[
   {
      "fields" : {
         "album" : 1,
         "artiste" : 1,
         "genre" : 52,
         "objetsonore_ptr" : 4,
         "position" : 4,
         "provenance" : 1
      },
      "model" : "gestion_des_musiques.piste",
      "pk" : 4
   },
   {
      "fields" : {
         "album" : 1,
         "artiste" : 1,
         "genre" : 52,
         "objetsonore_ptr" : 5,
         "position" : 5,
         "provenance" : 1
      },
      "model" : "gestion_des_musiques.piste",
      "pk" : 5
   },
   {
      "fields" : {
         "album" : 1,
         "artiste" : 1,
         "genre" : 52,
         "objetsonore_ptr" : 2,
         "position" : 2,
         "provenance" : 1
      },
      "model" : "gestion_des_musiques.piste",
      "pk" : 2
   },
   {
      "fields" : {
         "album" : 1,
         "artiste" : 1,
         "genre" : 52,
         "objetsonore_ptr" : 6,
         "position" : 6,
         "provenance" : 1
      },
      "model" : "gestion_des_musiques.piste",
      "pk" : 6
   },
   {
      "fields" : {
         "album" : 1,
         "artiste" : 1,
         "genre" : 52,
         "objetsonore_ptr" : 3,
         "position" : 3,
         "provenance" : 1
      },
      "model" : "gestion_des_musiques.piste",
      "pk" : 3
   },
   {
      "fields" : {
         "album" : 1,
         "artiste" : 1,
         "genre" : 52,
         "objetsonore_ptr" : 1,
         "position" : 1,
         "provenance" : 1
      },
      "model" : "gestion_des_musiques.piste",
      "pk" : 1
   }
]
