@startuml

actor Programmateur
control Signals
participant Programmation

Programmateur -> Programmation : supprimer
Programmation -> Signals : pre_delete : delete_programmation
Signals --> Programmateur : si debut dans le passé\n<color : red>ProtectedError
Programmation ->  Programmateur : Programmation supprimée

@enduml
