@startuml

actor Programmateur
participant Programmation

Programmateur -> Programmation : créer
Programmation --> Programmateur : si debut dans le passé \n<color : red>ValidationError
Programmation -->  Programmateur : si debut > fin \n<color : red>ValidationError
Programmation -->  Programmateur : si fin > fin de l'année scolaire \n<color : red>ValidationError
Programmation -->  Programmateur : si nombre de répétitions > MAX_REPETITIONS \n<color : red>ValidationError
Programmation -->  Programmateur : si durée du diffusable > fréquence \n<color : red>ValidationError
Programmation -->  Programmateur : si des créneaux ne sont pas libres \n<color : red>ValidationError
Programmation ->  Programmateur : Programmation enregistrée

@enduml
