[
   {
      "fields" : {
         "nom" : "Blues"
      },
      "model" : "gestion_des_musiques.genre",
      "pk" : 0
   },
   {
      "fields" : {
         "nom" : "Classic Rock"
      },
      "model" : "gestion_des_musiques.genre",
      "pk" : 1
   },
   {
      "fields" : {
         "nom" : "Country"
      },
      "model" : "gestion_des_musiques.genre",
      "pk" : 2
   },
   {
      "fields" : {
         "nom" : "Dance"
      },
      "model" : "gestion_des_musiques.genre",
      "pk" : 3
   },
   {
      "fields" : {
         "nom" : "Disco"
      },
      "model" : "gestion_des_musiques.genre",
      "pk" : 4
   },
   {
      "fields" : {
         "nom" : "Funk"
      },
      "model" : "gestion_des_musiques.genre",
      "pk" : 5
   },
   {
      "fields" : {
         "nom" : "Grunge"
      },
      "model" : "gestion_des_musiques.genre",
      "pk" : 6
   },
   {
      "fields" : {
         "nom" : "Hip-Hop"
      },
      "model" : "gestion_des_musiques.genre",
      "pk" : 7
   },
   {
      "fields" : {
         "nom" : "Jazz"
      },
      "model" : "gestion_des_musiques.genre",
      "pk" : 8
   },
   {
      "fields" : {
         "nom" : "Metal"
      },
      "model" : "gestion_des_musiques.genre",
      "pk" : 9
   },
   {
      "fields" : {
         "nom" : "New Age"
      },
      "model" : "gestion_des_musiques.genre",
      "pk" : 10
   },
   {
      "fields" : {
         "nom" : "Oldies"
      },
      "model" : "gestion_des_musiques.genre",
      "pk" : 11
   },
   {
      "fields" : {
         "nom" : "Other"
      },
      "model" : "gestion_des_musiques.genre",
      "pk" : 12
   },
   {
      "fields" : {
         "nom" : "Pop"
      },
      "model" : "gestion_des_musiques.genre",
      "pk" : 13
   },
   {
      "fields" : {
         "nom" : "R&B"
      },
      "model" : "gestion_des_musiques.genre",
      "pk" : 14
   },
   {
      "fields" : {
         "nom" : "Rap"
      },
      "model" : "gestion_des_musiques.genre",
      "pk" : 15
   },
   {
      "fields" : {
         "nom" : "Reggae"
      },
      "model" : "gestion_des_musiques.genre",
      "pk" : 16
   },
   {
      "fields" : {
         "nom" : "Rock"
      },
      "model" : "gestion_des_musiques.genre",
      "pk" : 17
   },
   {
      "fields" : {
         "nom" : "Techno"
      },
      "model" : "gestion_des_musiques.genre",
      "pk" : 18
   },
   {
      "fields" : {
         "nom" : "Industrial"
      },
      "model" : "gestion_des_musiques.genre",
      "pk" : 19
   },
   {
      "fields" : {
         "nom" : "Alternative"
      },
      "model" : "gestion_des_musiques.genre",
      "pk" : 20
   },
   {
      "fields" : {
         "nom" : "Ska"
      },
      "model" : "gestion_des_musiques.genre",
      "pk" : 21
   },
   {
      "fields" : {
         "nom" : "Death Metal"
      },
      "model" : "gestion_des_musiques.genre",
      "pk" : 22
   },
   {
      "fields" : {
         "nom" : "Pranks"
      },
      "model" : "gestion_des_musiques.genre",
      "pk" : 23
   },
   {
      "fields" : {
         "nom" : "Soundtrack"
      },
      "model" : "gestion_des_musiques.genre",
      "pk" : 24
   },
   {
      "fields" : {
         "nom" : "Euro-Techno"
      },
      "model" : "gestion_des_musiques.genre",
      "pk" : 25
   },
   {
      "fields" : {
         "nom" : "Ambient"
      },
      "model" : "gestion_des_musiques.genre",
      "pk" : 26
   },
   {
      "fields" : {
         "nom" : "Trip-Hop"
      },
      "model" : "gestion_des_musiques.genre",
      "pk" : 27
   },
   {
      "fields" : {
         "nom" : "Vocal"
      },
      "model" : "gestion_des_musiques.genre",
      "pk" : 28
   },
   {
      "fields" : {
         "nom" : "Jazz+Funk"
      },
      "model" : "gestion_des_musiques.genre",
      "pk" : 29
   },
   {
      "fields" : {
         "nom" : "Fusion"
      },
      "model" : "gestion_des_musiques.genre",
      "pk" : 30
   },
   {
      "fields" : {
         "nom" : "Trance"
      },
      "model" : "gestion_des_musiques.genre",
      "pk" : 31
   },
   {
      "fields" : {
         "nom" : "Classical"
      },
      "model" : "gestion_des_musiques.genre",
      "pk" : 32
   },
   {
      "fields" : {
         "nom" : "Instrumental"
      },
      "model" : "gestion_des_musiques.genre",
      "pk" : 33
   },
   {
      "fields" : {
         "nom" : "Acid"
      },
      "model" : "gestion_des_musiques.genre",
      "pk" : 34
   },
   {
      "fields" : {
         "nom" : "House"
      },
      "model" : "gestion_des_musiques.genre",
      "pk" : 35
   },
   {
      "fields" : {
         "nom" : "Game"
      },
      "model" : "gestion_des_musiques.genre",
      "pk" : 36
   },
   {
      "fields" : {
         "nom" : "Sound Clip"
      },
      "model" : "gestion_des_musiques.genre",
      "pk" : 37
   },
   {
      "fields" : {
         "nom" : "Gospel"
      },
      "model" : "gestion_des_musiques.genre",
      "pk" : 38
   },
   {
      "fields" : {
         "nom" : "Noise"
      },
      "model" : "gestion_des_musiques.genre",
      "pk" : 39
   },
   {
      "fields" : {
         "nom" : "AlternRock"
      },
      "model" : "gestion_des_musiques.genre",
      "pk" : 40
   },
   {
      "fields" : {
         "nom" : "Bass"
      },
      "model" : "gestion_des_musiques.genre",
      "pk" : 41
   },
   {
      "fields" : {
         "nom" : "Soul"
      },
      "model" : "gestion_des_musiques.genre",
      "pk" : 42
   },
   {
      "fields" : {
         "nom" : "Punk"
      },
      "model" : "gestion_des_musiques.genre",
      "pk" : 43
   },
   {
      "fields" : {
         "nom" : "Space"
      },
      "model" : "gestion_des_musiques.genre",
      "pk" : 44
   },
   {
      "fields" : {
         "nom" : "Meditative"
      },
      "model" : "gestion_des_musiques.genre",
      "pk" : 45
   },
   {
      "fields" : {
         "nom" : "Instrumental Pop"
      },
      "model" : "gestion_des_musiques.genre",
      "pk" : 46
   },
   {
      "fields" : {
         "nom" : "Instrumental Rock"
      },
      "model" : "gestion_des_musiques.genre",
      "pk" : 47
   },
   {
      "fields" : {
         "nom" : "Ethnic"
      },
      "model" : "gestion_des_musiques.genre",
      "pk" : 48
   },
   {
      "fields" : {
         "nom" : "Gothic"
      },
      "model" : "gestion_des_musiques.genre",
      "pk" : 49
   },
   {
      "fields" : {
         "nom" : "Darkwave"
      },
      "model" : "gestion_des_musiques.genre",
      "pk" : 50
   },
   {
      "fields" : {
         "nom" : "Techno-Industrial"
      },
      "model" : "gestion_des_musiques.genre",
      "pk" : 51
   },
   {
      "fields" : {
         "nom" : "Electronic"
      },
      "model" : "gestion_des_musiques.genre",
      "pk" : 52
   },
   {
      "fields" : {
         "nom" : "Pop-Folk"
      },
      "model" : "gestion_des_musiques.genre",
      "pk" : 53
   },
   {
      "fields" : {
         "nom" : "Eurodance"
      },
      "model" : "gestion_des_musiques.genre",
      "pk" : 54
   },
   {
      "fields" : {
         "nom" : "Dream"
      },
      "model" : "gestion_des_musiques.genre",
      "pk" : 55
   },
   {
      "fields" : {
         "nom" : "Southern Rock"
      },
      "model" : "gestion_des_musiques.genre",
      "pk" : 56
   },
   {
      "fields" : {
         "nom" : "Comedy"
      },
      "model" : "gestion_des_musiques.genre",
      "pk" : 57
   },
   {
      "fields" : {
         "nom" : "Cult"
      },
      "model" : "gestion_des_musiques.genre",
      "pk" : 58
   },
   {
      "fields" : {
         "nom" : "Gangsta"
      },
      "model" : "gestion_des_musiques.genre",
      "pk" : 59
   },
   {
      "fields" : {
         "nom" : "Top 40"
      },
      "model" : "gestion_des_musiques.genre",
      "pk" : 60
   },
   {
      "fields" : {
         "nom" : "Christian Rap"
      },
      "model" : "gestion_des_musiques.genre",
      "pk" : 61
   },
   {
      "fields" : {
         "nom" : "Pop/Funk"
      },
      "model" : "gestion_des_musiques.genre",
      "pk" : 62
   },
   {
      "fields" : {
         "nom" : "Jungle"
      },
      "model" : "gestion_des_musiques.genre",
      "pk" : 63
   },
   {
      "fields" : {
         "nom" : "Native American"
      },
      "model" : "gestion_des_musiques.genre",
      "pk" : 64
   },
   {
      "fields" : {
         "nom" : "Cabaret"
      },
      "model" : "gestion_des_musiques.genre",
      "pk" : 65
   },
   {
      "fields" : {
         "nom" : "New Wave"
      },
      "model" : "gestion_des_musiques.genre",
      "pk" : 66
   },
   {
      "fields" : {
         "nom" : "Psychadelic"
      },
      "model" : "gestion_des_musiques.genre",
      "pk" : 67
   },
   {
      "fields" : {
         "nom" : "Rave"
      },
      "model" : "gestion_des_musiques.genre",
      "pk" : 68
   },
   {
      "fields" : {
         "nom" : "Showtunes"
      },
      "model" : "gestion_des_musiques.genre",
      "pk" : 69
   },
   {
      "fields" : {
         "nom" : "Trailer"
      },
      "model" : "gestion_des_musiques.genre",
      "pk" : 70
   },
   {
      "fields" : {
         "nom" : "Lo-Fi"
      },
      "model" : "gestion_des_musiques.genre",
      "pk" : 71
   },
   {
      "fields" : {
         "nom" : "Tribal"
      },
      "model" : "gestion_des_musiques.genre",
      "pk" : 72
   },
   {
      "fields" : {
         "nom" : "Acid Punk"
      },
      "model" : "gestion_des_musiques.genre",
      "pk" : 73
   },
   {
      "fields" : {
         "nom" : "Acid Jazz"
      },
      "model" : "gestion_des_musiques.genre",
      "pk" : 74
   },
   {
      "fields" : {
         "nom" : "Polka"
      },
      "model" : "gestion_des_musiques.genre",
      "pk" : 75
   },
   {
      "fields" : {
         "nom" : "Retro"
      },
      "model" : "gestion_des_musiques.genre",
      "pk" : 76
   },
   {
      "fields" : {
         "nom" : "Musical"
      },
      "model" : "gestion_des_musiques.genre",
      "pk" : 77
   },
   {
      "fields" : {
         "nom" : "Rock & Roll"
      },
      "model" : "gestion_des_musiques.genre",
      "pk" : 78
   },
   {
      "fields" : {
         "nom" : "Hard Rock"
      },
      "model" : "gestion_des_musiques.genre",
      "pk" : 79
   },
   {
      "fields" : {
         "nom" : "Folk"
      },
      "model" : "gestion_des_musiques.genre",
      "pk" : 80
   },
   {
      "fields" : {
         "nom" : "Folk-Rock"
      },
      "model" : "gestion_des_musiques.genre",
      "pk" : 81
   },
   {
      "fields" : {
         "nom" : "National Folk"
      },
      "model" : "gestion_des_musiques.genre",
      "pk" : 82
   },
   {
      "fields" : {
         "nom" : "Swing"
      },
      "model" : "gestion_des_musiques.genre",
      "pk" : 83
   },
   {
      "fields" : {
         "nom" : "Fast Fusion"
      },
      "model" : "gestion_des_musiques.genre",
      "pk" : 84
   },
   {
      "fields" : {
         "nom" : "Bebob"
      },
      "model" : "gestion_des_musiques.genre",
      "pk" : 85
   },
   {
      "fields" : {
         "nom" : "Latin"
      },
      "model" : "gestion_des_musiques.genre",
      "pk" : 86
   },
   {
      "fields" : {
         "nom" : "Revival"
      },
      "model" : "gestion_des_musiques.genre",
      "pk" : 87
   },
   {
      "fields" : {
         "nom" : "Celtic"
      },
      "model" : "gestion_des_musiques.genre",
      "pk" : 88
   },
   {
      "fields" : {
         "nom" : "Bluegrass"
      },
      "model" : "gestion_des_musiques.genre",
      "pk" : 89
   },
   {
      "fields" : {
         "nom" : "Avantgarde"
      },
      "model" : "gestion_des_musiques.genre",
      "pk" : 90
   },
   {
      "fields" : {
         "nom" : "Gothic Rock"
      },
      "model" : "gestion_des_musiques.genre",
      "pk" : 91
   },
   {
      "fields" : {
         "nom" : "Progressive Rock"
      },
      "model" : "gestion_des_musiques.genre",
      "pk" : 92
   },
   {
      "fields" : {
         "nom" : "Psychedelic Rock"
      },
      "model" : "gestion_des_musiques.genre",
      "pk" : 93
   },
   {
      "fields" : {
         "nom" : "Symphonic Rock"
      },
      "model" : "gestion_des_musiques.genre",
      "pk" : 94
   },
   {
      "fields" : {
         "nom" : "Slow Rock"
      },
      "model" : "gestion_des_musiques.genre",
      "pk" : 95
   },
   {
      "fields" : {
         "nom" : "Big Band"
      },
      "model" : "gestion_des_musiques.genre",
      "pk" : 96
   },
   {
      "fields" : {
         "nom" : "Chorus"
      },
      "model" : "gestion_des_musiques.genre",
      "pk" : 97
   },
   {
      "fields" : {
         "nom" : "Easy Listening"
      },
      "model" : "gestion_des_musiques.genre",
      "pk" : 98
   },
   {
      "fields" : {
         "nom" : "Acoustic"
      },
      "model" : "gestion_des_musiques.genre",
      "pk" : 99
   },
   {
      "fields" : {
         "nom" : "Humour"
      },
      "model" : "gestion_des_musiques.genre",
      "pk" : 100
   },
   {
      "fields" : {
         "nom" : "Speech"
      },
      "model" : "gestion_des_musiques.genre",
      "pk" : 101
   },
   {
      "fields" : {
         "nom" : "Chanson"
      },
      "model" : "gestion_des_musiques.genre",
      "pk" : 102
   },
   {
      "fields" : {
         "nom" : "Opera"
      },
      "model" : "gestion_des_musiques.genre",
      "pk" : 103
   },
   {
      "fields" : {
         "nom" : "Chamber Music"
      },
      "model" : "gestion_des_musiques.genre",
      "pk" : 104
   },
   {
      "fields" : {
         "nom" : "Sonata"
      },
      "model" : "gestion_des_musiques.genre",
      "pk" : 105
   },
   {
      "fields" : {
         "nom" : "Symphony"
      },
      "model" : "gestion_des_musiques.genre",
      "pk" : 106
   },
   {
      "fields" : {
         "nom" : "Booty Bass"
      },
      "model" : "gestion_des_musiques.genre",
      "pk" : 107
   },
   {
      "fields" : {
         "nom" : "Primus"
      },
      "model" : "gestion_des_musiques.genre",
      "pk" : 108
   },
   {
      "fields" : {
         "nom" : "Porn Groove"
      },
      "model" : "gestion_des_musiques.genre",
      "pk" : 109
   },
   {
      "fields" : {
         "nom" : "Satire"
      },
      "model" : "gestion_des_musiques.genre",
      "pk" : 110
   },
   {
      "fields" : {
         "nom" : "Slow Jam"
      },
      "model" : "gestion_des_musiques.genre",
      "pk" : 111
   },
   {
      "fields" : {
         "nom" : "Club"
      },
      "model" : "gestion_des_musiques.genre",
      "pk" : 112
   },
   {
      "fields" : {
         "nom" : "Tango"
      },
      "model" : "gestion_des_musiques.genre",
      "pk" : 113
   },
   {
      "fields" : {
         "nom" : "Samba"
      },
      "model" : "gestion_des_musiques.genre",
      "pk" : 114
   },
   {
      "fields" : {
         "nom" : "Folklore"
      },
      "model" : "gestion_des_musiques.genre",
      "pk" : 115
   },
   {
      "fields" : {
         "nom" : "Ballad"
      },
      "model" : "gestion_des_musiques.genre",
      "pk" : 116
   },
   {
      "fields" : {
         "nom" : "Power Ballad"
      },
      "model" : "gestion_des_musiques.genre",
      "pk" : 117
   },
   {
      "fields" : {
         "nom" : "Rhythmic Soul"
      },
      "model" : "gestion_des_musiques.genre",
      "pk" : 118
   },
   {
      "fields" : {
         "nom" : "Freestyle"
      },
      "model" : "gestion_des_musiques.genre",
      "pk" : 119
   },
   {
      "fields" : {
         "nom" : "Duet"
      },
      "model" : "gestion_des_musiques.genre",
      "pk" : 120
   },
   {
      "fields" : {
         "nom" : "Punk Rock"
      },
      "model" : "gestion_des_musiques.genre",
      "pk" : 121
   },
   {
      "fields" : {
         "nom" : "Drum Solo"
      },
      "model" : "gestion_des_musiques.genre",
      "pk" : 122
   },
   {
      "fields" : {
         "nom" : "A capella"
      },
      "model" : "gestion_des_musiques.genre",
      "pk" : 123
   },
   {
      "fields" : {
         "nom" : "Euro-House"
      },
      "model" : "gestion_des_musiques.genre",
      "pk" : 124
   },
   {
      "fields" : {
         "nom" : "Dance Hall"
      },
      "model" : "gestion_des_musiques.genre",
      "pk" : 125
   }
]
