[
   {
      "fields" : {
         "_duree" : "00:05:37",
         "date_publication" : "2011-03-09",
         "editeur" : 2,
         "licence" : 7,
         "titre" : "vapeur"
      },
      "model" : "gestion_de_la_diffusion.diffusable",
      "pk" : 1
   },
   {
      "fields" : {
         "_duree" : "00:09:54",
         "date_publication" : "2011-03-09",
         "editeur" : 2,
         "licence" : 7,
         "titre" : "des papillons dans le ventre"
      },
      "model" : "gestion_de_la_diffusion.diffusable",
      "pk" : 2
   },
   {
      "fields" : {
         "_duree" : "00:10:40",
         "date_publication" : "2011-03-09",
         "editeur" : 2,
         "licence" : 7,
         "titre" : "gorgonbasse"
      },
      "model" : "gestion_de_la_diffusion.diffusable",
      "pk" : 3
   },
   {
      "fields" : {
         "_duree" : "00:01:48",
         "date_publication" : "2011-03-09",
         "editeur" : 2,
         "licence" : 7,
         "titre" : "Sigmund Freud"
      },
      "model" : "gestion_de_la_diffusion.diffusable",
      "pk" : 4
   },
   {
      "fields" : {
         "_duree" : "00:07:06",
         "date_publication" : "2011-03-09",
         "editeur" : 2,
         "licence" : 7,
         "titre" : "aven"
      },
      "model" : "gestion_de_la_diffusion.diffusable",
      "pk" : 5
   },
   {
      "fields" : {
         "_duree" : "00:08:06",
         "date_publication" : "2011-03-09",
         "editeur" : 2,
         "licence" : 7,
         "titre" : "en attendant la pluie"
      },
      "model" : "gestion_de_la_diffusion.diffusable",
      "pk" : 6
   },
   {
      "fields" : {
         "_duree" : "00:10:28",
         "date_publication" : "2018-04-08",
         "editeur" : 1,
         "licence" : 6,
         "titre" : "Conseils aux STS1 pour PPE3"
      },
      "model" : "gestion_de_la_diffusion.diffusable",
      "pk" : 7
   },
   {
      "fields" : {
         "_duree" : "00:22:37",
         "date_publication" : "2018-04-08",
         "editeur" : 1,
         "licence" : 6,
         "titre" : "Matin tranquille"
      },
      "model" : "gestion_de_la_diffusion.diffusable",
      "pk" : 8
   },
   {
      "fields" : {
         "_duree" : "00:17:53",
         "date_publication" : "2018-04-08",
         "editeur" : 1,
         "licence" : 6,
         "titre" : "Soirée studieuse"
      },
      "model" : "gestion_de_la_diffusion.diffusable",
      "pk" : 9
   },
   {
      "fields" : {
         "_duree" : "00:05:37",
         "date_publication" : "2018-04-10",
         "editeur" : 1,
         "licence" : 6,
         "titre" : "Pour le plaisir"
      },
      "model" : "gestion_de_la_diffusion.diffusable",
      "pk" : 10
   },
   {
      "fields" : {
         "_duree" : "00:10:28",
         "date_publication" : "2018-04-10",
         "editeur" : 1,
         "licence" : 6,
         "titre" : "Conseils aux STS2 pour PPE4"
      },
      "model" : "gestion_de_la_diffusion.diffusable",
      "pk" : 11
   },
   {
      "fields" : {
         "_duree" : "00:10:28",
         "date_publication" : "2018-04-10",
         "editeur" : 1,
         "licence" : 6,
         "titre" : "Conseils aux STS1 pour PPE3"
      },
      "model" : "gestion_de_la_diffusion.diffusable",
      "pk" : 12
   }
]
