[
   {
      "fields" : {
         "emission" : 1,
         "objetsonore_ptr" : 7,
         "description" : null,
         "image" : null,
         "description_image" : null
      },
      "model" : "gestion_des_emissions.episode",
      "pk" : 7
   },
   {
      "fields" : {
         "emission" : 2,
         "objetsonore_ptr" : 9,
         "description" : null,
         "image" : null,
         "description_image" : null
      },
      "model" : "gestion_des_emissions.episode",
      "pk" : 12
   },
   {
      "fields" : {
         "emission" : 1,
         "objetsonore_ptr" : 8,
         "description" : null,
         "image" : null,
         "description_image" : null
      },
      "model" : "gestion_des_emissions.episode",
      "pk" : 11
   }
]
