<?xml version="1.0" encoding="UTF-8" standalone="no"?>
<!-- Created with Inkscape (http://www.inkscape.org/) -->

<svg
   xmlns:dc="http://purl.org/dc/elements/1.1/"
   xmlns:cc="http://creativecommons.org/ns#"
   xmlns:rdf="http://www.w3.org/1999/02/22-rdf-syntax-ns#"
   xmlns:svg="http://www.w3.org/2000/svg"
   xmlns="http://www.w3.org/2000/svg"
   xmlns:sodipodi="http://sodipodi.sourceforge.net/DTD/sodipodi-0.dtd"
   xmlns:inkscape="http://www.inkscape.org/namespaces/inkscape"
   width="10mm"
   height="10mm"
   viewBox="0 0 10 10"
   version="1.1"
   id="svg8"
   inkscape:version="0.92.2 (5c3e80d, 2017-08-06)"
   sodipodi:docname="rotary-minimum.svg">
  <title
     id="title815">Slider position Midi</title>
  <defs
     id="defs2" />
  <sodipodi:namedview
     id="base"
     pagecolor="#ffffff"
     bordercolor="#666666"
     borderopacity="1.0"
     inkscape:pageopacity="0.0"
     inkscape:pageshadow="2"
     inkscape:zoom="7.9195959"
     inkscape:cx="19.877284"
     inkscape:cy="16.821924"
     inkscape:document-units="mm"
     inkscape:current-layer="layer1"
     showgrid="false"
     inkscape:window-width="1366"
     inkscape:window-height="754"
     inkscape:window-x="0"
     inkscape:window-y="14"
     inkscape:window-maximized="0"
     showguides="false"
     inkscape:guide-bbox="true"
     objecttolerance="20">
    <sodipodi:guide
       position="0,4.9999999"
       orientation="0,1"
       id="guide836"
       inkscape:locked="false"
       inkscape:label=""
       inkscape:color="rgb(0,0,255)" />
    <sodipodi:guide
       position="4.9999999,0"
       orientation="1,0"
       id="guide838"
       inkscape:locked="false"
       inkscape:label=""
       inkscape:color="rgb(0,0,255)" />
  </sodipodi:namedview>
  <metadata
     id="metadata5">
    <rdf:RDF>
      <cc:Work
         rdf:about="">
        <dc:format>image/svg+xml</dc:format>
        <dc:type
           rdf:resource="http://purl.org/dc/dcmitype/StillImage" />
        <dc:title>Slider position Midi</dc:title>
        <dc:date>2017-12-06</dc:date>
        <dc:creator>
          <cc:Agent>
            <dc:title>Grégory DAVID</dc:title>
          </cc:Agent>
        </dc:creator>
        <cc:license
           rdf:resource="http://artlibre.org/licence/lal" />
      </cc:Work>
      <cc:License
         rdf:about="http://artlibre.org/licence/lal">
        <cc:permits
           rdf:resource="http://creativecommons.org/ns#Reproduction" />
        <cc:permits
           rdf:resource="http://creativecommons.org/ns#Distribution" />
        <cc:permits
           rdf:resource="http://creativecommons.org/ns#DerivativeWorks" />
        <cc:requires
           rdf:resource="http://creativecommons.org/ns#ShareAlike" />
        <cc:requires
           rdf:resource="http://creativecommons.org/ns#Notice" />
        <cc:requires
           rdf:resource="http://creativecommons.org/ns#Attribution" />
      </cc:License>
    </rdf:RDF>
  </metadata>
  <g
     inkscape:label="Calque 1"
     inkscape:groupmode="layer"
     id="layer1"
     transform="translate(0,-287)">
    <path
       style="opacity:1;fill:none;fill-opacity:1;stroke:#000000;stroke-width:0.5;stroke-linecap:round;stroke-linejoin:round;stroke-miterlimit:0;stroke-dasharray:none;stroke-dashoffset:0;stroke-opacity:1;paint-order:normal"
       id="path844"
       sodipodi:type="arc"
       sodipodi:cx="5"
       sodipodi:cy="292"
       sodipodi:rx="3.930922"
       sodipodi:ry="3.930922"
       sodipodi:start="2.0943951"
       sodipodi:end="1.0471976"
       d="m 3.034539,295.40428 a 3.930922,3.930922 0 0 1 -1.8315181,-4.42168 3.930922,3.930922 0 0 1 3.7969792,-2.91352 3.930922,3.930922 0 0 1 3.796979,2.91352 3.930922,3.930922 0 0 1 -1.8315183,4.42168 L 5,292 Z" />
    <path
       d="M 3.5058643,294.52075 A 2.9882715,2.9882715 0 0 1 3.0791762,294.22198 L 5,291.93283 Z"
       sodipodi:end="2.268928"
       sodipodi:start="2.0943951"
       sodipodi:ry="2.9882715"
       sodipodi:rx="2.9882715"
       sodipodi:cy="291.93283"
       sodipodi:cx="5"
       sodipodi:type="arc"
       id="path848"
       style="opacity:1;fill:#ff0000;fill-opacity:1;stroke:#000000;stroke-width:0.30000001;stroke-linecap:round;stroke-linejoin:round;stroke-miterlimit:0;stroke-dasharray:0.30000001, 0.60000003000000002;stroke-dashoffset:0;stroke-opacity:1;paint-order:normal" />
  </g>
</svg>
