{
  "uid": "VTANR5L15V2055",
  "numero": "2055",
  "organeRef": "PO717460",
  "legislature": "15",
  "sessionRef": "SCR5A2019E1",
  "seanceRef": "RUANR5L15S2019IDS21768",
  "dateScrutin": "2019-07-17T02:00:00.000+02:00",
  "quantiemeJourSeance": "2",
  "typeVote": {
    "codeTypeVote": "SPO",
    "libelleTypeVote": "scrutin public ordinaire",
    "typeMajorite": "majorité absolue des suffrages exprimés"
  },
  "sort": {
    "code": "rejeté",
    "libelle": "L'Assemblée nationale n'a pas adopté"
  },
  "titre": "l'amendement n° 17 de M. Lecoq et l'amendement identique suivant à l'article 2 du projet de loi autorisant la ratification de l'accord économique et commercial global entre l'Union européenne et ses États membres, d'une part, et le Canada, d'autre part, et de l'accord de partenariat stratégique entre l'Union européenne et ses États membres, d'une part, et le Canada, d'autre part (première lecture).",
  "demandeur": {
    "texte": "Président du groupe \"de la Gauche démocrate et républicaine\"\rPrésident du groupe \"La France insoumise\""
  },
  "objet": {
    "libelle": "l'amendement n° 17 de M. Lecoq et l'amendement identique suivant à l'article 2 du projet de loi autorisant la ratification de l'accord économique et commercial global entre l'Union européenne et ses États membres, d'une part, et le Canada, d'autre part, et de l'accord de partenariat stratégique entre l'Union européenne et ses États membres, d'une part, et le Canada, d'autre part (première lecture)."
  },
  "modePublicationDesVotes": "DecompteNominatif",
  "syntheseVote": {
    "nombreVotants": "108",
    "suffragesExprimes": "94",
    "nbrSuffragesRequis": "48",
    "annonce": "L'Assemblée nationale n'a pas adopté",
    "decompte": {
      "pour": "22",
      "contre": "72",
      "nonVotants": "2",
      "abstentions": "14",
      "nonVotantsVolontaires": "0"
    }
  },
  "ventilationVotes": {
    "organeRef": "PO717460",
    "groupes": [
      {
        "organeRef": "PO730964",
        "nombreMembresGroupe": "304",
        "vote": {
          "positionMajoritaire": "contre",
          "decompteVoix": {
            "pour": "0",
            "contre": "61",
            "nonVotants": "1",
            "abstentions": "1",
            "nonVotantsVolontaires": "1"
          },
          "decompteNominatif": {
            "nonVotants": [
              {
                "acteurRef": "PA606171",
                "mandatRef": "PM722632",
                "causePositionVote": "PAN"
              }
            ],
            "contre": [
              {
                "acteurRef": "PA722398",
                "mandatRef": "PM723562",
                "parDelegation": false
              },
              {
                "acteurRef": "PA721880",
                "mandatRef": "PM723410",
                "parDelegation": false
              },
              {
                "acteurRef": "PA672",
                "mandatRef": "PM723230",
                "parDelegation": false
              },
              {
                "acteurRef": "PA721296",
                "mandatRef": "PM723228",
                "parDelegation": false
              },
              {
                "acteurRef": "PA721852",
                "mandatRef": "PM723402",
                "parDelegation": false
              },
              {
                "acteurRef": "PA718710",
                "mandatRef": "PM722432",
                "parDelegation": false
              },
              {
                "acteurRef": "PA719024",
                "mandatRef": "PM722536",
                "parDelegation": false
              },
              {
                "acteurRef": "PA719170",
                "mandatRef": "PM722582",
                "parDelegation": false
              },
              {
                "acteurRef": "PA719218",
                "mandatRef": "PM722596",
                "parDelegation": false
              },
              {
                "acteurRef": "PA719242",
                "mandatRef": "PM722604",
                "parDelegation": false
              },
              {
                "acteurRef": "PA719294",
                "mandatRef": "PM722618",
                "parDelegation": false
              },
              {
                "acteurRef": "PA719338",
                "mandatRef": "PM722630",
                "parDelegation": false
              },
              {
                "acteurRef": "PA719372",
                "mandatRef": "PM722640",
                "parDelegation": false
              },
              {
                "acteurRef": "PA719396",
                "mandatRef": "PM722650",
                "parDelegation": false
              },
              {
                "acteurRef": "PA719448",
                "mandatRef": "PM722666",
                "parDelegation": false
              },
              {
                "acteurRef": "PA719550",
                "mandatRef": "PM722694",
                "parDelegation": false
              },
              {
                "acteurRef": "PA719756",
                "mandatRef": "PM722752",
                "parDelegation": false
              },
              {
                "acteurRef": "PA719770",
                "mandatRef": "PM722758",
                "parDelegation": false
              },
              {
                "acteurRef": "PA719790",
                "mandatRef": "PM722764",
                "parDelegation": false
              },
              {
                "acteurRef": "PA719798",
                "mandatRef": "PM722766",
                "parDelegation": true
              },
              {
                "acteurRef": "PA719850",
                "mandatRef": "PM722780",
                "parDelegation": false
              },
              {
                "acteurRef": "PA720046",
                "mandatRef": "PM722842",
                "parDelegation": true
              },
              {
                "acteurRef": "PA720138",
                "mandatRef": "PM722872",
                "parDelegation": false
              },
              {
                "acteurRef": "PA720146",
                "mandatRef": "PM722874",
                "parDelegation": false
              },
              {
                "acteurRef": "PA720214",
                "mandatRef": "PM722894",
                "parDelegation": false
              },
              {
                "acteurRef": "PA720268",
                "mandatRef": "PM722912",
                "parDelegation": false
              },
              {
                "acteurRef": "PA720354",
                "mandatRef": "PM722940",
                "parDelegation": false
              },
              {
                "acteurRef": "PA720414",
                "mandatRef": "PM722958",
                "parDelegation": false
              },
              {
                "acteurRef": "PA720552",
                "mandatRef": "PM722998",
                "parDelegation": false
              },
              {
                "acteurRef": "PA720622",
                "mandatRef": "PM723018",
                "parDelegation": false
              },
              {
                "acteurRef": "PA720754",
                "mandatRef": "PM723066",
                "parDelegation": false
              },
              {
                "acteurRef": "PA720830",
                "mandatRef": "PM723088",
                "parDelegation": false
              },
              {
                "acteurRef": "PA720944",
                "mandatRef": "PM723120",
                "parDelegation": false
              },
              {
                "acteurRef": "PA721024",
                "mandatRef": "PM723144",
                "parDelegation": false
              },
              {
                "acteurRef": "PA721134",
                "mandatRef": "PM723184",
                "parDelegation": false
              },
              {
                "acteurRef": "PA721142",
                "mandatRef": "PM723186",
                "parDelegation": true
              },
              {
                "acteurRef": "PA721158",
                "mandatRef": "PM723190",
                "parDelegation": false
              },
              {
                "acteurRef": "PA721166",
                "mandatRef": "PM755857",
                "parDelegation": false
              },
              {
                "acteurRef": "PA721278",
                "mandatRef": "PM723222",
                "parDelegation": false
              },
              {
                "acteurRef": "PA721328",
                "mandatRef": "PM723240",
                "parDelegation": false
              },
              {
                "acteurRef": "PA721336",
                "mandatRef": "PM723242",
                "parDelegation": false
              },
              {
                "acteurRef": "PA721466",
                "mandatRef": "PM723284",
                "parDelegation": false
              },
              {
                "acteurRef": "PA721542",
                "mandatRef": "PM723308",
                "parDelegation": true
              },
              {
                "acteurRef": "PA721624",
                "mandatRef": "PM723336",
                "parDelegation": false
              },
              {
                "acteurRef": "PA721644",
                "mandatRef": "PM723342",
                "parDelegation": false
              },
              {
                "acteurRef": "PA721808",
                "mandatRef": "PM723388",
                "parDelegation": false
              },
              {
                "acteurRef": "PA721946",
                "mandatRef": "PM723430",
                "parDelegation": false
              },
              {
                "acteurRef": "PA722000",
                "mandatRef": "PM723444",
                "parDelegation": true
              },
              {
                "acteurRef": "PA722008",
                "mandatRef": "PM723446",
                "parDelegation": false
              },
              {
                "acteurRef": "PA722046",
                "mandatRef": "PM723458",
                "parDelegation": true
              },
              {
                "acteurRef": "PA722054",
                "mandatRef": "PM723460",
                "parDelegation": false
              },
              {
                "acteurRef": "PA722094",
                "mandatRef": "PM723470",
                "parDelegation": false
              },
              {
                "acteurRef": "PA722150",
                "mandatRef": "PM723486",
                "parDelegation": false
              },
              {
                "acteurRef": "PA722170",
                "mandatRef": "PM723492",
                "parDelegation": false
              },
              {
                "acteurRef": "PA722178",
                "mandatRef": "PM723494",
                "parDelegation": false
              },
              {
                "acteurRef": "PA722228",
                "mandatRef": "PM723512",
                "parDelegation": false
              },
              {
                "acteurRef": "PA722292",
                "mandatRef": "PM723530",
                "parDelegation": false
              },
              {
                "acteurRef": "PA702054",
                "mandatRef": "PM733713",
                "parDelegation": false
              },
              {
                "acteurRef": "PA642695",
                "mandatRef": "PM722602",
                "parDelegation": false
              },
              {
                "acteurRef": "PA760658",
                "mandatRef": "PM760662",
                "parDelegation": true
              },
              {
                "acteurRef": "PA721674",
                "mandatRef": "PM764881",
                "parDelegation": false
              }
            ],
            "abstentions": [
              {
                "acteurRef": "PA719230",
                "mandatRef": "PM722600",
                "parDelegation": false
              }
            ]
          }
        }
      },
      {
        "organeRef": "PO730934",
        "nombreMembresGroupe": "104",
        "vote": {
          "positionMajoritaire": "abstention",
          "decompteVoix": {
            "pour": "0",
            "contre": "0",
            "nonVotants": "1",
            "abstentions": "7",
            "nonVotantsVolontaires": "7"
          },
          "decompteNominatif": {
            "nonVotants": [
              {
                "acteurRef": "PA1874",
                "mandatRef": "PM722598",
                "causePositionVote": "PSE"
              }
            ],
            "abstentions": [
              {
                "acteurRef": "PA720210",
                "mandatRef": "PM722892",
                "parDelegation": false
              },
              {
                "acteurRef": "PA608016",
                "mandatRef": "PM723024",
                "parDelegation": false
              },
              {
                "acteurRef": "PA721816",
                "mandatRef": "PM748964",
                "parDelegation": false
              },
              {
                "acteurRef": "PA720630",
                "mandatRef": "PM723020",
                "parDelegation": false
              },
              {
                "acteurRef": "PA346054",
                "mandatRef": "PM723510",
                "parDelegation": true
              },
              {
                "acteurRef": "PA330909",
                "mandatRef": "PM722548",
                "parDelegation": false
              },
              {
                "acteurRef": "PA266793",
                "mandatRef": "PM722550",
                "parDelegation": false
              }
            ]
          }
        }
      },
      {
        "organeRef": "PO730970",
        "nombreMembresGroupe": "45",
        "vote": {
          "positionMajoritaire": "contre",
          "decompteVoix": {
            "pour": "0",
            "contre": "11",
            "nonVotants": "0",
            "abstentions": "0",
            "nonVotantsVolontaires": "0"
          },
          "decompteNominatif": {
            "contre": [
              {
                "acteurRef": "PA721418",
                "mandatRef": "PM723268",
                "parDelegation": false
              },
              {
                "acteurRef": "PA717151",
                "mandatRef": "PM723374",
                "parDelegation": false
              },
              {
                "acteurRef": "PA719044",
                "mandatRef": "PM722542",
                "parDelegation": false
              },
              {
                "acteurRef": "PA719504",
                "mandatRef": "PM722680",
                "parDelegation": false
              },
              {
                "acteurRef": "PA719640",
                "mandatRef": "PM722718",
                "parDelegation": false
              },
              {
                "acteurRef": "PA720728",
                "mandatRef": "PM723058",
                "parDelegation": false
              },
              {
                "acteurRef": "PA720746",
                "mandatRef": "PM723064",
                "parDelegation": false
              },
              {
                "acteurRef": "PA721182",
                "mandatRef": "PM723196",
                "parDelegation": false
              },
              {
                "acteurRef": "PA721984",
                "mandatRef": "PM723440",
                "parDelegation": true
              },
              {
                "acteurRef": "PA722162",
                "mandatRef": "PM723490",
                "parDelegation": false
              },
              {
                "acteurRef": "PA722284",
                "mandatRef": "PM723528",
                "parDelegation": false
              }
            ]
          }
        }
      },
      {
        "organeRef": "PO758835",
        "nombreMembresGroupe": "29",
        "vote": {
          "positionMajoritaire": "abstention",
          "decompteVoix": {
            "pour": "0",
            "contre": "0",
            "nonVotants": "0",
            "abstentions": "4",
            "nonVotantsVolontaires": "4"
          },
          "decompteNominatif": {
            "abstentions": [
              {
                "acteurRef": "PA1198",
                "mandatRef": "PM722532",
                "parDelegation": false
              },
              {
                "acteurRef": "PA333285",
                "mandatRef": "PM722906",
                "parDelegation": false
              },
              {
                "acteurRef": "PA607553",
                "mandatRef": "PM722956",
                "parDelegation": false
              },
              {
                "acteurRef": "PA608172",
                "mandatRef": "PM723048",
                "parDelegation": false
              }
            ]
          }
        }
      },
      {
        "organeRef": "PO765636",
        "nombreMembresGroupe": "28",
        "vote": {
          "positionMajoritaire": "pour",
          "decompteVoix": {
            "pour": "2",
            "contre": "0",
            "nonVotants": "0",
            "abstentions": "0",
            "nonVotantsVolontaires": "0"
          },
          "decompteNominatif": {
            "pour": [
              {
                "acteurRef": "PA332228",
                "mandatRef": "PM722754",
                "parDelegation": false
              },
              {
                "acteurRef": "PA719806",
                "mandatRef": "PM722768",
                "parDelegation": true
              }
            ]
          }
        }
      },
      {
        "organeRef": "PO759900",
        "nombreMembresGroupe": "18",
        "vote": {
          "positionMajoritaire": "pour",
          "decompteVoix": {
            "pour": "6",
            "contre": "0",
            "nonVotants": "0",
            "abstentions": "0",
            "nonVotantsVolontaires": "0"
          },
          "decompteNominatif": {
            "pour": [
              {
                "acteurRef": "PA267042",
                "mandatRef": "PM722910",
                "parDelegation": false
              },
              {
                "acteurRef": "PA331582",
                "mandatRef": "PM722646",
                "parDelegation": false
              },
              {
                "acteurRef": "PA336175",
                "mandatRef": "PM723328",
                "parDelegation": false
              },
              {
                "acteurRef": "PA607619",
                "mandatRef": "PM722936",
                "parDelegation": false
              },
              {
                "acteurRef": "PA719138",
                "mandatRef": "PM722574",
                "parDelegation": false
              },
              {
                "acteurRef": "PA721194",
                "mandatRef": "PM723200",
                "parDelegation": true
              }
            ]
          }
        }
      },
      {
        "organeRef": "PO730958",
        "nombreMembresGroupe": "17",
        "vote": {
          "positionMajoritaire": "pour",
          "decompteVoix": {
            "pour": "6",
            "contre": "0",
            "nonVotants": "0",
            "abstentions": "0",
            "nonVotantsVolontaires": "0"
          },
          "decompteNominatif": {
            "pour": [
              {
                "acteurRef": "PA588884",
                "mandatRef": "PM723226",
                "parDelegation": false
              },
              {
                "acteurRef": "PA718860",
                "mandatRef": "PM722482",
                "parDelegation": false
              },
              {
                "acteurRef": "PA720422",
                "mandatRef": "PM722960",
                "parDelegation": false
              },
              {
                "acteurRef": "PA720892",
                "mandatRef": "PM723106",
                "parDelegation": false
              },
              {
                "acteurRef": "PA721202",
                "mandatRef": "PM723202",
                "parDelegation": false
              },
              {
                "acteurRef": "PA722142",
                "mandatRef": "PM723484",
                "parDelegation": false
              }
            ]
          }
        }
      },
      {
        "organeRef": "PO730940",
        "nombreMembresGroupe": "16",
        "vote": {
          "positionMajoritaire": "pour",
          "decompteVoix": {
            "pour": "6",
            "contre": "0",
            "nonVotants": "0",
            "abstentions": "0",
            "nonVotantsVolontaires": "0"
          },
          "decompteNominatif": {
            "pour": [
              {
                "acteurRef": "PA267306",
                "mandatRef": "PM723054",
                "parDelegation": false
              },
              {
                "acteurRef": "PA718926",
                "mandatRef": "PM722502",
                "parDelegation": false
              },
              {
                "acteurRef": "PA718720",
                "mandatRef": "PM722436",
                "parDelegation": false
              },
              {
                "acteurRef": "PA720546",
                "mandatRef": "PM722996",
                "parDelegation": false
              },
              {
                "acteurRef": "PA722110",
                "mandatRef": "PM723474",
                "parDelegation": false
              },
              {
                "acteurRef": "PA335612",
                "mandatRef": "PM723506",
                "parDelegation": false
              }
            ]
          }
        }
      },
      {
        "organeRef": "PO723569",
        "nombreMembresGroupe": "15",
        "vote": {
          "positionMajoritaire": "pour",
          "decompteVoix": {
            "pour": "2",
            "contre": "0",
            "nonVotants": "0",
            "abstentions": "2",
            "nonVotantsVolontaires": "2"
          },
          "decompteNominatif": {
            "pour": [
              {
                "acteurRef": "PA1206",
                "mandatRef": "PM723354",
                "parDelegation": false
              },
              {
                "acteurRef": "PA335999",
                "mandatRef": "PM723480",
                "parDelegation": false
              }
            ],
            "abstentions": [
              {
                "acteurRef": "PA719608",
                "mandatRef": "PM722710",
                "parDelegation": false
              },
              {
                "acteurRef": "PA720664",
                "mandatRef": "PM723032",
                "parDelegation": true
              }
            ]
          }
        }
      }
    ]
  }
}