{
  "uid": "VTANR5L15V1646",
  "numero": "1646",
  "organeRef": "PO717460",
  "legislature": "15",
  "sessionRef": "SCR5A2019O1",
  "seanceRef": "RUANR5L15S2019IDS21472",
  "dateScrutin": "2019-01-31T01:00:00.000+01:00",
  "quantiemeJourSeance": "2",
  "typeVote": {
    "codeTypeVote": "SPO",
    "libelleTypeVote": "scrutin public ordinaire",
    "typeMajorite": "majorité absolue des suffrages exprimés"
  },
  "sort": {
    "code": "rejeté",
    "libelle": "L'Assemblée nationale n'a pas adopté"
  },
  "titre": "l'amendement n° 27 de M. Favennec Becot à l'article premier de la proposition de loi pour des mesures d'urgence contre la désertification médicale (première lecture)",
  "demandeur": {
    "texte": "Président du groupe \"Libertés et Territoires\""
  },
  "objet": {
    "libelle": "l'amendement n° 27 de M. Favennec Becot à l'article premier de la proposition de loi pour des mesures d'urgence contre la désertification médicale (première lecture)"
  },
  "modePublicationDesVotes": "DecompteNominatif",
  "syntheseVote": {
    "nombreVotants": "98",
    "suffragesExprimes": "95",
    "nbrSuffragesRequis": "48",
    "annonce": "L'Assemblée nationale n'a pas adopté",
    "decompte": {
      "pour": "30",
      "contre": "65",
      "nonVotants": "2",
      "abstentions": "3",
      "nonVotantsVolontaires": "0"
    }
  },
  "ventilationVotes": {
    "organeRef": "PO717460",
    "groupes": [
      {
        "organeRef": "PO730964",
        "nombreMembresGroupe": "307",
        "vote": {
          "positionMajoritaire": "contre",
          "decompteVoix": {
            "pour": "2",
            "contre": "55",
            "nonVotants": "1",
            "abstentions": "0",
            "nonVotantsVolontaires": "0"
          },
          "decompteNominatif": {
            "nonVotants": [
              {
                "acteurRef": "PA606171",
                "mandatRef": "PM722632",
                "causePositionVote": "PAN"
              }
            ],
            "pour": [
              {
                "acteurRef": "PA722070",
                "mandatRef": "PM723464",
                "parDelegation": false
              },
              {
                "acteurRef": "PA760658",
                "mandatRef": "PM760662",
                "parDelegation": false
              }
            ],
            "contre": [
              {
                "acteurRef": "PA719952",
                "mandatRef": "PM722814",
                "parDelegation": false
              },
              {
                "acteurRef": "PA608083",
                "mandatRef": "PM723038",
                "parDelegation": false
              },
              {
                "acteurRef": "PA331835",
                "mandatRef": "PM722688",
                "parDelegation": false
              },
              {
                "acteurRef": "PA607395",
                "mandatRef": "PM760313",
                "parDelegation": false
              },
              {
                "acteurRef": "PA717379",
                "mandatRef": "PM723282",
                "parDelegation": false
              },
              {
                "acteurRef": "PA718682",
                "mandatRef": "PM722422",
                "parDelegation": false
              },
              {
                "acteurRef": "PA718744",
                "mandatRef": "PM722442",
                "parDelegation": false
              },
              {
                "acteurRef": "PA718810",
                "mandatRef": "PM722464",
                "parDelegation": false
              },
              {
                "acteurRef": "PA718910",
                "mandatRef": "PM722498",
                "parDelegation": false
              },
              {
                "acteurRef": "PA718944",
                "mandatRef": "PM722508",
                "parDelegation": false
              },
              {
                "acteurRef": "PA718990",
                "mandatRef": "PM722524",
                "parDelegation": false
              },
              {
                "acteurRef": "PA719072",
                "mandatRef": "PM722552",
                "parDelegation": false
              },
              {
                "acteurRef": "PA719154",
                "mandatRef": "PM722578",
                "parDelegation": false
              },
              {
                "acteurRef": "PA719186",
                "mandatRef": "PM722588",
                "parDelegation": false
              },
              {
                "acteurRef": "PA719230",
                "mandatRef": "PM722600",
                "parDelegation": false
              },
              {
                "acteurRef": "PA719456",
                "mandatRef": "PM722668",
                "parDelegation": false
              },
              {
                "acteurRef": "PA719512",
                "mandatRef": "PM722682",
                "parDelegation": false
              },
              {
                "acteurRef": "PA719540",
                "mandatRef": "PM722690",
                "parDelegation": false
              },
              {
                "acteurRef": "PA719550",
                "mandatRef": "PM722694",
                "parDelegation": false
              },
              {
                "acteurRef": "PA719718",
                "mandatRef": "PM722740",
                "parDelegation": false
              },
              {
                "acteurRef": "PA719756",
                "mandatRef": "PM722752",
                "parDelegation": false
              },
              {
                "acteurRef": "PA719798",
                "mandatRef": "PM722766",
                "parDelegation": false
              },
              {
                "acteurRef": "PA719890",
                "mandatRef": "PM722790",
                "parDelegation": false
              },
              {
                "acteurRef": "PA719922",
                "mandatRef": "PM722802",
                "parDelegation": false
              },
              {
                "acteurRef": "PA719994",
                "mandatRef": "PM722828",
                "parDelegation": false
              },
              {
                "acteurRef": "PA720046",
                "mandatRef": "PM722842",
                "parDelegation": false
              },
              {
                "acteurRef": "PA720066",
                "mandatRef": "PM722848",
                "parDelegation": false
              },
              {
                "acteurRef": "PA643175",
                "mandatRef": "PM722868",
                "parDelegation": false
              },
              {
                "acteurRef": "PA720138",
                "mandatRef": "PM722872",
                "parDelegation": false
              },
              {
                "acteurRef": "PA720190",
                "mandatRef": "PM722886",
                "parDelegation": false
              },
              {
                "acteurRef": "PA720222",
                "mandatRef": "PM722896",
                "parDelegation": false
              },
              {
                "acteurRef": "PA720278",
                "mandatRef": "PM722916",
                "parDelegation": false
              },
              {
                "acteurRef": "PA720318",
                "mandatRef": "PM722928",
                "parDelegation": false
              },
              {
                "acteurRef": "PA720512",
                "mandatRef": "PM722986",
                "parDelegation": false
              },
              {
                "acteurRef": "PA720814",
                "mandatRef": "PM723084",
                "parDelegation": false
              },
              {
                "acteurRef": "PA720854",
                "mandatRef": "PM723096",
                "parDelegation": false
              },
              {
                "acteurRef": "PA720900",
                "mandatRef": "PM723108",
                "parDelegation": false
              },
              {
                "acteurRef": "PA720916",
                "mandatRef": "PM723112",
                "parDelegation": false
              },
              {
                "acteurRef": "PA720932",
                "mandatRef": "PM723116",
                "parDelegation": false
              },
              {
                "acteurRef": "PA721158",
                "mandatRef": "PM723190",
                "parDelegation": false
              },
              {
                "acteurRef": "PA721246",
                "mandatRef": "PM723214",
                "parDelegation": false
              },
              {
                "acteurRef": "PA721466",
                "mandatRef": "PM723284",
                "parDelegation": false
              },
              {
                "acteurRef": "PA721522",
                "mandatRef": "PM723300",
                "parDelegation": false
              },
              {
                "acteurRef": "PA721542",
                "mandatRef": "PM723308",
                "parDelegation": false
              },
              {
                "acteurRef": "PA721600",
                "mandatRef": "PM723330",
                "parDelegation": false
              },
              {
                "acteurRef": "PA721670",
                "mandatRef": "PM723350",
                "parDelegation": false
              },
              {
                "acteurRef": "PA721710",
                "mandatRef": "PM723362",
                "parDelegation": false
              },
              {
                "acteurRef": "PA721726",
                "mandatRef": "PM723366",
                "parDelegation": false
              },
              {
                "acteurRef": "PA721764",
                "mandatRef": "PM723376",
                "parDelegation": false
              },
              {
                "acteurRef": "PA721916",
                "mandatRef": "PM723420",
                "parDelegation": false
              },
              {
                "acteurRef": "PA722038",
                "mandatRef": "PM723456",
                "parDelegation": false
              },
              {
                "acteurRef": "PA722268",
                "mandatRef": "PM723522",
                "parDelegation": false
              },
              {
                "acteurRef": "PA722366",
                "mandatRef": "PM723554",
                "parDelegation": false
              },
              {
                "acteurRef": "PA724827",
                "mandatRef": "PM754304",
                "parDelegation": false
              },
              {
                "acteurRef": "PA722194",
                "mandatRef": "PM760311",
                "parDelegation": false
              }
            ]
          }
        }
      },
      {
        "organeRef": "PO730934",
        "nombreMembresGroupe": "104",
        "vote": {
          "positionMajoritaire": "pour",
          "decompteVoix": {
            "pour": "3",
            "contre": "2",
            "nonVotants": "1",
            "abstentions": "3",
            "nonVotantsVolontaires": "3"
          },
          "decompteNominatif": {
            "nonVotants": [
              {
                "acteurRef": "PA605991",
                "mandatRef": "PM722660",
                "causePositionVote": "PSE"
              }
            ],
            "pour": [
              {
                "acteurRef": "PA720644",
                "mandatRef": "PM723026",
                "parDelegation": false
              },
              {
                "acteurRef": "PA1012",
                "mandatRef": "PM722418",
                "parDelegation": false
              },
              {
                "acteurRef": "PA721054",
                "mandatRef": "PM723156",
                "parDelegation": false
              }
            ],
            "contre": [
              {
                "acteurRef": "PA606712",
                "mandatRef": "PM722756",
                "parDelegation": false
              },
              {
                "acteurRef": "PA721506",
                "mandatRef": "PM723296",
                "parDelegation": false
              }
            ],
            "abstentions": [
              {
                "acteurRef": "PA720100",
                "mandatRef": "PM722860",
                "parDelegation": false
              },
              {
                "acteurRef": "PA721286",
                "mandatRef": "PM723224",
                "parDelegation": false
              },
              {
                "acteurRef": "PA721314",
                "mandatRef": "PM723236",
                "parDelegation": false
              }
            ]
          }
        }
      },
      {
        "organeRef": "PO730970",
        "nombreMembresGroupe": "46",
        "vote": {
          "positionMajoritaire": "contre",
          "decompteVoix": {
            "pour": "1",
            "contre": "2",
            "nonVotants": "0",
            "abstentions": "0",
            "nonVotantsVolontaires": "0"
          },
          "decompteNominatif": {
            "pour": [
              {
                "acteurRef": "PA720256",
                "mandatRef": "PM722908",
                "parDelegation": false
              }
            ],
            "contre": [
              {
                "acteurRef": "PA721742",
                "mandatRef": "PM723370",
                "parDelegation": false
              },
              {
                "acteurRef": "PA721984",
                "mandatRef": "PM723440",
                "parDelegation": false
              }
            ]
          }
        }
      },
      {
        "organeRef": "PO744425",
        "nombreMembresGroupe": "29",
        "vote": {
          "positionMajoritaire": "contre",
          "decompteVoix": {
            "pour": "0",
            "contre": "3",
            "nonVotants": "0",
            "abstentions": "0",
            "nonVotantsVolontaires": "0"
          },
          "decompteNominatif": {
            "contre": [
              {
                "acteurRef": "PA642868",
                "mandatRef": "PM722992",
                "parDelegation": false
              },
              {
                "acteurRef": "PA720696",
                "mandatRef": "PM723044",
                "parDelegation": false
              },
              {
                "acteurRef": "PA721194",
                "mandatRef": "PM723200",
                "parDelegation": false
              }
            ]
          }
        }
      },
      {
        "organeRef": "PO758835",
        "nombreMembresGroupe": "29",
        "vote": {
          "positionMajoritaire": "pour",
          "decompteVoix": {
            "pour": "18",
            "contre": "2",
            "nonVotants": "0",
            "abstentions": "0",
            "nonVotantsVolontaires": "0"
          },
          "decompteNominatif": {
            "pour": [
              {
                "acteurRef": "PA1198",
                "mandatRef": "PM722532",
                "parDelegation": false
              },
              {
                "acteurRef": "PA1592",
                "mandatRef": "PM723060",
                "parDelegation": false
              },
              {
                "acteurRef": "PA333818",
                "mandatRef": "PM722990",
                "parDelegation": false
              },
              {
                "acteurRef": "PA335054",
                "mandatRef": "PM723254",
                "parDelegation": false
              },
              {
                "acteurRef": "PA267233",
                "mandatRef": "PM723500",
                "parDelegation": false
              },
              {
                "acteurRef": "PA337483",
                "mandatRef": "PM723140",
                "parDelegation": false
              },
              {
                "acteurRef": "PA332614",
                "mandatRef": "PM722812",
                "parDelegation": false
              },
              {
                "acteurRef": "PA607553",
                "mandatRef": "PM722956",
                "parDelegation": false
              },
              {
                "acteurRef": "PA608172",
                "mandatRef": "PM723048",
                "parDelegation": false
              },
              {
                "acteurRef": "PA609590",
                "mandatRef": "PM723326",
                "parDelegation": false
              },
              {
                "acteurRef": "PA610681",
                "mandatRef": "PM723150",
                "parDelegation": false
              },
              {
                "acteurRef": "PA608011",
                "mandatRef": "PM723022",
                "parDelegation": false
              },
              {
                "acteurRef": "PA1008",
                "mandatRef": "PM722704",
                "parDelegation": false
              },
              {
                "acteurRef": "PA719930",
                "mandatRef": "PM722804",
                "parDelegation": false
              },
              {
                "acteurRef": "PA608741",
                "mandatRef": "PM757984",
                "parDelegation": false
              },
              {
                "acteurRef": "PA643145",
                "mandatRef": "PM723130",
                "parDelegation": false
              },
              {
                "acteurRef": "PA642764",
                "mandatRef": "PM753836",
                "parDelegation": false
              },
              {
                "acteurRef": "PA340357",
                "mandatRef": "PM747435",
                "parDelegation": false
              }
            ],
            "contre": [
              {
                "acteurRef": "PA340343",
                "mandatRef": "PM722470",
                "parDelegation": false
              },
              {
                "acteurRef": "PA720988",
                "mandatRef": "PM723132",
                "parDelegation": false
              }
            ]
          }
        }
      },
      {
        "organeRef": "PO730958",
        "nombreMembresGroupe": "17",
        "vote": {
          "positionMajoritaire": "pour",
          "decompteVoix": {
            "pour": "2",
            "contre": "0",
            "nonVotants": "0",
            "abstentions": "0",
            "nonVotantsVolontaires": "0"
          },
          "decompteNominatif": {
            "pour": [
              {
                "acteurRef": "PA720286",
                "mandatRef": "PM722918",
                "parDelegation": false
              },
              {
                "acteurRef": "PA721210",
                "mandatRef": "PM723204",
                "parDelegation": false
              }
            ]
          }
        }
      },
      {
        "organeRef": "PO730940",
        "nombreMembresGroupe": "16",
        "vote": {
          "positionMajoritaire": "pour",
          "decompteVoix": {
            "pour": "2",
            "contre": "0",
            "nonVotants": "0",
            "abstentions": "0",
            "nonVotantsVolontaires": "0"
          },
          "decompteNominatif": {
            "pour": [
              {
                "acteurRef": "PA610667",
                "mandatRef": "PM723146",
                "parDelegation": false
              },
              {
                "acteurRef": "PA721896",
                "mandatRef": "PM723414",
                "parDelegation": false
              }
            ]
          }
        }
      },
      {
        "organeRef": "PO759900",
        "nombreMembresGroupe": "16",
        "vote": {
          "positionMajoritaire": "pour",
          "decompteVoix": {
            "pour": "2",
            "contre": "0",
            "nonVotants": "0",
            "abstentions": "0",
            "nonVotantsVolontaires": "0"
          },
          "decompteNominatif": {
            "pour": [
              {
                "acteurRef": "PA267042",
                "mandatRef": "PM722910",
                "parDelegation": false
              },
              {
                "acteurRef": "PA608292",
                "mandatRef": "PM723076",
                "parDelegation": false
              }
            ]
          }
        }
      },
      {
        "organeRef": "PO723569",
        "nombreMembresGroupe": "13",
        "vote": {
          "positionMajoritaire": "contre",
          "decompteVoix": {
            "pour": "0",
            "contre": "1",
            "nonVotants": "0",
            "abstentions": "0",
            "nonVotantsVolontaires": "0"
          },
          "decompteNominatif": {
            "contre": [
              {
                "acteurRef": "PA719608",
                "mandatRef": "PM722710",
                "parDelegation": false
              }
            ]
          }
        }
      }
    ]
  },
  "miseAuPoint": {
    "pour": [
      {
        "acteurRef": "PA333285",
        "mandatRef": "PM722906"
      },
      {
        "acteurRef": "PA340343",
        "mandatRef": "PM722470"
      }
    ]
  }
}