{
  "uid": "VTANR5L15V656",
  "numero": "656",
  "organeRef": "PO717460",
  "legislature": "15",
  "sessionRef": "SCR5A2018O1",
  "seanceRef": "RUANR5L15S2018IDS21055",
  "dateScrutin": "2018-05-25T02:00:00.000+02:00",
  "quantiemeJourSeance": "2",
  "typeVote": {
    "codeTypeVote": "SPO",
    "libelleTypeVote": "scrutin public ordinaire",
    "typeMajorite": "majorité absolue des suffrages exprimés"
  },
  "sort": {
    "code": "rejeté",
    "libelle": "L'Assemblée nationale n'a pas adopté"
  },
  "titre": "le sous-amendement n° 2738 de M. Garot à l'amendement n° 2653 (rect.) de M. Moreau après l'article 10 ter du projet de loi pour l'équilibre des relations commerciales dans le secteur agricole et alimentaire et une alimentation saine et durable (première lecture).",
  "demandeur": {
    "texte": "Présidente du groupe \"Nouvelle Gauche\""
  },
  "objet": {
    "libelle": "le sous-amendement n° 2738 de M. Garot à l'amendement n° 2653 (rect.) de M. Moreau après l'article 10 ter du projet de loi pour l'équilibre des relations commerciales dans le secteur agricole et alimentaire et une alimentation saine et durable (première lecture)."
  },
  "modePublicationDesVotes": "DecompteNominatif",
  "syntheseVote": {
    "nombreVotants": "68",
    "suffragesExprimes": "56",
    "nbrSuffragesRequis": "29",
    "annonce": "L'Assemblée nationale n'a pas adopté",
    "decompte": {
      "pour": "7",
      "contre": "49",
      "nonVotants": "2",
      "abstentions": "12",
      "nonVotantsVolontaires": "0"
    }
  },
  "ventilationVotes": {
    "organeRef": "PO717460",
    "groupes": [
      {
        "organeRef": "PO730964",
        "nombreMembresGroupe": "313",
        "vote": {
          "positionMajoritaire": "contre",
          "decompteVoix": {
            "pour": "1",
            "contre": "41",
            "nonVotants": "1",
            "abstentions": "0",
            "nonVotantsVolontaires": "0"
          },
          "decompteNominatif": {
            "nonVotants": [
              {
                "acteurRef": "PA332747",
                "mandatRef": "PM722798",
                "causePositionVote": "PAN"
              }
            ],
            "pour": [
              {
                "acteurRef": "PA719652",
                "mandatRef": "PM722722",
                "parDelegation": false
              }
            ],
            "contre": [
              {
                "acteurRef": "PA607193",
                "mandatRef": "PM722846",
                "parDelegation": false
              },
              {
                "acteurRef": "PA721852",
                "mandatRef": "PM723402",
                "parDelegation": false
              },
              {
                "acteurRef": "PA718802",
                "mandatRef": "PM722462",
                "parDelegation": false
              },
              {
                "acteurRef": "PA718876",
                "mandatRef": "PM722486",
                "parDelegation": false
              },
              {
                "acteurRef": "PA719186",
                "mandatRef": "PM722588",
                "parDelegation": false
              },
              {
                "acteurRef": "PA719230",
                "mandatRef": "PM722600",
                "parDelegation": false
              },
              {
                "acteurRef": "PA719242",
                "mandatRef": "PM722604",
                "parDelegation": false
              },
              {
                "acteurRef": "PA719338",
                "mandatRef": "PM722630",
                "parDelegation": false
              },
              {
                "acteurRef": "PA719388",
                "mandatRef": "PM722648",
                "parDelegation": false
              },
              {
                "acteurRef": "PA719412",
                "mandatRef": "PM722654",
                "parDelegation": false
              },
              {
                "acteurRef": "PA719420",
                "mandatRef": "PM722656",
                "parDelegation": false
              },
              {
                "acteurRef": "PA719550",
                "mandatRef": "PM722694",
                "parDelegation": false
              },
              {
                "acteurRef": "PA719660",
                "mandatRef": "PM722724",
                "parDelegation": false
              },
              {
                "acteurRef": "PA719700",
                "mandatRef": "PM722734",
                "parDelegation": false
              },
              {
                "acteurRef": "PA719814",
                "mandatRef": "PM722770",
                "parDelegation": false
              },
              {
                "acteurRef": "PA719830",
                "mandatRef": "PM722774",
                "parDelegation": false
              },
              {
                "acteurRef": "PA719850",
                "mandatRef": "PM722780",
                "parDelegation": false
              },
              {
                "acteurRef": "PA719858",
                "mandatRef": "PM722782",
                "parDelegation": false
              },
              {
                "acteurRef": "PA719890",
                "mandatRef": "PM722790",
                "parDelegation": false
              },
              {
                "acteurRef": "PA719980",
                "mandatRef": "PM722822",
                "parDelegation": false
              },
              {
                "acteurRef": "PA720014",
                "mandatRef": "PM722834",
                "parDelegation": false
              },
              {
                "acteurRef": "PA720030",
                "mandatRef": "PM722838",
                "parDelegation": false
              },
              {
                "acteurRef": "PA720116",
                "mandatRef": "PM722864",
                "parDelegation": false
              },
              {
                "acteurRef": "PA720222",
                "mandatRef": "PM722896",
                "parDelegation": false
              },
              {
                "acteurRef": "PA720242",
                "mandatRef": "PM722902",
                "parDelegation": false
              },
              {
                "acteurRef": "PA720278",
                "mandatRef": "PM722916",
                "parDelegation": false
              },
              {
                "acteurRef": "PA720318",
                "mandatRef": "PM722928",
                "parDelegation": false
              },
              {
                "acteurRef": "PA720342",
                "mandatRef": "PM722934",
                "parDelegation": false
              },
              {
                "acteurRef": "PA720590",
                "mandatRef": "PM723010",
                "parDelegation": false
              },
              {
                "acteurRef": "PA720780",
                "mandatRef": "PM723074",
                "parDelegation": false
              },
              {
                "acteurRef": "PA721134",
                "mandatRef": "PM723184",
                "parDelegation": false
              },
              {
                "acteurRef": "PA721166",
                "mandatRef": "PM755857",
                "parDelegation": false
              },
              {
                "acteurRef": "PA721398",
                "mandatRef": "PM723262",
                "parDelegation": false
              },
              {
                "acteurRef": "PA721450",
                "mandatRef": "PM723278",
                "parDelegation": false
              },
              {
                "acteurRef": "PA721542",
                "mandatRef": "PM723308",
                "parDelegation": false
              },
              {
                "acteurRef": "PA721600",
                "mandatRef": "PM723330",
                "parDelegation": false
              },
              {
                "acteurRef": "PA721792",
                "mandatRef": "PM723384",
                "parDelegation": false
              },
              {
                "acteurRef": "PA721808",
                "mandatRef": "PM723388",
                "parDelegation": false
              },
              {
                "acteurRef": "PA722022",
                "mandatRef": "PM723452",
                "parDelegation": false
              },
              {
                "acteurRef": "PA722094",
                "mandatRef": "PM723470",
                "parDelegation": false
              },
              {
                "acteurRef": "PA722228",
                "mandatRef": "PM723512",
                "parDelegation": false
              }
            ]
          }
        }
      },
      {
        "organeRef": "PO730934",
        "nombreMembresGroupe": "102",
        "vote": {
          "positionMajoritaire": "abstention",
          "decompteVoix": {
            "pour": "0",
            "contre": "0",
            "nonVotants": "0",
            "abstentions": "9",
            "nonVotantsVolontaires": "9"
          },
          "decompteNominatif": {
            "abstentions": [
              {
                "acteurRef": "PA606712",
                "mandatRef": "PM722756",
                "parDelegation": false
              },
              {
                "acteurRef": "PA720644",
                "mandatRef": "PM723026",
                "parDelegation": false
              },
              {
                "acteurRef": "PA267429",
                "mandatRef": "PM722818",
                "parDelegation": false
              },
              {
                "acteurRef": "PA718838",
                "mandatRef": "PM722474",
                "parDelegation": false
              },
              {
                "acteurRef": "PA1012",
                "mandatRef": "PM722418",
                "parDelegation": false
              },
              {
                "acteurRef": "PA336316",
                "mandatRef": "PM723406",
                "parDelegation": false
              },
              {
                "acteurRef": "PA643134",
                "mandatRef": "PM722824",
                "parDelegation": false
              },
              {
                "acteurRef": "PA330909",
                "mandatRef": "PM722548",
                "parDelegation": false
              },
              {
                "acteurRef": "PA266793",
                "mandatRef": "PM722550",
                "parDelegation": false
              }
            ]
          }
        }
      },
      {
        "organeRef": "PO730970",
        "nombreMembresGroupe": "47",
        "vote": {
          "positionMajoritaire": "contre",
          "decompteVoix": {
            "pour": "0",
            "contre": "7",
            "nonVotants": "0",
            "abstentions": "0",
            "nonVotantsVolontaires": "0"
          },
          "decompteNominatif": {
            "contre": [
              {
                "acteurRef": "PA719938",
                "mandatRef": "PM722806",
                "parDelegation": false
              },
              {
                "acteurRef": "PA720092",
                "mandatRef": "PM722858",
                "parDelegation": false
              },
              {
                "acteurRef": "PA720162",
                "mandatRef": "PM722878",
                "parDelegation": false
              },
              {
                "acteurRef": "PA720256",
                "mandatRef": "PM722908",
                "parDelegation": false
              },
              {
                "acteurRef": "PA720976",
                "mandatRef": "PM723128",
                "parDelegation": false
              },
              {
                "acteurRef": "PA721976",
                "mandatRef": "PM723438",
                "parDelegation": false
              },
              {
                "acteurRef": "PA722162",
                "mandatRef": "PM723490",
                "parDelegation": false
              }
            ]
          }
        }
      },
      {
        "organeRef": "PO744425",
        "nombreMembresGroupe": "32",
        "vote": {
          "positionMajoritaire": "pour",
          "decompteVoix": {
            "pour": "3",
            "contre": "1",
            "nonVotants": "1",
            "abstentions": "0",
            "nonVotantsVolontaires": "0"
          },
          "decompteNominatif": {
            "nonVotants": [
              {
                "acteurRef": "PA267801",
                "mandatRef": "PM723320",
                "causePositionVote": "PSE"
              }
            ],
            "pour": [
              {
                "acteurRef": "PA267042",
                "mandatRef": "PM722910",
                "parDelegation": false
              },
              {
                "acteurRef": "PA335758",
                "mandatRef": "PM723338",
                "parDelegation": false
              },
              {
                "acteurRef": "PA332228",
                "mandatRef": "PM722754",
                "parDelegation": false
              }
            ],
            "contre": [
              {
                "acteurRef": "PA267355",
                "mandatRef": "PM723524",
                "parDelegation": false
              }
            ]
          }
        }
      },
      {
        "organeRef": "PO730946",
        "nombreMembresGroupe": "30",
        "vote": {
          "positionMajoritaire": "pour",
          "decompteVoix": {
            "pour": "3",
            "contre": "0",
            "nonVotants": "0",
            "abstentions": "0",
            "nonVotantsVolontaires": "0"
          },
          "decompteNominatif": {
            "pour": [
              {
                "acteurRef": "PA333285",
                "mandatRef": "PM722906",
                "parDelegation": false
              },
              {
                "acteurRef": "PA607553",
                "mandatRef": "PM722956",
                "parDelegation": false
              },
              {
                "acteurRef": "PA609590",
                "mandatRef": "PM723326",
                "parDelegation": false
              }
            ]
          }
        }
      },
      {
        "organeRef": "PO723569",
        "nombreMembresGroupe": "20",
        "vote": {
          "positionMajoritaire": "pour",
          "decompteVoix": {
            "pour": "0",
            "contre": "0",
            "nonVotants": "0",
            "abstentions": "0",
            "nonVotantsVolontaires": "0"
          },
          "decompteNominatif": {}
        }
      },
      {
        "organeRef": "PO730958",
        "nombreMembresGroupe": "17",
        "vote": {
          "positionMajoritaire": "abstention",
          "decompteVoix": {
            "pour": "0",
            "contre": "0",
            "nonVotants": "0",
            "abstentions": "2",
            "nonVotantsVolontaires": "2"
          },
          "decompteNominatif": {
            "abstentions": [
              {
                "acteurRef": "PA719578",
                "mandatRef": "PM722702",
                "parDelegation": false
              },
              {
                "acteurRef": "PA720286",
                "mandatRef": "PM722918",
                "parDelegation": false
              }
            ]
          }
        }
      },
      {
        "organeRef": "PO730940",
        "nombreMembresGroupe": "16",
        "vote": {
          "positionMajoritaire": "abstention",
          "decompteVoix": {
            "pour": "0",
            "contre": "0",
            "nonVotants": "0",
            "abstentions": "1",
            "nonVotantsVolontaires": "1"
          },
          "decompteNominatif": {
            "abstentions": [
              {
                "acteurRef": "PA267306",
                "mandatRef": "PM723054",
                "parDelegation": false
              }
            ]
          }
        }
      }
    ]
  }
}