{
  "uid": "VTANR5L15V2145",
  "numero": "2145",
  "organeRef": "PO717460",
  "legislature": "15",
  "sessionRef": "SCR5A2020O1",
  "seanceRef": "RUANR5L15S2020IDS21861",
  "dateScrutin": "2019-10-14T02:00:00.000+02:00",
  "quantiemeJourSeance": "2",
  "typeVote": {
    "codeTypeVote": "SPO",
    "libelleTypeVote": "scrutin public ordinaire",
    "typeMajorite": "majorité absolue des suffrages exprimés"
  },
  "sort": {
    "code": "rejeté",
    "libelle": "L'Assemblée nationale n'a pas adopté"
  },
  "titre": "l'amendement n° 1374 de Mme Rabault à l'article 11 du projet de loi de finances pour 2020 (première lecture).",
  "demandeur": {
    "texte": "Présidente du groupe \"Socialistes et apparentés\""
  },
  "objet": {
    "libelle": "l'amendement n° 1374 de Mme Rabault à l'article 11 du projet de loi de finances pour 2020 (première lecture)."
  },
  "modePublicationDesVotes": "DecompteNominatif",
  "syntheseVote": {
    "nombreVotants": "68",
    "suffragesExprimes": "66",
    "nbrSuffragesRequis": "34",
    "annonce": "L'Assemblée nationale n'a pas adopté",
    "decompte": {
      "pour": "15",
      "contre": "51",
      "nonVotants": "2",
      "abstentions": "2",
      "nonVotantsVolontaires": "0"
    }
  },
  "ventilationVotes": {
    "organeRef": "PO717460",
    "groupes": [
      {
        "organeRef": "PO730964",
        "nombreMembresGroupe": "304",
        "vote": {
          "positionMajoritaire": "contre",
          "decompteVoix": {
            "pour": "1",
            "contre": "37",
            "nonVotants": "2",
            "abstentions": "0",
            "nonVotantsVolontaires": "0"
          },
          "decompteNominatif": {
            "nonVotants": [
              {
                "acteurRef": "PA606171",
                "mandatRef": "PM722632",
                "causePositionVote": "PAN"
              },
              {
                "acteurRef": "PA721824",
                "mandatRef": "PM723394",
                "causePositionVote": "PSE"
              }
            ],
            "pour": [
              {
                "acteurRef": "PA719480",
                "mandatRef": "PM722674",
                "parDelegation": false
              }
            ],
            "contre": [
              {
                "acteurRef": "PA267336",
                "mandatRef": "PM722434",
                "parDelegation": false
              },
              {
                "acteurRef": "PA607595",
                "mandatRef": "PM722924",
                "parDelegation": false
              },
              {
                "acteurRef": "PA720492",
                "mandatRef": "PM722980",
                "parDelegation": false
              },
              {
                "acteurRef": "PA718710",
                "mandatRef": "PM722432",
                "parDelegation": false
              },
              {
                "acteurRef": "PA718736",
                "mandatRef": "PM722440",
                "parDelegation": false
              },
              {
                "acteurRef": "PA718744",
                "mandatRef": "PM722442",
                "parDelegation": false
              },
              {
                "acteurRef": "PA718962",
                "mandatRef": "PM722514",
                "parDelegation": false
              },
              {
                "acteurRef": "PA719060",
                "mandatRef": "PM722546",
                "parDelegation": false
              },
              {
                "acteurRef": "PA719186",
                "mandatRef": "PM722588",
                "parDelegation": false
              },
              {
                "acteurRef": "PA719218",
                "mandatRef": "PM722596",
                "parDelegation": false
              },
              {
                "acteurRef": "PA719230",
                "mandatRef": "PM722600",
                "parDelegation": false
              },
              {
                "acteurRef": "PA719250",
                "mandatRef": "PM722606",
                "parDelegation": false
              },
              {
                "acteurRef": "PA719472",
                "mandatRef": "PM722672",
                "parDelegation": false
              },
              {
                "acteurRef": "PA719798",
                "mandatRef": "PM722766",
                "parDelegation": false
              },
              {
                "acteurRef": "PA719850",
                "mandatRef": "PM722780",
                "parDelegation": false
              },
              {
                "acteurRef": "PA719890",
                "mandatRef": "PM722790",
                "parDelegation": false
              },
              {
                "acteurRef": "PA643175",
                "mandatRef": "PM722868",
                "parDelegation": false
              },
              {
                "acteurRef": "PA720170",
                "mandatRef": "PM722880",
                "parDelegation": false
              },
              {
                "acteurRef": "PA720222",
                "mandatRef": "PM722896",
                "parDelegation": false
              },
              {
                "acteurRef": "PA720298",
                "mandatRef": "PM722922",
                "parDelegation": false
              },
              {
                "acteurRef": "PA720402",
                "mandatRef": "PM722952",
                "parDelegation": false
              },
              {
                "acteurRef": "PA720520",
                "mandatRef": "PM722988",
                "parDelegation": false
              },
              {
                "acteurRef": "PA720560",
                "mandatRef": "PM723000",
                "parDelegation": false
              },
              {
                "acteurRef": "PA720590",
                "mandatRef": "PM723010",
                "parDelegation": false
              },
              {
                "acteurRef": "PA720878",
                "mandatRef": "PM723102",
                "parDelegation": false
              },
              {
                "acteurRef": "PA720900",
                "mandatRef": "PM723108",
                "parDelegation": false
              },
              {
                "acteurRef": "PA720908",
                "mandatRef": "PM723110",
                "parDelegation": true
              },
              {
                "acteurRef": "PA720916",
                "mandatRef": "PM723112",
                "parDelegation": false
              },
              {
                "acteurRef": "PA721150",
                "mandatRef": "PM723188",
                "parDelegation": false
              },
              {
                "acteurRef": "PA721426",
                "mandatRef": "PM723270",
                "parDelegation": false
              },
              {
                "acteurRef": "PA721450",
                "mandatRef": "PM723278",
                "parDelegation": false
              },
              {
                "acteurRef": "PA721458",
                "mandatRef": "PM723280",
                "parDelegation": false
              },
              {
                "acteurRef": "PA721542",
                "mandatRef": "PM723308",
                "parDelegation": false
              },
              {
                "acteurRef": "PA721916",
                "mandatRef": "PM723420",
                "parDelegation": false
              },
              {
                "acteurRef": "PA722054",
                "mandatRef": "PM723460",
                "parDelegation": false
              },
              {
                "acteurRef": "PA722366",
                "mandatRef": "PM723554",
                "parDelegation": false
              },
              {
                "acteurRef": "PA722382",
                "mandatRef": "PM723558",
                "parDelegation": false
              }
            ]
          }
        }
      },
      {
        "organeRef": "PO730934",
        "nombreMembresGroupe": "104",
        "vote": {
          "positionMajoritaire": "contre",
          "decompteVoix": {
            "pour": "3",
            "contre": "7",
            "nonVotants": "0",
            "abstentions": "2",
            "nonVotantsVolontaires": "2"
          },
          "decompteNominatif": {
            "pour": [
              {
                "acteurRef": "PA332523",
                "mandatRef": "PM722792",
                "parDelegation": false
              },
              {
                "acteurRef": "PA718784",
                "mandatRef": "PM722456",
                "parDelegation": false
              },
              {
                "acteurRef": "PA720630",
                "mandatRef": "PM723020",
                "parDelegation": false
              }
            ],
            "contre": [
              {
                "acteurRef": "PA606712",
                "mandatRef": "PM722756",
                "parDelegation": false
              },
              {
                "acteurRef": "PA1874",
                "mandatRef": "PM722598",
                "parDelegation": false
              },
              {
                "acteurRef": "PA2960",
                "mandatRef": "PM723006",
                "parDelegation": false
              },
              {
                "acteurRef": "PA605036",
                "mandatRef": "PM722444",
                "parDelegation": false
              },
              {
                "acteurRef": "PA721410",
                "mandatRef": "PM723266",
                "parDelegation": false
              },
              {
                "acteurRef": "PA608016",
                "mandatRef": "PM723024",
                "parDelegation": false
              },
              {
                "acteurRef": "PA712015",
                "mandatRef": "PM722448",
                "parDelegation": false
              }
            ],
            "abstentions": [
              {
                "acteurRef": "PA340853",
                "mandatRef": "PM722534",
                "parDelegation": false
              },
              {
                "acteurRef": "PA718884",
                "mandatRef": "PM722488",
                "parDelegation": false
              }
            ]
          }
        }
      },
      {
        "organeRef": "PO730970",
        "nombreMembresGroupe": "46",
        "vote": {
          "positionMajoritaire": "contre",
          "decompteVoix": {
            "pour": "0",
            "contre": "3",
            "nonVotants": "0",
            "abstentions": "0",
            "nonVotantsVolontaires": "0"
          },
          "decompteNominatif": {
            "contre": [
              {
                "acteurRef": "PA720652",
                "mandatRef": "PM723028",
                "parDelegation": false
              },
              {
                "acteurRef": "PA720728",
                "mandatRef": "PM723058",
                "parDelegation": false
              },
              {
                "acteurRef": "PA721924",
                "mandatRef": "PM723422",
                "parDelegation": false
              }
            ]
          }
        }
      },
      {
        "organeRef": "PO758835",
        "nombreMembresGroupe": "29",
        "vote": {
          "positionMajoritaire": "pour",
          "decompteVoix": {
            "pour": "5",
            "contre": "0",
            "nonVotants": "0",
            "abstentions": "0",
            "nonVotantsVolontaires": "0"
          },
          "decompteNominatif": {
            "pour": [
              {
                "acteurRef": "PA605069",
                "mandatRef": "PM722424",
                "parDelegation": false
              },
              {
                "acteurRef": "PA342415",
                "mandatRef": "PM722826",
                "parDelegation": false
              },
              {
                "acteurRef": "PA608172",
                "mandatRef": "PM723048",
                "parDelegation": false
              },
              {
                "acteurRef": "PA609590",
                "mandatRef": "PM723326",
                "parDelegation": false
              },
              {
                "acteurRef": "PA340357",
                "mandatRef": "PM747435",
                "parDelegation": false
              }
            ]
          }
        }
      },
      {
        "organeRef": "PO767217",
        "nombreMembresGroupe": "28",
        "vote": {
          "positionMajoritaire": "contre",
          "decompteVoix": {
            "pour": "0",
            "contre": "2",
            "nonVotants": "0",
            "abstentions": "0",
            "nonVotantsVolontaires": "0"
          },
          "decompteNominatif": {
            "contre": [
              {
                "acteurRef": "PA720230",
                "mandatRef": "PM722898",
                "parDelegation": false
              },
              {
                "acteurRef": "PA721632",
                "mandatRef": "PM760305",
                "parDelegation": false
              }
            ]
          }
        }
      },
      {
        "organeRef": "PO759900",
        "nombreMembresGroupe": "19",
        "vote": {
          "positionMajoritaire": "pour",
          "decompteVoix": {
            "pour": "1",
            "contre": "1",
            "nonVotants": "0",
            "abstentions": "0",
            "nonVotantsVolontaires": "0"
          },
          "decompteNominatif": {
            "pour": [
              {
                "acteurRef": "PA608292",
                "mandatRef": "PM723076",
                "parDelegation": false
              }
            ],
            "contre": [
              {
                "acteurRef": "PA942",
                "mandatRef": "PM722900",
                "parDelegation": false
              }
            ]
          }
        }
      },
      {
        "organeRef": "PO730958",
        "nombreMembresGroupe": "17",
        "vote": {
          "positionMajoritaire": "pour",
          "decompteVoix": {
            "pour": "1",
            "contre": "0",
            "nonVotants": "0",
            "abstentions": "0",
            "nonVotantsVolontaires": "0"
          },
          "decompteNominatif": {
            "pour": [
              {
                "acteurRef": "PA721202",
                "mandatRef": "PM723202",
                "parDelegation": false
              }
            ]
          }
        }
      },
      {
        "organeRef": "PO730940",
        "nombreMembresGroupe": "16",
        "vote": {
          "positionMajoritaire": "pour",
          "decompteVoix": {
            "pour": "3",
            "contre": "0",
            "nonVotants": "0",
            "abstentions": "0",
            "nonVotantsVolontaires": "0"
          },
          "decompteNominatif": {
            "pour": [
              {
                "acteurRef": "PA720692",
                "mandatRef": "PM723042",
                "parDelegation": false
              },
              {
                "acteurRef": "PA718720",
                "mandatRef": "PM722436",
                "parDelegation": false
              },
              {
                "acteurRef": "PA721118",
                "mandatRef": "PM723176",
                "parDelegation": false
              }
            ]
          }
        }
      },
      {
        "organeRef": "PO723569",
        "nombreMembresGroupe": "13",
        "vote": {
          "positionMajoritaire": "pour",
          "decompteVoix": {
            "pour": "1",
            "contre": "1",
            "nonVotants": "0",
            "abstentions": "0",
            "nonVotantsVolontaires": "0"
          },
          "decompteNominatif": {
            "pour": [
              {
                "acteurRef": "PA1838",
                "mandatRef": "PM723068",
                "parDelegation": false
              }
            ],
            "contre": [
              {
                "acteurRef": "PA719608",
                "mandatRef": "PM722710",
                "parDelegation": false
              }
            ]
          }
        }
      }
    ]
  },
  "miseAuPoint": {
    "contre": [
      {
        "acteurRef": "PA719480",
        "mandatRef": "PM722674"
      }
    ]
  }
}