{
  "uid": "VTANR5L15V1230",
  "numero": "1230",
  "organeRef": "PO717460",
  "legislature": "15",
  "sessionRef": "SCR5A2019O1",
  "seanceRef": "RUANR5L15S2019IDS21274",
  "dateScrutin": "2018-10-16T02:00:00.000+02:00",
  "quantiemeJourSeance": "1",
  "typeVote": {
    "codeTypeVote": "SPO",
    "libelleTypeVote": "scrutin public ordinaire",
    "typeMajorite": "majorité absolue des suffrages exprimés"
  },
  "sort": {
    "code": "rejeté",
    "libelle": "L'Assemblée nationale n'a pas adopté"
  },
  "titre": "l'amendement n° 302 de M. Le Fur et l'amendement identique suivant à l'article 2 du projet de loi de finances pour 2019 (première lecture).",
  "demandeur": {
    "texte": "Président du groupe \"Les Républicains\""
  },
  "objet": {
    "libelle": "l'amendement n° 302 de M. Le Fur et l'amendement identique suivant à l'article 2 du projet de loi de finances pour 2019 (première lecture)."
  },
  "modePublicationDesVotes": "DecompteNominatif",
  "syntheseVote": {
    "nombreVotants": "141",
    "suffragesExprimes": "138",
    "nbrSuffragesRequis": "70",
    "annonce": "L'Assemblée nationale n'a pas adopté",
    "decompte": {
      "pour": "46",
      "contre": "92",
      "nonVotants": "1",
      "abstentions": "3",
      "nonVotantsVolontaires": "0"
    }
  },
  "ventilationVotes": {
    "organeRef": "PO717460",
    "groupes": [
      {
        "organeRef": "PO730964",
        "nombreMembresGroupe": "310",
        "vote": {
          "positionMajoritaire": "contre",
          "decompteVoix": {
            "pour": "0",
            "contre": "81",
            "nonVotants": "1",
            "abstentions": "0",
            "nonVotantsVolontaires": "0"
          },
          "decompteNominatif": {
            "nonVotants": [
              {
                "acteurRef": "PA606171",
                "mandatRef": "PM722632",
                "causePositionVote": "PSE"
              }
            ],
            "contre": [
              {
                "acteurRef": "PA722398",
                "mandatRef": "PM723562",
                "parDelegation": false
              },
              {
                "acteurRef": "PA643127",
                "mandatRef": "PM722636",
                "parDelegation": false
              },
              {
                "acteurRef": "PA2828",
                "mandatRef": "PM722540",
                "parDelegation": false
              },
              {
                "acteurRef": "PA334768",
                "mandatRef": "PM723548",
                "parDelegation": false
              },
              {
                "acteurRef": "PA605963",
                "mandatRef": "PM722584",
                "parDelegation": false
              },
              {
                "acteurRef": "PA607155",
                "mandatRef": "PM722832",
                "parDelegation": false
              },
              {
                "acteurRef": "PA607595",
                "mandatRef": "PM722924",
                "parDelegation": false
              },
              {
                "acteurRef": "PA720492",
                "mandatRef": "PM722980",
                "parDelegation": false
              },
              {
                "acteurRef": "PA718736",
                "mandatRef": "PM722440",
                "parDelegation": false
              },
              {
                "acteurRef": "PA677483",
                "mandatRef": "PM722466",
                "parDelegation": false
              },
              {
                "acteurRef": "PA718902",
                "mandatRef": "PM722496",
                "parDelegation": false
              },
              {
                "acteurRef": "PA718954",
                "mandatRef": "PM722512",
                "parDelegation": false
              },
              {
                "acteurRef": "PA718962",
                "mandatRef": "PM722514",
                "parDelegation": false
              },
              {
                "acteurRef": "PA719006",
                "mandatRef": "PM722530",
                "parDelegation": false
              },
              {
                "acteurRef": "PA719024",
                "mandatRef": "PM722536",
                "parDelegation": false
              },
              {
                "acteurRef": "PA719060",
                "mandatRef": "PM722546",
                "parDelegation": false
              },
              {
                "acteurRef": "PA719092",
                "mandatRef": "PM722560",
                "parDelegation": false
              },
              {
                "acteurRef": "PA719154",
                "mandatRef": "PM722578",
                "parDelegation": false
              },
              {
                "acteurRef": "PA719170",
                "mandatRef": "PM722582",
                "parDelegation": false
              },
              {
                "acteurRef": "PA719194",
                "mandatRef": "PM722590",
                "parDelegation": false
              },
              {
                "acteurRef": "PA719230",
                "mandatRef": "PM722600",
                "parDelegation": false
              },
              {
                "acteurRef": "PA719250",
                "mandatRef": "PM722606",
                "parDelegation": false
              },
              {
                "acteurRef": "PA719310",
                "mandatRef": "PM722622",
                "parDelegation": false
              },
              {
                "acteurRef": "PA719330",
                "mandatRef": "PM722628",
                "parDelegation": false
              },
              {
                "acteurRef": "PA719364",
                "mandatRef": "PM722638",
                "parDelegation": false
              },
              {
                "acteurRef": "PA719388",
                "mandatRef": "PM722648",
                "parDelegation": false
              },
              {
                "acteurRef": "PA719420",
                "mandatRef": "PM722656",
                "parDelegation": false
              },
              {
                "acteurRef": "PA719440",
                "mandatRef": "PM722664",
                "parDelegation": false
              },
              {
                "acteurRef": "PA719472",
                "mandatRef": "PM722672",
                "parDelegation": false
              },
              {
                "acteurRef": "PA719480",
                "mandatRef": "PM722674",
                "parDelegation": false
              },
              {
                "acteurRef": "PA719550",
                "mandatRef": "PM722694",
                "parDelegation": false
              },
              {
                "acteurRef": "PA719616",
                "mandatRef": "PM722712",
                "parDelegation": false
              },
              {
                "acteurRef": "PA719692",
                "mandatRef": "PM722732",
                "parDelegation": false
              },
              {
                "acteurRef": "PA719710",
                "mandatRef": "PM722738",
                "parDelegation": false
              },
              {
                "acteurRef": "PA719778",
                "mandatRef": "PM722760",
                "parDelegation": false
              },
              {
                "acteurRef": "PA719798",
                "mandatRef": "PM722766",
                "parDelegation": false
              },
              {
                "acteurRef": "PA719850",
                "mandatRef": "PM722780",
                "parDelegation": false
              },
              {
                "acteurRef": "PA719922",
                "mandatRef": "PM722802",
                "parDelegation": false
              },
              {
                "acteurRef": "PA720108",
                "mandatRef": "PM722862",
                "parDelegation": false
              },
              {
                "acteurRef": "PA720116",
                "mandatRef": "PM722864",
                "parDelegation": false
              },
              {
                "acteurRef": "PA643175",
                "mandatRef": "PM722868",
                "parDelegation": false
              },
              {
                "acteurRef": "PA720222",
                "mandatRef": "PM722896",
                "parDelegation": false
              },
              {
                "acteurRef": "PA720278",
                "mandatRef": "PM722916",
                "parDelegation": false
              },
              {
                "acteurRef": "PA720298",
                "mandatRef": "PM722922",
                "parDelegation": false
              },
              {
                "acteurRef": "PA720310",
                "mandatRef": "PM722926",
                "parDelegation": false
              },
              {
                "acteurRef": "PA720318",
                "mandatRef": "PM722928",
                "parDelegation": false
              },
              {
                "acteurRef": "PA720362",
                "mandatRef": "PM722942",
                "parDelegation": false
              },
              {
                "acteurRef": "PA720378",
                "mandatRef": "PM722946",
                "parDelegation": false
              },
              {
                "acteurRef": "PA720446",
                "mandatRef": "PM722966",
                "parDelegation": false
              },
              {
                "acteurRef": "PA720454",
                "mandatRef": "PM722968",
                "parDelegation": false
              },
              {
                "acteurRef": "PA720560",
                "mandatRef": "PM723000",
                "parDelegation": false
              },
              {
                "acteurRef": "PA720814",
                "mandatRef": "PM723084",
                "parDelegation": false
              },
              {
                "acteurRef": "PA720878",
                "mandatRef": "PM723102",
                "parDelegation": false
              },
              {
                "acteurRef": "PA721024",
                "mandatRef": "PM723144",
                "parDelegation": false
              },
              {
                "acteurRef": "PA721150",
                "mandatRef": "PM723188",
                "parDelegation": false
              },
              {
                "acteurRef": "PA721158",
                "mandatRef": "PM723190",
                "parDelegation": false
              },
              {
                "acteurRef": "PA721336",
                "mandatRef": "PM723242",
                "parDelegation": false
              },
              {
                "acteurRef": "PA721384",
                "mandatRef": "PM723256",
                "parDelegation": false
              },
              {
                "acteurRef": "PA721398",
                "mandatRef": "PM723262",
                "parDelegation": false
              },
              {
                "acteurRef": "PA721498",
                "mandatRef": "PM723294",
                "parDelegation": false
              },
              {
                "acteurRef": "PA721542",
                "mandatRef": "PM723308",
                "parDelegation": false
              },
              {
                "acteurRef": "PA721584",
                "mandatRef": "PM723324",
                "parDelegation": false
              },
              {
                "acteurRef": "PA721600",
                "mandatRef": "PM723330",
                "parDelegation": false
              },
              {
                "acteurRef": "PA721616",
                "mandatRef": "PM723334",
                "parDelegation": false
              },
              {
                "acteurRef": "PA721670",
                "mandatRef": "PM723350",
                "parDelegation": false
              },
              {
                "acteurRef": "PA721792",
                "mandatRef": "PM723384",
                "parDelegation": false
              },
              {
                "acteurRef": "PA721916",
                "mandatRef": "PM723420",
                "parDelegation": false
              },
              {
                "acteurRef": "PA722000",
                "mandatRef": "PM723444",
                "parDelegation": false
              },
              {
                "acteurRef": "PA722126",
                "mandatRef": "PM723478",
                "parDelegation": false
              },
              {
                "acteurRef": "PA722134",
                "mandatRef": "PM723482",
                "parDelegation": false
              },
              {
                "acteurRef": "PA722228",
                "mandatRef": "PM723512",
                "parDelegation": false
              },
              {
                "acteurRef": "PA722244",
                "mandatRef": "PM723516",
                "parDelegation": false
              },
              {
                "acteurRef": "PA722292",
                "mandatRef": "PM723530",
                "parDelegation": false
              },
              {
                "acteurRef": "PA722300",
                "mandatRef": "PM723532",
                "parDelegation": false
              },
              {
                "acteurRef": "PA722312",
                "mandatRef": "PM723536",
                "parDelegation": false
              },
              {
                "acteurRef": "PA722358",
                "mandatRef": "PM723552",
                "parDelegation": false
              },
              {
                "acteurRef": "PA722382",
                "mandatRef": "PM723558",
                "parDelegation": false
              },
              {
                "acteurRef": "PA724827",
                "mandatRef": "PM754304",
                "parDelegation": false
              },
              {
                "acteurRef": "PA642695",
                "mandatRef": "PM722602",
                "parDelegation": false
              },
              {
                "acteurRef": "PA719326",
                "mandatRef": "PM733709",
                "parDelegation": false
              },
              {
                "acteurRef": "PA720198",
                "mandatRef": "PM733711",
                "parDelegation": false
              }
            ]
          }
        }
      },
      {
        "organeRef": "PO730934",
        "nombreMembresGroupe": "104",
        "vote": {
          "positionMajoritaire": "pour",
          "decompteVoix": {
            "pour": "37",
            "contre": "0",
            "nonVotants": "0",
            "abstentions": "0",
            "nonVotantsVolontaires": "0"
          },
          "decompteNominatif": {
            "pour": [
              {
                "acteurRef": "PA720210",
                "mandatRef": "PM722892",
                "parDelegation": false
              },
              {
                "acteurRef": "PA606712",
                "mandatRef": "PM722756",
                "parDelegation": false
              },
              {
                "acteurRef": "PA1327",
                "mandatRef": "PM722762",
                "parDelegation": false
              },
              {
                "acteurRef": "PA1874",
                "mandatRef": "PM722598",
                "parDelegation": false
              },
              {
                "acteurRef": "PA746",
                "mandatRef": "PM723212",
                "parDelegation": false
              },
              {
                "acteurRef": "PA266808",
                "mandatRef": "PM723264",
                "parDelegation": false
              },
              {
                "acteurRef": "PA720586",
                "mandatRef": "PM723008",
                "parDelegation": false
              },
              {
                "acteurRef": "PA606098",
                "mandatRef": "PM722642",
                "parDelegation": false
              },
              {
                "acteurRef": "PA2960",
                "mandatRef": "PM723006",
                "parDelegation": false
              },
              {
                "acteurRef": "PA718850",
                "mandatRef": "PM722478",
                "parDelegation": false
              },
              {
                "acteurRef": "PA608826",
                "mandatRef": "PM723276",
                "parDelegation": false
              },
              {
                "acteurRef": "PA721636",
                "mandatRef": "PM723340",
                "parDelegation": false
              },
              {
                "acteurRef": "PA336316",
                "mandatRef": "PM723406",
                "parDelegation": false
              },
              {
                "acteurRef": "PA330008",
                "mandatRef": "PM722416",
                "parDelegation": false
              },
              {
                "acteurRef": "PA266797",
                "mandatRef": "PM722884",
                "parDelegation": false
              },
              {
                "acteurRef": "PA332523",
                "mandatRef": "PM722792",
                "parDelegation": false
              },
              {
                "acteurRef": "PA267450",
                "mandatRef": "PM722586",
                "parDelegation": false
              },
              {
                "acteurRef": "PA721968",
                "mandatRef": "PM723436",
                "parDelegation": false
              },
              {
                "acteurRef": "PA721410",
                "mandatRef": "PM723266",
                "parDelegation": false
              },
              {
                "acteurRef": "PA607090",
                "mandatRef": "PM722796",
                "parDelegation": false
              },
              {
                "acteurRef": "PA608016",
                "mandatRef": "PM723024",
                "parDelegation": false
              },
              {
                "acteurRef": "PA609245",
                "mandatRef": "PM723318",
                "parDelegation": false
              },
              {
                "acteurRef": "PA609726",
                "mandatRef": "PM723426",
                "parDelegation": false
              },
              {
                "acteurRef": "PA718780",
                "mandatRef": "PM722454",
                "parDelegation": false
              },
              {
                "acteurRef": "PA718784",
                "mandatRef": "PM722456",
                "parDelegation": false
              },
              {
                "acteurRef": "PA718884",
                "mandatRef": "PM722488",
                "parDelegation": false
              },
              {
                "acteurRef": "PA643103",
                "mandatRef": "PM722614",
                "parDelegation": false
              },
              {
                "acteurRef": "PA719318",
                "mandatRef": "PM722624",
                "parDelegation": false
              },
              {
                "acteurRef": "PA720100",
                "mandatRef": "PM722860",
                "parDelegation": false
              },
              {
                "acteurRef": "PA720386",
                "mandatRef": "PM722948",
                "parDelegation": false
              },
              {
                "acteurRef": "PA642847",
                "mandatRef": "PM722954",
                "parDelegation": false
              },
              {
                "acteurRef": "PA721046",
                "mandatRef": "PM723154",
                "parDelegation": false
              },
              {
                "acteurRef": "PA330909",
                "mandatRef": "PM722548",
                "parDelegation": false
              },
              {
                "acteurRef": "PA266793",
                "mandatRef": "PM722550",
                "parDelegation": false
              },
              {
                "acteurRef": "PA709315",
                "mandatRef": "PM722526",
                "parDelegation": false
              },
              {
                "acteurRef": "PA712015",
                "mandatRef": "PM722448",
                "parDelegation": false
              },
              {
                "acteurRef": "PA759192",
                "mandatRef": "PM759197",
                "parDelegation": false
              }
            ]
          }
        }
      },
      {
        "organeRef": "PO730970",
        "nombreMembresGroupe": "46",
        "vote": {
          "positionMajoritaire": "contre",
          "decompteVoix": {
            "pour": "1",
            "contre": "4",
            "nonVotants": "0",
            "abstentions": "0",
            "nonVotantsVolontaires": "0"
          },
          "decompteNominatif": {
            "pour": [
              {
                "acteurRef": "PA721608",
                "mandatRef": "PM723332",
                "parDelegation": false
              }
            ],
            "contre": [
              {
                "acteurRef": "PA720002",
                "mandatRef": "PM722830",
                "parDelegation": false
              },
              {
                "acteurRef": "PA720728",
                "mandatRef": "PM723058",
                "parDelegation": false
              },
              {
                "acteurRef": "PA721234",
                "mandatRef": "PM723210",
                "parDelegation": false
              },
              {
                "acteurRef": "PA721836",
                "mandatRef": "PM723398",
                "parDelegation": false
              }
            ]
          }
        }
      },
      {
        "organeRef": "PO744425",
        "nombreMembresGroupe": "32",
        "vote": {
          "positionMajoritaire": "pour",
          "decompteVoix": {
            "pour": "7",
            "contre": "0",
            "nonVotants": "0",
            "abstentions": "2",
            "nonVotantsVolontaires": "2"
          },
          "decompteNominatif": {
            "pour": [
              {
                "acteurRef": "PA942",
                "mandatRef": "PM722900",
                "parDelegation": false
              },
              {
                "acteurRef": "PA267330",
                "mandatRef": "PM723392",
                "parDelegation": false
              },
              {
                "acteurRef": "PA331582",
                "mandatRef": "PM722646",
                "parDelegation": false
              },
              {
                "acteurRef": "PA332228",
                "mandatRef": "PM722754",
                "parDelegation": false
              },
              {
                "acteurRef": "PA721194",
                "mandatRef": "PM723200",
                "parDelegation": false
              },
              {
                "acteurRef": "PA721486",
                "mandatRef": "PM723290",
                "parDelegation": false
              },
              {
                "acteurRef": "PA702052",
                "mandatRef": "PM723172",
                "parDelegation": false
              }
            ],
            "abstentions": [
              {
                "acteurRef": "PA267766",
                "mandatRef": "PM722970",
                "parDelegation": false
              },
              {
                "acteurRef": "PA720696",
                "mandatRef": "PM723044",
                "parDelegation": false
              }
            ]
          }
        }
      },
      {
        "organeRef": "PO758835",
        "nombreMembresGroupe": "30",
        "vote": {
          "positionMajoritaire": "contre",
          "decompteVoix": {
            "pour": "0",
            "contre": "6",
            "nonVotants": "0",
            "abstentions": "0",
            "nonVotantsVolontaires": "0"
          },
          "decompteNominatif": {
            "contre": [
              {
                "acteurRef": "PA1592",
                "mandatRef": "PM723060",
                "parDelegation": false
              },
              {
                "acteurRef": "PA605069",
                "mandatRef": "PM722424",
                "parDelegation": false
              },
              {
                "acteurRef": "PA332614",
                "mandatRef": "PM722812",
                "parDelegation": false
              },
              {
                "acteurRef": "PA405480",
                "mandatRef": "PM723118",
                "parDelegation": false
              },
              {
                "acteurRef": "PA608172",
                "mandatRef": "PM723048",
                "parDelegation": false
              },
              {
                "acteurRef": "PA608695",
                "mandatRef": "PM723564",
                "parDelegation": false
              }
            ]
          }
        }
      },
      {
        "organeRef": "PO723569",
        "nombreMembresGroupe": "21",
        "vote": {
          "positionMajoritaire": "pour",
          "decompteVoix": {
            "pour": "1",
            "contre": "0",
            "nonVotants": "0",
            "abstentions": "0",
            "nonVotantsVolontaires": "0"
          },
          "decompteNominatif": {
            "pour": [
              {
                "acteurRef": "PA719608",
                "mandatRef": "PM722710",
                "parDelegation": false
              }
            ]
          }
        }
      },
      {
        "organeRef": "PO730958",
        "nombreMembresGroupe": "17",
        "vote": {
          "positionMajoritaire": "abstention",
          "decompteVoix": {
            "pour": "0",
            "contre": "0",
            "nonVotants": "0",
            "abstentions": "1",
            "nonVotantsVolontaires": "1"
          },
          "decompteNominatif": {
            "abstentions": [
              {
                "acteurRef": "PA721226",
                "mandatRef": "PM723208",
                "parDelegation": false
              }
            ]
          }
        }
      },
      {
        "organeRef": "PO730940",
        "nombreMembresGroupe": "16",
        "vote": {
          "positionMajoritaire": "contre",
          "decompteVoix": {
            "pour": "0",
            "contre": "1",
            "nonVotants": "0",
            "abstentions": "0",
            "nonVotantsVolontaires": "0"
          },
          "decompteNominatif": {
            "contre": [
              {
                "acteurRef": "PA718720",
                "mandatRef": "PM722436",
                "parDelegation": false
              }
            ]
          }
        }
      }
    ]
  }
}