{
  "uid": "VTANR5L15V643",
  "numero": "643",
  "organeRef": "PO717460",
  "legislature": "15",
  "sessionRef": "SCR5A2018O1",
  "seanceRef": "RUANR5L15S2018IDS21053",
  "dateScrutin": "2018-05-24T02:00:00.000+02:00",
  "quantiemeJourSeance": "3",
  "typeVote": {
    "codeTypeVote": "SPO",
    "libelleTypeVote": "scrutin public ordinaire",
    "typeMajorite": "majorité absolue des suffrages exprimés"
  },
  "sort": {
    "code": "rejeté",
    "libelle": "L'Assemblée nationale n'a pas adopté"
  },
  "titre": "l'amendement de suppression n° 1755 de M. Chassaigne à l'article 8 du projet de loi pour l'équilibre des relations commerciales dans le secteur agricole et alimentaire et une alimentation saine et durable (première lecture).",
  "demandeur": {
    "texte": "Président du groupe \"de la Gauche démocrate et républicaine\""
  },
  "objet": {
    "libelle": "l'amendement de suppression n° 1755 de M. Chassaigne à l'article 8 du projet de loi pour l'équilibre des relations commerciales dans le secteur agricole et alimentaire et une alimentation saine et durable (première lecture)."
  },
  "modePublicationDesVotes": "DecompteNominatif",
  "syntheseVote": {
    "nombreVotants": "78",
    "suffragesExprimes": "75",
    "nbrSuffragesRequis": "38",
    "annonce": "L'Assemblée nationale n'a pas adopté",
    "decompte": {
      "pour": "23",
      "contre": "52",
      "nonVotants": "2",
      "abstentions": "3",
      "nonVotantsVolontaires": "0"
    }
  },
  "ventilationVotes": {
    "organeRef": "PO717460",
    "groupes": [
      {
        "organeRef": "PO730964",
        "nombreMembresGroupe": "313",
        "vote": {
          "positionMajoritaire": "contre",
          "decompteVoix": {
            "pour": "1",
            "contre": "49",
            "nonVotants": "1",
            "abstentions": "2",
            "nonVotantsVolontaires": "2"
          },
          "decompteNominatif": {
            "nonVotants": [
              {
                "acteurRef": "PA332747",
                "mandatRef": "PM722798",
                "causePositionVote": "PAN"
              }
            ],
            "pour": [
              {
                "acteurRef": "PA720862",
                "mandatRef": "PM723098",
                "parDelegation": false
              }
            ],
            "contre": [
              {
                "acteurRef": "PA721262",
                "mandatRef": "PM723218",
                "parDelegation": false
              },
              {
                "acteurRef": "PA609520",
                "mandatRef": "PM723508",
                "parDelegation": false
              },
              {
                "acteurRef": "PA722190",
                "mandatRef": "PM723498",
                "parDelegation": false
              },
              {
                "acteurRef": "PA721852",
                "mandatRef": "PM723402",
                "parDelegation": false
              },
              {
                "acteurRef": "PA677483",
                "mandatRef": "PM722466",
                "parDelegation": false
              },
              {
                "acteurRef": "PA718876",
                "mandatRef": "PM722486",
                "parDelegation": false
              },
              {
                "acteurRef": "PA718930",
                "mandatRef": "PM722504",
                "parDelegation": false
              },
              {
                "acteurRef": "PA719032",
                "mandatRef": "PM722538",
                "parDelegation": false
              },
              {
                "acteurRef": "PA719080",
                "mandatRef": "PM722554",
                "parDelegation": false
              },
              {
                "acteurRef": "PA719100",
                "mandatRef": "PM722562",
                "parDelegation": false
              },
              {
                "acteurRef": "PA719186",
                "mandatRef": "PM722588",
                "parDelegation": false
              },
              {
                "acteurRef": "PA719230",
                "mandatRef": "PM722600",
                "parDelegation": false
              },
              {
                "acteurRef": "PA719242",
                "mandatRef": "PM722604",
                "parDelegation": false
              },
              {
                "acteurRef": "PA719258",
                "mandatRef": "PM722608",
                "parDelegation": false
              },
              {
                "acteurRef": "PA719310",
                "mandatRef": "PM722622",
                "parDelegation": false
              },
              {
                "acteurRef": "PA719338",
                "mandatRef": "PM722630",
                "parDelegation": false
              },
              {
                "acteurRef": "PA719372",
                "mandatRef": "PM722640",
                "parDelegation": false
              },
              {
                "acteurRef": "PA719412",
                "mandatRef": "PM722654",
                "parDelegation": false
              },
              {
                "acteurRef": "PA719540",
                "mandatRef": "PM722690",
                "parDelegation": false
              },
              {
                "acteurRef": "PA719550",
                "mandatRef": "PM722694",
                "parDelegation": false
              },
              {
                "acteurRef": "PA719652",
                "mandatRef": "PM722722",
                "parDelegation": false
              },
              {
                "acteurRef": "PA719660",
                "mandatRef": "PM722724",
                "parDelegation": false
              },
              {
                "acteurRef": "PA719728",
                "mandatRef": "PM722744",
                "parDelegation": false
              },
              {
                "acteurRef": "PA719740",
                "mandatRef": "PM722748",
                "parDelegation": false
              },
              {
                "acteurRef": "PA719798",
                "mandatRef": "PM722766",
                "parDelegation": false
              },
              {
                "acteurRef": "PA719814",
                "mandatRef": "PM722770",
                "parDelegation": false
              },
              {
                "acteurRef": "PA719830",
                "mandatRef": "PM722774",
                "parDelegation": false
              },
              {
                "acteurRef": "PA719850",
                "mandatRef": "PM722780",
                "parDelegation": false
              },
              {
                "acteurRef": "PA719858",
                "mandatRef": "PM722782",
                "parDelegation": false
              },
              {
                "acteurRef": "PA719922",
                "mandatRef": "PM722802",
                "parDelegation": false
              },
              {
                "acteurRef": "PA720108",
                "mandatRef": "PM722862",
                "parDelegation": false
              },
              {
                "acteurRef": "PA720318",
                "mandatRef": "PM722928",
                "parDelegation": false
              },
              {
                "acteurRef": "PA720342",
                "mandatRef": "PM722934",
                "parDelegation": false
              },
              {
                "acteurRef": "PA720362",
                "mandatRef": "PM722942",
                "parDelegation": false
              },
              {
                "acteurRef": "PA720560",
                "mandatRef": "PM723000",
                "parDelegation": false
              },
              {
                "acteurRef": "PA720590",
                "mandatRef": "PM723010",
                "parDelegation": false
              },
              {
                "acteurRef": "PA720780",
                "mandatRef": "PM723074",
                "parDelegation": false
              },
              {
                "acteurRef": "PA720854",
                "mandatRef": "PM723096",
                "parDelegation": false
              },
              {
                "acteurRef": "PA721004",
                "mandatRef": "PM723136",
                "parDelegation": false
              },
              {
                "acteurRef": "PA721134",
                "mandatRef": "PM723184",
                "parDelegation": false
              },
              {
                "acteurRef": "PA721218",
                "mandatRef": "PM723206",
                "parDelegation": false
              },
              {
                "acteurRef": "PA721450",
                "mandatRef": "PM723278",
                "parDelegation": false
              },
              {
                "acteurRef": "PA721466",
                "mandatRef": "PM723284",
                "parDelegation": false
              },
              {
                "acteurRef": "PA721542",
                "mandatRef": "PM723308",
                "parDelegation": false
              },
              {
                "acteurRef": "PA721600",
                "mandatRef": "PM723330",
                "parDelegation": false
              },
              {
                "acteurRef": "PA721808",
                "mandatRef": "PM723388",
                "parDelegation": false
              },
              {
                "acteurRef": "PA721916",
                "mandatRef": "PM723420",
                "parDelegation": false
              },
              {
                "acteurRef": "PA722366",
                "mandatRef": "PM723554",
                "parDelegation": false
              },
              {
                "acteurRef": "PA720198",
                "mandatRef": "PM733711",
                "parDelegation": false
              }
            ],
            "abstentions": [
              {
                "acteurRef": "PA720222",
                "mandatRef": "PM722896",
                "parDelegation": false
              },
              {
                "acteurRef": "PA720870",
                "mandatRef": "PM723100",
                "parDelegation": false
              }
            ]
          }
        }
      },
      {
        "organeRef": "PO730934",
        "nombreMembresGroupe": "102",
        "vote": {
          "positionMajoritaire": "pour",
          "decompteVoix": {
            "pour": "13",
            "contre": "0",
            "nonVotants": "0",
            "abstentions": "0",
            "nonVotantsVolontaires": "0"
          },
          "decompteNominatif": {
            "pour": [
              {
                "acteurRef": "PA345722",
                "mandatRef": "PM723428",
                "parDelegation": false
              },
              {
                "acteurRef": "PA606712",
                "mandatRef": "PM722756",
                "parDelegation": false
              },
              {
                "acteurRef": "PA1874",
                "mandatRef": "PM722598",
                "parDelegation": false
              },
              {
                "acteurRef": "PA1695",
                "mandatRef": "PM723322",
                "parDelegation": false
              },
              {
                "acteurRef": "PA720644",
                "mandatRef": "PM723026",
                "parDelegation": false
              },
              {
                "acteurRef": "PA718838",
                "mandatRef": "PM722474",
                "parDelegation": false
              },
              {
                "acteurRef": "PA334149",
                "mandatRef": "PM723034",
                "parDelegation": false
              },
              {
                "acteurRef": "PA336316",
                "mandatRef": "PM723406",
                "parDelegation": false
              },
              {
                "acteurRef": "PA608016",
                "mandatRef": "PM723024",
                "parDelegation": false
              },
              {
                "acteurRef": "PA330909",
                "mandatRef": "PM722548",
                "parDelegation": false
              },
              {
                "acteurRef": "PA266793",
                "mandatRef": "PM722550",
                "parDelegation": false
              },
              {
                "acteurRef": "PA709315",
                "mandatRef": "PM722526",
                "parDelegation": false
              },
              {
                "acteurRef": "PA712015",
                "mandatRef": "PM722448",
                "parDelegation": false
              }
            ]
          }
        }
      },
      {
        "organeRef": "PO730970",
        "nombreMembresGroupe": "47",
        "vote": {
          "positionMajoritaire": "contre",
          "decompteVoix": {
            "pour": "0",
            "contre": "3",
            "nonVotants": "0",
            "abstentions": "0",
            "nonVotantsVolontaires": "0"
          },
          "decompteNominatif": {
            "contre": [
              {
                "acteurRef": "PA720256",
                "mandatRef": "PM722908",
                "parDelegation": false
              },
              {
                "acteurRef": "PA721976",
                "mandatRef": "PM723438",
                "parDelegation": false
              },
              {
                "acteurRef": "PA721984",
                "mandatRef": "PM723440",
                "parDelegation": false
              }
            ]
          }
        }
      },
      {
        "organeRef": "PO744425",
        "nombreMembresGroupe": "32",
        "vote": {
          "positionMajoritaire": "pour",
          "decompteVoix": {
            "pour": "2",
            "contre": "0",
            "nonVotants": "1",
            "abstentions": "0",
            "nonVotantsVolontaires": "0"
          },
          "decompteNominatif": {
            "nonVotants": [
              {
                "acteurRef": "PA267801",
                "mandatRef": "PM723320",
                "causePositionVote": "PSE"
              }
            ],
            "pour": [
              {
                "acteurRef": "PA267355",
                "mandatRef": "PM723524",
                "parDelegation": false
              },
              {
                "acteurRef": "PA332228",
                "mandatRef": "PM722754",
                "parDelegation": false
              }
            ]
          }
        }
      },
      {
        "organeRef": "PO730946",
        "nombreMembresGroupe": "30",
        "vote": {
          "positionMajoritaire": "pour",
          "decompteVoix": {
            "pour": "4",
            "contre": "0",
            "nonVotants": "0",
            "abstentions": "1",
            "nonVotantsVolontaires": "1"
          },
          "decompteNominatif": {
            "pour": [
              {
                "acteurRef": "PA333285",
                "mandatRef": "PM722906",
                "parDelegation": false
              },
              {
                "acteurRef": "PA1592",
                "mandatRef": "PM723060",
                "parDelegation": false
              },
              {
                "acteurRef": "PA342415",
                "mandatRef": "PM722826",
                "parDelegation": false
              },
              {
                "acteurRef": "PA610681",
                "mandatRef": "PM723150",
                "parDelegation": false
              }
            ],
            "abstentions": [
              {
                "acteurRef": "PA607553",
                "mandatRef": "PM722956",
                "parDelegation": false
              }
            ]
          }
        }
      },
      {
        "organeRef": "PO723569",
        "nombreMembresGroupe": "20",
        "vote": {
          "positionMajoritaire": "pour",
          "decompteVoix": {
            "pour": "0",
            "contre": "0",
            "nonVotants": "0",
            "abstentions": "0",
            "nonVotantsVolontaires": "0"
          },
          "decompteNominatif": {}
        }
      },
      {
        "organeRef": "PO730958",
        "nombreMembresGroupe": "17",
        "vote": {
          "positionMajoritaire": "pour",
          "decompteVoix": {
            "pour": "2",
            "contre": "0",
            "nonVotants": "0",
            "abstentions": "0",
            "nonVotantsVolontaires": "0"
          },
          "decompteNominatif": {
            "pour": [
              {
                "acteurRef": "PA719578",
                "mandatRef": "PM722702",
                "parDelegation": false
              },
              {
                "acteurRef": "PA720286",
                "mandatRef": "PM722918",
                "parDelegation": false
              }
            ]
          }
        }
      },
      {
        "organeRef": "PO730940",
        "nombreMembresGroupe": "16",
        "vote": {
          "positionMajoritaire": "pour",
          "decompteVoix": {
            "pour": "1",
            "contre": "0",
            "nonVotants": "0",
            "abstentions": "0",
            "nonVotantsVolontaires": "0"
          },
          "decompteNominatif": {
            "pour": [
              {
                "acteurRef": "PA722202",
                "mandatRef": "PM723502",
                "parDelegation": false
              }
            ]
          }
        }
      }
    ]
  }
}