{
  "uid": "VTANR5L15V1052",
  "numero": "1052",
  "organeRef": "PO717460",
  "legislature": "15",
  "sessionRef": "SCR5A2018O1",
  "seanceRef": "RUANR5L15S2018IDS21169",
  "dateScrutin": "2018-07-17T02:00:00.000+02:00",
  "quantiemeJourSeance": "1",
  "typeVote": {
    "codeTypeVote": "SPO",
    "libelleTypeVote": "scrutin public ordinaire",
    "typeMajorite": "majorité absolue des suffrages exprimés"
  },
  "sort": {
    "code": "rejeté",
    "libelle": "L'Assemblée nationale n'a pas adopté"
  },
  "titre": "l'amendement n° 1431 de Mme Untermaier après l'article premier du projet de loi constitutionnelle pour une démocratie plus représentative, responsable et efficace (première lecture).",
  "demandeur": {
    "texte": "Présidente du groupe \"Nouvelle Gauche\""
  },
  "objet": {
    "libelle": "l'amendement n° 1431 de Mme Untermaier après l'article premier du projet de loi constitutionnelle pour une démocratie plus représentative, responsable et efficace (première lecture)."
  },
  "modePublicationDesVotes": "DecompteNominatif",
  "syntheseVote": {
    "nombreVotants": "180",
    "suffragesExprimes": "178",
    "nbrSuffragesRequis": "90",
    "annonce": "L'Assemblée nationale n'a pas adopté",
    "decompte": {
      "pour": "78",
      "contre": "100",
      "nonVotants": "1",
      "abstentions": "2",
      "nonVotantsVolontaires": "0"
    }
  },
  "ventilationVotes": {
    "organeRef": "PO717460",
    "groupes": [
      {
        "organeRef": "PO730964",
        "nombreMembresGroupe": "312",
        "vote": {
          "positionMajoritaire": "contre",
          "decompteVoix": {
            "pour": "0",
            "contre": "86",
            "nonVotants": "1",
            "abstentions": "1",
            "nonVotantsVolontaires": "1"
          },
          "decompteNominatif": {
            "nonVotants": [
              {
                "acteurRef": "PA332747",
                "mandatRef": "PM722798",
                "causePositionVote": "PSE"
              }
            ],
            "contre": [
              {
                "acteurRef": "PA721262",
                "mandatRef": "PM723218",
                "parDelegation": false
              },
              {
                "acteurRef": "PA2449",
                "mandatRef": "PM723036",
                "parDelegation": false
              },
              {
                "acteurRef": "PA643127",
                "mandatRef": "PM722636",
                "parDelegation": false
              },
              {
                "acteurRef": "PA606171",
                "mandatRef": "PM722632",
                "parDelegation": false
              },
              {
                "acteurRef": "PA609520",
                "mandatRef": "PM723508",
                "parDelegation": false
              },
              {
                "acteurRef": "PA608083",
                "mandatRef": "PM723038",
                "parDelegation": false
              },
              {
                "acteurRef": "PA721880",
                "mandatRef": "PM723410",
                "parDelegation": false
              },
              {
                "acteurRef": "PA722190",
                "mandatRef": "PM723498",
                "parDelegation": false
              },
              {
                "acteurRef": "PA606507",
                "mandatRef": "PM722720",
                "parDelegation": false
              },
              {
                "acteurRef": "PA607193",
                "mandatRef": "PM722846",
                "parDelegation": false
              },
              {
                "acteurRef": "PA607619",
                "mandatRef": "PM722936",
                "parDelegation": false
              },
              {
                "acteurRef": "PA717379",
                "mandatRef": "PM723282",
                "parDelegation": false
              },
              {
                "acteurRef": "PA718728",
                "mandatRef": "PM722438",
                "parDelegation": false
              },
              {
                "acteurRef": "PA718736",
                "mandatRef": "PM722440",
                "parDelegation": false
              },
              {
                "acteurRef": "PA718756",
                "mandatRef": "PM722446",
                "parDelegation": false
              },
              {
                "acteurRef": "PA718794",
                "mandatRef": "PM722460",
                "parDelegation": false
              },
              {
                "acteurRef": "PA718894",
                "mandatRef": "PM722494",
                "parDelegation": false
              },
              {
                "acteurRef": "PA718902",
                "mandatRef": "PM722496",
                "parDelegation": false
              },
              {
                "acteurRef": "PA718918",
                "mandatRef": "PM722500",
                "parDelegation": false
              },
              {
                "acteurRef": "PA719024",
                "mandatRef": "PM722536",
                "parDelegation": false
              },
              {
                "acteurRef": "PA719052",
                "mandatRef": "PM722544",
                "parDelegation": false
              },
              {
                "acteurRef": "PA719072",
                "mandatRef": "PM722552",
                "parDelegation": false
              },
              {
                "acteurRef": "PA719130",
                "mandatRef": "PM722572",
                "parDelegation": false
              },
              {
                "acteurRef": "PA719162",
                "mandatRef": "PM722580",
                "parDelegation": false
              },
              {
                "acteurRef": "PA719186",
                "mandatRef": "PM722588",
                "parDelegation": false
              },
              {
                "acteurRef": "PA719194",
                "mandatRef": "PM722590",
                "parDelegation": false
              },
              {
                "acteurRef": "PA719202",
                "mandatRef": "PM722592",
                "parDelegation": false
              },
              {
                "acteurRef": "PA719230",
                "mandatRef": "PM722600",
                "parDelegation": false
              },
              {
                "acteurRef": "PA719302",
                "mandatRef": "PM722620",
                "parDelegation": false
              },
              {
                "acteurRef": "PA719330",
                "mandatRef": "PM722628",
                "parDelegation": false
              },
              {
                "acteurRef": "PA719512",
                "mandatRef": "PM722682",
                "parDelegation": false
              },
              {
                "acteurRef": "PA719616",
                "mandatRef": "PM722712",
                "parDelegation": false
              },
              {
                "acteurRef": "PA719728",
                "mandatRef": "PM722744",
                "parDelegation": false
              },
              {
                "acteurRef": "PA719770",
                "mandatRef": "PM722758",
                "parDelegation": false
              },
              {
                "acteurRef": "PA719778",
                "mandatRef": "PM722760",
                "parDelegation": false
              },
              {
                "acteurRef": "PA719790",
                "mandatRef": "PM722764",
                "parDelegation": false
              },
              {
                "acteurRef": "PA719814",
                "mandatRef": "PM722770",
                "parDelegation": false
              },
              {
                "acteurRef": "PA719850",
                "mandatRef": "PM722780",
                "parDelegation": false
              },
              {
                "acteurRef": "PA719866",
                "mandatRef": "PM722784",
                "parDelegation": false
              },
              {
                "acteurRef": "PA719890",
                "mandatRef": "PM722790",
                "parDelegation": false
              },
              {
                "acteurRef": "PA719922",
                "mandatRef": "PM722802",
                "parDelegation": false
              },
              {
                "acteurRef": "PA719972",
                "mandatRef": "PM722820",
                "parDelegation": false
              },
              {
                "acteurRef": "PA719980",
                "mandatRef": "PM722822",
                "parDelegation": false
              },
              {
                "acteurRef": "PA720022",
                "mandatRef": "PM722836",
                "parDelegation": false
              },
              {
                "acteurRef": "PA720046",
                "mandatRef": "PM722842",
                "parDelegation": false
              },
              {
                "acteurRef": "PA720108",
                "mandatRef": "PM722862",
                "parDelegation": false
              },
              {
                "acteurRef": "PA720116",
                "mandatRef": "PM722864",
                "parDelegation": false
              },
              {
                "acteurRef": "PA720124",
                "mandatRef": "PM722866",
                "parDelegation": false
              },
              {
                "acteurRef": "PA720138",
                "mandatRef": "PM722872",
                "parDelegation": false
              },
              {
                "acteurRef": "PA720146",
                "mandatRef": "PM722874",
                "parDelegation": false
              },
              {
                "acteurRef": "PA720154",
                "mandatRef": "PM722876",
                "parDelegation": false
              },
              {
                "acteurRef": "PA720190",
                "mandatRef": "PM722886",
                "parDelegation": false
              },
              {
                "acteurRef": "PA720222",
                "mandatRef": "PM722896",
                "parDelegation": false
              },
              {
                "acteurRef": "PA720278",
                "mandatRef": "PM722916",
                "parDelegation": false
              },
              {
                "acteurRef": "PA720318",
                "mandatRef": "PM722928",
                "parDelegation": false
              },
              {
                "acteurRef": "PA720354",
                "mandatRef": "PM722940",
                "parDelegation": false
              },
              {
                "acteurRef": "PA720446",
                "mandatRef": "PM722966",
                "parDelegation": false
              },
              {
                "acteurRef": "PA720454",
                "mandatRef": "PM722968",
                "parDelegation": false
              },
              {
                "acteurRef": "PA720568",
                "mandatRef": "PM723002",
                "parDelegation": false
              },
              {
                "acteurRef": "PA720622",
                "mandatRef": "PM723018",
                "parDelegation": false
              },
              {
                "acteurRef": "PA720754",
                "mandatRef": "PM723066",
                "parDelegation": false
              },
              {
                "acteurRef": "PA720806",
                "mandatRef": "PM723082",
                "parDelegation": false
              },
              {
                "acteurRef": "PA720908",
                "mandatRef": "PM723110",
                "parDelegation": false
              },
              {
                "acteurRef": "PA720944",
                "mandatRef": "PM723120",
                "parDelegation": false
              },
              {
                "acteurRef": "PA721218",
                "mandatRef": "PM723206",
                "parDelegation": false
              },
              {
                "acteurRef": "PA721246",
                "mandatRef": "PM723214",
                "parDelegation": false
              },
              {
                "acteurRef": "PA721364",
                "mandatRef": "PM723250",
                "parDelegation": false
              },
              {
                "acteurRef": "PA721398",
                "mandatRef": "PM723262",
                "parDelegation": false
              },
              {
                "acteurRef": "PA721434",
                "mandatRef": "PM723272",
                "parDelegation": false
              },
              {
                "acteurRef": "PA721670",
                "mandatRef": "PM723350",
                "parDelegation": false
              },
              {
                "acteurRef": "PA721690",
                "mandatRef": "PM723356",
                "parDelegation": false
              },
              {
                "acteurRef": "PA721784",
                "mandatRef": "PM723382",
                "parDelegation": false
              },
              {
                "acteurRef": "PA721908",
                "mandatRef": "PM723418",
                "parDelegation": false
              },
              {
                "acteurRef": "PA721916",
                "mandatRef": "PM723420",
                "parDelegation": false
              },
              {
                "acteurRef": "PA721946",
                "mandatRef": "PM723430",
                "parDelegation": false
              },
              {
                "acteurRef": "PA722134",
                "mandatRef": "PM723482",
                "parDelegation": false
              },
              {
                "acteurRef": "PA722150",
                "mandatRef": "PM723486",
                "parDelegation": false
              },
              {
                "acteurRef": "PA722260",
                "mandatRef": "PM723520",
                "parDelegation": false
              },
              {
                "acteurRef": "PA722292",
                "mandatRef": "PM723530",
                "parDelegation": false
              },
              {
                "acteurRef": "PA722300",
                "mandatRef": "PM723532",
                "parDelegation": false
              },
              {
                "acteurRef": "PA722336",
                "mandatRef": "PM723544",
                "parDelegation": false
              },
              {
                "acteurRef": "PA722366",
                "mandatRef": "PM723554",
                "parDelegation": false
              },
              {
                "acteurRef": "PA719326",
                "mandatRef": "PM733709",
                "parDelegation": false
              },
              {
                "acteurRef": "PA721956",
                "mandatRef": "PM733717",
                "parDelegation": false
              },
              {
                "acteurRef": "PA721876",
                "mandatRef": "PM733719",
                "parDelegation": false
              },
              {
                "acteurRef": "PA721564",
                "mandatRef": "PM733723",
                "parDelegation": false
              }
            ],
            "abstentions": [
              {
                "acteurRef": "PA702054",
                "mandatRef": "PM733713",
                "parDelegation": false
              }
            ]
          }
        }
      },
      {
        "organeRef": "PO730934",
        "nombreMembresGroupe": "103",
        "vote": {
          "positionMajoritaire": "pour",
          "decompteVoix": {
            "pour": "46",
            "contre": "0",
            "nonVotants": "0",
            "abstentions": "0",
            "nonVotantsVolontaires": "0"
          },
          "decompteNominatif": {
            "pour": [
              {
                "acteurRef": "PA345722",
                "mandatRef": "PM723428",
                "parDelegation": false
              },
              {
                "acteurRef": "PA720210",
                "mandatRef": "PM722892",
                "parDelegation": false
              },
              {
                "acteurRef": "PA606712",
                "mandatRef": "PM722756",
                "parDelegation": false
              },
              {
                "acteurRef": "PA330240",
                "mandatRef": "PM722492",
                "parDelegation": false
              },
              {
                "acteurRef": "PA856",
                "mandatRef": "PM723288",
                "parDelegation": false
              },
              {
                "acteurRef": "PA923",
                "mandatRef": "PM722904",
                "parDelegation": false
              },
              {
                "acteurRef": "PA1874",
                "mandatRef": "PM722598",
                "parDelegation": false
              },
              {
                "acteurRef": "PA1695",
                "mandatRef": "PM723322",
                "parDelegation": false
              },
              {
                "acteurRef": "PA2155",
                "mandatRef": "PM722490",
                "parDelegation": false
              },
              {
                "acteurRef": "PA266808",
                "mandatRef": "PM723264",
                "parDelegation": false
              },
              {
                "acteurRef": "PA720586",
                "mandatRef": "PM723008",
                "parDelegation": false
              },
              {
                "acteurRef": "PA606098",
                "mandatRef": "PM722642",
                "parDelegation": false
              },
              {
                "acteurRef": "PA267260",
                "mandatRef": "PM722476",
                "parDelegation": false
              },
              {
                "acteurRef": "PA267324",
                "mandatRef": "PM723292",
                "parDelegation": false
              },
              {
                "acteurRef": "PA718850",
                "mandatRef": "PM722478",
                "parDelegation": false
              },
              {
                "acteurRef": "PA266776",
                "mandatRef": "PM723542",
                "parDelegation": false
              },
              {
                "acteurRef": "PA718838",
                "mandatRef": "PM722474",
                "parDelegation": false
              },
              {
                "acteurRef": "PA721636",
                "mandatRef": "PM723340",
                "parDelegation": false
              },
              {
                "acteurRef": "PA1012",
                "mandatRef": "PM722418",
                "parDelegation": false
              },
              {
                "acteurRef": "PA334149",
                "mandatRef": "PM723034",
                "parDelegation": false
              },
              {
                "acteurRef": "PA332523",
                "mandatRef": "PM722792",
                "parDelegation": false
              },
              {
                "acteurRef": "PA330684",
                "mandatRef": "PM722528",
                "parDelegation": false
              },
              {
                "acteurRef": "PA340853",
                "mandatRef": "PM722534",
                "parDelegation": false
              },
              {
                "acteurRef": "PA605991",
                "mandatRef": "PM722660",
                "parDelegation": false
              },
              {
                "acteurRef": "PA721410",
                "mandatRef": "PM723266",
                "parDelegation": false
              },
              {
                "acteurRef": "PA266774",
                "mandatRef": "PM723526",
                "parDelegation": false
              },
              {
                "acteurRef": "PA607090",
                "mandatRef": "PM722796",
                "parDelegation": false
              },
              {
                "acteurRef": "PA608016",
                "mandatRef": "PM723024",
                "parDelegation": false
              },
              {
                "acteurRef": "PA608416",
                "mandatRef": "PM723540",
                "parDelegation": false
              },
              {
                "acteurRef": "PA267785",
                "mandatRef": "PM723310",
                "parDelegation": false
              },
              {
                "acteurRef": "PA720684",
                "mandatRef": "PM723040",
                "parDelegation": false
              },
              {
                "acteurRef": "PA718784",
                "mandatRef": "PM722456",
                "parDelegation": false
              },
              {
                "acteurRef": "PA719272",
                "mandatRef": "PM722612",
                "parDelegation": false
              },
              {
                "acteurRef": "PA643103",
                "mandatRef": "PM722614",
                "parDelegation": false
              },
              {
                "acteurRef": "PA643134",
                "mandatRef": "PM722824",
                "parDelegation": false
              },
              {
                "acteurRef": "PA720100",
                "mandatRef": "PM722860",
                "parDelegation": false
              },
              {
                "acteurRef": "PA720386",
                "mandatRef": "PM722948",
                "parDelegation": false
              },
              {
                "acteurRef": "PA642847",
                "mandatRef": "PM722954",
                "parDelegation": false
              },
              {
                "acteurRef": "PA720630",
                "mandatRef": "PM723020",
                "parDelegation": false
              },
              {
                "acteurRef": "PA721314",
                "mandatRef": "PM723236",
                "parDelegation": false
              },
              {
                "acteurRef": "PA721506",
                "mandatRef": "PM723296",
                "parDelegation": false
              },
              {
                "acteurRef": "PA721678",
                "mandatRef": "PM723352",
                "parDelegation": false
              },
              {
                "acteurRef": "PA722390",
                "mandatRef": "PM723560",
                "parDelegation": false
              },
              {
                "acteurRef": "PA266793",
                "mandatRef": "PM722550",
                "parDelegation": false
              },
              {
                "acteurRef": "PA748954",
                "mandatRef": "PM748958",
                "parDelegation": false
              },
              {
                "acteurRef": "PA643089",
                "mandatRef": "PM758076",
                "parDelegation": false
              }
            ]
          }
        }
      },
      {
        "organeRef": "PO730970",
        "nombreMembresGroupe": "46",
        "vote": {
          "positionMajoritaire": "contre",
          "decompteVoix": {
            "pour": "0",
            "contre": "13",
            "nonVotants": "0",
            "abstentions": "1",
            "nonVotantsVolontaires": "1"
          },
          "decompteNominatif": {
            "contre": [
              {
                "acteurRef": "PA721418",
                "mandatRef": "PM723268",
                "parDelegation": false
              },
              {
                "acteurRef": "PA719504",
                "mandatRef": "PM722680",
                "parDelegation": false
              },
              {
                "acteurRef": "PA719558",
                "mandatRef": "PM722696",
                "parDelegation": false
              },
              {
                "acteurRef": "PA719874",
                "mandatRef": "PM722786",
                "parDelegation": false
              },
              {
                "acteurRef": "PA719938",
                "mandatRef": "PM722806",
                "parDelegation": false
              },
              {
                "acteurRef": "PA720256",
                "mandatRef": "PM722908",
                "parDelegation": false
              },
              {
                "acteurRef": "PA720652",
                "mandatRef": "PM723028",
                "parDelegation": false
              },
              {
                "acteurRef": "PA720746",
                "mandatRef": "PM723064",
                "parDelegation": false
              },
              {
                "acteurRef": "PA720772",
                "mandatRef": "PM723072",
                "parDelegation": false
              },
              {
                "acteurRef": "PA721742",
                "mandatRef": "PM723370",
                "parDelegation": false
              },
              {
                "acteurRef": "PA721976",
                "mandatRef": "PM723438",
                "parDelegation": false
              },
              {
                "acteurRef": "PA721992",
                "mandatRef": "PM723442",
                "parDelegation": false
              },
              {
                "acteurRef": "PA722284",
                "mandatRef": "PM723528",
                "parDelegation": false
              }
            ],
            "abstentions": [
              {
                "acteurRef": "PA720326",
                "mandatRef": "PM722930",
                "parDelegation": false
              }
            ]
          }
        }
      },
      {
        "organeRef": "PO744425",
        "nombreMembresGroupe": "31",
        "vote": {
          "positionMajoritaire": "pour",
          "decompteVoix": {
            "pour": "6",
            "contre": "1",
            "nonVotants": "0",
            "abstentions": "0",
            "nonVotantsVolontaires": "0"
          },
          "decompteNominatif": {
            "pour": [
              {
                "acteurRef": "PA268019",
                "mandatRef": "PM723092",
                "parDelegation": false
              },
              {
                "acteurRef": "PA267585",
                "mandatRef": "PM722978",
                "parDelegation": false
              },
              {
                "acteurRef": "PA642868",
                "mandatRef": "PM722992",
                "parDelegation": false
              },
              {
                "acteurRef": "PA721110",
                "mandatRef": "PM723174",
                "parDelegation": false
              },
              {
                "acteurRef": "PA642935",
                "mandatRef": "PM723238",
                "parDelegation": false
              },
              {
                "acteurRef": "PA702052",
                "mandatRef": "PM723172",
                "parDelegation": false
              }
            ],
            "contre": [
              {
                "acteurRef": "PA942",
                "mandatRef": "PM722900",
                "parDelegation": false
              }
            ]
          }
        }
      },
      {
        "organeRef": "PO730946",
        "nombreMembresGroupe": "30",
        "vote": {
          "positionMajoritaire": "pour",
          "decompteVoix": {
            "pour": "11",
            "contre": "0",
            "nonVotants": "0",
            "abstentions": "0",
            "nonVotantsVolontaires": "0"
          },
          "decompteNominatif": {
            "pour": [
              {
                "acteurRef": "PA508",
                "mandatRef": "PM722736",
                "parDelegation": false
              },
              {
                "acteurRef": "PA333285",
                "mandatRef": "PM722906",
                "parDelegation": false
              },
              {
                "acteurRef": "PA340343",
                "mandatRef": "PM722470",
                "parDelegation": false
              },
              {
                "acteurRef": "PA1592",
                "mandatRef": "PM723060",
                "parDelegation": false
              },
              {
                "acteurRef": "PA605069",
                "mandatRef": "PM722424",
                "parDelegation": false
              },
              {
                "acteurRef": "PA337483",
                "mandatRef": "PM723140",
                "parDelegation": false
              },
              {
                "acteurRef": "PA342415",
                "mandatRef": "PM722826",
                "parDelegation": false
              },
              {
                "acteurRef": "PA608695",
                "mandatRef": "PM723564",
                "parDelegation": false
              },
              {
                "acteurRef": "PA608011",
                "mandatRef": "PM723022",
                "parDelegation": false
              },
              {
                "acteurRef": "PA1008",
                "mandatRef": "PM722704",
                "parDelegation": false
              },
              {
                "acteurRef": "PA643145",
                "mandatRef": "PM723130",
                "parDelegation": false
              }
            ]
          }
        }
      },
      {
        "organeRef": "PO723569",
        "nombreMembresGroupe": "21",
        "vote": {
          "positionMajoritaire": "pour",
          "decompteVoix": {
            "pour": "5",
            "contre": "0",
            "nonVotants": "0",
            "abstentions": "0",
            "nonVotantsVolontaires": "0"
          },
          "decompteNominatif": {
            "pour": [
              {
                "acteurRef": "PA336175",
                "mandatRef": "PM723328",
                "parDelegation": false
              },
              {
                "acteurRef": "PA608292",
                "mandatRef": "PM723076",
                "parDelegation": false
              },
              {
                "acteurRef": "PA719138",
                "mandatRef": "PM722574",
                "parDelegation": false
              },
              {
                "acteurRef": "PA719146",
                "mandatRef": "PM722576",
                "parDelegation": false
              },
              {
                "acteurRef": "PA719608",
                "mandatRef": "PM722710",
                "parDelegation": false
              }
            ]
          }
        }
      },
      {
        "organeRef": "PO730958",
        "nombreMembresGroupe": "17",
        "vote": {
          "positionMajoritaire": "pour",
          "decompteVoix": {
            "pour": "4",
            "contre": "0",
            "nonVotants": "0",
            "abstentions": "0",
            "nonVotantsVolontaires": "0"
          },
          "decompteNominatif": {
            "pour": [
              {
                "acteurRef": "PA2150",
                "mandatRef": "PM722506",
                "parDelegation": false
              },
              {
                "acteurRef": "PA720286",
                "mandatRef": "PM722918",
                "parDelegation": false
              },
              {
                "acteurRef": "PA720422",
                "mandatRef": "PM722960",
                "parDelegation": false
              },
              {
                "acteurRef": "PA721202",
                "mandatRef": "PM723202",
                "parDelegation": false
              }
            ]
          }
        }
      },
      {
        "organeRef": "PO730940",
        "nombreMembresGroupe": "16",
        "vote": {
          "positionMajoritaire": "pour",
          "decompteVoix": {
            "pour": "6",
            "contre": "0",
            "nonVotants": "0",
            "abstentions": "0",
            "nonVotantsVolontaires": "0"
          },
          "decompteNominatif": {
            "pour": [
              {
                "acteurRef": "PA722202",
                "mandatRef": "PM723502",
                "parDelegation": false
              },
              {
                "acteurRef": "PA718926",
                "mandatRef": "PM722502",
                "parDelegation": false
              },
              {
                "acteurRef": "PA610667",
                "mandatRef": "PM723146",
                "parDelegation": false
              },
              {
                "acteurRef": "PA718720",
                "mandatRef": "PM722436",
                "parDelegation": false
              },
              {
                "acteurRef": "PA721118",
                "mandatRef": "PM723176",
                "parDelegation": false
              },
              {
                "acteurRef": "PA722110",
                "mandatRef": "PM723474",
                "parDelegation": false
              }
            ]
          }
        }
      }
    ]
  }
}