{
  "uid": "VTANR5L15V1954",
  "numero": "1954",
  "organeRef": "PO717460",
  "legislature": "15",
  "sessionRef": "SCR5A2019O1",
  "seanceRef": "RUANR5L15S2019IDS21703",
  "dateScrutin": "2019-06-14T02:00:00.000+02:00",
  "quantiemeJourSeance": "3",
  "typeVote": {
    "codeTypeVote": "SPO",
    "libelleTypeVote": "scrutin public ordinaire",
    "typeMajorite": "majorité absolue des suffrages exprimés"
  },
  "sort": {
    "code": "adopté",
    "libelle": "l'Assemblée nationale a adopté"
  },
  "titre": "l'article 39 du projet de loi d'orientation des mobilités (première lecture).",
  "demandeur": {
    "texte": "Président du groupe \"La République en Marche\""
  },
  "objet": {
    "libelle": "l'article 39 du projet de loi d'orientation des mobilités (première lecture)."
  },
  "modePublicationDesVotes": "DecompteNominatif",
  "syntheseVote": {
    "nombreVotants": "37",
    "suffragesExprimes": "35",
    "nbrSuffragesRequis": "18",
    "annonce": "l'Assemblée nationale a adopté",
    "decompte": {
      "pour": "33",
      "contre": "2",
      "nonVotants": "2",
      "abstentions": "2",
      "nonVotantsVolontaires": "0"
    }
  },
  "ventilationVotes": {
    "organeRef": "PO717460",
    "groupes": [
      {
        "organeRef": "PO730964",
        "nombreMembresGroupe": "305",
        "vote": {
          "positionMajoritaire": "pour",
          "decompteVoix": {
            "pour": "25",
            "contre": "0",
            "nonVotants": "2",
            "abstentions": "0",
            "nonVotantsVolontaires": "0"
          },
          "decompteNominatif": {
            "nonVotants": [
              {
                "acteurRef": "PA606171",
                "mandatRef": "PM722632",
                "causePositionVote": "PAN"
              },
              {
                "acteurRef": "PA721824",
                "mandatRef": "PM723394",
                "causePositionVote": "PSE"
              }
            ],
            "pour": [
              {
                "acteurRef": "PA609520",
                "mandatRef": "PM723508",
                "parDelegation": false
              },
              {
                "acteurRef": "PA721296",
                "mandatRef": "PM723228",
                "parDelegation": false
              },
              {
                "acteurRef": "PA718962",
                "mandatRef": "PM722514",
                "parDelegation": false
              },
              {
                "acteurRef": "PA719080",
                "mandatRef": "PM722554",
                "parDelegation": false
              },
              {
                "acteurRef": "PA719194",
                "mandatRef": "PM722590",
                "parDelegation": false
              },
              {
                "acteurRef": "PA719372",
                "mandatRef": "PM722640",
                "parDelegation": false
              },
              {
                "acteurRef": "PA719624",
                "mandatRef": "PM722714",
                "parDelegation": false
              },
              {
                "acteurRef": "PA719632",
                "mandatRef": "PM722716",
                "parDelegation": false
              },
              {
                "acteurRef": "PA719740",
                "mandatRef": "PM722748",
                "parDelegation": false
              },
              {
                "acteurRef": "PA719798",
                "mandatRef": "PM722766",
                "parDelegation": false
              },
              {
                "acteurRef": "PA720222",
                "mandatRef": "PM722896",
                "parDelegation": false
              },
              {
                "acteurRef": "PA720242",
                "mandatRef": "PM722902",
                "parDelegation": false
              },
              {
                "acteurRef": "PA720944",
                "mandatRef": "PM723120",
                "parDelegation": false
              },
              {
                "acteurRef": "PA721142",
                "mandatRef": "PM723186",
                "parDelegation": false
              },
              {
                "acteurRef": "PA721218",
                "mandatRef": "PM723206",
                "parDelegation": false
              },
              {
                "acteurRef": "PA721372",
                "mandatRef": "PM723252",
                "parDelegation": false
              },
              {
                "acteurRef": "PA721426",
                "mandatRef": "PM723270",
                "parDelegation": false
              },
              {
                "acteurRef": "PA721450",
                "mandatRef": "PM723278",
                "parDelegation": false
              },
              {
                "acteurRef": "PA721600",
                "mandatRef": "PM723330",
                "parDelegation": false
              },
              {
                "acteurRef": "PA721916",
                "mandatRef": "PM723420",
                "parDelegation": false
              },
              {
                "acteurRef": "PA722000",
                "mandatRef": "PM723444",
                "parDelegation": false
              },
              {
                "acteurRef": "PA722022",
                "mandatRef": "PM723452",
                "parDelegation": false
              },
              {
                "acteurRef": "PA722236",
                "mandatRef": "PM723514",
                "parDelegation": false
              },
              {
                "acteurRef": "PA722366",
                "mandatRef": "PM723554",
                "parDelegation": false
              },
              {
                "acteurRef": "PA722194",
                "mandatRef": "PM760311",
                "parDelegation": false
              }
            ]
          }
        }
      },
      {
        "organeRef": "PO730934",
        "nombreMembresGroupe": "104",
        "vote": {
          "positionMajoritaire": "pour",
          "decompteVoix": {
            "pour": "1",
            "contre": "0",
            "nonVotants": "0",
            "abstentions": "1",
            "nonVotantsVolontaires": "1"
          },
          "decompteNominatif": {
            "pour": [
              {
                "acteurRef": "PA609245",
                "mandatRef": "PM723318",
                "parDelegation": false
              }
            ],
            "abstentions": [
              {
                "acteurRef": "PA267204",
                "mandatRef": "PM722794",
                "parDelegation": false
              }
            ]
          }
        }
      },
      {
        "organeRef": "PO730970",
        "nombreMembresGroupe": "46",
        "vote": {
          "positionMajoritaire": "pour",
          "decompteVoix": {
            "pour": "5",
            "contre": "0",
            "nonVotants": "0",
            "abstentions": "0",
            "nonVotantsVolontaires": "0"
          },
          "decompteNominatif": {
            "pour": [
              {
                "acteurRef": "PA721734",
                "mandatRef": "PM723368",
                "parDelegation": false
              },
              {
                "acteurRef": "PA718978",
                "mandatRef": "PM722520",
                "parDelegation": false
              },
              {
                "acteurRef": "PA721530",
                "mandatRef": "PM723302",
                "parDelegation": false
              },
              {
                "acteurRef": "PA721976",
                "mandatRef": "PM723438",
                "parDelegation": false
              },
              {
                "acteurRef": "PA722284",
                "mandatRef": "PM723528",
                "parDelegation": false
              }
            ]
          }
        }
      },
      {
        "organeRef": "PO758835",
        "nombreMembresGroupe": "29",
        "vote": {
          "positionMajoritaire": "abstention",
          "decompteVoix": {
            "pour": "0",
            "contre": "0",
            "nonVotants": "0",
            "abstentions": "1",
            "nonVotantsVolontaires": "1"
          },
          "decompteNominatif": {
            "abstentions": [
              {
                "acteurRef": "PA720988",
                "mandatRef": "PM723132",
                "parDelegation": false
              }
            ]
          }
        }
      },
      {
        "organeRef": "PO765636",
        "nombreMembresGroupe": "28",
        "vote": {
          "positionMajoritaire": "pour",
          "decompteVoix": {
            "pour": "1",
            "contre": "0",
            "nonVotants": "0",
            "abstentions": "0",
            "nonVotantsVolontaires": "0"
          },
          "decompteNominatif": {
            "pour": [
              {
                "acteurRef": "PA719806",
                "mandatRef": "PM722768",
                "parDelegation": false
              }
            ]
          }
        }
      },
      {
        "organeRef": "PO759900",
        "nombreMembresGroupe": "18",
        "vote": {
          "positionMajoritaire": "pour",
          "decompteVoix": {
            "pour": "1",
            "contre": "0",
            "nonVotants": "0",
            "abstentions": "0",
            "nonVotantsVolontaires": "0"
          },
          "decompteNominatif": {
            "pour": [
              {
                "acteurRef": "PA333421",
                "mandatRef": "PM722920",
                "parDelegation": false
              }
            ]
          }
        }
      },
      {
        "organeRef": "PO730958",
        "nombreMembresGroupe": "17",
        "vote": {
          "positionMajoritaire": "pour",
          "decompteVoix": {
            "pour": "0",
            "contre": "0",
            "nonVotants": "0",
            "abstentions": "0",
            "nonVotantsVolontaires": "0"
          },
          "decompteNominatif": {}
        }
      },
      {
        "organeRef": "PO730940",
        "nombreMembresGroupe": "16",
        "vote": {
          "positionMajoritaire": "contre",
          "decompteVoix": {
            "pour": "0",
            "contre": "1",
            "nonVotants": "0",
            "abstentions": "0",
            "nonVotantsVolontaires": "0"
          },
          "decompteNominatif": {
            "contre": [
              {
                "acteurRef": "PA335612",
                "mandatRef": "PM723506",
                "parDelegation": false
              }
            ]
          }
        }
      },
      {
        "organeRef": "PO723569",
        "nombreMembresGroupe": "14",
        "vote": {
          "positionMajoritaire": "contre",
          "decompteVoix": {
            "pour": "0",
            "contre": "1",
            "nonVotants": "0",
            "abstentions": "0",
            "nonVotantsVolontaires": "0"
          },
          "decompteNominatif": {
            "contre": [
              {
                "acteurRef": "PA335999",
                "mandatRef": "PM723480",
                "parDelegation": false
              }
            ]
          }
        }
      }
    ]
  }
}