{
  "uid": "VTANR5L15V1518",
  "numero": "1518",
  "organeRef": "PO717460",
  "legislature": "15",
  "sessionRef": "SCR5A2019O1",
  "seanceRef": "RUANR5L15S2019IDS21409",
  "dateScrutin": "2018-12-03T01:00:00.000+01:00",
  "quantiemeJourSeance": "1",
  "typeVote": {
    "codeTypeVote": "SPO",
    "libelleTypeVote": "scrutin public ordinaire",
    "typeMajorite": "majorité absolue des suffrages exprimés"
  },
  "sort": {
    "code": "rejeté",
    "libelle": "L'Assemblée nationale n'a pas adopté"
  },
  "titre": "la motion de renvoi en commission, déposée par M. André Chassaigne, du projet de loi de financement de la sécurité sociale pour 2019 (lecture définitive).",
  "demandeur": {
    "texte": "Président du groupe \"de la Gauche démocrate et républicaine\""
  },
  "objet": {
    "libelle": "la motion de renvoi en commission, déposée par M. André Chassaigne, du projet de loi de financement de la sécurité sociale pour 2019 (lecture définitive)."
  },
  "modePublicationDesVotes": "DecompteNominatif",
  "syntheseVote": {
    "nombreVotants": "85",
    "suffragesExprimes": "83",
    "nbrSuffragesRequis": "42",
    "annonce": "L'Assemblée nationale n'a pas adopté",
    "decompte": {
      "pour": "35",
      "contre": "48",
      "nonVotants": "1",
      "abstentions": "2",
      "nonVotantsVolontaires": "0"
    }
  },
  "ventilationVotes": {
    "organeRef": "PO717460",
    "groupes": [
      {
        "organeRef": "PO730964",
        "nombreMembresGroupe": "309",
        "vote": {
          "positionMajoritaire": "contre",
          "decompteVoix": {
            "pour": "0",
            "contre": "46",
            "nonVotants": "1",
            "abstentions": "0",
            "nonVotantsVolontaires": "0"
          },
          "decompteNominatif": {
            "nonVotants": [
              {
                "acteurRef": "PA606171",
                "mandatRef": "PM722632",
                "causePositionVote": "PSE"
              }
            ],
            "contre": [
              {
                "acteurRef": "PA643127",
                "mandatRef": "PM722636",
                "parDelegation": false
              },
              {
                "acteurRef": "PA721880",
                "mandatRef": "PM723410",
                "parDelegation": false
              },
              {
                "acteurRef": "PA718768",
                "mandatRef": "PM722450",
                "parDelegation": false
              },
              {
                "acteurRef": "PA721296",
                "mandatRef": "PM723228",
                "parDelegation": false
              },
              {
                "acteurRef": "PA718694",
                "mandatRef": "PM722426",
                "parDelegation": false
              },
              {
                "acteurRef": "PA718736",
                "mandatRef": "PM722440",
                "parDelegation": false
              },
              {
                "acteurRef": "PA718894",
                "mandatRef": "PM722494",
                "parDelegation": false
              },
              {
                "acteurRef": "PA719072",
                "mandatRef": "PM722552",
                "parDelegation": false
              },
              {
                "acteurRef": "PA719202",
                "mandatRef": "PM722592",
                "parDelegation": false
              },
              {
                "acteurRef": "PA719294",
                "mandatRef": "PM722618",
                "parDelegation": false
              },
              {
                "acteurRef": "PA719330",
                "mandatRef": "PM722628",
                "parDelegation": false
              },
              {
                "acteurRef": "PA719512",
                "mandatRef": "PM722682",
                "parDelegation": false
              },
              {
                "acteurRef": "PA719710",
                "mandatRef": "PM722738",
                "parDelegation": false
              },
              {
                "acteurRef": "PA719756",
                "mandatRef": "PM722752",
                "parDelegation": false
              },
              {
                "acteurRef": "PA719770",
                "mandatRef": "PM722758",
                "parDelegation": false
              },
              {
                "acteurRef": "PA719830",
                "mandatRef": "PM722774",
                "parDelegation": false
              },
              {
                "acteurRef": "PA719866",
                "mandatRef": "PM722784",
                "parDelegation": false
              },
              {
                "acteurRef": "PA719980",
                "mandatRef": "PM722822",
                "parDelegation": false
              },
              {
                "acteurRef": "PA719994",
                "mandatRef": "PM722828",
                "parDelegation": false
              },
              {
                "acteurRef": "PA720154",
                "mandatRef": "PM722876",
                "parDelegation": false
              },
              {
                "acteurRef": "PA720242",
                "mandatRef": "PM722902",
                "parDelegation": false
              },
              {
                "acteurRef": "PA720268",
                "mandatRef": "PM722912",
                "parDelegation": false
              },
              {
                "acteurRef": "PA720446",
                "mandatRef": "PM722966",
                "parDelegation": false
              },
              {
                "acteurRef": "PA720454",
                "mandatRef": "PM722968",
                "parDelegation": false
              },
              {
                "acteurRef": "PA720512",
                "mandatRef": "PM722986",
                "parDelegation": false
              },
              {
                "acteurRef": "PA720622",
                "mandatRef": "PM723018",
                "parDelegation": false
              },
              {
                "acteurRef": "PA720870",
                "mandatRef": "PM723100",
                "parDelegation": false
              },
              {
                "acteurRef": "PA720916",
                "mandatRef": "PM723112",
                "parDelegation": false
              },
              {
                "acteurRef": "PA721024",
                "mandatRef": "PM723144",
                "parDelegation": false
              },
              {
                "acteurRef": "PA721246",
                "mandatRef": "PM723214",
                "parDelegation": false
              },
              {
                "acteurRef": "PA721426",
                "mandatRef": "PM723270",
                "parDelegation": false
              },
              {
                "acteurRef": "PA721466",
                "mandatRef": "PM723284",
                "parDelegation": false
              },
              {
                "acteurRef": "PA721616",
                "mandatRef": "PM723334",
                "parDelegation": false
              },
              {
                "acteurRef": "PA721624",
                "mandatRef": "PM723336",
                "parDelegation": false
              },
              {
                "acteurRef": "PA721644",
                "mandatRef": "PM723342",
                "parDelegation": false
              },
              {
                "acteurRef": "PA721670",
                "mandatRef": "PM723350",
                "parDelegation": false
              },
              {
                "acteurRef": "PA721702",
                "mandatRef": "PM723360",
                "parDelegation": false
              },
              {
                "acteurRef": "PA721776",
                "mandatRef": "PM723380",
                "parDelegation": false
              },
              {
                "acteurRef": "PA721844",
                "mandatRef": "PM723400",
                "parDelegation": false
              },
              {
                "acteurRef": "PA721888",
                "mandatRef": "PM723412",
                "parDelegation": false
              },
              {
                "acteurRef": "PA722008",
                "mandatRef": "PM723446",
                "parDelegation": false
              },
              {
                "acteurRef": "PA722046",
                "mandatRef": "PM723458",
                "parDelegation": false
              },
              {
                "acteurRef": "PA722086",
                "mandatRef": "PM723468",
                "parDelegation": false
              },
              {
                "acteurRef": "PA722094",
                "mandatRef": "PM723470",
                "parDelegation": false
              },
              {
                "acteurRef": "PA642788",
                "mandatRef": "PM722746",
                "parDelegation": false
              },
              {
                "acteurRef": "PA642695",
                "mandatRef": "PM722602",
                "parDelegation": false
              }
            ]
          }
        }
      },
      {
        "organeRef": "PO730934",
        "nombreMembresGroupe": "104",
        "vote": {
          "positionMajoritaire": "pour",
          "decompteVoix": {
            "pour": "12",
            "contre": "0",
            "nonVotants": "0",
            "abstentions": "0",
            "nonVotantsVolontaires": "0"
          },
          "decompteNominatif": {
            "pour": [
              {
                "acteurRef": "PA345722",
                "mandatRef": "PM723428",
                "parDelegation": false
              },
              {
                "acteurRef": "PA606712",
                "mandatRef": "PM722756",
                "parDelegation": false
              },
              {
                "acteurRef": "PA330240",
                "mandatRef": "PM722492",
                "parDelegation": false
              },
              {
                "acteurRef": "PA1874",
                "mandatRef": "PM722598",
                "parDelegation": false
              },
              {
                "acteurRef": "PA267289",
                "mandatRef": "PM754301",
                "parDelegation": false
              },
              {
                "acteurRef": "PA267527",
                "mandatRef": "PM723274",
                "parDelegation": false
              },
              {
                "acteurRef": "PA720684",
                "mandatRef": "PM723040",
                "parDelegation": false
              },
              {
                "acteurRef": "PA718784",
                "mandatRef": "PM722456",
                "parDelegation": false
              },
              {
                "acteurRef": "PA720100",
                "mandatRef": "PM722860",
                "parDelegation": false
              },
              {
                "acteurRef": "PA721506",
                "mandatRef": "PM723296",
                "parDelegation": false
              },
              {
                "acteurRef": "PA346218",
                "mandatRef": "PM723348",
                "parDelegation": false
              },
              {
                "acteurRef": "PA748954",
                "mandatRef": "PM748958",
                "parDelegation": false
              }
            ]
          }
        }
      },
      {
        "organeRef": "PO730970",
        "nombreMembresGroupe": "46",
        "vote": {
          "positionMajoritaire": "contre",
          "decompteVoix": {
            "pour": "1",
            "contre": "2",
            "nonVotants": "0",
            "abstentions": "0",
            "nonVotantsVolontaires": "0"
          },
          "decompteNominatif": {
            "pour": [
              {
                "acteurRef": "PA721992",
                "mandatRef": "PM723442",
                "parDelegation": false
              }
            ],
            "contre": [
              {
                "acteurRef": "PA721734",
                "mandatRef": "PM723368",
                "parDelegation": false
              },
              {
                "acteurRef": "PA721924",
                "mandatRef": "PM723422",
                "parDelegation": false
              }
            ]
          }
        }
      },
      {
        "organeRef": "PO758835",
        "nombreMembresGroupe": "29",
        "vote": {
          "positionMajoritaire": "pour",
          "decompteVoix": {
            "pour": "5",
            "contre": "0",
            "nonVotants": "0",
            "abstentions": "0",
            "nonVotantsVolontaires": "0"
          },
          "decompteNominatif": {
            "pour": [
              {
                "acteurRef": "PA1592",
                "mandatRef": "PM723060",
                "parDelegation": false
              },
              {
                "acteurRef": "PA609590",
                "mandatRef": "PM723326",
                "parDelegation": false
              },
              {
                "acteurRef": "PA719930",
                "mandatRef": "PM722804",
                "parDelegation": false
              },
              {
                "acteurRef": "PA608741",
                "mandatRef": "PM757984",
                "parDelegation": false
              },
              {
                "acteurRef": "PA642764",
                "mandatRef": "PM753836",
                "parDelegation": false
              }
            ]
          }
        }
      },
      {
        "organeRef": "PO744425",
        "nombreMembresGroupe": "28",
        "vote": {
          "positionMajoritaire": "abstention",
          "decompteVoix": {
            "pour": "1",
            "contre": "0",
            "nonVotants": "0",
            "abstentions": "2",
            "nonVotantsVolontaires": "2"
          },
          "decompteNominatif": {
            "pour": [
              {
                "acteurRef": "PA267585",
                "mandatRef": "PM722978",
                "parDelegation": false
              }
            ],
            "abstentions": [
              {
                "acteurRef": "PA2952",
                "mandatRef": "PM722480",
                "parDelegation": false
              },
              {
                "acteurRef": "PA267780",
                "mandatRef": "PM723504",
                "parDelegation": false
              }
            ]
          }
        }
      },
      {
        "organeRef": "PO730958",
        "nombreMembresGroupe": "17",
        "vote": {
          "positionMajoritaire": "pour",
          "decompteVoix": {
            "pour": "10",
            "contre": "0",
            "nonVotants": "0",
            "abstentions": "0",
            "nonVotantsVolontaires": "0"
          },
          "decompteNominatif": {
            "pour": [
              {
                "acteurRef": "PA588884",
                "mandatRef": "PM723226",
                "parDelegation": false
              },
              {
                "acteurRef": "PA718860",
                "mandatRef": "PM722482",
                "parDelegation": false
              },
              {
                "acteurRef": "PA718868",
                "mandatRef": "PM722484",
                "parDelegation": false
              },
              {
                "acteurRef": "PA2150",
                "mandatRef": "PM722506",
                "parDelegation": false
              },
              {
                "acteurRef": "PA720286",
                "mandatRef": "PM722918",
                "parDelegation": false
              },
              {
                "acteurRef": "PA720430",
                "mandatRef": "PM722962",
                "parDelegation": false
              },
              {
                "acteurRef": "PA721202",
                "mandatRef": "PM723202",
                "parDelegation": false
              },
              {
                "acteurRef": "PA721210",
                "mandatRef": "PM723204",
                "parDelegation": false
              },
              {
                "acteurRef": "PA721226",
                "mandatRef": "PM723208",
                "parDelegation": false
              },
              {
                "acteurRef": "PA721960",
                "mandatRef": "PM723434",
                "parDelegation": false
              }
            ]
          }
        }
      },
      {
        "organeRef": "PO730940",
        "nombreMembresGroupe": "16",
        "vote": {
          "positionMajoritaire": "pour",
          "decompteVoix": {
            "pour": "3",
            "contre": "0",
            "nonVotants": "0",
            "abstentions": "0",
            "nonVotantsVolontaires": "0"
          },
          "decompteNominatif": {
            "pour": [
              {
                "acteurRef": "PA718926",
                "mandatRef": "PM722502",
                "parDelegation": false
              },
              {
                "acteurRef": "PA718720",
                "mandatRef": "PM722436",
                "parDelegation": false
              },
              {
                "acteurRef": "PA721270",
                "mandatRef": "PM723220",
                "parDelegation": false
              }
            ]
          }
        }
      },
      {
        "organeRef": "PO759900",
        "nombreMembresGroupe": "16",
        "vote": {
          "positionMajoritaire": "pour",
          "decompteVoix": {
            "pour": "2",
            "contre": "0",
            "nonVotants": "0",
            "abstentions": "0",
            "nonVotantsVolontaires": "0"
          },
          "decompteNominatif": {
            "pour": [
              {
                "acteurRef": "PA336175",
                "mandatRef": "PM723328",
                "parDelegation": false
              },
              {
                "acteurRef": "PA405480",
                "mandatRef": "PM723118",
                "parDelegation": false
              }
            ]
          }
        }
      },
      {
        "organeRef": "PO723569",
        "nombreMembresGroupe": "12",
        "vote": {
          "positionMajoritaire": "pour",
          "decompteVoix": {
            "pour": "1",
            "contre": "0",
            "nonVotants": "0",
            "abstentions": "0",
            "nonVotantsVolontaires": "0"
          },
          "decompteNominatif": {
            "pour": [
              {
                "acteurRef": "PA720468",
                "mandatRef": "PM722972",
                "parDelegation": false
              }
            ]
          }
        }
      }
    ]
  }
}