{
  "uid": "VTANR5L15V1412",
  "numero": "1412",
  "organeRef": "PO717460",
  "legislature": "15",
  "sessionRef": "SCR5A2019O1",
  "seanceRef": "RUANR5L15S2019IDS21342",
  "dateScrutin": "2018-11-15T01:00:00.000+01:00",
  "quantiemeJourSeance": "2",
  "typeVote": {
    "codeTypeVote": "SPO",
    "libelleTypeVote": "scrutin public ordinaire",
    "typeMajorite": "majorité absolue des suffrages exprimés"
  },
  "sort": {
    "code": "rejeté",
    "libelle": "L'Assemblée nationale n'a pas adopté"
  },
  "titre": "l'amendement de suppression n° 23 de M. Jean-Pierre Vigier et les amendements identiques suivants à l'article 52 de la seconde partie du projet de loi de finances pour 2019 (première lecture).",
  "demandeur": {
    "texte": "Président du groupe \"Les Républicains\"Président du groupe \"de la Gauche démocrate et républicaine\""
  },
  "objet": {
    "libelle": "l'amendement de suppression n° 23 de M. Jean-Pierre Vigier et les amendements identiques suivants à l'article 52 de la seconde partie du projet de loi de finances pour 2019 (première lecture)."
  },
  "modePublicationDesVotes": "DecompteNominatif",
  "syntheseVote": {
    "nombreVotants": "60",
    "suffragesExprimes": "60",
    "nbrSuffragesRequis": "31",
    "annonce": "L'Assemblée nationale n'a pas adopté",
    "decompte": {
      "pour": "15",
      "contre": "45",
      "nonVotants": "2",
      "abstentions": "0",
      "nonVotantsVolontaires": "0"
    }
  },
  "ventilationVotes": {
    "organeRef": "PO717460",
    "groupes": [
      {
        "organeRef": "PO730964",
        "nombreMembresGroupe": "308",
        "vote": {
          "positionMajoritaire": "contre",
          "decompteVoix": {
            "pour": "0",
            "contre": "39",
            "nonVotants": "2",
            "abstentions": "0",
            "nonVotantsVolontaires": "0"
          },
          "decompteNominatif": {
            "nonVotants": [
              {
                "acteurRef": "PA606171",
                "mandatRef": "PM722632",
                "causePositionVote": "PAN"
              },
              {
                "acteurRef": "PA720622",
                "mandatRef": "PM723018",
                "causePositionVote": "PSE"
              }
            ],
            "contre": [
              {
                "acteurRef": "PA267336",
                "mandatRef": "PM722434",
                "parDelegation": false
              },
              {
                "acteurRef": "PA605963",
                "mandatRef": "PM722584",
                "parDelegation": false
              },
              {
                "acteurRef": "PA607595",
                "mandatRef": "PM722924",
                "parDelegation": false
              },
              {
                "acteurRef": "PA718736",
                "mandatRef": "PM722440",
                "parDelegation": false
              },
              {
                "acteurRef": "PA718756",
                "mandatRef": "PM722446",
                "parDelegation": false
              },
              {
                "acteurRef": "PA718954",
                "mandatRef": "PM722512",
                "parDelegation": false
              },
              {
                "acteurRef": "PA719100",
                "mandatRef": "PM722562",
                "parDelegation": false
              },
              {
                "acteurRef": "PA719108",
                "mandatRef": "PM722564",
                "parDelegation": false
              },
              {
                "acteurRef": "PA719230",
                "mandatRef": "PM722600",
                "parDelegation": false
              },
              {
                "acteurRef": "PA719250",
                "mandatRef": "PM722606",
                "parDelegation": false
              },
              {
                "acteurRef": "PA719330",
                "mandatRef": "PM722628",
                "parDelegation": false
              },
              {
                "acteurRef": "PA719456",
                "mandatRef": "PM722668",
                "parDelegation": false
              },
              {
                "acteurRef": "PA719550",
                "mandatRef": "PM722694",
                "parDelegation": false
              },
              {
                "acteurRef": "PA719778",
                "mandatRef": "PM722760",
                "parDelegation": false
              },
              {
                "acteurRef": "PA719798",
                "mandatRef": "PM722766",
                "parDelegation": false
              },
              {
                "acteurRef": "PA719850",
                "mandatRef": "PM722780",
                "parDelegation": false
              },
              {
                "acteurRef": "PA719890",
                "mandatRef": "PM722790",
                "parDelegation": false
              },
              {
                "acteurRef": "PA720022",
                "mandatRef": "PM722836",
                "parDelegation": false
              },
              {
                "acteurRef": "PA720074",
                "mandatRef": "PM722850",
                "parDelegation": false
              },
              {
                "acteurRef": "PA720138",
                "mandatRef": "PM722872",
                "parDelegation": false
              },
              {
                "acteurRef": "PA720146",
                "mandatRef": "PM722874",
                "parDelegation": false
              },
              {
                "acteurRef": "PA720222",
                "mandatRef": "PM722896",
                "parDelegation": false
              },
              {
                "acteurRef": "PA720268",
                "mandatRef": "PM722912",
                "parDelegation": false
              },
              {
                "acteurRef": "PA720298",
                "mandatRef": "PM722922",
                "parDelegation": false
              },
              {
                "acteurRef": "PA720318",
                "mandatRef": "PM722928",
                "parDelegation": false
              },
              {
                "acteurRef": "PA720560",
                "mandatRef": "PM723000",
                "parDelegation": false
              },
              {
                "acteurRef": "PA720854",
                "mandatRef": "PM723096",
                "parDelegation": false
              },
              {
                "acteurRef": "PA721150",
                "mandatRef": "PM723188",
                "parDelegation": false
              },
              {
                "acteurRef": "PA721434",
                "mandatRef": "PM723272",
                "parDelegation": false
              },
              {
                "acteurRef": "PA721542",
                "mandatRef": "PM723308",
                "parDelegation": true
              },
              {
                "acteurRef": "PA721568",
                "mandatRef": "PM723316",
                "parDelegation": false
              },
              {
                "acteurRef": "PA721670",
                "mandatRef": "PM723350",
                "parDelegation": false
              },
              {
                "acteurRef": "PA721702",
                "mandatRef": "PM723360",
                "parDelegation": false
              },
              {
                "acteurRef": "PA721764",
                "mandatRef": "PM723376",
                "parDelegation": false
              },
              {
                "acteurRef": "PA721916",
                "mandatRef": "PM723420",
                "parDelegation": false
              },
              {
                "acteurRef": "PA721946",
                "mandatRef": "PM723430",
                "parDelegation": false
              },
              {
                "acteurRef": "PA722382",
                "mandatRef": "PM723558",
                "parDelegation": false
              },
              {
                "acteurRef": "PA642695",
                "mandatRef": "PM722602",
                "parDelegation": false
              },
              {
                "acteurRef": "PA721956",
                "mandatRef": "PM733717",
                "parDelegation": false
              }
            ]
          }
        }
      },
      {
        "organeRef": "PO730934",
        "nombreMembresGroupe": "104",
        "vote": {
          "positionMajoritaire": "pour",
          "decompteVoix": {
            "pour": "10",
            "contre": "0",
            "nonVotants": "0",
            "abstentions": "0",
            "nonVotantsVolontaires": "0"
          },
          "decompteNominatif": {
            "pour": [
              {
                "acteurRef": "PA1874",
                "mandatRef": "PM722598",
                "parDelegation": false
              },
              {
                "acteurRef": "PA2155",
                "mandatRef": "PM722490",
                "parDelegation": false
              },
              {
                "acteurRef": "PA2960",
                "mandatRef": "PM723006",
                "parDelegation": false
              },
              {
                "acteurRef": "PA332523",
                "mandatRef": "PM722792",
                "parDelegation": false
              },
              {
                "acteurRef": "PA608016",
                "mandatRef": "PM723024",
                "parDelegation": false
              },
              {
                "acteurRef": "PA609245",
                "mandatRef": "PM723318",
                "parDelegation": false
              },
              {
                "acteurRef": "PA642847",
                "mandatRef": "PM722954",
                "parDelegation": false
              },
              {
                "acteurRef": "PA721506",
                "mandatRef": "PM723296",
                "parDelegation": false
              },
              {
                "acteurRef": "PA330909",
                "mandatRef": "PM722548",
                "parDelegation": false
              },
              {
                "acteurRef": "PA712015",
                "mandatRef": "PM722448",
                "parDelegation": false
              }
            ]
          }
        }
      },
      {
        "organeRef": "PO730970",
        "nombreMembresGroupe": "46",
        "vote": {
          "positionMajoritaire": "contre",
          "decompteVoix": {
            "pour": "1",
            "contre": "4",
            "nonVotants": "0",
            "abstentions": "0",
            "nonVotantsVolontaires": "0"
          },
          "decompteNominatif": {
            "pour": [
              {
                "acteurRef": "PA719266",
                "mandatRef": "PM722610",
                "parDelegation": false
              }
            ],
            "contre": [
              {
                "acteurRef": "PA721734",
                "mandatRef": "PM723368",
                "parDelegation": false
              },
              {
                "acteurRef": "PA718978",
                "mandatRef": "PM722520",
                "parDelegation": false
              },
              {
                "acteurRef": "PA720728",
                "mandatRef": "PM723058",
                "parDelegation": false
              },
              {
                "acteurRef": "PA721976",
                "mandatRef": "PM723438",
                "parDelegation": false
              }
            ]
          }
        }
      },
      {
        "organeRef": "PO758835",
        "nombreMembresGroupe": "29",
        "vote": {
          "positionMajoritaire": "contre",
          "decompteVoix": {
            "pour": "0",
            "contre": "1",
            "nonVotants": "0",
            "abstentions": "0",
            "nonVotantsVolontaires": "0"
          },
          "decompteNominatif": {
            "contre": [
              {
                "acteurRef": "PA608172",
                "mandatRef": "PM723048",
                "parDelegation": false
              }
            ]
          }
        }
      },
      {
        "organeRef": "PO744425",
        "nombreMembresGroupe": "28",
        "vote": {
          "positionMajoritaire": "contre",
          "decompteVoix": {
            "pour": "0",
            "contre": "1",
            "nonVotants": "0",
            "abstentions": "0",
            "nonVotantsVolontaires": "0"
          },
          "decompteNominatif": {
            "contre": [
              {
                "acteurRef": "PA720230",
                "mandatRef": "PM722898",
                "parDelegation": false
              }
            ]
          }
        }
      },
      {
        "organeRef": "PO730958",
        "nombreMembresGroupe": "17",
        "vote": {
          "positionMajoritaire": "pour",
          "decompteVoix": {
            "pour": "1",
            "contre": "0",
            "nonVotants": "0",
            "abstentions": "0",
            "nonVotantsVolontaires": "0"
          },
          "decompteNominatif": {
            "pour": [
              {
                "acteurRef": "PA721202",
                "mandatRef": "PM723202",
                "parDelegation": false
              }
            ]
          }
        }
      },
      {
        "organeRef": "PO730940",
        "nombreMembresGroupe": "16",
        "vote": {
          "positionMajoritaire": "pour",
          "decompteVoix": {
            "pour": "0",
            "contre": "0",
            "nonVotants": "0",
            "abstentions": "0",
            "nonVotantsVolontaires": "0"
          },
          "decompteNominatif": {}
        }
      },
      {
        "organeRef": "PO759900",
        "nombreMembresGroupe": "16",
        "vote": {
          "positionMajoritaire": "pour",
          "decompteVoix": {
            "pour": "2",
            "contre": "0",
            "nonVotants": "0",
            "abstentions": "0",
            "nonVotantsVolontaires": "0"
          },
          "decompteNominatif": {
            "pour": [
              {
                "acteurRef": "PA942",
                "mandatRef": "PM722900",
                "parDelegation": false
              },
              {
                "acteurRef": "PA405480",
                "mandatRef": "PM723118",
                "parDelegation": false
              }
            ]
          }
        }
      },
      {
        "organeRef": "PO723569",
        "nombreMembresGroupe": "12",
        "vote": {
          "positionMajoritaire": "pour",
          "decompteVoix": {
            "pour": "1",
            "contre": "0",
            "nonVotants": "0",
            "abstentions": "0",
            "nonVotantsVolontaires": "0"
          },
          "decompteNominatif": {
            "pour": [
              {
                "acteurRef": "PA719608",
                "mandatRef": "PM722710",
                "parDelegation": false
              }
            ]
          }
        }
      }
    ]
  }
}