{
  "uid": "VTANR5L15V1850",
  "numero": "1850",
  "organeRef": "PO717460",
  "legislature": "15",
  "sessionRef": "SCR5A2019O1",
  "seanceRef": "RUANR5L15S2019IDS21613",
  "dateScrutin": "2019-05-07T02:00:00.000+02:00",
  "quantiemeJourSeance": "1",
  "typeVote": {
    "codeTypeVote": "SPO",
    "libelleTypeVote": "scrutin public ordinaire",
    "typeMajorite": "majorité absolue des suffrages exprimés"
  },
  "sort": {
    "code": "adopté",
    "libelle": "l'Assemblée nationale a adopté"
  },
  "titre": "l'ensemble de la proposition de loi visant à renforcer l'accompagnement des jeunes majeurs vulnérables vers l'autonomie (première lecture).",
  "demandeur": {
    "texte": "Président du groupe \"La République en Marche\"\rPrésident du groupe \"La France insoumise\""
  },
  "objet": {
    "libelle": "l'ensemble de la proposition de loi visant à renforcer l'accompagnement des jeunes majeurs vulnérables vers l'autonomie (première lecture)."
  },
  "modePublicationDesVotes": "DecompteNominatif",
  "syntheseVote": {
    "nombreVotants": "49",
    "suffragesExprimes": "48",
    "nbrSuffragesRequis": "25",
    "annonce": "l'Assemblée nationale a adopté",
    "decompte": {
      "pour": "42",
      "contre": "6",
      "nonVotants": "2",
      "abstentions": "1",
      "nonVotantsVolontaires": "0"
    }
  },
  "ventilationVotes": {
    "organeRef": "PO717460",
    "groupes": [
      {
        "organeRef": "PO730964",
        "nombreMembresGroupe": "306",
        "vote": {
          "positionMajoritaire": "pour",
          "decompteVoix": {
            "pour": "36",
            "contre": "0",
            "nonVotants": "2",
            "abstentions": "0",
            "nonVotantsVolontaires": "0"
          },
          "decompteNominatif": {
            "nonVotants": [
              {
                "acteurRef": "PA606171",
                "mandatRef": "PM722632",
                "causePositionVote": "PAN"
              },
              {
                "acteurRef": "PA721824",
                "mandatRef": "PM723394",
                "causePositionVote": "PSE"
              }
            ],
            "pour": [
              {
                "acteurRef": "PA608083",
                "mandatRef": "PM723038",
                "parDelegation": false
              },
              {
                "acteurRef": "PA343493",
                "mandatRef": "PM722938",
                "parDelegation": false
              },
              {
                "acteurRef": "PA717379",
                "mandatRef": "PM723282",
                "parDelegation": false
              },
              {
                "acteurRef": "PA718694",
                "mandatRef": "PM722426",
                "parDelegation": false
              },
              {
                "acteurRef": "PA718744",
                "mandatRef": "PM722442",
                "parDelegation": false
              },
              {
                "acteurRef": "PA718810",
                "mandatRef": "PM722464",
                "parDelegation": false
              },
              {
                "acteurRef": "PA719024",
                "mandatRef": "PM722536",
                "parDelegation": false
              },
              {
                "acteurRef": "PA719162",
                "mandatRef": "PM722580",
                "parDelegation": false
              },
              {
                "acteurRef": "PA719170",
                "mandatRef": "PM722582",
                "parDelegation": false
              },
              {
                "acteurRef": "PA719218",
                "mandatRef": "PM722596",
                "parDelegation": false
              },
              {
                "acteurRef": "PA719294",
                "mandatRef": "PM722618",
                "parDelegation": false
              },
              {
                "acteurRef": "PA719456",
                "mandatRef": "PM722668",
                "parDelegation": false
              },
              {
                "acteurRef": "PA719472",
                "mandatRef": "PM722672",
                "parDelegation": false
              },
              {
                "acteurRef": "PA719616",
                "mandatRef": "PM722712",
                "parDelegation": false
              },
              {
                "acteurRef": "PA719652",
                "mandatRef": "PM722722",
                "parDelegation": false
              },
              {
                "acteurRef": "PA719756",
                "mandatRef": "PM722752",
                "parDelegation": false
              },
              {
                "acteurRef": "PA719858",
                "mandatRef": "PM722782",
                "parDelegation": false
              },
              {
                "acteurRef": "PA719980",
                "mandatRef": "PM722822",
                "parDelegation": false
              },
              {
                "acteurRef": "PA720154",
                "mandatRef": "PM722876",
                "parDelegation": false
              },
              {
                "acteurRef": "PA720480",
                "mandatRef": "PM722976",
                "parDelegation": false
              },
              {
                "acteurRef": "PA720512",
                "mandatRef": "PM722986",
                "parDelegation": false
              },
              {
                "acteurRef": "PA720560",
                "mandatRef": "PM723000",
                "parDelegation": false
              },
              {
                "acteurRef": "PA720916",
                "mandatRef": "PM723112",
                "parDelegation": false
              },
              {
                "acteurRef": "PA720932",
                "mandatRef": "PM723116",
                "parDelegation": false
              },
              {
                "acteurRef": "PA721246",
                "mandatRef": "PM723214",
                "parDelegation": false
              },
              {
                "acteurRef": "PA721434",
                "mandatRef": "PM723272",
                "parDelegation": false
              },
              {
                "acteurRef": "PA721710",
                "mandatRef": "PM723362",
                "parDelegation": false
              },
              {
                "acteurRef": "PA721776",
                "mandatRef": "PM723380",
                "parDelegation": false
              },
              {
                "acteurRef": "PA722000",
                "mandatRef": "PM723444",
                "parDelegation": false
              },
              {
                "acteurRef": "PA722046",
                "mandatRef": "PM723458",
                "parDelegation": false
              },
              {
                "acteurRef": "PA722054",
                "mandatRef": "PM723460",
                "parDelegation": false
              },
              {
                "acteurRef": "PA722126",
                "mandatRef": "PM723478",
                "parDelegation": false
              },
              {
                "acteurRef": "PA722268",
                "mandatRef": "PM723522",
                "parDelegation": false
              },
              {
                "acteurRef": "PA719326",
                "mandatRef": "PM733709",
                "parDelegation": false
              },
              {
                "acteurRef": "PA722194",
                "mandatRef": "PM760311",
                "parDelegation": false
              },
              {
                "acteurRef": "PA722090",
                "mandatRef": "PM762941",
                "parDelegation": false
              }
            ]
          }
        }
      },
      {
        "organeRef": "PO730934",
        "nombreMembresGroupe": "104",
        "vote": {
          "positionMajoritaire": "abstention",
          "decompteVoix": {
            "pour": "0",
            "contre": "0",
            "nonVotants": "0",
            "abstentions": "1",
            "nonVotantsVolontaires": "1"
          },
          "decompteNominatif": {
            "abstentions": [
              {
                "acteurRef": "PA721286",
                "mandatRef": "PM723224",
                "parDelegation": false
              }
            ]
          }
        }
      },
      {
        "organeRef": "PO730970",
        "nombreMembresGroupe": "46",
        "vote": {
          "positionMajoritaire": "pour",
          "decompteVoix": {
            "pour": "4",
            "contre": "0",
            "nonVotants": "0",
            "abstentions": "0",
            "nonVotantsVolontaires": "0"
          },
          "decompteNominatif": {
            "pour": [
              {
                "acteurRef": "PA719640",
                "mandatRef": "PM722718",
                "parDelegation": false
              },
              {
                "acteurRef": "PA720924",
                "mandatRef": "PM723114",
                "parDelegation": false
              },
              {
                "acteurRef": "PA720968",
                "mandatRef": "PM723126",
                "parDelegation": false
              },
              {
                "acteurRef": "PA721924",
                "mandatRef": "PM723422",
                "parDelegation": false
              }
            ]
          }
        }
      },
      {
        "organeRef": "PO744425",
        "nombreMembresGroupe": "29",
        "vote": {
          "positionMajoritaire": "pour",
          "decompteVoix": {
            "pour": "1",
            "contre": "0",
            "nonVotants": "0",
            "abstentions": "0",
            "nonVotantsVolontaires": "0"
          },
          "decompteNominatif": {
            "pour": [
              {
                "acteurRef": "PA721110",
                "mandatRef": "PM723174",
                "parDelegation": false
              }
            ]
          }
        }
      },
      {
        "organeRef": "PO758835",
        "nombreMembresGroupe": "29",
        "vote": {
          "positionMajoritaire": "contre",
          "decompteVoix": {
            "pour": "0",
            "contre": "3",
            "nonVotants": "0",
            "abstentions": "0",
            "nonVotantsVolontaires": "0"
          },
          "decompteNominatif": {
            "contre": [
              {
                "acteurRef": "PA1198",
                "mandatRef": "PM722532",
                "parDelegation": false
              },
              {
                "acteurRef": "PA508",
                "mandatRef": "PM722736",
                "parDelegation": false
              },
              {
                "acteurRef": "PA608011",
                "mandatRef": "PM723022",
                "parDelegation": false
              }
            ]
          }
        }
      },
      {
        "organeRef": "PO730958",
        "nombreMembresGroupe": "17",
        "vote": {
          "positionMajoritaire": "contre",
          "decompteVoix": {
            "pour": "0",
            "contre": "2",
            "nonVotants": "0",
            "abstentions": "0",
            "nonVotantsVolontaires": "0"
          },
          "decompteNominatif": {
            "contre": [
              {
                "acteurRef": "PA720892",
                "mandatRef": "PM723106",
                "parDelegation": false
              },
              {
                "acteurRef": "PA721960",
                "mandatRef": "PM723434",
                "parDelegation": false
              }
            ]
          }
        }
      },
      {
        "organeRef": "PO730940",
        "nombreMembresGroupe": "16",
        "vote": {
          "positionMajoritaire": "contre",
          "decompteVoix": {
            "pour": "0",
            "contre": "1",
            "nonVotants": "0",
            "abstentions": "0",
            "nonVotantsVolontaires": "0"
          },
          "decompteNominatif": {
            "contre": [
              {
                "acteurRef": "PA721896",
                "mandatRef": "PM723414",
                "parDelegation": false
              }
            ]
          }
        }
      },
      {
        "organeRef": "PO759900",
        "nombreMembresGroupe": "16",
        "vote": {
          "positionMajoritaire": "pour",
          "decompteVoix": {
            "pour": "1",
            "contre": "0",
            "nonVotants": "0",
            "abstentions": "0",
            "nonVotantsVolontaires": "0"
          },
          "decompteNominatif": {
            "pour": [
              {
                "acteurRef": "PA267042",
                "mandatRef": "PM722910",
                "parDelegation": false
              }
            ]
          }
        }
      },
      {
        "organeRef": "PO723569",
        "nombreMembresGroupe": "14",
        "vote": {
          "positionMajoritaire": "pour",
          "decompteVoix": {
            "pour": "0",
            "contre": "0",
            "nonVotants": "0",
            "abstentions": "0",
            "nonVotantsVolontaires": "0"
          },
          "decompteNominatif": {}
        }
      }
    ]
  }
}