{
  "uid": "VTANR5L15V219",
  "numero": "219",
  "organeRef": "PO717460",
  "legislature": "15",
  "sessionRef": "SCR5A2018O1",
  "seanceRef": "RUANR5L15S2018IDS20733",
  "dateScrutin": "2017-11-02T01:00:00.000+01:00",
  "quantiemeJourSeance": "3",
  "typeVote": {
    "codeTypeVote": "SPO",
    "libelleTypeVote": "scrutin public ordinaire",
    "typeMajorite": "majorité absolue des suffrages exprimés"
  },
  "sort": {
    "code": "rejeté",
    "libelle": "L'Assemblée nationale n'a pas adopté"
  },
  "titre": "l'amendement n? 346 de M. Ruffin a l'article 29 et Etat B de la seconde partie du projet de loi de finances pour 2018 (premiere lecture) - Mission cohesion des territoires",
  "demandeur": {
    "texte": "President du groupe \"Nouvelle Gauche\""
  },
  "objet": {
    "libelle": "l'amendement n? 346 de M. Ruffin a l'article 29 et Etat B de la seconde partie du projet de loi de finances pour 2018 (premiere lecture) - Mission cohesion des territoires"
  },
  "modePublicationDesVotes": "DecompteNominatif",
  "syntheseVote": {
    "nombreVotants": "104",
    "suffragesExprimes": "99",
    "nbrSuffragesRequis": "50",
    "annonce": "L'Assemblée nationale n'a pas adopté",
    "decompte": {
      "pour": "18",
      "contre": "81",
      "nonVotants": "2",
      "abstentions": "5",
      "nonVotantsVolontaires": "0"
    }
  },
  "ventilationVotes": {
    "organeRef": "PO717460",
    "groupes": [
      {
        "organeRef": "PO730964",
        "nombreMembresGroupe": "313",
        "vote": {
          "positionMajoritaire": "contre",
          "decompteVoix": {
            "pour": "1",
            "contre": "72",
            "nonVotants": "2",
            "abstentions": "0",
            "nonVotantsVolontaires": "0"
          },
          "decompteNominatif": {
            "nonVotants": [
              {
                "acteurRef": "PA332747",
                "mandatRef": "PM722798",
                "causePositionVote": "PAN"
              },
              {
                "acteurRef": "PA722150",
                "mandatRef": "PM723486",
                "causePositionVote": "PSE"
              }
            ],
            "pour": [
              {
                "acteurRef": "PA721194",
                "mandatRef": "PM723200",
                "parDelegation": false
              }
            ],
            "contre": [
              {
                "acteurRef": "PA721262",
                "mandatRef": "PM723218",
                "parDelegation": false
              },
              {
                "acteurRef": "PA722398",
                "mandatRef": "PM723562",
                "parDelegation": false
              },
              {
                "acteurRef": "PA719952",
                "mandatRef": "PM722814",
                "parDelegation": false
              },
              {
                "acteurRef": "PA609520",
                "mandatRef": "PM723508",
                "parDelegation": false
              },
              {
                "acteurRef": "PA721880",
                "mandatRef": "PM723410",
                "parDelegation": false
              },
              {
                "acteurRef": "PA334116",
                "mandatRef": "PM723030",
                "parDelegation": false
              },
              {
                "acteurRef": "PA605963",
                "mandatRef": "PM722584",
                "parDelegation": false
              },
              {
                "acteurRef": "PA606675",
                "mandatRef": "PM722742",
                "parDelegation": false
              },
              {
                "acteurRef": "PA719520",
                "mandatRef": "PM722684",
                "parDelegation": false
              },
              {
                "acteurRef": "PA718694",
                "mandatRef": "PM722426",
                "parDelegation": false
              },
              {
                "acteurRef": "PA718794",
                "mandatRef": "PM722460",
                "parDelegation": false
              },
              {
                "acteurRef": "PA718918",
                "mandatRef": "PM722500",
                "parDelegation": false
              },
              {
                "acteurRef": "PA718962",
                "mandatRef": "PM722514",
                "parDelegation": false
              },
              {
                "acteurRef": "PA719060",
                "mandatRef": "PM722546",
                "parDelegation": false
              },
              {
                "acteurRef": "PA719072",
                "mandatRef": "PM722552",
                "parDelegation": false
              },
              {
                "acteurRef": "PA719080",
                "mandatRef": "PM722554",
                "parDelegation": false
              },
              {
                "acteurRef": "PA719100",
                "mandatRef": "PM722562",
                "parDelegation": false
              },
              {
                "acteurRef": "PA719130",
                "mandatRef": "PM722572",
                "parDelegation": false
              },
              {
                "acteurRef": "PA719162",
                "mandatRef": "PM722580",
                "parDelegation": false
              },
              {
                "acteurRef": "PA719186",
                "mandatRef": "PM722588",
                "parDelegation": false
              },
              {
                "acteurRef": "PA719230",
                "mandatRef": "PM722600",
                "parDelegation": false
              },
              {
                "acteurRef": "PA719310",
                "mandatRef": "PM722622",
                "parDelegation": false
              },
              {
                "acteurRef": "PA719388",
                "mandatRef": "PM722648",
                "parDelegation": false
              },
              {
                "acteurRef": "PA719440",
                "mandatRef": "PM722664",
                "parDelegation": false
              },
              {
                "acteurRef": "PA719456",
                "mandatRef": "PM722668",
                "parDelegation": false
              },
              {
                "acteurRef": "PA719472",
                "mandatRef": "PM722672",
                "parDelegation": false
              },
              {
                "acteurRef": "PA719512",
                "mandatRef": "PM722682",
                "parDelegation": false
              },
              {
                "acteurRef": "PA719550",
                "mandatRef": "PM722694",
                "parDelegation": false
              },
              {
                "acteurRef": "PA719660",
                "mandatRef": "PM722724",
                "parDelegation": false
              },
              {
                "acteurRef": "PA719684",
                "mandatRef": "PM722730",
                "parDelegation": false
              },
              {
                "acteurRef": "PA719710",
                "mandatRef": "PM722738",
                "parDelegation": false
              },
              {
                "acteurRef": "PA719718",
                "mandatRef": "PM722740",
                "parDelegation": false
              },
              {
                "acteurRef": "PA719728",
                "mandatRef": "PM722744",
                "parDelegation": false
              },
              {
                "acteurRef": "PA719770",
                "mandatRef": "PM722758",
                "parDelegation": false
              },
              {
                "acteurRef": "PA719778",
                "mandatRef": "PM722760",
                "parDelegation": false
              },
              {
                "acteurRef": "PA719798",
                "mandatRef": "PM722766",
                "parDelegation": false
              },
              {
                "acteurRef": "PA719814",
                "mandatRef": "PM722770",
                "parDelegation": false
              },
              {
                "acteurRef": "PA719842",
                "mandatRef": "PM722778",
                "parDelegation": false
              },
              {
                "acteurRef": "PA719850",
                "mandatRef": "PM722780",
                "parDelegation": false
              },
              {
                "acteurRef": "PA719972",
                "mandatRef": "PM722820",
                "parDelegation": false
              },
              {
                "acteurRef": "PA719994",
                "mandatRef": "PM722828",
                "parDelegation": false
              },
              {
                "acteurRef": "PA720022",
                "mandatRef": "PM722836",
                "parDelegation": false
              },
              {
                "acteurRef": "PA720030",
                "mandatRef": "PM722838",
                "parDelegation": false
              },
              {
                "acteurRef": "PA720066",
                "mandatRef": "PM722848",
                "parDelegation": false
              },
              {
                "acteurRef": "PA720170",
                "mandatRef": "PM722880",
                "parDelegation": false
              },
              {
                "acteurRef": "PA720268",
                "mandatRef": "PM722912",
                "parDelegation": false
              },
              {
                "acteurRef": "PA720414",
                "mandatRef": "PM722958",
                "parDelegation": false
              },
              {
                "acteurRef": "PA720500",
                "mandatRef": "PM722982",
                "parDelegation": false
              },
              {
                "acteurRef": "PA720552",
                "mandatRef": "PM722998",
                "parDelegation": false
              },
              {
                "acteurRef": "PA720754",
                "mandatRef": "PM723066",
                "parDelegation": false
              },
              {
                "acteurRef": "PA720806",
                "mandatRef": "PM723082",
                "parDelegation": false
              },
              {
                "acteurRef": "PA720830",
                "mandatRef": "PM723088",
                "parDelegation": false
              },
              {
                "acteurRef": "PA721278",
                "mandatRef": "PM723222",
                "parDelegation": false
              },
              {
                "acteurRef": "PA721328",
                "mandatRef": "PM723240",
                "parDelegation": false
              },
              {
                "acteurRef": "PA721426",
                "mandatRef": "PM723270",
                "parDelegation": false
              },
              {
                "acteurRef": "PA721466",
                "mandatRef": "PM723284",
                "parDelegation": false
              },
              {
                "acteurRef": "PA721498",
                "mandatRef": "PM723294",
                "parDelegation": false
              },
              {
                "acteurRef": "PA721542",
                "mandatRef": "PM723308",
                "parDelegation": false
              },
              {
                "acteurRef": "PA721568",
                "mandatRef": "PM723316",
                "parDelegation": false
              },
              {
                "acteurRef": "PA721600",
                "mandatRef": "PM723330",
                "parDelegation": false
              },
              {
                "acteurRef": "PA721670",
                "mandatRef": "PM723350",
                "parDelegation": false
              },
              {
                "acteurRef": "PA721690",
                "mandatRef": "PM723356",
                "parDelegation": false
              },
              {
                "acteurRef": "PA721710",
                "mandatRef": "PM723362",
                "parDelegation": false
              },
              {
                "acteurRef": "PA721718",
                "mandatRef": "PM723364",
                "parDelegation": false
              },
              {
                "acteurRef": "PA721808",
                "mandatRef": "PM723388",
                "parDelegation": false
              },
              {
                "acteurRef": "PA722070",
                "mandatRef": "PM723464",
                "parDelegation": false
              },
              {
                "acteurRef": "PA722094",
                "mandatRef": "PM723470",
                "parDelegation": false
              },
              {
                "acteurRef": "PA722228",
                "mandatRef": "PM723512",
                "parDelegation": false
              },
              {
                "acteurRef": "PA722336",
                "mandatRef": "PM723544",
                "parDelegation": false
              },
              {
                "acteurRef": "PA642695",
                "mandatRef": "PM722602",
                "parDelegation": false
              },
              {
                "acteurRef": "PA718706",
                "mandatRef": "PM733715",
                "parDelegation": false
              },
              {
                "acteurRef": "PA721564",
                "mandatRef": "PM733723",
                "parDelegation": false
              }
            ]
          }
        }
      },
      {
        "organeRef": "PO730934",
        "nombreMembresGroupe": "100",
        "vote": {
          "positionMajoritaire": "abstention",
          "decompteVoix": {
            "pour": "1",
            "contre": "1",
            "nonVotants": "0",
            "abstentions": "2",
            "nonVotantsVolontaires": "2"
          },
          "decompteNominatif": {
            "pour": [
              {
                "acteurRef": "PA330008",
                "mandatRef": "PM722416",
                "parDelegation": false
              }
            ],
            "contre": [
              {
                "acteurRef": "PA606712",
                "mandatRef": "PM722756",
                "parDelegation": false
              }
            ],
            "abstentions": [
              {
                "acteurRef": "PA346218",
                "mandatRef": "PM723348",
                "parDelegation": false
              },
              {
                "acteurRef": "PA330909",
                "mandatRef": "PM722548",
                "parDelegation": false
              }
            ]
          }
        }
      },
      {
        "organeRef": "PO730970",
        "nombreMembresGroupe": "47",
        "vote": {
          "positionMajoritaire": "contre",
          "decompteVoix": {
            "pour": "0",
            "contre": "5",
            "nonVotants": "0",
            "abstentions": "0",
            "nonVotantsVolontaires": "0"
          },
          "decompteNominatif": {
            "contre": [
              {
                "acteurRef": "PA718978",
                "mandatRef": "PM722520",
                "parDelegation": false
              },
              {
                "acteurRef": "PA719044",
                "mandatRef": "PM722542",
                "parDelegation": false
              },
              {
                "acteurRef": "PA719938",
                "mandatRef": "PM722806",
                "parDelegation": false
              },
              {
                "acteurRef": "PA721182",
                "mandatRef": "PM723196",
                "parDelegation": false
              },
              {
                "acteurRef": "PA721836",
                "mandatRef": "PM723398",
                "parDelegation": false
              }
            ]
          }
        }
      },
      {
        "organeRef": "PO730952",
        "nombreMembresGroupe": "35",
        "vote": {
          "positionMajoritaire": "contre",
          "decompteVoix": {
            "pour": "0",
            "contre": "3",
            "nonVotants": "0",
            "abstentions": "0",
            "nonVotantsVolontaires": "0"
          },
          "decompteNominatif": {
            "contre": [
              {
                "acteurRef": "PA720230",
                "mandatRef": "PM722898",
                "parDelegation": false
              },
              {
                "acteurRef": "PA267766",
                "mandatRef": "PM722970",
                "parDelegation": false
              },
              {
                "acteurRef": "PA642868",
                "mandatRef": "PM722992",
                "parDelegation": false
              }
            ]
          }
        }
      },
      {
        "organeRef": "PO730946",
        "nombreMembresGroupe": "31",
        "vote": {
          "positionMajoritaire": "pour",
          "decompteVoix": {
            "pour": "5",
            "contre": "0",
            "nonVotants": "0",
            "abstentions": "0",
            "nonVotantsVolontaires": "0"
          },
          "decompteNominatif": {
            "pour": [
              {
                "acteurRef": "PA605069",
                "mandatRef": "PM722424",
                "parDelegation": false
              },
              {
                "acteurRef": "PA335054",
                "mandatRef": "PM723254",
                "parDelegation": false
              },
              {
                "acteurRef": "PA337483",
                "mandatRef": "PM723140",
                "parDelegation": false
              },
              {
                "acteurRef": "PA405480",
                "mandatRef": "PM723118",
                "parDelegation": false
              },
              {
                "acteurRef": "PA609590",
                "mandatRef": "PM723326",
                "parDelegation": false
              }
            ]
          }
        }
      },
      {
        "organeRef": "PO723569",
        "nombreMembresGroupe": "18",
        "vote": {
          "positionMajoritaire": "abstention",
          "decompteVoix": {
            "pour": "2",
            "contre": "0",
            "nonVotants": "0",
            "abstentions": "3",
            "nonVotantsVolontaires": "3"
          },
          "decompteNominatif": {
            "pour": [
              {
                "acteurRef": "PA336175",
                "mandatRef": "PM723328",
                "parDelegation": false
              },
              {
                "acteurRef": "PA719146",
                "mandatRef": "PM722576",
                "parDelegation": false
              }
            ],
            "abstentions": [
              {
                "acteurRef": "PA720468",
                "mandatRef": "PM722972",
                "parDelegation": false
              },
              {
                "acteurRef": "PA719608",
                "mandatRef": "PM722710",
                "parDelegation": false
              },
              {
                "acteurRef": "PA720606",
                "mandatRef": "PM723014",
                "parDelegation": false
              }
            ]
          }
        }
      },
      {
        "organeRef": "PO730958",
        "nombreMembresGroupe": "17",
        "vote": {
          "positionMajoritaire": "pour",
          "decompteVoix": {
            "pour": "6",
            "contre": "0",
            "nonVotants": "0",
            "abstentions": "0",
            "nonVotantsVolontaires": "0"
          },
          "decompteNominatif": {
            "pour": [
              {
                "acteurRef": "PA588884",
                "mandatRef": "PM723226",
                "parDelegation": false
              },
              {
                "acteurRef": "PA718868",
                "mandatRef": "PM722484",
                "parDelegation": false
              },
              {
                "acteurRef": "PA720422",
                "mandatRef": "PM722960",
                "parDelegation": false
              },
              {
                "acteurRef": "PA720892",
                "mandatRef": "PM723106",
                "parDelegation": false
              },
              {
                "acteurRef": "PA721202",
                "mandatRef": "PM723202",
                "parDelegation": false
              },
              {
                "acteurRef": "PA721960",
                "mandatRef": "PM723434",
                "parDelegation": false
              }
            ]
          }
        }
      },
      {
        "organeRef": "PO730940",
        "nombreMembresGroupe": "16",
        "vote": {
          "positionMajoritaire": "pour",
          "decompteVoix": {
            "pour": "3",
            "contre": "0",
            "nonVotants": "0",
            "abstentions": "0",
            "nonVotantsVolontaires": "0"
          },
          "decompteNominatif": {
            "pour": [
              {
                "acteurRef": "PA721270",
                "mandatRef": "PM723220",
                "parDelegation": false
              },
              {
                "acteurRef": "PA721896",
                "mandatRef": "PM723414",
                "parDelegation": false
              },
              {
                "acteurRef": "PA335612",
                "mandatRef": "PM723506",
                "parDelegation": false
              }
            ]
          }
        }
      }
    ]
  },
  "miseAuPoint": {
    "contre": [
      {
        "acteurRef": "PA721194",
        "mandatRef": "PM723200"
      }
    ]
  }
}