{
  "uid": "VTANR5L15V1263",
  "numero": "1263",
  "organeRef": "PO717460",
  "legislature": "15",
  "sessionRef": "SCR5A2019O1",
  "seanceRef": "RUANR5L15S2019IDS21286",
  "dateScrutin": "2018-10-23T02:00:00.000+02:00",
  "quantiemeJourSeance": "1",
  "typeVote": {
    "codeTypeVote": "SPS",
    "libelleTypeVote": "scrutin public solennel",
    "typeMajorite": "majorité absolue des suffrages exprimés"
  },
  "sort": {
    "code": "adopté",
    "libelle": "l'Assemblée nationale a adopté"
  },
  "titre": "la première partie du projet de loi de finances pour 2019 (première lecture).",
  "demandeur": {
    "texte": "Conférence des Présidents"
  },
  "objet": {
    "libelle": "la première partie du projet de loi de finances pour 2019 (première lecture)."
  },
  "modePublicationDesVotes": "DecompteNominatif",
  "syntheseVote": {
    "nombreVotants": "554",
    "suffragesExprimes": "527",
    "nbrSuffragesRequis": "264",
    "annonce": "l'Assemblée nationale a adopté",
    "decompte": {
      "pour": "346",
      "contre": "181",
      "nonVotants": "1",
      "abstentions": "27",
      "nonVotantsVolontaires": "0"
    }
  },
  "ventilationVotes": {
    "organeRef": "PO717460",
    "groupes": [
      {
        "organeRef": "PO730964",
        "nombreMembresGroupe": "308",
        "vote": {
          "positionMajoritaire": "pour",
          "decompteVoix": {
            "pour": "297",
            "contre": "0",
            "nonVotants": "1",
            "abstentions": "1",
            "nonVotantsVolontaires": "1"
          },
          "decompteNominatif": {
            "nonVotants": [
              {
                "acteurRef": "PA606171",
                "mandatRef": "PM722632",
                "causePositionVote": "PSE"
              }
            ],
            "pour": [
              {
                "acteurRef": "PA721262",
                "mandatRef": "PM723218",
                "parDelegation": false
              },
              {
                "acteurRef": "PA722398",
                "mandatRef": "PM723562",
                "parDelegation": false
              },
              {
                "acteurRef": "PA2449",
                "mandatRef": "PM723036",
                "parDelegation": false
              },
              {
                "acteurRef": "PA643127",
                "mandatRef": "PM722636",
                "parDelegation": true
              },
              {
                "acteurRef": "PA2828",
                "mandatRef": "PM722540",
                "parDelegation": false
              },
              {
                "acteurRef": "PA346876",
                "mandatRef": "PM723496",
                "parDelegation": false
              },
              {
                "acteurRef": "PA719952",
                "mandatRef": "PM722814",
                "parDelegation": false
              },
              {
                "acteurRef": "PA720790",
                "mandatRef": "PM723078",
                "parDelegation": false
              },
              {
                "acteurRef": "PA719118",
                "mandatRef": "PM722568",
                "parDelegation": true
              },
              {
                "acteurRef": "PA609520",
                "mandatRef": "PM723508",
                "parDelegation": false
              },
              {
                "acteurRef": "PA719668",
                "mandatRef": "PM722726",
                "parDelegation": false
              },
              {
                "acteurRef": "PA608083",
                "mandatRef": "PM723038",
                "parDelegation": false
              },
              {
                "acteurRef": "PA267336",
                "mandatRef": "PM722434",
                "parDelegation": false
              },
              {
                "acteurRef": "PA267673",
                "mandatRef": "PM723306",
                "parDelegation": true
              },
              {
                "acteurRef": "PA721880",
                "mandatRef": "PM723410",
                "parDelegation": false
              },
              {
                "acteurRef": "PA343493",
                "mandatRef": "PM722938",
                "parDelegation": false
              },
              {
                "acteurRef": "PA331835",
                "mandatRef": "PM722688",
                "parDelegation": false
              },
              {
                "acteurRef": "PA334116",
                "mandatRef": "PM723030",
                "parDelegation": false
              },
              {
                "acteurRef": "PA334768",
                "mandatRef": "PM723548",
                "parDelegation": false
              },
              {
                "acteurRef": "PA718768",
                "mandatRef": "PM722450",
                "parDelegation": false
              },
              {
                "acteurRef": "PA722252",
                "mandatRef": "PM723518",
                "parDelegation": false
              },
              {
                "acteurRef": "PA605084",
                "mandatRef": "PM722428",
                "parDelegation": true
              },
              {
                "acteurRef": "PA606202",
                "mandatRef": "PM722698",
                "parDelegation": false
              },
              {
                "acteurRef": "PA605963",
                "mandatRef": "PM722584",
                "parDelegation": false
              },
              {
                "acteurRef": "PA606507",
                "mandatRef": "PM722720",
                "parDelegation": true
              },
              {
                "acteurRef": "PA606639",
                "mandatRef": "PM722776",
                "parDelegation": true
              },
              {
                "acteurRef": "PA606675",
                "mandatRef": "PM722742",
                "parDelegation": false
              },
              {
                "acteurRef": "PA607155",
                "mandatRef": "PM722832",
                "parDelegation": false
              },
              {
                "acteurRef": "PA607193",
                "mandatRef": "PM722846",
                "parDelegation": false
              },
              {
                "acteurRef": "PA607595",
                "mandatRef": "PM722924",
                "parDelegation": false
              },
              {
                "acteurRef": "PA608641",
                "mandatRef": "PM723248",
                "parDelegation": false
              },
              {
                "acteurRef": "PA672",
                "mandatRef": "PM723230",
                "parDelegation": true
              },
              {
                "acteurRef": "PA721296",
                "mandatRef": "PM723228",
                "parDelegation": true
              },
              {
                "acteurRef": "PA719520",
                "mandatRef": "PM722684",
                "parDelegation": false
              },
              {
                "acteurRef": "PA721852",
                "mandatRef": "PM723402",
                "parDelegation": false
              },
              {
                "acteurRef": "PA720492",
                "mandatRef": "PM722980",
                "parDelegation": false
              },
              {
                "acteurRef": "PA717379",
                "mandatRef": "PM723282",
                "parDelegation": false
              },
              {
                "acteurRef": "PA718674",
                "mandatRef": "PM722420",
                "parDelegation": false
              },
              {
                "acteurRef": "PA718682",
                "mandatRef": "PM722422",
                "parDelegation": false
              },
              {
                "acteurRef": "PA718694",
                "mandatRef": "PM722426",
                "parDelegation": false
              },
              {
                "acteurRef": "PA718710",
                "mandatRef": "PM722432",
                "parDelegation": false
              },
              {
                "acteurRef": "PA718728",
                "mandatRef": "PM722438",
                "parDelegation": false
              },
              {
                "acteurRef": "PA718736",
                "mandatRef": "PM722440",
                "parDelegation": false
              },
              {
                "acteurRef": "PA718744",
                "mandatRef": "PM722442",
                "parDelegation": false
              },
              {
                "acteurRef": "PA718756",
                "mandatRef": "PM722446",
                "parDelegation": false
              },
              {
                "acteurRef": "PA718794",
                "mandatRef": "PM722460",
                "parDelegation": false
              },
              {
                "acteurRef": "PA718802",
                "mandatRef": "PM722462",
                "parDelegation": false
              },
              {
                "acteurRef": "PA718810",
                "mandatRef": "PM722464",
                "parDelegation": false
              },
              {
                "acteurRef": "PA677483",
                "mandatRef": "PM722466",
                "parDelegation": false
              },
              {
                "acteurRef": "PA718876",
                "mandatRef": "PM722486",
                "parDelegation": true
              },
              {
                "acteurRef": "PA718894",
                "mandatRef": "PM722494",
                "parDelegation": false
              },
              {
                "acteurRef": "PA718902",
                "mandatRef": "PM722496",
                "parDelegation": false
              },
              {
                "acteurRef": "PA718910",
                "mandatRef": "PM722498",
                "parDelegation": false
              },
              {
                "acteurRef": "PA718918",
                "mandatRef": "PM722500",
                "parDelegation": false
              },
              {
                "acteurRef": "PA718930",
                "mandatRef": "PM722504",
                "parDelegation": false
              },
              {
                "acteurRef": "PA718944",
                "mandatRef": "PM722508",
                "parDelegation": false
              },
              {
                "acteurRef": "PA718954",
                "mandatRef": "PM722512",
                "parDelegation": false
              },
              {
                "acteurRef": "PA718962",
                "mandatRef": "PM722514",
                "parDelegation": false
              },
              {
                "acteurRef": "PA718990",
                "mandatRef": "PM722524",
                "parDelegation": false
              },
              {
                "acteurRef": "PA719006",
                "mandatRef": "PM722530",
                "parDelegation": false
              },
              {
                "acteurRef": "PA719024",
                "mandatRef": "PM722536",
                "parDelegation": false
              },
              {
                "acteurRef": "PA719032",
                "mandatRef": "PM722538",
                "parDelegation": false
              },
              {
                "acteurRef": "PA719052",
                "mandatRef": "PM722544",
                "parDelegation": false
              },
              {
                "acteurRef": "PA719060",
                "mandatRef": "PM722546",
                "parDelegation": false
              },
              {
                "acteurRef": "PA719072",
                "mandatRef": "PM722552",
                "parDelegation": false
              },
              {
                "acteurRef": "PA719080",
                "mandatRef": "PM722554",
                "parDelegation": false
              },
              {
                "acteurRef": "PA719092",
                "mandatRef": "PM722560",
                "parDelegation": false
              },
              {
                "acteurRef": "PA719100",
                "mandatRef": "PM722562",
                "parDelegation": false
              },
              {
                "acteurRef": "PA719108",
                "mandatRef": "PM722564",
                "parDelegation": false
              },
              {
                "acteurRef": "PA719154",
                "mandatRef": "PM722578",
                "parDelegation": false
              },
              {
                "acteurRef": "PA719162",
                "mandatRef": "PM722580",
                "parDelegation": false
              },
              {
                "acteurRef": "PA719170",
                "mandatRef": "PM722582",
                "parDelegation": false
              },
              {
                "acteurRef": "PA719186",
                "mandatRef": "PM722588",
                "parDelegation": false
              },
              {
                "acteurRef": "PA719194",
                "mandatRef": "PM722590",
                "parDelegation": false
              },
              {
                "acteurRef": "PA719202",
                "mandatRef": "PM722592",
                "parDelegation": false
              },
              {
                "acteurRef": "PA719218",
                "mandatRef": "PM722596",
                "parDelegation": false
              },
              {
                "acteurRef": "PA719230",
                "mandatRef": "PM722600",
                "parDelegation": false
              },
              {
                "acteurRef": "PA719242",
                "mandatRef": "PM722604",
                "parDelegation": false
              },
              {
                "acteurRef": "PA719250",
                "mandatRef": "PM722606",
                "parDelegation": false
              },
              {
                "acteurRef": "PA719258",
                "mandatRef": "PM722608",
                "parDelegation": false
              },
              {
                "acteurRef": "PA719294",
                "mandatRef": "PM722618",
                "parDelegation": false
              },
              {
                "acteurRef": "PA719302",
                "mandatRef": "PM722620",
                "parDelegation": true
              },
              {
                "acteurRef": "PA719310",
                "mandatRef": "PM722622",
                "parDelegation": false
              },
              {
                "acteurRef": "PA719330",
                "mandatRef": "PM722628",
                "parDelegation": false
              },
              {
                "acteurRef": "PA719350",
                "mandatRef": "PM722634",
                "parDelegation": false
              },
              {
                "acteurRef": "PA719364",
                "mandatRef": "PM722638",
                "parDelegation": false
              },
              {
                "acteurRef": "PA719372",
                "mandatRef": "PM722640",
                "parDelegation": false
              },
              {
                "acteurRef": "PA719388",
                "mandatRef": "PM722648",
                "parDelegation": false
              },
              {
                "acteurRef": "PA719396",
                "mandatRef": "PM722650",
                "parDelegation": false
              },
              {
                "acteurRef": "PA719404",
                "mandatRef": "PM722652",
                "parDelegation": false
              },
              {
                "acteurRef": "PA719412",
                "mandatRef": "PM722654",
                "parDelegation": false
              },
              {
                "acteurRef": "PA719420",
                "mandatRef": "PM722656",
                "parDelegation": false
              },
              {
                "acteurRef": "PA719440",
                "mandatRef": "PM722664",
                "parDelegation": false
              },
              {
                "acteurRef": "PA719448",
                "mandatRef": "PM722666",
                "parDelegation": false
              },
              {
                "acteurRef": "PA719456",
                "mandatRef": "PM722668",
                "parDelegation": true
              },
              {
                "acteurRef": "PA719464",
                "mandatRef": "PM722670",
                "parDelegation": true
              },
              {
                "acteurRef": "PA719472",
                "mandatRef": "PM722672",
                "parDelegation": false
              },
              {
                "acteurRef": "PA719480",
                "mandatRef": "PM722674",
                "parDelegation": false
              },
              {
                "acteurRef": "PA719496",
                "mandatRef": "PM722678",
                "parDelegation": false
              },
              {
                "acteurRef": "PA719512",
                "mandatRef": "PM722682",
                "parDelegation": true
              },
              {
                "acteurRef": "PA719528",
                "mandatRef": "PM722686",
                "parDelegation": false
              },
              {
                "acteurRef": "PA719540",
                "mandatRef": "PM722690",
                "parDelegation": false
              },
              {
                "acteurRef": "PA719550",
                "mandatRef": "PM722694",
                "parDelegation": false
              },
              {
                "acteurRef": "PA719570",
                "mandatRef": "PM722700",
                "parDelegation": false
              },
              {
                "acteurRef": "PA719592",
                "mandatRef": "PM722706",
                "parDelegation": false
              },
              {
                "acteurRef": "PA719600",
                "mandatRef": "PM722708",
                "parDelegation": false
              },
              {
                "acteurRef": "PA719616",
                "mandatRef": "PM722712",
                "parDelegation": false
              },
              {
                "acteurRef": "PA719624",
                "mandatRef": "PM722714",
                "parDelegation": false
              },
              {
                "acteurRef": "PA719632",
                "mandatRef": "PM722716",
                "parDelegation": false
              },
              {
                "acteurRef": "PA719652",
                "mandatRef": "PM722722",
                "parDelegation": false
              },
              {
                "acteurRef": "PA719684",
                "mandatRef": "PM722730",
                "parDelegation": false
              },
              {
                "acteurRef": "PA719692",
                "mandatRef": "PM722732",
                "parDelegation": false
              },
              {
                "acteurRef": "PA719700",
                "mandatRef": "PM722734",
                "parDelegation": false
              },
              {
                "acteurRef": "PA719710",
                "mandatRef": "PM722738",
                "parDelegation": false
              },
              {
                "acteurRef": "PA719718",
                "mandatRef": "PM722740",
                "parDelegation": false
              },
              {
                "acteurRef": "PA719728",
                "mandatRef": "PM722744",
                "parDelegation": true
              },
              {
                "acteurRef": "PA719740",
                "mandatRef": "PM722748",
                "parDelegation": false
              },
              {
                "acteurRef": "PA719748",
                "mandatRef": "PM722750",
                "parDelegation": false
              },
              {
                "acteurRef": "PA719756",
                "mandatRef": "PM722752",
                "parDelegation": true
              },
              {
                "acteurRef": "PA719770",
                "mandatRef": "PM722758",
                "parDelegation": false
              },
              {
                "acteurRef": "PA719778",
                "mandatRef": "PM722760",
                "parDelegation": true
              },
              {
                "acteurRef": "PA719790",
                "mandatRef": "PM722764",
                "parDelegation": false
              },
              {
                "acteurRef": "PA719798",
                "mandatRef": "PM722766",
                "parDelegation": false
              },
              {
                "acteurRef": "PA719814",
                "mandatRef": "PM722770",
                "parDelegation": false
              },
              {
                "acteurRef": "PA719822",
                "mandatRef": "PM722772",
                "parDelegation": false
              },
              {
                "acteurRef": "PA719830",
                "mandatRef": "PM722774",
                "parDelegation": false
              },
              {
                "acteurRef": "PA719842",
                "mandatRef": "PM722778",
                "parDelegation": false
              },
              {
                "acteurRef": "PA719850",
                "mandatRef": "PM722780",
                "parDelegation": false
              },
              {
                "acteurRef": "PA719858",
                "mandatRef": "PM722782",
                "parDelegation": false
              },
              {
                "acteurRef": "PA719866",
                "mandatRef": "PM722784",
                "parDelegation": false
              },
              {
                "acteurRef": "PA719890",
                "mandatRef": "PM722790",
                "parDelegation": false
              },
              {
                "acteurRef": "PA719922",
                "mandatRef": "PM722802",
                "parDelegation": false
              },
              {
                "acteurRef": "PA719960",
                "mandatRef": "PM722816",
                "parDelegation": false
              },
              {
                "acteurRef": "PA719972",
                "mandatRef": "PM722820",
                "parDelegation": false
              },
              {
                "acteurRef": "PA719980",
                "mandatRef": "PM722822",
                "parDelegation": false
              },
              {
                "acteurRef": "PA719994",
                "mandatRef": "PM722828",
                "parDelegation": false
              },
              {
                "acteurRef": "PA720014",
                "mandatRef": "PM722834",
                "parDelegation": false
              },
              {
                "acteurRef": "PA720022",
                "mandatRef": "PM722836",
                "parDelegation": false
              },
              {
                "acteurRef": "PA720030",
                "mandatRef": "PM722838",
                "parDelegation": false
              },
              {
                "acteurRef": "PA720038",
                "mandatRef": "PM722840",
                "parDelegation": false
              },
              {
                "acteurRef": "PA720046",
                "mandatRef": "PM722842",
                "parDelegation": false
              },
              {
                "acteurRef": "PA720054",
                "mandatRef": "PM722844",
                "parDelegation": false
              },
              {
                "acteurRef": "PA720066",
                "mandatRef": "PM722848",
                "parDelegation": false
              },
              {
                "acteurRef": "PA720074",
                "mandatRef": "PM722850",
                "parDelegation": false
              },
              {
                "acteurRef": "PA720108",
                "mandatRef": "PM722862",
                "parDelegation": false
              },
              {
                "acteurRef": "PA720116",
                "mandatRef": "PM722864",
                "parDelegation": false
              },
              {
                "acteurRef": "PA720124",
                "mandatRef": "PM722866",
                "parDelegation": true
              },
              {
                "acteurRef": "PA643175",
                "mandatRef": "PM722868",
                "parDelegation": false
              },
              {
                "acteurRef": "PA720138",
                "mandatRef": "PM722872",
                "parDelegation": false
              },
              {
                "acteurRef": "PA720146",
                "mandatRef": "PM722874",
                "parDelegation": false
              },
              {
                "acteurRef": "PA720154",
                "mandatRef": "PM722876",
                "parDelegation": false
              },
              {
                "acteurRef": "PA720170",
                "mandatRef": "PM722880",
                "parDelegation": false
              },
              {
                "acteurRef": "PA720190",
                "mandatRef": "PM722886",
                "parDelegation": false
              },
              {
                "acteurRef": "PA720202",
                "mandatRef": "PM722890",
                "parDelegation": false
              },
              {
                "acteurRef": "PA720214",
                "mandatRef": "PM722894",
                "parDelegation": true
              },
              {
                "acteurRef": "PA720222",
                "mandatRef": "PM722896",
                "parDelegation": false
              },
              {
                "acteurRef": "PA720242",
                "mandatRef": "PM722902",
                "parDelegation": false
              },
              {
                "acteurRef": "PA720268",
                "mandatRef": "PM722912",
                "parDelegation": false
              },
              {
                "acteurRef": "PA720278",
                "mandatRef": "PM722916",
                "parDelegation": false
              },
              {
                "acteurRef": "PA720298",
                "mandatRef": "PM722922",
                "parDelegation": false
              },
              {
                "acteurRef": "PA720310",
                "mandatRef": "PM722926",
                "parDelegation": true
              },
              {
                "acteurRef": "PA720318",
                "mandatRef": "PM722928",
                "parDelegation": false
              },
              {
                "acteurRef": "PA720342",
                "mandatRef": "PM722934",
                "parDelegation": false
              },
              {
                "acteurRef": "PA720354",
                "mandatRef": "PM722940",
                "parDelegation": false
              },
              {
                "acteurRef": "PA720362",
                "mandatRef": "PM722942",
                "parDelegation": false
              },
              {
                "acteurRef": "PA720378",
                "mandatRef": "PM722946",
                "parDelegation": false
              },
              {
                "acteurRef": "PA720394",
                "mandatRef": "PM722950",
                "parDelegation": false
              },
              {
                "acteurRef": "PA720402",
                "mandatRef": "PM722952",
                "parDelegation": false
              },
              {
                "acteurRef": "PA720414",
                "mandatRef": "PM722958",
                "parDelegation": false
              },
              {
                "acteurRef": "PA720438",
                "mandatRef": "PM722964",
                "parDelegation": true
              },
              {
                "acteurRef": "PA720446",
                "mandatRef": "PM722966",
                "parDelegation": false
              },
              {
                "acteurRef": "PA720454",
                "mandatRef": "PM722968",
                "parDelegation": false
              },
              {
                "acteurRef": "PA720480",
                "mandatRef": "PM722976",
                "parDelegation": false
              },
              {
                "acteurRef": "PA720500",
                "mandatRef": "PM722982",
                "parDelegation": true
              },
              {
                "acteurRef": "PA720512",
                "mandatRef": "PM722986",
                "parDelegation": false
              },
              {
                "acteurRef": "PA720520",
                "mandatRef": "PM722988",
                "parDelegation": false
              },
              {
                "acteurRef": "PA720538",
                "mandatRef": "PM722994",
                "parDelegation": false
              },
              {
                "acteurRef": "PA720552",
                "mandatRef": "PM722998",
                "parDelegation": false
              },
              {
                "acteurRef": "PA720560",
                "mandatRef": "PM723000",
                "parDelegation": false
              },
              {
                "acteurRef": "PA720568",
                "mandatRef": "PM723002",
                "parDelegation": false
              },
              {
                "acteurRef": "PA720576",
                "mandatRef": "PM723004",
                "parDelegation": false
              },
              {
                "acteurRef": "PA720590",
                "mandatRef": "PM723010",
                "parDelegation": false
              },
              {
                "acteurRef": "PA720622",
                "mandatRef": "PM723018",
                "parDelegation": false
              },
              {
                "acteurRef": "PA720738",
                "mandatRef": "PM723062",
                "parDelegation": false
              },
              {
                "acteurRef": "PA720754",
                "mandatRef": "PM723066",
                "parDelegation": true
              },
              {
                "acteurRef": "PA720780",
                "mandatRef": "PM723074",
                "parDelegation": false
              },
              {
                "acteurRef": "PA720806",
                "mandatRef": "PM723082",
                "parDelegation": false
              },
              {
                "acteurRef": "PA720814",
                "mandatRef": "PM723084",
                "parDelegation": false
              },
              {
                "acteurRef": "PA720830",
                "mandatRef": "PM723088",
                "parDelegation": false
              },
              {
                "acteurRef": "PA720854",
                "mandatRef": "PM723096",
                "parDelegation": false
              },
              {
                "acteurRef": "PA720862",
                "mandatRef": "PM723098",
                "parDelegation": false
              },
              {
                "acteurRef": "PA720870",
                "mandatRef": "PM723100",
                "parDelegation": true
              },
              {
                "acteurRef": "PA720878",
                "mandatRef": "PM723102",
                "parDelegation": false
              },
              {
                "acteurRef": "PA720900",
                "mandatRef": "PM723108",
                "parDelegation": true
              },
              {
                "acteurRef": "PA720908",
                "mandatRef": "PM723110",
                "parDelegation": false
              },
              {
                "acteurRef": "PA720916",
                "mandatRef": "PM723112",
                "parDelegation": false
              },
              {
                "acteurRef": "PA720932",
                "mandatRef": "PM723116",
                "parDelegation": false
              },
              {
                "acteurRef": "PA720944",
                "mandatRef": "PM723120",
                "parDelegation": false
              },
              {
                "acteurRef": "PA720952",
                "mandatRef": "PM723122",
                "parDelegation": false
              },
              {
                "acteurRef": "PA721004",
                "mandatRef": "PM723136",
                "parDelegation": false
              },
              {
                "acteurRef": "PA721024",
                "mandatRef": "PM723144",
                "parDelegation": false
              },
              {
                "acteurRef": "PA721036",
                "mandatRef": "PM753260",
                "parDelegation": false
              },
              {
                "acteurRef": "PA721134",
                "mandatRef": "PM723184",
                "parDelegation": true
              },
              {
                "acteurRef": "PA721142",
                "mandatRef": "PM723186",
                "parDelegation": false
              },
              {
                "acteurRef": "PA721150",
                "mandatRef": "PM723188",
                "parDelegation": false
              },
              {
                "acteurRef": "PA721158",
                "mandatRef": "PM723190",
                "parDelegation": false
              },
              {
                "acteurRef": "PA721166",
                "mandatRef": "PM755857",
                "parDelegation": true
              },
              {
                "acteurRef": "PA721174",
                "mandatRef": "PM723194",
                "parDelegation": false
              },
              {
                "acteurRef": "PA721218",
                "mandatRef": "PM723206",
                "parDelegation": false
              },
              {
                "acteurRef": "PA721246",
                "mandatRef": "PM723214",
                "parDelegation": false
              },
              {
                "acteurRef": "PA721278",
                "mandatRef": "PM723222",
                "parDelegation": true
              },
              {
                "acteurRef": "PA721328",
                "mandatRef": "PM723240",
                "parDelegation": false
              },
              {
                "acteurRef": "PA721336",
                "mandatRef": "PM723242",
                "parDelegation": false
              },
              {
                "acteurRef": "PA721344",
                "mandatRef": "PM723244",
                "parDelegation": false
              },
              {
                "acteurRef": "PA721352",
                "mandatRef": "PM723246",
                "parDelegation": false
              },
              {
                "acteurRef": "PA721364",
                "mandatRef": "PM723250",
                "parDelegation": false
              },
              {
                "acteurRef": "PA721372",
                "mandatRef": "PM723252",
                "parDelegation": false
              },
              {
                "acteurRef": "PA721384",
                "mandatRef": "PM723256",
                "parDelegation": false
              },
              {
                "acteurRef": "PA721398",
                "mandatRef": "PM723262",
                "parDelegation": true
              },
              {
                "acteurRef": "PA721426",
                "mandatRef": "PM723270",
                "parDelegation": false
              },
              {
                "acteurRef": "PA721434",
                "mandatRef": "PM723272",
                "parDelegation": false
              },
              {
                "acteurRef": "PA721450",
                "mandatRef": "PM723278",
                "parDelegation": false
              },
              {
                "acteurRef": "PA721458",
                "mandatRef": "PM723280",
                "parDelegation": false
              },
              {
                "acteurRef": "PA721466",
                "mandatRef": "PM723284",
                "parDelegation": false
              },
              {
                "acteurRef": "PA721498",
                "mandatRef": "PM723294",
                "parDelegation": false
              },
              {
                "acteurRef": "PA721514",
                "mandatRef": "PM723298",
                "parDelegation": true
              },
              {
                "acteurRef": "PA721522",
                "mandatRef": "PM723300",
                "parDelegation": false
              },
              {
                "acteurRef": "PA721542",
                "mandatRef": "PM723308",
                "parDelegation": false
              },
              {
                "acteurRef": "PA721584",
                "mandatRef": "PM723324",
                "parDelegation": false
              },
              {
                "acteurRef": "PA721600",
                "mandatRef": "PM723330",
                "parDelegation": false
              },
              {
                "acteurRef": "PA721616",
                "mandatRef": "PM723334",
                "parDelegation": false
              },
              {
                "acteurRef": "PA721624",
                "mandatRef": "PM723336",
                "parDelegation": false
              },
              {
                "acteurRef": "PA721644",
                "mandatRef": "PM723342",
                "parDelegation": false
              },
              {
                "acteurRef": "PA721656",
                "mandatRef": "PM723346",
                "parDelegation": true
              },
              {
                "acteurRef": "PA721670",
                "mandatRef": "PM723350",
                "parDelegation": false
              },
              {
                "acteurRef": "PA721690",
                "mandatRef": "PM723356",
                "parDelegation": false
              },
              {
                "acteurRef": "PA721702",
                "mandatRef": "PM723360",
                "parDelegation": false
              },
              {
                "acteurRef": "PA721710",
                "mandatRef": "PM723362",
                "parDelegation": false
              },
              {
                "acteurRef": "PA721718",
                "mandatRef": "PM723364",
                "parDelegation": false
              },
              {
                "acteurRef": "PA721750",
                "mandatRef": "PM723372",
                "parDelegation": false
              },
              {
                "acteurRef": "PA721764",
                "mandatRef": "PM723376",
                "parDelegation": false
              },
              {
                "acteurRef": "PA721776",
                "mandatRef": "PM723380",
                "parDelegation": false
              },
              {
                "acteurRef": "PA721784",
                "mandatRef": "PM723382",
                "parDelegation": true
              },
              {
                "acteurRef": "PA721792",
                "mandatRef": "PM723384",
                "parDelegation": false
              },
              {
                "acteurRef": "PA721800",
                "mandatRef": "PM723386",
                "parDelegation": false
              },
              {
                "acteurRef": "PA721808",
                "mandatRef": "PM723388",
                "parDelegation": true
              },
              {
                "acteurRef": "PA721824",
                "mandatRef": "PM723394",
                "parDelegation": false
              },
              {
                "acteurRef": "PA721844",
                "mandatRef": "PM723400",
                "parDelegation": false
              },
              {
                "acteurRef": "PA721860",
                "mandatRef": "PM723404",
                "parDelegation": false
              },
              {
                "acteurRef": "PA721888",
                "mandatRef": "PM723412",
                "parDelegation": true
              },
              {
                "acteurRef": "PA721908",
                "mandatRef": "PM723418",
                "parDelegation": false
              },
              {
                "acteurRef": "PA721916",
                "mandatRef": "PM723420",
                "parDelegation": false
              },
              {
                "acteurRef": "PA721946",
                "mandatRef": "PM723430",
                "parDelegation": true
              },
              {
                "acteurRef": "PA722000",
                "mandatRef": "PM723444",
                "parDelegation": true
              },
              {
                "acteurRef": "PA722008",
                "mandatRef": "PM723446",
                "parDelegation": false
              },
              {
                "acteurRef": "PA722022",
                "mandatRef": "PM723452",
                "parDelegation": false
              },
              {
                "acteurRef": "PA722038",
                "mandatRef": "PM723456",
                "parDelegation": false
              },
              {
                "acteurRef": "PA722046",
                "mandatRef": "PM723458",
                "parDelegation": false
              },
              {
                "acteurRef": "PA722054",
                "mandatRef": "PM723460",
                "parDelegation": false
              },
              {
                "acteurRef": "PA722062",
                "mandatRef": "PM723462",
                "parDelegation": true
              },
              {
                "acteurRef": "PA722070",
                "mandatRef": "PM723464",
                "parDelegation": true
              },
              {
                "acteurRef": "PA722078",
                "mandatRef": "PM723466",
                "parDelegation": false
              },
              {
                "acteurRef": "PA722086",
                "mandatRef": "PM723468",
                "parDelegation": false
              },
              {
                "acteurRef": "PA722094",
                "mandatRef": "PM723470",
                "parDelegation": false
              },
              {
                "acteurRef": "PA722102",
                "mandatRef": "PM723472",
                "parDelegation": false
              },
              {
                "acteurRef": "PA722118",
                "mandatRef": "PM723476",
                "parDelegation": false
              },
              {
                "acteurRef": "PA722126",
                "mandatRef": "PM723478",
                "parDelegation": false
              },
              {
                "acteurRef": "PA722134",
                "mandatRef": "PM723482",
                "parDelegation": false
              },
              {
                "acteurRef": "PA722150",
                "mandatRef": "PM723486",
                "parDelegation": false
              },
              {
                "acteurRef": "PA722170",
                "mandatRef": "PM723492",
                "parDelegation": false
              },
              {
                "acteurRef": "PA722178",
                "mandatRef": "PM723494",
                "parDelegation": false
              },
              {
                "acteurRef": "PA722228",
                "mandatRef": "PM723512",
                "parDelegation": false
              },
              {
                "acteurRef": "PA722236",
                "mandatRef": "PM723514",
                "parDelegation": true
              },
              {
                "acteurRef": "PA722244",
                "mandatRef": "PM723516",
                "parDelegation": false
              },
              {
                "acteurRef": "PA722260",
                "mandatRef": "PM723520",
                "parDelegation": false
              },
              {
                "acteurRef": "PA722268",
                "mandatRef": "PM723522",
                "parDelegation": false
              },
              {
                "acteurRef": "PA722292",
                "mandatRef": "PM723530",
                "parDelegation": false
              },
              {
                "acteurRef": "PA722300",
                "mandatRef": "PM723532",
                "parDelegation": false
              },
              {
                "acteurRef": "PA722312",
                "mandatRef": "PM723536",
                "parDelegation": false
              },
              {
                "acteurRef": "PA722320",
                "mandatRef": "PM723538",
                "parDelegation": false
              },
              {
                "acteurRef": "PA722336",
                "mandatRef": "PM723544",
                "parDelegation": false
              },
              {
                "acteurRef": "PA722344",
                "mandatRef": "PM723546",
                "parDelegation": false
              },
              {
                "acteurRef": "PA722358",
                "mandatRef": "PM723552",
                "parDelegation": false
              },
              {
                "acteurRef": "PA722366",
                "mandatRef": "PM723554",
                "parDelegation": false
              },
              {
                "acteurRef": "PA722382",
                "mandatRef": "PM723558",
                "parDelegation": false
              },
              {
                "acteurRef": "PA724827",
                "mandatRef": "PM754304",
                "parDelegation": false
              },
              {
                "acteurRef": "PA642788",
                "mandatRef": "PM722746",
                "parDelegation": false
              },
              {
                "acteurRef": "PA642724",
                "mandatRef": "PM722658",
                "parDelegation": false
              },
              {
                "acteurRef": "PA702054",
                "mandatRef": "PM733713",
                "parDelegation": false
              },
              {
                "acteurRef": "PA642695",
                "mandatRef": "PM722602",
                "parDelegation": false
              },
              {
                "acteurRef": "PA719326",
                "mandatRef": "PM733709",
                "parDelegation": false
              },
              {
                "acteurRef": "PA720198",
                "mandatRef": "PM733711",
                "parDelegation": false
              },
              {
                "acteurRef": "PA718706",
                "mandatRef": "PM733715",
                "parDelegation": false
              },
              {
                "acteurRef": "PA721956",
                "mandatRef": "PM733717",
                "parDelegation": true
              },
              {
                "acteurRef": "PA721876",
                "mandatRef": "PM733719",
                "parDelegation": false
              },
              {
                "acteurRef": "PA721564",
                "mandatRef": "PM733723",
                "parDelegation": false
              },
              {
                "acteurRef": "PA719910",
                "mandatRef": "PM759347",
                "parDelegation": true
              }
            ],
            "abstentions": [
              {
                "acteurRef": "PA720960",
                "mandatRef": "PM723124",
                "parDelegation": false
              }
            ]
          }
        }
      },
      {
        "organeRef": "PO730934",
        "nombreMembresGroupe": "104",
        "vote": {
          "positionMajoritaire": "contre",
          "decompteVoix": {
            "pour": "0",
            "contre": "103",
            "nonVotants": "0",
            "abstentions": "0",
            "nonVotantsVolontaires": "0"
          },
          "decompteNominatif": {
            "contre": [
              {
                "acteurRef": "PA998",
                "mandatRef": "PM723046",
                "parDelegation": false
              },
              {
                "acteurRef": "PA2529",
                "mandatRef": "PM723234",
                "parDelegation": false
              },
              {
                "acteurRef": "PA2796",
                "mandatRef": "PM722510",
                "parDelegation": false
              },
              {
                "acteurRef": "PA2377",
                "mandatRef": "PM723550",
                "parDelegation": false
              },
              {
                "acteurRef": "PA345722",
                "mandatRef": "PM723428",
                "parDelegation": false
              },
              {
                "acteurRef": "PA720210",
                "mandatRef": "PM722892",
                "parDelegation": false
              },
              {
                "acteurRef": "PA606712",
                "mandatRef": "PM722756",
                "parDelegation": false
              },
              {
                "acteurRef": "PA330240",
                "mandatRef": "PM722492",
                "parDelegation": false
              },
              {
                "acteurRef": "PA856",
                "mandatRef": "PM723288",
                "parDelegation": false
              },
              {
                "acteurRef": "PA923",
                "mandatRef": "PM722904",
                "parDelegation": false
              },
              {
                "acteurRef": "PA1327",
                "mandatRef": "PM722762",
                "parDelegation": false
              },
              {
                "acteurRef": "PA1874",
                "mandatRef": "PM722598",
                "parDelegation": false
              },
              {
                "acteurRef": "PA1498",
                "mandatRef": "PM723396",
                "parDelegation": false
              },
              {
                "acteurRef": "PA746",
                "mandatRef": "PM723212",
                "parDelegation": false
              },
              {
                "acteurRef": "PA1695",
                "mandatRef": "PM723322",
                "parDelegation": false
              },
              {
                "acteurRef": "PA2155",
                "mandatRef": "PM722490",
                "parDelegation": true
              },
              {
                "acteurRef": "PA720644",
                "mandatRef": "PM723026",
                "parDelegation": false
              },
              {
                "acteurRef": "PA266808",
                "mandatRef": "PM723264",
                "parDelegation": false
              },
              {
                "acteurRef": "PA2086",
                "mandatRef": "PM723450",
                "parDelegation": false
              },
              {
                "acteurRef": "PA720586",
                "mandatRef": "PM723008",
                "parDelegation": false
              },
              {
                "acteurRef": "PA606098",
                "mandatRef": "PM722642",
                "parDelegation": false
              },
              {
                "acteurRef": "PA1630",
                "mandatRef": "PM723232",
                "parDelegation": false
              },
              {
                "acteurRef": "PA2492",
                "mandatRef": "PM722566",
                "parDelegation": false
              },
              {
                "acteurRef": "PA1029",
                "mandatRef": "PM722516",
                "parDelegation": false
              },
              {
                "acteurRef": "PA334843",
                "mandatRef": "PM723534",
                "parDelegation": false
              },
              {
                "acteurRef": "PA223837",
                "mandatRef": "PM722458",
                "parDelegation": false
              },
              {
                "acteurRef": "PA267200",
                "mandatRef": "PM722974",
                "parDelegation": false
              },
              {
                "acteurRef": "PA267204",
                "mandatRef": "PM722794",
                "parDelegation": false
              },
              {
                "acteurRef": "PA267260",
                "mandatRef": "PM722476",
                "parDelegation": false
              },
              {
                "acteurRef": "PA267289",
                "mandatRef": "PM754301",
                "parDelegation": false
              },
              {
                "acteurRef": "PA267324",
                "mandatRef": "PM723292",
                "parDelegation": false
              },
              {
                "acteurRef": "PA267378",
                "mandatRef": "PM723344",
                "parDelegation": false
              },
              {
                "acteurRef": "PA267429",
                "mandatRef": "PM722818",
                "parDelegation": false
              },
              {
                "acteurRef": "PA267440",
                "mandatRef": "PM722522",
                "parDelegation": false
              },
              {
                "acteurRef": "PA267527",
                "mandatRef": "PM723274",
                "parDelegation": false
              },
              {
                "acteurRef": "PA267794",
                "mandatRef": "PM722468",
                "parDelegation": false
              },
              {
                "acteurRef": "PA267901",
                "mandatRef": "PM723166",
                "parDelegation": false
              },
              {
                "acteurRef": "PA2792",
                "mandatRef": "PM722870",
                "parDelegation": true
              },
              {
                "acteurRef": "PA2960",
                "mandatRef": "PM723006",
                "parDelegation": false
              },
              {
                "acteurRef": "PA718850",
                "mandatRef": "PM722478",
                "parDelegation": false
              },
              {
                "acteurRef": "PA266776",
                "mandatRef": "PM723542",
                "parDelegation": false
              },
              {
                "acteurRef": "PA608826",
                "mandatRef": "PM723276",
                "parDelegation": false
              },
              {
                "acteurRef": "PA719946",
                "mandatRef": "PM722808",
                "parDelegation": false
              },
              {
                "acteurRef": "PA718838",
                "mandatRef": "PM722474",
                "parDelegation": false
              },
              {
                "acteurRef": "PA721636",
                "mandatRef": "PM723340",
                "parDelegation": false
              },
              {
                "acteurRef": "PA605036",
                "mandatRef": "PM722444",
                "parDelegation": false
              },
              {
                "acteurRef": "PA1012",
                "mandatRef": "PM722418",
                "parDelegation": false
              },
              {
                "acteurRef": "PA334149",
                "mandatRef": "PM723034",
                "parDelegation": false
              },
              {
                "acteurRef": "PA336316",
                "mandatRef": "PM723406",
                "parDelegation": false
              },
              {
                "acteurRef": "PA334654",
                "mandatRef": "PM723566",
                "parDelegation": false
              },
              {
                "acteurRef": "PA330008",
                "mandatRef": "PM722416",
                "parDelegation": false
              },
              {
                "acteurRef": "PA266797",
                "mandatRef": "PM722884",
                "parDelegation": false
              },
              {
                "acteurRef": "PA332523",
                "mandatRef": "PM722792",
                "parDelegation": false
              },
              {
                "acteurRef": "PA267450",
                "mandatRef": "PM722586",
                "parDelegation": false
              },
              {
                "acteurRef": "PA330684",
                "mandatRef": "PM722528",
                "parDelegation": false
              },
              {
                "acteurRef": "PA330788",
                "mandatRef": "PM722570",
                "parDelegation": false
              },
              {
                "acteurRef": "PA340853",
                "mandatRef": "PM722534",
                "parDelegation": false
              },
              {
                "acteurRef": "PA342935",
                "mandatRef": "PM722856",
                "parDelegation": false
              },
              {
                "acteurRef": "PA721968",
                "mandatRef": "PM723436",
                "parDelegation": false
              },
              {
                "acteurRef": "PA605991",
                "mandatRef": "PM722660",
                "parDelegation": false
              },
              {
                "acteurRef": "PA721410",
                "mandatRef": "PM723266",
                "parDelegation": false
              },
              {
                "acteurRef": "PA266774",
                "mandatRef": "PM723526",
                "parDelegation": false
              },
              {
                "acteurRef": "PA267735",
                "mandatRef": "PM722852",
                "parDelegation": true
              },
              {
                "acteurRef": "PA607090",
                "mandatRef": "PM722796",
                "parDelegation": false
              },
              {
                "acteurRef": "PA608016",
                "mandatRef": "PM723024",
                "parDelegation": false
              },
              {
                "acteurRef": "PA608416",
                "mandatRef": "PM723540",
                "parDelegation": false
              },
              {
                "acteurRef": "PA609245",
                "mandatRef": "PM723318",
                "parDelegation": false
              },
              {
                "acteurRef": "PA267785",
                "mandatRef": "PM723310",
                "parDelegation": false
              },
              {
                "acteurRef": "PA609726",
                "mandatRef": "PM723426",
                "parDelegation": false
              },
              {
                "acteurRef": "PA720684",
                "mandatRef": "PM723040",
                "parDelegation": false
              },
              {
                "acteurRef": "PA721816",
                "mandatRef": "PM748964",
                "parDelegation": true
              },
              {
                "acteurRef": "PA267318",
                "mandatRef": "PM723260",
                "parDelegation": false
              },
              {
                "acteurRef": "PA718780",
                "mandatRef": "PM722454",
                "parDelegation": true
              },
              {
                "acteurRef": "PA718784",
                "mandatRef": "PM722456",
                "parDelegation": false
              },
              {
                "acteurRef": "PA718884",
                "mandatRef": "PM722488",
                "parDelegation": false
              },
              {
                "acteurRef": "PA719272",
                "mandatRef": "PM722612",
                "parDelegation": false
              },
              {
                "acteurRef": "PA643103",
                "mandatRef": "PM722614",
                "parDelegation": false
              },
              {
                "acteurRef": "PA719318",
                "mandatRef": "PM722624",
                "parDelegation": false
              },
              {
                "acteurRef": "PA643134",
                "mandatRef": "PM722824",
                "parDelegation": false
              },
              {
                "acteurRef": "PA720100",
                "mandatRef": "PM722860",
                "parDelegation": true
              },
              {
                "acteurRef": "PA720386",
                "mandatRef": "PM722948",
                "parDelegation": false
              },
              {
                "acteurRef": "PA642847",
                "mandatRef": "PM722954",
                "parDelegation": false
              },
              {
                "acteurRef": "PA720630",
                "mandatRef": "PM723020",
                "parDelegation": false
              },
              {
                "acteurRef": "PA721046",
                "mandatRef": "PM723154",
                "parDelegation": false
              },
              {
                "acteurRef": "PA721054",
                "mandatRef": "PM723156",
                "parDelegation": false
              },
              {
                "acteurRef": "PA721070",
                "mandatRef": "PM723160",
                "parDelegation": false
              },
              {
                "acteurRef": "PA721286",
                "mandatRef": "PM723224",
                "parDelegation": false
              },
              {
                "acteurRef": "PA721314",
                "mandatRef": "PM723236",
                "parDelegation": false
              },
              {
                "acteurRef": "PA721474",
                "mandatRef": "PM723286",
                "parDelegation": false
              },
              {
                "acteurRef": "PA721506",
                "mandatRef": "PM723296",
                "parDelegation": false
              },
              {
                "acteurRef": "PA346218",
                "mandatRef": "PM723348",
                "parDelegation": false
              },
              {
                "acteurRef": "PA721678",
                "mandatRef": "PM723352",
                "parDelegation": false
              },
              {
                "acteurRef": "PA346054",
                "mandatRef": "PM723510",
                "parDelegation": false
              },
              {
                "acteurRef": "PA722390",
                "mandatRef": "PM723560",
                "parDelegation": false
              },
              {
                "acteurRef": "PA721126",
                "mandatRef": "PM723182",
                "parDelegation": false
              },
              {
                "acteurRef": "PA330909",
                "mandatRef": "PM722548",
                "parDelegation": false
              },
              {
                "acteurRef": "PA266793",
                "mandatRef": "PM722550",
                "parDelegation": false
              },
              {
                "acteurRef": "PA709315",
                "mandatRef": "PM722526",
                "parDelegation": false
              },
              {
                "acteurRef": "PA712015",
                "mandatRef": "PM722448",
                "parDelegation": false
              },
              {
                "acteurRef": "PA713448",
                "mandatRef": "PM722452",
                "parDelegation": true
              },
              {
                "acteurRef": "PA748954",
                "mandatRef": "PM748958",
                "parDelegation": false
              },
              {
                "acteurRef": "PA643089",
                "mandatRef": "PM758076",
                "parDelegation": false
              },
              {
                "acteurRef": "PA759192",
                "mandatRef": "PM759197",
                "parDelegation": false
              }
            ]
          }
        }
      },
      {
        "organeRef": "PO730970",
        "nombreMembresGroupe": "46",
        "vote": {
          "positionMajoritaire": "pour",
          "decompteVoix": {
            "pour": "44",
            "contre": "1",
            "nonVotants": "0",
            "abstentions": "0",
            "nonVotantsVolontaires": "0"
          },
          "decompteNominatif": {
            "pour": [
              {
                "acteurRef": "PA721608",
                "mandatRef": "PM723332",
                "parDelegation": false
              },
              {
                "acteurRef": "PA720598",
                "mandatRef": "PM723012",
                "parDelegation": false
              },
              {
                "acteurRef": "PA1276",
                "mandatRef": "PM723052",
                "parDelegation": false
              },
              {
                "acteurRef": "PA721418",
                "mandatRef": "PM723268",
                "parDelegation": false
              },
              {
                "acteurRef": "PA721734",
                "mandatRef": "PM723368",
                "parDelegation": false
              },
              {
                "acteurRef": "PA717151",
                "mandatRef": "PM723374",
                "parDelegation": false
              },
              {
                "acteurRef": "PA718978",
                "mandatRef": "PM722520",
                "parDelegation": false
              },
              {
                "acteurRef": "PA719044",
                "mandatRef": "PM722542",
                "parDelegation": true
              },
              {
                "acteurRef": "PA719210",
                "mandatRef": "PM722594",
                "parDelegation": false
              },
              {
                "acteurRef": "PA719266",
                "mandatRef": "PM722610",
                "parDelegation": false
              },
              {
                "acteurRef": "PA719488",
                "mandatRef": "PM722676",
                "parDelegation": false
              },
              {
                "acteurRef": "PA719504",
                "mandatRef": "PM722680",
                "parDelegation": true
              },
              {
                "acteurRef": "PA719558",
                "mandatRef": "PM722696",
                "parDelegation": false
              },
              {
                "acteurRef": "PA719640",
                "mandatRef": "PM722718",
                "parDelegation": false
              },
              {
                "acteurRef": "PA719874",
                "mandatRef": "PM722786",
                "parDelegation": false
              },
              {
                "acteurRef": "PA720002",
                "mandatRef": "PM722830",
                "parDelegation": false
              },
              {
                "acteurRef": "PA720092",
                "mandatRef": "PM722858",
                "parDelegation": true
              },
              {
                "acteurRef": "PA720162",
                "mandatRef": "PM722878",
                "parDelegation": false
              },
              {
                "acteurRef": "PA720178",
                "mandatRef": "PM722882",
                "parDelegation": false
              },
              {
                "acteurRef": "PA720256",
                "mandatRef": "PM722908",
                "parDelegation": false
              },
              {
                "acteurRef": "PA720326",
                "mandatRef": "PM722930",
                "parDelegation": false
              },
              {
                "acteurRef": "PA720334",
                "mandatRef": "PM722932",
                "parDelegation": false
              },
              {
                "acteurRef": "PA720652",
                "mandatRef": "PM723028",
                "parDelegation": false
              },
              {
                "acteurRef": "PA720704",
                "mandatRef": "PM723050",
                "parDelegation": true
              },
              {
                "acteurRef": "PA720720",
                "mandatRef": "PM723056",
                "parDelegation": false
              },
              {
                "acteurRef": "PA720728",
                "mandatRef": "PM723058",
                "parDelegation": false
              },
              {
                "acteurRef": "PA720746",
                "mandatRef": "PM723064",
                "parDelegation": false
              },
              {
                "acteurRef": "PA720764",
                "mandatRef": "PM723070",
                "parDelegation": false
              },
              {
                "acteurRef": "PA720772",
                "mandatRef": "PM723072",
                "parDelegation": false
              },
              {
                "acteurRef": "PA720924",
                "mandatRef": "PM723114",
                "parDelegation": false
              },
              {
                "acteurRef": "PA720968",
                "mandatRef": "PM723126",
                "parDelegation": false
              },
              {
                "acteurRef": "PA721182",
                "mandatRef": "PM723196",
                "parDelegation": true
              },
              {
                "acteurRef": "PA721234",
                "mandatRef": "PM723210",
                "parDelegation": true
              },
              {
                "acteurRef": "PA721530",
                "mandatRef": "PM723302",
                "parDelegation": false
              },
              {
                "acteurRef": "PA721742",
                "mandatRef": "PM723370",
                "parDelegation": false
              },
              {
                "acteurRef": "PA721836",
                "mandatRef": "PM723398",
                "parDelegation": false
              },
              {
                "acteurRef": "PA721924",
                "mandatRef": "PM723422",
                "parDelegation": false
              },
              {
                "acteurRef": "PA721976",
                "mandatRef": "PM723438",
                "parDelegation": false
              },
              {
                "acteurRef": "PA721984",
                "mandatRef": "PM723440",
                "parDelegation": false
              },
              {
                "acteurRef": "PA721992",
                "mandatRef": "PM723442",
                "parDelegation": false
              },
              {
                "acteurRef": "PA722162",
                "mandatRef": "PM723490",
                "parDelegation": false
              },
              {
                "acteurRef": "PA722284",
                "mandatRef": "PM723528",
                "parDelegation": true
              },
              {
                "acteurRef": "PA722374",
                "mandatRef": "PM723556",
                "parDelegation": false
              },
              {
                "acteurRef": "PA719918",
                "mandatRef": "PM733721",
                "parDelegation": false
              }
            ],
            "contre": [
              {
                "acteurRef": "PA720976",
                "mandatRef": "PM723128",
                "parDelegation": false
              }
            ]
          }
        }
      },
      {
        "organeRef": "PO758835",
        "nombreMembresGroupe": "29",
        "vote": {
          "positionMajoritaire": "contre",
          "decompteVoix": {
            "pour": "0",
            "contre": "29",
            "nonVotants": "0",
            "abstentions": "0",
            "nonVotantsVolontaires": "0"
          },
          "decompteNominatif": {
            "contre": [
              {
                "acteurRef": "PA1198",
                "mandatRef": "PM722532",
                "parDelegation": false
              },
              {
                "acteurRef": "PA1809",
                "mandatRef": "PM722556",
                "parDelegation": false
              },
              {
                "acteurRef": "PA508",
                "mandatRef": "PM722736",
                "parDelegation": false
              },
              {
                "acteurRef": "PA333285",
                "mandatRef": "PM722906",
                "parDelegation": false
              },
              {
                "acteurRef": "PA340343",
                "mandatRef": "PM722470",
                "parDelegation": true
              },
              {
                "acteurRef": "PA429893",
                "mandatRef": "PM723104",
                "parDelegation": false
              },
              {
                "acteurRef": "PA1592",
                "mandatRef": "PM723060",
                "parDelegation": false
              },
              {
                "acteurRef": "PA605069",
                "mandatRef": "PM722424",
                "parDelegation": false
              },
              {
                "acteurRef": "PA333818",
                "mandatRef": "PM722990",
                "parDelegation": false
              },
              {
                "acteurRef": "PA335054",
                "mandatRef": "PM723254",
                "parDelegation": true
              },
              {
                "acteurRef": "PA335532",
                "mandatRef": "PM723416",
                "parDelegation": true
              },
              {
                "acteurRef": "PA267233",
                "mandatRef": "PM723500",
                "parDelegation": false
              },
              {
                "acteurRef": "PA337483",
                "mandatRef": "PM723140",
                "parDelegation": false
              },
              {
                "acteurRef": "PA332614",
                "mandatRef": "PM722812",
                "parDelegation": false
              },
              {
                "acteurRef": "PA609332",
                "mandatRef": "PM723378",
                "parDelegation": false
              },
              {
                "acteurRef": "PA342415",
                "mandatRef": "PM722826",
                "parDelegation": true
              },
              {
                "acteurRef": "PA607553",
                "mandatRef": "PM722956",
                "parDelegation": false
              },
              {
                "acteurRef": "PA608172",
                "mandatRef": "PM723048",
                "parDelegation": false
              },
              {
                "acteurRef": "PA608695",
                "mandatRef": "PM723564",
                "parDelegation": true
              },
              {
                "acteurRef": "PA609590",
                "mandatRef": "PM723326",
                "parDelegation": false
              },
              {
                "acteurRef": "PA610681",
                "mandatRef": "PM723150",
                "parDelegation": false
              },
              {
                "acteurRef": "PA608011",
                "mandatRef": "PM723022",
                "parDelegation": false
              },
              {
                "acteurRef": "PA1008",
                "mandatRef": "PM722704",
                "parDelegation": false
              },
              {
                "acteurRef": "PA719930",
                "mandatRef": "PM722804",
                "parDelegation": false
              },
              {
                "acteurRef": "PA720988",
                "mandatRef": "PM723132",
                "parDelegation": true
              },
              {
                "acteurRef": "PA608741",
                "mandatRef": "PM757984",
                "parDelegation": false
              },
              {
                "acteurRef": "PA643145",
                "mandatRef": "PM723130",
                "parDelegation": true
              },
              {
                "acteurRef": "PA642764",
                "mandatRef": "PM753836",
                "parDelegation": false
              },
              {
                "acteurRef": "PA340357",
                "mandatRef": "PM747435",
                "parDelegation": false
              }
            ]
          }
        }
      },
      {
        "organeRef": "PO744425",
        "nombreMembresGroupe": "28",
        "vote": {
          "positionMajoritaire": "abstention",
          "decompteVoix": {
            "pour": "3",
            "contre": "8",
            "nonVotants": "0",
            "abstentions": "15",
            "nonVotantsVolontaires": "15"
          },
          "decompteNominatif": {
            "pour": [
              {
                "acteurRef": "PA2952",
                "mandatRef": "PM722480",
                "parDelegation": false
              },
              {
                "acteurRef": "PA722030",
                "mandatRef": "PM723454",
                "parDelegation": false
              },
              {
                "acteurRef": "PA712014",
                "mandatRef": "PM722984",
                "parDelegation": false
              }
            ],
            "contre": [
              {
                "acteurRef": "PA268019",
                "mandatRef": "PM723092",
                "parDelegation": true
              },
              {
                "acteurRef": "PA266788",
                "mandatRef": "PM722914",
                "parDelegation": false
              },
              {
                "acteurRef": "PA267330",
                "mandatRef": "PM723392",
                "parDelegation": false
              },
              {
                "acteurRef": "PA719806",
                "mandatRef": "PM722768",
                "parDelegation": false
              },
              {
                "acteurRef": "PA267766",
                "mandatRef": "PM722970",
                "parDelegation": false
              },
              {
                "acteurRef": "PA720696",
                "mandatRef": "PM723044",
                "parDelegation": false
              },
              {
                "acteurRef": "PA721486",
                "mandatRef": "PM723290",
                "parDelegation": false
              },
              {
                "acteurRef": "PA695100",
                "mandatRef": "PM723198",
                "parDelegation": false
              }
            ],
            "abstentions": [
              {
                "acteurRef": "PA1960",
                "mandatRef": "PM722810",
                "parDelegation": false
              },
              {
                "acteurRef": "PA267241",
                "mandatRef": "PM723304",
                "parDelegation": false
              },
              {
                "acteurRef": "PA267355",
                "mandatRef": "PM723524",
                "parDelegation": false
              },
              {
                "acteurRef": "PA267585",
                "mandatRef": "PM722978",
                "parDelegation": false
              },
              {
                "acteurRef": "PA331567",
                "mandatRef": "PM722644",
                "parDelegation": false
              },
              {
                "acteurRef": "PA332228",
                "mandatRef": "PM722754",
                "parDelegation": false
              },
              {
                "acteurRef": "PA610775",
                "mandatRef": "PM723170",
                "parDelegation": true
              },
              {
                "acteurRef": "PA720230",
                "mandatRef": "PM722898",
                "parDelegation": false
              },
              {
                "acteurRef": "PA642868",
                "mandatRef": "PM722992",
                "parDelegation": false
              },
              {
                "acteurRef": "PA721094",
                "mandatRef": "PM723168",
                "parDelegation": false
              },
              {
                "acteurRef": "PA721110",
                "mandatRef": "PM723174",
                "parDelegation": true
              },
              {
                "acteurRef": "PA721194",
                "mandatRef": "PM723200",
                "parDelegation": true
              },
              {
                "acteurRef": "PA642935",
                "mandatRef": "PM723238",
                "parDelegation": false
              },
              {
                "acteurRef": "PA267780",
                "mandatRef": "PM723504",
                "parDelegation": false
              },
              {
                "acteurRef": "PA702052",
                "mandatRef": "PM723172",
                "parDelegation": false
              }
            ]
          }
        }
      },
      {
        "organeRef": "PO730958",
        "nombreMembresGroupe": "17",
        "vote": {
          "positionMajoritaire": "contre",
          "decompteVoix": {
            "pour": "0",
            "contre": "17",
            "nonVotants": "0",
            "abstentions": "0",
            "nonVotantsVolontaires": "0"
          },
          "decompteNominatif": {
            "contre": [
              {
                "acteurRef": "PA588884",
                "mandatRef": "PM723226",
                "parDelegation": true
              },
              {
                "acteurRef": "PA718860",
                "mandatRef": "PM722482",
                "parDelegation": false
              },
              {
                "acteurRef": "PA718868",
                "mandatRef": "PM722484",
                "parDelegation": true
              },
              {
                "acteurRef": "PA2150",
                "mandatRef": "PM722506",
                "parDelegation": true
              },
              {
                "acteurRef": "PA719578",
                "mandatRef": "PM722702",
                "parDelegation": false
              },
              {
                "acteurRef": "PA719676",
                "mandatRef": "PM722728",
                "parDelegation": true
              },
              {
                "acteurRef": "PA720286",
                "mandatRef": "PM722918",
                "parDelegation": false
              },
              {
                "acteurRef": "PA720422",
                "mandatRef": "PM722960",
                "parDelegation": false
              },
              {
                "acteurRef": "PA720430",
                "mandatRef": "PM722962",
                "parDelegation": false
              },
              {
                "acteurRef": "PA720846",
                "mandatRef": "PM723094",
                "parDelegation": false
              },
              {
                "acteurRef": "PA720892",
                "mandatRef": "PM723106",
                "parDelegation": true
              },
              {
                "acteurRef": "PA721062",
                "mandatRef": "PM723158",
                "parDelegation": false
              },
              {
                "acteurRef": "PA721202",
                "mandatRef": "PM723202",
                "parDelegation": false
              },
              {
                "acteurRef": "PA721210",
                "mandatRef": "PM723204",
                "parDelegation": false
              },
              {
                "acteurRef": "PA721226",
                "mandatRef": "PM723208",
                "parDelegation": true
              },
              {
                "acteurRef": "PA721960",
                "mandatRef": "PM723434",
                "parDelegation": true
              },
              {
                "acteurRef": "PA722142",
                "mandatRef": "PM723484",
                "parDelegation": false
              }
            ]
          }
        }
      },
      {
        "organeRef": "PO730940",
        "nombreMembresGroupe": "16",
        "vote": {
          "positionMajoritaire": "contre",
          "decompteVoix": {
            "pour": "0",
            "contre": "16",
            "nonVotants": "0",
            "abstentions": "0",
            "nonVotantsVolontaires": "0"
          },
          "decompteNominatif": {
            "contre": [
              {
                "acteurRef": "PA441",
                "mandatRef": "PM723152",
                "parDelegation": false
              },
              {
                "acteurRef": "PA689",
                "mandatRef": "PM723090",
                "parDelegation": true
              },
              {
                "acteurRef": "PA610654",
                "mandatRef": "PM723142",
                "parDelegation": true
              },
              {
                "acteurRef": "PA722202",
                "mandatRef": "PM723502",
                "parDelegation": false
              },
              {
                "acteurRef": "PA267306",
                "mandatRef": "PM723054",
                "parDelegation": false
              },
              {
                "acteurRef": "PA718926",
                "mandatRef": "PM722502",
                "parDelegation": false
              },
              {
                "acteurRef": "PA720692",
                "mandatRef": "PM723042",
                "parDelegation": false
              },
              {
                "acteurRef": "PA610667",
                "mandatRef": "PM723146",
                "parDelegation": false
              },
              {
                "acteurRef": "PA718720",
                "mandatRef": "PM722436",
                "parDelegation": false
              },
              {
                "acteurRef": "PA720546",
                "mandatRef": "PM722996",
                "parDelegation": false
              },
              {
                "acteurRef": "PA721118",
                "mandatRef": "PM723176",
                "parDelegation": true
              },
              {
                "acteurRef": "PA721270",
                "mandatRef": "PM723220",
                "parDelegation": false
              },
              {
                "acteurRef": "PA721896",
                "mandatRef": "PM723414",
                "parDelegation": false
              },
              {
                "acteurRef": "PA722110",
                "mandatRef": "PM723474",
                "parDelegation": false
              },
              {
                "acteurRef": "PA335612",
                "mandatRef": "PM723506",
                "parDelegation": false
              },
              {
                "acteurRef": "PA721012",
                "mandatRef": "PM755861",
                "parDelegation": false
              }
            ]
          }
        }
      },
      {
        "organeRef": "PO759900",
        "nombreMembresGroupe": "16",
        "vote": {
          "positionMajoritaire": "abstention",
          "decompteVoix": {
            "pour": "2",
            "contre": "0",
            "nonVotants": "0",
            "abstentions": "11",
            "nonVotantsVolontaires": "11"
          },
          "decompteNominatif": {
            "pour": [
              {
                "acteurRef": "PA607619",
                "mandatRef": "PM722936",
                "parDelegation": false
              },
              {
                "acteurRef": "PA755549",
                "mandatRef": "PM755552",
                "parDelegation": false
              }
            ],
            "abstentions": [
              {
                "acteurRef": "PA267042",
                "mandatRef": "PM722910",
                "parDelegation": false
              },
              {
                "acteurRef": "PA942",
                "mandatRef": "PM722900",
                "parDelegation": false
              },
              {
                "acteurRef": "PA331582",
                "mandatRef": "PM722646",
                "parDelegation": false
              },
              {
                "acteurRef": "PA333421",
                "mandatRef": "PM722920",
                "parDelegation": false
              },
              {
                "acteurRef": "PA336439",
                "mandatRef": "PM723488",
                "parDelegation": false
              },
              {
                "acteurRef": "PA336175",
                "mandatRef": "PM723328",
                "parDelegation": false
              },
              {
                "acteurRef": "PA605518",
                "mandatRef": "PM722518",
                "parDelegation": false
              },
              {
                "acteurRef": "PA605694",
                "mandatRef": "PM722558",
                "parDelegation": false
              },
              {
                "acteurRef": "PA608292",
                "mandatRef": "PM723076",
                "parDelegation": false
              },
              {
                "acteurRef": "PA719146",
                "mandatRef": "PM722576",
                "parDelegation": false
              },
              {
                "acteurRef": "PA720996",
                "mandatRef": "PM723134",
                "parDelegation": false
              }
            ]
          }
        }
      },
      {
        "organeRef": "PO723569",
        "nombreMembresGroupe": "12",
        "vote": {
          "positionMajoritaire": "contre",
          "decompteVoix": {
            "pour": "0",
            "contre": "7",
            "nonVotants": "0",
            "abstentions": "0",
            "nonVotantsVolontaires": "0"
          },
          "decompteNominatif": {
            "contre": [
              {
                "acteurRef": "PA720614",
                "mandatRef": "PM723016",
                "parDelegation": false
              },
              {
                "acteurRef": "PA719608",
                "mandatRef": "PM722710",
                "parDelegation": false
              },
              {
                "acteurRef": "PA720606",
                "mandatRef": "PM723014",
                "parDelegation": false
              },
              {
                "acteurRef": "PA720664",
                "mandatRef": "PM723032",
                "parDelegation": true
              },
              {
                "acteurRef": "PA720798",
                "mandatRef": "PM723080",
                "parDelegation": false
              },
              {
                "acteurRef": "PA720822",
                "mandatRef": "PM723086",
                "parDelegation": false
              },
              {
                "acteurRef": "PA721932",
                "mandatRef": "PM734586",
                "parDelegation": false
              }
            ]
          }
        }
      }
    ]
  },
  "miseAuPoint": {
    "contre": [
      {
        "acteurRef": "PA405480",
        "mandatRef": "PM723118"
      }
    ],
    "abstentions": [
      {
        "acteurRef": "PA719138",
        "mandatRef": "PM722574"
      }
    ]
  }
}