{
  "uid": "VTANR5L15V1057",
  "numero": "1057",
  "organeRef": "PO717460",
  "legislature": "15",
  "sessionRef": "SCR5A2018O1",
  "seanceRef": "RUANR5L15S2018IDS21170",
  "dateScrutin": "2018-07-17T02:00:00.000+02:00",
  "quantiemeJourSeance": "2",
  "typeVote": {
    "codeTypeVote": "SPO",
    "libelleTypeVote": "scrutin public ordinaire",
    "typeMajorite": "majorité absolue des suffrages exprimés"
  },
  "sort": {
    "code": "rejeté",
    "libelle": "L'Assemblée nationale n'a pas adopté"
  },
  "titre": "l'amendement n° 2 rectifié de M. Le Fur et les amendements identiques suivants après l'article premier du projet de loi constitutionnelle pour une démocratie plus représentative, responsable et efficace (première lecture).",
  "demandeur": {
    "texte": "Président du groupe \"Les Républicains\""
  },
  "objet": {
    "libelle": "l'amendement n° 2 rectifié de M. Le Fur et les amendements identiques suivants après l'article premier du projet de loi constitutionnelle pour une démocratie plus représentative, responsable et efficace (première lecture)."
  },
  "modePublicationDesVotes": "DecompteNominatif",
  "syntheseVote": {
    "nombreVotants": "189",
    "suffragesExprimes": "181",
    "nbrSuffragesRequis": "91",
    "annonce": "L'Assemblée nationale n'a pas adopté",
    "decompte": {
      "pour": "61",
      "contre": "120",
      "nonVotants": "1",
      "abstentions": "8",
      "nonVotantsVolontaires": "0"
    }
  },
  "ventilationVotes": {
    "organeRef": "PO717460",
    "groupes": [
      {
        "organeRef": "PO730964",
        "nombreMembresGroupe": "312",
        "vote": {
          "positionMajoritaire": "contre",
          "decompteVoix": {
            "pour": "2",
            "contre": "93",
            "nonVotants": "1",
            "abstentions": "1",
            "nonVotantsVolontaires": "1"
          },
          "decompteNominatif": {
            "nonVotants": [
              {
                "acteurRef": "PA332747",
                "mandatRef": "PM722798",
                "causePositionVote": "PSE"
              }
            ],
            "pour": [
              {
                "acteurRef": "PA607155",
                "mandatRef": "PM722832",
                "parDelegation": false
              },
              {
                "acteurRef": "PA607619",
                "mandatRef": "PM722936",
                "parDelegation": false
              }
            ],
            "contre": [
              {
                "acteurRef": "PA721262",
                "mandatRef": "PM723218",
                "parDelegation": false
              },
              {
                "acteurRef": "PA722398",
                "mandatRef": "PM723562",
                "parDelegation": false
              },
              {
                "acteurRef": "PA2449",
                "mandatRef": "PM723036",
                "parDelegation": false
              },
              {
                "acteurRef": "PA643127",
                "mandatRef": "PM722636",
                "parDelegation": false
              },
              {
                "acteurRef": "PA719952",
                "mandatRef": "PM722814",
                "parDelegation": false
              },
              {
                "acteurRef": "PA606171",
                "mandatRef": "PM722632",
                "parDelegation": false
              },
              {
                "acteurRef": "PA609520",
                "mandatRef": "PM723508",
                "parDelegation": false
              },
              {
                "acteurRef": "PA608083",
                "mandatRef": "PM723038",
                "parDelegation": false
              },
              {
                "acteurRef": "PA721880",
                "mandatRef": "PM723410",
                "parDelegation": false
              },
              {
                "acteurRef": "PA722190",
                "mandatRef": "PM723498",
                "parDelegation": false
              },
              {
                "acteurRef": "PA606202",
                "mandatRef": "PM722698",
                "parDelegation": false
              },
              {
                "acteurRef": "PA607193",
                "mandatRef": "PM722846",
                "parDelegation": false
              },
              {
                "acteurRef": "PA717379",
                "mandatRef": "PM723282",
                "parDelegation": false
              },
              {
                "acteurRef": "PA718794",
                "mandatRef": "PM722460",
                "parDelegation": false
              },
              {
                "acteurRef": "PA677483",
                "mandatRef": "PM722466",
                "parDelegation": false
              },
              {
                "acteurRef": "PA718902",
                "mandatRef": "PM722496",
                "parDelegation": false
              },
              {
                "acteurRef": "PA718918",
                "mandatRef": "PM722500",
                "parDelegation": false
              },
              {
                "acteurRef": "PA718944",
                "mandatRef": "PM722508",
                "parDelegation": false
              },
              {
                "acteurRef": "PA718962",
                "mandatRef": "PM722514",
                "parDelegation": false
              },
              {
                "acteurRef": "PA719032",
                "mandatRef": "PM722538",
                "parDelegation": false
              },
              {
                "acteurRef": "PA719130",
                "mandatRef": "PM722572",
                "parDelegation": false
              },
              {
                "acteurRef": "PA719154",
                "mandatRef": "PM722578",
                "parDelegation": false
              },
              {
                "acteurRef": "PA719162",
                "mandatRef": "PM722580",
                "parDelegation": false
              },
              {
                "acteurRef": "PA719186",
                "mandatRef": "PM722588",
                "parDelegation": false
              },
              {
                "acteurRef": "PA719194",
                "mandatRef": "PM722590",
                "parDelegation": false
              },
              {
                "acteurRef": "PA719230",
                "mandatRef": "PM722600",
                "parDelegation": false
              },
              {
                "acteurRef": "PA719330",
                "mandatRef": "PM722628",
                "parDelegation": false
              },
              {
                "acteurRef": "PA719350",
                "mandatRef": "PM722634",
                "parDelegation": false
              },
              {
                "acteurRef": "PA719464",
                "mandatRef": "PM722670",
                "parDelegation": false
              },
              {
                "acteurRef": "PA719472",
                "mandatRef": "PM722672",
                "parDelegation": false
              },
              {
                "acteurRef": "PA719496",
                "mandatRef": "PM722678",
                "parDelegation": false
              },
              {
                "acteurRef": "PA719512",
                "mandatRef": "PM722682",
                "parDelegation": false
              },
              {
                "acteurRef": "PA719616",
                "mandatRef": "PM722712",
                "parDelegation": false
              },
              {
                "acteurRef": "PA719624",
                "mandatRef": "PM722714",
                "parDelegation": false
              },
              {
                "acteurRef": "PA719684",
                "mandatRef": "PM722730",
                "parDelegation": false
              },
              {
                "acteurRef": "PA719740",
                "mandatRef": "PM722748",
                "parDelegation": false
              },
              {
                "acteurRef": "PA719748",
                "mandatRef": "PM722750",
                "parDelegation": false
              },
              {
                "acteurRef": "PA719770",
                "mandatRef": "PM722758",
                "parDelegation": false
              },
              {
                "acteurRef": "PA719790",
                "mandatRef": "PM722764",
                "parDelegation": false
              },
              {
                "acteurRef": "PA719798",
                "mandatRef": "PM722766",
                "parDelegation": false
              },
              {
                "acteurRef": "PA719814",
                "mandatRef": "PM722770",
                "parDelegation": false
              },
              {
                "acteurRef": "PA719850",
                "mandatRef": "PM722780",
                "parDelegation": false
              },
              {
                "acteurRef": "PA719866",
                "mandatRef": "PM722784",
                "parDelegation": false
              },
              {
                "acteurRef": "PA719890",
                "mandatRef": "PM722790",
                "parDelegation": false
              },
              {
                "acteurRef": "PA719922",
                "mandatRef": "PM722802",
                "parDelegation": false
              },
              {
                "acteurRef": "PA719994",
                "mandatRef": "PM722828",
                "parDelegation": false
              },
              {
                "acteurRef": "PA720046",
                "mandatRef": "PM722842",
                "parDelegation": false
              },
              {
                "acteurRef": "PA720074",
                "mandatRef": "PM722850",
                "parDelegation": false
              },
              {
                "acteurRef": "PA720108",
                "mandatRef": "PM722862",
                "parDelegation": false
              },
              {
                "acteurRef": "PA643175",
                "mandatRef": "PM722868",
                "parDelegation": false
              },
              {
                "acteurRef": "PA720138",
                "mandatRef": "PM722872",
                "parDelegation": false
              },
              {
                "acteurRef": "PA720146",
                "mandatRef": "PM722874",
                "parDelegation": false
              },
              {
                "acteurRef": "PA720154",
                "mandatRef": "PM722876",
                "parDelegation": false
              },
              {
                "acteurRef": "PA720222",
                "mandatRef": "PM722896",
                "parDelegation": false
              },
              {
                "acteurRef": "PA720242",
                "mandatRef": "PM722902",
                "parDelegation": false
              },
              {
                "acteurRef": "PA720318",
                "mandatRef": "PM722928",
                "parDelegation": false
              },
              {
                "acteurRef": "PA720342",
                "mandatRef": "PM722934",
                "parDelegation": false
              },
              {
                "acteurRef": "PA720354",
                "mandatRef": "PM722940",
                "parDelegation": false
              },
              {
                "acteurRef": "PA720362",
                "mandatRef": "PM722942",
                "parDelegation": false
              },
              {
                "acteurRef": "PA720394",
                "mandatRef": "PM722950",
                "parDelegation": false
              },
              {
                "acteurRef": "PA720446",
                "mandatRef": "PM722966",
                "parDelegation": false
              },
              {
                "acteurRef": "PA720454",
                "mandatRef": "PM722968",
                "parDelegation": false
              },
              {
                "acteurRef": "PA720568",
                "mandatRef": "PM723002",
                "parDelegation": false
              },
              {
                "acteurRef": "PA720622",
                "mandatRef": "PM723018",
                "parDelegation": false
              },
              {
                "acteurRef": "PA720754",
                "mandatRef": "PM723066",
                "parDelegation": false
              },
              {
                "acteurRef": "PA720806",
                "mandatRef": "PM723082",
                "parDelegation": false
              },
              {
                "acteurRef": "PA720854",
                "mandatRef": "PM723096",
                "parDelegation": false
              },
              {
                "acteurRef": "PA720870",
                "mandatRef": "PM723100",
                "parDelegation": false
              },
              {
                "acteurRef": "PA720908",
                "mandatRef": "PM723110",
                "parDelegation": false
              },
              {
                "acteurRef": "PA720944",
                "mandatRef": "PM723120",
                "parDelegation": false
              },
              {
                "acteurRef": "PA721158",
                "mandatRef": "PM723190",
                "parDelegation": false
              },
              {
                "acteurRef": "PA721218",
                "mandatRef": "PM723206",
                "parDelegation": false
              },
              {
                "acteurRef": "PA721278",
                "mandatRef": "PM723222",
                "parDelegation": false
              },
              {
                "acteurRef": "PA721364",
                "mandatRef": "PM723250",
                "parDelegation": false
              },
              {
                "acteurRef": "PA721398",
                "mandatRef": "PM723262",
                "parDelegation": false
              },
              {
                "acteurRef": "PA721542",
                "mandatRef": "PM723308",
                "parDelegation": false
              },
              {
                "acteurRef": "PA721584",
                "mandatRef": "PM723324",
                "parDelegation": false
              },
              {
                "acteurRef": "PA721670",
                "mandatRef": "PM723350",
                "parDelegation": false
              },
              {
                "acteurRef": "PA721690",
                "mandatRef": "PM723356",
                "parDelegation": false
              },
              {
                "acteurRef": "PA721702",
                "mandatRef": "PM723360",
                "parDelegation": false
              },
              {
                "acteurRef": "PA721916",
                "mandatRef": "PM723420",
                "parDelegation": false
              },
              {
                "acteurRef": "PA721946",
                "mandatRef": "PM723430",
                "parDelegation": false
              },
              {
                "acteurRef": "PA722000",
                "mandatRef": "PM723444",
                "parDelegation": false
              },
              {
                "acteurRef": "PA722046",
                "mandatRef": "PM723458",
                "parDelegation": false
              },
              {
                "acteurRef": "PA722134",
                "mandatRef": "PM723482",
                "parDelegation": false
              },
              {
                "acteurRef": "PA722150",
                "mandatRef": "PM723486",
                "parDelegation": false
              },
              {
                "acteurRef": "PA722260",
                "mandatRef": "PM723520",
                "parDelegation": false
              },
              {
                "acteurRef": "PA722336",
                "mandatRef": "PM723544",
                "parDelegation": false
              },
              {
                "acteurRef": "PA722366",
                "mandatRef": "PM723554",
                "parDelegation": false
              },
              {
                "acteurRef": "PA642788",
                "mandatRef": "PM722746",
                "parDelegation": false
              },
              {
                "acteurRef": "PA642695",
                "mandatRef": "PM722602",
                "parDelegation": false
              },
              {
                "acteurRef": "PA721956",
                "mandatRef": "PM733717",
                "parDelegation": false
              },
              {
                "acteurRef": "PA721876",
                "mandatRef": "PM733719",
                "parDelegation": false
              }
            ],
            "abstentions": [
              {
                "acteurRef": "PA702054",
                "mandatRef": "PM733713",
                "parDelegation": false
              }
            ]
          }
        }
      },
      {
        "organeRef": "PO730934",
        "nombreMembresGroupe": "103",
        "vote": {
          "positionMajoritaire": "pour",
          "decompteVoix": {
            "pour": "43",
            "contre": "0",
            "nonVotants": "0",
            "abstentions": "0",
            "nonVotantsVolontaires": "0"
          },
          "decompteNominatif": {
            "pour": [
              {
                "acteurRef": "PA2377",
                "mandatRef": "PM723550",
                "parDelegation": false
              },
              {
                "acteurRef": "PA345722",
                "mandatRef": "PM723428",
                "parDelegation": false
              },
              {
                "acteurRef": "PA720210",
                "mandatRef": "PM722892",
                "parDelegation": false
              },
              {
                "acteurRef": "PA606712",
                "mandatRef": "PM722756",
                "parDelegation": false
              },
              {
                "acteurRef": "PA330240",
                "mandatRef": "PM722492",
                "parDelegation": false
              },
              {
                "acteurRef": "PA923",
                "mandatRef": "PM722904",
                "parDelegation": false
              },
              {
                "acteurRef": "PA1874",
                "mandatRef": "PM722598",
                "parDelegation": false
              },
              {
                "acteurRef": "PA1695",
                "mandatRef": "PM723322",
                "parDelegation": false
              },
              {
                "acteurRef": "PA720644",
                "mandatRef": "PM723026",
                "parDelegation": false
              },
              {
                "acteurRef": "PA266808",
                "mandatRef": "PM723264",
                "parDelegation": false
              },
              {
                "acteurRef": "PA720586",
                "mandatRef": "PM723008",
                "parDelegation": false
              },
              {
                "acteurRef": "PA606098",
                "mandatRef": "PM722642",
                "parDelegation": false
              },
              {
                "acteurRef": "PA267429",
                "mandatRef": "PM722818",
                "parDelegation": false
              },
              {
                "acteurRef": "PA718850",
                "mandatRef": "PM722478",
                "parDelegation": false
              },
              {
                "acteurRef": "PA266776",
                "mandatRef": "PM723542",
                "parDelegation": false
              },
              {
                "acteurRef": "PA608826",
                "mandatRef": "PM723276",
                "parDelegation": false
              },
              {
                "acteurRef": "PA1012",
                "mandatRef": "PM722418",
                "parDelegation": false
              },
              {
                "acteurRef": "PA334654",
                "mandatRef": "PM723566",
                "parDelegation": false
              },
              {
                "acteurRef": "PA332523",
                "mandatRef": "PM722792",
                "parDelegation": false
              },
              {
                "acteurRef": "PA330684",
                "mandatRef": "PM722528",
                "parDelegation": false
              },
              {
                "acteurRef": "PA340853",
                "mandatRef": "PM722534",
                "parDelegation": false
              },
              {
                "acteurRef": "PA721968",
                "mandatRef": "PM723436",
                "parDelegation": false
              },
              {
                "acteurRef": "PA605991",
                "mandatRef": "PM722660",
                "parDelegation": false
              },
              {
                "acteurRef": "PA721410",
                "mandatRef": "PM723266",
                "parDelegation": false
              },
              {
                "acteurRef": "PA266774",
                "mandatRef": "PM723526",
                "parDelegation": false
              },
              {
                "acteurRef": "PA267735",
                "mandatRef": "PM722852",
                "parDelegation": false
              },
              {
                "acteurRef": "PA608016",
                "mandatRef": "PM723024",
                "parDelegation": false
              },
              {
                "acteurRef": "PA267785",
                "mandatRef": "PM723310",
                "parDelegation": false
              },
              {
                "acteurRef": "PA720684",
                "mandatRef": "PM723040",
                "parDelegation": false
              },
              {
                "acteurRef": "PA718784",
                "mandatRef": "PM722456",
                "parDelegation": false
              },
              {
                "acteurRef": "PA643134",
                "mandatRef": "PM722824",
                "parDelegation": false
              },
              {
                "acteurRef": "PA720100",
                "mandatRef": "PM722860",
                "parDelegation": false
              },
              {
                "acteurRef": "PA720386",
                "mandatRef": "PM722948",
                "parDelegation": false
              },
              {
                "acteurRef": "PA642847",
                "mandatRef": "PM722954",
                "parDelegation": false
              },
              {
                "acteurRef": "PA720630",
                "mandatRef": "PM723020",
                "parDelegation": false
              },
              {
                "acteurRef": "PA721314",
                "mandatRef": "PM723236",
                "parDelegation": false
              },
              {
                "acteurRef": "PA721506",
                "mandatRef": "PM723296",
                "parDelegation": false
              },
              {
                "acteurRef": "PA721678",
                "mandatRef": "PM723352",
                "parDelegation": false
              },
              {
                "acteurRef": "PA767",
                "mandatRef": "PM723568",
                "parDelegation": false
              },
              {
                "acteurRef": "PA266793",
                "mandatRef": "PM722550",
                "parDelegation": false
              },
              {
                "acteurRef": "PA709315",
                "mandatRef": "PM722526",
                "parDelegation": false
              },
              {
                "acteurRef": "PA712015",
                "mandatRef": "PM722448",
                "parDelegation": false
              },
              {
                "acteurRef": "PA748954",
                "mandatRef": "PM748958",
                "parDelegation": false
              }
            ]
          }
        }
      },
      {
        "organeRef": "PO730970",
        "nombreMembresGroupe": "46",
        "vote": {
          "positionMajoritaire": "contre",
          "decompteVoix": {
            "pour": "0",
            "contre": "16",
            "nonVotants": "0",
            "abstentions": "0",
            "nonVotantsVolontaires": "0"
          },
          "decompteNominatif": {
            "contre": [
              {
                "acteurRef": "PA721734",
                "mandatRef": "PM723368",
                "parDelegation": false
              },
              {
                "acteurRef": "PA718978",
                "mandatRef": "PM722520",
                "parDelegation": false
              },
              {
                "acteurRef": "PA719266",
                "mandatRef": "PM722610",
                "parDelegation": false
              },
              {
                "acteurRef": "PA719558",
                "mandatRef": "PM722696",
                "parDelegation": false
              },
              {
                "acteurRef": "PA719640",
                "mandatRef": "PM722718",
                "parDelegation": false
              },
              {
                "acteurRef": "PA719874",
                "mandatRef": "PM722786",
                "parDelegation": false
              },
              {
                "acteurRef": "PA719938",
                "mandatRef": "PM722806",
                "parDelegation": false
              },
              {
                "acteurRef": "PA720002",
                "mandatRef": "PM722830",
                "parDelegation": false
              },
              {
                "acteurRef": "PA720256",
                "mandatRef": "PM722908",
                "parDelegation": false
              },
              {
                "acteurRef": "PA720326",
                "mandatRef": "PM722930",
                "parDelegation": false
              },
              {
                "acteurRef": "PA720652",
                "mandatRef": "PM723028",
                "parDelegation": false
              },
              {
                "acteurRef": "PA720772",
                "mandatRef": "PM723072",
                "parDelegation": false
              },
              {
                "acteurRef": "PA721530",
                "mandatRef": "PM723302",
                "parDelegation": false
              },
              {
                "acteurRef": "PA721742",
                "mandatRef": "PM723370",
                "parDelegation": false
              },
              {
                "acteurRef": "PA721976",
                "mandatRef": "PM723438",
                "parDelegation": false
              },
              {
                "acteurRef": "PA721992",
                "mandatRef": "PM723442",
                "parDelegation": false
              }
            ]
          }
        }
      },
      {
        "organeRef": "PO744425",
        "nombreMembresGroupe": "31",
        "vote": {
          "positionMajoritaire": "contre",
          "decompteVoix": {
            "pour": "1",
            "contre": "7",
            "nonVotants": "0",
            "abstentions": "2",
            "nonVotantsVolontaires": "2"
          },
          "decompteNominatif": {
            "pour": [
              {
                "acteurRef": "PA266788",
                "mandatRef": "PM722914",
                "parDelegation": false
              }
            ],
            "contre": [
              {
                "acteurRef": "PA268019",
                "mandatRef": "PM723092",
                "parDelegation": false
              },
              {
                "acteurRef": "PA942",
                "mandatRef": "PM722900",
                "parDelegation": false
              },
              {
                "acteurRef": "PA267585",
                "mandatRef": "PM722978",
                "parDelegation": false
              },
              {
                "acteurRef": "PA331582",
                "mandatRef": "PM722646",
                "parDelegation": false
              },
              {
                "acteurRef": "PA719806",
                "mandatRef": "PM722768",
                "parDelegation": false
              },
              {
                "acteurRef": "PA720696",
                "mandatRef": "PM723044",
                "parDelegation": false
              },
              {
                "acteurRef": "PA267780",
                "mandatRef": "PM723504",
                "parDelegation": false
              }
            ],
            "abstentions": [
              {
                "acteurRef": "PA721110",
                "mandatRef": "PM723174",
                "parDelegation": false
              },
              {
                "acteurRef": "PA702052",
                "mandatRef": "PM723172",
                "parDelegation": false
              }
            ]
          }
        }
      },
      {
        "organeRef": "PO730946",
        "nombreMembresGroupe": "30",
        "vote": {
          "positionMajoritaire": "pour",
          "decompteVoix": {
            "pour": "8",
            "contre": "0",
            "nonVotants": "0",
            "abstentions": "0",
            "nonVotantsVolontaires": "0"
          },
          "decompteNominatif": {
            "pour": [
              {
                "acteurRef": "PA508",
                "mandatRef": "PM722736",
                "parDelegation": false
              },
              {
                "acteurRef": "PA340343",
                "mandatRef": "PM722470",
                "parDelegation": false
              },
              {
                "acteurRef": "PA1592",
                "mandatRef": "PM723060",
                "parDelegation": false
              },
              {
                "acteurRef": "PA605069",
                "mandatRef": "PM722424",
                "parDelegation": false
              },
              {
                "acteurRef": "PA609332",
                "mandatRef": "PM723378",
                "parDelegation": false
              },
              {
                "acteurRef": "PA342415",
                "mandatRef": "PM722826",
                "parDelegation": false
              },
              {
                "acteurRef": "PA608172",
                "mandatRef": "PM723048",
                "parDelegation": false
              },
              {
                "acteurRef": "PA1008",
                "mandatRef": "PM722704",
                "parDelegation": false
              }
            ]
          }
        }
      },
      {
        "organeRef": "PO723569",
        "nombreMembresGroupe": "21",
        "vote": {
          "positionMajoritaire": "pour",
          "decompteVoix": {
            "pour": "7",
            "contre": "1",
            "nonVotants": "0",
            "abstentions": "0",
            "nonVotantsVolontaires": "0"
          },
          "decompteNominatif": {
            "pour": [
              {
                "acteurRef": "PA1838",
                "mandatRef": "PM723068",
                "parDelegation": false
              },
              {
                "acteurRef": "PA336175",
                "mandatRef": "PM723328",
                "parDelegation": false
              },
              {
                "acteurRef": "PA608292",
                "mandatRef": "PM723076",
                "parDelegation": false
              },
              {
                "acteurRef": "PA719138",
                "mandatRef": "PM722574",
                "parDelegation": false
              },
              {
                "acteurRef": "PA719146",
                "mandatRef": "PM722576",
                "parDelegation": false
              },
              {
                "acteurRef": "PA719286",
                "mandatRef": "PM722616",
                "parDelegation": false
              },
              {
                "acteurRef": "PA719608",
                "mandatRef": "PM722710",
                "parDelegation": false
              }
            ],
            "contre": [
              {
                "acteurRef": "PA720468",
                "mandatRef": "PM722972",
                "parDelegation": false
              }
            ]
          }
        }
      },
      {
        "organeRef": "PO730958",
        "nombreMembresGroupe": "17",
        "vote": {
          "positionMajoritaire": "contre",
          "decompteVoix": {
            "pour": "0",
            "contre": "2",
            "nonVotants": "0",
            "abstentions": "2",
            "nonVotantsVolontaires": "2"
          },
          "decompteNominatif": {
            "contre": [
              {
                "acteurRef": "PA718868",
                "mandatRef": "PM722484",
                "parDelegation": false
              },
              {
                "acteurRef": "PA720430",
                "mandatRef": "PM722962",
                "parDelegation": false
              }
            ],
            "abstentions": [
              {
                "acteurRef": "PA720286",
                "mandatRef": "PM722918",
                "parDelegation": false
              },
              {
                "acteurRef": "PA722142",
                "mandatRef": "PM723484",
                "parDelegation": false
              }
            ]
          }
        }
      },
      {
        "organeRef": "PO730940",
        "nombreMembresGroupe": "16",
        "vote": {
          "positionMajoritaire": "abstention",
          "decompteVoix": {
            "pour": "0",
            "contre": "1",
            "nonVotants": "0",
            "abstentions": "3",
            "nonVotantsVolontaires": "3"
          },
          "decompteNominatif": {
            "contre": [
              {
                "acteurRef": "PA610667",
                "mandatRef": "PM723146",
                "parDelegation": false
              }
            ],
            "abstentions": [
              {
                "acteurRef": "PA722202",
                "mandatRef": "PM723502",
                "parDelegation": false
              },
              {
                "acteurRef": "PA721118",
                "mandatRef": "PM723176",
                "parDelegation": false
              },
              {
                "acteurRef": "PA722110",
                "mandatRef": "PM723474",
                "parDelegation": false
              }
            ]
          }
        }
      }
    ]
  }
}