{
  "uid": "VTANR5L15V1792",
  "numero": "1792",
  "organeRef": "PO717460",
  "legislature": "15",
  "sessionRef": "SCR5A2019O1",
  "seanceRef": "RUANR5L15S2019IDS21562",
  "dateScrutin": "2019-03-21T01:00:00.000+01:00",
  "quantiemeJourSeance": "1",
  "typeVote": {
    "codeTypeVote": "SPO",
    "libelleTypeVote": "scrutin public ordinaire",
    "typeMajorite": "majorité absolue des suffrages exprimés"
  },
  "sort": {
    "code": "adopté",
    "libelle": "l'Assemblée nationale a adopté"
  },
  "titre": "l'amendement n° 1894 de M. Isaac-Sibille et l'amendement identique suivant après l'article 6 du projet de loi relatif à l'organisation et à la transformation du système de santé (première lecture).",
  "demandeur": {
    "texte": "Président du groupe \"La République en Marche\""
  },
  "objet": {
    "libelle": "l'amendement n° 1894 de M. Isaac-Sibille et l'amendement identique suivant après l'article 6 du projet de loi relatif à l'organisation et à la transformation du système de santé (première lecture)."
  },
  "modePublicationDesVotes": "DecompteNominatif",
  "syntheseVote": {
    "nombreVotants": "60",
    "suffragesExprimes": "60",
    "nbrSuffragesRequis": "31",
    "annonce": "l'Assemblée nationale a adopté",
    "decompte": {
      "pour": "59",
      "contre": "1",
      "nonVotants": "2",
      "abstentions": "0",
      "nonVotantsVolontaires": "0"
    }
  },
  "ventilationVotes": {
    "organeRef": "PO717460",
    "groupes": [
      {
        "organeRef": "PO730964",
        "nombreMembresGroupe": "306",
        "vote": {
          "positionMajoritaire": "pour",
          "decompteVoix": {
            "pour": "40",
            "contre": "1",
            "nonVotants": "1",
            "abstentions": "0",
            "nonVotantsVolontaires": "0"
          },
          "decompteNominatif": {
            "nonVotants": [
              {
                "acteurRef": "PA606171",
                "mandatRef": "PM722632",
                "causePositionVote": "PAN"
              }
            ],
            "pour": [
              {
                "acteurRef": "PA722398",
                "mandatRef": "PM723562",
                "parDelegation": false
              },
              {
                "acteurRef": "PA719668",
                "mandatRef": "PM722726",
                "parDelegation": false
              },
              {
                "acteurRef": "PA608083",
                "mandatRef": "PM723038",
                "parDelegation": false
              },
              {
                "acteurRef": "PA334768",
                "mandatRef": "PM723548",
                "parDelegation": false
              },
              {
                "acteurRef": "PA717379",
                "mandatRef": "PM723282",
                "parDelegation": false
              },
              {
                "acteurRef": "PA718694",
                "mandatRef": "PM722426",
                "parDelegation": false
              },
              {
                "acteurRef": "PA718744",
                "mandatRef": "PM722442",
                "parDelegation": false
              },
              {
                "acteurRef": "PA718910",
                "mandatRef": "PM722498",
                "parDelegation": false
              },
              {
                "acteurRef": "PA719072",
                "mandatRef": "PM722552",
                "parDelegation": false
              },
              {
                "acteurRef": "PA719092",
                "mandatRef": "PM722560",
                "parDelegation": false
              },
              {
                "acteurRef": "PA719350",
                "mandatRef": "PM722634",
                "parDelegation": false
              },
              {
                "acteurRef": "PA719412",
                "mandatRef": "PM722654",
                "parDelegation": false
              },
              {
                "acteurRef": "PA719448",
                "mandatRef": "PM722666",
                "parDelegation": false
              },
              {
                "acteurRef": "PA719512",
                "mandatRef": "PM722682",
                "parDelegation": false
              },
              {
                "acteurRef": "PA719652",
                "mandatRef": "PM722722",
                "parDelegation": false
              },
              {
                "acteurRef": "PA719858",
                "mandatRef": "PM722782",
                "parDelegation": false
              },
              {
                "acteurRef": "PA719866",
                "mandatRef": "PM722784",
                "parDelegation": false
              },
              {
                "acteurRef": "PA719980",
                "mandatRef": "PM722822",
                "parDelegation": false
              },
              {
                "acteurRef": "PA720030",
                "mandatRef": "PM722838",
                "parDelegation": false
              },
              {
                "acteurRef": "PA720046",
                "mandatRef": "PM722842",
                "parDelegation": false
              },
              {
                "acteurRef": "PA720066",
                "mandatRef": "PM722848",
                "parDelegation": false
              },
              {
                "acteurRef": "PA720154",
                "mandatRef": "PM722876",
                "parDelegation": false
              },
              {
                "acteurRef": "PA720214",
                "mandatRef": "PM722894",
                "parDelegation": false
              },
              {
                "acteurRef": "PA720342",
                "mandatRef": "PM722934",
                "parDelegation": false
              },
              {
                "acteurRef": "PA720362",
                "mandatRef": "PM722942",
                "parDelegation": false
              },
              {
                "acteurRef": "PA720394",
                "mandatRef": "PM722950",
                "parDelegation": false
              },
              {
                "acteurRef": "PA720520",
                "mandatRef": "PM722988",
                "parDelegation": false
              },
              {
                "acteurRef": "PA720738",
                "mandatRef": "PM723062",
                "parDelegation": true
              },
              {
                "acteurRef": "PA720830",
                "mandatRef": "PM723088",
                "parDelegation": false
              },
              {
                "acteurRef": "PA721246",
                "mandatRef": "PM723214",
                "parDelegation": false
              },
              {
                "acteurRef": "PA721336",
                "mandatRef": "PM723242",
                "parDelegation": false
              },
              {
                "acteurRef": "PA721726",
                "mandatRef": "PM723366",
                "parDelegation": false
              },
              {
                "acteurRef": "PA721750",
                "mandatRef": "PM723372",
                "parDelegation": false
              },
              {
                "acteurRef": "PA722062",
                "mandatRef": "PM723462",
                "parDelegation": false
              },
              {
                "acteurRef": "PA722102",
                "mandatRef": "PM723472",
                "parDelegation": false
              },
              {
                "acteurRef": "PA722126",
                "mandatRef": "PM723478",
                "parDelegation": false
              },
              {
                "acteurRef": "PA722312",
                "mandatRef": "PM723536",
                "parDelegation": false
              },
              {
                "acteurRef": "PA718706",
                "mandatRef": "PM733715",
                "parDelegation": false
              },
              {
                "acteurRef": "PA719910",
                "mandatRef": "PM759347",
                "parDelegation": false
              },
              {
                "acteurRef": "PA722090",
                "mandatRef": "PM762941",
                "parDelegation": false
              }
            ],
            "contre": [
              {
                "acteurRef": "PA331835",
                "mandatRef": "PM722688",
                "parDelegation": false
              }
            ]
          }
        }
      },
      {
        "organeRef": "PO730934",
        "nombreMembresGroupe": "104",
        "vote": {
          "positionMajoritaire": "pour",
          "decompteVoix": {
            "pour": "7",
            "contre": "0",
            "nonVotants": "1",
            "abstentions": "0",
            "nonVotantsVolontaires": "0"
          },
          "decompteNominatif": {
            "nonVotants": [
              {
                "acteurRef": "PA1874",
                "mandatRef": "PM722598",
                "causePositionVote": "PSE"
              }
            ],
            "pour": [
              {
                "acteurRef": "PA606712",
                "mandatRef": "PM722756",
                "parDelegation": false
              },
              {
                "acteurRef": "PA267289",
                "mandatRef": "PM754301",
                "parDelegation": false
              },
              {
                "acteurRef": "PA267378",
                "mandatRef": "PM723344",
                "parDelegation": false
              },
              {
                "acteurRef": "PA609726",
                "mandatRef": "PM723426",
                "parDelegation": false
              },
              {
                "acteurRef": "PA720386",
                "mandatRef": "PM722948",
                "parDelegation": false
              },
              {
                "acteurRef": "PA642847",
                "mandatRef": "PM722954",
                "parDelegation": false
              },
              {
                "acteurRef": "PA721286",
                "mandatRef": "PM723224",
                "parDelegation": false
              }
            ]
          }
        }
      },
      {
        "organeRef": "PO730970",
        "nombreMembresGroupe": "46",
        "vote": {
          "positionMajoritaire": "pour",
          "decompteVoix": {
            "pour": "6",
            "contre": "0",
            "nonVotants": "0",
            "abstentions": "0",
            "nonVotantsVolontaires": "0"
          },
          "decompteNominatif": {
            "pour": [
              {
                "acteurRef": "PA719266",
                "mandatRef": "PM722610",
                "parDelegation": false
              },
              {
                "acteurRef": "PA719488",
                "mandatRef": "PM722676",
                "parDelegation": false
              },
              {
                "acteurRef": "PA720326",
                "mandatRef": "PM722930",
                "parDelegation": false
              },
              {
                "acteurRef": "PA720968",
                "mandatRef": "PM723126",
                "parDelegation": false
              },
              {
                "acteurRef": "PA721924",
                "mandatRef": "PM723422",
                "parDelegation": false
              },
              {
                "acteurRef": "PA722374",
                "mandatRef": "PM723556",
                "parDelegation": false
              }
            ]
          }
        }
      },
      {
        "organeRef": "PO744425",
        "nombreMembresGroupe": "29",
        "vote": {
          "positionMajoritaire": "pour",
          "decompteVoix": {
            "pour": "2",
            "contre": "0",
            "nonVotants": "0",
            "abstentions": "0",
            "nonVotantsVolontaires": "0"
          },
          "decompteNominatif": {
            "pour": [
              {
                "acteurRef": "PA642868",
                "mandatRef": "PM722992",
                "parDelegation": false
              },
              {
                "acteurRef": "PA342601",
                "mandatRef": "PM761932",
                "parDelegation": false
              }
            ]
          }
        }
      },
      {
        "organeRef": "PO758835",
        "nombreMembresGroupe": "29",
        "vote": {
          "positionMajoritaire": "pour",
          "decompteVoix": {
            "pour": "2",
            "contre": "0",
            "nonVotants": "0",
            "abstentions": "0",
            "nonVotantsVolontaires": "0"
          },
          "decompteNominatif": {
            "pour": [
              {
                "acteurRef": "PA508",
                "mandatRef": "PM722736",
                "parDelegation": false
              },
              {
                "acteurRef": "PA642764",
                "mandatRef": "PM753836",
                "parDelegation": false
              }
            ]
          }
        }
      },
      {
        "organeRef": "PO730958",
        "nombreMembresGroupe": "17",
        "vote": {
          "positionMajoritaire": "pour",
          "decompteVoix": {
            "pour": "1",
            "contre": "0",
            "nonVotants": "0",
            "abstentions": "0",
            "nonVotantsVolontaires": "0"
          },
          "decompteNominatif": {
            "pour": [
              {
                "acteurRef": "PA720286",
                "mandatRef": "PM722918",
                "parDelegation": false
              }
            ]
          }
        }
      },
      {
        "organeRef": "PO730940",
        "nombreMembresGroupe": "16",
        "vote": {
          "positionMajoritaire": "pour",
          "decompteVoix": {
            "pour": "1",
            "contre": "0",
            "nonVotants": "0",
            "abstentions": "0",
            "nonVotantsVolontaires": "0"
          },
          "decompteNominatif": {
            "pour": [
              {
                "acteurRef": "PA720546",
                "mandatRef": "PM722996",
                "parDelegation": false
              }
            ]
          }
        }
      },
      {
        "organeRef": "PO759900",
        "nombreMembresGroupe": "16",
        "vote": {
          "positionMajoritaire": "pour",
          "decompteVoix": {
            "pour": "0",
            "contre": "0",
            "nonVotants": "0",
            "abstentions": "0",
            "nonVotantsVolontaires": "0"
          },
          "decompteNominatif": {}
        }
      },
      {
        "organeRef": "PO723569",
        "nombreMembresGroupe": "14",
        "vote": {
          "positionMajoritaire": "pour",
          "decompteVoix": {
            "pour": "0",
            "contre": "0",
            "nonVotants": "0",
            "abstentions": "0",
            "nonVotantsVolontaires": "0"
          },
          "decompteNominatif": {}
        }
      }
    ]
  }
}