{
  "uid": "VTANR5L15V404",
  "numero": "404",
  "organeRef": "PO717460",
  "legislature": "15",
  "sessionRef": "SCR5A2018O1",
  "seanceRef": "RUANR5L15S2018IDS20916",
  "dateScrutin": "2018-02-15T01:00:00.000+01:00",
  "quantiemeJourSeance": "3",
  "typeVote": {
    "codeTypeVote": "SPO",
    "libelleTypeVote": "scrutin public ordinaire",
    "typeMajorite": "majorité absolue des suffrages exprimés"
  },
  "sort": {
    "code": "adopté",
    "libelle": "l'Assemblée nationale a adopté"
  },
  "titre": "l'article premier de la proposition de loi permettant une bonne application du regime d'asile europeen (deuxieme lecture).",
  "demandeur": {
    "texte": "President du groupe \"La France insoumise\""
  },
  "objet": {
    "libelle": "l'article premier de la proposition de loi permettant une bonne application du regime d'asile europeen (deuxieme lecture)."
  },
  "modePublicationDesVotes": "DecompteNominatif",
  "syntheseVote": {
    "nombreVotants": "62",
    "suffragesExprimes": "53",
    "nbrSuffragesRequis": "27",
    "annonce": "l'Assemblée nationale a adopté",
    "decompte": {
      "pour": "48",
      "contre": "5",
      "nonVotants": "2",
      "abstentions": "9",
      "nonVotantsVolontaires": "0"
    }
  },
  "ventilationVotes": {
    "organeRef": "PO717460",
    "groupes": [
      {
        "organeRef": "PO730964",
        "nombreMembresGroupe": "310",
        "vote": {
          "positionMajoritaire": "pour",
          "decompteVoix": {
            "pour": "38",
            "contre": "1",
            "nonVotants": "1",
            "abstentions": "8",
            "nonVotantsVolontaires": "8"
          },
          "decompteNominatif": {
            "nonVotants": [
              {
                "acteurRef": "PA332747",
                "mandatRef": "PM722798",
                "causePositionVote": "PAN"
              }
            ],
            "pour": [
              {
                "acteurRef": "PA719952",
                "mandatRef": "PM722814",
                "parDelegation": false
              },
              {
                "acteurRef": "PA606202",
                "mandatRef": "PM722698",
                "parDelegation": false
              },
              {
                "acteurRef": "PA606507",
                "mandatRef": "PM722720",
                "parDelegation": false
              },
              {
                "acteurRef": "PA607193",
                "mandatRef": "PM722846",
                "parDelegation": false
              },
              {
                "acteurRef": "PA717379",
                "mandatRef": "PM723282",
                "parDelegation": false
              },
              {
                "acteurRef": "PA677483",
                "mandatRef": "PM722466",
                "parDelegation": false
              },
              {
                "acteurRef": "PA719108",
                "mandatRef": "PM722564",
                "parDelegation": false
              },
              {
                "acteurRef": "PA719130",
                "mandatRef": "PM722572",
                "parDelegation": false
              },
              {
                "acteurRef": "PA719162",
                "mandatRef": "PM722580",
                "parDelegation": false
              },
              {
                "acteurRef": "PA719230",
                "mandatRef": "PM722600",
                "parDelegation": false
              },
              {
                "acteurRef": "PA719310",
                "mandatRef": "PM722622",
                "parDelegation": false
              },
              {
                "acteurRef": "PA719550",
                "mandatRef": "PM722694",
                "parDelegation": false
              },
              {
                "acteurRef": "PA719728",
                "mandatRef": "PM722744",
                "parDelegation": false
              },
              {
                "acteurRef": "PA719756",
                "mandatRef": "PM722752",
                "parDelegation": false
              },
              {
                "acteurRef": "PA719778",
                "mandatRef": "PM722760",
                "parDelegation": false
              },
              {
                "acteurRef": "PA719814",
                "mandatRef": "PM722770",
                "parDelegation": false
              },
              {
                "acteurRef": "PA719842",
                "mandatRef": "PM722778",
                "parDelegation": false
              },
              {
                "acteurRef": "PA719972",
                "mandatRef": "PM722820",
                "parDelegation": false
              },
              {
                "acteurRef": "PA720370",
                "mandatRef": "PM722944",
                "parDelegation": false
              },
              {
                "acteurRef": "PA720830",
                "mandatRef": "PM723088",
                "parDelegation": false
              },
              {
                "acteurRef": "PA720908",
                "mandatRef": "PM723110",
                "parDelegation": false
              },
              {
                "acteurRef": "PA721278",
                "mandatRef": "PM723222",
                "parDelegation": false
              },
              {
                "acteurRef": "PA721328",
                "mandatRef": "PM723240",
                "parDelegation": false
              },
              {
                "acteurRef": "PA721364",
                "mandatRef": "PM723250",
                "parDelegation": false
              },
              {
                "acteurRef": "PA721426",
                "mandatRef": "PM723270",
                "parDelegation": false
              },
              {
                "acteurRef": "PA721450",
                "mandatRef": "PM723278",
                "parDelegation": false
              },
              {
                "acteurRef": "PA721466",
                "mandatRef": "PM723284",
                "parDelegation": false
              },
              {
                "acteurRef": "PA721568",
                "mandatRef": "PM723316",
                "parDelegation": false
              },
              {
                "acteurRef": "PA721616",
                "mandatRef": "PM723334",
                "parDelegation": false
              },
              {
                "acteurRef": "PA721624",
                "mandatRef": "PM723336",
                "parDelegation": false
              },
              {
                "acteurRef": "PA721710",
                "mandatRef": "PM723362",
                "parDelegation": false
              },
              {
                "acteurRef": "PA721908",
                "mandatRef": "PM723418",
                "parDelegation": false
              },
              {
                "acteurRef": "PA722046",
                "mandatRef": "PM723458",
                "parDelegation": false
              },
              {
                "acteurRef": "PA722054",
                "mandatRef": "PM723460",
                "parDelegation": false
              },
              {
                "acteurRef": "PA722094",
                "mandatRef": "PM723470",
                "parDelegation": false
              },
              {
                "acteurRef": "PA722150",
                "mandatRef": "PM723486",
                "parDelegation": false
              },
              {
                "acteurRef": "PA722336",
                "mandatRef": "PM723544",
                "parDelegation": false
              },
              {
                "acteurRef": "PA721564",
                "mandatRef": "PM733723",
                "parDelegation": false
              }
            ],
            "contre": [
              {
                "acteurRef": "PA718744",
                "mandatRef": "PM722442",
                "parDelegation": false
              }
            ],
            "abstentions": [
              {
                "acteurRef": "PA336439",
                "mandatRef": "PM723488",
                "parDelegation": false
              },
              {
                "acteurRef": "PA720074",
                "mandatRef": "PM722850",
                "parDelegation": false
              },
              {
                "acteurRef": "PA720202",
                "mandatRef": "PM722890",
                "parDelegation": false
              },
              {
                "acteurRef": "PA721246",
                "mandatRef": "PM723214",
                "parDelegation": false
              },
              {
                "acteurRef": "PA722062",
                "mandatRef": "PM723462",
                "parDelegation": false
              },
              {
                "acteurRef": "PA722268",
                "mandatRef": "PM723522",
                "parDelegation": false
              },
              {
                "acteurRef": "PA718706",
                "mandatRef": "PM733715",
                "parDelegation": false
              },
              {
                "acteurRef": "PA721956",
                "mandatRef": "PM733717",
                "parDelegation": false
              }
            ]
          }
        }
      },
      {
        "organeRef": "PO730934",
        "nombreMembresGroupe": "101",
        "vote": {
          "positionMajoritaire": "pour",
          "decompteVoix": {
            "pour": "3",
            "contre": "0",
            "nonVotants": "1",
            "abstentions": "0",
            "nonVotantsVolontaires": "0"
          },
          "decompteNominatif": {
            "nonVotants": [
              {
                "acteurRef": "PA605991",
                "mandatRef": "PM722660",
                "causePositionVote": "PSE"
              }
            ],
            "pour": [
              {
                "acteurRef": "PA330240",
                "mandatRef": "PM722492",
                "parDelegation": false
              },
              {
                "acteurRef": "PA267200",
                "mandatRef": "PM722974",
                "parDelegation": false
              },
              {
                "acteurRef": "PA334654",
                "mandatRef": "PM723566",
                "parDelegation": false
              }
            ]
          }
        }
      },
      {
        "organeRef": "PO730970",
        "nombreMembresGroupe": "47",
        "vote": {
          "positionMajoritaire": "pour",
          "decompteVoix": {
            "pour": "5",
            "contre": "1",
            "nonVotants": "0",
            "abstentions": "1",
            "nonVotantsVolontaires": "1"
          },
          "decompteNominatif": {
            "pour": [
              {
                "acteurRef": "PA720256",
                "mandatRef": "PM722908",
                "parDelegation": false
              },
              {
                "acteurRef": "PA720334",
                "mandatRef": "PM722932",
                "parDelegation": false
              },
              {
                "acteurRef": "PA720704",
                "mandatRef": "PM723050",
                "parDelegation": false
              },
              {
                "acteurRef": "PA720746",
                "mandatRef": "PM723064",
                "parDelegation": false
              },
              {
                "acteurRef": "PA721182",
                "mandatRef": "PM723196",
                "parDelegation": false
              }
            ],
            "contre": [
              {
                "acteurRef": "PA719558",
                "mandatRef": "PM722696",
                "parDelegation": false
              }
            ],
            "abstentions": [
              {
                "acteurRef": "PA720326",
                "mandatRef": "PM722930",
                "parDelegation": false
              }
            ]
          }
        }
      },
      {
        "organeRef": "PO744425",
        "nombreMembresGroupe": "32",
        "vote": {
          "positionMajoritaire": "pour",
          "decompteVoix": {
            "pour": "1",
            "contre": "0",
            "nonVotants": "0",
            "abstentions": "0",
            "nonVotantsVolontaires": "0"
          },
          "decompteNominatif": {
            "pour": [
              {
                "acteurRef": "PA2952",
                "mandatRef": "PM722480",
                "parDelegation": false
              }
            ]
          }
        }
      },
      {
        "organeRef": "PO730946",
        "nombreMembresGroupe": "30",
        "vote": {
          "positionMajoritaire": "pour",
          "decompteVoix": {
            "pour": "0",
            "contre": "0",
            "nonVotants": "0",
            "abstentions": "0",
            "nonVotantsVolontaires": "0"
          },
          "decompteNominatif": {}
        }
      },
      {
        "organeRef": "PO723569",
        "nombreMembresGroupe": "18",
        "vote": {
          "positionMajoritaire": "pour",
          "decompteVoix": {
            "pour": "1",
            "contre": "0",
            "nonVotants": "0",
            "abstentions": "0",
            "nonVotantsVolontaires": "0"
          },
          "decompteNominatif": {
            "pour": [
              {
                "acteurRef": "PA719608",
                "mandatRef": "PM722710",
                "parDelegation": false
              }
            ]
          }
        }
      },
      {
        "organeRef": "PO730958",
        "nombreMembresGroupe": "17",
        "vote": {
          "positionMajoritaire": "contre",
          "decompteVoix": {
            "pour": "0",
            "contre": "2",
            "nonVotants": "0",
            "abstentions": "0",
            "nonVotantsVolontaires": "0"
          },
          "decompteNominatif": {
            "contre": [
              {
                "acteurRef": "PA718860",
                "mandatRef": "PM722482",
                "parDelegation": false
              },
              {
                "acteurRef": "PA720846",
                "mandatRef": "PM723094",
                "parDelegation": false
              }
            ]
          }
        }
      },
      {
        "organeRef": "PO730940",
        "nombreMembresGroupe": "16",
        "vote": {
          "positionMajoritaire": "contre",
          "decompteVoix": {
            "pour": "0",
            "contre": "1",
            "nonVotants": "0",
            "abstentions": "0",
            "nonVotantsVolontaires": "0"
          },
          "decompteNominatif": {
            "contre": [
              {
                "acteurRef": "PA721270",
                "mandatRef": "PM723220",
                "parDelegation": false
              }
            ]
          }
        }
      }
    ]
  },
  "miseAuPoint": {
    "contre": [
      {
        "acteurRef": "PA721202",
        "mandatRef": "PM723202"
      }
    ]
  }
}