{
  "uid": "VTANR5L15V824",
  "numero": "824",
  "organeRef": "PO717460",
  "legislature": "15",
  "sessionRef": "SCR5A2018O1",
  "seanceRef": "RUANR5L15S2018IDS21089",
  "dateScrutin": "2018-06-06T02:00:00.000+02:00",
  "quantiemeJourSeance": "1",
  "typeVote": {
    "codeTypeVote": "SPO",
    "libelleTypeVote": "scrutin public ordinaire",
    "typeMajorite": "majorité absolue des suffrages exprimés"
  },
  "sort": {
    "code": "rejeté",
    "libelle": "L'Assemblée nationale n'a pas adopté"
  },
  "titre": "l'amendement n° 1177 de M. Pauget à l'article 46 du projet de loi portant évolution du logement, de l'aménagement et du numérique (première lecture).",
  "demandeur": {
    "texte": "Président du groupe \"Les Républicains\""
  },
  "objet": {
    "libelle": "l'amendement n° 1177 de M. Pauget à l'article 46 du projet de loi portant évolution du logement, de l'aménagement et du numérique (première lecture)."
  },
  "modePublicationDesVotes": "DecompteNominatif",
  "syntheseVote": {
    "nombreVotants": "110",
    "suffragesExprimes": "107",
    "nbrSuffragesRequis": "54",
    "annonce": "L'Assemblée nationale n'a pas adopté",
    "decompte": {
      "pour": "23",
      "contre": "84",
      "nonVotants": "2",
      "abstentions": "3",
      "nonVotantsVolontaires": "0"
    }
  },
  "ventilationVotes": {
    "organeRef": "PO717460",
    "groupes": [
      {
        "organeRef": "PO730964",
        "nombreMembresGroupe": "313",
        "vote": {
          "positionMajoritaire": "contre",
          "decompteVoix": {
            "pour": "0",
            "contre": "66",
            "nonVotants": "1",
            "abstentions": "0",
            "nonVotantsVolontaires": "0"
          },
          "decompteNominatif": {
            "nonVotants": [
              {
                "acteurRef": "PA332747",
                "mandatRef": "PM722798",
                "causePositionVote": "PAN"
              }
            ],
            "contre": [
              {
                "acteurRef": "PA719668",
                "mandatRef": "PM722726",
                "parDelegation": false
              },
              {
                "acteurRef": "PA718768",
                "mandatRef": "PM722450",
                "parDelegation": false
              },
              {
                "acteurRef": "PA605963",
                "mandatRef": "PM722584",
                "parDelegation": false
              },
              {
                "acteurRef": "PA721296",
                "mandatRef": "PM723228",
                "parDelegation": false
              },
              {
                "acteurRef": "PA719520",
                "mandatRef": "PM722684",
                "parDelegation": false
              },
              {
                "acteurRef": "PA721852",
                "mandatRef": "PM723402",
                "parDelegation": false
              },
              {
                "acteurRef": "PA720492",
                "mandatRef": "PM722980",
                "parDelegation": false
              },
              {
                "acteurRef": "PA718728",
                "mandatRef": "PM722438",
                "parDelegation": false
              },
              {
                "acteurRef": "PA718930",
                "mandatRef": "PM722504",
                "parDelegation": false
              },
              {
                "acteurRef": "PA718962",
                "mandatRef": "PM722514",
                "parDelegation": false
              },
              {
                "acteurRef": "PA718990",
                "mandatRef": "PM722524",
                "parDelegation": false
              },
              {
                "acteurRef": "PA719080",
                "mandatRef": "PM722554",
                "parDelegation": false
              },
              {
                "acteurRef": "PA719108",
                "mandatRef": "PM722564",
                "parDelegation": false
              },
              {
                "acteurRef": "PA719130",
                "mandatRef": "PM722572",
                "parDelegation": false
              },
              {
                "acteurRef": "PA719154",
                "mandatRef": "PM722578",
                "parDelegation": false
              },
              {
                "acteurRef": "PA719194",
                "mandatRef": "PM722590",
                "parDelegation": false
              },
              {
                "acteurRef": "PA719388",
                "mandatRef": "PM722648",
                "parDelegation": false
              },
              {
                "acteurRef": "PA719420",
                "mandatRef": "PM722656",
                "parDelegation": false
              },
              {
                "acteurRef": "PA719652",
                "mandatRef": "PM722722",
                "parDelegation": false
              },
              {
                "acteurRef": "PA719660",
                "mandatRef": "PM722724",
                "parDelegation": false
              },
              {
                "acteurRef": "PA719718",
                "mandatRef": "PM722740",
                "parDelegation": false
              },
              {
                "acteurRef": "PA719740",
                "mandatRef": "PM722748",
                "parDelegation": false
              },
              {
                "acteurRef": "PA719756",
                "mandatRef": "PM722752",
                "parDelegation": false
              },
              {
                "acteurRef": "PA719822",
                "mandatRef": "PM722772",
                "parDelegation": false
              },
              {
                "acteurRef": "PA719830",
                "mandatRef": "PM722774",
                "parDelegation": false
              },
              {
                "acteurRef": "PA719866",
                "mandatRef": "PM722784",
                "parDelegation": false
              },
              {
                "acteurRef": "PA719922",
                "mandatRef": "PM722802",
                "parDelegation": false
              },
              {
                "acteurRef": "PA719994",
                "mandatRef": "PM722828",
                "parDelegation": false
              },
              {
                "acteurRef": "PA720154",
                "mandatRef": "PM722876",
                "parDelegation": false
              },
              {
                "acteurRef": "PA720278",
                "mandatRef": "PM722916",
                "parDelegation": false
              },
              {
                "acteurRef": "PA720298",
                "mandatRef": "PM722922",
                "parDelegation": false
              },
              {
                "acteurRef": "PA720378",
                "mandatRef": "PM722946",
                "parDelegation": false
              },
              {
                "acteurRef": "PA720402",
                "mandatRef": "PM722952",
                "parDelegation": false
              },
              {
                "acteurRef": "PA720414",
                "mandatRef": "PM722958",
                "parDelegation": false
              },
              {
                "acteurRef": "PA720480",
                "mandatRef": "PM722976",
                "parDelegation": false
              },
              {
                "acteurRef": "PA720738",
                "mandatRef": "PM723062",
                "parDelegation": false
              },
              {
                "acteurRef": "PA720780",
                "mandatRef": "PM723074",
                "parDelegation": false
              },
              {
                "acteurRef": "PA720814",
                "mandatRef": "PM723084",
                "parDelegation": false
              },
              {
                "acteurRef": "PA720854",
                "mandatRef": "PM723096",
                "parDelegation": false
              },
              {
                "acteurRef": "PA720862",
                "mandatRef": "PM723098",
                "parDelegation": false
              },
              {
                "acteurRef": "PA720932",
                "mandatRef": "PM723116",
                "parDelegation": false
              },
              {
                "acteurRef": "PA721150",
                "mandatRef": "PM723188",
                "parDelegation": false
              },
              {
                "acteurRef": "PA721364",
                "mandatRef": "PM723250",
                "parDelegation": false
              },
              {
                "acteurRef": "PA721426",
                "mandatRef": "PM723270",
                "parDelegation": false
              },
              {
                "acteurRef": "PA721434",
                "mandatRef": "PM723272",
                "parDelegation": false
              },
              {
                "acteurRef": "PA721450",
                "mandatRef": "PM723278",
                "parDelegation": false
              },
              {
                "acteurRef": "PA721458",
                "mandatRef": "PM723280",
                "parDelegation": false
              },
              {
                "acteurRef": "PA721584",
                "mandatRef": "PM723324",
                "parDelegation": false
              },
              {
                "acteurRef": "PA721600",
                "mandatRef": "PM723330",
                "parDelegation": false
              },
              {
                "acteurRef": "PA721718",
                "mandatRef": "PM723364",
                "parDelegation": false
              },
              {
                "acteurRef": "PA721750",
                "mandatRef": "PM723372",
                "parDelegation": false
              },
              {
                "acteurRef": "PA721776",
                "mandatRef": "PM723380",
                "parDelegation": false
              },
              {
                "acteurRef": "PA721784",
                "mandatRef": "PM723382",
                "parDelegation": false
              },
              {
                "acteurRef": "PA721792",
                "mandatRef": "PM723384",
                "parDelegation": false
              },
              {
                "acteurRef": "PA721844",
                "mandatRef": "PM723400",
                "parDelegation": false
              },
              {
                "acteurRef": "PA722000",
                "mandatRef": "PM723444",
                "parDelegation": false
              },
              {
                "acteurRef": "PA722022",
                "mandatRef": "PM723452",
                "parDelegation": false
              },
              {
                "acteurRef": "PA722070",
                "mandatRef": "PM723464",
                "parDelegation": false
              },
              {
                "acteurRef": "PA722094",
                "mandatRef": "PM723470",
                "parDelegation": false
              },
              {
                "acteurRef": "PA722150",
                "mandatRef": "PM723486",
                "parDelegation": false
              },
              {
                "acteurRef": "PA722170",
                "mandatRef": "PM723492",
                "parDelegation": false
              },
              {
                "acteurRef": "PA722268",
                "mandatRef": "PM723522",
                "parDelegation": false
              },
              {
                "acteurRef": "PA722292",
                "mandatRef": "PM723530",
                "parDelegation": false
              },
              {
                "acteurRef": "PA722312",
                "mandatRef": "PM723536",
                "parDelegation": false
              },
              {
                "acteurRef": "PA718706",
                "mandatRef": "PM733715",
                "parDelegation": false
              },
              {
                "acteurRef": "PA721876",
                "mandatRef": "PM733719",
                "parDelegation": false
              }
            ]
          }
        }
      },
      {
        "organeRef": "PO730934",
        "nombreMembresGroupe": "102",
        "vote": {
          "positionMajoritaire": "pour",
          "decompteVoix": {
            "pour": "22",
            "contre": "0",
            "nonVotants": "0",
            "abstentions": "0",
            "nonVotantsVolontaires": "0"
          },
          "decompteNominatif": {
            "pour": [
              {
                "acteurRef": "PA2377",
                "mandatRef": "PM723550",
                "parDelegation": false
              },
              {
                "acteurRef": "PA345722",
                "mandatRef": "PM723428",
                "parDelegation": false
              },
              {
                "acteurRef": "PA2960",
                "mandatRef": "PM723006",
                "parDelegation": false
              },
              {
                "acteurRef": "PA718838",
                "mandatRef": "PM722474",
                "parDelegation": false
              },
              {
                "acteurRef": "PA1012",
                "mandatRef": "PM722418",
                "parDelegation": false
              },
              {
                "acteurRef": "PA267450",
                "mandatRef": "PM722586",
                "parDelegation": false
              },
              {
                "acteurRef": "PA340853",
                "mandatRef": "PM722534",
                "parDelegation": false
              },
              {
                "acteurRef": "PA721968",
                "mandatRef": "PM723436",
                "parDelegation": false
              },
              {
                "acteurRef": "PA607090",
                "mandatRef": "PM722796",
                "parDelegation": false
              },
              {
                "acteurRef": "PA609245",
                "mandatRef": "PM723318",
                "parDelegation": false
              },
              {
                "acteurRef": "PA720684",
                "mandatRef": "PM723040",
                "parDelegation": false
              },
              {
                "acteurRef": "PA718780",
                "mandatRef": "PM722454",
                "parDelegation": false
              },
              {
                "acteurRef": "PA718784",
                "mandatRef": "PM722456",
                "parDelegation": false
              },
              {
                "acteurRef": "PA642847",
                "mandatRef": "PM722954",
                "parDelegation": false
              },
              {
                "acteurRef": "PA721286",
                "mandatRef": "PM723224",
                "parDelegation": false
              },
              {
                "acteurRef": "PA721506",
                "mandatRef": "PM723296",
                "parDelegation": false
              },
              {
                "acteurRef": "PA346218",
                "mandatRef": "PM723348",
                "parDelegation": false
              },
              {
                "acteurRef": "PA721678",
                "mandatRef": "PM723352",
                "parDelegation": false
              },
              {
                "acteurRef": "PA346054",
                "mandatRef": "PM723510",
                "parDelegation": false
              },
              {
                "acteurRef": "PA330909",
                "mandatRef": "PM722548",
                "parDelegation": false
              },
              {
                "acteurRef": "PA266793",
                "mandatRef": "PM722550",
                "parDelegation": false
              },
              {
                "acteurRef": "PA748954",
                "mandatRef": "PM748958",
                "parDelegation": false
              }
            ]
          }
        }
      },
      {
        "organeRef": "PO730970",
        "nombreMembresGroupe": "47",
        "vote": {
          "positionMajoritaire": "contre",
          "decompteVoix": {
            "pour": "0",
            "contre": "5",
            "nonVotants": "0",
            "abstentions": "1",
            "nonVotantsVolontaires": "1"
          },
          "decompteNominatif": {
            "contre": [
              {
                "acteurRef": "PA720598",
                "mandatRef": "PM723012",
                "parDelegation": false
              },
              {
                "acteurRef": "PA720326",
                "mandatRef": "PM722930",
                "parDelegation": false
              },
              {
                "acteurRef": "PA720728",
                "mandatRef": "PM723058",
                "parDelegation": false
              },
              {
                "acteurRef": "PA721530",
                "mandatRef": "PM723302",
                "parDelegation": false
              },
              {
                "acteurRef": "PA719918",
                "mandatRef": "PM733721",
                "parDelegation": false
              }
            ],
            "abstentions": [
              {
                "acteurRef": "PA721234",
                "mandatRef": "PM723210",
                "parDelegation": false
              }
            ]
          }
        }
      },
      {
        "organeRef": "PO744425",
        "nombreMembresGroupe": "32",
        "vote": {
          "positionMajoritaire": "abstention",
          "decompteVoix": {
            "pour": "0",
            "contre": "0",
            "nonVotants": "1",
            "abstentions": "2",
            "nonVotantsVolontaires": "2"
          },
          "decompteNominatif": {
            "nonVotants": [
              {
                "acteurRef": "PA267801",
                "mandatRef": "PM723320",
                "causePositionVote": "PSE"
              }
            ],
            "abstentions": [
              {
                "acteurRef": "PA332228",
                "mandatRef": "PM722754",
                "parDelegation": false
              },
              {
                "acteurRef": "PA721486",
                "mandatRef": "PM723290",
                "parDelegation": false
              }
            ]
          }
        }
      },
      {
        "organeRef": "PO730946",
        "nombreMembresGroupe": "30",
        "vote": {
          "positionMajoritaire": "contre",
          "decompteVoix": {
            "pour": "0",
            "contre": "2",
            "nonVotants": "0",
            "abstentions": "0",
            "nonVotantsVolontaires": "0"
          },
          "decompteNominatif": {
            "contre": [
              {
                "acteurRef": "PA342415",
                "mandatRef": "PM722826",
                "parDelegation": false
              },
              {
                "acteurRef": "PA607553",
                "mandatRef": "PM722956",
                "parDelegation": false
              }
            ]
          }
        }
      },
      {
        "organeRef": "PO723569",
        "nombreMembresGroupe": "20",
        "vote": {
          "positionMajoritaire": "pour",
          "decompteVoix": {
            "pour": "1",
            "contre": "1",
            "nonVotants": "0",
            "abstentions": "0",
            "nonVotantsVolontaires": "0"
          },
          "decompteNominatif": {
            "pour": [
              {
                "acteurRef": "PA719608",
                "mandatRef": "PM722710",
                "parDelegation": false
              }
            ],
            "contre": [
              {
                "acteurRef": "PA336175",
                "mandatRef": "PM723328",
                "parDelegation": false
              }
            ]
          }
        }
      },
      {
        "organeRef": "PO730958",
        "nombreMembresGroupe": "17",
        "vote": {
          "positionMajoritaire": "contre",
          "decompteVoix": {
            "pour": "0",
            "contre": "6",
            "nonVotants": "0",
            "abstentions": "0",
            "nonVotantsVolontaires": "0"
          },
          "decompteNominatif": {
            "contre": [
              {
                "acteurRef": "PA718860",
                "mandatRef": "PM722482",
                "parDelegation": false
              },
              {
                "acteurRef": "PA2150",
                "mandatRef": "PM722506",
                "parDelegation": false
              },
              {
                "acteurRef": "PA719578",
                "mandatRef": "PM722702",
                "parDelegation": false
              },
              {
                "acteurRef": "PA719676",
                "mandatRef": "PM722728",
                "parDelegation": false
              },
              {
                "acteurRef": "PA720286",
                "mandatRef": "PM722918",
                "parDelegation": false
              },
              {
                "acteurRef": "PA721202",
                "mandatRef": "PM723202",
                "parDelegation": false
              }
            ]
          }
        }
      },
      {
        "organeRef": "PO730940",
        "nombreMembresGroupe": "16",
        "vote": {
          "positionMajoritaire": "contre",
          "decompteVoix": {
            "pour": "0",
            "contre": "4",
            "nonVotants": "0",
            "abstentions": "0",
            "nonVotantsVolontaires": "0"
          },
          "decompteNominatif": {
            "contre": [
              {
                "acteurRef": "PA689",
                "mandatRef": "PM723090",
                "parDelegation": false
              },
              {
                "acteurRef": "PA721270",
                "mandatRef": "PM723220",
                "parDelegation": false
              },
              {
                "acteurRef": "PA721896",
                "mandatRef": "PM723414",
                "parDelegation": false
              },
              {
                "acteurRef": "PA722110",
                "mandatRef": "PM723474",
                "parDelegation": false
              }
            ]
          }
        }
      }
    ]
  }
}