{
  "uid": "VTANR5L15V1683",
  "numero": "1683",
  "organeRef": "PO717460",
  "legislature": "15",
  "sessionRef": "SCR5A2019O1",
  "seanceRef": "RUANR5L15S2019IDS21504",
  "dateScrutin": "2019-02-14T01:00:00.000+01:00",
  "quantiemeJourSeance": "2",
  "typeVote": {
    "codeTypeVote": "SPO",
    "libelleTypeVote": "scrutin public ordinaire",
    "typeMajorite": "majorité absolue des suffrages exprimés"
  },
  "sort": {
    "code": "rejeté",
    "libelle": "L'Assemblée nationale n'a pas adopté"
  },
  "titre": "le sous-amendement n° 1161 de M. Pradié à l'amendement n° 1058 du Gouvernement après l'article 5 quater du projet de loi pour une école de la confiance (première lecture).",
  "demandeur": {
    "texte": "Président du groupe \"Les Républicains\""
  },
  "objet": {
    "libelle": "le sous-amendement n° 1161 de M. Pradié à l'amendement n° 1058 du Gouvernement après l'article 5 quater du projet de loi pour une école de la confiance (première lecture)."
  },
  "modePublicationDesVotes": "DecompteNominatif",
  "syntheseVote": {
    "nombreVotants": "63",
    "suffragesExprimes": "61",
    "nbrSuffragesRequis": "31",
    "annonce": "L'Assemblée nationale n'a pas adopté",
    "decompte": {
      "pour": "20",
      "contre": "41",
      "nonVotants": "2",
      "abstentions": "2",
      "nonVotantsVolontaires": "0"
    }
  },
  "ventilationVotes": {
    "organeRef": "PO717460",
    "groupes": [
      {
        "organeRef": "PO730964",
        "nombreMembresGroupe": "306",
        "vote": {
          "positionMajoritaire": "contre",
          "decompteVoix": {
            "pour": "0",
            "contre": "37",
            "nonVotants": "2",
            "abstentions": "0",
            "nonVotantsVolontaires": "0"
          },
          "decompteNominatif": {
            "nonVotants": [
              {
                "acteurRef": "PA606171",
                "mandatRef": "PM722632",
                "causePositionVote": "PAN"
              },
              {
                "acteurRef": "PA721824",
                "mandatRef": "PM723394",
                "causePositionVote": "PSE"
              }
            ],
            "contre": [
              {
                "acteurRef": "PA720492",
                "mandatRef": "PM722980",
                "parDelegation": false
              },
              {
                "acteurRef": "PA717379",
                "mandatRef": "PM723282",
                "parDelegation": false
              },
              {
                "acteurRef": "PA719032",
                "mandatRef": "PM722538",
                "parDelegation": false
              },
              {
                "acteurRef": "PA719162",
                "mandatRef": "PM722580",
                "parDelegation": false
              },
              {
                "acteurRef": "PA719170",
                "mandatRef": "PM722582",
                "parDelegation": false
              },
              {
                "acteurRef": "PA719230",
                "mandatRef": "PM722600",
                "parDelegation": false
              },
              {
                "acteurRef": "PA719350",
                "mandatRef": "PM722634",
                "parDelegation": false
              },
              {
                "acteurRef": "PA719404",
                "mandatRef": "PM722652",
                "parDelegation": false
              },
              {
                "acteurRef": "PA719790",
                "mandatRef": "PM722764",
                "parDelegation": false
              },
              {
                "acteurRef": "PA719814",
                "mandatRef": "PM722770",
                "parDelegation": false
              },
              {
                "acteurRef": "PA719830",
                "mandatRef": "PM722774",
                "parDelegation": false
              },
              {
                "acteurRef": "PA719866",
                "mandatRef": "PM722784",
                "parDelegation": false
              },
              {
                "acteurRef": "PA720030",
                "mandatRef": "PM722838",
                "parDelegation": false
              },
              {
                "acteurRef": "PA720124",
                "mandatRef": "PM722866",
                "parDelegation": false
              },
              {
                "acteurRef": "PA720154",
                "mandatRef": "PM722876",
                "parDelegation": false
              },
              {
                "acteurRef": "PA720214",
                "mandatRef": "PM722894",
                "parDelegation": false
              },
              {
                "acteurRef": "PA720480",
                "mandatRef": "PM722976",
                "parDelegation": false
              },
              {
                "acteurRef": "PA720568",
                "mandatRef": "PM723002",
                "parDelegation": false
              },
              {
                "acteurRef": "PA720590",
                "mandatRef": "PM723010",
                "parDelegation": false
              },
              {
                "acteurRef": "PA720754",
                "mandatRef": "PM723066",
                "parDelegation": false
              },
              {
                "acteurRef": "PA720854",
                "mandatRef": "PM723096",
                "parDelegation": false
              },
              {
                "acteurRef": "PA720900",
                "mandatRef": "PM723108",
                "parDelegation": false
              },
              {
                "acteurRef": "PA720932",
                "mandatRef": "PM723116",
                "parDelegation": false
              },
              {
                "acteurRef": "PA721218",
                "mandatRef": "PM723206",
                "parDelegation": false
              },
              {
                "acteurRef": "PA721328",
                "mandatRef": "PM723240",
                "parDelegation": false
              },
              {
                "acteurRef": "PA721426",
                "mandatRef": "PM723270",
                "parDelegation": false
              },
              {
                "acteurRef": "PA721844",
                "mandatRef": "PM723400",
                "parDelegation": false
              },
              {
                "acteurRef": "PA721888",
                "mandatRef": "PM723412",
                "parDelegation": false
              },
              {
                "acteurRef": "PA721946",
                "mandatRef": "PM723430",
                "parDelegation": false
              },
              {
                "acteurRef": "PA722062",
                "mandatRef": "PM723462",
                "parDelegation": false
              },
              {
                "acteurRef": "PA722070",
                "mandatRef": "PM723464",
                "parDelegation": false
              },
              {
                "acteurRef": "PA722268",
                "mandatRef": "PM723522",
                "parDelegation": false
              },
              {
                "acteurRef": "PA724827",
                "mandatRef": "PM754304",
                "parDelegation": false
              },
              {
                "acteurRef": "PA643205",
                "mandatRef": "PM723358",
                "parDelegation": false
              },
              {
                "acteurRef": "PA719326",
                "mandatRef": "PM733709",
                "parDelegation": false
              },
              {
                "acteurRef": "PA719910",
                "mandatRef": "PM759347",
                "parDelegation": false
              },
              {
                "acteurRef": "PA722194",
                "mandatRef": "PM760311",
                "parDelegation": false
              }
            ]
          }
        }
      },
      {
        "organeRef": "PO730934",
        "nombreMembresGroupe": "104",
        "vote": {
          "positionMajoritaire": "pour",
          "decompteVoix": {
            "pour": "10",
            "contre": "0",
            "nonVotants": "0",
            "abstentions": "0",
            "nonVotantsVolontaires": "0"
          },
          "decompteNominatif": {
            "pour": [
              {
                "acteurRef": "PA345722",
                "mandatRef": "PM723428",
                "parDelegation": false
              },
              {
                "acteurRef": "PA606712",
                "mandatRef": "PM722756",
                "parDelegation": false
              },
              {
                "acteurRef": "PA1874",
                "mandatRef": "PM722598",
                "parDelegation": false
              },
              {
                "acteurRef": "PA720586",
                "mandatRef": "PM723008",
                "parDelegation": false
              },
              {
                "acteurRef": "PA266776",
                "mandatRef": "PM723542",
                "parDelegation": false
              },
              {
                "acteurRef": "PA330008",
                "mandatRef": "PM722416",
                "parDelegation": false
              },
              {
                "acteurRef": "PA608416",
                "mandatRef": "PM723540",
                "parDelegation": false
              },
              {
                "acteurRef": "PA718884",
                "mandatRef": "PM722488",
                "parDelegation": false
              },
              {
                "acteurRef": "PA720100",
                "mandatRef": "PM722860",
                "parDelegation": false
              },
              {
                "acteurRef": "PA720630",
                "mandatRef": "PM723020",
                "parDelegation": false
              }
            ]
          }
        }
      },
      {
        "organeRef": "PO730970",
        "nombreMembresGroupe": "46",
        "vote": {
          "positionMajoritaire": "contre",
          "decompteVoix": {
            "pour": "0",
            "contre": "4",
            "nonVotants": "0",
            "abstentions": "1",
            "nonVotantsVolontaires": "1"
          },
          "decompteNominatif": {
            "contre": [
              {
                "acteurRef": "PA720598",
                "mandatRef": "PM723012",
                "parDelegation": false
              },
              {
                "acteurRef": "PA719044",
                "mandatRef": "PM722542",
                "parDelegation": false
              },
              {
                "acteurRef": "PA719640",
                "mandatRef": "PM722718",
                "parDelegation": false
              },
              {
                "acteurRef": "PA720256",
                "mandatRef": "PM722908",
                "parDelegation": false
              }
            ],
            "abstentions": [
              {
                "acteurRef": "PA721234",
                "mandatRef": "PM723210",
                "parDelegation": false
              }
            ]
          }
        }
      },
      {
        "organeRef": "PO744425",
        "nombreMembresGroupe": "29",
        "vote": {
          "positionMajoritaire": "pour",
          "decompteVoix": {
            "pour": "0",
            "contre": "0",
            "nonVotants": "0",
            "abstentions": "0",
            "nonVotantsVolontaires": "0"
          },
          "decompteNominatif": {}
        }
      },
      {
        "organeRef": "PO758835",
        "nombreMembresGroupe": "29",
        "vote": {
          "positionMajoritaire": "pour",
          "decompteVoix": {
            "pour": "5",
            "contre": "0",
            "nonVotants": "0",
            "abstentions": "0",
            "nonVotantsVolontaires": "0"
          },
          "decompteNominatif": {
            "pour": [
              {
                "acteurRef": "PA267233",
                "mandatRef": "PM723500",
                "parDelegation": false
              },
              {
                "acteurRef": "PA332614",
                "mandatRef": "PM722812",
                "parDelegation": false
              },
              {
                "acteurRef": "PA720988",
                "mandatRef": "PM723132",
                "parDelegation": false
              },
              {
                "acteurRef": "PA608741",
                "mandatRef": "PM757984",
                "parDelegation": false
              },
              {
                "acteurRef": "PA340357",
                "mandatRef": "PM747435",
                "parDelegation": false
              }
            ]
          }
        }
      },
      {
        "organeRef": "PO730958",
        "nombreMembresGroupe": "17",
        "vote": {
          "positionMajoritaire": "pour",
          "decompteVoix": {
            "pour": "1",
            "contre": "0",
            "nonVotants": "0",
            "abstentions": "1",
            "nonVotantsVolontaires": "1"
          },
          "decompteNominatif": {
            "pour": [
              {
                "acteurRef": "PA721960",
                "mandatRef": "PM723434",
                "parDelegation": false
              }
            ],
            "abstentions": [
              {
                "acteurRef": "PA721226",
                "mandatRef": "PM723208",
                "parDelegation": false
              }
            ]
          }
        }
      },
      {
        "organeRef": "PO730940",
        "nombreMembresGroupe": "16",
        "vote": {
          "positionMajoritaire": "pour",
          "decompteVoix": {
            "pour": "1",
            "contre": "0",
            "nonVotants": "0",
            "abstentions": "0",
            "nonVotantsVolontaires": "0"
          },
          "decompteNominatif": {
            "pour": [
              {
                "acteurRef": "PA721896",
                "mandatRef": "PM723414",
                "parDelegation": false
              }
            ]
          }
        }
      },
      {
        "organeRef": "PO759900",
        "nombreMembresGroupe": "16",
        "vote": {
          "positionMajoritaire": "pour",
          "decompteVoix": {
            "pour": "2",
            "contre": "0",
            "nonVotants": "0",
            "abstentions": "0",
            "nonVotantsVolontaires": "0"
          },
          "decompteNominatif": {
            "pour": [
              {
                "acteurRef": "PA405480",
                "mandatRef": "PM723118",
                "parDelegation": false
              },
              {
                "acteurRef": "PA607619",
                "mandatRef": "PM722936",
                "parDelegation": false
              }
            ]
          }
        }
      },
      {
        "organeRef": "PO723569",
        "nombreMembresGroupe": "14",
        "vote": {
          "positionMajoritaire": "pour",
          "decompteVoix": {
            "pour": "1",
            "contre": "0",
            "nonVotants": "0",
            "abstentions": "0",
            "nonVotantsVolontaires": "0"
          },
          "decompteNominatif": {
            "pour": [
              {
                "acteurRef": "PA719608",
                "mandatRef": "PM722710",
                "parDelegation": false
              }
            ]
          }
        }
      }
    ]
  }
}