{
  "uid": "VTANR5L15V981",
  "numero": "981",
  "organeRef": "PO717460",
  "legislature": "15",
  "sessionRef": "SCR5A2018O1",
  "seanceRef": "RUANR5L15S2018IDS21121",
  "dateScrutin": "2018-06-20T02:00:00.000+02:00",
  "quantiemeJourSeance": "1",
  "typeVote": {
    "codeTypeVote": "SPO",
    "libelleTypeVote": "scrutin public ordinaire",
    "typeMajorite": "majorité absolue des suffrages exprimés"
  },
  "sort": {
    "code": "adopté",
    "libelle": "l'Assemblée nationale a adopté"
  },
  "titre": "la proposition de résolution concernant les certificats d'économie d'énergie (art. 34-1 de la Constitution).",
  "demandeur": {
    "texte": "Président du groupe \"La République en Marche\""
  },
  "objet": {
    "libelle": "la proposition de résolution concernant les certificats d'économie d'énergie (art. 34-1 de la Constitution)."
  },
  "modePublicationDesVotes": "DecompteNominatif",
  "syntheseVote": {
    "nombreVotants": "60",
    "suffragesExprimes": "56",
    "nbrSuffragesRequis": "29",
    "annonce": "l'Assemblée nationale a adopté",
    "decompte": {
      "pour": "56",
      "contre": "0",
      "nonVotants": "2",
      "abstentions": "4",
      "nonVotantsVolontaires": "0"
    }
  },
  "ventilationVotes": {
    "organeRef": "PO717460",
    "groupes": [
      {
        "organeRef": "PO730964",
        "nombreMembresGroupe": "312",
        "vote": {
          "positionMajoritaire": "pour",
          "decompteVoix": {
            "pour": "34",
            "contre": "0",
            "nonVotants": "2",
            "abstentions": "0",
            "nonVotantsVolontaires": "0"
          },
          "decompteNominatif": {
            "nonVotants": [
              {
                "acteurRef": "PA332747",
                "mandatRef": "PM722798",
                "causePositionVote": "PAN"
              },
              {
                "acteurRef": "PA721824",
                "mandatRef": "PM723394",
                "causePositionVote": "PSE"
              }
            ],
            "pour": [
              {
                "acteurRef": "PA643127",
                "mandatRef": "PM722636",
                "parDelegation": false
              },
              {
                "acteurRef": "PA267336",
                "mandatRef": "PM722434",
                "parDelegation": false
              },
              {
                "acteurRef": "PA720492",
                "mandatRef": "PM722980",
                "parDelegation": false
              },
              {
                "acteurRef": "PA718736",
                "mandatRef": "PM722440",
                "parDelegation": false
              },
              {
                "acteurRef": "PA718794",
                "mandatRef": "PM722460",
                "parDelegation": false
              },
              {
                "acteurRef": "PA718962",
                "mandatRef": "PM722514",
                "parDelegation": false
              },
              {
                "acteurRef": "PA719006",
                "mandatRef": "PM722530",
                "parDelegation": false
              },
              {
                "acteurRef": "PA719170",
                "mandatRef": "PM722582",
                "parDelegation": false
              },
              {
                "acteurRef": "PA719186",
                "mandatRef": "PM722588",
                "parDelegation": false
              },
              {
                "acteurRef": "PA719250",
                "mandatRef": "PM722606",
                "parDelegation": false
              },
              {
                "acteurRef": "PA719512",
                "mandatRef": "PM722682",
                "parDelegation": false
              },
              {
                "acteurRef": "PA719710",
                "mandatRef": "PM722738",
                "parDelegation": false
              },
              {
                "acteurRef": "PA719740",
                "mandatRef": "PM722748",
                "parDelegation": false
              },
              {
                "acteurRef": "PA719850",
                "mandatRef": "PM722780",
                "parDelegation": false
              },
              {
                "acteurRef": "PA720022",
                "mandatRef": "PM722836",
                "parDelegation": false
              },
              {
                "acteurRef": "PA720138",
                "mandatRef": "PM722872",
                "parDelegation": false
              },
              {
                "acteurRef": "PA720146",
                "mandatRef": "PM722874",
                "parDelegation": false
              },
              {
                "acteurRef": "PA720222",
                "mandatRef": "PM722896",
                "parDelegation": false
              },
              {
                "acteurRef": "PA720268",
                "mandatRef": "PM722912",
                "parDelegation": false
              },
              {
                "acteurRef": "PA720298",
                "mandatRef": "PM722922",
                "parDelegation": false
              },
              {
                "acteurRef": "PA720560",
                "mandatRef": "PM723000",
                "parDelegation": false
              },
              {
                "acteurRef": "PA720878",
                "mandatRef": "PM723102",
                "parDelegation": false
              },
              {
                "acteurRef": "PA721150",
                "mandatRef": "PM723188",
                "parDelegation": false
              },
              {
                "acteurRef": "PA721218",
                "mandatRef": "PM723206",
                "parDelegation": false
              },
              {
                "acteurRef": "PA721434",
                "mandatRef": "PM723272",
                "parDelegation": false
              },
              {
                "acteurRef": "PA721450",
                "mandatRef": "PM723278",
                "parDelegation": false
              },
              {
                "acteurRef": "PA721542",
                "mandatRef": "PM723308",
                "parDelegation": false
              },
              {
                "acteurRef": "PA721584",
                "mandatRef": "PM723324",
                "parDelegation": false
              },
              {
                "acteurRef": "PA721670",
                "mandatRef": "PM723350",
                "parDelegation": false
              },
              {
                "acteurRef": "PA721860",
                "mandatRef": "PM723404",
                "parDelegation": false
              },
              {
                "acteurRef": "PA721888",
                "mandatRef": "PM723412",
                "parDelegation": false
              },
              {
                "acteurRef": "PA722320",
                "mandatRef": "PM723538",
                "parDelegation": false
              },
              {
                "acteurRef": "PA722366",
                "mandatRef": "PM723554",
                "parDelegation": false
              },
              {
                "acteurRef": "PA724827",
                "mandatRef": "PM754304",
                "parDelegation": false
              }
            ]
          }
        }
      },
      {
        "organeRef": "PO730934",
        "nombreMembresGroupe": "102",
        "vote": {
          "positionMajoritaire": "pour",
          "decompteVoix": {
            "pour": "7",
            "contre": "0",
            "nonVotants": "0",
            "abstentions": "0",
            "nonVotantsVolontaires": "0"
          },
          "decompteNominatif": {
            "pour": [
              {
                "acteurRef": "PA267440",
                "mandatRef": "PM722522",
                "parDelegation": false
              },
              {
                "acteurRef": "PA2960",
                "mandatRef": "PM723006",
                "parDelegation": false
              },
              {
                "acteurRef": "PA266776",
                "mandatRef": "PM723542",
                "parDelegation": false
              },
              {
                "acteurRef": "PA332523",
                "mandatRef": "PM722792",
                "parDelegation": false
              },
              {
                "acteurRef": "PA721410",
                "mandatRef": "PM723266",
                "parDelegation": false
              },
              {
                "acteurRef": "PA609726",
                "mandatRef": "PM723426",
                "parDelegation": false
              },
              {
                "acteurRef": "PA719272",
                "mandatRef": "PM722612",
                "parDelegation": false
              }
            ]
          }
        }
      },
      {
        "organeRef": "PO730970",
        "nombreMembresGroupe": "47",
        "vote": {
          "positionMajoritaire": "pour",
          "decompteVoix": {
            "pour": "4",
            "contre": "0",
            "nonVotants": "0",
            "abstentions": "0",
            "nonVotantsVolontaires": "0"
          },
          "decompteNominatif": {
            "pour": [
              {
                "acteurRef": "PA720162",
                "mandatRef": "PM722878",
                "parDelegation": false
              },
              {
                "acteurRef": "PA720720",
                "mandatRef": "PM723056",
                "parDelegation": false
              },
              {
                "acteurRef": "PA721992",
                "mandatRef": "PM723442",
                "parDelegation": false
              },
              {
                "acteurRef": "PA722284",
                "mandatRef": "PM723528",
                "parDelegation": false
              }
            ]
          }
        }
      },
      {
        "organeRef": "PO744425",
        "nombreMembresGroupe": "32",
        "vote": {
          "positionMajoritaire": "pour",
          "decompteVoix": {
            "pour": "5",
            "contre": "0",
            "nonVotants": "0",
            "abstentions": "0",
            "nonVotantsVolontaires": "0"
          },
          "decompteNominatif": {
            "pour": [
              {
                "acteurRef": "PA942",
                "mandatRef": "PM722900",
                "parDelegation": false
              },
              {
                "acteurRef": "PA331582",
                "mandatRef": "PM722646",
                "parDelegation": false
              },
              {
                "acteurRef": "PA332228",
                "mandatRef": "PM722754",
                "parDelegation": false
              },
              {
                "acteurRef": "PA720230",
                "mandatRef": "PM722898",
                "parDelegation": false
              },
              {
                "acteurRef": "PA267766",
                "mandatRef": "PM722970",
                "parDelegation": false
              }
            ]
          }
        }
      },
      {
        "organeRef": "PO730946",
        "nombreMembresGroupe": "30",
        "vote": {
          "positionMajoritaire": "pour",
          "decompteVoix": {
            "pour": "2",
            "contre": "0",
            "nonVotants": "0",
            "abstentions": "2",
            "nonVotantsVolontaires": "2"
          },
          "decompteNominatif": {
            "pour": [
              {
                "acteurRef": "PA332614",
                "mandatRef": "PM722812",
                "parDelegation": false
              },
              {
                "acteurRef": "PA342415",
                "mandatRef": "PM722826",
                "parDelegation": false
              }
            ],
            "abstentions": [
              {
                "acteurRef": "PA605069",
                "mandatRef": "PM722424",
                "parDelegation": false
              },
              {
                "acteurRef": "PA1008",
                "mandatRef": "PM722704",
                "parDelegation": false
              }
            ]
          }
        }
      },
      {
        "organeRef": "PO723569",
        "nombreMembresGroupe": "21",
        "vote": {
          "positionMajoritaire": "pour",
          "decompteVoix": {
            "pour": "3",
            "contre": "0",
            "nonVotants": "0",
            "abstentions": "0",
            "nonVotantsVolontaires": "0"
          },
          "decompteNominatif": {
            "pour": [
              {
                "acteurRef": "PA720468",
                "mandatRef": "PM722972",
                "parDelegation": false
              },
              {
                "acteurRef": "PA720606",
                "mandatRef": "PM723014",
                "parDelegation": false
              },
              {
                "acteurRef": "PA720822",
                "mandatRef": "PM723086",
                "parDelegation": false
              }
            ]
          }
        }
      },
      {
        "organeRef": "PO730958",
        "nombreMembresGroupe": "17",
        "vote": {
          "positionMajoritaire": "abstention",
          "decompteVoix": {
            "pour": "0",
            "contre": "0",
            "nonVotants": "0",
            "abstentions": "2",
            "nonVotantsVolontaires": "2"
          },
          "decompteNominatif": {
            "abstentions": [
              {
                "acteurRef": "PA588884",
                "mandatRef": "PM723226",
                "parDelegation": false
              },
              {
                "acteurRef": "PA720892",
                "mandatRef": "PM723106",
                "parDelegation": false
              }
            ]
          }
        }
      },
      {
        "organeRef": "PO730940",
        "nombreMembresGroupe": "16",
        "vote": {
          "positionMajoritaire": "pour",
          "decompteVoix": {
            "pour": "1",
            "contre": "0",
            "nonVotants": "0",
            "abstentions": "0",
            "nonVotantsVolontaires": "0"
          },
          "decompteNominatif": {
            "pour": [
              {
                "acteurRef": "PA718720",
                "mandatRef": "PM722436",
                "parDelegation": false
              }
            ]
          }
        }
      }
    ]
  }
}