{
  "uid": "VTANR5L15V210",
  "numero": "210",
  "organeRef": "PO717460",
  "legislature": "15",
  "sessionRef": "SCR5A2018O1",
  "seanceRef": "RUANR5L15S2018IDS20729",
  "dateScrutin": "2017-10-31T01:00:00.000+01:00",
  "quantiemeJourSeance": "1",
  "typeVote": {
    "codeTypeVote": "SPO",
    "libelleTypeVote": "scrutin public ordinaire",
    "typeMajorite": "majorité absolue des suffrages exprimés"
  },
  "sort": {
    "code": "rejeté",
    "libelle": "L'Assemblée nationale n'a pas adopté"
  },
  "titre": "l'amendement n? 306 de Mme Rabault a l'article 29 et Etat B de la seconde partie du projet de loi de finances pour 2018 (premiere lecture) - Mission Anciens combattants, memoire et liens avec la Nation",
  "demandeur": {
    "texte": "President du groupe \"Nouvelle Gauche\""
  },
  "objet": {
    "libelle": "l'amendement n? 306 de Mme Rabault a l'article 29 et Etat B de la seconde partie du projet de loi de finances pour 2018 (premiere lecture) - Mission Anciens combattants, memoire et liens avec la Nation"
  },
  "modePublicationDesVotes": "DecompteNominatif",
  "syntheseVote": {
    "nombreVotants": "90",
    "suffragesExprimes": "89",
    "nbrSuffragesRequis": "45",
    "annonce": "L'Assemblée nationale n'a pas adopté",
    "decompte": {
      "pour": "32",
      "contre": "57",
      "nonVotants": "1",
      "abstentions": "1",
      "nonVotantsVolontaires": "0"
    }
  },
  "ventilationVotes": {
    "organeRef": "PO717460",
    "groupes": [
      {
        "organeRef": "PO730964",
        "nombreMembresGroupe": "313",
        "vote": {
          "positionMajoritaire": "contre",
          "decompteVoix": {
            "pour": "1",
            "contre": "51",
            "nonVotants": "1",
            "abstentions": "1",
            "nonVotantsVolontaires": "1"
          },
          "decompteNominatif": {
            "nonVotants": [
              {
                "acteurRef": "PA332747",
                "mandatRef": "PM722798",
                "causePositionVote": "PAN"
              }
            ],
            "pour": [
              {
                "acteurRef": "PA720030",
                "mandatRef": "PM722838",
                "parDelegation": false
              }
            ],
            "contre": [
              {
                "acteurRef": "PA643127",
                "mandatRef": "PM722636",
                "parDelegation": false
              },
              {
                "acteurRef": "PA719952",
                "mandatRef": "PM722814",
                "parDelegation": false
              },
              {
                "acteurRef": "PA719118",
                "mandatRef": "PM722568",
                "parDelegation": false
              },
              {
                "acteurRef": "PA721880",
                "mandatRef": "PM723410",
                "parDelegation": false
              },
              {
                "acteurRef": "PA722190",
                "mandatRef": "PM723498",
                "parDelegation": false
              },
              {
                "acteurRef": "PA606202",
                "mandatRef": "PM722698",
                "parDelegation": false
              },
              {
                "acteurRef": "PA672",
                "mandatRef": "PM723230",
                "parDelegation": false
              },
              {
                "acteurRef": "PA720492",
                "mandatRef": "PM722980",
                "parDelegation": false
              },
              {
                "acteurRef": "PA718756",
                "mandatRef": "PM722446",
                "parDelegation": false
              },
              {
                "acteurRef": "PA718794",
                "mandatRef": "PM722460",
                "parDelegation": false
              },
              {
                "acteurRef": "PA718802",
                "mandatRef": "PM722462",
                "parDelegation": false
              },
              {
                "acteurRef": "PA718918",
                "mandatRef": "PM722500",
                "parDelegation": false
              },
              {
                "acteurRef": "PA719024",
                "mandatRef": "PM722536",
                "parDelegation": false
              },
              {
                "acteurRef": "PA719162",
                "mandatRef": "PM722580",
                "parDelegation": false
              },
              {
                "acteurRef": "PA719230",
                "mandatRef": "PM722600",
                "parDelegation": false
              },
              {
                "acteurRef": "PA719294",
                "mandatRef": "PM722618",
                "parDelegation": false
              },
              {
                "acteurRef": "PA719330",
                "mandatRef": "PM722628",
                "parDelegation": false
              },
              {
                "acteurRef": "PA719404",
                "mandatRef": "PM722652",
                "parDelegation": false
              },
              {
                "acteurRef": "PA719440",
                "mandatRef": "PM722664",
                "parDelegation": false
              },
              {
                "acteurRef": "PA719472",
                "mandatRef": "PM722672",
                "parDelegation": false
              },
              {
                "acteurRef": "PA719550",
                "mandatRef": "PM722694",
                "parDelegation": false
              },
              {
                "acteurRef": "PA719692",
                "mandatRef": "PM722732",
                "parDelegation": false
              },
              {
                "acteurRef": "PA719790",
                "mandatRef": "PM722764",
                "parDelegation": false
              },
              {
                "acteurRef": "PA719814",
                "mandatRef": "PM722770",
                "parDelegation": false
              },
              {
                "acteurRef": "PA719922",
                "mandatRef": "PM722802",
                "parDelegation": false
              },
              {
                "acteurRef": "PA719972",
                "mandatRef": "PM722820",
                "parDelegation": false
              },
              {
                "acteurRef": "PA720022",
                "mandatRef": "PM722836",
                "parDelegation": false
              },
              {
                "acteurRef": "PA720066",
                "mandatRef": "PM722848",
                "parDelegation": false
              },
              {
                "acteurRef": "PA643175",
                "mandatRef": "PM722868",
                "parDelegation": false
              },
              {
                "acteurRef": "PA720154",
                "mandatRef": "PM722876",
                "parDelegation": false
              },
              {
                "acteurRef": "PA720214",
                "mandatRef": "PM722894",
                "parDelegation": false
              },
              {
                "acteurRef": "PA720268",
                "mandatRef": "PM722912",
                "parDelegation": false
              },
              {
                "acteurRef": "PA720278",
                "mandatRef": "PM722916",
                "parDelegation": false
              },
              {
                "acteurRef": "PA720622",
                "mandatRef": "PM723018",
                "parDelegation": false
              },
              {
                "acteurRef": "PA720830",
                "mandatRef": "PM723088",
                "parDelegation": false
              },
              {
                "acteurRef": "PA721150",
                "mandatRef": "PM723188",
                "parDelegation": false
              },
              {
                "acteurRef": "PA721158",
                "mandatRef": "PM723190",
                "parDelegation": false
              },
              {
                "acteurRef": "PA721194",
                "mandatRef": "PM723200",
                "parDelegation": false
              },
              {
                "acteurRef": "PA721522",
                "mandatRef": "PM723300",
                "parDelegation": false
              },
              {
                "acteurRef": "PA721542",
                "mandatRef": "PM723308",
                "parDelegation": false
              },
              {
                "acteurRef": "PA721764",
                "mandatRef": "PM723376",
                "parDelegation": false
              },
              {
                "acteurRef": "PA721776",
                "mandatRef": "PM723380",
                "parDelegation": false
              },
              {
                "acteurRef": "PA721808",
                "mandatRef": "PM723388",
                "parDelegation": false
              },
              {
                "acteurRef": "PA721844",
                "mandatRef": "PM723400",
                "parDelegation": false
              },
              {
                "acteurRef": "PA721946",
                "mandatRef": "PM723430",
                "parDelegation": false
              },
              {
                "acteurRef": "PA722094",
                "mandatRef": "PM723470",
                "parDelegation": false
              },
              {
                "acteurRef": "PA722118",
                "mandatRef": "PM723476",
                "parDelegation": false
              },
              {
                "acteurRef": "PA722150",
                "mandatRef": "PM723486",
                "parDelegation": false
              },
              {
                "acteurRef": "PA722228",
                "mandatRef": "PM723512",
                "parDelegation": false
              },
              {
                "acteurRef": "PA719326",
                "mandatRef": "PM733709",
                "parDelegation": false
              },
              {
                "acteurRef": "PA721564",
                "mandatRef": "PM733723",
                "parDelegation": false
              }
            ],
            "abstentions": [
              {
                "acteurRef": "PA721568",
                "mandatRef": "PM723316",
                "parDelegation": false
              }
            ]
          }
        }
      },
      {
        "organeRef": "PO730934",
        "nombreMembresGroupe": "100",
        "vote": {
          "positionMajoritaire": "pour",
          "decompteVoix": {
            "pour": "18",
            "contre": "0",
            "nonVotants": "0",
            "abstentions": "0",
            "nonVotantsVolontaires": "0"
          },
          "decompteNominatif": {
            "pour": [
              {
                "acteurRef": "PA606712",
                "mandatRef": "PM722756",
                "parDelegation": false
              },
              {
                "acteurRef": "PA1874",
                "mandatRef": "PM722598",
                "parDelegation": false
              },
              {
                "acteurRef": "PA2492",
                "mandatRef": "PM722566",
                "parDelegation": false
              },
              {
                "acteurRef": "PA334843",
                "mandatRef": "PM723534",
                "parDelegation": false
              },
              {
                "acteurRef": "PA267289",
                "mandatRef": "PM722854",
                "parDelegation": false
              },
              {
                "acteurRef": "PA266776",
                "mandatRef": "PM723542",
                "parDelegation": false
              },
              {
                "acteurRef": "PA721636",
                "mandatRef": "PM723340",
                "parDelegation": false
              },
              {
                "acteurRef": "PA1012",
                "mandatRef": "PM722418",
                "parDelegation": false
              },
              {
                "acteurRef": "PA330008",
                "mandatRef": "PM722416",
                "parDelegation": false
              },
              {
                "acteurRef": "PA342935",
                "mandatRef": "PM722856",
                "parDelegation": false
              },
              {
                "acteurRef": "PA721968",
                "mandatRef": "PM723436",
                "parDelegation": false
              },
              {
                "acteurRef": "PA720684",
                "mandatRef": "PM723040",
                "parDelegation": false
              },
              {
                "acteurRef": "PA718780",
                "mandatRef": "PM722454",
                "parDelegation": false
              },
              {
                "acteurRef": "PA718784",
                "mandatRef": "PM722456",
                "parDelegation": false
              },
              {
                "acteurRef": "PA643103",
                "mandatRef": "PM722614",
                "parDelegation": false
              },
              {
                "acteurRef": "PA720386",
                "mandatRef": "PM722948",
                "parDelegation": false
              },
              {
                "acteurRef": "PA642847",
                "mandatRef": "PM722954",
                "parDelegation": false
              },
              {
                "acteurRef": "PA346218",
                "mandatRef": "PM723348",
                "parDelegation": false
              }
            ]
          }
        }
      },
      {
        "organeRef": "PO730970",
        "nombreMembresGroupe": "47",
        "vote": {
          "positionMajoritaire": "contre",
          "decompteVoix": {
            "pour": "0",
            "contre": "6",
            "nonVotants": "0",
            "abstentions": "0",
            "nonVotantsVolontaires": "0"
          },
          "decompteNominatif": {
            "contre": [
              {
                "acteurRef": "PA721418",
                "mandatRef": "PM723268",
                "parDelegation": false
              },
              {
                "acteurRef": "PA721734",
                "mandatRef": "PM723368",
                "parDelegation": false
              },
              {
                "acteurRef": "PA719266",
                "mandatRef": "PM722610",
                "parDelegation": false
              },
              {
                "acteurRef": "PA719640",
                "mandatRef": "PM722718",
                "parDelegation": false
              },
              {
                "acteurRef": "PA720002",
                "mandatRef": "PM722830",
                "parDelegation": false
              },
              {
                "acteurRef": "PA721742",
                "mandatRef": "PM723370",
                "parDelegation": false
              }
            ]
          }
        }
      },
      {
        "organeRef": "PO730952",
        "nombreMembresGroupe": "35",
        "vote": {
          "positionMajoritaire": "pour",
          "decompteVoix": {
            "pour": "3",
            "contre": "0",
            "nonVotants": "0",
            "abstentions": "0",
            "nonVotantsVolontaires": "0"
          },
          "decompteNominatif": {
            "pour": [
              {
                "acteurRef": "PA942",
                "mandatRef": "PM722900",
                "parDelegation": false
              },
              {
                "acteurRef": "PA332228",
                "mandatRef": "PM722754",
                "parDelegation": false
              },
              {
                "acteurRef": "PA720230",
                "mandatRef": "PM722898",
                "parDelegation": false
              }
            ]
          }
        }
      },
      {
        "organeRef": "PO730946",
        "nombreMembresGroupe": "31",
        "vote": {
          "positionMajoritaire": "pour",
          "decompteVoix": {
            "pour": "3",
            "contre": "0",
            "nonVotants": "0",
            "abstentions": "0",
            "nonVotantsVolontaires": "0"
          },
          "decompteNominatif": {
            "pour": [
              {
                "acteurRef": "PA429893",
                "mandatRef": "PM723104",
                "parDelegation": false
              },
              {
                "acteurRef": "PA332614",
                "mandatRef": "PM722812",
                "parDelegation": false
              },
              {
                "acteurRef": "PA609590",
                "mandatRef": "PM723326",
                "parDelegation": false
              }
            ]
          }
        }
      },
      {
        "organeRef": "PO723569",
        "nombreMembresGroupe": "18",
        "vote": {
          "positionMajoritaire": "pour",
          "decompteVoix": {
            "pour": "0",
            "contre": "0",
            "nonVotants": "0",
            "abstentions": "0",
            "nonVotantsVolontaires": "0"
          },
          "decompteNominatif": {}
        }
      },
      {
        "organeRef": "PO730958",
        "nombreMembresGroupe": "17",
        "vote": {
          "positionMajoritaire": "pour",
          "decompteVoix": {
            "pour": "4",
            "contre": "0",
            "nonVotants": "0",
            "abstentions": "0",
            "nonVotantsVolontaires": "0"
          },
          "decompteNominatif": {
            "pour": [
              {
                "acteurRef": "PA718868",
                "mandatRef": "PM722484",
                "parDelegation": false
              },
              {
                "acteurRef": "PA719676",
                "mandatRef": "PM722728",
                "parDelegation": false
              },
              {
                "acteurRef": "PA720846",
                "mandatRef": "PM723094",
                "parDelegation": false
              },
              {
                "acteurRef": "PA721210",
                "mandatRef": "PM723204",
                "parDelegation": false
              }
            ]
          }
        }
      },
      {
        "organeRef": "PO730940",
        "nombreMembresGroupe": "16",
        "vote": {
          "positionMajoritaire": "pour",
          "decompteVoix": {
            "pour": "3",
            "contre": "0",
            "nonVotants": "0",
            "abstentions": "0",
            "nonVotantsVolontaires": "0"
          },
          "decompteNominatif": {
            "pour": [
              {
                "acteurRef": "PA267306",
                "mandatRef": "PM723054",
                "parDelegation": false
              },
              {
                "acteurRef": "PA720692",
                "mandatRef": "PM723042",
                "parDelegation": false
              },
              {
                "acteurRef": "PA721270",
                "mandatRef": "PM723220",
                "parDelegation": false
              }
            ]
          }
        }
      }
    ]
  },
  "miseAuPoint": {
    "nonVotantsVolontaires": [
      {
        "acteurRef": "PA722150",
        "mandatRef": "PM723486"
      }
    ]
  }
}