{
  "uid": "VTANR5L15V823",
  "numero": "823",
  "organeRef": "PO717460",
  "legislature": "15",
  "sessionRef": "SCR5A2018O1",
  "seanceRef": "RUANR5L15S2018IDS21088",
  "dateScrutin": "2018-06-05T02:00:00.000+02:00",
  "quantiemeJourSeance": "3",
  "typeVote": {
    "codeTypeVote": "SPO",
    "libelleTypeVote": "scrutin public ordinaire",
    "typeMajorite": "majorité absolue des suffrages exprimés"
  },
  "sort": {
    "code": "rejeté",
    "libelle": "L'Assemblée nationale n'a pas adopté"
  },
  "titre": "l'amendement n° 1059 de M. Peu et les amendements identiques suivants à l'article 46 du projet de loi portant évolution du logement, de l'aménagement et du numérique (première lecture).",
  "demandeur": {
    "texte": "Président du groupe \"La France insoumise\"Président du groupe \"de la Gauche démocrate et républicaine\""
  },
  "objet": {
    "libelle": "l'amendement n° 1059 de M. Peu et les amendements identiques suivants à l'article 46 du projet de loi portant évolution du logement, de l'aménagement et du numérique (première lecture)."
  },
  "modePublicationDesVotes": "DecompteNominatif",
  "syntheseVote": {
    "nombreVotants": "175",
    "suffragesExprimes": "171",
    "nbrSuffragesRequis": "86",
    "annonce": "L'Assemblée nationale n'a pas adopté",
    "decompte": {
      "pour": "23",
      "contre": "148",
      "nonVotants": "2",
      "abstentions": "4",
      "nonVotantsVolontaires": "0"
    }
  },
  "ventilationVotes": {
    "organeRef": "PO717460",
    "groupes": [
      {
        "organeRef": "PO730964",
        "nombreMembresGroupe": "313",
        "vote": {
          "positionMajoritaire": "contre",
          "decompteVoix": {
            "pour": "0",
            "contre": "108",
            "nonVotants": "1",
            "abstentions": "1",
            "nonVotantsVolontaires": "1"
          },
          "decompteNominatif": {
            "nonVotants": [
              {
                "acteurRef": "PA332747",
                "mandatRef": "PM722798",
                "causePositionVote": "PAN"
              }
            ],
            "contre": [
              {
                "acteurRef": "PA721262",
                "mandatRef": "PM723218",
                "parDelegation": false
              },
              {
                "acteurRef": "PA722398",
                "mandatRef": "PM723562",
                "parDelegation": false
              },
              {
                "acteurRef": "PA2449",
                "mandatRef": "PM723036",
                "parDelegation": false
              },
              {
                "acteurRef": "PA643127",
                "mandatRef": "PM722636",
                "parDelegation": false
              },
              {
                "acteurRef": "PA720790",
                "mandatRef": "PM723078",
                "parDelegation": false
              },
              {
                "acteurRef": "PA719668",
                "mandatRef": "PM722726",
                "parDelegation": false
              },
              {
                "acteurRef": "PA343493",
                "mandatRef": "PM722938",
                "parDelegation": false
              },
              {
                "acteurRef": "PA334116",
                "mandatRef": "PM723030",
                "parDelegation": false
              },
              {
                "acteurRef": "PA718768",
                "mandatRef": "PM722450",
                "parDelegation": false
              },
              {
                "acteurRef": "PA605963",
                "mandatRef": "PM722584",
                "parDelegation": false
              },
              {
                "acteurRef": "PA607155",
                "mandatRef": "PM722832",
                "parDelegation": false
              },
              {
                "acteurRef": "PA721296",
                "mandatRef": "PM723228",
                "parDelegation": false
              },
              {
                "acteurRef": "PA719520",
                "mandatRef": "PM722684",
                "parDelegation": false
              },
              {
                "acteurRef": "PA721852",
                "mandatRef": "PM723402",
                "parDelegation": false
              },
              {
                "acteurRef": "PA720492",
                "mandatRef": "PM722980",
                "parDelegation": false
              },
              {
                "acteurRef": "PA718710",
                "mandatRef": "PM722432",
                "parDelegation": false
              },
              {
                "acteurRef": "PA718736",
                "mandatRef": "PM722440",
                "parDelegation": false
              },
              {
                "acteurRef": "PA718744",
                "mandatRef": "PM722442",
                "parDelegation": false
              },
              {
                "acteurRef": "PA718902",
                "mandatRef": "PM722496",
                "parDelegation": false
              },
              {
                "acteurRef": "PA718930",
                "mandatRef": "PM722504",
                "parDelegation": false
              },
              {
                "acteurRef": "PA718962",
                "mandatRef": "PM722514",
                "parDelegation": false
              },
              {
                "acteurRef": "PA719060",
                "mandatRef": "PM722546",
                "parDelegation": false
              },
              {
                "acteurRef": "PA719080",
                "mandatRef": "PM722554",
                "parDelegation": false
              },
              {
                "acteurRef": "PA719092",
                "mandatRef": "PM722560",
                "parDelegation": false
              },
              {
                "acteurRef": "PA719130",
                "mandatRef": "PM722572",
                "parDelegation": false
              },
              {
                "acteurRef": "PA719154",
                "mandatRef": "PM722578",
                "parDelegation": false
              },
              {
                "acteurRef": "PA719218",
                "mandatRef": "PM722596",
                "parDelegation": false
              },
              {
                "acteurRef": "PA719230",
                "mandatRef": "PM722600",
                "parDelegation": false
              },
              {
                "acteurRef": "PA719242",
                "mandatRef": "PM722604",
                "parDelegation": false
              },
              {
                "acteurRef": "PA719258",
                "mandatRef": "PM722608",
                "parDelegation": false
              },
              {
                "acteurRef": "PA719294",
                "mandatRef": "PM722618",
                "parDelegation": false
              },
              {
                "acteurRef": "PA719310",
                "mandatRef": "PM722622",
                "parDelegation": false
              },
              {
                "acteurRef": "PA719350",
                "mandatRef": "PM722634",
                "parDelegation": false
              },
              {
                "acteurRef": "PA719388",
                "mandatRef": "PM722648",
                "parDelegation": false
              },
              {
                "acteurRef": "PA719420",
                "mandatRef": "PM722656",
                "parDelegation": false
              },
              {
                "acteurRef": "PA719472",
                "mandatRef": "PM722672",
                "parDelegation": false
              },
              {
                "acteurRef": "PA719528",
                "mandatRef": "PM722686",
                "parDelegation": false
              },
              {
                "acteurRef": "PA719550",
                "mandatRef": "PM722694",
                "parDelegation": false
              },
              {
                "acteurRef": "PA719592",
                "mandatRef": "PM722706",
                "parDelegation": false
              },
              {
                "acteurRef": "PA719660",
                "mandatRef": "PM722724",
                "parDelegation": false
              },
              {
                "acteurRef": "PA719700",
                "mandatRef": "PM722734",
                "parDelegation": false
              },
              {
                "acteurRef": "PA719710",
                "mandatRef": "PM722738",
                "parDelegation": false
              },
              {
                "acteurRef": "PA719728",
                "mandatRef": "PM722744",
                "parDelegation": false
              },
              {
                "acteurRef": "PA719740",
                "mandatRef": "PM722748",
                "parDelegation": false
              },
              {
                "acteurRef": "PA719778",
                "mandatRef": "PM722760",
                "parDelegation": false
              },
              {
                "acteurRef": "PA719790",
                "mandatRef": "PM722764",
                "parDelegation": false
              },
              {
                "acteurRef": "PA719798",
                "mandatRef": "PM722766",
                "parDelegation": false
              },
              {
                "acteurRef": "PA719814",
                "mandatRef": "PM722770",
                "parDelegation": false
              },
              {
                "acteurRef": "PA719822",
                "mandatRef": "PM722772",
                "parDelegation": false
              },
              {
                "acteurRef": "PA719830",
                "mandatRef": "PM722774",
                "parDelegation": false
              },
              {
                "acteurRef": "PA719858",
                "mandatRef": "PM722782",
                "parDelegation": false
              },
              {
                "acteurRef": "PA719866",
                "mandatRef": "PM722784",
                "parDelegation": false
              },
              {
                "acteurRef": "PA719960",
                "mandatRef": "PM722816",
                "parDelegation": false
              },
              {
                "acteurRef": "PA720014",
                "mandatRef": "PM722834",
                "parDelegation": false
              },
              {
                "acteurRef": "PA720066",
                "mandatRef": "PM722848",
                "parDelegation": false
              },
              {
                "acteurRef": "PA720074",
                "mandatRef": "PM722850",
                "parDelegation": false
              },
              {
                "acteurRef": "PA720146",
                "mandatRef": "PM722874",
                "parDelegation": false
              },
              {
                "acteurRef": "PA720190",
                "mandatRef": "PM722886",
                "parDelegation": false
              },
              {
                "acteurRef": "PA720214",
                "mandatRef": "PM722894",
                "parDelegation": false
              },
              {
                "acteurRef": "PA720242",
                "mandatRef": "PM722902",
                "parDelegation": false
              },
              {
                "acteurRef": "PA720268",
                "mandatRef": "PM722912",
                "parDelegation": false
              },
              {
                "acteurRef": "PA720318",
                "mandatRef": "PM722928",
                "parDelegation": false
              },
              {
                "acteurRef": "PA720378",
                "mandatRef": "PM722946",
                "parDelegation": false
              },
              {
                "acteurRef": "PA720394",
                "mandatRef": "PM722950",
                "parDelegation": false
              },
              {
                "acteurRef": "PA720414",
                "mandatRef": "PM722958",
                "parDelegation": false
              },
              {
                "acteurRef": "PA720480",
                "mandatRef": "PM722976",
                "parDelegation": false
              },
              {
                "acteurRef": "PA720738",
                "mandatRef": "PM723062",
                "parDelegation": false
              },
              {
                "acteurRef": "PA720780",
                "mandatRef": "PM723074",
                "parDelegation": false
              },
              {
                "acteurRef": "PA720806",
                "mandatRef": "PM723082",
                "parDelegation": false
              },
              {
                "acteurRef": "PA720814",
                "mandatRef": "PM723084",
                "parDelegation": false
              },
              {
                "acteurRef": "PA720854",
                "mandatRef": "PM723096",
                "parDelegation": false
              },
              {
                "acteurRef": "PA720900",
                "mandatRef": "PM723108",
                "parDelegation": false
              },
              {
                "acteurRef": "PA720916",
                "mandatRef": "PM723112",
                "parDelegation": false
              },
              {
                "acteurRef": "PA720932",
                "mandatRef": "PM723116",
                "parDelegation": false
              },
              {
                "acteurRef": "PA721004",
                "mandatRef": "PM723136",
                "parDelegation": false
              },
              {
                "acteurRef": "PA721158",
                "mandatRef": "PM723190",
                "parDelegation": false
              },
              {
                "acteurRef": "PA721278",
                "mandatRef": "PM723222",
                "parDelegation": false
              },
              {
                "acteurRef": "PA721328",
                "mandatRef": "PM723240",
                "parDelegation": false
              },
              {
                "acteurRef": "PA721336",
                "mandatRef": "PM723242",
                "parDelegation": false
              },
              {
                "acteurRef": "PA721398",
                "mandatRef": "PM723262",
                "parDelegation": false
              },
              {
                "acteurRef": "PA721426",
                "mandatRef": "PM723270",
                "parDelegation": false
              },
              {
                "acteurRef": "PA721434",
                "mandatRef": "PM723272",
                "parDelegation": false
              },
              {
                "acteurRef": "PA721450",
                "mandatRef": "PM723278",
                "parDelegation": false
              },
              {
                "acteurRef": "PA721458",
                "mandatRef": "PM723280",
                "parDelegation": false
              },
              {
                "acteurRef": "PA721584",
                "mandatRef": "PM723324",
                "parDelegation": false
              },
              {
                "acteurRef": "PA721600",
                "mandatRef": "PM723330",
                "parDelegation": false
              },
              {
                "acteurRef": "PA721702",
                "mandatRef": "PM723360",
                "parDelegation": false
              },
              {
                "acteurRef": "PA721750",
                "mandatRef": "PM723372",
                "parDelegation": false
              },
              {
                "acteurRef": "PA721776",
                "mandatRef": "PM723380",
                "parDelegation": false
              },
              {
                "acteurRef": "PA721784",
                "mandatRef": "PM723382",
                "parDelegation": false
              },
              {
                "acteurRef": "PA721792",
                "mandatRef": "PM723384",
                "parDelegation": false
              },
              {
                "acteurRef": "PA721844",
                "mandatRef": "PM723400",
                "parDelegation": false
              },
              {
                "acteurRef": "PA721860",
                "mandatRef": "PM723404",
                "parDelegation": false
              },
              {
                "acteurRef": "PA721916",
                "mandatRef": "PM723420",
                "parDelegation": false
              },
              {
                "acteurRef": "PA722000",
                "mandatRef": "PM723444",
                "parDelegation": false
              },
              {
                "acteurRef": "PA722038",
                "mandatRef": "PM723456",
                "parDelegation": false
              },
              {
                "acteurRef": "PA722046",
                "mandatRef": "PM723458",
                "parDelegation": false
              },
              {
                "acteurRef": "PA722070",
                "mandatRef": "PM723464",
                "parDelegation": false
              },
              {
                "acteurRef": "PA722094",
                "mandatRef": "PM723470",
                "parDelegation": false
              },
              {
                "acteurRef": "PA722150",
                "mandatRef": "PM723486",
                "parDelegation": false
              },
              {
                "acteurRef": "PA722170",
                "mandatRef": "PM723492",
                "parDelegation": false
              },
              {
                "acteurRef": "PA722260",
                "mandatRef": "PM723520",
                "parDelegation": false
              },
              {
                "acteurRef": "PA722268",
                "mandatRef": "PM723522",
                "parDelegation": false
              },
              {
                "acteurRef": "PA722312",
                "mandatRef": "PM723536",
                "parDelegation": false
              },
              {
                "acteurRef": "PA722336",
                "mandatRef": "PM723544",
                "parDelegation": false
              },
              {
                "acteurRef": "PA722366",
                "mandatRef": "PM723554",
                "parDelegation": false
              },
              {
                "acteurRef": "PA642695",
                "mandatRef": "PM722602",
                "parDelegation": false
              },
              {
                "acteurRef": "PA721876",
                "mandatRef": "PM733719",
                "parDelegation": false
              }
            ],
            "abstentions": [
              {
                "acteurRef": "PA607619",
                "mandatRef": "PM722936",
                "parDelegation": false
              }
            ]
          }
        }
      },
      {
        "organeRef": "PO730934",
        "nombreMembresGroupe": "102",
        "vote": {
          "positionMajoritaire": "contre",
          "decompteVoix": {
            "pour": "1",
            "contre": "21",
            "nonVotants": "1",
            "abstentions": "0",
            "nonVotantsVolontaires": "0"
          },
          "decompteNominatif": {
            "nonVotants": [
              {
                "acteurRef": "PA605991",
                "mandatRef": "PM722660",
                "causePositionVote": "PSE"
              }
            ],
            "pour": [
              {
                "acteurRef": "PA332523",
                "mandatRef": "PM722792",
                "parDelegation": false
              }
            ],
            "contre": [
              {
                "acteurRef": "PA606712",
                "mandatRef": "PM722756",
                "parDelegation": false
              },
              {
                "acteurRef": "PA267204",
                "mandatRef": "PM722794",
                "parDelegation": false
              },
              {
                "acteurRef": "PA267527",
                "mandatRef": "PM723274",
                "parDelegation": false
              },
              {
                "acteurRef": "PA718850",
                "mandatRef": "PM722478",
                "parDelegation": false
              },
              {
                "acteurRef": "PA718838",
                "mandatRef": "PM722474",
                "parDelegation": false
              },
              {
                "acteurRef": "PA1012",
                "mandatRef": "PM722418",
                "parDelegation": false
              },
              {
                "acteurRef": "PA340853",
                "mandatRef": "PM722534",
                "parDelegation": false
              },
              {
                "acteurRef": "PA721410",
                "mandatRef": "PM723266",
                "parDelegation": false
              },
              {
                "acteurRef": "PA609245",
                "mandatRef": "PM723318",
                "parDelegation": false
              },
              {
                "acteurRef": "PA720684",
                "mandatRef": "PM723040",
                "parDelegation": false
              },
              {
                "acteurRef": "PA718780",
                "mandatRef": "PM722454",
                "parDelegation": false
              },
              {
                "acteurRef": "PA718784",
                "mandatRef": "PM722456",
                "parDelegation": false
              },
              {
                "acteurRef": "PA719318",
                "mandatRef": "PM722624",
                "parDelegation": false
              },
              {
                "acteurRef": "PA720386",
                "mandatRef": "PM722948",
                "parDelegation": false
              },
              {
                "acteurRef": "PA642847",
                "mandatRef": "PM722954",
                "parDelegation": false
              },
              {
                "acteurRef": "PA720630",
                "mandatRef": "PM723020",
                "parDelegation": false
              },
              {
                "acteurRef": "PA721286",
                "mandatRef": "PM723224",
                "parDelegation": false
              },
              {
                "acteurRef": "PA721506",
                "mandatRef": "PM723296",
                "parDelegation": false
              },
              {
                "acteurRef": "PA346218",
                "mandatRef": "PM723348",
                "parDelegation": false
              },
              {
                "acteurRef": "PA721678",
                "mandatRef": "PM723352",
                "parDelegation": false
              },
              {
                "acteurRef": "PA748954",
                "mandatRef": "PM748958",
                "parDelegation": false
              }
            ]
          }
        }
      },
      {
        "organeRef": "PO730970",
        "nombreMembresGroupe": "47",
        "vote": {
          "positionMajoritaire": "contre",
          "decompteVoix": {
            "pour": "0",
            "contre": "18",
            "nonVotants": "0",
            "abstentions": "0",
            "nonVotantsVolontaires": "0"
          },
          "decompteNominatif": {
            "contre": [
              {
                "acteurRef": "PA720598",
                "mandatRef": "PM723012",
                "parDelegation": false
              },
              {
                "acteurRef": "PA721418",
                "mandatRef": "PM723268",
                "parDelegation": false
              },
              {
                "acteurRef": "PA718978",
                "mandatRef": "PM722520",
                "parDelegation": false
              },
              {
                "acteurRef": "PA719266",
                "mandatRef": "PM722610",
                "parDelegation": false
              },
              {
                "acteurRef": "PA719488",
                "mandatRef": "PM722676",
                "parDelegation": false
              },
              {
                "acteurRef": "PA719504",
                "mandatRef": "PM722680",
                "parDelegation": false
              },
              {
                "acteurRef": "PA719640",
                "mandatRef": "PM722718",
                "parDelegation": false
              },
              {
                "acteurRef": "PA719938",
                "mandatRef": "PM722806",
                "parDelegation": false
              },
              {
                "acteurRef": "PA720002",
                "mandatRef": "PM722830",
                "parDelegation": false
              },
              {
                "acteurRef": "PA720326",
                "mandatRef": "PM722930",
                "parDelegation": false
              },
              {
                "acteurRef": "PA720652",
                "mandatRef": "PM723028",
                "parDelegation": false
              },
              {
                "acteurRef": "PA720728",
                "mandatRef": "PM723058",
                "parDelegation": false
              },
              {
                "acteurRef": "PA721742",
                "mandatRef": "PM723370",
                "parDelegation": false
              },
              {
                "acteurRef": "PA721836",
                "mandatRef": "PM723398",
                "parDelegation": false
              },
              {
                "acteurRef": "PA721924",
                "mandatRef": "PM723422",
                "parDelegation": false
              },
              {
                "acteurRef": "PA721976",
                "mandatRef": "PM723438",
                "parDelegation": false
              },
              {
                "acteurRef": "PA721992",
                "mandatRef": "PM723442",
                "parDelegation": false
              },
              {
                "acteurRef": "PA722374",
                "mandatRef": "PM723556",
                "parDelegation": false
              }
            ]
          }
        }
      },
      {
        "organeRef": "PO744425",
        "nombreMembresGroupe": "32",
        "vote": {
          "positionMajoritaire": "abstention",
          "decompteVoix": {
            "pour": "0",
            "contre": "0",
            "nonVotants": "0",
            "abstentions": "3",
            "nonVotantsVolontaires": "3"
          },
          "decompteNominatif": {
            "abstentions": [
              {
                "acteurRef": "PA332228",
                "mandatRef": "PM722754",
                "parDelegation": false
              },
              {
                "acteurRef": "PA267780",
                "mandatRef": "PM723504",
                "parDelegation": false
              },
              {
                "acteurRef": "PA702052",
                "mandatRef": "PM723172",
                "parDelegation": false
              }
            ]
          }
        }
      },
      {
        "organeRef": "PO730946",
        "nombreMembresGroupe": "30",
        "vote": {
          "positionMajoritaire": "pour",
          "decompteVoix": {
            "pour": "7",
            "contre": "0",
            "nonVotants": "0",
            "abstentions": "0",
            "nonVotantsVolontaires": "0"
          },
          "decompteNominatif": {
            "pour": [
              {
                "acteurRef": "PA1592",
                "mandatRef": "PM723060",
                "parDelegation": false
              },
              {
                "acteurRef": "PA605069",
                "mandatRef": "PM722424",
                "parDelegation": false
              },
              {
                "acteurRef": "PA405480",
                "mandatRef": "PM723118",
                "parDelegation": false
              },
              {
                "acteurRef": "PA342415",
                "mandatRef": "PM722826",
                "parDelegation": false
              },
              {
                "acteurRef": "PA607553",
                "mandatRef": "PM722956",
                "parDelegation": false
              },
              {
                "acteurRef": "PA608172",
                "mandatRef": "PM723048",
                "parDelegation": false
              },
              {
                "acteurRef": "PA1008",
                "mandatRef": "PM722704",
                "parDelegation": false
              }
            ]
          }
        }
      },
      {
        "organeRef": "PO723569",
        "nombreMembresGroupe": "20",
        "vote": {
          "positionMajoritaire": "pour",
          "decompteVoix": {
            "pour": "2",
            "contre": "1",
            "nonVotants": "0",
            "abstentions": "0",
            "nonVotantsVolontaires": "0"
          },
          "decompteNominatif": {
            "pour": [
              {
                "acteurRef": "PA336175",
                "mandatRef": "PM723328",
                "parDelegation": false
              },
              {
                "acteurRef": "PA720996",
                "mandatRef": "PM723134",
                "parDelegation": false
              }
            ],
            "contre": [
              {
                "acteurRef": "PA719608",
                "mandatRef": "PM722710",
                "parDelegation": false
              }
            ]
          }
        }
      },
      {
        "organeRef": "PO730958",
        "nombreMembresGroupe": "17",
        "vote": {
          "positionMajoritaire": "pour",
          "decompteVoix": {
            "pour": "6",
            "contre": "0",
            "nonVotants": "0",
            "abstentions": "0",
            "nonVotantsVolontaires": "0"
          },
          "decompteNominatif": {
            "pour": [
              {
                "acteurRef": "PA719578",
                "mandatRef": "PM722702",
                "parDelegation": false
              },
              {
                "acteurRef": "PA719676",
                "mandatRef": "PM722728",
                "parDelegation": false
              },
              {
                "acteurRef": "PA720286",
                "mandatRef": "PM722918",
                "parDelegation": false
              },
              {
                "acteurRef": "PA721062",
                "mandatRef": "PM723158",
                "parDelegation": false
              },
              {
                "acteurRef": "PA721202",
                "mandatRef": "PM723202",
                "parDelegation": false
              },
              {
                "acteurRef": "PA721960",
                "mandatRef": "PM723434",
                "parDelegation": false
              }
            ]
          }
        }
      },
      {
        "organeRef": "PO730940",
        "nombreMembresGroupe": "16",
        "vote": {
          "positionMajoritaire": "pour",
          "decompteVoix": {
            "pour": "7",
            "contre": "0",
            "nonVotants": "0",
            "abstentions": "0",
            "nonVotantsVolontaires": "0"
          },
          "decompteNominatif": {
            "pour": [
              {
                "acteurRef": "PA610654",
                "mandatRef": "PM723142",
                "parDelegation": false
              },
              {
                "acteurRef": "PA722202",
                "mandatRef": "PM723502",
                "parDelegation": false
              },
              {
                "acteurRef": "PA267306",
                "mandatRef": "PM723054",
                "parDelegation": false
              },
              {
                "acteurRef": "PA718926",
                "mandatRef": "PM722502",
                "parDelegation": false
              },
              {
                "acteurRef": "PA721270",
                "mandatRef": "PM723220",
                "parDelegation": false
              },
              {
                "acteurRef": "PA722110",
                "mandatRef": "PM723474",
                "parDelegation": false
              },
              {
                "acteurRef": "PA721012",
                "mandatRef": "PM755861",
                "parDelegation": false
              }
            ]
          }
        }
      }
    ]
  }
}