{
  "uid": "VTANR5L15V200",
  "numero": "200",
  "organeRef": "PO717460",
  "legislature": "15",
  "sessionRef": "SCR5A2018O1",
  "seanceRef": "RUANR5L15S2018IDS20712",
  "dateScrutin": "2017-10-26T02:00:00.000+02:00",
  "quantiemeJourSeance": "3",
  "typeVote": {
    "codeTypeVote": "SPO",
    "libelleTypeVote": "scrutin public ordinaire",
    "typeMajorite": "majorité absolue des suffrages exprimés"
  },
  "sort": {
    "code": "adopté",
    "libelle": "l'Assemblée nationale a adopté"
  },
  "titre": "l'amendement n?1210 de la commission et les amendements identiques suivants apres l'article 13 du projet de loi de financement de la securite sociale pour 2018 (premiere lecture).",
  "demandeur": {
    "texte": "President(e) du groupe \"La Republique en Marche\""
  },
  "objet": {
    "libelle": "l'amendement n?1210 de la commission et les amendements identiques suivants apres l'article 13 du projet de loi de financement de la securite sociale pour 2018 (premiere lecture)."
  },
  "modePublicationDesVotes": "DecompteNominatif",
  "syntheseVote": {
    "nombreVotants": "89",
    "suffragesExprimes": "83",
    "nbrSuffragesRequis": "42",
    "annonce": "l'Assemblée nationale a adopté",
    "decompte": {
      "pour": "80",
      "contre": "3",
      "nonVotants": "2",
      "abstentions": "6",
      "nonVotantsVolontaires": "0"
    }
  },
  "ventilationVotes": {
    "organeRef": "PO717460",
    "groupes": [
      {
        "organeRef": "PO730964",
        "nombreMembresGroupe": "313",
        "vote": {
          "positionMajoritaire": "pour",
          "decompteVoix": {
            "pour": "58",
            "contre": "0",
            "nonVotants": "1",
            "abstentions": "1",
            "nonVotantsVolontaires": "1"
          },
          "decompteNominatif": {
            "nonVotants": [
              {
                "acteurRef": "PA332747",
                "mandatRef": "PM722798",
                "causePositionVote": "PAN"
              }
            ],
            "pour": [
              {
                "acteurRef": "PA608083",
                "mandatRef": "PM723038",
                "parDelegation": false
              },
              {
                "acteurRef": "PA605963",
                "mandatRef": "PM722584",
                "parDelegation": false
              },
              {
                "acteurRef": "PA721296",
                "mandatRef": "PM723228",
                "parDelegation": false
              },
              {
                "acteurRef": "PA721852",
                "mandatRef": "PM723402",
                "parDelegation": false
              },
              {
                "acteurRef": "PA718710",
                "mandatRef": "PM722432",
                "parDelegation": false
              },
              {
                "acteurRef": "PA718744",
                "mandatRef": "PM722442",
                "parDelegation": false
              },
              {
                "acteurRef": "PA718810",
                "mandatRef": "PM722464",
                "parDelegation": false
              },
              {
                "acteurRef": "PA718902",
                "mandatRef": "PM722496",
                "parDelegation": false
              },
              {
                "acteurRef": "PA718910",
                "mandatRef": "PM722498",
                "parDelegation": false
              },
              {
                "acteurRef": "PA719052",
                "mandatRef": "PM722544",
                "parDelegation": false
              },
              {
                "acteurRef": "PA719072",
                "mandatRef": "PM722552",
                "parDelegation": false
              },
              {
                "acteurRef": "PA719130",
                "mandatRef": "PM722572",
                "parDelegation": false
              },
              {
                "acteurRef": "PA719186",
                "mandatRef": "PM722588",
                "parDelegation": false
              },
              {
                "acteurRef": "PA719218",
                "mandatRef": "PM722596",
                "parDelegation": false
              },
              {
                "acteurRef": "PA719294",
                "mandatRef": "PM722618",
                "parDelegation": false
              },
              {
                "acteurRef": "PA719388",
                "mandatRef": "PM722648",
                "parDelegation": false
              },
              {
                "acteurRef": "PA719448",
                "mandatRef": "PM722666",
                "parDelegation": false
              },
              {
                "acteurRef": "PA719496",
                "mandatRef": "PM722678",
                "parDelegation": false
              },
              {
                "acteurRef": "PA719512",
                "mandatRef": "PM722682",
                "parDelegation": false
              },
              {
                "acteurRef": "PA719540",
                "mandatRef": "PM722690",
                "parDelegation": false
              },
              {
                "acteurRef": "PA719570",
                "mandatRef": "PM722700",
                "parDelegation": false
              },
              {
                "acteurRef": "PA719600",
                "mandatRef": "PM722708",
                "parDelegation": false
              },
              {
                "acteurRef": "PA719616",
                "mandatRef": "PM722712",
                "parDelegation": false
              },
              {
                "acteurRef": "PA719652",
                "mandatRef": "PM722722",
                "parDelegation": false
              },
              {
                "acteurRef": "PA719660",
                "mandatRef": "PM722724",
                "parDelegation": false
              },
              {
                "acteurRef": "PA719684",
                "mandatRef": "PM722730",
                "parDelegation": false
              },
              {
                "acteurRef": "PA719748",
                "mandatRef": "PM722750",
                "parDelegation": false
              },
              {
                "acteurRef": "PA719756",
                "mandatRef": "PM722752",
                "parDelegation": false
              },
              {
                "acteurRef": "PA719770",
                "mandatRef": "PM722758",
                "parDelegation": false
              },
              {
                "acteurRef": "PA719830",
                "mandatRef": "PM722774",
                "parDelegation": false
              },
              {
                "acteurRef": "PA719960",
                "mandatRef": "PM722816",
                "parDelegation": false
              },
              {
                "acteurRef": "PA720046",
                "mandatRef": "PM722842",
                "parDelegation": false
              },
              {
                "acteurRef": "PA720074",
                "mandatRef": "PM722850",
                "parDelegation": false
              },
              {
                "acteurRef": "PA720222",
                "mandatRef": "PM722896",
                "parDelegation": false
              },
              {
                "acteurRef": "PA720268",
                "mandatRef": "PM722912",
                "parDelegation": false
              },
              {
                "acteurRef": "PA720354",
                "mandatRef": "PM722940",
                "parDelegation": false
              },
              {
                "acteurRef": "PA720538",
                "mandatRef": "PM722994",
                "parDelegation": false
              },
              {
                "acteurRef": "PA720560",
                "mandatRef": "PM723000",
                "parDelegation": false
              },
              {
                "acteurRef": "PA720568",
                "mandatRef": "PM723002",
                "parDelegation": false
              },
              {
                "acteurRef": "PA720854",
                "mandatRef": "PM723096",
                "parDelegation": false
              },
              {
                "acteurRef": "PA720862",
                "mandatRef": "PM723098",
                "parDelegation": false
              },
              {
                "acteurRef": "PA720916",
                "mandatRef": "PM723112",
                "parDelegation": false
              },
              {
                "acteurRef": "PA720932",
                "mandatRef": "PM723116",
                "parDelegation": false
              },
              {
                "acteurRef": "PA721004",
                "mandatRef": "PM723136",
                "parDelegation": false
              },
              {
                "acteurRef": "PA721336",
                "mandatRef": "PM723242",
                "parDelegation": false
              },
              {
                "acteurRef": "PA721466",
                "mandatRef": "PM723284",
                "parDelegation": false
              },
              {
                "acteurRef": "PA721542",
                "mandatRef": "PM723308",
                "parDelegation": false
              },
              {
                "acteurRef": "PA721726",
                "mandatRef": "PM723366",
                "parDelegation": false
              },
              {
                "acteurRef": "PA722000",
                "mandatRef": "PM723444",
                "parDelegation": false
              },
              {
                "acteurRef": "PA722022",
                "mandatRef": "PM723452",
                "parDelegation": false
              },
              {
                "acteurRef": "PA722062",
                "mandatRef": "PM723462",
                "parDelegation": false
              },
              {
                "acteurRef": "PA722086",
                "mandatRef": "PM723468",
                "parDelegation": false
              },
              {
                "acteurRef": "PA722102",
                "mandatRef": "PM723472",
                "parDelegation": false
              },
              {
                "acteurRef": "PA722134",
                "mandatRef": "PM723482",
                "parDelegation": false
              },
              {
                "acteurRef": "PA722268",
                "mandatRef": "PM723522",
                "parDelegation": false
              },
              {
                "acteurRef": "PA722300",
                "mandatRef": "PM723532",
                "parDelegation": false
              },
              {
                "acteurRef": "PA722382",
                "mandatRef": "PM723558",
                "parDelegation": false
              },
              {
                "acteurRef": "PA642788",
                "mandatRef": "PM722746",
                "parDelegation": false
              }
            ],
            "abstentions": [
              {
                "acteurRef": "PA718706",
                "mandatRef": "PM733715",
                "parDelegation": false
              }
            ]
          }
        }
      },
      {
        "organeRef": "PO730934",
        "nombreMembresGroupe": "100",
        "vote": {
          "positionMajoritaire": "pour",
          "decompteVoix": {
            "pour": "3",
            "contre": "0",
            "nonVotants": "0",
            "abstentions": "3",
            "nonVotantsVolontaires": "3"
          },
          "decompteNominatif": {
            "pour": [
              {
                "acteurRef": "PA267289",
                "mandatRef": "PM722854",
                "parDelegation": false
              },
              {
                "acteurRef": "PA721286",
                "mandatRef": "PM723224",
                "parDelegation": false
              },
              {
                "acteurRef": "PA721126",
                "mandatRef": "PM723182",
                "parDelegation": false
              }
            ],
            "abstentions": [
              {
                "acteurRef": "PA606712",
                "mandatRef": "PM722756",
                "parDelegation": false
              },
              {
                "acteurRef": "PA718780",
                "mandatRef": "PM722454",
                "parDelegation": false
              },
              {
                "acteurRef": "PA346218",
                "mandatRef": "PM723348",
                "parDelegation": false
              }
            ]
          }
        }
      },
      {
        "organeRef": "PO730970",
        "nombreMembresGroupe": "47",
        "vote": {
          "positionMajoritaire": "pour",
          "decompteVoix": {
            "pour": "12",
            "contre": "0",
            "nonVotants": "1",
            "abstentions": "0",
            "nonVotantsVolontaires": "0"
          },
          "decompteNominatif": {
            "nonVotants": [
              {
                "acteurRef": "PA720746",
                "mandatRef": "PM723064",
                "causePositionVote": "PSE"
              }
            ],
            "pour": [
              {
                "acteurRef": "PA719640",
                "mandatRef": "PM722718",
                "parDelegation": false
              },
              {
                "acteurRef": "PA719938",
                "mandatRef": "PM722806",
                "parDelegation": false
              },
              {
                "acteurRef": "PA720002",
                "mandatRef": "PM722830",
                "parDelegation": false
              },
              {
                "acteurRef": "PA720326",
                "mandatRef": "PM722930",
                "parDelegation": false
              },
              {
                "acteurRef": "PA720334",
                "mandatRef": "PM722932",
                "parDelegation": false
              },
              {
                "acteurRef": "PA720652",
                "mandatRef": "PM723028",
                "parDelegation": false
              },
              {
                "acteurRef": "PA720924",
                "mandatRef": "PM723114",
                "parDelegation": false
              },
              {
                "acteurRef": "PA720968",
                "mandatRef": "PM723126",
                "parDelegation": false
              },
              {
                "acteurRef": "PA720976",
                "mandatRef": "PM723128",
                "parDelegation": false
              },
              {
                "acteurRef": "PA721924",
                "mandatRef": "PM723422",
                "parDelegation": false
              },
              {
                "acteurRef": "PA722284",
                "mandatRef": "PM723528",
                "parDelegation": false
              },
              {
                "acteurRef": "PA722374",
                "mandatRef": "PM723556",
                "parDelegation": false
              }
            ]
          }
        }
      },
      {
        "organeRef": "PO730952",
        "nombreMembresGroupe": "35",
        "vote": {
          "positionMajoritaire": "pour",
          "decompteVoix": {
            "pour": "2",
            "contre": "1",
            "nonVotants": "0",
            "abstentions": "0",
            "nonVotantsVolontaires": "0"
          },
          "decompteNominatif": {
            "pour": [
              {
                "acteurRef": "PA267585",
                "mandatRef": "PM722978",
                "parDelegation": false
              },
              {
                "acteurRef": "PA267780",
                "mandatRef": "PM723504",
                "parDelegation": false
              }
            ],
            "contre": [
              {
                "acteurRef": "PA720230",
                "mandatRef": "PM722898",
                "parDelegation": false
              }
            ]
          }
        }
      },
      {
        "organeRef": "PO730946",
        "nombreMembresGroupe": "31",
        "vote": {
          "positionMajoritaire": "pour",
          "decompteVoix": {
            "pour": "2",
            "contre": "2",
            "nonVotants": "0",
            "abstentions": "2",
            "nonVotantsVolontaires": "2"
          },
          "decompteNominatif": {
            "pour": [
              {
                "acteurRef": "PA610681",
                "mandatRef": "PM723150",
                "parDelegation": false
              },
              {
                "acteurRef": "PA719930",
                "mandatRef": "PM722804",
                "parDelegation": false
              }
            ],
            "contre": [
              {
                "acteurRef": "PA605069",
                "mandatRef": "PM722424",
                "parDelegation": false
              },
              {
                "acteurRef": "PA608011",
                "mandatRef": "PM723022",
                "parDelegation": false
              }
            ],
            "abstentions": [
              {
                "acteurRef": "PA508",
                "mandatRef": "PM722736",
                "parDelegation": false
              },
              {
                "acteurRef": "PA642764",
                "mandatRef": "PM722692",
                "parDelegation": false
              }
            ]
          }
        }
      },
      {
        "organeRef": "PO723569",
        "nombreMembresGroupe": "18",
        "vote": {
          "positionMajoritaire": "pour",
          "decompteVoix": {
            "pour": "1",
            "contre": "0",
            "nonVotants": "0",
            "abstentions": "0",
            "nonVotantsVolontaires": "0"
          },
          "decompteNominatif": {
            "pour": [
              {
                "acteurRef": "PA719608",
                "mandatRef": "PM722710",
                "parDelegation": false
              }
            ]
          }
        }
      },
      {
        "organeRef": "PO730958",
        "nombreMembresGroupe": "17",
        "vote": {
          "positionMajoritaire": "pour",
          "decompteVoix": {
            "pour": "1",
            "contre": "0",
            "nonVotants": "0",
            "abstentions": "0",
            "nonVotantsVolontaires": "0"
          },
          "decompteNominatif": {
            "pour": [
              {
                "acteurRef": "PA720892",
                "mandatRef": "PM723106",
                "parDelegation": false
              }
            ]
          }
        }
      },
      {
        "organeRef": "PO730940",
        "nombreMembresGroupe": "16",
        "vote": {
          "positionMajoritaire": "pour",
          "decompteVoix": {
            "pour": "1",
            "contre": "0",
            "nonVotants": "0",
            "abstentions": "0",
            "nonVotantsVolontaires": "0"
          },
          "decompteNominatif": {
            "pour": [
              {
                "acteurRef": "PA718926",
                "mandatRef": "PM722502",
                "parDelegation": false
              }
            ]
          }
        }
      }
    ]
  }
}