{
  "uid": "VTANR5L15V839",
  "numero": "839",
  "organeRef": "PO717460",
  "legislature": "15",
  "sessionRef": "SCR5A2018O1",
  "seanceRef": "RUANR5L15S2018IDS21090",
  "dateScrutin": "2018-06-06T02:00:00.000+02:00",
  "quantiemeJourSeance": "2",
  "typeVote": {
    "codeTypeVote": "SPO",
    "libelleTypeVote": "scrutin public ordinaire",
    "typeMajorite": "majorité absolue des suffrages exprimés"
  },
  "sort": {
    "code": "rejeté",
    "libelle": "L'Assemblée nationale n'a pas adopté"
  },
  "titre": "l'amendement de suppression n° 799 de M. Bazin à l'article 47 du projet de loi portant évolution du logement, de l'aménagement et du numérique (première lecture).",
  "demandeur": {
    "texte": "Président du groupe \"Les Républicains\""
  },
  "objet": {
    "libelle": "l'amendement de suppression n° 799 de M. Bazin à l'article 47 du projet de loi portant évolution du logement, de l'aménagement et du numérique (première lecture)."
  },
  "modePublicationDesVotes": "DecompteNominatif",
  "syntheseVote": {
    "nombreVotants": "69",
    "suffragesExprimes": "66",
    "nbrSuffragesRequis": "34",
    "annonce": "L'Assemblée nationale n'a pas adopté",
    "decompte": {
      "pour": "6",
      "contre": "60",
      "nonVotants": "2",
      "abstentions": "3",
      "nonVotantsVolontaires": "0"
    }
  },
  "ventilationVotes": {
    "organeRef": "PO717460",
    "groupes": [
      {
        "organeRef": "PO730964",
        "nombreMembresGroupe": "313",
        "vote": {
          "positionMajoritaire": "contre",
          "decompteVoix": {
            "pour": "1",
            "contre": "46",
            "nonVotants": "2",
            "abstentions": "0",
            "nonVotantsVolontaires": "0"
          },
          "decompteNominatif": {
            "nonVotants": [
              {
                "acteurRef": "PA332747",
                "mandatRef": "PM722798",
                "causePositionVote": "PAN"
              },
              {
                "acteurRef": "PA720622",
                "mandatRef": "PM723018",
                "causePositionVote": "PSE"
              }
            ],
            "pour": [
              {
                "acteurRef": "PA607619",
                "mandatRef": "PM722936",
                "parDelegation": false
              }
            ],
            "contre": [
              {
                "acteurRef": "PA722398",
                "mandatRef": "PM723562",
                "parDelegation": false
              },
              {
                "acteurRef": "PA2449",
                "mandatRef": "PM723036",
                "parDelegation": false
              },
              {
                "acteurRef": "PA719668",
                "mandatRef": "PM722726",
                "parDelegation": false
              },
              {
                "acteurRef": "PA606202",
                "mandatRef": "PM722698",
                "parDelegation": false
              },
              {
                "acteurRef": "PA607155",
                "mandatRef": "PM722832",
                "parDelegation": false
              },
              {
                "acteurRef": "PA721296",
                "mandatRef": "PM723228",
                "parDelegation": false
              },
              {
                "acteurRef": "PA719520",
                "mandatRef": "PM722684",
                "parDelegation": false
              },
              {
                "acteurRef": "PA718930",
                "mandatRef": "PM722504",
                "parDelegation": false
              },
              {
                "acteurRef": "PA718962",
                "mandatRef": "PM722514",
                "parDelegation": false
              },
              {
                "acteurRef": "PA719060",
                "mandatRef": "PM722546",
                "parDelegation": false
              },
              {
                "acteurRef": "PA719130",
                "mandatRef": "PM722572",
                "parDelegation": false
              },
              {
                "acteurRef": "PA719242",
                "mandatRef": "PM722604",
                "parDelegation": false
              },
              {
                "acteurRef": "PA719294",
                "mandatRef": "PM722618",
                "parDelegation": false
              },
              {
                "acteurRef": "PA719338",
                "mandatRef": "PM722630",
                "parDelegation": false
              },
              {
                "acteurRef": "PA719652",
                "mandatRef": "PM722722",
                "parDelegation": false
              },
              {
                "acteurRef": "PA719660",
                "mandatRef": "PM722724",
                "parDelegation": false
              },
              {
                "acteurRef": "PA719740",
                "mandatRef": "PM722748",
                "parDelegation": false
              },
              {
                "acteurRef": "PA719778",
                "mandatRef": "PM722760",
                "parDelegation": false
              },
              {
                "acteurRef": "PA719790",
                "mandatRef": "PM722764",
                "parDelegation": false
              },
              {
                "acteurRef": "PA719830",
                "mandatRef": "PM722774",
                "parDelegation": false
              },
              {
                "acteurRef": "PA719922",
                "mandatRef": "PM722802",
                "parDelegation": false
              },
              {
                "acteurRef": "PA720318",
                "mandatRef": "PM722928",
                "parDelegation": false
              },
              {
                "acteurRef": "PA720342",
                "mandatRef": "PM722934",
                "parDelegation": false
              },
              {
                "acteurRef": "PA720414",
                "mandatRef": "PM722958",
                "parDelegation": false
              },
              {
                "acteurRef": "PA720480",
                "mandatRef": "PM722976",
                "parDelegation": false
              },
              {
                "acteurRef": "PA720520",
                "mandatRef": "PM722988",
                "parDelegation": false
              },
              {
                "acteurRef": "PA720738",
                "mandatRef": "PM723062",
                "parDelegation": false
              },
              {
                "acteurRef": "PA720870",
                "mandatRef": "PM723100",
                "parDelegation": false
              },
              {
                "acteurRef": "PA720900",
                "mandatRef": "PM723108",
                "parDelegation": false
              },
              {
                "acteurRef": "PA720916",
                "mandatRef": "PM723112",
                "parDelegation": false
              },
              {
                "acteurRef": "PA720932",
                "mandatRef": "PM723116",
                "parDelegation": false
              },
              {
                "acteurRef": "PA721246",
                "mandatRef": "PM723214",
                "parDelegation": false
              },
              {
                "acteurRef": "PA721328",
                "mandatRef": "PM723240",
                "parDelegation": false
              },
              {
                "acteurRef": "PA721434",
                "mandatRef": "PM723272",
                "parDelegation": false
              },
              {
                "acteurRef": "PA721450",
                "mandatRef": "PM723278",
                "parDelegation": false
              },
              {
                "acteurRef": "PA721458",
                "mandatRef": "PM723280",
                "parDelegation": false
              },
              {
                "acteurRef": "PA721466",
                "mandatRef": "PM723284",
                "parDelegation": false
              },
              {
                "acteurRef": "PA721584",
                "mandatRef": "PM723324",
                "parDelegation": false
              },
              {
                "acteurRef": "PA721600",
                "mandatRef": "PM723330",
                "parDelegation": false
              },
              {
                "acteurRef": "PA721702",
                "mandatRef": "PM723360",
                "parDelegation": false
              },
              {
                "acteurRef": "PA721750",
                "mandatRef": "PM723372",
                "parDelegation": false
              },
              {
                "acteurRef": "PA721784",
                "mandatRef": "PM723382",
                "parDelegation": false
              },
              {
                "acteurRef": "PA721916",
                "mandatRef": "PM723420",
                "parDelegation": false
              },
              {
                "acteurRef": "PA722170",
                "mandatRef": "PM723492",
                "parDelegation": false
              },
              {
                "acteurRef": "PA722300",
                "mandatRef": "PM723532",
                "parDelegation": false
              },
              {
                "acteurRef": "PA722336",
                "mandatRef": "PM723544",
                "parDelegation": false
              }
            ]
          }
        }
      },
      {
        "organeRef": "PO730934",
        "nombreMembresGroupe": "102",
        "vote": {
          "positionMajoritaire": "pour",
          "decompteVoix": {
            "pour": "5",
            "contre": "0",
            "nonVotants": "0",
            "abstentions": "0",
            "nonVotantsVolontaires": "0"
          },
          "decompteNominatif": {
            "pour": [
              {
                "acteurRef": "PA606712",
                "mandatRef": "PM722756",
                "parDelegation": false
              },
              {
                "acteurRef": "PA266808",
                "mandatRef": "PM723264",
                "parDelegation": false
              },
              {
                "acteurRef": "PA332523",
                "mandatRef": "PM722792",
                "parDelegation": false
              },
              {
                "acteurRef": "PA642847",
                "mandatRef": "PM722954",
                "parDelegation": false
              },
              {
                "acteurRef": "PA721286",
                "mandatRef": "PM723224",
                "parDelegation": false
              }
            ]
          }
        }
      },
      {
        "organeRef": "PO730970",
        "nombreMembresGroupe": "47",
        "vote": {
          "positionMajoritaire": "abstention",
          "decompteVoix": {
            "pour": "0",
            "contre": "1",
            "nonVotants": "0",
            "abstentions": "2",
            "nonVotantsVolontaires": "2"
          },
          "decompteNominatif": {
            "contre": [
              {
                "acteurRef": "PA720598",
                "mandatRef": "PM723012",
                "parDelegation": false
              }
            ],
            "abstentions": [
              {
                "acteurRef": "PA720002",
                "mandatRef": "PM722830",
                "parDelegation": false
              },
              {
                "acteurRef": "PA720728",
                "mandatRef": "PM723058",
                "parDelegation": false
              }
            ]
          }
        }
      },
      {
        "organeRef": "PO744425",
        "nombreMembresGroupe": "32",
        "vote": {
          "positionMajoritaire": "contre",
          "decompteVoix": {
            "pour": "0",
            "contre": "2",
            "nonVotants": "0",
            "abstentions": "0",
            "nonVotantsVolontaires": "0"
          },
          "decompteNominatif": {
            "contre": [
              {
                "acteurRef": "PA332228",
                "mandatRef": "PM722754",
                "parDelegation": false
              },
              {
                "acteurRef": "PA267780",
                "mandatRef": "PM723504",
                "parDelegation": false
              }
            ]
          }
        }
      },
      {
        "organeRef": "PO730946",
        "nombreMembresGroupe": "30",
        "vote": {
          "positionMajoritaire": "contre",
          "decompteVoix": {
            "pour": "0",
            "contre": "4",
            "nonVotants": "0",
            "abstentions": "0",
            "nonVotantsVolontaires": "0"
          },
          "decompteNominatif": {
            "contre": [
              {
                "acteurRef": "PA605069",
                "mandatRef": "PM722424",
                "parDelegation": false
              },
              {
                "acteurRef": "PA607553",
                "mandatRef": "PM722956",
                "parDelegation": false
              },
              {
                "acteurRef": "PA608172",
                "mandatRef": "PM723048",
                "parDelegation": false
              },
              {
                "acteurRef": "PA1008",
                "mandatRef": "PM722704",
                "parDelegation": false
              }
            ]
          }
        }
      },
      {
        "organeRef": "PO723569",
        "nombreMembresGroupe": "20",
        "vote": {
          "positionMajoritaire": "abstention",
          "decompteVoix": {
            "pour": "0",
            "contre": "0",
            "nonVotants": "0",
            "abstentions": "1",
            "nonVotantsVolontaires": "1"
          },
          "decompteNominatif": {
            "abstentions": [
              {
                "acteurRef": "PA336175",
                "mandatRef": "PM723328",
                "parDelegation": false
              }
            ]
          }
        }
      },
      {
        "organeRef": "PO730958",
        "nombreMembresGroupe": "17",
        "vote": {
          "positionMajoritaire": "contre",
          "decompteVoix": {
            "pour": "0",
            "contre": "2",
            "nonVotants": "0",
            "abstentions": "0",
            "nonVotantsVolontaires": "0"
          },
          "decompteNominatif": {
            "contre": [
              {
                "acteurRef": "PA718868",
                "mandatRef": "PM722484",
                "parDelegation": false
              },
              {
                "acteurRef": "PA721960",
                "mandatRef": "PM723434",
                "parDelegation": false
              }
            ]
          }
        }
      },
      {
        "organeRef": "PO730940",
        "nombreMembresGroupe": "16",
        "vote": {
          "positionMajoritaire": "contre",
          "decompteVoix": {
            "pour": "0",
            "contre": "5",
            "nonVotants": "0",
            "abstentions": "0",
            "nonVotantsVolontaires": "0"
          },
          "decompteNominatif": {
            "contre": [
              {
                "acteurRef": "PA267306",
                "mandatRef": "PM723054",
                "parDelegation": false
              },
              {
                "acteurRef": "PA718926",
                "mandatRef": "PM722502",
                "parDelegation": false
              },
              {
                "acteurRef": "PA718720",
                "mandatRef": "PM722436",
                "parDelegation": false
              },
              {
                "acteurRef": "PA721270",
                "mandatRef": "PM723220",
                "parDelegation": false
              },
              {
                "acteurRef": "PA722110",
                "mandatRef": "PM723474",
                "parDelegation": false
              }
            ]
          }
        }
      }
    ]
  }
}