{
  "uid": {
    "@xsi:type": "IdActeur_type",
    "#text": "PA1198"
  },
  "etatCivil": {
    "ident": {
      "civ": "Mme",
      "prenom": "Laurence",
      "nom": "Dumont",
      "alpha": "DumontL",
      "trigramme": "LDU"
    },
    "infoNaissance": {
      "dateNais": "1958-06-02T01:00:00.000+01:00",
      "villeNais": "Vincennes",
      "depNais": "Val-de-Marne",
      "paysNais": "France"
    },
    "dateDeces": null
  },
  "profession": {
    "libelleCourant": "Chargée d'études",
    "socProcINSEE": {
      "catSocPro": "Cadres de la fonction publique, professions intellectuelles et  artistiques",
      "famSocPro": "Cadres et professions intellectuelles supérieures"
    }
  },
  "uri_hatvp": "https://www.hatvp.fr/pages_nominatives/dumont-laurence",
  "adresses": {
    "adresse": [
      {
        "@xsi:type": "AdressePostale_Type",
        "uid": "AD386638",
        "type": "0",
        "typeLibelle": "Adresse officielle",
        "poids": "1",
        "adresseDeRattachement": null,
        "intitule": "Assemblée nationale,",
        "numeroRue": "126",
        "nomRue": "Rue de l'Université,",
        "complementAdresse": null,
        "codePostal": "75355",
        "ville": "Paris 07 SP"
      },
      {
        "@xsi:type": "AdressePostale_Type",
        "uid": "AD394974",
        "type": "2",
        "typeLibelle": "Adresse publiée de circonscription",
        "poids": "22",
        "adresseDeRattachement": null,
        "intitule": "Permanence parlementaire",
        "numeroRue": "17",
        "nomRue": "Rue Paul Toutain",
        "complementAdresse": null,
        "codePostal": "14000",
        "ville": "Caen"
      },
      {
        "@xsi:type": "AdresseTelephonique_Type",
        "uid": "AD411558",
        "type": "11",
        "typeLibelle": "Téléphone",
        "poids": "22",
        "adresseDeRattachement": "AD394974",
        "valElec": "02 31 78 15 10"
      },
      {
        "@xsi:type": "AdresseMail_Type",
        "uid": "AD727912",
        "type": "15",
        "typeLibelle": "Mèl",
        "poids": null,
        "adresseDeRattachement": null,
        "valElec": "laurence.dumont@assemblee-nationale.fr"
      }
    ]
  },
  "mandats": {
    "mandat": [
      {
        "@xsi:type": "MandatSimple_Type",
        "uid": "PM750271",
        "acteurRef": "PA1198",
        "legislature": "15",
        "typeOrgane": "GE",
        "dateDebut": "2018-02-14T01:00:00.000+01:00",
        "datePublication": null,
        "dateFin": null,
        "preseance": "20",
        "nominPrincipale": "1",
        "infosQualite": {
          "codeQualite": "Membre",
          "libQualite": "Membre",
          "libQualiteSex": "Membre"
        },
        "organes": {
          "organeRef": "PO747072"
        }
      },
      {
        "@xsi:type": "MandatSimple_Type",
        "uid": "PM676581",
        "acteurRef": "PA1198",
        "legislature": "14",
        "typeOrgane": "DELEGBUREAU",
        "dateDebut": "2012-07-18T02:00:00.000+02:00",
        "datePublication": null,
        "dateFin": "2017-06-20T02:00:00.000+02:00",
        "preseance": "1",
        "nominPrincipale": "1",
        "infosQualite": {
          "codeQualite": "Président",
          "libQualite": "Président",
          "libQualiteSex": "Présidente"
        },
        "organes": {
          "organeRef": "PO665158"
        }
      },
      {
        "@xsi:type": "MandatSimple_Type",
        "uid": "PM416143",
        "acteurRef": "PA1198",
        "legislature": "13",
        "typeOrgane": "GE",
        "dateDebut": "2008-09-01T02:00:00.000+02:00",
        "datePublication": null,
        "dateFin": "2012-06-19T02:00:00.000+02:00",
        "preseance": "20",
        "nominPrincipale": "1",
        "infosQualite": {
          "codeQualite": "Membre",
          "libQualite": "Membre",
          "libQualiteSex": "Membre"
        },
        "organes": {
          "organeRef": "PO402937"
        }
      },
      {
        "@xsi:type": "MandatSimple_Type",
        "uid": "PM698270",
        "acteurRef": "PA1198",
        "legislature": "14",
        "typeOrgane": "GE",
        "dateDebut": "2013-11-04T01:00:00.000+01:00",
        "datePublication": null,
        "dateFin": "2017-06-20T02:00:00.000+02:00",
        "preseance": "20",
        "nominPrincipale": "1",
        "infosQualite": {
          "codeQualite": "Membre",
          "libQualite": "Membre",
          "libQualiteSex": "Membre"
        },
        "organes": {
          "organeRef": "PO695593"
        }
      },
      {
        "@xsi:type": "MandatSimple_Type",
        "uid": "PM431240",
        "acteurRef": "PA1198",
        "legislature": "13",
        "typeOrgane": "GE",
        "dateDebut": "2011-11-24T01:00:00.000+01:00",
        "datePublication": null,
        "dateFin": "2012-06-19T02:00:00.000+02:00",
        "preseance": "20",
        "nominPrincipale": "1",
        "infosQualite": {
          "codeQualite": "Membre",
          "libQualite": "Membre",
          "libQualiteSex": "Membre"
        },
        "organes": {
          "organeRef": "PO428150"
        }
      },
      {
        "@xsi:type": "MandatSimple_Type",
        "uid": "PM712397",
        "acteurRef": "PA1198",
        "legislature": "14",
        "typeOrgane": "API",
        "dateDebut": "2015-10-01T02:00:00.000+02:00",
        "datePublication": null,
        "dateFin": "2017-06-20T02:00:00.000+02:00",
        "preseance": "4",
        "nominPrincipale": "1",
        "infosQualite": {
          "codeQualite": "Vice-Président",
          "libQualite": "Vice-Président",
          "libQualiteSex": "Vice-Présidente"
        },
        "organes": {
          "organeRef": "PO206064"
        }
      },
      {
        "@xsi:type": "MandatSimple_Type",
        "uid": "PM763366",
        "acteurRef": "PA1198",
        "legislature": "15",
        "typeOrgane": "ORGEXTPARL",
        "dateDebut": "2019-03-14T01:00:00.000+01:00",
        "datePublication": "2019-03-15T01:00:00.000+01:00",
        "dateFin": null,
        "preseance": "20",
        "nominPrincipale": "1",
        "infosQualite": {
          "codeQualite": "Titulaire",
          "libQualite": "Membre titulaire",
          "libQualiteSex": "Membre titulaire"
        },
        "organes": {
          "organeRef": "PO763346"
        }
      },
      {
        "@xsi:type": "MandatParlementaire_type",
        "uid": "PM732231",
        "acteurRef": "PA1198",
        "legislature": "15",
        "typeOrgane": "ASSEMBLEE",
        "dateDebut": "2017-06-28T02:00:00.000+02:00",
        "datePublication": null,
        "dateFin": "2018-01-31T01:00:00.000+01:00",
        "preseance": "26",
        "nominPrincipale": "1",
        "infosQualite": {
          "codeQualite": "Secrétaire",
          "libQualite": "Secrétaire de l'Assemblée nationale",
          "libQualiteSex": "Secrétaire de l'Assemblée nationale"
        },
        "organes": {
          "organeRef": "PO717460"
        },
        "suppleants": null,
        "chambre": null,
        "election": {
          "lieu": {
            "region": null,
            "regionType": null,
            "departement": null,
            "numDepartement": null,
            "numCirco": null
          },
          "causeMandat": null
        },
        "mandature": {
          "datePriseFonction": null,
          "causeFin": null,
          "premiereElection": "0",
          "placeHemicycle": null,
          "mandatRemplaceRef": null
        },
        "collaborateurs": null
      },
      {
        "@xsi:type": "MandatSimple_Type",
        "uid": "PM735143",
        "acteurRef": "PA1198",
        "legislature": "15",
        "typeOrgane": "GA",
        "dateDebut": "2017-09-26T02:00:00.000+02:00",
        "datePublication": null,
        "dateFin": null,
        "preseance": "20",
        "nominPrincipale": "0",
        "infosQualite": {
          "codeQualite": "Membre",
          "libQualite": "Membre",
          "libQualiteSex": "Membre"
        },
        "organes": {
          "organeRef": "PO733327"
        }
      },
      {
        "@xsi:type": "MandatSimple_Type",
        "uid": "PM401405",
        "acteurRef": "PA1198",
        "legislature": "13",
        "typeOrgane": "GA",
        "dateDebut": "2007-10-26T02:00:00.000+02:00",
        "datePublication": null,
        "dateFin": "2012-06-19T02:00:00.000+02:00",
        "preseance": "20",
        "nominPrincipale": "1",
        "infosQualite": {
          "codeQualite": "Membre",
          "libQualite": "Membre",
          "libQualiteSex": "Membre"
        },
        "organes": {
          "organeRef": "PO392895"
        }
      },
      {
        "@xsi:type": "MandatMission_Type",
        "uid": "PM743898",
        "acteurRef": "PA1198",
        "legislature": "15",
        "typeOrgane": "MISINFO",
        "dateDebut": "2017-10-24T02:00:00.000+02:00",
        "datePublication": null,
        "dateFin": "2018-04-04T02:00:00.000+02:00",
        "preseance": "10",
        "nominPrincipale": "0",
        "infosQualite": {
          "codeQualite": "Membre",
          "libQualite": "Membre",
          "libQualiteSex": "Membre"
        },
        "organes": {
          "organeRef": "PO743895"
        },
        "libelle": null,
        "missionSuivanteRef": null,
        "missionPrecedenteRef": null
      },
      {
        "@xsi:type": "MandatSimple_Type",
        "uid": "PM681032",
        "acteurRef": "PA1198",
        "legislature": "14",
        "typeOrgane": "GA",
        "dateDebut": "2012-10-15T02:00:00.000+02:00",
        "datePublication": null,
        "dateFin": "2017-06-20T02:00:00.000+02:00",
        "preseance": "20",
        "nominPrincipale": "1",
        "infosQualite": {
          "codeQualite": "Membre",
          "libQualite": "Membre",
          "libQualiteSex": "Membre"
        },
        "organes": {
          "organeRef": "PO675813"
        }
      },
      {
        "@xsi:type": "MandatSimple_Type",
        "uid": "PM401407",
        "acteurRef": "PA1198",
        "legislature": "13",
        "typeOrgane": "GA",
        "dateDebut": "2007-10-26T02:00:00.000+02:00",
        "datePublication": null,
        "dateFin": "2012-06-19T02:00:00.000+02:00",
        "preseance": "20",
        "nominPrincipale": "1",
        "infosQualite": {
          "codeQualite": "Membre",
          "libQualite": "Membre",
          "libQualiteSex": "Membre"
        },
        "organes": {
          "organeRef": "PO393182"
        }
      },
      {
        "@xsi:type": "MandatSimple_Type",
        "uid": "PM406897",
        "acteurRef": "PA1198",
        "legislature": "13",
        "typeOrgane": "GE",
        "dateDebut": "2008-01-16T01:00:00.000+01:00",
        "datePublication": null,
        "dateFin": "2012-06-19T02:00:00.000+02:00",
        "preseance": "20",
        "nominPrincipale": "1",
        "infosQualite": {
          "codeQualite": "Membre",
          "libQualite": "Membre",
          "libQualiteSex": "Membre"
        },
        "organes": {
          "organeRef": "PO402895"
        }
      },
      {
        "@xsi:type": "MandatSimple_Type",
        "uid": "PM692130",
        "acteurRef": "PA1198",
        "legislature": "14",
        "typeOrgane": "GA",
        "dateDebut": "2013-02-27T01:00:00.000+01:00",
        "datePublication": null,
        "dateFin": "2017-06-20T02:00:00.000+02:00",
        "preseance": "20",
        "nominPrincipale": "1",
        "infosQualite": {
          "codeQualite": "Membre",
          "libQualite": "Membre",
          "libQualiteSex": "Membre"
        },
        "organes": {
          "organeRef": "PO675765"
        }
      },
      {
        "@xsi:type": "MandatSimple_Type",
        "uid": "PM390477",
        "acteurRef": "PA1198",
        "legislature": "13",
        "typeOrgane": "COMPER",
        "dateDebut": "2007-06-27T02:00:00.000+02:00",
        "datePublication": "2007-06-28T02:00:00.000+02:00",
        "dateFin": "2009-03-24T01:00:00.000+01:00",
        "preseance": "32",
        "nominPrincipale": "1",
        "infosQualite": {
          "codeQualite": "Membre",
          "libQualite": "Membre",
          "libQualiteSex": "Membre"
        },
        "organes": {
          "organeRef": "PO59045"
        }
      },
      {
        "@xsi:type": "MandatSimple_Type",
        "uid": "PM740558",
        "acteurRef": "PA1198",
        "legislature": "15",
        "typeOrgane": "GA",
        "dateDebut": "2017-10-18T02:00:00.000+02:00",
        "datePublication": null,
        "dateFin": null,
        "preseance": "8",
        "nominPrincipale": "1",
        "infosQualite": {
          "codeQualite": "Vice-Président",
          "libQualite": "Vice-Président",
          "libQualiteSex": "Vice-Présidente"
        },
        "organes": {
          "organeRef": "PO733562"
        }
      },
      {
        "@xsi:type": "MandatSimple_Type",
        "uid": "PM421890",
        "acteurRef": "PA1198",
        "legislature": "13",
        "typeOrgane": "COMPER",
        "dateDebut": "2009-10-09T02:00:00.000+02:00",
        "datePublication": "2009-10-09T02:00:00.000+02:00",
        "dateFin": "2010-07-12T02:00:00.000+02:00",
        "preseance": "32",
        "nominPrincipale": "1",
        "infosQualite": {
          "codeQualite": "Membre",
          "libQualite": "Membre",
          "libQualiteSex": "Membre"
        },
        "organes": {
          "organeRef": "PO420120"
        }
      },
      {
        "@xsi:type": "MandatSimple_Type",
        "uid": "PM681034",
        "acteurRef": "PA1198",
        "legislature": "14",
        "typeOrgane": "GA",
        "dateDebut": "2012-10-15T02:00:00.000+02:00",
        "datePublication": null,
        "dateFin": "2017-06-20T02:00:00.000+02:00",
        "preseance": "20",
        "nominPrincipale": "1",
        "infosQualite": {
          "codeQualite": "Membre",
          "libQualite": "Membre",
          "libQualiteSex": "Membre"
        },
        "organes": {
          "organeRef": "PO675841"
        }
      },
      {
        "@xsi:type": "MandatSimple_Type",
        "uid": "PM401409",
        "acteurRef": "PA1198",
        "legislature": "13",
        "typeOrgane": "GA",
        "dateDebut": "2007-10-26T02:00:00.000+02:00",
        "datePublication": null,
        "dateFin": "2012-06-19T02:00:00.000+02:00",
        "preseance": "20",
        "nominPrincipale": "1",
        "infosQualite": {
          "codeQualite": "Membre",
          "libQualite": "Membre",
          "libQualiteSex": "Membre"
        },
        "organes": {
          "organeRef": "PO393363"
        }
      },
      {
        "@xsi:type": "MandatMission_Type",
        "uid": "PM760034",
        "acteurRef": "PA1198",
        "legislature": "15",
        "typeOrgane": "MISINFO",
        "dateDebut": "2018-10-17T02:00:00.000+02:00",
        "datePublication": null,
        "dateFin": null,
        "preseance": "10",
        "nominPrincipale": "0",
        "infosQualite": {
          "codeQualite": "Membre",
          "libQualite": "Membre",
          "libQualiteSex": "Membre"
        },
        "organes": {
          "organeRef": "PO760031"
        },
        "libelle": null,
        "missionSuivanteRef": null,
        "missionPrecedenteRef": null
      },
      {
        "@xsi:type": "MandatSimple_Type",
        "uid": "PM712478",
        "acteurRef": "PA1198",
        "legislature": "14",
        "typeOrgane": "GE",
        "dateDebut": "2016-04-26T02:00:00.000+02:00",
        "datePublication": null,
        "dateFin": "2017-06-20T02:00:00.000+02:00",
        "preseance": "8",
        "nominPrincipale": "1",
        "infosQualite": {
          "codeQualite": "Vice-Président",
          "libQualite": "Vice-Président",
          "libQualiteSex": "Vice-Présidente"
        },
        "organes": {
          "organeRef": "PO712100"
        }
      },
      {
        "@xsi:type": "MandatSimple_Type",
        "uid": "PM746567",
        "acteurRef": "PA1198",
        "legislature": "15",
        "typeOrgane": "GA",
        "dateDebut": "2017-12-19T01:00:00.000+01:00",
        "datePublication": null,
        "dateFin": null,
        "preseance": "20",
        "nominPrincipale": "0",
        "infosQualite": {
          "codeQualite": "Membre",
          "libQualite": "Membre",
          "libQualiteSex": "Membre"
        },
        "organes": {
          "organeRef": "PO733432"
        }
      },
      {
        "@xsi:type": "MandatSimple_Type",
        "uid": "PM681036",
        "acteurRef": "PA1198",
        "legislature": "14",
        "typeOrgane": "GA",
        "dateDebut": "2012-10-15T02:00:00.000+02:00",
        "datePublication": null,
        "dateFin": "2017-06-20T02:00:00.000+02:00",
        "preseance": "20",
        "nominPrincipale": "1",
        "infosQualite": {
          "codeQualite": "Membre",
          "libQualite": "Membre",
          "libQualiteSex": "Membre"
        },
        "organes": {
          "organeRef": "PO675716"
        }
      },
      {
        "@xsi:type": "MandatMission_Type",
        "uid": "PM760036",
        "acteurRef": "PA1198",
        "legislature": "15",
        "typeOrgane": "MISINFO",
        "dateDebut": "2018-10-17T02:00:00.000+02:00",
        "datePublication": null,
        "dateFin": null,
        "preseance": "5",
        "nominPrincipale": "1",
        "infosQualite": {
          "codeQualite": "Co-rapporteur",
          "libQualite": "Co-rapporteur",
          "libQualiteSex": "Co-rapporteure"
        },
        "organes": {
          "organeRef": "PO760031"
        },
        "libelle": null,
        "missionSuivanteRef": null,
        "missionPrecedenteRef": null
      },
      {
        "@xsi:type": "MandatSimple_Type",
        "uid": "PM746355",
        "acteurRef": "PA1198",
        "legislature": "15",
        "typeOrgane": "GA",
        "dateDebut": "2017-12-12T01:00:00.000+01:00",
        "datePublication": null,
        "dateFin": null,
        "preseance": "20",
        "nominPrincipale": "1",
        "infosQualite": {
          "codeQualite": "Membre",
          "libQualite": "Membre",
          "libQualiteSex": "Membre"
        },
        "organes": {
          "organeRef": "PO733062"
        }
      },
      {
        "@xsi:type": "MandatSimple_Type",
        "uid": "PM690989",
        "acteurRef": "PA1198",
        "legislature": "14",
        "typeOrgane": "GE",
        "dateDebut": "2013-02-08T01:00:00.000+01:00",
        "datePublication": null,
        "dateFin": "2017-06-20T02:00:00.000+02:00",
        "preseance": "8",
        "nominPrincipale": "1",
        "infosQualite": {
          "codeQualite": "Vice-Président",
          "libQualite": "Vice-Président",
          "libQualiteSex": "Vice-Présidente"
        },
        "organes": {
          "organeRef": "PO686424"
        }
      },
      {
        "@xsi:type": "MandatSimple_Type",
        "uid": "PM424950",
        "acteurRef": "PA1198",
        "legislature": "13",
        "typeOrgane": "COMPER",
        "dateDebut": "2010-09-11T02:00:00.000+02:00",
        "datePublication": "2010-09-11T02:00:00.000+02:00",
        "dateFin": "2012-06-19T02:00:00.000+02:00",
        "preseance": "32",
        "nominPrincipale": "1",
        "infosQualite": {
          "codeQualite": "Membre",
          "libQualite": "Membre",
          "libQualiteSex": "Membre"
        },
        "organes": {
          "organeRef": "PO420120"
        }
      },
      {
        "@xsi:type": "MandatSimple_Type",
        "uid": "PM724307",
        "acteurRef": "PA1198",
        "legislature": "15",
        "typeOrgane": "GP",
        "dateDebut": "2017-06-21T02:00:00.000+02:00",
        "datePublication": null,
        "dateFin": "2017-06-26T02:00:00.000+02:00",
        "preseance": "28",
        "nominPrincipale": "1",
        "infosQualite": {
          "codeQualite": "Député non-inscrit",
          "libQualite": "Député non-inscrit",
          "libQualiteSex": "Députée non-inscrite"
        },
        "organes": {
          "organeRef": "PO723569"
        }
      },
      {
        "@xsi:type": "MandatSimple_Type",
        "uid": "PM740996",
        "acteurRef": "PA1198",
        "legislature": "15",
        "typeOrgane": "GA",
        "dateDebut": "2017-10-24T02:00:00.000+02:00",
        "datePublication": null,
        "dateFin": null,
        "preseance": "8",
        "nominPrincipale": "1",
        "infosQualite": {
          "codeQualite": "Vice-Président",
          "libQualite": "Vice-Président",
          "libQualiteSex": "Vice-Présidente"
        },
        "organes": {
          "organeRef": "PO733187"
        }
      },
      {
        "@xsi:type": "MandatSimple_Type",
        "uid": "PM688601",
        "acteurRef": "PA1198",
        "legislature": "14",
        "typeOrgane": "GE",
        "dateDebut": "2013-01-23T01:00:00.000+01:00",
        "datePublication": null,
        "dateFin": "2017-06-20T02:00:00.000+02:00",
        "preseance": "20",
        "nominPrincipale": "1",
        "infosQualite": {
          "codeQualite": "Membre",
          "libQualite": "Membre",
          "libQualiteSex": "Membre"
        },
        "organes": {
          "organeRef": "PO686196"
        }
      },
      {
        "@xsi:type": "MandatSimple_Type",
        "uid": "PM732282",
        "acteurRef": "PA1198",
        "legislature": "15",
        "typeOrgane": "COMPER",
        "dateDebut": "2017-06-30T02:00:00.000+02:00",
        "datePublication": "2017-06-30T02:00:00.000+02:00",
        "dateFin": "2018-10-01T02:00:00.000+02:00",
        "preseance": "16",
        "nominPrincipale": "1",
        "infosQualite": {
          "codeQualite": "Secrétaire",
          "libQualite": "Secrétaire",
          "libQualiteSex": "Secrétaire"
        },
        "organes": {
          "organeRef": "PO59047"
        }
      },
      {
        "@xsi:type": "MandatSimple_Type",
        "uid": "PM387217",
        "acteurRef": "PA1198",
        "legislature": "13",
        "typeOrgane": "GP",
        "dateDebut": "2007-06-20T02:00:00.000+02:00",
        "datePublication": null,
        "dateFin": "2007-06-26T02:00:00.000+02:00",
        "preseance": "28",
        "nominPrincipale": "1",
        "infosQualite": {
          "codeQualite": "Député non-inscrit",
          "libQualite": "Député non-inscrit",
          "libQualiteSex": "Députée non-inscrite"
        },
        "organes": {
          "organeRef": "PO387155"
        }
      },
      {
        "@xsi:type": "MandatSimple_Type",
        "uid": "PM684744",
        "acteurRef": "PA1198",
        "legislature": "14",
        "typeOrgane": "GEVI",
        "dateDebut": "2012-11-20T01:00:00.000+01:00",
        "datePublication": null,
        "dateFin": "2017-06-20T02:00:00.000+02:00",
        "preseance": "14",
        "nominPrincipale": "1",
        "infosQualite": {
          "codeQualite": "Secrétaire",
          "libQualite": "Secrétaire",
          "libQualiteSex": "Secrétaire"
        },
        "organes": {
          "organeRef": "PO675803"
        }
      },
      {
        "@xsi:type": "MandatSimple_Type",
        "uid": "PM747414",
        "acteurRef": "PA1198",
        "legislature": "15",
        "typeOrgane": "GA",
        "dateDebut": "2017-12-20T01:00:00.000+01:00",
        "datePublication": null,
        "dateFin": null,
        "preseance": "8",
        "nominPrincipale": "1",
        "infosQualite": {
          "codeQualite": "Vice-Président",
          "libQualite": "Vice-Président",
          "libQualiteSex": "Vice-Présidente"
        },
        "organes": {
          "organeRef": "PO733557"
        }
      },
      {
        "@xsi:type": "MandatSimple_Type",
        "uid": "PM685404",
        "acteurRef": "PA1198",
        "legislature": "14",
        "typeOrgane": "GA",
        "dateDebut": "2012-12-04T01:00:00.000+01:00",
        "datePublication": null,
        "dateFin": "2017-06-20T02:00:00.000+02:00",
        "preseance": "8",
        "nominPrincipale": "1",
        "infosQualite": {
          "codeQualite": "Vice-Président",
          "libQualite": "Vice-Président",
          "libQualiteSex": "Vice-Présidente"
        },
        "organes": {
          "organeRef": "PO675716"
        }
      },
      {
        "@xsi:type": "MandatSimple_Type",
        "uid": "PM751595",
        "acteurRef": "PA1198",
        "legislature": "15",
        "typeOrgane": "GE",
        "dateDebut": "2018-02-21T01:00:00.000+01:00",
        "datePublication": null,
        "dateFin": null,
        "preseance": "20",
        "nominPrincipale": "1",
        "infosQualite": {
          "codeQualite": "Membre",
          "libQualite": "Membre",
          "libQualiteSex": "Membre"
        },
        "organes": {
          "organeRef": "PO747261"
        }
      },
      {
        "@xsi:type": "MandatSimple_Type",
        "uid": "PM685726",
        "acteurRef": "PA1198",
        "legislature": null,
        "typeOrgane": "PARPOL",
        "dateDebut": "2012-12-01T01:00:00.000+01:00",
        "datePublication": null,
        "dateFin": "2017-06-20T02:00:00.000+02:00",
        "preseance": "5",
        "nominPrincipale": "1",
        "infosQualite": {
          "codeQualite": "Membre",
          "libQualite": "Membre",
          "libQualiteSex": "Membre"
        },
        "organes": {
          "organeRef": "PO684932"
        }
      },
      {
        "@xsi:type": "MandatSimple_Type",
        "uid": "PM399051",
        "acteurRef": "PA1198",
        "legislature": "13",
        "typeOrgane": "GA",
        "dateDebut": "2007-10-15T02:00:00.000+02:00",
        "datePublication": null,
        "dateFin": "2012-06-19T02:00:00.000+02:00",
        "preseance": "20",
        "nominPrincipale": "1",
        "infosQualite": {
          "codeQualite": "Membre",
          "libQualite": "Membre",
          "libQualiteSex": "Membre"
        },
        "organes": {
          "organeRef": "PO393075"
        }
      },
      {
        "@xsi:type": "MandatSimple_Type",
        "uid": "PM743626",
        "acteurRef": "PA1198",
        "legislature": "15",
        "typeOrgane": "GA",
        "dateDebut": "2017-11-21T01:00:00.000+01:00",
        "datePublication": null,
        "dateFin": null,
        "preseance": "8",
        "nominPrincipale": "1",
        "infosQualite": {
          "codeQualite": "Vice-Président",
          "libQualite": "Vice-Président",
          "libQualiteSex": "Vice-Présidente"
        },
        "organes": {
          "organeRef": "PO733512"
        }
      },
      {
        "@xsi:type": "MandatSimple_Type",
        "uid": "PM694068",
        "acteurRef": "PA1198",
        "legislature": "14",
        "typeOrgane": "GE",
        "dateDebut": "2013-04-24T02:00:00.000+02:00",
        "datePublication": null,
        "dateFin": "2017-06-20T02:00:00.000+02:00",
        "preseance": "20",
        "nominPrincipale": "1",
        "infosQualite": {
          "codeQualite": "Membre",
          "libQualite": "Membre",
          "libQualiteSex": "Membre"
        },
        "organes": {
          "organeRef": "PO692289"
        }
      },
      {
        "@xsi:type": "MandatSimple_Type",
        "uid": "PM752760",
        "acteurRef": "PA1198",
        "legislature": "15",
        "typeOrgane": "GE",
        "dateDebut": "2018-03-07T01:00:00.000+01:00",
        "datePublication": null,
        "dateFin": null,
        "preseance": "20",
        "nominPrincipale": "0",
        "infosQualite": {
          "codeQualite": "Membre",
          "libQualite": "Membre",
          "libQualiteSex": "Membre"
        },
        "organes": {
          "organeRef": "PO747140"
        }
      },
      {
        "@xsi:type": "MandatParlementaire_type",
        "uid": "PM656839",
        "acteurRef": "PA1198",
        "legislature": "14",
        "typeOrgane": "ASSEMBLEE",
        "dateDebut": "2012-06-27T02:00:00.000+02:00",
        "datePublication": null,
        "dateFin": "2017-06-20T02:00:00.000+02:00",
        "preseance": "5",
        "nominPrincipale": "1",
        "infosQualite": {
          "codeQualite": "Vice-Président",
          "libQualite": "Vice-président de l'Assemblée nationale",
          "libQualiteSex": "Vice-présidente de l'Assemblée nationale"
        },
        "organes": {
          "organeRef": "PO644420"
        },
        "suppleants": null,
        "chambre": null,
        "election": {
          "lieu": {
            "region": null,
            "regionType": null,
            "departement": null,
            "numDepartement": null,
            "numCirco": null
          },
          "causeMandat": null
        },
        "mandature": {
          "datePriseFonction": null,
          "causeFin": null,
          "premiereElection": "0",
          "placeHemicycle": null,
          "mandatRemplaceRef": null
        },
        "collaborateurs": null
      },
      {
        "@xsi:type": "MandatSimple_Type",
        "uid": "PM424671",
        "acteurRef": "PA1198",
        "legislature": "13",
        "typeOrgane": "COMPER",
        "dateDebut": "2010-07-13T02:00:00.000+02:00",
        "datePublication": "2010-07-13T02:00:00.000+02:00",
        "dateFin": "2010-09-10T02:00:00.000+02:00",
        "preseance": "32",
        "nominPrincipale": "1",
        "infosQualite": {
          "codeQualite": "Membre",
          "libQualite": "Membre",
          "libQualiteSex": "Membre"
        },
        "organes": {
          "organeRef": "PO59047"
        }
      },
      {
        "@xsi:type": "MandatSimple_Type",
        "uid": "PM405786",
        "acteurRef": "PA1198",
        "legislature": "13",
        "typeOrgane": "GA",
        "dateDebut": "2007-12-19T01:00:00.000+01:00",
        "datePublication": null,
        "dateFin": "2012-06-19T02:00:00.000+02:00",
        "preseance": "8",
        "nominPrincipale": "1",
        "infosQualite": {
          "codeQualite": "Vice-Président",
          "libQualite": "Vice-Président",
          "libQualiteSex": "Vice-Présidente"
        },
        "organes": {
          "organeRef": "PO393105"
        }
      },
      {
        "@xsi:type": "MandatParlementaire_type",
        "uid": "PM722532",
        "acteurRef": "PA1198",
        "legislature": "15",
        "typeOrgane": "ASSEMBLEE",
        "dateDebut": "2017-06-18T02:00:00.000+02:00",
        "datePublication": null,
        "dateFin": null,
        "preseance": "50",
        "nominPrincipale": "1",
        "infosQualite": {
          "codeQualite": "membre",
          "libQualite": "membre",
          "libQualiteSex": "membre"
        },
        "organes": {
          "organeRef": "PO717460"
        },
        "suppleants": {
          "suppleant": {
            "dateDebut": "2017-06-18T02:00:00.000+02:00",
            "dateFin": null,
            "suppleantRef": "PA719014"
          }
        },
        "chambre": null,
        "election": {
          "lieu": {
            "region": "Normandie",
            "regionType": "Métropolitain",
            "departement": "Calvados",
            "numDepartement": "14",
            "numCirco": "2"
          },
          "causeMandat": "élections générales",
          "refCirconscription": "PO717592"
        },
        "mandature": {
          "datePriseFonction": "2017-06-21T02:00:00.000+02:00",
          "causeFin": null,
          "premiereElection": "1",
          "placeHemicycle": "509",
          "mandatRemplaceRef": null
        },
        "collaborateurs": {
          "collaborateur": [
            {
              "qualite": "Mme",
              "prenom": "Valérie",
              "nom": "Scognamiglio",
              "dateDebut": null,
              "dateFin": null
            },
            {
              "qualite": "M.",
              "prenom": "Pascal",
              "nom": "Leroy",
              "dateDebut": null,
              "dateFin": null
            },
            {
              "qualite": "Mme",
              "prenom": "Emmanuelle",
              "nom": "Jardin-Payet",
              "dateDebut": null,
              "dateFin": null
            }
          ]
        }
      },
      {
        "@xsi:type": "MandatSimple_Type",
        "uid": "PM737701",
        "acteurRef": "PA1198",
        "legislature": "15",
        "typeOrgane": "GA",
        "dateDebut": "2017-10-05T02:00:00.000+02:00",
        "datePublication": null,
        "dateFin": null,
        "preseance": "20",
        "nominPrincipale": "0",
        "infosQualite": {
          "codeQualite": "Membre",
          "libQualite": "Membre",
          "libQualiteSex": "Membre"
        },
        "organes": {
          "organeRef": "PO733187"
        }
      },
      {
        "@xsi:type": "MandatParlementaire_type",
        "uid": "PM645393",
        "acteurRef": "PA1198",
        "legislature": "14",
        "typeOrgane": "ASSEMBLEE",
        "dateDebut": "2012-06-20T02:00:00.000+02:00",
        "datePublication": null,
        "dateFin": "2017-06-20T02:00:00.000+02:00",
        "preseance": "50",
        "nominPrincipale": "1",
        "infosQualite": {
          "codeQualite": "membre",
          "libQualite": "membre",
          "libQualiteSex": "membre"
        },
        "organes": {
          "organeRef": "PO644420"
        },
        "suppleants": {
          "suppleant": {
            "dateDebut": "2012-06-20T02:00:00.000+02:00",
            "dateFin": "2017-06-20T02:00:00.000+02:00",
            "suppleantRef": "PA2409"
          }
        },
        "chambre": null,
        "election": {
          "lieu": {
            "region": "Normandie",
            "regionType": "Métropolitain",
            "departement": "Calvados",
            "numDepartement": "14",
            "numCirco": "2"
          },
          "causeMandat": "élections générales",
          "refCirconscription": "PO644481"
        },
        "mandature": {
          "datePriseFonction": "2012-06-20T02:00:00.000+02:00",
          "causeFin": "Fin de législature",
          "premiereElection": "1",
          "placeHemicycle": "509",
          "mandatRemplaceRef": null
        },
        "collaborateurs": null
      },
      {
        "@xsi:type": "MandatSimple_Type",
        "uid": "PM713191",
        "acteurRef": "PA1198",
        "legislature": "14",
        "typeOrgane": "GP",
        "dateDebut": "2016-05-25T02:00:00.000+02:00",
        "datePublication": null,
        "dateFin": "2017-06-20T02:00:00.000+02:00",
        "preseance": "20",
        "nominPrincipale": "1",
        "infosQualite": {
          "codeQualite": "Membre",
          "libQualite": "Membre du",
          "libQualiteSex": "Membre du"
        },
        "organes": {
          "organeRef": "PO713077"
        }
      },
      {
        "@xsi:type": "MandatSimple_Type",
        "uid": "PM399049",
        "acteurRef": "PA1198",
        "legislature": "13",
        "typeOrgane": "GA",
        "dateDebut": "2007-10-15T02:00:00.000+02:00",
        "datePublication": null,
        "dateFin": "2012-06-19T02:00:00.000+02:00",
        "preseance": "20",
        "nominPrincipale": "1",
        "infosQualite": {
          "codeQualite": "Membre",
          "libQualite": "Membre",
          "libQualiteSex": "Membre"
        },
        "organes": {
          "organeRef": "PO392845"
        }
      },
      {
        "@xsi:type": "MandatSimple_Type",
        "uid": "PM399053",
        "acteurRef": "PA1198",
        "legislature": "13",
        "typeOrgane": "GA",
        "dateDebut": "2007-10-15T02:00:00.000+02:00",
        "datePublication": null,
        "dateFin": "2012-06-19T02:00:00.000+02:00",
        "preseance": "20",
        "nominPrincipale": "1",
        "infosQualite": {
          "codeQualite": "Membre",
          "libQualite": "Membre",
          "libQualiteSex": "Membre"
        },
        "organes": {
          "organeRef": "PO393263"
        }
      },
      {
        "@xsi:type": "MandatSimple_Type",
        "uid": "PM734466",
        "acteurRef": "PA1198",
        "legislature": "15",
        "typeOrgane": "API",
        "dateDebut": "2017-08-02T02:00:00.000+02:00",
        "datePublication": "2017-08-03T02:00:00.000+02:00",
        "dateFin": null,
        "preseance": "20",
        "nominPrincipale": "1",
        "infosQualite": {
          "codeQualite": "Membre",
          "libQualite": "Membre",
          "libQualiteSex": "Membre"
        },
        "organes": {
          "organeRef": "PO206064"
        }
      },
      {
        "@xsi:type": "MandatSimple_Type",
        "uid": "PM425616",
        "acteurRef": "PA1198",
        "legislature": "13",
        "typeOrgane": "CNPS",
        "dateDebut": "2010-11-10T01:00:00.000+01:00",
        "datePublication": "2011-11-11T01:00:00.000+01:00",
        "dateFin": "2011-06-23T02:00:00.000+02:00",
        "preseance": "20",
        "nominPrincipale": "1",
        "infosQualite": {
          "codeQualite": "Membre",
          "libQualite": "Membre",
          "libQualiteSex": "Membre"
        },
        "organes": {
          "organeRef": "PO425550"
        }
      },
      {
        "@xsi:type": "MandatSimple_Type",
        "uid": "PM760189",
        "acteurRef": "PA1198",
        "legislature": "15",
        "typeOrgane": "GE",
        "dateDebut": "2018-11-12T01:00:00.000+01:00",
        "datePublication": null,
        "dateFin": null,
        "preseance": "20",
        "nominPrincipale": "1",
        "infosQualite": {
          "codeQualite": "Membre",
          "libQualite": "Membre",
          "libQualiteSex": "Membre"
        },
        "organes": {
          "organeRef": "PO747215"
        }
      },
      {
        "@xsi:type": "MandatSimple_Type",
        "uid": "PM746440",
        "acteurRef": "PA1198",
        "legislature": "15",
        "typeOrgane": "GA",
        "dateDebut": "2017-12-14T01:00:00.000+01:00",
        "datePublication": null,
        "dateFin": null,
        "preseance": "20",
        "nominPrincipale": "1",
        "infosQualite": {
          "codeQualite": "Membre",
          "libQualite": "Membre",
          "libQualiteSex": "Membre"
        },
        "organes": {
          "organeRef": "PO732974"
        }
      },
      {
        "@xsi:type": "MandatSimple_Type",
        "uid": "PM698147",
        "acteurRef": "PA1198",
        "legislature": "14",
        "typeOrgane": "CNPS",
        "dateDebut": "2013-10-29T01:00:00.000+01:00",
        "datePublication": "2013-10-30T01:00:00.000+01:00",
        "dateFin": "2016-04-14T02:00:00.000+02:00",
        "preseance": "14",
        "nominPrincipale": "1",
        "infosQualite": {
          "codeQualite": "Secrétaire",
          "libQualite": "Secrétaire",
          "libQualiteSex": "Secrétaire"
        },
        "organes": {
          "organeRef": "PO697810"
        }
      },
      {
        "@xsi:type": "MandatSimple_Type",
        "uid": "PM704489",
        "acteurRef": "PA1198",
        "legislature": "14",
        "typeOrgane": "API",
        "dateDebut": "2014-10-08T02:00:00.000+02:00",
        "datePublication": null,
        "dateFin": "2017-06-20T02:00:00.000+02:00",
        "preseance": "20",
        "nominPrincipale": "1",
        "infosQualite": {
          "codeQualite": "Membre",
          "libQualite": "Membre",
          "libQualiteSex": "Membre"
        },
        "organes": {
          "organeRef": "PO201115"
        }
      },
      {
        "@xsi:type": "MandatSimple_Type",
        "uid": "PM390136",
        "acteurRef": "PA1198",
        "legislature": "13",
        "typeOrgane": "GP",
        "dateDebut": "2007-06-27T02:00:00.000+02:00",
        "datePublication": "2007-06-27T02:00:00.000+02:00",
        "dateFin": "2012-06-19T02:00:00.000+02:00",
        "preseance": "20",
        "nominPrincipale": "1",
        "infosQualite": {
          "codeQualite": "Membre",
          "libQualite": "Membre du",
          "libQualiteSex": "Membre du"
        },
        "organes": {
          "organeRef": "PO389507"
        }
      },
      {
        "@xsi:type": "MandatSimple_Type",
        "uid": "PM737703",
        "acteurRef": "PA1198",
        "legislature": "15",
        "typeOrgane": "GA",
        "dateDebut": "2017-10-05T02:00:00.000+02:00",
        "datePublication": null,
        "dateFin": null,
        "preseance": "20",
        "nominPrincipale": "0",
        "infosQualite": {
          "codeQualite": "Membre",
          "libQualite": "Membre",
          "libQualiteSex": "Membre"
        },
        "organes": {
          "organeRef": "PO733292"
        }
      },
      {
        "@xsi:type": "MandatSimple_Type",
        "uid": "PM399055",
        "acteurRef": "PA1198",
        "legislature": "13",
        "typeOrgane": "GA",
        "dateDebut": "2007-10-15T02:00:00.000+02:00",
        "datePublication": null,
        "dateFin": "2012-06-19T02:00:00.000+02:00",
        "preseance": "20",
        "nominPrincipale": "1",
        "infosQualite": {
          "codeQualite": "Membre",
          "libQualite": "Membre",
          "libQualiteSex": "Membre"
        },
        "organes": {
          "organeRef": "PO393478"
        }
      },
      {
        "@xsi:type": "MandatSimple_Type",
        "uid": "PM430675",
        "acteurRef": "PA1198",
        "legislature": "13",
        "typeOrgane": "DELEGBUREAU",
        "dateDebut": "2011-10-12T02:00:00.000+02:00",
        "datePublication": null,
        "dateFin": "2012-06-19T02:00:00.000+02:00",
        "preseance": "1",
        "nominPrincipale": "1",
        "infosQualite": {
          "codeQualite": "Président",
          "libQualite": "Président",
          "libQualiteSex": "Présidente"
        },
        "organes": {
          "organeRef": "PO391172"
        }
      },
      {
        "@xsi:type": "MandatSimple_Type",
        "uid": "PM688220",
        "acteurRef": "PA1198",
        "legislature": "14",
        "typeOrgane": "GE",
        "dateDebut": "2013-01-18T01:00:00.000+01:00",
        "datePublication": null,
        "dateFin": "2017-06-20T02:00:00.000+02:00",
        "preseance": "20",
        "nominPrincipale": "1",
        "infosQualite": {
          "codeQualite": "Membre",
          "libQualite": "Membre",
          "libQualiteSex": "Membre"
        },
        "organes": {
          "organeRef": "PO687403"
        }
      },
      {
        "@xsi:type": "MandatSimple_Type",
        "uid": "PM737705",
        "acteurRef": "PA1198",
        "legislature": "15",
        "typeOrgane": "GA",
        "dateDebut": "2017-10-05T02:00:00.000+02:00",
        "datePublication": null,
        "dateFin": null,
        "preseance": "20",
        "nominPrincipale": "0",
        "infosQualite": {
          "codeQualite": "Membre",
          "libQualite": "Membre",
          "libQualiteSex": "Membre"
        },
        "organes": {
          "organeRef": "PO733512"
        }
      },
      {
        "@xsi:type": "MandatSimple_Type",
        "uid": "PM678862",
        "acteurRef": "PA1198",
        "legislature": "14",
        "typeOrgane": "ORGEXTPARL",
        "dateDebut": "2012-10-03T02:00:00.000+02:00",
        "datePublication": "2012-10-04T02:00:00.000+02:00",
        "dateFin": "2017-06-20T02:00:00.000+02:00",
        "preseance": "20",
        "nominPrincipale": "1",
        "infosQualite": {
          "codeQualite": "Titulaire",
          "libQualite": "Membre titulaire",
          "libQualiteSex": "Membre titulaire"
        },
        "organes": {
          "organeRef": "PO60185"
        }
      },
      {
        "@xsi:type": "MandatSimple_Type",
        "uid": "PM419231",
        "acteurRef": "PA1198",
        "legislature": "13",
        "typeOrgane": "COMPER",
        "dateDebut": "2009-05-05T02:00:00.000+02:00",
        "datePublication": "2009-05-05T02:00:00.000+02:00",
        "dateFin": "2009-10-08T02:00:00.000+02:00",
        "preseance": "32",
        "nominPrincipale": "1",
        "infosQualite": {
          "codeQualite": "Membre",
          "libQualite": "Membre",
          "libQualiteSex": "Membre"
        },
        "organes": {
          "organeRef": "PO59051"
        }
      },
      {
        "@xsi:type": "MandatSimple_Type",
        "uid": "PM737707",
        "acteurRef": "PA1198",
        "legislature": "15",
        "typeOrgane": "GA",
        "dateDebut": "2017-10-05T02:00:00.000+02:00",
        "datePublication": null,
        "dateFin": null,
        "preseance": "20",
        "nominPrincipale": "0",
        "infosQualite": {
          "codeQualite": "Membre",
          "libQualite": "Membre",
          "libQualiteSex": "Membre"
        },
        "organes": {
          "organeRef": "PO733562"
        }
      },
      {
        "@xsi:type": "MandatSimple_Type",
        "uid": "PM657405",
        "acteurRef": "PA1198",
        "legislature": "14",
        "typeOrgane": "COMPER",
        "dateDebut": "2012-06-28T02:00:00.000+02:00",
        "datePublication": "2012-06-28T02:00:00.000+02:00",
        "dateFin": "2013-01-14T01:00:00.000+01:00",
        "preseance": "32",
        "nominPrincipale": "1",
        "infosQualite": {
          "codeQualite": "Membre",
          "libQualite": "Membre",
          "libQualiteSex": "Membre"
        },
        "organes": {
          "organeRef": "PO59051"
        }
      },
      {
        "@xsi:type": "MandatSimple_Type",
        "uid": "PM409586",
        "acteurRef": "PA1198",
        "legislature": "13",
        "typeOrgane": "GE",
        "dateDebut": "2008-02-22T01:00:00.000+01:00",
        "datePublication": null,
        "dateFin": "2012-06-19T02:00:00.000+02:00",
        "preseance": "20",
        "nominPrincipale": "0",
        "infosQualite": {
          "codeQualite": "Membre",
          "libQualite": "Membre",
          "libQualiteSex": "Membre"
        },
        "organes": {
          "organeRef": "PO402715"
        }
      },
      {
        "@xsi:type": "MandatSimple_Type",
        "uid": "PM688371",
        "acteurRef": "PA1198",
        "legislature": "14",
        "typeOrgane": "GE",
        "dateDebut": "2013-01-16T01:00:00.000+01:00",
        "datePublication": null,
        "dateFin": "2017-06-20T02:00:00.000+02:00",
        "preseance": "20",
        "nominPrincipale": "1",
        "infosQualite": {
          "codeQualite": "Membre",
          "libQualite": "Membre",
          "libQualiteSex": "Membre"
        },
        "organes": {
          "organeRef": "PO686204"
        }
      },
      {
        "@xsi:type": "MandatSimple_Type",
        "uid": "PM697930",
        "acteurRef": "PA1198",
        "legislature": "14",
        "typeOrgane": "CNPS",
        "dateDebut": "2013-10-22T02:00:00.000+02:00",
        "datePublication": "2013-10-22T02:00:00.000+02:00",
        "dateFin": "2016-04-14T02:00:00.000+02:00",
        "preseance": "20",
        "nominPrincipale": "1",
        "infosQualite": {
          "codeQualite": "Membre",
          "libQualite": "Membre",
          "libQualiteSex": "Membre"
        },
        "organes": {
          "organeRef": "PO697810"
        }
      },
      {
        "@xsi:type": "MandatSimple_Type",
        "uid": "PM746381",
        "acteurRef": "PA1198",
        "legislature": "15",
        "typeOrgane": "GA",
        "dateDebut": "2017-11-08T01:00:00.000+01:00",
        "datePublication": null,
        "dateFin": null,
        "preseance": "20",
        "nominPrincipale": "0",
        "infosQualite": {
          "codeQualite": "Membre",
          "libQualite": "Membre",
          "libQualiteSex": "Membre"
        },
        "organes": {
          "organeRef": "PO733167"
        }
      },
      {
        "@xsi:type": "MandatSimple_Type",
        "uid": "PM742088",
        "acteurRef": "PA1198",
        "legislature": "15",
        "typeOrgane": "API",
        "dateDebut": "2017-10-27T02:00:00.000+02:00",
        "datePublication": "2017-10-28T02:00:00.000+02:00",
        "dateFin": null,
        "preseance": "20",
        "nominPrincipale": "1",
        "infosQualite": {
          "codeQualite": "Membre",
          "libQualite": "Membre",
          "libQualiteSex": "Membre"
        },
        "organes": {
          "organeRef": "PO201115"
        }
      },
      {
        "@xsi:type": "MandatSimple_Type",
        "uid": "PM681031",
        "acteurRef": "PA1198",
        "legislature": "14",
        "typeOrgane": "GA",
        "dateDebut": "2012-10-15T02:00:00.000+02:00",
        "datePublication": null,
        "dateFin": "2017-06-20T02:00:00.000+02:00",
        "preseance": "20",
        "nominPrincipale": "1",
        "infosQualite": {
          "codeQualite": "Membre",
          "libQualite": "Membre",
          "libQualiteSex": "Membre"
        },
        "organes": {
          "organeRef": "PO675845"
        }
      },
      {
        "@xsi:type": "MandatSimple_Type",
        "uid": "PM735144",
        "acteurRef": "PA1198",
        "legislature": "15",
        "typeOrgane": "GA",
        "dateDebut": "2017-09-26T02:00:00.000+02:00",
        "datePublication": null,
        "dateFin": null,
        "preseance": "1",
        "nominPrincipale": "1",
        "infosQualite": {
          "codeQualite": "Président",
          "libQualite": "Président",
          "libQualiteSex": "Présidente"
        },
        "organes": {
          "organeRef": "PO733327"
        }
      },
      {
        "@xsi:type": "MandatSimple_Type",
        "uid": "PM743359",
        "acteurRef": "PA1198",
        "legislature": "15",
        "typeOrgane": "GA",
        "dateDebut": "2017-11-15T01:00:00.000+01:00",
        "datePublication": null,
        "dateFin": null,
        "preseance": "8",
        "nominPrincipale": "1",
        "infosQualite": {
          "codeQualite": "Vice-Président",
          "libQualite": "Vice-Président",
          "libQualiteSex": "Vice-Présidente"
        },
        "organes": {
          "organeRef": "PO732984"
        }
      },
      {
        "@xsi:type": "MandatSimple_Type",
        "uid": "PM421775",
        "acteurRef": "PA1198",
        "legislature": "13",
        "typeOrgane": "CMP",
        "dateDebut": "2009-09-28T02:00:00.000+02:00",
        "datePublication": "2009-10-01T02:00:00.000+02:00",
        "dateFin": "2009-10-26T01:00:00.000+01:00",
        "preseance": "28",
        "nominPrincipale": "1",
        "infosQualite": {
          "codeQualite": "Suppléant",
          "libQualite": "Membre suppléant",
          "libQualiteSex": "Membre suppléante"
        },
        "organes": {
          "organeRef": "PO421633"
        }
      },
      {
        "@xsi:type": "MandatMission_Type",
        "uid": "PM743900",
        "acteurRef": "PA1198",
        "legislature": "15",
        "typeOrgane": "MISINFO",
        "dateDebut": "2017-10-24T02:00:00.000+02:00",
        "datePublication": null,
        "dateFin": "2018-04-04T02:00:00.000+02:00",
        "preseance": "5",
        "nominPrincipale": "1",
        "infosQualite": {
          "codeQualite": "Co-rapporteur",
          "libQualite": "Co-rapporteur",
          "libQualiteSex": "Co-rapporteure"
        },
        "organes": {
          "organeRef": "PO743895"
        },
        "libelle": null,
        "missionSuivanteRef": null,
        "missionPrecedenteRef": null
      },
      {
        "@xsi:type": "MandatSimple_Type",
        "uid": "PM401406",
        "acteurRef": "PA1198",
        "legislature": "13",
        "typeOrgane": "GA",
        "dateDebut": "2007-10-26T02:00:00.000+02:00",
        "datePublication": null,
        "dateFin": "2012-06-19T02:00:00.000+02:00",
        "preseance": "20",
        "nominPrincipale": "1",
        "infosQualite": {
          "codeQualite": "Membre",
          "libQualite": "Membre",
          "libQualiteSex": "Membre"
        },
        "organes": {
          "organeRef": "PO393060"
        }
      },
      {
        "@xsi:type": "MandatSimple_Type",
        "uid": "PM689357",
        "acteurRef": "PA1198",
        "legislature": "14",
        "typeOrgane": "GE",
        "dateDebut": "2013-01-23T01:00:00.000+01:00",
        "datePublication": null,
        "dateFin": "2017-06-20T02:00:00.000+02:00",
        "preseance": "20",
        "nominPrincipale": "1",
        "infosQualite": {
          "codeQualite": "Membre",
          "libQualite": "Membre",
          "libQualiteSex": "Membre"
        },
        "organes": {
          "organeRef": "PO687076"
        }
      },
      {
        "@xsi:type": "MandatSimple_Type",
        "uid": "PM712937",
        "acteurRef": "PA1198",
        "legislature": "14",
        "typeOrgane": "GE",
        "dateDebut": "2016-05-19T02:00:00.000+02:00",
        "datePublication": null,
        "dateFin": "2017-06-20T02:00:00.000+02:00",
        "preseance": "20",
        "nominPrincipale": "1",
        "infosQualite": {
          "codeQualite": "Membre",
          "libQualite": "Membre",
          "libQualiteSex": "Membre"
        },
        "organes": {
          "organeRef": "PO711617"
        }
      },
      {
        "@xsi:type": "MandatSimple_Type",
        "uid": "PM684770",
        "acteurRef": "PA1198",
        "legislature": "14",
        "typeOrgane": "GA",
        "dateDebut": "2012-11-20T01:00:00.000+01:00",
        "datePublication": null,
        "dateFin": "2017-06-20T02:00:00.000+02:00",
        "preseance": "8",
        "nominPrincipale": "1",
        "infosQualite": {
          "codeQualite": "Vice-Président",
          "libQualite": "Vice-Président",
          "libQualiteSex": "Vice-Présidente"
        },
        "organes": {
          "organeRef": "PO675784"
        }
      },
      {
        "@xsi:type": "MandatSimple_Type",
        "uid": "PM687861",
        "acteurRef": "PA1198",
        "legislature": "14",
        "typeOrgane": "COMPER",
        "dateDebut": "2013-01-15T01:00:00.000+01:00",
        "datePublication": "2013-01-15T01:00:00.000+01:00",
        "dateFin": "2013-01-15T01:00:00.000+01:00",
        "preseance": "32",
        "nominPrincipale": "1",
        "infosQualite": {
          "codeQualite": "Membre",
          "libQualite": "Membre",
          "libQualiteSex": "Membre"
        },
        "organes": {
          "organeRef": "PO419865"
        }
      },
      {
        "@xsi:type": "MandatSimple_Type",
        "uid": "PM687427",
        "acteurRef": "PA1198",
        "legislature": "14",
        "typeOrgane": "GA",
        "dateDebut": "2012-12-18T01:00:00.000+01:00",
        "datePublication": null,
        "dateFin": "2017-06-20T02:00:00.000+02:00",
        "preseance": "8",
        "nominPrincipale": "1",
        "infosQualite": {
          "codeQualite": "Vice-Président",
          "libQualite": "Vice-Président",
          "libQualiteSex": "Vice-Présidente"
        },
        "organes": {
          "organeRef": "PO675781"
        }
      },
      {
        "@xsi:type": "MandatSimple_Type",
        "uid": "PM742061",
        "acteurRef": "PA1198",
        "legislature": "15",
        "typeOrgane": "GA",
        "dateDebut": "2017-10-27T02:00:00.000+02:00",
        "datePublication": null,
        "dateFin": null,
        "preseance": "8",
        "nominPrincipale": "1",
        "infosQualite": {
          "codeQualite": "Vice-Président",
          "libQualite": "Vice-Président",
          "libQualiteSex": "Vice-Présidente"
        },
        "organes": {
          "organeRef": "PO733452"
        }
      },
      {
        "@xsi:type": "MandatSimple_Type",
        "uid": "PM681033",
        "acteurRef": "PA1198",
        "legislature": "14",
        "typeOrgane": "GA",
        "dateDebut": "2012-10-15T02:00:00.000+02:00",
        "datePublication": null,
        "dateFin": "2017-06-20T02:00:00.000+02:00",
        "preseance": "20",
        "nominPrincipale": "1",
        "infosQualite": {
          "codeQualite": "Membre",
          "libQualite": "Membre",
          "libQualiteSex": "Membre"
        },
        "organes": {
          "organeRef": "PO675739"
        }
      },
      {
        "@xsi:type": "MandatSimple_Type",
        "uid": "PM401408",
        "acteurRef": "PA1198",
        "legislature": "13",
        "typeOrgane": "GA",
        "dateDebut": "2007-10-26T02:00:00.000+02:00",
        "datePublication": null,
        "dateFin": "2012-06-19T02:00:00.000+02:00",
        "preseance": "20",
        "nominPrincipale": "1",
        "infosQualite": {
          "codeQualite": "Membre",
          "libQualite": "Membre",
          "libQualiteSex": "Membre"
        },
        "organes": {
          "organeRef": "PO393222"
        }
      },
      {
        "@xsi:type": "MandatSimple_Type",
        "uid": "PM690986",
        "acteurRef": "PA1198",
        "legislature": "14",
        "typeOrgane": "GE",
        "dateDebut": "2013-02-08T01:00:00.000+01:00",
        "datePublication": null,
        "dateFin": "2017-06-20T02:00:00.000+02:00",
        "preseance": "20",
        "nominPrincipale": "0",
        "infosQualite": {
          "codeQualite": "Membre",
          "libQualite": "Membre",
          "libQualiteSex": "Membre"
        },
        "organes": {
          "organeRef": "PO686424"
        }
      },
      {
        "@xsi:type": "MandatSimple_Type",
        "uid": "PM681035",
        "acteurRef": "PA1198",
        "legislature": "14",
        "typeOrgane": "GA",
        "dateDebut": "2012-10-15T02:00:00.000+02:00",
        "datePublication": null,
        "dateFin": "2017-06-20T02:00:00.000+02:00",
        "preseance": "20",
        "nominPrincipale": "1",
        "infosQualite": {
          "codeQualite": "Membre",
          "libQualite": "Membre",
          "libQualiteSex": "Membre"
        },
        "organes": {
          "organeRef": "PO675781"
        }
      },
      {
        "@xsi:type": "MandatSimple_Type",
        "uid": "PM418799",
        "acteurRef": "PA1198",
        "legislature": "13",
        "typeOrgane": "COMPER",
        "dateDebut": "2009-03-25T01:00:00.000+01:00",
        "datePublication": "2009-03-25T01:00:00.000+01:00",
        "dateFin": "2009-04-24T02:00:00.000+02:00",
        "preseance": "32",
        "nominPrincipale": "1",
        "infosQualite": {
          "codeQualite": "Membre",
          "libQualite": "Membre",
          "libQualiteSex": "Membre"
        },
        "organes": {
          "organeRef": "PO59051"
        }
      },
      {
        "@xsi:type": "MandatSimple_Type",
        "uid": "PM755162",
        "acteurRef": "PA1198",
        "legislature": "15",
        "typeOrgane": "GA",
        "dateDebut": "2018-04-09T02:00:00.000+02:00",
        "datePublication": null,
        "dateFin": null,
        "preseance": "20",
        "nominPrincipale": "1",
        "infosQualite": {
          "codeQualite": "Membre",
          "libQualite": "Membre",
          "libQualiteSex": "Membre"
        },
        "organes": {
          "organeRef": "PO733502"
        }
      },
      {
        "@xsi:type": "MandatSimple_Type",
        "uid": "PM409640",
        "acteurRef": "PA1198",
        "legislature": "13",
        "typeOrgane": "GE",
        "dateDebut": "2008-02-22T01:00:00.000+01:00",
        "datePublication": null,
        "dateFin": "2012-06-19T02:00:00.000+02:00",
        "preseance": "12",
        "nominPrincipale": "1",
        "infosQualite": {
          "codeQualite": "Secrétaire",
          "libQualite": "Secrétaire",
          "libQualiteSex": "Secrétaire"
        },
        "organes": {
          "organeRef": "PO402715"
        }
      },
      {
        "@xsi:type": "MandatSimple_Type",
        "uid": "PM681037",
        "acteurRef": "PA1198",
        "legislature": "14",
        "typeOrgane": "GA",
        "dateDebut": "2012-10-15T02:00:00.000+02:00",
        "datePublication": null,
        "dateFin": "2017-06-20T02:00:00.000+02:00",
        "preseance": "20",
        "nominPrincipale": "1",
        "infosQualite": {
          "codeQualite": "Membre",
          "libQualite": "Membre",
          "libQualiteSex": "Membre"
        },
        "organes": {
          "organeRef": "PO675784"
        }
      },
      {
        "@xsi:type": "MandatSimple_Type",
        "uid": "PM517988",
        "acteurRef": "PA1198",
        "legislature": "13",
        "typeOrgane": "API",
        "dateDebut": "2012-01-30T01:00:00.000+01:00",
        "datePublication": null,
        "dateFin": "2012-06-19T02:00:00.000+02:00",
        "preseance": "20",
        "nominPrincipale": "1",
        "infosQualite": {
          "codeQualite": "Membre",
          "libQualite": "Membre",
          "libQualiteSex": "Membre"
        },
        "organes": {
          "organeRef": "PO206064"
        }
      },
      {
        "@xsi:type": "MandatParlementaire_type",
        "uid": "PM430163",
        "acteurRef": "PA1198",
        "legislature": "13",
        "typeOrgane": "ASSEMBLEE",
        "dateDebut": "2011-10-03T02:00:00.000+02:00",
        "datePublication": null,
        "dateFin": "2012-06-19T02:00:00.000+02:00",
        "preseance": "10",
        "nominPrincipale": "1",
        "infosQualite": {
          "codeQualite": "Vice-Président",
          "libQualite": "Vice-président de l'Assemblée nationale",
          "libQualiteSex": "Vice-présidente de l'Assemblée nationale"
        },
        "organes": {
          "organeRef": "PO384266"
        },
        "suppleants": null,
        "chambre": null,
        "election": {
          "lieu": {
            "region": null,
            "regionType": null,
            "departement": null,
            "numDepartement": null,
            "numCirco": null
          },
          "causeMandat": null
        },
        "mandature": {
          "datePriseFonction": null,
          "causeFin": null,
          "premiereElection": "0",
          "placeHemicycle": null,
          "mandatRemplaceRef": null
        },
        "collaborateurs": null
      },
      {
        "@xsi:type": "MandatSimple_Type",
        "uid": "PM732739",
        "acteurRef": "PA1198",
        "legislature": "15",
        "typeOrgane": "DELEGBUREAU",
        "dateDebut": "2017-06-29T02:00:00.000+02:00",
        "datePublication": null,
        "dateFin": "2019-10-21T02:00:00.000+02:00",
        "preseance": "24",
        "nominPrincipale": "1",
        "infosQualite": {
          "codeQualite": "Membre",
          "libQualite": "Membre",
          "libQualiteSex": "Membre"
        },
        "organes": {
          "organeRef": "PO732735"
        }
      },
      {
        "@xsi:type": "MandatSimple_Type",
        "uid": "PM747880",
        "acteurRef": "PA1198",
        "legislature": "15",
        "typeOrgane": "ORGEXTPARL",
        "dateDebut": "2018-01-10T01:00:00.000+01:00",
        "datePublication": "2018-01-11T01:00:00.000+01:00",
        "dateFin": null,
        "preseance": "20",
        "nominPrincipale": "1",
        "infosQualite": {
          "codeQualite": "Titulaire",
          "libQualite": "Membre titulaire",
          "libQualiteSex": "Membre titulaire"
        },
        "organes": {
          "organeRef": "PO717436"
        }
      },
      {
        "@xsi:type": "MandatParlementaire_type",
        "uid": "PM748791",
        "acteurRef": "PA1198",
        "legislature": "15",
        "typeOrgane": "ASSEMBLEE",
        "dateDebut": "2018-02-01T01:00:00.000+01:00",
        "datePublication": null,
        "dateFin": "2019-09-30T02:00:00.000+02:00",
        "preseance": "24",
        "nominPrincipale": "1",
        "infosQualite": {
          "codeQualite": "Secrétaire",
          "libQualite": "Secrétaire de l'Assemblée nationale",
          "libQualiteSex": "Secrétaire de l'Assemblée nationale"
        },
        "organes": {
          "organeRef": "PO717460"
        },
        "suppleants": null,
        "chambre": null,
        "election": {
          "lieu": {
            "region": null,
            "regionType": null,
            "departement": null,
            "numDepartement": null,
            "numCirco": null
          },
          "causeMandat": null
        },
        "mandature": {
          "datePriseFonction": null,
          "causeFin": null,
          "premiereElection": "0",
          "placeHemicycle": null,
          "mandatRemplaceRef": null
        },
        "collaborateurs": null
      },
      {
        "@xsi:type": "MandatSimple_Type",
        "uid": "PM746360",
        "acteurRef": "PA1198",
        "legislature": "15",
        "typeOrgane": "GA",
        "dateDebut": "2017-12-13T01:00:00.000+01:00",
        "datePublication": null,
        "dateFin": null,
        "preseance": "20",
        "nominPrincipale": "1",
        "infosQualite": {
          "codeQualite": "Membre",
          "libQualite": "Membre",
          "libQualiteSex": "Membre"
        },
        "organes": {
          "organeRef": "PO733532"
        }
      },
      {
        "@xsi:type": "MandatSimple_Type",
        "uid": "PM700765",
        "acteurRef": "PA1198",
        "legislature": "14",
        "typeOrgane": "API",
        "dateDebut": "2014-04-03T02:00:00.000+02:00",
        "datePublication": null,
        "dateFin": "2017-06-20T02:00:00.000+02:00",
        "preseance": "20",
        "nominPrincipale": "1",
        "infosQualite": {
          "codeQualite": "Membre",
          "libQualite": "Membre",
          "libQualiteSex": "Membre"
        },
        "organes": {
          "organeRef": "PO418736"
        }
      },
      {
        "@xsi:type": "MandatSimple_Type",
        "uid": "PM752792",
        "acteurRef": "PA1198",
        "legislature": "15",
        "typeOrgane": "GE",
        "dateDebut": "2018-03-07T01:00:00.000+01:00",
        "datePublication": null,
        "dateFin": null,
        "preseance": "12",
        "nominPrincipale": "1",
        "infosQualite": {
          "codeQualite": "Secrétaire",
          "libQualite": "Secrétaire",
          "libQualiteSex": "Secrétaire"
        },
        "organes": {
          "organeRef": "PO747140"
        }
      },
      {
        "@xsi:type": "MandatSimple_Type",
        "uid": "PM412482",
        "acteurRef": "PA1198",
        "legislature": "13",
        "typeOrgane": "GE",
        "dateDebut": "2008-02-05T01:00:00.000+01:00",
        "datePublication": null,
        "dateFin": "2012-06-19T02:00:00.000+02:00",
        "preseance": "12",
        "nominPrincipale": "1",
        "infosQualite": {
          "codeQualite": "Secrétaire",
          "libQualite": "Secrétaire",
          "libQualiteSex": "Secrétaire"
        },
        "organes": {
          "organeRef": "PO403172"
        }
      },
      {
        "@xsi:type": "MandatSimple_Type",
        "uid": "PM399050",
        "acteurRef": "PA1198",
        "legislature": "13",
        "typeOrgane": "GA",
        "dateDebut": "2007-10-15T02:00:00.000+02:00",
        "datePublication": null,
        "dateFin": "2012-06-19T02:00:00.000+02:00",
        "preseance": "20",
        "nominPrincipale": "1",
        "infosQualite": {
          "codeQualite": "Membre",
          "libQualite": "Membre",
          "libQualiteSex": "Membre"
        },
        "organes": {
          "organeRef": "PO392990"
        }
      },
      {
        "@xsi:type": "MandatSimple_Type",
        "uid": "PM748041",
        "acteurRef": "PA1198",
        "legislature": "15",
        "typeOrgane": "GA",
        "dateDebut": "2018-01-23T01:00:00.000+01:00",
        "datePublication": null,
        "dateFin": null,
        "preseance": "14",
        "nominPrincipale": "1",
        "infosQualite": {
          "codeQualite": "Secrétaire",
          "libQualite": "Secrétaire",
          "libQualiteSex": "Secrétaire"
        },
        "organes": {
          "organeRef": "PO733432"
        }
      },
      {
        "@xsi:type": "MandatSimple_Type",
        "uid": "PM742714",
        "acteurRef": "PA1198",
        "legislature": "15",
        "typeOrgane": "GA",
        "dateDebut": "2017-11-07T01:00:00.000+01:00",
        "datePublication": null,
        "dateFin": null,
        "preseance": "8",
        "nominPrincipale": "1",
        "infosQualite": {
          "codeQualite": "Vice-Président",
          "libQualite": "Vice-Président",
          "libQualiteSex": "Vice-Présidente"
        },
        "organes": {
          "organeRef": "PO733652"
        }
      },
      {
        "@xsi:type": "MandatSimple_Type",
        "uid": "PM731905",
        "acteurRef": "PA1198",
        "legislature": "15",
        "typeOrgane": "COMPER",
        "dateDebut": "2017-06-29T02:00:00.000+02:00",
        "datePublication": "2017-06-29T02:00:00.000+02:00",
        "dateFin": null,
        "preseance": "32",
        "nominPrincipale": "1",
        "infosQualite": {
          "codeQualite": "Membre",
          "libQualite": "Membre",
          "libQualiteSex": "Membre"
        },
        "organes": {
          "organeRef": "PO59047"
        }
      },
      {
        "@xsi:type": "MandatSimple_Type",
        "uid": "PM737700",
        "acteurRef": "PA1198",
        "legislature": "15",
        "typeOrgane": "GA",
        "dateDebut": "2017-10-05T02:00:00.000+02:00",
        "datePublication": null,
        "dateFin": null,
        "preseance": "20",
        "nominPrincipale": "0",
        "infosQualite": {
          "codeQualite": "Membre",
          "libQualite": "Membre",
          "libQualiteSex": "Membre"
        },
        "organes": {
          "organeRef": "PO732984"
        }
      },
      {
        "@xsi:type": "MandatSimple_Type",
        "uid": "PM656125",
        "acteurRef": "PA1198",
        "legislature": "14",
        "typeOrgane": "GP",
        "dateDebut": "2012-06-26T02:00:00.000+02:00",
        "datePublication": "2012-06-27T02:00:00.000+02:00",
        "dateFin": "2016-05-24T02:00:00.000+02:00",
        "preseance": "20",
        "nominPrincipale": "1",
        "infosQualite": {
          "codeQualite": "Membre",
          "libQualite": "Membre du",
          "libQualiteSex": "Membre du"
        },
        "organes": {
          "organeRef": "PO656002"
        }
      },
      {
        "@xsi:type": "MandatSimple_Type",
        "uid": "PM731482",
        "acteurRef": "PA1198",
        "legislature": "15",
        "typeOrgane": "GP",
        "dateDebut": "2017-06-27T02:00:00.000+02:00",
        "datePublication": "2017-06-28T02:00:00.000+02:00",
        "dateFin": "2018-09-11T02:00:00.000+02:00",
        "preseance": "20",
        "nominPrincipale": "1",
        "infosQualite": {
          "codeQualite": "Membre",
          "libQualite": "Membre du",
          "libQualiteSex": "Membre du"
        },
        "organes": {
          "organeRef": "PO730946"
        }
      },
      {
        "@xsi:type": "MandatSimple_Type",
        "uid": "PM419147",
        "acteurRef": "PA1198",
        "legislature": "13",
        "typeOrgane": "COMPER",
        "dateDebut": "2009-04-25T02:00:00.000+02:00",
        "datePublication": "2009-04-25T02:00:00.000+02:00",
        "dateFin": "2009-05-04T02:00:00.000+02:00",
        "preseance": "32",
        "nominPrincipale": "1",
        "infosQualite": {
          "codeQualite": "Membre",
          "libQualite": "Membre",
          "libQualiteSex": "Membre"
        },
        "organes": {
          "organeRef": "PO59045"
        }
      },
      {
        "@xsi:type": "MandatSimple_Type",
        "uid": "PM399052",
        "acteurRef": "PA1198",
        "legislature": "13",
        "typeOrgane": "GA",
        "dateDebut": "2007-10-15T02:00:00.000+02:00",
        "datePublication": null,
        "dateFin": "2012-06-19T02:00:00.000+02:00",
        "preseance": "20",
        "nominPrincipale": "1",
        "infosQualite": {
          "codeQualite": "Membre",
          "libQualite": "Membre",
          "libQualiteSex": "Membre"
        },
        "organes": {
          "organeRef": "PO393105"
        }
      },
      {
        "@xsi:type": "MandatSimple_Type",
        "uid": "PM684820",
        "acteurRef": "PA1198",
        "legislature": "14",
        "typeOrgane": "GA",
        "dateDebut": "2012-11-20T01:00:00.000+01:00",
        "datePublication": null,
        "dateFin": "2017-06-20T02:00:00.000+02:00",
        "preseance": "8",
        "nominPrincipale": "1",
        "infosQualite": {
          "codeQualite": "Vice-Président",
          "libQualite": "Vice-Président",
          "libQualiteSex": "Vice-Présidente"
        },
        "organes": {
          "organeRef": "PO675813"
        }
      },
      {
        "@xsi:type": "MandatSimple_Type",
        "uid": "PM681800",
        "acteurRef": "PA1198",
        "legislature": "14",
        "typeOrgane": "GEVI",
        "dateDebut": "2012-10-16T02:00:00.000+02:00",
        "datePublication": null,
        "dateFin": "2017-06-20T02:00:00.000+02:00",
        "preseance": "20",
        "nominPrincipale": "1",
        "infosQualite": {
          "codeQualite": "Membre",
          "libQualite": "Membre",
          "libQualiteSex": "Membre"
        },
        "organes": {
          "organeRef": "PO675803"
        }
      },
      {
        "@xsi:type": "MandatSimple_Type",
        "uid": "PM737699",
        "acteurRef": "PA1198",
        "legislature": "15",
        "typeOrgane": "GA",
        "dateDebut": "2017-10-05T02:00:00.000+02:00",
        "datePublication": null,
        "dateFin": null,
        "preseance": "20",
        "nominPrincipale": "1",
        "infosQualite": {
          "codeQualite": "Membre",
          "libQualite": "Membre",
          "libQualiteSex": "Membre"
        },
        "organes": {
          "organeRef": "PO732944"
        }
      },
      {
        "@xsi:type": "MandatSimple_Type",
        "uid": "PM746940",
        "acteurRef": "PA1198",
        "legislature": "15",
        "typeOrgane": "GA",
        "dateDebut": "2017-12-06T01:00:00.000+01:00",
        "datePublication": null,
        "dateFin": null,
        "preseance": "8",
        "nominPrincipale": "1",
        "infosQualite": {
          "codeQualite": "Vice-Président",
          "libQualite": "Vice-Président",
          "libQualiteSex": "Vice-Présidente"
        },
        "organes": {
          "organeRef": "PO733292"
        }
      },
      {
        "@xsi:type": "MandatSimple_Type",
        "uid": "PM712313",
        "acteurRef": "PA1198",
        "legislature": "14",
        "typeOrgane": "GE",
        "dateDebut": "2016-04-07T02:00:00.000+02:00",
        "datePublication": null,
        "dateFin": "2017-06-20T02:00:00.000+02:00",
        "preseance": "20",
        "nominPrincipale": "1",
        "infosQualite": {
          "codeQualite": "Membre",
          "libQualite": "Membre",
          "libQualiteSex": "Membre"
        },
        "organes": {
          "organeRef": "PO712100"
        }
      },
      {
        "@xsi:type": "MandatSimple_Type",
        "uid": "PM737702",
        "acteurRef": "PA1198",
        "legislature": "15",
        "typeOrgane": "GA",
        "dateDebut": "2017-10-05T02:00:00.000+02:00",
        "datePublication": null,
        "dateFin": null,
        "preseance": "20",
        "nominPrincipale": "0",
        "infosQualite": {
          "codeQualite": "Membre",
          "libQualite": "Membre",
          "libQualiteSex": "Membre"
        },
        "organes": {
          "organeRef": "PO733232"
        }
      },
      {
        "@xsi:type": "MandatSimple_Type",
        "uid": "PM709154",
        "acteurRef": "PA1198",
        "legislature": "14",
        "typeOrgane": "API",
        "dateDebut": "2015-07-31T02:00:00.000+02:00",
        "datePublication": null,
        "dateFin": "2017-06-20T02:00:00.000+02:00",
        "preseance": "20",
        "nominPrincipale": "1",
        "infosQualite": {
          "codeQualite": "Membre",
          "libQualite": "Membre",
          "libQualiteSex": "Membre"
        },
        "organes": {
          "organeRef": "PO206064"
        }
      },
      {
        "@xsi:type": "MandatSimple_Type",
        "uid": "PM399054",
        "acteurRef": "PA1198",
        "legislature": "13",
        "typeOrgane": "GA",
        "dateDebut": "2007-10-15T02:00:00.000+02:00",
        "datePublication": null,
        "dateFin": "2012-06-19T02:00:00.000+02:00",
        "preseance": "20",
        "nominPrincipale": "1",
        "infosQualite": {
          "codeQualite": "Membre",
          "libQualite": "Membre",
          "libQualiteSex": "Membre"
        },
        "organes": {
          "organeRef": "PO393408"
        }
      },
      {
        "@xsi:type": "MandatSimple_Type",
        "uid": "PM430674",
        "acteurRef": "PA1198",
        "legislature": "13",
        "typeOrgane": "DELEGBUREAU",
        "dateDebut": "2011-10-12T02:00:00.000+02:00",
        "datePublication": null,
        "dateFin": "2012-06-19T02:00:00.000+02:00",
        "preseance": "24",
        "nominPrincipale": "0",
        "infosQualite": {
          "codeQualite": "Membre",
          "libQualite": "Membre",
          "libQualiteSex": "Membre"
        },
        "organes": {
          "organeRef": "PO391172"
        }
      },
      {
        "@xsi:type": "MandatSimple_Type",
        "uid": "PM676567",
        "acteurRef": "PA1198",
        "legislature": "14",
        "typeOrgane": "DELEGBUREAU",
        "dateDebut": "2012-07-18T02:00:00.000+02:00",
        "datePublication": null,
        "dateFin": "2017-06-20T02:00:00.000+02:00",
        "preseance": "24",
        "nominPrincipale": "0",
        "infosQualite": {
          "codeQualite": "Membre",
          "libQualite": "Membre",
          "libQualiteSex": "Membre"
        },
        "organes": {
          "organeRef": "PO665158"
        }
      },
      {
        "@xsi:type": "MandatSimple_Type",
        "uid": "PM687881",
        "acteurRef": "PA1198",
        "legislature": "14",
        "typeOrgane": "COMPER",
        "dateDebut": "2013-01-15T01:00:00.000+01:00",
        "datePublication": "2013-01-16T01:00:00.000+01:00",
        "dateFin": "2017-06-20T02:00:00.000+02:00",
        "preseance": "32",
        "nominPrincipale": "1",
        "infosQualite": {
          "codeQualite": "Membre",
          "libQualite": "Membre",
          "libQualiteSex": "Membre"
        },
        "organes": {
          "organeRef": "PO59051"
        }
      },
      {
        "@xsi:type": "MandatSimple_Type",
        "uid": "PM749174",
        "acteurRef": "PA1198",
        "legislature": "15",
        "typeOrgane": "GA",
        "dateDebut": "2017-11-08T01:00:00.000+01:00",
        "datePublication": null,
        "dateFin": null,
        "preseance": "8",
        "nominPrincipale": "1",
        "infosQualite": {
          "codeQualite": "Vice-Président",
          "libQualite": "Vice-Président",
          "libQualiteSex": "Vice-Présidente"
        },
        "organes": {
          "organeRef": "PO733167"
        }
      },
      {
        "@xsi:type": "MandatSimple_Type",
        "uid": "PM758841",
        "acteurRef": "PA1198",
        "legislature": "15",
        "typeOrgane": "GP",
        "dateDebut": "2018-09-12T02:00:00.000+02:00",
        "datePublication": null,
        "dateFin": null,
        "preseance": "20",
        "nominPrincipale": "1",
        "infosQualite": {
          "codeQualite": "Membre",
          "libQualite": "Membre du",
          "libQualiteSex": "Membre du"
        },
        "organes": {
          "organeRef": "PO758835"
        }
      },
      {
        "@xsi:type": "MandatSimple_Type",
        "uid": "PM737704",
        "acteurRef": "PA1198",
        "legislature": "15",
        "typeOrgane": "GA",
        "dateDebut": "2017-10-05T02:00:00.000+02:00",
        "datePublication": null,
        "dateFin": null,
        "preseance": "20",
        "nominPrincipale": "0",
        "infosQualite": {
          "codeQualite": "Membre",
          "libQualite": "Membre",
          "libQualiteSex": "Membre"
        },
        "organes": {
          "organeRef": "PO733452"
        }
      },
      {
        "@xsi:type": "MandatSimple_Type",
        "uid": "PM412416",
        "acteurRef": "PA1198",
        "legislature": "13",
        "typeOrgane": "GE",
        "dateDebut": "2008-02-05T01:00:00.000+01:00",
        "datePublication": null,
        "dateFin": "2012-06-19T02:00:00.000+02:00",
        "preseance": "20",
        "nominPrincipale": "0",
        "infosQualite": {
          "codeQualite": "Membre",
          "libQualite": "Membre",
          "libQualiteSex": "Membre"
        },
        "organes": {
          "organeRef": "PO403172"
        }
      },
      {
        "@xsi:type": "MandatSimple_Type",
        "uid": "PM408847",
        "acteurRef": "PA1198",
        "legislature": "13",
        "typeOrgane": "GE",
        "dateDebut": "2008-02-11T01:00:00.000+01:00",
        "datePublication": null,
        "dateFin": "2012-06-19T02:00:00.000+02:00",
        "preseance": "20",
        "nominPrincipale": "1",
        "infosQualite": {
          "codeQualite": "Membre",
          "libQualite": "Membre",
          "libQualiteSex": "Membre"
        },
        "organes": {
          "organeRef": "PO403123"
        }
      },
      {
        "@xsi:type": "MandatSimple_Type",
        "uid": "PM406455",
        "acteurRef": "PA1198",
        "legislature": "13",
        "typeOrgane": "GE",
        "dateDebut": "2008-01-09T01:00:00.000+01:00",
        "datePublication": null,
        "dateFin": "2012-06-19T02:00:00.000+02:00",
        "preseance": "20",
        "nominPrincipale": "1",
        "infosQualite": {
          "codeQualite": "Membre",
          "libQualite": "Membre",
          "libQualiteSex": "Membre"
        },
        "organes": {
          "organeRef": "PO402734"
        }
      },
      {
        "@xsi:type": "MandatSimple_Type",
        "uid": "PM749426",
        "acteurRef": "PA1198",
        "legislature": "15",
        "typeOrgane": "GE",
        "dateDebut": "2018-02-12T01:00:00.000+01:00",
        "datePublication": null,
        "dateFin": null,
        "preseance": "20",
        "nominPrincipale": "1",
        "infosQualite": {
          "codeQualite": "Membre",
          "libQualite": "Membre",
          "libQualiteSex": "Membre"
        },
        "organes": {
          "organeRef": "PO746748"
        }
      },
      {
        "@xsi:type": "MandatSimple_Type",
        "uid": "PM737706",
        "acteurRef": "PA1198",
        "legislature": "15",
        "typeOrgane": "GA",
        "dateDebut": "2017-10-05T02:00:00.000+02:00",
        "datePublication": null,
        "dateFin": null,
        "preseance": "20",
        "nominPrincipale": "0",
        "infosQualite": {
          "codeQualite": "Membre",
          "libQualite": "Membre",
          "libQualiteSex": "Membre"
        },
        "organes": {
          "organeRef": "PO733557"
        }
      },
      {
        "@xsi:type": "MandatSimple_Type",
        "uid": "PM743283",
        "acteurRef": "PA1198",
        "legislature": "15",
        "typeOrgane": "GA",
        "dateDebut": "2017-11-14T01:00:00.000+01:00",
        "datePublication": null,
        "dateFin": null,
        "preseance": "8",
        "nominPrincipale": "1",
        "infosQualite": {
          "codeQualite": "Vice-Président",
          "libQualite": "Vice-Président",
          "libQualiteSex": "Vice-Présidente"
        },
        "organes": {
          "organeRef": "PO733232"
        }
      },
      {
        "@xsi:type": "MandatSimple_Type",
        "uid": "PM757720",
        "acteurRef": "PA1198",
        "legislature": "15",
        "typeOrgane": "GA",
        "dateDebut": "2018-07-10T02:00:00.000+02:00",
        "datePublication": null,
        "dateFin": null,
        "preseance": "20",
        "nominPrincipale": "1",
        "infosQualite": {
          "codeQualite": "Membre",
          "libQualite": "Membre",
          "libQualiteSex": "Membre"
        },
        "organes": {
          "organeRef": "PO733347"
        }
      },
      {
        "@xsi:type": "MandatParlementaire_type",
        "uid": "PM690219",
        "acteurRef": "PA1198",
        "legislature": "14",
        "typeOrgane": "CONFPT",
        "dateDebut": "2012-06-20T02:00:00.000+02:00",
        "datePublication": null,
        "dateFin": "2017-06-20T02:00:00.000+02:00",
        "preseance": "20",
        "nominPrincipale": "1",
        "infosQualite": {
          "codeQualite": "Membre",
          "libQualite": "Membre",
          "libQualiteSex": null
        },
        "organes": {
          "organeRef": "PO690204"
        },
        "suppleants": null,
        "chambre": null,
        "election": {
          "lieu": {
            "region": null,
            "regionType": null,
            "departement": null,
            "numDepartement": null,
            "numCirco": null
          },
          "causeMandat": null
        },
        "mandature": {
          "datePriseFonction": null,
          "causeFin": null,
          "premiereElection": "0",
          "placeHemicycle": null,
          "mandatRemplaceRef": null
        },
        "collaborateurs": null
      },
      {
        "@xsi:type": "MandatParlementaire_type",
        "uid": "PM386183",
        "acteurRef": "PA1198",
        "legislature": "13",
        "typeOrgane": "ASSEMBLEE",
        "dateDebut": "2007-06-20T02:00:00.000+02:00",
        "datePublication": null,
        "dateFin": "2012-06-19T02:00:00.000+02:00",
        "preseance": "50",
        "nominPrincipale": "1",
        "infosQualite": {
          "codeQualite": "membre",
          "libQualite": "membre",
          "libQualiteSex": "membre"
        },
        "organes": {
          "organeRef": "PO384266"
        },
        "suppleants": {
          "suppleant": {
            "dateDebut": "2007-06-20T02:00:00.000+02:00",
            "dateFin": "2012-06-19T02:00:00.000+02:00",
            "suppleantRef": "PA340833"
          }
        },
        "chambre": null,
        "election": {
          "lieu": {
            "region": "Normandie",
            "regionType": "Métropolitain",
            "departement": "Calvados",
            "numDepartement": "14",
            "numCirco": "2"
          },
          "causeMandat": "élections générales",
          "refCirconscription": "PO384327"
        },
        "mandature": {
          "datePriseFonction": "2007-06-20T02:00:00.000+02:00",
          "causeFin": "Fin de législature",
          "premiereElection": "1",
          "placeHemicycle": "509",
          "mandatRemplaceRef": null
        },
        "collaborateurs": null
      },
      {
        "@xsi:type": "MandatSimple_Type",
        "uid": "PM737708",
        "acteurRef": "PA1198",
        "legislature": "15",
        "typeOrgane": "GA",
        "dateDebut": "2017-10-05T02:00:00.000+02:00",
        "datePublication": null,
        "dateFin": null,
        "preseance": "20",
        "nominPrincipale": "0",
        "infosQualite": {
          "codeQualite": "Membre",
          "libQualite": "Membre",
          "libQualiteSex": "Membre"
        },
        "organes": {
          "organeRef": "PO733652"
        }
      }
    ]
  },
  "@xmlns:xsi": "http://www.w3.org/2001/XMLSchema-instance"
}