{
  "@xmlns:xsi": "http://www.w3.org/2001/XMLSchema-instance",
  "uid": "PO60081",
  "codeType": "GEVI",
  "libelle": "Groupe d'études à vocation internationale sur les problèmes lies à l'expansion de l'économie Taiwanaise",
  "libelleEdition": "du groupe d'études à vocation internationale sur les problèmes lies à l'expansion de l'économie Taiwanaise",
  "libelleAbrege": "Taiwan",
  "libelleAbrev": "TAI",
  "viMoDe": {
    "dateDebut": null,
    "dateAgrement": "1997-06-12T02:00:00.000+02:00",
    "dateFin": "2002-06-18T02:00:00.000+02:00"
  },
  "organeParent": null,
  "chambre": null,
  "regime": "5ème République",
  "legislature": "11",
  "secretariat": {
    "secretaire01": null,
    "secretaire02": null
  },
  "listePays": null
}