{
  "@xmlns:xsi": "http://www.w3.org/2001/XMLSchema-instance",
  "uid": "PO308503",
  "codeType": "MINISTERE",
  "libelle": "Ministère des petites et moyennes entreprises, du commerce, de l'artisanat, des professions libérales et de la consommation",
  "libelleEdition": "des petites et moyennes entreprises, du commerce, de l'artisanat, des professions libérales et de la consommation",
  "libelleAbrege": "PME, commerce, artisanat, professions libérales et consommation",
  "libelleAbrev": "PME",
  "viMoDe": {
    "dateDebut": "2004-11-29T01:00:00.000+01:00",
    "dateAgrement": null,
    "dateFin": "2005-05-31T02:00:00.000+02:00"
  },
  "organeParent": "PO300736"
}