{
  "@xmlns:xsi": "http://www.w3.org/2001/XMLSchema-instance",
  "uid": "PO59909",
  "codeType": "GE",
  "libelle": "Groupe d'études sur la mer et la pêche maritime",
  "libelleEdition": "du groupe d'études sur la mer et la pêche maritime",
  "libelleAbrege": "Mer et pêche maritime",
  "libelleAbrev": "MER",
  "viMoDe": {
    "dateDebut": null,
    "dateAgrement": "1993-06-10T02:00:00.000+02:00",
    "dateFin": "1997-04-21T02:00:00.000+02:00"
  },
  "organeParent": null,
  "chambre": null,
  "regime": "5ème République",
  "legislature": "10",
  "secretariat": {
    "secretaire01": null,
    "secretaire02": null
  }
}