{
  "@xmlns:xsi": "http://www.w3.org/2001/XMLSchema-instance",
  "uid": "PO274092",
  "codeType": "GA",
  "libelle": "France état des Émirats Arabes Unis",
  "libelleEdition": "de France état des Émirats Arabes Unis",
  "libelleAbrege": "Émirats Arabes Unis",
  "libelleAbrev": "EM",
  "viMoDe": {
    "dateDebut": null,
    "dateAgrement": "2002-07-24T02:00:00.000+02:00",
    "dateFin": "2007-06-19T02:00:00.000+02:00"
  },
  "organeParent": null,
  "chambre": null,
  "regime": "5ème République",
  "legislature": "12",
  "secretariat": {
    "secretaire01": null,
    "secretaire02": null
  },
  "listePays": null
}