{
  "@xmlns:xsi": "http://www.w3.org/2001/XMLSchema-instance",
  "uid": "PO315211",
  "codeType": "CMP",
  "libelle": "Commission mixte paritaire sur le Projet de loi de financement de la sécurité sociale pour 2006",
  "libelleEdition": "sur le Projet de loi de financement de la sécurité sociale pour 2006",
  "libelleAbrege": "Financement de la sécurité sociale pour 2006",
  "libelleAbrev": "2575",
  "viMoDe": {
    "dateDebut": "2005-11-18T01:00:00.000+01:00",
    "dateAgrement": null,
    "dateFin": "2005-11-23T01:00:00.000+01:00"
  },
  "organeParent": null,
  "chambre": null,
  "regime": "5ème République",
  "legislature": "12",
  "secretariat": {
    "secretaire01": null,
    "secretaire02": null
  }
}