{
  "@xmlns:xsi": "http://www.w3.org/2001/XMLSchema-instance",
  "uid": "PO225915",
  "codeType": "CMP",
  "libelle": "projet de loi portant mesures urgentes de réformes à caractère économique et financier",
  "libelleEdition": "sur le projet de loi portant mesures urgentes de réformes à caractère économique et financier",
  "libelleAbrege": "MURCEF",
  "libelleAbrev": "2990",
  "viMoDe": {
    "dateDebut": "2001-06-07T02:00:00.000+02:00",
    "dateAgrement": null,
    "dateFin": "2001-06-20T02:00:00.000+02:00"
  },
  "organeParent": null,
  "chambre": null,
  "regime": "5ème République",
  "legislature": "11",
  "secretariat": {
    "secretaire01": null,
    "secretaire02": null
  }
}