{
  "@xmlns:xsi": "http://www.w3.org/2001/XMLSchema-instance",
  "uid": "PO403765",
  "codeType": "CMP",
  "libelle": "Commission mixte paritaire chargée de proposer un texte sur les dispositions restant en discussion du projet de loi de financement de la sécurité sociale pour 2008",
  "libelleEdition": "chargée de proposer un texte sur les dispositions restant en discussion du projet de loi de financement de la sécurité sociale pour 2008",
  "libelleAbrege": "CMP PLFSS",
  "libelleAbrev": "284",
  "viMoDe": {
    "dateDebut": "2007-11-16T01:00:00.000+01:00",
    "dateAgrement": null,
    "dateFin": "2007-11-23T01:00:00.000+01:00"
  },
  "organeParent": null,
  "chambre": null,
  "regime": "5ème République",
  "legislature": "13",
  "secretariat": {
    "secretaire01": null,
    "secretaire02": null
  }
}