{
  "uid": {
    "@xsi:type": "IdActeur_type",
    "#text": "PA721608"
  },
  "etatCivil": {
    "ident": {
      "civ": "M.",
      "prenom": "Jean-Louis",
      "nom": "Bourlanges",
      "alpha": "Bourlanges",
      "trigramme": "JBU"
    },
    "infoNaissance": {
      "dateNais": "1946-07-13T01:00:00.000+01:00",
      "villeNais": "Neuilly-Sur-Seine",
      "depNais": "Hauts-de-Seine",
      "paysNais": "France"
    },
    "dateDeces": null
  },
  "profession": {
    "libelleCourant": "Retraité de la fonction publique",
    "socProcINSEE": {
      "catSocPro": "Cadres de la fonction publique, professions intellectuelles et  artistiques",
      "famSocPro": "Cadres et professions intellectuelles supérieures"
    }
  },
  "uri_hatvp": "https://www.hatvp.fr/pages_nominatives/bourlanges-jean-louis",
  "adresses": {
    "adresse": [
      {
        "@xsi:type": "AdressePostale_Type",
        "uid": "AD721610",
        "type": "0",
        "typeLibelle": "Adresse officielle",
        "poids": "1",
        "adresseDeRattachement": null,
        "intitule": "Assemblée nationale,",
        "numeroRue": "126",
        "nomRue": "Rue de l'Université,",
        "complementAdresse": null,
        "codePostal": "75355",
        "ville": "Paris 07 SP"
      },
      {
        "@xsi:type": "AdresseMail_Type",
        "uid": "AD728264",
        "type": "15",
        "typeLibelle": "Mèl",
        "poids": null,
        "adresseDeRattachement": null,
        "valElec": "jean-louis.bourlanges@assemblee-nationale.fr"
      }
    ]
  },
  "mandats": {
    "mandat": [
      {
        "@xsi:type": "MandatSimple_Type",
        "uid": "PM755326",
        "acteurRef": "PA721608",
        "legislature": "15",
        "typeOrgane": "GE",
        "dateDebut": "2018-04-10T02:00:00.000+02:00",
        "datePublication": null,
        "dateFin": null,
        "preseance": "20",
        "nominPrincipale": "1",
        "infosQualite": {
          "codeQualite": "Membre",
          "libQualite": "Membre",
          "libQualiteSex": "Membre"
        },
        "organes": {
          "organeRef": "PO746634"
        }
      },
      {
        "@xsi:type": "MandatSimple_Type",
        "uid": "PM731424",
        "acteurRef": "PA721608",
        "legislature": "15",
        "typeOrgane": "GP",
        "dateDebut": "2017-06-27T02:00:00.000+02:00",
        "datePublication": "2017-06-28T02:00:00.000+02:00",
        "dateFin": null,
        "preseance": "20",
        "nominPrincipale": "1",
        "infosQualite": {
          "codeQualite": "Membre",
          "libQualite": "Membre du",
          "libQualiteSex": "Membre du"
        },
        "organes": {
          "organeRef": "PO730970"
        }
      },
      {
        "@xsi:type": "MandatAvecSuppleant_Type",
        "uid": "PM732412",
        "acteurRef": "PA721608",
        "legislature": "15",
        "typeOrgane": "COMNL",
        "dateDebut": "2017-07-06T02:00:00.000+02:00",
        "datePublication": "2017-07-06T02:00:00.000+02:00",
        "dateFin": null,
        "preseance": "8",
        "nominPrincipale": "1",
        "infosQualite": {
          "codeQualite": "Vice-Président",
          "libQualite": "Vice-Président",
          "libQualiteSex": "Vice-Président"
        },
        "organes": {
          "organeRef": "PO415287"
        },
        "suppleants": null
      },
      {
        "@xsi:type": "MandatMission_Type",
        "uid": "PM744851",
        "acteurRef": "PA721608",
        "legislature": "15",
        "typeOrgane": "MISINFOPRE",
        "dateDebut": "2017-12-07T01:00:00.000+01:00",
        "datePublication": "2017-12-07T01:00:00.000+01:00",
        "dateFin": "2018-11-20T01:00:00.000+01:00",
        "preseance": "20",
        "nominPrincipale": "1",
        "infosQualite": {
          "codeQualite": "Membre",
          "libQualite": "Membre",
          "libQualiteSex": "Membre"
        },
        "organes": {
          "organeRef": "PO743664"
        },
        "libelle": null,
        "missionSuivanteRef": null,
        "missionPrecedenteRef": null
      },
      {
        "@xsi:type": "MandatMission_Type",
        "uid": "PM757272",
        "acteurRef": "PA721608",
        "legislature": "15",
        "typeOrgane": "MISINFOPRE",
        "dateDebut": "2018-06-26T02:00:00.000+02:00",
        "datePublication": "2018-06-27T02:00:00.000+02:00",
        "dateFin": "2019-01-15T01:00:00.000+01:00",
        "preseance": "20",
        "nominPrincipale": "1",
        "infosQualite": {
          "codeQualite": "Membre",
          "libQualite": "Membre",
          "libQualiteSex": "Membre"
        },
        "organes": {
          "organeRef": "PO757118"
        },
        "libelle": null,
        "missionSuivanteRef": null,
        "missionPrecedenteRef": null
      },
      {
        "@xsi:type": "MandatSimple_Type",
        "uid": "PM767278",
        "acteurRef": "PA721608",
        "legislature": "15",
        "typeOrgane": "COMPER",
        "dateDebut": "2019-10-01T02:00:00.000+02:00",
        "datePublication": "2019-10-01T02:00:00.000+02:00",
        "dateFin": null,
        "preseance": "32",
        "nominPrincipale": "1",
        "infosQualite": {
          "codeQualite": "Membre",
          "libQualite": "Membre",
          "libQualiteSex": "Membre"
        },
        "organes": {
          "organeRef": "PO59047"
        }
      },
      {
        "@xsi:type": "MandatSimple_Type",
        "uid": "PM761101",
        "acteurRef": "PA721608",
        "legislature": "15",
        "typeOrgane": "CMP",
        "dateDebut": "2018-12-18T01:00:00.000+01:00",
        "datePublication": "2018-12-19T01:00:00.000+01:00",
        "dateFin": "2019-01-17T01:00:00.000+01:00",
        "preseance": "1",
        "nominPrincipale": "1",
        "infosQualite": {
          "codeQualite": "Président",
          "libQualite": "Président",
          "libQualiteSex": "Président"
        },
        "organes": {
          "organeRef": "PO760925"
        }
      },
      {
        "@xsi:type": "MandatSimple_Type",
        "uid": "PM742147",
        "acteurRef": "PA721608",
        "legislature": "15",
        "typeOrgane": "API",
        "dateDebut": "2017-10-27T02:00:00.000+02:00",
        "datePublication": "2017-10-28T02:00:00.000+02:00",
        "dateFin": "2018-01-24T01:00:00.000+01:00",
        "preseance": "20",
        "nominPrincipale": "1",
        "infosQualite": {
          "codeQualite": "Membre",
          "libQualite": "Membre",
          "libQualiteSex": "Membre"
        },
        "organes": {
          "organeRef": "PO201115"
        }
      },
      {
        "@xsi:type": "MandatSimple_Type",
        "uid": "PM735236",
        "acteurRef": "PA721608",
        "legislature": "15",
        "typeOrgane": "GA",
        "dateDebut": "2017-09-26T02:00:00.000+02:00",
        "datePublication": null,
        "dateFin": "2017-11-07T01:00:00.000+01:00",
        "preseance": "1",
        "nominPrincipale": "1",
        "infosQualite": {
          "codeQualite": "Président",
          "libQualite": "Président",
          "libQualiteSex": "Président"
        },
        "organes": {
          "organeRef": "PO733322"
        }
      },
      {
        "@xsi:type": "MandatSimple_Type",
        "uid": "PM760484",
        "acteurRef": "PA721608",
        "legislature": "15",
        "typeOrgane": "CNPS",
        "dateDebut": "2018-11-20T01:00:00.000+01:00",
        "datePublication": "2018-11-22T01:00:00.000+01:00",
        "dateFin": "2019-01-17T01:00:00.000+01:00",
        "preseance": "1",
        "nominPrincipale": "1",
        "infosQualite": {
          "codeQualite": "Président",
          "libQualite": "Président",
          "libQualiteSex": "Président"
        },
        "organes": {
          "organeRef": "PO760148"
        }
      },
      {
        "@xsi:type": "MandatMission_Type",
        "uid": "PM766419",
        "acteurRef": "PA721608",
        "legislature": "15",
        "typeOrgane": "MISINFOPRE",
        "dateDebut": "2019-07-12T02:00:00.000+02:00",
        "datePublication": "2019-07-13T02:00:00.000+02:00",
        "dateFin": null,
        "preseance": "20",
        "nominPrincipale": "1",
        "infosQualite": {
          "codeQualite": "Membre",
          "libQualite": "Membre",
          "libQualiteSex": "Membre"
        },
        "organes": {
          "organeRef": "PO766012"
        },
        "libelle": null,
        "missionSuivanteRef": null,
        "missionPrecedenteRef": null
      },
      {
        "@xsi:type": "MandatSimple_Type",
        "uid": "PM731637",
        "acteurRef": "PA721608",
        "legislature": "15",
        "typeOrgane": "COMPER",
        "dateDebut": "2017-06-29T02:00:00.000+02:00",
        "datePublication": "2017-06-29T02:00:00.000+02:00",
        "dateFin": "2019-09-30T02:00:00.000+02:00",
        "preseance": "32",
        "nominPrincipale": "1",
        "infosQualite": {
          "codeQualite": "Membre",
          "libQualite": "Membre",
          "libQualiteSex": "Membre"
        },
        "organes": {
          "organeRef": "PO59048"
        }
      },
      {
        "@xsi:type": "MandatSimple_Type",
        "uid": "PM759225",
        "acteurRef": "PA721608",
        "legislature": "15",
        "typeOrgane": "CMP",
        "dateDebut": "2018-10-02T02:00:00.000+02:00",
        "datePublication": "2018-10-03T02:00:00.000+02:00",
        "dateFin": "2018-10-10T02:00:00.000+02:00",
        "preseance": "20",
        "nominPrincipale": "1",
        "infosQualite": {
          "codeQualite": "Titulaire",
          "libQualite": "Membre titulaire",
          "libQualiteSex": "Membre titulaire"
        },
        "organes": {
          "organeRef": "PO759099"
        }
      },
      {
        "@xsi:type": "MandatSimple_Type",
        "uid": "PM760253",
        "acteurRef": "PA721608",
        "legislature": "15",
        "typeOrgane": "CNPS",
        "dateDebut": "2018-11-13T01:00:00.000+01:00",
        "datePublication": "2018-11-14T01:00:00.000+01:00",
        "dateFin": "2019-01-17T01:00:00.000+01:00",
        "preseance": "20",
        "nominPrincipale": "1",
        "infosQualite": {
          "codeQualite": "Membre",
          "libQualite": "Membre",
          "libQualiteSex": "Membre"
        },
        "organes": {
          "organeRef": "PO760148"
        }
      },
      {
        "@xsi:type": "MandatMission_Type",
        "uid": "PM738964",
        "acteurRef": "PA721608",
        "legislature": "15",
        "typeOrgane": "MISINFOCOM",
        "dateDebut": "2017-10-12T02:00:00.000+02:00",
        "datePublication": "2017-10-12T02:00:00.000+02:00",
        "dateFin": "2018-05-23T02:00:00.000+02:00",
        "preseance": "20",
        "nominPrincipale": "1",
        "infosQualite": {
          "codeQualite": "Membre",
          "libQualite": "Membre",
          "libQualiteSex": "Membre"
        },
        "organes": {
          "organeRef": "PO738944"
        },
        "libelle": null,
        "missionSuivanteRef": null,
        "missionPrecedenteRef": null
      },
      {
        "@xsi:type": "MandatParlementaire_type",
        "uid": "PM723332",
        "acteurRef": "PA721608",
        "legislature": "15",
        "typeOrgane": "ASSEMBLEE",
        "dateDebut": "2017-06-18T02:00:00.000+02:00",
        "datePublication": null,
        "dateFin": null,
        "preseance": "50",
        "nominPrincipale": "1",
        "infosQualite": {
          "codeQualite": "membre",
          "libQualite": "membre",
          "libQualiteSex": "membre"
        },
        "organes": {
          "organeRef": "PO717460"
        },
        "suppleants": {
          "suppleant": {
            "dateDebut": "2017-06-18T02:00:00.000+02:00",
            "dateFin": null,
            "suppleantRef": "PA721612"
          }
        },
        "chambre": null,
        "election": {
          "lieu": {
            "region": "Ile-de-France",
            "regionType": "Métropolitain",
            "departement": "Hauts-de-Seine",
            "numDepartement": "92",
            "numCirco": "12"
          },
          "causeMandat": "élections générales",
          "refCirconscription": "PO718424"
        },
        "mandature": {
          "datePriseFonction": "2017-06-21T02:00:00.000+02:00",
          "causeFin": null,
          "premiereElection": "0",
          "placeHemicycle": "165",
          "mandatRemplaceRef": null
        },
        "collaborateurs": {
          "collaborateur": [
            {
              "qualite": "Mme",
              "prenom": "Clothilde",
              "nom": "Avenet-Tenneson",
              "dateDebut": null,
              "dateFin": null
            },
            {
              "qualite": "Mme",
              "prenom": "Ariane",
              "nom": "Cornut-Gentille",
              "dateDebut": null,
              "dateFin": null
            },
            {
              "qualite": "M.",
              "prenom": "Bertrand",
              "nom": "Marcincal",
              "dateDebut": null,
              "dateFin": null
            }
          ]
        }
      },
      {
        "@xsi:type": "MandatSimple_Type",
        "uid": "PM724707",
        "acteurRef": "PA721608",
        "legislature": "15",
        "typeOrgane": "GP",
        "dateDebut": "2017-06-21T02:00:00.000+02:00",
        "datePublication": null,
        "dateFin": "2017-06-26T02:00:00.000+02:00",
        "preseance": "28",
        "nominPrincipale": "1",
        "infosQualite": {
          "codeQualite": "Député non-inscrit",
          "libQualite": "Député non-inscrit",
          "libQualiteSex": "Député non-inscrit"
        },
        "organes": {
          "organeRef": "PO723569"
        }
      },
      {
        "@xsi:type": "MandatSimple_Type",
        "uid": "PM735235",
        "acteurRef": "PA721608",
        "legislature": "15",
        "typeOrgane": "GA",
        "dateDebut": "2017-09-26T02:00:00.000+02:00",
        "datePublication": null,
        "dateFin": null,
        "preseance": "20",
        "nominPrincipale": "1",
        "infosQualite": {
          "codeQualite": "Membre",
          "libQualite": "Membre",
          "libQualiteSex": "Membre"
        },
        "organes": {
          "organeRef": "PO733322"
        }
      },
      {
        "@xsi:type": "MandatSimple_Type",
        "uid": "PM761072",
        "acteurRef": "PA721608",
        "legislature": "15",
        "typeOrgane": "CMP",
        "dateDebut": "2018-12-13T01:00:00.000+01:00",
        "datePublication": "2018-12-14T01:00:00.000+01:00",
        "dateFin": "2019-01-17T01:00:00.000+01:00",
        "preseance": "20",
        "nominPrincipale": "1",
        "infosQualite": {
          "codeQualite": "Titulaire",
          "libQualite": "Membre titulaire",
          "libQualiteSex": "Membre titulaire"
        },
        "organes": {
          "organeRef": "PO760925"
        }
      },
      {
        "@xsi:type": "MandatAvecSuppleant_Type",
        "uid": "PM732402",
        "acteurRef": "PA721608",
        "legislature": "15",
        "typeOrgane": "COMNL",
        "dateDebut": "2017-07-05T02:00:00.000+02:00",
        "datePublication": "2017-07-05T02:00:00.000+02:00",
        "dateFin": null,
        "preseance": "20",
        "nominPrincipale": "0",
        "infosQualite": {
          "codeQualite": "Membre",
          "libQualite": "Membre",
          "libQualiteSex": "Membre"
        },
        "organes": {
          "organeRef": "PO415287"
        },
        "suppleants": null
      }
    ]
  },
  "@xmlns:xsi": "http://www.w3.org/2001/XMLSchema-instance"
}