{
  "@xmlns:xsi": "http://www.w3.org/2001/XMLSchema-instance",
  "uid": "PO216539",
  "codeType": "CMP",
  "libelle": "Projet de loi relatif à la chasse",
  "libelleEdition": "sur le projet de loi relatif à la chasse",
  "libelleAbrege": "Chasse",
  "libelleAbrev": "2182",
  "viMoDe": {
    "dateDebut": "2000-05-25T02:00:00.000+02:00",
    "dateAgrement": null,
    "dateFin": "2000-05-29T02:00:00.000+02:00"
  },
  "organeParent": null,
  "chambre": null,
  "regime": "5ème République",
  "legislature": "11",
  "secretariat": {
    "secretaire01": null,
    "secretaire02": null
  }
}