{
  "@xmlns:xsi": "http://www.w3.org/2001/XMLSchema-instance",
  "uid": "PO746880",
  "codeType": "GE",
  "libelle": "Enjeux de la ruralité",
  "libelleEdition": "ENJEUX DE LA RURALITÉ",
  "libelleAbrege": "ENJEUX DE LA RURALITÉ",
  "libelleAbrev": "ENJEURURAL",
  "viMoDe": {
    "dateDebut": null,
    "dateAgrement": "2017-12-20T01:00:00.000+01:00",
    "dateFin": null
  },
  "organeParent": null,
  "chambre": null,
  "regime": "5ème République",
  "legislature": "15",
  "secretariat": {
    "secretaire01": "M. David Scalbert",
    "secretaire02": null
  }
}