{
  "@xmlns:xsi": "http://www.w3.org/2001/XMLSchema-instance",
  "uid": "PO387931",
  "codeType": "MINISTERE",
  "libelle": "Premier ministre",
  "libelleEdition": null,
  "libelleAbrege": "Premier ministre",
  "libelleAbrev": "PMI",
  "viMoDe": {
    "dateDebut": "2007-06-18T02:00:00.000+02:00",
    "dateAgrement": null,
    "dateFin": "2010-11-13T01:00:00.000+01:00"
  },
  "organeParent": "PO384206"
}