{
  "uid": {
    "@xsi:type": "IdActeur_type",
    "#text": "PA720014"
  },
  "etatCivil": {
    "ident": {
      "civ": "Mme",
      "prenom": "Huguette",
      "nom": "Tiegna",
      "alpha": "Tiegna",
      "trigramme": "HTI"
    },
    "infoNaissance": {
      "dateNais": "1982-04-01T02:00:00.000+02:00",
      "villeNais": "Bangassogo",
      "depNais": null,
      "paysNais": "Burkina Faso"
    },
    "dateDeces": null
  },
  "profession": {
    "libelleCourant": "Docteur, Ingénieur Recherche et Dévelopement",
    "socProcINSEE": {
      "catSocPro": "Cadres de la fonction publique, professions intellectuelles et  artistiques",
      "famSocPro": "Cadres et professions intellectuelles supérieures"
    }
  },
  "uri_hatvp": "https://www.hatvp.fr/pages_nominatives/tiegna-huguette",
  "adresses": {
    "adresse": [
      {
        "@xsi:type": "AdressePostale_Type",
        "uid": "AD720016",
        "type": "0",
        "typeLibelle": "Adresse officielle",
        "poids": "1",
        "adresseDeRattachement": null,
        "intitule": "Assemblée nationale,",
        "numeroRue": "126",
        "nomRue": "Rue de l'Université,",
        "complementAdresse": null,
        "codePostal": "75355",
        "ville": "Paris 07 SP"
      },
      {
        "@xsi:type": "AdresseSiteWeb_Type",
        "uid": "AD726076",
        "type": "24",
        "typeLibelle": "Twitter",
        "poids": null,
        "adresseDeRattachement": null,
        "valElec": "@HuguetteLREM46"
      },
      {
        "@xsi:type": "AdresseMail_Type",
        "uid": "AD728101",
        "type": "15",
        "typeLibelle": "Mèl",
        "poids": null,
        "adresseDeRattachement": null,
        "valElec": "huguette.tiegna@assemblee-nationale.fr"
      },
      {
        "@xsi:type": "AdressePostale_Type",
        "uid": "AD740703",
        "type": "2",
        "typeLibelle": "Adresse publiée de circonscription",
        "poids": "2",
        "adresseDeRattachement": null,
        "intitule": "Permanence parlementaire",
        "numeroRue": "2",
        "nomRue": "Rue Caviale",
        "complementAdresse": null,
        "codePostal": "46100",
        "ville": "Figeac"
      },
      {
        "@xsi:type": "AdresseSiteWeb_Type",
        "uid": "AD740705",
        "type": "25",
        "typeLibelle": "Facebook",
        "poids": null,
        "adresseDeRattachement": null,
        "valElec": "HuguetteTiegnaLREM46LOT2"
      },
      {
        "@xsi:type": "AdresseSiteWeb_Type",
        "uid": "AD740707",
        "type": "22",
        "typeLibelle": "Site internet",
        "poids": null,
        "adresseDeRattachement": null,
        "valElec": "www.huguettetiegna.fr"
      }
    ]
  },
  "mandats": {
    "mandat": [
      {
        "@xsi:type": "MandatSimple_Type",
        "uid": "PM743285",
        "acteurRef": "PA720014",
        "legislature": "15",
        "typeOrgane": "GA",
        "dateDebut": "2017-11-14T01:00:00.000+01:00",
        "datePublication": null,
        "dateFin": null,
        "preseance": "8",
        "nominPrincipale": "1",
        "infosQualite": {
          "codeQualite": "Vice-Président",
          "libQualite": "Vice-Président",
          "libQualiteSex": "Vice-Présidente"
        },
        "organes": {
          "organeRef": "PO733232"
        }
      },
      {
        "@xsi:type": "MandatSimple_Type",
        "uid": "PM738049",
        "acteurRef": "PA720014",
        "legislature": "15",
        "typeOrgane": "GA",
        "dateDebut": "2017-10-06T02:00:00.000+02:00",
        "datePublication": null,
        "dateFin": null,
        "preseance": "20",
        "nominPrincipale": "1",
        "infosQualite": {
          "codeQualite": "Membre",
          "libQualite": "Membre",
          "libQualiteSex": "Membre"
        },
        "organes": {
          "organeRef": "PO733652"
        }
      },
      {
        "@xsi:type": "MandatSimple_Type",
        "uid": "PM738053",
        "acteurRef": "PA720014",
        "legislature": "15",
        "typeOrgane": "GEVI",
        "dateDebut": "2017-10-06T02:00:00.000+02:00",
        "datePublication": null,
        "dateFin": null,
        "preseance": "20",
        "nominPrincipale": "1",
        "infosQualite": {
          "codeQualite": "Membre",
          "libQualite": "Membre",
          "libQualiteSex": "Membre"
        },
        "organes": {
          "organeRef": "PO733462"
        }
      },
      {
        "@xsi:type": "MandatSimple_Type",
        "uid": "PM738016",
        "acteurRef": "PA720014",
        "legislature": "15",
        "typeOrgane": "GA",
        "dateDebut": "2017-10-06T02:00:00.000+02:00",
        "datePublication": null,
        "dateFin": null,
        "preseance": "20",
        "nominPrincipale": "1",
        "infosQualite": {
          "codeQualite": "Membre",
          "libQualite": "Membre",
          "libQualiteSex": "Membre"
        },
        "organes": {
          "organeRef": "PO732964"
        }
      },
      {
        "@xsi:type": "MandatSimple_Type",
        "uid": "PM738020",
        "acteurRef": "PA720014",
        "legislature": "15",
        "typeOrgane": "GA",
        "dateDebut": "2017-10-06T02:00:00.000+02:00",
        "datePublication": null,
        "dateFin": null,
        "preseance": "20",
        "nominPrincipale": "1",
        "infosQualite": {
          "codeQualite": "Membre",
          "libQualite": "Membre",
          "libQualiteSex": "Membre"
        },
        "organes": {
          "organeRef": "PO733052"
        }
      },
      {
        "@xsi:type": "MandatSimple_Type",
        "uid": "PM750452",
        "acteurRef": "PA720014",
        "legislature": "15",
        "typeOrgane": "GE",
        "dateDebut": "2018-02-08T01:00:00.000+01:00",
        "datePublication": null,
        "dateFin": null,
        "preseance": "20",
        "nominPrincipale": "1",
        "infosQualite": {
          "codeQualite": "Membre",
          "libQualite": "Membre",
          "libQualiteSex": "Membre"
        },
        "organes": {
          "organeRef": "PO747266"
        }
      },
      {
        "@xsi:type": "MandatSimple_Type",
        "uid": "PM755687",
        "acteurRef": "PA720014",
        "legislature": "15",
        "typeOrgane": "GE",
        "dateDebut": "2018-04-10T02:00:00.000+02:00",
        "datePublication": null,
        "dateFin": null,
        "preseance": "12",
        "nominPrincipale": "1",
        "infosQualite": {
          "codeQualite": "Secrétaire",
          "libQualite": "Secrétaire",
          "libQualiteSex": "Secrétaire"
        },
        "organes": {
          "organeRef": "PO751484"
        }
      },
      {
        "@xsi:type": "MandatSimple_Type",
        "uid": "PM751505",
        "acteurRef": "PA720014",
        "legislature": "15",
        "typeOrgane": "GE",
        "dateDebut": "2018-02-21T01:00:00.000+01:00",
        "datePublication": null,
        "dateFin": null,
        "preseance": "20",
        "nominPrincipale": "0",
        "infosQualite": {
          "codeQualite": "Membre",
          "libQualite": "Membre",
          "libQualiteSex": "Membre"
        },
        "organes": {
          "organeRef": "PO746837"
        }
      },
      {
        "@xsi:type": "MandatParlementaire_type",
        "uid": "PM722834",
        "acteurRef": "PA720014",
        "legislature": "15",
        "typeOrgane": "ASSEMBLEE",
        "dateDebut": "2017-06-18T02:00:00.000+02:00",
        "datePublication": null,
        "dateFin": null,
        "preseance": "50",
        "nominPrincipale": "1",
        "infosQualite": {
          "codeQualite": "membre",
          "libQualite": "membre",
          "libQualiteSex": "membre"
        },
        "organes": {
          "organeRef": "PO717460"
        },
        "suppleants": {
          "suppleant": {
            "dateDebut": "2017-06-18T02:00:00.000+02:00",
            "dateFin": null,
            "suppleantRef": "PA720018"
          }
        },
        "chambre": null,
        "election": {
          "lieu": {
            "region": "Occitanie",
            "regionType": "Métropolitain",
            "departement": "Lot",
            "numDepartement": "46",
            "numCirco": "2"
          },
          "causeMandat": "élections générales",
          "refCirconscription": "PO717906"
        },
        "mandature": {
          "datePriseFonction": "2017-06-21T02:00:00.000+02:00",
          "causeFin": null,
          "premiereElection": "0",
          "placeHemicycle": "455",
          "mandatRemplaceRef": null
        },
        "collaborateurs": {
          "collaborateur": [
            {
              "qualite": "M.",
              "prenom": "Jean-Baptiste",
              "nom": "Jallet",
              "dateDebut": null,
              "dateFin": null
            },
            {
              "qualite": "M.",
              "prenom": "Hugo",
              "nom": "Conzelmann",
              "dateDebut": null,
              "dateFin": null
            }
          ]
        }
      },
      {
        "@xsi:type": "MandatSimple_Type",
        "uid": "PM738018",
        "acteurRef": "PA720014",
        "legislature": "15",
        "typeOrgane": "GA",
        "dateDebut": "2017-10-06T02:00:00.000+02:00",
        "datePublication": null,
        "dateFin": null,
        "preseance": "20",
        "nominPrincipale": "1",
        "infosQualite": {
          "codeQualite": "Membre",
          "libQualite": "Membre",
          "libQualiteSex": "Membre"
        },
        "organes": {
          "organeRef": "PO732984"
        }
      },
      {
        "@xsi:type": "MandatSimple_Type",
        "uid": "PM738022",
        "acteurRef": "PA720014",
        "legislature": "15",
        "typeOrgane": "GA",
        "dateDebut": "2017-10-06T02:00:00.000+02:00",
        "datePublication": null,
        "dateFin": null,
        "preseance": "20",
        "nominPrincipale": "1",
        "infosQualite": {
          "codeQualite": "Membre",
          "libQualite": "Membre",
          "libQualiteSex": "Membre"
        },
        "organes": {
          "organeRef": "PO733072"
        }
      },
      {
        "@xsi:type": "MandatSimple_Type",
        "uid": "PM738024",
        "acteurRef": "PA720014",
        "legislature": "15",
        "typeOrgane": "GA",
        "dateDebut": "2017-10-06T02:00:00.000+02:00",
        "datePublication": null,
        "dateFin": null,
        "preseance": "20",
        "nominPrincipale": "1",
        "infosQualite": {
          "codeQualite": "Membre",
          "libQualite": "Membre",
          "libQualiteSex": "Membre"
        },
        "organes": {
          "organeRef": "PO733117"
        }
      },
      {
        "@xsi:type": "MandatSimple_Type",
        "uid": "PM755841",
        "acteurRef": "PA720014",
        "legislature": "15",
        "typeOrgane": "GE",
        "dateDebut": "2018-04-04T02:00:00.000+02:00",
        "datePublication": null,
        "dateFin": null,
        "preseance": "12",
        "nominPrincipale": "1",
        "infosQualite": {
          "codeQualite": "Secrétaire",
          "libQualite": "Secrétaire",
          "libQualiteSex": "Secrétaire"
        },
        "organes": {
          "organeRef": "PO746763"
        }
      },
      {
        "@xsi:type": "MandatSimple_Type",
        "uid": "PM738026",
        "acteurRef": "PA720014",
        "legislature": "15",
        "typeOrgane": "GA",
        "dateDebut": "2017-10-06T02:00:00.000+02:00",
        "datePublication": null,
        "dateFin": null,
        "preseance": "20",
        "nominPrincipale": "1",
        "infosQualite": {
          "codeQualite": "Membre",
          "libQualite": "Membre",
          "libQualiteSex": "Membre"
        },
        "organes": {
          "organeRef": "PO733177"
        }
      },
      {
        "@xsi:type": "MandatSimple_Type",
        "uid": "PM738030",
        "acteurRef": "PA720014",
        "legislature": "15",
        "typeOrgane": "GA",
        "dateDebut": "2017-10-06T02:00:00.000+02:00",
        "datePublication": null,
        "dateFin": null,
        "preseance": "20",
        "nominPrincipale": "1",
        "infosQualite": {
          "codeQualite": "Membre",
          "libQualite": "Membre",
          "libQualiteSex": "Membre"
        },
        "organes": {
          "organeRef": "PO733277"
        }
      },
      {
        "@xsi:type": "MandatMission_Type",
        "uid": "PM757630",
        "acteurRef": "PA720014",
        "legislature": "15",
        "typeOrgane": "MISINFOPRE",
        "dateDebut": "2018-07-05T02:00:00.000+02:00",
        "datePublication": "2018-07-06T02:00:00.000+02:00",
        "dateFin": "2019-08-05T02:00:00.000+02:00",
        "preseance": "20",
        "nominPrincipale": "1",
        "infosQualite": {
          "codeQualite": "Membre",
          "libQualite": "Membre",
          "libQualiteSex": "Membre"
        },
        "organes": {
          "organeRef": "PO757231"
        },
        "libelle": null,
        "missionSuivanteRef": null,
        "missionPrecedenteRef": null
      },
      {
        "@xsi:type": "MandatSimple_Type",
        "uid": "PM735296",
        "acteurRef": "PA720014",
        "legislature": "15",
        "typeOrgane": "GA",
        "dateDebut": "2017-09-26T02:00:00.000+02:00",
        "datePublication": null,
        "dateFin": "2019-10-11T02:00:00.000+02:00",
        "preseance": "1",
        "nominPrincipale": "1",
        "infosQualite": {
          "codeQualite": "Président",
          "libQualite": "Président",
          "libQualiteSex": "Présidente"
        },
        "organes": {
          "organeRef": "PO733227"
        }
      },
      {
        "@xsi:type": "MandatSimple_Type",
        "uid": "PM754319",
        "acteurRef": "PA720014",
        "legislature": "15",
        "typeOrgane": "GE",
        "dateDebut": "2018-03-06T01:00:00.000+01:00",
        "datePublication": null,
        "dateFin": null,
        "preseance": "20",
        "nominPrincipale": "1",
        "infosQualite": {
          "codeQualite": "Membre",
          "libQualite": "Membre",
          "libQualiteSex": "Membre"
        },
        "organes": {
          "organeRef": "PO747135"
        }
      },
      {
        "@xsi:type": "MandatSimple_Type",
        "uid": "PM738028",
        "acteurRef": "PA720014",
        "legislature": "15",
        "typeOrgane": "GA",
        "dateDebut": "2017-10-06T02:00:00.000+02:00",
        "datePublication": null,
        "dateFin": null,
        "preseance": "20",
        "nominPrincipale": "0",
        "infosQualite": {
          "codeQualite": "Membre",
          "libQualite": "Membre",
          "libQualiteSex": "Membre"
        },
        "organes": {
          "organeRef": "PO733232"
        }
      },
      {
        "@xsi:type": "MandatSimple_Type",
        "uid": "PM738032",
        "acteurRef": "PA720014",
        "legislature": "15",
        "typeOrgane": "GA",
        "dateDebut": "2017-10-06T02:00:00.000+02:00",
        "datePublication": null,
        "dateFin": null,
        "preseance": "20",
        "nominPrincipale": "1",
        "infosQualite": {
          "codeQualite": "Membre",
          "libQualite": "Membre",
          "libQualiteSex": "Membre"
        },
        "organes": {
          "organeRef": "PO733302"
        }
      },
      {
        "@xsi:type": "MandatSimple_Type",
        "uid": "PM755523",
        "acteurRef": "PA720014",
        "legislature": "15",
        "typeOrgane": "GE",
        "dateDebut": "2018-04-11T02:00:00.000+02:00",
        "datePublication": null,
        "dateFin": null,
        "preseance": "12",
        "nominPrincipale": "1",
        "infosQualite": {
          "codeQualite": "Secrétaire",
          "libQualite": "Secrétaire",
          "libQualiteSex": "Secrétaire"
        },
        "organes": {
          "organeRef": "PO746837"
        }
      },
      {
        "@xsi:type": "MandatSimple_Type",
        "uid": "PM742104",
        "acteurRef": "PA720014",
        "legislature": "15",
        "typeOrgane": "API",
        "dateDebut": "2017-10-27T02:00:00.000+02:00",
        "datePublication": "2017-10-28T02:00:00.000+02:00",
        "dateFin": "2019-11-06T01:00:00.000+01:00",
        "preseance": "20",
        "nominPrincipale": "1",
        "infosQualite": {
          "codeQualite": "Membre",
          "libQualite": "Membre",
          "libQualiteSex": "Membre"
        },
        "organes": {
          "organeRef": "PO201115"
        }
      },
      {
        "@xsi:type": "MandatSimple_Type",
        "uid": "PM738034",
        "acteurRef": "PA720014",
        "legislature": "15",
        "typeOrgane": "GA",
        "dateDebut": "2017-10-06T02:00:00.000+02:00",
        "datePublication": null,
        "dateFin": null,
        "preseance": "20",
        "nominPrincipale": "1",
        "infosQualite": {
          "codeQualite": "Membre",
          "libQualite": "Membre",
          "libQualiteSex": "Membre"
        },
        "organes": {
          "organeRef": "PO733342"
        }
      },
      {
        "@xsi:type": "MandatAvecSuppleant_Type",
        "uid": "PM732817",
        "acteurRef": "PA720014",
        "legislature": "15",
        "typeOrgane": "OFFPAR",
        "dateDebut": "2017-07-18T02:00:00.000+02:00",
        "datePublication": "2017-07-18T02:00:00.000+02:00",
        "dateFin": null,
        "preseance": "10",
        "nominPrincipale": "1",
        "infosQualite": {
          "codeQualite": "Vice-Président",
          "libQualite": "Vice-Président",
          "libQualiteSex": "Vice-Présidente"
        },
        "organes": {
          "organeRef": "PO273589"
        },
        "suppleants": null
      },
      {
        "@xsi:type": "MandatSimple_Type",
        "uid": "PM738036",
        "acteurRef": "PA720014",
        "legislature": "15",
        "typeOrgane": "GA",
        "dateDebut": "2017-10-06T02:00:00.000+02:00",
        "datePublication": null,
        "dateFin": null,
        "preseance": "20",
        "nominPrincipale": "1",
        "infosQualite": {
          "codeQualite": "Membre",
          "libQualite": "Membre",
          "libQualiteSex": "Membre"
        },
        "organes": {
          "organeRef": "PO733367"
        }
      },
      {
        "@xsi:type": "MandatSimple_Type",
        "uid": "PM738040",
        "acteurRef": "PA720014",
        "legislature": "15",
        "typeOrgane": "GA",
        "dateDebut": "2017-10-06T02:00:00.000+02:00",
        "datePublication": null,
        "dateFin": null,
        "preseance": "20",
        "nominPrincipale": "1",
        "infosQualite": {
          "codeQualite": "Membre",
          "libQualite": "Membre",
          "libQualiteSex": "Membre"
        },
        "organes": {
          "organeRef": "PO733562"
        }
      },
      {
        "@xsi:type": "MandatSimple_Type",
        "uid": "PM732176",
        "acteurRef": "PA720014",
        "legislature": "15",
        "typeOrgane": "COMPER",
        "dateDebut": "2017-06-29T02:00:00.000+02:00",
        "datePublication": "2017-06-29T02:00:00.000+02:00",
        "dateFin": null,
        "preseance": "32",
        "nominPrincipale": "1",
        "infosQualite": {
          "codeQualite": "Membre",
          "libQualite": "Membre",
          "libQualiteSex": "Membre"
        },
        "organes": {
          "organeRef": "PO419610"
        }
      },
      {
        "@xsi:type": "MandatSimple_Type",
        "uid": "PM724458",
        "acteurRef": "PA720014",
        "legislature": "15",
        "typeOrgane": "GP",
        "dateDebut": "2017-06-21T02:00:00.000+02:00",
        "datePublication": null,
        "dateFin": "2017-06-26T02:00:00.000+02:00",
        "preseance": "28",
        "nominPrincipale": "1",
        "infosQualite": {
          "codeQualite": "Député non-inscrit",
          "libQualite": "Député non-inscrit",
          "libQualiteSex": "Députée non-inscrite"
        },
        "organes": {
          "organeRef": "PO723569"
        }
      },
      {
        "@xsi:type": "MandatSimple_Type",
        "uid": "PM765389",
        "acteurRef": "PA720014",
        "legislature": "15",
        "typeOrgane": "GE",
        "dateDebut": "2019-05-29T02:00:00.000+02:00",
        "datePublication": null,
        "dateFin": null,
        "preseance": "20",
        "nominPrincipale": "0",
        "infosQualite": {
          "codeQualite": "Membre",
          "libQualite": "Membre",
          "libQualiteSex": "Membre"
        },
        "organes": {
          "organeRef": "PO763264"
        }
      },
      {
        "@xsi:type": "MandatSimple_Type",
        "uid": "PM738038",
        "acteurRef": "PA720014",
        "legislature": "15",
        "typeOrgane": "GA",
        "dateDebut": "2017-10-06T02:00:00.000+02:00",
        "datePublication": null,
        "dateFin": null,
        "preseance": "20",
        "nominPrincipale": "1",
        "infosQualite": {
          "codeQualite": "Membre",
          "libQualite": "Membre",
          "libQualiteSex": "Membre"
        },
        "organes": {
          "organeRef": "PO733492"
        }
      },
      {
        "@xsi:type": "MandatSimple_Type",
        "uid": "PM738042",
        "acteurRef": "PA720014",
        "legislature": "15",
        "typeOrgane": "GA",
        "dateDebut": "2017-10-06T02:00:00.000+02:00",
        "datePublication": null,
        "dateFin": null,
        "preseance": "20",
        "nominPrincipale": "1",
        "infosQualite": {
          "codeQualite": "Membre",
          "libQualite": "Membre",
          "libQualiteSex": "Membre"
        },
        "organes": {
          "organeRef": "PO733577"
        }
      },
      {
        "@xsi:type": "MandatSimple_Type",
        "uid": "PM750474",
        "acteurRef": "PA720014",
        "legislature": "15",
        "typeOrgane": "GE",
        "dateDebut": "2018-02-14T01:00:00.000+01:00",
        "datePublication": null,
        "dateFin": null,
        "preseance": "20",
        "nominPrincipale": "1",
        "infosQualite": {
          "codeQualite": "Membre",
          "libQualite": "Membre",
          "libQualiteSex": "Membre"
        },
        "organes": {
          "organeRef": "PO746925"
        }
      },
      {
        "@xsi:type": "MandatSimple_Type",
        "uid": "PM750616",
        "acteurRef": "PA720014",
        "legislature": "15",
        "typeOrgane": "GE",
        "dateDebut": "2018-02-12T01:00:00.000+01:00",
        "datePublication": null,
        "dateFin": null,
        "preseance": "20",
        "nominPrincipale": "0",
        "infosQualite": {
          "codeQualite": "Membre",
          "libQualite": "Membre",
          "libQualiteSex": "Membre"
        },
        "organes": {
          "organeRef": "PO746857"
        }
      },
      {
        "@xsi:type": "MandatSimple_Type",
        "uid": "PM748189",
        "acteurRef": "PA720014",
        "legislature": "15",
        "typeOrgane": "API",
        "dateDebut": "2018-01-26T01:00:00.000+01:00",
        "datePublication": null,
        "dateFin": "2019-11-06T01:00:00.000+01:00",
        "preseance": "24",
        "nominPrincipale": "0",
        "infosQualite": {
          "codeQualite": "Trésorier adjoint",
          "libQualite": "Trésorier adjoint",
          "libQualiteSex": "Trésorière adjointe"
        },
        "organes": {
          "organeRef": "PO201115"
        }
      },
      {
        "@xsi:type": "MandatSimple_Type",
        "uid": "PM738044",
        "acteurRef": "PA720014",
        "legislature": "15",
        "typeOrgane": "GA",
        "dateDebut": "2017-10-06T02:00:00.000+02:00",
        "datePublication": null,
        "dateFin": null,
        "preseance": "20",
        "nominPrincipale": "1",
        "infosQualite": {
          "codeQualite": "Membre",
          "libQualite": "Membre",
          "libQualiteSex": "Membre"
        },
        "organes": {
          "organeRef": "PO733607"
        }
      },
      {
        "@xsi:type": "MandatSimple_Type",
        "uid": "PM744508",
        "acteurRef": "PA720014",
        "legislature": "15",
        "typeOrgane": "GA",
        "dateDebut": "2017-11-29T01:00:00.000+01:00",
        "datePublication": null,
        "dateFin": "2018-02-14T01:00:00.000+01:00",
        "preseance": "14",
        "nominPrincipale": "1",
        "infosQualite": {
          "codeQualite": "Secrétaire",
          "libQualite": "Secrétaire",
          "libQualiteSex": "Secrétaire"
        },
        "organes": {
          "organeRef": "PO733507"
        }
      },
      {
        "@xsi:type": "MandatSimple_Type",
        "uid": "PM752731",
        "acteurRef": "PA720014",
        "legislature": "15",
        "typeOrgane": "GE",
        "dateDebut": "2018-03-06T01:00:00.000+01:00",
        "datePublication": null,
        "dateFin": null,
        "preseance": "20",
        "nominPrincipale": "1",
        "infosQualite": {
          "codeQualite": "Membre",
          "libQualite": "Membre",
          "libQualiteSex": "Membre"
        },
        "organes": {
          "organeRef": "PO747220"
        }
      },
      {
        "@xsi:type": "MandatSimple_Type",
        "uid": "PM738046",
        "acteurRef": "PA720014",
        "legislature": "15",
        "typeOrgane": "GA",
        "dateDebut": "2017-10-06T02:00:00.000+02:00",
        "datePublication": null,
        "dateFin": null,
        "preseance": "20",
        "nominPrincipale": "1",
        "infosQualite": {
          "codeQualite": "Membre",
          "libQualite": "Membre",
          "libQualiteSex": "Membre"
        },
        "organes": {
          "organeRef": "PO733632"
        }
      },
      {
        "@xsi:type": "MandatSimple_Type",
        "uid": "PM738048",
        "acteurRef": "PA720014",
        "legislature": "15",
        "typeOrgane": "GA",
        "dateDebut": "2017-10-06T02:00:00.000+02:00",
        "datePublication": null,
        "dateFin": null,
        "preseance": "20",
        "nominPrincipale": "1",
        "infosQualite": {
          "codeQualite": "Membre",
          "libQualite": "Membre",
          "libQualiteSex": "Membre"
        },
        "organes": {
          "organeRef": "PO733642"
        }
      },
      {
        "@xsi:type": "MandatSimple_Type",
        "uid": "PM738052",
        "acteurRef": "PA720014",
        "legislature": "15",
        "typeOrgane": "GEVI",
        "dateDebut": "2017-10-06T02:00:00.000+02:00",
        "datePublication": null,
        "dateFin": null,
        "preseance": "20",
        "nominPrincipale": "1",
        "infosQualite": {
          "codeQualite": "Membre",
          "libQualite": "Membre",
          "libQualiteSex": "Membre"
        },
        "organes": {
          "organeRef": "PO733217"
        }
      },
      {
        "@xsi:type": "MandatSimple_Type",
        "uid": "PM755651",
        "acteurRef": "PA720014",
        "legislature": "15",
        "typeOrgane": "GE",
        "dateDebut": "2018-04-10T02:00:00.000+02:00",
        "datePublication": null,
        "dateFin": null,
        "preseance": "20",
        "nominPrincipale": "0",
        "infosQualite": {
          "codeQualite": "Membre",
          "libQualite": "Membre",
          "libQualiteSex": "Membre"
        },
        "organes": {
          "organeRef": "PO751484"
        }
      },
      {
        "@xsi:type": "MandatSimple_Type",
        "uid": "PM738017",
        "acteurRef": "PA720014",
        "legislature": "15",
        "typeOrgane": "GA",
        "dateDebut": "2017-10-06T02:00:00.000+02:00",
        "datePublication": null,
        "dateFin": null,
        "preseance": "20",
        "nominPrincipale": "1",
        "infosQualite": {
          "codeQualite": "Membre",
          "libQualite": "Membre",
          "libQualiteSex": "Membre"
        },
        "organes": {
          "organeRef": "PO732969"
        }
      },
      {
        "@xsi:type": "MandatSimple_Type",
        "uid": "PM738021",
        "acteurRef": "PA720014",
        "legislature": "15",
        "typeOrgane": "GA",
        "dateDebut": "2017-10-06T02:00:00.000+02:00",
        "datePublication": null,
        "dateFin": null,
        "preseance": "20",
        "nominPrincipale": "1",
        "infosQualite": {
          "codeQualite": "Membre",
          "libQualite": "Membre",
          "libQualiteSex": "Membre"
        },
        "organes": {
          "organeRef": "PO733057"
        }
      },
      {
        "@xsi:type": "MandatSimple_Type",
        "uid": "PM752346",
        "acteurRef": "PA720014",
        "legislature": "15",
        "typeOrgane": "GE",
        "dateDebut": "2018-03-05T01:00:00.000+01:00",
        "datePublication": null,
        "dateFin": null,
        "preseance": "20",
        "nominPrincipale": "0",
        "infosQualite": {
          "codeQualite": "Membre",
          "libQualite": "Membre",
          "libQualiteSex": "Membre"
        },
        "organes": {
          "organeRef": "PO747246"
        }
      },
      {
        "@xsi:type": "MandatSimple_Type",
        "uid": "PM753440",
        "acteurRef": "PA720014",
        "legislature": "15",
        "typeOrgane": "GE",
        "dateDebut": "2018-03-14T01:00:00.000+01:00",
        "datePublication": null,
        "dateFin": null,
        "preseance": "8",
        "nominPrincipale": "1",
        "infosQualite": {
          "codeQualite": "Vice-Président",
          "libQualite": "Vice-Président",
          "libQualiteSex": "Vice-Présidente"
        },
        "organes": {
          "organeRef": "PO747246"
        }
      },
      {
        "@xsi:type": "MandatSimple_Type",
        "uid": "PM738019",
        "acteurRef": "PA720014",
        "legislature": "15",
        "typeOrgane": "GA",
        "dateDebut": "2017-10-06T02:00:00.000+02:00",
        "datePublication": null,
        "dateFin": null,
        "preseance": "20",
        "nominPrincipale": "1",
        "infosQualite": {
          "codeQualite": "Membre",
          "libQualite": "Membre",
          "libQualiteSex": "Membre"
        },
        "organes": {
          "organeRef": "PO733011"
        }
      },
      {
        "@xsi:type": "MandatSimple_Type",
        "uid": "PM738023",
        "acteurRef": "PA720014",
        "legislature": "15",
        "typeOrgane": "GA",
        "dateDebut": "2017-10-06T02:00:00.000+02:00",
        "datePublication": null,
        "dateFin": null,
        "preseance": "20",
        "nominPrincipale": "1",
        "infosQualite": {
          "codeQualite": "Membre",
          "libQualite": "Membre",
          "libQualiteSex": "Membre"
        },
        "organes": {
          "organeRef": "PO733102"
        }
      },
      {
        "@xsi:type": "MandatSimple_Type",
        "uid": "PM754278",
        "acteurRef": "PA720014",
        "legislature": "15",
        "typeOrgane": "GE",
        "dateDebut": "2018-03-26T02:00:00.000+02:00",
        "datePublication": null,
        "dateFin": null,
        "preseance": "20",
        "nominPrincipale": "1",
        "infosQualite": {
          "codeQualite": "Membre",
          "libQualite": "Membre",
          "libQualiteSex": "Membre"
        },
        "organes": {
          "organeRef": "PO747256"
        }
      },
      {
        "@xsi:type": "MandatSimple_Type",
        "uid": "PM752527",
        "acteurRef": "PA720014",
        "legislature": "15",
        "typeOrgane": "GE",
        "dateDebut": "2018-02-14T01:00:00.000+01:00",
        "datePublication": null,
        "dateFin": null,
        "preseance": "20",
        "nominPrincipale": "0",
        "infosQualite": {
          "codeQualite": "Membre",
          "libQualite": "Membre",
          "libQualiteSex": "Membre"
        },
        "organes": {
          "organeRef": "PO746763"
        }
      },
      {
        "@xsi:type": "MandatSimple_Type",
        "uid": "PM743544",
        "acteurRef": "PA720014",
        "legislature": "15",
        "typeOrgane": "CMP",
        "dateDebut": "2017-11-16T01:00:00.000+01:00",
        "datePublication": "2017-11-16T01:00:00.000+01:00",
        "dateFin": "2017-12-19T01:00:00.000+01:00",
        "preseance": "28",
        "nominPrincipale": "1",
        "infosQualite": {
          "codeQualite": "Suppléant",
          "libQualite": "Membre suppléant",
          "libQualiteSex": "Membre suppléante"
        },
        "organes": {
          "organeRef": "PO742823"
        }
      },
      {
        "@xsi:type": "MandatSimple_Type",
        "uid": "PM766574",
        "acteurRef": "PA720014",
        "legislature": "15",
        "typeOrgane": "CMP",
        "dateDebut": "2019-07-18T02:00:00.000+02:00",
        "datePublication": "2019-07-19T02:00:00.000+02:00",
        "dateFin": "2019-09-26T02:00:00.000+02:00",
        "preseance": "28",
        "nominPrincipale": "1",
        "infosQualite": {
          "codeQualite": "Suppléant",
          "libQualite": "Membre suppléant",
          "libQualiteSex": "Membre suppléante"
        },
        "organes": {
          "organeRef": "PO766528"
        }
      },
      {
        "@xsi:type": "MandatSimple_Type",
        "uid": "PM738025",
        "acteurRef": "PA720014",
        "legislature": "15",
        "typeOrgane": "GA",
        "dateDebut": "2017-10-06T02:00:00.000+02:00",
        "datePublication": null,
        "dateFin": null,
        "preseance": "20",
        "nominPrincipale": "1",
        "infosQualite": {
          "codeQualite": "Membre",
          "libQualite": "Membre",
          "libQualiteSex": "Membre"
        },
        "organes": {
          "organeRef": "PO733157"
        }
      },
      {
        "@xsi:type": "MandatSimple_Type",
        "uid": "PM735295",
        "acteurRef": "PA720014",
        "legislature": "15",
        "typeOrgane": "GA",
        "dateDebut": "2017-09-26T02:00:00.000+02:00",
        "datePublication": null,
        "dateFin": null,
        "preseance": "20",
        "nominPrincipale": "1",
        "infosQualite": {
          "codeQualite": "Membre",
          "libQualite": "Membre",
          "libQualiteSex": "Membre"
        },
        "organes": {
          "organeRef": "PO733227"
        }
      },
      {
        "@xsi:type": "MandatSimple_Type",
        "uid": "PM738027",
        "acteurRef": "PA720014",
        "legislature": "15",
        "typeOrgane": "GA",
        "dateDebut": "2017-10-06T02:00:00.000+02:00",
        "datePublication": null,
        "dateFin": null,
        "preseance": "20",
        "nominPrincipale": "1",
        "infosQualite": {
          "codeQualite": "Membre",
          "libQualite": "Membre",
          "libQualiteSex": "Membre"
        },
        "organes": {
          "organeRef": "PO733197"
        }
      },
      {
        "@xsi:type": "MandatSimple_Type",
        "uid": "PM738031",
        "acteurRef": "PA720014",
        "legislature": "15",
        "typeOrgane": "GA",
        "dateDebut": "2017-10-06T02:00:00.000+02:00",
        "datePublication": null,
        "dateFin": null,
        "preseance": "20",
        "nominPrincipale": "1",
        "infosQualite": {
          "codeQualite": "Membre",
          "libQualite": "Membre",
          "libQualiteSex": "Membre"
        },
        "organes": {
          "organeRef": "PO733292"
        }
      },
      {
        "@xsi:type": "MandatSimple_Type",
        "uid": "PM754895",
        "acteurRef": "PA720014",
        "legislature": "15",
        "typeOrgane": "GE",
        "dateDebut": "2018-03-31T02:00:00.000+02:00",
        "datePublication": null,
        "dateFin": null,
        "preseance": "1",
        "nominPrincipale": "1",
        "infosQualite": {
          "codeQualite": "Président",
          "libQualite": "Président",
          "libQualiteSex": "Présidente"
        },
        "organes": {
          "organeRef": "PO746852"
        }
      },
      {
        "@xsi:type": "MandatSimple_Type",
        "uid": "PM738029",
        "acteurRef": "PA720014",
        "legislature": "15",
        "typeOrgane": "GA",
        "dateDebut": "2017-10-06T02:00:00.000+02:00",
        "datePublication": null,
        "dateFin": null,
        "preseance": "20",
        "nominPrincipale": "1",
        "infosQualite": {
          "codeQualite": "Membre",
          "libQualite": "Membre",
          "libQualiteSex": "Membre"
        },
        "organes": {
          "organeRef": "PO733272"
        }
      },
      {
        "@xsi:type": "MandatSimple_Type",
        "uid": "PM738033",
        "acteurRef": "PA720014",
        "legislature": "15",
        "typeOrgane": "GA",
        "dateDebut": "2017-10-06T02:00:00.000+02:00",
        "datePublication": null,
        "dateFin": null,
        "preseance": "20",
        "nominPrincipale": "1",
        "infosQualite": {
          "codeQualite": "Membre",
          "libQualite": "Membre",
          "libQualiteSex": "Membre"
        },
        "organes": {
          "organeRef": "PO733307"
        }
      },
      {
        "@xsi:type": "MandatMission_Type",
        "uid": "PM749056",
        "acteurRef": "PA720014",
        "legislature": "15",
        "typeOrgane": "MISINFOCOM",
        "dateDebut": "2018-02-08T01:00:00.000+01:00",
        "datePublication": "2018-02-08T01:00:00.000+01:00",
        "dateFin": "2018-12-05T01:00:00.000+01:00",
        "preseance": "20",
        "nominPrincipale": "1",
        "infosQualite": {
          "codeQualite": "Membre",
          "libQualite": "Membre",
          "libQualiteSex": "Membre"
        },
        "organes": {
          "organeRef": "PO749043"
        },
        "libelle": null,
        "missionSuivanteRef": null,
        "missionPrecedenteRef": null
      },
      {
        "@xsi:type": "MandatSimple_Type",
        "uid": "PM738035",
        "acteurRef": "PA720014",
        "legislature": "15",
        "typeOrgane": "GA",
        "dateDebut": "2017-10-06T02:00:00.000+02:00",
        "datePublication": null,
        "dateFin": null,
        "preseance": "20",
        "nominPrincipale": "1",
        "infosQualite": {
          "codeQualite": "Membre",
          "libQualite": "Membre",
          "libQualiteSex": "Membre"
        },
        "organes": {
          "organeRef": "PO733347"
        }
      },
      {
        "@xsi:type": "MandatSimple_Type",
        "uid": "PM744754",
        "acteurRef": "PA720014",
        "legislature": "15",
        "typeOrgane": "CNPS",
        "dateDebut": "2017-12-06T01:00:00.000+01:00",
        "datePublication": "2017-12-06T01:00:00.000+01:00",
        "dateFin": "2018-07-31T02:00:00.000+02:00",
        "preseance": "20",
        "nominPrincipale": "1",
        "infosQualite": {
          "codeQualite": "Membre",
          "libQualite": "Membre",
          "libQualiteSex": "Membre"
        },
        "organes": {
          "organeRef": "PO744107"
        }
      },
      {
        "@xsi:type": "MandatMission_Type",
        "uid": "PM760941",
        "acteurRef": "PA720014",
        "legislature": "15",
        "typeOrgane": "MISINFO",
        "dateDebut": "2018-12-11T01:00:00.000+01:00",
        "datePublication": null,
        "dateFin": null,
        "preseance": "10",
        "nominPrincipale": "1",
        "infosQualite": {
          "codeQualite": "Membre",
          "libQualite": "Membre",
          "libQualiteSex": "Membre"
        },
        "organes": {
          "organeRef": "PO760931"
        },
        "libelle": null,
        "missionSuivanteRef": null,
        "missionPrecedenteRef": null
      },
      {
        "@xsi:type": "MandatSimple_Type",
        "uid": "PM754870",
        "acteurRef": "PA720014",
        "legislature": "15",
        "typeOrgane": "GE",
        "dateDebut": "2018-03-02T01:00:00.000+01:00",
        "datePublication": null,
        "dateFin": null,
        "preseance": "20",
        "nominPrincipale": "0",
        "infosQualite": {
          "codeQualite": "Membre",
          "libQualite": "Membre",
          "libQualiteSex": "Membre"
        },
        "organes": {
          "organeRef": "PO746852"
        }
      },
      {
        "@xsi:type": "MandatSimple_Type",
        "uid": "PM738037",
        "acteurRef": "PA720014",
        "legislature": "15",
        "typeOrgane": "GA",
        "dateDebut": "2017-10-06T02:00:00.000+02:00",
        "datePublication": null,
        "dateFin": null,
        "preseance": "20",
        "nominPrincipale": "1",
        "infosQualite": {
          "codeQualite": "Membre",
          "libQualite": "Membre",
          "libQualiteSex": "Membre"
        },
        "organes": {
          "organeRef": "PO733397"
        }
      },
      {
        "@xsi:type": "MandatSimple_Type",
        "uid": "PM738041",
        "acteurRef": "PA720014",
        "legislature": "15",
        "typeOrgane": "GA",
        "dateDebut": "2017-10-06T02:00:00.000+02:00",
        "datePublication": null,
        "dateFin": null,
        "preseance": "20",
        "nominPrincipale": "1",
        "infosQualite": {
          "codeQualite": "Membre",
          "libQualite": "Membre",
          "libQualiteSex": "Membre"
        },
        "organes": {
          "organeRef": "PO733567"
        }
      },
      {
        "@xsi:type": "MandatSimple_Type",
        "uid": "PM755891",
        "acteurRef": "PA720014",
        "legislature": "15",
        "typeOrgane": "GE",
        "dateDebut": "2018-04-30T02:00:00.000+02:00",
        "datePublication": null,
        "dateFin": null,
        "preseance": "20",
        "nominPrincipale": "1",
        "infosQualite": {
          "codeQualite": "Membre",
          "libQualite": "Membre",
          "libQualiteSex": "Membre"
        },
        "organes": {
          "organeRef": "PO746935"
        }
      },
      {
        "@xsi:type": "MandatSimple_Type",
        "uid": "PM752688",
        "acteurRef": "PA720014",
        "legislature": "15",
        "typeOrgane": "GE",
        "dateDebut": "2018-03-07T01:00:00.000+01:00",
        "datePublication": null,
        "dateFin": null,
        "preseance": "12",
        "nominPrincipale": "1",
        "infosQualite": {
          "codeQualite": "Secrétaire",
          "libQualite": "Secrétaire",
          "libQualiteSex": "Secrétaire"
        },
        "organes": {
          "organeRef": "PO746857"
        }
      },
      {
        "@xsi:type": "MandatSimple_Type",
        "uid": "PM738039",
        "acteurRef": "PA720014",
        "legislature": "15",
        "typeOrgane": "GA",
        "dateDebut": "2017-10-06T02:00:00.000+02:00",
        "datePublication": null,
        "dateFin": null,
        "preseance": "20",
        "nominPrincipale": "1",
        "infosQualite": {
          "codeQualite": "Membre",
          "libQualite": "Membre",
          "libQualiteSex": "Membre"
        },
        "organes": {
          "organeRef": "PO733507"
        }
      },
      {
        "@xsi:type": "MandatSimple_Type",
        "uid": "PM738043",
        "acteurRef": "PA720014",
        "legislature": "15",
        "typeOrgane": "GA",
        "dateDebut": "2017-10-06T02:00:00.000+02:00",
        "datePublication": null,
        "dateFin": null,
        "preseance": "20",
        "nominPrincipale": "1",
        "infosQualite": {
          "codeQualite": "Membre",
          "libQualite": "Membre",
          "libQualiteSex": "Membre"
        },
        "organes": {
          "organeRef": "PO733587"
        }
      },
      {
        "@xsi:type": "MandatSimple_Type",
        "uid": "PM750976",
        "acteurRef": "PA720014",
        "legislature": "15",
        "typeOrgane": "GE",
        "dateDebut": "2018-02-19T01:00:00.000+01:00",
        "datePublication": null,
        "dateFin": null,
        "preseance": "20",
        "nominPrincipale": "1",
        "infosQualite": {
          "codeQualite": "Membre",
          "libQualite": "Membre",
          "libQualiteSex": "Membre"
        },
        "organes": {
          "organeRef": "PO746880"
        }
      },
      {
        "@xsi:type": "MandatSimple_Type",
        "uid": "PM745461",
        "acteurRef": "PA720014",
        "legislature": null,
        "typeOrgane": "PARPOL",
        "dateDebut": "2017-12-01T01:00:00.000+01:00",
        "datePublication": null,
        "dateFin": "2018-11-30T01:00:00.000+01:00",
        "preseance": "5",
        "nominPrincipale": "1",
        "infosQualite": {
          "codeQualite": "Membre",
          "libQualite": "Membre",
          "libQualiteSex": "Membre"
        },
        "organes": {
          "organeRef": "PO744854"
        }
      },
      {
        "@xsi:type": "MandatSimple_Type",
        "uid": "PM753067",
        "acteurRef": "PA720014",
        "legislature": "15",
        "typeOrgane": "GE",
        "dateDebut": "2018-03-08T01:00:00.000+01:00",
        "datePublication": null,
        "dateFin": null,
        "preseance": "20",
        "nominPrincipale": "1",
        "infosQualite": {
          "codeQualite": "Membre",
          "libQualite": "Membre",
          "libQualiteSex": "Membre"
        },
        "organes": {
          "organeRef": "PO746811"
        }
      },
      {
        "@xsi:type": "MandatSimple_Type",
        "uid": "PM738045",
        "acteurRef": "PA720014",
        "legislature": "15",
        "typeOrgane": "GA",
        "dateDebut": "2017-10-06T02:00:00.000+02:00",
        "datePublication": null,
        "dateFin": null,
        "preseance": "20",
        "nominPrincipale": "1",
        "infosQualite": {
          "codeQualite": "Membre",
          "libQualite": "Membre",
          "libQualiteSex": "Membre"
        },
        "organes": {
          "organeRef": "PO733617"
        }
      },
      {
        "@xsi:type": "MandatSimple_Type",
        "uid": "PM765471",
        "acteurRef": "PA720014",
        "legislature": "15",
        "typeOrgane": "GE",
        "dateDebut": "2019-05-29T02:00:00.000+02:00",
        "datePublication": null,
        "dateFin": null,
        "preseance": "8",
        "nominPrincipale": "1",
        "infosQualite": {
          "codeQualite": "Vice-Président",
          "libQualite": "Vice-Président",
          "libQualiteSex": "Vice-Présidente"
        },
        "organes": {
          "organeRef": "PO763264"
        }
      },
      {
        "@xsi:type": "MandatSimple_Type",
        "uid": "PM747751",
        "acteurRef": "PA720014",
        "legislature": "15",
        "typeOrgane": "GEVI",
        "dateDebut": "2017-11-30T01:00:00.000+01:00",
        "datePublication": null,
        "dateFin": null,
        "preseance": "8",
        "nominPrincipale": "1",
        "infosQualite": {
          "codeQualite": "Vice-Président",
          "libQualite": "Vice-Président",
          "libQualiteSex": "Vice-Présidente"
        },
        "organes": {
          "organeRef": "PO733047"
        }
      },
      {
        "@xsi:type": "MandatAvecSuppleant_Type",
        "uid": "PM732653",
        "acteurRef": "PA720014",
        "legislature": "15",
        "typeOrgane": "OFFPAR",
        "dateDebut": "2017-07-12T02:00:00.000+02:00",
        "datePublication": "2017-07-12T02:00:00.000+02:00",
        "dateFin": null,
        "preseance": "24",
        "nominPrincipale": "0",
        "infosQualite": {
          "codeQualite": "Membre",
          "libQualite": "Membre",
          "libQualiteSex": "Membre"
        },
        "organes": {
          "organeRef": "PO273589"
        },
        "suppleants": null
      },
      {
        "@xsi:type": "MandatSimple_Type",
        "uid": "PM738047",
        "acteurRef": "PA720014",
        "legislature": "15",
        "typeOrgane": "GA",
        "dateDebut": "2017-10-06T02:00:00.000+02:00",
        "datePublication": null,
        "dateFin": null,
        "preseance": "20",
        "nominPrincipale": "1",
        "infosQualite": {
          "codeQualite": "Membre",
          "libQualite": "Membre",
          "libQualiteSex": "Membre"
        },
        "organes": {
          "organeRef": "PO733637"
        }
      },
      {
        "@xsi:type": "MandatSimple_Type",
        "uid": "PM738051",
        "acteurRef": "PA720014",
        "legislature": "15",
        "typeOrgane": "GEVI",
        "dateDebut": "2017-10-06T02:00:00.000+02:00",
        "datePublication": null,
        "dateFin": null,
        "preseance": "20",
        "nominPrincipale": "0",
        "infosQualite": {
          "codeQualite": "Membre",
          "libQualite": "Membre",
          "libQualiteSex": "Membre"
        },
        "organes": {
          "organeRef": "PO733047"
        }
      },
      {
        "@xsi:type": "MandatSimple_Type",
        "uid": "PM768098",
        "acteurRef": "PA720014",
        "legislature": "15",
        "typeOrgane": "ORGEXTPARL",
        "dateDebut": "2018-06-21T02:00:00.000+02:00",
        "datePublication": "2018-06-28T02:00:00.000+02:00",
        "dateFin": null,
        "preseance": "20",
        "nominPrincipale": "1",
        "infosQualite": {
          "codeQualite": "Titulaire",
          "libQualite": "Membre titulaire",
          "libQualiteSex": "Membre titulaire"
        },
        "organes": {
          "organeRef": "PO768088"
        }
      },
      {
        "@xsi:type": "MandatSimple_Type",
        "uid": "PM731100",
        "acteurRef": "PA720014",
        "legislature": "15",
        "typeOrgane": "GP",
        "dateDebut": "2017-06-27T02:00:00.000+02:00",
        "datePublication": "2017-06-28T02:00:00.000+02:00",
        "dateFin": null,
        "preseance": "20",
        "nominPrincipale": "1",
        "infosQualite": {
          "codeQualite": "Membre",
          "libQualite": "Membre du",
          "libQualiteSex": "Membre du"
        },
        "organes": {
          "organeRef": "PO730964"
        }
      }
    ]
  },
  "@xmlns:xsi": "http://www.w3.org/2001/XMLSchema-instance"
}