{
  "@xmlns:xsi": "http://www.w3.org/2001/XMLSchema-instance",
  "uid": "PO201275",
  "codeType": "DELEG",
  "libelle": "Délégation de l'Assemblée nationale à l'aménagement et au développement durable du territoire",
  "libelleEdition": "de la délégation de l'Assemblée nationale à l'aménagement et au développement durable du  territoire",
  "libelleAbrege": "Délégation de l'Assemblée nationale à l'aménagement et au développement durable",
  "libelleAbrev": "TER",
  "viMoDe": {
    "dateDebut": "1999-06-25T02:00:00.000+02:00",
    "dateAgrement": null,
    "dateFin": "2009-06-15T02:00:00.000+02:00"
  },
  "organeParent": null,
  "chambre": null,
  "regime": "5ème République",
  "legislature": null,
  "secretariat": {
    "secretaire01": null,
    "secretaire02": null
  }
}