{
  "@xmlns:xsi": "http://www.w3.org/2001/XMLSchema-instance",
  "uid": "PO270915",
  "codeType": "GP",
  "libelle": "Député-e-s Communistes et Républicains",
  "libelleEdition": "du groupe Député-e-s Communistes et Républicains",
  "libelleAbrege": "CR",
  "libelleAbrev": "CR",
  "viMoDe": {
    "dateDebut": "2002-06-25T02:00:00.000+02:00",
    "dateAgrement": null,
    "dateFin": "2007-06-19T02:00:00.000+02:00"
  },
  "organeParent": null,
  "chambre": null,
  "regime": "5ème République",
  "legislature": "12",
  "secretariat": {
    "secretaire01": null,
    "secretaire02": null
  },
  "positionPolitique": null,
  "preseance": "9",
  "couleurAssociee": null
}