{
  "@xmlns:xsi": "http://www.w3.org/2001/XMLSchema-instance",
  "uid": "PO746748",
  "codeType": "GE",
  "libelle": "Conditions d'accueil des migrants",
  "libelleEdition": "CONDITIONS D'ACCUEIL DES MIGRANTS",
  "libelleAbrege": "CONDITIONS D'ACCUEIL DES MIGRANTS",
  "libelleAbrev": "ACCMIGRANT",
  "viMoDe": {
    "dateDebut": null,
    "dateAgrement": "2017-12-20T01:00:00.000+01:00",
    "dateFin": null
  },
  "organeParent": null,
  "chambre": null,
  "regime": "5ème République",
  "legislature": "15",
  "secretariat": {
    "secretaire01": "M. Lucien Dalarun",
    "secretaire02": null
  }
}