{
  "@xmlns:xsi": "http://www.w3.org/2001/XMLSchema-instance",
  "uid": "PO733037",
  "codeType": "GA",
  "libelle": "France-Népal",
  "libelleEdition": "de France-Népal",
  "libelleAbrege": "Népal",
  "libelleAbrev": "NEP",
  "viMoDe": {
    "dateDebut": null,
    "dateAgrement": "2017-07-19T02:00:00.000+02:00",
    "dateFin": null
  },
  "organeParent": null,
  "chambre": null,
  "regime": "5ème République",
  "legislature": "15",
  "secretariat": {
    "secretaire01": "M. Pascal Marchain",
    "secretaire02": null
  },
  "listePays": {
    "paysRef": "GOP756452"
  }
}