{
  "@xmlns:xsi": "http://www.w3.org/2001/XMLSchema-instance",
  "uid": "PO285078",
  "codeType": "GE",
  "libelle": "Groupe d'études sur le médicament et les produits de santé",
  "libelleEdition": "du groupe d'études sur le médicament et les produits de santé",
  "libelleAbrege": "Médicament",
  "libelleAbrev": "MED",
  "viMoDe": {
    "dateDebut": null,
    "dateAgrement": "2002-10-16T02:00:00.000+02:00",
    "dateFin": "2007-06-19T02:00:00.000+02:00"
  },
  "organeParent": null,
  "chambre": null,
  "regime": "5ème République",
  "legislature": "12",
  "secretariat": {
    "secretaire01": null,
    "secretaire02": null
  }
}