{
  "@xmlns:xsi": "http://www.w3.org/2001/XMLSchema-instance",
  "uid": "PO77707",
  "codeType": "GROUPESENAT",
  "libelle": "communiste républicain et citoyen",
  "libelleEdition": "du groupe communiste républicain et citoyen",
  "libelleAbrege": "Communiste",
  "libelleAbrev": "CRCPO",
  "viMoDe": {
    "dateDebut": "1992-10-02T01:00:00.000+01:00",
    "dateAgrement": null,
    "dateFin": null
  },
  "organeParent": null
}