{
  "@xmlns:xsi": "http://www.w3.org/2001/XMLSchema-instance",
  "uid": "PO416941",
  "codeType": "MISINFOPRE",
  "libelle": "Mission d'évaluation de la politique de prévention et de lutte contre les violences faites aux femmes",
  "libelleEdition": "de la Mission d'évaluation de la politique de prévention et de lutte contre les violences faites aux femmes",
  "libelleAbrege": "Violences faites aux femmes",
  "libelleAbrev": "VIOLENCES",
  "viMoDe": {
    "dateDebut": "2008-12-02T01:00:00.000+01:00",
    "dateAgrement": null,
    "dateFin": "2009-07-07T02:00:00.000+02:00"
  },
  "organeParent": null,
  "chambre": null,
  "regime": "5ème République",
  "legislature": "13",
  "secretariat": {
    "secretaire01": null,
    "secretaire02": null
  }
}