{
  "@xmlns:xsi": "http://www.w3.org/2001/XMLSchema-instance",
  "uid": "PO60248",
  "codeType": "ORGEXTPARL",
  "libelle": "Conseil national de l'enseignement supérieur et de la recherche",
  "libelleEdition": "du Conseil national de l'enseignement supérieur et de la recherche",
  "libelleAbrege": "Enseignement supérieur",
  "libelleAbrev": "108",
  "viMoDe": {
    "dateDebut": "1989-01-02T01:00:00.000+01:00",
    "dateAgrement": null,
    "dateFin": null
  },
  "organeParent": null,
  "chambre": null,
  "regime": "5ème République",
  "legislature": null,
  "regimeJuridique": "Article L. 232-1 du code de l’éducation",
  "siteInternet": "http://www.enseignementsup-recherche.gouv.fr/cid53497/le-conseil-national-de-l-enseignement-superieur-et-de-la-recherche-cneser.html",
  "nombreReunionsAnnuelles": "20"
}