{
  "@xmlns:xsi": "http://www.w3.org/2001/XMLSchema-instance",
  "uid": "PO733032",
  "codeType": "GA",
  "libelle": "France-Egypte",
  "libelleEdition": "de France-Egypte",
  "libelleAbrege": "Egypte",
  "libelleAbrev": "EGY",
  "viMoDe": {
    "dateDebut": null,
    "dateAgrement": "2017-07-19T02:00:00.000+02:00",
    "dateFin": null
  },
  "organeParent": null,
  "chambre": null,
  "regime": "5ème République",
  "legislature": "15",
  "secretariat": {
    "secretaire01": "Mme Sophie Teulade",
    "secretaire02": null
  },
  "listePays": {
    "paysRef": "GOP756492"
  }
}