{
  "@xmlns:xsi": "http://www.w3.org/2001/XMLSchema-instance",
  "uid": "PO696970",
  "codeType": "CMP",
  "libelle": "Commission mixte paritaire chargée de proposer un texte sur les dispositions restant en discussion du projet de loi habilitant le Gouvernement à simplifier les relations entre l'administration et les citoyens",
  "libelleEdition": "du projet de loi habilitant le Gouvernement à simplifier les relations entre l'administration et les citoyens",
  "libelleAbrege": "Relations administration-citoyens",
  "libelleAbrev": "664-12-13",
  "viMoDe": {
    "dateDebut": "2013-09-17T02:00:00.000+02:00",
    "dateAgrement": null,
    "dateFin": "2013-10-30T01:00:00.000+01:00"
  },
  "organeParent": null,
  "chambre": null,
  "regime": "5ème République",
  "legislature": "14",
  "secretariat": {
    "secretaire01": null,
    "secretaire02": null
  }
}