{
  "@xmlns:xsi": "http://www.w3.org/2001/XMLSchema-instance",
  "uid": "PO716002",
  "codeType": "CMP",
  "libelle": "Commission mixte paritaire chargée de proposer un texte sur les dispositions restant en discussion de la proposition de loi relative à l'extension du délit d'entrave à l'interruption volontaire de grossesse",
  "libelleEdition": "de la commission mixte paritaire chargée de proposer un texte sur les dispositions restant en discussion de la proposition de loi relative à l'extension du délit d'entrave à l'interruption volontaire de grossesse",
  "libelleAbrege": "Extension du délit d'entrave à l'interruption volontaire de grossesse",
  "libelleAbrev": "4118",
  "viMoDe": {
    "dateDebut": "2016-12-08T01:00:00.000+01:00",
    "dateAgrement": null,
    "dateFin": "2017-01-25T01:00:00.000+01:00"
  },
  "organeParent": null,
  "chambre": null,
  "regime": "5ème République",
  "legislature": "14",
  "secretariat": {
    "secretaire01": null,
    "secretaire02": null
  }
}