{
  "@xmlns:xsi": "http://www.w3.org/2001/XMLSchema-instance",
  "uid": "PO708730",
  "codeType": "CMP",
  "libelle": "Commission mixte paritaire chargée de proposer un texte sur les dispositions restant en discussion du projet de loi relatif au dialogue social et à l'emploi",
  "libelleEdition": "de la commission mixte paritaire chargée de proposer un texte sur les dispositions restant en discussion du projet de loi relatif au dialogue social et à l'emploi",
  "libelleAbrege": "Dialogue social et emploi",
  "libelleAbrev": "2739",
  "viMoDe": {
    "dateDebut": "2015-06-29T02:00:00.000+02:00",
    "dateAgrement": null,
    "dateFin": "2015-07-01T02:00:00.000+02:00"
  },
  "organeParent": null,
  "chambre": null,
  "regime": "5ème République",
  "legislature": "14",
  "secretariat": {
    "secretaire01": null,
    "secretaire02": null
  }
}