{
  "@xmlns:xsi": "http://www.w3.org/2001/XMLSchema-instance",
  "uid": "PO206914",
  "codeType": "CMP",
  "libelle": "projet de loi  d'orientation agricole",
  "libelleEdition": "sur le projet de loi  d'orientation agricole",
  "libelleAbrege": "Orientation agricole",
  "libelleAbrev": "977",
  "viMoDe": {
    "dateDebut": "1999-02-02T01:00:00.000+01:00",
    "dateAgrement": null,
    "dateFin": "1999-03-04T01:00:00.000+01:00"
  },
  "organeParent": null,
  "chambre": null,
  "regime": "5ème République",
  "legislature": "11",
  "secretariat": {
    "secretaire01": null,
    "secretaire02": null
  }
}