{
  "@xmlns:xsi": "http://www.w3.org/2001/XMLSchema-instance",
  "uid": "PO695919",
  "codeType": "MISINFOCOM",
  "libelle": "Mission d'information commune sur la politique de soutien au sport professionnel et les solidarités avec le sport amateur",
  "libelleEdition": "de la mission d'information commune sur la politique de soutien au sport professionnel et les solidarités avec le sport amateur",
  "libelleAbrege": "Soutien au sport",
  "libelleAbrev": "SPORT",
  "viMoDe": {
    "dateDebut": "2013-07-08T02:00:00.000+02:00",
    "dateAgrement": null,
    "dateFin": "2013-07-11T02:00:00.000+02:00"
  },
  "organeParent": null,
  "chambre": null,
  "regime": "5ème République",
  "legislature": "14",
  "secretariat": {
    "secretaire01": null,
    "secretaire02": null
  }
}