{
  "@xmlns:xsi": "http://www.w3.org/2001/XMLSchema-instance",
  "uid": "PO44312",
  "codeType": "ASSEMBLEE",
  "libelle": "Assemblée nationale de la 10ème législature",
  "libelleEdition": "de l'Assemblée",
  "libelleAbrege": "Assemblée",
  "libelleAbrev": "AN",
  "viMoDe": {
    "dateDebut": "1993-04-02T02:00:00.000+02:00",
    "dateAgrement": null,
    "dateFin": "1997-04-21T02:00:00.000+02:00"
  },
  "organeParent": null,
  "chambre": null,
  "regime": "5ème République",
  "legislature": "10",
  "secretariat": {
    "secretaire01": null,
    "secretaire02": null
  }
}