{
  "@xmlns:xsi": "http://www.w3.org/2001/XMLSchema-instance",
  "uid": "PO271850",
  "codeType": "COMNL",
  "libelle": "Commission chargée de l'application de l'article 26 de la Constitution",
  "libelleEdition": "de la commission chargée de l'application de l'article 26 de la Constitution",
  "libelleAbrege": "Immunités",
  "libelleAbrev": "IMMU",
  "viMoDe": {
    "dateDebut": "1994-04-06T02:00:00.000+02:00",
    "dateAgrement": null,
    "dateFin": null
  },
  "organeParent": null,
  "chambre": null,
  "regime": "5ème République",
  "legislature": "10",
  "secretariat": {
    "secretaire01": "Mme Catherine Leroy",
    "secretaire02": null
  }
}