{
  "@xmlns:xsi": "http://www.w3.org/2001/XMLSchema-instance",
  "uid": "PO744286",
  "codeType": "MISINFO",
  "libelle": "Mission d'information sur le terrorisme : lutter contre le financement du terrorisme international",
  "libelleEdition": "de la mission d'information sur le terrorisme : lutter contre le financement du terrorisme international",
  "libelleAbrege": "Lutter contre le financement du terrorisme international",
  "libelleAbrev": "TERRORISME",
  "viMoDe": {
    "dateDebut": "2017-10-24T02:00:00.000+02:00",
    "dateAgrement": null,
    "dateFin": "2019-04-03T02:00:00.000+02:00"
  },
  "organeParent": "PO59047",
  "chambre": null,
  "regime": "5ème République",
  "legislature": "15",
  "secretariat": {
    "secretaire01": null,
    "secretaire02": null
  }
}