{
  "@xmlns:xsi": "http://www.w3.org/2001/XMLSchema-instance",
  "uid": "PO426509",
  "codeType": "ORGEXTPARL",
  "libelle": "Commission consultative de suivi des conséquences des essais nucléaires",
  "libelleEdition": "de la Commission consultative de suivi des conséquences des essais nucléaires",
  "libelleAbrege": "Essais nucléaires",
  "libelleAbrev": "272",
  "viMoDe": {
    "dateDebut": "2010-01-05T01:00:00.000+01:00",
    "dateAgrement": null,
    "dateFin": null
  },
  "organeParent": null,
  "chambre": null,
  "regime": "5ème République",
  "legislature": null,
  "regimeJuridique": "Article 7 de la loi n° 2010-2 du 5 janvier 2010",
  "siteInternet": "https://www.gouvernement.fr/civen-faq-3022",
  "nombreReunionsAnnuelles": "1"
}