{
  "@xmlns:xsi": "http://www.w3.org/2001/XMLSchema-instance",
  "uid": "PO423357",
  "codeType": "MINISTERE",
  "libelle": "Ministère du travail, de la solidarité et de la fonction publique",
  "libelleEdition": "du travail, de la solidarité et de la fonction publique",
  "libelleAbrege": "Travail, solidarité et fonction publique",
  "libelleAbrev": "TRS",
  "viMoDe": {
    "dateDebut": "2010-03-22T01:00:00.000+01:00",
    "dateAgrement": null,
    "dateFin": "2010-11-13T01:00:00.000+01:00"
  },
  "organeParent": "PO384206"
}