{
  "@xmlns:xsi": "http://www.w3.org/2001/XMLSchema-instance",
  "uid": "PO767884",
  "codeType": "MISINFOCOM",
  "libelle": "Mission d'information commune sur l'identité numérique",
  "libelleEdition": "de la mission d'information commune sur l'identité numérique",
  "libelleAbrege": "Identité numérique",
  "libelleAbrev": "MICNUM",
  "viMoDe": {
    "dateDebut": "2019-10-30T01:00:00.000+01:00",
    "dateAgrement": null,
    "dateFin": null
  },
  "organeParent": null,
  "chambre": null,
  "regime": "5ème République",
  "legislature": "15",
  "secretariat": {
    "secretaire01": null,
    "secretaire02": null
  }
}