{
  "@xmlns:xsi": "http://www.w3.org/2001/XMLSchema-instance",
  "uid": "PO706466",
  "codeType": "MINISTERE",
  "libelle": "Ministère de l'éducation nationale, de l'enseignement supérieur et de la recherche",
  "libelleEdition": "de l'éducation nationale, de l'enseignement supérieur et de la recherche",
  "libelleAbrege": "Éducation nationale, enseignement supérieur et recherche",
  "libelleAbrev": "EDU",
  "viMoDe": {
    "dateDebut": "2015-03-06T01:00:00.000+01:00",
    "dateAgrement": null,
    "dateFin": "2016-12-06T01:00:00.000+01:00"
  },
  "organeParent": "PO702883"
}