{
  "@xmlns:xsi": "http://www.w3.org/2001/XMLSchema-instance",
  "uid": "PO418960",
  "codeType": "CMP",
  "libelle": "Commission mixte paritaire chargée de proposer un texte sur les dispositions restant en discussion du projet de loi favorisant la diffusion et la protection de la création sur Internet",
  "libelleEdition": "projet de loi favorisant la diffusion et la protection de la création sur Internet",
  "libelleAbrege": "Création sur Internet",
  "libelleAbrev": "405-07-08",
  "viMoDe": {
    "dateDebut": "2009-04-03T02:00:00.000+02:00",
    "dateAgrement": null,
    "dateFin": "2009-04-22T02:00:00.000+02:00"
  },
  "organeParent": null,
  "chambre": null,
  "regime": "5ème République",
  "legislature": "13",
  "secretariat": {
    "secretaire01": null,
    "secretaire02": null
  }
}