{
  "uid": {
    "@xsi:type": "IdActeur_type",
    "#text": "PA719060"
  },
  "etatCivil": {
    "ident": {
      "civ": "M.",
      "prenom": "Christophe",
      "nom": "Jerretie",
      "alpha": "Jerretie",
      "trigramme": "CJE"
    },
    "infoNaissance": {
      "dateNais": "1979-08-31T02:00:00.000+02:00",
      "villeNais": "Tulle",
      "depNais": "Corrèze",
      "paysNais": "FRANCE"
    },
    "dateDeces": null
  },
  "profession": {
    "libelleCourant": "Profession libérale",
    "socProcINSEE": {
      "catSocPro": "Professions libérales et assimilés",
      "famSocPro": "Cadres et professions intellectuelles supérieures"
    }
  },
  "uri_hatvp": "https://www.hatvp.fr/pages_nominatives/jerretie-christophe",
  "adresses": {
    "adresse": [
      {
        "@xsi:type": "AdressePostale_Type",
        "uid": "AD719062",
        "type": "0",
        "typeLibelle": "Adresse officielle",
        "poids": "1",
        "adresseDeRattachement": null,
        "intitule": "Assemblée nationale,",
        "numeroRue": "126",
        "nomRue": "Rue de l'Université,",
        "complementAdresse": null,
        "codePostal": "75355",
        "ville": "Paris 07 SP"
      },
      {
        "@xsi:type": "AdresseMail_Type",
        "uid": "AD728000",
        "type": "15",
        "typeLibelle": "Mèl",
        "poids": null,
        "adresseDeRattachement": null,
        "valElec": "christophe.jerretie@assemblee-nationale.fr"
      },
      {
        "@xsi:type": "AdresseSiteWeb_Type",
        "uid": "AD728570",
        "type": "25",
        "typeLibelle": "Facebook",
        "poids": null,
        "adresseDeRattachement": null,
        "valElec": "christophe.jerretie"
      },
      {
        "@xsi:type": "AdresseSiteWeb_Type",
        "uid": "AD728932",
        "type": "24",
        "typeLibelle": "Twitter",
        "poids": null,
        "adresseDeRattachement": null,
        "valElec": "@cjerretie"
      },
      {
        "@xsi:type": "AdressePostale_Type",
        "uid": "AD736785",
        "type": "2",
        "typeLibelle": "Adresse publiée de circonscription",
        "poids": "22",
        "adresseDeRattachement": null,
        "intitule": "Permanence parlementaire",
        "numeroRue": "14",
        "nomRue": "Avenue Victor Hugo",
        "complementAdresse": null,
        "codePostal": "19000",
        "ville": "Tulle"
      },
      {
        "@xsi:type": "AdresseTelephonique_Type",
        "uid": "AD736787",
        "type": "11",
        "typeLibelle": "Téléphone",
        "poids": "22",
        "adresseDeRattachement": "AD736785",
        "valElec": "05 44 40 61 94"
      },
      {
        "@xsi:type": "AdresseTelephonique_Type",
        "uid": "AD736789",
        "type": "11",
        "typeLibelle": "Téléphone",
        "poids": "1",
        "adresseDeRattachement": "AD719062",
        "valElec": "01 40 63 31 68"
      },
      {
        "@xsi:type": "AdresseMail_Type",
        "uid": "AD736791",
        "type": "15",
        "typeLibelle": "Mèl",
        "poids": null,
        "adresseDeRattachement": null,
        "valElec": "permanence@christophejerretie.fr"
      }
    ]
  },
  "mandats": {
    "mandat": [
      {
        "@xsi:type": "MandatSimple_Type",
        "uid": "PM760205",
        "acteurRef": "PA719060",
        "legislature": "15",
        "typeOrgane": "CNPS",
        "dateDebut": "2018-11-13T01:00:00.000+01:00",
        "datePublication": "2018-11-14T01:00:00.000+01:00",
        "dateFin": "2019-01-17T01:00:00.000+01:00",
        "preseance": "20",
        "nominPrincipale": "1",
        "infosQualite": {
          "codeQualite": "Membre",
          "libQualite": "Membre",
          "libQualiteSex": "Membre"
        },
        "organes": {
          "organeRef": "PO760148"
        }
      },
      {
        "@xsi:type": "MandatSimple_Type",
        "uid": "PM749436",
        "acteurRef": "PA719060",
        "legislature": "15",
        "typeOrgane": "GE",
        "dateDebut": "2018-02-28T01:00:00.000+01:00",
        "datePublication": null,
        "dateFin": null,
        "preseance": "20",
        "nominPrincipale": "1",
        "infosQualite": {
          "codeQualite": "Membre",
          "libQualite": "Membre",
          "libQualiteSex": "Membre"
        },
        "organes": {
          "organeRef": "PO746674"
        }
      },
      {
        "@xsi:type": "MandatSimple_Type",
        "uid": "PM736594",
        "acteurRef": "PA719060",
        "legislature": "15",
        "typeOrgane": "GA",
        "dateDebut": "2017-10-02T02:00:00.000+02:00",
        "datePublication": null,
        "dateFin": null,
        "preseance": "20",
        "nominPrincipale": "0",
        "infosQualite": {
          "codeQualite": "Membre",
          "libQualite": "Membre",
          "libQualiteSex": "Membre"
        },
        "organes": {
          "organeRef": "PO732944"
        }
      },
      {
        "@xsi:type": "MandatSimple_Type",
        "uid": "PM749438",
        "acteurRef": "PA719060",
        "legislature": "15",
        "typeOrgane": "GE",
        "dateDebut": "2018-02-12T01:00:00.000+01:00",
        "datePublication": null,
        "dateFin": null,
        "preseance": "20",
        "nominPrincipale": "1",
        "infosQualite": {
          "codeQualite": "Membre",
          "libQualite": "Membre",
          "libQualiteSex": "Membre"
        },
        "organes": {
          "organeRef": "PO746925"
        }
      },
      {
        "@xsi:type": "MandatSimple_Type",
        "uid": "PM745157",
        "acteurRef": "PA719060",
        "legislature": null,
        "typeOrgane": "PARPOL",
        "dateDebut": "2017-12-01T01:00:00.000+01:00",
        "datePublication": null,
        "dateFin": "2018-11-30T01:00:00.000+01:00",
        "preseance": "5",
        "nominPrincipale": "1",
        "infosQualite": {
          "codeQualite": "Membre",
          "libQualite": "Membre",
          "libQualiteSex": "Membre"
        },
        "organes": {
          "organeRef": "PO744854"
        }
      },
      {
        "@xsi:type": "MandatSimple_Type",
        "uid": "PM750928",
        "acteurRef": "PA719060",
        "legislature": "15",
        "typeOrgane": "GE",
        "dateDebut": "2018-02-19T01:00:00.000+01:00",
        "datePublication": null,
        "dateFin": null,
        "preseance": "20",
        "nominPrincipale": "1",
        "infosQualite": {
          "codeQualite": "Membre",
          "libQualite": "Membre",
          "libQualiteSex": "Membre"
        },
        "organes": {
          "organeRef": "PO746880"
        }
      },
      {
        "@xsi:type": "MandatSimple_Type",
        "uid": "PM749527",
        "acteurRef": "PA719060",
        "legislature": "15",
        "typeOrgane": "GE",
        "dateDebut": "2018-02-13T01:00:00.000+01:00",
        "datePublication": null,
        "dateFin": null,
        "preseance": "20",
        "nominPrincipale": "1",
        "infosQualite": {
          "codeQualite": "Membre",
          "libQualite": "Membre",
          "libQualiteSex": "Membre"
        },
        "organes": {
          "organeRef": "PO746894"
        }
      },
      {
        "@xsi:type": "MandatSimple_Type",
        "uid": "PM756660",
        "acteurRef": "PA719060",
        "legislature": "15",
        "typeOrgane": "GA",
        "dateDebut": "2018-05-30T02:00:00.000+02:00",
        "datePublication": null,
        "dateFin": null,
        "preseance": "20",
        "nominPrincipale": "1",
        "infosQualite": {
          "codeQualite": "Membre",
          "libQualite": "Membre",
          "libQualiteSex": "Membre"
        },
        "organes": {
          "organeRef": "PO733577"
        }
      },
      {
        "@xsi:type": "MandatSimple_Type",
        "uid": "PM746263",
        "acteurRef": "PA719060",
        "legislature": "15",
        "typeOrgane": "DELEG",
        "dateDebut": "2017-12-09T01:00:00.000+01:00",
        "datePublication": "2017-12-09T01:00:00.000+01:00",
        "dateFin": null,
        "preseance": "20",
        "nominPrincipale": "0",
        "infosQualite": {
          "codeQualite": "Membre",
          "libQualite": "Membre",
          "libQualiteSex": "Membre"
        },
        "organes": {
          "organeRef": "PO744127"
        }
      },
      {
        "@xsi:type": "MandatSimple_Type",
        "uid": "PM749395",
        "acteurRef": "PA719060",
        "legislature": "15",
        "typeOrgane": "GE",
        "dateDebut": "2018-02-12T01:00:00.000+01:00",
        "datePublication": null,
        "dateFin": null,
        "preseance": "20",
        "nominPrincipale": "1",
        "infosQualite": {
          "codeQualite": "Membre",
          "libQualite": "Membre",
          "libQualiteSex": "Membre"
        },
        "organes": {
          "organeRef": "PO747215"
        }
      },
      {
        "@xsi:type": "MandatAvecSuppleant_Type",
        "uid": "PM732367",
        "acteurRef": "PA719060",
        "legislature": "15",
        "typeOrgane": "COMNL",
        "dateDebut": "2017-07-05T02:00:00.000+02:00",
        "datePublication": "2017-07-05T02:00:00.000+02:00",
        "dateFin": null,
        "preseance": "20",
        "nominPrincipale": "1",
        "infosQualite": {
          "codeQualite": "Membre",
          "libQualite": "Membre",
          "libQualiteSex": "Membre"
        },
        "organes": {
          "organeRef": "PO415287"
        },
        "suppleants": null
      },
      {
        "@xsi:type": "MandatAvecSuppleant_Type",
        "uid": "PM732904",
        "acteurRef": "PA719060",
        "legislature": "15",
        "typeOrgane": "COMNL",
        "dateDebut": "2017-07-20T02:00:00.000+02:00",
        "datePublication": "2017-07-20T02:00:00.000+02:00",
        "dateFin": "2019-03-29T01:00:00.000+01:00",
        "preseance": "16",
        "nominPrincipale": "1",
        "infosQualite": {
          "codeQualite": "Secrétaire",
          "libQualite": "Secrétaire",
          "libQualiteSex": "Secrétaire"
        },
        "organes": {
          "organeRef": "PO271860"
        },
        "suppleants": null
      },
      {
        "@xsi:type": "MandatParlementaire_type",
        "uid": "PM722546",
        "acteurRef": "PA719060",
        "legislature": "15",
        "typeOrgane": "ASSEMBLEE",
        "dateDebut": "2017-06-18T02:00:00.000+02:00",
        "datePublication": null,
        "dateFin": null,
        "preseance": "50",
        "nominPrincipale": "1",
        "infosQualite": {
          "codeQualite": "membre",
          "libQualite": "membre",
          "libQualiteSex": "membre"
        },
        "organes": {
          "organeRef": "PO717460"
        },
        "suppleants": {
          "suppleant": {
            "dateDebut": "2017-06-18T02:00:00.000+02:00",
            "dateFin": null,
            "suppleantRef": "PA719064"
          }
        },
        "chambre": null,
        "election": {
          "lieu": {
            "region": "Nouvelle-Aquitaine",
            "regionType": "Métropolitain",
            "departement": "Corrèze",
            "numDepartement": "19",
            "numCirco": "1"
          },
          "causeMandat": "élections générales",
          "refCirconscription": "PO717634"
        },
        "mandature": {
          "datePriseFonction": "2017-06-21T02:00:00.000+02:00",
          "causeFin": null,
          "premiereElection": "0",
          "placeHemicycle": "320",
          "mandatRemplaceRef": null
        },
        "collaborateurs": {
          "collaborateur": [
            {
              "qualite": "M.",
              "prenom": "Jérôme",
              "nom": "Petit",
              "dateDebut": null,
              "dateFin": null
            },
            {
              "qualite": "Mme",
              "prenom": "Audrey",
              "nom": "Chouzenoux",
              "dateDebut": null,
              "dateFin": null
            },
            {
              "qualite": "Mme",
              "prenom": "Aurélie",
              "nom": "Manaux",
              "dateDebut": null,
              "dateFin": null
            },
            {
              "qualite": "Mme",
              "prenom": "Isabelle",
              "nom": "Celle",
              "dateDebut": null,
              "dateFin": null
            }
          ]
        }
      },
      {
        "@xsi:type": "MandatSimple_Type",
        "uid": "PM749402",
        "acteurRef": "PA719060",
        "legislature": "15",
        "typeOrgane": "GE",
        "dateDebut": "2018-02-08T01:00:00.000+01:00",
        "datePublication": null,
        "dateFin": null,
        "preseance": "20",
        "nominPrincipale": "1",
        "infosQualite": {
          "codeQualite": "Membre",
          "libQualite": "Membre",
          "libQualiteSex": "Membre"
        },
        "organes": {
          "organeRef": "PO747266"
        }
      },
      {
        "@xsi:type": "MandatSimple_Type",
        "uid": "PM746780",
        "acteurRef": "PA719060",
        "legislature": "15",
        "typeOrgane": "DELEG",
        "dateDebut": "2017-12-20T01:00:00.000+01:00",
        "datePublication": "2017-12-21T01:00:00.000+01:00",
        "dateFin": null,
        "preseance": "8",
        "nominPrincipale": "1",
        "infosQualite": {
          "codeQualite": "Vice-Président",
          "libQualite": "Vice-Président",
          "libQualiteSex": "Vice-Président"
        },
        "organes": {
          "organeRef": "PO744127"
        }
      },
      {
        "@xsi:type": "MandatSimple_Type",
        "uid": "PM750280",
        "acteurRef": "PA719060",
        "legislature": "15",
        "typeOrgane": "GA",
        "dateDebut": "2018-02-14T01:00:00.000+01:00",
        "datePublication": null,
        "dateFin": null,
        "preseance": "8",
        "nominPrincipale": "1",
        "infosQualite": {
          "codeQualite": "Vice-Président",
          "libQualite": "Vice-Président",
          "libQualiteSex": "Vice-Président"
        },
        "organes": {
          "organeRef": "PO732944"
        }
      },
      {
        "@xsi:type": "MandatSimple_Type",
        "uid": "PM750781",
        "acteurRef": "PA719060",
        "legislature": "15",
        "typeOrgane": "GE",
        "dateDebut": "2018-02-16T01:00:00.000+01:00",
        "datePublication": null,
        "dateFin": null,
        "preseance": "20",
        "nominPrincipale": "1",
        "infosQualite": {
          "codeQualite": "Membre",
          "libQualite": "Membre",
          "libQualiteSex": "Membre"
        },
        "organes": {
          "organeRef": "PO746982"
        }
      },
      {
        "@xsi:type": "MandatMission_Type",
        "uid": "PM757623",
        "acteurRef": "PA719060",
        "legislature": "15",
        "typeOrgane": "MISINFOPRE",
        "dateDebut": "2018-07-05T02:00:00.000+02:00",
        "datePublication": "2018-07-06T02:00:00.000+02:00",
        "dateFin": "2019-08-05T02:00:00.000+02:00",
        "preseance": "20",
        "nominPrincipale": "1",
        "infosQualite": {
          "codeQualite": "Membre",
          "libQualite": "Membre",
          "libQualiteSex": "Membre"
        },
        "organes": {
          "organeRef": "PO757231"
        },
        "libelle": null,
        "missionSuivanteRef": null,
        "missionPrecedenteRef": null
      },
      {
        "@xsi:type": "MandatAvecSuppleant_Type",
        "uid": "PM732629",
        "acteurRef": "PA719060",
        "legislature": "15",
        "typeOrgane": "COMNL",
        "dateDebut": "2017-07-12T02:00:00.000+02:00",
        "datePublication": "2017-07-12T02:00:00.000+02:00",
        "dateFin": "2019-03-29T01:00:00.000+01:00",
        "preseance": "20",
        "nominPrincipale": "1",
        "infosQualite": {
          "codeQualite": "Membre",
          "libQualite": "Membre",
          "libQualiteSex": "Membre"
        },
        "organes": {
          "organeRef": "PO271860"
        },
        "suppleants": null
      },
      {
        "@xsi:type": "MandatSimple_Type",
        "uid": "PM731007",
        "acteurRef": "PA719060",
        "legislature": "15",
        "typeOrgane": "GP",
        "dateDebut": "2017-06-27T02:00:00.000+02:00",
        "datePublication": "2017-06-28T02:00:00.000+02:00",
        "dateFin": null,
        "preseance": "20",
        "nominPrincipale": "1",
        "infosQualite": {
          "codeQualite": "Membre",
          "libQualite": "Membre du",
          "libQualiteSex": "Membre du"
        },
        "organes": {
          "organeRef": "PO730964"
        }
      },
      {
        "@xsi:type": "MandatSimple_Type",
        "uid": "PM750862",
        "acteurRef": "PA719060",
        "legislature": "15",
        "typeOrgane": "GE",
        "dateDebut": "2018-02-20T01:00:00.000+01:00",
        "datePublication": null,
        "dateFin": null,
        "preseance": "20",
        "nominPrincipale": "1",
        "infosQualite": {
          "codeQualite": "Membre",
          "libQualite": "Membre",
          "libQualiteSex": "Membre"
        },
        "organes": {
          "organeRef": "PO747099"
        }
      },
      {
        "@xsi:type": "MandatSimple_Type",
        "uid": "PM724314",
        "acteurRef": "PA719060",
        "legislature": "15",
        "typeOrgane": "GP",
        "dateDebut": "2017-06-21T02:00:00.000+02:00",
        "datePublication": null,
        "dateFin": "2017-06-26T02:00:00.000+02:00",
        "preseance": "28",
        "nominPrincipale": "1",
        "infosQualite": {
          "codeQualite": "Député non-inscrit",
          "libQualite": "Député non-inscrit",
          "libQualiteSex": "Député non-inscrit"
        },
        "organes": {
          "organeRef": "PO723569"
        }
      },
      {
        "@xsi:type": "MandatSimple_Type",
        "uid": "PM752113",
        "acteurRef": "PA719060",
        "legislature": "15",
        "typeOrgane": "GE",
        "dateDebut": "2018-02-27T01:00:00.000+01:00",
        "datePublication": null,
        "dateFin": null,
        "preseance": "20",
        "nominPrincipale": "1",
        "infosQualite": {
          "codeQualite": "Membre",
          "libQualite": "Membre",
          "libQualiteSex": "Membre"
        },
        "organes": {
          "organeRef": "PO747251"
        }
      },
      {
        "@xsi:type": "MandatSimple_Type",
        "uid": "PM731911",
        "acteurRef": "PA719060",
        "legislature": "15",
        "typeOrgane": "COMPER",
        "dateDebut": "2017-06-29T02:00:00.000+02:00",
        "datePublication": "2017-06-29T02:00:00.000+02:00",
        "dateFin": null,
        "preseance": "32",
        "nominPrincipale": "1",
        "infosQualite": {
          "codeQualite": "Membre",
          "libQualite": "Membre",
          "libQualiteSex": "Membre"
        },
        "organes": {
          "organeRef": "PO59048"
        }
      },
      {
        "@xsi:type": "MandatSimple_Type",
        "uid": "PM751172",
        "acteurRef": "PA719060",
        "legislature": "15",
        "typeOrgane": "GE",
        "dateDebut": "2018-02-19T01:00:00.000+01:00",
        "datePublication": null,
        "dateFin": null,
        "preseance": "20",
        "nominPrincipale": "1",
        "infosQualite": {
          "codeQualite": "Membre",
          "libQualite": "Membre",
          "libQualiteSex": "Membre"
        },
        "organes": {
          "organeRef": "PO747276"
        }
      },
      {
        "@xsi:type": "MandatSimple_Type",
        "uid": "PM760874",
        "acteurRef": "PA719060",
        "legislature": "15",
        "typeOrgane": "CMP",
        "dateDebut": "2018-12-06T01:00:00.000+01:00",
        "datePublication": "2018-12-08T01:00:00.000+01:00",
        "dateFin": "2018-12-20T01:00:00.000+01:00",
        "preseance": "20",
        "nominPrincipale": "1",
        "infosQualite": {
          "codeQualite": "Titulaire",
          "libQualite": "Membre titulaire",
          "libQualiteSex": "Membre titulaire"
        },
        "organes": {
          "organeRef": "PO760826"
        }
      },
      {
        "@xsi:type": "MandatSimple_Type",
        "uid": "PM743743",
        "acteurRef": "PA719060",
        "legislature": "15",
        "typeOrgane": "ORGEXTPARL",
        "dateDebut": "2017-11-17T01:00:00.000+01:00",
        "datePublication": "2017-11-18T01:00:00.000+01:00",
        "dateFin": null,
        "preseance": "20",
        "nominPrincipale": "1",
        "infosQualite": {
          "codeQualite": "Titulaire",
          "libQualite": "Membre titulaire",
          "libQualiteSex": "Membre titulaire"
        },
        "organes": {
          "organeRef": "PO717311"
        }
      }
    ]
  },
  "@xmlns:xsi": "http://www.w3.org/2001/XMLSchema-instance"
}