{
  "@xmlns:xsi": "http://www.w3.org/2001/XMLSchema-instance",
  "uid": "PO747135",
  "codeType": "GE",
  "libelle": "Presse",
  "libelleEdition": null,
  "libelleAbrege": "PRESSE",
  "libelleAbrev": "PRESSE",
  "viMoDe": {
    "dateDebut": null,
    "dateAgrement": "2017-12-20T01:00:00.000+01:00",
    "dateFin": null
  },
  "organeParent": null,
  "chambre": null,
  "regime": "5ème République",
  "legislature": "15",
  "secretariat": {
    "secretaire01": "M. Serge Ezdra",
    "secretaire02": null
  }
}