{
  "@xmlns:xsi": "http://www.w3.org/2001/XMLSchema-instance",
  "uid": "PO428784",
  "codeType": "CMP",
  "libelle": "Commission mixte paritaire chargée de proposer un texte sur les dispositions restant en discussion du projet de loi relatif à la bioéthique",
  "libelleEdition": "du projet de loi relatif à la bioéthique",
  "libelleAbrege": "bioéthique",
  "libelleAbrev": "2911",
  "viMoDe": {
    "dateDebut": "2011-06-10T02:00:00.000+02:00",
    "dateAgrement": null,
    "dateFin": "2011-07-25T02:00:00.000+02:00"
  },
  "organeParent": null,
  "chambre": null,
  "regime": "5ème République",
  "legislature": "13",
  "secretariat": {
    "secretaire01": null,
    "secretaire02": null
  }
}