{
  "@xmlns:xsi": "http://www.w3.org/2001/XMLSchema-instance",
  "uid": "PO702586",
  "codeType": "CMP",
  "libelle": "Commission mixte paritaire chargée de proposer un texte sur les dispositions restant en discussion du projet de loi de financement rectificative de la sécurité sociale pour 2014",
  "libelleEdition": "du projet de loi de financement rectificative de la sécurité sociale pour 2014",
  "libelleAbrege": "PLFRSS 2014",
  "libelleAbrev": "2044",
  "viMoDe": {
    "dateDebut": "2014-07-17T02:00:00.000+02:00",
    "dateAgrement": null,
    "dateFin": "2014-07-23T02:00:00.000+02:00"
  },
  "organeParent": null,
  "chambre": null,
  "regime": "5ème République",
  "legislature": "14",
  "secretariat": {
    "secretaire01": null,
    "secretaire02": null
  }
}