{
  "@xmlns:xsi": "http://www.w3.org/2001/XMLSchema-instance",
  "uid": "PO393388",
  "codeType": "GA",
  "libelle": "France-République de Slovénie",
  "libelleEdition": "de France-République de Slovénie",
  "libelleAbrege": "Slovénie",
  "libelleAbrev": "VEN",
  "viMoDe": {
    "dateDebut": null,
    "dateAgrement": "2007-07-18T02:00:00.000+02:00",
    "dateFin": "2012-06-19T02:00:00.000+02:00"
  },
  "organeParent": null,
  "chambre": null,
  "regime": "5ème République",
  "legislature": "13",
  "secretariat": {
    "secretaire01": null,
    "secretaire02": null
  },
  "listePays": null
}