{
  "@xmlns:xsi": "http://www.w3.org/2001/XMLSchema-instance",
  "uid": "PO428704",
  "codeType": "CMP",
  "libelle": "Commission mixte paritaire chargée de proposer un texte sur les dispositions restant en discussion de la proposition de loi de libéralisation des ventes volontaires de meubles aux enchères publiques",
  "libelleEdition": "de la proposition de loi de libéralisation des ventes volontaires de meubles aux enchères publiques",
  "libelleAbrege": "Ventes aux enchères publiques",
  "libelleAbrev": "210-07-08",
  "viMoDe": {
    "dateDebut": "2011-06-01T02:00:00.000+02:00",
    "dateAgrement": null,
    "dateFin": "2011-07-25T02:00:00.000+02:00"
  },
  "organeParent": null,
  "chambre": null,
  "regime": "5ème République",
  "legislature": "13",
  "secretariat": {
    "secretaire01": null,
    "secretaire02": null
  }
}