{
  "@xmlns:xsi": "http://www.w3.org/2001/XMLSchema-instance",
  "uid": "PO216518",
  "codeType": "CMP",
  "libelle": "Projet de loi relatif au référé devant les juridictions administratives",
  "libelleEdition": "sur le projet de loi relatif au référé devant les juridictions administratives",
  "libelleAbrege": "Référé devant les juridictions administratives",
  "libelleAbrev": "269-98/99",
  "viMoDe": {
    "dateDebut": "2000-04-25T02:00:00.000+02:00",
    "dateAgrement": null,
    "dateFin": "2000-06-07T02:00:00.000+02:00"
  },
  "organeParent": null,
  "chambre": null,
  "regime": "5ème République",
  "legislature": "11",
  "secretariat": {
    "secretaire01": null,
    "secretaire02": null
  }
}