{
  "uid": {
    "@xsi:type": "IdActeur_type",
    "#text": "PA721466"
  },
  "etatCivil": {
    "ident": {
      "civ": "M.",
      "prenom": "Gilles",
      "nom": "Le Gendre",
      "alpha": "LeGendre",
      "trigramme": "GGE"
    },
    "infoNaissance": {
      "dateNais": "1958-05-13T01:00:00.000+01:00",
      "villeNais": "Neuilly-sur-Seine",
      "depNais": "Hauts-de-Seine",
      "paysNais": "France"
    },
    "dateDeces": null
  },
  "profession": {
    "libelleCourant": "Industriel-Chef d'entreprise",
    "socProcINSEE": {
      "catSocPro": "Cadres d'entreprise",
      "famSocPro": "Cadres et professions intellectuelles supérieures"
    }
  },
  "uri_hatvp": "https://www.hatvp.fr/pages_nominatives/le-gendre-gilles",
  "adresses": {
    "adresse": [
      {
        "@xsi:type": "AdressePostale_Type",
        "uid": "AD721468",
        "type": "0",
        "typeLibelle": "Adresse officielle",
        "poids": "1",
        "adresseDeRattachement": null,
        "intitule": "Assemblée nationale,",
        "numeroRue": "126",
        "nomRue": "Rue de l'Université,",
        "complementAdresse": null,
        "codePostal": "75355",
        "ville": "Paris 07 SP"
      },
      {
        "@xsi:type": "AdresseMail_Type",
        "uid": "AD728251",
        "type": "15",
        "typeLibelle": "Mèl",
        "poids": null,
        "adresseDeRattachement": null,
        "valElec": "gilles.le.gendre@assemblee-nationale.fr"
      },
      {
        "@xsi:type": "AdresseSiteWeb_Type",
        "uid": "AD728512",
        "type": "24",
        "typeLibelle": "Twitter",
        "poids": null,
        "adresseDeRattachement": null,
        "valElec": "@GillesLeGendre"
      },
      {
        "@xsi:type": "AdresseMail_Type",
        "uid": "AD728782",
        "type": "15",
        "typeLibelle": "Mèl",
        "poids": null,
        "adresseDeRattachement": null,
        "valElec": "gilles.legendre@en-marche.fr"
      },
      {
        "@xsi:type": "AdresseSiteWeb_Type",
        "uid": "AD728968",
        "type": "22",
        "typeLibelle": "Site internet",
        "poids": null,
        "adresseDeRattachement": null,
        "valElec": "glg2017.fr"
      },
      {
        "@xsi:type": "AdresseSiteWeb_Type",
        "uid": "AD744648",
        "type": "22",
        "typeLibelle": "Site internet",
        "poids": null,
        "adresseDeRattachement": null,
        "valElec": "www.gilleslegendre.fr"
      },
      {
        "@xsi:type": "AdresseTelephonique_Type",
        "uid": "AD757813",
        "type": "11",
        "typeLibelle": "Téléphone",
        "poids": null,
        "adresseDeRattachement": null,
        "valElec": "01.40.63.94.01"
      }
    ]
  },
  "mandats": {
    "mandat": [
      {
        "@xsi:type": "MandatSimple_Type",
        "uid": "PM763081",
        "acteurRef": "PA721466",
        "legislature": "15",
        "typeOrgane": "COMPER",
        "dateDebut": "2019-03-07T01:00:00.000+01:00",
        "datePublication": "2019-03-07T01:00:00.000+01:00",
        "dateFin": null,
        "preseance": "32",
        "nominPrincipale": "1",
        "infosQualite": {
          "codeQualite": "Membre",
          "libQualite": "Membre",
          "libQualiteSex": "Membre"
        },
        "organes": {
          "organeRef": "PO59046"
        }
      },
      {
        "@xsi:type": "MandatSimple_Type",
        "uid": "PM736156",
        "acteurRef": "PA721466",
        "legislature": "15",
        "typeOrgane": "GA",
        "dateDebut": "2017-10-02T02:00:00.000+02:00",
        "datePublication": null,
        "dateFin": null,
        "preseance": "20",
        "nominPrincipale": "1",
        "infosQualite": {
          "codeQualite": "Membre",
          "libQualite": "Membre",
          "libQualiteSex": "Membre"
        },
        "organes": {
          "organeRef": "PO733352"
        }
      },
      {
        "@xsi:type": "MandatSimple_Type",
        "uid": "PM765169",
        "acteurRef": "PA721466",
        "legislature": "15",
        "typeOrgane": "GE",
        "dateDebut": "2019-05-20T02:00:00.000+02:00",
        "datePublication": null,
        "dateFin": null,
        "preseance": "20",
        "nominPrincipale": "1",
        "infosQualite": {
          "codeQualite": "Membre",
          "libQualite": "Membre",
          "libQualiteSex": "Membre"
        },
        "organes": {
          "organeRef": "PO763244"
        }
      },
      {
        "@xsi:type": "MandatMission_Type",
        "uid": "PM756904",
        "acteurRef": "PA721466",
        "legislature": "15",
        "typeOrgane": "MINISTERE",
        "dateDebut": "2018-06-11T02:00:00.000+02:00",
        "datePublication": "2018-06-12T02:00:00.000+02:00",
        "dateFin": "2018-10-04T02:00:00.000+02:00",
        "preseance": "1",
        "nominPrincipale": "1",
        "infosQualite": {
          "codeQualite": "en mission",
          "libQualite": "en mission",
          "libQualiteSex": "en mission"
        },
        "organes": {
          "organeRef": [
            "PO729982",
            "PO729989",
            "PO744098"
          ]
        },
        "libelle": "Préservation et développement en France des métiers d'art et du patrimoine vivant",
        "missionSuivanteRef": null,
        "missionPrecedenteRef": null
      },
      {
        "@xsi:type": "MandatSimple_Type",
        "uid": "PM760803",
        "acteurRef": "PA721466",
        "legislature": "15",
        "typeOrgane": "COMPER",
        "dateDebut": "2018-12-04T01:00:00.000+01:00",
        "datePublication": "2018-12-04T01:00:00.000+01:00",
        "dateFin": "2019-03-06T01:00:00.000+01:00",
        "preseance": "32",
        "nominPrincipale": "1",
        "infosQualite": {
          "codeQualite": "Membre",
          "libQualite": "Membre",
          "libQualiteSex": "Membre"
        },
        "organes": {
          "organeRef": "PO59051"
        }
      },
      {
        "@xsi:type": "MandatSimple_Type",
        "uid": "PM758987",
        "acteurRef": "PA721466",
        "legislature": "15",
        "typeOrgane": "GP",
        "dateDebut": "2018-09-18T02:00:00.000+02:00",
        "datePublication": "2018-09-19T02:00:00.000+02:00",
        "dateFin": null,
        "preseance": "1",
        "nominPrincipale": "1",
        "infosQualite": {
          "codeQualite": "Président",
          "libQualite": "Président du",
          "libQualiteSex": "Président du"
        },
        "organes": {
          "organeRef": "PO730964"
        }
      },
      {
        "@xsi:type": "MandatSimple_Type",
        "uid": "PM736157",
        "acteurRef": "PA721466",
        "legislature": "15",
        "typeOrgane": "GA",
        "dateDebut": "2017-10-02T02:00:00.000+02:00",
        "datePublication": null,
        "dateFin": null,
        "preseance": "20",
        "nominPrincipale": "1",
        "infosQualite": {
          "codeQualite": "Membre",
          "libQualite": "Membre",
          "libQualiteSex": "Membre"
        },
        "organes": {
          "organeRef": "PO733617"
        }
      },
      {
        "@xsi:type": "MandatSimple_Type",
        "uid": "PM750769",
        "acteurRef": "PA721466",
        "legislature": "15",
        "typeOrgane": "GE",
        "dateDebut": "2018-02-16T01:00:00.000+01:00",
        "datePublication": null,
        "dateFin": null,
        "preseance": "20",
        "nominPrincipale": "1",
        "infosQualite": {
          "codeQualite": "Membre",
          "libQualite": "Membre",
          "libQualiteSex": "Membre"
        },
        "organes": {
          "organeRef": "PO747170"
        }
      },
      {
        "@xsi:type": "MandatSimple_Type",
        "uid": "PM745215",
        "acteurRef": "PA721466",
        "legislature": null,
        "typeOrgane": "PARPOL",
        "dateDebut": "2017-12-01T01:00:00.000+01:00",
        "datePublication": null,
        "dateFin": "2018-11-30T01:00:00.000+01:00",
        "preseance": "5",
        "nominPrincipale": "1",
        "infosQualite": {
          "codeQualite": "Membre",
          "libQualite": "Membre",
          "libQualiteSex": "Membre"
        },
        "organes": {
          "organeRef": "PO744854"
        }
      },
      {
        "@xsi:type": "MandatSimple_Type",
        "uid": "PM731207",
        "acteurRef": "PA721466",
        "legislature": "15",
        "typeOrgane": "GP",
        "dateDebut": "2017-06-27T02:00:00.000+02:00",
        "datePublication": "2017-06-28T02:00:00.000+02:00",
        "dateFin": null,
        "preseance": "20",
        "nominPrincipale": "0",
        "infosQualite": {
          "codeQualite": "Membre",
          "libQualite": "Membre du",
          "libQualiteSex": "Membre du"
        },
        "organes": {
          "organeRef": "PO730964"
        }
      },
      {
        "@xsi:type": "MandatSimple_Type",
        "uid": "PM732841",
        "acteurRef": "PA721466",
        "legislature": "15",
        "typeOrgane": "ORGEXTPARL",
        "dateDebut": "2017-07-17T02:00:00.000+02:00",
        "datePublication": "2017-07-18T02:00:00.000+02:00",
        "dateFin": "2018-01-23T01:00:00.000+01:00",
        "preseance": "20",
        "nominPrincipale": "1",
        "infosQualite": {
          "codeQualite": "Titulaire",
          "libQualite": "Membre titulaire",
          "libQualiteSex": "Membre titulaire"
        },
        "organes": {
          "organeRef": "PO60160"
        }
      },
      {
        "@xsi:type": "MandatParlementaire_type",
        "uid": "PM723284",
        "acteurRef": "PA721466",
        "legislature": "15",
        "typeOrgane": "ASSEMBLEE",
        "dateDebut": "2017-06-18T02:00:00.000+02:00",
        "datePublication": null,
        "dateFin": null,
        "preseance": "50",
        "nominPrincipale": "1",
        "infosQualite": {
          "codeQualite": "membre",
          "libQualite": "membre",
          "libQualiteSex": "membre"
        },
        "organes": {
          "organeRef": "PO717460"
        },
        "suppleants": {
          "suppleant": {
            "dateDebut": "2017-06-18T02:00:00.000+02:00",
            "dateFin": null,
            "suppleantRef": "PA721470"
          }
        },
        "chambre": null,
        "election": {
          "lieu": {
            "region": "Ile-de-France",
            "regionType": "Métropolitain",
            "departement": "Paris",
            "numDepartement": "75",
            "numCirco": "2"
          },
          "causeMandat": "élections générales",
          "refCirconscription": "PO718224"
        },
        "mandature": {
          "datePriseFonction": "2017-06-21T02:00:00.000+02:00",
          "causeFin": null,
          "premiereElection": "0",
          "placeHemicycle": "422",
          "mandatRemplaceRef": null
        },
        "collaborateurs": {
          "collaborateur": [
            {
              "qualite": "M.",
              "prenom": "Théo",
              "nom": "Dardonville",
              "dateDebut": null,
              "dateFin": null
            },
            {
              "qualite": "Mme",
              "prenom": "Charline",
              "nom": "Moireau",
              "dateDebut": null,
              "dateFin": null
            },
            {
              "qualite": "M.",
              "prenom": "Simon",
              "nom": "Albert",
              "dateDebut": null,
              "dateFin": null
            }
          ]
        }
      },
      {
        "@xsi:type": "MandatSimple_Type",
        "uid": "PM731950",
        "acteurRef": "PA721466",
        "legislature": "15",
        "typeOrgane": "COMPER",
        "dateDebut": "2017-06-29T02:00:00.000+02:00",
        "datePublication": "2017-06-29T02:00:00.000+02:00",
        "dateFin": "2018-09-29T02:00:00.000+02:00",
        "preseance": "32",
        "nominPrincipale": "1",
        "infosQualite": {
          "codeQualite": "Membre",
          "libQualite": "Membre",
          "libQualiteSex": "Membre"
        },
        "organes": {
          "organeRef": "PO59048"
        }
      },
      {
        "@xsi:type": "MandatSimple_Type",
        "uid": "PM724683",
        "acteurRef": "PA721466",
        "legislature": "15",
        "typeOrgane": "GP",
        "dateDebut": "2017-06-21T02:00:00.000+02:00",
        "datePublication": null,
        "dateFin": "2017-06-26T02:00:00.000+02:00",
        "preseance": "28",
        "nominPrincipale": "1",
        "infosQualite": {
          "codeQualite": "Député non-inscrit",
          "libQualite": "Député non-inscrit",
          "libQualiteSex": "Député non-inscrit"
        },
        "organes": {
          "organeRef": "PO723569"
        }
      },
      {
        "@xsi:type": "MandatSimple_Type",
        "uid": "PM750301",
        "acteurRef": "PA721466",
        "legislature": "15",
        "typeOrgane": "GE",
        "dateDebut": "2018-02-14T01:00:00.000+01:00",
        "datePublication": null,
        "dateFin": null,
        "preseance": "20",
        "nominPrincipale": "1",
        "infosQualite": {
          "codeQualite": "Membre",
          "libQualite": "Membre",
          "libQualiteSex": "Membre"
        },
        "organes": {
          "organeRef": "PO747155"
        }
      },
      {
        "@xsi:type": "MandatSimple_Type",
        "uid": "PM759147",
        "acteurRef": "PA721466",
        "legislature": "15",
        "typeOrgane": "COMPER",
        "dateDebut": "2018-09-30T02:00:00.000+02:00",
        "datePublication": "2018-09-30T02:00:00.000+02:00",
        "dateFin": "2018-12-03T01:00:00.000+01:00",
        "preseance": "32",
        "nominPrincipale": "1",
        "infosQualite": {
          "codeQualite": "Membre",
          "libQualite": "Membre",
          "libQualiteSex": "Membre"
        },
        "organes": {
          "organeRef": "PO59046"
        }
      },
      {
        "@xsi:type": "MandatParlementaire_type",
        "uid": "PM758988",
        "acteurRef": "PA721466",
        "legislature": "15",
        "typeOrgane": "CONFPT",
        "dateDebut": "2018-09-18T02:00:00.000+02:00",
        "datePublication": "2018-09-19T02:00:00.000+02:00",
        "dateFin": null,
        "preseance": "20",
        "nominPrincipale": "1",
        "infosQualite": {
          "codeQualite": "Membre",
          "libQualite": "Membre",
          "libQualiteSex": "Membre"
        },
        "organes": {
          "organeRef": "PO725343"
        },
        "suppleants": null,
        "chambre": null,
        "election": {
          "lieu": {
            "region": null,
            "regionType": null,
            "departement": null,
            "numDepartement": null,
            "numCirco": null
          },
          "causeMandat": null
        },
        "mandature": {
          "datePriseFonction": null,
          "causeFin": null,
          "premiereElection": "0",
          "placeHemicycle": null,
          "mandatRemplaceRef": null
        },
        "collaborateurs": null
      }
    ]
  },
  "@xmlns:xsi": "http://www.w3.org/2001/XMLSchema-instance"
}