{
  "@xmlns:xsi": "http://www.w3.org/2001/XMLSchema-instance",
  "uid": "PO59479",
  "codeType": "GA",
  "libelle": "France République de Panama",
  "libelleEdition": "de France République de Panama",
  "libelleAbrege": "Panama",
  "libelleAbrev": "PAN",
  "viMoDe": {
    "dateDebut": null,
    "dateAgrement": "1997-06-12T02:00:00.000+02:00",
    "dateFin": "2002-06-18T02:00:00.000+02:00"
  },
  "organeParent": null,
  "chambre": null,
  "regime": "5ème République",
  "legislature": "11",
  "secretariat": {
    "secretaire01": null,
    "secretaire02": null
  },
  "listePays": null
}