{
  "@xmlns:xsi": "http://www.w3.org/2001/XMLSchema-instance",
  "uid": "PO733698",
  "codeType": "GA",
  "libelle": "France-Burundi Rwanda",
  "libelleEdition": null,
  "libelleAbrege": "Burundi Rwanda",
  "libelleAbrev": "BURW",
  "viMoDe": {
    "dateDebut": null,
    "dateAgrement": "2017-07-19T02:00:00.000+02:00",
    "dateFin": null
  },
  "organeParent": null,
  "chambre": null,
  "regime": "5ème République",
  "legislature": "15",
  "secretariat": {
    "secretaire01": "M. Charles Boriaud",
    "secretaire02": null
  },
  "listePays": null
}