{
  "@xmlns:xsi": "http://www.w3.org/2001/XMLSchema-instance",
  "uid": "PO217775",
  "codeType": "CMP",
  "libelle": "Projet de loi de finances pour 2000",
  "libelleEdition": "sur le projet de loi de finances pour 2000",
  "libelleAbrege": "Projet de loi de finances pour 2000",
  "libelleAbrev": "1805",
  "viMoDe": {
    "dateDebut": "1999-12-14T01:00:00.000+01:00",
    "dateAgrement": null,
    "dateFin": "1999-12-15T01:00:00.000+01:00"
  },
  "organeParent": null,
  "chambre": null,
  "regime": "5ème République",
  "legislature": "11",
  "secretariat": {
    "secretaire01": null,
    "secretaire02": null
  }
}