{
  "@xmlns:xsi": "http://www.w3.org/2001/XMLSchema-instance",
  "uid": "PO678097",
  "codeType": "ORGEXTPARL",
  "libelle": "conseil d'administration de l'Agence nationale de sécurité du médicament et des produits de santé",
  "libelleEdition": "du conseil d'administration de l'Agence nationale de sécurité du médicament et des produits de santé",
  "libelleAbrege": "Sécurité du médicament",
  "libelleAbrev": "299",
  "viMoDe": {
    "dateDebut": "2012-04-27T02:00:00.000+02:00",
    "dateAgrement": null,
    "dateFin": null
  },
  "organeParent": null,
  "chambre": null,
  "regime": "5ème République",
  "legislature": null,
  "regimeJuridique": "Article L. 5322-1 du code de la santé publique",
  "siteInternet": "http://ansm.sante.fr/L-ANSM/Gouvernance/Conseil-d-administration/(offset)/1",
  "nombreReunionsAnnuelles": null
}