{
  "@xmlns:xsi": "http://www.w3.org/2001/XMLSchema-instance",
  "uid": "PO747129",
  "codeType": "GE",
  "libelle": "Pratiques innovantes pour l'emploi",
  "libelleEdition": "PRATIQUES INNOVANTES POUR L'EMPLOI",
  "libelleAbrege": "PRATIQUES INNOVANTES POUR L'EMPLOI",
  "libelleAbrev": "PRATIINOVA",
  "viMoDe": {
    "dateDebut": null,
    "dateAgrement": "2017-12-20T01:00:00.000+01:00",
    "dateFin": null
  },
  "organeParent": null,
  "chambre": null,
  "regime": "5ème République",
  "legislature": "15",
  "secretariat": {
    "secretaire01": "M. Lionel Menjou",
    "secretaire02": null
  }
}