{
  "@xmlns:xsi": "http://www.w3.org/2001/XMLSchema-instance",
  "uid": "PO59770",
  "codeType": "GE",
  "libelle": "Groupe d'études sur le cheval",
  "libelleEdition": "du groupe d'études sur le cheval",
  "libelleAbrege": "Cheval",
  "libelleAbrev": "CHE",
  "viMoDe": {
    "dateDebut": null,
    "dateAgrement": "1988-10-11T01:00:00.000+01:00",
    "dateFin": "1993-04-01T02:00:00.000+02:00"
  },
  "organeParent": null,
  "chambre": null,
  "regime": "5ème République",
  "legislature": "9",
  "secretariat": {
    "secretaire01": null,
    "secretaire02": null
  }
}