{
  "@xmlns:xsi": "http://www.w3.org/2001/XMLSchema-instance",
  "uid": "PO665154",
  "codeType": "DELEGBUREAU",
  "libelle": "Délégation chargée de l'application du statut du député",
  "libelleEdition": "de la délégation chargée de l'application du statut du député",
  "libelleAbrege": "Statut du député",
  "libelleAbrev": "STA",
  "viMoDe": {
    "dateDebut": "2012-06-20T02:00:00.000+02:00",
    "dateAgrement": null,
    "dateFin": "2017-06-20T02:00:00.000+02:00"
  },
  "organeParent": null,
  "chambre": null,
  "regime": "5ème République",
  "legislature": "14",
  "secretariat": {
    "secretaire01": null,
    "secretaire02": null
  }
}