{
  "uid": "PA720576",
  "etatCivil": {
    "ident": {
      "civ": "M.",
      "prenom": "Pascal",
      "nom": "Bois",
      "alpha": "Bois",
      "trigramme": "PBO"
    },
    "infoNaissance": {
      "dateNais": "1959-12-03T01:00:00.000+01:00",
      "villeNais": "Paris",
      "depNais": "Paris",
      "paysNais": "France"
    }
  },
  "profession": {
    "libelleCourant": "Autre cadre (secteur privé)",
    "socProcInsee": {
      "catSocPro": "Cadres d'entreprise",
      "famSocPro": "Cadres et professions intellectuelles supérieures"
    }
  },
  "uriHatvp": "https://www.hatvp.fr/pages_nominatives/bois-pascal",
  "adresses": [
    {
      "xsiType": "AdressePostale_Type",
      "uid": "AD720578",
      "type": "0",
      "typeLibelle": "Adresse officielle",
      "poids": "1",
      "intitule": "Assemblée nationale,",
      "numeroRue": "126",
      "nomRue": "Rue de l'Université,",
      "codePostal": "75355",
      "ville": "Paris 07 SP"
    },
    {
      "xsiType": "AdresseMail_Type",
      "uid": "AD728161",
      "type": "15",
      "typeLibelle": "Mèl",
      "valElec": "pascal.bois@assemblee-nationale.fr"
    },
    {
      "xsiType": "AdresseSiteWeb_Type",
      "uid": "AD728592",
      "type": "25",
      "typeLibelle": "Facebook",
      "valElec": "pascal.bois"
    },
    {
      "xsiType": "AdresseSiteWeb_Type",
      "uid": "AD728832",
      "type": "24",
      "typeLibelle": "Twitter",
      "valElec": "@PascalBoisLaREM"
    },
    {
      "xsiType": "AdressePostale_Type",
      "uid": "AD748350",
      "type": "2",
      "typeLibelle": "Adresse publiée de circonscription",
      "poids": "2",
      "intitule": "Permanence parlementaire",
      "numeroRue": "75",
      "nomRue": "Rue des Maryrs de la Résistance",
      "complementAdresse": "Résidence Les Conti",
      "codePostal": "60110",
      "ville": "Meru"
    },
    {
      "xsiType": "AdresseTelephonique_Type",
      "uid": "AD748352",
      "type": "11",
      "typeLibelle": "Téléphone",
      "poids": "2",
      "adresseDeRattachement": "AD748350",
      "valElec": "03 44 12 53 01"
    },
    {
      "xsiType": "AdresseTelephonique_Type",
      "uid": "AD757917",
      "type": "11",
      "typeLibelle": "Téléphone",
      "poids": "1",
      "adresseDeRattachement": "AD720578",
      "valElec": "01.40.63.76.60"
    },
    {
      "xsiType": "AdresseSiteWeb_Type",
      "uid": "AD763320",
      "type": "22",
      "typeLibelle": "Site internet",
      "valElec": "pascalbois.fr"
    }
  ],
  "mandats": [
    {
      "xsiType": "MandatParlementaire_type",
      "uid": "PM723004",
      "acteurRef": "PA720576",
      "legislature": "15",
      "typeOrgane": "ASSEMBLEE",
      "dateDebut": "2017-06-18T02:00:00.000+02:00",
      "preseance": "50",
      "nominPrincipale": "1",
      "infosQualite": {
        "codeQualite": "membre",
        "libQualite": "membre",
        "libQualiteSex": "membre"
      },
      "organesRefs": [
        "PO717460"
      ],
      "suppleant": {
        "dateDebut": "2017-06-18T02:00:00.000+02:00",
        "suppleantRef": "PA720580"
      },
      "election": {
        "lieu": {
          "region": "Hauts-de-France",
          "regionType": "Métropolitain",
          "departement": "Oise",
          "numDepartement": "60",
          "numCirco": "3"
        },
        "causeMandat": "élections générales",
        "refCirconscription": "PO718050"
      },
      "mandature": {
        "datePriseFonction": "2017-06-21T02:00:00.000+02:00",
        "premiereElection": "0",
        "placeHemicycle": "414"
      },
      "collaborateurs": [
        {
          "qualite": "M.",
          "prenom": "Jérôme",
          "nom": "Furet"
        },
        {
          "qualite": "M.",
          "prenom": "Cédric",
          "nom": "Pruvost"
        },
        {
          "qualite": "M.",
          "prenom": "Christian",
          "nom": "Bertelle"
        },
        {
          "qualite": "M.",
          "prenom": "Karim",
          "nom": "Guerda"
        }
      ]
    },
    {
      "xsiType": "MandatSimple_Type",
      "uid": "PM731150",
      "acteurRef": "PA720576",
      "legislature": "15",
      "typeOrgane": "GP",
      "dateDebut": "2017-06-27T02:00:00.000+02:00",
      "datePublication": "2017-06-28T02:00:00.000+02:00",
      "preseance": "20",
      "nominPrincipale": "1",
      "infosQualite": {
        "codeQualite": "Membre",
        "libQualite": "Membre du",
        "libQualiteSex": "Membre du"
      },
      "organesRefs": [
        "PO730964"
      ]
    },
    {
      "xsiType": "MandatSimple_Type",
      "uid": "PM732007",
      "acteurRef": "PA720576",
      "legislature": "15",
      "typeOrgane": "COMPER",
      "dateDebut": "2017-06-29T02:00:00.000+02:00",
      "datePublication": "2017-06-29T02:00:00.000+02:00",
      "preseance": "32",
      "nominPrincipale": "1",
      "infosQualite": {
        "codeQualite": "Membre",
        "libQualite": "Membre",
        "libQualiteSex": "Membre"
      },
      "organesRefs": [
        "PO419604"
      ]
    },
    {
      "xsiType": "MandatSimple_Type",
      "uid": "PM735325",
      "acteurRef": "PA720576",
      "legislature": "15",
      "typeOrgane": "GA",
      "dateDebut": "2017-09-26T02:00:00.000+02:00",
      "preseance": "20",
      "nominPrincipale": "0",
      "infosQualite": {
        "codeQualite": "Membre",
        "libQualite": "Membre",
        "libQualiteSex": "Membre"
      },
      "organesRefs": [
        "PO733467"
      ]
    },
    {
      "xsiType": "MandatSimple_Type",
      "uid": "PM735326",
      "acteurRef": "PA720576",
      "legislature": "15",
      "typeOrgane": "GA",
      "dateDebut": "2017-09-26T02:00:00.000+02:00",
      "preseance": "1",
      "nominPrincipale": "1",
      "infosQualite": {
        "codeQualite": "Président",
        "libQualite": "Président",
        "libQualiteSex": "Président"
      },
      "organesRefs": [
        "PO733467"
      ]
    },
    {
      "xsiType": "MandatSimple_Type",
      "uid": "PM737113",
      "acteurRef": "PA720576",
      "legislature": "15",
      "typeOrgane": "GA",
      "dateDebut": "2017-10-04T02:00:00.000+02:00",
      "preseance": "20",
      "nominPrincipale": "1",
      "infosQualite": {
        "codeQualite": "Membre",
        "libQualite": "Membre",
        "libQualiteSex": "Membre"
      },
      "organesRefs": [
        "PO733072"
      ]
    },
    {
      "xsiType": "MandatSimple_Type",
      "uid": "PM737114",
      "acteurRef": "PA720576",
      "legislature": "15",
      "typeOrgane": "GA",
      "dateDebut": "2017-10-04T02:00:00.000+02:00",
      "preseance": "20",
      "nominPrincipale": "1",
      "infosQualite": {
        "codeQualite": "Membre",
        "libQualite": "Membre",
        "libQualiteSex": "Membre"
      },
      "organesRefs": [
        "PO733382"
      ]
    },
    {
      "xsiType": "MandatSimple_Type",
      "uid": "PM737115",
      "acteurRef": "PA720576",
      "legislature": "15",
      "typeOrgane": "GA",
      "dateDebut": "2017-10-04T02:00:00.000+02:00",
      "preseance": "20",
      "nominPrincipale": "1",
      "infosQualite": {
        "codeQualite": "Membre",
        "libQualite": "Membre",
        "libQualiteSex": "Membre"
      },
      "organesRefs": [
        "PO733562"
      ]
    },
    {
      "xsiType": "MandatSimple_Type",
      "uid": "PM737116",
      "acteurRef": "PA720576",
      "legislature": "15",
      "typeOrgane": "GA",
      "dateDebut": "2017-10-04T02:00:00.000+02:00",
      "preseance": "20",
      "nominPrincipale": "0",
      "infosQualite": {
        "codeQualite": "Membre",
        "libQualite": "Membre",
        "libQualiteSex": "Membre"
      },
      "organesRefs": [
        "PO733617"
      ]
    },
    {
      "xsiType": "MandatSimple_Type",
      "uid": "PM737117",
      "acteurRef": "PA720576",
      "legislature": "15",
      "typeOrgane": "GEVI",
      "dateDebut": "2017-10-04T02:00:00.000+02:00",
      "preseance": "20",
      "nominPrincipale": "0",
      "infosQualite": {
        "codeQualite": "Membre",
        "libQualite": "Membre",
        "libQualiteSex": "Membre"
      },
      "organesRefs": [
        "PO733462"
      ]
    },
    {
      "xsiType": "MandatSimple_Type",
      "uid": "PM740374",
      "acteurRef": "PA720576",
      "legislature": "15",
      "typeOrgane": "ORGEXTPARL",
      "dateDebut": "2017-10-11T02:00:00.000+02:00",
      "datePublication": "2017-10-12T02:00:00.000+02:00",
      "preseance": "20",
      "nominPrincipale": "1",
      "infosQualite": {
        "codeQualite": "Titulaire",
        "libQualite": "Membre titulaire",
        "libQualiteSex": "Membre titulaire"
      },
      "organesRefs": [
        "PO60244"
      ]
    },
    {
      "xsiType": "MandatMission_Type",
      "uid": "PM741949",
      "acteurRef": "PA720576",
      "legislature": "15",
      "typeOrgane": "MISINFO",
      "dateDebut": "2017-09-27T02:00:00.000+02:00",
      "preseance": "10",
      "nominPrincipale": "1",
      "infosQualite": {
        "codeQualite": "Membre",
        "libQualite": "Membre",
        "libQualiteSex": "Membre"
      },
      "organesRefs": [
        "PO741916"
      ]
    },
    {
      "xsiType": "MandatSimple_Type",
      "uid": "PM742115",
      "acteurRef": "PA720576",
      "legislature": "15",
      "typeOrgane": "API",
      "dateDebut": "2017-10-27T02:00:00.000+02:00",
      "datePublication": "2017-10-28T02:00:00.000+02:00",
      "preseance": "20",
      "nominPrincipale": "1",
      "infosQualite": {
        "codeQualite": "Membre",
        "libQualite": "Membre",
        "libQualiteSex": "Membre"
      },
      "organesRefs": [
        "PO201115"
      ]
    },
    {
      "xsiType": "MandatSimple_Type",
      "uid": "PM742260",
      "acteurRef": "PA720576",
      "legislature": "15",
      "typeOrgane": "GA",
      "dateDebut": "2017-10-31T01:00:00.000+01:00",
      "preseance": "8",
      "nominPrincipale": "1",
      "infosQualite": {
        "codeQualite": "Vice-Président",
        "libQualite": "Vice-Président",
        "libQualiteSex": "Vice-Président"
      },
      "organesRefs": [
        "PO733617"
      ]
    },
    {
      "xsiType": "MandatSimple_Type",
      "uid": "PM743482",
      "acteurRef": "PA720576",
      "legislature": "15",
      "typeOrgane": "GA",
      "dateDebut": "2017-11-16T01:00:00.000+01:00",
      "preseance": "20",
      "nominPrincipale": "0",
      "infosQualite": {
        "codeQualite": "Membre",
        "libQualite": "Membre",
        "libQualiteSex": "Membre"
      },
      "organesRefs": [
        "PO733657"
      ]
    },
    {
      "xsiType": "MandatSimple_Type",
      "uid": "PM743725",
      "acteurRef": "PA720576",
      "legislature": "15",
      "typeOrgane": "ORGEXTPARL",
      "dateDebut": "2017-11-21T01:00:00.000+01:00",
      "datePublication": "2017-11-22T01:00:00.000+01:00",
      "preseance": "20",
      "nominPrincipale": "1",
      "infosQualite": {
        "codeQualite": "Titulaire",
        "libQualite": "Membre titulaire",
        "libQualiteSex": "Membre titulaire"
      },
      "organesRefs": [
        "PO418452"
      ]
    },
    {
      "xsiType": "MandatSimple_Type",
      "uid": "PM743973",
      "acteurRef": "PA720576",
      "legislature": "15",
      "typeOrgane": "GA",
      "dateDebut": "2017-11-21T01:00:00.000+01:00",
      "preseance": "8",
      "nominPrincipale": "1",
      "infosQualite": {
        "codeQualite": "Vice-Président",
        "libQualite": "Vice-Président",
        "libQualiteSex": "Vice-Président"
      },
      "organesRefs": [
        "PO733657"
      ]
    },
    {
      "xsiType": "MandatSimple_Type",
      "uid": "PM746257",
      "acteurRef": "PA720576",
      "legislature": "15",
      "typeOrgane": "GA",
      "dateDebut": "2017-12-08T01:00:00.000+01:00",
      "preseance": "20",
      "nominPrincipale": "0",
      "infosQualite": {
        "codeQualite": "Membre",
        "libQualite": "Membre",
        "libQualiteSex": "Membre"
      },
      "organesRefs": [
        "PO733052"
      ]
    },
    {
      "xsiType": "MandatSimple_Type",
      "uid": "PM746563",
      "acteurRef": "PA720576",
      "legislature": "15",
      "typeOrgane": "GA",
      "dateDebut": "2017-12-12T01:00:00.000+01:00",
      "preseance": "8",
      "nominPrincipale": "1",
      "infosQualite": {
        "codeQualite": "Vice-Président",
        "libQualite": "Vice-Président",
        "libQualiteSex": "Vice-Président"
      },
      "organesRefs": [
        "PO733052"
      ]
    },
    {
      "xsiType": "MandatSimple_Type",
      "uid": "PM747665",
      "acteurRef": "PA720576",
      "legislature": "15",
      "typeOrgane": "GEVI",
      "dateDebut": "2017-11-29T01:00:00.000+01:00",
      "preseance": "8",
      "nominPrincipale": "1",
      "infosQualite": {
        "codeQualite": "Vice-Président",
        "libQualite": "Vice-Président",
        "libQualiteSex": "Vice-Président"
      },
      "organesRefs": [
        "PO733462"
      ]
    },
    {
      "xsiType": "MandatSimple_Type",
      "uid": "PM750232",
      "acteurRef": "PA720576",
      "legislature": "15",
      "typeOrgane": "GE",
      "dateDebut": "2018-02-14T01:00:00.000+01:00",
      "preseance": "20",
      "nominPrincipale": "1",
      "infosQualite": {
        "codeQualite": "Membre",
        "libQualite": "Membre",
        "libQualiteSex": "Membre"
      },
      "organesRefs": [
        "PO746821"
      ]
    },
    {
      "xsiType": "MandatSimple_Type",
      "uid": "PM750342",
      "acteurRef": "PA720576",
      "legislature": "15",
      "typeOrgane": "GE",
      "dateDebut": "2018-02-14T01:00:00.000+01:00",
      "preseance": "20",
      "nominPrincipale": "0",
      "infosQualite": {
        "codeQualite": "Membre",
        "libQualite": "Membre",
        "libQualiteSex": "Membre"
      },
      "organesRefs": [
        "PO746796"
      ]
    },
    {
      "xsiType": "MandatSimple_Type",
      "uid": "PM750343",
      "acteurRef": "PA720576",
      "legislature": "15",
      "typeOrgane": "GE",
      "dateDebut": "2018-02-14T01:00:00.000+01:00",
      "preseance": "20",
      "nominPrincipale": "1",
      "infosQualite": {
        "codeQualite": "Membre",
        "libQualite": "Membre",
        "libQualiteSex": "Membre"
      },
      "organesRefs": [
        "PO747215"
      ]
    },
    {
      "xsiType": "MandatSimple_Type",
      "uid": "PM750417",
      "acteurRef": "PA720576",
      "legislature": "15",
      "typeOrgane": "GE",
      "dateDebut": "2018-02-14T01:00:00.000+01:00",
      "preseance": "20",
      "nominPrincipale": "1",
      "infosQualite": {
        "codeQualite": "Membre",
        "libQualite": "Membre",
        "libQualiteSex": "Membre"
      },
      "organesRefs": [
        "PO746925"
      ]
    },
    {
      "xsiType": "MandatSimple_Type",
      "uid": "PM750502",
      "acteurRef": "PA720576",
      "legislature": "15",
      "typeOrgane": "GE",
      "dateDebut": "2018-02-15T01:00:00.000+01:00",
      "preseance": "20",
      "nominPrincipale": "1",
      "infosQualite": {
        "codeQualite": "Membre",
        "libQualite": "Membre",
        "libQualiteSex": "Membre"
      },
      "organesRefs": [
        "PO747047"
      ]
    },
    {
      "xsiType": "MandatSimple_Type",
      "uid": "PM750726",
      "acteurRef": "PA720576",
      "legislature": "15",
      "typeOrgane": "GE",
      "dateDebut": "2018-02-16T01:00:00.000+01:00",
      "preseance": "20",
      "nominPrincipale": "1",
      "infosQualite": {
        "codeQualite": "Membre",
        "libQualite": "Membre",
        "libQualiteSex": "Membre"
      },
      "organesRefs": [
        "PO746847"
      ]
    },
    {
      "xsiType": "MandatSimple_Type",
      "uid": "PM751002",
      "acteurRef": "PA720576",
      "legislature": "15",
      "typeOrgane": "GE",
      "dateDebut": "2018-02-19T01:00:00.000+01:00",
      "preseance": "20",
      "nominPrincipale": "1",
      "infosQualite": {
        "codeQualite": "Membre",
        "libQualite": "Membre",
        "libQualiteSex": "Membre"
      },
      "organesRefs": [
        "PO746880"
      ]
    },
    {
      "xsiType": "MandatSimple_Type",
      "uid": "PM751119",
      "acteurRef": "PA720576",
      "legislature": "15",
      "typeOrgane": "GE",
      "dateDebut": "2018-02-19T01:00:00.000+01:00",
      "preseance": "20",
      "nominPrincipale": "0",
      "infosQualite": {
        "codeQualite": "Membre",
        "libQualite": "Membre",
        "libQualiteSex": "Membre"
      },
      "organesRefs": [
        "PO746684"
      ]
    },
    {
      "xsiType": "MandatSimple_Type",
      "uid": "PM751432",
      "acteurRef": "PA720576",
      "legislature": "15",
      "typeOrgane": "GE",
      "dateDebut": "2018-02-21T01:00:00.000+01:00",
      "preseance": "20",
      "nominPrincipale": "1",
      "infosQualite": {
        "codeQualite": "Membre",
        "libQualite": "Membre",
        "libQualiteSex": "Membre"
      },
      "organesRefs": [
        "PO746644"
      ]
    },
    {
      "xsiType": "MandatSimple_Type",
      "uid": "PM751602",
      "acteurRef": "PA720576",
      "legislature": "15",
      "typeOrgane": "GE",
      "dateDebut": "2018-02-21T01:00:00.000+01:00",
      "preseance": "20",
      "nominPrincipale": "1",
      "infosQualite": {
        "codeQualite": "Membre",
        "libQualite": "Membre",
        "libQualiteSex": "Membre"
      },
      "organesRefs": [
        "PO747261"
      ]
    },
    {
      "xsiType": "MandatSimple_Type",
      "uid": "PM752074",
      "acteurRef": "PA720576",
      "legislature": "15",
      "typeOrgane": "GE",
      "dateDebut": "2018-02-27T01:00:00.000+01:00",
      "preseance": "20",
      "nominPrincipale": "0",
      "infosQualite": {
        "codeQualite": "Membre",
        "libQualite": "Membre",
        "libQualiteSex": "Membre"
      },
      "organesRefs": [
        "PO747104"
      ]
    },
    {
      "xsiType": "MandatSimple_Type",
      "uid": "PM752188",
      "acteurRef": "PA720576",
      "legislature": "15",
      "typeOrgane": "GE",
      "dateDebut": "2018-02-28T01:00:00.000+01:00",
      "preseance": "20",
      "nominPrincipale": "1",
      "infosQualite": {
        "codeQualite": "Membre",
        "libQualite": "Membre",
        "libQualiteSex": "Membre"
      },
      "organesRefs": [
        "PO747286"
      ]
    },
    {
      "xsiType": "MandatSimple_Type",
      "uid": "PM752613",
      "acteurRef": "PA720576",
      "legislature": "15",
      "typeOrgane": "GE",
      "dateDebut": "2018-03-06T01:00:00.000+01:00",
      "preseance": "20",
      "nominPrincipale": "0",
      "infosQualite": {
        "codeQualite": "Membre",
        "libQualite": "Membre",
        "libQualiteSex": "Membre"
      },
      "organesRefs": [
        "PO747165"
      ]
    },
    {
      "xsiType": "MandatSimple_Type",
      "uid": "PM753156",
      "acteurRef": "PA720576",
      "legislature": "15",
      "typeOrgane": "GE",
      "dateDebut": "2018-03-09T01:00:00.000+01:00",
      "preseance": "8",
      "nominPrincipale": "1",
      "infosQualite": {
        "codeQualite": "Vice-Président",
        "libQualite": "Vice-Président",
        "libQualiteSex": "Vice-Président"
      },
      "organesRefs": [
        "PO747104"
      ]
    },
    {
      "xsiType": "MandatSimple_Type",
      "uid": "PM753594",
      "acteurRef": "PA720576",
      "legislature": "15",
      "typeOrgane": "GE",
      "dateDebut": "2018-03-15T01:00:00.000+01:00",
      "preseance": "8",
      "nominPrincipale": "1",
      "infosQualite": {
        "codeQualite": "Vice-Président",
        "libQualite": "Vice-Président",
        "libQualiteSex": "Vice-Président"
      },
      "organesRefs": [
        "PO746796"
      ]
    },
    {
      "xsiType": "MandatSimple_Type",
      "uid": "PM753952",
      "acteurRef": "PA720576",
      "legislature": "15",
      "typeOrgane": "GE",
      "dateDebut": "2018-03-20T01:00:00.000+01:00",
      "preseance": "20",
      "nominPrincipale": "1",
      "infosQualite": {
        "codeQualite": "Membre",
        "libQualite": "Membre",
        "libQualiteSex": "Membre"
      },
      "organesRefs": [
        "PO747135"
      ]
    },
    {
      "xsiType": "MandatSimple_Type",
      "uid": "PM754216",
      "acteurRef": "PA720576",
      "legislature": "15",
      "typeOrgane": "GE",
      "dateDebut": "2018-03-21T01:00:00.000+01:00",
      "preseance": "8",
      "nominPrincipale": "1",
      "infosQualite": {
        "codeQualite": "Vice-Président",
        "libQualite": "Vice-Président",
        "libQualiteSex": "Vice-Président"
      },
      "organesRefs": [
        "PO747165"
      ]
    },
    {
      "xsiType": "MandatSimple_Type",
      "uid": "PM755659",
      "acteurRef": "PA720576",
      "legislature": "15",
      "typeOrgane": "GE",
      "dateDebut": "2018-04-10T02:00:00.000+02:00",
      "preseance": "20",
      "nominPrincipale": "1",
      "infosQualite": {
        "codeQualite": "Membre",
        "libQualite": "Membre",
        "libQualiteSex": "Membre"
      },
      "organesRefs": [
        "PO751484"
      ]
    },
    {
      "xsiType": "MandatSimple_Type",
      "uid": "PM755827",
      "acteurRef": "PA720576",
      "legislature": "15",
      "typeOrgane": "GE",
      "dateDebut": "2018-04-23T02:00:00.000+02:00",
      "preseance": "8",
      "nominPrincipale": "1",
      "infosQualite": {
        "codeQualite": "Vice-Président",
        "libQualite": "Vice-Président",
        "libQualiteSex": "Vice-Président"
      },
      "organesRefs": [
        "PO746684"
      ]
    },
    {
      "xsiType": "MandatSimple_Type",
      "uid": "PM757074",
      "acteurRef": "PA720576",
      "legislature": "15",
      "typeOrgane": "ORGEXTPARL",
      "dateDebut": "2018-06-04T02:00:00.000+02:00",
      "datePublication": "2018-06-05T02:00:00.000+02:00",
      "preseance": "20",
      "nominPrincipale": "1",
      "infosQualite": {
        "codeQualite": "Titulaire",
        "libQualite": "Membre titulaire",
        "libQualiteSex": "Membre titulaire"
      },
      "organesRefs": [
        "PO756933"
      ]
    },
    {
      "xsiType": "MandatSimple_Type",
      "uid": "PM761383",
      "acteurRef": "PA720576",
      "typeOrgane": "PARPOL",
      "dateDebut": "2018-12-01T01:00:00.000+01:00",
      "preseance": "5",
      "nominPrincipale": "1",
      "infosQualite": {
        "codeQualite": "Membre",
        "libQualite": "Membre",
        "libQualiteSex": "Membre"
      },
      "organesRefs": [
        "PO761294"
      ]
    },
    {
      "xsiType": "MandatSimple_Type",
      "uid": "PM765056",
      "acteurRef": "PA720576",
      "legislature": "15",
      "typeOrgane": "GE",
      "dateDebut": "2019-05-13T02:00:00.000+02:00",
      "preseance": "20",
      "nominPrincipale": "0",
      "infosQualite": {
        "codeQualite": "Membre",
        "libQualite": "Membre",
        "libQualiteSex": "Membre"
      },
      "organesRefs": [
        "PO763269"
      ]
    },
    {
      "xsiType": "MandatSimple_Type",
      "uid": "PM765301",
      "acteurRef": "PA720576",
      "legislature": "15",
      "typeOrgane": "GE",
      "dateDebut": "2019-05-27T02:00:00.000+02:00",
      "preseance": "8",
      "nominPrincipale": "1",
      "infosQualite": {
        "codeQualite": "Vice-Président",
        "libQualite": "Vice-Président",
        "libQualiteSex": "Vice-Président"
      },
      "organesRefs": [
        "PO763269"
      ]
    },
    {
      "xsiType": "MandatSimple_Type",
      "uid": "PM765400",
      "acteurRef": "PA720576",
      "legislature": "15",
      "typeOrgane": "GE",
      "dateDebut": "2019-05-29T02:00:00.000+02:00",
      "preseance": "20",
      "nominPrincipale": "1",
      "infosQualite": {
        "codeQualite": "Membre",
        "libQualite": "Membre",
        "libQualiteSex": "Membre"
      },
      "organesRefs": [
        "PO763264"
      ]
    },
    {
      "xsiType": "MandatSimple_Type",
      "uid": "PM767431",
      "acteurRef": "PA720576",
      "legislature": "15",
      "typeOrgane": "GA",
      "dateDebut": "2019-10-07T02:00:00.000+02:00",
      "preseance": "20",
      "nominPrincipale": "1",
      "infosQualite": {
        "codeQualite": "Membre",
        "libQualite": "Membre",
        "libQualiteSex": "Membre"
      },
      "organesRefs": [
        "PO733187"
      ]
    },
    {
      "xsiType": "MandatSimple_Type",
      "uid": "PM767432",
      "acteurRef": "PA720576",
      "legislature": "15",
      "typeOrgane": "GA",
      "dateDebut": "2019-10-07T02:00:00.000+02:00",
      "preseance": "20",
      "nominPrincipale": "1",
      "infosQualite": {
        "codeQualite": "Membre",
        "libQualite": "Membre",
        "libQualiteSex": "Membre"
      },
      "organesRefs": [
        "PO733202"
      ]
    }
  ]
}