{
  "xsiType": "OrganeParlementaire_Type",
  "uid": "PO750141",
  "codeType": "MISINFO",
  "libelle": "Mission d'information sur les fichiers mis à la disposition des forces de sécurité",
  "libelleEdition": "de la mission d'information sur les fichiers mis à la disposition des forces de sécurité",
  "libelleAbrege": "Fichiers mis à la disposition des forces de sécurité",
  "libelleAbrev": "FICHSECUR",
  "viMoDe": {
    "dateDebut": "2018-01-31T01:00:00.000+01:00"
  },
  "organeParentRef": "PO59051",
  "regime": "5ème République",
  "legislature": "15",
  "secretariat": {}
}