{
  "uid": "PA722300",
  "etatCivil": {
    "ident": {
      "civ": "Mme",
      "prenom": "Anissa",
      "nom": "Khedher",
      "alpha": "Khedher",
      "trigramme": "AKH"
    },
    "infoNaissance": {
      "dateNais": "1980-04-01T01:00:00.000+01:00",
      "villeNais": "Vénissieux",
      "depNais": "Rhône",
      "paysNais": "France"
    }
  },
  "profession": {
    "libelleCourant": "Cadre hospitalier",
    "socProcInsee": {
      "catSocPro": "Cadres de la fonction publique, professions intellectuelles et  artistiques",
      "famSocPro": "Cadres et professions intellectuelles supérieures"
    }
  },
  "uriHatvp": "https://www.hatvp.fr/pages_nominatives/khedher-anissa",
  "adresses": [
    {
      "xsiType": "AdressePostale_Type",
      "uid": "AD722302",
      "type": "0",
      "typeLibelle": "Adresse officielle",
      "poids": "1",
      "intitule": "Assemblée nationale,",
      "numeroRue": "126",
      "nomRue": "Rue de l'Université,",
      "codePostal": "75355",
      "ville": "Paris 07 SP"
    },
    {
      "xsiType": "AdresseMail_Type",
      "uid": "AD728337",
      "type": "15",
      "typeLibelle": "Mèl",
      "valElec": "anissa.khedher@assemblee-nationale.fr"
    }
  ],
  "mandats": [
    {
      "xsiType": "MandatParlementaire_type",
      "uid": "PM723532",
      "acteurRef": "PA722300",
      "legislature": "15",
      "typeOrgane": "ASSEMBLEE",
      "dateDebut": "2017-06-18T02:00:00.000+02:00",
      "preseance": "50",
      "nominPrincipale": "1",
      "infosQualite": {
        "codeQualite": "membre",
        "libQualite": "membre",
        "libQualiteSex": "membre"
      },
      "organesRefs": [
        "PO717460"
      ],
      "suppleant": {
        "dateDebut": "2017-06-18T02:00:00.000+02:00",
        "suppleantRef": "PA722304"
      },
      "election": {
        "lieu": {
          "region": "Auvergne-Rhône-Alpes",
          "regionType": "Métropolitain",
          "departement": "Rhône",
          "numDepartement": "69",
          "numCirco": "7"
        },
        "causeMandat": "élections générales",
        "refCirconscription": "PO718168"
      },
      "mandature": {
        "datePriseFonction": "2017-06-21T02:00:00.000+02:00",
        "premiereElection": "0",
        "placeHemicycle": "573"
      },
      "collaborateurs": [
        {
          "qualite": "M.",
          "prenom": "Anthony",
          "nom": "Colomb"
        },
        {
          "qualite": "M.",
          "prenom": "Yves",
          "nom": "Azeroual"
        }
      ]
    },
    {
      "xsiType": "MandatSimple_Type",
      "uid": "PM731274",
      "acteurRef": "PA722300",
      "legislature": "15",
      "typeOrgane": "GP",
      "dateDebut": "2017-06-27T02:00:00.000+02:00",
      "datePublication": "2017-06-28T02:00:00.000+02:00",
      "preseance": "20",
      "nominPrincipale": "1",
      "infosQualite": {
        "codeQualite": "Membre",
        "libQualite": "Membre du",
        "libQualiteSex": "Membre du"
      },
      "organesRefs": [
        "PO730964"
      ]
    },
    {
      "xsiType": "MandatSimple_Type",
      "uid": "PM731993",
      "acteurRef": "PA722300",
      "legislature": "15",
      "typeOrgane": "COMPER",
      "dateDebut": "2017-06-29T02:00:00.000+02:00",
      "datePublication": "2017-06-29T02:00:00.000+02:00",
      "preseance": "32",
      "nominPrincipale": "1",
      "infosQualite": {
        "codeQualite": "Membre",
        "libQualite": "Membre",
        "libQualiteSex": "Membre"
      },
      "organesRefs": [
        "PO59046"
      ]
    },
    {
      "xsiType": "MandatSimple_Type",
      "uid": "PM734549",
      "acteurRef": "PA722300",
      "legislature": "15",
      "typeOrgane": "API",
      "dateDebut": "2017-08-08T02:00:00.000+02:00",
      "datePublication": "2017-08-08T02:00:00.000+02:00",
      "preseance": "20",
      "nominPrincipale": "1",
      "infosQualite": {
        "codeQualite": "Titulaire",
        "libQualite": "Membre titulaire",
        "libQualiteSex": "Membre titulaire"
      },
      "organesRefs": [
        "PO58974"
      ]
    },
    {
      "xsiType": "MandatSimple_Type",
      "uid": "PM735177",
      "acteurRef": "PA722300",
      "legislature": "15",
      "typeOrgane": "GA",
      "dateDebut": "2017-09-26T02:00:00.000+02:00",
      "preseance": "20",
      "nominPrincipale": "0",
      "infosQualite": {
        "codeQualite": "Membre",
        "libQualite": "Membre",
        "libQualiteSex": "Membre"
      },
      "organesRefs": [
        "PO733362"
      ]
    },
    {
      "xsiType": "MandatSimple_Type",
      "uid": "PM735178",
      "acteurRef": "PA722300",
      "legislature": "15",
      "typeOrgane": "GA",
      "dateDebut": "2017-09-26T02:00:00.000+02:00",
      "preseance": "1",
      "nominPrincipale": "1",
      "infosQualite": {
        "codeQualite": "Président",
        "libQualite": "Président",
        "libQualiteSex": "Présidente"
      },
      "organesRefs": [
        "PO733362"
      ]
    },
    {
      "xsiType": "MandatSimple_Type",
      "uid": "PM738773",
      "acteurRef": "PA722300",
      "legislature": "15",
      "typeOrgane": "GEVI",
      "dateDebut": "2017-10-10T02:00:00.000+02:00",
      "preseance": "20",
      "nominPrincipale": "1",
      "infosQualite": {
        "codeQualite": "Membre",
        "libQualite": "Membre",
        "libQualiteSex": "Membre"
      },
      "organesRefs": [
        "PO733462"
      ]
    },
    {
      "xsiType": "MandatSimple_Type",
      "uid": "PM738776",
      "acteurRef": "PA722300",
      "legislature": "15",
      "typeOrgane": "GA",
      "dateDebut": "2017-10-10T02:00:00.000+02:00",
      "preseance": "20",
      "nominPrincipale": "1",
      "infosQualite": {
        "codeQualite": "Membre",
        "libQualite": "Membre",
        "libQualiteSex": "Membre"
      },
      "organesRefs": [
        "PO733117"
      ]
    },
    {
      "xsiType": "MandatSimple_Type",
      "uid": "PM738778",
      "acteurRef": "PA722300",
      "legislature": "15",
      "typeOrgane": "GA",
      "dateDebut": "2017-10-10T02:00:00.000+02:00",
      "preseance": "20",
      "nominPrincipale": "1",
      "infosQualite": {
        "codeQualite": "Membre",
        "libQualite": "Membre",
        "libQualiteSex": "Membre"
      },
      "organesRefs": [
        "PO733187"
      ]
    },
    {
      "xsiType": "MandatSimple_Type",
      "uid": "PM738781",
      "acteurRef": "PA722300",
      "legislature": "15",
      "typeOrgane": "GA",
      "dateDebut": "2017-10-10T02:00:00.000+02:00",
      "preseance": "20",
      "nominPrincipale": "1",
      "infosQualite": {
        "codeQualite": "Membre",
        "libQualite": "Membre",
        "libQualiteSex": "Membre"
      },
      "organesRefs": [
        "PO733382"
      ]
    },
    {
      "xsiType": "MandatSimple_Type",
      "uid": "PM738784",
      "acteurRef": "PA722300",
      "legislature": "15",
      "typeOrgane": "GA",
      "dateDebut": "2017-10-10T02:00:00.000+02:00",
      "preseance": "20",
      "nominPrincipale": "0",
      "infosQualite": {
        "codeQualite": "Membre",
        "libQualite": "Membre",
        "libQualiteSex": "Membre"
      },
      "organesRefs": [
        "PO733452"
      ]
    },
    {
      "xsiType": "MandatSimple_Type",
      "uid": "PM739061",
      "acteurRef": "PA722300",
      "legislature": "15",
      "typeOrgane": "GA",
      "dateDebut": "2017-10-11T02:00:00.000+02:00",
      "preseance": "20",
      "nominPrincipale": "1",
      "infosQualite": {
        "codeQualite": "Membre",
        "libQualite": "Membre",
        "libQualiteSex": "Membre"
      },
      "organesRefs": [
        "PO733517"
      ]
    },
    {
      "xsiType": "MandatSimple_Type",
      "uid": "PM742074",
      "acteurRef": "PA722300",
      "legislature": "15",
      "typeOrgane": "GA",
      "dateDebut": "2017-10-27T02:00:00.000+02:00",
      "preseance": "8",
      "nominPrincipale": "1",
      "infosQualite": {
        "codeQualite": "Vice-Président",
        "libQualite": "Vice-Président",
        "libQualiteSex": "Vice-Présidente"
      },
      "organesRefs": [
        "PO733452"
      ]
    },
    {
      "xsiType": "MandatSimple_Type",
      "uid": "PM742164",
      "acteurRef": "PA722300",
      "legislature": "15",
      "typeOrgane": "API",
      "dateDebut": "2017-10-27T02:00:00.000+02:00",
      "datePublication": "2017-10-28T02:00:00.000+02:00",
      "preseance": "20",
      "nominPrincipale": "1",
      "infosQualite": {
        "codeQualite": "Membre",
        "libQualite": "Membre",
        "libQualiteSex": "Membre"
      },
      "organesRefs": [
        "PO201115"
      ]
    },
    {
      "xsiType": "MandatSimple_Type",
      "uid": "PM748581",
      "acteurRef": "PA722300",
      "legislature": "15",
      "typeOrgane": "GE",
      "dateDebut": "2018-02-01T01:00:00.000+01:00",
      "preseance": "20",
      "nominPrincipale": "0",
      "infosQualite": {
        "codeQualite": "Membre",
        "libQualite": "Membre",
        "libQualiteSex": "Membre"
      },
      "organesRefs": [
        "PO747002"
      ]
    },
    {
      "xsiType": "MandatSimple_Type",
      "uid": "PM748583",
      "acteurRef": "PA722300",
      "legislature": "15",
      "typeOrgane": "GE",
      "dateDebut": "2018-02-01T01:00:00.000+01:00",
      "preseance": "4",
      "nominPrincipale": "1",
      "infosQualite": {
        "codeQualite": "Co-Président",
        "libQualite": "Co-Président",
        "libQualiteSex": "Co-Présidente"
      },
      "organesRefs": [
        "PO747002"
      ]
    },
    {
      "xsiType": "MandatSimple_Type",
      "uid": "PM750674",
      "acteurRef": "PA722300",
      "legislature": "15",
      "typeOrgane": "GE",
      "dateDebut": "2018-02-15T01:00:00.000+01:00",
      "preseance": "20",
      "nominPrincipale": "1",
      "infosQualite": {
        "codeQualite": "Membre",
        "libQualite": "Membre",
        "libQualiteSex": "Membre"
      },
      "organesRefs": [
        "PO747271"
      ]
    },
    {
      "xsiType": "MandatSimple_Type",
      "uid": "PM750900",
      "acteurRef": "PA722300",
      "legislature": "15",
      "typeOrgane": "GE",
      "dateDebut": "2018-02-19T01:00:00.000+01:00",
      "preseance": "20",
      "nominPrincipale": "1",
      "infosQualite": {
        "codeQualite": "Membre",
        "libQualite": "Membre",
        "libQualiteSex": "Membre"
      },
      "organesRefs": [
        "PO747109"
      ]
    },
    {
      "xsiType": "MandatSimple_Type",
      "uid": "PM752029",
      "acteurRef": "PA722300",
      "legislature": "15",
      "typeOrgane": "GE",
      "dateDebut": "2018-02-26T01:00:00.000+01:00",
      "preseance": "20",
      "nominPrincipale": "1",
      "infosQualite": {
        "codeQualite": "Membre",
        "libQualite": "Membre",
        "libQualiteSex": "Membre"
      },
      "organesRefs": [
        "PO746649"
      ]
    },
    {
      "xsiType": "MandatSimple_Type",
      "uid": "PM754483",
      "acteurRef": "PA722300",
      "legislature": "15",
      "typeOrgane": "GA",
      "dateDebut": "2018-03-29T02:00:00.000+02:00",
      "preseance": "20",
      "nominPrincipale": "1",
      "infosQualite": {
        "codeQualite": "Membre",
        "libQualite": "Membre",
        "libQualiteSex": "Membre"
      },
      "organesRefs": [
        "PO733632"
      ]
    },
    {
      "xsiType": "MandatSimple_Type",
      "uid": "PM757513",
      "acteurRef": "PA722300",
      "legislature": "15",
      "typeOrgane": "GE",
      "dateDebut": "2018-06-24T02:00:00.000+02:00",
      "preseance": "20",
      "nominPrincipale": "1",
      "infosQualite": {
        "codeQualite": "Membre",
        "libQualite": "Membre",
        "libQualiteSex": "Membre"
      },
      "organesRefs": [
        "PO747145"
      ]
    },
    {
      "xsiType": "MandatMission_Type",
      "uid": "PM758875",
      "acteurRef": "PA722300",
      "legislature": "15",
      "typeOrgane": "MISINFO",
      "dateDebut": "2018-09-12T02:00:00.000+02:00",
      "preseance": "10",
      "nominPrincipale": "0",
      "infosQualite": {
        "codeQualite": "Membre",
        "libQualite": "Membre",
        "libQualiteSex": "Membre"
      },
      "organesRefs": [
        "PO758871"
      ]
    },
    {
      "xsiType": "MandatMission_Type",
      "uid": "PM758877",
      "acteurRef": "PA722300",
      "legislature": "15",
      "typeOrgane": "MISINFO",
      "dateDebut": "2018-09-12T02:00:00.000+02:00",
      "preseance": "5",
      "nominPrincipale": "1",
      "infosQualite": {
        "codeQualite": "Co-rapporteur",
        "libQualite": "Co-rapporteur",
        "libQualiteSex": "Co-rapporteure"
      },
      "organesRefs": [
        "PO758871"
      ]
    },
    {
      "xsiType": "MandatSimple_Type",
      "uid": "PM760147",
      "acteurRef": "PA722300",
      "legislature": "15",
      "typeOrgane": "GA",
      "dateDebut": "2018-10-31T01:00:00.000+01:00",
      "preseance": "20",
      "nominPrincipale": "1",
      "infosQualite": {
        "codeQualite": "Membre",
        "libQualite": "Membre",
        "libQualiteSex": "Membre"
      },
      "organesRefs": [
        "PO733352"
      ]
    },
    {
      "xsiType": "MandatSimple_Type",
      "uid": "PM761111",
      "acteurRef": "PA722300",
      "legislature": "15",
      "typeOrgane": "GE",
      "dateDebut": "2018-12-11T01:00:00.000+01:00",
      "preseance": "20",
      "nominPrincipale": "1",
      "infosQualite": {
        "codeQualite": "Membre",
        "libQualite": "Membre",
        "libQualiteSex": "Membre"
      },
      "organesRefs": [
        "PO746735"
      ]
    },
    {
      "xsiType": "MandatSimple_Type",
      "uid": "PM761669",
      "acteurRef": "PA722300",
      "typeOrgane": "PARPOL",
      "dateDebut": "2018-12-01T01:00:00.000+01:00",
      "preseance": "5",
      "nominPrincipale": "1",
      "infosQualite": {
        "codeQualite": "Membre",
        "libQualite": "Membre",
        "libQualiteSex": "Membre"
      },
      "organesRefs": [
        "PO761294"
      ]
    }
  ]
}