{
  "xsiType": "OrganeExterne_Type",
  "uid": "PO516754",
  "codeType": "COMSENAT",
  "libelle": "Commission de l'aménagement du territoire et du développement durable",
  "libelleEdition": "de la commission de l'aménagement du territoire et du développement durable",
  "libelleAbrege": "Aménagement du territoire et développement durable",
  "libelleAbrev": "CDDCO",
  "viMoDe": {
    "dateDebut": "2012-02-21T01:00:00.000+01:00"
  }
}