{
  "uid": "PA719330",
  "etatCivil": {
    "ident": {
      "civ": "M.",
      "prenom": "Fabien",
      "nom": "Gouttefarde",
      "alpha": "Gouttefarde",
      "trigramme": "FGO"
    },
    "infoNaissance": {
      "dateNais": "1978-09-27T02:00:00.000+02:00",
      "villeNais": "Versailles",
      "depNais": "Yvelines",
      "paysNais": "France"
    }
  },
  "profession": {
    "libelleCourant": "Fonctionnaire de catégorie A",
    "socProcInsee": {
      "catSocPro": "Cadres de la fonction publique, professions intellectuelles et  artistiques",
      "famSocPro": "Cadres et professions intellectuelles supérieures"
    }
  },
  "uriHatvp": "https://www.hatvp.fr/pages_nominatives/gouttefarde-fabien",
  "adresses": [
    {
      "xsiType": "AdressePostale_Type",
      "uid": "AD719332",
      "type": "0",
      "typeLibelle": "Adresse officielle",
      "poids": "1",
      "intitule": "Assemblée nationale,",
      "numeroRue": "126",
      "nomRue": "Rue de l'Université,",
      "codePostal": "75355",
      "ville": "Paris 07 SP"
    },
    {
      "xsiType": "AdresseMail_Type",
      "uid": "AD728029",
      "type": "15",
      "typeLibelle": "Mèl",
      "valElec": "fabien.gouttefarde@assemblee-nationale.fr"
    },
    {
      "xsiType": "AdresseSiteWeb_Type",
      "uid": "AD728882",
      "type": "24",
      "typeLibelle": "Twitter",
      "valElec": "@FGouttefarde"
    },
    {
      "xsiType": "AdresseMail_Type",
      "uid": "AD728890",
      "type": "15",
      "typeLibelle": "Mèl",
      "valElec": "fabien.gouttefarde@en-marche.fr"
    },
    {
      "xsiType": "AdresseSiteWeb_Type",
      "uid": "AD734002",
      "type": "25",
      "typeLibelle": "Facebook",
      "valElec": "FGouttefarde"
    }
  ],
  "mandats": [
    {
      "xsiType": "MandatParlementaire_type",
      "uid": "PM722628",
      "acteurRef": "PA719330",
      "legislature": "15",
      "typeOrgane": "ASSEMBLEE",
      "dateDebut": "2017-06-18T02:00:00.000+02:00",
      "preseance": "50",
      "nominPrincipale": "1",
      "infosQualite": {
        "codeQualite": "membre",
        "libQualite": "membre",
        "libQualiteSex": "membre"
      },
      "organesRefs": [
        "PO717460"
      ],
      "suppleant": {
        "dateDebut": "2017-06-18T02:00:00.000+02:00",
        "suppleantRef": "PA719334"
      },
      "election": {
        "lieu": {
          "region": "Normandie",
          "regionType": "Métropolitain",
          "departement": "Eure",
          "numDepartement": "27",
          "numCirco": "2"
        },
        "causeMandat": "élections générales",
        "refCirconscription": "PO717692"
      },
      "mandature": {
        "datePriseFonction": "2017-06-21T02:00:00.000+02:00",
        "premiereElection": "0",
        "placeHemicycle": "415"
      },
      "collaborateurs": [
        {
          "qualite": "M.",
          "prenom": "Cédric",
          "nom": "Brout"
        },
        {
          "qualite": "M.",
          "prenom": "Vincent",
          "nom": "Debas"
        },
        {
          "qualite": "Mme",
          "prenom": "Caroline",
          "nom": "Catino"
        }
      ]
    },
    {
      "xsiType": "MandatSimple_Type",
      "uid": "PM731032",
      "acteurRef": "PA719330",
      "legislature": "15",
      "typeOrgane": "GP",
      "dateDebut": "2017-06-27T02:00:00.000+02:00",
      "datePublication": "2017-06-28T02:00:00.000+02:00",
      "preseance": "20",
      "nominPrincipale": "1",
      "infosQualite": {
        "codeQualite": "Membre",
        "libQualite": "Membre du",
        "libQualiteSex": "Membre du"
      },
      "organesRefs": [
        "PO730964"
      ]
    },
    {
      "xsiType": "MandatSimple_Type",
      "uid": "PM731985",
      "acteurRef": "PA719330",
      "legislature": "15",
      "typeOrgane": "COMPER",
      "dateDebut": "2017-06-29T02:00:00.000+02:00",
      "datePublication": "2017-06-29T02:00:00.000+02:00",
      "preseance": "32",
      "nominPrincipale": "1",
      "infosQualite": {
        "codeQualite": "Membre",
        "libQualite": "Membre",
        "libQualiteSex": "Membre"
      },
      "organesRefs": [
        "PO59046"
      ]
    },
    {
      "xsiType": "MandatSimple_Type",
      "uid": "PM734399",
      "acteurRef": "PA719330",
      "legislature": "15",
      "typeOrgane": "API",
      "dateDebut": "2017-08-02T02:00:00.000+02:00",
      "datePublication": "2017-08-03T02:00:00.000+02:00",
      "preseance": "20",
      "nominPrincipale": "1",
      "infosQualite": {
        "codeQualite": "Titulaire",
        "libQualite": "Membre titulaire",
        "libQualiteSex": "Membre titulaire"
      },
      "organesRefs": [
        "PO304272"
      ]
    },
    {
      "xsiType": "MandatSimple_Type",
      "uid": "PM735060",
      "acteurRef": "PA719330",
      "legislature": "15",
      "typeOrgane": "ORGEXTPARL",
      "dateDebut": "2017-09-18T02:00:00.000+02:00",
      "datePublication": "2017-09-21T02:00:00.000+02:00",
      "preseance": "20",
      "nominPrincipale": "1",
      "infosQualite": {
        "codeQualite": "Titulaire",
        "libQualite": "Membre titulaire",
        "libQualiteSex": "Membre titulaire"
      },
      "organesRefs": [
        "PO191887"
      ]
    },
    {
      "xsiType": "MandatSimple_Type",
      "uid": "PM735217",
      "acteurRef": "PA719330",
      "legislature": "15",
      "typeOrgane": "GA",
      "dateDebut": "2017-09-26T02:00:00.000+02:00",
      "preseance": "20",
      "nominPrincipale": "0",
      "infosQualite": {
        "codeQualite": "Membre",
        "libQualite": "Membre",
        "libQualiteSex": "Membre"
      },
      "organesRefs": [
        "PO733147"
      ]
    },
    {
      "xsiType": "MandatSimple_Type",
      "uid": "PM735218",
      "acteurRef": "PA719330",
      "legislature": "15",
      "typeOrgane": "GA",
      "dateDebut": "2017-09-26T02:00:00.000+02:00",
      "preseance": "1",
      "nominPrincipale": "1",
      "infosQualite": {
        "codeQualite": "Président",
        "libQualite": "Président",
        "libQualiteSex": "Président"
      },
      "organesRefs": [
        "PO733147"
      ]
    },
    {
      "xsiType": "MandatSimple_Type",
      "uid": "PM738193",
      "acteurRef": "PA719330",
      "legislature": "15",
      "typeOrgane": "GA",
      "dateDebut": "2017-10-09T02:00:00.000+02:00",
      "preseance": "20",
      "nominPrincipale": "1",
      "infosQualite": {
        "codeQualite": "Membre",
        "libQualite": "Membre",
        "libQualiteSex": "Membre"
      },
      "organesRefs": [
        "PO732964"
      ]
    },
    {
      "xsiType": "MandatSimple_Type",
      "uid": "PM738194",
      "acteurRef": "PA719330",
      "legislature": "15",
      "typeOrgane": "GA",
      "dateDebut": "2017-10-09T02:00:00.000+02:00",
      "preseance": "20",
      "nominPrincipale": "1",
      "infosQualite": {
        "codeQualite": "Membre",
        "libQualite": "Membre",
        "libQualiteSex": "Membre"
      },
      "organesRefs": [
        "PO732979"
      ]
    },
    {
      "xsiType": "MandatSimple_Type",
      "uid": "PM738195",
      "acteurRef": "PA719330",
      "legislature": "15",
      "typeOrgane": "GA",
      "dateDebut": "2017-10-09T02:00:00.000+02:00",
      "preseance": "20",
      "nominPrincipale": "0",
      "infosQualite": {
        "codeQualite": "Membre",
        "libQualite": "Membre",
        "libQualiteSex": "Membre"
      },
      "organesRefs": [
        "PO733022"
      ]
    },
    {
      "xsiType": "MandatSimple_Type",
      "uid": "PM738196",
      "acteurRef": "PA719330",
      "legislature": "15",
      "typeOrgane": "GA",
      "dateDebut": "2017-10-09T02:00:00.000+02:00",
      "preseance": "20",
      "nominPrincipale": "1",
      "infosQualite": {
        "codeQualite": "Membre",
        "libQualite": "Membre",
        "libQualiteSex": "Membre"
      },
      "organesRefs": [
        "PO733057"
      ]
    },
    {
      "xsiType": "MandatSimple_Type",
      "uid": "PM738197",
      "acteurRef": "PA719330",
      "legislature": "15",
      "typeOrgane": "GA",
      "dateDebut": "2017-10-09T02:00:00.000+02:00",
      "preseance": "20",
      "nominPrincipale": "1",
      "infosQualite": {
        "codeQualite": "Membre",
        "libQualite": "Membre",
        "libQualiteSex": "Membre"
      },
      "organesRefs": [
        "PO733072"
      ]
    },
    {
      "xsiType": "MandatSimple_Type",
      "uid": "PM738198",
      "acteurRef": "PA719330",
      "legislature": "15",
      "typeOrgane": "GA",
      "dateDebut": "2017-10-09T02:00:00.000+02:00",
      "preseance": "20",
      "nominPrincipale": "1",
      "infosQualite": {
        "codeQualite": "Membre",
        "libQualite": "Membre",
        "libQualiteSex": "Membre"
      },
      "organesRefs": [
        "PO733182"
      ]
    },
    {
      "xsiType": "MandatSimple_Type",
      "uid": "PM738199",
      "acteurRef": "PA719330",
      "legislature": "15",
      "typeOrgane": "GA",
      "dateDebut": "2017-10-09T02:00:00.000+02:00",
      "preseance": "20",
      "nominPrincipale": "0",
      "infosQualite": {
        "codeQualite": "Membre",
        "libQualite": "Membre",
        "libQualiteSex": "Membre"
      },
      "organesRefs": [
        "PO733322"
      ]
    },
    {
      "xsiType": "MandatSimple_Type",
      "uid": "PM738200",
      "acteurRef": "PA719330",
      "legislature": "15",
      "typeOrgane": "GA",
      "dateDebut": "2017-10-09T02:00:00.000+02:00",
      "preseance": "20",
      "nominPrincipale": "0",
      "infosQualite": {
        "codeQualite": "Membre",
        "libQualite": "Membre",
        "libQualiteSex": "Membre"
      },
      "organesRefs": [
        "PO733482"
      ]
    },
    {
      "xsiType": "MandatSimple_Type",
      "uid": "PM738201",
      "acteurRef": "PA719330",
      "legislature": "15",
      "typeOrgane": "GA",
      "dateDebut": "2017-10-09T02:00:00.000+02:00",
      "preseance": "20",
      "nominPrincipale": "1",
      "infosQualite": {
        "codeQualite": "Membre",
        "libQualite": "Membre",
        "libQualiteSex": "Membre"
      },
      "organesRefs": [
        "PO733652"
      ]
    },
    {
      "xsiType": "MandatSimple_Type",
      "uid": "PM738440",
      "acteurRef": "PA719330",
      "legislature": "15",
      "typeOrgane": "ORGEXTPARL",
      "dateDebut": "2017-10-09T02:00:00.000+02:00",
      "datePublication": "2017-10-10T02:00:00.000+02:00",
      "preseance": "20",
      "nominPrincipale": "1",
      "infosQualite": {
        "codeQualite": "Titulaire",
        "libQualite": "Membre titulaire",
        "libQualiteSex": "Membre titulaire"
      },
      "organesRefs": [
        "PO60156"
      ]
    },
    {
      "xsiType": "MandatSimple_Type",
      "uid": "PM740401",
      "acteurRef": "PA719330",
      "legislature": "15",
      "typeOrgane": "GA",
      "dateDebut": "2017-10-17T02:00:00.000+02:00",
      "preseance": "20",
      "nominPrincipale": "0",
      "infosQualite": {
        "codeQualite": "Membre",
        "libQualite": "Membre",
        "libQualiteSex": "Membre"
      },
      "organesRefs": [
        "PO733487"
      ]
    },
    {
      "xsiType": "MandatSimple_Type",
      "uid": "PM740498",
      "acteurRef": "PA719330",
      "legislature": "15",
      "typeOrgane": "GA",
      "dateDebut": "2017-10-18T02:00:00.000+02:00",
      "preseance": "20",
      "nominPrincipale": "0",
      "infosQualite": {
        "codeQualite": "Membre",
        "libQualite": "Membre",
        "libQualiteSex": "Membre"
      },
      "organesRefs": [
        "PO733703"
      ]
    },
    {
      "xsiType": "MandatSimple_Type",
      "uid": "PM740511",
      "acteurRef": "PA719330",
      "legislature": "15",
      "typeOrgane": "GA",
      "dateDebut": "2017-10-18T02:00:00.000+02:00",
      "preseance": "20",
      "nominPrincipale": "0",
      "infosQualite": {
        "codeQualite": "Membre",
        "libQualite": "Membre",
        "libQualiteSex": "Membre"
      },
      "organesRefs": [
        "PO733632"
      ]
    },
    {
      "xsiType": "MandatSimple_Type",
      "uid": "PM742585",
      "acteurRef": "PA719330",
      "legislature": "15",
      "typeOrgane": "GA",
      "dateDebut": "2017-11-07T01:00:00.000+01:00",
      "preseance": "8",
      "nominPrincipale": "1",
      "infosQualite": {
        "codeQualite": "Vice-Président",
        "libQualite": "Vice-Président",
        "libQualiteSex": "Vice-Président"
      },
      "organesRefs": [
        "PO733322"
      ]
    },
    {
      "xsiType": "MandatSimple_Type",
      "uid": "PM742694",
      "acteurRef": "PA719330",
      "legislature": "15",
      "typeOrgane": "GA",
      "dateDebut": "2017-11-08T01:00:00.000+01:00",
      "preseance": "8",
      "nominPrincipale": "1",
      "infosQualite": {
        "codeQualite": "Vice-Président",
        "libQualite": "Vice-Président",
        "libQualiteSex": "Vice-Président"
      },
      "organesRefs": [
        "PO733703"
      ]
    },
    {
      "xsiType": "MandatSimple_Type",
      "uid": "PM742948",
      "acteurRef": "PA719330",
      "legislature": "15",
      "typeOrgane": "GA",
      "dateDebut": "2017-11-09T01:00:00.000+01:00",
      "preseance": "8",
      "nominPrincipale": "1",
      "infosQualite": {
        "codeQualite": "Vice-Président",
        "libQualite": "Vice-Président",
        "libQualiteSex": "Vice-Président"
      },
      "organesRefs": [
        "PO733022"
      ]
    },
    {
      "xsiType": "MandatSimple_Type",
      "uid": "PM743853",
      "acteurRef": "PA719330",
      "legislature": "15",
      "typeOrgane": "GEVI",
      "dateDebut": "2017-11-08T01:00:00.000+01:00",
      "preseance": "20",
      "nominPrincipale": "1",
      "infosQualite": {
        "codeQualite": "Membre",
        "libQualite": "Membre",
        "libQualiteSex": "Membre"
      },
      "organesRefs": [
        "PO743840"
      ]
    },
    {
      "xsiType": "MandatSimple_Type",
      "uid": "PM744017",
      "acteurRef": "PA719330",
      "legislature": "15",
      "typeOrgane": "GA",
      "dateDebut": "2017-11-23T01:00:00.000+01:00",
      "preseance": "8",
      "nominPrincipale": "1",
      "infosQualite": {
        "codeQualite": "Vice-Président",
        "libQualite": "Vice-Président",
        "libQualiteSex": "Vice-Président"
      },
      "organesRefs": [
        "PO733632"
      ]
    },
    {
      "xsiType": "MandatSimple_Type",
      "uid": "PM744522",
      "acteurRef": "PA719330",
      "legislature": "15",
      "typeOrgane": "GA",
      "dateDebut": "2017-11-30T01:00:00.000+01:00",
      "preseance": "20",
      "nominPrincipale": "1",
      "infosQualite": {
        "codeQualite": "Membre",
        "libQualite": "Membre",
        "libQualiteSex": "Membre"
      },
      "organesRefs": [
        "PO733207"
      ]
    },
    {
      "xsiType": "MandatSimple_Type",
      "uid": "PM745747",
      "acteurRef": "PA719330",
      "legislature": "15",
      "typeOrgane": "GA",
      "dateDebut": "2017-12-06T01:00:00.000+01:00",
      "preseance": "8",
      "nominPrincipale": "1",
      "infosQualite": {
        "codeQualite": "Vice-Président",
        "libQualite": "Vice-Président",
        "libQualiteSex": "Vice-Président"
      },
      "organesRefs": [
        "PO733487"
      ]
    },
    {
      "xsiType": "MandatSimple_Type",
      "uid": "PM748463",
      "acteurRef": "PA719330",
      "legislature": "15",
      "typeOrgane": "GE",
      "dateDebut": "2018-02-01T01:00:00.000+01:00",
      "preseance": "20",
      "nominPrincipale": "0",
      "infosQualite": {
        "codeQualite": "Membre",
        "libQualite": "Membre",
        "libQualiteSex": "Membre"
      },
      "organesRefs": [
        "PO746612"
      ]
    },
    {
      "xsiType": "MandatSimple_Type",
      "uid": "PM748464",
      "acteurRef": "PA719330",
      "legislature": "15",
      "typeOrgane": "GE",
      "dateDebut": "2018-02-01T01:00:00.000+01:00",
      "preseance": "1",
      "nominPrincipale": "1",
      "infosQualite": {
        "codeQualite": "Président",
        "libQualite": "Président",
        "libQualiteSex": "Président"
      },
      "organesRefs": [
        "PO746612"
      ]
    },
    {
      "xsiType": "MandatSimple_Type",
      "uid": "PM750126",
      "acteurRef": "PA719330",
      "legislature": "15",
      "typeOrgane": "GE",
      "dateDebut": "2018-02-13T01:00:00.000+01:00",
      "preseance": "20",
      "nominPrincipale": "1",
      "infosQualite": {
        "codeQualite": "Membre",
        "libQualite": "Membre",
        "libQualiteSex": "Membre"
      },
      "organesRefs": [
        "PO746982"
      ]
    },
    {
      "xsiType": "MandatSimple_Type",
      "uid": "PM750645",
      "acteurRef": "PA719330",
      "legislature": "15",
      "typeOrgane": "GE",
      "dateDebut": "2018-02-15T01:00:00.000+01:00",
      "preseance": "20",
      "nominPrincipale": "1",
      "infosQualite": {
        "codeQualite": "Membre",
        "libQualite": "Membre",
        "libQualiteSex": "Membre"
      },
      "organesRefs": [
        "PO747200"
      ]
    },
    {
      "xsiType": "MandatSimple_Type",
      "uid": "PM750944",
      "acteurRef": "PA719330",
      "legislature": "15",
      "typeOrgane": "GE",
      "dateDebut": "2018-02-19T01:00:00.000+01:00",
      "preseance": "20",
      "nominPrincipale": "1",
      "infosQualite": {
        "codeQualite": "Membre",
        "libQualite": "Membre",
        "libQualiteSex": "Membre"
      },
      "organesRefs": [
        "PO746880"
      ]
    },
    {
      "xsiType": "MandatSimple_Type",
      "uid": "PM751670",
      "acteurRef": "PA719330",
      "legislature": "15",
      "typeOrgane": "GE",
      "dateDebut": "2018-02-22T01:00:00.000+01:00",
      "preseance": "20",
      "nominPrincipale": "1",
      "infosQualite": {
        "codeQualite": "Membre",
        "libQualite": "Membre",
        "libQualiteSex": "Membre"
      },
      "organesRefs": [
        "PO746669"
      ]
    },
    {
      "xsiType": "MandatSimple_Type",
      "uid": "PM751962",
      "acteurRef": "PA719330",
      "legislature": "15",
      "typeOrgane": "GE",
      "dateDebut": "2018-02-23T01:00:00.000+01:00",
      "preseance": "20",
      "nominPrincipale": "1",
      "infosQualite": {
        "codeQualite": "Membre",
        "libQualite": "Membre",
        "libQualiteSex": "Membre"
      },
      "organesRefs": [
        "PO746925"
      ]
    },
    {
      "xsiType": "MandatSimple_Type",
      "uid": "PM752754",
      "acteurRef": "PA719330",
      "legislature": "15",
      "typeOrgane": "GA",
      "dateDebut": "2018-03-07T01:00:00.000+01:00",
      "preseance": "20",
      "nominPrincipale": "1",
      "infosQualite": {
        "codeQualite": "Membre",
        "libQualite": "Membre",
        "libQualiteSex": "Membre"
      },
      "organesRefs": [
        "PO733362"
      ]
    },
    {
      "xsiType": "MandatSimple_Type",
      "uid": "PM754329",
      "acteurRef": "PA719330",
      "legislature": "15",
      "typeOrgane": "GA",
      "dateDebut": "2017-12-05T01:00:00.000+01:00",
      "preseance": "8",
      "nominPrincipale": "1",
      "infosQualite": {
        "codeQualite": "Vice-Président",
        "libQualite": "Vice-Président",
        "libQualiteSex": "Vice-Président"
      },
      "organesRefs": [
        "PO733482"
      ]
    },
    {
      "xsiType": "MandatSimple_Type",
      "uid": "PM761527",
      "acteurRef": "PA719330",
      "typeOrgane": "PARPOL",
      "dateDebut": "2018-12-01T01:00:00.000+01:00",
      "preseance": "5",
      "nominPrincipale": "1",
      "infosQualite": {
        "codeQualite": "Membre",
        "libQualite": "Membre",
        "libQualiteSex": "Membre"
      },
      "organesRefs": [
        "PO761294"
      ]
    },
    {
      "xsiType": "MandatSimple_Type",
      "uid": "PM764744",
      "acteurRef": "PA719330",
      "legislature": "15",
      "typeOrgane": "GE",
      "dateDebut": "2019-04-15T02:00:00.000+02:00",
      "preseance": "20",
      "nominPrincipale": "0",
      "infosQualite": {
        "codeQualite": "Membre",
        "libQualite": "Membre",
        "libQualiteSex": "Membre"
      },
      "organesRefs": [
        "PO763254"
      ]
    },
    {
      "xsiType": "MandatSimple_Type",
      "uid": "PM765313",
      "acteurRef": "PA719330",
      "legislature": "15",
      "typeOrgane": "GE",
      "dateDebut": "2019-05-27T02:00:00.000+02:00",
      "preseance": "8",
      "nominPrincipale": "1",
      "infosQualite": {
        "codeQualite": "Vice-Président",
        "libQualite": "Vice-Président",
        "libQualiteSex": "Vice-Président"
      },
      "organesRefs": [
        "PO763254"
      ]
    },
    {
      "xsiType": "MandatMission_Type",
      "uid": "PM767003",
      "acteurRef": "PA719330",
      "legislature": "15",
      "typeOrgane": "MISINFOPRE",
      "dateDebut": "2019-09-11T02:00:00.000+02:00",
      "datePublication": "2019-09-12T02:00:00.000+02:00",
      "preseance": "20",
      "nominPrincipale": "1",
      "infosQualite": {
        "codeQualite": "Membre",
        "libQualite": "Membre",
        "libQualiteSex": "Membre"
      },
      "organesRefs": [
        "PO766497"
      ]
    },
    {
      "xsiType": "MandatMission_Type",
      "uid": "PM768021",
      "acteurRef": "PA719330",
      "legislature": "15",
      "typeOrgane": "MISINFO",
      "dateDebut": "2019-10-23T02:00:00.000+02:00",
      "preseance": "10",
      "nominPrincipale": "0",
      "infosQualite": {
        "codeQualite": "Membre",
        "libQualite": "Membre",
        "libQualiteSex": "Membre"
      },
      "organesRefs": [
        "PO767995"
      ]
    },
    {
      "xsiType": "MandatMission_Type",
      "uid": "PM768064",
      "acteurRef": "PA719330",
      "legislature": "15",
      "typeOrgane": "MISINFO",
      "dateDebut": "2019-10-23T02:00:00.000+02:00",
      "preseance": "5",
      "nominPrincipale": "1",
      "infosQualite": {
        "codeQualite": "Co-rapporteur",
        "libQualite": "Co-rapporteur",
        "libQualiteSex": "Co-rapporteur"
      },
      "organesRefs": [
        "PO767995"
      ]
    }
  ]
}