{
  "uid": "PA719632",
  "etatCivil": {
    "ident": {
      "civ": "Mme",
      "prenom": "Sophie",
      "nom": "Panonacle",
      "alpha": "Panonacle",
      "trigramme": "SPA"
    },
    "infoNaissance": {
      "dateNais": "1968-12-16T01:00:00.000+01:00",
      "villeNais": "Bordeaux",
      "depNais": "Gironde",
      "paysNais": "France"
    }
  },
  "profession": {
    "libelleCourant": "Sans profession déclarée",
    "socProcInsee": {
      "catSocPro": "Sans profession déclarée",
      "famSocPro": "Sans profession déclarée"
    }
  },
  "uriHatvp": "https://www.hatvp.fr/pages_nominatives/panonacle-sophie",
  "adresses": [
    {
      "xsiType": "AdressePostale_Type",
      "uid": "AD719634",
      "type": "0",
      "typeLibelle": "Adresse officielle",
      "poids": "1",
      "intitule": "Assemblée nationale,",
      "numeroRue": "126",
      "nomRue": "Rue de l'Université,",
      "codePostal": "75355",
      "ville": "Paris 07 SP"
    },
    {
      "xsiType": "AdresseMail_Type",
      "uid": "AD728061",
      "type": "15",
      "typeLibelle": "Mèl",
      "valElec": "sophie.panonacle@assemblee-nationale.fr"
    },
    {
      "xsiType": "AdressePostale_Type",
      "uid": "AD736960",
      "type": "2",
      "typeLibelle": "Adresse publiée de circonscription",
      "poids": "22",
      "intitule": "Permanence parlementaire",
      "numeroRue": "14",
      "nomRue": "Boulevard du Général Leclerc",
      "codePostal": "33120",
      "ville": "Arcachon"
    }
  ],
  "mandats": [
    {
      "xsiType": "MandatParlementaire_type",
      "uid": "PM722716",
      "acteurRef": "PA719632",
      "legislature": "15",
      "typeOrgane": "ASSEMBLEE",
      "dateDebut": "2017-06-18T02:00:00.000+02:00",
      "preseance": "50",
      "nominPrincipale": "1",
      "infosQualite": {
        "codeQualite": "membre",
        "libQualite": "membre",
        "libQualiteSex": "membre"
      },
      "organesRefs": [
        "PO717460"
      ],
      "suppleant": {
        "dateDebut": "2017-06-18T02:00:00.000+02:00",
        "suppleantRef": "PA719636"
      },
      "election": {
        "lieu": {
          "region": "Nouvelle-Aquitaine",
          "regionType": "Métropolitain",
          "departement": "Gironde",
          "numDepartement": "33",
          "numCirco": "8"
        },
        "causeMandat": "élections générales",
        "refCirconscription": "PO717736"
      },
      "mandature": {
        "datePriseFonction": "2017-06-21T02:00:00.000+02:00",
        "premiereElection": "0",
        "placeHemicycle": "281"
      },
      "collaborateurs": [
        {
          "qualite": "Mme",
          "prenom": "Marie",
          "nom": "Pajot"
        },
        {
          "qualite": "Mme",
          "prenom": "Ameline",
          "nom": "Berthonnaud"
        },
        {
          "qualite": "M.",
          "prenom": "Thibault",
          "nom": "Fournol"
        }
      ]
    },
    {
      "xsiType": "MandatSimple_Type",
      "uid": "PM731065",
      "acteurRef": "PA719632",
      "legislature": "15",
      "typeOrgane": "GP",
      "dateDebut": "2017-06-27T02:00:00.000+02:00",
      "datePublication": "2017-06-28T02:00:00.000+02:00",
      "preseance": "20",
      "nominPrincipale": "1",
      "infosQualite": {
        "codeQualite": "Membre",
        "libQualite": "Membre du",
        "libQualiteSex": "Membre du"
      },
      "organesRefs": [
        "PO730964"
      ]
    },
    {
      "xsiType": "MandatSimple_Type",
      "uid": "PM732077",
      "acteurRef": "PA719632",
      "legislature": "15",
      "typeOrgane": "COMPER",
      "dateDebut": "2017-06-29T02:00:00.000+02:00",
      "datePublication": "2017-06-29T02:00:00.000+02:00",
      "preseance": "32",
      "nominPrincipale": "1",
      "infosQualite": {
        "codeQualite": "Membre",
        "libQualite": "Membre",
        "libQualiteSex": "Membre"
      },
      "organesRefs": [
        "PO419865"
      ]
    },
    {
      "xsiType": "MandatSimple_Type",
      "uid": "PM732678",
      "acteurRef": "PA719632",
      "legislature": "15",
      "typeOrgane": "DELEG",
      "dateDebut": "2017-07-12T02:00:00.000+02:00",
      "datePublication": "2017-07-12T02:00:00.000+02:00",
      "preseance": "20",
      "nominPrincipale": "0",
      "infosQualite": {
        "codeQualite": "Membre",
        "libQualite": "Membre",
        "libQualiteSex": "Membre"
      },
      "organesRefs": [
        "PO201269"
      ]
    },
    {
      "xsiType": "MandatSimple_Type",
      "uid": "PM732721",
      "acteurRef": "PA719632",
      "legislature": "15",
      "typeOrgane": "DELEG",
      "dateDebut": "2017-07-12T02:00:00.000+02:00",
      "datePublication": "2017-07-13T02:00:00.000+02:00",
      "preseance": "14",
      "nominPrincipale": "1",
      "infosQualite": {
        "codeQualite": "Secrétaire",
        "libQualite": "Secrétaire",
        "libQualiteSex": "Secrétaire"
      },
      "organesRefs": [
        "PO201269"
      ]
    },
    {
      "xsiType": "MandatSimple_Type",
      "uid": "PM736549",
      "acteurRef": "PA719632",
      "legislature": "15",
      "typeOrgane": "GA",
      "dateDebut": "2017-10-02T02:00:00.000+02:00",
      "preseance": "20",
      "nominPrincipale": "1",
      "infosQualite": {
        "codeQualite": "Membre",
        "libQualite": "Membre",
        "libQualiteSex": "Membre"
      },
      "organesRefs": [
        "PO733492"
      ]
    },
    {
      "xsiType": "MandatSimple_Type",
      "uid": "PM743728",
      "acteurRef": "PA719632",
      "legislature": "15",
      "typeOrgane": "ORGEXTPARL",
      "dateDebut": "2017-11-21T01:00:00.000+01:00",
      "datePublication": "2017-11-22T01:00:00.000+01:00",
      "preseance": "20",
      "nominPrincipale": "1",
      "infosQualite": {
        "codeQualite": "Titulaire",
        "libQualite": "Membre titulaire",
        "libQualiteSex": "Membre titulaire"
      },
      "organesRefs": [
        "PO429559"
      ]
    },
    {
      "xsiType": "MandatSimple_Type",
      "uid": "PM751075",
      "acteurRef": "PA719632",
      "legislature": "15",
      "typeOrgane": "GE",
      "dateDebut": "2018-02-19T01:00:00.000+01:00",
      "preseance": "20",
      "nominPrincipale": "0",
      "infosQualite": {
        "codeQualite": "Membre",
        "libQualite": "Membre",
        "libQualiteSex": "Membre"
      },
      "organesRefs": [
        "PO746832"
      ]
    },
    {
      "xsiType": "MandatSimple_Type",
      "uid": "PM752719",
      "acteurRef": "PA719632",
      "legislature": "15",
      "typeOrgane": "GE",
      "dateDebut": "2018-03-07T01:00:00.000+01:00",
      "preseance": "12",
      "nominPrincipale": "1",
      "infosQualite": {
        "codeQualite": "Secrétaire",
        "libQualite": "Secrétaire",
        "libQualiteSex": "Secrétaire"
      },
      "organesRefs": [
        "PO746832"
      ]
    },
    {
      "xsiType": "MandatSimple_Type",
      "uid": "PM753403",
      "acteurRef": "PA719632",
      "legislature": "15",
      "typeOrgane": "GE",
      "dateDebut": "2018-03-14T01:00:00.000+01:00",
      "preseance": "20",
      "nominPrincipale": "0",
      "infosQualite": {
        "codeQualite": "Membre",
        "libQualite": "Membre",
        "libQualiteSex": "Membre"
      },
      "organesRefs": [
        "PO747042"
      ]
    },
    {
      "xsiType": "MandatSimple_Type",
      "uid": "PM753713",
      "acteurRef": "PA719632",
      "legislature": "15",
      "typeOrgane": "GE",
      "dateDebut": "2018-03-15T01:00:00.000+01:00",
      "preseance": "8",
      "nominPrincipale": "1",
      "infosQualite": {
        "codeQualite": "Vice-Président",
        "libQualite": "Vice-Président",
        "libQualiteSex": "Vice-Présidente"
      },
      "organesRefs": [
        "PO747042"
      ]
    },
    {
      "xsiType": "MandatSimple_Type",
      "uid": "PM755817",
      "acteurRef": "PA719632",
      "legislature": "15",
      "typeOrgane": "GE",
      "dateDebut": "2018-04-17T02:00:00.000+02:00",
      "preseance": "20",
      "nominPrincipale": "1",
      "infosQualite": {
        "codeQualite": "Membre",
        "libQualite": "Membre",
        "libQualiteSex": "Membre"
      },
      "organesRefs": [
        "PO747114"
      ]
    },
    {
      "xsiType": "MandatSimple_Type",
      "uid": "PM761703",
      "acteurRef": "PA719632",
      "typeOrgane": "PARPOL",
      "dateDebut": "2018-12-01T01:00:00.000+01:00",
      "preseance": "5",
      "nominPrincipale": "1",
      "infosQualite": {
        "codeQualite": "Membre",
        "libQualite": "Membre",
        "libQualiteSex": "Membre"
      },
      "organesRefs": [
        "PO761294"
      ]
    }
  ]
}