{
  "xsiType": "OrganeParlementaire_Type",
  "uid": "PO760024",
  "codeType": "MISINFO",
  "libelle": "Mission d'information sur la France et le Moyen-Orient",
  "libelleEdition": "de la",
  "libelleAbrege": "La France et le Moyen-Orient",
  "libelleAbrev": "ORIENT",
  "viMoDe": {
    "dateDebut": "2018-10-17T02:00:00.000+02:00"
  },
  "organeParentRef": "PO59047",
  "regime": "5ème République",
  "legislature": "15",
  "secretariat": {}
}