{
  "xsiType": "OrganeExterne_Type",
  "uid": "PO684934",
  "codeType": "PARPOL",
  "libelle": "Parti radical de gauche",
  "libelleEdition": "Parti radical de gauche",
  "libelleAbrege": "Parti radical de gauche",
  "libelleAbrev": "PRG",
  "viMoDe": {}
}