{
  "xsiType": "OrganeParlementaire_Type",
  "uid": "PO766012",
  "codeType": "MISINFOPRE",
  "libelle": "Mission d'information sur l'adaptation de la politique familiale française aux défis du XXIe siècle",
  "libelleEdition": "de la mission d'information sur l'adaptation de la politique familiale française aux défis du XXIe siècle",
  "libelleAbrege": "Politique familiale française",
  "libelleAbrev": "POLFAMF",
  "viMoDe": {
    "dateDebut": "2019-06-25T02:00:00.000+02:00"
  },
  "regime": "5ème République",
  "legislature": "15",
  "secretariat": {}
}