{
  "xsiType": "OrganeParlementaireInternational",
  "uid": "PO733402",
  "codeType": "GA",
  "libelle": "France-Guinée-Bissao",
  "libelleEdition": "de France-Guinée-Bissao",
  "libelleAbrege": "Guinée-Bissao",
  "libelleAbrev": "GUINB",
  "viMoDe": {
    "dateAgrement": "2017-07-19T02:00:00.000+02:00"
  },
  "regime": "5ème République",
  "legislature": "15",
  "secretariat": {
    "secretaire01": "Mme Bérengère Durand"
  }
}