{
  "uid": "PA702054",
  "etatCivil": {
    "ident": {
      "civ": "M.",
      "prenom": "Stéphane",
      "nom": "Claireaux",
      "alpha": "Claireaux",
      "trigramme": "SCL"
    },
    "infoNaissance": {
      "dateNais": "1964-06-23T01:00:00.000+01:00",
      "villeNais": "Saint-Pierre-et-Miquelon",
      "depNais": "Saint-Pierre-et-Miquelon",
      "paysNais": "France"
    }
  },
  "profession": {
    "libelleCourant": "Infographiste",
    "socProcInsee": {
      "catSocPro": "Commerçants et assimilés",
      "famSocPro": "Artisans, commerçants et chefs d'entreprise"
    }
  },
  "uriHatvp": "https://www.hatvp.fr/pages_nominatives/claireaux-stephane",
  "adresses": [
    {
      "xsiType": "AdressePostale_Type",
      "uid": "AD702057",
      "type": "0",
      "typeLibelle": "Adresse officielle",
      "poids": "1",
      "intitule": "Assemblée nationale",
      "numeroRue": "126",
      "nomRue": "Rue de l'Université",
      "codePostal": "75355",
      "ville": "Paris 07 SP"
    },
    {
      "xsiType": "AdressePostale_Type",
      "uid": "AD702669",
      "type": "2",
      "typeLibelle": "Adresse publiée de circonscription",
      "poids": "22",
      "intitule": "Permanence parlementaire",
      "numeroRue": "7",
      "nomRue": "Rue René Autin",
      "complementAdresse": "BP 4477",
      "codePostal": "97500",
      "ville": "Saint-Pierre-et-Miquelon"
    },
    {
      "xsiType": "AdresseTelephonique_Type",
      "uid": "AD702670",
      "type": "11",
      "typeLibelle": "Téléphone",
      "poids": "22",
      "adresseDeRattachement": "AD702669",
      "valElec": "05 08 41 99 98"
    },
    {
      "xsiType": "AdresseMail_Type",
      "uid": "AD716107",
      "type": "15",
      "typeLibelle": "Mèl",
      "valElec": "stephane.claireaux@assemblee-nationale.fr"
    },
    {
      "xsiType": "AdresseMail_Type",
      "uid": "AD716108",
      "type": "15",
      "typeLibelle": "Mèl",
      "valElec": "contact@depute975.fr"
    },
    {
      "xsiType": "AdresseSiteWeb_Type",
      "uid": "AD733751",
      "type": "22",
      "typeLibelle": "Site internet",
      "valElec": "depute975.net"
    },
    {
      "xsiType": "AdresseSiteWeb_Type",
      "uid": "AD733753",
      "type": "25",
      "typeLibelle": "Facebook",
      "valElec": "depute975"
    },
    {
      "xsiType": "AdresseSiteWeb_Type",
      "uid": "AD733755",
      "type": "24",
      "typeLibelle": "Twitter",
      "valElec": "@sclaireaux"
    }
  ],
  "mandats": [
    {
      "xsiType": "MandatParlementaire_type",
      "uid": "PM733713",
      "acteurRef": "PA702054",
      "legislature": "15",
      "typeOrgane": "ASSEMBLEE",
      "dateDebut": "2017-06-18T02:00:00.000+02:00",
      "preseance": "50",
      "nominPrincipale": "1",
      "infosQualite": {
        "codeQualite": "membre",
        "libQualite": "membre",
        "libQualiteSex": "membre"
      },
      "organesRefs": [
        "PO717460"
      ],
      "election": {
        "lieu": {
          "region": "Saint-Pierre-et-Miquelon",
          "regionType": "Collectivités d'outre-mer et Nouvelle-Calédonie",
          "departement": "Saint-Pierre-et-Miquelon",
          "numDepartement": "975",
          "numCirco": "1"
        },
        "causeMandat": "remplacement d'un député nommé au Gouvernement",
        "refCirconscription": "PO718518"
      },
      "mandature": {
        "datePriseFonction": "2017-07-22T02:00:00.000+02:00",
        "premiereElection": "1",
        "placeHemicycle": "599"
      },
      "collaborateurs": [
        {
          "qualite": "M.",
          "prenom": "Matthew",
          "nom": "Reardon"
        },
        {
          "qualite": "Mme",
          "prenom": "Marie-Annick",
          "nom": "Vigneau"
        },
        {
          "qualite": "M.",
          "prenom": "Nasha",
          "nom": "Gagnebin-Weber"
        },
        {
          "qualite": "Mme",
          "prenom": "Caroline",
          "nom": "Le Bossé"
        }
      ]
    },
    {
      "xsiType": "MandatSimple_Type",
      "uid": "PM733734",
      "acteurRef": "PA702054",
      "legislature": "15",
      "typeOrgane": "GP",
      "dateDebut": "2017-07-23T02:00:00.000+02:00",
      "preseance": "20",
      "nominPrincipale": "1",
      "infosQualite": {
        "codeQualite": "Membre",
        "libQualite": "Membre du",
        "libQualiteSex": "Membre du"
      },
      "organesRefs": [
        "PO730964"
      ]
    },
    {
      "xsiType": "MandatSimple_Type",
      "uid": "PM733790",
      "acteurRef": "PA702054",
      "legislature": "15",
      "typeOrgane": "COMPER",
      "dateDebut": "2017-07-25T02:00:00.000+02:00",
      "datePublication": "2017-07-25T02:00:00.000+02:00",
      "preseance": "32",
      "nominPrincipale": "1",
      "infosQualite": {
        "codeQualite": "Membre",
        "libQualite": "Membre",
        "libQualiteSex": "Membre"
      },
      "organesRefs": [
        "PO419604"
      ]
    },
    {
      "xsiType": "MandatSimple_Type",
      "uid": "PM736048",
      "acteurRef": "PA702054",
      "legislature": "15",
      "typeOrgane": "GA",
      "dateDebut": "2017-09-29T02:00:00.000+02:00",
      "preseance": "20",
      "nominPrincipale": "1",
      "infosQualite": {
        "codeQualite": "Membre",
        "libQualite": "Membre",
        "libQualiteSex": "Membre"
      },
      "organesRefs": [
        "PO733072"
      ]
    },
    {
      "xsiType": "MandatSimple_Type",
      "uid": "PM736049",
      "acteurRef": "PA702054",
      "legislature": "15",
      "typeOrgane": "GA",
      "dateDebut": "2017-09-29T02:00:00.000+02:00",
      "preseance": "20",
      "nominPrincipale": "0",
      "infosQualite": {
        "codeQualite": "Membre",
        "libQualite": "Membre",
        "libQualiteSex": "Membre"
      },
      "organesRefs": [
        "PO733322"
      ]
    },
    {
      "xsiType": "MandatMission_Type",
      "uid": "PM741963",
      "acteurRef": "PA702054",
      "legislature": "15",
      "typeOrgane": "MISINFO",
      "dateDebut": "2017-09-27T02:00:00.000+02:00",
      "preseance": "10",
      "nominPrincipale": "1",
      "infosQualite": {
        "codeQualite": "Membre",
        "libQualite": "Membre",
        "libQualiteSex": "Membre"
      },
      "organesRefs": [
        "PO741916"
      ]
    },
    {
      "xsiType": "MandatSimple_Type",
      "uid": "PM742234",
      "acteurRef": "PA702054",
      "legislature": "15",
      "typeOrgane": "GA",
      "dateDebut": "2017-10-30T01:00:00.000+01:00",
      "preseance": "20",
      "nominPrincipale": "0",
      "infosQualite": {
        "codeQualite": "Membre",
        "libQualite": "Membre",
        "libQualiteSex": "Membre"
      },
      "organesRefs": [
        "PO733387"
      ]
    },
    {
      "xsiType": "MandatSimple_Type",
      "uid": "PM742595",
      "acteurRef": "PA702054",
      "legislature": "15",
      "typeOrgane": "GA",
      "dateDebut": "2017-11-07T01:00:00.000+01:00",
      "preseance": "8",
      "nominPrincipale": "1",
      "infosQualite": {
        "codeQualite": "Vice-Président",
        "libQualite": "Vice-Président",
        "libQualiteSex": "Vice-Président"
      },
      "organesRefs": [
        "PO733322"
      ]
    },
    {
      "xsiType": "MandatSimple_Type",
      "uid": "PM744010",
      "acteurRef": "PA702054",
      "legislature": "15",
      "typeOrgane": "DELEG",
      "dateDebut": "2017-11-24T01:00:00.000+01:00",
      "datePublication": "2017-11-24T01:00:00.000+01:00",
      "preseance": "20",
      "nominPrincipale": "1",
      "infosQualite": {
        "codeQualite": "Membre",
        "libQualite": "Membre",
        "libQualiteSex": "Membre"
      },
      "organesRefs": [
        "PO675659"
      ]
    },
    {
      "xsiType": "MandatSimple_Type",
      "uid": "PM744871",
      "acteurRef": "PA702054",
      "typeOrgane": "PARPOL",
      "dateDebut": "2017-12-01T01:00:00.000+01:00",
      "preseance": "5",
      "nominPrincipale": "1",
      "infosQualite": {
        "codeQualite": "Membre",
        "libQualite": "Membre",
        "libQualiteSex": "Membre"
      },
      "organesRefs": [
        "PO685813"
      ]
    },
    {
      "xsiType": "MandatSimple_Type",
      "uid": "PM751096",
      "acteurRef": "PA702054",
      "legislature": "15",
      "typeOrgane": "GE",
      "dateDebut": "2018-02-21T01:00:00.000+01:00",
      "preseance": "20",
      "nominPrincipale": "0",
      "infosQualite": {
        "codeQualite": "Membre",
        "libQualite": "Membre",
        "libQualiteSex": "Membre"
      },
      "organesRefs": [
        "PO746832"
      ]
    },
    {
      "xsiType": "MandatSimple_Type",
      "uid": "PM752712",
      "acteurRef": "PA702054",
      "legislature": "15",
      "typeOrgane": "GE",
      "dateDebut": "2018-03-07T01:00:00.000+01:00",
      "preseance": "8",
      "nominPrincipale": "1",
      "infosQualite": {
        "codeQualite": "Vice-Président",
        "libQualite": "Vice-Président",
        "libQualiteSex": "Vice-Président"
      },
      "organesRefs": [
        "PO746832"
      ]
    },
    {
      "xsiType": "MandatSimple_Type",
      "uid": "PM754271",
      "acteurRef": "PA702054",
      "legislature": "15",
      "typeOrgane": "GA",
      "dateDebut": "2017-11-21T01:00:00.000+01:00",
      "preseance": "8",
      "nominPrincipale": "1",
      "infosQualite": {
        "codeQualite": "Vice-Président",
        "libQualite": "Vice-Président",
        "libQualiteSex": "Vice-Président"
      },
      "organesRefs": [
        "PO733387"
      ]
    },
    {
      "xsiType": "MandatSimple_Type",
      "uid": "PM755325",
      "acteurRef": "PA702054",
      "legislature": "15",
      "typeOrgane": "GE",
      "dateDebut": "2018-04-11T02:00:00.000+02:00",
      "preseance": "20",
      "nominPrincipale": "1",
      "infosQualite": {
        "codeQualite": "Membre",
        "libQualite": "Membre",
        "libQualiteSex": "Membre"
      },
      "organesRefs": [
        "PO746634"
      ]
    },
    {
      "xsiType": "MandatSimple_Type",
      "uid": "PM756085",
      "acteurRef": "PA702054",
      "legislature": "15",
      "typeOrgane": "GE",
      "dateDebut": "2018-05-15T02:00:00.000+02:00",
      "preseance": "20",
      "nominPrincipale": "0",
      "infosQualite": {
        "codeQualite": "Membre",
        "libQualite": "Membre",
        "libQualiteSex": "Membre"
      },
      "organesRefs": [
        "PO746967"
      ]
    },
    {
      "xsiType": "MandatSimple_Type",
      "uid": "PM762046",
      "acteurRef": "PA702054",
      "legislature": "15",
      "typeOrgane": "GE",
      "dateDebut": "2019-01-15T01:00:00.000+01:00",
      "preseance": "8",
      "nominPrincipale": "1",
      "infosQualite": {
        "codeQualite": "Vice-Président",
        "libQualite": "Vice-Président",
        "libQualiteSex": "Vice-Président"
      },
      "organesRefs": [
        "PO746967"
      ]
    },
    {
      "xsiType": "MandatSimple_Type",
      "uid": "PM765061",
      "acteurRef": "PA702054",
      "legislature": "15",
      "typeOrgane": "GE",
      "dateDebut": "2019-05-13T02:00:00.000+02:00",
      "preseance": "20",
      "nominPrincipale": "1",
      "infosQualite": {
        "codeQualite": "Membre",
        "libQualite": "Membre",
        "libQualiteSex": "Membre"
      },
      "organesRefs": [
        "PO763269"
      ]
    },
    {
      "xsiType": "MandatSimple_Type",
      "uid": "PM766727",
      "acteurRef": "PA702054",
      "legislature": "15",
      "typeOrgane": "GEVI",
      "dateDebut": "2019-07-24T02:00:00.000+02:00",
      "preseance": "20",
      "nominPrincipale": "1",
      "infosQualite": {
        "codeQualite": "Membre",
        "libQualite": "Membre",
        "libQualiteSex": "Membre"
      },
      "organesRefs": [
        "PO733622"
      ]
    }
  ]
}