{
  "uid": "PA267260",
  "etatCivil": {
    "ident": {
      "civ": "Mme",
      "prenom": "Bérengère",
      "nom": "Poletti",
      "alpha": "Poletti",
      "trigramme": "BPO"
    },
    "infoNaissance": {
      "dateNais": "1959-10-14T01:00:00.000+01:00",
      "villeNais": "Biencourt-sur-Orge",
      "depNais": "Meuse",
      "paysNais": "France"
    }
  },
  "profession": {
    "libelleCourant": "Sage-femme",
    "socProcInsee": {
      "catSocPro": "Professions intermédiaires de l'enseignement, de la santé, de la fonction publique et assimilés",
      "famSocPro": "Professions Intermédiaires"
    }
  },
  "uriHatvp": "https://www.hatvp.fr/pages_nominatives/poletti-berengere",
  "adresses": [
    {
      "xsiType": "AdressePostale_Type",
      "uid": "AD386607",
      "type": "0",
      "typeLibelle": "Adresse officielle",
      "poids": "1",
      "intitule": "Assemblée nationale,",
      "numeroRue": "126",
      "nomRue": "Rue de l'Université,",
      "codePostal": "75355",
      "ville": "Paris 07 SP"
    },
    {
      "xsiType": "AdresseMail_Type",
      "uid": "AD392004",
      "type": "15",
      "typeLibelle": "Mèl",
      "valElec": "berengere.poletti@assemblee-nationale.fr"
    },
    {
      "xsiType": "AdresseMail_Type",
      "uid": "AD725070",
      "type": "15",
      "typeLibelle": "Mèl",
      "valElec": "berengerepoletti08@wanadoo.fr"
    },
    {
      "xsiType": "AdresseSiteWeb_Type",
      "uid": "AD725128",
      "type": "24",
      "typeLibelle": "Twitter",
      "valElec": "@poletti_b"
    },
    {
      "xsiType": "AdressePostale_Type",
      "uid": "AD725338",
      "type": "2",
      "typeLibelle": "Adresse publiée de circonscription",
      "poids": "22",
      "intitule": "Permanence parlementaire",
      "numeroRue": "21",
      "nomRue": "Avenue du Maréchal Leclerc",
      "codePostal": "08000",
      "ville": "Charleville-Mézières"
    },
    {
      "xsiType": "AdresseTelephonique_Type",
      "uid": "AD725340",
      "type": "11",
      "typeLibelle": "Téléphone",
      "poids": "22",
      "adresseDeRattachement": "AD725338",
      "valElec": "03 24 32 49 81"
    }
  ],
  "mandats": [
    {
      "xsiType": "MandatParlementaire_type",
      "uid": "PM722476",
      "acteurRef": "PA267260",
      "legislature": "15",
      "typeOrgane": "ASSEMBLEE",
      "dateDebut": "2017-06-18T02:00:00.000+02:00",
      "preseance": "50",
      "nominPrincipale": "1",
      "infosQualite": {
        "codeQualite": "membre",
        "libQualite": "membre",
        "libQualiteSex": "membre"
      },
      "organesRefs": [
        "PO717460"
      ],
      "suppleant": {
        "dateDebut": "2017-06-18T02:00:00.000+02:00",
        "suppleantRef": "PA718846"
      },
      "election": {
        "lieu": {
          "region": "Grand Est",
          "regionType": "Métropolitain",
          "departement": "Ardennes",
          "numDepartement": "08",
          "numCirco": "1"
        },
        "causeMandat": "élections générales",
        "refCirconscription": "PO717536"
      },
      "mandature": {
        "datePriseFonction": "2017-06-21T02:00:00.000+02:00",
        "premiereElection": "1",
        "placeHemicycle": "022"
      },
      "collaborateurs": [
        {
          "qualite": "Mme",
          "prenom": "Brigitte",
          "nom": "Audoux"
        },
        {
          "qualite": "Mme",
          "prenom": "Else",
          "nom": "Joseph"
        },
        {
          "qualite": "Mme",
          "prenom": "Marie-Pierre",
          "nom": "Soly"
        },
        {
          "qualite": "Mme",
          "prenom": "Roxane",
          "nom": "Beguet"
        },
        {
          "qualite": "M.",
          "prenom": "Abdouragim",
          "nom": "Yangiev"
        }
      ]
    },
    {
      "xsiType": "MandatSimple_Type",
      "uid": "PM731336",
      "acteurRef": "PA267260",
      "legislature": "15",
      "typeOrgane": "GP",
      "dateDebut": "2017-06-27T02:00:00.000+02:00",
      "datePublication": "2017-06-28T02:00:00.000+02:00",
      "preseance": "20",
      "nominPrincipale": "1",
      "infosQualite": {
        "codeQualite": "Membre",
        "libQualite": "Membre du",
        "libQualiteSex": "Membre du"
      },
      "organesRefs": [
        "PO730934"
      ]
    },
    {
      "xsiType": "MandatSimple_Type",
      "uid": "PM731748",
      "acteurRef": "PA267260",
      "legislature": "15",
      "typeOrgane": "COMPER",
      "dateDebut": "2017-06-29T02:00:00.000+02:00",
      "datePublication": "2017-06-29T02:00:00.000+02:00",
      "preseance": "32",
      "nominPrincipale": "0",
      "infosQualite": {
        "codeQualite": "Membre",
        "libQualite": "Membre",
        "libQualiteSex": "Membre"
      },
      "organesRefs": [
        "PO59047"
      ]
    },
    {
      "xsiType": "MandatSimple_Type",
      "uid": "PM732281",
      "acteurRef": "PA267260",
      "legislature": "15",
      "typeOrgane": "COMPER",
      "dateDebut": "2017-06-30T02:00:00.000+02:00",
      "datePublication": "2017-06-30T02:00:00.000+02:00",
      "preseance": "16",
      "nominPrincipale": "1",
      "infosQualite": {
        "codeQualite": "Secrétaire",
        "libQualite": "Secrétaire",
        "libQualiteSex": "Secrétaire"
      },
      "organesRefs": [
        "PO59047"
      ]
    },
    {
      "xsiType": "MandatSimple_Type",
      "uid": "PM735057",
      "acteurRef": "PA267260",
      "legislature": "15",
      "typeOrgane": "ORGEXTPARL",
      "dateDebut": "2017-09-18T02:00:00.000+02:00",
      "datePublication": "2017-09-21T02:00:00.000+02:00",
      "preseance": "30",
      "nominPrincipale": "1",
      "infosQualite": {
        "codeQualite": "Suppléant",
        "libQualite": "Membre suppléant",
        "libQualiteSex": "Membre suppléante"
      },
      "organesRefs": [
        "PO60265"
      ]
    },
    {
      "xsiType": "MandatSimple_Type",
      "uid": "PM735179",
      "acteurRef": "PA267260",
      "legislature": "15",
      "typeOrgane": "GA",
      "dateDebut": "2017-09-26T02:00:00.000+02:00",
      "preseance": "20",
      "nominPrincipale": "0",
      "infosQualite": {
        "codeQualite": "Membre",
        "libQualite": "Membre",
        "libQualiteSex": "Membre"
      },
      "organesRefs": [
        "PO733302"
      ]
    },
    {
      "xsiType": "MandatSimple_Type",
      "uid": "PM735180",
      "acteurRef": "PA267260",
      "legislature": "15",
      "typeOrgane": "GA",
      "dateDebut": "2017-09-26T02:00:00.000+02:00",
      "preseance": "1",
      "nominPrincipale": "1",
      "infosQualite": {
        "codeQualite": "Président",
        "libQualite": "Président",
        "libQualiteSex": "Présidente"
      },
      "organesRefs": [
        "PO733302"
      ]
    },
    {
      "xsiType": "MandatSimple_Type",
      "uid": "PM739668",
      "acteurRef": "PA267260",
      "legislature": "15",
      "typeOrgane": "GA",
      "dateDebut": "2017-10-12T02:00:00.000+02:00",
      "preseance": "20",
      "nominPrincipale": "0",
      "infosQualite": {
        "codeQualite": "Membre",
        "libQualite": "Membre",
        "libQualiteSex": "Membre"
      },
      "organesRefs": [
        "PO733322"
      ]
    },
    {
      "xsiType": "MandatSimple_Type",
      "uid": "PM739669",
      "acteurRef": "PA267260",
      "legislature": "15",
      "typeOrgane": "GA",
      "dateDebut": "2017-10-12T02:00:00.000+02:00",
      "preseance": "20",
      "nominPrincipale": "0",
      "infosQualite": {
        "codeQualite": "Membre",
        "libQualite": "Membre",
        "libQualiteSex": "Membre"
      },
      "organesRefs": [
        "PO733487"
      ]
    },
    {
      "xsiType": "MandatSimple_Type",
      "uid": "PM741724",
      "acteurRef": "PA267260",
      "legislature": "15",
      "typeOrgane": "GA",
      "dateDebut": "2017-10-25T02:00:00.000+02:00",
      "preseance": "20",
      "nominPrincipale": "0",
      "infosQualite": {
        "codeQualite": "Membre",
        "libQualite": "Membre",
        "libQualiteSex": "Membre"
      },
      "organesRefs": [
        "PO733397"
      ]
    },
    {
      "xsiType": "MandatSimple_Type",
      "uid": "PM742249",
      "acteurRef": "PA267260",
      "legislature": "15",
      "typeOrgane": "GA",
      "dateDebut": "2017-10-31T01:00:00.000+01:00",
      "preseance": "20",
      "nominPrincipale": "0",
      "infosQualite": {
        "codeQualite": "Membre",
        "libQualite": "Membre",
        "libQualiteSex": "Membre"
      },
      "organesRefs": [
        "PO733497"
      ]
    },
    {
      "xsiType": "MandatSimple_Type",
      "uid": "PM742442",
      "acteurRef": "PA267260",
      "legislature": "15",
      "typeOrgane": "ORGEXTPARL",
      "dateDebut": "2017-11-02T01:00:00.000+01:00",
      "datePublication": "2017-11-03T01:00:00.000+01:00",
      "preseance": "20",
      "nominPrincipale": "1",
      "infosQualite": {
        "codeQualite": "Titulaire",
        "libQualite": "Membre titulaire",
        "libQualiteSex": "Membre titulaire"
      },
      "organesRefs": [
        "PO60276"
      ]
    },
    {
      "xsiType": "MandatSimple_Type",
      "uid": "PM742597",
      "acteurRef": "PA267260",
      "legislature": "15",
      "typeOrgane": "GA",
      "dateDebut": "2017-11-07T01:00:00.000+01:00",
      "preseance": "14",
      "nominPrincipale": "1",
      "infosQualite": {
        "codeQualite": "Secrétaire",
        "libQualite": "Secrétaire",
        "libQualiteSex": "Secrétaire"
      },
      "organesRefs": [
        "PO733322"
      ]
    },
    {
      "xsiType": "MandatSimple_Type",
      "uid": "PM742721",
      "acteurRef": "PA267260",
      "legislature": "15",
      "typeOrgane": "GA",
      "dateDebut": "2017-11-08T01:00:00.000+01:00",
      "preseance": "8",
      "nominPrincipale": "1",
      "infosQualite": {
        "codeQualite": "Vice-Président",
        "libQualite": "Vice-Président",
        "libQualiteSex": "Vice-Présidente"
      },
      "organesRefs": [
        "PO733397"
      ]
    },
    {
      "xsiType": "MandatSimple_Type",
      "uid": "PM743064",
      "acteurRef": "PA267260",
      "legislature": "15",
      "typeOrgane": "ORGEXTPARL",
      "dateDebut": "2017-11-10T01:00:00.000+01:00",
      "datePublication": "2017-11-11T01:00:00.000+01:00",
      "preseance": "20",
      "nominPrincipale": "1",
      "infosQualite": {
        "codeQualite": "Titulaire",
        "libQualite": "Membre titulaire",
        "libQualiteSex": "Membre titulaire"
      },
      "organesRefs": [
        "PO707219"
      ]
    },
    {
      "xsiType": "MandatSimple_Type",
      "uid": "PM745687",
      "acteurRef": "PA267260",
      "typeOrgane": "PARPOL",
      "dateDebut": "2017-12-01T01:00:00.000+01:00",
      "preseance": "5",
      "nominPrincipale": "1",
      "infosQualite": {
        "codeQualite": "Membre",
        "libQualite": "Membre",
        "libQualiteSex": "Membre"
      },
      "organesRefs": [
        "PO710396"
      ]
    },
    {
      "xsiType": "MandatSimple_Type",
      "uid": "PM745746",
      "acteurRef": "PA267260",
      "legislature": "15",
      "typeOrgane": "GA",
      "dateDebut": "2017-12-06T01:00:00.000+01:00",
      "preseance": "8",
      "nominPrincipale": "1",
      "infosQualite": {
        "codeQualite": "Vice-Président",
        "libQualite": "Vice-Président",
        "libQualiteSex": "Vice-Présidente"
      },
      "organesRefs": [
        "PO733487"
      ]
    },
    {
      "xsiType": "MandatSimple_Type",
      "uid": "PM747872",
      "acteurRef": "PA267260",
      "legislature": "15",
      "typeOrgane": "ORGEXTPARL",
      "dateDebut": "2018-01-10T01:00:00.000+01:00",
      "datePublication": "2018-01-11T01:00:00.000+01:00",
      "preseance": "20",
      "nominPrincipale": "1",
      "infosQualite": {
        "codeQualite": "Titulaire",
        "libQualite": "Membre titulaire",
        "libQualiteSex": "Membre titulaire"
      },
      "organesRefs": [
        "PO717436"
      ]
    },
    {
      "xsiType": "MandatSimple_Type",
      "uid": "PM748225",
      "acteurRef": "PA267260",
      "legislature": "15",
      "typeOrgane": "GA",
      "dateDebut": "2017-12-13T01:00:00.000+01:00",
      "preseance": "14",
      "nominPrincipale": "1",
      "infosQualite": {
        "codeQualite": "Secrétaire",
        "libQualite": "Secrétaire",
        "libQualiteSex": "Secrétaire"
      },
      "organesRefs": [
        "PO733497"
      ]
    },
    {
      "xsiType": "MandatSimple_Type",
      "uid": "PM748876",
      "acteurRef": "PA267260",
      "legislature": "15",
      "typeOrgane": "GE",
      "dateDebut": "2018-02-01T01:00:00.000+01:00",
      "preseance": "20",
      "nominPrincipale": "0",
      "infosQualite": {
        "codeQualite": "Membre",
        "libQualite": "Membre",
        "libQualiteSex": "Membre"
      },
      "organesRefs": [
        "PO746753"
      ]
    },
    {
      "xsiType": "MandatSimple_Type",
      "uid": "PM748877",
      "acteurRef": "PA267260",
      "legislature": "15",
      "typeOrgane": "GE",
      "dateDebut": "2018-02-01T01:00:00.000+01:00",
      "preseance": "4",
      "nominPrincipale": "1",
      "infosQualite": {
        "codeQualite": "Co-Président",
        "libQualite": "Co-Président",
        "libQualiteSex": "Co-Présidente"
      },
      "organesRefs": [
        "PO746753"
      ]
    },
    {
      "xsiType": "MandatSimple_Type",
      "uid": "PM749219",
      "acteurRef": "PA267260",
      "legislature": "15",
      "typeOrgane": "GE",
      "dateDebut": "2018-02-09T01:00:00.000+01:00",
      "preseance": "20",
      "nominPrincipale": "1",
      "infosQualite": {
        "codeQualite": "Membre",
        "libQualite": "Membre",
        "libQualiteSex": "Membre"
      },
      "organesRefs": [
        "PO746925"
      ]
    },
    {
      "xsiType": "MandatSimple_Type",
      "uid": "PM749275",
      "acteurRef": "PA267260",
      "legislature": "15",
      "typeOrgane": "GE",
      "dateDebut": "2018-02-09T01:00:00.000+01:00",
      "preseance": "20",
      "nominPrincipale": "1",
      "infosQualite": {
        "codeQualite": "Membre",
        "libQualite": "Membre",
        "libQualiteSex": "Membre"
      },
      "organesRefs": [
        "PO747266"
      ]
    },
    {
      "xsiType": "MandatSimple_Type",
      "uid": "PM750042",
      "acteurRef": "PA267260",
      "legislature": "15",
      "typeOrgane": "GA",
      "dateDebut": "2018-02-13T01:00:00.000+01:00",
      "preseance": "20",
      "nominPrincipale": "1",
      "infosQualite": {
        "codeQualite": "Membre",
        "libQualite": "Membre",
        "libQualiteSex": "Membre"
      },
      "organesRefs": [
        "PO733107"
      ]
    },
    {
      "xsiType": "MandatSimple_Type",
      "uid": "PM750785",
      "acteurRef": "PA267260",
      "legislature": "15",
      "typeOrgane": "GE",
      "dateDebut": "2018-02-16T01:00:00.000+01:00",
      "preseance": "20",
      "nominPrincipale": "0",
      "infosQualite": {
        "codeQualite": "Membre",
        "libQualite": "Membre",
        "libQualiteSex": "Membre"
      },
      "organesRefs": [
        "PO747072"
      ]
    },
    {
      "xsiType": "MandatSimple_Type",
      "uid": "PM751750",
      "acteurRef": "PA267260",
      "legislature": "15",
      "typeOrgane": "GE",
      "dateDebut": "2018-02-22T01:00:00.000+01:00",
      "preseance": "20",
      "nominPrincipale": "1",
      "infosQualite": {
        "codeQualite": "Membre",
        "libQualite": "Membre",
        "libQualiteSex": "Membre"
      },
      "organesRefs": [
        "PO746659"
      ]
    },
    {
      "xsiType": "MandatSimple_Type",
      "uid": "PM752081",
      "acteurRef": "PA267260",
      "legislature": "15",
      "typeOrgane": "GE",
      "dateDebut": "2018-02-27T01:00:00.000+01:00",
      "preseance": "20",
      "nominPrincipale": "1",
      "infosQualite": {
        "codeQualite": "Membre",
        "libQualite": "Membre",
        "libQualiteSex": "Membre"
      },
      "organesRefs": [
        "PO746618"
      ]
    },
    {
      "xsiType": "MandatSimple_Type",
      "uid": "PM752852",
      "acteurRef": "PA267260",
      "legislature": "15",
      "typeOrgane": "GE",
      "dateDebut": "2018-03-08T01:00:00.000+01:00",
      "preseance": "20",
      "nominPrincipale": "1",
      "infosQualite": {
        "codeQualite": "Membre",
        "libQualite": "Membre",
        "libQualiteSex": "Membre"
      },
      "organesRefs": [
        "PO746791"
      ]
    },
    {
      "xsiType": "MandatSimple_Type",
      "uid": "PM752994",
      "acteurRef": "PA267260",
      "legislature": "15",
      "typeOrgane": "GE",
      "dateDebut": "2018-03-08T01:00:00.000+01:00",
      "preseance": "20",
      "nominPrincipale": "0",
      "infosQualite": {
        "codeQualite": "Membre",
        "libQualite": "Membre",
        "libQualiteSex": "Membre"
      },
      "organesRefs": [
        "PO746806"
      ]
    },
    {
      "xsiType": "MandatSimple_Type",
      "uid": "PM753902",
      "acteurRef": "PA267260",
      "legislature": "15",
      "typeOrgane": "GE",
      "dateDebut": "2018-03-20T01:00:00.000+01:00",
      "preseance": "8",
      "nominPrincipale": "1",
      "infosQualite": {
        "codeQualite": "Vice-Président",
        "libQualite": "Vice-Président",
        "libQualiteSex": "Vice-Présidente"
      },
      "organesRefs": [
        "PO746806"
      ]
    },
    {
      "xsiType": "MandatSimple_Type",
      "uid": "PM755074",
      "acteurRef": "PA267260",
      "legislature": "15",
      "typeOrgane": "GE",
      "dateDebut": "2018-04-04T02:00:00.000+02:00",
      "preseance": "8",
      "nominPrincipale": "1",
      "infosQualite": {
        "codeQualite": "Vice-Président",
        "libQualite": "Vice-Président",
        "libQualiteSex": "Vice-Présidente"
      },
      "organesRefs": [
        "PO747072"
      ]
    },
    {
      "xsiType": "MandatSimple_Type",
      "uid": "PM755811",
      "acteurRef": "PA267260",
      "legislature": "15",
      "typeOrgane": "GE",
      "dateDebut": "2018-04-17T02:00:00.000+02:00",
      "preseance": "20",
      "nominPrincipale": "1",
      "infosQualite": {
        "codeQualite": "Membre",
        "libQualite": "Membre",
        "libQualiteSex": "Membre"
      },
      "organesRefs": [
        "PO747114"
      ]
    },
    {
      "xsiType": "MandatSimple_Type",
      "uid": "PM756270",
      "acteurRef": "PA267260",
      "legislature": "15",
      "typeOrgane": "GE",
      "dateDebut": "2018-05-24T02:00:00.000+02:00",
      "preseance": "20",
      "nominPrincipale": "1",
      "infosQualite": {
        "codeQualite": "Membre",
        "libQualite": "Membre",
        "libQualiteSex": "Membre"
      },
      "organesRefs": [
        "PO746669"
      ]
    },
    {
      "xsiType": "MandatSimple_Type",
      "uid": "PM758059",
      "acteurRef": "PA267260",
      "legislature": "15",
      "typeOrgane": "GE",
      "dateDebut": "2018-07-16T02:00:00.000+02:00",
      "preseance": "20",
      "nominPrincipale": "1",
      "infosQualite": {
        "codeQualite": "Membre",
        "libQualite": "Membre",
        "libQualiteSex": "Membre"
      },
      "organesRefs": [
        "PO747281"
      ]
    },
    {
      "xsiType": "MandatSimple_Type",
      "uid": "PM758335",
      "acteurRef": "PA267260",
      "legislature": "15",
      "typeOrgane": "GA",
      "dateDebut": "2018-07-24T02:00:00.000+02:00",
      "preseance": "20",
      "nominPrincipale": "1",
      "infosQualite": {
        "codeQualite": "Membre",
        "libQualite": "Membre",
        "libQualiteSex": "Membre"
      },
      "organesRefs": [
        "PO733532"
      ]
    },
    {
      "xsiType": "MandatSimple_Type",
      "uid": "PM758938",
      "acteurRef": "PA267260",
      "legislature": "15",
      "typeOrgane": "GA",
      "dateDebut": "2018-09-14T02:00:00.000+02:00",
      "preseance": "20",
      "nominPrincipale": "1",
      "infosQualite": {
        "codeQualite": "Membre",
        "libQualite": "Membre",
        "libQualiteSex": "Membre"
      },
      "organesRefs": [
        "PO733032"
      ]
    },
    {
      "xsiType": "MandatSimple_Type",
      "uid": "PM759020",
      "acteurRef": "PA267260",
      "legislature": "15",
      "typeOrgane": "GE",
      "dateDebut": "2018-09-24T02:00:00.000+02:00",
      "preseance": "20",
      "nominPrincipale": "1",
      "infosQualite": {
        "codeQualite": "Membre",
        "libQualite": "Membre",
        "libQualiteSex": "Membre"
      },
      "organesRefs": [
        "PO746920"
      ]
    },
    {
      "xsiType": "MandatSimple_Type",
      "uid": "PM759216",
      "acteurRef": "PA267260",
      "legislature": "15",
      "typeOrgane": "GA",
      "dateDebut": "2018-10-02T02:00:00.000+02:00",
      "preseance": "20",
      "nominPrincipale": "1",
      "infosQualite": {
        "codeQualite": "Membre",
        "libQualite": "Membre",
        "libQualiteSex": "Membre"
      },
      "organesRefs": [
        "PO733202"
      ]
    },
    {
      "xsiType": "MandatSimple_Type",
      "uid": "PM759931",
      "acteurRef": "PA267260",
      "legislature": "15",
      "typeOrgane": "GA",
      "dateDebut": "2018-10-18T02:00:00.000+02:00",
      "preseance": "20",
      "nominPrincipale": "1",
      "infosQualite": {
        "codeQualite": "Membre",
        "libQualite": "Membre",
        "libQualiteSex": "Membre"
      },
      "organesRefs": [
        "PO733537"
      ]
    },
    {
      "xsiType": "MandatSimple_Type",
      "uid": "PM761988",
      "acteurRef": "PA267260",
      "legislature": "15",
      "typeOrgane": "GEVI",
      "dateDebut": "2019-01-17T01:00:00.000+01:00",
      "preseance": "20",
      "nominPrincipale": "1",
      "infosQualite": {
        "codeQualite": "Membre",
        "libQualite": "Membre",
        "libQualiteSex": "Membre"
      },
      "organesRefs": [
        "PO733462"
      ]
    },
    {
      "xsiType": "MandatSimple_Type",
      "uid": "PM762358",
      "acteurRef": "PA267260",
      "legislature": "15",
      "typeOrgane": "DELEG",
      "dateDebut": "2019-01-31T01:00:00.000+01:00",
      "datePublication": "2019-01-31T01:00:00.000+01:00",
      "preseance": "20",
      "nominPrincipale": "1",
      "infosQualite": {
        "codeQualite": "Membre",
        "libQualite": "Membre",
        "libQualiteSex": "Membre"
      },
      "organesRefs": [
        "PO675659"
      ]
    },
    {
      "xsiType": "MandatMission_Type",
      "uid": "PM762782",
      "acteurRef": "PA267260",
      "legislature": "15",
      "typeOrgane": "MISINFO",
      "dateDebut": "2019-02-13T01:00:00.000+01:00",
      "preseance": "10",
      "nominPrincipale": "0",
      "infosQualite": {
        "codeQualite": "Membre",
        "libQualite": "Membre",
        "libQualiteSex": "Membre"
      },
      "organesRefs": [
        "PO762778"
      ]
    },
    {
      "xsiType": "MandatMission_Type",
      "uid": "PM762796",
      "acteurRef": "PA267260",
      "legislature": "15",
      "typeOrgane": "MISINFO",
      "dateDebut": "2019-02-13T01:00:00.000+01:00",
      "preseance": "5",
      "nominPrincipale": "1",
      "infosQualite": {
        "codeQualite": "Co-rapporteur",
        "libQualite": "Co-rapporteur",
        "libQualiteSex": "Co-rapporteure"
      },
      "organesRefs": [
        "PO762778"
      ]
    },
    {
      "xsiType": "MandatSimple_Type",
      "uid": "PM763359",
      "acteurRef": "PA267260",
      "legislature": "15",
      "typeOrgane": "ORGEXTPARL",
      "dateDebut": "2019-03-14T01:00:00.000+01:00",
      "datePublication": "2019-03-15T01:00:00.000+01:00",
      "preseance": "20",
      "nominPrincipale": "1",
      "infosQualite": {
        "codeQualite": "Titulaire",
        "libQualite": "Membre titulaire",
        "libQualiteSex": "Membre titulaire"
      },
      "organesRefs": [
        "PO763346"
      ]
    },
    {
      "xsiType": "MandatSimple_Type",
      "uid": "PM765364",
      "acteurRef": "PA267260",
      "legislature": "15",
      "typeOrgane": "GE",
      "dateDebut": "2019-05-29T02:00:00.000+02:00",
      "preseance": "20",
      "nominPrincipale": "1",
      "infosQualite": {
        "codeQualite": "Membre",
        "libQualite": "Membre",
        "libQualiteSex": "Membre"
      },
      "organesRefs": [
        "PO763264"
      ]
    }
  ]
}