{
  "uid": "PA1012",
  "etatCivil": {
    "ident": {
      "civ": "M.",
      "prenom": "Charles",
      "nom": "de la Verpillière",
      "alpha": "Verpilliere (de la)",
      "trigramme": "CDL"
    },
    "infoNaissance": {
      "dateNais": "1954-05-31T01:00:00.000+01:00",
      "villeNais": "Bourg-en-Bresse",
      "depNais": "Ain",
      "paysNais": "France"
    }
  },
  "profession": {
    "libelleCourant": "Conseiller d'État",
    "socProcInsee": {
      "catSocPro": "Cadres de la fonction publique, professions intellectuelles et  artistiques",
      "famSocPro": "Cadres et professions intellectuelles supérieures"
    }
  },
  "uriHatvp": "https://www.hatvp.fr/pages_nominatives/de-la-verpilliere-charles",
  "adresses": [
    {
      "xsiType": "AdresseMail_Type",
      "uid": "AD383361",
      "type": "15",
      "typeLibelle": "Mèl",
      "valElec": "charlesdelaverpilliere@orange.fr"
    },
    {
      "xsiType": "AdressePostale_Type",
      "uid": "AD386579",
      "type": "0",
      "typeLibelle": "Adresse officielle",
      "poids": "1",
      "intitule": "Assemblée nationale,",
      "numeroRue": "126",
      "nomRue": "Rue de l'Université,",
      "codePostal": "75355",
      "ville": "Paris 07 SP"
    },
    {
      "xsiType": "AdressePostale_Type",
      "uid": "AD394445",
      "type": "2",
      "typeLibelle": "Adresse publiée de circonscription",
      "poids": "22",
      "intitule": "Permanence parlementaire",
      "numeroRue": "4",
      "nomRue": "Rue du Docteur Mehier",
      "complementAdresse": "BP 49",
      "codePostal": "01152",
      "ville": "Lagnieu Cedex"
    },
    {
      "xsiType": "AdresseTelephonique_Type",
      "uid": "AD410277",
      "type": "11",
      "typeLibelle": "Téléphone",
      "poids": "22",
      "adresseDeRattachement": "AD394445",
      "valElec": "04 74 35 13 58"
    },
    {
      "xsiType": "AdresseSiteWeb_Type",
      "uid": "AD726568",
      "type": "25",
      "typeLibelle": "Facebook",
      "valElec": "charlesdelaverpilliere"
    },
    {
      "xsiType": "AdresseSiteWeb_Type",
      "uid": "AD726646",
      "type": "24",
      "typeLibelle": "Twitter",
      "valElec": "@delaverpilliere"
    },
    {
      "xsiType": "AdresseSiteWeb_Type",
      "uid": "AD726754",
      "type": "22",
      "typeLibelle": "Site internet",
      "valElec": "www.charlesdelaverpilliere.com"
    },
    {
      "xsiType": "AdresseMail_Type",
      "uid": "AD727911",
      "type": "15",
      "typeLibelle": "Mèl",
      "valElec": "charles.delaverpilliere@assemblee-nationale.fr"
    }
  ],
  "mandats": [
    {
      "xsiType": "MandatParlementaire_type",
      "uid": "PM722418",
      "acteurRef": "PA1012",
      "legislature": "15",
      "typeOrgane": "ASSEMBLEE",
      "dateDebut": "2017-06-18T02:00:00.000+02:00",
      "preseance": "50",
      "nominPrincipale": "1",
      "infosQualite": {
        "codeQualite": "membre",
        "libQualite": "membre",
        "libQualiteSex": "membre"
      },
      "organesRefs": [
        "PO717460"
      ],
      "suppleant": {
        "dateDebut": "2017-06-18T02:00:00.000+02:00",
        "suppleantRef": "PA718670"
      },
      "election": {
        "lieu": {
          "region": "Auvergne-Rhône-Alpes",
          "regionType": "Métropolitain",
          "departement": "Ain",
          "numDepartement": "01",
          "numCirco": "2"
        },
        "causeMandat": "élections générales",
        "refCirconscription": "PO717482"
      },
      "mandature": {
        "datePriseFonction": "2017-06-21T02:00:00.000+02:00",
        "premiereElection": "1",
        "placeHemicycle": "026"
      },
      "collaborateurs": [
        {
          "qualite": "Mme",
          "prenom": "Sabine",
          "nom": "Vasquez"
        },
        {
          "qualite": "Mme",
          "prenom": "Edwige",
          "nom": "Lafayolle de la Bruyère"
        },
        {
          "qualite": "Mme",
          "prenom": "Aurélie",
          "nom": "Richard"
        }
      ]
    },
    {
      "xsiType": "MandatSimple_Type",
      "uid": "PM731332",
      "acteurRef": "PA1012",
      "legislature": "15",
      "typeOrgane": "GP",
      "dateDebut": "2017-06-27T02:00:00.000+02:00",
      "datePublication": "2017-06-28T02:00:00.000+02:00",
      "preseance": "20",
      "nominPrincipale": "1",
      "infosQualite": {
        "codeQualite": "Membre",
        "libQualite": "Membre du",
        "libQualiteSex": "Membre du"
      },
      "organesRefs": [
        "PO730934"
      ]
    },
    {
      "xsiType": "MandatSimple_Type",
      "uid": "PM731705",
      "acteurRef": "PA1012",
      "legislature": "15",
      "typeOrgane": "COMPER",
      "dateDebut": "2017-06-29T02:00:00.000+02:00",
      "datePublication": "2017-06-29T02:00:00.000+02:00",
      "preseance": "32",
      "nominPrincipale": "0",
      "infosQualite": {
        "codeQualite": "Membre",
        "libQualite": "Membre",
        "libQualiteSex": "Membre"
      },
      "organesRefs": [
        "PO59046"
      ]
    },
    {
      "xsiType": "MandatSimple_Type",
      "uid": "PM732326",
      "acteurRef": "PA1012",
      "legislature": "15",
      "typeOrgane": "COMPER",
      "dateDebut": "2017-06-30T02:00:00.000+02:00",
      "datePublication": "2017-06-30T02:00:00.000+02:00",
      "preseance": "8",
      "nominPrincipale": "1",
      "infosQualite": {
        "codeQualite": "Vice-Président",
        "libQualite": "Vice-président",
        "libQualiteSex": "Vice-président"
      },
      "organesRefs": [
        "PO59046"
      ]
    },
    {
      "xsiType": "MandatSimple_Type",
      "uid": "PM735157",
      "acteurRef": "PA1012",
      "legislature": "15",
      "typeOrgane": "GA",
      "dateDebut": "2017-09-26T02:00:00.000+02:00",
      "preseance": "20",
      "nominPrincipale": "0",
      "infosQualite": {
        "codeQualite": "Membre",
        "libQualite": "Membre",
        "libQualiteSex": "Membre"
      },
      "organesRefs": [
        "PO733703"
      ]
    },
    {
      "xsiType": "MandatSimple_Type",
      "uid": "PM735158",
      "acteurRef": "PA1012",
      "legislature": "15",
      "typeOrgane": "GA",
      "dateDebut": "2017-09-26T02:00:00.000+02:00",
      "preseance": "1",
      "nominPrincipale": "1",
      "infosQualite": {
        "codeQualite": "Président",
        "libQualite": "Président",
        "libQualiteSex": "Président"
      },
      "organesRefs": [
        "PO733703"
      ]
    },
    {
      "xsiType": "MandatSimple_Type",
      "uid": "PM736876",
      "acteurRef": "PA1012",
      "legislature": "15",
      "typeOrgane": "GA",
      "dateDebut": "2017-10-03T02:00:00.000+02:00",
      "preseance": "20",
      "nominPrincipale": "1",
      "infosQualite": {
        "codeQualite": "Membre",
        "libQualite": "Membre",
        "libQualiteSex": "Membre"
      },
      "organesRefs": [
        "PO733137"
      ]
    },
    {
      "xsiType": "MandatSimple_Type",
      "uid": "PM736877",
      "acteurRef": "PA1012",
      "legislature": "15",
      "typeOrgane": "GEVI",
      "dateDebut": "2017-10-03T02:00:00.000+02:00",
      "preseance": "20",
      "nominPrincipale": "1",
      "infosQualite": {
        "codeQualite": "Membre",
        "libQualite": "Membre",
        "libQualiteSex": "Membre"
      },
      "organesRefs": [
        "PO733217"
      ]
    },
    {
      "xsiType": "MandatSimple_Type",
      "uid": "PM738221",
      "acteurRef": "PA1012",
      "legislature": "15",
      "typeOrgane": "GA",
      "dateDebut": "2017-10-09T02:00:00.000+02:00",
      "preseance": "20",
      "nominPrincipale": "1",
      "infosQualite": {
        "codeQualite": "Membre",
        "libQualite": "Membre",
        "libQualiteSex": "Membre"
      },
      "organesRefs": [
        "PO732984"
      ]
    },
    {
      "xsiType": "MandatSimple_Type",
      "uid": "PM738222",
      "acteurRef": "PA1012",
      "legislature": "15",
      "typeOrgane": "GA",
      "dateDebut": "2017-10-09T02:00:00.000+02:00",
      "preseance": "20",
      "nominPrincipale": "1",
      "infosQualite": {
        "codeQualite": "Membre",
        "libQualite": "Membre",
        "libQualiteSex": "Membre"
      },
      "organesRefs": [
        "PO733302"
      ]
    },
    {
      "xsiType": "MandatSimple_Type",
      "uid": "PM745752",
      "acteurRef": "PA1012",
      "typeOrgane": "PARPOL",
      "dateDebut": "2017-12-01T01:00:00.000+01:00",
      "preseance": "5",
      "nominPrincipale": "1",
      "infosQualite": {
        "codeQualite": "Membre",
        "libQualite": "Membre",
        "libQualiteSex": "Membre"
      },
      "organesRefs": [
        "PO710396"
      ]
    },
    {
      "xsiType": "MandatSimple_Type",
      "uid": "PM747862",
      "acteurRef": "PA1012",
      "legislature": "15",
      "typeOrgane": "ORGEXTPARL",
      "dateDebut": "2018-01-10T01:00:00.000+01:00",
      "datePublication": "2018-01-11T01:00:00.000+01:00",
      "preseance": "20",
      "nominPrincipale": "1",
      "infosQualite": {
        "codeQualite": "Titulaire",
        "libQualite": "Membre titulaire",
        "libQualiteSex": "Membre titulaire"
      },
      "organesRefs": [
        "PO717436"
      ]
    },
    {
      "xsiType": "MandatSimple_Type",
      "uid": "PM748894",
      "acteurRef": "PA1012",
      "legislature": "15",
      "typeOrgane": "GE",
      "dateDebut": "2018-02-01T01:00:00.000+01:00",
      "preseance": "20",
      "nominPrincipale": "0",
      "infosQualite": {
        "codeQualite": "Membre",
        "libQualite": "Membre",
        "libQualiteSex": "Membre"
      },
      "organesRefs": [
        "PO746957"
      ]
    },
    {
      "xsiType": "MandatSimple_Type",
      "uid": "PM748895",
      "acteurRef": "PA1012",
      "legislature": "15",
      "typeOrgane": "GE",
      "dateDebut": "2018-02-01T01:00:00.000+01:00",
      "preseance": "1",
      "nominPrincipale": "1",
      "infosQualite": {
        "codeQualite": "Président",
        "libQualite": "Président",
        "libQualiteSex": "Président"
      },
      "organesRefs": [
        "PO746957"
      ]
    },
    {
      "xsiType": "MandatSimple_Type",
      "uid": "PM750784",
      "acteurRef": "PA1012",
      "legislature": "15",
      "typeOrgane": "GE",
      "dateDebut": "2018-02-16T01:00:00.000+01:00",
      "preseance": "20",
      "nominPrincipale": "0",
      "infosQualite": {
        "codeQualite": "Membre",
        "libQualite": "Membre",
        "libQualiteSex": "Membre"
      },
      "organesRefs": [
        "PO746982"
      ]
    },
    {
      "xsiType": "MandatSimple_Type",
      "uid": "PM751664",
      "acteurRef": "PA1012",
      "legislature": "15",
      "typeOrgane": "GE",
      "dateDebut": "2018-02-22T01:00:00.000+01:00",
      "preseance": "20",
      "nominPrincipale": "1",
      "infosQualite": {
        "codeQualite": "Membre",
        "libQualite": "Membre",
        "libQualiteSex": "Membre"
      },
      "organesRefs": [
        "PO746669"
      ]
    },
    {
      "xsiType": "MandatSimple_Type",
      "uid": "PM755094",
      "acteurRef": "PA1012",
      "legislature": "15",
      "typeOrgane": "GE",
      "dateDebut": "2018-03-13T01:00:00.000+01:00",
      "preseance": "8",
      "nominPrincipale": "1",
      "infosQualite": {
        "codeQualite": "Vice-Président",
        "libQualite": "Vice-Président",
        "libQualiteSex": "Vice-Président"
      },
      "organesRefs": [
        "PO746982"
      ]
    },
    {
      "xsiType": "MandatSimple_Type",
      "uid": "PM765356",
      "acteurRef": "PA1012",
      "legislature": "15",
      "typeOrgane": "GE",
      "dateDebut": "2019-05-29T02:00:00.000+02:00",
      "preseance": "20",
      "nominPrincipale": "1",
      "infosQualite": {
        "codeQualite": "Membre",
        "libQualite": "Membre",
        "libQualiteSex": "Membre"
      },
      "organesRefs": [
        "PO763264"
      ]
    },
    {
      "xsiType": "MandatMission_Type",
      "uid": "PM767018",
      "acteurRef": "PA1012",
      "legislature": "15",
      "typeOrgane": "MISINFOPRE",
      "dateDebut": "2019-09-11T02:00:00.000+02:00",
      "datePublication": "2019-09-12T02:00:00.000+02:00",
      "preseance": "20",
      "nominPrincipale": "0",
      "infosQualite": {
        "codeQualite": "Membre",
        "libQualite": "Membre",
        "libQualiteSex": "Membre"
      },
      "organesRefs": [
        "PO766497"
      ]
    },
    {
      "xsiType": "MandatMission_Type",
      "uid": "PM767381",
      "acteurRef": "PA1012",
      "legislature": "15",
      "typeOrgane": "MISINFOPRE",
      "dateDebut": "2019-10-02T02:00:00.000+02:00",
      "datePublication": "2019-10-03T02:00:00.000+02:00",
      "preseance": "8",
      "nominPrincipale": "1",
      "infosQualite": {
        "codeQualite": "Secrétaire",
        "libQualite": "Secrétaire",
        "libQualiteSex": "Secrétaire"
      },
      "organesRefs": [
        "PO766497"
      ]
    }
  ]
}