{
  "uid": "PA719350",
  "etatCivil": {
    "ident": {
      "civ": "Mme",
      "prenom": "Marie",
      "nom": "Tamarelle-Verhaeghe",
      "alpha": "Tamarelle-Verhaeghe",
      "trigramme": "MTV"
    },
    "infoNaissance": {
      "dateNais": "1962-09-27T01:00:00.000+01:00",
      "villeNais": "Petit-Quevilly",
      "depNais": "Seine-Maritime",
      "paysNais": "France"
    }
  },
  "profession": {
    "libelleCourant": "Médecin",
    "socProcInsee": {
      "catSocPro": "Cadres de la fonction publique, professions intellectuelles et  artistiques",
      "famSocPro": "Cadres et professions intellectuelles supérieures"
    }
  },
  "uriHatvp": "https://www.hatvp.fr/pages_nominatives/tamarelle-verhaeghe-marie-8844",
  "adresses": [
    {
      "xsiType": "AdressePostale_Type",
      "uid": "AD719352",
      "type": "0",
      "typeLibelle": "Adresse officielle",
      "poids": "1",
      "intitule": "Assemblée nationale,",
      "numeroRue": "126",
      "nomRue": "Rue de l'Université,",
      "codePostal": "75355",
      "ville": "Paris 07 SP"
    },
    {
      "xsiType": "AdresseMail_Type",
      "uid": "AD728031",
      "type": "15",
      "typeLibelle": "Mèl",
      "valElec": "marie.tamarelle@assemblee-nationale.fr"
    },
    {
      "xsiType": "AdresseSiteWeb_Type",
      "uid": "AD730611",
      "type": "25",
      "typeLibelle": "Facebook",
      "valElec": "Marie-Tamarelle-Verhaeghe-En-Marche-Législatives-2017"
    },
    {
      "xsiType": "AdresseSiteWeb_Type",
      "uid": "AD730659",
      "type": "24",
      "typeLibelle": "Twitter",
      "valElec": "@marietamarelle"
    },
    {
      "xsiType": "AdresseSiteWeb_Type",
      "uid": "AD758801",
      "type": "22",
      "typeLibelle": "Site internet",
      "valElec": "marie-tamarelle.fr"
    },
    {
      "xsiType": "AdressePostale_Type",
      "uid": "AD760869",
      "type": "2",
      "typeLibelle": "Adresse publiée de circonscription",
      "poids": "2",
      "numeroRue": "16",
      "nomRue": "Place Louis Gillain",
      "codePostal": "27500",
      "ville": "Pont-Audemer"
    },
    {
      "xsiType": "AdresseTelephonique_Type",
      "uid": "AD760871",
      "type": "11",
      "typeLibelle": "Téléphone",
      "poids": "2",
      "adresseDeRattachement": "AD760869",
      "valElec": "0227367726"
    }
  ],
  "mandats": [
    {
      "xsiType": "MandatParlementaire_type",
      "uid": "PM722634",
      "acteurRef": "PA719350",
      "legislature": "15",
      "typeOrgane": "ASSEMBLEE",
      "dateDebut": "2017-06-18T02:00:00.000+02:00",
      "preseance": "50",
      "nominPrincipale": "1",
      "infosQualite": {
        "codeQualite": "membre",
        "libQualite": "membre",
        "libQualiteSex": "membre"
      },
      "organesRefs": [
        "PO717460"
      ],
      "suppleant": {
        "dateDebut": "2017-06-18T02:00:00.000+02:00",
        "suppleantRef": "PA719354"
      },
      "election": {
        "lieu": {
          "region": "Normandie",
          "regionType": "Métropolitain",
          "departement": "Eure",
          "numDepartement": "27",
          "numCirco": "3"
        },
        "causeMandat": "élections générales",
        "refCirconscription": "PO717698"
      },
      "mandature": {
        "datePriseFonction": "2017-06-21T02:00:00.000+02:00",
        "premiereElection": "0",
        "placeHemicycle": "224"
      },
      "collaborateurs": [
        {
          "qualite": "M.",
          "prenom": "Antonin",
          "nom": "Violette"
        },
        {
          "qualite": "M.",
          "prenom": "Arnaud",
          "nom": "Vidal"
        },
        {
          "qualite": "M.",
          "prenom": "Rémy",
          "nom": "Picard"
        }
      ]
    },
    {
      "xsiType": "MandatSimple_Type",
      "uid": "PM731035",
      "acteurRef": "PA719350",
      "legislature": "15",
      "typeOrgane": "GP",
      "dateDebut": "2017-06-27T02:00:00.000+02:00",
      "datePublication": "2017-06-28T02:00:00.000+02:00",
      "preseance": "20",
      "nominPrincipale": "1",
      "infosQualite": {
        "codeQualite": "Membre",
        "libQualite": "Membre du",
        "libQualiteSex": "Membre du"
      },
      "organesRefs": [
        "PO730964"
      ]
    },
    {
      "xsiType": "MandatSimple_Type",
      "uid": "PM732064",
      "acteurRef": "PA719350",
      "legislature": "15",
      "typeOrgane": "COMPER",
      "dateDebut": "2017-06-29T02:00:00.000+02:00",
      "datePublication": "2017-06-29T02:00:00.000+02:00",
      "preseance": "32",
      "nominPrincipale": "1",
      "infosQualite": {
        "codeQualite": "Membre",
        "libQualite": "Membre",
        "libQualiteSex": "Membre"
      },
      "organesRefs": [
        "PO420120"
      ]
    },
    {
      "xsiType": "MandatAvecSuppleant_Type",
      "uid": "PM732609",
      "acteurRef": "PA719350",
      "legislature": "15",
      "typeOrgane": "COMNL",
      "dateDebut": "2017-07-12T02:00:00.000+02:00",
      "datePublication": "2017-07-12T02:00:00.000+02:00",
      "preseance": "20",
      "nominPrincipale": "0",
      "infosQualite": {
        "codeQualite": "Membre",
        "libQualite": "Membre",
        "libQualiteSex": "Membre"
      },
      "organesRefs": [
        "PO420375"
      ]
    },
    {
      "xsiType": "MandatSimple_Type",
      "uid": "PM740414",
      "acteurRef": "PA719350",
      "legislature": "15",
      "typeOrgane": "GA",
      "dateDebut": "2017-10-17T02:00:00.000+02:00",
      "preseance": "20",
      "nominPrincipale": "0",
      "infosQualite": {
        "codeQualite": "Membre",
        "libQualite": "Membre",
        "libQualiteSex": "Membre"
      },
      "organesRefs": [
        "PO733512"
      ]
    },
    {
      "xsiType": "MandatSimple_Type",
      "uid": "PM740434",
      "acteurRef": "PA719350",
      "legislature": "15",
      "typeOrgane": "GA",
      "dateDebut": "2017-10-17T02:00:00.000+02:00",
      "preseance": "20",
      "nominPrincipale": "0",
      "infosQualite": {
        "codeQualite": "Membre",
        "libQualite": "Membre",
        "libQualiteSex": "Membre"
      },
      "organesRefs": [
        "PO733182"
      ]
    },
    {
      "xsiType": "MandatSimple_Type",
      "uid": "PM740649",
      "acteurRef": "PA719350",
      "legislature": "15",
      "typeOrgane": "GA",
      "dateDebut": "2017-10-20T02:00:00.000+02:00",
      "preseance": "20",
      "nominPrincipale": "1",
      "infosQualite": {
        "codeQualite": "Membre",
        "libQualite": "Membre",
        "libQualiteSex": "Membre"
      },
      "organesRefs": [
        "PO732974"
      ]
    },
    {
      "xsiType": "MandatSimple_Type",
      "uid": "PM743627",
      "acteurRef": "PA719350",
      "legislature": "15",
      "typeOrgane": "GA",
      "dateDebut": "2017-11-21T01:00:00.000+01:00",
      "preseance": "8",
      "nominPrincipale": "1",
      "infosQualite": {
        "codeQualite": "Vice-Président",
        "libQualite": "Vice-Président",
        "libQualiteSex": "Vice-Présidente"
      },
      "organesRefs": [
        "PO733512"
      ]
    },
    {
      "xsiType": "MandatSimple_Type",
      "uid": "PM747514",
      "acteurRef": "PA719350",
      "legislature": "15",
      "typeOrgane": "GA",
      "dateDebut": "2017-11-14T01:00:00.000+01:00",
      "preseance": "8",
      "nominPrincipale": "1",
      "infosQualite": {
        "codeQualite": "Vice-Président",
        "libQualite": "Vice-Président",
        "libQualiteSex": "Vice-Présidente"
      },
      "organesRefs": [
        "PO733182"
      ]
    },
    {
      "xsiType": "MandatSimple_Type",
      "uid": "PM748676",
      "acteurRef": "PA719350",
      "legislature": "15",
      "typeOrgane": "GE",
      "dateDebut": "2018-02-01T01:00:00.000+01:00",
      "preseance": "20",
      "nominPrincipale": "0",
      "infosQualite": {
        "codeQualite": "Membre",
        "libQualite": "Membre",
        "libQualiteSex": "Membre"
      },
      "organesRefs": [
        "PO747180"
      ]
    },
    {
      "xsiType": "MandatSimple_Type",
      "uid": "PM748677",
      "acteurRef": "PA719350",
      "legislature": "15",
      "typeOrgane": "GE",
      "dateDebut": "2018-02-01T01:00:00.000+01:00",
      "preseance": "1",
      "nominPrincipale": "1",
      "infosQualite": {
        "codeQualite": "Président",
        "libQualite": "Président",
        "libQualiteSex": "Présidente"
      },
      "organesRefs": [
        "PO747180"
      ]
    },
    {
      "xsiType": "MandatSimple_Type",
      "uid": "PM750471",
      "acteurRef": "PA719350",
      "legislature": "15",
      "typeOrgane": "GE",
      "dateDebut": "2018-02-14T01:00:00.000+01:00",
      "preseance": "20",
      "nominPrincipale": "1",
      "infosQualite": {
        "codeQualite": "Membre",
        "libQualite": "Membre",
        "libQualiteSex": "Membre"
      },
      "organesRefs": [
        "PO746925"
      ]
    },
    {
      "xsiType": "MandatSimple_Type",
      "uid": "PM750809",
      "acteurRef": "PA719350",
      "legislature": "15",
      "typeOrgane": "GE",
      "dateDebut": "2018-02-16T01:00:00.000+01:00",
      "preseance": "20",
      "nominPrincipale": "1",
      "infosQualite": {
        "codeQualite": "Membre",
        "libQualite": "Membre",
        "libQualiteSex": "Membre"
      },
      "organesRefs": [
        "PO746659"
      ]
    },
    {
      "xsiType": "MandatSimple_Type",
      "uid": "PM750946",
      "acteurRef": "PA719350",
      "legislature": "15",
      "typeOrgane": "GE",
      "dateDebut": "2018-02-19T01:00:00.000+01:00",
      "preseance": "20",
      "nominPrincipale": "1",
      "infosQualite": {
        "codeQualite": "Membre",
        "libQualite": "Membre",
        "libQualiteSex": "Membre"
      },
      "organesRefs": [
        "PO746880"
      ]
    },
    {
      "xsiType": "MandatSimple_Type",
      "uid": "PM751721",
      "acteurRef": "PA719350",
      "legislature": "15",
      "typeOrgane": "GE",
      "dateDebut": "2018-02-22T01:00:00.000+01:00",
      "preseance": "20",
      "nominPrincipale": "0",
      "infosQualite": {
        "codeQualite": "Membre",
        "libQualite": "Membre",
        "libQualiteSex": "Membre"
      },
      "organesRefs": [
        "PO746679"
      ]
    },
    {
      "xsiType": "MandatSimple_Type",
      "uid": "PM751859",
      "acteurRef": "PA719350",
      "legislature": "15",
      "typeOrgane": "GE",
      "dateDebut": "2018-02-14T01:00:00.000+01:00",
      "preseance": "20",
      "nominPrincipale": "0",
      "infosQualite": {
        "codeQualite": "Membre",
        "libQualite": "Membre",
        "libQualiteSex": "Membre"
      },
      "organesRefs": [
        "PO747140"
      ]
    },
    {
      "xsiType": "MandatSimple_Type",
      "uid": "PM752799",
      "acteurRef": "PA719350",
      "legislature": "15",
      "typeOrgane": "GE",
      "dateDebut": "2018-03-07T01:00:00.000+01:00",
      "preseance": "8",
      "nominPrincipale": "1",
      "infosQualite": {
        "codeQualite": "Vice-Président",
        "libQualite": "Vice-Président",
        "libQualiteSex": "Vice-Présidente"
      },
      "organesRefs": [
        "PO746679"
      ]
    },
    {
      "xsiType": "MandatSimple_Type",
      "uid": "PM753774",
      "acteurRef": "PA719350",
      "legislature": "15",
      "typeOrgane": "GE",
      "dateDebut": "2018-03-19T01:00:00.000+01:00",
      "preseance": "20",
      "nominPrincipale": "1",
      "infosQualite": {
        "codeQualite": "Membre",
        "libQualite": "Membre",
        "libQualiteSex": "Membre"
      },
      "organesRefs": [
        "PO747084"
      ]
    },
    {
      "xsiType": "MandatSimple_Type",
      "uid": "PM755962",
      "acteurRef": "PA719350",
      "legislature": "15",
      "typeOrgane": "GA",
      "dateDebut": "2018-05-02T02:00:00.000+02:00",
      "preseance": "20",
      "nominPrincipale": "1",
      "infosQualite": {
        "codeQualite": "Membre",
        "libQualite": "Membre",
        "libQualiteSex": "Membre"
      },
      "organesRefs": [
        "PO733637"
      ]
    },
    {
      "xsiType": "MandatSimple_Type",
      "uid": "PM756716",
      "acteurRef": "PA719350",
      "legislature": "15",
      "typeOrgane": "GE",
      "dateDebut": "2018-04-04T02:00:00.000+02:00",
      "preseance": "8",
      "nominPrincipale": "1",
      "infosQualite": {
        "codeQualite": "Vice-Président",
        "libQualite": "Vice-Président",
        "libQualiteSex": "Vice-Présidente"
      },
      "organesRefs": [
        "PO747140"
      ]
    },
    {
      "xsiType": "MandatSimple_Type",
      "uid": "PM761855",
      "acteurRef": "PA719350",
      "typeOrgane": "PARPOL",
      "dateDebut": "2018-12-01T01:00:00.000+01:00",
      "preseance": "5",
      "nominPrincipale": "1",
      "infosQualite": {
        "codeQualite": "Membre",
        "libQualite": "Membre",
        "libQualiteSex": "Membre"
      },
      "organesRefs": [
        "PO761294"
      ]
    },
    {
      "xsiType": "MandatAvecSuppleant_Type",
      "uid": "PM763288",
      "acteurRef": "PA719350",
      "legislature": "15",
      "typeOrgane": "COMNL",
      "dateDebut": "2019-03-14T01:00:00.000+01:00",
      "datePublication": "2019-03-15T01:00:00.000+01:00",
      "preseance": "8",
      "nominPrincipale": "1",
      "infosQualite": {
        "codeQualite": "Vice-Président",
        "libQualite": "Vice-Président",
        "libQualiteSex": "Vice-Présidente"
      },
      "organesRefs": [
        "PO420375"
      ]
    },
    {
      "xsiType": "MandatSimple_Type",
      "uid": "PM764526",
      "acteurRef": "PA719350",
      "legislature": "15",
      "typeOrgane": "GEVI",
      "dateDebut": "2019-04-09T02:00:00.000+02:00",
      "preseance": "20",
      "nominPrincipale": "1",
      "infosQualite": {
        "codeQualite": "Membre",
        "libQualite": "Membre",
        "libQualiteSex": "Membre"
      },
      "organesRefs": [
        "PO733462"
      ]
    },
    {
      "xsiType": "MandatSimple_Type",
      "uid": "PM766205",
      "acteurRef": "PA719350",
      "legislature": "15",
      "typeOrgane": "GE",
      "dateDebut": "2019-07-03T02:00:00.000+02:00",
      "preseance": "20",
      "nominPrincipale": "0",
      "infosQualite": {
        "codeQualite": "Membre",
        "libQualite": "Membre",
        "libQualiteSex": "Membre"
      },
      "organesRefs": [
        "PO763259"
      ]
    },
    {
      "xsiType": "MandatSimple_Type",
      "uid": "PM766208",
      "acteurRef": "PA719350",
      "legislature": "15",
      "typeOrgane": "GE",
      "dateDebut": "2019-07-03T02:00:00.000+02:00",
      "preseance": "8",
      "nominPrincipale": "1",
      "infosQualite": {
        "codeQualite": "Vice-Président",
        "libQualite": "Vice-Président",
        "libQualiteSex": "Vice-Présidente"
      },
      "organesRefs": [
        "PO763259"
      ]
    },
    {
      "xsiType": "MandatMission_Type",
      "uid": "PM766405",
      "acteurRef": "PA719350",
      "legislature": "15",
      "typeOrgane": "MISINFOPRE",
      "dateDebut": "2019-07-12T02:00:00.000+02:00",
      "datePublication": "2019-07-13T02:00:00.000+02:00",
      "preseance": "20",
      "nominPrincipale": "1",
      "infosQualite": {
        "codeQualite": "Membre",
        "libQualite": "Membre",
        "libQualiteSex": "Membre"
      },
      "organesRefs": [
        "PO766012"
      ]
    },
    {
      "xsiType": "MandatSimple_Type",
      "uid": "PM766802",
      "acteurRef": "PA719350",
      "legislature": "15",
      "typeOrgane": "CNPS",
      "dateDebut": "2019-07-24T02:00:00.000+02:00",
      "datePublication": "2019-07-25T02:00:00.000+02:00",
      "preseance": "20",
      "nominPrincipale": "1",
      "infosQualite": {
        "codeQualite": "Membre",
        "libQualite": "Membre",
        "libQualiteSex": "Membre"
      },
      "organesRefs": [
        "PO766718"
      ]
    },
    {
      "xsiType": "MandatMission_Type",
      "uid": "PM767004",
      "acteurRef": "PA719350",
      "legislature": "15",
      "typeOrgane": "MISINFOPRE",
      "dateDebut": "2019-09-11T02:00:00.000+02:00",
      "datePublication": "2019-09-12T02:00:00.000+02:00",
      "preseance": "20",
      "nominPrincipale": "0",
      "infosQualite": {
        "codeQualite": "Membre",
        "libQualite": "Membre",
        "libQualiteSex": "Membre"
      },
      "organesRefs": [
        "PO766497"
      ]
    },
    {
      "xsiType": "MandatMission_Type",
      "uid": "PM767383",
      "acteurRef": "PA719350",
      "legislature": "15",
      "typeOrgane": "MISINFOPRE",
      "dateDebut": "2019-10-02T02:00:00.000+02:00",
      "datePublication": "2019-10-03T02:00:00.000+02:00",
      "preseance": "8",
      "nominPrincipale": "1",
      "infosQualite": {
        "codeQualite": "Secrétaire",
        "libQualite": "Secrétaire",
        "libQualiteSex": "Secrétaire"
      },
      "organesRefs": [
        "PO766497"
      ]
    },
    {
      "xsiType": "MandatSimple_Type",
      "uid": "PM767961",
      "acteurRef": "PA719350",
      "legislature": "15",
      "typeOrgane": "ORGEXTPARL",
      "dateDebut": "2019-07-12T02:00:00.000+02:00",
      "datePublication": "2019-07-13T02:00:00.000+02:00",
      "preseance": "20",
      "nominPrincipale": "1",
      "infosQualite": {
        "codeQualite": "Titulaire",
        "libQualite": "Membre titulaire",
        "libQualiteSex": "Membre titulaire"
      },
      "organesRefs": [
        "PO767958"
      ]
    }
  ]
}