{
  "uid": "PA719684",
  "etatCivil": {
    "ident": {
      "civ": "Mme",
      "prenom": "Coralie",
      "nom": "Dubost",
      "alpha": "Dubost",
      "trigramme": "CDB"
    },
    "infoNaissance": {
      "dateNais": "1983-03-04T01:00:00.000+01:00",
      "villeNais": "Montpellier",
      "depNais": "Hérault",
      "paysNais": "France"
    }
  },
  "profession": {
    "libelleCourant": "Conseiller juridique",
    "socProcInsee": {
      "catSocPro": "Cadres d'entreprise",
      "famSocPro": "Cadres et professions intellectuelles supérieures"
    }
  },
  "uriHatvp": "https://www.hatvp.fr/pages_nominatives/dubost-coralie",
  "adresses": [
    {
      "xsiType": "AdressePostale_Type",
      "uid": "AD719686",
      "type": "0",
      "typeLibelle": "Adresse officielle",
      "poids": "1",
      "intitule": "Assemblée nationale,",
      "numeroRue": "126",
      "nomRue": "Rue de l'Université,",
      "codePostal": "75355",
      "ville": "Paris 07 SP"
    },
    {
      "xsiType": "AdresseMail_Type",
      "uid": "AD728067",
      "type": "15",
      "typeLibelle": "Mèl",
      "valElec": "coralie.dubost@assemblee-nationale.fr"
    },
    {
      "xsiType": "AdresseMail_Type",
      "uid": "AD730146",
      "type": "15",
      "typeLibelle": "Mèl",
      "valElec": "coralie.dubost@en-marche.fr"
    },
    {
      "xsiType": "AdressePostale_Type",
      "uid": "AD762061",
      "type": "2",
      "typeLibelle": "Adresse publiée de circonscription",
      "poids": "2",
      "numeroRue": "14",
      "nomRue": "Avenue Jean Jaurès",
      "codePostal": "34170",
      "ville": "Castelnau-le-Lez"
    }
  ],
  "mandats": [
    {
      "xsiType": "MandatParlementaire_type",
      "uid": "PM722730",
      "acteurRef": "PA719684",
      "legislature": "15",
      "typeOrgane": "ASSEMBLEE",
      "dateDebut": "2017-06-18T02:00:00.000+02:00",
      "preseance": "50",
      "nominPrincipale": "1",
      "infosQualite": {
        "codeQualite": "membre",
        "libQualite": "membre",
        "libQualiteSex": "membre"
      },
      "organesRefs": [
        "PO717460"
      ],
      "suppleant": {
        "dateDebut": "2017-06-18T02:00:00.000+02:00",
        "suppleantRef": "PA719688"
      },
      "election": {
        "lieu": {
          "region": "Occitanie",
          "regionType": "Métropolitain",
          "departement": "Hérault",
          "numDepartement": "34",
          "numCirco": "3"
        },
        "causeMandat": "élections générales",
        "refCirconscription": "PO717778"
      },
      "mandature": {
        "datePriseFonction": "2017-06-21T02:00:00.000+02:00",
        "premiereElection": "0",
        "placeHemicycle": "347"
      },
      "collaborateurs": [
        {
          "qualite": "M.",
          "prenom": "Guillaume",
          "nom": "Theret"
        },
        {
          "qualite": "M.",
          "prenom": "Stanislas",
          "nom": "Tanasijevic-Rabolt"
        },
        {
          "qualite": "M.",
          "prenom": "Guillaume",
          "nom": "Léger"
        },
        {
          "qualite": "Mme",
          "prenom": "Inès",
          "nom": "Abdelli"
        }
      ]
    },
    {
      "xsiType": "MandatSimple_Type",
      "uid": "PM731070",
      "acteurRef": "PA719684",
      "legislature": "15",
      "typeOrgane": "GP",
      "dateDebut": "2017-06-27T02:00:00.000+02:00",
      "datePublication": "2017-06-28T02:00:00.000+02:00",
      "preseance": "20",
      "nominPrincipale": "1",
      "infosQualite": {
        "codeQualite": "Membre",
        "libQualite": "Membre du",
        "libQualiteSex": "Membre du"
      },
      "organesRefs": [
        "PO730964"
      ]
    },
    {
      "xsiType": "MandatSimple_Type",
      "uid": "PM731842",
      "acteurRef": "PA719684",
      "legislature": "15",
      "typeOrgane": "COMPER",
      "dateDebut": "2017-06-29T02:00:00.000+02:00",
      "datePublication": "2017-06-29T02:00:00.000+02:00",
      "preseance": "32",
      "nominPrincipale": "0",
      "infosQualite": {
        "codeQualite": "Membre",
        "libQualite": "Membre",
        "libQualiteSex": "Membre"
      },
      "organesRefs": [
        "PO59051"
      ]
    },
    {
      "xsiType": "MandatSimple_Type",
      "uid": "PM735358",
      "acteurRef": "PA719684",
      "legislature": "15",
      "typeOrgane": "GA",
      "dateDebut": "2017-09-26T02:00:00.000+02:00",
      "preseance": "20",
      "nominPrincipale": "1",
      "infosQualite": {
        "codeQualite": "Membre",
        "libQualite": "Membre",
        "libQualiteSex": "Membre"
      },
      "organesRefs": [
        "PO733602"
      ]
    },
    {
      "xsiType": "MandatSimple_Type",
      "uid": "PM740509",
      "acteurRef": "PA719684",
      "legislature": "15",
      "typeOrgane": "GA",
      "dateDebut": "2017-10-18T02:00:00.000+02:00",
      "preseance": "20",
      "nominPrincipale": "0",
      "infosQualite": {
        "codeQualite": "Membre",
        "libQualite": "Membre",
        "libQualiteSex": "Membre"
      },
      "organesRefs": [
        "PO733117"
      ]
    },
    {
      "xsiType": "MandatAvecSuppleant_Type",
      "uid": "PM740684",
      "acteurRef": "PA719684",
      "legislature": "15",
      "typeOrgane": "COMNL",
      "dateDebut": "2017-10-21T02:00:00.000+02:00",
      "datePublication": "2017-10-22T02:00:00.000+02:00",
      "preseance": "20",
      "nominPrincipale": "1",
      "infosQualite": {
        "codeQualite": "Membre",
        "libQualite": "Membre",
        "libQualiteSex": "Membre"
      },
      "organesRefs": [
        "PO415287"
      ]
    },
    {
      "xsiType": "MandatSimple_Type",
      "uid": "PM740720",
      "acteurRef": "PA719684",
      "legislature": "15",
      "typeOrgane": "GA",
      "dateDebut": "2017-10-24T02:00:00.000+02:00",
      "preseance": "8",
      "nominPrincipale": "1",
      "infosQualite": {
        "codeQualite": "Vice-Président",
        "libQualite": "Vice-Président",
        "libQualiteSex": "Vice-Présidente"
      },
      "organesRefs": [
        "PO733117"
      ]
    },
    {
      "xsiType": "MandatSimple_Type",
      "uid": "PM750756",
      "acteurRef": "PA719684",
      "legislature": "15",
      "typeOrgane": "GE",
      "dateDebut": "2018-02-16T01:00:00.000+01:00",
      "preseance": "20",
      "nominPrincipale": "0",
      "infosQualite": {
        "codeQualite": "Membre",
        "libQualite": "Membre",
        "libQualiteSex": "Membre"
      },
      "organesRefs": [
        "PO747170"
      ]
    },
    {
      "xsiType": "MandatSimple_Type",
      "uid": "PM754931",
      "acteurRef": "PA719684",
      "legislature": "15",
      "typeOrgane": "GE",
      "dateDebut": "2018-02-20T01:00:00.000+01:00",
      "preseance": "8",
      "nominPrincipale": "1",
      "infosQualite": {
        "codeQualite": "Vice-Président",
        "libQualite": "Vice-Président",
        "libQualiteSex": "Vice-Présidente"
      },
      "organesRefs": [
        "PO747170"
      ]
    },
    {
      "xsiType": "MandatSimple_Type",
      "uid": "PM757058",
      "acteurRef": "PA719684",
      "legislature": "15",
      "typeOrgane": "ORGEXTPARL",
      "dateDebut": "2018-06-04T02:00:00.000+02:00",
      "datePublication": "2018-06-05T02:00:00.000+02:00",
      "preseance": "20",
      "nominPrincipale": "1",
      "infosQualite": {
        "codeQualite": "Titulaire",
        "libQualite": "Membre titulaire",
        "libQualiteSex": "Membre titulaire"
      },
      "organesRefs": [
        "PO756933"
      ]
    },
    {
      "xsiType": "MandatSimple_Type",
      "uid": "PM761465",
      "acteurRef": "PA719684",
      "typeOrgane": "PARPOL",
      "dateDebut": "2018-12-01T01:00:00.000+01:00",
      "preseance": "5",
      "nominPrincipale": "1",
      "infosQualite": {
        "codeQualite": "Membre",
        "libQualite": "Membre",
        "libQualiteSex": "Membre"
      },
      "organesRefs": [
        "PO761294"
      ]
    },
    {
      "xsiType": "MandatSimple_Type",
      "uid": "PM766788",
      "acteurRef": "PA719684",
      "legislature": "15",
      "typeOrgane": "CNPS",
      "dateDebut": "2019-07-24T02:00:00.000+02:00",
      "datePublication": "2019-07-25T02:00:00.000+02:00",
      "preseance": "20",
      "nominPrincipale": "0",
      "infosQualite": {
        "codeQualite": "Membre",
        "libQualite": "Membre",
        "libQualiteSex": "Membre"
      },
      "organesRefs": [
        "PO766718"
      ]
    },
    {
      "xsiType": "MandatSimple_Type",
      "uid": "PM766855",
      "acteurRef": "PA719684",
      "legislature": "15",
      "typeOrgane": "CNPS",
      "dateDebut": "2019-07-25T02:00:00.000+02:00",
      "datePublication": "2019-07-26T02:00:00.000+02:00",
      "preseance": "16",
      "nominPrincipale": "1",
      "infosQualite": {
        "codeQualite": "Rapporteur",
        "libQualite": "Rapporteur",
        "libQualiteSex": "Rapporteure"
      },
      "organesRefs": [
        "PO766718"
      ]
    },
    {
      "xsiType": "MandatSimple_Type",
      "uid": "PM767349",
      "acteurRef": "PA719684",
      "legislature": "15",
      "typeOrgane": "COMPER",
      "dateDebut": "2019-10-01T02:00:00.000+02:00",
      "datePublication": "2019-10-02T02:00:00.000+02:00",
      "preseance": "8",
      "nominPrincipale": "1",
      "infosQualite": {
        "codeQualite": "Vice-Président",
        "libQualite": "Vice-président",
        "libQualiteSex": "Vice-présidente"
      },
      "organesRefs": [
        "PO59051"
      ]
    }
  ]
}