{
  "xsiType": "OrganeParlementaireInternational",
  "uid": "PO732924",
  "codeType": "GA",
  "libelle": "France-République démocratique du Congo",
  "libelleEdition": "de France-République démocratique du Congo",
  "libelleAbrege": "Congo (République démocratique du)",
  "libelleAbrev": "RDC",
  "viMoDe": {
    "dateAgrement": "2017-07-19T02:00:00.000+02:00"
  },
  "regime": "5ème République",
  "legislature": "15",
  "secretariat": {
    "secretaire01": "Mme Jeanne Mazière"
  }
}