{
  "xsiType": "OrganeParlementaire_Type",
  "uid": "PO747089",
  "codeType": "GE",
  "libelle": "Mondialisation – régulation économique et sociale",
  "libelleEdition": "MONDIALISATION – RÉGULATION ÉCONOMIQUE ET SOCIALE",
  "libelleAbrege": "MONDIALISATION – RÉGULATION ÉCONOMIQUE ET SOCIALE",
  "libelleAbrev": "MONDIALISA",
  "viMoDe": {
    "dateAgrement": "2017-12-20T01:00:00.000+01:00"
  },
  "regime": "5ème République",
  "legislature": "15",
  "secretariat": {
    "secretaire01": "Mme Loubna Sabil"
  }
}