{
  "uid": "PA720988",
  "etatCivil": {
    "ident": {
      "civ": "Mme",
      "prenom": "Josette",
      "nom": "Manin",
      "alpha": "Manin",
      "trigramme": "JMN"
    },
    "infoNaissance": {
      "dateNais": "1950-03-16T01:00:00.000+01:00",
      "villeNais": "Lamentin",
      "depNais": "Martinique",
      "paysNais": "France"
    }
  },
  "profession": {
    "libelleCourant": "Retraitée salariée (secteur privé)",
    "socProcInsee": {
      "catSocPro": "Anciens cadres et professions intermédiaires",
      "famSocPro": "Retraités"
    }
  },
  "uriHatvp": "https://www.hatvp.fr/pages_nominatives/manin-josette",
  "adresses": [
    {
      "xsiType": "AdressePostale_Type",
      "uid": "AD720990",
      "type": "0",
      "typeLibelle": "Adresse officielle",
      "poids": "1",
      "intitule": "Assemblée nationale,",
      "numeroRue": "126",
      "nomRue": "Rue de l'Université,",
      "codePostal": "75355",
      "ville": "Paris 07 SP"
    },
    {
      "xsiType": "AdresseMail_Type",
      "uid": "AD728205",
      "type": "15",
      "typeLibelle": "Mèl",
      "valElec": "josette.manin@assemblee-nationale.fr"
    }
  ],
  "mandats": [
    {
      "xsiType": "MandatParlementaire_type",
      "uid": "PM723132",
      "acteurRef": "PA720988",
      "legislature": "15",
      "typeOrgane": "ASSEMBLEE",
      "dateDebut": "2017-06-18T02:00:00.000+02:00",
      "preseance": "50",
      "nominPrincipale": "1",
      "infosQualite": {
        "codeQualite": "membre",
        "libQualite": "membre",
        "libQualiteSex": "membre"
      },
      "organesRefs": [
        "PO717460"
      ],
      "suppleant": {
        "dateDebut": "2017-06-18T02:00:00.000+02:00",
        "suppleantRef": "PA720992"
      },
      "election": {
        "lieu": {
          "region": "Martinique",
          "regionType": "Dom",
          "departement": "Martinique",
          "numDepartement": "972",
          "numCirco": "1"
        },
        "causeMandat": "élections générales",
        "refCirconscription": "PO718532"
      },
      "mandature": {
        "datePriseFonction": "2017-06-21T02:00:00.000+02:00",
        "premiereElection": "0",
        "placeHemicycle": "581"
      },
      "collaborateurs": [
        {
          "qualite": "M.",
          "prenom": "Brayen",
          "nom": "Sooranna"
        },
        {
          "qualite": "M.",
          "prenom": "Lionel",
          "nom": "Quille"
        },
        {
          "qualite": "Mme",
          "prenom": "Sandra",
          "nom": "Seneron"
        }
      ]
    },
    {
      "xsiType": "MandatSimple_Type",
      "uid": "PM732533",
      "acteurRef": "PA720988",
      "legislature": "15",
      "typeOrgane": "DELEG",
      "dateDebut": "2017-07-12T02:00:00.000+02:00",
      "datePublication": "2017-07-12T02:00:00.000+02:00",
      "preseance": "20",
      "nominPrincipale": "0",
      "infosQualite": {
        "codeQualite": "Membre",
        "libQualite": "Membre",
        "libQualiteSex": "Membre"
      },
      "organesRefs": [
        "PO675659"
      ]
    },
    {
      "xsiType": "MandatSimple_Type",
      "uid": "PM732855",
      "acteurRef": "PA720988",
      "legislature": "15",
      "typeOrgane": "DELEG",
      "dateDebut": "2017-07-18T02:00:00.000+02:00",
      "datePublication": "2017-07-19T02:00:00.000+02:00",
      "preseance": "14",
      "nominPrincipale": "1",
      "infosQualite": {
        "codeQualite": "Secrétaire",
        "libQualite": "Secrétaire",
        "libQualiteSex": "Secrétaire"
      },
      "organesRefs": [
        "PO675659"
      ]
    },
    {
      "xsiType": "MandatSimple_Type",
      "uid": "PM737109",
      "acteurRef": "PA720988",
      "legislature": "15",
      "typeOrgane": "GA",
      "dateDebut": "2017-10-04T02:00:00.000+02:00",
      "preseance": "20",
      "nominPrincipale": "1",
      "infosQualite": {
        "codeQualite": "Membre",
        "libQualite": "Membre",
        "libQualiteSex": "Membre"
      },
      "organesRefs": [
        "PO733592"
      ]
    },
    {
      "xsiType": "MandatSimple_Type",
      "uid": "PM740493",
      "acteurRef": "PA720988",
      "legislature": "15",
      "typeOrgane": "GA",
      "dateDebut": "2017-10-18T02:00:00.000+02:00",
      "preseance": "20",
      "nominPrincipale": "0",
      "infosQualite": {
        "codeQualite": "Membre",
        "libQualite": "Membre",
        "libQualiteSex": "Membre"
      },
      "organesRefs": [
        "PO733522"
      ]
    },
    {
      "xsiType": "MandatMission_Type",
      "uid": "PM741973",
      "acteurRef": "PA720988",
      "legislature": "15",
      "typeOrgane": "MISINFO",
      "dateDebut": "2017-09-27T02:00:00.000+02:00",
      "preseance": "10",
      "nominPrincipale": "1",
      "infosQualite": {
        "codeQualite": "Membre",
        "libQualite": "Membre",
        "libQualiteSex": "Membre"
      },
      "organesRefs": [
        "PO741916"
      ]
    },
    {
      "xsiType": "MandatSimple_Type",
      "uid": "PM742655",
      "acteurRef": "PA720988",
      "legislature": "15",
      "typeOrgane": "GA",
      "dateDebut": "2017-11-08T01:00:00.000+01:00",
      "preseance": "8",
      "nominPrincipale": "1",
      "infosQualite": {
        "codeQualite": "Vice-Président",
        "libQualite": "Vice-Président",
        "libQualiteSex": "Vice-Présidente"
      },
      "organesRefs": [
        "PO733522"
      ]
    },
    {
      "xsiType": "MandatSimple_Type",
      "uid": "PM744483",
      "acteurRef": "PA720988",
      "legislature": "15",
      "typeOrgane": "GA",
      "dateDebut": "2017-11-29T01:00:00.000+01:00",
      "preseance": "20",
      "nominPrincipale": "1",
      "infosQualite": {
        "codeQualite": "Membre",
        "libQualite": "Membre",
        "libQualiteSex": "Membre"
      },
      "organesRefs": [
        "PO733097"
      ]
    },
    {
      "xsiType": "MandatSimple_Type",
      "uid": "PM745910",
      "acteurRef": "PA720988",
      "typeOrgane": "PARPOL",
      "dateDebut": "2017-12-01T01:00:00.000+01:00",
      "preseance": "5",
      "nominPrincipale": "1",
      "infosQualite": {
        "codeQualite": "Membre",
        "libQualite": "Membre",
        "libQualiteSex": "Membre"
      },
      "organesRefs": [
        "PO685893"
      ]
    },
    {
      "xsiType": "MandatSimple_Type",
      "uid": "PM747960",
      "acteurRef": "PA720988",
      "legislature": "15",
      "typeOrgane": "ORGEXTPARL",
      "dateDebut": "2018-01-10T01:00:00.000+01:00",
      "datePublication": "2018-01-11T01:00:00.000+01:00",
      "preseance": "20",
      "nominPrincipale": "1",
      "infosQualite": {
        "codeQualite": "Titulaire",
        "libQualite": "Membre titulaire",
        "libQualiteSex": "Membre titulaire"
      },
      "organesRefs": [
        "PO717436"
      ]
    },
    {
      "xsiType": "MandatMission_Type",
      "uid": "PM760614",
      "acteurRef": "PA720988",
      "legislature": "15",
      "typeOrgane": "MISINFO",
      "dateDebut": "2018-11-21T01:00:00.000+01:00",
      "preseance": "10",
      "nominPrincipale": "0",
      "infosQualite": {
        "codeQualite": "Membre",
        "libQualite": "Membre",
        "libQualiteSex": "Membre"
      },
      "organesRefs": [
        "PO760588"
      ]
    },
    {
      "xsiType": "MandatMission_Type",
      "uid": "PM760616",
      "acteurRef": "PA720988",
      "legislature": "15",
      "typeOrgane": "MISINFO",
      "dateDebut": "2018-11-21T01:00:00.000+01:00",
      "preseance": "9",
      "nominPrincipale": "1",
      "infosQualite": {
        "codeQualite": "Rapporteur",
        "libQualite": "Rapporteur",
        "libQualiteSex": "Rapporteure"
      },
      "organesRefs": [
        "PO760588"
      ]
    },
    {
      "xsiType": "MandatSimple_Type",
      "uid": "PM763438",
      "acteurRef": "PA720988",
      "legislature": "15",
      "typeOrgane": "ORGEXTPARL",
      "dateDebut": "2019-03-14T01:00:00.000+01:00",
      "datePublication": "2019-03-15T01:00:00.000+01:00",
      "preseance": "20",
      "nominPrincipale": "1",
      "infosQualite": {
        "codeQualite": "Titulaire",
        "libQualite": "Membre titulaire",
        "libQualiteSex": "Membre titulaire"
      },
      "organesRefs": [
        "PO763346"
      ]
    },
    {
      "xsiType": "MandatSimple_Type",
      "uid": "PM767355",
      "acteurRef": "PA720988",
      "legislature": "15",
      "typeOrgane": "GP",
      "dateDebut": "2019-10-02T02:00:00.000+02:00",
      "preseance": "24",
      "nominPrincipale": "1",
      "infosQualite": {
        "codeQualite": "Membre apparenté",
        "libQualite": "Apparenté au",
        "libQualiteSex": "Apparentée au"
      },
      "organesRefs": [
        "PO758835"
      ]
    },
    {
      "xsiType": "MandatSimple_Type",
      "uid": "PM768156",
      "acteurRef": "PA720988",
      "legislature": "15",
      "typeOrgane": "COMPER",
      "dateDebut": "2019-11-14T01:00:00.000+01:00",
      "datePublication": "2019-11-14T01:00:00.000+01:00",
      "preseance": "32",
      "nominPrincipale": "1",
      "infosQualite": {
        "codeQualite": "Membre",
        "libQualite": "Membre",
        "libQualiteSex": "Membre"
      },
      "organesRefs": [
        "PO419604"
      ]
    }
  ]
}