{
  "uid": "PA998",
  "etatCivil": {
    "ident": {
      "civ": "M.",
      "prenom": "Olivier",
      "nom": "Dassault",
      "alpha": "Dassault",
      "trigramme": "ODA"
    },
    "infoNaissance": {
      "dateNais": "1951-06-01T01:00:00.000+01:00",
      "villeNais": "Boulogne-Billancourt",
      "depNais": "Hauts-de-Seine",
      "paysNais": "France"
    }
  },
  "profession": {
    "libelleCourant": "Président de sociétés",
    "socProcInsee": {
      "catSocPro": "Chefs d'entreprise de 10 salariés ou plus",
      "famSocPro": "Artisans, commerçants et chefs d'entreprise"
    }
  },
  "uriHatvp": "https://www.hatvp.fr/pages_nominatives/dassault-olivier",
  "adresses": [
    {
      "xsiType": "AdressePostale_Type",
      "uid": "AD45840",
      "type": "2",
      "typeLibelle": "Adresse publiée de circonscription",
      "poids": "22",
      "intitule": "Permanence parlementaire",
      "numeroRue": "11",
      "nomRue": "Boulevard Amyot-d'Inville",
      "codePostal": "60000",
      "ville": "Beauvais"
    },
    {
      "xsiType": "AdresseTelephonique_Type",
      "uid": "AD47253",
      "type": "11",
      "typeLibelle": "Téléphone",
      "poids": "22",
      "adresseDeRattachement": "AD45840",
      "valElec": "03 44 45 78 48"
    },
    {
      "xsiType": "AdressePostale_Type",
      "uid": "AD386878",
      "type": "0",
      "typeLibelle": "Adresse officielle",
      "poids": "1",
      "intitule": "Assemblée nationale,",
      "numeroRue": "126",
      "nomRue": "Rue de l'Université,",
      "codePostal": "75355",
      "ville": "Paris 07 SP"
    },
    {
      "xsiType": "AdresseMail_Type",
      "uid": "AD391649",
      "type": "15",
      "typeLibelle": "Mèl",
      "valElec": "olivier.dassault@assemblee-nationale.fr"
    },
    {
      "xsiType": "AdresseSiteWeb_Type",
      "uid": "AD728766",
      "type": "22",
      "typeLibelle": "Site internet",
      "valElec": "www.olivierdassault.fr"
    },
    {
      "xsiType": "AdresseSiteWeb_Type",
      "uid": "AD728970",
      "type": "25",
      "typeLibelle": "Facebook",
      "valElec": "olivier.dassault"
    },
    {
      "xsiType": "AdresseSiteWeb_Type",
      "uid": "AD729042",
      "type": "24",
      "typeLibelle": "Twitter",
      "valElec": "@ODassault"
    }
  ],
  "mandats": [
    {
      "xsiType": "MandatParlementaire_type",
      "uid": "PM723046",
      "acteurRef": "PA998",
      "legislature": "15",
      "typeOrgane": "ASSEMBLEE",
      "dateDebut": "2017-06-18T02:00:00.000+02:00",
      "preseance": "50",
      "nominPrincipale": "1",
      "infosQualite": {
        "codeQualite": "membre",
        "libQualite": "membre",
        "libQualiteSex": "membre"
      },
      "organesRefs": [
        "PO717460"
      ],
      "suppleant": {
        "dateDebut": "2017-06-18T02:00:00.000+02:00",
        "suppleantRef": "PA343988"
      },
      "election": {
        "lieu": {
          "region": "Hauts-de-France",
          "regionType": "Métropolitain",
          "departement": "Oise",
          "numDepartement": "60",
          "numCirco": "1"
        },
        "causeMandat": "élections générales",
        "refCirconscription": "PO718048"
      },
      "mandature": {
        "datePriseFonction": "2017-06-21T02:00:00.000+02:00",
        "premiereElection": "1",
        "placeHemicycle": "100"
      },
      "collaborateurs": [
        {
          "qualite": "Mme",
          "prenom": "Guylaine",
          "nom": "Capgras"
        },
        {
          "qualite": "Mme",
          "prenom": "Aurélie",
          "nom": "Chantepie"
        },
        {
          "qualite": "Mme",
          "prenom": "Maggy",
          "nom": "Legat"
        },
        {
          "qualite": "Mme",
          "prenom": "Jacqueline",
          "nom": "Bijou"
        },
        {
          "qualite": "M.",
          "prenom": "Leny",
          "nom": "Payre"
        },
        {
          "qualite": "Mme",
          "prenom": "Pauline",
          "nom": "Lefèvre"
        }
      ]
    },
    {
      "xsiType": "MandatSimple_Type",
      "uid": "PM731324",
      "acteurRef": "PA998",
      "legislature": "15",
      "typeOrgane": "GP",
      "dateDebut": "2017-06-27T02:00:00.000+02:00",
      "datePublication": "2017-06-28T02:00:00.000+02:00",
      "preseance": "20",
      "nominPrincipale": "1",
      "infosQualite": {
        "codeQualite": "Membre",
        "libQualite": "Membre du",
        "libQualiteSex": "Membre du"
      },
      "organesRefs": [
        "PO730934"
      ]
    },
    {
      "xsiType": "MandatSimple_Type",
      "uid": "PM731759",
      "acteurRef": "PA998",
      "legislature": "15",
      "typeOrgane": "COMPER",
      "dateDebut": "2017-06-29T02:00:00.000+02:00",
      "datePublication": "2017-06-29T02:00:00.000+02:00",
      "preseance": "32",
      "nominPrincipale": "1",
      "infosQualite": {
        "codeQualite": "Membre",
        "libQualite": "Membre",
        "libQualiteSex": "Membre"
      },
      "organesRefs": [
        "PO59047"
      ]
    },
    {
      "xsiType": "MandatSimple_Type",
      "uid": "PM735167",
      "acteurRef": "PA998",
      "legislature": "15",
      "typeOrgane": "GA",
      "dateDebut": "2017-09-26T02:00:00.000+02:00",
      "preseance": "20",
      "nominPrincipale": "0",
      "infosQualite": {
        "codeQualite": "Membre",
        "libQualite": "Membre",
        "libQualiteSex": "Membre"
      },
      "organesRefs": [
        "PO733437"
      ]
    },
    {
      "xsiType": "MandatSimple_Type",
      "uid": "PM735168",
      "acteurRef": "PA998",
      "legislature": "15",
      "typeOrgane": "GA",
      "dateDebut": "2017-09-26T02:00:00.000+02:00",
      "preseance": "1",
      "nominPrincipale": "1",
      "infosQualite": {
        "codeQualite": "Président",
        "libQualite": "Président",
        "libQualiteSex": "Président"
      },
      "organesRefs": [
        "PO733437"
      ]
    },
    {
      "xsiType": "MandatSimple_Type",
      "uid": "PM736126",
      "acteurRef": "PA998",
      "legislature": "15",
      "typeOrgane": "GEVI",
      "dateDebut": "2017-10-02T02:00:00.000+02:00",
      "preseance": "20",
      "nominPrincipale": "1",
      "infosQualite": {
        "codeQualite": "Membre",
        "libQualite": "Membre",
        "libQualiteSex": "Membre"
      },
      "organesRefs": [
        "PO733622"
      ]
    },
    {
      "xsiType": "MandatSimple_Type",
      "uid": "PM739084",
      "acteurRef": "PA998",
      "legislature": "15",
      "typeOrgane": "GA",
      "dateDebut": "2017-10-11T02:00:00.000+02:00",
      "preseance": "20",
      "nominPrincipale": "1",
      "infosQualite": {
        "codeQualite": "Membre",
        "libQualite": "Membre",
        "libQualiteSex": "Membre"
      },
      "organesRefs": [
        "PO732934"
      ]
    },
    {
      "xsiType": "MandatSimple_Type",
      "uid": "PM739085",
      "acteurRef": "PA998",
      "legislature": "15",
      "typeOrgane": "GA",
      "dateDebut": "2017-10-11T02:00:00.000+02:00",
      "preseance": "20",
      "nominPrincipale": "1",
      "infosQualite": {
        "codeQualite": "Membre",
        "libQualite": "Membre",
        "libQualiteSex": "Membre"
      },
      "organesRefs": [
        "PO732939"
      ]
    },
    {
      "xsiType": "MandatSimple_Type",
      "uid": "PM739086",
      "acteurRef": "PA998",
      "legislature": "15",
      "typeOrgane": "GA",
      "dateDebut": "2017-10-11T02:00:00.000+02:00",
      "preseance": "20",
      "nominPrincipale": "1",
      "infosQualite": {
        "codeQualite": "Membre",
        "libQualite": "Membre",
        "libQualiteSex": "Membre"
      },
      "organesRefs": [
        "PO732984"
      ]
    },
    {
      "xsiType": "MandatSimple_Type",
      "uid": "PM739087",
      "acteurRef": "PA998",
      "legislature": "15",
      "typeOrgane": "GA",
      "dateDebut": "2017-10-11T02:00:00.000+02:00",
      "preseance": "20",
      "nominPrincipale": "1",
      "infosQualite": {
        "codeQualite": "Membre",
        "libQualite": "Membre",
        "libQualiteSex": "Membre"
      },
      "organesRefs": [
        "PO733032"
      ]
    },
    {
      "xsiType": "MandatSimple_Type",
      "uid": "PM739088",
      "acteurRef": "PA998",
      "legislature": "15",
      "typeOrgane": "GA",
      "dateDebut": "2017-10-11T02:00:00.000+02:00",
      "preseance": "20",
      "nominPrincipale": "1",
      "infosQualite": {
        "codeQualite": "Membre",
        "libQualite": "Membre",
        "libQualiteSex": "Membre"
      },
      "organesRefs": [
        "PO733072"
      ]
    },
    {
      "xsiType": "MandatSimple_Type",
      "uid": "PM739089",
      "acteurRef": "PA998",
      "legislature": "15",
      "typeOrgane": "GA",
      "dateDebut": "2017-10-11T02:00:00.000+02:00",
      "preseance": "20",
      "nominPrincipale": "1",
      "infosQualite": {
        "codeQualite": "Membre",
        "libQualite": "Membre",
        "libQualiteSex": "Membre"
      },
      "organesRefs": [
        "PO733117"
      ]
    },
    {
      "xsiType": "MandatSimple_Type",
      "uid": "PM739090",
      "acteurRef": "PA998",
      "legislature": "15",
      "typeOrgane": "GA",
      "dateDebut": "2017-10-11T02:00:00.000+02:00",
      "preseance": "20",
      "nominPrincipale": "1",
      "infosQualite": {
        "codeQualite": "Membre",
        "libQualite": "Membre",
        "libQualiteSex": "Membre"
      },
      "organesRefs": [
        "PO733127"
      ]
    },
    {
      "xsiType": "MandatSimple_Type",
      "uid": "PM739091",
      "acteurRef": "PA998",
      "legislature": "15",
      "typeOrgane": "GA",
      "dateDebut": "2017-10-11T02:00:00.000+02:00",
      "preseance": "20",
      "nominPrincipale": "1",
      "infosQualite": {
        "codeQualite": "Membre",
        "libQualite": "Membre",
        "libQualiteSex": "Membre"
      },
      "organesRefs": [
        "PO733157"
      ]
    },
    {
      "xsiType": "MandatSimple_Type",
      "uid": "PM739092",
      "acteurRef": "PA998",
      "legislature": "15",
      "typeOrgane": "GA",
      "dateDebut": "2017-10-11T02:00:00.000+02:00",
      "preseance": "20",
      "nominPrincipale": "1",
      "infosQualite": {
        "codeQualite": "Membre",
        "libQualite": "Membre",
        "libQualiteSex": "Membre"
      },
      "organesRefs": [
        "PO733177"
      ]
    },
    {
      "xsiType": "MandatSimple_Type",
      "uid": "PM739093",
      "acteurRef": "PA998",
      "legislature": "15",
      "typeOrgane": "GA",
      "dateDebut": "2017-10-11T02:00:00.000+02:00",
      "preseance": "20",
      "nominPrincipale": "1",
      "infosQualite": {
        "codeQualite": "Membre",
        "libQualite": "Membre",
        "libQualiteSex": "Membre"
      },
      "organesRefs": [
        "PO733182"
      ]
    },
    {
      "xsiType": "MandatSimple_Type",
      "uid": "PM739094",
      "acteurRef": "PA998",
      "legislature": "15",
      "typeOrgane": "GA",
      "dateDebut": "2017-10-11T02:00:00.000+02:00",
      "preseance": "20",
      "nominPrincipale": "1",
      "infosQualite": {
        "codeQualite": "Membre",
        "libQualite": "Membre",
        "libQualiteSex": "Membre"
      },
      "organesRefs": [
        "PO733187"
      ]
    },
    {
      "xsiType": "MandatSimple_Type",
      "uid": "PM739095",
      "acteurRef": "PA998",
      "legislature": "15",
      "typeOrgane": "GA",
      "dateDebut": "2017-10-11T02:00:00.000+02:00",
      "preseance": "20",
      "nominPrincipale": "1",
      "infosQualite": {
        "codeQualite": "Membre",
        "libQualite": "Membre",
        "libQualiteSex": "Membre"
      },
      "organesRefs": [
        "PO733297"
      ]
    },
    {
      "xsiType": "MandatSimple_Type",
      "uid": "PM739096",
      "acteurRef": "PA998",
      "legislature": "15",
      "typeOrgane": "GA",
      "dateDebut": "2017-10-11T02:00:00.000+02:00",
      "preseance": "20",
      "nominPrincipale": "1",
      "infosQualite": {
        "codeQualite": "Membre",
        "libQualite": "Membre",
        "libQualiteSex": "Membre"
      },
      "organesRefs": [
        "PO733322"
      ]
    },
    {
      "xsiType": "MandatSimple_Type",
      "uid": "PM739097",
      "acteurRef": "PA998",
      "legislature": "15",
      "typeOrgane": "GA",
      "dateDebut": "2017-10-11T02:00:00.000+02:00",
      "preseance": "20",
      "nominPrincipale": "1",
      "infosQualite": {
        "codeQualite": "Membre",
        "libQualite": "Membre",
        "libQualiteSex": "Membre"
      },
      "organesRefs": [
        "PO733342"
      ]
    },
    {
      "xsiType": "MandatSimple_Type",
      "uid": "PM739098",
      "acteurRef": "PA998",
      "legislature": "15",
      "typeOrgane": "GA",
      "dateDebut": "2017-10-11T02:00:00.000+02:00",
      "preseance": "20",
      "nominPrincipale": "1",
      "infosQualite": {
        "codeQualite": "Membre",
        "libQualite": "Membre",
        "libQualiteSex": "Membre"
      },
      "organesRefs": [
        "PO733352"
      ]
    },
    {
      "xsiType": "MandatSimple_Type",
      "uid": "PM739099",
      "acteurRef": "PA998",
      "legislature": "15",
      "typeOrgane": "GA",
      "dateDebut": "2017-10-11T02:00:00.000+02:00",
      "preseance": "20",
      "nominPrincipale": "1",
      "infosQualite": {
        "codeQualite": "Membre",
        "libQualite": "Membre",
        "libQualiteSex": "Membre"
      },
      "organesRefs": [
        "PO733367"
      ]
    },
    {
      "xsiType": "MandatSimple_Type",
      "uid": "PM739100",
      "acteurRef": "PA998",
      "legislature": "15",
      "typeOrgane": "GA",
      "dateDebut": "2017-10-11T02:00:00.000+02:00",
      "preseance": "20",
      "nominPrincipale": "1",
      "infosQualite": {
        "codeQualite": "Membre",
        "libQualite": "Membre",
        "libQualiteSex": "Membre"
      },
      "organesRefs": [
        "PO733372"
      ]
    },
    {
      "xsiType": "MandatSimple_Type",
      "uid": "PM739101",
      "acteurRef": "PA998",
      "legislature": "15",
      "typeOrgane": "GA",
      "dateDebut": "2017-10-11T02:00:00.000+02:00",
      "preseance": "20",
      "nominPrincipale": "1",
      "infosQualite": {
        "codeQualite": "Membre",
        "libQualite": "Membre",
        "libQualiteSex": "Membre"
      },
      "organesRefs": [
        "PO733407"
      ]
    },
    {
      "xsiType": "MandatSimple_Type",
      "uid": "PM739102",
      "acteurRef": "PA998",
      "legislature": "15",
      "typeOrgane": "GA",
      "dateDebut": "2017-10-11T02:00:00.000+02:00",
      "preseance": "20",
      "nominPrincipale": "0",
      "infosQualite": {
        "codeQualite": "Membre",
        "libQualite": "Membre",
        "libQualiteSex": "Membre"
      },
      "organesRefs": [
        "PO733482"
      ]
    },
    {
      "xsiType": "MandatSimple_Type",
      "uid": "PM739103",
      "acteurRef": "PA998",
      "legislature": "15",
      "typeOrgane": "GA",
      "dateDebut": "2017-10-11T02:00:00.000+02:00",
      "preseance": "20",
      "nominPrincipale": "1",
      "infosQualite": {
        "codeQualite": "Membre",
        "libQualite": "Membre",
        "libQualiteSex": "Membre"
      },
      "organesRefs": [
        "PO733517"
      ]
    },
    {
      "xsiType": "MandatSimple_Type",
      "uid": "PM739104",
      "acteurRef": "PA998",
      "legislature": "15",
      "typeOrgane": "GA",
      "dateDebut": "2017-10-11T02:00:00.000+02:00",
      "preseance": "20",
      "nominPrincipale": "1",
      "infosQualite": {
        "codeQualite": "Membre",
        "libQualite": "Membre",
        "libQualiteSex": "Membre"
      },
      "organesRefs": [
        "PO733522"
      ]
    },
    {
      "xsiType": "MandatSimple_Type",
      "uid": "PM739105",
      "acteurRef": "PA998",
      "legislature": "15",
      "typeOrgane": "GA",
      "dateDebut": "2017-10-11T02:00:00.000+02:00",
      "preseance": "20",
      "nominPrincipale": "1",
      "infosQualite": {
        "codeQualite": "Membre",
        "libQualite": "Membre",
        "libQualiteSex": "Membre"
      },
      "organesRefs": [
        "PO733532"
      ]
    },
    {
      "xsiType": "MandatSimple_Type",
      "uid": "PM739106",
      "acteurRef": "PA998",
      "legislature": "15",
      "typeOrgane": "GA",
      "dateDebut": "2017-10-11T02:00:00.000+02:00",
      "preseance": "20",
      "nominPrincipale": "1",
      "infosQualite": {
        "codeQualite": "Membre",
        "libQualite": "Membre",
        "libQualiteSex": "Membre"
      },
      "organesRefs": [
        "PO733567"
      ]
    },
    {
      "xsiType": "MandatSimple_Type",
      "uid": "PM739107",
      "acteurRef": "PA998",
      "legislature": "15",
      "typeOrgane": "GA",
      "dateDebut": "2017-10-11T02:00:00.000+02:00",
      "preseance": "20",
      "nominPrincipale": "1",
      "infosQualite": {
        "codeQualite": "Membre",
        "libQualite": "Membre",
        "libQualiteSex": "Membre"
      },
      "organesRefs": [
        "PO733577"
      ]
    },
    {
      "xsiType": "MandatSimple_Type",
      "uid": "PM739108",
      "acteurRef": "PA998",
      "legislature": "15",
      "typeOrgane": "GA",
      "dateDebut": "2017-10-11T02:00:00.000+02:00",
      "preseance": "20",
      "nominPrincipale": "1",
      "infosQualite": {
        "codeQualite": "Membre",
        "libQualite": "Membre",
        "libQualiteSex": "Membre"
      },
      "organesRefs": [
        "PO733597"
      ]
    },
    {
      "xsiType": "MandatSimple_Type",
      "uid": "PM739109",
      "acteurRef": "PA998",
      "legislature": "15",
      "typeOrgane": "GA",
      "dateDebut": "2017-10-11T02:00:00.000+02:00",
      "preseance": "20",
      "nominPrincipale": "1",
      "infosQualite": {
        "codeQualite": "Membre",
        "libQualite": "Membre",
        "libQualiteSex": "Membre"
      },
      "organesRefs": [
        "PO733617"
      ]
    },
    {
      "xsiType": "MandatSimple_Type",
      "uid": "PM739110",
      "acteurRef": "PA998",
      "legislature": "15",
      "typeOrgane": "GA",
      "dateDebut": "2017-10-11T02:00:00.000+02:00",
      "preseance": "20",
      "nominPrincipale": "1",
      "infosQualite": {
        "codeQualite": "Membre",
        "libQualite": "Membre",
        "libQualiteSex": "Membre"
      },
      "organesRefs": [
        "PO733627"
      ]
    },
    {
      "xsiType": "MandatSimple_Type",
      "uid": "PM739111",
      "acteurRef": "PA998",
      "legislature": "15",
      "typeOrgane": "GA",
      "dateDebut": "2017-10-11T02:00:00.000+02:00",
      "preseance": "20",
      "nominPrincipale": "1",
      "infosQualite": {
        "codeQualite": "Membre",
        "libQualite": "Membre",
        "libQualiteSex": "Membre"
      },
      "organesRefs": [
        "PO733632"
      ]
    },
    {
      "xsiType": "MandatSimple_Type",
      "uid": "PM739112",
      "acteurRef": "PA998",
      "legislature": "15",
      "typeOrgane": "GA",
      "dateDebut": "2017-10-11T02:00:00.000+02:00",
      "preseance": "20",
      "nominPrincipale": "1",
      "infosQualite": {
        "codeQualite": "Membre",
        "libQualite": "Membre",
        "libQualiteSex": "Membre"
      },
      "organesRefs": [
        "PO733637"
      ]
    },
    {
      "xsiType": "MandatSimple_Type",
      "uid": "PM742118",
      "acteurRef": "PA998",
      "legislature": "15",
      "typeOrgane": "API",
      "dateDebut": "2017-10-27T02:00:00.000+02:00",
      "datePublication": "2017-10-28T02:00:00.000+02:00",
      "preseance": "20",
      "nominPrincipale": "1",
      "infosQualite": {
        "codeQualite": "Membre",
        "libQualite": "Membre",
        "libQualiteSex": "Membre"
      },
      "organesRefs": [
        "PO201115"
      ]
    },
    {
      "xsiType": "MandatSimple_Type",
      "uid": "PM745659",
      "acteurRef": "PA998",
      "typeOrgane": "PARPOL",
      "dateDebut": "2017-12-01T01:00:00.000+01:00",
      "preseance": "5",
      "nominPrincipale": "1",
      "infosQualite": {
        "codeQualite": "Membre",
        "libQualite": "Membre",
        "libQualiteSex": "Membre"
      },
      "organesRefs": [
        "PO710396"
      ]
    },
    {
      "xsiType": "MandatSimple_Type",
      "uid": "PM751120",
      "acteurRef": "PA998",
      "legislature": "15",
      "typeOrgane": "GE",
      "dateDebut": "2018-02-19T01:00:00.000+01:00",
      "preseance": "20",
      "nominPrincipale": "1",
      "infosQualite": {
        "codeQualite": "Membre",
        "libQualite": "Membre",
        "libQualiteSex": "Membre"
      },
      "organesRefs": [
        "PO746684"
      ]
    },
    {
      "xsiType": "MandatSimple_Type",
      "uid": "PM751333",
      "acteurRef": "PA998",
      "legislature": "15",
      "typeOrgane": "GE",
      "dateDebut": "2018-02-20T01:00:00.000+01:00",
      "preseance": "20",
      "nominPrincipale": "1",
      "infosQualite": {
        "codeQualite": "Membre",
        "libQualite": "Membre",
        "libQualiteSex": "Membre"
      },
      "organesRefs": [
        "PO746880"
      ]
    },
    {
      "xsiType": "MandatSimple_Type",
      "uid": "PM751436",
      "acteurRef": "PA998",
      "legislature": "15",
      "typeOrgane": "GE",
      "dateDebut": "2018-02-21T01:00:00.000+01:00",
      "preseance": "20",
      "nominPrincipale": "1",
      "infosQualite": {
        "codeQualite": "Membre",
        "libQualite": "Membre",
        "libQualiteSex": "Membre"
      },
      "organesRefs": [
        "PO746644"
      ]
    },
    {
      "xsiType": "MandatSimple_Type",
      "uid": "PM751685",
      "acteurRef": "PA998",
      "legislature": "15",
      "typeOrgane": "GE",
      "dateDebut": "2018-02-22T01:00:00.000+01:00",
      "preseance": "20",
      "nominPrincipale": "0",
      "infosQualite": {
        "codeQualite": "Membre",
        "libQualite": "Membre",
        "libQualiteSex": "Membre"
      },
      "organesRefs": [
        "PO746669"
      ]
    },
    {
      "xsiType": "MandatSimple_Type",
      "uid": "PM752513",
      "acteurRef": "PA998",
      "legislature": "15",
      "typeOrgane": "GE",
      "dateDebut": "2018-02-16T01:00:00.000+01:00",
      "preseance": "20",
      "nominPrincipale": "1",
      "infosQualite": {
        "codeQualite": "Membre",
        "libQualite": "Membre",
        "libQualiteSex": "Membre"
      },
      "organesRefs": [
        "PO746763"
      ]
    },
    {
      "xsiType": "MandatSimple_Type",
      "uid": "PM753183",
      "acteurRef": "PA998",
      "legislature": "15",
      "typeOrgane": "GE",
      "dateDebut": "2018-03-12T01:00:00.000+01:00",
      "preseance": "20",
      "nominPrincipale": "1",
      "infosQualite": {
        "codeQualite": "Membre",
        "libQualite": "Membre",
        "libQualiteSex": "Membre"
      },
      "organesRefs": [
        "PO746674"
      ]
    },
    {
      "xsiType": "MandatSimple_Type",
      "uid": "PM753201",
      "acteurRef": "PA998",
      "legislature": "15",
      "typeOrgane": "GA",
      "dateDebut": "2018-03-12T01:00:00.000+01:00",
      "preseance": "20",
      "nominPrincipale": "1",
      "infosQualite": {
        "codeQualite": "Membre",
        "libQualite": "Membre",
        "libQualiteSex": "Membre"
      },
      "organesRefs": [
        "PO733052"
      ]
    },
    {
      "xsiType": "MandatSimple_Type",
      "uid": "PM753210",
      "acteurRef": "PA998",
      "legislature": "15",
      "typeOrgane": "GE",
      "dateDebut": "2018-03-12T01:00:00.000+01:00",
      "preseance": "20",
      "nominPrincipale": "0",
      "infosQualite": {
        "codeQualite": "Membre",
        "libQualite": "Membre",
        "libQualiteSex": "Membre"
      },
      "organesRefs": [
        "PO747220"
      ]
    },
    {
      "xsiType": "MandatSimple_Type",
      "uid": "PM753503",
      "acteurRef": "PA998",
      "legislature": "15",
      "typeOrgane": "GE",
      "dateDebut": "2018-03-13T01:00:00.000+01:00",
      "preseance": "20",
      "nominPrincipale": "1",
      "infosQualite": {
        "codeQualite": "Membre",
        "libQualite": "Membre",
        "libQualiteSex": "Membre"
      },
      "organesRefs": [
        "PO747200"
      ]
    },
    {
      "xsiType": "MandatSimple_Type",
      "uid": "PM753586",
      "acteurRef": "PA998",
      "legislature": "15",
      "typeOrgane": "GE",
      "dateDebut": "2018-03-15T01:00:00.000+01:00",
      "preseance": "12",
      "nominPrincipale": "1",
      "infosQualite": {
        "codeQualite": "Secrétaire",
        "libQualite": "Secrétaire",
        "libQualiteSex": "Secrétaire"
      },
      "organesRefs": [
        "PO747220"
      ]
    },
    {
      "xsiType": "MandatSimple_Type",
      "uid": "PM753697",
      "acteurRef": "PA998",
      "legislature": "15",
      "typeOrgane": "GE",
      "dateDebut": "2018-03-16T01:00:00.000+01:00",
      "preseance": "20",
      "nominPrincipale": "1",
      "infosQualite": {
        "codeQualite": "Membre",
        "libQualite": "Membre",
        "libQualiteSex": "Membre"
      },
      "organesRefs": [
        "PO747129"
      ]
    },
    {
      "xsiType": "MandatSimple_Type",
      "uid": "PM753725",
      "acteurRef": "PA998",
      "legislature": "15",
      "typeOrgane": "GE",
      "dateDebut": "2018-03-16T01:00:00.000+01:00",
      "preseance": "20",
      "nominPrincipale": "1",
      "infosQualite": {
        "codeQualite": "Membre",
        "libQualite": "Membre",
        "libQualiteSex": "Membre"
      },
      "organesRefs": [
        "PO746987"
      ]
    },
    {
      "xsiType": "MandatSimple_Type",
      "uid": "PM753726",
      "acteurRef": "PA998",
      "legislature": "15",
      "typeOrgane": "GE",
      "dateDebut": "2018-03-16T01:00:00.000+01:00",
      "preseance": "20",
      "nominPrincipale": "1",
      "infosQualite": {
        "codeQualite": "Membre",
        "libQualite": "Membre",
        "libQualiteSex": "Membre"
      },
      "organesRefs": [
        "PO746837"
      ]
    },
    {
      "xsiType": "MandatSimple_Type",
      "uid": "PM754332",
      "acteurRef": "PA998",
      "legislature": "15",
      "typeOrgane": "GA",
      "dateDebut": "2017-12-05T01:00:00.000+01:00",
      "preseance": "8",
      "nominPrincipale": "1",
      "infosQualite": {
        "codeQualite": "Vice-Président",
        "libQualite": "Vice-Président",
        "libQualiteSex": "Vice-Président"
      },
      "organesRefs": [
        "PO733482"
      ]
    },
    {
      "xsiType": "MandatSimple_Type",
      "uid": "PM757008",
      "acteurRef": "PA998",
      "legislature": "15",
      "typeOrgane": "ORGEXTPARL",
      "dateDebut": "2018-03-08T01:00:00.000+01:00",
      "datePublication": "2018-03-09T01:00:00.000+01:00",
      "preseance": "20",
      "nominPrincipale": "1",
      "infosQualite": {
        "codeQualite": "Titulaire",
        "libQualite": "Membre titulaire",
        "libQualiteSex": "Membre titulaire"
      },
      "organesRefs": [
        "PO756933"
      ]
    },
    {
      "xsiType": "MandatSimple_Type",
      "uid": "PM758030",
      "acteurRef": "PA998",
      "legislature": "15",
      "typeOrgane": "GE",
      "dateDebut": "2018-07-16T02:00:00.000+02:00",
      "preseance": "20",
      "nominPrincipale": "1",
      "infosQualite": {
        "codeQualite": "Membre",
        "libQualite": "Membre",
        "libQualiteSex": "Membre"
      },
      "organesRefs": [
        "PO747281"
      ]
    },
    {
      "xsiType": "MandatSimple_Type",
      "uid": "PM758393",
      "acteurRef": "PA998",
      "legislature": "15",
      "typeOrgane": "GE",
      "dateDebut": "2018-03-07T01:00:00.000+01:00",
      "preseance": "12",
      "nominPrincipale": "1",
      "infosQualite": {
        "codeQualite": "Secrétaire",
        "libQualite": "Secrétaire",
        "libQualiteSex": "Secrétaire"
      },
      "organesRefs": [
        "PO746669"
      ]
    },
    {
      "xsiType": "MandatSimple_Type",
      "uid": "PM765181",
      "acteurRef": "PA998",
      "legislature": "15",
      "typeOrgane": "GE",
      "dateDebut": "2019-05-20T02:00:00.000+02:00",
      "preseance": "20",
      "nominPrincipale": "1",
      "infosQualite": {
        "codeQualite": "Membre",
        "libQualite": "Membre",
        "libQualiteSex": "Membre"
      },
      "organesRefs": [
        "PO763244"
      ]
    }
  ]
}