{
  "uid": "PA721352",
  "etatCivil": {
    "ident": {
      "civ": "Mme",
      "prenom": "Danièle",
      "nom": "Cazarian",
      "alpha": "Cazarian",
      "trigramme": "DCA"
    },
    "infoNaissance": {
      "dateNais": "1965-08-31T01:00:00.000+01:00",
      "villeNais": "Lyon 7ème",
      "depNais": "Rhône",
      "paysNais": "France"
    }
  },
  "profession": {
    "libelleCourant": "Administratrice de sociétés",
    "socProcInsee": {
      "catSocPro": "Chefs d'entreprise de 10 salariés ou plus",
      "famSocPro": "Artisans, commerçants et chefs d'entreprise"
    }
  },
  "uriHatvp": "https://www.hatvp.fr/pages_nominatives/cazarian-daniele",
  "adresses": [
    {
      "xsiType": "AdressePostale_Type",
      "uid": "AD721354",
      "type": "0",
      "typeLibelle": "Adresse officielle",
      "poids": "1",
      "intitule": "Assemblée nationale,",
      "numeroRue": "126",
      "nomRue": "Rue de l'Université,",
      "codePostal": "75355",
      "ville": "Paris 07 SP"
    },
    {
      "xsiType": "AdresseMail_Type",
      "uid": "AD728240",
      "type": "15",
      "typeLibelle": "Mèl",
      "valElec": "daniele.cazarian@assemblee-nationale.fr"
    },
    {
      "xsiType": "AdressePostale_Type",
      "uid": "AD746586",
      "type": "2",
      "typeLibelle": "Adresse publiée de circonscription",
      "poids": "2",
      "intitule": "Permanence parlementaire",
      "numeroRue": "262",
      "nomRue": "Avenue Jean Jaurès",
      "codePostal": "69150",
      "ville": "Décines-Charpieu"
    }
  ],
  "mandats": [
    {
      "xsiType": "MandatParlementaire_type",
      "uid": "PM723246",
      "acteurRef": "PA721352",
      "legislature": "15",
      "typeOrgane": "ASSEMBLEE",
      "dateDebut": "2017-06-18T02:00:00.000+02:00",
      "preseance": "50",
      "nominPrincipale": "1",
      "infosQualite": {
        "codeQualite": "membre",
        "libQualite": "membre",
        "libQualiteSex": "membre"
      },
      "organesRefs": [
        "PO717460"
      ],
      "suppleant": {
        "dateDebut": "2017-06-18T02:00:00.000+02:00",
        "suppleantRef": "PA721356"
      },
      "election": {
        "lieu": {
          "region": "Auvergne-Rhône-Alpes",
          "regionType": "Métropolitain",
          "departement": "Rhône",
          "numDepartement": "69",
          "numCirco": "13"
        },
        "causeMandat": "élections générales",
        "refCirconscription": "PO718150"
      },
      "mandature": {
        "datePriseFonction": "2017-06-21T02:00:00.000+02:00",
        "premiereElection": "0",
        "placeHemicycle": "624"
      },
      "collaborateurs": [
        {
          "qualite": "M.",
          "prenom": "Julien",
          "nom": "Couturier"
        },
        {
          "qualite": "Mme",
          "prenom": "Sarah",
          "nom": "Tanzilli"
        },
        {
          "qualite": "M.",
          "prenom": "Sacha",
          "nom": "Vaytet"
        }
      ]
    },
    {
      "xsiType": "MandatSimple_Type",
      "uid": "PM731196",
      "acteurRef": "PA721352",
      "legislature": "15",
      "typeOrgane": "GP",
      "dateDebut": "2017-06-27T02:00:00.000+02:00",
      "datePublication": "2017-06-28T02:00:00.000+02:00",
      "preseance": "20",
      "nominPrincipale": "1",
      "infosQualite": {
        "codeQualite": "Membre",
        "libQualite": "Membre du",
        "libQualiteSex": "Membre du"
      },
      "organesRefs": [
        "PO730964"
      ]
    },
    {
      "xsiType": "MandatSimple_Type",
      "uid": "PM732010",
      "acteurRef": "PA721352",
      "legislature": "15",
      "typeOrgane": "COMPER",
      "dateDebut": "2017-06-29T02:00:00.000+02:00",
      "datePublication": "2017-06-29T02:00:00.000+02:00",
      "preseance": "32",
      "nominPrincipale": "1",
      "infosQualite": {
        "codeQualite": "Membre",
        "libQualite": "Membre",
        "libQualiteSex": "Membre"
      },
      "organesRefs": [
        "PO419604"
      ]
    },
    {
      "xsiType": "MandatSimple_Type",
      "uid": "PM736125",
      "acteurRef": "PA721352",
      "legislature": "15",
      "typeOrgane": "GA",
      "dateDebut": "2017-10-02T02:00:00.000+02:00",
      "preseance": "20",
      "nominPrincipale": "1",
      "infosQualite": {
        "codeQualite": "Membre",
        "libQualite": "Membre",
        "libQualiteSex": "Membre"
      },
      "organesRefs": [
        "PO733517"
      ]
    },
    {
      "xsiType": "MandatSimple_Type",
      "uid": "PM749208",
      "acteurRef": "PA721352",
      "legislature": "15",
      "typeOrgane": "GE",
      "dateDebut": "2018-02-08T01:00:00.000+01:00",
      "preseance": "20",
      "nominPrincipale": "1",
      "infosQualite": {
        "codeQualite": "Membre",
        "libQualite": "Membre",
        "libQualiteSex": "Membre"
      },
      "organesRefs": [
        "PO746925"
      ]
    },
    {
      "xsiType": "MandatSimple_Type",
      "uid": "PM752245",
      "acteurRef": "PA721352",
      "legislature": "15",
      "typeOrgane": "GE",
      "dateDebut": "2018-03-03T01:00:00.000+01:00",
      "preseance": "20",
      "nominPrincipale": "1",
      "infosQualite": {
        "codeQualite": "Membre",
        "libQualite": "Membre",
        "libQualiteSex": "Membre"
      },
      "organesRefs": [
        "PO747185"
      ]
    },
    {
      "xsiType": "MandatSimple_Type",
      "uid": "PM757083",
      "acteurRef": "PA721352",
      "legislature": "15",
      "typeOrgane": "ORGEXTPARL",
      "dateDebut": "2018-06-04T02:00:00.000+02:00",
      "datePublication": "2018-06-05T02:00:00.000+02:00",
      "preseance": "20",
      "nominPrincipale": "1",
      "infosQualite": {
        "codeQualite": "Titulaire",
        "libQualite": "Membre titulaire",
        "libQualiteSex": "Membre titulaire"
      },
      "organesRefs": [
        "PO756933"
      ]
    },
    {
      "xsiType": "MandatSimple_Type",
      "uid": "PM759248",
      "acteurRef": "PA721352",
      "legislature": "15",
      "typeOrgane": "GE",
      "dateDebut": "2018-10-02T02:00:00.000+02:00",
      "preseance": "20",
      "nominPrincipale": "1",
      "infosQualite": {
        "codeQualite": "Membre",
        "libQualite": "Membre",
        "libQualiteSex": "Membre"
      },
      "organesRefs": [
        "PO747002"
      ]
    },
    {
      "xsiType": "MandatSimple_Type",
      "uid": "PM761405",
      "acteurRef": "PA721352",
      "typeOrgane": "PARPOL",
      "dateDebut": "2018-12-01T01:00:00.000+01:00",
      "preseance": "5",
      "nominPrincipale": "1",
      "infosQualite": {
        "codeQualite": "Membre",
        "libQualite": "Membre",
        "libQualiteSex": "Membre"
      },
      "organesRefs": [
        "PO761294"
      ]
    },
    {
      "xsiType": "MandatMission_Type",
      "uid": "PM765109",
      "acteurRef": "PA721352",
      "legislature": "15",
      "typeOrgane": "MISINFO",
      "dateDebut": "2019-05-14T02:00:00.000+02:00",
      "preseance": "10",
      "nominPrincipale": "1",
      "infosQualite": {
        "codeQualite": "Membre",
        "libQualite": "Membre",
        "libQualiteSex": "Membre"
      },
      "organesRefs": [
        "PO741916"
      ]
    }
  ]
}