{
  "xsiType": "OrganeParlementaire_Type",
  "uid": "PO59047",
  "codeType": "COMPER",
  "libelle": "Commission des affaires étrangères",
  "libelleEdition": "de la commission des affaires étrangères",
  "libelleAbrege": "Affaires étrangères",
  "libelleAbrev": "CION_AFETR",
  "viMoDe": {
    "dateDebut": "1958-12-09T01:00:00.000+01:00"
  },
  "regime": "5ème République",
  "secretariat": {
    "secretaire01": "M. Stanislas Brézet"
  }
}