{
  "@xmlns": "http://schemas.assemblee-nationale.fr/referentiel",
  "@xmlns:xsi": "http://www.w3.org/2001/XMLSchema-instance",
  "@xsi:type": "OrganeExtraParlementaire_type",
  "uid": "PO60179",
  "codeType": "ORGEXTPARL",
  "libelle": "Comité des finances locales",
  "libelleEdition": "du Comité des finances locales",
  "libelleAbrege": "Finances locales",
  "libelleAbrev": "34",
  "viMoDe": {
    "dateDebut": "1979-01-03T01:00:00.000+01:00",
    "dateAgrement": null,
    "dateFin": null
  },
  "organeParent": null,
  "chambre": null,
  "regime": "5ème République",
  "legislature": null,
  "regimeJuridique": "Article L. 1211-2 du code général des collectivités territoriales",
  "siteInternet": "https://www.collectivites-locales.gouv.fr/liste-des-membres-1",
  "nombreReunionsAnnuelles": "7"
}