{
  "@xmlns": "http://schemas.assemblee-nationale.fr/referentiel",
  "@xmlns:xsi": "http://www.w3.org/2001/XMLSchema-instance",
  "@xsi:type": "OrganeExtraParlementaire_type",
  "uid": "PO60260",
  "codeType": "ORGEXTPARL",
  "libelle": "Conseil d'administration de l'Agence de l'environnement et de la maîtrise de l'énergie",
  "libelleEdition": "du conseil d'administration de l'Agence de l'environnement et de la maîtrise de l'énergie",
  "libelleAbrege": "Environnement et maîtrise de l'énergie",
  "libelleAbrev": "120",
  "viMoDe": {
    "dateDebut": "1990-12-19T01:00:00.000+01:00",
    "dateAgrement": null,
    "dateFin": null
  },
  "organeParent": null,
  "chambre": null,
  "regime": "5ème République",
  "legislature": null,
  "regimeJuridique": "Article L. 131-4 du code de l’environnement",
  "siteInternet": "http://www.ademe.fr/connaitre/presentation-lademe/instances-statut-lademe",
  "nombreReunionsAnnuelles": null
}