{
  "@xmlns": "http://schemas.assemblee-nationale.fr/referentiel",
  "@xmlns:xsi": "http://www.w3.org/2001/XMLSchema-instance",
  "@xsi:type": "OrganeParlementaire_Type",
  "uid": "PO58974",
  "codeType": "API",
  "libelle": "Délégation française à l'Assemblée parlementaire de l'OTAN",
  "libelleEdition": "de la délégation française à l'Assemblée parlementaire de l'OTAN",
  "libelleAbrege": "Assemblée parlementaire de l'OTAN",
  "libelleAbrev": "OTAN",
  "viMoDe": {
    "dateDebut": "1988-06-13T02:00:00.000+02:00",
    "dateAgrement": null,
    "dateFin": null
  },
  "organeParent": null,
  "chambre": null,
  "regime": "5ème République",
  "legislature": null,
  "secretariat": {
    "secretaire01": "M. Vincent Tocanne",
    "secretaire02": null
  }
}