{
  "@xmlns": "http://schemas.assemblee-nationale.fr/referentiel",
  "@xmlns:xsi": "http://www.w3.org/2001/XMLSchema-instance",
  "@xsi:type": "OrganeExterne_Type",
  "uid": "PO405191",
  "codeType": "DELEGSENAT",
  "libelle": "Délégation parlementaire au renseignement",
  "libelleEdition": null,
  "libelleAbrege": "Délégation parlementaire au renseignement",
  "libelleAbrev": "RENSE",
  "viMoDe": {
    "dateDebut": "2007-10-10T02:00:00.000+02:00",
    "dateAgrement": null,
    "dateFin": null
  },
  "organeParent": null
}