{
  "@xmlns": "http://schemas.assemblee-nationale.fr/referentiel",
  "@xmlns:xsi": "http://www.w3.org/2001/XMLSchema-instance",
  "@xsi:type": "OrganeParlementaire_Type",
  "uid": "PO747286",
  "codeType": "GE",
  "libelle": "Voies navigables et transports multimodaux – canaux",
  "libelleEdition": null,
  "libelleAbrege": "VOIES NAVIGABLES ET TRANSPORTS MULTIMODAUX – CANAUX",
  "libelleAbrev": "VOIESNAVIG",
  "viMoDe": {
    "dateDebut": null,
    "dateAgrement": "2017-12-20T01:00:00.000+01:00",
    "dateFin": null
  },
  "organeParent": null,
  "chambre": null,
  "regime": "5ème République",
  "legislature": "15",
  "secretariat": {
    "secretaire01": "M. Thierry Marchand",
    "secretaire02": null
  }
}