{
  "@xmlns": "http://schemas.assemblee-nationale.fr/referentiel",
  "uid": {
    "@xmlns:xsi": "http://www.w3.org/2001/XMLSchema-instance",
    "@xsi:type": "IdActeur_type",
    "#text": "PA719032"
  },
  "etatCivil": {
    "ident": {
      "civ": "M.",
      "prenom": "Bertrand",
      "nom": "Bouyx",
      "alpha": "Bouyx",
      "trigramme": "BBU"
    },
    "infoNaissance": {
      "dateNais": "1970-05-26T01:00:00.000+01:00",
      "villeNais": "Juvisy-sur-Orge",
      "depNais": "Essonne",
      "paysNais": "France"
    },
    "dateDeces": {
      "@xmlns:xsi": "http://www.w3.org/2001/XMLSchema-instance",
      "@xsi:nil": "true"
    }
  },
  "profession": {
    "libelleCourant": "Pharmacien",
    "socProcINSEE": {
      "catSocPro": "Professions intermédiaires de l'enseignement, de la santé, de la fonction publique et assimilés",
      "famSocPro": "Professions Intermédiaires"
    }
  },
  "uri_hatvp": "https://www.hatvp.fr/pages_nominatives/bouyx-bertrand",
  "adresses": {
    "adresse": [
      {
        "@xmlns:xsi": "http://www.w3.org/2001/XMLSchema-instance",
        "@xsi:type": "AdressePostale_Type",
        "uid": "AD719034",
        "type": "0",
        "typeLibelle": "Adresse officielle",
        "poids": "1",
        "adresseDeRattachement": null,
        "intitule": "Assemblée nationale,",
        "numeroRue": "126",
        "nomRue": "Rue de l'Université,",
        "complementAdresse": null,
        "codePostal": "75355",
        "ville": "Paris 07 SP"
      },
      {
        "@xmlns:xsi": "http://www.w3.org/2001/XMLSchema-instance",
        "@xsi:type": "AdresseSiteWeb_Type",
        "uid": "AD726728",
        "type": "25",
        "typeLibelle": "Facebook",
        "poids": null,
        "adresseDeRattachement": null,
        "valElec": "bertrandbouyx"
      },
      {
        "@xmlns:xsi": "http://www.w3.org/2001/XMLSchema-instance",
        "@xsi:type": "AdresseMail_Type",
        "uid": "AD727997",
        "type": "15",
        "typeLibelle": "Mèl",
        "poids": null,
        "adresseDeRattachement": null,
        "valElec": "bertrand.bouyx@assemblee-nationale.fr"
      },
      {
        "@xmlns:xsi": "http://www.w3.org/2001/XMLSchema-instance",
        "@xsi:type": "AdressePostale_Type",
        "uid": "AD747856",
        "type": "2",
        "typeLibelle": "Adresse publiée de circonscription",
        "poids": "2",
        "adresseDeRattachement": null,
        "intitule": "Permanence du député Bertrand Bouyx",
        "numeroRue": "46",
        "nomRue": "Rue Saint-Jean",
        "complementAdresse": "Allée de l'Orangerie",
        "codePostal": "14400",
        "ville": "Bayeux"
      },
      {
        "@xmlns:xsi": "http://www.w3.org/2001/XMLSchema-instance",
        "@xsi:type": "AdresseTelephonique_Type",
        "uid": "AD747858",
        "type": "11",
        "typeLibelle": "Téléphone",
        "poids": "2",
        "adresseDeRattachement": "AD747856",
        "valElec": "0231104810"
      },
      {
        "@xmlns:xsi": "http://www.w3.org/2001/XMLSchema-instance",
        "@xsi:type": "AdresseSiteWeb_Type",
        "uid": "AD766987",
        "type": "22",
        "typeLibelle": "Site internet",
        "poids": null,
        "adresseDeRattachement": null,
        "valElec": "www.bertrandbouyx.fr"
      }
    ]
  },
  "mandats": {
    "mandat": [
      {
        "@xmlns:xsi": "http://www.w3.org/2001/XMLSchema-instance",
        "@xsi:type": "MandatMission_Type",
        "uid": "PM760527",
        "acteurRef": "PA719032",
        "legislature": "15",
        "typeOrgane": "MISINFO",
        "dateDebut": "2018-11-21T01:00:00.000+01:00",
        "datePublication": null,
        "dateFin": null,
        "preseance": "9",
        "nominPrincipale": "1",
        "infosQualite": {
          "codeQualite": "Rapporteur",
          "libQualite": "Rapporteur",
          "libQualiteSex": "Rapporteur"
        },
        "organes": {
          "organeRef": "PO760500"
        },
        "libelle": null,
        "missionSuivanteRef": null,
        "missionPrecedenteRef": null
      },
      {
        "@xmlns:xsi": "http://www.w3.org/2001/XMLSchema-instance",
        "@xsi:type": "MandatSimple_Type",
        "uid": "PM761327",
        "acteurRef": "PA719032",
        "legislature": null,
        "typeOrgane": "PARPOL",
        "dateDebut": "2018-12-01T01:00:00.000+01:00",
        "datePublication": null,
        "dateFin": null,
        "preseance": "5",
        "nominPrincipale": "1",
        "infosQualite": {
          "codeQualite": "Membre",
          "libQualite": "Membre",
          "libQualiteSex": "Membre"
        },
        "organes": {
          "organeRef": "PO761294"
        }
      },
      {
        "@xmlns:xsi": "http://www.w3.org/2001/XMLSchema-instance",
        "@xsi:type": "MandatMission_Type",
        "uid": "PM760526",
        "acteurRef": "PA719032",
        "legislature": "15",
        "typeOrgane": "MISINFO",
        "dateDebut": "2018-11-21T01:00:00.000+01:00",
        "datePublication": null,
        "dateFin": null,
        "preseance": "10",
        "nominPrincipale": "0",
        "infosQualite": {
          "codeQualite": "Membre",
          "libQualite": "Membre",
          "libQualiteSex": "Membre"
        },
        "organes": {
          "organeRef": "PO760500"
        },
        "libelle": null,
        "missionSuivanteRef": null,
        "missionPrecedenteRef": null
      },
      {
        "@xmlns:xsi": "http://www.w3.org/2001/XMLSchema-instance",
        "@xsi:type": "MandatSimple_Type",
        "uid": "PM760646",
        "acteurRef": "PA719032",
        "legislature": "15",
        "typeOrgane": "GEVI",
        "dateDebut": "2018-11-23T01:00:00.000+01:00",
        "datePublication": null,
        "dateFin": null,
        "preseance": "20",
        "nominPrincipale": "1",
        "infosQualite": {
          "codeQualite": "Membre",
          "libQualite": "Membre",
          "libQualiteSex": "Membre"
        },
        "organes": {
          "organeRef": "PO733622"
        }
      },
      {
        "@xmlns:xsi": "http://www.w3.org/2001/XMLSchema-instance",
        "@xsi:type": "MandatSimple_Type",
        "uid": "PM763323",
        "acteurRef": "PA719032",
        "legislature": "15",
        "typeOrgane": "API",
        "dateDebut": "2019-03-20T01:00:00.000+01:00",
        "datePublication": "2019-03-20T01:00:00.000+01:00",
        "dateFin": null,
        "preseance": "20",
        "nominPrincipale": "1",
        "infosQualite": {
          "codeQualite": "Titulaire",
          "libQualite": "Membre titulaire",
          "libQualiteSex": "Membre titulaire"
        },
        "organes": {
          "organeRef": "PO304272"
        }
      },
      {
        "@xmlns:xsi": "http://www.w3.org/2001/XMLSchema-instance",
        "@xsi:type": "MandatSimple_Type",
        "uid": "PM766170",
        "acteurRef": "PA719032",
        "legislature": "15",
        "typeOrgane": "API",
        "dateDebut": "2019-03-20T01:00:00.000+01:00",
        "datePublication": null,
        "dateFin": null,
        "preseance": "20",
        "nominPrincipale": "1",
        "infosQualite": {
          "codeQualite": "Membre",
          "libQualite": "Membre",
          "libQualiteSex": "Membre"
        },
        "organes": {
          "organeRef": "PO201115"
        }
      },
      {
        "@xmlns:xsi": "http://www.w3.org/2001/XMLSchema-instance",
        "@xsi:type": "MandatSimple_Type",
        "uid": "PM740981",
        "acteurRef": "PA719032",
        "legislature": "15",
        "typeOrgane": "ORGEXTPARL",
        "dateDebut": "2017-10-19T02:00:00.000+02:00",
        "datePublication": "2017-10-21T02:00:00.000+02:00",
        "dateFin": null,
        "preseance": "20",
        "nominPrincipale": "1",
        "infosQualite": {
          "codeQualite": "Titulaire",
          "libQualite": "Membre titulaire",
          "libQualiteSex": "Membre titulaire"
        },
        "organes": {
          "organeRef": "PO427757"
        }
      },
      {
        "@xmlns:xsi": "http://www.w3.org/2001/XMLSchema-instance",
        "@xsi:type": "MandatSimple_Type",
        "uid": "PM731004",
        "acteurRef": "PA719032",
        "legislature": "15",
        "typeOrgane": "GP",
        "dateDebut": "2017-06-27T02:00:00.000+02:00",
        "datePublication": "2017-06-28T02:00:00.000+02:00",
        "dateFin": null,
        "preseance": "20",
        "nominPrincipale": "1",
        "infosQualite": {
          "codeQualite": "Membre",
          "libQualite": "Membre du",
          "libQualiteSex": "Membre du"
        },
        "organes": {
          "organeRef": "PO730964"
        }
      },
      {
        "@xmlns:xsi": "http://www.w3.org/2001/XMLSchema-instance",
        "@xsi:type": "MandatSimple_Type",
        "uid": "PM759131",
        "acteurRef": "PA719032",
        "legislature": "15",
        "typeOrgane": "COMPER",
        "dateDebut": "2018-09-30T02:00:00.000+02:00",
        "datePublication": "2018-09-30T02:00:00.000+02:00",
        "dateFin": null,
        "preseance": "32",
        "nominPrincipale": "1",
        "infosQualite": {
          "codeQualite": "Membre",
          "libQualite": "Membre",
          "libQualiteSex": "Membre"
        },
        "organes": {
          "organeRef": "PO419604"
        }
      },
      {
        "@xmlns:xsi": "http://www.w3.org/2001/XMLSchema-instance",
        "@xsi:type": "MandatSimple_Type",
        "uid": "PM753397",
        "acteurRef": "PA719032",
        "legislature": "15",
        "typeOrgane": "GE",
        "dateDebut": "2018-03-14T01:00:00.000+01:00",
        "datePublication": null,
        "dateFin": null,
        "preseance": "20",
        "nominPrincipale": "1",
        "infosQualite": {
          "codeQualite": "Membre",
          "libQualite": "Membre",
          "libQualiteSex": "Membre"
        },
        "organes": {
          "organeRef": "PO747042"
        }
      },
      {
        "@xmlns:xsi": "http://www.w3.org/2001/XMLSchema-instance",
        "@xsi:type": "MandatSimple_Type",
        "uid": "PM749413",
        "acteurRef": "PA719032",
        "legislature": "15",
        "typeOrgane": "GE",
        "dateDebut": "2018-02-12T01:00:00.000+01:00",
        "datePublication": null,
        "dateFin": null,
        "preseance": "20",
        "nominPrincipale": "1",
        "infosQualite": {
          "codeQualite": "Membre",
          "libQualite": "Membre",
          "libQualiteSex": "Membre"
        },
        "organes": {
          "organeRef": "PO746748"
        }
      },
      {
        "@xmlns:xsi": "http://www.w3.org/2001/XMLSchema-instance",
        "@xsi:type": "MandatSimple_Type",
        "uid": "PM755352",
        "acteurRef": "PA719032",
        "legislature": "15",
        "typeOrgane": "GE",
        "dateDebut": "2018-04-10T02:00:00.000+02:00",
        "datePublication": null,
        "dateFin": null,
        "preseance": "20",
        "nominPrincipale": "1",
        "infosQualite": {
          "codeQualite": "Membre",
          "libQualite": "Membre",
          "libQualiteSex": "Membre"
        },
        "organes": {
          "organeRef": "PO746962"
        }
      },
      {
        "@xmlns:xsi": "http://www.w3.org/2001/XMLSchema-instance",
        "@xsi:type": "MandatSimple_Type",
        "uid": "PM749169",
        "acteurRef": "PA719032",
        "legislature": "15",
        "typeOrgane": "GE",
        "dateDebut": "2018-02-08T01:00:00.000+01:00",
        "datePublication": null,
        "dateFin": null,
        "preseance": "20",
        "nominPrincipale": "1",
        "infosQualite": {
          "codeQualite": "Membre",
          "libQualite": "Membre",
          "libQualiteSex": "Membre"
        },
        "organes": {
          "organeRef": "PO746735"
        }
      },
      {
        "@xmlns:xsi": "http://www.w3.org/2001/XMLSchema-instance",
        "@xsi:type": "MandatSimple_Type",
        "uid": "PM753640",
        "acteurRef": "PA719032",
        "legislature": "15",
        "typeOrgane": "GE",
        "dateDebut": "2018-03-15T01:00:00.000+01:00",
        "datePublication": null,
        "dateFin": null,
        "preseance": "20",
        "nominPrincipale": "1",
        "infosQualite": {
          "codeQualite": "Membre",
          "libQualite": "Membre",
          "libQualiteSex": "Membre"
        },
        "organes": {
          "organeRef": "PO746992"
        }
      },
      {
        "@xmlns:xsi": "http://www.w3.org/2001/XMLSchema-instance",
        "@xsi:type": "MandatSimple_Type",
        "uid": "PM757501",
        "acteurRef": "PA719032",
        "legislature": "15",
        "typeOrgane": "GE",
        "dateDebut": "2018-06-24T02:00:00.000+02:00",
        "datePublication": null,
        "dateFin": null,
        "preseance": "20",
        "nominPrincipale": "1",
        "infosQualite": {
          "codeQualite": "Membre",
          "libQualite": "Membre",
          "libQualiteSex": "Membre"
        },
        "organes": {
          "organeRef": "PO747145"
        }
      },
      {
        "@xmlns:xsi": "http://www.w3.org/2001/XMLSchema-instance",
        "@xsi:type": "MandatSimple_Type",
        "uid": "PM750490",
        "acteurRef": "PA719032",
        "legislature": "15",
        "typeOrgane": "GE",
        "dateDebut": "2018-02-14T01:00:00.000+01:00",
        "datePublication": null,
        "dateFin": null,
        "preseance": "20",
        "nominPrincipale": "1",
        "infosQualite": {
          "codeQualite": "Membre",
          "libQualite": "Membre",
          "libQualiteSex": "Membre"
        },
        "organes": {
          "organeRef": "PO747037"
        }
      },
      {
        "@xmlns:xsi": "http://www.w3.org/2001/XMLSchema-instance",
        "@xsi:type": "MandatSimple_Type",
        "uid": "PM753741",
        "acteurRef": "PA719032",
        "legislature": "15",
        "typeOrgane": "GE",
        "dateDebut": "2018-03-14T01:00:00.000+01:00",
        "datePublication": null,
        "dateFin": null,
        "preseance": "12",
        "nominPrincipale": "1",
        "infosQualite": {
          "codeQualite": "Secrétaire",
          "libQualite": "Secrétaire",
          "libQualiteSex": "Secrétaire"
        },
        "organes": {
          "organeRef": "PO746925"
        }
      },
      {
        "@xmlns:xsi": "http://www.w3.org/2001/XMLSchema-instance",
        "@xsi:type": "MandatSimple_Type",
        "uid": "PM756258",
        "acteurRef": "PA719032",
        "legislature": "15",
        "typeOrgane": "GE",
        "dateDebut": "2018-05-22T02:00:00.000+02:00",
        "datePublication": null,
        "dateFin": null,
        "preseance": "20",
        "nominPrincipale": "1",
        "infosQualite": {
          "codeQualite": "Membre",
          "libQualite": "Membre",
          "libQualiteSex": "Membre"
        },
        "organes": {
          "organeRef": "PO751484"
        }
      },
      {
        "@xmlns:xsi": "http://www.w3.org/2001/XMLSchema-instance",
        "@xsi:type": "MandatSimple_Type",
        "uid": "PM751960",
        "acteurRef": "PA719032",
        "legislature": "15",
        "typeOrgane": "GE",
        "dateDebut": "2018-02-23T01:00:00.000+01:00",
        "datePublication": null,
        "dateFin": null,
        "preseance": "20",
        "nominPrincipale": "0",
        "infosQualite": {
          "codeQualite": "Membre",
          "libQualite": "Membre",
          "libQualiteSex": "Membre"
        },
        "organes": {
          "organeRef": "PO746925"
        }
      },
      {
        "@xmlns:xsi": "http://www.w3.org/2001/XMLSchema-instance",
        "@xsi:type": "MandatSimple_Type",
        "uid": "PM751068",
        "acteurRef": "PA719032",
        "legislature": "15",
        "typeOrgane": "GE",
        "dateDebut": "2018-02-19T01:00:00.000+01:00",
        "datePublication": null,
        "dateFin": null,
        "preseance": "20",
        "nominPrincipale": "1",
        "infosQualite": {
          "codeQualite": "Membre",
          "libQualite": "Membre",
          "libQualiteSex": "Membre"
        },
        "organes": {
          "organeRef": "PO746832"
        }
      },
      {
        "@xmlns:xsi": "http://www.w3.org/2001/XMLSchema-instance",
        "@xsi:type": "MandatSimple_Type",
        "uid": "PM749428",
        "acteurRef": "PA719032",
        "legislature": "15",
        "typeOrgane": "GE",
        "dateDebut": "2018-02-12T01:00:00.000+01:00",
        "datePublication": null,
        "dateFin": null,
        "preseance": "20",
        "nominPrincipale": "1",
        "infosQualite": {
          "codeQualite": "Membre",
          "libQualite": "Membre",
          "libQualiteSex": "Membre"
        },
        "organes": {
          "organeRef": "PO747155"
        }
      },
      {
        "@xmlns:xsi": "http://www.w3.org/2001/XMLSchema-instance",
        "@xsi:type": "MandatSimple_Type",
        "uid": "PM738804",
        "acteurRef": "PA719032",
        "legislature": "15",
        "typeOrgane": "GA",
        "dateDebut": "2017-10-10T02:00:00.000+02:00",
        "datePublication": null,
        "dateFin": null,
        "preseance": "20",
        "nominPrincipale": "1",
        "infosQualite": {
          "codeQualite": "Membre",
          "libQualite": "Membre",
          "libQualiteSex": "Membre"
        },
        "organes": {
          "organeRef": "PO733157"
        }
      },
      {
        "@xmlns:xsi": "http://www.w3.org/2001/XMLSchema-instance",
        "@xsi:type": "MandatSimple_Type",
        "uid": "PM746306",
        "acteurRef": "PA719032",
        "legislature": "15",
        "typeOrgane": "GA",
        "dateDebut": "2017-11-08T01:00:00.000+01:00",
        "datePublication": null,
        "dateFin": null,
        "preseance": "14",
        "nominPrincipale": "1",
        "infosQualite": {
          "codeQualite": "Secrétaire",
          "libQualite": "Secrétaire",
          "libQualiteSex": "Secrétaire"
        },
        "organes": {
          "organeRef": "PO733072"
        }
      },
      {
        "@xmlns:xsi": "http://www.w3.org/2001/XMLSchema-instance",
        "@xsi:type": "MandatSimple_Type",
        "uid": "PM738806",
        "acteurRef": "PA719032",
        "legislature": "15",
        "typeOrgane": "GA",
        "dateDebut": "2017-10-10T02:00:00.000+02:00",
        "datePublication": null,
        "dateFin": null,
        "preseance": "20",
        "nominPrincipale": "0",
        "infosQualite": {
          "codeQualite": "Membre",
          "libQualite": "Membre",
          "libQualiteSex": "Membre"
        },
        "organes": {
          "organeRef": "PO733352"
        }
      },
      {
        "@xmlns:xsi": "http://www.w3.org/2001/XMLSchema-instance",
        "@xsi:type": "MandatSimple_Type",
        "uid": "PM738810",
        "acteurRef": "PA719032",
        "legislature": "15",
        "typeOrgane": "GA",
        "dateDebut": "2017-10-10T02:00:00.000+02:00",
        "datePublication": null,
        "dateFin": null,
        "preseance": "20",
        "nominPrincipale": "1",
        "infosQualite": {
          "codeQualite": "Membre",
          "libQualite": "Membre",
          "libQualiteSex": "Membre"
        },
        "organes": {
          "organeRef": "PO733642"
        }
      },
      {
        "@xmlns:xsi": "http://www.w3.org/2001/XMLSchema-instance",
        "@xsi:type": "MandatSimple_Type",
        "uid": "PM735324",
        "acteurRef": "PA719032",
        "legislature": "15",
        "typeOrgane": "GA",
        "dateDebut": "2017-09-26T02:00:00.000+02:00",
        "datePublication": null,
        "dateFin": null,
        "preseance": "1",
        "nominPrincipale": "1",
        "infosQualite": {
          "codeQualite": "Président",
          "libQualite": "Président",
          "libQualiteSex": "Président"
        },
        "organes": {
          "organeRef": "PO733092"
        }
      },
      {
        "@xmlns:xsi": "http://www.w3.org/2001/XMLSchema-instance",
        "@xsi:type": "MandatSimple_Type",
        "uid": "PM738808",
        "acteurRef": "PA719032",
        "legislature": "15",
        "typeOrgane": "GA",
        "dateDebut": "2017-10-10T02:00:00.000+02:00",
        "datePublication": null,
        "dateFin": null,
        "preseance": "20",
        "nominPrincipale": "0",
        "infosQualite": {
          "codeQualite": "Membre",
          "libQualite": "Membre",
          "libQualiteSex": "Membre"
        },
        "organes": {
          "organeRef": "PO733577"
        }
      },
      {
        "@xmlns:xsi": "http://www.w3.org/2001/XMLSchema-instance",
        "@xsi:type": "MandatSimple_Type",
        "uid": "PM766218",
        "acteurRef": "PA719032",
        "legislature": "15",
        "typeOrgane": "GA",
        "dateDebut": "2019-07-04T02:00:00.000+02:00",
        "datePublication": null,
        "dateFin": null,
        "preseance": "20",
        "nominPrincipale": "1",
        "infosQualite": {
          "codeQualite": "Membre",
          "libQualite": "Membre",
          "libQualiteSex": "Membre"
        },
        "organes": {
          "organeRef": "PO733117"
        }
      },
      {
        "@xmlns:xsi": "http://www.w3.org/2001/XMLSchema-instance",
        "@xsi:type": "MandatSimple_Type",
        "uid": "PM738803",
        "acteurRef": "PA719032",
        "legislature": "15",
        "typeOrgane": "GA",
        "dateDebut": "2017-10-10T02:00:00.000+02:00",
        "datePublication": null,
        "dateFin": null,
        "preseance": "20",
        "nominPrincipale": "0",
        "infosQualite": {
          "codeQualite": "Membre",
          "libQualite": "Membre",
          "libQualiteSex": "Membre"
        },
        "organes": {
          "organeRef": "PO733072"
        }
      },
      {
        "@xmlns:xsi": "http://www.w3.org/2001/XMLSchema-instance",
        "@xsi:type": "MandatSimple_Type",
        "uid": "PM738805",
        "acteurRef": "PA719032",
        "legislature": "15",
        "typeOrgane": "GA",
        "dateDebut": "2017-10-10T02:00:00.000+02:00",
        "datePublication": null,
        "dateFin": null,
        "preseance": "20",
        "nominPrincipale": "1",
        "infosQualite": {
          "codeQualite": "Membre",
          "libQualite": "Membre",
          "libQualiteSex": "Membre"
        },
        "organes": {
          "organeRef": "PO733312"
        }
      },
      {
        "@xmlns:xsi": "http://www.w3.org/2001/XMLSchema-instance",
        "@xsi:type": "MandatSimple_Type",
        "uid": "PM735323",
        "acteurRef": "PA719032",
        "legislature": "15",
        "typeOrgane": "GA",
        "dateDebut": "2017-09-26T02:00:00.000+02:00",
        "datePublication": null,
        "dateFin": null,
        "preseance": "20",
        "nominPrincipale": "0",
        "infosQualite": {
          "codeQualite": "Membre",
          "libQualite": "Membre",
          "libQualiteSex": "Membre"
        },
        "organes": {
          "organeRef": "PO733092"
        }
      },
      {
        "@xmlns:xsi": "http://www.w3.org/2001/XMLSchema-instance",
        "@xsi:type": "MandatSimple_Type",
        "uid": "PM738807",
        "acteurRef": "PA719032",
        "legislature": "15",
        "typeOrgane": "GA",
        "dateDebut": "2017-10-10T02:00:00.000+02:00",
        "datePublication": null,
        "dateFin": null,
        "preseance": "20",
        "nominPrincipale": "1",
        "infosQualite": {
          "codeQualite": "Membre",
          "libQualite": "Membre",
          "libQualiteSex": "Membre"
        },
        "organes": {
          "organeRef": "PO733572"
        }
      },
      {
        "@xmlns:xsi": "http://www.w3.org/2001/XMLSchema-instance",
        "@xsi:type": "MandatSimple_Type",
        "uid": "PM738809",
        "acteurRef": "PA719032",
        "legislature": "15",
        "typeOrgane": "GA",
        "dateDebut": "2017-10-10T02:00:00.000+02:00",
        "datePublication": null,
        "dateFin": null,
        "preseance": "20",
        "nominPrincipale": "1",
        "infosQualite": {
          "codeQualite": "Membre",
          "libQualite": "Membre",
          "libQualiteSex": "Membre"
        },
        "organes": {
          "organeRef": "PO733597"
        }
      },
      {
        "@xmlns:xsi": "http://www.w3.org/2001/XMLSchema-instance",
        "@xsi:type": "MandatSimple_Type",
        "uid": "PM742317",
        "acteurRef": "PA719032",
        "legislature": "15",
        "typeOrgane": "GA",
        "dateDebut": "2017-10-31T01:00:00.000+01:00",
        "datePublication": null,
        "dateFin": null,
        "preseance": "20",
        "nominPrincipale": "1",
        "infosQualite": {
          "codeQualite": "Membre",
          "libQualite": "Membre",
          "libQualiteSex": "Membre"
        },
        "organes": {
          "organeRef": "PO732974"
        }
      },
      {
        "@xmlns:xsi": "http://www.w3.org/2001/XMLSchema-instance",
        "@xsi:type": "MandatSimple_Type",
        "uid": "PM743839",
        "acteurRef": "PA719032",
        "legislature": "15",
        "typeOrgane": "GA",
        "dateDebut": "2017-11-22T01:00:00.000+01:00",
        "datePublication": null,
        "dateFin": null,
        "preseance": "20",
        "nominPrincipale": "1",
        "infosQualite": {
          "codeQualite": "Membre",
          "libQualite": "Membre",
          "libQualiteSex": "Membre"
        },
        "organes": {
          "organeRef": "PO733412"
        }
      },
      {
        "@xmlns:xsi": "http://www.w3.org/2001/XMLSchema-instance",
        "@xsi:type": "MandatSimple_Type",
        "uid": "PM744151",
        "acteurRef": "PA719032",
        "legislature": "15",
        "typeOrgane": "GA",
        "dateDebut": "2017-11-22T01:00:00.000+01:00",
        "datePublication": null,
        "dateFin": null,
        "preseance": "14",
        "nominPrincipale": "1",
        "infosQualite": {
          "codeQualite": "Secrétaire",
          "libQualite": "Secrétaire",
          "libQualiteSex": "Secrétaire"
        },
        "organes": {
          "organeRef": "PO733352"
        }
      },
      {
        "@xmlns:xsi": "http://www.w3.org/2001/XMLSchema-instance",
        "@xsi:type": "MandatSimple_Type",
        "uid": "PM742292",
        "acteurRef": "PA719032",
        "legislature": "15",
        "typeOrgane": "GA",
        "dateDebut": "2017-10-31T01:00:00.000+01:00",
        "datePublication": null,
        "dateFin": null,
        "preseance": "8",
        "nominPrincipale": "1",
        "infosQualite": {
          "codeQualite": "Vice-Président",
          "libQualite": "Vice-Président",
          "libQualiteSex": "Vice-Président"
        },
        "organes": {
          "organeRef": "PO733577"
        }
      },
      {
        "@xmlns:xsi": "http://www.w3.org/2001/XMLSchema-instance",
        "@xsi:type": "MandatParlementaire_type",
        "uid": "PM722538",
        "acteurRef": "PA719032",
        "legislature": "15",
        "typeOrgane": "ASSEMBLEE",
        "dateDebut": "2017-06-18T02:00:00.000+02:00",
        "datePublication": null,
        "dateFin": null,
        "preseance": "50",
        "nominPrincipale": "1",
        "infosQualite": {
          "codeQualite": "membre",
          "libQualite": "membre",
          "libQualiteSex": "membre"
        },
        "organes": {
          "organeRef": "PO717460"
        },
        "suppleants": {
          "suppleant": {
            "dateDebut": "2017-06-18T02:00:00.000+02:00",
            "dateFin": null,
            "suppleantRef": "PA719036"
          }
        },
        "chambre": null,
        "election": {
          "lieu": {
            "region": "Normandie",
            "regionType": "Métropolitain",
            "departement": "Calvados",
            "numDepartement": "14",
            "numCirco": "5"
          },
          "causeMandat": "élections générales",
          "refCirconscription": "PO717602"
        },
        "mandature": {
          "datePriseFonction": "2017-06-21T02:00:00.000+02:00",
          "causeFin": null,
          "premiereElection": "0",
          "placeHemicycle": "210",
          "mandatRemplaceRef": null
        },
        "collaborateurs": {
          "collaborateur": [
            {
              "qualite": "M.",
              "prenom": "David",
              "nom": "Lemaresquier",
              "dateDebut": null,
              "dateFin": null
            },
            {
              "qualite": "M.",
              "prenom": "Cyrille",
              "nom": "Malinosky",
              "dateDebut": null,
              "dateFin": null
            },
            {
              "qualite": "M.",
              "prenom": "Hugo",
              "nom": "Guillochin",
              "dateDebut": null,
              "dateFin": null
            },
            {
              "qualite": "Mme",
              "prenom": "Marie",
              "nom": "Lebedio",
              "dateDebut": null,
              "dateFin": null
            }
          ]
        }
      }
    ]
  }
}