{
  "@xmlns": "http://schemas.assemblee-nationale.fr/referentiel",
  "@xmlns:xsi": "http://www.w3.org/2001/XMLSchema-instance",
  "@xsi:type": "OrganeExtraParlementaire_type",
  "uid": "PO693055",
  "codeType": "ORGEXTPARL",
  "libelle": "Conseil national du numérique (formation élargie)",
  "libelleEdition": "du Conseil national du numérique (formation élargie)",
  "libelleAbrege": "Numérique",
  "libelleAbrev": "304",
  "viMoDe": {
    "dateDebut": "2012-12-13T01:00:00.000+01:00",
    "dateAgrement": null,
    "dateFin": null
  },
  "organeParent": null,
  "chambre": null,
  "regime": "5ème République",
  "legislature": null,
  "regimeJuridique": "Article 33 de la loi  n° 2018-699 du 3 août 2018",
  "siteInternet": "https://cnnumerique.fr/",
  "nombreReunionsAnnuelles": null
}