{
  "@xmlns": "http://schemas.assemblee-nationale.fr/referentiel",
  "@xmlns:xsi": "http://www.w3.org/2001/XMLSchema-instance",
  "@xsi:type": "OrganeParlementaire_Type",
  "uid": "PO760090",
  "codeType": "MISINFO",
  "libelle": "Mission d'information sur l'aide juridictionnelle",
  "libelleEdition": null,
  "libelleAbrege": "Aide juridictionnelle",
  "libelleAbrev": "AIDEJURID",
  "viMoDe": {
    "dateDebut": "2018-11-07T01:00:00.000+01:00",
    "dateAgrement": null,
    "dateFin": null
  },
  "organeParent": "PO59051",
  "chambre": null,
  "regime": "5ème République",
  "legislature": "15",
  "secretariat": {
    "secretaire01": null,
    "secretaire02": null
  }
}