{
  "@xmlns": "http://schemas.assemblee-nationale.fr/referentiel",
  "@xmlns:xsi": "http://www.w3.org/2001/XMLSchema-instance",
  "@xsi:type": "OrganeParlementaire_Type",
  "uid": "PO759296",
  "codeType": "MISINFO",
  "libelle": "Mission d'information sur la radicalisation dans les services publics",
  "libelleEdition": "de la mission d'information sur la radicalisation dans les services publics",
  "libelleAbrege": "Radicalisation dans les services publics",
  "libelleAbrev": "RADICALSP",
  "viMoDe": {
    "dateDebut": "2018-10-02T02:00:00.000+02:00",
    "dateAgrement": null,
    "dateFin": null
  },
  "organeParent": "PO59051",
  "chambre": null,
  "regime": "5ème République",
  "legislature": "15",
  "secretariat": {
    "secretaire01": null,
    "secretaire02": null
  }
}