{
  "@xmlns": "http://schemas.assemblee-nationale.fr/referentiel",
  "@xmlns:xsi": "http://www.w3.org/2001/XMLSchema-instance",
  "@xsi:type": "OrganeExtraParlementaire_type",
  "uid": "PO709200",
  "codeType": "ORGEXTPARL",
  "libelle": "Conseil supérieur de la coopération",
  "libelleEdition": "du Conseil supérieur de la coopération",
  "libelleAbrege": "Coopération",
  "libelleAbrev": "338",
  "viMoDe": {
    "dateDebut": "2015-05-20T02:00:00.000+02:00",
    "dateAgrement": null,
    "dateFin": null
  },
  "organeParent": null,
  "chambre": null,
  "regime": "5ème République",
  "legislature": null,
  "regimeJuridique": "Articles 5-1 de la loi n° 47-1775 du 10 septembre 1947 et 1er du décret n° 2015-562 du 20 mai 2015",
  "siteInternet": null,
  "nombreReunionsAnnuelles": null
}