{
  "@xmlns": "http://schemas.assemblee-nationale.fr/referentiel",
  "@xmlns:xsi": "http://www.w3.org/2001/XMLSchema-instance",
  "@xsi:type": "OrganeExtraParlementaire_type",
  "uid": "PO742477",
  "codeType": "ORGEXTPARL",
  "libelle": "Office franco-québécois pour la jeunesse",
  "libelleEdition": "de l'Office franco-québécois pour la jeunesse",
  "libelleAbrege": "Office franco-québécois pour la jeunesse",
  "libelleAbrev": "381",
  "viMoDe": {
    "dateDebut": "2017-11-01T01:00:00.000+01:00",
    "dateAgrement": null,
    "dateFin": null
  },
  "organeParent": null,
  "chambre": null,
  "regime": "5ème République",
  "legislature": null,
  "regimeJuridique": "Article 31 de la loi n° 2018-699 du 3 août 2018",
  "siteInternet": "http://www.ofqj.org/book/notre-organisation",
  "nombreReunionsAnnuelles": "1"
}