{
  "@xmlns": "http://schemas.assemblee-nationale.fr/referentiel",
  "@xmlns:xsi": "http://www.w3.org/2001/XMLSchema-instance",
  "@xsi:type": "OrganeParlementaire_Type",
  "uid": "PO747225",
  "codeType": "GE",
  "libelle": "Statut des travailleurs mobiles en Europe",
  "libelleEdition": "STATUT DES TRAVAILLEURS MOBILES EN EUROPE",
  "libelleAbrege": "STATUT DES TRAVAILLEURS MOBILES EN EUROPE",
  "libelleAbrev": "STATRAVMOB",
  "viMoDe": {
    "dateDebut": null,
    "dateAgrement": "2017-12-20T01:00:00.000+01:00",
    "dateFin": null
  },
  "organeParent": null,
  "chambre": null,
  "regime": "5ème République",
  "legislature": "15",
  "secretariat": {
    "secretaire01": "Mme Valérie Checketts",
    "secretaire02": null
  }
}