<?xml version="1.0" encoding="UTF-8" standalone="no"?>
<!-- Created with Inkscape (http://www.inkscape.org/) -->

<svg
   width="211.66667mm"
   height="158.75mm"
   viewBox="0 0 211.66667 158.75"
   version="1.1"
   id="svg1211"
   inkscape:version="1.2.1 (9c6d41e410, 2022-07-14)"
   sodipodi:docname="menu_back.svg"
   inkscape:export-filename="menu_back.png"
   inkscape:export-xdpi="96"
   inkscape:export-ydpi="96"
   xmlns:inkscape="http://www.inkscape.org/namespaces/inkscape"
   xmlns:sodipodi="http://sodipodi.sourceforge.net/DTD/sodipodi-0.dtd"
   xmlns="http://www.w3.org/2000/svg"
   xmlns:svg="http://www.w3.org/2000/svg">
  <sodipodi:namedview
     id="namedview1213"
     pagecolor="#ffffff"
     bordercolor="#111111"
     borderopacity="1"
     inkscape:showpageshadow="0"
     inkscape:pageopacity="0"
     inkscape:pagecheckerboard="1"
     inkscape:deskcolor="#d1d1d1"
     inkscape:document-units="mm"
     showgrid="false"
     inkscape:zoom="0.74386223"
     inkscape:cx="490.68226"
     inkscape:cy="329.36206"
     inkscape:window-width="2560"
     inkscape:window-height="1015"
     inkscape:window-x="0"
     inkscape:window-y="36"
     inkscape:window-maximized="1"
     inkscape:current-layer="layer1" />
  <defs
     id="defs1208" />
  <g
     inkscape:label="Calque 1"
     inkscape:groupmode="layer"
     id="layer1"
     transform="translate(42.077535,-61.764705)">
    <rect
       style="fill:#3a404b;fill-opacity:0.99914002;fill-rule:evenodd;stroke-width:0.3"
       id="rect2071"
       width="211.66666"
       height="158.75"
       x="-42.077534"
       y="61.764706" />
    <g
       id="feu-rouge-O"
       transform="matrix(3.2403428,0,0,3.2403428,-61.45453,-605.38773)"
       style="opacity:0.30497003">
      <path
         id="path14955"
         style="fill:#000000;fill-opacity:0.99914;fill-rule:evenodd;stroke-width:0.3"
         d="m 30.955898,226.80225 c 0,-0.64504 -0.55635,-0.94862 -1.16427,-1.16428 l -2.53473,-0.89917 v -1.25367 c 0,-2.5155 -2.16955,-3.69931 -4.54029,-4.5403 l -10.6748,-3.78683 c -2.3707398,-0.841 -4.5402897,2.02531 -4.5402897,4.5408 v 1.80764 c 0,2.51549 2.1695499,3.69981 4.5402897,4.54081 l 10.6748,3.78685 c 1.71871,0.60969 3.33132,-0.72971 4.08864,-2.47066 0.0812,0.0341 0.16451,0.0656 0.24908,0.0956 l 2.7373,0.971 c 0.60792,0.21565 1.16427,-0.51923 1.16427,-1.16426 z" />
      <ellipse
         style="fill:#112b00;fill-opacity:0.99914;fill-rule:evenodd;stroke-width:0.176751"
         id="ellipse14957"
         cx="224.62929"
         cy="-22.979254"
         rx="3.3072917"
         ry="2.3812499"
         transform="rotate(90)" />
      <ellipse
         style="fill:#552200;fill-opacity:0.99914;fill-rule:evenodd;stroke-width:0.176751"
         id="ellipse14959"
         cx="222.34456"
         cy="-17.303473"
         rx="3.3072917"
         ry="2.3812499"
         transform="rotate(90)" />
      <ellipse
         style="fill:#ff0000;fill-opacity:0.99914;fill-rule:evenodd;stroke-width:0.176751"
         id="ellipse14961"
         cx="220.16515"
         cy="-11.448782"
         rx="3.3072917"
         ry="2.3812499"
         transform="rotate(90)" />
    </g>
    <path
       id="rect1384"
       style="opacity:0.943991;mix-blend-mode:normal;fill:#343a45;fill-opacity:1;fill-rule:evenodd;stroke-width:0.931195"
       d="m 25.055318,61.764705 a 50.336552,39.328003 0 0 1 8.792745,22.200712 50.336552,39.328003 0 0 1 -50.336462,39.327833 50.336552,39.328003 0 0 1 -25.589136,-5.48235 V 220.51471 H 108.64712 L 38.984184,178.73689 169.58913,86.800903 V 61.764705 Z" />
    <g
       id="feu-vert-N"
       transform="matrix(3.8556439,0,0,3.8556439,-113.66346,-515.54782)"
       style="opacity:0.19721188">
      <path
         id="path14877"
         style="fill:#000000;fill-opacity:0.99914;fill-rule:evenodd;stroke-width:0.3"
         d="m 65.301151,197.44899 c 0.64504,0 0.94862,-0.55635 1.16427,-1.16427 l 0.89917,-2.53473 h 1.25367 c 2.5155,0 3.69931,-2.16955 4.5403,-4.54029 l 3.78684,-10.6748 c 0.84099,-2.37074 -2.02531,-4.54029 -4.5408,-4.54029 h -1.80765 c -2.51549,0 -3.69981,2.16955 -4.5408,4.54029 l -3.78685,10.6748 c -0.60969,1.71871 0.7297,3.33132 2.47065,4.08864 -0.0341,0.0812 -0.0656,0.16451 -0.0956,0.24908 l -0.971,2.7373 c -0.21565,0.60792 0.51923,1.16427 1.16427,1.16427 z" />
      <ellipse
         style="fill:#66ff00;fill-opacity:0.99914;fill-rule:evenodd;stroke-width:0.176751"
         id="ellipse14879"
         cx="-67.474106"
         cy="-189.47235"
         rx="3.3072917"
         ry="2.3812499"
         transform="scale(-1)" />
      <ellipse
         style="fill:#552200;fill-opacity:0.99914;fill-rule:evenodd;stroke-width:0.176751"
         id="ellipse14881"
         cx="-69.758842"
         cy="-183.79657"
         rx="3.3072917"
         ry="2.3812499"
         transform="scale(-1)" />
      <ellipse
         style="fill:#550000;fill-opacity:0.99914;fill-rule:evenodd;stroke-width:0.176751"
         id="ellipse14883"
         cx="-71.938255"
         cy="-177.94188"
         rx="3.3072917"
         ry="2.3812499"
         transform="scale(-1)" />
    </g>
  </g>
</svg>
