<?xml version="1.0" encoding="UTF-8" standalone="no"?>
<!-- Created with Inkscape (http://www.inkscape.org/) -->

<svg
   width="39.6875mm"
   height="39.6875mm"
   viewBox="0 0 39.6875 39.6875"
   version="1.1"
   id="svg4773"
   inkscape:version="1.2.1 (9c6d41e410, 2022-07-14)"
   sodipodi:docname="grass-tile.svg"
   xmlns:inkscape="http://www.inkscape.org/namespaces/inkscape"
   xmlns:sodipodi="http://sodipodi.sourceforge.net/DTD/sodipodi-0.dtd"
   xmlns:xlink="http://www.w3.org/1999/xlink"
   xmlns="http://www.w3.org/2000/svg"
   xmlns:svg="http://www.w3.org/2000/svg">
  <sodipodi:namedview
     id="namedview4775"
     pagecolor="#ffffff"
     bordercolor="#111111"
     borderopacity="1"
     inkscape:showpageshadow="0"
     inkscape:pageopacity="0"
     inkscape:pagecheckerboard="1"
     inkscape:deskcolor="#d1d1d1"
     inkscape:document-units="mm"
     showgrid="false"
     inkscape:zoom="0.74386223"
     inkscape:cx="-34.280541"
     inkscape:cy="298.44236"
     inkscape:window-width="1920"
     inkscape:window-height="1015"
     inkscape:window-x="0"
     inkscape:window-y="36"
     inkscape:window-maximized="1"
     inkscape:current-layer="layer1" />
  <defs
     id="defs4770">
    <radialGradient
       inkscape:collect="always"
       xlink:href="#linearGradient1192"
       id="radialGradient3178"
       cx="48.299686"
       cy="64.258575"
       fx="48.299686"
       fy="64.258575"
       r="19.84375"
       gradientUnits="userSpaceOnUse"
       gradientTransform="translate(85.794924,25.374961)" />
    <linearGradient
       inkscape:collect="always"
       id="linearGradient1192">
      <stop
         style="stop-color:#8fc64a;stop-opacity:1;"
         offset="0.07049976"
         id="stop1188" />
      <stop
         style="stop-color:#7cb131;stop-opacity:1;"
         offset="0.9686861"
         id="stop1190" />
    </linearGradient>
  </defs>
  <g
     inkscape:label="Calque 1"
     inkscape:groupmode="layer"
     id="layer1"
     transform="translate(-114.25086,-69.78978)">
    <rect
       style="fill:url(#radialGradient3178);fill-opacity:1;fill-rule:evenodd;stroke-width:0.277814"
       id="rect234"
       width="39.6875"
       height="39.6875"
       x="114.25086"
       y="69.78978" />
    <g
       id="g1163"
       transform="translate(29.952212,25.781805)">
      <path
         id="rect1002"
         style="fill:#84d60e;fill-opacity:1;fill-rule:evenodd;stroke-width:0.0522465"
         d="m 89.838568,69.45369 c 0,0 1.393308,0.328828 1.863517,2.468175 0.470213,2.139348 1.002028,7.167628 1.002028,7.167628 l -0.9238,-1.25234 c 0,0 0.279901,-1.662655 -0.426002,-4.808848 -0.705907,-3.146193 -1.515743,-3.574615 -1.515743,-3.574615 z"
         sodipodi:nodetypes="czcczc" />
      <path
         id="path1101"
         style="fill:#8de50f;fill-opacity:1;fill-rule:evenodd;stroke-width:0.0410704"
         d="m 94.884612,72.583771 c 0,0 -0.850044,-0.05471 -1.138878,0.511631 -0.288835,0.566341 -1.054413,6.004788 -1.054413,6.004788 l 0.717129,-0.9771 c 0,0 -0.166135,-0.945699 0.159842,-2.658331 0.325976,-1.712633 1.31632,-2.880988 1.31632,-2.880988 z"
         sodipodi:nodetypes="czcczc" />
      <path
         id="path1155"
         style="fill:#7eca0d;fill-opacity:1;fill-rule:evenodd;stroke-width:0.3"
         inkscape:transform-center-x="0.89807107"
         inkscape:transform-center-y="-0.45561376"
         d="m 93.22011,78.396039 -0.533514,0.711294 -0.225882,-2.074284 -0.17192,-6.450733 z"
         sodipodi:nodetypes="ccccc" />
    </g>
    <g
       id="g3176"
       transform="matrix(-0.61362209,0,0,0.61362209,191.35731,34.604005)">
      <path
         id="path3170"
         style="fill:#84d60e;fill-opacity:1;fill-rule:evenodd;stroke-width:0.0522465"
         d="m 89.838568,69.45369 c 0,0 1.393308,0.328828 1.863517,2.468175 0.470213,2.139348 1.002028,7.167628 1.002028,7.167628 l -0.9238,-1.25234 c 0,0 0.279901,-1.662655 -0.426002,-4.808848 -0.705907,-3.146193 -1.515743,-3.574615 -1.515743,-3.574615 z"
         sodipodi:nodetypes="czcczc" />
      <path
         id="path3172"
         style="fill:#8de50f;fill-opacity:1;fill-rule:evenodd;stroke-width:0.0410704"
         d="m 94.884612,72.583771 c 0,0 -0.850044,-0.05471 -1.138878,0.511631 -0.288835,0.566341 -1.054413,6.004788 -1.054413,6.004788 l 0.717129,-0.9771 c 0,0 -0.166135,-0.945699 0.159842,-2.658331 0.325976,-1.712633 1.31632,-2.880988 1.31632,-2.880988 z"
         sodipodi:nodetypes="czcczc" />
      <path
         id="path3174"
         style="fill:#7eca0d;fill-opacity:1;fill-rule:evenodd;stroke-width:0.3"
         inkscape:transform-center-x="0.89807107"
         inkscape:transform-center-y="-0.45561376"
         d="m 93.22011,78.396039 -0.533514,0.711294 -0.225882,-2.074284 -0.17192,-6.450733 z"
         sodipodi:nodetypes="ccccc" />
    </g>
  </g>
</svg>
