critere,valeur
"Respect du temps (5 minutes $\pm$15s)",2
"Communication orale",4
"Maîtrise des outils techniques (C++, Compilation)",5
"Organisation et suivi collaboratifs du projet",5
"Implication dans le projet",4
