@startuml
skinparam classAttributeIconSize 0

class Activite {
   {static} code : Varchar(5)
   ..
   libelle : Varchar(50)
}
class Coureur {
   {static} licence : Varchar(5)
   ..
   nom : Varchar(50)
   ..
   prenom : Varchar(50)
   ..
   sexe : Character(1)
   ..
   nationalite : Varchar(50)
   ..
   mail : Varchar(50)
   ..
   certif_med_aptitude : Boolean
   ..
   date_naissance : Date
}
class Equipe {
   {static} numero : Integer
   ..
   nom : Varchar(50)
   ..
   date_insciption : Date
   ..
   temps_global : Integer
   ..
   classement : Integer
   ..
   penalites_bonif : Integer
}
class Integrer_equipe {
   temps_individuel : Integer
   ..
   num_dossard : Varchar(15)
}
class Raid {
   {static} code : Varchar(6)
   ..
   nom : Varchar(50)
   ..
   date_debut : Varchar(10)
   ..
   ville : Varchar(50)
   ..
   region : Varchar(50)
   ..
   nb_maxi_par_equipe : Integer
   ..
   montant_inscription : Numeric(8,2)
   ..
   nb_femmes : Integer
   ..
   duree_maxi : Integer
   ..
   age_minimum : Integer
}

Raid "1" -- "0*" Equipe
Equipe "1" .. "0*" Integrer_equipe
Raid "1" .. "0*" Integrer_equipe
Coureur "1" .. "0*" Integrer_equipe
Activite "1*" .. "1*" Raid

@enduml

