@startuml

class Raid {
   - {static} code : String
   ..
   - nom : String
   ..
   - nb_maxi_par_equipe : Integer
   ..
   - nb_femmes : Integer
}

class Coureur {
   {static} - licence : String
   ..
   - nom : String
   ..
   - prenom : String
   ..
   - numero_equipe : Integer
   ..
   - numero_dans_equipe : Long Int
   --
   + generer_dossard(string code_raid) : Void
}

Raid "participe 0*" -- "0*" Coureur

@enduml
