-r test.txt

# Django
# ------------------------------------------------------------------------------
django-debug-toolbar  # https://github.com/jazzband/django-debug-toolbar
django-extensions  # https://github.com/django-extensions/django-extensions
