kick 55 0.859375 0.34375 0 0 0.4375 0.359375 0.9 10;
rockit 65.4064 0.859375 0.5625 0 0 0.4375 0.359375 0.9 10;
electronica 65.4064 0.59375 0.625 0.78125 0.265625 0.28125 0.765625 0.9 10;
sub 43.6535 0.265625 0.453125 0 0.296875 0.640625 0.265625 0.9 10;
techno 43.6535 0.6875 0.71875 0 0 0.484375 0.265625 0.9 10;
beltram 48.9994 0.34375 0.828125 0.484375 0.140625 0.484375 0.890625 0.9 10;
tresor 55 0.71875 0.71875 0.578125 0 0.5 0.890625 0.9 10;
hardkick 55 0.96875 0.796875 0.484375 0 0.34375 0.890625 0.9 10;
hardcore 55 0.96875 0.796875 0.75 0.90625 0.34375 0.890625 0.9 10;
digit 55 0.0625 0.796875 0.75 0.90625 0.34375 0.890625 0.9 10;
short 55 0.25 1 1 0.671875 0.375 0.265625 0.9 10;
longpulse 43.6535 0 1 0 0 1 0 0.9 10;
coldteck 43.6535 0.734375 0.796875 0.6875 0.625 0.34375 0.1875 0.9 10;
