# Blender v2.72 (sub 0) OBJ File: ''
# www.blender.org
o Cube
v 1.000000 -1.000000 -1.000000
v 1.000000 -1.000000 1.000000
v -1.000000 -1.000000 1.000000
v -1.000000 -1.000000 -1.000000
v 1.000000 0.448006 -0.999999
v 0.999999 0.448006 1.000001
v -1.000000 0.448006 1.000000
v -1.000000 0.448006 -1.000000
v 1.000000 0.448006 0.000001
v 0.000000 1.171127 -1.000000
v -0.000001 1.171127 1.000000
v -1.000000 0.448006 -0.000000
v -0.000000 1.171127 0.000000
v -0.500000 0.809566 -1.000000
v -1.000000 0.448006 -0.500000
v 0.000000 1.171127 -0.500000
v -0.500000 0.809566 0.000000
v -0.500000 0.809566 -0.500000
v -0.750000 0.628786 -1.000000
v -1.000000 0.448006 -0.750000
v -0.000000 1.171127 -0.250000
v -0.250000 0.990347 0.000000
v -0.250000 0.990347 -1.000000
v -1.000000 0.448006 -0.250000
v 0.000000 1.171127 -0.750000
v -0.750000 0.628786 -0.000000
v -0.500000 0.809566 -0.250000
v -0.500000 0.809566 -0.750000
v -0.250000 0.990347 -0.500000
v -0.750000 0.628786 -0.500000
v -0.750000 0.628786 -0.250000
v -0.250000 0.990347 -0.250000
v -0.250000 0.990347 -0.750000
v -0.750000 0.628786 -0.750000
v -0.500000 0.809566 -0.500000
v -0.500000 0.809566 -0.750000
v -0.750000 0.628786 -0.500000
v -0.750000 0.628786 -0.750000
v -0.479219 1.092119 -0.500000
v -0.479219 1.092119 -0.750000
v -0.729219 1.096915 -0.500000
v -0.729219 1.096915 -0.750000
s off
f 1 2 3 4
f 13 22 17 26 12 7 11
f 1 5 9 6 2
f 2 6 11 7 3
f 3 7 12 24 15 20 8 4
f 5 1 4 8 19 14 23 10
f 9 13 11 6
f 5 10 25 16 21 13 9
f 31 24 12 26
f 32 27 17 22
f 33 28 18 29
f 34 20 15 30
f 27 31 26 17
f 18 30 31 27
f 30 15 24 31
f 21 32 22 13
f 16 29 32 21
f 29 18 27 32
f 25 33 29 16
f 10 23 33 25
f 23 14 28 33
f 28 34 38 36
f 14 19 34 28
f 19 8 20 34
f 36 38 42 40
f 34 30 37 38
f 30 18 35 37
f 18 28 36 35
f 40 42 41 39
f 38 37 41 42
f 37 35 39 41
f 35 36 40 39
