<?xml version="1.0" encoding="UTF-8" standalone="no"?>
<!-- Created with Inkscape (http://www.inkscape.org/) -->

<svg
   xmlns:dc="http://purl.org/dc/elements/1.1/"
   xmlns:cc="http://creativecommons.org/ns#"
   xmlns:rdf="http://www.w3.org/1999/02/22-rdf-syntax-ns#"
   xmlns:svg="http://www.w3.org/2000/svg"
   xmlns="http://www.w3.org/2000/svg"
   xmlns:sodipodi="http://sodipodi.sourceforge.net/DTD/sodipodi-0.dtd"
   xmlns:inkscape="http://www.inkscape.org/namespaces/inkscape"
   width="2773.3333"
   height="853.33331"
   id="svg2"
   version="1.1"
   inkscape:version="0.92.1 r15371"
   sodipodi:docname="aotraLogo_v1_0CodeDeploye.svg">
  <defs
     id="defs4" />
  <sodipodi:namedview
     id="base"
     pagecolor="#ffffff"
     bordercolor="#666666"
     borderopacity="1.0"
     inkscape:pageopacity="0.0"
     inkscape:pageshadow="2"
     inkscape:zoom="0.21536452"
     inkscape:cx="889.52763"
     inkscape:cy="310.18436"
     inkscape:document-units="px"
     inkscape:current-layer="layer3"
     showgrid="false"
     inkscape:window-width="1024"
     inkscape:window-height="724"
     inkscape:window-x="0"
     inkscape:window-y="0"
     inkscape:window-maximized="1"
     showguides="true"
     inkscape:guide-bbox="true" />
  <metadata
     id="metadata7">
    <rdf:RDF>
      <cc:Work
         rdf:about="">
        <dc:format>image/svg+xml</dc:format>
        <dc:type
           rdf:resource="http://purl.org/dc/dcmitype/StillImage" />
        <dc:title />
      </cc:Work>
    </rdf:RDF>
  </metadata>
  <g
     inkscape:label="Calque 1"
     inkscape:groupmode="layer"
     id="layer1"
     transform="translate(0,-269.18633)"
     style="display:inline" />
  <g
     inkscape:groupmode="layer"
     id="layer2"
     inkscape:label="Calque"
     style="display:inline" />
  <g
     inkscape:groupmode="layer"
     id="layer3"
     inkscape:label="Calque2">
    <path
       style="display:inline;fill:#000000;fill-opacity:1;fill-rule:evenodd;stroke:none;stroke-width:1.06666672"
       d="M 1114.712,-2.6666667e-5 C 879.0705,-2.6666667e-5 688.04532,191.02514 688.04532,426.66663 c 0,235.64151 191.02518,426.66671 426.66668,426.66671 1.1492,0 2.2862,-0.0245 3.4333,-0.0331 V 691.50022 c -66.8132,-0.4445 -133.48578,-26.11916 -184.4667,-77.10004 -0.50165,-0.50164 -1.00341,-0.9951 -1.49994,-1.5 -0.50464,-0.49675 -0.9984,-0.99837 -1.50006,-1.5 -102.85845,-102.85846 -102.85845,-269.60821 0,-372.46667 51.42924,-51.42924 118.8271,-77.16665 186.2334,-77.16666 0.4101,0 0.8231,-0.002 1.2333,0 V 0.03350933 c -1.1471,-0.0096 -2.2841,-0.0332799967 -3.4333,-0.0332799967 z"
       id="path2985"
       inkscape:connector-curvature="0" />
    <path
       style="display:inline;fill:#ffffff;fill-opacity:1;fill-rule:evenodd;stroke:#000000;stroke-width:3.20000005;stroke-miterlimit:4;stroke-dasharray:none;stroke-opacity:1"
       d="m 1750.5897,3.04e-4 c -1.1493,0 -2.2862,0.02432 -3.4333,0.03328 V 161.76691 c 66.9954,0.3113 133.8837,26.05038 185,77.16667 0.5016,0.50163 1.0035,0.99508 1.4999,1.5 0.5048,0.49675 0.9984,0.99836 1.5001,1.5 102.8584,102.85846 102.8584,269.6082 0,372.46667 -51.8776,51.87758 -120.0117,77.55226 -188,77.1 v 161.80004 c 1.1471,0.0107 2.284,0.0331 3.4333,0.0331 235.6414,0 426.6666,-191.0252 426.6666,-426.66669 C 2177.2563,191.0252 1986.2311,3.4666667e-5 1750.5897,3.4666667e-5 Z"
       id="path2985-7"
       inkscape:connector-curvature="0" />
    <g
       style="display:inline"
       id="g3907"
       transform="translate(-110.61526,2.4000001e-5)">
      <path
         id="path2985-0"
         d="m 614.40747,614.40747 c 102.85846,-102.85847 102.85846,-269.625 -10e-6,-372.48346 -0.50165,-0.50164 -1.00855,-0.98737 -1.51322,-1.48412 L 240.43988,612.89426 c 0.49651,0.5049 0.9825,1.01154 1.48414,1.51319 102.85847,102.85847 269.62499,102.85847 372.48346,0 z"
         style="fill:#000000;fill-opacity:1;fill-rule:evenodd;stroke:#000000;stroke-width:3.20000005;stroke-miterlimit:4;stroke-dasharray:none;stroke-opacity:1"
         inkscape:connector-curvature="0" />
      <path
         id="path2985-7-9"
         d="m 238.92587,238.92582 c -102.85848,102.85847 -102.85851,269.62496 -5e-5,372.48343 0.50165,0.50164 1.00854,0.98739 1.5132,1.48414 L 612.89339,240.43902 c -0.49649,-0.50492 -0.98248,-1.01157 -1.48412,-1.51321 -102.85846,-102.85847 -269.62496,-102.85844 -372.48342,4e-5 z"
         style="fill:#ffffff;fill-opacity:1;fill-rule:evenodd;stroke:#000000;stroke-width:3.20000005;stroke-miterlimit:4;stroke-dasharray:none;stroke-opacity:1"
         inkscape:connector-curvature="0" />
    </g>
    <path
       style="display:inline;fill:#ffffff;fill-opacity:1;fill-rule:evenodd;stroke:#000000;stroke-width:3.20000005;stroke-miterlimit:4;stroke-dasharray:none;stroke-opacity:1"
       d="m 1448.0412,161.77807 c -67.4062,10e-6 -134.8375,25.7041 -186.2667,77.13333 -102.8584,102.85847 -102.8584,269.64153 0,372.5 0.5017,0.50165 1.0287,0.96992 1.5333,1.46667 0.4966,0.5049 0.9651,1.03169 1.4667,1.53333 102.8585,102.85848 269.6416,102.85848 372.5001,0 102.8584,-102.85846 102.8584,-269.64153 0,-372.5 -0.5017,-0.50164 -0.9955,-0.96992 -1.5001,-1.46666 h -0.033 c -0.4965,-0.50492 -0.965,-1.03171 -1.4666,-1.53334 -51.4293,-51.42923 -118.8271,-77.13334 -186.2334,-77.13333 z"
       id="path2985-0-8"
       inkscape:connector-curvature="0" />
    <path
       style="display:inline;fill:#ffffff;fill-opacity:1;fill-rule:evenodd;stroke:#000000;stroke-width:3.20000005;stroke-miterlimit:4;stroke-dasharray:none;stroke-opacity:1"
       d="m 2347.1878,238.93068 c -102.8584,102.85845 -102.8584,269.59824 0,372.45669 0.5017,0.50164 1.0041,1.01156 1.5085,1.5085 0.4962,0.50523 1.0068,1.00686 1.5085,1.50849 102.6931,102.69308 269.0639,102.85775 371.9618,0.49498 l -6.3639,-6.36396 c -100.3915,99.85619 -262.7243,99.69152 -362.9109,-0.49497 -0.4893,-0.48943 -0.9533,-0.99236 -1.4377,-1.48493 l 363.3586,-363.35861 c 0.4367,0.43002 0.8865,0.84404 1.3199,1.27279 l 4.5255,-4.52548 c -0.3355,-0.3356 -0.6764,-0.67649 -1.0135,-1.01351 -51.4292,-51.42924 -118.8222,-77.14537 -186.2284,-77.14536 -67.4063,1e-5 -134.7991,25.71612 -186.2284,77.14536 z"
       id="path2985-0-0"
       inkscape:connector-curvature="0" />
  </g>
</svg>
