m_project_id,m_user_id,m_role_id,m_valid_start_datetime,m_valid_end_datetime,m_invalid_reason
2,0,WRITE,2019-05-02 14:27:44.09798,2118-12-29 14:27:44.097998,
2,0,DELETE,2019-05-02 14:27:44.09798,2118-12-29 14:27:44.097998,
1,0,VOTE,2019-05-03 18:38:04.822602,2118-12-30 18:38:04.822619,
2,0,VOTE,2019-05-03 18:53:02.853642,2118-12-30 18:53:02.853659,
4,0,WRITE,2019-05-03 17:11:37.346546,2118-12-30 17:11:37.346579,
4,0,DELETE,2019-05-03 17:11:37.346546,2118-12-30 17:11:37.346579,
4,0,VOTE,2019-05-03 17:11:37.346546,2118-12-30 17:11:37.346579,
1,0,READ,2019-05-03 17:11:37.346546,2118-12-30 17:11:37.346579,
1,0,WRITE,2019-05-03 17:11:37.346546,2118-12-30 17:11:37.346579,
1,0,DELETE,2019-05-03 17:11:37.346546,2118-12-30 17:11:37.346579,
0,0,READ,2019-05-03 17:11:37.346546,2118-12-30 17:11:37.346579,
0,0,WRITE,2019-05-03 17:11:37.346546,2118-12-30 17:11:37.346579,
0,0,DELETE,2019-05-03 17:11:37.346546,2118-12-30 17:11:37.346579,
0,0,VOTE,2019-05-03 17:11:37.346546,2118-12-30 17:11:37.346579,
3,0,READ,2019-05-03 17:11:37.346546,2118-12-30 17:11:37.346579,
3,0,WRITE,2019-05-03 17:11:37.346546,2118-12-30 17:11:37.346579,
3,0,DELETE,2019-05-03 17:11:37.346546,2118-12-30 17:11:37.346579,
3,0,VOTE,2019-05-03 17:11:37.346546,2118-12-30 17:11:37.346579,
5,0,READ,2019-05-03 17:11:37.346546,2118-12-30 17:11:37.346579,
5,0,WRITE,2019-05-03 17:11:37.346546,2118-12-30 17:11:37.346579,
5,0,DELETE,2019-05-03 17:11:37.346546,2118-12-30 17:11:37.346579,
5,0,VOTE,2019-05-03 17:11:37.346546,2118-12-30 17:11:37.346579,
6,0,READ,2019-05-25 13:27:29.913839,2119-01-21 13:27:29.913857,
6,0,WRITE,2019-05-25 13:27:29.913839,2119-01-21 13:27:29.913857,
6,0,DELETE,2019-05-25 13:27:29.913839,2119-01-21 13:27:29.913857,
6,0,VOTE,2019-05-25 13:27:29.913839,2119-01-21 13:27:29.913857,
7,0,READ,2019-05-26 14:51:55.928232,2119-01-22 14:51:55.92827,
7,0,WRITE,2019-05-26 14:51:55.928232,2119-01-22 14:51:55.92827,
7,0,DELETE,2019-05-26 14:51:55.928232,2119-01-22 14:51:55.92827,
7,0,VOTE,2019-05-26 14:51:55.928232,2119-01-22 14:51:55.92827,
8,0,READ,2019-05-28 21:03:32.431028,2119-01-24 21:03:32.431047,
8,0,WRITE,2019-05-28 21:03:32.431028,2119-01-24 21:03:32.431047,
8,0,DELETE,2019-05-28 21:03:32.431028,2119-01-24 21:03:32.431047,
8,0,VOTE,2019-05-28 21:03:32.431028,2119-01-24 21:03:32.431047,
2,0,READ,2019-05-11 13:06:59.125324,2119-01-07 13:06:59.125342,
4,0,READ,2019-05-11 13:06:59.125324,2119-01-07 13:06:59.125342,
9,0,READ,2019-05-29 15:29:36.995215,2119-01-25 15:29:36.995234,
9,0,WRITE,2019-05-29 15:29:36.995215,2119-01-25 15:29:36.995234,
9,0,DELETE,2019-05-29 15:29:36.995215,2119-01-25 15:29:36.995234,
9,0,VOTE,2019-05-29 15:29:36.995215,2119-01-25 15:29:36.995234,
10,0,READ,2019-06-05 16:45:17.944824,2119-02-01 16:45:17.944846,
10,0,WRITE,2019-06-05 16:45:17.944824,2119-02-01 16:45:17.944846,
10,0,DELETE,2019-06-05 16:45:17.944824,2119-02-01 16:45:17.944846,
10,0,VOTE,2019-06-05 16:45:17.944824,2119-02-01 16:45:17.944846,
12,0,READ,2019-06-12 08:44:42.362895,2119-02-08 08:44:42.362915,
12,0,WRITE,2019-06-12 08:44:42.362895,2119-02-08 08:44:42.362915,
12,0,DELETE,2019-06-12 08:44:42.362895,2119-02-08 08:44:42.362915,
12,0,VOTE,2019-06-12 08:44:42.362895,2119-02-08 08:44:42.362915,
11,0,READ,2019-06-12 08:44:42.362895,2119-02-08 08:44:42.362915,
11,0,WRITE,2019-06-12 08:44:42.362895,2119-02-08 08:44:42.362915,
11,0,DELETE,2019-06-12 08:44:42.362895,2119-02-08 08:44:42.362915,
11,0,VOTE,2019-06-12 08:44:42.362895,2119-02-08 08:44:42.362915,
13,0,READ,2019-06-15 22:53:05.671571,2119-02-11 22:53:05.671591,
13,0,WRITE,2019-06-15 22:53:05.671571,2119-02-11 22:53:05.671591,
13,0,DELETE,2019-06-15 22:53:05.671571,2119-02-11 22:53:05.671591,
13,0,VOTE,2019-06-15 22:53:05.671571,2119-02-11 22:53:05.671591,
