m_project_id,m_project_type_id,m_valid_start_datetime,m_valid_end_datetime,m_invalid_reason
2,APHP,2019-02-21 15:56:36.743771,2099-01-01 00:00:00,
3,SNDS,2019-02-21 15:56:53.175347,2099-01-01 00:00:00,
4,BDX,2019-02-21 15:57:01.870652,2099-01-01 00:00:00,
0,MIMICIII,2019-02-21 16:13:42.899004,2099-01-01 00:00:00,
1,LILLE,2018-12-07 00:00:00,2099-01-01 00:00:00,
5,TLS,2019-02-21 15:56:36.743771,2099-01-01 00:00:00,
6,OSIRIS,2019-05-24 00:00:00,2099-01-01 00:00:00,
7,CDISC,2019-05-26 00:00:00,2099-01-01 00:00:00,
8,OMOP,2019-05-28 00:00:00,2099-01-01 00:00:00,
9,BIOLOINC,2019-05-28 00:00:00,2099-01-01 00:00:00,
10,FHIR,2019-06-06 00:43:41.744293,2099-01-01 00:00:00,
11,SUSANA,2018-12-07 00:00:00,2099-01-01 00:00:00,
12,PAERPA,2010-06-11 00:00:00,2099-01-01 00:00:00,
13,RENNES,2018-12-07 00:00:00,2099-01-01 00:00:00,
