concept_name,concept_code,m_language_id,vocabulary_id
Unknown,unknown,EN,FHIR - data-absent-reason
Asked But Unknown,asked-unknown,EN,FHIR - data-absent-reason
Temporarily Unknown,temp-unknown,EN,FHIR - data-absent-reason
Not Asked,not-asked,EN,FHIR - data-absent-reason
Asked But Declined,asked-declined,EN,FHIR - data-absent-reason
Masked,masked,EN,FHIR - data-absent-reason
Not Applicable,not-applicable,EN,FHIR - data-absent-reason
Unsupported,unsupported,EN,FHIR - data-absent-reason
As Text,as-text,EN,FHIR - data-absent-reason
Error,error,EN,FHIR - data-absent-reason
Not a Number (NaN),not-a-number,EN,FHIR - data-absent-reason
Negative Infinity (NINF),negative-infinity,EN,FHIR - data-absent-reason
Positive Infinity (PINF),positive-infinity,EN,FHIR - data-absent-reason
Not Performed,not-performed,EN,FHIR - data-absent-reason
Not Permitted,not-permitted,EN,FHIR - data-absent-reason
