relationship_id	relationship_name	is_hierarchical	defines_ancestry	reverse_relationship_id	relationship_concept_id
Has specimen proc	Has specimen procedure (SNOMED)	0	0	Specimen proc of	44818775
Has specimen source	Has specimen source identity (SNOMED)	0	0	Specimen identity of	44818776
Has specimen morph	Has specimen source morphology (SNOMED)	0	0	Specimen morph of	44818777
Has specimen topo	Has specimen source topography (SNOMED)	0	0	Specimen topo of	44818778
Has specimen subst	Has specimen substance (SNOMED)	0	0	Specimen subst of	44818779
Has due to	Has due to (SNOMED)	0	0	Due to of	44818780
Has relat context	Has subject relationship context (SNOMED)	0	0	Relat context of	44818781
Has dose form	Has dose form (SNOMED)	0	0	Dose form of	44818782
Occurs after	Occurs after (SNOMED)	0	0	Occurs before	44818783
