ancestor_concept_id	descendant_concept_id	min_levels_of_separation	max_levels_of_separation
375415	4335743	4	4
735979	41070383	3	5
438112	36566114	2	3
529411	43269406	3	3
141960	200164	3	6
441840	4096781	4	12
438112	42514191	3	3
439392	36525635	2	2
255919	36559629	5	5
