{
  "table": "device_exposure",
  "source_tables": {
    "ER_TIP_F": {
      "CDM_columns": {
        "device_exposure_id": "TIP_PRS_IDE",
        "person_id": "NUM_ENQ",
        "device_concept_id": "0",
        "device_exposure_start_date": "TIP_ACL_DTD",
        "device_exposure_start_datetime": "TIP_ACL_DTD.cast('TIMESTAMP')",
        "device_exposure_end_date": "TIP_ACL_DTF",
        "device_exposure_end_datetime": "TIP_ACL_DTF.cast('TIMESTAMP')",
        "device_type_concept_id": "0",
        "unique_decide_id": "0",
        "quantity": "TIP_ACT_QSN",
        "provider_id": "TIP_SIR_NUM",
        "visit_occurrence_id": "CONCAT(FLX_DIS_DTD, '_', FLX_TRT_DTD, '_', FLX_EMT_TYP, '_', FLX_EMT_NUM, '_', FLX_EMT_ORD, '_', ORG_CLE_NUM, '_', DCT_ORD_NUM, '_', PRS_ORD_NUM, '_', REM_TYP_AFF)", ,
        "visit_detail_id": "0",
        "device_source_value": "TIP_PRS_IDE",
        "device_source_concept_id": "0",
      },
      "comments": {
        "device_type_concept_id": "has to do with TIP_PRS_TYP",
        "device_source_value": "need to map NT_LPP to a Device Concept"
      }
    }
  }
}

