{
  "table": "visit_detail",
  "source_tables": {
    "ER_PRS_F": {
      "CDM_columns": {
        "visit_detail_id": "0",
        "person_id": "'NUM_ENQ'",
        "visit_detail_concept_id": "0",
        "visit_detail_start_date": "'EXE_SOI_DTD'",
        "visit_detail_start_datetime": "'EXE_SOI_DTD').cast('TIMESTAMP'",
        "visit_detail_end_date": "'EXE_SOI_DTF'",
        "visit_detail_end_datetime": "'EXE_SOI_DTF').cast('TIMESTAMP'",
        "visit_detail_type_concept_id": "0",
        "provider_id": "'PFS_EXE_NUM'",
        "care_site_id": "0",
        "visit_detail_source_value": "0",
        "visit_detail_source_concept_id": "0",
        "admitted_from_source_value": "0",
        "admitted_from_concept_id": "0",
        "discharge_to_source_value": "0",
        "discharge_to_concept_id": "0",
        "preceding_visit_detail_id": "0",
        "visit_detail_parent_id": "0",
        "visit_occurrence_id": "func.concat_ws('', *join_keys)"
      },
      "temporary_columns": {
      },
      "comments": {
        "visit_detail_id": "NOT IMPLEMENTED, TRAVAIL EN COURS"
      }
    }
  }
}

