<?xml version="1.0" encoding="UTF-8" standalone="no"?>
<svg
   xmlns:dc="http://purl.org/dc/elements/1.1/"
   xmlns:cc="http://creativecommons.org/ns#"
   xmlns:rdf="http://www.w3.org/1999/02/22-rdf-syntax-ns#"
   xmlns:svg="http://www.w3.org/2000/svg"
   xmlns="http://www.w3.org/2000/svg"
   xmlns:xlink="http://www.w3.org/1999/xlink"
   xmlns:sodipodi="http://sodipodi.sourceforge.net/DTD/sodipodi-0.dtd"
   xmlns:inkscape="http://www.inkscape.org/namespaces/inkscape"
   width="590.23425pt"
   height="188.56401pt"
   viewBox="0 0 590.23425 188.56401"
   version="1.1"
   id="svg945"
   sodipodi:docname="compBat.svg"
   inkscape:version="0.92.5 (2060ec1f9f, 2020-04-08)"
   inkscape:export-filename="./compBat.png"
   inkscape:export-xdpi="300"
   inkscape:export-ydpi="300">
  <metadata
     id="metadata949">
    <rdf:RDF>
      <cc:Work
         rdf:about="">
        <dc:format>image/svg+xml</dc:format>
        <dc:type
           rdf:resource="http://purl.org/dc/dcmitype/StillImage" />
      </cc:Work>
    </rdf:RDF>
  </metadata>
  <sodipodi:namedview
     pagecolor="#ffffff"
     bordercolor="#666666"
     borderopacity="1"
     objecttolerance="10"
     gridtolerance="10"
     guidetolerance="10"
     inkscape:pageopacity="0"
     inkscape:pageshadow="2"
     inkscape:window-width="1280"
     inkscape:window-height="975"
     id="namedview947"
     showgrid="false"
     inkscape:zoom="2.7327848"
     inkscape:cx="115.61245"
     inkscape:cy="79.264059"
     inkscape:window-x="0"
     inkscape:window-y="25"
     inkscape:window-maximized="1"
     inkscape:current-layer="svg945" />
  <defs
     id="defs262">
    <g
       id="g164">
      <symbol
         overflow="visible"
         id="glyph0-0"
         style="overflow:visible">
        <path
           style="stroke:none"
           d=""
           id="path2"
           inkscape:connector-curvature="0" />
      </symbol>
      <symbol
         overflow="visible"
         id="glyph0-1"
         style="overflow:visible">
        <path
           style="stroke:none"
           d="m 2.421875,-6.359375 c -0.578125,0 -1.109375,0.265625 -1.4375,0.6875 C 0.578125,-5.109375 0.375,-4.25 0.375,-3.078125 c 0,2.140625 0.703125,3.28125 2.046875,3.28125 1.3125,0 2.03125,-1.140625 2.03125,-3.234375 0,-1.21875 -0.1875,-2.046875 -0.59375,-2.640625 -0.328125,-0.4375 -0.84375,-0.6875 -1.4375,-0.6875 z m 0,0.6875 c 0.828125,0 1.25,0.84375 1.25,2.578125 0,1.8125 -0.40625,2.65625 -1.265625,2.65625 -0.828125,0 -1.234375,-0.875 -1.234375,-2.625 0,-1.765625 0.40625,-2.609375 1.25,-2.609375 z m 0,0"
           id="path5"
           inkscape:connector-curvature="0" />
      </symbol>
      <symbol
         overflow="visible"
         id="glyph0-2"
         style="overflow:visible">
        <path
           style="stroke:none"
           d="M 4.453125,-0.765625 H 1.171875 C 1.25,-1.296875 1.53125,-1.625 2.296875,-2.09375 l 0.875,-0.5 C 4.046875,-3.0625 4.5,-3.71875 4.5,-4.5 4.5,-5.03125 4.28125,-5.53125 3.921875,-5.875 3.546875,-6.203125 3.09375,-6.359375 2.5,-6.359375 c -0.796875,0 -1.375,0.28125 -1.71875,0.828125 -0.234375,0.328125 -0.328125,0.734375 -0.34375,1.375 h 0.78125 c 0.015625,-0.4375 0.078125,-0.6875 0.1875,-0.90625 0.1875,-0.375 0.59375,-0.625 1.0625,-0.625 0.703125,0 1.234375,0.515625 1.234375,1.203125 0,0.515625 -0.296875,0.953125 -0.84375,1.265625 L 2.046875,-2.75 C 0.75,-2 0.375,-1.40625 0.296875,-0.015625 h 4.15625 z m 0,0"
           id="path8"
           inkscape:connector-curvature="0" />
      </symbol>
      <symbol
         overflow="visible"
         id="glyph0-3"
         style="overflow:visible">
        <path
           style="stroke:none"
           d="M 2.875,-1.546875 V 0 h 0.78125 v -1.546875 h 0.921875 v -0.6875 H 3.65625 v -4.125 H 3.078125 l -2.828125,4 v 0.8125 z m 0,-0.6875 H 0.921875 L 2.875,-5.046875 Z m 0,0"
           id="path11"
           inkscape:connector-curvature="0" />
      </symbol>
      <symbol
         overflow="visible"
         id="glyph0-4"
         style="overflow:visible">
        <path
           style="stroke:none"
           d="M 4.375,-4.703125 C 4.234375,-5.75 3.5625,-6.359375 2.609375,-6.359375 c -0.6875,0 -1.296875,0.328125 -1.671875,0.90625 -0.390625,0.625 -0.5625,1.390625 -0.5625,2.546875 0,1.078125 0.15625,1.75 0.53125,2.3125 0.328125,0.515625 0.875,0.796875 1.5625,0.796875 1.1875,0 2.046875,-0.890625 2.046875,-2.125 0,-1.171875 -0.796875,-2 -1.90625,-2 -0.625,0 -1.109375,0.234375 -1.4375,0.6875 0,-1.5625 0.5,-2.4375 1.390625,-2.4375 0.546875,0 0.921875,0.34375 1.046875,0.96875 z M 2.5,-3.234375 c 0.75,0 1.21875,0.53125 1.21875,1.375 0,0.796875 -0.53125,1.375 -1.234375,1.375 -0.71875,0 -1.265625,-0.609375 -1.265625,-1.421875 0,-0.78125 0.515625,-1.328125 1.28125,-1.328125 z m 0,0"
           id="path14"
           inkscape:connector-curvature="0" />
      </symbol>
      <symbol
         overflow="visible"
         id="glyph0-5"
         style="overflow:visible">
        <path
           style="stroke:none"
           d="M 5.6875,-6.40625 H 4.90625 v 5.234375 L 1.5625,-6.40625 H 0.671875 V 0 H 1.4375 V -5.203125 L 4.765625,0 H 5.6875 Z m 0,0"
           id="path17"
           inkscape:connector-curvature="0" />
      </symbol>
      <symbol
         overflow="visible"
         id="glyph0-6"
         style="overflow:visible">
        <path
           style="stroke:none"
           d="M 4.234375,0 V -4.609375 H 3.515625 V -2 c 0,0.9375 -0.5,1.5625 -1.265625,1.5625 -0.578125,0 -0.953125,-0.359375 -0.953125,-0.90625 V -4.609375 H 0.578125 V -1.0625 c 0,0.765625 0.5625,1.265625 1.46875,1.265625 0.671875,0 1.109375,-0.234375 1.53125,-0.84375 V 0 Z m 0,0"
           id="path20"
           inkscape:connector-curvature="0" />
      </symbol>
      <symbol
         overflow="visible"
         id="glyph0-7"
         style="overflow:visible">
        <path
           style="stroke:none"
           d="M 0.609375,-4.609375 V 0 h 0.75 v -2.890625 c 0,-0.671875 0.484375,-1.203125 1.078125,-1.203125 0.546875,0 0.859375,0.328125 0.859375,0.921875 V 0 H 4.03125 v -2.890625 c 0,-0.671875 0.484375,-1.203125 1.078125,-1.203125 0.53125,0 0.859375,0.34375 0.859375,0.921875 V 0 h 0.734375 v -3.453125 c 0,-0.828125 -0.46875,-1.28125 -1.34375,-1.28125 -0.609375,0 -0.984375,0.171875 -1.40625,0.703125 -0.28125,-0.5 -0.640625,-0.703125 -1.25,-0.703125 -0.609375,0 -1.015625,0.21875 -1.40625,0.78125 v -0.65625 z m 0,0"
           id="path23"
           inkscape:connector-curvature="0" />
      </symbol>
      <symbol
         overflow="visible"
         id="glyph0-8"
         style="overflow:visible">
        <path
           style="stroke:none"
           d="M 0.46875,-6.40625 V 0 h 0.671875 v -0.59375 c 0.34375,0.546875 0.8125,0.796875 1.453125,0.796875 1.21875,0 2,-1 2,-2.53125 0,-1.484375 -0.734375,-2.40625 -1.96875,-2.40625 -0.625,0 -1.078125,0.234375 -1.421875,0.75 V -6.40625 Z m 2.015625,2.34375 c 0.828125,0 1.34375,0.71875 1.34375,1.8125 0,1.046875 -0.53125,1.765625 -1.34375,1.765625 -0.78125,0 -1.28125,-0.703125 -1.28125,-1.78125 0,-1.09375 0.5,-1.796875 1.28125,-1.796875 z m 0,0"
           id="path26"
           inkscape:connector-curvature="0" />
      </symbol>
      <symbol
         overflow="visible"
         id="glyph0-9"
         style="overflow:visible">
        <path
           style="stroke:none"
           d="m 4.515625,-2.0625 c 0,-0.703125 -0.0625,-1.125 -0.1875,-1.46875 -0.296875,-0.75 -1,-1.203125 -1.859375,-1.203125 -1.296875,0 -2.109375,0.96875 -2.109375,2.484375 0,1.53125 0.78125,2.453125 2.09375,2.453125 1.046875,0 1.78125,-0.59375 1.96875,-1.609375 h -0.75 C 3.46875,-0.796875 3.0625,-0.46875 2.46875,-0.46875 2,-0.46875 1.609375,-0.6875 1.359375,-1.078125 1.1875,-1.34375 1.125,-1.59375 1.125,-2.0625 Z m -3.375,-0.59375 c 0.0625,-0.859375 0.578125,-1.40625 1.3125,-1.40625 0.75,0 1.265625,0.578125 1.265625,1.40625 z m 0,0"
           id="path29"
           inkscape:connector-curvature="0" />
      </symbol>
      <symbol
         overflow="visible"
         id="glyph0-10"
         style="overflow:visible">
        <path
           style="stroke:none"
           d="M 0.609375,-4.609375 V 0 H 1.34375 V -2.390625 C 1.359375,-3.5 1.8125,-4 2.828125,-3.96875 v -0.75 c -0.125,-0.015625 -0.203125,-0.015625 -0.28125,-0.015625 -0.484375,0 -0.84375,0.28125 -1.265625,0.953125 v -0.828125 z m 0,0"
           id="path32"
           inkscape:connector-curvature="0" />
      </symbol>
      <symbol
         overflow="visible"
         id="glyph0-11"
         style="overflow:visible">
        <path
           style="stroke:none"
           d=""
           id="path35"
           inkscape:connector-curvature="0" />
      </symbol>
      <symbol
         overflow="visible"
         id="glyph0-12"
         style="overflow:visible">
        <path
           style="stroke:none"
           d="m 2.390625,-4.734375 c -1.296875,0 -2.078125,0.921875 -2.078125,2.46875 0,1.546875 0.78125,2.46875 2.09375,2.46875 1.296875,0 2.078125,-0.921875 2.078125,-2.4375 0,-1.59375 -0.75,-2.5 -2.09375,-2.5 z M 2.40625,-4.0625 c 0.828125,0 1.3125,0.671875 1.3125,1.8125 0,1.09375 -0.515625,1.78125 -1.3125,1.78125 -0.828125,0 -1.328125,-0.6875 -1.328125,-1.796875 0,-1.125 0.5,-1.796875 1.328125,-1.796875 z m 0,0"
           id="path38"
           inkscape:connector-curvature="0" />
      </symbol>
      <symbol
         overflow="visible"
         id="glyph0-13"
         style="overflow:visible">
        <path
           style="stroke:none"
           d="M 2.265625,-4.609375 H 1.5 v -0.71875 c 0,-0.3125 0.171875,-0.46875 0.515625,-0.46875 0.0625,0 0.09375,0 0.25,0.015625 V -6.390625 C 2.109375,-6.4375 2,-6.4375 1.859375,-6.4375 c -0.6875,0 -1.078125,0.390625 -1.078125,1.046875 v 0.78125 h -0.625 v 0.59375 h 0.625 V 0 H 1.5 v -4.015625 h 0.765625 z m 0,0"
           id="path41"
           inkscape:connector-curvature="0" />
      </symbol>
      <symbol
         overflow="visible"
         id="glyph0-14"
         style="overflow:visible">
        <path
           style="stroke:none"
           d="m 6.546875,0 1.625,-6.40625 H 7.25 L 6.078125,-1.203125 4.625,-6.40625 H 3.734375 L 2.3125,-1.203125 1.109375,-6.40625 H 0.1875 L 1.84375,0 H 2.734375 L 4.171875,-5.265625 5.640625,0 Z m 0,0"
           id="path44"
           inkscape:connector-curvature="0" />
      </symbol>
      <symbol
         overflow="visible"
         id="glyph0-15"
         style="overflow:visible">
        <path
           style="stroke:none"
           d="M 1.234375,-6.40625 H 0.515625 V 0 h 0.71875 V -1.796875 L 1.953125,-2.5 3.515625,0 h 0.90625 L 2.53125,-3.015625 4.140625,-4.609375 H 3.1875 L 1.234375,-2.65625 Z m 0,0"
           id="path47"
           inkscape:connector-curvature="0" />
      </symbol>
      <symbol
         overflow="visible"
         id="glyph0-16"
         style="overflow:visible">
        <path
           style="stroke:none"
           d="M 1.3125,-4.609375 H 0.59375 V 0 H 1.3125 Z m 0,-1.796875 H 0.578125 v 0.921875 H 1.3125 Z m 0,0"
           id="path50"
           inkscape:connector-curvature="0" />
      </symbol>
      <symbol
         overflow="visible"
         id="glyph0-17"
         style="overflow:visible">
        <path
           style="stroke:none"
           d="M 0.609375,-4.609375 V 0 h 0.75 v -2.546875 c 0,-0.9375 0.484375,-1.546875 1.25,-1.546875 0.578125,0 0.9375,0.34375 0.9375,0.90625 V 0 H 4.28125 v -3.484375 c 0,-0.765625 -0.5625,-1.25 -1.453125,-1.25 -0.6875,0 -1.125,0.25 -1.53125,0.90625 v -0.78125 z m 0,0"
           id="path53"
           inkscape:connector-curvature="0" />
      </symbol>
      <symbol
         overflow="visible"
         id="glyph0-18"
         style="overflow:visible">
        <path
           style="stroke:none"
           d="M 3.546875,-4.609375 V -3.9375 C 3.1875,-4.5 2.78125,-4.734375 2.203125,-4.734375 c -1.125,0 -1.890625,1.03125 -1.890625,2.515625 0,0.765625 0.1875,1.328125 0.578125,1.796875 0.34375,0.40625 0.78125,0.625 1.25,0.625 0.5625,0 0.953125,-0.25 1.34375,-0.828125 v 0.234375 c 0,1.234375 -0.34375,1.6875 -1.265625,1.6875 -0.625,0 -0.9375,-0.234375 -1.015625,-0.765625 h -0.75 c 0.078125,0.84375 0.75,1.390625 1.75,1.390625 0.6875,0 1.25,-0.21875 1.546875,-0.59375 0.34375,-0.4375 0.484375,-1 0.484375,-2.078125 V -4.609375 Z M 2.265625,-4.0625 c 0.78125,0 1.21875,0.65625 1.21875,1.8125 0,1.125 -0.453125,1.78125 -1.21875,1.78125 -0.75,0 -1.1875,-0.671875 -1.1875,-1.796875 0,-1.125 0.4375,-1.796875 1.1875,-1.796875 z m 0,0"
           id="path56"
           inkscape:connector-curvature="0" />
      </symbol>
      <symbol
         overflow="visible"
         id="glyph0-19"
         style="overflow:visible">
        <path
           style="stroke:none"
           d="m 1.625,-2.71875 h 2.015625 c 0.5,0 0.890625,-0.15625 1.234375,-0.453125 0.390625,-0.359375 0.546875,-0.765625 0.546875,-1.359375 0,-1.203125 -0.703125,-1.875 -1.96875,-1.875 H 0.796875 V 0 H 1.625 Z m 0,-0.71875 v -2.25 h 1.703125 c 0.78125,0 1.25,0.421875 1.25,1.125 0,0.703125 -0.46875,1.125 -1.25,1.125 z m 0,0"
           id="path59"
           inkscape:connector-curvature="0" />
      </symbol>
      <symbol
         overflow="visible"
         id="glyph0-20"
         style="overflow:visible">
        <path
           style="stroke:none"
           d="m 1.34375,-6.40625 h -0.75 V 0 h 0.75 z m 0,0"
           id="path62"
           inkscape:connector-curvature="0" />
      </symbol>
      <symbol
         overflow="visible"
         id="glyph0-21"
         style="overflow:visible">
        <path
           style="stroke:none"
           d="M 4.703125,-0.4375 C 4.625,-0.40625 4.59375,-0.40625 4.546875,-0.40625 c -0.25,0 -0.390625,-0.140625 -0.390625,-0.375 v -2.703125 c 0,-0.8125 -0.609375,-1.25 -1.734375,-1.25 -0.6875,0 -1.21875,0.1875 -1.53125,0.53125 -0.21875,0.234375 -0.296875,0.5 -0.3125,0.953125 H 1.3125 c 0.0625,-0.5625 0.390625,-0.8125 1.078125,-0.8125 0.671875,0 1.03125,0.25 1.03125,0.6875 v 0.1875 C 3.40625,-2.875 3.25,-2.75 2.65625,-2.671875 1.625,-2.546875 1.453125,-2.5 1.171875,-2.390625 0.640625,-2.15625 0.375,-1.765625 0.375,-1.15625 c 0,0.828125 0.578125,1.359375 1.5,1.359375 C 2.46875,0.203125 2.921875,0 3.453125,-0.46875 3.5,0 3.734375,0.203125 4.203125,0.203125 c 0.15625,0 0.25,-0.015625 0.5,-0.078125 z m -1.28125,-1.015625 c 0,0.25 -0.0625,0.390625 -0.296875,0.59375 -0.296875,0.28125 -0.65625,0.421875 -1.078125,0.421875 -0.578125,0 -0.90625,-0.28125 -0.90625,-0.734375 0,-0.484375 0.3125,-0.734375 1.109375,-0.84375 C 3.03125,-2.125 3.171875,-2.15625 3.421875,-2.28125 Z m 0,0"
           id="path65"
           inkscape:connector-curvature="0" />
      </symbol>
      <symbol
         overflow="visible"
         id="glyph0-22"
         style="overflow:visible">
        <path
           style="stroke:none"
           d="m 4.140625,-3.0625 c -0.03125,-0.453125 -0.125,-0.734375 -0.3125,-1 -0.3125,-0.421875 -0.859375,-0.671875 -1.5,-0.671875 -1.25,0 -2.0625,0.984375 -2.0625,2.515625 0,1.484375 0.796875,2.421875 2.046875,2.421875 1.09375,0 1.796875,-0.65625 1.890625,-1.78125 h -0.75 c -0.125,0.734375 -0.5,1.109375 -1.125,1.109375 -0.8125,0 -1.296875,-0.671875 -1.296875,-1.75 0,-1.15625 0.484375,-1.84375 1.28125,-1.84375 0.609375,0 1,0.359375 1.09375,1 z m 0,0"
           id="path68"
           inkscape:connector-curvature="0" />
      </symbol>
      <symbol
         overflow="visible"
         id="glyph0-23"
         style="overflow:visible">
        <path
           style="stroke:none"
           d="M 3.859375,-3.328125 C 3.84375,-4.234375 3.25,-4.734375 2.1875,-4.734375 c -1.078125,0 -1.78125,0.546875 -1.78125,1.40625 0,0.71875 0.375,1.0625 1.46875,1.328125 l 0.6875,0.15625 c 0.5,0.125 0.703125,0.3125 0.703125,0.640625 0,0.4375 -0.421875,0.734375 -1.0625,0.734375 -0.40625,0 -0.734375,-0.125 -0.921875,-0.3125 C 1.171875,-0.921875 1.125,-1.046875 1.078125,-1.375 h -0.78125 c 0.03125,1.0625 0.640625,1.578125 1.84375,1.578125 1.15625,0 1.890625,-0.578125 1.890625,-1.46875 0,-0.671875 -0.375,-1.0625 -1.296875,-1.28125 L 2.03125,-2.703125 C 1.4375,-2.84375 1.171875,-3.046875 1.171875,-3.375 c 0,-0.421875 0.390625,-0.6875 0.984375,-0.6875 0.59375,0 0.90625,0.25 0.921875,0.734375 z m 0,0"
           id="path71"
           inkscape:connector-curvature="0" />
      </symbol>
      <symbol
         overflow="visible"
         id="glyph0-24"
         style="overflow:visible">
        <path
           style="stroke:none"
           d="m 0.6875,0 h 2.90625 c 0.609375,0 1.046875,-0.171875 1.390625,-0.53125 0.3125,-0.34375 0.5,-0.796875 0.5,-1.296875 0,-0.78125 -0.359375,-1.234375 -1.171875,-1.5625 C 4.90625,-3.65625 5.203125,-4.125 5.203125,-4.78125 c 0,-0.484375 -0.1875,-0.890625 -0.515625,-1.1875 -0.34375,-0.296875 -0.765625,-0.4375 -1.390625,-0.4375 H 0.6875 Z M 1.515625,-3.65625 V -5.6875 H 3.09375 c 0.453125,0 0.71875,0.0625 0.9375,0.21875 C 4.25,-5.28125 4.375,-5.015625 4.375,-4.671875 4.375,-4.3125 4.25,-4.0625 4.03125,-3.875 3.8125,-3.71875 3.546875,-3.65625 3.09375,-3.65625 Z m 0,2.9375 v -2.203125 h 2 c 0.71875,0 1.140625,0.40625 1.140625,1.09375 0,0.6875 -0.421875,1.109375 -1.140625,1.109375 z m 0,0"
           id="path74"
           inkscape:connector-curvature="0" />
      </symbol>
      <symbol
         overflow="visible"
         id="glyph0-25"
         style="overflow:visible">
        <path
           style="stroke:none"
           d="M 0.78125,0 H 3.25 c 1.625,0 2.625,-1.21875 2.625,-3.203125 0,-2 -1,-3.203125 -2.625,-3.203125 H 0.78125 Z m 0.8125,-0.71875 V -5.6875 h 1.515625 c 1.265625,0 1.9375,0.84375 1.9375,2.484375 0,1.625 -0.671875,2.484375 -1.9375,2.484375 z m 0,0"
           id="path77"
           inkscape:connector-curvature="0" />
      </symbol>
      <symbol
         overflow="visible"
         id="glyph0-26"
         style="overflow:visible">
        <path
           style="stroke:none"
           d="M 3.109375,-5.6875 H 5.21875 V -6.40625 H 0.1875 V -5.6875 H 2.296875 V 0 h 0.8125 z m 0,0"
           id="path80"
           inkscape:connector-curvature="0" />
      </symbol>
      <symbol
         overflow="visible"
         id="glyph0-27"
         style="overflow:visible">
        <path
           style="stroke:none"
           d="m 0.46875,1.921875 h 0.75 v -2.40625 c 0.375,0.46875 0.8125,0.6875 1.40625,0.6875 1.203125,0 1.96875,-0.953125 1.96875,-2.421875 0,-1.5625 -0.75,-2.515625 -1.96875,-2.515625 -0.625,0 -1.125,0.28125 -1.46875,0.8125 v -0.6875 H 0.46875 Z M 2.5,-4.0625 c 0.8125,0 1.328125,0.71875 1.328125,1.8125 0,1.046875 -0.53125,1.765625 -1.328125,1.765625 -0.78125,0 -1.28125,-0.703125 -1.28125,-1.78125 0,-1.09375 0.5,-1.796875 1.28125,-1.796875 z m 0,0"
           id="path83"
           inkscape:connector-curvature="0" />
      </symbol>
      <symbol
         overflow="visible"
         id="glyph0-28"
         style="overflow:visible">
        <path
           style="stroke:none"
           d="M 2.28125,-4.53125 V 0 h 0.765625 v -6.359375 h -0.5 C 2.265625,-5.390625 2.09375,-5.25 0.890625,-5.09375 v 0.5625 z m 0,0"
           id="path86"
           inkscape:connector-curvature="0" />
      </symbol>
      <symbol
         overflow="visible"
         id="glyph0-29"
         style="overflow:visible">
        <path
           style="stroke:none"
           d="m 1.9375,-2.921875 h 0.421875 c 0.84375,0 1.296875,0.390625 1.296875,1.15625 0,0.796875 -0.484375,1.28125 -1.28125,1.28125 -0.859375,0 -1.265625,-0.4375 -1.3125,-1.359375 H 0.28125 c 0.03125,0.5 0.125,0.84375 0.265625,1.125 0.328125,0.609375 0.9375,0.921875 1.796875,0.921875 1.28125,0 2.109375,-0.78125 2.109375,-1.984375 0,-0.8125 -0.3125,-1.25 -1.0625,-1.515625 0.578125,-0.234375 0.875,-0.671875 0.875,-1.3125 0,-1.09375 -0.71875,-1.75 -1.90625,-1.75 -1.25,0 -1.921875,0.703125 -1.953125,2.046875 H 1.1875 C 1.203125,-4.703125 1.234375,-4.921875 1.328125,-5.109375 1.5,-5.46875 1.890625,-5.6875 2.375,-5.6875 c 0.6875,0 1.09375,0.421875 1.09375,1.109375 0,0.4375 -0.15625,0.71875 -0.5,0.859375 -0.203125,0.09375 -0.484375,0.125 -1.03125,0.140625 z m 0,0"
           id="path89"
           inkscape:connector-curvature="0" />
      </symbol>
      <symbol
         overflow="visible"
         id="glyph0-30"
         style="overflow:visible">
        <path
           style="stroke:none"
           d="M 4.84375,-2.921875 V 0 H 5.671875 V -6.40625 H 4.84375 v 2.765625 H 1.546875 V -6.40625 h -0.8125 V 0 h 0.8125 v -2.921875 z m 0,0"
           id="path92"
           inkscape:connector-curvature="0" />
      </symbol>
      <symbol
         overflow="visible"
         id="glyph0-31"
         style="overflow:visible">
        <path
           style="stroke:none"
           d="M 4.703125,-2.34375 H 2.875 V -4.171875 H 2.265625 V -2.34375 H 0.4375 v 0.609375 H 2.265625 V 0.09375 H 2.875 v -1.828125 h 1.828125 z m 0,0"
           id="path95"
           inkscape:connector-curvature="0" />
      </symbol>
      <symbol
         overflow="visible"
         id="glyph0-32"
         style="overflow:visible">
        <path
           style="stroke:none"
           d="m 1.609375,-2.921875 h 3.0625 v -0.71875 h -3.0625 V -5.6875 H 5.09375 V -6.40625 H 0.796875 V 0 h 0.8125 z m 0,0"
           id="path98"
           inkscape:connector-curvature="0" />
      </symbol>
      <symbol
         overflow="visible"
         id="glyph1-0"
         style="overflow:visible">
        <path
           style="stroke:none"
           d=""
           id="path101"
           inkscape:connector-curvature="0" />
      </symbol>
      <symbol
         overflow="visible"
         id="glyph1-1"
         style="overflow:visible">
        <path
           style="stroke:none"
           d="M 2.796875,-5.765625 H 1.84375 V -7.34375 H 0.9375 v 1.578125 H 0.15625 v 0.75 H 0.9375 v 4.359375 c 0,0.59375 0.390625,0.90625 1.109375,0.90625 0.234375,0 0.4375,-0.015625 0.75,-0.078125 V -0.59375 c -0.140625,0.03125 -0.25,0.046875 -0.4375,0.046875 -0.40625,0 -0.515625,-0.109375 -0.515625,-0.515625 v -3.953125 h 0.953125 z m 0,0"
           id="path104"
           inkscape:connector-curvature="0" />
      </symbol>
      <symbol
         overflow="visible"
         id="glyph1-2"
         style="overflow:visible">
        <path
           style="stroke:none"
           d="m 2.984375,-5.921875 c -1.625,0 -2.59375,1.140625 -2.59375,3.078125 0,1.953125 0.96875,3.09375 2.609375,3.09375 1.625,0 2.609375,-1.15625 2.609375,-3.046875 0,-2 -0.953125,-3.125 -2.625,-3.125 z M 3,-5.078125 c 1.03125,0 1.65625,0.84375 1.65625,2.265625 0,1.375 -0.640625,2.21875 -1.65625,2.21875 -1.015625,0 -1.640625,-0.84375 -1.640625,-2.25 0,-1.390625 0.625,-2.234375 1.640625,-2.234375 z m 0,0"
           id="path107"
           inkscape:connector-curvature="0" />
      </symbol>
      <symbol
         overflow="visible"
         id="glyph1-3"
         style="overflow:visible">
        <path
           style="stroke:none"
           d="m 0.59375,2.390625 h 0.921875 v -3 C 2,-0.015625 2.546875,0.25 3.28125,0.25 c 1.5,0 2.46875,-1.203125 2.46875,-3.03125 0,-1.9375 -0.9375,-3.140625 -2.46875,-3.140625 -0.78125,0 -1.40625,0.34375 -1.84375,1.03125 v -0.875 H 0.59375 Z M 3.125,-5.078125 c 1.015625,0 1.671875,0.890625 1.671875,2.265625 0,1.3125 -0.671875,2.203125 -1.671875,2.203125 -0.984375,0 -1.609375,-0.875 -1.609375,-2.234375 0,-1.34375 0.625,-2.234375 1.609375,-2.234375 z m 0,0"
           id="path110"
           inkscape:connector-curvature="0" />
      </symbol>
      <symbol
         overflow="visible"
         id="glyph1-4"
         style="overflow:visible">
        <path
           style="stroke:none"
           d="M 1.65625,-5.765625 H 0.734375 V 0 H 1.65625 Z m 0,-2.25 h -0.9375 v 1.15625 h 0.9375 z m 0,0"
           id="path113"
           inkscape:connector-curvature="0" />
      </symbol>
      <symbol
         overflow="visible"
         id="glyph1-5"
         style="overflow:visible">
        <path
           style="stroke:none"
           d="m 5.1875,-3.828125 c -0.046875,-0.5625 -0.171875,-0.921875 -0.390625,-1.25 -0.390625,-0.53125 -1.09375,-0.84375 -1.890625,-0.84375 -1.5625,0 -2.5625,1.21875 -2.5625,3.140625 0,1.859375 0.984375,3.03125 2.546875,3.03125 1.375,0 2.25,-0.828125 2.359375,-2.234375 H 4.328125 c -0.15625,0.921875 -0.625,1.390625 -1.40625,1.390625 -1.015625,0 -1.625,-0.828125 -1.625,-2.1875 0,-1.4375 0.59375,-2.296875 1.59375,-2.296875 0.765625,0 1.25,0.453125 1.359375,1.25 z m 0,0"
           id="path116"
           inkscape:connector-curvature="0" />
      </symbol>
      <symbol
         overflow="visible"
         id="glyph1-6"
         style="overflow:visible">
        <path
           style="stroke:none"
           d="M 0.59375,-8.015625 V 0 H 1.421875 V -0.734375 C 1.859375,-0.0625 2.4375,0.25 3.25,0.25 c 1.515625,0 2.5,-1.234375 2.5,-3.15625 0,-1.875 -0.9375,-3.015625 -2.46875,-3.015625 C 2.5,-5.921875 1.9375,-5.625 1.5,-4.984375 v -3.03125 z m 2.515625,2.9375 c 1.03125,0 1.6875,0.890625 1.6875,2.265625 0,1.3125 -0.6875,2.203125 -1.6875,2.203125 -0.96875,0 -1.609375,-0.875 -1.609375,-2.234375 0,-1.34375 0.640625,-2.234375 1.609375,-2.234375 z m 0,0"
           id="path119"
           inkscape:connector-curvature="0" />
      </symbol>
      <symbol
         overflow="visible"
         id="glyph1-7"
         style="overflow:visible">
        <path
           style="stroke:none"
           d="M 5.296875,0 V -5.765625 H 4.390625 V -2.5 c 0,1.1875 -0.625,1.953125 -1.578125,1.953125 -0.71875,0 -1.1875,-0.4375 -1.1875,-1.140625 V -5.765625 H 0.71875 V -1.3125 c 0,0.953125 0.71875,1.5625 1.828125,1.5625 0.859375,0 1.390625,-0.296875 1.9375,-1.046875 V 0 Z m 0,0"
           id="path122"
           inkscape:connector-curvature="0" />
      </symbol>
      <symbol
         overflow="visible"
         id="glyph1-8"
         style="overflow:visible">
        <path
           style="stroke:none"
           d="M 1.671875,-8.015625 H 0.75 V 0 h 0.921875 z m 0,0"
           id="path125"
           inkscape:connector-curvature="0" />
      </symbol>
      <symbol
         overflow="visible"
         id="glyph1-9"
         style="overflow:visible">
        <path
           style="stroke:none"
           d="M 5.4375,-8.015625 H 4.53125 v 2.984375 c -0.390625,-0.59375 -1,-0.890625 -1.765625,-0.890625 -1.5,0 -2.484375,1.1875 -2.484375,3.03125 0,1.9375 0.953125,3.140625 2.515625,3.140625 0.796875,0 1.34375,-0.296875 1.828125,-1.015625 V 0 h 0.8125 z m -2.515625,2.9375 c 0.984375,0 1.609375,0.875 1.609375,2.265625 0,1.328125 -0.640625,2.203125 -1.609375,2.203125 C 1.90625,-0.609375 1.25,-1.5 1.25,-2.84375 c 0,-1.34375 0.65625,-2.234375 1.671875,-2.234375 z m 0,0"
           id="path128"
           inkscape:connector-curvature="0" />
      </symbol>
      <symbol
         overflow="visible"
         id="glyph1-10"
         style="overflow:visible">
        <path
           style="stroke:none"
           d="M 0.765625,-5.765625 V 0 H 1.6875 v -3.171875 c 0,-1.1875 0.625,-1.953125 1.5625,-1.953125 0.734375,0 1.1875,0.4375 1.1875,1.125 v 4 h 0.921875 v -4.359375 c 0,-0.953125 -0.71875,-1.5625 -1.828125,-1.5625 -0.859375,0 -1.40625,0.328125 -1.921875,1.125 v -0.96875 z m 0,0"
           id="path131"
           inkscape:connector-curvature="0" />
      </symbol>
      <symbol
         overflow="visible"
         id="glyph1-11"
         style="overflow:visible">
        <path
           style="stroke:none"
           d="m 4.4375,-5.765625 v 0.84375 c -0.453125,-0.703125 -0.96875,-1 -1.6875,-1 -1.390625,0 -2.359375,1.296875 -2.359375,3.140625 0,0.96875 0.21875,1.671875 0.71875,2.25 C 1.546875,-0.015625 2.09375,0.25 2.6875,0.25 3.375,0.25 3.875,-0.0625 4.359375,-0.78125 v 0.296875 C 4.359375,1.0625 3.921875,1.625 2.78125,1.625 2,1.625 1.59375,1.3125 1.5,0.65625 H 0.578125 C 0.65625,1.734375 1.5,2.390625 2.765625,2.390625 3.609375,2.390625 4.3125,2.125 4.6875,1.65625 5.125,1.125 5.296875,0.40625 5.296875,-0.953125 v -4.8125 z m -1.59375,0.6875 c 0.96875,0 1.515625,0.8125 1.515625,2.265625 0,1.40625 -0.5625,2.21875 -1.515625,2.21875 -0.953125,0 -1.5,-0.828125 -1.5,-2.25 0,-1.40625 0.546875,-2.234375 1.5,-2.234375 z m 0,0"
           id="path134"
           inkscape:connector-curvature="0" />
      </symbol>
      <symbol
         overflow="visible"
         id="glyph1-12"
         style="overflow:visible">
        <path
           style="stroke:none"
           d="M 6.5625,-5.671875 C 6.5625,-6.21875 6.515625,-6.375 6.34375,-6.75 5.90625,-7.671875 4.96875,-8.15625 3.625,-8.15625 c -1.765625,0 -2.859375,0.90625 -2.859375,2.359375 0,0.984375 0.515625,1.59375 1.578125,1.875 l 1.984375,0.515625 c 1.03125,0.265625 1.484375,0.671875 1.484375,1.3125 0,0.421875 -0.234375,0.859375 -0.578125,1.109375 -0.3125,0.21875 -0.828125,0.328125 -1.46875,0.328125 C 2.875,-0.65625 2.296875,-0.859375 1.90625,-1.3125 1.609375,-1.671875 1.484375,-2.0625 1.5,-2.546875 H 0.53125 C 0.53125,-1.8125 0.6875,-1.328125 1,-0.890625 1.546875,-0.125 2.46875,0.25 3.703125,0.25 c 0.953125,0 1.734375,-0.21875 2.25,-0.609375 0.53125,-0.4375 0.875,-1.140625 0.875,-1.84375 0,-0.984375 -0.609375,-1.71875 -1.703125,-2.015625 L 3.109375,-4.75 c -0.96875,-0.265625 -1.3125,-0.578125 -1.3125,-1.1875 0,-0.8125 0.71875,-1.359375 1.796875,-1.359375 1.265625,0 1.984375,0.578125 2,1.625 z m 0,0"
           id="path137"
           inkscape:connector-curvature="0" />
      </symbol>
      <symbol
         overflow="visible"
         id="glyph1-13"
         style="overflow:visible">
        <path
           style="stroke:none"
           d="M 0.765625,-5.765625 V 0 H 1.6875 V -2.984375 C 1.6875,-4.375 2.265625,-5 3.53125,-4.96875 v -0.921875 c -0.15625,-0.03125 -0.25,-0.03125 -0.359375,-0.03125 -0.59375,0 -1.03125,0.34375 -1.5625,1.203125 v -1.046875 z m 0,0"
           id="path140"
           inkscape:connector-curvature="0" />
      </symbol>
      <symbol
         overflow="visible"
         id="glyph1-14"
         style="overflow:visible">
        <path
           style="stroke:none"
           d="m 5.640625,-2.578125 c 0,-0.875 -0.0625,-1.40625 -0.234375,-1.828125 -0.375,-0.953125 -1.25,-1.515625 -2.328125,-1.515625 -1.609375,0 -2.640625,1.21875 -2.640625,3.109375 0,1.90625 1,3.0625 2.625,3.0625 1.3125,0 2.234375,-0.75 2.453125,-2 H 4.59375 c -0.25,0.765625 -0.765625,1.15625 -1.5,1.15625 -0.578125,0 -1.078125,-0.265625 -1.390625,-0.75 C 1.484375,-1.671875 1.40625,-2 1.390625,-2.578125 Z m -4.21875,-0.75 c 0.078125,-1.0625 0.71875,-1.75 1.640625,-1.75 0.9375,0 1.59375,0.71875 1.59375,1.75 z m 0,0"
           id="path143"
           inkscape:connector-curvature="0" />
      </symbol>
      <symbol
         overflow="visible"
         id="glyph2-0"
         style="overflow:visible">
        <path
           style="stroke:none"
           d=""
           id="path146"
           inkscape:connector-curvature="0" />
      </symbol>
      <symbol
         overflow="visible"
         id="glyph2-1"
         style="overflow:visible">
        <path
           style="stroke:none"
           d="M 0,-3.140625 -5.765625,-5.34375 v 1.03125 l 4.671875,1.625 -4.671875,1.546875 v 1.03125 L 0,-2.140625 Z m 0,0"
           id="path149"
           inkscape:connector-curvature="0" />
      </symbol>
      <symbol
         overflow="visible"
         id="glyph2-2"
         style="overflow:visible">
        <path
           style="stroke:none"
           d="m -0.53125,-5.890625 c 0.015625,0.109375 0.015625,0.15625 0.015625,0.203125 0,0.3125 -0.171875,0.5 -0.453125,0.5 h -3.390625 c -1.015625,0 -1.5625,0.75 -1.5625,2.15625 0,0.859375 0.234375,1.53125 0.65625,1.921875 0.296875,0.265625 0.640625,0.375 1.203125,0.390625 v -0.921875 c -0.703125,-0.078125 -1.015625,-0.5 -1.015625,-1.34375 0,-0.84375 0.296875,-1.296875 0.859375,-1.296875 h 0.234375 c 0.390625,0.015625 0.546875,0.21875 0.640625,0.953125 0.171875,1.296875 0.203125,1.5 0.359375,1.859375 0.28125,0.671875 0.78125,1 1.53125,1 C -0.40625,-0.46875 0.25,-1.1875 0.25,-2.359375 0.25,-3.078125 0,-3.65625 -0.59375,-4.3125 0,-4.375 0.25,-4.65625 0.25,-5.265625 c 0,-0.1875 -0.015625,-0.3125 -0.09375,-0.625 z M -1.8125,-4.28125 c 0.3125,0 0.5,0.09375 0.75,0.359375 0.34375,0.375 0.515625,0.828125 0.515625,1.375 0,0.703125 -0.34375,1.125 -0.921875,1.125 -0.609375,0 -0.921875,-0.390625 -1.0625,-1.390625 -0.125,-0.96875 -0.171875,-1.15625 -0.3125,-1.46875 z m 0,0"
           id="path152"
           inkscape:connector-curvature="0" />
      </symbol>
      <symbol
         overflow="visible"
         id="glyph2-3"
         style="overflow:visible">
        <path
           style="stroke:none"
           d="M -8.015625,-1.671875 V -0.75 H 0 v -0.921875 z m 0,0"
           id="path155"
           inkscape:connector-curvature="0" />
      </symbol>
      <symbol
         overflow="visible"
         id="glyph2-4"
         style="overflow:visible">
        <path
           style="stroke:none"
           d="m 0,-5.296875 h -5.765625 v 0.90625 H -2.5 c 1.1875,0 1.953125,0.625 1.953125,1.578125 0,0.71875 -0.4375,1.1875 -1.140625,1.1875 h -4.078125 v 0.90625 H -1.3125 c 0.953125,0 1.5625,-0.71875 1.5625,-1.828125 0,-0.859375 -0.296875,-1.390625 -1.046875,-1.9375 H 0 Z m 0,0"
           id="path158"
           inkscape:connector-curvature="0" />
      </symbol>
      <symbol
         overflow="visible"
         id="glyph2-5"
         style="overflow:visible">
        <path
           style="stroke:none"
           d="m -2.578125,-5.640625 c -0.875,0 -1.40625,0.0625 -1.828125,0.234375 -0.953125,0.375 -1.515625,1.25 -1.515625,2.328125 0,1.609375 1.21875,2.640625 3.109375,2.640625 1.90625,0 3.0625,-1 3.0625,-2.625 0,-1.3125 -0.75,-2.234375 -2,-2.453125 v 0.921875 c 0.765625,0.25 1.15625,0.765625 1.15625,1.5 0,0.578125 -0.265625,1.078125 -0.75,1.390625 -0.328125,0.21875 -0.65625,0.296875 -1.234375,0.3125 z m -0.75,4.21875 c -1.0625,-0.078125 -1.75,-0.71875 -1.75,-1.640625 0,-0.9375 0.71875,-1.59375 1.75,-1.59375 z m 0,0"
           id="path161"
           inkscape:connector-curvature="0" />
      </symbol>
    </g>
    <clipPath
       id="clip1">
      <path
         d="M 0,0 H 283.5 V 209.5 H 0 Z m 0,0"
         id="path166"
         inkscape:connector-curvature="0" />
    </clipPath>
    <clipPath
       id="clip2">
      <path
         d="M 49.570312,5.480469 H 183.57031 V 175.94922 H 49.570312 Z m 0,0"
         id="path169"
         inkscape:connector-curvature="0" />
    </clipPath>
    <clipPath
       id="clip3">
      <path
         d="M 49.570312,141 H 183.57031 v 1 H 49.570312 Z m 0,0"
         id="path172"
         inkscape:connector-curvature="0" />
    </clipPath>
    <clipPath
       id="clip4">
      <path
         d="M 49.570312,87 H 183.57031 v 1 H 49.570312 Z m 0,0"
         id="path175"
         inkscape:connector-curvature="0" />
    </clipPath>
    <clipPath
       id="clip5">
      <path
         d="M 49.570312,33 H 183.57031 v 2 H 49.570312 Z m 0,0"
         id="path178"
         inkscape:connector-curvature="0" />
    </clipPath>
    <clipPath
       id="clip6">
      <path
         d="M 49.570312,167 H 183.57031 v 2 H 49.570312 Z m 0,0"
         id="path181"
         inkscape:connector-curvature="0" />
    </clipPath>
    <clipPath
       id="clip7">
      <path
         d="M 49.570312,113 H 183.57031 v 2 H 49.570312 Z m 0,0"
         id="path184"
         inkscape:connector-curvature="0" />
    </clipPath>
    <clipPath
       id="clip8">
      <path
         d="M 49.570312,60 H 183.57031 v 2 H 49.570312 Z m 0,0"
         id="path187"
         inkscape:connector-curvature="0" />
    </clipPath>
    <clipPath
       id="clip9">
      <path
         d="M 49.570312,6 H 183.57031 V 8 H 49.570312 Z m 0,0"
         id="path190"
         inkscape:connector-curvature="0" />
    </clipPath>
    <clipPath
       id="clip10">
      <path
         d="m 116,5.480469 h 2 V 175.94922 h -2 z m 0,0"
         id="path193"
         inkscape:connector-curvature="0" />
    </clipPath>
    <clipPath
       id="clip11">
      <path
         d="M 283.5,0 H 567 V 209.5 H 283.5 Z m 0,0"
         id="path196"
         inkscape:connector-curvature="0" />
    </clipPath>
    <clipPath
       id="clip12">
      <path
         d="m 333.07031,5.480469 h 134 V 175.94922 h -134 z m 0,0"
         id="path199"
         inkscape:connector-curvature="0" />
    </clipPath>
    <clipPath
       id="clip13">
      <path
         d="m 333.07031,149 h 134 v 1 h -134 z m 0,0"
         id="path202"
         inkscape:connector-curvature="0" />
    </clipPath>
    <clipPath
       id="clip14">
      <path
         d="m 333.07031,112 h 134 v 2 h -134 z m 0,0"
         id="path205"
         inkscape:connector-curvature="0" />
    </clipPath>
    <clipPath
       id="clip15">
      <path
         d="m 333.07031,75 h 134 v 2 h -134 z m 0,0"
         id="path208"
         inkscape:connector-curvature="0" />
    </clipPath>
    <clipPath
       id="clip16">
      <path
         d="m 333.07031,38 h 134 v 2 h -134 z m 0,0"
         id="path211"
         inkscape:connector-curvature="0" />
    </clipPath>
    <clipPath
       id="clip17">
      <path
         d="m 333.07031,167 h 134 v 2 h -134 z m 0,0"
         id="path214"
         inkscape:connector-curvature="0" />
    </clipPath>
    <clipPath
       id="clip18">
      <path
         d="m 333.07031,130 h 134 v 2 h -134 z m 0,0"
         id="path217"
         inkscape:connector-curvature="0" />
    </clipPath>
    <clipPath
       id="clip19">
      <path
         d="m 333.07031,93 h 134 v 2 h -134 z m 0,0"
         id="path220"
         inkscape:connector-curvature="0" />
    </clipPath>
    <clipPath
       id="clip20">
      <path
         d="m 333.07031,56 h 134 v 2 h -134 z m 0,0"
         id="path223"
         inkscape:connector-curvature="0" />
    </clipPath>
    <clipPath
       id="clip21">
      <path
         d="m 333.07031,19 h 134 v 2 h -134 z m 0,0"
         id="path226"
         inkscape:connector-curvature="0" />
    </clipPath>
    <clipPath
       id="clip22">
      <path
         d="m 399,5.480469 h 2 V 175.94922 h -2 z m 0,0"
         id="path229"
         inkscape:connector-curvature="0" />
    </clipPath>
    <clipPath
       id="clip23">
      <path
         d="M 0,209.5 H 283.5 V 419 H 0 Z m 0,0"
         id="path232"
         inkscape:connector-curvature="0" />
    </clipPath>
    <clipPath
       id="clip24">
      <path
         d="M 49.570312,214.98047 H 183.57031 V 385.44922 H 49.570312 Z m 0,0"
         id="path235"
         inkscape:connector-curvature="0" />
    </clipPath>
    <clipPath
       id="clip25">
      <path
         d="M 49.570312,350 H 183.57031 v 2 H 49.570312 Z m 0,0"
         id="path238"
         inkscape:connector-curvature="0" />
    </clipPath>
    <clipPath
       id="clip26">
      <path
         d="M 49.570312,297 H 183.57031 v 1 H 49.570312 Z m 0,0"
         id="path241"
         inkscape:connector-curvature="0" />
    </clipPath>
    <clipPath
       id="clip27">
      <path
         d="M 49.570312,243 H 183.57031 v 2 H 49.570312 Z m 0,0"
         id="path244"
         inkscape:connector-curvature="0" />
    </clipPath>
    <clipPath
       id="clip28">
      <path
         d="M 49.570312,377 H 183.57031 v 2 H 49.570312 Z m 0,0"
         id="path247"
         inkscape:connector-curvature="0" />
    </clipPath>
    <clipPath
       id="clip29">
      <path
         d="M 49.570312,323 H 183.57031 v 2 H 49.570312 Z m 0,0"
         id="path250"
         inkscape:connector-curvature="0" />
    </clipPath>
    <clipPath
       id="clip30">
      <path
         d="M 49.570312,270 H 183.57031 v 2 H 49.570312 Z m 0,0"
         id="path253"
         inkscape:connector-curvature="0" />
    </clipPath>
    <clipPath
       id="clip31">
      <path
         d="M 49.570312,216 H 183.57031 v 2 H 49.570312 Z m 0,0"
         id="path256"
         inkscape:connector-curvature="0" />
    </clipPath>
    <clipPath
       id="clip32">
      <path
         d="m 116,214.98047 h 2 v 170.46875 h -2 z m 0,0"
         id="path259"
         inkscape:connector-curvature="0" />
    </clipPath>
  </defs>
  <g
     style="clip-rule:nonzero"
     id="g272"
     clip-path="url(#clip2)"
     transform="translate(-19.890625,-3.5517578)">
    <path
       inkscape:connector-curvature="0"
       id="path270"
       d="M 49.570312,175.94922 H 183.57031 V 5.480469 H 49.570312 Z m 0,0"
       style="fill:#ebebeb;fill-opacity:1;fill-rule:nonzero;stroke:none" />
  </g>
  <g
     style="clip-rule:nonzero"
     id="g276"
     clip-path="url(#clip3)"
     transform="translate(-19.890625,-3.5517578)">
    <path
       inkscape:connector-curvature="0"
       id="path274"
       d="M 49.570312,141.33203 H 183.57031"
       style="fill:none;stroke:#ffffff;stroke-width:0.53348899;stroke-linecap:butt;stroke-linejoin:round;stroke-miterlimit:10;stroke-opacity:1" />
  </g>
  <g
     style="clip-rule:nonzero"
     id="g280"
     clip-path="url(#clip4)"
     transform="translate(-19.890625,-3.5517578)">
    <path
       inkscape:connector-curvature="0"
       id="path278"
       d="M 49.570312,87.597656 H 183.57031"
       style="fill:none;stroke:#ffffff;stroke-width:0.53348899;stroke-linecap:butt;stroke-linejoin:round;stroke-miterlimit:10;stroke-opacity:1" />
  </g>
  <g
     style="clip-rule:nonzero"
     id="g284"
     clip-path="url(#clip5)"
     transform="translate(-19.890625,-3.5517578)">
    <path
       inkscape:connector-curvature="0"
       id="path282"
       d="M 49.570312,33.863281 H 183.57031"
       style="fill:none;stroke:#ffffff;stroke-width:0.53348899;stroke-linecap:butt;stroke-linejoin:round;stroke-miterlimit:10;stroke-opacity:1" />
  </g>
  <g
     style="clip-rule:nonzero"
     id="g288"
     clip-path="url(#clip6)"
     transform="translate(-19.890625,-3.5517578)">
    <path
       inkscape:connector-curvature="0"
       id="path286"
       d="M 49.570312,168.19922 H 183.57031"
       style="fill:none;stroke:#ffffff;stroke-width:1.06697798;stroke-linecap:butt;stroke-linejoin:round;stroke-miterlimit:10;stroke-opacity:1" />
  </g>
  <g
     style="clip-rule:nonzero"
     id="g292"
     clip-path="url(#clip7)"
     transform="translate(-19.890625,-3.5517578)">
    <path
       inkscape:connector-curvature="0"
       id="path290"
       d="M 49.570312,114.46484 H 183.57031"
       style="fill:none;stroke:#ffffff;stroke-width:1.06697798;stroke-linecap:butt;stroke-linejoin:round;stroke-miterlimit:10;stroke-opacity:1" />
  </g>
  <g
     style="clip-rule:nonzero"
     id="g296"
     clip-path="url(#clip8)"
     transform="translate(-19.890625,-3.5517578)">
    <path
       inkscape:connector-curvature="0"
       id="path294"
       d="M 49.570312,60.730469 H 183.57031"
       style="fill:none;stroke:#ffffff;stroke-width:1.06697798;stroke-linecap:butt;stroke-linejoin:round;stroke-miterlimit:10;stroke-opacity:1" />
  </g>
  <g
     style="clip-rule:nonzero"
     id="g300"
     clip-path="url(#clip9)"
     transform="translate(-19.890625,-3.5517578)">
    <path
       inkscape:connector-curvature="0"
       id="path298"
       d="M 49.570312,6.996094 H 183.57031"
       style="fill:none;stroke:#ffffff;stroke-width:1.06697798;stroke-linecap:butt;stroke-linejoin:round;stroke-miterlimit:10;stroke-opacity:1" />
  </g>
  <g
     style="clip-rule:nonzero"
     id="g304"
     clip-path="url(#clip10)"
     transform="translate(-19.890625,-3.5517578)">
    <path
       inkscape:connector-curvature="0"
       id="path302"
       d="M 116.57031,175.94922 V 5.480469"
       style="fill:none;stroke:#ffffff;stroke-width:1.06697798;stroke-linecap:butt;stroke-linejoin:round;stroke-miterlimit:10;stroke-opacity:1" />
  </g>
  <path
     inkscape:connector-curvature="0"
     id="path306"
     d="M 96.679685,164.64746 H 146.92968 V 9.6748042 H 96.679685 Z m 0,0"
     style="fill:#00bdc2;fill-opacity:1;fill-rule:nonzero;stroke:none" />
  <path
     inkscape:connector-curvature="0"
     id="path308"
     d="M 46.429687,164.64746 H 96.679685 V 98.120122 H 46.429687 Z m 0,0"
     style="fill:#f8756b;fill-opacity:1;fill-rule:nonzero;stroke:none" />
  <g
     id="g312"
     style="fill:#4c4c4c;fill-opacity:1"
     transform="translate(-19.890625,-3.5517578)">
    <use
       height="100%"
       width="100%"
       id="use310"
       y="171.11426"
       x="39.640625"
       xlink:href="#glyph0-1" />
  </g>
  <g
     id="g324"
     style="fill:#4c4c4c;fill-opacity:1"
     transform="translate(-19.890625,-3.5517578)">
    <use
       height="100%"
       width="100%"
       id="use314"
       y="117.37988"
       x="19.640625"
       xlink:href="#glyph0-2" />
    <use
       height="100%"
       width="100%"
       id="use316"
       y="117.37988"
       x="24.640625"
       xlink:href="#glyph0-1" />
    <use
       height="100%"
       width="100%"
       id="use318"
       y="117.37988"
       x="29.640625"
       xlink:href="#glyph0-1" />
    <use
       height="100%"
       width="100%"
       id="use320"
       y="117.37988"
       x="34.640625"
       xlink:href="#glyph0-1" />
    <use
       height="100%"
       width="100%"
       id="use322"
       y="117.37988"
       x="39.640625"
       xlink:href="#glyph0-1" />
  </g>
  <g
     id="g336"
     style="fill:#4c4c4c;fill-opacity:1"
     transform="translate(-19.890625,-3.5517578)">
    <use
       height="100%"
       width="100%"
       id="use326"
       y="63.645508"
       x="19.640625"
       xlink:href="#glyph0-3" />
    <use
       height="100%"
       width="100%"
       id="use328"
       y="63.645508"
       x="24.640625"
       xlink:href="#glyph0-1" />
    <use
       height="100%"
       width="100%"
       id="use330"
       y="63.645508"
       x="29.640625"
       xlink:href="#glyph0-1" />
    <use
       height="100%"
       width="100%"
       id="use332"
       y="63.645508"
       x="34.640625"
       xlink:href="#glyph0-1" />
    <use
       height="100%"
       width="100%"
       id="use334"
       y="63.645508"
       x="39.640625"
       xlink:href="#glyph0-1" />
  </g>
  <g
     id="g348"
     style="fill:#4c4c4c;fill-opacity:1"
     transform="translate(-19.890625,-3.5517578)">
    <use
       height="100%"
       width="100%"
       id="use338"
       y="9.9111328"
       x="19.640625"
       xlink:href="#glyph0-4" />
    <use
       height="100%"
       width="100%"
       id="use340"
       y="9.9111328"
       x="24.640625"
       xlink:href="#glyph0-1" />
    <use
       height="100%"
       width="100%"
       id="use342"
       y="9.9111328"
       x="29.640625"
       xlink:href="#glyph0-1" />
    <use
       height="100%"
       width="100%"
       id="use344"
       y="9.9111328"
       x="34.640625"
       xlink:href="#glyph0-1" />
    <use
       height="100%"
       width="100%"
       id="use346"
       y="9.9111328"
       x="39.640625"
       xlink:href="#glyph0-1" />
  </g>
  <path
     inkscape:connector-curvature="0"
     id="path350"
     d="m 26.941406,164.64746 h 2.738281"
     style="fill:none;stroke:#333333;stroke-width:1.06697798;stroke-linecap:butt;stroke-linejoin:round;stroke-miterlimit:10;stroke-opacity:1" />
  <path
     inkscape:connector-curvature="0"
     id="path352"
     d="m 26.941406,110.91308 h 2.738281"
     style="fill:none;stroke:#333333;stroke-width:1.06697798;stroke-linecap:butt;stroke-linejoin:round;stroke-miterlimit:10;stroke-opacity:1" />
  <path
     inkscape:connector-curvature="0"
     id="path354"
     d="m 26.941406,57.178711 h 2.738281"
     style="fill:none;stroke:#333333;stroke-width:1.06697798;stroke-linecap:butt;stroke-linejoin:round;stroke-miterlimit:10;stroke-opacity:1" />
  <path
     inkscape:connector-curvature="0"
     id="path356"
     d="m 26.941406,3.4443362 h 2.738281"
     style="fill:none;stroke:#333333;stroke-width:1.06697798;stroke-linecap:butt;stroke-linejoin:round;stroke-miterlimit:10;stroke-opacity:1" />
  <path
     inkscape:connector-curvature="0"
     id="path358"
     d="m 96.679685,175.13574 v -2.73828"
     style="fill:none;stroke:#333333;stroke-width:1.06697798;stroke-linecap:butt;stroke-linejoin:round;stroke-miterlimit:10;stroke-opacity:1" />
  <use
     style="fill:#4c4c4c;fill-opacity:1"
     xlink:href="#glyph0-5"
     x="65.570312"
     y="187.29395"
     id="use360"
     width="100%"
     height="100%"
     transform="matrix(1.3110271,0,0,1.3110271,-56.608062,-59.503068)" />
  <use
     style="fill:#4c4c4c;fill-opacity:1"
     xlink:href="#glyph0-6"
     x="71.570312"
     y="187.29395"
     id="use362"
     width="100%"
     height="100%"
     transform="matrix(1.3110271,0,0,1.3110271,-56.608062,-59.503068)" />
  <use
     style="fill:#4c4c4c;fill-opacity:1"
     xlink:href="#glyph0-7"
     x="76.570312"
     y="187.29395"
     id="use364"
     width="100%"
     height="100%"
     transform="matrix(1.3110271,0,0,1.3110271,-56.608062,-59.503068)" />
  <use
     style="fill:#4c4c4c;fill-opacity:1"
     xlink:href="#glyph0-8"
     x="83.570312"
     y="187.29395"
     id="use366"
     width="100%"
     height="100%"
     transform="matrix(1.3110271,0,0,1.3110271,-56.608062,-59.503068)" />
  <use
     style="fill:#4c4c4c;fill-opacity:1"
     xlink:href="#glyph0-9"
     x="88.570312"
     y="187.29395"
     id="use368"
     width="100%"
     height="100%"
     transform="matrix(1.3110271,0,0,1.3110271,-56.608062,-59.503068)" />
  <use
     style="fill:#4c4c4c;fill-opacity:1"
     xlink:href="#glyph0-10"
     x="93.570312"
     y="187.29395"
     id="use370"
     width="100%"
     height="100%"
     transform="matrix(1.3110271,0,0,1.3110271,-56.608062,-59.503068)" />
  <use
     style="fill:#4c4c4c;fill-opacity:1"
     xlink:href="#glyph0-11"
     x="96.570312"
     y="187.29395"
     id="use372"
     width="100%"
     height="100%"
     transform="matrix(1.3110271,0,0,1.3110271,-56.608062,-59.503068)" />
  <use
     style="fill:#4c4c4c;fill-opacity:1"
     xlink:href="#glyph0-12"
     x="98.570312"
     y="187.29395"
     id="use374"
     width="100%"
     height="100%"
     transform="matrix(1.3110271,0,0,1.3110271,-56.608062,-59.503068)" />
  <use
     style="fill:#4c4c4c;fill-opacity:1"
     xlink:href="#glyph0-13"
     x="103.57031"
     y="187.29395"
     id="use376"
     width="100%"
     height="100%"
     transform="matrix(1.3110271,0,0,1.3110271,-56.608062,-59.503068)" />
  <use
     style="fill:#4c4c4c;fill-opacity:1"
     xlink:href="#glyph0-11"
     x="105.57031"
     y="187.29395"
     id="use378"
     width="100%"
     height="100%"
     transform="matrix(1.3110271,0,0,1.3110271,-56.608062,-59.503068)" />
  <use
     style="fill:#4c4c4c;fill-opacity:1"
     xlink:href="#glyph0-14"
     x="107.57031"
     y="187.29395"
     id="use380"
     width="100%"
     height="100%"
     transform="matrix(1.3110271,0,0,1.3110271,-56.608062,-59.503068)" />
  <use
     style="fill:#4c4c4c;fill-opacity:1"
     xlink:href="#glyph0-12"
     x="115.57031"
     y="187.29395"
     id="use382"
     width="100%"
     height="100%"
     transform="matrix(1.3110271,0,0,1.3110271,-56.608063,-59.503068)" />
  <use
     style="fill:#4c4c4c;fill-opacity:1"
     xlink:href="#glyph0-15"
     x="120.57031"
     y="187.29395"
     id="use384"
     width="100%"
     height="100%"
     transform="matrix(1.3110271,0,0,1.3110271,-53.330485,-59.503068)" />
  <use
     style="fill:#4c4c4c;fill-opacity:1"
     xlink:href="#glyph0-10"
     x="124.57031"
     y="187.29395"
     id="use386"
     width="100%"
     height="100%"
     transform="matrix(1.3110271,0,0,1.3110271,-62.466705,-59.503068)" />
  <use
     style="fill:#4c4c4c;fill-opacity:1"
     xlink:href="#glyph0-16"
     x="127.57031"
     y="187.29395"
     id="use388"
     width="100%"
     height="100%"
     transform="matrix(1.3110271,0,0,1.3110271,-56.60805,-59.503068)" />
  <use
     style="fill:#4c4c4c;fill-opacity:1"
     xlink:href="#glyph0-17"
     x="129.57031"
     y="187.29395"
     id="use390"
     width="100%"
     height="100%"
     transform="matrix(1.3110271,0,0,1.3110271,-56.608062,-59.503068)" />
  <use
     style="fill:#4c4c4c;fill-opacity:1"
     xlink:href="#glyph0-18"
     x="134.57031"
     y="187.29395"
     id="use392"
     width="100%"
     height="100%"
     transform="matrix(1.3110271,0,0,1.3110271,-56.608062,-59.503068)" />
  <use
     style="fill:#4c4c4c;fill-opacity:1"
     xlink:href="#glyph0-11"
     x="139.57031"
     y="187.29395"
     id="use394"
     width="100%"
     height="100%"
     transform="matrix(1.3110271,0,0,1.3110271,-56.608062,-59.503068)" />
  <use
     style="fill:#4c4c4c;fill-opacity:1"
     xlink:href="#glyph0-19"
     x="141.57031"
     y="187.29395"
     id="use396"
     width="100%"
     height="100%"
     transform="matrix(1.3110271,0,0,1.3110271,-56.608062,-59.503068)" />
  <use
     style="fill:#4c4c4c;fill-opacity:1"
     xlink:href="#glyph0-20"
     x="147.57031"
     y="187.29395"
     id="use398"
     width="100%"
     height="100%"
     transform="matrix(1.3110271,0,0,1.3110271,-56.608062,-59.503068)" />
  <use
     style="fill:#4c4c4c;fill-opacity:1"
     xlink:href="#glyph0-21"
     x="149.57031"
     y="187.29395"
     id="use400"
     width="100%"
     height="100%"
     transform="matrix(1.3110271,0,0,1.3110271,-56.608062,-59.503068)" />
  <use
     style="fill:#4c4c4c;fill-opacity:1"
     xlink:href="#glyph0-22"
     x="154.57031"
     y="187.29395"
     id="use402"
     width="100%"
     height="100%"
     transform="matrix(1.3110271,0,0,1.3110271,-56.608062,-59.503068)" />
  <use
     style="fill:#4c4c4c;fill-opacity:1"
     xlink:href="#glyph0-9"
     x="158.57031"
     y="187.29395"
     id="use404"
     width="100%"
     height="100%"
     transform="matrix(1.3110271,0,0,1.3110271,-56.608062,-59.503068)" />
  <use
     style="fill:#4c4c4c;fill-opacity:1"
     xlink:href="#glyph0-23"
     x="163.57031"
     y="187.29395"
     id="use406"
     width="100%"
     height="100%"
     transform="matrix(1.3110271,0,0,1.3110271,-56.608062,-59.503068)" />
  <g
     style="clip-rule:nonzero"
     id="g502"
     clip-path="url(#clip12)"
     transform="translate(-130.19277,-4.5161138)">
    <path
       inkscape:connector-curvature="0"
       id="path500"
       d="m 333.07031,175.94922 h 134 V 5.480469 h -134 z m 0,0"
       style="fill:#ebebeb;fill-opacity:1;fill-rule:nonzero;stroke:none" />
  </g>
  <g
     style="clip-rule:nonzero"
     id="g506"
     clip-path="url(#clip13)"
     transform="translate(-130.19277,-4.5161138)">
    <path
       inkscape:connector-curvature="0"
       id="path504"
       d="m 333.07031,149.73047 h 134"
       style="fill:none;stroke:#ffffff;stroke-width:0.53348899;stroke-linecap:butt;stroke-linejoin:round;stroke-miterlimit:10;stroke-opacity:1" />
  </g>
  <g
     style="clip-rule:nonzero"
     id="g510"
     clip-path="url(#clip14)"
     transform="translate(-130.19277,-4.5161138)">
    <path
       inkscape:connector-curvature="0"
       id="path508"
       d="m 333.07031,112.78516 h 134"
       style="fill:none;stroke:#ffffff;stroke-width:0.53348899;stroke-linecap:butt;stroke-linejoin:round;stroke-miterlimit:10;stroke-opacity:1" />
  </g>
  <g
     style="clip-rule:nonzero"
     id="g514"
     clip-path="url(#clip15)"
     transform="translate(-130.19277,-4.5161138)">
    <path
       inkscape:connector-curvature="0"
       id="path512"
       d="m 333.07031,75.84375 h 134"
       style="fill:none;stroke:#ffffff;stroke-width:0.53348899;stroke-linecap:butt;stroke-linejoin:round;stroke-miterlimit:10;stroke-opacity:1" />
  </g>
  <g
     style="clip-rule:nonzero"
     id="g518"
     clip-path="url(#clip16)"
     transform="translate(-130.19277,-4.5161138)">
    <path
       inkscape:connector-curvature="0"
       id="path516"
       d="m 333.07031,38.898438 h 134"
       style="fill:none;stroke:#ffffff;stroke-width:0.53348899;stroke-linecap:butt;stroke-linejoin:round;stroke-miterlimit:10;stroke-opacity:1" />
  </g>
  <g
     style="clip-rule:nonzero"
     id="g522"
     clip-path="url(#clip17)"
     transform="translate(-130.19277,-4.5161138)">
    <path
       inkscape:connector-curvature="0"
       id="path520"
       d="m 333.07031,168.19922 h 134"
       style="fill:none;stroke:#ffffff;stroke-width:1.06697798;stroke-linecap:butt;stroke-linejoin:round;stroke-miterlimit:10;stroke-opacity:1" />
  </g>
  <g
     style="clip-rule:nonzero"
     id="g526"
     clip-path="url(#clip18)"
     transform="translate(-130.19277,-4.5161138)">
    <path
       inkscape:connector-curvature="0"
       id="path524"
       d="m 333.07031,131.25781 h 134"
       style="fill:none;stroke:#ffffff;stroke-width:1.06697798;stroke-linecap:butt;stroke-linejoin:round;stroke-miterlimit:10;stroke-opacity:1" />
  </g>
  <g
     style="clip-rule:nonzero"
     id="g530"
     clip-path="url(#clip19)"
     transform="translate(-130.19277,-4.5161138)">
    <path
       inkscape:connector-curvature="0"
       id="path528"
       d="m 333.07031,94.316406 h 134"
       style="fill:none;stroke:#ffffff;stroke-width:1.06697798;stroke-linecap:butt;stroke-linejoin:round;stroke-miterlimit:10;stroke-opacity:1" />
  </g>
  <g
     style="clip-rule:nonzero"
     id="g534"
     clip-path="url(#clip20)"
     transform="translate(-130.19277,-4.5161138)">
    <path
       inkscape:connector-curvature="0"
       id="path532"
       d="m 333.07031,57.371094 h 134"
       style="fill:none;stroke:#ffffff;stroke-width:1.06697798;stroke-linecap:butt;stroke-linejoin:round;stroke-miterlimit:10;stroke-opacity:1" />
  </g>
  <g
     style="clip-rule:nonzero"
     id="g538"
     clip-path="url(#clip21)"
     transform="translate(-130.19277,-4.5161138)">
    <path
       inkscape:connector-curvature="0"
       id="path536"
       d="m 333.07031,20.429688 h 134"
       style="fill:none;stroke:#ffffff;stroke-width:1.06697798;stroke-linecap:butt;stroke-linejoin:round;stroke-miterlimit:10;stroke-opacity:1" />
  </g>
  <g
     style="clip-rule:nonzero"
     id="g542"
     clip-path="url(#clip22)"
     transform="translate(-130.19277,-4.5161138)">
    <path
       inkscape:connector-curvature="0"
       id="path540"
       d="M 400.07031,175.94922 V 5.480469"
       style="fill:none;stroke:#ffffff;stroke-width:1.06697798;stroke-linecap:butt;stroke-linejoin:round;stroke-miterlimit:10;stroke-opacity:1" />
  </g>
  <path
     inkscape:connector-curvature="0"
     id="path544"
     d="m 269.87754,163.68311 h 50.25 V 8.7104482 h -50.25 z m 0,0"
     style="fill:#00bdc2;fill-opacity:1;fill-rule:nonzero;stroke:none" />
  <path
     inkscape:connector-curvature="0"
     id="path546"
     d="m 219.62754,163.68311 h 50.25 V 26.257324 h -50.25 z m 0,0"
     style="fill:#f8756b;fill-opacity:1;fill-rule:nonzero;stroke:none" />
  <g
     id="g550"
     style="fill:#4c4c4c;fill-opacity:1"
     transform="translate(-130.19277,-4.5161138)">
    <use
       height="100%"
       width="100%"
       id="use548"
       y="171.11426"
       x="323.14062"
       xlink:href="#glyph0-1" />
  </g>
  <g
     id="g562"
     style="fill:#4c4c4c;fill-opacity:1"
     transform="translate(-130.19277,-4.5161138)">
    <use
       height="100%"
       width="100%"
       id="use552"
       y="134.17285"
       x="303.14062"
       xlink:href="#glyph0-28" />
    <use
       height="100%"
       width="100%"
       id="use554"
       y="134.17285"
       x="308.14062"
       xlink:href="#glyph0-1" />
    <use
       height="100%"
       width="100%"
       id="use556"
       y="134.17285"
       x="313.14062"
       xlink:href="#glyph0-1" />
    <use
       height="100%"
       width="100%"
       id="use558"
       y="134.17285"
       x="318.14062"
       xlink:href="#glyph0-1" />
    <use
       height="100%"
       width="100%"
       id="use560"
       y="134.17285"
       x="323.14062"
       xlink:href="#glyph0-1" />
  </g>
  <g
     id="g574"
     style="fill:#4c4c4c;fill-opacity:1"
     transform="translate(-130.19277,-4.5161138)">
    <use
       height="100%"
       width="100%"
       id="use564"
       y="97.231445"
       x="303.14062"
       xlink:href="#glyph0-2" />
    <use
       height="100%"
       width="100%"
       id="use566"
       y="97.231445"
       x="308.14062"
       xlink:href="#glyph0-1" />
    <use
       height="100%"
       width="100%"
       id="use568"
       y="97.231445"
       x="313.14062"
       xlink:href="#glyph0-1" />
    <use
       height="100%"
       width="100%"
       id="use570"
       y="97.231445"
       x="318.14062"
       xlink:href="#glyph0-1" />
    <use
       height="100%"
       width="100%"
       id="use572"
       y="97.231445"
       x="323.14062"
       xlink:href="#glyph0-1" />
  </g>
  <g
     id="g586"
     style="fill:#4c4c4c;fill-opacity:1"
     transform="translate(-130.19277,-4.5161138)">
    <use
       height="100%"
       width="100%"
       id="use576"
       y="60.286133"
       x="303.14062"
       xlink:href="#glyph0-29" />
    <use
       height="100%"
       width="100%"
       id="use578"
       y="60.286133"
       x="308.14062"
       xlink:href="#glyph0-1" />
    <use
       height="100%"
       width="100%"
       id="use580"
       y="60.286133"
       x="313.14062"
       xlink:href="#glyph0-1" />
    <use
       height="100%"
       width="100%"
       id="use582"
       y="60.286133"
       x="318.14062"
       xlink:href="#glyph0-1" />
    <use
       height="100%"
       width="100%"
       id="use584"
       y="60.286133"
       x="323.14062"
       xlink:href="#glyph0-1" />
  </g>
  <g
     id="g598"
     style="fill:#4c4c4c;fill-opacity:1"
     transform="translate(-130.19277,-4.5161138)">
    <use
       height="100%"
       width="100%"
       id="use588"
       y="23.344727"
       x="303.14062"
       xlink:href="#glyph0-3" />
    <use
       height="100%"
       width="100%"
       id="use590"
       y="23.344727"
       x="308.14062"
       xlink:href="#glyph0-1" />
    <use
       height="100%"
       width="100%"
       id="use592"
       y="23.344727"
       x="313.14062"
       xlink:href="#glyph0-1" />
    <use
       height="100%"
       width="100%"
       id="use594"
       y="23.344727"
       x="318.14062"
       xlink:href="#glyph0-1" />
    <use
       height="100%"
       width="100%"
       id="use596"
       y="23.344727"
       x="323.14062"
       xlink:href="#glyph0-1" />
  </g>
  <path
     inkscape:connector-curvature="0"
     id="path600"
     d="m 200.13926,163.68311 h 2.73828"
     style="fill:none;stroke:#333333;stroke-width:1.06697798;stroke-linecap:butt;stroke-linejoin:round;stroke-miterlimit:10;stroke-opacity:1" />
  <path
     inkscape:connector-curvature="0"
     id="path602"
     d="m 200.13926,126.7417 h 2.73828"
     style="fill:none;stroke:#333333;stroke-width:1.06697798;stroke-linecap:butt;stroke-linejoin:round;stroke-miterlimit:10;stroke-opacity:1" />
  <path
     inkscape:connector-curvature="0"
     id="path604"
     d="m 200.13926,89.800292 h 2.73828"
     style="fill:none;stroke:#333333;stroke-width:1.06697798;stroke-linecap:butt;stroke-linejoin:round;stroke-miterlimit:10;stroke-opacity:1" />
  <path
     inkscape:connector-curvature="0"
     id="path606"
     d="m 200.13926,52.85498 h 2.73828"
     style="fill:none;stroke:#333333;stroke-width:1.06697798;stroke-linecap:butt;stroke-linejoin:round;stroke-miterlimit:10;stroke-opacity:1" />
  <path
     inkscape:connector-curvature="0"
     id="path608"
     d="m 200.13926,15.913574 h 2.73828"
     style="fill:none;stroke:#333333;stroke-width:1.06697798;stroke-linecap:butt;stroke-linejoin:round;stroke-miterlimit:10;stroke-opacity:1" />
  <path
     inkscape:connector-curvature="0"
     id="path610"
     d="m 269.87754,174.17139 v -2.73828"
     style="fill:none;stroke:#333333;stroke-width:1.06697798;stroke-linecap:butt;stroke-linejoin:round;stroke-miterlimit:10;stroke-opacity:1" />
  <g
     id="g646"
     style="fill:#4c4c4c;fill-opacity:1"
     transform="matrix(1.3110271,0,0,1.3110271,-254.56403,-60.767364)">
    <use
       height="100%"
       width="100%"
       id="use612"
       y="187.29395"
       x="363.07031"
       xlink:href="#glyph0-5" />
    <use
       height="100%"
       width="100%"
       id="use614"
       y="187.29395"
       x="369.07031"
       xlink:href="#glyph0-6" />
    <use
       height="100%"
       width="100%"
       id="use616"
       y="187.29395"
       x="374.07031"
       xlink:href="#glyph0-7" />
    <use
       height="100%"
       width="100%"
       id="use618"
       y="187.29395"
       x="381.07031"
       xlink:href="#glyph0-8" />
    <use
       height="100%"
       width="100%"
       id="use620"
       y="187.29395"
       x="386.07031"
       xlink:href="#glyph0-9" />
    <use
       height="100%"
       width="100%"
       id="use622"
       y="187.29395"
       x="391.07031"
       xlink:href="#glyph0-10" />
    <use
       height="100%"
       width="100%"
       id="use624"
       y="187.29395"
       x="394.07031"
       xlink:href="#glyph0-11" />
    <use
       height="100%"
       width="100%"
       id="use626"
       y="187.29395"
       x="396.07031"
       xlink:href="#glyph0-12" />
    <use
       height="100%"
       width="100%"
       id="use628"
       y="187.29395"
       x="401.07031"
       xlink:href="#glyph0-13" />
    <use
       height="100%"
       width="100%"
       id="use630"
       y="187.29395"
       x="403.07031"
       xlink:href="#glyph0-11" />
    <use
       height="100%"
       width="100%"
       id="use632"
       y="187.29395"
       x="405.07031"
       xlink:href="#glyph0-30" />
    <use
       height="100%"
       width="100%"
       id="use634"
       y="187.29395"
       x="411.07031"
       xlink:href="#glyph0-12" />
    <use
       height="100%"
       width="100%"
       id="use636"
       y="187.29395"
       x="416.07031"
       xlink:href="#glyph0-6" />
    <use
       height="100%"
       width="100%"
       id="use638"
       y="187.29395"
       x="421.07031"
       xlink:href="#glyph0-23" />
    <use
       height="100%"
       width="100%"
       id="use640"
       y="187.29395"
       x="425.07031"
       xlink:href="#glyph0-16" />
    <use
       height="100%"
       width="100%"
       id="use642"
       y="187.29395"
       x="427.07031"
       xlink:href="#glyph0-17" />
    <use
       height="100%"
       width="100%"
       id="use644"
       y="187.29395"
       x="432.07031"
       xlink:href="#glyph0-18" />
  </g>
  <g
     style="clip-rule:nonzero"
     id="g740"
     clip-path="url(#clip24)"
     transform="translate(326.50509,-212.67285)">
    <path
       inkscape:connector-curvature="0"
       id="path738"
       d="M 49.570312,385.44922 H 183.57031 V 214.98047 H 49.570312 Z m 0,0"
       style="fill:#ebebeb;fill-opacity:1;fill-rule:nonzero;stroke:none" />
  </g>
  <g
     style="clip-rule:nonzero"
     id="g744"
     clip-path="url(#clip25)"
     transform="translate(326.50509,-212.67285)">
    <path
       inkscape:connector-curvature="0"
       id="path742"
       d="M 49.570312,350.99219 H 183.57031"
       style="fill:none;stroke:#ffffff;stroke-width:0.53348899;stroke-linecap:butt;stroke-linejoin:round;stroke-miterlimit:10;stroke-opacity:1" />
  </g>
  <g
     style="clip-rule:nonzero"
     id="g748"
     clip-path="url(#clip26)"
     transform="translate(326.50509,-212.67285)">
    <path
       inkscape:connector-curvature="0"
       id="path746"
       d="M 49.570312,297.57812 H 183.57031"
       style="fill:none;stroke:#ffffff;stroke-width:0.53348899;stroke-linecap:butt;stroke-linejoin:round;stroke-miterlimit:10;stroke-opacity:1" />
  </g>
  <g
     style="clip-rule:nonzero"
     id="g752"
     clip-path="url(#clip27)"
     transform="translate(326.50509,-212.67285)">
    <path
       inkscape:connector-curvature="0"
       id="path750"
       d="M 49.570312,244.16406 H 183.57031"
       style="fill:none;stroke:#ffffff;stroke-width:0.53348899;stroke-linecap:butt;stroke-linejoin:round;stroke-miterlimit:10;stroke-opacity:1" />
  </g>
  <g
     style="clip-rule:nonzero"
     id="g756"
     clip-path="url(#clip28)"
     transform="translate(326.50509,-212.67285)">
    <path
       inkscape:connector-curvature="0"
       id="path754"
       d="M 49.570312,377.69922 H 183.57031"
       style="fill:none;stroke:#ffffff;stroke-width:1.06697798;stroke-linecap:butt;stroke-linejoin:round;stroke-miterlimit:10;stroke-opacity:1" />
  </g>
  <g
     style="clip-rule:nonzero"
     id="g760"
     clip-path="url(#clip29)"
     transform="translate(326.50509,-212.67285)">
    <path
       inkscape:connector-curvature="0"
       id="path758"
       d="M 49.570312,324.28516 H 183.57031"
       style="fill:none;stroke:#ffffff;stroke-width:1.06697798;stroke-linecap:butt;stroke-linejoin:round;stroke-miterlimit:10;stroke-opacity:1" />
  </g>
  <g
     style="clip-rule:nonzero"
     id="g764"
     clip-path="url(#clip30)"
     transform="translate(326.50509,-212.67285)">
    <path
       inkscape:connector-curvature="0"
       id="path762"
       d="M 49.570312,270.87109 H 183.57031"
       style="fill:none;stroke:#ffffff;stroke-width:1.06697798;stroke-linecap:butt;stroke-linejoin:round;stroke-miterlimit:10;stroke-opacity:1" />
  </g>
  <g
     style="clip-rule:nonzero"
     id="g768"
     clip-path="url(#clip31)"
     transform="translate(326.50509,-212.67285)">
    <path
       inkscape:connector-curvature="0"
       id="path766"
       d="M 49.570312,217.45703 H 183.57031"
       style="fill:none;stroke:#ffffff;stroke-width:1.06697798;stroke-linecap:butt;stroke-linejoin:round;stroke-miterlimit:10;stroke-opacity:1" />
  </g>
  <g
     style="clip-rule:nonzero"
     id="g772"
     clip-path="url(#clip32)"
     transform="translate(326.50509,-212.67285)">
    <path
       inkscape:connector-curvature="0"
       id="path770"
       d="M 116.57031,385.44922 V 214.98047"
       style="fill:none;stroke:#ffffff;stroke-width:1.06697798;stroke-linecap:butt;stroke-linejoin:round;stroke-miterlimit:10;stroke-opacity:1" />
  </g>
  <path
     inkscape:connector-curvature="0"
     id="path774"
     d="m 443.0754,165.02637 h 50.25 V 10.053706 h -50.25 z m 0,0"
     style="fill:#00bdc2;fill-opacity:1;fill-rule:nonzero;stroke:none" />
  <path
     inkscape:connector-curvature="0"
     id="path776"
     d="m 392.8254,165.02637 h 50.25 V 39.823236 h -50.25 z m 0,0"
     style="fill:#f8756b;fill-opacity:1;fill-rule:nonzero;stroke:none" />
  <g
     id="g788"
     style="fill:#4c4c4c;fill-opacity:1"
     transform="translate(326.50509,-212.67285)">
    <use
       height="100%"
       width="100%"
       id="use778"
       y="380.61426"
       x="19.640625"
       xlink:href="#glyph0-1" />
    <use
       height="100%"
       width="100%"
       id="use780"
       y="380.61426"
       x="24.640625"
       xlink:href="#glyph0-9" />
    <use
       height="100%"
       width="100%"
       id="use782"
       y="380.61426"
       x="29.640625"
       xlink:href="#glyph0-31" />
    <use
       height="100%"
       width="100%"
       id="use784"
       y="380.61426"
       x="34.640625"
       xlink:href="#glyph0-1" />
    <use
       height="100%"
       width="100%"
       id="use786"
       y="380.61426"
       x="39.640625"
       xlink:href="#glyph0-1" />
  </g>
  <g
     id="g800"
     style="fill:#4c4c4c;fill-opacity:1"
     transform="translate(326.50509,-212.67285)">
    <use
       height="100%"
       width="100%"
       id="use790"
       y="327.2002"
       x="19.640625"
       xlink:href="#glyph0-2" />
    <use
       height="100%"
       width="100%"
       id="use792"
       y="327.2002"
       x="24.640625"
       xlink:href="#glyph0-9" />
    <use
       height="100%"
       width="100%"
       id="use794"
       y="327.2002"
       x="29.640625"
       xlink:href="#glyph0-31" />
    <use
       height="100%"
       width="100%"
       id="use796"
       y="327.2002"
       x="34.640625"
       xlink:href="#glyph0-1" />
    <use
       height="100%"
       width="100%"
       id="use798"
       y="327.2002"
       x="39.640625"
       xlink:href="#glyph0-4" />
  </g>
  <g
     id="g812"
     style="fill:#4c4c4c;fill-opacity:1"
     transform="translate(326.50509,-212.67285)">
    <use
       height="100%"
       width="100%"
       id="use802"
       y="273.78613"
       x="19.640625"
       xlink:href="#glyph0-3" />
    <use
       height="100%"
       width="100%"
       id="use804"
       y="273.78613"
       x="24.640625"
       xlink:href="#glyph0-9" />
    <use
       height="100%"
       width="100%"
       id="use806"
       y="273.78613"
       x="29.640625"
       xlink:href="#glyph0-31" />
    <use
       height="100%"
       width="100%"
       id="use808"
       y="273.78613"
       x="34.640625"
       xlink:href="#glyph0-1" />
    <use
       height="100%"
       width="100%"
       id="use810"
       y="273.78613"
       x="39.640625"
       xlink:href="#glyph0-4" />
  </g>
  <g
     id="g824"
     style="fill:#4c4c4c;fill-opacity:1"
     transform="translate(326.50509,-212.67285)">
    <use
       height="100%"
       width="100%"
       id="use814"
       y="220.37207"
       x="19.640625"
       xlink:href="#glyph0-4" />
    <use
       height="100%"
       width="100%"
       id="use816"
       y="220.37207"
       x="24.640625"
       xlink:href="#glyph0-9" />
    <use
       height="100%"
       width="100%"
       id="use818"
       y="220.37207"
       x="29.640625"
       xlink:href="#glyph0-31" />
    <use
       height="100%"
       width="100%"
       id="use820"
       y="220.37207"
       x="34.640625"
       xlink:href="#glyph0-1" />
    <use
       height="100%"
       width="100%"
       id="use822"
       y="220.37207"
       x="39.640625"
       xlink:href="#glyph0-4" />
  </g>
  <path
     inkscape:connector-curvature="0"
     id="path826"
     d="m 373.33712,165.02637 h 2.73828"
     style="fill:none;stroke:#333333;stroke-width:1.06697798;stroke-linecap:butt;stroke-linejoin:round;stroke-miterlimit:10;stroke-opacity:1" />
  <path
     inkscape:connector-curvature="0"
     id="path828"
     d="m 373.33712,111.61231 h 2.73828"
     style="fill:none;stroke:#333333;stroke-width:1.06697798;stroke-linecap:butt;stroke-linejoin:round;stroke-miterlimit:10;stroke-opacity:1" />
  <path
     inkscape:connector-curvature="0"
     id="path830"
     d="m 373.33712,58.198236 h 2.73828"
     style="fill:none;stroke:#333333;stroke-width:1.06697798;stroke-linecap:butt;stroke-linejoin:round;stroke-miterlimit:10;stroke-opacity:1" />
  <path
     inkscape:connector-curvature="0"
     id="path832"
     d="m 373.33712,4.7841762 h 2.73828"
     style="fill:none;stroke:#333333;stroke-width:1.06697798;stroke-linecap:butt;stroke-linejoin:round;stroke-miterlimit:10;stroke-opacity:1" />
  <path
     inkscape:connector-curvature="0"
     id="path834"
     d="m 443.0754,175.51465 v -2.73828"
     style="fill:none;stroke:#333333;stroke-width:1.06697798;stroke-linecap:butt;stroke-linejoin:round;stroke-miterlimit:10;stroke-opacity:1" />
  <g
     id="g856"
     style="fill:#4c4c4c;fill-opacity:1"
     transform="matrix(1.3110271,0,0,1.3110271,289.9208,-334.32136)">
    <use
       height="100%"
       width="100%"
       id="use836"
       y="396.79395"
       x="96.570312"
       xlink:href="#glyph0-32" />
    <use
       height="100%"
       width="100%"
       id="use838"
       y="396.79395"
       x="101.57031"
       xlink:href="#glyph0-20" />
    <use
       height="100%"
       width="100%"
       id="use840"
       y="396.79395"
       x="103.57031"
       xlink:href="#glyph0-12" />
    <use
       height="100%"
       width="100%"
       id="use842"
       y="396.79395"
       x="108.57031"
       xlink:href="#glyph0-12" />
    <use
       height="100%"
       width="100%"
       id="use844"
       y="396.79395"
       x="113.57031"
       xlink:href="#glyph0-10" />
    <use
       height="100%"
       width="100%"
       id="use846"
       y="396.79395"
       x="116.57031"
       xlink:href="#glyph0-11" />
    <use
       height="100%"
       width="100%"
       id="use848"
       y="396.79395"
       x="118.57031"
       xlink:href="#glyph0-21" />
    <use
       height="100%"
       width="100%"
       id="use850"
       y="396.79395"
       x="123.57031"
       xlink:href="#glyph0-10" />
    <use
       height="100%"
       width="100%"
       id="use852"
       y="396.79395"
       x="126.57031"
       xlink:href="#glyph0-9" />
    <use
       height="100%"
       width="100%"
       id="use854"
       y="396.79395"
       x="131.57031"
       xlink:href="#glyph0-21" />
  </g>
  <g
     id="g2126"
     transform="translate(319.58578,-207.64404)">
    <g
       style="fill:#000000;fill-opacity:1"
       id="g912">
      <use
         xlink:href="#glyph1-6"
         x="200.00781"
         y="283.71387"
         id="use884"
         width="100%"
         height="100%" />
      <use
         xlink:href="#glyph1-7"
         x="206.00781"
         y="283.71387"
         id="use886"
         width="100%"
         height="100%" />
      <use
         xlink:href="#glyph1-4"
         x="212.00781"
         y="283.71387"
         id="use888"
         width="100%"
         height="100%" />
      <use
         xlink:href="#glyph1-8"
         x="214.00781"
         y="283.71387"
         id="use890"
         width="100%"
         height="100%" />
      <use
         xlink:href="#glyph1-9"
         x="216.00781"
         y="283.71387"
         id="use892"
         width="100%"
         height="100%" />
      <use
         xlink:href="#glyph1-4"
         x="222.00781"
         y="283.71387"
         id="use894"
         width="100%"
         height="100%" />
      <use
         xlink:href="#glyph1-10"
         x="224.00781"
         y="283.71387"
         id="use896"
         width="100%"
         height="100%" />
      <use
         xlink:href="#glyph1-11"
         x="230.00781"
         y="283.71387"
         id="use898"
         width="100%"
         height="100%" />
      <use
         xlink:href="#glyph1-12"
         x="236.00781"
         y="283.71387"
         id="use900"
         width="100%"
         height="100%" />
      <use
         xlink:href="#glyph1-2"
         x="243.00781"
         y="283.71387"
         id="use902"
         width="100%"
         height="100%" />
      <use
         xlink:href="#glyph1-7"
         x="249.00781"
         y="283.71387"
         id="use904"
         width="100%"
         height="100%" />
      <use
         xlink:href="#glyph1-13"
         x="255.00781"
         y="283.71387"
         id="use906"
         width="100%"
         height="100%" />
      <use
         xlink:href="#glyph1-5"
         x="259.00781"
         y="283.71387"
         id="use908"
         width="100%"
         height="100%" />
      <use
         xlink:href="#glyph1-14"
         x="265.00781"
         y="283.71387"
         id="use910"
         width="100%"
         height="100%" />
    </g>
    <path
       style="fill:#f0f0f0;fill-opacity:1;fill-rule:nonzero;stroke:none"
       d="m 200.00781,308.11328 h 17.28125 v -17.28125 h -17.28125 z m 0,0"
       id="path914"
       inkscape:connector-curvature="0" />
    <path
       style="fill:#f8756b;fill-opacity:1;fill-rule:nonzero;stroke:none"
       d="m 200.71484,307.40625 h 15.86328 v -15.86328 h -15.86328 z m 0,0"
       id="path916"
       inkscape:connector-curvature="0" />
    <path
       style="fill:#f0f0f0;fill-opacity:1;fill-rule:nonzero;stroke:none"
       d="m 200.00781,325.39453 h 17.28125 v -17.28125 h -17.28125 z m 0,0"
       id="path918"
       inkscape:connector-curvature="0" />
    <path
       style="fill:#00bdc2;fill-opacity:1;fill-rule:nonzero;stroke:none"
       d="m 200.71484,324.68359 h 15.86328 v -15.86328 h -15.86328 z m 0,0"
       id="path920"
       inkscape:connector-curvature="0" />
    <g
       style="fill:#000000;fill-opacity:1"
       id="g934">
      <use
         xlink:href="#glyph0-24"
         x="222.76562"
         y="302.3877"
         id="use922"
         width="100%"
         height="100%" />
      <use
         xlink:href="#glyph0-25"
         x="228.76562"
         y="302.3877"
         id="use924"
         width="100%"
         height="100%" />
      <use
         xlink:href="#glyph0-26"
         x="234.76562"
         y="302.3877"
         id="use926"
         width="100%"
         height="100%" />
      <use
         xlink:href="#glyph0-12"
         x="239.76562"
         y="302.3877"
         id="use928"
         width="100%"
         height="100%" />
      <use
         xlink:href="#glyph0-27"
         x="244.76562"
         y="302.3877"
         id="use930"
         width="100%"
         height="100%" />
      <use
         xlink:href="#glyph0-12"
         x="249.76562"
         y="302.3877"
         id="use932"
         width="100%"
         height="100%" />
    </g>
    <g
       style="fill:#000000;fill-opacity:1"
       id="g942">
      <use
         xlink:href="#glyph0-24"
         x="222.76562"
         y="319.66895"
         id="use936"
         width="100%"
         height="100%" />
      <use
         xlink:href="#glyph0-5"
         x="228.76562"
         y="319.66895"
         id="use938"
         width="100%"
         height="100%" />
      <use
         xlink:href="#glyph0-24"
         x="234.76562"
         y="319.66895"
         id="use940"
         width="100%"
         height="100%" />
    </g>
  </g>
</svg>
