<?xml version="1.0" encoding="utf-8"?>
<!-- Generator: Adobe Illustrator 16.0.0, SVG Export Plug-In . SVG Version: 6.00 Build 0)  -->
<!DOCTYPE svg PUBLIC "-//W3C//DTD SVG 1.1//EN" "http://www.w3.org/Graphics/SVG/1.1/DTD/svg11.dtd">
<svg version="1.1" id="Layer_1" xmlns="http://www.w3.org/2000/svg" xmlns:xlink="http://www.w3.org/1999/xlink" x="0px" y="0px"
	 width="439.369px" height="198.426px" viewBox="0 0 439.369 198.426" enable-background="new 0 0 439.369 198.426"
	 xml:space="preserve">
<g id="QZ7zeL.tif">
	<g>
		<path fill="none" d="M64.772,3.43c-1.059,1.333-1.847,2.059-2.307,2.952c-1.633,3.177-3.145,6.416-4.718,9.624
			c-3.697,7.534-7.371,15.081-11.115,22.593c-5.23,10.495-10.558,20.942-15.764,31.449c-3.73,7.526-7.274,15.146-11.003,22.674
			c-5.5,11.106-11.095,22.166-16.639,33.251c-1.158,2.316-0.811,3.021,1.723,3.062c4.915,0.081,9.832,0.014,14.748,0.036
			c1.998,0.01,3.292-0.987,4.105-2.718c1.976-4.2,4.141-8.328,5.829-12.642c1.017-2.599,2.559-3.193,5.107-3.185
			c20.498,0.065,40.997,0.038,61.495-0.022c1.758-0.006,2.774,0.667,3.542,2.165c2.652,5.178,5.41,10.303,8.052,15.485
			c3.622,7.107,7.177,14.248,10.758,21.376c0.899,1.792,2.231,2.768,4.351,2.735c4.831-0.073,9.666,0.014,14.498-0.045
			c2.68-0.032,3.006-0.837,1.737-3.225c-2.883-5.426-5.74-10.867-8.468-16.372c-1.345-2.714-0.85-3.492,2.058-3.609
			c2.078-0.083,2.617-1.027,2.607-3.018c-0.108-23.996-0.14-47.992-0.173-71.988c0-0.529,0.221-1.06,0.38-1.773
			c0.642,0.267,1.259,0.322,1.48,0.647c1.094,1.602,2.186,3.22,3.093,4.931c3.952,7.456,7.875,14.929,11.737,22.432
			c2.158,4.191,4.127,8.479,6.275,12.676c2.026,3.958,4.304,7.791,6.242,11.79c3.459,7.132,3.388,7.124,10.646,7.115
			c1.705-0.002,2.8-0.525,3.592-2.072c2.648-5.171,5.41-10.283,8.087-15.439c3.937-7.585,7.848-15.185,11.752-22.787
			c2.915-5.678,5.782-11.381,8.729-17.042c0.377-0.728,1.102-1.273,1.664-1.904c0.43,0.796,1.195,1.577,1.229,2.389
			c0.16,3.909,0.15,7.827,0.152,11.742c0,27.414,0.012,54.829-0.059,82.244c-0.006,2.293,0.898,3.239,3.043,3.25
			c4.082,0.02,8.166-0.012,12.248,0.041c2.197,0.028,2.859-1.051,2.822-3.122c-0.1-5.414-0.061-10.832-0.062-16.248
			c0-3.5,0.303-3.789,3.891-3.802c2.918-0.011,5.834-0.005,8.75-0.026c1.777-0.014,2.766-0.747,2.758-2.716
			c-0.105-24.079-0.178-48.158-0.244-72.238c-0.004-0.837,0.145-1.676,0.275-3.069c1.383,1.494,2.584,2.372,3.221,3.555
			c2.361,4.374,4.537,8.847,6.777,13.285c2.242,4.446,4.438,8.917,6.727,13.339c3.271,6.316,6.621,12.593,9.918,18.895
			c1.611,3.078,3.004,6.291,4.865,9.208c0.723,1.134,2.377,1.919,3.764,2.317c1.389,0.399,3.027,0.366,4.455,0.058
			c1.16-0.25,2.492-0.95,3.182-1.874c1.271-1.707,2.158-3.709,3.152-5.615c3.957-7.573,7.893-15.157,11.836-22.737
			c2.488-4.785,5.004-9.558,7.459-14.361c2.225-4.355,4.361-8.757,6.596-13.107c0.367-0.715,1.031-1.275,1.559-1.908
			c0.355,0.768,0.988,1.524,1.02,2.304c0.15,3.821,0.184,7.647,0.184,11.472c-0.004,27.832-0.014,55.663-0.061,83.494
			c-0.004,2.037,0.846,2.9,2.822,2.892c4.166-0.019,8.332-0.049,12.498,0.027c2.242,0.041,3.133-0.896,3.096-3.145
			c-0.09-5.415-0.041-10.832-0.041-16.248c0-3.523,0.27-3.795,3.875-3.796c13.582-0.004,27.166,0.002,40.748,0.003
			c8.193,0,16.109-1.006,23.938-3.928c13.941-5.202,22.637-15.033,27.264-28.772c1.311-3.896,1.973-8.033,2.688-12.104
			c2.754-15.699,2.199-31.088-4.408-45.919c-4.764-10.696-12.668-17.916-23.635-21.84c-2.412-0.863-4.871-1.612-7.342-2.29
			c-2.297-0.63-4.635-1.529-6.965-1.562c-23.74-0.336-47.484-0.477-71.227-0.803c-2.779-0.039-4.117,1.357-5.174,3.463
			c-3.16,6.29-6.215,12.634-9.441,18.89c-3.764,7.3-7.723,14.499-11.488,21.797c-4.26,8.252-8.402,16.563-12.588,24.853
			c-1.037,2.052-2.115,2.182-3.338,0.133c-1.486-2.489-2.729-5.126-4.068-7.702c-4.371-8.408-8.756-16.808-13.102-25.229
			c-5.834-11.31-11.656-22.626-17.426-33.97c-0.85-1.672-2.125-2.207-3.834-2.205c-9.332,0.011-18.664,0.027-27.998,0.011
			c-1.719-0.003-3.041,0.471-3.9,2.108c-3.266,6.23-6.658,12.396-9.876,18.651c-3.79,7.365-7.431,14.808-11.168,22.2
			c-4.561,9.021-9.146,18.029-13.76,27.023c-0.271,0.527-0.871,1.183-1.358,1.217c-0.48,0.034-1.213-0.534-1.486-1.03
			c-1.483-2.685-2.879-5.418-4.266-8.154c-3.717-7.337-7.376-14.702-11.125-22.021c-5.986-11.684-12.048-23.329-18.031-35.014
			c-1.7-3.322-3.745-5.664-8.044-5.061c-2.778,0.39-5.655,0.073-8.488,0.07c-3.459-0.003-3.896,0.427-3.896,3.867
			c0,25.415-0.005,50.829,0.015,76.244c0.002,3.248,0.199,6.495,0.166,9.741c-0.007,0.705-0.615,1.403-0.946,2.105
			c-0.529-0.441-1.256-0.776-1.558-1.339c-2.738-5.104-5.431-10.232-8.08-15.383c-4.896-9.517-9.774-19.042-14.622-28.584
			c-5.722-11.263-11.392-22.553-17.105-33.819C72.167,17.849,68.638,10.991,64.772,3.43z M81.545,164.85
			c-1.704-0.193-2.881,0.507-3.62,2.566c-1.282,3.568-3.004,6.977-4.463,10.484c-1.777,4.272-3.53,8.557-5.152,12.888
			c-0.295,0.789,0.091,1.833,0.162,2.759c1.21-0.32,2.757-0.291,3.541-1.05c0.938-0.908,1.25-2.479,1.783-3.782
			c2.136-5.218,4.235-10.45,6.402-15.654c0.193-0.463,0.889-1.139,1.155-1.059c0.529,0.157,1.029,0.705,1.35,1.213
			c0.662,1.047,1.181,2.182,1.789,3.264c2.162,3.846,1.899,4.156-2.359,5.085c-1.168,0.255-2.044,1.851-3.054,2.831
			c0.995,0.35,1.971,0.791,2.993,1.018c0.713,0.158,1.493-0.003,2.241,0.021c2.472,0.083,4.27,1.008,5.076,3.589
			c0.414,1.323,1.021,2.86,2.044,3.637c0.924,0.702,2.532,0.573,3.845,0.619c0.215,0.008,0.776-1.081,0.644-1.487
			c-0.563-1.717-1.306-3.378-2.024-5.041c-2.665-6.178-5.296-12.37-8.056-18.505C85.087,166.567,84.36,164.558,81.545,164.85z
			 M282.986,179.266c0,1.916,0.004,3.833,0,5.75c-0.004,1.916,0.02,3.833-0.031,5.748c-0.045,1.653,0.066,3.078,2.316,2.902
			c1.947-0.152,3.104-0.861,2.947-3.103c-0.186-2.655-0.035-5.335-0.23-7.989c-0.365-5.014,2.893-6.183,7.402-5.794
			c0.764,0.065,1.82,1.018,2.051,1.772c0.236,0.767-0.098,2.107-0.686,2.642c-1.062,0.962-2.553,1.433-3.758,2.262
			c-0.607,0.417-1.508,1.542-1.385,1.715c1.961,2.766,3.881,5.61,6.25,8.001c0.688,0.693,2.754,0.02,4.186-0.027
			c-0.438-0.986-0.855-1.982-1.324-2.955c-0.141-0.29-0.414-0.518-0.631-0.77c-2.559-2.967-2.545-3.179,0.381-5.678
			c2.918-2.49,3.049-5.979,0.605-8.959c-1.885-2.298-4.393-1.709-6.689-1.73c-5.814-0.053-5.891,0.051-6.18-5.756
			c-0.115-2.34-1.609-2.371-3.24-2.471c-1.809-0.111-1.998,1.06-1.992,2.441C282.992,171.267,282.982,175.266,282.986,179.266z
			 M241.553,184.363c1.857,2.496,3.807,4.915,5.518,7.492c1.041,1.568,2.424,1.932,4.061,1.823c0.604-0.04,1.57-0.315,1.684-0.69
			c0.176-0.583-0.064-1.461-0.438-2.004c-0.789-1.154-2.037-2.057-2.59-3.289c-0.361-0.801-0.01-2.078,0.375-2.996
			c0.248-0.596,1.152-0.9,1.723-1.382c2.043-1.72,2.086-4.187,1.252-6.179c-0.672-1.602-2.426-3.477-4-3.812
			c-2.586-0.549-5.451-0.175-8.129,0.247c-1.873,0.294-2.531-0.346-2.617-1.941c-0.08-1.492,0.016-2.994,0.062-4.49
			c0.062-1.873-0.855-2.505-2.65-2.303c-1.936,0.218-2.408,1.365-2.396,3.104c0.055,7.653,0.094,15.31,0.037,22.963
			c-0.018,2.175,1.158,2.737,2.961,2.775c1.877,0.039,2.109-1.184,2.074-2.679c-0.07-2.91-0.201-5.826-0.09-8.73
			c0.17-4.396,4.908-7.199,8.812-5.188c0.82,0.423,1.568,1.533,1.75,2.446c0.111,0.57-0.752,1.62-1.432,2.008
			C245.756,182.543,243.854,183.299,241.553,184.363z M356.572,178.936c0,3.574,0.098,7.152-0.033,10.721
			c-0.094,2.576,1.074,3.655,3.512,3.719c2.324,0.061,4.652,0.291,6.973,0.235c6.354-0.151,9.686-3.954,9.65-10.754
			c-0.027-5.371-3.025-10.273-9.771-9.878c-5.447,0.32-5.465,0.066-5.533-5.351c-0.018-1.377,0.035-2.795-1.932-2.804
			c-1.92-0.01-2.902,0.873-2.873,2.891C356.615,171.455,356.578,175.195,356.572,178.936z M195.832,192.791
			c-0.782-1.061-1.501-2.154-2.34-3.147c-2.66-3.147-2.651-3.537,0.409-6.118c3.029-2.555,3.163-5.668,0.5-8.604
			c-2.239-2.468-5.175-1.926-7.918-1.883c-5.37,0.084-5.369,0.182-5.471-5.053c-0.003-0.167-0.013-0.334-0.008-0.5
			c0.048-1.737-0.774-2.647-2.534-2.67c-1.775-0.021-2.244,1.031-2.233,2.594c0.051,7.82,0.079,15.639,0.097,23.459
			c0.003,1.586,0.3,2.859,2.291,2.788c1.815-0.065,2.443-1.11,2.406-2.792c-0.062-2.742-0.151-5.487-0.103-8.229
			c0.081-4.586,3.441-7.123,7.872-5.781c0.973,0.295,2.06,1.508,2.298,2.491c0.167,0.688-0.876,1.87-1.64,2.53
			c-0.785,0.678-1.855,1.076-2.857,1.443c-1.966,0.721-2.345,1.608-1.17,3.275c1.291,1.83,2.614,3.641,3.987,5.41
			C190.887,193.896,193.28,194.223,195.832,192.791z M165.943,184.951c0,0.019,0,0.037,0,0.057c1.331,0,2.662,0.025,3.992-0.006
			c2.729-0.062,3.541-0.948,3.435-3.688c-0.263-6.77-8.978-11.106-14.945-7.288c-5.749,3.68-6.726,11.625-1.583,17.019
			c2.197,2.304,11.236,3.798,13.973,2.245c0.608-0.346,1.091-1.482,1.041-2.215c-0.031-0.478-1.104-1.212-1.752-1.262
			c-1.983-0.149-4.01,0.162-5.977-0.07c-1.318-0.157-2.661-0.781-3.8-1.502c-0.534-0.338-0.982-1.518-0.792-2.09
			c0.184-0.552,1.212-1.064,1.922-1.147C162.934,184.83,164.446,184.951,165.943,184.951z M28.3,185.008c0-0.004,0-0.009,0-0.014
			c1.166,0,2.332-0.008,3.498,0.002c3.265,0.03,4.249-1.077,3.756-4.238c-1.017-6.508-8.067-10.066-14.011-7.141
			c-6.643,3.271-7.144,13.191-2.005,17.621c3.984,3.434,8.788,2.361,13.378,2.125c0.479-0.024,1.271-1.361,1.216-2.031
			c-0.048-0.566-1.079-1.432-1.737-1.492c-1.979-0.182-4.015,0.158-5.98-0.084c-1.314-0.163-2.628-0.844-3.781-1.555
			c-0.479-0.295-0.916-1.449-0.704-1.891c0.287-0.597,1.185-1.158,1.882-1.246C25.286,184.879,26.801,185.008,28.3,185.008z
			 M223.697,184.972c0,0.021,0,0.041,0,0.062c1.5,0,3.029,0.178,4.486-0.07c0.793-0.136,1.895-0.859,2.113-1.553
			c0.93-2.929-0.811-7.68-3.186-9.37c-1.992-1.419-9.094-1.287-11.105,0.025c-4.316,2.815-4.66,6.956-4.076,11.474
			c0.615,4.748,3.109,7.395,7.857,7.885c2.639,0.271,5.322,0.105,7.984,0.133c1.426,0.014,2.197-0.682,2.168-2.127
			c-0.031-1.675-1.189-1.711-2.453-1.686c-2.164,0.046-4.352,0.191-6.488-0.055c-1.117-0.129-2.404-0.764-3.166-1.586
			c-1.51-1.627-0.893-2.918,1.369-3.107C220.689,184.87,222.199,184.972,223.697,184.972z M406.768,185.098
			c7.184-0.142,7.49-0.469,6.357-6.9c-0.477-2.703-2.912-4.984-5.658-5.102c-1.992-0.084-4-0.041-5.984,0.119
			c-2.312,0.186-6.043,3.613-6.207,5.807c-0.18,2.397-0.17,4.822-0.049,7.227c0.162,3.284,2.127,5.814,5.045,6.461
			c3.57,0.79,7.387,0.559,11.096,0.529c0.547-0.004,1.082-1.33,1.623-2.045c-0.67-0.469-1.312-1.285-2.018-1.342
			c-2.232-0.178-4.525,0.166-6.723-0.164c-1.326-0.199-2.727-1.06-3.727-2.01c-1.301-1.238-0.654-2.365,1.01-2.539
			C403.26,184.957,405.021,185.098,406.768,185.098z M423.162,189.965c0-0.021,0-0.043-0.002-0.064
			c-0.996-0.069-2.037-0.346-2.977-0.148c-0.906,0.19-1.711,0.869-2.559,1.334c0.646,0.749,1.266,2.113,1.945,2.145
			c3.629,0.168,7.326,0.363,10.896-0.159c2.924-0.429,4.104-3.415,3.605-7.243c-0.314-2.43-2.453-4.289-5.176-4.43
			c-1.412-0.072-2.832-0.074-4.246-0.05c-1.715,0.029-3.047-0.489-3.098-2.425c-0.047-1.88,1.428-2.386,2.889-2.422
			c2.068-0.051,4.156,0.351,6.215,0.217c0.912-0.059,1.771-0.955,2.654-1.471c-0.785-0.711-1.523-1.963-2.365-2.037
			c-3.053-0.269-6.158-0.346-9.213-0.111c-3.301,0.254-5.215,3.086-5.045,6.854c0.15,3.35,1.875,5.004,5.455,5.173
			c1.498,0.071,3.115-0.278,4.459,0.19c0.98,0.342,2.07,1.615,2.279,2.643c0.316,1.559-1.062,2.022-2.471,2.008
			C425.328,189.957,424.246,189.965,423.162,189.965z M312.682,189.828c-0.436-0.035-1.385-0.295-2.25-0.129
			c-0.885,0.17-1.691,0.758-2.531,1.163c0.676,0.779,1.293,2.165,2.035,2.233c3.451,0.322,6.971,0.615,10.4,0.271
			c3.256-0.327,4.738-3.019,4.424-6.706c-0.293-3.418-1.998-5.105-5.393-5.277c-1.66-0.084-3.395,0.171-4.955-0.25
			c-0.963-0.26-1.66-1.505-2.477-2.307c0.766-0.732,1.48-2.015,2.309-2.093c2.367-0.224,4.783,0,7.176,0.134
			c1.09,0.061,2.293,0.473,2.484-1.158c0.17-1.469-0.459-2.463-2.053-2.494c-3.148-0.061-6.314-0.266-9.443-0.031
			c-3.342,0.25-5.016,2.844-4.809,6.785c0.195,3.703,1.498,4.982,5.293,5.15c1.494,0.065,3.09-0.229,4.455,0.211
			c1.027,0.332,2.27,1.451,2.508,2.438c0.383,1.588-1.139,1.982-2.457,2.045C315.988,189.879,314.572,189.828,312.682,189.828z
			 M44.571,189.783c-0.001,0.03-0.001,0.061-0.001,0.092c-0.997-0.057-2.027-0.293-2.982-0.117
			c-0.888,0.164-1.695,0.766-2.539,1.174c0.692,0.752,1.328,2.082,2.087,2.156c3.37,0.33,6.807,0.625,10.159,0.305
			c3.25-0.309,4.634-2.973,4.324-6.998c-0.25-3.238-1.97-4.865-5.341-5.017c-1.496-0.067-3.078,0.198-4.463-0.216
			c-1.085-0.325-1.927-1.463-2.877-2.238c0.913-0.787,1.764-2.139,2.752-2.248c2.275-0.252,4.619,0.189,6.932,0.156
			c0.779-0.012,2.075-0.455,2.223-0.965c0.373-1.293-0.107-2.535-1.803-2.594c-3.066-0.105-6.148-0.362-9.2-0.168
			c-3.926,0.25-5.234,2.246-5.053,6.959c0.149,3.895,1.263,4.92,5.482,5.072c1.578,0.058,3.239-0.141,4.698,0.311
			c0.85,0.262,1.727,1.514,1.898,2.447c0.09,0.487-1.239,1.613-2.075,1.806C47.45,190.01,45.984,189.783,44.571,189.783z
			 M132.073,189.832c0,0.012,0,0.025,0,0.037c-1.08-0.047-2.195-0.279-3.229-0.082c-0.821,0.157-1.543,0.841-2.309,1.291
			c0.576,0.674,1.109,1.883,1.737,1.934c3.531,0.289,7.123,0.662,10.62,0.296c3.048-0.319,4.599-3.257,4.252-6.599
			c-0.334-3.213-2.34-5.178-5.477-5.324c-1.411-0.066-2.829-0.014-4.236-0.121c-1.48-0.113-2.935-0.504-2.975-2.35
			c-0.041-1.902,1.526-2.33,2.931-2.377c2.144-0.07,4.301,0.158,6.447,0.322c1.043,0.08,2.276,0.688,2.467-1.051
			c0.157-1.438-0.333-2.475-1.99-2.518c-3.062-0.08-6.135-0.328-9.186-0.175c-3.414,0.171-5.351,2.806-5.21,6.577
			c0.142,3.773,1.595,5.262,5.353,5.429c1.411,0.062,2.933-0.266,4.204,0.169c1.04,0.355,1.785,1.578,2.661,2.416
			c-0.857,0.708-1.614,1.709-2.599,2.045C134.494,190.107,133.236,189.832,132.073,189.832z M258.252,180.08
			c-0.004,0-0.01,0-0.014,0c0,2.495-0.045,4.99,0.01,7.484c0.105,4.676,3.018,7.012,7.568,5.992
			c0.646-0.145,1.574-0.958,1.596-1.494c0.029-0.709-0.604-1.987-1.129-2.087c-2.916-0.552-3.102-2.601-3.068-4.89
			c0.023-1.58,0.059-3.161,0.018-4.74c-0.055-2.059,0.428-3.551,2.861-3.883c0.574-0.077,1.312-1.205,1.383-1.91
			c0.047-0.454-0.936-1.087-1.543-1.518c-1.146-0.812-2.342-1.555-3.541-2.288c-0.846-0.518-1.875-1.495-2.559-1.308
			c-0.695,0.191-1.449,1.53-1.512,2.414C258.129,174.584,258.252,177.337,258.252,180.08z M112.25,180.252c-0.004,0-0.009,0-0.014,0
			c0,2.412-0.016,4.825,0.004,7.238c0.039,4.979,2.037,6.771,6.999,6.076c0.783-0.109,1.455-1.014,2.179-1.55
			c-0.587-0.738-1.046-1.911-1.785-2.128c-1.781-0.521-2.44-1.614-2.474-3.27c-0.044-2.246-0.004-4.492-0.03-6.738
			c-0.021-1.818,0.661-2.947,2.583-3.389c0.683-0.157,1.185-1.097,1.77-1.679c-0.651-0.593-1.257-1.251-1.966-1.766
			c-1.218-0.886-2.496-1.687-3.755-2.514c-0.757-0.497-1.524-0.979-2.286-1.469c-0.408,0.817-1.126,1.618-1.168,2.453
			C112.161,174.424,112.25,177.34,112.25,180.252z M10.796,179.504c-0.003,0-0.006,0-0.009,0c0-4.07-0.032-8.141,0.015-12.211
			c0.021-1.872-0.94-2.424-2.641-2.454c-1.793-0.031-2.571,0.695-2.563,2.503c0.032,7.893,0.027,15.785-0.002,23.677
			c-0.007,1.741,0.673,2.642,2.492,2.626c1.813-0.016,2.767-0.707,2.729-2.676C10.745,187.148,10.796,183.326,10.796,179.504z
			 M340.391,179.498c0-3.997-0.012-7.994,0.008-11.99c0.006-1.601-0.295-2.774-2.326-2.708c-1.83,0.06-2.732,0.69-2.717,2.669
			c0.059,7.827,0.057,15.654,0,23.482c-0.016,1.953,0.859,2.672,2.693,2.728c1.963,0.061,2.377-1.029,2.359-2.689
			C340.367,187.159,340.395,183.328,340.391,179.498z M201.225,179.276c-0.004,0-0.01,0-0.014,0c0,3.823,0.016,7.647-0.01,11.472
			c-0.01,1.438,0.119,2.767,1.941,2.879c1.859,0.114,2.461-1.041,2.459-2.691c-0.008-7.811-0.016-15.621-0.027-23.432
			c-0.004-1.501-0.479-2.66-2.234-2.667c-1.836-0.007-2.117,1.258-2.115,2.719C201.227,171.463,201.225,175.369,201.225,179.276z
			 M98.333,182.014c0.085,0,0.17,0,0.254,0c0,2.99-0.022,5.98,0.009,8.969c0.018,1.653,0.76,2.72,2.564,2.667
			c1.815-0.053,2.097-1.303,2.086-2.767c-0.015-1.913,0.103-3.834-0.034-5.736c-0.274-3.848,0.319-7.107,4.487-8.721
			c0.488-0.188,0.483-1.652,0.708-2.524c-0.817-0.133-2.005-0.673-2.385-0.327c-1.435,1.309-2.49,0.896-3.958,0.023
			c-2.272-1.35-3.724-0.305-3.73,2.429C98.33,178.022,98.333,180.018,98.333,182.014z M380.975,183.123c0.008,0,0.018,0,0.027,0
			c0,2.662,0.031,5.326-0.012,7.988c-0.025,1.578,0.426,2.588,2.242,2.523c1.707-0.061,2.629-0.77,2.594-2.588
			c-0.051-2.496,0.102-5-0.049-7.487c-0.186-3.059,0.695-5.29,3.652-6.687c0.705-0.334,0.854-1.848,1.256-2.818
			c-0.953-0.143-2.117-0.697-2.816-0.34c-1.42,0.723-2.461,1.072-3.779-0.185c-0.461-0.438-1.707-0.571-2.246-0.253
			c-0.523,0.309-0.805,1.367-0.832,2.109C380.914,177.962,380.975,180.543,380.975,183.123z M272.365,182.999
			c0.006,0,0.012,0,0.016,0c0,2.826-0.008,5.652,0.004,8.479c0.006,1.402,0.76,2.427,2.119,2.078c0.979-0.251,2.473-1.276,2.5-2.003
			c0.207-5.478,0.129-10.967,0.094-16.453c-0.012-1.711-1.279-1.924-2.615-1.949c-1.438-0.028-2.139,0.652-2.123,2.119
			C272.385,177.846,272.365,180.422,272.365,182.999z M350.85,183.369c0.01,0,0.02,0,0.029,0c0-2.571-0.043-5.145,0.016-7.714
			c0.031-1.421-0.199-2.499-1.934-2.509c-1.502-0.009-2.695,0.422-2.709,2.17c-0.039,5.309-0.045,10.618-0.016,15.927
			c0.01,1.649,1.068,2.358,2.604,2.365c1.684,0.009,2.018-1.134,2.012-2.524C350.844,188.512,350.85,185.94,350.85,183.369z
			 M274.646,169.549c1.109-1.311,1.801-2.129,2.494-2.947c-0.865-0.581-1.666-1.463-2.613-1.668
			c-1.295-0.282-2.445,0.501-2.158,1.955C272.523,167.672,273.523,168.289,274.646,169.549z M348.787,169.52
			c1.014-1.258,1.951-1.906,2.072-2.681c0.217-1.396-0.838-2.251-2.158-1.916c-0.945,0.24-1.727,1.134-2.58,1.736
			C346.861,167.453,347.602,168.248,348.787,169.52z"/>
		<path fill-rule="evenodd" clip-rule="evenodd" d="M64.772,3.43c3.866,7.562,7.395,14.419,10.882,21.297
			c5.714,11.267,11.384,22.557,17.105,33.819c4.848,9.542,9.727,19.067,14.622,28.584c2.649,5.15,5.342,10.279,8.08,15.383
			c0.302,0.562,1.028,0.897,1.558,1.339c0.331-0.702,0.939-1.4,0.946-2.105c0.033-3.246-0.164-6.493-0.166-9.741
			c-0.02-25.415-0.015-50.829-0.015-76.244c-0.001-3.44,0.437-3.87,3.896-3.867c2.833,0.003,5.71,0.319,8.488-0.07
			c4.299-0.604,6.344,1.738,8.044,5.061c5.983,11.685,12.045,23.33,18.031,35.014c3.749,7.319,7.408,14.685,11.125,22.021
			c1.387,2.736,2.782,5.47,4.266,8.154c0.273,0.496,1.006,1.064,1.486,1.03c0.487-0.034,1.088-0.689,1.358-1.217
			c4.614-8.994,9.199-18.003,13.76-27.023c3.737-7.393,7.378-14.835,11.168-22.2c3.218-6.255,6.611-12.421,9.876-18.651
			c0.859-1.638,2.182-2.111,3.9-2.108c9.334,0.017,18.666,0,27.998-0.011c1.709-0.002,2.984,0.533,3.834,2.205
			c5.77,11.344,11.592,22.66,17.426,33.97c4.346,8.421,8.73,16.82,13.102,25.229c1.34,2.576,2.582,5.213,4.068,7.702
			c1.223,2.049,2.301,1.919,3.338-0.133c4.186-8.289,8.328-16.601,12.588-24.853c3.766-7.298,7.725-14.497,11.488-21.797
			c3.227-6.256,6.281-12.6,9.441-18.89c1.057-2.105,2.395-3.502,5.174-3.463c23.742,0.326,47.486,0.467,71.227,0.803
			c2.33,0.033,4.668,0.933,6.965,1.562c2.471,0.678,4.93,1.427,7.342,2.29c10.967,3.924,18.871,11.144,23.635,21.84
			c6.607,14.831,7.162,30.22,4.408,45.919c-0.715,4.07-1.377,8.208-2.688,12.104c-4.627,13.739-13.322,23.57-27.264,28.772
			c-7.828,2.922-15.744,3.928-23.938,3.928c-13.582-0.001-27.166-0.007-40.748-0.003c-3.605,0.001-3.875,0.272-3.875,3.796
			c0,5.416-0.049,10.833,0.041,16.248c0.037,2.248-0.854,3.186-3.096,3.145c-4.166-0.076-8.332-0.046-12.498-0.027
			c-1.977,0.009-2.826-0.854-2.822-2.892c0.047-27.831,0.057-55.662,0.061-83.494c0-3.824-0.033-7.65-0.184-11.472
			c-0.031-0.779-0.664-1.536-1.02-2.304c-0.527,0.633-1.191,1.193-1.559,1.908c-2.234,4.351-4.371,8.752-6.596,13.107
			c-2.455,4.804-4.971,9.576-7.459,14.361c-3.943,7.58-7.879,15.164-11.836,22.737c-0.994,1.906-1.881,3.908-3.152,5.615
			c-0.689,0.924-2.021,1.624-3.182,1.874c-1.428,0.309-3.066,0.342-4.455-0.058c-1.387-0.398-3.041-1.184-3.764-2.317
			c-1.861-2.917-3.254-6.13-4.865-9.208c-3.297-6.302-6.646-12.578-9.918-18.895c-2.289-4.422-4.484-8.893-6.727-13.339
			c-2.24-4.438-4.416-8.911-6.777-13.285c-0.637-1.183-1.838-2.061-3.221-3.555c-0.131,1.394-0.279,2.232-0.275,3.069
			c0.066,24.08,0.139,48.159,0.244,72.238c0.008,1.969-0.98,2.702-2.758,2.716c-2.916,0.021-5.832,0.016-8.75,0.026
			c-3.588,0.013-3.891,0.302-3.891,3.802c0.002,5.416-0.037,10.834,0.062,16.248c0.037,2.071-0.625,3.15-2.822,3.122
			c-4.082-0.053-8.166-0.021-12.248-0.041c-2.145-0.011-3.049-0.957-3.043-3.25c0.07-27.415,0.059-54.83,0.059-82.244
			c-0.002-3.915,0.008-7.833-0.152-11.742c-0.033-0.812-0.799-1.593-1.229-2.389c-0.562,0.631-1.287,1.177-1.664,1.904
			c-2.947,5.661-5.814,11.364-8.729,17.042c-3.904,7.603-7.815,15.202-11.752,22.787c-2.677,5.156-5.438,10.269-8.087,15.439
			c-0.792,1.547-1.887,2.07-3.592,2.072c-7.259,0.009-7.188,0.017-10.646-7.115c-1.938-3.999-4.216-7.832-6.242-11.79
			c-2.148-4.196-4.117-8.484-6.275-12.676c-3.862-7.503-7.785-14.976-11.737-22.432c-0.907-1.711-1.999-3.329-3.093-4.931
			c-0.222-0.325-0.839-0.381-1.48-0.647c-0.159,0.714-0.38,1.244-0.38,1.773c0.033,23.996,0.064,47.992,0.173,71.988
			c0.01,1.99-0.529,2.935-2.607,3.018c-2.907,0.117-3.402,0.896-2.058,3.609c2.728,5.505,5.585,10.946,8.468,16.372
			c1.269,2.388,0.942,3.192-1.737,3.225c-4.832,0.059-9.667-0.028-14.498,0.045c-2.119,0.032-3.451-0.943-4.351-2.735
			c-3.581-7.128-7.136-14.269-10.758-21.376c-2.642-5.183-5.399-10.308-8.052-15.485c-0.768-1.498-1.784-2.171-3.542-2.165
			c-20.498,0.061-40.997,0.088-61.495,0.022c-2.549-0.009-4.091,0.586-5.107,3.185c-1.688,4.313-3.854,8.441-5.829,12.642
			c-0.813,1.73-2.107,2.728-4.105,2.718c-4.916-0.022-9.833,0.045-14.748-0.036c-2.533-0.041-2.881-0.745-1.723-3.062
			c5.544-11.085,11.139-22.145,16.639-33.251c3.729-7.528,7.272-15.147,11.003-22.674c5.206-10.507,10.533-20.954,15.764-31.449
			c3.744-7.512,7.418-15.059,11.115-22.593c1.573-3.208,3.085-6.447,4.718-9.624C62.925,5.488,63.713,4.763,64.772,3.43z
			 M324.121,98.053c0,15.083-0.014,30.166,0.01,45.249c0.006,2.831,0.688,3.472,3.336,3.495c2.623,0.023,3.318-0.646,3.357-3.47
			c0.047-3.499,0.002-7,0.01-10.5c0.014-6.521,2.598-9.128,9.074-9.13c13.332-0.005,26.666-0.014,39.998,0.008
			c7.295,0.012,14.453-0.78,21.422-3.09c11.59-3.843,20.09-11.181,24.559-22.561c6.488-16.522,6.77-33.557,2.395-50.575
			c-3-11.663-10.127-20.284-21.363-25.208c-7.594-3.327-15.619-4.958-23.811-5.061c-19.414-0.24-38.832-0.075-58.248-0.122
			c-2.074-0.005-3.436,0.738-4.387,2.612c-4.404,8.69-8.881,17.344-13.326,26.014c-6.27,12.229-12.533,24.461-18.805,36.688
			c-0.266,0.518-0.562,1.022-0.885,1.507c-3.807,5.708-9.797,5.595-13.092-0.417c-3.643-6.643-7.053-13.414-10.521-20.15
			c-7.475-14.514-14.953-29.024-22.344-43.581c-1.023-2.015-2.375-2.698-4.543-2.667c-6.414,0.093-12.838,0.177-19.246-0.032
			c-2.945-0.097-4.613,1.027-5.896,3.544c-7.869,15.432-15.819,30.822-23.741,46.228c-2.742,5.334-5.472,10.675-8.229,16.002
			c-1.345,2.599-2.978,4.798-6.288,5.042c-3.93,0.291-6.121-1.799-7.786-5.049c-10.56-20.605-21.222-41.158-31.728-61.791
			c-1.476-2.896-3.254-4.199-6.597-3.987c-4.522,0.287-4.691,0.234-4.691,4.91c0.003,25.5,0.007,50.999-0.004,76.499
			c-0.001,1.663-0.002,3.343-0.218,4.986c-0.34,2.592-1.706,4.551-4.27,5.353c-2.486,0.778-4.607-0.121-6.319-1.956
			c-0.788-0.844-1.553-1.771-2.077-2.79c-7.16-13.925-14.286-27.868-21.399-41.817c-7.151-14.024-14.262-28.068-21.444-42.076
			c-0.638-1.245-1.674-2.286-2.524-3.422c-0.874,1.176-1.947,2.253-2.593,3.544C54.792,34.51,47.753,48.776,40.674,63.022
			C34.56,75.33,28.406,87.617,22.298,99.928c-3.331,6.716-6.601,13.461-9.896,20.194c-0.616,1.259-1.175,2.581,0.574,3.375
			c2.622,1.191,5.846-0.114,7.103-2.764c1.678-3.535,3.366-7.064,5.061-10.592c1.617-3.366,4.317-4.863,8.031-4.858
			c21.166,0.03,42.333,0.038,63.499-0.005c3.739-0.008,6.443,1.575,8.117,4.808c5.742,11.096,11.499,22.186,17.051,33.376
			c1.229,2.479,2.734,3.506,5.41,3.368c3.399-0.175,3.992-1.159,2.375-4.171c-1.536-2.861-3.096-5.72-4.43-8.676
			c-1.546-3.428-0.937-6.958,1.918-8.749c2.509-1.573,2.773-3.587,2.769-6.125c-0.048-21-0.035-41.999-0.014-62.999
			c0.002-1.742,0-3.529,0.359-5.219c1.009-4.737,6.571-6.442,10.15-3.137c0.959,0.887,1.786,1.994,2.419,3.14
			c1.853,3.353,3.59,6.77,5.349,10.173c7.415,14.351,14.805,28.716,22.28,43.035c0.435,0.833,1.54,1.813,2.34,1.819
			c0.801,0.007,1.934-0.955,2.368-1.782c5.999-11.426,11.901-22.901,17.831-34.364c3.214-6.212,6.383-12.447,9.691-18.608
			c0.77-1.432,1.838-2.84,3.1-3.845c3.547-2.825,8.607-1.006,9.641,3.408c0.336,1.438,0.346,2.976,0.348,4.468
			c0.027,14.166,0.023,28.333,0.023,42.499c0,15.083-0.014,30.166,0,45.249c0.002,3.208,0.641,3.867,3.486,3.849
			c2.789-0.02,3.461-0.747,3.482-3.917c0.023-3.75-0.057-7.501,0.012-11.249c0.098-5.145,2.812-7.811,7.941-7.926
			c0.834-0.019,1.666,0,2.5,0.001c4.393,0.011,4.699-0.306,4.699-4.655c-0.006-21.083-0.02-42.166,0.016-63.249
			c0.004-1.814,0.064-3.715,0.586-5.427c1.352-4.428,6.723-5.776,10.062-2.569c1.117,1.072,2.064,2.416,2.785,3.795
			c8.98,17.207,17.885,34.453,26.895,51.646c0.592,1.129,1.873,2.624,2.834,2.625c0.947,0,2.209-1.52,2.799-2.651
			c7.936-15.213,15.77-30.479,23.656-45.721c1.453-2.81,2.912-5.629,4.572-8.318c1.619-2.625,4.479-3.593,7.406-2.834
			c2.451,0.635,4.176,2.771,4.488,5.714c0.141,1.322,0.131,2.663,0.133,3.995C324.127,70.054,324.125,84.054,324.121,98.053z"/>
		<path fill-rule="evenodd" clip-rule="evenodd" d="M81.545,164.85c2.814-0.292,3.542,1.718,4.297,3.396
			c2.76,6.135,5.391,12.327,8.056,18.505c0.719,1.663,1.461,3.324,2.024,5.041c0.133,0.406-0.429,1.495-0.644,1.487
			c-1.312-0.046-2.921,0.083-3.845-0.619c-1.023-0.776-1.63-2.313-2.044-3.637c-0.807-2.581-2.604-3.506-5.076-3.589
			c-0.748-0.024-1.528,0.137-2.241-0.021c-1.022-0.227-1.998-0.668-2.993-1.018c1.01-0.98,1.886-2.576,3.054-2.831
			c4.259-0.929,4.521-1.239,2.359-5.085c-0.608-1.082-1.127-2.217-1.789-3.264c-0.32-0.508-0.82-1.056-1.35-1.213
			c-0.267-0.08-0.962,0.596-1.155,1.059c-2.167,5.204-4.267,10.437-6.402,15.654c-0.533,1.304-0.846,2.874-1.783,3.782
			c-0.784,0.759-2.331,0.729-3.541,1.05c-0.071-0.926-0.457-1.97-0.162-2.759c1.622-4.331,3.375-8.615,5.152-12.888
			c1.459-3.508,3.181-6.916,4.463-10.484C78.665,165.356,79.841,164.656,81.545,164.85z"/>
		<path fill-rule="evenodd" clip-rule="evenodd" d="M282.984,179.266c-0.002-4,0.008-7.999-0.006-11.998
			c-0.006-1.382,0.184-2.553,1.992-2.441c1.631,0.1,3.125,0.131,3.24,2.471c0.289,5.807,0.365,5.703,6.18,5.756
			c2.297,0.021,4.805-0.567,6.689,1.73c2.443,2.98,2.312,6.469-0.605,8.959c-2.926,2.499-2.939,2.711-0.381,5.678
			c0.217,0.252,0.49,0.479,0.631,0.77c0.469,0.973,0.887,1.969,1.324,2.955c-1.432,0.047-3.498,0.721-4.186,0.027
			c-2.369-2.391-4.289-5.235-6.25-8.001c-0.123-0.173,0.777-1.298,1.385-1.715c1.205-0.829,2.695-1.3,3.758-2.262
			c0.588-0.534,0.922-1.875,0.686-2.642c-0.23-0.755-1.287-1.707-2.051-1.772c-4.51-0.389-7.768,0.78-7.402,5.794
			c0.195,2.654,0.045,5.334,0.23,7.989c0.156,2.241-1,2.95-2.947,3.103c-2.25,0.176-2.361-1.249-2.316-2.902
			c0.051-1.915,0.027-3.832,0.031-5.748C282.99,183.099,282.986,181.182,282.984,179.266z"/>
		<path fill-rule="evenodd" clip-rule="evenodd" d="M241.553,184.363c2.301-1.064,4.203-1.82,5.967-2.824
			c0.68-0.388,1.543-1.438,1.432-2.008c-0.182-0.913-0.93-2.023-1.75-2.446c-3.904-2.011-8.643,0.792-8.812,5.188
			c-0.111,2.904,0.02,5.82,0.09,8.73c0.035,1.495-0.197,2.718-2.074,2.679c-1.803-0.038-2.979-0.601-2.961-2.775
			c0.057-7.653,0.018-15.31-0.037-22.963c-0.012-1.739,0.461-2.887,2.396-3.104c1.795-0.202,2.713,0.43,2.65,2.303
			c-0.047,1.496-0.143,2.998-0.062,4.49c0.086,1.596,0.744,2.235,2.617,1.941c2.678-0.422,5.543-0.796,8.129-0.247
			c1.574,0.335,3.328,2.21,4,3.812c0.834,1.992,0.791,4.459-1.252,6.179c-0.57,0.481-1.475,0.786-1.723,1.382
			c-0.385,0.918-0.736,2.195-0.375,2.996c0.553,1.232,1.801,2.135,2.59,3.289c0.373,0.543,0.613,1.421,0.438,2.004
			c-0.113,0.375-1.08,0.65-1.684,0.69c-1.637,0.108-3.02-0.255-4.061-1.823C245.359,189.278,243.41,186.859,241.553,184.363z"/>
		<path fill-rule="evenodd" clip-rule="evenodd" d="M356.576,178.936c0.002-3.74,0.039-7.48-0.012-11.221
			c-0.029-2.018,0.953-2.9,2.873-2.891c1.967,0.009,1.914,1.427,1.932,2.804c0.068,5.417,0.086,5.671,5.533,5.351
			c6.746-0.396,9.744,4.507,9.771,9.878c0.035,6.8-3.297,10.603-9.65,10.754c-2.32,0.056-4.648-0.175-6.973-0.235
			c-2.438-0.063-3.605-1.143-3.512-3.719C356.67,186.088,356.572,182.51,356.576,178.936z M361.359,183.587
			c-0.008,0-0.014,0-0.021,0c0,0.664-0.006,1.327,0,1.991c0.035,3.408,0.717,4.122,4.033,4.234c3.643,0.123,6-1.883,6.623-5.635
			c0.562-3.395-1.816-7.057-4.738-7.293c-4.588-0.373-5.873,0.925-5.896,5.955C361.357,183.089,361.359,183.338,361.359,183.587z"/>
		<path fill-rule="evenodd" clip-rule="evenodd" d="M195.832,192.791c-2.552,1.432-4.944,1.105-6.413-0.785
			c-1.373-1.77-2.696-3.58-3.987-5.41c-1.175-1.667-0.796-2.555,1.17-3.275c1.002-0.367,2.072-0.766,2.857-1.443
			c0.764-0.66,1.807-1.842,1.64-2.53c-0.238-0.983-1.325-2.196-2.298-2.491c-4.431-1.342-7.791,1.195-7.872,5.781
			c-0.049,2.741,0.04,5.486,0.103,8.229c0.037,1.682-0.591,2.727-2.406,2.792c-1.991,0.071-2.288-1.202-2.291-2.788
			c-0.018-7.82-0.046-15.639-0.097-23.459c-0.011-1.562,0.458-2.615,2.233-2.594c1.76,0.022,2.582,0.933,2.534,2.67
			c-0.005,0.166,0.005,0.333,0.008,0.5c0.102,5.234,0.101,5.137,5.471,5.053c2.743-0.043,5.679-0.585,7.918,1.883
			c2.663,2.936,2.529,6.049-0.5,8.604c-3.061,2.581-3.069,2.971-0.409,6.118C194.331,190.637,195.049,191.73,195.832,192.791z"/>
		<path fill-rule="evenodd" clip-rule="evenodd" d="M165.943,184.951c-1.497,0-3.009-0.121-4.486,0.052
			c-0.71,0.083-1.738,0.596-1.922,1.147c-0.19,0.572,0.258,1.752,0.792,2.09c1.139,0.721,2.481,1.345,3.8,1.502
			c1.967,0.232,3.993-0.079,5.977,0.07c0.648,0.05,1.721,0.784,1.752,1.262c0.05,0.732-0.433,1.869-1.041,2.215
			c-2.736,1.553-11.775,0.059-13.973-2.245c-5.143-5.394-4.166-13.339,1.583-17.019c5.968-3.818,14.683,0.519,14.945,7.288
			c0.106,2.74-0.705,3.626-3.435,3.688c-1.33,0.031-2.661,0.006-3.992,0.006C165.943,184.988,165.943,184.97,165.943,184.951z
			 M164.285,181.508c0.375,0.029,1.296,0.226,2.184,0.126c0.577-0.065,1.418-0.449,1.577-0.893c0.211-0.587,0.088-1.517-0.269-2.046
			c-1.695-2.517-5.218-2.869-7.358-0.686c-0.591,0.604-1.018,1.734-0.894,2.525c0.067,0.431,1.427,0.748,2.245,0.943
			C162.397,181.629,163.087,181.508,164.285,181.508z"/>
		<path fill-rule="evenodd" clip-rule="evenodd" d="M28.3,185.008c-1.499,0-3.015-0.129-4.489,0.057
			c-0.697,0.088-1.595,0.649-1.882,1.246c-0.212,0.441,0.225,1.596,0.704,1.891c1.153,0.711,2.467,1.392,3.781,1.555
			c1.966,0.242,4.001-0.098,5.98,0.084c0.658,0.061,1.689,0.926,1.737,1.492c0.056,0.67-0.737,2.007-1.216,2.031
			c-4.59,0.236-9.394,1.309-13.378-2.125c-5.139-4.43-4.638-14.351,2.005-17.621c5.943-2.926,12.994,0.633,14.011,7.141
			c0.493,3.161-0.491,4.269-3.756,4.238c-1.166-0.01-2.332-0.002-3.498-0.002C28.3,184.999,28.3,185.004,28.3,185.008z
			 M26.183,181.443c0,0.031,0,0.062,0,0.092c0.664,0,1.366,0.137,1.982-0.034c0.801-0.223,1.978-0.532,2.178-1.095
			c0.227-0.636-0.261-1.744-0.77-2.383c-1.348-1.689-4.27-2.04-6.092-0.627c-0.808,0.627-1.167,1.83-1.729,2.771
			c0.896,0.426,1.766,0.932,2.699,1.244C24.973,181.588,25.603,181.443,26.183,181.443z"/>
		<path fill-rule="evenodd" clip-rule="evenodd" d="M223.697,184.972c-1.498,0-3.008-0.102-4.496,0.024
			c-2.262,0.189-2.879,1.48-1.369,3.107c0.762,0.822,2.049,1.457,3.166,1.586c2.137,0.246,4.324,0.101,6.488,0.055
			c1.264-0.025,2.422,0.011,2.453,1.686c0.029,1.445-0.742,2.141-2.168,2.127c-2.662-0.027-5.346,0.139-7.984-0.133
			c-4.748-0.49-7.242-3.137-7.857-7.885c-0.584-4.518-0.24-8.658,4.076-11.474c2.012-1.312,9.113-1.444,11.105-0.025
			c2.375,1.69,4.115,6.441,3.186,9.37c-0.219,0.693-1.32,1.417-2.113,1.553c-1.457,0.248-2.986,0.07-4.486,0.07
			C223.697,185.013,223.697,184.992,223.697,184.972z M221.256,181.503c0.002,0.023,0.004,0.047,0.006,0.07
			c1.152-0.104,2.377-0.015,3.424-0.401c0.482-0.179,1.049-1.472,0.844-1.944c-0.955-2.222-3.367-3.358-5.551-2.325
			c-1.217,0.575-2.723,2.104-2.762,3.248c-0.066,1.932,1.932,1.453,3.297,1.409C220.762,181.552,221.008,181.522,221.256,181.503z"
			/>
		<path fill-rule="evenodd" clip-rule="evenodd" d="M406.768,185.098c-1.746,0-3.508-0.141-5.234,0.041
			c-1.664,0.174-2.311,1.301-1.01,2.539c1,0.95,2.4,1.811,3.727,2.01c2.197,0.33,4.49-0.014,6.723,0.164
			c0.705,0.057,1.348,0.873,2.018,1.342c-0.541,0.715-1.076,2.041-1.623,2.045c-3.709,0.029-7.525,0.261-11.096-0.529
			c-2.918-0.646-4.883-3.177-5.045-6.461c-0.121-2.404-0.131-4.829,0.049-7.227c0.164-2.193,3.895-5.621,6.207-5.807
			c1.984-0.16,3.992-0.203,5.984-0.119c2.746,0.117,5.182,2.398,5.658,5.102C414.258,184.629,413.951,184.956,406.768,185.098z
			 M402.645,182.016c0.064-0.126,0.127-0.252,0.191-0.378c1.156-0.058,2.32-0.048,3.469-0.187c2.244-0.271,2.799-1.596,1.506-3.451
			c-1.32-1.895-4.775-1.988-6.564-0.039c-0.604,0.657-1.318,1.926-1.059,2.485C400.533,181.189,401.783,181.512,402.645,182.016z"/>
		<path fill-rule="evenodd" clip-rule="evenodd" d="M423.162,189.965c1.084,0,2.166-0.008,3.248,0.002
			c1.408,0.015,2.787-0.449,2.471-2.008c-0.209-1.027-1.299-2.301-2.279-2.643c-1.344-0.469-2.961-0.119-4.459-0.19
			c-3.58-0.169-5.305-1.823-5.455-5.173c-0.17-3.768,1.744-6.6,5.045-6.854c3.055-0.234,6.16-0.157,9.213,0.111
			c0.842,0.074,1.58,1.326,2.365,2.037c-0.883,0.516-1.742,1.412-2.654,1.471c-2.059,0.134-4.146-0.268-6.215-0.217
			c-1.461,0.036-2.936,0.542-2.889,2.422c0.051,1.936,1.383,2.454,3.098,2.425c1.414-0.024,2.834-0.022,4.246,0.05
			c2.723,0.141,4.861,2,5.176,4.43c0.498,3.828-0.682,6.814-3.605,7.243c-3.57,0.522-7.268,0.327-10.896,0.159
			c-0.68-0.031-1.299-1.396-1.945-2.145c0.848-0.465,1.652-1.144,2.559-1.334c0.939-0.197,1.98,0.079,2.977,0.148
			C423.162,189.922,423.162,189.943,423.162,189.965z"/>
		<path fill-rule="evenodd" clip-rule="evenodd" d="M312.682,189.828c1.891,0,3.307,0.051,4.717-0.016
			c1.318-0.062,2.84-0.457,2.457-2.045c-0.238-0.986-1.48-2.105-2.508-2.438c-1.365-0.439-2.961-0.146-4.455-0.211
			c-3.795-0.168-5.098-1.447-5.293-5.15c-0.207-3.941,1.467-6.535,4.809-6.785c3.129-0.234,6.295-0.029,9.443,0.031
			c1.594,0.031,2.223,1.025,2.053,2.494c-0.191,1.631-1.395,1.219-2.484,1.158c-2.393-0.134-4.809-0.357-7.176-0.134
			c-0.828,0.078-1.543,1.36-2.309,2.093c0.816,0.802,1.514,2.047,2.477,2.307c1.561,0.421,3.295,0.166,4.955,0.25
			c3.395,0.172,5.1,1.859,5.393,5.277c0.314,3.688-1.168,6.379-4.424,6.706c-3.43,0.345-6.949,0.052-10.4-0.271
			c-0.742-0.068-1.359-1.454-2.035-2.233c0.84-0.405,1.646-0.993,2.531-1.163C311.297,189.533,312.246,189.793,312.682,189.828z"/>
		<path fill-rule="evenodd" clip-rule="evenodd" d="M44.571,189.783c1.413,0,2.879,0.227,4.222-0.083
			c0.836-0.192,2.165-1.318,2.075-1.806c-0.172-0.934-1.049-2.186-1.898-2.447c-1.459-0.451-3.12-0.253-4.698-0.311
			c-4.22-0.152-5.333-1.178-5.482-5.072c-0.182-4.713,1.127-6.709,5.053-6.959c3.052-0.194,6.134,0.062,9.2,0.168
			c1.695,0.059,2.176,1.301,1.803,2.594c-0.147,0.51-1.443,0.953-2.223,0.965c-2.312,0.033-4.656-0.408-6.932-0.156
			c-0.988,0.109-1.839,1.461-2.752,2.248c0.95,0.775,1.792,1.913,2.877,2.238c1.385,0.414,2.967,0.148,4.463,0.216
			c3.371,0.151,5.091,1.778,5.341,5.017c0.31,4.025-1.074,6.689-4.324,6.998c-3.353,0.32-6.789,0.025-10.159-0.305
			c-0.759-0.074-1.395-1.404-2.087-2.156c0.844-0.408,1.651-1.01,2.539-1.174c0.955-0.176,1.985,0.061,2.982,0.117
			C44.57,189.844,44.57,189.813,44.571,189.783z"/>
		<path fill-rule="evenodd" clip-rule="evenodd" d="M132.073,189.832c1.163,0,2.421,0.275,3.463-0.08
			c0.984-0.336,1.741-1.337,2.599-2.045c-0.876-0.838-1.621-2.061-2.661-2.416c-1.271-0.435-2.793-0.106-4.204-0.169
			c-3.758-0.167-5.211-1.655-5.353-5.429c-0.141-3.771,1.796-6.406,5.21-6.577c3.051-0.153,6.123,0.095,9.186,0.175
			c1.657,0.043,2.147,1.08,1.99,2.518c-0.19,1.738-1.424,1.131-2.467,1.051c-2.146-0.164-4.304-0.393-6.447-0.322
			c-1.404,0.047-2.972,0.475-2.931,2.377c0.04,1.846,1.494,2.236,2.975,2.35c1.407,0.107,2.825,0.055,4.236,0.121
			c3.137,0.146,5.143,2.111,5.477,5.324c0.347,3.342-1.204,6.279-4.252,6.599c-3.497,0.366-7.089-0.007-10.62-0.296
			c-0.628-0.051-1.161-1.26-1.737-1.934c0.766-0.45,1.487-1.134,2.309-1.291c1.033-0.197,2.148,0.035,3.229,0.082
			C132.073,189.857,132.073,189.844,132.073,189.832z"/>
		<path fill-rule="evenodd" clip-rule="evenodd" d="M258.252,180.08c0-2.743-0.123-5.496,0.07-8.227
			c0.062-0.884,0.816-2.223,1.512-2.414c0.684-0.188,1.713,0.79,2.559,1.308c1.199,0.733,2.395,1.477,3.541,2.288
			c0.607,0.431,1.59,1.063,1.543,1.518c-0.07,0.705-0.809,1.833-1.383,1.91c-2.434,0.332-2.916,1.824-2.861,3.883
			c0.041,1.579,0.006,3.16-0.018,4.74c-0.033,2.289,0.152,4.338,3.068,4.89c0.525,0.1,1.158,1.378,1.129,2.087
			c-0.021,0.536-0.949,1.35-1.596,1.494c-4.551,1.02-7.463-1.316-7.568-5.992c-0.055-2.494-0.01-4.989-0.01-7.484
			C258.242,180.08,258.248,180.08,258.252,180.08z"/>
		<path fill-rule="evenodd" clip-rule="evenodd" d="M112.25,180.252c0-2.912-0.089-5.828,0.057-8.733
			c0.042-0.835,0.76-1.636,1.168-2.453c0.762,0.489,1.529,0.972,2.286,1.469c1.259,0.827,2.537,1.628,3.755,2.514
			c0.709,0.515,1.314,1.173,1.966,1.766c-0.585,0.582-1.087,1.521-1.77,1.679c-1.922,0.441-2.604,1.57-2.583,3.389
			c0.026,2.246-0.014,4.492,0.03,6.738c0.033,1.655,0.692,2.748,2.474,3.27c0.739,0.217,1.198,1.39,1.785,2.128
			c-0.724,0.536-1.396,1.44-2.179,1.55c-4.962,0.695-6.96-1.098-6.999-6.076c-0.02-2.413-0.004-4.826-0.004-7.238
			C112.241,180.252,112.246,180.252,112.25,180.252z"/>
		<path fill-rule="evenodd" clip-rule="evenodd" d="M10.796,179.504c0,3.822-0.052,7.645,0.021,11.465
			c0.037,1.969-0.916,2.66-2.729,2.676c-1.819,0.016-2.499-0.885-2.492-2.626c0.029-7.892,0.034-15.784,0.002-23.677
			c-0.008-1.808,0.771-2.534,2.563-2.503c1.7,0.03,2.662,0.582,2.641,2.454c-0.047,4.07-0.015,8.141-0.015,12.211
			C10.791,179.504,10.793,179.504,10.796,179.504z"/>
		<path fill-rule="evenodd" clip-rule="evenodd" d="M340.393,179.498c0.002,3.83-0.025,7.661,0.016,11.491
			c0.018,1.66-0.396,2.75-2.359,2.689c-1.834-0.056-2.709-0.774-2.693-2.728c0.057-7.828,0.059-15.655,0-23.482
			c-0.016-1.979,0.887-2.609,2.717-2.669c2.031-0.066,2.332,1.107,2.326,2.708C340.379,171.504,340.391,175.501,340.393,179.498z"/>
		<path fill-rule="evenodd" clip-rule="evenodd" d="M201.225,179.276c0-3.907,0.002-7.813,0-11.721
			c-0.002-1.461,0.279-2.726,2.115-2.719c1.756,0.007,2.23,1.166,2.234,2.667c0.012,7.811,0.02,15.621,0.027,23.432
			c0.002,1.65-0.6,2.806-2.459,2.691c-1.822-0.112-1.951-1.441-1.941-2.879c0.025-3.824,0.01-7.648,0.01-11.472
			C201.215,179.276,201.221,179.276,201.225,179.276z"/>
		<path fill-rule="evenodd" clip-rule="evenodd" d="M98.333,182.014c0-1.996-0.004-3.991,0.001-5.987
			c0.007-2.733,1.458-3.778,3.73-2.429c1.468,0.872,2.523,1.285,3.958-0.023c0.38-0.346,1.567,0.194,2.385,0.327
			c-0.225,0.872-0.22,2.336-0.708,2.524c-4.168,1.613-4.762,4.873-4.487,8.721c0.137,1.902,0.02,3.823,0.034,5.736
			c0.011,1.464-0.271,2.714-2.086,2.767c-1.805,0.053-2.547-1.014-2.564-2.667c-0.031-2.988-0.009-5.979-0.009-8.969
			C98.503,182.014,98.418,182.014,98.333,182.014z"/>
		<path fill-rule="evenodd" clip-rule="evenodd" d="M380.975,183.123c0-2.58-0.061-5.161,0.037-7.736
			c0.027-0.742,0.309-1.801,0.832-2.109c0.539-0.318,1.785-0.185,2.246,0.253c1.318,1.257,2.359,0.907,3.779,0.185
			c0.699-0.357,1.863,0.197,2.816,0.34c-0.402,0.971-0.551,2.484-1.256,2.818c-2.957,1.396-3.838,3.628-3.652,6.687
			c0.15,2.487-0.002,4.991,0.049,7.487c0.035,1.818-0.887,2.527-2.594,2.588c-1.816,0.064-2.268-0.945-2.242-2.523
			c0.043-2.662,0.012-5.326,0.012-7.988C380.992,183.123,380.982,183.123,380.975,183.123z"/>
		<path fill-rule="evenodd" clip-rule="evenodd" d="M272.365,182.999c0-2.577,0.02-5.153-0.006-7.729
			c-0.016-1.467,0.686-2.147,2.123-2.119c1.336,0.025,2.604,0.238,2.615,1.949c0.035,5.486,0.113,10.976-0.094,16.453
			c-0.027,0.727-1.521,1.752-2.5,2.003c-1.359,0.349-2.113-0.676-2.119-2.078c-0.012-2.826-0.004-5.652-0.004-8.479
			C272.377,182.999,272.371,182.999,272.365,182.999z"/>
		<path fill-rule="evenodd" clip-rule="evenodd" d="M350.85,183.369c0,2.571-0.006,5.143,0.002,7.715
			c0.006,1.391-0.328,2.533-2.012,2.524c-1.535-0.007-2.594-0.716-2.604-2.365c-0.029-5.309-0.023-10.618,0.016-15.927
			c0.014-1.748,1.207-2.179,2.709-2.17c1.734,0.01,1.965,1.088,1.934,2.509c-0.059,2.569-0.016,5.143-0.016,7.714
			C350.869,183.369,350.859,183.369,350.85,183.369z"/>
		<path fill-rule="evenodd" clip-rule="evenodd" d="M274.646,169.549c-1.123-1.26-2.123-1.877-2.277-2.66
			c-0.287-1.454,0.863-2.237,2.158-1.955c0.947,0.205,1.748,1.087,2.613,1.668C276.447,167.42,275.756,168.238,274.646,169.549z"/>
		<path fill-rule="evenodd" clip-rule="evenodd" d="M348.787,169.52c-1.186-1.271-1.926-2.066-2.666-2.86
			c0.854-0.603,1.635-1.496,2.58-1.736c1.32-0.335,2.375,0.52,2.158,1.916C350.738,167.613,349.801,168.262,348.787,169.52z"/>
		<path fill-rule="evenodd" clip-rule="evenodd" fill="none" d="M324.123,98.053c0.002-13.999,0.004-27.999-0.004-41.999
			c-0.002-1.332,0.008-2.673-0.133-3.995c-0.312-2.943-2.037-5.079-4.488-5.714c-2.928-0.759-5.787,0.209-7.406,2.834
			c-1.66,2.689-3.119,5.509-4.572,8.318c-7.887,15.241-15.721,30.508-23.656,45.721c-0.59,1.132-1.852,2.651-2.799,2.651
			c-0.961-0.001-2.242-1.496-2.834-2.625c-9.01-17.192-17.914-34.438-26.895-51.646c-0.721-1.379-1.668-2.723-2.785-3.795
			c-3.34-3.207-8.711-1.858-10.062,2.569c-0.521,1.712-0.582,3.612-0.586,5.427c-0.035,21.083-0.021,42.166-0.016,63.249
			c0,4.35-0.307,4.666-4.699,4.655c-0.834-0.001-1.666-0.02-2.5-0.001c-5.129,0.115-7.844,2.781-7.941,7.926
			c-0.068,3.748,0.012,7.499-0.012,11.249c-0.021,3.17-0.693,3.897-3.482,3.917c-2.846,0.019-3.484-0.641-3.486-3.849
			c-0.014-15.083,0-30.166,0-45.249c0-14.166,0.004-28.333-0.023-42.499c-0.002-1.492-0.012-3.029-0.348-4.468
			c-1.033-4.414-6.094-6.233-9.641-3.408c-1.262,1.005-2.33,2.413-3.1,3.845c-3.308,6.161-6.477,12.396-9.691,18.608
			c-5.93,11.463-11.832,22.938-17.831,34.364c-0.435,0.827-1.567,1.789-2.368,1.782c-0.8-0.006-1.905-0.986-2.34-1.819
			c-7.476-14.319-14.865-28.685-22.28-43.035c-1.759-3.403-3.496-6.82-5.349-10.173c-0.633-1.146-1.46-2.253-2.419-3.14
			c-3.579-3.306-9.142-1.601-10.15,3.137c-0.359,1.689-0.357,3.477-0.359,5.219c-0.021,21-0.034,41.999,0.014,62.999
			c0.005,2.538-0.26,4.552-2.769,6.125c-2.854,1.791-3.464,5.321-1.918,8.749c1.334,2.956,2.894,5.814,4.43,8.676
			c1.617,3.012,1.024,3.996-2.375,4.171c-2.676,0.138-4.181-0.89-5.41-3.368c-5.552-11.19-11.309-22.28-17.051-33.376
			c-1.674-3.232-4.378-4.815-8.117-4.808c-21.166,0.043-42.333,0.035-63.499,0.005c-3.714-0.005-6.414,1.492-8.031,4.858
			c-1.694,3.527-3.383,7.057-5.061,10.592c-1.257,2.649-4.48,3.955-7.103,2.764c-1.749-0.794-1.19-2.116-0.574-3.375
			c3.295-6.733,6.564-13.479,9.896-20.194C28.406,87.617,34.56,75.33,40.674,63.022c7.079-14.246,14.118-28.513,21.232-42.741
			c0.646-1.291,1.719-2.368,2.593-3.544c0.851,1.136,1.887,2.177,2.524,3.422c7.183,14.008,14.293,28.052,21.444,42.076
			c7.113,13.949,14.239,27.893,21.399,41.817c0.524,1.02,1.289,1.946,2.077,2.79c1.712,1.835,3.833,2.734,6.319,1.956
			c2.563-0.802,3.93-2.761,4.27-5.353c0.216-1.644,0.217-3.323,0.218-4.986c0.011-25.5,0.007-50.999,0.004-76.499
			c0-4.676,0.169-4.623,4.691-4.91c3.343-0.212,5.121,1.091,6.597,3.987c10.506,20.633,21.168,41.186,31.728,61.791
			c1.665,3.25,3.856,5.34,7.786,5.049c3.311-0.244,4.943-2.443,6.288-5.042c2.757-5.327,5.486-10.668,8.229-16.002
			c7.922-15.405,15.872-30.796,23.741-46.228c1.283-2.517,2.951-3.641,5.896-3.544c6.408,0.209,12.832,0.125,19.246,0.032
			c2.168-0.031,3.52,0.652,4.543,2.667c7.391,14.557,14.869,29.067,22.344,43.581c3.469,6.736,6.879,13.508,10.521,20.15
			c3.295,6.012,9.285,6.125,13.092,0.417c0.322-0.484,0.619-0.989,0.885-1.507c6.271-12.228,12.535-24.46,18.805-36.688
			c4.445-8.67,8.922-17.323,13.326-26.014c0.951-1.874,2.312-2.617,4.387-2.612c19.416,0.047,38.834-0.118,58.248,0.122
			c8.191,0.103,16.217,1.733,23.811,5.061c11.236,4.924,18.363,13.545,21.363,25.208c4.375,17.019,4.094,34.053-2.395,50.575
			c-4.469,11.38-12.969,18.718-24.559,22.561c-6.969,2.31-14.127,3.102-21.422,3.09c-13.332-0.021-26.666-0.013-39.998-0.008
			c-6.477,0.002-9.061,2.608-9.074,9.13c-0.008,3.5,0.037,7.001-0.01,10.5c-0.039,2.823-0.734,3.493-3.357,3.47
			c-2.648-0.023-3.33-0.664-3.336-3.495C324.107,128.219,324.121,113.136,324.123,98.053z M349.318,70.315
			c0,6.332,0,12.664,0.002,18.996c0,6.416-0.035,12.831,0.014,19.246c0.043,5.545,2.615,8.188,8.135,8.162
			c10.494-0.05,20.992-0.079,31.48-0.388c14.518-0.427,26.832-9.618,31.383-23.426c4.432-13.444,4.725-27.16,1.832-40.946
			c-3.338-15.906-16.393-26.818-32.646-27.253c-10.488-0.281-20.984-0.348-31.479-0.425c-6.404-0.047-8.707,2.328-8.715,8.79
			C349.307,45.487,349.318,57.901,349.318,70.315z M64.89,98.197c0-0.008,0-0.017,0-0.025c7.659,0,15.319,0.076,22.977-0.027
			c4.937-0.066,7.504-3.094,6.905-7.972c-0.147-1.205-0.624-2.411-1.146-3.524c-5.297-11.301-10.62-22.59-15.969-33.867
			c-2.102-4.433-4.04-8.97-6.493-13.204c-3.365-5.808-9.165-5.658-12.608,0.08c-0.427,0.712-0.781,1.47-1.135,2.222
			c-2.371,5.045-4.717,10.102-7.1,15.141C45.555,67.098,40.7,77.135,36.018,87.252c-2.928,6.327,0.131,10.908,7.145,10.938
			C50.405,98.223,57.648,98.197,64.89,98.197z"/>
		<path fill-rule="evenodd" clip-rule="evenodd" fill="none" d="M361.359,183.587c0-0.249-0.002-0.498,0-0.747
			c0.023-5.03,1.309-6.328,5.896-5.955c2.922,0.236,5.301,3.898,4.738,7.293c-0.623,3.752-2.98,5.758-6.623,5.635
			c-3.316-0.112-3.998-0.826-4.033-4.234c-0.006-0.664,0-1.327,0-1.991C361.346,183.587,361.352,183.587,361.359,183.587z"/>
		<path fill-rule="evenodd" clip-rule="evenodd" fill="none" d="M164.285,181.508c-1.197,0-1.888,0.121-2.515-0.029
			c-0.818-0.195-2.178-0.513-2.245-0.943c-0.124-0.791,0.303-1.922,0.894-2.525c2.141-2.184,5.663-1.831,7.358,0.686
			c0.356,0.529,0.479,1.459,0.269,2.046c-0.159,0.443-1,0.827-1.577,0.893C165.581,181.733,164.66,181.537,164.285,181.508z"/>
		<path fill-rule="evenodd" clip-rule="evenodd" fill="none" d="M26.183,181.443c-0.58,0-1.21,0.145-1.731-0.031
			c-0.934-0.312-1.803-0.818-2.699-1.244c0.562-0.941,0.922-2.145,1.729-2.771c1.822-1.413,4.744-1.062,6.092,0.627
			c0.509,0.639,0.996,1.747,0.77,2.383c-0.2,0.562-1.377,0.872-2.178,1.095c-0.616,0.171-1.318,0.034-1.982,0.034
			C26.183,181.505,26.183,181.475,26.183,181.443z"/>
		<path fill-rule="evenodd" clip-rule="evenodd" fill="none" d="M221.256,181.503c-0.248,0.02-0.494,0.049-0.742,0.057
			c-1.365,0.044-3.363,0.522-3.297-1.409c0.039-1.145,1.545-2.673,2.762-3.248c2.184-1.033,4.596,0.104,5.551,2.325
			c0.205,0.473-0.361,1.766-0.844,1.944c-1.047,0.387-2.271,0.297-3.424,0.401C221.26,181.55,221.258,181.526,221.256,181.503z"/>
		<path fill-rule="evenodd" clip-rule="evenodd" fill="none" d="M402.645,182.016c-0.861-0.504-2.111-0.826-2.457-1.569
			c-0.26-0.56,0.455-1.828,1.059-2.485c1.789-1.949,5.244-1.855,6.564,0.039c1.293,1.855,0.738,3.18-1.506,3.451
			c-1.148,0.139-2.312,0.129-3.469,0.187C402.771,181.764,402.709,181.89,402.645,182.016z"/>
		<path fill-rule="evenodd" clip-rule="evenodd" d="M349.318,70.315c0-12.414-0.012-24.828,0.006-37.243
			c0.008-6.462,2.311-8.837,8.715-8.79c10.494,0.077,20.99,0.144,31.479,0.425c16.254,0.435,29.309,11.347,32.646,27.253
			c2.893,13.786,2.6,27.502-1.832,40.946c-4.551,13.808-16.865,22.999-31.383,23.426c-10.488,0.309-20.986,0.338-31.48,0.388
			c-5.52,0.025-8.092-2.617-8.135-8.162c-0.049-6.415-0.014-12.83-0.014-19.246C349.318,82.979,349.318,76.647,349.318,70.315z
			 M355.168,70.449c0,12.244-0.002,24.488,0.002,36.732c0,3,0.844,3.876,3.852,3.862c9.41-0.042,18.822-0.06,28.23-0.198
			c3.893-0.058,7.656-0.438,11.439-1.979c8.977-3.652,14.793-10.429,17.045-19.228c3.785-14.787,4.938-29.858-1.869-44.37
			c-2.176-4.64-5.611-8.19-10.016-10.776c-6.373-3.739-13.389-4.831-20.643-4.847c-7.828-0.017-15.658-0.01-23.488-0.014
			c-4.125-0.002-4.541,0.404-4.543,4.584C355.172,46.294,355.176,58.371,355.168,70.449z"/>
		<path fill-rule="evenodd" clip-rule="evenodd" d="M64.89,98.197c-7.242,0-14.485,0.025-21.728-0.007
			c-7.014-0.03-10.072-4.611-7.145-10.938C40.7,77.135,45.555,67.098,50.322,57.02c2.383-5.039,4.729-10.096,7.1-15.141
			c0.354-0.752,0.708-1.51,1.135-2.222c3.443-5.738,9.243-5.888,12.608-0.08c2.453,4.234,4.392,8.771,6.493,13.204
			c5.349,11.277,10.672,22.566,15.969,33.867c0.521,1.113,0.998,2.319,1.146,3.524c0.599,4.878-1.969,7.905-6.905,7.972
			c-7.657,0.104-15.317,0.027-22.977,0.027C64.89,98.181,64.89,98.189,64.89,98.197z M65.239,92.854c0-0.017,0-0.034,0-0.051
			c6.906,0,13.812,0.013,20.719-0.006c2.776-0.008,3.877-1.281,2.876-3.43c-2.453-5.265-5.016-10.479-7.512-15.725
			c-2.531-5.319-5.031-10.653-7.553-15.977c-2.166-4.573-4.139-9.255-6.58-13.677c-2.064-3.741-2.31-3.608-4.419-0.057
			c-0.381,0.64-0.795,1.268-1.104,1.942c-3.666,7.976-7.25,15.988-10.987,23.93c-3.099,6.585-6.38,13.082-9.563,19.627
			c-0.855,1.759-0.292,2.817,1.677,3.188c0.732,0.139,1.485,0.222,2.229,0.224C51.76,92.861,58.5,92.854,65.239,92.854z"/>
		<path fill-rule="evenodd" clip-rule="evenodd" fill="none" d="M355.172,70.449c0.004-12.078,0-24.155,0.006-36.232
			c0.002-4.18,0.418-4.586,4.543-4.584c7.83,0.004,15.66-0.003,23.488,0.014c7.254,0.016,14.27,1.107,20.643,4.847
			c4.404,2.586,7.84,6.137,10.016,10.776c6.807,14.512,5.654,29.583,1.869,44.37c-2.252,8.799-8.068,15.575-17.045,19.228
			c-3.783,1.54-7.547,1.921-11.439,1.979c-9.408,0.139-18.82,0.156-28.23,0.198c-3.008,0.014-3.852-0.862-3.852-3.862
			C355.166,94.938,355.168,82.693,355.172,70.449z"/>
		<path fill-rule="evenodd" clip-rule="evenodd" fill="none" d="M65.239,92.854c-6.739,0-13.479,0.007-20.218-0.01
			c-0.744-0.002-1.497-0.085-2.229-0.224c-1.969-0.371-2.532-1.43-1.677-3.188c3.184-6.545,6.465-13.042,9.563-19.627
			c3.737-7.941,7.321-15.954,10.987-23.93c0.31-0.675,0.724-1.303,1.104-1.942c2.109-3.552,2.354-3.685,4.419,0.057
			c2.441,4.422,4.414,9.104,6.58,13.677c2.521,5.323,5.021,10.657,7.553,15.977c2.496,5.245,5.059,10.46,7.512,15.725
			c1.001,2.148-0.1,3.422-2.876,3.43c-6.906,0.019-13.812,0.006-20.719,0.006C65.239,92.82,65.239,92.838,65.239,92.854z"/>
	</g>
</g>
</svg>
