nutrent 0.087766 0.798191 0.844468 0.125991 0.406949 0.0890208 0.328983
0.675085 0.473051 0.928983 0.984068 0.933051 12.3191;
cymbale 0.541 0.492 0.546 0.447 0.8 0.254 0.608 0.914 0.39 0.79 0.043
0.259843;
twonk 0.041383 0.468085 0.384894 0.96 0.329 0.361 0.397 0.107 0.542
0.325 0.727 1.20213;
blop 0.170213 0.370106 0.201277 0.0390109 0.335932 0.890208 0.383051
0.622034 0.287966 0.862034 0.554068 0.0930508 11.9149;
bucketbell 0.0493617 0.054 0.352 0.413 0.638 0.785 0.722 0.995 0.761
0.309 0.057 0.69 16.3617;
wooddrum 0.0711702 0.957979 0.175851 0.395012 0.68 0.399976 0.104068
0.411017 0.926949 0.482034 0.472034 0.824915 0;
trent35 0.0452128 0.893936 0.574468 0.125991 0.406949 0.0890208 0.328983
0.675085 0.473051 0.928983 0.984068 4.6383;
torsion 0.0345745 1 0.712766 0.125991 0.406949 0.0890208 0.328983 0.675085
0.473051 0.928983 0.984068 0.933051 19.1915;
nabab 0.0345745 0.861702 0.308511 0.136219 1 0.0147853 0.261186 0.0169492
0.423729 0.928983 0.949153 0.169492 2.41489;
complexe 0.0771277 0.340426 0.755319 0.01 0 0.0147853 0.244237 0 0.423729
1 0 18.9894;
canhead 0.0329787 0.404255 0.914894 0.395012 0.68 0.399976 0.104068
0.411017 0.926949 0.482034 0.472034 0.824915 17.5745;
repliement199 0.545213 0.798229 0.727447 0.125991 0.406949 0.0890208
0.328983 0.675085 0.473051 0.928983 0.984068 10.0957;
repliement228 0.0452128 0.0535106 0.184894 0.125991 0.406949 0.0890208
0.328983 0.675085 0.473051 0.928983 0.984068 0.933051 9.28723;
stick 0.0106383 0.175957 0.537553 0.489 0.25 0.602 0.193 0.81 0.262
0.467 0.716 0.653 1;
failure 0.0494681 0.223404 0.633298 0.489 0.25 0.602 0.193 0.81 0.262
0.467 0.716 1.36585;
diatonee2 1 0.0744681 0.207766 0.489 0.25 0.602 0.193 0.81 0.262 0.467
0.716 13.3298;
diatonee3 0.0319149 0.0744681 1 0.667953 1 0.01 0 0.118644 0 1 0 8.88298
;
testo 1 1 1 1 1 0.890208 0 0 0 1 1 1 20;
failure 0.0494681 0.223404 0.633298 0.489 0.25 0.602 0.193 0.81 0.262
0.467 0.716 1.36585 1;
testo 1 1 1 1 1 0.890208 0 0 0 1 1 1 20;
