[gd_scene load_steps=8 format=1]

[ext_resource path="res://Interface_Pistolet.gd" type="Script" id=1]
[ext_resource path="res://interface_pistolet.png" type="Texture" id=2]
[ext_resource path="res://ubuntu_test.fnt" type="BitmapFont" id=3]

[sub_resource type="Animation" id=1]

resource/name = "Charger"
length = 1.0
loop = true
step = 0.1
tracks/0/type = "value"
tracks/0/path = NodePath("Sprite:frame")
tracks/0/interp = 1
tracks/0/imported = false
tracks/0/keys = {
"times": FloatArray( 0 ),
"transitions": FloatArray( 1 ),
"update": 1,
"values": [ 2 ]
}

[sub_resource type="Animation" id=2]

resource/name = "Degainer"
length = 1.0
loop = true
step = 0.1
tracks/0/type = "value"
tracks/0/path = NodePath("Sprite:frame")
tracks/0/interp = 1
tracks/0/imported = false
tracks/0/keys = {
"times": FloatArray( 0 ),
"transitions": FloatArray( 1 ),
"update": 1,
"values": [ 3 ]
}

[sub_resource type="Animation" id=3]

resource/name = "Tir"
length = 0.4
loop = false
step = 0.1
tracks/0/type = "value"
tracks/0/path = NodePath("Sprite:frame")
tracks/0/interp = 1
tracks/0/imported = false
tracks/0/keys = {
"times": FloatArray( 0 ),
"transitions": FloatArray( 1 ),
"update": 1,
"values": [ 0 ]
}

[sub_resource type="Animation" id=4]

resource/name = "Tirer"
length = 1.0
loop = true
step = 0.1
tracks/0/type = "value"
tracks/0/path = NodePath("Sprite:frame")
tracks/0/interp = 1
tracks/0/imported = false
tracks/0/keys = {
"times": FloatArray( 0 ),
"transitions": FloatArray( 1 ),
"update": 1,
"values": [ 1 ]
}

[node name="Interface_Pistolet" type="Control"]

visibility/opacity = 0.8
rect/scale = Vector2( 3, 3 )
focus/ignore_mouse = false
focus/stop_mouse = true
size_flags/horizontal = 2
size_flags/vertical = 2
margin/left = 0.0
margin/top = 0.0
margin/right = 40.0
margin/bottom = 40.0
script/script = ExtResource( 1 )

[node name="Sprite" type="Sprite" parent="."]

texture = ExtResource( 2 )
vframes = 4
frame = 3

[node name="Label" type="Label" parent="."]

rect/scale = Vector2( 0.2, 0.2 )
focus/ignore_mouse = true
focus/stop_mouse = true
size_flags/horizontal = 2
size_flags/vertical = 0
margin/left = -7.0
margin/top = -14.0
margin/right = 59.0
margin/bottom = 0.0
custom_fonts/font = ExtResource( 3 )
custom_colors/font_color = Color( 0, 0, 0, 1 )
text = "DÉGAINER"
percent_visible = 1.0
lines_skipped = 0
max_lines_visible = -1

[node name="Label1" type="Label" parent="."]

rect/scale = Vector2( 0.2, 0.2 )
focus/ignore_mouse = true
focus/stop_mouse = true
size_flags/horizontal = 2
size_flags/vertical = 0
margin/left = -7.0
margin/top = -9.0
margin/right = 59.0
margin/bottom = 5.0
custom_fonts/font = ExtResource( 3 )
custom_colors/font_color = Color( 0, 0, 0, 1 )
text = "CHARGER"
percent_visible = 1.0
lines_skipped = 0
max_lines_visible = -1

[node name="Label2" type="Label" parent="."]

rect/scale = Vector2( 0.2, 0.2 )
focus/ignore_mouse = true
focus/stop_mouse = true
size_flags/horizontal = 2
size_flags/vertical = 0
margin/left = -4.0
margin/top = -2.0
margin/right = 62.0
margin/bottom = 12.0
custom_fonts/font = ExtResource( 3 )
custom_colors/font_color = Color( 0, 0, 0, 1 )
text = "TIRER"
percent_visible = 1.0
lines_skipped = 0
max_lines_visible = -1

[node name="AnimationPlayer" type="AnimationPlayer" parent="."]

playback/process_mode = 1
playback/default_blend_time = 0.0
root/root = NodePath("..")
anims/Charger = SubResource( 1 )
anims/Degainer = SubResource( 2 )
anims/Tir = SubResource( 3 )
anims/Tirer = SubResource( 4 )
next/Tir = "Charger"
playback/active = true
playback/speed = 1.0
blend_times = [  ]
autoplay = "Degainer"


