[gd_scene load_steps=6 format=1]

[ext_resource path="res://Didacticiel.gd" type="Script" id=1]
[ext_resource path="res://Sol_Ville.xml" type="TileSet" id=2]
[ext_resource path="res://Joueur_euse.tscn" type="PackedScene" id=3]
[ext_resource path="res://Bullogue.tscn" type="PackedScene" id=4]

[sub_resource type="Animation" id=1]

resource/name = "fin"
length = 1.5
loop = false
step = 0.1
tracks/0/type = "value"
tracks/0/path = NodePath(".:visibility/opacity")
tracks/0/interp = 1
tracks/0/imported = false
tracks/0/keys = {
"times": FloatArray( 0, 1.5 ),
"transitions": FloatArray( 1, 1 ),
"update": 0,
"values": [ 1.0, 0.0 ]
}

[node name="Didacticiel" type="Node2D"]

script/script = ExtResource( 1 )

[node name="Camera2D" type="Camera2D" parent="."]

transform/pos = Vector2( 416.028, 312.021 )
anchor_mode = 1
rotating = false
current = true
zoom = Vector2( 0.5, 0.5 )
limit/left = -10000000
limit/top = -10000000
limit/right = 10000000
limit/bottom = 10000000
drag_margin/h_enabled = true
drag_margin/v_enabled = true
smoothing/enable = false
smoothing/speed = 5.0
drag_margin/left = 0.2
drag_margin/top = 0.2
drag_margin/right = 0.2
drag_margin/bottom = 0.2

[node name="TileMap" type="TileMap" parent="."]

mode = 0
tile_set = ExtResource( 2 )
cell/size = Vector2( 32, 32 )
cell/quadrant_size = 16
cell/custom_transform = Matrix32( 1, 0, 0, 1, 0, 0 )
cell/half_offset = 2
cell/tile_origin = 0
cell/y_sort = false
collision/use_kinematic = false
collision/friction = 1.0
collision/bounce = 0.0
collision/layers = 1
collision/mask = 1
occluder/light_mask = 1
tile_data = IntArray( -65537, 0, -131072, 0, -131071, 0, -131070, 0, -131069, 0, -131068, 0, -131067, 0, -131066, 0, -131065, 0, -131064, 0, -131063, 0, -131062, 0, -131061, 0, -131060, 0, -131059, 0, -131058, 0, -131057, 0, -131056, 0, -131055, 0, -131054, 0, -131053, 0, -131052, 0, -131051, 0, -131050, 0, -131049, 0, -131048, 0, -131047, 0, -131046, 0, -131045, 0, -1, 0, -65536, 0, -65535, 0, -65534, 0, -65533, 0, -65532, 0, -65531, 0, -65530, 0, -65529, 0, -65528, 0, -65527, 0, -65526, 0, -65525, 0, -65524, 0, -65523, 0, -65522, 0, -65521, 0, -65520, 0, -65519, 0, -65518, 0, -65517, 0, -65516, 0, -65515, 0, -65514, 0, -65513, 0, -65512, 0, -65511, 0, -65510, 0, -65509, 0, 65535, 0, 0, 0, 1, 0, 2, 0, 3, 0, 4, 0, 5, 0, 6, 0, 7, 0, 8, 0, 9, 0, 10, 0, 11, 0, 12, 0, 13, 0, 14, 0, 15, 0, 16, 0, 17, 0, 18, 0, 19, 0, 20, 0, 21, 0, 22, 0, 23, 0, 24, 0, 25, 0, 26, 0, 27, 0, 131071, 0, 65536, 0, 65537, 0, 65538, 0, 65539, 0, 65540, 0, 65541, 0, 65542, 0, 65543, 0, 65544, 0, 65545, 0, 65546, 0, 65547, 0, 65548, 0, 65549, 0, 65550, 0, 65551, 0, 65552, 0, 65553, 0, 65554, 0, 65555, 0, 65556, 0, 65557, 0, 65558, 0, 65559, 0, 65560, 0, 65561, 0, 65562, 0, 65563, 0, 196607, 0, 131072, 0, 131073, 0, 131074, 0, 131075, 0, 131076, 0, 131077, 0, 131078, 0, 131079, 0, 131080, 0, 131081, 0, 131082, 0, 131083, 0, 131084, 0, 131085, 0, 131086, 0, 131087, 0, 131088, 2, 131089, 2, 131090, 2, 131091, 2, 131092, 0, 131093, 0, 131094, 0, 131095, 0, 131096, 0, 131097, 0, 131098, 0, 131099, 0, 262143, 0, 196608, 0, 196609, 0, 196610, 0, 196611, 0, 196612, 0, 196613, 0, 196614, 0, 196615, 1, 196616, 0, 196617, 1, 196618, 0, 196619, 0, 196620, 0, 196621, 0, 196622, 2, 196623, 2, 196624, 0, 196625, 0, 196626, 0, 196627, 0, 196628, 0, 196629, 0, 196630, 0, 196631, 0, 196632, 0, 196633, 0, 196634, 0, 196635, 0, 327679, 0, 262144, 0, 262145, 0, 262146, 0, 262147, 0, 262148, 0, 262149, 1, 262150, 0, 262151, 0, 262152, 0, 262153, 1, 262154, 1, 262155, 1, 262156, 1, 262157, 1, 262158, 2, 262159, 1, 262160, 0, 262161, 0, 262162, 0, 262163, 0, 262164, 0, 262165, 2, 262166, 0, 262167, 0, 262168, 0, 262169, 0, 262170, 0, 262171, 0, 393215, 0, 327680, 0, 327681, 0, 327682, 0, 327683, 0, 327684, 0, 327685, 1, 327686, 1, 327687, 0, 327688, 1, 327689, 1, 327690, 1, 327691, 2, 327692, 2, 327693, 2, 327694, 2, 327695, 2, 327696, 1, 327697, 0, 327698, 0, 327699, 0, 327700, 0, 327701, 0, 327702, 0, 327703, 0, 327704, 0, 327705, 0, 327706, 0, 327707, 0, 458751, 0, 393216, 0, 393217, 0, 393218, 0, 393219, 0, 393220, 0, 393221, 0, 393222, 1, 393223, 1, 393224, 0, 393225, 2, 393226, 2, 393227, 1, 393228, 1, 393229, 1, 393230, 2, 393231, 1, 393232, 2, 393233, 0, 393234, 2, 393235, 0, 393236, 0, 393237, 2, 393238, 0, 393239, 0, 393240, 0, 393241, 0, 393242, 0, 393243, 0, 524287, 0, 458752, 0, 458753, 0, 458754, 0, 458755, 0, 458756, 0, 458757, 0, 458758, 1, 458759, 1, 458760, 2, 458761, 1, 458762, 2, 458763, 2, 458764, 2, 458765, 2, 458766, 2, 458767, 1, 458768, 1, 458769, 0, 458770, 0, 458771, 2, 458772, 0, 458773, 0, 458774, 0, 458775, 0, 458776, 0, 458777, 0, 458778, 0, 458779, 0, 589823, 0, 524288, 0, 524289, 0, 524290, 0, 524291, 0, 524292, 2, 524293, 2, 524294, 2, 524295, 2, 524296, 2, 524297, 2, 524298, 2, 524299, 2, 524300, 2, 524301, 0, 524302, 2, 524303, 2, 524304, 2, 524305, 2, 524306, 0, 524307, 2, 524308, 0, 524309, 2, 524310, 0, 524311, 0, 524312, 0, 524313, 0, 524314, 0, 524315, 0, 655359, 0, 589824, 0, 589825, 0, 589826, 0, 589827, 0, 589828, 0, 589829, 0, 589830, 0, 589831, 0, 589832, 2, 589833, 1, 589834, 2, 589835, 2, 589836, 1, 589837, 2, 589838, 0, 589839, 1, 589840, 2, 589841, 1, 589842, 0, 589843, 2, 589844, 0, 589845, 0, 589846, 0, 589847, 0, 589848, 0, 589849, 0, 589850, 0, 589851, 0, 720895, 0, 655360, 0, 655361, 0, 655362, 0, 655363, 0, 655364, 0, 655365, 1, 655366, 0, 655367, 0, 655368, 2, 655369, 0, 655370, 2, 655371, 1, 655372, 2, 655373, 2, 655374, 1, 655375, 1, 655376, 2, 655377, 2, 655378, 2, 655379, 0, 655380, 2, 655381, 2, 655382, 0, 655383, 0, 655384, 0, 655385, 0, 655386, 0, 655387, 0, 786431, 0, 720896, 0, 720897, 0, 720898, 0, 720899, 0, 720900, 0, 720901, 1, 720902, 0, 720903, 0, 720904, 2, 720905, 0, 720906, 2, 720907, 2, 720908, 0, 720909, 1, 720910, 0, 720911, 1, 720912, 0, 720913, 2, 720914, 2, 720915, 0, 720916, 2, 720917, 0, 720918, 0, 720919, 0, 720920, 0, 720921, 0, 720922, 0, 720923, 0, 851967, 0, 786432, 0, 786433, 0, 786434, 0, 786435, 0, 786436, 0, 786437, 1, 786438, 1, 786439, 1, 786440, 0, 786441, 2, 786442, 2, 786443, 2, 786444, 2, 786445, 1, 786446, 1, 786447, 2, 786448, 2, 786449, 2, 786450, 0, 786451, 0, 786452, 2, 786453, 0, 786454, 0, 786455, 0, 786456, 0, 786457, 0, 786458, 0, 786459, 0, 917503, 0, 851968, 0, 851969, 0, 851970, 0, 851971, 0, 851972, 0, 851973, 0, 851974, 1, 851975, 0, 851976, 2, 851977, 0, 851978, 2, 851979, 2, 851980, 2, 851981, 2, 851982, 2, 851983, 2, 851984, 1, 851985, 0, 851986, 0, 851987, 2, 851988, 0, 851989, 0, 851990, 0, 851991, 0, 851992, 0, 851993, 0, 851994, 0, 851995, 0, 983039, 0, 917504, 0, 917505, 0, 917506, 0, 917507, 0, 917508, 0, 917509, 0, 917510, 2, 917511, 2, 917512, 2, 917513, 2, 917514, 1, 917515, 1, 917516, 0, 917517, 2, 917518, 1, 917519, 0, 917520, 2, 917521, 2, 917522, 2, 917523, 2, 917524, 0, 917525, 0, 917526, 0, 917527, 0, 917528, 0, 917529, 0, 917530, 0, 917531, 0, 1048575, 0, 983040, 0, 983041, 0, 983042, 0, 983043, 0, 983044, 0, 983045, 0, 983046, 0, 983047, 1, 983048, 0, 983049, 2, 983050, 2, 983051, 2, 983052, 0, 983053, 1, 983054, 0, 983055, 0, 983056, 0, 983057, 0, 983058, 0, 983059, 0, 983060, 0, 983061, 0, 983062, 0, 983063, 0, 983064, 0, 983065, 0, 983066, 0, 983067, 0, 1114111, 0, 1048576, 0, 1048577, 0, 1048578, 0, 1048579, 0, 1048580, 0, 1048581, 0, 1048582, 0, 1048583, 0, 1048584, 0, 1048585, 0, 1048586, 1, 1048587, 1, 1048588, 1, 1048589, 0, 1048590, 0, 1048591, 0, 1048592, 0, 1048593, 0, 1048594, 0, 1048595, 0, 1048596, 0, 1048597, 0, 1048598, 0, 1048599, 0, 1048600, 0, 1048601, 0, 1048602, 0, 1048603, 0, 1179647, 0, 1114112, 0, 1114113, 0, 1114114, 0, 1114115, 0, 1114116, 0, 1114117, 0, 1114118, 0, 1114119, 0, 1114120, 0, 1114121, 0, 1114122, 0, 1114123, 0, 1114124, 0, 1114125, 0, 1114126, 0, 1114127, 0, 1114128, 0, 1114129, 0, 1114130, 0, 1114131, 0, 1114132, 0, 1114133, 0, 1114134, 0, 1114135, 0, 1114136, 0, 1114137, 0, 1114138, 0, 1114139, 0, 1245183, 0, 1179648, 0, 1179649, 0, 1179650, 0, 1179651, 0, 1179652, 0, 1179653, 0, 1179654, 0, 1179655, 0, 1179656, 0, 1179657, 0, 1179658, 0, 1179659, 0, 1179660, 0, 1179661, 0, 1179662, 0, 1179663, 0, 1179664, 0, 1179665, 0, 1179666, 0, 1179667, 0, 1179668, 0, 1179669, 0, 1179670, 0, 1179671, 0, 1179672, 0, 1179673, 0, 1179674, 0, 1179675, 0, 1310719, 0, 1245184, 0, 1245185, 0, 1245186, 0, 1245187, 0, 1245188, 0, 1245189, 0, 1245190, 0, 1245191, 0, 1245192, 0, 1245193, 0, 1245194, 0, 1245195, 0, 1245196, 0, 1245197, 0, 1245198, 0, 1245199, 0, 1245200, 0, 1245201, 0, 1245202, 0, 1245203, 0, 1245204, 0, 1245205, 0, 1245206, 0, 1245207, 0, 1245208, 0, 1245209, 0, 1245210, 0, 1245211, 0, 1376255, 0, 1310720, 0, 1310721, 0, 1310722, 0, 1310723, 0, 1310724, 0, 1310725, 0, 1310726, 0, 1310727, 0, 1310728, 0, 1310729, 0, 1310730, 0, 1310731, 0, 1310732, 0, 1310733, 0, 1310734, 0, 1310735, 0, 1310736, 0, 1310737, 0, 1310738, 0, 1310739, 0, 1310740, 0, 1310741, 0, 1310742, 0, 1310743, 0, 1310744, 0, 1310745, 0, 1310746, 0, 1310747, 0 )

[node name="Joueur_euse" parent="." instance=ExtResource( 3 )]

transform/pos = Vector2( 354.656, 436.235 )

[node name="Partenaire" parent="." instance=ExtResource( 3 )]

transform/pos = Vector2( 361.043, 367.562 )

[node name="Bullogue" parent="." instance=ExtResource( 4 )]

[node name="AnimationPlayer" type="AnimationPlayer" parent="."]

playback/process_mode = 1
playback/default_blend_time = 0.0
root/root = NodePath("..")
anims/fin = SubResource( 1 )
playback/active = true
playback/speed = 1.0
blend_times = [  ]
autoplay = ""


