[gd_scene load_steps=3 format=1]

[ext_resource path="res://tombe.png" type="Texture" id=1]

[sub_resource type="RectangleShape2D" id=1]

custom_solver_bias = 0.0
extents = Vector2( 7.72022, 9.75763 )

[node name="Tombe" type="StaticBody2D"]

input/pickable = false
shapes/0/shape = SubResource( 1 )
shapes/0/transform = Matrix32( 1, 0, 0, 1, -0.581131, -1.7434 )
shapes/0/trigger = false
collision/layers = 1
collision/mask = 1
constant_linear_velocity = Vector2( 0, 0 )
constant_angular_velocity = 0.0
friction = 1.0
bounce = 0.0

[node name="Sprite" type="Sprite" parent="."]

texture = ExtResource( 1 )

[node name="CollisionShape2D" type="CollisionShape2D" parent="."]

transform/pos = Vector2( -0.581131, -1.7434 )
shape = SubResource( 1 )
trigger = false
_update_shape_index = 0


