<?xml version="1.0" encoding="UTF-8" standalone="no"?>
<svg
   xmlns:dc="http://purl.org/dc/elements/1.1/"
   xmlns:cc="http://creativecommons.org/ns#"
   xmlns:rdf="http://www.w3.org/1999/02/22-rdf-syntax-ns#"
   xmlns:svg="http://www.w3.org/2000/svg"
   xmlns="http://www.w3.org/2000/svg"
   xmlns:sodipodi="http://sodipodi.sourceforge.net/DTD/sodipodi-0.dtd"
   xmlns:inkscape="http://www.inkscape.org/namespaces/inkscape"
   version="1.1"
   x="0px"
   y="0px"
   viewBox="0 0 24 30"
   style="enable-background:new 0 0 24 24;"
   xml:space="preserve"
   id="svg36"
   sodipodi:docname="pic.svg"
   inkscape:version="0.92.3 (2405546, 2018-03-11)"><metadata
     id="metadata42"><rdf:RDF><cc:Work
         rdf:about=""><dc:format>image/svg+xml</dc:format><dc:type
           rdf:resource="http://purl.org/dc/dcmitype/StillImage" /></cc:Work></rdf:RDF></metadata><defs
     id="defs40" /><sodipodi:namedview
     pagecolor="#ffffff"
     bordercolor="#666666"
     borderopacity="1"
     objecttolerance="10"
     gridtolerance="10"
     guidetolerance="10"
     inkscape:pageopacity="0"
     inkscape:pageshadow="2"
     inkscape:window-width="640"
     inkscape:window-height="480"
     id="namedview38"
     showgrid="false"
     inkscape:zoom="7.8666667"
     inkscape:cx="12"
     inkscape:cy="-5.3389831"
     inkscape:window-x="0"
     inkscape:window-y="0"
     inkscape:window-maximized="0"
     inkscape:current-layer="svg36" /><g
     id="g30"><g
       id="g14"><g
         id="g4"><path
           d="M23.5,20h-13c-0.276,0-0.5-0.224-0.5-0.5s0.224-0.5,0.5-0.5H23V6h-9.5C13.224,6,13,5.776,13,5.5S13.224,5,13.5,5h10     C23.776,5,24,5.224,24,5.5v14C24,19.776,23.776,20,23.5,20z"
           id="path2" /></g><g
         id="g8"><path
           d="M23.5,18c-0.128,0-0.256-0.049-0.354-0.146L18.5,13.207l-1.646,1.646c-0.195,0.195-0.512,0.195-0.707,0L13.5,12.207     l-2.646,2.646c-0.195,0.195-0.512,0.195-0.707,0s-0.195-0.512,0-0.707l3-3c0.195-0.195,0.512-0.195,0.707,0l2.646,2.646     l1.646-1.646c0.195-0.195,0.512-0.195,0.707,0l5,5c0.195,0.195,0.195,0.512,0,0.707C23.756,17.951,23.628,18,23.5,18z"
           id="path6" /></g><g
         id="g12"><path
           d="M19,11c-1.103,0-2-0.897-2-2s0.897-2,2-2s2,0.897,2,2S20.103,11,19,11z M19,8c-0.552,0-1,0.449-1,1s0.448,1,1,1     s1-0.449,1-1S19.552,8,19,8z"
           id="path10" /></g></g><g
       id="g28"><g
         id="g18"><path
           d="M9.5,24c-0.723,0-1.433-0.129-2.111-0.382l-5.767-2.164C0.652,21.092,0,20.151,0,19.114V4.988     c0-1.113,0.716-2.075,1.782-2.395l6.659-1.998l0,0C9.759,0.201,11.125,0,12.5,0C13.327,0,14,0.673,14,1.5v5.279     c0,0.646-0.412,1.218-1.025,1.423l-1.633,0.544C11.137,8.814,11,9.005,11,9.221V22.5C11,23.327,10.327,24,9.5,24z M8.728,1.554     L2.069,3.551C1.43,3.743,1,4.321,1,4.988v14.126c0,0.622,0.391,1.187,0.973,1.403l5.767,2.164C8.305,22.893,8.897,23,9.499,23     C9.775,23,10,22.775,10,22.5V9.221c0-0.646,0.412-1.218,1.025-1.423l1.633-0.544C12.863,7.186,13,6.995,13,6.779V1.5     C13,1.224,12.776,1,12.5,1C11.222,1,9.953,1.186,8.728,1.554L8.728,1.554z"
           id="path16" /></g><g
         id="g22"><path
           d="M16.5,6C16.224,6,16,5.776,16,5.5v-1C16,3.673,15.327,3,14.5,3h-1C13.224,3,13,2.776,13,2.5S13.224,2,13.5,2h1     C15.879,2,17,3.122,17,4.5v1C17,5.776,16.776,6,16.5,6z"
           id="path20" /></g><g
         id="g26"><path
           d="M14.5,22h-4c-0.276,0-0.5-0.224-0.5-0.5s0.224-0.5,0.5-0.5h4c0.827,0,1.5-0.673,1.5-1.5c0-0.276,0.224-0.5,0.5-0.5     s0.5,0.224,0.5,0.5C17,20.879,15.879,22,14.5,22z"
           id="path24" /></g></g></g></svg>