<?xml version="1.0" encoding="UTF-8" standalone="no"?>
<svg
   xmlns:dc="http://purl.org/dc/elements/1.1/"
   xmlns:cc="http://creativecommons.org/ns#"
   xmlns:rdf="http://www.w3.org/1999/02/22-rdf-syntax-ns#"
   xmlns:svg="http://www.w3.org/2000/svg"
   xmlns="http://www.w3.org/2000/svg"
   xmlns:sodipodi="http://sodipodi.sourceforge.net/DTD/sodipodi-0.dtd"
   xmlns:inkscape="http://www.inkscape.org/namespaces/inkscape"
   version="1.1"
   x="0px"
   y="0px"
   viewBox="0 0 100 125"
   enable-background="new 0 0 100 100"
   xml:space="preserve"
   id="svg8"
   sodipodi:docname="monitoring.svg"
   inkscape:version="0.92.3 (2405546, 2018-03-11)"><metadata
     id="metadata14"><rdf:RDF><cc:Work
         rdf:about=""><dc:format>image/svg+xml</dc:format><dc:type
           rdf:resource="http://purl.org/dc/dcmitype/StillImage" /></cc:Work></rdf:RDF></metadata><defs
     id="defs12" /><sodipodi:namedview
     pagecolor="#ffffff"
     bordercolor="#666666"
     borderopacity="1"
     objecttolerance="10"
     gridtolerance="10"
     guidetolerance="10"
     inkscape:pageopacity="0"
     inkscape:pageshadow="2"
     inkscape:window-width="852"
     inkscape:window-height="480"
     id="namedview10"
     showgrid="false"
     inkscape:zoom="1.888"
     inkscape:cx="50"
     inkscape:cy="62.5"
     inkscape:window-x="0"
     inkscape:window-y="0"
     inkscape:window-maximized="0"
     inkscape:current-layer="svg8" /><path
     d="M56.96,38.983c0.006,3.839-3.083,6.94-6.926,6.953c-3.887,0.013-6.99-3.069-6.993-6.946c0-0.116,0.003-0.231,0.008-0.346  c0.582,0.225,1.217,0.349,1.884,0.347c2.812-0.01,5.072-2.278,5.068-5.087c-0.001-0.658-0.125-1.283-0.349-1.857  c0.103-0.005,0.205-0.008,0.309-0.009C53.849,32.026,56.954,35.107,56.96,38.983z M77.455,41.441c0,0-0.516,0.583-1.847,1.94  c-3.81,3.886-7.994,7.305-12.791,9.921c-3.719,2.028-7.64,3.432-11.916,3.631c-0.302,0.014-0.602,0.021-0.901,0.022  c-0.299-0.001-0.599-0.008-0.901-0.022c-4.276-0.199-8.197-1.603-11.916-3.631c-4.796-2.616-8.981-6.035-12.791-9.921  c-1.331-1.358-1.847-1.94-1.847-1.94c-1.105-1.248-1.052-3.239,0.119-4.426c0,0,5.063-5.133,9.188-8.197  c3.488-2.591,7.176-4.828,11.31-6.256c2.248-0.777,4.522-1.224,6.839-1.229c2.317,0.005,4.591,0.452,6.839,1.229  c4.133,1.428,7.822,3.665,11.31,6.256c4.125,3.064,9.188,8.197,9.188,8.197C78.507,38.202,78.561,40.194,77.455,41.441z   M62.556,39.362c-0.002-0.08-0.002-0.171-0.001-0.204c0,0,0,0,0-0.03c0.001-0.094,0-0.188-0.001-0.282  c0-0.011,0.001-0.021,0.001-0.032c0.07-6.952-5.522-12.64-12.487-12.702c-0.023,0-0.046,0-0.069,0c-0.023,0-0.046-0.001-0.069,0  c-6.965,0.062-12.557,5.75-12.487,12.702c0,0.011,0.001,0.021,0.001,0.032c-0.001,0.094-0.002,0.188-0.001,0.282  c0,0.03,0,0.03,0,0.03c0.001,0.032,0.001,0.124-0.001,0.204c0,0,0,0,0.001,0.073c0,0.031,0.002,0.061,0.002,0.092  c-0.001,0.074-0.003,0.148-0.002,0.222C37.513,46.597,43.176,52.192,50,52.165c6.824,0.027,12.487-5.568,12.556-12.415  c0.001-0.074-0.001-0.148-0.002-0.222c0.001-0.031,0.002-0.061,0.002-0.092C62.556,39.362,62.556,39.362,62.556,39.362z   M93.932,61.734v10.535h-0.008c-0.116,3.006-2.588,5.408-5.622,5.408H59.796c0.051,1.263,0.754,6.997,9.318,8.074h-0.41  c1.352,0,2.449,1.096,2.449,2.449s-1.096,2.449-2.449,2.449H31.157c-1.352,0-2.449-1.096-2.449-2.449s1.096-2.449,2.449-2.449  h-0.275c8.564-1.076,9.268-6.81,9.318-8.074H11.696c-3.034,0-5.506-2.402-5.622-5.408H6.071v-0.12  c-0.001-0.034-0.003-0.067-0.003-0.101V71.58c0-0.034,0.002-0.067,0.003-0.101v-8.546c0-0.026-0.002-0.052-0.002-0.078V15.74  c0-3.523,2.866-6.389,6.389-6.389H87.54c3.523,0,6.389,2.866,6.389,6.389v45.995L93.932,61.734z M53.125,71.376  c0-1.726-1.399-3.125-3.125-3.125c-1.726,0-3.125,1.399-3.125,3.125c0,1.726,1.399,3.125,3.125,3.125S53.125,73.102,53.125,71.376z   M88.66,62.855V15.74c0-0.617-0.502-1.12-1.12-1.12H12.457c-0.617,0-1.12,0.502-1.12,1.12v47.115c0,0.617,0.502,1.12,1.12,1.12  H87.54C88.158,63.975,88.66,63.473,88.66,62.855L88.66,62.855z"
     id="path2" /></svg>