<?xml version="1.0" encoding="UTF-8" standalone="no"?>
<svg
   xmlns:dc="http://purl.org/dc/elements/1.1/"
   xmlns:cc="http://creativecommons.org/ns#"
   xmlns:rdf="http://www.w3.org/1999/02/22-rdf-syntax-ns#"
   xmlns:svg="http://www.w3.org/2000/svg"
   xmlns="http://www.w3.org/2000/svg"
   xmlns:sodipodi="http://sodipodi.sourceforge.net/DTD/sodipodi-0.dtd"
   xmlns:inkscape="http://www.inkscape.org/namespaces/inkscape"
   viewBox="0 0 62 85"
   version="1.1"
   x="0px"
   y="0px"
   id="svg16"
   sodipodi:docname="vpn.svg"
   inkscape:version="0.92.3 (2405546, 2018-03-11)">
  <metadata
     id="metadata22">
    <rdf:RDF>
      <cc:Work
         rdf:about="">
        <dc:format>image/svg+xml</dc:format>
        <dc:type
           rdf:resource="http://purl.org/dc/dcmitype/StillImage" />
      </cc:Work>
    </rdf:RDF>
  </metadata>
  <defs
     id="defs20" />
  <sodipodi:namedview
     pagecolor="#ffffff"
     bordercolor="#666666"
     borderopacity="1"
     objecttolerance="10"
     gridtolerance="10"
     guidetolerance="10"
     inkscape:pageopacity="0"
     inkscape:pageshadow="2"
     inkscape:window-width="852"
     inkscape:window-height="480"
     id="namedview18"
     showgrid="false"
     inkscape:zoom="2.7764706"
     inkscape:cx="31"
     inkscape:cy="42.5"
     inkscape:window-x="0"
     inkscape:window-y="0"
     inkscape:window-maximized="0"
     inkscape:current-layer="svg16" />
  <title
     id="title2">vpn, connections. network, private, anonymous</title>
  <desc
     id="desc4">Created with Sketch.</desc>
  <g
     stroke="none"
     stroke-width="1"
     fill="none"
     fill-rule="evenodd"
     id="g10">
    <g
       transform="translate(-179.000000, -56.000000)"
       fill="#000000"
       fill-rule="nonzero"
       id="g8">
      <path
         d="M194.143594,83.1547005 L189.65177,80.5613451 C187.773256,82.1676811 185.013726,82.5023712 182.751289,81.1961524 C179.881533,79.5392982 178.898282,75.8697557 180.555136,73 C182.211991,70.1302443 185.881533,69.1469933 188.751289,70.8038476 C191.013726,72.1100664 192.103641,74.6672347 191.65177,77.0972435 L196.143594,79.6905989 L208,72.8452995 L208,67.6585886 C205.669615,66.8349158 204,64.6124377 204,62 C204,58.6862915 206.686292,56 210,56 C213.313708,56 216,58.6862915 216,62 C216,64.6124377 214.330385,66.8349158 212,67.6585886 L212,72.8452995 L223.856406,79.6905989 L228.34823,77.0972435 C227.896359,74.6672347 228.986274,72.1100664 231.248711,70.8038476 C234.118467,69.1469933 237.788009,70.1302443 239.444864,73 C241.101718,75.8697557 240.118467,79.5392982 237.248711,81.1961524 C234.986274,82.5023712 232.226744,82.1676811 230.34823,80.5613451 L225.856406,83.1547005 L225.856406,96.8452995 L230.34823,99.4386549 C232.226744,97.8323189 234.986274,97.4976288 237.248711,98.8038476 C240.118467,100.460702 241.101718,104.130244 239.444864,107 C237.788009,109.869756 234.118467,110.853007 231.248711,109.196152 C228.986274,107.889934 227.896359,105.332765 228.34823,102.902757 L223.856406,100.309401 L212,107.154701 L212,112.341411 C214.330385,113.165084 216,115.387562 216,118 C216,121.313708 213.313708,124 210,124 C206.686292,124 204,121.313708 204,118 C204,115.387562 205.669615,113.165084 208,112.341411 L208,107.154701 L196.143594,100.309401 L191.65177,102.902757 C192.103641,105.332765 191.013726,107.889934 188.751289,109.196152 C185.881533,110.853007 182.211991,109.869756 180.555136,107 C178.898282,104.130244 179.881533,100.460702 182.751289,98.8038476 C185.013726,97.4976288 187.773256,97.8323189 189.65177,99.4386549 L194.143594,96.8452995 L194.143594,83.1547005 Z M210,76.3094011 L198.143594,83.1547005 L198.143594,96.8452995 L210,103.690599 L221.856406,96.8452995 L221.856406,83.1547005 L210,76.3094011 Z M210,64 C211.104569,64 212,63.1045695 212,62 C212,60.8954305 211.104569,60 210,60 C208.895431,60 208,60.8954305 208,62 C208,63.1045695 208.895431,64 210,64 Z M235.248711,77.7320508 C236.205297,77.1797661 236.533047,75.9565852 235.980762,75 C235.428477,74.0434148 234.205297,73.7156644 233.248711,74.2679492 C232.292126,74.8202339 231.964376,76.0434148 232.51666,77 C233.068945,77.9565852 234.292126,78.2843356 235.248711,77.7320508 Z M233.248711,105.732051 C234.205297,106.284336 235.428477,105.956585 235.980762,105 C236.533047,104.043415 236.205297,102.820234 235.248711,102.267949 C234.292126,101.715664 233.068945,102.043415 232.51666,103 C231.964376,103.956585 232.292126,105.179766 233.248711,105.732051 Z M210,116 C208.895431,116 208,116.895431 208,118 C208,119.104569 208.895431,120 210,120 C211.104569,120 212,119.104569 212,118 C212,116.895431 211.104569,116 210,116 Z M184.751289,102.267949 C183.794703,102.820234 183.466953,104.043415 184.019238,105 C184.571523,105.956585 185.794703,106.284336 186.751289,105.732051 C187.707874,105.179766 188.035624,103.956585 187.48334,103 C186.931055,102.043415 185.707874,101.715664 184.751289,102.267949 Z M187.48334,77 C188.035624,76.0434148 187.707874,74.8202339 186.751289,74.2679492 C185.794703,73.7156644 184.571523,74.0434148 184.019238,75 C183.466953,75.9565852 183.794703,77.1797661 184.751289,77.7320508 C185.707874,78.2843356 186.931055,77.9565852 187.48334,77 Z"
         id="path6" />
    </g>
  </g>
</svg>
