<svg xmlns="http://www.w3.org/2000/svg" height="19.623" width="19.476">
  <path d="M13.45 8.917l6.026 2.138-1.36 3.906-5.465-1.95 1.354 5.637-4.063.976-1.35-5.63-3.976 4.23-3.004-2.867L6 10.71 0 8.637 1.348 4.72 6.8 6.61 5.45.977 9.505 0l1.353 5.625 3.993-4.165 3.003 2.866-4.405 4.59z" fill="#fe2015"/>
</svg>
