{
  "@xmlns:xsi": "http://www.w3.org/2001/XMLSchema-instance",
  "uid": "VTANR5L15V712",
  "numero": "712",
  "organeRef": "PO717460",
  "legislature": "15",
  "sessionRef": "SCR5A2018O1",
  "seanceRef": "RUANR5L15S2018IDS21058",
  "dateScrutin": "2018-05-28T02:00:00.000+02:00",
  "quantiemeJourSeance": "2",
  "typeVote": {
    "codeTypeVote": "SPO",
    "libelleTypeVote": "scrutin public ordinaire",
    "typeMajorite": "majorité absolue des suffrages exprimés"
  },
  "sort": {
    "code": "rejeté",
    "libelle": "L'Assemblée nationale n'a pas adopté"
  },
  "titre": "l'amendement n° 964 de la commission du développement durable et les amendements identiques après l'article 14 septies du projet de loi pour l'équilibre des relations commerciales dans le secteur agricole et alimentaire et une alimentation saine et durable (première lecture).",
  "demandeur": {
    "texte": "Président du groupe \"La France insoumise\"",
    "referenceLegislative": null
  },
  "objet": {
    "libelle": "l'amendement n° 964 de la commission du développement durable et les amendements identiques après l'article 14 septies du projet de loi pour l'équilibre des relations commerciales dans le secteur agricole et alimentaire et une alimentation saine et durable (première lecture).",
    "referenceLegislative": null
  },
  "modePublicationDesVotes": "DecompteNominatif",
  "syntheseVote": {
    "nombreVotants": "84",
    "suffragesExprimes": "78",
    "nbrSuffragesRequis": "40",
    "annonce": "L'Assemblée nationale n'a pas adopté",
    "decompte": {
      "pour": "9",
      "contre": "69",
      "abstentions": "6",
      "nonVotants": "1",
      "nonVotantsVolontaires": "0"
    }
  },
  "ventilationVotes": {
    "organe": {
      "organeRef": "PO717460",
      "groupes": {
        "groupe": [
          {
            "organeRef": "PO730964",
            "nombreMembresGroupe": "313",
            "vote": {
              "positionMajoritaire": "contre",
              "decompteVoix": {
                "pour": "6",
                "contre": "42",
                "nonVotants": "1",
                "abstentions": "4",
                "nonVotantsVolontaires": "4"
              },
              "decompteNominatif": {
                "nonVotants": {
                  "votant": {
                    "acteurRef": "PA332747",
                    "mandatRef": "PM722798",
                    "causePositionVote": "PSE"
                  }
                },
                "abstentions": {
                  "votant": [
                    {
                      "acteurRef": "PA720310",
                      "mandatRef": "PM722926",
                      "parDelegation": "false"
                    },
                    {
                      "acteurRef": "PA720394",
                      "mandatRef": "PM722950",
                      "parDelegation": "false"
                    },
                    {
                      "acteurRef": "PA721726",
                      "mandatRef": "PM723366",
                      "parDelegation": "false"
                    },
                    {
                      "acteurRef": "PA722366",
                      "mandatRef": "PM723554",
                      "parDelegation": "false"
                    }
                  ]
                },
                "pours": {
                  "votant": [
                    {
                      "acteurRef": "PA609520",
                      "mandatRef": "PM723508",
                      "parDelegation": "false"
                    },
                    {
                      "acteurRef": "PA718962",
                      "mandatRef": "PM722514",
                      "parDelegation": "false"
                    },
                    {
                      "acteurRef": "PA719396",
                      "mandatRef": "PM722650",
                      "parDelegation": "false"
                    },
                    {
                      "acteurRef": "PA720278",
                      "mandatRef": "PM722916",
                      "parDelegation": "false"
                    },
                    {
                      "acteurRef": "PA720538",
                      "mandatRef": "PM722994",
                      "parDelegation": "false"
                    },
                    {
                      "acteurRef": "PA721450",
                      "mandatRef": "PM723278",
                      "parDelegation": "false"
                    }
                  ]
                },
                "contres": {
                  "votant": [
                    {
                      "acteurRef": "PA722398",
                      "mandatRef": "PM723562",
                      "parDelegation": "false"
                    },
                    {
                      "acteurRef": "PA606171",
                      "mandatRef": "PM722632",
                      "parDelegation": "false"
                    },
                    {
                      "acteurRef": "PA721880",
                      "mandatRef": "PM723410",
                      "parDelegation": "false"
                    },
                    {
                      "acteurRef": "PA672",
                      "mandatRef": "PM723230",
                      "parDelegation": "false"
                    },
                    {
                      "acteurRef": "PA718710",
                      "mandatRef": "PM722432",
                      "parDelegation": "false"
                    },
                    {
                      "acteurRef": "PA718876",
                      "mandatRef": "PM722486",
                      "parDelegation": "false"
                    },
                    {
                      "acteurRef": "PA719032",
                      "mandatRef": "PM722538",
                      "parDelegation": "false"
                    },
                    {
                      "acteurRef": "PA719242",
                      "mandatRef": "PM722604",
                      "parDelegation": "false"
                    },
                    {
                      "acteurRef": "PA719258",
                      "mandatRef": "PM722608",
                      "parDelegation": "false"
                    },
                    {
                      "acteurRef": "PA719338",
                      "mandatRef": "PM722630",
                      "parDelegation": "false"
                    },
                    {
                      "acteurRef": "PA719372",
                      "mandatRef": "PM722640",
                      "parDelegation": "false"
                    },
                    {
                      "acteurRef": "PA719412",
                      "mandatRef": "PM722654",
                      "parDelegation": "false"
                    },
                    {
                      "acteurRef": "PA719456",
                      "mandatRef": "PM722668",
                      "parDelegation": "false"
                    },
                    {
                      "acteurRef": "PA719480",
                      "mandatRef": "PM722674",
                      "parDelegation": "false"
                    },
                    {
                      "acteurRef": "PA719540",
                      "mandatRef": "PM722690",
                      "parDelegation": "false"
                    },
                    {
                      "acteurRef": "PA719652",
                      "mandatRef": "PM722722",
                      "parDelegation": "false"
                    },
                    {
                      "acteurRef": "PA719700",
                      "mandatRef": "PM722734",
                      "parDelegation": "false"
                    },
                    {
                      "acteurRef": "PA719718",
                      "mandatRef": "PM722740",
                      "parDelegation": "false"
                    },
                    {
                      "acteurRef": "PA719770",
                      "mandatRef": "PM722758",
                      "parDelegation": "false"
                    },
                    {
                      "acteurRef": "PA719830",
                      "mandatRef": "PM722774",
                      "parDelegation": "false"
                    },
                    {
                      "acteurRef": "PA719858",
                      "mandatRef": "PM722782",
                      "parDelegation": "false"
                    },
                    {
                      "acteurRef": "PA719960",
                      "mandatRef": "PM722816",
                      "parDelegation": "false"
                    },
                    {
                      "acteurRef": "PA719972",
                      "mandatRef": "PM722820",
                      "parDelegation": "false"
                    },
                    {
                      "acteurRef": "PA720222",
                      "mandatRef": "PM722896",
                      "parDelegation": "false"
                    },
                    {
                      "acteurRef": "PA720268",
                      "mandatRef": "PM722912",
                      "parDelegation": "false"
                    },
                    {
                      "acteurRef": "PA720342",
                      "mandatRef": "PM722934",
                      "parDelegation": "false"
                    },
                    {
                      "acteurRef": "PA720354",
                      "mandatRef": "PM722940",
                      "parDelegation": "false"
                    },
                    {
                      "acteurRef": "PA720560",
                      "mandatRef": "PM723000",
                      "parDelegation": "false"
                    },
                    {
                      "acteurRef": "PA720590",
                      "mandatRef": "PM723010",
                      "parDelegation": "false"
                    },
                    {
                      "acteurRef": "PA720830",
                      "mandatRef": "PM723088",
                      "parDelegation": "false"
                    },
                    {
                      "acteurRef": "PA720870",
                      "mandatRef": "PM723100",
                      "parDelegation": "false"
                    },
                    {
                      "acteurRef": "PA721134",
                      "mandatRef": "PM723184",
                      "parDelegation": "false"
                    },
                    {
                      "acteurRef": "PA721522",
                      "mandatRef": "PM723300",
                      "parDelegation": "false"
                    },
                    {
                      "acteurRef": "PA721542",
                      "mandatRef": "PM723308",
                      "parDelegation": "false"
                    },
                    {
                      "acteurRef": "PA721808",
                      "mandatRef": "PM723388",
                      "parDelegation": "false"
                    },
                    {
                      "acteurRef": "PA722094",
                      "mandatRef": "PM723470",
                      "parDelegation": "false"
                    },
                    {
                      "acteurRef": "PA722134",
                      "mandatRef": "PM723482",
                      "parDelegation": "false"
                    },
                    {
                      "acteurRef": "PA722228",
                      "mandatRef": "PM723512",
                      "parDelegation": "false"
                    },
                    {
                      "acteurRef": "PA722268",
                      "mandatRef": "PM723522",
                      "parDelegation": "false"
                    },
                    {
                      "acteurRef": "PA722312",
                      "mandatRef": "PM723536",
                      "parDelegation": "false"
                    },
                    {
                      "acteurRef": "PA643205",
                      "mandatRef": "PM723358",
                      "parDelegation": "false"
                    },
                    {
                      "acteurRef": "PA719326",
                      "mandatRef": "PM733709",
                      "parDelegation": "false"
                    }
                  ]
                }
              }
            }
          },
          {
            "organeRef": "PO730934",
            "nombreMembresGroupe": "102",
            "vote": {
              "positionMajoritaire": "contre",
              "decompteVoix": {
                "pour": "0",
                "contre": "15",
                "nonVotants": "0",
                "abstentions": "0",
                "nonVotantsVolontaires": "0"
              },
              "decompteNominatif": {
                "nonVotants": null,
                "abstentions": null,
                "pours": null,
                "contres": {
                  "votant": [
                    {
                      "acteurRef": "PA606712",
                      "mandatRef": "PM722756",
                      "parDelegation": "false"
                    },
                    {
                      "acteurRef": "PA1695",
                      "mandatRef": "PM723322",
                      "parDelegation": "false"
                    },
                    {
                      "acteurRef": "PA720644",
                      "mandatRef": "PM723026",
                      "parDelegation": "false"
                    },
                    {
                      "acteurRef": "PA267289",
                      "mandatRef": "PM754301",
                      "parDelegation": "false"
                    },
                    {
                      "acteurRef": "PA267429",
                      "mandatRef": "PM722818",
                      "parDelegation": "false"
                    },
                    {
                      "acteurRef": "PA334149",
                      "mandatRef": "PM723034",
                      "parDelegation": "false"
                    },
                    {
                      "acteurRef": "PA336316",
                      "mandatRef": "PM723406",
                      "parDelegation": "false"
                    },
                    {
                      "acteurRef": "PA340853",
                      "mandatRef": "PM722534",
                      "parDelegation": "false"
                    },
                    {
                      "acteurRef": "PA608016",
                      "mandatRef": "PM723024",
                      "parDelegation": "false"
                    },
                    {
                      "acteurRef": "PA719318",
                      "mandatRef": "PM722624",
                      "parDelegation": "false"
                    },
                    {
                      "acteurRef": "PA720630",
                      "mandatRef": "PM723020",
                      "parDelegation": "false"
                    },
                    {
                      "acteurRef": "PA330909",
                      "mandatRef": "PM722548",
                      "parDelegation": "false"
                    },
                    {
                      "acteurRef": "PA266793",
                      "mandatRef": "PM722550",
                      "parDelegation": "false"
                    },
                    {
                      "acteurRef": "PA709315",
                      "mandatRef": "PM722526",
                      "parDelegation": "false"
                    },
                    {
                      "acteurRef": "PA712015",
                      "mandatRef": "PM722448",
                      "parDelegation": "false"
                    }
                  ]
                }
              }
            }
          },
          {
            "organeRef": "PO730970",
            "nombreMembresGroupe": "47",
            "vote": {
              "positionMajoritaire": "contre",
              "decompteVoix": {
                "pour": "1",
                "contre": "4",
                "nonVotants": "0",
                "abstentions": "1",
                "nonVotantsVolontaires": "1"
              },
              "decompteNominatif": {
                "nonVotants": null,
                "abstentions": {
                  "votant": {
                    "acteurRef": "PA720256",
                    "mandatRef": "PM722908",
                    "parDelegation": "false"
                  }
                },
                "pours": {
                  "votant": {
                    "acteurRef": "PA720092",
                    "mandatRef": "PM722858",
                    "parDelegation": "false"
                  }
                },
                "contres": {
                  "votant": [
                    {
                      "acteurRef": "PA719640",
                      "mandatRef": "PM722718",
                      "parDelegation": "false"
                    },
                    {
                      "acteurRef": "PA719938",
                      "mandatRef": "PM722806",
                      "parDelegation": "false"
                    },
                    {
                      "acteurRef": "PA720002",
                      "mandatRef": "PM722830",
                      "parDelegation": "false"
                    },
                    {
                      "acteurRef": "PA722162",
                      "mandatRef": "PM723490",
                      "parDelegation": "false"
                    }
                  ]
                }
              }
            }
          },
          {
            "organeRef": "PO744425",
            "nombreMembresGroupe": "32",
            "vote": {
              "positionMajoritaire": "contre",
              "decompteVoix": {
                "pour": "0",
                "contre": "7",
                "nonVotants": "0",
                "abstentions": "0",
                "nonVotantsVolontaires": "0"
              },
              "decompteNominatif": {
                "nonVotants": null,
                "abstentions": null,
                "pours": null,
                "contres": {
                  "votant": [
                    {
                      "acteurRef": "PA942",
                      "mandatRef": "PM722900",
                      "parDelegation": "false"
                    },
                    {
                      "acteurRef": "PA267355",
                      "mandatRef": "PM723524",
                      "parDelegation": "false"
                    },
                    {
                      "acteurRef": "PA331582",
                      "mandatRef": "PM722646",
                      "parDelegation": "false"
                    },
                    {
                      "acteurRef": "PA331567",
                      "mandatRef": "PM722644",
                      "parDelegation": "false"
                    },
                    {
                      "acteurRef": "PA332228",
                      "mandatRef": "PM722754",
                      "parDelegation": "false"
                    },
                    {
                      "acteurRef": "PA720230",
                      "mandatRef": "PM722898",
                      "parDelegation": "false"
                    },
                    {
                      "acteurRef": "PA719806",
                      "mandatRef": "PM722768",
                      "parDelegation": "false"
                    }
                  ]
                }
              }
            }
          },
          {
            "organeRef": "PO730946",
            "nombreMembresGroupe": "30",
            "vote": {
              "positionMajoritaire": "abstention",
              "decompteVoix": {
                "pour": "0",
                "contre": "0",
                "nonVotants": "0",
                "abstentions": "1",
                "nonVotantsVolontaires": "1"
              },
              "decompteNominatif": {
                "nonVotants": null,
                "abstentions": {
                  "votant": {
                    "acteurRef": "PA333285",
                    "mandatRef": "PM722906",
                    "parDelegation": "false"
                  }
                },
                "pours": null,
                "contres": null
              }
            }
          },
          {
            "organeRef": "PO723569",
            "nombreMembresGroupe": "20",
            "vote": {
              "positionMajoritaire": "pour",
              "decompteVoix": {
                "pour": "1",
                "contre": "0",
                "nonVotants": "0",
                "abstentions": "0",
                "nonVotantsVolontaires": "0"
              },
              "decompteNominatif": {
                "nonVotants": null,
                "abstentions": null,
                "pours": {
                  "votant": {
                    "acteurRef": "PA335999",
                    "mandatRef": "PM723480",
                    "parDelegation": "false"
                  }
                },
                "contres": null
              }
            }
          },
          {
            "organeRef": "PO730958",
            "nombreMembresGroupe": "17",
            "vote": {
              "positionMajoritaire": "pour",
              "decompteVoix": {
                "pour": "1",
                "contre": "0",
                "nonVotants": "0",
                "abstentions": "0",
                "nonVotantsVolontaires": "0"
              },
              "decompteNominatif": {
                "nonVotants": null,
                "abstentions": null,
                "pours": {
                  "votant": {
                    "acteurRef": "PA719578",
                    "mandatRef": "PM722702",
                    "parDelegation": "false"
                  }
                },
                "contres": null
              }
            }
          },
          {
            "organeRef": "PO730940",
            "nombreMembresGroupe": "16",
            "vote": {
              "positionMajoritaire": "contre",
              "decompteVoix": {
                "pour": "0",
                "contre": "1",
                "nonVotants": "0",
                "abstentions": "0",
                "nonVotantsVolontaires": "0"
              },
              "decompteNominatif": {
                "nonVotants": null,
                "abstentions": null,
                "pours": null,
                "contres": {
                  "votant": {
                    "acteurRef": "PA722202",
                    "mandatRef": "PM723502",
                    "parDelegation": "false"
                  }
                }
              }
            }
          }
        ]
      }
    }
  },
  "miseAuPoint": null,
  "@xmlns": "http://schemas.assemblee-nationale.fr/referentiel"
}