{
  "@xmlns:xsi": "http://www.w3.org/2001/XMLSchema-instance",
  "uid": "VTANR5L15V578",
  "numero": "578",
  "organeRef": "PO717460",
  "legislature": "15",
  "sessionRef": "SCR5A2018O1",
  "seanceRef": "RUANR5L15S2018IDS21079",
  "dateScrutin": "2018-04-22T02:00:00.000+02:00",
  "quantiemeJourSeance": "2",
  "typeVote": {
    "codeTypeVote": "SPS",
    "libelleTypeVote": "scrutin public solennel",
    "typeMajorite": "majorité absolue des suffrages exprimés"
  },
  "sort": {
    "code": "adopté",
    "libelle": "l'Assemblée nationale a adopté"
  },
  "titre": "l'ensemble du projet de loi pour une immigration maîtrisée, un droit d'asile effectif et une intégration réussie (première lecture).",
  "demandeur": {
    "texte": "Conférence des Présidents",
    "referenceLegislative": null
  },
  "objet": {
    "libelle": "l'ensemble du projet de loi pour une immigration maîtrisée, un droit d'asile effectif et une intégration réussie (première lecture).",
    "referenceLegislative": null
  },
  "modePublicationDesVotes": "DecompteNominatif",
  "syntheseVote": {
    "nombreVotants": "391",
    "suffragesExprimes": "367",
    "nbrSuffragesRequis": "184",
    "annonce": "l'Assemblée nationale a adopté",
    "decompte": {
      "pour": "228",
      "contre": "139",
      "abstentions": "24",
      "nonVotants": "1",
      "nonVotantsVolontaires": "0"
    }
  },
  "ventilationVotes": {
    "organe": {
      "organeRef": "PO717460",
      "groupes": {
        "groupe": [
          {
            "organeRef": "PO730964",
            "nombreMembresGroupe": "312",
            "vote": {
              "positionMajoritaire": "pour",
              "decompteVoix": {
                "pour": "197",
                "contre": "1",
                "nonVotants": "1",
                "abstentions": "14",
                "nonVotantsVolontaires": "14"
              },
              "decompteNominatif": {
                "nonVotants": {
                  "votant": {
                    "acteurRef": "PA332747",
                    "mandatRef": "PM722798",
                    "causePositionVote": "PSE"
                  }
                },
                "abstentions": {
                  "votant": [
                    {
                      "acteurRef": "PA605518",
                      "mandatRef": "PM722518",
                      "parDelegation": "false"
                    },
                    {
                      "acteurRef": "PA718744",
                      "mandatRef": "PM722442",
                      "parDelegation": "true"
                    },
                    {
                      "acteurRef": "PA719092",
                      "mandatRef": "PM722560",
                      "parDelegation": "false"
                    },
                    {
                      "acteurRef": "PA719350",
                      "mandatRef": "PM722634",
                      "parDelegation": "true"
                    },
                    {
                      "acteurRef": "PA719456",
                      "mandatRef": "PM722668",
                      "parDelegation": "false"
                    },
                    {
                      "acteurRef": "PA643175",
                      "mandatRef": "PM722868",
                      "parDelegation": "true"
                    },
                    {
                      "acteurRef": "PA720202",
                      "mandatRef": "PM722890",
                      "parDelegation": "false"
                    },
                    {
                      "acteurRef": "PA720214",
                      "mandatRef": "PM722894",
                      "parDelegation": "false"
                    },
                    {
                      "acteurRef": "PA720278",
                      "mandatRef": "PM722916",
                      "parDelegation": "false"
                    },
                    {
                      "acteurRef": "PA720900",
                      "mandatRef": "PM723108",
                      "parDelegation": "true"
                    },
                    {
                      "acteurRef": "PA721246",
                      "mandatRef": "PM723214",
                      "parDelegation": "false"
                    },
                    {
                      "acteurRef": "PA722062",
                      "mandatRef": "PM723462",
                      "parDelegation": "true"
                    },
                    {
                      "acteurRef": "PA722102",
                      "mandatRef": "PM723472",
                      "parDelegation": "true"
                    },
                    {
                      "acteurRef": "PA722268",
                      "mandatRef": "PM723522",
                      "parDelegation": "false"
                    }
                  ]
                },
                "pours": {
                  "votant": [
                    {
                      "acteurRef": "PA721262",
                      "mandatRef": "PM723218",
                      "parDelegation": "true"
                    },
                    {
                      "acteurRef": "PA722398",
                      "mandatRef": "PM723562",
                      "parDelegation": "false"
                    },
                    {
                      "acteurRef": "PA643127",
                      "mandatRef": "PM722636",
                      "parDelegation": "false"
                    },
                    {
                      "acteurRef": "PA346876",
                      "mandatRef": "PM723496",
                      "parDelegation": "true"
                    },
                    {
                      "acteurRef": "PA719952",
                      "mandatRef": "PM722814",
                      "parDelegation": "true"
                    },
                    {
                      "acteurRef": "PA606171",
                      "mandatRef": "PM722632",
                      "parDelegation": "false"
                    },
                    {
                      "acteurRef": "PA719668",
                      "mandatRef": "PM722726",
                      "parDelegation": "true"
                    },
                    {
                      "acteurRef": "PA608083",
                      "mandatRef": "PM723038",
                      "parDelegation": "true"
                    },
                    {
                      "acteurRef": "PA267622",
                      "mandatRef": "PM723448",
                      "parDelegation": "true"
                    },
                    {
                      "acteurRef": "PA721880",
                      "mandatRef": "PM723410",
                      "parDelegation": "true"
                    },
                    {
                      "acteurRef": "PA331835",
                      "mandatRef": "PM722688",
                      "parDelegation": "true"
                    },
                    {
                      "acteurRef": "PA334116",
                      "mandatRef": "PM723030",
                      "parDelegation": "false"
                    },
                    {
                      "acteurRef": "PA334768",
                      "mandatRef": "PM723548",
                      "parDelegation": "true"
                    },
                    {
                      "acteurRef": "PA718768",
                      "mandatRef": "PM722450",
                      "parDelegation": "false"
                    },
                    {
                      "acteurRef": "PA722252",
                      "mandatRef": "PM723518",
                      "parDelegation": "false"
                    },
                    {
                      "acteurRef": "PA722190",
                      "mandatRef": "PM723498",
                      "parDelegation": "true"
                    },
                    {
                      "acteurRef": "PA606202",
                      "mandatRef": "PM722698",
                      "parDelegation": "true"
                    },
                    {
                      "acteurRef": "PA605963",
                      "mandatRef": "PM722584",
                      "parDelegation": "false"
                    },
                    {
                      "acteurRef": "PA606507",
                      "mandatRef": "PM722720",
                      "parDelegation": "false"
                    },
                    {
                      "acteurRef": "PA606639",
                      "mandatRef": "PM722776",
                      "parDelegation": "false"
                    },
                    {
                      "acteurRef": "PA608641",
                      "mandatRef": "PM723248",
                      "parDelegation": "true"
                    },
                    {
                      "acteurRef": "PA672",
                      "mandatRef": "PM723230",
                      "parDelegation": "false"
                    },
                    {
                      "acteurRef": "PA721296",
                      "mandatRef": "PM723228",
                      "parDelegation": "false"
                    },
                    {
                      "acteurRef": "PA719520",
                      "mandatRef": "PM722684",
                      "parDelegation": "false"
                    },
                    {
                      "acteurRef": "PA720492",
                      "mandatRef": "PM722980",
                      "parDelegation": "true"
                    },
                    {
                      "acteurRef": "PA717379",
                      "mandatRef": "PM723282",
                      "parDelegation": "true"
                    },
                    {
                      "acteurRef": "PA718674",
                      "mandatRef": "PM722420",
                      "parDelegation": "false"
                    },
                    {
                      "acteurRef": "PA718694",
                      "mandatRef": "PM722426",
                      "parDelegation": "false"
                    },
                    {
                      "acteurRef": "PA718710",
                      "mandatRef": "PM722432",
                      "parDelegation": "false"
                    },
                    {
                      "acteurRef": "PA718756",
                      "mandatRef": "PM722446",
                      "parDelegation": "false"
                    },
                    {
                      "acteurRef": "PA718794",
                      "mandatRef": "PM722460",
                      "parDelegation": "true"
                    },
                    {
                      "acteurRef": "PA718810",
                      "mandatRef": "PM722464",
                      "parDelegation": "true"
                    },
                    {
                      "acteurRef": "PA677483",
                      "mandatRef": "PM722466",
                      "parDelegation": "false"
                    },
                    {
                      "acteurRef": "PA718918",
                      "mandatRef": "PM722500",
                      "parDelegation": "true"
                    },
                    {
                      "acteurRef": "PA718962",
                      "mandatRef": "PM722514",
                      "parDelegation": "true"
                    },
                    {
                      "acteurRef": "PA719006",
                      "mandatRef": "PM722530",
                      "parDelegation": "false"
                    },
                    {
                      "acteurRef": "PA719024",
                      "mandatRef": "PM722536",
                      "parDelegation": "false"
                    },
                    {
                      "acteurRef": "PA719032",
                      "mandatRef": "PM722538",
                      "parDelegation": "false"
                    },
                    {
                      "acteurRef": "PA719072",
                      "mandatRef": "PM722552",
                      "parDelegation": "false"
                    },
                    {
                      "acteurRef": "PA719080",
                      "mandatRef": "PM722554",
                      "parDelegation": "false"
                    },
                    {
                      "acteurRef": "PA719100",
                      "mandatRef": "PM722562",
                      "parDelegation": "true"
                    },
                    {
                      "acteurRef": "PA719108",
                      "mandatRef": "PM722564",
                      "parDelegation": "false"
                    },
                    {
                      "acteurRef": "PA719130",
                      "mandatRef": "PM722572",
                      "parDelegation": "true"
                    },
                    {
                      "acteurRef": "PA719162",
                      "mandatRef": "PM722580",
                      "parDelegation": "false"
                    },
                    {
                      "acteurRef": "PA719170",
                      "mandatRef": "PM722582",
                      "parDelegation": "false"
                    },
                    {
                      "acteurRef": "PA719202",
                      "mandatRef": "PM722592",
                      "parDelegation": "true"
                    },
                    {
                      "acteurRef": "PA719230",
                      "mandatRef": "PM722600",
                      "parDelegation": "false"
                    },
                    {
                      "acteurRef": "PA719242",
                      "mandatRef": "PM722604",
                      "parDelegation": "true"
                    },
                    {
                      "acteurRef": "PA719250",
                      "mandatRef": "PM722606",
                      "parDelegation": "true"
                    },
                    {
                      "acteurRef": "PA719302",
                      "mandatRef": "PM722620",
                      "parDelegation": "false"
                    },
                    {
                      "acteurRef": "PA719338",
                      "mandatRef": "PM722630",
                      "parDelegation": "false"
                    },
                    {
                      "acteurRef": "PA719364",
                      "mandatRef": "PM722638",
                      "parDelegation": "false"
                    },
                    {
                      "acteurRef": "PA719372",
                      "mandatRef": "PM722640",
                      "parDelegation": "false"
                    },
                    {
                      "acteurRef": "PA719388",
                      "mandatRef": "PM722648",
                      "parDelegation": "false"
                    },
                    {
                      "acteurRef": "PA719404",
                      "mandatRef": "PM722652",
                      "parDelegation": "true"
                    },
                    {
                      "acteurRef": "PA719440",
                      "mandatRef": "PM722664",
                      "parDelegation": "true"
                    },
                    {
                      "acteurRef": "PA719472",
                      "mandatRef": "PM722672",
                      "parDelegation": "true"
                    },
                    {
                      "acteurRef": "PA719496",
                      "mandatRef": "PM722678",
                      "parDelegation": "false"
                    },
                    {
                      "acteurRef": "PA719512",
                      "mandatRef": "PM722682",
                      "parDelegation": "true"
                    },
                    {
                      "acteurRef": "PA719540",
                      "mandatRef": "PM722690",
                      "parDelegation": "true"
                    },
                    {
                      "acteurRef": "PA719550",
                      "mandatRef": "PM722694",
                      "parDelegation": "false"
                    },
                    {
                      "acteurRef": "PA719570",
                      "mandatRef": "PM722700",
                      "parDelegation": "true"
                    },
                    {
                      "acteurRef": "PA719592",
                      "mandatRef": "PM722706",
                      "parDelegation": "false"
                    },
                    {
                      "acteurRef": "PA719600",
                      "mandatRef": "PM722708",
                      "parDelegation": "false"
                    },
                    {
                      "acteurRef": "PA719616",
                      "mandatRef": "PM722712",
                      "parDelegation": "true"
                    },
                    {
                      "acteurRef": "PA719632",
                      "mandatRef": "PM722716",
                      "parDelegation": "false"
                    },
                    {
                      "acteurRef": "PA719660",
                      "mandatRef": "PM722724",
                      "parDelegation": "false"
                    },
                    {
                      "acteurRef": "PA719684",
                      "mandatRef": "PM722730",
                      "parDelegation": "false"
                    },
                    {
                      "acteurRef": "PA719692",
                      "mandatRef": "PM722732",
                      "parDelegation": "false"
                    },
                    {
                      "acteurRef": "PA719700",
                      "mandatRef": "PM722734",
                      "parDelegation": "false"
                    },
                    {
                      "acteurRef": "PA719718",
                      "mandatRef": "PM722740",
                      "parDelegation": "true"
                    },
                    {
                      "acteurRef": "PA719728",
                      "mandatRef": "PM722744",
                      "parDelegation": "true"
                    },
                    {
                      "acteurRef": "PA719740",
                      "mandatRef": "PM722748",
                      "parDelegation": "true"
                    },
                    {
                      "acteurRef": "PA719748",
                      "mandatRef": "PM722750",
                      "parDelegation": "true"
                    },
                    {
                      "acteurRef": "PA719756",
                      "mandatRef": "PM722752",
                      "parDelegation": "true"
                    },
                    {
                      "acteurRef": "PA719770",
                      "mandatRef": "PM722758",
                      "parDelegation": "false"
                    },
                    {
                      "acteurRef": "PA719778",
                      "mandatRef": "PM722760",
                      "parDelegation": "false"
                    },
                    {
                      "acteurRef": "PA719790",
                      "mandatRef": "PM722764",
                      "parDelegation": "false"
                    },
                    {
                      "acteurRef": "PA719798",
                      "mandatRef": "PM722766",
                      "parDelegation": "false"
                    },
                    {
                      "acteurRef": "PA719814",
                      "mandatRef": "PM722770",
                      "parDelegation": "false"
                    },
                    {
                      "acteurRef": "PA719822",
                      "mandatRef": "PM722772",
                      "parDelegation": "true"
                    },
                    {
                      "acteurRef": "PA719830",
                      "mandatRef": "PM722774",
                      "parDelegation": "false"
                    },
                    {
                      "acteurRef": "PA719842",
                      "mandatRef": "PM722778",
                      "parDelegation": "false"
                    },
                    {
                      "acteurRef": "PA719850",
                      "mandatRef": "PM722780",
                      "parDelegation": "false"
                    },
                    {
                      "acteurRef": "PA719858",
                      "mandatRef": "PM722782",
                      "parDelegation": "true"
                    },
                    {
                      "acteurRef": "PA719866",
                      "mandatRef": "PM722784",
                      "parDelegation": "false"
                    },
                    {
                      "acteurRef": "PA719890",
                      "mandatRef": "PM722790",
                      "parDelegation": "true"
                    },
                    {
                      "acteurRef": "PA719922",
                      "mandatRef": "PM722802",
                      "parDelegation": "false"
                    },
                    {
                      "acteurRef": "PA719980",
                      "mandatRef": "PM722822",
                      "parDelegation": "false"
                    },
                    {
                      "acteurRef": "PA719994",
                      "mandatRef": "PM722828",
                      "parDelegation": "true"
                    },
                    {
                      "acteurRef": "PA720014",
                      "mandatRef": "PM722834",
                      "parDelegation": "false"
                    },
                    {
                      "acteurRef": "PA720030",
                      "mandatRef": "PM722838",
                      "parDelegation": "false"
                    },
                    {
                      "acteurRef": "PA720038",
                      "mandatRef": "PM722840",
                      "parDelegation": "true"
                    },
                    {
                      "acteurRef": "PA720066",
                      "mandatRef": "PM722848",
                      "parDelegation": "false"
                    },
                    {
                      "acteurRef": "PA720074",
                      "mandatRef": "PM722850",
                      "parDelegation": "false"
                    },
                    {
                      "acteurRef": "PA720108",
                      "mandatRef": "PM722862",
                      "parDelegation": "true"
                    },
                    {
                      "acteurRef": "PA720116",
                      "mandatRef": "PM722864",
                      "parDelegation": "true"
                    },
                    {
                      "acteurRef": "PA720138",
                      "mandatRef": "PM722872",
                      "parDelegation": "true"
                    },
                    {
                      "acteurRef": "PA720154",
                      "mandatRef": "PM722876",
                      "parDelegation": "true"
                    },
                    {
                      "acteurRef": "PA720222",
                      "mandatRef": "PM722896",
                      "parDelegation": "false"
                    },
                    {
                      "acteurRef": "PA720242",
                      "mandatRef": "PM722902",
                      "parDelegation": "false"
                    },
                    {
                      "acteurRef": "PA720268",
                      "mandatRef": "PM722912",
                      "parDelegation": "false"
                    },
                    {
                      "acteurRef": "PA720298",
                      "mandatRef": "PM722922",
                      "parDelegation": "true"
                    },
                    {
                      "acteurRef": "PA720318",
                      "mandatRef": "PM722928",
                      "parDelegation": "true"
                    },
                    {
                      "acteurRef": "PA720342",
                      "mandatRef": "PM722934",
                      "parDelegation": "true"
                    },
                    {
                      "acteurRef": "PA720354",
                      "mandatRef": "PM722940",
                      "parDelegation": "true"
                    },
                    {
                      "acteurRef": "PA720362",
                      "mandatRef": "PM722942",
                      "parDelegation": "false"
                    },
                    {
                      "acteurRef": "PA720370",
                      "mandatRef": "PM722944",
                      "parDelegation": "false"
                    },
                    {
                      "acteurRef": "PA720378",
                      "mandatRef": "PM722946",
                      "parDelegation": "true"
                    },
                    {
                      "acteurRef": "PA720394",
                      "mandatRef": "PM722950",
                      "parDelegation": "true"
                    },
                    {
                      "acteurRef": "PA720454",
                      "mandatRef": "PM722968",
                      "parDelegation": "true"
                    },
                    {
                      "acteurRef": "PA720480",
                      "mandatRef": "PM722976",
                      "parDelegation": "false"
                    },
                    {
                      "acteurRef": "PA720500",
                      "mandatRef": "PM722982",
                      "parDelegation": "false"
                    },
                    {
                      "acteurRef": "PA720512",
                      "mandatRef": "PM722986",
                      "parDelegation": "false"
                    },
                    {
                      "acteurRef": "PA720520",
                      "mandatRef": "PM722988",
                      "parDelegation": "true"
                    },
                    {
                      "acteurRef": "PA720552",
                      "mandatRef": "PM722998",
                      "parDelegation": "false"
                    },
                    {
                      "acteurRef": "PA720560",
                      "mandatRef": "PM723000",
                      "parDelegation": "true"
                    },
                    {
                      "acteurRef": "PA720568",
                      "mandatRef": "PM723002",
                      "parDelegation": "true"
                    },
                    {
                      "acteurRef": "PA720576",
                      "mandatRef": "PM723004",
                      "parDelegation": "false"
                    },
                    {
                      "acteurRef": "PA720590",
                      "mandatRef": "PM723010",
                      "parDelegation": "false"
                    },
                    {
                      "acteurRef": "PA720622",
                      "mandatRef": "PM723018",
                      "parDelegation": "true"
                    },
                    {
                      "acteurRef": "PA720754",
                      "mandatRef": "PM723066",
                      "parDelegation": "true"
                    },
                    {
                      "acteurRef": "PA720780",
                      "mandatRef": "PM723074",
                      "parDelegation": "false"
                    },
                    {
                      "acteurRef": "PA720806",
                      "mandatRef": "PM723082",
                      "parDelegation": "true"
                    },
                    {
                      "acteurRef": "PA720830",
                      "mandatRef": "PM723088",
                      "parDelegation": "false"
                    },
                    {
                      "acteurRef": "PA720862",
                      "mandatRef": "PM723098",
                      "parDelegation": "false"
                    },
                    {
                      "acteurRef": "PA720870",
                      "mandatRef": "PM723100",
                      "parDelegation": "false"
                    },
                    {
                      "acteurRef": "PA720878",
                      "mandatRef": "PM723102",
                      "parDelegation": "false"
                    },
                    {
                      "acteurRef": "PA720908",
                      "mandatRef": "PM723110",
                      "parDelegation": "true"
                    },
                    {
                      "acteurRef": "PA720932",
                      "mandatRef": "PM723116",
                      "parDelegation": "false"
                    },
                    {
                      "acteurRef": "PA720944",
                      "mandatRef": "PM723120",
                      "parDelegation": "false"
                    },
                    {
                      "acteurRef": "PA721024",
                      "mandatRef": "PM723144",
                      "parDelegation": "false"
                    },
                    {
                      "acteurRef": "PA721134",
                      "mandatRef": "PM723184",
                      "parDelegation": "false"
                    },
                    {
                      "acteurRef": "PA721142",
                      "mandatRef": "PM723186",
                      "parDelegation": "true"
                    },
                    {
                      "acteurRef": "PA721150",
                      "mandatRef": "PM723188",
                      "parDelegation": "false"
                    },
                    {
                      "acteurRef": "PA721158",
                      "mandatRef": "PM723190",
                      "parDelegation": "true"
                    },
                    {
                      "acteurRef": "PA721174",
                      "mandatRef": "PM723194",
                      "parDelegation": "true"
                    },
                    {
                      "acteurRef": "PA721194",
                      "mandatRef": "PM723200",
                      "parDelegation": "true"
                    },
                    {
                      "acteurRef": "PA721328",
                      "mandatRef": "PM723240",
                      "parDelegation": "false"
                    },
                    {
                      "acteurRef": "PA721344",
                      "mandatRef": "PM723244",
                      "parDelegation": "true"
                    },
                    {
                      "acteurRef": "PA721364",
                      "mandatRef": "PM723250",
                      "parDelegation": "false"
                    },
                    {
                      "acteurRef": "PA721372",
                      "mandatRef": "PM723252",
                      "parDelegation": "true"
                    },
                    {
                      "acteurRef": "PA721384",
                      "mandatRef": "PM723256",
                      "parDelegation": "true"
                    },
                    {
                      "acteurRef": "PA721398",
                      "mandatRef": "PM723262",
                      "parDelegation": "true"
                    },
                    {
                      "acteurRef": "PA721434",
                      "mandatRef": "PM723272",
                      "parDelegation": "true"
                    },
                    {
                      "acteurRef": "PA721450",
                      "mandatRef": "PM723278",
                      "parDelegation": "true"
                    },
                    {
                      "acteurRef": "PA721466",
                      "mandatRef": "PM723284",
                      "parDelegation": "false"
                    },
                    {
                      "acteurRef": "PA721498",
                      "mandatRef": "PM723294",
                      "parDelegation": "false"
                    },
                    {
                      "acteurRef": "PA721514",
                      "mandatRef": "PM723298",
                      "parDelegation": "false"
                    },
                    {
                      "acteurRef": "PA721522",
                      "mandatRef": "PM723300",
                      "parDelegation": "false"
                    },
                    {
                      "acteurRef": "PA721542",
                      "mandatRef": "PM723308",
                      "parDelegation": "true"
                    },
                    {
                      "acteurRef": "PA721568",
                      "mandatRef": "PM723316",
                      "parDelegation": "false"
                    },
                    {
                      "acteurRef": "PA721584",
                      "mandatRef": "PM723324",
                      "parDelegation": "false"
                    },
                    {
                      "acteurRef": "PA721616",
                      "mandatRef": "PM723334",
                      "parDelegation": "false"
                    },
                    {
                      "acteurRef": "PA721624",
                      "mandatRef": "PM723336",
                      "parDelegation": "false"
                    },
                    {
                      "acteurRef": "PA721670",
                      "mandatRef": "PM723350",
                      "parDelegation": "true"
                    },
                    {
                      "acteurRef": "PA721702",
                      "mandatRef": "PM723360",
                      "parDelegation": "false"
                    },
                    {
                      "acteurRef": "PA721710",
                      "mandatRef": "PM723362",
                      "parDelegation": "false"
                    },
                    {
                      "acteurRef": "PA721718",
                      "mandatRef": "PM723364",
                      "parDelegation": "false"
                    },
                    {
                      "acteurRef": "PA721726",
                      "mandatRef": "PM723366",
                      "parDelegation": "true"
                    },
                    {
                      "acteurRef": "PA721750",
                      "mandatRef": "PM723372",
                      "parDelegation": "false"
                    },
                    {
                      "acteurRef": "PA721764",
                      "mandatRef": "PM723376",
                      "parDelegation": "true"
                    },
                    {
                      "acteurRef": "PA721800",
                      "mandatRef": "PM723386",
                      "parDelegation": "true"
                    },
                    {
                      "acteurRef": "PA721808",
                      "mandatRef": "PM723388",
                      "parDelegation": "false"
                    },
                    {
                      "acteurRef": "PA721824",
                      "mandatRef": "PM723394",
                      "parDelegation": "false"
                    },
                    {
                      "acteurRef": "PA721844",
                      "mandatRef": "PM723400",
                      "parDelegation": "false"
                    },
                    {
                      "acteurRef": "PA721888",
                      "mandatRef": "PM723412",
                      "parDelegation": "false"
                    },
                    {
                      "acteurRef": "PA721908",
                      "mandatRef": "PM723418",
                      "parDelegation": "false"
                    },
                    {
                      "acteurRef": "PA721916",
                      "mandatRef": "PM723420",
                      "parDelegation": "false"
                    },
                    {
                      "acteurRef": "PA721946",
                      "mandatRef": "PM723430",
                      "parDelegation": "false"
                    },
                    {
                      "acteurRef": "PA722000",
                      "mandatRef": "PM723444",
                      "parDelegation": "false"
                    },
                    {
                      "acteurRef": "PA722008",
                      "mandatRef": "PM723446",
                      "parDelegation": "false"
                    },
                    {
                      "acteurRef": "PA722054",
                      "mandatRef": "PM723460",
                      "parDelegation": "false"
                    },
                    {
                      "acteurRef": "PA722070",
                      "mandatRef": "PM723464",
                      "parDelegation": "false"
                    },
                    {
                      "acteurRef": "PA722118",
                      "mandatRef": "PM723476",
                      "parDelegation": "false"
                    },
                    {
                      "acteurRef": "PA722126",
                      "mandatRef": "PM723478",
                      "parDelegation": "false"
                    },
                    {
                      "acteurRef": "PA722134",
                      "mandatRef": "PM723482",
                      "parDelegation": "true"
                    },
                    {
                      "acteurRef": "PA722150",
                      "mandatRef": "PM723486",
                      "parDelegation": "true"
                    },
                    {
                      "acteurRef": "PA722170",
                      "mandatRef": "PM723492",
                      "parDelegation": "false"
                    },
                    {
                      "acteurRef": "PA722228",
                      "mandatRef": "PM723512",
                      "parDelegation": "false"
                    },
                    {
                      "acteurRef": "PA722236",
                      "mandatRef": "PM723514",
                      "parDelegation": "false"
                    },
                    {
                      "acteurRef": "PA722260",
                      "mandatRef": "PM723520",
                      "parDelegation": "false"
                    },
                    {
                      "acteurRef": "PA722292",
                      "mandatRef": "PM723530",
                      "parDelegation": "false"
                    },
                    {
                      "acteurRef": "PA722312",
                      "mandatRef": "PM723536",
                      "parDelegation": "false"
                    },
                    {
                      "acteurRef": "PA722320",
                      "mandatRef": "PM723538",
                      "parDelegation": "false"
                    },
                    {
                      "acteurRef": "PA722336",
                      "mandatRef": "PM723544",
                      "parDelegation": "false"
                    },
                    {
                      "acteurRef": "PA722344",
                      "mandatRef": "PM723546",
                      "parDelegation": "true"
                    },
                    {
                      "acteurRef": "PA722358",
                      "mandatRef": "PM723552",
                      "parDelegation": "false"
                    },
                    {
                      "acteurRef": "PA722366",
                      "mandatRef": "PM723554",
                      "parDelegation": "false"
                    },
                    {
                      "acteurRef": "PA722382",
                      "mandatRef": "PM723558",
                      "parDelegation": "false"
                    },
                    {
                      "acteurRef": "PA724827",
                      "mandatRef": "PM754304",
                      "parDelegation": "false"
                    },
                    {
                      "acteurRef": "PA642788",
                      "mandatRef": "PM722746",
                      "parDelegation": "true"
                    },
                    {
                      "acteurRef": "PA643205",
                      "mandatRef": "PM723358",
                      "parDelegation": "true"
                    },
                    {
                      "acteurRef": "PA702054",
                      "mandatRef": "PM733713",
                      "parDelegation": "true"
                    },
                    {
                      "acteurRef": "PA719326",
                      "mandatRef": "PM733709",
                      "parDelegation": "false"
                    },
                    {
                      "acteurRef": "PA721876",
                      "mandatRef": "PM733719",
                      "parDelegation": "true"
                    },
                    {
                      "acteurRef": "PA721564",
                      "mandatRef": "PM733723",
                      "parDelegation": "false"
                    }
                  ]
                },
                "contres": {
                  "votant": {
                    "acteurRef": "PA336439",
                    "mandatRef": "PM723488",
                    "parDelegation": "false"
                  }
                }
              }
            }
          },
          {
            "organeRef": "PO730934",
            "nombreMembresGroupe": "102",
            "vote": {
              "positionMajoritaire": "contre",
              "decompteVoix": {
                "pour": "0",
                "contre": "68",
                "nonVotants": "0",
                "abstentions": "0",
                "nonVotantsVolontaires": "0"
              },
              "decompteNominatif": {
                "nonVotants": null,
                "abstentions": null,
                "pours": null,
                "contres": {
                  "votant": [
                    {
                      "acteurRef": "PA998",
                      "mandatRef": "PM723046",
                      "parDelegation": "true"
                    },
                    {
                      "acteurRef": "PA2529",
                      "mandatRef": "PM723234",
                      "parDelegation": "true"
                    },
                    {
                      "acteurRef": "PA345722",
                      "mandatRef": "PM723428",
                      "parDelegation": "false"
                    },
                    {
                      "acteurRef": "PA720210",
                      "mandatRef": "PM722892",
                      "parDelegation": "false"
                    },
                    {
                      "acteurRef": "PA606712",
                      "mandatRef": "PM722756",
                      "parDelegation": "false"
                    },
                    {
                      "acteurRef": "PA330240",
                      "mandatRef": "PM722492",
                      "parDelegation": "false"
                    },
                    {
                      "acteurRef": "PA856",
                      "mandatRef": "PM723288",
                      "parDelegation": "true"
                    },
                    {
                      "acteurRef": "PA923",
                      "mandatRef": "PM722904",
                      "parDelegation": "true"
                    },
                    {
                      "acteurRef": "PA1874",
                      "mandatRef": "PM722598",
                      "parDelegation": "true"
                    },
                    {
                      "acteurRef": "PA1498",
                      "mandatRef": "PM723396",
                      "parDelegation": "false"
                    },
                    {
                      "acteurRef": "PA1695",
                      "mandatRef": "PM723322",
                      "parDelegation": "false"
                    },
                    {
                      "acteurRef": "PA2155",
                      "mandatRef": "PM722490",
                      "parDelegation": "true"
                    },
                    {
                      "acteurRef": "PA720644",
                      "mandatRef": "PM723026",
                      "parDelegation": "true"
                    },
                    {
                      "acteurRef": "PA720586",
                      "mandatRef": "PM723008",
                      "parDelegation": "false"
                    },
                    {
                      "acteurRef": "PA606098",
                      "mandatRef": "PM722642",
                      "parDelegation": "false"
                    },
                    {
                      "acteurRef": "PA1630",
                      "mandatRef": "PM723232",
                      "parDelegation": "false"
                    },
                    {
                      "acteurRef": "PA334843",
                      "mandatRef": "PM723534",
                      "parDelegation": "false"
                    },
                    {
                      "acteurRef": "PA223837",
                      "mandatRef": "PM722458",
                      "parDelegation": "true"
                    },
                    {
                      "acteurRef": "PA267200",
                      "mandatRef": "PM722974",
                      "parDelegation": "false"
                    },
                    {
                      "acteurRef": "PA267204",
                      "mandatRef": "PM722794",
                      "parDelegation": "false"
                    },
                    {
                      "acteurRef": "PA267260",
                      "mandatRef": "PM722476",
                      "parDelegation": "true"
                    },
                    {
                      "acteurRef": "PA267378",
                      "mandatRef": "PM723344",
                      "parDelegation": "true"
                    },
                    {
                      "acteurRef": "PA267440",
                      "mandatRef": "PM722522",
                      "parDelegation": "false"
                    },
                    {
                      "acteurRef": "PA267901",
                      "mandatRef": "PM723166",
                      "parDelegation": "false"
                    },
                    {
                      "acteurRef": "PA718850",
                      "mandatRef": "PM722478",
                      "parDelegation": "false"
                    },
                    {
                      "acteurRef": "PA266776",
                      "mandatRef": "PM723542",
                      "parDelegation": "true"
                    },
                    {
                      "acteurRef": "PA608826",
                      "mandatRef": "PM723276",
                      "parDelegation": "true"
                    },
                    {
                      "acteurRef": "PA718838",
                      "mandatRef": "PM722474",
                      "parDelegation": "true"
                    },
                    {
                      "acteurRef": "PA721636",
                      "mandatRef": "PM723340",
                      "parDelegation": "true"
                    },
                    {
                      "acteurRef": "PA605036",
                      "mandatRef": "PM722444",
                      "parDelegation": "true"
                    },
                    {
                      "acteurRef": "PA334149",
                      "mandatRef": "PM723034",
                      "parDelegation": "true"
                    },
                    {
                      "acteurRef": "PA334654",
                      "mandatRef": "PM723566",
                      "parDelegation": "true"
                    },
                    {
                      "acteurRef": "PA330008",
                      "mandatRef": "PM722416",
                      "parDelegation": "false"
                    },
                    {
                      "acteurRef": "PA332523",
                      "mandatRef": "PM722792",
                      "parDelegation": "true"
                    },
                    {
                      "acteurRef": "PA330684",
                      "mandatRef": "PM722528",
                      "parDelegation": "false"
                    },
                    {
                      "acteurRef": "PA340853",
                      "mandatRef": "PM722534",
                      "parDelegation": "true"
                    },
                    {
                      "acteurRef": "PA342935",
                      "mandatRef": "PM722856",
                      "parDelegation": "true"
                    },
                    {
                      "acteurRef": "PA605991",
                      "mandatRef": "PM722660",
                      "parDelegation": "true"
                    },
                    {
                      "acteurRef": "PA721410",
                      "mandatRef": "PM723266",
                      "parDelegation": "false"
                    },
                    {
                      "acteurRef": "PA267735",
                      "mandatRef": "PM722852",
                      "parDelegation": "false"
                    },
                    {
                      "acteurRef": "PA607090",
                      "mandatRef": "PM722796",
                      "parDelegation": "true"
                    },
                    {
                      "acteurRef": "PA608016",
                      "mandatRef": "PM723024",
                      "parDelegation": "false"
                    },
                    {
                      "acteurRef": "PA608416",
                      "mandatRef": "PM723540",
                      "parDelegation": "true"
                    },
                    {
                      "acteurRef": "PA609245",
                      "mandatRef": "PM723318",
                      "parDelegation": "false"
                    },
                    {
                      "acteurRef": "PA267785",
                      "mandatRef": "PM723310",
                      "parDelegation": "false"
                    },
                    {
                      "acteurRef": "PA609726",
                      "mandatRef": "PM723426",
                      "parDelegation": "false"
                    },
                    {
                      "acteurRef": "PA720684",
                      "mandatRef": "PM723040",
                      "parDelegation": "false"
                    },
                    {
                      "acteurRef": "PA721816",
                      "mandatRef": "PM748964",
                      "parDelegation": "false"
                    },
                    {
                      "acteurRef": "PA718780",
                      "mandatRef": "PM722454",
                      "parDelegation": "true"
                    },
                    {
                      "acteurRef": "PA718784",
                      "mandatRef": "PM722456",
                      "parDelegation": "true"
                    },
                    {
                      "acteurRef": "PA718884",
                      "mandatRef": "PM722488",
                      "parDelegation": "false"
                    },
                    {
                      "acteurRef": "PA719318",
                      "mandatRef": "PM722624",
                      "parDelegation": "false"
                    },
                    {
                      "acteurRef": "PA643134",
                      "mandatRef": "PM722824",
                      "parDelegation": "false"
                    },
                    {
                      "acteurRef": "PA720386",
                      "mandatRef": "PM722948",
                      "parDelegation": "false"
                    },
                    {
                      "acteurRef": "PA642847",
                      "mandatRef": "PM722954",
                      "parDelegation": "true"
                    },
                    {
                      "acteurRef": "PA720630",
                      "mandatRef": "PM723020",
                      "parDelegation": "false"
                    },
                    {
                      "acteurRef": "PA721286",
                      "mandatRef": "PM723224",
                      "parDelegation": "false"
                    },
                    {
                      "acteurRef": "PA721314",
                      "mandatRef": "PM723236",
                      "parDelegation": "true"
                    },
                    {
                      "acteurRef": "PA721474",
                      "mandatRef": "PM723286",
                      "parDelegation": "false"
                    },
                    {
                      "acteurRef": "PA721506",
                      "mandatRef": "PM723296",
                      "parDelegation": "false"
                    },
                    {
                      "acteurRef": "PA346218",
                      "mandatRef": "PM723348",
                      "parDelegation": "false"
                    },
                    {
                      "acteurRef": "PA721678",
                      "mandatRef": "PM723352",
                      "parDelegation": "false"
                    },
                    {
                      "acteurRef": "PA722390",
                      "mandatRef": "PM723560",
                      "parDelegation": "true"
                    },
                    {
                      "acteurRef": "PA721126",
                      "mandatRef": "PM723182",
                      "parDelegation": "true"
                    },
                    {
                      "acteurRef": "PA330909",
                      "mandatRef": "PM722548",
                      "parDelegation": "false"
                    },
                    {
                      "acteurRef": "PA266793",
                      "mandatRef": "PM722550",
                      "parDelegation": "true"
                    },
                    {
                      "acteurRef": "PA709315",
                      "mandatRef": "PM722526",
                      "parDelegation": "true"
                    },
                    {
                      "acteurRef": "PA748954",
                      "mandatRef": "PM748958",
                      "parDelegation": "false"
                    }
                  ]
                }
              }
            }
          },
          {
            "organeRef": "PO730970",
            "nombreMembresGroupe": "47",
            "vote": {
              "positionMajoritaire": "pour",
              "decompteVoix": {
                "pour": "16",
                "contre": "1",
                "nonVotants": "0",
                "abstentions": "8",
                "nonVotantsVolontaires": "8"
              },
              "decompteNominatif": {
                "nonVotants": null,
                "abstentions": {
                  "votant": [
                    {
                      "acteurRef": "PA721608",
                      "mandatRef": "PM723332",
                      "parDelegation": "true"
                    },
                    {
                      "acteurRef": "PA718978",
                      "mandatRef": "PM722520",
                      "parDelegation": "true"
                    },
                    {
                      "acteurRef": "PA719558",
                      "mandatRef": "PM722696",
                      "parDelegation": "false"
                    },
                    {
                      "acteurRef": "PA720092",
                      "mandatRef": "PM722858",
                      "parDelegation": "false"
                    },
                    {
                      "acteurRef": "PA720178",
                      "mandatRef": "PM722882",
                      "parDelegation": "true"
                    },
                    {
                      "acteurRef": "PA720326",
                      "mandatRef": "PM722930",
                      "parDelegation": "false"
                    },
                    {
                      "acteurRef": "PA720720",
                      "mandatRef": "PM723056",
                      "parDelegation": "true"
                    },
                    {
                      "acteurRef": "PA721234",
                      "mandatRef": "PM723210",
                      "parDelegation": "false"
                    }
                  ]
                },
                "pours": {
                  "votant": [
                    {
                      "acteurRef": "PA721734",
                      "mandatRef": "PM723368",
                      "parDelegation": "true"
                    },
                    {
                      "acteurRef": "PA719874",
                      "mandatRef": "PM722786",
                      "parDelegation": "false"
                    },
                    {
                      "acteurRef": "PA719938",
                      "mandatRef": "PM722806",
                      "parDelegation": "false"
                    },
                    {
                      "acteurRef": "PA720162",
                      "mandatRef": "PM722878",
                      "parDelegation": "true"
                    },
                    {
                      "acteurRef": "PA720334",
                      "mandatRef": "PM722932",
                      "parDelegation": "false"
                    },
                    {
                      "acteurRef": "PA720704",
                      "mandatRef": "PM723050",
                      "parDelegation": "true"
                    },
                    {
                      "acteurRef": "PA720728",
                      "mandatRef": "PM723058",
                      "parDelegation": "true"
                    },
                    {
                      "acteurRef": "PA720746",
                      "mandatRef": "PM723064",
                      "parDelegation": "true"
                    },
                    {
                      "acteurRef": "PA720772",
                      "mandatRef": "PM723072",
                      "parDelegation": "true"
                    },
                    {
                      "acteurRef": "PA720924",
                      "mandatRef": "PM723114",
                      "parDelegation": "false"
                    },
                    {
                      "acteurRef": "PA721742",
                      "mandatRef": "PM723370",
                      "parDelegation": "false"
                    },
                    {
                      "acteurRef": "PA721836",
                      "mandatRef": "PM723398",
                      "parDelegation": "false"
                    },
                    {
                      "acteurRef": "PA721976",
                      "mandatRef": "PM723438",
                      "parDelegation": "false"
                    },
                    {
                      "acteurRef": "PA721984",
                      "mandatRef": "PM723440",
                      "parDelegation": "true"
                    },
                    {
                      "acteurRef": "PA722162",
                      "mandatRef": "PM723490",
                      "parDelegation": "true"
                    },
                    {
                      "acteurRef": "PA722284",
                      "mandatRef": "PM723528",
                      "parDelegation": "false"
                    }
                  ]
                },
                "contres": {
                  "votant": {
                    "acteurRef": "PA719044",
                    "mandatRef": "PM722542",
                    "parDelegation": "false"
                  }
                }
              }
            }
          },
          {
            "organeRef": "PO744425",
            "nombreMembresGroupe": "32",
            "vote": {
              "positionMajoritaire": "pour",
              "decompteVoix": {
                "pour": "15",
                "contre": "1",
                "nonVotants": "0",
                "abstentions": "2",
                "nonVotantsVolontaires": "2"
              },
              "decompteNominatif": {
                "nonVotants": null,
                "abstentions": {
                  "votant": [
                    {
                      "acteurRef": "PA267042",
                      "mandatRef": "PM722910",
                      "parDelegation": "false"
                    },
                    {
                      "acteurRef": "PA695100",
                      "mandatRef": "PM723198",
                      "parDelegation": "false"
                    }
                  ]
                },
                "pours": {
                  "votant": [
                    {
                      "acteurRef": "PA268019",
                      "mandatRef": "PM723092",
                      "parDelegation": "true"
                    },
                    {
                      "acteurRef": "PA2952",
                      "mandatRef": "PM722480",
                      "parDelegation": "false"
                    },
                    {
                      "acteurRef": "PA267241",
                      "mandatRef": "PM723304",
                      "parDelegation": "true"
                    },
                    {
                      "acteurRef": "PA267330",
                      "mandatRef": "PM723392",
                      "parDelegation": "true"
                    },
                    {
                      "acteurRef": "PA267355",
                      "mandatRef": "PM723524",
                      "parDelegation": "false"
                    },
                    {
                      "acteurRef": "PA331582",
                      "mandatRef": "PM722646",
                      "parDelegation": "false"
                    },
                    {
                      "acteurRef": "PA335758",
                      "mandatRef": "PM723338",
                      "parDelegation": "true"
                    },
                    {
                      "acteurRef": "PA332228",
                      "mandatRef": "PM722754",
                      "parDelegation": "false"
                    },
                    {
                      "acteurRef": "PA720230",
                      "mandatRef": "PM722898",
                      "parDelegation": "false"
                    },
                    {
                      "acteurRef": "PA719806",
                      "mandatRef": "PM722768",
                      "parDelegation": "false"
                    },
                    {
                      "acteurRef": "PA267766",
                      "mandatRef": "PM722970",
                      "parDelegation": "true"
                    },
                    {
                      "acteurRef": "PA642868",
                      "mandatRef": "PM722992",
                      "parDelegation": "true"
                    },
                    {
                      "acteurRef": "PA642935",
                      "mandatRef": "PM723238",
                      "parDelegation": "true"
                    },
                    {
                      "acteurRef": "PA722030",
                      "mandatRef": "PM723454",
                      "parDelegation": "false"
                    },
                    {
                      "acteurRef": "PA267780",
                      "mandatRef": "PM723504",
                      "parDelegation": "false"
                    }
                  ]
                },
                "contres": {
                  "votant": {
                    "acteurRef": "PA333421",
                    "mandatRef": "PM722920",
                    "parDelegation": "true"
                  }
                }
              }
            }
          },
          {
            "organeRef": "PO730946",
            "nombreMembresGroupe": "31",
            "vote": {
              "positionMajoritaire": "contre",
              "decompteVoix": {
                "pour": "0",
                "contre": "31",
                "nonVotants": "0",
                "abstentions": "0",
                "nonVotantsVolontaires": "0"
              },
              "decompteNominatif": {
                "nonVotants": null,
                "abstentions": null,
                "pours": null,
                "contres": {
                  "votant": [
                    {
                      "acteurRef": "PA1198",
                      "mandatRef": "PM722532",
                      "parDelegation": "false"
                    },
                    {
                      "acteurRef": "PA1809",
                      "mandatRef": "PM722556",
                      "parDelegation": "false"
                    },
                    {
                      "acteurRef": "PA588886",
                      "mandatRef": "PM723258",
                      "parDelegation": "true"
                    },
                    {
                      "acteurRef": "PA508",
                      "mandatRef": "PM722736",
                      "parDelegation": "false"
                    },
                    {
                      "acteurRef": "PA333285",
                      "mandatRef": "PM722906",
                      "parDelegation": "false"
                    },
                    {
                      "acteurRef": "PA340343",
                      "mandatRef": "PM722470",
                      "parDelegation": "true"
                    },
                    {
                      "acteurRef": "PA429893",
                      "mandatRef": "PM723104",
                      "parDelegation": "true"
                    },
                    {
                      "acteurRef": "PA1592",
                      "mandatRef": "PM723060",
                      "parDelegation": "false"
                    },
                    {
                      "acteurRef": "PA605069",
                      "mandatRef": "PM722424",
                      "parDelegation": "false"
                    },
                    {
                      "acteurRef": "PA333818",
                      "mandatRef": "PM722990",
                      "parDelegation": "true"
                    },
                    {
                      "acteurRef": "PA335054",
                      "mandatRef": "PM723254",
                      "parDelegation": "false"
                    },
                    {
                      "acteurRef": "PA335532",
                      "mandatRef": "PM723416",
                      "parDelegation": "true"
                    },
                    {
                      "acteurRef": "PA267233",
                      "mandatRef": "PM723500",
                      "parDelegation": "false"
                    },
                    {
                      "acteurRef": "PA337483",
                      "mandatRef": "PM723140",
                      "parDelegation": "true"
                    },
                    {
                      "acteurRef": "PA332614",
                      "mandatRef": "PM722812",
                      "parDelegation": "true"
                    },
                    {
                      "acteurRef": "PA609332",
                      "mandatRef": "PM723378",
                      "parDelegation": "false"
                    },
                    {
                      "acteurRef": "PA405480",
                      "mandatRef": "PM723118",
                      "parDelegation": "true"
                    },
                    {
                      "acteurRef": "PA342415",
                      "mandatRef": "PM722826",
                      "parDelegation": "false"
                    },
                    {
                      "acteurRef": "PA607553",
                      "mandatRef": "PM722956",
                      "parDelegation": "true"
                    },
                    {
                      "acteurRef": "PA608172",
                      "mandatRef": "PM723048",
                      "parDelegation": "false"
                    },
                    {
                      "acteurRef": "PA608695",
                      "mandatRef": "PM723564",
                      "parDelegation": "true"
                    },
                    {
                      "acteurRef": "PA609590",
                      "mandatRef": "PM723326",
                      "parDelegation": "false"
                    },
                    {
                      "acteurRef": "PA610681",
                      "mandatRef": "PM723150",
                      "parDelegation": "true"
                    },
                    {
                      "acteurRef": "PA608011",
                      "mandatRef": "PM723022",
                      "parDelegation": "true"
                    },
                    {
                      "acteurRef": "PA1008",
                      "mandatRef": "PM722704",
                      "parDelegation": "false"
                    },
                    {
                      "acteurRef": "PA719930",
                      "mandatRef": "PM722804",
                      "parDelegation": "false"
                    },
                    {
                      "acteurRef": "PA720988",
                      "mandatRef": "PM723132",
                      "parDelegation": "true"
                    },
                    {
                      "acteurRef": "PA643145",
                      "mandatRef": "PM723130",
                      "parDelegation": "true"
                    },
                    {
                      "acteurRef": "PA335999",
                      "mandatRef": "PM723480",
                      "parDelegation": "true"
                    },
                    {
                      "acteurRef": "PA642764",
                      "mandatRef": "PM753836",
                      "parDelegation": "true"
                    },
                    {
                      "acteurRef": "PA340357",
                      "mandatRef": "PM747435",
                      "parDelegation": "false"
                    }
                  ]
                }
              }
            }
          },
          {
            "organeRef": "PO723569",
            "nombreMembresGroupe": "19",
            "vote": {
              "positionMajoritaire": "contre",
              "decompteVoix": {
                "pour": "0",
                "contre": "14",
                "nonVotants": "0",
                "abstentions": "0",
                "nonVotantsVolontaires": "0"
              },
              "decompteNominatif": {
                "nonVotants": null,
                "abstentions": null,
                "pours": null,
                "contres": {
                  "votant": [
                    {
                      "acteurRef": "PA1206",
                      "mandatRef": "PM723354",
                      "parDelegation": "false"
                    },
                    {
                      "acteurRef": "PA720468",
                      "mandatRef": "PM722972",
                      "parDelegation": "true"
                    },
                    {
                      "acteurRef": "PA720614",
                      "mandatRef": "PM723016",
                      "parDelegation": "false"
                    },
                    {
                      "acteurRef": "PA336175",
                      "mandatRef": "PM723328",
                      "parDelegation": "false"
                    },
                    {
                      "acteurRef": "PA605694",
                      "mandatRef": "PM722558",
                      "parDelegation": "true"
                    },
                    {
                      "acteurRef": "PA606212",
                      "mandatRef": "PM722662",
                      "parDelegation": "false"
                    },
                    {
                      "acteurRef": "PA608292",
                      "mandatRef": "PM723076",
                      "parDelegation": "false"
                    },
                    {
                      "acteurRef": "PA719146",
                      "mandatRef": "PM722576",
                      "parDelegation": "true"
                    },
                    {
                      "acteurRef": "PA719608",
                      "mandatRef": "PM722710",
                      "parDelegation": "false"
                    },
                    {
                      "acteurRef": "PA720606",
                      "mandatRef": "PM723014",
                      "parDelegation": "false"
                    },
                    {
                      "acteurRef": "PA720798",
                      "mandatRef": "PM723080",
                      "parDelegation": "false"
                    },
                    {
                      "acteurRef": "PA720822",
                      "mandatRef": "PM723086",
                      "parDelegation": "true"
                    },
                    {
                      "acteurRef": "PA720996",
                      "mandatRef": "PM723134",
                      "parDelegation": "false"
                    },
                    {
                      "acteurRef": "PA721932",
                      "mandatRef": "PM734586",
                      "parDelegation": "true"
                    }
                  ]
                }
              }
            }
          },
          {
            "organeRef": "PO730958",
            "nombreMembresGroupe": "17",
            "vote": {
              "positionMajoritaire": "contre",
              "decompteVoix": {
                "pour": "0",
                "contre": "17",
                "nonVotants": "0",
                "abstentions": "0",
                "nonVotantsVolontaires": "0"
              },
              "decompteNominatif": {
                "nonVotants": null,
                "abstentions": null,
                "pours": null,
                "contres": {
                  "votant": [
                    {
                      "acteurRef": "PA588884",
                      "mandatRef": "PM723226",
                      "parDelegation": "true"
                    },
                    {
                      "acteurRef": "PA718860",
                      "mandatRef": "PM722482",
                      "parDelegation": "false"
                    },
                    {
                      "acteurRef": "PA718868",
                      "mandatRef": "PM722484",
                      "parDelegation": "true"
                    },
                    {
                      "acteurRef": "PA2150",
                      "mandatRef": "PM722506",
                      "parDelegation": "false"
                    },
                    {
                      "acteurRef": "PA719578",
                      "mandatRef": "PM722702",
                      "parDelegation": "false"
                    },
                    {
                      "acteurRef": "PA719676",
                      "mandatRef": "PM722728",
                      "parDelegation": "true"
                    },
                    {
                      "acteurRef": "PA720286",
                      "mandatRef": "PM722918",
                      "parDelegation": "true"
                    },
                    {
                      "acteurRef": "PA720422",
                      "mandatRef": "PM722960",
                      "parDelegation": "true"
                    },
                    {
                      "acteurRef": "PA720430",
                      "mandatRef": "PM722962",
                      "parDelegation": "true"
                    },
                    {
                      "acteurRef": "PA720846",
                      "mandatRef": "PM723094",
                      "parDelegation": "false"
                    },
                    {
                      "acteurRef": "PA720892",
                      "mandatRef": "PM723106",
                      "parDelegation": "false"
                    },
                    {
                      "acteurRef": "PA721062",
                      "mandatRef": "PM723158",
                      "parDelegation": "true"
                    },
                    {
                      "acteurRef": "PA721202",
                      "mandatRef": "PM723202",
                      "parDelegation": "false"
                    },
                    {
                      "acteurRef": "PA721210",
                      "mandatRef": "PM723204",
                      "parDelegation": "false"
                    },
                    {
                      "acteurRef": "PA721226",
                      "mandatRef": "PM723208",
                      "parDelegation": "false"
                    },
                    {
                      "acteurRef": "PA721960",
                      "mandatRef": "PM723434",
                      "parDelegation": "false"
                    },
                    {
                      "acteurRef": "PA722142",
                      "mandatRef": "PM723484",
                      "parDelegation": "true"
                    }
                  ]
                }
              }
            }
          },
          {
            "organeRef": "PO730940",
            "nombreMembresGroupe": "16",
            "vote": {
              "positionMajoritaire": "contre",
              "decompteVoix": {
                "pour": "0",
                "contre": "6",
                "nonVotants": "0",
                "abstentions": "0",
                "nonVotantsVolontaires": "0"
              },
              "decompteNominatif": {
                "nonVotants": null,
                "abstentions": null,
                "pours": null,
                "contres": {
                  "votant": [
                    {
                      "acteurRef": "PA722202",
                      "mandatRef": "PM723502",
                      "parDelegation": "false"
                    },
                    {
                      "acteurRef": "PA267306",
                      "mandatRef": "PM723054",
                      "parDelegation": "true"
                    },
                    {
                      "acteurRef": "PA718926",
                      "mandatRef": "PM722502",
                      "parDelegation": "true"
                    },
                    {
                      "acteurRef": "PA721270",
                      "mandatRef": "PM723220",
                      "parDelegation": "true"
                    },
                    {
                      "acteurRef": "PA721896",
                      "mandatRef": "PM723414",
                      "parDelegation": "false"
                    },
                    {
                      "acteurRef": "PA335612",
                      "mandatRef": "PM723506",
                      "parDelegation": "false"
                    }
                  ]
                }
              }
            }
          }
        ]
      }
    }
  },
  "miseAuPoint": {
    "nonVotants": [
      null,
      null
    ],
    "abstentions": [
      null,
      {
        "votant": [
          {
            "acteurRef": "PA719464",
            "mandatRef": "PM722670"
          },
          {
            "acteurRef": "PA721398",
            "mandatRef": "PM723262"
          }
        ]
      }
    ],
    "nonVotantsVolontaires": [
      null,
      null
    ],
    "pours": {
      "votant": [
        {
          "acteurRef": "PA717151",
          "mandatRef": "PM723374"
        },
        {
          "acteurRef": "PA606675",
          "mandatRef": "PM722742"
        },
        {
          "acteurRef": "PA719310",
          "mandatRef": "PM722622"
        },
        {
          "acteurRef": "PA721182",
          "mandatRef": "PM723196"
        },
        {
          "acteurRef": "PA721600",
          "mandatRef": "PM723330"
        },
        {
          "acteurRef": "PA721776",
          "mandatRef": "PM723380"
        },
        {
          "acteurRef": "PA722046",
          "mandatRef": "PM723458"
        }
      ]
    },
    "contres": null,
    "dysfonctionnement": {
      "nonVotants": null,
      "pour": null,
      "contre": null,
      "abstentions": null,
      "nonVotantsVolontaires": null
    }
  },
  "@xmlns": "http://schemas.assemblee-nationale.fr/referentiel"
}