{
  "@xmlns:xsi": "http://www.w3.org/2001/XMLSchema-instance",
  "uid": "VTANR5L15V1085",
  "numero": "1085",
  "organeRef": "PO717460",
  "legislature": "15",
  "sessionRef": "SCR5A2018E1",
  "seanceRef": "RUANR5L15S2018IDS21198",
  "dateScrutin": "2018-07-23T02:00:00.000+02:00",
  "quantiemeJourSeance": "2",
  "typeVote": {
    "codeTypeVote": "SPO",
    "libelleTypeVote": "scrutin public ordinaire",
    "typeMajorite": "majorité absolue des suffrages exprimés"
  },
  "sort": {
    "code": "rejeté",
    "libelle": "L'Assemblée nationale n'a pas adopté"
  },
  "titre": "l'amendement n° 35 de M. Dharréville et l'amendement identique suivant à l'article premier du projet de loi pour la liberté de choisir son avenir professionnel (nouvelle lecture).",
  "demandeur": {
    "texte": "Président du groupe \"UDI, Agir et Indépendants\"Président du groupe \"de la Gauche démocrate et républicaine\"",
    "referenceLegislative": null
  },
  "objet": {
    "libelle": "l'amendement n° 35 de M. Dharréville et l'amendement identique suivant à l'article premier du projet de loi pour la liberté de choisir son avenir professionnel (nouvelle lecture).",
    "referenceLegislative": null
  },
  "modePublicationDesVotes": "DecompteNominatif",
  "syntheseVote": {
    "nombreVotants": "81",
    "suffragesExprimes": "80",
    "nbrSuffragesRequis": "41",
    "annonce": "L'Assemblée nationale n'a pas adopté",
    "decompte": {
      "pour": "25",
      "contre": "55",
      "abstentions": "1",
      "nonVotants": "2",
      "nonVotantsVolontaires": "0"
    }
  },
  "ventilationVotes": {
    "organe": {
      "organeRef": "PO717460",
      "groupes": {
        "groupe": [
          {
            "organeRef": "PO730964",
            "nombreMembresGroupe": "312",
            "vote": {
              "positionMajoritaire": "contre",
              "decompteVoix": {
                "pour": "0",
                "contre": "51",
                "nonVotants": "1",
                "abstentions": "0",
                "nonVotantsVolontaires": "0"
              },
              "decompteNominatif": {
                "nonVotants": {
                  "votant": {
                    "acteurRef": "PA332747",
                    "mandatRef": "PM722798",
                    "causePositionVote": "PAN"
                  }
                },
                "abstentions": null,
                "pours": null,
                "contres": {
                  "votant": [
                    {
                      "acteurRef": "PA2449",
                      "mandatRef": "PM723036",
                      "parDelegation": "false"
                    },
                    {
                      "acteurRef": "PA608083",
                      "mandatRef": "PM723038",
                      "parDelegation": "false"
                    },
                    {
                      "acteurRef": "PA331835",
                      "mandatRef": "PM722688",
                      "parDelegation": "false"
                    },
                    {
                      "acteurRef": "PA717379",
                      "mandatRef": "PM723282",
                      "parDelegation": "false"
                    },
                    {
                      "acteurRef": "PA718674",
                      "mandatRef": "PM722420",
                      "parDelegation": "false"
                    },
                    {
                      "acteurRef": "PA718710",
                      "mandatRef": "PM722432",
                      "parDelegation": "false"
                    },
                    {
                      "acteurRef": "PA718744",
                      "mandatRef": "PM722442",
                      "parDelegation": "false"
                    },
                    {
                      "acteurRef": "PA718902",
                      "mandatRef": "PM722496",
                      "parDelegation": "false"
                    },
                    {
                      "acteurRef": "PA718930",
                      "mandatRef": "PM722504",
                      "parDelegation": "false"
                    },
                    {
                      "acteurRef": "PA719032",
                      "mandatRef": "PM722538",
                      "parDelegation": "false"
                    },
                    {
                      "acteurRef": "PA719072",
                      "mandatRef": "PM722552",
                      "parDelegation": "false"
                    },
                    {
                      "acteurRef": "PA719162",
                      "mandatRef": "PM722580",
                      "parDelegation": "false"
                    },
                    {
                      "acteurRef": "PA719170",
                      "mandatRef": "PM722582",
                      "parDelegation": "false"
                    },
                    {
                      "acteurRef": "PA719338",
                      "mandatRef": "PM722630",
                      "parDelegation": "false"
                    },
                    {
                      "acteurRef": "PA719448",
                      "mandatRef": "PM722666",
                      "parDelegation": "false"
                    },
                    {
                      "acteurRef": "PA719512",
                      "mandatRef": "PM722682",
                      "parDelegation": "false"
                    },
                    {
                      "acteurRef": "PA719540",
                      "mandatRef": "PM722690",
                      "parDelegation": "false"
                    },
                    {
                      "acteurRef": "PA719570",
                      "mandatRef": "PM722700",
                      "parDelegation": "false"
                    },
                    {
                      "acteurRef": "PA719624",
                      "mandatRef": "PM722714",
                      "parDelegation": "false"
                    },
                    {
                      "acteurRef": "PA719850",
                      "mandatRef": "PM722780",
                      "parDelegation": "false"
                    },
                    {
                      "acteurRef": "PA719890",
                      "mandatRef": "PM722790",
                      "parDelegation": "false"
                    },
                    {
                      "acteurRef": "PA719960",
                      "mandatRef": "PM722816",
                      "parDelegation": "false"
                    },
                    {
                      "acteurRef": "PA719972",
                      "mandatRef": "PM722820",
                      "parDelegation": "false"
                    },
                    {
                      "acteurRef": "PA719980",
                      "mandatRef": "PM722822",
                      "parDelegation": "false"
                    },
                    {
                      "acteurRef": "PA720074",
                      "mandatRef": "PM722850",
                      "parDelegation": "false"
                    },
                    {
                      "acteurRef": "PA720170",
                      "mandatRef": "PM722880",
                      "parDelegation": "false"
                    },
                    {
                      "acteurRef": "PA720268",
                      "mandatRef": "PM722912",
                      "parDelegation": "false"
                    },
                    {
                      "acteurRef": "PA720278",
                      "mandatRef": "PM722916",
                      "parDelegation": "false"
                    },
                    {
                      "acteurRef": "PA720342",
                      "mandatRef": "PM722934",
                      "parDelegation": "false"
                    },
                    {
                      "acteurRef": "PA720454",
                      "mandatRef": "PM722968",
                      "parDelegation": "false"
                    },
                    {
                      "acteurRef": "PA720512",
                      "mandatRef": "PM722986",
                      "parDelegation": "false"
                    },
                    {
                      "acteurRef": "PA720538",
                      "mandatRef": "PM722994",
                      "parDelegation": "false"
                    },
                    {
                      "acteurRef": "PA720560",
                      "mandatRef": "PM723000",
                      "parDelegation": "false"
                    },
                    {
                      "acteurRef": "PA720622",
                      "mandatRef": "PM723018",
                      "parDelegation": "false"
                    },
                    {
                      "acteurRef": "PA720814",
                      "mandatRef": "PM723084",
                      "parDelegation": "false"
                    },
                    {
                      "acteurRef": "PA720830",
                      "mandatRef": "PM723088",
                      "parDelegation": "false"
                    },
                    {
                      "acteurRef": "PA720900",
                      "mandatRef": "PM723108",
                      "parDelegation": "false"
                    },
                    {
                      "acteurRef": "PA720932",
                      "mandatRef": "PM723116",
                      "parDelegation": "false"
                    },
                    {
                      "acteurRef": "PA720952",
                      "mandatRef": "PM723122",
                      "parDelegation": "false"
                    },
                    {
                      "acteurRef": "PA721004",
                      "mandatRef": "PM723136",
                      "parDelegation": "false"
                    },
                    {
                      "acteurRef": "PA721194",
                      "mandatRef": "PM723200",
                      "parDelegation": "false"
                    },
                    {
                      "acteurRef": "PA721218",
                      "mandatRef": "PM723206",
                      "parDelegation": "false"
                    },
                    {
                      "acteurRef": "PA721328",
                      "mandatRef": "PM723240",
                      "parDelegation": "false"
                    },
                    {
                      "acteurRef": "PA721344",
                      "mandatRef": "PM723244",
                      "parDelegation": "false"
                    },
                    {
                      "acteurRef": "PA721450",
                      "mandatRef": "PM723278",
                      "parDelegation": "false"
                    },
                    {
                      "acteurRef": "PA721498",
                      "mandatRef": "PM723294",
                      "parDelegation": "false"
                    },
                    {
                      "acteurRef": "PA721710",
                      "mandatRef": "PM723362",
                      "parDelegation": "false"
                    },
                    {
                      "acteurRef": "PA721750",
                      "mandatRef": "PM723372",
                      "parDelegation": "false"
                    },
                    {
                      "acteurRef": "PA721808",
                      "mandatRef": "PM723388",
                      "parDelegation": "false"
                    },
                    {
                      "acteurRef": "PA722094",
                      "mandatRef": "PM723470",
                      "parDelegation": "false"
                    },
                    {
                      "acteurRef": "PA719326",
                      "mandatRef": "PM733709",
                      "parDelegation": "false"
                    }
                  ]
                }
              }
            }
          },
          {
            "organeRef": "PO730934",
            "nombreMembresGroupe": "103",
            "vote": {
              "positionMajoritaire": "pour",
              "decompteVoix": {
                "pour": "12",
                "contre": "0",
                "nonVotants": "1",
                "abstentions": "0",
                "nonVotantsVolontaires": "0"
              },
              "decompteNominatif": {
                "nonVotants": {
                  "votant": {
                    "acteurRef": "PA605991",
                    "mandatRef": "PM722660",
                    "causePositionVote": "PSE"
                  }
                },
                "abstentions": null,
                "pours": {
                  "votant": [
                    {
                      "acteurRef": "PA606712",
                      "mandatRef": "PM722756",
                      "parDelegation": "false"
                    },
                    {
                      "acteurRef": "PA856",
                      "mandatRef": "PM723288",
                      "parDelegation": "false"
                    },
                    {
                      "acteurRef": "PA266808",
                      "mandatRef": "PM723264",
                      "parDelegation": "false"
                    },
                    {
                      "acteurRef": "PA267429",
                      "mandatRef": "PM722818",
                      "parDelegation": "false"
                    },
                    {
                      "acteurRef": "PA266776",
                      "mandatRef": "PM723542",
                      "parDelegation": "false"
                    },
                    {
                      "acteurRef": "PA334654",
                      "mandatRef": "PM723566",
                      "parDelegation": "false"
                    },
                    {
                      "acteurRef": "PA267735",
                      "mandatRef": "PM722852",
                      "parDelegation": "false"
                    },
                    {
                      "acteurRef": "PA608416",
                      "mandatRef": "PM723540",
                      "parDelegation": "false"
                    },
                    {
                      "acteurRef": "PA642847",
                      "mandatRef": "PM722954",
                      "parDelegation": "false"
                    },
                    {
                      "acteurRef": "PA720630",
                      "mandatRef": "PM723020",
                      "parDelegation": "false"
                    },
                    {
                      "acteurRef": "PA721286",
                      "mandatRef": "PM723224",
                      "parDelegation": "false"
                    },
                    {
                      "acteurRef": "PA721474",
                      "mandatRef": "PM723286",
                      "parDelegation": "false"
                    }
                  ]
                },
                "contres": null
              }
            }
          },
          {
            "organeRef": "PO730970",
            "nombreMembresGroupe": "46",
            "vote": {
              "positionMajoritaire": "contre",
              "decompteVoix": {
                "pour": "0",
                "contre": "4",
                "nonVotants": "0",
                "abstentions": "1",
                "nonVotantsVolontaires": "1"
              },
              "decompteNominatif": {
                "nonVotants": null,
                "abstentions": {
                  "votant": {
                    "acteurRef": "PA720002",
                    "mandatRef": "PM722830",
                    "parDelegation": "false"
                  }
                },
                "pours": null,
                "contres": {
                  "votant": [
                    {
                      "acteurRef": "PA720334",
                      "mandatRef": "PM722932",
                      "parDelegation": "false"
                    },
                    {
                      "acteurRef": "PA720976",
                      "mandatRef": "PM723128",
                      "parDelegation": "false"
                    },
                    {
                      "acteurRef": "PA721182",
                      "mandatRef": "PM723196",
                      "parDelegation": "false"
                    },
                    {
                      "acteurRef": "PA721924",
                      "mandatRef": "PM723422",
                      "parDelegation": "false"
                    }
                  ]
                }
              }
            }
          },
          {
            "organeRef": "PO744425",
            "nombreMembresGroupe": "31",
            "vote": {
              "positionMajoritaire": "pour",
              "decompteVoix": {
                "pour": "3",
                "contre": "0",
                "nonVotants": "0",
                "abstentions": "0",
                "nonVotantsVolontaires": "0"
              },
              "decompteNominatif": {
                "nonVotants": null,
                "abstentions": null,
                "pours": {
                  "votant": [
                    {
                      "acteurRef": "PA267585",
                      "mandatRef": "PM722978",
                      "parDelegation": "false"
                    },
                    {
                      "acteurRef": "PA719806",
                      "mandatRef": "PM722768",
                      "parDelegation": "false"
                    },
                    {
                      "acteurRef": "PA642868",
                      "mandatRef": "PM722992",
                      "parDelegation": "false"
                    }
                  ]
                },
                "contres": null
              }
            }
          },
          {
            "organeRef": "PO730946",
            "nombreMembresGroupe": "30",
            "vote": {
              "positionMajoritaire": "pour",
              "decompteVoix": {
                "pour": "3",
                "contre": "0",
                "nonVotants": "0",
                "abstentions": "0",
                "nonVotantsVolontaires": "0"
              },
              "decompteNominatif": {
                "nonVotants": null,
                "abstentions": null,
                "pours": {
                  "votant": [
                    {
                      "acteurRef": "PA610681",
                      "mandatRef": "PM723150",
                      "parDelegation": "false"
                    },
                    {
                      "acteurRef": "PA720988",
                      "mandatRef": "PM723132",
                      "parDelegation": "false"
                    },
                    {
                      "acteurRef": "PA642764",
                      "mandatRef": "PM753836",
                      "parDelegation": "false"
                    }
                  ]
                },
                "contres": null
              }
            }
          },
          {
            "organeRef": "PO723569",
            "nombreMembresGroupe": "21",
            "vote": {
              "positionMajoritaire": "pour",
              "decompteVoix": {
                "pour": "1",
                "contre": "0",
                "nonVotants": "0",
                "abstentions": "0",
                "nonVotantsVolontaires": "0"
              },
              "decompteNominatif": {
                "nonVotants": null,
                "abstentions": null,
                "pours": {
                  "votant": {
                    "acteurRef": "PA608292",
                    "mandatRef": "PM723076",
                    "parDelegation": "false"
                  }
                },
                "contres": null
              }
            }
          },
          {
            "organeRef": "PO730958",
            "nombreMembresGroupe": "17",
            "vote": {
              "positionMajoritaire": "pour",
              "decompteVoix": {
                "pour": "3",
                "contre": "0",
                "nonVotants": "0",
                "abstentions": "0",
                "nonVotantsVolontaires": "0"
              },
              "decompteNominatif": {
                "nonVotants": null,
                "abstentions": null,
                "pours": {
                  "votant": [
                    {
                      "acteurRef": "PA719578",
                      "mandatRef": "PM722702",
                      "parDelegation": "false"
                    },
                    {
                      "acteurRef": "PA720422",
                      "mandatRef": "PM722960",
                      "parDelegation": "false"
                    },
                    {
                      "acteurRef": "PA721062",
                      "mandatRef": "PM723158",
                      "parDelegation": "false"
                    }
                  ]
                },
                "contres": null
              }
            }
          },
          {
            "organeRef": "PO730940",
            "nombreMembresGroupe": "16",
            "vote": {
              "positionMajoritaire": "pour",
              "decompteVoix": {
                "pour": "3",
                "contre": "0",
                "nonVotants": "0",
                "abstentions": "0",
                "nonVotantsVolontaires": "0"
              },
              "decompteNominatif": {
                "nonVotants": null,
                "abstentions": null,
                "pours": {
                  "votant": [
                    {
                      "acteurRef": "PA610654",
                      "mandatRef": "PM723142",
                      "parDelegation": "false"
                    },
                    {
                      "acteurRef": "PA718926",
                      "mandatRef": "PM722502",
                      "parDelegation": "false"
                    },
                    {
                      "acteurRef": "PA335612",
                      "mandatRef": "PM723506",
                      "parDelegation": "false"
                    }
                  ]
                },
                "contres": null
              }
            }
          }
        ]
      }
    }
  },
  "miseAuPoint": null,
  "@xmlns": "http://schemas.assemblee-nationale.fr/referentiel"
}