{
  "@xmlns:xsi": "http://www.w3.org/2001/XMLSchema-instance",
  "uid": "VTANR5L15V1993",
  "numero": "1993",
  "organeRef": "PO717460",
  "legislature": "15",
  "sessionRef": "SCR5A2019O1",
  "seanceRef": "RUANR5L15S2019IDS21735",
  "dateScrutin": "2019-06-27T02:00:00.000+02:00",
  "quantiemeJourSeance": "1",
  "typeVote": {
    "codeTypeVote": "SPO",
    "libelleTypeVote": "scrutin public ordinaire",
    "typeMajorite": "majorité absolue des suffrages exprimés"
  },
  "sort": {
    "code": "rejeté",
    "libelle": "L'Assemblée nationale n'a pas adopté"
  },
  "titre": "l'amendement n° 630 de M. Aubert à l'article premier du projet de loi relatif à l'énergie et au climat (première lecture).",
  "demandeur": {
    "texte": "Président du groupe \"Les Républicains\"",
    "referenceLegislative": null
  },
  "objet": {
    "libelle": "l'amendement n° 630 de M. Aubert à l'article premier du projet de loi relatif à l'énergie et au climat (première lecture).",
    "referenceLegislative": null
  },
  "modePublicationDesVotes": "DecompteNominatif",
  "syntheseVote": {
    "nombreVotants": "62",
    "suffragesExprimes": "55",
    "nbrSuffragesRequis": "28",
    "annonce": "L'Assemblée nationale n'a pas adopté",
    "decompte": {
      "pour": "5",
      "contre": "50",
      "abstentions": "7",
      "nonVotants": "2",
      "nonVotantsVolontaires": "0"
    }
  },
  "ventilationVotes": {
    "organe": {
      "organeRef": "PO717460",
      "groupes": {
        "groupe": [
          {
            "organeRef": "PO730964",
            "nombreMembresGroupe": "305",
            "vote": {
              "positionMajoritaire": "contre",
              "decompteVoix": {
                "pour": "0",
                "contre": "39",
                "nonVotants": "1",
                "abstentions": "0",
                "nonVotantsVolontaires": "0"
              },
              "decompteNominatif": {
                "nonVotants": {
                  "votant": {
                    "acteurRef": "PA606171",
                    "mandatRef": "PM722632",
                    "causePositionVote": "PAN"
                  }
                },
                "abstentions": null,
                "pours": null,
                "contres": {
                  "votant": [
                    {
                      "acteurRef": "PA608083",
                      "mandatRef": "PM723038",
                      "parDelegation": "true"
                    },
                    {
                      "acteurRef": "PA607155",
                      "mandatRef": "PM722832",
                      "parDelegation": "false"
                    },
                    {
                      "acteurRef": "PA719520",
                      "mandatRef": "PM722684",
                      "parDelegation": "false"
                    },
                    {
                      "acteurRef": "PA721852",
                      "mandatRef": "PM723402",
                      "parDelegation": "false"
                    },
                    {
                      "acteurRef": "PA720492",
                      "mandatRef": "PM722980",
                      "parDelegation": "false"
                    },
                    {
                      "acteurRef": "PA718710",
                      "mandatRef": "PM722432",
                      "parDelegation": "false"
                    },
                    {
                      "acteurRef": "PA718756",
                      "mandatRef": "PM722446",
                      "parDelegation": "false"
                    },
                    {
                      "acteurRef": "PA718930",
                      "mandatRef": "PM722504",
                      "parDelegation": "false"
                    },
                    {
                      "acteurRef": "PA719080",
                      "mandatRef": "PM722554",
                      "parDelegation": "false"
                    },
                    {
                      "acteurRef": "PA719092",
                      "mandatRef": "PM722560",
                      "parDelegation": "false"
                    },
                    {
                      "acteurRef": "PA719100",
                      "mandatRef": "PM722562",
                      "parDelegation": "false"
                    },
                    {
                      "acteurRef": "PA719170",
                      "mandatRef": "PM722582",
                      "parDelegation": "false"
                    },
                    {
                      "acteurRef": "PA719242",
                      "mandatRef": "PM722604",
                      "parDelegation": "false"
                    },
                    {
                      "acteurRef": "PA719258",
                      "mandatRef": "PM722608",
                      "parDelegation": "false"
                    },
                    {
                      "acteurRef": "PA719310",
                      "mandatRef": "PM722622",
                      "parDelegation": "false"
                    },
                    {
                      "acteurRef": "PA719440",
                      "mandatRef": "PM722664",
                      "parDelegation": "false"
                    },
                    {
                      "acteurRef": "PA719740",
                      "mandatRef": "PM722748",
                      "parDelegation": "false"
                    },
                    {
                      "acteurRef": "PA719790",
                      "mandatRef": "PM722764",
                      "parDelegation": "false"
                    },
                    {
                      "acteurRef": "PA719798",
                      "mandatRef": "PM722766",
                      "parDelegation": "true"
                    },
                    {
                      "acteurRef": "PA719972",
                      "mandatRef": "PM722820",
                      "parDelegation": "false"
                    },
                    {
                      "acteurRef": "PA720014",
                      "mandatRef": "PM722834",
                      "parDelegation": "false"
                    },
                    {
                      "acteurRef": "PA720046",
                      "mandatRef": "PM722842",
                      "parDelegation": "true"
                    },
                    {
                      "acteurRef": "PA720342",
                      "mandatRef": "PM722934",
                      "parDelegation": "false"
                    },
                    {
                      "acteurRef": "PA720362",
                      "mandatRef": "PM722942",
                      "parDelegation": "false"
                    },
                    {
                      "acteurRef": "PA720414",
                      "mandatRef": "PM722958",
                      "parDelegation": "false"
                    },
                    {
                      "acteurRef": "PA720480",
                      "mandatRef": "PM722976",
                      "parDelegation": "true"
                    },
                    {
                      "acteurRef": "PA720854",
                      "mandatRef": "PM723096",
                      "parDelegation": "false"
                    },
                    {
                      "acteurRef": "PA721134",
                      "mandatRef": "PM723184",
                      "parDelegation": "false"
                    },
                    {
                      "acteurRef": "PA721158",
                      "mandatRef": "PM723190",
                      "parDelegation": "false"
                    },
                    {
                      "acteurRef": "PA721218",
                      "mandatRef": "PM723206",
                      "parDelegation": "true"
                    },
                    {
                      "acteurRef": "PA721384",
                      "mandatRef": "PM723256",
                      "parDelegation": "true"
                    },
                    {
                      "acteurRef": "PA721726",
                      "mandatRef": "PM723366",
                      "parDelegation": "false"
                    },
                    {
                      "acteurRef": "PA721750",
                      "mandatRef": "PM723372",
                      "parDelegation": "false"
                    },
                    {
                      "acteurRef": "PA722038",
                      "mandatRef": "PM723456",
                      "parDelegation": "false"
                    },
                    {
                      "acteurRef": "PA722062",
                      "mandatRef": "PM723462",
                      "parDelegation": "false"
                    },
                    {
                      "acteurRef": "PA722170",
                      "mandatRef": "PM723492",
                      "parDelegation": "false"
                    },
                    {
                      "acteurRef": "PA722336",
                      "mandatRef": "PM723544",
                      "parDelegation": "false"
                    },
                    {
                      "acteurRef": "PA702054",
                      "mandatRef": "PM733713",
                      "parDelegation": "false"
                    },
                    {
                      "acteurRef": "PA760658",
                      "mandatRef": "PM760662",
                      "parDelegation": "true"
                    }
                  ]
                }
              }
            }
          },
          {
            "organeRef": "PO730934",
            "nombreMembresGroupe": "104",
            "vote": {
              "positionMajoritaire": "pour",
              "decompteVoix": {
                "pour": "2",
                "contre": "0",
                "nonVotants": "1",
                "abstentions": "1",
                "nonVotantsVolontaires": "1"
              },
              "decompteNominatif": {
                "nonVotants": {
                  "votant": {
                    "acteurRef": "PA1874",
                    "mandatRef": "PM722598",
                    "causePositionVote": "PSE"
                  }
                },
                "abstentions": {
                  "votant": {
                    "acteurRef": "PA606712",
                    "mandatRef": "PM722756",
                    "parDelegation": "false"
                  }
                },
                "pours": {
                  "votant": [
                    {
                      "acteurRef": "PA609726",
                      "mandatRef": "PM723426",
                      "parDelegation": "false"
                    },
                    {
                      "acteurRef": "PA721046",
                      "mandatRef": "PM723154",
                      "parDelegation": "false"
                    }
                  ]
                },
                "contres": null
              }
            }
          },
          {
            "organeRef": "PO730970",
            "nombreMembresGroupe": "46",
            "vote": {
              "positionMajoritaire": "contre",
              "decompteVoix": {
                "pour": "0",
                "contre": "7",
                "nonVotants": "0",
                "abstentions": "0",
                "nonVotantsVolontaires": "0"
              },
              "decompteNominatif": {
                "nonVotants": null,
                "abstentions": null,
                "pours": null,
                "contres": {
                  "votant": [
                    {
                      "acteurRef": "PA721418",
                      "mandatRef": "PM723268",
                      "parDelegation": "false"
                    },
                    {
                      "acteurRef": "PA720162",
                      "mandatRef": "PM722878",
                      "parDelegation": "false"
                    },
                    {
                      "acteurRef": "PA720334",
                      "mandatRef": "PM722932",
                      "parDelegation": "false"
                    },
                    {
                      "acteurRef": "PA720728",
                      "mandatRef": "PM723058",
                      "parDelegation": "false"
                    },
                    {
                      "acteurRef": "PA720764",
                      "mandatRef": "PM723070",
                      "parDelegation": "false"
                    },
                    {
                      "acteurRef": "PA721182",
                      "mandatRef": "PM723196",
                      "parDelegation": "false"
                    },
                    {
                      "acteurRef": "PA721924",
                      "mandatRef": "PM723422",
                      "parDelegation": "false"
                    }
                  ]
                }
              }
            }
          },
          {
            "organeRef": "PO758835",
            "nombreMembresGroupe": "29",
            "vote": {
              "positionMajoritaire": "abstention",
              "decompteVoix": {
                "pour": "0",
                "contre": "0",
                "nonVotants": "0",
                "abstentions": "1",
                "nonVotantsVolontaires": "1"
              },
              "decompteNominatif": {
                "nonVotants": null,
                "abstentions": {
                  "votant": {
                    "acteurRef": "PA342415",
                    "mandatRef": "PM722826",
                    "parDelegation": "false"
                  }
                },
                "pours": null,
                "contres": null
              }
            }
          },
          {
            "organeRef": "PO765636",
            "nombreMembresGroupe": "28",
            "vote": {
              "positionMajoritaire": "pour",
              "decompteVoix": {
                "pour": "1",
                "contre": "0",
                "nonVotants": "0",
                "abstentions": "0",
                "nonVotantsVolontaires": "0"
              },
              "decompteNominatif": {
                "nonVotants": null,
                "abstentions": null,
                "pours": {
                  "votant": {
                    "acteurRef": "PA331567",
                    "mandatRef": "PM722644",
                    "parDelegation": "false"
                  }
                },
                "contres": null
              }
            }
          },
          {
            "organeRef": "PO759900",
            "nombreMembresGroupe": "18",
            "vote": {
              "positionMajoritaire": "pour",
              "decompteVoix": {
                "pour": "2",
                "contre": "2",
                "nonVotants": "0",
                "abstentions": "0",
                "nonVotantsVolontaires": "0"
              },
              "decompteNominatif": {
                "nonVotants": null,
                "abstentions": null,
                "pours": {
                  "votant": [
                    {
                      "acteurRef": "PA331582",
                      "mandatRef": "PM722646",
                      "parDelegation": "false"
                    },
                    {
                      "acteurRef": "PA405480",
                      "mandatRef": "PM723118",
                      "parDelegation": "false"
                    }
                  ]
                },
                "contres": {
                  "votant": [
                    {
                      "acteurRef": "PA605518",
                      "mandatRef": "PM722518",
                      "parDelegation": "false"
                    },
                    {
                      "acteurRef": "PA719146",
                      "mandatRef": "PM722576",
                      "parDelegation": "false"
                    }
                  ]
                }
              }
            }
          },
          {
            "organeRef": "PO730958",
            "nombreMembresGroupe": "17",
            "vote": {
              "positionMajoritaire": "abstention",
              "decompteVoix": {
                "pour": "0",
                "contre": "0",
                "nonVotants": "0",
                "abstentions": "4",
                "nonVotantsVolontaires": "4"
              },
              "decompteNominatif": {
                "nonVotants": null,
                "abstentions": {
                  "votant": [
                    {
                      "acteurRef": "PA718860",
                      "mandatRef": "PM722482",
                      "parDelegation": "false"
                    },
                    {
                      "acteurRef": "PA720846",
                      "mandatRef": "PM723094",
                      "parDelegation": "false"
                    },
                    {
                      "acteurRef": "PA721210",
                      "mandatRef": "PM723204",
                      "parDelegation": "false"
                    },
                    {
                      "acteurRef": "PA721960",
                      "mandatRef": "PM723434",
                      "parDelegation": "false"
                    }
                  ]
                },
                "pours": null,
                "contres": null
              }
            }
          },
          {
            "organeRef": "PO730940",
            "nombreMembresGroupe": "16",
            "vote": {
              "positionMajoritaire": "abstention",
              "decompteVoix": {
                "pour": "0",
                "contre": "0",
                "nonVotants": "0",
                "abstentions": "1",
                "nonVotantsVolontaires": "1"
              },
              "decompteNominatif": {
                "nonVotants": null,
                "abstentions": {
                  "votant": {
                    "acteurRef": "PA722110",
                    "mandatRef": "PM723474",
                    "parDelegation": "false"
                  }
                },
                "pours": null,
                "contres": null
              }
            }
          },
          {
            "organeRef": "PO723569",
            "nombreMembresGroupe": "14",
            "vote": {
              "positionMajoritaire": "contre",
              "decompteVoix": {
                "pour": "0",
                "contre": "2",
                "nonVotants": "0",
                "abstentions": "0",
                "nonVotantsVolontaires": "0"
              },
              "decompteNominatif": {
                "nonVotants": null,
                "abstentions": null,
                "pours": null,
                "contres": {
                  "votant": [
                    {
                      "acteurRef": "PA720278",
                      "mandatRef": "PM722916",
                      "parDelegation": "false"
                    },
                    {
                      "acteurRef": "PA335999",
                      "mandatRef": "PM723480",
                      "parDelegation": "false"
                    }
                  ]
                }
              }
            }
          }
        ]
      }
    }
  },
  "miseAuPoint": null,
  "@xmlns": "http://schemas.assemblee-nationale.fr/referentiel"
}