{
  "@xmlns:xsi": "http://www.w3.org/2001/XMLSchema-instance",
  "uid": "VTANR5L15V1141",
  "numero": "1141",
  "organeRef": "PO717460",
  "legislature": "15",
  "sessionRef": "SCR5A2018E2",
  "seanceRef": "RUANR5L15S2018IDS21237",
  "dateScrutin": "2018-09-14T02:00:00.000+02:00",
  "quantiemeJourSeance": "3",
  "typeVote": {
    "codeTypeVote": "SPO",
    "libelleTypeVote": "scrutin public ordinaire",
    "typeMajorite": "majorité absolue des suffrages exprimés"
  },
  "sort": {
    "code": "rejeté",
    "libelle": "L'Assemblée nationale n'a pas adopté"
  },
  "titre": "l'amendement n° 671 de M. Ruffin à l'article 13 bis A du projet de loi pour l'équilibre des relations commerciales dans le secteur agricole et alimentaire et une alimentation saine, durable et accessible à tous (nouvelle lecture).",
  "demandeur": {
    "texte": "Président du groupe \"La France insoumise\"",
    "referenceLegislative": null
  },
  "objet": {
    "libelle": "l'amendement n° 671 de M. Ruffin à l'article 13 bis A du projet de loi pour l'équilibre des relations commerciales dans le secteur agricole et alimentaire et une alimentation saine, durable et accessible à tous (nouvelle lecture).",
    "referenceLegislative": null
  },
  "modePublicationDesVotes": "DecompteNominatif",
  "syntheseVote": {
    "nombreVotants": "43",
    "suffragesExprimes": "39",
    "nbrSuffragesRequis": "20",
    "annonce": "L'Assemblée nationale n'a pas adopté",
    "decompte": {
      "pour": "13",
      "contre": "26",
      "abstentions": "4",
      "nonVotants": "2",
      "nonVotantsVolontaires": "0"
    }
  },
  "ventilationVotes": {
    "organe": {
      "organeRef": "PO717460",
      "groupes": {
        "groupe": [
          {
            "organeRef": "PO730964",
            "nombreMembresGroupe": "312",
            "vote": {
              "positionMajoritaire": "contre",
              "decompteVoix": {
                "pour": "0",
                "contre": "20",
                "nonVotants": "1",
                "abstentions": "2",
                "nonVotantsVolontaires": "2"
              },
              "decompteNominatif": {
                "nonVotants": {
                  "votant": {
                    "acteurRef": "PA606171",
                    "mandatRef": "PM722632",
                    "causePositionVote": "PAN"
                  }
                },
                "abstentions": {
                  "votant": [
                    {
                      "acteurRef": "PA721600",
                      "mandatRef": "PM723330",
                      "parDelegation": "false"
                    },
                    {
                      "acteurRef": "PA721776",
                      "mandatRef": "PM723380",
                      "parDelegation": "false"
                    }
                  ]
                },
                "pours": null,
                "contres": {
                  "votant": [
                    {
                      "acteurRef": "PA609520",
                      "mandatRef": "PM723508",
                      "parDelegation": "false"
                    },
                    {
                      "acteurRef": "PA718794",
                      "mandatRef": "PM722460",
                      "parDelegation": "false"
                    },
                    {
                      "acteurRef": "PA718894",
                      "mandatRef": "PM722494",
                      "parDelegation": "false"
                    },
                    {
                      "acteurRef": "PA719154",
                      "mandatRef": "PM722578",
                      "parDelegation": "false"
                    },
                    {
                      "acteurRef": "PA719242",
                      "mandatRef": "PM722604",
                      "parDelegation": "false"
                    },
                    {
                      "acteurRef": "PA719310",
                      "mandatRef": "PM722622",
                      "parDelegation": "false"
                    },
                    {
                      "acteurRef": "PA719338",
                      "mandatRef": "PM722630",
                      "parDelegation": "false"
                    },
                    {
                      "acteurRef": "PA719412",
                      "mandatRef": "PM722654",
                      "parDelegation": "false"
                    },
                    {
                      "acteurRef": "PA719540",
                      "mandatRef": "PM722690",
                      "parDelegation": "false"
                    },
                    {
                      "acteurRef": "PA719660",
                      "mandatRef": "PM722724",
                      "parDelegation": "false"
                    },
                    {
                      "acteurRef": "PA719718",
                      "mandatRef": "PM722740",
                      "parDelegation": "false"
                    },
                    {
                      "acteurRef": "PA719858",
                      "mandatRef": "PM722782",
                      "parDelegation": "false"
                    },
                    {
                      "acteurRef": "PA720242",
                      "mandatRef": "PM722902",
                      "parDelegation": "false"
                    },
                    {
                      "acteurRef": "PA720342",
                      "mandatRef": "PM722934",
                      "parDelegation": "false"
                    },
                    {
                      "acteurRef": "PA720862",
                      "mandatRef": "PM723098",
                      "parDelegation": "false"
                    },
                    {
                      "acteurRef": "PA721246",
                      "mandatRef": "PM723214",
                      "parDelegation": "false"
                    },
                    {
                      "acteurRef": "PA721844",
                      "mandatRef": "PM723400",
                      "parDelegation": "false"
                    },
                    {
                      "acteurRef": "PA722070",
                      "mandatRef": "PM723464",
                      "parDelegation": "false"
                    },
                    {
                      "acteurRef": "PA722228",
                      "mandatRef": "PM723512",
                      "parDelegation": "false"
                    },
                    {
                      "acteurRef": "PA722366",
                      "mandatRef": "PM723554",
                      "parDelegation": "false"
                    }
                  ]
                }
              }
            }
          },
          {
            "organeRef": "PO730934",
            "nombreMembresGroupe": "103",
            "vote": {
              "positionMajoritaire": "pour",
              "decompteVoix": {
                "pour": "1",
                "contre": "0",
                "nonVotants": "0",
                "abstentions": "1",
                "nonVotantsVolontaires": "1"
              },
              "decompteNominatif": {
                "nonVotants": null,
                "abstentions": {
                  "votant": {
                    "acteurRef": "PA721286",
                    "mandatRef": "PM723224",
                    "parDelegation": "false"
                  }
                },
                "pours": {
                  "votant": {
                    "acteurRef": "PA267440",
                    "mandatRef": "PM722522",
                    "parDelegation": "false"
                  }
                },
                "contres": null
              }
            }
          },
          {
            "organeRef": "PO730970",
            "nombreMembresGroupe": "46",
            "vote": {
              "positionMajoritaire": "contre",
              "decompteVoix": {
                "pour": "1",
                "contre": "2",
                "nonVotants": "0",
                "abstentions": "0",
                "nonVotantsVolontaires": "0"
              },
              "decompteNominatif": {
                "nonVotants": null,
                "abstentions": null,
                "pours": {
                  "votant": {
                    "acteurRef": "PA721234",
                    "mandatRef": "PM723210",
                    "parDelegation": "false"
                  }
                },
                "contres": {
                  "votant": [
                    {
                      "acteurRef": "PA721976",
                      "mandatRef": "PM723438",
                      "parDelegation": "false"
                    },
                    {
                      "acteurRef": "PA722162",
                      "mandatRef": "PM723490",
                      "parDelegation": "false"
                    }
                  ]
                }
              }
            }
          },
          {
            "organeRef": "PO744425",
            "nombreMembresGroupe": "31",
            "vote": {
              "positionMajoritaire": "contre",
              "decompteVoix": {
                "pour": "1",
                "contre": "3",
                "nonVotants": "1",
                "abstentions": "0",
                "nonVotantsVolontaires": "0"
              },
              "decompteNominatif": {
                "nonVotants": {
                  "votant": {
                    "acteurRef": "PA1960",
                    "mandatRef": "PM722810",
                    "causePositionVote": "PSE"
                  }
                },
                "abstentions": null,
                "pours": {
                  "votant": {
                    "acteurRef": "PA722030",
                    "mandatRef": "PM723454",
                    "parDelegation": "false"
                  }
                },
                "contres": {
                  "votant": [
                    {
                      "acteurRef": "PA332228",
                      "mandatRef": "PM722754",
                      "parDelegation": "false"
                    },
                    {
                      "acteurRef": "PA720230",
                      "mandatRef": "PM722898",
                      "parDelegation": "false"
                    },
                    {
                      "acteurRef": "PA719806",
                      "mandatRef": "PM722768",
                      "parDelegation": "false"
                    }
                  ]
                }
              }
            }
          },
          {
            "organeRef": "PO723569",
            "nombreMembresGroupe": "21",
            "vote": {
              "positionMajoritaire": "pour",
              "decompteVoix": {
                "pour": "3",
                "contre": "0",
                "nonVotants": "0",
                "abstentions": "0",
                "nonVotantsVolontaires": "0"
              },
              "decompteNominatif": {
                "nonVotants": null,
                "abstentions": null,
                "pours": {
                  "votant": [
                    {
                      "acteurRef": "PA719608",
                      "mandatRef": "PM722710",
                      "parDelegation": "false"
                    },
                    {
                      "acteurRef": "PA720996",
                      "mandatRef": "PM723134",
                      "parDelegation": "false"
                    },
                    {
                      "acteurRef": "PA335999",
                      "mandatRef": "PM723480",
                      "parDelegation": "false"
                    }
                  ]
                },
                "contres": null
              }
            }
          },
          {
            "organeRef": "PO730958",
            "nombreMembresGroupe": "17",
            "vote": {
              "positionMajoritaire": "pour",
              "decompteVoix": {
                "pour": "6",
                "contre": "0",
                "nonVotants": "0",
                "abstentions": "0",
                "nonVotantsVolontaires": "0"
              },
              "decompteNominatif": {
                "nonVotants": null,
                "abstentions": null,
                "pours": {
                  "votant": [
                    {
                      "acteurRef": "PA2150",
                      "mandatRef": "PM722506",
                      "parDelegation": "false"
                    },
                    {
                      "acteurRef": "PA720846",
                      "mandatRef": "PM723094",
                      "parDelegation": "false"
                    },
                    {
                      "acteurRef": "PA720892",
                      "mandatRef": "PM723106",
                      "parDelegation": "false"
                    },
                    {
                      "acteurRef": "PA721210",
                      "mandatRef": "PM723204",
                      "parDelegation": "false"
                    },
                    {
                      "acteurRef": "PA721226",
                      "mandatRef": "PM723208",
                      "parDelegation": "false"
                    },
                    {
                      "acteurRef": "PA722142",
                      "mandatRef": "PM723484",
                      "parDelegation": "false"
                    }
                  ]
                },
                "contres": null
              }
            }
          },
          {
            "organeRef": "PO730940",
            "nombreMembresGroupe": "16",
            "vote": {
              "positionMajoritaire": "pour",
              "decompteVoix": {
                "pour": "1",
                "contre": "0",
                "nonVotants": "0",
                "abstentions": "0",
                "nonVotantsVolontaires": "0"
              },
              "decompteNominatif": {
                "nonVotants": null,
                "abstentions": null,
                "pours": {
                  "votant": {
                    "acteurRef": "PA335612",
                    "mandatRef": "PM723506",
                    "parDelegation": "false"
                  }
                },
                "contres": null
              }
            }
          }
        ]
      }
    }
  },
  "miseAuPoint": null,
  "@xmlns": "http://schemas.assemblee-nationale.fr/referentiel"
}