{
  "@xmlns:xsi": "http://www.w3.org/2001/XMLSchema-instance",
  "uid": "VTANR5L15V1163",
  "numero": "1163",
  "organeRef": "PO717460",
  "legislature": "15",
  "sessionRef": "SCR5A2018E2",
  "seanceRef": "RUANR5L15S2018IDS21242",
  "dateScrutin": "2018-09-19T02:00:00.000+02:00",
  "quantiemeJourSeance": "1",
  "typeVote": {
    "codeTypeVote": "SPO",
    "libelleTypeVote": "scrutin public ordinaire",
    "typeMajorite": "majorité absolue des suffrages exprimés"
  },
  "sort": {
    "code": "rejeté",
    "libelle": "L'Assemblée nationale n'a pas adopté"
  },
  "titre": "l'amendement n° 152 de Mme Pires Beaune à l'article 13 du projet de loi relatif à la lutte contre la fraude (première lecture).",
  "demandeur": {
    "texte": "Présidente du groupe \"Socialistes et apparentés\"",
    "referenceLegislative": null
  },
  "objet": {
    "libelle": "l'amendement n° 152 de Mme Pires Beaune à l'article 13 du projet de loi relatif à la lutte contre la fraude (première lecture).",
    "referenceLegislative": null
  },
  "modePublicationDesVotes": "DecompteNominatif",
  "syntheseVote": {
    "nombreVotants": "93",
    "suffragesExprimes": "83",
    "nbrSuffragesRequis": "42",
    "annonce": "L'Assemblée nationale n'a pas adopté",
    "decompte": {
      "pour": "6",
      "contre": "77",
      "abstentions": "10",
      "nonVotants": "2",
      "nonVotantsVolontaires": "0"
    }
  },
  "ventilationVotes": {
    "organe": {
      "organeRef": "PO717460",
      "groupes": {
        "groupe": [
          {
            "organeRef": "PO730964",
            "nombreMembresGroupe": "311",
            "vote": {
              "positionMajoritaire": "contre",
              "decompteVoix": {
                "pour": "0",
                "contre": "59",
                "nonVotants": "2",
                "abstentions": "0",
                "nonVotantsVolontaires": "0"
              },
              "decompteNominatif": {
                "nonVotants": {
                  "votant": [
                    {
                      "acteurRef": "PA606171",
                      "mandatRef": "PM722632",
                      "causePositionVote": "PAN"
                    },
                    {
                      "acteurRef": "PA720622",
                      "mandatRef": "PM723018",
                      "causePositionVote": "PSE"
                    }
                  ]
                },
                "abstentions": null,
                "pours": null,
                "contres": {
                  "votant": [
                    {
                      "acteurRef": "PA719952",
                      "mandatRef": "PM722814",
                      "parDelegation": "false"
                    },
                    {
                      "acteurRef": "PA267336",
                      "mandatRef": "PM722434",
                      "parDelegation": "false"
                    },
                    {
                      "acteurRef": "PA607595",
                      "mandatRef": "PM722924",
                      "parDelegation": "false"
                    },
                    {
                      "acteurRef": "PA721852",
                      "mandatRef": "PM723402",
                      "parDelegation": "false"
                    },
                    {
                      "acteurRef": "PA720492",
                      "mandatRef": "PM722980",
                      "parDelegation": "false"
                    },
                    {
                      "acteurRef": "PA718682",
                      "mandatRef": "PM722422",
                      "parDelegation": "false"
                    },
                    {
                      "acteurRef": "PA718736",
                      "mandatRef": "PM722440",
                      "parDelegation": "false"
                    },
                    {
                      "acteurRef": "PA718962",
                      "mandatRef": "PM722514",
                      "parDelegation": "false"
                    },
                    {
                      "acteurRef": "PA719006",
                      "mandatRef": "PM722530",
                      "parDelegation": "false"
                    },
                    {
                      "acteurRef": "PA719024",
                      "mandatRef": "PM722536",
                      "parDelegation": "false"
                    },
                    {
                      "acteurRef": "PA719060",
                      "mandatRef": "PM722546",
                      "parDelegation": "false"
                    },
                    {
                      "acteurRef": "PA719100",
                      "mandatRef": "PM722562",
                      "parDelegation": "false"
                    },
                    {
                      "acteurRef": "PA719162",
                      "mandatRef": "PM722580",
                      "parDelegation": "false"
                    },
                    {
                      "acteurRef": "PA719186",
                      "mandatRef": "PM722588",
                      "parDelegation": "false"
                    },
                    {
                      "acteurRef": "PA719230",
                      "mandatRef": "PM722600",
                      "parDelegation": "false"
                    },
                    {
                      "acteurRef": "PA719250",
                      "mandatRef": "PM722606",
                      "parDelegation": "false"
                    },
                    {
                      "acteurRef": "PA719294",
                      "mandatRef": "PM722618",
                      "parDelegation": "false"
                    },
                    {
                      "acteurRef": "PA719456",
                      "mandatRef": "PM722668",
                      "parDelegation": "false"
                    },
                    {
                      "acteurRef": "PA719710",
                      "mandatRef": "PM722738",
                      "parDelegation": "false"
                    },
                    {
                      "acteurRef": "PA719718",
                      "mandatRef": "PM722740",
                      "parDelegation": "false"
                    },
                    {
                      "acteurRef": "PA719778",
                      "mandatRef": "PM722760",
                      "parDelegation": "false"
                    },
                    {
                      "acteurRef": "PA719798",
                      "mandatRef": "PM722766",
                      "parDelegation": "false"
                    },
                    {
                      "acteurRef": "PA719850",
                      "mandatRef": "PM722780",
                      "parDelegation": "false"
                    },
                    {
                      "acteurRef": "PA719922",
                      "mandatRef": "PM722802",
                      "parDelegation": "false"
                    },
                    {
                      "acteurRef": "PA719980",
                      "mandatRef": "PM722822",
                      "parDelegation": "false"
                    },
                    {
                      "acteurRef": "PA719994",
                      "mandatRef": "PM722828",
                      "parDelegation": "false"
                    },
                    {
                      "acteurRef": "PA720030",
                      "mandatRef": "PM722838",
                      "parDelegation": "false"
                    },
                    {
                      "acteurRef": "PA643175",
                      "mandatRef": "PM722868",
                      "parDelegation": "false"
                    },
                    {
                      "acteurRef": "PA720138",
                      "mandatRef": "PM722872",
                      "parDelegation": "false"
                    },
                    {
                      "acteurRef": "PA720190",
                      "mandatRef": "PM722886",
                      "parDelegation": "false"
                    },
                    {
                      "acteurRef": "PA720222",
                      "mandatRef": "PM722896",
                      "parDelegation": "false"
                    },
                    {
                      "acteurRef": "PA720278",
                      "mandatRef": "PM722916",
                      "parDelegation": "false"
                    },
                    {
                      "acteurRef": "PA720298",
                      "mandatRef": "PM722922",
                      "parDelegation": "false"
                    },
                    {
                      "acteurRef": "PA720318",
                      "mandatRef": "PM722928",
                      "parDelegation": "false"
                    },
                    {
                      "acteurRef": "PA720362",
                      "mandatRef": "PM722942",
                      "parDelegation": "false"
                    },
                    {
                      "acteurRef": "PA720394",
                      "mandatRef": "PM722950",
                      "parDelegation": "false"
                    },
                    {
                      "acteurRef": "PA720446",
                      "mandatRef": "PM722966",
                      "parDelegation": "false"
                    },
                    {
                      "acteurRef": "PA720480",
                      "mandatRef": "PM722976",
                      "parDelegation": "false"
                    },
                    {
                      "acteurRef": "PA720878",
                      "mandatRef": "PM723102",
                      "parDelegation": "false"
                    },
                    {
                      "acteurRef": "PA720944",
                      "mandatRef": "PM723120",
                      "parDelegation": "false"
                    },
                    {
                      "acteurRef": "PA721150",
                      "mandatRef": "PM723188",
                      "parDelegation": "false"
                    },
                    {
                      "acteurRef": "PA721158",
                      "mandatRef": "PM723190",
                      "parDelegation": "false"
                    },
                    {
                      "acteurRef": "PA721218",
                      "mandatRef": "PM723206",
                      "parDelegation": "false"
                    },
                    {
                      "acteurRef": "PA721372",
                      "mandatRef": "PM723252",
                      "parDelegation": "false"
                    },
                    {
                      "acteurRef": "PA721450",
                      "mandatRef": "PM723278",
                      "parDelegation": "false"
                    },
                    {
                      "acteurRef": "PA721498",
                      "mandatRef": "PM723294",
                      "parDelegation": "false"
                    },
                    {
                      "acteurRef": "PA721522",
                      "mandatRef": "PM723300",
                      "parDelegation": "false"
                    },
                    {
                      "acteurRef": "PA721542",
                      "mandatRef": "PM723308",
                      "parDelegation": "false"
                    },
                    {
                      "acteurRef": "PA721584",
                      "mandatRef": "PM723324",
                      "parDelegation": "false"
                    },
                    {
                      "acteurRef": "PA721670",
                      "mandatRef": "PM723350",
                      "parDelegation": "false"
                    },
                    {
                      "acteurRef": "PA721764",
                      "mandatRef": "PM723376",
                      "parDelegation": "false"
                    },
                    {
                      "acteurRef": "PA721860",
                      "mandatRef": "PM723404",
                      "parDelegation": "false"
                    },
                    {
                      "acteurRef": "PA721916",
                      "mandatRef": "PM723420",
                      "parDelegation": "false"
                    },
                    {
                      "acteurRef": "PA722054",
                      "mandatRef": "PM723460",
                      "parDelegation": "false"
                    },
                    {
                      "acteurRef": "PA722228",
                      "mandatRef": "PM723512",
                      "parDelegation": "false"
                    },
                    {
                      "acteurRef": "PA722244",
                      "mandatRef": "PM723516",
                      "parDelegation": "false"
                    },
                    {
                      "acteurRef": "PA722292",
                      "mandatRef": "PM723530",
                      "parDelegation": "false"
                    },
                    {
                      "acteurRef": "PA642695",
                      "mandatRef": "PM722602",
                      "parDelegation": "false"
                    },
                    {
                      "acteurRef": "PA720198",
                      "mandatRef": "PM733711",
                      "parDelegation": "false"
                    }
                  ]
                }
              }
            }
          },
          {
            "organeRef": "PO730934",
            "nombreMembresGroupe": "103",
            "vote": {
              "positionMajoritaire": "contre",
              "decompteVoix": {
                "pour": "1",
                "contre": "11",
                "nonVotants": "0",
                "abstentions": "0",
                "nonVotantsVolontaires": "0"
              },
              "decompteNominatif": {
                "nonVotants": null,
                "abstentions": null,
                "pours": {
                  "votant": {
                    "acteurRef": "PA266793",
                    "mandatRef": "PM722550",
                    "parDelegation": "false"
                  }
                },
                "contres": {
                  "votant": [
                    {
                      "acteurRef": "PA267440",
                      "mandatRef": "PM722522",
                      "parDelegation": "false"
                    },
                    {
                      "acteurRef": "PA2960",
                      "mandatRef": "PM723006",
                      "parDelegation": "false"
                    },
                    {
                      "acteurRef": "PA718850",
                      "mandatRef": "PM722478",
                      "parDelegation": "false"
                    },
                    {
                      "acteurRef": "PA266797",
                      "mandatRef": "PM722884",
                      "parDelegation": "false"
                    },
                    {
                      "acteurRef": "PA340853",
                      "mandatRef": "PM722534",
                      "parDelegation": "false"
                    },
                    {
                      "acteurRef": "PA721410",
                      "mandatRef": "PM723266",
                      "parDelegation": "false"
                    },
                    {
                      "acteurRef": "PA719318",
                      "mandatRef": "PM722624",
                      "parDelegation": "false"
                    },
                    {
                      "acteurRef": "PA643134",
                      "mandatRef": "PM722824",
                      "parDelegation": "false"
                    },
                    {
                      "acteurRef": "PA720630",
                      "mandatRef": "PM723020",
                      "parDelegation": "false"
                    },
                    {
                      "acteurRef": "PA721054",
                      "mandatRef": "PM723156",
                      "parDelegation": "false"
                    },
                    {
                      "acteurRef": "PA330909",
                      "mandatRef": "PM722548",
                      "parDelegation": "false"
                    }
                  ]
                }
              }
            }
          },
          {
            "organeRef": "PO730970",
            "nombreMembresGroupe": "46",
            "vote": {
              "positionMajoritaire": "contre",
              "decompteVoix": {
                "pour": "0",
                "contre": "4",
                "nonVotants": "0",
                "abstentions": "1",
                "nonVotantsVolontaires": "1"
              },
              "decompteNominatif": {
                "nonVotants": null,
                "abstentions": {
                  "votant": {
                    "acteurRef": "PA720704",
                    "mandatRef": "PM723050",
                    "parDelegation": "false"
                  }
                },
                "pours": null,
                "contres": {
                  "votant": [
                    {
                      "acteurRef": "PA721608",
                      "mandatRef": "PM723332",
                      "parDelegation": "false"
                    },
                    {
                      "acteurRef": "PA718978",
                      "mandatRef": "PM722520",
                      "parDelegation": "false"
                    },
                    {
                      "acteurRef": "PA720728",
                      "mandatRef": "PM723058",
                      "parDelegation": "false"
                    },
                    {
                      "acteurRef": "PA720746",
                      "mandatRef": "PM723064",
                      "parDelegation": "false"
                    }
                  ]
                }
              }
            }
          },
          {
            "organeRef": "PO744425",
            "nombreMembresGroupe": "32",
            "vote": {
              "positionMajoritaire": "contre",
              "decompteVoix": {
                "pour": "0",
                "contre": "2",
                "nonVotants": "0",
                "abstentions": "0",
                "nonVotantsVolontaires": "0"
              },
              "decompteNominatif": {
                "nonVotants": null,
                "abstentions": null,
                "pours": null,
                "contres": {
                  "votant": [
                    {
                      "acteurRef": "PA942",
                      "mandatRef": "PM722900",
                      "parDelegation": "false"
                    },
                    {
                      "acteurRef": "PA331582",
                      "mandatRef": "PM722646",
                      "parDelegation": "false"
                    }
                  ]
                }
              }
            }
          },
          {
            "organeRef": "PO723569",
            "nombreMembresGroupe": "21",
            "vote": {
              "positionMajoritaire": "contre",
              "decompteVoix": {
                "pour": "0",
                "contre": "1",
                "nonVotants": "0",
                "abstentions": "0",
                "nonVotantsVolontaires": "0"
              },
              "decompteNominatif": {
                "nonVotants": null,
                "abstentions": null,
                "pours": null,
                "contres": {
                  "votant": {
                    "acteurRef": "PA719608",
                    "mandatRef": "PM722710",
                    "parDelegation": "false"
                  }
                }
              }
            }
          },
          {
            "organeRef": "PO730958",
            "nombreMembresGroupe": "17",
            "vote": {
              "positionMajoritaire": "abstention",
              "decompteVoix": {
                "pour": "0",
                "contre": "0",
                "nonVotants": "0",
                "abstentions": "5",
                "nonVotantsVolontaires": "5"
              },
              "decompteNominatif": {
                "nonVotants": null,
                "abstentions": {
                  "votant": [
                    {
                      "acteurRef": "PA720286",
                      "mandatRef": "PM722918",
                      "parDelegation": "false"
                    },
                    {
                      "acteurRef": "PA720422",
                      "mandatRef": "PM722960",
                      "parDelegation": "false"
                    },
                    {
                      "acteurRef": "PA721202",
                      "mandatRef": "PM723202",
                      "parDelegation": "false"
                    },
                    {
                      "acteurRef": "PA721226",
                      "mandatRef": "PM723208",
                      "parDelegation": "false"
                    },
                    {
                      "acteurRef": "PA721960",
                      "mandatRef": "PM723434",
                      "parDelegation": "false"
                    }
                  ]
                },
                "pours": null,
                "contres": null
              }
            }
          },
          {
            "organeRef": "PO730940",
            "nombreMembresGroupe": "16",
            "vote": {
              "positionMajoritaire": "abstention",
              "decompteVoix": {
                "pour": "0",
                "contre": "0",
                "nonVotants": "0",
                "abstentions": "4",
                "nonVotantsVolontaires": "4"
              },
              "decompteNominatif": {
                "nonVotants": null,
                "abstentions": {
                  "votant": [
                    {
                      "acteurRef": "PA720692",
                      "mandatRef": "PM723042",
                      "parDelegation": "false"
                    },
                    {
                      "acteurRef": "PA718720",
                      "mandatRef": "PM722436",
                      "parDelegation": "false"
                    },
                    {
                      "acteurRef": "PA721270",
                      "mandatRef": "PM723220",
                      "parDelegation": "false"
                    },
                    {
                      "acteurRef": "PA721896",
                      "mandatRef": "PM723414",
                      "parDelegation": "false"
                    }
                  ]
                },
                "pours": null,
                "contres": null
              }
            }
          }
        ]
      }
    }
  },
  "miseAuPoint": {
    "nonVotants": [
      null,
      null
    ],
    "abstentions": [
      null,
      null
    ],
    "nonVotantsVolontaires": [
      null,
      null
    ],
    "pours": null,
    "contres": null,
    "dysfonctionnement": {
      "nonVotants": null,
      "pour": null,
      "contre": null,
      "abstentions": null,
      "nonVotantsVolontaires": null
    }
  },
  "@xmlns": "http://schemas.assemblee-nationale.fr/referentiel"
}