{
  "@xmlns:xsi": "http://www.w3.org/2001/XMLSchema-instance",
  "uid": "VTANR5L15V1360",
  "numero": "1360",
  "organeRef": "PO717460",
  "legislature": "15",
  "sessionRef": "SCR5A2019O1",
  "seanceRef": "RUANR5L15S2019IDS21333",
  "dateScrutin": "2018-11-08T01:00:00.000+01:00",
  "quantiemeJourSeance": "3",
  "typeVote": {
    "codeTypeVote": "SPO",
    "libelleTypeVote": "scrutin public ordinaire",
    "typeMajorite": "majorité absolue des suffrages exprimés"
  },
  "sort": {
    "code": "adopté",
    "libelle": "l'Assemblée nationale a adopté"
  },
  "titre": "l'amendement n° 708 de M. Descoeur et les amendements identiques suivants à l'article 81 de la seconde partie du projet de loi de finances pour 2019 - Mission Relations avec les collectivités territoriales (première lecture).",
  "demandeur": {
    "texte": "Président du groupe \"Les Républicains\"",
    "referenceLegislative": null
  },
  "objet": {
    "libelle": "l'amendement n° 708 de M. Descoeur et les amendements identiques suivants à l'article 81 de la seconde partie du projet de loi de finances pour 2019 - Mission Relations avec les collectivités territoriales (première lecture).",
    "referenceLegislative": null
  },
  "modePublicationDesVotes": "DecompteNominatif",
  "syntheseVote": {
    "nombreVotants": "35",
    "suffragesExprimes": "32",
    "nbrSuffragesRequis": "17",
    "annonce": "l'Assemblée nationale a adopté",
    "decompte": {
      "pour": "28",
      "contre": "4",
      "abstentions": "3",
      "nonVotants": "1",
      "nonVotantsVolontaires": "0"
    }
  },
  "ventilationVotes": {
    "organe": {
      "organeRef": "PO717460",
      "groupes": {
        "groupe": [
          {
            "organeRef": "PO730964",
            "nombreMembresGroupe": "308",
            "vote": {
              "positionMajoritaire": "pour",
              "decompteVoix": {
                "pour": "18",
                "contre": "2",
                "nonVotants": "1",
                "abstentions": "2",
                "nonVotantsVolontaires": "2"
              },
              "decompteNominatif": {
                "nonVotants": {
                  "votant": {
                    "acteurRef": "PA606171",
                    "mandatRef": "PM722632",
                    "causePositionVote": "PAN"
                  }
                },
                "abstentions": {
                  "votant": [
                    {
                      "acteurRef": "PA719814",
                      "mandatRef": "PM722770",
                      "parDelegation": "false"
                    },
                    {
                      "acteurRef": "PA643175",
                      "mandatRef": "PM722868",
                      "parDelegation": "false"
                    }
                  ]
                },
                "pours": {
                  "votant": [
                    {
                      "acteurRef": "PA267336",
                      "mandatRef": "PM722434",
                      "parDelegation": "false"
                    },
                    {
                      "acteurRef": "PA718736",
                      "mandatRef": "PM722440",
                      "parDelegation": "false"
                    },
                    {
                      "acteurRef": "PA718802",
                      "mandatRef": "PM722462",
                      "parDelegation": "false"
                    },
                    {
                      "acteurRef": "PA718810",
                      "mandatRef": "PM722464",
                      "parDelegation": "false"
                    },
                    {
                      "acteurRef": "PA719652",
                      "mandatRef": "PM722722",
                      "parDelegation": "false"
                    },
                    {
                      "acteurRef": "PA719850",
                      "mandatRef": "PM722780",
                      "parDelegation": "false"
                    },
                    {
                      "acteurRef": "PA720318",
                      "mandatRef": "PM722928",
                      "parDelegation": "false"
                    },
                    {
                      "acteurRef": "PA720480",
                      "mandatRef": "PM722976",
                      "parDelegation": "false"
                    },
                    {
                      "acteurRef": "PA720500",
                      "mandatRef": "PM722982",
                      "parDelegation": "false"
                    },
                    {
                      "acteurRef": "PA720622",
                      "mandatRef": "PM723018",
                      "parDelegation": "false"
                    },
                    {
                      "acteurRef": "PA720806",
                      "mandatRef": "PM723082",
                      "parDelegation": "false"
                    },
                    {
                      "acteurRef": "PA720944",
                      "mandatRef": "PM723120",
                      "parDelegation": "false"
                    },
                    {
                      "acteurRef": "PA721426",
                      "mandatRef": "PM723270",
                      "parDelegation": "false"
                    },
                    {
                      "acteurRef": "PA721458",
                      "mandatRef": "PM723280",
                      "parDelegation": "false"
                    },
                    {
                      "acteurRef": "PA721670",
                      "mandatRef": "PM723350",
                      "parDelegation": "false"
                    },
                    {
                      "acteurRef": "PA721844",
                      "mandatRef": "PM723400",
                      "parDelegation": "false"
                    },
                    {
                      "acteurRef": "PA722000",
                      "mandatRef": "PM723444",
                      "parDelegation": "false"
                    },
                    {
                      "acteurRef": "PA722228",
                      "mandatRef": "PM723512",
                      "parDelegation": "false"
                    }
                  ]
                },
                "contres": {
                  "votant": [
                    {
                      "acteurRef": "PA719472",
                      "mandatRef": "PM722672",
                      "parDelegation": "false"
                    },
                    {
                      "acteurRef": "PA720402",
                      "mandatRef": "PM722952",
                      "parDelegation": "false"
                    }
                  ]
                }
              }
            }
          },
          {
            "organeRef": "PO730934",
            "nombreMembresGroupe": "104",
            "vote": {
              "positionMajoritaire": "pour",
              "decompteVoix": {
                "pour": "3",
                "contre": "0",
                "nonVotants": "0",
                "abstentions": "0",
                "nonVotantsVolontaires": "0"
              },
              "decompteNominatif": {
                "nonVotants": null,
                "abstentions": null,
                "pours": {
                  "votant": [
                    {
                      "acteurRef": "PA608016",
                      "mandatRef": "PM723024",
                      "parDelegation": "false"
                    },
                    {
                      "acteurRef": "PA721314",
                      "mandatRef": "PM723236",
                      "parDelegation": "false"
                    },
                    {
                      "acteurRef": "PA330909",
                      "mandatRef": "PM722548",
                      "parDelegation": "false"
                    }
                  ]
                },
                "contres": null
              }
            }
          },
          {
            "organeRef": "PO730970",
            "nombreMembresGroupe": "46",
            "vote": {
              "positionMajoritaire": "contre",
              "decompteVoix": {
                "pour": "0",
                "contre": "2",
                "nonVotants": "0",
                "abstentions": "1",
                "nonVotantsVolontaires": "1"
              },
              "decompteNominatif": {
                "nonVotants": null,
                "abstentions": {
                  "votant": {
                    "acteurRef": "PA720326",
                    "mandatRef": "PM722930",
                    "parDelegation": "false"
                  }
                },
                "pours": null,
                "contres": {
                  "votant": [
                    {
                      "acteurRef": "PA721234",
                      "mandatRef": "PM723210",
                      "parDelegation": "false"
                    },
                    {
                      "acteurRef": "PA721742",
                      "mandatRef": "PM723370",
                      "parDelegation": "false"
                    }
                  ]
                }
              }
            }
          },
          {
            "organeRef": "PO758835",
            "nombreMembresGroupe": "29",
            "vote": {
              "positionMajoritaire": "pour",
              "decompteVoix": {
                "pour": "3",
                "contre": "0",
                "nonVotants": "0",
                "abstentions": "0",
                "nonVotantsVolontaires": "0"
              },
              "decompteNominatif": {
                "nonVotants": null,
                "abstentions": null,
                "pours": {
                  "votant": [
                    {
                      "acteurRef": "PA340343",
                      "mandatRef": "PM722470",
                      "parDelegation": "false"
                    },
                    {
                      "acteurRef": "PA605069",
                      "mandatRef": "PM722424",
                      "parDelegation": "false"
                    },
                    {
                      "acteurRef": "PA608172",
                      "mandatRef": "PM723048",
                      "parDelegation": "false"
                    }
                  ]
                },
                "contres": null
              }
            }
          },
          {
            "organeRef": "PO744425",
            "nombreMembresGroupe": "28",
            "vote": {
              "positionMajoritaire": "pour",
              "decompteVoix": {
                "pour": "2",
                "contre": "0",
                "nonVotants": "0",
                "abstentions": "0",
                "nonVotantsVolontaires": "0"
              },
              "decompteNominatif": {
                "nonVotants": null,
                "abstentions": null,
                "pours": {
                  "votant": [
                    {
                      "acteurRef": "PA720230",
                      "mandatRef": "PM722898",
                      "parDelegation": "false"
                    },
                    {
                      "acteurRef": "PA267766",
                      "mandatRef": "PM722970",
                      "parDelegation": "false"
                    }
                  ]
                },
                "contres": null
              }
            }
          },
          {
            "organeRef": "PO730958",
            "nombreMembresGroupe": "17",
            "vote": {
              "positionMajoritaire": "pour",
              "decompteVoix": {
                "pour": "1",
                "contre": "0",
                "nonVotants": "0",
                "abstentions": "0",
                "nonVotantsVolontaires": "0"
              },
              "decompteNominatif": {
                "nonVotants": null,
                "abstentions": null,
                "pours": {
                  "votant": {
                    "acteurRef": "PA718860",
                    "mandatRef": "PM722482",
                    "parDelegation": "false"
                  }
                },
                "contres": null
              }
            }
          },
          {
            "organeRef": "PO730940",
            "nombreMembresGroupe": "16",
            "vote": {
              "positionMajoritaire": "pour",
              "decompteVoix": {
                "pour": "0",
                "contre": "0",
                "nonVotants": "0",
                "abstentions": "0",
                "nonVotantsVolontaires": "0"
              },
              "decompteNominatif": {
                "nonVotants": null,
                "abstentions": null,
                "pours": null,
                "contres": null
              }
            }
          },
          {
            "organeRef": "PO759900",
            "nombreMembresGroupe": "16",
            "vote": {
              "positionMajoritaire": "pour",
              "decompteVoix": {
                "pour": "1",
                "contre": "0",
                "nonVotants": "0",
                "abstentions": "0",
                "nonVotantsVolontaires": "0"
              },
              "decompteNominatif": {
                "nonVotants": null,
                "abstentions": null,
                "pours": {
                  "votant": {
                    "acteurRef": "PA607619",
                    "mandatRef": "PM722936",
                    "parDelegation": "false"
                  }
                },
                "contres": null
              }
            }
          },
          {
            "organeRef": "PO723569",
            "nombreMembresGroupe": "12",
            "vote": {
              "positionMajoritaire": "pour",
              "decompteVoix": {
                "pour": "0",
                "contre": "0",
                "nonVotants": "0",
                "abstentions": "0",
                "nonVotantsVolontaires": "0"
              },
              "decompteNominatif": {
                "nonVotants": null,
                "abstentions": null,
                "pours": null,
                "contres": null
              }
            }
          }
        ]
      }
    }
  },
  "miseAuPoint": {
    "nonVotants": [
      null,
      null
    ],
    "abstentions": [
      null,
      null
    ],
    "nonVotantsVolontaires": [
      null,
      null
    ],
    "pours": {
      "votant": [
        {
          "acteurRef": "PA721234",
          "mandatRef": "PM723210"
        },
        {
          "acteurRef": "PA721742",
          "mandatRef": "PM723370"
        }
      ]
    },
    "contres": null,
    "dysfonctionnement": {
      "nonVotants": null,
      "pour": null,
      "contre": null,
      "abstentions": null,
      "nonVotantsVolontaires": null
    }
  },
  "@xmlns": "http://schemas.assemblee-nationale.fr/referentiel"
}