{
  "@xmlns:xsi": "http://www.w3.org/2001/XMLSchema-instance",
  "uid": "VTANR5L15V2218",
  "numero": "2218",
  "organeRef": "PO717460",
  "legislature": "15",
  "sessionRef": "SCR5A2020O1",
  "seanceRef": "RUANR5L15S2020IDS21881",
  "dateScrutin": "2019-10-25T02:00:00.000+02:00",
  "quantiemeJourSeance": "2",
  "typeVote": {
    "codeTypeVote": "SPO",
    "libelleTypeVote": "scrutin public ordinaire",
    "typeMajorite": "majorité absolue des suffrages exprimés"
  },
  "sort": {
    "code": "rejeté",
    "libelle": "L'Assemblée nationale n'a pas adopté"
  },
  "titre": "l'amendement de suppression n° 159 de M. Pauget et les amendements identiques suivants à l'article 41 du projet de loi de financement de la sécurité sociale pour 2020 (première lecture).",
  "demandeur": {
    "texte": "Président du groupe \"Les Républicains\"\rPrésident du groupe \"La France insoumise\"",
    "referenceLegislative": null
  },
  "objet": {
    "libelle": "l'amendement de suppression n° 159 de M. Pauget et les amendements identiques suivants à l'article 41 du projet de loi de financement de la sécurité sociale pour 2020 (première lecture).",
    "referenceLegislative": null
  },
  "modePublicationDesVotes": "DecompteNominatif",
  "syntheseVote": {
    "nombreVotants": "45",
    "suffragesExprimes": "45",
    "nbrSuffragesRequis": "23",
    "annonce": "L'Assemblée nationale n'a pas adopté",
    "decompte": {
      "pour": "14",
      "contre": "31",
      "abstentions": "0",
      "nonVotants": "2",
      "nonVotantsVolontaires": "0"
    }
  },
  "ventilationVotes": {
    "organe": {
      "organeRef": "PO717460",
      "groupes": {
        "groupe": [
          {
            "organeRef": "PO730964",
            "nombreMembresGroupe": "304",
            "vote": {
              "positionMajoritaire": "contre",
              "decompteVoix": {
                "pour": "1",
                "contre": "29",
                "nonVotants": "2",
                "abstentions": "0",
                "nonVotantsVolontaires": "0"
              },
              "decompteNominatif": {
                "nonVotants": {
                  "votant": [
                    {
                      "acteurRef": "PA606171",
                      "mandatRef": "PM722632",
                      "causePositionVote": "PAN"
                    },
                    {
                      "acteurRef": "PA721824",
                      "mandatRef": "PM723394",
                      "causePositionVote": "PSE"
                    }
                  ]
                },
                "abstentions": null,
                "pours": {
                  "votant": {
                    "acteurRef": "PA334768",
                    "mandatRef": "PM723548",
                    "parDelegation": "false"
                  }
                },
                "contres": {
                  "votant": [
                    {
                      "acteurRef": "PA672",
                      "mandatRef": "PM723230",
                      "parDelegation": "false"
                    },
                    {
                      "acteurRef": "PA718910",
                      "mandatRef": "PM722498",
                      "parDelegation": "false"
                    },
                    {
                      "acteurRef": "PA719032",
                      "mandatRef": "PM722538",
                      "parDelegation": "false"
                    },
                    {
                      "acteurRef": "PA719072",
                      "mandatRef": "PM722552",
                      "parDelegation": "false"
                    },
                    {
                      "acteurRef": "PA719448",
                      "mandatRef": "PM722666",
                      "parDelegation": "false"
                    },
                    {
                      "acteurRef": "PA719512",
                      "mandatRef": "PM722682",
                      "parDelegation": "false"
                    },
                    {
                      "acteurRef": "PA719540",
                      "mandatRef": "PM722690",
                      "parDelegation": "true"
                    },
                    {
                      "acteurRef": "PA719570",
                      "mandatRef": "PM722700",
                      "parDelegation": "false"
                    },
                    {
                      "acteurRef": "PA719756",
                      "mandatRef": "PM722752",
                      "parDelegation": "false"
                    },
                    {
                      "acteurRef": "PA719858",
                      "mandatRef": "PM722782",
                      "parDelegation": "false"
                    },
                    {
                      "acteurRef": "PA719960",
                      "mandatRef": "PM722816",
                      "parDelegation": "false"
                    },
                    {
                      "acteurRef": "PA719980",
                      "mandatRef": "PM722822",
                      "parDelegation": "false"
                    },
                    {
                      "acteurRef": "PA720014",
                      "mandatRef": "PM722834",
                      "parDelegation": "true"
                    },
                    {
                      "acteurRef": "PA720046",
                      "mandatRef": "PM722842",
                      "parDelegation": "false"
                    },
                    {
                      "acteurRef": "PA720066",
                      "mandatRef": "PM722848",
                      "parDelegation": "false"
                    },
                    {
                      "acteurRef": "PA720170",
                      "mandatRef": "PM722880",
                      "parDelegation": "true"
                    },
                    {
                      "acteurRef": "PA720480",
                      "mandatRef": "PM722976",
                      "parDelegation": "false"
                    },
                    {
                      "acteurRef": "PA720738",
                      "mandatRef": "PM723062",
                      "parDelegation": "false"
                    },
                    {
                      "acteurRef": "PA720830",
                      "mandatRef": "PM723088",
                      "parDelegation": "false"
                    },
                    {
                      "acteurRef": "PA720908",
                      "mandatRef": "PM723110",
                      "parDelegation": "true"
                    },
                    {
                      "acteurRef": "PA721024",
                      "mandatRef": "PM723144",
                      "parDelegation": "false"
                    },
                    {
                      "acteurRef": "PA721246",
                      "mandatRef": "PM723214",
                      "parDelegation": "false"
                    },
                    {
                      "acteurRef": "PA721466",
                      "mandatRef": "PM723284",
                      "parDelegation": "false"
                    },
                    {
                      "acteurRef": "PA721656",
                      "mandatRef": "PM723346",
                      "parDelegation": "true"
                    },
                    {
                      "acteurRef": "PA721710",
                      "mandatRef": "PM723362",
                      "parDelegation": "false"
                    },
                    {
                      "acteurRef": "PA722046",
                      "mandatRef": "PM723458",
                      "parDelegation": "true"
                    },
                    {
                      "acteurRef": "PA722102",
                      "mandatRef": "PM723472",
                      "parDelegation": "false"
                    },
                    {
                      "acteurRef": "PA722268",
                      "mandatRef": "PM723522",
                      "parDelegation": "false"
                    },
                    {
                      "acteurRef": "PA642788",
                      "mandatRef": "PM722746",
                      "parDelegation": "false"
                    }
                  ]
                }
              }
            }
          },
          {
            "organeRef": "PO730934",
            "nombreMembresGroupe": "104",
            "vote": {
              "positionMajoritaire": "pour",
              "decompteVoix": {
                "pour": "7",
                "contre": "2",
                "nonVotants": "0",
                "abstentions": "0",
                "nonVotantsVolontaires": "0"
              },
              "decompteNominatif": {
                "nonVotants": null,
                "abstentions": null,
                "pours": {
                  "votant": [
                    {
                      "acteurRef": "PA606712",
                      "mandatRef": "PM722756",
                      "parDelegation": "false"
                    },
                    {
                      "acteurRef": "PA267289",
                      "mandatRef": "PM754301",
                      "parDelegation": "false"
                    },
                    {
                      "acteurRef": "PA643134",
                      "mandatRef": "PM722824",
                      "parDelegation": "false"
                    },
                    {
                      "acteurRef": "PA721286",
                      "mandatRef": "PM723224",
                      "parDelegation": "false"
                    },
                    {
                      "acteurRef": "PA721506",
                      "mandatRef": "PM723296",
                      "parDelegation": "false"
                    },
                    {
                      "acteurRef": "PA722390",
                      "mandatRef": "PM723560",
                      "parDelegation": "false"
                    },
                    {
                      "acteurRef": "PA721126",
                      "mandatRef": "PM723182",
                      "parDelegation": "false"
                    }
                  ]
                },
                "contres": {
                  "votant": [
                    {
                      "acteurRef": "PA334654",
                      "mandatRef": "PM723566",
                      "parDelegation": "false"
                    },
                    {
                      "acteurRef": "PA721410",
                      "mandatRef": "PM723266",
                      "parDelegation": "false"
                    }
                  ]
                }
              }
            }
          },
          {
            "organeRef": "PO730970",
            "nombreMembresGroupe": "46",
            "vote": {
              "positionMajoritaire": "pour",
              "decompteVoix": {
                "pour": "1",
                "contre": "0",
                "nonVotants": "0",
                "abstentions": "0",
                "nonVotantsVolontaires": "0"
              },
              "decompteNominatif": {
                "nonVotants": null,
                "abstentions": null,
                "pours": {
                  "votant": {
                    "acteurRef": "PA721924",
                    "mandatRef": "PM723422",
                    "parDelegation": "false"
                  }
                },
                "contres": null
              }
            }
          },
          {
            "organeRef": "PO758835",
            "nombreMembresGroupe": "29",
            "vote": {
              "positionMajoritaire": "pour",
              "decompteVoix": {
                "pour": "1",
                "contre": "0",
                "nonVotants": "0",
                "abstentions": "0",
                "nonVotantsVolontaires": "0"
              },
              "decompteNominatif": {
                "nonVotants": null,
                "abstentions": null,
                "pours": {
                  "votant": {
                    "acteurRef": "PA508",
                    "mandatRef": "PM722736",
                    "parDelegation": "false"
                  }
                },
                "contres": null
              }
            }
          },
          {
            "organeRef": "PO767217",
            "nombreMembresGroupe": "28",
            "vote": {
              "positionMajoritaire": "pour",
              "decompteVoix": {
                "pour": "1",
                "contre": "0",
                "nonVotants": "0",
                "abstentions": "0",
                "nonVotantsVolontaires": "0"
              },
              "decompteNominatif": {
                "nonVotants": null,
                "abstentions": null,
                "pours": {
                  "votant": {
                    "acteurRef": "PA642868",
                    "mandatRef": "PM722992",
                    "parDelegation": "false"
                  }
                },
                "contres": null
              }
            }
          },
          {
            "organeRef": "PO759900",
            "nombreMembresGroupe": "19",
            "vote": {
              "positionMajoritaire": "pour",
              "decompteVoix": {
                "pour": "0",
                "contre": "0",
                "nonVotants": "0",
                "abstentions": "0",
                "nonVotantsVolontaires": "0"
              },
              "decompteNominatif": {
                "nonVotants": null,
                "abstentions": null,
                "pours": null,
                "contres": null
              }
            }
          },
          {
            "organeRef": "PO730958",
            "nombreMembresGroupe": "17",
            "vote": {
              "positionMajoritaire": "pour",
              "decompteVoix": {
                "pour": "1",
                "contre": "0",
                "nonVotants": "0",
                "abstentions": "0",
                "nonVotantsVolontaires": "0"
              },
              "decompteNominatif": {
                "nonVotants": null,
                "abstentions": null,
                "pours": {
                  "votant": {
                    "acteurRef": "PA720286",
                    "mandatRef": "PM722918",
                    "parDelegation": "false"
                  }
                },
                "contres": null
              }
            }
          },
          {
            "organeRef": "PO730940",
            "nombreMembresGroupe": "16",
            "vote": {
              "positionMajoritaire": "pour",
              "decompteVoix": {
                "pour": "2",
                "contre": "0",
                "nonVotants": "0",
                "abstentions": "0",
                "nonVotantsVolontaires": "0"
              },
              "decompteNominatif": {
                "nonVotants": null,
                "abstentions": null,
                "pours": {
                  "votant": [
                    {
                      "acteurRef": "PA718926",
                      "mandatRef": "PM722502",
                      "parDelegation": "false"
                    },
                    {
                      "acteurRef": "PA720546",
                      "mandatRef": "PM722996",
                      "parDelegation": "false"
                    }
                  ]
                },
                "contres": null
              }
            }
          },
          {
            "organeRef": "PO723569",
            "nombreMembresGroupe": "13",
            "vote": {
              "positionMajoritaire": "pour",
              "decompteVoix": {
                "pour": "0",
                "contre": "0",
                "nonVotants": "0",
                "abstentions": "0",
                "nonVotantsVolontaires": "0"
              },
              "decompteNominatif": {
                "nonVotants": null,
                "abstentions": null,
                "pours": null,
                "contres": null
              }
            }
          }
        ]
      }
    }
  },
  "miseAuPoint": null,
  "@xmlns": "http://schemas.assemblee-nationale.fr/referentiel"
}