{
  "@xmlns:xsi": "http://www.w3.org/2001/XMLSchema-instance",
  "uid": "VTANR5L15V99",
  "numero": "99",
  "organeRef": "PO717460",
  "legislature": "15",
  "sessionRef": "SCR5A2017E1",
  "seanceRef": "RUANR5L15S2017IDS20663",
  "dateScrutin": "2017-07-28T02:00:00.000+02:00",
  "quantiemeJourSeance": "3",
  "typeVote": {
    "codeTypeVote": "SPO",
    "libelleTypeVote": "scrutin public ordinaire",
    "typeMajorite": "majorité absolue des suffrages exprimés"
  },
  "sort": {
    "code": "rejeté",
    "libelle": "L'Assemblée nationale n'a pas adopté"
  },
  "titre": "l'amendement n? 247 de Mme Untermaier et les amendements identiques suivants a l'article 5 du projet de loi organique pour la confiance dans la vie publique (premiere lecture).",
  "demandeur": {
    "texte": "President du groupe \"Nouvelle Gauche\"",
    "referenceLegislative": null
  },
  "objet": {
    "libelle": "l'amendement n? 247 de Mme Untermaier et les amendements identiques suivants a l'article 5 du projet de loi organique pour la confiance dans la vie publique (premiere lecture).",
    "referenceLegislative": null
  },
  "modePublicationDesVotes": "DecompteNominatif",
  "syntheseVote": {
    "nombreVotants": "139",
    "suffragesExprimes": "135",
    "nbrSuffragesRequis": "68",
    "annonce": "L'Assemblée nationale n'a pas adopté",
    "decompte": {
      "pour": "40",
      "contre": "95",
      "abstentions": "4",
      "nonVotants": "1",
      "nonVotantsVolontaires": "0"
    }
  },
  "ventilationVotes": {
    "organe": {
      "organeRef": "PO717460",
      "groupes": {
        "groupe": [
          {
            "organeRef": "PO730964",
            "nombreMembresGroupe": "314",
            "vote": {
              "positionMajoritaire": "contre",
              "decompteVoix": {
                "pour": "5",
                "contre": "80",
                "nonVotants": "1",
                "abstentions": "4",
                "nonVotantsVolontaires": "4"
              },
              "decompteNominatif": {
                "nonVotants": {
                  "votant": {
                    "acteurRef": "PA332747",
                    "mandatRef": "PM722798",
                    "causePositionVote": "PSE"
                  }
                },
                "abstentions": {
                  "votant": [
                    {
                      "acteurRef": "PA719922",
                      "mandatRef": "PM722802",
                      "parDelegation": "false"
                    },
                    {
                      "acteurRef": "PA721194",
                      "mandatRef": "PM723200",
                      "parDelegation": "false"
                    },
                    {
                      "acteurRef": "PA721514",
                      "mandatRef": "PM723298",
                      "parDelegation": "false"
                    },
                    {
                      "acteurRef": "PA721916",
                      "mandatRef": "PM723420",
                      "parDelegation": "false"
                    }
                  ]
                },
                "pours": {
                  "votant": [
                    {
                      "acteurRef": "PA719330",
                      "mandatRef": "PM722628",
                      "parDelegation": "false"
                    },
                    {
                      "acteurRef": "PA720870",
                      "mandatRef": "PM723100",
                      "parDelegation": "false"
                    },
                    {
                      "acteurRef": "PA721600",
                      "mandatRef": "PM723330",
                      "parDelegation": "false"
                    },
                    {
                      "acteurRef": "PA721670",
                      "mandatRef": "PM723350",
                      "parDelegation": "false"
                    },
                    {
                      "acteurRef": "PA722382",
                      "mandatRef": "PM723558",
                      "parDelegation": "false"
                    }
                  ]
                },
                "contres": {
                  "votant": [
                    {
                      "acteurRef": "PA722398",
                      "mandatRef": "PM723562",
                      "parDelegation": "false"
                    },
                    {
                      "acteurRef": "PA719118",
                      "mandatRef": "PM722568",
                      "parDelegation": "false"
                    },
                    {
                      "acteurRef": "PA609520",
                      "mandatRef": "PM723508",
                      "parDelegation": "false"
                    },
                    {
                      "acteurRef": "PA721880",
                      "mandatRef": "PM723410",
                      "parDelegation": "false"
                    },
                    {
                      "acteurRef": "PA722190",
                      "mandatRef": "PM723498",
                      "parDelegation": "false"
                    },
                    {
                      "acteurRef": "PA717379",
                      "mandatRef": "PM723282",
                      "parDelegation": "false"
                    },
                    {
                      "acteurRef": "PA718736",
                      "mandatRef": "PM722440",
                      "parDelegation": "false"
                    },
                    {
                      "acteurRef": "PA718794",
                      "mandatRef": "PM722460",
                      "parDelegation": "false"
                    },
                    {
                      "acteurRef": "PA718810",
                      "mandatRef": "PM722464",
                      "parDelegation": "false"
                    },
                    {
                      "acteurRef": "PA677483",
                      "mandatRef": "PM722466",
                      "parDelegation": "false"
                    },
                    {
                      "acteurRef": "PA718918",
                      "mandatRef": "PM722500",
                      "parDelegation": "false"
                    },
                    {
                      "acteurRef": "PA719006",
                      "mandatRef": "PM722530",
                      "parDelegation": "false"
                    },
                    {
                      "acteurRef": "PA719154",
                      "mandatRef": "PM722578",
                      "parDelegation": "false"
                    },
                    {
                      "acteurRef": "PA719170",
                      "mandatRef": "PM722582",
                      "parDelegation": "false"
                    },
                    {
                      "acteurRef": "PA719230",
                      "mandatRef": "PM722600",
                      "parDelegation": "false"
                    },
                    {
                      "acteurRef": "PA719302",
                      "mandatRef": "PM722620",
                      "parDelegation": "false"
                    },
                    {
                      "acteurRef": "PA719388",
                      "mandatRef": "PM722648",
                      "parDelegation": "false"
                    },
                    {
                      "acteurRef": "PA719456",
                      "mandatRef": "PM722668",
                      "parDelegation": "false"
                    },
                    {
                      "acteurRef": "PA719512",
                      "mandatRef": "PM722682",
                      "parDelegation": "false"
                    },
                    {
                      "acteurRef": "PA719600",
                      "mandatRef": "PM722708",
                      "parDelegation": "false"
                    },
                    {
                      "acteurRef": "PA719632",
                      "mandatRef": "PM722716",
                      "parDelegation": "false"
                    },
                    {
                      "acteurRef": "PA719660",
                      "mandatRef": "PM722724",
                      "parDelegation": "false"
                    },
                    {
                      "acteurRef": "PA719710",
                      "mandatRef": "PM722738",
                      "parDelegation": "false"
                    },
                    {
                      "acteurRef": "PA719756",
                      "mandatRef": "PM722752",
                      "parDelegation": "false"
                    },
                    {
                      "acteurRef": "PA719770",
                      "mandatRef": "PM722758",
                      "parDelegation": "false"
                    },
                    {
                      "acteurRef": "PA719830",
                      "mandatRef": "PM722774",
                      "parDelegation": "false"
                    },
                    {
                      "acteurRef": "PA719850",
                      "mandatRef": "PM722780",
                      "parDelegation": "false"
                    },
                    {
                      "acteurRef": "PA719866",
                      "mandatRef": "PM722784",
                      "parDelegation": "false"
                    },
                    {
                      "acteurRef": "PA719890",
                      "mandatRef": "PM722790",
                      "parDelegation": "false"
                    },
                    {
                      "acteurRef": "PA719994",
                      "mandatRef": "PM722828",
                      "parDelegation": "false"
                    },
                    {
                      "acteurRef": "PA720014",
                      "mandatRef": "PM722834",
                      "parDelegation": "false"
                    },
                    {
                      "acteurRef": "PA720030",
                      "mandatRef": "PM722838",
                      "parDelegation": "false"
                    },
                    {
                      "acteurRef": "PA720108",
                      "mandatRef": "PM722862",
                      "parDelegation": "false"
                    },
                    {
                      "acteurRef": "PA720124",
                      "mandatRef": "PM722866",
                      "parDelegation": "false"
                    },
                    {
                      "acteurRef": "PA643175",
                      "mandatRef": "PM722868",
                      "parDelegation": "false"
                    },
                    {
                      "acteurRef": "PA720222",
                      "mandatRef": "PM722896",
                      "parDelegation": "false"
                    },
                    {
                      "acteurRef": "PA720268",
                      "mandatRef": "PM722912",
                      "parDelegation": "false"
                    },
                    {
                      "acteurRef": "PA720402",
                      "mandatRef": "PM722952",
                      "parDelegation": "false"
                    },
                    {
                      "acteurRef": "PA720480",
                      "mandatRef": "PM722976",
                      "parDelegation": "false"
                    },
                    {
                      "acteurRef": "PA720512",
                      "mandatRef": "PM722986",
                      "parDelegation": "false"
                    },
                    {
                      "acteurRef": "PA720622",
                      "mandatRef": "PM723018",
                      "parDelegation": "false"
                    },
                    {
                      "acteurRef": "PA720908",
                      "mandatRef": "PM723110",
                      "parDelegation": "false"
                    },
                    {
                      "acteurRef": "PA720952",
                      "mandatRef": "PM723122",
                      "parDelegation": "false"
                    },
                    {
                      "acteurRef": "PA720960",
                      "mandatRef": "PM723124",
                      "parDelegation": "false"
                    },
                    {
                      "acteurRef": "PA721024",
                      "mandatRef": "PM723144",
                      "parDelegation": "false"
                    },
                    {
                      "acteurRef": "PA721134",
                      "mandatRef": "PM723184",
                      "parDelegation": "false"
                    },
                    {
                      "acteurRef": "PA721142",
                      "mandatRef": "PM723186",
                      "parDelegation": "false"
                    },
                    {
                      "acteurRef": "PA721158",
                      "mandatRef": "PM723190",
                      "parDelegation": "false"
                    },
                    {
                      "acteurRef": "PA721174",
                      "mandatRef": "PM723194",
                      "parDelegation": "false"
                    },
                    {
                      "acteurRef": "PA721218",
                      "mandatRef": "PM723206",
                      "parDelegation": "false"
                    },
                    {
                      "acteurRef": "PA721246",
                      "mandatRef": "PM723214",
                      "parDelegation": "false"
                    },
                    {
                      "acteurRef": "PA721254",
                      "mandatRef": "PM723216",
                      "parDelegation": "false"
                    },
                    {
                      "acteurRef": "PA721434",
                      "mandatRef": "PM723272",
                      "parDelegation": "false"
                    },
                    {
                      "acteurRef": "PA721450",
                      "mandatRef": "PM723278",
                      "parDelegation": "false"
                    },
                    {
                      "acteurRef": "PA721466",
                      "mandatRef": "PM723284",
                      "parDelegation": "false"
                    },
                    {
                      "acteurRef": "PA721522",
                      "mandatRef": "PM723300",
                      "parDelegation": "false"
                    },
                    {
                      "acteurRef": "PA721542",
                      "mandatRef": "PM723308",
                      "parDelegation": "false"
                    },
                    {
                      "acteurRef": "PA721568",
                      "mandatRef": "PM723316",
                      "parDelegation": "false"
                    },
                    {
                      "acteurRef": "PA721584",
                      "mandatRef": "PM723324",
                      "parDelegation": "false"
                    },
                    {
                      "acteurRef": "PA721616",
                      "mandatRef": "PM723334",
                      "parDelegation": "false"
                    },
                    {
                      "acteurRef": "PA721644",
                      "mandatRef": "PM723342",
                      "parDelegation": "false"
                    },
                    {
                      "acteurRef": "PA721710",
                      "mandatRef": "PM723362",
                      "parDelegation": "false"
                    },
                    {
                      "acteurRef": "PA721718",
                      "mandatRef": "PM723364",
                      "parDelegation": "false"
                    },
                    {
                      "acteurRef": "PA721750",
                      "mandatRef": "PM723372",
                      "parDelegation": "false"
                    },
                    {
                      "acteurRef": "PA721764",
                      "mandatRef": "PM723376",
                      "parDelegation": "false"
                    },
                    {
                      "acteurRef": "PA721784",
                      "mandatRef": "PM723382",
                      "parDelegation": "false"
                    },
                    {
                      "acteurRef": "PA721844",
                      "mandatRef": "PM723400",
                      "parDelegation": "false"
                    },
                    {
                      "acteurRef": "PA721888",
                      "mandatRef": "PM723412",
                      "parDelegation": "false"
                    },
                    {
                      "acteurRef": "PA721908",
                      "mandatRef": "PM723418",
                      "parDelegation": "false"
                    },
                    {
                      "acteurRef": "PA722000",
                      "mandatRef": "PM723444",
                      "parDelegation": "false"
                    },
                    {
                      "acteurRef": "PA722046",
                      "mandatRef": "PM723458",
                      "parDelegation": "false"
                    },
                    {
                      "acteurRef": "PA722054",
                      "mandatRef": "PM723460",
                      "parDelegation": "false"
                    },
                    {
                      "acteurRef": "PA722062",
                      "mandatRef": "PM723462",
                      "parDelegation": "false"
                    },
                    {
                      "acteurRef": "PA722086",
                      "mandatRef": "PM723468",
                      "parDelegation": "false"
                    },
                    {
                      "acteurRef": "PA722118",
                      "mandatRef": "PM723476",
                      "parDelegation": "false"
                    },
                    {
                      "acteurRef": "PA722178",
                      "mandatRef": "PM723494",
                      "parDelegation": "false"
                    },
                    {
                      "acteurRef": "PA722236",
                      "mandatRef": "PM723514",
                      "parDelegation": "false"
                    },
                    {
                      "acteurRef": "PA722268",
                      "mandatRef": "PM723522",
                      "parDelegation": "false"
                    },
                    {
                      "acteurRef": "PA722366",
                      "mandatRef": "PM723554",
                      "parDelegation": "false"
                    },
                    {
                      "acteurRef": "PA721956",
                      "mandatRef": "PM733717",
                      "parDelegation": "false"
                    }
                  ]
                }
              }
            }
          },
          {
            "organeRef": "PO730934",
            "nombreMembresGroupe": "100",
            "vote": {
              "positionMajoritaire": "pour",
              "decompteVoix": {
                "pour": "9",
                "contre": "4",
                "nonVotants": "0",
                "abstentions": "0",
                "nonVotantsVolontaires": "0"
              },
              "decompteNominatif": {
                "nonVotants": null,
                "abstentions": null,
                "pours": {
                  "votant": [
                    {
                      "acteurRef": "PA720210",
                      "mandatRef": "PM722892",
                      "parDelegation": "false"
                    },
                    {
                      "acteurRef": "PA267200",
                      "mandatRef": "PM722974",
                      "parDelegation": "false"
                    },
                    {
                      "acteurRef": "PA267527",
                      "mandatRef": "PM723274",
                      "parDelegation": "false"
                    },
                    {
                      "acteurRef": "PA1012",
                      "mandatRef": "PM722418",
                      "parDelegation": "false"
                    },
                    {
                      "acteurRef": "PA330008",
                      "mandatRef": "PM722416",
                      "parDelegation": "false"
                    },
                    {
                      "acteurRef": "PA720684",
                      "mandatRef": "PM723040",
                      "parDelegation": "false"
                    },
                    {
                      "acteurRef": "PA721286",
                      "mandatRef": "PM723224",
                      "parDelegation": "false"
                    },
                    {
                      "acteurRef": "PA721506",
                      "mandatRef": "PM723296",
                      "parDelegation": "false"
                    },
                    {
                      "acteurRef": "PA721126",
                      "mandatRef": "PM723182",
                      "parDelegation": "false"
                    }
                  ]
                },
                "contres": {
                  "votant": [
                    {
                      "acteurRef": "PA606712",
                      "mandatRef": "PM722756",
                      "parDelegation": "false"
                    },
                    {
                      "acteurRef": "PA2155",
                      "mandatRef": "PM722490",
                      "parDelegation": "false"
                    },
                    {
                      "acteurRef": "PA720644",
                      "mandatRef": "PM723026",
                      "parDelegation": "false"
                    },
                    {
                      "acteurRef": "PA266776",
                      "mandatRef": "PM723542",
                      "parDelegation": "false"
                    }
                  ]
                }
              }
            }
          },
          {
            "organeRef": "PO730970",
            "nombreMembresGroupe": "47",
            "vote": {
              "positionMajoritaire": "contre",
              "decompteVoix": {
                "pour": "0",
                "contre": "9",
                "nonVotants": "0",
                "abstentions": "0",
                "nonVotantsVolontaires": "0"
              },
              "decompteNominatif": {
                "nonVotants": null,
                "abstentions": null,
                "pours": null,
                "contres": {
                  "votant": [
                    {
                      "acteurRef": "PA721608",
                      "mandatRef": "PM723332",
                      "parDelegation": "false"
                    },
                    {
                      "acteurRef": "PA717151",
                      "mandatRef": "PM723374",
                      "parDelegation": "false"
                    },
                    {
                      "acteurRef": "PA719558",
                      "mandatRef": "PM722696",
                      "parDelegation": "false"
                    },
                    {
                      "acteurRef": "PA719640",
                      "mandatRef": "PM722718",
                      "parDelegation": "false"
                    },
                    {
                      "acteurRef": "PA719938",
                      "mandatRef": "PM722806",
                      "parDelegation": "false"
                    },
                    {
                      "acteurRef": "PA720256",
                      "mandatRef": "PM722908",
                      "parDelegation": "false"
                    },
                    {
                      "acteurRef": "PA720704",
                      "mandatRef": "PM723050",
                      "parDelegation": "false"
                    },
                    {
                      "acteurRef": "PA720764",
                      "mandatRef": "PM723070",
                      "parDelegation": "false"
                    },
                    {
                      "acteurRef": "PA721234",
                      "mandatRef": "PM723210",
                      "parDelegation": "false"
                    }
                  ]
                }
              }
            }
          },
          {
            "organeRef": "PO730952",
            "nombreMembresGroupe": "35",
            "vote": {
              "positionMajoritaire": "contre",
              "decompteVoix": {
                "pour": "1",
                "contre": "2",
                "nonVotants": "0",
                "abstentions": "0",
                "nonVotantsVolontaires": "0"
              },
              "decompteNominatif": {
                "nonVotants": null,
                "abstentions": null,
                "pours": {
                  "votant": {
                    "acteurRef": "PA721110",
                    "mandatRef": "PM723174",
                    "parDelegation": "false"
                  }
                },
                "contres": {
                  "votant": [
                    {
                      "acteurRef": "PA331567",
                      "mandatRef": "PM722644",
                      "parDelegation": "false"
                    },
                    {
                      "acteurRef": "PA332228",
                      "mandatRef": "PM722754",
                      "parDelegation": "false"
                    }
                  ]
                }
              }
            }
          },
          {
            "organeRef": "PO730946",
            "nombreMembresGroupe": "31",
            "vote": {
              "positionMajoritaire": "pour",
              "decompteVoix": {
                "pour": "7",
                "contre": "0",
                "nonVotants": "0",
                "abstentions": "0",
                "nonVotantsVolontaires": "0"
              },
              "decompteNominatif": {
                "nonVotants": null,
                "abstentions": null,
                "pours": {
                  "votant": [
                    {
                      "acteurRef": "PA1198",
                      "mandatRef": "PM722532",
                      "parDelegation": "false"
                    },
                    {
                      "acteurRef": "PA333285",
                      "mandatRef": "PM722906",
                      "parDelegation": "false"
                    },
                    {
                      "acteurRef": "PA330357",
                      "mandatRef": "PM722472",
                      "parDelegation": "false"
                    },
                    {
                      "acteurRef": "PA607553",
                      "mandatRef": "PM722956",
                      "parDelegation": "false"
                    },
                    {
                      "acteurRef": "PA608172",
                      "mandatRef": "PM723048",
                      "parDelegation": "false"
                    },
                    {
                      "acteurRef": "PA608695",
                      "mandatRef": "PM723564",
                      "parDelegation": "false"
                    },
                    {
                      "acteurRef": "PA335999",
                      "mandatRef": "PM723480",
                      "parDelegation": "false"
                    }
                  ]
                },
                "contres": null
              }
            }
          },
          {
            "organeRef": "PO723569",
            "nombreMembresGroupe": "17",
            "vote": {
              "positionMajoritaire": "pour",
              "decompteVoix": {
                "pour": "4",
                "contre": "0",
                "nonVotants": "0",
                "abstentions": "0",
                "nonVotantsVolontaires": "0"
              },
              "decompteNominatif": {
                "nonVotants": null,
                "abstentions": null,
                "pours": {
                  "votant": [
                    {
                      "acteurRef": "PA1206",
                      "mandatRef": "PM723354",
                      "parDelegation": "false"
                    },
                    {
                      "acteurRef": "PA719608",
                      "mandatRef": "PM722710",
                      "parDelegation": "false"
                    },
                    {
                      "acteurRef": "PA720664",
                      "mandatRef": "PM723032",
                      "parDelegation": "false"
                    },
                    {
                      "acteurRef": "PA720822",
                      "mandatRef": "PM723086",
                      "parDelegation": "false"
                    }
                  ]
                },
                "contres": null
              }
            }
          },
          {
            "organeRef": "PO730958",
            "nombreMembresGroupe": "17",
            "vote": {
              "positionMajoritaire": "pour",
              "decompteVoix": {
                "pour": "9",
                "contre": "0",
                "nonVotants": "0",
                "abstentions": "0",
                "nonVotantsVolontaires": "0"
              },
              "decompteNominatif": {
                "nonVotants": null,
                "abstentions": null,
                "pours": {
                  "votant": [
                    {
                      "acteurRef": "PA718860",
                      "mandatRef": "PM722482",
                      "parDelegation": "false"
                    },
                    {
                      "acteurRef": "PA2150",
                      "mandatRef": "PM722506",
                      "parDelegation": "false"
                    },
                    {
                      "acteurRef": "PA720286",
                      "mandatRef": "PM722918",
                      "parDelegation": "false"
                    },
                    {
                      "acteurRef": "PA720846",
                      "mandatRef": "PM723094",
                      "parDelegation": "false"
                    },
                    {
                      "acteurRef": "PA720892",
                      "mandatRef": "PM723106",
                      "parDelegation": "false"
                    },
                    {
                      "acteurRef": "PA721202",
                      "mandatRef": "PM723202",
                      "parDelegation": "false"
                    },
                    {
                      "acteurRef": "PA721210",
                      "mandatRef": "PM723204",
                      "parDelegation": "false"
                    },
                    {
                      "acteurRef": "PA721226",
                      "mandatRef": "PM723208",
                      "parDelegation": "false"
                    },
                    {
                      "acteurRef": "PA721960",
                      "mandatRef": "PM723434",
                      "parDelegation": "false"
                    }
                  ]
                },
                "contres": null
              }
            }
          },
          {
            "organeRef": "PO730940",
            "nombreMembresGroupe": "16",
            "vote": {
              "positionMajoritaire": "pour",
              "decompteVoix": {
                "pour": "5",
                "contre": "0",
                "nonVotants": "0",
                "abstentions": "0",
                "nonVotantsVolontaires": "0"
              },
              "decompteNominatif": {
                "nonVotants": null,
                "abstentions": null,
                "pours": {
                  "votant": [
                    {
                      "acteurRef": "PA718926",
                      "mandatRef": "PM722502",
                      "parDelegation": "false"
                    },
                    {
                      "acteurRef": "PA720692",
                      "mandatRef": "PM723042",
                      "parDelegation": "false"
                    },
                    {
                      "acteurRef": "PA721270",
                      "mandatRef": "PM723220",
                      "parDelegation": "false"
                    },
                    {
                      "acteurRef": "PA721896",
                      "mandatRef": "PM723414",
                      "parDelegation": "false"
                    },
                    {
                      "acteurRef": "PA335612",
                      "mandatRef": "PM723506",
                      "parDelegation": "false"
                    }
                  ]
                },
                "contres": null
              }
            }
          }
        ]
      }
    }
  },
  "miseAuPoint": null,
  "@xmlns": "http://schemas.assemblee-nationale.fr/referentiel"
}