{
  "@xmlns:xsi": "http://www.w3.org/2001/XMLSchema-instance",
  "uid": "VTANR5L15V2308",
  "numero": "2308",
  "organeRef": "PO717460",
  "legislature": "15",
  "sessionRef": "SCR5A2020O1",
  "seanceRef": "RUANR5L15S2020IDS21948",
  "dateScrutin": "2019-11-19T01:00:00.000+01:00",
  "quantiemeJourSeance": "1",
  "typeVote": {
    "codeTypeVote": "SPO",
    "libelleTypeVote": "scrutin public ordinaire",
    "typeMajorite": "majorité absolue des suffrages exprimés"
  },
  "sort": {
    "code": "adopté",
    "libelle": "l'Assemblée nationale a adopté"
  },
  "titre": "l'ensemble du projet de loi d'orientation des mobilités (lecture définitive)",
  "demandeur": {
    "texte": "Président du groupe \"La République en Marche\"",
    "referenceLegislative": null
  },
  "objet": {
    "libelle": "l'ensemble du projet de loi d'orientation des mobilités (lecture définitive)",
    "referenceLegislative": null
  },
  "modePublicationDesVotes": "DecompteNominatif",
  "syntheseVote": {
    "nombreVotants": "174",
    "suffragesExprimes": "165",
    "nbrSuffragesRequis": "83",
    "annonce": "l'Assemblée nationale a adopté",
    "decompte": {
      "pour": "116",
      "contre": "49",
      "abstentions": "9",
      "nonVotants": "1",
      "nonVotantsVolontaires": "0"
    }
  },
  "ventilationVotes": {
    "organe": {
      "organeRef": "PO717460",
      "groupes": {
        "groupe": [
          {
            "organeRef": "PO730964",
            "nombreMembresGroupe": "304",
            "vote": {
              "positionMajoritaire": "pour",
              "decompteVoix": {
                "pour": "93",
                "contre": "0",
                "nonVotants": "1",
                "abstentions": "0",
                "nonVotantsVolontaires": "0"
              },
              "decompteNominatif": {
                "nonVotants": {
                  "votant": {
                    "acteurRef": "PA606171",
                    "mandatRef": "PM722632",
                    "causePositionVote": "PAN"
                  }
                },
                "abstentions": null,
                "pours": {
                  "votant": [
                    {
                      "acteurRef": "PA722398",
                      "mandatRef": "PM723562",
                      "parDelegation": "false"
                    },
                    {
                      "acteurRef": "PA2449",
                      "mandatRef": "PM723036",
                      "parDelegation": "false"
                    },
                    {
                      "acteurRef": "PA643127",
                      "mandatRef": "PM722636",
                      "parDelegation": "false"
                    },
                    {
                      "acteurRef": "PA609520",
                      "mandatRef": "PM723508",
                      "parDelegation": "false"
                    },
                    {
                      "acteurRef": "PA721880",
                      "mandatRef": "PM723410",
                      "parDelegation": "false"
                    },
                    {
                      "acteurRef": "PA720492",
                      "mandatRef": "PM722980",
                      "parDelegation": "false"
                    },
                    {
                      "acteurRef": "PA718710",
                      "mandatRef": "PM722432",
                      "parDelegation": "false"
                    },
                    {
                      "acteurRef": "PA718802",
                      "mandatRef": "PM722462",
                      "parDelegation": "false"
                    },
                    {
                      "acteurRef": "PA718810",
                      "mandatRef": "PM722464",
                      "parDelegation": "false"
                    },
                    {
                      "acteurRef": "PA677483",
                      "mandatRef": "PM722466",
                      "parDelegation": "false"
                    },
                    {
                      "acteurRef": "PA718962",
                      "mandatRef": "PM722514",
                      "parDelegation": "false"
                    },
                    {
                      "acteurRef": "PA718990",
                      "mandatRef": "PM722524",
                      "parDelegation": "false"
                    },
                    {
                      "acteurRef": "PA719024",
                      "mandatRef": "PM722536",
                      "parDelegation": "false"
                    },
                    {
                      "acteurRef": "PA719080",
                      "mandatRef": "PM722554",
                      "parDelegation": "false"
                    },
                    {
                      "acteurRef": "PA719092",
                      "mandatRef": "PM722560",
                      "parDelegation": "false"
                    },
                    {
                      "acteurRef": "PA719294",
                      "mandatRef": "PM722618",
                      "parDelegation": "false"
                    },
                    {
                      "acteurRef": "PA719310",
                      "mandatRef": "PM722622",
                      "parDelegation": "false"
                    },
                    {
                      "acteurRef": "PA719364",
                      "mandatRef": "PM722638",
                      "parDelegation": "false"
                    },
                    {
                      "acteurRef": "PA719388",
                      "mandatRef": "PM722648",
                      "parDelegation": "false"
                    },
                    {
                      "acteurRef": "PA719396",
                      "mandatRef": "PM722650",
                      "parDelegation": "false"
                    },
                    {
                      "acteurRef": "PA719404",
                      "mandatRef": "PM722652",
                      "parDelegation": "false"
                    },
                    {
                      "acteurRef": "PA719456",
                      "mandatRef": "PM722668",
                      "parDelegation": "false"
                    },
                    {
                      "acteurRef": "PA719496",
                      "mandatRef": "PM722678",
                      "parDelegation": "false"
                    },
                    {
                      "acteurRef": "PA719528",
                      "mandatRef": "PM722686",
                      "parDelegation": "false"
                    },
                    {
                      "acteurRef": "PA719592",
                      "mandatRef": "PM722706",
                      "parDelegation": "false"
                    },
                    {
                      "acteurRef": "PA719624",
                      "mandatRef": "PM722714",
                      "parDelegation": "false"
                    },
                    {
                      "acteurRef": "PA719718",
                      "mandatRef": "PM722740",
                      "parDelegation": "false"
                    },
                    {
                      "acteurRef": "PA719740",
                      "mandatRef": "PM722748",
                      "parDelegation": "false"
                    },
                    {
                      "acteurRef": "PA719748",
                      "mandatRef": "PM722750",
                      "parDelegation": "false"
                    },
                    {
                      "acteurRef": "PA719756",
                      "mandatRef": "PM722752",
                      "parDelegation": "false"
                    },
                    {
                      "acteurRef": "PA719890",
                      "mandatRef": "PM722790",
                      "parDelegation": "false"
                    },
                    {
                      "acteurRef": "PA719922",
                      "mandatRef": "PM722802",
                      "parDelegation": "false"
                    },
                    {
                      "acteurRef": "PA719960",
                      "mandatRef": "PM722816",
                      "parDelegation": "false"
                    },
                    {
                      "acteurRef": "PA719972",
                      "mandatRef": "PM722820",
                      "parDelegation": "false"
                    },
                    {
                      "acteurRef": "PA719994",
                      "mandatRef": "PM722828",
                      "parDelegation": "false"
                    },
                    {
                      "acteurRef": "PA720030",
                      "mandatRef": "PM722838",
                      "parDelegation": "false"
                    },
                    {
                      "acteurRef": "PA643175",
                      "mandatRef": "PM722868",
                      "parDelegation": "false"
                    },
                    {
                      "acteurRef": "PA720138",
                      "mandatRef": "PM722872",
                      "parDelegation": "false"
                    },
                    {
                      "acteurRef": "PA720154",
                      "mandatRef": "PM722876",
                      "parDelegation": "false"
                    },
                    {
                      "acteurRef": "PA720242",
                      "mandatRef": "PM722902",
                      "parDelegation": "false"
                    },
                    {
                      "acteurRef": "PA720310",
                      "mandatRef": "PM722926",
                      "parDelegation": "false"
                    },
                    {
                      "acteurRef": "PA720362",
                      "mandatRef": "PM722942",
                      "parDelegation": "false"
                    },
                    {
                      "acteurRef": "PA720394",
                      "mandatRef": "PM722950",
                      "parDelegation": "false"
                    },
                    {
                      "acteurRef": "PA720414",
                      "mandatRef": "PM722958",
                      "parDelegation": "false"
                    },
                    {
                      "acteurRef": "PA720454",
                      "mandatRef": "PM722968",
                      "parDelegation": "false"
                    },
                    {
                      "acteurRef": "PA720512",
                      "mandatRef": "PM722986",
                      "parDelegation": "false"
                    },
                    {
                      "acteurRef": "PA720520",
                      "mandatRef": "PM722988",
                      "parDelegation": "false"
                    },
                    {
                      "acteurRef": "PA720552",
                      "mandatRef": "PM722998",
                      "parDelegation": "false"
                    },
                    {
                      "acteurRef": "PA720560",
                      "mandatRef": "PM723000",
                      "parDelegation": "false"
                    },
                    {
                      "acteurRef": "PA720576",
                      "mandatRef": "PM723004",
                      "parDelegation": "false"
                    },
                    {
                      "acteurRef": "PA720590",
                      "mandatRef": "PM723010",
                      "parDelegation": "false"
                    },
                    {
                      "acteurRef": "PA720806",
                      "mandatRef": "PM723082",
                      "parDelegation": "false"
                    },
                    {
                      "acteurRef": "PA720814",
                      "mandatRef": "PM723084",
                      "parDelegation": "false"
                    },
                    {
                      "acteurRef": "PA720830",
                      "mandatRef": "PM723088",
                      "parDelegation": "false"
                    },
                    {
                      "acteurRef": "PA720854",
                      "mandatRef": "PM723096",
                      "parDelegation": "false"
                    },
                    {
                      "acteurRef": "PA720878",
                      "mandatRef": "PM723102",
                      "parDelegation": "true"
                    },
                    {
                      "acteurRef": "PA720908",
                      "mandatRef": "PM723110",
                      "parDelegation": "true"
                    },
                    {
                      "acteurRef": "PA720944",
                      "mandatRef": "PM723120",
                      "parDelegation": "false"
                    },
                    {
                      "acteurRef": "PA721158",
                      "mandatRef": "PM723190",
                      "parDelegation": "false"
                    },
                    {
                      "acteurRef": "PA721336",
                      "mandatRef": "PM723242",
                      "parDelegation": "false"
                    },
                    {
                      "acteurRef": "PA721372",
                      "mandatRef": "PM723252",
                      "parDelegation": "false"
                    },
                    {
                      "acteurRef": "PA721384",
                      "mandatRef": "PM723256",
                      "parDelegation": "false"
                    },
                    {
                      "acteurRef": "PA721426",
                      "mandatRef": "PM723270",
                      "parDelegation": "false"
                    },
                    {
                      "acteurRef": "PA721434",
                      "mandatRef": "PM723272",
                      "parDelegation": "false"
                    },
                    {
                      "acteurRef": "PA721560",
                      "mandatRef": "PM764780",
                      "parDelegation": "false"
                    },
                    {
                      "acteurRef": "PA721584",
                      "mandatRef": "PM723324",
                      "parDelegation": "false"
                    },
                    {
                      "acteurRef": "PA721616",
                      "mandatRef": "PM723334",
                      "parDelegation": "false"
                    },
                    {
                      "acteurRef": "PA721644",
                      "mandatRef": "PM723342",
                      "parDelegation": "false"
                    },
                    {
                      "acteurRef": "PA721656",
                      "mandatRef": "PM723346",
                      "parDelegation": "true"
                    },
                    {
                      "acteurRef": "PA721718",
                      "mandatRef": "PM723364",
                      "parDelegation": "false"
                    },
                    {
                      "acteurRef": "PA721726",
                      "mandatRef": "PM723366",
                      "parDelegation": "false"
                    },
                    {
                      "acteurRef": "PA721776",
                      "mandatRef": "PM723380",
                      "parDelegation": "false"
                    },
                    {
                      "acteurRef": "PA721784",
                      "mandatRef": "PM723382",
                      "parDelegation": "false"
                    },
                    {
                      "acteurRef": "PA721808",
                      "mandatRef": "PM723388",
                      "parDelegation": "false"
                    },
                    {
                      "acteurRef": "PA721824",
                      "mandatRef": "PM723394",
                      "parDelegation": "false"
                    },
                    {
                      "acteurRef": "PA721908",
                      "mandatRef": "PM723418",
                      "parDelegation": "false"
                    },
                    {
                      "acteurRef": "PA721916",
                      "mandatRef": "PM723420",
                      "parDelegation": "false"
                    },
                    {
                      "acteurRef": "PA721946",
                      "mandatRef": "PM723430",
                      "parDelegation": "false"
                    },
                    {
                      "acteurRef": "PA722000",
                      "mandatRef": "PM723444",
                      "parDelegation": "false"
                    },
                    {
                      "acteurRef": "PA722046",
                      "mandatRef": "PM723458",
                      "parDelegation": "true"
                    },
                    {
                      "acteurRef": "PA722094",
                      "mandatRef": "PM723470",
                      "parDelegation": "false"
                    },
                    {
                      "acteurRef": "PA722102",
                      "mandatRef": "PM723472",
                      "parDelegation": "false"
                    },
                    {
                      "acteurRef": "PA722150",
                      "mandatRef": "PM723486",
                      "parDelegation": "false"
                    },
                    {
                      "acteurRef": "PA722178",
                      "mandatRef": "PM723494",
                      "parDelegation": "false"
                    },
                    {
                      "acteurRef": "PA722228",
                      "mandatRef": "PM723512",
                      "parDelegation": "false"
                    },
                    {
                      "acteurRef": "PA722312",
                      "mandatRef": "PM723536",
                      "parDelegation": "false"
                    },
                    {
                      "acteurRef": "PA722336",
                      "mandatRef": "PM723544",
                      "parDelegation": "false"
                    },
                    {
                      "acteurRef": "PA722366",
                      "mandatRef": "PM723554",
                      "parDelegation": "false"
                    },
                    {
                      "acteurRef": "PA724827",
                      "mandatRef": "PM754304",
                      "parDelegation": "false"
                    },
                    {
                      "acteurRef": "PA643205",
                      "mandatRef": "PM723358",
                      "parDelegation": "false"
                    },
                    {
                      "acteurRef": "PA719326",
                      "mandatRef": "PM733709",
                      "parDelegation": "false"
                    },
                    {
                      "acteurRef": "PA721876",
                      "mandatRef": "PM733719",
                      "parDelegation": "false"
                    },
                    {
                      "acteurRef": "PA722240",
                      "mandatRef": "PM767406",
                      "parDelegation": "false"
                    }
                  ]
                },
                "contres": null
              }
            }
          },
          {
            "organeRef": "PO730934",
            "nombreMembresGroupe": "104",
            "vote": {
              "positionMajoritaire": "contre",
              "decompteVoix": {
                "pour": "0",
                "contre": "26",
                "nonVotants": "0",
                "abstentions": "3",
                "nonVotantsVolontaires": "3"
              },
              "decompteNominatif": {
                "nonVotants": null,
                "abstentions": {
                  "votant": [
                    {
                      "acteurRef": "PA720644",
                      "mandatRef": "PM723026",
                      "parDelegation": "false"
                    },
                    {
                      "acteurRef": "PA721286",
                      "mandatRef": "PM723224",
                      "parDelegation": "false"
                    },
                    {
                      "acteurRef": "PA709315",
                      "mandatRef": "PM722526",
                      "parDelegation": "false"
                    }
                  ]
                },
                "pours": null,
                "contres": {
                  "votant": [
                    {
                      "acteurRef": "PA720210",
                      "mandatRef": "PM722892",
                      "parDelegation": "false"
                    },
                    {
                      "acteurRef": "PA606712",
                      "mandatRef": "PM722756",
                      "parDelegation": "false"
                    },
                    {
                      "acteurRef": "PA856",
                      "mandatRef": "PM723288",
                      "parDelegation": "false"
                    },
                    {
                      "acteurRef": "PA2155",
                      "mandatRef": "PM722490",
                      "parDelegation": "false"
                    },
                    {
                      "acteurRef": "PA266808",
                      "mandatRef": "PM723264",
                      "parDelegation": "false"
                    },
                    {
                      "acteurRef": "PA267204",
                      "mandatRef": "PM722794",
                      "parDelegation": "false"
                    },
                    {
                      "acteurRef": "PA267429",
                      "mandatRef": "PM722818",
                      "parDelegation": "false"
                    },
                    {
                      "acteurRef": "PA718850",
                      "mandatRef": "PM722478",
                      "parDelegation": "false"
                    },
                    {
                      "acteurRef": "PA266776",
                      "mandatRef": "PM723542",
                      "parDelegation": "false"
                    },
                    {
                      "acteurRef": "PA334149",
                      "mandatRef": "PM723034",
                      "parDelegation": "false"
                    },
                    {
                      "acteurRef": "PA266797",
                      "mandatRef": "PM722884",
                      "parDelegation": "false"
                    },
                    {
                      "acteurRef": "PA332523",
                      "mandatRef": "PM722792",
                      "parDelegation": "false"
                    },
                    {
                      "acteurRef": "PA340853",
                      "mandatRef": "PM722534",
                      "parDelegation": "false"
                    },
                    {
                      "acteurRef": "PA342935",
                      "mandatRef": "PM722856",
                      "parDelegation": "false"
                    },
                    {
                      "acteurRef": "PA609245",
                      "mandatRef": "PM723318",
                      "parDelegation": "false"
                    },
                    {
                      "acteurRef": "PA267785",
                      "mandatRef": "PM723310",
                      "parDelegation": "false"
                    },
                    {
                      "acteurRef": "PA609726",
                      "mandatRef": "PM723426",
                      "parDelegation": "false"
                    },
                    {
                      "acteurRef": "PA718780",
                      "mandatRef": "PM722454",
                      "parDelegation": "false"
                    },
                    {
                      "acteurRef": "PA718784",
                      "mandatRef": "PM722456",
                      "parDelegation": "false"
                    },
                    {
                      "acteurRef": "PA720386",
                      "mandatRef": "PM722948",
                      "parDelegation": "false"
                    },
                    {
                      "acteurRef": "PA642847",
                      "mandatRef": "PM722954",
                      "parDelegation": "false"
                    },
                    {
                      "acteurRef": "PA721314",
                      "mandatRef": "PM723236",
                      "parDelegation": "false"
                    },
                    {
                      "acteurRef": "PA346218",
                      "mandatRef": "PM723348",
                      "parDelegation": "false"
                    },
                    {
                      "acteurRef": "PA330909",
                      "mandatRef": "PM722548",
                      "parDelegation": "false"
                    },
                    {
                      "acteurRef": "PA266793",
                      "mandatRef": "PM722550",
                      "parDelegation": "false"
                    },
                    {
                      "acteurRef": "PA713448",
                      "mandatRef": "PM722452",
                      "parDelegation": "false"
                    }
                  ]
                }
              }
            }
          },
          {
            "organeRef": "PO730970",
            "nombreMembresGroupe": "46",
            "vote": {
              "positionMajoritaire": "pour",
              "decompteVoix": {
                "pour": "15",
                "contre": "0",
                "nonVotants": "0",
                "abstentions": "0",
                "nonVotantsVolontaires": "0"
              },
              "decompteNominatif": {
                "nonVotants": null,
                "abstentions": null,
                "pours": {
                  "votant": [
                    {
                      "acteurRef": "PA721734",
                      "mandatRef": "PM723368",
                      "parDelegation": "false"
                    },
                    {
                      "acteurRef": "PA719640",
                      "mandatRef": "PM722718",
                      "parDelegation": "false"
                    },
                    {
                      "acteurRef": "PA720256",
                      "mandatRef": "PM722908",
                      "parDelegation": "false"
                    },
                    {
                      "acteurRef": "PA720334",
                      "mandatRef": "PM722932",
                      "parDelegation": "false"
                    },
                    {
                      "acteurRef": "PA720652",
                      "mandatRef": "PM723028",
                      "parDelegation": "false"
                    },
                    {
                      "acteurRef": "PA720720",
                      "mandatRef": "PM723056",
                      "parDelegation": "false"
                    },
                    {
                      "acteurRef": "PA720728",
                      "mandatRef": "PM723058",
                      "parDelegation": "false"
                    },
                    {
                      "acteurRef": "PA720764",
                      "mandatRef": "PM723070",
                      "parDelegation": "false"
                    },
                    {
                      "acteurRef": "PA720772",
                      "mandatRef": "PM723072",
                      "parDelegation": "false"
                    },
                    {
                      "acteurRef": "PA720968",
                      "mandatRef": "PM723126",
                      "parDelegation": "false"
                    },
                    {
                      "acteurRef": "PA721234",
                      "mandatRef": "PM723210",
                      "parDelegation": "false"
                    },
                    {
                      "acteurRef": "PA721530",
                      "mandatRef": "PM723302",
                      "parDelegation": "false"
                    },
                    {
                      "acteurRef": "PA721924",
                      "mandatRef": "PM723422",
                      "parDelegation": "false"
                    },
                    {
                      "acteurRef": "PA719918",
                      "mandatRef": "PM733721",
                      "parDelegation": "false"
                    },
                    {
                      "acteurRef": "PA719942",
                      "mandatRef": "PM760307",
                      "parDelegation": "false"
                    }
                  ]
                },
                "contres": null
              }
            }
          },
          {
            "organeRef": "PO758835",
            "nombreMembresGroupe": "29",
            "vote": {
              "positionMajoritaire": "contre",
              "decompteVoix": {
                "pour": "0",
                "contre": "7",
                "nonVotants": "0",
                "abstentions": "0",
                "nonVotantsVolontaires": "0"
              },
              "decompteNominatif": {
                "nonVotants": null,
                "abstentions": null,
                "pours": null,
                "contres": {
                  "votant": [
                    {
                      "acteurRef": "PA1198",
                      "mandatRef": "PM722532",
                      "parDelegation": "false"
                    },
                    {
                      "acteurRef": "PA605069",
                      "mandatRef": "PM722424",
                      "parDelegation": "false"
                    },
                    {
                      "acteurRef": "PA267233",
                      "mandatRef": "PM723500",
                      "parDelegation": "false"
                    },
                    {
                      "acteurRef": "PA342415",
                      "mandatRef": "PM722826",
                      "parDelegation": "false"
                    },
                    {
                      "acteurRef": "PA608011",
                      "mandatRef": "PM723022",
                      "parDelegation": "false"
                    },
                    {
                      "acteurRef": "PA1008",
                      "mandatRef": "PM722704",
                      "parDelegation": "false"
                    },
                    {
                      "acteurRef": "PA608741",
                      "mandatRef": "PM757984",
                      "parDelegation": "false"
                    }
                  ]
                }
              }
            }
          },
          {
            "organeRef": "PO767217",
            "nombreMembresGroupe": "28",
            "vote": {
              "positionMajoritaire": "pour",
              "decompteVoix": {
                "pour": "7",
                "contre": "1",
                "nonVotants": "0",
                "abstentions": "0",
                "nonVotantsVolontaires": "0"
              },
              "decompteNominatif": {
                "nonVotants": null,
                "abstentions": null,
                "pours": {
                  "votant": [
                    {
                      "acteurRef": "PA268019",
                      "mandatRef": "PM723092",
                      "parDelegation": "false"
                    },
                    {
                      "acteurRef": "PA267330",
                      "mandatRef": "PM723392",
                      "parDelegation": "false"
                    },
                    {
                      "acteurRef": "PA332228",
                      "mandatRef": "PM722754",
                      "parDelegation": "false"
                    },
                    {
                      "acteurRef": "PA267766",
                      "mandatRef": "PM722970",
                      "parDelegation": "false"
                    },
                    {
                      "acteurRef": "PA642868",
                      "mandatRef": "PM722992",
                      "parDelegation": "false"
                    },
                    {
                      "acteurRef": "PA342601",
                      "mandatRef": "PM761932",
                      "parDelegation": "false"
                    },
                    {
                      "acteurRef": "PA721632",
                      "mandatRef": "PM760305",
                      "parDelegation": "false"
                    }
                  ]
                },
                "contres": {
                  "votant": {
                    "acteurRef": "PA266788",
                    "mandatRef": "PM722914",
                    "parDelegation": "false"
                  }
                }
              }
            }
          },
          {
            "organeRef": "PO759900",
            "nombreMembresGroupe": "19",
            "vote": {
              "positionMajoritaire": "abstention",
              "decompteVoix": {
                "pour": "1",
                "contre": "0",
                "nonVotants": "0",
                "abstentions": "6",
                "nonVotantsVolontaires": "6"
              },
              "decompteNominatif": {
                "nonVotants": null,
                "abstentions": {
                  "votant": [
                    {
                      "acteurRef": "PA336175",
                      "mandatRef": "PM723328",
                      "parDelegation": "false"
                    },
                    {
                      "acteurRef": "PA605694",
                      "mandatRef": "PM722558",
                      "parDelegation": "false"
                    },
                    {
                      "acteurRef": "PA608292",
                      "mandatRef": "PM723076",
                      "parDelegation": "false"
                    },
                    {
                      "acteurRef": "PA719138",
                      "mandatRef": "PM722574",
                      "parDelegation": "false"
                    },
                    {
                      "acteurRef": "PA719286",
                      "mandatRef": "PM722616",
                      "parDelegation": "false"
                    },
                    {
                      "acteurRef": "PA721194",
                      "mandatRef": "PM723200",
                      "parDelegation": "false"
                    }
                  ]
                },
                "pours": {
                  "votant": {
                    "acteurRef": "PA331582",
                    "mandatRef": "PM722646",
                    "parDelegation": "false"
                  }
                },
                "contres": null
              }
            }
          },
          {
            "organeRef": "PO730958",
            "nombreMembresGroupe": "17",
            "vote": {
              "positionMajoritaire": "contre",
              "decompteVoix": {
                "pour": "0",
                "contre": "8",
                "nonVotants": "0",
                "abstentions": "0",
                "nonVotantsVolontaires": "0"
              },
              "decompteNominatif": {
                "nonVotants": null,
                "abstentions": null,
                "pours": null,
                "contres": {
                  "votant": [
                    {
                      "acteurRef": "PA718868",
                      "mandatRef": "PM722484",
                      "parDelegation": "false"
                    },
                    {
                      "acteurRef": "PA2150",
                      "mandatRef": "PM722506",
                      "parDelegation": "false"
                    },
                    {
                      "acteurRef": "PA719578",
                      "mandatRef": "PM722702",
                      "parDelegation": "false"
                    },
                    {
                      "acteurRef": "PA720422",
                      "mandatRef": "PM722960",
                      "parDelegation": "false"
                    },
                    {
                      "acteurRef": "PA720430",
                      "mandatRef": "PM722962",
                      "parDelegation": "false"
                    },
                    {
                      "acteurRef": "PA720846",
                      "mandatRef": "PM723094",
                      "parDelegation": "false"
                    },
                    {
                      "acteurRef": "PA720892",
                      "mandatRef": "PM723106",
                      "parDelegation": "false"
                    },
                    {
                      "acteurRef": "PA721210",
                      "mandatRef": "PM723204",
                      "parDelegation": "false"
                    }
                  ]
                }
              }
            }
          },
          {
            "organeRef": "PO730940",
            "nombreMembresGroupe": "16",
            "vote": {
              "positionMajoritaire": "contre",
              "decompteVoix": {
                "pour": "0",
                "contre": "5",
                "nonVotants": "0",
                "abstentions": "0",
                "nonVotantsVolontaires": "0"
              },
              "decompteNominatif": {
                "nonVotants": null,
                "abstentions": null,
                "pours": null,
                "contres": {
                  "votant": [
                    {
                      "acteurRef": "PA722202",
                      "mandatRef": "PM723502",
                      "parDelegation": "false"
                    },
                    {
                      "acteurRef": "PA267306",
                      "mandatRef": "PM723054",
                      "parDelegation": "false"
                    },
                    {
                      "acteurRef": "PA718720",
                      "mandatRef": "PM722436",
                      "parDelegation": "false"
                    },
                    {
                      "acteurRef": "PA720546",
                      "mandatRef": "PM722996",
                      "parDelegation": "false"
                    },
                    {
                      "acteurRef": "PA722110",
                      "mandatRef": "PM723474",
                      "parDelegation": "false"
                    }
                  ]
                }
              }
            }
          },
          {
            "organeRef": "PO723569",
            "nombreMembresGroupe": "13",
            "vote": {
              "positionMajoritaire": "contre",
              "decompteVoix": {
                "pour": "0",
                "contre": "2",
                "nonVotants": "0",
                "abstentions": "0",
                "nonVotantsVolontaires": "0"
              },
              "decompteNominatif": {
                "nonVotants": null,
                "abstentions": null,
                "pours": null,
                "contres": {
                  "votant": [
                    {
                      "acteurRef": "PA719608",
                      "mandatRef": "PM722710",
                      "parDelegation": "false"
                    },
                    {
                      "acteurRef": "PA721932",
                      "mandatRef": "PM734586",
                      "parDelegation": "false"
                    }
                  ]
                }
              }
            }
          }
        ]
      }
    }
  },
  "miseAuPoint": {
    "nonVotants": [
      null,
      null
    ],
    "abstentions": [
      null,
      null
    ],
    "nonVotantsVolontaires": [
      null,
      null
    ],
    "pours": {
      "votant": {
        "acteurRef": "PA719806",
        "mandatRef": "PM722768"
      }
    },
    "contres": null,
    "dysfonctionnement": {
      "nonVotants": null,
      "pour": null,
      "contre": null,
      "abstentions": null,
      "nonVotantsVolontaires": null
    }
  },
  "@xmlns": "http://schemas.assemblee-nationale.fr/referentiel"
}