{
  "@xmlns:xsi": "http://www.w3.org/2001/XMLSchema-instance",
  "uid": "VTANR5L15V192",
  "numero": "192",
  "organeRef": "PO717460",
  "legislature": "15",
  "sessionRef": "SCR5A2018O1",
  "seanceRef": "RUANR5L15S2018IDS20709",
  "dateScrutin": "2017-10-25T02:00:00.000+02:00",
  "quantiemeJourSeance": "2",
  "typeVote": {
    "codeTypeVote": "SPO",
    "libelleTypeVote": "scrutin public ordinaire",
    "typeMajorite": "majorité absolue des suffrages exprimés"
  },
  "sort": {
    "code": "rejeté",
    "libelle": "L'Assemblée nationale n'a pas adopté"
  },
  "titre": "l'amendement n?597 de Mme Rabault et les amendements identiques suivants a l'article 7 du projet de loi de financement de la securite sociale pour 2018 (premiere lecture).",
  "demandeur": {
    "texte": "President du groupe \"Nouvelle Gauche\"",
    "referenceLegislative": null
  },
  "objet": {
    "libelle": "l'amendement n?597 de Mme Rabault et les amendements identiques suivants a l'article 7 du projet de loi de financement de la securite sociale pour 2018 (premiere lecture).",
    "referenceLegislative": null
  },
  "modePublicationDesVotes": "DecompteNominatif",
  "syntheseVote": {
    "nombreVotants": "171",
    "suffragesExprimes": "167",
    "nbrSuffragesRequis": "84",
    "annonce": "L'Assemblée nationale n'a pas adopté",
    "decompte": {
      "pour": "34",
      "contre": "133",
      "abstentions": "4",
      "nonVotants": "2",
      "nonVotantsVolontaires": "0"
    }
  },
  "ventilationVotes": {
    "organe": {
      "organeRef": "PO717460",
      "groupes": {
        "groupe": [
          {
            "organeRef": "PO730964",
            "nombreMembresGroupe": "313",
            "vote": {
              "positionMajoritaire": "contre",
              "decompteVoix": {
                "pour": "2",
                "contre": "115",
                "nonVotants": "2",
                "abstentions": "1",
                "nonVotantsVolontaires": "1"
              },
              "decompteNominatif": {
                "nonVotants": {
                  "votant": [
                    {
                      "acteurRef": "PA332747",
                      "mandatRef": "PM722798",
                      "causePositionVote": "PAN"
                    },
                    {
                      "acteurRef": "PA720622",
                      "mandatRef": "PM723018",
                      "causePositionVote": "PSE"
                    }
                  ]
                },
                "abstentions": {
                  "votant": {
                    "acteurRef": "PA719420",
                    "mandatRef": "PM722656",
                    "parDelegation": "false"
                  }
                },
                "pours": {
                  "votant": [
                    {
                      "acteurRef": "PA642724",
                      "mandatRef": "PM722658",
                      "parDelegation": "false"
                    },
                    {
                      "acteurRef": "PA720198",
                      "mandatRef": "PM733711",
                      "parDelegation": "false"
                    }
                  ]
                },
                "contres": {
                  "votant": [
                    {
                      "acteurRef": "PA606171",
                      "mandatRef": "PM722632",
                      "parDelegation": "false"
                    },
                    {
                      "acteurRef": "PA608083",
                      "mandatRef": "PM723038",
                      "parDelegation": "false"
                    },
                    {
                      "acteurRef": "PA331835",
                      "mandatRef": "PM722688",
                      "parDelegation": "false"
                    },
                    {
                      "acteurRef": "PA605963",
                      "mandatRef": "PM722584",
                      "parDelegation": "false"
                    },
                    {
                      "acteurRef": "PA607155",
                      "mandatRef": "PM722832",
                      "parDelegation": "false"
                    },
                    {
                      "acteurRef": "PA721296",
                      "mandatRef": "PM723228",
                      "parDelegation": "false"
                    },
                    {
                      "acteurRef": "PA719520",
                      "mandatRef": "PM722684",
                      "parDelegation": "false"
                    },
                    {
                      "acteurRef": "PA717379",
                      "mandatRef": "PM723282",
                      "parDelegation": "false"
                    },
                    {
                      "acteurRef": "PA718694",
                      "mandatRef": "PM722426",
                      "parDelegation": "false"
                    },
                    {
                      "acteurRef": "PA718710",
                      "mandatRef": "PM722432",
                      "parDelegation": "false"
                    },
                    {
                      "acteurRef": "PA718744",
                      "mandatRef": "PM722442",
                      "parDelegation": "false"
                    },
                    {
                      "acteurRef": "PA718810",
                      "mandatRef": "PM722464",
                      "parDelegation": "false"
                    },
                    {
                      "acteurRef": "PA718902",
                      "mandatRef": "PM722496",
                      "parDelegation": "false"
                    },
                    {
                      "acteurRef": "PA718910",
                      "mandatRef": "PM722498",
                      "parDelegation": "false"
                    },
                    {
                      "acteurRef": "PA718944",
                      "mandatRef": "PM722508",
                      "parDelegation": "false"
                    },
                    {
                      "acteurRef": "PA718954",
                      "mandatRef": "PM722512",
                      "parDelegation": "false"
                    },
                    {
                      "acteurRef": "PA718962",
                      "mandatRef": "PM722514",
                      "parDelegation": "false"
                    },
                    {
                      "acteurRef": "PA719032",
                      "mandatRef": "PM722538",
                      "parDelegation": "false"
                    },
                    {
                      "acteurRef": "PA719060",
                      "mandatRef": "PM722546",
                      "parDelegation": "false"
                    },
                    {
                      "acteurRef": "PA719072",
                      "mandatRef": "PM722552",
                      "parDelegation": "false"
                    },
                    {
                      "acteurRef": "PA719130",
                      "mandatRef": "PM722572",
                      "parDelegation": "false"
                    },
                    {
                      "acteurRef": "PA719170",
                      "mandatRef": "PM722582",
                      "parDelegation": "false"
                    },
                    {
                      "acteurRef": "PA719186",
                      "mandatRef": "PM722588",
                      "parDelegation": "false"
                    },
                    {
                      "acteurRef": "PA719194",
                      "mandatRef": "PM722590",
                      "parDelegation": "false"
                    },
                    {
                      "acteurRef": "PA719218",
                      "mandatRef": "PM722596",
                      "parDelegation": "false"
                    },
                    {
                      "acteurRef": "PA719242",
                      "mandatRef": "PM722604",
                      "parDelegation": "false"
                    },
                    {
                      "acteurRef": "PA719250",
                      "mandatRef": "PM722606",
                      "parDelegation": "false"
                    },
                    {
                      "acteurRef": "PA719294",
                      "mandatRef": "PM722618",
                      "parDelegation": "false"
                    },
                    {
                      "acteurRef": "PA719350",
                      "mandatRef": "PM722634",
                      "parDelegation": "false"
                    },
                    {
                      "acteurRef": "PA719372",
                      "mandatRef": "PM722640",
                      "parDelegation": "false"
                    },
                    {
                      "acteurRef": "PA719388",
                      "mandatRef": "PM722648",
                      "parDelegation": "false"
                    },
                    {
                      "acteurRef": "PA719448",
                      "mandatRef": "PM722666",
                      "parDelegation": "false"
                    },
                    {
                      "acteurRef": "PA719480",
                      "mandatRef": "PM722674",
                      "parDelegation": "false"
                    },
                    {
                      "acteurRef": "PA719496",
                      "mandatRef": "PM722678",
                      "parDelegation": "false"
                    },
                    {
                      "acteurRef": "PA719512",
                      "mandatRef": "PM722682",
                      "parDelegation": "false"
                    },
                    {
                      "acteurRef": "PA719540",
                      "mandatRef": "PM722690",
                      "parDelegation": "false"
                    },
                    {
                      "acteurRef": "PA719570",
                      "mandatRef": "PM722700",
                      "parDelegation": "false"
                    },
                    {
                      "acteurRef": "PA719592",
                      "mandatRef": "PM722706",
                      "parDelegation": "false"
                    },
                    {
                      "acteurRef": "PA719616",
                      "mandatRef": "PM722712",
                      "parDelegation": "false"
                    },
                    {
                      "acteurRef": "PA719624",
                      "mandatRef": "PM722714",
                      "parDelegation": "false"
                    },
                    {
                      "acteurRef": "PA719652",
                      "mandatRef": "PM722722",
                      "parDelegation": "false"
                    },
                    {
                      "acteurRef": "PA719660",
                      "mandatRef": "PM722724",
                      "parDelegation": "false"
                    },
                    {
                      "acteurRef": "PA719684",
                      "mandatRef": "PM722730",
                      "parDelegation": "false"
                    },
                    {
                      "acteurRef": "PA719692",
                      "mandatRef": "PM722732",
                      "parDelegation": "false"
                    },
                    {
                      "acteurRef": "PA719700",
                      "mandatRef": "PM722734",
                      "parDelegation": "false"
                    },
                    {
                      "acteurRef": "PA719748",
                      "mandatRef": "PM722750",
                      "parDelegation": "false"
                    },
                    {
                      "acteurRef": "PA719756",
                      "mandatRef": "PM722752",
                      "parDelegation": "false"
                    },
                    {
                      "acteurRef": "PA719770",
                      "mandatRef": "PM722758",
                      "parDelegation": "false"
                    },
                    {
                      "acteurRef": "PA719830",
                      "mandatRef": "PM722774",
                      "parDelegation": "false"
                    },
                    {
                      "acteurRef": "PA719850",
                      "mandatRef": "PM722780",
                      "parDelegation": "false"
                    },
                    {
                      "acteurRef": "PA719960",
                      "mandatRef": "PM722816",
                      "parDelegation": "false"
                    },
                    {
                      "acteurRef": "PA719980",
                      "mandatRef": "PM722822",
                      "parDelegation": "false"
                    },
                    {
                      "acteurRef": "PA720014",
                      "mandatRef": "PM722834",
                      "parDelegation": "false"
                    },
                    {
                      "acteurRef": "PA720022",
                      "mandatRef": "PM722836",
                      "parDelegation": "false"
                    },
                    {
                      "acteurRef": "PA720046",
                      "mandatRef": "PM722842",
                      "parDelegation": "false"
                    },
                    {
                      "acteurRef": "PA720074",
                      "mandatRef": "PM722850",
                      "parDelegation": "false"
                    },
                    {
                      "acteurRef": "PA643175",
                      "mandatRef": "PM722868",
                      "parDelegation": "false"
                    },
                    {
                      "acteurRef": "PA720138",
                      "mandatRef": "PM722872",
                      "parDelegation": "false"
                    },
                    {
                      "acteurRef": "PA720170",
                      "mandatRef": "PM722880",
                      "parDelegation": "false"
                    },
                    {
                      "acteurRef": "PA720190",
                      "mandatRef": "PM722886",
                      "parDelegation": "false"
                    },
                    {
                      "acteurRef": "PA720214",
                      "mandatRef": "PM722894",
                      "parDelegation": "false"
                    },
                    {
                      "acteurRef": "PA720222",
                      "mandatRef": "PM722896",
                      "parDelegation": "false"
                    },
                    {
                      "acteurRef": "PA720298",
                      "mandatRef": "PM722922",
                      "parDelegation": "false"
                    },
                    {
                      "acteurRef": "PA720342",
                      "mandatRef": "PM722934",
                      "parDelegation": "false"
                    },
                    {
                      "acteurRef": "PA720354",
                      "mandatRef": "PM722940",
                      "parDelegation": "false"
                    },
                    {
                      "acteurRef": "PA720362",
                      "mandatRef": "PM722942",
                      "parDelegation": "false"
                    },
                    {
                      "acteurRef": "PA720438",
                      "mandatRef": "PM722964",
                      "parDelegation": "false"
                    },
                    {
                      "acteurRef": "PA720446",
                      "mandatRef": "PM722966",
                      "parDelegation": "false"
                    },
                    {
                      "acteurRef": "PA720480",
                      "mandatRef": "PM722976",
                      "parDelegation": "false"
                    },
                    {
                      "acteurRef": "PA720500",
                      "mandatRef": "PM722982",
                      "parDelegation": "false"
                    },
                    {
                      "acteurRef": "PA720512",
                      "mandatRef": "PM722986",
                      "parDelegation": "false"
                    },
                    {
                      "acteurRef": "PA720538",
                      "mandatRef": "PM722994",
                      "parDelegation": "false"
                    },
                    {
                      "acteurRef": "PA720560",
                      "mandatRef": "PM723000",
                      "parDelegation": "false"
                    },
                    {
                      "acteurRef": "PA720568",
                      "mandatRef": "PM723002",
                      "parDelegation": "false"
                    },
                    {
                      "acteurRef": "PA720738",
                      "mandatRef": "PM723062",
                      "parDelegation": "false"
                    },
                    {
                      "acteurRef": "PA720754",
                      "mandatRef": "PM723066",
                      "parDelegation": "false"
                    },
                    {
                      "acteurRef": "PA720780",
                      "mandatRef": "PM723074",
                      "parDelegation": "false"
                    },
                    {
                      "acteurRef": "PA720806",
                      "mandatRef": "PM723082",
                      "parDelegation": "false"
                    },
                    {
                      "acteurRef": "PA720854",
                      "mandatRef": "PM723096",
                      "parDelegation": "false"
                    },
                    {
                      "acteurRef": "PA720862",
                      "mandatRef": "PM723098",
                      "parDelegation": "false"
                    },
                    {
                      "acteurRef": "PA720932",
                      "mandatRef": "PM723116",
                      "parDelegation": "false"
                    },
                    {
                      "acteurRef": "PA720944",
                      "mandatRef": "PM723120",
                      "parDelegation": "false"
                    },
                    {
                      "acteurRef": "PA721004",
                      "mandatRef": "PM723136",
                      "parDelegation": "false"
                    },
                    {
                      "acteurRef": "PA721024",
                      "mandatRef": "PM723144",
                      "parDelegation": "false"
                    },
                    {
                      "acteurRef": "PA721134",
                      "mandatRef": "PM723184",
                      "parDelegation": "false"
                    },
                    {
                      "acteurRef": "PA721150",
                      "mandatRef": "PM723188",
                      "parDelegation": "false"
                    },
                    {
                      "acteurRef": "PA721246",
                      "mandatRef": "PM723214",
                      "parDelegation": "false"
                    },
                    {
                      "acteurRef": "PA721336",
                      "mandatRef": "PM723242",
                      "parDelegation": "false"
                    },
                    {
                      "acteurRef": "PA721434",
                      "mandatRef": "PM723272",
                      "parDelegation": "false"
                    },
                    {
                      "acteurRef": "PA721450",
                      "mandatRef": "PM723278",
                      "parDelegation": "false"
                    },
                    {
                      "acteurRef": "PA721458",
                      "mandatRef": "PM723280",
                      "parDelegation": "false"
                    },
                    {
                      "acteurRef": "PA721498",
                      "mandatRef": "PM723294",
                      "parDelegation": "false"
                    },
                    {
                      "acteurRef": "PA721542",
                      "mandatRef": "PM723308",
                      "parDelegation": "false"
                    },
                    {
                      "acteurRef": "PA721670",
                      "mandatRef": "PM723350",
                      "parDelegation": "false"
                    },
                    {
                      "acteurRef": "PA721690",
                      "mandatRef": "PM723356",
                      "parDelegation": "false"
                    },
                    {
                      "acteurRef": "PA721710",
                      "mandatRef": "PM723362",
                      "parDelegation": "false"
                    },
                    {
                      "acteurRef": "PA721844",
                      "mandatRef": "PM723400",
                      "parDelegation": "false"
                    },
                    {
                      "acteurRef": "PA721916",
                      "mandatRef": "PM723420",
                      "parDelegation": "false"
                    },
                    {
                      "acteurRef": "PA722000",
                      "mandatRef": "PM723444",
                      "parDelegation": "false"
                    },
                    {
                      "acteurRef": "PA722062",
                      "mandatRef": "PM723462",
                      "parDelegation": "false"
                    },
                    {
                      "acteurRef": "PA722086",
                      "mandatRef": "PM723468",
                      "parDelegation": "false"
                    },
                    {
                      "acteurRef": "PA722102",
                      "mandatRef": "PM723472",
                      "parDelegation": "false"
                    },
                    {
                      "acteurRef": "PA722126",
                      "mandatRef": "PM723478",
                      "parDelegation": "false"
                    },
                    {
                      "acteurRef": "PA722134",
                      "mandatRef": "PM723482",
                      "parDelegation": "false"
                    },
                    {
                      "acteurRef": "PA722150",
                      "mandatRef": "PM723486",
                      "parDelegation": "false"
                    },
                    {
                      "acteurRef": "PA722268",
                      "mandatRef": "PM723522",
                      "parDelegation": "false"
                    },
                    {
                      "acteurRef": "PA722300",
                      "mandatRef": "PM723532",
                      "parDelegation": "false"
                    },
                    {
                      "acteurRef": "PA722336",
                      "mandatRef": "PM723544",
                      "parDelegation": "false"
                    },
                    {
                      "acteurRef": "PA722382",
                      "mandatRef": "PM723558",
                      "parDelegation": "false"
                    },
                    {
                      "acteurRef": "PA642788",
                      "mandatRef": "PM722746",
                      "parDelegation": "false"
                    },
                    {
                      "acteurRef": "PA642695",
                      "mandatRef": "PM722602",
                      "parDelegation": "false"
                    },
                    {
                      "acteurRef": "PA719326",
                      "mandatRef": "PM733709",
                      "parDelegation": "false"
                    },
                    {
                      "acteurRef": "PA718706",
                      "mandatRef": "PM733715",
                      "parDelegation": "false"
                    },
                    {
                      "acteurRef": "PA721956",
                      "mandatRef": "PM733717",
                      "parDelegation": "false"
                    },
                    {
                      "acteurRef": "PA721876",
                      "mandatRef": "PM733719",
                      "parDelegation": "false"
                    }
                  ]
                }
              }
            }
          },
          {
            "organeRef": "PO730934",
            "nombreMembresGroupe": "100",
            "vote": {
              "positionMajoritaire": "pour",
              "decompteVoix": {
                "pour": "1",
                "contre": "0",
                "nonVotants": "0",
                "abstentions": "0",
                "nonVotantsVolontaires": "0"
              },
              "decompteNominatif": {
                "nonVotants": null,
                "abstentions": null,
                "pours": {
                  "votant": {
                    "acteurRef": "PA346054",
                    "mandatRef": "PM723510",
                    "parDelegation": "false"
                  }
                },
                "contres": null
              }
            }
          },
          {
            "organeRef": "PO730970",
            "nombreMembresGroupe": "47",
            "vote": {
              "positionMajoritaire": "contre",
              "decompteVoix": {
                "pour": "0",
                "contre": "18",
                "nonVotants": "0",
                "abstentions": "2",
                "nonVotantsVolontaires": "2"
              },
              "decompteNominatif": {
                "nonVotants": null,
                "abstentions": {
                  "votant": [
                    {
                      "acteurRef": "PA720326",
                      "mandatRef": "PM722930",
                      "parDelegation": "false"
                    },
                    {
                      "acteurRef": "PA720924",
                      "mandatRef": "PM723114",
                      "parDelegation": "false"
                    }
                  ]
                },
                "pours": null,
                "contres": {
                  "votant": [
                    {
                      "acteurRef": "PA720598",
                      "mandatRef": "PM723012",
                      "parDelegation": "false"
                    },
                    {
                      "acteurRef": "PA721418",
                      "mandatRef": "PM723268",
                      "parDelegation": "false"
                    },
                    {
                      "acteurRef": "PA718978",
                      "mandatRef": "PM722520",
                      "parDelegation": "false"
                    },
                    {
                      "acteurRef": "PA719640",
                      "mandatRef": "PM722718",
                      "parDelegation": "false"
                    },
                    {
                      "acteurRef": "PA719938",
                      "mandatRef": "PM722806",
                      "parDelegation": "false"
                    },
                    {
                      "acteurRef": "PA720002",
                      "mandatRef": "PM722830",
                      "parDelegation": "false"
                    },
                    {
                      "acteurRef": "PA720334",
                      "mandatRef": "PM722932",
                      "parDelegation": "false"
                    },
                    {
                      "acteurRef": "PA720652",
                      "mandatRef": "PM723028",
                      "parDelegation": "false"
                    },
                    {
                      "acteurRef": "PA720720",
                      "mandatRef": "PM723056",
                      "parDelegation": "false"
                    },
                    {
                      "acteurRef": "PA720728",
                      "mandatRef": "PM723058",
                      "parDelegation": "false"
                    },
                    {
                      "acteurRef": "PA720968",
                      "mandatRef": "PM723126",
                      "parDelegation": "false"
                    },
                    {
                      "acteurRef": "PA721530",
                      "mandatRef": "PM723302",
                      "parDelegation": "false"
                    },
                    {
                      "acteurRef": "PA721742",
                      "mandatRef": "PM723370",
                      "parDelegation": "false"
                    },
                    {
                      "acteurRef": "PA721836",
                      "mandatRef": "PM723398",
                      "parDelegation": "false"
                    },
                    {
                      "acteurRef": "PA721924",
                      "mandatRef": "PM723422",
                      "parDelegation": "false"
                    },
                    {
                      "acteurRef": "PA721992",
                      "mandatRef": "PM723442",
                      "parDelegation": "false"
                    },
                    {
                      "acteurRef": "PA722162",
                      "mandatRef": "PM723490",
                      "parDelegation": "false"
                    },
                    {
                      "acteurRef": "PA722374",
                      "mandatRef": "PM723556",
                      "parDelegation": "false"
                    }
                  ]
                }
              }
            }
          },
          {
            "organeRef": "PO730952",
            "nombreMembresGroupe": "35",
            "vote": {
              "positionMajoritaire": "pour",
              "decompteVoix": {
                "pour": "4",
                "contre": "0",
                "nonVotants": "0",
                "abstentions": "1",
                "nonVotantsVolontaires": "1"
              },
              "decompteNominatif": {
                "nonVotants": null,
                "abstentions": {
                  "votant": {
                    "acteurRef": "PA721486",
                    "mandatRef": "PM723290",
                    "parDelegation": "false"
                  }
                },
                "pours": {
                  "votant": [
                    {
                      "acteurRef": "PA267585",
                      "mandatRef": "PM722978",
                      "parDelegation": "false"
                    },
                    {
                      "acteurRef": "PA332228",
                      "mandatRef": "PM722754",
                      "parDelegation": "false"
                    },
                    {
                      "acteurRef": "PA642868",
                      "mandatRef": "PM722992",
                      "parDelegation": "false"
                    },
                    {
                      "acteurRef": "PA721110",
                      "mandatRef": "PM723174",
                      "parDelegation": "false"
                    }
                  ]
                },
                "contres": null
              }
            }
          },
          {
            "organeRef": "PO730946",
            "nombreMembresGroupe": "31",
            "vote": {
              "positionMajoritaire": "pour",
              "decompteVoix": {
                "pour": "10",
                "contre": "0",
                "nonVotants": "0",
                "abstentions": "0",
                "nonVotantsVolontaires": "0"
              },
              "decompteNominatif": {
                "nonVotants": null,
                "abstentions": null,
                "pours": {
                  "votant": [
                    {
                      "acteurRef": "PA508",
                      "mandatRef": "PM722736",
                      "parDelegation": "false"
                    },
                    {
                      "acteurRef": "PA605069",
                      "mandatRef": "PM722424",
                      "parDelegation": "false"
                    },
                    {
                      "acteurRef": "PA342415",
                      "mandatRef": "PM722826",
                      "parDelegation": "false"
                    },
                    {
                      "acteurRef": "PA607553",
                      "mandatRef": "PM722956",
                      "parDelegation": "false"
                    },
                    {
                      "acteurRef": "PA608172",
                      "mandatRef": "PM723048",
                      "parDelegation": "false"
                    },
                    {
                      "acteurRef": "PA609590",
                      "mandatRef": "PM723326",
                      "parDelegation": "false"
                    },
                    {
                      "acteurRef": "PA610681",
                      "mandatRef": "PM723150",
                      "parDelegation": "false"
                    },
                    {
                      "acteurRef": "PA719930",
                      "mandatRef": "PM722804",
                      "parDelegation": "false"
                    },
                    {
                      "acteurRef": "PA643145",
                      "mandatRef": "PM723130",
                      "parDelegation": "false"
                    },
                    {
                      "acteurRef": "PA642764",
                      "mandatRef": "PM722692",
                      "parDelegation": "false"
                    }
                  ]
                },
                "contres": null
              }
            }
          },
          {
            "organeRef": "PO723569",
            "nombreMembresGroupe": "18",
            "vote": {
              "positionMajoritaire": "pour",
              "decompteVoix": {
                "pour": "3",
                "contre": "0",
                "nonVotants": "0",
                "abstentions": "0",
                "nonVotantsVolontaires": "0"
              },
              "decompteNominatif": {
                "nonVotants": null,
                "abstentions": null,
                "pours": {
                  "votant": [
                    {
                      "acteurRef": "PA608292",
                      "mandatRef": "PM723076",
                      "parDelegation": "false"
                    },
                    {
                      "acteurRef": "PA719608",
                      "mandatRef": "PM722710",
                      "parDelegation": "false"
                    },
                    {
                      "acteurRef": "PA720822",
                      "mandatRef": "PM723086",
                      "parDelegation": "false"
                    }
                  ]
                },
                "contres": null
              }
            }
          },
          {
            "organeRef": "PO730958",
            "nombreMembresGroupe": "17",
            "vote": {
              "positionMajoritaire": "pour",
              "decompteVoix": {
                "pour": "10",
                "contre": "0",
                "nonVotants": "0",
                "abstentions": "0",
                "nonVotantsVolontaires": "0"
              },
              "decompteNominatif": {
                "nonVotants": null,
                "abstentions": null,
                "pours": {
                  "votant": [
                    {
                      "acteurRef": "PA588884",
                      "mandatRef": "PM723226",
                      "parDelegation": "false"
                    },
                    {
                      "acteurRef": "PA718868",
                      "mandatRef": "PM722484",
                      "parDelegation": "false"
                    },
                    {
                      "acteurRef": "PA719578",
                      "mandatRef": "PM722702",
                      "parDelegation": "false"
                    },
                    {
                      "acteurRef": "PA720286",
                      "mandatRef": "PM722918",
                      "parDelegation": "false"
                    },
                    {
                      "acteurRef": "PA720422",
                      "mandatRef": "PM722960",
                      "parDelegation": "false"
                    },
                    {
                      "acteurRef": "PA720892",
                      "mandatRef": "PM723106",
                      "parDelegation": "false"
                    },
                    {
                      "acteurRef": "PA721062",
                      "mandatRef": "PM723158",
                      "parDelegation": "false"
                    },
                    {
                      "acteurRef": "PA721210",
                      "mandatRef": "PM723204",
                      "parDelegation": "false"
                    },
                    {
                      "acteurRef": "PA721226",
                      "mandatRef": "PM723208",
                      "parDelegation": "false"
                    },
                    {
                      "acteurRef": "PA722142",
                      "mandatRef": "PM723484",
                      "parDelegation": "false"
                    }
                  ]
                },
                "contres": null
              }
            }
          },
          {
            "organeRef": "PO730940",
            "nombreMembresGroupe": "16",
            "vote": {
              "positionMajoritaire": "pour",
              "decompteVoix": {
                "pour": "4",
                "contre": "0",
                "nonVotants": "0",
                "abstentions": "0",
                "nonVotantsVolontaires": "0"
              },
              "decompteNominatif": {
                "nonVotants": null,
                "abstentions": null,
                "pours": {
                  "votant": [
                    {
                      "acteurRef": "PA718926",
                      "mandatRef": "PM722502",
                      "parDelegation": "false"
                    },
                    {
                      "acteurRef": "PA718720",
                      "mandatRef": "PM722436",
                      "parDelegation": "false"
                    },
                    {
                      "acteurRef": "PA722110",
                      "mandatRef": "PM723474",
                      "parDelegation": "false"
                    },
                    {
                      "acteurRef": "PA335612",
                      "mandatRef": "PM723506",
                      "parDelegation": "false"
                    }
                  ]
                },
                "contres": null
              }
            }
          }
        ]
      }
    }
  },
  "miseAuPoint": null,
  "@xmlns": "http://schemas.assemblee-nationale.fr/referentiel"
}