{
  "@xmlns:xsi": "http://www.w3.org/2001/XMLSchema-instance",
  "uid": "VTANR5L15V1780",
  "numero": "1780",
  "organeRef": "PO717460",
  "legislature": "15",
  "sessionRef": "SCR5A2019O1",
  "seanceRef": "RUANR5L15S2019IDS21568",
  "dateScrutin": "2019-03-20T01:00:00.000+01:00",
  "quantiemeJourSeance": "2",
  "typeVote": {
    "codeTypeVote": "SPO",
    "libelleTypeVote": "scrutin public ordinaire",
    "typeMajorite": "majorité absolue des suffrages exprimés"
  },
  "sort": {
    "code": "rejeté",
    "libelle": "L'Assemblée nationale n'a pas adopté"
  },
  "titre": "le sous-amendement n° 2073 de M. Benoit à l'amendement n° 1128 de M. Viala après l'article 5 bis du projet de loi relatif à l'organisation et à la transformation du système de santé (première lecture).",
  "demandeur": {
    "texte": "Président du groupe \"UDI, Agir et Indépendants\"",
    "referenceLegislative": null
  },
  "objet": {
    "libelle": "le sous-amendement n° 2073 de M. Benoit à l'amendement n° 1128 de M. Viala après l'article 5 bis du projet de loi relatif à l'organisation et à la transformation du système de santé (première lecture).",
    "referenceLegislative": null
  },
  "modePublicationDesVotes": "DecompteNominatif",
  "syntheseVote": {
    "nombreVotants": "117",
    "suffragesExprimes": "106",
    "nbrSuffragesRequis": "54",
    "annonce": "L'Assemblée nationale n'a pas adopté",
    "decompte": {
      "pour": "20",
      "contre": "86",
      "abstentions": "11",
      "nonVotants": "2",
      "nonVotantsVolontaires": "0"
    }
  },
  "ventilationVotes": {
    "organe": {
      "organeRef": "PO717460",
      "groupes": {
        "groupe": [
          {
            "organeRef": "PO730964",
            "nombreMembresGroupe": "306",
            "vote": {
              "positionMajoritaire": "contre",
              "decompteVoix": {
                "pour": "0",
                "contre": "67",
                "nonVotants": "2",
                "abstentions": "4",
                "nonVotantsVolontaires": "4"
              },
              "decompteNominatif": {
                "nonVotants": {
                  "votant": [
                    {
                      "acteurRef": "PA606171",
                      "mandatRef": "PM722632",
                      "causePositionVote": "PAN"
                    },
                    {
                      "acteurRef": "PA721824",
                      "mandatRef": "PM723394",
                      "causePositionVote": "PSE"
                    }
                  ]
                },
                "abstentions": {
                  "votant": [
                    {
                      "acteurRef": "PA607155",
                      "mandatRef": "PM722832",
                      "parDelegation": "false"
                    },
                    {
                      "acteurRef": "PA718744",
                      "mandatRef": "PM722442",
                      "parDelegation": "false"
                    },
                    {
                      "acteurRef": "PA719372",
                      "mandatRef": "PM722640",
                      "parDelegation": "false"
                    },
                    {
                      "acteurRef": "PA719540",
                      "mandatRef": "PM722690",
                      "parDelegation": "false"
                    }
                  ]
                },
                "pours": null,
                "contres": {
                  "votant": [
                    {
                      "acteurRef": "PA722398",
                      "mandatRef": "PM723562",
                      "parDelegation": "false"
                    },
                    {
                      "acteurRef": "PA2449",
                      "mandatRef": "PM723036",
                      "parDelegation": "false"
                    },
                    {
                      "acteurRef": "PA719668",
                      "mandatRef": "PM722726",
                      "parDelegation": "false"
                    },
                    {
                      "acteurRef": "PA608083",
                      "mandatRef": "PM723038",
                      "parDelegation": "true"
                    },
                    {
                      "acteurRef": "PA331835",
                      "mandatRef": "PM722688",
                      "parDelegation": "false"
                    },
                    {
                      "acteurRef": "PA334768",
                      "mandatRef": "PM723548",
                      "parDelegation": "false"
                    },
                    {
                      "acteurRef": "PA721296",
                      "mandatRef": "PM723228",
                      "parDelegation": "false"
                    },
                    {
                      "acteurRef": "PA721852",
                      "mandatRef": "PM723402",
                      "parDelegation": "false"
                    },
                    {
                      "acteurRef": "PA720492",
                      "mandatRef": "PM722980",
                      "parDelegation": "false"
                    },
                    {
                      "acteurRef": "PA717379",
                      "mandatRef": "PM723282",
                      "parDelegation": "false"
                    },
                    {
                      "acteurRef": "PA718694",
                      "mandatRef": "PM722426",
                      "parDelegation": "false"
                    },
                    {
                      "acteurRef": "PA718736",
                      "mandatRef": "PM722440",
                      "parDelegation": "false"
                    },
                    {
                      "acteurRef": "PA718954",
                      "mandatRef": "PM722512",
                      "parDelegation": "false"
                    },
                    {
                      "acteurRef": "PA718962",
                      "mandatRef": "PM722514",
                      "parDelegation": "false"
                    },
                    {
                      "acteurRef": "PA719060",
                      "mandatRef": "PM722546",
                      "parDelegation": "false"
                    },
                    {
                      "acteurRef": "PA719072",
                      "mandatRef": "PM722552",
                      "parDelegation": "false"
                    },
                    {
                      "acteurRef": "PA719130",
                      "mandatRef": "PM722572",
                      "parDelegation": "false"
                    },
                    {
                      "acteurRef": "PA719242",
                      "mandatRef": "PM722604",
                      "parDelegation": "false"
                    },
                    {
                      "acteurRef": "PA719338",
                      "mandatRef": "PM722630",
                      "parDelegation": "false"
                    },
                    {
                      "acteurRef": "PA719350",
                      "mandatRef": "PM722634",
                      "parDelegation": "false"
                    },
                    {
                      "acteurRef": "PA719448",
                      "mandatRef": "PM722666",
                      "parDelegation": "false"
                    },
                    {
                      "acteurRef": "PA719472",
                      "mandatRef": "PM722672",
                      "parDelegation": "false"
                    },
                    {
                      "acteurRef": "PA719512",
                      "mandatRef": "PM722682",
                      "parDelegation": "false"
                    },
                    {
                      "acteurRef": "PA719570",
                      "mandatRef": "PM722700",
                      "parDelegation": "false"
                    },
                    {
                      "acteurRef": "PA719652",
                      "mandatRef": "PM722722",
                      "parDelegation": "false"
                    },
                    {
                      "acteurRef": "PA719728",
                      "mandatRef": "PM722744",
                      "parDelegation": "false"
                    },
                    {
                      "acteurRef": "PA719740",
                      "mandatRef": "PM722748",
                      "parDelegation": "false"
                    },
                    {
                      "acteurRef": "PA719790",
                      "mandatRef": "PM722764",
                      "parDelegation": "false"
                    },
                    {
                      "acteurRef": "PA719850",
                      "mandatRef": "PM722780",
                      "parDelegation": "false"
                    },
                    {
                      "acteurRef": "PA719858",
                      "mandatRef": "PM722782",
                      "parDelegation": "false"
                    },
                    {
                      "acteurRef": "PA719922",
                      "mandatRef": "PM722802",
                      "parDelegation": "false"
                    },
                    {
                      "acteurRef": "PA719980",
                      "mandatRef": "PM722822",
                      "parDelegation": "false"
                    },
                    {
                      "acteurRef": "PA720046",
                      "mandatRef": "PM722842",
                      "parDelegation": "false"
                    },
                    {
                      "acteurRef": "PA720066",
                      "mandatRef": "PM722848",
                      "parDelegation": "false"
                    },
                    {
                      "acteurRef": "PA720146",
                      "mandatRef": "PM722874",
                      "parDelegation": "false"
                    },
                    {
                      "acteurRef": "PA720170",
                      "mandatRef": "PM722880",
                      "parDelegation": "false"
                    },
                    {
                      "acteurRef": "PA720190",
                      "mandatRef": "PM722886",
                      "parDelegation": "false"
                    },
                    {
                      "acteurRef": "PA720214",
                      "mandatRef": "PM722894",
                      "parDelegation": "false"
                    },
                    {
                      "acteurRef": "PA720342",
                      "mandatRef": "PM722934",
                      "parDelegation": "false"
                    },
                    {
                      "acteurRef": "PA720362",
                      "mandatRef": "PM722942",
                      "parDelegation": "false"
                    },
                    {
                      "acteurRef": "PA720394",
                      "mandatRef": "PM722950",
                      "parDelegation": "false"
                    },
                    {
                      "acteurRef": "PA720512",
                      "mandatRef": "PM722986",
                      "parDelegation": "false"
                    },
                    {
                      "acteurRef": "PA720552",
                      "mandatRef": "PM722998",
                      "parDelegation": "false"
                    },
                    {
                      "acteurRef": "PA720738",
                      "mandatRef": "PM723062",
                      "parDelegation": "true"
                    },
                    {
                      "acteurRef": "PA720754",
                      "mandatRef": "PM723066",
                      "parDelegation": "false"
                    },
                    {
                      "acteurRef": "PA720862",
                      "mandatRef": "PM723098",
                      "parDelegation": "false"
                    },
                    {
                      "acteurRef": "PA720916",
                      "mandatRef": "PM723112",
                      "parDelegation": "false"
                    },
                    {
                      "acteurRef": "PA720932",
                      "mandatRef": "PM723116",
                      "parDelegation": "false"
                    },
                    {
                      "acteurRef": "PA721246",
                      "mandatRef": "PM723214",
                      "parDelegation": "false"
                    },
                    {
                      "acteurRef": "PA721328",
                      "mandatRef": "PM723240",
                      "parDelegation": "false"
                    },
                    {
                      "acteurRef": "PA721336",
                      "mandatRef": "PM723242",
                      "parDelegation": "false"
                    },
                    {
                      "acteurRef": "PA721364",
                      "mandatRef": "PM723250",
                      "parDelegation": "false"
                    },
                    {
                      "acteurRef": "PA721426",
                      "mandatRef": "PM723270",
                      "parDelegation": "false"
                    },
                    {
                      "acteurRef": "PA721466",
                      "mandatRef": "PM723284",
                      "parDelegation": "false"
                    },
                    {
                      "acteurRef": "PA721670",
                      "mandatRef": "PM723350",
                      "parDelegation": "false"
                    },
                    {
                      "acteurRef": "PA721726",
                      "mandatRef": "PM723366",
                      "parDelegation": "false"
                    },
                    {
                      "acteurRef": "PA721750",
                      "mandatRef": "PM723372",
                      "parDelegation": "false"
                    },
                    {
                      "acteurRef": "PA722046",
                      "mandatRef": "PM723458",
                      "parDelegation": "false"
                    },
                    {
                      "acteurRef": "PA722062",
                      "mandatRef": "PM723462",
                      "parDelegation": "false"
                    },
                    {
                      "acteurRef": "PA722102",
                      "mandatRef": "PM723472",
                      "parDelegation": "false"
                    },
                    {
                      "acteurRef": "PA722134",
                      "mandatRef": "PM723482",
                      "parDelegation": "false"
                    },
                    {
                      "acteurRef": "PA642788",
                      "mandatRef": "PM722746",
                      "parDelegation": "false"
                    },
                    {
                      "acteurRef": "PA702054",
                      "mandatRef": "PM733713",
                      "parDelegation": "false"
                    },
                    {
                      "acteurRef": "PA642695",
                      "mandatRef": "PM722602",
                      "parDelegation": "false"
                    },
                    {
                      "acteurRef": "PA718706",
                      "mandatRef": "PM733715",
                      "parDelegation": "false"
                    },
                    {
                      "acteurRef": "PA721564",
                      "mandatRef": "PM733723",
                      "parDelegation": "false"
                    },
                    {
                      "acteurRef": "PA719910",
                      "mandatRef": "PM759347",
                      "parDelegation": "false"
                    }
                  ]
                }
              }
            }
          },
          {
            "organeRef": "PO730934",
            "nombreMembresGroupe": "104",
            "vote": {
              "positionMajoritaire": "pour",
              "decompteVoix": {
                "pour": "8",
                "contre": "7",
                "nonVotants": "0",
                "abstentions": "2",
                "nonVotantsVolontaires": "2"
              },
              "decompteNominatif": {
                "nonVotants": null,
                "abstentions": {
                  "votant": [
                    {
                      "acteurRef": "PA2377",
                      "mandatRef": "PM723550",
                      "parDelegation": "false"
                    },
                    {
                      "acteurRef": "PA718780",
                      "mandatRef": "PM722454",
                      "parDelegation": "false"
                    }
                  ]
                },
                "pours": {
                  "votant": [
                    {
                      "acteurRef": "PA720644",
                      "mandatRef": "PM723026",
                      "parDelegation": "false"
                    },
                    {
                      "acteurRef": "PA267260",
                      "mandatRef": "PM722476",
                      "parDelegation": "false"
                    },
                    {
                      "acteurRef": "PA721410",
                      "mandatRef": "PM723266",
                      "parDelegation": "false"
                    },
                    {
                      "acteurRef": "PA608016",
                      "mandatRef": "PM723024",
                      "parDelegation": "false"
                    },
                    {
                      "acteurRef": "PA720684",
                      "mandatRef": "PM723040",
                      "parDelegation": "false"
                    },
                    {
                      "acteurRef": "PA721816",
                      "mandatRef": "PM748964",
                      "parDelegation": "false"
                    },
                    {
                      "acteurRef": "PA643134",
                      "mandatRef": "PM722824",
                      "parDelegation": "false"
                    },
                    {
                      "acteurRef": "PA709315",
                      "mandatRef": "PM722526",
                      "parDelegation": "false"
                    }
                  ]
                },
                "contres": {
                  "votant": [
                    {
                      "acteurRef": "PA606712",
                      "mandatRef": "PM722756",
                      "parDelegation": "false"
                    },
                    {
                      "acteurRef": "PA267289",
                      "mandatRef": "PM754301",
                      "parDelegation": "false"
                    },
                    {
                      "acteurRef": "PA267378",
                      "mandatRef": "PM723344",
                      "parDelegation": "false"
                    },
                    {
                      "acteurRef": "PA336316",
                      "mandatRef": "PM723406",
                      "parDelegation": "false"
                    },
                    {
                      "acteurRef": "PA267318",
                      "mandatRef": "PM723260",
                      "parDelegation": "false"
                    },
                    {
                      "acteurRef": "PA642847",
                      "mandatRef": "PM722954",
                      "parDelegation": "false"
                    },
                    {
                      "acteurRef": "PA721286",
                      "mandatRef": "PM723224",
                      "parDelegation": "false"
                    }
                  ]
                }
              }
            }
          },
          {
            "organeRef": "PO730970",
            "nombreMembresGroupe": "46",
            "vote": {
              "positionMajoritaire": "contre",
              "decompteVoix": {
                "pour": "1",
                "contre": "7",
                "nonVotants": "0",
                "abstentions": "0",
                "nonVotantsVolontaires": "0"
              },
              "decompteNominatif": {
                "nonVotants": null,
                "abstentions": null,
                "pours": {
                  "votant": {
                    "acteurRef": "PA720256",
                    "mandatRef": "PM722908",
                    "parDelegation": "false"
                  }
                },
                "contres": {
                  "votant": [
                    {
                      "acteurRef": "PA718978",
                      "mandatRef": "PM722520",
                      "parDelegation": "false"
                    },
                    {
                      "acteurRef": "PA719266",
                      "mandatRef": "PM722610",
                      "parDelegation": "false"
                    },
                    {
                      "acteurRef": "PA719488",
                      "mandatRef": "PM722676",
                      "parDelegation": "false"
                    },
                    {
                      "acteurRef": "PA720326",
                      "mandatRef": "PM722930",
                      "parDelegation": "false"
                    },
                    {
                      "acteurRef": "PA720968",
                      "mandatRef": "PM723126",
                      "parDelegation": "false"
                    },
                    {
                      "acteurRef": "PA721924",
                      "mandatRef": "PM723422",
                      "parDelegation": "false"
                    },
                    {
                      "acteurRef": "PA722374",
                      "mandatRef": "PM723556",
                      "parDelegation": "false"
                    }
                  ]
                }
              }
            }
          },
          {
            "organeRef": "PO744425",
            "nombreMembresGroupe": "29",
            "vote": {
              "positionMajoritaire": "pour",
              "decompteVoix": {
                "pour": "3",
                "contre": "1",
                "nonVotants": "0",
                "abstentions": "1",
                "nonVotantsVolontaires": "1"
              },
              "decompteNominatif": {
                "nonVotants": null,
                "abstentions": {
                  "votant": {
                    "acteurRef": "PA642868",
                    "mandatRef": "PM722992",
                    "parDelegation": "false"
                  }
                },
                "pours": {
                  "votant": [
                    {
                      "acteurRef": "PA332228",
                      "mandatRef": "PM722754",
                      "parDelegation": "false"
                    },
                    {
                      "acteurRef": "PA719806",
                      "mandatRef": "PM722768",
                      "parDelegation": "false"
                    },
                    {
                      "acteurRef": "PA342601",
                      "mandatRef": "PM761932",
                      "parDelegation": "false"
                    }
                  ]
                },
                "contres": {
                  "votant": {
                    "acteurRef": "PA267780",
                    "mandatRef": "PM723504",
                    "parDelegation": "false"
                  }
                }
              }
            }
          },
          {
            "organeRef": "PO758835",
            "nombreMembresGroupe": "29",
            "vote": {
              "positionMajoritaire": "pour",
              "decompteVoix": {
                "pour": "4",
                "contre": "0",
                "nonVotants": "0",
                "abstentions": "0",
                "nonVotantsVolontaires": "0"
              },
              "decompteNominatif": {
                "nonVotants": null,
                "abstentions": null,
                "pours": {
                  "votant": [
                    {
                      "acteurRef": "PA508",
                      "mandatRef": "PM722736",
                      "parDelegation": "false"
                    },
                    {
                      "acteurRef": "PA333285",
                      "mandatRef": "PM722906",
                      "parDelegation": "false"
                    },
                    {
                      "acteurRef": "PA610681",
                      "mandatRef": "PM723150",
                      "parDelegation": "false"
                    },
                    {
                      "acteurRef": "PA642764",
                      "mandatRef": "PM753836",
                      "parDelegation": "false"
                    }
                  ]
                },
                "contres": null
              }
            }
          },
          {
            "organeRef": "PO730958",
            "nombreMembresGroupe": "17",
            "vote": {
              "positionMajoritaire": "abstention",
              "decompteVoix": {
                "pour": "0",
                "contre": "0",
                "nonVotants": "0",
                "abstentions": "2",
                "nonVotantsVolontaires": "2"
              },
              "decompteNominatif": {
                "nonVotants": null,
                "abstentions": {
                  "votant": [
                    {
                      "acteurRef": "PA720286",
                      "mandatRef": "PM722918",
                      "parDelegation": "false"
                    },
                    {
                      "acteurRef": "PA720430",
                      "mandatRef": "PM722962",
                      "parDelegation": "false"
                    }
                  ]
                },
                "pours": null,
                "contres": null
              }
            }
          },
          {
            "organeRef": "PO730940",
            "nombreMembresGroupe": "16",
            "vote": {
              "positionMajoritaire": "abstention",
              "decompteVoix": {
                "pour": "0",
                "contre": "0",
                "nonVotants": "0",
                "abstentions": "2",
                "nonVotantsVolontaires": "2"
              },
              "decompteNominatif": {
                "nonVotants": null,
                "abstentions": {
                  "votant": [
                    {
                      "acteurRef": "PA718926",
                      "mandatRef": "PM722502",
                      "parDelegation": "false"
                    },
                    {
                      "acteurRef": "PA720546",
                      "mandatRef": "PM722996",
                      "parDelegation": "false"
                    }
                  ]
                },
                "pours": null,
                "contres": null
              }
            }
          },
          {
            "organeRef": "PO759900",
            "nombreMembresGroupe": "16",
            "vote": {
              "positionMajoritaire": "pour",
              "decompteVoix": {
                "pour": "4",
                "contre": "3",
                "nonVotants": "0",
                "abstentions": "0",
                "nonVotantsVolontaires": "0"
              },
              "decompteNominatif": {
                "nonVotants": null,
                "abstentions": null,
                "pours": {
                  "votant": [
                    {
                      "acteurRef": "PA267042",
                      "mandatRef": "PM722910",
                      "parDelegation": "false"
                    },
                    {
                      "acteurRef": "PA331582",
                      "mandatRef": "PM722646",
                      "parDelegation": "false"
                    },
                    {
                      "acteurRef": "PA607619",
                      "mandatRef": "PM722936",
                      "parDelegation": "false"
                    },
                    {
                      "acteurRef": "PA608292",
                      "mandatRef": "PM723076",
                      "parDelegation": "false"
                    }
                  ]
                },
                "contres": {
                  "votant": [
                    {
                      "acteurRef": "PA336175",
                      "mandatRef": "PM723328",
                      "parDelegation": "false"
                    },
                    {
                      "acteurRef": "PA719138",
                      "mandatRef": "PM722574",
                      "parDelegation": "false"
                    },
                    {
                      "acteurRef": "PA719286",
                      "mandatRef": "PM722616",
                      "parDelegation": "false"
                    }
                  ]
                }
              }
            }
          },
          {
            "organeRef": "PO723569",
            "nombreMembresGroupe": "14",
            "vote": {
              "positionMajoritaire": "contre",
              "decompteVoix": {
                "pour": "0",
                "contre": "1",
                "nonVotants": "0",
                "abstentions": "0",
                "nonVotantsVolontaires": "0"
              },
              "decompteNominatif": {
                "nonVotants": null,
                "abstentions": null,
                "pours": null,
                "contres": {
                  "votant": {
                    "acteurRef": "PA719608",
                    "mandatRef": "PM722710",
                    "parDelegation": "false"
                  }
                }
              }
            }
          }
        ]
      }
    }
  },
  "miseAuPoint": null,
  "@xmlns": "http://schemas.assemblee-nationale.fr/referentiel"
}