{
  "@xmlns:xsi": "http://www.w3.org/2001/XMLSchema-instance",
  "uid": "VTANR5L15V1948",
  "numero": "1948",
  "organeRef": "PO717460",
  "legislature": "15",
  "sessionRef": "SCR5A2019O1",
  "seanceRef": "RUANR5L15S2019IDS21700",
  "dateScrutin": "2019-06-13T02:00:00.000+02:00",
  "quantiemeJourSeance": "3",
  "typeVote": {
    "codeTypeVote": "SPO",
    "libelleTypeVote": "scrutin public ordinaire",
    "typeMajorite": "majorité absolue des suffrages exprimés"
  },
  "sort": {
    "code": "rejeté",
    "libelle": "L'Assemblée nationale n'a pas adopté"
  },
  "titre": "l'amendement n° 3019 (2ème rect.) de M. François-Michel Lambert après l'article 1er B du projet de loi d'orientation des mobilités (première lecture).",
  "demandeur": {
    "texte": "Président du groupe \"Libertés et Territoires\"",
    "referenceLegislative": null
  },
  "objet": {
    "libelle": "l'amendement n° 3019 (2ème rect.) de M. François-Michel Lambert après l'article 1er B du projet de loi d'orientation des mobilités (première lecture).",
    "referenceLegislative": null
  },
  "modePublicationDesVotes": "DecompteNominatif",
  "syntheseVote": {
    "nombreVotants": "40",
    "suffragesExprimes": "38",
    "nbrSuffragesRequis": "20",
    "annonce": "L'Assemblée nationale n'a pas adopté",
    "decompte": {
      "pour": "7",
      "contre": "31",
      "abstentions": "2",
      "nonVotants": "2",
      "nonVotantsVolontaires": "0"
    }
  },
  "ventilationVotes": {
    "organe": {
      "organeRef": "PO717460",
      "groupes": {
        "groupe": [
          {
            "organeRef": "PO730964",
            "nombreMembresGroupe": "305",
            "vote": {
              "positionMajoritaire": "contre",
              "decompteVoix": {
                "pour": "0",
                "contre": "27",
                "nonVotants": "2",
                "abstentions": "1",
                "nonVotantsVolontaires": "1"
              },
              "decompteNominatif": {
                "nonVotants": {
                  "votant": [
                    {
                      "acteurRef": "PA606171",
                      "mandatRef": "PM722632",
                      "causePositionVote": "PAN"
                    },
                    {
                      "acteurRef": "PA720622",
                      "mandatRef": "PM723018",
                      "causePositionVote": "PSE"
                    }
                  ]
                },
                "abstentions": {
                  "votant": {
                    "acteurRef": "PA718744",
                    "mandatRef": "PM722442",
                    "parDelegation": "false"
                  }
                },
                "pours": null,
                "contres": {
                  "votant": [
                    {
                      "acteurRef": "PA719952",
                      "mandatRef": "PM722814",
                      "parDelegation": "false"
                    },
                    {
                      "acteurRef": "PA609520",
                      "mandatRef": "PM723508",
                      "parDelegation": "false"
                    },
                    {
                      "acteurRef": "PA606202",
                      "mandatRef": "PM722698",
                      "parDelegation": "false"
                    },
                    {
                      "acteurRef": "PA721296",
                      "mandatRef": "PM723228",
                      "parDelegation": "false"
                    },
                    {
                      "acteurRef": "PA718962",
                      "mandatRef": "PM722514",
                      "parDelegation": "false"
                    },
                    {
                      "acteurRef": "PA719080",
                      "mandatRef": "PM722554",
                      "parDelegation": "false"
                    },
                    {
                      "acteurRef": "PA719230",
                      "mandatRef": "PM722600",
                      "parDelegation": "false"
                    },
                    {
                      "acteurRef": "PA719372",
                      "mandatRef": "PM722640",
                      "parDelegation": "false"
                    },
                    {
                      "acteurRef": "PA719412",
                      "mandatRef": "PM722654",
                      "parDelegation": "false"
                    },
                    {
                      "acteurRef": "PA719472",
                      "mandatRef": "PM722672",
                      "parDelegation": "false"
                    },
                    {
                      "acteurRef": "PA719624",
                      "mandatRef": "PM722714",
                      "parDelegation": "false"
                    },
                    {
                      "acteurRef": "PA719740",
                      "mandatRef": "PM722748",
                      "parDelegation": "false"
                    },
                    {
                      "acteurRef": "PA719830",
                      "mandatRef": "PM722774",
                      "parDelegation": "false"
                    },
                    {
                      "acteurRef": "PA720222",
                      "mandatRef": "PM722896",
                      "parDelegation": "false"
                    },
                    {
                      "acteurRef": "PA720242",
                      "mandatRef": "PM722902",
                      "parDelegation": "false"
                    },
                    {
                      "acteurRef": "PA720520",
                      "mandatRef": "PM722988",
                      "parDelegation": "false"
                    },
                    {
                      "acteurRef": "PA720806",
                      "mandatRef": "PM723082",
                      "parDelegation": "false"
                    },
                    {
                      "acteurRef": "PA720944",
                      "mandatRef": "PM723120",
                      "parDelegation": "false"
                    },
                    {
                      "acteurRef": "PA721372",
                      "mandatRef": "PM723252",
                      "parDelegation": "false"
                    },
                    {
                      "acteurRef": "PA721426",
                      "mandatRef": "PM723270",
                      "parDelegation": "false"
                    },
                    {
                      "acteurRef": "PA721450",
                      "mandatRef": "PM723278",
                      "parDelegation": "false"
                    },
                    {
                      "acteurRef": "PA721600",
                      "mandatRef": "PM723330",
                      "parDelegation": "false"
                    },
                    {
                      "acteurRef": "PA721916",
                      "mandatRef": "PM723420",
                      "parDelegation": "false"
                    },
                    {
                      "acteurRef": "PA722336",
                      "mandatRef": "PM723544",
                      "parDelegation": "false"
                    },
                    {
                      "acteurRef": "PA722366",
                      "mandatRef": "PM723554",
                      "parDelegation": "false"
                    },
                    {
                      "acteurRef": "PA724827",
                      "mandatRef": "PM754304",
                      "parDelegation": "false"
                    },
                    {
                      "acteurRef": "PA721876",
                      "mandatRef": "PM733719",
                      "parDelegation": "false"
                    }
                  ]
                }
              }
            }
          },
          {
            "organeRef": "PO730934",
            "nombreMembresGroupe": "104",
            "vote": {
              "positionMajoritaire": "contre",
              "decompteVoix": {
                "pour": "0",
                "contre": "2",
                "nonVotants": "0",
                "abstentions": "0",
                "nonVotantsVolontaires": "0"
              },
              "decompteNominatif": {
                "nonVotants": null,
                "abstentions": null,
                "pours": null,
                "contres": {
                  "votant": [
                    {
                      "acteurRef": "PA267204",
                      "mandatRef": "PM722794",
                      "parDelegation": "false"
                    },
                    {
                      "acteurRef": "PA721410",
                      "mandatRef": "PM723266",
                      "parDelegation": "false"
                    }
                  ]
                }
              }
            }
          },
          {
            "organeRef": "PO730970",
            "nombreMembresGroupe": "46",
            "vote": {
              "positionMajoritaire": "contre",
              "decompteVoix": {
                "pour": "1",
                "contre": "2",
                "nonVotants": "0",
                "abstentions": "0",
                "nonVotantsVolontaires": "0"
              },
              "decompteNominatif": {
                "nonVotants": null,
                "abstentions": null,
                "pours": {
                  "votant": {
                    "acteurRef": "PA722284",
                    "mandatRef": "PM723528",
                    "parDelegation": "false"
                  }
                },
                "contres": {
                  "votant": [
                    {
                      "acteurRef": "PA720652",
                      "mandatRef": "PM723028",
                      "parDelegation": "false"
                    },
                    {
                      "acteurRef": "PA721976",
                      "mandatRef": "PM723438",
                      "parDelegation": "false"
                    }
                  ]
                }
              }
            }
          },
          {
            "organeRef": "PO758835",
            "nombreMembresGroupe": "29",
            "vote": {
              "positionMajoritaire": "pour",
              "decompteVoix": {
                "pour": "2",
                "contre": "0",
                "nonVotants": "0",
                "abstentions": "0",
                "nonVotantsVolontaires": "0"
              },
              "decompteNominatif": {
                "nonVotants": null,
                "abstentions": null,
                "pours": {
                  "votant": [
                    {
                      "acteurRef": "PA267233",
                      "mandatRef": "PM723500",
                      "parDelegation": "false"
                    },
                    {
                      "acteurRef": "PA607553",
                      "mandatRef": "PM722956",
                      "parDelegation": "false"
                    }
                  ]
                },
                "contres": null
              }
            }
          },
          {
            "organeRef": "PO765636",
            "nombreMembresGroupe": "28",
            "vote": {
              "positionMajoritaire": "pour",
              "decompteVoix": {
                "pour": "1",
                "contre": "0",
                "nonVotants": "0",
                "abstentions": "0",
                "nonVotantsVolontaires": "0"
              },
              "decompteNominatif": {
                "nonVotants": null,
                "abstentions": null,
                "pours": {
                  "votant": {
                    "acteurRef": "PA719806",
                    "mandatRef": "PM722768",
                    "parDelegation": "false"
                  }
                },
                "contres": null
              }
            }
          },
          {
            "organeRef": "PO759900",
            "nombreMembresGroupe": "18",
            "vote": {
              "positionMajoritaire": "pour",
              "decompteVoix": {
                "pour": "1",
                "contre": "0",
                "nonVotants": "0",
                "abstentions": "0",
                "nonVotantsVolontaires": "0"
              },
              "decompteNominatif": {
                "nonVotants": null,
                "abstentions": null,
                "pours": {
                  "votant": {
                    "acteurRef": "PA605518",
                    "mandatRef": "PM722518",
                    "parDelegation": "false"
                  }
                },
                "contres": null
              }
            }
          },
          {
            "organeRef": "PO730958",
            "nombreMembresGroupe": "17",
            "vote": {
              "positionMajoritaire": "pour",
              "decompteVoix": {
                "pour": "0",
                "contre": "0",
                "nonVotants": "0",
                "abstentions": "0",
                "nonVotantsVolontaires": "0"
              },
              "decompteNominatif": {
                "nonVotants": null,
                "abstentions": null,
                "pours": null,
                "contres": null
              }
            }
          },
          {
            "organeRef": "PO730940",
            "nombreMembresGroupe": "16",
            "vote": {
              "positionMajoritaire": "pour",
              "decompteVoix": {
                "pour": "2",
                "contre": "0",
                "nonVotants": "0",
                "abstentions": "0",
                "nonVotantsVolontaires": "0"
              },
              "decompteNominatif": {
                "nonVotants": null,
                "abstentions": null,
                "pours": {
                  "votant": [
                    {
                      "acteurRef": "PA610654",
                      "mandatRef": "PM723142",
                      "parDelegation": "false"
                    },
                    {
                      "acteurRef": "PA335612",
                      "mandatRef": "PM723506",
                      "parDelegation": "false"
                    }
                  ]
                },
                "contres": null
              }
            }
          },
          {
            "organeRef": "PO723569",
            "nombreMembresGroupe": "14",
            "vote": {
              "positionMajoritaire": "abstention",
              "decompteVoix": {
                "pour": "0",
                "contre": "0",
                "nonVotants": "0",
                "abstentions": "1",
                "nonVotantsVolontaires": "1"
              },
              "decompteNominatif": {
                "nonVotants": null,
                "abstentions": {
                  "votant": {
                    "acteurRef": "PA719608",
                    "mandatRef": "PM722710",
                    "parDelegation": "false"
                  }
                },
                "pours": null,
                "contres": null
              }
            }
          }
        ]
      }
    }
  },
  "miseAuPoint": null,
  "@xmlns": "http://schemas.assemblee-nationale.fr/referentiel"
}