{
  "@xmlns:xsi": "http://www.w3.org/2001/XMLSchema-instance",
  "uid": "VTANR5L15V239",
  "numero": "239",
  "organeRef": "PO717460",
  "legislature": "15",
  "sessionRef": "SCR5A2018O1",
  "seanceRef": "RUANR5L15S2018IDS20752",
  "dateScrutin": "2017-11-09T01:00:00.000+01:00",
  "quantiemeJourSeance": "2",
  "typeVote": {
    "codeTypeVote": "SPO",
    "libelleTypeVote": "scrutin public ordinaire",
    "typeMajorite": "majorité absolue des suffrages exprimés"
  },
  "sort": {
    "code": "rejeté",
    "libelle": "L'Assemblée nationale n'a pas adopté"
  },
  "titre": "l'amendement n? 636 de M. Coquerel apres l'article 54 de la seconde partie du projet de loi de finances pour 2018 (premiere lecture) - Mission Ecologie, developpement et mobilites durables",
  "demandeur": {
    "texte": "President du groupe \"La France insoumise\"",
    "referenceLegislative": null
  },
  "objet": {
    "libelle": "l'amendement n? 636 de M. Coquerel apres l'article 54 de la seconde partie du projet de loi de finances pour 2018 (premiere lecture) - Mission Ecologie, developpement et mobilites durables",
    "referenceLegislative": null
  },
  "modePublicationDesVotes": "DecompteNominatif",
  "syntheseVote": {
    "nombreVotants": "52",
    "suffragesExprimes": "50",
    "nbrSuffragesRequis": "26",
    "annonce": "L'Assemblée nationale n'a pas adopté",
    "decompte": {
      "pour": "10",
      "contre": "40",
      "abstentions": "2",
      "nonVotants": "2",
      "nonVotantsVolontaires": "0"
    }
  },
  "ventilationVotes": {
    "organe": {
      "organeRef": "PO717460",
      "groupes": {
        "groupe": [
          {
            "organeRef": "PO730964",
            "nombreMembresGroupe": "313",
            "vote": {
              "positionMajoritaire": "contre",
              "decompteVoix": {
                "pour": "1",
                "contre": "35",
                "nonVotants": "2",
                "abstentions": "2",
                "nonVotantsVolontaires": "2"
              },
              "decompteNominatif": {
                "nonVotants": {
                  "votant": [
                    {
                      "acteurRef": "PA332747",
                      "mandatRef": "PM722798",
                      "causePositionVote": "PAN"
                    },
                    {
                      "acteurRef": "PA720622",
                      "mandatRef": "PM723018",
                      "causePositionVote": "PSE"
                    }
                  ]
                },
                "abstentions": {
                  "votant": [
                    {
                      "acteurRef": "PA720278",
                      "mandatRef": "PM722916",
                      "parDelegation": "false"
                    },
                    {
                      "acteurRef": "PA720944",
                      "mandatRef": "PM723120",
                      "parDelegation": "false"
                    }
                  ]
                },
                "pours": {
                  "votant": {
                    "acteurRef": "PA722344",
                    "mandatRef": "PM723546",
                    "parDelegation": "false"
                  }
                },
                "contres": {
                  "votant": [
                    {
                      "acteurRef": "PA721262",
                      "mandatRef": "PM723218",
                      "parDelegation": "false"
                    },
                    {
                      "acteurRef": "PA643127",
                      "mandatRef": "PM722636",
                      "parDelegation": "false"
                    },
                    {
                      "acteurRef": "PA719520",
                      "mandatRef": "PM722684",
                      "parDelegation": "false"
                    },
                    {
                      "acteurRef": "PA720492",
                      "mandatRef": "PM722980",
                      "parDelegation": "false"
                    },
                    {
                      "acteurRef": "PA718802",
                      "mandatRef": "PM722462",
                      "parDelegation": "false"
                    },
                    {
                      "acteurRef": "PA719092",
                      "mandatRef": "PM722560",
                      "parDelegation": "false"
                    },
                    {
                      "acteurRef": "PA719194",
                      "mandatRef": "PM722590",
                      "parDelegation": "false"
                    },
                    {
                      "acteurRef": "PA719496",
                      "mandatRef": "PM722678",
                      "parDelegation": "false"
                    },
                    {
                      "acteurRef": "PA719550",
                      "mandatRef": "PM722694",
                      "parDelegation": "false"
                    },
                    {
                      "acteurRef": "PA719592",
                      "mandatRef": "PM722706",
                      "parDelegation": "false"
                    },
                    {
                      "acteurRef": "PA719600",
                      "mandatRef": "PM722708",
                      "parDelegation": "false"
                    },
                    {
                      "acteurRef": "PA719740",
                      "mandatRef": "PM722748",
                      "parDelegation": "false"
                    },
                    {
                      "acteurRef": "PA719756",
                      "mandatRef": "PM722752",
                      "parDelegation": "false"
                    },
                    {
                      "acteurRef": "PA719798",
                      "mandatRef": "PM722766",
                      "parDelegation": "false"
                    },
                    {
                      "acteurRef": "PA719858",
                      "mandatRef": "PM722782",
                      "parDelegation": "false"
                    },
                    {
                      "acteurRef": "PA719980",
                      "mandatRef": "PM722822",
                      "parDelegation": "false"
                    },
                    {
                      "acteurRef": "PA719994",
                      "mandatRef": "PM722828",
                      "parDelegation": "false"
                    },
                    {
                      "acteurRef": "PA720222",
                      "mandatRef": "PM722896",
                      "parDelegation": "false"
                    },
                    {
                      "acteurRef": "PA720362",
                      "mandatRef": "PM722942",
                      "parDelegation": "false"
                    },
                    {
                      "acteurRef": "PA720378",
                      "mandatRef": "PM722946",
                      "parDelegation": "false"
                    },
                    {
                      "acteurRef": "PA720402",
                      "mandatRef": "PM722952",
                      "parDelegation": "false"
                    },
                    {
                      "acteurRef": "PA720520",
                      "mandatRef": "PM722988",
                      "parDelegation": "false"
                    },
                    {
                      "acteurRef": "PA720538",
                      "mandatRef": "PM722994",
                      "parDelegation": "false"
                    },
                    {
                      "acteurRef": "PA720560",
                      "mandatRef": "PM723000",
                      "parDelegation": "false"
                    },
                    {
                      "acteurRef": "PA720932",
                      "mandatRef": "PM723116",
                      "parDelegation": "false"
                    },
                    {
                      "acteurRef": "PA721328",
                      "mandatRef": "PM723240",
                      "parDelegation": "false"
                    },
                    {
                      "acteurRef": "PA721372",
                      "mandatRef": "PM723252",
                      "parDelegation": "false"
                    },
                    {
                      "acteurRef": "PA721584",
                      "mandatRef": "PM723324",
                      "parDelegation": "false"
                    },
                    {
                      "acteurRef": "PA721644",
                      "mandatRef": "PM723342",
                      "parDelegation": "false"
                    },
                    {
                      "acteurRef": "PA721916",
                      "mandatRef": "PM723420",
                      "parDelegation": "false"
                    },
                    {
                      "acteurRef": "PA722008",
                      "mandatRef": "PM723446",
                      "parDelegation": "false"
                    },
                    {
                      "acteurRef": "PA722070",
                      "mandatRef": "PM723464",
                      "parDelegation": "false"
                    },
                    {
                      "acteurRef": "PA722228",
                      "mandatRef": "PM723512",
                      "parDelegation": "false"
                    },
                    {
                      "acteurRef": "PA722236",
                      "mandatRef": "PM723514",
                      "parDelegation": "false"
                    },
                    {
                      "acteurRef": "PA722336",
                      "mandatRef": "PM723544",
                      "parDelegation": "false"
                    }
                  ]
                }
              }
            }
          },
          {
            "organeRef": "PO730934",
            "nombreMembresGroupe": "100",
            "vote": {
              "positionMajoritaire": "pour",
              "decompteVoix": {
                "pour": "4",
                "contre": "0",
                "nonVotants": "0",
                "abstentions": "0",
                "nonVotantsVolontaires": "0"
              },
              "decompteNominatif": {
                "nonVotants": null,
                "abstentions": null,
                "pours": {
                  "votant": [
                    {
                      "acteurRef": "PA267527",
                      "mandatRef": "PM723274",
                      "parDelegation": "false"
                    },
                    {
                      "acteurRef": "PA721410",
                      "mandatRef": "PM723266",
                      "parDelegation": "false"
                    },
                    {
                      "acteurRef": "PA609726",
                      "mandatRef": "PM723426",
                      "parDelegation": "false"
                    },
                    {
                      "acteurRef": "PA720100",
                      "mandatRef": "PM722860",
                      "parDelegation": "false"
                    }
                  ]
                },
                "contres": null
              }
            }
          },
          {
            "organeRef": "PO730970",
            "nombreMembresGroupe": "47",
            "vote": {
              "positionMajoritaire": "contre",
              "decompteVoix": {
                "pour": "0",
                "contre": "4",
                "nonVotants": "0",
                "abstentions": "0",
                "nonVotantsVolontaires": "0"
              },
              "decompteNominatif": {
                "nonVotants": null,
                "abstentions": null,
                "pours": null,
                "contres": {
                  "votant": [
                    {
                      "acteurRef": "PA720334",
                      "mandatRef": "PM722932",
                      "parDelegation": "false"
                    },
                    {
                      "acteurRef": "PA720764",
                      "mandatRef": "PM723070",
                      "parDelegation": "false"
                    },
                    {
                      "acteurRef": "PA721530",
                      "mandatRef": "PM723302",
                      "parDelegation": "false"
                    },
                    {
                      "acteurRef": "PA722284",
                      "mandatRef": "PM723528",
                      "parDelegation": "false"
                    }
                  ]
                }
              }
            }
          },
          {
            "organeRef": "PO730952",
            "nombreMembresGroupe": "35",
            "vote": {
              "positionMajoritaire": "contre",
              "decompteVoix": {
                "pour": "0",
                "contre": "1",
                "nonVotants": "0",
                "abstentions": "0",
                "nonVotantsVolontaires": "0"
              },
              "decompteNominatif": {
                "nonVotants": null,
                "abstentions": null,
                "pours": null,
                "contres": {
                  "votant": {
                    "acteurRef": "PA333421",
                    "mandatRef": "PM722920",
                    "parDelegation": "false"
                  }
                }
              }
            }
          },
          {
            "organeRef": "PO730946",
            "nombreMembresGroupe": "31",
            "vote": {
              "positionMajoritaire": "pour",
              "decompteVoix": {
                "pour": "0",
                "contre": "0",
                "nonVotants": "0",
                "abstentions": "0",
                "nonVotantsVolontaires": "0"
              },
              "decompteNominatif": {
                "nonVotants": null,
                "abstentions": null,
                "pours": null,
                "contres": null
              }
            }
          },
          {
            "organeRef": "PO723569",
            "nombreMembresGroupe": "18",
            "vote": {
              "positionMajoritaire": "pour",
              "decompteVoix": {
                "pour": "0",
                "contre": "0",
                "nonVotants": "0",
                "abstentions": "0",
                "nonVotantsVolontaires": "0"
              },
              "decompteNominatif": {
                "nonVotants": null,
                "abstentions": null,
                "pours": null,
                "contres": null
              }
            }
          },
          {
            "organeRef": "PO730958",
            "nombreMembresGroupe": "17",
            "vote": {
              "positionMajoritaire": "pour",
              "decompteVoix": {
                "pour": "5",
                "contre": "0",
                "nonVotants": "0",
                "abstentions": "0",
                "nonVotantsVolontaires": "0"
              },
              "decompteNominatif": {
                "nonVotants": null,
                "abstentions": null,
                "pours": {
                  "votant": [
                    {
                      "acteurRef": "PA718868",
                      "mandatRef": "PM722484",
                      "parDelegation": "false"
                    },
                    {
                      "acteurRef": "PA719578",
                      "mandatRef": "PM722702",
                      "parDelegation": "false"
                    },
                    {
                      "acteurRef": "PA720286",
                      "mandatRef": "PM722918",
                      "parDelegation": "false"
                    },
                    {
                      "acteurRef": "PA720892",
                      "mandatRef": "PM723106",
                      "parDelegation": "false"
                    },
                    {
                      "acteurRef": "PA721202",
                      "mandatRef": "PM723202",
                      "parDelegation": "false"
                    }
                  ]
                },
                "contres": null
              }
            }
          },
          {
            "organeRef": "PO730940",
            "nombreMembresGroupe": "16",
            "vote": {
              "positionMajoritaire": "pour",
              "decompteVoix": {
                "pour": "0",
                "contre": "0",
                "nonVotants": "0",
                "abstentions": "0",
                "nonVotantsVolontaires": "0"
              },
              "decompteNominatif": {
                "nonVotants": null,
                "abstentions": null,
                "pours": null,
                "contres": null
              }
            }
          }
        ]
      }
    }
  },
  "miseAuPoint": null,
  "@xmlns": "http://schemas.assemblee-nationale.fr/referentiel"
}