{
  "@xmlns:xsi": "http://www.w3.org/2001/XMLSchema-instance",
  "uid": "VTANR5L15V860",
  "numero": "860",
  "organeRef": "PO717460",
  "legislature": "15",
  "sessionRef": "SCR5A2018O1",
  "seanceRef": "RUANR5L15S2018IDS21139",
  "dateScrutin": "2018-06-08T02:00:00.000+02:00",
  "quantiemeJourSeance": "3",
  "typeVote": {
    "codeTypeVote": "SPO",
    "libelleTypeVote": "scrutin public ordinaire",
    "typeMajorite": "majorité absolue des suffrages exprimés"
  },
  "sort": {
    "code": "rejeté",
    "libelle": "L'Assemblée nationale n'a pas adopté"
  },
  "titre": "l'amendement n° 1713 de M. Chassaigne après l'article 57 du projet de loi portant évolution du logement, de l'aménagement et du numérique (première lecture)",
  "demandeur": {
    "texte": "Présidente du groupe \"Nouvelle Gauche\"",
    "referenceLegislative": null
  },
  "objet": {
    "libelle": "l'amendement n° 1713 de M. Chassaigne après l'article 57 du projet de loi portant évolution du logement, de l'aménagement et du numérique (première lecture)",
    "referenceLegislative": null
  },
  "modePublicationDesVotes": "DecompteNominatif",
  "syntheseVote": {
    "nombreVotants": "49",
    "suffragesExprimes": "47",
    "nbrSuffragesRequis": "24",
    "annonce": "L'Assemblée nationale n'a pas adopté",
    "decompte": {
      "pour": "7",
      "contre": "40",
      "abstentions": "2",
      "nonVotants": "2",
      "nonVotantsVolontaires": "0"
    }
  },
  "ventilationVotes": {
    "organe": {
      "organeRef": "PO717460",
      "groupes": {
        "groupe": [
          {
            "organeRef": "PO730964",
            "nombreMembresGroupe": "313",
            "vote": {
              "positionMajoritaire": "contre",
              "decompteVoix": {
                "pour": "0",
                "contre": "34",
                "nonVotants": "1",
                "abstentions": "0",
                "nonVotantsVolontaires": "0"
              },
              "decompteNominatif": {
                "nonVotants": {
                  "votant": {
                    "acteurRef": "PA332747",
                    "mandatRef": "PM722798",
                    "causePositionVote": "PAN"
                  }
                },
                "abstentions": null,
                "pours": null,
                "contres": {
                  "votant": [
                    {
                      "acteurRef": "PA721262",
                      "mandatRef": "PM723218",
                      "parDelegation": "false"
                    },
                    {
                      "acteurRef": "PA722398",
                      "mandatRef": "PM723562",
                      "parDelegation": "false"
                    },
                    {
                      "acteurRef": "PA643127",
                      "mandatRef": "PM722636",
                      "parDelegation": "false"
                    },
                    {
                      "acteurRef": "PA719668",
                      "mandatRef": "PM722726",
                      "parDelegation": "false"
                    },
                    {
                      "acteurRef": "PA606202",
                      "mandatRef": "PM722698",
                      "parDelegation": "false"
                    },
                    {
                      "acteurRef": "PA721296",
                      "mandatRef": "PM723228",
                      "parDelegation": "false"
                    },
                    {
                      "acteurRef": "PA719520",
                      "mandatRef": "PM722684",
                      "parDelegation": "false"
                    },
                    {
                      "acteurRef": "PA718918",
                      "mandatRef": "PM722500",
                      "parDelegation": "false"
                    },
                    {
                      "acteurRef": "PA719080",
                      "mandatRef": "PM722554",
                      "parDelegation": "false"
                    },
                    {
                      "acteurRef": "PA719294",
                      "mandatRef": "PM722618",
                      "parDelegation": "false"
                    },
                    {
                      "acteurRef": "PA719338",
                      "mandatRef": "PM722630",
                      "parDelegation": "false"
                    },
                    {
                      "acteurRef": "PA719660",
                      "mandatRef": "PM722724",
                      "parDelegation": "false"
                    },
                    {
                      "acteurRef": "PA719740",
                      "mandatRef": "PM722748",
                      "parDelegation": "false"
                    },
                    {
                      "acteurRef": "PA719830",
                      "mandatRef": "PM722774",
                      "parDelegation": "false"
                    },
                    {
                      "acteurRef": "PA719858",
                      "mandatRef": "PM722782",
                      "parDelegation": "false"
                    },
                    {
                      "acteurRef": "PA719866",
                      "mandatRef": "PM722784",
                      "parDelegation": "false"
                    },
                    {
                      "acteurRef": "PA720378",
                      "mandatRef": "PM722946",
                      "parDelegation": "false"
                    },
                    {
                      "acteurRef": "PA720414",
                      "mandatRef": "PM722958",
                      "parDelegation": "false"
                    },
                    {
                      "acteurRef": "PA720590",
                      "mandatRef": "PM723010",
                      "parDelegation": "false"
                    },
                    {
                      "acteurRef": "PA720806",
                      "mandatRef": "PM723082",
                      "parDelegation": "false"
                    },
                    {
                      "acteurRef": "PA720870",
                      "mandatRef": "PM723100",
                      "parDelegation": "false"
                    },
                    {
                      "acteurRef": "PA720900",
                      "mandatRef": "PM723108",
                      "parDelegation": "false"
                    },
                    {
                      "acteurRef": "PA720932",
                      "mandatRef": "PM723116",
                      "parDelegation": "false"
                    },
                    {
                      "acteurRef": "PA721194",
                      "mandatRef": "PM723200",
                      "parDelegation": "false"
                    },
                    {
                      "acteurRef": "PA721278",
                      "mandatRef": "PM723222",
                      "parDelegation": "false"
                    },
                    {
                      "acteurRef": "PA721458",
                      "mandatRef": "PM723280",
                      "parDelegation": "false"
                    },
                    {
                      "acteurRef": "PA721466",
                      "mandatRef": "PM723284",
                      "parDelegation": "false"
                    },
                    {
                      "acteurRef": "PA721702",
                      "mandatRef": "PM723360",
                      "parDelegation": "false"
                    },
                    {
                      "acteurRef": "PA721750",
                      "mandatRef": "PM723372",
                      "parDelegation": "false"
                    },
                    {
                      "acteurRef": "PA722094",
                      "mandatRef": "PM723470",
                      "parDelegation": "false"
                    },
                    {
                      "acteurRef": "PA722170",
                      "mandatRef": "PM723492",
                      "parDelegation": "false"
                    },
                    {
                      "acteurRef": "PA722336",
                      "mandatRef": "PM723544",
                      "parDelegation": "false"
                    },
                    {
                      "acteurRef": "PA642695",
                      "mandatRef": "PM722602",
                      "parDelegation": "false"
                    },
                    {
                      "acteurRef": "PA721564",
                      "mandatRef": "PM733723",
                      "parDelegation": "false"
                    }
                  ]
                }
              }
            }
          },
          {
            "organeRef": "PO730934",
            "nombreMembresGroupe": "102",
            "vote": {
              "positionMajoritaire": "abstention",
              "decompteVoix": {
                "pour": "1",
                "contre": "0",
                "nonVotants": "0",
                "abstentions": "2",
                "nonVotantsVolontaires": "2"
              },
              "decompteNominatif": {
                "nonVotants": null,
                "abstentions": {
                  "votant": [
                    {
                      "acteurRef": "PA334654",
                      "mandatRef": "PM723566",
                      "parDelegation": "false"
                    },
                    {
                      "acteurRef": "PA642847",
                      "mandatRef": "PM722954",
                      "parDelegation": "false"
                    }
                  ]
                },
                "pours": {
                  "votant": {
                    "acteurRef": "PA721286",
                    "mandatRef": "PM723224",
                    "parDelegation": "false"
                  }
                },
                "contres": null
              }
            }
          },
          {
            "organeRef": "PO730970",
            "nombreMembresGroupe": "47",
            "vote": {
              "positionMajoritaire": "contre",
              "decompteVoix": {
                "pour": "0",
                "contre": "4",
                "nonVotants": "1",
                "abstentions": "0",
                "nonVotantsVolontaires": "0"
              },
              "decompteNominatif": {
                "nonVotants": {
                  "votant": {
                    "acteurRef": "PA720746",
                    "mandatRef": "PM723064",
                    "causePositionVote": "PSE"
                  }
                },
                "abstentions": null,
                "pours": null,
                "contres": {
                  "votant": [
                    {
                      "acteurRef": "PA719640",
                      "mandatRef": "PM722718",
                      "parDelegation": "false"
                    },
                    {
                      "acteurRef": "PA720092",
                      "mandatRef": "PM722858",
                      "parDelegation": "false"
                    },
                    {
                      "acteurRef": "PA720924",
                      "mandatRef": "PM723114",
                      "parDelegation": "false"
                    },
                    {
                      "acteurRef": "PA721742",
                      "mandatRef": "PM723370",
                      "parDelegation": "false"
                    }
                  ]
                }
              }
            }
          },
          {
            "organeRef": "PO744425",
            "nombreMembresGroupe": "32",
            "vote": {
              "positionMajoritaire": "contre",
              "decompteVoix": {
                "pour": "0",
                "contre": "2",
                "nonVotants": "0",
                "abstentions": "0",
                "nonVotantsVolontaires": "0"
              },
              "decompteNominatif": {
                "nonVotants": null,
                "abstentions": null,
                "pours": null,
                "contres": {
                  "votant": [
                    {
                      "acteurRef": "PA331567",
                      "mandatRef": "PM722644",
                      "parDelegation": "false"
                    },
                    {
                      "acteurRef": "PA722030",
                      "mandatRef": "PM723454",
                      "parDelegation": "false"
                    }
                  ]
                }
              }
            }
          },
          {
            "organeRef": "PO730946",
            "nombreMembresGroupe": "30",
            "vote": {
              "positionMajoritaire": "pour",
              "decompteVoix": {
                "pour": "1",
                "contre": "0",
                "nonVotants": "0",
                "abstentions": "0",
                "nonVotantsVolontaires": "0"
              },
              "decompteNominatif": {
                "nonVotants": null,
                "abstentions": null,
                "pours": {
                  "votant": {
                    "acteurRef": "PA609590",
                    "mandatRef": "PM723326",
                    "parDelegation": "false"
                  }
                },
                "contres": null
              }
            }
          },
          {
            "organeRef": "PO723569",
            "nombreMembresGroupe": "20",
            "vote": {
              "positionMajoritaire": "pour",
              "decompteVoix": {
                "pour": "1",
                "contre": "0",
                "nonVotants": "0",
                "abstentions": "0",
                "nonVotantsVolontaires": "0"
              },
              "decompteNominatif": {
                "nonVotants": null,
                "abstentions": null,
                "pours": {
                  "votant": {
                    "acteurRef": "PA336175",
                    "mandatRef": "PM723328",
                    "parDelegation": "false"
                  }
                },
                "contres": null
              }
            }
          },
          {
            "organeRef": "PO730958",
            "nombreMembresGroupe": "17",
            "vote": {
              "positionMajoritaire": "pour",
              "decompteVoix": {
                "pour": "3",
                "contre": "0",
                "nonVotants": "0",
                "abstentions": "0",
                "nonVotantsVolontaires": "0"
              },
              "decompteNominatif": {
                "nonVotants": null,
                "abstentions": null,
                "pours": {
                  "votant": [
                    {
                      "acteurRef": "PA720892",
                      "mandatRef": "PM723106",
                      "parDelegation": "false"
                    },
                    {
                      "acteurRef": "PA721226",
                      "mandatRef": "PM723208",
                      "parDelegation": "false"
                    },
                    {
                      "acteurRef": "PA721960",
                      "mandatRef": "PM723434",
                      "parDelegation": "false"
                    }
                  ]
                },
                "contres": null
              }
            }
          },
          {
            "organeRef": "PO730940",
            "nombreMembresGroupe": "16",
            "vote": {
              "positionMajoritaire": "pour",
              "decompteVoix": {
                "pour": "1",
                "contre": "0",
                "nonVotants": "0",
                "abstentions": "0",
                "nonVotantsVolontaires": "0"
              },
              "decompteNominatif": {
                "nonVotants": null,
                "abstentions": null,
                "pours": {
                  "votant": {
                    "acteurRef": "PA721270",
                    "mandatRef": "PM723220",
                    "parDelegation": "false"
                  }
                },
                "contres": null
              }
            }
          }
        ]
      }
    }
  },
  "miseAuPoint": null,
  "@xmlns": "http://schemas.assemblee-nationale.fr/referentiel"
}