{
  "@xmlns:xsi": "http://www.w3.org/2001/XMLSchema-instance",
  "uid": "VTANR5L15V73",
  "numero": "73",
  "organeRef": "PO717460",
  "legislature": "15",
  "sessionRef": "SCR5A2017E1",
  "seanceRef": "RUANR5L15S2017IDS20630",
  "dateScrutin": "2017-07-26T02:00:00.000+02:00",
  "quantiemeJourSeance": "2",
  "typeVote": {
    "codeTypeVote": "SPO",
    "libelleTypeVote": "scrutin public ordinaire",
    "typeMajorite": "majorité absolue des suffrages exprimés"
  },
  "sort": {
    "code": "rejeté",
    "libelle": "L'Assemblée nationale n'a pas adopté"
  },
  "titre": "l'amendement n? 380 de Mme Untermaier et les amendements identiques suivants a l'article 2 quater du projet de loi pour la confiance dans la vie publique (premiere lecture).",
  "demandeur": {
    "texte": "President du groupe \"Nouvelle Gauche\"",
    "referenceLegislative": null
  },
  "objet": {
    "libelle": "l'amendement n? 380 de Mme Untermaier et les amendements identiques suivants a l'article 2 quater du projet de loi pour la confiance dans la vie publique (premiere lecture).",
    "referenceLegislative": null
  },
  "modePublicationDesVotes": "DecompteNominatif",
  "syntheseVote": {
    "nombreVotants": "163",
    "suffragesExprimes": "156",
    "nbrSuffragesRequis": "79",
    "annonce": "L'Assemblée nationale n'a pas adopté",
    "decompte": {
      "pour": "37",
      "contre": "119",
      "abstentions": "7",
      "nonVotants": "1",
      "nonVotantsVolontaires": "0"
    }
  },
  "ventilationVotes": {
    "organe": {
      "organeRef": "PO717460",
      "groupes": {
        "groupe": [
          {
            "organeRef": "PO730964",
            "nombreMembresGroupe": "314",
            "vote": {
              "positionMajoritaire": "contre",
              "decompteVoix": {
                "pour": "0",
                "contre": "95",
                "nonVotants": "1",
                "abstentions": "0",
                "nonVotantsVolontaires": "0"
              },
              "decompteNominatif": {
                "nonVotants": {
                  "votant": {
                    "acteurRef": "PA332747",
                    "mandatRef": "PM722798",
                    "causePositionVote": "PSE"
                  }
                },
                "abstentions": null,
                "pours": null,
                "contres": {
                  "votant": [
                    {
                      "acteurRef": "PA722398",
                      "mandatRef": "PM723562",
                      "parDelegation": "false"
                    },
                    {
                      "acteurRef": "PA643127",
                      "mandatRef": "PM722636",
                      "parDelegation": "false"
                    },
                    {
                      "acteurRef": "PA606171",
                      "mandatRef": "PM722632",
                      "parDelegation": "false"
                    },
                    {
                      "acteurRef": "PA609520",
                      "mandatRef": "PM723508",
                      "parDelegation": "false"
                    },
                    {
                      "acteurRef": "PA608083",
                      "mandatRef": "PM723038",
                      "parDelegation": "false"
                    },
                    {
                      "acteurRef": "PA721880",
                      "mandatRef": "PM723410",
                      "parDelegation": "false"
                    },
                    {
                      "acteurRef": "PA720492",
                      "mandatRef": "PM722980",
                      "parDelegation": "false"
                    },
                    {
                      "acteurRef": "PA718694",
                      "mandatRef": "PM722426",
                      "parDelegation": "false"
                    },
                    {
                      "acteurRef": "PA718728",
                      "mandatRef": "PM722438",
                      "parDelegation": "false"
                    },
                    {
                      "acteurRef": "PA718736",
                      "mandatRef": "PM722440",
                      "parDelegation": "false"
                    },
                    {
                      "acteurRef": "PA718756",
                      "mandatRef": "PM722446",
                      "parDelegation": "false"
                    },
                    {
                      "acteurRef": "PA718794",
                      "mandatRef": "PM722460",
                      "parDelegation": "false"
                    },
                    {
                      "acteurRef": "PA677483",
                      "mandatRef": "PM722466",
                      "parDelegation": "false"
                    },
                    {
                      "acteurRef": "PA718876",
                      "mandatRef": "PM722486",
                      "parDelegation": "false"
                    },
                    {
                      "acteurRef": "PA718918",
                      "mandatRef": "PM722500",
                      "parDelegation": "false"
                    },
                    {
                      "acteurRef": "PA719032",
                      "mandatRef": "PM722538",
                      "parDelegation": "false"
                    },
                    {
                      "acteurRef": "PA719154",
                      "mandatRef": "PM722578",
                      "parDelegation": "false"
                    },
                    {
                      "acteurRef": "PA719186",
                      "mandatRef": "PM722588",
                      "parDelegation": "false"
                    },
                    {
                      "acteurRef": "PA719230",
                      "mandatRef": "PM722600",
                      "parDelegation": "false"
                    },
                    {
                      "acteurRef": "PA719242",
                      "mandatRef": "PM722604",
                      "parDelegation": "false"
                    },
                    {
                      "acteurRef": "PA719250",
                      "mandatRef": "PM722606",
                      "parDelegation": "false"
                    },
                    {
                      "acteurRef": "PA719258",
                      "mandatRef": "PM722608",
                      "parDelegation": "false"
                    },
                    {
                      "acteurRef": "PA719294",
                      "mandatRef": "PM722618",
                      "parDelegation": "false"
                    },
                    {
                      "acteurRef": "PA719350",
                      "mandatRef": "PM722634",
                      "parDelegation": "false"
                    },
                    {
                      "acteurRef": "PA719372",
                      "mandatRef": "PM722640",
                      "parDelegation": "false"
                    },
                    {
                      "acteurRef": "PA719396",
                      "mandatRef": "PM722650",
                      "parDelegation": "false"
                    },
                    {
                      "acteurRef": "PA719412",
                      "mandatRef": "PM722654",
                      "parDelegation": "false"
                    },
                    {
                      "acteurRef": "PA719420",
                      "mandatRef": "PM722656",
                      "parDelegation": "false"
                    },
                    {
                      "acteurRef": "PA719448",
                      "mandatRef": "PM722666",
                      "parDelegation": "false"
                    },
                    {
                      "acteurRef": "PA719464",
                      "mandatRef": "PM722670",
                      "parDelegation": "false"
                    },
                    {
                      "acteurRef": "PA719472",
                      "mandatRef": "PM722672",
                      "parDelegation": "false"
                    },
                    {
                      "acteurRef": "PA719512",
                      "mandatRef": "PM722682",
                      "parDelegation": "false"
                    },
                    {
                      "acteurRef": "PA719550",
                      "mandatRef": "PM722694",
                      "parDelegation": "false"
                    },
                    {
                      "acteurRef": "PA719616",
                      "mandatRef": "PM722712",
                      "parDelegation": "false"
                    },
                    {
                      "acteurRef": "PA719624",
                      "mandatRef": "PM722714",
                      "parDelegation": "false"
                    },
                    {
                      "acteurRef": "PA719718",
                      "mandatRef": "PM722740",
                      "parDelegation": "false"
                    },
                    {
                      "acteurRef": "PA719728",
                      "mandatRef": "PM722744",
                      "parDelegation": "false"
                    },
                    {
                      "acteurRef": "PA719748",
                      "mandatRef": "PM722750",
                      "parDelegation": "false"
                    },
                    {
                      "acteurRef": "PA719756",
                      "mandatRef": "PM722752",
                      "parDelegation": "false"
                    },
                    {
                      "acteurRef": "PA719770",
                      "mandatRef": "PM722758",
                      "parDelegation": "false"
                    },
                    {
                      "acteurRef": "PA719842",
                      "mandatRef": "PM722778",
                      "parDelegation": "false"
                    },
                    {
                      "acteurRef": "PA719858",
                      "mandatRef": "PM722782",
                      "parDelegation": "false"
                    },
                    {
                      "acteurRef": "PA719866",
                      "mandatRef": "PM722784",
                      "parDelegation": "false"
                    },
                    {
                      "acteurRef": "PA719890",
                      "mandatRef": "PM722790",
                      "parDelegation": "false"
                    },
                    {
                      "acteurRef": "PA719922",
                      "mandatRef": "PM722802",
                      "parDelegation": "false"
                    },
                    {
                      "acteurRef": "PA719994",
                      "mandatRef": "PM722828",
                      "parDelegation": "false"
                    },
                    {
                      "acteurRef": "PA720014",
                      "mandatRef": "PM722834",
                      "parDelegation": "false"
                    },
                    {
                      "acteurRef": "PA720022",
                      "mandatRef": "PM722836",
                      "parDelegation": "false"
                    },
                    {
                      "acteurRef": "PA720030",
                      "mandatRef": "PM722838",
                      "parDelegation": "false"
                    },
                    {
                      "acteurRef": "PA720038",
                      "mandatRef": "PM722840",
                      "parDelegation": "false"
                    },
                    {
                      "acteurRef": "PA720074",
                      "mandatRef": "PM722850",
                      "parDelegation": "false"
                    },
                    {
                      "acteurRef": "PA720138",
                      "mandatRef": "PM722872",
                      "parDelegation": "false"
                    },
                    {
                      "acteurRef": "PA720154",
                      "mandatRef": "PM722876",
                      "parDelegation": "false"
                    },
                    {
                      "acteurRef": "PA720170",
                      "mandatRef": "PM722880",
                      "parDelegation": "false"
                    },
                    {
                      "acteurRef": "PA720222",
                      "mandatRef": "PM722896",
                      "parDelegation": "false"
                    },
                    {
                      "acteurRef": "PA720268",
                      "mandatRef": "PM722912",
                      "parDelegation": "false"
                    },
                    {
                      "acteurRef": "PA720278",
                      "mandatRef": "PM722916",
                      "parDelegation": "false"
                    },
                    {
                      "acteurRef": "PA720318",
                      "mandatRef": "PM722928",
                      "parDelegation": "false"
                    },
                    {
                      "acteurRef": "PA720342",
                      "mandatRef": "PM722934",
                      "parDelegation": "false"
                    },
                    {
                      "acteurRef": "PA720354",
                      "mandatRef": "PM722940",
                      "parDelegation": "false"
                    },
                    {
                      "acteurRef": "PA720370",
                      "mandatRef": "PM722944",
                      "parDelegation": "false"
                    },
                    {
                      "acteurRef": "PA720394",
                      "mandatRef": "PM722950",
                      "parDelegation": "false"
                    },
                    {
                      "acteurRef": "PA720446",
                      "mandatRef": "PM722966",
                      "parDelegation": "false"
                    },
                    {
                      "acteurRef": "PA720454",
                      "mandatRef": "PM722968",
                      "parDelegation": "false"
                    },
                    {
                      "acteurRef": "PA720480",
                      "mandatRef": "PM722976",
                      "parDelegation": "false"
                    },
                    {
                      "acteurRef": "PA720500",
                      "mandatRef": "PM722982",
                      "parDelegation": "false"
                    },
                    {
                      "acteurRef": "PA720512",
                      "mandatRef": "PM722986",
                      "parDelegation": "false"
                    },
                    {
                      "acteurRef": "PA720520",
                      "mandatRef": "PM722988",
                      "parDelegation": "false"
                    },
                    {
                      "acteurRef": "PA720568",
                      "mandatRef": "PM723002",
                      "parDelegation": "false"
                    },
                    {
                      "acteurRef": "PA720738",
                      "mandatRef": "PM723062",
                      "parDelegation": "false"
                    },
                    {
                      "acteurRef": "PA720830",
                      "mandatRef": "PM723088",
                      "parDelegation": "false"
                    },
                    {
                      "acteurRef": "PA720870",
                      "mandatRef": "PM723100",
                      "parDelegation": "false"
                    },
                    {
                      "acteurRef": "PA721246",
                      "mandatRef": "PM723214",
                      "parDelegation": "false"
                    },
                    {
                      "acteurRef": "PA721336",
                      "mandatRef": "PM723242",
                      "parDelegation": "false"
                    },
                    {
                      "acteurRef": "PA721384",
                      "mandatRef": "PM723256",
                      "parDelegation": "false"
                    },
                    {
                      "acteurRef": "PA721398",
                      "mandatRef": "PM723262",
                      "parDelegation": "false"
                    },
                    {
                      "acteurRef": "PA721426",
                      "mandatRef": "PM723270",
                      "parDelegation": "false"
                    },
                    {
                      "acteurRef": "PA721434",
                      "mandatRef": "PM723272",
                      "parDelegation": "false"
                    },
                    {
                      "acteurRef": "PA721450",
                      "mandatRef": "PM723278",
                      "parDelegation": "false"
                    },
                    {
                      "acteurRef": "PA721458",
                      "mandatRef": "PM723280",
                      "parDelegation": "false"
                    },
                    {
                      "acteurRef": "PA721584",
                      "mandatRef": "PM723324",
                      "parDelegation": "false"
                    },
                    {
                      "acteurRef": "PA721624",
                      "mandatRef": "PM723336",
                      "parDelegation": "false"
                    },
                    {
                      "acteurRef": "PA721644",
                      "mandatRef": "PM723342",
                      "parDelegation": "false"
                    },
                    {
                      "acteurRef": "PA721710",
                      "mandatRef": "PM723362",
                      "parDelegation": "false"
                    },
                    {
                      "acteurRef": "PA721800",
                      "mandatRef": "PM723386",
                      "parDelegation": "false"
                    },
                    {
                      "acteurRef": "PA721808",
                      "mandatRef": "PM723388",
                      "parDelegation": "false"
                    },
                    {
                      "acteurRef": "PA721908",
                      "mandatRef": "PM723418",
                      "parDelegation": "false"
                    },
                    {
                      "acteurRef": "PA722038",
                      "mandatRef": "PM723456",
                      "parDelegation": "false"
                    },
                    {
                      "acteurRef": "PA722086",
                      "mandatRef": "PM723468",
                      "parDelegation": "false"
                    },
                    {
                      "acteurRef": "PA722228",
                      "mandatRef": "PM723512",
                      "parDelegation": "false"
                    },
                    {
                      "acteurRef": "PA722300",
                      "mandatRef": "PM723532",
                      "parDelegation": "false"
                    },
                    {
                      "acteurRef": "PA722336",
                      "mandatRef": "PM723544",
                      "parDelegation": "false"
                    },
                    {
                      "acteurRef": "PA643205",
                      "mandatRef": "PM723358",
                      "parDelegation": "false"
                    },
                    {
                      "acteurRef": "PA642695",
                      "mandatRef": "PM722602",
                      "parDelegation": "false"
                    },
                    {
                      "acteurRef": "PA721564",
                      "mandatRef": "PM733723",
                      "parDelegation": "false"
                    }
                  ]
                }
              }
            }
          },
          {
            "organeRef": "PO730934",
            "nombreMembresGroupe": "100",
            "vote": {
              "positionMajoritaire": "pour",
              "decompteVoix": {
                "pour": "12",
                "contre": "11",
                "nonVotants": "0",
                "abstentions": "3",
                "nonVotantsVolontaires": "3"
              },
              "decompteNominatif": {
                "nonVotants": null,
                "abstentions": {
                  "votant": [
                    {
                      "acteurRef": "PA606712",
                      "mandatRef": "PM722756",
                      "parDelegation": "false"
                    },
                    {
                      "acteurRef": "PA721410",
                      "mandatRef": "PM723266",
                      "parDelegation": "false"
                    },
                    {
                      "acteurRef": "PA720386",
                      "mandatRef": "PM722948",
                      "parDelegation": "false"
                    }
                  ]
                },
                "pours": {
                  "votant": [
                    {
                      "acteurRef": "PA266808",
                      "mandatRef": "PM723264",
                      "parDelegation": "false"
                    },
                    {
                      "acteurRef": "PA718838",
                      "mandatRef": "PM722474",
                      "parDelegation": "false"
                    },
                    {
                      "acteurRef": "PA267735",
                      "mandatRef": "PM722852",
                      "parDelegation": "false"
                    },
                    {
                      "acteurRef": "PA609726",
                      "mandatRef": "PM723426",
                      "parDelegation": "false"
                    },
                    {
                      "acteurRef": "PA720684",
                      "mandatRef": "PM723040",
                      "parDelegation": "false"
                    },
                    {
                      "acteurRef": "PA718780",
                      "mandatRef": "PM722454",
                      "parDelegation": "false"
                    },
                    {
                      "acteurRef": "PA718784",
                      "mandatRef": "PM722456",
                      "parDelegation": "false"
                    },
                    {
                      "acteurRef": "PA720100",
                      "mandatRef": "PM722860",
                      "parDelegation": "false"
                    },
                    {
                      "acteurRef": "PA721286",
                      "mandatRef": "PM723224",
                      "parDelegation": "false"
                    },
                    {
                      "acteurRef": "PA721678",
                      "mandatRef": "PM723352",
                      "parDelegation": "false"
                    },
                    {
                      "acteurRef": "PA346054",
                      "mandatRef": "PM723510",
                      "parDelegation": "false"
                    },
                    {
                      "acteurRef": "PA721126",
                      "mandatRef": "PM723182",
                      "parDelegation": "false"
                    }
                  ]
                },
                "contres": {
                  "votant": [
                    {
                      "acteurRef": "PA1695",
                      "mandatRef": "PM723322",
                      "parDelegation": "false"
                    },
                    {
                      "acteurRef": "PA718850",
                      "mandatRef": "PM722478",
                      "parDelegation": "false"
                    },
                    {
                      "acteurRef": "PA608826",
                      "mandatRef": "PM723276",
                      "parDelegation": "false"
                    },
                    {
                      "acteurRef": "PA721636",
                      "mandatRef": "PM723340",
                      "parDelegation": "false"
                    },
                    {
                      "acteurRef": "PA605036",
                      "mandatRef": "PM722444",
                      "parDelegation": "false"
                    },
                    {
                      "acteurRef": "PA1012",
                      "mandatRef": "PM722418",
                      "parDelegation": "false"
                    },
                    {
                      "acteurRef": "PA605991",
                      "mandatRef": "PM722660",
                      "parDelegation": "false"
                    },
                    {
                      "acteurRef": "PA266774",
                      "mandatRef": "PM723526",
                      "parDelegation": "false"
                    },
                    {
                      "acteurRef": "PA719318",
                      "mandatRef": "PM722624",
                      "parDelegation": "false"
                    },
                    {
                      "acteurRef": "PA642847",
                      "mandatRef": "PM722954",
                      "parDelegation": "false"
                    },
                    {
                      "acteurRef": "PA709315",
                      "mandatRef": "PM722526",
                      "parDelegation": "false"
                    }
                  ]
                }
              }
            }
          },
          {
            "organeRef": "PO730970",
            "nombreMembresGroupe": "47",
            "vote": {
              "positionMajoritaire": "contre",
              "decompteVoix": {
                "pour": "0",
                "contre": "13",
                "nonVotants": "0",
                "abstentions": "0",
                "nonVotantsVolontaires": "0"
              },
              "decompteNominatif": {
                "nonVotants": null,
                "abstentions": null,
                "pours": null,
                "contres": {
                  "votant": [
                    {
                      "acteurRef": "PA719504",
                      "mandatRef": "PM722680",
                      "parDelegation": "false"
                    },
                    {
                      "acteurRef": "PA719558",
                      "mandatRef": "PM722696",
                      "parDelegation": "false"
                    },
                    {
                      "acteurRef": "PA719874",
                      "mandatRef": "PM722786",
                      "parDelegation": "false"
                    },
                    {
                      "acteurRef": "PA720002",
                      "mandatRef": "PM722830",
                      "parDelegation": "false"
                    },
                    {
                      "acteurRef": "PA720178",
                      "mandatRef": "PM722882",
                      "parDelegation": "false"
                    },
                    {
                      "acteurRef": "PA720256",
                      "mandatRef": "PM722908",
                      "parDelegation": "false"
                    },
                    {
                      "acteurRef": "PA720326",
                      "mandatRef": "PM722930",
                      "parDelegation": "false"
                    },
                    {
                      "acteurRef": "PA720334",
                      "mandatRef": "PM722932",
                      "parDelegation": "false"
                    },
                    {
                      "acteurRef": "PA720728",
                      "mandatRef": "PM723058",
                      "parDelegation": "false"
                    },
                    {
                      "acteurRef": "PA721182",
                      "mandatRef": "PM723196",
                      "parDelegation": "false"
                    },
                    {
                      "acteurRef": "PA721742",
                      "mandatRef": "PM723370",
                      "parDelegation": "false"
                    },
                    {
                      "acteurRef": "PA721924",
                      "mandatRef": "PM723422",
                      "parDelegation": "false"
                    },
                    {
                      "acteurRef": "PA721992",
                      "mandatRef": "PM723442",
                      "parDelegation": "false"
                    }
                  ]
                }
              }
            }
          },
          {
            "organeRef": "PO730952",
            "nombreMembresGroupe": "35",
            "vote": {
              "positionMajoritaire": "pour",
              "decompteVoix": {
                "pour": "6",
                "contre": "0",
                "nonVotants": "0",
                "abstentions": "0",
                "nonVotantsVolontaires": "0"
              },
              "decompteNominatif": {
                "nonVotants": null,
                "abstentions": null,
                "pours": {
                  "votant": [
                    {
                      "acteurRef": "PA266788",
                      "mandatRef": "PM722914",
                      "parDelegation": "false"
                    },
                    {
                      "acteurRef": "PA720230",
                      "mandatRef": "PM722898",
                      "parDelegation": "false"
                    },
                    {
                      "acteurRef": "PA642868",
                      "mandatRef": "PM722992",
                      "parDelegation": "false"
                    },
                    {
                      "acteurRef": "PA720696",
                      "mandatRef": "PM723044",
                      "parDelegation": "false"
                    },
                    {
                      "acteurRef": "PA721110",
                      "mandatRef": "PM723174",
                      "parDelegation": "false"
                    },
                    {
                      "acteurRef": "PA702052",
                      "mandatRef": "PM723172",
                      "parDelegation": "false"
                    }
                  ]
                },
                "contres": null
              }
            }
          },
          {
            "organeRef": "PO730946",
            "nombreMembresGroupe": "31",
            "vote": {
              "positionMajoritaire": "pour",
              "decompteVoix": {
                "pour": "7",
                "contre": "0",
                "nonVotants": "0",
                "abstentions": "0",
                "nonVotantsVolontaires": "0"
              },
              "decompteNominatif": {
                "nonVotants": null,
                "abstentions": null,
                "pours": {
                  "votant": [
                    {
                      "acteurRef": "PA1198",
                      "mandatRef": "PM722532",
                      "parDelegation": "false"
                    },
                    {
                      "acteurRef": "PA333285",
                      "mandatRef": "PM722906",
                      "parDelegation": "false"
                    },
                    {
                      "acteurRef": "PA607553",
                      "mandatRef": "PM722956",
                      "parDelegation": "false"
                    },
                    {
                      "acteurRef": "PA608695",
                      "mandatRef": "PM723564",
                      "parDelegation": "false"
                    },
                    {
                      "acteurRef": "PA608011",
                      "mandatRef": "PM723022",
                      "parDelegation": "false"
                    },
                    {
                      "acteurRef": "PA719930",
                      "mandatRef": "PM722804",
                      "parDelegation": "false"
                    },
                    {
                      "acteurRef": "PA335999",
                      "mandatRef": "PM723480",
                      "parDelegation": "false"
                    }
                  ]
                },
                "contres": null
              }
            }
          },
          {
            "organeRef": "PO723569",
            "nombreMembresGroupe": "17",
            "vote": {
              "positionMajoritaire": "abstention",
              "decompteVoix": {
                "pour": "0",
                "contre": "0",
                "nonVotants": "0",
                "abstentions": "4",
                "nonVotantsVolontaires": "4"
              },
              "decompteNominatif": {
                "nonVotants": null,
                "abstentions": {
                  "votant": [
                    {
                      "acteurRef": "PA719608",
                      "mandatRef": "PM722710",
                      "parDelegation": "false"
                    },
                    {
                      "acteurRef": "PA720606",
                      "mandatRef": "PM723014",
                      "parDelegation": "false"
                    },
                    {
                      "acteurRef": "PA720664",
                      "mandatRef": "PM723032",
                      "parDelegation": "false"
                    },
                    {
                      "acteurRef": "PA720822",
                      "mandatRef": "PM723086",
                      "parDelegation": "false"
                    }
                  ]
                },
                "pours": null,
                "contres": null
              }
            }
          },
          {
            "organeRef": "PO730958",
            "nombreMembresGroupe": "17",
            "vote": {
              "positionMajoritaire": "pour",
              "decompteVoix": {
                "pour": "7",
                "contre": "0",
                "nonVotants": "0",
                "abstentions": "0",
                "nonVotantsVolontaires": "0"
              },
              "decompteNominatif": {
                "nonVotants": null,
                "abstentions": null,
                "pours": {
                  "votant": [
                    {
                      "acteurRef": "PA718868",
                      "mandatRef": "PM722484",
                      "parDelegation": "false"
                    },
                    {
                      "acteurRef": "PA719578",
                      "mandatRef": "PM722702",
                      "parDelegation": "false"
                    },
                    {
                      "acteurRef": "PA719676",
                      "mandatRef": "PM722728",
                      "parDelegation": "false"
                    },
                    {
                      "acteurRef": "PA720286",
                      "mandatRef": "PM722918",
                      "parDelegation": "false"
                    },
                    {
                      "acteurRef": "PA720846",
                      "mandatRef": "PM723094",
                      "parDelegation": "false"
                    },
                    {
                      "acteurRef": "PA721960",
                      "mandatRef": "PM723434",
                      "parDelegation": "false"
                    },
                    {
                      "acteurRef": "PA722142",
                      "mandatRef": "PM723484",
                      "parDelegation": "false"
                    }
                  ]
                },
                "contres": null
              }
            }
          },
          {
            "organeRef": "PO730940",
            "nombreMembresGroupe": "16",
            "vote": {
              "positionMajoritaire": "pour",
              "decompteVoix": {
                "pour": "5",
                "contre": "0",
                "nonVotants": "0",
                "abstentions": "0",
                "nonVotantsVolontaires": "0"
              },
              "decompteNominatif": {
                "nonVotants": null,
                "abstentions": null,
                "pours": {
                  "votant": [
                    {
                      "acteurRef": "PA267306",
                      "mandatRef": "PM723054",
                      "parDelegation": "false"
                    },
                    {
                      "acteurRef": "PA720692",
                      "mandatRef": "PM723042",
                      "parDelegation": "false"
                    },
                    {
                      "acteurRef": "PA718720",
                      "mandatRef": "PM722436",
                      "parDelegation": "false"
                    },
                    {
                      "acteurRef": "PA721270",
                      "mandatRef": "PM723220",
                      "parDelegation": "false"
                    },
                    {
                      "acteurRef": "PA721896",
                      "mandatRef": "PM723414",
                      "parDelegation": "false"
                    }
                  ]
                },
                "contres": null
              }
            }
          }
        ]
      }
    }
  },
  "miseAuPoint": null,
  "@xmlns": "http://schemas.assemblee-nationale.fr/referentiel"
}