{
  "@xmlns:xsi": "http://www.w3.org/2001/XMLSchema-instance",
  "uid": "VTANR5L15V224",
  "numero": "224",
  "organeRef": "PO717460",
  "legislature": "15",
  "sessionRef": "SCR5A2018O1",
  "seanceRef": "RUANR5L15S2018IDS20735",
  "dateScrutin": "2017-11-03T01:00:00.000+01:00",
  "quantiemeJourSeance": "2",
  "typeVote": {
    "codeTypeVote": "SPO",
    "libelleTypeVote": "scrutin public ordinaire",
    "typeMajorite": "majorité absolue des suffrages exprimés"
  },
  "sort": {
    "code": "rejeté",
    "libelle": "L'Assemblée nationale n'a pas adopté"
  },
  "titre": "l'amendement n? 473 de Mme Rabault a l'article 29 et Etat B de la seconde partie du projet de loi de finances pour 2018 (premiere lecture) - Mission securites",
  "demandeur": {
    "texte": "President du groupe \"Nouvelle Gauche\"",
    "referenceLegislative": null
  },
  "objet": {
    "libelle": "l'amendement n? 473 de Mme Rabault a l'article 29 et Etat B de la seconde partie du projet de loi de finances pour 2018 (premiere lecture) - Mission securites",
    "referenceLegislative": null
  },
  "modePublicationDesVotes": "DecompteNominatif",
  "syntheseVote": {
    "nombreVotants": "57",
    "suffragesExprimes": "57",
    "nbrSuffragesRequis": "29",
    "annonce": "L'Assemblée nationale n'a pas adopté",
    "decompte": {
      "pour": "10",
      "contre": "47",
      "abstentions": "0",
      "nonVotants": "2",
      "nonVotantsVolontaires": "0"
    }
  },
  "ventilationVotes": {
    "organe": {
      "organeRef": "PO717460",
      "groupes": {
        "groupe": [
          {
            "organeRef": "PO730964",
            "nombreMembresGroupe": "313",
            "vote": {
              "positionMajoritaire": "contre",
              "decompteVoix": {
                "pour": "0",
                "contre": "40",
                "nonVotants": "1",
                "abstentions": "0",
                "nonVotantsVolontaires": "0"
              },
              "decompteNominatif": {
                "nonVotants": {
                  "votant": {
                    "acteurRef": "PA332747",
                    "mandatRef": "PM722798",
                    "causePositionVote": "PAN"
                  }
                },
                "abstentions": null,
                "pours": null,
                "contres": {
                  "votant": [
                    {
                      "acteurRef": "PA722398",
                      "mandatRef": "PM723562",
                      "parDelegation": "false"
                    },
                    {
                      "acteurRef": "PA719952",
                      "mandatRef": "PM722814",
                      "parDelegation": "false"
                    },
                    {
                      "acteurRef": "PA720790",
                      "mandatRef": "PM723078",
                      "parDelegation": "false"
                    },
                    {
                      "acteurRef": "PA721880",
                      "mandatRef": "PM723410",
                      "parDelegation": "false"
                    },
                    {
                      "acteurRef": "PA722190",
                      "mandatRef": "PM723498",
                      "parDelegation": "false"
                    },
                    {
                      "acteurRef": "PA672",
                      "mandatRef": "PM723230",
                      "parDelegation": "false"
                    },
                    {
                      "acteurRef": "PA718756",
                      "mandatRef": "PM722446",
                      "parDelegation": "false"
                    },
                    {
                      "acteurRef": "PA719108",
                      "mandatRef": "PM722564",
                      "parDelegation": "false"
                    },
                    {
                      "acteurRef": "PA719130",
                      "mandatRef": "PM722572",
                      "parDelegation": "false"
                    },
                    {
                      "acteurRef": "PA719162",
                      "mandatRef": "PM722580",
                      "parDelegation": "false"
                    },
                    {
                      "acteurRef": "PA719230",
                      "mandatRef": "PM722600",
                      "parDelegation": "false"
                    },
                    {
                      "acteurRef": "PA719512",
                      "mandatRef": "PM722682",
                      "parDelegation": "false"
                    },
                    {
                      "acteurRef": "PA719550",
                      "mandatRef": "PM722694",
                      "parDelegation": "false"
                    },
                    {
                      "acteurRef": "PA719728",
                      "mandatRef": "PM722744",
                      "parDelegation": "false"
                    },
                    {
                      "acteurRef": "PA719842",
                      "mandatRef": "PM722778",
                      "parDelegation": "false"
                    },
                    {
                      "acteurRef": "PA719850",
                      "mandatRef": "PM722780",
                      "parDelegation": "false"
                    },
                    {
                      "acteurRef": "PA719972",
                      "mandatRef": "PM722820",
                      "parDelegation": "false"
                    },
                    {
                      "acteurRef": "PA719994",
                      "mandatRef": "PM722828",
                      "parDelegation": "false"
                    },
                    {
                      "acteurRef": "PA720022",
                      "mandatRef": "PM722836",
                      "parDelegation": "false"
                    },
                    {
                      "acteurRef": "PA720146",
                      "mandatRef": "PM722874",
                      "parDelegation": "false"
                    },
                    {
                      "acteurRef": "PA720298",
                      "mandatRef": "PM722922",
                      "parDelegation": "false"
                    },
                    {
                      "acteurRef": "PA720414",
                      "mandatRef": "PM722958",
                      "parDelegation": "false"
                    },
                    {
                      "acteurRef": "PA720552",
                      "mandatRef": "PM722998",
                      "parDelegation": "false"
                    },
                    {
                      "acteurRef": "PA720830",
                      "mandatRef": "PM723088",
                      "parDelegation": "false"
                    },
                    {
                      "acteurRef": "PA720908",
                      "mandatRef": "PM723110",
                      "parDelegation": "false"
                    },
                    {
                      "acteurRef": "PA720944",
                      "mandatRef": "PM723120",
                      "parDelegation": "false"
                    },
                    {
                      "acteurRef": "PA721194",
                      "mandatRef": "PM723200",
                      "parDelegation": "false"
                    },
                    {
                      "acteurRef": "PA721328",
                      "mandatRef": "PM723240",
                      "parDelegation": "false"
                    },
                    {
                      "acteurRef": "PA721466",
                      "mandatRef": "PM723284",
                      "parDelegation": "false"
                    },
                    {
                      "acteurRef": "PA721522",
                      "mandatRef": "PM723300",
                      "parDelegation": "false"
                    },
                    {
                      "acteurRef": "PA721670",
                      "mandatRef": "PM723350",
                      "parDelegation": "false"
                    },
                    {
                      "acteurRef": "PA721702",
                      "mandatRef": "PM723360",
                      "parDelegation": "false"
                    },
                    {
                      "acteurRef": "PA721776",
                      "mandatRef": "PM723380",
                      "parDelegation": "false"
                    },
                    {
                      "acteurRef": "PA721800",
                      "mandatRef": "PM723386",
                      "parDelegation": "false"
                    },
                    {
                      "acteurRef": "PA721808",
                      "mandatRef": "PM723388",
                      "parDelegation": "false"
                    },
                    {
                      "acteurRef": "PA722054",
                      "mandatRef": "PM723460",
                      "parDelegation": "false"
                    },
                    {
                      "acteurRef": "PA722078",
                      "mandatRef": "PM723466",
                      "parDelegation": "false"
                    },
                    {
                      "acteurRef": "PA722228",
                      "mandatRef": "PM723512",
                      "parDelegation": "false"
                    },
                    {
                      "acteurRef": "PA642695",
                      "mandatRef": "PM722602",
                      "parDelegation": "false"
                    },
                    {
                      "acteurRef": "PA719326",
                      "mandatRef": "PM733709",
                      "parDelegation": "false"
                    }
                  ]
                }
              }
            }
          },
          {
            "organeRef": "PO730934",
            "nombreMembresGroupe": "100",
            "vote": {
              "positionMajoritaire": "pour",
              "decompteVoix": {
                "pour": "4",
                "contre": "0",
                "nonVotants": "0",
                "abstentions": "0",
                "nonVotantsVolontaires": "0"
              },
              "decompteNominatif": {
                "nonVotants": null,
                "abstentions": null,
                "pours": {
                  "votant": [
                    {
                      "acteurRef": "PA330240",
                      "mandatRef": "PM722492",
                      "parDelegation": "false"
                    },
                    {
                      "acteurRef": "PA721816",
                      "mandatRef": "PM723390",
                      "parDelegation": "false"
                    },
                    {
                      "acteurRef": "PA718884",
                      "mandatRef": "PM722488",
                      "parDelegation": "false"
                    },
                    {
                      "acteurRef": "PA720100",
                      "mandatRef": "PM722860",
                      "parDelegation": "false"
                    }
                  ]
                },
                "contres": null
              }
            }
          },
          {
            "organeRef": "PO730970",
            "nombreMembresGroupe": "47",
            "vote": {
              "positionMajoritaire": "contre",
              "decompteVoix": {
                "pour": "0",
                "contre": "5",
                "nonVotants": "1",
                "abstentions": "0",
                "nonVotantsVolontaires": "0"
              },
              "decompteNominatif": {
                "nonVotants": {
                  "votant": {
                    "acteurRef": "PA720746",
                    "mandatRef": "PM723064",
                    "causePositionVote": "PSE"
                  }
                },
                "abstentions": null,
                "pours": null,
                "contres": {
                  "votant": [
                    {
                      "acteurRef": "PA721418",
                      "mandatRef": "PM723268",
                      "parDelegation": "false"
                    },
                    {
                      "acteurRef": "PA721734",
                      "mandatRef": "PM723368",
                      "parDelegation": "false"
                    },
                    {
                      "acteurRef": "PA719044",
                      "mandatRef": "PM722542",
                      "parDelegation": "false"
                    },
                    {
                      "acteurRef": "PA719558",
                      "mandatRef": "PM722696",
                      "parDelegation": "false"
                    },
                    {
                      "acteurRef": "PA721182",
                      "mandatRef": "PM723196",
                      "parDelegation": "false"
                    }
                  ]
                }
              }
            }
          },
          {
            "organeRef": "PO730952",
            "nombreMembresGroupe": "35",
            "vote": {
              "positionMajoritaire": "contre",
              "decompteVoix": {
                "pour": "0",
                "contre": "2",
                "nonVotants": "0",
                "abstentions": "0",
                "nonVotantsVolontaires": "0"
              },
              "decompteNominatif": {
                "nonVotants": null,
                "abstentions": null,
                "pours": null,
                "contres": {
                  "votant": [
                    {
                      "acteurRef": "PA720230",
                      "mandatRef": "PM722898",
                      "parDelegation": "false"
                    },
                    {
                      "acteurRef": "PA642868",
                      "mandatRef": "PM722992",
                      "parDelegation": "false"
                    }
                  ]
                }
              }
            }
          },
          {
            "organeRef": "PO730946",
            "nombreMembresGroupe": "31",
            "vote": {
              "positionMajoritaire": "pour",
              "decompteVoix": {
                "pour": "1",
                "contre": "0",
                "nonVotants": "0",
                "abstentions": "0",
                "nonVotantsVolontaires": "0"
              },
              "decompteNominatif": {
                "nonVotants": null,
                "abstentions": null,
                "pours": {
                  "votant": {
                    "acteurRef": "PA609590",
                    "mandatRef": "PM723326",
                    "parDelegation": "false"
                  }
                },
                "contres": null
              }
            }
          },
          {
            "organeRef": "PO723569",
            "nombreMembresGroupe": "18",
            "vote": {
              "positionMajoritaire": "pour",
              "decompteVoix": {
                "pour": "2",
                "contre": "0",
                "nonVotants": "0",
                "abstentions": "0",
                "nonVotantsVolontaires": "0"
              },
              "decompteNominatif": {
                "nonVotants": null,
                "abstentions": null,
                "pours": {
                  "votant": [
                    {
                      "acteurRef": "PA720614",
                      "mandatRef": "PM723016",
                      "parDelegation": "false"
                    },
                    {
                      "acteurRef": "PA719608",
                      "mandatRef": "PM722710",
                      "parDelegation": "false"
                    }
                  ]
                },
                "contres": null
              }
            }
          },
          {
            "organeRef": "PO730958",
            "nombreMembresGroupe": "17",
            "vote": {
              "positionMajoritaire": "pour",
              "decompteVoix": {
                "pour": "3",
                "contre": "0",
                "nonVotants": "0",
                "abstentions": "0",
                "nonVotantsVolontaires": "0"
              },
              "decompteNominatif": {
                "nonVotants": null,
                "abstentions": null,
                "pours": {
                  "votant": [
                    {
                      "acteurRef": "PA720430",
                      "mandatRef": "PM722962",
                      "parDelegation": "false"
                    },
                    {
                      "acteurRef": "PA721202",
                      "mandatRef": "PM723202",
                      "parDelegation": "false"
                    },
                    {
                      "acteurRef": "PA721960",
                      "mandatRef": "PM723434",
                      "parDelegation": "false"
                    }
                  ]
                },
                "contres": null
              }
            }
          },
          {
            "organeRef": "PO730940",
            "nombreMembresGroupe": "16",
            "vote": {
              "positionMajoritaire": "pour",
              "decompteVoix": {
                "pour": "0",
                "contre": "0",
                "nonVotants": "0",
                "abstentions": "0",
                "nonVotantsVolontaires": "0"
              },
              "decompteNominatif": {
                "nonVotants": null,
                "abstentions": null,
                "pours": null,
                "contres": null
              }
            }
          }
        ]
      }
    }
  },
  "miseAuPoint": null,
  "@xmlns": "http://schemas.assemblee-nationale.fr/referentiel"
}