{
  "@xmlns:xsi": "http://www.w3.org/2001/XMLSchema-instance",
  "uid": "VTANR5L15V1107",
  "numero": "1107",
  "organeRef": "PO717460",
  "legislature": "15",
  "sessionRef": "SCR5A2018E1",
  "seanceRef": "RUANR5L15S2018IDS21205",
  "dateScrutin": "2018-07-26T02:00:00.000+02:00",
  "quantiemeJourSeance": "3",
  "typeVote": {
    "codeTypeVote": "SPO",
    "libelleTypeVote": "scrutin public ordinaire",
    "typeMajorite": "majorité absolue des suffrages exprimés"
  },
  "sort": {
    "code": "rejeté",
    "libelle": "L'Assemblée nationale n'a pas adopté"
  },
  "titre": "l'amendement n° 378 de Mme Karamanli à l'article 19 ter du projet de loi pour une immigration maîtrisée, un droit d'asile effectif et une intégration réussie (nouvelle lecture).",
  "demandeur": {
    "texte": "Présidente du groupe \"Nouvelle Gauche\"",
    "referenceLegislative": null
  },
  "objet": {
    "libelle": "l'amendement n° 378 de Mme Karamanli à l'article 19 ter du projet de loi pour une immigration maîtrisée, un droit d'asile effectif et une intégration réussie (nouvelle lecture).",
    "referenceLegislative": null
  },
  "modePublicationDesVotes": "DecompteNominatif",
  "syntheseVote": {
    "nombreVotants": "73",
    "suffragesExprimes": "68",
    "nbrSuffragesRequis": "35",
    "annonce": "L'Assemblée nationale n'a pas adopté",
    "decompte": {
      "pour": "15",
      "contre": "53",
      "abstentions": "5",
      "nonVotants": "1",
      "nonVotantsVolontaires": "0"
    }
  },
  "ventilationVotes": {
    "organe": {
      "organeRef": "PO717460",
      "groupes": {
        "groupe": [
          {
            "organeRef": "PO730964",
            "nombreMembresGroupe": "312",
            "vote": {
              "positionMajoritaire": "contre",
              "decompteVoix": {
                "pour": "8",
                "contre": "42",
                "nonVotants": "1",
                "abstentions": "3",
                "nonVotantsVolontaires": "3"
              },
              "decompteNominatif": {
                "nonVotants": {
                  "votant": {
                    "acteurRef": "PA332747",
                    "mandatRef": "PM722798",
                    "causePositionVote": "PSE"
                  }
                },
                "abstentions": {
                  "votant": [
                    {
                      "acteurRef": "PA718710",
                      "mandatRef": "PM722432",
                      "parDelegation": "false"
                    },
                    {
                      "acteurRef": "PA720538",
                      "mandatRef": "PM722994",
                      "parDelegation": "false"
                    },
                    {
                      "acteurRef": "PA721450",
                      "mandatRef": "PM723278",
                      "parDelegation": "false"
                    }
                  ]
                },
                "pours": {
                  "votant": [
                    {
                      "acteurRef": "PA719448",
                      "mandatRef": "PM722666",
                      "parDelegation": "false"
                    },
                    {
                      "acteurRef": "PA719464",
                      "mandatRef": "PM722670",
                      "parDelegation": "false"
                    },
                    {
                      "acteurRef": "PA720124",
                      "mandatRef": "PM722866",
                      "parDelegation": "false"
                    },
                    {
                      "acteurRef": "PA720202",
                      "mandatRef": "PM722890",
                      "parDelegation": "false"
                    },
                    {
                      "acteurRef": "PA720870",
                      "mandatRef": "PM723100",
                      "parDelegation": "false"
                    },
                    {
                      "acteurRef": "PA720900",
                      "mandatRef": "PM723108",
                      "parDelegation": "false"
                    },
                    {
                      "acteurRef": "PA720916",
                      "mandatRef": "PM723112",
                      "parDelegation": "false"
                    },
                    {
                      "acteurRef": "PA721194",
                      "mandatRef": "PM723200",
                      "parDelegation": "false"
                    }
                  ]
                },
                "contres": {
                  "votant": [
                    {
                      "acteurRef": "PA722398",
                      "mandatRef": "PM723562",
                      "parDelegation": "false"
                    },
                    {
                      "acteurRef": "PA643127",
                      "mandatRef": "PM722636",
                      "parDelegation": "false"
                    },
                    {
                      "acteurRef": "PA721880",
                      "mandatRef": "PM723410",
                      "parDelegation": "false"
                    },
                    {
                      "acteurRef": "PA718768",
                      "mandatRef": "PM722450",
                      "parDelegation": "false"
                    },
                    {
                      "acteurRef": "PA606507",
                      "mandatRef": "PM722720",
                      "parDelegation": "false"
                    },
                    {
                      "acteurRef": "PA607193",
                      "mandatRef": "PM722846",
                      "parDelegation": "false"
                    },
                    {
                      "acteurRef": "PA717379",
                      "mandatRef": "PM723282",
                      "parDelegation": "false"
                    },
                    {
                      "acteurRef": "PA718674",
                      "mandatRef": "PM722420",
                      "parDelegation": "false"
                    },
                    {
                      "acteurRef": "PA718930",
                      "mandatRef": "PM722504",
                      "parDelegation": "false"
                    },
                    {
                      "acteurRef": "PA719024",
                      "mandatRef": "PM722536",
                      "parDelegation": "false"
                    },
                    {
                      "acteurRef": "PA719072",
                      "mandatRef": "PM722552",
                      "parDelegation": "false"
                    },
                    {
                      "acteurRef": "PA719080",
                      "mandatRef": "PM722554",
                      "parDelegation": "false"
                    },
                    {
                      "acteurRef": "PA719108",
                      "mandatRef": "PM722564",
                      "parDelegation": "false"
                    },
                    {
                      "acteurRef": "PA719170",
                      "mandatRef": "PM722582",
                      "parDelegation": "false"
                    },
                    {
                      "acteurRef": "PA719456",
                      "mandatRef": "PM722668",
                      "parDelegation": "false"
                    },
                    {
                      "acteurRef": "PA719570",
                      "mandatRef": "PM722700",
                      "parDelegation": "false"
                    },
                    {
                      "acteurRef": "PA719692",
                      "mandatRef": "PM722732",
                      "parDelegation": "false"
                    },
                    {
                      "acteurRef": "PA719850",
                      "mandatRef": "PM722780",
                      "parDelegation": "false"
                    },
                    {
                      "acteurRef": "PA719960",
                      "mandatRef": "PM722816",
                      "parDelegation": "false"
                    },
                    {
                      "acteurRef": "PA719994",
                      "mandatRef": "PM722828",
                      "parDelegation": "false"
                    },
                    {
                      "acteurRef": "PA720022",
                      "mandatRef": "PM722836",
                      "parDelegation": "false"
                    },
                    {
                      "acteurRef": "PA720054",
                      "mandatRef": "PM722844",
                      "parDelegation": "false"
                    },
                    {
                      "acteurRef": "PA720108",
                      "mandatRef": "PM722862",
                      "parDelegation": "false"
                    },
                    {
                      "acteurRef": "PA720268",
                      "mandatRef": "PM722912",
                      "parDelegation": "false"
                    },
                    {
                      "acteurRef": "PA720318",
                      "mandatRef": "PM722928",
                      "parDelegation": "false"
                    },
                    {
                      "acteurRef": "PA720370",
                      "mandatRef": "PM722944",
                      "parDelegation": "false"
                    },
                    {
                      "acteurRef": "PA720568",
                      "mandatRef": "PM723002",
                      "parDelegation": "false"
                    },
                    {
                      "acteurRef": "PA720830",
                      "mandatRef": "PM723088",
                      "parDelegation": "false"
                    },
                    {
                      "acteurRef": "PA720908",
                      "mandatRef": "PM723110",
                      "parDelegation": "false"
                    },
                    {
                      "acteurRef": "PA721328",
                      "mandatRef": "PM723240",
                      "parDelegation": "false"
                    },
                    {
                      "acteurRef": "PA721344",
                      "mandatRef": "PM723244",
                      "parDelegation": "false"
                    },
                    {
                      "acteurRef": "PA721364",
                      "mandatRef": "PM723250",
                      "parDelegation": "false"
                    },
                    {
                      "acteurRef": "PA721584",
                      "mandatRef": "PM723324",
                      "parDelegation": "false"
                    },
                    {
                      "acteurRef": "PA721616",
                      "mandatRef": "PM723334",
                      "parDelegation": "false"
                    },
                    {
                      "acteurRef": "PA722170",
                      "mandatRef": "PM723492",
                      "parDelegation": "false"
                    },
                    {
                      "acteurRef": "PA722228",
                      "mandatRef": "PM723512",
                      "parDelegation": "false"
                    },
                    {
                      "acteurRef": "PA722292",
                      "mandatRef": "PM723530",
                      "parDelegation": "false"
                    },
                    {
                      "acteurRef": "PA722344",
                      "mandatRef": "PM723546",
                      "parDelegation": "false"
                    },
                    {
                      "acteurRef": "PA722382",
                      "mandatRef": "PM723558",
                      "parDelegation": "false"
                    },
                    {
                      "acteurRef": "PA643205",
                      "mandatRef": "PM723358",
                      "parDelegation": "false"
                    },
                    {
                      "acteurRef": "PA719326",
                      "mandatRef": "PM733709",
                      "parDelegation": "false"
                    },
                    {
                      "acteurRef": "PA721564",
                      "mandatRef": "PM733723",
                      "parDelegation": "false"
                    }
                  ]
                }
              }
            }
          },
          {
            "organeRef": "PO730934",
            "nombreMembresGroupe": "103",
            "vote": {
              "positionMajoritaire": "contre",
              "decompteVoix": {
                "pour": "0",
                "contre": "4",
                "nonVotants": "0",
                "abstentions": "0",
                "nonVotantsVolontaires": "0"
              },
              "decompteNominatif": {
                "nonVotants": null,
                "abstentions": null,
                "pours": null,
                "contres": {
                  "votant": [
                    {
                      "acteurRef": "PA330240",
                      "mandatRef": "PM722492",
                      "parDelegation": "false"
                    },
                    {
                      "acteurRef": "PA608016",
                      "mandatRef": "PM723024",
                      "parDelegation": "false"
                    },
                    {
                      "acteurRef": "PA267785",
                      "mandatRef": "PM723310",
                      "parDelegation": "false"
                    },
                    {
                      "acteurRef": "PA720684",
                      "mandatRef": "PM723040",
                      "parDelegation": "false"
                    }
                  ]
                }
              }
            }
          },
          {
            "organeRef": "PO730970",
            "nombreMembresGroupe": "46",
            "vote": {
              "positionMajoritaire": "contre",
              "decompteVoix": {
                "pour": "0",
                "contre": "4",
                "nonVotants": "0",
                "abstentions": "2",
                "nonVotantsVolontaires": "2"
              },
              "decompteNominatif": {
                "nonVotants": null,
                "abstentions": {
                  "votant": [
                    {
                      "acteurRef": "PA719558",
                      "mandatRef": "PM722696",
                      "parDelegation": "false"
                    },
                    {
                      "acteurRef": "PA721234",
                      "mandatRef": "PM723210",
                      "parDelegation": "false"
                    }
                  ]
                },
                "pours": null,
                "contres": {
                  "votant": [
                    {
                      "acteurRef": "PA719874",
                      "mandatRef": "PM722786",
                      "parDelegation": "false"
                    },
                    {
                      "acteurRef": "PA721182",
                      "mandatRef": "PM723196",
                      "parDelegation": "false"
                    },
                    {
                      "acteurRef": "PA721976",
                      "mandatRef": "PM723438",
                      "parDelegation": "false"
                    },
                    {
                      "acteurRef": "PA722284",
                      "mandatRef": "PM723528",
                      "parDelegation": "false"
                    }
                  ]
                }
              }
            }
          },
          {
            "organeRef": "PO744425",
            "nombreMembresGroupe": "31",
            "vote": {
              "positionMajoritaire": "pour",
              "decompteVoix": {
                "pour": "0",
                "contre": "0",
                "nonVotants": "0",
                "abstentions": "0",
                "nonVotantsVolontaires": "0"
              },
              "decompteNominatif": {
                "nonVotants": null,
                "abstentions": null,
                "pours": null,
                "contres": null
              }
            }
          },
          {
            "organeRef": "PO730946",
            "nombreMembresGroupe": "30",
            "vote": {
              "positionMajoritaire": "pour",
              "decompteVoix": {
                "pour": "3",
                "contre": "0",
                "nonVotants": "0",
                "abstentions": "0",
                "nonVotantsVolontaires": "0"
              },
              "decompteNominatif": {
                "nonVotants": null,
                "abstentions": null,
                "pours": {
                  "votant": [
                    {
                      "acteurRef": "PA335054",
                      "mandatRef": "PM723254",
                      "parDelegation": "false"
                    },
                    {
                      "acteurRef": "PA342415",
                      "mandatRef": "PM722826",
                      "parDelegation": "false"
                    },
                    {
                      "acteurRef": "PA720988",
                      "mandatRef": "PM723132",
                      "parDelegation": "false"
                    }
                  ]
                },
                "contres": null
              }
            }
          },
          {
            "organeRef": "PO723569",
            "nombreMembresGroupe": "21",
            "vote": {
              "positionMajoritaire": "contre",
              "decompteVoix": {
                "pour": "0",
                "contre": "3",
                "nonVotants": "0",
                "abstentions": "0",
                "nonVotantsVolontaires": "0"
              },
              "decompteNominatif": {
                "nonVotants": null,
                "abstentions": null,
                "pours": null,
                "contres": {
                  "votant": [
                    {
                      "acteurRef": "PA719608",
                      "mandatRef": "PM722710",
                      "parDelegation": "false"
                    },
                    {
                      "acteurRef": "PA720606",
                      "mandatRef": "PM723014",
                      "parDelegation": "false"
                    },
                    {
                      "acteurRef": "PA721932",
                      "mandatRef": "PM734586",
                      "parDelegation": "false"
                    }
                  ]
                }
              }
            }
          },
          {
            "organeRef": "PO730958",
            "nombreMembresGroupe": "17",
            "vote": {
              "positionMajoritaire": "pour",
              "decompteVoix": {
                "pour": "2",
                "contre": "0",
                "nonVotants": "0",
                "abstentions": "0",
                "nonVotantsVolontaires": "0"
              },
              "decompteNominatif": {
                "nonVotants": null,
                "abstentions": null,
                "pours": {
                  "votant": [
                    {
                      "acteurRef": "PA720892",
                      "mandatRef": "PM723106",
                      "parDelegation": "false"
                    },
                    {
                      "acteurRef": "PA721960",
                      "mandatRef": "PM723434",
                      "parDelegation": "false"
                    }
                  ]
                },
                "contres": null
              }
            }
          },
          {
            "organeRef": "PO730940",
            "nombreMembresGroupe": "16",
            "vote": {
              "positionMajoritaire": "pour",
              "decompteVoix": {
                "pour": "2",
                "contre": "0",
                "nonVotants": "0",
                "abstentions": "0",
                "nonVotantsVolontaires": "0"
              },
              "decompteNominatif": {
                "nonVotants": null,
                "abstentions": null,
                "pours": {
                  "votant": [
                    {
                      "acteurRef": "PA721270",
                      "mandatRef": "PM723220",
                      "parDelegation": "false"
                    },
                    {
                      "acteurRef": "PA721896",
                      "mandatRef": "PM723414",
                      "parDelegation": "false"
                    }
                  ]
                },
                "contres": null
              }
            }
          }
        ]
      }
    }
  },
  "miseAuPoint": null,
  "@xmlns": "http://schemas.assemblee-nationale.fr/referentiel"
}