{
  "@xmlns:xsi": "http://www.w3.org/2001/XMLSchema-instance",
  "uid": "VTANR5L15V1080",
  "numero": "1080",
  "organeRef": "PO717460",
  "legislature": "15",
  "sessionRef": "SCR5A2018O1",
  "seanceRef": "RUANR5L15S2018IDS21175",
  "dateScrutin": "2018-07-19T02:00:00.000+02:00",
  "quantiemeJourSeance": "3",
  "typeVote": {
    "codeTypeVote": "SPO",
    "libelleTypeVote": "scrutin public ordinaire",
    "typeMajorite": "majorité absolue des suffrages exprimés"
  },
  "sort": {
    "code": "rejeté",
    "libelle": "L'Assemblée nationale n'a pas adopté"
  },
  "titre": "l'amendement n° 1816 de M. Potier et l'amendement identique suivant après l'article 2 du projet de loi constitutionnelle pour une démocratie plus représentative, responsable et efficace (première lecture).",
  "demandeur": {
    "texte": "Président du groupe \"de la Gauche démocrate et républicaine\"",
    "referenceLegislative": null
  },
  "objet": {
    "libelle": "l'amendement n° 1816 de M. Potier et l'amendement identique suivant après l'article 2 du projet de loi constitutionnelle pour une démocratie plus représentative, responsable et efficace (première lecture).",
    "referenceLegislative": null
  },
  "modePublicationDesVotes": "DecompteNominatif",
  "syntheseVote": {
    "nombreVotants": "108",
    "suffragesExprimes": "106",
    "nbrSuffragesRequis": "54",
    "annonce": "L'Assemblée nationale n'a pas adopté",
    "decompte": {
      "pour": "25",
      "contre": "81",
      "abstentions": "2",
      "nonVotants": "1",
      "nonVotantsVolontaires": "0"
    }
  },
  "ventilationVotes": {
    "organe": {
      "organeRef": "PO717460",
      "groupes": {
        "groupe": [
          {
            "organeRef": "PO730964",
            "nombreMembresGroupe": "312",
            "vote": {
              "positionMajoritaire": "contre",
              "decompteVoix": {
                "pour": "1",
                "contre": "61",
                "nonVotants": "1",
                "abstentions": "0",
                "nonVotantsVolontaires": "0"
              },
              "decompteNominatif": {
                "nonVotants": {
                  "votant": {
                    "acteurRef": "PA332747",
                    "mandatRef": "PM722798",
                    "causePositionVote": "PSE"
                  }
                },
                "abstentions": null,
                "pours": {
                  "votant": {
                    "acteurRef": "PA607619",
                    "mandatRef": "PM722936",
                    "parDelegation": "false"
                  }
                },
                "contres": {
                  "votant": [
                    {
                      "acteurRef": "PA643127",
                      "mandatRef": "PM722636",
                      "parDelegation": "false"
                    },
                    {
                      "acteurRef": "PA719952",
                      "mandatRef": "PM722814",
                      "parDelegation": "false"
                    },
                    {
                      "acteurRef": "PA606171",
                      "mandatRef": "PM722632",
                      "parDelegation": "false"
                    },
                    {
                      "acteurRef": "PA721880",
                      "mandatRef": "PM723410",
                      "parDelegation": "false"
                    },
                    {
                      "acteurRef": "PA722190",
                      "mandatRef": "PM723498",
                      "parDelegation": "false"
                    },
                    {
                      "acteurRef": "PA605518",
                      "mandatRef": "PM722518",
                      "parDelegation": "false"
                    },
                    {
                      "acteurRef": "PA606507",
                      "mandatRef": "PM722720",
                      "parDelegation": "false"
                    },
                    {
                      "acteurRef": "PA607193",
                      "mandatRef": "PM722846",
                      "parDelegation": "false"
                    },
                    {
                      "acteurRef": "PA672",
                      "mandatRef": "PM723230",
                      "parDelegation": "false"
                    },
                    {
                      "acteurRef": "PA721852",
                      "mandatRef": "PM723402",
                      "parDelegation": "false"
                    },
                    {
                      "acteurRef": "PA717379",
                      "mandatRef": "PM723282",
                      "parDelegation": "false"
                    },
                    {
                      "acteurRef": "PA718794",
                      "mandatRef": "PM722460",
                      "parDelegation": "false"
                    },
                    {
                      "acteurRef": "PA718894",
                      "mandatRef": "PM722494",
                      "parDelegation": "false"
                    },
                    {
                      "acteurRef": "PA718962",
                      "mandatRef": "PM722514",
                      "parDelegation": "false"
                    },
                    {
                      "acteurRef": "PA719060",
                      "mandatRef": "PM722546",
                      "parDelegation": "false"
                    },
                    {
                      "acteurRef": "PA719080",
                      "mandatRef": "PM722554",
                      "parDelegation": "false"
                    },
                    {
                      "acteurRef": "PA719186",
                      "mandatRef": "PM722588",
                      "parDelegation": "false"
                    },
                    {
                      "acteurRef": "PA719202",
                      "mandatRef": "PM722592",
                      "parDelegation": "false"
                    },
                    {
                      "acteurRef": "PA719230",
                      "mandatRef": "PM722600",
                      "parDelegation": "false"
                    },
                    {
                      "acteurRef": "PA719350",
                      "mandatRef": "PM722634",
                      "parDelegation": "false"
                    },
                    {
                      "acteurRef": "PA719600",
                      "mandatRef": "PM722708",
                      "parDelegation": "false"
                    },
                    {
                      "acteurRef": "PA719616",
                      "mandatRef": "PM722712",
                      "parDelegation": "false"
                    },
                    {
                      "acteurRef": "PA719748",
                      "mandatRef": "PM722750",
                      "parDelegation": "false"
                    },
                    {
                      "acteurRef": "PA719770",
                      "mandatRef": "PM722758",
                      "parDelegation": "false"
                    },
                    {
                      "acteurRef": "PA719798",
                      "mandatRef": "PM722766",
                      "parDelegation": "false"
                    },
                    {
                      "acteurRef": "PA719822",
                      "mandatRef": "PM722772",
                      "parDelegation": "false"
                    },
                    {
                      "acteurRef": "PA719850",
                      "mandatRef": "PM722780",
                      "parDelegation": "false"
                    },
                    {
                      "acteurRef": "PA719866",
                      "mandatRef": "PM722784",
                      "parDelegation": "false"
                    },
                    {
                      "acteurRef": "PA719890",
                      "mandatRef": "PM722790",
                      "parDelegation": "false"
                    },
                    {
                      "acteurRef": "PA719922",
                      "mandatRef": "PM722802",
                      "parDelegation": "false"
                    },
                    {
                      "acteurRef": "PA719994",
                      "mandatRef": "PM722828",
                      "parDelegation": "false"
                    },
                    {
                      "acteurRef": "PA720108",
                      "mandatRef": "PM722862",
                      "parDelegation": "false"
                    },
                    {
                      "acteurRef": "PA643175",
                      "mandatRef": "PM722868",
                      "parDelegation": "false"
                    },
                    {
                      "acteurRef": "PA720154",
                      "mandatRef": "PM722876",
                      "parDelegation": "false"
                    },
                    {
                      "acteurRef": "PA720222",
                      "mandatRef": "PM722896",
                      "parDelegation": "false"
                    },
                    {
                      "acteurRef": "PA720298",
                      "mandatRef": "PM722922",
                      "parDelegation": "false"
                    },
                    {
                      "acteurRef": "PA720318",
                      "mandatRef": "PM722928",
                      "parDelegation": "false"
                    },
                    {
                      "acteurRef": "PA721036",
                      "mandatRef": "PM753260",
                      "parDelegation": "false"
                    },
                    {
                      "acteurRef": "PA721158",
                      "mandatRef": "PM723190",
                      "parDelegation": "false"
                    },
                    {
                      "acteurRef": "PA721218",
                      "mandatRef": "PM723206",
                      "parDelegation": "false"
                    },
                    {
                      "acteurRef": "PA721450",
                      "mandatRef": "PM723278",
                      "parDelegation": "false"
                    },
                    {
                      "acteurRef": "PA721568",
                      "mandatRef": "PM723316",
                      "parDelegation": "false"
                    },
                    {
                      "acteurRef": "PA721584",
                      "mandatRef": "PM723324",
                      "parDelegation": "false"
                    },
                    {
                      "acteurRef": "PA721600",
                      "mandatRef": "PM723330",
                      "parDelegation": "false"
                    },
                    {
                      "acteurRef": "PA721616",
                      "mandatRef": "PM723334",
                      "parDelegation": "false"
                    },
                    {
                      "acteurRef": "PA721624",
                      "mandatRef": "PM723336",
                      "parDelegation": "false"
                    },
                    {
                      "acteurRef": "PA721670",
                      "mandatRef": "PM723350",
                      "parDelegation": "false"
                    },
                    {
                      "acteurRef": "PA721702",
                      "mandatRef": "PM723360",
                      "parDelegation": "false"
                    },
                    {
                      "acteurRef": "PA721784",
                      "mandatRef": "PM723382",
                      "parDelegation": "false"
                    },
                    {
                      "acteurRef": "PA721888",
                      "mandatRef": "PM723412",
                      "parDelegation": "false"
                    },
                    {
                      "acteurRef": "PA721916",
                      "mandatRef": "PM723420",
                      "parDelegation": "false"
                    },
                    {
                      "acteurRef": "PA721946",
                      "mandatRef": "PM723430",
                      "parDelegation": "false"
                    },
                    {
                      "acteurRef": "PA722000",
                      "mandatRef": "PM723444",
                      "parDelegation": "false"
                    },
                    {
                      "acteurRef": "PA722086",
                      "mandatRef": "PM723468",
                      "parDelegation": "false"
                    },
                    {
                      "acteurRef": "PA722150",
                      "mandatRef": "PM723486",
                      "parDelegation": "false"
                    },
                    {
                      "acteurRef": "PA722228",
                      "mandatRef": "PM723512",
                      "parDelegation": "false"
                    },
                    {
                      "acteurRef": "PA722260",
                      "mandatRef": "PM723520",
                      "parDelegation": "false"
                    },
                    {
                      "acteurRef": "PA722336",
                      "mandatRef": "PM723544",
                      "parDelegation": "false"
                    },
                    {
                      "acteurRef": "PA722366",
                      "mandatRef": "PM723554",
                      "parDelegation": "false"
                    },
                    {
                      "acteurRef": "PA724827",
                      "mandatRef": "PM754304",
                      "parDelegation": "false"
                    },
                    {
                      "acteurRef": "PA642788",
                      "mandatRef": "PM722746",
                      "parDelegation": "false"
                    }
                  ]
                }
              }
            }
          },
          {
            "organeRef": "PO730934",
            "nombreMembresGroupe": "103",
            "vote": {
              "positionMajoritaire": "contre",
              "decompteVoix": {
                "pour": "2",
                "contre": "11",
                "nonVotants": "0",
                "abstentions": "1",
                "nonVotantsVolontaires": "1"
              },
              "decompteNominatif": {
                "nonVotants": null,
                "abstentions": {
                  "votant": {
                    "acteurRef": "PA720100",
                    "mandatRef": "PM722860",
                    "parDelegation": "false"
                  }
                },
                "pours": {
                  "votant": [
                    {
                      "acteurRef": "PA606712",
                      "mandatRef": "PM722756",
                      "parDelegation": "false"
                    },
                    {
                      "acteurRef": "PA330008",
                      "mandatRef": "PM722416",
                      "parDelegation": "false"
                    }
                  ]
                },
                "contres": {
                  "votant": [
                    {
                      "acteurRef": "PA345722",
                      "mandatRef": "PM723428",
                      "parDelegation": "false"
                    },
                    {
                      "acteurRef": "PA923",
                      "mandatRef": "PM722904",
                      "parDelegation": "false"
                    },
                    {
                      "acteurRef": "PA1695",
                      "mandatRef": "PM723322",
                      "parDelegation": "false"
                    },
                    {
                      "acteurRef": "PA2960",
                      "mandatRef": "PM723006",
                      "parDelegation": "false"
                    },
                    {
                      "acteurRef": "PA266776",
                      "mandatRef": "PM723542",
                      "parDelegation": "false"
                    },
                    {
                      "acteurRef": "PA334654",
                      "mandatRef": "PM723566",
                      "parDelegation": "false"
                    },
                    {
                      "acteurRef": "PA266774",
                      "mandatRef": "PM723526",
                      "parDelegation": "false"
                    },
                    {
                      "acteurRef": "PA608416",
                      "mandatRef": "PM723540",
                      "parDelegation": "false"
                    },
                    {
                      "acteurRef": "PA721054",
                      "mandatRef": "PM723156",
                      "parDelegation": "false"
                    },
                    {
                      "acteurRef": "PA721286",
                      "mandatRef": "PM723224",
                      "parDelegation": "false"
                    },
                    {
                      "acteurRef": "PA346218",
                      "mandatRef": "PM723348",
                      "parDelegation": "false"
                    }
                  ]
                }
              }
            }
          },
          {
            "organeRef": "PO730970",
            "nombreMembresGroupe": "46",
            "vote": {
              "positionMajoritaire": "contre",
              "decompteVoix": {
                "pour": "0",
                "contre": "9",
                "nonVotants": "0",
                "abstentions": "0",
                "nonVotantsVolontaires": "0"
              },
              "decompteNominatif": {
                "nonVotants": null,
                "abstentions": null,
                "pours": null,
                "contres": {
                  "votant": [
                    {
                      "acteurRef": "PA721608",
                      "mandatRef": "PM723332",
                      "parDelegation": "false"
                    },
                    {
                      "acteurRef": "PA719558",
                      "mandatRef": "PM722696",
                      "parDelegation": "false"
                    },
                    {
                      "acteurRef": "PA719640",
                      "mandatRef": "PM722718",
                      "parDelegation": "false"
                    },
                    {
                      "acteurRef": "PA720720",
                      "mandatRef": "PM723056",
                      "parDelegation": "false"
                    },
                    {
                      "acteurRef": "PA720764",
                      "mandatRef": "PM723070",
                      "parDelegation": "false"
                    },
                    {
                      "acteurRef": "PA720968",
                      "mandatRef": "PM723126",
                      "parDelegation": "false"
                    },
                    {
                      "acteurRef": "PA721742",
                      "mandatRef": "PM723370",
                      "parDelegation": "false"
                    },
                    {
                      "acteurRef": "PA722162",
                      "mandatRef": "PM723490",
                      "parDelegation": "false"
                    },
                    {
                      "acteurRef": "PA722284",
                      "mandatRef": "PM723528",
                      "parDelegation": "false"
                    }
                  ]
                }
              }
            }
          },
          {
            "organeRef": "PO744425",
            "nombreMembresGroupe": "31",
            "vote": {
              "positionMajoritaire": "pour",
              "decompteVoix": {
                "pour": "2",
                "contre": "0",
                "nonVotants": "0",
                "abstentions": "0",
                "nonVotantsVolontaires": "0"
              },
              "decompteNominatif": {
                "nonVotants": null,
                "abstentions": null,
                "pours": {
                  "votant": [
                    {
                      "acteurRef": "PA719806",
                      "mandatRef": "PM722768",
                      "parDelegation": "false"
                    },
                    {
                      "acteurRef": "PA702052",
                      "mandatRef": "PM723172",
                      "parDelegation": "false"
                    }
                  ]
                },
                "contres": null
              }
            }
          },
          {
            "organeRef": "PO730946",
            "nombreMembresGroupe": "30",
            "vote": {
              "positionMajoritaire": "pour",
              "decompteVoix": {
                "pour": "9",
                "contre": "0",
                "nonVotants": "0",
                "abstentions": "0",
                "nonVotantsVolontaires": "0"
              },
              "decompteNominatif": {
                "nonVotants": null,
                "abstentions": null,
                "pours": {
                  "votant": [
                    {
                      "acteurRef": "PA333285",
                      "mandatRef": "PM722906",
                      "parDelegation": "false"
                    },
                    {
                      "acteurRef": "PA340343",
                      "mandatRef": "PM722470",
                      "parDelegation": "false"
                    },
                    {
                      "acteurRef": "PA1592",
                      "mandatRef": "PM723060",
                      "parDelegation": "false"
                    },
                    {
                      "acteurRef": "PA337483",
                      "mandatRef": "PM723140",
                      "parDelegation": "false"
                    },
                    {
                      "acteurRef": "PA609332",
                      "mandatRef": "PM723378",
                      "parDelegation": "false"
                    },
                    {
                      "acteurRef": "PA607553",
                      "mandatRef": "PM722956",
                      "parDelegation": "false"
                    },
                    {
                      "acteurRef": "PA608172",
                      "mandatRef": "PM723048",
                      "parDelegation": "false"
                    },
                    {
                      "acteurRef": "PA608695",
                      "mandatRef": "PM723564",
                      "parDelegation": "false"
                    },
                    {
                      "acteurRef": "PA719930",
                      "mandatRef": "PM722804",
                      "parDelegation": "false"
                    }
                  ]
                },
                "contres": null
              }
            }
          },
          {
            "organeRef": "PO723569",
            "nombreMembresGroupe": "21",
            "vote": {
              "positionMajoritaire": "pour",
              "decompteVoix": {
                "pour": "2",
                "contre": "0",
                "nonVotants": "0",
                "abstentions": "1",
                "nonVotantsVolontaires": "1"
              },
              "decompteNominatif": {
                "nonVotants": null,
                "abstentions": {
                  "votant": {
                    "acteurRef": "PA720606",
                    "mandatRef": "PM723014",
                    "parDelegation": "false"
                  }
                },
                "pours": {
                  "votant": [
                    {
                      "acteurRef": "PA608292",
                      "mandatRef": "PM723076",
                      "parDelegation": "false"
                    },
                    {
                      "acteurRef": "PA719138",
                      "mandatRef": "PM722574",
                      "parDelegation": "false"
                    }
                  ]
                },
                "contres": null
              }
            }
          },
          {
            "organeRef": "PO730958",
            "nombreMembresGroupe": "17",
            "vote": {
              "positionMajoritaire": "pour",
              "decompteVoix": {
                "pour": "4",
                "contre": "0",
                "nonVotants": "0",
                "abstentions": "0",
                "nonVotantsVolontaires": "0"
              },
              "decompteNominatif": {
                "nonVotants": null,
                "abstentions": null,
                "pours": {
                  "votant": [
                    {
                      "acteurRef": "PA721062",
                      "mandatRef": "PM723158",
                      "parDelegation": "false"
                    },
                    {
                      "acteurRef": "PA721202",
                      "mandatRef": "PM723202",
                      "parDelegation": "false"
                    },
                    {
                      "acteurRef": "PA721960",
                      "mandatRef": "PM723434",
                      "parDelegation": "false"
                    },
                    {
                      "acteurRef": "PA722142",
                      "mandatRef": "PM723484",
                      "parDelegation": "false"
                    }
                  ]
                },
                "contres": null
              }
            }
          },
          {
            "organeRef": "PO730940",
            "nombreMembresGroupe": "16",
            "vote": {
              "positionMajoritaire": "pour",
              "decompteVoix": {
                "pour": "5",
                "contre": "0",
                "nonVotants": "0",
                "abstentions": "0",
                "nonVotantsVolontaires": "0"
              },
              "decompteNominatif": {
                "nonVotants": null,
                "abstentions": null,
                "pours": {
                  "votant": [
                    {
                      "acteurRef": "PA722202",
                      "mandatRef": "PM723502",
                      "parDelegation": "false"
                    },
                    {
                      "acteurRef": "PA718926",
                      "mandatRef": "PM722502",
                      "parDelegation": "false"
                    },
                    {
                      "acteurRef": "PA610667",
                      "mandatRef": "PM723146",
                      "parDelegation": "false"
                    },
                    {
                      "acteurRef": "PA721118",
                      "mandatRef": "PM723176",
                      "parDelegation": "false"
                    },
                    {
                      "acteurRef": "PA722110",
                      "mandatRef": "PM723474",
                      "parDelegation": "false"
                    }
                  ]
                },
                "contres": null
              }
            }
          }
        ]
      }
    }
  },
  "miseAuPoint": null,
  "@xmlns": "http://schemas.assemblee-nationale.fr/referentiel"
}