{
  "@xmlns:xsi": "http://www.w3.org/2001/XMLSchema-instance",
  "uid": "VTANR5L15V2019",
  "numero": "2019",
  "organeRef": "PO717460",
  "legislature": "15",
  "sessionRef": "SCR5A2019E1",
  "seanceRef": "RUANR5L15S2019IDS21747",
  "dateScrutin": "2019-07-02T02:00:00.000+02:00",
  "quantiemeJourSeance": "2",
  "typeVote": {
    "codeTypeVote": "SPO",
    "libelleTypeVote": "scrutin public ordinaire",
    "typeMajorite": "majorité absolue des suffrages exprimés"
  },
  "sort": {
    "code": "rejeté",
    "libelle": "L'Assemblée nationale n'a pas adopté"
  },
  "titre": "l'amendement de suppression n° 2 de Mme Kuster et les amendements identiques suivants à l'article 8 du projet de loi pour la conservation et la restauration de la cathédrale Notre-Dame de Paris et instituant une souscription nationale à cet effet (nouvelle lecture).",
  "demandeur": {
    "texte": "Président du groupe \"Les Républicains\"",
    "referenceLegislative": null
  },
  "objet": {
    "libelle": "l'amendement de suppression n° 2 de Mme Kuster et les amendements identiques suivants à l'article 8 du projet de loi pour la conservation et la restauration de la cathédrale Notre-Dame de Paris et instituant une souscription nationale à cet effet (nouvelle lecture).",
    "referenceLegislative": null
  },
  "modePublicationDesVotes": "DecompteNominatif",
  "syntheseVote": {
    "nombreVotants": "50",
    "suffragesExprimes": "48",
    "nbrSuffragesRequis": "25",
    "annonce": "L'Assemblée nationale n'a pas adopté",
    "decompte": {
      "pour": "13",
      "contre": "35",
      "abstentions": "2",
      "nonVotants": "2",
      "nonVotantsVolontaires": "0"
    }
  },
  "ventilationVotes": {
    "organe": {
      "organeRef": "PO717460",
      "groupes": {
        "groupe": [
          {
            "organeRef": "PO730964",
            "nombreMembresGroupe": "304",
            "vote": {
              "positionMajoritaire": "contre",
              "decompteVoix": {
                "pour": "0",
                "contre": "31",
                "nonVotants": "1",
                "abstentions": "0",
                "nonVotantsVolontaires": "0"
              },
              "decompteNominatif": {
                "nonVotants": {
                  "votant": {
                    "acteurRef": "PA606171",
                    "mandatRef": "PM722632",
                    "causePositionVote": "PAN"
                  }
                },
                "abstentions": null,
                "pours": null,
                "contres": {
                  "votant": [
                    {
                      "acteurRef": "PA721262",
                      "mandatRef": "PM723218",
                      "parDelegation": "false"
                    },
                    {
                      "acteurRef": "PA608083",
                      "mandatRef": "PM723038",
                      "parDelegation": "true"
                    },
                    {
                      "acteurRef": "PA718944",
                      "mandatRef": "PM722508",
                      "parDelegation": "false"
                    },
                    {
                      "acteurRef": "PA719032",
                      "mandatRef": "PM722538",
                      "parDelegation": "false"
                    },
                    {
                      "acteurRef": "PA719108",
                      "mandatRef": "PM722564",
                      "parDelegation": "false"
                    },
                    {
                      "acteurRef": "PA719154",
                      "mandatRef": "PM722578",
                      "parDelegation": "false"
                    },
                    {
                      "acteurRef": "PA719170",
                      "mandatRef": "PM722582",
                      "parDelegation": "false"
                    },
                    {
                      "acteurRef": "PA719230",
                      "mandatRef": "PM722600",
                      "parDelegation": "false"
                    },
                    {
                      "acteurRef": "PA719472",
                      "mandatRef": "PM722672",
                      "parDelegation": "false"
                    },
                    {
                      "acteurRef": "PA719600",
                      "mandatRef": "PM722708",
                      "parDelegation": "false"
                    },
                    {
                      "acteurRef": "PA719798",
                      "mandatRef": "PM722766",
                      "parDelegation": "true"
                    },
                    {
                      "acteurRef": "PA719814",
                      "mandatRef": "PM722770",
                      "parDelegation": "false"
                    },
                    {
                      "acteurRef": "PA719830",
                      "mandatRef": "PM722774",
                      "parDelegation": "false"
                    },
                    {
                      "acteurRef": "PA719850",
                      "mandatRef": "PM722780",
                      "parDelegation": "false"
                    },
                    {
                      "acteurRef": "PA719858",
                      "mandatRef": "PM722782",
                      "parDelegation": "true"
                    },
                    {
                      "acteurRef": "PA720146",
                      "mandatRef": "PM722874",
                      "parDelegation": "false"
                    },
                    {
                      "acteurRef": "PA720190",
                      "mandatRef": "PM722886",
                      "parDelegation": "false"
                    },
                    {
                      "acteurRef": "PA720576",
                      "mandatRef": "PM723004",
                      "parDelegation": "false"
                    },
                    {
                      "acteurRef": "PA720754",
                      "mandatRef": "PM723066",
                      "parDelegation": "false"
                    },
                    {
                      "acteurRef": "PA721328",
                      "mandatRef": "PM723240",
                      "parDelegation": "false"
                    },
                    {
                      "acteurRef": "PA721458",
                      "mandatRef": "PM723280",
                      "parDelegation": "false"
                    },
                    {
                      "acteurRef": "PA721616",
                      "mandatRef": "PM723334",
                      "parDelegation": "false"
                    },
                    {
                      "acteurRef": "PA721750",
                      "mandatRef": "PM723372",
                      "parDelegation": "false"
                    },
                    {
                      "acteurRef": "PA721844",
                      "mandatRef": "PM723400",
                      "parDelegation": "false"
                    },
                    {
                      "acteurRef": "PA722000",
                      "mandatRef": "PM723444",
                      "parDelegation": "true"
                    },
                    {
                      "acteurRef": "PA722046",
                      "mandatRef": "PM723458",
                      "parDelegation": "false"
                    },
                    {
                      "acteurRef": "PA722244",
                      "mandatRef": "PM723516",
                      "parDelegation": "false"
                    },
                    {
                      "acteurRef": "PA722194",
                      "mandatRef": "PM760311",
                      "parDelegation": "false"
                    },
                    {
                      "acteurRef": "PA760658",
                      "mandatRef": "PM760662",
                      "parDelegation": "true"
                    },
                    {
                      "acteurRef": "PA722090",
                      "mandatRef": "PM762941",
                      "parDelegation": "false"
                    },
                    {
                      "acteurRef": "PA721674",
                      "mandatRef": "PM764881",
                      "parDelegation": "false"
                    }
                  ]
                }
              }
            }
          },
          {
            "organeRef": "PO730934",
            "nombreMembresGroupe": "104",
            "vote": {
              "positionMajoritaire": "pour",
              "decompteVoix": {
                "pour": "6",
                "contre": "0",
                "nonVotants": "1",
                "abstentions": "0",
                "nonVotantsVolontaires": "0"
              },
              "decompteNominatif": {
                "nonVotants": {
                  "votant": {
                    "acteurRef": "PA605991",
                    "mandatRef": "PM722660",
                    "causePositionVote": "PSE"
                  }
                },
                "abstentions": null,
                "pours": {
                  "votant": [
                    {
                      "acteurRef": "PA345722",
                      "mandatRef": "PM723428",
                      "parDelegation": "false"
                    },
                    {
                      "acteurRef": "PA330684",
                      "mandatRef": "PM722528",
                      "parDelegation": "false"
                    },
                    {
                      "acteurRef": "PA719318",
                      "mandatRef": "PM722624",
                      "parDelegation": "false"
                    },
                    {
                      "acteurRef": "PA642847",
                      "mandatRef": "PM722954",
                      "parDelegation": "false"
                    },
                    {
                      "acteurRef": "PA720630",
                      "mandatRef": "PM723020",
                      "parDelegation": "false"
                    },
                    {
                      "acteurRef": "PA721506",
                      "mandatRef": "PM723296",
                      "parDelegation": "false"
                    }
                  ]
                },
                "contres": null
              }
            }
          },
          {
            "organeRef": "PO730970",
            "nombreMembresGroupe": "46",
            "vote": {
              "positionMajoritaire": "contre",
              "decompteVoix": {
                "pour": "0",
                "contre": "1",
                "nonVotants": "0",
                "abstentions": "0",
                "nonVotantsVolontaires": "0"
              },
              "decompteNominatif": {
                "nonVotants": null,
                "abstentions": null,
                "pours": null,
                "contres": {
                  "votant": {
                    "acteurRef": "PA719640",
                    "mandatRef": "PM722718",
                    "parDelegation": "false"
                  }
                }
              }
            }
          },
          {
            "organeRef": "PO758835",
            "nombreMembresGroupe": "29",
            "vote": {
              "positionMajoritaire": "contre",
              "decompteVoix": {
                "pour": "0",
                "contre": "1",
                "nonVotants": "0",
                "abstentions": "1",
                "nonVotantsVolontaires": "1"
              },
              "decompteNominatif": {
                "nonVotants": null,
                "abstentions": {
                  "votant": {
                    "acteurRef": "PA607553",
                    "mandatRef": "PM722956",
                    "parDelegation": "false"
                  }
                },
                "pours": null,
                "contres": {
                  "votant": {
                    "acteurRef": "PA340357",
                    "mandatRef": "PM747435",
                    "parDelegation": "false"
                  }
                }
              }
            }
          },
          {
            "organeRef": "PO765636",
            "nombreMembresGroupe": "28",
            "vote": {
              "positionMajoritaire": "contre",
              "decompteVoix": {
                "pour": "0",
                "contre": "2",
                "nonVotants": "0",
                "abstentions": "1",
                "nonVotantsVolontaires": "1"
              },
              "decompteNominatif": {
                "nonVotants": null,
                "abstentions": {
                  "votant": {
                    "acteurRef": "PA720696",
                    "mandatRef": "PM723044",
                    "parDelegation": "false"
                  }
                },
                "pours": null,
                "contres": {
                  "votant": [
                    {
                      "acteurRef": "PA720230",
                      "mandatRef": "PM722898",
                      "parDelegation": "false"
                    },
                    {
                      "acteurRef": "PA721632",
                      "mandatRef": "PM760305",
                      "parDelegation": "false"
                    }
                  ]
                }
              }
            }
          },
          {
            "organeRef": "PO759900",
            "nombreMembresGroupe": "18",
            "vote": {
              "positionMajoritaire": "pour",
              "decompteVoix": {
                "pour": "2",
                "contre": "0",
                "nonVotants": "0",
                "abstentions": "0",
                "nonVotantsVolontaires": "0"
              },
              "decompteNominatif": {
                "nonVotants": null,
                "abstentions": null,
                "pours": {
                  "votant": [
                    {
                      "acteurRef": "PA607619",
                      "mandatRef": "PM722936",
                      "parDelegation": "false"
                    },
                    {
                      "acteurRef": "PA721194",
                      "mandatRef": "PM723200",
                      "parDelegation": "false"
                    }
                  ]
                },
                "contres": null
              }
            }
          },
          {
            "organeRef": "PO730958",
            "nombreMembresGroupe": "17",
            "vote": {
              "positionMajoritaire": "pour",
              "decompteVoix": {
                "pour": "1",
                "contre": "0",
                "nonVotants": "0",
                "abstentions": "0",
                "nonVotantsVolontaires": "0"
              },
              "decompteNominatif": {
                "nonVotants": null,
                "abstentions": null,
                "pours": {
                  "votant": {
                    "acteurRef": "PA718868",
                    "mandatRef": "PM722484",
                    "parDelegation": "false"
                  }
                },
                "contres": null
              }
            }
          },
          {
            "organeRef": "PO730940",
            "nombreMembresGroupe": "16",
            "vote": {
              "positionMajoritaire": "pour",
              "decompteVoix": {
                "pour": "1",
                "contre": "0",
                "nonVotants": "0",
                "abstentions": "0",
                "nonVotantsVolontaires": "0"
              },
              "decompteNominatif": {
                "nonVotants": null,
                "abstentions": null,
                "pours": {
                  "votant": {
                    "acteurRef": "PA718926",
                    "mandatRef": "PM722502",
                    "parDelegation": "false"
                  }
                },
                "contres": null
              }
            }
          },
          {
            "organeRef": "PO723569",
            "nombreMembresGroupe": "14",
            "vote": {
              "positionMajoritaire": "pour",
              "decompteVoix": {
                "pour": "3",
                "contre": "0",
                "nonVotants": "0",
                "abstentions": "0",
                "nonVotantsVolontaires": "0"
              },
              "decompteNominatif": {
                "nonVotants": null,
                "abstentions": null,
                "pours": {
                  "votant": [
                    {
                      "acteurRef": "PA719608",
                      "mandatRef": "PM722710",
                      "parDelegation": "false"
                    },
                    {
                      "acteurRef": "PA720606",
                      "mandatRef": "PM723014",
                      "parDelegation": "false"
                    },
                    {
                      "acteurRef": "PA721932",
                      "mandatRef": "PM734586",
                      "parDelegation": "false"
                    }
                  ]
                },
                "contres": null
              }
            }
          }
        ]
      }
    }
  },
  "miseAuPoint": null,
  "@xmlns": "http://schemas.assemblee-nationale.fr/referentiel"
}