{
  "@xmlns:xsi": "http://www.w3.org/2001/XMLSchema-instance",
  "uid": "VTANR5L15V725",
  "numero": "725",
  "organeRef": "PO717460",
  "legislature": "15",
  "sessionRef": "SCR5A2018O1",
  "seanceRef": "RUANR5L15S2018IDS21060",
  "dateScrutin": "2018-05-29T02:00:00.000+02:00",
  "quantiemeJourSeance": "2",
  "typeVote": {
    "codeTypeVote": "SPO",
    "libelleTypeVote": "scrutin public ordinaire",
    "typeMajorite": "majorité absolue des suffrages exprimés"
  },
  "sort": {
    "code": "rejeté",
    "libelle": "L'Assemblée nationale n'a pas adopté"
  },
  "titre": "l'amendement n° 1472 de Mme Genevard après l'article 15 bis du projet de loi pour l'équilibre des relations commerciales dans le secteur agricole et alimentaire et une alimentation saine et durable (première lecture).",
  "demandeur": {
    "texte": "Président du groupe \"Les Républicains\"",
    "referenceLegislative": null
  },
  "objet": {
    "libelle": "l'amendement n° 1472 de Mme Genevard après l'article 15 bis du projet de loi pour l'équilibre des relations commerciales dans le secteur agricole et alimentaire et une alimentation saine et durable (première lecture).",
    "referenceLegislative": null
  },
  "modePublicationDesVotes": "DecompteNominatif",
  "syntheseVote": {
    "nombreVotants": "118",
    "suffragesExprimes": "110",
    "nbrSuffragesRequis": "56",
    "annonce": "L'Assemblée nationale n'a pas adopté",
    "decompte": {
      "pour": "44",
      "contre": "66",
      "abstentions": "8",
      "nonVotants": "2",
      "nonVotantsVolontaires": "0"
    }
  },
  "ventilationVotes": {
    "organe": {
      "organeRef": "PO717460",
      "groupes": {
        "groupe": [
          {
            "organeRef": "PO730964",
            "nombreMembresGroupe": "313",
            "vote": {
              "positionMajoritaire": "contre",
              "decompteVoix": {
                "pour": "2",
                "contre": "65",
                "nonVotants": "1",
                "abstentions": "4",
                "nonVotantsVolontaires": "4"
              },
              "decompteNominatif": {
                "nonVotants": {
                  "votant": {
                    "acteurRef": "PA332747",
                    "mandatRef": "PM722798",
                    "causePositionVote": "PAN"
                  }
                },
                "abstentions": {
                  "votant": [
                    {
                      "acteurRef": "PA343493",
                      "mandatRef": "PM722938",
                      "parDelegation": "false"
                    },
                    {
                      "acteurRef": "PA718710",
                      "mandatRef": "PM722432",
                      "parDelegation": "false"
                    },
                    {
                      "acteurRef": "PA720146",
                      "mandatRef": "PM722874",
                      "parDelegation": "false"
                    },
                    {
                      "acteurRef": "PA721450",
                      "mandatRef": "PM723278",
                      "parDelegation": "false"
                    }
                  ]
                },
                "pours": {
                  "votant": [
                    {
                      "acteurRef": "PA721522",
                      "mandatRef": "PM723300",
                      "parDelegation": "false"
                    },
                    {
                      "acteurRef": "PA721726",
                      "mandatRef": "PM723366",
                      "parDelegation": "false"
                    }
                  ]
                },
                "contres": {
                  "votant": [
                    {
                      "acteurRef": "PA722398",
                      "mandatRef": "PM723562",
                      "parDelegation": "false"
                    },
                    {
                      "acteurRef": "PA2449",
                      "mandatRef": "PM723036",
                      "parDelegation": "false"
                    },
                    {
                      "acteurRef": "PA643127",
                      "mandatRef": "PM722636",
                      "parDelegation": "false"
                    },
                    {
                      "acteurRef": "PA718768",
                      "mandatRef": "PM722450",
                      "parDelegation": "false"
                    },
                    {
                      "acteurRef": "PA605518",
                      "mandatRef": "PM722518",
                      "parDelegation": "false"
                    },
                    {
                      "acteurRef": "PA607155",
                      "mandatRef": "PM722832",
                      "parDelegation": "false"
                    },
                    {
                      "acteurRef": "PA607595",
                      "mandatRef": "PM722924",
                      "parDelegation": "false"
                    },
                    {
                      "acteurRef": "PA672",
                      "mandatRef": "PM723230",
                      "parDelegation": "false"
                    },
                    {
                      "acteurRef": "PA721852",
                      "mandatRef": "PM723402",
                      "parDelegation": "false"
                    },
                    {
                      "acteurRef": "PA718876",
                      "mandatRef": "PM722486",
                      "parDelegation": "false"
                    },
                    {
                      "acteurRef": "PA718894",
                      "mandatRef": "PM722494",
                      "parDelegation": "false"
                    },
                    {
                      "acteurRef": "PA718918",
                      "mandatRef": "PM722500",
                      "parDelegation": "false"
                    },
                    {
                      "acteurRef": "PA718930",
                      "mandatRef": "PM722504",
                      "parDelegation": "false"
                    },
                    {
                      "acteurRef": "PA718962",
                      "mandatRef": "PM722514",
                      "parDelegation": "false"
                    },
                    {
                      "acteurRef": "PA718990",
                      "mandatRef": "PM722524",
                      "parDelegation": "false"
                    },
                    {
                      "acteurRef": "PA719032",
                      "mandatRef": "PM722538",
                      "parDelegation": "false"
                    },
                    {
                      "acteurRef": "PA719130",
                      "mandatRef": "PM722572",
                      "parDelegation": "false"
                    },
                    {
                      "acteurRef": "PA719154",
                      "mandatRef": "PM722578",
                      "parDelegation": "false"
                    },
                    {
                      "acteurRef": "PA719170",
                      "mandatRef": "PM722582",
                      "parDelegation": "false"
                    },
                    {
                      "acteurRef": "PA719230",
                      "mandatRef": "PM722600",
                      "parDelegation": "false"
                    },
                    {
                      "acteurRef": "PA719242",
                      "mandatRef": "PM722604",
                      "parDelegation": "false"
                    },
                    {
                      "acteurRef": "PA719310",
                      "mandatRef": "PM722622",
                      "parDelegation": "false"
                    },
                    {
                      "acteurRef": "PA719338",
                      "mandatRef": "PM722630",
                      "parDelegation": "false"
                    },
                    {
                      "acteurRef": "PA719372",
                      "mandatRef": "PM722640",
                      "parDelegation": "false"
                    },
                    {
                      "acteurRef": "PA719388",
                      "mandatRef": "PM722648",
                      "parDelegation": "false"
                    },
                    {
                      "acteurRef": "PA719412",
                      "mandatRef": "PM722654",
                      "parDelegation": "false"
                    },
                    {
                      "acteurRef": "PA719652",
                      "mandatRef": "PM722722",
                      "parDelegation": "false"
                    },
                    {
                      "acteurRef": "PA719700",
                      "mandatRef": "PM722734",
                      "parDelegation": "false"
                    },
                    {
                      "acteurRef": "PA719770",
                      "mandatRef": "PM722758",
                      "parDelegation": "false"
                    },
                    {
                      "acteurRef": "PA719790",
                      "mandatRef": "PM722764",
                      "parDelegation": "false"
                    },
                    {
                      "acteurRef": "PA719830",
                      "mandatRef": "PM722774",
                      "parDelegation": "false"
                    },
                    {
                      "acteurRef": "PA719842",
                      "mandatRef": "PM722778",
                      "parDelegation": "false"
                    },
                    {
                      "acteurRef": "PA719858",
                      "mandatRef": "PM722782",
                      "parDelegation": "false"
                    },
                    {
                      "acteurRef": "PA720014",
                      "mandatRef": "PM722834",
                      "parDelegation": "false"
                    },
                    {
                      "acteurRef": "PA720022",
                      "mandatRef": "PM722836",
                      "parDelegation": "false"
                    },
                    {
                      "acteurRef": "PA720108",
                      "mandatRef": "PM722862",
                      "parDelegation": "false"
                    },
                    {
                      "acteurRef": "PA720124",
                      "mandatRef": "PM722866",
                      "parDelegation": "false"
                    },
                    {
                      "acteurRef": "PA720154",
                      "mandatRef": "PM722876",
                      "parDelegation": "false"
                    },
                    {
                      "acteurRef": "PA720222",
                      "mandatRef": "PM722896",
                      "parDelegation": "false"
                    },
                    {
                      "acteurRef": "PA720268",
                      "mandatRef": "PM722912",
                      "parDelegation": "false"
                    },
                    {
                      "acteurRef": "PA720342",
                      "mandatRef": "PM722934",
                      "parDelegation": "false"
                    },
                    {
                      "acteurRef": "PA720414",
                      "mandatRef": "PM722958",
                      "parDelegation": "false"
                    },
                    {
                      "acteurRef": "PA720538",
                      "mandatRef": "PM722994",
                      "parDelegation": "false"
                    },
                    {
                      "acteurRef": "PA720568",
                      "mandatRef": "PM723002",
                      "parDelegation": "false"
                    },
                    {
                      "acteurRef": "PA720590",
                      "mandatRef": "PM723010",
                      "parDelegation": "false"
                    },
                    {
                      "acteurRef": "PA720622",
                      "mandatRef": "PM723018",
                      "parDelegation": "false"
                    },
                    {
                      "acteurRef": "PA720780",
                      "mandatRef": "PM723074",
                      "parDelegation": "false"
                    },
                    {
                      "acteurRef": "PA720814",
                      "mandatRef": "PM723084",
                      "parDelegation": "false"
                    },
                    {
                      "acteurRef": "PA720830",
                      "mandatRef": "PM723088",
                      "parDelegation": "false"
                    },
                    {
                      "acteurRef": "PA721134",
                      "mandatRef": "PM723184",
                      "parDelegation": "false"
                    },
                    {
                      "acteurRef": "PA721372",
                      "mandatRef": "PM723252",
                      "parDelegation": "false"
                    },
                    {
                      "acteurRef": "PA721542",
                      "mandatRef": "PM723308",
                      "parDelegation": "false"
                    },
                    {
                      "acteurRef": "PA721600",
                      "mandatRef": "PM723330",
                      "parDelegation": "false"
                    },
                    {
                      "acteurRef": "PA721616",
                      "mandatRef": "PM723334",
                      "parDelegation": "false"
                    },
                    {
                      "acteurRef": "PA721792",
                      "mandatRef": "PM723384",
                      "parDelegation": "false"
                    },
                    {
                      "acteurRef": "PA721808",
                      "mandatRef": "PM723388",
                      "parDelegation": "false"
                    },
                    {
                      "acteurRef": "PA722000",
                      "mandatRef": "PM723444",
                      "parDelegation": "false"
                    },
                    {
                      "acteurRef": "PA722134",
                      "mandatRef": "PM723482",
                      "parDelegation": "false"
                    },
                    {
                      "acteurRef": "PA722170",
                      "mandatRef": "PM723492",
                      "parDelegation": "false"
                    },
                    {
                      "acteurRef": "PA722228",
                      "mandatRef": "PM723512",
                      "parDelegation": "false"
                    },
                    {
                      "acteurRef": "PA722312",
                      "mandatRef": "PM723536",
                      "parDelegation": "false"
                    },
                    {
                      "acteurRef": "PA722336",
                      "mandatRef": "PM723544",
                      "parDelegation": "false"
                    },
                    {
                      "acteurRef": "PA722344",
                      "mandatRef": "PM723546",
                      "parDelegation": "false"
                    },
                    {
                      "acteurRef": "PA722366",
                      "mandatRef": "PM723554",
                      "parDelegation": "false"
                    },
                    {
                      "acteurRef": "PA719326",
                      "mandatRef": "PM733709",
                      "parDelegation": "false"
                    }
                  ]
                }
              }
            }
          },
          {
            "organeRef": "PO730934",
            "nombreMembresGroupe": "102",
            "vote": {
              "positionMajoritaire": "pour",
              "decompteVoix": {
                "pour": "24",
                "contre": "0",
                "nonVotants": "1",
                "abstentions": "0",
                "nonVotantsVolontaires": "0"
              },
              "decompteNominatif": {
                "nonVotants": {
                  "votant": {
                    "acteurRef": "PA605991",
                    "mandatRef": "PM722660",
                    "causePositionVote": "PSE"
                  }
                },
                "abstentions": null,
                "pours": {
                  "votant": [
                    {
                      "acteurRef": "PA720210",
                      "mandatRef": "PM722892",
                      "parDelegation": "false"
                    },
                    {
                      "acteurRef": "PA606712",
                      "mandatRef": "PM722756",
                      "parDelegation": "false"
                    },
                    {
                      "acteurRef": "PA1327",
                      "mandatRef": "PM722762",
                      "parDelegation": "false"
                    },
                    {
                      "acteurRef": "PA2155",
                      "mandatRef": "PM722490",
                      "parDelegation": "false"
                    },
                    {
                      "acteurRef": "PA720644",
                      "mandatRef": "PM723026",
                      "parDelegation": "false"
                    },
                    {
                      "acteurRef": "PA720586",
                      "mandatRef": "PM723008",
                      "parDelegation": "false"
                    },
                    {
                      "acteurRef": "PA334843",
                      "mandatRef": "PM723534",
                      "parDelegation": "false"
                    },
                    {
                      "acteurRef": "PA718850",
                      "mandatRef": "PM722478",
                      "parDelegation": "false"
                    },
                    {
                      "acteurRef": "PA718838",
                      "mandatRef": "PM722474",
                      "parDelegation": "false"
                    },
                    {
                      "acteurRef": "PA334149",
                      "mandatRef": "PM723034",
                      "parDelegation": "false"
                    },
                    {
                      "acteurRef": "PA336316",
                      "mandatRef": "PM723406",
                      "parDelegation": "false"
                    },
                    {
                      "acteurRef": "PA334654",
                      "mandatRef": "PM723566",
                      "parDelegation": "false"
                    },
                    {
                      "acteurRef": "PA340853",
                      "mandatRef": "PM722534",
                      "parDelegation": "false"
                    },
                    {
                      "acteurRef": "PA608016",
                      "mandatRef": "PM723024",
                      "parDelegation": "false"
                    },
                    {
                      "acteurRef": "PA718780",
                      "mandatRef": "PM722454",
                      "parDelegation": "false"
                    },
                    {
                      "acteurRef": "PA719318",
                      "mandatRef": "PM722624",
                      "parDelegation": "false"
                    },
                    {
                      "acteurRef": "PA643134",
                      "mandatRef": "PM722824",
                      "parDelegation": "false"
                    },
                    {
                      "acteurRef": "PA720386",
                      "mandatRef": "PM722948",
                      "parDelegation": "false"
                    },
                    {
                      "acteurRef": "PA642847",
                      "mandatRef": "PM722954",
                      "parDelegation": "false"
                    },
                    {
                      "acteurRef": "PA720630",
                      "mandatRef": "PM723020",
                      "parDelegation": "false"
                    },
                    {
                      "acteurRef": "PA330909",
                      "mandatRef": "PM722548",
                      "parDelegation": "false"
                    },
                    {
                      "acteurRef": "PA266793",
                      "mandatRef": "PM722550",
                      "parDelegation": "false"
                    },
                    {
                      "acteurRef": "PA709315",
                      "mandatRef": "PM722526",
                      "parDelegation": "false"
                    },
                    {
                      "acteurRef": "PA712015",
                      "mandatRef": "PM722448",
                      "parDelegation": "false"
                    }
                  ]
                },
                "contres": null
              }
            }
          },
          {
            "organeRef": "PO730970",
            "nombreMembresGroupe": "47",
            "vote": {
              "positionMajoritaire": "contre",
              "decompteVoix": {
                "pour": "0",
                "contre": "1",
                "nonVotants": "0",
                "abstentions": "0",
                "nonVotantsVolontaires": "0"
              },
              "decompteNominatif": {
                "nonVotants": null,
                "abstentions": null,
                "pours": null,
                "contres": {
                  "votant": {
                    "acteurRef": "PA720598",
                    "mandatRef": "PM723012",
                    "parDelegation": "false"
                  }
                }
              }
            }
          },
          {
            "organeRef": "PO744425",
            "nombreMembresGroupe": "32",
            "vote": {
              "positionMajoritaire": "pour",
              "decompteVoix": {
                "pour": "9",
                "contre": "0",
                "nonVotants": "0",
                "abstentions": "1",
                "nonVotantsVolontaires": "1"
              },
              "decompteNominatif": {
                "nonVotants": null,
                "abstentions": {
                  "votant": {
                    "acteurRef": "PA720230",
                    "mandatRef": "PM722898",
                    "parDelegation": "false"
                  }
                },
                "pours": {
                  "votant": [
                    {
                      "acteurRef": "PA267042",
                      "mandatRef": "PM722910",
                      "parDelegation": "false"
                    },
                    {
                      "acteurRef": "PA268019",
                      "mandatRef": "PM723092",
                      "parDelegation": "false"
                    },
                    {
                      "acteurRef": "PA266788",
                      "mandatRef": "PM722914",
                      "parDelegation": "false"
                    },
                    {
                      "acteurRef": "PA267355",
                      "mandatRef": "PM723524",
                      "parDelegation": "false"
                    },
                    {
                      "acteurRef": "PA331582",
                      "mandatRef": "PM722646",
                      "parDelegation": "false"
                    },
                    {
                      "acteurRef": "PA335758",
                      "mandatRef": "PM723338",
                      "parDelegation": "false"
                    },
                    {
                      "acteurRef": "PA332228",
                      "mandatRef": "PM722754",
                      "parDelegation": "false"
                    },
                    {
                      "acteurRef": "PA267766",
                      "mandatRef": "PM722970",
                      "parDelegation": "false"
                    },
                    {
                      "acteurRef": "PA267780",
                      "mandatRef": "PM723504",
                      "parDelegation": "false"
                    }
                  ]
                },
                "contres": null
              }
            }
          },
          {
            "organeRef": "PO730946",
            "nombreMembresGroupe": "30",
            "vote": {
              "positionMajoritaire": "pour",
              "decompteVoix": {
                "pour": "6",
                "contre": "0",
                "nonVotants": "0",
                "abstentions": "0",
                "nonVotantsVolontaires": "0"
              },
              "decompteNominatif": {
                "nonVotants": null,
                "abstentions": null,
                "pours": {
                  "votant": [
                    {
                      "acteurRef": "PA333285",
                      "mandatRef": "PM722906",
                      "parDelegation": "false"
                    },
                    {
                      "acteurRef": "PA1592",
                      "mandatRef": "PM723060",
                      "parDelegation": "false"
                    },
                    {
                      "acteurRef": "PA605069",
                      "mandatRef": "PM722424",
                      "parDelegation": "false"
                    },
                    {
                      "acteurRef": "PA342415",
                      "mandatRef": "PM722826",
                      "parDelegation": "false"
                    },
                    {
                      "acteurRef": "PA607553",
                      "mandatRef": "PM722956",
                      "parDelegation": "false"
                    },
                    {
                      "acteurRef": "PA1008",
                      "mandatRef": "PM722704",
                      "parDelegation": "false"
                    }
                  ]
                },
                "contres": null
              }
            }
          },
          {
            "organeRef": "PO723569",
            "nombreMembresGroupe": "20",
            "vote": {
              "positionMajoritaire": "pour",
              "decompteVoix": {
                "pour": "2",
                "contre": "0",
                "nonVotants": "0",
                "abstentions": "0",
                "nonVotantsVolontaires": "0"
              },
              "decompteNominatif": {
                "nonVotants": null,
                "abstentions": null,
                "pours": {
                  "votant": [
                    {
                      "acteurRef": "PA336175",
                      "mandatRef": "PM723328",
                      "parDelegation": "false"
                    },
                    {
                      "acteurRef": "PA608292",
                      "mandatRef": "PM723076",
                      "parDelegation": "false"
                    }
                  ]
                },
                "contres": null
              }
            }
          },
          {
            "organeRef": "PO730958",
            "nombreMembresGroupe": "17",
            "vote": {
              "positionMajoritaire": "abstention",
              "decompteVoix": {
                "pour": "0",
                "contre": "0",
                "nonVotants": "0",
                "abstentions": "3",
                "nonVotantsVolontaires": "3"
              },
              "decompteNominatif": {
                "nonVotants": null,
                "abstentions": {
                  "votant": [
                    {
                      "acteurRef": "PA718868",
                      "mandatRef": "PM722484",
                      "parDelegation": "false"
                    },
                    {
                      "acteurRef": "PA719578",
                      "mandatRef": "PM722702",
                      "parDelegation": "false"
                    },
                    {
                      "acteurRef": "PA722142",
                      "mandatRef": "PM723484",
                      "parDelegation": "false"
                    }
                  ]
                },
                "pours": null,
                "contres": null
              }
            }
          },
          {
            "organeRef": "PO730940",
            "nombreMembresGroupe": "16",
            "vote": {
              "positionMajoritaire": "pour",
              "decompteVoix": {
                "pour": "1",
                "contre": "0",
                "nonVotants": "0",
                "abstentions": "0",
                "nonVotantsVolontaires": "0"
              },
              "decompteNominatif": {
                "nonVotants": null,
                "abstentions": null,
                "pours": {
                  "votant": {
                    "acteurRef": "PA267306",
                    "mandatRef": "PM723054",
                    "parDelegation": "false"
                  }
                },
                "contres": null
              }
            }
          }
        ]
      }
    }
  },
  "miseAuPoint": null,
  "@xmlns": "http://schemas.assemblee-nationale.fr/referentiel"
}