{
  "uid": "VTANR5L14V1018",
  "numero": "1018",
  "organeRef": "PO644420",
  "legislature": "14",
  "sessionRef": "SCR5A2015O1",
  "seanceRef": "RUANR5L14S2015IDS19026",
  "dateScrutin": "2015-02-06T01:00:00.000+01:00",
  "quantiemeJourSeance": "3",
  "typeVote": {
    "codeTypeVote": "SPO",
    "libelleTypeVote": "scrutin public ordinaire",
    "typeMajorite": "majorité absolue des suffrages exprimés"
  },
  "sort": {
    "code": "rejeté",
    "libelle": "L'Assemblée nationale n'a pas adopté"
  },
  "titre": "l'amendement n° 2788 de Mme Berger à l'article 34 du projet de loi pour la croissance, l'activité et l'égalité des chances économiques (première lecture)",
  "demandeur": {
    "texte": "Président du groupe de la gauche démocrate et républicaine"
  },
  "objet": {
    "libelle": "l'amendement n° 2788 de Mme Berger à l'article 34 du projet de loi pour la croissance, l'activité et l'égalité des chances économiques (première lecture)"
  },
  "modePublicationDesVotes": "DecompteNominatif",
  "syntheseVote": {
    "nombreVotants": "38",
    "suffragesExprimes": "37",
    "nbrSuffragesRequis": "19",
    "annonce": "L'Assemblée nationale n'a pas adopté",
    "decompte": {
      "pour": "7",
      "contre": "30",
      "nonVotants": "2",
      "abstentions": "1"
    }
  },
  "ventilationVotes": {
    "organeRef": "PO644420",
    "groupes": [
      {
        "organeRef": "PO656002",
        "nombreMembresGroupe": "287",
        "vote": {
          "positionMajoritaire": "contre",
          "decompteVoix": {
            "pour": "3",
            "contre": "19",
            "nonVotants": "1",
            "abstentions": "1"
          },
          "decompteNominatif": {
            "nonVotants": [
              {
                "acteurRef": "PA381",
                "mandatRef": "PM645125",
                "causePositionVote": "PAN"
              }
            ],
            "pour": [
              {
                "acteurRef": "PA605143",
                "mandatRef": "PM645423"
              },
              {
                "acteurRef": "PA609042",
                "mandatRef": "PM645076"
              },
              {
                "acteurRef": "PA610529",
                "mandatRef": "PM645192"
              }
            ],
            "contre": [
              {
                "acteurRef": "PA610481",
                "mandatRef": "PM645131"
              },
              {
                "acteurRef": "PA680",
                "mandatRef": "PM645536"
              },
              {
                "acteurRef": "PA1886",
                "mandatRef": "PM645099"
              },
              {
                "acteurRef": "PA606171",
                "mandatRef": "PM645255"
              },
              {
                "acteurRef": "PA331282",
                "mandatRef": "PM645480"
              },
              {
                "acteurRef": "PA335017",
                "mandatRef": "PM645607"
              },
              {
                "acteurRef": "PA770",
                "mandatRef": "PM645361"
              },
              {
                "acteurRef": "PA608083",
                "mandatRef": "PM645142"
              },
              {
                "acteurRef": "PA267835",
                "mandatRef": "PM645134"
              },
              {
                "acteurRef": "PA267965",
                "mandatRef": "PM645052"
              },
              {
                "acteurRef": "PA335054",
                "mandatRef": "PM645614"
              },
              {
                "acteurRef": "PA605131",
                "mandatRef": "PM645420"
              },
              {
                "acteurRef": "PA605606",
                "mandatRef": "PM645394"
              },
              {
                "acteurRef": "PA606991",
                "mandatRef": "PM645098"
              },
              {
                "acteurRef": "PA607310",
                "mandatRef": "PM645297"
              },
              {
                "acteurRef": "PA608641",
                "mandatRef": "PM645579"
              },
              {
                "acteurRef": "PA608785",
                "mandatRef": "PM645567"
              },
              {
                "acteurRef": "PA672",
                "mandatRef": "PM645175"
              },
              {
                "acteurRef": "PA610594",
                "mandatRef": "PM645185"
              }
            ],
            "abstentions": [
              {
                "acteurRef": "PA607187",
                "mandatRef": "PM645224"
              }
            ]
          }
        }
      },
      {
        "organeRef": "PO656006",
        "nombreMembresGroupe": "198",
        "vote": {
          "positionMajoritaire": "contre",
          "decompteVoix": {
            "pour": "0",
            "contre": "6",
            "nonVotants": "1",
            "abstentions": "0"
          },
          "decompteNominatif": {
            "nonVotants": [
              {
                "acteurRef": "PA1874",
                "mandatRef": "PM645474",
                "causePositionVote": "PSE"
              }
            ],
            "contre": [
              {
                "acteurRef": "PA606712",
                "mandatRef": "PM645549"
              },
              {
                "acteurRef": "PA345937",
                "mandatRef": "PM645177"
              },
              {
                "acteurRef": "PA2815",
                "mandatRef": "PM645514"
              },
              {
                "acteurRef": "PA267506",
                "mandatRef": "PM645270"
              },
              {
                "acteurRef": "PA330684",
                "mandatRef": "PM645497"
              },
              {
                "acteurRef": "PA346886",
                "mandatRef": "PM695110"
              }
            ]
          }
        }
      },
      {
        "organeRef": "PO656010",
        "nombreMembresGroupe": "30",
        "vote": {
          "positionMajoritaire": "contre",
          "decompteVoix": {
            "pour": "0",
            "contre": "4",
            "abstentions": "0"
          },
          "decompteNominatif": {
            "contre": [
              {
                "acteurRef": "PA267585",
                "mandatRef": "PM645508"
              },
              {
                "acteurRef": "PA267673",
                "mandatRef": "PM645249"
              },
              {
                "acteurRef": "PA331582",
                "mandatRef": "PM645198"
              },
              {
                "acteurRef": "PA610125",
                "mandatRef": "PM645088"
              }
            ]
          }
        }
      },
      {
        "organeRef": "PO656014",
        "nombreMembresGroupe": "18",
        "vote": {
          "positionMajoritaire": "pour",
          "decompteVoix": {
            "pour": "2",
            "contre": "0",
            "abstentions": "0"
          },
          "decompteNominatif": {
            "pour": [
              {
                "acteurRef": "PA609520",
                "mandatRef": "PM645233"
              },
              {
                "acteurRef": "PA606910",
                "mandatRef": "PM645547"
              }
            ]
          }
        }
      },
      {
        "organeRef": "PO656022",
        "nombreMembresGroupe": "18",
        "vote": {
          "positionMajoritaire": "contre",
          "decompteVoix": {
            "pour": "0",
            "contre": "1",
            "abstentions": "0"
          },
          "decompteNominatif": {
            "contre": [
              {
                "acteurRef": "PA2828",
                "mandatRef": "PM645402"
              }
            ]
          }
        }
      },
      {
        "organeRef": "PO656018",
        "nombreMembresGroupe": "15",
        "vote": {
          "positionMajoritaire": "pour",
          "decompteVoix": {
            "pour": "2",
            "contre": "0",
            "abstentions": "0"
          },
          "decompteNominatif": {
            "pour": [
              {
                "acteurRef": "PA605745",
                "mandatRef": "PM645435"
              },
              {
                "acteurRef": "PA267306",
                "mandatRef": "PM645210"
              }
            ]
          }
        }
      },
      {
        "organeRef": "PO645633",
        "nombreMembresGroupe": "9",
        "vote": {
          "positionMajoritaire": "pour",
          "decompteVoix": {
            "pour": "0",
            "contre": "0",
            "abstentions": "0"
          },
          "decompteNominatif": {}
        }
      }
    ]
  }
}