{
  "uid": "VTANR5L14V1350",
  "numero": "1350",
  "organeRef": "PO644420",
  "legislature": "14",
  "sessionRef": "SCR5A2017O1",
  "seanceRef": "RUANR5L14S2017IDS20355",
  "dateScrutin": "2016-11-17T01:00:00.000+01:00",
  "quantiemeJourSeance": "1",
  "typeVote": {
    "codeTypeVote": "SPO",
    "libelleTypeVote": "scrutin public ordinaire",
    "typeMajorite": "majorité absolue des suffrages exprimés"
  },
  "sort": {
    "code": "rejeté",
    "libelle": "L'Assemblée nationale n'a pas adopté"
  },
  "titre": "l'amendement n° 46 de M. Mariton et les amendements identiques de suppression de l'article 38 de la seconde partie du projet de loi de finances pour 2017 (première lecture).",
  "demandeur": {
    "texte": "Président du groupe Les Républicains"
  },
  "objet": {
    "libelle": "l'amendement n° 46 de M. Mariton et les amendements identiques de suppression de l'article 38 de la seconde partie du projet de loi de finances pour 2017 (première lecture)."
  },
  "modePublicationDesVotes": "DecompteNominatif",
  "syntheseVote": {
    "nombreVotants": "82",
    "suffragesExprimes": "82",
    "nbrSuffragesRequis": "42",
    "annonce": "L'Assemblée nationale n'a pas adopté",
    "decompte": {
      "pour": "37",
      "contre": "45",
      "nonVotants": "1",
      "abstentions": "0"
    }
  },
  "ventilationVotes": {
    "organeRef": "PO644420",
    "groupes": [
      {
        "organeRef": "PO713077",
        "nombreMembresGroupe": "288",
        "vote": {
          "positionMajoritaire": "contre",
          "decompteVoix": {
            "pour": "0",
            "contre": "41",
            "nonVotants": "1",
            "abstentions": "0"
          },
          "decompteNominatif": {
            "nonVotants": [
              {
                "acteurRef": "PA381",
                "mandatRef": "PM645125",
                "causePositionVote": "PAN"
              }
            ],
            "contre": [
              {
                "acteurRef": "PA394",
                "mandatRef": "PM645447"
              },
              {
                "acteurRef": "PA543",
                "mandatRef": "PM645064"
              },
              {
                "acteurRef": "PA765",
                "mandatRef": "PM645138"
              },
              {
                "acteurRef": "PA1199",
                "mandatRef": "PM645376"
              },
              {
                "acteurRef": "PA1214",
                "mandatRef": "PM645446"
              },
              {
                "acteurRef": "PA1991",
                "mandatRef": "PM645156"
              },
              {
                "acteurRef": "PA2883",
                "mandatRef": "PM645512"
              },
              {
                "acteurRef": "PA607187",
                "mandatRef": "PM645224"
              },
              {
                "acteurRef": "PA2317",
                "mandatRef": "PM645111"
              },
              {
                "acteurRef": "PA735",
                "mandatRef": "PM645089"
              },
              {
                "acteurRef": "PA877",
                "mandatRef": "PM645349"
              },
              {
                "acteurRef": "PA1401",
                "mandatRef": "PM645439"
              },
              {
                "acteurRef": "PA1886",
                "mandatRef": "PM645099"
              },
              {
                "acteurRef": "PA1979",
                "mandatRef": "PM645223"
              },
              {
                "acteurRef": "PA331282",
                "mandatRef": "PM645480"
              },
              {
                "acteurRef": "PA608686",
                "mandatRef": "PM645601"
              },
              {
                "acteurRef": "PA267835",
                "mandatRef": "PM645134"
              },
              {
                "acteurRef": "PA336971",
                "mandatRef": "PM645102"
              },
              {
                "acteurRef": "PA336421",
                "mandatRef": "PM645332"
              },
              {
                "acteurRef": "PA335319",
                "mandatRef": "PM645070"
              },
              {
                "acteurRef": "PA331973",
                "mandatRef": "PM645438"
              },
              {
                "acteurRef": "PA331753",
                "mandatRef": "PM645348"
              },
              {
                "acteurRef": "PA332636",
                "mandatRef": "PM645118"
              },
              {
                "acteurRef": "PA405480",
                "mandatRef": "PM645203"
              },
              {
                "acteurRef": "PA605143",
                "mandatRef": "PM645423"
              },
              {
                "acteurRef": "PA605349",
                "mandatRef": "PM645483"
              },
              {
                "acteurRef": "PA605963",
                "mandatRef": "PM645055"
              },
              {
                "acteurRef": "PA606675",
                "mandatRef": "PM645533"
              },
              {
                "acteurRef": "PA608172",
                "mandatRef": "PM645197"
              },
              {
                "acteurRef": "PA609042",
                "mandatRef": "PM645076"
              },
              {
                "acteurRef": "PA608785",
                "mandatRef": "PM645567"
              },
              {
                "acteurRef": "PA608920",
                "mandatRef": "PM645060"
              },
              {
                "acteurRef": "PA609435",
                "mandatRef": "PM645211"
              },
              {
                "acteurRef": "PA609590",
                "mandatRef": "PM645261"
              },
              {
                "acteurRef": "PA610291",
                "mandatRef": "PM645119"
              },
              {
                "acteurRef": "PA609314",
                "mandatRef": "PM645145"
              },
              {
                "acteurRef": "PA610529",
                "mandatRef": "PM645192"
              },
              {
                "acteurRef": "PA610594",
                "mandatRef": "PM645185"
              },
              {
                "acteurRef": "PA642836",
                "mandatRef": "PM676799"
              },
              {
                "acteurRef": "PA342332",
                "mandatRef": "PM676816"
              },
              {
                "acteurRef": "PA267623",
                "mandatRef": "PM676817"
              }
            ]
          }
        }
      },
      {
        "organeRef": "PO707869",
        "nombreMembresGroupe": "199",
        "vote": {
          "positionMajoritaire": "pour",
          "decompteVoix": {
            "pour": "33",
            "contre": "0",
            "abstentions": "0"
          },
          "decompteNominatif": {
            "pour": [
              {
                "acteurRef": "PA1020",
                "mandatRef": "PM645057"
              },
              {
                "acteurRef": "PA2048",
                "mandatRef": "PM693013"
              },
              {
                "acteurRef": "PA2295",
                "mandatRef": "PM645091"
              },
              {
                "acteurRef": "PA2801",
                "mandatRef": "PM645576"
              },
              {
                "acteurRef": "PA2936",
                "mandatRef": "PM645272"
              },
              {
                "acteurRef": "PA259",
                "mandatRef": "PM645395"
              },
              {
                "acteurRef": "PA267689",
                "mandatRef": "PM645295"
              },
              {
                "acteurRef": "PA606712",
                "mandatRef": "PM645549"
              },
              {
                "acteurRef": "PA856",
                "mandatRef": "PM645353"
              },
              {
                "acteurRef": "PA1874",
                "mandatRef": "PM645474"
              },
              {
                "acteurRef": "PA2083",
                "mandatRef": "PM645105"
              },
              {
                "acteurRef": "PA746",
                "mandatRef": "PM645154"
              },
              {
                "acteurRef": "PA1445",
                "mandatRef": "PM645563"
              },
              {
                "acteurRef": "PA1695",
                "mandatRef": "PM645157"
              },
              {
                "acteurRef": "PA267797",
                "mandatRef": "PM645350"
              },
              {
                "acteurRef": "PA2492",
                "mandatRef": "PM645431"
              },
              {
                "acteurRef": "PA267227",
                "mandatRef": "PM645618"
              },
              {
                "acteurRef": "PA267775",
                "mandatRef": "PM645585"
              },
              {
                "acteurRef": "PA267813",
                "mandatRef": "PM645172"
              },
              {
                "acteurRef": "PA2700",
                "mandatRef": "PM645196"
              },
              {
                "acteurRef": "PA2960",
                "mandatRef": "PM645040"
              },
              {
                "acteurRef": "PA266776",
                "mandatRef": "PM645590"
              },
              {
                "acteurRef": "PA267178",
                "mandatRef": "PM645473"
              },
              {
                "acteurRef": "PA243",
                "mandatRef": "PM645167"
              },
              {
                "acteurRef": "PA332523",
                "mandatRef": "PM645550"
              },
              {
                "acteurRef": "PA331567",
                "mandatRef": "PM645186"
              },
              {
                "acteurRef": "PA608016",
                "mandatRef": "PM645071"
              },
              {
                "acteurRef": "PA608434",
                "mandatRef": "PM645593"
              },
              {
                "acteurRef": "PA607489",
                "mandatRef": "PM645366"
              },
              {
                "acteurRef": "PA608380",
                "mandatRef": "PM645578"
              },
              {
                "acteurRef": "PA610830",
                "mandatRef": "PM645039"
              },
              {
                "acteurRef": "PA610924",
                "mandatRef": "PM645227"
              },
              {
                "acteurRef": "PA709315",
                "mandatRef": "PM709318"
              }
            ]
          }
        }
      },
      {
        "organeRef": "PO656010",
        "nombreMembresGroupe": "27",
        "vote": {
          "positionMajoritaire": "pour",
          "decompteVoix": {
            "pour": "2",
            "contre": "0",
            "abstentions": "0"
          },
          "decompteNominatif": {
            "pour": [
              {
                "acteurRef": "PA2597",
                "mandatRef": "PM645126"
              },
              {
                "acteurRef": "PA942",
                "mandatRef": "PM645357"
              }
            ]
          }
        }
      },
      {
        "organeRef": "PO645633",
        "nombreMembresGroupe": "26",
        "vote": {
          "positionMajoritaire": "pour",
          "decompteVoix": {
            "pour": "1",
            "contre": "0",
            "abstentions": "0"
          },
          "decompteNominatif": {
            "pour": [
              {
                "acteurRef": "PA610125",
                "mandatRef": "PM645088"
              }
            ]
          }
        }
      },
      {
        "organeRef": "PO656022",
        "nombreMembresGroupe": "18",
        "vote": {
          "positionMajoritaire": "contre",
          "decompteVoix": {
            "pour": "0",
            "contre": "4",
            "abstentions": "0"
          },
          "decompteNominatif": {
            "contre": [
              {
                "acteurRef": "PA2828",
                "mandatRef": "PM645402"
              },
              {
                "acteurRef": "PA267336",
                "mandatRef": "PM645424"
              },
              {
                "acteurRef": "PA267407",
                "mandatRef": "PM645320"
              },
              {
                "acteurRef": "PA608292",
                "mandatRef": "PM645276"
              }
            ]
          }
        }
      },
      {
        "organeRef": "PO656018",
        "nombreMembresGroupe": "15",
        "vote": {
          "positionMajoritaire": "pour",
          "decompteVoix": {
            "pour": "1",
            "contre": "0",
            "abstentions": "0"
          },
          "decompteNominatif": {
            "pour": [
              {
                "acteurRef": "PA605745",
                "mandatRef": "PM645435"
              }
            ]
          }
        }
      }
    ]
  }
}