{
  "uid": "VTANR5L14V960",
  "numero": "960",
  "organeRef": "PO644420",
  "legislature": "14",
  "sessionRef": "SCR5A2015O1",
  "seanceRef": "RUANR5L14S2015IDS18815",
  "dateScrutin": "2014-11-19T01:00:00.000+01:00",
  "quantiemeJourSeance": "2",
  "typeVote": {
    "codeTypeVote": "SPO",
    "libelleTypeVote": "scrutin public ordinaire",
    "typeMajorite": "majorité absolue des suffrages exprimés"
  },
  "sort": {
    "code": "rejeté",
    "libelle": "L'Assemblée nationale n'a pas adopté"
  },
  "titre": "l'amendement n°9 de M. Molac à l'article premier du projet de loi relatif à la délimitation des régions, aux élections régionales et départementales et modifiant le calendrier électoral (deuxième lecture).",
  "demandeur": {
    "texte": "Président du groupe écologiste"
  },
  "objet": {
    "libelle": "l'amendement n°9 de M. Molac à l'article premier du projet de loi relatif à la délimitation des régions, aux élections régionales et départementales et modifiant le calendrier électoral (deuxième lecture)."
  },
  "modePublicationDesVotes": "DecompteNominatif",
  "syntheseVote": {
    "nombreVotants": "87",
    "suffragesExprimes": "87",
    "nbrSuffragesRequis": "44",
    "annonce": "L'Assemblée nationale n'a pas adopté",
    "decompte": {
      "pour": "30",
      "contre": "57",
      "nonVotants": "2",
      "abstentions": "0"
    }
  },
  "ventilationVotes": {
    "organeRef": "PO644420",
    "groupes": [
      {
        "organeRef": "PO656002",
        "nombreMembresGroupe": "288",
        "vote": {
          "positionMajoritaire": "contre",
          "decompteVoix": {
            "pour": "1",
            "contre": "52",
            "nonVotants": "1",
            "abstentions": "0"
          },
          "decompteNominatif": {
            "nonVotants": [
              {
                "acteurRef": "PA381",
                "mandatRef": "PM645125",
                "causePositionVote": "PAN"
              }
            ],
            "pour": [
              {
                "acteurRef": "PA606631",
                "mandatRef": "PM645516"
              }
            ],
            "contre": [
              {
                "acteurRef": "PA1199",
                "mandatRef": "PM645376"
              },
              {
                "acteurRef": "PA610481",
                "mandatRef": "PM645131"
              },
              {
                "acteurRef": "PA1866",
                "mandatRef": "PM645284"
              },
              {
                "acteurRef": "PA1816",
                "mandatRef": "PM701036"
              },
              {
                "acteurRef": "PA331594",
                "mandatRef": "PM645208"
              },
              {
                "acteurRef": "PA334160",
                "mandatRef": "PM703300"
              },
              {
                "acteurRef": "PA508",
                "mandatRef": "PM645397"
              },
              {
                "acteurRef": "PA333285",
                "mandatRef": "PM701029"
              },
              {
                "acteurRef": "PA609218",
                "mandatRef": "PM645132"
              },
              {
                "acteurRef": "PA877",
                "mandatRef": "PM645349"
              },
              {
                "acteurRef": "PA2374",
                "mandatRef": "PM645217"
              },
              {
                "acteurRef": "PA2603",
                "mandatRef": "PM645552"
              },
              {
                "acteurRef": "PA2611",
                "mandatRef": "PM645436"
              },
              {
                "acteurRef": "PA606171",
                "mandatRef": "PM645255"
              },
              {
                "acteurRef": "PA331282",
                "mandatRef": "PM645480"
              },
              {
                "acteurRef": "PA608083",
                "mandatRef": "PM645142"
              },
              {
                "acteurRef": "PA267479",
                "mandatRef": "PM645504"
              },
              {
                "acteurRef": "PA267835",
                "mandatRef": "PM645134"
              },
              {
                "acteurRef": "PA343493",
                "mandatRef": "PM645385"
              },
              {
                "acteurRef": "PA605069",
                "mandatRef": "PM645534"
              },
              {
                "acteurRef": "PA335543",
                "mandatRef": "PM702197"
              },
              {
                "acteurRef": "PA336112",
                "mandatRef": "PM645253"
              },
              {
                "acteurRef": "PA335319",
                "mandatRef": "PM645070"
              },
              {
                "acteurRef": "PA331014",
                "mandatRef": "PM645422"
              },
              {
                "acteurRef": "PA332305",
                "mandatRef": "PM645562"
              },
              {
                "acteurRef": "PA331658",
                "mandatRef": "PM645277"
              },
              {
                "acteurRef": "PA332796",
                "mandatRef": "PM645193"
              },
              {
                "acteurRef": "PA605076",
                "mandatRef": "PM645535"
              },
              {
                "acteurRef": "PA605349",
                "mandatRef": "PM645483"
              },
              {
                "acteurRef": "PA605703",
                "mandatRef": "PM645418"
              },
              {
                "acteurRef": "PA605643",
                "mandatRef": "PM645405"
              },
              {
                "acteurRef": "PA606149",
                "mandatRef": "PM645218"
              },
              {
                "acteurRef": "PA606623",
                "mandatRef": "PM645513"
              },
              {
                "acteurRef": "PA606665",
                "mandatRef": "PM645526"
              },
              {
                "acteurRef": "PA607256",
                "mandatRef": "PM645247"
              },
              {
                "acteurRef": "PA607892",
                "mandatRef": "PM645460"
              },
              {
                "acteurRef": "PA608718",
                "mandatRef": "PM645610"
              },
              {
                "acteurRef": "PA609775",
                "mandatRef": "PM645329"
              },
              {
                "acteurRef": "PA609435",
                "mandatRef": "PM645211"
              },
              {
                "acteurRef": "PA610066",
                "mandatRef": "PM645059"
              },
              {
                "acteurRef": "PA610354",
                "mandatRef": "PM645106"
              },
              {
                "acteurRef": "PA607369",
                "mandatRef": "PM645318"
              },
              {
                "acteurRef": "PA608363",
                "mandatRef": "PM645571"
              },
              {
                "acteurRef": "PA609314",
                "mandatRef": "PM645145"
              },
              {
                "acteurRef": "PA609535",
                "mandatRef": "PM645236"
              },
              {
                "acteurRef": "PA606375",
                "mandatRef": "PM676790"
              },
              {
                "acteurRef": "PA642987",
                "mandatRef": "PM676803"
              },
              {
                "acteurRef": "PA608741",
                "mandatRef": "PM676810"
              },
              {
                "acteurRef": "PA642739",
                "mandatRef": "PM676811"
              },
              {
                "acteurRef": "PA342332",
                "mandatRef": "PM676816"
              },
              {
                "acteurRef": "PA267623",
                "mandatRef": "PM676817"
              },
              {
                "acteurRef": "PA643002",
                "mandatRef": "PM703297"
              }
            ]
          }
        }
      },
      {
        "organeRef": "PO656006",
        "nombreMembresGroupe": "197",
        "vote": {
          "positionMajoritaire": "pour",
          "decompteVoix": {
            "pour": "23",
            "contre": "1",
            "nonVotants": "1",
            "abstentions": "0"
          },
          "decompteNominatif": {
            "nonVotants": [
              {
                "acteurRef": "PA267797",
                "mandatRef": "PM645350",
                "causePositionVote": "PSE"
              }
            ],
            "pour": [
              {
                "acteurRef": "PA2529",
                "mandatRef": "PM645608"
              },
              {
                "acteurRef": "PA606712",
                "mandatRef": "PM645549"
              },
              {
                "acteurRef": "PA1874",
                "mandatRef": "PM645474"
              },
              {
                "acteurRef": "PA1445",
                "mandatRef": "PM645563"
              },
              {
                "acteurRef": "PA606693",
                "mandatRef": "PM645542"
              },
              {
                "acteurRef": "PA333224",
                "mandatRef": "PM645354"
              },
              {
                "acteurRef": "PA2707",
                "mandatRef": "PM645575"
              },
              {
                "acteurRef": "PA2971",
                "mandatRef": "PM645392"
              },
              {
                "acteurRef": "PA267013",
                "mandatRef": "PM645613"
              },
              {
                "acteurRef": "PA267227",
                "mandatRef": "PM645618"
              },
              {
                "acteurRef": "PA267355",
                "mandatRef": "PM645581"
              },
              {
                "acteurRef": "PA267358",
                "mandatRef": "PM645602"
              },
              {
                "acteurRef": "PA268051",
                "mandatRef": "PM645234"
              },
              {
                "acteurRef": "PA266776",
                "mandatRef": "PM645590"
              },
              {
                "acteurRef": "PA334654",
                "mandatRef": "PM645596"
              },
              {
                "acteurRef": "PA330008",
                "mandatRef": "PM645164"
              },
              {
                "acteurRef": "PA605991",
                "mandatRef": "PM645081"
              },
              {
                "acteurRef": "PA266774",
                "mandatRef": "PM645583"
              },
              {
                "acteurRef": "PA607603",
                "mandatRef": "PM645379"
              },
              {
                "acteurRef": "PA608416",
                "mandatRef": "PM645586"
              },
              {
                "acteurRef": "PA608434",
                "mandatRef": "PM645593"
              },
              {
                "acteurRef": "PA267785",
                "mandatRef": "PM645359"
              },
              {
                "acteurRef": "PA608380",
                "mandatRef": "PM645578"
              }
            ],
            "contre": [
              {
                "acteurRef": "PA267260",
                "mandatRef": "PM645459"
              }
            ]
          }
        }
      },
      {
        "organeRef": "PO656010",
        "nombreMembresGroupe": "30",
        "vote": {
          "positionMajoritaire": "contre",
          "decompteVoix": {
            "pour": "1",
            "contre": "3",
            "abstentions": "0"
          },
          "decompteNominatif": {
            "pour": [
              {
                "acteurRef": "PA332228",
                "mandatRef": "PM645546"
              }
            ],
            "contre": [
              {
                "acteurRef": "PA2597",
                "mandatRef": "PM645126"
              },
              {
                "acteurRef": "PA942",
                "mandatRef": "PM645357"
              },
              {
                "acteurRef": "PA267469",
                "mandatRef": "PM645314"
              }
            ]
          }
        }
      },
      {
        "organeRef": "PO656014",
        "nombreMembresGroupe": "18",
        "vote": {
          "positionMajoritaire": "pour",
          "decompteVoix": {
            "pour": "3",
            "contre": "0",
            "abstentions": "0"
          },
          "decompteNominatif": {
            "pour": [
              {
                "acteurRef": "PA332747",
                "mandatRef": "PM645155"
              },
              {
                "acteurRef": "PA609520",
                "mandatRef": "PM645233"
              },
              {
                "acteurRef": "PA607619",
                "mandatRef": "PM645383"
              }
            ]
          }
        }
      },
      {
        "organeRef": "PO656022",
        "nombreMembresGroupe": "17",
        "vote": {
          "positionMajoritaire": "pour",
          "decompteVoix": {
            "pour": "2",
            "contre": "1",
            "abstentions": "0"
          },
          "decompteNominatif": {
            "pour": [
              {
                "acteurRef": "PA605084",
                "mandatRef": "PM645537"
              },
              {
                "acteurRef": "PA608292",
                "mandatRef": "PM645276"
              }
            ],
            "contre": [
              {
                "acteurRef": "PA2828",
                "mandatRef": "PM645402"
              }
            ]
          }
        }
      },
      {
        "organeRef": "PO656018",
        "nombreMembresGroupe": "15",
        "vote": {
          "positionMajoritaire": "pour",
          "decompteVoix": {
            "pour": "0",
            "contre": "0",
            "abstentions": "0"
          },
          "decompteNominatif": {}
        }
      },
      {
        "organeRef": "PO645633",
        "nombreMembresGroupe": "9",
        "vote": {
          "positionMajoritaire": "pour",
          "decompteVoix": {
            "pour": "0",
            "contre": "0",
            "abstentions": "0"
          },
          "decompteNominatif": {}
        }
      }
    ]
  },
  "miseAuPoint": {
    "contre": [
      {
        "acteurRef": "PA606631",
        "mandatRef": "PM645516"
      }
    ]
  }
}