{
  "uid": "VTANR5L14V578",
  "numero": "578",
  "organeRef": "PO644420",
  "legislature": "14",
  "sessionRef": "SCR5A2013E1",
  "seanceRef": "RUANR5L14S2013IDS17434",
  "dateScrutin": "2013-07-19T02:00:00.000+02:00",
  "quantiemeJourSeance": "1",
  "typeVote": {
    "codeTypeVote": "SPO",
    "libelleTypeVote": "scrutin public ordinaire",
    "typeMajorite": "majorité absolue des suffrages exprimés"
  },
  "sort": {
    "code": "rejeté",
    "libelle": "L'Assemblée nationale n'a pas adopté"
  },
  "titre": "l'amendement n° 1079 de M. Asensi après l'article 12 du projet de loi de modernisation de l'action publique terrioriale et d'affirmation des métropoles.",
  "demandeur": {
    "texte": "Président du groupe de la gauche démocrate et républicaine"
  },
  "objet": {
    "libelle": "l'amendement n° 1079 de M. Asensi après l'article 12 du projet de loi de modernisation de l'action publique terrioriale et d'affirmation des métropoles."
  },
  "modePublicationDesVotes": "DecompteDissidentsPositionGroupe",
  "syntheseVote": {
    "nombreVotants": "74",
    "suffragesExprimes": "72",
    "nbrSuffragesRequis": "37",
    "annonce": "L'Assemblée nationale n'a pas adopté",
    "decompte": {
      "pour": "26",
      "contre": "46",
      "nonVotants": "3",
      "abstentions": "2"
    }
  },
  "ventilationVotes": {
    "organeRef": "PO644420",
    "groupes": [
      {
        "organeRef": "PO656002",
        "nombreMembresGroupe": "292",
        "vote": {
          "positionMajoritaire": "contre",
          "decompteVoix": {
            "pour": "0",
            "contre": "42",
            "nonVotants": "3",
            "abstentions": "2"
          },
          "decompteNominatif": {
            "nonVotants": [
              {
                "acteurRef": "PA381",
                "mandatRef": "PM645125",
                "causePositionVote": "PAN"
              },
              {
                "acteurRef": "PA267278",
                "mandatRef": "PM645391",
                "causePositionVote": "MG"
              },
              {
                "acteurRef": "PA335017",
                "mandatRef": "PM645607",
                "causePositionVote": "PSE"
              }
            ],
            "abstentions": [
              {
                "acteurRef": "PA610481",
                "mandatRef": "PM645131"
              },
              {
                "acteurRef": "PA341981",
                "mandatRef": "PM645444"
              }
            ]
          }
        }
      },
      {
        "organeRef": "PO656006",
        "nombreMembresGroupe": "199",
        "vote": {
          "positionMajoritaire": "pour",
          "decompteVoix": {
            "pour": "14",
            "contre": "0",
            "abstentions": "0"
          },
          "decompteNominatif": {}
        }
      },
      {
        "organeRef": "PO656010",
        "nombreMembresGroupe": "31",
        "vote": {
          "positionMajoritaire": "pour",
          "decompteVoix": {
            "pour": "4",
            "contre": "0",
            "abstentions": "0"
          },
          "decompteNominatif": {}
        }
      },
      {
        "organeRef": "PO656014",
        "nombreMembresGroupe": "17",
        "vote": {
          "positionMajoritaire": "contre",
          "decompteVoix": {
            "pour": "0",
            "contre": "2",
            "abstentions": "0"
          },
          "decompteNominatif": {}
        }
      },
      {
        "organeRef": "PO656022",
        "nombreMembresGroupe": "16",
        "vote": {
          "positionMajoritaire": "contre",
          "decompteVoix": {
            "pour": "0",
            "contre": "2",
            "abstentions": "0"
          },
          "decompteNominatif": {}
        }
      },
      {
        "organeRef": "PO656018",
        "nombreMembresGroupe": "15",
        "vote": {
          "positionMajoritaire": "pour",
          "decompteVoix": {
            "pour": "8",
            "contre": "0",
            "abstentions": "0"
          },
          "decompteNominatif": {}
        }
      },
      {
        "organeRef": "PO645633",
        "nombreMembresGroupe": "7",
        "vote": {
          "positionMajoritaire": "pour",
          "decompteVoix": {
            "pour": "0",
            "contre": "0",
            "abstentions": "0"
          },
          "decompteNominatif": {}
        }
      }
    ]
  }
}