{
  "uid": "VTANR5L14V1320",
  "numero": "1320",
  "organeRef": "PO644420",
  "legislature": "14",
  "sessionRef": "SCR5A2016E1",
  "seanceRef": "RUANR5L14S2016IDS20179",
  "dateScrutin": "2016-07-19T02:00:00.000+02:00",
  "quantiemeJourSeance": "2",
  "typeVote": {
    "codeTypeVote": "SPO",
    "libelleTypeVote": "scrutin public ordinaire",
    "typeMajorite": "majorité absolue des suffrages exprimés"
  },
  "sort": {
    "code": "rejeté",
    "libelle": "L'Assemblée nationale n'a pas adopté"
  },
  "titre": "l'amendement n° 83 de M. Le Fur après l'article premier du projet de loi prorogeant l'application de la loi n° 55-385 du 3 avril 1955 relative à l'état d'urgence (première lecture)",
  "demandeur": {
    "texte": "Président du groupe Les Républicains"
  },
  "objet": {
    "libelle": "l'amendement n° 83 de M. Le Fur après l'article premier du projet de loi prorogeant l'application de la loi n° 55-385 du 3 avril 1955 relative à l'état d'urgence (première lecture)"
  },
  "modePublicationDesVotes": "DecompteNominatif",
  "syntheseVote": {
    "nombreVotants": "308",
    "suffragesExprimes": "308",
    "nbrSuffragesRequis": "155",
    "annonce": "L'Assemblée nationale n'a pas adopté",
    "decompte": {
      "pour": "123",
      "contre": "185",
      "nonVotants": "1",
      "abstentions": "0"
    }
  },
  "ventilationVotes": {
    "organeRef": "PO644420",
    "groupes": [
      {
        "organeRef": "PO713077",
        "nombreMembresGroupe": "291",
        "vote": {
          "positionMajoritaire": "contre",
          "decompteVoix": {
            "pour": "0",
            "contre": "163",
            "nonVotants": "1",
            "abstentions": "0"
          },
          "decompteNominatif": {
            "nonVotants": [
              {
                "acteurRef": "PA381",
                "mandatRef": "PM645125",
                "causePositionVote": "PSE"
              }
            ],
            "contre": [
              {
                "acteurRef": "PA356",
                "mandatRef": "PM645358"
              },
              {
                "acteurRef": "PA543",
                "mandatRef": "PM645064"
              },
              {
                "acteurRef": "PA765",
                "mandatRef": "PM645138"
              },
              {
                "acteurRef": "PA840",
                "mandatRef": "PM645617"
              },
              {
                "acteurRef": "PA1155",
                "mandatRef": "PM645285"
              },
              {
                "acteurRef": "PA1199",
                "mandatRef": "PM645376"
              },
              {
                "acteurRef": "PA1198",
                "mandatRef": "PM645393"
              },
              {
                "acteurRef": "PA1353",
                "mandatRef": "PM645038"
              },
              {
                "acteurRef": "PA610481",
                "mandatRef": "PM645131"
              },
              {
                "acteurRef": "PA1866",
                "mandatRef": "PM645284"
              },
              {
                "acteurRef": "PA1871",
                "mandatRef": "PM645374"
              },
              {
                "acteurRef": "PA1991",
                "mandatRef": "PM645156"
              },
              {
                "acteurRef": "PA2631",
                "mandatRef": "PM645178"
              },
              {
                "acteurRef": "PA2883",
                "mandatRef": "PM645512"
              },
              {
                "acteurRef": "PA608038",
                "mandatRef": "PM645075"
              },
              {
                "acteurRef": "PA267091",
                "mandatRef": "PM645467"
              },
              {
                "acteurRef": "PA695",
                "mandatRef": "PM645503"
              },
              {
                "acteurRef": "PA334160",
                "mandatRef": "PM703300"
              },
              {
                "acteurRef": "PA508",
                "mandatRef": "PM645397"
              },
              {
                "acteurRef": "PA2895",
                "mandatRef": "PM645485"
              },
              {
                "acteurRef": "PA333285",
                "mandatRef": "PM701029"
              },
              {
                "acteurRef": "PA590034",
                "mandatRef": "PM701035"
              },
              {
                "acteurRef": "PA560",
                "mandatRef": "PM645337"
              },
              {
                "acteurRef": "PA735",
                "mandatRef": "PM645089"
              },
              {
                "acteurRef": "PA1182",
                "mandatRef": "PM645090"
              },
              {
                "acteurRef": "PA1226",
                "mandatRef": "PM645386"
              },
              {
                "acteurRef": "PA1362",
                "mandatRef": "PM645356"
              },
              {
                "acteurRef": "PA1401",
                "mandatRef": "PM645439"
              },
              {
                "acteurRef": "PA1886",
                "mandatRef": "PM645099"
              },
              {
                "acteurRef": "PA2265",
                "mandatRef": "PM645445"
              },
              {
                "acteurRef": "PA2374",
                "mandatRef": "PM645217"
              },
              {
                "acteurRef": "PA332747",
                "mandatRef": "PM645155"
              },
              {
                "acteurRef": "PA1936",
                "mandatRef": "PM645382"
              },
              {
                "acteurRef": "PA606631",
                "mandatRef": "PM645516"
              },
              {
                "acteurRef": "PA331282",
                "mandatRef": "PM645480"
              },
              {
                "acteurRef": "PA605278",
                "mandatRef": "PM645462"
              },
              {
                "acteurRef": "PA606899",
                "mandatRef": "PM645545"
              },
              {
                "acteurRef": "PA1844",
                "mandatRef": "PM645254"
              },
              {
                "acteurRef": "PA770",
                "mandatRef": "PM645361"
              },
              {
                "acteurRef": "PA608083",
                "mandatRef": "PM645142"
              },
              {
                "acteurRef": "PA608158",
                "mandatRef": "PM645174"
              },
              {
                "acteurRef": "PA608686",
                "mandatRef": "PM645601"
              },
              {
                "acteurRef": "PA2503",
                "mandatRef": "PM645187"
              },
              {
                "acteurRef": "PA267695",
                "mandatRef": "PM645213"
              },
              {
                "acteurRef": "PA267835",
                "mandatRef": "PM645134"
              },
              {
                "acteurRef": "PA267965",
                "mandatRef": "PM645052"
              },
              {
                "acteurRef": "PA1592",
                "mandatRef": "PM645232"
              },
              {
                "acteurRef": "PA590031",
                "mandatRef": "PM705598"
              },
              {
                "acteurRef": "PA1193",
                "mandatRef": "PM645344"
              },
              {
                "acteurRef": "PA605069",
                "mandatRef": "PM645534"
              },
              {
                "acteurRef": "PA332364",
                "mandatRef": "PM707194"
              },
              {
                "acteurRef": "PA331807",
                "mandatRef": "PM645367"
              },
              {
                "acteurRef": "PA331835",
                "mandatRef": "PM645380"
              },
              {
                "acteurRef": "PA332384",
                "mandatRef": "PM645528"
              },
              {
                "acteurRef": "PA334116",
                "mandatRef": "PM645114"
              },
              {
                "acteurRef": "PA330130",
                "mandatRef": "PM645541"
              },
              {
                "acteurRef": "PA330357",
                "mandatRef": "PM645453"
              },
              {
                "acteurRef": "PA334951",
                "mandatRef": "PM645594"
              },
              {
                "acteurRef": "PA335543",
                "mandatRef": "PM702197"
              },
              {
                "acteurRef": "PA336112",
                "mandatRef": "PM645253"
              },
              {
                "acteurRef": "PA335319",
                "mandatRef": "PM645070"
              },
              {
                "acteurRef": "PA336015",
                "mandatRef": "PM645222"
              },
              {
                "acteurRef": "PA267233",
                "mandatRef": "PM645115"
              },
              {
                "acteurRef": "PA334811",
                "mandatRef": "PM645587"
              },
              {
                "acteurRef": "PA331014",
                "mandatRef": "PM645422"
              },
              {
                "acteurRef": "PA331753",
                "mandatRef": "PM645348"
              },
              {
                "acteurRef": "PA332305",
                "mandatRef": "PM645562"
              },
              {
                "acteurRef": "PA330546",
                "mandatRef": "PM645492"
              },
              {
                "acteurRef": "PA330613",
                "mandatRef": "PM645522"
              },
              {
                "acteurRef": "PA2430",
                "mandatRef": "PM645411"
              },
              {
                "acteurRef": "PA332614",
                "mandatRef": "PM645110"
              },
              {
                "acteurRef": "PA332636",
                "mandatRef": "PM645118"
              },
              {
                "acteurRef": "PA331658",
                "mandatRef": "PM645277"
              },
              {
                "acteurRef": "PA332206",
                "mandatRef": "PM645538"
              },
              {
                "acteurRef": "PA332796",
                "mandatRef": "PM645193"
              },
              {
                "acteurRef": "PA344114",
                "mandatRef": "PM645092"
              },
              {
                "acteurRef": "PA342415",
                "mandatRef": "PM645532"
              },
              {
                "acteurRef": "PA605076",
                "mandatRef": "PM645535"
              },
              {
                "acteurRef": "PA605518",
                "mandatRef": "PM645500"
              },
              {
                "acteurRef": "PA605557",
                "mandatRef": "PM645507"
              },
              {
                "acteurRef": "PA340432",
                "mandatRef": "PM645471"
              },
              {
                "acteurRef": "PA605349",
                "mandatRef": "PM645483"
              },
              {
                "acteurRef": "PA605426",
                "mandatRef": "PM645517"
              },
              {
                "acteurRef": "PA605703",
                "mandatRef": "PM645418"
              },
              {
                "acteurRef": "PA341246",
                "mandatRef": "PM645469"
              },
              {
                "acteurRef": "PA605888",
                "mandatRef": "PM645476"
              },
              {
                "acteurRef": "PA605643",
                "mandatRef": "PM645405"
              },
              {
                "acteurRef": "PA606258",
                "mandatRef": "PM645347"
              },
              {
                "acteurRef": "PA605952",
                "mandatRef": "PM645049"
              },
              {
                "acteurRef": "PA605963",
                "mandatRef": "PM645055"
              },
              {
                "acteurRef": "PA606030",
                "mandatRef": "PM645123"
              },
              {
                "acteurRef": "PA606161",
                "mandatRef": "PM645250"
              },
              {
                "acteurRef": "PA606412",
                "mandatRef": "PM645400"
              },
              {
                "acteurRef": "PA606555",
                "mandatRef": "PM645477"
              },
              {
                "acteurRef": "PA606573",
                "mandatRef": "PM645484"
              },
              {
                "acteurRef": "PA606586",
                "mandatRef": "PM645490"
              },
              {
                "acteurRef": "PA341981",
                "mandatRef": "PM645444"
              },
              {
                "acteurRef": "PA606507",
                "mandatRef": "PM645406"
              },
              {
                "acteurRef": "PA606363",
                "mandatRef": "PM645388"
              },
              {
                "acteurRef": "PA606924",
                "mandatRef": "PM645527"
              },
              {
                "acteurRef": "PA606991",
                "mandatRef": "PM645098"
              },
              {
                "acteurRef": "PA606623",
                "mandatRef": "PM645513"
              },
              {
                "acteurRef": "PA606639",
                "mandatRef": "PM645521"
              },
              {
                "acteurRef": "PA606665",
                "mandatRef": "PM645526"
              },
              {
                "acteurRef": "PA606745",
                "mandatRef": "PM645560"
              },
              {
                "acteurRef": "PA607256",
                "mandatRef": "PM645247"
              },
              {
                "acteurRef": "PA607283",
                "mandatRef": "PM645259"
              },
              {
                "acteurRef": "PA607310",
                "mandatRef": "PM645297"
              },
              {
                "acteurRef": "PA607193",
                "mandatRef": "PM645179"
              },
              {
                "acteurRef": "PA607595",
                "mandatRef": "PM645377"
              },
              {
                "acteurRef": "PA607606",
                "mandatRef": "PM645381"
              },
              {
                "acteurRef": "PA607619",
                "mandatRef": "PM645383"
              },
              {
                "acteurRef": "PA607395",
                "mandatRef": "PM645343"
              },
              {
                "acteurRef": "PA607509",
                "mandatRef": "PM645369"
              },
              {
                "acteurRef": "PA607892",
                "mandatRef": "PM645460"
              },
              {
                "acteurRef": "PA607691",
                "mandatRef": "PM645401"
              },
              {
                "acteurRef": "PA607699",
                "mandatRef": "PM645403"
              },
              {
                "acteurRef": "PA607761",
                "mandatRef": "PM645482"
              },
              {
                "acteurRef": "PA607769",
                "mandatRef": "PM645494"
              },
              {
                "acteurRef": "PA608172",
                "mandatRef": "PM645197"
              },
              {
                "acteurRef": "PA608235",
                "mandatRef": "PM645229"
              },
              {
                "acteurRef": "PA608641",
                "mandatRef": "PM645579"
              },
              {
                "acteurRef": "PA608684",
                "mandatRef": "PM645599"
              },
              {
                "acteurRef": "PA608695",
                "mandatRef": "PM645605"
              },
              {
                "acteurRef": "PA608718",
                "mandatRef": "PM645610"
              },
              {
                "acteurRef": "PA608778",
                "mandatRef": "PM645565"
              },
              {
                "acteurRef": "PA609205",
                "mandatRef": "PM645128"
              },
              {
                "acteurRef": "PA609292",
                "mandatRef": "PM645169"
              },
              {
                "acteurRef": "PA609775",
                "mandatRef": "PM645329"
              },
              {
                "acteurRef": "PA609435",
                "mandatRef": "PM645211"
              },
              {
                "acteurRef": "PA609578",
                "mandatRef": "PM645256"
              },
              {
                "acteurRef": "PA609590",
                "mandatRef": "PM645261"
              },
              {
                "acteurRef": "PA610045",
                "mandatRef": "PM645041"
              },
              {
                "acteurRef": "PA610066",
                "mandatRef": "PM645059"
              },
              {
                "acteurRef": "PA609816",
                "mandatRef": "PM645334"
              },
              {
                "acteurRef": "PA672",
                "mandatRef": "PM645175"
              },
              {
                "acteurRef": "PA610354",
                "mandatRef": "PM645106"
              },
              {
                "acteurRef": "PA608363",
                "mandatRef": "PM645571"
              },
              {
                "acteurRef": "PA344242",
                "mandatRef": "PM645170"
              },
              {
                "acteurRef": "PA609314",
                "mandatRef": "PM645145"
              },
              {
                "acteurRef": "PA609535",
                "mandatRef": "PM645236"
              },
              {
                "acteurRef": "PA610075",
                "mandatRef": "PM645068"
              },
              {
                "acteurRef": "PA610529",
                "mandatRef": "PM645192"
              },
              {
                "acteurRef": "PA610594",
                "mandatRef": "PM645185"
              },
              {
                "acteurRef": "PA610203",
                "mandatRef": "PM645065"
              },
              {
                "acteurRef": "PA609963",
                "mandatRef": "PM645045"
              },
              {
                "acteurRef": "PA608011",
                "mandatRef": "PM645066"
              },
              {
                "acteurRef": "PA608264",
                "mandatRef": "PM645248"
              },
              {
                "acteurRef": "PA610905",
                "mandatRef": "PM645225"
              },
              {
                "acteurRef": "PA642987",
                "mandatRef": "PM676803"
              },
              {
                "acteurRef": "PA642940",
                "mandatRef": "PM676814"
              },
              {
                "acteurRef": "PA342539",
                "mandatRef": "PM703295"
              },
              {
                "acteurRef": "PA335999",
                "mandatRef": "PM696536"
              },
              {
                "acteurRef": "PA343408",
                "mandatRef": "PM701217"
              },
              {
                "acteurRef": "PA643205",
                "mandatRef": "PM701215"
              },
              {
                "acteurRef": "PA643002",
                "mandatRef": "PM703297"
              },
              {
                "acteurRef": "PA642805",
                "mandatRef": "PM703478"
              },
              {
                "acteurRef": "PA643177",
                "mandatRef": "PM709055"
              },
              {
                "acteurRef": "PA642790",
                "mandatRef": "PM709217"
              },
              {
                "acteurRef": "PA642736",
                "mandatRef": "PM711657"
              },
              {
                "acteurRef": "PA642965",
                "mandatRef": "PM711810"
              },
              {
                "acteurRef": "PA643165",
                "mandatRef": "PM711811"
              },
              {
                "acteurRef": "PA344545",
                "mandatRef": "PM713452"
              }
            ]
          }
        }
      },
      {
        "organeRef": "PO707869",
        "nombreMembresGroupe": "198",
        "vote": {
          "positionMajoritaire": "pour",
          "decompteVoix": {
            "pour": "113",
            "contre": "0",
            "abstentions": "0"
          },
          "decompteNominatif": {
            "pour": [
              {
                "acteurRef": "PA346",
                "mandatRef": "PM645086"
              },
              {
                "acteurRef": "PA951",
                "mandatRef": "PM645280"
              },
              {
                "acteurRef": "PA1020",
                "mandatRef": "PM645057"
              },
              {
                "acteurRef": "PA1761",
                "mandatRef": "PM645501"
              },
              {
                "acteurRef": "PA1954",
                "mandatRef": "PM645195"
              },
              {
                "acteurRef": "PA2048",
                "mandatRef": "PM693013"
              },
              {
                "acteurRef": "PA2191",
                "mandatRef": "PM645141"
              },
              {
                "acteurRef": "PA2250",
                "mandatRef": "PM645539"
              },
              {
                "acteurRef": "PA2801",
                "mandatRef": "PM645576"
              },
              {
                "acteurRef": "PA2936",
                "mandatRef": "PM645272"
              },
              {
                "acteurRef": "PA259",
                "mandatRef": "PM645395"
              },
              {
                "acteurRef": "PA2377",
                "mandatRef": "PM645591"
              },
              {
                "acteurRef": "PA267689",
                "mandatRef": "PM645295"
              },
              {
                "acteurRef": "PA333134",
                "mandatRef": "PM645341"
              },
              {
                "acteurRef": "PA606712",
                "mandatRef": "PM645549"
              },
              {
                "acteurRef": "PA330240",
                "mandatRef": "PM645425"
              },
              {
                "acteurRef": "PA856",
                "mandatRef": "PM645353"
              },
              {
                "acteurRef": "PA923",
                "mandatRef": "PM645363"
              },
              {
                "acteurRef": "PA1585",
                "mandatRef": "PM645094"
              },
              {
                "acteurRef": "PA1661",
                "mandatRef": "PM645181"
              },
              {
                "acteurRef": "PA1874",
                "mandatRef": "PM645474"
              },
              {
                "acteurRef": "PA2099",
                "mandatRef": "PM645101"
              },
              {
                "acteurRef": "PA2277",
                "mandatRef": "PM645135"
              },
              {
                "acteurRef": "PA609365",
                "mandatRef": "PM645191"
              },
              {
                "acteurRef": "PA1152",
                "mandatRef": "PM645561"
              },
              {
                "acteurRef": "PA1521",
                "mandatRef": "PM645078"
              },
              {
                "acteurRef": "PA1498",
                "mandatRef": "PM645080"
              },
              {
                "acteurRef": "PA1445",
                "mandatRef": "PM645563"
              },
              {
                "acteurRef": "PA606693",
                "mandatRef": "PM645542"
              },
              {
                "acteurRef": "PA1695",
                "mandatRef": "PM645157"
              },
              {
                "acteurRef": "PA267797",
                "mandatRef": "PM645350"
              },
              {
                "acteurRef": "PA606098",
                "mandatRef": "PM645171"
              },
              {
                "acteurRef": "PA1379",
                "mandatRef": "PM645433"
              },
              {
                "acteurRef": "PA1574",
                "mandatRef": "PM645430"
              },
              {
                "acteurRef": "PA1946",
                "mandatRef": "PM645437"
              },
              {
                "acteurRef": "PA346876",
                "mandatRef": "PM645097"
              },
              {
                "acteurRef": "PA2971",
                "mandatRef": "PM645392"
              },
              {
                "acteurRef": "PA266788",
                "mandatRef": "PM645294"
              },
              {
                "acteurRef": "PA2229",
                "mandatRef": "PM645205"
              },
              {
                "acteurRef": "PA334843",
                "mandatRef": "PM645589"
              },
              {
                "acteurRef": "PA267013",
                "mandatRef": "PM645613"
              },
              {
                "acteurRef": "PA267165",
                "mandatRef": "PM645360"
              },
              {
                "acteurRef": "PA267200",
                "mandatRef": "PM645502"
              },
              {
                "acteurRef": "PA267204",
                "mandatRef": "PM645551"
              },
              {
                "acteurRef": "PA267246",
                "mandatRef": "PM645340"
              },
              {
                "acteurRef": "PA267260",
                "mandatRef": "PM645459"
              },
              {
                "acteurRef": "PA267289",
                "mandatRef": "PM645242"
              },
              {
                "acteurRef": "PA267327",
                "mandatRef": "PM645031"
              },
              {
                "acteurRef": "PA267355",
                "mandatRef": "PM645581"
              },
              {
                "acteurRef": "PA267378",
                "mandatRef": "PM645266"
              },
              {
                "acteurRef": "PA267429",
                "mandatRef": "PM645130"
              },
              {
                "acteurRef": "PA267459",
                "mandatRef": "PM645564"
              },
              {
                "acteurRef": "PA267506",
                "mandatRef": "PM645270"
              },
              {
                "acteurRef": "PA267527",
                "mandatRef": "PM645555"
              },
              {
                "acteurRef": "PA267598",
                "mandatRef": "PM645286"
              },
              {
                "acteurRef": "PA267743",
                "mandatRef": "PM645058"
              },
              {
                "acteurRef": "PA267775",
                "mandatRef": "PM645585"
              },
              {
                "acteurRef": "PA267794",
                "mandatRef": "PM645442"
              },
              {
                "acteurRef": "PA267813",
                "mandatRef": "PM645172"
              },
              {
                "acteurRef": "PA267886",
                "mandatRef": "PM645188"
              },
              {
                "acteurRef": "PA2700",
                "mandatRef": "PM645196"
              },
              {
                "acteurRef": "PA2792",
                "mandatRef": "PM645308"
              },
              {
                "acteurRef": "PA266776",
                "mandatRef": "PM645590"
              },
              {
                "acteurRef": "PA267628",
                "mandatRef": "PM645046"
              },
              {
                "acteurRef": "PA608826",
                "mandatRef": "PM645556"
              },
              {
                "acteurRef": "PA267532",
                "mandatRef": "PM645558"
              },
              {
                "acteurRef": "PA267285",
                "mandatRef": "PM645140"
              },
              {
                "acteurRef": "PA267680",
                "mandatRef": "PM645427"
              },
              {
                "acteurRef": "PA605036",
                "mandatRef": "PM645278"
              },
              {
                "acteurRef": "PA1459",
                "mandatRef": "PM645518"
              },
              {
                "acteurRef": "PA1012",
                "mandatRef": "PM645168"
              },
              {
                "acteurRef": "PA267551",
                "mandatRef": "PM645372"
              },
              {
                "acteurRef": "PA243",
                "mandatRef": "PM645167"
              },
              {
                "acteurRef": "PA330008",
                "mandatRef": "PM645164"
              },
              {
                "acteurRef": "PA336576",
                "mandatRef": "PM645364"
              },
              {
                "acteurRef": "PA266797",
                "mandatRef": "PM645338"
              },
              {
                "acteurRef": "PA335567",
                "mandatRef": "PM645104"
              },
              {
                "acteurRef": "PA334906",
                "mandatRef": "PM645577"
              },
              {
                "acteurRef": "PA267450",
                "mandatRef": "PM645452"
              },
              {
                "acteurRef": "PA330684",
                "mandatRef": "PM645497"
              },
              {
                "acteurRef": "PA330788",
                "mandatRef": "PM645510"
              },
              {
                "acteurRef": "PA331146",
                "mandatRef": "PM645306"
              },
              {
                "acteurRef": "PA342935",
                "mandatRef": "PM645244"
              },
              {
                "acteurRef": "PA417099",
                "mandatRef": "PM645346"
              },
              {
                "acteurRef": "PA605991",
                "mandatRef": "PM645081"
              },
              {
                "acteurRef": "PA422119",
                "mandatRef": "PM645183"
              },
              {
                "acteurRef": "PA266774",
                "mandatRef": "PM645583"
              },
              {
                "acteurRef": "PA606478",
                "mandatRef": "PM645457"
              },
              {
                "acteurRef": "PA606888",
                "mandatRef": "PM645543"
              },
              {
                "acteurRef": "PA267735",
                "mandatRef": "PM645237"
              },
              {
                "acteurRef": "PA607090",
                "mandatRef": "PM645143"
              },
              {
                "acteurRef": "PA607603",
                "mandatRef": "PM645379"
              },
              {
                "acteurRef": "PA608016",
                "mandatRef": "PM645071"
              },
              {
                "acteurRef": "PA608662",
                "mandatRef": "PM645592"
              },
              {
                "acteurRef": "PA344776",
                "mandatRef": "PM645584"
              },
              {
                "acteurRef": "PA608416",
                "mandatRef": "PM645586"
              },
              {
                "acteurRef": "PA608851",
                "mandatRef": "PM645559"
              },
              {
                "acteurRef": "PA609245",
                "mandatRef": "PM645150"
              },
              {
                "acteurRef": "PA609740",
                "mandatRef": "PM645319"
              },
              {
                "acteurRef": "PA314",
                "mandatRef": "PM645292"
              },
              {
                "acteurRef": "PA267785",
                "mandatRef": "PM645359"
              },
              {
                "acteurRef": "PA609726",
                "mandatRef": "PM645311"
              },
              {
                "acteurRef": "PA607489",
                "mandatRef": "PM645366"
              },
              {
                "acteurRef": "PA610924",
                "mandatRef": "PM645227"
              },
              {
                "acteurRef": "PA687214",
                "mandatRef": "PM687217"
              },
              {
                "acteurRef": "PA695511",
                "mandatRef": "PM695513"
              },
              {
                "acteurRef": "PA642759",
                "mandatRef": "PM701660"
              },
              {
                "acteurRef": "PA709315",
                "mandatRef": "PM709318"
              },
              {
                "acteurRef": "PA712015",
                "mandatRef": "PM712024"
              },
              {
                "acteurRef": "PA712014",
                "mandatRef": "PM712023"
              },
              {
                "acteurRef": "PA712016",
                "mandatRef": "PM712025"
              },
              {
                "acteurRef": "PA713448",
                "mandatRef": "PM713451"
              },
              {
                "acteurRef": "PA643183",
                "mandatRef": "PM713680"
              }
            ]
          }
        }
      },
      {
        "organeRef": "PO656010",
        "nombreMembresGroupe": "30",
        "vote": {
          "positionMajoritaire": "pour",
          "decompteVoix": {
            "pour": "6",
            "contre": "1",
            "abstentions": "0"
          },
          "decompteNominatif": {
            "pour": [
              {
                "acteurRef": "PA2597",
                "mandatRef": "PM645126"
              },
              {
                "acteurRef": "PA267042",
                "mandatRef": "PM645368"
              },
              {
                "acteurRef": "PA332228",
                "mandatRef": "PM645546"
              },
              {
                "acteurRef": "PA702053",
                "mandatRef": "PM702060"
              },
              {
                "acteurRef": "PA702052",
                "mandatRef": "PM702062"
              },
              {
                "acteurRef": "PA642876",
                "mandatRef": "PM712393"
              }
            ],
            "contre": [
              {
                "acteurRef": "PA333421",
                "mandatRef": "PM645375"
              }
            ]
          }
        }
      },
      {
        "organeRef": "PO645633",
        "nombreMembresGroupe": "25",
        "vote": {
          "positionMajoritaire": "contre",
          "decompteVoix": {
            "pour": "4",
            "contre": "9",
            "abstentions": "0"
          },
          "decompteNominatif": {
            "pour": [
              {
                "acteurRef": "PA563",
                "mandatRef": "PM645307"
              },
              {
                "acteurRef": "PA1206",
                "mandatRef": "PM645054"
              },
              {
                "acteurRef": "PA606212",
                "mandatRef": "PM645330"
              },
              {
                "acteurRef": "PA609709",
                "mandatRef": "PM645302"
              }
            ],
            "contre": [
              {
                "acteurRef": "PA271",
                "mandatRef": "PM645515"
              },
              {
                "acteurRef": "PA608672",
                "mandatRef": "PM645597"
              },
              {
                "acteurRef": "PA608186",
                "mandatRef": "PM645202"
              },
              {
                "acteurRef": "PA605625",
                "mandatRef": "PM645398"
              },
              {
                "acteurRef": "PA606545",
                "mandatRef": "PM645470"
              },
              {
                "acteurRef": "PA607632",
                "mandatRef": "PM645387"
              },
              {
                "acteurRef": "PA588872",
                "mandatRef": "PM701032"
              },
              {
                "acteurRef": "PA610427",
                "mandatRef": "PM645158"
              },
              {
                "acteurRef": "PA606910",
                "mandatRef": "PM645547"
              }
            ]
          }
        }
      },
      {
        "organeRef": "PO656022",
        "nombreMembresGroupe": "18",
        "vote": {
          "positionMajoritaire": "contre",
          "decompteVoix": {
            "pour": "0",
            "contre": "8",
            "abstentions": "0"
          },
          "decompteNominatif": {
            "contre": [
              {
                "acteurRef": "PA1809",
                "mandatRef": "PM645415"
              },
              {
                "acteurRef": "PA2713",
                "mandatRef": "PM645148"
              },
              {
                "acteurRef": "PA2828",
                "mandatRef": "PM645402"
              },
              {
                "acteurRef": "PA267336",
                "mandatRef": "PM645424"
              },
              {
                "acteurRef": "PA608292",
                "mandatRef": "PM645276"
              },
              {
                "acteurRef": "PA610521",
                "mandatRef": "PM645190"
              },
              {
                "acteurRef": "PA642684",
                "mandatRef": "PM663906"
              },
              {
                "acteurRef": "PA702054",
                "mandatRef": "PM702804"
              }
            ]
          }
        }
      },
      {
        "organeRef": "PO656018",
        "nombreMembresGroupe": "15",
        "vote": {
          "positionMajoritaire": "contre",
          "decompteVoix": {
            "pour": "0",
            "contre": "4",
            "abstentions": "0"
          },
          "decompteNominatif": {
            "contre": [
              {
                "acteurRef": "PA1141",
                "mandatRef": "PM645468"
              },
              {
                "acteurRef": "PA754",
                "mandatRef": "PM645050"
              },
              {
                "acteurRef": "PA605745",
                "mandatRef": "PM645435"
              },
              {
                "acteurRef": "PA340755",
                "mandatRef": "PM645506"
              }
            ]
          }
        }
      }
    ]
  }
}