{
  "uid": "VTANR5L14V975",
  "numero": "975",
  "organeRef": "PO644420",
  "legislature": "14",
  "sessionRef": "SCR5A2015O1",
  "seanceRef": "RUANR5L14S2015IDS18821",
  "dateScrutin": "2014-11-26T01:00:00.000+01:00",
  "quantiemeJourSeance": "1",
  "typeVote": {
    "codeTypeVote": "SPO",
    "libelleTypeVote": "scrutin public ordinaire",
    "typeMajorite": "majorité absolue des suffrages exprimés"
  },
  "sort": {
    "code": "adopté",
    "libelle": "l'Assemblée nationale a adopté"
  },
  "titre": "la proposition de résolution visant à réaffirmer le droit fondamental à l'Interruption Volontaire de Grossesse en France et en Europe.",
  "demandeur": {
    "texte": "Président du groupe socialiste, républicain et citoyen"
  },
  "objet": {
    "libelle": "la proposition de résolution visant à réaffirmer le droit fondamental à l'Interruption Volontaire de Grossesse en France et en Europe."
  },
  "modePublicationDesVotes": "DecompteNominatif",
  "syntheseVote": {
    "nombreVotants": "151",
    "suffragesExprimes": "150",
    "nbrSuffragesRequis": "76",
    "annonce": "l'Assemblée nationale a adopté",
    "decompte": {
      "pour": "143",
      "contre": "7",
      "nonVotants": "1",
      "abstentions": "1"
    }
  },
  "ventilationVotes": {
    "organeRef": "PO644420",
    "groupes": [
      {
        "organeRef": "PO656002",
        "nombreMembresGroupe": "288",
        "vote": {
          "positionMajoritaire": "pour",
          "decompteVoix": {
            "pour": "96",
            "contre": "0",
            "nonVotants": "1",
            "abstentions": "0"
          },
          "decompteNominatif": {
            "nonVotants": [
              {
                "acteurRef": "PA381",
                "mandatRef": "PM645125",
                "causePositionVote": "PSE"
              }
            ],
            "pour": [
              {
                "acteurRef": "PA543",
                "mandatRef": "PM645064"
              },
              {
                "acteurRef": "PA1155",
                "mandatRef": "PM645285"
              },
              {
                "acteurRef": "PA1252",
                "mandatRef": "PM645095"
              },
              {
                "acteurRef": "PA610481",
                "mandatRef": "PM645131"
              },
              {
                "acteurRef": "PA1991",
                "mandatRef": "PM645156"
              },
              {
                "acteurRef": "PA2859",
                "mandatRef": "PM645087"
              },
              {
                "acteurRef": "PA1816",
                "mandatRef": "PM701036"
              },
              {
                "acteurRef": "PA608038",
                "mandatRef": "PM645075"
              },
              {
                "acteurRef": "PA607187",
                "mandatRef": "PM645224"
              },
              {
                "acteurRef": "PA267091",
                "mandatRef": "PM645467"
              },
              {
                "acteurRef": "PA331594",
                "mandatRef": "PM645208"
              },
              {
                "acteurRef": "PA1496",
                "mandatRef": "PM645273"
              },
              {
                "acteurRef": "PA1710",
                "mandatRef": "PM645166"
              },
              {
                "acteurRef": "PA590034",
                "mandatRef": "PM701035"
              },
              {
                "acteurRef": "PA1689",
                "mandatRef": "PM645378"
              },
              {
                "acteurRef": "PA1911",
                "mandatRef": "PM645152"
              },
              {
                "acteurRef": "PA1886",
                "mandatRef": "PM645099"
              },
              {
                "acteurRef": "PA2374",
                "mandatRef": "PM645217"
              },
              {
                "acteurRef": "PA2611",
                "mandatRef": "PM645436"
              },
              {
                "acteurRef": "PA335017",
                "mandatRef": "PM645607"
              },
              {
                "acteurRef": "PA608083",
                "mandatRef": "PM645142"
              },
              {
                "acteurRef": "PA608158",
                "mandatRef": "PM645174"
              },
              {
                "acteurRef": "PA267188",
                "mandatRef": "PM645410"
              },
              {
                "acteurRef": "PA267965",
                "mandatRef": "PM645052"
              },
              {
                "acteurRef": "PA268042",
                "mandatRef": "PM645241"
              },
              {
                "acteurRef": "PA343493",
                "mandatRef": "PM645385"
              },
              {
                "acteurRef": "PA334116",
                "mandatRef": "PM645114"
              },
              {
                "acteurRef": "PA335054",
                "mandatRef": "PM645614"
              },
              {
                "acteurRef": "PA334951",
                "mandatRef": "PM645594"
              },
              {
                "acteurRef": "PA267923",
                "mandatRef": "PM645120"
              },
              {
                "acteurRef": "PA336421",
                "mandatRef": "PM645332"
              },
              {
                "acteurRef": "PA335319",
                "mandatRef": "PM645070"
              },
              {
                "acteurRef": "PA336015",
                "mandatRef": "PM645222"
              },
              {
                "acteurRef": "PA332015",
                "mandatRef": "PM645414"
              },
              {
                "acteurRef": "PA334811",
                "mandatRef": "PM645587"
              },
              {
                "acteurRef": "PA331014",
                "mandatRef": "PM645422"
              },
              {
                "acteurRef": "PA331753",
                "mandatRef": "PM645348"
              },
              {
                "acteurRef": "PA331658",
                "mandatRef": "PM645277"
              },
              {
                "acteurRef": "PA332206",
                "mandatRef": "PM645538"
              },
              {
                "acteurRef": "PA330981",
                "mandatRef": "PM645409"
              },
              {
                "acteurRef": "PA342415",
                "mandatRef": "PM645532"
              },
              {
                "acteurRef": "PA605076",
                "mandatRef": "PM645535"
              },
              {
                "acteurRef": "PA605349",
                "mandatRef": "PM645483"
              },
              {
                "acteurRef": "PA605426",
                "mandatRef": "PM645517"
              },
              {
                "acteurRef": "PA605703",
                "mandatRef": "PM645418"
              },
              {
                "acteurRef": "PA605830",
                "mandatRef": "PM645454"
              },
              {
                "acteurRef": "PA341246",
                "mandatRef": "PM645469"
              },
              {
                "acteurRef": "PA605888",
                "mandatRef": "PM645476"
              },
              {
                "acteurRef": "PA605804",
                "mandatRef": "PM645450"
              },
              {
                "acteurRef": "PA605606",
                "mandatRef": "PM645394"
              },
              {
                "acteurRef": "PA605952",
                "mandatRef": "PM645049"
              },
              {
                "acteurRef": "PA606161",
                "mandatRef": "PM645250"
              },
              {
                "acteurRef": "PA606573",
                "mandatRef": "PM645484"
              },
              {
                "acteurRef": "PA606586",
                "mandatRef": "PM645490"
              },
              {
                "acteurRef": "PA606924",
                "mandatRef": "PM645527"
              },
              {
                "acteurRef": "PA606991",
                "mandatRef": "PM645098"
              },
              {
                "acteurRef": "PA606623",
                "mandatRef": "PM645513"
              },
              {
                "acteurRef": "PA606665",
                "mandatRef": "PM645526"
              },
              {
                "acteurRef": "PA606675",
                "mandatRef": "PM645533"
              },
              {
                "acteurRef": "PA607256",
                "mandatRef": "PM645247"
              },
              {
                "acteurRef": "PA607283",
                "mandatRef": "PM645259"
              },
              {
                "acteurRef": "PA607310",
                "mandatRef": "PM645297"
              },
              {
                "acteurRef": "PA607595",
                "mandatRef": "PM645377"
              },
              {
                "acteurRef": "PA607606",
                "mandatRef": "PM645381"
              },
              {
                "acteurRef": "PA607395",
                "mandatRef": "PM645343"
              },
              {
                "acteurRef": "PA607553",
                "mandatRef": "PM645373"
              },
              {
                "acteurRef": "PA608310",
                "mandatRef": "PM645293"
              },
              {
                "acteurRef": "PA608348",
                "mandatRef": "PM645322"
              },
              {
                "acteurRef": "PA608172",
                "mandatRef": "PM645197"
              },
              {
                "acteurRef": "PA608684",
                "mandatRef": "PM645599"
              },
              {
                "acteurRef": "PA608718",
                "mandatRef": "PM645610"
              },
              {
                "acteurRef": "PA608778",
                "mandatRef": "PM645565"
              },
              {
                "acteurRef": "PA608785",
                "mandatRef": "PM645567"
              },
              {
                "acteurRef": "PA608920",
                "mandatRef": "PM645060"
              },
              {
                "acteurRef": "PA609775",
                "mandatRef": "PM645329"
              },
              {
                "acteurRef": "PA609435",
                "mandatRef": "PM645211"
              },
              {
                "acteurRef": "PA610066",
                "mandatRef": "PM645059"
              },
              {
                "acteurRef": "PA609845",
                "mandatRef": "PM645339"
              },
              {
                "acteurRef": "PA672",
                "mandatRef": "PM645175"
              },
              {
                "acteurRef": "PA610313",
                "mandatRef": "PM645122"
              },
              {
                "acteurRef": "PA344242",
                "mandatRef": "PM645170"
              },
              {
                "acteurRef": "PA610681",
                "mandatRef": "PM645275"
              },
              {
                "acteurRef": "PA609963",
                "mandatRef": "PM645045"
              },
              {
                "acteurRef": "PA608264",
                "mandatRef": "PM645248"
              },
              {
                "acteurRef": "PA610905",
                "mandatRef": "PM645225"
              },
              {
                "acteurRef": "PA642788",
                "mandatRef": "PM676805"
              },
              {
                "acteurRef": "PA608741",
                "mandatRef": "PM676810"
              },
              {
                "acteurRef": "PA642940",
                "mandatRef": "PM676814"
              },
              {
                "acteurRef": "PA342332",
                "mandatRef": "PM676816"
              },
              {
                "acteurRef": "PA267623",
                "mandatRef": "PM676817"
              },
              {
                "acteurRef": "PA643069",
                "mandatRef": "PM701218"
              },
              {
                "acteurRef": "PA343408",
                "mandatRef": "PM701217"
              },
              {
                "acteurRef": "PA643205",
                "mandatRef": "PM701215"
              },
              {
                "acteurRef": "PA643020",
                "mandatRef": "PM702199"
              },
              {
                "acteurRef": "PA643002",
                "mandatRef": "PM703297"
              },
              {
                "acteurRef": "PA642805",
                "mandatRef": "PM703478"
              }
            ]
          }
        }
      },
      {
        "organeRef": "PO656006",
        "nombreMembresGroupe": "197",
        "vote": {
          "positionMajoritaire": "pour",
          "decompteVoix": {
            "pour": "27",
            "contre": "5",
            "abstentions": "0"
          },
          "decompteNominatif": {
            "pour": [
              {
                "acteurRef": "PA1310",
                "mandatRef": "PM645047"
              },
              {
                "acteurRef": "PA1954",
                "mandatRef": "PM645195"
              },
              {
                "acteurRef": "PA259",
                "mandatRef": "PM645395"
              },
              {
                "acteurRef": "PA606712",
                "mandatRef": "PM645549"
              },
              {
                "acteurRef": "PA2257",
                "mandatRef": "PM645201"
              },
              {
                "acteurRef": "PA333224",
                "mandatRef": "PM645354"
              },
              {
                "acteurRef": "PA1695",
                "mandatRef": "PM645157"
              },
              {
                "acteurRef": "PA917",
                "mandatRef": "PM645163"
              },
              {
                "acteurRef": "PA2086",
                "mandatRef": "PM645043"
              },
              {
                "acteurRef": "PA1946",
                "mandatRef": "PM645437"
              },
              {
                "acteurRef": "PA346876",
                "mandatRef": "PM645097"
              },
              {
                "acteurRef": "PA2971",
                "mandatRef": "PM645392"
              },
              {
                "acteurRef": "PA1029",
                "mandatRef": "PM645524"
              },
              {
                "acteurRef": "PA267260",
                "mandatRef": "PM645459"
              },
              {
                "acteurRef": "PA267266",
                "mandatRef": "PM645489"
              },
              {
                "acteurRef": "PA267459",
                "mandatRef": "PM645564"
              },
              {
                "acteurRef": "PA267605",
                "mandatRef": "PM645189"
              },
              {
                "acteurRef": "PA267895",
                "mandatRef": "PM645199"
              },
              {
                "acteurRef": "PA2124",
                "mandatRef": "PM645475"
              },
              {
                "acteurRef": "PA2792",
                "mandatRef": "PM645308"
              },
              {
                "acteurRef": "PA267628",
                "mandatRef": "PM645046"
              },
              {
                "acteurRef": "PA605036",
                "mandatRef": "PM645278"
              },
              {
                "acteurRef": "PA267450",
                "mandatRef": "PM645452"
              },
              {
                "acteurRef": "PA608016",
                "mandatRef": "PM645071"
              },
              {
                "acteurRef": "PA609245",
                "mandatRef": "PM645150"
              },
              {
                "acteurRef": "PA610924",
                "mandatRef": "PM645227"
              },
              {
                "acteurRef": "PA642759",
                "mandatRef": "PM701660"
              }
            ],
            "contre": [
              {
                "acteurRef": "PA606098",
                "mandatRef": "PM645171"
              },
              {
                "acteurRef": "PA345937",
                "mandatRef": "PM645177"
              },
              {
                "acteurRef": "PA267178",
                "mandatRef": "PM645473"
              },
              {
                "acteurRef": "PA330008",
                "mandatRef": "PM645164"
              },
              {
                "acteurRef": "PA609764",
                "mandatRef": "PM645323"
              }
            ]
          }
        }
      },
      {
        "organeRef": "PO656010",
        "nombreMembresGroupe": "30",
        "vote": {
          "positionMajoritaire": "pour",
          "decompteVoix": {
            "pour": "5",
            "contre": "1",
            "abstentions": "0"
          },
          "decompteNominatif": {
            "pour": [
              {
                "acteurRef": "PA2690",
                "mandatRef": "PM645458"
              },
              {
                "acteurRef": "PA267330",
                "mandatRef": "PM645032"
              },
              {
                "acteurRef": "PA332228",
                "mandatRef": "PM645546"
              },
              {
                "acteurRef": "PA610770",
                "mandatRef": "PM645305"
              },
              {
                "acteurRef": "PA702052",
                "mandatRef": "PM702062"
              }
            ],
            "contre": [
              {
                "acteurRef": "PA610125",
                "mandatRef": "PM645088"
              }
            ]
          }
        }
      },
      {
        "organeRef": "PO656014",
        "nombreMembresGroupe": "18",
        "vote": {
          "positionMajoritaire": "pour",
          "decompteVoix": {
            "pour": "5",
            "contre": "0",
            "abstentions": "0"
          },
          "decompteNominatif": {
            "pour": [
              {
                "acteurRef": "PA332747",
                "mandatRef": "PM645155"
              },
              {
                "acteurRef": "PA609520",
                "mandatRef": "PM645233"
              },
              {
                "acteurRef": "PA610860",
                "mandatRef": "PM645212"
              },
              {
                "acteurRef": "PA609816",
                "mandatRef": "PM645334"
              },
              {
                "acteurRef": "PA606910",
                "mandatRef": "PM645547"
              }
            ]
          }
        }
      },
      {
        "organeRef": "PO656022",
        "nombreMembresGroupe": "17",
        "vote": {
          "positionMajoritaire": "pour",
          "decompteVoix": {
            "pour": "5",
            "contre": "0",
            "abstentions": "0"
          },
          "decompteNominatif": {
            "pour": [
              {
                "acteurRef": "PA267407",
                "mandatRef": "PM645320"
              },
              {
                "acteurRef": "PA605694",
                "mandatRef": "PM645416"
              },
              {
                "acteurRef": "PA608292",
                "mandatRef": "PM645276"
              },
              {
                "acteurRef": "PA346170",
                "mandatRef": "PM676815"
              },
              {
                "acteurRef": "PA702054",
                "mandatRef": "PM702804"
              }
            ]
          }
        }
      },
      {
        "organeRef": "PO656018",
        "nombreMembresGroupe": "15",
        "vote": {
          "positionMajoritaire": "pour",
          "decompteVoix": {
            "pour": "5",
            "contre": "0",
            "abstentions": "0"
          },
          "decompteNominatif": {
            "pour": [
              {
                "acteurRef": "PA1141",
                "mandatRef": "PM645468"
              },
              {
                "acteurRef": "PA1364",
                "mandatRef": "PM645084"
              },
              {
                "acteurRef": "PA689",
                "mandatRef": "PM645113"
              },
              {
                "acteurRef": "PA754",
                "mandatRef": "PM645050"
              },
              {
                "acteurRef": "PA267306",
                "mandatRef": "PM645210"
              }
            ]
          }
        }
      },
      {
        "organeRef": "PO645633",
        "nombreMembresGroupe": "9",
        "vote": {
          "positionMajoritaire": "contre",
          "decompteVoix": {
            "pour": "0",
            "contre": "1",
            "abstentions": "1"
          },
          "decompteNominatif": {
            "contre": [
              {
                "acteurRef": "PA563",
                "mandatRef": "PM645307"
              }
            ],
            "abstentions": [
              {
                "acteurRef": "PA606212",
                "mandatRef": "PM645330"
              }
            ]
          }
        }
      }
    ]
  }
}