{
  "uid": "VTANR5L14V289",
  "numero": "289",
  "organeRef": "PO644420",
  "legislature": "14",
  "sessionRef": "SCR5A2013O1",
  "seanceRef": "RUANR5L14S2013IDS16927",
  "dateScrutin": "2013-03-14T01:00:00.000+01:00",
  "quantiemeJourSeance": "3",
  "typeVote": {
    "codeTypeVote": "SPO",
    "libelleTypeVote": "scrutin public ordinaire",
    "typeMajorite": "majorité absolue des suffrages exprimés"
  },
  "sort": {
    "code": "adopté",
    "libelle": "l'Assemblée nationale a adopté"
  },
  "titre": "l'article 1er et le rapport annexé du projet de loi d'orientation et de programmation pour la refondation de l'école.",
  "demandeur": {
    "texte": "Président du groupe socialiste, républicain et citoyen"
  },
  "objet": {
    "libelle": "l'article 1er et le rapport annexé du projet de loi d'orientation et de programmation pour la refondation de l'école."
  },
  "modePublicationDesVotes": "DecompteDissidentsPositionGroupe",
  "syntheseVote": {
    "nombreVotants": "87",
    "suffragesExprimes": "87",
    "nbrSuffragesRequis": "44",
    "annonce": "l'Assemblée nationale a adopté",
    "decompte": {
      "pour": "70",
      "contre": "17",
      "nonVotants": "2",
      "abstentions": "0"
    }
  },
  "ventilationVotes": {
    "organeRef": "PO644420",
    "groupes": [
      {
        "organeRef": "PO656002",
        "nombreMembresGroupe": "293",
        "vote": {
          "positionMajoritaire": "pour",
          "decompteVoix": {
            "pour": "62",
            "contre": "2",
            "nonVotants": "2",
            "abstentions": "0"
          },
          "decompteNominatif": {
            "nonVotants": [
              {
                "acteurRef": "PA381",
                "mandatRef": "PM645125",
                "causePositionVote": "PAN"
              },
              {
                "acteurRef": "PA335017",
                "mandatRef": "PM645607",
                "causePositionVote": "PSE"
              }
            ],
            "contre": [
              {
                "acteurRef": "PA356",
                "mandatRef": "PM645358"
              },
              {
                "acteurRef": "PA642682",
                "mandatRef": "PM676798"
              }
            ]
          }
        }
      },
      {
        "organeRef": "PO656006",
        "nombreMembresGroupe": "195",
        "vote": {
          "positionMajoritaire": "contre",
          "decompteVoix": {
            "pour": "0",
            "contre": "13",
            "abstentions": "0"
          },
          "decompteNominatif": {}
        }
      },
      {
        "organeRef": "PO656010",
        "nombreMembresGroupe": "30",
        "vote": {
          "positionMajoritaire": "contre",
          "decompteVoix": {
            "pour": "0",
            "contre": "2",
            "abstentions": "0"
          },
          "decompteNominatif": {}
        }
      },
      {
        "organeRef": "PO656014",
        "nombreMembresGroupe": "17",
        "vote": {
          "positionMajoritaire": "pour",
          "decompteVoix": {
            "pour": "6",
            "contre": "0",
            "abstentions": "0"
          },
          "decompteNominatif": {}
        }
      },
      {
        "organeRef": "PO656022",
        "nombreMembresGroupe": "16",
        "vote": {
          "positionMajoritaire": "pour",
          "decompteVoix": {
            "pour": "2",
            "contre": "0",
            "abstentions": "0"
          },
          "decompteNominatif": {}
        }
      },
      {
        "organeRef": "PO656018",
        "nombreMembresGroupe": "15",
        "vote": {
          "positionMajoritaire": "pour",
          "decompteVoix": {
            "pour": "0",
            "contre": "0",
            "abstentions": "0"
          },
          "decompteNominatif": {}
        }
      },
      {
        "organeRef": "PO645633",
        "nombreMembresGroupe": "7",
        "vote": {
          "positionMajoritaire": "pour",
          "decompteVoix": {
            "pour": "0",
            "contre": "0",
            "abstentions": "0"
          },
          "decompteNominatif": {}
        }
      }
    ]
  },
  "miseAuPoint": {
    "pour": [
      {
        "acteurRef": "PA356",
        "mandatRef": "PM645358"
      },
      {
        "acteurRef": "PA642682",
        "mandatRef": "PM676798"
      }
    ]
  }
}