{
  "uid": "VTANR5L14V529",
  "numero": "529",
  "organeRef": "PO644420",
  "legislature": "14",
  "sessionRef": "SCR5A2013O1",
  "seanceRef": "RUANR5L14S2013IDS17274",
  "dateScrutin": "2013-06-17T02:00:00.000+02:00",
  "quantiemeJourSeance": "2",
  "typeVote": {
    "codeTypeVote": "SPO",
    "libelleTypeVote": "scrutin public ordinaire",
    "typeMajorite": "majorité absolue des suffrages exprimés"
  },
  "sort": {
    "code": "rejeté",
    "libelle": "L'Assemblée nationale n'a pas adopté"
  },
  "titre": "l'amendement n° 218 de Mme Le Callennec à l'article 1er du projet de loi organique relatif à la transparence de la vie publique.",
  "demandeur": {
    "texte": "Président du groupe de l'union pour un mouvement populaire"
  },
  "objet": {
    "libelle": "l'amendement n° 218 de Mme Le Callennec à l'article 1er du projet de loi organique relatif à la transparence de la vie publique."
  },
  "modePublicationDesVotes": "DecompteDissidentsPositionGroupe",
  "syntheseVote": {
    "nombreVotants": "44",
    "suffragesExprimes": "44",
    "nbrSuffragesRequis": "23",
    "annonce": "L'Assemblée nationale n'a pas adopté",
    "decompte": {
      "pour": "14",
      "contre": "30",
      "nonVotants": "2",
      "abstentions": "0"
    }
  },
  "ventilationVotes": {
    "organeRef": "PO644420",
    "groupes": [
      {
        "organeRef": "PO656002",
        "nombreMembresGroupe": "292",
        "vote": {
          "positionMajoritaire": "contre",
          "decompteVoix": {
            "pour": "0",
            "contre": "28",
            "nonVotants": "1",
            "abstentions": "0"
          },
          "decompteNominatif": {
            "nonVotants": [
              {
                "acteurRef": "PA381",
                "mandatRef": "PM645125",
                "causePositionVote": "PAN"
              }
            ]
          }
        }
      },
      {
        "organeRef": "PO656006",
        "nombreMembresGroupe": "197",
        "vote": {
          "positionMajoritaire": "pour",
          "decompteVoix": {
            "pour": "11",
            "contre": "0",
            "abstentions": "0"
          },
          "decompteNominatif": {}
        }
      },
      {
        "organeRef": "PO656010",
        "nombreMembresGroupe": "31",
        "vote": {
          "positionMajoritaire": "pour",
          "decompteVoix": {
            "pour": "2",
            "contre": "0",
            "abstentions": "0"
          },
          "decompteNominatif": {}
        }
      },
      {
        "organeRef": "PO656014",
        "nombreMembresGroupe": "17",
        "vote": {
          "positionMajoritaire": "pour",
          "decompteVoix": {
            "pour": "1",
            "contre": "0",
            "nonVotants": "1",
            "abstentions": "0"
          },
          "decompteNominatif": {
            "nonVotants": [
              {
                "acteurRef": "PA609016",
                "mandatRef": "PM645074",
                "causePositionVote": "PSE"
              }
            ]
          }
        }
      },
      {
        "organeRef": "PO656022",
        "nombreMembresGroupe": "16",
        "vote": {
          "positionMajoritaire": "pour",
          "decompteVoix": {
            "pour": "0",
            "contre": "0",
            "abstentions": "0"
          },
          "decompteNominatif": {}
        }
      },
      {
        "organeRef": "PO656018",
        "nombreMembresGroupe": "15",
        "vote": {
          "positionMajoritaire": "contre",
          "decompteVoix": {
            "pour": "0",
            "contre": "2",
            "abstentions": "0"
          },
          "decompteNominatif": {}
        }
      },
      {
        "organeRef": "PO645633",
        "nombreMembresGroupe": "8",
        "vote": {
          "positionMajoritaire": "pour",
          "decompteVoix": {
            "pour": "0",
            "contre": "0",
            "abstentions": "0"
          },
          "decompteNominatif": {}
        }
      }
    ]
  }
}