{
  "uid": "VTANR5L14V819",
  "numero": "819",
  "organeRef": "PO644420",
  "legislature": "14",
  "sessionRef": "SCR5A2014O1",
  "seanceRef": "RUANR5L14S2014IDS18583",
  "dateScrutin": "2014-06-16T02:00:00.000+02:00",
  "quantiemeJourSeance": "1",
  "typeVote": {
    "codeTypeVote": "SPO",
    "libelleTypeVote": "scrutin public ordinaire",
    "typeMajorite": "majorité absolue des suffrages exprimés"
  },
  "sort": {
    "code": "rejeté",
    "libelle": "L'Assemblée nationale n'a pas adopté"
  },
  "titre": "l'amendement n° 123 et les amendements identiques158, 419, 426, 512, 566 et 719, à l'article 11 de la proposition de loi relative à l'autorité parentale et à l'intérêt de l'enfant.",
  "demandeur": {
    "texte": "Président du groupe de l'union pour un mouvement populaire"
  },
  "objet": {
    "libelle": "l'amendement n° 123 et les amendements identiques158, 419, 426, 512, 566 et 719, à l'article 11 de la proposition de loi relative à l'autorité parentale et à l'intérêt de l'enfant."
  },
  "modePublicationDesVotes": "DecompteNominatif",
  "syntheseVote": {
    "nombreVotants": "26",
    "suffragesExprimes": "26",
    "nbrSuffragesRequis": "14",
    "annonce": "L'Assemblée nationale n'a pas adopté",
    "decompte": {
      "pour": "10",
      "contre": "16",
      "nonVotants": "3",
      "abstentions": "0"
    }
  },
  "ventilationVotes": {
    "organeRef": "PO644420",
    "groupes": [
      {
        "organeRef": "PO656002",
        "nombreMembresGroupe": "290",
        "vote": {
          "positionMajoritaire": "contre",
          "decompteVoix": {
            "pour": "0",
            "contre": "13",
            "nonVotants": "3",
            "abstentions": "0"
          },
          "decompteNominatif": {
            "nonVotants": [
              {
                "acteurRef": "PA381",
                "mandatRef": "PM645125",
                "causePositionVote": "PAN"
              },
              {
                "acteurRef": "PA2051",
                "mandatRef": "PM645056",
                "causePositionVote": "MG"
              },
              {
                "acteurRef": "PA606351",
                "mandatRef": "PM645384",
                "causePositionVote": "MG"
              }
            ],
            "contre": [
              {
                "acteurRef": "PA606040",
                "mandatRef": "PM645144"
              },
              {
                "acteurRef": "PA331594",
                "mandatRef": "PM645208"
              },
              {
                "acteurRef": "PA606899",
                "mandatRef": "PM645545"
              },
              {
                "acteurRef": "PA608158",
                "mandatRef": "PM645174"
              },
              {
                "acteurRef": "PA336421",
                "mandatRef": "PM645332"
              },
              {
                "acteurRef": "PA335319",
                "mandatRef": "PM645070"
              },
              {
                "acteurRef": "PA605349",
                "mandatRef": "PM645483"
              },
              {
                "acteurRef": "PA605703",
                "mandatRef": "PM645418"
              },
              {
                "acteurRef": "PA606363",
                "mandatRef": "PM645388"
              },
              {
                "acteurRef": "PA606665",
                "mandatRef": "PM645526"
              },
              {
                "acteurRef": "PA672",
                "mandatRef": "PM645175"
              },
              {
                "acteurRef": "PA610354",
                "mandatRef": "PM645106"
              },
              {
                "acteurRef": "PA693008",
                "mandatRef": "PM693014"
              }
            ]
          }
        }
      },
      {
        "organeRef": "PO656006",
        "nombreMembresGroupe": "199",
        "vote": {
          "positionMajoritaire": "pour",
          "decompteVoix": {
            "pour": "10",
            "contre": "0",
            "abstentions": "0"
          },
          "decompteNominatif": {
            "pour": [
              {
                "acteurRef": "PA1874",
                "mandatRef": "PM645474"
              },
              {
                "acteurRef": "PA2098",
                "mandatRef": "PM645351"
              },
              {
                "acteurRef": "PA1379",
                "mandatRef": "PM645433"
              },
              {
                "acteurRef": "PA267459",
                "mandatRef": "PM645564"
              },
              {
                "acteurRef": "PA266776",
                "mandatRef": "PM645590"
              },
              {
                "acteurRef": "PA334149",
                "mandatRef": "PM645127"
              },
              {
                "acteurRef": "PA330008",
                "mandatRef": "PM645164"
              },
              {
                "acteurRef": "PA266797",
                "mandatRef": "PM645338"
              },
              {
                "acteurRef": "PA605991",
                "mandatRef": "PM645081"
              },
              {
                "acteurRef": "PA607489",
                "mandatRef": "PM645366"
              }
            ]
          }
        }
      },
      {
        "organeRef": "PO656010",
        "nombreMembresGroupe": "28",
        "vote": {
          "positionMajoritaire": "pour",
          "decompteVoix": {
            "pour": "0",
            "contre": "0",
            "abstentions": "0"
          },
          "decompteNominatif": {}
        }
      },
      {
        "organeRef": "PO656014",
        "nombreMembresGroupe": "18",
        "vote": {
          "positionMajoritaire": "contre",
          "decompteVoix": {
            "pour": "0",
            "contre": "2",
            "abstentions": "0"
          },
          "decompteNominatif": {
            "contre": [
              {
                "acteurRef": "PA609016",
                "mandatRef": "PM645074"
              },
              {
                "acteurRef": "PA609816",
                "mandatRef": "PM645334"
              }
            ]
          }
        }
      },
      {
        "organeRef": "PO656022",
        "nombreMembresGroupe": "16",
        "vote": {
          "positionMajoritaire": "pour",
          "decompteVoix": {
            "pour": "0",
            "contre": "0",
            "abstentions": "0"
          },
          "decompteNominatif": {}
        }
      },
      {
        "organeRef": "PO656018",
        "nombreMembresGroupe": "15",
        "vote": {
          "positionMajoritaire": "contre",
          "decompteVoix": {
            "pour": "0",
            "contre": "1",
            "abstentions": "0"
          },
          "decompteNominatif": {
            "contre": [
              {
                "acteurRef": "PA689",
                "mandatRef": "PM645113"
              }
            ]
          }
        }
      },
      {
        "organeRef": "PO645633",
        "nombreMembresGroupe": "8",
        "vote": {
          "positionMajoritaire": "pour",
          "decompteVoix": {
            "pour": "0",
            "contre": "0",
            "abstentions": "0"
          },
          "decompteNominatif": {}
        }
      }
    ]
  }
}