{
  "uid": "VTANR5L14V956",
  "numero": "956",
  "organeRef": "PO644420",
  "legislature": "14",
  "sessionRef": "SCR5A2015O1",
  "seanceRef": "RUANR5L14S2015IDS18798",
  "dateScrutin": "2014-11-18T01:00:00.000+01:00",
  "quantiemeJourSeance": "2",
  "typeVote": {
    "codeTypeVote": "SPO",
    "libelleTypeVote": "scrutin public ordinaire",
    "typeMajorite": "majorité absolue des suffrages exprimés"
  },
  "sort": {
    "code": "rejeté",
    "libelle": "L'Assemblée nationale n'a pas adopté"
  },
  "titre": "l'amendement n° 74 de M. Dolez et l'amendement identique suivant à l'article 1er A du projet de loi relatif à la délimitation des régions, aux élections régionales et départementales et modifiant le calendrier électoral (deuxième lecture).",
  "demandeur": {
    "texte": "Président du groupe de la gauche démocrate et républicaine"
  },
  "objet": {
    "libelle": "l'amendement n° 74 de M. Dolez et l'amendement identique suivant à l'article 1er A du projet de loi relatif à la délimitation des régions, aux élections régionales et départementales et modifiant le calendrier électoral (deuxième lecture)."
  },
  "modePublicationDesVotes": "DecompteNominatif",
  "syntheseVote": {
    "nombreVotants": "105",
    "suffragesExprimes": "98",
    "nbrSuffragesRequis": "50",
    "annonce": "L'Assemblée nationale n'a pas adopté",
    "decompte": {
      "pour": "29",
      "contre": "69",
      "nonVotants": "2",
      "abstentions": "7"
    }
  },
  "ventilationVotes": {
    "organeRef": "PO644420",
    "groupes": [
      {
        "organeRef": "PO656002",
        "nombreMembresGroupe": "288",
        "vote": {
          "positionMajoritaire": "contre",
          "decompteVoix": {
            "pour": "1",
            "contre": "62",
            "nonVotants": "1",
            "abstentions": "0"
          },
          "decompteNominatif": {
            "nonVotants": [
              {
                "acteurRef": "PA381",
                "mandatRef": "PM645125",
                "causePositionVote": "PAN"
              }
            ],
            "pour": [
              {
                "acteurRef": "PA610481",
                "mandatRef": "PM645131"
              }
            ],
            "contre": [
              {
                "acteurRef": "PA1816",
                "mandatRef": "PM701036"
              },
              {
                "acteurRef": "PA608038",
                "mandatRef": "PM645075"
              },
              {
                "acteurRef": "PA267091",
                "mandatRef": "PM645467"
              },
              {
                "acteurRef": "PA331594",
                "mandatRef": "PM645208"
              },
              {
                "acteurRef": "PA508",
                "mandatRef": "PM645397"
              },
              {
                "acteurRef": "PA1710",
                "mandatRef": "PM645166"
              },
              {
                "acteurRef": "PA680",
                "mandatRef": "PM645536"
              },
              {
                "acteurRef": "PA877",
                "mandatRef": "PM645349"
              },
              {
                "acteurRef": "PA1911",
                "mandatRef": "PM645152"
              },
              {
                "acteurRef": "PA1886",
                "mandatRef": "PM645099"
              },
              {
                "acteurRef": "PA1977",
                "mandatRef": "PM645404"
              },
              {
                "acteurRef": "PA1979",
                "mandatRef": "PM645223"
              },
              {
                "acteurRef": "PA2365",
                "mandatRef": "PM645481"
              },
              {
                "acteurRef": "PA2611",
                "mandatRef": "PM645436"
              },
              {
                "acteurRef": "PA1748",
                "mandatRef": "PM645566"
              },
              {
                "acteurRef": "PA606631",
                "mandatRef": "PM645516"
              },
              {
                "acteurRef": "PA331282",
                "mandatRef": "PM645480"
              },
              {
                "acteurRef": "PA606899",
                "mandatRef": "PM645545"
              },
              {
                "acteurRef": "PA267835",
                "mandatRef": "PM645134"
              },
              {
                "acteurRef": "PA343493",
                "mandatRef": "PM645385"
              },
              {
                "acteurRef": "PA605069",
                "mandatRef": "PM645534"
              },
              {
                "acteurRef": "PA1032",
                "mandatRef": "PM645488"
              },
              {
                "acteurRef": "PA330130",
                "mandatRef": "PM645541"
              },
              {
                "acteurRef": "PA335543",
                "mandatRef": "PM702197"
              },
              {
                "acteurRef": "PA336112",
                "mandatRef": "PM645253"
              },
              {
                "acteurRef": "PA331014",
                "mandatRef": "PM645422"
              },
              {
                "acteurRef": "PA332305",
                "mandatRef": "PM645562"
              },
              {
                "acteurRef": "PA330546",
                "mandatRef": "PM645492"
              },
              {
                "acteurRef": "PA332636",
                "mandatRef": "PM645118"
              },
              {
                "acteurRef": "PA331658",
                "mandatRef": "PM645277"
              },
              {
                "acteurRef": "PA332796",
                "mandatRef": "PM645193"
              },
              {
                "acteurRef": "PA330981",
                "mandatRef": "PM645409"
              },
              {
                "acteurRef": "PA605557",
                "mandatRef": "PM645507"
              },
              {
                "acteurRef": "PA605349",
                "mandatRef": "PM645483"
              },
              {
                "acteurRef": "PA605426",
                "mandatRef": "PM645517"
              },
              {
                "acteurRef": "PA341246",
                "mandatRef": "PM645469"
              },
              {
                "acteurRef": "PA605606",
                "mandatRef": "PM645394"
              },
              {
                "acteurRef": "PA605643",
                "mandatRef": "PM645405"
              },
              {
                "acteurRef": "PA606149",
                "mandatRef": "PM645218"
              },
              {
                "acteurRef": "PA606924",
                "mandatRef": "PM645527"
              },
              {
                "acteurRef": "PA606991",
                "mandatRef": "PM645098"
              },
              {
                "acteurRef": "PA606623",
                "mandatRef": "PM645513"
              },
              {
                "acteurRef": "PA606665",
                "mandatRef": "PM645526"
              },
              {
                "acteurRef": "PA607256",
                "mandatRef": "PM645247"
              },
              {
                "acteurRef": "PA607155",
                "mandatRef": "PM645200"
              },
              {
                "acteurRef": "PA607606",
                "mandatRef": "PM645381"
              },
              {
                "acteurRef": "PA607395",
                "mandatRef": "PM645343"
              },
              {
                "acteurRef": "PA607509",
                "mandatRef": "PM645369"
              },
              {
                "acteurRef": "PA607553",
                "mandatRef": "PM645373"
              },
              {
                "acteurRef": "PA607691",
                "mandatRef": "PM645401"
              },
              {
                "acteurRef": "PA607699",
                "mandatRef": "PM645403"
              },
              {
                "acteurRef": "PA609205",
                "mandatRef": "PM645128"
              },
              {
                "acteurRef": "PA609775",
                "mandatRef": "PM645329"
              },
              {
                "acteurRef": "PA609435",
                "mandatRef": "PM645211"
              },
              {
                "acteurRef": "PA608363",
                "mandatRef": "PM645571"
              },
              {
                "acteurRef": "PA609314",
                "mandatRef": "PM645145"
              },
              {
                "acteurRef": "PA609535",
                "mandatRef": "PM645236"
              },
              {
                "acteurRef": "PA642836",
                "mandatRef": "PM676799"
              },
              {
                "acteurRef": "PA642739",
                "mandatRef": "PM676811"
              },
              {
                "acteurRef": "PA342332",
                "mandatRef": "PM676816"
              },
              {
                "acteurRef": "PA267623",
                "mandatRef": "PM676817"
              },
              {
                "acteurRef": "PA643002",
                "mandatRef": "PM703297"
              }
            ]
          }
        }
      },
      {
        "organeRef": "PO656006",
        "nombreMembresGroupe": "197",
        "vote": {
          "positionMajoritaire": "pour",
          "decompteVoix": {
            "pour": "23",
            "contre": "0",
            "nonVotants": "1",
            "abstentions": "6"
          },
          "decompteNominatif": {
            "nonVotants": [
              {
                "acteurRef": "PA267797",
                "mandatRef": "PM645350",
                "causePositionVote": "PSE"
              }
            ],
            "pour": [
              {
                "acteurRef": "PA2529",
                "mandatRef": "PM645608"
              },
              {
                "acteurRef": "PA606712",
                "mandatRef": "PM645549"
              },
              {
                "acteurRef": "PA1466",
                "mandatRef": "PM645240"
              },
              {
                "acteurRef": "PA2876",
                "mandatRef": "PM645355"
              },
              {
                "acteurRef": "PA1445",
                "mandatRef": "PM645563"
              },
              {
                "acteurRef": "PA2971",
                "mandatRef": "PM645392"
              },
              {
                "acteurRef": "PA266788",
                "mandatRef": "PM645294"
              },
              {
                "acteurRef": "PA267246",
                "mandatRef": "PM645340"
              },
              {
                "acteurRef": "PA267358",
                "mandatRef": "PM645602"
              },
              {
                "acteurRef": "PA267527",
                "mandatRef": "PM645555"
              },
              {
                "acteurRef": "PA267813",
                "mandatRef": "PM645172"
              },
              {
                "acteurRef": "PA268051",
                "mandatRef": "PM645234"
              },
              {
                "acteurRef": "PA266776",
                "mandatRef": "PM645590"
              },
              {
                "acteurRef": "PA334654",
                "mandatRef": "PM645596"
              },
              {
                "acteurRef": "PA330008",
                "mandatRef": "PM645164"
              },
              {
                "acteurRef": "PA266774",
                "mandatRef": "PM645583"
              },
              {
                "acteurRef": "PA607603",
                "mandatRef": "PM645379"
              },
              {
                "acteurRef": "PA608662",
                "mandatRef": "PM645592"
              },
              {
                "acteurRef": "PA344776",
                "mandatRef": "PM645584"
              },
              {
                "acteurRef": "PA608416",
                "mandatRef": "PM645586"
              },
              {
                "acteurRef": "PA608434",
                "mandatRef": "PM645593"
              },
              {
                "acteurRef": "PA607489",
                "mandatRef": "PM645366"
              },
              {
                "acteurRef": "PA608380",
                "mandatRef": "PM645578"
              }
            ],
            "abstentions": [
              {
                "acteurRef": "PA1874",
                "mandatRef": "PM645474"
              },
              {
                "acteurRef": "PA267013",
                "mandatRef": "PM645613"
              },
              {
                "acteurRef": "PA267227",
                "mandatRef": "PM645618"
              },
              {
                "acteurRef": "PA267260",
                "mandatRef": "PM645459"
              },
              {
                "acteurRef": "PA267355",
                "mandatRef": "PM645581"
              },
              {
                "acteurRef": "PA267785",
                "mandatRef": "PM645359"
              }
            ]
          }
        }
      },
      {
        "organeRef": "PO656010",
        "nombreMembresGroupe": "30",
        "vote": {
          "positionMajoritaire": "contre",
          "decompteVoix": {
            "pour": "2",
            "contre": "3",
            "abstentions": "1"
          },
          "decompteNominatif": {
            "pour": [
              {
                "acteurRef": "PA267042",
                "mandatRef": "PM645368"
              },
              {
                "acteurRef": "PA1960",
                "mandatRef": "PM645107"
              }
            ],
            "contre": [
              {
                "acteurRef": "PA942",
                "mandatRef": "PM645357"
              },
              {
                "acteurRef": "PA267469",
                "mandatRef": "PM645314"
              },
              {
                "acteurRef": "PA332228",
                "mandatRef": "PM645546"
              }
            ],
            "abstentions": [
              {
                "acteurRef": "PA216574",
                "mandatRef": "PM645629"
              }
            ]
          }
        }
      },
      {
        "organeRef": "PO656014",
        "nombreMembresGroupe": "18",
        "vote": {
          "positionMajoritaire": "contre",
          "decompteVoix": {
            "pour": "0",
            "contre": "3",
            "abstentions": "0"
          },
          "decompteNominatif": {
            "contre": [
              {
                "acteurRef": "PA332747",
                "mandatRef": "PM645155"
              },
              {
                "acteurRef": "PA609520",
                "mandatRef": "PM645233"
              },
              {
                "acteurRef": "PA607619",
                "mandatRef": "PM645383"
              }
            ]
          }
        }
      },
      {
        "organeRef": "PO656022",
        "nombreMembresGroupe": "17",
        "vote": {
          "positionMajoritaire": "pour",
          "decompteVoix": {
            "pour": "2",
            "contre": "0",
            "abstentions": "0"
          },
          "decompteNominatif": {
            "pour": [
              {
                "acteurRef": "PA605084",
                "mandatRef": "PM645537"
              },
              {
                "acteurRef": "PA608292",
                "mandatRef": "PM645276"
              }
            ]
          }
        }
      },
      {
        "organeRef": "PO656018",
        "nombreMembresGroupe": "15",
        "vote": {
          "positionMajoritaire": "pour",
          "decompteVoix": {
            "pour": "1",
            "contre": "0",
            "abstentions": "0"
          },
          "decompteNominatif": {
            "pour": [
              {
                "acteurRef": "PA1141",
                "mandatRef": "PM645468"
              }
            ]
          }
        }
      },
      {
        "organeRef": "PO645633",
        "nombreMembresGroupe": "9",
        "vote": {
          "positionMajoritaire": "contre",
          "decompteVoix": {
            "pour": "0",
            "contre": "1",
            "abstentions": "0"
          },
          "decompteNominatif": {
            "contre": [
              {
                "acteurRef": "PA271",
                "mandatRef": "PM645515"
              }
            ]
          }
        }
      }
    ]
  },
  "miseAuPoint": {
    "pour": [
      {
        "acteurRef": "PA2707",
        "mandatRef": "PM645575"
      }
    ]
  }
}