{
  "uid": "VTANR5L14V624",
  "numero": "624",
  "organeRef": "PO644420",
  "legislature": "14",
  "sessionRef": "SCR5A2014O1",
  "seanceRef": "RUANR5L14S2014IDS17617",
  "dateScrutin": "2013-10-10T02:00:00.000+02:00",
  "quantiemeJourSeance": "2",
  "typeVote": {
    "codeTypeVote": "SPO",
    "libelleTypeVote": "scrutin public ordinaire",
    "typeMajorite": "majorité absolue des suffrages exprimés"
  },
  "sort": {
    "code": "rejeté",
    "libelle": "L'Assemblée nationale n'a pas adopté"
  },
  "titre": "les amendements n° 337 à 351 de Mme Fraysse et 14 de ses collègues à l'article 5 du projet de loi garantissant l'avenir et la justice du système de retraite.",
  "demandeur": {
    "texte": "Président du groupe de la gauche démocrate et républicaine"
  },
  "objet": {
    "libelle": "les amendements n° 337 à 351 de Mme Fraysse et 14 de ses collègues à l'article 5 du projet de loi garantissant l'avenir et la justice du système de retraite."
  },
  "modePublicationDesVotes": "DecompteDissidentsPositionGroupe",
  "syntheseVote": {
    "nombreVotants": "63",
    "suffragesExprimes": "63",
    "nbrSuffragesRequis": "32",
    "annonce": "L'Assemblée nationale n'a pas adopté",
    "decompte": {
      "pour": "16",
      "contre": "47",
      "nonVotants": "2",
      "abstentions": "0"
    }
  },
  "ventilationVotes": {
    "organeRef": "PO644420",
    "groupes": [
      {
        "organeRef": "PO656002",
        "nombreMembresGroupe": "292",
        "vote": {
          "positionMajoritaire": "contre",
          "decompteVoix": {
            "pour": "4",
            "contre": "47",
            "nonVotants": "1",
            "abstentions": "0"
          },
          "decompteNominatif": {
            "nonVotants": [
              {
                "acteurRef": "PA381",
                "mandatRef": "PM645125",
                "causePositionVote": "PAN"
              }
            ],
            "pour": [
              {
                "acteurRef": "PA608686",
                "mandatRef": "PM645601"
              },
              {
                "acteurRef": "PA333818",
                "mandatRef": "PM645451"
              },
              {
                "acteurRef": "PA2430",
                "mandatRef": "PM645411"
              },
              {
                "acteurRef": "PA605952",
                "mandatRef": "PM645049"
              }
            ]
          }
        }
      },
      {
        "organeRef": "PO656006",
        "nombreMembresGroupe": "199",
        "vote": {
          "positionMajoritaire": "pour",
          "decompteVoix": {
            "pour": "0",
            "contre": "0",
            "abstentions": "0"
          },
          "decompteNominatif": {}
        }
      },
      {
        "organeRef": "PO656010",
        "nombreMembresGroupe": "30",
        "vote": {
          "positionMajoritaire": "pour",
          "decompteVoix": {
            "pour": "0",
            "contre": "0",
            "abstentions": "0"
          },
          "decompteNominatif": {}
        }
      },
      {
        "organeRef": "PO656014",
        "nombreMembresGroupe": "17",
        "vote": {
          "positionMajoritaire": "pour",
          "decompteVoix": {
            "pour": "4",
            "contre": "0",
            "nonVotants": "1",
            "abstentions": "0"
          },
          "decompteNominatif": {
            "nonVotants": [
              {
                "acteurRef": "PA609016",
                "mandatRef": "PM645074",
                "causePositionVote": "PSE"
              }
            ]
          }
        }
      },
      {
        "organeRef": "PO656022",
        "nombreMembresGroupe": "16",
        "vote": {
          "positionMajoritaire": "pour",
          "decompteVoix": {
            "pour": "0",
            "contre": "0",
            "abstentions": "0"
          },
          "decompteNominatif": {}
        }
      },
      {
        "organeRef": "PO656018",
        "nombreMembresGroupe": "15",
        "vote": {
          "positionMajoritaire": "pour",
          "decompteVoix": {
            "pour": "8",
            "contre": "0",
            "abstentions": "0"
          },
          "decompteNominatif": {}
        }
      },
      {
        "organeRef": "PO645633",
        "nombreMembresGroupe": "8",
        "vote": {
          "positionMajoritaire": "pour",
          "decompteVoix": {
            "pour": "0",
            "contre": "0",
            "abstentions": "0"
          },
          "decompteNominatif": {}
        }
      }
    ]
  }
}