{
  "uid": "VTANR5L14V697",
  "numero": "697",
  "organeRef": "PO644420",
  "legislature": "14",
  "sessionRef": "SCR5A2014O1",
  "seanceRef": "RUANR5L14S2014IDS17846",
  "dateScrutin": "2013-11-18T01:00:00.000+01:00",
  "quantiemeJourSeance": "1",
  "typeVote": {
    "codeTypeVote": "SPO",
    "libelleTypeVote": "scrutin public ordinaire",
    "typeMajorite": "majorité absolue des suffrages exprimés"
  },
  "sort": {
    "code": "rejeté",
    "libelle": "L'Assemblée nationale n'a pas adopté"
  },
  "titre": "la motion de rejet préalable, présentée par M. Christian Jacob, du projet de loi organique interdisant le cumul de fonctions exécutives locales avec le mandat de député et limitant à une seule fonction exécutive locale le cumul avec le mandat de sénateur.",
  "demandeur": {
    "texte": "Président du groupe socialiste, républicain et citoyen"
  },
  "objet": {
    "libelle": "la motion de rejet préalable, présentée par M. Christian Jacob, du projet de loi organique interdisant le cumul de fonctions exécutives locales avec le mandat de député et limitant à une seule fonction exécutive locale le cumul avec le mandat de sénateur."
  },
  "modePublicationDesVotes": "DecompteDissidentsPositionGroupe",
  "syntheseVote": {
    "nombreVotants": "96",
    "suffragesExprimes": "96",
    "nbrSuffragesRequis": "49",
    "annonce": "L'Assemblée nationale n'a pas adopté",
    "decompte": {
      "pour": "11",
      "contre": "85",
      "nonVotants": "2",
      "abstentions": "0"
    }
  },
  "ventilationVotes": {
    "organeRef": "PO644420",
    "groupes": [
      {
        "organeRef": "PO656002",
        "nombreMembresGroupe": "292",
        "vote": {
          "positionMajoritaire": "contre",
          "decompteVoix": {
            "pour": "2",
            "contre": "79",
            "nonVotants": "1",
            "abstentions": "0"
          },
          "decompteNominatif": {
            "nonVotants": [
              {
                "acteurRef": "PA381",
                "mandatRef": "PM645125",
                "causePositionVote": "PAN"
              }
            ],
            "pour": [
              {
                "acteurRef": "PA608686",
                "mandatRef": "PM645601"
              },
              {
                "acteurRef": "PA642724",
                "mandatRef": "PM676813"
              }
            ]
          }
        }
      },
      {
        "organeRef": "PO656006",
        "nombreMembresGroupe": "199",
        "vote": {
          "positionMajoritaire": "pour",
          "decompteVoix": {
            "pour": "9",
            "contre": "0",
            "nonVotants": "1",
            "abstentions": "0"
          },
          "decompteNominatif": {
            "nonVotants": [
              {
                "acteurRef": "PA1874",
                "mandatRef": "PM645474",
                "causePositionVote": "PSE"
              }
            ]
          }
        }
      },
      {
        "organeRef": "PO656010",
        "nombreMembresGroupe": "30",
        "vote": {
          "positionMajoritaire": "pour",
          "decompteVoix": {
            "pour": "0",
            "contre": "0",
            "abstentions": "0"
          },
          "decompteNominatif": {}
        }
      },
      {
        "organeRef": "PO656014",
        "nombreMembresGroupe": "17",
        "vote": {
          "positionMajoritaire": "contre",
          "decompteVoix": {
            "pour": "0",
            "contre": "4",
            "abstentions": "0"
          },
          "decompteNominatif": {}
        }
      },
      {
        "organeRef": "PO656022",
        "nombreMembresGroupe": "16",
        "vote": {
          "positionMajoritaire": "pour",
          "decompteVoix": {
            "pour": "0",
            "contre": "0",
            "abstentions": "0"
          },
          "decompteNominatif": {}
        }
      },
      {
        "organeRef": "PO656018",
        "nombreMembresGroupe": "15",
        "vote": {
          "positionMajoritaire": "contre",
          "decompteVoix": {
            "pour": "0",
            "contre": "2",
            "abstentions": "0"
          },
          "decompteNominatif": {}
        }
      },
      {
        "organeRef": "PO645633",
        "nombreMembresGroupe": "8",
        "vote": {
          "positionMajoritaire": "pour",
          "decompteVoix": {
            "pour": "0",
            "contre": "0",
            "abstentions": "0"
          },
          "decompteNominatif": {}
        }
      }
    ]
  },
  "miseAuPoint": {
    "contre": [
      {
        "acteurRef": "PA608686",
        "mandatRef": "PM645601"
      },
      {
        "acteurRef": "PA642724",
        "mandatRef": "PM676813"
      }
    ]
  }
}