{
  "uid": "VTANR5L14V880",
  "numero": "880",
  "organeRef": "PO644420",
  "legislature": "14",
  "sessionRef": "SCR5A2014E1",
  "seanceRef": "RUANR5L14S2014IDS18627",
  "dateScrutin": "2014-07-17T02:00:00.000+02:00",
  "quantiemeJourSeance": "3",
  "typeVote": {
    "codeTypeVote": "SPO",
    "libelleTypeVote": "scrutin public ordinaire",
    "typeMajorite": "majorité absolue des suffrages exprimés"
  },
  "sort": {
    "code": "rejeté",
    "libelle": "L'Assemblée nationale n'a pas adopté"
  },
  "titre": "les amendements de suppression à l'article premier du projet de loi relatif à la délimitation des régions, aux élections régionales et départementales et modifiant le calendrier électoral",
  "demandeur": {
    "texte": "Président du groupe de la gauche démocrate et républicaine"
  },
  "objet": {
    "libelle": "les amendements de suppression à l'article premier du projet de loi relatif à la délimitation des régions, aux élections régionales et départementales et modifiant le calendrier électoral"
  },
  "modePublicationDesVotes": "DecompteNominatif",
  "syntheseVote": {
    "nombreVotants": "85",
    "suffragesExprimes": "84",
    "nbrSuffragesRequis": "43",
    "annonce": "L'Assemblée nationale n'a pas adopté",
    "decompte": {
      "pour": "22",
      "contre": "62",
      "nonVotants": "3",
      "abstentions": "1"
    }
  },
  "ventilationVotes": {
    "organeRef": "PO644420",
    "groupes": [
      {
        "organeRef": "PO656002",
        "nombreMembresGroupe": "290",
        "vote": {
          "positionMajoritaire": "contre",
          "decompteVoix": {
            "pour": "2",
            "contre": "52",
            "nonVotants": "2",
            "abstentions": "0"
          },
          "decompteNominatif": {
            "nonVotants": [
              {
                "acteurRef": "PA381",
                "mandatRef": "PM645125",
                "causePositionVote": "PAN"
              },
              {
                "acteurRef": "PA335017",
                "mandatRef": "PM645607",
                "causePositionVote": "PSE"
              }
            ],
            "pour": [
              {
                "acteurRef": "PA610481",
                "mandatRef": "PM645131"
              },
              {
                "acteurRef": "PA605076",
                "mandatRef": "PM645535"
              }
            ],
            "contre": [
              {
                "acteurRef": "PA606040",
                "mandatRef": "PM645144"
              },
              {
                "acteurRef": "PA267091",
                "mandatRef": "PM645467"
              },
              {
                "acteurRef": "PA331594",
                "mandatRef": "PM645208"
              },
              {
                "acteurRef": "PA1886",
                "mandatRef": "PM645099"
              },
              {
                "acteurRef": "PA2549",
                "mandatRef": "PM645412"
              },
              {
                "acteurRef": "PA606171",
                "mandatRef": "PM645255"
              },
              {
                "acteurRef": "PA331282",
                "mandatRef": "PM645480"
              },
              {
                "acteurRef": "PA605278",
                "mandatRef": "PM645462"
              },
              {
                "acteurRef": "PA1844",
                "mandatRef": "PM645254"
              },
              {
                "acteurRef": "PA609513",
                "mandatRef": "PM645228"
              },
              {
                "acteurRef": "PA2503",
                "mandatRef": "PM645187"
              },
              {
                "acteurRef": "PA267695",
                "mandatRef": "PM645213"
              },
              {
                "acteurRef": "PA1592",
                "mandatRef": "PM645232"
              },
              {
                "acteurRef": "PA605069",
                "mandatRef": "PM645534"
              },
              {
                "acteurRef": "PA332384",
                "mandatRef": "PM645528"
              },
              {
                "acteurRef": "PA335054",
                "mandatRef": "PM645614"
              },
              {
                "acteurRef": "PA335543",
                "mandatRef": "PM702197"
              },
              {
                "acteurRef": "PA336112",
                "mandatRef": "PM645253"
              },
              {
                "acteurRef": "PA336439",
                "mandatRef": "PM645333"
              },
              {
                "acteurRef": "PA332305",
                "mandatRef": "PM645562"
              },
              {
                "acteurRef": "PA332636",
                "mandatRef": "PM645118"
              },
              {
                "acteurRef": "PA344114",
                "mandatRef": "PM645092"
              },
              {
                "acteurRef": "PA605703",
                "mandatRef": "PM645418"
              },
              {
                "acteurRef": "PA605888",
                "mandatRef": "PM645476"
              },
              {
                "acteurRef": "PA605643",
                "mandatRef": "PM645405"
              },
              {
                "acteurRef": "PA606149",
                "mandatRef": "PM645218"
              },
              {
                "acteurRef": "PA606161",
                "mandatRef": "PM645250"
              },
              {
                "acteurRef": "PA606555",
                "mandatRef": "PM645477"
              },
              {
                "acteurRef": "PA606507",
                "mandatRef": "PM645406"
              },
              {
                "acteurRef": "PA606623",
                "mandatRef": "PM645513"
              },
              {
                "acteurRef": "PA607310",
                "mandatRef": "PM645297"
              },
              {
                "acteurRef": "PA607606",
                "mandatRef": "PM645381"
              },
              {
                "acteurRef": "PA607395",
                "mandatRef": "PM645343"
              },
              {
                "acteurRef": "PA607892",
                "mandatRef": "PM645460"
              },
              {
                "acteurRef": "PA607699",
                "mandatRef": "PM645403"
              },
              {
                "acteurRef": "PA608172",
                "mandatRef": "PM645197"
              },
              {
                "acteurRef": "PA608718",
                "mandatRef": "PM645610"
              },
              {
                "acteurRef": "PA608785",
                "mandatRef": "PM645567"
              },
              {
                "acteurRef": "PA609292",
                "mandatRef": "PM645169"
              },
              {
                "acteurRef": "PA609775",
                "mandatRef": "PM645329"
              },
              {
                "acteurRef": "PA609435",
                "mandatRef": "PM645211"
              },
              {
                "acteurRef": "PA609845",
                "mandatRef": "PM645339"
              },
              {
                "acteurRef": "PA608363",
                "mandatRef": "PM645571"
              },
              {
                "acteurRef": "PA609535",
                "mandatRef": "PM645236"
              },
              {
                "acteurRef": "PA610594",
                "mandatRef": "PM645185"
              },
              {
                "acteurRef": "PA608011",
                "mandatRef": "PM645066"
              },
              {
                "acteurRef": "PA610539",
                "mandatRef": "PM645194"
              },
              {
                "acteurRef": "PA608741",
                "mandatRef": "PM676810"
              },
              {
                "acteurRef": "PA342332",
                "mandatRef": "PM676816"
              },
              {
                "acteurRef": "PA267623",
                "mandatRef": "PM676817"
              },
              {
                "acteurRef": "PA335999",
                "mandatRef": "PM696536"
              },
              {
                "acteurRef": "PA643020",
                "mandatRef": "PM702199"
              }
            ]
          }
        }
      },
      {
        "organeRef": "PO656006",
        "nombreMembresGroupe": "199",
        "vote": {
          "positionMajoritaire": "pour",
          "decompteVoix": {
            "pour": "19",
            "contre": "1",
            "abstentions": "1"
          },
          "decompteNominatif": {
            "pour": [
              {
                "acteurRef": "PA1874",
                "mandatRef": "PM645474"
              },
              {
                "acteurRef": "PA1445",
                "mandatRef": "PM645563"
              },
              {
                "acteurRef": "PA606693",
                "mandatRef": "PM645542"
              },
              {
                "acteurRef": "PA1695",
                "mandatRef": "PM645157"
              },
              {
                "acteurRef": "PA267797",
                "mandatRef": "PM645350"
              },
              {
                "acteurRef": "PA266788",
                "mandatRef": "PM645294"
              },
              {
                "acteurRef": "PA267260",
                "mandatRef": "PM645459"
              },
              {
                "acteurRef": "PA267355",
                "mandatRef": "PM645581"
              },
              {
                "acteurRef": "PA267605",
                "mandatRef": "PM645189"
              },
              {
                "acteurRef": "PA268051",
                "mandatRef": "PM645234"
              },
              {
                "acteurRef": "PA332886",
                "mandatRef": "PM645226"
              },
              {
                "acteurRef": "PA334149",
                "mandatRef": "PM645127"
              },
              {
                "acteurRef": "PA334654",
                "mandatRef": "PM645596"
              },
              {
                "acteurRef": "PA330008",
                "mandatRef": "PM645164"
              },
              {
                "acteurRef": "PA266774",
                "mandatRef": "PM645583"
              },
              {
                "acteurRef": "PA344776",
                "mandatRef": "PM645584"
              },
              {
                "acteurRef": "PA608416",
                "mandatRef": "PM645586"
              },
              {
                "acteurRef": "PA608434",
                "mandatRef": "PM645593"
              },
              {
                "acteurRef": "PA267785",
                "mandatRef": "PM645359"
              }
            ],
            "contre": [
              {
                "acteurRef": "PA266776",
                "mandatRef": "PM645590"
              }
            ],
            "abstentions": [
              {
                "acteurRef": "PA696",
                "mandatRef": "PM645428"
              }
            ]
          }
        }
      },
      {
        "organeRef": "PO656010",
        "nombreMembresGroupe": "30",
        "vote": {
          "positionMajoritaire": "pour",
          "decompteVoix": {
            "pour": "0",
            "contre": "0",
            "abstentions": "0"
          },
          "decompteNominatif": {}
        }
      },
      {
        "organeRef": "PO656014",
        "nombreMembresGroupe": "18",
        "vote": {
          "positionMajoritaire": "contre",
          "decompteVoix": {
            "pour": "0",
            "contre": "4",
            "abstentions": "0"
          },
          "decompteNominatif": {
            "contre": [
              {
                "acteurRef": "PA332747",
                "mandatRef": "PM645155"
              },
              {
                "acteurRef": "PA609520",
                "mandatRef": "PM645233"
              },
              {
                "acteurRef": "PA605963",
                "mandatRef": "PM645055"
              },
              {
                "acteurRef": "PA607619",
                "mandatRef": "PM645383"
              }
            ]
          }
        }
      },
      {
        "organeRef": "PO656022",
        "nombreMembresGroupe": "16",
        "vote": {
          "positionMajoritaire": "contre",
          "decompteVoix": {
            "pour": "0",
            "contre": "5",
            "abstentions": "0"
          },
          "decompteNominatif": {
            "contre": [
              {
                "acteurRef": "PA2713",
                "mandatRef": "PM645148"
              },
              {
                "acteurRef": "PA2828",
                "mandatRef": "PM645402"
              },
              {
                "acteurRef": "PA605084",
                "mandatRef": "PM645537"
              },
              {
                "acteurRef": "PA605694",
                "mandatRef": "PM645416"
              },
              {
                "acteurRef": "PA608292",
                "mandatRef": "PM645276"
              }
            ]
          }
        }
      },
      {
        "organeRef": "PO656018",
        "nombreMembresGroupe": "15",
        "vote": {
          "positionMajoritaire": "pour",
          "decompteVoix": {
            "pour": "1",
            "contre": "0",
            "abstentions": "0"
          },
          "decompteNominatif": {
            "pour": [
              {
                "acteurRef": "PA1141",
                "mandatRef": "PM645468"
              }
            ]
          }
        }
      },
      {
        "organeRef": "PO645633",
        "nombreMembresGroupe": "9",
        "vote": {
          "positionMajoritaire": "pour",
          "decompteVoix": {
            "pour": "0",
            "contre": "0",
            "nonVotants": "1",
            "abstentions": "0"
          },
          "decompteNominatif": {
            "nonVotants": [
              {
                "acteurRef": "PA337633",
                "mandatRef": "PM702061",
                "causePositionVote": "MG"
              }
            ]
          }
        }
      }
    ]
  },
  "miseAuPoint": {
    "pour": [
      {
        "acteurRef": "PA266776",
        "mandatRef": "PM645590"
      }
    ]
  }
}