{
  "uid": "VTANR5L14V1269",
  "numero": "1269",
  "organeRef": "PO644420",
  "legislature": "14",
  "sessionRef": "SCR5A2016O1",
  "seanceRef": "RUANR5L14S2016IDS19961",
  "dateScrutin": "2016-05-03T02:00:00.000+02:00",
  "quantiemeJourSeance": "2",
  "typeVote": {
    "codeTypeVote": "SPO",
    "libelleTypeVote": "scrutin public ordinaire",
    "typeMajorite": "majorité absolue des suffrages exprimés"
  },
  "sort": {
    "code": "rejeté",
    "libelle": "L'Assemblée nationale n'a pas adopté"
  },
  "titre": "la motion de renvoi en commission, déposée par M. Christian Jacob, du projet de loi visant à instituer de nouvelles libertés et de nouvelles protections pour les entreprises et les actif-v-es (première lecture).",
  "demandeur": {
    "texte": "Président du groupe Les Républicains"
  },
  "objet": {
    "libelle": "la motion de renvoi en commission, déposée par M. Christian Jacob, du projet de loi visant à instituer de nouvelles libertés et de nouvelles protections pour les entreprises et les actif-v-es (première lecture)."
  },
  "modePublicationDesVotes": "DecompteNominatif",
  "syntheseVote": {
    "nombreVotants": "278",
    "suffragesExprimes": "276",
    "nbrSuffragesRequis": "139",
    "annonce": "L'Assemblée nationale n'a pas adopté",
    "decompte": {
      "pour": "99",
      "contre": "177",
      "nonVotants": "1",
      "abstentions": "2"
    }
  },
  "ventilationVotes": {
    "organeRef": "PO644420",
    "groupes": [
      {
        "organeRef": "PO656002",
        "nombreMembresGroupe": "286",
        "vote": {
          "positionMajoritaire": "contre",
          "decompteVoix": {
            "pour": "1",
            "contre": "165",
            "nonVotants": "1",
            "abstentions": "2"
          },
          "decompteNominatif": {
            "nonVotants": [
              {
                "acteurRef": "PA381",
                "mandatRef": "PM645125",
                "causePositionVote": "PAN"
              }
            ],
            "pour": [
              {
                "acteurRef": "PA610481",
                "mandatRef": "PM645131"
              }
            ],
            "contre": [
              {
                "acteurRef": "PA394",
                "mandatRef": "PM645447"
              },
              {
                "acteurRef": "PA840",
                "mandatRef": "PM645617"
              },
              {
                "acteurRef": "PA606040",
                "mandatRef": "PM645144"
              },
              {
                "acteurRef": "PA1116",
                "mandatRef": "PM645530"
              },
              {
                "acteurRef": "PA1199",
                "mandatRef": "PM645376"
              },
              {
                "acteurRef": "PA1198",
                "mandatRef": "PM645393"
              },
              {
                "acteurRef": "PA1214",
                "mandatRef": "PM645446"
              },
              {
                "acteurRef": "PA1353",
                "mandatRef": "PM645038"
              },
              {
                "acteurRef": "PA1866",
                "mandatRef": "PM645284"
              },
              {
                "acteurRef": "PA1991",
                "mandatRef": "PM645156"
              },
              {
                "acteurRef": "PA2859",
                "mandatRef": "PM645087"
              },
              {
                "acteurRef": "PA2883",
                "mandatRef": "PM645512"
              },
              {
                "acteurRef": "PA610891",
                "mandatRef": "PM645221"
              },
              {
                "acteurRef": "PA608038",
                "mandatRef": "PM645075"
              },
              {
                "acteurRef": "PA267091",
                "mandatRef": "PM645467"
              },
              {
                "acteurRef": "PA695",
                "mandatRef": "PM645503"
              },
              {
                "acteurRef": "PA508",
                "mandatRef": "PM645397"
              },
              {
                "acteurRef": "PA2895",
                "mandatRef": "PM645485"
              },
              {
                "acteurRef": "PA1496",
                "mandatRef": "PM645273"
              },
              {
                "acteurRef": "PA1710",
                "mandatRef": "PM645166"
              },
              {
                "acteurRef": "PA1579",
                "mandatRef": "PM645117"
              },
              {
                "acteurRef": "PA333285",
                "mandatRef": "PM701029"
              },
              {
                "acteurRef": "PA2317",
                "mandatRef": "PM645111"
              },
              {
                "acteurRef": "PA590034",
                "mandatRef": "PM701035"
              },
              {
                "acteurRef": "PA339",
                "mandatRef": "PM645511"
              },
              {
                "acteurRef": "PA560",
                "mandatRef": "PM645337"
              },
              {
                "acteurRef": "PA877",
                "mandatRef": "PM645349"
              },
              {
                "acteurRef": "PA1208",
                "mandatRef": "PM645486"
              },
              {
                "acteurRef": "PA1226",
                "mandatRef": "PM645386"
              },
              {
                "acteurRef": "PA1362",
                "mandatRef": "PM645356"
              },
              {
                "acteurRef": "PA1689",
                "mandatRef": "PM645378"
              },
              {
                "acteurRef": "PA1789",
                "mandatRef": "PM645426"
              },
              {
                "acteurRef": "PA1911",
                "mandatRef": "PM645152"
              },
              {
                "acteurRef": "PA1886",
                "mandatRef": "PM645099"
              },
              {
                "acteurRef": "PA1977",
                "mandatRef": "PM645404"
              },
              {
                "acteurRef": "PA1979",
                "mandatRef": "PM645223"
              },
              {
                "acteurRef": "PA2265",
                "mandatRef": "PM645445"
              },
              {
                "acteurRef": "PA2343",
                "mandatRef": "PM645498"
              },
              {
                "acteurRef": "PA2365",
                "mandatRef": "PM645481"
              },
              {
                "acteurRef": "PA2549",
                "mandatRef": "PM645412"
              },
              {
                "acteurRef": "PA2603",
                "mandatRef": "PM645552"
              },
              {
                "acteurRef": "PA2611",
                "mandatRef": "PM645436"
              },
              {
                "acteurRef": "PA267278",
                "mandatRef": "PM701030"
              },
              {
                "acteurRef": "PA606171",
                "mandatRef": "PM645255"
              },
              {
                "acteurRef": "PA608098",
                "mandatRef": "PM645146"
              },
              {
                "acteurRef": "PA331282",
                "mandatRef": "PM645480"
              },
              {
                "acteurRef": "PA606899",
                "mandatRef": "PM645545"
              },
              {
                "acteurRef": "PA335017",
                "mandatRef": "PM645607"
              },
              {
                "acteurRef": "PA770",
                "mandatRef": "PM645361"
              },
              {
                "acteurRef": "PA608083",
                "mandatRef": "PM645142"
              },
              {
                "acteurRef": "PA2503",
                "mandatRef": "PM645187"
              },
              {
                "acteurRef": "PA267188",
                "mandatRef": "PM645410"
              },
              {
                "acteurRef": "PA267695",
                "mandatRef": "PM645213"
              },
              {
                "acteurRef": "PA267835",
                "mandatRef": "PM645134"
              },
              {
                "acteurRef": "PA268042",
                "mandatRef": "PM645241"
              },
              {
                "acteurRef": "PA1592",
                "mandatRef": "PM645232"
              },
              {
                "acteurRef": "PA590031",
                "mandatRef": "PM705598"
              },
              {
                "acteurRef": "PA1193",
                "mandatRef": "PM645344"
              },
              {
                "acteurRef": "PA605069",
                "mandatRef": "PM645534"
              },
              {
                "acteurRef": "PA332364",
                "mandatRef": "PM707194"
              },
              {
                "acteurRef": "PA331835",
                "mandatRef": "PM645380"
              },
              {
                "acteurRef": "PA332384",
                "mandatRef": "PM645528"
              },
              {
                "acteurRef": "PA334116",
                "mandatRef": "PM645114"
              },
              {
                "acteurRef": "PA330118",
                "mandatRef": "PM645540"
              },
              {
                "acteurRef": "PA335054",
                "mandatRef": "PM645614"
              },
              {
                "acteurRef": "PA267923",
                "mandatRef": "PM645120"
              },
              {
                "acteurRef": "PA335543",
                "mandatRef": "PM702197"
              },
              {
                "acteurRef": "PA333043",
                "mandatRef": "PM645303"
              },
              {
                "acteurRef": "PA331924",
                "mandatRef": "PM701034"
              },
              {
                "acteurRef": "PA335319",
                "mandatRef": "PM645070"
              },
              {
                "acteurRef": "PA336439",
                "mandatRef": "PM645333"
              },
              {
                "acteurRef": "PA331973",
                "mandatRef": "PM645438"
              },
              {
                "acteurRef": "PA334768",
                "mandatRef": "PM645582"
              },
              {
                "acteurRef": "PA336015",
                "mandatRef": "PM645222"
              },
              {
                "acteurRef": "PA267233",
                "mandatRef": "PM645115"
              },
              {
                "acteurRef": "PA332015",
                "mandatRef": "PM645414"
              },
              {
                "acteurRef": "PA334811",
                "mandatRef": "PM645587"
              },
              {
                "acteurRef": "PA331014",
                "mandatRef": "PM645422"
              },
              {
                "acteurRef": "PA332843",
                "mandatRef": "PM645220"
              },
              {
                "acteurRef": "PA331753",
                "mandatRef": "PM645348"
              },
              {
                "acteurRef": "PA332305",
                "mandatRef": "PM645562"
              },
              {
                "acteurRef": "PA330546",
                "mandatRef": "PM645492"
              },
              {
                "acteurRef": "PA337483",
                "mandatRef": "PM645265"
              },
              {
                "acteurRef": "PA2430",
                "mandatRef": "PM645411"
              },
              {
                "acteurRef": "PA332614",
                "mandatRef": "PM645110"
              },
              {
                "acteurRef": "PA332636",
                "mandatRef": "PM645118"
              },
              {
                "acteurRef": "PA331658",
                "mandatRef": "PM645277"
              },
              {
                "acteurRef": "PA332796",
                "mandatRef": "PM645193"
              },
              {
                "acteurRef": "PA344114",
                "mandatRef": "PM645092"
              },
              {
                "acteurRef": "PA341339",
                "mandatRef": "PM645496"
              },
              {
                "acteurRef": "PA342415",
                "mandatRef": "PM645532"
              },
              {
                "acteurRef": "PA2693",
                "mandatRef": "PM645419"
              },
              {
                "acteurRef": "PA340432",
                "mandatRef": "PM645471"
              },
              {
                "acteurRef": "PA605349",
                "mandatRef": "PM645483"
              },
              {
                "acteurRef": "PA605426",
                "mandatRef": "PM645517"
              },
              {
                "acteurRef": "PA605830",
                "mandatRef": "PM645454"
              },
              {
                "acteurRef": "PA1963",
                "mandatRef": "PM645466"
              },
              {
                "acteurRef": "PA341246",
                "mandatRef": "PM645469"
              },
              {
                "acteurRef": "PA605888",
                "mandatRef": "PM645476"
              },
              {
                "acteurRef": "PA605804",
                "mandatRef": "PM645450"
              },
              {
                "acteurRef": "PA605643",
                "mandatRef": "PM645405"
              },
              {
                "acteurRef": "PA606149",
                "mandatRef": "PM645218"
              },
              {
                "acteurRef": "PA606161",
                "mandatRef": "PM645250"
              },
              {
                "acteurRef": "PA606586",
                "mandatRef": "PM645490"
              },
              {
                "acteurRef": "PA341981",
                "mandatRef": "PM645444"
              },
              {
                "acteurRef": "PA606507",
                "mandatRef": "PM645406"
              },
              {
                "acteurRef": "PA606363",
                "mandatRef": "PM645388"
              },
              {
                "acteurRef": "PA606991",
                "mandatRef": "PM645098"
              },
              {
                "acteurRef": "PA606639",
                "mandatRef": "PM645521"
              },
              {
                "acteurRef": "PA606665",
                "mandatRef": "PM645526"
              },
              {
                "acteurRef": "PA606675",
                "mandatRef": "PM645533"
              },
              {
                "acteurRef": "PA607283",
                "mandatRef": "PM645259"
              },
              {
                "acteurRef": "PA607310",
                "mandatRef": "PM645297"
              },
              {
                "acteurRef": "PA607193",
                "mandatRef": "PM645179"
              },
              {
                "acteurRef": "PA607606",
                "mandatRef": "PM645381"
              },
              {
                "acteurRef": "PA607395",
                "mandatRef": "PM645343"
              },
              {
                "acteurRef": "PA607509",
                "mandatRef": "PM645369"
              },
              {
                "acteurRef": "PA607892",
                "mandatRef": "PM645460"
              },
              {
                "acteurRef": "PA607691",
                "mandatRef": "PM645401"
              },
              {
                "acteurRef": "PA607761",
                "mandatRef": "PM645482"
              },
              {
                "acteurRef": "PA607769",
                "mandatRef": "PM645494"
              },
              {
                "acteurRef": "PA608348",
                "mandatRef": "PM645322"
              },
              {
                "acteurRef": "PA608172",
                "mandatRef": "PM645197"
              },
              {
                "acteurRef": "PA608641",
                "mandatRef": "PM645579"
              },
              {
                "acteurRef": "PA608695",
                "mandatRef": "PM645605"
              },
              {
                "acteurRef": "PA608718",
                "mandatRef": "PM645610"
              },
              {
                "acteurRef": "PA608778",
                "mandatRef": "PM645565"
              },
              {
                "acteurRef": "PA608785",
                "mandatRef": "PM645567"
              },
              {
                "acteurRef": "PA609205",
                "mandatRef": "PM645128"
              },
              {
                "acteurRef": "PA609292",
                "mandatRef": "PM645169"
              },
              {
                "acteurRef": "PA609743",
                "mandatRef": "PM645321"
              },
              {
                "acteurRef": "PA609435",
                "mandatRef": "PM645211"
              },
              {
                "acteurRef": "PA609691",
                "mandatRef": "PM645296"
              },
              {
                "acteurRef": "PA609983",
                "mandatRef": "PM645048"
              },
              {
                "acteurRef": "PA672",
                "mandatRef": "PM645175"
              },
              {
                "acteurRef": "PA610313",
                "mandatRef": "PM645122"
              },
              {
                "acteurRef": "PA610354",
                "mandatRef": "PM645106"
              },
              {
                "acteurRef": "PA608363",
                "mandatRef": "PM645571"
              },
              {
                "acteurRef": "PA344242",
                "mandatRef": "PM645170"
              },
              {
                "acteurRef": "PA609535",
                "mandatRef": "PM645236"
              },
              {
                "acteurRef": "PA610529",
                "mandatRef": "PM645192"
              },
              {
                "acteurRef": "PA610594",
                "mandatRef": "PM645185"
              },
              {
                "acteurRef": "PA610729",
                "mandatRef": "PM645288"
              },
              {
                "acteurRef": "PA609963",
                "mandatRef": "PM645045"
              },
              {
                "acteurRef": "PA610758",
                "mandatRef": "PM645301"
              },
              {
                "acteurRef": "PA608011",
                "mandatRef": "PM645066"
              },
              {
                "acteurRef": "PA610905",
                "mandatRef": "PM645225"
              },
              {
                "acteurRef": "PA610936",
                "mandatRef": "PM645230"
              },
              {
                "acteurRef": "PA642836",
                "mandatRef": "PM676799"
              },
              {
                "acteurRef": "PA642987",
                "mandatRef": "PM676803"
              },
              {
                "acteurRef": "PA608741",
                "mandatRef": "PM676810"
              },
              {
                "acteurRef": "PA342332",
                "mandatRef": "PM676816"
              },
              {
                "acteurRef": "PA643069",
                "mandatRef": "PM701218"
              },
              {
                "acteurRef": "PA643205",
                "mandatRef": "PM701215"
              },
              {
                "acteurRef": "PA643020",
                "mandatRef": "PM702199"
              },
              {
                "acteurRef": "PA643002",
                "mandatRef": "PM703297"
              },
              {
                "acteurRef": "PA642805",
                "mandatRef": "PM703478"
              },
              {
                "acteurRef": "PA643177",
                "mandatRef": "PM709055"
              },
              {
                "acteurRef": "PA642790",
                "mandatRef": "PM709217"
              },
              {
                "acteurRef": "PA642736",
                "mandatRef": "PM711657"
              },
              {
                "acteurRef": "PA642699",
                "mandatRef": "PM711712"
              },
              {
                "acteurRef": "PA642965",
                "mandatRef": "PM711810"
              },
              {
                "acteurRef": "PA643165",
                "mandatRef": "PM711811"
              },
              {
                "acteurRef": "PA643196",
                "mandatRef": "PM711809"
              },
              {
                "acteurRef": "PA712422",
                "mandatRef": "PM712424"
              }
            ],
            "abstentions": [
              {
                "acteurRef": "PA2374",
                "mandatRef": "PM645217"
              },
              {
                "acteurRef": "PA605952",
                "mandatRef": "PM645049"
              }
            ]
          }
        }
      },
      {
        "organeRef": "PO707869",
        "nombreMembresGroupe": "196",
        "vote": {
          "positionMajoritaire": "pour",
          "decompteVoix": {
            "pour": "80",
            "contre": "0",
            "abstentions": "0"
          },
          "decompteNominatif": {
            "pour": [
              {
                "acteurRef": "PA951",
                "mandatRef": "PM645280"
              },
              {
                "acteurRef": "PA1699",
                "mandatRef": "PM645390"
              },
              {
                "acteurRef": "PA1761",
                "mandatRef": "PM645501"
              },
              {
                "acteurRef": "PA1954",
                "mandatRef": "PM645195"
              },
              {
                "acteurRef": "PA2250",
                "mandatRef": "PM645539"
              },
              {
                "acteurRef": "PA2936",
                "mandatRef": "PM645272"
              },
              {
                "acteurRef": "PA259",
                "mandatRef": "PM645395"
              },
              {
                "acteurRef": "PA2377",
                "mandatRef": "PM645591"
              },
              {
                "acteurRef": "PA333134",
                "mandatRef": "PM645341"
              },
              {
                "acteurRef": "PA606712",
                "mandatRef": "PM645549"
              },
              {
                "acteurRef": "PA230",
                "mandatRef": "PM645553"
              },
              {
                "acteurRef": "PA856",
                "mandatRef": "PM645353"
              },
              {
                "acteurRef": "PA1031",
                "mandatRef": "PM645044"
              },
              {
                "acteurRef": "PA1661",
                "mandatRef": "PM645181"
              },
              {
                "acteurRef": "PA1874",
                "mandatRef": "PM645474"
              },
              {
                "acteurRef": "PA2257",
                "mandatRef": "PM645201"
              },
              {
                "acteurRef": "PA2277",
                "mandatRef": "PM645135"
              },
              {
                "acteurRef": "PA2775",
                "mandatRef": "PM645461"
              },
              {
                "acteurRef": "PA1152",
                "mandatRef": "PM645561"
              },
              {
                "acteurRef": "PA606693",
                "mandatRef": "PM645542"
              },
              {
                "acteurRef": "PA1695",
                "mandatRef": "PM645157"
              },
              {
                "acteurRef": "PA2155",
                "mandatRef": "PM705467"
              },
              {
                "acteurRef": "PA917",
                "mandatRef": "PM645163"
              },
              {
                "acteurRef": "PA267797",
                "mandatRef": "PM645350"
              },
              {
                "acteurRef": "PA345937",
                "mandatRef": "PM645177"
              },
              {
                "acteurRef": "PA1379",
                "mandatRef": "PM645433"
              },
              {
                "acteurRef": "PA1574",
                "mandatRef": "PM645430"
              },
              {
                "acteurRef": "PA346876",
                "mandatRef": "PM645097"
              },
              {
                "acteurRef": "PA2971",
                "mandatRef": "PM645392"
              },
              {
                "acteurRef": "PA266788",
                "mandatRef": "PM645294"
              },
              {
                "acteurRef": "PA1029",
                "mandatRef": "PM645524"
              },
              {
                "acteurRef": "PA334843",
                "mandatRef": "PM645589"
              },
              {
                "acteurRef": "PA267013",
                "mandatRef": "PM645613"
              },
              {
                "acteurRef": "PA267057",
                "mandatRef": "PM645399"
              },
              {
                "acteurRef": "PA267227",
                "mandatRef": "PM645618"
              },
              {
                "acteurRef": "PA267260",
                "mandatRef": "PM645459"
              },
              {
                "acteurRef": "PA267266",
                "mandatRef": "PM645489"
              },
              {
                "acteurRef": "PA267289",
                "mandatRef": "PM645242"
              },
              {
                "acteurRef": "PA267355",
                "mandatRef": "PM645581"
              },
              {
                "acteurRef": "PA267429",
                "mandatRef": "PM645130"
              },
              {
                "acteurRef": "PA267527",
                "mandatRef": "PM645555"
              },
              {
                "acteurRef": "PA267598",
                "mandatRef": "PM645286"
              },
              {
                "acteurRef": "PA267762",
                "mandatRef": "PM645455"
              },
              {
                "acteurRef": "PA267794",
                "mandatRef": "PM645442"
              },
              {
                "acteurRef": "PA267813",
                "mandatRef": "PM645172"
              },
              {
                "acteurRef": "PA2124",
                "mandatRef": "PM645475"
              },
              {
                "acteurRef": "PA2700",
                "mandatRef": "PM645196"
              },
              {
                "acteurRef": "PA2792",
                "mandatRef": "PM645308"
              },
              {
                "acteurRef": "PA267628",
                "mandatRef": "PM645046"
              },
              {
                "acteurRef": "PA267532",
                "mandatRef": "PM645558"
              },
              {
                "acteurRef": "PA605036",
                "mandatRef": "PM645278"
              },
              {
                "acteurRef": "PA1459",
                "mandatRef": "PM645518"
              },
              {
                "acteurRef": "PA1012",
                "mandatRef": "PM645168"
              },
              {
                "acteurRef": "PA335159",
                "mandatRef": "PM645554"
              },
              {
                "acteurRef": "PA243",
                "mandatRef": "PM645167"
              },
              {
                "acteurRef": "PA336576",
                "mandatRef": "PM645364"
              },
              {
                "acteurRef": "PA266797",
                "mandatRef": "PM645338"
              },
              {
                "acteurRef": "PA332523",
                "mandatRef": "PM645550"
              },
              {
                "acteurRef": "PA267450",
                "mandatRef": "PM645452"
              },
              {
                "acteurRef": "PA330788",
                "mandatRef": "PM645510"
              },
              {
                "acteurRef": "PA331146",
                "mandatRef": "PM645306"
              },
              {
                "acteurRef": "PA417099",
                "mandatRef": "PM645346"
              },
              {
                "acteurRef": "PA344492",
                "mandatRef": "PM645300"
              },
              {
                "acteurRef": "PA2664",
                "mandatRef": "PM645139"
              },
              {
                "acteurRef": "PA606478",
                "mandatRef": "PM645457"
              },
              {
                "acteurRef": "PA267735",
                "mandatRef": "PM645237"
              },
              {
                "acteurRef": "PA607090",
                "mandatRef": "PM645143"
              },
              {
                "acteurRef": "PA607603",
                "mandatRef": "PM645379"
              },
              {
                "acteurRef": "PA608662",
                "mandatRef": "PM645592"
              },
              {
                "acteurRef": "PA344776",
                "mandatRef": "PM645584"
              },
              {
                "acteurRef": "PA608851",
                "mandatRef": "PM645559"
              },
              {
                "acteurRef": "PA609245",
                "mandatRef": "PM645150"
              },
              {
                "acteurRef": "PA609726",
                "mandatRef": "PM645311"
              },
              {
                "acteurRef": "PA607489",
                "mandatRef": "PM645366"
              },
              {
                "acteurRef": "PA610830",
                "mandatRef": "PM645039"
              },
              {
                "acteurRef": "PA695511",
                "mandatRef": "PM695513"
              },
              {
                "acteurRef": "PA642759",
                "mandatRef": "PM701660"
              },
              {
                "acteurRef": "PA709315",
                "mandatRef": "PM709318"
              },
              {
                "acteurRef": "PA712015",
                "mandatRef": "PM712024"
              },
              {
                "acteurRef": "PA712014",
                "mandatRef": "PM712023"
              }
            ]
          }
        }
      },
      {
        "organeRef": "PO656010",
        "nombreMembresGroupe": "30",
        "vote": {
          "positionMajoritaire": "pour",
          "decompteVoix": {
            "pour": "4",
            "contre": "0",
            "abstentions": "0"
          },
          "decompteNominatif": {
            "pour": [
              {
                "acteurRef": "PA267042",
                "mandatRef": "PM645368"
              },
              {
                "acteurRef": "PA267585",
                "mandatRef": "PM645508"
              },
              {
                "acteurRef": "PA332228",
                "mandatRef": "PM645546"
              },
              {
                "acteurRef": "PA702052",
                "mandatRef": "PM702062"
              }
            ]
          }
        }
      },
      {
        "organeRef": "PO656022",
        "nombreMembresGroupe": "18",
        "vote": {
          "positionMajoritaire": "contre",
          "decompteVoix": {
            "pour": "0",
            "contre": "4",
            "abstentions": "0"
          },
          "decompteNominatif": {
            "contre": [
              {
                "acteurRef": "PA815",
                "mandatRef": "PM645544"
              },
              {
                "acteurRef": "PA2828",
                "mandatRef": "PM645402"
              },
              {
                "acteurRef": "PA267407",
                "mandatRef": "PM645320"
              },
              {
                "acteurRef": "PA332950",
                "mandatRef": "PM645251"
              }
            ]
          }
        }
      },
      {
        "organeRef": "PO656014",
        "nombreMembresGroupe": "17",
        "vote": {
          "positionMajoritaire": "pour",
          "decompteVoix": {
            "pour": "7",
            "contre": "6",
            "abstentions": "0"
          },
          "decompteNominatif": {
            "pour": [
              {
                "acteurRef": "PA608186",
                "mandatRef": "PM645202"
              },
              {
                "acteurRef": "PA610860",
                "mandatRef": "PM645212"
              },
              {
                "acteurRef": "PA605625",
                "mandatRef": "PM645398"
              },
              {
                "acteurRef": "PA588872",
                "mandatRef": "PM701032"
              },
              {
                "acteurRef": "PA610002",
                "mandatRef": "PM645053"
              },
              {
                "acteurRef": "PA610427",
                "mandatRef": "PM645158"
              },
              {
                "acteurRef": "PA606910",
                "mandatRef": "PM645547"
              }
            ],
            "contre": [
              {
                "acteurRef": "PA332747",
                "mandatRef": "PM645155"
              },
              {
                "acteurRef": "PA609016",
                "mandatRef": "PM645074"
              },
              {
                "acteurRef": "PA605518",
                "mandatRef": "PM645500"
              },
              {
                "acteurRef": "PA605963",
                "mandatRef": "PM645055"
              },
              {
                "acteurRef": "PA609816",
                "mandatRef": "PM645334"
              },
              {
                "acteurRef": "PA605922",
                "mandatRef": "PM645493"
              }
            ]
          }
        }
      },
      {
        "organeRef": "PO656018",
        "nombreMembresGroupe": "15",
        "vote": {
          "positionMajoritaire": "pour",
          "decompteVoix": {
            "pour": "7",
            "contre": "1",
            "abstentions": "0"
          },
          "decompteNominatif": {
            "pour": [
              {
                "acteurRef": "PA295",
                "mandatRef": "PM645103"
              },
              {
                "acteurRef": "PA1141",
                "mandatRef": "PM645468"
              },
              {
                "acteurRef": "PA1364",
                "mandatRef": "PM645084"
              },
              {
                "acteurRef": "PA689",
                "mandatRef": "PM645113"
              },
              {
                "acteurRef": "PA605745",
                "mandatRef": "PM645435"
              },
              {
                "acteurRef": "PA267306",
                "mandatRef": "PM645210"
              },
              {
                "acteurRef": "PA340755",
                "mandatRef": "PM645506"
              }
            ],
            "contre": [
              {
                "acteurRef": "PA610667",
                "mandatRef": "PM645269"
              }
            ]
          }
        }
      },
      {
        "organeRef": "PO645633",
        "nombreMembresGroupe": "12",
        "vote": {
          "positionMajoritaire": "contre",
          "decompteVoix": {
            "pour": "0",
            "contre": "1",
            "abstentions": "0"
          },
          "decompteNominatif": {
            "contre": [
              {
                "acteurRef": "PA608672",
                "mandatRef": "PM645597"
              }
            ]
          }
        }
      }
    ]
  },
  "miseAuPoint": {
    "contre": [
      {
        "acteurRef": "PA330130",
        "mandatRef": "PM645541"
      }
    ]
  }
}