{
  "uid": "VTANR5L14V64",
  "numero": "64",
  "organeRef": "PO644420",
  "legislature": "14",
  "sessionRef": "SCR5A2013O1",
  "seanceRef": "RUANR5L14S2013IDS16629",
  "dateScrutin": "2012-11-21T01:00:00.000+01:00",
  "quantiemeJourSeance": "2",
  "typeVote": {
    "codeTypeVote": "SPO",
    "libelleTypeVote": "scrutin public ordinaire",
    "typeMajorite": "majorité absolue des suffrages exprimés"
  },
  "sort": {
    "code": "rejeté",
    "libelle": "L'Assemblée nationale n'a pas adopté"
  },
  "titre": "l'amendement n° 61 rect. de Mme Abeille à l'article 1 er bis du projet de loi adopté par le Sénat, après engagement de la procédure accélérée, relatif à la mise en oeuvre du principe de participation du public défini à l'article 7 de la Charte de l'environnement (permis exclusifs de recherche).",
  "demandeur": {
    "texte": "Président du groupe de l'union des démocrates et indépendants"
  },
  "objet": {
    "libelle": "l'amendement n° 61 rect. de Mme Abeille à l'article 1 er bis du projet de loi adopté par le Sénat, après engagement de la procédure accélérée, relatif à la mise en oeuvre du principe de participation du public défini à l'article 7 de la Charte de l'environnement (permis exclusifs de recherche)."
  },
  "modePublicationDesVotes": "DecompteDissidentsPositionGroupe",
  "syntheseVote": {
    "nombreVotants": "51",
    "suffragesExprimes": "47",
    "nbrSuffragesRequis": "24",
    "annonce": "L'Assemblée nationale n'a pas adopté",
    "decompte": {
      "pour": "8",
      "contre": "39",
      "nonVotants": "2",
      "abstentions": "4"
    }
  },
  "ventilationVotes": {
    "organeRef": "PO644420",
    "groupes": [
      {
        "organeRef": "PO656002",
        "nombreMembresGroupe": "296",
        "vote": {
          "positionMajoritaire": "contre",
          "decompteVoix": {
            "pour": "0",
            "contre": "39",
            "nonVotants": "2",
            "abstentions": "2"
          },
          "decompteNominatif": {
            "nonVotants": [
              {
                "acteurRef": "PA381",
                "mandatRef": "PM645125",
                "causePositionVote": "PAN"
              },
              {
                "acteurRef": "PA1198",
                "mandatRef": "PM645393",
                "causePositionVote": "PSE"
              }
            ],
            "abstentions": [
              {
                "acteurRef": "PA339",
                "mandatRef": "PM645511"
              },
              {
                "acteurRef": "PA610066",
                "mandatRef": "PM645059"
              }
            ]
          }
        }
      },
      {
        "organeRef": "PO656006",
        "nombreMembresGroupe": "194",
        "vote": {
          "positionMajoritaire": "pour",
          "decompteVoix": {
            "pour": "2",
            "contre": "0",
            "abstentions": "2"
          },
          "decompteNominatif": {
            "abstentions": [
              {
                "acteurRef": "PA605991",
                "mandatRef": "PM645081"
              },
              {
                "acteurRef": "PA609726",
                "mandatRef": "PM645311"
              }
            ]
          }
        }
      },
      {
        "organeRef": "PO656010",
        "nombreMembresGroupe": "29",
        "vote": {
          "positionMajoritaire": "pour",
          "decompteVoix": {
            "pour": "4",
            "contre": "0",
            "abstentions": "0"
          },
          "decompteNominatif": {}
        }
      },
      {
        "organeRef": "PO656014",
        "nombreMembresGroupe": "17",
        "vote": {
          "positionMajoritaire": "pour",
          "decompteVoix": {
            "pour": "2",
            "contre": "0",
            "abstentions": "0"
          },
          "decompteNominatif": {}
        }
      },
      {
        "organeRef": "PO656022",
        "nombreMembresGroupe": "16",
        "vote": {
          "positionMajoritaire": "pour",
          "decompteVoix": {
            "pour": "0",
            "contre": "0",
            "abstentions": "0"
          },
          "decompteNominatif": {}
        }
      },
      {
        "organeRef": "PO656018",
        "nombreMembresGroupe": "15",
        "vote": {
          "positionMajoritaire": "pour",
          "decompteVoix": {
            "pour": "0",
            "contre": "0",
            "abstentions": "0"
          },
          "decompteNominatif": {}
        }
      },
      {
        "organeRef": "PO645633",
        "nombreMembresGroupe": "7",
        "vote": {
          "positionMajoritaire": "pour",
          "decompteVoix": {
            "pour": "0",
            "contre": "0",
            "abstentions": "0"
          },
          "decompteNominatif": {}
        }
      }
    ]
  }
}