{
  "uid": "VTANR5L14V1037",
  "numero": "1037",
  "organeRef": "PO644420",
  "legislature": "14",
  "sessionRef": "SCR5A2015O1",
  "seanceRef": "RUANR5L14S2015IDS19041",
  "dateScrutin": "2015-02-18T01:00:00.000+01:00",
  "quantiemeJourSeance": "1",
  "typeVote": {
    "codeTypeVote": "SPO",
    "libelleTypeVote": "scrutin public ordinaire",
    "typeMajorite": "majorité absolue des suffrages exprimés"
  },
  "sort": {
    "code": "rejeté",
    "libelle": "L'Assemblée nationale n'a pas adopté"
  },
  "titre": "l'amendement n° 915 de M. Molac après l'article premier du projet de loi, adopté par le Sénat, portant nouvelle organisation territoriale de la République (première lecture).",
  "demandeur": {
    "texte": "Président du groupe de l'union pour un mouvement populaire"
  },
  "objet": {
    "libelle": "l'amendement n° 915 de M. Molac après l'article premier du projet de loi, adopté par le Sénat, portant nouvelle organisation territoriale de la République (première lecture)."
  },
  "modePublicationDesVotes": "DecompteNominatif",
  "syntheseVote": {
    "nombreVotants": "47",
    "suffragesExprimes": "45",
    "nbrSuffragesRequis": "23",
    "annonce": "L'Assemblée nationale n'a pas adopté",
    "decompte": {
      "pour": "19",
      "contre": "26",
      "nonVotants": "2",
      "abstentions": "2"
    }
  },
  "ventilationVotes": {
    "organeRef": "PO644420",
    "groupes": [
      {
        "organeRef": "PO656002",
        "nombreMembresGroupe": "288",
        "vote": {
          "positionMajoritaire": "contre",
          "decompteVoix": {
            "pour": "2",
            "contre": "25",
            "nonVotants": "2",
            "abstentions": "1"
          },
          "decompteNominatif": {
            "nonVotants": [
              {
                "acteurRef": "PA381",
                "mandatRef": "PM645125",
                "causePositionVote": "PAN"
              },
              {
                "acteurRef": "PA1198",
                "mandatRef": "PM645393",
                "causePositionVote": "PSE"
              }
            ],
            "pour": [
              {
                "acteurRef": "PA331594",
                "mandatRef": "PM645208"
              },
              {
                "acteurRef": "PA331658",
                "mandatRef": "PM645277"
              }
            ],
            "contre": [
              {
                "acteurRef": "PA609218",
                "mandatRef": "PM645132"
              },
              {
                "acteurRef": "PA2343",
                "mandatRef": "PM645498"
              },
              {
                "acteurRef": "PA1844",
                "mandatRef": "PM645254"
              },
              {
                "acteurRef": "PA608083",
                "mandatRef": "PM645142"
              },
              {
                "acteurRef": "PA331807",
                "mandatRef": "PM645367"
              },
              {
                "acteurRef": "PA331835",
                "mandatRef": "PM645380"
              },
              {
                "acteurRef": "PA330357",
                "mandatRef": "PM645453"
              },
              {
                "acteurRef": "PA332305",
                "mandatRef": "PM645562"
              },
              {
                "acteurRef": "PA332636",
                "mandatRef": "PM645118"
              },
              {
                "acteurRef": "PA332206",
                "mandatRef": "PM645538"
              },
              {
                "acteurRef": "PA332796",
                "mandatRef": "PM645193"
              },
              {
                "acteurRef": "PA342415",
                "mandatRef": "PM645532"
              },
              {
                "acteurRef": "PA606555",
                "mandatRef": "PM645477"
              },
              {
                "acteurRef": "PA606665",
                "mandatRef": "PM645526"
              },
              {
                "acteurRef": "PA267706",
                "mandatRef": "PM645529"
              },
              {
                "acteurRef": "PA607395",
                "mandatRef": "PM645343"
              },
              {
                "acteurRef": "PA608172",
                "mandatRef": "PM645197"
              },
              {
                "acteurRef": "PA608785",
                "mandatRef": "PM645567"
              },
              {
                "acteurRef": "PA609775",
                "mandatRef": "PM645329"
              },
              {
                "acteurRef": "PA609435",
                "mandatRef": "PM645211"
              },
              {
                "acteurRef": "PA609845",
                "mandatRef": "PM645339"
              },
              {
                "acteurRef": "PA609314",
                "mandatRef": "PM645145"
              },
              {
                "acteurRef": "PA608264",
                "mandatRef": "PM645248"
              },
              {
                "acteurRef": "PA643069",
                "mandatRef": "PM701218"
              },
              {
                "acteurRef": "PA642764",
                "mandatRef": "PM702198"
              }
            ],
            "abstentions": [
              {
                "acteurRef": "PA331990",
                "mandatRef": "PM645449"
              }
            ]
          }
        }
      },
      {
        "organeRef": "PO656006",
        "nombreMembresGroupe": "198",
        "vote": {
          "positionMajoritaire": "pour",
          "decompteVoix": {
            "pour": "11",
            "contre": "0",
            "abstentions": "0"
          },
          "decompteNominatif": {
            "pour": [
              {
                "acteurRef": "PA1874",
                "mandatRef": "PM645474"
              },
              {
                "acteurRef": "PA606693",
                "mandatRef": "PM645542"
              },
              {
                "acteurRef": "PA2815",
                "mandatRef": "PM645514"
              },
              {
                "acteurRef": "PA267527",
                "mandatRef": "PM645555"
              },
              {
                "acteurRef": "PA608826",
                "mandatRef": "PM645556"
              },
              {
                "acteurRef": "PA267178",
                "mandatRef": "PM645473"
              },
              {
                "acteurRef": "PA605991",
                "mandatRef": "PM645081"
              },
              {
                "acteurRef": "PA607603",
                "mandatRef": "PM645379"
              },
              {
                "acteurRef": "PA344776",
                "mandatRef": "PM645584"
              },
              {
                "acteurRef": "PA314",
                "mandatRef": "PM645292"
              },
              {
                "acteurRef": "PA607489",
                "mandatRef": "PM645366"
              }
            ]
          }
        }
      },
      {
        "organeRef": "PO656010",
        "nombreMembresGroupe": "30",
        "vote": {
          "positionMajoritaire": "pour",
          "decompteVoix": {
            "pour": "1",
            "contre": "0",
            "abstentions": "1"
          },
          "decompteNominatif": {
            "pour": [
              {
                "acteurRef": "PA1960",
                "mandatRef": "PM645107"
              }
            ],
            "abstentions": [
              {
                "acteurRef": "PA267469",
                "mandatRef": "PM645314"
              }
            ]
          }
        }
      },
      {
        "organeRef": "PO656014",
        "nombreMembresGroupe": "18",
        "vote": {
          "positionMajoritaire": "pour",
          "decompteVoix": {
            "pour": "4",
            "contre": "0",
            "abstentions": "0"
          },
          "decompteNominatif": {
            "pour": [
              {
                "acteurRef": "PA332747",
                "mandatRef": "PM645155"
              },
              {
                "acteurRef": "PA605518",
                "mandatRef": "PM645500"
              },
              {
                "acteurRef": "PA607619",
                "mandatRef": "PM645383"
              },
              {
                "acteurRef": "PA605922",
                "mandatRef": "PM645493"
              }
            ]
          }
        }
      },
      {
        "organeRef": "PO656022",
        "nombreMembresGroupe": "18",
        "vote": {
          "positionMajoritaire": "pour",
          "decompteVoix": {
            "pour": "1",
            "contre": "0",
            "abstentions": "0"
          },
          "decompteNominatif": {
            "pour": [
              {
                "acteurRef": "PA608292",
                "mandatRef": "PM645276"
              }
            ]
          }
        }
      },
      {
        "organeRef": "PO656018",
        "nombreMembresGroupe": "15",
        "vote": {
          "positionMajoritaire": "contre",
          "decompteVoix": {
            "pour": "0",
            "contre": "1",
            "abstentions": "0"
          },
          "decompteNominatif": {
            "contre": [
              {
                "acteurRef": "PA1141",
                "mandatRef": "PM645468"
              }
            ]
          }
        }
      },
      {
        "organeRef": "PO645633",
        "nombreMembresGroupe": "9",
        "vote": {
          "positionMajoritaire": "pour",
          "decompteVoix": {
            "pour": "0",
            "contre": "0",
            "abstentions": "0"
          },
          "decompteNominatif": {}
        }
      }
    ]
  }
}