{
  "uid": "VTANR5L14V516",
  "numero": "516",
  "organeRef": "PO644420",
  "legislature": "14",
  "sessionRef": "SCR5A2013O1",
  "seanceRef": "RUANR5L14S2013IDS17094",
  "dateScrutin": "2013-04-25T02:00:00.000+02:00",
  "quantiemeJourSeance": "3",
  "typeVote": {
    "codeTypeVote": "SPO",
    "libelleTypeVote": "scrutin public ordinaire",
    "typeMajorite": "majorité absolue des suffrages exprimés"
  },
  "sort": {
    "code": "rejeté",
    "libelle": "L'Assemblée nationale n'a pas adopté"
  },
  "titre": "l'amendement n°  5 de M. Darmanin après  l'article  unique de la proposition de loi relative à l'égalité des droits et à l'intégration des personnes en situation de handicap.",
  "demandeur": {
    "texte": "Président du groupe de l'union pour un mouvement populaire"
  },
  "objet": {
    "libelle": "l'amendement n°  5 de M. Darmanin après  l'article  unique de la proposition de loi relative à l'égalité des droits et à l'intégration des personnes en situation de handicap."
  },
  "modePublicationDesVotes": "DecompteDissidentsPositionGroupe",
  "syntheseVote": {
    "nombreVotants": "35",
    "suffragesExprimes": "33",
    "nbrSuffragesRequis": "17",
    "annonce": "L'Assemblée nationale n'a pas adopté",
    "decompte": {
      "pour": "11",
      "contre": "22",
      "nonVotants": "2",
      "abstentions": "2"
    }
  },
  "ventilationVotes": {
    "organeRef": "PO644420",
    "groupes": [
      {
        "organeRef": "PO656002",
        "nombreMembresGroupe": "292",
        "vote": {
          "positionMajoritaire": "contre",
          "decompteVoix": {
            "pour": "0",
            "contre": "22",
            "nonVotants": "2",
            "abstentions": "2"
          },
          "decompteNominatif": {
            "nonVotants": [
              {
                "acteurRef": "PA381",
                "mandatRef": "PM645125",
                "causePositionVote": "PAN"
              },
              {
                "acteurRef": "PA335017",
                "mandatRef": "PM645607",
                "causePositionVote": "PSE"
              }
            ],
            "abstentions": [
              {
                "acteurRef": "PA606040",
                "mandatRef": "PM645144"
              },
              {
                "acteurRef": "PA342539",
                "mandatRef": "PM676818"
              }
            ]
          }
        }
      },
      {
        "organeRef": "PO656006",
        "nombreMembresGroupe": "196",
        "vote": {
          "positionMajoritaire": "pour",
          "decompteVoix": {
            "pour": "9",
            "contre": "0",
            "abstentions": "0"
          },
          "decompteNominatif": {}
        }
      },
      {
        "organeRef": "PO656010",
        "nombreMembresGroupe": "30",
        "vote": {
          "positionMajoritaire": "pour",
          "decompteVoix": {
            "pour": "2",
            "contre": "0",
            "abstentions": "0"
          },
          "decompteNominatif": {}
        }
      },
      {
        "organeRef": "PO656014",
        "nombreMembresGroupe": "17",
        "vote": {
          "positionMajoritaire": "pour",
          "decompteVoix": {
            "pour": "0",
            "contre": "0",
            "abstentions": "0"
          },
          "decompteNominatif": {}
        }
      },
      {
        "organeRef": "PO656022",
        "nombreMembresGroupe": "16",
        "vote": {
          "positionMajoritaire": "pour",
          "decompteVoix": {
            "pour": "0",
            "contre": "0",
            "abstentions": "0"
          },
          "decompteNominatif": {}
        }
      },
      {
        "organeRef": "PO656018",
        "nombreMembresGroupe": "15",
        "vote": {
          "positionMajoritaire": "pour",
          "decompteVoix": {
            "pour": "0",
            "contre": "0",
            "abstentions": "0"
          },
          "decompteNominatif": {}
        }
      },
      {
        "organeRef": "PO645633",
        "nombreMembresGroupe": "8",
        "vote": {
          "positionMajoritaire": "pour",
          "decompteVoix": {
            "pour": "0",
            "contre": "0",
            "abstentions": "0"
          },
          "decompteNominatif": {}
        }
      }
    ]
  }
}