{
  "uid": "VTANR5L14V67",
  "numero": "67",
  "organeRef": "PO644420",
  "legislature": "14",
  "sessionRef": "SCR5A2013O1",
  "seanceRef": "RUANR5L14S2013IDS16631",
  "dateScrutin": "2012-11-22T01:00:00.000+01:00",
  "quantiemeJourSeance": "2",
  "typeVote": {
    "codeTypeVote": "SPO",
    "libelleTypeVote": "scrutin public ordinaire",
    "typeMajorite": "majorité absolue des suffrages exprimés"
  },
  "sort": {
    "code": "adopté",
    "libelle": "l'Assemblée nationale a adopté"
  },
  "titre": "l'amendement n° 1, présenté par le Gouvernement, de suppression de l'article unique de la proposition de loi visant à déconnecter le prix du gaz de celui du pétrole pour la fixation des tarifs réglementés du gaz naturel.",
  "demandeur": {
    "texte": "Président du groupe de l'union des démocrates et indépendants"
  },
  "objet": {
    "libelle": "l'amendement n° 1, présenté par le Gouvernement, de suppression de l'article unique de la proposition de loi visant à déconnecter le prix du gaz de celui du pétrole pour la fixation des tarifs réglementés du gaz naturel."
  },
  "modePublicationDesVotes": "DecompteDissidentsPositionGroupe",
  "syntheseVote": {
    "nombreVotants": "101",
    "suffragesExprimes": "99",
    "nbrSuffragesRequis": "50",
    "annonce": "l'Assemblée nationale a adopté",
    "decompte": {
      "pour": "66",
      "contre": "33",
      "nonVotants": "2",
      "abstentions": "2"
    }
  },
  "ventilationVotes": {
    "organeRef": "PO644420",
    "groupes": [
      {
        "organeRef": "PO656002",
        "nombreMembresGroupe": "296",
        "vote": {
          "positionMajoritaire": "pour",
          "decompteVoix": {
            "pour": "61",
            "contre": "0",
            "nonVotants": "2",
            "abstentions": "0"
          },
          "decompteNominatif": {
            "nonVotants": [
              {
                "acteurRef": "PA381",
                "mandatRef": "PM645125",
                "causePositionVote": "PAN"
              },
              {
                "acteurRef": "PA1198",
                "mandatRef": "PM645393",
                "causePositionVote": "PSE"
              }
            ]
          }
        }
      },
      {
        "organeRef": "PO656006",
        "nombreMembresGroupe": "194",
        "vote": {
          "positionMajoritaire": "contre",
          "decompteVoix": {
            "pour": "0",
            "contre": "10",
            "abstentions": "0"
          },
          "decompteNominatif": {}
        }
      },
      {
        "organeRef": "PO656010",
        "nombreMembresGroupe": "29",
        "vote": {
          "positionMajoritaire": "contre",
          "decompteVoix": {
            "pour": "0",
            "contre": "23",
            "abstentions": "0"
          },
          "decompteNominatif": {}
        }
      },
      {
        "organeRef": "PO656014",
        "nombreMembresGroupe": "17",
        "vote": {
          "positionMajoritaire": "pour",
          "decompteVoix": {
            "pour": "3",
            "contre": "0",
            "abstentions": "0"
          },
          "decompteNominatif": {}
        }
      },
      {
        "organeRef": "PO656022",
        "nombreMembresGroupe": "16",
        "vote": {
          "positionMajoritaire": "pour",
          "decompteVoix": {
            "pour": "2",
            "contre": "0",
            "abstentions": "0"
          },
          "decompteNominatif": {}
        }
      },
      {
        "organeRef": "PO656018",
        "nombreMembresGroupe": "15",
        "vote": {
          "positionMajoritaire": "abstention",
          "decompteVoix": {
            "pour": "0",
            "contre": "0",
            "abstentions": "2"
          },
          "decompteNominatif": {}
        }
      },
      {
        "organeRef": "PO645633",
        "nombreMembresGroupe": "7",
        "vote": {
          "positionMajoritaire": "pour",
          "decompteVoix": {
            "pour": "0",
            "contre": "0",
            "abstentions": "0"
          },
          "decompteNominatif": {}
        }
      }
    ]
  },
  "miseAuPoint": {
    "pour": [
      {
        "acteurRef": "PA336439",
        "mandatRef": "PM645333"
      },
      {
        "acteurRef": "PA606665",
        "mandatRef": "PM645526"
      }
    ]
  }
}