{
  "@xmlns:xsi": "http://www.w3.org/2001/XMLSchema-instance",
  "uid": "VTANR5L14V872",
  "numero": "872",
  "organeRef": "PO644420",
  "legislature": "14",
  "sessionRef": "SCR5A2014E1",
  "seanceRef": "RUANR5L14S2014IDS18611",
  "dateScrutin": "2014-07-08T02:00:00.000+02:00",
  "quantiemeJourSeance": "1",
  "typeVote": {
    "codeTypeVote": "SPO",
    "libelleTypeVote": "scrutin public ordinaire",
    "typeMajorite": "majorité absolue des suffrages exprimés"
  },
  "sort": {
    "code": "rejeté",
    "libelle": "L'Assemblée nationale n'a pas adopté"
  },
  "titre": "l'amendement n° 1050 de Mme Genevard à l'article 5 du projet de loi d'avenir pour l'agriculture, l'alimentation et la forêt (deuxième lecture).",
  "demandeur": {
    "texte": "Président du groupe de l'union pour un mouvement populaire",
    "referenceLegislative": null
  },
  "objet": {
    "libelle": "l'amendement n° 1050 de Mme Genevard à l'article 5 du projet de loi d'avenir pour l'agriculture, l'alimentation et la forêt (deuxième lecture).",
    "referenceLegislative": null
  },
  "modePublicationDesVotes": "DecompteNominatif",
  "syntheseVote": {
    "nombreVotants": "49",
    "suffragesExprimes": "48",
    "nbrSuffragesRequis": "25",
    "annonce": "L'Assemblée nationale n'a pas adopté",
    "decompte": {
      "pour": "14",
      "contre": "34",
      "abstentions": "1",
      "nonVotants": "3"
    }
  },
  "ventilationVotes": {
    "organe": {
      "organeRef": "PO644420",
      "groupes": {
        "groupe": [
          {
            "organeRef": "PO656002",
            "nombreMembresGroupe": "290",
            "vote": {
              "positionMajoritaire": "contre",
              "decompteVoix": {
                "pour": "0",
                "contre": "28",
                "abstention": "1",
                "nonVotant": "1"
              },
              "decompteNominatif": {
                "nonVotants": {
                  "votant": {
                    "acteurRef": "PA381",
                    "mandatRef": "PM645125",
                    "causePositionVote": "PAN"
                  }
                },
                "pour": null,
                "contre": {
                  "votant": [
                    {
                      "acteurRef": "PA1991",
                      "mandatRef": "PM645156"
                    },
                    {
                      "acteurRef": "PA267091",
                      "mandatRef": "PM645467"
                    },
                    {
                      "acteurRef": "PA339",
                      "mandatRef": "PM645511"
                    },
                    {
                      "acteurRef": "PA680",
                      "mandatRef": "PM645536"
                    },
                    {
                      "acteurRef": "PA2343",
                      "mandatRef": "PM645498"
                    },
                    {
                      "acteurRef": "PA609513",
                      "mandatRef": "PM645228"
                    },
                    {
                      "acteurRef": "PA770",
                      "mandatRef": "PM645361"
                    },
                    {
                      "acteurRef": "PA1193",
                      "mandatRef": "PM645344"
                    },
                    {
                      "acteurRef": "PA1032",
                      "mandatRef": "PM645488"
                    },
                    {
                      "acteurRef": "PA330118",
                      "mandatRef": "PM645540"
                    },
                    {
                      "acteurRef": "PA267923",
                      "mandatRef": "PM645120"
                    },
                    {
                      "acteurRef": "PA331973",
                      "mandatRef": "PM645438"
                    },
                    {
                      "acteurRef": "PA336015",
                      "mandatRef": "PM645222"
                    },
                    {
                      "acteurRef": "PA330546",
                      "mandatRef": "PM645492"
                    },
                    {
                      "acteurRef": "PA337504",
                      "mandatRef": "PM645271"
                    },
                    {
                      "acteurRef": "PA331658",
                      "mandatRef": "PM645277"
                    },
                    {
                      "acteurRef": "PA342415",
                      "mandatRef": "PM645532"
                    },
                    {
                      "acteurRef": "PA605349",
                      "mandatRef": "PM645483"
                    },
                    {
                      "acteurRef": "PA605606",
                      "mandatRef": "PM645394"
                    },
                    {
                      "acteurRef": "PA605952",
                      "mandatRef": "PM645049"
                    },
                    {
                      "acteurRef": "PA606149",
                      "mandatRef": "PM645218"
                    },
                    {
                      "acteurRef": "PA606586",
                      "mandatRef": "PM645490"
                    },
                    {
                      "acteurRef": "PA607155",
                      "mandatRef": "PM645200"
                    },
                    {
                      "acteurRef": "PA607595",
                      "mandatRef": "PM645377"
                    },
                    {
                      "acteurRef": "PA607553",
                      "mandatRef": "PM645373"
                    },
                    {
                      "acteurRef": "PA608310",
                      "mandatRef": "PM645293"
                    },
                    {
                      "acteurRef": "PA608778",
                      "mandatRef": "PM645565"
                    },
                    {
                      "acteurRef": "PA608011",
                      "mandatRef": "PM645066"
                    }
                  ]
                },
                "abstentions": {
                  "votant": {
                    "acteurRef": "PA334951",
                    "mandatRef": "PM645594"
                  }
                }
              }
            }
          },
          {
            "organeRef": "PO656006",
            "nombreMembresGroupe": "199",
            "vote": {
              "positionMajoritaire": "pour",
              "decompteVoix": {
                "pour": "12",
                "contre": "0",
                "abstention": "0",
                "nonVotant": "1"
              },
              "decompteNominatif": {
                "nonVotants": {
                  "votant": {
                    "acteurRef": "PA1874",
                    "mandatRef": "PM645474",
                    "causePositionVote": "PSE"
                  }
                },
                "pour": {
                  "votant": [
                    {
                      "acteurRef": "PA267689",
                      "mandatRef": "PM645295"
                    },
                    {
                      "acteurRef": "PA267355",
                      "mandatRef": "PM645581"
                    },
                    {
                      "acteurRef": "PA267429",
                      "mandatRef": "PM645130"
                    },
                    {
                      "acteurRef": "PA267762",
                      "mandatRef": "PM645455"
                    },
                    {
                      "acteurRef": "PA2792",
                      "mandatRef": "PM645308"
                    },
                    {
                      "acteurRef": "PA266776",
                      "mandatRef": "PM645590"
                    },
                    {
                      "acteurRef": "PA267551",
                      "mandatRef": "PM645372"
                    },
                    {
                      "acteurRef": "PA267178",
                      "mandatRef": "PM645473"
                    },
                    {
                      "acteurRef": "PA605991",
                      "mandatRef": "PM645081"
                    },
                    {
                      "acteurRef": "PA2664",
                      "mandatRef": "PM645139"
                    },
                    {
                      "acteurRef": "PA607603",
                      "mandatRef": "PM645379"
                    },
                    {
                      "acteurRef": "PA609740",
                      "mandatRef": "PM645319"
                    }
                  ]
                },
                "contre": null,
                "abstentions": null
              }
            }
          },
          {
            "organeRef": "PO656010",
            "nombreMembresGroupe": "30",
            "vote": {
              "positionMajoritaire": "pour",
              "decompteVoix": {
                "pour": "2",
                "contre": "0",
                "abstention": "0"
              },
              "decompteNominatif": {
                "nonVotants": "0",
                "pour": {
                  "votant": [
                    {
                      "acteurRef": "PA331582",
                      "mandatRef": "PM645198"
                    },
                    {
                      "acteurRef": "PA332228",
                      "mandatRef": "PM645546"
                    }
                  ]
                },
                "contre": null,
                "abstentions": null
              }
            }
          },
          {
            "organeRef": "PO656014",
            "nombreMembresGroupe": "18",
            "vote": {
              "positionMajoritaire": "contre",
              "decompteVoix": {
                "pour": "0",
                "contre": "2",
                "abstention": "0"
              },
              "decompteNominatif": {
                "nonVotants": "0",
                "pour": null,
                "contre": {
                  "votant": [
                    {
                      "acteurRef": "PA606910",
                      "mandatRef": "PM645547"
                    },
                    {
                      "acteurRef": "PA605922",
                      "mandatRef": "PM645493"
                    }
                  ]
                },
                "abstentions": null
              }
            }
          },
          {
            "organeRef": "PO656022",
            "nombreMembresGroupe": "16",
            "vote": {
              "positionMajoritaire": "contre",
              "decompteVoix": {
                "pour": "0",
                "contre": "3",
                "abstention": "0"
              },
              "decompteNominatif": {
                "nonVotants": "0",
                "pour": null,
                "contre": {
                  "votant": [
                    {
                      "acteurRef": "PA815",
                      "mandatRef": "PM645544"
                    },
                    {
                      "acteurRef": "PA267336",
                      "mandatRef": "PM645424"
                    },
                    {
                      "acteurRef": "PA608292",
                      "mandatRef": "PM645276"
                    }
                  ]
                },
                "abstentions": null
              }
            }
          },
          {
            "organeRef": "PO656018",
            "nombreMembresGroupe": "15",
            "vote": {
              "positionMajoritaire": "contre",
              "decompteVoix": {
                "pour": "0",
                "contre": "1",
                "abstention": "0"
              },
              "decompteNominatif": {
                "nonVotants": "0",
                "pour": null,
                "contre": {
                  "votant": {
                    "acteurRef": "PA267306",
                    "mandatRef": "PM645210"
                  }
                },
                "abstentions": null
              }
            }
          },
          {
            "organeRef": "PO645633",
            "nombreMembresGroupe": "9",
            "vote": {
              "positionMajoritaire": "pour",
              "decompteVoix": {
                "pour": "0",
                "contre": "0",
                "abstention": "0",
                "nonVotant": "1"
              },
              "decompteNominatif": {
                "nonVotants": {
                  "votant": {
                    "acteurRef": "PA337633",
                    "mandatRef": "PM702061",
                    "causePositionVote": "MG"
                  }
                },
                "pour": null,
                "contre": null,
                "abstentions": null
              }
            }
          }
        ]
      }
    }
  },
  "miseAuPoint": null
}