{
  "@xmlns:xsi": "http://www.w3.org/2001/XMLSchema-instance",
  "uid": "VTANR5L14V1149",
  "numero": "1149",
  "organeRef": "PO644420",
  "legislature": "14",
  "sessionRef": "SCR5A2015E1",
  "seanceRef": "RUANR5L14S2015IDS19385",
  "dateScrutin": "2015-07-02T02:00:00.000+02:00",
  "quantiemeJourSeance": "3",
  "typeVote": {
    "codeTypeVote": "SPO",
    "libelleTypeVote": "scrutin public ordinaire",
    "typeMajorite": "majorité absolue des suffrages exprimés"
  },
  "sort": {
    "code": "rejeté",
    "libelle": "L'Assemblée nationale n'a pas adopté"
  },
  "titre": "l'amendement n° 423 (rect.) de M. Carrez et l'amendement identique à l'article 17 septdecies du projet de loi portant nouvelle organisation territoriale de la République (2ème lecture).",
  "demandeur": {
    "texte": "Président du groupe Les Républicains",
    "referenceLegislative": null
  },
  "objet": {
    "libelle": "l'amendement n° 423 (rect.) de M. Carrez et l'amendement identique à l'article 17 septdecies du projet de loi portant nouvelle organisation territoriale de la République (2ème lecture).",
    "referenceLegislative": null
  },
  "modePublicationDesVotes": "DecompteNominatif",
  "syntheseVote": {
    "nombreVotants": "29",
    "suffragesExprimes": "28",
    "nbrSuffragesRequis": "15",
    "annonce": "L'Assemblée nationale n'a pas adopté",
    "decompte": {
      "pour": "13",
      "contre": "15",
      "abstentions": "1",
      "nonVotants": "4"
    }
  },
  "ventilationVotes": {
    "organe": {
      "organeRef": "PO644420",
      "groupes": {
        "groupe": [
          {
            "organeRef": "PO656002",
            "nombreMembresGroupe": "287",
            "vote": {
              "positionMajoritaire": "contre",
              "decompteVoix": {
                "pour": "0",
                "contre": "15",
                "abstention": "1",
                "nonVotant": "4"
              },
              "decompteNominatif": {
                "nonVotants": {
                  "votant": [
                    {
                      "acteurRef": "PA381",
                      "mandatRef": "PM645125",
                      "causePositionVote": "PAN"
                    },
                    {
                      "acteurRef": "PA335319",
                      "mandatRef": "PM645070",
                      "causePositionVote": "PSE"
                    },
                    {
                      "acteurRef": "PA330981",
                      "mandatRef": "PM645409",
                      "causePositionVote": "MG"
                    },
                    {
                      "acteurRef": "PA605606",
                      "mandatRef": "PM645394",
                      "causePositionVote": "MG"
                    }
                  ]
                },
                "pour": null,
                "contre": {
                  "votant": [
                    {
                      "acteurRef": "PA610481",
                      "mandatRef": "PM645131"
                    },
                    {
                      "acteurRef": "PA609218",
                      "mandatRef": "PM645132"
                    },
                    {
                      "acteurRef": "PA735",
                      "mandatRef": "PM645089"
                    },
                    {
                      "acteurRef": "PA267835",
                      "mandatRef": "PM645134"
                    },
                    {
                      "acteurRef": "PA267965",
                      "mandatRef": "PM645052"
                    },
                    {
                      "acteurRef": "PA330357",
                      "mandatRef": "PM645453"
                    },
                    {
                      "acteurRef": "PA336971",
                      "mandatRef": "PM645102"
                    },
                    {
                      "acteurRef": "PA267706",
                      "mandatRef": "PM645529"
                    },
                    {
                      "acteurRef": "PA609435",
                      "mandatRef": "PM645211"
                    },
                    {
                      "acteurRef": "PA672",
                      "mandatRef": "PM645175"
                    },
                    {
                      "acteurRef": "PA610594",
                      "mandatRef": "PM645185"
                    },
                    {
                      "acteurRef": "PA610539",
                      "mandatRef": "PM645194"
                    },
                    {
                      "acteurRef": "PA642940",
                      "mandatRef": "PM676814"
                    },
                    {
                      "acteurRef": "PA267623",
                      "mandatRef": "PM676817"
                    },
                    {
                      "acteurRef": "PA643205",
                      "mandatRef": "PM701215"
                    }
                  ]
                },
                "abstentions": {
                  "votant": {
                    "acteurRef": "PA765",
                    "mandatRef": "PM645138"
                  }
                }
              }
            }
          },
          {
            "organeRef": "PO707869",
            "nombreMembresGroupe": "198",
            "vote": {
              "positionMajoritaire": "pour",
              "decompteVoix": {
                "pour": "9",
                "contre": "0",
                "abstention": "0"
              },
              "decompteNominatif": {
                "nonVotants": "0",
                "pour": {
                  "votant": [
                    {
                      "acteurRef": "PA1124",
                      "mandatRef": "PM687215"
                    },
                    {
                      "acteurRef": "PA2295",
                      "mandatRef": "PM645091"
                    },
                    {
                      "acteurRef": "PA1585",
                      "mandatRef": "PM645094"
                    },
                    {
                      "acteurRef": "PA1521",
                      "mandatRef": "PM645078"
                    },
                    {
                      "acteurRef": "PA746",
                      "mandatRef": "PM645154"
                    },
                    {
                      "acteurRef": "PA1630",
                      "mandatRef": "PM645176"
                    },
                    {
                      "acteurRef": "PA1770",
                      "mandatRef": "PM645069"
                    },
                    {
                      "acteurRef": "PA346876",
                      "mandatRef": "PM645097"
                    },
                    {
                      "acteurRef": "PA267628",
                      "mandatRef": "PM645046"
                    }
                  ]
                },
                "contre": null,
                "abstentions": null
              }
            }
          },
          {
            "organeRef": "PO656010",
            "nombreMembresGroupe": "30",
            "vote": {
              "positionMajoritaire": "pour",
              "decompteVoix": {
                "pour": "0",
                "contre": "0",
                "abstention": "0"
              },
              "decompteNominatif": {
                "nonVotants": "0",
                "pour": null,
                "contre": null,
                "abstentions": null
              }
            }
          },
          {
            "organeRef": "PO656014",
            "nombreMembresGroupe": "18",
            "vote": {
              "positionMajoritaire": "pour",
              "decompteVoix": {
                "pour": "2",
                "contre": "0",
                "abstention": "0"
              },
              "decompteNominatif": {
                "nonVotants": "0",
                "pour": {
                  "votant": [
                    {
                      "acteurRef": "PA609016",
                      "mandatRef": "PM645074"
                    },
                    {
                      "acteurRef": "PA610002",
                      "mandatRef": "PM645053"
                    }
                  ]
                },
                "contre": null,
                "abstentions": null
              }
            }
          },
          {
            "organeRef": "PO656022",
            "nombreMembresGroupe": "18",
            "vote": {
              "positionMajoritaire": "pour",
              "decompteVoix": {
                "pour": "0",
                "contre": "0",
                "abstention": "0"
              },
              "decompteNominatif": {
                "nonVotants": "0",
                "pour": null,
                "contre": null,
                "abstentions": null
              }
            }
          },
          {
            "organeRef": "PO656018",
            "nombreMembresGroupe": "15",
            "vote": {
              "positionMajoritaire": "pour",
              "decompteVoix": {
                "pour": "2",
                "contre": "0",
                "abstention": "0"
              },
              "decompteNominatif": {
                "nonVotants": "0",
                "pour": {
                  "votant": [
                    {
                      "acteurRef": "PA295",
                      "mandatRef": "PM645103"
                    },
                    {
                      "acteurRef": "PA1364",
                      "mandatRef": "PM645084"
                    }
                  ]
                },
                "contre": null,
                "abstentions": null
              }
            }
          },
          {
            "organeRef": "PO645633",
            "nombreMembresGroupe": "10",
            "vote": {
              "positionMajoritaire": "pour",
              "decompteVoix": {
                "pour": "0",
                "contre": "0",
                "abstention": "0"
              },
              "decompteNominatif": {
                "nonVotants": "0",
                "pour": null,
                "contre": null,
                "abstentions": null
              }
            }
          }
        ]
      }
    }
  },
  "miseAuPoint": null
}