{
  "@xmlns:xsi": "http://www.w3.org/2001/XMLSchema-instance",
  "uid": "VTANR5L14V1119",
  "numero": "1119",
  "organeRef": "PO644420",
  "legislature": "14",
  "sessionRef": "SCR5A2015O1",
  "seanceRef": "RUANR5L14S2015IDS19245",
  "dateScrutin": "2015-05-21T02:00:00.000+02:00",
  "quantiemeJourSeance": "3",
  "typeVote": {
    "codeTypeVote": "SPO",
    "libelleTypeVote": "scrutin public ordinaire",
    "typeMajorite": "majorité absolue des suffrages exprimés"
  },
  "sort": {
    "code": "rejeté",
    "libelle": "L'Assemblée nationale n'a pas adopté"
  },
  "titre": "l'amendement n° 384 de M. Carvalho à l'article 38 bis BA du projet de loi relatif à la transition énergétique pour la croissance verte (nouvelle lecture).",
  "demandeur": {
    "texte": "Président du groupe de l'union pour un mouvement populaire",
    "referenceLegislative": null
  },
  "objet": {
    "libelle": "l'amendement n° 384 de M. Carvalho à l'article 38 bis BA du projet de loi relatif à la transition énergétique pour la croissance verte (nouvelle lecture).",
    "referenceLegislative": null
  },
  "modePublicationDesVotes": "DecompteNominatif",
  "syntheseVote": {
    "nombreVotants": "23",
    "suffragesExprimes": "23",
    "nbrSuffragesRequis": "12",
    "annonce": "L'Assemblée nationale n'a pas adopté",
    "decompte": {
      "pour": "6",
      "contre": "17",
      "abstentions": "0",
      "nonVotants": "2"
    }
  },
  "ventilationVotes": {
    "organe": {
      "organeRef": "PO644420",
      "groupes": {
        "groupe": [
          {
            "organeRef": "PO656002",
            "nombreMembresGroupe": "288",
            "vote": {
              "positionMajoritaire": "contre",
              "decompteVoix": {
                "pour": "2",
                "contre": "13",
                "abstention": "0",
                "nonVotant": "1"
              },
              "decompteNominatif": {
                "nonVotants": {
                  "votant": {
                    "acteurRef": "PA381",
                    "mandatRef": "PM645125",
                    "causePositionVote": "PAN"
                  }
                },
                "pour": {
                  "votant": [
                    {
                      "acteurRef": "PA610481",
                      "mandatRef": "PM645131"
                    },
                    {
                      "acteurRef": "PA605069",
                      "mandatRef": "PM645534"
                    }
                  ]
                },
                "contre": {
                  "votant": [
                    {
                      "acteurRef": "PA267091",
                      "mandatRef": "PM645467"
                    },
                    {
                      "acteurRef": "PA1710",
                      "mandatRef": "PM645166"
                    },
                    {
                      "acteurRef": "PA680",
                      "mandatRef": "PM645536"
                    },
                    {
                      "acteurRef": "PA2374",
                      "mandatRef": "PM645217"
                    },
                    {
                      "acteurRef": "PA770",
                      "mandatRef": "PM645361"
                    },
                    {
                      "acteurRef": "PA2430",
                      "mandatRef": "PM645411"
                    },
                    {
                      "acteurRef": "PA342415",
                      "mandatRef": "PM645532"
                    },
                    {
                      "acteurRef": "PA341246",
                      "mandatRef": "PM645469"
                    },
                    {
                      "acteurRef": "PA605952",
                      "mandatRef": "PM645049"
                    },
                    {
                      "acteurRef": "PA608641",
                      "mandatRef": "PM645579"
                    },
                    {
                      "acteurRef": "PA608718",
                      "mandatRef": "PM645610"
                    },
                    {
                      "acteurRef": "PA610681",
                      "mandatRef": "PM645275"
                    },
                    {
                      "acteurRef": "PA693008",
                      "mandatRef": "PM693014"
                    }
                  ]
                },
                "abstentions": null
              }
            }
          },
          {
            "organeRef": "PO656006",
            "nombreMembresGroupe": "198",
            "vote": {
              "positionMajoritaire": "pour",
              "decompteVoix": {
                "pour": "2",
                "contre": "0",
                "abstention": "0",
                "nonVotant": "1"
              },
              "decompteNominatif": {
                "nonVotants": {
                  "votant": {
                    "acteurRef": "PA1874",
                    "mandatRef": "PM645474",
                    "causePositionVote": "PSE"
                  }
                },
                "pour": {
                  "votant": [
                    {
                      "acteurRef": "PA334149",
                      "mandatRef": "PM645127"
                    },
                    {
                      "acteurRef": "PA609726",
                      "mandatRef": "PM645311"
                    }
                  ]
                },
                "contre": null,
                "abstentions": null
              }
            }
          },
          {
            "organeRef": "PO656010",
            "nombreMembresGroupe": "30",
            "vote": {
              "positionMajoritaire": "pour",
              "decompteVoix": {
                "pour": "1",
                "contre": "0",
                "abstention": "0"
              },
              "decompteNominatif": {
                "nonVotants": "0",
                "pour": {
                  "votant": {
                    "acteurRef": "PA267801",
                    "mandatRef": "PM645153"
                  }
                },
                "contre": null,
                "abstentions": null
              }
            }
          },
          {
            "organeRef": "PO656014",
            "nombreMembresGroupe": "18",
            "vote": {
              "positionMajoritaire": "contre",
              "decompteVoix": {
                "pour": "0",
                "contre": "3",
                "abstention": "0"
              },
              "decompteNominatif": {
                "nonVotants": "0",
                "pour": null,
                "contre": {
                  "votant": [
                    {
                      "acteurRef": "PA609016",
                      "mandatRef": "PM645074"
                    },
                    {
                      "acteurRef": "PA609520",
                      "mandatRef": "PM645233"
                    },
                    {
                      "acteurRef": "PA588872",
                      "mandatRef": "PM701032"
                    }
                  ]
                },
                "abstentions": null
              }
            }
          },
          {
            "organeRef": "PO656022",
            "nombreMembresGroupe": "18",
            "vote": {
              "positionMajoritaire": "contre",
              "decompteVoix": {
                "pour": "0",
                "contre": "1",
                "abstention": "0"
              },
              "decompteNominatif": {
                "nonVotants": "0",
                "pour": null,
                "contre": {
                  "votant": {
                    "acteurRef": "PA605084",
                    "mandatRef": "PM645537"
                  }
                },
                "abstentions": null
              }
            }
          },
          {
            "organeRef": "PO656018",
            "nombreMembresGroupe": "15",
            "vote": {
              "positionMajoritaire": "pour",
              "decompteVoix": {
                "pour": "1",
                "contre": "0",
                "abstention": "0"
              },
              "decompteNominatif": {
                "nonVotants": "0",
                "pour": {
                  "votant": {
                    "acteurRef": "PA754",
                    "mandatRef": "PM645050"
                  }
                },
                "contre": null,
                "abstentions": null
              }
            }
          },
          {
            "organeRef": "PO645633",
            "nombreMembresGroupe": "9",
            "vote": {
              "positionMajoritaire": "pour",
              "decompteVoix": {
                "pour": "0",
                "contre": "0",
                "abstention": "0"
              },
              "decompteNominatif": {
                "nonVotants": "0",
                "pour": null,
                "contre": null,
                "abstentions": null
              }
            }
          }
        ]
      }
    }
  },
  "miseAuPoint": null
}