{
  "@xmlns:xsi": "http://www.w3.org/2001/XMLSchema-instance",
  "uid": "VTANR5L14V506",
  "numero": "506",
  "organeRef": "PO644420",
  "legislature": "14",
  "sessionRef": "SCR5A2013O1",
  "seanceRef": "RUANR5L14S2013IDS17067",
  "dateScrutin": "2013-04-18T02:00:00.000+02:00",
  "quantiemeJourSeance": "2",
  "typeVote": {
    "codeTypeVote": "SPO",
    "libelleTypeVote": "scrutin public ordinaire",
    "typeMajorite": "majorité absolue des suffrages exprimés"
  },
  "sort": {
    "code": "adopté",
    "libelle": "l'Assemblée nationale a adopté"
  },
  "titre": "l'article 2 du projet de loi ouvrant le mariage aux couples de personnes de même sexe (2ème lecture).",
  "demandeur": {
    "texte": "Président du groupe de l'union pour un mouvement populaire",
    "referenceLegislative": null
  },
  "objet": {
    "libelle": "l'article 2 du projet de loi ouvrant le mariage aux couples de personnes de même sexe (2ème lecture).",
    "referenceLegislative": null
  },
  "modePublicationDesVotes": "DecompteDissidentsPositionGroupe",
  "syntheseVote": {
    "nombreVotants": "112",
    "suffragesExprimes": "112",
    "nbrSuffragesRequis": "57",
    "annonce": "l'Assemblée nationale a adopté",
    "decompte": {
      "pour": "75",
      "contre": "37",
      "abstentions": "0",
      "nonVotants": "2"
    }
  },
  "ventilationVotes": {
    "organe": {
      "organeRef": "PO644420",
      "groupes": {
        "groupe": [
          {
            "organeRef": "PO656002",
            "nombreMembresGroupe": "293",
            "vote": {
              "positionMajoritaire": "pour",
              "decompteVoix": {
                "pour": "75",
                "contre": "0",
                "abstention": "0",
                "nonVotant": "2"
              },
              "decompteNominatif": {
                "nonVotants": {
                  "votant": [
                    {
                      "acteurRef": "PA381",
                      "mandatRef": "PM645125",
                      "causePositionVote": "PAN"
                    },
                    {
                      "acteurRef": "PA335319",
                      "mandatRef": "PM645070",
                      "causePositionVote": "PSE"
                    }
                  ]
                },
                "pour": null,
                "contre": null,
                "abstentions": null
              }
            }
          },
          {
            "organeRef": "PO656006",
            "nombreMembresGroupe": "196",
            "vote": {
              "positionMajoritaire": "contre",
              "decompteVoix": {
                "pour": "0",
                "contre": "35",
                "abstention": "0"
              },
              "decompteNominatif": {
                "nonVotants": "0",
                "pour": null,
                "contre": null,
                "abstentions": null
              }
            }
          },
          {
            "organeRef": "PO656010",
            "nombreMembresGroupe": "30",
            "vote": {
              "positionMajoritaire": "contre",
              "decompteVoix": {
                "pour": "0",
                "contre": "2",
                "abstention": "0"
              },
              "decompteNominatif": {
                "nonVotants": "0",
                "pour": null,
                "contre": null,
                "abstentions": null
              }
            }
          },
          {
            "organeRef": "PO656014",
            "nombreMembresGroupe": "17",
            "vote": {
              "positionMajoritaire": "pour",
              "decompteVoix": {
                "pour": "0",
                "contre": "0",
                "abstention": "0"
              },
              "decompteNominatif": {
                "nonVotants": "0",
                "pour": null,
                "contre": null,
                "abstentions": null
              }
            }
          },
          {
            "organeRef": "PO656022",
            "nombreMembresGroupe": "16",
            "vote": {
              "positionMajoritaire": "pour",
              "decompteVoix": {
                "pour": "0",
                "contre": "0",
                "abstention": "0"
              },
              "decompteNominatif": {
                "nonVotants": "0",
                "pour": null,
                "contre": null,
                "abstentions": null
              }
            }
          },
          {
            "organeRef": "PO656018",
            "nombreMembresGroupe": "15",
            "vote": {
              "positionMajoritaire": "pour",
              "decompteVoix": {
                "pour": "0",
                "contre": "0",
                "abstention": "0"
              },
              "decompteNominatif": {
                "nonVotants": "0",
                "pour": null,
                "contre": null,
                "abstentions": null
              }
            }
          },
          {
            "organeRef": "PO645633",
            "nombreMembresGroupe": "8",
            "vote": {
              "positionMajoritaire": "pour",
              "decompteVoix": {
                "pour": "0",
                "contre": "0",
                "abstention": "0"
              },
              "decompteNominatif": {
                "nonVotants": "0",
                "pour": null,
                "contre": null,
                "abstentions": null
              }
            }
          }
        ]
      }
    }
  },
  "miseAuPoint": null
}