{
  "@xmlns:xsi": "http://www.w3.org/2001/XMLSchema-instance",
  "uid": "VTANR5L14V298",
  "numero": "298",
  "organeRef": "PO644420",
  "legislature": "14",
  "sessionRef": "SCR5A2013O1",
  "seanceRef": "RUANR5L14S2013IDS16992",
  "dateScrutin": "2013-03-28T01:00:00.000+01:00",
  "quantiemeJourSeance": "2",
  "typeVote": {
    "codeTypeVote": "SPO",
    "libelleTypeVote": "scrutin public ordinaire",
    "typeMajorite": "majorité absolue des suffrages exprimés"
  },
  "sort": {
    "code": "rejeté",
    "libelle": "L'Assemblée nationale n'a pas adopté"
  },
  "titre": "l'article premier de la proposition de loi rétablissant une circonscription unique pour l'élection des représentants français au Parlement européen.",
  "demandeur": {
    "texte": "Président du groupe de l'union pour un mouvement populaire",
    "referenceLegislative": null
  },
  "objet": {
    "libelle": "l'article premier de la proposition de loi rétablissant une circonscription unique pour l'élection des représentants français au Parlement européen.",
    "referenceLegislative": null
  },
  "modePublicationDesVotes": "DecompteDissidentsPositionGroupe",
  "syntheseVote": {
    "nombreVotants": "65",
    "suffragesExprimes": "63",
    "nbrSuffragesRequis": "32",
    "annonce": "L'Assemblée nationale n'a pas adopté",
    "decompte": {
      "pour": "27",
      "contre": "36",
      "abstentions": "2",
      "nonVotants": "1"
    }
  },
  "ventilationVotes": {
    "organe": {
      "organeRef": "PO644420",
      "groupes": {
        "groupe": [
          {
            "organeRef": "PO656002",
            "nombreMembresGroupe": "293",
            "vote": {
              "positionMajoritaire": "contre",
              "decompteVoix": {
                "pour": "3",
                "contre": "23",
                "abstention": "0",
                "nonVotant": "1"
              },
              "decompteNominatif": {
                "nonVotants": {
                  "votant": {
                    "acteurRef": "PA381",
                    "mandatRef": "PM645125",
                    "causePositionVote": "PAN"
                  }
                },
                "pour": {
                  "votant": [
                    {
                      "acteurRef": "PA610481",
                      "mandatRef": "PM645131"
                    },
                    {
                      "acteurRef": "PA1991",
                      "mandatRef": "PM645156"
                    },
                    {
                      "acteurRef": "PA605076",
                      "mandatRef": "PM645535"
                    }
                  ]
                },
                "contre": null,
                "abstentions": null
              }
            }
          },
          {
            "organeRef": "PO656006",
            "nombreMembresGroupe": "196",
            "vote": {
              "positionMajoritaire": "contre",
              "decompteVoix": {
                "pour": "4",
                "contre": "12",
                "abstention": "2"
              },
              "decompteNominatif": {
                "nonVotants": "0",
                "pour": {
                  "votant": [
                    {
                      "acteurRef": "PA369",
                      "mandatRef": "PM645479"
                    },
                    {
                      "acteurRef": "PA267151",
                      "mandatRef": "PM645165"
                    },
                    {
                      "acteurRef": "PA266797",
                      "mandatRef": "PM645338"
                    },
                    {
                      "acteurRef": "PA687214",
                      "mandatRef": "PM687217"
                    }
                  ]
                },
                "contre": null,
                "abstentions": {
                  "votant": [
                    {
                      "acteurRef": "PA267499",
                      "mandatRef": "PM645572"
                    },
                    {
                      "acteurRef": "PA334906",
                      "mandatRef": "PM645577"
                    }
                  ]
                }
              }
            }
          },
          {
            "organeRef": "PO656010",
            "nombreMembresGroupe": "30",
            "vote": {
              "positionMajoritaire": "contre",
              "decompteVoix": {
                "pour": "0",
                "contre": "1",
                "abstention": "0"
              },
              "decompteNominatif": {
                "nonVotants": "0",
                "pour": null,
                "contre": null,
                "abstentions": null
              }
            }
          },
          {
            "organeRef": "PO656014",
            "nombreMembresGroupe": "17",
            "vote": {
              "positionMajoritaire": "pour",
              "decompteVoix": {
                "pour": "5",
                "contre": "0",
                "abstention": "0"
              },
              "decompteNominatif": {
                "nonVotants": "0",
                "pour": null,
                "contre": null,
                "abstentions": null
              }
            }
          },
          {
            "organeRef": "PO656022",
            "nombreMembresGroupe": "16",
            "vote": {
              "positionMajoritaire": "pour",
              "decompteVoix": {
                "pour": "15",
                "contre": "0",
                "abstention": "0"
              },
              "decompteNominatif": {
                "nonVotants": "0",
                "pour": null,
                "contre": null,
                "abstentions": null
              }
            }
          },
          {
            "organeRef": "PO656018",
            "nombreMembresGroupe": "15",
            "vote": {
              "positionMajoritaire": "pour",
              "decompteVoix": {
                "pour": "0",
                "contre": "0",
                "abstention": "0"
              },
              "decompteNominatif": {
                "nonVotants": "0",
                "pour": null,
                "contre": null,
                "abstentions": null
              }
            }
          },
          {
            "organeRef": "PO645633",
            "nombreMembresGroupe": "8",
            "vote": {
              "positionMajoritaire": "pour",
              "decompteVoix": {
                "pour": "0",
                "contre": "0",
                "abstention": "0"
              },
              "decompteNominatif": {
                "nonVotants": "0",
                "pour": null,
                "contre": null,
                "abstentions": null
              }
            }
          }
        ]
      }
    }
  },
  "miseAuPoint": {
    "nonVotants": null,
    "pour": null,
    "contre": {
      "votant": [
        {
          "acteurRef": "PA369",
          "mandatRef": "PM645479"
        },
        {
          "acteurRef": "PA267151",
          "mandatRef": "PM645165"
        },
        {
          "acteurRef": "PA266797",
          "mandatRef": "PM645338"
        },
        {
          "acteurRef": "PA687214",
          "mandatRef": "PM687217"
        }
      ]
    },
    "abstentions": null,
    "nonVotantsVolontaires": null
  }
}