{
  "@xmlns:xsi": "http://www.w3.org/2001/XMLSchema-instance",
  "uid": "VTANR5L14V1179",
  "numero": "1179",
  "organeRef": "PO644420",
  "legislature": "14",
  "sessionRef": "SCR5A2016O1",
  "seanceRef": "RUANR5L14S2016IDS19563",
  "dateScrutin": "2015-10-20T02:00:00.000+02:00",
  "quantiemeJourSeance": "2",
  "typeVote": {
    "codeTypeVote": "SPO",
    "libelleTypeVote": "scrutin public ordinaire",
    "typeMajorite": "majorité absolue des suffrages exprimés"
  },
  "sort": {
    "code": "rejeté",
    "libelle": "L'Assemblée nationale n'a pas adopté"
  },
  "titre": "la motion de renvoi en commission, déposée par M. Christian Jacob, du projet de loi de financement de la sécurité sociale pour 2016 (première lecture).",
  "demandeur": {
    "texte": "Président du groupe Les Républicains",
    "referenceLegislative": null
  },
  "objet": {
    "libelle": "la motion de renvoi en commission, déposée par M. Christian Jacob, du projet de loi de financement de la sécurité sociale pour 2016 (première lecture).",
    "referenceLegislative": null
  },
  "modePublicationDesVotes": "DecompteNominatif",
  "syntheseVote": {
    "nombreVotants": "75",
    "suffragesExprimes": "75",
    "nbrSuffragesRequis": "38",
    "annonce": "L'Assemblée nationale n'a pas adopté",
    "decompte": {
      "pour": "21",
      "contre": "54",
      "abstentions": "0",
      "nonVotants": "2"
    }
  },
  "ventilationVotes": {
    "organe": {
      "organeRef": "PO644420",
      "groupes": {
        "groupe": [
          {
            "organeRef": "PO656002",
            "nombreMembresGroupe": "287",
            "vote": {
              "positionMajoritaire": "contre",
              "decompteVoix": {
                "pour": "0",
                "contre": "51",
                "abstention": "0",
                "nonVotant": "2"
              },
              "decompteNominatif": {
                "nonVotants": {
                  "votant": [
                    {
                      "acteurRef": "PA381",
                      "mandatRef": "PM645125",
                      "causePositionVote": "PAN"
                    },
                    {
                      "acteurRef": "PA335319",
                      "mandatRef": "PM645070",
                      "causePositionVote": "PSE"
                    }
                  ]
                },
                "pour": null,
                "contre": {
                  "votant": [
                    {
                      "acteurRef": "PA356",
                      "mandatRef": "PM645358"
                    },
                    {
                      "acteurRef": "PA508",
                      "mandatRef": "PM645397"
                    },
                    {
                      "acteurRef": "PA590034",
                      "mandatRef": "PM701035"
                    },
                    {
                      "acteurRef": "PA877",
                      "mandatRef": "PM645349"
                    },
                    {
                      "acteurRef": "PA1689",
                      "mandatRef": "PM645378"
                    },
                    {
                      "acteurRef": "PA1977",
                      "mandatRef": "PM645404"
                    },
                    {
                      "acteurRef": "PA1979",
                      "mandatRef": "PM645223"
                    },
                    {
                      "acteurRef": "PA1936",
                      "mandatRef": "PM645382"
                    },
                    {
                      "acteurRef": "PA335017",
                      "mandatRef": "PM645607"
                    },
                    {
                      "acteurRef": "PA1844",
                      "mandatRef": "PM645254"
                    },
                    {
                      "acteurRef": "PA2503",
                      "mandatRef": "PM645187"
                    },
                    {
                      "acteurRef": "PA267188",
                      "mandatRef": "PM645410"
                    },
                    {
                      "acteurRef": "PA605069",
                      "mandatRef": "PM645534"
                    },
                    {
                      "acteurRef": "PA331835",
                      "mandatRef": "PM645380"
                    },
                    {
                      "acteurRef": "PA332384",
                      "mandatRef": "PM645528"
                    },
                    {
                      "acteurRef": "PA330130",
                      "mandatRef": "PM645541"
                    },
                    {
                      "acteurRef": "PA336421",
                      "mandatRef": "PM645332"
                    },
                    {
                      "acteurRef": "PA331924",
                      "mandatRef": "PM701034"
                    },
                    {
                      "acteurRef": "PA334768",
                      "mandatRef": "PM645582"
                    },
                    {
                      "acteurRef": "PA336015",
                      "mandatRef": "PM645222"
                    },
                    {
                      "acteurRef": "PA331753",
                      "mandatRef": "PM645348"
                    },
                    {
                      "acteurRef": "PA332305",
                      "mandatRef": "PM645562"
                    },
                    {
                      "acteurRef": "PA331658",
                      "mandatRef": "PM645277"
                    },
                    {
                      "acteurRef": "PA342415",
                      "mandatRef": "PM645532"
                    },
                    {
                      "acteurRef": "PA605758",
                      "mandatRef": "PM645443"
                    },
                    {
                      "acteurRef": "PA605557",
                      "mandatRef": "PM645507"
                    },
                    {
                      "acteurRef": "PA340432",
                      "mandatRef": "PM645471"
                    },
                    {
                      "acteurRef": "PA605426",
                      "mandatRef": "PM645517"
                    },
                    {
                      "acteurRef": "PA605703",
                      "mandatRef": "PM645418"
                    },
                    {
                      "acteurRef": "PA605830",
                      "mandatRef": "PM645454"
                    },
                    {
                      "acteurRef": "PA605888",
                      "mandatRef": "PM645476"
                    },
                    {
                      "acteurRef": "PA606202",
                      "mandatRef": "PM645327"
                    },
                    {
                      "acteurRef": "PA606149",
                      "mandatRef": "PM645218"
                    },
                    {
                      "acteurRef": "PA606924",
                      "mandatRef": "PM645527"
                    },
                    {
                      "acteurRef": "PA606991",
                      "mandatRef": "PM645098"
                    },
                    {
                      "acteurRef": "PA606665",
                      "mandatRef": "PM645526"
                    },
                    {
                      "acteurRef": "PA607553",
                      "mandatRef": "PM645373"
                    },
                    {
                      "acteurRef": "PA607769",
                      "mandatRef": "PM645494"
                    },
                    {
                      "acteurRef": "PA608348",
                      "mandatRef": "PM645322"
                    },
                    {
                      "acteurRef": "PA608172",
                      "mandatRef": "PM645197"
                    },
                    {
                      "acteurRef": "PA608695",
                      "mandatRef": "PM645605"
                    },
                    {
                      "acteurRef": "PA608785",
                      "mandatRef": "PM645567"
                    },
                    {
                      "acteurRef": "PA609743",
                      "mandatRef": "PM645321"
                    },
                    {
                      "acteurRef": "PA609775",
                      "mandatRef": "PM645329"
                    },
                    {
                      "acteurRef": "PA607369",
                      "mandatRef": "PM645318"
                    },
                    {
                      "acteurRef": "PA609535",
                      "mandatRef": "PM645236"
                    },
                    {
                      "acteurRef": "PA610529",
                      "mandatRef": "PM645192"
                    },
                    {
                      "acteurRef": "PA610594",
                      "mandatRef": "PM645185"
                    },
                    {
                      "acteurRef": "PA608264",
                      "mandatRef": "PM645248"
                    },
                    {
                      "acteurRef": "PA643002",
                      "mandatRef": "PM703297"
                    },
                    {
                      "acteurRef": "PA642805",
                      "mandatRef": "PM703478"
                    }
                  ]
                },
                "abstentions": null
              }
            }
          },
          {
            "organeRef": "PO707869",
            "nombreMembresGroupe": "199",
            "vote": {
              "positionMajoritaire": "pour",
              "decompteVoix": {
                "pour": "20",
                "contre": "0",
                "abstention": "0"
              },
              "decompteNominatif": {
                "nonVotants": "0",
                "pour": {
                  "votant": [
                    {
                      "acteurRef": "PA1699",
                      "mandatRef": "PM645390"
                    },
                    {
                      "acteurRef": "PA606712",
                      "mandatRef": "PM645549"
                    },
                    {
                      "acteurRef": "PA230",
                      "mandatRef": "PM645553"
                    },
                    {
                      "acteurRef": "PA2345",
                      "mandatRef": "PM645548"
                    },
                    {
                      "acteurRef": "PA606693",
                      "mandatRef": "PM645542"
                    },
                    {
                      "acteurRef": "PA2815",
                      "mandatRef": "PM645514"
                    },
                    {
                      "acteurRef": "PA267260",
                      "mandatRef": "PM645459"
                    },
                    {
                      "acteurRef": "PA267289",
                      "mandatRef": "PM645242"
                    },
                    {
                      "acteurRef": "PA267506",
                      "mandatRef": "PM645270"
                    },
                    {
                      "acteurRef": "PA267556",
                      "mandatRef": "PM645396"
                    },
                    {
                      "acteurRef": "PA266776",
                      "mandatRef": "PM645590"
                    },
                    {
                      "acteurRef": "PA605991",
                      "mandatRef": "PM645081"
                    },
                    {
                      "acteurRef": "PA606888",
                      "mandatRef": "PM645543"
                    },
                    {
                      "acteurRef": "PA607603",
                      "mandatRef": "PM645379"
                    },
                    {
                      "acteurRef": "PA608434",
                      "mandatRef": "PM645593"
                    },
                    {
                      "acteurRef": "PA609764",
                      "mandatRef": "PM645323"
                    },
                    {
                      "acteurRef": "PA607489",
                      "mandatRef": "PM645366"
                    },
                    {
                      "acteurRef": "PA608380",
                      "mandatRef": "PM645578"
                    },
                    {
                      "acteurRef": "PA610924",
                      "mandatRef": "PM645227"
                    },
                    {
                      "acteurRef": "PA709315",
                      "mandatRef": "PM709318"
                    }
                  ]
                },
                "contre": null,
                "abstentions": null
              }
            }
          },
          {
            "organeRef": "PO656010",
            "nombreMembresGroupe": "30",
            "vote": {
              "positionMajoritaire": "pour",
              "decompteVoix": {
                "pour": "1",
                "contre": "0",
                "abstention": "0"
              },
              "decompteNominatif": {
                "nonVotants": "0",
                "pour": {
                  "votant": {
                    "acteurRef": "PA267585",
                    "mandatRef": "PM645508"
                  }
                },
                "contre": null,
                "abstentions": null
              }
            }
          },
          {
            "organeRef": "PO656014",
            "nombreMembresGroupe": "18",
            "vote": {
              "positionMajoritaire": "contre",
              "decompteVoix": {
                "pour": "0",
                "contre": "1",
                "abstention": "0"
              },
              "decompteNominatif": {
                "nonVotants": "0",
                "pour": null,
                "contre": {
                  "votant": {
                    "acteurRef": "PA606545",
                    "mandatRef": "PM645470"
                  }
                },
                "abstentions": null
              }
            }
          },
          {
            "organeRef": "PO656022",
            "nombreMembresGroupe": "18",
            "vote": {
              "positionMajoritaire": "contre",
              "decompteVoix": {
                "pour": "0",
                "contre": "2",
                "abstention": "0"
              },
              "decompteNominatif": {
                "nonVotants": "0",
                "pour": null,
                "contre": {
                  "votant": [
                    {
                      "acteurRef": "PA332950",
                      "mandatRef": "PM645251"
                    },
                    {
                      "acteurRef": "PA702054",
                      "mandatRef": "PM702804"
                    }
                  ]
                },
                "abstentions": null
              }
            }
          },
          {
            "organeRef": "PO656018",
            "nombreMembresGroupe": "15",
            "vote": {
              "positionMajoritaire": "pour",
              "decompteVoix": {
                "pour": "0",
                "contre": "0",
                "abstention": "0"
              },
              "decompteNominatif": {
                "nonVotants": "0",
                "pour": null,
                "contre": null,
                "abstentions": null
              }
            }
          },
          {
            "organeRef": "PO645633",
            "nombreMembresGroupe": "10",
            "vote": {
              "positionMajoritaire": "pour",
              "decompteVoix": {
                "pour": "0",
                "contre": "0",
                "abstention": "0"
              },
              "decompteNominatif": {
                "nonVotants": "0",
                "pour": null,
                "contre": null,
                "abstentions": null
              }
            }
          }
        ]
      }
    }
  },
  "miseAuPoint": null
}