{
  "@xmlns:xsi": "http://www.w3.org/2001/XMLSchema-instance",
  "uid": "VTANR5L14V1005",
  "numero": "1005",
  "organeRef": "PO644420",
  "legislature": "14",
  "sessionRef": "SCR5A2015O1",
  "seanceRef": "RUANR5L14S2015IDS19015",
  "dateScrutin": "2015-02-02T01:00:00.000+01:00",
  "quantiemeJourSeance": "1",
  "typeVote": {
    "codeTypeVote": "SPO",
    "libelleTypeVote": "scrutin public ordinaire",
    "typeMajorite": "majorité absolue des suffrages exprimés"
  },
  "sort": {
    "code": "rejeté",
    "libelle": "L'Assemblée nationale n'a pas adopté"
  },
  "titre": "l'amendement n° 380 de M. Houillon et les amendements identiques n° 537 de M. Hetzel et n° 1847 de M. Gosselin à l'article 12 du projet de loi pour la croissance, l'activité et l'égalité des chances économiques (première lecture).",
  "demandeur": {
    "texte": "Président du groupe de l'union pour un mouvement populaire",
    "referenceLegislative": null
  },
  "objet": {
    "libelle": "l'amendement n° 380 de M. Houillon et les amendements identiques n° 537 de M. Hetzel et n° 1847 de M. Gosselin à l'article 12 du projet de loi pour la croissance, l'activité et l'égalité des chances économiques (première lecture).",
    "referenceLegislative": null
  },
  "modePublicationDesVotes": "DecompteNominatif",
  "syntheseVote": {
    "nombreVotants": "63",
    "suffragesExprimes": "63",
    "nbrSuffragesRequis": "32",
    "annonce": "L'Assemblée nationale n'a pas adopté",
    "decompte": {
      "pour": "29",
      "contre": "34",
      "abstentions": "0",
      "nonVotants": "2"
    }
  },
  "ventilationVotes": {
    "organe": {
      "organeRef": "PO644420",
      "groupes": {
        "groupe": [
          {
            "organeRef": "PO656002",
            "nombreMembresGroupe": "287",
            "vote": {
              "positionMajoritaire": "contre",
              "decompteVoix": {
                "pour": "0",
                "contre": "33",
                "abstention": "0",
                "nonVotant": "2"
              },
              "decompteNominatif": {
                "nonVotants": {
                  "votant": [
                    {
                      "acteurRef": "PA381",
                      "mandatRef": "PM645125",
                      "causePositionVote": "PAN"
                    },
                    {
                      "acteurRef": "PA1592",
                      "mandatRef": "PM645232",
                      "causePositionVote": "PSE"
                    }
                  ]
                },
                "pour": null,
                "contre": {
                  "votant": [
                    {
                      "acteurRef": "PA695",
                      "mandatRef": "PM645503"
                    },
                    {
                      "acteurRef": "PA680",
                      "mandatRef": "PM645536"
                    },
                    {
                      "acteurRef": "PA877",
                      "mandatRef": "PM645349"
                    },
                    {
                      "acteurRef": "PA1911",
                      "mandatRef": "PM645152"
                    },
                    {
                      "acteurRef": "PA1886",
                      "mandatRef": "PM645099"
                    },
                    {
                      "acteurRef": "PA2338",
                      "mandatRef": "PM645413"
                    },
                    {
                      "acteurRef": "PA2343",
                      "mandatRef": "PM645498"
                    },
                    {
                      "acteurRef": "PA2799",
                      "mandatRef": "PM645448"
                    },
                    {
                      "acteurRef": "PA606171",
                      "mandatRef": "PM645255"
                    },
                    {
                      "acteurRef": "PA331282",
                      "mandatRef": "PM645480"
                    },
                    {
                      "acteurRef": "PA335017",
                      "mandatRef": "PM645607"
                    },
                    {
                      "acteurRef": "PA770",
                      "mandatRef": "PM645361"
                    },
                    {
                      "acteurRef": "PA267835",
                      "mandatRef": "PM645134"
                    },
                    {
                      "acteurRef": "PA331835",
                      "mandatRef": "PM645380"
                    },
                    {
                      "acteurRef": "PA334951",
                      "mandatRef": "PM645594"
                    },
                    {
                      "acteurRef": "PA267923",
                      "mandatRef": "PM645120"
                    },
                    {
                      "acteurRef": "PA335319",
                      "mandatRef": "PM645070"
                    },
                    {
                      "acteurRef": "PA336439",
                      "mandatRef": "PM645333"
                    },
                    {
                      "acteurRef": "PA605349",
                      "mandatRef": "PM645483"
                    },
                    {
                      "acteurRef": "PA605606",
                      "mandatRef": "PM645394"
                    },
                    {
                      "acteurRef": "PA606665",
                      "mandatRef": "PM645526"
                    },
                    {
                      "acteurRef": "PA607310",
                      "mandatRef": "PM645297"
                    },
                    {
                      "acteurRef": "PA607193",
                      "mandatRef": "PM645179"
                    },
                    {
                      "acteurRef": "PA607395",
                      "mandatRef": "PM645343"
                    },
                    {
                      "acteurRef": "PA608695",
                      "mandatRef": "PM645605"
                    },
                    {
                      "acteurRef": "PA608785",
                      "mandatRef": "PM645567"
                    },
                    {
                      "acteurRef": "PA609743",
                      "mandatRef": "PM645321"
                    },
                    {
                      "acteurRef": "PA672",
                      "mandatRef": "PM645175"
                    },
                    {
                      "acteurRef": "PA610313",
                      "mandatRef": "PM645122"
                    },
                    {
                      "acteurRef": "PA610529",
                      "mandatRef": "PM645192"
                    },
                    {
                      "acteurRef": "PA608264",
                      "mandatRef": "PM645248"
                    },
                    {
                      "acteurRef": "PA342332",
                      "mandatRef": "PM676816"
                    },
                    {
                      "acteurRef": "PA693008",
                      "mandatRef": "PM693014"
                    }
                  ]
                },
                "abstentions": null
              }
            }
          },
          {
            "organeRef": "PO656006",
            "nombreMembresGroupe": "198",
            "vote": {
              "positionMajoritaire": "pour",
              "decompteVoix": {
                "pour": "26",
                "contre": "0",
                "abstention": "0"
              },
              "decompteNominatif": {
                "nonVotants": "0",
                "pour": {
                  "votant": [
                    {
                      "acteurRef": "PA1310",
                      "mandatRef": "PM645047"
                    },
                    {
                      "acteurRef": "PA2801",
                      "mandatRef": "PM645576"
                    },
                    {
                      "acteurRef": "PA259",
                      "mandatRef": "PM645395"
                    },
                    {
                      "acteurRef": "PA606712",
                      "mandatRef": "PM645549"
                    },
                    {
                      "acteurRef": "PA856",
                      "mandatRef": "PM645353"
                    },
                    {
                      "acteurRef": "PA1661",
                      "mandatRef": "PM645181"
                    },
                    {
                      "acteurRef": "PA1874",
                      "mandatRef": "PM645474"
                    },
                    {
                      "acteurRef": "PA1931",
                      "mandatRef": "PM645042"
                    },
                    {
                      "acteurRef": "PA1695",
                      "mandatRef": "PM645157"
                    },
                    {
                      "acteurRef": "PA606098",
                      "mandatRef": "PM645171"
                    },
                    {
                      "acteurRef": "PA266788",
                      "mandatRef": "PM645294"
                    },
                    {
                      "acteurRef": "PA2815",
                      "mandatRef": "PM645514"
                    },
                    {
                      "acteurRef": "PA267013",
                      "mandatRef": "PM645613"
                    },
                    {
                      "acteurRef": "PA267200",
                      "mandatRef": "PM645502"
                    },
                    {
                      "acteurRef": "PA267227",
                      "mandatRef": "PM645618"
                    },
                    {
                      "acteurRef": "PA267429",
                      "mandatRef": "PM645130"
                    },
                    {
                      "acteurRef": "PA267506",
                      "mandatRef": "PM645270"
                    },
                    {
                      "acteurRef": "PA2960",
                      "mandatRef": "PM645040"
                    },
                    {
                      "acteurRef": "PA332886",
                      "mandatRef": "PM645226"
                    },
                    {
                      "acteurRef": "PA230329",
                      "mandatRef": "PM645079"
                    },
                    {
                      "acteurRef": "PA331481",
                      "mandatRef": "PM645136"
                    },
                    {
                      "acteurRef": "PA331567",
                      "mandatRef": "PM645186"
                    },
                    {
                      "acteurRef": "PA330684",
                      "mandatRef": "PM645497"
                    },
                    {
                      "acteurRef": "PA267785",
                      "mandatRef": "PM645359"
                    },
                    {
                      "acteurRef": "PA609726",
                      "mandatRef": "PM645311"
                    },
                    {
                      "acteurRef": "PA610830",
                      "mandatRef": "PM645039"
                    }
                  ]
                },
                "contre": null,
                "abstentions": null
              }
            }
          },
          {
            "organeRef": "PO656010",
            "nombreMembresGroupe": "30",
            "vote": {
              "positionMajoritaire": "pour",
              "decompteVoix": {
                "pour": "1",
                "contre": "0",
                "abstention": "0"
              },
              "decompteNominatif": {
                "nonVotants": "0",
                "pour": {
                  "votant": {
                    "acteurRef": "PA267585",
                    "mandatRef": "PM645508"
                  }
                },
                "contre": null,
                "abstentions": null
              }
            }
          },
          {
            "organeRef": "PO656014",
            "nombreMembresGroupe": "18",
            "vote": {
              "positionMajoritaire": "pour",
              "decompteVoix": {
                "pour": "0",
                "contre": "0",
                "abstention": "0"
              },
              "decompteNominatif": {
                "nonVotants": "0",
                "pour": null,
                "contre": null,
                "abstentions": null
              }
            }
          },
          {
            "organeRef": "PO656022",
            "nombreMembresGroupe": "18",
            "vote": {
              "positionMajoritaire": "contre",
              "decompteVoix": {
                "pour": "0",
                "contre": "1",
                "abstention": "0"
              },
              "decompteNominatif": {
                "nonVotants": "0",
                "pour": null,
                "contre": {
                  "votant": {
                    "acteurRef": "PA2828",
                    "mandatRef": "PM645402"
                  }
                },
                "abstentions": null
              }
            }
          },
          {
            "organeRef": "PO656018",
            "nombreMembresGroupe": "15",
            "vote": {
              "positionMajoritaire": "pour",
              "decompteVoix": {
                "pour": "1",
                "contre": "0",
                "abstention": "0"
              },
              "decompteNominatif": {
                "nonVotants": "0",
                "pour": {
                  "votant": {
                    "acteurRef": "PA1141",
                    "mandatRef": "PM645468"
                  }
                },
                "contre": null,
                "abstentions": null
              }
            }
          },
          {
            "organeRef": "PO645633",
            "nombreMembresGroupe": "9",
            "vote": {
              "positionMajoritaire": "pour",
              "decompteVoix": {
                "pour": "1",
                "contre": "0",
                "abstention": "0"
              },
              "decompteNominatif": {
                "nonVotants": "0",
                "pour": {
                  "votant": {
                    "acteurRef": "PA609709",
                    "mandatRef": "PM645302"
                  }
                },
                "contre": null,
                "abstentions": null
              }
            }
          }
        ]
      }
    }
  },
  "miseAuPoint": null
}