{
  "@xmlns:xsi": "http://www.w3.org/2001/XMLSchema-instance",
  "uid": "VTANR5L14V1335",
  "numero": "1335",
  "organeRef": "PO644420",
  "legislature": "14",
  "sessionRef": "SCR5A2017O1",
  "seanceRef": "RUANR5L14S2017IDS20299",
  "dateScrutin": "2016-10-19T02:00:00.000+02:00",
  "quantiemeJourSeance": "2",
  "typeVote": {
    "codeTypeVote": "SPO",
    "libelleTypeVote": "scrutin public ordinaire",
    "typeMajorite": "majorité absolue des suffrages exprimés"
  },
  "sort": {
    "code": "adopté",
    "libelle": "l'Assemblée nationale a adopté"
  },
  "titre": "l'amendement n° 239 de M. Dufau et les amendements identiques n° 724 de M. Laurent et n° 784 de Mme Sas après l'article 11 du projet de loi de finances pour 2017 (1ère lecture)",
  "demandeur": {
    "texte": "Président du groupe de la gauche démocrate et républicaine",
    "referenceLegislative": null
  },
  "objet": {
    "libelle": "l'amendement n° 239 de M. Dufau et les amendements identiques n° 724 de M. Laurent et n° 784 de Mme Sas après l'article 11 du projet de loi de finances pour 2017 (1ère lecture)",
    "referenceLegislative": null
  },
  "modePublicationDesVotes": "DecompteNominatif",
  "syntheseVote": {
    "nombreVotants": "51",
    "suffragesExprimes": "50",
    "nbrSuffragesRequis": "26",
    "annonce": "l'Assemblée nationale a adopté",
    "decompte": {
      "pour": "39",
      "contre": "11",
      "abstentions": "1",
      "nonVotants": "2"
    }
  },
  "ventilationVotes": {
    "organe": {
      "organeRef": "PO644420",
      "groupes": {
        "groupe": [
          {
            "organeRef": "PO713077",
            "nombreMembresGroupe": "288",
            "vote": {
              "positionMajoritaire": "pour",
              "decompteVoix": {
                "pour": "29",
                "contre": "3",
                "abstention": "1",
                "nonVotant": "2"
              },
              "decompteNominatif": {
                "nonVotants": {
                  "votant": [
                    {
                      "acteurRef": "PA381",
                      "mandatRef": "PM645125",
                      "causePositionVote": "PAN"
                    },
                    {
                      "acteurRef": "PA332747",
                      "mandatRef": "PM645155",
                      "causePositionVote": "PSE"
                    }
                  ]
                },
                "pour": {
                  "votant": [
                    {
                      "acteurRef": "PA610481",
                      "mandatRef": "PM645131"
                    },
                    {
                      "acteurRef": "PA1182",
                      "mandatRef": "PM645090"
                    },
                    {
                      "acteurRef": "PA1911",
                      "mandatRef": "PM645152"
                    },
                    {
                      "acteurRef": "PA1886",
                      "mandatRef": "PM645099"
                    },
                    {
                      "acteurRef": "PA2338",
                      "mandatRef": "PM645413"
                    },
                    {
                      "acteurRef": "PA334755",
                      "mandatRef": "PM645580"
                    },
                    {
                      "acteurRef": "PA331014",
                      "mandatRef": "PM645422"
                    },
                    {
                      "acteurRef": "PA332636",
                      "mandatRef": "PM645118"
                    },
                    {
                      "acteurRef": "PA332206",
                      "mandatRef": "PM645538"
                    },
                    {
                      "acteurRef": "PA609332",
                      "mandatRef": "PM645147"
                    },
                    {
                      "acteurRef": "PA405480",
                      "mandatRef": "PM645203"
                    },
                    {
                      "acteurRef": "PA605143",
                      "mandatRef": "PM645423"
                    },
                    {
                      "acteurRef": "PA340432",
                      "mandatRef": "PM645471"
                    },
                    {
                      "acteurRef": "PA605952",
                      "mandatRef": "PM645049"
                    },
                    {
                      "acteurRef": "PA605963",
                      "mandatRef": "PM645055"
                    },
                    {
                      "acteurRef": "PA606161",
                      "mandatRef": "PM645250"
                    },
                    {
                      "acteurRef": "PA606675",
                      "mandatRef": "PM645533"
                    },
                    {
                      "acteurRef": "PA607699",
                      "mandatRef": "PM645403"
                    },
                    {
                      "acteurRef": "PA608172",
                      "mandatRef": "PM645197"
                    },
                    {
                      "acteurRef": "PA609042",
                      "mandatRef": "PM645076"
                    },
                    {
                      "acteurRef": "PA609435",
                      "mandatRef": "PM645211"
                    },
                    {
                      "acteurRef": "PA609590",
                      "mandatRef": "PM645261"
                    },
                    {
                      "acteurRef": "PA609816",
                      "mandatRef": "PM645334"
                    },
                    {
                      "acteurRef": "PA607369",
                      "mandatRef": "PM645318"
                    },
                    {
                      "acteurRef": "PA610529",
                      "mandatRef": "PM645192"
                    },
                    {
                      "acteurRef": "PA610594",
                      "mandatRef": "PM645185"
                    },
                    {
                      "acteurRef": "PA610203",
                      "mandatRef": "PM645065"
                    },
                    {
                      "acteurRef": "PA342332",
                      "mandatRef": "PM676816"
                    },
                    {
                      "acteurRef": "PA643020",
                      "mandatRef": "PM702199"
                    }
                  ]
                },
                "contre": {
                  "votant": [
                    {
                      "acteurRef": "PA339",
                      "mandatRef": "PM645511"
                    },
                    {
                      "acteurRef": "PA735",
                      "mandatRef": "PM645089"
                    },
                    {
                      "acteurRef": "PA331835",
                      "mandatRef": "PM645380"
                    }
                  ]
                },
                "abstentions": {
                  "votant": {
                    "acteurRef": "PA607187",
                    "mandatRef": "PM645224"
                  }
                }
              }
            }
          },
          {
            "organeRef": "PO707869",
            "nombreMembresGroupe": "199",
            "vote": {
              "positionMajoritaire": "contre",
              "decompteVoix": {
                "pour": "1",
                "contre": "6",
                "abstention": "0"
              },
              "decompteNominatif": {
                "nonVotants": "0",
                "pour": {
                  "votant": {
                    "acteurRef": "PA609442",
                    "mandatRef": "PM645214"
                  }
                },
                "contre": {
                  "votant": [
                    {
                      "acteurRef": "PA2048",
                      "mandatRef": "PM693013"
                    },
                    {
                      "acteurRef": "PA267689",
                      "mandatRef": "PM645295"
                    },
                    {
                      "acteurRef": "PA606712",
                      "mandatRef": "PM645549"
                    },
                    {
                      "acteurRef": "PA746",
                      "mandatRef": "PM645154"
                    },
                    {
                      "acteurRef": "PA332523",
                      "mandatRef": "PM645550"
                    },
                    {
                      "acteurRef": "PA608016",
                      "mandatRef": "PM645071"
                    }
                  ]
                },
                "abstentions": null
              }
            }
          },
          {
            "organeRef": "PO656010",
            "nombreMembresGroupe": "27",
            "vote": {
              "positionMajoritaire": "contre",
              "decompteVoix": {
                "pour": "0",
                "contre": "2",
                "abstention": "0"
              },
              "decompteNominatif": {
                "nonVotants": "0",
                "pour": null,
                "contre": {
                  "votant": [
                    {
                      "acteurRef": "PA942",
                      "mandatRef": "PM645357"
                    },
                    {
                      "acteurRef": "PA331582",
                      "mandatRef": "PM645198"
                    }
                  ]
                },
                "abstentions": null
              }
            }
          },
          {
            "organeRef": "PO645633",
            "nombreMembresGroupe": "26",
            "vote": {
              "positionMajoritaire": "pour",
              "decompteVoix": {
                "pour": "6",
                "contre": "0",
                "abstention": "0"
              },
              "decompteNominatif": {
                "nonVotants": "0",
                "pour": {
                  "votant": [
                    {
                      "acteurRef": "PA608186",
                      "mandatRef": "PM645202"
                    },
                    {
                      "acteurRef": "PA605625",
                      "mandatRef": "PM645398"
                    },
                    {
                      "acteurRef": "PA607632",
                      "mandatRef": "PM645387"
                    },
                    {
                      "acteurRef": "PA610002",
                      "mandatRef": "PM645053"
                    },
                    {
                      "acteurRef": "PA610427",
                      "mandatRef": "PM645158"
                    },
                    {
                      "acteurRef": "PA605922",
                      "mandatRef": "PM645493"
                    }
                  ]
                },
                "contre": null,
                "abstentions": null
              }
            }
          },
          {
            "organeRef": "PO656022",
            "nombreMembresGroupe": "18",
            "vote": {
              "positionMajoritaire": "pour",
              "decompteVoix": {
                "pour": "1",
                "contre": "0",
                "abstention": "0"
              },
              "decompteNominatif": {
                "nonVotants": "0",
                "pour": {
                  "votant": {
                    "acteurRef": "PA267336",
                    "mandatRef": "PM645424"
                  }
                },
                "contre": null,
                "abstentions": null
              }
            }
          },
          {
            "organeRef": "PO656018",
            "nombreMembresGroupe": "15",
            "vote": {
              "positionMajoritaire": "pour",
              "decompteVoix": {
                "pour": "2",
                "contre": "0",
                "abstention": "0"
              },
              "decompteNominatif": {
                "nonVotants": "0",
                "pour": {
                  "votant": [
                    {
                      "acteurRef": "PA605745",
                      "mandatRef": "PM645435"
                    },
                    {
                      "acteurRef": "PA267306",
                      "mandatRef": "PM645210"
                    }
                  ]
                },
                "contre": null,
                "abstentions": null
              }
            }
          }
        ]
      }
    }
  },
  "miseAuPoint": {
    "nonVotants": null,
    "pour": {
      "votant": {
        "acteurRef": "PA770",
        "mandatRef": "PM645361"
      }
    },
    "contre": null,
    "abstentions": null,
    "nonVotantsVolontaires": null
  }
}