{
  "@xmlns:xsi": "http://www.w3.org/2001/XMLSchema-instance",
  "uid": "VTANR5L14V125",
  "numero": "125",
  "organeRef": "PO644420",
  "legislature": "14",
  "sessionRef": "SCR5A2013O1",
  "seanceRef": "RUANR5L14S2013IDS16791",
  "dateScrutin": "2013-02-03T01:00:00.000+01:00",
  "quantiemeJourSeance": "1",
  "typeVote": {
    "codeTypeVote": "SPO",
    "libelleTypeVote": "scrutin public ordinaire",
    "typeMajorite": "majorité absolue des suffrages exprimés"
  },
  "sort": {
    "code": "rejeté",
    "libelle": "L'Assemblée nationale n'a pas adopté"
  },
  "titre": "l'amendement n° 2157 de M.Sergio Coronado avant l'article 1er bis du projet de loi portant ouverture du mariage aux couples de personnes de même sexe (PMA et filiation de la conjointe).",
  "demandeur": {
    "texte": "Président du groupe écologiste",
    "referenceLegislative": null
  },
  "objet": {
    "libelle": "l'amendement n° 2157 de M.Sergio Coronado avant l'article 1er bis du projet de loi portant ouverture du mariage aux couples de personnes de même sexe (PMA et filiation de la conjointe).",
    "referenceLegislative": null
  },
  "modePublicationDesVotes": "DecompteDissidentsPositionGroupe",
  "syntheseVote": {
    "nombreVotants": "309",
    "suffragesExprimes": "297",
    "nbrSuffragesRequis": "149",
    "annonce": "L'Assemblée nationale n'a pas adopté",
    "decompte": {
      "pour": "18",
      "contre": "279",
      "abstentions": "12",
      "nonVotants": "1"
    }
  },
  "ventilationVotes": {
    "organe": {
      "organeRef": "PO644420",
      "groupes": {
        "groupe": [
          {
            "organeRef": "PO656002",
            "nombreMembresGroupe": "295",
            "vote": {
              "positionMajoritaire": "contre",
              "decompteVoix": {
                "pour": "8",
                "contre": "163",
                "abstention": "10",
                "nonVotant": "1"
              },
              "decompteNominatif": {
                "nonVotants": {
                  "votant": {
                    "acteurRef": "PA381",
                    "mandatRef": "PM645125",
                    "causePositionVote": "PSE"
                  }
                },
                "pour": {
                  "votant": [
                    {
                      "acteurRef": "PA1710",
                      "mandatRef": "PM645166"
                    },
                    {
                      "acteurRef": "PA606631",
                      "mandatRef": "PM645516"
                    },
                    {
                      "acteurRef": "PA335017",
                      "mandatRef": "PM645607"
                    },
                    {
                      "acteurRef": "PA330357",
                      "mandatRef": "PM645453"
                    },
                    {
                      "acteurRef": "PA605804",
                      "mandatRef": "PM645450"
                    },
                    {
                      "acteurRef": "PA606639",
                      "mandatRef": "PM645521"
                    },
                    {
                      "acteurRef": "PA607283",
                      "mandatRef": "PM645259"
                    },
                    {
                      "acteurRef": "PA642743",
                      "mandatRef": "PM676801"
                    }
                  ]
                },
                "contre": null,
                "abstentions": {
                  "votant": [
                    {
                      "acteurRef": "PA543",
                      "mandatRef": "PM645064"
                    },
                    {
                      "acteurRef": "PA765",
                      "mandatRef": "PM645138"
                    },
                    {
                      "acteurRef": "PA610891",
                      "mandatRef": "PM645221"
                    },
                    {
                      "acteurRef": "PA609513",
                      "mandatRef": "PM645228"
                    },
                    {
                      "acteurRef": "PA1032",
                      "mandatRef": "PM645488"
                    },
                    {
                      "acteurRef": "PA605261",
                      "mandatRef": "PM645456"
                    },
                    {
                      "acteurRef": "PA607632",
                      "mandatRef": "PM645387"
                    },
                    {
                      "acteurRef": "PA610954",
                      "mandatRef": "PM645231"
                    },
                    {
                      "acteurRef": "PA642940",
                      "mandatRef": "PM676814"
                    },
                    {
                      "acteurRef": "PA342539",
                      "mandatRef": "PM676818"
                    }
                  ]
                }
              }
            }
          },
          {
            "organeRef": "PO656006",
            "nombreMembresGroupe": "196",
            "vote": {
              "positionMajoritaire": "contre",
              "decompteVoix": {
                "pour": "0",
                "contre": "110",
                "abstention": "2"
              },
              "decompteNominatif": {
                "nonVotants": "0",
                "pour": null,
                "contre": null,
                "abstentions": {
                  "votant": [
                    {
                      "acteurRef": "PA2229",
                      "mandatRef": "PM645205"
                    },
                    {
                      "acteurRef": "PA267728",
                      "mandatRef": "PM645216"
                    }
                  ]
                }
              }
            }
          },
          {
            "organeRef": "PO656010",
            "nombreMembresGroupe": "29",
            "vote": {
              "positionMajoritaire": "contre",
              "decompteVoix": {
                "pour": "0",
                "contre": "2",
                "abstention": "0"
              },
              "decompteNominatif": {
                "nonVotants": "0",
                "pour": null,
                "contre": null,
                "abstentions": null
              }
            }
          },
          {
            "organeRef": "PO656014",
            "nombreMembresGroupe": "17",
            "vote": {
              "positionMajoritaire": "pour",
              "decompteVoix": {
                "pour": "8",
                "contre": "2",
                "abstention": "0"
              },
              "decompteNominatif": {
                "nonVotants": "0",
                "pour": null,
                "contre": {
                  "votant": [
                    {
                      "acteurRef": "PA609816",
                      "mandatRef": "PM645334"
                    },
                    {
                      "acteurRef": "PA605922",
                      "mandatRef": "PM645493"
                    }
                  ]
                },
                "abstentions": null
              }
            }
          },
          {
            "organeRef": "PO656022",
            "nombreMembresGroupe": "16",
            "vote": {
              "positionMajoritaire": "pour",
              "decompteVoix": {
                "pour": "0",
                "contre": "0",
                "abstention": "0"
              },
              "decompteNominatif": {
                "nonVotants": "0",
                "pour": null,
                "contre": null,
                "abstentions": null
              }
            }
          },
          {
            "organeRef": "PO656018",
            "nombreMembresGroupe": "15",
            "vote": {
              "positionMajoritaire": "pour",
              "decompteVoix": {
                "pour": "2",
                "contre": "2",
                "abstention": "0"
              },
              "decompteNominatif": {
                "nonVotants": "0",
                "pour": null,
                "contre": {
                  "votant": [
                    {
                      "acteurRef": "PA1141",
                      "mandatRef": "PM645468"
                    },
                    {
                      "acteurRef": "PA1364",
                      "mandatRef": "PM645084"
                    }
                  ]
                },
                "abstentions": null
              }
            }
          },
          {
            "organeRef": "PO645633",
            "nombreMembresGroupe": "7",
            "vote": {
              "positionMajoritaire": "pour",
              "decompteVoix": {
                "pour": "0",
                "contre": "0",
                "abstention": "0"
              },
              "decompteNominatif": {
                "nonVotants": "0",
                "pour": null,
                "contre": null,
                "abstentions": null
              }
            }
          }
        ]
      }
    }
  },
  "miseAuPoint": {
    "nonVotants": null,
    "pour": {
      "votant": [
        {
          "acteurRef": "PA609816",
          "mandatRef": "PM645334"
        },
        {
          "acteurRef": "PA605922",
          "mandatRef": "PM645493"
        }
      ]
    },
    "contre": {
      "votant": [
        {
          "acteurRef": "PA606230",
          "mandatRef": "PM645342"
        },
        {
          "acteurRef": "PA608276",
          "mandatRef": "PM645252"
        },
        {
          "acteurRef": "PA606495",
          "mandatRef": "PM645463"
        },
        {
          "acteurRef": "PA2229",
          "mandatRef": "PM645205"
        },
        {
          "acteurRef": "PA267728",
          "mandatRef": "PM645216"
        },
        {
          "acteurRef": "PA330981",
          "mandatRef": "PM645409"
        },
        {
          "acteurRef": "PA606586",
          "mandatRef": "PM645490"
        },
        {
          "acteurRef": "PA610758",
          "mandatRef": "PM645301"
        }
      ]
    },
    "abstentions": {
      "votant": {
        "acteurRef": "PA267965",
        "mandatRef": "PM645052"
      }
    },
    "nonVotantsVolontaires": null
  }
}