{
  "@xmlns:xsi": "http://www.w3.org/2001/XMLSchema-instance",
  "uid": "VTANR5L14V461",
  "numero": "461",
  "organeRef": "PO644420",
  "legislature": "14",
  "sessionRef": "SCR5A2013O1",
  "seanceRef": "RUANR5L14S2013IDS17043",
  "dateScrutin": "2013-04-08T02:00:00.000+02:00",
  "quantiemeJourSeance": "2",
  "typeVote": {
    "codeTypeVote": "SPO",
    "libelleTypeVote": "scrutin public ordinaire",
    "typeMajorite": "majorité absolue des suffrages exprimés"
  },
  "sort": {
    "code": "rejeté",
    "libelle": "L'Assemblée nationale n'a pas adopté"
  },
  "titre": "l'amendement n° 3639 de Mme Fraysse et les amendements identiques à l'article 15 du projet de loi relatif à la sécurisation de l'emploi.",
  "demandeur": {
    "texte": "Président du groupe de la gauche démocrate et républicaine",
    "referenceLegislative": null
  },
  "objet": {
    "libelle": "l'amendement n° 3639 de Mme Fraysse et les amendements identiques à l'article 15 du projet de loi relatif à la sécurisation de l'emploi.",
    "referenceLegislative": null
  },
  "modePublicationDesVotes": "DecompteDissidentsPositionGroupe",
  "syntheseVote": {
    "nombreVotants": "43",
    "suffragesExprimes": "38",
    "nbrSuffragesRequis": "20",
    "annonce": "L'Assemblée nationale n'a pas adopté",
    "decompte": {
      "pour": "8",
      "contre": "30",
      "abstentions": "5",
      "nonVotants": "2"
    }
  },
  "ventilationVotes": {
    "organe": {
      "organeRef": "PO644420",
      "groupes": {
        "groupe": [
          {
            "organeRef": "PO656002",
            "nombreMembresGroupe": "293",
            "vote": {
              "positionMajoritaire": "contre",
              "decompteVoix": {
                "pour": "1",
                "contre": "30",
                "abstention": "4",
                "nonVotant": "2"
              },
              "decompteNominatif": {
                "nonVotants": {
                  "votant": [
                    {
                      "acteurRef": "PA381",
                      "mandatRef": "PM645125",
                      "causePositionVote": "PAN"
                    },
                    {
                      "acteurRef": "PA335319",
                      "mandatRef": "PM645070",
                      "causePositionVote": "PSE"
                    }
                  ]
                },
                "pour": {
                  "votant": {
                    "acteurRef": "PA1710",
                    "mandatRef": "PM645166"
                  }
                },
                "contre": null,
                "abstentions": {
                  "votant": [
                    {
                      "acteurRef": "PA1592",
                      "mandatRef": "PM645232"
                    },
                    {
                      "acteurRef": "PA605952",
                      "mandatRef": "PM645049"
                    },
                    {
                      "acteurRef": "PA606161",
                      "mandatRef": "PM645250"
                    },
                    {
                      "acteurRef": "PA1567",
                      "mandatRef": "PM676809"
                    }
                  ]
                }
              }
            }
          },
          {
            "organeRef": "PO656006",
            "nombreMembresGroupe": "196",
            "vote": {
              "positionMajoritaire": "pour",
              "decompteVoix": {
                "pour": "0",
                "contre": "0",
                "abstention": "0"
              },
              "decompteNominatif": {
                "nonVotants": "0",
                "pour": null,
                "contre": null,
                "abstentions": null
              }
            }
          },
          {
            "organeRef": "PO656010",
            "nombreMembresGroupe": "30",
            "vote": {
              "positionMajoritaire": "pour",
              "decompteVoix": {
                "pour": "0",
                "contre": "0",
                "abstention": "0"
              },
              "decompteNominatif": {
                "nonVotants": "0",
                "pour": null,
                "contre": null,
                "abstentions": null
              }
            }
          },
          {
            "organeRef": "PO656014",
            "nombreMembresGroupe": "17",
            "vote": {
              "positionMajoritaire": "pour",
              "decompteVoix": {
                "pour": "3",
                "contre": "0",
                "abstention": "0"
              },
              "decompteNominatif": {
                "nonVotants": "0",
                "pour": null,
                "contre": null,
                "abstentions": null
              }
            }
          },
          {
            "organeRef": "PO656022",
            "nombreMembresGroupe": "16",
            "vote": {
              "positionMajoritaire": "abstention",
              "decompteVoix": {
                "pour": "0",
                "contre": "0",
                "abstention": "1"
              },
              "decompteNominatif": {
                "nonVotants": "0",
                "pour": null,
                "contre": null,
                "abstentions": null
              }
            }
          },
          {
            "organeRef": "PO656018",
            "nombreMembresGroupe": "15",
            "vote": {
              "positionMajoritaire": "pour",
              "decompteVoix": {
                "pour": "4",
                "contre": "0",
                "abstention": "0"
              },
              "decompteNominatif": {
                "nonVotants": "0",
                "pour": null,
                "contre": null,
                "abstentions": null
              }
            }
          },
          {
            "organeRef": "PO645633",
            "nombreMembresGroupe": "8",
            "vote": {
              "positionMajoritaire": "pour",
              "decompteVoix": {
                "pour": "0",
                "contre": "0",
                "abstention": "0"
              },
              "decompteNominatif": {
                "nonVotants": "0",
                "pour": null,
                "contre": null,
                "abstentions": null
              }
            }
          }
        ]
      }
    }
  },
  "miseAuPoint": null
}