{
  "@xmlns:xsi": "http://www.w3.org/2001/XMLSchema-instance",
  "uid": "VTANR5L14V33",
  "numero": "33",
  "organeRef": "PO644420",
  "legislature": "14",
  "sessionRef": "SCR5A2013O1",
  "seanceRef": "RUANR5L14S2013IDS16538",
  "dateScrutin": "2012-10-11T02:00:00.000+02:00",
  "quantiemeJourSeance": "1",
  "typeVote": {
    "codeTypeVote": "SPO",
    "libelleTypeVote": "scrutin public ordinaire",
    "typeMajorite": "majorité absolue des suffrages exprimés"
  },
  "sort": {
    "code": "adopté",
    "libelle": "l'Assemblée nationale a adopté"
  },
  "titre": "l'amendement n° 1 de M. Sirugue à l'article premier de la proposition de loi relative à l'aide médicale d'Etat (suppression de l'article visant à rétablir le guichet unique pour les bénéficiaires de l'aide médicale d'Etat).",
  "demandeur": {
    "texte": "Président du groupe de l'union pour un mouvement populaire",
    "referenceLegislative": null
  },
  "objet": {
    "libelle": "l'amendement n° 1 de M. Sirugue à l'article premier de la proposition de loi relative à l'aide médicale d'Etat (suppression de l'article visant à rétablir le guichet unique pour les bénéficiaires de l'aide médicale d'Etat).",
    "referenceLegislative": null
  },
  "modePublicationDesVotes": "DecompteDissidentsPositionGroupe",
  "syntheseVote": {
    "nombreVotants": "145",
    "suffragesExprimes": "145",
    "nbrSuffragesRequis": "73",
    "annonce": "l'Assemblée nationale a adopté",
    "decompte": {
      "pour": "97",
      "contre": "48",
      "abstentions": "0",
      "nonVotants": "2"
    }
  },
  "ventilationVotes": {
    "organe": {
      "organeRef": "PO644420",
      "groupes": {
        "groupe": [
          {
            "organeRef": "PO656002",
            "nombreMembresGroupe": "297",
            "vote": {
              "positionMajoritaire": "pour",
              "decompteVoix": {
                "pour": "94",
                "contre": "0",
                "abstention": "0",
                "nonVotant": "2"
              },
              "decompteNominatif": {
                "nonVotants": {
                  "votant": [
                    {
                      "acteurRef": "PA381",
                      "mandatRef": "PM645125",
                      "causePositionVote": "PAN"
                    },
                    {
                      "acteurRef": "PA335319",
                      "mandatRef": "PM645070",
                      "causePositionVote": "PSE"
                    }
                  ]
                },
                "pour": null,
                "contre": null,
                "abstentions": null
              }
            }
          },
          {
            "organeRef": "PO656006",
            "nombreMembresGroupe": "195",
            "vote": {
              "positionMajoritaire": "contre",
              "decompteVoix": {
                "pour": "0",
                "contre": "48",
                "abstention": "0"
              },
              "decompteNominatif": {
                "nonVotants": "0",
                "pour": null,
                "contre": null,
                "abstentions": null
              }
            }
          },
          {
            "organeRef": "PO656010",
            "nombreMembresGroupe": "30",
            "vote": {
              "positionMajoritaire": "pour",
              "decompteVoix": {
                "pour": "0",
                "contre": "0",
                "abstention": "0"
              },
              "decompteNominatif": {
                "nonVotants": "0",
                "pour": null,
                "contre": null,
                "abstentions": null
              }
            }
          },
          {
            "organeRef": "PO656014",
            "nombreMembresGroupe": "17",
            "vote": {
              "positionMajoritaire": "pour",
              "decompteVoix": {
                "pour": "2",
                "contre": "0",
                "abstention": "0"
              },
              "decompteNominatif": {
                "nonVotants": "0",
                "pour": null,
                "contre": null,
                "abstentions": null
              }
            }
          },
          {
            "organeRef": "PO656022",
            "nombreMembresGroupe": "16",
            "vote": {
              "positionMajoritaire": "pour",
              "decompteVoix": {
                "pour": "0",
                "contre": "0",
                "abstention": "0"
              },
              "decompteNominatif": {
                "nonVotants": "0",
                "pour": null,
                "contre": null,
                "abstentions": null
              }
            }
          },
          {
            "organeRef": "PO656018",
            "nombreMembresGroupe": "15",
            "vote": {
              "positionMajoritaire": "pour",
              "decompteVoix": {
                "pour": "1",
                "contre": "0",
                "abstention": "0"
              },
              "decompteNominatif": {
                "nonVotants": "0",
                "pour": null,
                "contre": null,
                "abstentions": null
              }
            }
          },
          {
            "organeRef": "PO645633",
            "nombreMembresGroupe": "7",
            "vote": {
              "positionMajoritaire": "pour",
              "decompteVoix": {
                "pour": "0",
                "contre": "0",
                "abstention": "0"
              },
              "decompteNominatif": {
                "nonVotants": "0",
                "pour": null,
                "contre": null,
                "abstentions": null
              }
            }
          }
        ]
      }
    }
  },
  "miseAuPoint": null
}