{
  "@xmlns:xsi": "http://www.w3.org/2001/XMLSchema-instance",
  "uid": "VTANR5L14V884",
  "numero": "884",
  "organeRef": "PO644420",
  "legislature": "14",
  "sessionRef": "SCR5A2014E1",
  "seanceRef": "RUANR5L14S2014IDS18627",
  "dateScrutin": "2014-07-17T02:00:00.000+02:00",
  "quantiemeJourSeance": "3",
  "typeVote": {
    "codeTypeVote": "SPO",
    "libelleTypeVote": "scrutin public ordinaire",
    "typeMajorite": "majorité absolue des suffrages exprimés"
  },
  "sort": {
    "code": "rejeté",
    "libelle": "L'Assemblée nationale n'a pas adopté"
  },
  "titre": "le sous-amendement n° 509 de M. de Rugy à l'amendement n° 490 de M. Le Roux à l'article premier du projet de loi relatif à la délimitation des régions, aux élections régionales et départementales et modifiant le calendrier électoral",
  "demandeur": {
    "texte": "Président du groupe écologiste",
    "referenceLegislative": null
  },
  "objet": {
    "libelle": "le sous-amendement n° 509 de M. de Rugy à l'amendement n° 490 de M. Le Roux à l'article premier du projet de loi relatif à la délimitation des régions, aux élections régionales et départementales et modifiant le calendrier électoral",
    "referenceLegislative": null
  },
  "modePublicationDesVotes": "DecompteNominatif",
  "syntheseVote": {
    "nombreVotants": "80",
    "suffragesExprimes": "78",
    "nbrSuffragesRequis": "40",
    "annonce": "L'Assemblée nationale n'a pas adopté",
    "decompte": {
      "pour": "25",
      "contre": "53",
      "abstentions": "2",
      "nonVotants": "3"
    }
  },
  "ventilationVotes": {
    "organe": {
      "organeRef": "PO644420",
      "groupes": {
        "groupe": [
          {
            "organeRef": "PO656002",
            "nombreMembresGroupe": "290",
            "vote": {
              "positionMajoritaire": "contre",
              "decompteVoix": {
                "pour": "4",
                "contre": "47",
                "abstention": "1",
                "nonVotant": "2"
              },
              "decompteNominatif": {
                "nonVotants": {
                  "votant": [
                    {
                      "acteurRef": "PA381",
                      "mandatRef": "PM645125",
                      "causePositionVote": "PAN"
                    },
                    {
                      "acteurRef": "PA335017",
                      "mandatRef": "PM645607",
                      "causePositionVote": "PSE"
                    }
                  ]
                },
                "pour": {
                  "votant": [
                    {
                      "acteurRef": "PA332305",
                      "mandatRef": "PM645562"
                    },
                    {
                      "acteurRef": "PA605888",
                      "mandatRef": "PM645476"
                    },
                    {
                      "acteurRef": "PA606161",
                      "mandatRef": "PM645250"
                    },
                    {
                      "acteurRef": "PA607606",
                      "mandatRef": "PM645381"
                    }
                  ]
                },
                "contre": {
                  "votant": [
                    {
                      "acteurRef": "PA606040",
                      "mandatRef": "PM645144"
                    },
                    {
                      "acteurRef": "PA610481",
                      "mandatRef": "PM645131"
                    },
                    {
                      "acteurRef": "PA1816",
                      "mandatRef": "PM701036"
                    },
                    {
                      "acteurRef": "PA331594",
                      "mandatRef": "PM645208"
                    },
                    {
                      "acteurRef": "PA334",
                      "mandatRef": "PM645206"
                    },
                    {
                      "acteurRef": "PA1886",
                      "mandatRef": "PM645099"
                    },
                    {
                      "acteurRef": "PA2549",
                      "mandatRef": "PM645412"
                    },
                    {
                      "acteurRef": "PA606631",
                      "mandatRef": "PM645516"
                    },
                    {
                      "acteurRef": "PA606171",
                      "mandatRef": "PM645255"
                    },
                    {
                      "acteurRef": "PA1844",
                      "mandatRef": "PM645254"
                    },
                    {
                      "acteurRef": "PA609513",
                      "mandatRef": "PM645228"
                    },
                    {
                      "acteurRef": "PA608158",
                      "mandatRef": "PM645174"
                    },
                    {
                      "acteurRef": "PA2503",
                      "mandatRef": "PM645187"
                    },
                    {
                      "acteurRef": "PA267695",
                      "mandatRef": "PM645213"
                    },
                    {
                      "acteurRef": "PA1592",
                      "mandatRef": "PM645232"
                    },
                    {
                      "acteurRef": "PA605069",
                      "mandatRef": "PM645534"
                    },
                    {
                      "acteurRef": "PA335054",
                      "mandatRef": "PM645614"
                    },
                    {
                      "acteurRef": "PA335543",
                      "mandatRef": "PM702197"
                    },
                    {
                      "acteurRef": "PA336112",
                      "mandatRef": "PM645253"
                    },
                    {
                      "acteurRef": "PA336439",
                      "mandatRef": "PM645333"
                    },
                    {
                      "acteurRef": "PA332636",
                      "mandatRef": "PM645118"
                    },
                    {
                      "acteurRef": "PA330981",
                      "mandatRef": "PM645409"
                    },
                    {
                      "acteurRef": "PA344114",
                      "mandatRef": "PM645092"
                    },
                    {
                      "acteurRef": "PA605076",
                      "mandatRef": "PM645535"
                    },
                    {
                      "acteurRef": "PA605703",
                      "mandatRef": "PM645418"
                    },
                    {
                      "acteurRef": "PA605643",
                      "mandatRef": "PM645405"
                    },
                    {
                      "acteurRef": "PA606555",
                      "mandatRef": "PM645477"
                    },
                    {
                      "acteurRef": "PA606507",
                      "mandatRef": "PM645406"
                    },
                    {
                      "acteurRef": "PA606991",
                      "mandatRef": "PM645098"
                    },
                    {
                      "acteurRef": "PA606623",
                      "mandatRef": "PM645513"
                    },
                    {
                      "acteurRef": "PA606665",
                      "mandatRef": "PM645526"
                    },
                    {
                      "acteurRef": "PA607310",
                      "mandatRef": "PM645297"
                    },
                    {
                      "acteurRef": "PA607395",
                      "mandatRef": "PM645343"
                    },
                    {
                      "acteurRef": "PA607892",
                      "mandatRef": "PM645460"
                    },
                    {
                      "acteurRef": "PA608172",
                      "mandatRef": "PM645197"
                    },
                    {
                      "acteurRef": "PA608718",
                      "mandatRef": "PM645610"
                    },
                    {
                      "acteurRef": "PA609292",
                      "mandatRef": "PM645169"
                    },
                    {
                      "acteurRef": "PA609775",
                      "mandatRef": "PM645329"
                    },
                    {
                      "acteurRef": "PA609435",
                      "mandatRef": "PM645211"
                    },
                    {
                      "acteurRef": "PA609845",
                      "mandatRef": "PM645339"
                    },
                    {
                      "acteurRef": "PA608363",
                      "mandatRef": "PM645571"
                    },
                    {
                      "acteurRef": "PA609535",
                      "mandatRef": "PM645236"
                    },
                    {
                      "acteurRef": "PA610594",
                      "mandatRef": "PM645185"
                    },
                    {
                      "acteurRef": "PA608011",
                      "mandatRef": "PM645066"
                    },
                    {
                      "acteurRef": "PA267623",
                      "mandatRef": "PM676817"
                    },
                    {
                      "acteurRef": "PA335999",
                      "mandatRef": "PM696536"
                    },
                    {
                      "acteurRef": "PA643020",
                      "mandatRef": "PM702199"
                    }
                  ]
                },
                "abstentions": {
                  "votant": {
                    "acteurRef": "PA331282",
                    "mandatRef": "PM645480"
                  }
                }
              }
            }
          },
          {
            "organeRef": "PO656006",
            "nombreMembresGroupe": "199",
            "vote": {
              "positionMajoritaire": "pour",
              "decompteVoix": {
                "pour": "11",
                "contre": "2",
                "abstention": "1"
              },
              "decompteNominatif": {
                "nonVotants": "0",
                "pour": {
                  "votant": [
                    {
                      "acteurRef": "PA1874",
                      "mandatRef": "PM645474"
                    },
                    {
                      "acteurRef": "PA606693",
                      "mandatRef": "PM645542"
                    },
                    {
                      "acteurRef": "PA267797",
                      "mandatRef": "PM645350"
                    },
                    {
                      "acteurRef": "PA266776",
                      "mandatRef": "PM645590"
                    },
                    {
                      "acteurRef": "PA334149",
                      "mandatRef": "PM645127"
                    },
                    {
                      "acteurRef": "PA334654",
                      "mandatRef": "PM645596"
                    },
                    {
                      "acteurRef": "PA330008",
                      "mandatRef": "PM645164"
                    },
                    {
                      "acteurRef": "PA266774",
                      "mandatRef": "PM645583"
                    },
                    {
                      "acteurRef": "PA608416",
                      "mandatRef": "PM645586"
                    },
                    {
                      "acteurRef": "PA608434",
                      "mandatRef": "PM645593"
                    },
                    {
                      "acteurRef": "PA267785",
                      "mandatRef": "PM645359"
                    }
                  ]
                },
                "contre": {
                  "votant": [
                    {
                      "acteurRef": "PA268051",
                      "mandatRef": "PM645234"
                    },
                    {
                      "acteurRef": "PA332886",
                      "mandatRef": "PM645226"
                    }
                  ]
                },
                "abstentions": {
                  "votant": {
                    "acteurRef": "PA696",
                    "mandatRef": "PM645428"
                  }
                }
              }
            }
          },
          {
            "organeRef": "PO656010",
            "nombreMembresGroupe": "30",
            "vote": {
              "positionMajoritaire": "pour",
              "decompteVoix": {
                "pour": "3",
                "contre": "2",
                "abstention": "0"
              },
              "decompteNominatif": {
                "nonVotants": "0",
                "pour": {
                  "votant": [
                    {
                      "acteurRef": "PA331582",
                      "mandatRef": "PM645198"
                    },
                    {
                      "acteurRef": "PA332228",
                      "mandatRef": "PM645546"
                    },
                    {
                      "acteurRef": "PA610125",
                      "mandatRef": "PM645088"
                    }
                  ]
                },
                "contre": {
                  "votant": [
                    {
                      "acteurRef": "PA267042",
                      "mandatRef": "PM645368"
                    },
                    {
                      "acteurRef": "PA267469",
                      "mandatRef": "PM645314"
                    }
                  ]
                },
                "abstentions": null
              }
            }
          },
          {
            "organeRef": "PO656014",
            "nombreMembresGroupe": "18",
            "vote": {
              "positionMajoritaire": "pour",
              "decompteVoix": {
                "pour": "5",
                "contre": "0",
                "abstention": "0"
              },
              "decompteNominatif": {
                "nonVotants": "0",
                "pour": {
                  "votant": [
                    {
                      "acteurRef": "PA332747",
                      "mandatRef": "PM645155"
                    },
                    {
                      "acteurRef": "PA609016",
                      "mandatRef": "PM645074"
                    },
                    {
                      "acteurRef": "PA609520",
                      "mandatRef": "PM645233"
                    },
                    {
                      "acteurRef": "PA605518",
                      "mandatRef": "PM645500"
                    },
                    {
                      "acteurRef": "PA607619",
                      "mandatRef": "PM645383"
                    }
                  ]
                },
                "contre": null,
                "abstentions": null
              }
            }
          },
          {
            "organeRef": "PO656022",
            "nombreMembresGroupe": "16",
            "vote": {
              "positionMajoritaire": "pour",
              "decompteVoix": {
                "pour": "2",
                "contre": "2",
                "abstention": "0"
              },
              "decompteNominatif": {
                "nonVotants": "0",
                "pour": {
                  "votant": [
                    {
                      "acteurRef": "PA605084",
                      "mandatRef": "PM645537"
                    },
                    {
                      "acteurRef": "PA608292",
                      "mandatRef": "PM645276"
                    }
                  ]
                },
                "contre": {
                  "votant": [
                    {
                      "acteurRef": "PA2828",
                      "mandatRef": "PM645402"
                    },
                    {
                      "acteurRef": "PA605694",
                      "mandatRef": "PM645416"
                    }
                  ]
                },
                "abstentions": null
              }
            }
          },
          {
            "organeRef": "PO656018",
            "nombreMembresGroupe": "15",
            "vote": {
              "positionMajoritaire": "pour",
              "decompteVoix": {
                "pour": "0",
                "contre": "0",
                "abstention": "0"
              },
              "decompteNominatif": {
                "nonVotants": "0",
                "pour": null,
                "contre": null,
                "abstentions": null
              }
            }
          },
          {
            "organeRef": "PO645633",
            "nombreMembresGroupe": "9",
            "vote": {
              "positionMajoritaire": "pour",
              "decompteVoix": {
                "pour": "0",
                "contre": "0",
                "abstention": "0",
                "nonVotant": "1"
              },
              "decompteNominatif": {
                "nonVotants": {
                  "votant": {
                    "acteurRef": "PA337633",
                    "mandatRef": "PM702061",
                    "causePositionVote": "MG"
                  }
                },
                "pour": null,
                "contre": null,
                "abstentions": null
              }
            }
          }
        ]
      }
    }
  },
  "miseAuPoint": {
    "nonVotants": null,
    "pour": null,
    "contre": {
      "votant": {
        "acteurRef": "PA607846",
        "mandatRef": "PM645441"
      }
    },
    "abstentions": null,
    "nonVotantsVolontaires": null
  }
}