{
  "@xmlns:xsi": "http://www.w3.org/2001/XMLSchema-instance",
  "uid": "VTANR5L14V1121",
  "numero": "1121",
  "organeRef": "PO644420",
  "legislature": "14",
  "sessionRef": "SCR5A2015O1",
  "seanceRef": "RUANR5L14S2015IDS19271",
  "dateScrutin": "2015-05-26T02:00:00.000+02:00",
  "quantiemeJourSeance": "2",
  "typeVote": {
    "codeTypeVote": "SPO",
    "libelleTypeVote": "scrutin public ordinaire",
    "typeMajorite": "majorité absolue des suffrages exprimés"
  },
  "sort": {
    "code": "rejeté",
    "libelle": "L'Assemblée nationale n'a pas adopté"
  },
  "titre": "les amendements de suppression n° 38 de M. Cherpion, n° 46 de M. Tardy, n° 102 de M. Tian, n° 118 de M. Perrut, n° 138 de Mme Boyer, n°467 de M. Poisson et n° 534 de M. Fromantin à l'article premier du projet de loi relatif au dialogue social et à l'emploi (première lecture).",
  "demandeur": {
    "texte": "Président du groupe de l'union des démocrates et indépendants",
    "referenceLegislative": null
  },
  "objet": {
    "libelle": "les amendements de suppression n° 38 de M. Cherpion, n° 46 de M. Tardy, n° 102 de M. Tian, n° 118 de M. Perrut, n° 138 de Mme Boyer, n°467 de M. Poisson et n° 534 de M. Fromantin à l'article premier du projet de loi relatif au dialogue social et à l'emploi (première lecture).",
    "referenceLegislative": null
  },
  "modePublicationDesVotes": "DecompteNominatif",
  "syntheseVote": {
    "nombreVotants": "43",
    "suffragesExprimes": "43",
    "nbrSuffragesRequis": "22",
    "annonce": "L'Assemblée nationale n'a pas adopté",
    "decompte": {
      "pour": "14",
      "contre": "29",
      "abstentions": "0",
      "nonVotants": "2"
    }
  },
  "ventilationVotes": {
    "organe": {
      "organeRef": "PO644420",
      "groupes": {
        "groupe": [
          {
            "organeRef": "PO656002",
            "nombreMembresGroupe": "288",
            "vote": {
              "positionMajoritaire": "contre",
              "decompteVoix": {
                "pour": "0",
                "contre": "23",
                "abstention": "0",
                "nonVotant": "1"
              },
              "decompteNominatif": {
                "nonVotants": {
                  "votant": {
                    "acteurRef": "PA381",
                    "mandatRef": "PM645125",
                    "causePositionVote": "PAN"
                  }
                },
                "pour": null,
                "contre": {
                  "votant": [
                    {
                      "acteurRef": "PA2895",
                      "mandatRef": "PM645485"
                    },
                    {
                      "acteurRef": "PA877",
                      "mandatRef": "PM645349"
                    },
                    {
                      "acteurRef": "PA1977",
                      "mandatRef": "PM645404"
                    },
                    {
                      "acteurRef": "PA335017",
                      "mandatRef": "PM645607"
                    },
                    {
                      "acteurRef": "PA267188",
                      "mandatRef": "PM645410"
                    },
                    {
                      "acteurRef": "PA332384",
                      "mandatRef": "PM645528"
                    },
                    {
                      "acteurRef": "PA336421",
                      "mandatRef": "PM645332"
                    },
                    {
                      "acteurRef": "PA332206",
                      "mandatRef": "PM645538"
                    },
                    {
                      "acteurRef": "PA330981",
                      "mandatRef": "PM645409"
                    },
                    {
                      "acteurRef": "PA605830",
                      "mandatRef": "PM645454"
                    },
                    {
                      "acteurRef": "PA606924",
                      "mandatRef": "PM645527"
                    },
                    {
                      "acteurRef": "PA606991",
                      "mandatRef": "PM645098"
                    },
                    {
                      "acteurRef": "PA607256",
                      "mandatRef": "PM645247"
                    },
                    {
                      "acteurRef": "PA607283",
                      "mandatRef": "PM645259"
                    },
                    {
                      "acteurRef": "PA607632",
                      "mandatRef": "PM645387"
                    },
                    {
                      "acteurRef": "PA607509",
                      "mandatRef": "PM645369"
                    },
                    {
                      "acteurRef": "PA609042",
                      "mandatRef": "PM645076"
                    },
                    {
                      "acteurRef": "PA608718",
                      "mandatRef": "PM645610"
                    },
                    {
                      "acteurRef": "PA610529",
                      "mandatRef": "PM645192"
                    },
                    {
                      "acteurRef": "PA610594",
                      "mandatRef": "PM645185"
                    },
                    {
                      "acteurRef": "PA610203",
                      "mandatRef": "PM645065"
                    },
                    {
                      "acteurRef": "PA610729",
                      "mandatRef": "PM645288"
                    },
                    {
                      "acteurRef": "PA643002",
                      "mandatRef": "PM703297"
                    }
                  ]
                },
                "abstentions": null
              }
            }
          },
          {
            "organeRef": "PO656006",
            "nombreMembresGroupe": "198",
            "vote": {
              "positionMajoritaire": "pour",
              "decompteVoix": {
                "pour": "10",
                "contre": "0",
                "abstention": "0",
                "nonVotant": "1"
              },
              "decompteNominatif": {
                "nonVotants": {
                  "votant": {
                    "acteurRef": "PA267797",
                    "mandatRef": "PM645350",
                    "causePositionVote": "PSE"
                  }
                },
                "pour": {
                  "votant": [
                    {
                      "acteurRef": "PA2377",
                      "mandatRef": "PM645591"
                    },
                    {
                      "acteurRef": "PA856",
                      "mandatRef": "PM645353"
                    },
                    {
                      "acteurRef": "PA606693",
                      "mandatRef": "PM645542"
                    },
                    {
                      "acteurRef": "PA345937",
                      "mandatRef": "PM645177"
                    },
                    {
                      "acteurRef": "PA2815",
                      "mandatRef": "PM645514"
                    },
                    {
                      "acteurRef": "PA267204",
                      "mandatRef": "PM645551"
                    },
                    {
                      "acteurRef": "PA335159",
                      "mandatRef": "PM645554"
                    },
                    {
                      "acteurRef": "PA267450",
                      "mandatRef": "PM645452"
                    },
                    {
                      "acteurRef": "PA330684",
                      "mandatRef": "PM645497"
                    },
                    {
                      "acteurRef": "PA607489",
                      "mandatRef": "PM645366"
                    }
                  ]
                },
                "contre": null,
                "abstentions": null
              }
            }
          },
          {
            "organeRef": "PO656010",
            "nombreMembresGroupe": "30",
            "vote": {
              "positionMajoritaire": "pour",
              "decompteVoix": {
                "pour": "3",
                "contre": "0",
                "abstention": "0"
              },
              "decompteNominatif": {
                "nonVotants": "0",
                "pour": {
                  "votant": [
                    {
                      "acteurRef": "PA2597",
                      "mandatRef": "PM645126"
                    },
                    {
                      "acteurRef": "PA267585",
                      "mandatRef": "PM645508"
                    },
                    {
                      "acteurRef": "PA332228",
                      "mandatRef": "PM645546"
                    }
                  ]
                },
                "contre": null,
                "abstentions": null
              }
            }
          },
          {
            "organeRef": "PO656014",
            "nombreMembresGroupe": "18",
            "vote": {
              "positionMajoritaire": "contre",
              "decompteVoix": {
                "pour": "0",
                "contre": "5",
                "abstention": "0"
              },
              "decompteNominatif": {
                "nonVotants": "0",
                "pour": null,
                "contre": {
                  "votant": [
                    {
                      "acteurRef": "PA332747",
                      "mandatRef": "PM645155"
                    },
                    {
                      "acteurRef": "PA609520",
                      "mandatRef": "PM645233"
                    },
                    {
                      "acteurRef": "PA606258",
                      "mandatRef": "PM645347"
                    },
                    {
                      "acteurRef": "PA605963",
                      "mandatRef": "PM645055"
                    },
                    {
                      "acteurRef": "PA609816",
                      "mandatRef": "PM645334"
                    }
                  ]
                },
                "abstentions": null
              }
            }
          },
          {
            "organeRef": "PO656022",
            "nombreMembresGroupe": "18",
            "vote": {
              "positionMajoritaire": "pour",
              "decompteVoix": {
                "pour": "0",
                "contre": "0",
                "abstention": "0"
              },
              "decompteNominatif": {
                "nonVotants": "0",
                "pour": null,
                "contre": null,
                "abstentions": null
              }
            }
          },
          {
            "organeRef": "PO656018",
            "nombreMembresGroupe": "15",
            "vote": {
              "positionMajoritaire": "contre",
              "decompteVoix": {
                "pour": "0",
                "contre": "1",
                "abstention": "0"
              },
              "decompteNominatif": {
                "nonVotants": "0",
                "pour": null,
                "contre": {
                  "votant": {
                    "acteurRef": "PA1364",
                    "mandatRef": "PM645084"
                  }
                },
                "abstentions": null
              }
            }
          },
          {
            "organeRef": "PO645633",
            "nombreMembresGroupe": "9",
            "vote": {
              "positionMajoritaire": "pour",
              "decompteVoix": {
                "pour": "1",
                "contre": "0",
                "abstention": "0"
              },
              "decompteNominatif": {
                "nonVotants": "0",
                "pour": {
                  "votant": {
                    "acteurRef": "PA1838",
                    "mandatRef": "PM645238"
                  }
                },
                "contre": null,
                "abstentions": null
              }
            }
          }
        ]
      }
    }
  },
  "miseAuPoint": null
}