{
  "xsiType": "texteLoi_Type",
  "uid": "RINFANR5L15B0511",
  "legislature": "15",
  "cycleDeVie": {
    "chrono": {
      "dateCreation": "2017-12-20T00:00:00.000+01:00",
      "dateDepot": "2017-12-20T00:00:00.000+01:00",
      "datePublication": "2017-12-26T00:00:00.000+01:00",
      "datePublicationWeb": "2017-12-22T19:00:00.000+01:00"
    }
  },
  "denominationStructurelle": "Rapport d'information",
  "provenance": "Commission",
  "titres": {
    "titrePrincipal": "rapport d'information déposé en application de l'article 145 du règlement, par la commission du développement durable et de l'aménagement du territoire sur la mise en application de la loi n° 2016-816 du 20 juin 2016 pour l’économie bleue",
    "titrePrincipalCourt": "rapport d'information déposé en application de l'article 145 du règlement, par la commission du développement durable et de l'aménagement du territoire sur la mise en application de la loi n° 2016-816 du 20 juin 2016 pour l’économie bleue"
  },
  "dossierRef": "DLR5L15N36241",
  "classification": {
    "famille": {
      "depot": {
        "code": "RAPAUT",
        "libelle": "Rapport autonome"
      },
      "classe": {
        "code": "RAPINF",
        "libelle": "Rapport d'information"
      },
      "espece": {
        "code": "PRPDIT",
        "libelle": "tel quel"
      }
    },
    "type": {
      "code": "RINF",
      "libelle": "Rapport d'information"
    },
    "sousType": {
      "code": "PRPDIT",
      "libelle": "tel quel"
    }
  },
  "auteurs": [
    {
      "acteur": {
        "acteurRef": "PA719632",
        "qualite": "rapporteur"
      }
    },
    {
      "acteur": {
        "acteurRef": "PA719806",
        "qualite": "rapporteur"
      }
    },
    {
      "organeRef": "PO419865"
    }
  ],
  "notice": {
    "numNotice": "511",
    "formule": "déposé en application de l'article 145 du règlement, par la commission du développement durable et de l'aménagement du territoire sur la mise en application de la loi n° 2016-816 du 20 juin 2016 pour l’économie bleue",
    "adoptionConforme": false
  },
  "imprimerie": {
    "prix": "6.5"
  }
}