{
  "xsiType": "DossierResolutionAN",
  "uid": "DLR5L15N37773",
  "legislature": "15",
  "titreDossier": {
    "titre": "Marchés parallèles pour la prise de rendez-vous en préfecture",
    "titreChemin": "marches_paralleles_prise_rendez-vous_prefecture"
  },
  "procedureParlementaire": {
    "code": "8",
    "libelle": "Résolution"
  },
  "initiateur": {
    "acteurs": [
      {
        "acteurRef": "PA721210",
        "mandatRef": "PM723204"
      }
    ]
  },
  "actesLegislatifs": [
    {
      "xsiType": "Etape_Type",
      "uid": "L15-ANLUNI-37773",
      "codeActe": "ANLUNI",
      "libelleActe": {
        "nomCanonique": "Lecture unique"
      },
      "organeRef": "PO717460",
      "actesLegislatifs": [
        {
          "xsiType": "DepotInitiative_Type",
          "uid": "L15-VD190848DI",
          "codeActe": "ANLUNI-DEPOT",
          "libelleActe": {
            "nomCanonique": "1er dépôt d'une initiative.",
            "libelleCourt": "1er dépôt d'une initiative."
          },
          "organeRef": "PO717460",
          "dateActe": "2019-10-01T00:00:00.000+02:00",
          "texteAssocieRef": "PNREANR5L15B2276"
        },
        {
          "xsiType": "Etape_Type",
          "uid": "L15-ANLUNI-COM-37773",
          "codeActe": "ANLUNI-COM",
          "libelleActe": {
            "nomCanonique": "Travaux des commissions",
            "libelleCourt": "Travaux des commissions"
          },
          "organeRef": "PO717460",
          "actesLegislatifs": [
            {
              "xsiType": "Etape_Type",
              "uid": "L15-VD190849CF",
              "codeActe": "ANLUNI-COM-FOND",
              "libelleActe": {
                "nomCanonique": "Travaux de la commission saisie au fond",
                "libelleCourt": "Travaux de la commission saisie au fond"
              },
              "organeRef": "PO59051",
              "actesLegislatifs": [
                {
                  "xsiType": "SaisieComFond_Type",
                  "uid": "L15-VD190849CFS",
                  "codeActe": "ANLUNI-COM-FOND-SAISIE",
                  "libelleActe": {
                    "nomCanonique": "Renvoi en commission au fond",
                    "libelleCourt": "Renvoi en commission au fond"
                  },
                  "organeRef": "PO59051",
                  "dateActe": "2019-10-01T00:00:00.000+02:00"
                }
              ]
            }
          ]
        }
      ]
    }
  ]
}