{
  "xsiType": "texteLoi_Type",
  "uid": "PIONANR5L15B2260",
  "legislature": "15",
  "cycleDeVie": {
    "chrono": {
      "dateCreation": "2019-09-18T00:00:00.000+02:00",
      "dateDepot": "2019-09-25T00:00:00.000+02:00",
      "datePublication": "2019-10-03T00:00:00.000+02:00",
      "datePublicationWeb": "2019-09-26T10:40:00.000+02:00"
    }
  },
  "denominationStructurelle": "Proposition de loi",
  "provenance": "Texte Déposé",
  "titres": {
    "titrePrincipal": "proposition de loi visant à intégrer une mission d'intérêt général dans la formation des jeunes au sein d'un nouveau dispositif appelé service civique universel",
    "titrePrincipalCourt": "nouveau service civique universel"
  },
  "dossierRef": "DLR5L15N37742",
  "classification": {
    "famille": {
      "depot": {
        "code": "INITDEP",
        "libelle": "Initiative en 1er Dépôt"
      },
      "classe": {
        "code": "PIONLOI",
        "libelle": "Proposition de loi"
      }
    },
    "type": {
      "code": "PION",
      "libelle": "Proposition de loi"
    }
  },
  "auteurs": [
    {
      "acteur": {
        "acteurRef": "PA720178",
        "qualite": "auteur"
      }
    }
  ],
  "notice": {
    "numNotice": "2260",
    "formule": "visant à intégrer une mission d'intérêt général dans la formation des jeunes au sein d'un nouveau dispositif appelé service civique universel",
    "adoptionConforme": false
  },
  "coSignataires": [
    {
      "acteurRef": "PA334654",
      "dateCosignature": "2019-09-25+02:00",
      "edite": false
    },
    {
      "acteurRef": "PA643134",
      "dateCosignature": "2019-09-25+02:00",
      "edite": false
    },
    {
      "acteurRef": "PA721506",
      "dateCosignature": "2019-09-25+02:00",
      "edite": false
    },
    {
      "acteurRef": "PA712015",
      "dateCosignature": "2019-09-25+02:00",
      "edite": false
    },
    {
      "acteurRef": "PA718850",
      "dateCosignature": "2019-09-25+02:00",
      "edite": false
    },
    {
      "acteurRef": "PA267429",
      "dateCosignature": "2019-09-25+02:00",
      "edite": false
    },
    {
      "acteurRef": "PA608016",
      "dateCosignature": "2019-09-25+02:00",
      "edite": false
    },
    {
      "acteurRef": "PA998",
      "dateCosignature": "2019-09-25+02:00",
      "edite": false
    },
    {
      "acteurRef": "PA718780",
      "dateCosignature": "2019-09-25+02:00",
      "edite": false
    },
    {
      "acteurRef": "PA605036",
      "dateCosignature": "2019-09-25+02:00",
      "edite": false
    },
    {
      "acteurRef": "PA767",
      "dateCosignature": "2019-09-25+02:00",
      "edite": false
    },
    {
      "acteurRef": "PA709315",
      "dateCosignature": "2019-09-25+02:00",
      "edite": false
    },
    {
      "acteurRef": "PA330788",
      "dateCosignature": "2019-09-25+02:00",
      "edite": false
    },
    {
      "acteurRef": "PA718784",
      "dateCosignature": "2019-09-25+02:00",
      "edite": false
    },
    {
      "acteurRef": "PA720684",
      "dateCosignature": "2019-09-25+02:00",
      "edite": false
    },
    {
      "acteurRef": "PA332523",
      "dateCosignature": "2019-09-25+02:00",
      "edite": false
    },
    {
      "acteurRef": "PA1029",
      "dateCosignature": "2019-09-25+02:00",
      "edite": false
    },
    {
      "acteurRef": "PA1327",
      "dateCosignature": "2019-09-25+02:00",
      "edite": false
    },
    {
      "acteurRef": "PA609245",
      "dateCosignature": "2019-09-25+02:00",
      "edite": false
    },
    {
      "acteurRef": "PA1012",
      "dateCosignature": "2019-09-25+02:00",
      "edite": false
    },
    {
      "acteurRef": "PA334149",
      "dateCosignature": "2019-09-25+02:00",
      "edite": false
    },
    {
      "acteurRef": "PA720210",
      "dateCosignature": "2019-09-25+02:00",
      "edite": false
    },
    {
      "acteurRef": "PA605991",
      "dateCosignature": "2019-09-25+02:00",
      "edite": false
    },
    {
      "acteurRef": "PA223837",
      "dateCosignature": "2019-09-25+02:00",
      "edite": false
    },
    {
      "acteurRef": "PA345722",
      "dateCosignature": "2019-09-25+02:00",
      "edite": false
    },
    {
      "acteurRef": "PA2529",
      "dateCosignature": "2019-09-25+02:00",
      "edite": false
    },
    {
      "acteurRef": "PA266774",
      "dateCosignature": "2019-09-25+02:00",
      "edite": false
    },
    {
      "acteurRef": "PA720586",
      "dateCosignature": "2019-09-25+02:00",
      "edite": false
    },
    {
      "acteurRef": "PA2796",
      "dateCosignature": "2019-09-25+02:00",
      "edite": false
    },
    {
      "acteurRef": "PA721678",
      "dateCosignature": "2019-09-25+02:00",
      "edite": false
    },
    {
      "acteurRef": "PA267260",
      "dateCosignature": "2019-09-25+02:00",
      "edite": false
    },
    {
      "acteurRef": "PA267527",
      "dateCosignature": "2019-09-25+02:00",
      "edite": false
    },
    {
      "acteurRef": "PA1630",
      "dateCosignature": "2019-09-25+02:00",
      "edite": false
    },
    {
      "acteurRef": "PA267735",
      "dateCosignature": "2019-09-25+02:00",
      "edite": false
    },
    {
      "acteurRef": "PA719318",
      "dateCosignature": "2019-09-25+02:00",
      "edite": false
    }
  ],
  "depotAmendements": {
    "amendementsSeance": {
      "amendable": false
    },
    "amendementsCommission": [
      {
        "organeRef": "PO419604",
        "amendable": true
      }
    ]
  }
}