{
  "xsiType": "texteLoi_Type",
  "uid": "PRJLSNR5S319B0248",
  "cycleDeVie": {
    "chrono": {
      "dateCreation": "2019-01-31T00:00:00.000+01:00",
      "dateDepot": "2019-01-16T00:00:00.000+01:00"
    }
  },
  "denominationStructurelle": "Projet de loi",
  "provenance": "Texte Déposé",
  "titres": {
    "titrePrincipal": "projet de loi ratifiant l’ordonnance n° 2018-937 du 30 octobre 2018 visant à faciliter la réalisation de projets de construction et à favoriser l'innovation",
    "titrePrincipalCourt": "Projets de construction et innovation"
  },
  "dossierRef": "DLR5L15N37201",
  "classification": {
    "famille": {
      "depot": {
        "code": "INITDEP",
        "libelle": "Initiative en 1er Dépôt"
      },
      "classe": {
        "code": "PRJLOI",
        "libelle": "Projet de loi"
      }
    },
    "type": {
      "code": "PRJL",
      "libelle": "Projet de loi"
    }
  },
  "auteurs": [
    {
      "acteur": {
        "acteurRef": "PA345619",
        "qualite": "auteur"
      }
    }
  ],
  "notice": {
    "numNotice": "248",
    "formule": "ratifiant l’ordonnance n° 2018-937 du 30 octobre 2018 visant à faciliter la réalisation de projets de construction et à favoriser l'innovation",
    "adoptionConforme": false
  },
  "coSignataires": [
    {
      "acteurRef": "PA332747",
      "dateCosignature": "2019-01-16+01:00",
      "edite": true
    },
    {
      "acteurRef": "PA227076",
      "dateCosignature": "2019-01-16+01:00",
      "edite": true
    }
  ],
  "depotAmendements": {
    "amendementsSeance": {
      "amendable": false
    }
  }
}