{
  "xsiType": "DossierLegislatif_Type",
  "uid": "DLR5L15N36396",
  "legislature": "15",
  "titreDossier": {
    "titre": "Exonération fiscale et sociale des heures supplémentaires",
    "titreChemin": "exoneration_fiscale_sociale_heures_supplementaires"
  },
  "procedureParlementaire": {
    "code": "2",
    "libelle": "Proposition de loi ordinaire"
  },
  "initiateur": {
    "acteurs": [
      {
        "acteurRef": "PA712015",
        "mandatRef": "PM722448"
      }
    ]
  },
  "actesLegislatifs": [
    {
      "xsiType": "Etape_Type",
      "uid": "L15-AN1-36396",
      "codeActe": "AN1",
      "libelleActe": {
        "nomCanonique": "1ère lecture (1ère assemblée saisie)",
        "libelleCourt": "1ère lecture"
      },
      "organeRef": "PO717460",
      "actesLegislatifs": [
        {
          "xsiType": "DepotInitiative_Type",
          "uid": "L15-VD184670DI",
          "codeActe": "AN1-DEPOT",
          "libelleActe": {
            "nomCanonique": "1er dépôt d'une initiative.",
            "libelleCourt": "1er dépôt d'une initiative."
          },
          "organeRef": "PO717460",
          "dateActe": "2018-02-21T00:00:00.000+01:00",
          "texteAssocieRef": "PIONANR5L15B0702"
        },
        {
          "xsiType": "Etape_Type",
          "uid": "L15-AN1-COM-36396",
          "codeActe": "AN1-COM",
          "libelleActe": {
            "nomCanonique": "Travaux des commissions",
            "libelleCourt": "Travaux des commissions"
          },
          "organeRef": "PO717460",
          "actesLegislatifs": [
            {
              "xsiType": "Etape_Type",
              "uid": "L15-VD184671CF",
              "codeActe": "AN1-COM-FOND",
              "libelleActe": {
                "nomCanonique": "Travaux de la commission saisie au fond",
                "libelleCourt": "Travaux de la commission saisie au fond"
              },
              "organeRef": "PO420120",
              "actesLegislatifs": [
                {
                  "xsiType": "SaisieComFond_Type",
                  "uid": "L15-VD184671CFS",
                  "codeActe": "AN1-COM-FOND-SAISIE",
                  "libelleActe": {
                    "nomCanonique": "Renvoi en commission au fond",
                    "libelleCourt": "Renvoi en commission au fond"
                  },
                  "organeRef": "PO420120",
                  "dateActe": "2018-02-21T00:00:00.000+01:00"
                },
                {
                  "xsiType": "NominRapporteurs_Type",
                  "uid": "L15-VD184773",
                  "codeActe": "AN1-COM-FOND-NOMIN",
                  "libelleActe": {
                    "nomCanonique": "Nomination de rapporteur",
                    "libelleCourt": "Nomination de rapporteur"
                  },
                  "organeRef": "PO420120",
                  "dateActe": "2018-03-07T00:00:00.000+01:00",
                  "rapporteurs": [
                    {
                      "acteurRef": "PA712015",
                      "typeRapporteur": "rapporteur"
                    }
                  ]
                },
                {
                  "xsiType": "DiscussionCommission_Type",
                  "uid": "L15-VD184774R25499",
                  "codeActe": "AN1-COM-FOND-REUNION",
                  "libelleActe": {
                    "nomCanonique": "Réunion de commission",
                    "libelleCourt": "Réunion de commission"
                  },
                  "organeRef": "PO420120",
                  "dateActe": "2018-03-07T09:30:00.000+01:00",
                  "odjRef": "RUANR5L15S2018IDC428548PT25499",
                  "reunionRef": "RUANR5L15S2018IDC428548"
                },
                {
                  "xsiType": "DiscussionCommission_Type",
                  "uid": "L15-VD184774R25564",
                  "codeActe": "AN1-COM-FOND-REUNION",
                  "libelleActe": {
                    "nomCanonique": "Réunion de commission",
                    "libelleCourt": "Réunion de commission"
                  },
                  "organeRef": "PO420120",
                  "dateActe": "2018-03-28T08:30:00.000+02:00",
                  "odjRef": "RUANR5L15S2018IDC428695PT25564",
                  "reunionRef": "RUANR5L15S2018IDC428695"
                },
                {
                  "xsiType": "DiscussionCommission_Type",
                  "uid": "L15-VD184774R25516",
                  "codeActe": "AN1-COM-FOND-REUNION",
                  "libelleActe": {
                    "nomCanonique": "Réunion de commission",
                    "libelleCourt": "Réunion de commission"
                  },
                  "organeRef": "PO420120",
                  "dateActe": "2018-04-05T09:00:00.000+02:00",
                  "odjRef": "RUANR5L15S2018IDC428807PT25516",
                  "reunionRef": "RUANR5L15S2018IDC428807"
                },
                {
                  "xsiType": "DepotRapport_Type",
                  "uid": "L15-VD185086",
                  "codeActe": "AN1-COM-FOND-RAPPORT",
                  "libelleActe": {
                    "nomCanonique": "Dépôt de rapport",
                    "libelleCourt": "Dépôt de rapport"
                  },
                  "organeRef": "PO420120",
                  "dateActe": "2018-03-28T00:00:00.000+02:00",
                  "texteAssocieRef": "RAPPANR5L15B0817"
                }
              ]
            }
          ]
        },
        {
          "xsiType": "Etape_Type",
          "uid": "L15-AN1-DEBATS-36396",
          "codeActe": "AN1-DEBATS",
          "libelleActe": {
            "nomCanonique": "Discussion en séance publique",
            "libelleCourt": "Discussion en séance publique"
          },
          "organeRef": "PO717460",
          "actesLegislatifs": [
            {
              "xsiType": "DiscussionSeancePublique_Type",
              "uid": "L15-VD184856S35742",
              "codeActe": "AN1-DEBATS-SEANCE",
              "libelleActe": {
                "nomCanonique": "Discussion en séance publique",
                "libelleCourt": "Discussion en séance publique"
              },
              "organeRef": "PO717460",
              "dateActe": "2018-04-05T00:00:00.000+02:00",
              "odjRef": "RUANR5L15S2018IDS20986PT35742",
              "reunionRef": "RUANR5L15S2018IDS20986"
            },
            {
              "xsiType": "MotionProcedure_Type",
              "uid": "L15-VD185187",
              "codeActe": "AN1-DEBATS-MOTION",
              "libelleActe": {
                "nomCanonique": "Motion de procédure",
                "libelleCourt": "Motion de procédure"
              },
              "organeRef": "PO717460",
              "dateActe": "2018-04-05T00:00:00.000+02:00",
              "auteurMotion": "PA606171",
              "typeMotion": {
                "famCode": "TMP03",
                "libelle": "Motions de renvoi en commission"
              }
            },
            {
              "xsiType": "Decision_Type",
              "uid": "L15-VD185187DEC",
              "codeActe": "AN1-DEBATS-MOTION-VOTE",
              "libelleActe": {
                "nomCanonique": "Décision",
                "libelleCourt": "Décision"
              },
              "organeRef": "PO717460",
              "dateActe": "2018-04-05T00:00:00.000+02:00",
              "statutConclusion": {
                "famCode": "TSORTMOT01",
                "libelle": "Motion adopté(e)"
              }
            }
          ]
        }
      ]
    }
  ]
}