{
  "xsiType": "rapportParlementaire_Type",
  "uid": "RAPPANR5L15B0093",
  "legislature": "15",
  "cycleDeVie": {
    "chrono": {
      "dateCreation": "2017-07-12T00:00:00.000+02:00",
      "dateDepot": "2017-07-12T00:00:00.000+02:00",
      "datePublication": "2017-07-18T00:00:00.000+02:00",
      "datePublicationWeb": "2017-07-13T23:45:00.000+02:00"
    }
  },
  "denominationStructurelle": "Rapport",
  "provenance": "Commission",
  "titres": {
    "titrePrincipal": "rapport sur le projet de loi, après engagement de la procédure accélérée, ratifiant l’ordonnance n° 2017-31 du 12 janvier 2017 de mise en cohérence des textes au regard des dispositions de la loi n° 2016-41 du 26 janvier 2016 de modernisation de notre système de santé (n°6).",
    "titrePrincipalCourt": "rapport sur le projet de loi, après engagement de la procédure accélérée, ratifiant l’ordonnance n° 2017-31 du 12 janvier 2017 de mise en cohérence des textes au regard des dispositions de la loi n° 2016-41 du 26 janvier 2016 de modernisation de notre système de santé (n°6)."
  },
  "dossierRef": "DLR5L15N35848",
  "classification": {
    "famille": {
      "depot": {
        "code": "RAPINIT",
        "libelle": "Rapport sur une initiative"
      },
      "classe": {
        "code": "RAPPORT",
        "libelle": "Rapport"
      }
    },
    "type": {
      "code": "RAPP",
      "libelle": "Rapport"
    },
    "statutAdoption": "ADOPTCOM"
  },
  "auteurs": [
    {
      "acteur": {
        "acteurRef": "PA719350",
        "qualite": "rapporteur"
      }
    },
    {
      "organeRef": "PO420120"
    }
  ],
  "notice": {
    "numNotice": "93",
    "formule": "sur le projet de loi, après engagement de la procédure accélérée, ratifiant l’ordonnance n° 2017-31 du 12 janvier 2017 de mise en cohérence des textes au regard des dispositions de la loi n° 2016-41 du 26 janvier 2016 de modernisation de notre système de santé (n°6).",
    "adoptionConforme": false
  },
  "imprimerie": {
    "prix": "1.5"
  }
}