{
  "xsiType": "DossierMissionControle_Type",
  "uid": "DLR5L15N37869",
  "legislature": "15",
  "titreDossier": {
    "titre": "Soudures de l'EPR de Flamanville",
    "titreChemin": "soudures_epr_flamanville"
  },
  "procedureParlementaire": {
    "code": "19",
    "libelle": "Rapport d'information sans mission"
  },
  "actesLegislatifs": [
    {
      "xsiType": "Etape_Type",
      "uid": "L15-AN20-37869",
      "codeActe": "AN20",
      "libelleActe": {
        "nomCanonique": "Travaux"
      },
      "organeRef": "PO717460",
      "actesLegislatifs": [
        {
          "xsiType": "DepotRapport_Type",
          "uid": "L15-VD191073",
          "codeActe": "AN20-RAPPORT",
          "libelleActe": {
            "nomCanonique": "Dépôt de rapport",
            "libelleCourt": "Dépôt de rapport"
          },
          "organeRef": "PO273589",
          "dateActe": "2019-10-16T00:00:00.000+02:00",
          "texteAssocieRef": "RAPPANR5L15B2313"
        }
      ]
    }
  ]
}