{
  "xsiType": "texteLoi_Type",
  "uid": "PIONANR5L15B2256",
  "legislature": "15",
  "cycleDeVie": {
    "chrono": {
      "dateCreation": "2019-09-18T00:00:00.000+02:00",
      "dateDepot": "2019-09-25T00:00:00.000+02:00",
      "datePublication": "2019-10-03T00:00:00.000+02:00",
      "datePublicationWeb": "2019-09-26T10:20:00.000+02:00"
    }
  },
  "denominationStructurelle": "Proposition de loi",
  "provenance": "Texte Déposé",
  "titres": {
    "titrePrincipal": "proposition de loi visant à établir une journée nationale d'hommage aux soldats de la quatrième génération du feu",
    "titrePrincipalCourt": "journée hommage soldats quatrième génération du feu"
  },
  "dossierRef": "DLR5L15N37739",
  "classification": {
    "famille": {
      "depot": {
        "code": "INITDEP",
        "libelle": "Initiative en 1er Dépôt"
      },
      "classe": {
        "code": "PIONLOI",
        "libelle": "Proposition de loi"
      }
    },
    "type": {
      "code": "PION",
      "libelle": "Proposition de loi"
    }
  },
  "auteurs": [
    {
      "acteur": {
        "acteurRef": "PA718850",
        "qualite": "auteur"
      }
    }
  ],
  "notice": {
    "numNotice": "2256",
    "formule": "visant à établir une journée nationale d'hommage aux soldats de la quatrième génération du feu",
    "adoptionConforme": false
  },
  "coSignataires": [
    {
      "acteurRef": "PA719318",
      "dateCosignature": "2019-09-25+02:00",
      "edite": false
    },
    {
      "acteurRef": "PA720210",
      "dateCosignature": "2019-09-25+02:00",
      "edite": false
    },
    {
      "acteurRef": "PA223837",
      "dateCosignature": "2019-09-25+02:00",
      "edite": false
    },
    {
      "acteurRef": "PA267429",
      "dateCosignature": "2019-09-25+02:00",
      "edite": false
    },
    {
      "acteurRef": "PA722390",
      "dateCosignature": "2019-09-25+02:00",
      "edite": false
    },
    {
      "acteurRef": "PA998",
      "dateCosignature": "2019-09-25+02:00",
      "edite": false
    },
    {
      "acteurRef": "PA720386",
      "dateCosignature": "2019-09-25+02:00",
      "edite": false
    },
    {
      "acteurRef": "PA712015",
      "dateCosignature": "2019-09-25+02:00",
      "edite": false
    },
    {
      "acteurRef": "PA608826",
      "dateCosignature": "2019-09-25+02:00",
      "edite": false
    },
    {
      "acteurRef": "PA720684",
      "dateCosignature": "2019-09-25+02:00",
      "edite": false
    },
    {
      "acteurRef": "PA334149",
      "dateCosignature": "2019-09-25+02:00",
      "edite": false
    },
    {
      "acteurRef": "PA643103",
      "dateCosignature": "2019-09-25+02:00",
      "edite": false
    },
    {
      "acteurRef": "PA1327",
      "dateCosignature": "2019-09-25+02:00",
      "edite": false
    },
    {
      "acteurRef": "PA266774",
      "dateCosignature": "2019-09-25+02:00",
      "edite": false
    },
    {
      "acteurRef": "PA267735",
      "dateCosignature": "2019-09-25+02:00",
      "edite": false
    },
    {
      "acteurRef": "PA605991",
      "dateCosignature": "2019-09-25+02:00",
      "edite": false
    },
    {
      "acteurRef": "PA267318",
      "dateCosignature": "2019-09-25+02:00",
      "edite": false
    },
    {
      "acteurRef": "PA608016",
      "dateCosignature": "2019-09-25+02:00",
      "edite": false
    },
    {
      "acteurRef": "PA606712",
      "dateCosignature": "2019-09-25+02:00",
      "edite": false
    },
    {
      "acteurRef": "PA718784",
      "dateCosignature": "2019-09-25+02:00",
      "edite": false
    },
    {
      "acteurRef": "PA2377",
      "dateCosignature": "2019-09-25+02:00",
      "edite": false
    },
    {
      "acteurRef": "PA2492",
      "dateCosignature": "2019-09-25+02:00",
      "edite": false
    },
    {
      "acteurRef": "PA721286",
      "dateCosignature": "2019-09-25+02:00",
      "edite": false
    },
    {
      "acteurRef": "PA721070",
      "dateCosignature": "2019-09-25+02:00",
      "edite": false
    },
    {
      "acteurRef": "PA721678",
      "dateCosignature": "2019-09-25+02:00",
      "edite": false
    },
    {
      "acteurRef": "PA2529",
      "dateCosignature": "2019-09-25+02:00",
      "edite": false
    },
    {
      "acteurRef": "PA267527",
      "dateCosignature": "2019-09-25+02:00",
      "edite": false
    },
    {
      "acteurRef": "PA721314",
      "dateCosignature": "2019-09-25+02:00",
      "edite": false
    },
    {
      "acteurRef": "PA267794",
      "dateCosignature": "2019-09-25+02:00",
      "edite": false
    },
    {
      "acteurRef": "PA643134",
      "dateCosignature": "2019-09-25+02:00",
      "edite": false
    },
    {
      "acteurRef": "PA709315",
      "dateCosignature": "2019-09-25+02:00",
      "edite": false
    },
    {
      "acteurRef": "PA605036",
      "dateCosignature": "2019-09-25+02:00",
      "edite": false
    },
    {
      "acteurRef": "PA642847",
      "dateCosignature": "2019-09-25+02:00",
      "edite": false
    },
    {
      "acteurRef": "PA721410",
      "dateCosignature": "2019-09-25+02:00",
      "edite": false
    },
    {
      "acteurRef": "PA330684",
      "dateCosignature": "2019-09-25+02:00",
      "edite": false
    },
    {
      "acteurRef": "PA767",
      "dateCosignature": "2019-09-25+02:00",
      "edite": false
    },
    {
      "acteurRef": "PA267440",
      "dateCosignature": "2019-09-25+02:00",
      "edite": false
    },
    {
      "acteurRef": "PA267289",
      "dateCosignature": "2019-09-25+02:00",
      "edite": false
    },
    {
      "acteurRef": "PA342935",
      "dateCosignature": "2019-09-25+02:00",
      "edite": false
    },
    {
      "acteurRef": "PA267901",
      "dateCosignature": "2019-09-25+02:00",
      "edite": false
    },
    {
      "acteurRef": "PA721506",
      "dateCosignature": "2019-09-25+02:00",
      "edite": false
    },
    {
      "acteurRef": "PA1874",
      "dateCosignature": "2019-09-25+02:00",
      "edite": false
    },
    {
      "acteurRef": "PA340853",
      "dateCosignature": "2019-09-25+02:00",
      "edite": false
    },
    {
      "acteurRef": "PA721636",
      "dateCosignature": "2019-09-25+02:00",
      "edite": false
    },
    {
      "acteurRef": "PA267204",
      "dateCosignature": "2019-09-25+02:00",
      "edite": false
    },
    {
      "acteurRef": "PA718780",
      "dateCosignature": "2019-09-25+02:00",
      "edite": false
    },
    {
      "acteurRef": "PA720586",
      "dateCosignature": "2019-09-25+02:00",
      "edite": false
    },
    {
      "acteurRef": "PA334843",
      "dateCosignature": "2019-09-25+02:00",
      "edite": false
    }
  ],
  "depotAmendements": {
    "amendementsSeance": {
      "amendable": false
    },
    "amendementsCommission": [
      {
        "organeRef": "PO59046",
        "amendable": true
      }
    ]
  }
}