{
  "xsiType": "rapportParlementaire_Type",
  "uid": "RAPPSNR5S299B0734",
  "cycleDeVie": {
    "chrono": {
      "dateCreation": "2018-10-01T00:00:00.000+02:00",
      "dateDepot": "2018-09-26T00:00:00.000+02:00"
    }
  },
  "denominationStructurelle": "Rapport",
  "provenance": "Commission",
  "titres": {
    "titrePrincipal": "rapport , en nouvelle lecture, les dispositions restant en discussion sur de la proposition de loi organique rejetée par le Sénat, relative à la lutte contre la manipulation de l'information (n°1218).",
    "titrePrincipalCourt": "rapport , en nouvelle lecture, les dispositions restant en discussion sur de la proposition de loi organique rejetée par le Sénat, relative à la lutte contre la manipulation de l'information (n°1218)."
  },
  "dossierRef": "DLR5L15N36468",
  "classification": {
    "famille": {
      "depot": {
        "code": "RAPINIT",
        "libelle": "Rapport sur une initiative"
      },
      "classe": {
        "code": "RAPPORT",
        "libelle": "Rapport"
      }
    },
    "type": {
      "code": "RAPP",
      "libelle": "Rapport"
    }
  },
  "auteurs": [
    {
      "acteur": {
        "acteurRef": "PA429858",
        "qualite": "rapporteur"
      }
    },
    {
      "organeRef": "PO758368"
    }
  ],
  "notice": {
    "numNotice": "734",
    "formule": ", en nouvelle lecture, les dispositions restant en discussion sur de la proposition de loi organique rejetée par le Sénat, relative à la lutte contre la manipulation de l'information (n°1218).",
    "adoptionConforme": false
  }
}