{
  "xsiType": "texteLoi_Type",
  "uid": "PNREANR5L15B1458",
  "legislature": "15",
  "cycleDeVie": {
    "chrono": {
      "dateCreation": "2018-12-04T00:00:00.000+01:00",
      "dateDepot": "2018-12-04T00:00:00.000+01:00",
      "datePublication": "2018-12-26T00:00:00.000+01:00",
      "datePublicationWeb": "2018-12-20T15:25:00.000+01:00"
    }
  },
  "denominationStructurelle": "Proposition de résolution",
  "provenance": "Texte Déposé",
  "titres": {
    "titrePrincipal": "proposition de résolution visant à instituer une journée de sensibilisation au don de moelle osseuse, sur les lieux de travail et dans les établissements d’enseignement supérieur",
    "titrePrincipalCourt": "Journée de sensibilisation au don de moelle osseuse"
  },
  "dossierRef": "DLR5L15N37054",
  "classification": {
    "famille": {
      "depot": {
        "code": "INITDEP",
        "libelle": "Initiative en 1er Dépôt"
      },
      "classe": {
        "code": "PIONRES",
        "libelle": "Proposition de résolution"
      },
      "espece": {
        "code": "APPART341",
        "libelle": "en application de Article 34-1 de la Constitution"
      }
    },
    "type": {
      "code": "PNRE",
      "libelle": "Proposition de résolution"
    },
    "sousType": {
      "code": "APPART341",
      "libelle": "en application de Article 34-1 de la Constitution"
    }
  },
  "auteurs": [
    {
      "acteur": {
        "acteurRef": "PA643103",
        "qualite": "auteur"
      }
    }
  ],
  "notice": {
    "numNotice": "1458",
    "formule": "visant à instituer une journée de sensibilisation au don de moelle osseuse, sur les lieux de travail et dans les établissements d’enseignement supérieur",
    "adoptionConforme": false
  },
  "coSignataires": [
    {
      "acteurRef": "PA713448",
      "dateCosignature": "2018-12-04+01:00",
      "edite": false
    },
    {
      "acteurRef": "PA266808",
      "dateCosignature": "2018-12-04+01:00",
      "edite": false
    },
    {
      "acteurRef": "PA606712",
      "dateCosignature": "2018-12-04+01:00",
      "edite": false
    },
    {
      "acteurRef": "PA267318",
      "dateCosignature": "2018-12-04+01:00",
      "edite": false
    },
    {
      "acteurRef": "PA718884",
      "dateCosignature": "2018-12-04+01:00",
      "edite": false
    },
    {
      "acteurRef": "PA267527",
      "dateCosignature": "2018-12-04+01:00",
      "edite": false
    },
    {
      "acteurRef": "PA266797",
      "dateCosignature": "2018-12-04+01:00",
      "edite": false
    },
    {
      "acteurRef": "PA2529",
      "dateCosignature": "2018-12-04+01:00",
      "edite": false
    },
    {
      "acteurRef": "PA1630",
      "dateCosignature": "2018-12-04+01:00",
      "edite": false
    },
    {
      "acteurRef": "PA722390",
      "dateCosignature": "2018-12-04+01:00",
      "edite": false
    },
    {
      "acteurRef": "PA721636",
      "dateCosignature": "2018-12-04+01:00",
      "edite": false
    },
    {
      "acteurRef": "PA267204",
      "dateCosignature": "2018-12-04+01:00",
      "edite": false
    },
    {
      "acteurRef": "PA721046",
      "dateCosignature": "2018-12-04+01:00",
      "edite": false
    },
    {
      "acteurRef": "PA718838",
      "dateCosignature": "2018-12-04+01:00",
      "edite": false
    },
    {
      "acteurRef": "PA2377",
      "dateCosignature": "2018-12-04+01:00",
      "edite": false
    },
    {
      "acteurRef": "PA721070",
      "dateCosignature": "2018-12-04+01:00",
      "edite": false
    },
    {
      "acteurRef": "PA721816",
      "dateCosignature": "2018-12-04+01:00",
      "edite": false
    },
    {
      "acteurRef": "PA767",
      "dateCosignature": "2018-12-04+01:00",
      "edite": false
    },
    {
      "acteurRef": "PA1029",
      "dateCosignature": "2018-12-04+01:00",
      "edite": false
    },
    {
      "acteurRef": "PA720386",
      "dateCosignature": "2018-12-04+01:00",
      "edite": false
    },
    {
      "acteurRef": "PA718850",
      "dateCosignature": "2018-12-04+01:00",
      "edite": false
    },
    {
      "acteurRef": "PA267429",
      "dateCosignature": "2018-12-04+01:00",
      "edite": false
    },
    {
      "acteurRef": "PA1874",
      "dateCosignature": "2018-12-04+01:00",
      "edite": false
    },
    {
      "acteurRef": "PA608016",
      "dateCosignature": "2018-12-04+01:00",
      "edite": false
    },
    {
      "acteurRef": "PA608416",
      "dateCosignature": "2018-12-04+01:00",
      "edite": false
    },
    {
      "acteurRef": "PA721968",
      "dateCosignature": "2018-12-04+01:00",
      "edite": false
    },
    {
      "acteurRef": "PA643089",
      "dateCosignature": "2018-12-04+01:00",
      "edite": false
    },
    {
      "acteurRef": "PA718780",
      "dateCosignature": "2018-12-04+01:00",
      "edite": false
    },
    {
      "acteurRef": "PA720644",
      "dateCosignature": "2018-12-04+01:00",
      "edite": false
    },
    {
      "acteurRef": "PA643134",
      "dateCosignature": "2018-12-04+01:00",
      "edite": false
    },
    {
      "acteurRef": "PA721286",
      "dateCosignature": "2018-12-04+01:00",
      "edite": false
    },
    {
      "acteurRef": "PA720210",
      "dateCosignature": "2018-12-04+01:00",
      "edite": false
    },
    {
      "acteurRef": "PA609245",
      "dateCosignature": "2018-12-04+01:00",
      "edite": false
    },
    {
      "acteurRef": "PA330909",
      "dateCosignature": "2018-12-04+01:00",
      "edite": false
    },
    {
      "acteurRef": "PA267324",
      "dateCosignature": "2018-12-04+01:00",
      "edite": false
    },
    {
      "acteurRef": "PA330788",
      "dateCosignature": "2018-12-04+01:00",
      "edite": false
    },
    {
      "acteurRef": "PA720630",
      "dateCosignature": "2018-12-04+01:00",
      "edite": false
    },
    {
      "acteurRef": "PA605991",
      "dateCosignature": "2018-12-04+01:00",
      "edite": false
    }
  ]
}