{
  "xsiType": "texteLoi_Type",
  "uid": "PIONANR5L15B2324",
  "legislature": "15",
  "cycleDeVie": {
    "chrono": {
      "dateCreation": "2019-10-07T00:00:00.000+02:00",
      "dateDepot": "2019-10-16T00:00:00.000+02:00",
      "datePublication": "2019-10-23T00:00:00.000+02:00",
      "datePublicationWeb": "2019-10-17T12:00:00.000+02:00"
    }
  },
  "denominationStructurelle": "Proposition de loi",
  "provenance": "Texte Déposé",
  "titres": {
    "titrePrincipal": "proposition de loi visant à développer les constructions de logements sociaux locatifs dans les territoires pauvres",
    "titrePrincipalCourt": "développer les logements sociaux dans les territoires pauvres"
  },
  "dossierRef": "DLR5L15N37810",
  "classification": {
    "famille": {
      "depot": {
        "code": "INITDEP",
        "libelle": "Initiative en 1er Dépôt"
      },
      "classe": {
        "code": "PIONLOI",
        "libelle": "Proposition de loi"
      }
    },
    "type": {
      "code": "PION",
      "libelle": "Proposition de loi"
    }
  },
  "auteurs": [
    {
      "acteur": {
        "acteurRef": "PA720684",
        "qualite": "auteur"
      }
    }
  ],
  "notice": {
    "numNotice": "2324",
    "formule": "visant à développer les constructions de logements sociaux locatifs dans les territoires pauvres",
    "adoptionConforme": false
  },
  "coSignataires": [
    {
      "acteurRef": "PA267204",
      "dateCosignature": "2019-10-16+02:00",
      "edite": false
    },
    {
      "acteurRef": "PA267450",
      "dateCosignature": "2019-10-16+02:00",
      "edite": false
    },
    {
      "acteurRef": "PA718850",
      "dateCosignature": "2019-10-16+02:00",
      "edite": false
    },
    {
      "acteurRef": "PA267429",
      "dateCosignature": "2019-10-16+02:00",
      "edite": false
    },
    {
      "acteurRef": "PA2377",
      "dateCosignature": "2019-10-16+02:00",
      "edite": false
    },
    {
      "acteurRef": "PA1327",
      "dateCosignature": "2019-10-16+02:00",
      "edite": false
    },
    {
      "acteurRef": "PA608826",
      "dateCosignature": "2019-10-16+02:00",
      "edite": false
    },
    {
      "acteurRef": "PA721314",
      "dateCosignature": "2019-10-16+02:00",
      "edite": false
    },
    {
      "acteurRef": "PA340853",
      "dateCosignature": "2019-10-16+02:00",
      "edite": false
    },
    {
      "acteurRef": "PA2492",
      "dateCosignature": "2019-10-16+02:00",
      "edite": false
    },
    {
      "acteurRef": "PA719946",
      "dateCosignature": "2019-10-16+02:00",
      "edite": false
    },
    {
      "acteurRef": "PA267260",
      "dateCosignature": "2019-10-16+02:00",
      "edite": false
    },
    {
      "acteurRef": "PA2529",
      "dateCosignature": "2019-10-16+02:00",
      "edite": false
    },
    {
      "acteurRef": "PA267735",
      "dateCosignature": "2019-10-16+02:00",
      "edite": false
    },
    {
      "acteurRef": "PA267527",
      "dateCosignature": "2019-10-16+02:00",
      "edite": false
    }
  ],
  "depotAmendements": {
    "amendementsSeance": {
      "amendable": false
    },
    "amendementsCommission": [
      {
        "organeRef": "PO419610",
        "amendable": true
      }
    ]
  }
}