{
  "xsiType": "texteLoi_Type",
  "uid": "PRJLSNR5S279B0693",
  "cycleDeVie": {
    "chrono": {
      "dateCreation": "2017-07-31T00:00:00.000+02:00",
      "dateDepot": "2017-07-29T00:00:00.000+02:00"
    }
  },
  "denominationStructurelle": "Projet de loi",
  "provenance": "Texte Déposé",
  "titres": {
    "titrePrincipal": "projet de loi organique pour la confiance dans la vie politique",
    "titrePrincipalCourt": "Confiance dans la vie politique (loi organique)"
  },
  "dossierRef": "DLR5L15N35824",
  "classification": {
    "famille": {
      "depot": {
        "code": "INITNAV",
        "libelle": "Initiative en Navette"
      },
      "classe": {
        "code": "PRJLOI",
        "libelle": "Projet de loi"
      },
      "espece": {
        "code": "ORG",
        "libelle": "organique"
      }
    },
    "type": {
      "code": "PRJL",
      "libelle": "Projet de loi"
    },
    "sousType": {
      "code": "ORG",
      "libelle": "organique",
      "libelleEdition": "organique"
    }
  },
  "auteurs": [
    {
      "organeRef": "PO78718"
    }
  ],
  "notice": {
    "numNotice": "693",
    "formule": ", modifié, par l'Assemblée nationale, pour la confiance dans la vie politique",
    "adoptionConforme": false
  },
  "depotAmendements": {
    "amendementsSeance": {
      "amendable": false
    }
  }
}