{
  "xsiType": "rapportParlementaire_Type",
  "uid": "RAPPANR5L15B0684",
  "legislature": "15",
  "cycleDeVie": {
    "chrono": {
      "dateCreation": "2018-02-21T00:00:00.000+01:00",
      "dateDepot": "2018-02-21T00:00:00.000+01:00",
      "datePublication": "2018-03-01T00:00:00.000+01:00",
      "datePublicationWeb": "2018-02-27T14:45:00.000+01:00"
    }
  },
  "denominationStructurelle": "Rapport",
  "provenance": "Commission",
  "titres": {
    "titrePrincipal": "rapport sur la proposition de résolution européenne de M. Thierry Michels, rapporteur de la commission des affaires européennes sur la transition énergétique dans l'Union européenne (n°597).",
    "titrePrincipalCourt": "rapport sur la proposition de résolution européenne de M. Thierry Michels, rapporteur de la commission des affaires européennes sur la transition énergétique dans l'Union européenne (n°597)."
  },
  "dossierRef": "DLR5L15N36311",
  "classification": {
    "famille": {
      "depot": {
        "code": "RAPINIT",
        "libelle": "Rapport sur une initiative"
      },
      "classe": {
        "code": "RAPPORT",
        "libelle": "Rapport"
      }
    },
    "type": {
      "code": "RAPP",
      "libelle": "Rapport"
    },
    "statutAdoption": "ADOPTCOM"
  },
  "auteurs": [
    {
      "acteur": {
        "acteurRef": "PA720738",
        "qualite": "rapporteur"
      }
    },
    {
      "organeRef": "PO419865"
    }
  ],
  "notice": {
    "numNotice": "684",
    "formule": "sur la proposition de résolution européenne de M. Thierry Michels, rapporteur de la commission des affaires européennes sur la transition énergétique dans l'Union européenne (n°597).",
    "adoptionConforme": false
  },
  "imprimerie": {
    "prix": "1.5"
  }
}