{
  "xsiType": "texteLoi_Type",
  "uid": "PIONSNR5S319B0259",
  "cycleDeVie": {
    "chrono": {
      "dateCreation": "2019-02-07T00:00:00.000+01:00",
      "dateDepot": "2019-01-22T00:00:00.000+01:00"
    }
  },
  "denominationStructurelle": "Proposition de loi",
  "provenance": "Texte Déposé",
  "titres": {
    "titrePrincipal": "proposition de loi visant à interdire l'usage des lanceurs de balles de défense dans le cadre du maintien de l'ordre et à engager une réflexion sur les stratégies de désescalade et les alternatives pacifiques possibles à l'emploi de la force publique dans ce cadre",
    "titrePrincipalCourt": "Interdiction de l'usage des LBD pour le maintien de l'ordre"
  },
  "dossierRef": "DLR5L15N37228",
  "classification": {
    "famille": {
      "depot": {
        "code": "INITDEP",
        "libelle": "Initiative en 1er Dépôt"
      },
      "classe": {
        "code": "PIONLOI",
        "libelle": "Proposition de loi"
      }
    },
    "type": {
      "code": "PION",
      "libelle": "Proposition de loi"
    }
  },
  "auteurs": [
    {
      "acteur": {
        "acteurRef": "PA304082",
        "qualite": "auteur"
      }
    }
  ],
  "notice": {
    "numNotice": "259",
    "formule": "visant à interdire l'usage des lanceurs de balles de défense dans le cadre du maintien de l'ordre et à engager une réflexion sur les stratégies de désescalade et les alternatives pacifiques possibles à l'emploi de la force publique dans ce cadre",
    "adoptionConforme": false
  },
  "coSignataires": [
    {
      "acteurRef": "PA757676",
      "dateCosignature": "2019-01-22+01:00",
      "edite": false
    },
    {
      "acteurRef": "PA429891",
      "dateCosignature": "2019-01-22+01:00",
      "edite": false
    },
    {
      "acteurRef": "PA429894",
      "dateCosignature": "2019-01-22+01:00",
      "edite": false
    },
    {
      "acteurRef": "PA756685",
      "dateCosignature": "2019-01-22+01:00",
      "edite": false
    },
    {
      "acteurRef": "PA429836",
      "dateCosignature": "2019-01-22+01:00",
      "edite": false
    },
    {
      "acteurRef": "PA304071",
      "dateCosignature": "2019-01-22+01:00",
      "edite": false
    },
    {
      "acteurRef": "PA429886",
      "dateCosignature": "2019-01-22+01:00",
      "edite": false
    },
    {
      "acteurRef": "PA736195",
      "dateCosignature": "2019-01-22+01:00",
      "edite": false
    },
    {
      "acteurRef": "PA736177",
      "dateCosignature": "2019-01-22+01:00",
      "edite": false
    },
    {
      "acteurRef": "PA736173",
      "dateCosignature": "2019-01-22+01:00",
      "edite": false
    },
    {
      "acteurRef": "PA678263",
      "dateCosignature": "2019-01-22+01:00",
      "edite": false
    },
    {
      "acteurRef": "PA1978",
      "dateCosignature": "2019-01-22+01:00",
      "edite": false
    },
    {
      "acteurRef": "PA736243",
      "dateCosignature": "2019-01-22+01:00",
      "edite": false
    },
    {
      "acteurRef": "PA703499",
      "dateCosignature": "2019-01-22+01:00",
      "edite": false
    },
    {
      "acteurRef": "PA736175",
      "dateCosignature": "2019-01-22+01:00",
      "edite": false
    }
  ],
  "depotAmendements": {
    "amendementsSeance": {
      "amendable": false
    }
  }
}