{
  "xsiType": "texteLoi_Type",
  "uid": "PIONANR5L15B0622",
  "legislature": "15",
  "cycleDeVie": {
    "chrono": {
      "dateCreation": "2018-01-26T00:00:00.000+01:00",
      "dateDepot": "2018-01-31T00:00:00.000+01:00",
      "datePublication": "2018-02-07T00:00:00.000+01:00",
      "datePublicationWeb": "2018-02-02T15:45:00.000+01:00"
    }
  },
  "denominationStructurelle": "Proposition de loi",
  "provenance": "Texte Déposé",
  "titres": {
    "titrePrincipal": "proposition de loi relative aux prélèvements sur la dotation globale de fonctionnement des collectivités",
    "titrePrincipalCourt": "DGF négative"
  },
  "dossierRef": "DLR5L15N36322",
  "classification": {
    "famille": {
      "depot": {
        "code": "INITDEP",
        "libelle": "Initiative en 1er Dépôt"
      },
      "classe": {
        "code": "PIONLOI",
        "libelle": "Proposition de loi"
      }
    },
    "type": {
      "code": "PION",
      "libelle": "Proposition de loi"
    }
  },
  "auteurs": [
    {
      "acteur": {
        "acteurRef": "PA266808",
        "qualite": "auteur"
      }
    }
  ],
  "notice": {
    "numNotice": "622",
    "formule": "relative aux prélèvements sur la dotation globale de fonctionnement des collectivités",
    "adoptionConforme": false
  },
  "coSignataires": [
    {
      "acteurRef": "PA609726",
      "dateCosignature": "2018-01-31+01:00",
      "edite": false
    },
    {
      "acteurRef": "PA642847",
      "dateCosignature": "2018-01-31+01:00",
      "edite": false
    },
    {
      "acteurRef": "PA856",
      "dateCosignature": "2018-01-31+01:00",
      "edite": false
    },
    {
      "acteurRef": "PA608416",
      "dateCosignature": "2018-01-31+01:00",
      "edite": false
    },
    {
      "acteurRef": "PA719946",
      "dateCosignature": "2018-01-31+01:00",
      "edite": false
    },
    {
      "acteurRef": "PA267204",
      "dateCosignature": "2018-01-31+01:00",
      "edite": false
    },
    {
      "acteurRef": "PA334654",
      "dateCosignature": "2018-01-31+01:00",
      "edite": false
    },
    {
      "acteurRef": "PA267318",
      "dateCosignature": "2018-01-31+01:00",
      "edite": false
    },
    {
      "acteurRef": "PA606712",
      "dateCosignature": "2018-01-31+01:00",
      "edite": false
    },
    {
      "acteurRef": "PA1029",
      "dateCosignature": "2018-01-31+01:00",
      "edite": false
    },
    {
      "acteurRef": "PA2377",
      "dateCosignature": "2018-01-31+01:00",
      "edite": false
    },
    {
      "acteurRef": "PA2529",
      "dateCosignature": "2018-01-31+01:00",
      "edite": false
    },
    {
      "acteurRef": "PA330240",
      "dateCosignature": "2018-01-31+01:00",
      "edite": false
    },
    {
      "acteurRef": "PA266776",
      "dateCosignature": "2018-01-31+01:00",
      "edite": false
    },
    {
      "acteurRef": "PA709315",
      "dateCosignature": "2018-01-31+01:00",
      "edite": false
    },
    {
      "acteurRef": "PA605036",
      "dateCosignature": "2018-01-31+01:00",
      "edite": false
    },
    {
      "acteurRef": "PA767",
      "dateCosignature": "2018-01-31+01:00",
      "edite": false
    },
    {
      "acteurRef": "PA334843",
      "dateCosignature": "2018-01-31+01:00",
      "edite": false
    },
    {
      "acteurRef": "PA718884",
      "dateCosignature": "2018-02-07+01:00",
      "edite": false
    },
    {
      "acteurRef": "PA267450",
      "dateCosignature": "2018-02-07+01:00",
      "edite": false
    },
    {
      "acteurRef": "PA267527",
      "dateCosignature": "2018-02-07+01:00",
      "edite": false
    },
    {
      "acteurRef": "PA720386",
      "dateCosignature": "2018-02-07+01:00",
      "edite": false
    },
    {
      "acteurRef": "PA334149",
      "dateCosignature": "2018-02-07+01:00",
      "edite": false
    },
    {
      "acteurRef": "PA721070",
      "dateCosignature": "2018-02-07+01:00",
      "edite": false
    },
    {
      "acteurRef": "PA340853",
      "dateCosignature": "2018-02-07+01:00",
      "edite": false
    },
    {
      "acteurRef": "PA266774",
      "dateCosignature": "2018-02-07+01:00",
      "edite": false
    },
    {
      "acteurRef": "PA266793",
      "dateCosignature": "2018-02-07+01:00",
      "edite": false
    },
    {
      "acteurRef": "PA721314",
      "dateCosignature": "2018-02-07+01:00",
      "edite": false
    }
  ],
  "depotAmendements": {
    "amendementsSeance": {
      "amendable": false
    },
    "amendementsCommission": [
      {
        "organeRef": "PO59051",
        "amendable": true
      }
    ]
  }
}