{
  "xsiType": "texteLoi_Type",
  "uid": "PNREANR5L15B0488",
  "legislature": "15",
  "cycleDeVie": {
    "chrono": {
      "dateCreation": "2017-12-13T00:00:00.000+01:00",
      "dateDepot": "2017-12-13T00:00:00.000+01:00",
      "datePublication": "2017-12-19T00:00:00.000+01:00",
      "datePublicationWeb": "2017-12-15T17:35:00.000+01:00"
    }
  },
  "denominationStructurelle": "Proposition de résolution",
  "provenance": "Texte Déposé",
  "titres": {
    "titrePrincipal": "proposition de résolution sur l’attachement au respect des règles de la courtoisie internationale",
    "titrePrincipalCourt": "Respect courtoisie internationale"
  },
  "dossierRef": "DLR5L15N36219",
  "classification": {
    "famille": {
      "depot": {
        "code": "INITDEP",
        "libelle": "Initiative en 1er Dépôt"
      },
      "classe": {
        "code": "PIONRES",
        "libelle": "Proposition de résolution"
      },
      "espece": {
        "code": "APPART341",
        "libelle": "en application de Article 34-1 de la Constitution"
      }
    },
    "type": {
      "code": "PNRE",
      "libelle": "Proposition de résolution"
    },
    "sousType": {
      "code": "APPART341",
      "libelle": "en application de Article 34-1 de la Constitution"
    }
  },
  "auteurs": [
    {
      "acteur": {
        "acteurRef": "PA720614",
        "qualite": "auteur"
      }
    }
  ],
  "notice": {
    "numNotice": "488",
    "formule": "sur l’attachement au respect des règles de la courtoisie internationale",
    "adoptionConforme": false
  }
}