{
  "xsiType": "texteLoi_Type",
  "uid": "PRJLANR5L15B1182",
  "legislature": "15",
  "cycleDeVie": {
    "chrono": {
      "dateCreation": "2018-07-19T00:00:00.000+02:00",
      "dateDepot": "2018-07-19T00:00:00.000+02:00",
      "datePublication": "2018-07-30T00:00:00.000+02:00",
      "datePublicationWeb": "2018-07-25T13:00:00.000+02:00"
    }
  },
  "denominationStructurelle": "Projet de loi",
  "provenance": "Texte Déposé",
  "titres": {
    "titrePrincipal": "projet de loi autorisant l'approbation de l'accord entre le Gouvernement de la République française et le Gouvernement de la République de Moldavie relatif à l'emploi salarié des conjoints des agents des missions officielles de chaque État dans l'autre, de l'accord entre le Gouvernement de la République française et le Gouvernement de la République du Bénin relatif à l'emploi salarié des personnes à charge des agents des missions officielles de chaque État dans l'autre, de l'accord entre le Gouvernement de la République française et le Gouvernement de la République de Serbie relatif à l'exercice d'une activité rémunérée des membres des familles des agents des missions officielles de chaque Etat dans l'autre et de l'accord entre le Gouvernement de la République française et le conseil des ministres de la République d'Albanie relatif à l'emploi salarié des membres des familles des agents des missions officielles de chaque Etat dans l'autre",
    "titrePrincipalCourt": "Accord avec la Moldavie, le Bénin, la Serbie et l'Albanie sur l'emploi salarié des conjoints des agents des missions officielles"
  },
  "dossierRef": "DLR5L15N36672",
  "classification": {
    "famille": {
      "depot": {
        "code": "INITNAV",
        "libelle": "Initiative en Navette"
      },
      "classe": {
        "code": "PRJLOI",
        "libelle": "Projet de loi"
      },
      "espece": {
        "code": "AUTRATCONV",
        "libelle": "autorisant la ratification d'une convention"
      }
    },
    "type": {
      "code": "PRJL",
      "libelle": "Projet de loi"
    },
    "sousType": {
      "code": "AUTRATCONV",
      "libelle": "autorisant la ratification d'une convention",
      "libelleEdition": "autorisant la ratification d'une convention"
    }
  },
  "auteurs": [
    {
      "organeRef": "PO717460"
    }
  ],
  "notice": {
    "numNotice": "1182",
    "formule": ", adopté par le Sénat, autorisant l'approbation de l'accord entre le Gouvernement de la République française et le Gouvernement de la République de Moldavie relatif à l'emploi salarié des conjoints des agents des missions officielles de chaque État dans l'autre, de l'accord entre le Gouvernement de la République française et le Gouvernement de la République du Bénin relatif à l'emploi salarié des personnes à charge des agents des missions officielles de chaque État dans l'autre, de l'accord entre le Gouvernement de la République française et le Gouvernement de la République de Serbie relatif à l'exercice d'une activité rémunérée des membres des familles des agents des missions officielles de chaque Etat dans l'autre et de l'accord entre le Gouvernement de la République française et le conseil des ministres de la République d'Albanie relatif à l'emploi salarié des membres des familles des agents des missions officielles de chaque Etat dans l'autre",
    "adoptionConforme": false
  },
  "depotAmendements": {
    "amendementsSeance": {
      "amendable": true
    },
    "amendementsCommission": [
      {
        "organeRef": "PO59047",
        "amendable": true
      }
    ]
  }
}