{
  "xsiType": "texteLoi_Type",
  "uid": "PIONANR5L15B0618",
  "legislature": "15",
  "cycleDeVie": {
    "chrono": {
      "dateCreation": "2018-01-25T00:00:00.000+01:00",
      "dateDepot": "2018-01-31T00:00:00.000+01:00",
      "datePublication": "2018-02-06T00:00:00.000+01:00",
      "datePublicationWeb": "2018-02-01T11:15:00.000+01:00"
    }
  },
  "denominationStructurelle": "Proposition de loi",
  "provenance": "Texte Déposé",
  "titres": {
    "titrePrincipal": "proposition de loi relative à l’interdiction de la chasse à courre",
    "titrePrincipalCourt": "interdiction chasse à courre"
  },
  "dossierRef": "DLR5L15N36314",
  "classification": {
    "famille": {
      "depot": {
        "code": "INITDEP",
        "libelle": "Initiative en 1er Dépôt"
      },
      "classe": {
        "code": "PIONLOI",
        "libelle": "Proposition de loi"
      }
    },
    "type": {
      "code": "PION",
      "libelle": "Proposition de loi"
    }
  },
  "auteurs": [
    {
      "acteur": {
        "acteurRef": "PA720846",
        "qualite": "auteur"
      }
    }
  ],
  "notice": {
    "numNotice": "618",
    "formule": "relative à l’interdiction de la chasse à courre",
    "adoptionConforme": false
  },
  "coSignataires": [
    {
      "acteurRef": "PA720892",
      "dateCosignature": "2018-01-31+01:00",
      "edite": false
    },
    {
      "acteurRef": "PA2150",
      "dateCosignature": "2018-01-31+01:00",
      "edite": false
    },
    {
      "acteurRef": "PA720422",
      "dateCosignature": "2018-01-31+01:00",
      "edite": false
    },
    {
      "acteurRef": "PA718868",
      "dateCosignature": "2018-01-31+01:00",
      "edite": false
    },
    {
      "acteurRef": "PA721210",
      "dateCosignature": "2018-01-31+01:00",
      "edite": false
    },
    {
      "acteurRef": "PA721202",
      "dateCosignature": "2018-01-31+01:00",
      "edite": false
    },
    {
      "acteurRef": "PA720430",
      "dateCosignature": "2018-01-31+01:00",
      "edite": false
    },
    {
      "acteurRef": "PA720286",
      "dateCosignature": "2018-01-31+01:00",
      "edite": false
    },
    {
      "acteurRef": "PA719578",
      "dateCosignature": "2018-01-31+01:00",
      "edite": false
    },
    {
      "acteurRef": "PA721792",
      "dateCosignature": "2018-01-31+01:00",
      "edite": false
    },
    {
      "acteurRef": "PA334654",
      "dateCosignature": "2018-01-31+01:00",
      "edite": false
    },
    {
      "acteurRef": "PA335612",
      "dateCosignature": "2018-01-31+01:00",
      "edite": false
    },
    {
      "acteurRef": "PA689",
      "dateCosignature": "2018-01-31+01:00",
      "edite": false
    },
    {
      "acteurRef": "PA722202",
      "dateCosignature": "2018-01-31+01:00",
      "edite": false
    },
    {
      "acteurRef": "PA722062",
      "dateCosignature": "2018-01-31+01:00",
      "edite": false
    },
    {
      "acteurRef": "PA721234",
      "dateCosignature": "2018-01-31+01:00",
      "edite": false
    },
    {
      "acteurRef": "PA719558",
      "dateCosignature": "2018-01-31+01:00",
      "edite": false
    },
    {
      "acteurRef": "PA721992",
      "dateCosignature": "2018-01-31+01:00",
      "edite": false
    },
    {
      "acteurRef": "PA721960",
      "dateCosignature": "2018-02-08+01:00",
      "edite": false
    },
    {
      "acteurRef": "PA267440",
      "dateCosignature": "2019-02-19+01:00",
      "edite": false
    }
  ],
  "depotAmendements": {
    "amendementsSeance": {
      "amendable": false
    },
    "amendementsCommission": [
      {
        "organeRef": "PO419865",
        "amendable": true
      }
    ]
  }
}