{
  "xsiType": "texteLoi_Type",
  "uid": "PIONSNR5S299BTC0669",
  "cycleDeVie": {
    "chrono": {
      "dateCreation": "2018-07-24T00:00:00.000+02:00",
      "dateDepot": "2018-07-17T00:00:00.000+02:00",
      "datePublicationWeb": "2018-07-17T14:00:00.000+02:00"
    }
  },
  "denominationStructurelle": "Proposition de loi",
  "provenance": "Texte Déposé",
  "titres": {
    "titrePrincipal": "proposition de loi organique  sur la proposition de loi organique, adoptée, par l'Assemblée nationale après engagement de la procédure accélérée, relative à la lutte contre la manipulation de l'information (n°629).",
    "titrePrincipalCourt": "Lutte contre la manipulation de l'information"
  },
  "dossierRef": "DLR5L15N36468",
  "classification": {
    "famille": {
      "depot": {
        "code": "INITNAV",
        "libelle": "Initiative en Navette"
      },
      "classe": {
        "code": "PIONLOI",
        "libelle": "Proposition de loi"
      },
      "espece": {
        "code": "ORG",
        "libelle": "organique"
      }
    },
    "type": {
      "code": "PION",
      "libelle": "Proposition de loi"
    },
    "sousType": {
      "code": "ORG",
      "libelle": "organique",
      "libelleEdition": "organique"
    }
  },
  "auteurs": [
    {
      "acteur": {
        "acteurRef": "PA415454",
        "qualite": "rapporteur"
      }
    },
    {
      "organeRef": "PO211495"
    }
  ],
  "notice": {
    "numNotice": "669",
    "formule": "sur la proposition de loi organique, adoptée, par l'Assemblée nationale après engagement de la procédure accélérée, relative à la lutte contre la manipulation de l'information (n°629).",
    "adoptionConforme": false
  },
  "depotAmendements": {
    "amendementsSeance": {
      "amendable": false
    }
  }
}