{
  "xsiType": "texteLoi_Type",
  "uid": "PIONANR5L15B1601",
  "legislature": "15",
  "cycleDeVie": {
    "chrono": {
      "dateCreation": "2019-01-16T00:00:00.000+01:00",
      "dateDepot": "2019-01-23T00:00:00.000+01:00",
      "datePublication": "2019-01-29T00:00:00.000+01:00",
      "datePublicationWeb": "2019-01-24T17:55:00.000+01:00"
    }
  },
  "denominationStructurelle": "Proposition de loi",
  "provenance": "Texte Déposé",
  "titres": {
    "titrePrincipal": "proposition de loi portant renforcement de la surveillance de l'archéologie préventive",
    "titrePrincipalCourt": "renforcement surveillance archéologie préventive"
  },
  "dossierRef": "DLR5L15N37155",
  "classification": {
    "famille": {
      "depot": {
        "code": "INITDEP",
        "libelle": "Initiative en 1er Dépôt"
      },
      "classe": {
        "code": "PIONLOI",
        "libelle": "Proposition de loi"
      }
    },
    "type": {
      "code": "PION",
      "libelle": "Proposition de loi"
    }
  },
  "auteurs": [
    {
      "acteur": {
        "acteurRef": "PA722110",
        "qualite": "auteur"
      }
    }
  ],
  "notice": {
    "numNotice": "1601",
    "formule": "portant renforcement de la surveillance de l'archéologie préventive",
    "adoptionConforme": false
  },
  "coSignataires": [
    {
      "acteurRef": "PA720546",
      "dateCosignature": "2019-01-23+01:00",
      "edite": false
    },
    {
      "acteurRef": "PA689",
      "dateCosignature": "2019-01-23+01:00",
      "edite": false
    },
    {
      "acteurRef": "PA267306",
      "dateCosignature": "2019-01-23+01:00",
      "edite": false
    },
    {
      "acteurRef": "PA718926",
      "dateCosignature": "2019-01-23+01:00",
      "edite": false
    },
    {
      "acteurRef": "PA721896",
      "dateCosignature": "2019-01-23+01:00",
      "edite": false
    },
    {
      "acteurRef": "PA722202",
      "dateCosignature": "2019-01-23+01:00",
      "edite": false
    },
    {
      "acteurRef": "PA335612",
      "dateCosignature": "2019-01-23+01:00",
      "edite": false
    },
    {
      "acteurRef": "PA721270",
      "dateCosignature": "2019-01-23+01:00",
      "edite": false
    }
  ],
  "depotAmendements": {
    "amendementsSeance": {
      "amendable": false
    },
    "amendementsCommission": [
      {
        "organeRef": "PO419604",
        "amendable": true
      }
    ]
  }
}