{
  "xsiType": "texteLoi_Type",
  "uid": "PIONANR5L15B1728",
  "legislature": "15",
  "cycleDeVie": {
    "chrono": {
      "dateCreation": "2019-03-01T00:00:00.000+01:00",
      "dateDepot": "2019-02-28T00:00:00.000+01:00",
      "datePublication": "2019-03-29T00:00:00.000+01:00",
      "datePublicationWeb": "2019-03-22T14:15:00.000+01:00"
    }
  },
  "denominationStructurelle": "Proposition de loi",
  "provenance": "Texte Déposé",
  "titres": {
    "titrePrincipal": "proposition de loi constitutionnelle pour un référendum citoyen et participatif et une procédure de consultation généralisée",
    "titrePrincipalCourt": "contributions des citoyens-électeurs dans le processus délibératif"
  },
  "dossierRef": "DLR5L15N37292",
  "classification": {
    "famille": {
      "depot": {
        "code": "INITDEP",
        "libelle": "Initiative en 1er Dépôt"
      },
      "classe": {
        "code": "PIONLOI",
        "libelle": "Proposition de loi"
      },
      "espece": {
        "code": "CONST",
        "libelle": "constitutionnelle"
      }
    },
    "type": {
      "code": "PION",
      "libelle": "Proposition de loi"
    },
    "sousType": {
      "code": "CONST",
      "libelle": "constitutionnelle",
      "libelleEdition": "constitutionnelle"
    }
  },
  "auteurs": [
    {
      "acteur": {
        "acteurRef": "PA721174",
        "qualite": "auteur"
      }
    }
  ],
  "correction": {
    "typeCorrection": "Rectifié",
    "niveauCorrection": "1"
  },
  "notice": {
    "numNotice": "1728",
    "formule": "pour un référendum citoyen et participatif et une procédure de consultation généralisée",
    "adoptionConforme": false
  },
  "coSignataires": [
    {
      "acteurRef": "PA719806",
      "dateCosignature": "2019-02-28+01:00",
      "edite": true
    }
  ],
  "depotAmendements": {
    "amendementsSeance": {
      "amendable": false
    },
    "amendementsCommission": [
      {
        "organeRef": "PO59051",
        "amendable": true
      }
    ]
  }
}