{
  "xsiType": "texteLoi_Type",
  "uid": "PIONANR5L15B0961",
  "legislature": "15",
  "cycleDeVie": {
    "chrono": {
      "dateCreation": "2018-05-07T00:00:00.000+02:00",
      "dateDepot": "2018-05-16T00:00:00.000+02:00",
      "datePublication": "2018-05-24T00:00:00.000+02:00",
      "datePublicationWeb": "2018-05-18T18:10:00.000+02:00"
    }
  },
  "denominationStructurelle": "Proposition de loi",
  "provenance": "Texte Déposé",
  "titres": {
    "titrePrincipal": "proposition de loi tendant à permettre aux consommateurs et aux maires de s'opposer à l'installation de compteurs électriques dits intelligents",
    "titrePrincipalCourt": "permettre consommateurs et maires de s'opposer aux compteurs dits intelligents"
  },
  "dossierRef": "DLR5L15N36613",
  "classification": {
    "famille": {
      "depot": {
        "code": "INITDEP",
        "libelle": "Initiative en 1er Dépôt"
      },
      "classe": {
        "code": "PIONLOI",
        "libelle": "Proposition de loi"
      }
    },
    "type": {
      "code": "PION",
      "libelle": "Proposition de loi"
    }
  },
  "auteurs": [
    {
      "acteur": {
        "acteurRef": "PA720846",
        "qualite": "auteur"
      }
    }
  ],
  "notice": {
    "numNotice": "961",
    "formule": "tendant à permettre aux consommateurs et aux maires de s'opposer à l'installation de compteurs électriques dits intelligents",
    "adoptionConforme": false
  },
  "coSignataires": [
    {
      "acteurRef": "PA719578",
      "dateCosignature": "2018-05-16+02:00",
      "edite": false
    },
    {
      "acteurRef": "PA2150",
      "dateCosignature": "2018-05-16+02:00",
      "edite": false
    },
    {
      "acteurRef": "PA720892",
      "dateCosignature": "2018-05-16+02:00",
      "edite": false
    },
    {
      "acteurRef": "PA718868",
      "dateCosignature": "2018-05-16+02:00",
      "edite": false
    },
    {
      "acteurRef": "PA720286",
      "dateCosignature": "2018-05-16+02:00",
      "edite": false
    },
    {
      "acteurRef": "PA721202",
      "dateCosignature": "2018-05-16+02:00",
      "edite": false
    },
    {
      "acteurRef": "PA588884",
      "dateCosignature": "2018-05-16+02:00",
      "edite": false
    },
    {
      "acteurRef": "PA721210",
      "dateCosignature": "2018-05-16+02:00",
      "edite": false
    },
    {
      "acteurRef": "PA720430",
      "dateCosignature": "2018-05-16+02:00",
      "edite": false
    },
    {
      "acteurRef": "PA721960",
      "dateCosignature": "2018-05-16+02:00",
      "edite": false
    },
    {
      "acteurRef": "PA721062",
      "dateCosignature": "2018-05-16+02:00",
      "edite": false
    },
    {
      "acteurRef": "PA719676",
      "dateCosignature": "2018-05-16+02:00",
      "edite": false
    },
    {
      "acteurRef": "PA722142",
      "dateCosignature": "2018-05-16+02:00",
      "edite": false
    },
    {
      "acteurRef": "PA721226",
      "dateCosignature": "2018-05-16+02:00",
      "edite": false
    },
    {
      "acteurRef": "PA718860",
      "dateCosignature": "2018-05-16+02:00",
      "edite": false
    },
    {
      "acteurRef": "PA722110",
      "dateCosignature": "2018-05-16+02:00",
      "edite": false
    },
    {
      "acteurRef": "PA720996",
      "dateCosignature": "2018-05-16+02:00",
      "edite": false
    },
    {
      "acteurRef": "PA719138",
      "dateCosignature": "2018-05-28+02:00",
      "edite": false
    }
  ],
  "depotAmendements": {
    "amendementsSeance": {
      "amendable": false
    },
    "amendementsCommission": [
      {
        "organeRef": "PO419610",
        "amendable": true
      }
    ]
  }
}