{
  "xsiType": "texteLoi_Type",
  "uid": "PIONANR5L15B0707",
  "legislature": "15",
  "cycleDeVie": {
    "chrono": {
      "dateCreation": "2018-02-21T00:00:00.000+01:00",
      "dateDepot": "2018-02-21T00:00:00.000+01:00",
      "datePublication": "2018-03-05T00:00:00.000+01:00",
      "datePublicationWeb": "2018-02-27T10:45:00.000+01:00"
    }
  },
  "denominationStructurelle": "Proposition de loi",
  "provenance": "Texte Déposé",
  "titres": {
    "titrePrincipal": "proposition de loi créant le délit de marchand de sommeil",
    "titrePrincipalCourt": "marchand de sommeil"
  },
  "dossierRef": "DLR5L15N36409",
  "classification": {
    "famille": {
      "depot": {
        "code": "INITDEP",
        "libelle": "Initiative en 1er Dépôt"
      },
      "classe": {
        "code": "PIONLOI",
        "libelle": "Proposition de loi"
      }
    },
    "type": {
      "code": "PION",
      "libelle": "Proposition de loi"
    }
  },
  "auteurs": [
    {
      "acteur": {
        "acteurRef": "PA721678",
        "qualite": "auteur"
      }
    }
  ],
  "notice": {
    "numNotice": "707",
    "formule": "créant le délit de marchand de sommeil",
    "adoptionConforme": false
  },
  "coSignataires": [
    {
      "acteurRef": "PA267785",
      "dateCosignature": "2018-02-21+01:00",
      "edite": false
    },
    {
      "acteurRef": "PA712015",
      "dateCosignature": "2018-02-21+01:00",
      "edite": false
    },
    {
      "acteurRef": "PA721286",
      "dateCosignature": "2018-02-21+01:00",
      "edite": false
    },
    {
      "acteurRef": "PA608016",
      "dateCosignature": "2018-02-21+01:00",
      "edite": false
    },
    {
      "acteurRef": "PA346218",
      "dateCosignature": "2018-02-21+01:00",
      "edite": false
    },
    {
      "acteurRef": "PA346054",
      "dateCosignature": "2018-02-21+01:00",
      "edite": false
    },
    {
      "acteurRef": "PA643134",
      "dateCosignature": "2018-02-21+01:00",
      "edite": false
    },
    {
      "acteurRef": "PA642847",
      "dateCosignature": "2018-02-21+01:00",
      "edite": false
    },
    {
      "acteurRef": "PA721506",
      "dateCosignature": "2018-02-21+01:00",
      "edite": false
    },
    {
      "acteurRef": "PA267200",
      "dateCosignature": "2018-02-21+01:00",
      "edite": false
    },
    {
      "acteurRef": "PA605036",
      "dateCosignature": "2018-02-21+01:00",
      "edite": false
    },
    {
      "acteurRef": "PA608826",
      "dateCosignature": "2018-02-21+01:00",
      "edite": false
    },
    {
      "acteurRef": "PA721070",
      "dateCosignature": "2018-02-21+01:00",
      "edite": false
    },
    {
      "acteurRef": "PA606712",
      "dateCosignature": "2018-02-21+01:00",
      "edite": false
    },
    {
      "acteurRef": "PA718784",
      "dateCosignature": "2018-02-21+01:00",
      "edite": false
    },
    {
      "acteurRef": "PA266793",
      "dateCosignature": "2018-02-21+01:00",
      "edite": false
    },
    {
      "acteurRef": "PA721046",
      "dateCosignature": "2018-02-21+01:00",
      "edite": false
    },
    {
      "acteurRef": "PA2529",
      "dateCosignature": "2018-02-21+01:00",
      "edite": false
    },
    {
      "acteurRef": "PA267429",
      "dateCosignature": "2018-02-21+01:00",
      "edite": false
    },
    {
      "acteurRef": "PA334149",
      "dateCosignature": "2018-02-21+01:00",
      "edite": false
    },
    {
      "acteurRef": "PA1874",
      "dateCosignature": "2018-02-21+01:00",
      "edite": false
    },
    {
      "acteurRef": "PA721314",
      "dateCosignature": "2018-03-08+01:00",
      "edite": false
    },
    {
      "acteurRef": "PA345722",
      "dateCosignature": "2018-05-02+02:00",
      "edite": false
    }
  ],
  "depotAmendements": {
    "amendementsSeance": {
      "amendable": false
    },
    "amendementsCommission": [
      {
        "organeRef": "PO419610",
        "amendable": true
      }
    ]
  }
}