{
  "xsiType": "texteLoi_Type",
  "uid": "PRJLANR5L15BTC0971",
  "legislature": "15",
  "cycleDeVie": {
    "chrono": {
      "dateCreation": "2018-05-19T00:00:00.000+02:00",
      "dateDepot": "2018-05-19T00:00:00.000+02:00",
      "datePublication": "2018-05-25T00:00:00.000+02:00",
      "datePublicationWeb": "2018-05-22T19:30:00.000+02:00"
    }
  },
  "denominationStructurelle": "Projet de loi",
  "provenance": "Texte Déposé",
  "titres": {
    "titrePrincipal": "projet de loi sur le projet de loi, après engagement de la procédure accélérée, portant évolution du logement, de l’aménagement et du numérique (n°846).",
    "titrePrincipalCourt": "Logement Aménagement et Numérique"
  },
  "dossierRef": "DLR5L15N36537",
  "classification": {
    "famille": {
      "depot": {
        "code": "INITDEP",
        "libelle": "Initiative en 1er Dépôt"
      },
      "classe": {
        "code": "PRJLOI",
        "libelle": "Projet de loi"
      }
    },
    "type": {
      "code": "PRJL",
      "libelle": "Projet de loi"
    },
    "statutAdoption": "ADOPTCOM"
  },
  "auteurs": [
    {
      "acteur": {
        "acteurRef": "PA719660",
        "qualite": "rapporteur"
      }
    },
    {
      "acteur": {
        "acteurRef": "PA720378",
        "qualite": "rapporteur"
      }
    },
    {
      "organeRef": "PO419610"
    }
  ],
  "notice": {
    "numNotice": "971",
    "formule": "sur le projet de loi, après engagement de la procédure accélérée, portant évolution du logement, de l’aménagement et du numérique (n°846).",
    "adoptionConforme": false
  },
  "imprimerie": {
    "prix": "16.0"
  },
  "depotAmendements": {
    "amendementsSeance": {
      "amendable": true
    },
    "amendementsCommission": [
      {
        "organeRef": "PO59051",
        "amendable": true
      },
      {
        "organeRef": "PO419865",
        "amendable": true
      },
      {
        "organeRef": "PO419610",
        "amendable": true
      },
      {
        "organeRef": "PO419604",
        "amendable": true
      }
    ]
  }
}