{
  "xsiType": "rapportParlementaire_Type",
  "uid": "RAPPSNR5S299B0443",
  "cycleDeVie": {
    "chrono": {
      "dateCreation": "2018-04-19T00:00:00.000+02:00",
      "dateDepot": "2018-04-18T00:00:00.000+02:00",
      "datePublication": "2018-05-23T00:00:00.000+02:00"
    }
  },
  "denominationStructurelle": "Rapport",
  "provenance": "Commission",
  "titres": {
    "titrePrincipal": "rapport  les dispositions restant en discussion sur du projet de loi, modifié par le Sénat, relatif à l'élection des représentants au Parlement européen (n°874).",
    "titrePrincipalCourt": "rapport  les dispositions restant en discussion sur du projet de loi, modifié par le Sénat, relatif à l'élection des représentants au Parlement européen (n°874)."
  },
  "dossierRef": "DLR5L15N36254",
  "classification": {
    "famille": {
      "depot": {
        "code": "RAPINIT",
        "libelle": "Rapport sur une initiative"
      },
      "classe": {
        "code": "RAPPORT",
        "libelle": "Rapport"
      }
    },
    "type": {
      "code": "RAPP",
      "libelle": "Rapport"
    }
  },
  "auteurs": [
    {
      "acteur": {
        "acteurRef": "PA2552",
        "qualite": "rapporteur"
      }
    },
    {
      "organeRef": "PO755391"
    }
  ],
  "notice": {
    "numNotice": "443",
    "formule": "de la commission mixte paritaire chargée de proposer un texte sur les dispositions restant en discussion sur du projet de loi, modifié par le Sénat, relatif à l'élection des représentants au Parlement européen (n°874).",
    "adoptionConforme": false
  }
}