{
  "xsiType": "texteLoi_Type",
  "uid": "RINFANR5L15B1944",
  "legislature": "15",
  "cycleDeVie": {
    "chrono": {
      "dateCreation": "2019-05-14T00:00:00.000+02:00",
      "dateDepot": "2019-05-14T00:00:00.000+02:00",
      "datePublication": "2019-05-17T00:00:00.000+02:00",
      "datePublicationWeb": "2019-05-14T17:15:00.000+02:00"
    }
  },
  "denominationStructurelle": "Rapport d'information",
  "provenance": "Commission",
  "titres": {
    "titrePrincipal": "rapport d'information sur le projet de loi d'orientation des mobilités",
    "titrePrincipalCourt": "projet de loi d'orientation des mobilités"
  },
  "dossierRef": "DLR5L15N37468",
  "classification": {
    "famille": {
      "depot": {
        "code": "RAPAUT",
        "libelle": "Rapport autonome"
      },
      "classe": {
        "code": "RAPINF",
        "libelle": "Rapport d'information"
      },
      "espece": {
        "code": "PRPDIT",
        "libelle": "tel quel"
      }
    },
    "type": {
      "code": "RINF",
      "libelle": "Rapport d'information"
    },
    "sousType": {
      "code": "PRPDIT",
      "libelle": "tel quel"
    }
  },
  "auteurs": [
    {
      "acteur": {
        "acteurRef": "PA719130",
        "qualite": "rapporteur"
      }
    },
    {
      "organeRef": "PO744127"
    }
  ],
  "notice": {
    "numNotice": "1944",
    "formule": "sur le projet de loi d'orientation des mobilités",
    "adoptionConforme": false
  }
}