{
  "xsiType": "rapportParlementaire_Type",
  "uid": "RAPPSNR5S319B0092",
  "cycleDeVie": {
    "chrono": {
      "dateCreation": "2018-11-02T00:00:00.000+01:00",
      "dateDepot": "2018-10-30T00:00:00.000+01:00"
    }
  },
  "denominationStructurelle": "Rapport",
  "provenance": "Commission",
  "titres": {
    "titrePrincipal": "rapport sur le projet de loi, après engagement de la procédure accélérée, habilitant le Gouvernement à prendre par ordonnance les mesures de préparation au retrait du Royaume-Uni de l'Union européenne (n°9).",
    "titrePrincipalCourt": "rapport sur le projet de loi, après engagement de la procédure accélérée, habilitant le Gouvernement à prendre par ordonnance les mesures de préparation au retrait du Royaume-Uni de l'Union européenne (n°9)."
  },
  "dossierRef": "DLR5L15N36910",
  "classification": {
    "famille": {
      "depot": {
        "code": "RAPINIT",
        "libelle": "Rapport sur une initiative"
      },
      "classe": {
        "code": "RAPPORT",
        "libelle": "Rapport"
      }
    },
    "type": {
      "code": "RAPP",
      "libelle": "Rapport"
    }
  },
  "auteurs": [
    {
      "acteur": {
        "acteurRef": "PA2447",
        "qualite": "rapporteur"
      }
    },
    {
      "organeRef": "PO759364"
    }
  ],
  "notice": {
    "numNotice": "92",
    "formule": "sur le projet de loi, après engagement de la procédure accélérée, habilitant le Gouvernement à prendre par ordonnance les mesures de préparation au retrait du Royaume-Uni de l'Union européenne (n°9).",
    "adoptionConforme": false
  }
}