{
  "xsiType": "texteLoi_Type",
  "uid": "PRJLSNR5S299BTC0288",
  "cycleDeVie": {
    "chrono": {
      "dateCreation": "2018-02-13T00:00:00.000+01:00",
      "dateDepot": "2018-02-07T00:00:00.000+01:00",
      "datePublicationWeb": "2018-02-07T14:00:00.000+01:00"
    }
  },
  "denominationStructurelle": "Projet de loi",
  "provenance": "Texte Déposé",
  "titres": {
    "titrePrincipal": "projet de loi organique sur le projet de loi organique, après engagement de la procédure accélérée, relatif à l'organisation de la consultation sur l'accession à la pleine souveraineté de la Nouvelle-Calédonie (n°152).",
    "titrePrincipalCourt": "Consultation sur l'accession à la pleine souveraineté de la Nouvelle-Calédonie"
  },
  "dossierRef": "DLR5L15N36333",
  "classification": {
    "famille": {
      "depot": {
        "code": "INITDEP",
        "libelle": "Initiative en 1er Dépôt"
      },
      "classe": {
        "code": "PRJLOI",
        "libelle": "Projet de loi"
      },
      "espece": {
        "code": "ORG",
        "libelle": "organique"
      }
    },
    "type": {
      "code": "PRJL",
      "libelle": "Projet de loi"
    },
    "sousType": {
      "code": "ORG",
      "libelle": "organique",
      "libelleEdition": "organique"
    }
  },
  "auteurs": [
    {
      "acteur": {
        "acteurRef": "PA429858",
        "qualite": "rapporteur"
      }
    },
    {
      "organeRef": "PO211495"
    }
  ],
  "notice": {
    "numNotice": "288",
    "formule": "sur le projet de loi organique, après engagement de la procédure accélérée, relatif à l'organisation de la consultation sur l'accession à la pleine souveraineté de la Nouvelle-Calédonie (n°152).",
    "adoptionConforme": false
  },
  "depotAmendements": {
    "amendementsSeance": {
      "amendable": false
    }
  }
}