{
  "xsiType": "texteLoi_Type",
  "uid": "PIONANR5L15B2337",
  "legislature": "15",
  "cycleDeVie": {
    "chrono": {
      "dateCreation": "2019-10-12T00:00:00.000+02:00",
      "dateDepot": "2019-10-16T00:00:00.000+02:00",
      "datePublication": "2019-10-24T00:00:00.000+02:00",
      "datePublicationWeb": "2019-10-17T14:35:00.000+02:00"
    }
  },
  "denominationStructurelle": "Proposition de loi",
  "provenance": "Texte Déposé",
  "titres": {
    "titrePrincipal": "proposition de loi modernisant les ventes volontaires de meubles aux enchères publiques",
    "titrePrincipalCourt": "modernisant ventes aux enchères"
  },
  "dossierRef": "DLR5L15N37856",
  "classification": {
    "famille": {
      "depot": {
        "code": "INITDEP",
        "libelle": "Initiative en 1er Dépôt"
      },
      "classe": {
        "code": "PIONLOI",
        "libelle": "Proposition de loi"
      }
    },
    "type": {
      "code": "PION",
      "libelle": "Proposition de loi"
    }
  },
  "auteurs": [
    {
      "acteur": {
        "acteurRef": "PA717379",
        "qualite": "auteur"
      }
    }
  ],
  "notice": {
    "numNotice": "2337",
    "formule": "modernisant les ventes volontaires de meubles aux enchères publiques",
    "adoptionConforme": false
  },
  "coSignataires": [
    {
      "acteurRef": "PA719952",
      "dateCosignature": "2019-10-16+02:00",
      "edite": false
    },
    {
      "acteurRef": "PA721466",
      "dateCosignature": "2019-10-16+02:00",
      "edite": false
    },
    {
      "acteurRef": "PA721624",
      "dateCosignature": "2019-10-16+02:00",
      "edite": false
    },
    {
      "acteurRef": "PA721764",
      "dateCosignature": "2019-10-16+02:00",
      "edite": false
    },
    {
      "acteurRef": "PA721560",
      "dateCosignature": "2019-10-16+02:00",
      "edite": false
    },
    {
      "acteurRef": "PA721498",
      "dateCosignature": "2019-10-16+02:00",
      "edite": false
    },
    {
      "acteurRef": "PA717167",
      "dateCosignature": "2019-10-16+02:00",
      "edite": false
    },
    {
      "acteurRef": "PA721568",
      "dateCosignature": "2019-10-16+02:00",
      "edite": false
    },
    {
      "acteurRef": "PA721824",
      "dateCosignature": "2019-10-16+02:00",
      "edite": false
    },
    {
      "acteurRef": "PA721616",
      "dateCosignature": "2019-10-16+02:00",
      "edite": false
    },
    {
      "dateCosignature": "2019-10-16+02:00",
      "edite": false,
      "organe": {
        "organeRef": "PO730964",
        "etApparentes": true
      }
    },
    {
      "acteurRef": "PA719866",
      "dateCosignature": "2019-10-16+02:00",
      "edite": false
    },
    {
      "acteurRef": "PA720242",
      "dateCosignature": "2019-10-16+02:00",
      "edite": false
    },
    {
      "acteurRef": "PA722038",
      "dateCosignature": "2019-10-16+02:00",
      "edite": false
    },
    {
      "acteurRef": "PA721036",
      "dateCosignature": "2019-10-16+02:00",
      "edite": false
    },
    {
      "acteurRef": "PA718954",
      "dateCosignature": "2019-10-16+02:00",
      "edite": false
    },
    {
      "acteurRef": "PA605963",
      "dateCosignature": "2019-10-16+02:00",
      "edite": false
    },
    {
      "acteurRef": "PA724827",
      "dateCosignature": "2019-10-16+02:00",
      "edite": false
    },
    {
      "acteurRef": "PA720124",
      "dateCosignature": "2019-10-16+02:00",
      "edite": false
    },
    {
      "acteurRef": "PA721278",
      "dateCosignature": "2019-10-16+02:00",
      "edite": false
    },
    {
      "acteurRef": "PA606675",
      "dateCosignature": "2019-10-16+02:00",
      "edite": false
    },
    {
      "acteurRef": "PA721158",
      "dateCosignature": "2019-10-16+02:00",
      "edite": false
    },
    {
      "acteurRef": "PA719100",
      "dateCosignature": "2019-10-16+02:00",
      "edite": false
    },
    {
      "acteurRef": "PA720310",
      "dateCosignature": "2019-10-16+02:00",
      "edite": false
    },
    {
      "acteurRef": "PA721674",
      "dateCosignature": "2019-10-16+02:00",
      "edite": false
    },
    {
      "acteurRef": "PA719770",
      "dateCosignature": "2019-10-16+02:00",
      "edite": false
    },
    {
      "acteurRef": "PA718744",
      "dateCosignature": "2019-10-16+02:00",
      "edite": false
    },
    {
      "acteurRef": "PA721776",
      "dateCosignature": "2019-10-16+02:00",
      "edite": false
    },
    {
      "acteurRef": "PA642724",
      "dateCosignature": "2019-10-16+02:00",
      "edite": false
    },
    {
      "acteurRef": "PA721522",
      "dateCosignature": "2019-10-16+02:00",
      "edite": false
    },
    {
      "acteurRef": "PA722170",
      "dateCosignature": "2019-10-16+02:00",
      "edite": false
    },
    {
      "acteurRef": "PA720362",
      "dateCosignature": "2019-10-16+02:00",
      "edite": false
    },
    {
      "acteurRef": "PA722046",
      "dateCosignature": "2019-10-16+02:00",
      "edite": false
    },
    {
      "acteurRef": "PA719218",
      "dateCosignature": "2019-10-16+02:00",
      "edite": false
    },
    {
      "acteurRef": "PA718876",
      "dateCosignature": "2019-10-16+02:00",
      "edite": false
    },
    {
      "acteurRef": "PA722312",
      "dateCosignature": "2019-10-16+02:00",
      "edite": false
    },
    {
      "acteurRef": "PA718990",
      "dateCosignature": "2019-10-16+02:00",
      "edite": false
    },
    {
      "acteurRef": "PA719024",
      "dateCosignature": "2019-10-16+02:00",
      "edite": false
    },
    {
      "acteurRef": "PA608641",
      "dateCosignature": "2019-10-16+02:00",
      "edite": false
    },
    {
      "acteurRef": "PA720576",
      "dateCosignature": "2019-10-16+02:00",
      "edite": false
    },
    {
      "acteurRef": "PA721344",
      "dateCosignature": "2019-10-16+02:00",
      "edite": false
    },
    {
      "acteurRef": "PA718756",
      "dateCosignature": "2019-10-16+02:00",
      "edite": false
    },
    {
      "acteurRef": "PA719980",
      "dateCosignature": "2019-10-16+02:00",
      "edite": false
    },
    {
      "acteurRef": "PA642695",
      "dateCosignature": "2019-10-16+02:00",
      "edite": false
    },
    {
      "acteurRef": "PA606507",
      "dateCosignature": "2019-10-16+02:00",
      "edite": false
    },
    {
      "acteurRef": "PA608083",
      "dateCosignature": "2019-10-16+02:00",
      "edite": false
    },
    {
      "acteurRef": "PA719032",
      "dateCosignature": "2019-10-16+02:00",
      "edite": false
    },
    {
      "acteurRef": "PA718710",
      "dateCosignature": "2019-10-16+02:00",
      "edite": false
    },
    {
      "acteurRef": "PA721908",
      "dateCosignature": "2019-10-16+02:00",
      "edite": false
    },
    {
      "acteurRef": "PA672",
      "dateCosignature": "2019-10-16+02:00",
      "edite": false
    },
    {
      "acteurRef": "PA721336",
      "dateCosignature": "2019-10-16+02:00",
      "edite": false
    },
    {
      "acteurRef": "PA721328",
      "dateCosignature": "2019-10-16+02:00",
      "edite": false
    },
    {
      "acteurRef": "PA719890",
      "dateCosignature": "2019-10-16+02:00",
      "edite": false
    },
    {
      "acteurRef": "PA720116",
      "dateCosignature": "2019-10-16+02:00",
      "edite": false
    },
    {
      "acteurRef": "PA722000",
      "dateCosignature": "2019-10-16+02:00",
      "edite": false
    },
    {
      "acteurRef": "PA720622",
      "dateCosignature": "2019-10-16+02:00",
      "edite": false
    },
    {
      "acteurRef": "PA719496",
      "dateCosignature": "2019-10-16+02:00",
      "edite": false
    },
    {
      "acteurRef": "PA721750",
      "dateCosignature": "2019-10-16+02:00",
      "edite": false
    },
    {
      "acteurRef": "PA720298",
      "dateCosignature": "2019-10-16+02:00",
      "edite": false
    },
    {
      "acteurRef": "PA720520",
      "dateCosignature": "2019-10-16+02:00",
      "edite": false
    },
    {
      "acteurRef": "PA719922",
      "dateCosignature": "2019-10-16+02:00",
      "edite": false
    },
    {
      "acteurRef": "PA721352",
      "dateCosignature": "2019-10-16+02:00",
      "edite": false
    },
    {
      "acteurRef": "PA721166",
      "dateCosignature": "2019-10-16+02:00",
      "edite": false
    },
    {
      "acteurRef": "PA719472",
      "dateCosignature": "2019-10-16+02:00",
      "edite": false
    },
    {
      "acteurRef": "PA720814",
      "dateCosignature": "2019-10-16+02:00",
      "edite": false
    },
    {
      "acteurRef": "PA719440",
      "dateCosignature": "2019-10-16+02:00",
      "edite": false
    },
    {
      "acteurRef": "PA721860",
      "dateCosignature": "2019-10-16+02:00",
      "edite": false
    },
    {
      "acteurRef": "PA719748",
      "dateCosignature": "2019-10-16+02:00",
      "edite": false
    },
    {
      "acteurRef": "PA719790",
      "dateCosignature": "2019-10-16+02:00",
      "edite": false
    },
    {
      "acteurRef": "PA719448",
      "dateCosignature": "2019-10-16+02:00",
      "edite": false
    },
    {
      "acteurRef": "PA721218",
      "dateCosignature": "2019-10-16+02:00",
      "edite": false
    },
    {
      "acteurRef": "PA719170",
      "dateCosignature": "2019-10-16+02:00",
      "edite": false
    },
    {
      "acteurRef": "PA719250",
      "dateCosignature": "2019-10-16+02:00",
      "edite": false
    },
    {
      "acteurRef": "PA722126",
      "dateCosignature": "2019-10-16+02:00",
      "edite": false
    },
    {
      "acteurRef": "PA760658",
      "dateCosignature": "2019-10-16+02:00",
      "edite": false
    },
    {
      "acteurRef": "PA702054",
      "dateCosignature": "2019-10-16+02:00",
      "edite": false
    },
    {
      "acteurRef": "PA719294",
      "dateCosignature": "2019-10-16+02:00",
      "edite": false
    },
    {
      "acteurRef": "PA719756",
      "dateCosignature": "2019-10-16+02:00",
      "edite": false
    },
    {
      "acteurRef": "PA719740",
      "dateCosignature": "2019-10-16+02:00",
      "edite": false
    },
    {
      "acteurRef": "PA719814",
      "dateCosignature": "2019-10-16+02:00",
      "edite": false
    },
    {
      "acteurRef": "PA719118",
      "dateCosignature": "2019-10-16+02:00",
      "edite": false
    },
    {
      "acteurRef": "PA719624",
      "dateCosignature": "2019-10-16+02:00",
      "edite": false
    },
    {
      "acteurRef": "PA719194",
      "dateCosignature": "2019-10-16+02:00",
      "edite": false
    },
    {
      "acteurRef": "PA721808",
      "dateCosignature": "2019-10-16+02:00",
      "edite": false
    },
    {
      "acteurRef": "PA720268",
      "dateCosignature": "2019-10-16+02:00",
      "edite": false
    },
    {
      "acteurRef": "PA607155",
      "dateCosignature": "2019-10-16+02:00",
      "edite": false
    },
    {
      "acteurRef": "PA720932",
      "dateCosignature": "2019-10-16+02:00",
      "edite": false
    },
    {
      "acteurRef": "PA719710",
      "dateCosignature": "2019-10-16+02:00",
      "edite": false
    },
    {
      "acteurRef": "PA721398",
      "dateCosignature": "2019-10-16+02:00",
      "edite": false
    },
    {
      "acteurRef": "PA718694",
      "dateCosignature": "2019-10-16+02:00",
      "edite": false
    },
    {
      "acteurRef": "PA719258",
      "dateCosignature": "2019-10-16+02:00",
      "edite": false
    },
    {
      "acteurRef": "PA719830",
      "dateCosignature": "2019-10-16+02:00",
      "edite": false
    },
    {
      "acteurRef": "PA720862",
      "dateCosignature": "2019-10-16+02:00",
      "edite": false
    },
    {
      "acteurRef": "PA720538",
      "dateCosignature": "2019-10-16+02:00",
      "edite": false
    },
    {
      "acteurRef": "PA720438",
      "dateCosignature": "2019-10-16+02:00",
      "edite": false
    },
    {
      "acteurRef": "PA722382",
      "dateCosignature": "2019-10-16+02:00",
      "edite": false
    },
    {
      "acteurRef": "PA721718",
      "dateCosignature": "2019-10-16+02:00",
      "edite": false
    },
    {
      "acteurRef": "PA718894",
      "dateCosignature": "2019-10-16+02:00",
      "edite": false
    },
    {
      "acteurRef": "PA719162",
      "dateCosignature": "2019-10-16+02:00",
      "edite": false
    },
    {
      "acteurRef": "PA719684",
      "dateCosignature": "2019-10-16+02:00",
      "edite": false
    },
    {
      "acteurRef": "PA720154",
      "dateCosignature": "2019-10-16+02:00",
      "edite": false
    },
    {
      "acteurRef": "PA720046",
      "dateCosignature": "2019-10-16+02:00",
      "edite": false
    },
    {
      "acteurRef": "PA606202",
      "dateCosignature": "2019-10-16+02:00",
      "edite": false
    },
    {
      "acteurRef": "PA643175",
      "dateCosignature": "2019-10-16+02:00",
      "edite": false
    },
    {
      "acteurRef": "PA719692",
      "dateCosignature": "2019-10-16+02:00",
      "edite": false
    },
    {
      "acteurRef": "PA607193",
      "dateCosignature": "2019-10-16+02:00",
      "edite": false
    },
    {
      "acteurRef": "PA719616",
      "dateCosignature": "2019-10-16+02:00",
      "edite": false
    },
    {
      "acteurRef": "PA719570",
      "dateCosignature": "2019-10-16+02:00",
      "edite": false
    },
    {
      "acteurRef": "PA719960",
      "dateCosignature": "2019-10-16+02:00",
      "edite": false
    },
    {
      "acteurRef": "PA721702",
      "dateCosignature": "2019-10-16+02:00",
      "edite": false
    },
    {
      "acteurRef": "PA606171",
      "dateCosignature": "2019-10-16+02:00",
      "edite": false
    },
    {
      "acteurRef": "PA722134",
      "dateCosignature": "2019-10-16+02:00",
      "edite": false
    },
    {
      "acteurRef": "PA267673",
      "dateCosignature": "2019-10-16+02:00",
      "edite": false
    },
    {
      "acteurRef": "PA718706",
      "dateCosignature": "2019-10-16+02:00",
      "edite": false
    },
    {
      "acteurRef": "PA721384",
      "dateCosignature": "2019-10-16+02:00",
      "edite": false
    },
    {
      "acteurRef": "PA721142",
      "dateCosignature": "2019-10-16+02:00",
      "edite": false
    },
    {
      "acteurRef": "PA720030",
      "dateCosignature": "2019-10-16+02:00",
      "edite": false
    },
    {
      "acteurRef": "PA722366",
      "dateCosignature": "2019-10-16+02:00",
      "edite": false
    },
    {
      "acteurRef": "PA719480",
      "dateCosignature": "2019-10-16+02:00",
      "edite": false
    },
    {
      "acteurRef": "PA721246",
      "dateCosignature": "2019-10-16+02:00",
      "edite": false
    },
    {
      "acteurRef": "PA722358",
      "dateCosignature": "2019-10-16+02:00",
      "edite": false
    },
    {
      "acteurRef": "PA721364",
      "dateCosignature": "2019-10-16+02:00",
      "edite": false
    },
    {
      "acteurRef": "PA720806",
      "dateCosignature": "2019-10-16+02:00",
      "edite": false
    },
    {
      "acteurRef": "PA721024",
      "dateCosignature": "2019-10-16+02:00",
      "edite": false
    },
    {
      "acteurRef": "PA719108",
      "dateCosignature": "2019-10-16+02:00",
      "edite": false
    },
    {
      "acteurRef": "PA719326",
      "dateCosignature": "2019-10-16+02:00",
      "edite": false
    },
    {
      "acteurRef": "PA720222",
      "dateCosignature": "2019-10-16+02:00",
      "edite": false
    },
    {
      "acteurRef": "PA267336",
      "dateCosignature": "2019-10-16+02:00",
      "edite": false
    },
    {
      "acteurRef": "PA718674",
      "dateCosignature": "2019-10-16+02:00",
      "edite": false
    },
    {
      "acteurRef": "PA721784",
      "dateCosignature": "2019-10-16+02:00",
      "edite": false
    },
    {
      "acteurRef": "PA721296",
      "dateCosignature": "2019-10-16+02:00",
      "edite": false
    },
    {
      "acteurRef": "PA720560",
      "dateCosignature": "2019-10-16+02:00",
      "edite": false
    },
    {
      "acteurRef": "PA719330",
      "dateCosignature": "2019-10-16+02:00",
      "edite": false
    },
    {
      "acteurRef": "PA720170",
      "dateCosignature": "2019-10-16+02:00",
      "edite": false
    },
    {
      "acteurRef": "PA722062",
      "dateCosignature": "2019-10-16+02:00",
      "edite": false
    },
    {
      "acteurRef": "PA720790",
      "dateCosignature": "2019-10-16+02:00",
      "edite": false
    },
    {
      "acteurRef": "PA721792",
      "dateCosignature": "2019-10-16+02:00",
      "edite": false
    },
    {
      "acteurRef": "PA721880",
      "dateCosignature": "2019-10-16+02:00",
      "edite": false
    },
    {
      "acteurRef": "PA722054",
      "dateCosignature": "2019-10-16+02:00",
      "edite": false
    },
    {
      "acteurRef": "PA719652",
      "dateCosignature": "2019-10-16+02:00",
      "edite": false
    },
    {
      "acteurRef": "PA720054",
      "dateCosignature": "2019-10-16+02:00",
      "edite": false
    },
    {
      "acteurRef": "PA722094",
      "dateCosignature": "2019-10-16+02:00",
      "edite": false
    },
    {
      "acteurRef": "PA722070",
      "dateCosignature": "2019-10-16+02:00",
      "edite": false
    },
    {
      "acteurRef": "PA718794",
      "dateCosignature": "2019-10-16+02:00",
      "edite": false
    },
    {
      "acteurRef": "PA721150",
      "dateCosignature": "2019-10-16+02:00",
      "edite": false
    },
    {
      "acteurRef": "PA720454",
      "dateCosignature": "2019-10-16+02:00",
      "edite": false
    },
    {
      "acteurRef": "PA722150",
      "dateCosignature": "2019-10-16+02:00",
      "edite": false
    },
    {
      "acteurRef": "PA719700",
      "dateCosignature": "2019-10-16+02:00",
      "edite": false
    },
    {
      "acteurRef": "PA331835",
      "dateCosignature": "2019-10-16+02:00",
      "edite": false
    },
    {
      "acteurRef": "PA720354",
      "dateCosignature": "2019-10-16+02:00",
      "edite": false
    },
    {
      "acteurRef": "PA720074",
      "dateCosignature": "2019-10-16+02:00",
      "edite": false
    },
    {
      "acteurRef": "PA719060",
      "dateCosignature": "2019-10-16+02:00",
      "edite": false
    },
    {
      "acteurRef": "PA719778",
      "dateCosignature": "2019-10-16+02:00",
      "edite": false
    },
    {
      "acteurRef": "PA722344",
      "dateCosignature": "2019-10-16+02:00",
      "edite": false
    },
    {
      "acteurRef": "PA719994",
      "dateCosignature": "2019-10-16+02:00",
      "edite": false
    },
    {
      "acteurRef": "PA719372",
      "dateCosignature": "2019-10-16+02:00",
      "edite": false
    },
    {
      "acteurRef": "PA721514",
      "dateCosignature": "2019-10-16+02:00",
      "edite": false
    },
    {
      "acteurRef": "PA719230",
      "dateCosignature": "2019-10-16+02:00",
      "edite": false
    },
    {
      "acteurRef": "PA719052",
      "dateCosignature": "2019-10-16+02:00",
      "edite": false
    },
    {
      "acteurRef": "PA719186",
      "dateCosignature": "2019-10-16+02:00",
      "edite": false
    },
    {
      "acteurRef": "PA722300",
      "dateCosignature": "2019-10-16+02:00",
      "edite": false
    },
    {
      "acteurRef": "PA721644",
      "dateCosignature": "2019-10-16+02:00",
      "edite": false
    },
    {
      "acteurRef": "PA605084",
      "dateCosignature": "2019-10-16+02:00",
      "edite": false
    },
    {
      "acteurRef": "PA720202",
      "dateCosignature": "2019-10-16+02:00",
      "edite": false
    },
    {
      "acteurRef": "PA720214",
      "dateCosignature": "2019-10-16+02:00",
      "edite": false
    },
    {
      "acteurRef": "PA719842",
      "dateCosignature": "2019-10-16+02:00",
      "edite": false
    },
    {
      "acteurRef": "PA719798",
      "dateCosignature": "2019-10-16+02:00",
      "edite": false
    },
    {
      "acteurRef": "PA721004",
      "dateCosignature": "2019-10-16+02:00",
      "edite": false
    },
    {
      "acteurRef": "PA643205",
      "dateCosignature": "2019-10-16+02:00",
      "edite": false
    },
    {
      "acteurRef": "PA721434",
      "dateCosignature": "2019-10-16+02:00",
      "edite": false
    },
    {
      "acteurRef": "PA719396",
      "dateCosignature": "2019-10-16+02:00",
      "edite": false
    },
    {
      "acteurRef": "PA720022",
      "dateCosignature": "2019-10-16+02:00",
      "edite": false
    },
    {
      "acteurRef": "PA719664",
      "dateCosignature": "2019-10-16+02:00",
      "edite": false
    },
    {
      "acteurRef": "PA719310",
      "dateCosignature": "2019-10-16+02:00",
      "edite": false
    },
    {
      "acteurRef": "PA720916",
      "dateCosignature": "2019-10-16+02:00",
      "edite": false
    },
    {
      "acteurRef": "PA721852",
      "dateCosignature": "2019-10-16+02:00",
      "edite": false
    },
    {
      "acteurRef": "PA719728",
      "dateCosignature": "2019-10-16+02:00",
      "edite": false
    },
    {
      "acteurRef": "PA722228",
      "dateCosignature": "2019-10-16+02:00",
      "edite": false
    },
    {
      "acteurRef": "PA720480",
      "dateCosignature": "2019-10-16+02:00",
      "edite": false
    },
    {
      "acteurRef": "PA719412",
      "dateCosignature": "2019-10-16+02:00",
      "edite": false
    },
    {
      "acteurRef": "PA719404",
      "dateCosignature": "2019-10-16+02:00",
      "edite": false
    },
    {
      "acteurRef": "PA722008",
      "dateCosignature": "2019-10-16+02:00",
      "edite": false
    },
    {
      "acteurRef": "PA722320",
      "dateCosignature": "2019-10-16+02:00",
      "edite": false
    },
    {
      "acteurRef": "PA719388",
      "dateCosignature": "2019-10-16+02:00",
      "edite": false
    },
    {
      "acteurRef": "PA721450",
      "dateCosignature": "2019-10-16+02:00",
      "edite": false
    },
    {
      "acteurRef": "PA720342",
      "dateCosignature": "2019-10-16+02:00",
      "edite": false
    },
    {
      "acteurRef": "PA721134",
      "dateCosignature": "2019-10-16+02:00",
      "edite": false
    },
    {
      "acteurRef": "PA719006",
      "dateCosignature": "2019-10-16+02:00",
      "edite": false
    },
    {
      "acteurRef": "PA719858",
      "dateCosignature": "2019-10-16+02:00",
      "edite": false
    },
    {
      "acteurRef": "PA720378",
      "dateCosignature": "2019-10-16+02:00",
      "edite": false
    },
    {
      "acteurRef": "PA720446",
      "dateCosignature": "2019-10-16+02:00",
      "edite": false
    },
    {
      "acteurRef": "PA718918",
      "dateCosignature": "2019-10-16+02:00",
      "edite": false
    },
    {
      "acteurRef": "PA722244",
      "dateCosignature": "2019-10-16+02:00",
      "edite": false
    },
    {
      "acteurRef": "PA719718",
      "dateCosignature": "2019-10-16+02:00",
      "edite": false
    },
    {
      "acteurRef": "PA722178",
      "dateCosignature": "2019-10-16+02:00",
      "edite": false
    },
    {
      "acteurRef": "PA334116",
      "dateCosignature": "2019-10-16+02:00",
      "edite": false
    },
    {
      "acteurRef": "PA721946",
      "dateCosignature": "2019-10-16+02:00",
      "edite": false
    },
    {
      "acteurRef": "PA719080",
      "dateCosignature": "2019-10-16+02:00",
      "edite": false
    },
    {
      "acteurRef": "PA719154",
      "dateCosignature": "2019-10-16+02:00",
      "edite": false
    },
    {
      "acteurRef": "PA720146",
      "dateCosignature": "2019-10-16+02:00",
      "edite": false
    },
    {
      "acteurRef": "PA721800",
      "dateCosignature": "2019-10-16+02:00",
      "edite": false
    },
    {
      "acteurRef": "PA721726",
      "dateCosignature": "2019-10-16+02:00",
      "edite": false
    },
    {
      "acteurRef": "PA677483",
      "dateCosignature": "2019-10-16+02:00",
      "edite": false
    },
    {
      "acteurRef": "PA720870",
      "dateCosignature": "2019-10-16+02:00",
      "edite": false
    },
    {
      "acteurRef": "PA719338",
      "dateCosignature": "2019-10-16+02:00",
      "edite": false
    },
    {
      "acteurRef": "PA720370",
      "dateCosignature": "2019-10-16+02:00",
      "edite": false
    },
    {
      "acteurRef": "PA719072",
      "dateCosignature": "2019-10-16+02:00",
      "edite": false
    },
    {
      "acteurRef": "PA719882",
      "dateCosignature": "2019-10-16+02:00",
      "edite": false
    },
    {
      "acteurRef": "PA719130",
      "dateCosignature": "2019-10-16+02:00",
      "edite": false
    },
    {
      "acteurRef": "PA720738",
      "dateCosignature": "2019-10-16+02:00",
      "edite": false
    },
    {
      "acteurRef": "PA719668",
      "dateCosignature": "2019-10-16+02:00",
      "edite": false
    },
    {
      "acteurRef": "PA719456",
      "dateCosignature": "2019-10-16+02:00",
      "edite": false
    },
    {
      "acteurRef": "PA719242",
      "dateCosignature": "2019-10-16+02:00",
      "edite": false
    },
    {
      "acteurRef": "PA721876",
      "dateCosignature": "2019-10-16+02:00",
      "edite": false
    },
    {
      "acteurRef": "PA719850",
      "dateCosignature": "2019-10-16+02:00",
      "edite": false
    },
    {
      "acteurRef": "PA720908",
      "dateCosignature": "2019-10-16+02:00",
      "edite": false
    },
    {
      "acteurRef": "PA721656",
      "dateCosignature": "2019-10-16+02:00",
      "edite": false
    },
    {
      "acteurRef": "PA719520",
      "dateCosignature": "2019-10-16+02:00",
      "edite": false
    },
    {
      "acteurRef": "PA719364",
      "dateCosignature": "2019-10-16+02:00",
      "edite": false
    },
    {
      "acteurRef": "PA720108",
      "dateCosignature": "2019-10-16+02:00",
      "edite": false
    },
    {
      "acteurRef": "PA720492",
      "dateCosignature": "2019-10-16+02:00",
      "edite": false
    },
    {
      "acteurRef": "PA720402",
      "dateCosignature": "2019-10-16+02:00",
      "edite": false
    },
    {
      "acteurRef": "PA719632",
      "dateCosignature": "2019-10-16+02:00",
      "edite": false
    },
    {
      "acteurRef": "PA719202",
      "dateCosignature": "2019-10-16+02:00",
      "edite": false
    },
    {
      "acteurRef": "PA720944",
      "dateCosignature": "2019-10-16+02:00",
      "edite": false
    },
    {
      "acteurRef": "PA607595",
      "dateCosignature": "2019-10-16+02:00",
      "edite": false
    },
    {
      "acteurRef": "PA718802",
      "dateCosignature": "2019-10-16+02:00",
      "edite": false
    },
    {
      "acteurRef": "PA720414",
      "dateCosignature": "2019-10-16+02:00",
      "edite": false
    },
    {
      "acteurRef": "PA718930",
      "dateCosignature": "2019-10-16+02:00",
      "edite": false
    },
    {
      "acteurRef": "PA722090",
      "dateCosignature": "2019-10-16+02:00",
      "edite": false
    },
    {
      "acteurRef": "PA720500",
      "dateCosignature": "2019-10-16+02:00",
      "edite": false
    },
    {
      "acteurRef": "PA718736",
      "dateCosignature": "2019-10-16+02:00",
      "edite": false
    },
    {
      "acteurRef": "PA721710",
      "dateCosignature": "2019-10-16+02:00",
      "edite": false
    },
    {
      "acteurRef": "PA721372",
      "dateCosignature": "2019-10-16+02:00",
      "edite": false
    },
    {
      "acteurRef": "PA720512",
      "dateCosignature": "2019-10-16+02:00",
      "edite": false
    },
    {
      "acteurRef": "PA721844",
      "dateCosignature": "2019-10-16+02:00",
      "edite": false
    },
    {
      "acteurRef": "PA718910",
      "dateCosignature": "2019-10-16+02:00",
      "edite": false
    },
    {
      "acteurRef": "PA609520",
      "dateCosignature": "2019-10-16+02:00",
      "edite": false
    },
    {
      "acteurRef": "PA2449",
      "dateCosignature": "2019-10-16+02:00",
      "edite": false
    },
    {
      "acteurRef": "PA719528",
      "dateCosignature": "2019-10-16+02:00",
      "edite": false
    },
    {
      "acteurRef": "PA720590",
      "dateCosignature": "2019-10-16+02:00",
      "edite": false
    },
    {
      "acteurRef": "PA719600",
      "dateCosignature": "2019-10-16+02:00",
      "edite": false
    },
    {
      "acteurRef": "PA721916",
      "dateCosignature": "2019-10-16+02:00",
      "edite": false
    },
    {
      "acteurRef": "PA722194",
      "dateCosignature": "2019-10-16+02:00",
      "edite": false
    },
    {
      "acteurRef": "PA643127",
      "dateCosignature": "2019-10-16+02:00",
      "edite": false
    },
    {
      "acteurRef": "PA718944",
      "dateCosignature": "2019-10-16+02:00",
      "edite": false
    },
    {
      "acteurRef": "PA721888",
      "dateCosignature": "2019-10-16+02:00",
      "edite": false
    },
    {
      "acteurRef": "PA720552",
      "dateCosignature": "2019-10-16+02:00",
      "edite": false
    },
    {
      "acteurRef": "PA722398",
      "dateCosignature": "2019-10-16+02:00",
      "edite": false
    },
    {
      "acteurRef": "PA720900",
      "dateCosignature": "2019-10-16+02:00",
      "edite": false
    },
    {
      "acteurRef": "PA721426",
      "dateCosignature": "2019-10-16+02:00",
      "edite": false
    },
    {
      "acteurRef": "PA720066",
      "dateCosignature": "2019-10-16+02:00",
      "edite": false
    },
    {
      "acteurRef": "PA722252",
      "dateCosignature": "2019-10-16+02:00",
      "edite": false
    },
    {
      "acteurRef": "PA718810",
      "dateCosignature": "2019-10-16+02:00",
      "edite": false
    },
    {
      "acteurRef": "PA722022",
      "dateCosignature": "2019-10-16+02:00",
      "edite": false
    },
    {
      "acteurRef": "PA721458",
      "dateCosignature": "2019-10-16+02:00",
      "edite": false
    },
    {
      "acteurRef": "PA721600",
      "dateCosignature": "2019-10-16+02:00",
      "edite": false
    },
    {
      "acteurRef": "PA343493",
      "dateCosignature": "2019-10-16+02:00",
      "edite": false
    },
    {
      "acteurRef": "PA718902",
      "dateCosignature": "2019-10-16+02:00",
      "edite": false
    },
    {
      "acteurRef": "PA722292",
      "dateCosignature": "2019-10-16+02:00",
      "edite": false
    },
    {
      "acteurRef": "PA332747",
      "dateCosignature": "2019-10-16+02:00",
      "edite": false
    },
    {
      "acteurRef": "PA720878",
      "dateCosignature": "2019-10-16+02:00",
      "edite": false
    },
    {
      "acteurRef": "PA720138",
      "dateCosignature": "2019-10-16+02:00",
      "edite": false
    },
    {
      "acteurRef": "PA719972",
      "dateCosignature": "2019-10-16+02:00",
      "edite": false
    },
    {
      "acteurRef": "PA722078",
      "dateCosignature": "2019-10-16+02:00",
      "edite": false
    },
    {
      "acteurRef": "PA720780",
      "dateCosignature": "2019-10-16+02:00",
      "edite": false
    },
    {
      "acteurRef": "PA720960",
      "dateCosignature": "2019-10-16+02:00",
      "edite": false
    },
    {
      "acteurRef": "PA719592",
      "dateCosignature": "2019-10-16+02:00",
      "edite": false
    },
    {
      "acteurRef": "PA346876",
      "dateCosignature": "2019-10-16+02:00",
      "edite": false
    },
    {
      "acteurRef": "PA719420",
      "dateCosignature": "2019-10-16+02:00",
      "edite": false
    },
    {
      "acteurRef": "PA720190",
      "dateCosignature": "2019-10-16+02:00",
      "edite": false
    },
    {
      "acteurRef": "PA720754",
      "dateCosignature": "2019-10-16+02:00",
      "edite": false
    },
    {
      "acteurRef": "PA722118",
      "dateCosignature": "2019-10-16+02:00",
      "edite": false
    },
    {
      "acteurRef": "PA720952",
      "dateCosignature": "2019-10-16+02:00",
      "edite": false
    },
    {
      "acteurRef": "PA719350",
      "dateCosignature": "2019-10-16+02:00",
      "edite": false
    },
    {
      "acteurRef": "PA721690",
      "dateCosignature": "2019-10-16+02:00",
      "edite": false
    },
    {
      "acteurRef": "PA719550",
      "dateCosignature": "2019-10-16+02:00",
      "edite": false
    },
    {
      "acteurRef": "PA721584",
      "dateCosignature": "2019-10-16+02:00",
      "edite": false
    },
    {
      "acteurRef": "PA720854",
      "dateCosignature": "2019-10-16+02:00",
      "edite": false
    },
    {
      "acteurRef": "PA722336",
      "dateCosignature": "2019-10-16+02:00",
      "edite": false
    },
    {
      "acteurRef": "PA719822",
      "dateCosignature": "2019-10-16+02:00",
      "edite": false
    },
    {
      "acteurRef": "PA720830",
      "dateCosignature": "2019-10-16+02:00",
      "edite": false
    },
    {
      "acteurRef": "PA719302",
      "dateCosignature": "2019-10-16+02:00",
      "edite": false
    },
    {
      "acteurRef": "PA720014",
      "dateCosignature": "2019-10-16+02:00",
      "edite": false
    },
    {
      "acteurRef": "PA334768",
      "dateCosignature": "2019-10-16+02:00",
      "edite": false
    },
    {
      "acteurRef": "PA2828",
      "dateCosignature": "2019-10-16+02:00",
      "edite": false
    },
    {
      "acteurRef": "PA719540",
      "dateCosignature": "2019-10-16+02:00",
      "edite": false
    },
    {
      "acteurRef": "PA607395",
      "dateCosignature": "2019-10-16+02:00",
      "edite": false
    },
    {
      "acteurRef": "PA720394",
      "dateCosignature": "2019-10-16+02:00",
      "edite": false
    },
    {
      "acteurRef": "PA718682",
      "dateCosignature": "2019-10-16+02:00",
      "edite": false
    },
    {
      "acteurRef": "PA719092",
      "dateCosignature": "2019-10-16+02:00",
      "edite": false
    },
    {
      "acteurRef": "PA718768",
      "dateCosignature": "2019-10-16+02:00",
      "edite": false
    },
    {
      "acteurRef": "PA718728",
      "dateCosignature": "2019-10-16+02:00",
      "edite": false
    },
    {
      "acteurRef": "PA722240",
      "dateCosignature": "2019-10-16+02:00",
      "edite": false
    },
    {
      "acteurRef": "PA642788",
      "dateCosignature": "2019-10-16+02:00",
      "edite": false
    },
    {
      "acteurRef": "PA721542",
      "dateCosignature": "2019-10-16+02:00",
      "edite": false
    },
    {
      "acteurRef": "PA722102",
      "dateCosignature": "2019-10-16+02:00",
      "edite": false
    },
    {
      "acteurRef": "PA606639",
      "dateCosignature": "2019-10-16+02:00",
      "edite": false
    },
    {
      "acteurRef": "PA719512",
      "dateCosignature": "2019-10-16+02:00",
      "edite": false
    },
    {
      "acteurRef": "PA722260",
      "dateCosignature": "2019-10-16+02:00",
      "edite": false
    },
    {
      "acteurRef": "PA721262",
      "dateCosignature": "2019-10-16+02:00",
      "edite": false
    },
    {
      "acteurRef": "PA722268",
      "dateCosignature": "2019-10-16+02:00",
      "edite": false
    },
    {
      "acteurRef": "PA720318",
      "dateCosignature": "2019-10-16+02:00",
      "edite": false
    },
    {
      "acteurRef": "PA718962",
      "dateCosignature": "2019-10-16+02:00",
      "edite": false
    }
  ],
  "depotAmendements": {
    "amendementsSeance": {
      "amendable": false
    },
    "amendementsCommission": [
      {
        "organeRef": "PO59051",
        "amendable": true
      }
    ]
  }
}