{
  "xsiType": "avisConseilEtat_Type",
  "uid": "AVCEANR5L15B1481",
  "legislature": "15",
  "cycleDeVie": {
    "chrono": {
      "dateCreation": "2018-12-05T00:00:00.000+01:00",
      "dateDepot": "2018-12-05T00:00:00.000+01:00",
      "datePublication": "2019-02-19T00:00:00.000+01:00",
      "datePublicationWeb": "2018-12-05T19:30:00.000+01:00"
    }
  },
  "denominationStructurelle": "Projet de loi",
  "provenance": "Texte Déposé",
  "titres": {
    "titrePrincipal": "Avis du Conseil d'Etat sur le projet de loi pour une école de la confiance",
    "titrePrincipalCourt": "École de la confiance"
  },
  "dossierRef": "DLR5L15N37055",
  "classification": {
    "famille": {
      "depot": {
        "code": "INITDEP",
        "libelle": "Initiative en 1er Dépôt"
      },
      "classe": {
        "code": "PRJLOI",
        "libelle": "Projet de loi"
      }
    },
    "type": {
      "code": "AVCE",
      "libelle": "Avis du Conseil d'Etat"
    }
  },
  "auteurs": [
    {
      "acteur": {
        "acteurRef": "PA345619",
        "qualite": "auteur"
      }
    }
  ],
  "notice": {
    "numNotice": "1481",
    "formule": "pour une école de la confiance",
    "adoptionConforme": false
  }
}