{
  "xsiType": "texteLoi_Type",
  "uid": "PRJLSNR5S319B0718",
  "cycleDeVie": {
    "chrono": {
      "dateCreation": "2019-09-11T00:00:00.000+02:00",
      "dateDepot": "2019-09-11T00:00:00.000+02:00"
    }
  },
  "denominationStructurelle": "Projet de loi",
  "provenance": "Texte Déposé",
  "titres": {
    "titrePrincipal": "projet de loi ratifiant l’ordonnance n° 2019-700 du 3 juillet 2019 relative aux entrepreneurs de spectacles vivants",
    "titrePrincipalCourt": "ratifiant l’ordonnance n° 2019-700 du 3 juillet 2019 relative aux entrepreneurs de spectacles vivants"
  },
  "dossierRef": "DLR5L15N37733",
  "classification": {
    "famille": {
      "depot": {
        "code": "INITDEP",
        "libelle": "Initiative en 1er Dépôt"
      },
      "classe": {
        "code": "PRJLOI",
        "libelle": "Projet de loi"
      }
    },
    "type": {
      "code": "PRJL",
      "libelle": "Projet de loi"
    }
  },
  "auteurs": [
    {
      "acteur": {
        "acteurRef": "PA345619",
        "qualite": "auteur"
      }
    }
  ],
  "notice": {
    "numNotice": "718",
    "formule": "ratifiant l’ordonnance n° 2019-700 du 3 juillet 2019 relative aux entrepreneurs de spectacles vivants",
    "adoptionConforme": false
  },
  "coSignataires": [
    {
      "acteurRef": "PA335758",
      "dateCosignature": "2019-09-11+02:00",
      "edite": true
    }
  ],
  "depotAmendements": {
    "amendementsSeance": {
      "amendable": false
    }
  }
}