{
  "xsiType": "rapportParlementaire_Type",
  "uid": "RAPPANR5L15B1059",
  "legislature": "15",
  "cycleDeVie": {
    "chrono": {
      "dateCreation": "2018-06-13T00:00:00.000+02:00",
      "dateDepot": "2018-06-13T00:00:00.000+02:00",
      "datePublication": "2018-06-26T00:00:00.000+02:00",
      "datePublicationWeb": "2018-06-22T17:15:00.000+02:00"
    }
  },
  "denominationStructurelle": "Rapport",
  "provenance": "Commission",
  "titres": {
    "titrePrincipal": "rapport  sur le projet de loi, adopté par le Sénat, après engagement de la procédure accélérée, ratifiant l'ordonnance n° 2017-157 du 9 février 2017 étendant et adaptant à la Polynésie française certaines dispositions du livre IV du code de commerce relatives aux contrôles et aux sanctions en matière de concurrence (n°859).",
    "titrePrincipalCourt": "rapport  sur le projet de loi, adopté par le Sénat, après engagement de la procédure accélérée, ratifiant l'ordonnance n° 2017-157 du 9 février 2017 étendant et adaptant à la Polynésie française certaines dispositions du livre IV du code de commerce relatives aux contrôles et aux sanctions en matière de concurrence (n°859)."
  },
  "divisions": [
    {
      "xsiType": "rapportParlementaire_Type",
      "uid": "RAPPANR5L15B1059-COMPA",
      "legislature": "15",
      "cycleDeVie": {
        "chrono": {
          "dateCreation": "2018-06-13T00:00:00.000+02:00",
          "dateDepot": "2018-06-13T00:00:00.000+02:00",
          "datePublicationWeb": "2018-06-14T10:10:00.000+02:00"
        }
      },
      "denominationStructurelle": "Annexe Texte comparatif COMPA",
      "titres": {
        "titrePrincipal": "Texte comparatif",
        "titrePrincipalCourt": "Texte comparatif"
      },
      "dossierRef": "DLR5L15N36430",
      "classification": {
        "type": {
          "code": "RAPP",
          "libelle": "Rapport"
        },
        "sousType": {
          "code": "COMPA",
          "libelle": "Texte comparatif"
        },
        "statutAdoption": "ADOPTCOM"
      },
      "auteurs": [
        {
          "acteur": {
            "acteurRef": "PA719994",
            "qualite": "rapporteur"
          }
        },
        {
          "organeRef": "PO59051"
        }
      ],
      "notice": {
        "numNotice": "1059",
        "formule": "sur le projet de loi, adopté par le Sénat, après engagement de la procédure accélérée, ratifiant l'ordonnance n° 2017-157 du 9 février 2017 étendant et adaptant à la Polynésie française certaines dispositions du livre IV du code de commerce relatives aux contrôles et aux sanctions en matière de concurrence (n°859).",
        "adoptionConforme": false
      }
    }
  ],
  "dossierRef": "DLR5L15N36430",
  "classification": {
    "famille": {
      "depot": {
        "code": "RAPINIT",
        "libelle": "Rapport sur une initiative"
      },
      "classe": {
        "code": "RAPPORT",
        "libelle": "Rapport"
      }
    },
    "type": {
      "code": "RAPP",
      "libelle": "Rapport"
    },
    "statutAdoption": "ADOPTCOM"
  },
  "auteurs": [
    {
      "acteur": {
        "acteurRef": "PA719994",
        "qualite": "rapporteur"
      }
    },
    {
      "organeRef": "PO59051"
    }
  ],
  "notice": {
    "numNotice": "1059",
    "formule": "sur le projet de loi, adopté par le Sénat, après engagement de la procédure accélérée, ratifiant l'ordonnance n° 2017-157 du 9 février 2017 étendant et adaptant à la Polynésie française certaines dispositions du livre IV du code de commerce relatives aux contrôles et aux sanctions en matière de concurrence (n°859).",
    "adoptionConforme": false
  },
  "imprimerie": {
    "prix": "1.5"
  }
}