{
  "xsiType": "texteLoi_Type",
  "uid": "PIONANR5L15B1849",
  "legislature": "15",
  "cycleDeVie": {
    "chrono": {
      "dateCreation": "2019-04-01T00:00:00.000+02:00",
      "dateDepot": "2019-04-10T00:00:00.000+02:00",
      "datePublication": "2019-04-18T00:00:00.000+02:00",
      "datePublicationWeb": "2019-04-11T18:05:00.000+02:00"
    }
  },
  "denominationStructurelle": "Proposition de loi",
  "provenance": "Texte Déposé",
  "titres": {
    "titrePrincipal": "proposition de loi prévoyant la peine complémentaire d'interdiction du territoire suite à la commission de délits douaniers",
    "titrePrincipalCourt": "interdiction du territoire délits douaniers"
  },
  "dossierRef": "DLR5L15N37367",
  "classification": {
    "famille": {
      "depot": {
        "code": "INITDEP",
        "libelle": "Initiative en 1er Dépôt"
      },
      "classe": {
        "code": "PIONLOI",
        "libelle": "Proposition de loi"
      }
    },
    "type": {
      "code": "PION",
      "libelle": "Proposition de loi"
    }
  },
  "auteurs": [
    {
      "acteur": {
        "acteurRef": "PA267440",
        "qualite": "auteur"
      }
    }
  ],
  "notice": {
    "numNotice": "1849",
    "formule": "prévoyant la peine complémentaire d'interdiction du territoire suite à la commission de délits douaniers",
    "adoptionConforme": false
  },
  "coSignataires": [
    {
      "acteurRef": "PA721678",
      "dateCosignature": "2019-04-10+02:00",
      "edite": false
    },
    {
      "acteurRef": "PA608416",
      "dateCosignature": "2019-04-10+02:00",
      "edite": false
    },
    {
      "acteurRef": "PA334654",
      "dateCosignature": "2019-04-10+02:00",
      "edite": false
    },
    {
      "acteurRef": "PA767",
      "dateCosignature": "2019-04-10+02:00",
      "edite": false
    },
    {
      "acteurRef": "PA334843",
      "dateCosignature": "2019-04-10+02:00",
      "edite": false
    },
    {
      "acteurRef": "PA609245",
      "dateCosignature": "2019-04-10+02:00",
      "edite": false
    },
    {
      "acteurRef": "PA718784",
      "dateCosignature": "2019-04-10+02:00",
      "edite": false
    },
    {
      "acteurRef": "PA718838",
      "dateCosignature": "2019-04-10+02:00",
      "edite": false
    },
    {
      "acteurRef": "PA609726",
      "dateCosignature": "2019-04-10+02:00",
      "edite": false
    },
    {
      "acteurRef": "PA2492",
      "dateCosignature": "2019-04-10+02:00",
      "edite": false
    },
    {
      "acteurRef": "PA721816",
      "dateCosignature": "2019-04-10+02:00",
      "edite": false
    },
    {
      "acteurRef": "PA642847",
      "dateCosignature": "2019-04-10+02:00",
      "edite": false
    },
    {
      "acteurRef": "PA266797",
      "dateCosignature": "2019-04-10+02:00",
      "edite": false
    },
    {
      "acteurRef": "PA330240",
      "dateCosignature": "2019-04-10+02:00",
      "edite": false
    },
    {
      "acteurRef": "PA1874",
      "dateCosignature": "2019-04-10+02:00",
      "edite": false
    },
    {
      "acteurRef": "PA721636",
      "dateCosignature": "2019-04-10+02:00",
      "edite": false
    },
    {
      "acteurRef": "PA1327",
      "dateCosignature": "2019-04-10+02:00",
      "edite": false
    },
    {
      "acteurRef": "PA712015",
      "dateCosignature": "2019-04-10+02:00",
      "edite": false
    },
    {
      "acteurRef": "PA606712",
      "dateCosignature": "2019-04-10+02:00",
      "edite": false
    },
    {
      "acteurRef": "PA713448",
      "dateCosignature": "2019-04-10+02:00",
      "edite": false
    },
    {
      "acteurRef": "PA720210",
      "dateCosignature": "2019-04-10+02:00",
      "edite": false
    },
    {
      "acteurRef": "PA605991",
      "dateCosignature": "2019-04-10+02:00",
      "edite": false
    },
    {
      "acteurRef": "PA1630",
      "dateCosignature": "2019-04-10+02:00",
      "edite": false
    },
    {
      "acteurRef": "PA2377",
      "dateCosignature": "2019-04-10+02:00",
      "edite": false
    },
    {
      "acteurRef": "PA721968",
      "dateCosignature": "2019-04-10+02:00",
      "edite": false
    },
    {
      "acteurRef": "PA267330",
      "dateCosignature": "2019-04-10+02:00",
      "edite": false
    },
    {
      "acteurRef": "PA721410",
      "dateCosignature": "2019-04-10+02:00",
      "edite": false
    },
    {
      "acteurRef": "PA721486",
      "dateCosignature": "2019-04-10+02:00",
      "edite": false
    },
    {
      "acteurRef": "PA267766",
      "dateCosignature": "2019-04-10+02:00",
      "edite": false
    },
    {
      "acteurRef": "PA267527",
      "dateCosignature": "2019-04-10+02:00",
      "edite": false
    },
    {
      "acteurRef": "PA719318",
      "dateCosignature": "2019-04-10+02:00",
      "edite": false
    },
    {
      "acteurRef": "PA266788",
      "dateCosignature": "2019-04-10+02:00",
      "edite": false
    },
    {
      "acteurRef": "PA695100",
      "dateCosignature": "2019-04-10+02:00",
      "edite": false
    },
    {
      "acteurRef": "PA336316",
      "dateCosignature": "2019-04-10+02:00",
      "edite": false
    },
    {
      "acteurRef": "PA267735",
      "dateCosignature": "2019-04-10+02:00",
      "edite": false
    },
    {
      "acteurRef": "PA643134",
      "dateCosignature": "2019-04-10+02:00",
      "edite": false
    },
    {
      "acteurRef": "PA334149",
      "dateCosignature": "2019-04-10+02:00",
      "edite": false
    }
  ],
  "depotAmendements": {
    "amendementsSeance": {
      "amendable": false
    },
    "amendementsCommission": [
      {
        "organeRef": "PO59051",
        "amendable": true
      }
    ]
  }
}