{
  "xsiType": "texteLoi_Type",
  "uid": "PRJLSNR5S299B0342",
  "cycleDeVie": {
    "chrono": {
      "dateCreation": "2018-03-12T00:00:00.000+01:00",
      "dateDepot": "2018-03-07T00:00:00.000+01:00"
    }
  },
  "denominationStructurelle": "Projet de loi",
  "provenance": "Texte Déposé",
  "titres": {
    "titrePrincipal": "projet de loi ratifiant l'ordonnance n° 2017-1717 du 20 décembre 2017 portant transposition de la directive (UE) 2015/2302 du Parlement européen et du Conseil du 25 novembre 2015 relative aux voyages à forfait et aux prestations de voyage liées",
    "titrePrincipalCourt": "Voyages à forfait et prestations de voyage liées"
  },
  "dossierRef": "DLR5L15N36456",
  "classification": {
    "famille": {
      "depot": {
        "code": "INITDEP",
        "libelle": "Initiative en 1er Dépôt"
      },
      "classe": {
        "code": "PRJLOI",
        "libelle": "Projet de loi"
      }
    },
    "type": {
      "code": "PRJL",
      "libelle": "Projet de loi"
    }
  },
  "auteurs": [
    {
      "acteur": {
        "acteurRef": "PA345619",
        "qualite": "auteur"
      }
    }
  ],
  "notice": {
    "numNotice": "342",
    "formule": "ratifiant l'ordonnance n° 2017-1717 du 20 décembre 2017 portant transposition de la directive (UE) 2015/2302 du Parlement européen et du Conseil du 25 novembre 2015 relative aux voyages à forfait et aux prestations de voyage liées",
    "adoptionConforme": false
  },
  "coSignataires": [
    {
      "acteurRef": "PA331481",
      "dateCosignature": "2018-03-07+01:00",
      "edite": true
    }
  ],
  "depotAmendements": {
    "amendementsSeance": {
      "amendable": false
    }
  }
}