{
  "xsiType": "texteLoi_Type",
  "uid": "PNREANR5L15B1739",
  "legislature": "15",
  "cycleDeVie": {
    "chrono": {
      "dateCreation": "2019-03-06T00:00:00.000+01:00",
      "dateDepot": "2019-03-06T00:00:00.000+01:00",
      "datePublicationWeb": "2019-04-04T12:00:00.000+02:00"
    }
  },
  "denominationStructurelle": "Proposition de résolution",
  "provenance": "Texte Déposé",
  "titres": {
    "titrePrincipal": "proposition de résolution tendant à modifier le Règlement de l’Assemblée nationale et visant à faire présenter dans le rapport d’activité annuel de la délégation de l’Assemblée nationale à l’Assemblée parlementaire du Conseil de l’Europe une partie sur l’exécution des arrêts de la Cour européenne des droits de l’homme par la France et à en faire débattre l’Assemblée",
    "titrePrincipalCourt": "Exécution des arrêts de la CEDH"
  },
  "dossierRef": "DLR5L15N37311",
  "classification": {
    "famille": {
      "depot": {
        "code": "INITDEP",
        "libelle": "Initiative en 1er Dépôt"
      },
      "classe": {
        "code": "PIONRES",
        "libelle": "Proposition de résolution"
      },
      "espece": {
        "code": "MODREGLTAN",
        "libelle": "modifiant le Règlement de l'Assemblée nationale"
      }
    },
    "type": {
      "code": "PNRE",
      "libelle": "Proposition de résolution"
    },
    "sousType": {
      "code": "MODREGLTAN",
      "libelle": "modifiant le Règlement de l'Assemblée nationale"
    }
  },
  "auteurs": [
    {
      "acteur": {
        "acteurRef": "PA335054",
        "qualite": "auteur"
      }
    }
  ],
  "notice": {
    "numNotice": "1739",
    "formule": "tendant à modifier le Règlement de l’Assemblée nationale et visant à faire présenter dans le rapport d’activité annuel de la délégation de l’Assemblée nationale à l’Assemblée parlementaire du Conseil de l’Europe une partie sur l’exécution des arrêts de la Cour européenne des droits de l’homme par la France et à en faire débattre l’Assemblée",
    "adoptionConforme": false
  },
  "coSignataires": [
    {
      "acteurRef": "PA609590",
      "dateCosignature": "2019-03-06+01:00",
      "edite": true
    },
    {
      "dateCosignature": "2019-03-06+01:00",
      "edite": true,
      "organe": {
        "organeRef": "PO758835",
        "etApparentes": false
      }
    },
    {
      "acteurRef": "PA642764",
      "dateCosignature": "2019-03-06+01:00",
      "edite": false
    },
    {
      "acteurRef": "PA610681",
      "dateCosignature": "2019-03-06+01:00",
      "edite": false
    },
    {
      "acteurRef": "PA342415",
      "dateCosignature": "2019-03-06+01:00",
      "edite": false
    },
    {
      "acteurRef": "PA508",
      "dateCosignature": "2019-03-06+01:00",
      "edite": false
    },
    {
      "acteurRef": "PA267233",
      "dateCosignature": "2019-03-06+01:00",
      "edite": false
    },
    {
      "acteurRef": "PA605069",
      "dateCosignature": "2019-03-06+01:00",
      "edite": false
    },
    {
      "acteurRef": "PA429893",
      "dateCosignature": "2019-03-06+01:00",
      "edite": false
    },
    {
      "acteurRef": "PA1008",
      "dateCosignature": "2019-03-06+01:00",
      "edite": false
    },
    {
      "acteurRef": "PA1198",
      "dateCosignature": "2019-03-06+01:00",
      "edite": false
    },
    {
      "acteurRef": "PA609332",
      "dateCosignature": "2019-03-06+01:00",
      "edite": false
    },
    {
      "acteurRef": "PA333285",
      "dateCosignature": "2019-03-06+01:00",
      "edite": false
    },
    {
      "acteurRef": "PA1592",
      "dateCosignature": "2019-03-06+01:00",
      "edite": false
    },
    {
      "acteurRef": "PA333818",
      "dateCosignature": "2019-03-06+01:00",
      "edite": false
    },
    {
      "acteurRef": "PA332614",
      "dateCosignature": "2019-03-06+01:00",
      "edite": false
    },
    {
      "acteurRef": "PA1809",
      "dateCosignature": "2019-03-06+01:00",
      "edite": false
    },
    {
      "acteurRef": "PA337483",
      "dateCosignature": "2019-03-06+01:00",
      "edite": false
    },
    {
      "acteurRef": "PA720988",
      "dateCosignature": "2019-03-06+01:00",
      "edite": false
    },
    {
      "acteurRef": "PA335532",
      "dateCosignature": "2019-03-06+01:00",
      "edite": false
    },
    {
      "acteurRef": "PA608172",
      "dateCosignature": "2019-03-06+01:00",
      "edite": false
    },
    {
      "acteurRef": "PA607553",
      "dateCosignature": "2019-03-06+01:00",
      "edite": false
    },
    {
      "acteurRef": "PA608011",
      "dateCosignature": "2019-03-06+01:00",
      "edite": false
    },
    {
      "acteurRef": "PA340343",
      "dateCosignature": "2019-03-06+01:00",
      "edite": false
    },
    {
      "acteurRef": "PA608741",
      "dateCosignature": "2019-03-06+01:00",
      "edite": false
    },
    {
      "acteurRef": "PA608695",
      "dateCosignature": "2019-03-06+01:00",
      "edite": false
    },
    {
      "acteurRef": "PA643145",
      "dateCosignature": "2019-03-06+01:00",
      "edite": false
    },
    {
      "acteurRef": "PA719930",
      "dateCosignature": "2019-03-06+01:00",
      "edite": false
    },
    {
      "acteurRef": "PA340357",
      "dateCosignature": "2019-03-06+01:00",
      "edite": false
    }
  ]
}