{
  "xsiType": "rapportParlementaire_Type",
  "uid": "RAPPANR5L15B1955",
  "legislature": "15",
  "cycleDeVie": {
    "chrono": {
      "dateCreation": "2019-05-22T00:00:00.000+02:00",
      "dateDepot": "2019-05-22T00:00:00.000+02:00",
      "datePublicationWeb": "2019-05-24T21:50:00.000+02:00"
    }
  },
  "denominationStructurelle": "Rapport",
  "provenance": "Commission",
  "titres": {
    "titrePrincipal": "rapport sur la proposition de résolution de M. Richard Ferrand tendant à modifier le Règlement de l’Assemblée nationale (1882).",
    "titrePrincipalCourt": "rapport sur la proposition de résolution de M. Richard Ferrand tendant à modifier le Règlement de l’Assemblée nationale (1882)."
  },
  "divisions": [
    {
      "xsiType": "rapportParlementaire_Type",
      "uid": "RAPPANR5L15B1955-COMPA",
      "legislature": "15",
      "cycleDeVie": {
        "chrono": {
          "dateCreation": "2019-05-22T00:00:00.000+02:00",
          "dateDepot": "2019-05-22T00:00:00.000+02:00",
          "datePublicationWeb": "2019-05-22T14:45:00.000+02:00"
        }
      },
      "denominationStructurelle": "Annexe Texte comparatif COMPA",
      "titres": {
        "titrePrincipal": "Texte comparatif",
        "titrePrincipalCourt": "Texte comparatif"
      },
      "dossierRef": "DLR5L15N37446",
      "classification": {
        "type": {
          "code": "RAPP",
          "libelle": "Rapport"
        },
        "sousType": {
          "code": "COMPA",
          "libelle": "Texte comparatif"
        },
        "statutAdoption": "ADOPTCOM"
      },
      "auteurs": [
        {
          "acteur": {
            "acteurRef": "PA720746",
            "qualite": "rapporteur"
          }
        },
        {
          "organeRef": "PO59051"
        }
      ],
      "notice": {
        "numNotice": "1955",
        "formule": "sur la proposition de résolution de M. Richard Ferrand tendant à modifier le Règlement de l’Assemblée nationale (1882).",
        "adoptionConforme": false
      }
    }
  ],
  "dossierRef": "DLR5L15N37446",
  "classification": {
    "famille": {
      "depot": {
        "code": "RAPINIT",
        "libelle": "Rapport sur une initiative"
      },
      "classe": {
        "code": "RAPPORT",
        "libelle": "Rapport"
      }
    },
    "type": {
      "code": "RAPP",
      "libelle": "Rapport"
    },
    "statutAdoption": "ADOPTCOM"
  },
  "auteurs": [
    {
      "acteur": {
        "acteurRef": "PA720746",
        "qualite": "rapporteur"
      }
    },
    {
      "organeRef": "PO59051"
    }
  ],
  "notice": {
    "numNotice": "1955",
    "formule": "sur la proposition de résolution de M. Richard Ferrand tendant à modifier le Règlement de l’Assemblée nationale (1882).",
    "adoptionConforme": false
  },
  "imprimerie": {
    "prix": "7.5"
  }
}