{
  "xsiType": "texteLoi_Type",
  "uid": "PNREANR5L15B1151",
  "legislature": "15",
  "cycleDeVie": {
    "chrono": {
      "dateCreation": "2018-07-11T00:00:00.000+02:00",
      "dateDepot": "2018-07-11T00:00:00.000+02:00",
      "datePublication": "2018-07-23T00:00:00.000+02:00",
      "datePublicationWeb": "2018-07-17T12:50:00.000+02:00"
    }
  },
  "denominationStructurelle": "Proposition de résolution",
  "provenance": "Texte Déposé",
  "titres": {
    "titrePrincipal": "proposition de résolution tendant à la création d’une commission d’enquête sur les ventes d’armes des entreprises françaises et notre indépendance politique à cet égard",
    "titrePrincipalCourt": "Ventes d'armes des entreprises françaises"
  },
  "dossierRef": "DLR5L15N36778",
  "classification": {
    "famille": {
      "depot": {
        "code": "INITDEP",
        "libelle": "Initiative en 1er Dépôt"
      },
      "classe": {
        "code": "PIONRES",
        "libelle": "Proposition de résolution"
      },
      "espece": {
        "code": "COMENQ",
        "libelle": "tendant à la création d'une commission d'enquête"
      }
    },
    "type": {
      "code": "PNRE",
      "libelle": "Proposition de résolution"
    },
    "sousType": {
      "code": "COMENQ",
      "libelle": "tendant à la création d'une commission d'enquête"
    }
  },
  "auteurs": [
    {
      "acteur": {
        "acteurRef": "PA721932",
        "qualite": "auteur"
      }
    }
  ],
  "notice": {
    "numNotice": "1151",
    "formule": "tendant à la création d’une commission d’enquête sur les ventes d’armes des entreprises françaises et notre indépendance politique à cet égard",
    "adoptionConforme": false
  }
}