{
  "xsiType": "texteLoi_Type",
  "uid": "PIONANR5L15B2217",
  "legislature": "15",
  "cycleDeVie": {
    "chrono": {
      "dateCreation": "2019-07-26T00:00:00.000+02:00",
      "dateDepot": "2019-09-11T00:00:00.000+02:00",
      "datePublication": "2019-09-20T00:00:00.000+02:00",
      "datePublicationWeb": "2019-09-12T11:55:00.000+02:00"
    }
  },
  "denominationStructurelle": "Proposition de loi",
  "provenance": "Texte Déposé",
  "titres": {
    "titrePrincipal": "proposition de loi relative à l'obligation de déclarer son nouveau domicile en mairie",
    "titrePrincipalCourt": "déclaration de domiciliation"
  },
  "dossierRef": "DLR5L15N37685",
  "classification": {
    "famille": {
      "depot": {
        "code": "INITDEP",
        "libelle": "Initiative en 1er Dépôt"
      },
      "classe": {
        "code": "PIONLOI",
        "libelle": "Proposition de loi"
      }
    },
    "type": {
      "code": "PION",
      "libelle": "Proposition de loi"
    }
  },
  "auteurs": [
    {
      "acteur": {
        "acteurRef": "PA266797",
        "qualite": "auteur"
      }
    }
  ],
  "notice": {
    "numNotice": "2217",
    "formule": "relative à l'obligation de déclarer son nouveau domicile en mairie",
    "adoptionConforme": false
  },
  "coSignataires": [
    {
      "acteurRef": "PA608826",
      "dateCosignature": "2019-09-11+02:00",
      "edite": false
    },
    {
      "acteurRef": "PA719318",
      "dateCosignature": "2019-09-11+02:00",
      "edite": false
    },
    {
      "acteurRef": "PA721046",
      "dateCosignature": "2019-09-11+02:00",
      "edite": false
    },
    {
      "acteurRef": "PA642847",
      "dateCosignature": "2019-09-11+02:00",
      "edite": false
    },
    {
      "acteurRef": "PA721410",
      "dateCosignature": "2019-09-11+02:00",
      "edite": false
    },
    {
      "acteurRef": "PA721816",
      "dateCosignature": "2019-09-11+02:00",
      "edite": false
    },
    {
      "acteurRef": "PA767",
      "dateCosignature": "2019-09-11+02:00",
      "edite": false
    },
    {
      "acteurRef": "PA332523",
      "dateCosignature": "2019-09-11+02:00",
      "edite": false
    },
    {
      "acteurRef": "PA1012",
      "dateCosignature": "2019-09-11+02:00",
      "edite": false
    },
    {
      "acteurRef": "PA720684",
      "dateCosignature": "2019-09-11+02:00",
      "edite": false
    },
    {
      "acteurRef": "PA267324",
      "dateCosignature": "2019-09-11+02:00",
      "edite": false
    },
    {
      "acteurRef": "PA605991",
      "dateCosignature": "2019-09-11+02:00",
      "edite": false
    },
    {
      "acteurRef": "PA1498",
      "dateCosignature": "2019-09-11+02:00",
      "edite": false
    },
    {
      "acteurRef": "PA1630",
      "dateCosignature": "2019-09-11+02:00",
      "edite": false
    },
    {
      "acteurRef": "PA608416",
      "dateCosignature": "2019-09-11+02:00",
      "edite": false
    },
    {
      "acteurRef": "PA721506",
      "dateCosignature": "2019-09-11+02:00",
      "edite": false
    },
    {
      "acteurRef": "PA609245",
      "dateCosignature": "2019-09-11+02:00",
      "edite": false
    },
    {
      "acteurRef": "PA608016",
      "dateCosignature": "2019-09-11+02:00",
      "edite": false
    },
    {
      "acteurRef": "PA720644",
      "dateCosignature": "2019-09-11+02:00",
      "edite": false
    },
    {
      "acteurRef": "PA721636",
      "dateCosignature": "2019-09-11+02:00",
      "edite": false
    },
    {
      "acteurRef": "PA718784",
      "dateCosignature": "2019-09-11+02:00",
      "edite": false
    },
    {
      "acteurRef": "PA719946",
      "dateCosignature": "2019-09-11+02:00",
      "edite": false
    },
    {
      "acteurRef": "PA2377",
      "dateCosignature": "2019-09-11+02:00",
      "edite": false
    },
    {
      "acteurRef": "PA2492",
      "dateCosignature": "2019-09-11+02:00",
      "edite": false
    },
    {
      "acteurRef": "PA721070",
      "dateCosignature": "2019-09-11+02:00",
      "edite": false
    },
    {
      "acteurRef": "PA721678",
      "dateCosignature": "2019-09-11+02:00",
      "edite": false
    },
    {
      "acteurRef": "PA2529",
      "dateCosignature": "2019-09-11+02:00",
      "edite": false
    },
    {
      "acteurRef": "PA330788",
      "dateCosignature": "2019-09-11+02:00",
      "edite": false
    },
    {
      "acteurRef": "PA721314",
      "dateCosignature": "2019-09-11+02:00",
      "edite": false
    },
    {
      "acteurRef": "PA721474",
      "dateCosignature": "2019-09-11+02:00",
      "edite": false
    },
    {
      "acteurRef": "PA336316",
      "dateCosignature": "2019-09-11+02:00",
      "edite": false
    },
    {
      "acteurRef": "PA606712",
      "dateCosignature": "2019-09-11+02:00",
      "edite": false
    },
    {
      "acteurRef": "PA266808",
      "dateCosignature": "2019-09-11+02:00",
      "edite": false
    }
  ],
  "depotAmendements": {
    "amendementsSeance": {
      "amendable": false
    },
    "amendementsCommission": [
      {
        "organeRef": "PO59051",
        "amendable": true
      }
    ]
  }
}