{
  "xsiType": "texteLoi_Type",
  "uid": "PRJLANR5L15BTC0094",
  "legislature": "15",
  "cycleDeVie": {
    "chrono": {
      "dateCreation": "2017-07-12T00:00:00.000+02:00",
      "dateDepot": "2017-07-12T00:00:00.000+02:00",
      "datePublication": "2017-07-18T00:00:00.000+02:00",
      "datePublicationWeb": "2017-07-12T18:00:00.000+02:00"
    }
  },
  "denominationStructurelle": "Projet de loi",
  "provenance": "Texte Déposé",
  "titres": {
    "titrePrincipal": "projet de loi sur le projet de loi, après engagement de la procédure accélérée, ratifiant l’ordonnance n° 2017-48 du 19 janvier 2017 relative à la profession de physicien médical et l’ordonnance n° 2017-50 du 19 janvier 2017 relative à la reconnaissance des qualifications professionnelles dans le domaine de la santé (n°7).",
    "titrePrincipalCourt": "reconnaissance des qualifications professionnelles dans le domaine de la santé"
  },
  "dossierRef": "DLR5L15N35846",
  "classification": {
    "famille": {
      "depot": {
        "code": "INITDEP",
        "libelle": "Initiative en 1er Dépôt"
      },
      "classe": {
        "code": "PRJLOI",
        "libelle": "Projet de loi"
      }
    },
    "type": {
      "code": "PRJL",
      "libelle": "Projet de loi"
    },
    "statutAdoption": "ADOPTCOM"
  },
  "auteurs": [
    {
      "acteur": {
        "acteurRef": "PA719540",
        "qualite": "rapporteur"
      }
    },
    {
      "organeRef": "PO420120"
    }
  ],
  "notice": {
    "numNotice": "94",
    "formule": "sur le projet de loi, après engagement de la procédure accélérée, ratifiant l’ordonnance n° 2017-48 du 19 janvier 2017 relative à la profession de physicien médical et l’ordonnance n° 2017-50 du 19 janvier 2017 relative à la reconnaissance des qualifications professionnelles dans le domaine de la santé (n°7).",
    "adoptionConforme": false
  },
  "imprimerie": {
    "prix": "3.0"
  },
  "depotAmendements": {
    "amendementsSeance": {
      "amendable": true
    },
    "amendementsCommission": [
      {
        "organeRef": "PO420120",
        "amendable": true
      }
    ]
  }
}