{
  "xsiType": "DossierResolutionAN",
  "uid": "DLR5L15N37789",
  "legislature": "15",
  "titreDossier": {
    "titre": "Suivi médical des habitants sur les territoires touchés par l'incendie de l'usine Lubrizol à Rouen",
    "titreChemin": "suivi_medical_incendie_usine_lubrizol"
  },
  "procedureParlementaire": {
    "code": "22",
    "libelle": "Résolution Article 34-1"
  },
  "initiateur": {
    "acteurs": [
      {
        "acteurRef": "PA267233",
        "mandatRef": "PM723500"
      }
    ]
  },
  "actesLegislatifs": [
    {
      "xsiType": "Etape_Type",
      "uid": "L15-ANLUNI-37789",
      "codeActe": "ANLUNI",
      "libelleActe": {
        "nomCanonique": "Lecture unique"
      },
      "organeRef": "PO717460",
      "actesLegislatifs": [
        {
          "xsiType": "DepotInitiative_Type",
          "uid": "L15-VD190880DI",
          "codeActe": "ANLUNI-DEPOT",
          "libelleActe": {
            "nomCanonique": "1er dépôt d'une initiative.",
            "libelleCourt": "1er dépôt d'une initiative."
          },
          "organeRef": "PO717460",
          "dateActe": "2019-10-02T00:00:00.000+02:00",
          "texteAssocieRef": "PNREANR5L15B2282"
        }
      ]
    }
  ]
}