{
  "xsiType": "texteLoi_Type",
  "uid": "RINFANR5L15B1439",
  "legislature": "15",
  "cycleDeVie": {
    "chrono": {
      "dateCreation": "2018-11-21T00:00:00.000+01:00",
      "dateDepot": "2018-11-21T00:00:00.000+01:00",
      "datePublication": "2018-12-07T00:00:00.000+01:00",
      "datePublicationWeb": "2018-12-11T13:30:00.000+01:00"
    }
  },
  "denominationStructurelle": "Rapport d'information",
  "provenance": "Commission",
  "titres": {
    "titrePrincipal": "rapport d'information déposé en application de l'article 145 du règlement, par la commission des affaires étrangères, en conclusion des travaux d'une mission d'information sur la refondation démocratique de l'Union européenne",
    "titrePrincipalCourt": "rapport d'information déposé en application de l'article 145 du règlement, par la commission des affaires étrangères, en conclusion des travaux d'une mission d'information sur la refondation démocratique de l'Union européenne"
  },
  "dossierRef": "DLR5L15N37020",
  "classification": {
    "famille": {
      "depot": {
        "code": "RAPAUT",
        "libelle": "Rapport autonome"
      },
      "classe": {
        "code": "RAPINF",
        "libelle": "Rapport d'information"
      },
      "espece": {
        "code": "MINFOCOMPER",
        "libelle": "d'une mission d'information constituée au sein d'une commission permanente"
      }
    },
    "type": {
      "code": "RINF",
      "libelle": "Rapport d'information"
    },
    "sousType": {
      "code": "MINFOCOMPER",
      "libelle": "d'une mission d'information constituée au sein d'une commission permanente"
    }
  },
  "auteurs": [
    {
      "acteur": {
        "acteurRef": "PA719464",
        "qualite": "rapporteur"
      }
    },
    {
      "acteur": {
        "acteurRef": "PA2492",
        "qualite": "rapporteur"
      }
    },
    {
      "organeRef": "PO59047"
    }
  ],
  "notice": {
    "numNotice": "1439",
    "formule": "déposé en application de l'article 145 du règlement, par la commission des affaires étrangères, en conclusion des travaux d'une mission d'information sur la refondation démocratique de l'Union européenne",
    "adoptionConforme": false
  },
  "imprimerie": {
    "prix": "3.5"
  }
}