{
  "xsiType": "texteLoi_Type",
  "uid": "PIONANR5L15B2050",
  "legislature": "15",
  "cycleDeVie": {
    "chrono": {
      "dateCreation": "2019-06-13T00:00:00.000+02:00",
      "dateDepot": "2019-06-19T00:00:00.000+02:00",
      "datePublication": "2019-06-27T00:00:00.000+02:00",
      "datePublicationWeb": "2019-06-20T10:45:00.000+02:00"
    }
  },
  "denominationStructurelle": "Proposition de loi",
  "provenance": "Texte Déposé",
  "titres": {
    "titrePrincipal": "proposition de loi relative à l'application du délai de rétractation du droit de la consommation aux foires et salons",
    "titrePrincipalCourt": "délai rétractation foires et salons"
  },
  "dossierRef": "DLR5L15N37550",
  "classification": {
    "famille": {
      "depot": {
        "code": "INITDEP",
        "libelle": "Initiative en 1er Dépôt"
      },
      "classe": {
        "code": "PIONLOI",
        "libelle": "Proposition de loi"
      }
    },
    "type": {
      "code": "PION",
      "libelle": "Proposition de loi"
    }
  },
  "auteurs": [
    {
      "acteur": {
        "acteurRef": "PA266808",
        "qualite": "auteur"
      }
    }
  ],
  "notice": {
    "numNotice": "2050",
    "formule": "relative à l'application du délai de rétractation du droit de la consommation aux foires et salons",
    "adoptionConforme": false
  },
  "imprimerie": {
    "nbPage": "0"
  },
  "coSignataires": [
    {
      "acteurRef": "PA267204",
      "dateCosignature": "2019-06-19+02:00",
      "edite": false
    },
    {
      "acteurRef": "PA721678",
      "dateCosignature": "2019-06-19+02:00",
      "edite": false
    },
    {
      "acteurRef": "PA712015",
      "dateCosignature": "2019-06-19+02:00",
      "edite": false
    },
    {
      "acteurRef": "PA2492",
      "dateCosignature": "2019-06-19+02:00",
      "edite": false
    },
    {
      "acteurRef": "PA709315",
      "dateCosignature": "2019-06-19+02:00",
      "edite": false
    },
    {
      "acteurRef": "PA718884",
      "dateCosignature": "2019-06-19+02:00",
      "edite": false
    },
    {
      "acteurRef": "PA718784",
      "dateCosignature": "2019-06-19+02:00",
      "edite": false
    },
    {
      "acteurRef": "PA720586",
      "dateCosignature": "2019-06-19+02:00",
      "edite": false
    },
    {
      "acteurRef": "PA718780",
      "dateCosignature": "2019-06-19+02:00",
      "edite": false
    },
    {
      "acteurRef": "PA721046",
      "dateCosignature": "2019-06-19+02:00",
      "edite": false
    },
    {
      "acteurRef": "PA721070",
      "dateCosignature": "2019-06-19+02:00",
      "edite": false
    },
    {
      "acteurRef": "PA609245",
      "dateCosignature": "2019-06-19+02:00",
      "edite": false
    },
    {
      "acteurRef": "PA266797",
      "dateCosignature": "2019-06-19+02:00",
      "edite": false
    },
    {
      "acteurRef": "PA267260",
      "dateCosignature": "2019-06-19+02:00",
      "edite": false
    },
    {
      "acteurRef": "PA608416",
      "dateCosignature": "2019-06-19+02:00",
      "edite": false
    },
    {
      "acteurRef": "PA267318",
      "dateCosignature": "2019-06-19+02:00",
      "edite": false
    },
    {
      "acteurRef": "PA721474",
      "dateCosignature": "2019-06-19+02:00",
      "edite": false
    },
    {
      "acteurRef": "PA721410",
      "dateCosignature": "2019-06-19+02:00",
      "edite": false
    },
    {
      "acteurRef": "PA332523",
      "dateCosignature": "2019-06-19+02:00",
      "edite": false
    },
    {
      "acteurRef": "PA1327",
      "dateCosignature": "2019-06-19+02:00",
      "edite": false
    },
    {
      "acteurRef": "PA719318",
      "dateCosignature": "2019-06-19+02:00",
      "edite": false
    },
    {
      "acteurRef": "PA267440",
      "dateCosignature": "2019-07-16+02:00",
      "edite": false
    },
    {
      "acteurRef": "PA642847",
      "dateCosignature": "2019-07-22+02:00",
      "edite": false
    },
    {
      "acteurRef": "PA330909",
      "dateCosignature": "2019-07-23+02:00",
      "edite": false
    }
  ],
  "depotAmendements": {
    "amendementsSeance": {
      "amendable": false
    },
    "amendementsCommission": [
      {
        "organeRef": "PO419610",
        "amendable": true
      }
    ]
  }
}