{
  "xsiType": "texteLoi_Type",
  "uid": "PIONANR5L15BTC1622",
  "legislature": "15",
  "cycleDeVie": {
    "chrono": {
      "dateCreation": "2019-01-30T00:00:00.000+01:00",
      "dateDepot": "2019-01-30T00:00:00.000+01:00",
      "datePublication": "2019-02-04T00:00:00.000+01:00",
      "datePublicationWeb": "2019-01-30T16:45:00.000+01:00"
    }
  },
  "denominationStructurelle": "Proposition de loi",
  "provenance": "Texte Déposé",
  "titres": {
    "titrePrincipal": "proposition de loi organique  sur la proposition de loi organique, adoptée par le Sénat après engagement de la procédure accélérée, relative à la nomination du directeur général de l'Agence nationale de la cohésion des territoires (n°1394).",
    "titrePrincipalCourt": "Directeur général de l'Agence nationale de la cohésion des territoires"
  },
  "dossierRef": "DLR5L15N36933",
  "classification": {
    "famille": {
      "depot": {
        "code": "INITNAV",
        "libelle": "Initiative en Navette"
      },
      "classe": {
        "code": "PIONLOI",
        "libelle": "Proposition de loi"
      },
      "espece": {
        "code": "ORG",
        "libelle": "organique"
      }
    },
    "type": {
      "code": "PION",
      "libelle": "Proposition de loi"
    },
    "sousType": {
      "code": "ORG",
      "libelle": "organique",
      "libelleEdition": "organique"
    },
    "statutAdoption": "ADOPTCOM"
  },
  "auteurs": [
    {
      "acteur": {
        "acteurRef": "PA719616",
        "qualite": "rapporteur"
      }
    },
    {
      "organeRef": "PO59051"
    }
  ],
  "notice": {
    "numNotice": "1622",
    "formule": "sur la proposition de loi organique, adoptée par le Sénat après engagement de la procédure accélérée, relative à la nomination du directeur général de l'Agence nationale de la cohésion des territoires (n°1394).",
    "adoptionConforme": false
  },
  "imprimerie": {
    "nbPage": "0",
    "prix": "0.75"
  },
  "depotAmendements": {
    "amendementsSeance": {
      "amendable": true
    },
    "amendementsCommission": [
      {
        "organeRef": "PO419865",
        "amendable": true
      },
      {
        "organeRef": "PO59051",
        "amendable": true
      }
    ]
  }
}