{
  "xsiType": "texteLoi_Type",
  "uid": "PIONANR5L15B0254",
  "legislature": "15",
  "cycleDeVie": {
    "chrono": {
      "dateCreation": "2017-09-29T00:00:00.000+02:00",
      "dateDepot": "2017-10-03T00:00:00.000+02:00",
      "datePublication": "2017-10-13T00:00:00.000+02:00",
      "datePublicationWeb": "2017-10-10T11:00:00.000+02:00"
    }
  },
  "denominationStructurelle": "Proposition de loi",
  "provenance": "Texte Déposé",
  "titres": {
    "titrePrincipal": "proposition de loi d'orientation et de programmation pour la sécurité intérieure et la justice",
    "titrePrincipalCourt": "sécurité intérieure"
  },
  "dossierRef": "DLR5L15N35994",
  "classification": {
    "famille": {
      "depot": {
        "code": "INITDEP",
        "libelle": "Initiative en 1er Dépôt"
      },
      "classe": {
        "code": "PIONLOI",
        "libelle": "Proposition de loi"
      }
    },
    "type": {
      "code": "PION",
      "libelle": "Proposition de loi"
    }
  },
  "auteurs": [
    {
      "acteur": {
        "acteurRef": "PA330240",
        "qualite": "auteur"
      }
    }
  ],
  "notice": {
    "numNotice": "254",
    "formule": "d'orientation et de programmation pour la sécurité intérieure et la justice",
    "adoptionConforme": false
  },
  "coSignataires": [
    {
      "acteurRef": "PA643134",
      "dateCosignature": "2017-10-03+02:00",
      "edite": false
    },
    {
      "acteurRef": "PA340853",
      "dateCosignature": "2017-10-03+02:00",
      "edite": false
    },
    {
      "acteurRef": "PA330788",
      "dateCosignature": "2017-10-03+02:00",
      "edite": false
    },
    {
      "acteurRef": "PA345722",
      "dateCosignature": "2017-10-03+02:00",
      "edite": false
    },
    {
      "acteurRef": "PA2796",
      "dateCosignature": "2017-10-03+02:00",
      "edite": false
    },
    {
      "acteurRef": "PA2529",
      "dateCosignature": "2017-10-03+02:00",
      "edite": false
    },
    {
      "acteurRef": "PA266774",
      "dateCosignature": "2017-10-03+02:00",
      "edite": false
    },
    {
      "acteurRef": "PA605991",
      "dateCosignature": "2017-10-03+02:00",
      "edite": false
    },
    {
      "acteurRef": "PA1029",
      "dateCosignature": "2017-10-03+02:00",
      "edite": false
    },
    {
      "acteurRef": "PA267318",
      "dateCosignature": "2017-10-03+02:00",
      "edite": false
    },
    {
      "acteurRef": "PA721314",
      "dateCosignature": "2017-10-03+02:00",
      "edite": false
    },
    {
      "acteurRef": "PA998",
      "dateCosignature": "2017-10-03+02:00",
      "edite": false
    },
    {
      "acteurRef": "PA718838",
      "dateCosignature": "2017-10-03+02:00",
      "edite": false
    },
    {
      "acteurRef": "PA267794",
      "dateCosignature": "2017-10-03+02:00",
      "edite": false
    },
    {
      "acteurRef": "PA2960",
      "dateCosignature": "2017-10-03+02:00",
      "edite": false
    },
    {
      "acteurRef": "PA718884",
      "dateCosignature": "2017-10-03+02:00",
      "edite": false
    },
    {
      "acteurRef": "PA721968",
      "dateCosignature": "2017-10-03+02:00",
      "edite": false
    },
    {
      "acteurRef": "PA609726",
      "dateCosignature": "2017-10-03+02:00",
      "edite": false
    },
    {
      "acteurRef": "PA2377",
      "dateCosignature": "2017-10-03+02:00",
      "edite": false
    },
    {
      "acteurRef": "PA267429",
      "dateCosignature": "2017-10-03+02:00",
      "edite": false
    },
    {
      "acteurRef": "PA606098",
      "dateCosignature": "2017-10-03+02:00",
      "edite": false
    },
    {
      "acteurRef": "PA605036",
      "dateCosignature": "2017-10-03+02:00",
      "edite": false
    },
    {
      "acteurRef": "PA608016",
      "dateCosignature": "2017-10-03+02:00",
      "edite": false
    },
    {
      "acteurRef": "PA267260",
      "dateCosignature": "2017-10-03+02:00",
      "edite": false
    },
    {
      "acteurRef": "PA720100",
      "dateCosignature": "2017-10-03+02:00",
      "edite": false
    },
    {
      "acteurRef": "PA267204",
      "dateCosignature": "2017-10-03+02:00",
      "edite": false
    },
    {
      "acteurRef": "PA330684",
      "dateCosignature": "2017-10-03+02:00",
      "edite": false
    },
    {
      "acteurRef": "PA608826",
      "dateCosignature": "2017-10-03+02:00",
      "edite": false
    },
    {
      "acteurRef": "PA334654",
      "dateCosignature": "2017-10-03+02:00",
      "edite": false
    }
  ],
  "depotAmendements": {
    "amendementsSeance": {
      "amendable": false
    },
    "amendementsCommission": [
      {
        "organeRef": "PO59051",
        "amendable": true
      }
    ]
  }
}