{
  "xsiType": "texteLoi_Type",
  "uid": "PRJLSNR5S299BTC0280",
  "cycleDeVie": {
    "chrono": {
      "dateCreation": "2018-02-15T00:00:00.000+01:00",
      "dateDepot": "2018-02-07T00:00:00.000+01:00",
      "datePublicationWeb": "2018-02-07T14:00:00.000+01:00"
    }
  },
  "denominationStructurelle": "Projet de loi",
  "provenance": "Texte Déposé",
  "titres": {
    "titrePrincipal": "projet de loi  sur le projet de loi, adopté, par l'Assemblée nationale après engagement de la procédure accélérée, autorisant l'approbation de l'amendement au protocole de Montréal du 16 septembre 1987 relatif à des substances qui appauvrissent la couche d'ozone (n°186).",
    "titrePrincipalCourt": "Protocole Montréal couche d'ozone"
  },
  "dossierRef": "DLR5L15N36031",
  "classification": {
    "famille": {
      "depot": {
        "code": "INITNAV",
        "libelle": "Initiative en Navette"
      },
      "classe": {
        "code": "PRJLOI",
        "libelle": "Projet de loi"
      },
      "espece": {
        "code": "AUTRATCONV",
        "libelle": "autorisant la ratification d'une convention"
      }
    },
    "type": {
      "code": "PRJL",
      "libelle": "Projet de loi"
    },
    "sousType": {
      "code": "AUTRATCONV",
      "libelle": "autorisant la ratification d'une convention",
      "libelleEdition": "autorisant la ratification d'une convention"
    }
  },
  "auteurs": [
    {
      "acteur": {
        "acteurRef": "PA736227",
        "qualite": "rapporteur"
      }
    },
    {
      "organeRef": "PO211491"
    }
  ],
  "notice": {
    "numNotice": "280",
    "formule": "sur le projet de loi, adopté, par l'Assemblée nationale après engagement de la procédure accélérée, autorisant l'approbation de l'amendement au protocole de Montréal du 16 septembre 1987 relatif à des substances qui appauvrissent la couche d'ozone (n°186).",
    "adoptionConforme": false
  },
  "imprimerie": {
    "nbPage": "0"
  },
  "depotAmendements": {
    "amendementsSeance": {
      "amendable": false
    }
  }
}