{
  "xsiType": "texteLoi_Type",
  "uid": "PIONANR5L15B0788",
  "legislature": "15",
  "cycleDeVie": {
    "chrono": {
      "dateCreation": "2018-03-19T00:00:00.000+01:00",
      "dateDepot": "2018-03-21T00:00:00.000+01:00",
      "datePublication": "2018-03-27T00:00:00.000+02:00",
      "datePublicationWeb": "2018-03-22T20:00:00.000+01:00"
    }
  },
  "denominationStructurelle": "Proposition de loi",
  "provenance": "Texte Déposé",
  "titres": {
    "titrePrincipal": "proposition de loi visant à renforcer l’intégrité des mandats électifs et de la représentation nationale",
    "titrePrincipalCourt": "intégrité des élus"
  },
  "dossierRef": "DLR5L15N36477",
  "classification": {
    "famille": {
      "depot": {
        "code": "INITDEP",
        "libelle": "Initiative en 1er Dépôt"
      },
      "classe": {
        "code": "PIONLOI",
        "libelle": "Proposition de loi"
      }
    },
    "type": {
      "code": "PION",
      "libelle": "Proposition de loi"
    }
  },
  "auteurs": [
    {
      "acteur": {
        "acteurRef": "PA721118",
        "qualite": "auteur"
      }
    }
  ],
  "notice": {
    "numNotice": "788",
    "formule": "visant à renforcer l’intégrité des mandats électifs et de la représentation nationale",
    "adoptionConforme": false
  },
  "coSignataires": [
    {
      "acteurRef": "PA610634",
      "dateCosignature": "2018-03-21+01:00",
      "edite": false
    },
    {
      "acteurRef": "PA441",
      "dateCosignature": "2018-03-21+01:00",
      "edite": false
    },
    {
      "acteurRef": "PA720546",
      "dateCosignature": "2018-03-21+01:00",
      "edite": false
    },
    {
      "acteurRef": "PA689",
      "dateCosignature": "2018-03-21+01:00",
      "edite": false
    },
    {
      "acteurRef": "PA267306",
      "dateCosignature": "2018-03-21+01:00",
      "edite": false
    },
    {
      "acteurRef": "PA718720",
      "dateCosignature": "2018-03-21+01:00",
      "edite": false
    },
    {
      "acteurRef": "PA721896",
      "dateCosignature": "2018-03-21+01:00",
      "edite": false
    },
    {
      "acteurRef": "PA722202",
      "dateCosignature": "2018-03-21+01:00",
      "edite": false
    },
    {
      "acteurRef": "PA335612",
      "dateCosignature": "2018-03-21+01:00",
      "edite": false
    },
    {
      "acteurRef": "PA610654",
      "dateCosignature": "2018-03-21+01:00",
      "edite": false
    },
    {
      "acteurRef": "PA721270",
      "dateCosignature": "2018-03-21+01:00",
      "edite": false
    },
    {
      "acteurRef": "PA718902",
      "dateCosignature": "2018-03-21+01:00",
      "edite": false
    },
    {
      "acteurRef": "PA722110",
      "dateCosignature": "2018-03-21+01:00",
      "edite": false
    },
    {
      "acteurRef": "PA721062",
      "dateCosignature": "2019-02-19+01:00",
      "edite": false
    },
    {
      "acteurRef": "PA721012",
      "dateCosignature": "2019-02-19+01:00",
      "edite": false
    },
    {
      "acteurRef": "PA719286",
      "dateCosignature": "2019-02-19+01:00",
      "edite": false
    }
  ],
  "depotAmendements": {
    "amendementsSeance": {
      "amendable": true
    },
    "amendementsCommission": [
      {
        "organeRef": "PO59051",
        "amendable": true
      }
    ]
  }
}