{
  "xsiType": "texteLoi_Type",
  "uid": "AVISANR5L15B1621",
  "legislature": "15",
  "cycleDeVie": {
    "chrono": {
      "dateCreation": "2019-01-30T00:00:00.000+01:00",
      "dateDepot": "2019-01-30T00:00:00.000+01:00",
      "datePublication": "2019-02-11T00:00:00.000+01:00",
      "datePublicationWeb": "2019-02-06T19:00:00.000+01:00"
    }
  },
  "denominationStructurelle": "Avis",
  "provenance": "Commission",
  "titres": {
    "titrePrincipal": "avis  sur la proposition de loi, adoptée par le Sénat après engagement de la procédure accélérée, portant création d'une Agence nationale de la cohésion des territoires (n°1393).",
    "titrePrincipalCourt": "avis  sur la proposition de loi, adoptée par le Sénat après engagement de la procédure accélérée, portant création d'une Agence nationale de la cohésion des territoires (n°1393)."
  },
  "dossierRef": "DLR5L15N36915",
  "classification": {
    "famille": {
      "depot": {
        "code": "RAPINIT",
        "libelle": "Rapport sur une initiative"
      },
      "classe": {
        "code": "AVIS",
        "libelle": "Avis"
      }
    },
    "type": {
      "code": "AVIS",
      "libelle": "Avis"
    }
  },
  "auteurs": [
    {
      "acteur": {
        "acteurRef": "PA719310",
        "qualite": "rapporteur pour avis"
      }
    },
    {
      "organeRef": "PO419610"
    }
  ],
  "notice": {
    "numNotice": "1621",
    "formule": "sur la proposition de loi, adoptée par le Sénat après engagement de la procédure accélérée, portant création d'une Agence nationale de la cohésion des territoires (n°1393).",
    "adoptionConforme": false
  },
  "imprimerie": {
    "nbPage": "61",
    "prix": "1.5"
  }
}