{
  "xsiType": "DossierResolutionAN",
  "uid": "DLR5L15N37116",
  "legislature": "15",
  "titreDossier": {
    "titre": "Recherche, sciences et techniques : moratoire international interdisant la modification génomique",
    "titreChemin": "moratoire_international_interdiction_modification_genomique"
  },
  "procedureParlementaire": {
    "code": "22",
    "libelle": "Résolution Article 34-1"
  },
  "initiateur": {
    "acteurs": [
      {
        "acteurRef": "PA721932",
        "mandatRef": "PM734586"
      }
    ]
  },
  "actesLegislatifs": [
    {
      "xsiType": "Etape_Type",
      "uid": "L15-ANLUNI-37116",
      "codeActe": "ANLUNI",
      "libelleActe": {
        "nomCanonique": "Lecture unique"
      },
      "organeRef": "PO717460",
      "actesLegislatifs": [
        {
          "xsiType": "DepotInitiative_Type",
          "uid": "L15-VD187941DI",
          "codeActe": "ANLUNI-DEPOT",
          "libelleActe": {
            "nomCanonique": "1er dépôt d'une initiative.",
            "libelleCourt": "1er dépôt d'une initiative."
          },
          "organeRef": "PO717460",
          "dateActe": "2018-12-21T00:00:00.000+01:00",
          "texteAssocieRef": "PNREANR5L15B1553"
        }
      ]
    }
  ]
}