{
  "xsiType": "texteLoi_Type",
  "uid": "PIONSNR5S299BTC0547",
  "cycleDeVie": {
    "chrono": {
      "dateCreation": "2018-06-11T00:00:00.000+02:00",
      "dateDepot": "2018-06-06T00:00:00.000+02:00",
      "datePublicationWeb": "2018-06-06T14:00:00.000+02:00"
    }
  },
  "denominationStructurelle": "Proposition de loi",
  "provenance": "Texte Déposé",
  "titres": {
    "titrePrincipal": "proposition de loi sur la proposition de loi de MM. Philippe Bas, Mathieu Darnaud, Bruno Retailleau et plusieurs de leurs collègues relative à l'équilibre territorial et à la vitalité de la démocratie locale (466).",
    "titrePrincipalCourt": "Equilibre territorial et vitalité de la démocratie locale"
  },
  "dossierRef": "DLR5L15N36689",
  "classification": {
    "famille": {
      "depot": {
        "code": "INITDEP",
        "libelle": "Initiative en 1er Dépôt"
      },
      "classe": {
        "code": "PIONLOI",
        "libelle": "Proposition de loi"
      }
    },
    "type": {
      "code": "PION",
      "libelle": "Proposition de loi"
    }
  },
  "auteurs": [
    {
      "acteur": {
        "acteurRef": "PA267340",
        "qualite": "rapporteur"
      }
    },
    {
      "organeRef": "PO211495"
    }
  ],
  "notice": {
    "numNotice": "547",
    "formule": "sur la proposition de loi de MM. Philippe Bas, Mathieu Darnaud, Bruno Retailleau et plusieurs de leurs collègues relative à l'équilibre territorial et à la vitalité de la démocratie locale (466).",
    "adoptionConforme": false
  },
  "depotAmendements": {
    "amendementsSeance": {
      "amendable": false
    }
  }
}