{
  "xsiType": "rapportParlementaire_Type",
  "uid": "RAPPSNR5S299B0234",
  "cycleDeVie": {
    "chrono": {
      "dateCreation": "2018-02-09T00:00:00.000+01:00",
      "dateDepot": "2018-01-24T00:00:00.000+01:00"
    }
  },
  "denominationStructurelle": "Rapport",
  "provenance": "Commission",
  "titres": {
    "titrePrincipal": "rapport  sur la proposition de loi, adoptée, par l'Assemblée nationale, créant un dispositif de don de jours de repos non pris au bénéfice des proches aidants de personnes en perte d'autonomie ou présentant un handicap (n°146).",
    "titrePrincipalCourt": "rapport  sur la proposition de loi, adoptée, par l'Assemblée nationale, créant un dispositif de don de jours de repos non pris au bénéfice des proches aidants de personnes en perte d'autonomie ou présentant un handicap (n°146)."
  },
  "dossierRef": "DLR5L15N35967",
  "classification": {
    "famille": {
      "depot": {
        "code": "RAPINIT",
        "libelle": "Rapport sur une initiative"
      },
      "classe": {
        "code": "RAPPORT",
        "libelle": "Rapport"
      }
    },
    "type": {
      "code": "RAPP",
      "libelle": "Rapport"
    }
  },
  "auteurs": [
    {
      "acteur": {
        "acteurRef": "PA736206",
        "qualite": "rapporteur"
      }
    },
    {
      "organeRef": "PO211493"
    }
  ],
  "notice": {
    "numNotice": "234",
    "formule": "sur la proposition de loi, adoptée, par l'Assemblée nationale, créant un dispositif de don de jours de repos non pris au bénéfice des proches aidants de personnes en perte d'autonomie ou présentant un handicap (n°146).",
    "adoptionConforme": false
  }
}