{
  "xsiType": "texteLoi_Type",
  "uid": "RINFANR5L15B1090",
  "legislature": "15",
  "cycleDeVie": {
    "chrono": {
      "dateCreation": "2018-06-19T00:00:00.000+02:00",
      "dateDepot": "2018-06-19T00:00:00.000+02:00",
      "datePublication": "2018-06-19T00:00:00.000+02:00",
      "datePublicationWeb": "2018-07-06T15:20:00.000+02:00"
    }
  },
  "denominationStructurelle": "Rapport d'information",
  "provenance": "Commission",
  "titres": {
    "titrePrincipal": "rapport d'information déposé par la délégation aux outre-mer sur la lutte contre les discriminations anti LGBT dans les outre-mer",
    "titrePrincipalCourt": "rapport d'information déposé par la délégation aux outre-mer sur la lutte contre les discriminations anti LGBT dans les outre-mer"
  },
  "dossierRef": "DLR5L15N36730",
  "classification": {
    "famille": {
      "depot": {
        "code": "RAPAUT",
        "libelle": "Rapport autonome"
      },
      "classe": {
        "code": "RAPINF",
        "libelle": "Rapport d'information"
      },
      "espece": {
        "code": "PRPDIT",
        "libelle": "tel quel"
      }
    },
    "type": {
      "code": "RINF",
      "libelle": "Rapport d'information"
    },
    "sousType": {
      "code": "PRPDIT",
      "libelle": "tel quel"
    }
  },
  "auteurs": [
    {
      "acteur": {
        "acteurRef": "PA719108",
        "qualite": "rapporteur"
      }
    },
    {
      "acteur": {
        "acteurRef": "PA610667",
        "qualite": "rapporteur"
      }
    },
    {
      "acteur": {
        "acteurRef": "PA718728",
        "qualite": "rapporteur"
      }
    },
    {
      "organeRef": "PO675659"
    }
  ],
  "notice": {
    "numNotice": "1090",
    "formule": "déposé par la délégation aux outre-mer sur la lutte contre les discriminations anti LGBT dans les outre-mer",
    "adoptionConforme": false
  },
  "imprimerie": {
    "prix": "3.5"
  }
}