{
  "xsiType": "texteLoi_Type",
  "uid": "PRJLSNR5S319B0660",
  "cycleDeVie": {
    "chrono": {
      "dateCreation": "2019-07-11T00:00:00.000+02:00",
      "dateDepot": "2019-07-10T00:00:00.000+02:00",
      "datePublication": "2019-09-27T00:00:00.000+02:00"
    }
  },
  "denominationStructurelle": "Projet de loi",
  "provenance": "Texte Déposé",
  "titres": {
    "titrePrincipal": "projet de loi relatif à la lutte contre le gaspillage et à l’économie circulaire",
    "titrePrincipalCourt": "relatif à la lutte contre le gaspillage et à l’économie circulaire"
  },
  "dossierRef": "DLR5L15N37641",
  "classification": {
    "famille": {
      "depot": {
        "code": "INITDEP",
        "libelle": "Initiative en 1er Dépôt"
      },
      "classe": {
        "code": "PRJLOI",
        "libelle": "Projet de loi"
      }
    },
    "type": {
      "code": "PRJL",
      "libelle": "Projet de loi"
    }
  },
  "auteurs": [
    {
      "acteur": {
        "acteurRef": "PA345619",
        "qualite": "auteur"
      }
    }
  ],
  "notice": {
    "numNotice": "660",
    "formule": "relatif à la lutte contre le gaspillage et à l’économie circulaire",
    "adoptionConforme": false
  },
  "imprimerie": {
    "nbPage": "0"
  },
  "coSignataires": [
    {
      "acteurRef": "PA721872",
      "dateCosignature": "2019-07-10+02:00",
      "edite": true
    },
    {
      "acteurRef": "PA332747",
      "dateCosignature": "2019-07-10+02:00",
      "edite": true
    }
  ],
  "depotAmendements": {
    "amendementsSeance": {
      "amendable": false
    }
  }
}