{
  "xsiType": "DossierResolutionAN",
  "uid": "DLR5L15N37496",
  "legislature": "15",
  "titreDossier": {
    "titre": "Anciens combattants : reconnaissance de la Nation aux immigrés vietnamiens, laotiens et cambodgiens",
    "titreChemin": "reconnaissance_immigres_vietnamiens_laotiens_cambodgiens_effort_guerre"
  },
  "procedureParlementaire": {
    "code": "22",
    "libelle": "Résolution Article 34-1"
  },
  "initiateur": {
    "acteurs": [
      {
        "acteurRef": "PA721718",
        "mandatRef": "PM723364"
      }
    ]
  },
  "actesLegislatifs": [
    {
      "xsiType": "Etape_Type",
      "uid": "L15-ANLUNI-37496",
      "codeActe": "ANLUNI",
      "libelleActe": {
        "nomCanonique": "Lecture unique"
      },
      "organeRef": "PO717460",
      "actesLegislatifs": [
        {
          "xsiType": "DepotInitiative_Type",
          "uid": "L15-VD189558DI",
          "codeActe": "ANLUNI-DEPOT",
          "libelleActe": {
            "nomCanonique": "1er dépôt d'une initiative.",
            "libelleCourt": "1er dépôt d'une initiative."
          },
          "organeRef": "PO717460",
          "dateActe": "2019-05-28T00:00:00.000+02:00",
          "texteAssocieRef": "PNREANR5L15B1979"
        },
        {
          "xsiType": "RetraitInitiative_Type",
          "uid": "L15-VD190087",
          "codeActe": "ANLUNI-RTRINI",
          "libelleActe": {
            "nomCanonique": "Retrait d'une initiative",
            "libelleCourt": "Retrait d'une initiative"
          },
          "organeRef": "PO717460",
          "dateActe": "2019-07-03T00:00:00.000+02:00",
          "texteAssocieRef": "PNREANR5L15B1979"
        }
      ]
    }
  ]
}