{
  "xsiType": "texteLoi_Type",
  "uid": "PIONANR5L15B1375",
  "legislature": "15",
  "cycleDeVie": {
    "chrono": {
      "dateCreation": "2018-10-30T00:00:00.000+01:00",
      "dateDepot": "2018-11-07T00:00:00.000+01:00",
      "datePublication": "2018-11-13T00:00:00.000+01:00",
      "datePublicationWeb": "2018-11-08T18:30:00.000+01:00"
    }
  },
  "denominationStructurelle": "Proposition de loi",
  "provenance": "Texte Déposé",
  "titres": {
    "titrePrincipal": "proposition de loi visant à faire reconnaître la protection de l'enfance maltraitée \"Grande cause nationale 2019\"",
    "titrePrincipalCourt": "reconnaissance de la protection de l'enfance maltraitée \"Grande cause nationale 2019\""
  },
  "dossierRef": "DLR5L15N36956",
  "classification": {
    "famille": {
      "depot": {
        "code": "INITDEP",
        "libelle": "Initiative en 1er Dépôt"
      },
      "classe": {
        "code": "PIONLOI",
        "libelle": "Proposition de loi"
      }
    },
    "type": {
      "code": "PION",
      "libelle": "Proposition de loi"
    }
  },
  "auteurs": [
    {
      "acteur": {
        "acteurRef": "PA719364",
        "qualite": "auteur"
      }
    }
  ],
  "notice": {
    "numNotice": "1375",
    "formule": "visant à faire reconnaître la protection de l'enfance maltraitée \"Grande cause nationale 2019\"",
    "adoptionConforme": false
  },
  "coSignataires": [
    {
      "acteurRef": "PA718710",
      "dateCosignature": "2018-11-07+01:00",
      "edite": false
    },
    {
      "acteurRef": "PA721434",
      "dateCosignature": "2018-11-07+01:00",
      "edite": false
    },
    {
      "acteurRef": "PA720560",
      "dateCosignature": "2018-11-07+01:00",
      "edite": false
    },
    {
      "acteurRef": "PA719858",
      "dateCosignature": "2018-11-07+01:00",
      "edite": false
    },
    {
      "acteurRef": "PA720854",
      "dateCosignature": "2018-11-07+01:00",
      "edite": false
    },
    {
      "acteurRef": "PA718876",
      "dateCosignature": "2018-11-07+01:00",
      "edite": false
    },
    {
      "acteurRef": "PA605963",
      "dateCosignature": "2018-11-07+01:00",
      "edite": false
    },
    {
      "acteurRef": "PA719162",
      "dateCosignature": "2018-11-07+01:00",
      "edite": false
    },
    {
      "acteurRef": "PA343493",
      "dateCosignature": "2018-11-07+01:00",
      "edite": false
    },
    {
      "acteurRef": "PA718990",
      "dateCosignature": "2018-11-07+01:00",
      "edite": false
    },
    {
      "acteurRef": "PA721246",
      "dateCosignature": "2018-11-07+01:00",
      "edite": false
    },
    {
      "acteurRef": "PA720178",
      "dateCosignature": "2018-11-07+01:00",
      "edite": false
    },
    {
      "acteurRef": "PA719480",
      "dateCosignature": "2018-11-07+01:00",
      "edite": false
    },
    {
      "acteurRef": "PA719512",
      "dateCosignature": "2018-11-07+01:00",
      "edite": false
    },
    {
      "acteurRef": "PA721372",
      "dateCosignature": "2018-11-07+01:00",
      "edite": false
    },
    {
      "acteurRef": "PA720500",
      "dateCosignature": "2018-11-07+01:00",
      "edite": false
    },
    {
      "acteurRef": "PA721234",
      "dateCosignature": "2018-11-07+01:00",
      "edite": false
    },
    {
      "acteurRef": "PA721860",
      "dateCosignature": "2018-11-07+01:00",
      "edite": false
    },
    {
      "acteurRef": "PA721784",
      "dateCosignature": "2018-11-07+01:00",
      "edite": false
    },
    {
      "acteurRef": "PA642724",
      "dateCosignature": "2018-11-07+01:00",
      "edite": false
    },
    {
      "acteurRef": "PA721624",
      "dateCosignature": "2018-11-07+01:00",
      "edite": false
    },
    {
      "acteurRef": "PA721514",
      "dateCosignature": "2018-11-07+01:00",
      "edite": false
    },
    {
      "acteurRef": "PA719326",
      "dateCosignature": "2018-11-07+01:00",
      "edite": false
    }
  ],
  "depotAmendements": {
    "amendementsSeance": {
      "amendable": false
    },
    "amendementsCommission": [
      {
        "organeRef": "PO420120",
        "amendable": true
      }
    ]
  }
}