{
  "xsiType": "DossierMissionControle_Type",
  "uid": "DLR5L15N37651",
  "legislature": "15",
  "titreDossier": {
    "titre": "Action aérospatiale de l'État",
    "titreChemin": "action_aerospatiale_etat"
  },
  "procedureParlementaire": {
    "code": "19",
    "libelle": "Rapport d'information sans mission"
  },
  "actesLegislatifs": [
    {
      "xsiType": "Etape_Type",
      "uid": "L15-AN20-37651",
      "codeActe": "AN20",
      "libelleActe": {
        "nomCanonique": "Travaux"
      },
      "organeRef": "PO717460",
      "actesLegislatifs": [
        {
          "xsiType": "DepotRapport_Type",
          "uid": "L15-VD190386",
          "codeActe": "AN20-RAPPORT",
          "libelleActe": {
            "nomCanonique": "Dépôt de rapport",
            "libelleCourt": "Dépôt de rapport"
          },
          "organeRef": "PO59046",
          "dateActe": "2019-07-17T00:00:00.000+02:00",
          "texteAssocieRef": "RINFANR5L15B2166"
        }
      ]
    }
  ]
}