{
  "xsiType": "texteLoi_Type",
  "uid": "PIONSNR5S319BTC0447",
  "cycleDeVie": {
    "chrono": {
      "dateCreation": "2019-04-16T00:00:00.000+02:00",
      "dateDepot": "2019-04-10T00:00:00.000+02:00",
      "datePublicationWeb": "2019-04-10T14:00:00.000+02:00"
    }
  },
  "denominationStructurelle": "Proposition de loi",
  "provenance": "Texte Déposé",
  "titres": {
    "titrePrincipal": "proposition de loi sur la proposition de loi de M. Jérôme Durain et plusieurs de ses collègues portant reconnaissance du crime d'écocide (384).",
    "titrePrincipalCourt": "Reconnaissance du crime d'écocide"
  },
  "dossierRef": "DLR5L15N37392",
  "classification": {
    "famille": {
      "depot": {
        "code": "INITDEP",
        "libelle": "Initiative en 1er Dépôt"
      },
      "classe": {
        "code": "PIONLOI",
        "libelle": "Proposition de loi"
      }
    },
    "type": {
      "code": "PION",
      "libelle": "Proposition de loi"
    }
  },
  "auteurs": [
    {
      "acteur": {
        "acteurRef": "PA708632",
        "qualite": "rapporteur"
      }
    },
    {
      "organeRef": "PO211495"
    }
  ],
  "notice": {
    "numNotice": "447",
    "formule": "sur la proposition de loi de M. Jérôme Durain et plusieurs de ses collègues portant reconnaissance du crime d'écocide (384).",
    "adoptionConforme": false
  },
  "depotAmendements": {
    "amendementsSeance": {
      "amendable": false
    }
  }
}