{
  "xsiType": "texteLoi_Type",
  "uid": "PNREANR5L15B0362",
  "legislature": "15",
  "cycleDeVie": {
    "chrono": {
      "dateCreation": "2017-11-02T00:00:00.000+01:00",
      "dateDepot": "2017-11-02T00:00:00.000+01:00",
      "datePublication": "2017-11-17T00:00:00.000+01:00",
      "datePublicationWeb": "2017-11-13T15:30:00.000+01:00"
    }
  },
  "denominationStructurelle": "Proposition de résolution",
  "provenance": "Texte Déposé",
  "titres": {
    "titrePrincipal": "proposition de résolution tendant à la création d'une commission d'enquête sur les inégalités d'accès à la pratique sportive dans notre pays",
    "titrePrincipalCourt": "Inégalités d'accès à la pratique sportive dans notre pays"
  },
  "dossierRef": "DLR5L15N36106",
  "classification": {
    "famille": {
      "depot": {
        "code": "INITDEP",
        "libelle": "Initiative en 1er Dépôt"
      },
      "classe": {
        "code": "PIONRES",
        "libelle": "Proposition de résolution"
      },
      "espece": {
        "code": "COMENQ",
        "libelle": "tendant à la création d'une commission d'enquête"
      }
    },
    "type": {
      "code": "PNRE",
      "libelle": "Proposition de résolution"
    },
    "sousType": {
      "code": "COMENQ",
      "libelle": "tendant à la création d'une commission d'enquête"
    }
  },
  "auteurs": [
    {
      "acteur": {
        "acteurRef": "PA689",
        "qualite": "auteur"
      }
    }
  ],
  "notice": {
    "numNotice": "362",
    "formule": "tendant à la création d'une commission d'enquête sur les inégalités d'accès à la pratique sportive dans notre pays",
    "adoptionConforme": false
  },
  "coSignataires": [
    {
      "acteurRef": "PA720546",
      "dateCosignature": "2017-11-02+01:00",
      "edite": false
    },
    {
      "acteurRef": "PA267306",
      "dateCosignature": "2017-11-02+01:00",
      "edite": false
    },
    {
      "acteurRef": "PA718926",
      "dateCosignature": "2017-11-02+01:00",
      "edite": false
    },
    {
      "acteurRef": "PA718720",
      "dateCosignature": "2017-11-02+01:00",
      "edite": false
    },
    {
      "acteurRef": "PA721896",
      "dateCosignature": "2017-11-02+01:00",
      "edite": false
    },
    {
      "acteurRef": "PA722202",
      "dateCosignature": "2017-11-02+01:00",
      "edite": false
    },
    {
      "acteurRef": "PA335612",
      "dateCosignature": "2017-11-02+01:00",
      "edite": false
    },
    {
      "acteurRef": "PA721270",
      "dateCosignature": "2017-11-02+01:00",
      "edite": false
    },
    {
      "acteurRef": "PA720692",
      "dateCosignature": "2017-11-02+01:00",
      "edite": false
    },
    {
      "acteurRef": "PA722110",
      "dateCosignature": "2017-11-02+01:00",
      "edite": false
    },
    {
      "acteurRef": "PA721226",
      "dateCosignature": "2017-11-02+01:00",
      "edite": false
    },
    {
      "acteurRef": "PA720286",
      "dateCosignature": "2017-11-02+01:00",
      "edite": false
    },
    {
      "acteurRef": "PA722142",
      "dateCosignature": "2017-11-02+01:00",
      "edite": false
    },
    {
      "acteurRef": "PA332614",
      "dateCosignature": "2017-11-02+01:00",
      "edite": false
    },
    {
      "acteurRef": "PA333818",
      "dateCosignature": "2017-11-02+01:00",
      "edite": false
    }
  ]
}