{
  "xsiType": "DossierResolutionAN",
  "uid": "DLR5L15N36799",
  "legislature": "15",
  "titreDossier": {
    "titre": "Agriculture et forêt : vin naturel",
    "titreChemin": "vin_naturel"
  },
  "procedureParlementaire": {
    "code": "8",
    "libelle": "Résolution"
  },
  "initiateur": {
    "acteurs": [
      {
        "acteurRef": "PA721932",
        "mandatRef": "PM734586"
      }
    ]
  },
  "actesLegislatifs": [
    {
      "xsiType": "Etape_Type",
      "uid": "L15-ANLUNI-36799",
      "codeActe": "ANLUNI",
      "libelleActe": {
        "nomCanonique": "Lecture unique"
      },
      "organeRef": "PO717460",
      "actesLegislatifs": [
        {
          "xsiType": "DepotInitiative_Type",
          "uid": "L15-VD186444DI",
          "codeActe": "ANLUNI-DEPOT",
          "libelleActe": {
            "nomCanonique": "1er dépôt d'une initiative.",
            "libelleCourt": "1er dépôt d'une initiative."
          },
          "organeRef": "PO717460",
          "dateActe": "2018-07-16T00:00:00.000+02:00",
          "texteAssocieRef": "PNREANR5L15B1167"
        },
        {
          "xsiType": "Etape_Type",
          "uid": "L15-ANLUNI-COM-36799",
          "codeActe": "ANLUNI-COM",
          "libelleActe": {
            "nomCanonique": "Travaux des commissions",
            "libelleCourt": "Travaux des commissions"
          },
          "organeRef": "PO717460",
          "actesLegislatifs": [
            {
              "xsiType": "Etape_Type",
              "uid": "L15-VD186445CF",
              "codeActe": "ANLUNI-COM-FOND",
              "libelleActe": {
                "nomCanonique": "Travaux de la commission saisie au fond",
                "libelleCourt": "Travaux de la commission saisie au fond"
              },
              "organeRef": "PO419610",
              "actesLegislatifs": [
                {
                  "xsiType": "SaisieComFond_Type",
                  "uid": "L15-VD186445CFS",
                  "codeActe": "ANLUNI-COM-FOND-SAISIE",
                  "libelleActe": {
                    "nomCanonique": "Renvoi en commission au fond",
                    "libelleCourt": "Renvoi en commission au fond"
                  },
                  "organeRef": "PO419610",
                  "dateActe": "2018-07-16T00:00:00.000+02:00"
                }
              ]
            }
          ]
        }
      ]
    }
  ]
}