{
  "xsiType": "DossierResolutionAN",
  "uid": "DLR5L15N36726",
  "legislature": "15",
  "titreDossier": {
    "titre": "Outre-mer",
    "titreChemin": "Resolution_Outre-mer"
  },
  "procedureParlementaire": {
    "code": "22",
    "libelle": "Résolution Article 34-1"
  },
  "initiateur": {
    "acteurs": [
      {
        "acteurRef": "PA720960",
        "mandatRef": "PM723124"
      }
    ]
  },
  "actesLegislatifs": [
    {
      "xsiType": "Etape_Type",
      "uid": "L15-ANLUNI-36726",
      "codeActe": "ANLUNI",
      "libelleActe": {
        "nomCanonique": "Lecture unique"
      },
      "organeRef": "PO717460",
      "actesLegislatifs": [
        {
          "xsiType": "DepotInitiative_Type",
          "uid": "L15-VD186017DI",
          "codeActe": "ANLUNI-DEPOT",
          "libelleActe": {
            "nomCanonique": "1er dépôt d'une initiative.",
            "libelleCourt": "1er dépôt d'une initiative."
          },
          "organeRef": "PO717460",
          "dateActe": "2018-06-18T00:00:00.000+02:00",
          "texteAssocieRef": "PNREANR5L15B1087"
        }
      ]
    }
  ]
}