{
  "xsiType": "DossierMissionControle_Type",
  "uid": "DLR5L15N37871",
  "legislature": "15",
  "titreDossier": {
    "titre": "Réforme européenne du droit d'asile",
    "titreChemin": "reforme_europeenne_droit_asile_rap-info"
  },
  "procedureParlementaire": {
    "code": "19",
    "libelle": "Rapport d'information sans mission"
  },
  "actesLegislatifs": [
    {
      "xsiType": "Etape_Type",
      "uid": "L15-AN20-37871",
      "codeActe": "AN20",
      "libelleActe": {
        "nomCanonique": "Travaux"
      },
      "organeRef": "PO717460",
      "actesLegislatifs": [
        {
          "xsiType": "DepotRapport_Type",
          "uid": "L15-VD191130",
          "codeActe": "AN20-RAPPORT",
          "libelleActe": {
            "nomCanonique": "Dépôt de rapport",
            "libelleCourt": "Dépôt de rapport"
          },
          "organeRef": "PO415287",
          "dateActe": "2019-10-17T00:00:00.000+02:00",
          "texteAssocieRef": "RINFANR5L15B2342"
        }
      ]
    }
  ]
}