{
  "xsiType": "rapportParlementaire_Type",
  "uid": "RAPPSNR5S299B0677",
  "cycleDeVie": {
    "chrono": {
      "dateCreation": "2018-07-24T00:00:00.000+02:00",
      "dateDepot": "2018-07-18T00:00:00.000+02:00"
    }
  },
  "denominationStructurelle": "Rapport",
  "provenance": "Commission",
  "titres": {
    "titrePrincipal": "rapport  sur la proposition de loi, adoptée, par l'Assemblée nationale après engagement de la procédure accélérée, relative à la lutte contre la manipulation de l'information (n°623).",
    "titrePrincipalCourt": "rapport  sur la proposition de loi, adoptée, par l'Assemblée nationale après engagement de la procédure accélérée, relative à la lutte contre la manipulation de l'information (n°623)."
  },
  "dossierRef": "DLR5L15N36488",
  "classification": {
    "famille": {
      "depot": {
        "code": "RAPINIT",
        "libelle": "Rapport sur une initiative"
      },
      "classe": {
        "code": "RAPPORT",
        "libelle": "Rapport"
      }
    },
    "type": {
      "code": "RAPP",
      "libelle": "Rapport"
    }
  },
  "auteurs": [
    {
      "acteur": {
        "acteurRef": "PA304017",
        "qualite": "rapporteur"
      }
    },
    {
      "organeRef": "PO211490"
    }
  ],
  "notice": {
    "numNotice": "677",
    "formule": "sur la proposition de loi, adoptée, par l'Assemblée nationale après engagement de la procédure accélérée, relative à la lutte contre la manipulation de l'information (n°623).",
    "adoptionConforme": false
  }
}