{
  "xsiType": "texteLoi_Type",
  "uid": "PRJLANR5L15BTC1175",
  "legislature": "15",
  "cycleDeVie": {
    "chrono": {
      "dateCreation": "2018-07-18T00:00:00.000+02:00",
      "dateDepot": "2018-07-18T00:00:00.000+02:00",
      "datePublication": "2018-07-27T00:00:00.000+02:00",
      "datePublicationWeb": "2018-07-23T16:30:00.000+02:00"
    }
  },
  "denominationStructurelle": "Projet de loi",
  "provenance": "Texte Déposé",
  "titres": {
    "titrePrincipal": "projet de loi , en nouvelle lecture, sur le projet de loi, modifié par le Sénat, pour l'équilibre des relations commerciales dans le secteur agricole et alimentaire et une alimentation saine, durable et accessible à tous (n°1135).",
    "titrePrincipalCourt": "Équilibre dans le secteur agricole et alimentaire"
  },
  "dossierRef": "DLR5L15N36336",
  "classification": {
    "famille": {
      "depot": {
        "code": "INITNAV",
        "libelle": "Initiative en Navette"
      },
      "classe": {
        "code": "PRJLOI",
        "libelle": "Projet de loi"
      }
    },
    "type": {
      "code": "PRJL",
      "libelle": "Projet de loi"
    },
    "statutAdoption": "ADOPTCOM"
  },
  "auteurs": [
    {
      "acteur": {
        "acteurRef": "PA719242",
        "qualite": "rapporteur"
      }
    },
    {
      "organeRef": "PO419610"
    }
  ],
  "notice": {
    "numNotice": "1175",
    "formule": ", en nouvelle lecture, sur le projet de loi, modifié par le Sénat, pour l'équilibre des relations commerciales dans le secteur agricole et alimentaire et une alimentation saine, durable et accessible à tous (n°1135).",
    "adoptionConforme": false
  },
  "imprimerie": {
    "prix": "5.5"
  },
  "depotAmendements": {
    "amendementsSeance": {
      "amendable": true
    },
    "amendementsCommission": [
      {
        "organeRef": "PO419610",
        "amendable": true
      }
    ]
  }
}