{
  "xsiType": "texteLoi_Type",
  "uid": "PRJLANR5L15B2416",
  "legislature": "15",
  "cycleDeVie": {
    "chrono": {
      "dateCreation": "2019-11-15T00:00:00.000+01:00",
      "dateDepot": "2019-11-15T00:00:00.000+01:00",
      "datePublication": "2019-11-22T00:00:00.000+01:00",
      "datePublicationWeb": "2019-11-18T15:00:00.000+01:00"
    }
  },
  "denominationStructurelle": "Projet de loi",
  "provenance": "Texte Déposé",
  "titres": {
    "titrePrincipal": "projet de loi de financement de la sécurité sociale pour 2020",
    "titrePrincipalCourt": "PLFSS pour 2020"
  },
  "dossierRef": "DLR5L15N37831",
  "classification": {
    "famille": {
      "depot": {
        "code": "INITNAV",
        "libelle": "Initiative en Navette"
      },
      "classe": {
        "code": "PRJLOI",
        "libelle": "Projet de loi"
      },
      "espece": {
        "code": "FINSSOC",
        "libelle": "de financement de la sécurité sociale"
      }
    },
    "type": {
      "code": "PRJL",
      "libelle": "Projet de loi"
    },
    "sousType": {
      "code": "FINSSOC",
      "libelle": "de financement de la sécurité sociale",
      "libelleEdition": "de financement de la sécurité sociale"
    }
  },
  "auteurs": [
    {
      "organeRef": "PO717460"
    }
  ],
  "notice": {
    "numNotice": "2416",
    "formule": ", adopté par l'Assemblée nationale, pour 2020",
    "adoptionConforme": false
  },
  "imprimerie": {
    "nbPage": "0"
  },
  "depotAmendements": {
    "amendementsSeance": {
      "amendable": false
    },
    "amendementsCommission": [
      {
        "organeRef": "PO420120",
        "amendable": true
      }
    ]
  }
}