{
  "xsiType": "texteLoi_Type",
  "uid": "PRJLANR5L15B1390",
  "legislature": "15",
  "cycleDeVie": {
    "chrono": {
      "dateCreation": "2018-11-08T00:00:00.000+01:00",
      "dateDepot": "2018-11-08T00:00:00.000+01:00",
      "datePublication": "2018-11-19T00:00:00.000+01:00",
      "datePublicationWeb": "2018-11-14T15:35:00.000+01:00"
    }
  },
  "denominationStructurelle": "Projet de loi",
  "provenance": "Texte Déposé",
  "titres": {
    "titrePrincipal": "projet de loi autorisant l'approbation de l'accord entre le Gouvernement de la République française et l'Autorité européenne des marchés financiers relatif au siège de l'Autorité et à ses privilèges et immunités sur le territoire français",
    "titrePrincipalCourt": "Accord sur le siège de l'Autorité européenne des marchés financiers"
  },
  "dossierRef": "DLR5L15N36751",
  "classification": {
    "famille": {
      "depot": {
        "code": "INITNAV",
        "libelle": "Initiative en Navette"
      },
      "classe": {
        "code": "PRJLOI",
        "libelle": "Projet de loi"
      },
      "espece": {
        "code": "AUTRATCONV",
        "libelle": "autorisant la ratification d'une convention"
      }
    },
    "type": {
      "code": "PRJL",
      "libelle": "Projet de loi"
    },
    "sousType": {
      "code": "AUTRATCONV",
      "libelle": "autorisant la ratification d'une convention",
      "libelleEdition": "autorisant la ratification d'une convention"
    }
  },
  "auteurs": [
    {
      "organeRef": "PO717460"
    }
  ],
  "notice": {
    "numNotice": "1390",
    "formule": ", adopté par le Sénat, autorisant l'approbation de l'accord entre le Gouvernement de la République française et l'Autorité européenne des marchés financiers relatif au siège de l'Autorité et à ses privilèges et immunités sur le territoire français",
    "adoptionConforme": false
  },
  "depotAmendements": {
    "amendementsSeance": {
      "amendable": true
    },
    "amendementsCommission": [
      {
        "organeRef": "PO59047",
        "amendable": true
      }
    ]
  }
}