{
  "xsiType": "texteLoi_Type",
  "uid": "PNREANR5L15B1878",
  "legislature": "15",
  "cycleDeVie": {
    "chrono": {
      "dateCreation": "2019-04-23T00:00:00.000+02:00",
      "dateDepot": "2019-04-23T00:00:00.000+02:00",
      "datePublication": "2019-05-02T00:00:00.000+02:00",
      "datePublicationWeb": "2019-04-24T11:15:00.000+02:00"
    }
  },
  "denominationStructurelle": "Proposition de résolution",
  "provenance": "Texte Déposé",
  "titres": {
    "titrePrincipal": "proposition de résolution tendant à la création d’une commission d’enquête sur les ventes d’armes de la France à l’Arabie saoudite et aux Émirats arabes unis et sur l’éventuelle utilisation de celles-ci pour commettre des crimes de guerre ou des crimes contre l’humanité à l’encontre de la population civile du Yémen",
    "titrePrincipalCourt": "ventes d’armes de la France à l’Arabie saoudite et aux Émirats arabes unis"
  },
  "dossierRef": "DLR5L15N37433",
  "classification": {
    "famille": {
      "depot": {
        "code": "INITDEP",
        "libelle": "Initiative en 1er Dépôt"
      },
      "classe": {
        "code": "PIONRES",
        "libelle": "Proposition de résolution"
      },
      "espece": {
        "code": "COMENQ",
        "libelle": "tendant à la création d'une commission d'enquête"
      }
    },
    "type": {
      "code": "PNRE",
      "libelle": "Proposition de résolution"
    },
    "sousType": {
      "code": "COMENQ",
      "libelle": "tendant à la création d'une commission d'enquête"
    }
  },
  "auteurs": [
    {
      "acteur": {
        "acteurRef": "PA1206",
        "qualite": "auteur"
      }
    }
  ],
  "notice": {
    "numNotice": "1878",
    "formule": "tendant à la création d’une commission d’enquête sur les ventes d’armes de la France à l’Arabie saoudite et aux Émirats arabes unis et sur l’éventuelle utilisation de celles-ci pour commettre des crimes de guerre ou des crimes contre l’humanité à l’encontre de la population civile du Yémen",
    "adoptionConforme": false
  }
}