{
  "xsiType": "texteLoi_Type",
  "uid": "PNREANR5L15B0540",
  "legislature": "15",
  "cycleDeVie": {
    "chrono": {
      "dateCreation": "2018-01-04T00:00:00.000+01:00",
      "dateDepot": "2018-01-04T00:00:00.000+01:00",
      "datePublication": "2018-01-10T00:00:00.000+01:00",
      "datePublicationWeb": "2018-01-05T13:40:00.000+01:00"
    }
  },
  "denominationStructurelle": "Proposition de résolution",
  "provenance": "Texte Déposé",
  "titres": {
    "titrePrincipal": "proposition de résolution sur le coût de la démocratie parlementaire française",
    "titrePrincipalCourt": "Coût démocratie parlementaire française"
  },
  "dossierRef": "DLR5L15N36255",
  "classification": {
    "famille": {
      "depot": {
        "code": "INITDEP",
        "libelle": "Initiative en 1er Dépôt"
      },
      "classe": {
        "code": "PIONRES",
        "libelle": "Proposition de résolution"
      },
      "espece": {
        "code": "COMENQ",
        "libelle": "tendant à la création d'une commission d'enquête"
      }
    },
    "type": {
      "code": "PNRE",
      "libelle": "Proposition de résolution"
    },
    "sousType": {
      "code": "COMENQ",
      "libelle": "tendant à la création d'une commission d'enquête"
    }
  },
  "auteurs": [
    {
      "acteur": {
        "acteurRef": "PA266774",
        "qualite": "auteur"
      }
    }
  ],
  "notice": {
    "numNotice": "540",
    "formule": "sur le coût de la démocratie parlementaire française",
    "adoptionConforme": false
  },
  "coSignataires": [
    {
      "acteurRef": "PA719318",
      "dateCosignature": "2018-01-04+01:00",
      "edite": false
    },
    {
      "acteurRef": "PA609726",
      "dateCosignature": "2018-01-04+01:00",
      "edite": false
    },
    {
      "acteurRef": "PA642847",
      "dateCosignature": "2018-01-04+01:00",
      "edite": false
    },
    {
      "acteurRef": "PA718884",
      "dateCosignature": "2018-01-04+01:00",
      "edite": false
    },
    {
      "acteurRef": "PA720210",
      "dateCosignature": "2018-01-04+01:00",
      "edite": false
    },
    {
      "acteurRef": "PA330684",
      "dateCosignature": "2018-01-04+01:00",
      "edite": false
    },
    {
      "acteurRef": "PA223837",
      "dateCosignature": "2018-01-04+01:00",
      "edite": false
    },
    {
      "acteurRef": "PA718838",
      "dateCosignature": "2018-01-04+01:00",
      "edite": false
    },
    {
      "acteurRef": "PA767",
      "dateCosignature": "2018-01-04+01:00",
      "edite": false
    },
    {
      "acteurRef": "PA856",
      "dateCosignature": "2018-01-04+01:00",
      "edite": false
    },
    {
      "acteurRef": "PA267429",
      "dateCosignature": "2018-01-04+01:00",
      "edite": false
    },
    {
      "acteurRef": "PA718850",
      "dateCosignature": "2018-01-04+01:00",
      "edite": false
    },
    {
      "acteurRef": "PA722390",
      "dateCosignature": "2018-01-04+01:00",
      "edite": false
    },
    {
      "acteurRef": "PA332523",
      "dateCosignature": "2018-01-04+01:00",
      "edite": false
    },
    {
      "acteurRef": "PA267735",
      "dateCosignature": "2018-01-04+01:00",
      "edite": false
    },
    {
      "acteurRef": "PA1012",
      "dateCosignature": "2018-01-04+01:00",
      "edite": false
    },
    {
      "acteurRef": "PA1029",
      "dateCosignature": "2018-01-04+01:00",
      "edite": false
    },
    {
      "acteurRef": "PA267450",
      "dateCosignature": "2018-01-04+01:00",
      "edite": false
    },
    {
      "acteurRef": "PA330909",
      "dateCosignature": "2018-01-04+01:00",
      "edite": false
    },
    {
      "acteurRef": "PA720386",
      "dateCosignature": "2018-01-04+01:00",
      "edite": false
    },
    {
      "acteurRef": "PA712015",
      "dateCosignature": "2018-01-04+01:00",
      "edite": false
    },
    {
      "acteurRef": "PA342935",
      "dateCosignature": "2018-01-04+01:00",
      "edite": false
    },
    {
      "acteurRef": "PA334149",
      "dateCosignature": "2018-01-04+01:00",
      "edite": false
    },
    {
      "acteurRef": "PA643103",
      "dateCosignature": "2018-01-04+01:00",
      "edite": false
    },
    {
      "acteurRef": "PA1327",
      "dateCosignature": "2018-01-04+01:00",
      "edite": false
    },
    {
      "acteurRef": "PA1498",
      "dateCosignature": "2018-01-04+01:00",
      "edite": false
    },
    {
      "acteurRef": "PA266797",
      "dateCosignature": "2018-01-04+01:00",
      "edite": false
    },
    {
      "acteurRef": "PA267318",
      "dateCosignature": "2018-01-04+01:00",
      "edite": false
    },
    {
      "acteurRef": "PA721126",
      "dateCosignature": "2018-01-04+01:00",
      "edite": false
    },
    {
      "acteurRef": "PA1630",
      "dateCosignature": "2018-01-04+01:00",
      "edite": false
    },
    {
      "acteurRef": "PA608416",
      "dateCosignature": "2018-01-04+01:00",
      "edite": false
    },
    {
      "acteurRef": "PA267901",
      "dateCosignature": "2018-01-04+01:00",
      "edite": false
    },
    {
      "acteurRef": "PA340853",
      "dateCosignature": "2018-01-04+01:00",
      "edite": false
    },
    {
      "acteurRef": "PA1874",
      "dateCosignature": "2018-01-04+01:00",
      "edite": false
    },
    {
      "acteurRef": "PA267378",
      "dateCosignature": "2018-01-04+01:00",
      "edite": false
    },
    {
      "acteurRef": "PA608016",
      "dateCosignature": "2018-01-04+01:00",
      "edite": false
    },
    {
      "acteurRef": "PA606712",
      "dateCosignature": "2018-01-04+01:00",
      "edite": false
    },
    {
      "acteurRef": "PA346054",
      "dateCosignature": "2018-01-04+01:00",
      "edite": false
    },
    {
      "acteurRef": "PA606098",
      "dateCosignature": "2018-01-04+01:00",
      "edite": false
    },
    {
      "acteurRef": "PA2155",
      "dateCosignature": "2018-01-04+01:00",
      "edite": false
    },
    {
      "acteurRef": "PA719272",
      "dateCosignature": "2018-01-04+01:00",
      "edite": false
    },
    {
      "acteurRef": "PA720644",
      "dateCosignature": "2018-01-04+01:00",
      "edite": false
    },
    {
      "acteurRef": "PA721636",
      "dateCosignature": "2018-01-04+01:00",
      "edite": false
    },
    {
      "acteurRef": "PA718784",
      "dateCosignature": "2018-01-04+01:00",
      "edite": false
    },
    {
      "acteurRef": "PA719946",
      "dateCosignature": "2018-01-04+01:00",
      "edite": false
    },
    {
      "acteurRef": "PA2377",
      "dateCosignature": "2018-01-04+01:00",
      "edite": false
    },
    {
      "acteurRef": "PA267260",
      "dateCosignature": "2018-01-04+01:00",
      "edite": false
    },
    {
      "acteurRef": "PA720100",
      "dateCosignature": "2018-01-04+01:00",
      "edite": false
    },
    {
      "acteurRef": "PA2492",
      "dateCosignature": "2018-01-04+01:00",
      "edite": false
    },
    {
      "acteurRef": "PA721286",
      "dateCosignature": "2018-01-04+01:00",
      "edite": false
    },
    {
      "acteurRef": "PA721678",
      "dateCosignature": "2018-01-04+01:00",
      "edite": false
    },
    {
      "acteurRef": "PA266776",
      "dateCosignature": "2018-01-04+01:00",
      "edite": false
    },
    {
      "acteurRef": "PA2529",
      "dateCosignature": "2018-01-04+01:00",
      "edite": false
    },
    {
      "acteurRef": "PA266808",
      "dateCosignature": "2018-01-04+01:00",
      "edite": false
    },
    {
      "acteurRef": "PA721314",
      "dateCosignature": "2018-01-04+01:00",
      "edite": false
    },
    {
      "acteurRef": "PA267204",
      "dateCosignature": "2018-01-04+01:00",
      "edite": false
    },
    {
      "acteurRef": "PA334654",
      "dateCosignature": "2018-01-04+01:00",
      "edite": false
    },
    {
      "acteurRef": "PA267794",
      "dateCosignature": "2018-01-04+01:00",
      "edite": false
    },
    {
      "acteurRef": "PA2792",
      "dateCosignature": "2018-01-04+01:00",
      "edite": false
    },
    {
      "acteurRef": "PA643134",
      "dateCosignature": "2018-01-04+01:00",
      "edite": false
    },
    {
      "acteurRef": "PA334843",
      "dateCosignature": "2018-01-04+01:00",
      "edite": false
    },
    {
      "acteurRef": "PA720586",
      "dateCosignature": "2018-01-04+01:00",
      "edite": false
    },
    {
      "acteurRef": "PA709315",
      "dateCosignature": "2018-01-04+01:00",
      "edite": false
    },
    {
      "acteurRef": "PA721968",
      "dateCosignature": "2018-01-04+01:00",
      "edite": false
    },
    {
      "acteurRef": "PA607090",
      "dateCosignature": "2018-01-04+01:00",
      "edite": false
    },
    {
      "acteurRef": "PA721474",
      "dateCosignature": "2018-01-04+01:00",
      "edite": false
    }
  ]
}