{
  "xsiType": "texteLoi_Type",
  "uid": "PIONANR5L15B1590",
  "legislature": "15",
  "cycleDeVie": {
    "chrono": {
      "dateCreation": "2019-01-16T00:00:00.000+01:00",
      "dateDepot": "2019-01-16T00:00:00.000+01:00",
      "datePublication": "2019-01-22T00:00:00.000+01:00",
      "datePublicationWeb": "2019-01-17T11:40:00.000+01:00"
    }
  },
  "denominationStructurelle": "Proposition de loi",
  "provenance": "Texte Déposé",
  "titres": {
    "titrePrincipal": "proposition de loi visant à encadrer la vente de protoxyde d'azote et à renforcer les actions de prévention",
    "titrePrincipalCourt": "encadrer vente protoxyde azote"
  },
  "dossierRef": "DLR5L15N37153",
  "classification": {
    "famille": {
      "depot": {
        "code": "INITDEP",
        "libelle": "Initiative en 1er Dépôt"
      },
      "classe": {
        "code": "PIONLOI",
        "libelle": "Proposition de loi"
      }
    },
    "type": {
      "code": "PION",
      "libelle": "Proposition de loi"
    }
  },
  "auteurs": [
    {
      "acteur": {
        "acteurRef": "PA720430",
        "qualite": "auteur"
      }
    }
  ],
  "notice": {
    "numNotice": "1590",
    "formule": "visant à encadrer la vente de protoxyde d'azote et à renforcer les actions de prévention",
    "adoptionConforme": false
  },
  "coSignataires": [
    {
      "acteurRef": "PA721210",
      "dateCosignature": "2019-01-16+01:00",
      "edite": false
    },
    {
      "acteurRef": "PA2150",
      "dateCosignature": "2019-01-16+01:00",
      "edite": false
    },
    {
      "acteurRef": "PA588884",
      "dateCosignature": "2019-01-16+01:00",
      "edite": false
    },
    {
      "acteurRef": "PA721202",
      "dateCosignature": "2019-01-16+01:00",
      "edite": false
    },
    {
      "acteurRef": "PA720286",
      "dateCosignature": "2019-01-16+01:00",
      "edite": false
    },
    {
      "acteurRef": "PA718868",
      "dateCosignature": "2019-01-16+01:00",
      "edite": false
    },
    {
      "acteurRef": "PA721960",
      "dateCosignature": "2019-01-16+01:00",
      "edite": false
    },
    {
      "acteurRef": "PA720892",
      "dateCosignature": "2019-01-16+01:00",
      "edite": false
    },
    {
      "acteurRef": "PA719578",
      "dateCosignature": "2019-01-16+01:00",
      "edite": false
    },
    {
      "acteurRef": "PA720422",
      "dateCosignature": "2019-01-16+01:00",
      "edite": false
    },
    {
      "acteurRef": "PA721062",
      "dateCosignature": "2019-01-16+01:00",
      "edite": false
    },
    {
      "acteurRef": "PA719676",
      "dateCosignature": "2019-01-16+01:00",
      "edite": false
    },
    {
      "acteurRef": "PA721226",
      "dateCosignature": "2019-01-16+01:00",
      "edite": false
    },
    {
      "acteurRef": "PA722142",
      "dateCosignature": "2019-01-16+01:00",
      "edite": false
    },
    {
      "acteurRef": "PA718860",
      "dateCosignature": "2019-01-16+01:00",
      "edite": false
    }
  ],
  "depotAmendements": {
    "amendementsSeance": {
      "amendable": false
    },
    "amendementsCommission": [
      {
        "organeRef": "PO420120",
        "amendable": true
      }
    ]
  }
}