{
  "xsiType": "DossierLegislatif_Type",
  "uid": "DLR5L15N37759",
  "legislature": "15",
  "titreDossier": {
    "titre": "Proposition de loi visant à distinguer le vin des autres boissons alcooliques",
    "titreChemin": "DLR5L15N37759",
    "senatChemin": "http://www.senat.fr/dossier-legislatif/ppl18-714.html"
  },
  "procedureParlementaire": {
    "code": "2",
    "libelle": "Proposition de loi ordinaire"
  },
  "initiateur": {
    "acteurs": [
      {
        "acteurRef": "PA944",
        "mandatRef": "PM703562"
      }
    ],
    "organeRef": "PO78718"
  },
  "actesLegislatifs": [
    {
      "xsiType": "Etape_Type",
      "uid": "L15-SN1-37759",
      "codeActe": "SN1",
      "libelleActe": {
        "nomCanonique": "1ère lecture (1ère assemblée saisie)",
        "libelleCourt": "1ère lecture"
      },
      "organeRef": "PO78718",
      "actesLegislatifs": [
        {
          "xsiType": "DepotInitiative_Type",
          "uid": "L15-VD190768DI",
          "codeActe": "SN1-DEPOT",
          "libelleActe": {
            "nomCanonique": "1er dépôt d'une initiative.",
            "libelleCourt": "1er dépôt d'une initiative."
          },
          "organeRef": "PO78718",
          "dateActe": "2019-09-09T00:00:00.000+02:00",
          "texteAssocieRef": "PIONSNR5S319B0714"
        },
        {
          "xsiType": "Etape_Type",
          "uid": "L15-SN1-COM-37759",
          "codeActe": "SN1-COM",
          "libelleActe": {
            "nomCanonique": "Travaux des commissions",
            "libelleCourt": "Travaux des commissions"
          },
          "organeRef": "PO78718",
          "actesLegislatifs": [
            {
              "xsiType": "Etape_Type",
              "uid": "L15-VD190769CF",
              "codeActe": "SN1-COM-FOND",
              "libelleActe": {
                "nomCanonique": "Travaux de la commission saisie au fond",
                "libelleCourt": "Travaux de la commission saisie au fond"
              },
              "organeRef": "PO211493",
              "actesLegislatifs": [
                {
                  "xsiType": "SaisieComFond_Type",
                  "uid": "L15-VD190769CFS",
                  "codeActe": "SN1-COM-FOND-SAISIE",
                  "libelleActe": {
                    "nomCanonique": "Renvoi en commission au fond",
                    "libelleCourt": "Renvoi en commission au fond"
                  },
                  "organeRef": "PO211493",
                  "dateActe": "2019-09-09T00:00:00.000+02:00"
                }
              ]
            }
          ]
        }
      ]
    }
  ]
}