{
  "xsiType": "texteLoi_Type",
  "uid": "PIONANR5L15B2215",
  "legislature": "15",
  "cycleDeVie": {
    "chrono": {
      "dateCreation": "2019-07-25T00:00:00.000+02:00",
      "dateDepot": "2019-09-11T00:00:00.000+02:00",
      "datePublication": "2019-09-18T00:00:00.000+02:00",
      "datePublicationWeb": "2019-09-12T15:45:00.000+02:00"
    }
  },
  "denominationStructurelle": "Proposition de loi",
  "provenance": "Texte Déposé",
  "titres": {
    "titrePrincipal": "proposition de loi visant à renforcer la prévention et les sanctions en matière de lutte contre les noyades accidentelles",
    "titrePrincipalCourt": "lutte contre noyades accidentelles"
  },
  "dossierRef": "DLR5L15N37680",
  "classification": {
    "famille": {
      "depot": {
        "code": "INITDEP",
        "libelle": "Initiative en 1er Dépôt"
      },
      "classe": {
        "code": "PIONLOI",
        "libelle": "Proposition de loi"
      }
    },
    "type": {
      "code": "PION",
      "libelle": "Proposition de loi"
    }
  },
  "auteurs": [
    {
      "acteur": {
        "acteurRef": "PA718784",
        "qualite": "auteur"
      }
    }
  ],
  "notice": {
    "numNotice": "2215",
    "formule": "visant à renforcer la prévention et les sanctions en matière de lutte contre les noyades accidentelles",
    "adoptionConforme": false
  },
  "coSignataires": [
    {
      "acteurRef": "PA605036",
      "dateCosignature": "2019-09-11+02:00",
      "edite": false
    },
    {
      "acteurRef": "PA719318",
      "dateCosignature": "2019-09-11+02:00",
      "edite": false
    },
    {
      "acteurRef": "PA721046",
      "dateCosignature": "2019-09-11+02:00",
      "edite": false
    },
    {
      "acteurRef": "PA642847",
      "dateCosignature": "2019-09-11+02:00",
      "edite": false
    },
    {
      "acteurRef": "PA718884",
      "dateCosignature": "2019-09-11+02:00",
      "edite": false
    },
    {
      "acteurRef": "PA720210",
      "dateCosignature": "2019-09-11+02:00",
      "edite": false
    },
    {
      "acteurRef": "PA721410",
      "dateCosignature": "2019-09-11+02:00",
      "edite": false
    },
    {
      "acteurRef": "PA336316",
      "dateCosignature": "2019-09-11+02:00",
      "edite": false
    },
    {
      "acteurRef": "PA721816",
      "dateCosignature": "2019-09-11+02:00",
      "edite": false
    },
    {
      "acteurRef": "PA267735",
      "dateCosignature": "2019-09-11+02:00",
      "edite": false
    },
    {
      "acteurRef": "PA267440",
      "dateCosignature": "2019-09-11+02:00",
      "edite": false
    },
    {
      "acteurRef": "PA608826",
      "dateCosignature": "2019-09-11+02:00",
      "edite": false
    },
    {
      "acteurRef": "PA334149",
      "dateCosignature": "2019-09-11+02:00",
      "edite": false
    },
    {
      "acteurRef": "PA643103",
      "dateCosignature": "2019-09-11+02:00",
      "edite": false
    },
    {
      "acteurRef": "PA266774",
      "dateCosignature": "2019-09-11+02:00",
      "edite": false
    },
    {
      "acteurRef": "PA609245",
      "dateCosignature": "2019-09-11+02:00",
      "edite": false
    },
    {
      "acteurRef": "PA1874",
      "dateCosignature": "2019-09-11+02:00",
      "edite": false
    },
    {
      "acteurRef": "PA719946",
      "dateCosignature": "2019-09-11+02:00",
      "edite": false
    },
    {
      "acteurRef": "PA2377",
      "dateCosignature": "2019-09-11+02:00",
      "edite": false
    },
    {
      "acteurRef": "PA267260",
      "dateCosignature": "2019-09-11+02:00",
      "edite": false
    },
    {
      "acteurRef": "PA721286",
      "dateCosignature": "2019-09-11+02:00",
      "edite": false
    },
    {
      "acteurRef": "PA721070",
      "dateCosignature": "2019-09-11+02:00",
      "edite": false
    },
    {
      "acteurRef": "PA721678",
      "dateCosignature": "2019-09-11+02:00",
      "edite": false
    },
    {
      "acteurRef": "PA2529",
      "dateCosignature": "2019-09-11+02:00",
      "edite": false
    },
    {
      "acteurRef": "PA266776",
      "dateCosignature": "2019-09-11+02:00",
      "edite": false
    },
    {
      "acteurRef": "PA334654",
      "dateCosignature": "2019-09-11+02:00",
      "edite": false
    },
    {
      "acteurRef": "PA709315",
      "dateCosignature": "2019-09-11+02:00",
      "edite": false
    },
    {
      "acteurRef": "PA721474",
      "dateCosignature": "2019-09-11+02:00",
      "edite": false
    }
  ],
  "depotAmendements": {
    "amendementsSeance": {
      "amendable": false
    },
    "amendementsCommission": [
      {
        "organeRef": "PO59051",
        "amendable": true
      }
    ]
  }
}