{
  "xsiType": "rapportParlementaire_Type",
  "uid": "RAPPANR5L15B0683",
  "legislature": "15",
  "cycleDeVie": {
    "chrono": {
      "dateCreation": "2018-02-21T00:00:00.000+01:00",
      "dateDepot": "2018-02-21T00:00:00.000+01:00",
      "datePublication": "2018-03-06T00:00:00.000+01:00",
      "datePublicationWeb": "2018-03-02T17:00:00.000+01:00"
    }
  },
  "denominationStructurelle": "Rapport",
  "provenance": "Commission",
  "titres": {
    "titrePrincipal": "rapport sur la proposition de loi de MM. Fabien Roussel, Jean-Paul Dufrègne et plusieurs de leurs collègues créant une liste française des paradis fiscaux (585).",
    "titrePrincipalCourt": "rapport sur la proposition de loi de MM. Fabien Roussel, Jean-Paul Dufrègne et plusieurs de leurs collègues créant une liste française des paradis fiscaux (585)."
  },
  "dossierRef": "DLR5L15N36296",
  "classification": {
    "famille": {
      "depot": {
        "code": "RAPINIT",
        "libelle": "Rapport sur une initiative"
      },
      "classe": {
        "code": "RAPPORT",
        "libelle": "Rapport"
      }
    },
    "type": {
      "code": "RAPP",
      "libelle": "Rapport"
    }
  },
  "auteurs": [
    {
      "acteur": {
        "acteurRef": "PA720692",
        "qualite": "rapporteur"
      }
    },
    {
      "organeRef": "PO59048"
    }
  ],
  "notice": {
    "numNotice": "683",
    "formule": "sur la proposition de loi de MM. Fabien Roussel, Jean-Paul Dufrègne et plusieurs de leurs collègues créant une liste française des paradis fiscaux (585).",
    "adoptionConforme": false
  },
  "imprimerie": {
    "prix": "4.5"
  }
}