{
  "xsiType": "texteLoi_Type",
  "uid": "PIONANR5L15B2154",
  "legislature": "15",
  "cycleDeVie": {
    "chrono": {
      "dateCreation": "2019-07-11T00:00:00.000+02:00",
      "dateDepot": "2019-07-16T00:00:00.000+02:00",
      "datePublication": "2019-07-24T00:00:00.000+02:00",
      "datePublicationWeb": "2019-07-18T19:30:00.000+02:00"
    }
  },
  "denominationStructurelle": "Proposition de loi",
  "provenance": "Texte Déposé",
  "titres": {
    "titrePrincipal": "proposition de loi visant à définir, à prévenir et à lutter contre la maladie de Lyme",
    "titrePrincipalCourt": "lutte contre la maladie de Lyme"
  },
  "dossierRef": "DLR5L15N37633",
  "classification": {
    "famille": {
      "depot": {
        "code": "INITDEP",
        "libelle": "Initiative en 1er Dépôt"
      },
      "classe": {
        "code": "PIONLOI",
        "libelle": "Proposition de loi"
      }
    },
    "type": {
      "code": "PION",
      "libelle": "Proposition de loi"
    }
  },
  "auteurs": [
    {
      "acteur": {
        "acteurRef": "PA266788",
        "qualite": "auteur"
      }
    }
  ],
  "notice": {
    "numNotice": "2154",
    "formule": "visant à définir, à prévenir et à lutter contre la maladie de Lyme",
    "adoptionConforme": false
  },
  "coSignataires": [
    {
      "acteurRef": "PA331567",
      "dateCosignature": "2019-07-31+02:00",
      "edite": false
    }
  ],
  "depotAmendements": {
    "amendementsSeance": {
      "amendable": false
    },
    "amendementsCommission": [
      {
        "organeRef": "PO420120",
        "amendable": true
      }
    ]
  }
}