{
  "xsiType": "DossierMissionControle_Type",
  "uid": "DLR5L15N37611",
  "legislature": "15",
  "titreDossier": {
    "titre": "Prise en compte du développement durable dans la politique commerciale européenne",
    "titreChemin": "developpement_durable_politique_commerciale_europeenne"
  },
  "procedureParlementaire": {
    "code": "19",
    "libelle": "Rapport d'information sans mission"
  },
  "actesLegislatifs": [
    {
      "xsiType": "Etape_Type",
      "uid": "L15-AN20-37611",
      "codeActe": "AN20",
      "libelleActe": {
        "nomCanonique": "Travaux"
      },
      "organeRef": "PO717460",
      "actesLegislatifs": [
        {
          "xsiType": "DepotRapport_Type",
          "uid": "L15-VD190127",
          "codeActe": "AN20-RAPPORT",
          "libelleActe": {
            "nomCanonique": "Dépôt de rapport",
            "libelleCourt": "Dépôt de rapport"
          },
          "organeRef": "PO415287",
          "dateActe": "2019-07-04T00:00:00.000+02:00",
          "texteAssocieRef": "RINFANR5L15B2114"
        }
      ]
    }
  ]
}