{
  "xsiType": "texteLoi_Type",
  "uid": "PIONSNR5S299BTC0536",
  "cycleDeVie": {
    "chrono": {
      "dateCreation": "2018-06-06T00:00:00.000+02:00",
      "dateDepot": "2018-06-05T00:00:00.000+02:00",
      "datePublicationWeb": "2018-06-05T14:00:00.000+02:00"
    }
  },
  "denominationStructurelle": "Proposition de loi",
  "provenance": "Texte Déposé",
  "titres": {
    "titrePrincipal": "proposition de loi sur la proposition de loi de M. Jean-Pierre Decool relative à l'harmonisation de l'utilisation des caméras mobiles par les autorités de sécurité publique (337).",
    "titrePrincipalCourt": "Harmonisation de l'utilisation des caméras mobiles par la police"
  },
  "dossierRef": "DLR5L15N36690",
  "classification": {
    "famille": {
      "depot": {
        "code": "INITDEP",
        "libelle": "Initiative en 1er Dépôt"
      },
      "classe": {
        "code": "PIONLOI",
        "libelle": "Proposition de loi"
      }
    },
    "type": {
      "code": "PION",
      "libelle": "Proposition de loi"
    }
  },
  "auteurs": [
    {
      "acteur": {
        "acteurRef": "PA736196",
        "qualite": "rapporteur"
      }
    },
    {
      "organeRef": "PO211495"
    }
  ],
  "notice": {
    "numNotice": "536",
    "formule": "sur la proposition de loi de M. Jean-Pierre Decool relative à l'harmonisation de l'utilisation des caméras mobiles par les autorités de sécurité publique (337).",
    "adoptionConforme": false
  },
  "depotAmendements": {
    "amendementsSeance": {
      "amendable": false
    }
  }
}