{
  "xsiType": "DossierMissionControle_Type",
  "uid": "DLR5L15N36310",
  "legislature": "15",
  "titreDossier": {
    "titre": "Union européenne : la transition énergétique",
    "titreChemin": "transition_energetique_ue_rap-info"
  },
  "procedureParlementaire": {
    "code": "19",
    "libelle": "Rapport d'information sans mission"
  },
  "actesLegislatifs": [
    {
      "xsiType": "Etape_Type",
      "uid": "L15-AN20-36310",
      "codeActe": "AN20",
      "libelleActe": {
        "nomCanonique": "Travaux"
      },
      "organeRef": "PO717460",
      "actesLegislatifs": [
        {
          "xsiType": "DepotRapport_Type",
          "uid": "L15-VD184241",
          "codeActe": "AN20-RAPPORT",
          "libelleActe": {
            "nomCanonique": "Dépôt de rapport",
            "libelleCourt": "Dépôt de rapport"
          },
          "organeRef": "PO415287",
          "dateActe": "2018-01-25T00:00:00.000+01:00",
          "texteAssocieRef": "RINFANR5L15B0596"
        }
      ]
    }
  ]
}