{
  "xsiType": "rapportParlementaire_Type",
  "uid": "RAPPANR5L15B1662",
  "legislature": "15",
  "cycleDeVie": {
    "chrono": {
      "dateCreation": "2019-02-06T00:00:00.000+01:00",
      "dateDepot": "2019-02-06T00:00:00.000+01:00",
      "datePublication": "2019-02-15T00:00:00.000+01:00",
      "datePublicationWeb": "2019-02-12T15:15:00.000+01:00"
    }
  },
  "denominationStructurelle": "Rapport",
  "provenance": "Commission",
  "titres": {
    "titrePrincipal": "rapport  sur la proposition de loi, adoptée par le Sénat après engagement de la procédure accélérée, portant création d'une Agence nationale de la cohésion des territoires (n°1393).",
    "titrePrincipalCourt": "rapport  sur la proposition de loi, adoptée par le Sénat après engagement de la procédure accélérée, portant création d'une Agence nationale de la cohésion des territoires (n°1393)."
  },
  "divisions": [
    {
      "xsiType": "rapportParlementaire_Type",
      "uid": "RAPPANR5L15B1662-COMPA",
      "legislature": "15",
      "cycleDeVie": {
        "chrono": {
          "dateCreation": "2019-02-06T00:00:00.000+01:00",
          "dateDepot": "2019-02-06T00:00:00.000+01:00",
          "datePublicationWeb": "2019-02-08T11:15:00.000+01:00"
        }
      },
      "denominationStructurelle": "Annexe Texte comparatif COMPA",
      "titres": {
        "titrePrincipal": "Texte comparatif",
        "titrePrincipalCourt": "Texte comparatif"
      },
      "dossierRef": "DLR5L15N36915",
      "classification": {
        "type": {
          "code": "RAPP",
          "libelle": "Rapport"
        },
        "sousType": {
          "code": "COMPA",
          "libelle": "Texte comparatif"
        },
        "statutAdoption": "ADOPTCOM"
      },
      "auteurs": [
        {
          "acteur": {
            "acteurRef": "PA719194",
            "qualite": "rapporteur"
          }
        },
        {
          "organeRef": "PO419865"
        }
      ],
      "notice": {
        "numNotice": "1662",
        "formule": "sur la proposition de loi, adoptée par le Sénat après engagement de la procédure accélérée, portant création d'une Agence nationale de la cohésion des territoires (n°1393).",
        "adoptionConforme": false
      },
      "imprimerie": {
        "nbPage": "0"
      }
    },
    {
      "xsiType": "rapportParlementaire_Type",
      "uid": "RAPPANR5L15B1662-tI",
      "legislature": "15",
      "cycleDeVie": {
        "chrono": {
          "dateCreation": "2019-02-06T00:00:00.000+01:00",
          "dateDepot": "2019-02-06T00:00:00.000+01:00",
          "datePublicationWeb": "2019-02-08T13:00:00.000+01:00"
        }
      },
      "denominationStructurelle": "Tome I",
      "titres": {
        "titrePrincipal": "Avant-Propos, Synthèse",
        "titrePrincipalCourt": "Avant-Propos, Synthèse"
      },
      "dossierRef": "DLR5L15N36915",
      "classification": {
        "type": {
          "code": "RAPP",
          "libelle": "Rapport"
        },
        "statutAdoption": "ADOPTCOM"
      },
      "auteurs": [
        {
          "acteur": {
            "acteurRef": "PA719194",
            "qualite": "rapporteur"
          }
        },
        {
          "organeRef": "PO419865"
        }
      ],
      "notice": {
        "numNotice": "1662",
        "formule": "sur la proposition de loi, adoptée par le Sénat après engagement de la procédure accélérée, portant création d'une Agence nationale de la cohésion des territoires (n°1393).",
        "adoptionConforme": false
      },
      "imprimerie": {
        "nbPage": "0"
      }
    },
    {
      "xsiType": "rapportParlementaire_Type",
      "uid": "RAPPANR5L15B1662-tII",
      "legislature": "15",
      "cycleDeVie": {
        "chrono": {
          "dateCreation": "2019-02-06T00:00:00.000+01:00",
          "dateDepot": "2019-02-06T00:00:00.000+01:00",
          "datePublicationWeb": "2019-02-12T14:40:00.000+01:00"
        }
      },
      "denominationStructurelle": "Tome II",
      "titres": {
        "titrePrincipal": "Commentaires d'articles",
        "titrePrincipalCourt": "Commentaires d'articles"
      },
      "dossierRef": "DLR5L15N36915",
      "classification": {
        "type": {
          "code": "RAPP",
          "libelle": "Rapport"
        },
        "statutAdoption": "ADOPTCOM"
      },
      "auteurs": [
        {
          "acteur": {
            "acteurRef": "PA719194",
            "qualite": "rapporteur"
          }
        },
        {
          "organeRef": "PO419865"
        }
      ],
      "notice": {
        "numNotice": "1662",
        "formule": "sur la proposition de loi, adoptée par le Sénat après engagement de la procédure accélérée, portant création d'une Agence nationale de la cohésion des territoires (n°1393).",
        "adoptionConforme": false
      },
      "imprimerie": {
        "nbPage": "0"
      }
    },
    {
      "xsiType": "rapportParlementaire_Type",
      "uid": "RAPPANR5L15B1662-tIII",
      "legislature": "15",
      "cycleDeVie": {
        "chrono": {
          "dateCreation": "2019-02-06T00:00:00.000+01:00",
          "dateDepot": "2019-02-06T00:00:00.000+01:00",
          "datePublicationWeb": "2019-02-11T18:10:00.000+01:00"
        }
      },
      "denominationStructurelle": "Tome III",
      "titres": {
        "titrePrincipal": "Comptes rendus",
        "titrePrincipalCourt": "Comptes rendus"
      },
      "dossierRef": "DLR5L15N36915",
      "classification": {
        "type": {
          "code": "RAPP",
          "libelle": "Rapport"
        },
        "statutAdoption": "ADOPTCOM"
      },
      "auteurs": [
        {
          "acteur": {
            "acteurRef": "PA719194",
            "qualite": "rapporteur"
          }
        },
        {
          "organeRef": "PO419865"
        }
      ],
      "notice": {
        "numNotice": "1662",
        "formule": "sur la proposition de loi, adoptée par le Sénat après engagement de la procédure accélérée, portant création d'une Agence nationale de la cohésion des territoires (n°1393).",
        "adoptionConforme": false
      },
      "imprimerie": {
        "nbPage": "0"
      }
    }
  ],
  "dossierRef": "DLR5L15N36915",
  "classification": {
    "famille": {
      "depot": {
        "code": "RAPINIT",
        "libelle": "Rapport sur une initiative"
      },
      "classe": {
        "code": "RAPPORT",
        "libelle": "Rapport"
      }
    },
    "type": {
      "code": "RAPP",
      "libelle": "Rapport"
    },
    "statutAdoption": "ADOPTCOM"
  },
  "auteurs": [
    {
      "acteur": {
        "acteurRef": "PA719194",
        "qualite": "rapporteur"
      }
    },
    {
      "organeRef": "PO419865"
    }
  ],
  "notice": {
    "numNotice": "1662",
    "formule": "sur la proposition de loi, adoptée par le Sénat après engagement de la procédure accélérée, portant création d'une Agence nationale de la cohésion des territoires (n°1393).",
    "adoptionConforme": false
  },
  "imprimerie": {
    "nbPage": "0",
    "prix": "5.0"
  }
}