{
  "xsiType": "DossierLegislatif_Type",
  "uid": "DLR5L15N35928",
  "legislature": "15",
  "titreDossier": {
    "titre": "Pouvoirs publics : exercice par un ressortissant communautaire des fonctions d'adjoint au maire",
    "titreChemin": "ressortissant_communautaire_adjoint_maire"
  },
  "procedureParlementaire": {
    "code": "7",
    "libelle": "Projet ou proposition de loi constitutionnelle"
  },
  "initiateur": {
    "acteurs": [
      {
        "acteurRef": "PA2952",
        "mandatRef": "PM722480"
      }
    ]
  },
  "actesLegislatifs": [
    {
      "xsiType": "Etape_Type",
      "uid": "L15-AN1-35928",
      "codeActe": "AN1",
      "libelleActe": {
        "nomCanonique": "1ère lecture (1ère assemblée saisie)",
        "libelleCourt": "1ère lecture"
      },
      "organeRef": "PO717460",
      "actesLegislatifs": [
        {
          "xsiType": "DepotInitiative_Type",
          "uid": "L15-VD182618DI",
          "codeActe": "AN1-DEPOT",
          "libelleActe": {
            "nomCanonique": "1er dépôt d'une initiative.",
            "libelleCourt": "1er dépôt d'une initiative."
          },
          "organeRef": "PO717460",
          "dateActe": "2017-09-06T00:00:00.000+02:00",
          "texteAssocieRef": "PIONANR5L15B0154"
        },
        {
          "xsiType": "Etape_Type",
          "uid": "L15-AN1-COM-35928",
          "codeActe": "AN1-COM",
          "libelleActe": {
            "nomCanonique": "Travaux des commissions",
            "libelleCourt": "Travaux des commissions"
          },
          "organeRef": "PO717460",
          "actesLegislatifs": [
            {
              "xsiType": "Etape_Type",
              "uid": "L15-VD182619CF",
              "codeActe": "AN1-COM-FOND",
              "libelleActe": {
                "nomCanonique": "Travaux de la commission saisie au fond",
                "libelleCourt": "Travaux de la commission saisie au fond"
              },
              "organeRef": "PO59051",
              "actesLegislatifs": [
                {
                  "xsiType": "SaisieComFond_Type",
                  "uid": "L15-VD182619CFS",
                  "codeActe": "AN1-COM-FOND-SAISIE",
                  "libelleActe": {
                    "nomCanonique": "Renvoi en commission au fond",
                    "libelleCourt": "Renvoi en commission au fond"
                  },
                  "organeRef": "PO59051",
                  "dateActe": "2017-09-06T00:00:00.000+02:00"
                }
              ]
            }
          ]
        }
      ]
    }
  ]
}