{
  "xsiType": "texteLoi_Type",
  "uid": "PNREANR5L15B0729",
  "legislature": "15",
  "cycleDeVie": {
    "chrono": {
      "dateCreation": "2018-03-06T00:00:00.000+01:00",
      "dateDepot": "2018-03-06T00:00:00.000+01:00",
      "datePublication": "2018-04-09T00:00:00.000+02:00",
      "datePublicationWeb": "2018-04-04T12:35:00.000+02:00"
    }
  },
  "denominationStructurelle": "Proposition de résolution",
  "provenance": "Texte Déposé",
  "titres": {
    "titrePrincipal": "proposition de résolution visant à créer une commission d’enquête sur les difficultés liées à la protection des grands principes de la langue française",
    "titrePrincipalCourt": "proposition de résolution visant à créer une commission d’enquête sur les difficultés liées à la protection des grands principes de la langue française"
  },
  "dossierRef": "DLR5L15N36432",
  "classification": {
    "famille": {
      "depot": {
        "code": "INITDEP",
        "libelle": "Initiative en 1er Dépôt"
      },
      "classe": {
        "code": "PIONRES",
        "libelle": "Proposition de résolution"
      },
      "espece": {
        "code": "COMENQ",
        "libelle": "tendant à la création d'une commission d'enquête"
      }
    },
    "type": {
      "code": "PNRE",
      "libelle": "Proposition de résolution"
    },
    "sousType": {
      "code": "COMENQ",
      "libelle": "tendant à la création d'une commission d'enquête"
    }
  },
  "auteurs": [
    {
      "acteur": {
        "acteurRef": "PA605991",
        "qualite": "auteur"
      }
    }
  ],
  "notice": {
    "numNotice": "729",
    "formule": "visant à créer une commission d’enquête sur les difficultés liées à la protection des grands principes de la langue française",
    "adoptionConforme": false
  },
  "coSignataires": [
    {
      "acteurRef": "PA1630",
      "dateCosignature": "2018-03-06+01:00",
      "edite": false
    },
    {
      "acteurRef": "PA721968",
      "dateCosignature": "2018-03-06+01:00",
      "edite": false
    },
    {
      "acteurRef": "PA718850",
      "dateCosignature": "2018-03-06+01:00",
      "edite": false
    },
    {
      "acteurRef": "PA721070",
      "dateCosignature": "2018-03-06+01:00",
      "edite": false
    },
    {
      "acteurRef": "PA721046",
      "dateCosignature": "2018-03-06+01:00",
      "edite": false
    },
    {
      "acteurRef": "PA1327",
      "dateCosignature": "2018-03-06+01:00",
      "edite": false
    },
    {
      "acteurRef": "PA1012",
      "dateCosignature": "2018-03-06+01:00",
      "edite": false
    },
    {
      "acteurRef": "PA721126",
      "dateCosignature": "2018-03-06+01:00",
      "edite": false
    },
    {
      "acteurRef": "PA345722",
      "dateCosignature": "2018-03-06+01:00",
      "edite": false
    },
    {
      "acteurRef": "PA605036",
      "dateCosignature": "2018-03-06+01:00",
      "edite": false
    },
    {
      "acteurRef": "PA334149",
      "dateCosignature": "2018-03-06+01:00",
      "edite": false
    },
    {
      "acteurRef": "PA2492",
      "dateCosignature": "2018-03-06+01:00",
      "edite": false
    },
    {
      "acteurRef": "PA721410",
      "dateCosignature": "2018-03-06+01:00",
      "edite": false
    },
    {
      "acteurRef": "PA719318",
      "dateCosignature": "2018-03-06+01:00",
      "edite": false
    },
    {
      "acteurRef": "PA718784",
      "dateCosignature": "2018-03-06+01:00",
      "edite": false
    },
    {
      "acteurRef": "PA718838",
      "dateCosignature": "2018-03-06+01:00",
      "edite": false
    },
    {
      "acteurRef": "PA2086",
      "dateCosignature": "2018-03-06+01:00",
      "edite": false
    },
    {
      "acteurRef": "PA719272",
      "dateCosignature": "2018-03-06+01:00",
      "edite": false
    },
    {
      "acteurRef": "PA267378",
      "dateCosignature": "2018-03-06+01:00",
      "edite": false
    },
    {
      "acteurRef": "PA606712",
      "dateCosignature": "2018-03-06+01:00",
      "edite": false
    },
    {
      "acteurRef": "PA267785",
      "dateCosignature": "2018-03-06+01:00",
      "edite": false
    },
    {
      "acteurRef": "PA719946",
      "dateCosignature": "2018-03-06+01:00",
      "edite": false
    },
    {
      "acteurRef": "PA721816",
      "dateCosignature": "2018-03-06+01:00",
      "edite": false
    },
    {
      "acteurRef": "PA643134",
      "dateCosignature": "2018-03-06+01:00",
      "edite": false
    },
    {
      "acteurRef": "PA767",
      "dateCosignature": "2018-03-06+01:00",
      "edite": false
    },
    {
      "acteurRef": "PA267324",
      "dateCosignature": "2018-03-06+01:00",
      "edite": false
    },
    {
      "acteurRef": "PA267318",
      "dateCosignature": "2018-03-06+01:00",
      "edite": false
    },
    {
      "acteurRef": "PA2792",
      "dateCosignature": "2018-03-06+01:00",
      "edite": false
    },
    {
      "acteurRef": "PA336316",
      "dateCosignature": "2018-03-06+01:00",
      "edite": false
    },
    {
      "acteurRef": "PA2529",
      "dateCosignature": "2018-03-06+01:00",
      "edite": false
    },
    {
      "acteurRef": "PA267204",
      "dateCosignature": "2018-03-06+01:00",
      "edite": false
    },
    {
      "acteurRef": "PA607090",
      "dateCosignature": "2018-03-06+01:00",
      "edite": false
    },
    {
      "acteurRef": "PA721286",
      "dateCosignature": "2018-03-06+01:00",
      "edite": false
    },
    {
      "acteurRef": "PA709315",
      "dateCosignature": "2018-03-06+01:00",
      "edite": false
    },
    {
      "acteurRef": "PA720100",
      "dateCosignature": "2018-03-06+01:00",
      "edite": false
    },
    {
      "acteurRef": "PA267260",
      "dateCosignature": "2018-03-06+01:00",
      "edite": false
    },
    {
      "acteurRef": "PA223837",
      "dateCosignature": "2018-03-06+01:00",
      "edite": false
    },
    {
      "acteurRef": "PA2377",
      "dateCosignature": "2018-03-06+01:00",
      "edite": false
    },
    {
      "acteurRef": "PA721506",
      "dateCosignature": "2018-03-06+01:00",
      "edite": false
    },
    {
      "acteurRef": "PA721636",
      "dateCosignature": "2018-03-06+01:00",
      "edite": false
    },
    {
      "acteurRef": "PA998",
      "dateCosignature": "2018-03-06+01:00",
      "edite": false
    },
    {
      "acteurRef": "PA334843",
      "dateCosignature": "2018-03-06+01:00",
      "edite": false
    },
    {
      "acteurRef": "PA608416",
      "dateCosignature": "2018-03-06+01:00",
      "edite": false
    },
    {
      "acteurRef": "PA266797",
      "dateCosignature": "2018-03-06+01:00",
      "edite": false
    },
    {
      "acteurRef": "PA720586",
      "dateCosignature": "2018-03-06+01:00",
      "edite": false
    },
    {
      "acteurRef": "PA720684",
      "dateCosignature": "2018-03-06+01:00",
      "edite": false
    },
    {
      "acteurRef": "PA721314",
      "dateCosignature": "2018-03-06+01:00",
      "edite": false
    },
    {
      "acteurRef": "PA721678",
      "dateCosignature": "2018-03-06+01:00",
      "edite": false
    },
    {
      "acteurRef": "PA340853",
      "dateCosignature": "2018-03-06+01:00",
      "edite": false
    },
    {
      "acteurRef": "PA721474",
      "dateCosignature": "2018-03-06+01:00",
      "edite": false
    },
    {
      "acteurRef": "PA642847",
      "dateCosignature": "2018-03-06+01:00",
      "edite": false
    },
    {
      "acteurRef": "PA718884",
      "dateCosignature": "2018-03-06+01:00",
      "edite": false
    },
    {
      "acteurRef": "PA720210",
      "dateCosignature": "2018-03-06+01:00",
      "edite": false
    },
    {
      "acteurRef": "PA330684",
      "dateCosignature": "2018-03-06+01:00",
      "edite": false
    },
    {
      "acteurRef": "PA608016",
      "dateCosignature": "2018-03-06+01:00",
      "edite": false
    },
    {
      "acteurRef": "PA330909",
      "dateCosignature": "2018-03-06+01:00",
      "edite": false
    },
    {
      "acteurRef": "PA266808",
      "dateCosignature": "2018-03-06+01:00",
      "edite": false
    },
    {
      "acteurRef": "PA608826",
      "dateCosignature": "2018-03-06+01:00",
      "edite": false
    },
    {
      "acteurRef": "PA330008",
      "dateCosignature": "2018-03-06+01:00",
      "edite": false
    },
    {
      "acteurRef": "PA267429",
      "dateCosignature": "2018-03-06+01:00",
      "edite": false
    },
    {
      "acteurRef": "PA266793",
      "dateCosignature": "2018-03-06+01:00",
      "edite": false
    },
    {
      "acteurRef": "PA720644",
      "dateCosignature": "2018-03-06+01:00",
      "edite": false
    },
    {
      "acteurRef": "PA722390",
      "dateCosignature": "2018-03-06+01:00",
      "edite": false
    },
    {
      "acteurRef": "PA712015",
      "dateCosignature": "2018-03-06+01:00",
      "edite": false
    },
    {
      "acteurRef": "PA718780",
      "dateCosignature": "2018-03-06+01:00",
      "edite": false
    },
    {
      "acteurRef": "PA266774",
      "dateCosignature": "2018-03-06+01:00",
      "edite": false
    },
    {
      "acteurRef": "PA342935",
      "dateCosignature": "2018-03-06+01:00",
      "edite": false
    },
    {
      "acteurRef": "PA332523",
      "dateCosignature": "2018-03-06+01:00",
      "edite": false
    },
    {
      "acteurRef": "PA720630",
      "dateCosignature": "2018-03-06+01:00",
      "edite": false
    },
    {
      "acteurRef": "PA856",
      "dateCosignature": "2018-03-06+01:00",
      "edite": false
    }
  ]
}