{
  "xsiType": "texteLoi_Type",
  "uid": "PIONANR5L15B1202",
  "legislature": "15",
  "cycleDeVie": {
    "chrono": {
      "dateCreation": "2018-07-16T00:00:00.000+02:00",
      "dateDepot": "2018-07-25T00:00:00.000+02:00",
      "datePublication": "2018-08-03T00:00:00.000+02:00",
      "datePublicationWeb": "2018-08-01T16:00:00.000+02:00"
    }
  },
  "denominationStructurelle": "Proposition de loi",
  "provenance": "Texte Déposé",
  "titres": {
    "titrePrincipal": "proposition de loi relative aux centres communaux et intercommunaux d'action sociale",
    "titrePrincipalCourt": "centres communaux intercommunaux action sociale"
  },
  "dossierRef": "DLR5L15N36797",
  "classification": {
    "famille": {
      "depot": {
        "code": "INITDEP",
        "libelle": "Initiative en 1er Dépôt"
      },
      "classe": {
        "code": "PIONLOI",
        "libelle": "Proposition de loi"
      }
    },
    "type": {
      "code": "PION",
      "libelle": "Proposition de loi"
    }
  },
  "auteurs": [
    {
      "acteur": {
        "acteurRef": "PA2155",
        "qualite": "auteur"
      }
    }
  ],
  "notice": {
    "numNotice": "1202",
    "formule": "relative aux centres communaux et intercommunaux d'action sociale",
    "adoptionConforme": false
  },
  "coSignataires": [
    {
      "acteurRef": "PA642847",
      "dateCosignature": "2018-07-25+02:00",
      "edite": false
    },
    {
      "acteurRef": "PA266793",
      "dateCosignature": "2018-07-25+02:00",
      "edite": false
    },
    {
      "acteurRef": "PA856",
      "dateCosignature": "2018-07-25+02:00",
      "edite": false
    },
    {
      "acteurRef": "PA718850",
      "dateCosignature": "2018-07-25+02:00",
      "edite": false
    },
    {
      "acteurRef": "PA267450",
      "dateCosignature": "2018-07-25+02:00",
      "edite": false
    },
    {
      "acteurRef": "PA712015",
      "dateCosignature": "2018-07-25+02:00",
      "edite": false
    },
    {
      "acteurRef": "PA267289",
      "dateCosignature": "2018-07-25+02:00",
      "edite": false
    },
    {
      "acteurRef": "PA334149",
      "dateCosignature": "2018-07-25+02:00",
      "edite": false
    },
    {
      "acteurRef": "PA267324",
      "dateCosignature": "2018-07-25+02:00",
      "edite": false
    },
    {
      "acteurRef": "PA267318",
      "dateCosignature": "2018-07-25+02:00",
      "edite": false
    },
    {
      "acteurRef": "PA608416",
      "dateCosignature": "2018-07-25+02:00",
      "edite": false
    },
    {
      "acteurRef": "PA609245",
      "dateCosignature": "2018-07-25+02:00",
      "edite": false
    },
    {
      "acteurRef": "PA608016",
      "dateCosignature": "2018-07-25+02:00",
      "edite": false
    },
    {
      "acteurRef": "PA720644",
      "dateCosignature": "2018-07-25+02:00",
      "edite": false
    },
    {
      "acteurRef": "PA2377",
      "dateCosignature": "2018-07-25+02:00",
      "edite": false
    },
    {
      "acteurRef": "PA267260",
      "dateCosignature": "2018-07-25+02:00",
      "edite": false
    },
    {
      "acteurRef": "PA266808",
      "dateCosignature": "2018-07-25+02:00",
      "edite": false
    },
    {
      "acteurRef": "PA267204",
      "dateCosignature": "2018-07-25+02:00",
      "edite": false
    },
    {
      "acteurRef": "PA709315",
      "dateCosignature": "2018-07-25+02:00",
      "edite": false
    },
    {
      "acteurRef": "PA721968",
      "dateCosignature": "2018-07-25+02:00",
      "edite": false
    },
    {
      "acteurRef": "PA721474",
      "dateCosignature": "2018-07-25+02:00",
      "edite": false
    },
    {
      "acteurRef": "PA718884",
      "dateCosignature": "2018-10-10+02:00",
      "edite": false
    }
  ],
  "depotAmendements": {
    "amendementsSeance": {
      "amendable": false
    },
    "amendementsCommission": [
      {
        "organeRef": "PO420120",
        "amendable": true
      }
    ]
  }
}