{
  "xsiType": "texteLoi_Type",
  "uid": "PRJLANR5L15B0165",
  "legislature": "15",
  "cycleDeVie": {
    "chrono": {
      "dateCreation": "2017-09-15T00:00:00.000+02:00",
      "dateDepot": "2017-09-14T00:00:00.000+02:00",
      "datePublication": "2017-09-25T00:00:00.000+02:00",
      "datePublicationWeb": "2017-09-18T17:45:00.000+02:00"
    }
  },
  "denominationStructurelle": "Projet de loi",
  "provenance": "Texte Déposé",
  "titres": {
    "titrePrincipal": "projet de loi ratifiant l'ordonnance n° 2017-734 du 4 mai 2017 portant modification des dispositions relatives aux organismes mutualistes",
    "titrePrincipalCourt": "ordonnance organismes mutualistes"
  },
  "dossierRef": "DLR5L15N35935",
  "classification": {
    "famille": {
      "depot": {
        "code": "INITDEP",
        "libelle": "Initiative en 1er Dépôt"
      },
      "classe": {
        "code": "PRJLOI",
        "libelle": "Projet de loi"
      }
    },
    "type": {
      "code": "PRJL",
      "libelle": "Projet de loi"
    }
  },
  "auteurs": [
    {
      "acteur": {
        "acteurRef": "PA345619",
        "qualite": "auteur"
      }
    }
  ],
  "notice": {
    "numNotice": "165",
    "formule": "ratifiant l'ordonnance n° 2017-734 du 4 mai 2017 portant modification des dispositions relatives aux organismes mutualistes",
    "adoptionConforme": false
  },
  "coSignataires": [
    {
      "acteurRef": "PA717153",
      "dateCosignature": "2017-09-14+02:00",
      "edite": true
    }
  ],
  "depotAmendements": {
    "amendementsSeance": {
      "amendable": false
    },
    "amendementsCommission": [
      {
        "organeRef": "PO420120",
        "amendable": true
      }
    ]
  }
}