{
  "xsiType": "texteLoi_Type",
  "uid": "PIONANR5L15B1605",
  "legislature": "15",
  "cycleDeVie": {
    "chrono": {
      "dateCreation": "2019-01-16T00:00:00.000+01:00",
      "dateDepot": "2019-01-23T00:00:00.000+01:00",
      "datePublication": "2019-01-30T00:00:00.000+01:00",
      "datePublicationWeb": "2019-01-24T18:45:00.000+01:00"
    }
  },
  "denominationStructurelle": "Proposition de loi",
  "provenance": "Texte Déposé",
  "titres": {
    "titrePrincipal": "proposition de loi visant à protéger les journalistes des violences qu'ils peuvent subir lors de reportages",
    "titrePrincipalCourt": "protéger les journalistes des violences qu'ils peuvent subir lors de reportages"
  },
  "dossierRef": "DLR5L15N37158",
  "classification": {
    "famille": {
      "depot": {
        "code": "INITDEP",
        "libelle": "Initiative en 1er Dépôt"
      },
      "classe": {
        "code": "PIONLOI",
        "libelle": "Proposition de loi"
      }
    },
    "type": {
      "code": "PION",
      "libelle": "Proposition de loi"
    }
  },
  "auteurs": [
    {
      "acteur": {
        "acteurRef": "PA340853",
        "qualite": "auteur"
      }
    }
  ],
  "notice": {
    "numNotice": "1605",
    "formule": "visant à protéger les journalistes des violences qu'ils peuvent subir lors de reportages",
    "adoptionConforme": false
  },
  "depotAmendements": {
    "amendementsSeance": {
      "amendable": false
    },
    "amendementsCommission": [
      {
        "organeRef": "PO59051",
        "amendable": true
      }
    ]
  }
}