{
  "xsiType": "texteLoi_Type",
  "uid": "PIONANR5L15B1426",
  "legislature": "15",
  "cycleDeVie": {
    "chrono": {
      "dateCreation": "2018-11-19T00:00:00.000+01:00",
      "dateDepot": "2018-11-21T00:00:00.000+01:00",
      "datePublication": "2018-11-27T00:00:00.000+01:00",
      "datePublicationWeb": "2018-11-22T11:55:00.000+01:00"
    }
  },
  "denominationStructurelle": "Proposition de loi",
  "provenance": "Texte Déposé",
  "titres": {
    "titrePrincipal": "proposition de loi visant à supprimer la taxe sur la valeur ajoutée sur le montant de la taxe intérieure sur la consommation de produits énergétiques afin de préserver le pouvoir d'achat et la mobilité des Français",
    "titrePrincipalCourt": "taxe valeur ajoutée taxe produits énergétiques pouvoir d'achat mobilité"
  },
  "dossierRef": "DLR5L15N37008",
  "classification": {
    "famille": {
      "depot": {
        "code": "INITDEP",
        "libelle": "Initiative en 1er Dépôt"
      },
      "classe": {
        "code": "PIONLOI",
        "libelle": "Proposition de loi"
      }
    },
    "type": {
      "code": "PION",
      "libelle": "Proposition de loi"
    }
  },
  "auteurs": [
    {
      "acteur": {
        "acteurRef": "PA720822",
        "qualite": "auteur"
      }
    }
  ],
  "notice": {
    "numNotice": "1426",
    "formule": "visant à supprimer la taxe sur la valeur ajoutée sur le montant de la taxe intérieure sur la consommation de produits énergétiques afin de préserver le pouvoir d'achat et la mobilité des Français",
    "adoptionConforme": false
  },
  "coSignataires": [
    {
      "acteurRef": "PA720614",
      "dateCosignature": "2018-11-21+01:00",
      "edite": false
    },
    {
      "acteurRef": "PA720798",
      "dateCosignature": "2018-11-21+01:00",
      "edite": false
    },
    {
      "acteurRef": "PA720468",
      "dateCosignature": "2018-11-21+01:00",
      "edite": false
    },
    {
      "acteurRef": "PA606212",
      "dateCosignature": "2018-11-21+01:00",
      "edite": false
    },
    {
      "acteurRef": "PA720606",
      "dateCosignature": "2018-11-21+01:00",
      "edite": false
    },
    {
      "acteurRef": "PA721932",
      "dateCosignature": "2018-12-04+01:00",
      "edite": false
    }
  ],
  "depotAmendements": {
    "amendementsSeance": {
      "amendable": false
    },
    "amendementsCommission": [
      {
        "organeRef": "PO59048",
        "amendable": true
      }
    ]
  }
}