{
  "xsiType": "DossierMissionInformation_Type",
  "uid": "DLR5L15N37682",
  "legislature": "15",
  "titreDossier": {
    "titre": "Mission d'information sur le développement du Sahel",
    "titreChemin": "developpement_sahel_mi"
  },
  "procedureParlementaire": {
    "code": "10",
    "libelle": "Mission d'information"
  },
  "initiateur": {
    "organeRef": "PO766886"
  },
  "actesLegislatifs": [
    {
      "xsiType": "Etape_Type",
      "uid": "L15-AN20-37682",
      "codeActe": "AN20",
      "libelleActe": {
        "nomCanonique": "Travaux"
      },
      "organeRef": "PO717460",
      "actesLegislatifs": [
        {
          "xsiType": "Etape_Type",
          "uid": "L15-AN20-MISINF-37682",
          "codeActe": "AN20-MISINF",
          "libelleActe": {
            "nomCanonique": "Mission d'information",
            "libelleCourt": "Mission d'information"
          },
          "organeRef": "PO766886",
          "actesLegislatifs": [
            {
              "xsiType": "CreationOrganeTemporaire_Type",
              "uid": "L15-VD190578",
              "codeActe": "AN20-MISINF-CREA",
              "libelleActe": {
                "nomCanonique": "Création d'une mission d'information",
                "libelleCourt": "Création d'une mission d'information"
              },
              "organeRef": "PO766886",
              "dateActe": "2019-07-26T00:00:00.000+02:00",
              "initiateur": {
                "organeRef": "PO766886"
              }
            }
          ]
        }
      ]
    }
  ]
}