{
  "xsiType": "texteLoi_Type",
  "uid": "AVISANR5L15B0942",
  "legislature": "15",
  "cycleDeVie": {
    "chrono": {
      "dateCreation": "2018-05-15T00:00:00.000+02:00",
      "dateDepot": "2018-05-15T00:00:00.000+02:00",
      "datePublication": "2018-05-23T00:00:00.000+02:00",
      "datePublicationWeb": "2018-05-18T18:50:00.000+02:00"
    }
  },
  "denominationStructurelle": "Avis",
  "provenance": "Commission",
  "titres": {
    "titrePrincipal": "avis sur le projet de loi, après engagement de la procédure accélérée, portant évolution du logement, de l’aménagement et du numérique (n°846).",
    "titrePrincipalCourt": "avis sur le projet de loi, après engagement de la procédure accélérée, portant évolution du logement, de l’aménagement et du numérique (n°846)."
  },
  "dossierRef": "DLR5L15N36537",
  "classification": {
    "famille": {
      "depot": {
        "code": "RAPINIT",
        "libelle": "Rapport sur une initiative"
      },
      "classe": {
        "code": "AVIS",
        "libelle": "Avis"
      }
    },
    "type": {
      "code": "AVIS",
      "libelle": "Avis"
    }
  },
  "auteurs": [
    {
      "acteur": {
        "acteurRef": "PA719108",
        "qualite": "rapporteur pour avis"
      }
    },
    {
      "organeRef": "PO419604"
    }
  ],
  "notice": {
    "numNotice": "942",
    "formule": "sur le projet de loi, après engagement de la procédure accélérée, portant évolution du logement, de l’aménagement et du numérique (n°846).",
    "adoptionConforme": false
  },
  "imprimerie": {
    "prix": "3.0"
  }
}