{
  "xsiType": "DossierLegislatif_Type",
  "uid": "DLR5L15N37168",
  "legislature": "15",
  "titreDossier": {
    "titre": "Transparence dans l'utilisation de l'épargne populaire en matière énergétique",
    "titreChemin": "transparence_epargne_populaire_energie",
    "senatChemin": "http://www.senat.fr/dossier-legislatif/ppl18-373.html"
  },
  "procedureParlementaire": {
    "code": "2",
    "libelle": "Proposition de loi ordinaire"
  },
  "initiateur": {
    "acteurs": [
      {
        "acteurRef": "PA721896",
        "mandatRef": "PM723414"
      }
    ]
  },
  "actesLegislatifs": [
    {
      "xsiType": "Etape_Type",
      "uid": "L15-AN1-37168",
      "codeActe": "AN1",
      "libelleActe": {
        "nomCanonique": "1ère lecture (1ère assemblée saisie)",
        "libelleCourt": "1ère lecture"
      },
      "organeRef": "PO717460",
      "actesLegislatifs": [
        {
          "xsiType": "DepotInitiative_Type",
          "uid": "L15-VD188124DI",
          "codeActe": "AN1-DEPOT",
          "libelleActe": {
            "nomCanonique": "1er dépôt d'une initiative.",
            "libelleCourt": "1er dépôt d'une initiative."
          },
          "organeRef": "PO717460",
          "dateActe": "2019-01-23T00:00:00.000+01:00",
          "texteAssocieRef": "PIONANR5L15B1611"
        },
        {
          "xsiType": "Etape_Type",
          "uid": "L15-AN1-COM-37168",
          "codeActe": "AN1-COM",
          "libelleActe": {
            "nomCanonique": "Travaux des commissions",
            "libelleCourt": "Travaux des commissions"
          },
          "organeRef": "PO717460",
          "actesLegislatifs": [
            {
              "xsiType": "Etape_Type",
              "uid": "L15-VD188125CF",
              "codeActe": "AN1-COM-FOND",
              "libelleActe": {
                "nomCanonique": "Travaux de la commission saisie au fond",
                "libelleCourt": "Travaux de la commission saisie au fond"
              },
              "organeRef": "PO59048",
              "actesLegislatifs": [
                {
                  "xsiType": "SaisieComFond_Type",
                  "uid": "L15-VD188125CFS",
                  "codeActe": "AN1-COM-FOND-SAISIE",
                  "libelleActe": {
                    "nomCanonique": "Renvoi en commission au fond",
                    "libelleCourt": "Renvoi en commission au fond"
                  },
                  "organeRef": "PO59048",
                  "dateActe": "2019-01-23T00:00:00.000+01:00"
                },
                {
                  "xsiType": "NominRapporteurs_Type",
                  "uid": "L15-VD188502",
                  "codeActe": "AN1-COM-FOND-NOMIN",
                  "libelleActe": {
                    "nomCanonique": "Nomination de rapporteur",
                    "libelleCourt": "Nomination de rapporteur"
                  },
                  "organeRef": "PO59048",
                  "dateActe": "2019-02-20T00:00:00.000+01:00",
                  "rapporteurs": [
                    {
                      "acteurRef": "PA721896",
                      "typeRapporteur": "rapporteur"
                    }
                  ]
                },
                {
                  "xsiType": "DiscussionCommission_Type",
                  "uid": "L15-VD188231R26378",
                  "codeActe": "AN1-COM-FOND-REUNION",
                  "libelleActe": {
                    "nomCanonique": "Réunion de commission",
                    "libelleCourt": "Réunion de commission"
                  },
                  "organeRef": "PO59048",
                  "dateActe": "2019-02-20T09:30:00.000+01:00",
                  "odjRef": "RUANR5L15S2019IDC431429PT26378",
                  "reunionRef": "RUANR5L15S2019IDC431429"
                },
                {
                  "xsiType": "DepotRapport_Type",
                  "uid": "L15-VD188504",
                  "codeActe": "AN1-COM-FOND-RAPPORT",
                  "libelleActe": {
                    "nomCanonique": "Dépôt de rapport",
                    "libelleCourt": "Dépôt de rapport"
                  },
                  "organeRef": "PO59048",
                  "dateActe": "2019-02-20T00:00:00.000+01:00",
                  "texteAssocieRef": "RAPPANR5L15B1700"
                }
              ]
            }
          ]
        },
        {
          "xsiType": "Etape_Type",
          "uid": "L15-AN1-DEBATS-37168",
          "codeActe": "AN1-DEBATS",
          "libelleActe": {
            "nomCanonique": "Discussion en séance publique",
            "libelleCourt": "Discussion en séance publique"
          },
          "organeRef": "PO717460",
          "actesLegislatifs": [
            {
              "xsiType": "DiscussionSeancePublique_Type",
              "uid": "L15-VD188263S36957",
              "codeActe": "AN1-DEBATS-SEANCE",
              "libelleActe": {
                "nomCanonique": "Discussion en séance publique",
                "libelleCourt": "Discussion en séance publique"
              },
              "organeRef": "PO717460",
              "dateActe": "2019-03-07T00:00:00.000+01:00",
              "odjRef": "RUANR5L15S2019IDS21522PT36957",
              "reunionRef": "RUANR5L15S2019IDS21522"
            },
            {
              "xsiType": "DiscussionSeancePublique_Type",
              "uid": "L15-VD188263S36962",
              "codeActe": "AN1-DEBATS-SEANCE",
              "libelleActe": {
                "nomCanonique": "Discussion en séance publique",
                "libelleCourt": "Discussion en séance publique"
              },
              "organeRef": "PO717460",
              "dateActe": "2019-03-07T00:00:00.000+01:00",
              "odjRef": "RUANR5L15S2019IDS21523PT36962",
              "reunionRef": "RUANR5L15S2019IDS21523"
            },
            {
              "xsiType": "DiscussionSeancePublique_Type",
              "uid": "L15-VD188263S36968",
              "codeActe": "AN1-DEBATS-SEANCE",
              "libelleActe": {
                "nomCanonique": "Discussion en séance publique",
                "libelleCourt": "Discussion en séance publique"
              },
              "organeRef": "PO717460",
              "dateActe": "2019-03-07T00:00:00.000+01:00",
              "odjRef": "RUANR5L15S2019IDS21524PT36968",
              "reunionRef": "RUANR5L15S2019IDS21524"
            },
            {
              "xsiType": "Decision_Type",
              "uid": "L15-VD188722DEC",
              "codeActe": "AN1-DEBATS-DEC",
              "libelleActe": {
                "nomCanonique": "Décision",
                "libelleCourt": "Décision"
              },
              "organeRef": "PO717460",
              "dateActe": "2019-03-07T00:00:00.000+01:00",
              "reunionRef": "RUANR5L15S2019IDS21524",
              "statutConclusion": {
                "famCode": "TSORTF01",
                "libelle": "adoptée"
              },
              "textesAssocies": [
                {
                  "typeTexte": "BTA",
                  "texteAssocieRef": "PIONANR5L15BTA0240"
                },
                {
                  "typeTexte": "TAP",
                  "texteAssocieRef": "PIONANR5L15TAP0240"
                }
              ]
            }
          ]
        }
      ]
    },
    {
      "xsiType": "Etape_Type",
      "uid": "L15-SN1-37168",
      "codeActe": "SN1",
      "libelleActe": {
        "nomCanonique": "1ère lecture (2ème assemblée saisie)",
        "libelleCourt": "1ère lecture"
      },
      "organeRef": "PO78718",
      "actesLegislatifs": [
        {
          "xsiType": "DepotInitiativeNavette_Type",
          "uid": "L15-VD188731DIN",
          "codeActe": "SN1-DEPOT",
          "libelleActe": {
            "nomCanonique": "Dépôt d'une initiative en navette",
            "libelleCourt": "Dépôt d'une initiative en navette"
          },
          "organeRef": "PO78718",
          "dateActe": "2019-03-08T00:00:00.000+01:00",
          "provenanceRef": "PO717460",
          "texteAssocieRef": "PIONSNR5S319B0373"
        },
        {
          "xsiType": "Etape_Type",
          "uid": "L15-SN1-COM-37168",
          "codeActe": "SN1-COM",
          "libelleActe": {
            "nomCanonique": "Travaux des commissions",
            "libelleCourt": "Travaux des commissions"
          },
          "organeRef": "PO78718",
          "actesLegislatifs": [
            {
              "xsiType": "Etape_Type",
              "uid": "L15-VD188732CF",
              "codeActe": "SN1-COM-FOND",
              "libelleActe": {
                "nomCanonique": "Travaux de la commission saisie au fond",
                "libelleCourt": "Travaux de la commission saisie au fond"
              },
              "organeRef": "PO211494",
              "actesLegislatifs": [
                {
                  "xsiType": "SaisieComFond_Type",
                  "uid": "L15-VD188732CFS",
                  "codeActe": "SN1-COM-FOND-SAISIE",
                  "libelleActe": {
                    "nomCanonique": "Renvoi en commission au fond",
                    "libelleCourt": "Renvoi en commission au fond"
                  },
                  "organeRef": "PO211494",
                  "dateActe": "2019-03-08T00:00:00.000+01:00"
                }
              ]
            }
          ]
        }
      ]
    }
  ]
}