{
  "xsiType": "rapportParlementaire_Type",
  "uid": "RAPPANR5L15B2181",
  "legislature": "15",
  "cycleDeVie": {
    "chrono": {
      "dateCreation": "2019-07-23T00:00:00.000+02:00",
      "dateDepot": "2019-07-23T00:00:00.000+02:00",
      "datePublication": "2019-07-24T00:00:00.000+02:00",
      "datePublicationWeb": "2019-07-23T22:15:00.000+02:00"
    }
  },
  "denominationStructurelle": "Rapport",
  "provenance": "Commission",
  "titres": {
    "titrePrincipal": "rapport la commission mixte paritaire chargée de proposer un texte sur les dispositions restant en discussion du projet de loi relatif à la création de l'Agence nationale du sport et à diverses dispositions relatives à l'organisation des jeux Olympiques et Paralympiques de 2024.",
    "titrePrincipalCourt": "rapport la commission mixte paritaire chargée de proposer un texte sur les dispositions restant en discussion du projet de loi relatif à la création de l'Agence nationale du sport et à diverses dispositions relatives à l'organisation des jeux Olympiques et Paralympiques de 2024."
  },
  "dossierRef": "DLR5L15N37573",
  "classification": {
    "famille": {
      "depot": {
        "code": "RAPINIT",
        "libelle": "Rapport sur une initiative"
      },
      "classe": {
        "code": "RAPPORT",
        "libelle": "Rapport"
      }
    },
    "type": {
      "code": "RAPP",
      "libelle": "Rapport"
    },
    "statutAdoption": "ADOPTCOM"
  },
  "auteurs": [
    {
      "acteur": {
        "acteurRef": "PA703501",
        "qualite": "rapporteur"
      }
    },
    {
      "acteur": {
        "acteurRef": "PA720854",
        "qualite": "rapporteur"
      }
    },
    {
      "organeRef": "PO766521"
    }
  ],
  "notice": {
    "numNotice": "2181",
    "formule": "de la commission mixte paritaire chargée de proposer un texte sur les dispositions restant en discussion du projet de loi relatif à la création de l'Agence nationale du sport et à diverses dispositions relatives à l'organisation des jeux Olympiques et Paralympiques de 2024.",
    "adoptionConforme": false
  },
  "imprimerie": {
    "nbPage": "0",
    "prix": "0.75"
  }
}