{
  "xsiType": "texteLoi_Type",
  "uid": "PRJLSNR5S319B0157",
  "cycleDeVie": {
    "chrono": {
      "dateCreation": "2018-11-27T00:00:00.000+01:00",
      "dateDepot": "2018-11-26T00:00:00.000+01:00",
      "datePublication": "2019-04-02T00:00:00.000+02:00"
    }
  },
  "denominationStructurelle": "Projet de loi",
  "provenance": "Texte Déposé",
  "titres": {
    "titrePrincipal": "projet de loi d'orientation des mobilités",
    "titrePrincipalCourt": "Loi d'orientation des mobilités"
  },
  "dossierRef": "DLR5L15N37029",
  "classification": {
    "famille": {
      "depot": {
        "code": "INITDEP",
        "libelle": "Initiative en 1er Dépôt"
      },
      "classe": {
        "code": "PRJLOI",
        "libelle": "Projet de loi"
      }
    },
    "type": {
      "code": "PRJL",
      "libelle": "Projet de loi"
    }
  },
  "auteurs": [
    {
      "acteur": {
        "acteurRef": "PA345619",
        "qualite": "auteur"
      }
    }
  ],
  "correction": {
    "typeCorrection": "Rectifié",
    "niveauCorrection": "1"
  },
  "notice": {
    "numNotice": "157",
    "formule": "d'orientation des mobilités",
    "adoptionConforme": false
  },
  "imprimerie": {
    "nbPage": "0"
  },
  "coSignataires": [
    {
      "acteurRef": "PA332747",
      "dateCosignature": "2018-11-26+01:00",
      "edite": true
    }
  ],
  "depotAmendements": {
    "amendementsSeance": {
      "amendable": false
    }
  }
}