{
  "xsiType": "DossierLegislatif_Type",
  "uid": "DLR5L15N35926",
  "legislature": "15",
  "titreDossier": {
    "titre": "Offres de prêt immobilier conditionnées à la domiciliation des revenus de l'emprunteur",
    "titreChemin": "ratification_ordonnance_2017-1090",
    "senatChemin": "http://www.senat.fr/dossier-legislatif/pjl16-710.html"
  },
  "procedureParlementaire": {
    "code": "1",
    "libelle": "Projet de loi ordinaire"
  },
  "initiateur": {
    "acteurs": [
      {
        "acteurRef": "PA345619",
        "mandatRef": "PM725692"
      }
    ]
  },
  "actesLegislatifs": [
    {
      "xsiType": "Etape_Type",
      "uid": "L15-SN1-35926",
      "codeActe": "SN1",
      "libelleActe": {
        "nomCanonique": "1ère lecture (1ère assemblée saisie)",
        "libelleCourt": "1ère lecture"
      },
      "organeRef": "PO78718",
      "actesLegislatifs": [
        {
          "xsiType": "DepotInitiative_Type",
          "uid": "L15-VD182614DI",
          "codeActe": "SN1-DEPOT",
          "libelleActe": {
            "nomCanonique": "1er dépôt d'une initiative.",
            "libelleCourt": "1er dépôt d'une initiative."
          },
          "organeRef": "PO78718",
          "dateActe": "2017-08-30T00:00:00.000+02:00",
          "texteAssocieRef": "PRJLSNR5S279B0710"
        },
        {
          "xsiType": "Etape_Type",
          "uid": "L15-SN1-COM-35926",
          "codeActe": "SN1-COM",
          "libelleActe": {
            "nomCanonique": "Travaux des commissions",
            "libelleCourt": "Travaux des commissions"
          },
          "organeRef": "PO78718",
          "actesLegislatifs": [
            {
              "xsiType": "Etape_Type",
              "uid": "L15-VD182615CF",
              "codeActe": "SN1-COM-FOND",
              "libelleActe": {
                "nomCanonique": "Travaux de la commission saisie au fond",
                "libelleCourt": "Travaux de la commission saisie au fond"
              },
              "organeRef": "PO211494",
              "actesLegislatifs": [
                {
                  "xsiType": "SaisieComFond_Type",
                  "uid": "L15-VD182615CFS",
                  "codeActe": "SN1-COM-FOND-SAISIE",
                  "libelleActe": {
                    "nomCanonique": "Renvoi en commission au fond",
                    "libelleCourt": "Renvoi en commission au fond"
                  },
                  "organeRef": "PO211494",
                  "dateActe": "2017-08-30T00:00:00.000+02:00"
                }
              ]
            }
          ]
        }
      ]
    }
  ]
}