{
  "xsiType": "DossierMissionControle_Type",
  "uid": "DLR5L15N37218",
  "legislature": "15",
  "titreDossier": {
    "titre": "Sports : évaluation de la loi sur les sportifs de haut niveau et professionnels",
    "titreChemin": "evaluation_loi_sportifs_haut_niveau-rap-info"
  },
  "procedureParlementaire": {
    "code": "19",
    "libelle": "Rapport d'information sans mission"
  },
  "actesLegislatifs": [
    {
      "xsiType": "Etape_Type",
      "uid": "L15-AN20-37218",
      "codeActe": "AN20",
      "libelleActe": {
        "nomCanonique": "Travaux"
      },
      "organeRef": "PO717460",
      "actesLegislatifs": [
        {
          "xsiType": "DepotRapport_Type",
          "uid": "L15-VD188280",
          "codeActe": "AN20-RAPPORT",
          "libelleActe": {
            "nomCanonique": "Dépôt de rapport",
            "libelleCourt": "Dépôt de rapport"
          },
          "organeRef": "PO419604",
          "dateActe": "2019-02-06T00:00:00.000+01:00",
          "texteAssocieRef": "RINFANR5L15B1634"
        }
      ]
    }
  ]
}