{
  "xsiType": "texteLoi_Type",
  "uid": "PIONANR5L15B1009",
  "legislature": "15",
  "cycleDeVie": {
    "chrono": {
      "dateCreation": "2018-05-28T00:00:00.000+02:00",
      "dateDepot": "2018-05-30T00:00:00.000+02:00",
      "datePublication": "2018-06-05T00:00:00.000+02:00",
      "datePublicationWeb": "2018-05-31T17:20:00.000+02:00"
    }
  },
  "denominationStructurelle": "Proposition de loi",
  "provenance": "Texte Déposé",
  "titres": {
    "titrePrincipal": "proposition de loi visant à étendre le principe de laïcité aux établissements publics d'enseignement supérieur",
    "titrePrincipalCourt": "laïcité enseignement supérieur"
  },
  "dossierRef": "DLR5L15N36662",
  "classification": {
    "famille": {
      "depot": {
        "code": "INITDEP",
        "libelle": "Initiative en 1er Dépôt"
      },
      "classe": {
        "code": "PIONLOI",
        "libelle": "Proposition de loi"
      }
    },
    "type": {
      "code": "PION",
      "libelle": "Proposition de loi"
    }
  },
  "auteurs": [
    {
      "acteur": {
        "acteurRef": "PA330240",
        "qualite": "auteur"
      }
    }
  ],
  "notice": {
    "numNotice": "1009",
    "formule": "visant à étendre le principe de laïcité aux établissements publics d'enseignement supérieur",
    "adoptionConforme": false
  },
  "coSignataires": [
    {
      "acteurRef": "PA2377",
      "dateCosignature": "2018-05-30+02:00",
      "edite": false
    },
    {
      "acteurRef": "PA608826",
      "dateCosignature": "2018-05-30+02:00",
      "edite": false
    },
    {
      "acteurRef": "PA267318",
      "dateCosignature": "2018-05-30+02:00",
      "edite": false
    },
    {
      "acteurRef": "PA266774",
      "dateCosignature": "2018-05-30+02:00",
      "edite": false
    },
    {
      "acteurRef": "PA267260",
      "dateCosignature": "2018-05-30+02:00",
      "edite": false
    },
    {
      "acteurRef": "PA330788",
      "dateCosignature": "2018-05-30+02:00",
      "edite": false
    },
    {
      "acteurRef": "PA642847",
      "dateCosignature": "2018-05-30+02:00",
      "edite": false
    },
    {
      "acteurRef": "PA266776",
      "dateCosignature": "2018-05-30+02:00",
      "edite": false
    },
    {
      "acteurRef": "PA605036",
      "dateCosignature": "2018-05-30+02:00",
      "edite": false
    },
    {
      "acteurRef": "PA608416",
      "dateCosignature": "2018-05-30+02:00",
      "edite": false
    },
    {
      "acteurRef": "PA721968",
      "dateCosignature": "2018-05-30+02:00",
      "edite": false
    },
    {
      "acteurRef": "PA336316",
      "dateCosignature": "2018-05-30+02:00",
      "edite": false
    },
    {
      "acteurRef": "PA1029",
      "dateCosignature": "2018-05-30+02:00",
      "edite": false
    },
    {
      "acteurRef": "PA223837",
      "dateCosignature": "2018-05-30+02:00",
      "edite": false
    },
    {
      "acteurRef": "PA718784",
      "dateCosignature": "2018-05-30+02:00",
      "edite": false
    },
    {
      "acteurRef": "PA330684",
      "dateCosignature": "2018-05-30+02:00",
      "edite": false
    },
    {
      "acteurRef": "PA346218",
      "dateCosignature": "2018-05-30+02:00",
      "edite": false
    },
    {
      "acteurRef": "PA267289",
      "dateCosignature": "2018-05-30+02:00",
      "edite": false
    },
    {
      "acteurRef": "PA720684",
      "dateCosignature": "2018-05-30+02:00",
      "edite": false
    },
    {
      "acteurRef": "PA2155",
      "dateCosignature": "2018-05-30+02:00",
      "edite": false
    },
    {
      "acteurRef": "PA720644",
      "dateCosignature": "2018-05-30+02:00",
      "edite": false
    },
    {
      "acteurRef": "PA712015",
      "dateCosignature": "2018-05-30+02:00",
      "edite": false
    },
    {
      "acteurRef": "PA267735",
      "dateCosignature": "2018-05-30+02:00",
      "edite": false
    },
    {
      "acteurRef": "PA718884",
      "dateCosignature": "2018-05-30+02:00",
      "edite": false
    },
    {
      "acteurRef": "PA608016",
      "dateCosignature": "2018-05-30+02:00",
      "edite": false
    },
    {
      "acteurRef": "PA718780",
      "dateCosignature": "2018-05-30+02:00",
      "edite": false
    }
  ],
  "depotAmendements": {
    "amendementsSeance": {
      "amendable": false
    },
    "amendementsCommission": [
      {
        "organeRef": "PO59051",
        "amendable": true
      }
    ]
  }
}