{
  "xsiType": "texteLoi_Type",
  "uid": "PNREANR5L15B0335",
  "legislature": "15",
  "cycleDeVie": {
    "chrono": {
      "dateCreation": "2017-10-25T00:00:00.000+02:00",
      "dateDepot": "2017-10-25T00:00:00.000+02:00",
      "datePublication": "2017-11-07T00:00:00.000+01:00",
      "datePublicationWeb": "2017-10-31T17:25:00.000+01:00"
    }
  },
  "denominationStructurelle": "Proposition de résolution",
  "provenance": "Texte Déposé",
  "titres": {
    "titrePrincipal": "proposition de résolution tendant à la création d’une commission d’enquête sur la mobilité dans le parc locatif social",
    "titrePrincipalCourt": "Commission d'enquête parc locatif social"
  },
  "dossierRef": "DLR5L15N36083",
  "classification": {
    "famille": {
      "depot": {
        "code": "INITDEP",
        "libelle": "Initiative en 1er Dépôt"
      },
      "classe": {
        "code": "PIONRES",
        "libelle": "Proposition de résolution"
      },
      "espece": {
        "code": "COMENQ",
        "libelle": "tendant à la création d'une commission d'enquête"
      }
    },
    "type": {
      "code": "PNRE",
      "libelle": "Proposition de résolution"
    },
    "sousType": {
      "code": "COMENQ",
      "libelle": "tendant à la création d'une commission d'enquête"
    }
  },
  "auteurs": [
    {
      "acteur": {
        "acteurRef": "PA223837",
        "qualite": "auteur"
      }
    }
  ],
  "notice": {
    "numNotice": "335",
    "formule": "tendant à la création d’une commission d’enquête sur la mobilité dans le parc locatif social",
    "adoptionConforme": false
  },
  "coSignataires": [
    {
      "acteurRef": "PA721046",
      "dateCosignature": "2017-10-25+02:00",
      "edite": false
    },
    {
      "acteurRef": "PA642847",
      "dateCosignature": "2017-10-25+02:00",
      "edite": false
    },
    {
      "acteurRef": "PA767",
      "dateCosignature": "2017-10-25+02:00",
      "edite": false
    },
    {
      "acteurRef": "PA267429",
      "dateCosignature": "2017-10-25+02:00",
      "edite": false
    },
    {
      "acteurRef": "PA332523",
      "dateCosignature": "2017-10-25+02:00",
      "edite": false
    },
    {
      "acteurRef": "PA1327",
      "dateCosignature": "2017-10-25+02:00",
      "edite": false
    },
    {
      "acteurRef": "PA608416",
      "dateCosignature": "2017-10-25+02:00",
      "edite": false
    },
    {
      "acteurRef": "PA609245",
      "dateCosignature": "2017-10-25+02:00",
      "edite": false
    },
    {
      "acteurRef": "PA719272",
      "dateCosignature": "2017-10-25+02:00",
      "edite": false
    },
    {
      "acteurRef": "PA721286",
      "dateCosignature": "2017-10-25+02:00",
      "edite": false
    },
    {
      "acteurRef": "PA721968",
      "dateCosignature": "2017-10-25+02:00",
      "edite": false
    },
    {
      "acteurRef": "PA267260",
      "dateCosignature": "2017-11-02+01:00",
      "edite": false
    },
    {
      "acteurRef": "PA266774",
      "dateCosignature": "2017-11-15+01:00",
      "edite": false
    },
    {
      "acteurRef": "PA721314",
      "dateCosignature": "2017-11-15+01:00",
      "edite": false
    },
    {
      "acteurRef": "PA340853",
      "dateCosignature": "2017-11-15+01:00",
      "edite": false
    }
  ]
}