{
  "xsiType": "texteLoi_Type",
  "uid": "PRJLSNR5S299BTC0359",
  "cycleDeVie": {
    "chrono": {
      "dateCreation": "2018-03-19T00:00:00.000+01:00",
      "dateDepot": "2018-03-14T00:00:00.000+01:00",
      "datePublicationWeb": "2018-03-14T14:00:00.000+01:00"
    }
  },
  "denominationStructurelle": "Projet de loi",
  "provenance": "Texte Déposé",
  "titres": {
    "titrePrincipal": "projet de loi  sur le projet de loi, adopté, par l'Assemblée nationale, autorisant la ratification du protocole n° 16 à la convention de sauvegarde des droits de l'homme et des libertés fondamentales (n°304).",
    "titrePrincipalCourt": "Ratification Protocole n° 16 CESDH"
  },
  "dossierRef": "DLR5L15N36240",
  "classification": {
    "famille": {
      "depot": {
        "code": "INITNAV",
        "libelle": "Initiative en Navette"
      },
      "classe": {
        "code": "PRJLOI",
        "libelle": "Projet de loi"
      },
      "espece": {
        "code": "AUTRATCONV",
        "libelle": "autorisant la ratification d'une convention"
      }
    },
    "type": {
      "code": "PRJL",
      "libelle": "Projet de loi"
    },
    "sousType": {
      "code": "AUTRATCONV",
      "libelle": "autorisant la ratification d'une convention",
      "libelleEdition": "autorisant la ratification d'une convention"
    }
  },
  "auteurs": [
    {
      "acteur": {
        "acteurRef": "PA736227",
        "qualite": "rapporteur"
      }
    },
    {
      "organeRef": "PO211491"
    }
  ],
  "notice": {
    "numNotice": "359",
    "formule": "sur le projet de loi, adopté, par l'Assemblée nationale, autorisant la ratification du protocole n° 16 à la convention de sauvegarde des droits de l'homme et des libertés fondamentales (n°304).",
    "adoptionConforme": false
  },
  "imprimerie": {
    "nbPage": "0"
  },
  "depotAmendements": {
    "amendementsSeance": {
      "amendable": false
    }
  }
}