{
  "xsiType": "DossierMissionControle_Type",
  "uid": "DLR5L15N36779",
  "legislature": "15",
  "titreDossier": {
    "titre": "Défiscalisation dans les outre-mer",
    "titreChemin": "defiscalisation_dans_outre-mer"
  },
  "procedureParlementaire": {
    "code": "19",
    "libelle": "Rapport d'information sans mission"
  },
  "actesLegislatifs": [
    {
      "xsiType": "Etape_Type",
      "uid": "L15-AN20-36779",
      "codeActe": "AN20",
      "libelleActe": {
        "nomCanonique": "Travaux"
      },
      "organeRef": "PO717460",
      "actesLegislatifs": [
        {
          "xsiType": "DepotRapport_Type",
          "uid": "L15-VD186406",
          "codeActe": "AN20-RAPPORT",
          "libelleActe": {
            "nomCanonique": "Dépôt de rapport",
            "libelleCourt": "Dépôt de rapport"
          },
          "organeRef": "PO675659",
          "dateActe": "2018-07-11T00:00:00.000+02:00",
          "texteAssocieRef": "RINFANR5L15B1153"
        }
      ]
    }
  ]
}