{
  "xsiType": "texteLoi_Type",
  "uid": "PIONANR5L15BTC2112",
  "legislature": "15",
  "cycleDeVie": {
    "chrono": {
      "dateCreation": "2019-07-03T00:00:00.000+02:00",
      "dateDepot": "2019-07-03T00:00:00.000+02:00",
      "datePublicationWeb": "2019-07-04T17:45:00.000+02:00"
    }
  },
  "denominationStructurelle": "Proposition de loi",
  "provenance": "Texte Déposé",
  "titres": {
    "titrePrincipal": "proposition de loi la commission mixte paritaire chargée de proposer un texte sur les dispositions restant en discussion de la proposition de loi visant à préserver les intérêts de la défense et de la sécurité nationale de la France dans le cadre de l'exploitation des réseaux radioélectriques mobiles.",
    "titrePrincipalCourt": "Sécurité nationale et exploitation des réseaux radioélectriques mobiles"
  },
  "dossierRef": "DLR5L15N37263",
  "classification": {
    "famille": {
      "depot": {
        "code": "INITNAV",
        "libelle": "Initiative en Navette"
      },
      "classe": {
        "code": "PIONLOI",
        "libelle": "Proposition de loi"
      }
    },
    "type": {
      "code": "PION",
      "libelle": "Proposition de loi"
    },
    "statutAdoption": "ADOPTCOM"
  },
  "auteurs": [
    {
      "acteur": {
        "acteurRef": "PA642695",
        "qualite": "rapporteur"
      }
    },
    {
      "organeRef": "PO766097"
    }
  ],
  "notice": {
    "numNotice": "2112",
    "formule": "de la commission mixte paritaire chargée de proposer un texte sur les dispositions restant en discussion de la proposition de loi visant à préserver les intérêts de la défense et de la sécurité nationale de la France dans le cadre de l'exploitation des réseaux radioélectriques mobiles.",
    "adoptionConforme": false
  },
  "imprimerie": {
    "nbPage": "0"
  },
  "depotAmendements": {
    "amendementsSeance": {
      "amendable": true
    }
  }
}