{
  "xsiType": "DossierMissionControle_Type",
  "uid": "DLR5L15N36649",
  "legislature": "15",
  "titreDossier": {
    "titre": "Travail : observations de la commission des affaires européennes sur le projet de loi pour la liberté de choisir son avenir professionnel",
    "titreChemin": "liberte_choisir_avenir_professionnel_cae"
  },
  "procedureParlementaire": {
    "code": "19",
    "libelle": "Rapport d'information sans mission"
  },
  "actesLegislatifs": [
    {
      "xsiType": "Etape_Type",
      "uid": "L15-AN20-36649",
      "codeActe": "AN20",
      "libelleActe": {
        "nomCanonique": "Travaux"
      },
      "organeRef": "PO717460",
      "actesLegislatifs": [
        {
          "xsiType": "DepotRapport_Type",
          "uid": "L15-VD185620",
          "codeActe": "AN20-RAPPORT",
          "libelleActe": {
            "nomCanonique": "Dépôt de rapport",
            "libelleCourt": "Dépôt de rapport"
          },
          "organeRef": "PO415287",
          "dateActe": "2018-05-24T00:00:00.000+02:00",
          "texteAssocieRef": "RINFANR5L15B0983"
        }
      ]
    }
  ]
}