{
  "xsiType": "texteLoi_Type",
  "uid": "PIONANR5L15B0854",
  "legislature": "15",
  "cycleDeVie": {
    "chrono": {
      "dateCreation": "2018-04-05T00:00:00.000+02:00",
      "dateDepot": "2018-04-05T00:00:00.000+02:00",
      "datePublication": "2018-04-16T00:00:00.000+02:00",
      "datePublicationWeb": "2018-04-11T16:50:00.000+02:00"
    }
  },
  "denominationStructurelle": "Proposition de loi",
  "provenance": "Texte Déposé",
  "titres": {
    "titrePrincipal": "proposition de loi relative à l'élection des conseillers métropolitains",
    "titrePrincipalCourt": "Election des conseillers métropolitains"
  },
  "dossierRef": "DLR5L15N36505",
  "classification": {
    "famille": {
      "depot": {
        "code": "INITNAV",
        "libelle": "Initiative en Navette"
      },
      "classe": {
        "code": "PIONLOI",
        "libelle": "Proposition de loi"
      }
    },
    "type": {
      "code": "PION",
      "libelle": "Proposition de loi"
    }
  },
  "auteurs": [
    {
      "organeRef": "PO717460"
    }
  ],
  "notice": {
    "numNotice": "854",
    "formule": ", adoptée par le Sénat, relative à l'élection des conseillers métropolitains",
    "adoptionConforme": false
  },
  "depotAmendements": {
    "amendementsSeance": {
      "amendable": false
    },
    "amendementsCommission": [
      {
        "organeRef": "PO59051",
        "amendable": true
      }
    ]
  }
}