{
  "xsiType": "texteLoi_Type",
  "uid": "PRJLSNR5S319BTC0369",
  "cycleDeVie": {
    "chrono": {
      "dateCreation": "2019-03-07T00:00:00.000+01:00",
      "dateDepot": "2019-03-06T00:00:00.000+01:00",
      "datePublicationWeb": "2019-03-06T14:00:00.000+01:00"
    }
  },
  "denominationStructurelle": "Projet de loi",
  "provenance": "Texte Déposé",
  "titres": {
    "titrePrincipal": "projet de loi sur le projet de loi, après engagement de la procédure accélérée, d'orientation des mobilités , (n°157 rectifié et lettre rectificative n°, 339).",
    "titrePrincipalCourt": "Loi d'orientation des mobilités"
  },
  "dossierRef": "DLR5L15N37029",
  "classification": {
    "famille": {
      "depot": {
        "code": "INITDEP",
        "libelle": "Initiative en 1er Dépôt"
      },
      "classe": {
        "code": "PRJLOI",
        "libelle": "Projet de loi"
      }
    },
    "type": {
      "code": "PRJL",
      "libelle": "Projet de loi"
    }
  },
  "auteurs": [
    {
      "acteur": {
        "acteurRef": "PA703497",
        "qualite": "rapporteur"
      }
    },
    {
      "organeRef": "PO516754"
    }
  ],
  "notice": {
    "numNotice": "369",
    "formule": "sur le projet de loi, après engagement de la procédure accélérée, d'orientation des mobilités , (n°157 rectifié et lettre rectificative n°, 339).",
    "adoptionConforme": false
  },
  "imprimerie": {
    "nbPage": "0"
  },
  "depotAmendements": {
    "amendementsSeance": {
      "amendable": false
    }
  }
}