{
  "xsiType": "rapportParlementaire_Type",
  "uid": "RAPPSNR5S299B0170",
  "cycleDeVie": {
    "chrono": {
      "dateCreation": "2017-12-14T00:00:00.000+01:00",
      "dateDepot": "2017-12-13T00:00:00.000+01:00"
    }
  },
  "denominationStructurelle": "Rapport",
  "provenance": "Commission",
  "titres": {
    "titrePrincipal": "rapport , en nouvelle lecture, les dispositions restant en discussion sur du projet de loi, modifié par le Sénat, de programmation des finances publiques pour les années 2018 à 2022 (n°378).",
    "titrePrincipalCourt": "rapport , en nouvelle lecture, les dispositions restant en discussion sur du projet de loi, modifié par le Sénat, de programmation des finances publiques pour les années 2018 à 2022 (n°378)."
  },
  "dossierRef": "DLR5L15N35984",
  "classification": {
    "famille": {
      "depot": {
        "code": "RAPINIT",
        "libelle": "Rapport sur une initiative"
      },
      "classe": {
        "code": "RAPPORT",
        "libelle": "Rapport"
      }
    },
    "type": {
      "code": "RAPP",
      "libelle": "Rapport"
    }
  },
  "auteurs": [
    {
      "acteur": {
        "acteurRef": "PA415448",
        "qualite": "rapporteur"
      }
    },
    {
      "organeRef": "PO742972"
    }
  ],
  "notice": {
    "numNotice": "170",
    "formule": ", en nouvelle lecture, les dispositions restant en discussion sur du projet de loi, modifié par le Sénat, de programmation des finances publiques pour les années 2018 à 2022 (n°378).",
    "adoptionConforme": false
  },
  "imprimerie": {
    "nbPage": "0"
  }
}