{
  "xsiType": "DossierLegislatif_Type",
  "uid": "DLR5L15N35950",
  "legislature": "15",
  "titreDossier": {
    "titre": "Accord de coopération transfrontalière avec Andorre",
    "titreChemin": "accord_cooperation_policiere_andorre",
    "senatChemin": "http://www.senat.fr/dossier-legislatif/pjl16-522.html"
  },
  "procedureParlementaire": {
    "code": "1",
    "libelle": "Projet de loi ordinaire"
  },
  "initiateur": {
    "acteurs": [
      {
        "acteurRef": "PA345619",
        "mandatRef": "PM725692"
      },
      {
        "acteurRef": "PA1872",
        "mandatRef": "PM730104"
      }
    ]
  },
  "actesLegislatifs": [
    {
      "xsiType": "Etape_Type",
      "uid": "L15-AN1-35950",
      "codeActe": "AN1",
      "libelleActe": {
        "nomCanonique": "1ère lecture (1ère assemblée saisie)",
        "libelleCourt": "1ère lecture"
      },
      "organeRef": "PO717460",
      "actesLegislatifs": [
        {
          "xsiType": "DepotInitiative_Type",
          "uid": "L15-VD182663DI",
          "codeActe": "AN1-DEPOT",
          "libelleActe": {
            "nomCanonique": "1er dépôt d'une initiative.",
            "libelleCourt": "1er dépôt d'une initiative."
          },
          "organeRef": "PO717460",
          "dateActe": "2017-09-19T00:00:00.000+02:00",
          "texteAssocieRef": "PRJLANR5L15B0168"
        },
        {
          "xsiType": "EtudeImpact_Type",
          "uid": "L15-VD182663ETI",
          "codeActe": "AN1-ETI",
          "libelleActe": {
            "nomCanonique": "Etude d'impact",
            "libelleCourt": "Etude d'impact"
          },
          "organeRef": "PO717460",
          "dateActe": "2017-09-19T00:00:00.000+02:00",
          "contributionInternaute": {
            "dateOuverture": "2017-09-22+02:00",
            "dateFermeture": "2017-12-18+01:00"
          },
          "texteAssocieRef": "ETDIANR5L15B0168"
        },
        {
          "xsiType": "DepotAccordInternational_Type",
          "uid": "L15-VD182663ACIN",
          "codeActe": "AN1-ACIN",
          "libelleActe": {
            "nomCanonique": "Accord international",
            "libelleCourt": "Accord international"
          },
          "organeRef": "PO717460",
          "dateActe": "2017-09-19T00:00:00.000+02:00",
          "texteAssocieRef": "ACINANR5L15B0168"
        },
        {
          "xsiType": "Etape_Type",
          "uid": "L15-AN1-COM-35950",
          "codeActe": "AN1-COM",
          "libelleActe": {
            "nomCanonique": "Travaux des commissions",
            "libelleCourt": "Travaux des commissions"
          },
          "organeRef": "PO717460",
          "actesLegislatifs": [
            {
              "xsiType": "Etape_Type",
              "uid": "L15-VD182664CF",
              "codeActe": "AN1-COM-FOND",
              "libelleActe": {
                "nomCanonique": "Travaux de la commission saisie au fond",
                "libelleCourt": "Travaux de la commission saisie au fond"
              },
              "organeRef": "PO59047",
              "actesLegislatifs": [
                {
                  "xsiType": "SaisieComFond_Type",
                  "uid": "L15-VD182664CFS",
                  "codeActe": "AN1-COM-FOND-SAISIE",
                  "libelleActe": {
                    "nomCanonique": "Renvoi en commission au fond",
                    "libelleCourt": "Renvoi en commission au fond"
                  },
                  "organeRef": "PO59047",
                  "dateActe": "2017-09-19T00:00:00.000+02:00"
                },
                {
                  "xsiType": "NominRapporteurs_Type",
                  "uid": "L15-VD183193",
                  "codeActe": "AN1-COM-FOND-NOMIN",
                  "libelleActe": {
                    "nomCanonique": "Nomination de rapporteur",
                    "libelleCourt": "Nomination de rapporteur"
                  },
                  "organeRef": "PO59047",
                  "dateActe": "2017-10-24T00:00:00.000+02:00",
                  "rapporteurs": [
                    {
                      "acteurRef": "PA721166",
                      "typeRapporteur": "rapporteur"
                    }
                  ]
                },
                {
                  "xsiType": "DiscussionCommission_Type",
                  "uid": "L15-VD183198R25181",
                  "codeActe": "AN1-COM-FOND-REUNION",
                  "libelleActe": {
                    "nomCanonique": "Réunion de commission",
                    "libelleCourt": "Réunion de commission"
                  },
                  "organeRef": "PO59047",
                  "dateActe": "2017-10-24T17:30:00.000+02:00",
                  "odjRef": "RUANR5L15S2018IDC427469PT25181",
                  "reunionRef": "RUANR5L15S2018IDC427469"
                },
                {
                  "xsiType": "DiscussionCommission_Type",
                  "uid": "L15-VD183198R25293",
                  "codeActe": "AN1-COM-FOND-REUNION",
                  "libelleActe": {
                    "nomCanonique": "Réunion de commission",
                    "libelleCourt": "Réunion de commission"
                  },
                  "organeRef": "PO59047",
                  "dateActe": "2017-12-05T16:30:00.000+01:00",
                  "odjRef": "RUANR5L15S2018IDC428017PT25293",
                  "reunionRef": "RUANR5L15S2018IDC428017"
                },
                {
                  "xsiType": "DepotRapport_Type",
                  "uid": "L15-VD183637",
                  "codeActe": "AN1-COM-FOND-RAPPORT",
                  "libelleActe": {
                    "nomCanonique": "Dépôt de rapport",
                    "libelleCourt": "Dépôt de rapport"
                  },
                  "organeRef": "PO59047",
                  "dateActe": "2017-12-05T00:00:00.000+01:00",
                  "texteAssocieRef": "RAPPANR5L15B0442"
                }
              ]
            }
          ]
        },
        {
          "xsiType": "Etape_Type",
          "uid": "L15-AN1-DEBATS-35950",
          "codeActe": "AN1-DEBATS",
          "libelleActe": {
            "nomCanonique": "Discussion en séance publique",
            "libelleCourt": "Discussion en séance publique"
          },
          "organeRef": "PO717460",
          "actesLegislatifs": [
            {
              "xsiType": "DiscussionSeancePublique_Type",
              "uid": "L15-VD183553S35367",
              "codeActe": "AN1-DEBATS-SEANCE",
              "libelleActe": {
                "nomCanonique": "Discussion en séance publique",
                "libelleCourt": "Discussion en séance publique"
              },
              "organeRef": "PO717460",
              "dateActe": "2017-12-18T00:00:00.000+01:00",
              "odjRef": "RUANR5L15S2018IDS20846PT35367",
              "reunionRef": "RUANR5L15S2018IDS20846"
            },
            {
              "xsiType": "Decision_Type",
              "uid": "L15-VD183864DEC",
              "codeActe": "AN1-DEBATS-DEC",
              "libelleActe": {
                "nomCanonique": "Décision",
                "libelleCourt": "Décision"
              },
              "organeRef": "PO717460",
              "dateActe": "2017-12-18T00:00:00.000+01:00",
              "reunionRef": "RUANR5L15S2018IDS20846",
              "statutConclusion": {
                "famCode": "TSORTF01",
                "libelle": "adopté"
              },
              "textesAssocies": [
                {
                  "typeTexte": "BTA",
                  "texteAssocieRef": "PRJLANR5L15BTA0053"
                }
              ]
            }
          ]
        }
      ]
    },
    {
      "xsiType": "Etape_Type",
      "uid": "L15-SN1-35950",
      "codeActe": "SN1",
      "libelleActe": {
        "nomCanonique": "1ère lecture (2ème assemblée saisie)",
        "libelleCourt": "1ère lecture"
      },
      "organeRef": "PO78718",
      "actesLegislatifs": [
        {
          "xsiType": "DepotInitiativeNavette_Type",
          "uid": "L15-VD184181DIN",
          "codeActe": "SN1-DEPOT",
          "libelleActe": {
            "nomCanonique": "Dépôt d'une initiative en navette",
            "libelleCourt": "Dépôt d'une initiative en navette"
          },
          "organeRef": "PO78718",
          "dateActe": "2017-12-19T00:00:00.000+01:00",
          "provenanceRef": "PO717460",
          "texteAssocieRef": "PRJLSNR5S299B0185"
        },
        {
          "xsiType": "Etape_Type",
          "uid": "L15-SN1-COM-35950",
          "codeActe": "SN1-COM",
          "libelleActe": {
            "nomCanonique": "Travaux des commissions",
            "libelleCourt": "Travaux des commissions"
          },
          "organeRef": "PO78718",
          "actesLegislatifs": [
            {
              "xsiType": "Etape_Type",
              "uid": "L15-VD184182CF",
              "codeActe": "SN1-COM-FOND",
              "libelleActe": {
                "nomCanonique": "Travaux de la commission saisie au fond",
                "libelleCourt": "Travaux de la commission saisie au fond"
              },
              "organeRef": "PO211491",
              "actesLegislatifs": [
                {
                  "xsiType": "SaisieComFond_Type",
                  "uid": "L15-VD184182CFS",
                  "codeActe": "SN1-COM-FOND-SAISIE",
                  "libelleActe": {
                    "nomCanonique": "Renvoi en commission au fond",
                    "libelleCourt": "Renvoi en commission au fond"
                  },
                  "organeRef": "PO211491",
                  "dateActe": "2017-12-19T00:00:00.000+01:00"
                },
                {
                  "xsiType": "NominRapporteurs_Type",
                  "uid": "L15-VD184200",
                  "codeActe": "SN1-COM-FOND-NOMIN",
                  "libelleActe": {
                    "nomCanonique": "Nomination de rapporteur",
                    "libelleCourt": "Nomination de rapporteur"
                  },
                  "organeRef": "PO211491",
                  "rapporteurs": [
                    {
                      "acteurRef": "PA703499",
                      "typeRapporteur": "rapporteur"
                    }
                  ]
                },
                {
                  "xsiType": "DepotRapport_Type",
                  "uid": "L15-VD184202",
                  "codeActe": "SN1-COM-FOND-RAPPORT",
                  "libelleActe": {
                    "nomCanonique": "Dépôt de rapport",
                    "libelleCourt": "Dépôt de rapport"
                  },
                  "organeRef": "PO211491",
                  "dateActe": "2018-01-17T00:00:00.000+01:00",
                  "texteAssocieRef": "RAPPSNR5S299B0223"
                }
              ]
            }
          ]
        },
        {
          "xsiType": "Etape_Type",
          "uid": "L15-SN1-DEBATS-35950",
          "codeActe": "SN1-DEBATS",
          "libelleActe": {
            "nomCanonique": "Discussion en séance publique",
            "libelleCourt": "Discussion en séance publique"
          },
          "organeRef": "PO78718",
          "actesLegislatifs": [
            {
              "xsiType": "DiscussionSeancePublique_Type",
              "uid": "L15-VD184189S35459",
              "codeActe": "SN1-DEBATS-SEANCE",
              "libelleActe": {
                "nomCanonique": "Discussion en séance publique",
                "libelleCourt": "Discussion en séance publique"
              },
              "organeRef": "PO78718",
              "dateActe": "2018-01-25T00:00:00.000+01:00",
              "odjRef": "RUSNR5L15S2018IDS20879PT35459",
              "reunionRef": "RUSNR5L15S2018IDS20879"
            },
            {
              "xsiType": "Decision_Type",
              "uid": "L15-VD184249DEC",
              "codeActe": "SN1-DEBATS-DEC",
              "libelleActe": {
                "nomCanonique": "Décision",
                "libelleCourt": "Décision"
              },
              "organeRef": "PO78718",
              "dateActe": "2018-01-25T00:00:00.000+01:00",
              "reunionRef": "RUSNR5L15S2018IDS20879",
              "statutConclusion": {
                "famCode": "TSORTF03",
                "libelle": "adopté sans modification"
              },
              "textesAssocies": [
                {
                  "typeTexte": "BTA",
                  "texteAssocieRef": "PRJLSNR5S299BTA0047"
                }
              ]
            }
          ]
        }
      ]
    },
    {
      "xsiType": "Etape_Type",
      "uid": "L15-PROM-35950",
      "codeActe": "PROM",
      "libelleActe": {
        "nomCanonique": "Promulgation de la loi",
        "libelleCourt": "Promulgation de la loi"
      },
      "organeRef": "PO717136",
      "actesLegislatifs": [
        {
          "xsiType": "Promulgation_Type",
          "uid": "L15-VD184356PL",
          "codeActe": "PROM-PUB",
          "libelleActe": {
            "nomCanonique": "Promulgation d'une loi",
            "libelleCourt": "Promulgation d'une loi"
          },
          "organeRef": "PO717136",
          "dateActe": "2018-01-31T00:00:00.000+01:00",
          "codeLoi": "2018-53",
          "infoJo": {
            "typeJo": "JO_LOI_DECRET",
            "dateJo": "2018-02-01+01:00",
            "numJo": "26",
            "urlLegifrance": "http://www.legifrance.gouv.fr/WAspad/UnTexteDeJorf?numjo=EAEJ1504024L",
            "referenceNor": "EAEJ1504024L"
          },
          "texteLoiRef": "PRJLSNR5S299BTA0047",
          "titreLoi": "autorisant l'approbation de l'accord entre le Gouvernement de la République française et le Gouvernement de la Principauté d'Andorre relatif à la coopération transfrontalière en matière policière et douanière"
        }
      ]
    }
  ]
}