{
  "xsiType": "avisConseilEtat_Type",
  "uid": "AVCEANR5L15B1738",
  "legislature": "15",
  "cycleDeVie": {
    "chrono": {
      "dateCreation": "2019-03-06T00:00:00.000+01:00",
      "dateDepot": "2019-03-06T00:00:00.000+01:00",
      "datePublication": "2019-03-15T00:00:00.000+01:00",
      "datePublicationWeb": "2019-03-07T17:30:00.000+01:00"
    }
  },
  "denominationStructurelle": "Projet de loi",
  "provenance": "Texte Déposé",
  "titres": {
    "titrePrincipal": "Avis du Conseil d'Etat sur le projet de loi ratifiant l’ordonnance n° 2018-1178 du 19 décembre 2018 relative aux mesures relevant du domaine de la loi nécessaires pour parfaire la transposition en droit interne des principes du code mondial antidopage et modifiant le code du sport",
    "titrePrincipalCourt": "Ratification ordonnance code du sport"
  },
  "dossierRef": "DLR5L15N37310",
  "classification": {
    "famille": {
      "depot": {
        "code": "INITDEP",
        "libelle": "Initiative en 1er Dépôt"
      },
      "classe": {
        "code": "PRJLOI",
        "libelle": "Projet de loi"
      }
    },
    "type": {
      "code": "AVCE",
      "libelle": "Avis du Conseil d'Etat"
    }
  },
  "auteurs": [
    {
      "acteur": {
        "acteurRef": "PA345619",
        "qualite": "auteur"
      }
    }
  ],
  "notice": {
    "numNotice": "1738",
    "formule": "ratifiant l’ordonnance n° 2018-1178 du 19 décembre 2018 relative aux mesures relevant du domaine de la loi nécessaires pour parfaire la transposition en droit interne des principes du code mondial antidopage et modifiant le code du sport",
    "adoptionConforme": false
  }
}