{
  "xsiType": "texteLoi_Type",
  "uid": "PIONANR5L15B1524",
  "legislature": "15",
  "cycleDeVie": {
    "chrono": {
      "dateCreation": "2018-12-11T00:00:00.000+01:00",
      "dateDepot": "2018-12-19T00:00:00.000+01:00",
      "datePublication": "2018-12-27T00:00:00.000+01:00",
      "datePublicationWeb": "2018-12-21T17:35:00.000+01:00"
    }
  },
  "denominationStructurelle": "Proposition de loi",
  "provenance": "Texte Déposé",
  "titres": {
    "titrePrincipal": "proposition de loi visant à développer le télétravail par la négociation dans l'entreprise",
    "titrePrincipalCourt": "développer télétravail entreprise"
  },
  "dossierRef": "DLR5L15N37063",
  "classification": {
    "famille": {
      "depot": {
        "code": "INITDEP",
        "libelle": "Initiative en 1er Dépôt"
      },
      "classe": {
        "code": "PIONLOI",
        "libelle": "Proposition de loi"
      }
    },
    "type": {
      "code": "PION",
      "libelle": "Proposition de loi"
    }
  },
  "auteurs": [
    {
      "acteur": {
        "acteurRef": "PA718784",
        "qualite": "auteur"
      }
    }
  ],
  "notice": {
    "numNotice": "1524",
    "formule": "visant à développer le télétravail par la négociation dans l'entreprise",
    "adoptionConforme": false
  },
  "coSignataires": [
    {
      "acteurRef": "PA605036",
      "dateCosignature": "2018-12-19+01:00",
      "edite": false
    },
    {
      "acteurRef": "PA719318",
      "dateCosignature": "2018-12-19+01:00",
      "edite": false
    },
    {
      "acteurRef": "PA721046",
      "dateCosignature": "2018-12-19+01:00",
      "edite": false
    },
    {
      "acteurRef": "PA642847",
      "dateCosignature": "2018-12-19+01:00",
      "edite": false
    },
    {
      "acteurRef": "PA721410",
      "dateCosignature": "2018-12-19+01:00",
      "edite": false
    },
    {
      "acteurRef": "PA713448",
      "dateCosignature": "2018-12-19+01:00",
      "edite": false
    },
    {
      "acteurRef": "PA718838",
      "dateCosignature": "2018-12-19+01:00",
      "edite": false
    },
    {
      "acteurRef": "PA722390",
      "dateCosignature": "2018-12-19+01:00",
      "edite": false
    },
    {
      "acteurRef": "PA267289",
      "dateCosignature": "2018-12-19+01:00",
      "edite": false
    },
    {
      "acteurRef": "PA608826",
      "dateCosignature": "2018-12-19+01:00",
      "edite": false
    },
    {
      "acteurRef": "PA266774",
      "dateCosignature": "2018-12-19+01:00",
      "edite": false
    },
    {
      "acteurRef": "PA267735",
      "dateCosignature": "2018-12-19+01:00",
      "edite": false
    },
    {
      "acteurRef": "PA266797",
      "dateCosignature": "2018-12-19+01:00",
      "edite": false
    },
    {
      "acteurRef": "PA267318",
      "dateCosignature": "2018-12-19+01:00",
      "edite": false
    },
    {
      "acteurRef": "PA1630",
      "dateCosignature": "2018-12-19+01:00",
      "edite": false
    },
    {
      "acteurRef": "PA1874",
      "dateCosignature": "2018-12-19+01:00",
      "edite": false
    },
    {
      "acteurRef": "PA267378",
      "dateCosignature": "2018-12-19+01:00",
      "edite": false
    },
    {
      "acteurRef": "PA608016",
      "dateCosignature": "2018-12-19+01:00",
      "edite": false
    },
    {
      "acteurRef": "PA606712",
      "dateCosignature": "2018-12-19+01:00",
      "edite": false
    },
    {
      "acteurRef": "PA719272",
      "dateCosignature": "2018-12-19+01:00",
      "edite": false
    },
    {
      "acteurRef": "PA720644",
      "dateCosignature": "2018-12-19+01:00",
      "edite": false
    },
    {
      "acteurRef": "PA721636",
      "dateCosignature": "2018-12-19+01:00",
      "edite": false
    },
    {
      "acteurRef": "PA2377",
      "dateCosignature": "2018-12-19+01:00",
      "edite": false
    },
    {
      "acteurRef": "PA267260",
      "dateCosignature": "2018-12-19+01:00",
      "edite": false
    },
    {
      "acteurRef": "PA2492",
      "dateCosignature": "2018-12-19+01:00",
      "edite": false
    },
    {
      "acteurRef": "PA721286",
      "dateCosignature": "2018-12-19+01:00",
      "edite": false
    },
    {
      "acteurRef": "PA266776",
      "dateCosignature": "2018-12-19+01:00",
      "edite": false
    },
    {
      "acteurRef": "PA2529",
      "dateCosignature": "2018-12-19+01:00",
      "edite": false
    },
    {
      "acteurRef": "PA267527",
      "dateCosignature": "2018-12-19+01:00",
      "edite": false
    },
    {
      "acteurRef": "PA721314",
      "dateCosignature": "2018-12-19+01:00",
      "edite": false
    },
    {
      "acteurRef": "PA267204",
      "dateCosignature": "2018-12-19+01:00",
      "edite": false
    },
    {
      "acteurRef": "PA334654",
      "dateCosignature": "2018-12-19+01:00",
      "edite": false
    },
    {
      "acteurRef": "PA643089",
      "dateCosignature": "2018-12-19+01:00",
      "edite": false
    },
    {
      "acteurRef": "PA709315",
      "dateCosignature": "2018-12-19+01:00",
      "edite": false
    },
    {
      "acteurRef": "PA721968",
      "dateCosignature": "2018-12-19+01:00",
      "edite": false
    },
    {
      "acteurRef": "PA721678",
      "dateCosignature": "2018-12-19+01:00",
      "edite": false
    },
    {
      "acteurRef": "PA1327",
      "dateCosignature": "2018-12-19+01:00",
      "edite": false
    }
  ],
  "depotAmendements": {
    "amendementsSeance": {
      "amendable": false
    },
    "amendementsCommission": [
      {
        "organeRef": "PO420120",
        "amendable": true
      }
    ]
  }
}