{
  "xsiType": "texteLoi_Type",
  "uid": "PIONANR5L15B1277",
  "legislature": "15",
  "cycleDeVie": {
    "chrono": {
      "dateCreation": "2018-09-27T00:00:00.000+02:00",
      "dateDepot": "2018-10-03T00:00:00.000+02:00",
      "datePublication": "2018-10-09T00:00:00.000+02:00",
      "datePublicationWeb": "2018-10-04T10:55:00.000+02:00"
    }
  },
  "denominationStructurelle": "Proposition de loi",
  "provenance": "Texte Déposé",
  "titres": {
    "titrePrincipal": "proposition de loi visant à permettre une dérogation au travail dominical pour les stagiaires de la formation professionnelle",
    "titrePrincipalCourt": "dérogation au travail dominical pour les stagiaires de la formation professionnelle"
  },
  "dossierRef": "DLR5L15N36869",
  "classification": {
    "famille": {
      "depot": {
        "code": "INITDEP",
        "libelle": "Initiative en 1er Dépôt"
      },
      "classe": {
        "code": "PIONLOI",
        "libelle": "Proposition de loi"
      }
    },
    "type": {
      "code": "PION",
      "libelle": "Proposition de loi"
    }
  },
  "auteurs": [
    {
      "acteur": {
        "acteurRef": "PA643134",
        "qualite": "auteur"
      }
    }
  ],
  "notice": {
    "numNotice": "1277",
    "formule": "visant à permettre une dérogation au travail dominical pour les stagiaires de la formation professionnelle",
    "adoptionConforme": false
  },
  "coSignataires": [
    {
      "acteurRef": "PA720684",
      "dateCosignature": "2018-10-03+02:00",
      "edite": false
    },
    {
      "acteurRef": "PA267204",
      "dateCosignature": "2018-10-03+02:00",
      "edite": false
    },
    {
      "acteurRef": "PA718838",
      "dateCosignature": "2018-10-03+02:00",
      "edite": false
    },
    {
      "acteurRef": "PA721968",
      "dateCosignature": "2018-10-03+02:00",
      "edite": false
    },
    {
      "acteurRef": "PA719318",
      "dateCosignature": "2018-10-03+02:00",
      "edite": false
    },
    {
      "acteurRef": "PA721506",
      "dateCosignature": "2018-10-03+02:00",
      "edite": false
    },
    {
      "acteurRef": "PA721410",
      "dateCosignature": "2018-10-03+02:00",
      "edite": false
    },
    {
      "acteurRef": "PA267324",
      "dateCosignature": "2018-10-03+02:00",
      "edite": false
    },
    {
      "acteurRef": "PA608416",
      "dateCosignature": "2018-10-03+02:00",
      "edite": false
    },
    {
      "acteurRef": "PA2792",
      "dateCosignature": "2018-10-03+02:00",
      "edite": false
    },
    {
      "acteurRef": "PA334149",
      "dateCosignature": "2018-10-03+02:00",
      "edite": false
    },
    {
      "acteurRef": "PA267318",
      "dateCosignature": "2018-10-03+02:00",
      "edite": false
    },
    {
      "acteurRef": "PA718784",
      "dateCosignature": "2018-10-03+02:00",
      "edite": false
    },
    {
      "acteurRef": "PA605991",
      "dateCosignature": "2018-10-03+02:00",
      "edite": false
    },
    {
      "acteurRef": "PA721678",
      "dateCosignature": "2018-10-03+02:00",
      "edite": false
    },
    {
      "acteurRef": "PA332523",
      "dateCosignature": "2018-10-03+02:00",
      "edite": false
    },
    {
      "acteurRef": "PA340853",
      "dateCosignature": "2018-10-03+02:00",
      "edite": false
    },
    {
      "acteurRef": "PA718884",
      "dateCosignature": "2018-10-03+02:00",
      "edite": false
    },
    {
      "acteurRef": "PA266793",
      "dateCosignature": "2018-10-03+02:00",
      "edite": false
    },
    {
      "acteurRef": "PA346054",
      "dateCosignature": "2018-10-03+02:00",
      "edite": false
    },
    {
      "acteurRef": "PA720586",
      "dateCosignature": "2018-10-03+02:00",
      "edite": false
    },
    {
      "acteurRef": "PA342935",
      "dateCosignature": "2018-10-03+02:00",
      "edite": false
    },
    {
      "acteurRef": "PA605036",
      "dateCosignature": "2018-10-03+02:00",
      "edite": false
    },
    {
      "acteurRef": "PA267735",
      "dateCosignature": "2018-10-03+02:00",
      "edite": false
    },
    {
      "acteurRef": "PA722390",
      "dateCosignature": "2018-10-03+02:00",
      "edite": false
    },
    {
      "acteurRef": "PA608826",
      "dateCosignature": "2018-10-03+02:00",
      "edite": false
    },
    {
      "acteurRef": "PA606712",
      "dateCosignature": "2018-10-03+02:00",
      "edite": false
    },
    {
      "acteurRef": "PA267260",
      "dateCosignature": "2018-10-03+02:00",
      "edite": false
    },
    {
      "acteurRef": "PA223837",
      "dateCosignature": "2018-10-03+02:00",
      "edite": false
    },
    {
      "acteurRef": "PA608016",
      "dateCosignature": "2018-10-03+02:00",
      "edite": false
    },
    {
      "acteurRef": "PA721054",
      "dateCosignature": "2018-10-03+02:00",
      "edite": false
    },
    {
      "acteurRef": "PA2377",
      "dateCosignature": "2018-10-03+02:00",
      "edite": false
    },
    {
      "acteurRef": "PA267527",
      "dateCosignature": "2018-10-03+02:00",
      "edite": false
    },
    {
      "acteurRef": "PA2529",
      "dateCosignature": "2018-10-03+02:00",
      "edite": false
    },
    {
      "acteurRef": "PA266774",
      "dateCosignature": "2018-10-03+02:00",
      "edite": false
    },
    {
      "acteurRef": "PA609245",
      "dateCosignature": "2018-10-03+02:00",
      "edite": false
    },
    {
      "acteurRef": "PA267440",
      "dateCosignature": "2018-10-03+02:00",
      "edite": false
    },
    {
      "acteurRef": "PA1327",
      "dateCosignature": "2018-10-03+02:00",
      "edite": false
    }
  ],
  "depotAmendements": {
    "amendementsSeance": {
      "amendable": false
    },
    "amendementsCommission": [
      {
        "organeRef": "PO420120",
        "amendable": true
      }
    ]
  }
}