{
  "xsiType": "rapportParlementaire_Type",
  "uid": "RAPPSNR5S319B0524",
  "cycleDeVie": {
    "chrono": {
      "dateCreation": "2019-05-24T00:00:00.000+02:00",
      "dateDepot": "2019-05-22T00:00:00.000+02:00"
    }
  },
  "denominationStructurelle": "Rapport",
  "provenance": "Commission",
  "titres": {
    "titrePrincipal": "rapport  sur le projet de loi, adopté, par l'Assemblée nationale après engagement de la procédure accélérée, relatif à l'organisation et à la transformation du système de santé (n°404).",
    "titrePrincipalCourt": "rapport  sur le projet de loi, adopté, par l'Assemblée nationale après engagement de la procédure accélérée, relatif à l'organisation et à la transformation du système de santé (n°404)."
  },
  "dossierRef": "DLR5L15N37234",
  "classification": {
    "famille": {
      "depot": {
        "code": "RAPINIT",
        "libelle": "Rapport sur une initiative"
      },
      "classe": {
        "code": "RAPPORT",
        "libelle": "Rapport"
      }
    },
    "type": {
      "code": "RAPP",
      "libelle": "Rapport"
    }
  },
  "auteurs": [
    {
      "acteur": {
        "acteurRef": "PA2197",
        "qualite": "rapporteur"
      }
    },
    {
      "organeRef": "PO211493"
    }
  ],
  "notice": {
    "numNotice": "524",
    "formule": "sur le projet de loi, adopté, par l'Assemblée nationale après engagement de la procédure accélérée, relatif à l'organisation et à la transformation du système de santé (n°404).",
    "adoptionConforme": false
  }
}