{
  "xsiType": "texteLoi_Type",
  "uid": "PRJLANR5L15BTC0019",
  "legislature": "15",
  "cycleDeVie": {
    "chrono": {
      "dateCreation": "2017-07-06T00:00:00.000+02:00",
      "dateDepot": "2017-07-06T00:00:00.000+02:00",
      "datePublication": "2017-07-10T00:00:00.000+02:00",
      "datePublicationWeb": "2017-07-06T15:00:00.000+02:00"
    }
  },
  "denominationStructurelle": "Projet de loi",
  "provenance": "Texte Déposé",
  "titres": {
    "titrePrincipal": "projet de loi sur le projet de loi, après engagement de la procédure accélérée, d’habilitation à prendre par ordonnances les mesures pour le renforcement du dialogue social (n°4).",
    "titrePrincipalCourt": "renforcement du dialogue social"
  },
  "dossierRef": "DLR5L15N35836",
  "classification": {
    "famille": {
      "depot": {
        "code": "INITDEP",
        "libelle": "Initiative en 1er Dépôt"
      },
      "classe": {
        "code": "PRJLOI",
        "libelle": "Projet de loi"
      }
    },
    "type": {
      "code": "PRJL",
      "libelle": "Projet de loi"
    },
    "statutAdoption": "ADOPTCOM"
  },
  "auteurs": [
    {
      "acteur": {
        "acteurRef": "PA720512",
        "qualite": "rapporteur"
      }
    },
    {
      "organeRef": "PO420120"
    }
  ],
  "notice": {
    "numNotice": "19",
    "formule": "sur le projet de loi, après engagement de la procédure accélérée, d’habilitation à prendre par ordonnances les mesures pour le renforcement du dialogue social (n°4).",
    "adoptionConforme": false
  },
  "imprimerie": {
    "prix": "6.0"
  },
  "depotAmendements": {
    "amendementsSeance": {
      "amendable": true
    },
    "amendementsCommission": [
      {
        "organeRef": "PO420120",
        "amendable": true
      },
      {
        "organeRef": "PO59048",
        "amendable": true
      }
    ]
  }
}