{
  "xsiType": "texteLoi_Type",
  "uid": "PIONANR5L15B1220",
  "legislature": "15",
  "cycleDeVie": {
    "chrono": {
      "dateCreation": "2018-07-27T00:00:00.000+02:00",
      "dateDepot": "2018-07-27T00:00:00.000+02:00",
      "datePublication": "2018-07-31T00:00:00.000+02:00",
      "datePublicationWeb": "2018-07-30T18:15:00.000+02:00"
    }
  },
  "denominationStructurelle": "Proposition de loi",
  "provenance": "Texte Déposé",
  "titres": {
    "titrePrincipal": "proposition de loi relative à la mise en œuvre du transfert des compétences eau et assainissement aux communautés de communes et aux communautés d'agglomération",
    "titrePrincipalCourt": "Transfert compétences eau et assainissement"
  },
  "dossierRef": "DLR5L15N36246",
  "classification": {
    "famille": {
      "depot": {
        "code": "INITNAV",
        "libelle": "Initiative en Navette"
      },
      "classe": {
        "code": "PIONLOI",
        "libelle": "Proposition de loi"
      }
    },
    "type": {
      "code": "PION",
      "libelle": "Proposition de loi"
    }
  },
  "auteurs": [
    {
      "organeRef": "PO717460"
    }
  ],
  "notice": {
    "numNotice": "1220",
    "formule": ", modifiée par le Sénat, en nouvelle lecture, relative à la mise en œuvre du transfert des compétences eau et assainissement aux communautés de communes et aux communautés d'agglomération",
    "adoptionConforme": false
  },
  "depotAmendements": {
    "amendementsSeance": {
      "amendable": false
    },
    "amendementsCommission": [
      {
        "organeRef": "PO59051",
        "amendable": true
      }
    ]
  }
}