{
  "xsiType": "texteLoi_Type",
  "uid": "PIONANR5L15B2092",
  "legislature": "15",
  "cycleDeVie": {
    "chrono": {
      "dateCreation": "2019-06-27T00:00:00.000+02:00",
      "dateDepot": "2019-07-02T00:00:00.000+02:00",
      "datePublication": "2019-07-10T00:00:00.000+02:00",
      "datePublicationWeb": "2019-07-03T10:25:00.000+02:00"
    }
  },
  "denominationStructurelle": "Proposition de loi",
  "provenance": "Texte Déposé",
  "titres": {
    "titrePrincipal": "proposition de loi visant à intégrer les périodes de bénévolat dans le calcul de la retraite",
    "titrePrincipalCourt": "intégrer périodes bénévolat dans calcul de la retraite"
  },
  "dossierRef": "DLR5L15N37589",
  "classification": {
    "famille": {
      "depot": {
        "code": "INITDEP",
        "libelle": "Initiative en 1er Dépôt"
      },
      "classe": {
        "code": "PIONLOI",
        "libelle": "Proposition de loi"
      }
    },
    "type": {
      "code": "PION",
      "libelle": "Proposition de loi"
    }
  },
  "auteurs": [
    {
      "acteur": {
        "acteurRef": "PA2377",
        "qualite": "auteur"
      }
    }
  ],
  "notice": {
    "numNotice": "2092",
    "formule": "visant à intégrer les périodes de bénévolat dans le calcul de la retraite",
    "adoptionConforme": false
  },
  "depotAmendements": {
    "amendementsSeance": {
      "amendable": false
    },
    "amendementsCommission": [
      {
        "organeRef": "PO420120",
        "amendable": true
      }
    ]
  }
}