{
  "xsiType": "rapportParlementaire_Type",
  "uid": "RAPPSNR5S319B0543",
  "cycleDeVie": {
    "chrono": {
      "dateCreation": "2019-06-05T00:00:00.000+02:00",
      "dateDepot": "2019-06-04T00:00:00.000+02:00"
    }
  },
  "denominationStructurelle": "Rapport",
  "provenance": "Commission",
  "titres": {
    "titrePrincipal": "rapport la commission mixte paritaire chargée de proposer un texte sur les dispositions restant en discussion du projet de loi pour la conservation et la restauration de la cathédrale Notre-Dame de Paris et instituant une souscription nationale à cet effet.",
    "titrePrincipalCourt": "rapport la commission mixte paritaire chargée de proposer un texte sur les dispositions restant en discussion du projet de loi pour la conservation et la restauration de la cathédrale Notre-Dame de Paris et instituant une souscription nationale à cet effet."
  },
  "dossierRef": "DLR5L15N37436",
  "classification": {
    "famille": {
      "depot": {
        "code": "RAPINIT",
        "libelle": "Rapport sur une initiative"
      },
      "classe": {
        "code": "RAPPORT",
        "libelle": "Rapport"
      }
    },
    "type": {
      "code": "RAPP",
      "libelle": "Rapport"
    }
  },
  "auteurs": [
    {
      "acteur": {
        "acteurRef": "PA301592",
        "qualite": "rapporteur"
      }
    },
    {
      "organeRef": "PO765339"
    }
  ],
  "notice": {
    "numNotice": "543",
    "formule": "de la commission mixte paritaire chargée de proposer un texte sur les dispositions restant en discussion du projet de loi pour la conservation et la restauration de la cathédrale Notre-Dame de Paris et instituant une souscription nationale à cet effet.",
    "adoptionConforme": false
  }
}