{
  "xsiType": "texteLoi_Type",
  "uid": "PIONANR5L15B0706",
  "legislature": "15",
  "cycleDeVie": {
    "chrono": {
      "dateCreation": "2018-02-19T00:00:00.000+01:00",
      "dateDepot": "2018-02-21T00:00:00.000+01:00",
      "datePublication": "2018-02-27T00:00:00.000+01:00",
      "datePublicationWeb": "2018-02-22T16:20:00.000+01:00"
    }
  },
  "denominationStructurelle": "Proposition de loi",
  "provenance": "Texte Déposé",
  "titres": {
    "titrePrincipal": "proposition de loi visant à augmenter le pouvoir d’achat grâce à la création d’un ticket-carburant",
    "titrePrincipalCourt": "ticket-carburant"
  },
  "dossierRef": "DLR5L15N36400",
  "classification": {
    "famille": {
      "depot": {
        "code": "INITDEP",
        "libelle": "Initiative en 1er Dépôt"
      },
      "classe": {
        "code": "PIONLOI",
        "libelle": "Proposition de loi"
      }
    },
    "type": {
      "code": "PION",
      "libelle": "Proposition de loi"
    }
  },
  "auteurs": [
    {
      "acteur": {
        "acteurRef": "PA719946",
        "qualite": "auteur"
      }
    }
  ],
  "notice": {
    "numNotice": "706",
    "formule": "visant à augmenter le pouvoir d’achat grâce à la création d’un ticket-carburant",
    "adoptionConforme": false
  },
  "coSignataires": [
    {
      "acteurRef": "PA605036",
      "dateCosignature": "2018-02-21+01:00",
      "edite": false
    },
    {
      "acteurRef": "PA1327",
      "dateCosignature": "2018-02-21+01:00",
      "edite": false
    },
    {
      "acteurRef": "PA718838",
      "dateCosignature": "2018-02-21+01:00",
      "edite": false
    },
    {
      "acteurRef": "PA721506",
      "dateCosignature": "2018-02-21+01:00",
      "edite": false
    },
    {
      "acteurRef": "PA642847",
      "dateCosignature": "2018-02-21+01:00",
      "edite": false
    },
    {
      "acteurRef": "PA721314",
      "dateCosignature": "2018-02-21+01:00",
      "edite": false
    },
    {
      "acteurRef": "PA720684",
      "dateCosignature": "2018-02-21+01:00",
      "edite": false
    },
    {
      "acteurRef": "PA720630",
      "dateCosignature": "2018-02-21+01:00",
      "edite": false
    },
    {
      "acteurRef": "PA720100",
      "dateCosignature": "2018-02-21+01:00",
      "edite": false
    },
    {
      "acteurRef": "PA712015",
      "dateCosignature": "2018-02-21+01:00",
      "edite": false
    },
    {
      "acteurRef": "PA334149",
      "dateCosignature": "2018-02-21+01:00",
      "edite": false
    },
    {
      "acteurRef": "PA1874",
      "dateCosignature": "2018-02-21+01:00",
      "edite": false
    },
    {
      "acteurRef": "PA267204",
      "dateCosignature": "2018-02-21+01:00",
      "edite": false
    },
    {
      "acteurRef": "PA718884",
      "dateCosignature": "2018-02-21+01:00",
      "edite": false
    },
    {
      "acteurRef": "PA267429",
      "dateCosignature": "2018-02-21+01:00",
      "edite": false
    },
    {
      "acteurRef": "PA767",
      "dateCosignature": "2018-02-21+01:00",
      "edite": false
    },
    {
      "acteurRef": "PA720386",
      "dateCosignature": "2018-02-21+01:00",
      "edite": false
    },
    {
      "acteurRef": "PA721286",
      "dateCosignature": "2018-02-21+01:00",
      "edite": false
    },
    {
      "acteurRef": "PA721636",
      "dateCosignature": "2018-02-21+01:00",
      "edite": false
    },
    {
      "acteurRef": "PA606098",
      "dateCosignature": "2018-02-21+01:00",
      "edite": false
    },
    {
      "acteurRef": "PA719272",
      "dateCosignature": "2018-02-21+01:00",
      "edite": false
    },
    {
      "acteurRef": "PA643134",
      "dateCosignature": "2018-02-21+01:00",
      "edite": false
    },
    {
      "acteurRef": "PA998",
      "dateCosignature": "2018-02-21+01:00",
      "edite": false
    },
    {
      "acteurRef": "PA267785",
      "dateCosignature": "2018-02-21+01:00",
      "edite": false
    },
    {
      "acteurRef": "PA718780",
      "dateCosignature": "2018-02-21+01:00",
      "edite": false
    },
    {
      "acteurRef": "PA609245",
      "dateCosignature": "2018-02-21+01:00",
      "edite": false
    },
    {
      "acteurRef": "PA266776",
      "dateCosignature": "2018-02-21+01:00",
      "edite": false
    },
    {
      "acteurRef": "PA721968",
      "dateCosignature": "2018-02-21+01:00",
      "edite": false
    },
    {
      "acteurRef": "PA719318",
      "dateCosignature": "2018-02-21+01:00",
      "edite": false
    },
    {
      "acteurRef": "PA607090",
      "dateCosignature": "2018-02-21+01:00",
      "edite": false
    },
    {
      "acteurRef": "PA718850",
      "dateCosignature": "2018-02-21+01:00",
      "edite": false
    },
    {
      "acteurRef": "PA1029",
      "dateCosignature": "2018-02-21+01:00",
      "edite": false
    },
    {
      "acteurRef": "PA721070",
      "dateCosignature": "2018-02-21+01:00",
      "edite": false
    },
    {
      "acteurRef": "PA608416",
      "dateCosignature": "2018-02-21+01:00",
      "edite": false
    },
    {
      "acteurRef": "PA2792",
      "dateCosignature": "2018-02-21+01:00",
      "edite": false
    },
    {
      "acteurRef": "PA266808",
      "dateCosignature": "2018-02-21+01:00",
      "edite": false
    },
    {
      "acteurRef": "PA2377",
      "dateCosignature": "2018-02-21+01:00",
      "edite": false
    },
    {
      "acteurRef": "PA332523",
      "dateCosignature": "2018-02-21+01:00",
      "edite": false
    },
    {
      "acteurRef": "PA342935",
      "dateCosignature": "2018-02-21+01:00",
      "edite": false
    },
    {
      "acteurRef": "PA721474",
      "dateCosignature": "2018-02-21+01:00",
      "edite": false
    },
    {
      "acteurRef": "PA1630",
      "dateCosignature": "2018-03-28+02:00",
      "edite": false
    },
    {
      "acteurRef": "PA330909",
      "dateCosignature": "2018-03-28+02:00",
      "edite": false
    },
    {
      "acteurRef": "PA609726",
      "dateCosignature": "2018-03-28+02:00",
      "edite": false
    },
    {
      "acteurRef": "PA267289",
      "dateCosignature": "2018-03-28+02:00",
      "edite": false
    },
    {
      "acteurRef": "PA267200",
      "dateCosignature": "2018-03-28+02:00",
      "edite": false
    },
    {
      "acteurRef": "PA267440",
      "dateCosignature": "2018-03-28+02:00",
      "edite": false
    },
    {
      "acteurRef": "PA267378",
      "dateCosignature": "2018-03-28+02:00",
      "edite": false
    },
    {
      "acteurRef": "PA334843",
      "dateCosignature": "2018-03-28+02:00",
      "edite": false
    },
    {
      "acteurRef": "PA718784",
      "dateCosignature": "2018-03-28+02:00",
      "edite": false
    },
    {
      "acteurRef": "PA267324",
      "dateCosignature": "2018-03-28+02:00",
      "edite": false
    },
    {
      "acteurRef": "PA605991",
      "dateCosignature": "2018-03-28+02:00",
      "edite": false
    },
    {
      "acteurRef": "PA340853",
      "dateCosignature": "2018-03-28+02:00",
      "edite": false
    },
    {
      "acteurRef": "PA267527",
      "dateCosignature": "2018-03-28+02:00",
      "edite": false
    },
    {
      "acteurRef": "PA334654",
      "dateCosignature": "2018-03-30+02:00",
      "edite": false
    }
  ],
  "depotAmendements": {
    "amendementsSeance": {
      "amendable": true
    },
    "amendementsCommission": [
      {
        "organeRef": "PO420120",
        "amendable": true
      }
    ]
  }
}