{
  "xsiType": "texteLoi_Type",
  "uid": "PRJLSNR5S339B0046",
  "cycleDeVie": {
    "chrono": {
      "dateCreation": "2019-10-10T00:00:00.000+02:00",
      "dateDepot": "2019-10-09T00:00:00.000+02:00"
    }
  },
  "denominationStructurelle": "Projet de loi",
  "provenance": "Texte Déposé",
  "titres": {
    "titrePrincipal": "projet de loi ratifiant l'ordonnance n° 2019-770 du 17 juillet 2019 relative à la partie législative du livre VIII du code de la construction et de l'habitation.",
    "titrePrincipalCourt": "ratifiant l'ordonnance n° 2019-770 du 17 juillet 2019 relative à la partie législative du livre VIII du code de la construction et de l'habitation."
  },
  "dossierRef": "DLR5L15N37839",
  "classification": {
    "famille": {
      "depot": {
        "code": "INITDEP",
        "libelle": "Initiative en 1er Dépôt"
      },
      "classe": {
        "code": "PRJLOI",
        "libelle": "Projet de loi"
      }
    },
    "type": {
      "code": "PRJL",
      "libelle": "Projet de loi"
    }
  },
  "auteurs": [
    {
      "acteur": {
        "acteurRef": "PA345619",
        "qualite": "auteur"
      }
    }
  ],
  "notice": {
    "numNotice": "46",
    "formule": "ratifiant l'ordonnance n° 2019-770 du 17 juillet 2019 relative à la partie législative du livre VIII du code de la construction et de l'habitation.",
    "adoptionConforme": false
  },
  "coSignataires": [
    {
      "acteurRef": "PA729332",
      "dateCosignature": "2019-10-09+02:00",
      "edite": true
    },
    {
      "acteurRef": "PA227076",
      "dateCosignature": "2019-10-09+02:00",
      "edite": true
    }
  ],
  "depotAmendements": {
    "amendementsSeance": {
      "amendable": false
    }
  }
}