{
  "xsiType": "texteLoi_Type",
  "uid": "PIONSNR5S299B0598",
  "cycleDeVie": {
    "chrono": {
      "dateCreation": "2018-06-25T00:00:00.000+02:00",
      "dateDepot": "2018-06-22T00:00:00.000+02:00"
    }
  },
  "denominationStructurelle": "Proposition de loi",
  "provenance": "Texte Déposé",
  "titres": {
    "titrePrincipal": "proposition de loi visant à renforcer les droits des consommateurs en matière de démarchage téléphonique",
    "titrePrincipalCourt": "Démarchage téléphonique"
  },
  "dossierRef": "DLR5L15N36368",
  "classification": {
    "famille": {
      "depot": {
        "code": "INITNAV",
        "libelle": "Initiative en Navette"
      },
      "classe": {
        "code": "PIONLOI",
        "libelle": "Proposition de loi"
      }
    },
    "type": {
      "code": "PION",
      "libelle": "Proposition de loi"
    }
  },
  "auteurs": [
    {
      "organeRef": "PO78718"
    }
  ],
  "notice": {
    "numNotice": "598",
    "formule": ", adoptée, par l'Assemblée nationale, visant à renforcer les droits des consommateurs en matière de démarchage téléphonique",
    "adoptionConforme": false
  },
  "depotAmendements": {
    "amendementsSeance": {
      "amendable": false
    }
  }
}