{
  "xsiType": "texteLoi_Type",
  "uid": "PIONSNR5S319B0025",
  "cycleDeVie": {
    "chrono": {
      "dateCreation": "2018-10-19T00:00:00.000+02:00",
      "dateDepot": "2018-10-09T00:00:00.000+02:00",
      "datePublication": "2018-11-21T00:00:00.000+01:00"
    }
  },
  "denominationStructurelle": "Proposition de loi",
  "provenance": "Texte Déposé",
  "titres": {
    "titrePrincipal": "proposition de loi visant à la présentation par le Gouvernement d’un rapport au Parlement sur la mise en œuvre des préconisations relatives aux éventuels risques liés à l’emploi de matériaux issus de la valorisation de pneumatiques usagés dans les terrains de sport synthétiques, et usages similaires, établies par l’Agence nationale de sécurité sanitaire de l’alimentation, de l’environnement et du travail le 18 septembre 2018",
    "titrePrincipalCourt": "Pneumatiques usagés dans les terrains de sport"
  },
  "dossierRef": "DLR5L15N36942",
  "classification": {
    "famille": {
      "depot": {
        "code": "INITDEP",
        "libelle": "Initiative en 1er Dépôt"
      },
      "classe": {
        "code": "PIONLOI",
        "libelle": "Proposition de loi"
      }
    },
    "type": {
      "code": "PION",
      "libelle": "Proposition de loi"
    }
  },
  "auteurs": [
    {
      "acteur": {
        "acteurRef": "PA415459",
        "qualite": "auteur"
      }
    }
  ],
  "notice": {
    "numNotice": "25",
    "formule": "visant à la présentation par le Gouvernement d’un rapport au Parlement sur la mise en œuvre des préconisations relatives aux éventuels risques liés à l’emploi de matériaux issus de la valorisation de pneumatiques usagés dans les terrains de sport synthétiques, et usages similaires, établies par l’Agence nationale de sécurité sanitaire de l’alimentation, de l’environnement et du travail le 18 septembre 2018",
    "adoptionConforme": false
  },
  "coSignataires": [
    {
      "dateCosignature": "2018-10-09+02:00",
      "edite": false,
      "organe": {
        "organeRef": "PO732421",
        "etApparentes": false
      }
    }
  ],
  "depotAmendements": {
    "amendementsSeance": {
      "amendable": false
    }
  }
}