{
  "xsiType": "texteLoi_Type",
  "uid": "PIONANR5L15B0723",
  "legislature": "15",
  "cycleDeVie": {
    "chrono": {
      "dateCreation": "2018-02-22T00:00:00.000+01:00",
      "dateDepot": "2018-02-22T00:00:00.000+01:00",
      "datePublication": "2018-03-06T00:00:00.000+01:00",
      "datePublicationWeb": "2018-02-28T16:15:00.000+01:00"
    }
  },
  "denominationStructurelle": "Proposition de loi",
  "provenance": "Texte Déposé",
  "titres": {
    "titrePrincipal": "proposition de loi visant à renforcer la prévention des conflits d'intérêts liés à la mobilité des hauts fonctionnaires",
    "titrePrincipalCourt": "Prévention des conflits d'intérêts liés à la mobilité des hauts fonctionnaires"
  },
  "dossierRef": "DLR5L15N36352",
  "classification": {
    "famille": {
      "depot": {
        "code": "INITNAV",
        "libelle": "Initiative en Navette"
      },
      "classe": {
        "code": "PIONLOI",
        "libelle": "Proposition de loi"
      }
    },
    "type": {
      "code": "PION",
      "libelle": "Proposition de loi"
    }
  },
  "auteurs": [
    {
      "organeRef": "PO717460"
    }
  ],
  "notice": {
    "numNotice": "723",
    "formule": ", adoptée par le Sénat, visant à renforcer la prévention des conflits d'intérêts liés à la mobilité des hauts fonctionnaires",
    "adoptionConforme": false
  },
  "depotAmendements": {
    "amendementsSeance": {
      "amendable": false
    },
    "amendementsCommission": [
      {
        "organeRef": "PO59051",
        "amendable": true
      }
    ]
  }
}