{
  "xsiType": "texteLoi_Type",
  "uid": "PNREANR5L15B0243",
  "legislature": "15",
  "cycleDeVie": {
    "chrono": {
      "dateCreation": "2017-09-29T00:00:00.000+02:00",
      "dateDepot": "2017-09-29T00:00:00.000+02:00",
      "datePublication": "2017-10-09T00:00:00.000+02:00",
      "datePublicationWeb": "2017-10-04T10:20:00.000+02:00"
    }
  },
  "denominationStructurelle": "Proposition de résolution",
  "provenance": "Texte Déposé",
  "titres": {
    "titrePrincipal": "proposition de résolution tendant à la création d'une commission d'enquête relative aux problèmes de santé publique posés par le Levothyrox",
    "titrePrincipalCourt": "Commission d'enquête relative aux problèmes de santé publique posés par le Levothyrox"
  },
  "dossierRef": "DLR5L15N35998",
  "classification": {
    "famille": {
      "depot": {
        "code": "INITDEP",
        "libelle": "Initiative en 1er Dépôt"
      },
      "classe": {
        "code": "PIONRES",
        "libelle": "Proposition de résolution"
      },
      "espece": {
        "code": "COMENQ",
        "libelle": "tendant à la création d'une commission d'enquête"
      }
    },
    "type": {
      "code": "PNRE",
      "libelle": "Proposition de résolution"
    },
    "sousType": {
      "code": "COMENQ",
      "libelle": "tendant à la création d'une commission d'enquête"
    }
  },
  "auteurs": [
    {
      "acteur": {
        "acteurRef": "PA720468",
        "qualite": "auteur"
      }
    }
  ],
  "notice": {
    "numNotice": "243",
    "formule": "tendant à la création d'une commission d'enquête relative aux problèmes de santé publique posés par le Levothyrox",
    "adoptionConforme": false
  }
}