{
  "xsiType": "texteLoi_Type",
  "uid": "PIONSNR5S319B0214",
  "cycleDeVie": {
    "chrono": {
      "dateCreation": "2019-02-05T00:00:00.000+01:00",
      "dateDepot": "2018-12-18T00:00:00.000+01:00",
      "datePublication": "2019-03-05T00:00:00.000+01:00"
    }
  },
  "denominationStructurelle": "Proposition de loi",
  "provenance": "Texte Déposé",
  "titres": {
    "titrePrincipal": "proposition de loi visant à fournir une information aux patientes sur la reconstruction mammaire en cas de mastectomie",
    "titrePrincipalCourt": "Information sur la reconstruction mammaire"
  },
  "dossierRef": "DLR5L15N37213",
  "classification": {
    "famille": {
      "depot": {
        "code": "INITDEP",
        "libelle": "Initiative en 1er Dépôt"
      },
      "classe": {
        "code": "PIONLOI",
        "libelle": "Proposition de loi"
      }
    },
    "type": {
      "code": "PION",
      "libelle": "Proposition de loi"
    }
  },
  "auteurs": [
    {
      "acteur": {
        "acteurRef": "PA425322",
        "qualite": "auteur"
      }
    }
  ],
  "notice": {
    "numNotice": "214",
    "formule": "visant à fournir une information aux patientes sur la reconstruction mammaire en cas de mastectomie",
    "adoptionConforme": false
  },
  "coSignataires": [
    {
      "acteurRef": "PA2197",
      "dateCosignature": "2018-12-18+01:00",
      "edite": true
    },
    {
      "acteurRef": "PA2538",
      "dateCosignature": "2018-12-18+01:00",
      "edite": true
    },
    {
      "acteurRef": "PA736247",
      "dateCosignature": "2018-12-18+01:00",
      "edite": false
    },
    {
      "acteurRef": "PA744079",
      "dateCosignature": "2018-12-18+01:00",
      "edite": false
    },
    {
      "acteurRef": "PA736188",
      "dateCosignature": "2018-12-18+01:00",
      "edite": false
    },
    {
      "acteurRef": "PA736202",
      "dateCosignature": "2018-12-18+01:00",
      "edite": false
    },
    {
      "acteurRef": "PA736163",
      "dateCosignature": "2018-12-18+01:00",
      "edite": false
    },
    {
      "acteurRef": "PA703532",
      "dateCosignature": "2018-12-18+01:00",
      "edite": false
    },
    {
      "acteurRef": "PA550",
      "dateCosignature": "2018-12-18+01:00",
      "edite": false
    },
    {
      "acteurRef": "PA736198",
      "dateCosignature": "2018-12-18+01:00",
      "edite": false
    },
    {
      "acteurRef": "PA703522",
      "dateCosignature": "2018-12-18+01:00",
      "edite": false
    },
    {
      "acteurRef": "PA342665",
      "dateCosignature": "2018-12-18+01:00",
      "edite": false
    },
    {
      "acteurRef": "PA736176",
      "dateCosignature": "2018-12-18+01:00",
      "edite": false
    },
    {
      "acteurRef": "PA703500",
      "dateCosignature": "2018-12-18+01:00",
      "edite": false
    },
    {
      "acteurRef": "PA736244",
      "dateCosignature": "2018-12-18+01:00",
      "edite": false
    },
    {
      "acteurRef": "PA747421",
      "dateCosignature": "2018-12-18+01:00",
      "edite": false
    },
    {
      "acteurRef": "PA736216",
      "dateCosignature": "2018-12-18+01:00",
      "edite": false
    },
    {
      "acteurRef": "PA415456",
      "dateCosignature": "2018-12-18+01:00",
      "edite": false
    },
    {
      "acteurRef": "PA303997",
      "dateCosignature": "2018-12-18+01:00",
      "edite": false
    },
    {
      "acteurRef": "PA716",
      "dateCosignature": "2018-12-18+01:00",
      "edite": false
    },
    {
      "acteurRef": "PA304085",
      "dateCosignature": "2018-12-18+01:00",
      "edite": false
    },
    {
      "acteurRef": "PA703510",
      "dateCosignature": "2018-12-18+01:00",
      "edite": false
    },
    {
      "acteurRef": "PA429870",
      "dateCosignature": "2018-12-18+01:00",
      "edite": false
    },
    {
      "acteurRef": "PA709750",
      "dateCosignature": "2018-12-18+01:00",
      "edite": false
    },
    {
      "acteurRef": "PA429854",
      "dateCosignature": "2018-12-18+01:00",
      "edite": false
    },
    {
      "acteurRef": "PA415462",
      "dateCosignature": "2018-12-18+01:00",
      "edite": false
    },
    {
      "acteurRef": "PA736172",
      "dateCosignature": "2018-12-18+01:00",
      "edite": false
    },
    {
      "acteurRef": "PA715745",
      "dateCosignature": "2018-12-18+01:00",
      "edite": false
    },
    {
      "acteurRef": "PA980",
      "dateCosignature": "2018-12-18+01:00",
      "edite": false
    },
    {
      "acteurRef": "PA703483",
      "dateCosignature": "2018-12-18+01:00",
      "edite": false
    },
    {
      "acteurRef": "PA736192",
      "dateCosignature": "2018-12-18+01:00",
      "edite": false
    },
    {
      "acteurRef": "PA736160",
      "dateCosignature": "2018-12-18+01:00",
      "edite": false
    },
    {
      "acteurRef": "PA703539",
      "dateCosignature": "2018-12-18+01:00",
      "edite": false
    },
    {
      "acteurRef": "PA267112",
      "dateCosignature": "2018-12-18+01:00",
      "edite": false
    },
    {
      "acteurRef": "PA1122",
      "dateCosignature": "2018-12-18+01:00",
      "edite": false
    },
    {
      "acteurRef": "PA703494",
      "dateCosignature": "2018-12-18+01:00",
      "edite": false
    },
    {
      "acteurRef": "PA736170",
      "dateCosignature": "2018-12-18+01:00",
      "edite": false
    },
    {
      "acteurRef": "PA703498",
      "dateCosignature": "2018-12-18+01:00",
      "edite": false
    },
    {
      "acteurRef": "PA1183",
      "dateCosignature": "2018-12-18+01:00",
      "edite": false
    },
    {
      "acteurRef": "PA404656",
      "dateCosignature": "2018-12-18+01:00",
      "edite": false
    },
    {
      "acteurRef": "PA703506",
      "dateCosignature": "2018-12-18+01:00",
      "edite": false
    },
    {
      "acteurRef": "PA703520",
      "dateCosignature": "2018-12-18+01:00",
      "edite": false
    },
    {
      "acteurRef": "PA227029",
      "dateCosignature": "2018-12-18+01:00",
      "edite": false
    },
    {
      "acteurRef": "PA703504",
      "dateCosignature": "2018-12-18+01:00",
      "edite": false
    },
    {
      "acteurRef": "PA1344",
      "dateCosignature": "2018-12-18+01:00",
      "edite": false
    },
    {
      "acteurRef": "PA266795",
      "dateCosignature": "2018-12-18+01:00",
      "edite": false
    },
    {
      "acteurRef": "PA267989",
      "dateCosignature": "2018-12-18+01:00",
      "edite": false
    },
    {
      "acteurRef": "PA1477",
      "dateCosignature": "2018-12-18+01:00",
      "edite": false
    },
    {
      "acteurRef": "PA415486",
      "dateCosignature": "2018-12-18+01:00",
      "edite": false
    },
    {
      "acteurRef": "PA703530",
      "dateCosignature": "2018-12-18+01:00",
      "edite": false
    },
    {
      "acteurRef": "PA267081",
      "dateCosignature": "2018-12-18+01:00",
      "edite": false
    },
    {
      "acteurRef": "PA736206",
      "dateCosignature": "2018-12-18+01:00",
      "edite": false
    },
    {
      "acteurRef": "PA703492",
      "dateCosignature": "2018-12-18+01:00",
      "edite": false
    },
    {
      "acteurRef": "PA736238",
      "dateCosignature": "2018-12-18+01:00",
      "edite": false
    },
    {
      "acteurRef": "PA304737",
      "dateCosignature": "2018-12-18+01:00",
      "edite": false
    },
    {
      "acteurRef": "PA703515",
      "dateCosignature": "2018-12-18+01:00",
      "edite": false
    },
    {
      "acteurRef": "PA703501",
      "dateCosignature": "2018-12-18+01:00",
      "edite": false
    },
    {
      "acteurRef": "PA736182",
      "dateCosignature": "2018-12-18+01:00",
      "edite": false
    },
    {
      "acteurRef": "PA304000",
      "dateCosignature": "2018-12-18+01:00",
      "edite": false
    },
    {
      "acteurRef": "PA736246",
      "dateCosignature": "2018-12-18+01:00",
      "edite": false
    },
    {
      "acteurRef": "PA736230",
      "dateCosignature": "2018-12-18+01:00",
      "edite": false
    },
    {
      "acteurRef": "PA415451",
      "dateCosignature": "2018-12-18+01:00",
      "edite": false
    },
    {
      "acteurRef": "PA415447",
      "dateCosignature": "2018-12-18+01:00",
      "edite": false
    },
    {
      "acteurRef": "PA415467",
      "dateCosignature": "2018-12-18+01:00",
      "edite": false
    },
    {
      "acteurRef": "PA736186",
      "dateCosignature": "2018-12-18+01:00",
      "edite": false
    },
    {
      "acteurRef": "PA736213",
      "dateCosignature": "2018-12-18+01:00",
      "edite": false
    },
    {
      "acteurRef": "PA343775",
      "dateCosignature": "2018-12-18+01:00",
      "edite": false
    },
    {
      "acteurRef": "PA341381",
      "dateCosignature": "2018-12-18+01:00",
      "edite": false
    },
    {
      "acteurRef": "PA736185",
      "dateCosignature": "2018-12-18+01:00",
      "edite": false
    },
    {
      "acteurRef": "PA415489",
      "dateCosignature": "2018-12-18+01:00",
      "edite": false
    },
    {
      "acteurRef": "PA708632",
      "dateCosignature": "2018-12-18+01:00",
      "edite": false
    },
    {
      "acteurRef": "PA703517",
      "dateCosignature": "2018-12-18+01:00",
      "edite": false
    },
    {
      "acteurRef": "PA736204",
      "dateCosignature": "2018-12-18+01:00",
      "edite": false
    },
    {
      "acteurRef": "PA736183",
      "dateCosignature": "2018-12-18+01:00",
      "edite": false
    },
    {
      "acteurRef": "PA705750",
      "dateCosignature": "2018-12-18+01:00",
      "edite": false
    },
    {
      "acteurRef": "PA304017",
      "dateCosignature": "2018-12-18+01:00",
      "edite": false
    },
    {
      "acteurRef": "PA2237",
      "dateCosignature": "2018-12-18+01:00",
      "edite": false
    },
    {
      "acteurRef": "PA758716",
      "dateCosignature": "2018-12-18+01:00",
      "edite": false
    },
    {
      "acteurRef": "PA343988",
      "dateCosignature": "2018-12-18+01:00",
      "edite": false
    },
    {
      "acteurRef": "PA703521",
      "dateCosignature": "2018-12-18+01:00",
      "edite": false
    },
    {
      "acteurRef": "PA415479",
      "dateCosignature": "2018-12-18+01:00",
      "edite": false
    },
    {
      "acteurRef": "PA703541",
      "dateCosignature": "2018-12-18+01:00",
      "edite": false
    },
    {
      "acteurRef": "PA736200",
      "dateCosignature": "2018-12-18+01:00",
      "edite": false
    },
    {
      "acteurRef": "PA304076",
      "dateCosignature": "2018-12-18+01:00",
      "edite": false
    },
    {
      "acteurRef": "PA406065",
      "dateCosignature": "2018-12-18+01:00",
      "edite": false
    },
    {
      "acteurRef": "PA429842",
      "dateCosignature": "2018-12-18+01:00",
      "edite": false
    },
    {
      "acteurRef": "PA304086",
      "dateCosignature": "2018-12-18+01:00",
      "edite": false
    },
    {
      "acteurRef": "PA736166",
      "dateCosignature": "2018-12-18+01:00",
      "edite": false
    },
    {
      "acteurRef": "PA736239",
      "dateCosignature": "2018-12-18+01:00",
      "edite": false
    },
    {
      "acteurRef": "PA711156",
      "dateCosignature": "2018-12-18+01:00",
      "edite": false
    },
    {
      "acteurRef": "PA758431",
      "dateCosignature": "2018-12-18+01:00",
      "edite": false
    },
    {
      "acteurRef": "PA2543",
      "dateCosignature": "2018-12-18+01:00",
      "edite": false
    },
    {
      "acteurRef": "PA429851",
      "dateCosignature": "2018-12-18+01:00",
      "edite": false
    },
    {
      "acteurRef": "PA429874",
      "dateCosignature": "2018-12-18+01:00",
      "edite": false
    },
    {
      "acteurRef": "PA757678",
      "dateCosignature": "2018-12-18+01:00",
      "edite": false
    },
    {
      "acteurRef": "PA227094",
      "dateCosignature": "2018-12-18+01:00",
      "edite": false
    },
    {
      "acteurRef": "PA736207",
      "dateCosignature": "2018-12-18+01:00",
      "edite": false
    },
    {
      "acteurRef": "PA345785",
      "dateCosignature": "2018-12-18+01:00",
      "edite": false
    },
    {
      "acteurRef": "PA227098",
      "dateCosignature": "2018-12-18+01:00",
      "edite": false
    },
    {
      "acteurRef": "PA747420",
      "dateCosignature": "2018-12-18+01:00",
      "edite": false
    },
    {
      "acteurRef": "PA703527",
      "dateCosignature": "2018-12-18+01:00",
      "edite": false
    },
    {
      "acteurRef": "PA736222",
      "dateCosignature": "2018-12-18+01:00",
      "edite": false
    }
  ],
  "depotAmendements": {
    "amendementsSeance": {
      "amendable": false
    }
  }
}