{
  "xsiType": "texteLoi_Type",
  "uid": "RINFANR5L15B1215",
  "legislature": "15",
  "cycleDeVie": {
    "chrono": {
      "dateCreation": "2018-07-26T00:00:00.000+02:00",
      "dateDepot": "2018-07-26T00:00:00.000+02:00",
      "datePublication": "2018-07-30T00:00:00.000+02:00",
      "datePublicationWeb": "2018-07-26T20:30:00.000+02:00"
    }
  },
  "denominationStructurelle": "Rapport d'information",
  "provenance": "Commission",
  "titres": {
    "titrePrincipal": "rapport d'information déposé en application de l'article 145-7 alinéa 1 du règlement, par la commission des affaires sociales sur la mise en application de la loi n° 2017-1836 du 30 décembre 2017 de financement de la sécurité sociale pour 2018",
    "titrePrincipalCourt": "rapport d'information déposé en application de l'article 145-7 alinéa 1 du règlement, par la commission des affaires sociales sur la mise en application de la loi n° 2017-1836 du 30 décembre 2017 de financement de la sécurité sociale pour 2018"
  },
  "dossierRef": "DLR5L15N36821",
  "classification": {
    "famille": {
      "depot": {
        "code": "RAPAUT",
        "libelle": "Rapport autonome"
      },
      "classe": {
        "code": "RAPINF",
        "libelle": "Rapport d'information"
      },
      "espece": {
        "code": "APPLOI",
        "libelle": "sur l'application des lois"
      }
    },
    "type": {
      "code": "RINF",
      "libelle": "Rapport d'information"
    },
    "sousType": {
      "code": "APPLOI",
      "libelle": "sur l'application des lois"
    }
  },
  "auteurs": [
    {
      "acteur": {
        "acteurRef": "PA642788",
        "qualite": "rapporteur"
      }
    },
    {
      "acteur": {
        "acteurRef": "PA606712",
        "qualite": "rapporteur"
      }
    },
    {
      "organeRef": "PO420120"
    }
  ],
  "notice": {
    "numNotice": "1215",
    "formule": "déposé en application de l'article 145-7 alinéa 1 du règlement, par la commission des affaires sociales sur la mise en application de la loi n° 2017-1836 du 30 décembre 2017 de financement de la sécurité sociale pour 2018",
    "adoptionConforme": false
  },
  "imprimerie": {
    "prix": "1.5"
  }
}