{
  "xsiType": "texteLoi_Type",
  "uid": "PIONANR5L15B1929",
  "legislature": "15",
  "cycleDeVie": {
    "chrono": {
      "dateCreation": "2019-04-25T00:00:00.000+02:00",
      "dateDepot": "2019-05-07T00:00:00.000+02:00",
      "datePublication": "2019-05-16T00:00:00.000+02:00",
      "datePublicationWeb": "2019-05-09T19:00:00.000+02:00"
    }
  },
  "denominationStructurelle": "Proposition de loi",
  "provenance": "Texte Déposé",
  "titres": {
    "titrePrincipal": "proposition de loi visant à protéger de manière plus efficace les victimes directes et indirectes des accidents de la circulation",
    "titrePrincipalCourt": "protéger les victimes des accidents de circulation"
  },
  "dossierRef": "DLR5L15N37437",
  "classification": {
    "famille": {
      "depot": {
        "code": "INITDEP",
        "libelle": "Initiative en 1er Dépôt"
      },
      "classe": {
        "code": "PIONLOI",
        "libelle": "Proposition de loi"
      }
    },
    "type": {
      "code": "PION",
      "libelle": "Proposition de loi"
    }
  },
  "auteurs": [
    {
      "acteur": {
        "acteurRef": "PA718780",
        "qualite": "auteur"
      }
    }
  ],
  "notice": {
    "numNotice": "1929",
    "formule": "visant à protéger de manière plus efficace les victimes directes et indirectes des accidents de la circulation",
    "adoptionConforme": false
  },
  "coSignataires": [
    {
      "acteurRef": "PA336316",
      "dateCosignature": "2019-05-07+02:00",
      "edite": false
    },
    {
      "acteurRef": "PA1012",
      "dateCosignature": "2019-05-07+02:00",
      "edite": false
    },
    {
      "acteurRef": "PA608826",
      "dateCosignature": "2019-05-07+02:00",
      "edite": false
    },
    {
      "acteurRef": "PA267318",
      "dateCosignature": "2019-05-07+02:00",
      "edite": false
    },
    {
      "acteurRef": "PA606712",
      "dateCosignature": "2019-05-07+02:00",
      "edite": false
    },
    {
      "acteurRef": "PA346218",
      "dateCosignature": "2019-05-07+02:00",
      "edite": false
    },
    {
      "acteurRef": "PA718784",
      "dateCosignature": "2019-05-07+02:00",
      "edite": false
    },
    {
      "acteurRef": "PA267260",
      "dateCosignature": "2019-05-07+02:00",
      "edite": false
    },
    {
      "acteurRef": "PA2492",
      "dateCosignature": "2019-05-07+02:00",
      "edite": false
    },
    {
      "acteurRef": "PA721070",
      "dateCosignature": "2019-05-07+02:00",
      "edite": false
    },
    {
      "acteurRef": "PA721678",
      "dateCosignature": "2019-05-07+02:00",
      "edite": false
    },
    {
      "acteurRef": "PA2529",
      "dateCosignature": "2019-05-07+02:00",
      "edite": false
    },
    {
      "acteurRef": "PA709315",
      "dateCosignature": "2019-05-07+02:00",
      "edite": false
    },
    {
      "acteurRef": "PA721968",
      "dateCosignature": "2019-05-07+02:00",
      "edite": false
    },
    {
      "acteurRef": "PA721474",
      "dateCosignature": "2019-05-07+02:00",
      "edite": false
    },
    {
      "acteurRef": "PA721410",
      "dateCosignature": "2019-05-22+02:00",
      "edite": false
    },
    {
      "acteurRef": "PA330240",
      "dateCosignature": "2019-05-22+02:00",
      "edite": false
    },
    {
      "acteurRef": "PA334149",
      "dateCosignature": "2019-05-22+02:00",
      "edite": false
    },
    {
      "acteurRef": "PA345722",
      "dateCosignature": "2019-07-30+02:00",
      "edite": false
    }
  ],
  "depotAmendements": {
    "amendementsSeance": {
      "amendable": false
    },
    "amendementsCommission": [
      {
        "organeRef": "PO59051",
        "amendable": true
      }
    ]
  }
}