{
  "xsiType": "DossierMissionControle_Type",
  "uid": "DLR5L15N36210",
  "legislature": "15",
  "titreDossier": {
    "titre": "Union européenne : le marché unique du numérique",
    "titreChemin": "marche_unique_numerique_rap-info"
  },
  "procedureParlementaire": {
    "code": "19",
    "libelle": "Rapport d'information sans mission"
  },
  "actesLegislatifs": [
    {
      "xsiType": "Etape_Type",
      "uid": "L15-AN20-36210",
      "codeActe": "AN20",
      "libelleActe": {
        "nomCanonique": "Travaux"
      },
      "organeRef": "PO717460",
      "actesLegislatifs": [
        {
          "xsiType": "DepotRapport_Type",
          "uid": "L15-VD183713",
          "codeActe": "AN20-RAPPORT",
          "libelleActe": {
            "nomCanonique": "Dépôt de rapport",
            "libelleCourt": "Dépôt de rapport"
          },
          "organeRef": "PO415287",
          "dateActe": "2017-12-06T00:00:00.000+01:00",
          "texteAssocieRef": "RINFANR5L15B0479"
        }
      ]
    }
  ]
}