{
  "xsiType": "texteLoi_Type",
  "uid": "PIONANR5L15B2200",
  "legislature": "15",
  "cycleDeVie": {
    "chrono": {
      "dateCreation": "2019-08-01T00:00:00.000+02:00",
      "dateDepot": "2019-08-28T00:00:00.000+02:00",
      "datePublication": "2019-09-04T00:00:00.000+02:00",
      "datePublicationWeb": "2019-08-29T12:30:00.000+02:00"
    }
  },
  "denominationStructurelle": "Proposition de loi",
  "provenance": "Texte Déposé",
  "titres": {
    "titrePrincipal": "proposition de loi relative aux violences au sein des couples et aux incidences de ces dernières sur les enfants",
    "titrePrincipalCourt": "violences couples et incidences sur les enfants"
  },
  "dossierRef": "DLR5L15N37695",
  "classification": {
    "famille": {
      "depot": {
        "code": "INITDEP",
        "libelle": "Initiative en 1er Dépôt"
      },
      "classe": {
        "code": "PIONLOI",
        "libelle": "Proposition de loi"
      }
    },
    "type": {
      "code": "PION",
      "libelle": "Proposition de loi"
    }
  },
  "auteurs": [
    {
      "acteur": {
        "acteurRef": "PA330684",
        "qualite": "auteur"
      }
    }
  ],
  "notice": {
    "numNotice": "2200",
    "formule": "relative aux violences au sein des couples et aux incidences de ces dernières sur les enfants",
    "adoptionConforme": false
  },
  "coSignataires": [
    {
      "acteurRef": "PA720100",
      "dateCosignature": "2019-08-28+02:00",
      "edite": false
    },
    {
      "acteurRef": "PA1695",
      "dateCosignature": "2019-08-28+02:00",
      "edite": false
    },
    {
      "acteurRef": "PA605036",
      "dateCosignature": "2019-08-28+02:00",
      "edite": false
    },
    {
      "acteurRef": "PA642847",
      "dateCosignature": "2019-08-28+02:00",
      "edite": false
    },
    {
      "acteurRef": "PA713448",
      "dateCosignature": "2019-08-28+02:00",
      "edite": false
    },
    {
      "acteurRef": "PA767",
      "dateCosignature": "2019-08-28+02:00",
      "edite": false
    },
    {
      "acteurRef": "PA267429",
      "dateCosignature": "2019-08-28+02:00",
      "edite": false
    },
    {
      "acteurRef": "PA718850",
      "dateCosignature": "2019-08-28+02:00",
      "edite": false
    },
    {
      "acteurRef": "PA608826",
      "dateCosignature": "2019-08-28+02:00",
      "edite": false
    },
    {
      "acteurRef": "PA695100",
      "dateCosignature": "2019-08-28+02:00",
      "edite": false
    },
    {
      "acteurRef": "PA608416",
      "dateCosignature": "2019-08-28+02:00",
      "edite": false
    },
    {
      "acteurRef": "PA608016",
      "dateCosignature": "2019-08-28+02:00",
      "edite": false
    },
    {
      "acteurRef": "PA606712",
      "dateCosignature": "2019-08-28+02:00",
      "edite": false
    },
    {
      "acteurRef": "PA719272",
      "dateCosignature": "2019-08-28+02:00",
      "edite": false
    },
    {
      "acteurRef": "PA2377",
      "dateCosignature": "2019-08-28+02:00",
      "edite": false
    },
    {
      "acteurRef": "PA2529",
      "dateCosignature": "2019-08-28+02:00",
      "edite": false
    },
    {
      "acteurRef": "PA267204",
      "dateCosignature": "2019-08-28+02:00",
      "edite": false
    },
    {
      "acteurRef": "PA267794",
      "dateCosignature": "2019-08-28+02:00",
      "edite": false
    },
    {
      "acteurRef": "PA643089",
      "dateCosignature": "2019-08-28+02:00",
      "edite": false
    },
    {
      "acteurRef": "PA1012",
      "dateCosignature": "2019-08-28+02:00",
      "edite": false
    },
    {
      "acteurRef": "PA709315",
      "dateCosignature": "2019-08-28+02:00",
      "edite": false
    },
    {
      "acteurRef": "PA721968",
      "dateCosignature": "2019-08-28+02:00",
      "edite": false
    },
    {
      "acteurRef": "PA609245",
      "dateCosignature": "2019-08-28+02:00",
      "edite": false
    },
    {
      "acteurRef": "PA2796",
      "dateCosignature": "2019-08-28+02:00",
      "edite": false
    },
    {
      "acteurRef": "PA718884",
      "dateCosignature": "2019-09-05+02:00",
      "edite": false
    },
    {
      "acteurRef": "PA720210",
      "dateCosignature": "2019-09-05+02:00",
      "edite": false
    },
    {
      "acteurRef": "PA721816",
      "dateCosignature": "2019-09-05+02:00",
      "edite": false
    },
    {
      "acteurRef": "PA223837",
      "dateCosignature": "2019-09-05+02:00",
      "edite": false
    },
    {
      "acteurRef": "PA267735",
      "dateCosignature": "2019-09-05+02:00",
      "edite": false
    },
    {
      "acteurRef": "PA346218",
      "dateCosignature": "2019-09-05+02:00",
      "edite": false
    },
    {
      "acteurRef": "PA1630",
      "dateCosignature": "2019-09-13+02:00",
      "edite": false
    },
    {
      "acteurRef": "PA721410",
      "dateCosignature": "2019-09-11+02:00",
      "edite": false
    },
    {
      "acteurRef": "PA2960",
      "dateCosignature": "2019-09-16+02:00",
      "edite": false
    },
    {
      "dateCosignature": "2019-08-28+02:00",
      "edite": false,
      "organe": {
        "organeRef": "PO730934",
        "etApparentes": true
      }
    },
    {
      "acteurRef": "PA719318",
      "dateCosignature": "2019-08-28+02:00",
      "edite": false
    },
    {
      "acteurRef": "PA609726",
      "dateCosignature": "2019-08-28+02:00",
      "edite": false
    },
    {
      "acteurRef": "PA721046",
      "dateCosignature": "2019-08-28+02:00",
      "edite": false
    },
    {
      "acteurRef": "PA266793",
      "dateCosignature": "2019-08-28+02:00",
      "edite": false
    },
    {
      "acteurRef": "PA336316",
      "dateCosignature": "2019-08-28+02:00",
      "edite": false
    },
    {
      "acteurRef": "PA330008",
      "dateCosignature": "2019-08-28+02:00",
      "edite": false
    },
    {
      "acteurRef": "PA718838",
      "dateCosignature": "2019-08-28+02:00",
      "edite": false
    },
    {
      "acteurRef": "PA746",
      "dateCosignature": "2019-08-28+02:00",
      "edite": false
    },
    {
      "acteurRef": "PA856",
      "dateCosignature": "2019-08-28+02:00",
      "edite": false
    },
    {
      "acteurRef": "PA330240",
      "dateCosignature": "2019-08-28+02:00",
      "edite": false
    },
    {
      "acteurRef": "PA722390",
      "dateCosignature": "2019-08-28+02:00",
      "edite": false
    },
    {
      "acteurRef": "PA923",
      "dateCosignature": "2019-08-28+02:00",
      "edite": false
    },
    {
      "acteurRef": "PA332523",
      "dateCosignature": "2019-08-28+02:00",
      "edite": false
    },
    {
      "acteurRef": "PA998",
      "dateCosignature": "2019-08-28+02:00",
      "edite": false
    },
    {
      "acteurRef": "PA1029",
      "dateCosignature": "2019-08-28+02:00",
      "edite": false
    },
    {
      "acteurRef": "PA267450",
      "dateCosignature": "2019-08-28+02:00",
      "edite": false
    },
    {
      "acteurRef": "PA330909",
      "dateCosignature": "2019-08-28+02:00",
      "edite": false
    },
    {
      "acteurRef": "PA267440",
      "dateCosignature": "2019-08-28+02:00",
      "edite": false
    },
    {
      "acteurRef": "PA720386",
      "dateCosignature": "2019-08-28+02:00",
      "edite": false
    },
    {
      "acteurRef": "PA712015",
      "dateCosignature": "2019-08-28+02:00",
      "edite": false
    },
    {
      "acteurRef": "PA267289",
      "dateCosignature": "2019-08-28+02:00",
      "edite": false
    },
    {
      "acteurRef": "PA342935",
      "dateCosignature": "2019-08-28+02:00",
      "edite": false
    },
    {
      "acteurRef": "PA720684",
      "dateCosignature": "2019-08-28+02:00",
      "edite": false
    },
    {
      "acteurRef": "PA334149",
      "dateCosignature": "2019-08-28+02:00",
      "edite": false
    },
    {
      "acteurRef": "PA643103",
      "dateCosignature": "2019-08-28+02:00",
      "edite": false
    },
    {
      "acteurRef": "PA1327",
      "dateCosignature": "2019-08-28+02:00",
      "edite": false
    },
    {
      "acteurRef": "PA266774",
      "dateCosignature": "2019-08-28+02:00",
      "edite": false
    },
    {
      "acteurRef": "PA267324",
      "dateCosignature": "2019-08-28+02:00",
      "edite": false
    },
    {
      "acteurRef": "PA605991",
      "dateCosignature": "2019-08-28+02:00",
      "edite": false
    },
    {
      "acteurRef": "PA1498",
      "dateCosignature": "2019-08-28+02:00",
      "edite": false
    },
    {
      "acteurRef": "PA266797",
      "dateCosignature": "2019-08-28+02:00",
      "edite": false
    },
    {
      "acteurRef": "PA267318",
      "dateCosignature": "2019-08-28+02:00",
      "edite": false
    },
    {
      "acteurRef": "PA721126",
      "dateCosignature": "2019-08-28+02:00",
      "edite": false
    },
    {
      "acteurRef": "PA267200",
      "dateCosignature": "2019-08-28+02:00",
      "edite": false
    },
    {
      "acteurRef": "PA267901",
      "dateCosignature": "2019-08-28+02:00",
      "edite": false
    },
    {
      "acteurRef": "PA721506",
      "dateCosignature": "2019-08-28+02:00",
      "edite": false
    },
    {
      "acteurRef": "PA267785",
      "dateCosignature": "2019-08-28+02:00",
      "edite": false
    },
    {
      "acteurRef": "PA340853",
      "dateCosignature": "2019-08-28+02:00",
      "edite": false
    },
    {
      "acteurRef": "PA1874",
      "dateCosignature": "2019-08-28+02:00",
      "edite": false
    },
    {
      "acteurRef": "PA345722",
      "dateCosignature": "2019-08-28+02:00",
      "edite": false
    },
    {
      "acteurRef": "PA267378",
      "dateCosignature": "2019-08-28+02:00",
      "edite": false
    },
    {
      "acteurRef": "PA721054",
      "dateCosignature": "2019-08-28+02:00",
      "edite": false
    },
    {
      "acteurRef": "PA346054",
      "dateCosignature": "2019-08-28+02:00",
      "edite": false
    },
    {
      "acteurRef": "PA606098",
      "dateCosignature": "2019-08-28+02:00",
      "edite": false
    },
    {
      "acteurRef": "PA2086",
      "dateCosignature": "2019-08-28+02:00",
      "edite": false
    },
    {
      "acteurRef": "PA2155",
      "dateCosignature": "2019-08-28+02:00",
      "edite": false
    },
    {
      "acteurRef": "PA720630",
      "dateCosignature": "2019-08-28+02:00",
      "edite": false
    },
    {
      "acteurRef": "PA720644",
      "dateCosignature": "2019-08-28+02:00",
      "edite": false
    },
    {
      "acteurRef": "PA721636",
      "dateCosignature": "2019-08-28+02:00",
      "edite": false
    },
    {
      "acteurRef": "PA718784",
      "dateCosignature": "2019-08-28+02:00",
      "edite": false
    },
    {
      "acteurRef": "PA719946",
      "dateCosignature": "2019-08-28+02:00",
      "edite": false
    },
    {
      "acteurRef": "PA267260",
      "dateCosignature": "2019-08-28+02:00",
      "edite": false
    },
    {
      "acteurRef": "PA2492",
      "dateCosignature": "2019-08-28+02:00",
      "edite": false
    },
    {
      "acteurRef": "PA721286",
      "dateCosignature": "2019-08-28+02:00",
      "edite": false
    },
    {
      "acteurRef": "PA721070",
      "dateCosignature": "2019-08-28+02:00",
      "edite": false
    },
    {
      "acteurRef": "PA721678",
      "dateCosignature": "2019-08-28+02:00",
      "edite": false
    },
    {
      "acteurRef": "PA266776",
      "dateCosignature": "2019-08-28+02:00",
      "edite": false
    },
    {
      "acteurRef": "PA330788",
      "dateCosignature": "2019-08-28+02:00",
      "edite": false
    },
    {
      "acteurRef": "PA266808",
      "dateCosignature": "2019-08-28+02:00",
      "edite": false
    },
    {
      "acteurRef": "PA267527",
      "dateCosignature": "2019-08-28+02:00",
      "edite": false
    },
    {
      "acteurRef": "PA748954",
      "dateCosignature": "2019-08-28+02:00",
      "edite": false
    },
    {
      "acteurRef": "PA721314",
      "dateCosignature": "2019-08-28+02:00",
      "edite": false
    },
    {
      "acteurRef": "PA334654",
      "dateCosignature": "2019-08-28+02:00",
      "edite": false
    },
    {
      "acteurRef": "PA2792",
      "dateCosignature": "2019-08-28+02:00",
      "edite": false
    },
    {
      "acteurRef": "PA718780",
      "dateCosignature": "2019-08-28+02:00",
      "edite": false
    },
    {
      "acteurRef": "PA643134",
      "dateCosignature": "2019-08-28+02:00",
      "edite": false
    },
    {
      "acteurRef": "PA720586",
      "dateCosignature": "2019-08-28+02:00",
      "edite": false
    },
    {
      "acteurRef": "PA334843",
      "dateCosignature": "2019-08-28+02:00",
      "edite": false
    },
    {
      "acteurRef": "PA607090",
      "dateCosignature": "2019-08-28+02:00",
      "edite": false
    },
    {
      "acteurRef": "PA721474",
      "dateCosignature": "2019-08-28+02:00",
      "edite": false
    }
  ],
  "depotAmendements": {
    "amendementsSeance": {
      "amendable": true
    },
    "amendementsCommission": [
      {
        "organeRef": "PO59051",
        "amendable": true
      }
    ]
  }
}