{
  "xsiType": "DossierMissionControle_Type",
  "uid": "DLR5L15N36951",
  "legislature": "15",
  "titreDossier": {
    "titre": "Société : évaluation de la loi relative à la bioéthique",
    "titreChemin": "evaluation_application_loi_bioethique"
  },
  "procedureParlementaire": {
    "code": "19",
    "libelle": "Rapport d'information sans mission"
  },
  "actesLegislatifs": [
    {
      "xsiType": "Etape_Type",
      "uid": "L15-AN20-36951",
      "codeActe": "AN20",
      "libelleActe": {
        "nomCanonique": "Travaux"
      },
      "organeRef": "PO717460",
      "actesLegislatifs": [
        {
          "xsiType": "DepotRapport_Type",
          "uid": "L15-VD187177",
          "codeActe": "AN20-RAPPORT",
          "libelleActe": {
            "nomCanonique": "Dépôt de rapport",
            "libelleCourt": "Dépôt de rapport"
          },
          "organeRef": "PO273589",
          "dateActe": "2018-10-25T00:00:00.000+02:00",
          "texteAssocieRef": "RAPPANR5L15B1351"
        }
      ]
    }
  ]
}