{
  "xsiType": "texteLoi_Type",
  "uid": "PNREANR5L15B1261",
  "legislature": "15",
  "cycleDeVie": {
    "chrono": {
      "dateCreation": "2018-09-26T00:00:00.000+02:00",
      "dateDepot": "2018-09-26T00:00:00.000+02:00",
      "datePublication": "2018-10-09T00:00:00.000+02:00",
      "datePublicationWeb": "2018-10-04T13:45:00.000+02:00"
    }
  },
  "denominationStructurelle": "Proposition de résolution",
  "provenance": "Texte Déposé",
  "titres": {
    "titrePrincipal": "proposition de résolution visant à promouvoir l'adoption de l'assiette commune consolidée pour l'impôt des sociétés",
    "titrePrincipalCourt": "Assiette commune consolidée pour l'impôt des sociétés"
  },
  "dossierRef": "DLR5L15N36862",
  "classification": {
    "famille": {
      "depot": {
        "code": "INITDEP",
        "libelle": "Initiative en 1er Dépôt"
      },
      "classe": {
        "code": "PIONRES",
        "libelle": "Proposition de résolution"
      },
      "espece": {
        "code": "APPART341",
        "libelle": "en application de Article 34-1 de la Constitution"
      }
    },
    "type": {
      "code": "PNRE",
      "libelle": "Proposition de résolution"
    },
    "sousType": {
      "code": "APPART341",
      "libelle": "en application de Article 34-1 de la Constitution"
    }
  },
  "auteurs": [
    {
      "acteur": {
        "acteurRef": "PA718884",
        "qualite": "auteur"
      }
    }
  ],
  "notice": {
    "numNotice": "1261",
    "formule": "visant à promouvoir l'adoption de l'assiette commune consolidée pour l'impôt des sociétés",
    "adoptionConforme": false
  },
  "coSignataires": [
    {
      "acteurRef": "PA346218",
      "dateCosignature": "2018-10-11+02:00",
      "edite": false
    },
    {
      "acteurRef": "PA346054",
      "dateCosignature": "2018-10-11+02:00",
      "edite": false
    },
    {
      "acteurRef": "PA267204",
      "dateCosignature": "2018-10-11+02:00",
      "edite": false
    },
    {
      "acteurRef": "PA721968",
      "dateCosignature": "2018-10-11+02:00",
      "edite": false
    },
    {
      "acteurRef": "PA721474",
      "dateCosignature": "2018-10-11+02:00",
      "edite": false
    },
    {
      "acteurRef": "PA608016",
      "dateCosignature": "2018-10-11+02:00",
      "edite": false
    },
    {
      "acteurRef": "PA605036",
      "dateCosignature": "2018-10-11+02:00",
      "edite": false
    },
    {
      "acteurRef": "PA608416",
      "dateCosignature": "2018-10-11+02:00",
      "edite": false
    },
    {
      "acteurRef": "PA720630",
      "dateCosignature": "2018-10-18+02:00",
      "edite": false
    },
    {
      "acteurRef": "PA721314",
      "dateCosignature": "2018-10-18+02:00",
      "edite": false
    },
    {
      "acteurRef": "PA1630",
      "dateCosignature": "2018-10-18+02:00",
      "edite": false
    },
    {
      "acteurRef": "PA721046",
      "dateCosignature": "2018-10-18+02:00",
      "edite": false
    },
    {
      "acteurRef": "PA345722",
      "dateCosignature": "2018-10-31+01:00",
      "edite": false
    }
  ]
}