{
  "xsiType": "texteLoi_Type",
  "uid": "PRJLSNR5S339B0008",
  "cycleDeVie": {
    "chrono": {
      "dateCreation": "2019-10-02T00:00:00.000+02:00",
      "dateDepot": "2019-10-02T00:00:00.000+02:00"
    }
  },
  "denominationStructurelle": "Projet de loi",
  "provenance": "Texte Déposé",
  "titres": {
    "titrePrincipal": "projet de loi ratifiant l’ordonnance n° 2019-741 du 17 juillet 2019 portant extension en Nouvelle Calédonie, en Polynésie française et dans les îles Wallis et Futuna de diverses dispositions du code monétaire et financier issues de la loi n° 2019-486 du 22 mai 2019 relative à la croissance et à la transformation des entreprises",
    "titrePrincipalCourt": "ratifiant l’ordonnance n° 2019-741 du 17 juillet 2019 portant extension en Nouvelle Calédonie, en Polynésie française et dans les îles Wallis et Futuna de diverses dispositions du code monétaire et financier issues de la loi n° 2019-486 du 22 mai 2019 relative à la croissance et à la transformation des entreprises"
  },
  "dossierRef": "DLR5L15N37798",
  "classification": {
    "famille": {
      "depot": {
        "code": "INITDEP",
        "libelle": "Initiative en 1er Dépôt"
      },
      "classe": {
        "code": "PRJLOI",
        "libelle": "Projet de loi"
      }
    },
    "type": {
      "code": "PRJL",
      "libelle": "Projet de loi"
    }
  },
  "auteurs": [
    {
      "acteur": {
        "acteurRef": "PA345619",
        "qualite": "auteur"
      }
    }
  ],
  "notice": {
    "numNotice": "8",
    "formule": "ratifiant l’ordonnance n° 2019-741 du 17 juillet 2019 portant extension en Nouvelle Calédonie, en Polynésie française et dans les îles Wallis et Futuna de diverses dispositions du code monétaire et financier issues de la loi n° 2019-486 du 22 mai 2019 relative à la croissance et à la transformation des entreprises",
    "adoptionConforme": false
  },
  "coSignataires": [
    {
      "acteurRef": "PA331481",
      "dateCosignature": "2019-10-02+02:00",
      "edite": true
    }
  ],
  "depotAmendements": {
    "amendementsSeance": {
      "amendable": false
    }
  }
}