{
  "xsiType": "rapportParlementaire_Type",
  "uid": "RAPPANR5L15B2410",
  "legislature": "15",
  "cycleDeVie": {
    "chrono": {
      "dateCreation": "2019-11-13T00:00:00.000+01:00",
      "dateDepot": "2019-11-13T00:00:00.000+01:00",
      "datePublicationWeb": "2019-11-18T10:45:00.000+01:00"
    }
  },
  "denominationStructurelle": "Rapport",
  "provenance": "Commission",
  "titres": {
    "titrePrincipal": "rapport sur la proposition de résolution européenne de M. Ludovic Mendes, rapporteur de la commission des affaires européennes relative à la réforme européenne du droit d'asile (n°2343).",
    "titrePrincipalCourt": "rapport sur la proposition de résolution européenne de M. Ludovic Mendes, rapporteur de la commission des affaires européennes relative à la réforme européenne du droit d'asile (n°2343)."
  },
  "divisions": [
    {
      "xsiType": "rapportParlementaire_Type",
      "uid": "RAPPANR5L15B2410-COMPA",
      "legislature": "15",
      "cycleDeVie": {
        "chrono": {
          "dateCreation": "2019-11-13T00:00:00.000+01:00",
          "dateDepot": "2019-11-13T00:00:00.000+01:00",
          "datePublication": "2019-11-15T00:00:00.000+01:00",
          "datePublicationWeb": "2019-11-14T17:45:00.000+01:00"
        }
      },
      "denominationStructurelle": "Annexe Texte comparatif COMPA",
      "titres": {
        "titrePrincipal": "Texte comparatif",
        "titrePrincipalCourt": "Texte comparatif"
      },
      "dossierRef": "DLR5L15N37872",
      "classification": {
        "type": {
          "code": "RAPP",
          "libelle": "Rapport"
        },
        "sousType": {
          "code": "COMPA",
          "libelle": "Texte comparatif"
        },
        "statutAdoption": "ADOPTCOM"
      },
      "auteurs": [
        {
          "acteur": {
            "acteurRef": "PA335054",
            "qualite": "rapporteur"
          }
        },
        {
          "organeRef": "PO59051"
        }
      ],
      "notice": {
        "numNotice": "2410",
        "formule": "sur la proposition de résolution européenne de M. Ludovic Mendes, rapporteur de la commission des affaires européennes relative à la réforme européenne du droit d'asile (n°2343).",
        "adoptionConforme": false
      },
      "imprimerie": {
        "nbPage": "0"
      }
    }
  ],
  "dossierRef": "DLR5L15N37872",
  "classification": {
    "famille": {
      "depot": {
        "code": "RAPINIT",
        "libelle": "Rapport sur une initiative"
      },
      "classe": {
        "code": "RAPPORT",
        "libelle": "Rapport"
      }
    },
    "type": {
      "code": "RAPP",
      "libelle": "Rapport"
    },
    "statutAdoption": "ADOPTCOM"
  },
  "auteurs": [
    {
      "acteur": {
        "acteurRef": "PA335054",
        "qualite": "rapporteur"
      }
    },
    {
      "organeRef": "PO59051"
    }
  ],
  "notice": {
    "numNotice": "2410",
    "formule": "sur la proposition de résolution européenne de M. Ludovic Mendes, rapporteur de la commission des affaires européennes relative à la réforme européenne du droit d'asile (n°2343).",
    "adoptionConforme": false
  },
  "imprimerie": {
    "nbPage": "0",
    "prix": "1.5"
  }
}