{
  "xsiType": "texteLoi_Type",
  "uid": "PIONANR5L15B0741",
  "legislature": "15",
  "cycleDeVie": {
    "chrono": {
      "dateCreation": "2018-03-06T00:00:00.000+01:00",
      "dateDepot": "2018-03-07T00:00:00.000+01:00",
      "datePublication": "2018-03-13T00:00:00.000+01:00",
      "datePublicationWeb": "2018-03-08T11:15:00.000+01:00"
    }
  },
  "denominationStructurelle": "Proposition de loi",
  "provenance": "Texte Déposé",
  "titres": {
    "titrePrincipal": "proposition de loi visant à accorder la médaille du travail aux commerçants, artisans et professions libérales",
    "titrePrincipalCourt": "médaille du travail"
  },
  "dossierRef": "DLR5L15N36438",
  "classification": {
    "famille": {
      "depot": {
        "code": "INITDEP",
        "libelle": "Initiative en 1er Dépôt"
      },
      "classe": {
        "code": "PIONLOI",
        "libelle": "Proposition de loi"
      }
    },
    "type": {
      "code": "PION",
      "libelle": "Proposition de loi"
    }
  },
  "auteurs": [
    {
      "acteur": {
        "acteurRef": "PA2377",
        "qualite": "auteur"
      }
    }
  ],
  "notice": {
    "numNotice": "741",
    "formule": "visant à accorder la médaille du travail aux commerçants, artisans et professions libérales",
    "adoptionConforme": false
  },
  "depotAmendements": {
    "amendementsSeance": {
      "amendable": false
    },
    "amendementsCommission": [
      {
        "organeRef": "PO420120",
        "amendable": true
      }
    ]
  }
}