{
  "xsiType": "texteLoi_Type",
  "uid": "PRJLANR5L15BTC1222",
  "legislature": "15",
  "cycleDeVie": {
    "chrono": {
      "dateCreation": "2018-07-31T00:00:00.000+02:00",
      "dateDepot": "2018-07-31T00:00:00.000+02:00"
    }
  },
  "denominationStructurelle": "Projet de loi",
  "provenance": "Texte Déposé",
  "titres": {
    "titrePrincipal": "projet de loi sur le projet de loi, modifié par le Sénat en nouvelle lecture, pour un Etat au service d'une société de confiance, en vue de la lecture définitive (n°1217).",
    "titrePrincipalCourt": "Etat au service d'une société de confiance"
  },
  "dossierRef": "DLR5L15N36159",
  "classification": {
    "famille": {
      "depot": {
        "code": "INITNAV",
        "libelle": "Initiative en Navette"
      },
      "classe": {
        "code": "PRJLOI",
        "libelle": "Projet de loi"
      }
    },
    "type": {
      "code": "PRJL",
      "libelle": "Projet de loi"
    },
    "statutAdoption": "ADOPTCOM"
  },
  "auteurs": [
    {
      "acteur": {
        "acteurRef": "PA721498",
        "qualite": "rapporteur"
      }
    },
    {
      "organeRef": "PO744107"
    }
  ],
  "notice": {
    "numNotice": "1222",
    "formule": "sur le projet de loi, modifié par le Sénat en nouvelle lecture, pour un Etat au service d'une société de confiance, en vue de la lecture définitive (n°1217).",
    "adoptionConforme": false
  },
  "depotAmendements": {
    "amendementsSeance": {
      "amendable": true
    },
    "amendementsCommission": [
      {
        "organeRef": "PO744107",
        "amendable": true
      }
    ]
  }
}