{
  "xsiType": "texteLoi_Type",
  "uid": "PNREANR5L15B0125",
  "legislature": "15",
  "cycleDeVie": {
    "chrono": {
      "dateCreation": "2017-08-04T00:00:00.000+02:00",
      "dateDepot": "2017-08-04T00:00:00.000+02:00"
    }
  },
  "denominationStructurelle": "Proposition de résolution",
  "provenance": "Texte Déposé",
  "titres": {
    "titrePrincipal": "proposition de résolution tendant à la création d’une commission d’enquête sur les conditions de financement, de gestion et sur l’influence potentielle exercée par les Etats étrangers sur le lieu de culte niçois d’En-Nour",
    "titrePrincipalCourt": "Commission d'enquête lieu de culte En-Nour"
  },
  "dossierRef": "DLR5L15N35892",
  "classification": {
    "famille": {
      "depot": {
        "code": "INITDEP",
        "libelle": "Initiative en 1er Dépôt"
      },
      "classe": {
        "code": "PIONRES",
        "libelle": "Proposition de résolution"
      },
      "espece": {
        "code": "COMENQ",
        "libelle": "tendant à la création d'une commission d'enquête"
      }
    },
    "type": {
      "code": "PNRE",
      "libelle": "Proposition de résolution"
    },
    "sousType": {
      "code": "COMENQ",
      "libelle": "tendant à la création d'une commission d'enquête"
    }
  },
  "auteurs": [
    {
      "acteur": {
        "acteurRef": "PA713448",
        "qualite": "auteur"
      }
    }
  ],
  "notice": {
    "numNotice": "125",
    "formule": "tendant à la création d’une commission d’enquête sur les conditions de financement, de gestion et sur l’influence potentielle exercée par les Etats étrangers sur le lieu de culte niçois d’En-Nour",
    "adoptionConforme": false
  }
}