{
  "xsiType": "texteLoi_Type",
  "uid": "PIONANR5L15B1615",
  "legislature": "15",
  "cycleDeVie": {
    "chrono": {
      "dateCreation": "2019-01-24T00:00:00.000+01:00",
      "dateDepot": "2019-01-24T00:00:00.000+01:00",
      "datePublication": "2019-02-25T00:00:00.000+01:00",
      "datePublicationWeb": "2019-02-14T16:55:00.000+01:00"
    }
  },
  "denominationStructurelle": "Proposition de loi",
  "provenance": "Texte Déposé",
  "titres": {
    "titrePrincipal": "proposition de loi visant à améliorer la représentativité des conseils communautaires et à mieux associer les conseillers municipaux au fonctionnement de l’intercommunalité",
    "titrePrincipalCourt": "Représentativité des conseils communautaires et fonctionnement de l’intercommunalité"
  },
  "dossierRef": "DLR5L15N37126",
  "classification": {
    "famille": {
      "depot": {
        "code": "INITNAV",
        "libelle": "Initiative en Navette"
      },
      "classe": {
        "code": "PIONLOI",
        "libelle": "Proposition de loi"
      }
    },
    "type": {
      "code": "PION",
      "libelle": "Proposition de loi"
    }
  },
  "auteurs": [
    {
      "organeRef": "PO717460"
    }
  ],
  "notice": {
    "numNotice": "1615",
    "formule": ", adoptée par le Sénat, visant à améliorer la représentativité des conseils communautaires et à mieux associer les conseillers municipaux au fonctionnement de l’intercommunalité",
    "adoptionConforme": false
  },
  "depotAmendements": {
    "amendementsSeance": {
      "amendable": false
    },
    "amendementsCommission": [
      {
        "organeRef": "PO59051",
        "amendable": true
      }
    ]
  }
}