{
  "xsiType": "texteLoi_Type",
  "uid": "PIONANR5L15B1347",
  "legislature": "15",
  "cycleDeVie": {
    "chrono": {
      "dateCreation": "2018-10-23T00:00:00.000+02:00",
      "dateDepot": "2018-10-24T00:00:00.000+02:00",
      "datePublication": "2018-10-30T00:00:00.000+01:00",
      "datePublicationWeb": "2018-10-25T12:50:00.000+02:00"
    }
  },
  "denominationStructurelle": "Proposition de loi",
  "provenance": "Texte Déposé",
  "titres": {
    "titrePrincipal": "proposition de loi visant à donner un caractère obligatoire à l’interdiction d’exercice d’activités professionnelles ou bénévoles au contact de mineurs et de majeurs protégés aux personnes condamnées pour des faits d’atteinte sexuelle sur mineur, de diffusion et de détention de documents pédopornographiques, de pédophilie, d’agressions et de viols sur majeurs protégés",
    "titrePrincipalCourt": "interdiction d'exercice d'activités professionnelles personnes condamnées atteinte sexuelle sur mineur"
  },
  "dossierRef": "DLR5L15N36944",
  "classification": {
    "famille": {
      "depot": {
        "code": "INITDEP",
        "libelle": "Initiative en 1er Dépôt"
      },
      "classe": {
        "code": "PIONLOI",
        "libelle": "Proposition de loi"
      }
    },
    "type": {
      "code": "PION",
      "libelle": "Proposition de loi"
    }
  },
  "auteurs": [
    {
      "acteur": {
        "acteurRef": "PA720798",
        "qualite": "auteur"
      }
    }
  ],
  "notice": {
    "numNotice": "1347",
    "formule": "visant à donner un caractère obligatoire à l’interdiction d’exercice d’activités professionnelles ou bénévoles au contact de mineurs et de majeurs protégés aux personnes condamnées pour des faits d’atteinte sexuelle sur mineur, de diffusion et de détention de documents pédopornographiques, de pédophilie, d’agressions et de viols sur majeurs protégés",
    "adoptionConforme": false
  },
  "depotAmendements": {
    "amendementsSeance": {
      "amendable": false
    },
    "amendementsCommission": [
      {
        "organeRef": "PO59051",
        "amendable": true
      }
    ]
  }
}