{
  "xsiType": "texteLoi_Type",
  "uid": "PIONANR5L15B0298",
  "legislature": "15",
  "cycleDeVie": {
    "chrono": {
      "dateCreation": "2017-10-10T00:00:00.000+02:00",
      "dateDepot": "2017-10-17T00:00:00.000+02:00",
      "datePublication": "2017-10-24T00:00:00.000+02:00",
      "datePublicationWeb": "2017-10-19T11:25:00.000+02:00"
    }
  },
  "denominationStructurelle": "Proposition de loi",
  "provenance": "Texte Déposé",
  "titres": {
    "titrePrincipal": "proposition de loi visant à permettre l’accès à l’apprentissage dès l’âge de quatorze ans",
    "titrePrincipalCourt": "apprentissage dès quatorze ans"
  },
  "dossierRef": "DLR5L15N36026",
  "classification": {
    "famille": {
      "depot": {
        "code": "INITDEP",
        "libelle": "Initiative en 1er Dépôt"
      },
      "classe": {
        "code": "PIONLOI",
        "libelle": "Proposition de loi"
      }
    },
    "type": {
      "code": "PION",
      "libelle": "Proposition de loi"
    }
  },
  "auteurs": [
    {
      "acteur": {
        "acteurRef": "PA721506",
        "qualite": "auteur"
      }
    }
  ],
  "notice": {
    "numNotice": "298",
    "formule": "visant à permettre l’accès à l’apprentissage dès l’âge de quatorze ans",
    "adoptionConforme": false
  },
  "coSignataires": [
    {
      "acteurRef": "PA719946",
      "dateCosignature": "2017-10-17+02:00",
      "edite": false
    },
    {
      "acteurRef": "PA718838",
      "dateCosignature": "2017-10-17+02:00",
      "edite": false
    },
    {
      "acteurRef": "PA720100",
      "dateCosignature": "2017-10-17+02:00",
      "edite": false
    },
    {
      "acteurRef": "PA1012",
      "dateCosignature": "2017-10-17+02:00",
      "edite": false
    },
    {
      "acteurRef": "PA334843",
      "dateCosignature": "2017-10-17+02:00",
      "edite": false
    },
    {
      "acteurRef": "PA1874",
      "dateCosignature": "2017-10-17+02:00",
      "edite": false
    },
    {
      "acteurRef": "PA718884",
      "dateCosignature": "2017-10-17+02:00",
      "edite": false
    },
    {
      "acteurRef": "PA267204",
      "dateCosignature": "2017-10-17+02:00",
      "edite": false
    },
    {
      "acteurRef": "PA712015",
      "dateCosignature": "2017-10-17+02:00",
      "edite": false
    },
    {
      "acteurRef": "PA643103",
      "dateCosignature": "2017-10-17+02:00",
      "edite": false
    },
    {
      "acteurRef": "PA334654",
      "dateCosignature": "2017-10-17+02:00",
      "edite": false
    },
    {
      "acteurRef": "PA267440",
      "dateCosignature": "2017-10-17+02:00",
      "edite": false
    },
    {
      "acteurRef": "PA2377",
      "dateCosignature": "2017-10-17+02:00",
      "edite": false
    },
    {
      "acteurRef": "PA642847",
      "dateCosignature": "2017-10-17+02:00",
      "edite": false
    },
    {
      "acteurRef": "PA998",
      "dateCosignature": "2017-10-17+02:00",
      "edite": false
    },
    {
      "acteurRef": "PA342935",
      "dateCosignature": "2017-10-17+02:00",
      "edite": false
    },
    {
      "acteurRef": "PA266808",
      "dateCosignature": "2017-10-17+02:00",
      "edite": false
    },
    {
      "acteurRef": "PA718850",
      "dateCosignature": "2017-10-17+02:00",
      "edite": false
    },
    {
      "acteurRef": "PA718784",
      "dateCosignature": "2017-10-17+02:00",
      "edite": false
    },
    {
      "acteurRef": "PA223837",
      "dateCosignature": "2017-10-17+02:00",
      "edite": false
    },
    {
      "acteurRef": "PA346218",
      "dateCosignature": "2017-10-17+02:00",
      "edite": false
    },
    {
      "acteurRef": "PA721314",
      "dateCosignature": "2017-10-17+02:00",
      "edite": false
    },
    {
      "acteurRef": "PA2792",
      "dateCosignature": "2017-10-17+02:00",
      "edite": false
    },
    {
      "acteurRef": "PA1630",
      "dateCosignature": "2017-10-17+02:00",
      "edite": false
    },
    {
      "acteurRef": "PA2492",
      "dateCosignature": "2017-10-17+02:00",
      "edite": false
    },
    {
      "acteurRef": "PA720586",
      "dateCosignature": "2017-10-17+02:00",
      "edite": false
    },
    {
      "acteurRef": "PA721286",
      "dateCosignature": "2017-10-17+02:00",
      "edite": false
    },
    {
      "acteurRef": "PA1029",
      "dateCosignature": "2017-10-17+02:00",
      "edite": false
    },
    {
      "acteurRef": "PA608016",
      "dateCosignature": "2017-10-17+02:00",
      "edite": false
    },
    {
      "acteurRef": "PA267289",
      "dateCosignature": "2017-10-17+02:00",
      "edite": false
    },
    {
      "acteurRef": "PA267318",
      "dateCosignature": "2017-10-17+02:00",
      "edite": false
    },
    {
      "acteurRef": "PA608826",
      "dateCosignature": "2017-10-17+02:00",
      "edite": false
    },
    {
      "acteurRef": "PA609245",
      "dateCosignature": "2017-10-17+02:00",
      "edite": false
    },
    {
      "acteurRef": "PA267527",
      "dateCosignature": "2017-10-17+02:00",
      "edite": false
    },
    {
      "acteurRef": "PA267450",
      "dateCosignature": "2017-10-17+02:00",
      "edite": false
    },
    {
      "acteurRef": "PA767",
      "dateCosignature": "2017-10-23+02:00",
      "edite": false
    },
    {
      "acteurRef": "PA722390",
      "dateCosignature": "2018-01-18+01:00",
      "edite": false
    }
  ],
  "depotAmendements": {
    "amendementsSeance": {
      "amendable": false
    },
    "amendementsCommission": [
      {
        "organeRef": "PO420120",
        "amendable": true
      }
    ]
  }
}