{
  "xsiType": "texteLoi_Type",
  "uid": "PRJLSNR5S299B0184",
  "cycleDeVie": {
    "chrono": {
      "dateCreation": "2018-01-23T00:00:00.000+01:00",
      "dateDepot": "2017-12-19T00:00:00.000+01:00",
      "datePublication": "2018-01-25T00:00:00.000+01:00"
    }
  },
  "denominationStructurelle": "Projet de loi",
  "provenance": "Texte Déposé",
  "titres": {
    "titrePrincipal": "projet de loi autorisant l'approbation de l'accord entre le Gouvernement de la République française et le Gouvernement de la Principauté d'Andorre relatif à la coopération technique et à l'assistance mutuelle en matière de sécurité civile",
    "titrePrincipalCourt": "approbation France Andorre coopération technique sécurité civile"
  },
  "dossierRef": "DLR5L15N35949",
  "classification": {
    "famille": {
      "depot": {
        "code": "INITNAV",
        "libelle": "Initiative en Navette"
      },
      "classe": {
        "code": "PRJLOI",
        "libelle": "Projet de loi"
      },
      "espece": {
        "code": "AUTRATCONV",
        "libelle": "autorisant la ratification d'une convention"
      }
    },
    "type": {
      "code": "PRJL",
      "libelle": "Projet de loi"
    },
    "sousType": {
      "code": "AUTRATCONV",
      "libelle": "autorisant la ratification d'une convention",
      "libelleEdition": "autorisant la ratification d'une convention"
    }
  },
  "auteurs": [
    {
      "organeRef": "PO78718"
    }
  ],
  "notice": {
    "numNotice": "184",
    "formule": ", adopté, par l'Assemblée nationale, autorisant l'approbation de l'accord entre le Gouvernement de la République française et le Gouvernement de la Principauté d'Andorre relatif à la coopération technique et à l'assistance mutuelle en matière de sécurité civile",
    "adoptionConforme": false
  },
  "imprimerie": {},
  "depotAmendements": {
    "amendementsSeance": {
      "amendable": false
    }
  }
}