{
  "xsiType": "DossierMissionInformation_Type",
  "uid": "DLR5L15N37972",
  "legislature": "15",
  "titreDossier": {
    "titre": "Mise en place de la carte des spécialités dans le cadre de la réforme des lycées",
    "titreChemin": "carte_specialites_reforme_lycees_mf"
  },
  "procedureParlementaire": {
    "code": "10",
    "libelle": "Mission d'information"
  },
  "initiateur": {
    "organeRef": "PO768245"
  },
  "actesLegislatifs": [
    {
      "xsiType": "Etape_Type",
      "uid": "L15-AN20-37972",
      "codeActe": "AN20",
      "libelleActe": {
        "nomCanonique": "Travaux"
      },
      "organeRef": "PO717460",
      "actesLegislatifs": [
        {
          "xsiType": "Etape_Type",
          "uid": "L15-AN20-MISINF-37972",
          "codeActe": "AN20-MISINF",
          "libelleActe": {
            "nomCanonique": "Mission d'information",
            "libelleCourt": "Mission d'information"
          },
          "organeRef": "PO768245",
          "actesLegislatifs": [
            {
              "xsiType": "CreationOrganeTemporaire_Type",
              "uid": "L15-VD191496",
              "codeActe": "AN20-MISINF-CREA",
              "libelleActe": {
                "nomCanonique": "Création d'une mission d'information",
                "libelleCourt": "Création d'une mission d'information"
              },
              "organeRef": "PO768245",
              "dateActe": "2019-11-16T00:00:00.000+01:00",
              "initiateur": {
                "organeRef": "PO768245"
              }
            }
          ]
        }
      ]
    }
  ]
}