{
  "xsiType": "texteLoi_Type",
  "uid": "PNREANR5L15B1087",
  "legislature": "15",
  "cycleDeVie": {
    "chrono": {
      "dateCreation": "2018-06-18T00:00:00.000+02:00",
      "dateDepot": "2018-06-18T00:00:00.000+02:00",
      "datePublication": "2018-06-29T00:00:00.000+02:00",
      "datePublicationWeb": "2018-06-26T10:25:00.000+02:00"
    }
  },
  "denominationStructurelle": "Proposition de résolution",
  "provenance": "Texte Déposé",
  "titres": {
    "titrePrincipal": "proposition de résolution relative à l'Outre-mer",
    "titrePrincipalCourt": "Outre-mer"
  },
  "dossierRef": "DLR5L15N36726",
  "classification": {
    "famille": {
      "depot": {
        "code": "INITDEP",
        "libelle": "Initiative en 1er Dépôt"
      },
      "classe": {
        "code": "PIONRES",
        "libelle": "Proposition de résolution"
      },
      "espece": {
        "code": "APPART341",
        "libelle": "en application de Article 34-1 de la Constitution"
      }
    },
    "type": {
      "code": "PNRE",
      "libelle": "Proposition de résolution"
    },
    "sousType": {
      "code": "APPART341",
      "libelle": "en application de Article 34-1 de la Constitution"
    }
  },
  "auteurs": [
    {
      "acteur": {
        "acteurRef": "PA720960",
        "qualite": "auteur"
      }
    }
  ],
  "notice": {
    "numNotice": "1087",
    "formule": "relative à l'Outre-mer",
    "adoptionConforme": false
  }
}