{
  "xsiType": "texteLoi_Type",
  "uid": "PIONANR5L15B0924",
  "legislature": "15",
  "cycleDeVie": {
    "chrono": {
      "dateCreation": "2018-04-23T00:00:00.000+02:00",
      "dateDepot": "2018-05-09T00:00:00.000+02:00",
      "datePublication": "2018-05-21T00:00:00.000+02:00",
      "datePublicationWeb": "2018-05-16T11:00:00.000+02:00"
    }
  },
  "denominationStructurelle": "Proposition de loi",
  "provenance": "Texte Déposé",
  "titres": {
    "titrePrincipal": "proposition de loi visant à créer un fonds spécial dédié à dédommager les victimes de la géothermie",
    "titrePrincipalCourt": "fonds spécial victimes géothermie"
  },
  "dossierRef": "DLR5L15N36588",
  "classification": {
    "famille": {
      "depot": {
        "code": "INITDEP",
        "libelle": "Initiative en 1er Dépôt"
      },
      "classe": {
        "code": "PIONLOI",
        "libelle": "Proposition de loi"
      }
    },
    "type": {
      "code": "PION",
      "libelle": "Proposition de loi"
    }
  },
  "auteurs": [
    {
      "acteur": {
        "acteurRef": "PA608416",
        "qualite": "auteur"
      }
    }
  ],
  "notice": {
    "numNotice": "924",
    "formule": "visant à créer un fonds spécial dédié à dédommager les victimes de la géothermie",
    "adoptionConforme": false
  },
  "coSignataires": [
    {
      "acteurRef": "PA605036",
      "dateCosignature": "2018-05-09+02:00",
      "edite": false
    },
    {
      "acteurRef": "PA719318",
      "dateCosignature": "2018-05-09+02:00",
      "edite": false
    },
    {
      "acteurRef": "PA609726",
      "dateCosignature": "2018-05-09+02:00",
      "edite": false
    },
    {
      "acteurRef": "PA721046",
      "dateCosignature": "2018-05-09+02:00",
      "edite": false
    },
    {
      "acteurRef": "PA642847",
      "dateCosignature": "2018-05-09+02:00",
      "edite": false
    },
    {
      "acteurRef": "PA718884",
      "dateCosignature": "2018-05-09+02:00",
      "edite": false
    },
    {
      "acteurRef": "PA767",
      "dateCosignature": "2018-05-09+02:00",
      "edite": false
    },
    {
      "acteurRef": "PA267450",
      "dateCosignature": "2018-05-09+02:00",
      "edite": false
    },
    {
      "acteurRef": "PA330909",
      "dateCosignature": "2018-05-09+02:00",
      "edite": false
    },
    {
      "acteurRef": "PA608826",
      "dateCosignature": "2018-05-09+02:00",
      "edite": false
    },
    {
      "acteurRef": "PA266774",
      "dateCosignature": "2018-05-09+02:00",
      "edite": false
    },
    {
      "acteurRef": "PA1874",
      "dateCosignature": "2018-05-09+02:00",
      "edite": false
    },
    {
      "acteurRef": "PA608016",
      "dateCosignature": "2018-05-09+02:00",
      "edite": false
    },
    {
      "acteurRef": "PA2377",
      "dateCosignature": "2018-05-09+02:00",
      "edite": false
    },
    {
      "acteurRef": "PA2529",
      "dateCosignature": "2018-05-09+02:00",
      "edite": false
    },
    {
      "acteurRef": "PA267527",
      "dateCosignature": "2018-05-09+02:00",
      "edite": false
    },
    {
      "acteurRef": "PA721314",
      "dateCosignature": "2018-05-09+02:00",
      "edite": false
    },
    {
      "acteurRef": "PA267204",
      "dateCosignature": "2018-05-09+02:00",
      "edite": false
    },
    {
      "acteurRef": "PA334654",
      "dateCosignature": "2018-05-09+02:00",
      "edite": false
    },
    {
      "acteurRef": "PA643134",
      "dateCosignature": "2018-05-09+02:00",
      "edite": false
    },
    {
      "acteurRef": "PA720586",
      "dateCosignature": "2018-05-09+02:00",
      "edite": false
    },
    {
      "acteurRef": "PA721968",
      "dateCosignature": "2018-05-09+02:00",
      "edite": false
    }
  ],
  "depotAmendements": {
    "amendementsSeance": {
      "amendable": false
    },
    "amendementsCommission": [
      {
        "organeRef": "PO419865",
        "amendable": true
      }
    ]
  }
}