{
  "xsiType": "documentEtudeImpact_Type",
  "uid": "ETDIANR5L15B0659",
  "legislature": "15",
  "cycleDeVie": {
    "chrono": {
      "dateCreation": "2018-02-08T00:00:00.000+01:00",
      "dateDepot": "2018-02-08T00:00:00.000+01:00",
      "datePublication": "2018-02-19T00:00:00.000+01:00",
      "datePublicationWeb": "2018-02-12T18:35:00.000+01:00"
    }
  },
  "denominationStructurelle": "Projet de loi",
  "provenance": "Texte Déposé",
  "titres": {
    "titrePrincipal": "Etude d'impact sur le projet de loi relatif à la programmation militaire pour les années 2019 à 2025 et portant diverses dispositions intéressant la défense",
    "titrePrincipalCourt": "Programmation militaire pour les années 2019 à 2025"
  },
  "dossierRef": "DLR5L15N36362",
  "classification": {
    "famille": {
      "depot": {
        "code": "INITDEP",
        "libelle": "Initiative en 1er Dépôt"
      },
      "classe": {
        "code": "PRJLOI",
        "libelle": "Projet de loi"
      }
    },
    "type": {
      "code": "ETDI",
      "libelle": "Etude d'impact"
    }
  },
  "auteurs": [
    {
      "acteur": {
        "acteurRef": "PA345619",
        "qualite": "auteur"
      }
    }
  ],
  "notice": {
    "numNotice": "659",
    "formule": "relatif à la programmation militaire pour les années 2019 à 2025 et portant diverses dispositions intéressant la défense",
    "adoptionConforme": false
  }
}