{
  "xsiType": "DossierMissionControle_Type",
  "uid": "DLR5L15N36801",
  "legislature": "15",
  "titreDossier": {
    "titre": "Budget : application des mesures fiscales",
    "titreChemin": "application_mesures_fiscales_rap-info"
  },
  "procedureParlementaire": {
    "code": "19",
    "libelle": "Rapport d'information sans mission"
  },
  "actesLegislatifs": [
    {
      "xsiType": "Etape_Type",
      "uid": "L15-AN20-36801",
      "codeActe": "AN20",
      "libelleActe": {
        "nomCanonique": "Travaux"
      },
      "organeRef": "PO717460",
      "actesLegislatifs": [
        {
          "xsiType": "DepotRapport_Type",
          "uid": "L15-VD186468",
          "codeActe": "AN20-RAPPORT",
          "libelleActe": {
            "nomCanonique": "Dépôt de rapport",
            "libelleCourt": "Dépôt de rapport"
          },
          "organeRef": "PO59048",
          "dateActe": "2018-07-18T00:00:00.000+02:00",
          "texteAssocieRef": "RINFANR5L15B1172"
        }
      ]
    }
  ]
}