{
  "xsiType": "texteLoi_Type",
  "uid": "PIONANR5L15B1659",
  "legislature": "15",
  "cycleDeVie": {
    "chrono": {
      "dateCreation": "2019-02-01T00:00:00.000+01:00",
      "dateDepot": "2019-02-06T00:00:00.000+01:00",
      "datePublication": "2019-02-13T00:00:00.000+01:00",
      "datePublicationWeb": "2019-02-07T19:00:00.000+01:00"
    }
  },
  "denominationStructurelle": "Proposition de loi",
  "provenance": "Texte Déposé",
  "titres": {
    "titrePrincipal": "proposition de loi en faveur d'une immigration réellement choisie",
    "titrePrincipalCourt": "immigration réellement choisie"
  },
  "dossierRef": "DLR5L15N37205",
  "classification": {
    "famille": {
      "depot": {
        "code": "INITDEP",
        "libelle": "Initiative en 1er Dépôt"
      },
      "classe": {
        "code": "PIONLOI",
        "libelle": "Proposition de loi"
      }
    },
    "type": {
      "code": "PION",
      "libelle": "Proposition de loi"
    }
  },
  "auteurs": [
    {
      "acteur": {
        "acteurRef": "PA720684",
        "qualite": "auteur"
      }
    }
  ],
  "notice": {
    "numNotice": "1659",
    "formule": "en faveur d'une immigration réellement choisie",
    "adoptionConforme": false
  },
  "coSignataires": [
    {
      "acteurRef": "PA605036",
      "dateCosignature": "2019-02-06+01:00",
      "edite": false
    },
    {
      "acteurRef": "PA336316",
      "dateCosignature": "2019-02-06+01:00",
      "edite": false
    },
    {
      "acteurRef": "PA767",
      "dateCosignature": "2019-02-06+01:00",
      "edite": false
    },
    {
      "acteurRef": "PA330240",
      "dateCosignature": "2019-02-06+01:00",
      "edite": false
    },
    {
      "acteurRef": "PA720386",
      "dateCosignature": "2019-02-06+01:00",
      "edite": false
    },
    {
      "acteurRef": "PA334149",
      "dateCosignature": "2019-02-06+01:00",
      "edite": false
    },
    {
      "acteurRef": "PA266774",
      "dateCosignature": "2019-02-06+01:00",
      "edite": false
    },
    {
      "acteurRef": "PA1630",
      "dateCosignature": "2019-02-06+01:00",
      "edite": false
    },
    {
      "acteurRef": "PA608416",
      "dateCosignature": "2019-02-06+01:00",
      "edite": false
    },
    {
      "acteurRef": "PA267901",
      "dateCosignature": "2019-02-06+01:00",
      "edite": false
    },
    {
      "acteurRef": "PA609245",
      "dateCosignature": "2019-02-06+01:00",
      "edite": false
    },
    {
      "acteurRef": "PA345722",
      "dateCosignature": "2019-02-06+01:00",
      "edite": false
    },
    {
      "acteurRef": "PA608016",
      "dateCosignature": "2019-02-06+01:00",
      "edite": false
    },
    {
      "acteurRef": "PA606098",
      "dateCosignature": "2019-02-06+01:00",
      "edite": false
    },
    {
      "acteurRef": "PA721636",
      "dateCosignature": "2019-02-06+01:00",
      "edite": false
    },
    {
      "acteurRef": "PA719946",
      "dateCosignature": "2019-02-06+01:00",
      "edite": false
    },
    {
      "acteurRef": "PA2492",
      "dateCosignature": "2019-02-06+01:00",
      "edite": false
    },
    {
      "acteurRef": "PA721286",
      "dateCosignature": "2019-02-06+01:00",
      "edite": false
    },
    {
      "acteurRef": "PA2529",
      "dateCosignature": "2019-02-06+01:00",
      "edite": false
    },
    {
      "acteurRef": "PA721314",
      "dateCosignature": "2019-02-06+01:00",
      "edite": false
    },
    {
      "acteurRef": "PA334654",
      "dateCosignature": "2019-02-06+01:00",
      "edite": false
    },
    {
      "acteurRef": "PA718780",
      "dateCosignature": "2019-02-06+01:00",
      "edite": false
    },
    {
      "acteurRef": "PA643134",
      "dateCosignature": "2019-02-06+01:00",
      "edite": false
    },
    {
      "acteurRef": "PA2960",
      "dateCosignature": "2019-02-18+01:00",
      "edite": false
    },
    {
      "acteurRef": "PA267260",
      "dateCosignature": "2019-02-18+01:00",
      "edite": false
    }
  ],
  "depotAmendements": {
    "amendementsSeance": {
      "amendable": false
    },
    "amendementsCommission": [
      {
        "organeRef": "PO59051",
        "amendable": true
      }
    ]
  }
}