{
  "xsiType": "texteLoi_Type",
  "uid": "RINFANR5L15B2185",
  "legislature": "15",
  "cycleDeVie": {
    "chrono": {
      "dateCreation": "2019-07-23T00:00:00.000+02:00",
      "dateDepot": "2019-07-23T00:00:00.000+02:00",
      "datePublicationWeb": "2019-07-24T14:00:00.000+02:00"
    }
  },
  "denominationStructurelle": "Rapport d'information",
  "provenance": "Commission",
  "titres": {
    "titrePrincipal": "rapport d'information déposé par la délégation de l'Assemblée nationale aux droits des femmes et à l'égalité des chances entre les hommes et les femmes sur l'activité de la Délégation aux droits des femmes de juillet 2018 à juillet 2019",
    "titrePrincipalCourt": "rapport d'information déposé par la délégation de l'Assemblée nationale aux droits des femmes et à l'égalité des chances entre les hommes et les femmes sur l'activité de la Délégation aux droits des femmes de juillet 2018 à juillet 2019"
  },
  "dossierRef": "DLR5L15N37669",
  "classification": {
    "famille": {
      "depot": {
        "code": "RAPAUT",
        "libelle": "Rapport autonome"
      },
      "classe": {
        "code": "RAPINF",
        "libelle": "Rapport d'information"
      },
      "espece": {
        "code": "PRPDIT",
        "libelle": "tel quel"
      }
    },
    "type": {
      "code": "RINF",
      "libelle": "Rapport d'information"
    },
    "sousType": {
      "code": "PRPDIT",
      "libelle": "tel quel"
    }
  },
  "auteurs": [
    {
      "acteur": {
        "acteurRef": "PA722252",
        "qualite": "rapporteur"
      }
    },
    {
      "organeRef": "PO201269"
    }
  ],
  "notice": {
    "numNotice": "2185",
    "formule": "déposé par la délégation de l'Assemblée nationale aux droits des femmes et à l'égalité des chances entre les hommes et les femmes sur l'activité de la Délégation aux droits des femmes de juillet 2018 à juillet 2019",
    "adoptionConforme": false
  },
  "imprimerie": {
    "prix": "3.5"
  }
}