{
  "xsiType": "DossierLegislatif_Type",
  "uid": "DLR5L15N36481",
  "legislature": "15",
  "titreDossier": {
    "titre": "Défense : protection du monde combattant",
    "titreChemin": "protection_monde_combattant"
  },
  "procedureParlementaire": {
    "code": "2",
    "libelle": "Proposition de loi ordinaire"
  },
  "initiateur": {
    "acteurs": [
      {
        "acteurRef": "PA721932",
        "mandatRef": "PM734586"
      }
    ]
  },
  "actesLegislatifs": [
    {
      "xsiType": "Etape_Type",
      "uid": "L15-AN1-36481",
      "codeActe": "AN1",
      "libelleActe": {
        "nomCanonique": "1ère lecture (1ère assemblée saisie)",
        "libelleCourt": "1ère lecture"
      },
      "organeRef": "PO717460",
      "actesLegislatifs": [
        {
          "xsiType": "DepotInitiative_Type",
          "uid": "L15-VD184975DI",
          "codeActe": "AN1-DEPOT",
          "libelleActe": {
            "nomCanonique": "1er dépôt d'une initiative.",
            "libelleCourt": "1er dépôt d'une initiative."
          },
          "organeRef": "PO717460",
          "dateActe": "2018-03-21T00:00:00.000+01:00",
          "texteAssocieRef": "PIONANR5L15B0791"
        },
        {
          "xsiType": "Etape_Type",
          "uid": "L15-AN1-COM-36481",
          "codeActe": "AN1-COM",
          "libelleActe": {
            "nomCanonique": "Travaux des commissions",
            "libelleCourt": "Travaux des commissions"
          },
          "organeRef": "PO717460",
          "actesLegislatifs": [
            {
              "xsiType": "Etape_Type",
              "uid": "L15-VD184976CF",
              "codeActe": "AN1-COM-FOND",
              "libelleActe": {
                "nomCanonique": "Travaux de la commission saisie au fond",
                "libelleCourt": "Travaux de la commission saisie au fond"
              },
              "organeRef": "PO59046",
              "actesLegislatifs": [
                {
                  "xsiType": "SaisieComFond_Type",
                  "uid": "L15-VD184976CFS",
                  "codeActe": "AN1-COM-FOND-SAISIE",
                  "libelleActe": {
                    "nomCanonique": "Renvoi en commission au fond",
                    "libelleCourt": "Renvoi en commission au fond"
                  },
                  "organeRef": "PO59046",
                  "dateActe": "2018-03-21T00:00:00.000+01:00"
                }
              ]
            }
          ]
        }
      ]
    }
  ]
}