{
  "xsiType": "texteLoi_Type",
  "uid": "PIONSNR5S319B0175",
  "cycleDeVie": {
    "chrono": {
      "dateCreation": "2019-01-03T00:00:00.000+01:00",
      "dateDepot": "2018-12-04T00:00:00.000+01:00",
      "datePublication": "2019-01-22T00:00:00.000+01:00"
    }
  },
  "denominationStructurelle": "Proposition de loi",
  "provenance": "Texte Déposé",
  "titres": {
    "titrePrincipal": "proposition de loi relative aux articles 91 et 121 de la loi portant évolution du logement, de l'aménagement et du numérique",
    "titrePrincipalCourt": "Articles 91 et 121 de la loi ELAN"
  },
  "dossierRef": "DLR5L15N37122",
  "classification": {
    "famille": {
      "depot": {
        "code": "INITDEP",
        "libelle": "Initiative en 1er Dépôt"
      },
      "classe": {
        "code": "PIONLOI",
        "libelle": "Proposition de loi"
      }
    },
    "type": {
      "code": "PION",
      "libelle": "Proposition de loi"
    }
  },
  "auteurs": [
    {
      "acteur": {
        "acteurRef": "PA429842",
        "qualite": "auteur"
      }
    }
  ],
  "notice": {
    "numNotice": "175",
    "formule": "relative aux articles 91 et 121 de la loi portant évolution du logement, de l'aménagement et du numérique",
    "adoptionConforme": false
  },
  "coSignataires": [
    {
      "acteurRef": "PA736247",
      "dateCosignature": "2018-12-04+01:00",
      "edite": false
    },
    {
      "acteurRef": "PA744079",
      "dateCosignature": "2018-12-04+01:00",
      "edite": false
    },
    {
      "acteurRef": "PA736188",
      "dateCosignature": "2018-12-04+01:00",
      "edite": false
    },
    {
      "acteurRef": "PA736202",
      "dateCosignature": "2018-12-04+01:00",
      "edite": false
    },
    {
      "acteurRef": "PA736163",
      "dateCosignature": "2018-12-04+01:00",
      "edite": false
    },
    {
      "acteurRef": "PA528",
      "dateCosignature": "2018-12-04+01:00",
      "edite": false
    },
    {
      "acteurRef": "PA736198",
      "dateCosignature": "2018-12-04+01:00",
      "edite": false
    },
    {
      "acteurRef": "PA703522",
      "dateCosignature": "2018-12-04+01:00",
      "edite": false
    },
    {
      "acteurRef": "PA342665",
      "dateCosignature": "2018-12-04+01:00",
      "edite": false
    },
    {
      "acteurRef": "PA736176",
      "dateCosignature": "2018-12-04+01:00",
      "edite": false
    },
    {
      "acteurRef": "PA703500",
      "dateCosignature": "2018-12-04+01:00",
      "edite": false
    },
    {
      "acteurRef": "PA736216",
      "dateCosignature": "2018-12-04+01:00",
      "edite": false
    },
    {
      "acteurRef": "PA415456",
      "dateCosignature": "2018-12-04+01:00",
      "edite": false
    },
    {
      "acteurRef": "PA303997",
      "dateCosignature": "2018-12-04+01:00",
      "edite": false
    },
    {
      "acteurRef": "PA716",
      "dateCosignature": "2018-12-04+01:00",
      "edite": false
    },
    {
      "acteurRef": "PA703510",
      "dateCosignature": "2018-12-04+01:00",
      "edite": false
    },
    {
      "acteurRef": "PA429870",
      "dateCosignature": "2018-12-04+01:00",
      "edite": false
    },
    {
      "acteurRef": "PA709750",
      "dateCosignature": "2018-12-04+01:00",
      "edite": false
    },
    {
      "acteurRef": "PA703513",
      "dateCosignature": "2018-12-04+01:00",
      "edite": false
    },
    {
      "acteurRef": "PA415462",
      "dateCosignature": "2018-12-04+01:00",
      "edite": false
    },
    {
      "acteurRef": "PA736172",
      "dateCosignature": "2018-12-04+01:00",
      "edite": false
    },
    {
      "acteurRef": "PA736197",
      "dateCosignature": "2018-12-04+01:00",
      "edite": false
    },
    {
      "acteurRef": "PA720634",
      "dateCosignature": "2018-12-04+01:00",
      "edite": false
    },
    {
      "acteurRef": "PA715745",
      "dateCosignature": "2018-12-04+01:00",
      "edite": false
    },
    {
      "acteurRef": "PA980",
      "dateCosignature": "2018-12-04+01:00",
      "edite": false
    },
    {
      "acteurRef": "PA736192",
      "dateCosignature": "2018-12-04+01:00",
      "edite": false
    },
    {
      "acteurRef": "PA1001",
      "dateCosignature": "2018-12-04+01:00",
      "edite": false
    },
    {
      "acteurRef": "PA703503",
      "dateCosignature": "2018-12-04+01:00",
      "edite": false
    },
    {
      "acteurRef": "PA267762",
      "dateCosignature": "2018-12-04+01:00",
      "edite": false
    },
    {
      "acteurRef": "PA425322",
      "dateCosignature": "2018-12-04+01:00",
      "edite": false
    },
    {
      "acteurRef": "PA703539",
      "dateCosignature": "2018-12-04+01:00",
      "edite": false
    },
    {
      "acteurRef": "PA267112",
      "dateCosignature": "2018-12-04+01:00",
      "edite": false
    },
    {
      "acteurRef": "PA703494",
      "dateCosignature": "2018-12-04+01:00",
      "edite": false
    },
    {
      "acteurRef": "PA304062",
      "dateCosignature": "2018-12-04+01:00",
      "edite": false
    },
    {
      "acteurRef": "PA404656",
      "dateCosignature": "2018-12-04+01:00",
      "edite": false
    },
    {
      "acteurRef": "PA736218",
      "dateCosignature": "2018-12-04+01:00",
      "edite": false
    },
    {
      "acteurRef": "PA703506",
      "dateCosignature": "2018-12-04+01:00",
      "edite": false
    },
    {
      "acteurRef": "PA703520",
      "dateCosignature": "2018-12-04+01:00",
      "edite": false
    },
    {
      "acteurRef": "PA736169",
      "dateCosignature": "2018-12-04+01:00",
      "edite": false
    },
    {
      "acteurRef": "PA227029",
      "dateCosignature": "2018-12-04+01:00",
      "edite": false
    },
    {
      "acteurRef": "PA1344",
      "dateCosignature": "2018-12-04+01:00",
      "edite": false
    },
    {
      "acteurRef": "PA304108",
      "dateCosignature": "2018-12-04+01:00",
      "edite": false
    },
    {
      "acteurRef": "PA703530",
      "dateCosignature": "2018-12-04+01:00",
      "edite": false
    },
    {
      "acteurRef": "PA267081",
      "dateCosignature": "2018-12-04+01:00",
      "edite": false
    },
    {
      "acteurRef": "PA429875",
      "dateCosignature": "2018-12-04+01:00",
      "edite": false
    },
    {
      "acteurRef": "PA703515",
      "dateCosignature": "2018-12-04+01:00",
      "edite": false
    },
    {
      "acteurRef": "PA736232",
      "dateCosignature": "2018-12-04+01:00",
      "edite": false
    },
    {
      "acteurRef": "PA703488",
      "dateCosignature": "2018-12-04+01:00",
      "edite": false
    },
    {
      "acteurRef": "PA304000",
      "dateCosignature": "2018-12-04+01:00",
      "edite": false
    },
    {
      "acteurRef": "PA736246",
      "dateCosignature": "2018-12-04+01:00",
      "edite": false
    },
    {
      "acteurRef": "PA736211",
      "dateCosignature": "2018-12-04+01:00",
      "edite": false
    },
    {
      "acteurRef": "PA415447",
      "dateCosignature": "2018-12-04+01:00",
      "edite": false
    },
    {
      "acteurRef": "PA267795",
      "dateCosignature": "2018-12-04+01:00",
      "edite": false
    },
    {
      "acteurRef": "PA736213",
      "dateCosignature": "2018-12-04+01:00",
      "edite": false
    },
    {
      "acteurRef": "PA227089",
      "dateCosignature": "2018-12-04+01:00",
      "edite": false
    },
    {
      "acteurRef": "PA703523",
      "dateCosignature": "2018-12-04+01:00",
      "edite": false
    },
    {
      "acteurRef": "PA1993",
      "dateCosignature": "2018-12-04+01:00",
      "edite": false
    },
    {
      "acteurRef": "PA736226",
      "dateCosignature": "2018-12-04+01:00",
      "edite": false
    },
    {
      "acteurRef": "PA415455",
      "dateCosignature": "2018-12-04+01:00",
      "edite": false
    },
    {
      "acteurRef": "PA415489",
      "dateCosignature": "2018-12-04+01:00",
      "edite": false
    },
    {
      "acteurRef": "PA736224",
      "dateCosignature": "2018-12-04+01:00",
      "edite": false
    },
    {
      "acteurRef": "PA736194",
      "dateCosignature": "2018-12-04+01:00",
      "edite": false
    },
    {
      "acteurRef": "PA703517",
      "dateCosignature": "2018-12-04+01:00",
      "edite": false
    },
    {
      "acteurRef": "PA2197",
      "dateCosignature": "2018-12-04+01:00",
      "edite": false
    },
    {
      "acteurRef": "PA736183",
      "dateCosignature": "2018-12-04+01:00",
      "edite": false
    },
    {
      "acteurRef": "PA705750",
      "dateCosignature": "2018-12-04+01:00",
      "edite": false
    },
    {
      "acteurRef": "PA703518",
      "dateCosignature": "2018-12-04+01:00",
      "edite": false
    },
    {
      "acteurRef": "PA758716",
      "dateCosignature": "2018-12-04+01:00",
      "edite": false
    },
    {
      "acteurRef": "PA703541",
      "dateCosignature": "2018-12-04+01:00",
      "edite": false
    },
    {
      "acteurRef": "PA267872",
      "dateCosignature": "2018-12-04+01:00",
      "edite": false
    },
    {
      "acteurRef": "PA267328",
      "dateCosignature": "2018-12-04+01:00",
      "edite": false
    },
    {
      "acteurRef": "PA736200",
      "dateCosignature": "2018-12-04+01:00",
      "edite": false
    },
    {
      "acteurRef": "PA2447",
      "dateCosignature": "2018-12-04+01:00",
      "edite": false
    },
    {
      "acteurRef": "PA267728",
      "dateCosignature": "2018-12-04+01:00",
      "edite": false
    },
    {
      "acteurRef": "PA304086",
      "dateCosignature": "2018-12-04+01:00",
      "edite": false
    },
    {
      "acteurRef": "PA736239",
      "dateCosignature": "2018-12-04+01:00",
      "edite": false
    },
    {
      "acteurRef": "PA267018",
      "dateCosignature": "2018-12-04+01:00",
      "edite": false
    },
    {
      "acteurRef": "PA426327",
      "dateCosignature": "2018-12-04+01:00",
      "edite": false
    },
    {
      "acteurRef": "PA2538",
      "dateCosignature": "2018-12-04+01:00",
      "edite": false
    },
    {
      "acteurRef": "PA429851",
      "dateCosignature": "2018-12-04+01:00",
      "edite": false
    },
    {
      "acteurRef": "PA429874",
      "dateCosignature": "2018-12-04+01:00",
      "edite": false
    },
    {
      "acteurRef": "PA301592",
      "dateCosignature": "2018-12-04+01:00",
      "edite": false
    },
    {
      "acteurRef": "PA736207",
      "dateCosignature": "2018-12-04+01:00",
      "edite": false
    },
    {
      "acteurRef": "PA345785",
      "dateCosignature": "2018-12-04+01:00",
      "edite": false
    },
    {
      "acteurRef": "PA703482",
      "dateCosignature": "2018-12-04+01:00",
      "edite": false
    },
    {
      "acteurRef": "PA703527",
      "dateCosignature": "2018-12-04+01:00",
      "edite": false
    }
  ],
  "depotAmendements": {
    "amendementsSeance": {
      "amendable": false
    }
  }
}