{
  "xsiType": "texteLoi_Type",
  "uid": "PRJLANR5L15B0811",
  "legislature": "15",
  "cycleDeVie": {
    "chrono": {
      "dateCreation": "2018-03-22T00:00:00.000+01:00",
      "dateDepot": "2018-03-22T00:00:00.000+01:00",
      "datePublication": "2018-03-30T00:00:00.000+02:00",
      "datePublicationWeb": "2018-03-27T10:05:00.000+02:00"
    }
  },
  "denominationStructurelle": "Projet de loi",
  "provenance": "Texte Déposé",
  "titres": {
    "titrePrincipal": "projet de loi autorisant la ratification de l'accord instituant la Fondation internationale UE-ALC",
    "titrePrincipalCourt": "Ratification de l'accord instituant la Fondation internationale UE-ALC"
  },
  "dossierRef": "DLR5L15N36319",
  "classification": {
    "famille": {
      "depot": {
        "code": "INITNAV",
        "libelle": "Initiative en Navette"
      },
      "classe": {
        "code": "PRJLOI",
        "libelle": "Projet de loi"
      },
      "espece": {
        "code": "AUTRATCONV",
        "libelle": "autorisant la ratification d'une convention"
      }
    },
    "type": {
      "code": "PRJL",
      "libelle": "Projet de loi"
    },
    "sousType": {
      "code": "AUTRATCONV",
      "libelle": "autorisant la ratification d'une convention",
      "libelleEdition": "autorisant la ratification d'une convention"
    }
  },
  "auteurs": [
    {
      "organeRef": "PO717460"
    }
  ],
  "notice": {
    "numNotice": "811",
    "formule": ", adopté par le Sénat, autorisant la ratification de l'accord instituant la Fondation internationale UE-ALC",
    "adoptionConforme": false
  },
  "depotAmendements": {
    "amendementsSeance": {
      "amendable": true
    },
    "amendementsCommission": [
      {
        "organeRef": "PO59047",
        "amendable": true
      }
    ]
  }
}