{
  "xsiType": "avisConseilEtat_Type",
  "uid": "AVCEANR5L15B2412",
  "legislature": "15",
  "cycleDeVie": {
    "chrono": {
      "dateCreation": "2019-11-13T00:00:00.000+01:00",
      "dateDepot": "2019-11-13T00:00:00.000+01:00",
      "datePublication": "2019-11-21T00:00:00.000+01:00",
      "datePublicationWeb": "2019-11-15T16:20:00.000+01:00"
    }
  },
  "denominationStructurelle": "Projet de loi",
  "provenance": "Texte Déposé",
  "titres": {
    "titrePrincipal": "Avis du Conseil d'Etat sur le projet de loi ratifiant diverses ordonnances prévues par la loi n° 2018-771 du 5 septembre 2018 pour la liberté de choisir son avenir professionnel et portant diverses mesures d’ordre social",
    "titrePrincipalCourt": "Ratification de diverses ordonnances prévues par la loi \"Avenir professionnel\""
  },
  "dossierRef": "DLR5L15N37956",
  "classification": {
    "famille": {
      "depot": {
        "code": "INITDEP",
        "libelle": "Initiative en 1er Dépôt"
      },
      "classe": {
        "code": "PRJLOI",
        "libelle": "Projet de loi"
      }
    },
    "type": {
      "code": "AVCE",
      "libelle": "Avis du Conseil d'Etat"
    }
  },
  "auteurs": [
    {
      "acteur": {
        "acteurRef": "PA345619",
        "qualite": "auteur"
      }
    }
  ],
  "notice": {
    "numNotice": "2412",
    "formule": "ratifiant diverses ordonnances prévues par la loi n° 2018-771 du 5 septembre 2018 pour la liberté de choisir son avenir professionnel et portant diverses mesures d’ordre social",
    "adoptionConforme": false
  },
  "imprimerie": {
    "nbPage": "0"
  }
}