{
  "xsiType": "texteLoi_Type",
  "uid": "AVISSNR5S279B0642",
  "cycleDeVie": {
    "chrono": {
      "dateCreation": "2017-07-20T00:00:00.000+02:00",
      "dateDepot": "2017-07-18T00:00:00.000+02:00"
    }
  },
  "denominationStructurelle": "Avis",
  "provenance": "Commission",
  "titres": {
    "titrePrincipal": "avis  sur le projet de loi, adopté, par l'Assemblée nationale après engagement de la procédure accélérée, d'habilitation à prendre par ordonnances les mesures pour le renforcement du dialogue social (n°637).",
    "titrePrincipalCourt": "avis  sur le projet de loi, adopté, par l'Assemblée nationale après engagement de la procédure accélérée, d'habilitation à prendre par ordonnances les mesures pour le renforcement du dialogue social (n°637)."
  },
  "dossierRef": "DLR5L15N35836",
  "classification": {
    "famille": {
      "depot": {
        "code": "RAPINIT",
        "libelle": "Rapport sur une initiative"
      },
      "classe": {
        "code": "AVIS",
        "libelle": "Avis"
      }
    },
    "type": {
      "code": "AVIS",
      "libelle": "Avis"
    }
  },
  "auteurs": [
    {
      "acteur": {
        "acteurRef": "PA415448",
        "qualite": "rapporteur pour avis"
      }
    },
    {
      "organeRef": "PO211494"
    }
  ],
  "notice": {
    "numNotice": "642",
    "formule": "sur le projet de loi, adopté, par l'Assemblée nationale après engagement de la procédure accélérée, d'habilitation à prendre par ordonnances les mesures pour le renforcement du dialogue social (n°637).",
    "adoptionConforme": false
  }
}