{
  "xsiType": "texteLoi_Type",
  "uid": "PIONANR5L15B1642",
  "legislature": "15",
  "cycleDeVie": {
    "chrono": {
      "dateCreation": "2019-01-24T00:00:00.000+01:00",
      "dateDepot": "2019-02-06T00:00:00.000+01:00",
      "datePublication": "2019-02-13T00:00:00.000+01:00",
      "datePublicationWeb": "2019-02-08T14:00:00.000+01:00"
    }
  },
  "denominationStructurelle": "Proposition de loi",
  "provenance": "Texte Déposé",
  "titres": {
    "titrePrincipal": "proposition de loi visant à restaurer l'universalité des allocations familiales et à revenir sur la diminution de l'avantage maximal en impôt résultant de l'application du quotient familial",
    "titrePrincipalCourt": "restaurer universalité allocations familiales revenir application quotient familial"
  },
  "dossierRef": "DLR5L15N37182",
  "classification": {
    "famille": {
      "depot": {
        "code": "INITDEP",
        "libelle": "Initiative en 1er Dépôt"
      },
      "classe": {
        "code": "PIONLOI",
        "libelle": "Proposition de loi"
      }
    },
    "type": {
      "code": "PION",
      "libelle": "Proposition de loi"
    }
  },
  "auteurs": [
    {
      "acteur": {
        "acteurRef": "PA718838",
        "qualite": "auteur"
      }
    }
  ],
  "notice": {
    "numNotice": "1642",
    "formule": "visant à restaurer l'universalité des allocations familiales et à revenir sur la diminution de l'avantage maximal en impôt résultant de l'application du quotient familial",
    "adoptionConforme": false
  },
  "coSignataires": [
    {
      "acteurRef": "PA605036",
      "dateCosignature": "2019-02-06+01:00",
      "edite": false
    },
    {
      "acteurRef": "PA609726",
      "dateCosignature": "2019-02-06+01:00",
      "edite": false
    },
    {
      "acteurRef": "PA721046",
      "dateCosignature": "2019-02-06+01:00",
      "edite": false
    },
    {
      "acteurRef": "PA642847",
      "dateCosignature": "2019-02-06+01:00",
      "edite": false
    },
    {
      "acteurRef": "PA720210",
      "dateCosignature": "2019-02-06+01:00",
      "edite": false
    },
    {
      "acteurRef": "PA330684",
      "dateCosignature": "2019-02-06+01:00",
      "edite": false
    },
    {
      "acteurRef": "PA718850",
      "dateCosignature": "2019-02-06+01:00",
      "edite": false
    },
    {
      "acteurRef": "PA332523",
      "dateCosignature": "2019-02-06+01:00",
      "edite": false
    },
    {
      "acteurRef": "PA330909",
      "dateCosignature": "2019-02-06+01:00",
      "edite": false
    },
    {
      "acteurRef": "PA334149",
      "dateCosignature": "2019-02-06+01:00",
      "edite": false
    },
    {
      "acteurRef": "PA267735",
      "dateCosignature": "2019-02-06+01:00",
      "edite": false
    },
    {
      "acteurRef": "PA605991",
      "dateCosignature": "2019-02-06+01:00",
      "edite": false
    },
    {
      "acteurRef": "PA1630",
      "dateCosignature": "2019-02-06+01:00",
      "edite": false
    },
    {
      "acteurRef": "PA721506",
      "dateCosignature": "2019-02-06+01:00",
      "edite": false
    },
    {
      "acteurRef": "PA609245",
      "dateCosignature": "2019-02-06+01:00",
      "edite": false
    },
    {
      "acteurRef": "PA1874",
      "dateCosignature": "2019-02-06+01:00",
      "edite": false
    },
    {
      "acteurRef": "PA345722",
      "dateCosignature": "2019-02-06+01:00",
      "edite": false
    },
    {
      "acteurRef": "PA267378",
      "dateCosignature": "2019-02-06+01:00",
      "edite": false
    },
    {
      "acteurRef": "PA718784",
      "dateCosignature": "2019-02-06+01:00",
      "edite": false
    },
    {
      "acteurRef": "PA267260",
      "dateCosignature": "2019-02-06+01:00",
      "edite": false
    },
    {
      "acteurRef": "PA721070",
      "dateCosignature": "2019-02-06+01:00",
      "edite": false
    },
    {
      "acteurRef": "PA266808",
      "dateCosignature": "2019-02-06+01:00",
      "edite": false
    },
    {
      "acteurRef": "PA267527",
      "dateCosignature": "2019-02-06+01:00",
      "edite": false
    },
    {
      "acteurRef": "PA721314",
      "dateCosignature": "2019-02-06+01:00",
      "edite": false
    },
    {
      "acteurRef": "PA267204",
      "dateCosignature": "2019-02-06+01:00",
      "edite": false
    },
    {
      "acteurRef": "PA334654",
      "dateCosignature": "2019-02-06+01:00",
      "edite": false
    },
    {
      "acteurRef": "PA267794",
      "dateCosignature": "2019-02-06+01:00",
      "edite": false
    },
    {
      "acteurRef": "PA607090",
      "dateCosignature": "2019-02-06+01:00",
      "edite": false
    },
    {
      "acteurRef": "PA1327",
      "dateCosignature": "2019-02-11+01:00",
      "edite": false
    }
  ],
  "depotAmendements": {
    "amendementsSeance": {
      "amendable": false
    },
    "amendementsCommission": [
      {
        "organeRef": "PO420120",
        "amendable": true
      }
    ]
  }
}