{
  "xsiType": "texteLoi_Type",
  "uid": "PIONSNR5S339BTC0117",
  "cycleDeVie": {
    "chrono": {
      "dateCreation": "2019-11-14T00:00:00.000+01:00",
      "dateDepot": "2019-11-13T00:00:00.000+01:00",
      "datePublicationWeb": "2019-11-13T14:00:00.000+01:00"
    }
  },
  "denominationStructurelle": "Proposition de loi",
  "provenance": "Texte Déposé",
  "titres": {
    "titrePrincipal": "proposition de loi sur la proposition de loi de MM. Philippe Mouiller, Alain Milon, Bruno Retailleau et plusieurs de leurs collègues tendant à instituer une carte Vitale biométrique (517).",
    "titrePrincipalCourt": "Carte Vitale biométrique"
  },
  "dossierRef": "DLR5L15N37897",
  "classification": {
    "famille": {
      "depot": {
        "code": "INITDEP",
        "libelle": "Initiative en 1er Dépôt"
      },
      "classe": {
        "code": "PIONLOI",
        "libelle": "Proposition de loi"
      }
    },
    "type": {
      "code": "PION",
      "libelle": "Proposition de loi"
    }
  },
  "auteurs": [
    {
      "acteur": {
        "acteurRef": "PA425322",
        "qualite": "rapporteur"
      }
    },
    {
      "organeRef": "PO211493"
    }
  ],
  "notice": {
    "numNotice": "117",
    "formule": "sur la proposition de loi de MM. Philippe Mouiller, Alain Milon, Bruno Retailleau et plusieurs de leurs collègues tendant à instituer une carte Vitale biométrique (517).",
    "adoptionConforme": false
  },
  "imprimerie": {
    "nbPage": "0"
  },
  "depotAmendements": {
    "amendementsSeance": {
      "amendable": false
    }
  }
}