{
  "xsiType": "rapportParlementaire_Type",
  "uid": "RAPPANR5L15B1869",
  "legislature": "15",
  "cycleDeVie": {
    "chrono": {
      "dateCreation": "2019-04-11T00:00:00.000+02:00",
      "dateDepot": "2019-04-11T00:00:00.000+02:00"
    }
  },
  "denominationStructurelle": "Rapport",
  "provenance": "Commission",
  "titres": {
    "titrePrincipal": "rapport relatif à l'activité de la délégation parlementaire au renseignement pour l'année 2018",
    "titrePrincipalCourt": "Activité de la délégation parlementaire au renseignement pour l'année 2018"
  },
  "divisions": [
    {
      "xsiType": "rapportParlementaire_Type",
      "uid": "RAPPANR5L15B1869-t1",
      "legislature": "15",
      "cycleDeVie": {
        "chrono": {
          "dateCreation": "2019-04-11T00:00:00.000+02:00",
          "dateDepot": "2019-04-11T00:00:00.000+02:00",
          "datePublicationWeb": "2019-09-03T19:45:00.000+02:00"
        }
      },
      "denominationStructurelle": "Tome 1",
      "titres": {
        "titrePrincipal": "Activité de la délégation parlementaire au renseignement pour l’année 2018",
        "titrePrincipalCourt": "Activité de la délégation parlementaire au renseignement pour l'année 2018"
      },
      "dossierRef": "DLR5L15N37403",
      "classification": {
        "type": {
          "code": "RAPP",
          "libelle": "Rapport"
        },
        "sousType": {
          "code": "OFFPARL",
          "libelle": "des offices parlementaires",
          "libelleEdition": "des offices parlementaires"
        }
      },
      "auteurs": [
        {
          "acteur": {
            "acteurRef": "PA721908",
            "qualite": "rapporteur"
          }
        },
        {
          "organeRef": "PO402232"
        }
      ],
      "notice": {
        "numNotice": "1869",
        "formule": "relatif à l'activité de la délégation parlementaire au renseignement pour l'année 2018",
        "adoptionConforme": false
      }
    },
    {
      "xsiType": "rapportParlementaire_Type",
      "uid": "RAPPANR5L15B1869-t2",
      "legislature": "15",
      "cycleDeVie": {
        "chrono": {
          "dateCreation": "2019-04-11T00:00:00.000+02:00",
          "dateDepot": "2019-04-11T00:00:00.000+02:00",
          "datePublicationWeb": "2019-09-03T19:45:00.000+02:00"
        }
      },
      "denominationStructurelle": "Tome 2",
      "titres": {
        "titrePrincipal": "Actes du colloque du 10e anniversaire de la Délégation parlementaire au renseignement – 22 novembre 2018 – Hôtel de Lassay : 10 ans de contrôle parlementaire du renseignement : l’exigence démocratique est-elle satisfaite ?",
        "titrePrincipalCourt": "Activité de la délégation parlementaire au renseignement pour l'année 2018"
      },
      "dossierRef": "DLR5L15N37403",
      "classification": {
        "type": {
          "code": "RAPP",
          "libelle": "Rapport"
        },
        "sousType": {
          "code": "OFFPARL",
          "libelle": "des offices parlementaires",
          "libelleEdition": "des offices parlementaires"
        }
      },
      "auteurs": [
        {
          "acteur": {
            "acteurRef": "PA721908",
            "qualite": "rapporteur"
          }
        },
        {
          "organeRef": "PO402232"
        }
      ],
      "notice": {
        "numNotice": "1869",
        "formule": "relatif à l'activité de la délégation parlementaire au renseignement pour l'année 2018",
        "adoptionConforme": false
      }
    }
  ],
  "dossierRef": "DLR5L15N37403",
  "classification": {
    "famille": {
      "depot": {
        "code": "RAPAUT",
        "libelle": "Rapport autonome"
      },
      "classe": {
        "code": "RAPPORT",
        "libelle": "Rapport"
      },
      "espece": {
        "code": "OFFPARL",
        "libelle": "des offices parlementaires ou délégations mixtes"
      }
    },
    "type": {
      "code": "RAPP",
      "libelle": "Rapport"
    },
    "sousType": {
      "code": "OFFPARL",
      "libelle": "des offices parlementaires",
      "libelleEdition": "des offices parlementaires"
    }
  },
  "auteurs": [
    {
      "acteur": {
        "acteurRef": "PA721908",
        "qualite": "rapporteur"
      }
    },
    {
      "organeRef": "PO402232"
    }
  ],
  "notice": {
    "numNotice": "1869",
    "formule": "relatif à l'activité de la délégation parlementaire au renseignement pour l'année 2018",
    "adoptionConforme": false
  }
}