{
  "@xmlns": "http://schemas.assemblee-nationale.fr/referentiel",
  "@xmlns:xsi": "http://www.w3.org/2001/XMLSchema-instance",
  "@xsi:type": "rapportParlementaire_Type",
  "uid": "RAPPSNR5S339B0085",
  "legislature": null,
  "cycleDeVie": {
    "chrono": {
      "dateCreation": "2019-10-24T00:00:00.000+02:00",
      "dateDepot": "2019-10-23T00:00:00.000+02:00",
      "datePublication": null,
      "datePublicationWeb": null
    }
  },
  "denominationStructurelle": "Rapport",
  "provenance": "Commission",
  "titres": {
    "titrePrincipal": "rapport , en nouvelle lecture, sur le projet de loi, adopté, par l'Assemblée nationale, en nouvelle lecture, d'orientation des mobilités (n°730).",
    "titrePrincipalCourt": "rapport , en nouvelle lecture, sur le projet de loi, adopté, par l'Assemblée nationale, en nouvelle lecture, d'orientation des mobilités (n°730)."
  },
  "divisions": null,
  "dossierRef": "DLR5L15N37029",
  "redacteur": null,
  "classification": {
    "famille": {
      "depot": {
        "code": "RAPINIT",
        "libelle": "Rapport sur une initiative"
      },
      "classe": {
        "code": "RAPPORT",
        "libelle": "Rapport"
      }
    },
    "type": {
      "code": "RAPP",
      "libelle": "Rapport"
    },
    "sousType": null,
    "statutAdoption": null
  },
  "auteurs": {
    "auteur": [
      {
        "acteur": {
          "acteurRef": "PA703497",
          "qualite": "rapporteur"
        }
      },
      {
        "acteur": {
          "acteurRef": "PA703497",
          "qualite": "rapporteur"
        }
      },
      {
        "organe": {
          "organeRef": "PO516754"
        }
      }
    ]
  },
  "correction": null,
  "notice": {
    "numNotice": "85",
    "formule": ", en nouvelle lecture, sur le projet de loi, adopté, par l'Assemblée nationale, en nouvelle lecture, d'orientation des mobilités (n°730).",
    "adoptionConforme": "false"
  },
  "indexation": null,
  "imprimerie": {
    "prix": null,
    "ISSN": null,
    "ISBN": null,
    "DIAN": null,
    "nbPage": "0"
  }
}