{
  "@xmlns": "http://schemas.assemblee-nationale.fr/referentiel",
  "@xmlns:xsi": "http://www.w3.org/2001/XMLSchema-instance",
  "@xsi:type": "DossierLegislatif_Type",
  "uid": "DLR5L15N36084",
  "legislature": "15",
  "titreDossier": {
    "titre": "Prise en compte de l'ancienneté dans les contrats de travail saisonniers",
    "titreChemin": "ratification_ordonnance_2017-647",
    "senatChemin": null
  },
  "procedureParlementaire": {
    "code": "1",
    "libelle": "Projet de loi ordinaire"
  },
  "initiateur": {
    "acteurs": {
      "acteur": [
        {
          "acteurRef": "PA345619",
          "mandatRef": "PM725692"
        },
        {
          "acteurRef": "PA717169",
          "mandatRef": "PM730074"
        }
      ]
    }
  },
  "actesLegislatifs": {
    "acteLegislatif": {
      "@xsi:type": "Etape_Type",
      "uid": "L15-AN1-36084",
      "codeActe": "AN1",
      "libelleActe": {
        "nomCanonique": "1ère lecture (1ère assemblée saisie)",
        "libelleCourt": "1ère lecture"
      },
      "organeRef": "PO717460",
      "dateActe": null,
      "actesLegislatifs": {
        "acteLegislatif": [
          {
            "@xsi:type": "DepotInitiative_Type",
            "uid": "L15-VD183181DI",
            "codeActe": "AN1-DEPOT",
            "libelleActe": {
              "nomCanonique": "1er dépôt d'une initiative.",
              "libelleCourt": "1er dépôt d'une initiative."
            },
            "organeRef": "PO717460",
            "dateActe": "2017-10-25T00:00:00.000+02:00",
            "actesLegislatifs": null,
            "texteAssocie": "PRJLANR5L15B0336"
          },
          {
            "@xsi:type": "DepotAvisConseilEtat_Type",
            "uid": "L15-VD183181AVCE",
            "codeActe": "AN1-AVCE",
            "libelleActe": {
              "nomCanonique": "Avis du Conseil d'Etat",
              "libelleCourt": "Avis du Conseil d'Etat"
            },
            "organeRef": "PO717460",
            "dateActe": "2017-10-25T00:00:00.000+02:00",
            "actesLegislatifs": null,
            "texteAssocie": "AVCEANR5L15B0336"
          },
          {
            "@xsi:type": "Etape_Type",
            "uid": "L15-AN1-COM-36084",
            "codeActe": "AN1-COM",
            "libelleActe": {
              "nomCanonique": "Travaux des commissions",
              "libelleCourt": "Travaux des commissions"
            },
            "organeRef": "PO717460",
            "dateActe": null,
            "actesLegislatifs": {
              "acteLegislatif": {
                "@xsi:type": "Etape_Type",
                "uid": "L15-VD183182CF",
                "codeActe": "AN1-COM-FOND",
                "libelleActe": {
                  "nomCanonique": "Travaux de la commission saisie au fond",
                  "libelleCourt": "Travaux de la commission saisie au fond"
                },
                "organeRef": "PO420120",
                "dateActe": null,
                "actesLegislatifs": {
                  "acteLegislatif": {
                    "@xsi:type": "SaisieComFond_Type",
                    "uid": "L15-VD183182CFS",
                    "codeActe": "AN1-COM-FOND-SAISIE",
                    "libelleActe": {
                      "nomCanonique": "Renvoi en commission au fond",
                      "libelleCourt": "Renvoi en commission au fond"
                    },
                    "organeRef": "PO420120",
                    "dateActe": "2017-10-25T00:00:00.000+02:00",
                    "actesLegislatifs": null
                  }
                }
              }
            }
          }
        ]
      }
    }
  },
  "fusionDossier": null
}