{
  "@xmlns": "http://schemas.assemblee-nationale.fr/referentiel",
  "@xmlns:xsi": "http://www.w3.org/2001/XMLSchema-instance",
  "@xsi:type": "texteLoi_Type",
  "uid": "PRJLSNR5S319B0732",
  "legislature": null,
  "cycleDeVie": {
    "chrono": {
      "dateCreation": "2019-10-04T00:00:00.000+02:00",
      "dateDepot": "2019-09-19T00:00:00.000+02:00",
      "datePublication": null,
      "datePublicationWeb": null
    }
  },
  "denominationStructurelle": "Projet de loi",
  "provenance": "Texte Déposé",
  "titres": {
    "titrePrincipal": "projet de loi autorisant l'approbation de l'accord entre le Gouvernement de la République française et le Gouvernement de la République fédérale démocratique d'Éthiopie relatif aux services aériens, de l'accord entre le Gouvernement de la République française et le Gouvernement de la République du Costa Rica relatif aux services aériens et de l'accord relatif aux services aériens entre le Gouvernement de la République française et le Gouvernement de la République du Mozambique",
    "titrePrincipalCourt": "Accords Éthiopie Costa Rica et Mozambique relatifs aux services aériens"
  },
  "divisions": null,
  "dossierRef": "DLR5L15N36802",
  "redacteur": null,
  "classification": {
    "famille": {
      "depot": {
        "code": "INITNAV",
        "libelle": "Initiative en Navette"
      },
      "classe": {
        "code": "PRJLOI",
        "libelle": "Projet de loi"
      },
      "espece": {
        "code": "AUTRATCONV",
        "libelle": "autorisant la ratification d'une convention"
      }
    },
    "type": {
      "code": "PRJL",
      "libelle": "Projet de loi"
    },
    "sousType": {
      "code": "AUTRATCONV",
      "libelle": "autorisant la ratification d'une convention",
      "libelleEdition": "autorisant la ratification d'une convention"
    },
    "statutAdoption": null
  },
  "auteurs": {
    "auteur": {
      "organe": {
        "organeRef": "PO78718"
      }
    }
  },
  "correction": null,
  "notice": {
    "numNotice": "732",
    "formule": ", adopté, par l'Assemblée nationale, autorisant l'approbation de l'accord entre le Gouvernement de la République française et le Gouvernement de la République fédérale démocratique d'Éthiopie relatif aux services aériens, de l'accord entre le Gouvernement de la République française et le Gouvernement de la République du Costa Rica relatif aux services aériens et de l'accord relatif aux services aériens entre le Gouvernement de la République française et le Gouvernement de la République du Mozambique",
    "adoptionConforme": "false"
  },
  "indexation": null,
  "imprimerie": {
    "prix": null,
    "ISSN": null,
    "ISBN": null,
    "DIAN": null,
    "nbPage": null
  },
  "coSignataires": null,
  "depotAmendements": {
    "amendementsSeance": {
      "amendable": "false",
      "dateLimiteDepot": null
    }
  }
}