{
  "@xmlns": "http://schemas.assemblee-nationale.fr/referentiel",
  "@xmlns:xsi": "http://www.w3.org/2001/XMLSchema-instance",
  "@xsi:type": "rapportParlementaire_Type",
  "uid": "RAPPSNR5S299B0372",
  "legislature": null,
  "cycleDeVie": {
    "chrono": {
      "dateCreation": "2018-03-22T00:00:00.000+01:00",
      "dateDepot": "2018-03-21T00:00:00.000+01:00",
      "datePublication": null,
      "datePublicationWeb": null
    }
  },
  "denominationStructurelle": "Rapport",
  "provenance": "Commission",
  "titres": {
    "titrePrincipal": "rapport sur la proposition de loi de MM. Philippe Bas, François-Noël Buffet, Mmes Maryse Carrère, Françoise Gatel, Marie Mercier et plusieurs de leurs collègues d'orientation et de programmation pour une meilleure protection des mineurs victimes d'infractions sexuelles (293).",
    "titrePrincipalCourt": "rapport sur la proposition de loi de MM. Philippe Bas, François-Noël Buffet, Mmes Maryse Carrère, Françoise Gatel, Marie Mercier et plusieurs de leurs collègues d'orientation et de programmation pour une meilleure protection des mineurs victimes d'infractions sexuelles (293)."
  },
  "divisions": null,
  "dossierRef": "DLR5L15N36453",
  "redacteur": null,
  "classification": {
    "famille": {
      "depot": {
        "code": "RAPINIT",
        "libelle": "Rapport sur une initiative"
      },
      "classe": {
        "code": "RAPPORT",
        "libelle": "Rapport"
      }
    },
    "type": {
      "code": "RAPP",
      "libelle": "Rapport"
    },
    "sousType": null,
    "statutAdoption": null
  },
  "auteurs": {
    "auteur": [
      {
        "acteur": {
          "acteurRef": "PA708632",
          "qualite": "rapporteur"
        }
      },
      {
        "organe": {
          "organeRef": "PO211495"
        }
      }
    ]
  },
  "correction": null,
  "notice": {
    "numNotice": "372",
    "formule": "sur la proposition de loi de MM. Philippe Bas, François-Noël Buffet, Mmes Maryse Carrère, Françoise Gatel, Marie Mercier et plusieurs de leurs collègues d'orientation et de programmation pour une meilleure protection des mineurs victimes d'infractions sexuelles (293).",
    "adoptionConforme": "false"
  },
  "indexation": null,
  "imprimerie": null
}