{
  "@xmlns": "http://schemas.assemblee-nationale.fr/referentiel",
  "@xmlns:xsi": "http://www.w3.org/2001/XMLSchema-instance",
  "@xsi:type": "texteLoi_Type",
  "uid": "PRJLSNR5S299BTC0263",
  "legislature": null,
  "cycleDeVie": {
    "chrono": {
      "dateCreation": "2018-02-08T00:00:00.000+01:00",
      "dateDepot": "2018-01-31T00:00:00.000+01:00",
      "datePublication": null,
      "datePublicationWeb": "2018-01-31T14:00:00.000+01:00"
    }
  },
  "denominationStructurelle": "Projet de loi",
  "provenance": "Texte Déposé",
  "titres": {
    "titrePrincipal": "projet de loi  de la commission des lois constitutionnelles, de législation, du suffrage universel, du Règlement et d'administration générale.",
    "titrePrincipalCourt": "Organisation Jeux Olympiques et Paralympiques de 2024"
  },
  "divisions": null,
  "dossierRef": "DLR5L15N36130",
  "redacteur": null,
  "classification": {
    "famille": {
      "depot": {
        "code": "INITNAV",
        "libelle": "Initiative en Navette"
      },
      "classe": {
        "code": "PRJLOI",
        "libelle": "Projet de loi"
      }
    },
    "type": {
      "code": "PRJL",
      "libelle": "Projet de loi"
    },
    "sousType": null,
    "statutAdoption": null
  },
  "auteurs": {
    "auteur": [
      {
        "acteur": {
          "acteurRef": "PA736205",
          "qualite": "rapporteur"
        }
      },
      {
        "organe": {
          "organeRef": "PO211495"
        }
      }
    ]
  },
  "correction": null,
  "notice": {
    "numNotice": "263",
    "formule": "de la commission des lois constitutionnelles, de législation, du suffrage universel, du Règlement et d'administration générale.",
    "adoptionConforme": "false"
  },
  "indexation": null,
  "imprimerie": null,
  "coSignataires": null,
  "depotAmendements": {
    "amendementsSeance": {
      "amendable": "false",
      "dateLimiteDepot": null
    }
  }
}