{
  "@xmlns": "http://schemas.assemblee-nationale.fr/referentiel",
  "@xmlns:xsi": "http://www.w3.org/2001/XMLSchema-instance",
  "@xsi:type": "texteLoi_Type",
  "uid": "PIONSNR5S319BTC0076",
  "legislature": null,
  "cycleDeVie": {
    "chrono": {
      "dateCreation": "2018-11-02T00:00:00.000+01:00",
      "dateDepot": "2018-10-24T00:00:00.000+02:00",
      "datePublication": null,
      "datePublicationWeb": "2018-10-24T14:00:00.000+02:00"
    }
  },
  "denominationStructurelle": "Proposition de loi",
  "provenance": "Texte Déposé",
  "titres": {
    "titrePrincipal": "proposition de loi , en nouvelle lecture, sur la proposition de loi, adoptée, par l'Assemblée nationale, en nouvelle lecture, relative à la lutte contre la manipulation de l'information (n°30).",
    "titrePrincipalCourt": "Manipulation de l'information"
  },
  "divisions": null,
  "dossierRef": "DLR5L15N36488",
  "redacteur": null,
  "classification": {
    "famille": {
      "depot": {
        "code": "INITNAV",
        "libelle": "Initiative en Navette"
      },
      "classe": {
        "code": "PIONLOI",
        "libelle": "Proposition de loi"
      }
    },
    "type": {
      "code": "PION",
      "libelle": "Proposition de loi"
    },
    "sousType": null,
    "statutAdoption": null
  },
  "auteurs": {
    "auteur": [
      {
        "acteur": {
          "acteurRef": "PA304017",
          "qualite": "rapporteur"
        }
      },
      {
        "organe": {
          "organeRef": "PO211490"
        }
      }
    ]
  },
  "correction": null,
  "notice": {
    "numNotice": "76",
    "formule": ", en nouvelle lecture, sur la proposition de loi, adoptée, par l'Assemblée nationale, en nouvelle lecture, relative à la lutte contre la manipulation de l'information (n°30).",
    "adoptionConforme": "false"
  },
  "indexation": null,
  "imprimerie": null,
  "coSignataires": null,
  "depotAmendements": {
    "amendementsSeance": {
      "amendable": "false",
      "dateLimiteDepot": null
    }
  }
}