{
  "@xmlns": "http://schemas.assemblee-nationale.fr/referentiel",
  "@xmlns:xsi": "http://www.w3.org/2001/XMLSchema-instance",
  "@xsi:type": "DossierLegislatif_Type",
  "uid": "DLR5L15N36650",
  "legislature": "15",
  "titreDossier": {
    "titre": "Sécurité sociale : objectifs régionaux de dépenses d'assurance maladie (ORDAM)",
    "titreChemin": "objectifs_regionaux_depenses_assurance_maladie",
    "senatChemin": null
  },
  "procedureParlementaire": {
    "code": "5",
    "libelle": "Projet ou proposition de loi organique"
  },
  "initiateur": {
    "acteurs": {
      "acteur": {
        "acteurRef": "PA721286",
        "mandatRef": "PM723224"
      }
    }
  },
  "actesLegislatifs": {
    "acteLegislatif": {
      "@xsi:type": "Etape_Type",
      "uid": "L15-AN1-36650",
      "codeActe": "AN1",
      "libelleActe": {
        "nomCanonique": "1ère lecture (1ère assemblée saisie)",
        "libelleCourt": "1ère lecture"
      },
      "organeRef": "PO717460",
      "dateActe": null,
      "actesLegislatifs": {
        "acteLegislatif": [
          {
            "@xsi:type": "DepotInitiative_Type",
            "uid": "L15-VD185626DI",
            "codeActe": "AN1-DEPOT",
            "libelleActe": {
              "nomCanonique": "1er dépôt d'une initiative.",
              "libelleCourt": "1er dépôt d'une initiative."
            },
            "organeRef": "PO717460",
            "dateActe": "2018-05-25T00:00:00.000+02:00",
            "actesLegislatifs": null,
            "texteAssocie": "PIONANR5L15B0985"
          },
          {
            "@xsi:type": "Etape_Type",
            "uid": "L15-AN1-COM-36650",
            "codeActe": "AN1-COM",
            "libelleActe": {
              "nomCanonique": "Travaux des commissions",
              "libelleCourt": "Travaux des commissions"
            },
            "organeRef": "PO717460",
            "dateActe": null,
            "actesLegislatifs": {
              "acteLegislatif": {
                "@xsi:type": "Etape_Type",
                "uid": "L15-VD185627CF",
                "codeActe": "AN1-COM-FOND",
                "libelleActe": {
                  "nomCanonique": "Travaux de la commission saisie au fond",
                  "libelleCourt": "Travaux de la commission saisie au fond"
                },
                "organeRef": "PO59051",
                "dateActe": null,
                "actesLegislatifs": {
                  "acteLegislatif": {
                    "@xsi:type": "SaisieComFond_Type",
                    "uid": "L15-VD185627CFS",
                    "codeActe": "AN1-COM-FOND-SAISIE",
                    "libelleActe": {
                      "nomCanonique": "Renvoi en commission au fond",
                      "libelleCourt": "Renvoi en commission au fond"
                    },
                    "organeRef": "PO59051",
                    "dateActe": "2018-05-25T00:00:00.000+02:00",
                    "actesLegislatifs": null
                  }
                }
              }
            }
          }
        ]
      }
    }
  },
  "fusionDossier": null
}