{
  "@xmlns": "http://schemas.assemblee-nationale.fr/referentiel",
  "@xmlns:xsi": "http://www.w3.org/2001/XMLSchema-instance",
  "@xsi:type": "texteLoi_Type",
  "uid": "PIONANR5L15B1655",
  "legislature": "15",
  "cycleDeVie": {
    "chrono": {
      "dateCreation": "2019-01-31T00:00:00.000+01:00",
      "dateDepot": "2019-02-06T00:00:00.000+01:00",
      "datePublication": "2019-02-14T00:00:00.000+01:00",
      "datePublicationWeb": "2019-02-08T17:00:00.000+01:00"
    }
  },
  "denominationStructurelle": "Proposition de loi",
  "provenance": "Texte Déposé",
  "titres": {
    "titrePrincipal": "proposition de loi visant à intégrer les logements d'urgence dans le quota des logements sociaux",
    "titrePrincipalCourt": "intégrer les logements d'urgence dans le quota des logements sociaux"
  },
  "divisions": null,
  "dossierRef": "DLR5L15N37198",
  "redacteur": null,
  "classification": {
    "famille": {
      "depot": {
        "code": "INITDEP",
        "libelle": "Initiative en 1er Dépôt"
      },
      "classe": {
        "code": "PIONLOI",
        "libelle": "Proposition de loi"
      }
    },
    "type": {
      "code": "PION",
      "libelle": "Proposition de loi"
    },
    "sousType": null,
    "statutAdoption": null
  },
  "auteurs": {
    "auteur": {
      "acteur": {
        "acteurRef": "PA330788",
        "qualite": "auteur"
      }
    }
  },
  "correction": null,
  "notice": {
    "numNotice": "1655",
    "formule": "visant à intégrer les logements d'urgence dans le quota des logements sociaux",
    "adoptionConforme": "false"
  },
  "indexation": null,
  "imprimerie": null,
  "coSignataires": {
    "coSignataire": [
      {
        "acteur": {
          "acteurRef": "PA608016"
        },
        "dateCosignature": "2019-02-06+01:00",
        "dateRetraitCosignature": null,
        "edite": "false"
      },
      {
        "acteur": {
          "acteurRef": "PA2377"
        },
        "dateCosignature": "2019-02-06+01:00",
        "dateRetraitCosignature": null,
        "edite": "false"
      },
      {
        "acteur": {
          "acteurRef": "PA721410"
        },
        "dateCosignature": "2019-02-06+01:00",
        "dateRetraitCosignature": null,
        "edite": "false"
      },
      {
        "acteur": {
          "acteurRef": "PA642847"
        },
        "dateCosignature": "2019-02-06+01:00",
        "dateRetraitCosignature": null,
        "edite": "false"
      },
      {
        "acteur": {
          "acteurRef": "PA721286"
        },
        "dateCosignature": "2019-02-06+01:00",
        "dateRetraitCosignature": null,
        "edite": "false"
      },
      {
        "acteur": {
          "acteurRef": "PA721816"
        },
        "dateCosignature": "2019-02-06+01:00",
        "dateRetraitCosignature": null,
        "edite": "false"
      },
      {
        "acteur": {
          "acteurRef": "PA330240"
        },
        "dateCosignature": "2019-02-06+01:00",
        "dateRetraitCosignature": null,
        "edite": "false"
      },
      {
        "acteur": {
          "acteurRef": "PA334149"
        },
        "dateCosignature": "2019-02-06+01:00",
        "dateRetraitCosignature": null,
        "edite": "false"
      },
      {
        "acteur": {
          "acteurRef": "PA608416"
        },
        "dateCosignature": "2019-02-06+01:00",
        "dateRetraitCosignature": null,
        "edite": "false"
      },
      {
        "acteur": {
          "acteurRef": "PA1012"
        },
        "dateCosignature": "2019-02-06+01:00",
        "dateRetraitCosignature": null,
        "edite": "false"
      },
      {
        "acteur": {
          "acteurRef": "PA267260"
        },
        "dateCosignature": "2019-02-06+01:00",
        "dateRetraitCosignature": null,
        "edite": "false"
      },
      {
        "acteur": {
          "acteurRef": "PA2960"
        },
        "dateCosignature": "2019-02-06+01:00",
        "dateRetraitCosignature": null,
        "edite": "false"
      },
      {
        "acteur": {
          "acteurRef": "PA721070"
        },
        "dateCosignature": "2019-02-06+01:00",
        "dateRetraitCosignature": null,
        "edite": "false"
      },
      {
        "acteur": {
          "acteurRef": "PA609245"
        },
        "dateCosignature": "2019-02-06+01:00",
        "dateRetraitCosignature": null,
        "edite": "false"
      },
      {
        "acteur": {
          "acteurRef": "PA267450"
        },
        "dateCosignature": "2019-02-06+01:00",
        "dateRetraitCosignature": null,
        "edite": "false"
      },
      {
        "acteur": {
          "acteurRef": "PA2492"
        },
        "dateCosignature": "2019-02-06+01:00",
        "dateRetraitCosignature": null,
        "edite": "false"
      },
      {
        "acteur": {
          "acteurRef": "PA266808"
        },
        "dateCosignature": "2019-02-06+01:00",
        "dateRetraitCosignature": null,
        "edite": "false"
      },
      {
        "acteur": {
          "acteurRef": "PA1327"
        },
        "dateCosignature": "2019-02-06+01:00",
        "dateRetraitCosignature": null,
        "edite": "false"
      },
      {
        "acteur": {
          "acteurRef": "PA720586"
        },
        "dateCosignature": "2019-02-06+01:00",
        "dateRetraitCosignature": null,
        "edite": "false"
      },
      {
        "acteur": {
          "acteurRef": "PA267289"
        },
        "dateCosignature": "2019-02-06+01:00",
        "dateRetraitCosignature": null,
        "edite": "false"
      },
      {
        "acteur": {
          "acteurRef": "PA718884"
        },
        "dateCosignature": "2019-02-06+01:00",
        "dateRetraitCosignature": null,
        "edite": "false"
      },
      {
        "acteur": {
          "acteurRef": "PA720386"
        },
        "dateCosignature": "2019-02-06+01:00",
        "dateRetraitCosignature": null,
        "edite": "false"
      },
      {
        "acteur": {
          "acteurRef": "PA342935"
        },
        "dateCosignature": "2019-02-06+01:00",
        "dateRetraitCosignature": null,
        "edite": "false"
      },
      {
        "acteur": {
          "acteurRef": "PA267204"
        },
        "dateCosignature": "2019-02-06+01:00",
        "dateRetraitCosignature": null,
        "edite": "false"
      },
      {
        "acteur": {
          "acteurRef": "PA721054"
        },
        "dateCosignature": "2019-02-06+01:00",
        "dateRetraitCosignature": null,
        "edite": "false"
      },
      {
        "acteur": {
          "acteurRef": "PA718838"
        },
        "dateCosignature": "2019-02-06+01:00",
        "dateRetraitCosignature": null,
        "edite": "false"
      },
      {
        "acteur": {
          "acteurRef": "PA721506"
        },
        "dateCosignature": "2019-02-06+01:00",
        "dateRetraitCosignature": null,
        "edite": "false"
      },
      {
        "acteur": {
          "acteurRef": "PA605036"
        },
        "dateCosignature": "2019-02-06+01:00",
        "dateRetraitCosignature": null,
        "edite": "false"
      },
      {
        "acteur": {
          "acteurRef": "PA267378"
        },
        "dateCosignature": "2019-02-06+01:00",
        "dateRetraitCosignature": null,
        "edite": "false"
      },
      {
        "acteur": {
          "acteurRef": "PA721046"
        },
        "dateCosignature": "2019-02-06+01:00",
        "dateRetraitCosignature": null,
        "edite": "false"
      },
      {
        "acteur": {
          "acteurRef": "PA223837"
        },
        "dateCosignature": "2019-02-06+01:00",
        "dateRetraitCosignature": null,
        "edite": "false"
      },
      {
        "acteur": {
          "acteurRef": "PA767"
        },
        "dateCosignature": "2019-02-06+01:00",
        "dateRetraitCosignature": null,
        "edite": "false"
      },
      {
        "acteur": {
          "acteurRef": "PA334654"
        },
        "dateCosignature": "2019-02-06+01:00",
        "dateRetraitCosignature": null,
        "edite": "false"
      },
      {
        "acteur": {
          "acteurRef": "PA718784"
        },
        "dateCosignature": "2019-02-06+01:00",
        "dateRetraitCosignature": null,
        "edite": "false"
      },
      {
        "acteur": {
          "acteurRef": "PA1630"
        },
        "dateCosignature": "2019-02-06+01:00",
        "dateRetraitCosignature": null,
        "edite": "false"
      },
      {
        "acteur": {
          "acteurRef": "PA266774"
        },
        "dateCosignature": "2019-02-06+01:00",
        "dateRetraitCosignature": null,
        "edite": "false"
      },
      {
        "acteur": {
          "acteurRef": "PA1874"
        },
        "dateCosignature": "2019-02-06+01:00",
        "dateRetraitCosignature": null,
        "edite": "false"
      },
      {
        "acteur": {
          "acteurRef": "PA721314"
        },
        "dateCosignature": "2019-02-06+01:00",
        "dateRetraitCosignature": null,
        "edite": "false"
      },
      {
        "acteur": {
          "acteurRef": "PA606712"
        },
        "dateCosignature": "2019-02-06+01:00",
        "dateRetraitCosignature": null,
        "edite": "false"
      },
      {
        "acteur": {
          "acteurRef": "PA267527"
        },
        "dateCosignature": "2019-02-06+01:00",
        "dateRetraitCosignature": null,
        "edite": "false"
      },
      {
        "acteur": {
          "acteurRef": "PA609726"
        },
        "dateCosignature": "2019-02-06+01:00",
        "dateRetraitCosignature": null,
        "edite": "false"
      },
      {
        "acteur": {
          "acteurRef": "PA605991"
        },
        "dateCosignature": "2019-02-06+01:00",
        "dateRetraitCosignature": null,
        "edite": "false"
      }
    ]
  },
  "depotAmendements": {
    "amendementsSeance": {
      "amendable": "false",
      "dateLimiteDepot": null
    },
    "amendementsCommission": {
      "commission": {
        "organeRef": "PO419610",
        "amendable": "true",
        "dateLimiteDepot": null
      }
    }
  }
}