{
  "@xmlns": "http://schemas.assemblee-nationale.fr/referentiel",
  "@xmlns:xsi": "http://www.w3.org/2001/XMLSchema-instance",
  "@xsi:type": "texteLoi_Type",
  "uid": "PIONANR5L15B1998",
  "legislature": "15",
  "cycleDeVie": {
    "chrono": {
      "dateCreation": "2019-05-31T00:00:00.000+02:00",
      "dateDepot": "2019-06-05T00:00:00.000+02:00",
      "datePublication": "2019-06-14T00:00:00.000+02:00",
      "datePublicationWeb": "2019-06-07T12:00:00.000+02:00"
    }
  },
  "denominationStructurelle": "Proposition de loi",
  "provenance": "Texte Déposé",
  "titres": {
    "titrePrincipal": "proposition de loi visant à plafonner la rémunération des présidents des autorités administratives indépendantes",
    "titrePrincipalCourt": "plafonnement rémunération présidents AAI"
  },
  "divisions": null,
  "dossierRef": "DLR5L15N37509",
  "redacteur": null,
  "classification": {
    "famille": {
      "depot": {
        "code": "INITDEP",
        "libelle": "Initiative en 1er Dépôt"
      },
      "classe": {
        "code": "PIONLOI",
        "libelle": "Proposition de loi"
      }
    },
    "type": {
      "code": "PION",
      "libelle": "Proposition de loi"
    },
    "sousType": null,
    "statutAdoption": null
  },
  "auteurs": {
    "auteur": {
      "acteur": {
        "acteurRef": "PA334843",
        "qualite": "auteur"
      }
    }
  },
  "correction": null,
  "notice": {
    "numNotice": "1998",
    "formule": "visant à plafonner la rémunération des présidents des autorités administratives indépendantes",
    "adoptionConforme": "false"
  },
  "indexation": null,
  "imprimerie": null,
  "coSignataires": {
    "coSignataire": [
      {
        "acteur": {
          "acteurRef": "PA605036"
        },
        "dateCosignature": "2019-06-05+02:00",
        "dateRetraitCosignature": null,
        "edite": "false"
      },
      {
        "acteur": {
          "acteurRef": "PA719318"
        },
        "dateCosignature": "2019-06-05+02:00",
        "dateRetraitCosignature": null,
        "edite": "false"
      },
      {
        "acteur": {
          "acteurRef": "PA609726"
        },
        "dateCosignature": "2019-06-05+02:00",
        "dateRetraitCosignature": null,
        "edite": "false"
      },
      {
        "acteur": {
          "acteurRef": "PA721046"
        },
        "dateCosignature": "2019-06-05+02:00",
        "dateRetraitCosignature": null,
        "edite": "false"
      },
      {
        "acteur": {
          "acteurRef": "PA718884"
        },
        "dateCosignature": "2019-06-05+02:00",
        "dateRetraitCosignature": null,
        "edite": "false"
      },
      {
        "acteur": {
          "acteurRef": "PA720210"
        },
        "dateCosignature": "2019-06-05+02:00",
        "dateRetraitCosignature": null,
        "edite": "false"
      },
      {
        "acteur": {
          "acteurRef": "PA721410"
        },
        "dateCosignature": "2019-06-05+02:00",
        "dateRetraitCosignature": null,
        "edite": "false"
      },
      {
        "acteur": {
          "acteurRef": "PA721816"
        },
        "dateCosignature": "2019-06-05+02:00",
        "dateRetraitCosignature": null,
        "edite": "false"
      },
      {
        "acteur": {
          "acteurRef": "PA336316"
        },
        "dateCosignature": "2019-06-05+02:00",
        "dateRetraitCosignature": null,
        "edite": "false"
      },
      {
        "acteur": {
          "acteurRef": "PA713448"
        },
        "dateCosignature": "2019-06-05+02:00",
        "dateRetraitCosignature": null,
        "edite": "false"
      },
      {
        "acteur": {
          "acteurRef": "PA718838"
        },
        "dateCosignature": "2019-06-05+02:00",
        "dateRetraitCosignature": null,
        "edite": "false"
      },
      {
        "acteur": {
          "acteurRef": "PA267450"
        },
        "dateCosignature": "2019-06-05+02:00",
        "dateRetraitCosignature": null,
        "edite": "false"
      },
      {
        "acteur": {
          "acteurRef": "PA720386"
        },
        "dateCosignature": "2019-06-05+02:00",
        "dateRetraitCosignature": null,
        "edite": "false"
      },
      {
        "acteur": {
          "acteurRef": "PA608826"
        },
        "dateCosignature": "2019-06-05+02:00",
        "dateRetraitCosignature": null,
        "edite": "false"
      },
      {
        "acteur": {
          "acteurRef": "PA266774"
        },
        "dateCosignature": "2019-06-05+02:00",
        "dateRetraitCosignature": null,
        "edite": "false"
      },
      {
        "acteur": {
          "acteurRef": "PA267735"
        },
        "dateCosignature": "2019-06-05+02:00",
        "dateRetraitCosignature": null,
        "edite": "false"
      },
      {
        "acteur": {
          "acteurRef": "PA267318"
        },
        "dateCosignature": "2019-06-05+02:00",
        "dateRetraitCosignature": null,
        "edite": "false"
      },
      {
        "acteur": {
          "acteurRef": "PA609245"
        },
        "dateCosignature": "2019-06-05+02:00",
        "dateRetraitCosignature": null,
        "edite": "false"
      },
      {
        "acteur": {
          "acteurRef": "PA340853"
        },
        "dateCosignature": "2019-06-05+02:00",
        "dateRetraitCosignature": null,
        "edite": "false"
      },
      {
        "acteur": {
          "acteurRef": "PA608016"
        },
        "dateCosignature": "2019-06-05+02:00",
        "dateRetraitCosignature": null,
        "edite": "false"
      },
      {
        "acteur": {
          "acteurRef": "PA721636"
        },
        "dateCosignature": "2019-06-05+02:00",
        "dateRetraitCosignature": null,
        "edite": "false"
      },
      {
        "acteur": {
          "acteurRef": "PA718784"
        },
        "dateCosignature": "2019-06-05+02:00",
        "dateRetraitCosignature": null,
        "edite": "false"
      },
      {
        "acteur": {
          "acteurRef": "PA719946"
        },
        "dateCosignature": "2019-06-05+02:00",
        "dateRetraitCosignature": null,
        "edite": "false"
      },
      {
        "acteur": {
          "acteurRef": "PA2377"
        },
        "dateCosignature": "2019-06-05+02:00",
        "dateRetraitCosignature": null,
        "edite": "false"
      },
      {
        "acteur": {
          "acteurRef": "PA267260"
        },
        "dateCosignature": "2019-06-05+02:00",
        "dateRetraitCosignature": null,
        "edite": "false"
      },
      {
        "acteur": {
          "acteurRef": "PA721678"
        },
        "dateCosignature": "2019-06-05+02:00",
        "dateRetraitCosignature": null,
        "edite": "false"
      },
      {
        "acteur": {
          "acteurRef": "PA266776"
        },
        "dateCosignature": "2019-06-05+02:00",
        "dateRetraitCosignature": null,
        "edite": "false"
      },
      {
        "acteur": {
          "acteurRef": "PA721314"
        },
        "dateCosignature": "2019-06-05+02:00",
        "dateRetraitCosignature": null,
        "edite": "false"
      },
      {
        "acteur": {
          "acteurRef": "PA267204"
        },
        "dateCosignature": "2019-06-05+02:00",
        "dateRetraitCosignature": null,
        "edite": "false"
      },
      {
        "acteur": {
          "acteurRef": "PA334654"
        },
        "dateCosignature": "2019-06-05+02:00",
        "dateRetraitCosignature": null,
        "edite": "false"
      },
      {
        "acteur": {
          "acteurRef": "PA718780"
        },
        "dateCosignature": "2019-06-05+02:00",
        "dateRetraitCosignature": null,
        "edite": "false"
      },
      {
        "acteur": {
          "acteurRef": "PA643134"
        },
        "dateCosignature": "2019-06-05+02:00",
        "dateRetraitCosignature": null,
        "edite": "false"
      },
      {
        "acteur": {
          "acteurRef": "PA709315"
        },
        "dateCosignature": "2019-06-05+02:00",
        "dateRetraitCosignature": null,
        "edite": "false"
      },
      {
        "acteur": {
          "acteurRef": "PA721474"
        },
        "dateCosignature": "2019-06-05+02:00",
        "dateRetraitCosignature": null,
        "edite": "false"
      },
      {
        "acteur": {
          "acteurRef": "PA720586"
        },
        "dateCosignature": "2019-07-22+02:00",
        "dateRetraitCosignature": null,
        "edite": "false"
      },
      {
        "acteur": {
          "acteurRef": "PA642847"
        },
        "dateCosignature": "2019-07-23+02:00",
        "dateRetraitCosignature": null,
        "edite": "false"
      },
      {
        "acteur": {
          "acteurRef": "PA345722"
        },
        "dateCosignature": "2019-07-29+02:00",
        "dateRetraitCosignature": null,
        "edite": "false"
      },
      {
        "acteur": {
          "acteurRef": "PA1874"
        },
        "dateCosignature": "2019-09-10+02:00",
        "dateRetraitCosignature": null,
        "edite": "false"
      }
    ]
  },
  "depotAmendements": {
    "amendementsSeance": {
      "amendable": "false",
      "dateLimiteDepot": null
    },
    "amendementsCommission": {
      "commission": {
        "organeRef": "PO59051",
        "amendable": "true",
        "dateLimiteDepot": null
      }
    }
  }
}