{
  "@xmlns": "http://schemas.assemblee-nationale.fr/referentiel",
  "@xmlns:xsi": "http://www.w3.org/2001/XMLSchema-instance",
  "@xsi:type": "texteLoi_Type",
  "uid": "PRJLANR5L15B0900",
  "legislature": "15",
  "cycleDeVie": {
    "chrono": {
      "dateCreation": "2018-04-20T00:00:00.000+02:00",
      "dateDepot": "2018-04-20T00:00:00.000+02:00",
      "datePublication": "2018-04-30T00:00:00.000+02:00",
      "datePublicationWeb": "2018-04-23T12:50:00.000+02:00"
    }
  },
  "denominationStructurelle": "Projet de loi",
  "provenance": "Texte Déposé",
  "titres": {
    "titrePrincipal": "projet de loi autorisant la ratification de la convention n° 184 de l'Organisation internationale du travail relative à la sécurité et la santé dans l'agriculture",
    "titrePrincipalCourt": "Convention n° 184 de l'OIT sur la sécurité et la santé dans l'agriculture"
  },
  "divisions": null,
  "dossierRef": "DLR5L15N35850",
  "redacteur": null,
  "classification": {
    "famille": {
      "depot": {
        "code": "INITNAV",
        "libelle": "Initiative en Navette"
      },
      "classe": {
        "code": "PRJLOI",
        "libelle": "Projet de loi"
      },
      "espece": {
        "code": "AUTRATCONV",
        "libelle": "autorisant la ratification d'une convention"
      }
    },
    "type": {
      "code": "PRJL",
      "libelle": "Projet de loi"
    },
    "sousType": {
      "code": "AUTRATCONV",
      "libelle": "autorisant la ratification d'une convention",
      "libelleEdition": "autorisant la ratification d'une convention"
    },
    "statutAdoption": null
  },
  "auteurs": {
    "auteur": {
      "organe": {
        "organeRef": "PO717460"
      }
    }
  },
  "correction": null,
  "notice": {
    "numNotice": "900",
    "formule": ", adopté par le Sénat, autorisant la ratification de la convention n° 184 de l'Organisation internationale du travail relative à la sécurité et la santé dans l'agriculture",
    "adoptionConforme": "false"
  },
  "indexation": null,
  "imprimerie": null,
  "coSignataires": null,
  "depotAmendements": {
    "amendementsSeance": {
      "amendable": "true",
      "dateLimiteDepot": null
    },
    "amendementsCommission": {
      "commission": {
        "organeRef": "PO59047",
        "amendable": "true",
        "dateLimiteDepot": null
      }
    }
  }
}