{
  "@xmlns": "http://schemas.assemblee-nationale.fr/referentiel",
  "@xmlns:xsi": "http://www.w3.org/2001/XMLSchema-instance",
  "@xsi:type": "DossierLegislatif_Type",
  "uid": "DLR5L15N37127",
  "legislature": "15",
  "titreDossier": {
    "titre": "Droit voisin au profit des agences et éditeurs de presse",
    "titreChemin": "droit_voisin_agences_editeurs_presse",
    "senatChemin": "https://www.senat.fr/dossier-legislatif/ppl17-705.html"
  },
  "procedureParlementaire": {
    "code": "2",
    "libelle": "Proposition de loi ordinaire"
  },
  "initiateur": {
    "acteurs": {
      "acteur": {
        "acteurRef": "PA304002",
        "mandatRef": "PM736326"
      }
    },
    "organes": {
      "organe": {
        "organeRef": {
          "uid": "PO78718"
        }
      }
    }
  },
  "actesLegislatifs": {
    "acteLegislatif": [
      {
        "@xsi:type": "Etape_Type",
        "uid": "L15-SN1-37127",
        "codeActe": "SN1",
        "libelleActe": {
          "nomCanonique": "1ère lecture (1ère assemblée saisie)",
          "libelleCourt": "1ère lecture"
        },
        "organeRef": "PO78718",
        "dateActe": null,
        "actesLegislatifs": {
          "acteLegislatif": [
            {
              "@xsi:type": "DepotInitiative_Type",
              "uid": "L15-VD187971DI",
              "codeActe": "SN1-DEPOT",
              "libelleActe": {
                "nomCanonique": "1er dépôt d'une initiative.",
                "libelleCourt": "1er dépôt d'une initiative."
              },
              "organeRef": "PO78718",
              "dateActe": "2018-09-05T00:00:00.000+02:00",
              "actesLegislatifs": null,
              "texteAssocie": "PIONSNR5S299B0705"
            },
            {
              "@xsi:type": "Etape_Type",
              "uid": "L15-SN1-COM-37127",
              "codeActe": "SN1-COM",
              "libelleActe": {
                "nomCanonique": "Travaux des commissions",
                "libelleCourt": "Travaux des commissions"
              },
              "organeRef": "PO78718",
              "dateActe": null,
              "actesLegislatifs": {
                "acteLegislatif": {
                  "@xsi:type": "Etape_Type",
                  "uid": "L15-VD187972CF",
                  "codeActe": "SN1-COM-FOND",
                  "libelleActe": {
                    "nomCanonique": "Travaux de la commission saisie au fond",
                    "libelleCourt": "Travaux de la commission saisie au fond"
                  },
                  "organeRef": "PO211490",
                  "dateActe": null,
                  "actesLegislatifs": {
                    "acteLegislatif": [
                      {
                        "@xsi:type": "SaisieComFond_Type",
                        "uid": "L15-VD187972CFS",
                        "codeActe": "SN1-COM-FOND-SAISIE",
                        "libelleActe": {
                          "nomCanonique": "Renvoi en commission au fond",
                          "libelleCourt": "Renvoi en commission au fond"
                        },
                        "organeRef": "PO211490",
                        "dateActe": "2018-09-05T00:00:00.000+02:00",
                        "actesLegislatifs": null
                      },
                      {
                        "@xsi:type": "NominRapporteurs_Type",
                        "uid": "L15-VD188244",
                        "codeActe": "SN1-COM-FOND-NOMIN",
                        "libelleActe": {
                          "nomCanonique": "Nomination de rapporteur",
                          "libelleCourt": "Nomination de rapporteur"
                        },
                        "organeRef": "PO211490",
                        "dateActe": "2018-12-19T00:00:00.000+01:00",
                        "actesLegislatifs": null,
                        "rapporteurs": {
                          "rapporteur": {
                            "acteurRef": "PA304002",
                            "typeRapporteur": "rapporteur"
                          }
                        },
                        "reunion": null
                      },
                      {
                        "@xsi:type": "DepotRapport_Type",
                        "uid": "L15-VD188245",
                        "codeActe": "SN1-COM-FOND-RAPPORT",
                        "libelleActe": {
                          "nomCanonique": "Dépôt de rapport",
                          "libelleCourt": "Dépôt de rapport"
                        },
                        "organeRef": "PO211490",
                        "dateActe": "2019-01-16T00:00:00.000+01:00",
                        "actesLegislatifs": null,
                        "texteAssocie": "RAPPSNR5S319B0243",
                        "texteAdopte": "PIONSNR5S319BTC0244"
                      }
                    ]
                  }
                }
              }
            },
            {
              "@xsi:type": "Etape_Type",
              "uid": "L15-SN1-DEBATS-37127",
              "codeActe": "SN1-DEBATS",
              "libelleActe": {
                "nomCanonique": "Discussion en séance publique",
                "libelleCourt": "Discussion en séance publique"
              },
              "organeRef": "PO78718",
              "dateActe": null,
              "actesLegislatifs": {
                "acteLegislatif": [
                  {
                    "@xsi:type": "DiscussionSeancePublique_Type",
                    "uid": "L15-VD187974S36833",
                    "codeActe": "SN1-DEBATS-SEANCE",
                    "libelleActe": {
                      "nomCanonique": "Discussion en séance publique",
                      "libelleCourt": "Discussion en séance publique"
                    },
                    "organeRef": "PO78718",
                    "dateActe": "2019-01-24T00:00:00.000+01:00",
                    "actesLegislatifs": null,
                    "reunionRef": "RUSNR5L15S2019IDS21482",
                    "odjRef": "RUSNR5L15S2019IDS21482PT36833"
                  },
                  {
                    "@xsi:type": "Decision_Type",
                    "uid": "L15-VD188145DEC",
                    "codeActe": "SN1-DEBATS-DEC",
                    "libelleActe": {
                      "nomCanonique": "Décision",
                      "libelleCourt": "Décision"
                    },
                    "organeRef": "PO78718",
                    "dateActe": "2019-01-24T00:00:00.000+01:00",
                    "actesLegislatifs": null,
                    "reunionRef": "RUSNR5L15S2019IDS21482",
                    "statutConclusion": {
                      "fam_code": "TSORTF01",
                      "libelle": "adoptée"
                    },
                    "voteRefs": null,
                    "textesAssocies": {
                      "texteAssocie": {
                        "typeTexte": "BTA",
                        "refTexteAssocie": "PIONSNR5S319BTA0055"
                      }
                    }
                  }
                ]
              }
            }
          ]
        }
      },
      {
        "@xsi:type": "Etape_Type",
        "uid": "L15-AN1-37127",
        "codeActe": "AN1",
        "libelleActe": {
          "nomCanonique": "1ère lecture (2ème assemblée saisie)",
          "libelleCourt": "1ère lecture"
        },
        "organeRef": "PO717460",
        "dateActe": null,
        "actesLegislatifs": {
          "acteLegislatif": [
            {
              "@xsi:type": "DepotInitiativeNavette_Type",
              "uid": "L15-VD188146DIN",
              "codeActe": "AN1-DEPOT",
              "libelleActe": {
                "nomCanonique": "Dépôt d'une initiative en navette",
                "libelleCourt": "Dépôt d'une initiative en navette"
              },
              "organeRef": "PO717460",
              "dateActe": "2019-01-24T00:00:00.000+01:00",
              "actesLegislatifs": null,
              "texteAssocie": "PIONANR5L15B1616",
              "provenance": "PO78718"
            },
            {
              "@xsi:type": "Etape_Type",
              "uid": "L15-AN1-COM-37127",
              "codeActe": "AN1-COM",
              "libelleActe": {
                "nomCanonique": "Travaux des commissions",
                "libelleCourt": "Travaux des commissions"
              },
              "organeRef": "PO717460",
              "dateActe": null,
              "actesLegislatifs": {
                "acteLegislatif": {
                  "@xsi:type": "Etape_Type",
                  "uid": "L15-VD188147CF",
                  "codeActe": "AN1-COM-FOND",
                  "libelleActe": {
                    "nomCanonique": "Travaux de la commission saisie au fond",
                    "libelleCourt": "Travaux de la commission saisie au fond"
                  },
                  "organeRef": "PO419604",
                  "dateActe": null,
                  "actesLegislatifs": {
                    "acteLegislatif": [
                      {
                        "@xsi:type": "SaisieComFond_Type",
                        "uid": "L15-VD188147CFS",
                        "codeActe": "AN1-COM-FOND-SAISIE",
                        "libelleActe": {
                          "nomCanonique": "Renvoi en commission au fond",
                          "libelleCourt": "Renvoi en commission au fond"
                        },
                        "organeRef": "PO419604",
                        "dateActe": "2019-01-24T00:00:00.000+01:00",
                        "actesLegislatifs": null
                      },
                      {
                        "@xsi:type": "NominRapporteurs_Type",
                        "uid": "L15-VD188961",
                        "codeActe": "AN1-COM-FOND-NOMIN",
                        "libelleActe": {
                          "nomCanonique": "Nomination de rapporteur",
                          "libelleCourt": "Nomination de rapporteur"
                        },
                        "organeRef": "PO419604",
                        "dateActe": "2019-04-03T00:00:00.000+02:00",
                        "actesLegislatifs": null,
                        "rapporteurs": {
                          "rapporteur": {
                            "acteurRef": "PA721418",
                            "typeRapporteur": "rapporteur"
                          }
                        },
                        "reunion": null
                      },
                      {
                        "@xsi:type": "DiscussionCommission_Type",
                        "uid": "L15-VD188960R26490",
                        "codeActe": "AN1-COM-FOND-REUNION",
                        "libelleActe": {
                          "nomCanonique": "Réunion de commission",
                          "libelleCourt": "Réunion de commission"
                        },
                        "organeRef": "PO419604",
                        "dateActe": "2019-04-03T09:35:00.000+02:00",
                        "actesLegislatifs": null,
                        "reunionRef": "RUANR5L15S2019IDC431910",
                        "odjRef": "RUANR5L15S2019IDC431910PT26490"
                      },
                      {
                        "@xsi:type": "DiscussionCommission_Type",
                        "uid": "L15-VD188960R26496",
                        "codeActe": "AN1-COM-FOND-REUNION",
                        "libelleActe": {
                          "nomCanonique": "Réunion de commission",
                          "libelleCourt": "Réunion de commission"
                        },
                        "organeRef": "PO419604",
                        "dateActe": "2019-04-30T16:15:00.000+02:00",
                        "actesLegislatifs": null,
                        "reunionRef": "RUANR5L15S2019IDC432192",
                        "odjRef": "RUANR5L15S2019IDC432192PT26496"
                      },
                      {
                        "@xsi:type": "DiscussionCommission_Type",
                        "uid": "L15-VD188960R26544",
                        "codeActe": "AN1-COM-FOND-REUNION",
                        "libelleActe": {
                          "nomCanonique": "Réunion de commission",
                          "libelleCourt": "Réunion de commission"
                        },
                        "organeRef": "PO419604",
                        "dateActe": "2019-05-09T09:15:00.000+02:00",
                        "actesLegislatifs": null,
                        "reunionRef": "RUANR5L15S2019IDC432330",
                        "odjRef": "RUANR5L15S2019IDC432330PT26544"
                      },
                      {
                        "@xsi:type": "DepotRapport_Type",
                        "uid": "L15-VD189275",
                        "codeActe": "AN1-COM-FOND-RAPPORT",
                        "libelleActe": {
                          "nomCanonique": "Dépôt de rapport",
                          "libelleCourt": "Dépôt de rapport"
                        },
                        "organeRef": "PO419604",
                        "dateActe": "2019-04-30T00:00:00.000+02:00",
                        "actesLegislatifs": null,
                        "texteAssocie": "RAPPANR5L15B1912",
                        "texteAdopte": "PIONANR5L15BTC1912"
                      }
                    ]
                  }
                }
              }
            },
            {
              "@xsi:type": "Etape_Type",
              "uid": "L15-AN1-DEBATS-37127",
              "codeActe": "AN1-DEBATS",
              "libelleActe": {
                "nomCanonique": "Discussion en séance publique",
                "libelleCourt": "Discussion en séance publique"
              },
              "organeRef": "PO717460",
              "dateActe": null,
              "actesLegislatifs": {
                "acteLegislatif": [
                  {
                    "@xsi:type": "DiscussionSeancePublique_Type",
                    "uid": "L15-VD189048S37181",
                    "codeActe": "AN1-DEBATS-SEANCE",
                    "libelleActe": {
                      "nomCanonique": "Discussion en séance publique",
                      "libelleCourt": "Discussion en séance publique"
                    },
                    "organeRef": "PO717460",
                    "dateActe": "2019-05-09T00:00:00.000+02:00",
                    "actesLegislatifs": null,
                    "reunionRef": "RUANR5L15S2019IDS21615",
                    "odjRef": "RUANR5L15S2019IDS21615PT37181"
                  },
                  {
                    "@xsi:type": "DiscussionSeancePublique_Type",
                    "uid": "L15-VD189048S37185",
                    "codeActe": "AN1-DEBATS-SEANCE",
                    "libelleActe": {
                      "nomCanonique": "Discussion en séance publique",
                      "libelleCourt": "Discussion en séance publique"
                    },
                    "organeRef": "PO717460",
                    "dateActe": "2019-05-09T00:00:00.000+02:00",
                    "actesLegislatifs": null,
                    "reunionRef": "RUANR5L15S2019IDS21616",
                    "odjRef": "RUANR5L15S2019IDS21616PT37185"
                  },
                  {
                    "@xsi:type": "Decision_Type",
                    "uid": "L15-VD189362DEC",
                    "codeActe": "AN1-DEBATS-DEC",
                    "libelleActe": {
                      "nomCanonique": "Décision",
                      "libelleCourt": "Décision"
                    },
                    "organeRef": "PO717460",
                    "dateActe": "2019-05-09T00:00:00.000+02:00",
                    "actesLegislatifs": null,
                    "reunionRef": "RUANR5L15S2019IDS21616",
                    "statutConclusion": {
                      "fam_code": "TSORTF05",
                      "libelle": "modifiée"
                    },
                    "voteRefs": null,
                    "textesAssocies": {
                      "texteAssocie": [
                        {
                          "typeTexte": "BTA",
                          "refTexteAssocie": "PIONANR5L15BTA0267"
                        },
                        {
                          "typeTexte": "TAP",
                          "refTexteAssocie": "PIONANR5L15TAP0267"
                        }
                      ]
                    }
                  }
                ]
              }
            }
          ]
        }
      },
      {
        "@xsi:type": "Etape_Type",
        "uid": "L15-SN2-37127",
        "codeActe": "SN2",
        "libelleActe": {
          "nomCanonique": "deuxième lecture",
          "libelleCourt": "2ème lecture"
        },
        "organeRef": "PO78718",
        "dateActe": null,
        "actesLegislatifs": {
          "acteLegislatif": [
            {
              "@xsi:type": "DepotInitiativeNavette_Type",
              "uid": "L15-VD189377DIN",
              "codeActe": "SN2-DEPOT",
              "libelleActe": {
                "nomCanonique": "Dépôt d'une initiative en navette",
                "libelleCourt": "Dépôt d'une initiative en navette"
              },
              "organeRef": "PO78718",
              "dateActe": "2019-05-09T00:00:00.000+02:00",
              "actesLegislatifs": null,
              "texteAssocie": "PIONSNR5S319B0489",
              "provenance": "PO717460"
            },
            {
              "@xsi:type": "Etape_Type",
              "uid": "L15-SN2-COM-37127",
              "codeActe": "SN2-COM",
              "libelleActe": {
                "nomCanonique": "Travaux des commissions",
                "libelleCourt": "Travaux des commissions"
              },
              "organeRef": "PO78718",
              "dateActe": null,
              "actesLegislatifs": {
                "acteLegislatif": {
                  "@xsi:type": "Etape_Type",
                  "uid": "L15-VD189378CF",
                  "codeActe": "SN2-COM-FOND",
                  "libelleActe": {
                    "nomCanonique": "Travaux de la commission saisie au fond",
                    "libelleCourt": "Travaux de la commission saisie au fond"
                  },
                  "organeRef": "PO211490",
                  "dateActe": null,
                  "actesLegislatifs": {
                    "acteLegislatif": [
                      {
                        "@xsi:type": "SaisieComFond_Type",
                        "uid": "L15-VD189378CFS",
                        "codeActe": "SN2-COM-FOND-SAISIE",
                        "libelleActe": {
                          "nomCanonique": "Renvoi en commission au fond",
                          "libelleCourt": "Renvoi en commission au fond"
                        },
                        "organeRef": "PO211490",
                        "dateActe": "2019-05-09T00:00:00.000+02:00",
                        "actesLegislatifs": null
                      },
                      {
                        "@xsi:type": "DepotRapport_Type",
                        "uid": "L15-VD190023",
                        "codeActe": "SN2-COM-FOND-RAPPORT",
                        "libelleActe": {
                          "nomCanonique": "Dépôt de rapport",
                          "libelleCourt": "Dépôt de rapport"
                        },
                        "organeRef": "PO211490",
                        "dateActe": "2019-06-19T00:00:00.000+02:00",
                        "actesLegislatifs": null,
                        "texteAssocie": "RAPPSNR5S319B0581",
                        "texteAdopte": "PIONSNR5S319BTC0582"
                      }
                    ]
                  }
                }
              }
            },
            {
              "@xsi:type": "Etape_Type",
              "uid": "L15-SN2-DEBATS-37127",
              "codeActe": "SN2-DEBATS",
              "libelleActe": {
                "nomCanonique": "Discussion en séance publique",
                "libelleCourt": "Discussion en séance publique"
              },
              "organeRef": "PO78718",
              "dateActe": null,
              "actesLegislatifs": {
                "acteLegislatif": [
                  {
                    "@xsi:type": "DiscussionSeancePublique_Type",
                    "uid": "L15-VD190024S37529",
                    "codeActe": "SN2-DEBATS-SEANCE",
                    "libelleActe": {
                      "nomCanonique": "Discussion en séance publique",
                      "libelleCourt": "Discussion en séance publique"
                    },
                    "organeRef": "PO78718",
                    "dateActe": "2019-07-03T00:00:00.000+02:00",
                    "actesLegislatifs": null,
                    "reunionRef": "RUSNR5L15S2019IDS21778",
                    "odjRef": "RUSNR5L15S2019IDS21778PT37529"
                  },
                  {
                    "@xsi:type": "Decision_Type",
                    "uid": "L15-VD190111DEC",
                    "codeActe": "SN2-DEBATS-DEC",
                    "libelleActe": {
                      "nomCanonique": "Décision",
                      "libelleCourt": "Décision"
                    },
                    "organeRef": "PO78718",
                    "dateActe": "2019-07-03T00:00:00.000+02:00",
                    "actesLegislatifs": null,
                    "reunionRef": "RUSNR5L15S2019IDS21778",
                    "statutConclusion": {
                      "fam_code": "TSORTF02",
                      "libelle": "adoptée avec modifications"
                    },
                    "voteRefs": null,
                    "textesAssocies": {
                      "texteAssocie": {
                        "typeTexte": "BTA",
                        "refTexteAssocie": "PIONSNR5S319BTA0125"
                      }
                    }
                  }
                ]
              }
            }
          ]
        }
      },
      {
        "@xsi:type": "Etape_Type",
        "uid": "L15-AN2-37127",
        "codeActe": "AN2",
        "libelleActe": {
          "nomCanonique": "deuxième lecture",
          "libelleCourt": "2ème lecture"
        },
        "organeRef": "PO717460",
        "dateActe": null,
        "actesLegislatifs": {
          "acteLegislatif": [
            {
              "@xsi:type": "DepotInitiativeNavette_Type",
              "uid": "L15-VD190169DIN",
              "codeActe": "AN2-DEPOT",
              "libelleActe": {
                "nomCanonique": "Dépôt d'une initiative en navette",
                "libelleCourt": "Dépôt d'une initiative en navette"
              },
              "organeRef": "PO717460",
              "dateActe": "2019-07-08T00:00:00.000+02:00",
              "actesLegislatifs": null,
              "texteAssocie": "PIONANR5L15B2118",
              "provenance": "PO78718"
            },
            {
              "@xsi:type": "Etape_Type",
              "uid": "L15-AN2-COM-37127",
              "codeActe": "AN2-COM",
              "libelleActe": {
                "nomCanonique": "Travaux des commissions",
                "libelleCourt": "Travaux des commissions"
              },
              "organeRef": "PO717460",
              "dateActe": null,
              "actesLegislatifs": {
                "acteLegislatif": {
                  "@xsi:type": "Etape_Type",
                  "uid": "L15-VD190170CF",
                  "codeActe": "AN2-COM-FOND",
                  "libelleActe": {
                    "nomCanonique": "Travaux de la commission saisie au fond",
                    "libelleCourt": "Travaux de la commission saisie au fond"
                  },
                  "organeRef": "PO419604",
                  "dateActe": null,
                  "actesLegislatifs": {
                    "acteLegislatif": [
                      {
                        "@xsi:type": "SaisieComFond_Type",
                        "uid": "L15-VD190170CFS",
                        "codeActe": "AN2-COM-FOND-SAISIE",
                        "libelleActe": {
                          "nomCanonique": "Renvoi en commission au fond",
                          "libelleCourt": "Renvoi en commission au fond"
                        },
                        "organeRef": "PO419604",
                        "dateActe": "2019-07-08T00:00:00.000+02:00",
                        "actesLegislatifs": null
                      },
                      {
                        "@xsi:type": "DiscussionCommission_Type",
                        "uid": "L15-VD190284R26729",
                        "codeActe": "AN2-COM-FOND-REUNION",
                        "libelleActe": {
                          "nomCanonique": "Réunion de commission",
                          "libelleCourt": "Réunion de commission"
                        },
                        "organeRef": "PO419604",
                        "dateActe": "2019-07-15T15:05:00.000+02:00",
                        "actesLegislatifs": null,
                        "reunionRef": "RUANR5L15S2019IDC433258",
                        "odjRef": "RUANR5L15S2019IDC433258PT26729"
                      },
                      {
                        "@xsi:type": "DiscussionCommission_Type",
                        "uid": "L15-VD190284R26735",
                        "codeActe": "AN2-COM-FOND-REUNION",
                        "libelleActe": {
                          "nomCanonique": "Réunion de commission",
                          "libelleCourt": "Réunion de commission"
                        },
                        "organeRef": "PO419604",
                        "dateActe": "2019-07-23T14:45:00.000+02:00",
                        "actesLegislatifs": null,
                        "reunionRef": "RUANR5L15S2019IDC433263",
                        "odjRef": "RUANR5L15S2019IDC433263PT26735"
                      },
                      {
                        "@xsi:type": "DepotRapport_Type",
                        "uid": "L15-VD190319",
                        "codeActe": "AN2-COM-FOND-RAPPORT",
                        "libelleActe": {
                          "nomCanonique": "Dépôt de rapport",
                          "libelleCourt": "Dépôt de rapport"
                        },
                        "organeRef": "PO419604",
                        "dateActe": "2019-07-15T00:00:00.000+02:00",
                        "actesLegislatifs": null,
                        "texteAssocie": "RAPPANR5L15B2141",
                        "texteAdopte": "PIONANR5L15BTC2141"
                      }
                    ]
                  }
                }
              }
            },
            {
              "@xsi:type": "Etape_Type",
              "uid": "L15-AN2-DEBATS-37127",
              "codeActe": "AN2-DEBATS",
              "libelleActe": {
                "nomCanonique": "Discussion en séance publique",
                "libelleCourt": "Discussion en séance publique"
              },
              "organeRef": "PO717460",
              "dateActe": null,
              "actesLegislatifs": {
                "acteLegislatif": [
                  {
                    "@xsi:type": "DiscussionSeancePublique_Type",
                    "uid": "L15-VD190199S37539",
                    "codeActe": "AN2-DEBATS-SEANCE",
                    "libelleActe": {
                      "nomCanonique": "Discussion en séance publique",
                      "libelleCourt": "Discussion en séance publique"
                    },
                    "organeRef": "PO717460",
                    "dateActe": "2019-07-23T00:00:00.000+02:00",
                    "actesLegislatifs": null,
                    "reunionRef": "RUANR5L15S2019IDS21785",
                    "odjRef": "RUANR5L15S2019IDS21785PT37539"
                  },
                  {
                    "@xsi:type": "Decision_Type",
                    "uid": "L15-VD190450DEC",
                    "codeActe": "AN2-DEBATS-DEC",
                    "libelleActe": {
                      "nomCanonique": "Décision",
                      "libelleCourt": "Décision"
                    },
                    "organeRef": "PO717460",
                    "dateActe": "2019-07-23T00:00:00.000+02:00",
                    "actesLegislatifs": null,
                    "reunionRef": "RUANR5L15S2019IDS21785",
                    "statutConclusion": {
                      "fam_code": "TSORTF03",
                      "libelle": "adoptée sans modification"
                    },
                    "voteRefs": null,
                    "textesAssocies": {
                      "texteAssocie": [
                        {
                          "typeTexte": "BTA",
                          "refTexteAssocie": "PIONANR5L15BTA0325"
                        },
                        {
                          "typeTexte": "TAP",
                          "refTexteAssocie": "PIONANR5L15TAP0325"
                        }
                      ]
                    }
                  }
                ]
              }
            }
          ]
        }
      },
      {
        "@xsi:type": "Etape_Type",
        "uid": "L15-PROM-37127",
        "codeActe": "PROM",
        "libelleActe": {
          "nomCanonique": "Promulgation de la loi",
          "libelleCourt": "Promulgation de la loi"
        },
        "organeRef": "PO717136",
        "dateActe": null,
        "actesLegislatifs": {
          "acteLegislatif": {
            "@xsi:type": "Promulgation_Type",
            "uid": "L15-VD190584PL",
            "codeActe": "PROM-PUB",
            "libelleActe": {
              "nomCanonique": "Promulgation d'une loi",
              "libelleCourt": "Promulgation d'une loi"
            },
            "organeRef": "PO717136",
            "dateActe": "2019-07-24T00:00:00.000+02:00",
            "actesLegislatifs": null,
            "texteLoiRef": "PIONANR5L15BTA0325",
            "infoJO": {
              "typeJO": "JO_LOI_DECRET",
              "dateJO": "2019-07-26+02:00",
              "pageJO": null,
              "numJO": "172",
              "urlLegifrance": "http://www.legifrance.gouv.fr/WAspad/UnTexteDeJorf?numjo=MICX1902858L",
              "referenceNOR": "MICX1902858L"
            },
            "urlEcheancierLoi": null,
            "codeLoi": "2019-775",
            "titreLoi": "tendant à créer un droit voisin au profit des agences de presse et des éditeurs de presse"
          }
        }
      }
    ]
  },
  "fusionDossier": null
}