{
  "@xmlns": "http://schemas.assemblee-nationale.fr/referentiel",
  "@xmlns:xsi": "http://www.w3.org/2001/XMLSchema-instance",
  "@xsi:type": "texteLoi_Type",
  "uid": "PIONANR5L15B0798",
  "legislature": "15",
  "cycleDeVie": {
    "chrono": {
      "dateCreation": "2018-03-19T00:00:00.000+01:00",
      "dateDepot": "2018-03-21T00:00:00.000+01:00",
      "datePublication": "2018-03-27T00:00:00.000+02:00",
      "datePublicationWeb": "2018-03-22T16:00:00.000+01:00"
    }
  },
  "denominationStructurelle": "Proposition de loi",
  "provenance": "Texte Déposé",
  "titres": {
    "titrePrincipal": "proposition de loi relative à une société plus inclusive pour les personnes en situation de handicap",
    "titrePrincipalCourt": "société inclusive personnes handicap"
  },
  "divisions": null,
  "dossierRef": "DLR5L15N36487",
  "redacteur": null,
  "classification": {
    "famille": {
      "depot": {
        "code": "INITDEP",
        "libelle": "Initiative en 1er Dépôt"
      },
      "classe": {
        "code": "PIONLOI",
        "libelle": "Proposition de loi"
      }
    },
    "type": {
      "code": "PION",
      "libelle": "Proposition de loi"
    },
    "sousType": null,
    "statutAdoption": null
  },
  "auteurs": {
    "auteur": {
      "acteur": {
        "acteurRef": "PA605036",
        "qualite": "auteur"
      }
    }
  },
  "correction": null,
  "notice": {
    "numNotice": "798",
    "formule": "relative à une société plus inclusive pour les personnes en situation de handicap",
    "adoptionConforme": "false"
  },
  "indexation": null,
  "imprimerie": null,
  "coSignataires": {
    "coSignataire": [
      {
        "acteur": {
          "acteurRef": "PA1874"
        },
        "dateCosignature": "2018-03-21+01:00",
        "dateRetraitCosignature": null,
        "edite": "false"
      },
      {
        "acteur": {
          "acteurRef": "PA719318"
        },
        "dateCosignature": "2018-03-21+01:00",
        "dateRetraitCosignature": null,
        "edite": "false"
      },
      {
        "acteur": {
          "acteurRef": "PA721046"
        },
        "dateCosignature": "2018-03-21+01:00",
        "dateRetraitCosignature": null,
        "edite": "false"
      },
      {
        "acteur": {
          "acteurRef": "PA718884"
        },
        "dateCosignature": "2018-03-21+01:00",
        "dateRetraitCosignature": null,
        "edite": "false"
      },
      {
        "acteur": {
          "acteurRef": "PA266793"
        },
        "dateCosignature": "2018-03-21+01:00",
        "dateRetraitCosignature": null,
        "edite": "false"
      },
      {
        "acteur": {
          "acteurRef": "PA223837"
        },
        "dateCosignature": "2018-03-21+01:00",
        "dateRetraitCosignature": null,
        "edite": "false"
      },
      {
        "acteur": {
          "acteurRef": "PA718838"
        },
        "dateCosignature": "2018-03-21+01:00",
        "dateRetraitCosignature": null,
        "edite": "false"
      },
      {
        "acteur": {
          "acteurRef": "PA267429"
        },
        "dateCosignature": "2018-03-21+01:00",
        "dateRetraitCosignature": null,
        "edite": "false"
      },
      {
        "acteur": {
          "acteurRef": "PA856"
        },
        "dateCosignature": "2018-03-21+01:00",
        "dateRetraitCosignature": null,
        "edite": "false"
      },
      {
        "acteur": {
          "acteurRef": "PA718850"
        },
        "dateCosignature": "2018-03-21+01:00",
        "dateRetraitCosignature": null,
        "edite": "false"
      },
      {
        "acteur": {
          "acteurRef": "PA998"
        },
        "dateCosignature": "2018-03-21+01:00",
        "dateRetraitCosignature": null,
        "edite": "false"
      },
      {
        "acteur": {
          "acteurRef": "PA1029"
        },
        "dateCosignature": "2018-03-21+01:00",
        "dateRetraitCosignature": null,
        "edite": "false"
      },
      {
        "acteur": {
          "acteurRef": "PA267450"
        },
        "dateCosignature": "2018-03-21+01:00",
        "dateRetraitCosignature": null,
        "edite": "false"
      },
      {
        "acteur": {
          "acteurRef": "PA712015"
        },
        "dateCosignature": "2018-03-21+01:00",
        "dateRetraitCosignature": null,
        "edite": "false"
      },
      {
        "acteur": {
          "acteurRef": "PA1630"
        },
        "dateCosignature": "2018-03-21+01:00",
        "dateRetraitCosignature": null,
        "edite": "false"
      },
      {
        "acteur": {
          "acteurRef": "PA608416"
        },
        "dateCosignature": "2018-03-21+01:00",
        "dateRetraitCosignature": null,
        "edite": "false"
      },
      {
        "acteur": {
          "acteurRef": "PA267318"
        },
        "dateCosignature": "2018-03-21+01:00",
        "dateRetraitCosignature": null,
        "edite": "false"
      },
      {
        "acteur": {
          "acteurRef": "PA721506"
        },
        "dateCosignature": "2018-03-21+01:00",
        "dateRetraitCosignature": null,
        "edite": "false"
      },
      {
        "acteur": {
          "acteurRef": "PA267378"
        },
        "dateCosignature": "2018-03-21+01:00",
        "dateRetraitCosignature": null,
        "edite": "false"
      },
      {
        "acteur": {
          "acteurRef": "PA606098"
        },
        "dateCosignature": "2018-03-21+01:00",
        "dateRetraitCosignature": null,
        "edite": "false"
      },
      {
        "acteur": {
          "acteurRef": "PA720630"
        },
        "dateCosignature": "2018-03-21+01:00",
        "dateRetraitCosignature": null,
        "edite": "false"
      },
      {
        "acteur": {
          "acteurRef": "PA719946"
        },
        "dateCosignature": "2018-03-21+01:00",
        "dateRetraitCosignature": null,
        "edite": "false"
      },
      {
        "acteur": {
          "acteurRef": "PA2377"
        },
        "dateCosignature": "2018-03-21+01:00",
        "dateRetraitCosignature": null,
        "edite": "false"
      },
      {
        "acteur": {
          "acteurRef": "PA267260"
        },
        "dateCosignature": "2018-03-21+01:00",
        "dateRetraitCosignature": null,
        "edite": "false"
      },
      {
        "acteur": {
          "acteurRef": "PA720100"
        },
        "dateCosignature": "2018-03-21+01:00",
        "dateRetraitCosignature": null,
        "edite": "false"
      },
      {
        "acteur": {
          "acteurRef": "PA721286"
        },
        "dateCosignature": "2018-03-21+01:00",
        "dateRetraitCosignature": null,
        "edite": "false"
      },
      {
        "acteur": {
          "acteurRef": "PA721070"
        },
        "dateCosignature": "2018-03-21+01:00",
        "dateRetraitCosignature": null,
        "edite": "false"
      },
      {
        "acteur": {
          "acteurRef": "PA721678"
        },
        "dateCosignature": "2018-03-21+01:00",
        "dateRetraitCosignature": null,
        "edite": "false"
      },
      {
        "acteur": {
          "acteurRef": "PA2529"
        },
        "dateCosignature": "2018-03-21+01:00",
        "dateRetraitCosignature": null,
        "edite": "false"
      },
      {
        "acteur": {
          "acteurRef": "PA266808"
        },
        "dateCosignature": "2018-03-21+01:00",
        "dateRetraitCosignature": null,
        "edite": "false"
      },
      {
        "acteur": {
          "acteurRef": "PA267527"
        },
        "dateCosignature": "2018-03-21+01:00",
        "dateRetraitCosignature": null,
        "edite": "false"
      },
      {
        "acteur": {
          "acteurRef": "PA267204"
        },
        "dateCosignature": "2018-03-21+01:00",
        "dateRetraitCosignature": null,
        "edite": "false"
      },
      {
        "acteur": {
          "acteurRef": "PA334654"
        },
        "dateCosignature": "2018-03-21+01:00",
        "dateRetraitCosignature": null,
        "edite": "false"
      },
      {
        "acteur": {
          "acteurRef": "PA718780"
        },
        "dateCosignature": "2018-03-21+01:00",
        "dateRetraitCosignature": null,
        "edite": "false"
      },
      {
        "acteur": {
          "acteurRef": "PA643134"
        },
        "dateCosignature": "2018-03-21+01:00",
        "dateRetraitCosignature": null,
        "edite": "false"
      },
      {
        "acteur": {
          "acteurRef": "PA1012"
        },
        "dateCosignature": "2018-03-21+01:00",
        "dateRetraitCosignature": null,
        "edite": "false"
      },
      {
        "acteur": {
          "acteurRef": "PA709315"
        },
        "dateCosignature": "2018-03-21+01:00",
        "dateRetraitCosignature": null,
        "edite": "false"
      },
      {
        "acteur": {
          "acteurRef": "PA721474"
        },
        "dateCosignature": "2018-03-21+01:00",
        "dateRetraitCosignature": null,
        "edite": "false"
      },
      {
        "acteur": {
          "acteurRef": "PA642847"
        },
        "dateCosignature": "2018-04-11+02:00",
        "dateRetraitCosignature": null,
        "edite": "false"
      },
      {
        "acteur": {
          "acteurRef": "PA722390"
        },
        "dateCosignature": "2018-04-11+02:00",
        "dateRetraitCosignature": null,
        "edite": "false"
      },
      {
        "acteur": {
          "acteurRef": "PA330909"
        },
        "dateCosignature": "2018-04-11+02:00",
        "dateRetraitCosignature": null,
        "edite": "false"
      },
      {
        "acteur": {
          "acteurRef": "PA608826"
        },
        "dateCosignature": "2018-04-11+02:00",
        "dateRetraitCosignature": null,
        "edite": "false"
      },
      {
        "acteur": {
          "acteurRef": "PA334149"
        },
        "dateCosignature": "2018-04-11+02:00",
        "dateRetraitCosignature": null,
        "edite": "false"
      },
      {
        "acteur": {
          "acteurRef": "PA1327"
        },
        "dateCosignature": "2018-04-11+02:00",
        "dateRetraitCosignature": null,
        "edite": "false"
      },
      {
        "acteur": {
          "acteurRef": "PA266774"
        },
        "dateCosignature": "2018-04-11+02:00",
        "dateRetraitCosignature": null,
        "edite": "false"
      },
      {
        "acteur": {
          "acteurRef": "PA267324"
        },
        "dateCosignature": "2018-04-11+02:00",
        "dateRetraitCosignature": null,
        "edite": "false"
      },
      {
        "acteur": {
          "acteurRef": "PA605991"
        },
        "dateCosignature": "2018-04-11+02:00",
        "dateRetraitCosignature": null,
        "edite": "false"
      },
      {
        "acteur": {
          "acteurRef": "PA267200"
        },
        "dateCosignature": "2018-04-11+02:00",
        "dateRetraitCosignature": null,
        "edite": "false"
      },
      {
        "acteur": {
          "acteurRef": "PA609245"
        },
        "dateCosignature": "2018-04-11+02:00",
        "dateRetraitCosignature": null,
        "edite": "false"
      },
      {
        "acteur": {
          "acteurRef": "PA606712"
        },
        "dateCosignature": "2018-04-11+02:00",
        "dateRetraitCosignature": null,
        "edite": "false"
      },
      {
        "acteur": {
          "acteurRef": "PA718784"
        },
        "dateCosignature": "2018-04-11+02:00",
        "dateRetraitCosignature": null,
        "edite": "false"
      },
      {
        "acteur": {
          "acteurRef": "PA2492"
        },
        "dateCosignature": "2018-04-11+02:00",
        "dateRetraitCosignature": null,
        "edite": "false"
      },
      {
        "acteur": {
          "acteurRef": "PA748954"
        },
        "dateCosignature": "2018-04-11+02:00",
        "dateRetraitCosignature": null,
        "edite": "false"
      }
    ]
  },
  "depotAmendements": {
    "amendementsSeance": {
      "amendable": "false",
      "dateLimiteDepot": null
    },
    "amendementsCommission": {
      "commission": {
        "organeRef": "PO420120",
        "amendable": "true",
        "dateLimiteDepot": null
      }
    }
  }
}