{
  "@xmlns": "http://schemas.assemblee-nationale.fr/referentiel",
  "@xmlns:xsi": "http://www.w3.org/2001/XMLSchema-instance",
  "@xsi:type": "rapportParlementaire_Type",
  "uid": "RAPPANR5L15B1700",
  "legislature": "15",
  "cycleDeVie": {
    "chrono": {
      "dateCreation": "2019-02-20T00:00:00.000+01:00",
      "dateDepot": "2019-02-20T00:00:00.000+01:00",
      "datePublication": "2019-03-06T00:00:00.000+01:00",
      "datePublicationWeb": "2019-03-04T13:15:00.000+01:00"
    }
  },
  "denominationStructurelle": "Rapport",
  "provenance": "Commission",
  "titres": {
    "titrePrincipal": "rapport sur la proposition de loi de Mme Elsa Faucillon et plusieurs de ses collègues en faveur de la transparence sur l'utilisation de l'épargne populaire en matière énergétique (1611).",
    "titrePrincipalCourt": "rapport sur la proposition de loi de Mme Elsa Faucillon et plusieurs de ses collègues en faveur de la transparence sur l'utilisation de l'épargne populaire en matière énergétique (1611)."
  },
  "divisions": null,
  "dossierRef": "DLR5L15N37168",
  "redacteur": null,
  "classification": {
    "famille": {
      "depot": {
        "code": "RAPINIT",
        "libelle": "Rapport sur une initiative"
      },
      "classe": {
        "code": "RAPPORT",
        "libelle": "Rapport"
      }
    },
    "type": {
      "code": "RAPP",
      "libelle": "Rapport"
    },
    "sousType": null,
    "statutAdoption": null
  },
  "auteurs": {
    "auteur": [
      {
        "acteur": {
          "acteurRef": "PA721896",
          "qualite": "rapporteur"
        }
      },
      {
        "organe": {
          "organeRef": "PO59048"
        }
      }
    ]
  },
  "correction": null,
  "notice": {
    "numNotice": "1700",
    "formule": "sur la proposition de loi de Mme Elsa Faucillon et plusieurs de ses collègues en faveur de la transparence sur l'utilisation de l'épargne populaire en matière énergétique (1611).",
    "adoptionConforme": "false"
  },
  "indexation": null,
  "imprimerie": {
    "prix": "3.0"
  }
}