{
  "@xmlns": "http://schemas.assemblee-nationale.fr/referentiel",
  "@xmlns:xsi": "http://www.w3.org/2001/XMLSchema-instance",
  "@xsi:type": "documentEtudeImpact_Type",
  "uid": "ETDIANR5L15B0155",
  "legislature": "15",
  "cycleDeVie": {
    "chrono": {
      "dateCreation": "2017-09-06T00:00:00.000+02:00",
      "dateDepot": "2017-09-06T00:00:00.000+02:00",
      "datePublication": "2017-10-10T00:00:00.000+02:00",
      "datePublicationWeb": "2017-09-07T11:10:00.000+02:00"
    }
  },
  "denominationStructurelle": "Projet de loi",
  "provenance": "Texte Déposé",
  "titres": {
    "titrePrincipal": "Etude d'impact sur le projet de loi mettant fin à la recherche ainsi qu'à l'exploitation des hydrocarbures conventionnels et non conventionnels et portant diverses dispositions relatives à l'énergie et à l'environnement",
    "titrePrincipalCourt": "Recherche et exploitation des hydrocarbures conventionnels et non conventionnels"
  },
  "divisions": null,
  "dossierRef": "DLR5L15N35929",
  "redacteur": null,
  "classification": {
    "famille": {
      "depot": {
        "code": "INITDEP",
        "libelle": "Initiative en 1er Dépôt"
      },
      "classe": {
        "code": "PRJLOI",
        "libelle": "Projet de loi"
      }
    },
    "type": {
      "code": "ETDI",
      "libelle": "Etude d'impact"
    },
    "sousType": null,
    "statutAdoption": null
  },
  "auteurs": {
    "auteur": {
      "acteur": {
        "acteurRef": "PA345619",
        "qualite": "auteur"
      }
    }
  },
  "correction": null,
  "notice": {
    "numNotice": "155",
    "formule": "mettant fin à la recherche ainsi qu'à l'exploitation des hydrocarbures conventionnels et non conventionnels et portant diverses dispositions relatives à l'énergie et à l'environnement",
    "adoptionConforme": "false"
  },
  "indexation": null,
  "imprimerie": null
}