{
  "@xmlns": "http://schemas.assemblee-nationale.fr/referentiel",
  "@xmlns:xsi": "http://www.w3.org/2001/XMLSchema-instance",
  "@xsi:type": "rapportParlementaire_Type",
  "uid": "RAPPSNR5S279B0591",
  "legislature": null,
  "cycleDeVie": {
    "chrono": {
      "dateCreation": "2017-06-30T00:00:00.000+02:00",
      "dateDepot": "2017-06-28T00:00:00.000+02:00",
      "datePublication": null,
      "datePublicationWeb": null
    }
  },
  "denominationStructurelle": "Rapport",
  "provenance": "Commission",
  "titres": {
    "titrePrincipal": "rapport sur le projet de loi, après engagement de la procédure accélérée, prorogeant l'application de la loi n° 55-385 du 3 avril 1955 relative à l'état d'urgence (n°585).",
    "titrePrincipalCourt": "rapport sur le projet de loi, après engagement de la procédure accélérée, prorogeant l'application de la loi n° 55-385 du 3 avril 1955 relative à l'état d'urgence (n°585)."
  },
  "divisions": null,
  "dossierRef": "DLR5L15N35829",
  "redacteur": null,
  "classification": {
    "famille": {
      "depot": {
        "code": "RAPINIT",
        "libelle": "Rapport sur une initiative"
      },
      "classe": {
        "code": "RAPPORT",
        "libelle": "Rapport"
      }
    },
    "type": {
      "code": "RAPP",
      "libelle": "Rapport"
    },
    "sousType": null,
    "statutAdoption": null
  },
  "auteurs": {
    "auteur": [
      {
        "acteur": {
          "acteurRef": "PA2161",
          "qualite": "rapporteur"
        }
      },
      {
        "organe": {
          "organeRef": "PO211495"
        }
      }
    ]
  },
  "correction": null,
  "notice": {
    "numNotice": "591",
    "formule": "sur le projet de loi, après engagement de la procédure accélérée, prorogeant l'application de la loi n° 55-385 du 3 avril 1955 relative à l'état d'urgence (n°585).",
    "adoptionConforme": "false"
  },
  "indexation": null,
  "imprimerie": null
}