{
  "@xmlns": "http://schemas.assemblee-nationale.fr/referentiel",
  "@xmlns:xsi": "http://www.w3.org/2001/XMLSchema-instance",
  "@xsi:type": "texteLoi_Type",
  "uid": "PNREANR5L15B2017",
  "legislature": "15",
  "cycleDeVie": {
    "chrono": {
      "dateCreation": "2019-06-07T00:00:00.000+02:00",
      "dateDepot": "2019-06-07T00:00:00.000+02:00",
      "datePublication": "2019-06-14T00:00:00.000+02:00",
      "datePublicationWeb": "2019-06-11T11:50:00.000+02:00"
    }
  },
  "denominationStructurelle": "Proposition de résolution",
  "provenance": "Texte Déposé",
  "titres": {
    "titrePrincipal": "proposition de résolution visant l'amélioration des modalités de contrôle budgétaire par le Parlement",
    "titrePrincipalCourt": "amélioration des modalités de contrôle budgétaire par le Parlement"
  },
  "divisions": null,
  "dossierRef": "DLR5L15N37532",
  "redacteur": null,
  "classification": {
    "famille": {
      "depot": {
        "code": "INITDEP",
        "libelle": "Initiative en 1er Dépôt"
      },
      "classe": {
        "code": "PIONRES",
        "libelle": "Proposition de résolution"
      },
      "espece": {
        "code": "APPART341",
        "libelle": "en application de Article 34-1 de la Constitution"
      }
    },
    "type": {
      "code": "PNRE",
      "libelle": "Proposition de résolution"
    },
    "sousType": {
      "code": "APPART341",
      "libelle": "en application de Article 34-1 de la Constitution"
    },
    "statutAdoption": null
  },
  "auteurs": {
    "auteur": {
      "acteur": {
        "acteurRef": "PA720878",
        "qualite": "auteur"
      }
    }
  },
  "correction": null,
  "notice": {
    "numNotice": "2017",
    "formule": "visant l'amélioration des modalités de contrôle budgétaire par le Parlement",
    "adoptionConforme": "false"
  },
  "indexation": null,
  "imprimerie": null,
  "coSignataires": {
    "coSignataire": [
      {
        "acteur": {
          "acteurRef": "PA718736"
        },
        "dateCosignature": "2019-06-07+02:00",
        "dateRetraitCosignature": null,
        "edite": "false"
      },
      {
        "acteur": {
          "acteurRef": "PA718954"
        },
        "dateCosignature": "2019-06-07+02:00",
        "dateRetraitCosignature": null,
        "edite": "false"
      },
      {
        "acteur": {
          "acteurRef": "PA605963"
        },
        "dateCosignature": "2019-06-07+02:00",
        "dateRetraitCosignature": null,
        "edite": "false"
      },
      {
        "acteur": {
          "acteurRef": "PA606675"
        },
        "dateCosignature": "2019-06-07+02:00",
        "dateRetraitCosignature": null,
        "edite": "false"
      },
      {
        "acteur": {
          "acteurRef": "PA720298"
        },
        "dateCosignature": "2019-06-07+02:00",
        "dateRetraitCosignature": null,
        "edite": "false"
      },
      {
        "acteur": {
          "acteurRef": "PA720520"
        },
        "dateCosignature": "2019-06-07+02:00",
        "dateRetraitCosignature": null,
        "edite": "false"
      },
      {
        "acteur": {
          "acteurRef": "PA719472"
        },
        "dateCosignature": "2019-06-07+02:00",
        "dateRetraitCosignature": null,
        "edite": "false"
      },
      {
        "acteur": {
          "acteurRef": "PA719250"
        },
        "dateCosignature": "2019-06-07+02:00",
        "dateRetraitCosignature": null,
        "edite": "false"
      },
      {
        "acteur": {
          "acteurRef": "PA760658"
        },
        "dateCosignature": "2019-06-07+02:00",
        "dateRetraitCosignature": null,
        "edite": "false"
      },
      {
        "acteur": {
          "acteurRef": "PA720268"
        },
        "dateCosignature": "2019-06-07+02:00",
        "dateRetraitCosignature": null,
        "edite": "false"
      },
      {
        "acteur": {
          "acteurRef": "PA719710"
        },
        "dateCosignature": "2019-06-07+02:00",
        "dateRetraitCosignature": null,
        "edite": "false"
      },
      {
        "acteur": {
          "acteurRef": "PA722382"
        },
        "dateCosignature": "2019-06-07+02:00",
        "dateRetraitCosignature": null,
        "edite": "false"
      },
      {
        "acteur": {
          "acteurRef": "PA643175"
        },
        "dateCosignature": "2019-06-07+02:00",
        "dateRetraitCosignature": null,
        "edite": "false"
      },
      {
        "acteur": {
          "acteurRef": "PA607193"
        },
        "dateCosignature": "2019-06-07+02:00",
        "dateRetraitCosignature": null,
        "edite": "false"
      },
      {
        "acteur": {
          "acteurRef": "PA719480"
        },
        "dateCosignature": "2019-06-07+02:00",
        "dateRetraitCosignature": null,
        "edite": "false"
      },
      {
        "acteur": {
          "acteurRef": "PA267336"
        },
        "dateCosignature": "2019-06-07+02:00",
        "dateRetraitCosignature": null,
        "edite": "false"
      },
      {
        "acteur": {
          "acteurRef": "PA720560"
        },
        "dateCosignature": "2019-06-07+02:00",
        "dateRetraitCosignature": null,
        "edite": "false"
      },
      {
        "acteur": {
          "acteurRef": "PA720790"
        },
        "dateCosignature": "2019-06-07+02:00",
        "dateRetraitCosignature": null,
        "edite": "false"
      },
      {
        "acteur": {
          "acteurRef": "PA721764"
        },
        "dateCosignature": "2019-06-07+02:00",
        "dateRetraitCosignature": null,
        "edite": "false"
      },
      {
        "acteur": {
          "acteurRef": "PA722054"
        },
        "dateCosignature": "2019-06-07+02:00",
        "dateRetraitCosignature": null,
        "edite": "false"
      },
      {
        "acteur": {
          "acteurRef": "PA721150"
        },
        "dateCosignature": "2019-06-07+02:00",
        "dateRetraitCosignature": null,
        "edite": "false"
      },
      {
        "acteur": {
          "acteurRef": "PA719060"
        },
        "dateCosignature": "2019-06-07+02:00",
        "dateRetraitCosignature": null,
        "edite": "false"
      },
      {
        "acteur": {
          "acteurRef": "PA719778"
        },
        "dateCosignature": "2019-06-07+02:00",
        "dateRetraitCosignature": null,
        "edite": "false"
      },
      {
        "acteur": {
          "acteurRef": "PA719798"
        },
        "dateCosignature": "2019-06-07+02:00",
        "dateRetraitCosignature": null,
        "edite": "false"
      },
      {
        "acteur": {
          "acteurRef": "PA720022"
        },
        "dateCosignature": "2019-06-07+02:00",
        "dateRetraitCosignature": null,
        "edite": "false"
      },
      {
        "acteur": {
          "acteurRef": "PA719006"
        },
        "dateCosignature": "2019-06-07+02:00",
        "dateRetraitCosignature": null,
        "edite": "false"
      },
      {
        "acteur": {
          "acteurRef": "PA722244"
        },
        "dateCosignature": "2019-06-07+02:00",
        "dateRetraitCosignature": null,
        "edite": "false"
      },
      {
        "acteur": {
          "acteurRef": "PA719850"
        },
        "dateCosignature": "2019-06-07+02:00",
        "dateRetraitCosignature": null,
        "edite": "false"
      },
      {
        "acteur": {
          "acteurRef": "PA720492"
        },
        "dateCosignature": "2019-06-07+02:00",
        "dateRetraitCosignature": null,
        "edite": "false"
      },
      {
        "acteur": {
          "acteurRef": "PA720402"
        },
        "dateCosignature": "2019-06-07+02:00",
        "dateRetraitCosignature": null,
        "edite": "false"
      },
      {
        "acteur": {
          "acteurRef": "PA607595"
        },
        "dateCosignature": "2019-06-07+02:00",
        "dateRetraitCosignature": null,
        "edite": "false"
      },
      {
        "acteur": {
          "acteurRef": "PA720500"
        },
        "dateCosignature": "2019-06-07+02:00",
        "dateRetraitCosignature": null,
        "edite": "false"
      },
      {
        "acteur": {
          "acteurRef": "PA720590"
        },
        "dateCosignature": "2019-06-07+02:00",
        "dateRetraitCosignature": null,
        "edite": "false"
      },
      {
        "acteur": {
          "acteurRef": "PA721458"
        },
        "dateCosignature": "2019-06-07+02:00",
        "dateRetraitCosignature": null,
        "edite": "false"
      },
      {
        "acteur": {
          "acteurRef": "PA722078"
        },
        "dateCosignature": "2019-06-07+02:00",
        "dateRetraitCosignature": null,
        "edite": "false"
      },
      {
        "acteur": {
          "acteurRef": "PA720960"
        },
        "dateCosignature": "2019-06-07+02:00",
        "dateRetraitCosignature": null,
        "edite": "false"
      },
      {
        "acteur": {
          "acteurRef": "PA719592"
        },
        "dateCosignature": "2019-06-07+02:00",
        "dateRetraitCosignature": null,
        "edite": "false"
      },
      {
        "acteur": {
          "acteurRef": "PA721542"
        },
        "dateCosignature": "2019-06-07+02:00",
        "dateRetraitCosignature": null,
        "edite": "false"
      },
      {
        "acteur": {
          "acteurRef": "PA719692"
        },
        "dateCosignature": "2019-06-07+02:00",
        "dateRetraitCosignature": null,
        "edite": "false"
      }
    ]
  },
  "depotAmendements": null
}