{
  "@xmlns": "http://schemas.assemblee-nationale.fr/referentiel",
  "@xmlns:xsi": "http://www.w3.org/2001/XMLSchema-instance",
  "@xsi:type": "texteLoi_Type",
  "uid": "PIONANR5L15BTC2119",
  "legislature": "15",
  "cycleDeVie": {
    "chrono": {
      "dateCreation": "2019-07-09T00:00:00.000+02:00",
      "dateDepot": "2019-07-09T00:00:00.000+02:00",
      "datePublication": null,
      "datePublicationWeb": "2019-07-09T10:15:00.000+02:00"
    }
  },
  "denominationStructurelle": "Proposition de loi",
  "provenance": "Texte Déposé",
  "titres": {
    "titrePrincipal": "proposition de loi sur la proposition de loi, après engagement de la procédure accélérée, de M. Guillaume Vuilletet et plusieurs de ses collègues visant à faciliter la gestion et la sortie de l'indivision successorale et l'exploitation d'un aérodrome en Polynésie française (2085).",
    "titrePrincipalCourt": "indivision successorale et exploitation d'un aérodrome Polynésie française"
  },
  "divisions": null,
  "dossierRef": "DLR5L15N37599",
  "redacteur": null,
  "classification": {
    "famille": {
      "depot": {
        "code": "INITDEP",
        "libelle": "Initiative en 1er Dépôt"
      },
      "classe": {
        "code": "PIONLOI",
        "libelle": "Proposition de loi"
      }
    },
    "type": {
      "code": "PION",
      "libelle": "Proposition de loi"
    },
    "sousType": null,
    "statutAdoption": "ADOPTCOM"
  },
  "auteurs": {
    "auteur": [
      {
        "acteur": {
          "acteurRef": "PA721262",
          "qualite": "rapporteur"
        }
      },
      {
        "organe": {
          "organeRef": "PO59051"
        }
      }
    ]
  },
  "correction": null,
  "notice": {
    "numNotice": "2119",
    "formule": "sur la proposition de loi, après engagement de la procédure accélérée, de M. Guillaume Vuilletet et plusieurs de ses collègues visant à faciliter la gestion et la sortie de l'indivision successorale et l'exploitation d'un aérodrome en Polynésie française (2085).",
    "adoptionConforme": "false"
  },
  "indexation": null,
  "imprimerie": {
    "prix": "0.75"
  },
  "coSignataires": null,
  "depotAmendements": {
    "amendementsSeance": {
      "amendable": "true",
      "dateLimiteDepot": null
    },
    "amendementsCommission": {
      "commission": {
        "organeRef": "PO59051",
        "amendable": "true",
        "dateLimiteDepot": null
      }
    }
  }
}