{
  "@xmlns": "http://schemas.assemblee-nationale.fr/referentiel",
  "@xmlns:xsi": "http://www.w3.org/2001/XMLSchema-instance",
  "@xsi:type": "DossierMissionControle_Type",
  "uid": "DLR5L15N36668",
  "legislature": "15",
  "titreDossier": {
    "titre": "Collectivités territoriales : action de l'État dans l'exercice de ses missions régaliennes en Seine-Saint-Denis",
    "titreChemin": "action_etat_missions_regaliennes_seine-saint-denis",
    "senatChemin": null
  },
  "procedureParlementaire": {
    "code": "19",
    "libelle": "Rapport d'information sans mission"
  },
  "initiateur": null,
  "actesLegislatifs": {
    "acteLegislatif": {
      "@xsi:type": "Etape_Type",
      "uid": "L15-AN20-36668",
      "codeActe": "AN20",
      "libelleActe": {
        "nomCanonique": "Travaux"
      },
      "organeRef": "PO717460",
      "dateActe": null,
      "actesLegislatifs": {
        "acteLegislatif": {
          "@xsi:type": "DepotRapport_Type",
          "uid": "L15-VD185700",
          "codeActe": "AN20-RAPPORT",
          "libelleActe": {
            "nomCanonique": "Dépôt de rapport",
            "libelleCourt": "Dépôt de rapport"
          },
          "organeRef": "PO420375",
          "dateActe": "2018-05-31T00:00:00.000+02:00",
          "actesLegislatifs": null,
          "texteAssocie": "RINFANR5L15B1014",
          "texteAdopte": null
        }
      }
    }
  },
  "fusionDossier": null
}