{
  "@xmlns": "http://schemas.assemblee-nationale.fr/referentiel",
  "@xmlns:xsi": "http://www.w3.org/2001/XMLSchema-instance",
  "@xsi:type": "texteLoi_Type",
  "uid": "PRJLANR5L15BTC0105",
  "legislature": "15",
  "cycleDeVie": {
    "chrono": {
      "dateCreation": "2017-07-20T00:00:00.000+02:00",
      "dateDepot": "2017-07-20T00:00:00.000+02:00",
      "datePublication": "2017-07-21T00:00:00.000+02:00",
      "datePublicationWeb": "2017-07-20T18:55:00.000+02:00"
    }
  },
  "denominationStructurelle": "Projet de loi",
  "provenance": "Texte Déposé",
  "titres": {
    "titrePrincipal": "projet de loi organique  sur le projet de loi organique, adopté par le Sénat après engagement de la procédure accélérée, pour la régulation de la vie publique (n°99).",
    "titrePrincipalCourt": "Régulation de la vie publique (loi organique)"
  },
  "divisions": null,
  "dossierRef": "DLR5L15N35824",
  "redacteur": null,
  "classification": {
    "famille": {
      "depot": {
        "code": "INITNAV",
        "libelle": "Initiative en Navette"
      },
      "classe": {
        "code": "PRJLOI",
        "libelle": "Projet de loi"
      },
      "espece": {
        "code": "ORG",
        "libelle": "organique"
      }
    },
    "type": {
      "code": "PRJL",
      "libelle": "Projet de loi"
    },
    "sousType": {
      "code": "ORG",
      "libelle": "organique",
      "libelleEdition": "organique"
    },
    "statutAdoption": "ADOPTCOM"
  },
  "auteurs": {
    "auteur": [
      {
        "acteur": {
          "acteurRef": "PA721908",
          "qualite": "rapporteur"
        }
      },
      {
        "organe": {
          "organeRef": "PO59051"
        }
      }
    ]
  },
  "correction": null,
  "notice": {
    "numNotice": "105",
    "formule": "sur le projet de loi organique, adopté par le Sénat après engagement de la procédure accélérée, pour la régulation de la vie publique (n°99).",
    "adoptionConforme": "false"
  },
  "indexation": null,
  "imprimerie": {
    "prix": "8.5"
  },
  "coSignataires": null,
  "depotAmendements": {
    "amendementsSeance": {
      "amendable": "true",
      "dateLimiteDepot": null
    },
    "amendementsCommission": {
      "commission": [
        {
          "organeRef": "PO59051",
          "amendable": "true",
          "dateLimiteDepot": null
        },
        {
          "organeRef": "PO59048",
          "amendable": "true",
          "dateLimiteDepot": null
        }
      ]
    }
  }
}