{
  "@xmlns": "http://schemas.assemblee-nationale.fr/referentiel",
  "@xmlns:xsi": "http://www.w3.org/2001/XMLSchema-instance",
  "@xsi:type": "DossierMissionControle_Type",
  "uid": "DLR5L15N36450",
  "legislature": "15",
  "titreDossier": {
    "titre": "Union européenne : conformité au principe de subsidiarité de la proposition de règlement sur l’évaluation des technologies de la santé",
    "titreChemin": "reglement_evaluation_technologies_sante_avis_subsidiarite",
    "senatChemin": null
  },
  "procedureParlementaire": {
    "code": "19",
    "libelle": "Rapport d'information sans mission"
  },
  "initiateur": null,
  "actesLegislatifs": {
    "acteLegislatif": {
      "@xsi:type": "Etape_Type",
      "uid": "L15-AN20-36450",
      "codeActe": "AN20",
      "libelleActe": {
        "nomCanonique": "Travaux"
      },
      "organeRef": "PO717460",
      "dateActe": null,
      "actesLegislatifs": {
        "acteLegislatif": {
          "@xsi:type": "DepotRapport_Type",
          "uid": "L15-VD184836",
          "codeActe": "AN20-RAPPORT",
          "libelleActe": {
            "nomCanonique": "Dépôt de rapport",
            "libelleCourt": "Dépôt de rapport"
          },
          "organeRef": "PO415287",
          "dateActe": "2018-03-08T00:00:00.000+01:00",
          "actesLegislatifs": null,
          "texteAssocie": "RINFANR5L15B0755",
          "texteAdopte": null
        }
      }
    }
  },
  "fusionDossier": null
}