{
  "@xmlns": "http://schemas.assemblee-nationale.fr/referentiel",
  "@xmlns:xsi": "http://www.w3.org/2001/XMLSchema-instance",
  "@xsi:type": "DossierMissionInformation_Type",
  "uid": "DLR5L15N37175",
  "legislature": "15",
  "titreDossier": {
    "titre": "Mission d'information sur l'impôt universel",
    "titreChemin": "impot_universel_mi",
    "senatChemin": null
  },
  "procedureParlementaire": {
    "code": "10",
    "libelle": "Mission d'information"
  },
  "initiateur": {
    "organes": {
      "organe": {
        "organeRef": {
          "uid": "PO762089"
        }
      }
    }
  },
  "actesLegislatifs": {
    "acteLegislatif": {
      "@xsi:type": "Etape_Type",
      "uid": "L15-AN20-37175",
      "codeActe": "AN20",
      "libelleActe": {
        "nomCanonique": "Travaux"
      },
      "organeRef": "PO717460",
      "dateActe": null,
      "actesLegislatifs": {
        "acteLegislatif": {
          "@xsi:type": "Etape_Type",
          "uid": "L15-AN20-MISINF-37175",
          "codeActe": "AN20-MISINF",
          "libelleActe": {
            "nomCanonique": "Mission d'information",
            "libelleCourt": "Mission d'information"
          },
          "organeRef": "PO762089",
          "dateActe": null,
          "actesLegislatifs": {
            "acteLegislatif": {
              "@xsi:type": "CreationOrganeTemporaire_Type",
              "uid": "L15-VD188132",
              "codeActe": "AN20-MISINF-CREA",
              "libelleActe": {
                "nomCanonique": "Création d'une mission d'information",
                "libelleCourt": "Création d'une mission d'information"
              },
              "organeRef": "PO762089",
              "dateActe": "2019-01-24T00:00:00.000+01:00",
              "actesLegislatifs": null,
              "initiateurs": {
                "organeRef": "PO762089"
              }
            }
          }
        }
      }
    }
  },
  "fusionDossier": null
}