{
  "@xmlns": "http://schemas.assemblee-nationale.fr/referentiel",
  "@xmlns:xsi": "http://www.w3.org/2001/XMLSchema-instance",
  "@xsi:type": "texteLoi_Type",
  "uid": "AVISANR5L15B1938",
  "legislature": "15",
  "cycleDeVie": {
    "chrono": {
      "dateCreation": "2019-05-07T00:00:00.000+02:00",
      "dateDepot": "2019-05-07T00:00:00.000+02:00",
      "datePublication": "2019-05-20T00:00:00.000+02:00",
      "datePublicationWeb": "2019-05-16T21:05:00.000+02:00"
    }
  },
  "denominationStructurelle": "Avis",
  "provenance": "Commission",
  "titres": {
    "titrePrincipal": "avis  sur le projet de loi, adopté par le Sénat, après engagement de la procédure accélérée, d'orientation des mobilités (n°1831).",
    "titrePrincipalCourt": "avis  sur le projet de loi, adopté par le Sénat, après engagement de la procédure accélérée, d'orientation des mobilités (n°1831)."
  },
  "divisions": null,
  "dossierRef": "DLR5L15N37029",
  "redacteur": null,
  "classification": {
    "famille": {
      "depot": {
        "code": "RAPINIT",
        "libelle": "Rapport sur une initiative"
      },
      "classe": {
        "code": "AVIS",
        "libelle": "Avis"
      }
    },
    "type": {
      "code": "AVIS",
      "libelle": "Avis"
    },
    "sousType": null,
    "statutAdoption": null
  },
  "auteurs": {
    "auteur": [
      {
        "acteur": {
          "acteurRef": "PA722038",
          "qualite": "rapporteur pour avis"
        }
      },
      {
        "organe": {
          "organeRef": "PO419610"
        }
      }
    ]
  },
  "correction": null,
  "notice": {
    "numNotice": "1938",
    "formule": "sur le projet de loi, adopté par le Sénat, après engagement de la procédure accélérée, d'orientation des mobilités (n°1831).",
    "adoptionConforme": "false"
  },
  "indexation": null,
  "imprimerie": {
    "prix": "3.0",
    "ISSN": null,
    "ISBN": null,
    "DIAN": null,
    "nbPage": "0"
  },
  "coSignataires": null,
  "depotAmendements": null
}