{
  "@xmlns": "http://schemas.assemblee-nationale.fr/referentiel",
  "@xmlns:xsi": "http://www.w3.org/2001/XMLSchema-instance",
  "@xsi:type": "documentEtudeImpact_Type",
  "uid": "ETDISNR5S299B0105",
  "legislature": null,
  "cycleDeVie": {
    "chrono": {
      "dateCreation": "2017-11-23T00:00:00.000+01:00",
      "dateDepot": "2017-11-22T00:00:00.000+01:00",
      "datePublication": "2017-12-19T00:00:00.000+01:00",
      "datePublicationWeb": null
    }
  },
  "denominationStructurelle": "Projet de loi",
  "provenance": "Texte Déposé",
  "titres": {
    "titrePrincipal": "Etude d'impact sur le projet de loi portant diverses dispositions d'adaptation au droit de l'Union européenne dans le domaine de la sécurité",
    "titrePrincipalCourt": "Adaptation au droit de l'UE dans le domaine de la sécurité"
  },
  "divisions": null,
  "dossierRef": "DLR5L15N36157",
  "redacteur": null,
  "classification": {
    "famille": {
      "depot": {
        "code": "INITDEP",
        "libelle": "Initiative en 1er Dépôt"
      },
      "classe": {
        "code": "PRJLOI",
        "libelle": "Projet de loi"
      }
    },
    "type": {
      "code": "ETDI",
      "libelle": "Etude d'impact"
    },
    "sousType": null,
    "statutAdoption": null
  },
  "auteurs": {
    "auteur": {
      "acteur": {
        "acteurRef": "PA345619",
        "qualite": "auteur"
      }
    }
  },
  "correction": null,
  "notice": {
    "numNotice": "105",
    "formule": "portant diverses dispositions d'adaptation au droit de l'Union européenne dans le domaine de la sécurité",
    "adoptionConforme": "false"
  },
  "indexation": null,
  "imprimerie": null
}