{
  "@xmlns": "http://schemas.assemblee-nationale.fr/referentiel",
  "@xmlns:xsi": "http://www.w3.org/2001/XMLSchema-instance",
  "@xsi:type": "DossierLegislatif_Type",
  "uid": "DLR5L15N37837",
  "legislature": "15",
  "titreDossier": {
    "titre": "Nombre de sièges à pourvoir au sein des conseils municipaux",
    "titreChemin": "nombre_sieges_conseils_municipaux",
    "senatChemin": "http://www.senat.fr/dossier-legislatif/ppl18-495.html"
  },
  "procedureParlementaire": {
    "code": "2",
    "libelle": "Proposition de loi ordinaire"
  },
  "initiateur": {
    "acteurs": {
      "acteur": {
        "acteurRef": "PA267112",
        "mandatRef": "PM703608"
      }
    },
    "organes": {
      "organe": {
        "organeRef": {
          "uid": "PO78718"
        }
      }
    }
  },
  "actesLegislatifs": {
    "acteLegislatif": {
      "@xsi:type": "Etape_Type",
      "uid": "L15-SN1-37837",
      "codeActe": "SN1",
      "libelleActe": {
        "nomCanonique": "1ère lecture (1ère assemblée saisie)",
        "libelleCourt": "1ère lecture"
      },
      "organeRef": "PO78718",
      "dateActe": null,
      "actesLegislatifs": {
        "acteLegislatif": [
          {
            "@xsi:type": "DepotInitiative_Type",
            "uid": "L15-VD190980DI",
            "codeActe": "SN1-DEPOT",
            "libelleActe": {
              "nomCanonique": "1er dépôt d'une initiative.",
              "libelleCourt": "1er dépôt d'une initiative."
            },
            "organeRef": "PO78718",
            "dateActe": "2019-05-14T00:00:00.000+02:00",
            "actesLegislatifs": null,
            "texteAssocie": "PIONSNR5S319B0495"
          },
          {
            "@xsi:type": "Etape_Type",
            "uid": "L15-SN1-COM-37837",
            "codeActe": "SN1-COM",
            "libelleActe": {
              "nomCanonique": "Travaux des commissions",
              "libelleCourt": "Travaux des commissions"
            },
            "organeRef": "PO78718",
            "dateActe": null,
            "actesLegislatifs": {
              "acteLegislatif": {
                "@xsi:type": "Etape_Type",
                "uid": "L15-VD190981CF",
                "codeActe": "SN1-COM-FOND",
                "libelleActe": {
                  "nomCanonique": "Travaux de la commission saisie au fond",
                  "libelleCourt": "Travaux de la commission saisie au fond"
                },
                "organeRef": "PO211495",
                "dateActe": null,
                "actesLegislatifs": {
                  "acteLegislatif": {
                    "@xsi:type": "SaisieComFond_Type",
                    "uid": "L15-VD190981CFS",
                    "codeActe": "SN1-COM-FOND-SAISIE",
                    "libelleActe": {
                      "nomCanonique": "Renvoi en commission au fond",
                      "libelleCourt": "Renvoi en commission au fond"
                    },
                    "organeRef": "PO211495",
                    "dateActe": "2019-05-14T00:00:00.000+02:00",
                    "actesLegislatifs": null
                  }
                }
              }
            }
          }
        ]
      }
    }
  },
  "fusionDossier": null
}