{
  "@xmlns": "http://schemas.assemblee-nationale.fr/referentiel",
  "@xmlns:xsi": "http://www.w3.org/2001/XMLSchema-instance",
  "@xsi:type": "DossierResolutionAN",
  "uid": "DLR5L15N36805",
  "legislature": "15",
  "titreDossier": {
    "titre": "Justice : politique nationale de protection des mineurs contre la pornographie",
    "titreChemin": "politique_protection_mineurs_pornographie",
    "senatChemin": null
  },
  "procedureParlementaire": {
    "code": "8",
    "libelle": "Résolution"
  },
  "initiateur": {
    "acteurs": {
      "acteur": {
        "acteurRef": "PA608416",
        "mandatRef": "PM723540"
      }
    }
  },
  "actesLegislatifs": {
    "acteLegislatif": {
      "@xsi:type": "Etape_Type",
      "uid": "L15-ANLUNI-36805",
      "codeActe": "ANLUNI",
      "libelleActe": {
        "nomCanonique": "Lecture unique"
      },
      "organeRef": "PO717460",
      "dateActe": null,
      "actesLegislatifs": {
        "acteLegislatif": [
          {
            "@xsi:type": "DepotInitiative_Type",
            "uid": "L15-VD186489DI",
            "codeActe": "ANLUNI-DEPOT",
            "libelleActe": {
              "nomCanonique": "1er dépôt d'une initiative.",
              "libelleCourt": "1er dépôt d'une initiative."
            },
            "organeRef": "PO717460",
            "dateActe": "2018-07-19T00:00:00.000+02:00",
            "actesLegislatifs": null,
            "texteAssocie": "PNREANR5L15B1183"
          },
          {
            "@xsi:type": "Etape_Type",
            "uid": "L15-ANLUNI-COM-36805",
            "codeActe": "ANLUNI-COM",
            "libelleActe": {
              "nomCanonique": "Travaux des commissions",
              "libelleCourt": "Travaux des commissions"
            },
            "organeRef": "PO717460",
            "dateActe": null,
            "actesLegislatifs": {
              "acteLegislatif": {
                "@xsi:type": "Etape_Type",
                "uid": "L15-VD186490CF",
                "codeActe": "ANLUNI-COM-FOND",
                "libelleActe": {
                  "nomCanonique": "Travaux de la commission saisie au fond",
                  "libelleCourt": "Travaux de la commission saisie au fond"
                },
                "organeRef": "PO59051",
                "dateActe": null,
                "actesLegislatifs": {
                  "acteLegislatif": {
                    "@xsi:type": "SaisieComFond_Type",
                    "uid": "L15-VD186490CFS",
                    "codeActe": "ANLUNI-COM-FOND-SAISIE",
                    "libelleActe": {
                      "nomCanonique": "Renvoi en commission au fond",
                      "libelleCourt": "Renvoi en commission au fond"
                    },
                    "organeRef": "PO59051",
                    "dateActe": "2018-07-19T00:00:00.000+02:00",
                    "actesLegislatifs": null
                  }
                }
              }
            }
          }
        ]
      }
    }
  },
  "fusionDossier": null
}