{
  "@xmlns": "http://schemas.assemblee-nationale.fr/referentiel",
  "@xmlns:xsi": "http://www.w3.org/2001/XMLSchema-instance",
  "@xsi:type": "DossierLegislatif_Type",
  "uid": "DLR5L15N37201",
  "legislature": "15",
  "titreDossier": {
    "titre": "Projets de construction et innovation",
    "titreChemin": "ratification_ordonnance_2018-937",
    "senatChemin": "http://www.senat.fr/dossier-legislatif/pjl18-248.html"
  },
  "procedureParlementaire": {
    "code": "1",
    "libelle": "Projet de loi ordinaire"
  },
  "initiateur": {
    "acteurs": {
      "acteur": {
        "acteurRef": "PA345619",
        "mandatRef": "PM725692"
      }
    }
  },
  "actesLegislatifs": {
    "acteLegislatif": {
      "@xsi:type": "Etape_Type",
      "uid": "L15-SN1-37201",
      "codeActe": "SN1",
      "libelleActe": {
        "nomCanonique": "1ère lecture (1ère assemblée saisie)",
        "libelleCourt": "1ère lecture"
      },
      "organeRef": "PO78718",
      "dateActe": null,
      "actesLegislatifs": {
        "acteLegislatif": [
          {
            "@xsi:type": "DepotInitiative_Type",
            "uid": "L15-VD188226DI",
            "codeActe": "SN1-DEPOT",
            "libelleActe": {
              "nomCanonique": "1er dépôt d'une initiative.",
              "libelleCourt": "1er dépôt d'une initiative."
            },
            "organeRef": "PO78718",
            "dateActe": "2019-01-16T00:00:00.000+01:00",
            "actesLegislatifs": null,
            "texteAssocie": "PRJLSNR5S319B0248"
          },
          {
            "@xsi:type": "Etape_Type",
            "uid": "L15-SN1-COM-37201",
            "codeActe": "SN1-COM",
            "libelleActe": {
              "nomCanonique": "Travaux des commissions",
              "libelleCourt": "Travaux des commissions"
            },
            "organeRef": "PO78718",
            "dateActe": null,
            "actesLegislatifs": {
              "acteLegislatif": {
                "@xsi:type": "Etape_Type",
                "uid": "L15-VD188227CF",
                "codeActe": "SN1-COM-FOND",
                "libelleActe": {
                  "nomCanonique": "Travaux de la commission saisie au fond",
                  "libelleCourt": "Travaux de la commission saisie au fond"
                },
                "organeRef": "PO516753",
                "dateActe": null,
                "actesLegislatifs": {
                  "acteLegislatif": {
                    "@xsi:type": "SaisieComFond_Type",
                    "uid": "L15-VD188227CFS",
                    "codeActe": "SN1-COM-FOND-SAISIE",
                    "libelleActe": {
                      "nomCanonique": "Renvoi en commission au fond",
                      "libelleCourt": "Renvoi en commission au fond"
                    },
                    "organeRef": "PO516753",
                    "dateActe": "2019-01-16T00:00:00.000+01:00",
                    "actesLegislatifs": null
                  }
                }
              }
            }
          }
        ]
      }
    }
  },
  "fusionDossier": null
}