{
  "@xmlns": "http://schemas.assemblee-nationale.fr/referentiel",
  "@xmlns:xsi": "http://www.w3.org/2001/XMLSchema-instance",
  "@xsi:type": "DossierMissionControle_Type",
  "uid": "DLR5L15N37308",
  "legislature": "15",
  "titreDossier": {
    "titre": "Collectivités territoriales : adaptation de l’organisation des communes nouvelles à la diversité des territoires",
    "titreChemin": "adaptation_organisation_communes_nouvelles_ddf",
    "senatChemin": null
  },
  "procedureParlementaire": {
    "code": "19",
    "libelle": "Rapport d'information sans mission"
  },
  "initiateur": null,
  "actesLegislatifs": {
    "acteLegislatif": {
      "@xsi:type": "Etape_Type",
      "uid": "L15-AN20-37308",
      "codeActe": "AN20",
      "libelleActe": {
        "nomCanonique": "Travaux"
      },
      "organeRef": "PO717460",
      "dateActe": null,
      "actesLegislatifs": {
        "acteLegislatif": {
          "@xsi:type": "DepotRapport_Type",
          "uid": "L15-VD188653",
          "codeActe": "AN20-RAPPORT",
          "libelleActe": {
            "nomCanonique": "Dépôt de rapport",
            "libelleCourt": "Dépôt de rapport"
          },
          "organeRef": "PO201269",
          "dateActe": "2019-03-06T00:00:00.000+01:00",
          "actesLegislatifs": null,
          "texteAssocie": "RINFANR5L15B1736",
          "texteAdopte": null
        }
      }
    }
  },
  "fusionDossier": null
}