{
  "@xmlns": "http://schemas.assemblee-nationale.fr/referentiel",
  "@xmlns:xsi": "http://www.w3.org/2001/XMLSchema-instance",
  "@xsi:type": "texteLoi_Type",
  "uid": "PRJLSNR5S339B0107",
  "legislature": null,
  "cycleDeVie": {
    "chrono": {
      "dateCreation": "2019-11-08T00:00:00.000+01:00",
      "dateDepot": "2019-11-07T00:00:00.000+01:00",
      "datePublication": null,
      "datePublicationWeb": null
    }
  },
  "denominationStructurelle": "Projet de loi",
  "provenance": "Texte Déposé",
  "titres": {
    "titrePrincipal": "projet de loi ratifiant l'ordonnance n° 2019-848 du 21 août 2019 portant extension du code de commerce aux îles Wallis et Futuna",
    "titrePrincipalCourt": "ratifiant l'ordonnance n° 2019-848 du 21 août 2019 portant extension du code de commerce aux îles Wallis et Futuna"
  },
  "divisions": null,
  "dossierRef": "DLR5L15N37947",
  "redacteur": null,
  "classification": {
    "famille": {
      "depot": {
        "code": "INITDEP",
        "libelle": "Initiative en 1er Dépôt"
      },
      "classe": {
        "code": "PRJLOI",
        "libelle": "Projet de loi"
      }
    },
    "type": {
      "code": "PRJL",
      "libelle": "Projet de loi"
    },
    "sousType": null,
    "statutAdoption": null
  },
  "auteurs": {
    "auteur": {
      "acteur": {
        "acteurRef": "PA345619",
        "qualite": "auteur"
      }
    }
  },
  "correction": null,
  "notice": {
    "numNotice": "107",
    "formule": "ratifiant l'ordonnance n° 2019-848 du 21 août 2019 portant extension du code de commerce aux îles Wallis et Futuna",
    "adoptionConforme": "false"
  },
  "indexation": null,
  "imprimerie": {
    "prix": null,
    "ISSN": null,
    "ISBN": null,
    "DIAN": null,
    "nbPage": null
  },
  "coSignataires": {
    "coSignataire": {
      "acteur": {
        "acteurRef": "PA702191"
      },
      "dateCosignature": "2019-11-07+01:00",
      "dateRetraitCosignature": null,
      "edite": "true"
    }
  },
  "depotAmendements": {
    "amendementsSeance": {
      "amendable": "false",
      "dateLimiteDepot": null
    }
  }
}