{
  "@xmlns": "http://schemas.assemblee-nationale.fr/referentiel",
  "@xmlns:xsi": "http://www.w3.org/2001/XMLSchema-instance",
  "@xsi:type": "texteLoi_Type",
  "uid": "PIONANR5L15B1895",
  "legislature": "15",
  "cycleDeVie": {
    "chrono": {
      "dateCreation": "2019-04-11T00:00:00.000+02:00",
      "dateDepot": "2019-04-30T00:00:00.000+02:00",
      "datePublication": "2019-05-10T00:00:00.000+02:00",
      "datePublicationWeb": "2019-05-02T15:55:00.000+02:00"
    }
  },
  "denominationStructurelle": "Proposition de loi",
  "provenance": "Texte Déposé",
  "titres": {
    "titrePrincipal": "proposition de loi demandant l'extension de la pratique de l'interruption volontaire de grossesse instrumentale aux sages-femmes",
    "titrePrincipalCourt": "extension pratique interruption volontaire de grossesse aux sages-femmes"
  },
  "divisions": null,
  "dossierRef": "DLR5L15N37414",
  "redacteur": null,
  "classification": {
    "famille": {
      "depot": {
        "code": "INITDEP",
        "libelle": "Initiative en 1er Dépôt"
      },
      "classe": {
        "code": "PIONLOI",
        "libelle": "Proposition de loi"
      }
    },
    "type": {
      "code": "PION",
      "libelle": "Proposition de loi"
    },
    "sousType": null,
    "statutAdoption": null
  },
  "auteurs": {
    "auteur": {
      "acteur": {
        "acteurRef": "PA720892",
        "qualite": "auteur"
      }
    }
  },
  "correction": null,
  "notice": {
    "numNotice": "1895",
    "formule": "demandant l'extension de la pratique de l'interruption volontaire de grossesse instrumentale aux sages-femmes",
    "adoptionConforme": "false"
  },
  "indexation": null,
  "imprimerie": null,
  "coSignataires": {
    "coSignataire": [
      {
        "acteur": {
          "acteurRef": "PA588884"
        },
        "dateCosignature": "2019-04-30+02:00",
        "dateRetraitCosignature": null,
        "edite": "false"
      },
      {
        "acteur": {
          "acteurRef": "PA720286"
        },
        "dateCosignature": "2019-04-30+02:00",
        "dateRetraitCosignature": null,
        "edite": "false"
      },
      {
        "acteur": {
          "acteurRef": "PA720846"
        },
        "dateCosignature": "2019-04-30+02:00",
        "dateRetraitCosignature": null,
        "edite": "false"
      },
      {
        "acteur": {
          "acteurRef": "PA2150"
        },
        "dateCosignature": "2019-04-30+02:00",
        "dateRetraitCosignature": null,
        "edite": "false"
      },
      {
        "acteur": {
          "acteurRef": "PA721960"
        },
        "dateCosignature": "2019-04-30+02:00",
        "dateRetraitCosignature": null,
        "edite": "false"
      },
      {
        "acteur": {
          "acteurRef": "PA719578"
        },
        "dateCosignature": "2019-04-30+02:00",
        "dateRetraitCosignature": null,
        "edite": "false"
      },
      {
        "acteur": {
          "acteurRef": "PA720422"
        },
        "dateCosignature": "2019-04-30+02:00",
        "dateRetraitCosignature": null,
        "edite": "false"
      },
      {
        "acteur": {
          "acteurRef": "PA721062"
        },
        "dateCosignature": "2019-04-30+02:00",
        "dateRetraitCosignature": null,
        "edite": "false"
      },
      {
        "acteur": {
          "acteurRef": "PA721226"
        },
        "dateCosignature": "2019-04-30+02:00",
        "dateRetraitCosignature": null,
        "edite": "false"
      },
      {
        "acteur": {
          "acteurRef": "PA718860"
        },
        "dateCosignature": "2019-04-30+02:00",
        "dateRetraitCosignature": null,
        "edite": "false"
      }
    ]
  },
  "depotAmendements": {
    "amendementsSeance": {
      "amendable": "false",
      "dateLimiteDepot": null
    },
    "amendementsCommission": {
      "commission": {
        "organeRef": "PO420120",
        "amendable": "true",
        "dateLimiteDepot": null
      }
    }
  }
}