{
  "@xmlns": "http://schemas.assemblee-nationale.fr/referentiel",
  "@xmlns:xsi": "http://www.w3.org/2001/XMLSchema-instance",
  "@xsi:type": "texteLoi_Type",
  "uid": "PRJLANR5L15BTC1212",
  "legislature": "15",
  "cycleDeVie": {
    "chrono": {
      "dateCreation": "2018-07-25T00:00:00.000+02:00",
      "dateDepot": "2018-07-25T00:00:00.000+02:00",
      "datePublication": "2018-08-01T00:00:00.000+02:00",
      "datePublicationWeb": "2018-07-30T13:15:00.000+02:00"
    }
  },
  "denominationStructurelle": "Projet de loi",
  "provenance": "Texte Déposé",
  "titres": {
    "titrePrincipal": "projet de loi  sur le projet de loi, adopté par le Sénat après engagement de la procédure accélérée, relatif à la lutte contre la fraude (n°1142).",
    "titrePrincipalCourt": "Lutte contre la fraude"
  },
  "divisions": null,
  "dossierRef": "DLR5L15N36530",
  "redacteur": null,
  "classification": {
    "famille": {
      "depot": {
        "code": "INITNAV",
        "libelle": "Initiative en Navette"
      },
      "classe": {
        "code": "PRJLOI",
        "libelle": "Projet de loi"
      }
    },
    "type": {
      "code": "PRJL",
      "libelle": "Projet de loi"
    },
    "sousType": null,
    "statutAdoption": "ADOPTCOM"
  },
  "auteurs": {
    "auteur": [
      {
        "acteur": {
          "acteurRef": "PA720298",
          "qualite": "rapporteur"
        }
      },
      {
        "organe": {
          "organeRef": "PO59048"
        }
      }
    ]
  },
  "correction": null,
  "notice": {
    "numNotice": "1212",
    "formule": "sur le projet de loi, adopté par le Sénat après engagement de la procédure accélérée, relatif à la lutte contre la fraude (n°1142).",
    "adoptionConforme": "false"
  },
  "indexation": null,
  "imprimerie": {
    "prix": "9.5"
  },
  "coSignataires": null,
  "depotAmendements": {
    "amendementsSeance": {
      "amendable": "true",
      "dateLimiteDepot": null
    },
    "amendementsCommission": {
      "commission": [
        {
          "organeRef": "PO59051",
          "amendable": "true",
          "dateLimiteDepot": null
        },
        {
          "organeRef": "PO59048",
          "amendable": "true",
          "dateLimiteDepot": null
        }
      ]
    }
  }
}