{
  "@xmlns": "http://schemas.assemblee-nationale.fr/referentiel",
  "@xmlns:xsi": "http://www.w3.org/2001/XMLSchema-instance",
  "@xsi:type": "DossierCommissionEnquete_Type",
  "uid": "DLR5L15N37868",
  "legislature": "15",
  "titreDossier": {
    "titre": "Commission d'enquête chargée de faire la lumière sur les dysfonctionnements ayant conduit aux attaques commises à la préfecture de police de Paris le jeudi 3 octobre 2019",
    "titreChemin": "dysfonctionnements_attaques_prefecture_police_paris_3octobre2019_ce",
    "senatChemin": null
  },
  "procedureParlementaire": {
    "code": "9",
    "libelle": "Commission d'enquête"
  },
  "initiateur": {
    "acteurs": {
      "acteur": {
        "acteurRef": "PA330240",
        "mandatRef": "PM722492"
      }
    },
    "organes": {
      "organe": {
        "organeRef": {
          "uid": "PO717460"
        }
      }
    }
  },
  "actesLegislatifs": {
    "acteLegislatif": {
      "@xsi:type": "Etape_Type",
      "uid": "L15-AN20-37868",
      "codeActe": "AN20",
      "libelleActe": {
        "nomCanonique": "Travaux"
      },
      "organeRef": "PO717460",
      "dateActe": null,
      "actesLegislatifs": {
        "acteLegislatif": {
          "@xsi:type": "Etape_Type",
          "uid": "L15-AN20-COMENQ-37868",
          "codeActe": "AN20-COMENQ",
          "libelleActe": {
            "nomCanonique": "Commission d'enquête",
            "libelleCourt": "Commission d'enquête"
          },
          "organeRef": "PO767517",
          "dateActe": null,
          "actesLegislatifs": {
            "acteLegislatif": {
              "@xsi:type": "CreationOrganeTemporaire_Type",
              "uid": "L15-VD191072",
              "codeActe": "AN20-COMENQ-CREA",
              "libelleActe": {
                "nomCanonique": "Création d'une commission d'enquête",
                "libelleCourt": "Création d'une commission d'enquête"
              },
              "organeRef": "PO767517",
              "dateActe": "2019-10-16T00:00:00.000+02:00",
              "actesLegislatifs": null,
              "initiateurs": {
                "organeRef": "PO717460"
              }
            }
          }
        }
      }
    }
  },
  "fusionDossier": {
    "cause": "Examen commun",
    "dossierAbsorbantRef": "DLR5L15N37809"
  }
}