{
  "@xmlns": "http://schemas.assemblee-nationale.fr/referentiel",
  "@xmlns:xsi": "http://www.w3.org/2001/XMLSchema-instance",
  "@xsi:type": "texteLoi_Type",
  "uid": "RINFANR5L15B1624",
  "legislature": "15",
  "cycleDeVie": {
    "chrono": {
      "dateCreation": "2019-01-30T00:00:00.000+01:00",
      "dateDepot": "2019-01-30T00:00:00.000+01:00",
      "datePublication": "2019-02-05T00:00:00.000+01:00",
      "datePublicationWeb": "2019-02-01T16:20:00.000+01:00"
    }
  },
  "denominationStructurelle": "Rapport d'information",
  "provenance": "Commission",
  "titres": {
    "titrePrincipal": "rapport d'information déposé en application de l'article 145 du règlement, par la commission des finances, de l'économie générale et du contrôle budgétaire, en conclusion des travaux d'une mission d'information relative aux monnaies virtuelles",
    "titrePrincipalCourt": "Les monnaies virtuelles : vers un nouveau paradigme sociétal, économique et monétaire ?"
  },
  "divisions": null,
  "dossierRef": "DLR5L15N37191",
  "redacteur": null,
  "classification": {
    "famille": {
      "depot": {
        "code": "RAPAUT",
        "libelle": "Rapport autonome"
      },
      "classe": {
        "code": "RAPINF",
        "libelle": "Rapport d'information"
      },
      "espece": {
        "code": "MINFOCOMPER",
        "libelle": "d'une mission d'information constituée au sein d'une commission permanente"
      }
    },
    "type": {
      "code": "RINF",
      "libelle": "Rapport d'information"
    },
    "sousType": {
      "code": "MINFOCOMPER",
      "libelle": "d'une mission d'information constituée au sein d'une commission permanente"
    },
    "statutAdoption": null
  },
  "auteurs": {
    "auteur": [
      {
        "acteur": {
          "acteurRef": "PA721568",
          "qualite": "rapporteur"
        }
      },
      {
        "organe": {
          "organeRef": "PO59048"
        }
      }
    ]
  },
  "correction": null,
  "notice": {
    "numNotice": "1624",
    "formule": "déposé en application de l'article 145 du règlement, par la commission des finances, de l'économie générale et du contrôle budgétaire, en conclusion des travaux d'une mission d'information relative aux monnaies virtuelles",
    "adoptionConforme": "false"
  },
  "indexation": null,
  "imprimerie": {
    "prix": "4.0"
  },
  "coSignataires": null,
  "depotAmendements": null
}