{
  "@xmlns": "http://schemas.assemblee-nationale.fr/referentiel",
  "@xmlns:xsi": "http://www.w3.org/2001/XMLSchema-instance",
  "@xsi:type": "rapportParlementaire_Type",
  "uid": "RAPPANR5L15B0445",
  "legislature": "15",
  "cycleDeVie": {
    "chrono": {
      "dateCreation": "2017-12-05T00:00:00.000+01:00",
      "dateDepot": "2017-12-05T00:00:00.000+01:00",
      "datePublication": "2017-12-12T00:00:00.000+01:00",
      "datePublicationWeb": "2017-12-08T14:00:00.000+01:00"
    }
  },
  "denominationStructurelle": "Rapport",
  "provenance": "Commission",
  "titres": {
    "titrePrincipal": "rapport la commission mixte paritaire chargée de proposer un texte sur les dispositions restant en discussion du projet de loi ratifiant l'ordonnance n° 2017-644 du 27 avril 2017 relative à l'adaptation des dispositions législatives relatives au fonctionnement des ordres des professions de santé.",
    "titrePrincipalCourt": "rapport la commission mixte paritaire chargée de proposer un texte sur les dispositions restant en discussion du projet de loi ratifiant l'ordonnance n° 2017-644 du 27 avril 2017 relative à l'adaptation des dispositions législatives relatives au fonctionnement des ordres des professions de santé."
  },
  "divisions": null,
  "dossierRef": "DLR5L15N35847",
  "redacteur": null,
  "classification": {
    "famille": {
      "depot": {
        "code": "RAPINIT",
        "libelle": "Rapport sur une initiative"
      },
      "classe": {
        "code": "RAPPORT",
        "libelle": "Rapport"
      }
    },
    "type": {
      "code": "RAPP",
      "libelle": "Rapport"
    },
    "sousType": null,
    "statutAdoption": "ADOPTCOM"
  },
  "auteurs": {
    "auteur": [
      {
        "acteur": {
          "acteurRef": "PA719072",
          "qualite": "rapporteur"
        }
      },
      {
        "organe": {
          "organeRef": "PO739840"
        }
      }
    ]
  },
  "correction": null,
  "notice": {
    "numNotice": "445",
    "formule": "de la commission mixte paritaire chargée de proposer un texte sur les dispositions restant en discussion du projet de loi ratifiant l'ordonnance n° 2017-644 du 27 avril 2017 relative à l'adaptation des dispositions législatives relatives au fonctionnement des ordres des professions de santé.",
    "adoptionConforme": "false"
  },
  "indexation": null,
  "imprimerie": {
    "prix": "0.75"
  }
}