{
  "@xmlns": "http://schemas.assemblee-nationale.fr/referentiel",
  "@xmlns:xsi": "http://www.w3.org/2001/XMLSchema-instance",
  "@xsi:type": "texteLoi_Type",
  "uid": "PIONANR5L15B1132",
  "legislature": "15",
  "cycleDeVie": {
    "chrono": {
      "dateCreation": "2018-07-02T00:00:00.000+02:00",
      "dateDepot": "2018-07-02T00:00:00.000+02:00",
      "datePublication": "2018-07-09T00:00:00.000+02:00",
      "datePublicationWeb": "2018-07-04T10:15:00.000+02:00"
    }
  },
  "denominationStructurelle": "Proposition de loi",
  "provenance": "Texte Déposé",
  "titres": {
    "titrePrincipal": "proposition de loi constitutionnelle visant à prévoir, par défaut, une lecture unique dans chaque chambre",
    "titrePrincipalCourt": "Lecture unique dans chaque chambre"
  },
  "divisions": null,
  "dossierRef": "DLR5L15N36759",
  "redacteur": null,
  "classification": {
    "famille": {
      "depot": {
        "code": "INITDEP",
        "libelle": "Initiative en 1er Dépôt"
      },
      "classe": {
        "code": "PIONLOI",
        "libelle": "Proposition de loi"
      },
      "espece": {
        "code": "CONST",
        "libelle": "constitutionnelle"
      }
    },
    "type": {
      "code": "PION",
      "libelle": "Proposition de loi"
    },
    "sousType": {
      "code": "CONST",
      "libelle": "constitutionnelle",
      "libelleEdition": "constitutionnelle"
    },
    "statutAdoption": null
  },
  "auteurs": {
    "auteur": {
      "acteur": {
        "acteurRef": "PA2952",
        "qualite": "auteur"
      }
    }
  },
  "correction": {
    "typeCorrection": "Rectifié",
    "niveauCorrection": "1"
  },
  "notice": {
    "numNotice": "1132",
    "formule": "visant à prévoir, par défaut, une lecture unique dans chaque chambre",
    "adoptionConforme": "false"
  },
  "indexation": null,
  "imprimerie": null,
  "coSignataires": null,
  "depotAmendements": {
    "amendementsSeance": {
      "amendable": "false",
      "dateLimiteDepot": null
    },
    "amendementsCommission": {
      "commission": {
        "organeRef": "PO59051",
        "amendable": "true",
        "dateLimiteDepot": null
      }
    }
  }
}