{
  "@xmlns": "http://schemas.assemblee-nationale.fr/referentiel",
  "@xmlns:xsi": "http://www.w3.org/2001/XMLSchema-instance",
  "@xsi:type": "texteLoi_Type",
  "uid": "PIONSNR5S319BTC0562",
  "legislature": null,
  "cycleDeVie": {
    "chrono": {
      "dateCreation": "2019-06-20T00:00:00.000+02:00",
      "dateDepot": "2019-06-12T00:00:00.000+02:00",
      "datePublication": null,
      "datePublicationWeb": "2019-06-12T14:00:00.000+02:00"
    }
  },
  "denominationStructurelle": "Proposition de loi",
  "provenance": "Texte Déposé",
  "titres": {
    "titrePrincipal": "proposition de loi , en nouvelle lecture, sur la proposition de loi, adoptée, par l'Assemblée nationale, en nouvelle lecture, portant création d'une Agence nationale de la cohésion des territoires (n°518).",
    "titrePrincipalCourt": "Agence nationale de la cohésion des territoires"
  },
  "divisions": null,
  "dossierRef": "DLR5L15N36915",
  "redacteur": null,
  "classification": {
    "famille": {
      "depot": {
        "code": "INITNAV",
        "libelle": "Initiative en Navette"
      },
      "classe": {
        "code": "PIONLOI",
        "libelle": "Proposition de loi"
      }
    },
    "type": {
      "code": "PION",
      "libelle": "Proposition de loi"
    },
    "sousType": null,
    "statutAdoption": null
  },
  "auteurs": {
    "auteur": [
      {
        "acteur": {
          "acteurRef": "PA703503",
          "qualite": "rapporteur"
        }
      },
      {
        "organe": {
          "organeRef": "PO516754"
        }
      }
    ]
  },
  "correction": null,
  "notice": {
    "numNotice": "562",
    "formule": ", en nouvelle lecture, sur la proposition de loi, adoptée, par l'Assemblée nationale, en nouvelle lecture, portant création d'une Agence nationale de la cohésion des territoires (n°518).",
    "adoptionConforme": "false"
  },
  "indexation": null,
  "imprimerie": {
    "prix": null,
    "ISSN": null,
    "ISBN": null,
    "DIAN": null,
    "nbPage": "0"
  },
  "coSignataires": null,
  "depotAmendements": {
    "amendementsSeance": {
      "amendable": "false",
      "dateLimiteDepot": null
    }
  }
}