{
  "@xmlns": "http://schemas.assemblee-nationale.fr/referentiel",
  "@xmlns:xsi": "http://www.w3.org/2001/XMLSchema-instance",
  "@xsi:type": "avisConseilEtat_Type",
  "uid": "AVCEANR5L15B0904",
  "legislature": "15",
  "cycleDeVie": {
    "chrono": {
      "dateCreation": "2018-04-27T00:00:00.000+02:00",
      "dateDepot": "2018-04-27T00:00:00.000+02:00",
      "datePublication": "2018-06-19T00:00:00.000+02:00",
      "datePublicationWeb": "2018-05-02T17:30:00.000+02:00"
    }
  },
  "denominationStructurelle": "Projet de loi",
  "provenance": "Texte Déposé",
  "titres": {
    "titrePrincipal": "Avis du Conseil d'Etat sur le projet de loi pour la liberté de choisir son avenir professionnel",
    "titrePrincipalCourt": "avenir professionnel"
  },
  "divisions": null,
  "dossierRef": "DLR5L15N36601",
  "redacteur": null,
  "classification": {
    "famille": {
      "depot": {
        "code": "INITDEP",
        "libelle": "Initiative en 1er Dépôt"
      },
      "classe": {
        "code": "PRJLOI",
        "libelle": "Projet de loi"
      }
    },
    "type": {
      "code": "AVCE",
      "libelle": "Avis du Conseil d'Etat"
    },
    "sousType": null,
    "statutAdoption": null
  },
  "auteurs": {
    "auteur": {
      "acteur": {
        "acteurRef": "PA345619",
        "qualite": "auteur"
      }
    }
  },
  "correction": null,
  "notice": {
    "numNotice": "904",
    "formule": "pour la liberté de choisir son avenir professionnel",
    "adoptionConforme": "false"
  },
  "indexation": null,
  "imprimerie": null
}