{
  "@xmlns": "http://schemas.assemblee-nationale.fr/referentiel",
  "@xmlns:xsi": "http://www.w3.org/2001/XMLSchema-instance",
  "@xsi:type": "texteLoi_Type",
  "uid": "PRJLANR5L15BTC0091",
  "legislature": "15",
  "cycleDeVie": {
    "chrono": {
      "dateCreation": "2017-07-11T00:00:00.000+02:00",
      "dateDepot": "2017-07-11T00:00:00.000+02:00",
      "datePublication": "2017-07-13T00:00:00.000+02:00",
      "datePublicationWeb": "2017-07-12T17:00:00.000+02:00"
    }
  },
  "denominationStructurelle": "Projet de loi",
  "provenance": "Texte Déposé",
  "titres": {
    "titrePrincipal": "projet de loi sur le projet de loi, après engagement de la procédure accélérée, ratifiant les ordonnances n° 2016-1058 du 3 août 2016 relative à la modification des règles applicables à l'évaluation environnementale des projets, plans et programmes et n° 2016-1060 du 3 août 2016 portant réforme des procédures destinées à assurer l'information et la participation du public à l'élaboration de certaines décisions susceptibles d'avoir une incidence sur l'environnement (n°11).",
    "titrePrincipalCourt": "Ordonnances élaboration décisions ayant une incidence sur l'environnement"
  },
  "divisions": null,
  "dossierRef": "DLR5L15N35843",
  "redacteur": null,
  "classification": {
    "famille": {
      "depot": {
        "code": "INITDEP",
        "libelle": "Initiative en 1er Dépôt"
      },
      "classe": {
        "code": "PRJLOI",
        "libelle": "Projet de loi"
      }
    },
    "type": {
      "code": "PRJL",
      "libelle": "Projet de loi"
    },
    "sousType": null,
    "statutAdoption": "ADOPTCOM"
  },
  "auteurs": {
    "auteur": [
      {
        "acteur": {
          "acteurRef": "PA718962",
          "qualite": "rapporteur"
        }
      },
      {
        "organe": {
          "organeRef": "PO419865"
        }
      }
    ]
  },
  "correction": null,
  "notice": {
    "numNotice": "91",
    "formule": "sur le projet de loi, après engagement de la procédure accélérée, ratifiant les ordonnances n° 2016-1058 du 3 août 2016 relative à la modification des règles applicables à l'évaluation environnementale des projets, plans et programmes et n° 2016-1060 du 3 août 2016 portant réforme des procédures destinées à assurer l'information et la participation du public à l'élaboration de certaines décisions susceptibles d'avoir une incidence sur l'environnement (n°11).",
    "adoptionConforme": "false"
  },
  "indexation": null,
  "imprimerie": {
    "prix": "3.0"
  },
  "coSignataires": null,
  "depotAmendements": {
    "amendementsSeance": {
      "amendable": "true",
      "dateLimiteDepot": null
    },
    "amendementsCommission": {
      "commission": {
        "organeRef": "PO419865",
        "amendable": "true",
        "dateLimiteDepot": null
      }
    }
  }
}