{
  "@xmlns": "http://schemas.assemblee-nationale.fr/referentiel",
  "@xmlns:xsi": "http://www.w3.org/2001/XMLSchema-instance",
  "@xsi:type": "rapportParlementaire_Type",
  "uid": "RAPPSNR5S299B0450",
  "legislature": null,
  "cycleDeVie": {
    "chrono": {
      "dateCreation": "2018-04-19T00:00:00.000+02:00",
      "dateDepot": "2018-04-19T00:00:00.000+02:00",
      "datePublication": null,
      "datePublicationWeb": null
    }
  },
  "denominationStructurelle": "Rapport",
  "provenance": "Commission",
  "titres": {
    "titrePrincipal": "rapport , en nouvelle lecture, les dispositions restant en discussion sur du projet de loi, modifié par le Sénat, ratifiant l'ordonnance n° 2017-1252 du 9 août 2017 portant transposition de la directive 2015/2366 du Parlement européen et du Conseil du 25 novembre 2015 concernant les services de paiement dans le marché intérieur (n°812).",
    "titrePrincipalCourt": "rapport , en nouvelle lecture, les dispositions restant en discussion sur du projet de loi, modifié par le Sénat, ratifiant l'ordonnance n° 2017-1252 du 9 août 2017 portant transposition de la directive 2015/2366 du Parlement européen et du Conseil du 25 novembre 2015 concernant les services de paiement dans le marché intérieur (n°812)."
  },
  "divisions": null,
  "dossierRef": "DLR5L15N36122",
  "redacteur": null,
  "classification": {
    "famille": {
      "depot": {
        "code": "RAPINIT",
        "libelle": "Rapport sur une initiative"
      },
      "classe": {
        "code": "RAPPORT",
        "libelle": "Rapport"
      }
    },
    "type": {
      "code": "RAPP",
      "libelle": "Rapport"
    },
    "sousType": null,
    "statutAdoption": null
  },
  "auteurs": {
    "auteur": [
      {
        "acteur": {
          "acteurRef": "PA415448",
          "qualite": "rapporteur"
        }
      },
      {
        "organe": {
          "organeRef": "PO755413"
        }
      }
    ]
  },
  "correction": null,
  "notice": {
    "numNotice": "450",
    "formule": ", en nouvelle lecture, les dispositions restant en discussion sur du projet de loi, modifié par le Sénat, ratifiant l'ordonnance n° 2017-1252 du 9 août 2017 portant transposition de la directive 2015/2366 du Parlement européen et du Conseil du 25 novembre 2015 concernant les services de paiement dans le marché intérieur (n°812).",
    "adoptionConforme": "false"
  },
  "indexation": null,
  "imprimerie": null
}