{
  "@xmlns": "http://schemas.assemblee-nationale.fr/referentiel",
  "@xmlns:xsi": "http://www.w3.org/2001/XMLSchema-instance",
  "@xsi:type": "DossierLegislatif_Type",
  "uid": "DLR5L15N36844",
  "legislature": "15",
  "titreDossier": {
    "titre": "Société : augmentation du numerus clausus en médecine et encouragement à l'installation des médecins sur les territoires ruraux",
    "titreChemin": "numerus_clausus_medecins",
    "senatChemin": null
  },
  "procedureParlementaire": {
    "code": "2",
    "libelle": "Proposition de loi ordinaire"
  },
  "initiateur": {
    "acteurs": {
      "acteur": {
        "acteurRef": "PA709315",
        "mandatRef": "PM722526"
      }
    }
  },
  "actesLegislatifs": {
    "acteLegislatif": {
      "@xsi:type": "Etape_Type",
      "uid": "L15-AN1-36844",
      "codeActe": "AN1",
      "libelleActe": {
        "nomCanonique": "1ère lecture (1ère assemblée saisie)",
        "libelleCourt": "1ère lecture"
      },
      "organeRef": "PO717460",
      "dateActe": null,
      "actesLegislatifs": {
        "acteLegislatif": [
          {
            "@xsi:type": "DepotInitiative_Type",
            "uid": "L15-VD186757DI",
            "codeActe": "AN1-DEPOT",
            "libelleActe": {
              "nomCanonique": "1er dépôt d'une initiative.",
              "libelleCourt": "1er dépôt d'une initiative."
            },
            "organeRef": "PO717460",
            "dateActe": "2018-09-19T00:00:00.000+02:00",
            "actesLegislatifs": null,
            "texteAssocie": "PIONANR5L15B1251"
          },
          {
            "@xsi:type": "Etape_Type",
            "uid": "L15-AN1-COM-36844",
            "codeActe": "AN1-COM",
            "libelleActe": {
              "nomCanonique": "Travaux des commissions",
              "libelleCourt": "Travaux des commissions"
            },
            "organeRef": "PO717460",
            "dateActe": null,
            "actesLegislatifs": {
              "acteLegislatif": {
                "@xsi:type": "Etape_Type",
                "uid": "L15-VD186758CF",
                "codeActe": "AN1-COM-FOND",
                "libelleActe": {
                  "nomCanonique": "Travaux de la commission saisie au fond",
                  "libelleCourt": "Travaux de la commission saisie au fond"
                },
                "organeRef": "PO420120",
                "dateActe": null,
                "actesLegislatifs": {
                  "acteLegislatif": {
                    "@xsi:type": "SaisieComFond_Type",
                    "uid": "L15-VD186758CFS",
                    "codeActe": "AN1-COM-FOND-SAISIE",
                    "libelleActe": {
                      "nomCanonique": "Renvoi en commission au fond",
                      "libelleCourt": "Renvoi en commission au fond"
                    },
                    "organeRef": "PO420120",
                    "dateActe": "2018-09-19T00:00:00.000+02:00",
                    "actesLegislatifs": null
                  }
                }
              }
            }
          },
          {
            "@xsi:type": "RetraitInitiative_Type",
            "uid": "L15-VD188206",
            "codeActe": "AN1-RTRINI",
            "libelleActe": {
              "nomCanonique": "Retrait d'une initiative",
              "libelleCourt": "Retrait d'une initiative"
            },
            "organeRef": "PO717460",
            "dateActe": "2019-01-30T00:00:00.000+01:00",
            "actesLegislatifs": null,
            "texteAssocie": "PIONANR5L15B1251"
          }
        ]
      }
    }
  },
  "fusionDossier": null
}