{
  "@xmlns": "http://schemas.assemblee-nationale.fr/referentiel",
  "@xmlns:xsi": "http://www.w3.org/2001/XMLSchema-instance",
  "@xsi:type": "texteLoi_Type",
  "uid": "PIONANR5L15B0586",
  "legislature": "15",
  "cycleDeVie": {
    "chrono": {
      "dateCreation": "2018-01-19T00:00:00.000+01:00",
      "dateDepot": "2018-01-24T00:00:00.000+01:00",
      "datePublication": "2018-01-30T00:00:00.000+01:00",
      "datePublicationWeb": "2018-01-25T17:25:00.000+01:00"
    }
  },
  "denominationStructurelle": "Proposition de loi",
  "provenance": "Texte Déposé",
  "titres": {
    "titrePrincipal": "proposition de loi visant à lutter contre la précarité professionnelle des femmes",
    "titrePrincipalCourt": "lutte précarité professionnelle des femmes"
  },
  "divisions": null,
  "dossierRef": "DLR5L15N36297",
  "redacteur": null,
  "classification": {
    "famille": {
      "depot": {
        "code": "INITDEP",
        "libelle": "Initiative en 1er Dépôt"
      },
      "classe": {
        "code": "PIONLOI",
        "libelle": "Proposition de loi"
      }
    },
    "type": {
      "code": "PION",
      "libelle": "Proposition de loi"
    },
    "sousType": null,
    "statutAdoption": null
  },
  "auteurs": {
    "auteur": {
      "acteur": {
        "acteurRef": "PA689",
        "qualite": "auteur"
      }
    }
  },
  "correction": null,
  "notice": {
    "numNotice": "586",
    "formule": "visant à lutter contre la précarité professionnelle des femmes",
    "adoptionConforme": "false"
  },
  "indexation": null,
  "imprimerie": null,
  "coSignataires": {
    "coSignataire": [
      {
        "acteur": {
          "acteurRef": "PA441"
        },
        "dateCosignature": "2018-01-24+01:00",
        "dateRetraitCosignature": null,
        "edite": "true"
      },
      {
        "acteur": {
          "acteurRef": "PA610634"
        },
        "dateCosignature": "2018-01-24+01:00",
        "dateRetraitCosignature": null,
        "edite": "false"
      },
      {
        "acteur": {
          "acteurRef": "PA720546"
        },
        "dateCosignature": "2018-01-24+01:00",
        "dateRetraitCosignature": null,
        "edite": "false"
      },
      {
        "acteur": {
          "acteurRef": "PA721118"
        },
        "dateCosignature": "2018-01-24+01:00",
        "dateRetraitCosignature": null,
        "edite": "false"
      },
      {
        "acteur": {
          "acteurRef": "PA267306"
        },
        "dateCosignature": "2018-01-24+01:00",
        "dateRetraitCosignature": null,
        "edite": "false"
      },
      {
        "acteur": {
          "acteurRef": "PA718926"
        },
        "dateCosignature": "2018-01-24+01:00",
        "dateRetraitCosignature": null,
        "edite": "false"
      },
      {
        "acteur": {
          "acteurRef": "PA718720"
        },
        "dateCosignature": "2018-01-24+01:00",
        "dateRetraitCosignature": null,
        "edite": "false"
      },
      {
        "acteur": {
          "acteurRef": "PA721896"
        },
        "dateCosignature": "2018-01-24+01:00",
        "dateRetraitCosignature": null,
        "edite": "false"
      },
      {
        "acteur": {
          "acteurRef": "PA722202"
        },
        "dateCosignature": "2018-01-24+01:00",
        "dateRetraitCosignature": null,
        "edite": "false"
      },
      {
        "acteur": {
          "acteurRef": "PA335612"
        },
        "dateCosignature": "2018-01-24+01:00",
        "dateRetraitCosignature": null,
        "edite": "false"
      },
      {
        "acteur": {
          "acteurRef": "PA610654"
        },
        "dateCosignature": "2018-01-24+01:00",
        "dateRetraitCosignature": null,
        "edite": "false"
      },
      {
        "acteur": {
          "acteurRef": "PA721270"
        },
        "dateCosignature": "2018-01-24+01:00",
        "dateRetraitCosignature": null,
        "edite": "false"
      },
      {
        "acteur": {
          "acteurRef": "PA720692"
        },
        "dateCosignature": "2018-01-24+01:00",
        "dateRetraitCosignature": null,
        "edite": "false"
      },
      {
        "acteur": {
          "acteurRef": "PA610667"
        },
        "dateCosignature": "2018-01-24+01:00",
        "dateRetraitCosignature": null,
        "edite": "false"
      },
      {
        "acteur": {
          "acteurRef": "PA722110"
        },
        "dateCosignature": "2018-01-24+01:00",
        "dateRetraitCosignature": null,
        "edite": "false"
      }
    ]
  },
  "depotAmendements": {
    "amendementsSeance": {
      "amendable": "true",
      "dateLimiteDepot": null
    },
    "amendementsCommission": {
      "commission": {
        "organeRef": "PO420120",
        "amendable": "true",
        "dateLimiteDepot": null
      }
    }
  }
}