{
  "@xmlns": "http://schemas.assemblee-nationale.fr/referentiel",
  "@xmlns:xsi": "http://www.w3.org/2001/XMLSchema-instance",
  "@xsi:type": "DossierMissionControle_Type",
  "uid": "DLR5L15N36643",
  "legislature": "15",
  "titreDossier": {
    "titre": "Travail : rapport de la délégation aux droits des femmes sur le projet de loi sur la liberté de choisir son avenir professionnel",
    "titreChemin": "liberte_choix_avenir_professionnel_ddf",
    "senatChemin": null
  },
  "procedureParlementaire": {
    "code": "19",
    "libelle": "Rapport d'information sans mission"
  },
  "initiateur": null,
  "actesLegislatifs": {
    "acteLegislatif": {
      "@xsi:type": "Etape_Type",
      "uid": "L15-AN20-36643",
      "codeActe": "AN20",
      "libelleActe": {
        "nomCanonique": "Travaux"
      },
      "organeRef": "PO717460",
      "dateActe": null,
      "actesLegislatifs": {
        "acteLegislatif": {
          "@xsi:type": "DepotRapport_Type",
          "uid": "L15-VD185610",
          "codeActe": "AN20-RAPPORT",
          "libelleActe": {
            "nomCanonique": "Dépôt de rapport",
            "libelleCourt": "Dépôt de rapport"
          },
          "organeRef": "PO201269",
          "dateActe": "2018-05-23T00:00:00.000+02:00",
          "actesLegislatifs": null,
          "texteAssocie": "RINFANR5L15B0979",
          "texteAdopte": null
        }
      }
    }
  },
  "fusionDossier": null
}