{
  "@xmlns": "http://schemas.assemblee-nationale.fr/referentiel",
  "@xmlns:xsi": "http://www.w3.org/2001/XMLSchema-instance",
  "@xsi:type": "DossierResolutionAN",
  "uid": "DLR5L15N36729",
  "legislature": "15",
  "titreDossier": {
    "titre": "Amélioration de l’évaluation de l’aide médicale d’État",
    "titreChemin": "Amelioration_evaluation_aide_medicale_d_etat",
    "senatChemin": null
  },
  "procedureParlementaire": {
    "code": "22",
    "libelle": "Résolution Article 34-1"
  },
  "initiateur": {
    "acteurs": {
      "acteur": {
        "acteurRef": "PA608016",
        "mandatRef": "PM723024"
      }
    }
  },
  "actesLegislatifs": {
    "acteLegislatif": {
      "@xsi:type": "Etape_Type",
      "uid": "L15-ANLUNI-36729",
      "codeActe": "ANLUNI",
      "libelleActe": {
        "nomCanonique": "Lecture unique"
      },
      "organeRef": "PO717460",
      "dateActe": null,
      "actesLegislatifs": {
        "acteLegislatif": {
          "@xsi:type": "DepotInitiative_Type",
          "uid": "L15-VD186028DI",
          "codeActe": "ANLUNI-DEPOT",
          "libelleActe": {
            "nomCanonique": "1er dépôt d'une initiative.",
            "libelleCourt": "1er dépôt d'une initiative."
          },
          "organeRef": "PO717460",
          "dateActe": "2018-06-19T00:00:00.000+02:00",
          "actesLegislatifs": null,
          "texteAssocie": "PNREANR5L15B1089"
        }
      }
    }
  },
  "fusionDossier": null
}