{
  "@xmlns": "http://schemas.assemblee-nationale.fr/referentiel",
  "@xmlns:xsi": "http://www.w3.org/2001/XMLSchema-instance",
  "@xsi:type": "rapportParlementaire_Type",
  "uid": "RAPPANR5L15B0672",
  "legislature": "15",
  "cycleDeVie": {
    "chrono": {
      "dateCreation": "2018-02-15T00:00:00.000+01:00",
      "dateDepot": "2018-02-15T00:00:00.000+01:00",
      "datePublication": "2019-08-26T00:00:00.000+02:00",
      "datePublicationWeb": "2019-08-26T15:15:00.000+02:00"
    }
  },
  "denominationStructurelle": "Rapport",
  "provenance": "Commission",
  "titres": {
    "titrePrincipal": "rapport établi au nom de cet office, sur les enjeux des compteurs communicants",
    "titrePrincipalCourt": "rapport établi au nom de cet office, sur les enjeux des compteurs communicants"
  },
  "divisions": null,
  "dossierRef": "DLR5L15N36386",
  "redacteur": null,
  "classification": {
    "famille": {
      "depot": {
        "code": "RAPAUT",
        "libelle": "Rapport autonome"
      },
      "classe": {
        "code": "RAPPORT",
        "libelle": "Rapport"
      },
      "espece": {
        "code": "OFFPARL",
        "libelle": "des offices parlementaires ou délégations mixtes"
      }
    },
    "type": {
      "code": "RAPP",
      "libelle": "Rapport"
    },
    "sousType": {
      "code": "OFFPARL",
      "libelle": "des offices parlementaires",
      "libelleEdition": "des offices parlementaires"
    },
    "statutAdoption": null
  },
  "auteurs": {
    "auteur": [
      {
        "acteur": {
          "acteurRef": "PA722260",
          "qualite": "rapporteur"
        }
      },
      {
        "acteur": {
          "acteurRef": "PA1993",
          "qualite": "rapporteur"
        }
      },
      {
        "acteur": {
          "acteurRef": "PA719310",
          "qualite": "rapporteur"
        }
      },
      {
        "organe": {
          "organeRef": "PO273589"
        }
      }
    ]
  },
  "correction": {
    "typeCorrection": "Rectifié",
    "niveauCorrection": "1"
  },
  "notice": {
    "numNotice": "672",
    "formule": "établi au nom de cet office, sur les enjeux des compteurs communicants",
    "adoptionConforme": "false"
  },
  "indexation": null,
  "imprimerie": null
}