{
  "@xmlns": "http://schemas.assemblee-nationale.fr/referentiel",
  "@xmlns:xsi": "http://www.w3.org/2001/XMLSchema-instance",
  "@xsi:type": "rapportParlementaire_Type",
  "uid": "RAPPSNR5S319B0147",
  "legislature": null,
  "cycleDeVie": {
    "chrono": {
      "dateCreation": "2018-12-04T00:00:00.000+01:00",
      "dateDepot": "2018-11-22T00:00:00.000+01:00",
      "datePublication": null,
      "datePublicationWeb": null
    }
  },
  "denominationStructurelle": "Rapport",
  "provenance": "Commission",
  "titres": {
    "titrePrincipal": "rapport  sur le projet de loi de finances, adopté, par l'Assemblée nationale, pour 2019 (n°146).",
    "titrePrincipalCourt": "rapport  sur le projet de loi de finances, adopté, par l'Assemblée nationale, pour 2019 (n°146)."
  },
  "divisions": null,
  "dossierRef": "DLR5L15N36733",
  "redacteur": null,
  "classification": {
    "famille": {
      "depot": {
        "code": "RAPINIT",
        "libelle": "Rapport sur une initiative"
      },
      "classe": {
        "code": "RAPPORT",
        "libelle": "Rapport"
      }
    },
    "type": {
      "code": "RAPP",
      "libelle": "Rapport"
    },
    "sousType": null,
    "statutAdoption": null
  },
  "auteurs": {
    "auteur": [
      {
        "acteur": {
          "acteurRef": "PA415448",
          "qualite": "rapporteur"
        }
      },
      {
        "organe": {
          "organeRef": "PO211494"
        }
      }
    ]
  },
  "correction": null,
  "notice": {
    "numNotice": "147",
    "formule": "sur le projet de loi de finances, adopté, par l'Assemblée nationale, pour 2019 (n°146).",
    "adoptionConforme": "false"
  },
  "indexation": null,
  "imprimerie": null
}