{
  "@xmlns": "http://schemas.assemblee-nationale.fr/referentiel",
  "@xmlns:xsi": "http://www.w3.org/2001/XMLSchema-instance",
  "@xsi:type": "rapportParlementaire_Type",
  "uid": "RAPPANR5L15B1936",
  "legislature": "15",
  "cycleDeVie": {
    "chrono": {
      "dateCreation": "2019-05-07T00:00:00.000+02:00",
      "dateDepot": "2019-05-07T00:00:00.000+02:00",
      "datePublication": "2019-05-10T00:00:00.000+02:00",
      "datePublicationWeb": "2019-05-09T20:20:00.000+02:00"
    }
  },
  "denominationStructurelle": "Rapport",
  "provenance": "Commission",
  "titres": {
    "titrePrincipal": "rapport sur le projet de loi, après engagement de la procédure accélérée, relatif à l'entrée en fonction des représentants au Parlement européen élus en France aux élections de 2019 (n°1880).",
    "titrePrincipalCourt": "Représentants au Parlement européen"
  },
  "divisions": null,
  "dossierRef": "DLR5L15N37434",
  "redacteur": null,
  "classification": {
    "famille": {
      "depot": {
        "code": "RAPINIT",
        "libelle": "Rapport sur une initiative"
      },
      "classe": {
        "code": "RAPPORT",
        "libelle": "Rapport"
      }
    },
    "type": {
      "code": "RAPP",
      "libelle": "Rapport"
    },
    "sousType": null,
    "statutAdoption": "ADOPTCOM"
  },
  "auteurs": {
    "auteur": [
      {
        "acteur": {
          "acteurRef": "PA719684",
          "qualite": "rapporteur"
        }
      },
      {
        "organe": {
          "organeRef": "PO59051"
        }
      }
    ]
  },
  "correction": null,
  "notice": {
    "numNotice": "1936",
    "formule": "sur le projet de loi, après engagement de la procédure accélérée, relatif à l'entrée en fonction des représentants au Parlement européen élus en France aux élections de 2019 (n°1880).",
    "adoptionConforme": "false"
  },
  "indexation": null,
  "imprimerie": {
    "prix": "0.75"
  }
}