{
  "@xmlns": "http://schemas.assemblee-nationale.fr/referentiel",
  "@xmlns:xsi": "http://www.w3.org/2001/XMLSchema-instance",
  "@xsi:type": "texteLoi_Type",
  "uid": "RINFANR5L15B1241",
  "legislature": "15",
  "cycleDeVie": {
    "chrono": {
      "dateCreation": "2018-09-19T00:00:00.000+02:00",
      "dateDepot": "2018-09-19T00:00:00.000+02:00",
      "datePublication": "2018-10-08T00:00:00.000+02:00",
      "datePublicationWeb": "2018-10-03T18:10:00.000+02:00"
    }
  },
  "denominationStructurelle": "Rapport d'information",
  "provenance": "Commission",
  "titres": {
    "titrePrincipal": "rapport d'information déposé en application de l'article 145 du règlement, par la commission des affaires étrangères, en conclusion des travaux d'une mission d'information sur la diplomatie économique de la France",
    "titrePrincipalCourt": "rapport d'information déposé en application de l'article 145 du règlement, par la commission des affaires étrangères, en conclusion des travaux d'une mission d'information sur la diplomatie économique de la France"
  },
  "divisions": null,
  "dossierRef": "DLR5L15N36857",
  "redacteur": null,
  "classification": {
    "famille": {
      "depot": {
        "code": "RAPAUT",
        "libelle": "Rapport autonome"
      },
      "classe": {
        "code": "RAPINF",
        "libelle": "Rapport d'information"
      },
      "espece": {
        "code": "MINFOCOMPER",
        "libelle": "d'une mission d'information constituée au sein d'une commission permanente"
      }
    },
    "type": {
      "code": "RINF",
      "libelle": "Rapport d'information"
    },
    "sousType": {
      "code": "MINFOCOMPER",
      "libelle": "d'une mission d'information constituée au sein d'une commission permanente"
    },
    "statutAdoption": null
  },
  "auteurs": {
    "auteur": [
      {
        "acteur": {
          "acteurRef": "PA720146",
          "qualite": "rapporteur"
        }
      },
      {
        "acteur": {
          "acteurRef": "PA718850",
          "qualite": "rapporteur"
        }
      },
      {
        "organe": {
          "organeRef": "PO59047"
        }
      }
    ]
  },
  "correction": null,
  "notice": {
    "numNotice": "1241",
    "formule": "déposé en application de l'article 145 du règlement, par la commission des affaires étrangères, en conclusion des travaux d'une mission d'information sur la diplomatie économique de la France",
    "adoptionConforme": "false"
  },
  "indexation": null,
  "imprimerie": {
    "prix": "3.5"
  },
  "coSignataires": null,
  "depotAmendements": null
}