{
  "@xmlns": "http://schemas.assemblee-nationale.fr/referentiel",
  "@xmlns:xsi": "http://www.w3.org/2001/XMLSchema-instance",
  "@xsi:type": "texteLoi_Type",
  "uid": "PRJLSNR5S299BTC0074",
  "legislature": null,
  "cycleDeVie": {
    "chrono": {
      "dateCreation": "2017-11-09T00:00:00.000+01:00",
      "dateDepot": "2017-11-08T00:00:00.000+01:00",
      "datePublication": null,
      "datePublicationWeb": "2017-11-08T14:00:00.000+01:00"
    }
  },
  "denominationStructurelle": "Projet de loi",
  "provenance": "Texte Déposé",
  "titres": {
    "titrePrincipal": "projet de loi  sur le projet de loi, adopté, par l'Assemblée nationale après engagement de la procédure accélérée, autorisant l'approbation de la convention d'entraide judiciaire en matière pénale entre le Gouvernement de la République française et le Gouvernement de la République algérienne démocratique et populaire (n°706).",
    "titrePrincipalCourt": "Convention d'entraide judiciaire en matière pénale entre le Gouvernement de la République française et le Gouvernement de la République algérienne démocratique et populaire"
  },
  "divisions": null,
  "dossierRef": "DLR5L15N35842",
  "redacteur": null,
  "classification": {
    "famille": {
      "depot": {
        "code": "INITNAV",
        "libelle": "Initiative en Navette"
      },
      "classe": {
        "code": "PRJLOI",
        "libelle": "Projet de loi"
      },
      "espece": {
        "code": "AUTRATCONV",
        "libelle": "autorisant la ratification d'une convention"
      }
    },
    "type": {
      "code": "PRJL",
      "libelle": "Projet de loi"
    },
    "sousType": {
      "code": "AUTRATCONV",
      "libelle": "autorisant la ratification d'une convention",
      "libelleEdition": "autorisant la ratification d'une convention"
    },
    "statutAdoption": null
  },
  "auteurs": {
    "auteur": [
      {
        "acteur": {
          "acteurRef": "PA732419",
          "qualite": "rapporteur"
        }
      },
      {
        "organe": {
          "organeRef": "PO211491"
        }
      }
    ]
  },
  "correction": null,
  "notice": {
    "numNotice": "74",
    "formule": "sur le projet de loi, adopté, par l'Assemblée nationale après engagement de la procédure accélérée, autorisant l'approbation de la convention d'entraide judiciaire en matière pénale entre le Gouvernement de la République française et le Gouvernement de la République algérienne démocratique et populaire (n°706).",
    "adoptionConforme": "false"
  },
  "indexation": null,
  "imprimerie": {
    "prix": null,
    "ISSN": null,
    "ISBN": null,
    "DIAN": null,
    "nbPage": "0"
  },
  "coSignataires": null,
  "depotAmendements": {
    "amendementsSeance": {
      "amendable": "false",
      "dateLimiteDepot": null
    }
  }
}