{
  "@xmlns": "http://schemas.assemblee-nationale.fr/referentiel",
  "@xmlns:xsi": "http://www.w3.org/2001/XMLSchema-instance",
  "@xsi:type": "rapportParlementaire_Type",
  "uid": "RAPPSNR5S299B0665",
  "legislature": null,
  "cycleDeVie": {
    "chrono": {
      "dateCreation": "2018-07-18T00:00:00.000+02:00",
      "dateDepot": "2018-07-16T00:00:00.000+02:00",
      "datePublication": null,
      "datePublicationWeb": null
    }
  },
  "denominationStructurelle": "Rapport",
  "provenance": "Commission",
  "titres": {
    "titrePrincipal": "rapport , en nouvelle lecture, les dispositions restant en discussion sur du projet de loi, modifié par le Sénat, pour la liberté de choisir son avenir professionnel (n°1168).",
    "titrePrincipalCourt": "rapport , en nouvelle lecture, les dispositions restant en discussion sur du projet de loi, modifié par le Sénat, pour la liberté de choisir son avenir professionnel (n°1168)."
  },
  "divisions": null,
  "dossierRef": "DLR5L15N36601",
  "redacteur": null,
  "classification": {
    "famille": {
      "depot": {
        "code": "RAPINIT",
        "libelle": "Rapport sur une initiative"
      },
      "classe": {
        "code": "RAPPORT",
        "libelle": "Rapport"
      }
    },
    "type": {
      "code": "RAPP",
      "libelle": "Rapport"
    },
    "sousType": null,
    "statutAdoption": null
  },
  "auteurs": {
    "auteur": [
      {
        "acteur": {
          "acteurRef": "PA736171",
          "qualite": "rapporteur"
        }
      },
      {
        "organe": {
          "organeRef": "PO757975"
        }
      }
    ]
  },
  "correction": null,
  "notice": {
    "numNotice": "665",
    "formule": ", en nouvelle lecture, les dispositions restant en discussion sur du projet de loi, modifié par le Sénat, pour la liberté de choisir son avenir professionnel (n°1168).",
    "adoptionConforme": "false"
  },
  "indexation": null,
  "imprimerie": null
}