{
  "@xmlns": "http://schemas.assemblee-nationale.fr/referentiel",
  "@xmlns:xsi": "http://www.w3.org/2001/XMLSchema-instance",
  "@xsi:type": "texteLoi_Type",
  "uid": "PRJLSNR5S299BTC0104",
  "legislature": null,
  "cycleDeVie": {
    "chrono": {
      "dateCreation": "2017-11-23T00:00:00.000+01:00",
      "dateDepot": "2017-11-22T00:00:00.000+01:00",
      "datePublication": null,
      "datePublicationWeb": "2017-11-22T14:00:00.000+01:00"
    }
  },
  "denominationStructurelle": "Projet de loi",
  "provenance": "Texte Déposé",
  "titres": {
    "titrePrincipal": "projet de loi de financement de la sécurité sociale , en nouvelle lecture, les dispositions restant en discussion sur du projet de loi de financement de la sécurité sociale, modifié par le Sénat, pour 2018 (n°387).",
    "titrePrincipalCourt": "PLFSS pour 2018"
  },
  "divisions": null,
  "dossierRef": "DLR5L15N36030",
  "redacteur": null,
  "classification": {
    "famille": {
      "depot": {
        "code": "INITNAV",
        "libelle": "Initiative en Navette"
      },
      "classe": {
        "code": "PRJLOI",
        "libelle": "Projet de loi"
      },
      "espece": {
        "code": "FINSSOC",
        "libelle": "de financement de la sécurité sociale"
      }
    },
    "type": {
      "code": "PRJL",
      "libelle": "Projet de loi"
    },
    "sousType": {
      "code": "FINSSOC",
      "libelle": "de financement de la sécurité sociale",
      "libelleEdition": "de financement de la sécurité sociale"
    },
    "statutAdoption": null
  },
  "auteurs": {
    "auteur": [
      {
        "acteur": {
          "acteurRef": "PA227098",
          "qualite": "rapporteur"
        }
      },
      {
        "organe": {
          "organeRef": "PO743571"
        }
      }
    ]
  },
  "correction": null,
  "notice": {
    "numNotice": "104",
    "formule": ", en nouvelle lecture, les dispositions restant en discussion sur du projet de loi de financement de la sécurité sociale, modifié par le Sénat, pour 2018 (n°387).",
    "adoptionConforme": "false"
  },
  "indexation": null,
  "imprimerie": null,
  "coSignataires": null,
  "depotAmendements": {
    "amendementsSeance": {
      "amendable": "false",
      "dateLimiteDepot": null
    }
  }
}