{
  "@xmlns": "http://schemas.assemblee-nationale.fr/referentiel",
  "@xmlns:xsi": "http://www.w3.org/2001/XMLSchema-instance",
  "@xsi:type": "texteLoi_Type",
  "uid": "PRJLANR5L15BTC1105",
  "legislature": "15",
  "cycleDeVie": {
    "chrono": {
      "dateCreation": "2018-06-27T00:00:00.000+02:00",
      "dateDepot": "2018-06-27T00:00:00.000+02:00",
      "datePublication": "2018-06-29T00:00:00.000+02:00",
      "datePublicationWeb": "2018-06-28T20:30:00.000+02:00"
    }
  },
  "denominationStructurelle": "Projet de loi",
  "provenance": "Texte Déposé",
  "titres": {
    "titrePrincipal": "projet de loi , en nouvelle lecture, sur le projet de loi, modifié par le Sénat, ratifiant l'ordonnance n° 2017-1252 du 9 août 2017 portant transposition de la directive 2015/2366 du Parlement européen et du Conseil du 25 novembre 2015 concernant les services de paiement dans le marché intérieur (n°812).",
    "titrePrincipalCourt": "Ratification ordonnance n° 2017-1252 Services de paiement marché intérieur"
  },
  "divisions": null,
  "dossierRef": "DLR5L15N36122",
  "redacteur": null,
  "classification": {
    "famille": {
      "depot": {
        "code": "INITNAV",
        "libelle": "Initiative en Navette"
      },
      "classe": {
        "code": "PRJLOI",
        "libelle": "Projet de loi"
      }
    },
    "type": {
      "code": "PRJL",
      "libelle": "Projet de loi"
    },
    "sousType": null,
    "statutAdoption": "ADOPTCOM"
  },
  "auteurs": {
    "auteur": [
      {
        "acteur": {
          "acteurRef": "PA722054",
          "qualite": "rapporteur"
        }
      },
      {
        "organe": {
          "organeRef": "PO59048"
        }
      }
    ]
  },
  "correction": null,
  "notice": {
    "numNotice": "1105",
    "formule": ", en nouvelle lecture, sur le projet de loi, modifié par le Sénat, ratifiant l'ordonnance n° 2017-1252 du 9 août 2017 portant transposition de la directive 2015/2366 du Parlement européen et du Conseil du 25 novembre 2015 concernant les services de paiement dans le marché intérieur (n°812).",
    "adoptionConforme": "false"
  },
  "indexation": null,
  "imprimerie": {
    "prix": "1.5"
  },
  "coSignataires": null,
  "depotAmendements": {
    "amendementsSeance": {
      "amendable": "true",
      "dateLimiteDepot": null
    },
    "amendementsCommission": {
      "commission": {
        "organeRef": "PO59048",
        "amendable": "true",
        "dateLimiteDepot": null
      }
    }
  }
}