{
  "@xmlns": "http://schemas.assemblee-nationale.fr/referentiel",
  "@xmlns:xsi": "http://www.w3.org/2001/XMLSchema-instance",
  "@xsi:type": "texteLoi_Type",
  "uid": "AVISSNR5S279B0602",
  "legislature": null,
  "cycleDeVie": {
    "chrono": {
      "dateCreation": "2017-07-06T00:00:00.000+02:00",
      "dateDepot": "2017-07-04T00:00:00.000+02:00",
      "datePublication": null,
      "datePublicationWeb": null
    }
  },
  "denominationStructurelle": "Avis",
  "provenance": "Commission",
  "titres": {
    "titrePrincipal": "avis sur: - le projet de loi organique, après engagement de la procédure accélérée, rétablissant la confiance dans l'action publique (n°580)- le projet de loi de MM. le Premier ministre et le Ministre d'État, Garde des Sceaux, ministre de la justice rétablissant la confiance dans l'action publique (n°581).",
    "titrePrincipalCourt": "avis sur: - le projet de loi organique, après engagement de la procédure accélérée, rétablissant la confiance dans l'action publique (n°580)- le projet de loi de MM. le Premier ministre et le Ministre d'État, Garde des Sceaux, ministre de la justice rétablissant la confiance dans l'action publique (n°581)."
  },
  "divisions": null,
  "dossierRef": "DLR5L15N35824",
  "redacteur": null,
  "classification": {
    "famille": {
      "depot": {
        "code": "RAPINIT",
        "libelle": "Rapport sur une initiative"
      },
      "classe": {
        "code": "AVIS",
        "libelle": "Avis"
      }
    },
    "type": {
      "code": "AVIS",
      "libelle": "Avis"
    },
    "sousType": null,
    "statutAdoption": null
  },
  "auteurs": {
    "auteur": [
      {
        "acteur": {
          "acteurRef": "PA415448",
          "qualite": "rapporteur pour avis"
        }
      },
      {
        "organe": {
          "organeRef": "PO211494"
        }
      }
    ]
  },
  "correction": null,
  "notice": {
    "numNotice": "602",
    "formule": "sur: - le projet de loi organique, après engagement de la procédure accélérée, rétablissant la confiance dans l'action publique (n°580)- le projet de loi de MM. le Premier ministre et le Ministre d'État, Garde des Sceaux, ministre de la justice rétablissant la confiance dans l'action publique (n°581).",
    "adoptionConforme": "false"
  },
  "indexation": null,
  "imprimerie": null,
  "coSignataires": null,
  "depotAmendements": null
}