{
  "@xmlns": "http://schemas.assemblee-nationale.fr/referentiel",
  "@xmlns:xsi": "http://www.w3.org/2001/XMLSchema-instance",
  "@xsi:type": "documentEtudeImpact_Type",
  "uid": "ETDIANR5L15B0004",
  "legislature": "15",
  "cycleDeVie": {
    "chrono": {
      "dateCreation": "2017-06-29T00:00:00.000+02:00",
      "dateDepot": "2017-06-29T00:00:00.000+02:00",
      "datePublication": "2017-07-03T00:00:00.000+02:00",
      "datePublicationWeb": "2017-06-29T14:40:00.000+02:00"
    }
  },
  "denominationStructurelle": "Projet de loi",
  "provenance": "Texte Déposé",
  "titres": {
    "titrePrincipal": "Etude d'impact sur le projet de loi d’habilitation à prendre par ordonnances les mesures pour le renforcement du dialogue social",
    "titrePrincipalCourt": "renforcement du dialogue social"
  },
  "divisions": null,
  "dossierRef": "DLR5L15N35836",
  "redacteur": null,
  "classification": {
    "famille": {
      "depot": {
        "code": "INITDEP",
        "libelle": "Initiative en 1er Dépôt"
      },
      "classe": {
        "code": "PRJLOI",
        "libelle": "Projet de loi"
      }
    },
    "type": {
      "code": "ETDI",
      "libelle": "Etude d'impact"
    },
    "sousType": null,
    "statutAdoption": null
  },
  "auteurs": {
    "auteur": {
      "acteur": {
        "acteurRef": "PA345619",
        "qualite": "auteur"
      }
    }
  },
  "correction": null,
  "notice": {
    "numNotice": "4",
    "formule": "d’habilitation à prendre par ordonnances les mesures pour le renforcement du dialogue social",
    "adoptionConforme": "false"
  },
  "indexation": null,
  "imprimerie": null
}