{
  "xsiType": "DossierLegislatif_Type",
  "uid": "DLR5L14N34454",
  "legislature": "14",
  "titreDossier": {
    "titre": "Renforcement des prérogatives du président du conseil départemental en matière de lutte contre la fraude au revenu de solidarité active",
    "titreChemin": "renforcement_lutte_fraude_rsa"
  },
  "procedureParlementaire": {
    "code": "2",
    "libelle": "Proposition de loi ordinaire"
  },
  "initiateur": {
    "acteurs": [
      {
        "acteurRef": "PA330240",
        "mandatRef": "PM645425"
      }
    ]
  },
  "actesLegislatifs": [
    {
      "xsiType": "Etape_Type",
      "uid": "L14-AN1-34454",
      "codeActe": "AN1",
      "libelleActe": {
        "nomCanonique": "1ère lecture (1ère assemblée saisie)",
        "libelleCourt": "1ère lecture"
      },
      "organeRef": "PO644420",
      "actesLegislatifs": [
        {
          "xsiType": "DepotInitiative_Type",
          "uid": "L14-VD175985DI",
          "codeActe": "AN1-DEPOT",
          "libelleActe": {
            "nomCanonique": "1er dépôt d'une initiative.",
            "libelleCourt": "1er dépôt d'une initiative."
          },
          "organeRef": "PO644420",
          "dateActe": "2015-11-25T00:00:00.000+01:00",
          "texteAssocieRef": "PIONANR5L14B3267"
        },
        {
          "xsiType": "Etape_Type",
          "uid": "L14-AN1-COM-34454",
          "codeActe": "AN1-COM",
          "libelleActe": {
            "nomCanonique": "Travaux des commissions",
            "libelleCourt": "Travaux des commissions"
          },
          "organeRef": "PO644420",
          "actesLegislatifs": [
            {
              "xsiType": "Etape_Type",
              "uid": "L14-VD175986CF",
              "codeActe": "AN1-COM-FOND",
              "libelleActe": {
                "nomCanonique": "Travaux de la commission saisie au fond",
                "libelleCourt": "Travaux de la commission saisie au fond"
              },
              "organeRef": "PO420120",
              "actesLegislatifs": [
                {
                  "xsiType": "SaisieComFond_Type",
                  "uid": "L14-VD175986CFS",
                  "codeActe": "AN1-COM-FOND-SAISIE",
                  "libelleActe": {
                    "nomCanonique": "Renvoi en commission au fond",
                    "libelleCourt": "Renvoi en commission au fond"
                  },
                  "organeRef": "PO420120",
                  "dateActe": "2015-11-25T00:00:00.000+01:00"
                }
              ]
            }
          ]
        }
      ]
    }
  ]
}