{
  "xsiType": "DossierLegislatif_Type",
  "uid": "DLR5L14N31587",
  "legislature": "14",
  "titreDossier": {
    "titre": "Education : libre choix des maires concernant les rythmes scolaires dans le premier degré",
    "titreChemin": "liberte_maires_rythmes_scolaires_premier_degre"
  },
  "procedureParlementaire": {
    "code": "2",
    "libelle": "Proposition de loi ordinaire"
  },
  "initiateur": {
    "acteurs": [
      {
        "acteurRef": "PA267080",
        "mandatRef": "PM645531"
      }
    ]
  },
  "actesLegislatifs": [
    {
      "xsiType": "Etape_Type",
      "uid": "L14-AN1-31587",
      "codeActe": "AN1",
      "libelleActe": {
        "nomCanonique": "1ère lecture (1ère assemblée saisie)",
        "libelleCourt": "1ère lecture"
      },
      "organeRef": "PO644420",
      "actesLegislatifs": [
        {
          "xsiType": "DepotInitiative_Type",
          "uid": "L14-VD166632DI",
          "codeActe": "AN1-DEPOT",
          "libelleActe": {
            "nomCanonique": "1er dépôt d'une initiative.",
            "libelleCourt": "1er dépôt d'une initiative."
          },
          "organeRef": "PO644420",
          "dateActe": "2013-10-23T00:00:00.000+02:00",
          "texteAssocieRef": "PIONANR5L14B1491"
        },
        {
          "xsiType": "Etape_Type",
          "uid": "L14-AN1-COM-31587",
          "codeActe": "AN1-COM",
          "libelleActe": {
            "nomCanonique": "Travaux des commissions",
            "libelleCourt": "Travaux des commissions"
          },
          "organeRef": "PO644420",
          "actesLegislatifs": [
            {
              "xsiType": "Etape_Type",
              "uid": "L14-VD166633CF",
              "codeActe": "AN1-COM-FOND",
              "libelleActe": {
                "nomCanonique": "Travaux de la commission saisie au fond",
                "libelleCourt": "Travaux de la commission saisie au fond"
              },
              "organeRef": "PO419604",
              "actesLegislatifs": [
                {
                  "xsiType": "SaisieComFond_Type",
                  "uid": "L14-VD166633CFS",
                  "codeActe": "AN1-COM-FOND-SAISIE",
                  "libelleActe": {
                    "nomCanonique": "Renvoi en commission au fond",
                    "libelleCourt": "Renvoi en commission au fond"
                  },
                  "organeRef": "PO419604",
                  "dateActe": "2013-10-23T00:00:00.000+02:00"
                },
                {
                  "xsiType": "NominRapporteurs_Type",
                  "uid": "L14-VD167172",
                  "codeActe": "AN1-COM-FOND-NOMIN",
                  "libelleActe": {
                    "nomCanonique": "Nomination de rapporteur",
                    "libelleCourt": "Nomination de rapporteur"
                  },
                  "organeRef": "PO419604",
                  "dateActe": "2013-11-20T00:00:00.000+01:00",
                  "rapporteurs": [
                    {
                      "acteurRef": "PA267080",
                      "typeRapporteur": "rapporteur"
                    }
                  ]
                },
                {
                  "xsiType": "DiscussionCommission_Type",
                  "uid": "L14-VD167052R19122",
                  "codeActe": "AN1-COM-FOND-REUNION",
                  "libelleActe": {
                    "nomCanonique": "Réunion de commission",
                    "libelleCourt": "Réunion de commission"
                  },
                  "organeRef": "PO419604",
                  "dateActe": "2013-11-20T09:30:00.000+01:00",
                  "odjRef": "RUANR5L14S2014IDC419243PT19122",
                  "reunionRef": "RUANR5L14S2014IDC419243"
                },
                {
                  "xsiType": "DiscussionCommission_Type",
                  "uid": "L14-VD167052R19220",
                  "codeActe": "AN1-COM-FOND-REUNION",
                  "libelleActe": {
                    "nomCanonique": "Réunion de commission",
                    "libelleCourt": "Réunion de commission"
                  },
                  "organeRef": "PO419604",
                  "dateActe": "2013-11-27T09:30:00.000+01:00",
                  "odjRef": "RUANR5L14S2014IDC419524PT19220",
                  "reunionRef": "RUANR5L14S2014IDC419524"
                },
                {
                  "xsiType": "DiscussionCommission_Type",
                  "uid": "L14-VD167052R19224",
                  "codeActe": "AN1-COM-FOND-REUNION",
                  "libelleActe": {
                    "nomCanonique": "Réunion de commission",
                    "libelleCourt": "Réunion de commission"
                  },
                  "organeRef": "PO419604",
                  "dateActe": "2013-12-05T09:00:00.000+01:00",
                  "odjRef": "RUANR5L14S2014IDC419526PT19224",
                  "reunionRef": "RUANR5L14S2014IDC419526"
                },
                {
                  "xsiType": "DepotRapport_Type",
                  "uid": "L14-VD167321",
                  "codeActe": "AN1-COM-FOND-RAPPORT",
                  "libelleActe": {
                    "nomCanonique": "Dépôt de rapport",
                    "libelleCourt": "Dépôt de rapport"
                  },
                  "organeRef": "PO419604",
                  "dateActe": "2013-11-27T00:00:00.000+01:00",
                  "texteAssocieRef": "RAPPANR5L14B1583"
                }
              ]
            }
          ]
        },
        {
          "xsiType": "Etape_Type",
          "uid": "L14-AN1-DEBATS-31587",
          "codeActe": "AN1-DEBATS",
          "libelleActe": {
            "nomCanonique": "Discussion en séance publique",
            "libelleCourt": "Discussion en séance publique"
          },
          "organeRef": "PO644420",
          "actesLegislatifs": [
            {
              "xsiType": "DiscussionSeancePublique_Type",
              "uid": "L14-VD166952S29547",
              "codeActe": "AN1-DEBATS-SEANCE",
              "libelleActe": {
                "nomCanonique": "Discussion en séance publique",
                "libelleCourt": "Discussion en séance publique"
              },
              "organeRef": "PO644420",
              "dateActe": "2013-12-05T00:00:00.000+01:00",
              "odjRef": "RUANR5L14S2014IDS17933PT29547",
              "reunionRef": "RUANR5L14S2014IDS17933"
            },
            {
              "xsiType": "MotionProcedure_Type",
              "uid": "L14-VD167477",
              "codeActe": "AN1-DEBATS-MOTION",
              "libelleActe": {
                "nomCanonique": "Motion de procédure",
                "libelleCourt": "Motion de procédure"
              },
              "organeRef": "PO644420",
              "dateActe": "2013-11-29T00:00:00.000+01:00",
              "auteurMotion": "PA1886",
              "typeMotion": {
                "famCode": "TMP02",
                "libelle": "Question préalable"
              }
            },
            {
              "xsiType": "Decision_Type",
              "uid": "L14-VD167517DEC",
              "codeActe": "AN1-DEBATS-MOTION-VOTE",
              "libelleActe": {
                "nomCanonique": "Décision",
                "libelleCourt": "Décision"
              },
              "organeRef": "PO644420",
              "dateActe": "2013-12-05T00:00:00.000+01:00",
              "reunionRef": "RUANR5L14S2014IDS17933",
              "statutConclusion": {
                "famCode": "TSORTF07",
                "libelle": "rejetée"
              },
              "textesAssocies": [
                {
                  "typeTexte": "BTA",
                  "texteAssocieRef": "PIONANR5L14BTA0254"
                }
              ]
            }
          ]
        }
      ]
    }
  ]
}