{
  "xsiType": "texteLoi_Type",
  "uid": "PNREANR5L14B1204",
  "legislature": "14",
  "cycleDeVie": {
    "chrono": {
      "dateCreation": "2013-06-26T00:00:00.000+02:00",
      "dateDepot": "2013-06-26T00:00:00.000+02:00",
      "datePublication": "2013-08-11T00:00:00.000+02:00"
    }
  },
  "denominationStructurelle": "Proposition de résolution",
  "provenance": "Texte Déposé",
  "titres": {
    "titrePrincipal": "proposition de résolution européenne sur l'avis de la Commission européenne sur les programmes de stabilité et de réforme de la France",
    "titrePrincipalCourt": "programmes de stabilité et de réforme de la France"
  },
  "dossierRef": "DLR5L14N30599",
  "classification": {
    "famille": {
      "depot": {
        "code": "INITDEP",
        "libelle": "Initiative en 1er Dépôt"
      },
      "classe": {
        "code": "PIONRES",
        "libelle": "Proposition de résolution"
      },
      "espece": {
        "code": "TVXINSTITEUROP",
        "libelle": "sur les travaux conduits par les institutions européennes"
      }
    },
    "type": {
      "code": "PNRE",
      "libelle": "Proposition de résolution"
    },
    "sousType": {
      "code": "TVXINSTITEUROP",
      "libelle": "sur les travaux conduits par les institutions européennes"
    }
  },
  "auteurs": [
    {
      "acteur": {
        "acteurRef": "PA735",
        "qualite": "auteur"
      }
    }
  ],
  "notice": {
    "numNotice": "1204",
    "formule": "sur l'avis de la Commission européenne sur les programmes de stabilité et de réforme de la France",
    "adoptionConforme": false
  },
  "indexation": {
    "themes": {
      "@niveau": "1",
      "theme": {
        "libelleTheme": "SECURITE SOCIALE"
      }
    }
  }
}