{
  "xsiType": "texteLoi_Type",
  "uid": "PIONANR5L14B3418",
  "legislature": "14",
  "cycleDeVie": {
    "chrono": {
      "dateCreation": "2016-01-14T00:00:00.000+01:00",
      "dateDepot": "2016-01-19T00:00:00.000+01:00",
      "datePublicationWeb": "2016-01-21T17:05:00.000+01:00"
    }
  },
  "denominationStructurelle": "Proposition de loi",
  "provenance": "Texte Déposé",
  "titres": {
    "titrePrincipal": "proposition de loi visant à faciliter la cession d’œuvres entre musées publics",
    "titrePrincipalCourt": "cession d'oeuvres musées publics"
  },
  "dossierRef": "DLR5L14N34633",
  "classification": {
    "famille": {
      "depot": {
        "code": "INITDEP",
        "libelle": "Initiative en 1er Dépôt"
      },
      "classe": {
        "code": "PIONLOI",
        "libelle": "Proposition de loi"
      }
    },
    "type": {
      "code": "PION",
      "libelle": "Proposition de loi"
    }
  },
  "auteurs": [
    {
      "acteur": {
        "acteurRef": "PA2277",
        "qualite": "auteur"
      }
    }
  ],
  "notice": {
    "numNotice": "3418",
    "formule": "visant à faciliter la cession d’œuvres entre musées publics",
    "adoptionConforme": false
  },
  "coSignataires": [
    {
      "acteurRef": "PA608416",
      "dateCosignature": "2016-01-19+01:00",
      "edite": false
    },
    {
      "acteurRef": "PA334654",
      "dateCosignature": "2016-01-19+01:00",
      "edite": false
    },
    {
      "acteurRef": "PA266776",
      "dateCosignature": "2016-01-19+01:00",
      "edite": false
    },
    {
      "acteurRef": "PA2876",
      "dateCosignature": "2016-01-19+01:00",
      "edite": false
    },
    {
      "acteurRef": "PA2073",
      "dateCosignature": "2016-01-19+01:00",
      "edite": false
    },
    {
      "acteurRef": "PA1152",
      "dateCosignature": "2016-01-19+01:00",
      "edite": false
    },
    {
      "acteurRef": "PA223837",
      "dateCosignature": "2016-01-19+01:00",
      "edite": false
    },
    {
      "acteurRef": "PA2377",
      "dateCosignature": "2016-01-19+01:00",
      "edite": false
    },
    {
      "acteurRef": "PA267204",
      "dateCosignature": "2016-01-19+01:00",
      "edite": false
    },
    {
      "acteurRef": "PA344492",
      "dateCosignature": "2016-01-19+01:00",
      "edite": false
    },
    {
      "acteurRef": "PA267576",
      "dateCosignature": "2016-01-19+01:00",
      "edite": false
    },
    {
      "acteurRef": "PA2529",
      "dateCosignature": "2016-01-19+01:00",
      "edite": false
    },
    {
      "acteurRef": "PA334149",
      "dateCosignature": "2016-01-19+01:00",
      "edite": false
    },
    {
      "acteurRef": "PA331567",
      "dateCosignature": "2016-01-19+01:00",
      "edite": false
    },
    {
      "acteurRef": "PA266774",
      "dateCosignature": "2016-01-19+01:00",
      "edite": false
    },
    {
      "acteurRef": "PA243",
      "dateCosignature": "2016-01-19+01:00",
      "edite": false
    }
  ],
  "depotAmendements": {
    "amendementsSeance": {
      "amendable": false
    },
    "amendementsCommission": [
      {
        "organeRef": "PO419604",
        "amendable": true
      }
    ]
  }
}