{
  "xsiType": "texteLoi_Type",
  "uid": "PRJLANR5L14BTC0570",
  "legislature": "14",
  "cycleDeVie": {
    "chrono": {
      "dateCreation": "2012-12-19T00:00:00.000+01:00",
      "dateDepot": "2012-12-19T00:00:00.000+01:00",
      "datePublication": "2012-12-28T00:00:00.000+01:00",
      "datePublicationWeb": "2012-12-21T16:00:00.000+01:00"
    }
  },
  "denominationStructurelle": "Projet de loi",
  "provenance": "Texte Déposé",
  "titres": {
    "titrePrincipal": "projet de loi sur le projet de loi , après engagement de la procédure accélérée, portant création du contrat de génération (n°492)",
    "titrePrincipalCourt": "création du contrat de génération"
  },
  "dossierRef": "DLR5L14N29505",
  "classification": {
    "famille": {
      "depot": {
        "code": "INITDEP",
        "libelle": "Initiative en 1er Dépôt"
      },
      "classe": {
        "code": "PRJLOI",
        "libelle": "Projet de loi"
      }
    },
    "type": {
      "code": "PRJL",
      "libelle": "Projet de loi"
    },
    "statutAdoption": "ADOPTCOM"
  },
  "auteurs": [
    {
      "acteur": {
        "acteurRef": "PA335017",
        "qualite": "rapporteur"
      }
    },
    {
      "organeRef": "PO420120"
    }
  ],
  "notice": {
    "numNotice": "570",
    "formule": "sur le projet de loi , après engagement de la procédure accélérée, portant création du contrat de génération (n°492)",
    "adoptionConforme": false
  },
  "imprimerie": {
    "prix": "5.0"
  },
  "depotAmendements": {
    "amendementsSeance": {
      "amendable": true
    },
    "amendementsCommission": [
      {
        "organeRef": "PO420120",
        "amendable": true
      }
    ]
  }
}