{
  "xsiType": "DossierLegislatif_Type",
  "uid": "DLR5L14N28912",
  "legislature": "14",
  "titreDossier": {
    "titre": "Affaires étrangères : accord avec le Kosovo sur la réadmission des personnes en séjour irrégulier",
    "titreChemin": "readmission_sejour_irregulier_Kosovo",
    "senatChemin": "http://www.senat.fr/dossier-legislatif/pjl12-699.html"
  },
  "procedureParlementaire": {
    "code": "6",
    "libelle": "Projet de ratification des traités et conventions"
  },
  "initiateur": {
    "acteurs": [
      {
        "acteurRef": "PA328",
        "mandatRef": "PM653228"
      },
      {
        "acteurRef": "PA1268",
        "mandatRef": "PM653525"
      }
    ]
  },
  "actesLegislatifs": [
    {
      "xsiType": "Etape_Type",
      "uid": "L14-AN1-28912",
      "codeActe": "AN1",
      "libelleActe": {
        "nomCanonique": "1ère lecture (1ère assemblée saisie)",
        "libelleCourt": "1ère lecture"
      },
      "organeRef": "PO644420",
      "actesLegislatifs": [
        {
          "xsiType": "DepotInitiative_Type",
          "uid": "L14-VD158809DI",
          "codeActe": "AN1-DEPOT",
          "libelleActe": {
            "nomCanonique": "1er dépôt d'une initiative.",
            "libelleCourt": "1er dépôt d'une initiative."
          },
          "organeRef": "PO644420",
          "dateActe": "2012-07-18T00:00:00.000+02:00",
          "texteAssocieRef": "PRJLANR5L14B0091"
        },
        {
          "xsiType": "EtudeImpact_Type",
          "uid": "L14-VD158809ETI",
          "codeActe": "AN1-ETI",
          "libelleActe": {
            "nomCanonique": "Etude d'impact",
            "libelleCourt": "Etude d'impact"
          },
          "organeRef": "PO644420",
          "dateActe": "2012-07-18T00:00:00.000+02:00",
          "contributionInternaute": {
            "dateOuverture": "2012-07-19+02:00",
            "dateFermeture": "2013-06-27+02:00"
          },
          "texteAssocieRef": "ETDIANR5L14B0091"
        },
        {
          "xsiType": "Etape_Type",
          "uid": "L14-AN1-COM-28912",
          "codeActe": "AN1-COM",
          "libelleActe": {
            "nomCanonique": "Travaux des commissions",
            "libelleCourt": "Travaux des commissions"
          },
          "organeRef": "PO644420",
          "actesLegislatifs": [
            {
              "xsiType": "Etape_Type",
              "uid": "L14-VD158810CF",
              "codeActe": "AN1-COM-FOND",
              "libelleActe": {
                "nomCanonique": "Travaux de la commission saisie au fond",
                "libelleCourt": "Travaux de la commission saisie au fond"
              },
              "organeRef": "PO59047",
              "actesLegislatifs": [
                {
                  "xsiType": "SaisieComFond_Type",
                  "uid": "L14-VD158810CFS",
                  "codeActe": "AN1-COM-FOND-SAISIE",
                  "libelleActe": {
                    "nomCanonique": "Renvoi en commission au fond",
                    "libelleCourt": "Renvoi en commission au fond"
                  },
                  "organeRef": "PO59047",
                  "dateActe": "2012-07-18T00:00:00.000+02:00"
                },
                {
                  "xsiType": "NominRapporteurs_Type",
                  "uid": "L14-VD160265",
                  "codeActe": "AN1-COM-FOND-NOMIN",
                  "libelleActe": {
                    "nomCanonique": "Nomination de rapporteur",
                    "libelleCourt": "Nomination de rapporteur"
                  },
                  "organeRef": "PO59047",
                  "dateActe": "2012-11-14T00:00:00.000+01:00",
                  "rapporteurs": [
                    {
                      "acteurRef": "PA334",
                      "typeRapporteur": "rapporteur"
                    }
                  ]
                },
                {
                  "xsiType": "DiscussionCommission_Type",
                  "uid": "L14-VD159962R16457",
                  "codeActe": "AN1-COM-FOND-REUNION",
                  "libelleActe": {
                    "nomCanonique": "Réunion de commission",
                    "libelleCourt": "Réunion de commission"
                  },
                  "organeRef": "PO59047",
                  "dateActe": "2012-11-07T10:00:00.000+01:00",
                  "odjRef": "RUANR5L14S2013IDC415537PT16457",
                  "reunionRef": "RUANR5L14S2013IDC415537"
                },
                {
                  "xsiType": "DiscussionCommission_Type",
                  "uid": "L14-VD159962R16564",
                  "codeActe": "AN1-COM-FOND-REUNION",
                  "libelleActe": {
                    "nomCanonique": "Réunion de commission",
                    "libelleCourt": "Réunion de commission"
                  },
                  "organeRef": "PO59047",
                  "dateActe": "2012-11-14T09:00:00.000+01:00",
                  "odjRef": "RUANR5L14S2013IDC415594PT16564",
                  "reunionRef": "RUANR5L14S2013IDC415594"
                },
                {
                  "xsiType": "DiscussionCommission_Type",
                  "uid": "L14-VD159962R17408",
                  "codeActe": "AN1-COM-FOND-REUNION",
                  "libelleActe": {
                    "nomCanonique": "Réunion de commission",
                    "libelleCourt": "Réunion de commission"
                  },
                  "organeRef": "PO59047",
                  "dateActe": "2013-04-24T09:30:00.000+02:00",
                  "odjRef": "RUANR5L14S2013IDC417014PT17408",
                  "reunionRef": "RUANR5L14S2013IDC417014"
                },
                {
                  "xsiType": "DepotRapport_Type",
                  "uid": "L14-VD163319",
                  "codeActe": "AN1-COM-FOND-RAPPORT",
                  "libelleActe": {
                    "nomCanonique": "Dépôt de rapport",
                    "libelleCourt": "Dépôt de rapport"
                  },
                  "organeRef": "PO59047",
                  "dateActe": "2013-04-24T00:00:00.000+02:00",
                  "texteAssocieRef": "RAPPANR5L14B0991"
                }
              ]
            }
          ]
        },
        {
          "xsiType": "Etape_Type",
          "uid": "L14-AN1-DEBATS-28912",
          "codeActe": "AN1-DEBATS",
          "libelleActe": {
            "nomCanonique": "Discussion en séance publique",
            "libelleCourt": "Discussion en séance publique"
          },
          "organeRef": "PO644420",
          "actesLegislatifs": [
            {
              "xsiType": "DiscussionSeancePublique_Type",
              "uid": "L14-VD163971S28296",
              "codeActe": "AN1-DEBATS-SEANCE",
              "libelleActe": {
                "nomCanonique": "Discussion en séance publique",
                "libelleCourt": "Discussion en séance publique"
              },
              "organeRef": "PO644420",
              "dateActe": "2013-06-27T00:00:00.000+02:00",
              "odjRef": "RUANR5L14S2013IDS17292PT28296",
              "reunionRef": "RUANR5L14S2013IDS17292"
            },
            {
              "xsiType": "Decision_Type",
              "uid": "L14-VD164609DEC",
              "codeActe": "AN1-DEBATS-DEC",
              "libelleActe": {
                "nomCanonique": "Décision",
                "libelleCourt": "Décision"
              },
              "organeRef": "PO644420",
              "dateActe": "2013-06-27T00:00:00.000+02:00",
              "reunionRef": "RUANR5L14S2013IDS17292",
              "statutConclusion": {
                "famCode": "TSORTF01",
                "libelle": "adopté"
              },
              "textesAssocies": [
                {
                  "typeTexte": "BTA",
                  "texteAssocieRef": "PRJLANR5L14BTA0166"
                }
              ]
            }
          ]
        }
      ]
    },
    {
      "xsiType": "Etape_Type",
      "uid": "L14-SN1-28912",
      "codeActe": "SN1",
      "libelleActe": {
        "nomCanonique": "1ère lecture (2ème assemblée saisie)",
        "libelleCourt": "1ère lecture"
      },
      "organeRef": "PO78718",
      "actesLegislatifs": [
        {
          "xsiType": "DepotInitiativeNavette_Type",
          "uid": "L14-VD164650DIN",
          "codeActe": "SN1-DEPOT",
          "libelleActe": {
            "nomCanonique": "Dépôt d'une initiative en navette",
            "libelleCourt": "Dépôt d'une initiative en navette"
          },
          "organeRef": "PO78718",
          "dateActe": "2013-06-27T00:00:00.000+02:00",
          "provenanceRef": "PO644420",
          "texteAssocieRef": "PRJLSNR5S199B0699"
        },
        {
          "xsiType": "Etape_Type",
          "uid": "L14-SN1-COM-28912",
          "codeActe": "SN1-COM",
          "libelleActe": {
            "nomCanonique": "Travaux des commissions",
            "libelleCourt": "Travaux des commissions"
          },
          "organeRef": "PO78718",
          "actesLegislatifs": [
            {
              "xsiType": "Etape_Type",
              "uid": "L14-VD164651CF",
              "codeActe": "SN1-COM-FOND",
              "libelleActe": {
                "nomCanonique": "Travaux de la commission saisie au fond",
                "libelleCourt": "Travaux de la commission saisie au fond"
              },
              "organeRef": "PO211491",
              "actesLegislatifs": [
                {
                  "xsiType": "SaisieComFond_Type",
                  "uid": "L14-VD164651CFS",
                  "codeActe": "SN1-COM-FOND-SAISIE",
                  "libelleActe": {
                    "nomCanonique": "Renvoi en commission au fond",
                    "libelleCourt": "Renvoi en commission au fond"
                  },
                  "organeRef": "PO211491",
                  "dateActe": "2013-06-27T00:00:00.000+02:00"
                },
                {
                  "xsiType": "NominRapporteurs_Type",
                  "uid": "L14-VD170506",
                  "codeActe": "SN1-COM-FOND-NOMIN",
                  "libelleActe": {
                    "nomCanonique": "Nomination de rapporteur",
                    "libelleCourt": "Nomination de rapporteur"
                  },
                  "organeRef": "PO211491",
                  "dateActe": "2012-12-12T00:00:00.000+01:00",
                  "rapporteurs": [
                    {
                      "acteurRef": "PA419",
                      "typeRapporteur": "rapporteur"
                    },
                    {
                      "acteurRef": "PA304085",
                      "typeRapporteur": "rapporteur"
                    }
                  ]
                },
                {
                  "xsiType": "DepotRapport_Type",
                  "uid": "L14-VD170509",
                  "codeActe": "SN1-COM-FOND-RAPPORT",
                  "libelleActe": {
                    "nomCanonique": "Dépôt de rapport",
                    "libelleCourt": "Dépôt de rapport"
                  },
                  "organeRef": "PO211491",
                  "dateActe": "2014-06-17T00:00:00.000+02:00",
                  "texteAssocieRef": "RAPPSNR5S199B0699"
                }
              ]
            }
          ]
        },
        {
          "xsiType": "Etape_Type",
          "uid": "L14-SN1-DEBATS-28912",
          "codeActe": "SN1-DEBATS",
          "libelleActe": {
            "nomCanonique": "Discussion en séance publique",
            "libelleCourt": "Discussion en séance publique"
          },
          "organeRef": "PO78718",
          "actesLegislatifs": [
            {
              "xsiType": "DiscussionSeancePublique_Type",
              "uid": "L14-VD170158S30963",
              "codeActe": "SN1-DEBATS-SEANCE",
              "libelleActe": {
                "nomCanonique": "Discussion en séance publique",
                "libelleCourt": "Discussion en séance publique"
              },
              "organeRef": "PO78718",
              "dateActe": "2014-06-24T00:00:00.000+02:00",
              "odjRef": "RUSNR5L14S2014IDS18578PT30963",
              "reunionRef": "RUSNR5L14S2014IDS18578"
            },
            {
              "xsiType": "Decision_Type",
              "uid": "L14-VD170475DEC",
              "codeActe": "SN1-DEBATS-DEC",
              "libelleActe": {
                "nomCanonique": "Décision",
                "libelleCourt": "Décision"
              },
              "organeRef": "PO78718",
              "dateActe": "2014-06-24T00:00:00.000+02:00",
              "reunionRef": "RUSNR5L14S2014IDS18578",
              "statutConclusion": {
                "famCode": "TSORTF03",
                "libelle": "adopté sans modification"
              },
              "textesAssocies": [
                {
                  "typeTexte": "BTA",
                  "texteAssocieRef": "PRJLSNR5S219BTA0144"
                }
              ]
            }
          ]
        }
      ]
    },
    {
      "xsiType": "Etape_Type",
      "uid": "L14-PROM-28912",
      "codeActe": "PROM",
      "libelleActe": {
        "nomCanonique": "Promulgation de la loi",
        "libelleCourt": "Promulgation de la loi"
      },
      "organeRef": "PO696251",
      "actesLegislatifs": [
        {
          "xsiType": "Promulgation_Type",
          "uid": "L14-VD170696PL",
          "codeActe": "PROM-PUB",
          "libelleActe": {
            "nomCanonique": "Promulgation d'une loi",
            "libelleCourt": "Promulgation d'une loi"
          },
          "organeRef": "PO696251",
          "dateActe": "2014-07-07T00:00:00.000+02:00",
          "codeLoi": "2014-771",
          "infoJo": {
            "typeJo": "JO_LOI_DECRET",
            "dateJo": "2014-07-08+02:00",
            "numJo": "156"
          },
          "referenceNor": "MAEJ1204211L",
          "texteLoiRef": "PRJLSNR5S219BTA0144",
          "titreLoi": "autorisant l'approbation de l'accord entre le Gouvernement de la République française et le Gouvernement de la République du Kosovo relatif à la réadmission des personnes en séjour irrégulier et de son protocole d'application",
          "urlLegifrance": "http://www.legifrance.gouv.fr/WAspad/UnTexteDeJorf?numjo=MAEJ1204211L"
        }
      ]
    }
  ]
}