{
  "xsiType": "DossierLegislatif_Type",
  "uid": "DLR5L14N29510",
  "legislature": "14",
  "titreDossier": {
    "titre": "Instauration de mesures de réparation en faveur des orphelins de la guerre de 1939-1945 pupilles de la Nation",
    "titreChemin": "reparation_pupilles_Nation_guerre_1939-1945"
  },
  "procedureParlementaire": {
    "code": "2",
    "libelle": "Proposition de loi ordinaire"
  },
  "initiateur": {
    "acteurs": [
      {
        "acteurRef": "PA606212",
        "mandatRef": "PM645330"
      }
    ]
  },
  "actesLegislatifs": [
    {
      "xsiType": "Etape_Type",
      "uid": "L14-AN1-29510",
      "codeActe": "AN1",
      "libelleActe": {
        "nomCanonique": "1ère lecture (1ère assemblée saisie)",
        "libelleCourt": "1ère lecture"
      },
      "organeRef": "PO644420",
      "actesLegislatifs": [
        {
          "xsiType": "DepotInitiative_Type",
          "uid": "L14-VD161094DI",
          "codeActe": "AN1-DEPOT",
          "libelleActe": {
            "nomCanonique": "1er dépôt d'une initiative.",
            "libelleCourt": "1er dépôt d'une initiative."
          },
          "organeRef": "PO644420",
          "dateActe": "2012-12-19T00:00:00.000+01:00",
          "texteAssocieRef": "PIONANR5L14B0557"
        },
        {
          "xsiType": "Etape_Type",
          "uid": "L14-AN1-COM-29510",
          "codeActe": "AN1-COM",
          "libelleActe": {
            "nomCanonique": "Travaux des commissions",
            "libelleCourt": "Travaux des commissions"
          },
          "organeRef": "PO644420",
          "actesLegislatifs": [
            {
              "xsiType": "Etape_Type",
              "uid": "L14-VD161095CF",
              "codeActe": "AN1-COM-FOND",
              "libelleActe": {
                "nomCanonique": "Travaux de la commission saisie au fond",
                "libelleCourt": "Travaux de la commission saisie au fond"
              },
              "organeRef": "PO59046",
              "actesLegislatifs": [
                {
                  "xsiType": "SaisieComFond_Type",
                  "uid": "L14-VD161095CFS",
                  "codeActe": "AN1-COM-FOND-SAISIE",
                  "libelleActe": {
                    "nomCanonique": "Renvoi en commission au fond",
                    "libelleCourt": "Renvoi en commission au fond"
                  },
                  "organeRef": "PO59046",
                  "dateActe": "2012-12-19T00:00:00.000+01:00"
                }
              ]
            }
          ]
        }
      ]
    }
  ],
  "indexation": {
    "themes": {
      "@niveau": "1",
      "theme": {
        "libelleTheme": "SECURITE CIVILE"
      }
    }
  }
}