{
  "xsiType": "DossierResolutionAN",
  "uid": "DLR5L14N34159",
  "legislature": "14",
  "titreDossier": {
    "titre": "Crise de l'élevage français",
    "titreChemin": "crise_elevage_ffrancais"
  },
  "procedureParlementaire": {
    "code": "8",
    "libelle": "Résolution"
  },
  "initiateur": {
    "acteurs": [
      {
        "acteurRef": "PA2664",
        "mandatRef": "PM645139"
      }
    ]
  },
  "actesLegislatifs": [
    {
      "xsiType": "Etape_Type",
      "uid": "L14-ANLUNI-34159",
      "codeActe": "ANLUNI",
      "libelleActe": {
        "nomCanonique": "Lecture unique"
      },
      "organeRef": "PO644420",
      "actesLegislatifs": [
        {
          "xsiType": "DepotInitiative_Type",
          "uid": "L14-VD174733DI",
          "codeActe": "ANLUNI-DEPOT",
          "libelleActe": {
            "nomCanonique": "1er dépôt d'une initiative.",
            "libelleCourt": "1er dépôt d'une initiative."
          },
          "organeRef": "PO644420",
          "dateActe": "2015-07-21T00:00:00.000+02:00",
          "texteAssocieRef": "PNREANR5L14B2994"
        },
        {
          "xsiType": "Etape_Type",
          "uid": "L14-ANLUNI-COM-34159",
          "codeActe": "ANLUNI-COM",
          "libelleActe": {
            "nomCanonique": "Travaux des commissions",
            "libelleCourt": "Travaux des commissions"
          },
          "organeRef": "PO644420",
          "actesLegislatifs": [
            {
              "xsiType": "Etape_Type",
              "uid": "L14-VD174734CF",
              "codeActe": "ANLUNI-COM-FOND",
              "libelleActe": {
                "nomCanonique": "Travaux de la commission saisie au fond",
                "libelleCourt": "Travaux de la commission saisie au fond"
              },
              "organeRef": "PO419610",
              "actesLegislatifs": [
                {
                  "xsiType": "SaisieComFond_Type",
                  "uid": "L14-VD174734CFS",
                  "codeActe": "ANLUNI-COM-FOND-SAISIE",
                  "libelleActe": {
                    "nomCanonique": "Renvoi en commission au fond",
                    "libelleCourt": "Renvoi en commission au fond"
                  },
                  "organeRef": "PO419610",
                  "dateActe": "2015-07-21T00:00:00.000+02:00"
                }
              ]
            }
          ]
        }
      ]
    }
  ]
}