{
  "xsiType": "DossierLegislatif_Type",
  "uid": "DLR5L14N33863",
  "legislature": "14",
  "titreDossier": {
    "titre": "Outre-mer : modification de la loi relative à l'octroi de mer",
    "titreChemin": "modification_loi_octroi_mer",
    "senatChemin": "http://www.senat.fr/dossier-legislatif/pjl14-366.html"
  },
  "procedureParlementaire": {
    "code": "1",
    "libelle": "Projet de loi ordinaire"
  },
  "initiateur": {
    "acteurs": [
      {
        "acteurRef": "PA267622",
        "mandatRef": "PM702957"
      }
    ]
  },
  "actesLegislatifs": [
    {
      "xsiType": "Etape_Type",
      "uid": "L14-SN1-33863",
      "codeActe": "SN1",
      "libelleActe": {
        "nomCanonique": "1ère lecture (1ère assemblée saisie)",
        "libelleCourt": "1ère lecture"
      },
      "organeRef": "PO78718",
      "actesLegislatifs": [
        {
          "xsiType": "DepotInitiative_Type",
          "uid": "L14-VD173306DI",
          "codeActe": "SN1-DEPOT",
          "libelleActe": {
            "nomCanonique": "1er dépôt d'une initiative.",
            "libelleCourt": "1er dépôt d'une initiative."
          },
          "organeRef": "PO78718",
          "dateActe": "2015-03-25T00:00:00.000+01:00",
          "texteAssocieRef": "PRJLSNR5S239B0366"
        },
        {
          "xsiType": "ProcedureAccelere_Type",
          "uid": "L14-VD173311",
          "codeActe": "SN1-PROCACC",
          "libelleActe": {
            "nomCanonique": "Le gouvernement déclare l'urgence / engage la procédure accélérée",
            "libelleCourt": "Le gouvernement déclare l'urgence / engage la procédure accélérée"
          },
          "organeRef": "PO702883",
          "dateActe": "2015-03-25T00:00:00.000+01:00"
        },
        {
          "xsiType": "Etape_Type",
          "uid": "L14-SN1-COM-33863",
          "codeActe": "SN1-COM",
          "libelleActe": {
            "nomCanonique": "Travaux des commissions",
            "libelleCourt": "Travaux des commissions"
          },
          "organeRef": "PO78718",
          "actesLegislatifs": [
            {
              "xsiType": "Etape_Type",
              "uid": "L14-VD173307CF",
              "codeActe": "SN1-COM-FOND",
              "libelleActe": {
                "nomCanonique": "Travaux de la commission saisie au fond",
                "libelleCourt": "Travaux de la commission saisie au fond"
              },
              "organeRef": "PO211494",
              "actesLegislatifs": [
                {
                  "xsiType": "SaisieComFond_Type",
                  "uid": "L14-VD173307CFS",
                  "codeActe": "SN1-COM-FOND-SAISIE",
                  "libelleActe": {
                    "nomCanonique": "Renvoi en commission au fond",
                    "libelleCourt": "Renvoi en commission au fond"
                  },
                  "organeRef": "PO211494",
                  "dateActe": "2015-03-25T00:00:00.000+01:00"
                },
                {
                  "xsiType": "NominRapporteurs_Type",
                  "uid": "L14-VD173488",
                  "codeActe": "SN1-COM-FOND-NOMIN",
                  "libelleActe": {
                    "nomCanonique": "Nomination de rapporteur",
                    "libelleCourt": "Nomination de rapporteur"
                  },
                  "organeRef": "PO211494",
                  "dateActe": "2015-03-31T00:00:00.000+02:00",
                  "rapporteurs": [
                    {
                      "acteurRef": "PA1142",
                      "typeRapporteur": "rapporteur"
                    }
                  ]
                },
                {
                  "xsiType": "DepotRapport_Type",
                  "uid": "L14-VD173489",
                  "codeActe": "SN1-COM-FOND-RAPPORT",
                  "libelleActe": {
                    "nomCanonique": "Dépôt de rapport",
                    "libelleCourt": "Dépôt de rapport"
                  },
                  "organeRef": "PO211494",
                  "dateActe": "2015-04-15T00:00:00.000+02:00",
                  "texteAssocieRef": "RAPPSNR5S239B0407"
                }
              ]
            }
          ]
        },
        {
          "xsiType": "Etape_Type",
          "uid": "L14-SN1-DEBATS-33863",
          "codeActe": "SN1-DEBATS",
          "libelleActe": {
            "nomCanonique": "Discussion en séance publique",
            "libelleCourt": "Discussion en séance publique"
          },
          "organeRef": "PO78718",
          "actesLegislatifs": [
            {
              "xsiType": "DiscussionSeancePublique_Type",
              "uid": "L14-VD173497S32159",
              "codeActe": "SN1-DEBATS-SEANCE",
              "libelleActe": {
                "nomCanonique": "Discussion en séance publique",
                "libelleCourt": "Discussion en séance publique"
              },
              "organeRef": "PO78718",
              "dateActe": "2015-05-07T00:00:00.000+02:00",
              "odjRef": "RUSNR5L14S2015IDS19232PT32159",
              "reunionRef": "RUSNR5L14S2015IDS19232"
            },
            {
              "xsiType": "Decision_Type",
              "uid": "L14-VD173609DEC",
              "codeActe": "SN1-DEBATS-DEC",
              "libelleActe": {
                "nomCanonique": "Décision",
                "libelleCourt": "Décision"
              },
              "organeRef": "PO78718",
              "dateActe": "2015-05-07T00:00:00.000+02:00",
              "reunionRef": "RUSNR5L14S2015IDS19232",
              "statutConclusion": {
                "famCode": "TSORTF01",
                "libelle": "adopté"
              },
              "textesAssocies": [
                {
                  "typeTexte": "BTA",
                  "texteAssocieRef": "PRJLSNR5S239BTA0098"
                }
              ]
            }
          ]
        }
      ]
    },
    {
      "xsiType": "Etape_Type",
      "uid": "L14-AN1-33863",
      "codeActe": "AN1",
      "libelleActe": {
        "nomCanonique": "1ère lecture (2ème assemblée saisie)",
        "libelleCourt": "1ère lecture"
      },
      "organeRef": "PO644420",
      "actesLegislatifs": [
        {
          "xsiType": "DepotInitiativeNavette_Type",
          "uid": "L14-VD173611DIN",
          "codeActe": "AN1-DEPOT",
          "libelleActe": {
            "nomCanonique": "Dépôt d'une initiative en navette",
            "libelleCourt": "Dépôt d'une initiative en navette"
          },
          "organeRef": "PO644420",
          "dateActe": "2015-05-11T00:00:00.000+02:00",
          "provenanceRef": "PO78718",
          "texteAssocieRef": "PRJLANR5L14B2759"
        },
        {
          "xsiType": "Etape_Type",
          "uid": "L14-AN1-COM-33863",
          "codeActe": "AN1-COM",
          "libelleActe": {
            "nomCanonique": "Travaux des commissions",
            "libelleCourt": "Travaux des commissions"
          },
          "organeRef": "PO644420",
          "actesLegislatifs": [
            {
              "xsiType": "Etape_Type",
              "uid": "L14-VD173612CF",
              "codeActe": "AN1-COM-FOND",
              "libelleActe": {
                "nomCanonique": "Travaux de la commission saisie au fond",
                "libelleCourt": "Travaux de la commission saisie au fond"
              },
              "organeRef": "PO59048",
              "actesLegislatifs": [
                {
                  "xsiType": "SaisieComFond_Type",
                  "uid": "L14-VD173612CFS",
                  "codeActe": "AN1-COM-FOND-SAISIE",
                  "libelleActe": {
                    "nomCanonique": "Renvoi en commission au fond",
                    "libelleCourt": "Renvoi en commission au fond"
                  },
                  "organeRef": "PO59048",
                  "dateActe": "2015-05-11T00:00:00.000+02:00"
                },
                {
                  "xsiType": "NominRapporteurs_Type",
                  "uid": "L14-VD173701",
                  "codeActe": "AN1-COM-FOND-NOMIN",
                  "libelleActe": {
                    "nomCanonique": "Nomination de rapporteur",
                    "libelleCourt": "Nomination de rapporteur"
                  },
                  "organeRef": "PO59048",
                  "dateActe": "2015-05-19T00:00:00.000+02:00",
                  "rapporteurs": [
                    {
                      "acteurRef": "PA339",
                      "typeRapporteur": "rapporteur"
                    }
                  ]
                },
                {
                  "xsiType": "DiscussionCommission_Type",
                  "uid": "L14-VD173643R22319",
                  "codeActe": "AN1-COM-FOND-REUNION",
                  "libelleActe": {
                    "nomCanonique": "Réunion de commission",
                    "libelleCourt": "Réunion de commission"
                  },
                  "organeRef": "PO59048",
                  "dateActe": "2015-05-19T16:15:00.000+02:00",
                  "odjRef": "RUANR5L14S2015IDC423546PT22319",
                  "reunionRef": "RUANR5L14S2015IDC423546"
                },
                {
                  "xsiType": "DiscussionCommission_Type",
                  "uid": "L14-VD173643R22307",
                  "codeActe": "AN1-COM-FOND-REUNION",
                  "libelleActe": {
                    "nomCanonique": "Réunion de commission",
                    "libelleCourt": "Réunion de commission"
                  },
                  "organeRef": "PO59048",
                  "dateActe": "2015-05-27T09:30:00.000+02:00"
                },
                {
                  "xsiType": "DiscussionCommission_Type",
                  "uid": "L14-VD173643R22347",
                  "codeActe": "AN1-COM-FOND-REUNION",
                  "libelleActe": {
                    "nomCanonique": "Réunion de commission",
                    "libelleCourt": "Réunion de commission"
                  },
                  "organeRef": "PO59048",
                  "dateActe": "2015-06-01T15:45:00.000+02:00",
                  "odjRef": "RUANR5L14S2015IDC423632PT22347",
                  "reunionRef": "RUANR5L14S2015IDC423632"
                },
                {
                  "xsiType": "DepotRapport_Type",
                  "uid": "L14-VD173825",
                  "codeActe": "AN1-COM-FOND-RAPPORT",
                  "libelleActe": {
                    "nomCanonique": "Dépôt de rapport",
                    "libelleCourt": "Dépôt de rapport"
                  },
                  "organeRef": "PO59048",
                  "dateActe": "2015-05-27T00:00:00.000+02:00",
                  "texteAdopteRef": "PRJLANR5L14BTC2808",
                  "texteAssocieRef": "RAPPANR5L14B2808"
                }
              ]
            }
          ]
        },
        {
          "xsiType": "Etape_Type",
          "uid": "L14-AN1-DEBATS-33863",
          "codeActe": "AN1-DEBATS",
          "libelleActe": {
            "nomCanonique": "Discussion en séance publique",
            "libelleCourt": "Discussion en séance publique"
          },
          "organeRef": "PO644420",
          "actesLegislatifs": [
            {
              "xsiType": "DiscussionSeancePublique_Type",
              "uid": "L14-VD173669S32222",
              "codeActe": "AN1-DEBATS-SEANCE",
              "libelleActe": {
                "nomCanonique": "Discussion en séance publique",
                "libelleCourt": "Discussion en séance publique"
              },
              "organeRef": "PO644420",
              "dateActe": "2015-06-01T00:00:00.000+02:00",
              "odjRef": "RUANR5L14S2015IDS19294PT32222",
              "reunionRef": "RUANR5L14S2015IDS19294"
            },
            {
              "xsiType": "Decision_Type",
              "uid": "L14-VD173898DEC",
              "codeActe": "AN1-DEBATS-DEC",
              "libelleActe": {
                "nomCanonique": "Décision",
                "libelleCourt": "Décision"
              },
              "organeRef": "PO644420",
              "dateActe": "2015-06-01T00:00:00.000+02:00",
              "reunionRef": "RUANR5L14S2015IDS19294",
              "statutConclusion": {
                "famCode": "TSORTF05",
                "libelle": "modifié"
              },
              "textesAssocies": [
                {
                  "typeTexte": "BTA",
                  "texteAssocieRef": "PRJLANR5L14BTA0520"
                }
              ]
            }
          ]
        }
      ]
    },
    {
      "xsiType": "Etape_Type",
      "uid": "L14-CMP-33863",
      "codeActe": "CMP",
      "libelleActe": {
        "nomCanonique": "Commission Mixte Paritaire",
        "libelleCourt": "Commission Mixte Paritaire"
      },
      "organeRef": "PO708315",
      "actesLegislatifs": [
        {
          "xsiType": "DepotInitiativeNavette_Type",
          "uid": "L14-VD173911DIN",
          "codeActe": "CMP-DEPOT",
          "libelleActe": {
            "nomCanonique": "Dépôt d'un projet de loi",
            "libelleCourt": "Dépôt d'un projet de loi"
          },
          "organeRef": "PO708315",
          "dateActe": "2015-06-02T00:00:00.000+02:00",
          "provenanceRef": "PO644420",
          "texteAssocieRef": "PRJLSNR5S239B0475"
        },
        {
          "xsiType": "RenvoiCMP_Type",
          "uid": "L14-VD173913CMPS",
          "codeActe": "CMP-SAISIE",
          "libelleActe": {
            "nomCanonique": "Convocation d'une CMP",
            "libelleCourt": "Convocation d'une CMP"
          },
          "organeRef": "PO708315",
          "dateActe": "2015-06-02T00:00:00.000+02:00",
          "initiateur": {
            "acteurs": [
              {
                "acteurRef": "PA267622",
                "mandatRef": "PM702957"
              }
            ]
          }
        },
        {
          "xsiType": "Etape_Type",
          "uid": "L14-VD173913COM",
          "codeActe": "CMP-COM",
          "libelleActe": {
            "nomCanonique": "Commission Mixte Paritaire",
            "libelleCourt": "Commission Mixte Paritaire"
          },
          "organeRef": "PO708315",
          "actesLegislatifs": [
            {
              "xsiType": "NominRapporteurs_Type",
              "uid": "L14-VD174036",
              "codeActe": "CMP-COM-NOMIN",
              "libelleActe": {
                "nomCanonique": "Nomination de rapporteur",
                "libelleCourt": "Nomination de rapporteur"
              },
              "organeRef": "PO708315",
              "dateActe": "2015-06-11T00:00:00.000+02:00",
              "rapporteurs": [
                {
                  "acteurRef": "PA1155",
                  "typeRapporteur": "rapporteur"
                },
                {
                  "acteurRef": "PA1142",
                  "typeRapporteur": "rapporteur"
                }
              ]
            },
            {
              "xsiType": "DepotRapport_Type",
              "uid": "L14-VD174040",
              "codeActe": "CMP-COM-RAPPORT-AN",
              "libelleActe": {
                "nomCanonique": "Dépôt du rapport d'une CMP",
                "libelleCourt": "Dépôt du rapport d'une CMP"
              },
              "organeRef": "PO644420",
              "dateActe": "2015-06-11T00:00:00.000+02:00",
              "texteAssocieRef": "RAPPANR5L14B2865"
            },
            {
              "xsiType": "DepotRapport_Type",
              "uid": "L14-VD174045",
              "codeActe": "CMP-COM-RAPPORT-SN",
              "libelleActe": {
                "nomCanonique": "Dépôt du rapport d'une CMP",
                "libelleCourt": "Dépôt du rapport d'une CMP"
              },
              "organeRef": "PO78718",
              "dateActe": "2015-06-11T00:00:00.000+02:00",
              "texteAssocieRef": "RAPPSNR5S239B0515"
            }
          ]
        },
        {
          "xsiType": "Etape_Type",
          "uid": "L14-CMP-DEBATS-AN-33863",
          "codeActe": "CMP-DEBATS-AN",
          "libelleActe": {
            "nomCanonique": "Discussion en séance publique",
            "libelleCourt": "Discussion en séance publique"
          },
          "organeRef": "PO644420",
          "actesLegislatifs": [
            {
              "xsiType": "DiscussionSeancePublique_Type",
              "uid": "L14-VD174104S32384",
              "codeActe": "CMP-DEBATS-AN-SEANCE",
              "libelleActe": {
                "nomCanonique": "Discussion en séance publique",
                "libelleCourt": "Discussion en séance publique"
              },
              "organeRef": "PO644420",
              "dateActe": "2015-06-16T00:00:00.000+02:00",
              "odjRef": "RUANR5L14S2015IDS19332PT32384",
              "reunionRef": "RUANR5L14S2015IDS19332"
            },
            {
              "xsiType": "Decision_Type",
              "uid": "L14-VD174121DEC",
              "codeActe": "CMP-DEBATS-AN-DEC",
              "libelleActe": {
                "nomCanonique": "Décision",
                "libelleCourt": "Décision"
              },
              "organeRef": "PO644420",
              "dateActe": "2015-06-16T00:00:00.000+02:00",
              "reunionRef": "RUANR5L14S2015IDS19332",
              "statutConclusion": {
                "famCode": "TSORTF18",
                "libelle": "adopté, dans les conditions prévues à l'article 45, alinéa 3, de la Constitution"
              },
              "textesAssocies": [
                {
                  "typeTexte": "BTA",
                  "texteAssocieRef": "PRJLANR5L14BTA0537"
                }
              ]
            }
          ]
        },
        {
          "xsiType": "Etape_Type",
          "uid": "L14-CMP-DEBATS-SN-33863",
          "codeActe": "CMP-DEBATS-SN",
          "libelleActe": {
            "nomCanonique": "Discussion en séance publique",
            "libelleCourt": "Discussion en séance publique"
          },
          "organeRef": "PO78718",
          "actesLegislatifs": [
            {
              "xsiType": "DiscussionSeancePublique_Type",
              "uid": "L14-VD174085S32378",
              "codeActe": "CMP-DEBATS-SN-SEANCE",
              "libelleActe": {
                "nomCanonique": "Discussion en séance publique",
                "libelleCourt": "Discussion en séance publique"
              },
              "organeRef": "PO78718",
              "dateActe": "2015-06-18T00:00:00.000+02:00",
              "odjRef": "RUSNR5L14S2015IDS19293PT32378",
              "reunionRef": "RUSNR5L14S2015IDS19293"
            },
            {
              "xsiType": "Decision_Type",
              "uid": "L14-VD174164DEC",
              "codeActe": "CMP-DEBATS-SN-DEC",
              "libelleActe": {
                "nomCanonique": "Décision",
                "libelleCourt": "Décision"
              },
              "organeRef": "PO78718",
              "dateActe": "2015-06-18T00:00:00.000+02:00",
              "reunionRef": "RUSNR5L14S2015IDS19293",
              "statutConclusion": {
                "famCode": "TSORTF18",
                "libelle": "adopté, dans les conditions prévues à l'article 45, alinéa 3, de la Constitution"
              },
              "textesAssocies": [
                {
                  "typeTexte": "BTA",
                  "texteAssocieRef": "PRJLSNR5S239BTA0115"
                }
              ]
            }
          ]
        },
        {
          "xsiType": "Decision_Type",
          "uid": "L14-VD173913DEC",
          "codeActe": "CMP-DEC",
          "libelleActe": {
            "nomCanonique": "Décision de la CMP",
            "libelleCourt": "Décision de la CMP"
          },
          "organeRef": "PO708315",
          "dateActe": "2015-06-11T00:00:00.000+02:00",
          "statutConclusion": {
            "famCode": "TCCMP01",
            "libelle": "Accord"
          }
        }
      ]
    },
    {
      "xsiType": "Etape_Type",
      "uid": "L14-PROM-33863",
      "codeActe": "PROM",
      "libelleActe": {
        "nomCanonique": "Promulgation de la loi",
        "libelleCourt": "Promulgation de la loi"
      },
      "organeRef": "PO696251",
      "actesLegislatifs": [
        {
          "xsiType": "Promulgation_Type",
          "uid": "L14-VD174304PL",
          "codeActe": "PROM-PUB",
          "libelleActe": {
            "nomCanonique": "Promulgation d'une loi",
            "libelleCourt": "Promulgation d'une loi"
          },
          "organeRef": "PO696251",
          "dateActe": "2015-06-29T00:00:00.000+02:00",
          "codeLoi": "2015-762",
          "infoJo": {
            "typeJo": "JO_LOI_DECRET",
            "dateJo": "2015-06-30+02:00",
            "numJo": "149"
          },
          "referenceNor": "OMES1503295L",
          "texteLoiRef": "PRJLSNR5S239BTA0115",
          "titreLoi": "modifiant la loi n° 2004-639 du 2 juillet 2004 relative à l'octroi de mer",
          "urlLegifrance": "http://www.legifrance.gouv.fr/WAspad/UnTexteDeJorf?numjo=OMES1503295L"
        }
      ]
    }
  ]
}