{
  "xsiType": "rapportParlementaire_Type",
  "uid": "RAPPSNR5S239B0520",
  "cycleDeVie": {
    "chrono": {
      "dateCreation": "2015-06-17T00:00:00.000+02:00",
      "dateDepot": "2015-06-16T00:00:00.000+02:00",
      "datePublication": "2015-06-23T00:00:00.000+02:00"
    }
  },
  "denominationStructurelle": "Rapport",
  "provenance": "Commission",
  "titres": {
    "titrePrincipal": "rapport sur  les dispositions restant en discussion de la commission mixte paritaire chargée de proposer un texte dus dispositions restant en discussion du projet de loi relatif au renseignement",
    "titrePrincipalCourt": "rapport sur  les dispositions restant en discussion de la commission mixte paritaire chargée de proposer un texte dus dispositions restant en discussion du projet de loi relatif au renseignement"
  },
  "dossierRef": "DLR5L14N33839",
  "classification": {
    "famille": {
      "depot": {
        "code": "RAPINIT",
        "libelle": "Rapport sur une initiative"
      },
      "classe": {
        "code": "RAPPORT",
        "libelle": "Rapport"
      }
    },
    "type": {
      "code": "RAPP",
      "libelle": "Rapport"
    }
  },
  "auteurs": [
    {
      "acteur": {
        "acteurRef": "PA429858",
        "qualite": "rapporteur"
      }
    },
    {
      "organeRef": "PO708438"
    }
  ],
  "notice": {
    "numNotice": "520",
    "formule": "de la commission mixte paritaire chargée de proposer un texte sur les dispositions restant en discussion de la commission mixte paritaire chargée de proposer un texte dus dispositions restant en discussion du projet de loi relatif au renseignement",
    "adoptionConforme": false
  }
}