{
  "xsiType": "DossierLegislatif_Type",
  "uid": "DLR5L14N29815",
  "legislature": "14",
  "titreDossier": {
    "titre": "Pouvoirs publics : représentation des Français établis hors de France",
    "titreChemin": "representation_expatries",
    "senatChemin": "http://www.senat.fr/dossier-legislatif/pjl12-376.html"
  },
  "procedureParlementaire": {
    "code": "1",
    "libelle": "Projet de loi ordinaire"
  },
  "initiateur": {
    "acteurs": [
      {
        "acteurRef": "PA328",
        "mandatRef": "PM653228"
      }
    ]
  },
  "actesLegislatifs": [
    {
      "xsiType": "Etape_Type",
      "uid": "L14-SN1-29815",
      "codeActe": "SN1",
      "libelleActe": {
        "nomCanonique": "1ère lecture (1ère assemblée saisie)",
        "libelleCourt": "1ère lecture"
      },
      "organeRef": "PO78718",
      "actesLegislatifs": [
        {
          "xsiType": "DepotInitiative_Type",
          "uid": "L14-VD161986DI",
          "codeActe": "SN1-DEPOT",
          "libelleActe": {
            "nomCanonique": "1er dépôt d'une initiative.",
            "libelleCourt": "1er dépôt d'une initiative."
          },
          "organeRef": "PO78718",
          "dateActe": "2013-02-20T00:00:00.000+01:00",
          "texteAssocieRef": "PRJLSNR5S199B0376"
        },
        {
          "xsiType": "EtudeImpact_Type",
          "uid": "L14-VD161986ETI",
          "codeActe": "SN1-ETI",
          "libelleActe": {
            "nomCanonique": "Etude d'impact",
            "libelleCourt": "Etude d'impact"
          },
          "organeRef": "PO78718",
          "dateActe": "2013-02-20T00:00:00.000+01:00",
          "contributionInternaute": {},
          "texteAssocieRef": "ETDISNR5S199B0376"
        },
        {
          "xsiType": "ProcedureAccelere_Type",
          "uid": "L14-VD161990",
          "codeActe": "SN1-PROCACC",
          "libelleActe": {
            "nomCanonique": "Le gouvernement déclare l'urgence / engage la procédure accélérée",
            "libelleCourt": "Le gouvernement déclare l'urgence / engage la procédure accélérée"
          },
          "organeRef": "PO653199",
          "dateActe": "2013-02-20T00:00:00.000+01:00"
        },
        {
          "xsiType": "Etape_Type",
          "uid": "L14-SN1-COM-29815",
          "codeActe": "SN1-COM",
          "libelleActe": {
            "nomCanonique": "Travaux des commissions",
            "libelleCourt": "Travaux des commissions"
          },
          "organeRef": "PO78718",
          "actesLegislatifs": [
            {
              "xsiType": "Etape_Type",
              "uid": "L14-VD161987CF",
              "codeActe": "SN1-COM-FOND",
              "libelleActe": {
                "nomCanonique": "Travaux de la commission saisie au fond",
                "libelleCourt": "Travaux de la commission saisie au fond"
              },
              "organeRef": "PO211495",
              "actesLegislatifs": [
                {
                  "xsiType": "SaisieComFond_Type",
                  "uid": "L14-VD161987CFS",
                  "codeActe": "SN1-COM-FOND-SAISIE",
                  "libelleActe": {
                    "nomCanonique": "Renvoi en commission au fond",
                    "libelleCourt": "Renvoi en commission au fond"
                  },
                  "organeRef": "PO211495",
                  "dateActe": "2013-02-20T00:00:00.000+01:00"
                },
                {
                  "xsiType": "NominRapporteurs_Type",
                  "uid": "L14-VD162360",
                  "codeActe": "SN1-COM-FOND-NOMIN",
                  "libelleActe": {
                    "nomCanonique": "Nomination de rapporteur",
                    "libelleCourt": "Nomination de rapporteur"
                  },
                  "organeRef": "PO211495",
                  "dateActe": "2013-02-13T00:00:00.000+01:00",
                  "rapporteurs": [
                    {
                      "acteurRef": "PA429860",
                      "typeRapporteur": "rapporteur"
                    }
                  ]
                },
                {
                  "xsiType": "DepotRapport_Type",
                  "uid": "L14-VD162362",
                  "codeActe": "SN1-COM-FOND-RAPPORT",
                  "libelleActe": {
                    "nomCanonique": "Dépôt de rapport",
                    "libelleCourt": "Dépôt de rapport"
                  },
                  "organeRef": "PO211495",
                  "dateActe": "2013-03-13T00:00:00.000+01:00",
                  "texteAssocieRef": "RAPPSNR5S199B0376"
                }
              ]
            }
          ]
        },
        {
          "xsiType": "Etape_Type",
          "uid": "L14-SN1-DEBATS-29815",
          "codeActe": "SN1-DEBATS",
          "libelleActe": {
            "nomCanonique": "Discussion en séance publique",
            "libelleCourt": "Discussion en séance publique"
          },
          "organeRef": "PO78718",
          "actesLegislatifs": [
            {
              "xsiType": "DiscussionSeancePublique_Type",
              "uid": "L14-VD162044S27596",
              "codeActe": "SN1-DEBATS-SEANCE",
              "libelleActe": {
                "nomCanonique": "Discussion en séance publique",
                "libelleCourt": "Discussion en séance publique"
              },
              "organeRef": "PO78718",
              "dateActe": "2013-03-18T00:00:00.000+01:00",
              "odjRef": "RUSNR5L14S2013IDS16969PT27596",
              "reunionRef": "RUSNR5L14S2013IDS16969"
            },
            {
              "xsiType": "DiscussionSeancePublique_Type",
              "uid": "L14-VD162044S27600",
              "codeActe": "SN1-DEBATS-SEANCE",
              "libelleActe": {
                "nomCanonique": "Discussion en séance publique",
                "libelleCourt": "Discussion en séance publique"
              },
              "organeRef": "PO78718",
              "dateActe": "2013-03-19T00:00:00.000+01:00",
              "odjRef": "RUSNR5L14S2013IDS16970PT27600",
              "reunionRef": "RUSNR5L14S2013IDS16970"
            },
            {
              "xsiType": "Decision_Type",
              "uid": "L14-VD162411DEC",
              "codeActe": "SN1-DEBATS-DEC",
              "libelleActe": {
                "nomCanonique": "Décision",
                "libelleCourt": "Décision"
              },
              "organeRef": "PO78718",
              "dateActe": "2013-03-19T00:00:00.000+01:00",
              "reunionRef": "RUSNR5L14S2013IDS16970",
              "statutConclusion": {
                "famCode": "TSORTF01",
                "libelle": "adopté"
              },
              "textesAssocies": [
                {
                  "typeTexte": "BTA",
                  "texteAssocieRef": "PRJLSNR5S199BTA0120"
                }
              ]
            }
          ]
        }
      ]
    },
    {
      "xsiType": "Etape_Type",
      "uid": "L14-AN1-29815",
      "codeActe": "AN1",
      "libelleActe": {
        "nomCanonique": "1ère lecture (2ème assemblée saisie)",
        "libelleCourt": "1ère lecture"
      },
      "organeRef": "PO644420",
      "actesLegislatifs": [
        {
          "xsiType": "DepotInitiativeNavette_Type",
          "uid": "L14-VD162425DIN",
          "codeActe": "AN1-DEPOT",
          "libelleActe": {
            "nomCanonique": "Dépôt d'une initiative en navette",
            "libelleCourt": "Dépôt d'une initiative en navette"
          },
          "organeRef": "PO644420",
          "dateActe": "2013-03-20T00:00:00.000+01:00",
          "provenanceRef": "PO78718",
          "texteAssocieRef": "PRJLANR5L14B0834"
        },
        {
          "xsiType": "Etape_Type",
          "uid": "L14-AN1-COM-29815",
          "codeActe": "AN1-COM",
          "libelleActe": {
            "nomCanonique": "Travaux des commissions",
            "libelleCourt": "Travaux des commissions"
          },
          "organeRef": "PO644420",
          "actesLegislatifs": [
            {
              "xsiType": "Etape_Type",
              "uid": "L14-VD162426CF",
              "codeActe": "AN1-COM-FOND",
              "libelleActe": {
                "nomCanonique": "Travaux de la commission saisie au fond",
                "libelleCourt": "Travaux de la commission saisie au fond"
              },
              "organeRef": "PO59051",
              "actesLegislatifs": [
                {
                  "xsiType": "SaisieComFond_Type",
                  "uid": "L14-VD162426CFS",
                  "codeActe": "AN1-COM-FOND-SAISIE",
                  "libelleActe": {
                    "nomCanonique": "Renvoi en commission au fond",
                    "libelleCourt": "Renvoi en commission au fond"
                  },
                  "organeRef": "PO59051",
                  "dateActe": "2013-03-20T00:00:00.000+01:00"
                },
                {
                  "xsiType": "NominRapporteurs_Type",
                  "uid": "L14-VD162807",
                  "codeActe": "AN1-COM-FOND-NOMIN",
                  "libelleActe": {
                    "nomCanonique": "Nomination de rapporteur",
                    "libelleCourt": "Nomination de rapporteur"
                  },
                  "organeRef": "PO59051",
                  "dateActe": "2013-03-13T00:00:00.000+01:00",
                  "rapporteurs": [
                    {
                      "acteurRef": "PA609775",
                      "typeRapporteur": "rapporteur"
                    }
                  ]
                },
                {
                  "xsiType": "DiscussionCommission_Type",
                  "uid": "L14-VD162469R17238",
                  "codeActe": "AN1-COM-FOND-REUNION",
                  "libelleActe": {
                    "nomCanonique": "Réunion de commission",
                    "libelleCourt": "Réunion de commission"
                  },
                  "organeRef": "PO59051",
                  "dateActe": "2013-04-02T14:00:00.000+02:00",
                  "odjRef": "RUANR5L14S2013IDC416702PT17238",
                  "reunionRef": "RUANR5L14S2013IDC416702"
                },
                {
                  "xsiType": "DiscussionCommission_Type",
                  "uid": "L14-VD162469R17232",
                  "codeActe": "AN1-COM-FOND-REUNION",
                  "libelleActe": {
                    "nomCanonique": "Réunion de commission",
                    "libelleCourt": "Réunion de commission"
                  },
                  "organeRef": "PO59051",
                  "dateActe": "2013-04-03T10:00:00.000+02:00",
                  "odjRef": "RUANR5L14S2013IDC416703PT17232",
                  "reunionRef": "RUANR5L14S2013IDC416703"
                },
                {
                  "xsiType": "DiscussionCommission_Type",
                  "uid": "L14-VD162469R17437",
                  "codeActe": "AN1-COM-FOND-REUNION",
                  "libelleActe": {
                    "nomCanonique": "Réunion de commission",
                    "libelleCourt": "Réunion de commission"
                  },
                  "organeRef": "PO59051",
                  "dateActe": "2013-05-14T14:45:00.000+02:00",
                  "odjRef": "RUANR5L14S2013IDC417081PT17437",
                  "reunionRef": "RUANR5L14S2013IDC417081"
                },
                {
                  "xsiType": "DepotRapport_Type",
                  "uid": "L14-VD162809",
                  "codeActe": "AN1-COM-FOND-RAPPORT",
                  "libelleActe": {
                    "nomCanonique": "Dépôt de rapport",
                    "libelleCourt": "Dépôt de rapport"
                  },
                  "organeRef": "PO59051",
                  "dateActe": "2013-04-03T00:00:00.000+02:00",
                  "texteAdopteRef": "PRJLANR5L14BTC0884",
                  "texteAssocieRef": "RAPPANR5L14B0884"
                }
              ]
            }
          ]
        },
        {
          "xsiType": "Etape_Type",
          "uid": "L14-AN1-DEBATS-29815",
          "codeActe": "AN1-DEBATS",
          "libelleActe": {
            "nomCanonique": "Discussion en séance publique",
            "libelleCourt": "Discussion en séance publique"
          },
          "organeRef": "PO644420",
          "actesLegislatifs": [
            {
              "xsiType": "DiscussionSeancePublique_Type",
              "uid": "L14-VD163041S27961",
              "codeActe": "AN1-DEBATS-SEANCE",
              "libelleActe": {
                "nomCanonique": "Discussion en séance publique",
                "libelleCourt": "Discussion en séance publique"
              },
              "organeRef": "PO644420",
              "dateActe": "2013-05-14T00:00:00.000+02:00",
              "odjRef": "RUANR5L14S2013IDS17103PT27961",
              "reunionRef": "RUANR5L14S2013IDS17103"
            },
            {
              "xsiType": "DiscussionSeancePublique_Type",
              "uid": "L14-VD163041S27963",
              "codeActe": "AN1-DEBATS-SEANCE",
              "libelleActe": {
                "nomCanonique": "Discussion en séance publique",
                "libelleCourt": "Discussion en séance publique"
              },
              "organeRef": "PO644420",
              "dateActe": "2013-05-14T00:00:00.000+02:00",
              "odjRef": "RUANR5L14S2013IDS17104PT27963",
              "reunionRef": "RUANR5L14S2013IDS17104"
            },
            {
              "xsiType": "Decision_Type",
              "uid": "L14-VD163548DEC",
              "codeActe": "AN1-DEBATS-DEC",
              "libelleActe": {
                "nomCanonique": "Décision",
                "libelleCourt": "Décision"
              },
              "organeRef": "PO644420",
              "dateActe": "2013-05-14T00:00:00.000+02:00",
              "reunionRef": "RUANR5L14S2013IDS17104",
              "statutConclusion": {
                "famCode": "TSORTF05",
                "libelle": "modifié"
              },
              "textesAssocies": [
                {
                  "typeTexte": "BTA",
                  "texteAssocieRef": "PRJLANR5L14BTA0136"
                }
              ]
            }
          ]
        }
      ]
    },
    {
      "xsiType": "Etape_Type",
      "uid": "L14-SN2-29815",
      "codeActe": "SN2",
      "libelleActe": {
        "nomCanonique": "deuxième lecture",
        "libelleCourt": "2ème lecture"
      },
      "organeRef": "PO78718",
      "actesLegislatifs": [
        {
          "xsiType": "DepotInitiativeNavette_Type",
          "uid": "L14-VD163607DIN",
          "codeActe": "SN2-DEPOT",
          "libelleActe": {
            "nomCanonique": "Dépôt d'une initiative en navette",
            "libelleCourt": "Dépôt d'une initiative en navette"
          },
          "organeRef": "PO78718",
          "dateActe": "2013-05-15T00:00:00.000+02:00",
          "provenanceRef": "PO644420",
          "texteAssocieRef": "PRJLSNR5S199B0578"
        },
        {
          "xsiType": "Etape_Type",
          "uid": "L14-SN2-COM-29815",
          "codeActe": "SN2-COM",
          "libelleActe": {
            "nomCanonique": "Travaux des commissions",
            "libelleCourt": "Travaux des commissions"
          },
          "organeRef": "PO78718",
          "actesLegislatifs": [
            {
              "xsiType": "Etape_Type",
              "uid": "L14-VD163608CF",
              "codeActe": "SN2-COM-FOND",
              "libelleActe": {
                "nomCanonique": "Travaux de la commission saisie au fond",
                "libelleCourt": "Travaux de la commission saisie au fond"
              },
              "organeRef": "PO211495",
              "actesLegislatifs": [
                {
                  "xsiType": "SaisieComFond_Type",
                  "uid": "L14-VD163608CFS",
                  "codeActe": "SN2-COM-FOND-SAISIE",
                  "libelleActe": {
                    "nomCanonique": "Renvoi en commission au fond",
                    "libelleCourt": "Renvoi en commission au fond"
                  },
                  "organeRef": "PO211495",
                  "dateActe": "2013-05-15T00:00:00.000+02:00"
                }
              ]
            }
          ]
        }
      ]
    },
    {
      "xsiType": "Etape_Type",
      "uid": "L14-CMP-29815",
      "codeActe": "CMP",
      "libelleActe": {
        "nomCanonique": "Commission Mixte Paritaire",
        "libelleCourt": "Commission Mixte Paritaire"
      },
      "organeRef": "PO694425",
      "actesLegislatifs": [
        {
          "xsiType": "RenvoiCMP_Type",
          "uid": "L14-VD163610CMPS",
          "codeActe": "CMP-SAISIE",
          "libelleActe": {
            "nomCanonique": "Convocation d'une CMP",
            "libelleCourt": "Convocation d'une CMP"
          },
          "organeRef": "PO694425",
          "dateActe": "2013-05-15T00:00:00.000+02:00",
          "initiateur": {
            "acteurs": [
              {
                "acteurRef": "PA328",
                "mandatRef": "PM653228"
              }
            ]
          }
        },
        {
          "xsiType": "Etape_Type",
          "uid": "L14-VD163610COM",
          "codeActe": "CMP-COM",
          "libelleActe": {
            "nomCanonique": "Commission Mixte Paritaire",
            "libelleCourt": "Commission Mixte Paritaire"
          },
          "organeRef": "PO694425",
          "actesLegislatifs": [
            {
              "xsiType": "NominRapporteurs_Type",
              "uid": "L14-VD163702",
              "codeActe": "CMP-COM-NOMIN",
              "libelleActe": {
                "nomCanonique": "Nomination de rapporteur",
                "libelleCourt": "Nomination de rapporteur"
              },
              "organeRef": "PO694425",
              "dateActe": "2013-05-22T00:00:00.000+02:00",
              "rapporteurs": [
                {
                  "acteurRef": "PA609775",
                  "typeRapporteur": "rapporteur"
                },
                {
                  "acteurRef": "PA429860",
                  "typeRapporteur": "rapporteur"
                }
              ]
            },
            {
              "xsiType": "DepotRapport_Type",
              "uid": "L14-VD163709",
              "codeActe": "CMP-COM-RAPPORT-AN",
              "libelleActe": {
                "nomCanonique": "Dépôt du rapport d'une CMP",
                "libelleCourt": "Dépôt du rapport d'une CMP"
              },
              "organeRef": "PO644420",
              "dateActe": "2013-05-22T00:00:00.000+02:00",
              "texteAssocieRef": "RAPPANR5L14B1054"
            },
            {
              "xsiType": "DepotRapport_Type",
              "uid": "L14-VD163710",
              "codeActe": "CMP-COM-RAPPORT-SN",
              "libelleActe": {
                "nomCanonique": "Dépôt du rapport d'une CMP",
                "libelleCourt": "Dépôt du rapport d'une CMP"
              },
              "organeRef": "PO78718",
              "dateActe": "2013-05-22T00:00:00.000+02:00",
              "texteAssocieRef": "RAPPSNR5S199B0605"
            }
          ]
        },
        {
          "xsiType": "Decision_Type",
          "uid": "L14-VD163610DEC",
          "codeActe": "CMP-DEC",
          "libelleActe": {
            "nomCanonique": "Décision de la CMP",
            "libelleCourt": "Décision de la CMP"
          },
          "organeRef": "PO694425",
          "dateActe": "2013-05-23T00:00:00.000+02:00",
          "statutConclusion": {
            "famCode": "TCCMP02",
            "libelle": "Désaccord"
          }
        }
      ]
    },
    {
      "xsiType": "Etape_Type",
      "uid": "L14-ANNLEC-29815",
      "codeActe": "ANNLEC",
      "libelleActe": {
        "nomCanonique": "Nouvelle Lecture",
        "libelleCourt": "Nouvelle lecture"
      },
      "organeRef": "PO644420",
      "actesLegislatifs": [
        {
          "xsiType": "DepotInitiativeNavette_Type",
          "uid": "L14-VD163734DIN",
          "codeActe": "ANNLEC-DEPOT",
          "libelleActe": {
            "nomCanonique": "Dépôt d'une initiative en navette",
            "libelleCourt": "Dépôt d'une initiative en navette"
          },
          "organeRef": "PO644420",
          "dateActe": "2013-05-23T00:00:00.000+02:00",
          "provenanceRef": "PO694425",
          "texteAssocieRef": "PRJLANR5L14B1055"
        },
        {
          "xsiType": "Etape_Type",
          "uid": "L14-ANNLEC-COM-29815",
          "codeActe": "ANNLEC-COM",
          "libelleActe": {
            "nomCanonique": "Travaux des commissions",
            "libelleCourt": "Travaux des commissions"
          },
          "organeRef": "PO644420",
          "actesLegislatifs": [
            {
              "xsiType": "Etape_Type",
              "uid": "L14-VD163735CF",
              "codeActe": "ANNLEC-COM-FOND",
              "libelleActe": {
                "nomCanonique": "Travaux de la commission saisie au fond",
                "libelleCourt": "Travaux de la commission saisie au fond"
              },
              "organeRef": "PO59051",
              "actesLegislatifs": [
                {
                  "xsiType": "SaisieComFond_Type",
                  "uid": "L14-VD163735CFS",
                  "codeActe": "ANNLEC-COM-FOND-SAISIE",
                  "libelleActe": {
                    "nomCanonique": "Renvoi en commission au fond",
                    "libelleCourt": "Renvoi en commission au fond"
                  },
                  "organeRef": "PO59051",
                  "dateActe": "2013-05-23T00:00:00.000+02:00"
                },
                {
                  "xsiType": "DiscussionCommission_Type",
                  "uid": "L14-VD163930R17659",
                  "codeActe": "ANNLEC-COM-FOND-REUNION",
                  "libelleActe": {
                    "nomCanonique": "Réunion de commission",
                    "libelleCourt": "Réunion de commission"
                  },
                  "organeRef": "PO59051",
                  "dateActe": "2013-06-12T09:30:00.000+02:00",
                  "odjRef": "RUANR5L14S2013IDC417442PT17659",
                  "reunionRef": "RUANR5L14S2013IDC417442"
                },
                {
                  "xsiType": "DiscussionCommission_Type",
                  "uid": "L14-VD163930R17730",
                  "codeActe": "ANNLEC-COM-FOND-REUNION",
                  "libelleActe": {
                    "nomCanonique": "Réunion de commission",
                    "libelleCourt": "Réunion de commission"
                  },
                  "organeRef": "PO59051",
                  "dateActe": "2013-06-21T09:15:00.000+02:00",
                  "odjRef": "RUANR5L14S2013IDC417644PT17730",
                  "reunionRef": "RUANR5L14S2013IDC417644"
                },
                {
                  "xsiType": "DepotRapport_Type",
                  "uid": "L14-VD164103",
                  "codeActe": "ANNLEC-COM-FOND-RAPPORT",
                  "libelleActe": {
                    "nomCanonique": "Dépôt de rapport",
                    "libelleCourt": "Dépôt de rapport"
                  },
                  "organeRef": "PO59051",
                  "dateActe": "2013-06-12T00:00:00.000+02:00",
                  "texteAdopteRef": "PRJLANR5L14BTC1129",
                  "texteAssocieRef": "RAPPANR5L14B1129"
                }
              ]
            }
          ]
        },
        {
          "xsiType": "Etape_Type",
          "uid": "L14-ANNLEC-DEBATS-29815",
          "codeActe": "ANNLEC-DEBATS",
          "libelleActe": {
            "nomCanonique": "Discussion en séance publique",
            "libelleCourt": "Discussion en séance publique"
          },
          "organeRef": "PO644420",
          "actesLegislatifs": [
            {
              "xsiType": "DiscussionSeancePublique_Type",
              "uid": "L14-VD164091S28335",
              "codeActe": "ANNLEC-DEBATS-SEANCE",
              "libelleActe": {
                "nomCanonique": "Discussion en séance publique",
                "libelleCourt": "Discussion en séance publique"
              },
              "organeRef": "PO644420",
              "dateActe": "2013-06-21T00:00:00.000+02:00",
              "odjRef": "RUANR5L14S2013IDS17275PT28335",
              "reunionRef": "RUANR5L14S2013IDS17275"
            },
            {
              "xsiType": "Decision_Type",
              "uid": "L14-VD164389DEC",
              "codeActe": "ANNLEC-DEBATS-DEC",
              "libelleActe": {
                "nomCanonique": "Décision",
                "libelleCourt": "Décision"
              },
              "organeRef": "PO644420",
              "dateActe": "2013-06-21T00:00:00.000+02:00",
              "reunionRef": "RUANR5L14S2013IDS17275",
              "statutConclusion": {
                "famCode": "TSORTF01",
                "libelle": "adopté"
              },
              "textesAssocies": [
                {
                  "typeTexte": "BTA",
                  "texteAssocieRef": "PRJLANR5L14BTA0159"
                }
              ]
            }
          ]
        }
      ]
    },
    {
      "xsiType": "Etape_Type",
      "uid": "L14-SNNLEC-29815",
      "codeActe": "SNNLEC",
      "libelleActe": {
        "nomCanonique": "Nouvelle Lecture",
        "libelleCourt": "Nouvelle lecture"
      },
      "organeRef": "PO78718",
      "actesLegislatifs": [
        {
          "xsiType": "DepotInitiativeNavette_Type",
          "uid": "L14-VD164417DIN",
          "codeActe": "SNNLEC-DEPOT",
          "libelleActe": {
            "nomCanonique": "Dépôt d'une initiative en navette",
            "libelleCourt": "Dépôt d'une initiative en navette"
          },
          "organeRef": "PO78718",
          "dateActe": "2013-06-21T00:00:00.000+02:00",
          "provenanceRef": "PO644420",
          "texteAssocieRef": "PRJLSNR5S199B0684"
        },
        {
          "xsiType": "Etape_Type",
          "uid": "L14-SNNLEC-COM-29815",
          "codeActe": "SNNLEC-COM",
          "libelleActe": {
            "nomCanonique": "Travaux des commissions",
            "libelleCourt": "Travaux des commissions"
          },
          "organeRef": "PO78718",
          "actesLegislatifs": [
            {
              "xsiType": "Etape_Type",
              "uid": "L14-VD164418CF",
              "codeActe": "SNNLEC-COM-FOND",
              "libelleActe": {
                "nomCanonique": "Travaux de la commission saisie au fond",
                "libelleCourt": "Travaux de la commission saisie au fond"
              },
              "organeRef": "PO211495",
              "actesLegislatifs": [
                {
                  "xsiType": "SaisieComFond_Type",
                  "uid": "L14-VD164418CFS",
                  "codeActe": "SNNLEC-COM-FOND-SAISIE",
                  "libelleActe": {
                    "nomCanonique": "Renvoi en commission au fond",
                    "libelleCourt": "Renvoi en commission au fond"
                  },
                  "organeRef": "PO211495",
                  "dateActe": "2013-06-21T00:00:00.000+02:00"
                },
                {
                  "xsiType": "DepotRapport_Type",
                  "uid": "L14-VD164449",
                  "codeActe": "SNNLEC-COM-FOND-RAPPORT",
                  "libelleActe": {
                    "nomCanonique": "Dépôt de rapport",
                    "libelleCourt": "Dépôt de rapport"
                  },
                  "organeRef": "PO211495",
                  "dateActe": "2013-06-25T00:00:00.000+02:00",
                  "texteAssocieRef": "RAPPSNR5S199B0686"
                }
              ]
            }
          ]
        },
        {
          "xsiType": "Etape_Type",
          "uid": "L14-SNNLEC-DEBATS-29815",
          "codeActe": "SNNLEC-DEBATS",
          "libelleActe": {
            "nomCanonique": "Discussion en séance publique",
            "libelleCourt": "Discussion en séance publique"
          },
          "organeRef": "PO78718",
          "actesLegislatifs": [
            {
              "xsiType": "DiscussionSeancePublique_Type",
              "uid": "L14-VD164425S28536",
              "codeActe": "SNNLEC-DEBATS-SEANCE",
              "libelleActe": {
                "nomCanonique": "Discussion en séance publique",
                "libelleCourt": "Discussion en séance publique"
              },
              "organeRef": "PO78718",
              "dateActe": "2013-06-27T00:00:00.000+02:00",
              "odjRef": "RUSNR5L14S2013IDS17256PT28536",
              "reunionRef": "RUSNR5L14S2013IDS17256"
            },
            {
              "xsiType": "Decision_Type",
              "uid": "L14-VD164649DEC",
              "codeActe": "SNNLEC-DEBATS-DEC",
              "libelleActe": {
                "nomCanonique": "Décision",
                "libelleCourt": "Décision"
              },
              "organeRef": "PO78718",
              "dateActe": "2013-06-27T00:00:00.000+02:00",
              "reunionRef": "RUSNR5L14S2013IDS17256",
              "statutConclusion": {
                "famCode": "TSORTF03",
                "libelle": "adopté sans modification"
              },
              "textesAssocies": [
                {
                  "typeTexte": "BTA",
                  "texteAssocieRef": "PRJLSNR5S199BTA0181"
                }
              ]
            }
          ]
        }
      ]
    },
    {
      "xsiType": "Etape_Type",
      "uid": "L14-CC-29815",
      "codeActe": "CC",
      "libelleActe": {
        "nomCanonique": "Conseil constitutionnel",
        "libelleCourt": "Conseil constitutionnel"
      },
      "organeRef": "PO76034",
      "actesLegislatifs": [
        {
          "xsiType": "SaisineConseilConstit_Type",
          "uid": "L14-VD164665CCS1282",
          "codeActe": "CC-SAISIE-SN",
          "libelleActe": {
            "nomCanonique": "Saisine du conseil constitutionnel",
            "libelleCourt": "Saisine du conseil constitutionnel"
          },
          "organeRef": "PO78718",
          "dateActe": "2013-06-28T00:00:00.000+02:00",
          "casSaisine": {
            "famCode": "TSCCONT06",
            "libelle": "Soixante sénateurs au moins"
          },
          "motif": "En application de l'article 61§2 de la Constitution"
        },
        {
          "xsiType": "ConclusionEtapeCC_Type",
          "uid": "L14-VD164665CCC",
          "codeActe": "CC-CONCLUSION",
          "libelleActe": {
            "nomCanonique": "Conclusion du conseil constitutionnel",
            "libelleCourt": "Conclusion du conseil constitutionnel"
          },
          "organeRef": "PO76034",
          "dateActe": "2013-07-18T00:00:00.000+02:00",
          "anneeDecision": "2013",
          "numDecision": "673",
          "statutConclusion": {
            "famCode": "TCD01",
            "libelle": "Conforme"
          },
          "urlConclusion": "http://www.conseil-constitutionnel.fr/decision/2013/2013673dc.htm"
        }
      ]
    },
    {
      "xsiType": "Etape_Type",
      "uid": "L14-PROM-29815",
      "codeActe": "PROM",
      "libelleActe": {
        "nomCanonique": "Promulgation de la loi",
        "libelleCourt": "Promulgation de la loi"
      },
      "organeRef": "PO696251",
      "actesLegislatifs": [
        {
          "xsiType": "Promulgation_Type",
          "uid": "L14-VD165249PL",
          "codeActe": "PROM-PUB",
          "libelleActe": {
            "nomCanonique": "Promulgation d'une loi",
            "libelleCourt": "Promulgation d'une loi"
          },
          "organeRef": "PO696251",
          "dateActe": "2013-07-22T00:00:00.000+02:00",
          "codeLoi": "2013-659",
          "infoJo": {
            "typeJo": "JO_LOI_DECRET",
            "dateJo": "2013-07-23+02:00",
            "numJo": "169"
          },
          "infoJoRect": [
            {
              "typeJo": "JO_LOI_DECRET",
              "dateJo": "2013-10-12+02:00",
              "numJo": "238"
            }
          ],
          "referenceNor": "MAEX1301702L",
          "texteLoiRef": "PRJLSNR5S199BTA0181",
          "titreLoi": "relative à la représentation des Français établis hors de France",
          "urlLegifrance": "http://www.legifrance.gouv.fr/WAspad/UnTexteDeJorf?numjo=MAEX1301702L"
        }
      ]
    }
  ],
  "indexation": {
    "themes": {
      "@niveau": "1",
      "theme": {
        "libelleTheme": "PRIX ET CONCURRENCE"
      }
    }
  }
}