{
  "xsiType": "DossierLegislatif_Type",
  "uid": "DLR5L14N34516",
  "legislature": "14",
  "titreDossier": {
    "titre": "Economie : pour une République numérique",
    "titreChemin": "republique_numerique",
    "senatChemin": "http://www.senat.fr/dossier-legislatif/pjl15-325.html"
  },
  "procedureParlementaire": {
    "code": "1",
    "libelle": "Projet de loi ordinaire"
  },
  "initiateur": {
    "acteurs": [
      {
        "acteurRef": "PA267622",
        "mandatRef": "PM702957"
      },
      {
        "acteurRef": "PA702992",
        "mandatRef": "PM702994"
      },
      {
        "acteurRef": "PA610873",
        "mandatRef": "PM702982"
      }
    ]
  },
  "actesLegislatifs": [
    {
      "xsiType": "Etape_Type",
      "uid": "L14-AN1-34516",
      "codeActe": "AN1",
      "libelleActe": {
        "nomCanonique": "1ère lecture (1ère assemblée saisie)",
        "libelleCourt": "1ère lecture"
      },
      "organeRef": "PO644420",
      "actesLegislatifs": [
        {
          "xsiType": "DepotInitiative_Type",
          "uid": "L14-VD176159DI",
          "codeActe": "AN1-DEPOT",
          "libelleActe": {
            "nomCanonique": "1er dépôt d'une initiative.",
            "libelleCourt": "1er dépôt d'une initiative."
          },
          "organeRef": "PO644420",
          "dateActe": "2015-12-09T00:00:00.000+01:00",
          "texteAssocieRef": "PRJLANR5L14B3318"
        },
        {
          "xsiType": "EtudeImpact_Type",
          "uid": "L14-VD176159ETI",
          "codeActe": "AN1-ETI",
          "libelleActe": {
            "nomCanonique": "Etude d'impact",
            "libelleCourt": "Etude d'impact"
          },
          "organeRef": "PO644420",
          "dateActe": "2015-12-09T00:00:00.000+01:00",
          "contributionInternaute": {
            "dateOuverture": "2015-12-10+01:00",
            "dateFermeture": "2016-01-19+01:00"
          },
          "texteAssocieRef": "ETDIANR5L14B3318"
        },
        {
          "xsiType": "DepotAvisConseilEtat_Type",
          "uid": "L14-VD176159AVCE",
          "codeActe": "AN1-AVCE",
          "libelleActe": {
            "nomCanonique": "Avis du Conseil d'Etat",
            "libelleCourt": "Avis du Conseil d'Etat"
          },
          "organeRef": "PO644420",
          "dateActe": "2015-12-09T00:00:00.000+01:00",
          "texteAssocieRef": "AVCEANR5L14B3318"
        },
        {
          "xsiType": "ProcedureAccelere_Type",
          "uid": "L14-VD176161",
          "codeActe": "AN1-PROCACC",
          "libelleActe": {
            "nomCanonique": "Le gouvernement déclare l'urgence / engage la procédure accélérée",
            "libelleCourt": "Le gouvernement déclare l'urgence / engage la procédure accélérée"
          },
          "organeRef": "PO702883",
          "dateActe": "2015-12-09T00:00:00.000+01:00"
        },
        {
          "xsiType": "Etape_Type",
          "uid": "L14-AN1-COM-34516",
          "codeActe": "AN1-COM",
          "libelleActe": {
            "nomCanonique": "Travaux des commissions",
            "libelleCourt": "Travaux des commissions"
          },
          "organeRef": "PO644420",
          "actesLegislatifs": [
            {
              "xsiType": "Etape_Type",
              "uid": "L14-VD176160CF",
              "codeActe": "AN1-COM-FOND",
              "libelleActe": {
                "nomCanonique": "Travaux de la commission saisie au fond",
                "libelleCourt": "Travaux de la commission saisie au fond"
              },
              "organeRef": "PO59051",
              "actesLegislatifs": [
                {
                  "xsiType": "SaisieComFond_Type",
                  "uid": "L14-VD176160CFS",
                  "codeActe": "AN1-COM-FOND-SAISIE",
                  "libelleActe": {
                    "nomCanonique": "Renvoi en commission au fond",
                    "libelleCourt": "Renvoi en commission au fond"
                  },
                  "organeRef": "PO59051",
                  "dateActe": "2015-12-09T00:00:00.000+01:00"
                },
                {
                  "xsiType": "NominRapporteurs_Type",
                  "uid": "L14-VD176194",
                  "codeActe": "AN1-COM-FOND-NOMIN",
                  "libelleActe": {
                    "nomCanonique": "Nomination de rapporteur",
                    "libelleCourt": "Nomination de rapporteur"
                  },
                  "organeRef": "PO59051",
                  "dateActe": "2015-10-29T00:00:00.000+01:00",
                  "rapporteurs": [
                    {
                      "acteurRef": "PA607310",
                      "typeRapporteur": "rapporteur"
                    }
                  ]
                },
                {
                  "xsiType": "DiscussionCommission_Type",
                  "uid": "L14-VD176207R23127",
                  "codeActe": "AN1-COM-FOND-REUNION",
                  "libelleActe": {
                    "nomCanonique": "Réunion de commission",
                    "libelleCourt": "Réunion de commission"
                  },
                  "organeRef": "PO59051",
                  "dateActe": "2015-12-16T10:00:00.000+01:00",
                  "odjRef": "RUANR5L14S2016IDC424636PT23127",
                  "reunionRef": "RUANR5L14S2016IDC424636"
                },
                {
                  "xsiType": "DiscussionCommission_Type",
                  "uid": "L14-VD176207R23204",
                  "codeActe": "AN1-COM-FOND-REUNION",
                  "libelleActe": {
                    "nomCanonique": "Réunion de commission",
                    "libelleCourt": "Réunion de commission"
                  },
                  "organeRef": "PO59051",
                  "dateActe": "2016-01-13T09:30:00.000+01:00",
                  "odjRef": "RUANR5L14S2016IDC424747PT23204",
                  "reunionRef": "RUANR5L14S2016IDC424747"
                },
                {
                  "xsiType": "DiscussionCommission_Type",
                  "uid": "L14-VD176207R23205",
                  "codeActe": "AN1-COM-FOND-REUNION",
                  "libelleActe": {
                    "nomCanonique": "Réunion de commission",
                    "libelleCourt": "Réunion de commission"
                  },
                  "organeRef": "PO59051",
                  "dateActe": "2016-01-13T14:00:00.000+01:00",
                  "odjRef": "RUANR5L14S2016IDC424748PT23205",
                  "reunionRef": "RUANR5L14S2016IDC424748"
                },
                {
                  "xsiType": "DiscussionCommission_Type",
                  "uid": "L14-VD176207R23234",
                  "codeActe": "AN1-COM-FOND-REUNION",
                  "libelleActe": {
                    "nomCanonique": "Réunion de commission",
                    "libelleCourt": "Réunion de commission"
                  },
                  "organeRef": "PO59051",
                  "dateActe": "2016-01-13T18:00:00.000+01:00",
                  "odjRef": "RUANR5L14S2016IDC424749PT23234",
                  "reunionRef": "RUANR5L14S2016IDC424749"
                },
                {
                  "xsiType": "DiscussionCommission_Type",
                  "uid": "L14-VD176207R23235",
                  "codeActe": "AN1-COM-FOND-REUNION",
                  "libelleActe": {
                    "nomCanonique": "Réunion de commission",
                    "libelleCourt": "Réunion de commission"
                  },
                  "organeRef": "PO59051",
                  "dateActe": "2016-01-13T21:30:00.000+01:00",
                  "odjRef": "RUANR5L14S2016IDC424750PT23235",
                  "reunionRef": "RUANR5L14S2016IDC424750"
                },
                {
                  "xsiType": "DiscussionCommission_Type",
                  "uid": "L14-VD176207R23236",
                  "codeActe": "AN1-COM-FOND-REUNION",
                  "libelleActe": {
                    "nomCanonique": "Réunion de commission",
                    "libelleCourt": "Réunion de commission"
                  },
                  "organeRef": "PO59051",
                  "dateActe": "2016-01-14T10:00:00.000+01:00"
                },
                {
                  "xsiType": "DiscussionCommission_Type",
                  "uid": "L14-VD176207R23237",
                  "codeActe": "AN1-COM-FOND-REUNION",
                  "libelleActe": {
                    "nomCanonique": "Réunion de commission",
                    "libelleCourt": "Réunion de commission"
                  },
                  "organeRef": "PO59051",
                  "dateActe": "2016-01-14T15:00:00.000+01:00",
                  "odjRef": "RUANR5L14S2016IDC424760PT23237",
                  "reunionRef": "RUANR5L14S2016IDC424760"
                },
                {
                  "xsiType": "DiscussionCommission_Type",
                  "uid": "L14-VD176207R23226",
                  "codeActe": "AN1-COM-FOND-REUNION",
                  "libelleActe": {
                    "nomCanonique": "Réunion de commission",
                    "libelleCourt": "Réunion de commission"
                  },
                  "organeRef": "PO59051",
                  "dateActe": "2016-01-19T14:45:00.000+01:00",
                  "odjRef": "RUANR5L14S2016IDC424751PT23226",
                  "reunionRef": "RUANR5L14S2016IDC424751"
                },
                {
                  "xsiType": "DepotRapport_Type",
                  "uid": "L14-VD176557",
                  "codeActe": "AN1-COM-FOND-RAPPORT",
                  "libelleActe": {
                    "nomCanonique": "Dépôt de rapport",
                    "libelleCourt": "Dépôt de rapport"
                  },
                  "organeRef": "PO59051",
                  "dateActe": "2016-01-15T00:00:00.000+01:00",
                  "texteAdopteRef": "PRJLANR5L14BTC3399",
                  "texteAssocieRef": "RAPPANR5L14B3399"
                }
              ]
            },
            {
              "xsiType": "Etape_Type",
              "uid": "L14-VD176192CA",
              "codeActe": "AN1-COM-AVIS",
              "libelleActe": {
                "nomCanonique": "Travaux d'une commission saisie pour avis",
                "libelleCourt": "Travaux d'une commission saisie pour avis"
              },
              "organeRef": "PO419604",
              "actesLegislatifs": [
                {
                  "xsiType": "SaisieComAvis_Type",
                  "uid": "L14-VD176192CAS",
                  "codeActe": "AN1-COM-AVIS-SAISIE",
                  "libelleActe": {
                    "nomCanonique": "Saisine pour avis d'une commission",
                    "libelleCourt": "Saisine pour avis d'une commission"
                  },
                  "organeRef": "PO419604",
                  "dateActe": "2015-12-09T00:00:00.000+01:00"
                },
                {
                  "xsiType": "NominRapporteurs_Type",
                  "uid": "L14-VD176208",
                  "codeActe": "AN1-COM-AVIS-NOMIN",
                  "libelleActe": {
                    "nomCanonique": "Nomination de rapporteur",
                    "libelleCourt": "Nomination de rapporteur"
                  },
                  "organeRef": "PO419604",
                  "dateActe": "2015-11-10T00:00:00.000+01:00",
                  "rapporteurs": [
                    {
                      "acteurRef": "PA609314",
                      "typeRapporteur": "rapporteur pour avis"
                    }
                  ]
                },
                {
                  "xsiType": "DiscussionCommission_Type",
                  "uid": "L14-VD176207R23115",
                  "codeActe": "AN1-COM-AVIS-REUNION",
                  "libelleActe": {
                    "nomCanonique": "Réunion de commission",
                    "libelleCourt": "Réunion de commission"
                  },
                  "organeRef": "PO419604",
                  "dateActe": "2015-11-10T16:30:00.000+01:00",
                  "odjRef": "RUANR5L14S2016IDC424427PT23115",
                  "reunionRef": "RUANR5L14S2016IDC424427"
                },
                {
                  "xsiType": "DiscussionCommission_Type",
                  "uid": "L14-VD176207R23149",
                  "codeActe": "AN1-COM-AVIS-REUNION",
                  "libelleActe": {
                    "nomCanonique": "Réunion de commission",
                    "libelleCourt": "Réunion de commission"
                  },
                  "organeRef": "PO419604",
                  "dateActe": "2016-01-12T18:00:00.000+01:00",
                  "odjRef": "RUANR5L14S2016IDC424680PT23149",
                  "reunionRef": "RUANR5L14S2016IDC424680"
                },
                {
                  "xsiType": "DepotRapport_Type",
                  "uid": "L14-VD176502",
                  "codeActe": "AN1-COM-AVIS-RAPPORT",
                  "libelleActe": {
                    "nomCanonique": "Dépôt de rapport",
                    "libelleCourt": "Dépôt de rapport"
                  },
                  "organeRef": "PO419604",
                  "dateActe": "2016-01-13T00:00:00.000+01:00",
                  "texteAssocieRef": "AVISANR5L14B3389"
                }
              ]
            },
            {
              "xsiType": "Etape_Type",
              "uid": "L14-VD176228CA",
              "codeActe": "AN1-COM-AVIS",
              "libelleActe": {
                "nomCanonique": "Travaux d'une commission saisie pour avis",
                "libelleCourt": "Travaux d'une commission saisie pour avis"
              },
              "organeRef": "PO420120",
              "actesLegislatifs": [
                {
                  "xsiType": "SaisieComAvis_Type",
                  "uid": "L14-VD176228CAS",
                  "codeActe": "AN1-COM-AVIS-SAISIE",
                  "libelleActe": {
                    "nomCanonique": "Saisine pour avis d'une commission",
                    "libelleCourt": "Saisine pour avis d'une commission"
                  },
                  "organeRef": "PO420120",
                  "dateActe": "2015-12-10T00:00:00.000+01:00"
                },
                {
                  "xsiType": "NominRapporteurs_Type",
                  "uid": "L14-VD176236",
                  "codeActe": "AN1-COM-AVIS-NOMIN",
                  "libelleActe": {
                    "nomCanonique": "Nomination de rapporteur",
                    "libelleCourt": "Nomination de rapporteur"
                  },
                  "organeRef": "PO420120",
                  "dateActe": "2015-12-03T00:00:00.000+01:00",
                  "rapporteurs": [
                    {
                      "acteurRef": "PA608574",
                      "typeRapporteur": "rapporteur pour avis"
                    }
                  ]
                },
                {
                  "xsiType": "DiscussionCommission_Type",
                  "uid": "L14-VD176207R23133",
                  "codeActe": "AN1-COM-AVIS-REUNION",
                  "libelleActe": {
                    "nomCanonique": "Réunion de commission",
                    "libelleCourt": "Réunion de commission"
                  },
                  "organeRef": "PO420120",
                  "dateActe": "2015-12-03T09:15:00.000+01:00",
                  "odjRef": "RUANR5L14S2016IDC424553PT23133",
                  "reunionRef": "RUANR5L14S2016IDC424553"
                },
                {
                  "xsiType": "DiscussionCommission_Type",
                  "uid": "L14-VD176207R23134",
                  "codeActe": "AN1-COM-AVIS-REUNION",
                  "libelleActe": {
                    "nomCanonique": "Réunion de commission",
                    "libelleCourt": "Réunion de commission"
                  },
                  "organeRef": "PO420120",
                  "dateActe": "2016-01-12T16:15:00.000+01:00",
                  "odjRef": "RUANR5L14S2016IDC424670PT23134",
                  "reunionRef": "RUANR5L14S2016IDC424670"
                },
                {
                  "xsiType": "DepotRapport_Type",
                  "uid": "L14-VD176496",
                  "codeActe": "AN1-COM-AVIS-RAPPORT",
                  "libelleActe": {
                    "nomCanonique": "Dépôt de rapport",
                    "libelleCourt": "Dépôt de rapport"
                  },
                  "organeRef": "PO420120",
                  "dateActe": "2016-01-12T00:00:00.000+01:00",
                  "texteAssocieRef": "AVISANR5L14B3387"
                }
              ]
            },
            {
              "xsiType": "Etape_Type",
              "uid": "L14-VD176334CA",
              "codeActe": "AN1-COM-AVIS",
              "libelleActe": {
                "nomCanonique": "Travaux d'une commission saisie pour avis",
                "libelleCourt": "Travaux d'une commission saisie pour avis"
              },
              "organeRef": "PO419610",
              "actesLegislatifs": [
                {
                  "xsiType": "SaisieComAvis_Type",
                  "uid": "L14-VD176334CAS",
                  "codeActe": "AN1-COM-AVIS-SAISIE",
                  "libelleActe": {
                    "nomCanonique": "Saisine pour avis d'une commission",
                    "libelleCourt": "Saisine pour avis d'une commission"
                  },
                  "organeRef": "PO419610",
                  "dateActe": "2015-12-10T00:00:00.000+01:00"
                },
                {
                  "xsiType": "NominRapporteurs_Type",
                  "uid": "L14-VD176335",
                  "codeActe": "AN1-COM-AVIS-NOMIN",
                  "libelleActe": {
                    "nomCanonique": "Nomination de rapporteur",
                    "libelleCourt": "Nomination de rapporteur"
                  },
                  "organeRef": "PO419610",
                  "dateActe": "2015-11-18T00:00:00.000+01:00",
                  "rapporteurs": [
                    {
                      "acteurRef": "PA331282",
                      "typeRapporteur": "rapporteur pour avis"
                    }
                  ]
                },
                {
                  "xsiType": "DiscussionCommission_Type",
                  "uid": "L14-VD176207R23143",
                  "codeActe": "AN1-COM-AVIS-REUNION",
                  "libelleActe": {
                    "nomCanonique": "Réunion de commission",
                    "libelleCourt": "Réunion de commission"
                  },
                  "organeRef": "PO419610",
                  "dateActe": "2016-01-12T16:15:00.000+01:00"
                },
                {
                  "xsiType": "DiscussionCommission_Type",
                  "uid": "L14-VD176207R23142",
                  "codeActe": "AN1-COM-AVIS-REUNION",
                  "libelleActe": {
                    "nomCanonique": "Réunion de commission",
                    "libelleCourt": "Réunion de commission"
                  },
                  "organeRef": "PO419610",
                  "dateActe": "2016-01-12T21:45:00.000+01:00"
                },
                {
                  "xsiType": "DepotRapport_Type",
                  "uid": "L14-VD176505",
                  "codeActe": "AN1-COM-AVIS-RAPPORT",
                  "libelleActe": {
                    "nomCanonique": "Dépôt de rapport",
                    "libelleCourt": "Dépôt de rapport"
                  },
                  "organeRef": "PO419610",
                  "dateActe": "2016-01-13T00:00:00.000+01:00",
                  "texteAssocieRef": "AVISANR5L14B3391"
                }
              ]
            }
          ]
        },
        {
          "xsiType": "Etape_Type",
          "uid": "L14-AN1-DEBATS-34516",
          "codeActe": "AN1-DEBATS",
          "libelleActe": {
            "nomCanonique": "Discussion en séance publique",
            "libelleCourt": "Discussion en séance publique"
          },
          "organeRef": "PO644420",
          "actesLegislatifs": [
            {
              "xsiType": "DiscussionSeancePublique_Type",
              "uid": "L14-VD176235S33099",
              "codeActe": "AN1-DEBATS-SEANCE",
              "libelleActe": {
                "nomCanonique": "Discussion en séance publique",
                "libelleCourt": "Discussion en séance publique"
              },
              "organeRef": "PO644420",
              "dateActe": "2016-01-19T00:00:00.000+01:00",
              "odjRef": "RUANR5L14S2016IDS19746PT33099",
              "reunionRef": "RUANR5L14S2016IDS19746"
            },
            {
              "xsiType": "DiscussionSeancePublique_Type",
              "uid": "L14-VD176235S33100",
              "codeActe": "AN1-DEBATS-SEANCE",
              "libelleActe": {
                "nomCanonique": "Discussion en séance publique",
                "libelleCourt": "Discussion en séance publique"
              },
              "organeRef": "PO644420",
              "dateActe": "2016-01-19T00:00:00.000+01:00",
              "odjRef": "RUANR5L14S2016IDS19747PT33100",
              "reunionRef": "RUANR5L14S2016IDS19747"
            },
            {
              "xsiType": "DiscussionSeancePublique_Type",
              "uid": "L14-VD176235S33102",
              "codeActe": "AN1-DEBATS-SEANCE",
              "libelleActe": {
                "nomCanonique": "Discussion en séance publique",
                "libelleCourt": "Discussion en séance publique"
              },
              "organeRef": "PO644420",
              "dateActe": "2016-01-20T00:00:00.000+01:00",
              "odjRef": "RUANR5L14S2016IDS19748PT33102",
              "reunionRef": "RUANR5L14S2016IDS19748"
            },
            {
              "xsiType": "DiscussionSeancePublique_Type",
              "uid": "L14-VD176235S33103",
              "codeActe": "AN1-DEBATS-SEANCE",
              "libelleActe": {
                "nomCanonique": "Discussion en séance publique",
                "libelleCourt": "Discussion en séance publique"
              },
              "organeRef": "PO644420",
              "dateActe": "2016-01-20T00:00:00.000+01:00",
              "odjRef": "RUANR5L14S2016IDS19749PT33103",
              "reunionRef": "RUANR5L14S2016IDS19749"
            },
            {
              "xsiType": "DiscussionSeancePublique_Type",
              "uid": "L14-VD176235S33104",
              "codeActe": "AN1-DEBATS-SEANCE",
              "libelleActe": {
                "nomCanonique": "Discussion en séance publique",
                "libelleCourt": "Discussion en séance publique"
              },
              "organeRef": "PO644420",
              "dateActe": "2016-01-21T00:00:00.000+01:00",
              "odjRef": "RUANR5L14S2016IDS19750PT33104",
              "reunionRef": "RUANR5L14S2016IDS19750"
            },
            {
              "xsiType": "DiscussionSeancePublique_Type",
              "uid": "L14-VD176235S33105",
              "codeActe": "AN1-DEBATS-SEANCE",
              "libelleActe": {
                "nomCanonique": "Discussion en séance publique",
                "libelleCourt": "Discussion en séance publique"
              },
              "organeRef": "PO644420",
              "dateActe": "2016-01-21T00:00:00.000+01:00",
              "odjRef": "RUANR5L14S2016IDS19751PT33105",
              "reunionRef": "RUANR5L14S2016IDS19751"
            },
            {
              "xsiType": "DiscussionSeancePublique_Type",
              "uid": "L14-VD176235S33106",
              "codeActe": "AN1-DEBATS-SEANCE",
              "libelleActe": {
                "nomCanonique": "Discussion en séance publique",
                "libelleCourt": "Discussion en séance publique"
              },
              "organeRef": "PO644420",
              "dateActe": "2016-01-21T00:00:00.000+01:00",
              "odjRef": "RUANR5L14S2016IDS19752PT33106",
              "reunionRef": "RUANR5L14S2016IDS19752"
            },
            {
              "xsiType": "DiscussionSeancePublique_Type",
              "uid": "L14-VD176235S33143",
              "codeActe": "AN1-DEBATS-SEANCE",
              "libelleActe": {
                "nomCanonique": "Discussion en séance publique",
                "libelleCourt": "Discussion en séance publique"
              },
              "organeRef": "PO644420",
              "dateActe": "2016-01-26T00:00:00.000+01:00",
              "odjRef": "RUANR5L14S2016IDS19754PT33143",
              "reunionRef": "RUANR5L14S2016IDS19754"
            },
            {
              "xsiType": "Decision_Type",
              "uid": "L14-VD176678DEC",
              "codeActe": "AN1-DEBATS-DEC",
              "libelleActe": {
                "nomCanonique": "Décision",
                "libelleCourt": "Décision"
              },
              "organeRef": "PO644420",
              "dateActe": "2016-01-26T00:00:00.000+01:00",
              "reunionRef": "RUANR5L14S2016IDS19754",
              "statutConclusion": {
                "famCode": "TSORTF01",
                "libelle": "adopté"
              },
              "textesAssocies": [
                {
                  "typeTexte": "BTA",
                  "texteAssocieRef": "PRJLANR5L14BTA0663"
                }
              ],
              "voteRefs": [
                "VTANR5L14V1212"
              ]
            }
          ]
        }
      ]
    },
    {
      "xsiType": "Etape_Type",
      "uid": "L14-SN1-34516",
      "codeActe": "SN1",
      "libelleActe": {
        "nomCanonique": "1ère lecture (2ème assemblée saisie)",
        "libelleCourt": "1ère lecture"
      },
      "organeRef": "PO78718",
      "actesLegislatifs": [
        {
          "xsiType": "DepotInitiativeNavette_Type",
          "uid": "L14-VD176790DIN",
          "codeActe": "SN1-DEPOT",
          "libelleActe": {
            "nomCanonique": "Dépôt d'une initiative en navette",
            "libelleCourt": "Dépôt d'une initiative en navette"
          },
          "organeRef": "PO78718",
          "dateActe": "2016-01-26T00:00:00.000+01:00",
          "provenanceRef": "PO644420",
          "texteAssocieRef": "PRJLSNR5S259B0325"
        },
        {
          "xsiType": "Etape_Type",
          "uid": "L14-SN1-COM-34516",
          "codeActe": "SN1-COM",
          "libelleActe": {
            "nomCanonique": "Travaux des commissions",
            "libelleCourt": "Travaux des commissions"
          },
          "organeRef": "PO78718",
          "actesLegislatifs": [
            {
              "xsiType": "Etape_Type",
              "uid": "L14-VD176791CF",
              "codeActe": "SN1-COM-FOND",
              "libelleActe": {
                "nomCanonique": "Travaux de la commission saisie au fond",
                "libelleCourt": "Travaux de la commission saisie au fond"
              },
              "organeRef": "PO211495",
              "actesLegislatifs": [
                {
                  "xsiType": "SaisieComFond_Type",
                  "uid": "L14-VD176791CFS",
                  "codeActe": "SN1-COM-FOND-SAISIE",
                  "libelleActe": {
                    "nomCanonique": "Renvoi en commission au fond",
                    "libelleCourt": "Renvoi en commission au fond"
                  },
                  "organeRef": "PO211495",
                  "dateActe": "2016-01-26T00:00:00.000+01:00"
                },
                {
                  "xsiType": "NominRapporteurs_Type",
                  "uid": "L14-VD177772",
                  "codeActe": "SN1-COM-FOND-NOMIN",
                  "libelleActe": {
                    "nomCanonique": "Nomination de rapporteur",
                    "libelleCourt": "Nomination de rapporteur"
                  },
                  "organeRef": "PO211495",
                  "dateActe": "2016-02-17T00:00:00.000+01:00",
                  "rapporteurs": [
                    {
                      "acteurRef": "PA415454",
                      "typeRapporteur": "rapporteur"
                    }
                  ]
                },
                {
                  "xsiType": "DepotRapport_Type",
                  "uid": "L14-VD177773",
                  "codeActe": "SN1-COM-FOND-RAPPORT",
                  "libelleActe": {
                    "nomCanonique": "Dépôt de rapport",
                    "libelleCourt": "Dépôt de rapport"
                  },
                  "organeRef": "PO211495",
                  "dateActe": "2016-04-06T00:00:00.000+02:00",
                  "texteAssocieRef": "RAPPSNR5S259B0534"
                }
              ]
            },
            {
              "xsiType": "Etape_Type",
              "uid": "L14-VD177764CA",
              "codeActe": "SN1-COM-AVIS",
              "libelleActe": {
                "nomCanonique": "Travaux d'une commission saisie pour avis",
                "libelleCourt": "Travaux d'une commission saisie pour avis"
              },
              "organeRef": "PO516753",
              "actesLegislatifs": [
                {
                  "xsiType": "SaisieComAvis_Type",
                  "uid": "L14-VD177764CAS",
                  "codeActe": "SN1-COM-AVIS-SAISIE",
                  "libelleActe": {
                    "nomCanonique": "Saisine pour avis d'une commission",
                    "libelleCourt": "Saisine pour avis d'une commission"
                  },
                  "organeRef": "PO516753",
                  "dateActe": "2016-02-03T00:00:00.000+01:00"
                },
                {
                  "xsiType": "NominRapporteurs_Type",
                  "uid": "L14-VD177768",
                  "codeActe": "SN1-COM-AVIS-NOMIN",
                  "libelleActe": {
                    "nomCanonique": "Nomination de rapporteur",
                    "libelleCourt": "Nomination de rapporteur"
                  },
                  "organeRef": "PO516753",
                  "dateActe": "2016-02-03T00:00:00.000+01:00",
                  "rapporteurs": [
                    {
                      "acteurRef": "PA227094",
                      "typeRapporteur": "rapporteur pour avis"
                    }
                  ]
                },
                {
                  "xsiType": "DepotRapport_Type",
                  "uid": "L14-VD177777",
                  "codeActe": "SN1-COM-AVIS-RAPPORT",
                  "libelleActe": {
                    "nomCanonique": "Dépôt de rapport",
                    "libelleCourt": "Dépôt de rapport"
                  },
                  "organeRef": "PO516753",
                  "dateActe": "2016-04-05T00:00:00.000+02:00",
                  "texteAssocieRef": "AVISSNR5S259B0528"
                }
              ]
            },
            {
              "xsiType": "Etape_Type",
              "uid": "L14-VD177765CA",
              "codeActe": "SN1-COM-AVIS",
              "libelleActe": {
                "nomCanonique": "Travaux d'une commission saisie pour avis",
                "libelleCourt": "Travaux d'une commission saisie pour avis"
              },
              "organeRef": "PO211490",
              "actesLegislatifs": [
                {
                  "xsiType": "SaisieComAvis_Type",
                  "uid": "L14-VD177765CAS",
                  "codeActe": "SN1-COM-AVIS-SAISIE",
                  "libelleActe": {
                    "nomCanonique": "Saisine pour avis d'une commission",
                    "libelleCourt": "Saisine pour avis d'une commission"
                  },
                  "organeRef": "PO211490",
                  "dateActe": "2016-02-10T00:00:00.000+01:00"
                },
                {
                  "xsiType": "NominRapporteurs_Type",
                  "uid": "L14-VD177769",
                  "codeActe": "SN1-COM-AVIS-NOMIN",
                  "libelleActe": {
                    "nomCanonique": "Nomination de rapporteur",
                    "libelleCourt": "Nomination de rapporteur"
                  },
                  "organeRef": "PO211490",
                  "dateActe": "2016-02-10T00:00:00.000+01:00",
                  "rapporteurs": [
                    {
                      "acteurRef": "PA304021",
                      "typeRapporteur": "rapporteur pour avis"
                    }
                  ]
                },
                {
                  "xsiType": "DepotRapport_Type",
                  "uid": "L14-VD177775",
                  "codeActe": "SN1-COM-AVIS-RAPPORT",
                  "libelleActe": {
                    "nomCanonique": "Dépôt de rapport",
                    "libelleCourt": "Dépôt de rapport"
                  },
                  "organeRef": "PO211490",
                  "dateActe": "2016-04-05T00:00:00.000+02:00",
                  "texteAssocieRef": "AVISSNR5S259B0525"
                }
              ]
            },
            {
              "xsiType": "Etape_Type",
              "uid": "L14-VD177766CA",
              "codeActe": "SN1-COM-AVIS",
              "libelleActe": {
                "nomCanonique": "Travaux d'une commission saisie pour avis",
                "libelleCourt": "Travaux d'une commission saisie pour avis"
              },
              "organeRef": "PO516754",
              "actesLegislatifs": [
                {
                  "xsiType": "SaisieComAvis_Type",
                  "uid": "L14-VD177766CAS",
                  "codeActe": "SN1-COM-AVIS-SAISIE",
                  "libelleActe": {
                    "nomCanonique": "Saisine pour avis d'une commission",
                    "libelleCourt": "Saisine pour avis d'une commission"
                  },
                  "organeRef": "PO516754",
                  "dateActe": "2016-02-17T00:00:00.000+01:00"
                },
                {
                  "xsiType": "NominRapporteurs_Type",
                  "uid": "L14-VD177770",
                  "codeActe": "SN1-COM-AVIS-NOMIN",
                  "libelleActe": {
                    "nomCanonique": "Nomination de rapporteur",
                    "libelleCourt": "Nomination de rapporteur"
                  },
                  "organeRef": "PO516754",
                  "dateActe": "2016-02-17T00:00:00.000+01:00",
                  "rapporteurs": [
                    {
                      "acteurRef": "PA703513",
                      "typeRapporteur": "rapporteur pour avis"
                    }
                  ]
                },
                {
                  "xsiType": "DepotRapport_Type",
                  "uid": "L14-VD177776",
                  "codeActe": "SN1-COM-AVIS-RAPPORT",
                  "libelleActe": {
                    "nomCanonique": "Dépôt de rapport",
                    "libelleCourt": "Dépôt de rapport"
                  },
                  "organeRef": "PO516754",
                  "dateActe": "2016-04-05T00:00:00.000+02:00",
                  "texteAssocieRef": "AVISSNR5S259B0526"
                }
              ]
            },
            {
              "xsiType": "Etape_Type",
              "uid": "L14-VD177767CA",
              "codeActe": "SN1-COM-AVIS",
              "libelleActe": {
                "nomCanonique": "Travaux d'une commission saisie pour avis",
                "libelleCourt": "Travaux d'une commission saisie pour avis"
              },
              "organeRef": "PO211494",
              "actesLegislatifs": [
                {
                  "xsiType": "SaisieComAvis_Type",
                  "uid": "L14-VD177767CAS",
                  "codeActe": "SN1-COM-AVIS-SAISIE",
                  "libelleActe": {
                    "nomCanonique": "Saisine pour avis d'une commission",
                    "libelleCourt": "Saisine pour avis d'une commission"
                  },
                  "organeRef": "PO211494",
                  "dateActe": "2016-03-02T00:00:00.000+01:00"
                },
                {
                  "xsiType": "NominRapporteurs_Type",
                  "uid": "L14-VD177771",
                  "codeActe": "SN1-COM-AVIS-NOMIN",
                  "libelleActe": {
                    "nomCanonique": "Nomination de rapporteur",
                    "libelleCourt": "Nomination de rapporteur"
                  },
                  "organeRef": "PO211494",
                  "dateActe": "2016-03-02T00:00:00.000+01:00",
                  "rapporteurs": [
                    {
                      "acteurRef": "PA980",
                      "typeRapporteur": "rapporteur pour avis"
                    }
                  ]
                },
                {
                  "xsiType": "DepotRapport_Type",
                  "uid": "L14-VD177774",
                  "codeActe": "SN1-COM-AVIS-RAPPORT",
                  "libelleActe": {
                    "nomCanonique": "Dépôt de rapport",
                    "libelleCourt": "Dépôt de rapport"
                  },
                  "organeRef": "PO211494",
                  "dateActe": "2016-04-05T00:00:00.000+02:00",
                  "texteAssocieRef": "AVISSNR5S259B0524"
                }
              ]
            }
          ]
        },
        {
          "xsiType": "Etape_Type",
          "uid": "L14-SN1-DEBATS-34516",
          "codeActe": "SN1-DEBATS",
          "libelleActe": {
            "nomCanonique": "Discussion en séance publique",
            "libelleCourt": "Discussion en séance publique"
          },
          "organeRef": "PO78718",
          "actesLegislatifs": [
            {
              "xsiType": "DiscussionSeancePublique_Type",
              "uid": "L14-VD177341S33445",
              "codeActe": "SN1-DEBATS-SEANCE",
              "libelleActe": {
                "nomCanonique": "Discussion en séance publique",
                "libelleCourt": "Discussion en séance publique"
              },
              "organeRef": "PO78718",
              "dateActe": "2016-04-26T00:00:00.000+02:00",
              "odjRef": "RUSNR5L14S2016IDS19927PT33445",
              "reunionRef": "RUSNR5L14S2016IDS19927"
            },
            {
              "xsiType": "DiscussionSeancePublique_Type",
              "uid": "L14-VD177341S33446",
              "codeActe": "SN1-DEBATS-SEANCE",
              "libelleActe": {
                "nomCanonique": "Discussion en séance publique",
                "libelleCourt": "Discussion en séance publique"
              },
              "organeRef": "PO78718",
              "dateActe": "2016-04-27T00:00:00.000+02:00",
              "odjRef": "RUSNR5L14S2016IDS19928PT33446",
              "reunionRef": "RUSNR5L14S2016IDS19928"
            },
            {
              "xsiType": "DiscussionSeancePublique_Type",
              "uid": "L14-VD177341S33448",
              "codeActe": "SN1-DEBATS-SEANCE",
              "libelleActe": {
                "nomCanonique": "Discussion en séance publique",
                "libelleCourt": "Discussion en séance publique"
              },
              "organeRef": "PO78718",
              "dateActe": "2016-04-28T00:00:00.000+02:00",
              "odjRef": "RUSNR5L14S2016IDS19929PT33448",
              "reunionRef": "RUSNR5L14S2016IDS19929"
            },
            {
              "xsiType": "DiscussionSeancePublique_Type",
              "uid": "L14-VD177341S33609",
              "codeActe": "SN1-DEBATS-SEANCE",
              "libelleActe": {
                "nomCanonique": "Discussion en séance publique",
                "libelleCourt": "Discussion en séance publique"
              },
              "organeRef": "PO78718",
              "dateActe": "2016-04-29T00:00:00.000+02:00",
              "odjRef": "RUSNR5L14S2016IDS20021PT33609",
              "reunionRef": "RUSNR5L14S2016IDS20021"
            },
            {
              "xsiType": "DiscussionSeancePublique_Type",
              "uid": "L14-VD177341S33610",
              "codeActe": "SN1-DEBATS-SEANCE",
              "libelleActe": {
                "nomCanonique": "Discussion en séance publique",
                "libelleCourt": "Discussion en séance publique"
              },
              "organeRef": "PO78718",
              "dateActe": "2016-05-02T00:00:00.000+02:00",
              "odjRef": "RUSNR5L14S2016IDS20022PT33610",
              "reunionRef": "RUSNR5L14S2016IDS20022"
            },
            {
              "xsiType": "DiscussionSeancePublique_Type",
              "uid": "L14-VD177341S33449",
              "codeActe": "SN1-DEBATS-SEANCE",
              "libelleActe": {
                "nomCanonique": "Discussion en séance publique",
                "libelleCourt": "Discussion en séance publique"
              },
              "organeRef": "PO78718",
              "dateActe": "2016-05-03T00:00:00.000+02:00",
              "odjRef": "RUSNR5L14S2016IDS19930PT33449",
              "reunionRef": "RUSNR5L14S2016IDS19930"
            },
            {
              "xsiType": "Decision_Type",
              "uid": "L14-VD177878DEC",
              "codeActe": "SN1-DEBATS-DEC",
              "libelleActe": {
                "nomCanonique": "Décision",
                "libelleCourt": "Décision"
              },
              "organeRef": "PO78718",
              "dateActe": "2016-05-03T00:00:00.000+02:00",
              "reunionRef": "RUSNR5L14S2016IDS19930",
              "statutConclusion": {
                "famCode": "TSORTF05",
                "libelle": "modifié"
              },
              "textesAssocies": [
                {
                  "typeTexte": "BTA",
                  "texteAssocieRef": "PRJLSNR5S259BTA0131"
                }
              ]
            }
          ]
        }
      ]
    },
    {
      "xsiType": "Etape_Type",
      "uid": "L14-CMP-34516",
      "codeActe": "CMP",
      "libelleActe": {
        "nomCanonique": "Commission Mixte Paritaire",
        "libelleCourt": "Commission Mixte Paritaire"
      },
      "organeRef": "PO712731",
      "actesLegislatifs": [
        {
          "xsiType": "DepotInitiativeNavette_Type",
          "uid": "L14-VD177924DIN",
          "codeActe": "CMP-DEPOT",
          "libelleActe": {
            "nomCanonique": "Dépôt d'un projet de loi",
            "libelleCourt": "Dépôt d'un projet de loi"
          },
          "organeRef": "PO712731",
          "dateActe": "2016-05-04T00:00:00.000+02:00",
          "provenanceRef": "PO78718",
          "texteAssocieRef": "PRJLANR5L14B3724"
        },
        {
          "xsiType": "RenvoiCMP_Type",
          "uid": "L14-VD177926CMPS",
          "codeActe": "CMP-SAISIE",
          "libelleActe": {
            "nomCanonique": "Convocation d'une CMP",
            "libelleCourt": "Convocation d'une CMP"
          },
          "organeRef": "PO712731",
          "dateActe": "2016-05-04T00:00:00.000+02:00",
          "initiateur": {
            "acteurs": [
              {
                "acteurRef": "PA267622",
                "mandatRef": "PM702957"
              }
            ]
          }
        },
        {
          "xsiType": "Etape_Type",
          "uid": "L14-VD177926COM",
          "codeActe": "CMP-COM",
          "libelleActe": {
            "nomCanonique": "Commission Mixte Paritaire",
            "libelleCourt": "Commission Mixte Paritaire"
          },
          "organeRef": "PO712731",
          "actesLegislatifs": [
            {
              "xsiType": "NominRapporteurs_Type",
              "uid": "L14-VD178669",
              "codeActe": "CMP-COM-NOMIN",
              "libelleActe": {
                "nomCanonique": "Nomination de rapporteur",
                "libelleCourt": "Nomination de rapporteur"
              },
              "organeRef": "PO712731",
              "dateActe": "2016-06-29T00:00:00.000+02:00",
              "rapporteurs": [
                {
                  "acteurRef": "PA607310",
                  "typeRapporteur": "rapporteur"
                },
                {
                  "acteurRef": "PA415454",
                  "typeRapporteur": "rapporteur"
                }
              ]
            },
            {
              "xsiType": "DepotRapport_Type",
              "uid": "L14-VD178677",
              "codeActe": "CMP-COM-RAPPORT-AN",
              "libelleActe": {
                "nomCanonique": "Dépôt du rapport d'une CMP",
                "libelleCourt": "Dépôt du rapport d'une CMP"
              },
              "organeRef": "PO644420",
              "dateActe": "2016-06-30T00:00:00.000+02:00",
              "texteAssocieRef": "RAPPANR5L14B3902"
            },
            {
              "xsiType": "DepotRapport_Type",
              "uid": "L14-VD178702",
              "codeActe": "CMP-COM-RAPPORT-SN",
              "libelleActe": {
                "nomCanonique": "Dépôt du rapport d'une CMP",
                "libelleCourt": "Dépôt du rapport d'une CMP"
              },
              "organeRef": "PO78718",
              "dateActe": "2016-06-30T00:00:00.000+02:00",
              "texteAssocieRef": "RAPPSNR5S259B0743"
            }
          ]
        },
        {
          "xsiType": "Etape_Type",
          "uid": "L14-CMP-DEBATS-AN-34516",
          "codeActe": "CMP-DEBATS-AN",
          "libelleActe": {
            "nomCanonique": "Discussion en séance publique",
            "libelleCourt": "Discussion en séance publique"
          },
          "organeRef": "PO644420",
          "actesLegislatifs": [
            {
              "xsiType": "DiscussionSeancePublique_Type",
              "uid": "L14-VD178726S33980",
              "codeActe": "CMP-DEBATS-AN-SEANCE",
              "libelleActe": {
                "nomCanonique": "Discussion en séance publique",
                "libelleCourt": "Discussion en séance publique"
              },
              "organeRef": "PO644420",
              "dateActe": "2016-07-20T00:00:00.000+02:00",
              "odjRef": "RUANR5L14S2016IDS20181PT33980",
              "reunionRef": "RUANR5L14S2016IDS20181"
            },
            {
              "xsiType": "Decision_Type",
              "uid": "L14-VD179015DEC",
              "codeActe": "CMP-DEBATS-AN-DEC",
              "libelleActe": {
                "nomCanonique": "Décision",
                "libelleCourt": "Décision"
              },
              "organeRef": "PO644420",
              "dateActe": "2016-07-20T00:00:00.000+02:00",
              "reunionRef": "RUANR5L14S2016IDS20181",
              "statutConclusion": {
                "famCode": "TSORTF18",
                "libelle": "adopté, dans les conditions prévues à l'article 45, alinéa 3, de la Constitution"
              },
              "textesAssocies": [
                {
                  "typeTexte": "BTA",
                  "texteAssocieRef": "PRJLANR5L14BTA0802"
                }
              ]
            }
          ]
        },
        {
          "xsiType": "Etape_Type",
          "uid": "L14-CMP-DEBATS-SN-34516",
          "codeActe": "CMP-DEBATS-SN",
          "libelleActe": {
            "nomCanonique": "Discussion en séance publique",
            "libelleCourt": "Discussion en séance publique"
          },
          "organeRef": "PO78718",
          "actesLegislatifs": [
            {
              "xsiType": "DiscussionSeancePublique_Type",
              "uid": "L14-VD179439S34279",
              "codeActe": "CMP-DEBATS-SN-SEANCE",
              "libelleActe": {
                "nomCanonique": "Discussion en séance publique",
                "libelleCourt": "Discussion en séance publique"
              },
              "organeRef": "PO78718",
              "dateActe": "2016-09-28T00:00:00.000+02:00",
              "odjRef": "RUSNR5L14S2016IDS20242PT34279",
              "reunionRef": "RUSNR5L14S2016IDS20242"
            },
            {
              "xsiType": "Decision_Type",
              "uid": "L14-VD179450DEC",
              "codeActe": "CMP-DEBATS-SN-DEC",
              "libelleActe": {
                "nomCanonique": "Décision",
                "libelleCourt": "Décision"
              },
              "organeRef": "PO78718",
              "dateActe": "2016-09-28T00:00:00.000+02:00",
              "reunionRef": "RUSNR5L14S2016IDS20242",
              "statutConclusion": {
                "famCode": "TSORTF18",
                "libelle": "adopté, dans les conditions prévues à l'article 45, alinéa 3, de la Constitution"
              },
              "textesAssocies": [
                {
                  "typeTexte": "BTA",
                  "texteAssocieRef": "PRJLSNR5S259BTA0185"
                }
              ]
            }
          ]
        },
        {
          "xsiType": "Decision_Type",
          "uid": "L14-VD177926DEC",
          "codeActe": "CMP-DEC",
          "libelleActe": {
            "nomCanonique": "Décision de la CMP",
            "libelleCourt": "Décision de la CMP"
          },
          "organeRef": "PO712731",
          "dateActe": "2016-06-30T00:00:00.000+02:00",
          "statutConclusion": {
            "famCode": "TCCMP01",
            "libelle": "Accord"
          }
        }
      ]
    },
    {
      "xsiType": "Etape_Type",
      "uid": "L14-PROM-34516",
      "codeActe": "PROM",
      "libelleActe": {
        "nomCanonique": "Promulgation de la loi",
        "libelleCourt": "Promulgation de la loi"
      },
      "organeRef": "PO696251",
      "actesLegislatifs": [
        {
          "xsiType": "Promulgation_Type",
          "uid": "L14-VD179621PL",
          "codeActe": "PROM-PUB",
          "libelleActe": {
            "nomCanonique": "Promulgation d'une loi",
            "libelleCourt": "Promulgation d'une loi"
          },
          "organeRef": "PO696251",
          "dateActe": "2016-10-07T00:00:00.000+02:00",
          "codeLoi": "2016-1321",
          "infoJo": {
            "typeJo": "JO_LOI_DECRET",
            "dateJo": "2016-10-08+02:00",
            "numJo": "235"
          },
          "referenceNor": "ECFI1524250L",
          "texteLoiRef": "PRJLSNR5S259BTA0185",
          "titreLoi": "pour une République numérique",
          "urlLegifrance": "http://www.legifrance.gouv.fr/WAspad/UnTexteDeJorf?numjo=ECFI1524250L"
        }
      ]
    }
  ]
}