{
  "xsiType": "DossierLegislatif_Type",
  "uid": "DLR5L14N29034",
  "legislature": "14",
  "titreDossier": {
    "titre": "Favoriser l'accueil à l'école des enfants de deux ans, dans les zones de revitalisation rurale et les bassins d'emploi à redynamiser, à la demande de leurs parents",
    "titreChemin": "accueil_ecole_deux_ans_ZRR"
  },
  "procedureParlementaire": {
    "code": "2",
    "libelle": "Proposition de loi ordinaire"
  },
  "initiateur": {
    "acteurs": [
      {
        "acteurRef": "PA2952",
        "mandatRef": "PM645464"
      }
    ]
  },
  "actesLegislatifs": [
    {
      "xsiType": "Etape_Type",
      "uid": "L14-AN1-29034",
      "codeActe": "AN1",
      "libelleActe": {
        "nomCanonique": "1ère lecture (1ère assemblée saisie)",
        "libelleCourt": "1ère lecture"
      },
      "organeRef": "PO644420",
      "actesLegislatifs": [
        {
          "xsiType": "DepotInitiative_Type",
          "uid": "L14-VD159215DI",
          "codeActe": "AN1-DEPOT",
          "libelleActe": {
            "nomCanonique": "1er dépôt d'une initiative.",
            "libelleCourt": "1er dépôt d'une initiative."
          },
          "organeRef": "PO644420",
          "dateActe": "2012-09-12T00:00:00.000+02:00",
          "texteAssocieRef": "PIONANR5L14B0184"
        },
        {
          "xsiType": "Etape_Type",
          "uid": "L14-AN1-COM-29034",
          "codeActe": "AN1-COM",
          "libelleActe": {
            "nomCanonique": "Travaux des commissions",
            "libelleCourt": "Travaux des commissions"
          },
          "organeRef": "PO644420",
          "actesLegislatifs": [
            {
              "xsiType": "Etape_Type",
              "uid": "L14-VD159216CF",
              "codeActe": "AN1-COM-FOND",
              "libelleActe": {
                "nomCanonique": "Travaux de la commission saisie au fond",
                "libelleCourt": "Travaux de la commission saisie au fond"
              },
              "organeRef": "PO419604",
              "actesLegislatifs": [
                {
                  "xsiType": "SaisieComFond_Type",
                  "uid": "L14-VD159216CFS",
                  "codeActe": "AN1-COM-FOND-SAISIE",
                  "libelleActe": {
                    "nomCanonique": "Renvoi en commission au fond",
                    "libelleCourt": "Renvoi en commission au fond"
                  },
                  "organeRef": "PO419604",
                  "dateActe": "2012-09-12T00:00:00.000+02:00"
                }
              ]
            }
          ]
        }
      ]
    }
  ],
  "indexation": {
    "themes": {
      "@niveau": "1",
      "theme": {
        "libelleTheme": "POLITIQUE ECONOMIQUE ET SOCIALE"
      }
    }
  }
}