{
  "xsiType": "rapportParlementaire_Type",
  "uid": "RAPPANR5L14B3944",
  "legislature": "14",
  "cycleDeVie": {
    "chrono": {
      "dateCreation": "2016-07-12T00:00:00.000+02:00",
      "dateDepot": "2016-07-12T00:00:00.000+02:00",
      "datePublication": "2016-07-18T00:00:00.000+02:00",
      "datePublicationWeb": "2016-07-15T21:00:00.000+02:00"
    }
  },
  "denominationStructurelle": "Rapport",
  "provenance": "Commission",
  "titres": {
    "titrePrincipal": "rapport la commission mixte paritaire chargée de proposer un texte sur les dispositions restant en discussion de la proposition de loi organique rénovant les modalités d'inscription sur les listes électorales des Français établis hors de France.",
    "titrePrincipalCourt": "rapport la commission mixte paritaire chargée de proposer un texte sur les dispositions restant en discussion de la proposition de loi organique rénovant les modalités d'inscription sur les listes électorales des Français établis hors de France."
  },
  "dossierRef": "DLR5L14N34522",
  "classification": {
    "famille": {
      "depot": {
        "code": "RAPINIT",
        "libelle": "Rapport sur une initiative"
      },
      "classe": {
        "code": "RAPPORT",
        "libelle": "Rapport"
      }
    },
    "type": {
      "code": "RAPP",
      "libelle": "Rapport"
    },
    "statutAdoption": "ADOPTCOM"
  },
  "auteurs": [
    {
      "acteur": {
        "acteurRef": "PA610313",
        "qualite": "rapporteur"
      }
    },
    {
      "acteur": {
        "acteurRef": "PA2952",
        "qualite": "rapporteur"
      }
    },
    {
      "organeRef": "PO714021"
    }
  ],
  "notice": {
    "numNotice": "3944",
    "formule": "de la commission mixte paritaire chargée de proposer un texte sur les dispositions restant en discussion de la proposition de loi organique rénovant les modalités d'inscription sur les listes électorales des Français établis hors de France.",
    "adoptionConforme": false
  },
  "imprimerie": {
    "prix": "0.75"
  }
}