{
  "xsiType": "rapportParlementaire_Type",
  "uid": "RAPPSNR5S279B0073",
  "cycleDeVie": {
    "chrono": {
      "dateCreation": "2016-10-27T00:00:00.000+02:00",
      "dateDepot": "2016-10-26T00:00:00.000+02:00"
    }
  },
  "denominationStructurelle": "Rapport",
  "provenance": "Commission",
  "titres": {
    "titrePrincipal": "rapport  sur le projet de loi, adopté, par l'Assemblée nationale après engagement de la procédure accélérée, ratifiant l'ordonnance n° 2015-1682 du 17 décembre 2015 portant simplification de certains régimes d'autorisation préalable et de déclaration des entreprises et des professionnels et modifiant le code du sport (n°15).",
    "titrePrincipalCourt": "rapport  sur le projet de loi, adopté, par l'Assemblée nationale après engagement de la procédure accélérée, ratifiant l'ordonnance n° 2015-1682 du 17 décembre 2015 portant simplification de certains régimes d'autorisation préalable et de déclaration des entreprises et des professionnels et modifiant le code du sport (n°15)."
  },
  "dossierRef": "DLR5L14N34899",
  "classification": {
    "famille": {
      "depot": {
        "code": "RAPINIT",
        "libelle": "Rapport sur une initiative"
      },
      "classe": {
        "code": "RAPPORT",
        "libelle": "Rapport"
      }
    },
    "type": {
      "code": "RAPP",
      "libelle": "Rapport"
    }
  },
  "auteurs": [
    {
      "acteur": {
        "acteurRef": "PA429874",
        "qualite": "rapporteur"
      }
    },
    {
      "organeRef": "PO211490"
    }
  ],
  "notice": {
    "numNotice": "73",
    "formule": "sur le projet de loi, adopté, par l'Assemblée nationale après engagement de la procédure accélérée, ratifiant l'ordonnance n° 2015-1682 du 17 décembre 2015 portant simplification de certains régimes d'autorisation préalable et de déclaration des entreprises et des professionnels et modifiant le code du sport (n°15).",
    "adoptionConforme": false
  }
}