{
  "xsiType": "DossierMissionControle_Type",
  "uid": "DLR5L14N34321",
  "legislature": "14",
  "titreDossier": {
    "titre": "Application de la loi relative à la consommation",
    "titreChemin": "projet_de_loi_consommation"
  },
  "procedureParlementaire": {
    "code": "19",
    "libelle": "Rapport d'information sans mission"
  },
  "actesLegislatifs": [
    {
      "xsiType": "Etape_Type",
      "uid": "L14-AN20-34321",
      "codeActe": "AN20",
      "libelleActe": {
        "nomCanonique": "Travaux"
      },
      "organeRef": "PO644420",
      "actesLegislatifs": [
        {
          "xsiType": "DepotRapport_Type",
          "uid": "L14-VD175245",
          "codeActe": "AN20-RAPPORT",
          "libelleActe": {
            "nomCanonique": "Dépôt de rapport",
            "libelleCourt": "Dépôt de rapport"
          },
          "organeRef": "PO419610",
          "dateActe": "2015-10-07T00:00:00.000+02:00",
          "texteAssocieRef": "RINFANR5L14B3104"
        }
      ]
    }
  ]
}