{
  "xsiType": "rapportParlementaire_Type",
  "uid": "RAPPSNR5S259B0786",
  "cycleDeVie": {
    "chrono": {
      "dateCreation": "2016-07-13T00:00:00.000+02:00",
      "dateDepot": "2016-07-13T00:00:00.000+02:00"
    }
  },
  "denominationStructurelle": "Rapport",
  "provenance": "Commission",
  "titres": {
    "titrePrincipal": "rapport , en nouvelle lecture, sur le projet de loi de règlement du budget et d'approbation des comptes, adopté, par l'Assemblée nationale, en nouvelle lecture, de l'année 2015 (n°785).",
    "titrePrincipalCourt": "rapport , en nouvelle lecture, sur le projet de loi de règlement du budget et d'approbation des comptes, adopté, par l'Assemblée nationale, en nouvelle lecture, de l'année 2015 (n°785)."
  },
  "dossierRef": "DLR5L14N34928",
  "classification": {
    "famille": {
      "depot": {
        "code": "RAPINIT",
        "libelle": "Rapport sur une initiative"
      },
      "classe": {
        "code": "RAPPORT",
        "libelle": "Rapport"
      }
    },
    "type": {
      "code": "RAPP",
      "libelle": "Rapport"
    }
  },
  "auteurs": [
    {
      "acteur": {
        "acteurRef": "PA415448",
        "qualite": "rapporteur"
      }
    },
    {
      "organeRef": "PO211494"
    }
  ],
  "notice": {
    "numNotice": "786",
    "formule": ", en nouvelle lecture, sur le projet de loi de règlement du budget et d'approbation des comptes, adopté, par l'Assemblée nationale, en nouvelle lecture, de l'année 2015 (n°785).",
    "adoptionConforme": false
  }
}