{
  "xsiType": "texteLoi_Type",
  "uid": "PIONSNR5S259B0685",
  "cycleDeVie": {
    "chrono": {
      "dateCreation": "2016-06-17T00:00:00.000+02:00",
      "dateDepot": "2016-06-15T00:00:00.000+02:00"
    }
  },
  "denominationStructurelle": "Proposition de loi",
  "provenance": "Texte Déposé",
  "titres": {
    "titrePrincipal": "proposition de loi visant à la mise en œuvre effective du droit à l'eau potable et à l'assainissement",
    "titrePrincipalCourt": "Droit à l'eau potable"
  },
  "dossierRef": "DLR5L14N33872",
  "classification": {
    "famille": {
      "depot": {
        "code": "INITNAV",
        "libelle": "Initiative en Navette"
      },
      "classe": {
        "code": "PIONLOI",
        "libelle": "Proposition de loi"
      }
    },
    "type": {
      "code": "PION",
      "libelle": "Proposition de loi"
    }
  },
  "auteurs": [
    {
      "organeRef": "PO78718"
    }
  ],
  "notice": {
    "numNotice": "685",
    "formule": ", adoptée, par l'Assemblée nationale, visant à la mise en œuvre effective du droit à l'eau potable et à l'assainissement",
    "adoptionConforme": false
  },
  "depotAmendements": {
    "amendementsSeance": {
      "amendable": false
    }
  }
}