{
  "xsiType": "DossierLegislatif_Type",
  "uid": "DLR5L14N34835",
  "legislature": "14",
  "titreDossier": {
    "titre": "Société : autonomie des femmes étrangères",
    "titreChemin": "Autonomie_femmes_etrangeres",
    "senatChemin": "http://www.senat.fr/dossier-legislatif/ppl15-648.html"
  },
  "procedureParlementaire": {
    "code": "2",
    "libelle": "Proposition de loi ordinaire"
  },
  "initiateur": {
    "acteurs": [
      {
        "acteurRef": "PA689",
        "mandatRef": "PM645113"
      }
    ]
  },
  "actesLegislatifs": [
    {
      "xsiType": "Etape_Type",
      "uid": "L14-AN1-34835",
      "codeActe": "AN1",
      "libelleActe": {
        "nomCanonique": "1ère lecture (1ère assemblée saisie)",
        "libelleCourt": "1ère lecture"
      },
      "organeRef": "PO644420",
      "actesLegislatifs": [
        {
          "xsiType": "DepotInitiative_Type",
          "uid": "L14-VD177740DI",
          "codeActe": "AN1-DEPOT",
          "libelleActe": {
            "nomCanonique": "1er dépôt d'une initiative.",
            "libelleCourt": "1er dépôt d'une initiative."
          },
          "organeRef": "PO644420",
          "dateActe": "2016-04-13T00:00:00.000+02:00",
          "texteAssocieRef": "PIONANR5L14B3682"
        },
        {
          "xsiType": "Etape_Type",
          "uid": "L14-AN1-COM-34835",
          "codeActe": "AN1-COM",
          "libelleActe": {
            "nomCanonique": "Travaux des commissions",
            "libelleCourt": "Travaux des commissions"
          },
          "organeRef": "PO644420",
          "actesLegislatifs": [
            {
              "xsiType": "Etape_Type",
              "uid": "L14-VD177741CF",
              "codeActe": "AN1-COM-FOND",
              "libelleActe": {
                "nomCanonique": "Travaux de la commission saisie au fond",
                "libelleCourt": "Travaux de la commission saisie au fond"
              },
              "organeRef": "PO59051",
              "actesLegislatifs": [
                {
                  "xsiType": "SaisieComFond_Type",
                  "uid": "L14-VD177741CFS",
                  "codeActe": "AN1-COM-FOND-SAISIE",
                  "libelleActe": {
                    "nomCanonique": "Renvoi en commission au fond",
                    "libelleCourt": "Renvoi en commission au fond"
                  },
                  "organeRef": "PO59051",
                  "dateActe": "2016-04-13T00:00:00.000+02:00"
                },
                {
                  "xsiType": "NominRapporteurs_Type",
                  "uid": "L14-VD178083",
                  "codeActe": "AN1-COM-FOND-NOMIN",
                  "libelleActe": {
                    "nomCanonique": "Nomination de rapporteur",
                    "libelleCourt": "Nomination de rapporteur"
                  },
                  "organeRef": "PO59051",
                  "dateActe": "2016-05-04T00:00:00.000+02:00",
                  "rapporteurs": [
                    {
                      "acteurRef": "PA689",
                      "typeRapporteur": "rapporteur"
                    }
                  ]
                },
                {
                  "xsiType": "DiscussionCommission_Type",
                  "uid": "L14-VD177877R23628",
                  "codeActe": "AN1-COM-FOND-REUNION",
                  "libelleActe": {
                    "nomCanonique": "Réunion de commission",
                    "libelleCourt": "Réunion de commission"
                  },
                  "organeRef": "PO59051",
                  "dateActe": "2016-05-04T10:00:00.000+02:00",
                  "odjRef": "RUANR5L14S2016IDC425341PT23628",
                  "reunionRef": "RUANR5L14S2016IDC425341"
                },
                {
                  "xsiType": "DiscussionCommission_Type",
                  "uid": "L14-VD177877R23683",
                  "codeActe": "AN1-COM-FOND-REUNION",
                  "libelleActe": {
                    "nomCanonique": "Réunion de commission",
                    "libelleCourt": "Réunion de commission"
                  },
                  "organeRef": "PO59051",
                  "dateActe": "2016-05-18T10:30:00.000+02:00"
                },
                {
                  "xsiType": "DiscussionCommission_Type",
                  "uid": "L14-VD177877R23734",
                  "codeActe": "AN1-COM-FOND-REUNION",
                  "libelleActe": {
                    "nomCanonique": "Réunion de commission",
                    "libelleCourt": "Réunion de commission"
                  },
                  "organeRef": "PO59051",
                  "dateActe": "2016-05-26T11:00:00.000+02:00"
                },
                {
                  "xsiType": "DepotRapport_Type",
                  "uid": "L14-VD178084",
                  "codeActe": "AN1-COM-FOND-RAPPORT",
                  "libelleActe": {
                    "nomCanonique": "Dépôt de rapport",
                    "libelleCourt": "Dépôt de rapport"
                  },
                  "organeRef": "PO59051",
                  "dateActe": "2016-05-18T00:00:00.000+02:00",
                  "texteAdopteRef": "PIONANR5L14BTC3759",
                  "texteAssocieRef": "RAPPANR5L14B3759"
                }
              ]
            }
          ]
        },
        {
          "xsiType": "Etape_Type",
          "uid": "L14-AN1-DEBATS-34835",
          "codeActe": "AN1-DEBATS",
          "libelleActe": {
            "nomCanonique": "Discussion en séance publique",
            "libelleCourt": "Discussion en séance publique"
          },
          "organeRef": "PO644420",
          "actesLegislatifs": [
            {
              "xsiType": "DiscussionSeancePublique_Type",
              "uid": "L14-VD177860S33615",
              "codeActe": "AN1-DEBATS-SEANCE",
              "libelleActe": {
                "nomCanonique": "Discussion en séance publique",
                "libelleCourt": "Discussion en séance publique"
              },
              "organeRef": "PO644420",
              "dateActe": "2016-05-26T00:00:00.000+02:00",
              "odjRef": "RUANR5L14S2016IDS20028PT33615",
              "reunionRef": "RUANR5L14S2016IDS20028"
            },
            {
              "xsiType": "DiscussionSeancePublique_Type",
              "uid": "L14-VD177860S33619",
              "codeActe": "AN1-DEBATS-SEANCE",
              "libelleActe": {
                "nomCanonique": "Discussion en séance publique",
                "libelleCourt": "Discussion en séance publique"
              },
              "organeRef": "PO644420",
              "dateActe": "2016-05-26T00:00:00.000+02:00",
              "odjRef": "RUANR5L14S2016IDS20029PT33619",
              "reunionRef": "RUANR5L14S2016IDS20029"
            },
            {
              "xsiType": "Decision_Type",
              "uid": "L14-VD178232DEC",
              "codeActe": "AN1-DEBATS-DEC",
              "libelleActe": {
                "nomCanonique": "Décision",
                "libelleCourt": "Décision"
              },
              "organeRef": "PO644420",
              "dateActe": "2016-05-26T00:00:00.000+02:00",
              "reunionRef": "RUANR5L14S2016IDS20029",
              "statutConclusion": {
                "famCode": "TSORTF01",
                "libelle": "adoptée"
              },
              "textesAssocies": [
                {
                  "typeTexte": "BTA",
                  "texteAssocieRef": "PIONANR5L14BTA0740"
                }
              ]
            }
          ]
        }
      ]
    },
    {
      "xsiType": "Etape_Type",
      "uid": "L14-SN1-34835",
      "codeActe": "SN1",
      "libelleActe": {
        "nomCanonique": "1ère lecture (2ème assemblée saisie)",
        "libelleCourt": "1ère lecture"
      },
      "organeRef": "PO78718",
      "actesLegislatifs": [
        {
          "xsiType": "DepotInitiativeNavette_Type",
          "uid": "L14-VD178247DIN",
          "codeActe": "SN1-DEPOT",
          "libelleActe": {
            "nomCanonique": "Dépôt d'une initiative en navette",
            "libelleCourt": "Dépôt d'une initiative en navette"
          },
          "organeRef": "PO78718",
          "dateActe": "2016-05-26T00:00:00.000+02:00",
          "provenanceRef": "PO644420",
          "texteAssocieRef": "PIONSNR5S259B0648"
        },
        {
          "xsiType": "Etape_Type",
          "uid": "L14-SN1-COM-34835",
          "codeActe": "SN1-COM",
          "libelleActe": {
            "nomCanonique": "Travaux des commissions",
            "libelleCourt": "Travaux des commissions"
          },
          "organeRef": "PO78718",
          "actesLegislatifs": [
            {
              "xsiType": "Etape_Type",
              "uid": "L14-VD178248CF",
              "codeActe": "SN1-COM-FOND",
              "libelleActe": {
                "nomCanonique": "Travaux de la commission saisie au fond",
                "libelleCourt": "Travaux de la commission saisie au fond"
              },
              "organeRef": "PO211495",
              "actesLegislatifs": [
                {
                  "xsiType": "SaisieComFond_Type",
                  "uid": "L14-VD178248CFS",
                  "codeActe": "SN1-COM-FOND-SAISIE",
                  "libelleActe": {
                    "nomCanonique": "Renvoi en commission au fond",
                    "libelleCourt": "Renvoi en commission au fond"
                  },
                  "organeRef": "PO211495",
                  "dateActe": "2016-05-26T00:00:00.000+02:00"
                }
              ]
            }
          ]
        }
      ]
    }
  ]
}