{
  "xsiType": "texteLoi_Type",
  "uid": "PRJLANR5L14B0845",
  "legislature": "14",
  "cycleDeVie": {
    "chrono": {
      "dateCreation": "2013-03-27T00:00:00.000+01:00",
      "dateDepot": "2013-03-27T00:00:00.000+01:00",
      "datePublication": "2013-06-04T00:00:00.000+02:00",
      "datePublicationWeb": "2013-03-28T13:15:00.000+01:00"
    }
  },
  "denominationStructurelle": "Projet de loi",
  "provenance": "Texte Déposé",
  "titres": {
    "titrePrincipal": "projet de loi relatif aux attributions du garde des sceaux et des magistrats du ministère public en matière de politique pénale et d'action publique",
    "titrePrincipalCourt": "attributions du garde des sceaux et des magistrats du ministère public en matière de politique pénale et d'action publique"
  },
  "dossierRef": "DLR5L14N29949",
  "classification": {
    "famille": {
      "depot": {
        "code": "INITDEP",
        "libelle": "Initiative en 1er Dépôt"
      },
      "classe": {
        "code": "PRJLOI",
        "libelle": "Projet de loi"
      }
    },
    "type": {
      "code": "PRJL",
      "libelle": "Projet de loi"
    }
  },
  "auteurs": [
    {
      "acteur": {
        "acteurRef": "PA328",
        "qualite": "auteur"
      }
    }
  ],
  "notice": {
    "numNotice": "845",
    "formule": "relatif aux attributions du garde des sceaux et des magistrats du ministère public en matière de politique pénale et d'action publique",
    "adoptionConforme": false
  },
  "indexation": {
    "themes": {
      "@niveau": "1",
      "theme": {
        "libelleTheme": "AGRICULTURE"
      }
    }
  },
  "coSignataires": [
    {
      "acteurRef": "PA2791",
      "dateCosignature": "2013-03-27+01:00",
      "edite": true
    }
  ],
  "depotAmendements": {
    "amendementsSeance": {
      "amendable": false
    },
    "amendementsCommission": [
      {
        "organeRef": "PO59051",
        "amendable": true
      }
    ]
  }
}