{
  "xsiType": "texteLoi_Type",
  "uid": "PRJLSNR5S259B0545",
  "cycleDeVie": {
    "chrono": {
      "dateCreation": "2016-05-03T00:00:00.000+02:00",
      "dateDepot": "2016-04-13T00:00:00.000+02:00",
      "datePublication": "2016-07-13T00:00:00.000+02:00"
    }
  },
  "denominationStructurelle": "Projet de loi",
  "provenance": "Texte Déposé",
  "titres": {
    "titrePrincipal": "projet de loi ratifiant l'ordonnance n° 2016-129 du 10 février 2016 portant sur un dispositif de continuité de fourniture succédant à la fin des offres de marché transitoires de gaz et d’électricité",
    "titrePrincipalCourt": "Dispositif de continuité de fourniture succédant à la fin des offres de marché transitoires de gaz et d’électricité"
  },
  "dossierRef": "DLR5L14N34875",
  "classification": {
    "famille": {
      "depot": {
        "code": "INITDEP",
        "libelle": "Initiative en 1er Dépôt"
      },
      "classe": {
        "code": "PRJLOI",
        "libelle": "Projet de loi"
      }
    },
    "type": {
      "code": "PRJL",
      "libelle": "Projet de loi"
    }
  },
  "auteurs": [
    {
      "acteur": {
        "acteurRef": "PA267622",
        "qualite": "auteur"
      }
    }
  ],
  "notice": {
    "numNotice": "545",
    "formule": "ratifiant l'ordonnance n° 2016-129 du 10 février 2016 portant sur un dispositif de continuité de fourniture succédant à la fin des offres de marché transitoires de gaz et d’électricité",
    "adoptionConforme": false
  },
  "coSignataires": [
    {
      "acteurRef": "PA2650",
      "dateCosignature": "2016-04-13+02:00",
      "edite": true
    }
  ],
  "depotAmendements": {
    "amendementsSeance": {
      "amendable": false
    }
  }
}