{
  "xsiType": "DossierMissionControle_Type",
  "uid": "DLR5L14N35640",
  "legislature": "14",
  "titreDossier": {
    "titre": "Suivi de la mise en œuvre des conclusions de la commission d'enquête relative aux moyens mis en œuvre par l'Etat pour lutter contre le terrorisme depuis le 7 janvier 2015",
    "titreChemin": "suivi_enquete_lutte_terrorisme"
  },
  "procedureParlementaire": {
    "code": "19",
    "libelle": "Rapport d'information sans mission"
  },
  "actesLegislatifs": [
    {
      "xsiType": "Etape_Type",
      "uid": "L14-AN20-35640",
      "codeActe": "AN20",
      "libelleActe": {
        "nomCanonique": "Travaux"
      },
      "organeRef": "PO644420",
      "actesLegislatifs": [
        {
          "xsiType": "DepotRapport_Type",
          "uid": "L14-VD181484",
          "codeActe": "AN20-RAPPORT",
          "libelleActe": {
            "nomCanonique": "Dépôt de rapport",
            "libelleCourt": "Dépôt de rapport"
          },
          "organeRef": "PO59051",
          "dateActe": "2017-02-21T00:00:00.000+01:00",
          "texteAssocieRef": "RINFANR5L14B4534"
        }
      ]
    }
  ]
}