{
  "xsiType": "rapportParlementaire_Type",
  "uid": "RAPPANR5L14B3495",
  "legislature": "14",
  "cycleDeVie": {
    "chrono": {
      "dateCreation": "2016-02-11T00:00:00.000+01:00",
      "dateDepot": "2016-02-11T00:00:00.000+01:00",
      "datePublication": "2016-02-15T00:00:00.000+01:00",
      "datePublicationWeb": "2016-02-12T20:10:00.000+01:00"
    }
  },
  "denominationStructurelle": "Rapport",
  "provenance": "Commission",
  "titres": {
    "titrePrincipal": "rapport sur   le projet de loi , adopté par le Sénat après engagement de la procédure accélérée, prorogeant l'application de la loi n° 55-385 du 3 avril 1955 relative à l'état d'urgence (n°3487)",
    "titrePrincipalCourt": "rapport sur   le projet de loi , adopté par le Sénat après engagement de la procédure accélérée, prorogeant l'application de la loi n° 55-385 du 3 avril 1955 relative à l'état d'urgence (n°3487)"
  },
  "dossierRef": "DLR5L14N34683",
  "classification": {
    "famille": {
      "depot": {
        "code": "RAPINIT",
        "libelle": "Rapport sur une initiative"
      },
      "classe": {
        "code": "RAPPORT",
        "libelle": "Rapport"
      }
    },
    "type": {
      "code": "RAPP",
      "libelle": "Rapport"
    },
    "statutAdoption": "ADOPTCOM"
  },
  "auteurs": [
    {
      "acteur": {
        "acteurRef": "PA610354",
        "qualite": "rapporteur"
      }
    },
    {
      "organeRef": "PO59051"
    }
  ],
  "notice": {
    "numNotice": "3495",
    "formule": "sur   le projet de loi , adopté par le Sénat après engagement de la procédure accélérée, prorogeant l'application de la loi n° 55-385 du 3 avril 1955 relative à l'état d'urgence (n°3487)",
    "adoptionConforme": false
  },
  "imprimerie": {
    "prix": "1.5"
  }
}