{
  "xsiType": "rapportParlementaire_Type",
  "uid": "RAPPANR5L14B1615",
  "legislature": "14",
  "cycleDeVie": {
    "chrono": {
      "dateCreation": "2013-12-05T00:00:00.000+01:00",
      "dateDepot": "2013-12-05T00:00:00.000+01:00",
      "datePublication": "2013-12-09T00:00:00.000+01:00",
      "datePublicationWeb": "2013-12-06T11:30:00.000+01:00"
    }
  },
  "denominationStructurelle": "Rapport",
  "provenance": "Commission",
  "titres": {
    "titrePrincipal": "rapport sur  les dispositions restant en discussion du projet de loi de finances pour 2014",
    "titrePrincipalCourt": "rapport sur  les dispositions restant en discussion du projet de loi de finances pour 2014"
  },
  "dossierRef": "DLR5L14N30653",
  "classification": {
    "famille": {
      "depot": {
        "code": "RAPINIT",
        "libelle": "Rapport sur une initiative"
      },
      "classe": {
        "code": "RAPPORT",
        "libelle": "Rapport"
      }
    },
    "type": {
      "code": "RAPP",
      "libelle": "Rapport"
    }
  },
  "auteurs": [
    {
      "acteur": {
        "acteurRef": "PA1243",
        "qualite": "rapporteur"
      }
    },
    {
      "organeRef": "PO698794"
    }
  ],
  "notice": {
    "numNotice": "1615",
    "formule": "de la commission mixte paritaire chargée de proposer un texte sur les dispositions restant en discussion du projet de loi de finances pour 2014",
    "adoptionConforme": false
  },
  "indexation": {
    "themes": {
      "@niveau": "1",
      "theme": {
        "libelleTheme": "DIVORCE"
      }
    }
  },
  "imprimerie": {
    "prix": "0.75"
  }
}