{
  "xsiType": "texteLoi_Type",
  "uid": "PIONANR5L14B1074",
  "legislature": "14",
  "cycleDeVie": {
    "chrono": {
      "dateCreation": "2013-05-22T00:00:00.000+02:00",
      "dateDepot": "2013-05-29T00:00:00.000+02:00",
      "datePublicationWeb": "2013-05-30T14:45:00.000+02:00"
    }
  },
  "denominationStructurelle": "Proposition de loi",
  "provenance": "Texte Déposé",
  "titres": {
    "titrePrincipal": "proposition de loi visant à renforcer la répression de la délinquance étrangère",
    "titrePrincipalCourt": "Renforcement de la répression de la délinquance étrangère"
  },
  "dossierRef": "DLR5L14N30318",
  "classification": {
    "famille": {
      "depot": {
        "code": "INITDEP",
        "libelle": "Initiative en 1er Dépôt"
      },
      "classe": {
        "code": "PIONLOI",
        "libelle": "Proposition de loi"
      }
    },
    "type": {
      "code": "PION",
      "libelle": "Proposition de loi"
    }
  },
  "auteurs": [
    {
      "acteur": {
        "acteurRef": "PA330240",
        "qualite": "auteur"
      }
    }
  ],
  "notice": {
    "numNotice": "1074",
    "formule": "visant à renforcer la répression de la délinquance étrangère",
    "adoptionConforme": false
  },
  "indexation": {
    "themes": {
      "@niveau": "1",
      "theme": {
        "libelleTheme": "SECURITE SOCIALE"
      }
    }
  },
  "coSignataires": [
    {
      "acteurRef": "PA1521",
      "dateCosignature": "2013-05-29+02:00",
      "edite": true
    },
    {
      "acteurRef": "PA267785",
      "dateCosignature": "2013-05-29+02:00",
      "edite": true
    }
  ],
  "depotAmendements": {
    "amendementsSeance": {
      "amendable": false
    },
    "amendementsCommission": [
      {
        "organeRef": "PO59051",
        "amendable": true
      }
    ]
  }
}