{
  "xsiType": "DossierMissionControle_Type",
  "uid": "DLR5L14N35654",
  "legislature": "14",
  "titreDossier": {
    "titre": "La situation migratoire en Europe",
    "titreChemin": "europe_situation_migratoire"
  },
  "procedureParlementaire": {
    "code": "19",
    "libelle": "Rapport d'information sans mission"
  },
  "actesLegislatifs": [
    {
      "xsiType": "Etape_Type",
      "uid": "L14-AN20-35654",
      "codeActe": "AN20",
      "libelleActe": {
        "nomCanonique": "Travaux"
      },
      "organeRef": "PO644420",
      "actesLegislatifs": [
        {
          "xsiType": "DepotRapport_Type",
          "uid": "L14-VD181513",
          "codeActe": "AN20-RAPPORT",
          "libelleActe": {
            "nomCanonique": "Dépôt de rapport",
            "libelleCourt": "Dépôt de rapport"
          },
          "organeRef": "PO59047",
          "dateActe": "2017-02-22T00:00:00.000+01:00",
          "texteAssocieRef": "RINFANR5L14B4551"
        }
      ]
    }
  ]
}