{
  "xsiType": "texteLoi_Type",
  "uid": "PIONANR5L14B1317",
  "legislature": "14",
  "cycleDeVie": {
    "chrono": {
      "dateCreation": "2013-07-22T00:00:00.000+02:00",
      "dateDepot": "2013-07-24T00:00:00.000+02:00",
      "datePublicationWeb": "2013-07-25T15:15:00.000+02:00"
    }
  },
  "denominationStructurelle": "Proposition de loi",
  "provenance": "Texte Déposé",
  "titres": {
    "titrePrincipal": "proposition de loi visant à créer une contribution climat-énergie",
    "titrePrincipalCourt": "Contribution climat-énergie"
  },
  "dossierRef": "DLR5L14N30913",
  "classification": {
    "famille": {
      "depot": {
        "code": "INITDEP",
        "libelle": "Initiative en 1er Dépôt"
      },
      "classe": {
        "code": "PIONLOI",
        "libelle": "Proposition de loi"
      }
    },
    "type": {
      "code": "PION",
      "libelle": "Proposition de loi"
    }
  },
  "auteurs": [
    {
      "acteur": {
        "acteurRef": "PA610002",
        "qualite": "auteur"
      }
    }
  ],
  "notice": {
    "numNotice": "1317",
    "formule": "visant à créer une contribution climat-énergie",
    "adoptionConforme": false
  },
  "coSignataires": [
    {
      "acteurRef": "PA332747",
      "dateCosignature": "2013-07-24+02:00",
      "edite": true
    },
    {
      "acteurRef": "PA609520",
      "dateCosignature": "2013-07-24+02:00",
      "edite": true
    },
    {
      "acteurRef": "PA609016",
      "dateCosignature": "2013-07-24+02:00",
      "edite": true
    },
    {
      "acteurRef": "PA608186",
      "dateCosignature": "2013-07-24+02:00",
      "edite": true
    },
    {
      "acteurRef": "PA605963",
      "dateCosignature": "2013-07-24+02:00",
      "edite": true
    },
    {
      "dateCosignature": "2013-07-24+02:00",
      "edite": false,
      "organe": {
        "organeRef": "PO656014",
        "etApparentes": false
      }
    }
  ],
  "depotAmendements": {
    "amendementsSeance": {
      "amendable": false
    },
    "amendementsCommission": [
      {
        "organeRef": "PO419610",
        "amendable": true
      }
    ]
  }
}