{
  "xsiType": "DossierLegislatif_Type",
  "uid": "DLR5L14N34499",
  "legislature": "14",
  "titreDossier": {
    "titre": "Police et sécurité : communication dématérialisée des décisions de minoration du solde de points du permis de conduire",
    "titreChemin": "ratification_ordonnance_2015-1241"
  },
  "procedureParlementaire": {
    "code": "1",
    "libelle": "Projet de loi ordinaire"
  },
  "initiateur": {
    "acteurs": [
      {
        "acteurRef": "PA267622",
        "mandatRef": "PM702957"
      },
      {
        "acteurRef": "PA785",
        "mandatRef": "PM702979"
      }
    ]
  },
  "actesLegislatifs": [
    {
      "xsiType": "Etape_Type",
      "uid": "L14-AN1-34499",
      "codeActe": "AN1",
      "libelleActe": {
        "nomCanonique": "1ère lecture (1ère assemblée saisie)",
        "libelleCourt": "1ère lecture"
      },
      "organeRef": "PO644420",
      "actesLegislatifs": [
        {
          "xsiType": "DepotInitiative_Type",
          "uid": "L14-VD176076DI",
          "codeActe": "AN1-DEPOT",
          "libelleActe": {
            "nomCanonique": "1er dépôt d'une initiative.",
            "libelleCourt": "1er dépôt d'une initiative."
          },
          "organeRef": "PO644420",
          "dateActe": "2015-12-02T00:00:00.000+01:00",
          "texteAssocieRef": "PRJLANR5L14B3297"
        },
        {
          "xsiType": "Etape_Type",
          "uid": "L14-AN1-COM-34499",
          "codeActe": "AN1-COM",
          "libelleActe": {
            "nomCanonique": "Travaux des commissions",
            "libelleCourt": "Travaux des commissions"
          },
          "organeRef": "PO644420",
          "actesLegislatifs": [
            {
              "xsiType": "Etape_Type",
              "uid": "L14-VD176077CF",
              "codeActe": "AN1-COM-FOND",
              "libelleActe": {
                "nomCanonique": "Travaux de la commission saisie au fond",
                "libelleCourt": "Travaux de la commission saisie au fond"
              },
              "organeRef": "PO59051",
              "actesLegislatifs": [
                {
                  "xsiType": "SaisieComFond_Type",
                  "uid": "L14-VD176077CFS",
                  "codeActe": "AN1-COM-FOND-SAISIE",
                  "libelleActe": {
                    "nomCanonique": "Renvoi en commission au fond",
                    "libelleCourt": "Renvoi en commission au fond"
                  },
                  "organeRef": "PO59051",
                  "dateActe": "2015-12-02T00:00:00.000+01:00"
                }
              ]
            }
          ]
        },
        {
          "xsiType": "RetraitInitiative_Type",
          "uid": "L14-VD181723",
          "codeActe": "AN1-RTRINI",
          "libelleActe": {
            "nomCanonique": "Retrait d'une initiative",
            "libelleCourt": "Retrait d'une initiative"
          },
          "organeRef": "PO644420",
          "dateActe": "2017-04-20T00:00:00.000+02:00",
          "texteAssocieRef": "PRJLANR5L14B3297"
        }
      ]
    }
  ],
  "fusionDossier": {
    "cause": "Examen commun",
    "dossierAbsorbantRef": "DLR5L14N35778"
  }
}