{
  "xsiType": "texteLoi_Type",
  "uid": "PRJLANR5L14BTC1653",
  "legislature": "14",
  "cycleDeVie": {
    "chrono": {
      "dateCreation": "2013-12-17T00:00:00.000+01:00",
      "dateDepot": "2013-12-17T00:00:00.000+01:00",
      "datePublication": "2013-12-18T00:00:00.000+01:00",
      "datePublicationWeb": "2013-12-17T11:20:00.000+01:00"
    }
  },
  "denominationStructurelle": "Projet de loi",
  "provenance": "Texte Déposé",
  "titres": {
    "titrePrincipal": "projet de loi sur   le projet de loi , modifié par le Sénat, habilitant le Gouvernement à simplifier et sécuriser la vie des entreprises (n°1617)",
    "titrePrincipalCourt": "Habilitation du Gouvernement à simplifier et sécuriser la vie des entreprises"
  },
  "dossierRef": "DLR5L14N31093",
  "classification": {
    "famille": {
      "depot": {
        "code": "INITNAV",
        "libelle": "Initiative en Navette"
      },
      "classe": {
        "code": "PRJLOI",
        "libelle": "Projet de loi"
      }
    },
    "type": {
      "code": "PRJL",
      "libelle": "Projet de loi"
    },
    "statutAdoption": "ADOPTCOM"
  },
  "auteurs": [
    {
      "acteur": {
        "acteurRef": "PA336439",
        "qualite": "rapporteur"
      }
    },
    {
      "organeRef": "PO59051"
    }
  ],
  "notice": {
    "numNotice": "1653",
    "formule": "sur   le projet de loi , modifié par le Sénat, habilitant le Gouvernement à simplifier et sécuriser la vie des entreprises (n°1617)",
    "adoptionConforme": false
  },
  "imprimerie": {
    "prix": "150.0"
  },
  "depotAmendements": {
    "amendementsSeance": {
      "amendable": true
    },
    "amendementsCommission": [
      {
        "organeRef": "PO59051",
        "amendable": true
      }
    ]
  }
}