{
  "xsiType": "texteLoi_Type",
  "uid": "PIONANR5L14B0961",
  "legislature": "14",
  "cycleDeVie": {
    "chrono": {
      "dateCreation": "2013-04-11T00:00:00.000+02:00",
      "dateDepot": "2013-04-17T00:00:00.000+02:00",
      "datePublicationWeb": "2013-04-18T18:15:00.000+02:00"
    }
  },
  "denominationStructurelle": "Proposition de loi",
  "provenance": "Texte Déposé",
  "titres": {
    "titrePrincipal": "proposition de loi relative à la transparence de la vie publique et à la prévention des conflits d'intérêts",
    "titrePrincipalCourt": "Transparence de la vie publique et prévention des conflits d'intérêts"
  },
  "dossierRef": "DLR5L14N30059",
  "classification": {
    "famille": {
      "depot": {
        "code": "INITDEP",
        "libelle": "Initiative en 1er Dépôt"
      },
      "classe": {
        "code": "PIONLOI",
        "libelle": "Proposition de loi"
      }
    },
    "type": {
      "code": "PION",
      "libelle": "Proposition de loi"
    }
  },
  "auteurs": [
    {
      "acteur": {
        "acteurRef": "PA332747",
        "qualite": "auteur"
      }
    }
  ],
  "notice": {
    "numNotice": "961",
    "formule": "relative à la transparence de la vie publique et à la prévention des conflits d'intérêts",
    "adoptionConforme": false
  },
  "indexation": {
    "themes": {
      "@niveau": "1",
      "theme": {
        "libelleTheme": "FEMMES"
      }
    }
  },
  "coSignataires": [
    {
      "acteurRef": "PA609520",
      "dateCosignature": "2013-04-17+02:00",
      "edite": false
    },
    {
      "acteurRef": "PA610427",
      "dateCosignature": "2013-04-17+02:00",
      "edite": false
    },
    {
      "acteurRef": "PA605963",
      "dateCosignature": "2013-04-17+02:00",
      "edite": false
    },
    {
      "acteurRef": "PA605922",
      "dateCosignature": "2013-04-17+02:00",
      "edite": false
    },
    {
      "acteurRef": "PA605625",
      "dateCosignature": "2013-04-17+02:00",
      "edite": false
    },
    {
      "acteurRef": "PA608186",
      "dateCosignature": "2013-04-17+02:00",
      "edite": false
    },
    {
      "acteurRef": "PA609016",
      "dateCosignature": "2013-04-17+02:00",
      "edite": false
    },
    {
      "acteurRef": "PA606258",
      "dateCosignature": "2013-04-17+02:00",
      "edite": false
    },
    {
      "acteurRef": "PA610860",
      "dateCosignature": "2013-04-17+02:00",
      "edite": false
    },
    {
      "acteurRef": "PA605518",
      "dateCosignature": "2013-04-17+02:00",
      "edite": false
    },
    {
      "acteurRef": "PA2045",
      "dateCosignature": "2013-04-17+02:00",
      "edite": false
    },
    {
      "acteurRef": "PA609816",
      "dateCosignature": "2013-04-17+02:00",
      "edite": false
    },
    {
      "acteurRef": "PA607619",
      "dateCosignature": "2013-04-17+02:00",
      "edite": false
    },
    {
      "acteurRef": "PA606545",
      "dateCosignature": "2013-04-17+02:00",
      "edite": false
    },
    {
      "acteurRef": "PA610002",
      "dateCosignature": "2013-04-17+02:00",
      "edite": false
    }
  ],
  "depotAmendements": {
    "amendementsSeance": {
      "amendable": false
    },
    "amendementsCommission": [
      {
        "organeRef": "PO59051",
        "amendable": true
      }
    ]
  }
}