{
  "xsiType": "documentEtudeImpact_Type",
  "uid": "ETDIANR5L14B2893",
  "legislature": "14",
  "cycleDeVie": {
    "chrono": {
      "dateCreation": "2015-06-24T00:00:00.000+02:00",
      "dateDepot": "2015-06-24T00:00:00.000+02:00",
      "datePublicationWeb": "2015-06-24T16:20:00.000+02:00"
    }
  },
  "denominationStructurelle": "Projet de loi",
  "provenance": "Texte Déposé",
  "titres": {
    "titrePrincipal": "Etude d'impact sur le projet de loi autorisant l'approbation du protocole entre le Gouvernement de la République française et le Conseil des ministres de Bosnie-Herzégovine portant sur l'application de l'accord du 18 septembre 2007 entre la Communauté européenne et la Bosnie-Herzégovine concernant la réadmission des personnes en séjour irrégulier",
    "titrePrincipalCourt": "Protocole France-Bosnie-Herzégovine sur la réadmission des personnes en séjour irrégulier"
  },
  "dossierRef": "DLR5L14N34065",
  "classification": {
    "famille": {
      "depot": {
        "code": "INITDEP",
        "libelle": "Initiative en 1er Dépôt"
      },
      "classe": {
        "code": "PRJLOI",
        "libelle": "Projet de loi"
      },
      "espece": {
        "code": "AUTRATCONV",
        "libelle": "autorisant la ratification d'une convention"
      }
    },
    "type": {
      "code": "ETDI",
      "libelle": "Etude d'impact"
    },
    "sousType": {
      "code": "AUTRATCONV",
      "libelle": "autorisant la ratification d'une convention",
      "libelleEdition": "autorisant la ratification d'une convention"
    }
  },
  "auteurs": [
    {
      "acteur": {
        "acteurRef": "PA267622",
        "qualite": "auteur"
      }
    }
  ],
  "notice": {
    "numNotice": "2893",
    "formule": "autorisant l'approbation du protocole entre le Gouvernement de la République française et le Conseil des ministres de Bosnie-Herzégovine portant sur l'application de l'accord du 18 septembre 2007 entre la Communauté européenne et la Bosnie-Herzégovine concernant la réadmission des personnes en séjour irrégulier",
    "adoptionConforme": false
  }
}