{
  "xsiType": "texteLoi_Type",
  "uid": "PIONANR5L14B0108",
  "legislature": "14",
  "cycleDeVie": {
    "chrono": {
      "dateCreation": "2012-07-06T00:00:00.000+02:00",
      "dateDepot": "2012-07-24T00:00:00.000+02:00",
      "datePublicationWeb": "2012-07-25T08:15:00.000+02:00"
    }
  },
  "denominationStructurelle": "Proposition de loi",
  "provenance": "Texte Déposé",
  "titres": {
    "titrePrincipal": "proposition de loi visant à n'accorder l'aide médicale d'Etat qu'en cas d'urgence sanitaire ou de risque épidémique",
    "titrePrincipalCourt": "limitation de l'aide médicale d'Etat aux urgences sanitaires et risques épidémiques"
  },
  "dossierRef": "DLR5L14N28891",
  "classification": {
    "famille": {
      "depot": {
        "code": "INITDEP",
        "libelle": "Initiative en 1er Dépôt"
      },
      "classe": {
        "code": "PIONLOI",
        "libelle": "Proposition de loi"
      }
    },
    "type": {
      "code": "PION",
      "libelle": "Proposition de loi"
    }
  },
  "auteurs": [
    {
      "acteur": {
        "acteurRef": "PA2048",
        "qualite": "auteur"
      }
    }
  ],
  "notice": {
    "numNotice": "108",
    "formule": "visant à n'accorder l'aide médicale d'Etat qu'en cas d'urgence sanitaire ou de risque épidémique",
    "adoptionConforme": false
  },
  "indexation": {
    "themes": {
      "@niveau": "1",
      "theme": {
        "libelleTheme": "BANQUES ET ETABLISSEMENTS FINANCIERS"
      }
    }
  },
  "imprimerie": {
    "prix": "0.75"
  },
  "depotAmendements": {
    "amendementsSeance": {
      "amendable": false
    },
    "amendementsCommission": [
      {
        "organeRef": "PO420120",
        "amendable": true
      }
    ]
  }
}