{
  "xsiType": "texteLoi_Type",
  "uid": "PIONANR5L14B4510",
  "legislature": "14",
  "cycleDeVie": {
    "chrono": {
      "dateCreation": "2017-02-13T00:00:00.000+01:00",
      "dateDepot": "2017-02-15T00:00:00.000+01:00",
      "datePublication": "2017-02-24T00:00:00.000+01:00",
      "datePublicationWeb": "2017-02-17T14:30:00.000+01:00"
    }
  },
  "denominationStructurelle": "Proposition de loi",
  "provenance": "Texte Déposé",
  "titres": {
    "titrePrincipal": "proposition de loi autorisant les personnes protégées de plus de quinze ans à effectuer un don volontaire de produits issus du corps humain",
    "titrePrincipalCourt": "personnes protégées de plus de quinze ans à effectuer un don volontaire de produits issus du corps humain"
  },
  "dossierRef": "DLR5L14N35582",
  "classification": {
    "famille": {
      "depot": {
        "code": "INITDEP",
        "libelle": "Initiative en 1er Dépôt"
      },
      "classe": {
        "code": "PIONLOI",
        "libelle": "Proposition de loi"
      }
    },
    "type": {
      "code": "PION",
      "libelle": "Proposition de loi"
    }
  },
  "auteurs": [
    {
      "acteur": {
        "acteurRef": "PA713448",
        "qualite": "auteur"
      }
    }
  ],
  "notice": {
    "numNotice": "4510",
    "formule": "autorisant les personnes protégées de plus de quinze ans à effectuer un don volontaire de produits issus du corps humain",
    "adoptionConforme": false
  },
  "coSignataires": [
    {
      "acteurRef": "PA267735",
      "dateCosignature": "2017-02-15+01:00",
      "edite": false
    },
    {
      "acteurRef": "PA223837",
      "dateCosignature": "2017-02-15+01:00",
      "edite": false
    },
    {
      "acteurRef": "PA267762",
      "dateCosignature": "2017-02-15+01:00",
      "edite": false
    },
    {
      "acteurRef": "PA1001",
      "dateCosignature": "2017-02-15+01:00",
      "edite": false
    },
    {
      "acteurRef": "PA2667",
      "dateCosignature": "2017-02-15+01:00",
      "edite": false
    },
    {
      "acteurRef": "PA2377",
      "dateCosignature": "2017-02-15+01:00",
      "edite": false
    },
    {
      "acteurRef": "PA1630",
      "dateCosignature": "2017-02-15+01:00",
      "edite": false
    },
    {
      "acteurRef": "PA687214",
      "dateCosignature": "2017-02-15+01:00",
      "edite": false
    },
    {
      "acteurRef": "PA266776",
      "dateCosignature": "2017-02-15+01:00",
      "edite": false
    },
    {
      "acteurRef": "PA267013",
      "dateCosignature": "2017-02-15+01:00",
      "edite": false
    },
    {
      "acteurRef": "PA1459",
      "dateCosignature": "2017-02-15+01:00",
      "edite": false
    },
    {
      "acteurRef": "PA267598",
      "dateCosignature": "2017-02-15+01:00",
      "edite": false
    }
  ],
  "depotAmendements": {
    "amendementsSeance": {
      "amendable": false
    },
    "amendementsCommission": [
      {
        "organeRef": "PO420120",
        "amendable": true
      }
    ]
  }
}