{
  "xsiType": "DossierLegislatif_Type",
  "uid": "DLR5L14N31132",
  "legislature": "14",
  "titreDossier": {
    "titre": "Traités et conventions : ratification du traité sur le commerce des armes",
    "titreChemin": "ratification_traite_commerce_armes",
    "senatChemin": "http://www.senat.fr/dossier-legislatif/pjl12-837.html"
  },
  "procedureParlementaire": {
    "code": "6",
    "libelle": "Projet de ratification des traités et conventions"
  },
  "initiateur": {
    "acteurs": [
      {
        "acteurRef": "PA328",
        "mandatRef": "PM653228"
      }
    ]
  },
  "actesLegislatifs": [
    {
      "xsiType": "Etape_Type",
      "uid": "L14-SN1-31132",
      "codeActe": "SN1",
      "libelleActe": {
        "nomCanonique": "1ère lecture (1ère assemblée saisie)",
        "libelleCourt": "1ère lecture"
      },
      "organeRef": "PO78718",
      "actesLegislatifs": [
        {
          "xsiType": "DepotInitiative_Type",
          "uid": "L14-VD165712DI",
          "codeActe": "SN1-DEPOT",
          "libelleActe": {
            "nomCanonique": "1er dépôt d'une initiative.",
            "libelleCourt": "1er dépôt d'une initiative."
          },
          "organeRef": "PO78718",
          "dateActe": "2013-09-11T00:00:00.000+02:00",
          "texteAssocieRef": "PRJLSNR5S199B0837"
        },
        {
          "xsiType": "EtudeImpact_Type",
          "uid": "L14-VD165712ETI",
          "codeActe": "SN1-ETI",
          "libelleActe": {
            "nomCanonique": "Etude d'impact",
            "libelleCourt": "Etude d'impact"
          },
          "organeRef": "PO78718",
          "dateActe": "2013-09-11T00:00:00.000+02:00",
          "contributionInternaute": {},
          "texteAssocieRef": "ETDISNR5S199B0837"
        },
        {
          "xsiType": "ProcedureAccelere_Type",
          "uid": "L14-VD165719",
          "codeActe": "SN1-PROCACC",
          "libelleActe": {
            "nomCanonique": "Le gouvernement déclare l'urgence / engage la procédure accélérée",
            "libelleCourt": "Le gouvernement déclare l'urgence / engage la procédure accélérée"
          },
          "organeRef": "PO653199",
          "dateActe": "2013-09-11T00:00:00.000+02:00"
        },
        {
          "xsiType": "Etape_Type",
          "uid": "L14-SN1-COM-31132",
          "codeActe": "SN1-COM",
          "libelleActe": {
            "nomCanonique": "Travaux des commissions",
            "libelleCourt": "Travaux des commissions"
          },
          "organeRef": "PO78718",
          "actesLegislatifs": [
            {
              "xsiType": "Etape_Type",
              "uid": "L14-VD165713CF",
              "codeActe": "SN1-COM-FOND",
              "libelleActe": {
                "nomCanonique": "Travaux de la commission saisie au fond",
                "libelleCourt": "Travaux de la commission saisie au fond"
              },
              "organeRef": "PO211491",
              "actesLegislatifs": [
                {
                  "xsiType": "SaisieComFond_Type",
                  "uid": "L14-VD165713CFS",
                  "codeActe": "SN1-COM-FOND-SAISIE",
                  "libelleActe": {
                    "nomCanonique": "Renvoi en commission au fond",
                    "libelleCourt": "Renvoi en commission au fond"
                  },
                  "organeRef": "PO211491",
                  "dateActe": "2013-09-11T00:00:00.000+02:00"
                },
                {
                  "xsiType": "NominRapporteurs_Type",
                  "uid": "L14-VD166174",
                  "codeActe": "SN1-COM-FOND-NOMIN",
                  "libelleActe": {
                    "nomCanonique": "Nomination de rapporteur",
                    "libelleCourt": "Nomination de rapporteur"
                  },
                  "organeRef": "PO211491",
                  "dateActe": "2013-09-11T00:00:00.000+02:00",
                  "rapporteurs": [
                    {
                      "acteurRef": "PA2528",
                      "typeRapporteur": "rapporteur"
                    }
                  ]
                },
                {
                  "xsiType": "DepotRapport_Type",
                  "uid": "L14-VD166175",
                  "codeActe": "SN1-COM-FOND-RAPPORT",
                  "libelleActe": {
                    "nomCanonique": "Dépôt de rapport",
                    "libelleCourt": "Dépôt de rapport"
                  },
                  "organeRef": "PO211491",
                  "dateActe": "2013-10-03T00:00:00.000+02:00",
                  "texteAssocieRef": "RAPPSNR5S219B0033"
                }
              ]
            }
          ]
        },
        {
          "xsiType": "Etape_Type",
          "uid": "L14-SN1-DEBATS-31132",
          "codeActe": "SN1-DEBATS",
          "libelleActe": {
            "nomCanonique": "Discussion en séance publique",
            "libelleCourt": "Discussion en séance publique"
          },
          "organeRef": "PO78718",
          "actesLegislatifs": [
            {
              "xsiType": "DiscussionSeancePublique_Type",
              "uid": "L14-VD165775S29092",
              "codeActe": "SN1-DEBATS-SEANCE",
              "libelleActe": {
                "nomCanonique": "Discussion en séance publique",
                "libelleCourt": "Discussion en séance publique"
              },
              "organeRef": "PO78718",
              "dateActe": "2013-10-08T00:00:00.000+02:00",
              "odjRef": "RUSNR5L14S2014IDS17632PT29092",
              "reunionRef": "RUSNR5L14S2014IDS17632"
            },
            {
              "xsiType": "Decision_Type",
              "uid": "L14-VD166251DEC",
              "codeActe": "SN1-DEBATS-DEC",
              "libelleActe": {
                "nomCanonique": "Décision",
                "libelleCourt": "Décision"
              },
              "organeRef": "PO78718",
              "dateActe": "2013-10-08T00:00:00.000+02:00",
              "reunionRef": "RUSNR5L14S2014IDS17632",
              "statutConclusion": {
                "famCode": "TSORTF01",
                "libelle": "adopté"
              },
              "textesAssocies": [
                {
                  "typeTexte": "BTA",
                  "texteAssocieRef": "PRJLSNR5S219BTA0008"
                }
              ]
            }
          ]
        }
      ]
    },
    {
      "xsiType": "Etape_Type",
      "uid": "L14-AN1-31132",
      "codeActe": "AN1",
      "libelleActe": {
        "nomCanonique": "1ère lecture (2ème assemblée saisie)",
        "libelleCourt": "1ère lecture"
      },
      "organeRef": "PO644420",
      "actesLegislatifs": [
        {
          "xsiType": "DepotInitiativeNavette_Type",
          "uid": "L14-VD166280DIN",
          "codeActe": "AN1-DEPOT",
          "libelleActe": {
            "nomCanonique": "Dépôt d'une initiative en navette",
            "libelleCourt": "Dépôt d'une initiative en navette"
          },
          "organeRef": "PO644420",
          "dateActe": "2013-10-09T00:00:00.000+02:00",
          "provenanceRef": "PO78718",
          "texteAssocieRef": "PRJLANR5L14B1420"
        },
        {
          "xsiType": "Etape_Type",
          "uid": "L14-AN1-COM-31132",
          "codeActe": "AN1-COM",
          "libelleActe": {
            "nomCanonique": "Travaux des commissions",
            "libelleCourt": "Travaux des commissions"
          },
          "organeRef": "PO644420",
          "actesLegislatifs": [
            {
              "xsiType": "Etape_Type",
              "uid": "L14-VD166281CF",
              "codeActe": "AN1-COM-FOND",
              "libelleActe": {
                "nomCanonique": "Travaux de la commission saisie au fond",
                "libelleCourt": "Travaux de la commission saisie au fond"
              },
              "organeRef": "PO59047",
              "actesLegislatifs": [
                {
                  "xsiType": "SaisieComFond_Type",
                  "uid": "L14-VD166281CFS",
                  "codeActe": "AN1-COM-FOND-SAISIE",
                  "libelleActe": {
                    "nomCanonique": "Renvoi en commission au fond",
                    "libelleCourt": "Renvoi en commission au fond"
                  },
                  "organeRef": "PO59047",
                  "dateActe": "2013-10-09T00:00:00.000+02:00"
                },
                {
                  "xsiType": "NominRapporteurs_Type",
                  "uid": "L14-VD167180",
                  "codeActe": "AN1-COM-FOND-NOMIN",
                  "libelleActe": {
                    "nomCanonique": "Nomination de rapporteur",
                    "libelleCourt": "Nomination de rapporteur"
                  },
                  "organeRef": "PO59047",
                  "dateActe": "2013-11-20T00:00:00.000+01:00",
                  "rapporteurs": [
                    {
                      "acteurRef": "PA609465",
                      "typeRapporteur": "rapporteur"
                    }
                  ]
                },
                {
                  "xsiType": "DiscussionCommission_Type",
                  "uid": "L14-VD167062R19443",
                  "codeActe": "AN1-COM-FOND-REUNION",
                  "libelleActe": {
                    "nomCanonique": "Réunion de commission",
                    "libelleCourt": "Réunion de commission"
                  },
                  "organeRef": "PO59047",
                  "dateActe": "2013-12-11T09:45:00.000+01:00"
                },
                {
                  "xsiType": "DepotRapport_Type",
                  "uid": "L14-VD167603",
                  "codeActe": "AN1-COM-FOND-RAPPORT",
                  "libelleActe": {
                    "nomCanonique": "Dépôt de rapport",
                    "libelleCourt": "Dépôt de rapport"
                  },
                  "organeRef": "PO59047",
                  "dateActe": "2013-12-11T00:00:00.000+01:00",
                  "texteAssocieRef": "RAPPANR5L14B1620"
                }
              ]
            },
            {
              "xsiType": "Etape_Type",
              "uid": "L14-VD166737CA",
              "codeActe": "AN1-COM-AVIS",
              "libelleActe": {
                "nomCanonique": "Travaux d'une commission saisie pour avis",
                "libelleCourt": "Travaux d'une commission saisie pour avis"
              },
              "organeRef": "PO59046",
              "actesLegislatifs": [
                {
                  "xsiType": "SaisieComAvis_Type",
                  "uid": "L14-VD166737CAS",
                  "codeActe": "AN1-COM-AVIS-SAISIE",
                  "libelleActe": {
                    "nomCanonique": "Saisine pour avis d'une commission",
                    "libelleCourt": "Saisine pour avis d'une commission"
                  },
                  "organeRef": "PO59046",
                  "dateActe": "2013-10-24T00:00:00.000+02:00"
                },
                {
                  "xsiType": "NominRapporteurs_Type",
                  "uid": "L14-VD167290",
                  "codeActe": "AN1-COM-AVIS-NOMIN",
                  "libelleActe": {
                    "nomCanonique": "Nomination de rapporteur",
                    "libelleCourt": "Nomination de rapporteur"
                  },
                  "organeRef": "PO59046",
                  "dateActe": "2013-11-26T00:00:00.000+01:00",
                  "rapporteurs": [
                    {
                      "acteurRef": "PA267954",
                      "typeRapporteur": "rapporteur pour avis"
                    }
                  ]
                },
                {
                  "xsiType": "DiscussionCommission_Type",
                  "uid": "L14-VD167062R19242",
                  "codeActe": "AN1-COM-AVIS-REUNION",
                  "libelleActe": {
                    "nomCanonique": "Réunion de commission",
                    "libelleCourt": "Réunion de commission"
                  },
                  "organeRef": "PO59046",
                  "dateActe": "2013-11-26T14:00:00.000+01:00",
                  "odjRef": "RUANR5L14S2014IDC419353PT19242",
                  "reunionRef": "RUANR5L14S2014IDC419353"
                },
                {
                  "xsiType": "DiscussionCommission_Type",
                  "uid": "L14-VD167062R19362",
                  "codeActe": "AN1-COM-AVIS-REUNION",
                  "libelleActe": {
                    "nomCanonique": "Réunion de commission",
                    "libelleCourt": "Réunion de commission"
                  },
                  "organeRef": "PO59046",
                  "dateActe": "2013-12-04T09:30:00.000+01:00",
                  "odjRef": "RUANR5L14S2014IDC419354PT19362",
                  "reunionRef": "RUANR5L14S2014IDC419354"
                },
                {
                  "xsiType": "DepotRapport_Type",
                  "uid": "L14-VD167446",
                  "codeActe": "AN1-COM-AVIS-RAPPORT",
                  "libelleActe": {
                    "nomCanonique": "Dépôt de rapport",
                    "libelleCourt": "Dépôt de rapport"
                  },
                  "organeRef": "PO59046",
                  "dateActe": "2013-12-04T00:00:00.000+01:00",
                  "texteAssocieRef": "AVISANR5L14B1601"
                }
              ]
            }
          ]
        },
        {
          "xsiType": "Etape_Type",
          "uid": "L14-AN1-DEBATS-31132",
          "codeActe": "AN1-DEBATS",
          "libelleActe": {
            "nomCanonique": "Discussion en séance publique",
            "libelleCourt": "Discussion en séance publique"
          },
          "organeRef": "PO644420",
          "actesLegislatifs": [
            {
              "xsiType": "DiscussionSeancePublique_Type",
              "uid": "L14-VD167112S29625",
              "codeActe": "AN1-DEBATS-SEANCE",
              "libelleActe": {
                "nomCanonique": "Discussion en séance publique",
                "libelleCourt": "Discussion en séance publique"
              },
              "organeRef": "PO644420",
              "dateActe": "2013-12-12T00:00:00.000+01:00",
              "odjRef": "RUANR5L14S2014IDS17952PT29625",
              "reunionRef": "RUANR5L14S2014IDS17952"
            },
            {
              "xsiType": "Decision_Type",
              "uid": "L14-VD167650DEC",
              "codeActe": "AN1-DEBATS-DEC",
              "libelleActe": {
                "nomCanonique": "Décision",
                "libelleCourt": "Décision"
              },
              "organeRef": "PO644420",
              "dateActe": "2013-12-12T00:00:00.000+01:00",
              "reunionRef": "RUANR5L14S2014IDS17952",
              "statutConclusion": {
                "famCode": "TSORTF03",
                "libelle": "adopté sans modification"
              },
              "textesAssocies": [
                {
                  "typeTexte": "BTA",
                  "texteAssocieRef": "PRJLANR5L14BTA0258"
                }
              ]
            }
          ]
        }
      ]
    },
    {
      "xsiType": "Etape_Type",
      "uid": "L14-PROM-31132",
      "codeActe": "PROM",
      "libelleActe": {
        "nomCanonique": "Promulgation de la loi",
        "libelleCourt": "Promulgation de la loi"
      },
      "organeRef": "PO696251",
      "actesLegislatifs": [
        {
          "xsiType": "Promulgation_Type",
          "uid": "L14-VD167999PL",
          "codeActe": "PROM-PUB",
          "libelleActe": {
            "nomCanonique": "Promulgation d'une loi",
            "libelleCourt": "Promulgation d'une loi"
          },
          "organeRef": "PO696251",
          "dateActe": "2013-12-23T00:00:00.000+01:00",
          "codeLoi": "2013-1202",
          "infoJo": {
            "typeJo": "JO_LOI_DECRET",
            "dateJo": "2013-12-24+01:00",
            "numJo": "298"
          },
          "referenceNor": "MAEJ1316909L",
          "texteLoiRef": "PRJLANR5L14BTA0258",
          "titreLoi": "autorisant la ratification du traité sur le commerce des armes",
          "urlLegifrance": "http://www.legifrance.gouv.fr/WAspad/UnTexteDeJorf?numjo=MAEJ1316909L"
        }
      ]
    }
  ]
}