{
  "xsiType": "rapportParlementaire_Type",
  "uid": "RAPPANR5L14B0972",
  "legislature": "14",
  "cycleDeVie": {
    "chrono": {
      "dateCreation": "2013-04-18T00:00:00.000+02:00",
      "dateDepot": "2013-04-18T00:00:00.000+02:00",
      "datePublication": "2013-04-24T00:00:00.000+02:00",
      "datePublicationWeb": "2013-04-22T18:30:00.000+02:00"
    }
  },
  "denominationStructurelle": "Rapport",
  "provenance": "Commission",
  "titres": {
    "titrePrincipal": "rapport sur la proposition de loi de M. Damien Abad et plusieurs de ses collègues relative à l'égalité des droits et à l'intégration des personnes en situation de handicap (516)",
    "titrePrincipalCourt": "rapport sur la proposition de loi de M. Damien Abad et plusieurs de ses collègues relative à l'égalité des droits et à l'intégration des personnes en situation de handicap (516)"
  },
  "dossierRef": "DLR5L14N29403",
  "classification": {
    "famille": {
      "depot": {
        "code": "RAPINIT",
        "libelle": "Rapport sur une initiative"
      },
      "classe": {
        "code": "RAPPORT",
        "libelle": "Rapport"
      }
    },
    "type": {
      "code": "RAPP",
      "libelle": "Rapport"
    }
  },
  "auteurs": [
    {
      "acteur": {
        "acteurRef": "PA605036",
        "qualite": "rapporteur"
      }
    },
    {
      "organeRef": "PO420120"
    }
  ],
  "notice": {
    "numNotice": "972",
    "formule": "sur la proposition de loi de M. Damien Abad et plusieurs de ses collègues relative à l'égalité des droits et à l'intégration des personnes en situation de handicap (516)",
    "adoptionConforme": false
  },
  "indexation": {
    "themes": {
      "@niveau": "1",
      "theme": {
        "libelleTheme": "DOM-TOM"
      }
    }
  },
  "imprimerie": {
    "prix": "1.5"
  }
}