{
  "xsiType": "DossierMissionControle_Type",
  "uid": "DLR5L14N30597",
  "legislature": "14",
  "titreDossier": {
    "titre": "Avis de la Commission européenne sur les programmes de stabilité et de réforme en France",
    "titreChemin": "reforme_France_avis_Commission_europeenne"
  },
  "procedureParlementaire": {
    "code": "19",
    "libelle": "Rapport d'information sans mission"
  },
  "actesLegislatifs": [
    {
      "xsiType": "Etape_Type",
      "uid": "L14-AN20-30597",
      "codeActe": "AN20",
      "libelleActe": {
        "nomCanonique": "Travaux"
      },
      "organeRef": "PO644420",
      "actesLegislatifs": [
        {
          "xsiType": "DepotRapport_Type",
          "uid": "L14-VD164561",
          "codeActe": "AN20-RAPPORT",
          "libelleActe": {
            "nomCanonique": "Dépôt de rapport",
            "libelleCourt": "Dépôt de rapport"
          },
          "organeRef": "PO415287",
          "dateActe": "2013-06-26T00:00:00.000+02:00",
          "texteAssocieRef": "RINFANR5L14B1203"
        }
      ]
    }
  ],
  "indexation": {
    "themes": {
      "@niveau": "1",
      "theme": {
        "libelleTheme": "SECURITE SOCIALE"
      }
    }
  }
}