{
  "xsiType": "texteLoi_Type",
  "uid": "PIONANR5L14B0330",
  "legislature": "14",
  "cycleDeVie": {
    "chrono": {
      "dateCreation": "2012-10-24T00:00:00.000+02:00",
      "dateDepot": "2012-10-24T00:00:00.000+02:00",
      "datePublication": "2012-12-06T00:00:00.000+01:00",
      "datePublicationWeb": "2012-11-13T11:00:00.000+01:00"
    }
  },
  "denominationStructurelle": "Proposition de loi",
  "provenance": "Texte Déposé",
  "titres": {
    "titrePrincipal": "proposition de loi visant à encadrer les grands passages et à simplifier la mise en oeuvre de la procédure d'évacuation forcée",
    "titrePrincipalCourt": "encadrement des grands passages et évacuation forcée"
  },
  "dossierRef": "DLR5L14N29252",
  "classification": {
    "famille": {
      "depot": {
        "code": "INITDEP",
        "libelle": "Initiative en 1er Dépôt"
      },
      "classe": {
        "code": "PIONLOI",
        "libelle": "Proposition de loi"
      }
    },
    "type": {
      "code": "PION",
      "libelle": "Proposition de loi"
    }
  },
  "auteurs": [
    {
      "acteur": {
        "acteurRef": "PA2492",
        "qualite": "auteur"
      }
    }
  ],
  "notice": {
    "numNotice": "330",
    "formule": "visant à encadrer les grands passages et à simplifier la mise en oeuvre de la procédure d'évacuation forcée",
    "adoptionConforme": false
  },
  "coSignataires": [
    {
      "acteurRef": "PA1012",
      "dateCosignature": "2012-10-24+02:00",
      "edite": true
    },
    {
      "acteurRef": "PA267551",
      "dateCosignature": "2012-10-24+02:00",
      "edite": true
    },
    {
      "acteurRef": "PA1695",
      "dateCosignature": "2012-10-24+02:00",
      "edite": false
    },
    {
      "acteurRef": "PA605036",
      "dateCosignature": "2012-10-24+02:00",
      "edite": false
    },
    {
      "acteurRef": "PA606888",
      "dateCosignature": "2012-10-24+02:00",
      "edite": false
    },
    {
      "acteurRef": "PA267075",
      "dateCosignature": "2012-10-24+02:00",
      "edite": false
    },
    {
      "acteurRef": "PA267576",
      "dateCosignature": "2012-10-24+02:00",
      "edite": false
    },
    {
      "acteurRef": "PA330008",
      "dateCosignature": "2012-10-24+02:00",
      "edite": false
    },
    {
      "acteurRef": "PA223837",
      "dateCosignature": "2012-10-24+02:00",
      "edite": false
    },
    {
      "acteurRef": "PA746",
      "dateCosignature": "2012-10-24+02:00",
      "edite": false
    },
    {
      "acteurRef": "PA267358",
      "dateCosignature": "2012-10-24+02:00",
      "edite": false
    },
    {
      "acteurRef": "PA267429",
      "dateCosignature": "2012-10-24+02:00",
      "edite": false
    },
    {
      "acteurRef": "PA267775",
      "dateCosignature": "2012-10-24+02:00",
      "edite": false
    },
    {
      "acteurRef": "PA923",
      "dateCosignature": "2012-10-24+02:00",
      "edite": false
    },
    {
      "acteurRef": "PA332523",
      "dateCosignature": "2012-10-24+02:00",
      "edite": false
    },
    {
      "acteurRef": "PA998",
      "dateCosignature": "2012-10-24+02:00",
      "edite": false
    },
    {
      "acteurRef": "PA267762",
      "dateCosignature": "2012-10-24+02:00",
      "edite": false
    },
    {
      "acteurRef": "PA267450",
      "dateCosignature": "2012-10-24+02:00",
      "edite": false
    },
    {
      "acteurRef": "PA267178",
      "dateCosignature": "2012-10-24+02:00",
      "edite": false
    },
    {
      "acteurRef": "PA1263",
      "dateCosignature": "2012-10-24+02:00",
      "edite": false
    },
    {
      "acteurRef": "PA334149",
      "dateCosignature": "2012-10-24+02:00",
      "edite": false
    },
    {
      "acteurRef": "PA266774",
      "dateCosignature": "2012-10-24+02:00",
      "edite": false
    },
    {
      "acteurRef": "PA267735",
      "dateCosignature": "2012-10-24+02:00",
      "edite": false
    },
    {
      "acteurRef": "PA605991",
      "dateCosignature": "2012-10-24+02:00",
      "edite": false
    },
    {
      "acteurRef": "PA267813",
      "dateCosignature": "2012-10-24+02:00",
      "edite": false
    },
    {
      "acteurRef": "PA1459",
      "dateCosignature": "2012-10-24+02:00",
      "edite": false
    },
    {
      "acteurRef": "PA1477",
      "dateCosignature": "2012-10-24+02:00",
      "edite": false
    },
    {
      "acteurRef": "PA1483",
      "dateCosignature": "2012-10-24+02:00",
      "edite": false
    },
    {
      "acteurRef": "PA267151",
      "dateCosignature": "2012-10-24+02:00",
      "edite": false
    },
    {
      "acteurRef": "PA1521",
      "dateCosignature": "2012-10-24+02:00",
      "edite": false
    },
    {
      "acteurRef": "PA1661",
      "dateCosignature": "2012-10-24+02:00",
      "edite": false
    },
    {
      "acteurRef": "PA609245",
      "dateCosignature": "2012-10-24+02:00",
      "edite": false
    },
    {
      "acteurRef": "PA1790",
      "dateCosignature": "2012-10-24+02:00",
      "edite": false
    },
    {
      "acteurRef": "PA1874",
      "dateCosignature": "2012-10-24+02:00",
      "edite": false
    },
    {
      "acteurRef": "PA607603",
      "dateCosignature": "2012-10-24+02:00",
      "edite": false
    },
    {
      "acteurRef": "PA608016",
      "dateCosignature": "2012-10-24+02:00",
      "edite": false
    },
    {
      "acteurRef": "PA267512",
      "dateCosignature": "2012-10-24+02:00",
      "edite": false
    },
    {
      "acteurRef": "PA2073",
      "dateCosignature": "2012-10-24+02:00",
      "edite": false
    },
    {
      "acteurRef": "PA606098",
      "dateCosignature": "2012-10-24+02:00",
      "edite": false
    },
    {
      "acteurRef": "PA2099",
      "dateCosignature": "2012-10-24+02:00",
      "edite": false
    },
    {
      "acteurRef": "PA2124",
      "dateCosignature": "2012-10-24+02:00",
      "edite": false
    },
    {
      "acteurRef": "PA609345",
      "dateCosignature": "2012-10-24+02:00",
      "edite": false
    },
    {
      "acteurRef": "PA334906",
      "dateCosignature": "2012-10-24+02:00",
      "edite": false
    },
    {
      "acteurRef": "PA2191",
      "dateCosignature": "2012-10-24+02:00",
      "edite": false
    },
    {
      "acteurRef": "PA2229",
      "dateCosignature": "2012-10-24+02:00",
      "edite": false
    },
    {
      "acteurRef": "PA266788",
      "dateCosignature": "2012-10-24+02:00",
      "edite": false
    },
    {
      "acteurRef": "PA606299",
      "dateCosignature": "2012-10-24+02:00",
      "edite": false
    },
    {
      "acteurRef": "PA2250",
      "dateCosignature": "2012-10-24+02:00",
      "edite": false
    },
    {
      "acteurRef": "PA2257",
      "dateCosignature": "2012-10-24+02:00",
      "edite": false
    },
    {
      "acteurRef": "PA344776",
      "dateCosignature": "2012-10-24+02:00",
      "edite": false
    },
    {
      "acteurRef": "PA2277",
      "dateCosignature": "2012-10-24+02:00",
      "edite": false
    },
    {
      "acteurRef": "PA2345",
      "dateCosignature": "2012-10-24+02:00",
      "edite": false
    },
    {
      "acteurRef": "PA2377",
      "dateCosignature": "2012-10-24+02:00",
      "edite": false
    },
    {
      "acteurRef": "PA267260",
      "dateCosignature": "2012-10-24+02:00",
      "edite": false
    },
    {
      "acteurRef": "PA267598",
      "dateCosignature": "2012-10-24+02:00",
      "edite": false
    },
    {
      "acteurRef": "PA267527",
      "dateCosignature": "2012-10-24+02:00",
      "edite": false
    },
    {
      "acteurRef": "PA2664",
      "dateCosignature": "2012-10-24+02:00",
      "edite": false
    },
    {
      "acteurRef": "PA344492",
      "dateCosignature": "2012-10-24+02:00",
      "edite": false
    },
    {
      "acteurRef": "PA334654",
      "dateCosignature": "2012-10-24+02:00",
      "edite": false
    },
    {
      "acteurRef": "PA608434",
      "dateCosignature": "2012-10-24+02:00",
      "edite": false
    },
    {
      "acteurRef": "PA335159",
      "dateCosignature": "2012-10-24+02:00",
      "edite": false
    },
    {
      "acteurRef": "PA2796",
      "dateCosignature": "2012-10-24+02:00",
      "edite": false
    },
    {
      "acteurRef": "PA2801",
      "dateCosignature": "2012-10-24+02:00",
      "edite": false
    },
    {
      "acteurRef": "PA609442",
      "dateCosignature": "2012-10-24+02:00",
      "edite": false
    },
    {
      "acteurRef": "PA334843",
      "dateCosignature": "2012-10-24+02:00",
      "edite": false
    },
    {
      "acteurRef": "PA2907",
      "dateCosignature": "2012-10-24+02:00",
      "edite": false
    },
    {
      "acteurRef": "PA607090",
      "dateCosignature": "2012-10-24+02:00",
      "edite": false
    },
    {
      "acteurRef": "PA267506",
      "dateCosignature": "2012-10-24+02:00",
      "edite": false
    },
    {
      "acteurRef": "PA2936",
      "dateCosignature": "2012-10-24+02:00",
      "edite": false
    },
    {
      "acteurRef": "PA267822",
      "dateCosignature": "2012-11-13+01:00",
      "edite": false
    },
    {
      "acteurRef": "PA343623",
      "dateCosignature": "2012-11-13+01:00",
      "edite": false
    },
    {
      "acteurRef": "PA266797",
      "dateCosignature": "2012-11-16+01:00",
      "edite": false
    },
    {
      "acteurRef": "PA267246",
      "dateCosignature": "2012-11-22+01:00",
      "edite": false
    }
  ],
  "depotAmendements": {
    "amendementsSeance": {
      "amendable": true
    },
    "amendementsCommission": [
      {
        "organeRef": "PO59051",
        "amendable": true
      }
    ]
  }
}