{
  "xsiType": "texteLoi_Type",
  "uid": "PIONANR5L14B3613",
  "legislature": "14",
  "cycleDeVie": {
    "chrono": {
      "dateCreation": "2016-03-29T00:00:00.000+02:00",
      "dateDepot": "2016-03-29T00:00:00.000+02:00",
      "datePublication": "2016-04-05T00:00:00.000+02:00",
      "datePublicationWeb": "2016-03-30T11:40:00.000+02:00"
    }
  },
  "denominationStructurelle": "Proposition de loi",
  "provenance": "Texte Déposé",
  "titres": {
    "titrePrincipal": "proposition de loi relative à l'avenir des ouvriers d'Etat",
    "titrePrincipalCourt": "avenir ouvriers d'Etat"
  },
  "dossierRef": "DLR5L14N34809",
  "classification": {
    "famille": {
      "depot": {
        "code": "INITDEP",
        "libelle": "Initiative en 1er Dépôt"
      },
      "classe": {
        "code": "PIONLOI",
        "libelle": "Proposition de loi"
      }
    },
    "type": {
      "code": "PION",
      "libelle": "Proposition de loi"
    }
  },
  "auteurs": [
    {
      "acteur": {
        "acteurRef": "PA267306",
        "qualite": "auteur"
      }
    }
  ],
  "notice": {
    "numNotice": "3613",
    "formule": "relative à l'avenir des ouvriers d'Etat",
    "adoptionConforme": false
  },
  "coSignataires": [
    {
      "acteurRef": "PA295",
      "dateCosignature": "2016-03-29+02:00",
      "edite": false
    },
    {
      "acteurRef": "PA551",
      "dateCosignature": "2016-03-29+02:00",
      "edite": false
    },
    {
      "acteurRef": "PA689",
      "dateCosignature": "2016-03-29+02:00",
      "edite": false
    },
    {
      "acteurRef": "PA267492",
      "dateCosignature": "2016-03-29+02:00",
      "edite": false
    },
    {
      "acteurRef": "PA754",
      "dateCosignature": "2016-03-29+02:00",
      "edite": false
    },
    {
      "acteurRef": "PA340755",
      "dateCosignature": "2016-03-29+02:00",
      "edite": false
    },
    {
      "acteurRef": "PA1141",
      "dateCosignature": "2016-03-29+02:00",
      "edite": false
    },
    {
      "acteurRef": "PA1364",
      "dateCosignature": "2016-03-29+02:00",
      "edite": false
    },
    {
      "acteurRef": "PA605745",
      "dateCosignature": "2016-03-29+02:00",
      "edite": false
    }
  ],
  "depotAmendements": {
    "amendementsSeance": {
      "amendable": false
    },
    "amendementsCommission": [
      {
        "organeRef": "PO59051",
        "amendable": true
      }
    ]
  }
}