{
  "xsiType": "documentEtudeImpact_Type",
  "uid": "ETDIANR5L14B1163",
  "legislature": "14",
  "cycleDeVie": {
    "chrono": {
      "dateCreation": "2013-06-19T00:00:00.000+02:00",
      "dateDepot": "2013-06-19T00:00:00.000+02:00",
      "datePublication": "2015-06-25T00:00:00.000+02:00",
      "datePublicationWeb": "2013-06-20T17:00:00.000+02:00"
    }
  },
  "denominationStructurelle": "Projet de loi",
  "provenance": "Texte Déposé",
  "titres": {
    "titrePrincipal": "Etude d'impact sur le projet de loi autorisant la ratification de l'accord de partenariat économique d'étape entre la Côte d'Ivoire, d'une part, et la Communauté européenne et ses Etats membres, d'autre part",
    "titrePrincipalCourt": "accord de partenariat économique d'étape entre la Côte d'Ivoire et la Communauté européenne"
  },
  "dossierRef": "DLR5L14N30556",
  "classification": {
    "famille": {
      "depot": {
        "code": "INITDEP",
        "libelle": "Initiative en 1er Dépôt"
      },
      "classe": {
        "code": "PRJLOI",
        "libelle": "Projet de loi"
      },
      "espece": {
        "code": "AUTRATCONV",
        "libelle": "autorisant la ratification d'une convention"
      }
    },
    "type": {
      "code": "ETDI",
      "libelle": "Etude d'impact"
    },
    "sousType": {
      "code": "AUTRATCONV",
      "libelle": "autorisant la ratification d'une convention",
      "libelleEdition": "autorisant la ratification d'une convention"
    }
  },
  "auteurs": [
    {
      "acteur": {
        "acteurRef": "PA328",
        "qualite": "auteur"
      }
    }
  ],
  "notice": {
    "numNotice": "1163",
    "formule": "autorisant la ratification de l'accord de partenariat économique d'étape entre la Côte d'Ivoire, d'une part, et la Communauté européenne et ses Etats membres, d'autre part",
    "adoptionConforme": false
  },
  "indexation": {
    "themes": {
      "@niveau": "1",
      "theme": {
        "libelleTheme": "SECURITE SOCIALE"
      }
    }
  }
}