{
  "xsiType": "texteLoi_Type",
  "uid": "PIONANR5L14B0456",
  "legislature": "14",
  "cycleDeVie": {
    "chrono": {
      "dateCreation": "2012-11-26T00:00:00.000+01:00",
      "dateDepot": "2012-11-27T00:00:00.000+01:00",
      "datePublicationWeb": "2012-11-28T17:30:00.000+01:00"
    }
  },
  "denominationStructurelle": "Proposition de loi",
  "provenance": "Texte Déposé",
  "titres": {
    "titrePrincipal": "proposition de loi relative à la conservation pendant trente ans des objets placés sous main de justice",
    "titrePrincipalCourt": "conservation des objets placés sous main de justice"
  },
  "dossierRef": "DLR5L14N29372",
  "classification": {
    "famille": {
      "depot": {
        "code": "INITDEP",
        "libelle": "Initiative en 1er Dépôt"
      },
      "classe": {
        "code": "PIONLOI",
        "libelle": "Proposition de loi"
      }
    },
    "type": {
      "code": "PION",
      "libelle": "Proposition de loi"
    }
  },
  "auteurs": [
    {
      "acteur": {
        "acteurRef": "PA2277",
        "qualite": "auteur"
      }
    }
  ],
  "notice": {
    "numNotice": "456",
    "formule": "relative à la conservation pendant trente ans des objets placés sous main de justice",
    "adoptionConforme": false
  },
  "coSignataires": [
    {
      "acteurRef": "PA314",
      "dateCosignature": "2012-11-27+01:00",
      "edite": false
    },
    {
      "acteurRef": "PA267576",
      "dateCosignature": "2012-11-27+01:00",
      "edite": false
    },
    {
      "acteurRef": "PA607846",
      "dateCosignature": "2012-11-27+01:00",
      "edite": false
    },
    {
      "acteurRef": "PA267762",
      "dateCosignature": "2012-11-27+01:00",
      "edite": false
    },
    {
      "acteurRef": "PA266774",
      "dateCosignature": "2012-11-27+01:00",
      "edite": false
    },
    {
      "acteurRef": "PA331146",
      "dateCosignature": "2012-11-27+01:00",
      "edite": false
    },
    {
      "acteurRef": "PA267813",
      "dateCosignature": "2012-11-27+01:00",
      "edite": false
    },
    {
      "acteurRef": "PA331567",
      "dateCosignature": "2012-11-27+01:00",
      "edite": false
    },
    {
      "acteurRef": "PA1874",
      "dateCosignature": "2012-11-27+01:00",
      "edite": false
    },
    {
      "acteurRef": "PA267317",
      "dateCosignature": "2012-11-27+01:00",
      "edite": false
    },
    {
      "acteurRef": "PA2124",
      "dateCosignature": "2012-11-27+01:00",
      "edite": false
    },
    {
      "acteurRef": "PA266788",
      "dateCosignature": "2012-11-27+01:00",
      "edite": false
    },
    {
      "acteurRef": "PA2377",
      "dateCosignature": "2012-11-27+01:00",
      "edite": false
    },
    {
      "acteurRef": "PA2664",
      "dateCosignature": "2012-11-27+01:00",
      "edite": false
    },
    {
      "acteurRef": "PA608434",
      "dateCosignature": "2012-11-27+01:00",
      "edite": false
    },
    {
      "acteurRef": "PA2792",
      "dateCosignature": "2012-11-27+01:00",
      "edite": false
    },
    {
      "acteurRef": "PA607090",
      "dateCosignature": "2012-11-27+01:00",
      "edite": false
    },
    {
      "acteurRef": "PA2936",
      "dateCosignature": "2012-11-27+01:00",
      "edite": false
    }
  ],
  "depotAmendements": {
    "amendementsSeance": {
      "amendable": false
    },
    "amendementsCommission": [
      {
        "organeRef": "PO59051",
        "amendable": true
      }
    ]
  }
}