{
  "xsiType": "rapportParlementaire_Type",
  "uid": "RAPPANR5L14B3675",
  "legislature": "14",
  "cycleDeVie": {
    "chrono": {
      "dateCreation": "2016-04-07T00:00:00.000+02:00",
      "dateDepot": "2016-04-07T00:00:00.000+02:00",
      "datePublication": "2016-04-18T00:00:00.000+02:00",
      "datePublicationWeb": "2016-04-14T16:00:00.000+02:00"
    }
  },
  "denominationStructurelle": "Rapport",
  "provenance": "Commission",
  "titres": {
    "titrePrincipal": "rapport sur le projet de loi, après engagement de la procédure accélérée, visant à instituer de nouvelles libertés et de nouvelles protections pour les entreprises et les actifs (n°3600).",
    "titrePrincipalCourt": "rapport sur le projet de loi, après engagement de la procédure accélérée, visant à instituer de nouvelles libertés et de nouvelles protections pour les entreprises et les actifs (n°3600)."
  },
  "divisions": [
    {
      "xsiType": "rapportParlementaire_Type",
      "uid": "RAPPANR5L14B3675-a1",
      "legislature": "14",
      "cycleDeVie": {
        "chrono": {
          "dateCreation": "2016-04-07T00:00:00.000+02:00",
          "dateDepot": "2016-04-07T00:00:00.000+02:00",
          "datePublicationWeb": "2016-04-15T15:45:00.000+02:00"
        }
      },
      "denominationStructurelle": "Annexe 1",
      "titres": {
        "titrePrincipal": "Tableau comparatif",
        "titrePrincipalCourt": "Tableau comparatif"
      },
      "dossierRef": "DLR5L14N34783",
      "classification": {
        "type": {
          "code": "RAPP",
          "libelle": "Rapport"
        },
        "statutAdoption": "ADOPTCOM"
      },
      "auteurs": [
        {
          "acteur": {
            "acteurRef": "PA335017",
            "qualite": "rapporteur"
          }
        },
        {
          "organeRef": "PO420120"
        }
      ],
      "notice": {
        "numNotice": "3675",
        "formule": "sur le projet de loi, après engagement de la procédure accélérée, visant à instituer de nouvelles libertés et de nouvelles protections pour les entreprises et les actifs (n°3600).",
        "adoptionConforme": false
      }
    }
  ],
  "dossierRef": "DLR5L14N34783",
  "classification": {
    "famille": {
      "depot": {
        "code": "RAPINIT",
        "libelle": "Rapport sur une initiative"
      },
      "classe": {
        "code": "RAPPORT",
        "libelle": "Rapport"
      }
    },
    "type": {
      "code": "RAPP",
      "libelle": "Rapport"
    },
    "statutAdoption": "ADOPTCOM"
  },
  "auteurs": [
    {
      "acteur": {
        "acteurRef": "PA335017",
        "qualite": "rapporteur"
      }
    },
    {
      "organeRef": "PO420120"
    }
  ],
  "notice": {
    "numNotice": "3675",
    "formule": "sur le projet de loi, après engagement de la procédure accélérée, visant à instituer de nouvelles libertés et de nouvelles protections pour les entreprises et les actifs (n°3600).",
    "adoptionConforme": false
  },
  "imprimerie": {
    "prix": "14.0"
  }
}