{
  "xsiType": "texteLoi_Type",
  "uid": "RINFANR5L14B2926",
  "legislature": "14",
  "cycleDeVie": {
    "chrono": {
      "dateCreation": "2015-07-01T00:00:00.000+02:00",
      "dateDepot": "2015-07-01T00:00:00.000+02:00"
    }
  },
  "denominationStructurelle": "Rapport d'information",
  "provenance": "Commission",
  "titres": {
    "titrePrincipal": "rapport d'information déposé par la commission des affaires européennes sur la validation de l'apprentissage non formel et informel",
    "titrePrincipalCourt": "rapport d'information déposé par la commission des affaires européennes sur la validation de l'apprentissage non formel et informel"
  },
  "dossierRef": "DLR5L14N34083",
  "classification": {
    "famille": {
      "depot": {
        "code": "RAPAUT",
        "libelle": "Rapport autonome"
      },
      "classe": {
        "code": "RAPINF",
        "libelle": "Rapport d'information"
      },
      "espece": {
        "code": "AUE",
        "libelle": "sur des actes de l'Union européenne"
      }
    },
    "type": {
      "code": "RINF",
      "libelle": "Rapport d'information"
    },
    "sousType": {
      "code": "AUE",
      "libelle": "sur des actes de l'Union européenne"
    }
  },
  "auteurs": [
    {
      "acteur": {
        "acteurRef": "PA606412",
        "qualite": "rapporteur"
      }
    },
    {
      "organeRef": "PO415287"
    }
  ],
  "notice": {
    "numNotice": "2926",
    "formule": "déposé par la commission des affaires européennes sur la validation de l'apprentissage non formel et informel",
    "adoptionConforme": false
  }
}