{
  "xsiType": "texteLoi_Type",
  "uid": "AVISANR5L14B3247",
  "legislature": "14",
  "cycleDeVie": {
    "chrono": {
      "dateCreation": "2015-11-24T00:00:00.000+01:00",
      "dateDepot": "2015-11-24T00:00:00.000+01:00",
      "datePublication": "2015-11-30T00:00:00.000+01:00",
      "datePublicationWeb": "2015-11-27T11:30:00.000+01:00"
    }
  },
  "denominationStructurelle": "Avis",
  "provenance": "Commission",
  "titres": {
    "titrePrincipal": "avis sur le projet de loi de finances rectificative  pour 2015 (n°3217)",
    "titrePrincipalCourt": "avis sur le projet de loi de finances rectificative  pour 2015 (n°3217)"
  },
  "dossierRef": "DLR5L14N34429",
  "classification": {
    "famille": {
      "depot": {
        "code": "RAPINIT",
        "libelle": "Rapport sur une initiative"
      },
      "classe": {
        "code": "AVIS",
        "libelle": "Avis"
      }
    },
    "type": {
      "code": "AVIS",
      "libelle": "Avis"
    }
  },
  "auteurs": [
    {
      "acteur": {
        "acteurRef": "PA608778",
        "qualite": "rapporteur pour avis"
      }
    },
    {
      "organeRef": "PO419610"
    }
  ],
  "notice": {
    "numNotice": "3247",
    "formule": "sur le projet de loi de finances rectificative  pour 2015 (n°3217)",
    "adoptionConforme": false
  },
  "imprimerie": {
    "prix": "0.75"
  }
}