{
  "xsiType": "texteLoi_Type",
  "uid": "PIONANR5L14B0609",
  "legislature": "14",
  "cycleDeVie": {
    "chrono": {
      "dateCreation": "2012-12-19T00:00:00.000+01:00",
      "dateDepot": "2013-01-16T00:00:00.000+01:00",
      "datePublicationWeb": "2013-01-17T17:30:00.000+01:00"
    }
  },
  "denominationStructurelle": "Proposition de loi",
  "provenance": "Texte Déposé",
  "titres": {
    "titrePrincipal": "proposition de loi visant à assujettir les billets d'entrée dans les parcs de loisirs au taux réduit de taxe sur la valeur ajoutée",
    "titrePrincipalCourt": "taux réduit de TVA pour les parcs de loisirs"
  },
  "dossierRef": "DLR5L14N29537",
  "classification": {
    "famille": {
      "depot": {
        "code": "INITDEP",
        "libelle": "Initiative en 1er Dépôt"
      },
      "classe": {
        "code": "PIONLOI",
        "libelle": "Proposition de loi"
      }
    },
    "type": {
      "code": "PION",
      "libelle": "Proposition de loi"
    }
  },
  "auteurs": [
    {
      "acteur": {
        "acteurRef": "PA1874",
        "qualite": "auteur"
      }
    }
  ],
  "notice": {
    "numNotice": "609",
    "formule": "visant à assujettir les billets d'entrée dans les parcs de loisirs au taux réduit de taxe sur la valeur ajoutée",
    "adoptionConforme": false
  },
  "indexation": {
    "themes": {
      "@niveau": "1",
      "theme": {
        "libelleTheme": "LOIS DE FINANCES RECTIFICATIVES"
      }
    }
  },
  "coSignataires": [
    {
      "acteurRef": "PA267822",
      "dateCosignature": "2013-01-16+01:00",
      "edite": false
    },
    {
      "acteurRef": "PA267429",
      "dateCosignature": "2013-01-16+01:00",
      "edite": false
    },
    {
      "acteurRef": "PA267775",
      "dateCosignature": "2013-01-16+01:00",
      "edite": false
    },
    {
      "acteurRef": "PA951",
      "dateCosignature": "2013-01-16+01:00",
      "edite": false
    },
    {
      "acteurRef": "PA998",
      "dateCosignature": "2013-01-16+01:00",
      "edite": false
    },
    {
      "acteurRef": "PA267762",
      "dateCosignature": "2013-01-16+01:00",
      "edite": false
    },
    {
      "acteurRef": "PA334149",
      "dateCosignature": "2013-01-16+01:00",
      "edite": false
    },
    {
      "acteurRef": "PA336576",
      "dateCosignature": "2013-01-16+01:00",
      "edite": false
    },
    {
      "acteurRef": "PA606478",
      "dateCosignature": "2013-01-16+01:00",
      "edite": false
    },
    {
      "acteurRef": "PA267735",
      "dateCosignature": "2013-01-16+01:00",
      "edite": false
    },
    {
      "acteurRef": "PA1630",
      "dateCosignature": "2013-01-16+01:00",
      "edite": false
    },
    {
      "acteurRef": "PA267785",
      "dateCosignature": "2013-01-16+01:00",
      "edite": false
    },
    {
      "acteurRef": "PA1857",
      "dateCosignature": "2013-01-16+01:00",
      "edite": false
    },
    {
      "acteurRef": "PA267317",
      "dateCosignature": "2013-01-16+01:00",
      "edite": false
    },
    {
      "acteurRef": "PA607603",
      "dateCosignature": "2013-01-16+01:00",
      "edite": false
    },
    {
      "acteurRef": "PA608016",
      "dateCosignature": "2013-01-16+01:00",
      "edite": false
    },
    {
      "acteurRef": "PA2073",
      "dateCosignature": "2013-01-16+01:00",
      "edite": false
    },
    {
      "acteurRef": "PA2086",
      "dateCosignature": "2013-01-16+01:00",
      "edite": false
    },
    {
      "acteurRef": "PA2099",
      "dateCosignature": "2013-01-16+01:00",
      "edite": false
    },
    {
      "acteurRef": "PA267556",
      "dateCosignature": "2013-01-16+01:00",
      "edite": false
    },
    {
      "acteurRef": "PA2124",
      "dateCosignature": "2013-01-16+01:00",
      "edite": false
    },
    {
      "acteurRef": "PA606299",
      "dateCosignature": "2013-01-16+01:00",
      "edite": false
    },
    {
      "acteurRef": "PA2257",
      "dateCosignature": "2013-01-16+01:00",
      "edite": false
    },
    {
      "acteurRef": "PA344776",
      "dateCosignature": "2013-01-16+01:00",
      "edite": false
    },
    {
      "acteurRef": "PA2377",
      "dateCosignature": "2013-01-16+01:00",
      "edite": false
    },
    {
      "acteurRef": "PA2492",
      "dateCosignature": "2013-01-16+01:00",
      "edite": false
    },
    {
      "acteurRef": "PA344492",
      "dateCosignature": "2013-01-16+01:00",
      "edite": false
    },
    {
      "acteurRef": "PA334654",
      "dateCosignature": "2013-01-16+01:00",
      "edite": false
    },
    {
      "acteurRef": "PA2775",
      "dateCosignature": "2013-01-16+01:00",
      "edite": false
    },
    {
      "acteurRef": "PA2792",
      "dateCosignature": "2013-01-16+01:00",
      "edite": false
    },
    {
      "acteurRef": "PA334843",
      "dateCosignature": "2013-01-16+01:00",
      "edite": false
    },
    {
      "acteurRef": "PA2936",
      "dateCosignature": "2013-01-16+01:00",
      "edite": false
    },
    {
      "acteurRef": "PA309643",
      "dateCosignature": "2013-03-01+01:00",
      "edite": false
    }
  ],
  "depotAmendements": {
    "amendementsSeance": {
      "amendable": false
    },
    "amendementsCommission": [
      {
        "organeRef": "PO419604",
        "amendable": true
      }
    ]
  }
}