{
  "xsiType": "texteLoi_Type",
  "uid": "RINFANR5L14B2103",
  "legislature": "14",
  "cycleDeVie": {
    "chrono": {
      "dateCreation": "2014-07-08T00:00:00.000+02:00",
      "dateDepot": "2014-07-08T00:00:00.000+02:00",
      "datePublication": "2014-07-11T00:00:00.000+02:00",
      "datePublicationWeb": "2014-07-09T15:30:00.000+02:00"
    }
  },
  "denominationStructurelle": "Rapport d'information",
  "provenance": "Commission",
  "titres": {
    "titrePrincipal": "rapport d'information déposé en application de l'article 145 du règlement, par la commission des finances, de l'économie générale et du contrôle budgétaire préalable au débat d'orientation des finances publiques",
    "titrePrincipalCourt": "rapport d'information déposé en application de l'article 145 du règlement, par la commission des finances, de l'économie générale et du contrôle budgétaire préalable au débat d'orientation des finances publiques"
  },
  "dossierRef": "DLR5L14N33296",
  "classification": {
    "famille": {
      "depot": {
        "code": "RAPAUT",
        "libelle": "Rapport autonome"
      },
      "classe": {
        "code": "RAPINF",
        "libelle": "Rapport d'information"
      },
      "espece": {
        "code": "PRPDIT",
        "libelle": "tel quel"
      }
    },
    "type": {
      "code": "RINF",
      "libelle": "Rapport d'information"
    },
    "sousType": {
      "code": "PRPDIT",
      "libelle": "tel quel"
    }
  },
  "auteurs": [
    {
      "acteur": {
        "acteurRef": "PA609590",
        "qualite": "rapporteur"
      }
    },
    {
      "organeRef": "PO59048"
    }
  ],
  "notice": {
    "numNotice": "2103",
    "formule": "déposé en application de l'article 145 du règlement, par la commission des finances, de l'économie générale et du contrôle budgétaire préalable au débat d'orientation des finances publiques",
    "adoptionConforme": false
  },
  "imprimerie": {
    "prix": "3.5"
  }
}