{
  "xsiType": "rapportParlementaire_Type",
  "uid": "RAPPSNR5S219B0769",
  "cycleDeVie": {
    "chrono": {
      "dateCreation": "2014-10-14T00:00:00.000+02:00",
      "dateDepot": "2014-07-23T00:00:00.000+02:00"
    }
  },
  "denominationStructurelle": "Rapport",
  "provenance": "Commission",
  "titres": {
    "titrePrincipal": "rapport sur le projet de loi , après engagement de la procédure accélérée, relatif à la désignation des conseillers prud'hommes  , (n°423 et lettre rectificative n°, 739)",
    "titrePrincipalCourt": "rapport sur le projet de loi , après engagement de la procédure accélérée, relatif à la désignation des conseillers prud'hommes  , (n°423 et lettre rectificative n°, 739)"
  },
  "dossierRef": "DLR5L14N33488",
  "classification": {
    "famille": {
      "depot": {
        "code": "RAPINIT",
        "libelle": "Rapport sur une initiative"
      },
      "classe": {
        "code": "RAPPORT",
        "libelle": "Rapport"
      }
    },
    "type": {
      "code": "RAPP",
      "libelle": "Rapport"
    }
  },
  "auteurs": [
    {
      "acteur": {
        "acteurRef": "PA415470",
        "qualite": "rapporteur"
      }
    },
    {
      "organeRef": "PO211493"
    }
  ],
  "notice": {
    "numNotice": "769",
    "formule": "sur le projet de loi , après engagement de la procédure accélérée, relatif à la désignation des conseillers prud'hommes  , (n°423 et lettre rectificative n°, 739)",
    "adoptionConforme": false
  }
}