{
  "xsiType": "rapportParlementaire_Type",
  "uid": "RAPPSNR5S259B0694",
  "cycleDeVie": {
    "chrono": {
      "dateCreation": "2016-06-17T00:00:00.000+02:00",
      "dateDepot": "2016-06-16T00:00:00.000+02:00",
      "datePublication": "2016-06-29T00:00:00.000+02:00"
    }
  },
  "denominationStructurelle": "Rapport",
  "provenance": "Commission",
  "titres": {
    "titrePrincipal": "rapport  les dispositions restant en discussion sur du projet de loi, modifié par le Sénat, en deuxième lecture, relatif à la liberté de la création, à l'architecture et au patrimoine (n°3787).",
    "titrePrincipalCourt": "rapport  les dispositions restant en discussion sur du projet de loi, modifié par le Sénat, en deuxième lecture, relatif à la liberté de la création, à l'architecture et au patrimoine (n°3787)."
  },
  "dossierRef": "DLR5L14N34109",
  "classification": {
    "famille": {
      "depot": {
        "code": "RAPINIT",
        "libelle": "Rapport sur une initiative"
      },
      "classe": {
        "code": "RAPPORT",
        "libelle": "Rapport"
      }
    },
    "type": {
      "code": "RAPP",
      "libelle": "Rapport"
    }
  },
  "auteurs": [
    {
      "acteur": {
        "acteurRef": "PA267795",
        "qualite": "rapporteur"
      }
    },
    {
      "acteur": {
        "acteurRef": "PA227029",
        "qualite": "rapporteur"
      }
    },
    {
      "organeRef": "PO713419"
    }
  ],
  "notice": {
    "numNotice": "694",
    "formule": "de la commission mixte paritaire chargée de proposer un texte sur les dispositions restant en discussion sur du projet de loi, modifié par le Sénat, en deuxième lecture, relatif à la liberté de la création, à l'architecture et au patrimoine (n°3787).",
    "adoptionConforme": false
  }
}