{
  "xsiType": "documentEtudeImpact_Type",
  "uid": "ETDIANR5L14B1337",
  "legislature": "14",
  "cycleDeVie": {
    "chrono": {
      "dateCreation": "2013-08-02T00:00:00.000+02:00",
      "dateDepot": "2013-08-02T00:00:00.000+02:00",
      "datePublication": "2013-11-27T00:00:00.000+01:00",
      "datePublicationWeb": "2013-08-09T18:15:00.000+02:00"
    }
  },
  "denominationStructurelle": "Projet de loi",
  "provenance": "Texte Déposé",
  "titres": {
    "titrePrincipal": "Etude d'impact sur le projet de loi de programmation pour la ville et la cohésion urbaine",
    "titrePrincipalCourt": "relatif à la ville et à la cohésion urbaine"
  },
  "dossierRef": "DLR5L14N31013",
  "classification": {
    "famille": {
      "depot": {
        "code": "INITDEP",
        "libelle": "Initiative en 1er Dépôt"
      },
      "classe": {
        "code": "PRJLOI",
        "libelle": "Projet de loi"
      }
    },
    "type": {
      "code": "ETDI",
      "libelle": "Etude d'impact"
    }
  },
  "auteurs": [
    {
      "acteur": {
        "acteurRef": "PA328",
        "qualite": "auteur"
      }
    }
  ],
  "notice": {
    "numNotice": "1337",
    "formule": "de programmation pour la ville et la cohésion urbaine",
    "adoptionConforme": false
  }
}