{
  "xsiType": "DossierResolutionAN",
  "uid": "DLR5L14N32596",
  "legislature": "14",
  "titreDossier": {
    "titre": "Respect de la législation sur l'usage du titre de \"psychothérapeute\"",
    "titreChemin": "legislation_usage_titre_psychotherapeute"
  },
  "procedureParlementaire": {
    "code": "22",
    "libelle": "Résolution Article 34-1"
  },
  "initiateur": {
    "acteurs": [
      {
        "acteurRef": "PA230",
        "mandatRef": "PM645553"
      }
    ]
  },
  "actesLegislatifs": [
    {
      "xsiType": "Etape_Type",
      "uid": "L14-ANLUNI-32596",
      "codeActe": "ANLUNI",
      "libelleActe": {
        "nomCanonique": "Lecture unique"
      },
      "organeRef": "PO644420",
      "actesLegislatifs": [
        {
          "xsiType": "DepotInitiative_Type",
          "uid": "L14-VD168716DI",
          "codeActe": "ANLUNI-DEPOT",
          "libelleActe": {
            "nomCanonique": "1er dépôt d'une initiative.",
            "libelleCourt": "1er dépôt d'une initiative."
          },
          "organeRef": "PO644420",
          "dateActe": "2014-02-06T00:00:00.000+01:00",
          "texteAssocieRef": "PNREANR5L14B1774"
        }
      ]
    }
  ]
}