{
  "xsiType": "texteLoi_Type",
  "uid": "PIONANR5L14B0266",
  "legislature": "14",
  "cycleDeVie": {
    "chrono": {
      "dateCreation": "2012-09-28T00:00:00.000+02:00",
      "dateDepot": "2012-10-10T00:00:00.000+02:00",
      "datePublicationWeb": "2012-10-11T16:00:00.000+02:00"
    }
  },
  "denominationStructurelle": "Proposition de loi",
  "provenance": "Texte Déposé",
  "titres": {
    "titrePrincipal": "proposition de loi visant à instituer une journée nationale des victimes de la route dont la date serait fixée au 16 mai",
    "titrePrincipalCourt": "Instauration d'une journée nationale des victimes de la route"
  },
  "dossierRef": "DLR5L14N29118",
  "classification": {
    "famille": {
      "depot": {
        "code": "INITDEP",
        "libelle": "Initiative en 1er Dépôt"
      },
      "classe": {
        "code": "PIONLOI",
        "libelle": "Proposition de loi"
      }
    },
    "type": {
      "code": "PION",
      "libelle": "Proposition de loi"
    }
  },
  "auteurs": [
    {
      "acteur": {
        "acteurRef": "PA1699",
        "qualite": "auteur"
      }
    }
  ],
  "notice": {
    "numNotice": "266",
    "formule": "visant à instituer une journée nationale des victimes de la route dont la date serait fixée au 16 mai",
    "adoptionConforme": false
  },
  "depotAmendements": {
    "amendementsSeance": {
      "amendable": false
    },
    "amendementsCommission": [
      {
        "organeRef": "PO59051",
        "amendable": true
      }
    ]
  }
}