{
  "xsiType": "texteLoi_Type",
  "uid": "PIONANR5L14B0640",
  "legislature": "14",
  "cycleDeVie": {
    "chrono": {
      "dateCreation": "2012-12-27T00:00:00.000+01:00",
      "dateDepot": "2013-01-23T00:00:00.000+01:00",
      "datePublicationWeb": "2013-02-07T10:30:00.000+01:00"
    }
  },
  "denominationStructurelle": "Proposition de loi",
  "provenance": "Texte Déposé",
  "titres": {
    "titrePrincipal": "proposition de loi visant à mentionner sur le permis de conduire la volonté du titulaire de donner ou non ses organes",
    "titrePrincipalCourt": "Mention de la volonté de donner ses organes sur le permis de conduire"
  },
  "dossierRef": "DLR5L14N29545",
  "classification": {
    "famille": {
      "depot": {
        "code": "INITDEP",
        "libelle": "Initiative en 1er Dépôt"
      },
      "classe": {
        "code": "PIONLOI",
        "libelle": "Proposition de loi"
      }
    },
    "type": {
      "code": "PION",
      "libelle": "Proposition de loi"
    }
  },
  "auteurs": [
    {
      "acteur": {
        "acteurRef": "PA607846",
        "qualite": "auteur"
      }
    }
  ],
  "notice": {
    "numNotice": "640",
    "formule": "visant à mentionner sur le permis de conduire la volonté du titulaire de donner ou non ses organes",
    "adoptionConforme": false
  },
  "coSignataires": [
    {
      "acteurRef": "PA243",
      "dateCosignature": "2013-01-23+01:00",
      "edite": true
    },
    {
      "acteurRef": "PA333224",
      "dateCosignature": "2013-01-23+01:00",
      "edite": true
    },
    {
      "acteurRef": "PA609726",
      "dateCosignature": "2013-01-23+01:00",
      "edite": false
    },
    {
      "acteurRef": "PA606888",
      "dateCosignature": "2013-01-23+01:00",
      "edite": false
    },
    {
      "acteurRef": "PA267075",
      "dateCosignature": "2013-01-23+01:00",
      "edite": false
    },
    {
      "acteurRef": "PA267429",
      "dateCosignature": "2013-01-23+01:00",
      "edite": false
    },
    {
      "acteurRef": "PA267743",
      "dateCosignature": "2013-01-23+01:00",
      "edite": false
    },
    {
      "acteurRef": "PA951",
      "dateCosignature": "2013-01-23+01:00",
      "edite": false
    },
    {
      "acteurRef": "PA998",
      "dateCosignature": "2013-01-23+01:00",
      "edite": false
    },
    {
      "acteurRef": "PA267762",
      "dateCosignature": "2013-01-23+01:00",
      "edite": false
    },
    {
      "acteurRef": "PA422119",
      "dateCosignature": "2013-01-23+01:00",
      "edite": false
    },
    {
      "acteurRef": "PA608826",
      "dateCosignature": "2013-01-23+01:00",
      "edite": false
    },
    {
      "acteurRef": "PA267042",
      "dateCosignature": "2013-01-23+01:00",
      "edite": false
    },
    {
      "acteurRef": "PA267591",
      "dateCosignature": "2013-01-23+01:00",
      "edite": false
    },
    {
      "acteurRef": "PA266774",
      "dateCosignature": "2013-01-23+01:00",
      "edite": false
    },
    {
      "acteurRef": "PA605991",
      "dateCosignature": "2013-01-23+01:00",
      "edite": false
    },
    {
      "acteurRef": "PA267813",
      "dateCosignature": "2013-01-23+01:00",
      "edite": false
    },
    {
      "acteurRef": "PA267680",
      "dateCosignature": "2013-01-23+01:00",
      "edite": false
    },
    {
      "acteurRef": "PA1630",
      "dateCosignature": "2013-01-23+01:00",
      "edite": false
    },
    {
      "acteurRef": "PA608416",
      "dateCosignature": "2013-01-23+01:00",
      "edite": false
    },
    {
      "acteurRef": "PA333134",
      "dateCosignature": "2013-01-23+01:00",
      "edite": false
    },
    {
      "acteurRef": "PA331567",
      "dateCosignature": "2013-01-23+01:00",
      "edite": false
    },
    {
      "acteurRef": "PA267785",
      "dateCosignature": "2013-01-23+01:00",
      "edite": false
    },
    {
      "acteurRef": "PA331481",
      "dateCosignature": "2013-01-23+01:00",
      "edite": false
    },
    {
      "acteurRef": "PA607603",
      "dateCosignature": "2013-01-23+01:00",
      "edite": false
    },
    {
      "acteurRef": "PA1960",
      "dateCosignature": "2013-01-23+01:00",
      "edite": false
    },
    {
      "acteurRef": "PA608016",
      "dateCosignature": "2013-01-23+01:00",
      "edite": false
    },
    {
      "acteurRef": "PA606712",
      "dateCosignature": "2013-01-23+01:00",
      "edite": false
    },
    {
      "acteurRef": "PA606098",
      "dateCosignature": "2013-01-23+01:00",
      "edite": false
    },
    {
      "acteurRef": "PA2086",
      "dateCosignature": "2013-01-23+01:00",
      "edite": false
    },
    {
      "acteurRef": "PA2098",
      "dateCosignature": "2013-01-23+01:00",
      "edite": false
    },
    {
      "acteurRef": "PA2099",
      "dateCosignature": "2013-01-23+01:00",
      "edite": false
    },
    {
      "acteurRef": "PA267556",
      "dateCosignature": "2013-01-23+01:00",
      "edite": false
    },
    {
      "acteurRef": "PA267327",
      "dateCosignature": "2013-01-23+01:00",
      "edite": false
    },
    {
      "acteurRef": "PA266788",
      "dateCosignature": "2013-01-23+01:00",
      "edite": false
    },
    {
      "acteurRef": "PA606299",
      "dateCosignature": "2013-01-23+01:00",
      "edite": false
    },
    {
      "acteurRef": "PA2250",
      "dateCosignature": "2013-01-23+01:00",
      "edite": false
    },
    {
      "acteurRef": "PA2257",
      "dateCosignature": "2013-01-23+01:00",
      "edite": false
    },
    {
      "acteurRef": "PA267605",
      "dateCosignature": "2013-01-23+01:00",
      "edite": false
    },
    {
      "acteurRef": "PA2377",
      "dateCosignature": "2013-01-23+01:00",
      "edite": false
    },
    {
      "acteurRef": "PA2529",
      "dateCosignature": "2013-01-23+01:00",
      "edite": false
    },
    {
      "acteurRef": "PA417099",
      "dateCosignature": "2013-01-23+01:00",
      "edite": false
    },
    {
      "acteurRef": "PA267689",
      "dateCosignature": "2013-01-23+01:00",
      "edite": false
    },
    {
      "acteurRef": "PA608380",
      "dateCosignature": "2013-01-23+01:00",
      "edite": false
    },
    {
      "acteurRef": "PA610924",
      "dateCosignature": "2013-01-23+01:00",
      "edite": false
    },
    {
      "acteurRef": "PA267204",
      "dateCosignature": "2013-01-23+01:00",
      "edite": false
    },
    {
      "acteurRef": "PA346876",
      "dateCosignature": "2013-01-23+01:00",
      "edite": false
    },
    {
      "acteurRef": "PA267013",
      "dateCosignature": "2013-01-23+01:00",
      "edite": false
    },
    {
      "acteurRef": "PA2796",
      "dateCosignature": "2013-01-23+01:00",
      "edite": false
    },
    {
      "acteurRef": "PA610820",
      "dateCosignature": "2013-01-23+01:00",
      "edite": false
    },
    {
      "acteurRef": "PA607090",
      "dateCosignature": "2013-01-23+01:00",
      "edite": false
    },
    {
      "acteurRef": "PA267506",
      "dateCosignature": "2013-01-23+01:00",
      "edite": false
    },
    {
      "acteurRef": "PA2936",
      "dateCosignature": "2013-01-23+01:00",
      "edite": false
    },
    {
      "acteurRef": "PA2960",
      "dateCosignature": "2013-01-23+01:00",
      "edite": false
    },
    {
      "acteurRef": "PA267330",
      "dateCosignature": "2013-01-23+01:00",
      "edite": false
    },
    {
      "acteurRef": "PA267728",
      "dateCosignature": "2013-02-11+01:00",
      "edite": false
    },
    {
      "acteurRef": "PA267457",
      "dateCosignature": "2013-02-14+01:00",
      "edite": false
    },
    {
      "acteurRef": "PA334149",
      "dateCosignature": "2013-02-14+01:00",
      "edite": false
    }
  ],
  "depotAmendements": {
    "amendementsSeance": {
      "amendable": false
    },
    "amendementsCommission": [
      {
        "organeRef": "PO420120",
        "amendable": true
      }
    ]
  }
}