{
  "xsiType": "texteLoi_Type",
  "uid": "PIONANR5L14B4496",
  "legislature": "14",
  "cycleDeVie": {
    "chrono": {
      "dateCreation": "2017-02-09T00:00:00.000+01:00",
      "dateDepot": "2017-02-15T00:00:00.000+01:00",
      "datePublication": "2017-02-22T00:00:00.000+01:00",
      "datePublicationWeb": "2017-02-16T15:10:00.000+01:00"
    }
  },
  "denominationStructurelle": "Proposition de loi",
  "provenance": "Texte Déposé",
  "titres": {
    "titrePrincipal": "proposition de loi donnant le libre choix aux maires concernant les rythmes scolaires dans l'enseignement du premier degré",
    "titrePrincipalCourt": "libre choix des maires concernant les rythmes scolaires dans l'enseignement du premier degré"
  },
  "dossierRef": "DLR5L14N35568",
  "classification": {
    "famille": {
      "depot": {
        "code": "INITDEP",
        "libelle": "Initiative en 1er Dépôt"
      },
      "classe": {
        "code": "PIONLOI",
        "libelle": "Proposition de loi"
      }
    },
    "type": {
      "code": "PION",
      "libelle": "Proposition de loi"
    }
  },
  "auteurs": [
    {
      "acteur": {
        "acteurRef": "PA687214",
        "qualite": "auteur"
      }
    }
  ],
  "notice": {
    "numNotice": "4496",
    "formule": "donnant le libre choix aux maires concernant les rythmes scolaires dans l'enseignement du premier degré",
    "adoptionConforme": false
  },
  "coSignataires": [
    {
      "acteurRef": "PA267457",
      "dateCosignature": "2017-02-15+01:00",
      "edite": false
    },
    {
      "acteurRef": "PA642759",
      "dateCosignature": "2017-02-15+01:00",
      "edite": false
    },
    {
      "acteurRef": "PA267822",
      "dateCosignature": "2017-02-15+01:00",
      "edite": false
    },
    {
      "acteurRef": "PA713448",
      "dateCosignature": "2017-02-15+01:00",
      "edite": false
    },
    {
      "acteurRef": "PA330240",
      "dateCosignature": "2017-02-15+01:00",
      "edite": false
    },
    {
      "acteurRef": "PA951",
      "dateCosignature": "2017-02-15+01:00",
      "edite": false
    },
    {
      "acteurRef": "PA332523",
      "dateCosignature": "2017-02-15+01:00",
      "edite": false
    },
    {
      "acteurRef": "PA267762",
      "dateCosignature": "2017-02-15+01:00",
      "edite": false
    },
    {
      "acteurRef": "PA1031",
      "dateCosignature": "2017-02-15+01:00",
      "edite": false
    },
    {
      "acteurRef": "PA267289",
      "dateCosignature": "2017-02-15+01:00",
      "edite": false
    },
    {
      "acteurRef": "PA608826",
      "dateCosignature": "2017-02-15+01:00",
      "edite": false
    },
    {
      "acteurRef": "PA266774",
      "dateCosignature": "2017-02-15+01:00",
      "edite": false
    },
    {
      "acteurRef": "PA605991",
      "dateCosignature": "2017-02-15+01:00",
      "edite": false
    },
    {
      "acteurRef": "PA267813",
      "dateCosignature": "2017-02-15+01:00",
      "edite": false
    },
    {
      "acteurRef": "PA1574",
      "dateCosignature": "2017-02-15+01:00",
      "edite": false
    },
    {
      "acteurRef": "PA267551",
      "dateCosignature": "2017-02-15+01:00",
      "edite": false
    },
    {
      "acteurRef": "PA606693",
      "dateCosignature": "2017-02-15+01:00",
      "edite": false
    },
    {
      "acteurRef": "PA1874",
      "dateCosignature": "2017-02-15+01:00",
      "edite": false
    },
    {
      "acteurRef": "PA1931",
      "dateCosignature": "2017-02-15+01:00",
      "edite": false
    },
    {
      "acteurRef": "PA608016",
      "dateCosignature": "2017-02-15+01:00",
      "edite": false
    },
    {
      "acteurRef": "PA2073",
      "dateCosignature": "2017-02-15+01:00",
      "edite": false
    },
    {
      "acteurRef": "PA2084",
      "dateCosignature": "2017-02-15+01:00",
      "edite": false
    },
    {
      "acteurRef": "PA2086",
      "dateCosignature": "2017-02-15+01:00",
      "edite": false
    },
    {
      "acteurRef": "PA2098",
      "dateCosignature": "2017-02-15+01:00",
      "edite": false
    },
    {
      "acteurRef": "PA267556",
      "dateCosignature": "2017-02-15+01:00",
      "edite": false
    },
    {
      "acteurRef": "PA2250",
      "dateCosignature": "2017-02-15+01:00",
      "edite": false
    },
    {
      "acteurRef": "PA2277",
      "dateCosignature": "2017-02-15+01:00",
      "edite": false
    },
    {
      "acteurRef": "PA2345",
      "dateCosignature": "2017-02-15+01:00",
      "edite": false
    },
    {
      "acteurRef": "PA643183",
      "dateCosignature": "2017-02-15+01:00",
      "edite": false
    },
    {
      "acteurRef": "PA2377",
      "dateCosignature": "2017-02-15+01:00",
      "edite": false
    },
    {
      "acteurRef": "PA267886",
      "dateCosignature": "2017-02-15+01:00",
      "edite": false
    },
    {
      "acteurRef": "PA2529",
      "dateCosignature": "2017-02-15+01:00",
      "edite": false
    },
    {
      "acteurRef": "PA335758",
      "dateCosignature": "2017-02-15+01:00",
      "edite": false
    },
    {
      "acteurRef": "PA267013",
      "dateCosignature": "2017-02-15+01:00",
      "edite": false
    },
    {
      "acteurRef": "PA334654",
      "dateCosignature": "2017-02-15+01:00",
      "edite": false
    },
    {
      "acteurRef": "PA608434",
      "dateCosignature": "2017-02-15+01:00",
      "edite": false
    },
    {
      "acteurRef": "PA2775",
      "dateCosignature": "2017-02-15+01:00",
      "edite": false
    },
    {
      "acteurRef": "PA267794",
      "dateCosignature": "2017-02-15+01:00",
      "edite": false
    },
    {
      "acteurRef": "PA2796",
      "dateCosignature": "2017-02-15+01:00",
      "edite": false
    },
    {
      "acteurRef": "PA334843",
      "dateCosignature": "2017-02-15+01:00",
      "edite": false
    },
    {
      "acteurRef": "PA267506",
      "dateCosignature": "2017-02-15+01:00",
      "edite": false
    },
    {
      "acteurRef": "PA267200",
      "dateCosignature": "2017-02-15+01:00",
      "edite": false
    },
    {
      "acteurRef": "PA609345",
      "dateCosignature": "2017-02-15+01:00",
      "edite": false
    }
  ],
  "depotAmendements": {
    "amendementsSeance": {
      "amendable": false
    },
    "amendementsCommission": [
      {
        "organeRef": "PO419604",
        "amendable": true
      }
    ]
  }
}