{
  "xsiType": "rapportParlementaire_Type",
  "uid": "RAPPSNR5S259B0808",
  "cycleDeVie": {
    "chrono": {
      "dateCreation": "2016-07-21T00:00:00.000+02:00",
      "dateDepot": "2016-07-20T00:00:00.000+02:00",
      "datePublication": "2016-07-21T00:00:00.000+02:00"
    }
  },
  "denominationStructurelle": "Rapport",
  "provenance": "Commission",
  "titres": {
    "titrePrincipal": "rapport  les dispositions restant en discussion sur du projet de loi, modifié par le Sénat, prorogeant l'application de la loi n° 55-385 du 3 avril 1955 relative à l'état d'urgence et portant mesures de renforcement de la lutte antiterroriste (n°3992).",
    "titrePrincipalCourt": "rapport  les dispositions restant en discussion sur du projet de loi, modifié par le Sénat, prorogeant l'application de la loi n° 55-385 du 3 avril 1955 relative à l'état d'urgence et portant mesures de renforcement de la lutte antiterroriste (n°3992)."
  },
  "dossierRef": "DLR5L14N35094",
  "classification": {
    "famille": {
      "depot": {
        "code": "RAPINIT",
        "libelle": "Rapport sur une initiative"
      },
      "classe": {
        "code": "RAPPORT",
        "libelle": "Rapport"
      }
    },
    "type": {
      "code": "RAPP",
      "libelle": "Rapport"
    }
  },
  "auteurs": [
    {
      "acteur": {
        "acteurRef": "PA2161",
        "qualite": "rapporteur"
      }
    },
    {
      "organeRef": "PO714525"
    }
  ],
  "notice": {
    "numNotice": "808",
    "formule": "de la commission mixte paritaire chargée de proposer un texte sur les dispositions restant en discussion sur du projet de loi, modifié par le Sénat, prorogeant l'application de la loi n° 55-385 du 3 avril 1955 relative à l'état d'urgence et portant mesures de renforcement de la lutte antiterroriste (n°3992).",
    "adoptionConforme": false
  }
}