{
  "xsiType": "texteLoi_Type",
  "uid": "PRJLANR5L14B0287",
  "legislature": "14",
  "cycleDeVie": {
    "chrono": {
      "dateCreation": "2012-10-10T00:00:00.000+02:00",
      "dateDepot": "2012-10-10T00:00:00.000+02:00",
      "datePublication": "2012-10-15T00:00:00.000+02:00",
      "datePublicationWeb": "2012-10-12T11:00:00.000+02:00"
    }
  },
  "denominationStructurelle": "Projet de loi",
  "provenance": "Texte Déposé",
  "titres": {
    "titrePrincipal": "projet de loi de financement de la sécurité sociale pour 2013",
    "titrePrincipalCourt": "financement sécurité sociale pour 2013"
  },
  "dossierRef": "DLR5L14N29173",
  "classification": {
    "famille": {
      "depot": {
        "code": "INITDEP",
        "libelle": "Initiative en 1er Dépôt"
      },
      "classe": {
        "code": "PRJLOI",
        "libelle": "Projet de loi"
      },
      "espece": {
        "code": "FINSSOC",
        "libelle": "de financement de la sécurité sociale"
      }
    },
    "type": {
      "code": "PRJL",
      "libelle": "Projet de loi"
    },
    "sousType": {
      "code": "FINSSOC",
      "libelle": "de financement de la sécurité sociale",
      "libelleEdition": "de financement de la sécurité sociale"
    }
  },
  "auteurs": [
    {
      "acteur": {
        "acteurRef": "PA328",
        "qualite": "auteur"
      }
    }
  ],
  "notice": {
    "numNotice": "287",
    "formule": "pour 2013",
    "adoptionConforme": false
  },
  "indexation": {
    "themes": {
      "@niveau": "1",
      "theme": {
        "libelleTheme": "LOGEMENT ET HABITAT"
      }
    }
  },
  "imprimerie": {
    "prix": "10.5"
  },
  "coSignataires": [
    {
      "acteurRef": "PA2240",
      "dateCosignature": "2012-10-10+02:00",
      "edite": true
    }
  ],
  "depotAmendements": {
    "amendementsSeance": {
      "amendable": true
    },
    "amendementsCommission": [
      {
        "organeRef": "PO420120",
        "amendable": true
      },
      {
        "organeRef": "PO59048",
        "amendable": true
      }
    ]
  }
}