{
  "xsiType": "rapportParlementaire_Type",
  "uid": "RAPPSNR5S199B0650",
  "cycleDeVie": {
    "chrono": {
      "dateCreation": "2013-06-18T00:00:00.000+02:00",
      "dateDepot": "2013-06-11T00:00:00.000+02:00"
    }
  },
  "denominationStructurelle": "Rapport",
  "provenance": "Commission",
  "titres": {
    "titrePrincipal": "rapport sur   le projet de loi , adopté par l'Assemblée nationale après engagement de la procédure accélérée, autorisant l'approbation de l'accord entre le Gouvernement de la République française et le Gouvernement de la Principauté de Monaco relatif à la prise en charge sur le territoire français de déchets radioactifs monégasques (n°507)",
    "titrePrincipalCourt": "rapport sur   le projet de loi , adopté par l'Assemblée nationale après engagement de la procédure accélérée, autorisant l'approbation de l'accord entre le Gouvernement de la République française et le Gouvernement de la Principauté de Monaco relatif à la prise en charge sur le territoire français de déchets radioactifs monégasques (n°507)"
  },
  "dossierRef": "DLR5L14N28887",
  "classification": {
    "famille": {
      "depot": {
        "code": "RAPINIT",
        "libelle": "Rapport sur une initiative"
      },
      "classe": {
        "code": "RAPPORT",
        "libelle": "Rapport"
      }
    },
    "type": {
      "code": "RAPP",
      "libelle": "Rapport"
    }
  },
  "auteurs": [
    {
      "acteur": {
        "acteurRef": "PA429895",
        "qualite": "rapporteur"
      }
    },
    {
      "organeRef": "PO211491"
    }
  ],
  "notice": {
    "numNotice": "650",
    "formule": "sur   le projet de loi , adopté par l'Assemblée nationale après engagement de la procédure accélérée, autorisant l'approbation de l'accord entre le Gouvernement de la République française et le Gouvernement de la Principauté de Monaco relatif à la prise en charge sur le territoire français de déchets radioactifs monégasques (n°507)",
    "adoptionConforme": false
  }
}