{
  "xsiType": "DossierMissionInformation_Type",
  "uid": "DLR5L14N34705",
  "legislature": "14",
  "titreDossier": {
    "titre": "Evaluation de la politique d’aide sociale de l’Office national des anciens combattants (ONAC)",
    "titreChemin": "politique_aide_sociale_onac"
  },
  "procedureParlementaire": {
    "code": "10",
    "libelle": "Mission d'information"
  },
  "initiateur": {
    "organeRef": "PO711524"
  },
  "actesLegislatifs": [
    {
      "xsiType": "Etape_Type",
      "uid": "L14-AN20-34705",
      "codeActe": "AN20",
      "libelleActe": {
        "nomCanonique": "Travaux"
      },
      "organeRef": "PO644420",
      "actesLegislatifs": [
        {
          "xsiType": "Etape_Type",
          "uid": "L14-AN20-MISINF-34705",
          "codeActe": "AN20-MISINF",
          "libelleActe": {
            "nomCanonique": "Mission d'information",
            "libelleCourt": "Mission d'information"
          },
          "organeRef": "PO711524",
          "actesLegislatifs": [
            {
              "xsiType": "CreationOrganeTemporaire_Type",
              "uid": "L14-VD176994",
              "codeActe": "AN20-MISINF-CREA",
              "libelleActe": {
                "nomCanonique": "Création d'une mission d'information",
                "libelleCourt": "Création d'une mission d'information"
              },
              "organeRef": "PO711524",
              "dateActe": "2016-02-11T00:00:00.000+01:00",
              "initiateur": {
                "organeRef": "PO711524"
              }
            }
          ]
        }
      ]
    }
  ]
}