{
  "xsiType": "rapportParlementaire_Type",
  "uid": "RAPPANR5L14B2918",
  "legislature": "14",
  "cycleDeVie": {
    "chrono": {
      "dateCreation": "2015-06-30T00:00:00.000+02:00",
      "dateDepot": "2015-06-30T00:00:00.000+02:00",
      "datePublicationWeb": "2015-07-02T12:15:00.000+02:00"
    }
  },
  "denominationStructurelle": "Rapport",
  "provenance": "Commission",
  "titres": {
    "titrePrincipal": "rapport sur de la commission mixte paritaire chargée de proposer un texte sur les dispositions restant en discussion du projet de loi relatif au dialogue social et à l'emploi",
    "titrePrincipalCourt": "rapport sur de la commission mixte paritaire chargée de proposer un texte sur les dispositions restant en discussion du projet de loi relatif au dialogue social et à l'emploi"
  },
  "dossierRef": "DLR5L14N33930",
  "classification": {
    "famille": {
      "depot": {
        "code": "RAPINIT",
        "libelle": "Rapport sur une initiative"
      },
      "classe": {
        "code": "RAPPORT",
        "libelle": "Rapport"
      }
    },
    "type": {
      "code": "RAPP",
      "libelle": "Rapport"
    }
  },
  "auteurs": [
    {
      "acteur": {
        "acteurRef": "PA335017",
        "qualite": "rapporteur"
      }
    },
    {
      "organeRef": "PO708730"
    }
  ],
  "notice": {
    "numNotice": "2918",
    "formule": "sur de la commission mixte paritaire chargée de proposer un texte sur les dispositions restant en discussion du projet de loi relatif au dialogue social et à l'emploi",
    "adoptionConforme": false
  }
}