{
  "xsiType": "texteLoi_Type",
  "uid": "PNREANR5L14B4279",
  "legislature": "14",
  "cycleDeVie": {
    "chrono": {
      "dateCreation": "2016-12-06T00:00:00.000+01:00",
      "dateDepot": "2016-12-06T00:00:00.000+01:00",
      "datePublication": "2016-12-09T00:00:00.000+01:00",
      "datePublicationWeb": "2016-12-07T19:00:00.000+01:00"
    }
  },
  "denominationStructurelle": "Proposition de résolution",
  "provenance": "Texte Déposé",
  "titres": {
    "titrePrincipal": "proposition de résolution européenne sur le socle européen des droits sociaux",
    "titrePrincipalCourt": "socle européen des droits sociaux"
  },
  "dossierRef": "DLR5L14N35426",
  "classification": {
    "famille": {
      "depot": {
        "code": "INITDEP",
        "libelle": "Initiative en 1er Dépôt"
      },
      "classe": {
        "code": "PIONRES",
        "libelle": "Proposition de résolution"
      },
      "espece": {
        "code": "TVXINSTITEUROP",
        "libelle": "sur les travaux conduits par les institutions européennes"
      }
    },
    "type": {
      "code": "PNRE",
      "libelle": "Proposition de résolution"
    },
    "sousType": {
      "code": "TVXINSTITEUROP",
      "libelle": "sur les travaux conduits par les institutions européennes"
    }
  },
  "auteurs": [
    {
      "acteur": {
        "acteurRef": "PA610891",
        "qualite": "auteur"
      }
    },
    {
      "acteur": {
        "acteurRef": "PA332305",
        "qualite": "auteur"
      }
    },
    {
      "acteur": {
        "acteurRef": "PA608380",
        "qualite": "auteur"
      }
    }
  ],
  "notice": {
    "numNotice": "4279",
    "formule": "sur le socle européen des droits sociaux",
    "adoptionConforme": false
  }
}