{
  "xsiType": "rapportParlementaire_Type",
  "uid": "RAPPANR5L14B3564",
  "legislature": "14",
  "cycleDeVie": {
    "chrono": {
      "dateCreation": "2016-03-09T00:00:00.000+01:00",
      "dateDepot": "2016-03-09T00:00:00.000+01:00"
    }
  },
  "denominationStructurelle": "Rapport",
  "provenance": "Commission",
  "titres": {
    "titrePrincipal": "rapport  sur le projet de loi, modifié par le Sénat, pour la reconquête de la biodiversité, de la nature et des paysages (n°3442).",
    "titrePrincipalCourt": "rapport  sur le projet de loi, modifié par le Sénat, pour la reconquête de la biodiversité, de la nature et des paysages (n°3442)."
  },
  "divisions": [
    {
      "xsiType": "rapportParlementaire_Type",
      "uid": "RAPPANR5L14B3564-t1",
      "legislature": "14",
      "cycleDeVie": {
        "chrono": {
          "dateCreation": "2016-03-09T00:00:00.000+01:00",
          "dateDepot": "2016-03-09T00:00:00.000+01:00",
          "datePublication": "2016-03-15T00:00:00.000+01:00",
          "datePublicationWeb": "2016-03-14T15:36:00.000+01:00"
        }
      },
      "denominationStructurelle": "Tome 1",
      "titres": {
        "titrePrincipal": "Rapport",
        "titrePrincipalCourt": "Rapport"
      },
      "dossierRef": "DLR5L14N33016",
      "classification": {
        "type": {
          "code": "RAPP",
          "libelle": "Rapport"
        },
        "statutAdoption": "ADOPTCOM"
      },
      "auteurs": [
        {
          "acteur": {
            "acteurRef": "PA2374",
            "qualite": "rapporteur"
          }
        },
        {
          "organeRef": "PO419865"
        }
      ],
      "correction": {
        "typeCorrection": "Rectifié",
        "niveauCorrection": "1"
      },
      "notice": {
        "numNotice": "3564",
        "formule": "sur le projet de loi, modifié par le Sénat, pour la reconquête de la biodiversité, de la nature et des paysages (n°3442).",
        "adoptionConforme": false
      },
      "imprimerie": {
        "prix": "10.0"
      }
    },
    {
      "xsiType": "rapportParlementaire_Type",
      "uid": "RAPPANR5L14B3564-t2",
      "legislature": "14",
      "cycleDeVie": {
        "chrono": {
          "dateCreation": "2016-03-09T00:00:00.000+01:00",
          "dateDepot": "2016-03-09T00:00:00.000+01:00",
          "datePublication": "2016-03-15T00:00:00.000+01:00",
          "datePublicationWeb": "2016-03-14T15:45:00.000+01:00"
        }
      },
      "denominationStructurelle": "Tome 2",
      "titres": {
        "titrePrincipal": "Tableau comparatif",
        "titrePrincipalCourt": "Tableau comparatif"
      },
      "dossierRef": "DLR5L14N33016",
      "classification": {
        "type": {
          "code": "RAPP",
          "libelle": "Rapport"
        },
        "statutAdoption": "ADOPTCOM"
      },
      "auteurs": [
        {
          "acteur": {
            "acteurRef": "PA2374",
            "qualite": "rapporteur"
          }
        },
        {
          "organeRef": "PO419865"
        }
      ],
      "correction": {
        "typeCorrection": "Rectifié",
        "niveauCorrection": "1"
      },
      "notice": {
        "numNotice": "3564",
        "formule": "sur le projet de loi, modifié par le Sénat, pour la reconquête de la biodiversité, de la nature et des paysages (n°3442).",
        "adoptionConforme": false
      },
      "imprimerie": {
        "prix": "5.0"
      }
    }
  ],
  "dossierRef": "DLR5L14N33016",
  "classification": {
    "famille": {
      "depot": {
        "code": "RAPINIT",
        "libelle": "Rapport sur une initiative"
      },
      "classe": {
        "code": "RAPPORT",
        "libelle": "Rapport"
      }
    },
    "type": {
      "code": "RAPP",
      "libelle": "Rapport"
    },
    "statutAdoption": "ADOPTCOM"
  },
  "auteurs": [
    {
      "acteur": {
        "acteurRef": "PA2374",
        "qualite": "rapporteur"
      }
    },
    {
      "organeRef": "PO419865"
    }
  ],
  "correction": {
    "typeCorrection": "Rectifié",
    "niveauCorrection": "1"
  },
  "notice": {
    "numNotice": "3564",
    "formule": "sur le projet de loi, modifié par le Sénat, pour la reconquête de la biodiversité, de la nature et des paysages (n°3442).",
    "adoptionConforme": false
  }
}