{
  "xsiType": "texteLoi_Type",
  "uid": "PIONANR5L14B2732",
  "legislature": "14",
  "cycleDeVie": {
    "chrono": {
      "dateCreation": "2015-04-13T00:00:00.000+02:00",
      "dateDepot": "2015-04-15T00:00:00.000+02:00",
      "datePublication": "2015-06-11T00:00:00.000+02:00",
      "datePublicationWeb": "2015-04-16T18:00:00.000+02:00"
    }
  },
  "denominationStructurelle": "Proposition de loi",
  "provenance": "Texte Déposé",
  "titres": {
    "titrePrincipal": "proposition de loi visant à expérimenter un service civique de défense",
    "titrePrincipalCourt": "expérimentation service civique de défense"
  },
  "dossierRef": "DLR5L14N33900",
  "classification": {
    "famille": {
      "depot": {
        "code": "INITDEP",
        "libelle": "Initiative en 1er Dépôt"
      },
      "classe": {
        "code": "PIONLOI",
        "libelle": "Proposition de loi"
      }
    },
    "type": {
      "code": "PION",
      "libelle": "Proposition de loi"
    }
  },
  "auteurs": [
    {
      "acteur": {
        "acteurRef": "PA1379",
        "qualite": "auteur"
      }
    }
  ],
  "notice": {
    "numNotice": "2732",
    "formule": "visant à expérimenter un service civique de défense",
    "adoptionConforme": false
  },
  "coSignataires": [
    {
      "acteurRef": "PA1031",
      "dateCosignature": "2015-04-15+02:00",
      "edite": false
    },
    {
      "acteurRef": "PA1498",
      "dateCosignature": "2015-04-15+02:00",
      "edite": false
    },
    {
      "acteurRef": "PA344492",
      "dateCosignature": "2015-04-15+02:00",
      "edite": false
    },
    {
      "acteurRef": "PA2664",
      "dateCosignature": "2015-04-15+02:00",
      "edite": false
    },
    {
      "acteurRef": "PA2083",
      "dateCosignature": "2015-04-15+02:00",
      "edite": false
    },
    {
      "acteurRef": "PA667",
      "dateCosignature": "2015-04-15+02:00",
      "edite": false
    },
    {
      "acteurRef": "PA330240",
      "dateCosignature": "2015-04-15+02:00",
      "edite": false
    },
    {
      "acteurRef": "PA608416",
      "dateCosignature": "2015-04-15+02:00",
      "edite": false
    },
    {
      "acteurRef": "PA230",
      "dateCosignature": "2015-04-15+02:00",
      "edite": false
    },
    {
      "acteurRef": "PA1874",
      "dateCosignature": "2015-04-15+02:00",
      "edite": false
    },
    {
      "acteurRef": "PA2011",
      "dateCosignature": "2015-04-15+02:00",
      "edite": false
    },
    {
      "acteurRef": "PA951",
      "dateCosignature": "2015-04-15+02:00",
      "edite": false
    },
    {
      "acteurRef": "PA606478",
      "dateCosignature": "2015-04-15+02:00",
      "edite": false
    },
    {
      "acteurRef": "PA266788",
      "dateCosignature": "2015-04-15+02:00",
      "edite": false
    },
    {
      "acteurRef": "PA687214",
      "dateCosignature": "2015-04-15+02:00",
      "edite": false
    },
    {
      "acteurRef": "PA267459",
      "dateCosignature": "2015-04-15+02:00",
      "edite": false
    },
    {
      "acteurRef": "PA267289",
      "dateCosignature": "2015-04-15+02:00",
      "edite": false
    },
    {
      "acteurRef": "PA336576",
      "dateCosignature": "2015-04-15+02:00",
      "edite": false
    },
    {
      "acteurRef": "PA266797",
      "dateCosignature": "2015-04-15+02:00",
      "edite": false
    },
    {
      "acteurRef": "PA1585",
      "dateCosignature": "2015-04-15+02:00",
      "edite": false
    },
    {
      "acteurRef": "PA267227",
      "dateCosignature": "2015-04-15+02:00",
      "edite": false
    },
    {
      "acteurRef": "PA2492",
      "dateCosignature": "2015-04-15+02:00",
      "edite": false
    },
    {
      "acteurRef": "PA314",
      "dateCosignature": "2015-04-15+02:00",
      "edite": false
    },
    {
      "acteurRef": "PA2250",
      "dateCosignature": "2015-04-15+02:00",
      "edite": false
    },
    {
      "acteurRef": "PA609442",
      "dateCosignature": "2015-04-15+02:00",
      "edite": false
    },
    {
      "acteurRef": "PA267506",
      "dateCosignature": "2015-04-15+02:00",
      "edite": false
    },
    {
      "acteurRef": "PA917",
      "dateCosignature": "2015-04-15+02:00",
      "edite": false
    },
    {
      "acteurRef": "PA746",
      "dateCosignature": "2015-04-15+02:00",
      "edite": false
    },
    {
      "acteurRef": "PA642759",
      "dateCosignature": "2015-04-15+02:00",
      "edite": false
    },
    {
      "acteurRef": "PA267075",
      "dateCosignature": "2015-04-15+02:00",
      "edite": false
    },
    {
      "acteurRef": "PA2084",
      "dateCosignature": "2015-04-15+02:00",
      "edite": false
    },
    {
      "acteurRef": "PA243",
      "dateCosignature": "2015-04-15+02:00",
      "edite": false
    },
    {
      "acteurRef": "PA332523",
      "dateCosignature": "2015-04-15+02:00",
      "edite": false
    },
    {
      "acteurRef": "PA2048",
      "dateCosignature": "2015-04-15+02:00",
      "edite": false
    },
    {
      "acteurRef": "PA1931",
      "dateCosignature": "2015-04-15+02:00",
      "edite": false
    },
    {
      "acteurRef": "PA607090",
      "dateCosignature": "2015-04-15+02:00",
      "edite": false
    },
    {
      "acteurRef": "PA266776",
      "dateCosignature": "2015-04-15+02:00",
      "edite": false
    },
    {
      "acteurRef": "PA609740",
      "dateCosignature": "2015-04-15+02:00",
      "edite": false
    },
    {
      "acteurRef": "PA1790",
      "dateCosignature": "2015-04-15+02:00",
      "edite": false
    },
    {
      "acteurRef": "PA608662",
      "dateCosignature": "2015-04-15+02:00",
      "edite": false
    },
    {
      "acteurRef": "PA267551",
      "dateCosignature": "2015-04-15+02:00",
      "edite": false
    },
    {
      "acteurRef": "PA266774",
      "dateCosignature": "2015-04-15+02:00",
      "edite": false
    },
    {
      "acteurRef": "PA2529",
      "dateCosignature": "2015-04-15+02:00",
      "edite": false
    },
    {
      "acteurRef": "PA2089",
      "dateCosignature": "2015-04-15+02:00",
      "edite": false
    },
    {
      "acteurRef": "PA267680",
      "dateCosignature": "2015-04-15+02:00",
      "edite": false
    },
    {
      "acteurRef": "PA267743",
      "dateCosignature": "2015-04-15+02:00",
      "edite": false
    },
    {
      "acteurRef": "PA2796",
      "dateCosignature": "2015-04-15+02:00",
      "edite": false
    },
    {
      "acteurRef": "PA2792",
      "dateCosignature": "2015-04-15+02:00",
      "edite": false
    },
    {
      "acteurRef": "PA923",
      "dateCosignature": "2015-04-15+02:00",
      "edite": false
    },
    {
      "acteurRef": "PA606098",
      "dateCosignature": "2015-10-23+02:00",
      "edite": false
    }
  ],
  "depotAmendements": {
    "amendementsSeance": {
      "amendable": true
    },
    "amendementsCommission": [
      {
        "organeRef": "PO59046",
        "amendable": true
      }
    ]
  }
}