{
  "xsiType": "texteLoi_Type",
  "uid": "PIONANR5L14B2633",
  "legislature": "14",
  "cycleDeVie": {
    "chrono": {
      "dateCreation": "2015-03-05T00:00:00.000+01:00",
      "dateDepot": "2015-03-11T00:00:00.000+01:00"
    }
  },
  "denominationStructurelle": "Proposition de loi",
  "provenance": "Texte Déposé",
  "titres": {
    "titrePrincipal": "proposition de loi visant à permettre la mise en place d'une convention d'organisation de la collecte sécurisée des denrées alimentaires invendues, encore consommables, au profit d'une ou plusieurs associations d'aide alimentaire, pour les grandes surfaces de plus de 400 mètres carrés",
    "titrePrincipalCourt": "collecte sécurisée des denrées alimentaires invendues"
  },
  "dossierRef": "DLR5L14N33805",
  "classification": {
    "famille": {
      "depot": {
        "code": "INITDEP",
        "libelle": "Initiative en 1er Dépôt"
      },
      "classe": {
        "code": "PIONLOI",
        "libelle": "Proposition de loi"
      }
    },
    "type": {
      "code": "PION",
      "libelle": "Proposition de loi"
    }
  },
  "auteurs": [
    {
      "acteur": {
        "acteurRef": "PA346886",
        "qualite": "auteur"
      }
    }
  ],
  "notice": {
    "numNotice": "2633",
    "formule": "visant à permettre la mise en place d'une convention d'organisation de la collecte sécurisée des denrées alimentaires invendues, encore consommables, au profit d'une ou plusieurs associations d'aide alimentaire, pour les grandes surfaces de plus de 400 mètres carrés",
    "adoptionConforme": false
  },
  "depotAmendements": {
    "amendementsSeance": {
      "amendable": false
    },
    "amendementsCommission": [
      {
        "organeRef": "PO419610",
        "amendable": true
      }
    ]
  }
}