{
  "xsiType": "texteLoi_Type",
  "uid": "AVISANR5L14B0930",
  "legislature": "14",
  "cycleDeVie": {
    "chrono": {
      "dateCreation": "2013-04-16T00:00:00.000+02:00",
      "dateDepot": "2013-04-16T00:00:00.000+02:00",
      "datePublication": "2013-04-29T00:00:00.000+02:00",
      "datePublicationWeb": "2013-04-25T15:30:00.000+02:00"
    }
  },
  "denominationStructurelle": "Avis",
  "provenance": "Commission",
  "titres": {
    "titrePrincipal": "avis sur le projet de loi  autorisant la ratification du traité de coopération en matière de défense entre la République française et la République de Djibouti (n°425)",
    "titrePrincipalCourt": "avis sur le projet de loi  autorisant la ratification du traité de coopération en matière de défense entre la République française et la République de Djibouti (n°425)"
  },
  "dossierRef": "DLR5L14N29357",
  "classification": {
    "famille": {
      "depot": {
        "code": "RAPINIT",
        "libelle": "Rapport sur une initiative"
      },
      "classe": {
        "code": "AVIS",
        "libelle": "Avis"
      }
    },
    "type": {
      "code": "AVIS",
      "libelle": "Avis"
    }
  },
  "auteurs": [
    {
      "acteur": {
        "acteurRef": "PA608158",
        "qualite": "rapporteur pour avis"
      }
    },
    {
      "organeRef": "PO59046"
    }
  ],
  "notice": {
    "numNotice": "930",
    "formule": "sur le projet de loi  autorisant la ratification du traité de coopération en matière de défense entre la République française et la République de Djibouti (n°425)",
    "adoptionConforme": false
  },
  "indexation": {
    "themes": {
      "@niveau": "1",
      "theme": {
        "libelleTheme": "LOIS DE FINANCES"
      }
    }
  },
  "imprimerie": {
    "prix": "1.5"
  }
}