{
  "xsiType": "texteLoi_Type",
  "uid": "PIONANR5L14B3605",
  "legislature": "14",
  "cycleDeVie": {
    "chrono": {
      "dateCreation": "2016-03-24T00:00:00.000+01:00",
      "dateDepot": "2016-03-29T00:00:00.000+02:00",
      "datePublication": "2016-04-05T00:00:00.000+02:00",
      "datePublicationWeb": "2016-03-30T11:05:00.000+02:00"
    }
  },
  "denominationStructurelle": "Proposition de loi",
  "provenance": "Texte Déposé",
  "titres": {
    "titrePrincipal": "proposition de loi relative aux violences au sein des couples et aux incidences de ces dernières sur les enfants",
    "titrePrincipalCourt": "violences couples"
  },
  "dossierRef": "DLR5L14N34784",
  "classification": {
    "famille": {
      "depot": {
        "code": "INITDEP",
        "libelle": "Initiative en 1er Dépôt"
      },
      "classe": {
        "code": "PIONLOI",
        "libelle": "Proposition de loi"
      }
    },
    "type": {
      "code": "PION",
      "libelle": "Proposition de loi"
    }
  },
  "auteurs": [
    {
      "acteur": {
        "acteurRef": "PA330684",
        "qualite": "auteur"
      }
    }
  ],
  "notice": {
    "numNotice": "3605",
    "formule": "relative aux violences au sein des couples et aux incidences de ces dernières sur les enfants",
    "adoptionConforme": false
  },
  "coSignataires": [
    {
      "acteurRef": "PA2971",
      "dateCosignature": "2016-03-29+02:00",
      "edite": false
    },
    {
      "acteurRef": "PA267813",
      "dateCosignature": "2016-03-29+02:00",
      "edite": false
    },
    {
      "acteurRef": "PA2073",
      "dateCosignature": "2016-03-29+02:00",
      "edite": false
    },
    {
      "acteurRef": "PA605036",
      "dateCosignature": "2016-03-29+02:00",
      "edite": false
    },
    {
      "acteurRef": "PA1001",
      "dateCosignature": "2016-03-29+02:00",
      "edite": false
    },
    {
      "acteurRef": "PA345897",
      "dateCosignature": "2016-03-29+02:00",
      "edite": false
    },
    {
      "acteurRef": "PA342935",
      "dateCosignature": "2016-03-29+02:00",
      "edite": false
    },
    {
      "acteurRef": "PA331582",
      "dateCosignature": "2016-03-29+02:00",
      "edite": false
    },
    {
      "acteurRef": "PA223837",
      "dateCosignature": "2016-03-29+02:00",
      "edite": false
    },
    {
      "acteurRef": "PA266788",
      "dateCosignature": "2016-03-29+02:00",
      "edite": false
    },
    {
      "acteurRef": "PA267551",
      "dateCosignature": "2016-03-29+02:00",
      "edite": false
    },
    {
      "acteurRef": "PA1521",
      "dateCosignature": "2016-03-29+02:00",
      "edite": false
    },
    {
      "acteurRef": "PA267506",
      "dateCosignature": "2016-03-29+02:00",
      "edite": false
    },
    {
      "acteurRef": "PA2048",
      "dateCosignature": "2016-03-29+02:00",
      "edite": false
    },
    {
      "acteurRef": "PA336316",
      "dateCosignature": "2016-03-29+02:00",
      "edite": false
    },
    {
      "acteurRef": "PA2124",
      "dateCosignature": "2016-03-29+02:00",
      "edite": false
    },
    {
      "acteurRef": "PA267227",
      "dateCosignature": "2016-03-29+02:00",
      "edite": false
    },
    {
      "acteurRef": "PA2529",
      "dateCosignature": "2016-03-29+02:00",
      "edite": false
    },
    {
      "acteurRef": "PA266774",
      "dateCosignature": "2016-03-29+02:00",
      "edite": false
    },
    {
      "acteurRef": "PA2011",
      "dateCosignature": "2016-03-29+02:00",
      "edite": false
    },
    {
      "acteurRef": "PA267260",
      "dateCosignature": "2016-03-29+02:00",
      "edite": false
    },
    {
      "acteurRef": "PA2377",
      "dateCosignature": "2016-03-29+02:00",
      "edite": false
    },
    {
      "acteurRef": "PA344492",
      "dateCosignature": "2016-03-29+02:00",
      "edite": false
    },
    {
      "acteurRef": "PA267673",
      "dateCosignature": "2016-03-29+02:00",
      "edite": false
    },
    {
      "acteurRef": "PA2936",
      "dateCosignature": "2016-03-29+02:00",
      "edite": false
    },
    {
      "acteurRef": "PA2664",
      "dateCosignature": "2016-03-29+02:00",
      "edite": false
    },
    {
      "acteurRef": "PA267794",
      "dateCosignature": "2016-03-29+02:00",
      "edite": false
    },
    {
      "acteurRef": "PA2667",
      "dateCosignature": "2016-03-29+02:00",
      "edite": false
    },
    {
      "acteurRef": "PA331481",
      "dateCosignature": "2016-03-29+02:00",
      "edite": false
    },
    {
      "acteurRef": "PA267289",
      "dateCosignature": "2016-03-29+02:00",
      "edite": false
    },
    {
      "acteurRef": "PA267358",
      "dateCosignature": "2016-03-29+02:00",
      "edite": false
    },
    {
      "acteurRef": "PA608380",
      "dateCosignature": "2016-03-29+02:00",
      "edite": false
    },
    {
      "acteurRef": "PA1857",
      "dateCosignature": "2016-03-29+02:00",
      "edite": false
    },
    {
      "acteurRef": "PA642759",
      "dateCosignature": "2016-03-29+02:00",
      "edite": false
    },
    {
      "acteurRef": "PA1574",
      "dateCosignature": "2016-03-29+02:00",
      "edite": false
    },
    {
      "acteurRef": "PA335758",
      "dateCosignature": "2016-03-29+02:00",
      "edite": false
    },
    {
      "acteurRef": "PA267628",
      "dateCosignature": "2016-03-29+02:00",
      "edite": false
    },
    {
      "acteurRef": "PA687214",
      "dateCosignature": "2016-03-29+02:00",
      "edite": false
    },
    {
      "acteurRef": "PA267246",
      "dateCosignature": "2016-03-29+02:00",
      "edite": false
    },
    {
      "acteurRef": "PA268051",
      "dateCosignature": "2016-03-29+02:00",
      "edite": false
    },
    {
      "acteurRef": "PA266797",
      "dateCosignature": "2016-03-29+02:00",
      "edite": false
    },
    {
      "acteurRef": "PA336576",
      "dateCosignature": "2016-03-29+02:00",
      "edite": false
    },
    {
      "acteurRef": "PA1459",
      "dateCosignature": "2016-03-29+02:00",
      "edite": false
    },
    {
      "acteurRef": "PA2597",
      "dateCosignature": "2016-03-29+02:00",
      "edite": false
    },
    {
      "acteurRef": "PA267576",
      "dateCosignature": "2016-03-29+02:00",
      "edite": false
    },
    {
      "acteurRef": "PA331567",
      "dateCosignature": "2016-04-05+02:00",
      "edite": false
    },
    {
      "acteurRef": "PA268019",
      "dateCosignature": "2016-07-08+02:00",
      "edite": false
    }
  ],
  "depotAmendements": {
    "amendementsSeance": {
      "amendable": false
    },
    "amendementsCommission": [
      {
        "organeRef": "PO59051",
        "amendable": true
      }
    ]
  }
}