{
  "xsiType": "texteLoi_Type",
  "uid": "PNREANR5L14B1394",
  "legislature": "14",
  "cycleDeVie": {
    "chrono": {
      "dateCreation": "2013-09-25T00:00:00.000+02:00",
      "dateDepot": "2013-09-25T00:00:00.000+02:00",
      "datePublicationWeb": "2013-09-27T15:15:00.000+02:00"
    }
  },
  "denominationStructurelle": "Proposition de résolution",
  "provenance": "Texte Déposé",
  "titres": {
    "titrePrincipal": "proposition de résolution tendant à la création d'une commission d'enquête sur l'organisation et sur les dysfonctionnements du régime social des indépendants",
    "titrePrincipalCourt": "Commission d'enquête sur l'organisation et sur les dysfonctionnements du Régime Social des Indépendants"
  },
  "dossierRef": "DLR5L14N31313",
  "classification": {
    "famille": {
      "depot": {
        "code": "INITDEP",
        "libelle": "Initiative en 1er Dépôt"
      },
      "classe": {
        "code": "PIONRES",
        "libelle": "Proposition de résolution"
      },
      "espece": {
        "code": "COMENQ",
        "libelle": "tendant à la création d'une commission d'enquête"
      }
    },
    "type": {
      "code": "PNRE",
      "libelle": "Proposition de résolution"
    },
    "sousType": {
      "code": "COMENQ",
      "libelle": "tendant à la création d'une commission d'enquête"
    }
  },
  "auteurs": [
    {
      "acteur": {
        "acteurRef": "PA609726",
        "qualite": "auteur"
      }
    }
  ],
  "notice": {
    "numNotice": "1394",
    "formule": "tendant à la création d'une commission d'enquête sur l'organisation et sur les dysfonctionnements du régime social des indépendants",
    "adoptionConforme": false
  },
  "coSignataires": [
    {
      "acteurRef": "PA608662",
      "dateCosignature": "2013-09-25+02:00",
      "edite": false
    },
    {
      "acteurRef": "PA605036",
      "dateCosignature": "2013-09-25+02:00",
      "edite": false
    },
    {
      "acteurRef": "PA607489",
      "dateCosignature": "2013-09-25+02:00",
      "edite": false
    },
    {
      "acteurRef": "PA607846",
      "dateCosignature": "2013-09-25+02:00",
      "edite": false
    },
    {
      "acteurRef": "PA608826",
      "dateCosignature": "2013-09-25+02:00",
      "edite": false
    },
    {
      "acteurRef": "PA605782",
      "dateCosignature": "2013-09-25+02:00",
      "edite": false
    }
  ]
}