{
  "xsiType": "texteLoi_Type",
  "uid": "PRJLANR5L14B3367",
  "legislature": "14",
  "cycleDeVie": {
    "chrono": {
      "dateCreation": "2015-12-16T00:00:00.000+01:00",
      "dateDepot": "2015-12-16T00:00:00.000+01:00",
      "datePublication": "2015-12-17T00:00:00.000+01:00",
      "datePublicationWeb": "2015-12-17T11:30:00.000+01:00"
    }
  },
  "denominationStructurelle": "Projet de loi",
  "provenance": "Texte Déposé",
  "titres": {
    "titrePrincipal": "projet de loi de finances pour 2016",
    "titrePrincipalCourt": "PLF pour 2016"
  },
  "dossierRef": "DLR5L14N34104",
  "classification": {
    "famille": {
      "depot": {
        "code": "INITNAV",
        "libelle": "Initiative en Navette"
      },
      "classe": {
        "code": "PRJLOI",
        "libelle": "Projet de loi"
      },
      "espece": {
        "code": "FIN",
        "libelle": "de finances"
      }
    },
    "type": {
      "code": "PRJL",
      "libelle": "Projet de loi"
    },
    "sousType": {
      "code": "FIN",
      "libelle": "de finances",
      "libelleEdition": "de finances"
    }
  },
  "auteurs": [
    {
      "organeRef": "PO644420"
    }
  ],
  "notice": {
    "numNotice": "3367",
    "formule": "pour 2016, adopté par l'Assemblée nationale en nouvelle lecture",
    "adoptionConforme": false
  },
  "depotAmendements": {
    "amendementsSeance": {
      "amendable": true
    },
    "amendementsCommission": [
      {
        "organeRef": "PO59048",
        "amendable": true
      }
    ]
  }
}