{
  "xsiType": "DossierMissionControle_Type",
  "uid": "DLR5L14N28942",
  "legislature": "14",
  "titreDossier": {
    "titre": "PACs du 6 juin au 13 juillet 2012",
    "titreChemin": "06_13072012_PACs"
  },
  "procedureParlementaire": {
    "code": "19",
    "libelle": "Rapport d'information sans mission"
  },
  "actesLegislatifs": [
    {
      "xsiType": "Etape_Type",
      "uid": "L14-AN20-28942",
      "codeActe": "AN20",
      "libelleActe": {
        "nomCanonique": "Travaux"
      },
      "organeRef": "PO644420",
      "actesLegislatifs": [
        {
          "xsiType": "DepotRapport_Type",
          "uid": "L14-VD158982",
          "codeActe": "AN20-RAPPORT",
          "libelleActe": {
            "nomCanonique": "Dépôt de rapport",
            "libelleCourt": "Dépôt de rapport"
          },
          "organeRef": "PO415287",
          "dateActe": "2012-07-25T00:00:00.000+02:00",
          "texteAssocieRef": "RINFANR5L14B0129"
        }
      ]
    }
  ],
  "indexation": {
    "themes": {
      "@niveau": "1",
      "theme": {
        "libelleTheme": "DIFFICULTES DES ENTREPRISES"
      }
    }
  }
}