{
  "xsiType": "texteLoi_Type",
  "uid": "PRJLANR5L14B0006",
  "legislature": "14",
  "cycleDeVie": {
    "chrono": {
      "dateCreation": "2012-06-27T00:00:00.000+02:00",
      "dateDepot": "2012-06-27T00:00:00.000+02:00",
      "datePublication": "2012-07-03T00:00:00.000+02:00",
      "datePublicationWeb": "2012-06-29T16:00:00.000+02:00"
    }
  },
  "denominationStructurelle": "Projet de loi",
  "provenance": "Texte Déposé",
  "titres": {
    "titrePrincipal": "projet de loi autorisant l'approbation de l'accord de coopération entre le Gouvernement de la République française et le Gouvernement de la République du Kazakhstan dans le domaine de l'exploration et de l'utilisation de l'espace extra atmosphérique à des fins pacifiques",
    "titrePrincipalCourt": "accord coopération France-Kazakhstan sur l'utilisation de l'espace extra atmosphérique"
  },
  "dossierRef": "DLR5L14N28859",
  "classification": {
    "famille": {
      "depot": {
        "code": "INITDEP",
        "libelle": "Initiative en 1er Dépôt"
      },
      "classe": {
        "code": "PRJLOI",
        "libelle": "Projet de loi"
      },
      "espece": {
        "code": "AUTRATCONV",
        "libelle": "autorisant la ratification d'une convention"
      }
    },
    "type": {
      "code": "PRJL",
      "libelle": "Projet de loi"
    },
    "sousType": {
      "code": "AUTRATCONV",
      "libelle": "autorisant la ratification d'une convention",
      "libelleEdition": "autorisant la ratification d'une convention"
    }
  },
  "auteurs": [
    {
      "acteur": {
        "acteurRef": "PA328",
        "qualite": "auteur"
      }
    }
  ],
  "notice": {
    "numNotice": "6",
    "formule": "autorisant l'approbation de l'accord de coopération entre le Gouvernement de la République française et le Gouvernement de la République du Kazakhstan dans le domaine de l'exploration et de l'utilisation de l'espace extra atmosphérique à des fins pacifiques",
    "adoptionConforme": false
  },
  "imprimerie": {
    "prix": "0.75"
  },
  "coSignataires": [
    {
      "acteurRef": "PA1268",
      "dateCosignature": "2012-06-27+02:00",
      "edite": true
    }
  ],
  "depotAmendements": {
    "amendementsSeance": {
      "amendable": true
    },
    "amendementsCommission": [
      {
        "organeRef": "PO59047",
        "amendable": true
      }
    ]
  }
}