{
  "xsiType": "rapportParlementaire_Type",
  "uid": "RAPPSNR5S259B0447",
  "cycleDeVie": {
    "chrono": {
      "dateCreation": "2016-03-14T00:00:00.000+01:00",
      "dateDepot": "2016-03-09T00:00:00.000+01:00"
    }
  },
  "denominationStructurelle": "Rapport",
  "provenance": "Commission",
  "titres": {
    "titrePrincipal": "rapport  sur le projet de loi constitutionnelle, adopté, par l'Assemblée nationale, de protection de la Nation (n°395).",
    "titrePrincipalCourt": "rapport  sur le projet de loi constitutionnelle, adopté, par l'Assemblée nationale, de protection de la Nation (n°395)."
  },
  "dossierRef": "DLR5L14N34570",
  "classification": {
    "famille": {
      "depot": {
        "code": "RAPINIT",
        "libelle": "Rapport sur une initiative"
      },
      "classe": {
        "code": "RAPPORT",
        "libelle": "Rapport"
      }
    },
    "type": {
      "code": "RAPP",
      "libelle": "Rapport"
    }
  },
  "auteurs": [
    {
      "acteur": {
        "acteurRef": "PA429858",
        "qualite": "rapporteur"
      }
    },
    {
      "organeRef": "PO211495"
    }
  ],
  "notice": {
    "numNotice": "447",
    "formule": "sur le projet de loi constitutionnelle, adopté, par l'Assemblée nationale, de protection de la Nation (n°395).",
    "adoptionConforme": false
  }
}