{
  "xsiType": "texteLoi_Type",
  "uid": "PRJLSNR5S199B0582",
  "cycleDeVie": {
    "chrono": {
      "dateCreation": "2013-05-17T00:00:00.000+02:00",
      "dateDepot": "2013-05-16T00:00:00.000+02:00",
      "datePublication": "2013-05-27T00:00:00.000+02:00"
    }
  },
  "denominationStructurelle": "Projet de loi",
  "provenance": "Texte Déposé",
  "titres": {
    "titrePrincipal": "projet de loi portant diverses dispositions d'adaptation dans le domaine de la justice en application du droit de l'Union européenne et des engagements internationaux de la France",
    "titrePrincipalCourt": "adaptation de la justice au droit de l'Union européenne et aux engagements internationaux de la France"
  },
  "dossierRef": "DLR5L14N29788",
  "classification": {
    "famille": {
      "depot": {
        "code": "INITNAV",
        "libelle": "Initiative en Navette"
      },
      "classe": {
        "code": "PRJLOI",
        "libelle": "Projet de loi"
      }
    },
    "type": {
      "code": "PRJL",
      "libelle": "Projet de loi"
    }
  },
  "auteurs": [
    {
      "organeRef": "PO78718"
    }
  ],
  "notice": {
    "numNotice": "582",
    "formule": ", adopté par l'Assemblée nationale après engagement de la procédure accélérée, portant diverses dispositions d'adaptation dans le domaine de la justice en application du droit de l'Union européenne et des engagements internationaux de la France",
    "adoptionConforme": false
  },
  "indexation": {
    "themes": {
      "@niveau": "1",
      "theme": {
        "libelleTheme": "POLITIQUE ECONOMIQUE ET SOCIALE"
      }
    }
  },
  "depotAmendements": {
    "amendementsSeance": {
      "amendable": false
    }
  }
}