{
  "xsiType": "texteLoi_Type",
  "uid": "PNREANR5L14BTC4418",
  "legislature": "14",
  "cycleDeVie": {
    "chrono": {
      "dateCreation": "2017-01-25T00:00:00.000+01:00",
      "dateDepot": "2017-01-25T00:00:00.000+01:00",
      "datePublication": "2017-01-30T00:00:00.000+01:00",
      "datePublicationWeb": "2017-01-25T20:00:00.000+01:00"
    }
  },
  "denominationStructurelle": "Proposition de résolution",
  "provenance": "Texte Déposé",
  "titres": {
    "titrePrincipal": "proposition de résolution européenne sur le texte adopté par la commission des affaires européennes sur la proposition de résolution européenne de M. Alain Bocquet et plusieurs de ses collègues pour une Conférence des parties . (n°4379)",
    "titrePrincipalCourt": "COP de la finance mondiale, l'harmonisation et la justice fiscales"
  },
  "dossierRef": "DLR5L14N35467",
  "classification": {
    "famille": {
      "depot": {
        "code": "INITDEP",
        "libelle": "Initiative en 1er Dépôt"
      },
      "classe": {
        "code": "PIONRES",
        "libelle": "Proposition de résolution"
      },
      "espece": {
        "code": "TVXINSTITEUROP",
        "libelle": "sur les travaux conduits par les institutions européennes"
      }
    },
    "type": {
      "code": "PNRE",
      "libelle": "Proposition de résolution"
    },
    "sousType": {
      "code": "TVXINSTITEUROP",
      "libelle": "sur les travaux conduits par les institutions européennes"
    },
    "statutAdoption": "ADOPTCOM"
  },
  "auteurs": [
    {
      "acteur": {
        "acteurRef": "PA551",
        "qualite": "rapporteur"
      }
    },
    {
      "organeRef": "PO59048"
    }
  ],
  "notice": {
    "numNotice": "4418",
    "formule": "sur le texte adopté par la commission des affaires européennes sur la proposition de résolution européenne de M. Alain Bocquet et plusieurs de ses collègues pour une Conférence des parties . (n°4379)",
    "adoptionConforme": false
  },
  "imprimerie": {
    "prix": "3.0"
  }
}