{
  "xsiType": "texteLoi_Type",
  "uid": "PIONANR5L14B2915",
  "legislature": "14",
  "cycleDeVie": {
    "chrono": {
      "dateCreation": "2015-06-30T00:00:00.000+02:00",
      "dateDepot": "2015-06-30T00:00:00.000+02:00",
      "datePublicationWeb": "2015-07-10T15:20:00.000+02:00"
    }
  },
  "denominationStructurelle": "Proposition de loi",
  "provenance": "Texte Déposé",
  "titres": {
    "titrePrincipal": "proposition de loi organique visant à fixer le nombre de députés à quatre cent cinquante",
    "titrePrincipalCourt": "Baisse du nombre de députés à quatre cent cinquante"
  },
  "dossierRef": "DLR5L14N34077",
  "classification": {
    "famille": {
      "depot": {
        "code": "INITDEP",
        "libelle": "Initiative en 1er Dépôt"
      },
      "classe": {
        "code": "PIONLOI",
        "libelle": "Proposition de loi"
      },
      "espece": {
        "code": "ORG",
        "libelle": "organique"
      }
    },
    "type": {
      "code": "PION",
      "libelle": "Proposition de loi"
    },
    "sousType": {
      "code": "ORG",
      "libelle": "organique",
      "libelleEdition": "organique"
    }
  },
  "auteurs": [
    {
      "acteur": {
        "acteurRef": "PA332747",
        "qualite": "auteur"
      }
    }
  ],
  "notice": {
    "numNotice": "2915",
    "formule": "visant à fixer le nombre de députés à quatre cent cinquante",
    "adoptionConforme": false
  },
  "coSignataires": [
    {
      "acteurRef": "PA609520",
      "dateCosignature": "2015-06-30+02:00",
      "edite": true
    },
    {
      "acteurRef": "PA610427",
      "dateCosignature": "2015-06-30+02:00",
      "edite": false
    },
    {
      "acteurRef": "PA605963",
      "dateCosignature": "2015-06-30+02:00",
      "edite": false
    },
    {
      "acteurRef": "PA606258",
      "dateCosignature": "2015-06-30+02:00",
      "edite": false
    },
    {
      "acteurRef": "PA588872",
      "dateCosignature": "2015-06-30+02:00",
      "edite": false
    },
    {
      "acteurRef": "PA605518",
      "dateCosignature": "2015-06-30+02:00",
      "edite": false
    },
    {
      "acteurRef": "PA2045",
      "dateCosignature": "2015-06-30+02:00",
      "edite": false
    },
    {
      "acteurRef": "PA609816",
      "dateCosignature": "2015-06-30+02:00",
      "edite": false
    },
    {
      "acteurRef": "PA607619",
      "dateCosignature": "2015-06-30+02:00",
      "edite": false
    },
    {
      "acteurRef": "PA610002",
      "dateCosignature": "2015-06-30+02:00",
      "edite": false
    }
  ],
  "depotAmendements": {
    "amendementsSeance": {
      "amendable": false
    },
    "amendementsCommission": [
      {
        "organeRef": "PO59051",
        "amendable": true
      }
    ]
  }
}