{
  "xsiType": "rapportParlementaire_Type",
  "uid": "RAPPANR5L14B2736",
  "legislature": "14",
  "cycleDeVie": {
    "chrono": {
      "dateCreation": "2015-04-16T00:00:00.000+02:00",
      "dateDepot": "2015-04-16T00:00:00.000+02:00",
      "datePublication": "2015-05-15T00:00:00.000+02:00",
      "datePublicationWeb": "2015-05-12T11:30:00.000+02:00"
    }
  },
  "denominationStructurelle": "Rapport",
  "provenance": "Commission",
  "titres": {
    "titrePrincipal": "rapport sur , en nouvelle lecture,  le projet de loi , modifié par le Sénat, relatif à la transition énergétique pour la croissance verte (n°2611)",
    "titrePrincipalCourt": "rapport sur , en nouvelle lecture,  le projet de loi , modifié par le Sénat, relatif à la transition énergétique pour la croissance verte (n°2611)"
  },
  "dossierRef": "DLR5L14N33352",
  "classification": {
    "famille": {
      "depot": {
        "code": "RAPINIT",
        "libelle": "Rapport sur une initiative"
      },
      "classe": {
        "code": "RAPPORT",
        "libelle": "Rapport"
      }
    },
    "type": {
      "code": "RAPP",
      "libelle": "Rapport"
    },
    "statutAdoption": "ADOPTCOM"
  },
  "auteurs": [
    {
      "acteur": {
        "acteurRef": "PA342415",
        "qualite": "rapporteur"
      }
    },
    {
      "acteur": {
        "acteurRef": "PA605261",
        "qualite": "rapporteur"
      }
    },
    {
      "acteur": {
        "acteurRef": "PA2430",
        "qualite": "rapporteur"
      }
    },
    {
      "acteur": {
        "acteurRef": "PA610681",
        "qualite": "rapporteur"
      }
    },
    {
      "acteur": {
        "acteurRef": "PA609016",
        "qualite": "rapporteur"
      }
    },
    {
      "organeRef": "PO702808"
    }
  ],
  "notice": {
    "numNotice": "2736",
    "formule": "sur , en nouvelle lecture,  le projet de loi , modifié par le Sénat, relatif à la transition énergétique pour la croissance verte (n°2611)",
    "adoptionConforme": false
  },
  "imprimerie": {
    "prix": "15.0"
  }
}