{
  "xsiType": "texteLoi_Type",
  "uid": "PIONANR5L14B1370",
  "legislature": "14",
  "cycleDeVie": {
    "chrono": {
      "dateCreation": "2013-09-11T00:00:00.000+02:00",
      "dateDepot": "2013-09-18T00:00:00.000+02:00",
      "datePublicationWeb": "2013-09-26T13:30:00.000+02:00"
    }
  },
  "denominationStructurelle": "Proposition de loi",
  "provenance": "Texte Déposé",
  "titres": {
    "titrePrincipal": "proposition de loi relative à l'acquisition de la nationalité française",
    "titrePrincipalCourt": "Acquisition de la nationalité française"
  },
  "dossierRef": "DLR5L14N31135",
  "classification": {
    "famille": {
      "depot": {
        "code": "INITDEP",
        "libelle": "Initiative en 1er Dépôt"
      },
      "classe": {
        "code": "PIONLOI",
        "libelle": "Proposition de loi"
      }
    },
    "type": {
      "code": "PION",
      "libelle": "Proposition de loi"
    }
  },
  "auteurs": [
    {
      "acteur": {
        "acteurRef": "PA606888",
        "qualite": "auteur"
      }
    }
  ],
  "notice": {
    "numNotice": "1370",
    "formule": "relative à l'acquisition de la nationalité française",
    "adoptionConforme": false
  },
  "coSignataires": [
    {
      "acteurRef": "PA267457",
      "dateCosignature": "2013-09-18+02:00",
      "edite": false
    },
    {
      "acteurRef": "PA609726",
      "dateCosignature": "2013-09-18+02:00",
      "edite": false
    },
    {
      "acteurRef": "PA687214",
      "dateCosignature": "2013-09-18+02:00",
      "edite": false
    },
    {
      "acteurRef": "PA856",
      "dateCosignature": "2013-09-18+02:00",
      "edite": false
    },
    {
      "acteurRef": "PA267762",
      "dateCosignature": "2013-09-18+02:00",
      "edite": false
    },
    {
      "acteurRef": "PA267450",
      "dateCosignature": "2013-09-18+02:00",
      "edite": false
    },
    {
      "acteurRef": "PA267289",
      "dateCosignature": "2013-09-18+02:00",
      "edite": false
    },
    {
      "acteurRef": "PA1152",
      "dateCosignature": "2013-09-18+02:00",
      "edite": false
    },
    {
      "acteurRef": "PA266774",
      "dateCosignature": "2013-09-18+02:00",
      "edite": false
    },
    {
      "acteurRef": "PA267813",
      "dateCosignature": "2013-09-18+02:00",
      "edite": false
    },
    {
      "acteurRef": "PA610830",
      "dateCosignature": "2013-09-18+02:00",
      "edite": false
    },
    {
      "acteurRef": "PA266797",
      "dateCosignature": "2013-09-18+02:00",
      "edite": false
    },
    {
      "acteurRef": "PA267227",
      "dateCosignature": "2013-09-18+02:00",
      "edite": false
    },
    {
      "acteurRef": "PA1574",
      "dateCosignature": "2013-09-18+02:00",
      "edite": false
    },
    {
      "acteurRef": "PA1778",
      "dateCosignature": "2013-09-18+02:00",
      "edite": false
    },
    {
      "acteurRef": "PA267551",
      "dateCosignature": "2013-09-18+02:00",
      "edite": false
    },
    {
      "acteurRef": "PA2011",
      "dateCosignature": "2013-09-18+02:00",
      "edite": false
    },
    {
      "acteurRef": "PA2084",
      "dateCosignature": "2013-09-18+02:00",
      "edite": false
    },
    {
      "acteurRef": "PA606098",
      "dateCosignature": "2013-09-18+02:00",
      "edite": false
    },
    {
      "acteurRef": "PA334906",
      "dateCosignature": "2013-09-18+02:00",
      "edite": false
    },
    {
      "acteurRef": "PA2250",
      "dateCosignature": "2013-09-18+02:00",
      "edite": false
    },
    {
      "acteurRef": "PA2664",
      "dateCosignature": "2013-09-18+02:00",
      "edite": false
    },
    {
      "acteurRef": "PA267013",
      "dateCosignature": "2013-09-18+02:00",
      "edite": false
    },
    {
      "acteurRef": "PA2775",
      "dateCosignature": "2013-09-18+02:00",
      "edite": false
    },
    {
      "acteurRef": "PA2796",
      "dateCosignature": "2013-09-18+02:00",
      "edite": false
    },
    {
      "acteurRef": "PA334843",
      "dateCosignature": "2013-09-18+02:00",
      "edite": false
    },
    {
      "acteurRef": "PA2700",
      "dateCosignature": "2013-10-11+02:00",
      "edite": false
    }
  ],
  "depotAmendements": {
    "amendementsSeance": {
      "amendable": false
    },
    "amendementsCommission": [
      {
        "organeRef": "PO59051",
        "amendable": true
      }
    ]
  }
}