{
  "xsiType": "texteLoi_Type",
  "uid": "PRJLANR5L14B3128",
  "legislature": "14",
  "cycleDeVie": {
    "chrono": {
      "dateCreation": "2015-10-14T00:00:00.000+02:00",
      "dateDepot": "2015-10-14T00:00:00.000+02:00",
      "datePublication": "2016-01-26T00:00:00.000+01:00",
      "datePublicationWeb": "2015-10-15T10:45:00.000+02:00"
    }
  },
  "denominationStructurelle": "Projet de loi",
  "provenance": "Texte Déposé",
  "titres": {
    "titrePrincipal": "projet de loi portant diverses dispositions relatives à la maîtrise de l'immigration",
    "titrePrincipalCourt": "Droit des étrangers"
  },
  "dossierRef": "DLR5L14N33345",
  "classification": {
    "famille": {
      "depot": {
        "code": "INITNAV",
        "libelle": "Initiative en Navette"
      },
      "classe": {
        "code": "PRJLOI",
        "libelle": "Projet de loi"
      }
    },
    "type": {
      "code": "PRJL",
      "libelle": "Projet de loi"
    }
  },
  "auteurs": [
    {
      "organeRef": "PO644420"
    }
  ],
  "notice": {
    "numNotice": "3128",
    "formule": ", modifié par le Sénat, portant diverses dispositions relatives à la maîtrise de l'immigration",
    "adoptionConforme": false
  },
  "depotAmendements": {
    "amendementsSeance": {
      "amendable": false
    },
    "amendementsCommission": [
      {
        "organeRef": "PO59051",
        "amendable": true
      }
    ]
  }
}