{
  "xsiType": "DossierLegislatif_Type",
  "uid": "DLR5L14N35820",
  "legislature": "14",
  "titreDossier": {
    "titre": "Environnement : consultation locale sur les projets susceptibles ayant une incidence sur l'environnement",
    "titreChemin": "ratification_ordonnance-2016-488",
    "senatChemin": "http://www.senat.fr/dossier-legislatif/pjl16-569.html"
  },
  "procedureParlementaire": {
    "code": "1",
    "libelle": "Projet de loi ordinaire"
  },
  "initiateur": {
    "acteurs": [
      {
        "acteurRef": "PA785",
        "mandatRef": "PM715797"
      }
    ]
  },
  "actesLegislatifs": [
    {
      "xsiType": "Etape_Type",
      "uid": "L14-SN1-35820",
      "codeActe": "SN1",
      "libelleActe": {
        "nomCanonique": "1ère lecture (1ère assemblée saisie)",
        "libelleCourt": "1ère lecture"
      },
      "organeRef": "PO78718",
      "actesLegislatifs": [
        {
          "xsiType": "DepotInitiative_Type",
          "uid": "L14-VD181915DI",
          "codeActe": "SN1-DEPOT",
          "libelleActe": {
            "nomCanonique": "1er dépôt d'une initiative.",
            "libelleCourt": "1er dépôt d'une initiative."
          },
          "organeRef": "PO78718",
          "dateActe": "2017-04-27T00:00:00.000+02:00",
          "texteAssocieRef": "PRJLSNR5S279B0569"
        },
        {
          "xsiType": "Etape_Type",
          "uid": "L14-SN1-COM-35820",
          "codeActe": "SN1-COM",
          "libelleActe": {
            "nomCanonique": "Travaux des commissions",
            "libelleCourt": "Travaux des commissions"
          },
          "organeRef": "PO78718",
          "actesLegislatifs": [
            {
              "xsiType": "Etape_Type",
              "uid": "L14-VD181916CF",
              "codeActe": "SN1-COM-FOND",
              "libelleActe": {
                "nomCanonique": "Travaux de la commission saisie au fond",
                "libelleCourt": "Travaux de la commission saisie au fond"
              },
              "organeRef": "PO516754",
              "actesLegislatifs": [
                {
                  "xsiType": "SaisieComFond_Type",
                  "uid": "L14-VD181916CFS",
                  "codeActe": "SN1-COM-FOND-SAISIE",
                  "libelleActe": {
                    "nomCanonique": "Renvoi en commission au fond",
                    "libelleCourt": "Renvoi en commission au fond"
                  },
                  "organeRef": "PO516754",
                  "dateActe": "2017-04-27T00:00:00.000+02:00"
                }
              ]
            }
          ]
        }
      ]
    }
  ]
}