{
  "xsiType": "DossierLegislatif_Type",
  "uid": "DLR5L14N28864",
  "legislature": "14",
  "titreDossier": {
    "titre": "Traités et conventions : amendement à la convention sur la protection physique des matières nucléaires",
    "titreChemin": "protection_matieres_nucleaires",
    "senatChemin": "http://www.senat.fr/dossier-legislatif/pjl11-720.html"
  },
  "procedureParlementaire": {
    "code": "6",
    "libelle": "Projet de ratification des traités et conventions"
  },
  "initiateur": {
    "acteurs": [
      {
        "acteurRef": "PA328",
        "mandatRef": "PM653228"
      },
      {
        "acteurRef": "PA1268",
        "mandatRef": "PM653525"
      }
    ]
  },
  "actesLegislatifs": [
    {
      "xsiType": "Etape_Type",
      "uid": "L14-AN1-28864",
      "codeActe": "AN1",
      "libelleActe": {
        "nomCanonique": "1ère lecture (1ère assemblée saisie)",
        "libelleCourt": "1ère lecture"
      },
      "organeRef": "PO644420",
      "actesLegislatifs": [
        {
          "xsiType": "DepotInitiative_Type",
          "uid": "L14-VD158449DI",
          "codeActe": "AN1-DEPOT",
          "libelleActe": {
            "nomCanonique": "1er dépôt d'une initiative.",
            "libelleCourt": "1er dépôt d'une initiative."
          },
          "organeRef": "PO644420",
          "dateActe": "2012-06-27T00:00:00.000+02:00",
          "texteAssocieRef": "PRJLANR5L14B0011"
        },
        {
          "xsiType": "EtudeImpact_Type",
          "uid": "L14-VD158449ETI",
          "codeActe": "AN1-ETI",
          "libelleActe": {
            "nomCanonique": "Etude d'impact",
            "libelleCourt": "Etude d'impact"
          },
          "organeRef": "PO644420",
          "dateActe": "2012-06-27T00:00:00.000+02:00",
          "contributionInternaute": {
            "dateOuverture": "2012-06-30+02:00",
            "dateFermeture": "2012-07-25+02:00"
          },
          "texteAssocieRef": "ETDIANR5L14B0011"
        },
        {
          "xsiType": "Etape_Type",
          "uid": "L14-AN1-COM-28864",
          "codeActe": "AN1-COM",
          "libelleActe": {
            "nomCanonique": "Travaux des commissions",
            "libelleCourt": "Travaux des commissions"
          },
          "organeRef": "PO644420",
          "actesLegislatifs": [
            {
              "xsiType": "Etape_Type",
              "uid": "L14-VD158450CF",
              "codeActe": "AN1-COM-FOND",
              "libelleActe": {
                "nomCanonique": "Travaux de la commission saisie au fond",
                "libelleCourt": "Travaux de la commission saisie au fond"
              },
              "organeRef": "PO59047",
              "actesLegislatifs": [
                {
                  "xsiType": "SaisieComFond_Type",
                  "uid": "L14-VD158450CFS",
                  "codeActe": "AN1-COM-FOND-SAISIE",
                  "libelleActe": {
                    "nomCanonique": "Renvoi en commission au fond",
                    "libelleCourt": "Renvoi en commission au fond"
                  },
                  "organeRef": "PO59047",
                  "dateActe": "2012-06-27T00:00:00.000+02:00"
                },
                {
                  "xsiType": "NominRapporteurs_Type",
                  "uid": "L14-VD158696",
                  "codeActe": "AN1-COM-FOND-NOMIN",
                  "libelleActe": {
                    "nomCanonique": "Nomination de rapporteur",
                    "libelleCourt": "Nomination de rapporteur"
                  },
                  "organeRef": "PO59047",
                  "dateActe": "2012-07-11T00:00:00.000+02:00",
                  "rapporteurs": [
                    {
                      "acteurRef": "PA840",
                      "typeRapporteur": "rapporteur"
                    }
                  ]
                },
                {
                  "xsiType": "DiscussionCommission_Type",
                  "uid": "L14-VD158631R16147",
                  "codeActe": "AN1-COM-FOND-REUNION",
                  "libelleActe": {
                    "nomCanonique": "Réunion de commission",
                    "libelleCourt": "Réunion de commission"
                  },
                  "organeRef": "PO59047",
                  "dateActe": "2012-07-11T10:00:00.000+02:00",
                  "odjRef": "RUANR5L14S2012IDC414963PT16147",
                  "reunionRef": "RUANR5L14S2012IDC414963"
                },
                {
                  "xsiType": "DiscussionCommission_Type",
                  "uid": "L14-VD158631R16183",
                  "codeActe": "AN1-COM-FOND-REUNION",
                  "libelleActe": {
                    "nomCanonique": "Réunion de commission",
                    "libelleCourt": "Réunion de commission"
                  },
                  "organeRef": "PO59047",
                  "dateActe": "2012-07-24T17:30:00.000+02:00",
                  "odjRef": "RUANR5L14S2012IDC415033PT16183",
                  "reunionRef": "RUANR5L14S2012IDC415033"
                },
                {
                  "xsiType": "DepotRapport_Type",
                  "uid": "L14-VD158932",
                  "codeActe": "AN1-COM-FOND-RAPPORT",
                  "libelleActe": {
                    "nomCanonique": "Dépôt de rapport",
                    "libelleCourt": "Dépôt de rapport"
                  },
                  "organeRef": "PO59047",
                  "dateActe": "2012-07-24T00:00:00.000+02:00",
                  "texteAssocieRef": "RAPPANR5L14B0125"
                }
              ]
            }
          ]
        },
        {
          "xsiType": "Etape_Type",
          "uid": "L14-AN1-DEBATS-28864",
          "codeActe": "AN1-DEBATS",
          "libelleActe": {
            "nomCanonique": "Discussion en séance publique",
            "libelleCourt": "Discussion en séance publique"
          },
          "organeRef": "PO644420",
          "actesLegislatifs": [
            {
              "xsiType": "DiscussionSeancePublique_Type",
              "uid": "L14-VD158470S26345",
              "codeActe": "AN1-DEBATS-SEANCE",
              "libelleActe": {
                "nomCanonique": "Discussion en séance publique",
                "libelleCourt": "Discussion en séance publique"
              },
              "organeRef": "PO644420",
              "dateActe": "2012-07-25T00:00:00.000+02:00",
              "odjRef": "RUANR5L14S2012IDS16446PT26345",
              "reunionRef": "RUANR5L14S2012IDS16446"
            },
            {
              "xsiType": "Decision_Type",
              "uid": "L14-VD158991DEC",
              "codeActe": "AN1-DEBATS-DEC",
              "libelleActe": {
                "nomCanonique": "Décision",
                "libelleCourt": "Décision"
              },
              "organeRef": "PO644420",
              "dateActe": "2012-07-25T00:00:00.000+02:00",
              "reunionRef": "RUANR5L14S2012IDS16446",
              "statutConclusion": {
                "famCode": "TSORTF01",
                "libelle": "adopté"
              },
              "textesAssocies": [
                {
                  "typeTexte": "BTA",
                  "texteAssocieRef": "PRJLANR5L14BTA0012"
                }
              ]
            }
          ]
        }
      ]
    },
    {
      "xsiType": "Etape_Type",
      "uid": "L14-SN1-28864",
      "codeActe": "SN1",
      "libelleActe": {
        "nomCanonique": "1ère lecture (2ème assemblée saisie)",
        "libelleCourt": "1ère lecture"
      },
      "organeRef": "PO78718",
      "actesLegislatifs": [
        {
          "xsiType": "DepotInitiativeNavette_Type",
          "uid": "L14-VD159013DIN",
          "codeActe": "SN1-DEPOT",
          "libelleActe": {
            "nomCanonique": "Dépôt d'une initiative en navette",
            "libelleCourt": "Dépôt d'une initiative en navette"
          },
          "organeRef": "PO78718",
          "dateActe": "2012-07-26T00:00:00.000+02:00",
          "provenanceRef": "PO644420",
          "texteAssocieRef": "PRJLSNR5S198B0720"
        },
        {
          "xsiType": "Etape_Type",
          "uid": "L14-SN1-COM-28864",
          "codeActe": "SN1-COM",
          "libelleActe": {
            "nomCanonique": "Travaux des commissions",
            "libelleCourt": "Travaux des commissions"
          },
          "organeRef": "PO78718",
          "actesLegislatifs": [
            {
              "xsiType": "Etape_Type",
              "uid": "L14-VD159014CF",
              "codeActe": "SN1-COM-FOND",
              "libelleActe": {
                "nomCanonique": "Travaux de la commission saisie au fond",
                "libelleCourt": "Travaux de la commission saisie au fond"
              },
              "organeRef": "PO211491",
              "actesLegislatifs": [
                {
                  "xsiType": "SaisieComFond_Type",
                  "uid": "L14-VD159014CFS",
                  "codeActe": "SN1-COM-FOND-SAISIE",
                  "libelleActe": {
                    "nomCanonique": "Renvoi en commission au fond",
                    "libelleCourt": "Renvoi en commission au fond"
                  },
                  "organeRef": "PO211491",
                  "dateActe": "2012-07-26T00:00:00.000+02:00"
                },
                {
                  "xsiType": "DepotRapport_Type",
                  "uid": "L14-VD160991",
                  "codeActe": "SN1-COM-FOND-RAPPORT",
                  "libelleActe": {
                    "nomCanonique": "Dépôt de rapport",
                    "libelleCourt": "Dépôt de rapport"
                  },
                  "organeRef": "PO211491",
                  "dateActe": "2012-12-12T00:00:00.000+01:00",
                  "texteAssocieRef": "RAPPSNR5S199B0217"
                }
              ]
            }
          ]
        },
        {
          "xsiType": "Etape_Type",
          "uid": "L14-SN1-DEBATS-28864",
          "codeActe": "SN1-DEBATS",
          "libelleActe": {
            "nomCanonique": "Discussion en séance publique",
            "libelleCourt": "Discussion en séance publique"
          },
          "organeRef": "PO78718",
          "actesLegislatifs": [
            {
              "xsiType": "DiscussionSeancePublique_Type",
              "uid": "L14-VD160414S26999",
              "codeActe": "SN1-DEBATS-SEANCE",
              "libelleActe": {
                "nomCanonique": "Discussion en séance publique",
                "libelleCourt": "Discussion en séance publique"
              },
              "organeRef": "PO78718",
              "dateActe": "2012-12-18T00:00:00.000+01:00",
              "odjRef": "RUSNR5L14S2013IDS16700PT26999",
              "reunionRef": "RUSNR5L14S2013IDS16700"
            },
            {
              "xsiType": "Decision_Type",
              "uid": "L14-VD161038DEC",
              "codeActe": "SN1-DEBATS-DEC",
              "libelleActe": {
                "nomCanonique": "Décision",
                "libelleCourt": "Décision"
              },
              "organeRef": "PO78718",
              "dateActe": "2012-12-18T00:00:00.000+01:00",
              "reunionRef": "RUSNR5L14S2013IDS16700",
              "statutConclusion": {
                "famCode": "TSORTF03",
                "libelle": "adopté sans modification"
              },
              "textesAssocies": [
                {
                  "typeTexte": "BTA",
                  "texteAssocieRef": "PRJLSNR5S199BTA0056"
                }
              ]
            }
          ]
        }
      ]
    },
    {
      "xsiType": "Etape_Type",
      "uid": "L14-PROM-28864",
      "codeActe": "PROM",
      "libelleActe": {
        "nomCanonique": "Promulgation de la loi",
        "libelleCourt": "Promulgation de la loi"
      },
      "organeRef": "PO696251",
      "actesLegislatifs": [
        {
          "xsiType": "Promulgation_Type",
          "uid": "L14-VD161195PL",
          "codeActe": "PROM-PUB",
          "libelleActe": {
            "nomCanonique": "Promulgation d'une loi",
            "libelleCourt": "Promulgation d'une loi"
          },
          "organeRef": "PO696251",
          "dateActe": "2012-12-28T00:00:00.000+01:00",
          "codeLoi": "2012-1473",
          "infoJo": {
            "typeJo": "JO_LOI_DECRET",
            "dateJo": "2012-12-29+01:00",
            "numJo": "303"
          },
          "referenceNor": "MAEJ1122813L",
          "texteLoiRef": "PRJLSNR5S199BTA0056",
          "titreLoi": "autorisant l'approbation de l'amendement à la convention sur la protection physique des matières nucléaires",
          "urlLegifrance": "http://www.legifrance.gouv.fr/WAspad/UnTexteDeJorf?numjo=MAEJ1122813L"
        }
      ]
    }
  ],
  "indexation": {
    "themes": {
      "@niveau": "1",
      "theme": {
        "libelleTheme": "SOCIETES"
      }
    }
  }
}