{
  "xsiType": "DossierMissionControle_Type",
  "uid": "DLR5L14N28934",
  "legislature": "14",
  "titreDossier": {
    "titre": "Application des mesures fiscales contenues dans les lois de finances",
    "titreChemin": "mesures_fiscales_lois_finances"
  },
  "procedureParlementaire": {
    "code": "19",
    "libelle": "Rapport d'information sans mission"
  },
  "actesLegislatifs": [
    {
      "xsiType": "Etape_Type",
      "uid": "L14-AN20-28934",
      "codeActe": "AN20",
      "libelleActe": {
        "nomCanonique": "Travaux"
      },
      "organeRef": "PO644420",
      "actesLegislatifs": [
        {
          "xsiType": "DepotRapport_Type",
          "uid": "L14-VD158971",
          "codeActe": "AN20-RAPPORT",
          "libelleActe": {
            "nomCanonique": "Dépôt de rapport",
            "libelleCourt": "Dépôt de rapport"
          },
          "organeRef": "PO59048",
          "dateActe": "2012-07-25T00:00:00.000+02:00",
          "texteAssocieRef": "RINFANR5L14B0127"
        }
      ]
    }
  ]
}