{
  "xsiType": "texteLoi_Type",
  "uid": "PIONANR5L14B0516",
  "legislature": "14",
  "cycleDeVie": {
    "chrono": {
      "dateCreation": "2012-12-03T00:00:00.000+01:00",
      "dateDepot": "2012-12-12T00:00:00.000+01:00",
      "datePublication": "2013-04-25T00:00:00.000+02:00",
      "datePublicationWeb": "2012-12-13T15:45:00.000+01:00"
    }
  },
  "denominationStructurelle": "Proposition de loi",
  "provenance": "Texte Déposé",
  "titres": {
    "titrePrincipal": "proposition de loi relative à l'égalité des droits et à l'intégration des personnes en situation de handicap",
    "titrePrincipalCourt": "Egalité des droits et intégration des personnes en situation de handicap"
  },
  "dossierRef": "DLR5L14N29403",
  "classification": {
    "famille": {
      "depot": {
        "code": "INITDEP",
        "libelle": "Initiative en 1er Dépôt"
      },
      "classe": {
        "code": "PIONLOI",
        "libelle": "Proposition de loi"
      }
    },
    "type": {
      "code": "PION",
      "libelle": "Proposition de loi"
    }
  },
  "auteurs": [
    {
      "acteur": {
        "acteurRef": "PA605036",
        "qualite": "auteur"
      }
    }
  ],
  "notice": {
    "numNotice": "516",
    "formule": "relative à l'égalité des droits et à l'intégration des personnes en situation de handicap",
    "adoptionConforme": false
  },
  "indexation": {
    "themes": {
      "@niveau": "1",
      "theme": {
        "libelleTheme": "DOM-TOM"
      }
    }
  },
  "coSignataires": [
    {
      "acteurRef": "PA243",
      "dateCosignature": "2012-12-12+01:00",
      "edite": false
    },
    {
      "acteurRef": "PA314",
      "dateCosignature": "2012-12-12+01:00",
      "edite": false
    },
    {
      "acteurRef": "PA267822",
      "dateCosignature": "2012-12-12+01:00",
      "edite": false
    },
    {
      "acteurRef": "PA336316",
      "dateCosignature": "2012-12-12+01:00",
      "edite": false
    },
    {
      "acteurRef": "PA230",
      "dateCosignature": "2012-12-12+01:00",
      "edite": false
    },
    {
      "acteurRef": "PA267080",
      "dateCosignature": "2012-12-12+01:00",
      "edite": false
    },
    {
      "acteurRef": "PA267576",
      "dateCosignature": "2012-12-12+01:00",
      "edite": false
    },
    {
      "acteurRef": "PA330684",
      "dateCosignature": "2012-12-12+01:00",
      "edite": false
    },
    {
      "acteurRef": "PA330008",
      "dateCosignature": "2012-12-12+01:00",
      "edite": false
    },
    {
      "acteurRef": "PA856",
      "dateCosignature": "2012-12-12+01:00",
      "edite": false
    },
    {
      "acteurRef": "PA608662",
      "dateCosignature": "2012-12-12+01:00",
      "edite": false
    },
    {
      "acteurRef": "PA267429",
      "dateCosignature": "2012-12-12+01:00",
      "edite": false
    },
    {
      "acteurRef": "PA951",
      "dateCosignature": "2012-12-12+01:00",
      "edite": false
    },
    {
      "acteurRef": "PA332523",
      "dateCosignature": "2012-12-12+01:00",
      "edite": false
    },
    {
      "acteurRef": "PA607846",
      "dateCosignature": "2012-12-12+01:00",
      "edite": false
    },
    {
      "acteurRef": "PA1001",
      "dateCosignature": "2012-12-12+01:00",
      "edite": false
    },
    {
      "acteurRef": "PA267762",
      "dateCosignature": "2012-12-12+01:00",
      "edite": false
    },
    {
      "acteurRef": "PA1029",
      "dateCosignature": "2012-12-12+01:00",
      "edite": false
    },
    {
      "acteurRef": "PA608851",
      "dateCosignature": "2012-12-12+01:00",
      "edite": false
    },
    {
      "acteurRef": "PA608826",
      "dateCosignature": "2012-12-12+01:00",
      "edite": false
    },
    {
      "acteurRef": "PA1263",
      "dateCosignature": "2012-12-12+01:00",
      "edite": false
    },
    {
      "acteurRef": "PA334149",
      "dateCosignature": "2012-12-12+01:00",
      "edite": false
    },
    {
      "acteurRef": "PA606478",
      "dateCosignature": "2012-12-12+01:00",
      "edite": false
    },
    {
      "acteurRef": "PA1379",
      "dateCosignature": "2012-12-12+01:00",
      "edite": false
    },
    {
      "acteurRef": "PA266774",
      "dateCosignature": "2012-12-12+01:00",
      "edite": false
    },
    {
      "acteurRef": "PA331146",
      "dateCosignature": "2012-12-12+01:00",
      "edite": false
    },
    {
      "acteurRef": "PA605991",
      "dateCosignature": "2012-12-12+01:00",
      "edite": false
    },
    {
      "acteurRef": "PA267813",
      "dateCosignature": "2012-12-12+01:00",
      "edite": false
    },
    {
      "acteurRef": "PA1483",
      "dateCosignature": "2012-12-12+01:00",
      "edite": false
    },
    {
      "acteurRef": "PA267151",
      "dateCosignature": "2012-12-12+01:00",
      "edite": false
    },
    {
      "acteurRef": "PA343623",
      "dateCosignature": "2012-12-12+01:00",
      "edite": false
    },
    {
      "acteurRef": "PA267227",
      "dateCosignature": "2012-12-12+01:00",
      "edite": false
    },
    {
      "acteurRef": "PA267499",
      "dateCosignature": "2012-12-12+01:00",
      "edite": false
    },
    {
      "acteurRef": "PA1630",
      "dateCosignature": "2012-12-12+01:00",
      "edite": false
    },
    {
      "acteurRef": "PA1699",
      "dateCosignature": "2012-12-12+01:00",
      "edite": false
    },
    {
      "acteurRef": "PA1761",
      "dateCosignature": "2012-12-12+01:00",
      "edite": false
    },
    {
      "acteurRef": "PA1778",
      "dateCosignature": "2012-12-12+01:00",
      "edite": false
    },
    {
      "acteurRef": "PA609245",
      "dateCosignature": "2012-12-12+01:00",
      "edite": false
    },
    {
      "acteurRef": "PA1012",
      "dateCosignature": "2012-12-12+01:00",
      "edite": false
    },
    {
      "acteurRef": "PA1874",
      "dateCosignature": "2012-12-12+01:00",
      "edite": false
    },
    {
      "acteurRef": "PA331481",
      "dateCosignature": "2012-12-12+01:00",
      "edite": false
    },
    {
      "acteurRef": "PA267317",
      "dateCosignature": "2012-12-12+01:00",
      "edite": false
    },
    {
      "acteurRef": "PA608016",
      "dateCosignature": "2012-12-12+01:00",
      "edite": false
    },
    {
      "acteurRef": "PA2011",
      "dateCosignature": "2012-12-12+01:00",
      "edite": false
    },
    {
      "acteurRef": "PA606712",
      "dateCosignature": "2012-12-12+01:00",
      "edite": false
    },
    {
      "acteurRef": "PA605782",
      "dateCosignature": "2012-12-12+01:00",
      "edite": false
    },
    {
      "acteurRef": "PA606098",
      "dateCosignature": "2012-12-12+01:00",
      "edite": false
    },
    {
      "acteurRef": "PA2099",
      "dateCosignature": "2012-12-12+01:00",
      "edite": false
    },
    {
      "acteurRef": "PA267556",
      "dateCosignature": "2012-12-12+01:00",
      "edite": false
    },
    {
      "acteurRef": "PA266788",
      "dateCosignature": "2012-12-12+01:00",
      "edite": false
    },
    {
      "acteurRef": "PA2250",
      "dateCosignature": "2012-12-12+01:00",
      "edite": false
    },
    {
      "acteurRef": "PA344776",
      "dateCosignature": "2012-12-12+01:00",
      "edite": false
    },
    {
      "acteurRef": "PA2277",
      "dateCosignature": "2012-12-12+01:00",
      "edite": false
    },
    {
      "acteurRef": "PA2345",
      "dateCosignature": "2012-12-12+01:00",
      "edite": false
    },
    {
      "acteurRef": "PA2377",
      "dateCosignature": "2012-12-12+01:00",
      "edite": false
    },
    {
      "acteurRef": "PA267260",
      "dateCosignature": "2012-12-12+01:00",
      "edite": false
    },
    {
      "acteurRef": "PA2529",
      "dateCosignature": "2012-12-12+01:00",
      "edite": false
    },
    {
      "acteurRef": "PA417099",
      "dateCosignature": "2012-12-12+01:00",
      "edite": false
    },
    {
      "acteurRef": "PA267689",
      "dateCosignature": "2012-12-12+01:00",
      "edite": false
    },
    {
      "acteurRef": "PA610924",
      "dateCosignature": "2012-12-12+01:00",
      "edite": false
    },
    {
      "acteurRef": "PA334654",
      "dateCosignature": "2012-12-12+01:00",
      "edite": false
    },
    {
      "acteurRef": "PA2775",
      "dateCosignature": "2012-12-12+01:00",
      "edite": false
    },
    {
      "acteurRef": "PA2792",
      "dateCosignature": "2012-12-12+01:00",
      "edite": false
    },
    {
      "acteurRef": "PA609442",
      "dateCosignature": "2012-12-12+01:00",
      "edite": false
    },
    {
      "acteurRef": "PA334843",
      "dateCosignature": "2012-12-12+01:00",
      "edite": false
    },
    {
      "acteurRef": "PA607090",
      "dateCosignature": "2012-12-12+01:00",
      "edite": false
    },
    {
      "acteurRef": "PA2936",
      "dateCosignature": "2012-12-12+01:00",
      "edite": false
    },
    {
      "acteurRef": "PA606888",
      "dateCosignature": "2013-01-22+01:00",
      "edite": false
    }
  ],
  "depotAmendements": {
    "amendementsSeance": {
      "amendable": true
    },
    "amendementsCommission": [
      {
        "organeRef": "PO420120",
        "amendable": true
      }
    ]
  }
}