{
  "xsiType": "texteLoi_Type",
  "uid": "PIONANR5L14B0971",
  "legislature": "14",
  "cycleDeVie": {
    "chrono": {
      "dateCreation": "2013-04-17T00:00:00.000+02:00",
      "dateDepot": "2013-04-17T00:00:00.000+02:00",
      "datePublicationWeb": "2014-01-16T16:00:00.000+01:00"
    }
  },
  "denominationStructurelle": "Proposition de loi",
  "provenance": "Texte Déposé",
  "titres": {
    "titrePrincipal": "proposition de loi organique visant à encadrer strictement le cumul des mandats et à rapprocher les élus parlementaires de leurs administrés",
    "titrePrincipalCourt": "encadrer strictement le cumul des mandats et rapprocher les élus parlementaires de leurs administrés"
  },
  "dossierRef": "DLR5L14N30093",
  "classification": {
    "famille": {
      "depot": {
        "code": "INITDEP",
        "libelle": "Initiative en 1er Dépôt"
      },
      "classe": {
        "code": "PIONLOI",
        "libelle": "Proposition de loi"
      },
      "espece": {
        "code": "ORG",
        "libelle": "organique"
      }
    },
    "type": {
      "code": "PION",
      "libelle": "Proposition de loi"
    },
    "sousType": {
      "code": "ORG",
      "libelle": "organique",
      "libelleEdition": "organique"
    }
  },
  "auteurs": [
    {
      "acteur": {
        "acteurRef": "PA330788",
        "qualite": "auteur"
      }
    }
  ],
  "notice": {
    "numNotice": "971",
    "formule": "visant à encadrer strictement le cumul des mandats et à rapprocher les élus parlementaires de leurs administrés",
    "adoptionConforme": false
  },
  "coSignataires": [
    {
      "acteurRef": "PA334149",
      "dateCosignature": "2013-04-17+02:00",
      "edite": false
    },
    {
      "acteurRef": "PA267813",
      "dateCosignature": "2013-04-17+02:00",
      "edite": false
    },
    {
      "acteurRef": "PA609740",
      "dateCosignature": "2013-04-17+02:00",
      "edite": false
    }
  ],
  "depotAmendements": {
    "amendementsSeance": {
      "amendable": false
    },
    "amendementsCommission": [
      {
        "organeRef": "PO59051",
        "amendable": true
      }
    ]
  }
}