{
  "xsiType": "texteLoi_Type",
  "uid": "PNREANR5L14B2067",
  "legislature": "14",
  "cycleDeVie": {
    "chrono": {
      "dateCreation": "2014-06-30T00:00:00.000+02:00",
      "dateDepot": "2014-06-30T00:00:00.000+02:00",
      "datePublicationWeb": "2014-07-01T11:30:00.000+02:00"
    }
  },
  "denominationStructurelle": "Proposition de résolution",
  "provenance": "Texte Déposé",
  "titres": {
    "titrePrincipal": "proposition de résolution tendant à la création d'une commission d'enquête relative à l'évaluation des avantages des salariés de la SNCF",
    "titrePrincipalCourt": "avantage des salariés de la SNCF"
  },
  "dossierRef": "DLR5L14N33282",
  "classification": {
    "famille": {
      "depot": {
        "code": "INITDEP",
        "libelle": "Initiative en 1er Dépôt"
      },
      "classe": {
        "code": "PIONRES",
        "libelle": "Proposition de résolution"
      },
      "espece": {
        "code": "COMENQ",
        "libelle": "tendant à la création d'une commission d'enquête"
      }
    },
    "type": {
      "code": "PNRE",
      "libelle": "Proposition de résolution"
    },
    "sousType": {
      "code": "COMENQ",
      "libelle": "tendant à la création d'une commission d'enquête"
    }
  },
  "auteurs": [
    {
      "acteur": {
        "acteurRef": "PA2792",
        "qualite": "auteur"
      }
    }
  ],
  "notice": {
    "numNotice": "2067",
    "formule": "tendant à la création d'une commission d'enquête relative à l'évaluation des avantages des salariés de la SNCF",
    "adoptionConforme": false
  },
  "coSignataires": [
    {
      "acteurRef": "PA336316",
      "dateCosignature": "2014-06-30+02:00",
      "edite": true
    },
    {
      "acteurRef": "PA695511",
      "dateCosignature": "2014-06-30+02:00",
      "edite": true
    },
    {
      "acteurRef": "PA2229",
      "dateCosignature": "2014-06-30+02:00",
      "edite": true
    },
    {
      "acteurRef": "PA344492",
      "dateCosignature": "2014-06-30+02:00",
      "edite": true
    },
    {
      "acteurRef": "PA998",
      "dateCosignature": "2014-06-30+02:00",
      "edite": true
    },
    {
      "acteurRef": "PA687214",
      "dateCosignature": "2014-06-30+02:00",
      "edite": true
    },
    {
      "acteurRef": "PA223837",
      "dateCosignature": "2014-06-30+02:00",
      "edite": true
    },
    {
      "acteurRef": "PA267743",
      "dateCosignature": "2014-06-30+02:00",
      "edite": true
    },
    {
      "acteurRef": "PA267762",
      "dateCosignature": "2014-06-30+02:00",
      "edite": true
    },
    {
      "acteurRef": "PA333134",
      "dateCosignature": "2014-06-30+02:00",
      "edite": true
    },
    {
      "acteurRef": "PA267200",
      "dateCosignature": "2014-06-30+02:00",
      "edite": true
    },
    {
      "acteurRef": "PA1778",
      "dateCosignature": "2014-06-30+02:00",
      "edite": true
    },
    {
      "acteurRef": "PA609764",
      "dateCosignature": "2014-06-30+02:00",
      "edite": true
    },
    {
      "acteurRef": "PA2529",
      "dateCosignature": "2014-06-30+02:00",
      "edite": true
    },
    {
      "acteurRef": "PA335159",
      "dateCosignature": "2014-06-30+02:00",
      "edite": true
    }
  ]
}