{
  "xsiType": "texteLoi_Type",
  "uid": "PIONANR5L14B4016",
  "legislature": "14",
  "cycleDeVie": {
    "chrono": {
      "dateCreation": "2016-08-24T00:00:00.000+02:00",
      "dateDepot": "2016-08-31T00:00:00.000+02:00",
      "datePublication": "2016-09-12T00:00:00.000+02:00",
      "datePublicationWeb": "2016-09-02T11:50:00.000+02:00"
    }
  },
  "denominationStructurelle": "Proposition de loi",
  "provenance": "Texte Déposé",
  "titres": {
    "titrePrincipal": "proposition de loi pénalisant la prédication subversive",
    "titrePrincipalCourt": "prédication subversive"
  },
  "dossierRef": "DLR5L14N35188",
  "classification": {
    "famille": {
      "depot": {
        "code": "INITDEP",
        "libelle": "Initiative en 1er Dépôt"
      },
      "classe": {
        "code": "PIONLOI",
        "libelle": "Proposition de loi"
      }
    },
    "type": {
      "code": "PION",
      "libelle": "Proposition de loi"
    }
  },
  "auteurs": [
    {
      "acteur": {
        "acteurRef": "PA267628",
        "qualite": "auteur"
      }
    }
  ],
  "notice": {
    "numNotice": "4016",
    "formule": "pénalisant la prédication subversive",
    "adoptionConforme": false
  },
  "coSignataires": [
    {
      "acteurRef": "PA605036",
      "dateCosignature": "2016-08-31+02:00",
      "edite": false
    },
    {
      "acteurRef": "PA267457",
      "dateCosignature": "2016-08-31+02:00",
      "edite": false
    },
    {
      "acteurRef": "PA267358",
      "dateCosignature": "2016-08-31+02:00",
      "edite": false
    },
    {
      "acteurRef": "PA1012",
      "dateCosignature": "2016-08-31+02:00",
      "edite": false
    },
    {
      "acteurRef": "PA267689",
      "dateCosignature": "2016-08-31+02:00",
      "edite": false
    },
    {
      "acteurRef": "PA267178",
      "dateCosignature": "2016-08-31+02:00",
      "edite": false
    },
    {
      "acteurRef": "PA712015",
      "dateCosignature": "2016-08-31+02:00",
      "edite": false
    },
    {
      "acteurRef": "PA334149",
      "dateCosignature": "2016-08-31+02:00",
      "edite": false
    },
    {
      "acteurRef": "PA266774",
      "dateCosignature": "2016-08-31+02:00",
      "edite": false
    },
    {
      "acteurRef": "PA605991",
      "dateCosignature": "2016-08-31+02:00",
      "edite": false
    },
    {
      "acteurRef": "PA267227",
      "dateCosignature": "2016-08-31+02:00",
      "edite": false
    },
    {
      "acteurRef": "PA608416",
      "dateCosignature": "2016-08-31+02:00",
      "edite": false
    },
    {
      "acteurRef": "PA267551",
      "dateCosignature": "2016-08-31+02:00",
      "edite": false
    },
    {
      "acteurRef": "PA2073",
      "dateCosignature": "2016-08-31+02:00",
      "edite": false
    },
    {
      "acteurRef": "PA2099",
      "dateCosignature": "2016-08-31+02:00",
      "edite": false
    },
    {
      "acteurRef": "PA2377",
      "dateCosignature": "2016-08-31+02:00",
      "edite": false
    },
    {
      "acteurRef": "PA267260",
      "dateCosignature": "2016-08-31+02:00",
      "edite": false
    },
    {
      "acteurRef": "PA267266",
      "dateCosignature": "2016-09-07+02:00",
      "edite": false
    },
    {
      "acteurRef": "PA267735",
      "dateCosignature": "2016-09-07+02:00",
      "edite": false
    },
    {
      "acteurRef": "PA1498",
      "dateCosignature": "2016-09-07+02:00",
      "edite": false
    },
    {
      "acteurRef": "PA695100",
      "dateCosignature": "2016-09-07+02:00",
      "edite": false
    },
    {
      "acteurRef": "PA1630",
      "dateCosignature": "2016-09-07+02:00",
      "edite": false
    },
    {
      "acteurRef": "PA266788",
      "dateCosignature": "2016-09-07+02:00",
      "edite": false
    },
    {
      "acteurRef": "PA267598",
      "dateCosignature": "2016-09-07+02:00",
      "edite": false
    },
    {
      "acteurRef": "PA267527",
      "dateCosignature": "2016-09-07+02:00",
      "edite": false
    },
    {
      "acteurRef": "PA2664",
      "dateCosignature": "2016-09-07+02:00",
      "edite": false
    },
    {
      "acteurRef": "PA267822",
      "dateCosignature": "2016-09-15+02:00",
      "edite": false
    },
    {
      "acteurRef": "PA687214",
      "dateCosignature": "2016-09-15+02:00",
      "edite": false
    },
    {
      "acteurRef": "PA223837",
      "dateCosignature": "2016-09-15+02:00",
      "edite": false
    },
    {
      "acteurRef": "PA1020",
      "dateCosignature": "2016-09-15+02:00",
      "edite": false
    },
    {
      "acteurRef": "PA267673",
      "dateCosignature": "2016-09-15+02:00",
      "edite": false
    },
    {
      "acteurRef": "PA1521",
      "dateCosignature": "2016-09-15+02:00",
      "edite": false
    },
    {
      "acteurRef": "PA1574",
      "dateCosignature": "2016-09-15+02:00",
      "edite": false
    },
    {
      "acteurRef": "PA1761",
      "dateCosignature": "2016-09-15+02:00",
      "edite": false
    },
    {
      "acteurRef": "PA2191",
      "dateCosignature": "2016-09-15+02:00",
      "edite": false
    },
    {
      "acteurRef": "PA2250",
      "dateCosignature": "2016-09-15+02:00",
      "edite": false
    },
    {
      "acteurRef": "PA643183",
      "dateCosignature": "2016-09-15+02:00",
      "edite": false
    },
    {
      "acteurRef": "PA608380",
      "dateCosignature": "2016-09-15+02:00",
      "edite": false
    },
    {
      "acteurRef": "PA267794",
      "dateCosignature": "2016-09-15+02:00",
      "edite": false
    },
    {
      "acteurRef": "PA2801",
      "dateCosignature": "2016-09-15+02:00",
      "edite": false
    },
    {
      "acteurRef": "PA259",
      "dateCosignature": "2016-09-27+02:00",
      "edite": false
    },
    {
      "acteurRef": "PA332228",
      "dateCosignature": "2016-09-27+02:00",
      "edite": false
    },
    {
      "acteurRef": "PA713448",
      "dateCosignature": "2016-09-27+02:00",
      "edite": false
    },
    {
      "acteurRef": "PA267042",
      "dateCosignature": "2016-09-27+02:00",
      "edite": false
    },
    {
      "acteurRef": "PA1770",
      "dateCosignature": "2016-09-27+02:00",
      "edite": false
    },
    {
      "acteurRef": "PA2011",
      "dateCosignature": "2016-09-27+02:00",
      "edite": false
    },
    {
      "acteurRef": "PA2229",
      "dateCosignature": "2016-09-27+02:00",
      "edite": false
    },
    {
      "acteurRef": "PA2257",
      "dateCosignature": "2016-09-27+02:00",
      "edite": false
    },
    {
      "acteurRef": "PA344776",
      "dateCosignature": "2016-09-27+02:00",
      "edite": false
    },
    {
      "acteurRef": "PA2796",
      "dateCosignature": "2016-09-27+02:00",
      "edite": false
    },
    {
      "acteurRef": "PA331582",
      "dateCosignature": "2016-09-27+02:00",
      "edite": false
    }
  ],
  "depotAmendements": {
    "amendementsSeance": {
      "amendable": true
    },
    "amendementsCommission": [
      {
        "organeRef": "PO59051",
        "amendable": true
      }
    ]
  }
}