{
  "xsiType": "rapportParlementaire_Type",
  "uid": "RAPPSNR5S199B0433",
  "cycleDeVie": {
    "chrono": {
      "dateCreation": "2013-03-20T00:00:00.000+01:00",
      "dateDepot": "2013-03-20T00:00:00.000+01:00"
    }
  },
  "denominationStructurelle": "Rapport",
  "provenance": "Commission",
  "titres": {
    "titrePrincipal": "rapport sur la proposition de loi de M. Jean-Jacques Mirassou et les membres du groupe Socialiste et apparentés relative à l'instauration du 27 mai comme journée nationale de la Résistance (350)",
    "titrePrincipalCourt": "rapport sur la proposition de loi de M. Jean-Jacques Mirassou et les membres du groupe Socialiste et apparentés relative à l'instauration du 27 mai comme journée nationale de la Résistance (350)"
  },
  "dossierRef": "DLR5L14N29845",
  "classification": {
    "famille": {
      "depot": {
        "code": "RAPINIT",
        "libelle": "Rapport sur une initiative"
      },
      "classe": {
        "code": "RAPPORT",
        "libelle": "Rapport"
      }
    },
    "type": {
      "code": "RAPP",
      "libelle": "Rapport"
    }
  },
  "auteurs": [
    {
      "acteur": {
        "acteurRef": "PA423245",
        "qualite": "rapporteur"
      }
    },
    {
      "organeRef": "PO211493"
    }
  ],
  "notice": {
    "numNotice": "433",
    "formule": "sur la proposition de loi de M. Jean-Jacques Mirassou et les membres du groupe Socialiste et apparentés relative à l'instauration du 27 mai comme journée nationale de la Résistance (350)",
    "adoptionConforme": false
  }
}