{
  "xsiType": "texteLoi_Type",
  "uid": "PRJLANR5L14B0577",
  "legislature": "14",
  "cycleDeVie": {
    "chrono": {
      "dateCreation": "2013-01-09T00:00:00.000+01:00",
      "dateDepot": "2013-01-09T00:00:00.000+01:00",
      "datePublicationWeb": "2013-01-14T11:45:00.000+01:00"
    }
  },
  "denominationStructurelle": "Projet de loi",
  "provenance": "Texte Déposé",
  "titres": {
    "titrePrincipal": "projet de loi autorisant l'approbation de l'accord sous forme d'échange de lettres entre le Gouvernement de la République française et le Gouvernement du Grand-Duché de Luxembourg pour le développement de la coopération et de l'entraide administrative en matière de sécurité sociale",
    "titrePrincipalCourt": "accord France-Luxembourg pour le développement de la coopération et de l'entraide administrative en matière de sécurité sociale"
  },
  "dossierRef": "DLR5L14N29564",
  "classification": {
    "famille": {
      "depot": {
        "code": "INITDEP",
        "libelle": "Initiative en 1er Dépôt"
      },
      "classe": {
        "code": "PRJLOI",
        "libelle": "Projet de loi"
      },
      "espece": {
        "code": "AUTRATCONV",
        "libelle": "autorisant la ratification d'une convention"
      }
    },
    "type": {
      "code": "PRJL",
      "libelle": "Projet de loi"
    },
    "sousType": {
      "code": "AUTRATCONV",
      "libelle": "autorisant la ratification d'une convention",
      "libelleEdition": "autorisant la ratification d'une convention"
    }
  },
  "auteurs": [
    {
      "acteur": {
        "acteurRef": "PA328",
        "qualite": "auteur"
      }
    }
  ],
  "notice": {
    "numNotice": "577",
    "formule": "autorisant l'approbation de l'accord sous forme d'échange de lettres entre le Gouvernement de la République française et le Gouvernement du Grand-Duché de Luxembourg pour le développement de la coopération et de l'entraide administrative en matière de sécurité sociale",
    "adoptionConforme": false
  },
  "coSignataires": [
    {
      "acteurRef": "PA1268",
      "dateCosignature": "2013-01-09+01:00",
      "edite": true
    }
  ],
  "depotAmendements": {
    "amendementsSeance": {
      "amendable": false
    },
    "amendementsCommission": [
      {
        "organeRef": "PO59047",
        "amendable": true
      }
    ]
  }
}