{
  "xsiType": "DossierLegislatif_Type",
  "uid": "DLR5L14N29543",
  "legislature": "14",
  "titreDossier": {
    "titre": "Immunité juridictionnelle des membres de la Mission interministérielle de vigilance et de lutte contre les dérives sectaires dans le cadre de leurs fonctions",
    "titreChemin": "immunite_juridictionnelle_membres_Miviludes",
    "senatChemin": "http://www.senat.fr/dossier-legislatif/ppl12-233.html"
  },
  "procedureParlementaire": {
    "code": "2",
    "libelle": "Proposition de loi ordinaire"
  },
  "initiateur": {
    "acteurs": [
      {
        "acteurRef": "PA415482",
        "mandatRef": "PM415579"
      }
    ],
    "organeRef": "PO78718"
  },
  "actesLegislatifs": [
    {
      "xsiType": "Etape_Type",
      "uid": "L14-SN1-29543",
      "codeActe": "SN1",
      "libelleActe": {
        "nomCanonique": "1ère lecture (1ère assemblée saisie)",
        "libelleCourt": "1ère lecture"
      },
      "organeRef": "PO78718",
      "actesLegislatifs": [
        {
          "xsiType": "DepotInitiative_Type",
          "uid": "L14-VD161172DI",
          "codeActe": "SN1-DEPOT",
          "libelleActe": {
            "nomCanonique": "1er dépôt d'une initiative.",
            "libelleCourt": "1er dépôt d'une initiative."
          },
          "organeRef": "PO78718",
          "dateActe": "2012-12-18T00:00:00.000+01:00",
          "texteAssocieRef": "PIONSNR5S199B0233"
        },
        {
          "xsiType": "Etape_Type",
          "uid": "L14-SN1-COM-29543",
          "codeActe": "SN1-COM",
          "libelleActe": {
            "nomCanonique": "Travaux des commissions",
            "libelleCourt": "Travaux des commissions"
          },
          "organeRef": "PO78718",
          "actesLegislatifs": [
            {
              "xsiType": "Etape_Type",
              "uid": "L14-VD161173CF",
              "codeActe": "SN1-COM-FOND",
              "libelleActe": {
                "nomCanonique": "Travaux de la commission saisie au fond",
                "libelleCourt": "Travaux de la commission saisie au fond"
              },
              "organeRef": "PO211495",
              "actesLegislatifs": [
                {
                  "xsiType": "SaisieComFond_Type",
                  "uid": "L14-VD161173CFS",
                  "codeActe": "SN1-COM-FOND-SAISIE",
                  "libelleActe": {
                    "nomCanonique": "Renvoi en commission au fond",
                    "libelleCourt": "Renvoi en commission au fond"
                  },
                  "organeRef": "PO211495",
                  "dateActe": "2012-12-18T00:00:00.000+01:00"
                }
              ]
            }
          ]
        }
      ]
    }
  ]
}