{
  "xsiType": "rapportParlementaire_Type",
  "uid": "RAPPANR5L14B0093",
  "legislature": "14",
  "cycleDeVie": {
    "chrono": {
      "dateCreation": "2012-07-18T00:00:00.000+02:00",
      "dateDepot": "2012-07-18T00:00:00.000+02:00",
      "datePublication": "2012-07-23T00:00:00.000+02:00",
      "datePublicationWeb": "2012-07-20T09:30:00.000+02:00"
    }
  },
  "denominationStructurelle": "Rapport",
  "provenance": "Commission",
  "titres": {
    "titrePrincipal": "rapport sur le projet de loi  autorisant l'approbation de l'accord de coopération entre le Gouvernement de la République française et le Gouvernement de la République du Kazakhstan dans le domaine de l'exploration et de l'utilisation de l'espace extra atmosphérique à des fins pacifiques (n°6)",
    "titrePrincipalCourt": "rapport sur le projet de loi  autorisant l'approbation de l'accord de coopération entre le Gouvernement de la République française et le Gouvernement de la République du Kazakhstan dans le domaine de l'exploration et de l'utilisation de l'espace extra atmosphérique à des fins pacifiques (n°6)"
  },
  "dossierRef": "DLR5L14N28859",
  "classification": {
    "famille": {
      "depot": {
        "code": "RAPINIT",
        "libelle": "Rapport sur une initiative"
      },
      "classe": {
        "code": "RAPPORT",
        "libelle": "Rapport"
      }
    },
    "type": {
      "code": "RAPP",
      "libelle": "Rapport"
    }
  },
  "auteurs": [
    {
      "acteur": {
        "acteurRef": "PA2685",
        "qualite": "rapporteur"
      }
    },
    {
      "organeRef": "PO59047"
    }
  ],
  "notice": {
    "numNotice": "93",
    "formule": "sur le projet de loi  autorisant l'approbation de l'accord de coopération entre le Gouvernement de la République française et le Gouvernement de la République du Kazakhstan dans le domaine de l'exploration et de l'utilisation de l'espace extra atmosphérique à des fins pacifiques (n°6)",
    "adoptionConforme": false
  },
  "imprimerie": {
    "prix": "0.75"
  }
}