{
  "xsiType": "DossierLegislatif_Type",
  "uid": "DLR5L14N34836",
  "legislature": "14",
  "titreDossier": {
    "titre": "Société : égalité et citoyenneté",
    "titreChemin": "Egalite_et_citoyennete",
    "senatChemin": "http://www.senat.fr/dossier-legislatif/pjl15-773.html"
  },
  "procedureParlementaire": {
    "code": "1",
    "libelle": "Projet de loi ordinaire"
  },
  "initiateur": {
    "acteurs": [
      {
        "acteurRef": "PA267622",
        "mandatRef": "PM702957"
      },
      {
        "acteurRef": "PA711558",
        "mandatRef": "PM711571"
      },
      {
        "acteurRef": "PA702993",
        "mandatRef": "PM709263"
      },
      {
        "acteurRef": "PA610681",
        "mandatRef": "PM711583"
      }
    ]
  },
  "actesLegislatifs": [
    {
      "xsiType": "Etape_Type",
      "uid": "L14-AN1-34836",
      "codeActe": "AN1",
      "libelleActe": {
        "nomCanonique": "1ère lecture (1ère assemblée saisie)",
        "libelleCourt": "1ère lecture"
      },
      "organeRef": "PO644420",
      "actesLegislatifs": [
        {
          "xsiType": "DepotInitiative_Type",
          "uid": "L14-VD177733DI",
          "codeActe": "AN1-DEPOT",
          "libelleActe": {
            "nomCanonique": "1er dépôt d'une initiative.",
            "libelleCourt": "1er dépôt d'une initiative."
          },
          "organeRef": "PO644420",
          "dateActe": "2016-04-13T00:00:00.000+02:00",
          "texteAssocieRef": "PRJLANR5L14B3679"
        },
        {
          "xsiType": "EtudeImpact_Type",
          "uid": "L14-VD177733ETI",
          "codeActe": "AN1-ETI",
          "libelleActe": {
            "nomCanonique": "Etude d'impact",
            "libelleCourt": "Etude d'impact"
          },
          "organeRef": "PO644420",
          "dateActe": "2016-04-13T00:00:00.000+02:00",
          "contributionInternaute": {
            "dateOuverture": "2016-04-15+02:00",
            "dateFermeture": "2016-06-27+02:00"
          },
          "texteAssocieRef": "ETDIANR5L14B3679"
        },
        {
          "xsiType": "DepotAvisConseilEtat_Type",
          "uid": "L14-VD177733AVCE",
          "codeActe": "AN1-AVCE",
          "libelleActe": {
            "nomCanonique": "Avis du Conseil d'Etat",
            "libelleCourt": "Avis du Conseil d'Etat"
          },
          "organeRef": "PO644420",
          "dateActe": "2016-04-13T00:00:00.000+02:00",
          "texteAssocieRef": "AVCEANR5L14B3679"
        },
        {
          "xsiType": "ProcedureAccelere_Type",
          "uid": "L14-VD177735",
          "codeActe": "AN1-PROCACC",
          "libelleActe": {
            "nomCanonique": "Le gouvernement déclare l'urgence / engage la procédure accélérée",
            "libelleCourt": "Le gouvernement déclare l'urgence / engage la procédure accélérée"
          },
          "organeRef": "PO702883",
          "dateActe": "2016-04-13T00:00:00.000+02:00"
        },
        {
          "xsiType": "Etape_Type",
          "uid": "L14-AN1-COM-34836",
          "codeActe": "AN1-COM",
          "libelleActe": {
            "nomCanonique": "Travaux des commissions",
            "libelleCourt": "Travaux des commissions"
          },
          "organeRef": "PO644420",
          "actesLegislatifs": [
            {
              "xsiType": "Etape_Type",
              "uid": "L14-VD177734CF",
              "codeActe": "AN1-COM-FOND",
              "libelleActe": {
                "nomCanonique": "Travaux de la commission saisie au fond",
                "libelleCourt": "Travaux de la commission saisie au fond"
              },
              "organeRef": "PO712376",
              "actesLegislatifs": [
                {
                  "xsiType": "SaisieComFond_Type",
                  "uid": "L14-VD177734CFS",
                  "codeActe": "AN1-COM-FOND-SAISIE",
                  "libelleActe": {
                    "nomCanonique": "Renvoi en commission au fond",
                    "libelleCourt": "Renvoi en commission au fond"
                  },
                  "organeRef": "PO712376",
                  "dateActe": "2016-04-13T00:00:00.000+02:00"
                },
                {
                  "xsiType": "NominRapporteurs_Type",
                  "uid": "L14-VD178331",
                  "codeActe": "AN1-COM-FOND-NOMIN",
                  "libelleActe": {
                    "nomCanonique": "Nomination de rapporteur",
                    "libelleCourt": "Nomination de rapporteur"
                  },
                  "organeRef": "PO712376",
                  "dateActe": "2016-05-11T00:00:00.000+02:00",
                  "rapporteurs": [
                    {
                      "acteurRef": "PA610291",
                      "typeRapporteur": "rapporteur"
                    },
                    {
                      "acteurRef": "PA607256",
                      "typeRapporteur": "rapporteur"
                    },
                    {
                      "acteurRef": "PA608363",
                      "typeRapporteur": "rapporteur"
                    },
                    {
                      "acteurRef": "PA606665",
                      "typeRapporteur": "rapporteur"
                    }
                  ]
                },
                {
                  "xsiType": "DiscussionCommission_Type",
                  "uid": "L14-VD178030R23680",
                  "codeActe": "AN1-COM-FOND-REUNION",
                  "libelleActe": {
                    "nomCanonique": "Réunion de commission",
                    "libelleCourt": "Réunion de commission"
                  },
                  "organeRef": "PO712376",
                  "dateActe": "2016-05-11T11:30:00.000+02:00",
                  "odjRef": "RUANR5L14S2016IDC425477PT23680",
                  "reunionRef": "RUANR5L14S2016IDC425477"
                },
                {
                  "xsiType": "DiscussionCommission_Type",
                  "uid": "L14-VD178030R23762",
                  "codeActe": "AN1-COM-FOND-REUNION",
                  "libelleActe": {
                    "nomCanonique": "Réunion de commission",
                    "libelleCourt": "Réunion de commission"
                  },
                  "organeRef": "PO712376",
                  "dateActe": "2016-05-25T10:30:00.000+02:00",
                  "odjRef": "RUANR5L14S2016IDC425632PT23762",
                  "reunionRef": "RUANR5L14S2016IDC425632"
                },
                {
                  "xsiType": "DiscussionCommission_Type",
                  "uid": "L14-VD178030R23763",
                  "codeActe": "AN1-COM-FOND-REUNION",
                  "libelleActe": {
                    "nomCanonique": "Réunion de commission",
                    "libelleCourt": "Réunion de commission"
                  },
                  "organeRef": "PO712376",
                  "dateActe": "2016-05-31T16:30:00.000+02:00",
                  "odjRef": "RUANR5L14S2016IDC425633PT23763",
                  "reunionRef": "RUANR5L14S2016IDC425633"
                },
                {
                  "xsiType": "DiscussionCommission_Type",
                  "uid": "L14-VD178030R23764",
                  "codeActe": "AN1-COM-FOND-REUNION",
                  "libelleActe": {
                    "nomCanonique": "Réunion de commission",
                    "libelleCourt": "Réunion de commission"
                  },
                  "organeRef": "PO712376",
                  "dateActe": "2016-05-31T18:00:00.000+02:00",
                  "odjRef": "RUANR5L14S2016IDC425634PT23764",
                  "reunionRef": "RUANR5L14S2016IDC425634"
                },
                {
                  "xsiType": "DiscussionCommission_Type",
                  "uid": "L14-VD178030R23765",
                  "codeActe": "AN1-COM-FOND-REUNION",
                  "libelleActe": {
                    "nomCanonique": "Réunion de commission",
                    "libelleCourt": "Réunion de commission"
                  },
                  "organeRef": "PO712376",
                  "dateActe": "2016-06-01T10:30:00.000+02:00",
                  "odjRef": "RUANR5L14S2016IDC425635PT23765",
                  "reunionRef": "RUANR5L14S2016IDC425635"
                },
                {
                  "xsiType": "DiscussionCommission_Type",
                  "uid": "L14-VD178030R23766",
                  "codeActe": "AN1-COM-FOND-REUNION",
                  "libelleActe": {
                    "nomCanonique": "Réunion de commission",
                    "libelleCourt": "Réunion de commission"
                  },
                  "organeRef": "PO712376",
                  "dateActe": "2016-06-01T16:30:00.000+02:00",
                  "odjRef": "RUANR5L14S2016IDC425636PT23766",
                  "reunionRef": "RUANR5L14S2016IDC425636"
                },
                {
                  "xsiType": "DiscussionCommission_Type",
                  "uid": "L14-VD178030R23767",
                  "codeActe": "AN1-COM-FOND-REUNION",
                  "libelleActe": {
                    "nomCanonique": "Réunion de commission",
                    "libelleCourt": "Réunion de commission"
                  },
                  "organeRef": "PO712376",
                  "dateActe": "2016-06-07T16:15:00.000+02:00",
                  "odjRef": "RUANR5L14S2016IDC425637PT23767",
                  "reunionRef": "RUANR5L14S2016IDC425637"
                },
                {
                  "xsiType": "DiscussionCommission_Type",
                  "uid": "L14-VD178030R23768",
                  "codeActe": "AN1-COM-FOND-REUNION",
                  "libelleActe": {
                    "nomCanonique": "Réunion de commission",
                    "libelleCourt": "Réunion de commission"
                  },
                  "organeRef": "PO712376",
                  "dateActe": "2016-06-08T09:45:00.000+02:00"
                },
                {
                  "xsiType": "DiscussionCommission_Type",
                  "uid": "L14-VD178030R23769",
                  "codeActe": "AN1-COM-FOND-REUNION",
                  "libelleActe": {
                    "nomCanonique": "Réunion de commission",
                    "libelleCourt": "Réunion de commission"
                  },
                  "organeRef": "PO712376",
                  "dateActe": "2016-06-08T11:15:00.000+02:00",
                  "odjRef": "RUANR5L14S2016IDC425639PT23769",
                  "reunionRef": "RUANR5L14S2016IDC425639"
                },
                {
                  "xsiType": "DiscussionCommission_Type",
                  "uid": "L14-VD178030R23770",
                  "codeActe": "AN1-COM-FOND-REUNION",
                  "libelleActe": {
                    "nomCanonique": "Réunion de commission",
                    "libelleCourt": "Réunion de commission"
                  },
                  "organeRef": "PO712376",
                  "dateActe": "2016-06-08T16:30:00.000+02:00",
                  "odjRef": "RUANR5L14S2016IDC425640PT23770",
                  "reunionRef": "RUANR5L14S2016IDC425640"
                },
                {
                  "xsiType": "DiscussionCommission_Type",
                  "uid": "L14-VD178030R23888",
                  "codeActe": "AN1-COM-FOND-REUNION",
                  "libelleActe": {
                    "nomCanonique": "Réunion de commission",
                    "libelleCourt": "Réunion de commission"
                  },
                  "organeRef": "PO712376",
                  "dateActe": "2016-06-14T17:00:00.000+02:00",
                  "odjRef": "RUANR5L14S2016IDC425809PT23888",
                  "reunionRef": "RUANR5L14S2016IDC425809"
                },
                {
                  "xsiType": "DiscussionCommission_Type",
                  "uid": "L14-VD178030R23889",
                  "codeActe": "AN1-COM-FOND-REUNION",
                  "libelleActe": {
                    "nomCanonique": "Réunion de commission",
                    "libelleCourt": "Réunion de commission"
                  },
                  "organeRef": "PO712376",
                  "dateActe": "2016-06-14T21:00:00.000+02:00",
                  "odjRef": "RUANR5L14S2016IDC425643PT23889",
                  "reunionRef": "RUANR5L14S2016IDC425643"
                },
                {
                  "xsiType": "DiscussionCommission_Type",
                  "uid": "L14-VD178030R23890",
                  "codeActe": "AN1-COM-FOND-REUNION",
                  "libelleActe": {
                    "nomCanonique": "Réunion de commission",
                    "libelleCourt": "Réunion de commission"
                  },
                  "organeRef": "PO712376",
                  "dateActe": "2016-06-15T09:30:00.000+02:00",
                  "odjRef": "RUANR5L14S2016IDC425644PT23890",
                  "reunionRef": "RUANR5L14S2016IDC425644"
                },
                {
                  "xsiType": "DiscussionCommission_Type",
                  "uid": "L14-VD178030R23891",
                  "codeActe": "AN1-COM-FOND-REUNION",
                  "libelleActe": {
                    "nomCanonique": "Réunion de commission",
                    "libelleCourt": "Réunion de commission"
                  },
                  "organeRef": "PO712376",
                  "dateActe": "2016-06-15T16:30:00.000+02:00",
                  "odjRef": "RUANR5L14S2016IDC425645PT23891",
                  "reunionRef": "RUANR5L14S2016IDC425645"
                },
                {
                  "xsiType": "DiscussionCommission_Type",
                  "uid": "L14-VD178030R23892",
                  "codeActe": "AN1-COM-FOND-REUNION",
                  "libelleActe": {
                    "nomCanonique": "Réunion de commission",
                    "libelleCourt": "Réunion de commission"
                  },
                  "organeRef": "PO712376",
                  "dateActe": "2016-06-15T21:15:00.000+02:00"
                },
                {
                  "xsiType": "DiscussionCommission_Type",
                  "uid": "L14-VD178030R23893",
                  "codeActe": "AN1-COM-FOND-REUNION",
                  "libelleActe": {
                    "nomCanonique": "Réunion de commission",
                    "libelleCourt": "Réunion de commission"
                  },
                  "organeRef": "PO712376",
                  "dateActe": "2016-06-16T10:00:00.000+02:00",
                  "odjRef": "RUANR5L14S2016IDC425810PT23893",
                  "reunionRef": "RUANR5L14S2016IDC425810"
                },
                {
                  "xsiType": "DiscussionCommission_Type",
                  "uid": "L14-VD178030R23894",
                  "codeActe": "AN1-COM-FOND-REUNION",
                  "libelleActe": {
                    "nomCanonique": "Réunion de commission",
                    "libelleCourt": "Réunion de commission"
                  },
                  "organeRef": "PO712376",
                  "dateActe": "2016-06-16T15:00:00.000+02:00",
                  "odjRef": "RUANR5L14S2016IDC425811PT23894",
                  "reunionRef": "RUANR5L14S2016IDC425811"
                },
                {
                  "xsiType": "DiscussionCommission_Type",
                  "uid": "L14-VD178030R23934",
                  "codeActe": "AN1-COM-FOND-REUNION",
                  "libelleActe": {
                    "nomCanonique": "Réunion de commission",
                    "libelleCourt": "Réunion de commission"
                  },
                  "organeRef": "PO712376",
                  "dateActe": "2016-06-27T15:00:00.000+02:00",
                  "odjRef": "RUANR5L14S2016IDC425872PT23934",
                  "reunionRef": "RUANR5L14S2016IDC425872"
                },
                {
                  "xsiType": "DiscussionCommission_Type",
                  "uid": "L14-VD178030R23956",
                  "codeActe": "AN1-COM-FOND-REUNION",
                  "libelleActe": {
                    "nomCanonique": "Réunion de commission",
                    "libelleCourt": "Réunion de commission"
                  },
                  "organeRef": "PO712376",
                  "dateActe": "2016-06-28T14:30:00.000+02:00",
                  "odjRef": "RUANR5L14S2016IDC425908PT23956",
                  "reunionRef": "RUANR5L14S2016IDC425908"
                },
                {
                  "xsiType": "DepotRapport_Type",
                  "uid": "L14-VD178472",
                  "codeActe": "AN1-COM-FOND-RAPPORT",
                  "libelleActe": {
                    "nomCanonique": "Dépôt de rapport",
                    "libelleCourt": "Dépôt de rapport"
                  },
                  "organeRef": "PO712376",
                  "dateActe": "2016-06-17T00:00:00.000+02:00",
                  "texteAdopteRef": "PRJLANR5L14BTC3851",
                  "texteAssocieRef": "RAPPANR5L14B3851"
                }
              ]
            }
          ]
        },
        {
          "xsiType": "Etape_Type",
          "uid": "L14-AN1-DEBATS-34836",
          "codeActe": "AN1-DEBATS",
          "libelleActe": {
            "nomCanonique": "Discussion en séance publique",
            "libelleCourt": "Discussion en séance publique"
          },
          "organeRef": "PO644420",
          "actesLegislatifs": [
            {
              "xsiType": "DiscussionSeancePublique_Type",
              "uid": "L14-VD178339S33836",
              "codeActe": "AN1-DEBATS-SEANCE",
              "libelleActe": {
                "nomCanonique": "Discussion en séance publique",
                "libelleCourt": "Discussion en séance publique"
              },
              "organeRef": "PO644420",
              "dateActe": "2016-06-27T00:00:00.000+02:00",
              "odjRef": "RUANR5L14S2016IDS20124PT33836",
              "reunionRef": "RUANR5L14S2016IDS20124"
            },
            {
              "xsiType": "DiscussionSeancePublique_Type",
              "uid": "L14-VD178339S33837",
              "codeActe": "AN1-DEBATS-SEANCE",
              "libelleActe": {
                "nomCanonique": "Discussion en séance publique",
                "libelleCourt": "Discussion en séance publique"
              },
              "organeRef": "PO644420",
              "dateActe": "2016-06-27T00:00:00.000+02:00",
              "odjRef": "RUANR5L14S2016IDS20125PT33837",
              "reunionRef": "RUANR5L14S2016IDS20125"
            },
            {
              "xsiType": "DiscussionSeancePublique_Type",
              "uid": "L14-VD178339S33850",
              "codeActe": "AN1-DEBATS-SEANCE",
              "libelleActe": {
                "nomCanonique": "Discussion en séance publique",
                "libelleCourt": "Discussion en séance publique"
              },
              "organeRef": "PO644420",
              "dateActe": "2016-06-28T00:00:00.000+02:00",
              "odjRef": "RUANR5L14S2016IDS20133PT33850",
              "reunionRef": "RUANR5L14S2016IDS20133"
            },
            {
              "xsiType": "DiscussionSeancePublique_Type",
              "uid": "L14-VD178339S33851",
              "codeActe": "AN1-DEBATS-SEANCE",
              "libelleActe": {
                "nomCanonique": "Discussion en séance publique",
                "libelleCourt": "Discussion en séance publique"
              },
              "organeRef": "PO644420",
              "dateActe": "2016-06-28T00:00:00.000+02:00",
              "odjRef": "RUANR5L14S2016IDS20134PT33851",
              "reunionRef": "RUANR5L14S2016IDS20134"
            },
            {
              "xsiType": "DiscussionSeancePublique_Type",
              "uid": "L14-VD178339S33843",
              "codeActe": "AN1-DEBATS-SEANCE",
              "libelleActe": {
                "nomCanonique": "Discussion en séance publique",
                "libelleCourt": "Discussion en séance publique"
              },
              "organeRef": "PO644420",
              "dateActe": "2016-06-29T00:00:00.000+02:00",
              "odjRef": "RUANR5L14S2016IDS20128PT33843",
              "reunionRef": "RUANR5L14S2016IDS20128"
            },
            {
              "xsiType": "DiscussionSeancePublique_Type",
              "uid": "L14-VD178339S33844",
              "codeActe": "AN1-DEBATS-SEANCE",
              "libelleActe": {
                "nomCanonique": "Discussion en séance publique",
                "libelleCourt": "Discussion en séance publique"
              },
              "organeRef": "PO644420",
              "dateActe": "2016-06-29T00:00:00.000+02:00",
              "odjRef": "RUANR5L14S2016IDS20129PT33844",
              "reunionRef": "RUANR5L14S2016IDS20129"
            },
            {
              "xsiType": "DiscussionSeancePublique_Type",
              "uid": "L14-VD178339S33957",
              "codeActe": "AN1-DEBATS-SEANCE",
              "libelleActe": {
                "nomCanonique": "Discussion en séance publique",
                "libelleCourt": "Discussion en séance publique"
              },
              "organeRef": "PO644420",
              "dateActe": "2016-06-30T00:00:00.000+02:00",
              "odjRef": "RUANR5L14S2016IDS20130PT33957",
              "reunionRef": "RUANR5L14S2016IDS20130"
            },
            {
              "xsiType": "DiscussionSeancePublique_Type",
              "uid": "L14-VD178339S33846",
              "codeActe": "AN1-DEBATS-SEANCE",
              "libelleActe": {
                "nomCanonique": "Discussion en séance publique",
                "libelleCourt": "Discussion en séance publique"
              },
              "organeRef": "PO644420",
              "dateActe": "2016-06-30T00:00:00.000+02:00",
              "odjRef": "RUANR5L14S2016IDS20131PT33846",
              "reunionRef": "RUANR5L14S2016IDS20131"
            },
            {
              "xsiType": "DiscussionSeancePublique_Type",
              "uid": "L14-VD178339S33847",
              "codeActe": "AN1-DEBATS-SEANCE",
              "libelleActe": {
                "nomCanonique": "Discussion en séance publique",
                "libelleCourt": "Discussion en séance publique"
              },
              "organeRef": "PO644420",
              "dateActe": "2016-06-30T00:00:00.000+02:00",
              "odjRef": "RUANR5L14S2016IDS20132PT33847",
              "reunionRef": "RUANR5L14S2016IDS20132"
            },
            {
              "xsiType": "DiscussionSeancePublique_Type",
              "uid": "L14-VD178339S33891",
              "codeActe": "AN1-DEBATS-SEANCE",
              "libelleActe": {
                "nomCanonique": "Discussion en séance publique",
                "libelleCourt": "Discussion en séance publique"
              },
              "organeRef": "PO644420",
              "dateActe": "2016-07-01T00:00:00.000+02:00",
              "odjRef": "RUANR5L14S2016IDS20141PT33891",
              "reunionRef": "RUANR5L14S2016IDS20141"
            },
            {
              "xsiType": "DiscussionSeancePublique_Type",
              "uid": "L14-VD178339S33892",
              "codeActe": "AN1-DEBATS-SEANCE",
              "libelleActe": {
                "nomCanonique": "Discussion en séance publique",
                "libelleCourt": "Discussion en séance publique"
              },
              "organeRef": "PO644420",
              "dateActe": "2016-07-01T00:00:00.000+02:00",
              "odjRef": "RUANR5L14S2016IDS20142PT33892",
              "reunionRef": "RUANR5L14S2016IDS20142"
            },
            {
              "xsiType": "DiscussionSeancePublique_Type",
              "uid": "L14-VD178339S33893",
              "codeActe": "AN1-DEBATS-SEANCE",
              "libelleActe": {
                "nomCanonique": "Discussion en séance publique",
                "libelleCourt": "Discussion en séance publique"
              },
              "organeRef": "PO644420",
              "dateActe": "2016-07-01T00:00:00.000+02:00",
              "odjRef": "RUANR5L14S2016IDS20143PT33893",
              "reunionRef": "RUANR5L14S2016IDS20143"
            },
            {
              "xsiType": "DiscussionSeancePublique_Type",
              "uid": "L14-VD178339S33898",
              "codeActe": "AN1-DEBATS-SEANCE",
              "libelleActe": {
                "nomCanonique": "Discussion en séance publique",
                "libelleCourt": "Discussion en séance publique"
              },
              "organeRef": "PO644420",
              "dateActe": "2016-07-06T00:00:00.000+02:00",
              "odjRef": "RUANR5L14S2016IDS20148PT33898",
              "reunionRef": "RUANR5L14S2016IDS20148"
            },
            {
              "xsiType": "Decision_Type",
              "uid": "L14-VD178780DEC",
              "codeActe": "AN1-DEBATS-DEC",
              "libelleActe": {
                "nomCanonique": "Décision",
                "libelleCourt": "Décision"
              },
              "organeRef": "PO644420",
              "dateActe": "2016-07-06T00:00:00.000+02:00",
              "reunionRef": "RUANR5L14S2016IDS20148",
              "statutConclusion": {
                "famCode": "TSORTF01",
                "libelle": "adopté"
              },
              "textesAssocies": [
                {
                  "typeTexte": "BTA",
                  "texteAssocieRef": "PRJLANR5L14BTA0787"
                }
              ],
              "voteRefs": [
                "VTANR5L14V1312"
              ]
            }
          ]
        }
      ]
    },
    {
      "xsiType": "Etape_Type",
      "uid": "L14-SN1-34836",
      "codeActe": "SN1",
      "libelleActe": {
        "nomCanonique": "1ère lecture (2ème assemblée saisie)",
        "libelleCourt": "1ère lecture"
      },
      "organeRef": "PO78718",
      "actesLegislatifs": [
        {
          "xsiType": "DepotInitiativeNavette_Type",
          "uid": "L14-VD179140DIN",
          "codeActe": "SN1-DEPOT",
          "libelleActe": {
            "nomCanonique": "Dépôt d'une initiative en navette",
            "libelleCourt": "Dépôt d'une initiative en navette"
          },
          "organeRef": "PO78718",
          "dateActe": "2016-07-07T00:00:00.000+02:00",
          "provenanceRef": "PO644420",
          "texteAssocieRef": "PRJLSNR5S259B0773"
        },
        {
          "xsiType": "Etape_Type",
          "uid": "L14-SN1-COM-34836",
          "codeActe": "SN1-COM",
          "libelleActe": {
            "nomCanonique": "Travaux des commissions",
            "libelleCourt": "Travaux des commissions"
          },
          "organeRef": "PO78718",
          "actesLegislatifs": [
            {
              "xsiType": "Etape_Type",
              "uid": "L14-VD179141CF",
              "codeActe": "SN1-COM-FOND",
              "libelleActe": {
                "nomCanonique": "Travaux de la commission saisie au fond",
                "libelleCourt": "Travaux de la commission saisie au fond"
              },
              "organeRef": "PO714224",
              "actesLegislatifs": [
                {
                  "xsiType": "SaisieComFond_Type",
                  "uid": "L14-VD179141CFS",
                  "codeActe": "SN1-COM-FOND-SAISIE",
                  "libelleActe": {
                    "nomCanonique": "Renvoi en commission au fond",
                    "libelleCourt": "Renvoi en commission au fond"
                  },
                  "organeRef": "PO714224",
                  "dateActe": "2016-07-07T00:00:00.000+02:00"
                },
                {
                  "xsiType": "NominRapporteurs_Type",
                  "uid": "L14-VD179347",
                  "codeActe": "SN1-COM-FOND-NOMIN",
                  "libelleActe": {
                    "nomCanonique": "Nomination de rapporteur",
                    "libelleCourt": "Nomination de rapporteur"
                  },
                  "organeRef": "PO714224",
                  "dateActe": "2016-07-12T00:00:00.000+02:00",
                  "rapporteurs": [
                    {
                      "acteurRef": "PA703520",
                      "typeRapporteur": "rapporteur"
                    },
                    {
                      "acteurRef": "PA266795",
                      "typeRapporteur": "rapporteur"
                    }
                  ]
                },
                {
                  "xsiType": "DepotRapport_Type",
                  "uid": "L14-VD179349",
                  "codeActe": "SN1-COM-FOND-RAPPORT",
                  "libelleActe": {
                    "nomCanonique": "Dépôt de rapport",
                    "libelleCourt": "Dépôt de rapport"
                  },
                  "organeRef": "PO714224",
                  "dateActe": "2016-09-14T00:00:00.000+02:00",
                  "texteAssocieRef": "RAPPSNR5S259B0827"
                }
              ]
            }
          ]
        },
        {
          "xsiType": "Etape_Type",
          "uid": "L14-SN1-DEBATS-34836",
          "codeActe": "SN1-DEBATS",
          "libelleActe": {
            "nomCanonique": "Discussion en séance publique",
            "libelleCourt": "Discussion en séance publique"
          },
          "organeRef": "PO78718",
          "actesLegislatifs": [
            {
              "xsiType": "DiscussionSeancePublique_Type",
              "uid": "L14-VD179500S34320",
              "codeActe": "SN1-DEBATS-SEANCE",
              "libelleActe": {
                "nomCanonique": "Discussion en séance publique",
                "libelleCourt": "Discussion en séance publique"
              },
              "organeRef": "PO78718",
              "dateActe": "2016-10-04T00:00:00.000+02:00",
              "odjRef": "RUSNR5L14S2017IDS20364PT34320",
              "reunionRef": "RUSNR5L14S2017IDS20364"
            },
            {
              "xsiType": "DiscussionSeancePublique_Type",
              "uid": "L14-VD179500S34321",
              "codeActe": "SN1-DEBATS-SEANCE",
              "libelleActe": {
                "nomCanonique": "Discussion en séance publique",
                "libelleCourt": "Discussion en séance publique"
              },
              "organeRef": "PO78718",
              "dateActe": "2016-10-05T00:00:00.000+02:00",
              "odjRef": "RUSNR5L14S2017IDS20365PT34321",
              "reunionRef": "RUSNR5L14S2017IDS20365"
            },
            {
              "xsiType": "DiscussionSeancePublique_Type",
              "uid": "L14-VD179500S34322",
              "codeActe": "SN1-DEBATS-SEANCE",
              "libelleActe": {
                "nomCanonique": "Discussion en séance publique",
                "libelleCourt": "Discussion en séance publique"
              },
              "organeRef": "PO78718",
              "dateActe": "2016-10-06T00:00:00.000+02:00",
              "odjRef": "RUSNR5L14S2017IDS20312PT34322",
              "reunionRef": "RUSNR5L14S2017IDS20312"
            },
            {
              "xsiType": "DiscussionSeancePublique_Type",
              "uid": "L14-VD179500S34323",
              "codeActe": "SN1-DEBATS-SEANCE",
              "libelleActe": {
                "nomCanonique": "Discussion en séance publique",
                "libelleCourt": "Discussion en séance publique"
              },
              "organeRef": "PO78718",
              "dateActe": "2016-10-11T00:00:00.000+02:00",
              "odjRef": "RUSNR5L14S2017IDS20366PT34323",
              "reunionRef": "RUSNR5L14S2017IDS20366"
            },
            {
              "xsiType": "DiscussionSeancePublique_Type",
              "uid": "L14-VD179500S34324",
              "codeActe": "SN1-DEBATS-SEANCE",
              "libelleActe": {
                "nomCanonique": "Discussion en séance publique",
                "libelleCourt": "Discussion en séance publique"
              },
              "organeRef": "PO78718",
              "dateActe": "2016-10-12T00:00:00.000+02:00",
              "odjRef": "RUSNR5L14S2017IDS20367PT34324",
              "reunionRef": "RUSNR5L14S2017IDS20367"
            },
            {
              "xsiType": "DiscussionSeancePublique_Type",
              "uid": "L14-VD179500S34340",
              "codeActe": "SN1-DEBATS-SEANCE",
              "libelleActe": {
                "nomCanonique": "Discussion en séance publique",
                "libelleCourt": "Discussion en séance publique"
              },
              "organeRef": "PO78718",
              "dateActe": "2016-10-14T00:00:00.000+02:00",
              "odjRef": "RUSNR5L14S2017IDS20375PT34340",
              "reunionRef": "RUSNR5L14S2017IDS20375"
            },
            {
              "xsiType": "DiscussionSeancePublique_Type",
              "uid": "L14-VD179500S34328",
              "codeActe": "SN1-DEBATS-SEANCE",
              "libelleActe": {
                "nomCanonique": "Discussion en séance publique",
                "libelleCourt": "Discussion en séance publique"
              },
              "organeRef": "PO78718",
              "dateActe": "2016-10-18T00:00:00.000+02:00",
              "odjRef": "RUSNR5L14S2017IDS20369PT34328",
              "reunionRef": "RUSNR5L14S2017IDS20369"
            },
            {
              "xsiType": "Decision_Type",
              "uid": "L14-VD179734DEC",
              "codeActe": "SN1-DEBATS-DEC",
              "libelleActe": {
                "nomCanonique": "Décision",
                "libelleCourt": "Décision"
              },
              "organeRef": "PO78718",
              "dateActe": "2016-10-18T00:00:00.000+02:00",
              "reunionRef": "RUSNR5L14S2017IDS20369",
              "statutConclusion": {
                "famCode": "TSORTF05",
                "libelle": "modifié"
              },
              "textesAssocies": [
                {
                  "typeTexte": "BTA",
                  "texteAssocieRef": "PRJLSNR5S279BTA0004"
                }
              ]
            }
          ]
        }
      ]
    },
    {
      "xsiType": "Etape_Type",
      "uid": "L14-CMP-34836",
      "codeActe": "CMP",
      "libelleActe": {
        "nomCanonique": "Commission Mixte Paritaire",
        "libelleCourt": "Commission Mixte Paritaire"
      },
      "organeRef": "PO714945",
      "actesLegislatifs": [
        {
          "xsiType": "RenvoiCMP_Type",
          "uid": "L14-VD179743CMPS",
          "codeActe": "CMP-SAISIE",
          "libelleActe": {
            "nomCanonique": "Convocation d'une CMP",
            "libelleCourt": "Convocation d'une CMP"
          },
          "organeRef": "PO714945",
          "dateActe": "2016-10-19T00:00:00.000+02:00",
          "initiateur": {
            "acteurs": [
              {
                "acteurRef": "PA267622",
                "mandatRef": "PM702957"
              }
            ]
          }
        },
        {
          "xsiType": "Etape_Type",
          "uid": "L14-VD179743COM",
          "codeActe": "CMP-COM",
          "libelleActe": {
            "nomCanonique": "Commission Mixte Paritaire",
            "libelleCourt": "Commission Mixte Paritaire"
          },
          "organeRef": "PO714945",
          "actesLegislatifs": [
            {
              "xsiType": "NominRapporteurs_Type",
              "uid": "L14-VD179804",
              "codeActe": "CMP-COM-NOMIN",
              "libelleActe": {
                "nomCanonique": "Nomination de rapporteur",
                "libelleCourt": "Nomination de rapporteur"
              },
              "organeRef": "PO714945",
              "dateActe": "2016-10-25T00:00:00.000+02:00",
              "rapporteurs": [
                {
                  "acteurRef": "PA610291",
                  "typeRapporteur": "rapporteur"
                },
                {
                  "acteurRef": "PA607256",
                  "typeRapporteur": "rapporteur"
                },
                {
                  "acteurRef": "PA608363",
                  "typeRapporteur": "rapporteur"
                },
                {
                  "acteurRef": "PA703520",
                  "typeRapporteur": "rapporteur"
                },
                {
                  "acteurRef": "PA266795",
                  "typeRapporteur": "rapporteur"
                }
              ]
            },
            {
              "xsiType": "DepotRapport_Type",
              "uid": "L14-VD179809",
              "codeActe": "CMP-COM-RAPPORT-AN",
              "libelleActe": {
                "nomCanonique": "Dépôt du rapport d'une CMP",
                "libelleCourt": "Dépôt du rapport d'une CMP"
              },
              "organeRef": "PO644420",
              "dateActe": "2016-10-25T00:00:00.000+02:00",
              "texteAssocieRef": "RAPPANR5L14B4155"
            },
            {
              "xsiType": "DepotRapport_Type",
              "uid": "L14-VD179813",
              "codeActe": "CMP-COM-RAPPORT-SN",
              "libelleActe": {
                "nomCanonique": "Dépôt du rapport d'une CMP",
                "libelleCourt": "Dépôt du rapport d'une CMP"
              },
              "organeRef": "PO78718",
              "dateActe": "2016-10-25T00:00:00.000+02:00",
              "texteAssocieRef": "RAPPSNR5S279B0069"
            }
          ]
        },
        {
          "xsiType": "Decision_Type",
          "uid": "L14-VD179743DEC",
          "codeActe": "CMP-DEC",
          "libelleActe": {
            "nomCanonique": "Décision de la CMP",
            "libelleCourt": "Décision de la CMP"
          },
          "organeRef": "PO714945",
          "dateActe": "2016-10-26T00:00:00.000+02:00",
          "statutConclusion": {
            "famCode": "TCCMP02",
            "libelle": "Désaccord"
          }
        }
      ]
    },
    {
      "xsiType": "Etape_Type",
      "uid": "L14-ANNLEC-34836",
      "codeActe": "ANNLEC",
      "libelleActe": {
        "nomCanonique": "Nouvelle Lecture",
        "libelleCourt": "Nouvelle lecture"
      },
      "organeRef": "PO644420",
      "actesLegislatifs": [
        {
          "xsiType": "DepotInitiativeNavette_Type",
          "uid": "L14-VD179741DIN",
          "codeActe": "ANNLEC-DEPOT",
          "libelleActe": {
            "nomCanonique": "Dépôt d'une initiative en navette",
            "libelleCourt": "Dépôt d'une initiative en navette"
          },
          "organeRef": "PO644420",
          "dateActe": "2016-10-19T00:00:00.000+02:00",
          "provenanceRef": "PO714945",
          "texteAssocieRef": "PRJLANR5L14B4141"
        },
        {
          "xsiType": "Etape_Type",
          "uid": "L14-ANNLEC-COM-34836",
          "codeActe": "ANNLEC-COM",
          "libelleActe": {
            "nomCanonique": "Travaux des commissions",
            "libelleCourt": "Travaux des commissions"
          },
          "organeRef": "PO644420",
          "actesLegislatifs": [
            {
              "xsiType": "Etape_Type",
              "uid": "L14-VD179742CF",
              "codeActe": "ANNLEC-COM-FOND",
              "libelleActe": {
                "nomCanonique": "Travaux de la commission saisie au fond",
                "libelleCourt": "Travaux de la commission saisie au fond"
              },
              "organeRef": "PO712376",
              "actesLegislatifs": [
                {
                  "xsiType": "SaisieComFond_Type",
                  "uid": "L14-VD179742CFS",
                  "codeActe": "ANNLEC-COM-FOND-SAISIE",
                  "libelleActe": {
                    "nomCanonique": "Renvoi en commission au fond",
                    "libelleCourt": "Renvoi en commission au fond"
                  },
                  "organeRef": "PO712376",
                  "dateActe": "2016-10-19T00:00:00.000+02:00"
                },
                {
                  "xsiType": "DiscussionCommission_Type",
                  "uid": "L14-VD179885R24391",
                  "codeActe": "ANNLEC-COM-FOND-REUNION",
                  "libelleActe": {
                    "nomCanonique": "Réunion de commission",
                    "libelleCourt": "Réunion de commission"
                  },
                  "organeRef": "PO712376",
                  "dateActe": "2016-11-07T16:15:00.000+01:00"
                },
                {
                  "xsiType": "DiscussionCommission_Type",
                  "uid": "L14-VD179885R24393",
                  "codeActe": "ANNLEC-COM-FOND-REUNION",
                  "libelleActe": {
                    "nomCanonique": "Réunion de commission",
                    "libelleCourt": "Réunion de commission"
                  },
                  "organeRef": "PO712376",
                  "dateActe": "2016-11-08T18:30:00.000+01:00",
                  "odjRef": "RUANR5L14S2017IDC426452PT24393",
                  "reunionRef": "RUANR5L14S2017IDC426452"
                },
                {
                  "xsiType": "DiscussionCommission_Type",
                  "uid": "L14-VD179885R24394",
                  "codeActe": "ANNLEC-COM-FOND-REUNION",
                  "libelleActe": {
                    "nomCanonique": "Réunion de commission",
                    "libelleCourt": "Réunion de commission"
                  },
                  "organeRef": "PO712376",
                  "dateActe": "2016-11-08T21:30:00.000+01:00",
                  "odjRef": "RUANR5L14S2017IDC426453PT24394",
                  "reunionRef": "RUANR5L14S2017IDC426453"
                },
                {
                  "xsiType": "DiscussionCommission_Type",
                  "uid": "L14-VD179885R24504",
                  "codeActe": "ANNLEC-COM-FOND-REUNION",
                  "libelleActe": {
                    "nomCanonique": "Réunion de commission",
                    "libelleCourt": "Réunion de commission"
                  },
                  "organeRef": "PO712376",
                  "dateActe": "2016-11-22T14:30:00.000+01:00",
                  "odjRef": "RUANR5L14S2017IDC426581PT24504",
                  "reunionRef": "RUANR5L14S2017IDC426581"
                },
                {
                  "xsiType": "DepotRapport_Type",
                  "uid": "L14-VD179996",
                  "codeActe": "ANNLEC-COM-FOND-RAPPORT",
                  "libelleActe": {
                    "nomCanonique": "Dépôt de rapport",
                    "libelleCourt": "Dépôt de rapport"
                  },
                  "organeRef": "PO712376",
                  "dateActe": "2016-11-09T00:00:00.000+01:00",
                  "texteAdopteRef": "PRJLANR5L14BTC4191",
                  "texteAssocieRef": "RAPPANR5L14B4191"
                }
              ]
            }
          ]
        },
        {
          "xsiType": "Etape_Type",
          "uid": "L14-ANNLEC-DEBATS-34836",
          "codeActe": "ANNLEC-DEBATS",
          "libelleActe": {
            "nomCanonique": "Discussion en séance publique",
            "libelleCourt": "Discussion en séance publique"
          },
          "organeRef": "PO644420",
          "actesLegislatifs": [
            {
              "xsiType": "DiscussionSeancePublique_Type",
              "uid": "L14-VD179908S34375",
              "codeActe": "ANNLEC-DEBATS-SEANCE",
              "libelleActe": {
                "nomCanonique": "Discussion en séance publique",
                "libelleCourt": "Discussion en séance publique"
              },
              "organeRef": "PO644420",
              "dateActe": "2016-11-22T00:00:00.000+01:00",
              "odjRef": "RUANR5L14S2017IDS20363PT34375",
              "reunionRef": "RUANR5L14S2017IDS20363"
            },
            {
              "xsiType": "DiscussionSeancePublique_Type",
              "uid": "L14-VD179908S34377",
              "codeActe": "ANNLEC-DEBATS-SEANCE",
              "libelleActe": {
                "nomCanonique": "Discussion en séance publique",
                "libelleCourt": "Discussion en séance publique"
              },
              "organeRef": "PO644420",
              "dateActe": "2016-11-22T00:00:00.000+01:00",
              "odjRef": "RUANR5L14S2017IDS20394PT34377",
              "reunionRef": "RUANR5L14S2017IDS20394"
            },
            {
              "xsiType": "DiscussionSeancePublique_Type",
              "uid": "L14-VD179908S34383",
              "codeActe": "ANNLEC-DEBATS-SEANCE",
              "libelleActe": {
                "nomCanonique": "Discussion en séance publique",
                "libelleCourt": "Discussion en séance publique"
              },
              "organeRef": "PO644420",
              "dateActe": "2016-11-23T00:00:00.000+01:00",
              "odjRef": "RUANR5L14S2017IDS20395PT34383",
              "reunionRef": "RUANR5L14S2017IDS20395"
            },
            {
              "xsiType": "DiscussionSeancePublique_Type",
              "uid": "L14-VD179908S34384",
              "codeActe": "ANNLEC-DEBATS-SEANCE",
              "libelleActe": {
                "nomCanonique": "Discussion en séance publique",
                "libelleCourt": "Discussion en séance publique"
              },
              "organeRef": "PO644420",
              "dateActe": "2016-11-23T00:00:00.000+01:00",
              "odjRef": "RUANR5L14S2017IDS20396PT34384",
              "reunionRef": "RUANR5L14S2017IDS20396"
            },
            {
              "xsiType": "Decision_Type",
              "uid": "L14-VD180208DEC",
              "codeActe": "ANNLEC-DEBATS-DEC",
              "libelleActe": {
                "nomCanonique": "Décision",
                "libelleCourt": "Décision"
              },
              "organeRef": "PO644420",
              "dateActe": "2016-11-23T00:00:00.000+01:00",
              "reunionRef": "RUANR5L14S2017IDS20396",
              "statutConclusion": {
                "famCode": "TSORTF01",
                "libelle": "adopté"
              },
              "textesAssocies": [
                {
                  "typeTexte": "BTA",
                  "texteAssocieRef": "PRJLANR5L14BTA0838"
                }
              ]
            }
          ]
        }
      ]
    },
    {
      "xsiType": "Etape_Type",
      "uid": "L14-SNNLEC-34836",
      "codeActe": "SNNLEC",
      "libelleActe": {
        "nomCanonique": "Nouvelle Lecture",
        "libelleCourt": "Nouvelle lecture"
      },
      "organeRef": "PO78718",
      "actesLegislatifs": [
        {
          "xsiType": "DepotInitiativeNavette_Type",
          "uid": "L14-VD180259DIN",
          "codeActe": "SNNLEC-DEPOT",
          "libelleActe": {
            "nomCanonique": "Dépôt d'une initiative en navette",
            "libelleCourt": "Dépôt d'une initiative en navette"
          },
          "organeRef": "PO78718",
          "dateActe": "2016-11-25T00:00:00.000+01:00",
          "provenanceRef": "PO644420",
          "texteAssocieRef": "PRJLSNR5S279B0148"
        },
        {
          "xsiType": "Etape_Type",
          "uid": "L14-SNNLEC-COM-34836",
          "codeActe": "SNNLEC-COM",
          "libelleActe": {
            "nomCanonique": "Travaux des commissions",
            "libelleCourt": "Travaux des commissions"
          },
          "organeRef": "PO78718",
          "actesLegislatifs": [
            {
              "xsiType": "Etape_Type",
              "uid": "L14-VD180260CF",
              "codeActe": "SNNLEC-COM-FOND",
              "libelleActe": {
                "nomCanonique": "Travaux de la commission saisie au fond",
                "libelleCourt": "Travaux de la commission saisie au fond"
              },
              "organeRef": "PO714224",
              "actesLegislatifs": [
                {
                  "xsiType": "SaisieComFond_Type",
                  "uid": "L14-VD180260CFS",
                  "codeActe": "SNNLEC-COM-FOND-SAISIE",
                  "libelleActe": {
                    "nomCanonique": "Renvoi en commission au fond",
                    "libelleCourt": "Renvoi en commission au fond"
                  },
                  "organeRef": "PO714224",
                  "dateActe": "2016-11-25T00:00:00.000+01:00"
                },
                {
                  "xsiType": "DepotRapport_Type",
                  "uid": "L14-VD180426",
                  "codeActe": "SNNLEC-COM-FOND-RAPPORT",
                  "libelleActe": {
                    "nomCanonique": "Dépôt de rapport",
                    "libelleCourt": "Dépôt de rapport"
                  },
                  "organeRef": "PO714224",
                  "dateActe": "2016-12-06T00:00:00.000+01:00",
                  "texteAssocieRef": "RAPPSNR5S279B0187"
                }
              ]
            }
          ]
        },
        {
          "xsiType": "Etape_Type",
          "uid": "L14-SNNLEC-DEBATS-34836",
          "codeActe": "SNNLEC-DEBATS",
          "libelleActe": {
            "nomCanonique": "Discussion en séance publique",
            "libelleCourt": "Discussion en séance publique"
          },
          "organeRef": "PO78718",
          "actesLegislatifs": [
            {
              "xsiType": "DiscussionSeancePublique_Type",
              "uid": "L14-VD180382S34483",
              "codeActe": "SNNLEC-DEBATS-SEANCE",
              "libelleActe": {
                "nomCanonique": "Discussion en séance publique",
                "libelleCourt": "Discussion en séance publique"
              },
              "organeRef": "PO78718",
              "dateActe": "2016-12-19T00:00:00.000+01:00",
              "odjRef": "RUSNR5L14S2017IDS20437PT34483",
              "reunionRef": "RUSNR5L14S2017IDS20437"
            },
            {
              "xsiType": "Decision_Type",
              "uid": "L14-VD180558DEC",
              "codeActe": "SNNLEC-DEBATS-DEC",
              "libelleActe": {
                "nomCanonique": "Décision",
                "libelleCourt": "Décision"
              },
              "organeRef": "PO78718",
              "dateActe": "2016-12-19T00:00:00.000+01:00",
              "reunionRef": "RUSNR5L14S2017IDS20437",
              "statutConclusion": {
                "famCode": "TSORTF07",
                "libelle": "rejeté"
              },
              "textesAssocies": [
                {
                  "typeTexte": "BTA",
                  "texteAssocieRef": "PRJLSNR5S279BTA0040"
                }
              ]
            }
          ]
        }
      ]
    },
    {
      "xsiType": "Etape_Type",
      "uid": "L14-ANLDEF-34836",
      "codeActe": "ANLDEF",
      "libelleActe": {
        "nomCanonique": "Lecture définitive",
        "libelleCourt": "Lecture définitive"
      },
      "organeRef": "PO644420",
      "actesLegislatifs": [
        {
          "xsiType": "DepotInitiativeNavette_Type",
          "uid": "L14-VD180569DIN",
          "codeActe": "ANLDEF-DEPOT",
          "libelleActe": {
            "nomCanonique": "Dépôt d'une initiative en navette",
            "libelleCourt": "Dépôt d'une initiative en navette"
          },
          "organeRef": "PO644420",
          "dateActe": "2016-12-20T00:00:00.000+01:00",
          "provenanceRef": "PO78718",
          "texteAssocieRef": "PRJLANR5L14B4324"
        },
        {
          "xsiType": "Etape_Type",
          "uid": "L14-ANLDEF-COM-34836",
          "codeActe": "ANLDEF-COM",
          "libelleActe": {
            "nomCanonique": "Travaux des commissions",
            "libelleCourt": "Travaux des commissions"
          },
          "organeRef": "PO644420",
          "actesLegislatifs": [
            {
              "xsiType": "Etape_Type",
              "uid": "L14-VD180570CF",
              "codeActe": "ANLDEF-COM-FOND",
              "libelleActe": {
                "nomCanonique": "Travaux de la commission saisie au fond",
                "libelleCourt": "Travaux de la commission saisie au fond"
              },
              "organeRef": "PO712376",
              "actesLegislatifs": [
                {
                  "xsiType": "SaisieComFond_Type",
                  "uid": "L14-VD180570CFS",
                  "codeActe": "ANLDEF-COM-FOND-SAISIE",
                  "libelleActe": {
                    "nomCanonique": "Renvoi en commission au fond",
                    "libelleCourt": "Renvoi en commission au fond"
                  },
                  "organeRef": "PO712376",
                  "dateActe": "2016-12-20T00:00:00.000+01:00"
                }
              ]
            }
          ]
        },
        {
          "xsiType": "Etape_Type",
          "uid": "L14-ANLDEF-DEBATS-34836",
          "codeActe": "ANLDEF-DEBATS",
          "libelleActe": {
            "nomCanonique": "Discussion en séance publique",
            "libelleCourt": "Discussion en séance publique"
          },
          "organeRef": "PO644420",
          "actesLegislatifs": [
            {
              "xsiType": "DiscussionSeancePublique_Type",
              "uid": "L14-VD180575S34550",
              "codeActe": "ANLDEF-DEBATS-SEANCE",
              "libelleActe": {
                "nomCanonique": "Discussion en séance publique",
                "libelleCourt": "Discussion en séance publique"
              },
              "organeRef": "PO644420",
              "dateActe": "2016-12-22T00:00:00.000+01:00",
              "odjRef": "RUANR5L14S2017IDS20467PT34550",
              "reunionRef": "RUANR5L14S2017IDS20467"
            },
            {
              "xsiType": "Decision_Type",
              "uid": "L14-VD180699DEC",
              "codeActe": "ANLDEF-DEBATS-DEC",
              "libelleActe": {
                "nomCanonique": "Décision",
                "libelleCourt": "Décision"
              },
              "organeRef": "PO644420",
              "dateActe": "2016-12-22T00:00:00.000+01:00",
              "reunionRef": "RUANR5L14S2017IDS20467",
              "statutConclusion": {
                "famCode": "TSORTF01",
                "libelle": "adopté"
              },
              "textesAssocies": [
                {
                  "typeTexte": "BTA",
                  "texteAssocieRef": "PRJLANR5L14BTA0878"
                }
              ]
            }
          ]
        }
      ]
    },
    {
      "xsiType": "Etape_Type",
      "uid": "L14-CC-34836",
      "codeActe": "CC",
      "libelleActe": {
        "nomCanonique": "Conseil constitutionnel",
        "libelleCourt": "Conseil constitutionnel"
      },
      "organeRef": "PO76034",
      "actesLegislatifs": [
        {
          "xsiType": "SaisineConseilConstit_Type",
          "uid": "L14-VD180717CCS1987",
          "codeActe": "CC-SAISIE-AN",
          "libelleActe": {
            "nomCanonique": "Saisine du conseil constitutionnel",
            "libelleCourt": "Saisine du conseil constitutionnel"
          },
          "organeRef": "PO644420",
          "dateActe": "2016-12-27T00:00:00.000+01:00",
          "casSaisine": {
            "famCode": "TSCCONT05",
            "libelle": "Soixante députés au moins"
          },
          "motif": "En application de l'article 61§2 de la Constitution"
        },
        {
          "xsiType": "SaisineConseilConstit_Type",
          "uid": "L14-VD180717CCS1988",
          "codeActe": "CC-SAISIE-SN",
          "libelleActe": {
            "nomCanonique": "Saisine du conseil constitutionnel",
            "libelleCourt": "Saisine du conseil constitutionnel"
          },
          "organeRef": "PO78718",
          "dateActe": "2016-12-27T00:00:00.000+01:00",
          "casSaisine": {
            "famCode": "TSCCONT06",
            "libelle": "Soixante sénateurs au moins"
          },
          "motif": "En application de l'article 61§2 de la Constitution"
        },
        {
          "xsiType": "ConclusionEtapeCC_Type",
          "uid": "L14-VD180717CCC",
          "codeActe": "CC-CONCLUSION",
          "libelleActe": {
            "nomCanonique": "Conclusion du conseil constitutionnel",
            "libelleCourt": "Conclusion du conseil constitutionnel"
          },
          "organeRef": "PO76034",
          "dateActe": "2017-01-26T00:00:00.000+01:00",
          "anneeDecision": "2016",
          "numDecision": "745",
          "statutConclusion": {
            "famCode": "TCD02",
            "libelle": "Partiellement conforme"
          },
          "urlConclusion": "http://www.conseil-constitutionnel.fr/decision/2017/2016745dc.htm"
        }
      ]
    },
    {
      "xsiType": "Etape_Type",
      "uid": "L14-PROM-34836",
      "codeActe": "PROM",
      "libelleActe": {
        "nomCanonique": "Promulgation de la loi",
        "libelleCourt": "Promulgation de la loi"
      },
      "organeRef": "PO696251",
      "actesLegislatifs": [
        {
          "xsiType": "Promulgation_Type",
          "uid": "L14-VD181058PL",
          "codeActe": "PROM-PUB",
          "libelleActe": {
            "nomCanonique": "Promulgation d'une loi",
            "libelleCourt": "Promulgation d'une loi"
          },
          "organeRef": "PO696251",
          "dateActe": "2017-01-26T00:00:00.000+01:00",
          "codeLoi": "2017-86",
          "infoJo": {
            "typeJo": "JO_LOI_DECRET",
            "dateJo": "2017-01-28+01:00",
            "numJo": "24"
          },
          "infoJoRect": [
            {
              "typeJo": "JO_LOI_DECRET",
              "dateJo": "2017-01-31+01:00",
              "numJo": "26"
            }
          ],
          "referenceNor": "LHAL1528110L",
          "texteLoiRef": "PRJLANR5L14BTA0878",
          "titreLoi": "relative à l'égalité et à la citoyenneté",
          "urlLegifrance": "http://www.legifrance.gouv.fr/WAspad/UnTexteDeJorf?numjo=LHAL1528110L"
        }
      ]
    }
  ]
}