{
  "xsiType": "rapportParlementaire_Type",
  "uid": "RAPPSNR5S219B0201",
  "cycleDeVie": {
    "chrono": {
      "dateCreation": "2013-12-06T00:00:00.000+01:00",
      "dateDepot": "2013-12-04T00:00:00.000+01:00"
    }
  },
  "denominationStructurelle": "Rapport",
  "provenance": "Commission",
  "titres": {
    "titrePrincipal": "rapport sur   le projet de loi , adopté par l'Assemblée nationale après engagement de la procédure accélérée, d'habilitation à prendre par ordonnances diverses mesures de simplification et de sécurisation de la vie des entreprises (n°28)",
    "titrePrincipalCourt": "rapport sur   le projet de loi , adopté par l'Assemblée nationale après engagement de la procédure accélérée, d'habilitation à prendre par ordonnances diverses mesures de simplification et de sécurisation de la vie des entreprises (n°28)"
  },
  "dossierRef": "DLR5L14N31093",
  "classification": {
    "famille": {
      "depot": {
        "code": "RAPINIT",
        "libelle": "Rapport sur une initiative"
      },
      "classe": {
        "code": "RAPPORT",
        "libelle": "Rapport"
      }
    },
    "type": {
      "code": "RAPP",
      "libelle": "Rapport"
    }
  },
  "auteurs": [
    {
      "acteur": {
        "acteurRef": "PA429840",
        "qualite": "rapporteur"
      }
    },
    {
      "organeRef": "PO211495"
    }
  ],
  "notice": {
    "numNotice": "201",
    "formule": "sur   le projet de loi , adopté par l'Assemblée nationale après engagement de la procédure accélérée, d'habilitation à prendre par ordonnances diverses mesures de simplification et de sécurisation de la vie des entreprises (n°28)",
    "adoptionConforme": false
  }
}