{
  "xsiType": "texteLoi_Type",
  "uid": "PNREANR5L14B3782",
  "legislature": "14",
  "cycleDeVie": {
    "chrono": {
      "dateCreation": "2016-05-25T00:00:00.000+02:00",
      "dateDepot": "2016-05-25T00:00:00.000+02:00",
      "datePublication": "2016-06-03T00:00:00.000+02:00",
      "datePublicationWeb": "2016-06-02T11:20:00.000+02:00"
    }
  },
  "denominationStructurelle": "Proposition de résolution",
  "provenance": "Texte Déposé",
  "titres": {
    "titrePrincipal": "proposition de résolution visant à protéger le système du crédit immobilier français dans le cadre des négociations de Bâle",
    "titrePrincipalCourt": "protéger le système du crédit immobilier français dans le cadre des négociations de Bâle"
  },
  "dossierRef": "DLR5L14N34929",
  "classification": {
    "famille": {
      "depot": {
        "code": "INITDEP",
        "libelle": "Initiative en 1er Dépôt"
      },
      "classe": {
        "code": "PIONRES",
        "libelle": "Proposition de résolution"
      },
      "espece": {
        "code": "APPART341",
        "libelle": "en application de Article 34-1 de la Constitution"
      }
    },
    "type": {
      "code": "PNRE",
      "libelle": "Proposition de résolution"
    },
    "sousType": {
      "code": "APPART341",
      "libelle": "en application de Article 34-1 de la Constitution"
    }
  },
  "auteurs": [
    {
      "acteur": {
        "acteurRef": "PA1886",
        "qualite": "auteur"
      }
    },
    {
      "acteur": {
        "acteurRef": "PA607761",
        "qualite": "auteur"
      }
    }
  ],
  "notice": {
    "numNotice": "3782",
    "formule": "visant à protéger le système du crédit immobilier français dans le cadre des négociations de Bâle",
    "adoptionConforme": false
  },
  "coSignataires": [
    {
      "acteurRef": "PA336971",
      "dateCosignature": "2016-05-25+02:00",
      "edite": true
    },
    {
      "acteurRef": "PA405480",
      "dateCosignature": "2016-05-25+02:00",
      "edite": true
    },
    {
      "acteurRef": "PA608363",
      "dateCosignature": "2016-05-25+02:00",
      "edite": true
    },
    {
      "acteurRef": "PA333043",
      "dateCosignature": "2016-05-25+02:00",
      "edite": true
    },
    {
      "dateCosignature": "2016-05-25+02:00",
      "edite": false,
      "organe": {
        "organeRef": "PO713077",
        "etApparentes": true
      }
    },
    {
      "acteurRef": "PA610758",
      "dateCosignature": "2016-05-25+02:00",
      "edite": false
    },
    {
      "acteurRef": "PA267695",
      "dateCosignature": "2016-05-25+02:00",
      "edite": false
    },
    {
      "acteurRef": "PA608276",
      "dateCosignature": "2016-05-25+02:00",
      "edite": false
    },
    {
      "acteurRef": "PA605963",
      "dateCosignature": "2016-05-25+02:00",
      "edite": false
    },
    {
      "acteurRef": "PA607892",
      "dateCosignature": "2016-05-25+02:00",
      "edite": false
    },
    {
      "acteurRef": "PA606675",
      "dateCosignature": "2016-05-25+02:00",
      "edite": false
    },
    {
      "acteurRef": "PA267706",
      "dateCosignature": "2016-05-25+02:00",
      "edite": false
    },
    {
      "acteurRef": "PA590031",
      "dateCosignature": "2016-05-25+02:00",
      "edite": false
    },
    {
      "acteurRef": "PA606631",
      "dateCosignature": "2016-05-25+02:00",
      "edite": false
    },
    {
      "acteurRef": "PA608348",
      "dateCosignature": "2016-05-25+02:00",
      "edite": false
    },
    {
      "acteurRef": "PA610066",
      "dateCosignature": "2016-05-25+02:00",
      "edite": false
    },
    {
      "acteurRef": "PA642987",
      "dateCosignature": "2016-05-25+02:00",
      "edite": false
    },
    {
      "acteurRef": "PA334",
      "dateCosignature": "2016-05-25+02:00",
      "edite": false
    },
    {
      "acteurRef": "PA339",
      "dateCosignature": "2016-05-25+02:00",
      "edite": false
    },
    {
      "acteurRef": "PA642705",
      "dateCosignature": "2016-05-25+02:00",
      "edite": false
    },
    {
      "acteurRef": "PA642699",
      "dateCosignature": "2016-05-25+02:00",
      "edite": false
    },
    {
      "acteurRef": "PA356",
      "dateCosignature": "2016-05-25+02:00",
      "edite": false
    },
    {
      "acteurRef": "PA642724",
      "dateCosignature": "2016-05-25+02:00",
      "edite": false
    },
    {
      "acteurRef": "PA607369",
      "dateCosignature": "2016-05-25+02:00",
      "edite": false
    },
    {
      "acteurRef": "PA381",
      "dateCosignature": "2016-05-25+02:00",
      "edite": false
    },
    {
      "acteurRef": "PA394",
      "dateCosignature": "2016-05-25+02:00",
      "edite": false
    },
    {
      "acteurRef": "PA335999",
      "dateCosignature": "2016-05-25+02:00",
      "edite": false
    },
    {
      "acteurRef": "PA342415",
      "dateCosignature": "2016-05-25+02:00",
      "edite": false
    },
    {
      "acteurRef": "PA608686",
      "dateCosignature": "2016-05-25+02:00",
      "edite": false
    },
    {
      "acteurRef": "PA606793",
      "dateCosignature": "2016-05-25+02:00",
      "edite": false
    },
    {
      "acteurRef": "PA608158",
      "dateCosignature": "2016-05-25+02:00",
      "edite": false
    },
    {
      "acteurRef": "PA609845",
      "dateCosignature": "2016-05-25+02:00",
      "edite": false
    },
    {
      "acteurRef": "PA605076",
      "dateCosignature": "2016-05-25+02:00",
      "edite": false
    },
    {
      "acteurRef": "PA342332",
      "dateCosignature": "2016-05-25+02:00",
      "edite": false
    },
    {
      "acteurRef": "PA607310",
      "dateCosignature": "2016-05-25+02:00",
      "edite": false
    },
    {
      "acteurRef": "PA605143",
      "dateCosignature": "2016-05-25+02:00",
      "edite": false
    },
    {
      "acteurRef": "PA337504",
      "dateCosignature": "2016-05-25+02:00",
      "edite": false
    },
    {
      "acteurRef": "PA508",
      "dateCosignature": "2016-05-25+02:00",
      "edite": false
    },
    {
      "acteurRef": "PA606899",
      "dateCosignature": "2016-05-25+02:00",
      "edite": false
    },
    {
      "acteurRef": "PA536",
      "dateCosignature": "2016-05-25+02:00",
      "edite": false
    },
    {
      "acteurRef": "PA608641",
      "dateCosignature": "2016-05-25+02:00",
      "edite": false
    },
    {
      "acteurRef": "PA606149",
      "dateCosignature": "2016-05-25+02:00",
      "edite": false
    },
    {
      "acteurRef": "PA543",
      "dateCosignature": "2016-05-25+02:00",
      "edite": false
    },
    {
      "acteurRef": "PA560",
      "dateCosignature": "2016-05-25+02:00",
      "edite": false
    },
    {
      "acteurRef": "PA606363",
      "dateCosignature": "2016-05-25+02:00",
      "edite": false
    },
    {
      "acteurRef": "PA606507",
      "dateCosignature": "2016-05-25+02:00",
      "edite": false
    },
    {
      "acteurRef": "PA332843",
      "dateCosignature": "2016-05-25+02:00",
      "edite": false
    },
    {
      "acteurRef": "PA267233",
      "dateCosignature": "2016-05-25+02:00",
      "edite": false
    },
    {
      "acteurRef": "PA608083",
      "dateCosignature": "2016-05-25+02:00",
      "edite": false
    },
    {
      "acteurRef": "PA610045",
      "dateCosignature": "2016-05-25+02:00",
      "edite": false
    },
    {
      "acteurRef": "PA605830",
      "dateCosignature": "2016-05-25+02:00",
      "edite": false
    },
    {
      "acteurRef": "PA609314",
      "dateCosignature": "2016-05-25+02:00",
      "edite": false
    },
    {
      "acteurRef": "PA605069",
      "dateCosignature": "2016-05-25+02:00",
      "edite": false
    },
    {
      "acteurRef": "PA672",
      "dateCosignature": "2016-05-25+02:00",
      "edite": false
    },
    {
      "acteurRef": "PA606745",
      "dateCosignature": "2016-05-25+02:00",
      "edite": false
    },
    {
      "acteurRef": "PA605261",
      "dateCosignature": "2016-05-25+02:00",
      "edite": false
    },
    {
      "acteurRef": "PA609535",
      "dateCosignature": "2016-05-25+02:00",
      "edite": false
    },
    {
      "acteurRef": "PA609743",
      "dateCosignature": "2016-05-25+02:00",
      "edite": false
    },
    {
      "acteurRef": "PA695",
      "dateCosignature": "2016-05-25+02:00",
      "edite": false
    },
    {
      "acteurRef": "PA605643",
      "dateCosignature": "2016-05-25+02:00",
      "edite": false
    },
    {
      "acteurRef": "PA719",
      "dateCosignature": "2016-05-25+02:00",
      "edite": false
    },
    {
      "acteurRef": "PA608264",
      "dateCosignature": "2016-05-25+02:00",
      "edite": false
    },
    {
      "acteurRef": "PA608098",
      "dateCosignature": "2016-05-25+02:00",
      "edite": false
    },
    {
      "acteurRef": "PA735",
      "dateCosignature": "2016-05-25+02:00",
      "edite": false
    },
    {
      "acteurRef": "PA590034",
      "dateCosignature": "2016-05-25+02:00",
      "edite": false
    },
    {
      "acteurRef": "PA642940",
      "dateCosignature": "2016-05-25+02:00",
      "edite": false
    },
    {
      "acteurRef": "PA267188",
      "dateCosignature": "2016-05-25+02:00",
      "edite": false
    },
    {
      "acteurRef": "PA605131",
      "dateCosignature": "2016-05-25+02:00",
      "edite": false
    },
    {
      "acteurRef": "PA765",
      "dateCosignature": "2016-05-25+02:00",
      "edite": false
    },
    {
      "acteurRef": "PA770",
      "dateCosignature": "2016-05-25+02:00",
      "edite": false
    },
    {
      "acteurRef": "PA606258",
      "dateCosignature": "2016-05-25+02:00",
      "edite": false
    },
    {
      "acteurRef": "PA608235",
      "dateCosignature": "2016-05-25+02:00",
      "edite": false
    },
    {
      "acteurRef": "PA330118",
      "dateCosignature": "2016-05-25+02:00",
      "edite": false
    },
    {
      "acteurRef": "PA810",
      "dateCosignature": "2016-05-25+02:00",
      "edite": false
    },
    {
      "acteurRef": "PA606665",
      "dateCosignature": "2016-05-25+02:00",
      "edite": false
    },
    {
      "acteurRef": "PA840",
      "dateCosignature": "2016-05-25+02:00",
      "edite": false
    },
    {
      "acteurRef": "PA609042",
      "dateCosignature": "2016-05-25+02:00",
      "edite": false
    },
    {
      "acteurRef": "PA605557",
      "dateCosignature": "2016-05-25+02:00",
      "edite": false
    },
    {
      "acteurRef": "PA872",
      "dateCosignature": "2016-05-25+02:00",
      "edite": false
    },
    {
      "acteurRef": "PA336439",
      "dateCosignature": "2016-05-25+02:00",
      "edite": false
    },
    {
      "acteurRef": "PA877",
      "dateCosignature": "2016-05-25+02:00",
      "edite": false
    },
    {
      "acteurRef": "PA643020",
      "dateCosignature": "2016-05-25+02:00",
      "edite": false
    },
    {
      "acteurRef": "PA643177",
      "dateCosignature": "2016-05-25+02:00",
      "edite": false
    },
    {
      "acteurRef": "PA610891",
      "dateCosignature": "2016-05-25+02:00",
      "edite": false
    },
    {
      "acteurRef": "PA607256",
      "dateCosignature": "2016-05-25+02:00",
      "edite": false
    },
    {
      "acteurRef": "PA344114",
      "dateCosignature": "2016-05-25+02:00",
      "edite": false
    },
    {
      "acteurRef": "PA336421",
      "dateCosignature": "2016-05-25+02:00",
      "edite": false
    },
    {
      "acteurRef": "PA608310",
      "dateCosignature": "2016-05-25+02:00",
      "edite": false
    },
    {
      "acteurRef": "PA334811",
      "dateCosignature": "2016-05-25+02:00",
      "edite": false
    },
    {
      "acteurRef": "PA334160",
      "dateCosignature": "2016-05-25+02:00",
      "edite": false
    },
    {
      "acteurRef": "PA608920",
      "dateCosignature": "2016-05-25+02:00",
      "edite": false
    },
    {
      "acteurRef": "PA712422",
      "dateCosignature": "2016-05-25+02:00",
      "edite": false
    },
    {
      "acteurRef": "PA607155",
      "dateCosignature": "2016-05-25+02:00",
      "edite": false
    },
    {
      "acteurRef": "PA267623",
      "dateCosignature": "2016-05-25+02:00",
      "edite": false
    },
    {
      "acteurRef": "PA1032",
      "dateCosignature": "2016-05-25+02:00",
      "edite": false
    },
    {
      "acteurRef": "PA342539",
      "dateCosignature": "2016-05-25+02:00",
      "edite": false
    },
    {
      "acteurRef": "PA331924",
      "dateCosignature": "2016-05-25+02:00",
      "edite": false
    },
    {
      "acteurRef": "PA267923",
      "dateCosignature": "2016-05-25+02:00",
      "edite": false
    },
    {
      "acteurRef": "PA606351",
      "dateCosignature": "2016-05-25+02:00",
      "edite": false
    },
    {
      "acteurRef": "PA642965",
      "dateCosignature": "2016-05-25+02:00",
      "edite": false
    },
    {
      "acteurRef": "PA643002",
      "dateCosignature": "2016-05-25+02:00",
      "edite": false
    },
    {
      "acteurRef": "PA606623",
      "dateCosignature": "2016-05-25+02:00",
      "edite": false
    },
    {
      "acteurRef": "PA609435",
      "dateCosignature": "2016-05-25+02:00",
      "edite": false
    },
    {
      "acteurRef": "PA606040",
      "dateCosignature": "2016-05-25+02:00",
      "edite": false
    },
    {
      "acteurRef": "PA1116",
      "dateCosignature": "2016-05-25+02:00",
      "edite": false
    },
    {
      "acteurRef": "PA606573",
      "dateCosignature": "2016-05-25+02:00",
      "edite": false
    },
    {
      "acteurRef": "PA1155",
      "dateCosignature": "2016-05-25+02:00",
      "edite": false
    },
    {
      "acteurRef": "PA610539",
      "dateCosignature": "2016-05-25+02:00",
      "edite": false
    },
    {
      "acteurRef": "PA606412",
      "dateCosignature": "2016-05-25+02:00",
      "edite": false
    },
    {
      "acteurRef": "PA608718",
      "dateCosignature": "2016-05-25+02:00",
      "edite": false
    },
    {
      "acteurRef": "PA1182",
      "dateCosignature": "2016-05-25+02:00",
      "edite": false
    },
    {
      "acteurRef": "PA607919",
      "dateCosignature": "2016-05-25+02:00",
      "edite": false
    },
    {
      "acteurRef": "PA1193",
      "dateCosignature": "2016-05-25+02:00",
      "edite": false
    },
    {
      "acteurRef": "PA606202",
      "dateCosignature": "2016-05-25+02:00",
      "edite": false
    },
    {
      "acteurRef": "PA1199",
      "dateCosignature": "2016-05-25+02:00",
      "edite": false
    },
    {
      "acteurRef": "PA1198",
      "dateCosignature": "2016-05-25+02:00",
      "edite": false
    },
    {
      "acteurRef": "PA1208",
      "dateCosignature": "2016-05-25+02:00",
      "edite": false
    },
    {
      "acteurRef": "PA1214",
      "dateCosignature": "2016-05-25+02:00",
      "edite": false
    },
    {
      "acteurRef": "PA1226",
      "dateCosignature": "2016-05-25+02:00",
      "edite": false
    },
    {
      "acteurRef": "PA330357",
      "dateCosignature": "2016-05-25+02:00",
      "edite": false
    },
    {
      "acteurRef": "PA1252",
      "dateCosignature": "2016-05-25+02:00",
      "edite": false
    },
    {
      "acteurRef": "PA331282",
      "dateCosignature": "2016-05-25+02:00",
      "edite": false
    },
    {
      "acteurRef": "PA607193",
      "dateCosignature": "2016-05-25+02:00",
      "edite": false
    },
    {
      "acteurRef": "PA605349",
      "dateCosignature": "2016-05-25+02:00",
      "edite": false
    },
    {
      "acteurRef": "PA609332",
      "dateCosignature": "2016-05-25+02:00",
      "edite": false
    },
    {
      "acteurRef": "PA340432",
      "dateCosignature": "2016-05-25+02:00",
      "edite": false
    },
    {
      "acteurRef": "PA332015",
      "dateCosignature": "2016-05-25+02:00",
      "edite": false
    },
    {
      "acteurRef": "PA333335",
      "dateCosignature": "2016-05-25+02:00",
      "edite": false
    },
    {
      "acteurRef": "PA606171",
      "dateCosignature": "2016-05-25+02:00",
      "edite": false
    },
    {
      "acteurRef": "PA333611",
      "dateCosignature": "2016-05-25+02:00",
      "edite": false
    },
    {
      "acteurRef": "PA332364",
      "dateCosignature": "2016-05-25+02:00",
      "edite": false
    },
    {
      "acteurRef": "PA609775",
      "dateCosignature": "2016-05-25+02:00",
      "edite": false
    },
    {
      "acteurRef": "PA343408",
      "dateCosignature": "2016-05-25+02:00",
      "edite": false
    },
    {
      "acteurRef": "PA335543",
      "dateCosignature": "2016-05-25+02:00",
      "edite": false
    },
    {
      "acteurRef": "PA609691",
      "dateCosignature": "2016-05-25+02:00",
      "edite": false
    },
    {
      "acteurRef": "PA1353",
      "dateCosignature": "2016-05-25+02:00",
      "edite": false
    },
    {
      "acteurRef": "PA1362",
      "dateCosignature": "2016-05-25+02:00",
      "edite": false
    },
    {
      "acteurRef": "PA337568",
      "dateCosignature": "2016-05-25+02:00",
      "edite": false
    },
    {
      "acteurRef": "PA332636",
      "dateCosignature": "2016-05-25+02:00",
      "edite": false
    },
    {
      "acteurRef": "PA2374",
      "dateCosignature": "2016-05-25+02:00",
      "edite": false
    },
    {
      "acteurRef": "PA1401",
      "dateCosignature": "2016-05-25+02:00",
      "edite": false
    },
    {
      "acteurRef": "PA333285",
      "dateCosignature": "2016-05-25+02:00",
      "edite": false
    },
    {
      "acteurRef": "PA643165",
      "dateCosignature": "2016-05-25+02:00",
      "edite": false
    },
    {
      "acteurRef": "PA610203",
      "dateCosignature": "2016-05-25+02:00",
      "edite": false
    },
    {
      "acteurRef": "PA332305",
      "dateCosignature": "2016-05-25+02:00",
      "edite": false
    },
    {
      "acteurRef": "PA1496",
      "dateCosignature": "2016-05-25+02:00",
      "edite": false
    },
    {
      "acteurRef": "PA608038",
      "dateCosignature": "2016-05-25+02:00",
      "edite": false
    },
    {
      "acteurRef": "PA642836",
      "dateCosignature": "2016-05-25+02:00",
      "edite": false
    },
    {
      "acteurRef": "PA331973",
      "dateCosignature": "2016-05-25+02:00",
      "edite": false
    },
    {
      "acteurRef": "PA609578",
      "dateCosignature": "2016-05-25+02:00",
      "edite": false
    },
    {
      "acteurRef": "PA605804",
      "dateCosignature": "2016-05-25+02:00",
      "edite": false
    },
    {
      "acteurRef": "PA336015",
      "dateCosignature": "2016-05-25+02:00",
      "edite": false
    },
    {
      "acteurRef": "PA608684",
      "dateCosignature": "2016-05-25+02:00",
      "edite": false
    },
    {
      "acteurRef": "PA1579",
      "dateCosignature": "2016-05-25+02:00",
      "edite": false
    },
    {
      "acteurRef": "PA606161",
      "dateCosignature": "2016-05-25+02:00",
      "edite": false
    },
    {
      "acteurRef": "PA1592",
      "dateCosignature": "2016-05-25+02:00",
      "edite": false
    },
    {
      "acteurRef": "PA610291",
      "dateCosignature": "2016-05-25+02:00",
      "edite": false
    },
    {
      "acteurRef": "PA590032",
      "dateCosignature": "2016-05-25+02:00",
      "edite": false
    },
    {
      "acteurRef": "PA610245",
      "dateCosignature": "2016-05-25+02:00",
      "edite": false
    },
    {
      "acteurRef": "PA606924",
      "dateCosignature": "2016-05-25+02:00",
      "edite": false
    },
    {
      "acteurRef": "PA333818",
      "dateCosignature": "2016-05-25+02:00",
      "edite": false
    },
    {
      "acteurRef": "PA331835",
      "dateCosignature": "2016-05-25+02:00",
      "edite": false
    },
    {
      "acteurRef": "PA1689",
      "dateCosignature": "2016-05-25+02:00",
      "edite": false
    },
    {
      "acteurRef": "PA332384",
      "dateCosignature": "2016-05-25+02:00",
      "edite": false
    },
    {
      "acteurRef": "PA268039",
      "dateCosignature": "2016-05-25+02:00",
      "edite": false
    },
    {
      "acteurRef": "PA1710",
      "dateCosignature": "2016-05-25+02:00",
      "edite": false
    },
    {
      "acteurRef": "PA330613",
      "dateCosignature": "2016-05-25+02:00",
      "edite": false
    },
    {
      "acteurRef": "PA643196",
      "dateCosignature": "2016-05-25+02:00",
      "edite": false
    },
    {
      "acteurRef": "PA332614",
      "dateCosignature": "2016-05-25+02:00",
      "edite": false
    },
    {
      "acteurRef": "PA607691",
      "dateCosignature": "2016-05-25+02:00",
      "edite": false
    },
    {
      "acteurRef": "PA335054",
      "dateCosignature": "2016-05-25+02:00",
      "edite": false
    },
    {
      "acteurRef": "PA344242",
      "dateCosignature": "2016-05-25+02:00",
      "edite": false
    },
    {
      "acteurRef": "PA607509",
      "dateCosignature": "2016-05-25+02:00",
      "edite": false
    },
    {
      "acteurRef": "PA608785",
      "dateCosignature": "2016-05-25+02:00",
      "edite": false
    },
    {
      "acteurRef": "PA1789",
      "dateCosignature": "2016-05-25+02:00",
      "edite": false
    },
    {
      "acteurRef": "PA605518",
      "dateCosignature": "2016-05-25+02:00",
      "edite": false
    },
    {
      "acteurRef": "PA1816",
      "dateCosignature": "2016-05-25+02:00",
      "edite": false
    },
    {
      "acteurRef": "PA643205",
      "dateCosignature": "2016-05-25+02:00",
      "edite": false
    },
    {
      "acteurRef": "PA341339",
      "dateCosignature": "2016-05-25+02:00",
      "edite": false
    },
    {
      "acteurRef": "PA1844",
      "dateCosignature": "2016-05-25+02:00",
      "edite": false
    },
    {
      "acteurRef": "PA610481",
      "dateCosignature": "2016-05-25+02:00",
      "edite": false
    },
    {
      "acteurRef": "PA610936",
      "dateCosignature": "2016-05-25+02:00",
      "edite": false
    },
    {
      "acteurRef": "PA267835",
      "dateCosignature": "2016-05-25+02:00",
      "edite": false
    },
    {
      "acteurRef": "PA1893",
      "dateCosignature": "2016-05-25+02:00",
      "edite": false
    },
    {
      "acteurRef": "PA1866",
      "dateCosignature": "2016-05-25+02:00",
      "edite": false
    },
    {
      "acteurRef": "PA606555",
      "dateCosignature": "2016-05-25+02:00",
      "edite": false
    },
    {
      "acteurRef": "PA1871",
      "dateCosignature": "2016-05-25+02:00",
      "edite": false
    },
    {
      "acteurRef": "PA341246",
      "dateCosignature": "2016-05-25+02:00",
      "edite": false
    },
    {
      "acteurRef": "PA1911",
      "dateCosignature": "2016-05-25+02:00",
      "edite": false
    },
    {
      "acteurRef": "PA610594",
      "dateCosignature": "2016-05-25+02:00",
      "edite": false
    },
    {
      "acteurRef": "PA605888",
      "dateCosignature": "2016-05-25+02:00",
      "edite": false
    },
    {
      "acteurRef": "PA331658",
      "dateCosignature": "2016-05-25+02:00",
      "edite": false
    },
    {
      "acteurRef": "PA1936",
      "dateCosignature": "2016-05-25+02:00",
      "edite": false
    },
    {
      "acteurRef": "PA331753",
      "dateCosignature": "2016-05-25+02:00",
      "edite": false
    },
    {
      "acteurRef": "PA605278",
      "dateCosignature": "2016-05-25+02:00",
      "edite": false
    },
    {
      "acteurRef": "PA267965",
      "dateCosignature": "2016-05-25+02:00",
      "edite": false
    },
    {
      "acteurRef": "PA607606",
      "dateCosignature": "2016-05-25+02:00",
      "edite": false
    },
    {
      "acteurRef": "PA642736",
      "dateCosignature": "2016-05-25+02:00",
      "edite": false
    },
    {
      "acteurRef": "PA610905",
      "dateCosignature": "2016-05-25+02:00",
      "edite": false
    },
    {
      "acteurRef": "PA1963",
      "dateCosignature": "2016-05-25+02:00",
      "edite": false
    },
    {
      "acteurRef": "PA330130",
      "dateCosignature": "2016-05-25+02:00",
      "edite": false
    },
    {
      "acteurRef": "PA337483",
      "dateCosignature": "2016-05-25+02:00",
      "edite": false
    },
    {
      "acteurRef": "PA642962",
      "dateCosignature": "2016-05-25+02:00",
      "edite": false
    },
    {
      "acteurRef": "PA1977",
      "dateCosignature": "2016-05-25+02:00",
      "edite": false
    },
    {
      "acteurRef": "PA1979",
      "dateCosignature": "2016-05-25+02:00",
      "edite": false
    },
    {
      "acteurRef": "PA1991",
      "dateCosignature": "2016-05-25+02:00",
      "edite": false
    },
    {
      "acteurRef": "PA268042",
      "dateCosignature": "2016-05-25+02:00",
      "edite": false
    },
    {
      "acteurRef": "PA607283",
      "dateCosignature": "2016-05-25+02:00",
      "edite": false
    },
    {
      "acteurRef": "PA268048",
      "dateCosignature": "2016-05-25+02:00",
      "edite": false
    },
    {
      "acteurRef": "PA334116",
      "dateCosignature": "2016-05-25+02:00",
      "edite": false
    },
    {
      "acteurRef": "PA330546",
      "dateCosignature": "2016-05-25+02:00",
      "edite": false
    },
    {
      "acteurRef": "PA332206",
      "dateCosignature": "2016-05-25+02:00",
      "edite": false
    },
    {
      "acteurRef": "PA267278",
      "dateCosignature": "2016-05-25+02:00",
      "edite": false
    },
    {
      "acteurRef": "PA331807",
      "dateCosignature": "2016-05-25+02:00",
      "edite": false
    },
    {
      "acteurRef": "PA267091",
      "dateCosignature": "2016-05-25+02:00",
      "edite": false
    },
    {
      "acteurRef": "PA609816",
      "dateCosignature": "2016-05-25+02:00",
      "edite": false
    },
    {
      "acteurRef": "PA335319",
      "dateCosignature": "2016-05-25+02:00",
      "edite": false
    },
    {
      "acteurRef": "PA332796",
      "dateCosignature": "2016-05-25+02:00",
      "edite": false
    },
    {
      "acteurRef": "PA605426",
      "dateCosignature": "2016-05-25+02:00",
      "edite": false
    },
    {
      "acteurRef": "PA267479",
      "dateCosignature": "2016-05-25+02:00",
      "edite": false
    },
    {
      "acteurRef": "PA607619",
      "dateCosignature": "2016-05-25+02:00",
      "edite": false
    },
    {
      "acteurRef": "PA334755",
      "dateCosignature": "2016-05-25+02:00",
      "edite": false
    },
    {
      "acteurRef": "PA643157",
      "dateCosignature": "2016-05-25+02:00",
      "edite": false
    },
    {
      "acteurRef": "PA2265",
      "dateCosignature": "2016-05-25+02:00",
      "edite": false
    },
    {
      "acteurRef": "PA606030",
      "dateCosignature": "2016-05-25+02:00",
      "edite": false
    },
    {
      "acteurRef": "PA642885",
      "dateCosignature": "2016-05-25+02:00",
      "edite": false
    },
    {
      "acteurRef": "PA609983",
      "dateCosignature": "2016-05-25+02:00",
      "edite": false
    },
    {
      "acteurRef": "PA610729",
      "dateCosignature": "2016-05-25+02:00",
      "edite": false
    },
    {
      "acteurRef": "PA2317",
      "dateCosignature": "2016-05-25+02:00",
      "edite": false
    },
    {
      "acteurRef": "PA267534",
      "dateCosignature": "2016-05-25+02:00",
      "edite": false
    },
    {
      "acteurRef": "PA2338",
      "dateCosignature": "2016-05-25+02:00",
      "edite": false
    },
    {
      "acteurRef": "PA607769",
      "dateCosignature": "2016-05-25+02:00",
      "edite": false
    },
    {
      "acteurRef": "PA2343",
      "dateCosignature": "2016-05-25+02:00",
      "edite": false
    },
    {
      "acteurRef": "PA607595",
      "dateCosignature": "2016-05-25+02:00",
      "edite": false
    },
    {
      "acteurRef": "PA2365",
      "dateCosignature": "2016-05-25+02:00",
      "edite": false
    },
    {
      "acteurRef": "PA610075",
      "dateCosignature": "2016-05-25+02:00",
      "edite": false
    },
    {
      "acteurRef": "PA608172",
      "dateCosignature": "2016-05-25+02:00",
      "edite": false
    },
    {
      "acteurRef": "PA2430",
      "dateCosignature": "2016-05-25+02:00",
      "edite": false
    },
    {
      "acteurRef": "PA610313",
      "dateCosignature": "2016-05-25+02:00",
      "edite": false
    },
    {
      "acteurRef": "PA693008",
      "dateCosignature": "2016-05-25+02:00",
      "edite": false
    },
    {
      "acteurRef": "PA610354",
      "dateCosignature": "2016-05-25+02:00",
      "edite": false
    },
    {
      "acteurRef": "PA607553",
      "dateCosignature": "2016-05-25+02:00",
      "edite": false
    },
    {
      "acteurRef": "PA609963",
      "dateCosignature": "2016-05-25+02:00",
      "edite": false
    },
    {
      "acteurRef": "PA642805",
      "dateCosignature": "2016-05-25+02:00",
      "edite": false
    },
    {
      "acteurRef": "PA606225",
      "dateCosignature": "2016-05-25+02:00",
      "edite": false
    },
    {
      "acteurRef": "PA643069",
      "dateCosignature": "2016-05-25+02:00",
      "edite": false
    },
    {
      "acteurRef": "PA608011",
      "dateCosignature": "2016-05-25+02:00",
      "edite": false
    },
    {
      "acteurRef": "PA331014",
      "dateCosignature": "2016-05-25+02:00",
      "edite": false
    },
    {
      "acteurRef": "PA609590",
      "dateCosignature": "2016-05-25+02:00",
      "edite": false
    },
    {
      "acteurRef": "PA607187",
      "dateCosignature": "2016-05-25+02:00",
      "edite": false
    },
    {
      "acteurRef": "PA2503",
      "dateCosignature": "2016-05-25+02:00",
      "edite": false
    },
    {
      "acteurRef": "PA341981",
      "dateCosignature": "2016-05-25+02:00",
      "edite": false
    },
    {
      "acteurRef": "PA2549",
      "dateCosignature": "2016-05-25+02:00",
      "edite": false
    },
    {
      "acteurRef": "PA642790",
      "dateCosignature": "2016-05-25+02:00",
      "edite": false
    },
    {
      "acteurRef": "PA609292",
      "dateCosignature": "2016-05-25+02:00",
      "edite": false
    },
    {
      "acteurRef": "PA606991",
      "dateCosignature": "2016-05-25+02:00",
      "edite": false
    },
    {
      "acteurRef": "PA2600",
      "dateCosignature": "2016-05-25+02:00",
      "edite": false
    },
    {
      "acteurRef": "PA2603",
      "dateCosignature": "2016-05-25+02:00",
      "edite": false
    },
    {
      "acteurRef": "PA606586",
      "dateCosignature": "2016-05-25+02:00",
      "edite": false
    },
    {
      "acteurRef": "PA605952",
      "dateCosignature": "2016-05-25+02:00",
      "edite": false
    },
    {
      "acteurRef": "PA2611",
      "dateCosignature": "2016-05-25+02:00",
      "edite": false
    },
    {
      "acteurRef": "PA343493",
      "dateCosignature": "2016-05-25+02:00",
      "edite": false
    },
    {
      "acteurRef": "PA2631",
      "dateCosignature": "2016-05-25+02:00",
      "edite": false
    },
    {
      "acteurRef": "PA331990",
      "dateCosignature": "2016-05-25+02:00",
      "edite": false
    },
    {
      "acteurRef": "PA332747",
      "dateCosignature": "2016-05-25+02:00",
      "edite": false
    },
    {
      "acteurRef": "PA610752",
      "dateCosignature": "2016-05-25+02:00",
      "edite": false
    },
    {
      "acteurRef": "PA608778",
      "dateCosignature": "2016-05-25+02:00",
      "edite": false
    },
    {
      "acteurRef": "PA2685",
      "dateCosignature": "2016-05-25+02:00",
      "edite": false
    },
    {
      "acteurRef": "PA2693",
      "dateCosignature": "2016-05-25+02:00",
      "edite": false
    },
    {
      "acteurRef": "PA606495",
      "dateCosignature": "2016-05-25+02:00",
      "edite": false
    },
    {
      "acteurRef": "PA610529",
      "dateCosignature": "2016-05-25+02:00",
      "edite": false
    },
    {
      "acteurRef": "PA335017",
      "dateCosignature": "2016-05-25+02:00",
      "edite": false
    },
    {
      "acteurRef": "PA610195",
      "dateCosignature": "2016-05-25+02:00",
      "edite": false
    },
    {
      "acteurRef": "PA605703",
      "dateCosignature": "2016-05-25+02:00",
      "edite": false
    },
    {
      "acteurRef": "PA2799",
      "dateCosignature": "2016-05-25+02:00",
      "edite": false
    },
    {
      "acteurRef": "PA608741",
      "dateCosignature": "2016-05-25+02:00",
      "edite": false
    },
    {
      "acteurRef": "PA334768",
      "dateCosignature": "2016-05-25+02:00",
      "edite": false
    },
    {
      "acteurRef": "PA607395",
      "dateCosignature": "2016-05-25+02:00",
      "edite": false
    },
    {
      "acteurRef": "PA609205",
      "dateCosignature": "2016-05-25+02:00",
      "edite": false
    },
    {
      "acteurRef": "PA608695",
      "dateCosignature": "2016-05-25+02:00",
      "edite": false
    },
    {
      "acteurRef": "PA2859",
      "dateCosignature": "2016-05-25+02:00",
      "edite": false
    },
    {
      "acteurRef": "PA336112",
      "dateCosignature": "2016-05-25+02:00",
      "edite": false
    },
    {
      "acteurRef": "PA2883",
      "dateCosignature": "2016-05-25+02:00",
      "edite": false
    },
    {
      "acteurRef": "PA606230",
      "dateCosignature": "2016-05-25+02:00",
      "edite": false
    },
    {
      "acteurRef": "PA2895",
      "dateCosignature": "2016-05-25+02:00",
      "edite": false
    },
    {
      "acteurRef": "PA606639",
      "dateCosignature": "2016-05-25+02:00",
      "edite": false
    },
    {
      "acteurRef": "PA334951",
      "dateCosignature": "2016-05-25+02:00",
      "edite": false
    },
    {
      "acteurRef": "PA610701",
      "dateCosignature": "2016-05-25+02:00",
      "edite": false
    },
    {
      "acteurRef": "PA607699",
      "dateCosignature": "2016-05-25+02:00",
      "edite": false
    }
  ]
}