{
  "xsiType": "rapportParlementaire_Type",
  "uid": "RAPPSNR5S259B0516",
  "cycleDeVie": {
    "chrono": {
      "dateCreation": "2016-04-01T00:00:00.000+02:00",
      "dateDepot": "2016-03-30T00:00:00.000+02:00"
    }
  },
  "denominationStructurelle": "Rapport",
  "provenance": "Commission",
  "titres": {
    "titrePrincipal": "rapport sur la proposition de loi de M. Jacques Mézard, les membres du groupe Groupe du rassemblement démocratique et social européen modifiant la loi n°2015-991 du 7 août 2015 portant nouvelle organisation territoriale de la République pour permettre de rallonger d'un an le délai d'entrée en vigueur des nouvelles intercommunalités (415 rectifié).",
    "titrePrincipalCourt": "rapport sur la proposition de loi de M. Jacques Mézard, les membres du groupe Groupe du rassemblement démocratique et social européen modifiant la loi n°2015-991 du 7 août 2015 portant nouvelle organisation territoriale de la République pour permettre de rallonger d'un an le délai d'entrée en vigueur des nouvelles intercommunalités (415 rectifié)."
  },
  "dossierRef": "DLR5L14N34762",
  "classification": {
    "famille": {
      "depot": {
        "code": "RAPINIT",
        "libelle": "Rapport sur une initiative"
      },
      "classe": {
        "code": "RAPPORT",
        "libelle": "Rapport"
      }
    },
    "type": {
      "code": "RAPP",
      "libelle": "Rapport"
    }
  },
  "auteurs": [
    {
      "acteur": {
        "acteurRef": "PA707346",
        "qualite": "rapporteur"
      }
    },
    {
      "organeRef": "PO211495"
    }
  ],
  "notice": {
    "numNotice": "516",
    "formule": "sur la proposition de loi de M. Jacques Mézard, les membres du groupe Groupe du rassemblement démocratique et social européen modifiant la loi n°2015-991 du 7 août 2015 portant nouvelle organisation territoriale de la République pour permettre de rallonger d'un an le délai d'entrée en vigueur des nouvelles intercommunalités (415 rectifié).",
    "adoptionConforme": false
  }
}