{
  "xsiType": "texteLoi_Type",
  "uid": "PNREANR5L14B4619",
  "legislature": "14",
  "cycleDeVie": {
    "chrono": {
      "dateCreation": "2017-04-27T00:00:00.000+02:00",
      "dateDepot": "2017-04-27T00:00:00.000+02:00",
      "datePublication": "2017-05-09T00:00:00.000+02:00",
      "datePublicationWeb": "2017-05-03T10:50:00.000+02:00"
    }
  },
  "denominationStructurelle": "Proposition de résolution",
  "provenance": "Texte Déposé",
  "titres": {
    "titrePrincipal": "proposition de résolution tendant à déclarer priorité nationale l'urgence de la prise en charge des personnes porteuses de déficience intellectuelle en outre-mer et en particulier en Martinique",
    "titrePrincipalCourt": "Prise en charge déficience intellectuelle en Martinique"
  },
  "dossierRef": "DLR5L14N35753",
  "classification": {
    "famille": {
      "depot": {
        "code": "INITDEP",
        "libelle": "Initiative en 1er Dépôt"
      },
      "classe": {
        "code": "PIONRES",
        "libelle": "Proposition de résolution"
      },
      "espece": {
        "code": "APPART341",
        "libelle": "en application de Article 34-1 de la Constitution"
      }
    },
    "type": {
      "code": "PNRE",
      "libelle": "Proposition de résolution"
    },
    "sousType": {
      "code": "APPART341",
      "libelle": "en application de Article 34-1 de la Constitution"
    }
  },
  "auteurs": [
    {
      "acteur": {
        "acteurRef": "PA610634",
        "qualite": "auteur"
      }
    }
  ],
  "notice": {
    "numNotice": "4619",
    "formule": "tendant à déclarer priorité nationale l'urgence de la prise en charge des personnes porteuses de déficience intellectuelle en outre-mer et en particulier en Martinique",
    "adoptionConforme": false
  },
  "coSignataires": [
    {
      "acteurRef": "PA267306",
      "dateCosignature": "2017-04-27+02:00",
      "edite": true
    }
  ]
}