{
  "xsiType": "rapportParlementaire_Type",
  "uid": "RAPPANR5L14B0824",
  "legislature": "14",
  "cycleDeVie": {
    "chrono": {
      "dateCreation": "2013-03-20T00:00:00.000+01:00",
      "dateDepot": "2013-03-20T00:00:00.000+01:00",
      "datePublication": "2013-03-26T00:00:00.000+01:00",
      "datePublicationWeb": "2013-03-25T18:15:00.000+01:00"
    }
  },
  "denominationStructurelle": "Rapport",
  "provenance": "Commission",
  "titres": {
    "titrePrincipal": "rapport sur la proposition de loi de M. Bruno Le Roux, Mmes Hélène Vainqueur-Christophe, Ericka Bareigts, M. Boinali Said et Mme Valérie Corre et plusieurs de leurs collègues tendant à prohiber la différence de taux de sucre entre la composition des produits manufacturés et vendus dans les régions d'outre-mer et celle des mêmes produits vendus dans l'hexagone (393)",
    "titrePrincipalCourt": "rapport sur la proposition de loi de M. Bruno Le Roux, Mmes Hélène Vainqueur-Christophe, Ericka Bareigts, M. Boinali Said et Mme Valérie Corre et plusieurs de leurs collègues tendant à prohiber la différence de taux de sucre entre la composition des produits manufacturés et vendus dans les régions d'outre-mer et celle des mêmes produits vendus dans l'hexagone (393)"
  },
  "dossierRef": "DLR5L14N29316",
  "classification": {
    "famille": {
      "depot": {
        "code": "RAPINIT",
        "libelle": "Rapport sur une initiative"
      },
      "classe": {
        "code": "RAPPORT",
        "libelle": "Rapport"
      }
    },
    "type": {
      "code": "RAPP",
      "libelle": "Rapport"
    },
    "statutAdoption": "ADOPTCOM"
  },
  "auteurs": [
    {
      "acteur": {
        "acteurRef": "PA643145",
        "qualite": "rapporteur"
      }
    },
    {
      "organeRef": "PO420120"
    }
  ],
  "notice": {
    "numNotice": "824",
    "formule": "sur la proposition de loi de M. Bruno Le Roux, Mmes Hélène Vainqueur-Christophe, Ericka Bareigts, M. Boinali Said et Mme Valérie Corre et plusieurs de leurs collègues tendant à prohiber la différence de taux de sucre entre la composition des produits manufacturés et vendus dans les régions d'outre-mer et celle des mêmes produits vendus dans l'hexagone (393)",
    "adoptionConforme": false
  },
  "indexation": {
    "themes": {
      "@niveau": "1",
      "theme": {
        "libelleTheme": "JUSTICE"
      }
    }
  },
  "imprimerie": {
    "prix": "3.0"
  }
}