{
  "xsiType": "texteLoi_Type",
  "uid": "PRJLANR5L14B1227",
  "legislature": "14",
  "cycleDeVie": {
    "chrono": {
      "dateCreation": "2013-07-05T00:00:00.000+02:00",
      "dateDepot": "2013-07-05T00:00:00.000+02:00",
      "datePublication": "2013-07-10T00:00:00.000+02:00",
      "datePublicationWeb": "2013-07-08T15:45:00.000+02:00"
    }
  },
  "denominationStructurelle": "Projet de loi",
  "provenance": "Texte Déposé",
  "titres": {
    "titrePrincipal": "projet de loi relatif aux attributions du garde des sceaux et des magistrats du ministère public en matière de politique pénale et de mise en oeuvre de l'action publique",
    "titrePrincipalCourt": "attributions du garde des sceaux et des magistrats du ministère public en matière de politique pénale et d'action publique"
  },
  "dossierRef": "DLR5L14N29949",
  "classification": {
    "famille": {
      "depot": {
        "code": "INITNAV",
        "libelle": "Initiative en Navette"
      },
      "classe": {
        "code": "PRJLOI",
        "libelle": "Projet de loi"
      }
    },
    "type": {
      "code": "PRJL",
      "libelle": "Projet de loi"
    }
  },
  "auteurs": [
    {
      "organeRef": "PO644420"
    }
  ],
  "notice": {
    "numNotice": "1227",
    "formule": ", modifié par le Sénat, relatif aux attributions du garde des sceaux et des magistrats du ministère public en matière de politique pénale et de mise en oeuvre de l'action publique",
    "adoptionConforme": false
  },
  "indexation": {
    "themes": {
      "@niveau": "1",
      "theme": {
        "libelleTheme": "AGRICULTURE"
      }
    }
  },
  "depotAmendements": {
    "amendementsSeance": {
      "amendable": false
    },
    "amendementsCommission": [
      {
        "organeRef": "PO59051",
        "amendable": true
      }
    ]
  }
}