{
  "xsiType": "texteLoi_Type",
  "uid": "PNREANR5L14B3713",
  "legislature": "14",
  "cycleDeVie": {
    "chrono": {
      "dateCreation": "2016-05-03T00:00:00.000+02:00",
      "dateDepot": "2016-05-03T00:00:00.000+02:00",
      "datePublication": "2016-05-09T00:00:00.000+02:00",
      "datePublicationWeb": "2016-05-04T14:50:00.000+02:00"
    }
  },
  "denominationStructurelle": "Proposition de résolution",
  "provenance": "Texte Déposé",
  "titres": {
    "titrePrincipal": "proposition de résolution européenne sur la protection du droit d'auteur dans l'Union européenne",
    "titrePrincipalCourt": "sur la protection du droit d'auteur dans l'Union européenne"
  },
  "dossierRef": "DLR5L14N34879",
  "classification": {
    "famille": {
      "depot": {
        "code": "INITDEP",
        "libelle": "Initiative en 1er Dépôt"
      },
      "classe": {
        "code": "PIONRES",
        "libelle": "Proposition de résolution"
      },
      "espece": {
        "code": "TVXINSTITEUROP",
        "libelle": "sur les travaux conduits par les institutions européennes"
      }
    },
    "type": {
      "code": "PNRE",
      "libelle": "Proposition de résolution"
    },
    "sousType": {
      "code": "TVXINSTITEUROP",
      "libelle": "sur les travaux conduits par les institutions européennes"
    }
  },
  "auteurs": [
    {
      "acteur": {
        "acteurRef": "PA335054",
        "qualite": "auteur"
      }
    },
    {
      "acteur": {
        "acteurRef": "PA1445",
        "qualite": "auteur"
      }
    }
  ],
  "notice": {
    "numNotice": "3713",
    "formule": "sur la protection du droit d'auteur dans l'Union européenne",
    "adoptionConforme": false
  },
  "imprimerie": {
    "prix": "0.75"
  }
}