{
  "xsiType": "rapportParlementaire_Type",
  "uid": "RAPPANR5L14B0627",
  "legislature": "14",
  "cycleDeVie": {
    "chrono": {
      "dateCreation": "2013-01-16T00:00:00.000+01:00",
      "dateDepot": "2013-01-16T00:00:00.000+01:00",
      "datePublication": "2013-01-22T00:00:00.000+01:00",
      "datePublicationWeb": "2013-01-18T13:00:00.000+01:00"
    }
  },
  "denominationStructurelle": "Rapport",
  "provenance": "Commission",
  "titres": {
    "titrePrincipal": "rapport sur la proposition de résolution de M. Alain Bocquet et plusieurs de ses collègues tendant à la création d'une commission d'enquête sur la situation de la sidérurgie française et européenne dans la crise économique et financière, et sur les conditions de sa sauvegarde et de son développement (99)",
    "titrePrincipalCourt": "rapport sur la proposition de résolution de M. Alain Bocquet et plusieurs de ses collègues tendant à la création d'une commission d'enquête sur la situation de la sidérurgie française et européenne dans la crise économique et financière, et sur les conditions de sa sauvegarde et de son développement (99)"
  },
  "dossierRef": "DLR5L14N28921",
  "classification": {
    "famille": {
      "depot": {
        "code": "RAPINIT",
        "libelle": "Rapport sur une initiative"
      },
      "classe": {
        "code": "RAPPORT",
        "libelle": "Rapport"
      }
    },
    "type": {
      "code": "RAPP",
      "libelle": "Rapport"
    },
    "statutAdoption": "ADOPTCOM"
  },
  "auteurs": [
    {
      "acteur": {
        "acteurRef": "PA551",
        "qualite": "rapporteur"
      }
    },
    {
      "organeRef": "PO419610"
    }
  ],
  "notice": {
    "numNotice": "627",
    "formule": "sur la proposition de résolution de M. Alain Bocquet et plusieurs de ses collègues tendant à la création d'une commission d'enquête sur la situation de la sidérurgie française et européenne dans la crise économique et financière, et sur les conditions de sa sauvegarde et de son développement (99)",
    "adoptionConforme": false
  },
  "indexation": {
    "themes": {
      "@niveau": "1",
      "theme": {
        "libelleTheme": "EMPLOI"
      }
    }
  },
  "imprimerie": {
    "prix": "1.5"
  }
}