{
  "xsiType": "DossierLegislatif_Type",
  "uid": "DLR5L14N29274",
  "legislature": "14",
  "titreDossier": {
    "titre": "Informer les jeunes sur les troubles de l'audition",
    "titreChemin": "informer_jeunes_troubles_audition"
  },
  "procedureParlementaire": {
    "code": "2",
    "libelle": "Proposition de loi ordinaire"
  },
  "initiateur": {
    "acteurs": [
      {
        "acteurRef": "PA342935",
        "mandatRef": "PM645244"
      }
    ]
  },
  "actesLegislatifs": [
    {
      "xsiType": "Etape_Type",
      "uid": "L14-AN1-29274",
      "codeActe": "AN1",
      "libelleActe": {
        "nomCanonique": "1ère lecture (1ère assemblée saisie)",
        "libelleCourt": "1ère lecture"
      },
      "organeRef": "PO644420",
      "actesLegislatifs": [
        {
          "xsiType": "DepotInitiative_Type",
          "uid": "L14-VD160500DI",
          "codeActe": "AN1-DEPOT",
          "libelleActe": {
            "nomCanonique": "1er dépôt d'une initiative.",
            "libelleCourt": "1er dépôt d'une initiative."
          },
          "organeRef": "PO644420",
          "dateActe": "2012-11-27T00:00:00.000+01:00",
          "texteAssocieRef": "PIONANR5L14B0441"
        },
        {
          "xsiType": "Etape_Type",
          "uid": "L14-AN1-COM-29274",
          "codeActe": "AN1-COM",
          "libelleActe": {
            "nomCanonique": "Travaux des commissions",
            "libelleCourt": "Travaux des commissions"
          },
          "organeRef": "PO644420",
          "actesLegislatifs": [
            {
              "xsiType": "Etape_Type",
              "uid": "L14-VD160501CF",
              "codeActe": "AN1-COM-FOND",
              "libelleActe": {
                "nomCanonique": "Travaux de la commission saisie au fond",
                "libelleCourt": "Travaux de la commission saisie au fond"
              },
              "organeRef": "PO419604",
              "actesLegislatifs": [
                {
                  "xsiType": "SaisieComFond_Type",
                  "uid": "L14-VD160501CFS",
                  "codeActe": "AN1-COM-FOND-SAISIE",
                  "libelleActe": {
                    "nomCanonique": "Renvoi en commission au fond",
                    "libelleCourt": "Renvoi en commission au fond"
                  },
                  "organeRef": "PO419604",
                  "dateActe": "2012-11-27T00:00:00.000+01:00"
                }
              ]
            }
          ]
        }
      ]
    }
  ],
  "indexation": {
    "themes": {
      "@niveau": "1",
      "theme": {
        "libelleTheme": "POLITIQUE ECONOMIQUE ET SOCIALE"
      }
    }
  }
}