{
  "xsiType": "documentEtudeImpact_Type",
  "uid": "ETDISNR5S279B0531",
  "cycleDeVie": {
    "chrono": {
      "dateCreation": "2017-05-03T00:00:00.000+02:00",
      "dateDepot": "2017-04-27T00:00:00.000+02:00"
    }
  },
  "denominationStructurelle": "Projet de loi",
  "provenance": "Texte Déposé",
  "titres": {
    "titrePrincipal": "Etude d'impact sur le projet de loi ratifiant l’ordonnance n° 2016-728 du 2 juin 2016 relative au statut de commissaire de justice",
    "titrePrincipalCourt": "Statut de commissaire de justice"
  },
  "dossierRef": "DLR5L14N35770",
  "classification": {
    "famille": {
      "depot": {
        "code": "INITDEP",
        "libelle": "Initiative en 1er Dépôt"
      },
      "classe": {
        "code": "PRJLOI",
        "libelle": "Projet de loi"
      }
    },
    "type": {
      "code": "ETDI",
      "libelle": "Etude d'impact"
    }
  },
  "auteurs": [
    {
      "acteur": {
        "acteurRef": "PA785",
        "qualite": "auteur"
      }
    }
  ],
  "notice": {
    "numNotice": "531",
    "formule": "ratifiant l’ordonnance n° 2016-728 du 2 juin 2016 relative au statut de commissaire de justice",
    "adoptionConforme": false
  }
}