{
  "xsiType": "texteLoi_Type",
  "uid": "PIONANR5L14B0175",
  "legislature": "14",
  "cycleDeVie": {
    "chrono": {
      "dateCreation": "2012-09-10T00:00:00.000+02:00",
      "dateDepot": "2012-09-12T00:00:00.000+02:00",
      "datePublicationWeb": "2012-09-13T15:30:00.000+02:00"
    }
  },
  "denominationStructurelle": "Proposition de loi",
  "provenance": "Texte Déposé",
  "titres": {
    "titrePrincipal": "proposition de loi visant à abroger la loi n° 2011-1843 du 8 décembre 2011 relative aux certificats d'obtention végétale",
    "titrePrincipalCourt": "Abrogation de la loi n° 2011-1843 du 8 décembre 2011"
  },
  "dossierRef": "DLR5L14N29027",
  "classification": {
    "famille": {
      "depot": {
        "code": "INITDEP",
        "libelle": "Initiative en 1er Dépôt"
      },
      "classe": {
        "code": "PIONLOI",
        "libelle": "Proposition de loi"
      }
    },
    "type": {
      "code": "PION",
      "libelle": "Proposition de loi"
    }
  },
  "auteurs": [
    {
      "acteur": {
        "acteurRef": "PA267492",
        "qualite": "auteur"
      }
    }
  ],
  "notice": {
    "numNotice": "175",
    "formule": "visant à abroger la loi n° 2011-1843 du 8 décembre 2011 relative aux certificats d'obtention végétale",
    "adoptionConforme": false
  },
  "depotAmendements": {
    "amendementsSeance": {
      "amendable": false
    },
    "amendementsCommission": [
      {
        "organeRef": "PO419610",
        "amendable": true
      }
    ]
  }
}