{
  "xsiType": "rapportParlementaire_Type",
  "uid": "RAPPSNR5S239B0296",
  "cycleDeVie": {
    "chrono": {
      "dateCreation": "2015-02-19T00:00:00.000+01:00",
      "dateDepot": "2015-02-18T00:00:00.000+01:00",
      "datePublication": "2015-04-02T00:00:00.000+02:00"
    }
  },
  "denominationStructurelle": "Rapport",
  "provenance": "Commission",
  "titres": {
    "titrePrincipal": "rapport sur  les dispositions restant en discussion de la proposition de loi portant diverses dispositions tendant à la modernisation du secteur de la presse",
    "titrePrincipalCourt": "rapport sur  les dispositions restant en discussion de la proposition de loi portant diverses dispositions tendant à la modernisation du secteur de la presse"
  },
  "dossierRef": "DLR5L14N33418",
  "classification": {
    "famille": {
      "depot": {
        "code": "RAPINIT",
        "libelle": "Rapport sur une initiative"
      },
      "classe": {
        "code": "RAPPORT",
        "libelle": "Rapport"
      }
    },
    "type": {
      "code": "RAPP",
      "libelle": "Rapport"
    }
  },
  "auteurs": [
    {
      "acteur": {
        "acteurRef": "PA569",
        "qualite": "rapporteur"
      }
    },
    {
      "organeRef": "PO706223"
    }
  ],
  "notice": {
    "numNotice": "296",
    "formule": "de la commission mixte paritaire chargée de proposer un texte sur les dispositions restant en discussion de la proposition de loi portant diverses dispositions tendant à la modernisation du secteur de la presse",
    "adoptionConforme": false
  }
}