{
  "xsiType": "texteLoi_Type",
  "uid": "PIONSNR5S199B0003",
  "cycleDeVie": {
    "chrono": {
      "dateCreation": "2012-10-19T00:00:00.000+02:00",
      "dateDepot": "2012-10-02T00:00:00.000+02:00",
      "datePublication": "2013-03-28T00:00:00.000+01:00"
    }
  },
  "denominationStructurelle": "Proposition de loi",
  "provenance": "Texte Déposé",
  "titres": {
    "titrePrincipal": "proposition de loi visant à l'abrogation du délit de racolage public",
    "titrePrincipalCourt": "Abrogation du délit de racolage public"
  },
  "dossierRef": "DLR5L14N29240",
  "classification": {
    "famille": {
      "depot": {
        "code": "INITDEP",
        "libelle": "Initiative en 1er Dépôt"
      },
      "classe": {
        "code": "PIONLOI",
        "libelle": "Proposition de loi"
      }
    },
    "type": {
      "code": "PION",
      "libelle": "Proposition de loi"
    }
  },
  "auteurs": [
    {
      "acteur": {
        "acteurRef": "PA429891",
        "qualite": "auteur"
      }
    }
  ],
  "notice": {
    "numNotice": "3",
    "formule": "visant à l'abrogation du délit de racolage public",
    "adoptionConforme": false
  },
  "coSignataires": [
    {
      "acteurRef": "PA429857",
      "dateCosignature": "2012-10-02+02:00",
      "edite": false
    },
    {
      "acteurRef": "PA677482",
      "dateCosignature": "2012-10-02+02:00",
      "edite": false
    },
    {
      "acteurRef": "PA429881",
      "dateCosignature": "2012-10-02+02:00",
      "edite": false
    },
    {
      "acteurRef": "PA227019",
      "dateCosignature": "2012-10-02+02:00",
      "edite": false
    },
    {
      "acteurRef": "PA429873",
      "dateCosignature": "2012-10-02+02:00",
      "edite": false
    },
    {
      "acteurRef": "PA429845",
      "dateCosignature": "2012-10-02+02:00",
      "edite": false
    },
    {
      "acteurRef": "PA304007",
      "dateCosignature": "2012-10-02+02:00",
      "edite": false
    },
    {
      "acteurRef": "PA429837",
      "dateCosignature": "2012-10-02+02:00",
      "edite": false
    },
    {
      "acteurRef": "PA429866",
      "dateCosignature": "2012-10-02+02:00",
      "edite": false
    },
    {
      "acteurRef": "PA651963",
      "dateCosignature": "2012-10-02+02:00",
      "edite": false
    },
    {
      "acteurRef": "PA429885",
      "dateCosignature": "2012-10-02+02:00",
      "edite": false
    }
  ],
  "depotAmendements": {
    "amendementsSeance": {
      "amendable": false
    }
  }
}