{
  "xsiType": "DossierResolutionAN",
  "uid": "DLR5L14N30066",
  "legislature": "14",
  "titreDossier": {
    "titre": "Rôle du Gouvernement au sujet du compte à l'étranger de Monsieur Jérôme Cahuzac",
    "titreChemin": "role_Gouvernement_compte_etranger_Cahuzac"
  },
  "procedureParlementaire": {
    "code": "8",
    "libelle": "Résolution"
  },
  "initiateur": {
    "acteurs": [
      {
        "acteurRef": "PA334149",
        "mandatRef": "PM645127"
      }
    ]
  },
  "actesLegislatifs": [
    {
      "xsiType": "Etape_Type",
      "uid": "L14-ANLUNI-30066",
      "codeActe": "ANLUNI",
      "libelleActe": {
        "nomCanonique": "Lecture unique"
      },
      "organeRef": "PO644420",
      "actesLegislatifs": [
        {
          "xsiType": "DepotInitiative_Type",
          "uid": "L14-VD163038DI",
          "codeActe": "ANLUNI-DEPOT",
          "libelleActe": {
            "nomCanonique": "1er dépôt d'une initiative.",
            "libelleCourt": "1er dépôt d'une initiative."
          },
          "organeRef": "PO644420",
          "dateActe": "2013-04-15T00:00:00.000+02:00",
          "texteAssocieRef": "PNREANR5L14B0921"
        },
        {
          "xsiType": "Etape_Type",
          "uid": "L14-ANLUNI-COM-30066",
          "codeActe": "ANLUNI-COM",
          "libelleActe": {
            "nomCanonique": "Travaux des commissions",
            "libelleCourt": "Travaux des commissions"
          },
          "organeRef": "PO644420",
          "actesLegislatifs": [
            {
              "xsiType": "Etape_Type",
              "uid": "L14-VD163039CF",
              "codeActe": "ANLUNI-COM-FOND",
              "libelleActe": {
                "nomCanonique": "Travaux de la commission saisie au fond",
                "libelleCourt": "Travaux de la commission saisie au fond"
              },
              "organeRef": "PO59051",
              "actesLegislatifs": [
                {
                  "xsiType": "SaisieComFond_Type",
                  "uid": "L14-VD163039CFS",
                  "codeActe": "ANLUNI-COM-FOND-SAISIE",
                  "libelleActe": {
                    "nomCanonique": "Renvoi en commission au fond",
                    "libelleCourt": "Renvoi en commission au fond"
                  },
                  "organeRef": "PO59051",
                  "dateActe": "2013-04-15T00:00:00.000+02:00"
                }
              ]
            }
          ]
        }
      ]
    }
  ]
}