{
  "xsiType": "rapportParlementaire_Type",
  "uid": "RAPPSNR5S199B0277",
  "cycleDeVie": {
    "chrono": {
      "dateCreation": "2013-01-30T00:00:00.000+01:00",
      "dateDepot": "2013-01-23T00:00:00.000+01:00"
    }
  },
  "denominationStructurelle": "Rapport",
  "provenance": "Commission",
  "titres": {
    "titrePrincipal": "rapport sur la proposition de loi , après engagement de la procédure accélérée,de M. Jacky Le Menn et les membres du groupe Socialiste et apparentés portant réforme de la biologie médicale (243)",
    "titrePrincipalCourt": "rapport sur la proposition de loi , après engagement de la procédure accélérée,de M. Jacky Le Menn et les membres du groupe Socialiste et apparentés portant réforme de la biologie médicale (243)"
  },
  "dossierRef": "DLR5L14N29556",
  "classification": {
    "famille": {
      "depot": {
        "code": "RAPINIT",
        "libelle": "Rapport sur une initiative"
      },
      "classe": {
        "code": "RAPPORT",
        "libelle": "Rapport"
      }
    },
    "type": {
      "code": "RAPP",
      "libelle": "Rapport"
    }
  },
  "auteurs": [
    {
      "acteur": {
        "acteurRef": "PA415470",
        "qualite": "rapporteur"
      }
    },
    {
      "organeRef": "PO211493"
    }
  ],
  "notice": {
    "numNotice": "277",
    "formule": "sur la proposition de loi , après engagement de la procédure accélérée,de M. Jacky Le Menn et les membres du groupe Socialiste et apparentés portant réforme de la biologie médicale (243)",
    "adoptionConforme": false
  }
}