{
  "xsiType": "texteLoi_Type",
  "uid": "PIONANR5L14B0505",
  "legislature": "14",
  "cycleDeVie": {
    "chrono": {
      "dateCreation": "2012-11-20T00:00:00.000+01:00",
      "dateDepot": "2012-12-12T00:00:00.000+01:00",
      "datePublicationWeb": "2012-12-13T14:00:00.000+01:00"
    }
  },
  "denominationStructurelle": "Proposition de loi",
  "provenance": "Texte Déposé",
  "titres": {
    "titrePrincipal": "proposition de loi visant à étendre le versement des allocations familiales jusqu'au vingt-deuxième anniversaire de l'enfant",
    "titrePrincipalCourt": "Allocations familiales jusqu'au vingt-deuxième anniversaire"
  },
  "dossierRef": "DLR5L14N29351",
  "classification": {
    "famille": {
      "depot": {
        "code": "INITDEP",
        "libelle": "Initiative en 1er Dépôt"
      },
      "classe": {
        "code": "PIONLOI",
        "libelle": "Proposition de loi"
      }
    },
    "type": {
      "code": "PION",
      "libelle": "Proposition de loi"
    }
  },
  "auteurs": [
    {
      "acteur": {
        "acteurRef": "PA1874",
        "qualite": "auteur"
      }
    }
  ],
  "notice": {
    "numNotice": "505",
    "formule": "visant à étendre le versement des allocations familiales jusqu'au vingt-deuxième anniversaire de l'enfant",
    "adoptionConforme": false
  },
  "depotAmendements": {
    "amendementsSeance": {
      "amendable": false
    },
    "amendementsCommission": [
      {
        "organeRef": "PO420120",
        "amendable": true
      }
    ]
  }
}