{
  "xsiType": "rapportParlementaire_Type",
  "uid": "RAPPSNR5S279B0380",
  "cycleDeVie": {
    "chrono": {
      "dateCreation": "2017-02-14T00:00:00.000+01:00",
      "dateDepot": "2017-02-08T00:00:00.000+01:00"
    }
  },
  "denominationStructurelle": "Rapport",
  "provenance": "Commission",
  "titres": {
    "titrePrincipal": "rapport  sur la proposition de loi, modifiée, par l'Assemblée nationale, visant à préserver l'éthique du sport, à renforcer la régulation et la transparence du sport professionnel et à améliorer la compétitivité des clubs (n°297).",
    "titrePrincipalCourt": "rapport  sur la proposition de loi, modifiée, par l'Assemblée nationale, visant à préserver l'éthique du sport, à renforcer la régulation et la transparence du sport professionnel et à améliorer la compétitivité des clubs (n°297)."
  },
  "dossierRef": "DLR5L14N35282",
  "classification": {
    "famille": {
      "depot": {
        "code": "RAPINIT",
        "libelle": "Rapport sur une initiative"
      },
      "classe": {
        "code": "RAPPORT",
        "libelle": "Rapport"
      }
    },
    "type": {
      "code": "RAPP",
      "libelle": "Rapport"
    }
  },
  "auteurs": [
    {
      "acteur": {
        "acteurRef": "PA429864",
        "qualite": "rapporteur"
      }
    },
    {
      "organeRef": "PO211490"
    }
  ],
  "notice": {
    "numNotice": "380",
    "formule": "sur la proposition de loi, modifiée, par l'Assemblée nationale, visant à préserver l'éthique du sport, à renforcer la régulation et la transparence du sport professionnel et à améliorer la compétitivité des clubs (n°297).",
    "adoptionConforme": false
  }
}