{
  "xsiType": "texteLoi_Type",
  "uid": "PIONANR5L14B3983",
  "legislature": "14",
  "cycleDeVie": {
    "chrono": {
      "dateCreation": "2016-07-18T00:00:00.000+02:00",
      "dateDepot": "2016-07-20T00:00:00.000+02:00",
      "datePublication": "2016-07-27T00:00:00.000+02:00",
      "datePublicationWeb": "2016-07-22T11:45:00.000+02:00"
    }
  },
  "denominationStructurelle": "Proposition de loi",
  "provenance": "Texte Déposé",
  "titres": {
    "titrePrincipal": "proposition de loi visant à éviter toute souffrance aux animaux lors de leur abattage",
    "titrePrincipalCourt": "éviter toute souffrance aux animaux lors de leur abattage"
  },
  "dossierRef": "DLR5L14N35087",
  "classification": {
    "famille": {
      "depot": {
        "code": "INITDEP",
        "libelle": "Initiative en 1er Dépôt"
      },
      "classe": {
        "code": "PIONLOI",
        "libelle": "Proposition de loi"
      }
    },
    "type": {
      "code": "PION",
      "libelle": "Proposition de loi"
    }
  },
  "auteurs": [
    {
      "acteur": {
        "acteurRef": "PA267551",
        "qualite": "auteur"
      }
    }
  ],
  "notice": {
    "numNotice": "3983",
    "formule": "visant à éviter toute souffrance aux animaux lors de leur abattage",
    "adoptionConforme": false
  },
  "coSignataires": [
    {
      "acteurRef": "PA2374",
      "dateCosignature": "2016-07-20+02:00",
      "edite": true
    },
    {
      "acteurRef": "PA610427",
      "dateCosignature": "2016-07-20+02:00",
      "edite": false
    },
    {
      "acteurRef": "PA608276",
      "dateCosignature": "2016-07-20+02:00",
      "edite": false
    },
    {
      "acteurRef": "PA610968",
      "dateCosignature": "2016-07-20+02:00",
      "edite": false
    },
    {
      "acteurRef": "PA609726",
      "dateCosignature": "2016-07-20+02:00",
      "edite": false
    },
    {
      "acteurRef": "PA309643",
      "dateCosignature": "2016-07-20+02:00",
      "edite": false
    },
    {
      "acteurRef": "PA267358",
      "dateCosignature": "2016-07-20+02:00",
      "edite": false
    },
    {
      "acteurRef": "PA951",
      "dateCosignature": "2016-07-20+02:00",
      "edite": false
    },
    {
      "acteurRef": "PA267762",
      "dateCosignature": "2016-07-20+02:00",
      "edite": false
    },
    {
      "acteurRef": "PA1031",
      "dateCosignature": "2016-07-20+02:00",
      "edite": false
    },
    {
      "acteurRef": "PA606478",
      "dateCosignature": "2016-07-20+02:00",
      "edite": false
    },
    {
      "acteurRef": "PA605804",
      "dateCosignature": "2016-07-20+02:00",
      "edite": false
    },
    {
      "acteurRef": "PA267227",
      "dateCosignature": "2016-07-20+02:00",
      "edite": false
    },
    {
      "acteurRef": "PA216574",
      "dateCosignature": "2016-07-20+02:00",
      "edite": false
    },
    {
      "acteurRef": "PA712014",
      "dateCosignature": "2016-07-20+02:00",
      "edite": false
    },
    {
      "acteurRef": "PA2011",
      "dateCosignature": "2016-07-20+02:00",
      "edite": false
    },
    {
      "acteurRef": "PA2098",
      "dateCosignature": "2016-07-20+02:00",
      "edite": false
    },
    {
      "acteurRef": "PA607632",
      "dateCosignature": "2016-07-20+02:00",
      "edite": false
    },
    {
      "acteurRef": "PA2377",
      "dateCosignature": "2016-07-20+02:00",
      "edite": false
    },
    {
      "acteurRef": "PA267260",
      "dateCosignature": "2016-07-20+02:00",
      "edite": false
    },
    {
      "acteurRef": "PA608380",
      "dateCosignature": "2016-07-20+02:00",
      "edite": false
    },
    {
      "acteurRef": "PA267765",
      "dateCosignature": "2016-07-20+02:00",
      "edite": false
    },
    {
      "acteurRef": "PA267330",
      "dateCosignature": "2016-07-20+02:00",
      "edite": false
    },
    {
      "acteurRef": "PA243",
      "dateCosignature": "2016-07-20+02:00",
      "edite": false
    },
    {
      "acteurRef": "PA605922",
      "dateCosignature": "2016-07-20+02:00",
      "edite": false
    },
    {
      "acteurRef": "PA259",
      "dateCosignature": "2016-07-20+02:00",
      "edite": false
    },
    {
      "acteurRef": "PA642759",
      "dateCosignature": "2016-07-20+02:00",
      "edite": false
    },
    {
      "acteurRef": "PA608186",
      "dateCosignature": "2016-07-20+02:00",
      "edite": false
    },
    {
      "acteurRef": "PA687214",
      "dateCosignature": "2016-07-20+02:00",
      "edite": false
    },
    {
      "acteurRef": "PA267576",
      "dateCosignature": "2016-07-20+02:00",
      "edite": false
    },
    {
      "acteurRef": "PA330684",
      "dateCosignature": "2016-07-20+02:00",
      "edite": false
    },
    {
      "acteurRef": "PA713448",
      "dateCosignature": "2016-07-20+02:00",
      "edite": false
    },
    {
      "acteurRef": "PA606745",
      "dateCosignature": "2016-07-20+02:00",
      "edite": false
    },
    {
      "acteurRef": "PA610860",
      "dateCosignature": "2016-07-20+02:00",
      "edite": false
    },
    {
      "acteurRef": "PA702053",
      "dateCosignature": "2016-07-20+02:00",
      "edite": false
    },
    {
      "acteurRef": "PA267450",
      "dateCosignature": "2016-07-20+02:00",
      "edite": false
    },
    {
      "acteurRef": "PA267178",
      "dateCosignature": "2016-07-20+02:00",
      "edite": false
    },
    {
      "acteurRef": "PA267289",
      "dateCosignature": "2016-07-20+02:00",
      "edite": false
    },
    {
      "acteurRef": "PA1152",
      "dateCosignature": "2016-07-20+02:00",
      "edite": false
    },
    {
      "acteurRef": "PA608826",
      "dateCosignature": "2016-07-20+02:00",
      "edite": false
    },
    {
      "acteurRef": "PA334149",
      "dateCosignature": "2016-07-20+02:00",
      "edite": false
    },
    {
      "acteurRef": "PA267532",
      "dateCosignature": "2016-07-20+02:00",
      "edite": false
    },
    {
      "acteurRef": "PA1445",
      "dateCosignature": "2016-07-20+02:00",
      "edite": false
    },
    {
      "acteurRef": "PA267148",
      "dateCosignature": "2016-07-20+02:00",
      "edite": false
    },
    {
      "acteurRef": "PA1574",
      "dateCosignature": "2016-07-20+02:00",
      "edite": false
    },
    {
      "acteurRef": "PA267246",
      "dateCosignature": "2016-07-20+02:00",
      "edite": false
    },
    {
      "acteurRef": "PA1630",
      "dateCosignature": "2016-07-20+02:00",
      "edite": false
    },
    {
      "acteurRef": "PA608416",
      "dateCosignature": "2016-07-20+02:00",
      "edite": false
    },
    {
      "acteurRef": "PA1661",
      "dateCosignature": "2016-07-20+02:00",
      "edite": false
    },
    {
      "acteurRef": "PA1012",
      "dateCosignature": "2016-07-20+02:00",
      "edite": false
    },
    {
      "acteurRef": "PA267317",
      "dateCosignature": "2016-07-20+02:00",
      "edite": false
    },
    {
      "acteurRef": "PA267057",
      "dateCosignature": "2016-07-20+02:00",
      "edite": false
    },
    {
      "acteurRef": "PA2089",
      "dateCosignature": "2016-07-20+02:00",
      "edite": false
    },
    {
      "acteurRef": "PA267556",
      "dateCosignature": "2016-07-20+02:00",
      "edite": false
    },
    {
      "acteurRef": "PA2124",
      "dateCosignature": "2016-07-20+02:00",
      "edite": false
    },
    {
      "acteurRef": "PA2250",
      "dateCosignature": "2016-07-20+02:00",
      "edite": false
    },
    {
      "acteurRef": "PA344776",
      "dateCosignature": "2016-07-20+02:00",
      "edite": false
    },
    {
      "acteurRef": "PA266776",
      "dateCosignature": "2016-07-20+02:00",
      "edite": false
    },
    {
      "acteurRef": "PA2529",
      "dateCosignature": "2016-07-20+02:00",
      "edite": false
    },
    {
      "acteurRef": "PA345897",
      "dateCosignature": "2016-07-20+02:00",
      "edite": false
    },
    {
      "acteurRef": "PA610002",
      "dateCosignature": "2016-07-20+02:00",
      "edite": false
    },
    {
      "acteurRef": "PA2700",
      "dateCosignature": "2016-07-20+02:00",
      "edite": false
    },
    {
      "acteurRef": "PA334654",
      "dateCosignature": "2016-07-20+02:00",
      "edite": false
    },
    {
      "acteurRef": "PA2775",
      "dateCosignature": "2016-07-20+02:00",
      "edite": false
    },
    {
      "acteurRef": "PA605703",
      "dateCosignature": "2016-07-20+02:00",
      "edite": false
    },
    {
      "acteurRef": "PA2801",
      "dateCosignature": "2016-07-20+02:00",
      "edite": false
    },
    {
      "acteurRef": "PA2815",
      "dateCosignature": "2016-07-20+02:00",
      "edite": false
    },
    {
      "acteurRef": "PA334768",
      "dateCosignature": "2016-07-20+02:00",
      "edite": false
    },
    {
      "acteurRef": "PA334843",
      "dateCosignature": "2016-07-20+02:00",
      "edite": false
    },
    {
      "acteurRef": "PA267506",
      "dateCosignature": "2016-07-20+02:00",
      "edite": false
    },
    {
      "acteurRef": "PA2936",
      "dateCosignature": "2016-07-20+02:00",
      "edite": false
    },
    {
      "acteurRef": "PA607699",
      "dateCosignature": "2016-07-20+02:00",
      "edite": false
    },
    {
      "acteurRef": "PA606098",
      "dateCosignature": "2016-11-10+01:00",
      "edite": false
    }
  ],
  "depotAmendements": {
    "amendementsSeance": {
      "amendable": false
    },
    "amendementsCommission": [
      {
        "organeRef": "PO419610",
        "amendable": true
      }
    ]
  }
}