{
  "xsiType": "texteLoi_Type",
  "uid": "PNREANR5L14B3497",
  "legislature": "14",
  "cycleDeVie": {
    "chrono": {
      "dateCreation": "2016-02-11T00:00:00.000+01:00",
      "dateDepot": "2016-02-11T00:00:00.000+01:00",
      "datePublication": "2016-03-11T00:00:00.000+01:00",
      "datePublicationWeb": "2016-03-08T12:40:00.000+01:00"
    }
  },
  "denominationStructurelle": "Proposition de résolution",
  "provenance": "Texte Déposé",
  "titres": {
    "titrePrincipal": "proposition de résolution tendant à la création d'une commission d'enquête sur les conditions d'abattage des animaux de boucherie dans les abattoirs français",
    "titrePrincipalCourt": "Conditions d'abattage des animaux de boucherie dans les abattoirs français"
  },
  "dossierRef": "DLR5L14N34709",
  "classification": {
    "famille": {
      "depot": {
        "code": "INITDEP",
        "libelle": "Initiative en 1er Dépôt"
      },
      "classe": {
        "code": "PIONRES",
        "libelle": "Proposition de résolution"
      },
      "espece": {
        "code": "COMENQ",
        "libelle": "tendant à la création d'une commission d'enquête"
      }
    },
    "type": {
      "code": "PNRE",
      "libelle": "Proposition de résolution"
    },
    "sousType": {
      "code": "COMENQ",
      "libelle": "tendant à la création d'une commission d'enquête"
    }
  },
  "auteurs": [
    {
      "acteur": {
        "acteurRef": "PA267506",
        "qualite": "auteur"
      }
    }
  ],
  "correction": {
    "typeCorrection": "Rectifié",
    "niveauCorrection": "1"
  },
  "notice": {
    "numNotice": "3497",
    "formule": "tendant à la création d'une commission d'enquête sur les conditions d'abattage des animaux de boucherie dans les abattoirs français",
    "adoptionConforme": false
  },
  "coSignataires": [
    {
      "acteurRef": "PA266788",
      "dateCosignature": "2016-02-11+01:00",
      "edite": false
    },
    {
      "acteurRef": "PA1031",
      "dateCosignature": "2016-02-11+01:00",
      "edite": false
    },
    {
      "acteurRef": "PA1477",
      "dateCosignature": "2016-02-11+01:00",
      "edite": false
    },
    {
      "acteurRef": "PA2191",
      "dateCosignature": "2016-02-11+01:00",
      "edite": false
    },
    {
      "acteurRef": "PA2124",
      "dateCosignature": "2016-02-11+01:00",
      "edite": false
    },
    {
      "acteurRef": "PA702053",
      "dateCosignature": "2016-02-11+01:00",
      "edite": false
    },
    {
      "acteurRef": "PA606712",
      "dateCosignature": "2016-02-11+01:00",
      "edite": false
    },
    {
      "acteurRef": "PA2529",
      "dateCosignature": "2016-02-11+01:00",
      "edite": false
    },
    {
      "acteurRef": "PA267178",
      "dateCosignature": "2016-02-11+01:00",
      "edite": false
    },
    {
      "acteurRef": "PA951",
      "dateCosignature": "2016-02-11+01:00",
      "edite": false
    },
    {
      "acteurRef": "PA267762",
      "dateCosignature": "2016-02-11+01:00",
      "edite": false
    },
    {
      "acteurRef": "PA1574",
      "dateCosignature": "2016-02-11+01:00",
      "edite": false
    },
    {
      "acteurRef": "PA1206",
      "dateCosignature": "2016-02-11+01:00",
      "edite": false
    },
    {
      "acteurRef": "PA1001",
      "dateCosignature": "2016-02-11+01:00",
      "edite": false
    },
    {
      "acteurRef": "PA267013",
      "dateCosignature": "2016-02-11+01:00",
      "edite": false
    },
    {
      "acteurRef": "PA266774",
      "dateCosignature": "2016-02-11+01:00",
      "edite": false
    },
    {
      "acteurRef": "PA1630",
      "dateCosignature": "2016-02-11+01:00",
      "edite": false
    },
    {
      "acteurRef": "PA335159",
      "dateCosignature": "2016-02-11+01:00",
      "edite": false
    },
    {
      "acteurRef": "PA267551",
      "dateCosignature": "2016-02-11+01:00",
      "edite": false
    },
    {
      "acteurRef": "PA2011",
      "dateCosignature": "2016-02-11+01:00",
      "edite": false
    },
    {
      "acteurRef": "PA336316",
      "dateCosignature": "2016-02-11+01:00",
      "edite": false
    },
    {
      "acteurRef": "PA331146",
      "dateCosignature": "2016-02-11+01:00",
      "edite": false
    },
    {
      "acteurRef": "PA2936",
      "dateCosignature": "2016-02-11+01:00",
      "edite": false
    },
    {
      "acteurRef": "PA267576",
      "dateCosignature": "2016-02-11+01:00",
      "edite": false
    },
    {
      "acteurRef": "PA2792",
      "dateCosignature": "2016-02-11+01:00",
      "edite": false
    },
    {
      "acteurRef": "PA344492",
      "dateCosignature": "2016-02-11+01:00",
      "edite": false
    },
    {
      "acteurRef": "PA267330",
      "dateCosignature": "2016-02-11+01:00",
      "edite": false
    },
    {
      "acteurRef": "PA267801",
      "dateCosignature": "2016-02-11+01:00",
      "edite": false
    },
    {
      "acteurRef": "PA267327",
      "dateCosignature": "2016-02-11+01:00",
      "edite": false
    },
    {
      "acteurRef": "PA2796",
      "dateCosignature": "2016-02-11+01:00",
      "edite": false
    },
    {
      "acteurRef": "PA2377",
      "dateCosignature": "2016-02-11+01:00",
      "edite": false
    },
    {
      "acteurRef": "PA267260",
      "dateCosignature": "2016-02-11+01:00",
      "edite": false
    },
    {
      "acteurRef": "PA259",
      "dateCosignature": "2016-02-11+01:00",
      "edite": false
    },
    {
      "acteurRef": "PA267598",
      "dateCosignature": "2016-02-11+01:00",
      "edite": false
    },
    {
      "acteurRef": "PA608826",
      "dateCosignature": "2016-02-11+01:00",
      "edite": false
    },
    {
      "acteurRef": "PA606098",
      "dateCosignature": "2016-02-11+01:00",
      "edite": false
    },
    {
      "acteurRef": "PA267457",
      "dateCosignature": "2016-02-11+01:00",
      "edite": false
    },
    {
      "acteurRef": "PA642759",
      "dateCosignature": "2016-02-11+01:00",
      "edite": false
    },
    {
      "acteurRef": "PA609764",
      "dateCosignature": "2016-03-10+01:00",
      "edite": false
    }
  ]
}