{
  "xsiType": "rapportParlementaire_Type",
  "uid": "RAPPANR5L14B3291",
  "legislature": "14",
  "cycleDeVie": {
    "chrono": {
      "dateCreation": "2015-12-01T00:00:00.000+01:00",
      "dateDepot": "2015-12-01T00:00:00.000+01:00"
    }
  },
  "denominationStructurelle": "Rapport",
  "provenance": "Commission",
  "titres": {
    "titrePrincipal": "rapport sur la proposition de résolution européenne de MM. Bruno Le Roux et Dominique Potier et plusieurs de leurs collègues relative au cycle de vie des produits et à l'économie des ressources (n°3284)",
    "titrePrincipalCourt": "rapport sur la proposition de résolution européenne de MM. Bruno Le Roux et Dominique Potier et plusieurs de leurs collègues relative au cycle de vie des produits et à l'économie des ressources (n°3284)"
  },
  "dossierRef": "DLR5L14N34483",
  "classification": {
    "famille": {
      "depot": {
        "code": "RAPINIT",
        "libelle": "Rapport sur une initiative"
      },
      "classe": {
        "code": "RAPPORT",
        "libelle": "Rapport"
      },
      "espece": {
        "code": "APPART1515",
        "libelle": "en application de l'article 151-5 du règlement"
      }
    },
    "type": {
      "code": "RAPP",
      "libelle": "Rapport"
    },
    "sousType": {
      "code": "APPART1515",
      "libelle": "en application de l'article 151-5 du règlement",
      "libelleEdition": "en application de l'article 151-5 du règlement"
    },
    "statutAdoption": "ADOPTCOM"
  },
  "auteurs": [
    {
      "acteur": {
        "acteurRef": "PA607553",
        "qualite": "rapporteur"
      }
    },
    {
      "organeRef": "PO415287"
    }
  ],
  "notice": {
    "numNotice": "3291",
    "formule": "sur la proposition de résolution européenne de MM. Bruno Le Roux et Dominique Potier et plusieurs de leurs collègues relative au cycle de vie des produits et à l'économie des ressources (n°3284)",
    "adoptionConforme": false
  }
}