{
  "xsiType": "texteLoi_Type",
  "uid": "PIONANR5L14B1027",
  "legislature": "14",
  "cycleDeVie": {
    "chrono": {
      "dateCreation": "2013-04-04T00:00:00.000+02:00",
      "dateDepot": "2013-05-15T00:00:00.000+02:00",
      "datePublicationWeb": "2013-05-16T10:45:00.000+02:00"
    }
  },
  "denominationStructurelle": "Proposition de loi",
  "provenance": "Texte Déposé",
  "titres": {
    "titrePrincipal": "proposition de loi visant à assurer le principe de laïcité dans les entreprises privées",
    "titrePrincipalCourt": "Principe de laïcité dans les entreprises privées"
  },
  "dossierRef": "DLR5L14N30007",
  "classification": {
    "famille": {
      "depot": {
        "code": "INITDEP",
        "libelle": "Initiative en 1er Dépôt"
      },
      "classe": {
        "code": "PIONLOI",
        "libelle": "Proposition de loi"
      }
    },
    "type": {
      "code": "PION",
      "libelle": "Proposition de loi"
    }
  },
  "auteurs": [
    {
      "acteur": {
        "acteurRef": "PA2257",
        "qualite": "auteur"
      }
    }
  ],
  "notice": {
    "numNotice": "1027",
    "formule": "visant à assurer le principe de laïcité dans les entreprises privées",
    "adoptionConforme": false
  },
  "depotAmendements": {
    "amendementsSeance": {
      "amendable": false
    },
    "amendementsCommission": [
      {
        "organeRef": "PO59051",
        "amendable": true
      }
    ]
  }
}