{
  "xsiType": "texteLoi_Type",
  "uid": "PIONANR5L14B4494",
  "legislature": "14",
  "cycleDeVie": {
    "chrono": {
      "dateCreation": "2017-02-09T00:00:00.000+01:00",
      "dateDepot": "2017-02-15T00:00:00.000+01:00",
      "datePublication": "2017-02-22T00:00:00.000+01:00",
      "datePublicationWeb": "2017-02-16T13:15:00.000+01:00"
    }
  },
  "denominationStructurelle": "Proposition de loi",
  "provenance": "Texte Déposé",
  "titres": {
    "titrePrincipal": "proposition de loi visant à habiliter les agents de la police municipale au contrôle d'identité de toute personne se trouvant sur le territoire communal",
    "titrePrincipalCourt": "habiliter les agents de la police municipale au contrôle d'identité de toute personne se trouvant sur le territoire communal"
  },
  "dossierRef": "DLR5L14N35566",
  "classification": {
    "famille": {
      "depot": {
        "code": "INITDEP",
        "libelle": "Initiative en 1er Dépôt"
      },
      "classe": {
        "code": "PIONLOI",
        "libelle": "Proposition de loi"
      }
    },
    "type": {
      "code": "PION",
      "libelle": "Proposition de loi"
    }
  },
  "auteurs": [
    {
      "acteur": {
        "acteurRef": "PA687214",
        "qualite": "auteur"
      }
    }
  ],
  "notice": {
    "numNotice": "4494",
    "formule": "visant à habiliter les agents de la police municipale au contrôle d'identité de toute personne se trouvant sur le territoire communal",
    "adoptionConforme": false
  },
  "coSignataires": [
    {
      "acteurRef": "PA267457",
      "dateCosignature": "2017-02-15+01:00",
      "edite": false
    },
    {
      "acteurRef": "PA230",
      "dateCosignature": "2017-02-15+01:00",
      "edite": false
    },
    {
      "acteurRef": "PA642759",
      "dateCosignature": "2017-02-15+01:00",
      "edite": false
    },
    {
      "acteurRef": "PA314",
      "dateCosignature": "2017-02-15+01:00",
      "edite": false
    },
    {
      "acteurRef": "PA267822",
      "dateCosignature": "2017-02-15+01:00",
      "edite": false
    },
    {
      "acteurRef": "PA336316",
      "dateCosignature": "2017-02-15+01:00",
      "edite": false
    },
    {
      "acteurRef": "PA713448",
      "dateCosignature": "2017-02-15+01:00",
      "edite": false
    },
    {
      "acteurRef": "PA667",
      "dateCosignature": "2017-02-15+01:00",
      "edite": false
    },
    {
      "acteurRef": "PA223837",
      "dateCosignature": "2017-02-15+01:00",
      "edite": false
    },
    {
      "acteurRef": "PA267775",
      "dateCosignature": "2017-02-15+01:00",
      "edite": false
    },
    {
      "acteurRef": "PA951",
      "dateCosignature": "2017-02-15+01:00",
      "edite": false
    },
    {
      "acteurRef": "PA998",
      "dateCosignature": "2017-02-15+01:00",
      "edite": false
    },
    {
      "acteurRef": "PA1012",
      "dateCosignature": "2017-02-15+01:00",
      "edite": false
    },
    {
      "acteurRef": "PA267762",
      "dateCosignature": "2017-02-15+01:00",
      "edite": false
    },
    {
      "acteurRef": "PA1031",
      "dateCosignature": "2017-02-15+01:00",
      "edite": false
    },
    {
      "acteurRef": "PA267178",
      "dateCosignature": "2017-02-15+01:00",
      "edite": false
    },
    {
      "acteurRef": "PA267289",
      "dateCosignature": "2017-02-15+01:00",
      "edite": false
    },
    {
      "acteurRef": "PA608826",
      "dateCosignature": "2017-02-15+01:00",
      "edite": false
    },
    {
      "acteurRef": "PA334149",
      "dateCosignature": "2017-02-15+01:00",
      "edite": false
    },
    {
      "acteurRef": "PA336576",
      "dateCosignature": "2017-02-15+01:00",
      "edite": false
    },
    {
      "acteurRef": "PA266774",
      "dateCosignature": "2017-02-15+01:00",
      "edite": false
    },
    {
      "acteurRef": "PA267813",
      "dateCosignature": "2017-02-15+01:00",
      "edite": false
    },
    {
      "acteurRef": "PA1459",
      "dateCosignature": "2017-02-15+01:00",
      "edite": false
    },
    {
      "acteurRef": "PA267227",
      "dateCosignature": "2017-02-15+01:00",
      "edite": false
    },
    {
      "acteurRef": "PA1574",
      "dateCosignature": "2017-02-15+01:00",
      "edite": false
    },
    {
      "acteurRef": "PA267355",
      "dateCosignature": "2017-02-15+01:00",
      "edite": false
    },
    {
      "acteurRef": "PA608416",
      "dateCosignature": "2017-02-15+01:00",
      "edite": false
    },
    {
      "acteurRef": "PA1770",
      "dateCosignature": "2017-02-15+01:00",
      "edite": false
    },
    {
      "acteurRef": "PA267551",
      "dateCosignature": "2017-02-15+01:00",
      "edite": false
    },
    {
      "acteurRef": "PA1857",
      "dateCosignature": "2017-02-15+01:00",
      "edite": false
    },
    {
      "acteurRef": "PA606693",
      "dateCosignature": "2017-02-15+01:00",
      "edite": false
    },
    {
      "acteurRef": "PA1874",
      "dateCosignature": "2017-02-15+01:00",
      "edite": false
    },
    {
      "acteurRef": "PA1931",
      "dateCosignature": "2017-02-15+01:00",
      "edite": false
    },
    {
      "acteurRef": "PA267378",
      "dateCosignature": "2017-02-15+01:00",
      "edite": false
    },
    {
      "acteurRef": "PA608016",
      "dateCosignature": "2017-02-15+01:00",
      "edite": false
    },
    {
      "acteurRef": "PA2011",
      "dateCosignature": "2017-02-15+01:00",
      "edite": false
    },
    {
      "acteurRef": "PA2073",
      "dateCosignature": "2017-02-15+01:00",
      "edite": false
    },
    {
      "acteurRef": "PA2084",
      "dateCosignature": "2017-02-15+01:00",
      "edite": false
    },
    {
      "acteurRef": "PA2086",
      "dateCosignature": "2017-02-15+01:00",
      "edite": false
    },
    {
      "acteurRef": "PA266788",
      "dateCosignature": "2017-02-15+01:00",
      "edite": false
    },
    {
      "acteurRef": "PA2250",
      "dateCosignature": "2017-02-15+01:00",
      "edite": false
    },
    {
      "acteurRef": "PA2377",
      "dateCosignature": "2017-02-15+01:00",
      "edite": false
    },
    {
      "acteurRef": "PA267886",
      "dateCosignature": "2017-02-15+01:00",
      "edite": false
    },
    {
      "acteurRef": "PA2529",
      "dateCosignature": "2017-02-15+01:00",
      "edite": false
    },
    {
      "acteurRef": "PA335758",
      "dateCosignature": "2017-02-15+01:00",
      "edite": false
    },
    {
      "acteurRef": "PA267527",
      "dateCosignature": "2017-02-15+01:00",
      "edite": false
    },
    {
      "acteurRef": "PA267204",
      "dateCosignature": "2017-02-15+01:00",
      "edite": false
    },
    {
      "acteurRef": "PA267013",
      "dateCosignature": "2017-02-15+01:00",
      "edite": false
    },
    {
      "acteurRef": "PA2792",
      "dateCosignature": "2017-02-15+01:00",
      "edite": false
    },
    {
      "acteurRef": "PA2796",
      "dateCosignature": "2017-02-15+01:00",
      "edite": false
    },
    {
      "acteurRef": "PA712016",
      "dateCosignature": "2017-02-15+01:00",
      "edite": false
    },
    {
      "acteurRef": "PA334843",
      "dateCosignature": "2017-02-15+01:00",
      "edite": false
    },
    {
      "acteurRef": "PA607090",
      "dateCosignature": "2017-02-15+01:00",
      "edite": false
    },
    {
      "acteurRef": "PA267506",
      "dateCosignature": "2017-02-15+01:00",
      "edite": false
    },
    {
      "acteurRef": "PA267285",
      "dateCosignature": "2017-02-15+01:00",
      "edite": false
    },
    {
      "acteurRef": "PA267200",
      "dateCosignature": "2017-02-15+01:00",
      "edite": false
    },
    {
      "acteurRef": "PA609345",
      "dateCosignature": "2017-02-15+01:00",
      "edite": false
    }
  ],
  "depotAmendements": {
    "amendementsSeance": {
      "amendable": false
    },
    "amendementsCommission": [
      {
        "organeRef": "PO59051",
        "amendable": true
      }
    ]
  }
}