{
  "xsiType": "documentEtudeImpact_Type",
  "uid": "ETDIANR5L14B1503",
  "legislature": "14",
  "cycleDeVie": {
    "chrono": {
      "dateCreation": "2013-10-30T00:00:00.000+01:00",
      "dateDepot": "2013-10-30T00:00:00.000+01:00",
      "datePublication": "2014-02-26T00:00:00.000+01:00",
      "datePublicationWeb": "2013-11-04T10:30:00.000+01:00"
    }
  },
  "denominationStructurelle": "Projet de loi",
  "provenance": "Texte Déposé",
  "titres": {
    "titrePrincipal": "Etude d'impact sur le projet de loi autorisant la ratification de l’accord entre la République française et la République fédérative du Brésil en matière de sécurité sociale",
    "titrePrincipalCourt": "Ratification de l’accord entre la République française et la République fédérative du Brésil en matière de sécurité sociale"
  },
  "dossierRef": "DLR5L14N31679",
  "classification": {
    "famille": {
      "depot": {
        "code": "INITDEP",
        "libelle": "Initiative en 1er Dépôt"
      },
      "classe": {
        "code": "PRJLOI",
        "libelle": "Projet de loi"
      },
      "espece": {
        "code": "AUTRATCONV",
        "libelle": "autorisant la ratification d'une convention"
      }
    },
    "type": {
      "code": "ETDI",
      "libelle": "Etude d'impact"
    },
    "sousType": {
      "code": "AUTRATCONV",
      "libelle": "autorisant la ratification d'une convention",
      "libelleEdition": "autorisant la ratification d'une convention"
    }
  },
  "auteurs": [
    {
      "acteur": {
        "acteurRef": "PA328",
        "qualite": "auteur"
      }
    }
  ],
  "notice": {
    "numNotice": "1503",
    "formule": "autorisant la ratification de l’accord entre la République française et la République fédérative du Brésil en matière de sécurité sociale",
    "adoptionConforme": false
  }
}