{
  "xsiType": "texteLoi_Type",
  "uid": "PIONANR5L14B0642",
  "legislature": "14",
  "cycleDeVie": {
    "chrono": {
      "dateCreation": "2013-01-17T00:00:00.000+01:00",
      "dateDepot": "2013-01-23T00:00:00.000+01:00",
      "datePublicationWeb": "2013-01-24T17:45:00.000+01:00"
    }
  },
  "denominationStructurelle": "Proposition de loi",
  "provenance": "Texte Déposé",
  "titres": {
    "titrePrincipal": "proposition de loi visant à contraindre les établissements qui forment en alternance à garantir des stages aux étudiants",
    "titrePrincipalCourt": "Garantie de stage aux étudiants en alternance"
  },
  "dossierRef": "DLR5L14N29599",
  "classification": {
    "famille": {
      "depot": {
        "code": "INITDEP",
        "libelle": "Initiative en 1er Dépôt"
      },
      "classe": {
        "code": "PIONLOI",
        "libelle": "Proposition de loi"
      }
    },
    "type": {
      "code": "PION",
      "libelle": "Proposition de loi"
    }
  },
  "auteurs": [
    {
      "acteur": {
        "acteurRef": "PA2876",
        "qualite": "auteur"
      }
    }
  ],
  "notice": {
    "numNotice": "642",
    "formule": "visant à contraindre les établissements qui forment en alternance à garantir des stages aux étudiants",
    "adoptionConforme": false
  },
  "depotAmendements": {
    "amendementsSeance": {
      "amendable": false
    },
    "amendementsCommission": [
      {
        "organeRef": "PO419604",
        "amendable": true
      }
    ]
  }
}