{
  "xsiType": "texteLoi_Type",
  "uid": "PRJLANR5L14B3148",
  "legislature": "14",
  "cycleDeVie": {
    "chrono": {
      "dateCreation": "2015-10-14T00:00:00.000+02:00",
      "dateDepot": "2015-10-14T00:00:00.000+02:00",
      "datePublication": "2016-03-17T00:00:00.000+01:00",
      "datePublicationWeb": "2015-10-16T17:20:00.000+02:00"
    }
  },
  "denominationStructurelle": "Projet de loi",
  "provenance": "Texte Déposé",
  "titres": {
    "titrePrincipal": "projet de loi autorisant l'approbation de l'amendement à la convention sur l'accès à l'information, la participation du public au processus décisionnel et l'accès à la justice en matière d'environnement, pris par décision II/1 adoptée dans le cadre de la deuxième réunion des Parties à la convention",
    "titrePrincipalCourt": "Amendement à la convention sur l'accès à l'information en matière d'environnement"
  },
  "dossierRef": "DLR5L14N34019",
  "classification": {
    "famille": {
      "depot": {
        "code": "INITNAV",
        "libelle": "Initiative en Navette"
      },
      "classe": {
        "code": "PRJLOI",
        "libelle": "Projet de loi"
      },
      "espece": {
        "code": "AUTRATCONV",
        "libelle": "autorisant la ratification d'une convention"
      }
    },
    "type": {
      "code": "PRJL",
      "libelle": "Projet de loi"
    },
    "sousType": {
      "code": "AUTRATCONV",
      "libelle": "autorisant la ratification d'une convention",
      "libelleEdition": "autorisant la ratification d'une convention"
    }
  },
  "auteurs": [
    {
      "organeRef": "PO644420"
    }
  ],
  "notice": {
    "numNotice": "3148",
    "formule": ", adopté par le Sénat, autorisant l'approbation de l'amendement à la convention sur l'accès à l'information, la participation du public au processus décisionnel et l'accès à la justice en matière d'environnement, pris par décision II/1 adoptée dans le cadre de la deuxième réunion des Parties à la convention",
    "adoptionConforme": false
  },
  "depotAmendements": {
    "amendementsSeance": {
      "amendable": true
    },
    "amendementsCommission": [
      {
        "organeRef": "PO59047",
        "amendable": true
      }
    ]
  }
}