{
  "xsiType": "texteLoi_Type",
  "uid": "PRJLSNR5S279B0318",
  "cycleDeVie": {
    "chrono": {
      "dateCreation": "2017-01-20T00:00:00.000+01:00",
      "dateDepot": "2017-01-20T00:00:00.000+01:00",
      "datePublication": "2017-02-09T00:00:00.000+01:00"
    }
  },
  "denominationStructurelle": "Projet de loi",
  "provenance": "Texte Déposé",
  "titres": {
    "titrePrincipal": "projet de loi ratifiant l'ordonnance n° 2016-1519 du 10 novembre 2016 portant création au sein du service public de l'emploi de l'établissement public chargé de la formation professionnelle des adultes",
    "titrePrincipalCourt": "Ratification ordonnance formation professionnelle des adultes"
  },
  "dossierRef": "DLR5L14N35490",
  "classification": {
    "famille": {
      "depot": {
        "code": "INITNAV",
        "libelle": "Initiative en Navette"
      },
      "classe": {
        "code": "PRJLOI",
        "libelle": "Projet de loi"
      }
    },
    "type": {
      "code": "PRJL",
      "libelle": "Projet de loi"
    }
  },
  "auteurs": [
    {
      "organeRef": "PO78718"
    }
  ],
  "notice": {
    "numNotice": "318",
    "formule": ", adopté, par l'Assemblée nationale après engagement de la procédure accélérée, ratifiant l'ordonnance n° 2016-1519 du 10 novembre 2016 portant création au sein du service public de l'emploi de l'établissement public chargé de la formation professionnelle des adultes",
    "adoptionConforme": false
  },
  "depotAmendements": {
    "amendementsSeance": {
      "amendable": false
    }
  }
}