{
  "xsiType": "rapportParlementaire_Type",
  "uid": "RAPPSNR5S199B0766",
  "cycleDeVie": {
    "chrono": {
      "dateCreation": "2013-07-19T00:00:00.000+02:00",
      "dateDepot": "2013-07-16T00:00:00.000+02:00"
    }
  },
  "denominationStructurelle": "Rapport",
  "provenance": "Commission",
  "titres": {
    "titrePrincipal": "rapport sur le projet de loi  autorisant l'approbation de l'accord-cadre entre le Gouvernement de la République française et le Gouvernement de la région wallonne du Royaume de Belgique sur l'accueil des personnes handicapées (n°602)",
    "titrePrincipalCourt": "rapport sur le projet de loi  autorisant l'approbation de l'accord-cadre entre le Gouvernement de la République française et le Gouvernement de la région wallonne du Royaume de Belgique sur l'accueil des personnes handicapées (n°602)"
  },
  "dossierRef": "DLR5L14N30320",
  "classification": {
    "famille": {
      "depot": {
        "code": "RAPINIT",
        "libelle": "Rapport sur une initiative"
      },
      "classe": {
        "code": "RAPPORT",
        "libelle": "Rapport"
      }
    },
    "type": {
      "code": "RAPP",
      "libelle": "Rapport"
    }
  },
  "auteurs": [
    {
      "acteur": {
        "acteurRef": "PA1071",
        "qualite": "rapporteur"
      }
    },
    {
      "organeRef": "PO211491"
    }
  ],
  "notice": {
    "numNotice": "766",
    "formule": "sur le projet de loi  autorisant l'approbation de l'accord-cadre entre le Gouvernement de la République française et le Gouvernement de la région wallonne du Royaume de Belgique sur l'accueil des personnes handicapées (n°602)",
    "adoptionConforme": false
  },
  "indexation": {
    "themes": {
      "@niveau": "1",
      "theme": {
        "libelleTheme": "SECURITE SOCIALE"
      }
    }
  }
}