{
  "xsiType": "rapportParlementaire_Type",
  "uid": "RAPPSNR5S219B0541",
  "cycleDeVie": {
    "chrono": {
      "dateCreation": "2014-05-21T00:00:00.000+02:00",
      "dateDepot": "2014-05-20T00:00:00.000+02:00",
      "datePublication": "2014-06-03T00:00:00.000+02:00"
    }
  },
  "denominationStructurelle": "Rapport",
  "provenance": "Commission",
  "titres": {
    "titrePrincipal": "rapport sur  les dispositions restant en discussion de la proposition de loi relative aux comptes bancaires inactifs et aux contrats d'assurance-vie en déshérence",
    "titrePrincipalCourt": "rapport sur  les dispositions restant en discussion de la proposition de loi relative aux comptes bancaires inactifs et aux contrats d'assurance-vie en déshérence"
  },
  "dossierRef": "DLR5L14N31738",
  "classification": {
    "famille": {
      "depot": {
        "code": "RAPINIT",
        "libelle": "Rapport sur une initiative"
      },
      "classe": {
        "code": "RAPPORT",
        "libelle": "Rapport"
      }
    },
    "type": {
      "code": "RAPP",
      "libelle": "Rapport"
    }
  },
  "auteurs": [
    {
      "acteur": {
        "acteurRef": "PA2056",
        "qualite": "rapporteur"
      }
    },
    {
      "organeRef": "PO701178"
    }
  ],
  "notice": {
    "numNotice": "541",
    "formule": "de la commission mixte paritaire chargée de proposer un texte sur les dispositions restant en discussion de la proposition de loi relative aux comptes bancaires inactifs et aux contrats d'assurance-vie en déshérence",
    "adoptionConforme": false
  }
}