{
  "xsiType": "texteLoi_Type",
  "uid": "PIONANR5L14B0597",
  "legislature": "14",
  "cycleDeVie": {
    "chrono": {
      "dateCreation": "2012-12-07T00:00:00.000+01:00",
      "dateDepot": "2013-01-16T00:00:00.000+01:00",
      "datePublicationWeb": "2013-01-17T15:30:00.000+01:00"
    }
  },
  "denominationStructurelle": "Proposition de loi",
  "provenance": "Texte Déposé",
  "titres": {
    "titrePrincipal": "proposition de loi visant à permettre aux parents d'un enfant handicapé de bénéficier de l'allocation de solidarité spécifique, suite au décès de leur enfant",
    "titrePrincipalCourt": "allocation de solidarité spécifique pour les parents d'un enfant handicapé décédé"
  },
  "dossierRef": "DLR5L14N29449",
  "classification": {
    "famille": {
      "depot": {
        "code": "INITDEP",
        "libelle": "Initiative en 1er Dépôt"
      },
      "classe": {
        "code": "PIONLOI",
        "libelle": "Proposition de loi"
      }
    },
    "type": {
      "code": "PION",
      "libelle": "Proposition de loi"
    }
  },
  "auteurs": [
    {
      "acteur": {
        "acteurRef": "PA2775",
        "qualite": "auteur"
      }
    }
  ],
  "notice": {
    "numNotice": "597",
    "formule": "visant à permettre aux parents d'un enfant handicapé de bénéficier de l'allocation de solidarité spécifique, suite au décès de leur enfant",
    "adoptionConforme": false
  },
  "coSignataires": [
    {
      "acteurRef": "PA1379",
      "dateCosignature": "2013-01-16+01:00",
      "edite": false
    },
    {
      "acteurRef": "PA267178",
      "dateCosignature": "2013-01-16+01:00",
      "edite": false
    },
    {
      "acteurRef": "PA330788",
      "dateCosignature": "2013-01-16+01:00",
      "edite": false
    },
    {
      "acteurRef": "PA1001",
      "dateCosignature": "2013-01-16+01:00",
      "edite": false
    },
    {
      "acteurRef": "PA608662",
      "dateCosignature": "2013-01-16+01:00",
      "edite": false
    },
    {
      "acteurRef": "PA267743",
      "dateCosignature": "2013-01-16+01:00",
      "edite": false
    },
    {
      "acteurRef": "PA267450",
      "dateCosignature": "2013-01-16+01:00",
      "edite": false
    },
    {
      "acteurRef": "PA331146",
      "dateCosignature": "2013-01-16+01:00",
      "edite": false
    },
    {
      "acteurRef": "PA1459",
      "dateCosignature": "2013-01-16+01:00",
      "edite": false
    },
    {
      "acteurRef": "PA1466",
      "dateCosignature": "2013-01-16+01:00",
      "edite": false
    },
    {
      "acteurRef": "PA1699",
      "dateCosignature": "2013-01-16+01:00",
      "edite": false
    },
    {
      "acteurRef": "PA331481",
      "dateCosignature": "2013-01-16+01:00",
      "edite": false
    },
    {
      "acteurRef": "PA2011",
      "dateCosignature": "2013-01-16+01:00",
      "edite": false
    },
    {
      "acteurRef": "PA2099",
      "dateCosignature": "2013-01-16+01:00",
      "edite": false
    },
    {
      "acteurRef": "PA267556",
      "dateCosignature": "2013-01-16+01:00",
      "edite": false
    },
    {
      "acteurRef": "PA266788",
      "dateCosignature": "2013-01-16+01:00",
      "edite": false
    },
    {
      "acteurRef": "PA2492",
      "dateCosignature": "2013-01-16+01:00",
      "edite": false
    },
    {
      "acteurRef": "PA267204",
      "dateCosignature": "2013-01-16+01:00",
      "edite": false
    },
    {
      "acteurRef": "PA267013",
      "dateCosignature": "2013-01-16+01:00",
      "edite": false
    },
    {
      "acteurRef": "PA2792",
      "dateCosignature": "2013-01-16+01:00",
      "edite": false
    },
    {
      "acteurRef": "PA609442",
      "dateCosignature": "2013-01-16+01:00",
      "edite": false
    },
    {
      "acteurRef": "PA267506",
      "dateCosignature": "2013-01-16+01:00",
      "edite": false
    },
    {
      "acteurRef": "PA2936",
      "dateCosignature": "2013-01-16+01:00",
      "edite": false
    },
    {
      "acteurRef": "PA610775",
      "dateCosignature": "2016-09-14+02:00",
      "edite": false
    }
  ],
  "depotAmendements": {
    "amendementsSeance": {
      "amendable": false
    },
    "amendementsCommission": [
      {
        "organeRef": "PO420120",
        "amendable": true
      }
    ]
  }
}