{
  "xsiType": "texteLoi_Type",
  "uid": "PIONANR5L14B4200",
  "legislature": "14",
  "cycleDeVie": {
    "chrono": {
      "dateCreation": "2016-11-04T00:00:00.000+01:00",
      "dateDepot": "2016-11-09T00:00:00.000+01:00",
      "datePublication": "2016-11-18T00:00:00.000+01:00",
      "datePublicationWeb": "2016-11-14T15:45:00.000+01:00"
    }
  },
  "denominationStructurelle": "Proposition de loi",
  "provenance": "Texte Déposé",
  "titres": {
    "titrePrincipal": "proposition de loi relative aux aires urbaines de production agricole",
    "titrePrincipalCourt": "aires urbaines de production agricole"
  },
  "dossierRef": "DLR5L14N35356",
  "classification": {
    "famille": {
      "depot": {
        "code": "INITDEP",
        "libelle": "Initiative en 1er Dépôt"
      },
      "classe": {
        "code": "PIONLOI",
        "libelle": "Proposition de loi"
      }
    },
    "type": {
      "code": "PION",
      "libelle": "Proposition de loi"
    }
  },
  "auteurs": [
    {
      "acteur": {
        "acteurRef": "PA605131",
        "qualite": "auteur"
      }
    }
  ],
  "notice": {
    "numNotice": "4200",
    "formule": "relative aux aires urbaines de production agricole",
    "adoptionConforme": false
  },
  "coSignataires": [
    {
      "acteurRef": "PA332796",
      "dateCosignature": "2016-11-09+01:00",
      "edite": false
    },
    {
      "acteurRef": "PA695",
      "dateCosignature": "2016-11-09+01:00",
      "edite": false
    },
    {
      "acteurRef": "PA606507",
      "dateCosignature": "2016-11-09+01:00",
      "edite": false
    },
    {
      "acteurRef": "PA1844",
      "dateCosignature": "2016-11-09+01:00",
      "edite": false
    },
    {
      "acteurRef": "PA606171",
      "dateCosignature": "2016-11-09+01:00",
      "edite": false
    },
    {
      "acteurRef": "PA331807",
      "dateCosignature": "2016-11-09+01:00",
      "edite": false
    },
    {
      "acteurRef": "PA332636",
      "dateCosignature": "2016-11-09+01:00",
      "edite": false
    },
    {
      "acteurRef": "PA606161",
      "dateCosignature": "2016-11-09+01:00",
      "edite": false
    },
    {
      "acteurRef": "PA643069",
      "dateCosignature": "2016-11-09+01:00",
      "edite": false
    },
    {
      "acteurRef": "PA606412",
      "dateCosignature": "2016-11-09+01:00",
      "edite": false
    },
    {
      "acteurRef": "PA605426",
      "dateCosignature": "2016-11-09+01:00",
      "edite": false
    },
    {
      "acteurRef": "PA2693",
      "dateCosignature": "2016-11-09+01:00",
      "edite": false
    },
    {
      "acteurRef": "PA606040",
      "dateCosignature": "2016-11-09+01:00",
      "edite": false
    },
    {
      "acteurRef": "PA606149",
      "dateCosignature": "2016-11-09+01:00",
      "edite": false
    },
    {
      "acteurRef": "PA605963",
      "dateCosignature": "2016-11-09+01:00",
      "edite": false
    },
    {
      "acteurRef": "PA607606",
      "dateCosignature": "2016-11-09+01:00",
      "edite": false
    },
    {
      "acteurRef": "PA607155",
      "dateCosignature": "2016-11-09+01:00",
      "edite": false
    },
    {
      "acteurRef": "PA1182",
      "dateCosignature": "2016-11-09+01:00",
      "edite": false
    },
    {
      "acteurRef": "PA332206",
      "dateCosignature": "2016-11-09+01:00",
      "edite": false
    },
    {
      "acteurRef": "PA607892",
      "dateCosignature": "2016-11-09+01:00",
      "edite": false
    },
    {
      "acteurRef": "PA337504",
      "dateCosignature": "2016-11-09+01:00",
      "edite": false
    },
    {
      "acteurRef": "PA1193",
      "dateCosignature": "2016-11-09+01:00",
      "edite": false
    },
    {
      "acteurRef": "PA608684",
      "dateCosignature": "2016-11-09+01:00",
      "edite": false
    },
    {
      "acteurRef": "PA607619",
      "dateCosignature": "2016-11-09+01:00",
      "edite": false
    },
    {
      "acteurRef": "PA608348",
      "dateCosignature": "2016-11-09+01:00",
      "edite": false
    },
    {
      "acteurRef": "PA606230",
      "dateCosignature": "2016-11-09+01:00",
      "edite": false
    }
  ],
  "depotAmendements": {
    "amendementsSeance": {
      "amendable": false
    },
    "amendementsCommission": [
      {
        "organeRef": "PO419610",
        "amendable": true
      }
    ]
  }
}