{
  "xsiType": "texteLoi_Type",
  "uid": "PRJLSNR5S199B0021",
  "cycleDeVie": {
    "chrono": {
      "dateCreation": "2012-10-10T00:00:00.000+02:00",
      "dateDepot": "2012-10-09T00:00:00.000+02:00",
      "datePublication": "2012-10-11T00:00:00.000+02:00"
    }
  },
  "denominationStructurelle": "Projet de loi",
  "provenance": "Texte Déposé",
  "titres": {
    "titrePrincipal": "projet de loi autorisant la ratification du traité sur la stabilité, la coordination et la gouvernance au sein de l'Union économique et monétaire",
    "titrePrincipalCourt": "Ratification du traité sur la stabilité, la coordination et la gouvernance au sein de l'Union économique et monétaire"
  },
  "dossierRef": "DLR5L14N29088",
  "classification": {
    "famille": {
      "depot": {
        "code": "INITNAV",
        "libelle": "Initiative en Navette"
      },
      "classe": {
        "code": "PRJLOI",
        "libelle": "Projet de loi"
      },
      "espece": {
        "code": "AUTRATCONV",
        "libelle": "autorisant la ratification d'une convention"
      }
    },
    "type": {
      "code": "PRJL",
      "libelle": "Projet de loi"
    },
    "sousType": {
      "code": "AUTRATCONV",
      "libelle": "autorisant la ratification d'une convention",
      "libelleEdition": "autorisant la ratification d'une convention"
    }
  },
  "auteurs": [
    {
      "organeRef": "PO78718"
    }
  ],
  "notice": {
    "numNotice": "21",
    "formule": ", adopté par l'Assemblée nationale après engagement de la procédure accélérée, autorisant la ratification du traité sur la stabilité, la coordination et la gouvernance au sein de l'Union économique et monétaire",
    "adoptionConforme": false
  },
  "depotAmendements": {
    "amendementsSeance": {
      "amendable": false
    }
  }
}