{
  "xsiType": "DossierLegislatif_Type",
  "uid": "DLR5L14N29090",
  "legislature": "14",
  "titreDossier": {
    "titre": "Economie : prévention du surendettement",
    "titreChemin": "prevenir_le_surendettement"
  },
  "procedureParlementaire": {
    "code": "2",
    "libelle": "Proposition de loi ordinaire"
  },
  "initiateur": {
    "acteurs": [
      {
        "acteurRef": "PA268019",
        "mandatRef": "PM645116"
      }
    ]
  },
  "actesLegislatifs": [
    {
      "xsiType": "Etape_Type",
      "uid": "L14-AN1-29090",
      "codeActe": "AN1",
      "libelleActe": {
        "nomCanonique": "1ère lecture (1ère assemblée saisie)",
        "libelleCourt": "1ère lecture"
      },
      "organeRef": "PO644420",
      "actesLegislatifs": [
        {
          "xsiType": "DepotInitiative_Type",
          "uid": "L14-VD159388DI",
          "codeActe": "AN1-DEPOT",
          "libelleActe": {
            "nomCanonique": "1er dépôt d'une initiative.",
            "libelleCourt": "1er dépôt d'une initiative."
          },
          "organeRef": "PO644420",
          "dateActe": "2012-09-26T00:00:00.000+02:00",
          "texteAssocieRef": "PIONANR5L14B0221"
        },
        {
          "xsiType": "Etape_Type",
          "uid": "L14-AN1-COM-29090",
          "codeActe": "AN1-COM",
          "libelleActe": {
            "nomCanonique": "Travaux des commissions",
            "libelleCourt": "Travaux des commissions"
          },
          "organeRef": "PO644420",
          "actesLegislatifs": [
            {
              "xsiType": "Etape_Type",
              "uid": "L14-VD159389CF",
              "codeActe": "AN1-COM-FOND",
              "libelleActe": {
                "nomCanonique": "Travaux de la commission saisie au fond",
                "libelleCourt": "Travaux de la commission saisie au fond"
              },
              "organeRef": "PO419610",
              "actesLegislatifs": [
                {
                  "xsiType": "SaisieComFond_Type",
                  "uid": "L14-VD159389CFS",
                  "codeActe": "AN1-COM-FOND-SAISIE",
                  "libelleActe": {
                    "nomCanonique": "Renvoi en commission au fond",
                    "libelleCourt": "Renvoi en commission au fond"
                  },
                  "organeRef": "PO419610",
                  "dateActe": "2012-09-26T00:00:00.000+02:00"
                },
                {
                  "xsiType": "NominRapporteurs_Type",
                  "uid": "L14-VD160090",
                  "codeActe": "AN1-COM-FOND-NOMIN",
                  "libelleActe": {
                    "nomCanonique": "Nomination de rapporteur",
                    "libelleCourt": "Nomination de rapporteur"
                  },
                  "organeRef": "PO419610",
                  "dateActe": "2012-11-07T00:00:00.000+01:00",
                  "rapporteurs": [
                    {
                      "acteurRef": "PA268019",
                      "typeRapporteur": "rapporteur"
                    }
                  ]
                },
                {
                  "xsiType": "DiscussionCommission_Type",
                  "uid": "L14-VD160093R16531",
                  "codeActe": "AN1-COM-FOND-REUNION",
                  "libelleActe": {
                    "nomCanonique": "Réunion de commission",
                    "libelleCourt": "Réunion de commission"
                  },
                  "organeRef": "PO419610",
                  "dateActe": "2012-11-14T16:15:00.000+01:00",
                  "odjRef": "RUANR5L14S2013IDC415507PT16531",
                  "reunionRef": "RUANR5L14S2013IDC415507"
                },
                {
                  "xsiType": "DiscussionCommission_Type",
                  "uid": "L14-VD160093R16537",
                  "codeActe": "AN1-COM-FOND-REUNION",
                  "libelleActe": {
                    "nomCanonique": "Réunion de commission",
                    "libelleCourt": "Réunion de commission"
                  },
                  "organeRef": "PO419610",
                  "dateActe": "2012-11-22T14:30:00.000+01:00",
                  "odjRef": "RUANR5L14S2013IDC415588PT16537",
                  "reunionRef": "RUANR5L14S2013IDC415588"
                },
                {
                  "xsiType": "DepotRapport_Type",
                  "uid": "L14-VD160284",
                  "codeActe": "AN1-COM-FOND-RAPPORT",
                  "libelleActe": {
                    "nomCanonique": "Dépôt de rapport",
                    "libelleCourt": "Dépôt de rapport"
                  },
                  "organeRef": "PO419610",
                  "dateActe": "2012-11-15T00:00:00.000+01:00",
                  "texteAssocieRef": "RAPPANR5L14B0411"
                }
              ]
            }
          ]
        },
        {
          "xsiType": "Etape_Type",
          "uid": "L14-AN1-DEBATS-29090",
          "codeActe": "AN1-DEBATS",
          "libelleActe": {
            "nomCanonique": "Discussion en séance publique",
            "libelleCourt": "Discussion en séance publique"
          },
          "organeRef": "PO644420",
          "actesLegislatifs": [
            {
              "xsiType": "DiscussionSeancePublique_Type",
              "uid": "L14-VD159927S26706",
              "codeActe": "AN1-DEBATS-SEANCE",
              "libelleActe": {
                "nomCanonique": "Discussion en séance publique",
                "libelleCourt": "Discussion en séance publique"
              },
              "organeRef": "PO644420",
              "dateActe": "2012-11-22T00:00:00.000+01:00",
              "odjRef": "RUANR5L14S2013IDS16632PT26706",
              "reunionRef": "RUANR5L14S2013IDS16632"
            },
            {
              "xsiType": "Decision_Type",
              "uid": "L14-VD160429DEC",
              "codeActe": "AN1-DEBATS-DEC",
              "libelleActe": {
                "nomCanonique": "Décision",
                "libelleCourt": "Décision"
              },
              "organeRef": "PO644420",
              "dateActe": "2012-11-22T00:00:00.000+01:00",
              "reunionRef": "RUANR5L14S2013IDS16632",
              "statutConclusion": {
                "famCode": "TSORTF07",
                "libelle": "rejetée"
              },
              "textesAssocies": [
                {
                  "typeTexte": "BTA",
                  "texteAssocieRef": "PIONANR5L14BTA0043"
                }
              ]
            }
          ]
        }
      ]
    }
  ]
}