{
  "xsiType": "texteLoi_Type",
  "uid": "PIONANR5L14B4644",
  "legislature": "14",
  "cycleDeVie": {
    "chrono": {
      "dateCreation": "2017-05-03T00:00:00.000+02:00",
      "dateDepot": "2017-05-10T00:00:00.000+02:00",
      "datePublication": "2017-05-26T00:00:00.000+02:00",
      "datePublicationWeb": "2017-05-15T17:45:00.000+02:00"
    }
  },
  "denominationStructurelle": "Proposition de loi",
  "provenance": "Texte Déposé",
  "titres": {
    "titrePrincipal": "proposition de loi tendant à faciliter l’expulsion du preneur à bail mauvais payeur par le bailleur",
    "titrePrincipalCourt": "Expulsion mauvais payeur par le bailleur"
  },
  "dossierRef": "DLR5L14N35792",
  "classification": {
    "famille": {
      "depot": {
        "code": "INITDEP",
        "libelle": "Initiative en 1er Dépôt"
      },
      "classe": {
        "code": "PIONLOI",
        "libelle": "Proposition de loi"
      }
    },
    "type": {
      "code": "PION",
      "libelle": "Proposition de loi"
    }
  },
  "auteurs": [
    {
      "acteur": {
        "acteurRef": "PA2048",
        "qualite": "auteur"
      }
    }
  ],
  "notice": {
    "numNotice": "4644",
    "formule": "tendant à faciliter l’expulsion du preneur à bail mauvais payeur par le bailleur",
    "adoptionConforme": false
  },
  "depotAmendements": {
    "amendementsSeance": {
      "amendable": false
    },
    "amendementsCommission": [
      {
        "organeRef": "PO419610",
        "amendable": true
      }
    ]
  }
}