{
  "xsiType": "texteLoi_Type",
  "uid": "RINFANR5L14B1668",
  "legislature": "14",
  "cycleDeVie": {
    "chrono": {
      "dateCreation": "2013-12-18T00:00:00.000+01:00",
      "dateDepot": "2013-12-18T00:00:00.000+01:00",
      "datePublication": "2014-01-10T00:00:00.000+01:00",
      "datePublicationWeb": "2014-01-08T16:00:00.000+01:00"
    }
  },
  "denominationStructurelle": "Rapport d'information",
  "provenance": "Commission",
  "titres": {
    "titrePrincipal": "rapport d'information déposé en application de l'article 145 du règlement, par la commission des affaires culturelles et de l'éducation sur le projet de contrat d'objectifs et de moyens de France Médias Monde",
    "titrePrincipalCourt": "rapport d'information déposé en application de l'article 145 du règlement, par la commission des affaires culturelles et de l'éducation sur le projet de contrat d'objectifs et de moyens de France Médias Monde"
  },
  "dossierRef": "DLR5L14N32101",
  "classification": {
    "famille": {
      "depot": {
        "code": "RAPAUT",
        "libelle": "Rapport autonome"
      },
      "classe": {
        "code": "RAPINF",
        "libelle": "Rapport d'information"
      },
      "espece": {
        "code": "PRPDIT",
        "libelle": "tel quel"
      }
    },
    "type": {
      "code": "RINF",
      "libelle": "Rapport d'information"
    },
    "sousType": {
      "code": "PRPDIT",
      "libelle": "tel quel"
    }
  },
  "auteurs": [
    {
      "acteur": {
        "acteurRef": "PA642984",
        "qualite": "rapporteur"
      }
    },
    {
      "organeRef": "PO419604"
    }
  ],
  "notice": {
    "numNotice": "1668",
    "formule": "déposé en application de l'article 145 du règlement, par la commission des affaires culturelles et de l'éducation sur le projet de contrat d'objectifs et de moyens de France Médias Monde",
    "adoptionConforme": false
  },
  "imprimerie": {
    "prix": "3.5"
  }
}