{
  "xsiType": "rapportParlementaire_Type",
  "uid": "RAPPANR5L14B2744",
  "legislature": "14",
  "cycleDeVie": {
    "chrono": {
      "dateCreation": "2015-05-06T00:00:00.000+02:00",
      "dateDepot": "2015-05-06T00:00:00.000+02:00",
      "datePublication": "2015-05-11T00:00:00.000+02:00",
      "datePublicationWeb": "2015-05-07T20:30:00.000+02:00"
    }
  },
  "denominationStructurelle": "Rapport",
  "provenance": "Commission",
  "titres": {
    "titrePrincipal": "rapport sur   la proposition de loi , adoptée par le Sénat, relative à la protection de l'enfant (n°2652 rectifié)",
    "titrePrincipalCourt": "rapport sur   la proposition de loi , adoptée par le Sénat, relative à la protection de l'enfant (n°2652 rectifié)"
  },
  "divisions": [
    {
      "xsiType": "rapportParlementaire_Type",
      "uid": "RAPPANR5L14B2744-a1",
      "legislature": "14",
      "cycleDeVie": {
        "chrono": {
          "dateCreation": "2015-05-06T00:00:00.000+02:00",
          "dateDepot": "2015-05-06T00:00:00.000+02:00",
          "datePublicationWeb": "2015-05-07T19:30:00.000+02:00"
        }
      },
      "denominationStructurelle": "Annexe 1",
      "titres": {
        "titrePrincipal": "tableau comparatif",
        "titrePrincipalCourt": "tableau comparatif"
      },
      "dossierRef": "DLR5L14N33597",
      "classification": {
        "type": {
          "code": "RAPP",
          "libelle": "Rapport"
        },
        "statutAdoption": "ADOPTCOM"
      },
      "auteurs": [
        {
          "acteur": {
            "acteurRef": "PA605888",
            "qualite": "rapporteur"
          }
        },
        {
          "organeRef": "PO420120"
        }
      ],
      "notice": {
        "numNotice": "2744",
        "formule": "sur   la proposition de loi , adoptée par le Sénat, relative à la protection de l'enfant (n°2652 rectifié)",
        "adoptionConforme": false
      }
    }
  ],
  "dossierRef": "DLR5L14N33597",
  "classification": {
    "famille": {
      "depot": {
        "code": "RAPINIT",
        "libelle": "Rapport sur une initiative"
      },
      "classe": {
        "code": "RAPPORT",
        "libelle": "Rapport"
      }
    },
    "type": {
      "code": "RAPP",
      "libelle": "Rapport"
    },
    "statutAdoption": "ADOPTCOM"
  },
  "auteurs": [
    {
      "acteur": {
        "acteurRef": "PA605888",
        "qualite": "rapporteur"
      }
    },
    {
      "organeRef": "PO420120"
    }
  ],
  "notice": {
    "numNotice": "2744",
    "formule": "sur   la proposition de loi , adoptée par le Sénat, relative à la protection de l'enfant (n°2652 rectifié)",
    "adoptionConforme": false
  },
  "imprimerie": {
    "prix": "4.0"
  }
}