{
  "xsiType": "texteLoi_Type",
  "uid": "PNREANR5L14B1304",
  "legislature": "14",
  "cycleDeVie": {
    "chrono": {
      "dateCreation": "2013-07-24T00:00:00.000+02:00",
      "dateDepot": "2013-07-24T00:00:00.000+02:00",
      "datePublicationWeb": "2013-07-25T16:00:00.000+02:00"
    }
  },
  "denominationStructurelle": "Proposition de résolution",
  "provenance": "Texte Déposé",
  "titres": {
    "titrePrincipal": "proposition de résolution tendant à la création d'une commission d'enquête relative aux événements survenus à Trappes le 19 juillet 2013 et aux dérives communautaristes qui mettent en danger la paix civile",
    "titrePrincipalCourt": "Commission d'enquête relative aux événements survenus à Trappes le 19 juillet 2013 et aux dérives communautaires qui mettent en danger la paix civile"
  },
  "dossierRef": "DLR5L14N30937",
  "classification": {
    "famille": {
      "depot": {
        "code": "INITDEP",
        "libelle": "Initiative en 1er Dépôt"
      },
      "classe": {
        "code": "PIONRES",
        "libelle": "Proposition de résolution"
      },
      "espece": {
        "code": "COMENQ",
        "libelle": "tendant à la création d'une commission d'enquête"
      }
    },
    "type": {
      "code": "PNRE",
      "libelle": "Proposition de résolution"
    },
    "sousType": {
      "code": "COMENQ",
      "libelle": "tendant à la création d'une commission d'enquête"
    }
  },
  "auteurs": [
    {
      "acteur": {
        "acteurRef": "PA2257",
        "qualite": "auteur"
      }
    }
  ],
  "notice": {
    "numNotice": "1304",
    "formule": "tendant à la création d'une commission d'enquête relative aux événements survenus à Trappes le 19 juillet 2013 et aux dérives communautaristes qui mettent en danger la paix civile",
    "adoptionConforme": false
  },
  "coSignataires": [
    {
      "acteurRef": "PA230",
      "dateCosignature": "2013-09-03+02:00",
      "edite": false
    },
    {
      "acteurRef": "PA314",
      "dateCosignature": "2013-09-03+02:00",
      "edite": false
    },
    {
      "acteurRef": "PA687214",
      "dateCosignature": "2013-09-03+02:00",
      "edite": false
    },
    {
      "acteurRef": "PA223837",
      "dateCosignature": "2013-09-03+02:00",
      "edite": false
    },
    {
      "acteurRef": "PA267775",
      "dateCosignature": "2013-09-03+02:00",
      "edite": false
    },
    {
      "acteurRef": "PA267762",
      "dateCosignature": "2013-09-03+02:00",
      "edite": false
    },
    {
      "acteurRef": "PA267178",
      "dateCosignature": "2013-09-03+02:00",
      "edite": false
    },
    {
      "acteurRef": "PA1152",
      "dateCosignature": "2013-09-03+02:00",
      "edite": false
    },
    {
      "acteurRef": "PA336576",
      "dateCosignature": "2013-09-03+02:00",
      "edite": false
    },
    {
      "acteurRef": "PA266774",
      "dateCosignature": "2013-09-03+02:00",
      "edite": false
    },
    {
      "acteurRef": "PA331146",
      "dateCosignature": "2013-09-03+02:00",
      "edite": false
    },
    {
      "acteurRef": "PA605991",
      "dateCosignature": "2013-09-03+02:00",
      "edite": false
    },
    {
      "acteurRef": "PA267151",
      "dateCosignature": "2013-09-03+02:00",
      "edite": false
    },
    {
      "acteurRef": "PA343623",
      "dateCosignature": "2013-09-03+02:00",
      "edite": false
    },
    {
      "acteurRef": "PA609365",
      "dateCosignature": "2013-09-03+02:00",
      "edite": false
    },
    {
      "acteurRef": "PA1574",
      "dateCosignature": "2013-09-03+02:00",
      "edite": false
    },
    {
      "acteurRef": "PA267499",
      "dateCosignature": "2013-09-03+02:00",
      "edite": false
    },
    {
      "acteurRef": "PA608416",
      "dateCosignature": "2013-09-03+02:00",
      "edite": false
    },
    {
      "acteurRef": "PA267551",
      "dateCosignature": "2013-09-03+02:00",
      "edite": false
    },
    {
      "acteurRef": "PA1012",
      "dateCosignature": "2013-09-03+02:00",
      "edite": false
    },
    {
      "acteurRef": "PA267057",
      "dateCosignature": "2013-09-03+02:00",
      "edite": false
    },
    {
      "acteurRef": "PA608016",
      "dateCosignature": "2013-09-03+02:00",
      "edite": false
    },
    {
      "acteurRef": "PA2250",
      "dateCosignature": "2013-09-03+02:00",
      "edite": false
    },
    {
      "acteurRef": "PA345937",
      "dateCosignature": "2013-09-03+02:00",
      "edite": false
    },
    {
      "acteurRef": "PA2492",
      "dateCosignature": "2013-09-03+02:00",
      "edite": false
    },
    {
      "acteurRef": "PA267013",
      "dateCosignature": "2013-09-03+02:00",
      "edite": false
    },
    {
      "acteurRef": "PA267506",
      "dateCosignature": "2013-09-03+02:00",
      "edite": false
    },
    {
      "acteurRef": "PA2936",
      "dateCosignature": "2013-09-03+02:00",
      "edite": false
    },
    {
      "acteurRef": "PA333134",
      "dateCosignature": "2013-09-13+02:00",
      "edite": false
    },
    {
      "acteurRef": "PA2073",
      "dateCosignature": "2013-09-13+02:00",
      "edite": false
    },
    {
      "acteurRef": "PA2084",
      "dateCosignature": "2013-09-13+02:00",
      "edite": false
    },
    {
      "acteurRef": "PA609764",
      "dateCosignature": "2013-09-13+02:00",
      "edite": false
    },
    {
      "acteurRef": "PA2796",
      "dateCosignature": "2013-09-13+02:00",
      "edite": false
    },
    {
      "acteurRef": "PA2815",
      "dateCosignature": "2013-09-13+02:00",
      "edite": false
    },
    {
      "acteurRef": "PA334843",
      "dateCosignature": "2013-09-13+02:00",
      "edite": false
    }
  ]
}