{
  "xsiType": "DossierLegislatif_Type",
  "uid": "DLR5L14N33917",
  "legislature": "14",
  "titreDossier": {
    "titre": "Economie : Agence française pour le développement international des entreprises",
    "titreChemin": "ratification_ordonnance_2014-1555"
  },
  "procedureParlementaire": {
    "code": "1",
    "libelle": "Projet de loi ordinaire"
  },
  "initiateur": {
    "acteurs": [
      {
        "acteurRef": "PA267622",
        "mandatRef": "PM702957"
      },
      {
        "acteurRef": "PA1268",
        "mandatRef": "PM702961"
      }
    ]
  },
  "actesLegislatifs": [
    {
      "xsiType": "Etape_Type",
      "uid": "L14-AN1-33917",
      "codeActe": "AN1",
      "libelleActe": {
        "nomCanonique": "1ère lecture (1ère assemblée saisie)",
        "libelleCourt": "1ère lecture"
      },
      "organeRef": "PO644420",
      "actesLegislatifs": [
        {
          "xsiType": "DepotInitiative_Type",
          "uid": "L14-VD173473DI",
          "codeActe": "AN1-DEPOT",
          "libelleActe": {
            "nomCanonique": "1er dépôt d'une initiative.",
            "libelleCourt": "1er dépôt d'une initiative."
          },
          "organeRef": "PO644420",
          "dateActe": "2015-04-15T00:00:00.000+02:00",
          "texteAssocieRef": "PRJLANR5L14B2726"
        },
        {
          "xsiType": "Etape_Type",
          "uid": "L14-AN1-COM-33917",
          "codeActe": "AN1-COM",
          "libelleActe": {
            "nomCanonique": "Travaux des commissions",
            "libelleCourt": "Travaux des commissions"
          },
          "organeRef": "PO644420",
          "actesLegislatifs": [
            {
              "xsiType": "Etape_Type",
              "uid": "L14-VD173474CF",
              "codeActe": "AN1-COM-FOND",
              "libelleActe": {
                "nomCanonique": "Travaux de la commission saisie au fond",
                "libelleCourt": "Travaux de la commission saisie au fond"
              },
              "organeRef": "PO59047",
              "actesLegislatifs": [
                {
                  "xsiType": "SaisieComFond_Type",
                  "uid": "L14-VD173474CFS",
                  "codeActe": "AN1-COM-FOND-SAISIE",
                  "libelleActe": {
                    "nomCanonique": "Renvoi en commission au fond",
                    "libelleCourt": "Renvoi en commission au fond"
                  },
                  "organeRef": "PO59047",
                  "dateActe": "2015-04-15T00:00:00.000+02:00"
                }
              ]
            }
          ]
        }
      ]
    }
  ]
}