{
  "xsiType": "texteLoi_Type",
  "uid": "AVISANR5L14B4376",
  "legislature": "14",
  "cycleDeVie": {
    "chrono": {
      "dateCreation": "2017-01-11T00:00:00.000+01:00",
      "dateDepot": "2017-01-11T00:00:00.000+01:00",
      "datePublication": "2017-01-18T00:00:00.000+01:00",
      "datePublicationWeb": "2017-01-16T16:45:00.000+01:00"
    }
  },
  "denominationStructurelle": "Avis",
  "provenance": "Commission",
  "titres": {
    "titrePrincipal": "avis sur la proposition de loi, après engagement de la procédure accélérée, de M. Bruno Le Roux et plusieurs de ses collègues portant adaptation du code minier au droit de l'environnement (4251).",
    "titrePrincipalCourt": "avis sur la proposition de loi, après engagement de la procédure accélérée, de M. Bruno Le Roux et plusieurs de ses collègues portant adaptation du code minier au droit de l'environnement (4251)."
  },
  "dossierRef": "DLR5L14N35391",
  "classification": {
    "famille": {
      "depot": {
        "code": "RAPINIT",
        "libelle": "Rapport sur une initiative"
      },
      "classe": {
        "code": "AVIS",
        "libelle": "Avis"
      }
    },
    "type": {
      "code": "AVIS",
      "libelle": "Avis"
    }
  },
  "auteurs": [
    {
      "acteur": {
        "acteurRef": "PA342415",
        "qualite": "rapporteur pour avis"
      }
    },
    {
      "organeRef": "PO419610"
    }
  ],
  "notice": {
    "numNotice": "4376",
    "formule": "sur la proposition de loi, après engagement de la procédure accélérée, de M. Bruno Le Roux et plusieurs de ses collègues portant adaptation du code minier au droit de l'environnement (4251).",
    "adoptionConforme": false
  },
  "imprimerie": {
    "prix": "3.0"
  }
}