{
  "xsiType": "DossierLegislatif_Type",
  "uid": "DLR5L14N28949",
  "legislature": "14",
  "titreDossier": {
    "titre": "Etablir une commission indépendante chargée d'élaborer le projet de redécoupage des circonscriptions législatives afin de limiter les risques d'arbitraire gouvernemental",
    "titreChemin": "commission_redecoupage_circonscriptions"
  },
  "procedureParlementaire": {
    "code": "5",
    "libelle": "Projet ou proposition de loi organique"
  },
  "initiateur": {
    "acteurs": [
      {
        "acteurRef": "PA2971",
        "mandatRef": "PM645392"
      }
    ]
  },
  "actesLegislatifs": [
    {
      "xsiType": "Etape_Type",
      "uid": "L14-AN1-28949",
      "codeActe": "AN1",
      "libelleActe": {
        "nomCanonique": "1ère lecture (1ère assemblée saisie)",
        "libelleCourt": "1ère lecture"
      },
      "organeRef": "PO644420",
      "actesLegislatifs": [
        {
          "xsiType": "DepotInitiative_Type",
          "uid": "L14-VD159015DI",
          "codeActe": "AN1-DEPOT",
          "libelleActe": {
            "nomCanonique": "1er dépôt d'une initiative.",
            "libelleCourt": "1er dépôt d'une initiative."
          },
          "organeRef": "PO644420",
          "dateActe": "2012-07-27T00:00:00.000+02:00",
          "texteAssocieRef": "PIONANR5L14B0132"
        },
        {
          "xsiType": "Etape_Type",
          "uid": "L14-AN1-COM-28949",
          "codeActe": "AN1-COM",
          "libelleActe": {
            "nomCanonique": "Travaux des commissions",
            "libelleCourt": "Travaux des commissions"
          },
          "organeRef": "PO644420",
          "actesLegislatifs": [
            {
              "xsiType": "Etape_Type",
              "uid": "L14-VD159016CF",
              "codeActe": "AN1-COM-FOND",
              "libelleActe": {
                "nomCanonique": "Travaux de la commission saisie au fond",
                "libelleCourt": "Travaux de la commission saisie au fond"
              },
              "organeRef": "PO59051",
              "actesLegislatifs": [
                {
                  "xsiType": "SaisieComFond_Type",
                  "uid": "L14-VD159016CFS",
                  "codeActe": "AN1-COM-FOND-SAISIE",
                  "libelleActe": {
                    "nomCanonique": "Renvoi en commission au fond",
                    "libelleCourt": "Renvoi en commission au fond"
                  },
                  "organeRef": "PO59051",
                  "dateActe": "2012-07-27T00:00:00.000+02:00"
                }
              ]
            }
          ]
        }
      ]
    }
  ]
}