{
  "xsiType": "texteLoi_Type",
  "uid": "PRJLANR5L14BTC4293",
  "legislature": "14",
  "cycleDeVie": {
    "chrono": {
      "dateCreation": "2016-12-07T00:00:00.000+01:00",
      "dateDepot": "2016-12-07T00:00:00.000+01:00",
      "datePublication": "2016-12-09T00:00:00.000+01:00",
      "datePublicationWeb": "2016-12-08T20:00:00.000+01:00"
    }
  },
  "denominationStructurelle": "Projet de loi",
  "provenance": "Texte Déposé",
  "titres": {
    "titrePrincipal": "projet de loi  sur le projet de loi, adopté par le Sénat après engagement de la procédure accélérée, relatif au statut de Paris et à l'aménagement métropolitain (n°4212).",
    "titrePrincipalCourt": "Statut de Paris et aménagement métropolitain"
  },
  "dossierRef": "DLR5L14N35138",
  "classification": {
    "famille": {
      "depot": {
        "code": "INITNAV",
        "libelle": "Initiative en Navette"
      },
      "classe": {
        "code": "PRJLOI",
        "libelle": "Projet de loi"
      }
    },
    "type": {
      "code": "PRJL",
      "libelle": "Projet de loi"
    },
    "statutAdoption": "ADOPTCOM"
  },
  "auteurs": [
    {
      "acteur": {
        "acteurRef": "PA267835",
        "qualite": "rapporteur"
      }
    },
    {
      "acteur": {
        "acteurRef": "PA605426",
        "qualite": "rapporteur"
      }
    },
    {
      "organeRef": "PO59051"
    }
  ],
  "notice": {
    "numNotice": "4293",
    "formule": "sur le projet de loi, adopté par le Sénat après engagement de la procédure accélérée, relatif au statut de Paris et à l'aménagement métropolitain (n°4212).",
    "adoptionConforme": false
  },
  "imprimerie": {
    "prix": "9.0"
  },
  "depotAmendements": {
    "amendementsSeance": {
      "amendable": true
    },
    "amendementsCommission": [
      {
        "organeRef": "PO59051",
        "amendable": true
      }
    ]
  }
}