{
  "xsiType": "texteLoi_Type",
  "uid": "PRJLANR5L14B4051",
  "legislature": "14",
  "cycleDeVie": {
    "chrono": {
      "dateCreation": "2016-09-22T00:00:00.000+02:00",
      "dateDepot": "2016-09-22T00:00:00.000+02:00",
      "datePublication": "2016-09-28T00:00:00.000+02:00",
      "datePublicationWeb": "2016-09-23T10:55:00.000+02:00"
    }
  },
  "denominationStructurelle": "Projet de loi",
  "provenance": "Texte Déposé",
  "titres": {
    "titrePrincipal": "projet de loi ratifiant l’ordonnance n° 2016-460 du 14 avril 2016 modifiant l’article L. 225-4 du code de la route pour habiliter les fonctionnaires et agents de l’État chargés du contrôle des transports terrestres placés sous l’autorité du ministre chargé des transports à accéder directement aux informations relatives au permis de conduire",
    "titrePrincipalCourt": "ordonnance contrôle des transports terrestres"
  },
  "dossierRef": "DLR5L14N35246",
  "classification": {
    "famille": {
      "depot": {
        "code": "INITDEP",
        "libelle": "Initiative en 1er Dépôt"
      },
      "classe": {
        "code": "PRJLOI",
        "libelle": "Projet de loi"
      }
    },
    "type": {
      "code": "PRJL",
      "libelle": "Projet de loi"
    }
  },
  "auteurs": [
    {
      "acteur": {
        "acteurRef": "PA267622",
        "qualite": "auteur"
      }
    }
  ],
  "notice": {
    "numNotice": "4051",
    "formule": "ratifiant l’ordonnance n° 2016-460 du 14 avril 2016 modifiant l’article L. 225-4 du code de la route pour habiliter les fonctionnaires et agents de l’État chargés du contrôle des transports terrestres placés sous l’autorité du ministre chargé des transports à accéder directement aux informations relatives au permis de conduire",
    "adoptionConforme": false
  },
  "coSignataires": [
    {
      "acteurRef": "PA2650",
      "dateCosignature": "2016-09-22+02:00",
      "edite": true
    }
  ],
  "depotAmendements": {
    "amendementsSeance": {
      "amendable": false
    },
    "amendementsCommission": [
      {
        "organeRef": "PO419865",
        "amendable": true
      }
    ]
  }
}