{
  "xsiType": "texteLoi_Type",
  "uid": "RINFANR5L14B4302",
  "legislature": "14",
  "cycleDeVie": {
    "chrono": {
      "dateCreation": "2016-12-14T00:00:00.000+01:00",
      "dateDepot": "2016-12-14T00:00:00.000+01:00",
      "datePublication": "2016-12-23T00:00:00.000+01:00",
      "datePublicationWeb": "2016-12-21T18:00:00.000+01:00"
    }
  },
  "denominationStructurelle": "Rapport d'information",
  "provenance": "Commission",
  "titres": {
    "titrePrincipal": "rapport d'information déposé en application de l'article 145-7 alinéa 1 du règlement, par la commission des lois constitutionnelles, de la législation et de l'administration générale de la République sur l'évaluation de la loi n°2014-640 du 20 juin 2014 relative à la réforme des procédures de révision et de réexamen d'une condamnation pénale définitive",
    "titrePrincipalCourt": "rapport d'information déposé en application de l'article 145-7 alinéa 1 du règlement, par la commission des lois constitutionnelles, de la législation et de l'administration générale de la République sur l'évaluation de la loi n°2014-640 du 20 juin 2014 relative à la réforme des procédures de révision et de réexamen d'une condamnation pénale définitive"
  },
  "dossierRef": "DLR5L14N35441",
  "classification": {
    "famille": {
      "depot": {
        "code": "RAPAUT",
        "libelle": "Rapport autonome"
      },
      "classe": {
        "code": "RAPINF",
        "libelle": "Rapport d'information"
      },
      "espece": {
        "code": "APPLOI",
        "libelle": "sur l'application des lois"
      }
    },
    "type": {
      "code": "RINF",
      "libelle": "Rapport d'information"
    },
    "sousType": {
      "code": "APPLOI",
      "libelle": "sur l'application des lois"
    }
  },
  "auteurs": [
    {
      "acteur": {
        "acteurRef": "PA267591",
        "qualite": "rapporteur"
      }
    },
    {
      "acteur": {
        "acteurRef": "PA2828",
        "qualite": "rapporteur"
      }
    },
    {
      "organeRef": "PO59051"
    }
  ],
  "notice": {
    "numNotice": "4302",
    "formule": "déposé en application de l'article 145-7 alinéa 1 du règlement, par la commission des lois constitutionnelles, de la législation et de l'administration générale de la République sur l'évaluation de la loi n°2014-640 du 20 juin 2014 relative à la réforme des procédures de révision et de réexamen d'une condamnation pénale définitive",
    "adoptionConforme": false
  },
  "imprimerie": {
    "prix": "3.5"
  }
}