{
  "xsiType": "rapportParlementaire_Type",
  "uid": "RAPPANR5L14B2865",
  "legislature": "14",
  "cycleDeVie": {
    "chrono": {
      "dateCreation": "2015-06-11T00:00:00.000+02:00",
      "dateDepot": "2015-06-11T00:00:00.000+02:00",
      "datePublication": "2015-06-12T00:00:00.000+02:00",
      "datePublicationWeb": "2015-06-11T19:00:00.000+02:00"
    }
  },
  "denominationStructurelle": "Rapport",
  "provenance": "Commission",
  "titres": {
    "titrePrincipal": "rapport sur  les dispositions restant en discussion de la commission mixte paritaire chargée de proposer un texte dus dispositions restant en discussion du projet de loi modifiant la loi n° 2004-639 du 2 juillet 2004 relative à l'octroi de mer",
    "titrePrincipalCourt": "rapport sur  les dispositions restant en discussion de la commission mixte paritaire chargée de proposer un texte dus dispositions restant en discussion du projet de loi modifiant la loi n° 2004-639 du 2 juillet 2004 relative à l'octroi de mer"
  },
  "dossierRef": "DLR5L14N33863",
  "classification": {
    "famille": {
      "depot": {
        "code": "RAPINIT",
        "libelle": "Rapport sur une initiative"
      },
      "classe": {
        "code": "RAPPORT",
        "libelle": "Rapport"
      }
    },
    "type": {
      "code": "RAPP",
      "libelle": "Rapport"
    },
    "statutAdoption": "ADOPTCOM"
  },
  "auteurs": [
    {
      "acteur": {
        "acteurRef": "PA1155",
        "qualite": "rapporteur"
      }
    },
    {
      "organeRef": "PO708315"
    }
  ],
  "notice": {
    "numNotice": "2865",
    "formule": "de la commission mixte paritaire chargée de proposer un texte sur les dispositions restant en discussion de la commission mixte paritaire chargée de proposer un texte dus dispositions restant en discussion du projet de loi modifiant la loi n° 2004-639 du 2 juillet 2004 relative à l'octroi de mer",
    "adoptionConforme": false
  },
  "imprimerie": {
    "prix": "0.75"
  }
}