{
  "xsiType": "DossierCommissionEnquete_Type",
  "uid": "DLR5L14N30153",
  "legislature": "14",
  "titreDossier": {
    "titre": "Commission d'enquête relative aux éventuels dysfonctionnements dans l'action du Gouvernement et des services de l'État, entre le 4 décembre 2012 et le 2 avril 2013, dans la gestion d'une affaire qui a conduit à la démission d'un membre du Gouvernement",
    "titreChemin": "dysfonctionnements_gestion_affaire_Cahuzac"
  },
  "procedureParlementaire": {
    "code": "9",
    "libelle": "Commission d'enquête"
  },
  "initiateur": {
    "acteurs": [
      {
        "acteurRef": "PA588",
        "mandatRef": "PM645491"
      }
    ],
    "organeRef": "PO644420"
  },
  "actesLegislatifs": [
    {
      "xsiType": "Etape_Type",
      "uid": "L14-AN20-30153",
      "codeActe": "AN20",
      "libelleActe": {
        "nomCanonique": "Travaux"
      },
      "organeRef": "PO644420",
      "actesLegislatifs": [
        {
          "xsiType": "Etape_Type",
          "uid": "L14-AN20-COMENQ-30153",
          "codeActe": "AN20-COMENQ",
          "libelleActe": {
            "nomCanonique": "Commission d'enquête",
            "libelleCourt": "Commission d'enquête"
          },
          "organeRef": "PO694085",
          "actesLegislatifs": [
            {
              "xsiType": "CreationOrganeTemporaire_Type",
              "uid": "L14-VD163357",
              "codeActe": "AN20-COMENQ-CREA",
              "libelleActe": {
                "nomCanonique": "Création d'une commission d'enquête",
                "libelleCourt": "Création d'une commission d'enquête"
              },
              "organeRef": "PO694085",
              "dateActe": "2013-04-25T00:00:00.000+02:00",
              "initiateur": {
                "organeRef": "PO644420"
              }
            },
            {
              "xsiType": "NominRapporteurs_Type",
              "uid": "L14-VD163749",
              "codeActe": "AN20-COMENQ-NOMIN",
              "libelleActe": {
                "nomCanonique": "Nomination de rapporteur",
                "libelleCourt": "Nomination de rapporteur"
              },
              "organeRef": "PO694085",
              "dateActe": "2013-05-15T00:00:00.000+02:00",
              "rapporteurs": [
                {
                  "acteurRef": "PA872",
                  "typeRapporteur": "rapporteur"
                }
              ]
            },
            {
              "xsiType": "DepotRapport_Type",
              "uid": "L14-VD166245",
              "codeActe": "AN20-COMENQ-RAPPORT",
              "libelleActe": {
                "nomCanonique": "Dépôt de rapport",
                "libelleCourt": "Dépôt de rapport"
              },
              "organeRef": "PO694085",
              "dateActe": "2013-10-08T00:00:00.000+02:00",
              "texteAssocieRef": "RAPPANR5L14B1408"
            }
          ]
        }
      ]
    }
  ],
  "indexation": {
    "themes": {
      "@niveau": "1",
      "theme": {
        "libelleTheme": "BOIS ET FORETS"
      }
    }
  }
}