{
  "xsiType": "DossierMissionControle_Type",
  "uid": "DLR5L14N32836",
  "legislature": "14",
  "titreDossier": {
    "titre": "Stratégie européenne en matière de perturbateurs endocriniens",
    "titreChemin": "strategie_europeenne_perturbateurs_endocriniens"
  },
  "procedureParlementaire": {
    "code": "19",
    "libelle": "Rapport d'information sans mission"
  },
  "actesLegislatifs": [
    {
      "xsiType": "Etape_Type",
      "uid": "L14-AN20-32836",
      "codeActe": "AN20",
      "libelleActe": {
        "nomCanonique": "Travaux"
      },
      "organeRef": "PO644420",
      "actesLegislatifs": [
        {
          "xsiType": "DepotRapport_Type",
          "uid": "L14-VD169152",
          "codeActe": "AN20-RAPPORT",
          "libelleActe": {
            "nomCanonique": "Dépôt de rapport",
            "libelleCourt": "Dépôt de rapport"
          },
          "organeRef": "PO415287",
          "dateActe": "2014-02-25T00:00:00.000+01:00",
          "texteAssocieRef": "RINFANR5L14B1828"
        }
      ]
    }
  ]
}