{
  "xsiType": "texteLoi_Type",
  "uid": "PRJLSNR5S239B0356",
  "cycleDeVie": {
    "chrono": {
      "dateCreation": "2015-03-23T00:00:00.000+01:00",
      "dateDepot": "2015-03-20T00:00:00.000+01:00",
      "datePublication": "2015-06-25T00:00:00.000+02:00"
    }
  },
  "denominationStructurelle": "Projet de loi",
  "provenance": "Texte Déposé",
  "titres": {
    "titrePrincipal": "projet de loi autorisant la ratification de la convention internationale de Nairobi sur l'enlèvement des épaves",
    "titrePrincipalCourt": "Ratification de la convention internationale de Nairobi sur l'enlèvement des épaves"
  },
  "dossierRef": "DLR5L14N30759",
  "classification": {
    "famille": {
      "depot": {
        "code": "INITNAV",
        "libelle": "Initiative en Navette"
      },
      "classe": {
        "code": "PRJLOI",
        "libelle": "Projet de loi"
      },
      "espece": {
        "code": "AUTRATCONV",
        "libelle": "autorisant la ratification d'une convention"
      }
    },
    "type": {
      "code": "PRJL",
      "libelle": "Projet de loi"
    },
    "sousType": {
      "code": "AUTRATCONV",
      "libelle": "autorisant la ratification d'une convention",
      "libelleEdition": "autorisant la ratification d'une convention"
    }
  },
  "auteurs": [
    {
      "organeRef": "PO78718"
    }
  ],
  "notice": {
    "numNotice": "356",
    "formule": ", adopté, par l'Assemblée nationale, autorisant la ratification de la convention internationale de Nairobi sur l'enlèvement des épaves",
    "adoptionConforme": false
  },
  "depotAmendements": {
    "amendementsSeance": {
      "amendable": false
    }
  }
}