{
  "xsiType": "texteLoi_Type",
  "uid": "PNREANR5L14B1014",
  "legislature": "14",
  "cycleDeVie": {
    "chrono": {
      "dateCreation": "2013-05-02T00:00:00.000+02:00",
      "dateDepot": "2013-05-02T00:00:00.000+02:00",
      "datePublicationWeb": "2013-05-14T11:00:00.000+02:00"
    }
  },
  "denominationStructurelle": "Proposition de résolution",
  "provenance": "Texte Déposé",
  "titres": {
    "titrePrincipal": "proposition de résolution estimant urgent un traité de paix en Corée",
    "titrePrincipalCourt": "traité de paix en Corée"
  },
  "dossierRef": "DLR5L14N30185",
  "classification": {
    "famille": {
      "depot": {
        "code": "INITDEP",
        "libelle": "Initiative en 1er Dépôt"
      },
      "classe": {
        "code": "PIONRES",
        "libelle": "Proposition de résolution"
      },
      "espece": {
        "code": "APPART341",
        "libelle": "en application de Article 34-1 de la Constitution"
      }
    },
    "type": {
      "code": "PNRE",
      "libelle": "Proposition de résolution"
    },
    "sousType": {
      "code": "APPART341",
      "libelle": "en application de Article 34-1 de la Constitution"
    }
  },
  "auteurs": [
    {
      "acteur": {
        "acteurRef": "PA267492",
        "qualite": "auteur"
      }
    }
  ],
  "notice": {
    "numNotice": "1014",
    "formule": "estimant urgent un traité de paix en Corée",
    "adoptionConforme": false
  },
  "indexation": {
    "themes": {
      "@niveau": "1",
      "theme": {
        "libelleTheme": "TRAVAIL"
      }
    }
  }
}