{
  "xsiType": "texteLoi_Type",
  "uid": "PRJLSNR5S259B0251",
  "cycleDeVie": {
    "chrono": {
      "dateCreation": "2015-12-14T00:00:00.000+01:00",
      "dateDepot": "2015-12-11T00:00:00.000+01:00",
      "datePublication": "2016-02-18T00:00:00.000+01:00"
    }
  },
  "denominationStructurelle": "Projet de loi",
  "provenance": "Texte Déposé",
  "titres": {
    "titrePrincipal": "projet de loi autorisant l'approbation de l'accord entre le Gouvernement de la République française et le Conseil fédéral suisse modifiant le protocole additionnel à la convention entre la France et la Suisse du 9 septembre 1966 modifiée, en vue d'éliminer les doubles impositions en matière d'impôts sur le revenu et sur la fortune et de prévenir la fraude et l'évasion fiscales",
    "titrePrincipalCourt": "Accord France-Suisse doubles impositions"
  },
  "dossierRef": "DLR5L14N34081",
  "classification": {
    "famille": {
      "depot": {
        "code": "INITNAV",
        "libelle": "Initiative en Navette"
      },
      "classe": {
        "code": "PRJLOI",
        "libelle": "Projet de loi"
      },
      "espece": {
        "code": "AUTRATCONV",
        "libelle": "autorisant la ratification d'une convention"
      }
    },
    "type": {
      "code": "PRJL",
      "libelle": "Projet de loi"
    },
    "sousType": {
      "code": "AUTRATCONV",
      "libelle": "autorisant la ratification d'une convention",
      "libelleEdition": "autorisant la ratification d'une convention"
    }
  },
  "auteurs": [
    {
      "organeRef": "PO78718"
    }
  ],
  "notice": {
    "numNotice": "251",
    "formule": ", adopté, par l'Assemblée nationale, autorisant l'approbation de l'accord entre le Gouvernement de la République française et le Conseil fédéral suisse modifiant le protocole additionnel à la convention entre la France et la Suisse du 9 septembre 1966 modifiée, en vue d'éliminer les doubles impositions en matière d'impôts sur le revenu et sur la fortune et de prévenir la fraude et l'évasion fiscales",
    "adoptionConforme": false
  },
  "depotAmendements": {
    "amendementsSeance": {
      "amendable": false
    }
  }
}