{
  "xsiType": "rapportParlementaire_Type",
  "uid": "RAPPANR5L14B1720",
  "legislature": "14",
  "cycleDeVie": {
    "chrono": {
      "dateCreation": "2014-01-22T00:00:00.000+01:00",
      "dateDepot": "2014-01-22T00:00:00.000+01:00",
      "datePublication": "2014-01-28T00:00:00.000+01:00",
      "datePublicationWeb": "2014-01-24T19:25:00.000+01:00"
    }
  },
  "denominationStructurelle": "Rapport",
  "provenance": "Commission",
  "titres": {
    "titrePrincipal": "rapport sur   la proposition de loi , adoptée par le Sénat après engagement de la procédure accélérée, tendant à renforcer la lutte contre la contrefaçon (n°1575)",
    "titrePrincipalCourt": "rapport sur   la proposition de loi , adoptée par le Sénat après engagement de la procédure accélérée, tendant à renforcer la lutte contre la contrefaçon (n°1575)"
  },
  "dossierRef": "DLR5L14N31414",
  "classification": {
    "famille": {
      "depot": {
        "code": "RAPINIT",
        "libelle": "Rapport sur une initiative"
      },
      "classe": {
        "code": "RAPPORT",
        "libelle": "Rapport"
      }
    },
    "type": {
      "code": "RAPP",
      "libelle": "Rapport"
    },
    "statutAdoption": "ADOPTCOM"
  },
  "auteurs": [
    {
      "acteur": {
        "acteurRef": "PA336439",
        "qualite": "rapporteur"
      }
    },
    {
      "organeRef": "PO59051"
    }
  ],
  "notice": {
    "numNotice": "1720",
    "formule": "sur   la proposition de loi , adoptée par le Sénat après engagement de la procédure accélérée, tendant à renforcer la lutte contre la contrefaçon (n°1575)",
    "adoptionConforme": false
  },
  "imprimerie": {
    "prix": "3.0"
  }
}