{
  "xsiType": "rapportParlementaire_Type",
  "uid": "RAPPANR5L14B1008",
  "legislature": "14",
  "cycleDeVie": {
    "chrono": {
      "dateCreation": "2013-04-24T00:00:00.000+02:00",
      "dateDepot": "2013-04-24T00:00:00.000+02:00",
      "datePublication": "2013-05-17T00:00:00.000+02:00",
      "datePublicationWeb": "2013-05-16T12:45:00.000+02:00"
    }
  },
  "denominationStructurelle": "Rapport",
  "provenance": "Commission",
  "titres": {
    "titrePrincipal": "rapport sur la proposition de résolution européenne de M. François Brottes, Mme Brigitte Allain, MM. André Chassaigne, Joël Giraud, Germinal Peiro et Franck Reynier sur le respect de la chaîne alimentaire (n°817)",
    "titrePrincipalCourt": "rapport sur la proposition de résolution européenne de M. François Brottes, Mme Brigitte Allain, MM. André Chassaigne, Joël Giraud, Germinal Peiro et Franck Reynier sur le respect de la chaîne alimentaire (n°817)"
  },
  "dossierRef": "DLR5L14N29909",
  "classification": {
    "famille": {
      "depot": {
        "code": "RAPINIT",
        "libelle": "Rapport sur une initiative"
      },
      "classe": {
        "code": "RAPPORT",
        "libelle": "Rapport"
      }
    },
    "type": {
      "code": "RAPP",
      "libelle": "Rapport"
    },
    "statutAdoption": "ADOPTCOM"
  },
  "auteurs": [
    {
      "acteur": {
        "acteurRef": "PA606230",
        "qualite": "rapporteur"
      }
    },
    {
      "organeRef": "PO419610"
    }
  ],
  "notice": {
    "numNotice": "1008",
    "formule": "sur la proposition de résolution européenne de M. François Brottes, Mme Brigitte Allain, MM. André Chassaigne, Joël Giraud, Germinal Peiro et Franck Reynier sur le respect de la chaîne alimentaire (n°817)",
    "adoptionConforme": false
  },
  "indexation": {
    "themes": {
      "@niveau": "1",
      "theme": {
        "libelleTheme": "TRAVAIL"
      }
    }
  },
  "imprimerie": {
    "prix": "1.5"
  }
}