{
  "xsiType": "DossierResolutionAN",
  "uid": "DLR5L14N33733",
  "legislature": "14",
  "titreDossier": {
    "titre": "Conséquences sanitaires et économiques des atermoiements face à l'épidémie de brucellose du bouquetin dans le massif du Bargy en Haute-Savoie",
    "titreChemin": "epidemie_brucellose_bouquetin_massif_Bargy"
  },
  "procedureParlementaire": {
    "code": "8",
    "libelle": "Résolution"
  },
  "initiateur": {
    "acteurs": [
      {
        "acteurRef": "PA230",
        "mandatRef": "PM645553"
      }
    ]
  },
  "actesLegislatifs": [
    {
      "xsiType": "Etape_Type",
      "uid": "L14-ANLUNI-33733",
      "codeActe": "ANLUNI",
      "libelleActe": {
        "nomCanonique": "Lecture unique"
      },
      "organeRef": "PO644420",
      "actesLegislatifs": [
        {
          "xsiType": "DepotInitiative_Type",
          "uid": "L14-VD172730DI",
          "codeActe": "ANLUNI-DEPOT",
          "libelleActe": {
            "nomCanonique": "1er dépôt d'une initiative.",
            "libelleCourt": "1er dépôt d'une initiative."
          },
          "organeRef": "PO644420",
          "dateActe": "2015-02-03T00:00:00.000+01:00",
          "texteAssocieRef": "PNREANR5L14B2543"
        },
        {
          "xsiType": "Etape_Type",
          "uid": "L14-ANLUNI-COM-33733",
          "codeActe": "ANLUNI-COM",
          "libelleActe": {
            "nomCanonique": "Travaux des commissions",
            "libelleCourt": "Travaux des commissions"
          },
          "organeRef": "PO644420",
          "actesLegislatifs": [
            {
              "xsiType": "Etape_Type",
              "uid": "L14-VD172731CF",
              "codeActe": "ANLUNI-COM-FOND",
              "libelleActe": {
                "nomCanonique": "Travaux de la commission saisie au fond",
                "libelleCourt": "Travaux de la commission saisie au fond"
              },
              "organeRef": "PO420120",
              "actesLegislatifs": [
                {
                  "xsiType": "SaisieComFond_Type",
                  "uid": "L14-VD172731CFS",
                  "codeActe": "ANLUNI-COM-FOND-SAISIE",
                  "libelleActe": {
                    "nomCanonique": "Renvoi en commission au fond",
                    "libelleCourt": "Renvoi en commission au fond"
                  },
                  "organeRef": "PO420120",
                  "dateActe": "2015-02-03T00:00:00.000+01:00"
                }
              ]
            }
          ]
        }
      ]
    }
  ]
}