{
  "xsiType": "rapportParlementaire_Type",
  "uid": "RAPPANR5L14B2124",
  "legislature": "14",
  "cycleDeVie": {
    "chrono": {
      "dateCreation": "2014-07-11T00:00:00.000+02:00",
      "dateDepot": "2014-07-11T00:00:00.000+02:00",
      "datePublication": "2014-07-15T00:00:00.000+02:00",
      "datePublicationWeb": "2014-07-11T19:30:00.000+02:00"
    }
  },
  "denominationStructurelle": "Rapport",
  "provenance": "Commission",
  "titres": {
    "titrePrincipal": "rapport sur , en nouvelle lecture,  le projet de loi de finances rectificative , adopté par l'Assemblée nationale, pour 2014 et qui a fait l'objet d'un vote de rejet par le Sénat au cours de sa séance du 8 juillet 2014 (n°2109)",
    "titrePrincipalCourt": "rapport sur , en nouvelle lecture,  le projet de loi de finances rectificative , adopté par l'Assemblée nationale, pour 2014 et qui a fait l'objet d'un vote de rejet par le Sénat au cours de sa séance du 8 juillet 2014 (n°2109)"
  },
  "dossierRef": "DLR5L14N33224",
  "classification": {
    "famille": {
      "depot": {
        "code": "RAPINIT",
        "libelle": "Rapport sur une initiative"
      },
      "classe": {
        "code": "RAPPORT",
        "libelle": "Rapport"
      }
    },
    "type": {
      "code": "RAPP",
      "libelle": "Rapport"
    }
  },
  "auteurs": [
    {
      "acteur": {
        "acteurRef": "PA609590",
        "qualite": "rapporteur"
      }
    },
    {
      "organeRef": "PO59048"
    }
  ],
  "notice": {
    "numNotice": "2124",
    "formule": "sur , en nouvelle lecture,  le projet de loi de finances rectificative , adopté par l'Assemblée nationale, pour 2014 et qui a fait l'objet d'un vote de rejet par le Sénat au cours de sa séance du 8 juillet 2014 (n°2109)",
    "adoptionConforme": false
  },
  "imprimerie": {
    "prix": "4.0"
  }
}