{
  "xsiType": "documentEtudeImpact_Type",
  "uid": "ETDIANR5L14B0137",
  "legislature": "14",
  "cycleDeVie": {
    "chrono": {
      "dateCreation": "2012-08-01T00:00:00.000+02:00",
      "dateDepot": "2012-08-01T00:00:00.000+02:00",
      "datePublicationWeb": "2012-08-02T08:30:00.000+02:00"
    }
  },
  "denominationStructurelle": "Projet de loi",
  "provenance": "Texte Déposé",
  "titres": {
    "titrePrincipal": "Etude d'impact sur le projet de loi autorisant l'approbation de l'accord de coopération dans le domaine de la sécurité intérieure entre le gouvernement de la République française et le gouvernement de la République de Turquie",
    "titrePrincipalCourt": "accord de coopération dans le domaine de la sécurité intérieure entre la France et la Turquie"
  },
  "dossierRef": "DLR5L14N28980",
  "classification": {
    "famille": {
      "depot": {
        "code": "INITDEP",
        "libelle": "Initiative en 1er Dépôt"
      },
      "classe": {
        "code": "PRJLOI",
        "libelle": "Projet de loi"
      },
      "espece": {
        "code": "AUTRATCONV",
        "libelle": "autorisant la ratification d'une convention"
      }
    },
    "type": {
      "code": "ETDI",
      "libelle": "Etude d'impact"
    },
    "sousType": {
      "code": "AUTRATCONV",
      "libelle": "autorisant la ratification d'une convention",
      "libelleEdition": "autorisant la ratification d'une convention"
    }
  },
  "auteurs": [
    {
      "acteur": {
        "acteurRef": "PA328",
        "qualite": "auteur"
      }
    }
  ],
  "notice": {
    "numNotice": "137",
    "formule": "autorisant l'approbation de l'accord de coopération dans le domaine de la sécurité intérieure entre le gouvernement de la République française et le gouvernement de la République de Turquie",
    "adoptionConforme": false
  },
  "indexation": {
    "themes": {
      "@niveau": "1",
      "theme": {
        "libelleTheme": "URBANISME"
      }
    }
  }
}