{
  "xsiType": "DossierResolutionAN",
  "uid": "DLR5L14N34086",
  "legislature": "14",
  "titreDossier": {
    "titre": "Proposition d'une solution au conflit opposant les taxis etVTC",
    "titreChemin": "solution_conflit_taxis_vtc"
  },
  "procedureParlementaire": {
    "code": "22",
    "libelle": "Résolution Article 34-1"
  },
  "initiateur": {
    "acteurs": [
      {
        "acteurRef": "PA346886",
        "mandatRef": "PM695110"
      }
    ]
  },
  "actesLegislatifs": [
    {
      "xsiType": "Etape_Type",
      "uid": "L14-ANLUNI-34086",
      "codeActe": "ANLUNI",
      "libelleActe": {
        "nomCanonique": "Lecture unique"
      },
      "organeRef": "PO644420",
      "actesLegislatifs": [
        {
          "xsiType": "DepotInitiative_Type",
          "uid": "L14-VD174363DI",
          "codeActe": "ANLUNI-DEPOT",
          "libelleActe": {
            "nomCanonique": "1er dépôt d'une initiative.",
            "libelleCourt": "1er dépôt d'une initiative."
          },
          "organeRef": "PO644420",
          "dateActe": "2015-07-02T00:00:00.000+02:00",
          "texteAssocieRef": "PNREANR5L14B2935"
        }
      ]
    }
  ]
}