{
  "xsiType": "texteLoi_Type",
  "uid": "PIONANR5L14B1453",
  "legislature": "14",
  "cycleDeVie": {
    "chrono": {
      "dateCreation": "2013-10-01T00:00:00.000+02:00",
      "dateDepot": "2013-10-10T00:00:00.000+02:00",
      "datePublicationWeb": "2013-10-11T15:30:00.000+02:00"
    }
  },
  "denominationStructurelle": "Proposition de loi",
  "provenance": "Texte Déposé",
  "titres": {
    "titrePrincipal": "proposition de loi visant à introduire un assouplissement d'urgence des dérogations au repos dominical",
    "titrePrincipalCourt": "Assouplissement d'urgence des dérogations au repos dominical"
  },
  "dossierRef": "DLR5L14N31374",
  "classification": {
    "famille": {
      "depot": {
        "code": "INITDEP",
        "libelle": "Initiative en 1er Dépôt"
      },
      "classe": {
        "code": "PIONLOI",
        "libelle": "Proposition de loi"
      }
    },
    "type": {
      "code": "PION",
      "libelle": "Proposition de loi"
    }
  },
  "auteurs": [
    {
      "acteur": {
        "acteurRef": "PA346886",
        "qualite": "auteur"
      }
    }
  ],
  "notice": {
    "numNotice": "1453",
    "formule": "visant à introduire un assouplissement d'urgence des dérogations au repos dominical",
    "adoptionConforme": false
  },
  "coSignataires": [
    {
      "acteurRef": "PA346",
      "dateCosignature": "2013-10-10+02:00",
      "edite": false
    },
    {
      "acteurRef": "PA267822",
      "dateCosignature": "2013-10-10+02:00",
      "edite": false
    },
    {
      "acteurRef": "PA267075",
      "dateCosignature": "2013-10-10+02:00",
      "edite": false
    },
    {
      "acteurRef": "PA223837",
      "dateCosignature": "2013-10-10+02:00",
      "edite": false
    },
    {
      "acteurRef": "PA267165",
      "dateCosignature": "2013-10-10+02:00",
      "edite": false
    },
    {
      "acteurRef": "PA608662",
      "dateCosignature": "2013-10-10+02:00",
      "edite": false
    },
    {
      "acteurRef": "PA267762",
      "dateCosignature": "2013-10-10+02:00",
      "edite": false
    },
    {
      "acteurRef": "PA608826",
      "dateCosignature": "2013-10-10+02:00",
      "edite": false
    },
    {
      "acteurRef": "PA267813",
      "dateCosignature": "2013-10-10+02:00",
      "edite": false
    },
    {
      "acteurRef": "PA609245",
      "dateCosignature": "2013-10-10+02:00",
      "edite": false
    },
    {
      "acteurRef": "PA1931",
      "dateCosignature": "2013-10-10+02:00",
      "edite": false
    },
    {
      "acteurRef": "PA1960",
      "dateCosignature": "2013-10-10+02:00",
      "edite": false
    },
    {
      "acteurRef": "PA267512",
      "dateCosignature": "2013-10-10+02:00",
      "edite": false
    },
    {
      "acteurRef": "PA2073",
      "dateCosignature": "2013-10-10+02:00",
      "edite": false
    },
    {
      "acteurRef": "PA2098",
      "dateCosignature": "2013-10-10+02:00",
      "edite": false
    },
    {
      "acteurRef": "PA266788",
      "dateCosignature": "2013-10-10+02:00",
      "edite": false
    },
    {
      "acteurRef": "PA2295",
      "dateCosignature": "2013-10-10+02:00",
      "edite": false
    },
    {
      "acteurRef": "PA267598",
      "dateCosignature": "2013-10-10+02:00",
      "edite": false
    },
    {
      "acteurRef": "PA610924",
      "dateCosignature": "2013-10-10+02:00",
      "edite": false
    },
    {
      "acteurRef": "PA344492",
      "dateCosignature": "2013-10-10+02:00",
      "edite": false
    },
    {
      "acteurRef": "PA2775",
      "dateCosignature": "2013-10-10+02:00",
      "edite": false
    },
    {
      "acteurRef": "PA2011",
      "dateCosignature": "2013-10-10+02:00",
      "edite": false
    }
  ],
  "depotAmendements": {
    "amendementsSeance": {
      "amendable": false
    },
    "amendementsCommission": [
      {
        "organeRef": "PO420120",
        "amendable": true
      }
    ]
  }
}