{
  "xsiType": "texteLoi_Type",
  "uid": "PIONANR5L14BTC1563",
  "legislature": "14",
  "cycleDeVie": {
    "chrono": {
      "dateCreation": "2013-11-20T00:00:00.000+01:00",
      "dateDepot": "2013-11-20T00:00:00.000+01:00",
      "datePublication": "2013-11-22T00:00:00.000+01:00",
      "datePublicationWeb": "2013-11-20T15:40:00.000+01:00"
    }
  },
  "denominationStructurelle": "Proposition de loi",
  "provenance": "Texte Déposé",
  "titres": {
    "titrePrincipal": "proposition de loi sur   la proposition de loi , modifiée par le Sénat, visant à reconnaître le vote blanc aux élections (n°768)",
    "titrePrincipalCourt": "Reconnaissance du vote blanc"
  },
  "dossierRef": "DLR5L14N28889",
  "classification": {
    "famille": {
      "depot": {
        "code": "INITNAV",
        "libelle": "Initiative en Navette"
      },
      "classe": {
        "code": "PIONLOI",
        "libelle": "Proposition de loi"
      }
    },
    "type": {
      "code": "PION",
      "libelle": "Proposition de loi"
    },
    "statutAdoption": "ADOPTCOM"
  },
  "auteurs": [
    {
      "acteur": {
        "acteurRef": "PA2690",
        "qualite": "rapporteur"
      }
    },
    {
      "organeRef": "PO59051"
    }
  ],
  "notice": {
    "numNotice": "1563",
    "formule": "sur   la proposition de loi , modifiée par le Sénat, visant à reconnaître le vote blanc aux élections (n°768)",
    "adoptionConforme": false
  },
  "indexation": {
    "themes": {
      "@niveau": "1",
      "theme": {
        "libelleTheme": "BANQUES ET ETABLISSEMENTS FINANCIERS"
      }
    }
  },
  "imprimerie": {
    "prix": "0.75"
  },
  "depotAmendements": {
    "amendementsSeance": {
      "amendable": true
    },
    "amendementsCommission": [
      {
        "organeRef": "PO59051",
        "amendable": true
      }
    ]
  }
}