{
  "xsiType": "DossierLegislatif_Type",
  "uid": "DLR5L14N35342",
  "legislature": "14",
  "titreDossier": {
    "titre": "Affaires étrangères : travaux définitifs de la section transfrontalière de la ligne ferroviaire Lyon-Turin",
    "titreChemin": "accord_italie_travaux_tgv_lyon-turin",
    "senatChemin": "http://www.senat.fr/dossier-legislatif/pjl16-271.html"
  },
  "procedureParlementaire": {
    "code": "6",
    "libelle": "Projet de ratification des traités et conventions"
  },
  "initiateur": {
    "acteurs": [
      {
        "acteurRef": "PA267622",
        "mandatRef": "PM702957"
      },
      {
        "acteurRef": "PA328",
        "mandatRef": "PM711554"
      }
    ]
  },
  "actesLegislatifs": [
    {
      "xsiType": "Etape_Type",
      "uid": "L14-AN1-35342",
      "codeActe": "AN1",
      "libelleActe": {
        "nomCanonique": "1ère lecture (1ère assemblée saisie)",
        "libelleCourt": "1ère lecture"
      },
      "organeRef": "PO644420",
      "actesLegislatifs": [
        {
          "xsiType": "DepotInitiative_Type",
          "uid": "L14-VD179849DI",
          "codeActe": "AN1-DEPOT",
          "libelleActe": {
            "nomCanonique": "1er dépôt d'une initiative.",
            "libelleCourt": "1er dépôt d'une initiative."
          },
          "organeRef": "PO644420",
          "dateActe": "2016-10-26T00:00:00.000+02:00",
          "texteAssocieRef": "PRJLANR5L14B4170"
        },
        {
          "xsiType": "EtudeImpact_Type",
          "uid": "L14-VD179849ETI",
          "codeActe": "AN1-ETI",
          "libelleActe": {
            "nomCanonique": "Etude d'impact",
            "libelleCourt": "Etude d'impact"
          },
          "organeRef": "PO644420",
          "dateActe": "2016-10-26T00:00:00.000+02:00",
          "contributionInternaute": {
            "dateOuverture": "2016-11-03+01:00",
            "dateFermeture": "2016-12-22+01:00"
          },
          "texteAssocieRef": "ETDIANR5L14B4170"
        },
        {
          "xsiType": "DepotAccordInternational_Type",
          "uid": "L14-VD179849ACIN",
          "codeActe": "AN1-ACIN",
          "libelleActe": {
            "nomCanonique": "Accord international",
            "libelleCourt": "Accord international"
          },
          "organeRef": "PO644420",
          "dateActe": "2016-10-26T00:00:00.000+02:00",
          "texteAssocieRef": "ACINANR5L14B4170"
        },
        {
          "xsiType": "ProcedureAccelere_Type",
          "uid": "L14-VD179851",
          "codeActe": "AN1-PROCACC",
          "libelleActe": {
            "nomCanonique": "Le gouvernement déclare l'urgence / engage la procédure accélérée",
            "libelleCourt": "Le gouvernement déclare l'urgence / engage la procédure accélérée"
          },
          "organeRef": "PO702883",
          "dateActe": "2016-10-26T00:00:00.000+02:00"
        },
        {
          "xsiType": "Etape_Type",
          "uid": "L14-AN1-COM-35342",
          "codeActe": "AN1-COM",
          "libelleActe": {
            "nomCanonique": "Travaux des commissions",
            "libelleCourt": "Travaux des commissions"
          },
          "organeRef": "PO644420",
          "actesLegislatifs": [
            {
              "xsiType": "Etape_Type",
              "uid": "L14-VD179850CF",
              "codeActe": "AN1-COM-FOND",
              "libelleActe": {
                "nomCanonique": "Travaux de la commission saisie au fond",
                "libelleCourt": "Travaux de la commission saisie au fond"
              },
              "organeRef": "PO59047",
              "actesLegislatifs": [
                {
                  "xsiType": "SaisieComFond_Type",
                  "uid": "L14-VD179850CFS",
                  "codeActe": "AN1-COM-FOND-SAISIE",
                  "libelleActe": {
                    "nomCanonique": "Renvoi en commission au fond",
                    "libelleCourt": "Renvoi en commission au fond"
                  },
                  "organeRef": "PO59047",
                  "dateActe": "2016-10-26T00:00:00.000+02:00"
                },
                {
                  "xsiType": "NominRapporteurs_Type",
                  "uid": "L14-VD180204",
                  "codeActe": "AN1-COM-FOND-NOMIN",
                  "libelleActe": {
                    "nomCanonique": "Nomination de rapporteur",
                    "libelleCourt": "Nomination de rapporteur"
                  },
                  "organeRef": "PO59047",
                  "dateActe": "2016-11-23T00:00:00.000+01:00",
                  "rapporteurs": [
                    {
                      "acteurRef": "PA1116",
                      "typeRapporteur": "rapporteur"
                    }
                  ]
                },
                {
                  "xsiType": "DiscussionCommission_Type",
                  "uid": "L14-VD180128R24496",
                  "codeActe": "AN1-COM-FOND-REUNION",
                  "libelleActe": {
                    "nomCanonique": "Réunion de commission",
                    "libelleCourt": "Réunion de commission"
                  },
                  "organeRef": "PO59047",
                  "dateActe": "2016-11-23T09:45:00.000+01:00"
                },
                {
                  "xsiType": "DiscussionCommission_Type",
                  "uid": "L14-VD180128R24584",
                  "codeActe": "AN1-COM-FOND-REUNION",
                  "libelleActe": {
                    "nomCanonique": "Réunion de commission",
                    "libelleCourt": "Réunion de commission"
                  },
                  "organeRef": "PO59047",
                  "dateActe": "2016-12-14T09:15:00.000+01:00",
                  "odjRef": "RUANR5L14S2017IDC426720PT24584",
                  "reunionRef": "RUANR5L14S2017IDC426720"
                },
                {
                  "xsiType": "DepotRapport_Type",
                  "uid": "L14-VD180481",
                  "codeActe": "AN1-COM-FOND-RAPPORT",
                  "libelleActe": {
                    "nomCanonique": "Dépôt de rapport",
                    "libelleCourt": "Dépôt de rapport"
                  },
                  "organeRef": "PO59047",
                  "dateActe": "2016-12-14T00:00:00.000+01:00",
                  "texteAssocieRef": "RAPPANR5L14B4303"
                }
              ]
            }
          ]
        },
        {
          "xsiType": "Etape_Type",
          "uid": "L14-AN1-DEBATS-35342",
          "codeActe": "AN1-DEBATS",
          "libelleActe": {
            "nomCanonique": "Discussion en séance publique",
            "libelleCourt": "Discussion en séance publique"
          },
          "organeRef": "PO644420",
          "actesLegislatifs": [
            {
              "xsiType": "DiscussionSeancePublique_Type",
              "uid": "L14-VD180257S34549",
              "codeActe": "AN1-DEBATS-SEANCE",
              "libelleActe": {
                "nomCanonique": "Discussion en séance publique",
                "libelleCourt": "Discussion en séance publique"
              },
              "organeRef": "PO644420",
              "dateActe": "2016-12-22T00:00:00.000+01:00",
              "odjRef": "RUANR5L14S2017IDS20467PT34549",
              "reunionRef": "RUANR5L14S2017IDS20467"
            },
            {
              "xsiType": "Decision_Type",
              "uid": "L14-VD180696DEC",
              "codeActe": "AN1-DEBATS-DEC",
              "libelleActe": {
                "nomCanonique": "Décision",
                "libelleCourt": "Décision"
              },
              "organeRef": "PO644420",
              "dateActe": "2016-12-22T00:00:00.000+01:00",
              "reunionRef": "RUANR5L14S2017IDS20467",
              "statutConclusion": {
                "famCode": "TSORTF01",
                "libelle": "adopté"
              },
              "textesAssocies": [
                {
                  "typeTexte": "BTA",
                  "texteAssocieRef": "PRJLANR5L14BTA0876"
                }
              ]
            }
          ]
        }
      ]
    },
    {
      "xsiType": "Etape_Type",
      "uid": "L14-SN1-35342",
      "codeActe": "SN1",
      "libelleActe": {
        "nomCanonique": "1ère lecture (2ème assemblée saisie)",
        "libelleCourt": "1ère lecture"
      },
      "organeRef": "PO78718",
      "actesLegislatifs": [
        {
          "xsiType": "DepotInitiativeNavette_Type",
          "uid": "L14-VD180822DIN",
          "codeActe": "SN1-DEPOT",
          "libelleActe": {
            "nomCanonique": "Dépôt d'une initiative en navette",
            "libelleCourt": "Dépôt d'une initiative en navette"
          },
          "organeRef": "PO78718",
          "dateActe": "2016-12-23T00:00:00.000+01:00",
          "provenanceRef": "PO644420",
          "texteAssocieRef": "PRJLSNR5S279B0271"
        },
        {
          "xsiType": "Etape_Type",
          "uid": "L14-SN1-COM-35342",
          "codeActe": "SN1-COM",
          "libelleActe": {
            "nomCanonique": "Travaux des commissions",
            "libelleCourt": "Travaux des commissions"
          },
          "organeRef": "PO78718",
          "actesLegislatifs": [
            {
              "xsiType": "Etape_Type",
              "uid": "L14-VD180823CF",
              "codeActe": "SN1-COM-FOND",
              "libelleActe": {
                "nomCanonique": "Travaux de la commission saisie au fond",
                "libelleCourt": "Travaux de la commission saisie au fond"
              },
              "organeRef": "PO211491",
              "actesLegislatifs": [
                {
                  "xsiType": "SaisieComFond_Type",
                  "uid": "L14-VD180823CFS",
                  "codeActe": "SN1-COM-FOND-SAISIE",
                  "libelleActe": {
                    "nomCanonique": "Renvoi en commission au fond",
                    "libelleCourt": "Renvoi en commission au fond"
                  },
                  "organeRef": "PO211491",
                  "dateActe": "2016-12-23T00:00:00.000+01:00"
                },
                {
                  "xsiType": "NominRapporteurs_Type",
                  "uid": "L14-VD181020",
                  "codeActe": "SN1-COM-FOND-NOMIN",
                  "libelleActe": {
                    "nomCanonique": "Nomination de rapporteur",
                    "libelleCourt": "Nomination de rapporteur"
                  },
                  "organeRef": "PO211491",
                  "dateActe": "2016-12-14T00:00:00.000+01:00",
                  "rapporteurs": [
                    {
                      "acteurRef": "PA304015",
                      "typeRapporteur": "rapporteur"
                    }
                  ]
                },
                {
                  "xsiType": "DepotRapport_Type",
                  "uid": "L14-VD181021",
                  "codeActe": "SN1-COM-FOND-RAPPORT",
                  "libelleActe": {
                    "nomCanonique": "Dépôt de rapport",
                    "libelleCourt": "Dépôt de rapport"
                  },
                  "organeRef": "PO211491",
                  "dateActe": "2017-01-25T00:00:00.000+01:00",
                  "texteAssocieRef": "RAPPSNR5S279B0329"
                }
              ]
            }
          ]
        },
        {
          "xsiType": "Etape_Type",
          "uid": "L14-SN1-DEBATS-35342",
          "codeActe": "SN1-DEBATS",
          "libelleActe": {
            "nomCanonique": "Discussion en séance publique",
            "libelleCourt": "Discussion en séance publique"
          },
          "organeRef": "PO78718",
          "actesLegislatifs": [
            {
              "xsiType": "DiscussionSeancePublique_Type",
              "uid": "L14-VD180899S34664",
              "codeActe": "SN1-DEBATS-SEANCE",
              "libelleActe": {
                "nomCanonique": "Discussion en séance publique",
                "libelleCourt": "Discussion en séance publique"
              },
              "organeRef": "PO78718",
              "dateActe": "2017-01-26T00:00:00.000+01:00",
              "odjRef": "RUSNR5L14S2017IDS20511PT34664",
              "reunionRef": "RUSNR5L14S2017IDS20511"
            },
            {
              "xsiType": "Decision_Type",
              "uid": "L14-VD181014DEC",
              "codeActe": "SN1-DEBATS-DEC",
              "libelleActe": {
                "nomCanonique": "Décision",
                "libelleCourt": "Décision"
              },
              "organeRef": "PO78718",
              "dateActe": "2017-01-26T00:00:00.000+01:00",
              "reunionRef": "RUSNR5L14S2017IDS20511",
              "statutConclusion": {
                "famCode": "TSORTF03",
                "libelle": "adopté sans modification"
              },
              "textesAssocies": [
                {
                  "typeTexte": "BTA",
                  "texteAssocieRef": "PRJLSNR5S279BTA0068"
                }
              ]
            }
          ]
        }
      ]
    },
    {
      "xsiType": "Etape_Type",
      "uid": "L14-PROM-35342",
      "codeActe": "PROM",
      "libelleActe": {
        "nomCanonique": "Promulgation de la loi",
        "libelleCourt": "Promulgation de la loi"
      },
      "organeRef": "PO696251",
      "actesLegislatifs": [
        {
          "xsiType": "Promulgation_Type",
          "uid": "L14-VD181177PL",
          "codeActe": "PROM-PUB",
          "libelleActe": {
            "nomCanonique": "Promulgation d'une loi",
            "libelleCourt": "Promulgation d'une loi"
          },
          "organeRef": "PO696251",
          "dateActe": "2017-02-01T00:00:00.000+01:00",
          "codeLoi": "2017-116",
          "infoJo": {
            "typeJo": "JO_LOI_DECRET",
            "dateJo": "2017-02-02+01:00",
            "numJo": "28"
          },
          "referenceNor": "MAEJ1623434L",
          "texteLoiRef": "PRJLSNR5S279BTA0068",
          "titreLoi": "autorisant l'approbation de l'accord entre le Gouvernement de la République française et le Gouvernement de la République italienne signé le 24 février 2015 pour l'engagement des travaux définitifs de la section transfrontalière de la nouvelle ligne ferroviaire Lyon-Turin",
          "urlLegifrance": "http://www.legifrance.gouv.fr/WAspad/UnTexteDeJorf?numjo=MAEJ1623434L"
        }
      ]
    }
  ]
}