{
  "xsiType": "texteLoi_Type",
  "uid": "AVISSNR5S219B0147",
  "cycleDeVie": {
    "chrono": {
      "dateCreation": "2013-11-15T00:00:00.000+01:00",
      "dateDepot": "2013-11-13T00:00:00.000+01:00"
    }
  },
  "denominationStructurelle": "Avis",
  "provenance": "Commission",
  "titres": {
    "titrePrincipal": "avis sur   le projet de loi , adopté par l'Assemblée nationale après engagement de la procédure accélérée, autorisant l'approbation de l'accord entre le Gouvernement de la République française et le Gouvernement de la République italienne pour la réalisation et l'exploitation d'une nouvelle ligne ferroviaire Lyon-Turin (n°115)",
    "titrePrincipalCourt": "avis sur   le projet de loi , adopté par l'Assemblée nationale après engagement de la procédure accélérée, autorisant l'approbation de l'accord entre le Gouvernement de la République française et le Gouvernement de la République italienne pour la réalisation et l'exploitation d'une nouvelle ligne ferroviaire Lyon-Turin (n°115)"
  },
  "dossierRef": "DLR5L14N29391",
  "classification": {
    "famille": {
      "depot": {
        "code": "RAPINIT",
        "libelle": "Rapport sur une initiative"
      },
      "classe": {
        "code": "AVIS",
        "libelle": "Avis"
      }
    },
    "type": {
      "code": "AVIS",
      "libelle": "Avis"
    }
  },
  "auteurs": [
    {
      "acteur": {
        "acteurRef": "PA677484",
        "qualite": "rapporteur pour avis"
      }
    },
    {
      "organeRef": "PO516754"
    }
  ],
  "notice": {
    "numNotice": "147",
    "formule": "sur   le projet de loi , adopté par l'Assemblée nationale après engagement de la procédure accélérée, autorisant l'approbation de l'accord entre le Gouvernement de la République française et le Gouvernement de la République italienne pour la réalisation et l'exploitation d'une nouvelle ligne ferroviaire Lyon-Turin (n°115)",
    "adoptionConforme": false
  },
  "indexation": {
    "themes": {
      "@niveau": "1",
      "theme": {
        "libelleTheme": "DOM-TOM"
      }
    }
  }
}