{
  "xsiType": "texteLoi_Type",
  "uid": "PIONANR5L14B3630",
  "legislature": "14",
  "cycleDeVie": {
    "chrono": {
      "dateCreation": "2016-03-24T00:00:00.000+01:00",
      "dateDepot": "2016-04-05T00:00:00.000+02:00",
      "datePublication": "2016-04-12T00:00:00.000+02:00",
      "datePublicationWeb": "2016-04-06T15:40:00.000+02:00"
    }
  },
  "denominationStructurelle": "Proposition de loi",
  "provenance": "Texte Déposé",
  "titres": {
    "titrePrincipal": "proposition de loi visant à développer la notoriété de la médiation de l’énergie",
    "titrePrincipalCourt": "notoriété médiation de l'énergie"
  },
  "dossierRef": "DLR5L14N34786",
  "classification": {
    "famille": {
      "depot": {
        "code": "INITDEP",
        "libelle": "Initiative en 1er Dépôt"
      },
      "classe": {
        "code": "PIONLOI",
        "libelle": "Proposition de loi"
      }
    },
    "type": {
      "code": "PION",
      "libelle": "Proposition de loi"
    }
  },
  "auteurs": [
    {
      "acteur": {
        "acteurRef": "PA2098",
        "qualite": "auteur"
      }
    }
  ],
  "notice": {
    "numNotice": "3630",
    "formule": "visant à développer la notoriété de la médiation de l’énergie",
    "adoptionConforme": false
  },
  "coSignataires": [
    {
      "acteurRef": "PA267743",
      "dateCosignature": "2016-04-05+02:00",
      "edite": false
    },
    {
      "acteurRef": "PA667",
      "dateCosignature": "2016-04-05+02:00",
      "edite": false
    },
    {
      "acteurRef": "PA608416",
      "dateCosignature": "2016-04-05+02:00",
      "edite": false
    },
    {
      "acteurRef": "PA266788",
      "dateCosignature": "2016-04-05+02:00",
      "edite": false
    },
    {
      "acteurRef": "PA605036",
      "dateCosignature": "2016-04-05+02:00",
      "edite": false
    },
    {
      "acteurRef": "PA267289",
      "dateCosignature": "2016-04-05+02:00",
      "edite": false
    },
    {
      "acteurRef": "PA267506",
      "dateCosignature": "2016-04-05+02:00",
      "edite": false
    },
    {
      "acteurRef": "PA608380",
      "dateCosignature": "2016-04-05+02:00",
      "edite": false
    },
    {
      "acteurRef": "PA336316",
      "dateCosignature": "2016-04-05+02:00",
      "edite": false
    },
    {
      "acteurRef": "PA333224",
      "dateCosignature": "2016-04-05+02:00",
      "edite": false
    },
    {
      "acteurRef": "PA267200",
      "dateCosignature": "2016-04-05+02:00",
      "edite": false
    },
    {
      "acteurRef": "PA267204",
      "dateCosignature": "2016-04-05+02:00",
      "edite": false
    },
    {
      "acteurRef": "PA266776",
      "dateCosignature": "2016-04-05+02:00",
      "edite": false
    },
    {
      "acteurRef": "PA2011",
      "dateCosignature": "2016-04-05+02:00",
      "edite": false
    },
    {
      "acteurRef": "PA2377",
      "dateCosignature": "2016-04-05+02:00",
      "edite": false
    },
    {
      "acteurRef": "PA608826",
      "dateCosignature": "2016-04-05+02:00",
      "edite": false
    },
    {
      "acteurRef": "PA2529",
      "dateCosignature": "2016-04-05+02:00",
      "edite": false
    },
    {
      "acteurRef": "PA266774",
      "dateCosignature": "2016-04-05+02:00",
      "edite": false
    },
    {
      "acteurRef": "PA1379",
      "dateCosignature": "2016-04-05+02:00",
      "edite": false
    },
    {
      "acteurRef": "PA335159",
      "dateCosignature": "2016-04-05+02:00",
      "edite": false
    },
    {
      "acteurRef": "PA267598",
      "dateCosignature": "2016-04-05+02:00",
      "edite": false
    },
    {
      "acteurRef": "PA2936",
      "dateCosignature": "2016-04-05+02:00",
      "edite": false
    },
    {
      "acteurRef": "PA334149",
      "dateCosignature": "2016-04-05+02:00",
      "edite": false
    },
    {
      "acteurRef": "PA2796",
      "dateCosignature": "2016-04-05+02:00",
      "edite": false
    },
    {
      "acteurRef": "PA266797",
      "dateCosignature": "2016-04-05+02:00",
      "edite": false
    },
    {
      "acteurRef": "PA267246",
      "dateCosignature": "2016-04-05+02:00",
      "edite": false
    },
    {
      "acteurRef": "PA332523",
      "dateCosignature": "2016-04-05+02:00",
      "edite": false
    },
    {
      "acteurRef": "PA267013",
      "dateCosignature": "2016-04-05+02:00",
      "edite": false
    }
  ],
  "depotAmendements": {
    "amendementsSeance": {
      "amendable": false
    },
    "amendementsCommission": [
      {
        "organeRef": "PO419610",
        "amendable": true
      }
    ]
  }
}