{
  "xsiType": "texteLoi_Type",
  "uid": "PIONANR5L14B0393",
  "legislature": "14",
  "cycleDeVie": {
    "chrono": {
      "dateCreation": "2012-11-09T00:00:00.000+01:00",
      "dateDepot": "2012-11-13T00:00:00.000+01:00",
      "datePublication": "2013-03-27T00:00:00.000+01:00",
      "datePublicationWeb": "2012-11-15T15:30:00.000+01:00"
    }
  },
  "denominationStructurelle": "Proposition de loi",
  "provenance": "Texte Déposé",
  "titres": {
    "titrePrincipal": "proposition de loi tendant à prohiber la différence de taux de sucre entre la composition des produits manufacturés et vendus dans les régions d'outre-mer et celle des mêmes produits vendus dans l'hexagone",
    "titrePrincipalCourt": "prohibition de la différence de taux de sucre outre-mer"
  },
  "dossierRef": "DLR5L14N29316",
  "classification": {
    "famille": {
      "depot": {
        "code": "INITDEP",
        "libelle": "Initiative en 1er Dépôt"
      },
      "classe": {
        "code": "PIONLOI",
        "libelle": "Proposition de loi"
      }
    },
    "type": {
      "code": "PION",
      "libelle": "Proposition de loi"
    }
  },
  "auteurs": [
    {
      "acteur": {
        "acteurRef": "PA1886",
        "qualite": "auteur"
      }
    }
  ],
  "notice": {
    "numNotice": "393",
    "formule": "tendant à prohiber la différence de taux de sucre entre la composition des produits manufacturés et vendus dans les régions d'outre-mer et celle des mêmes produits vendus dans l'hexagone",
    "adoptionConforme": false
  },
  "indexation": {
    "themes": {
      "@niveau": "1",
      "theme": {
        "libelleTheme": "JUSTICE"
      }
    }
  },
  "coSignataires": [
    {
      "acteurRef": "PA643145",
      "dateCosignature": "2012-11-13+01:00",
      "edite": true
    },
    {
      "acteurRef": "PA610681",
      "dateCosignature": "2012-11-13+01:00",
      "edite": true
    },
    {
      "acteurRef": "PA610752",
      "dateCosignature": "2012-11-13+01:00",
      "edite": true
    },
    {
      "acteurRef": "PA607256",
      "dateCosignature": "2012-11-13+01:00",
      "edite": true
    },
    {
      "acteurRef": "PA337568",
      "dateCosignature": "2012-11-13+01:00",
      "edite": false
    },
    {
      "acteurRef": "PA268039",
      "dateCosignature": "2012-11-13+01:00",
      "edite": false
    },
    {
      "acteurRef": "PA337550",
      "dateCosignature": "2012-11-13+01:00",
      "edite": false
    },
    {
      "acteurRef": "PA1880",
      "dateCosignature": "2012-11-13+01:00",
      "edite": false
    },
    {
      "dateCosignature": "2012-11-13+01:00",
      "edite": false,
      "organe": {
        "organeRef": "PO656002",
        "etApparentes": true
      }
    },
    {
      "acteurRef": "PA606675",
      "dateCosignature": "2012-11-13+01:00",
      "edite": false
    },
    {
      "acteurRef": "PA271",
      "dateCosignature": "2012-11-13+01:00",
      "edite": false
    },
    {
      "acteurRef": "PA339",
      "dateCosignature": "2012-11-13+01:00",
      "edite": false
    },
    {
      "acteurRef": "PA356",
      "dateCosignature": "2012-11-13+01:00",
      "edite": false
    },
    {
      "acteurRef": "PA607369",
      "dateCosignature": "2012-11-13+01:00",
      "edite": false
    },
    {
      "acteurRef": "PA342415",
      "dateCosignature": "2012-11-13+01:00",
      "edite": false
    },
    {
      "acteurRef": "PA609845",
      "dateCosignature": "2012-11-13+01:00",
      "edite": false
    },
    {
      "acteurRef": "PA508",
      "dateCosignature": "2012-11-13+01:00",
      "edite": false
    },
    {
      "acteurRef": "PA608363",
      "dateCosignature": "2012-11-13+01:00",
      "edite": false
    },
    {
      "acteurRef": "PA608641",
      "dateCosignature": "2012-11-13+01:00",
      "edite": false
    },
    {
      "acteurRef": "PA606149",
      "dateCosignature": "2012-11-13+01:00",
      "edite": false
    },
    {
      "acteurRef": "PA332843",
      "dateCosignature": "2012-11-13+01:00",
      "edite": false
    },
    {
      "acteurRef": "PA267233",
      "dateCosignature": "2012-11-13+01:00",
      "edite": false
    },
    {
      "acteurRef": "PA608083",
      "dateCosignature": "2012-11-13+01:00",
      "edite": false
    },
    {
      "acteurRef": "PA609314",
      "dateCosignature": "2012-11-13+01:00",
      "edite": false
    },
    {
      "acteurRef": "PA606745",
      "dateCosignature": "2012-11-13+01:00",
      "edite": false
    },
    {
      "acteurRef": "PA642739",
      "dateCosignature": "2012-11-13+01:00",
      "edite": false
    },
    {
      "acteurRef": "PA605261",
      "dateCosignature": "2012-11-13+01:00",
      "edite": false
    },
    {
      "acteurRef": "PA609535",
      "dateCosignature": "2012-11-13+01:00",
      "edite": false
    },
    {
      "acteurRef": "PA695",
      "dateCosignature": "2012-11-13+01:00",
      "edite": false
    },
    {
      "acteurRef": "PA605643",
      "dateCosignature": "2012-11-13+01:00",
      "edite": false
    },
    {
      "acteurRef": "PA608098",
      "dateCosignature": "2012-11-13+01:00",
      "edite": false
    },
    {
      "acteurRef": "PA267188",
      "dateCosignature": "2012-11-13+01:00",
      "edite": false
    },
    {
      "acteurRef": "PA770",
      "dateCosignature": "2012-11-13+01:00",
      "edite": false
    },
    {
      "acteurRef": "PA330118",
      "dateCosignature": "2012-11-13+01:00",
      "edite": false
    },
    {
      "acteurRef": "PA605557",
      "dateCosignature": "2012-11-13+01:00",
      "edite": false
    },
    {
      "acteurRef": "PA872",
      "dateCosignature": "2012-11-13+01:00",
      "edite": false
    },
    {
      "acteurRef": "PA336439",
      "dateCosignature": "2012-11-13+01:00",
      "edite": false
    },
    {
      "acteurRef": "PA344114",
      "dateCosignature": "2012-11-13+01:00",
      "edite": false
    },
    {
      "acteurRef": "PA336421",
      "dateCosignature": "2012-11-13+01:00",
      "edite": false
    },
    {
      "acteurRef": "PA608310",
      "dateCosignature": "2012-11-13+01:00",
      "edite": false
    },
    {
      "acteurRef": "PA334811",
      "dateCosignature": "2012-11-13+01:00",
      "edite": false
    },
    {
      "acteurRef": "PA1032",
      "dateCosignature": "2012-11-13+01:00",
      "edite": false
    },
    {
      "acteurRef": "PA267923",
      "dateCosignature": "2012-11-13+01:00",
      "edite": false
    },
    {
      "acteurRef": "PA609435",
      "dateCosignature": "2012-11-13+01:00",
      "edite": false
    },
    {
      "acteurRef": "PA606573",
      "dateCosignature": "2012-11-13+01:00",
      "edite": false
    },
    {
      "acteurRef": "PA1155",
      "dateCosignature": "2012-11-13+01:00",
      "edite": false
    },
    {
      "acteurRef": "PA610539",
      "dateCosignature": "2012-11-13+01:00",
      "edite": false
    },
    {
      "acteurRef": "PA345994",
      "dateCosignature": "2012-11-13+01:00",
      "edite": false
    },
    {
      "acteurRef": "PA606202",
      "dateCosignature": "2012-11-13+01:00",
      "edite": false
    },
    {
      "acteurRef": "PA1193",
      "dateCosignature": "2012-11-13+01:00",
      "edite": false
    },
    {
      "acteurRef": "PA1198",
      "dateCosignature": "2012-11-13+01:00",
      "edite": false
    },
    {
      "acteurRef": "PA1208",
      "dateCosignature": "2012-11-13+01:00",
      "edite": false
    },
    {
      "acteurRef": "PA330357",
      "dateCosignature": "2012-11-13+01:00",
      "edite": false
    },
    {
      "acteurRef": "PA607193",
      "dateCosignature": "2012-11-13+01:00",
      "edite": false
    },
    {
      "acteurRef": "PA332015",
      "dateCosignature": "2012-11-13+01:00",
      "edite": false
    },
    {
      "acteurRef": "PA333335",
      "dateCosignature": "2012-11-13+01:00",
      "edite": false
    },
    {
      "acteurRef": "PA606171",
      "dateCosignature": "2012-11-13+01:00",
      "edite": false
    },
    {
      "acteurRef": "PA609691",
      "dateCosignature": "2012-11-13+01:00",
      "edite": false
    },
    {
      "acteurRef": "PA332636",
      "dateCosignature": "2012-11-13+01:00",
      "edite": false
    },
    {
      "acteurRef": "PA332305",
      "dateCosignature": "2012-11-13+01:00",
      "edite": false
    },
    {
      "acteurRef": "PA608038",
      "dateCosignature": "2012-11-13+01:00",
      "edite": false
    },
    {
      "acteurRef": "PA331973",
      "dateCosignature": "2012-11-13+01:00",
      "edite": false
    },
    {
      "acteurRef": "PA333043",
      "dateCosignature": "2012-11-13+01:00",
      "edite": false
    },
    {
      "acteurRef": "PA605804",
      "dateCosignature": "2012-11-13+01:00",
      "edite": false
    },
    {
      "acteurRef": "PA267918",
      "dateCosignature": "2012-11-13+01:00",
      "edite": false
    },
    {
      "acteurRef": "PA606161",
      "dateCosignature": "2012-11-13+01:00",
      "edite": false
    },
    {
      "acteurRef": "PA1592",
      "dateCosignature": "2012-11-13+01:00",
      "edite": false
    },
    {
      "acteurRef": "PA610245",
      "dateCosignature": "2012-11-13+01:00",
      "edite": false
    },
    {
      "acteurRef": "PA267954",
      "dateCosignature": "2012-11-13+01:00",
      "edite": false
    },
    {
      "acteurRef": "PA606924",
      "dateCosignature": "2012-11-13+01:00",
      "edite": false
    },
    {
      "acteurRef": "PA333818",
      "dateCosignature": "2012-11-13+01:00",
      "edite": false
    },
    {
      "acteurRef": "PA331835",
      "dateCosignature": "2012-11-13+01:00",
      "edite": false
    },
    {
      "acteurRef": "PA1689",
      "dateCosignature": "2012-11-13+01:00",
      "edite": false
    },
    {
      "acteurRef": "PA332384",
      "dateCosignature": "2012-11-13+01:00",
      "edite": false
    },
    {
      "acteurRef": "PA1710",
      "dateCosignature": "2012-11-13+01:00",
      "edite": false
    },
    {
      "acteurRef": "PA332614",
      "dateCosignature": "2012-11-13+01:00",
      "edite": false
    },
    {
      "acteurRef": "PA335054",
      "dateCosignature": "2012-11-13+01:00",
      "edite": false
    },
    {
      "acteurRef": "PA344242",
      "dateCosignature": "2012-11-13+01:00",
      "edite": false
    },
    {
      "acteurRef": "PA607509",
      "dateCosignature": "2012-11-13+01:00",
      "edite": false
    },
    {
      "acteurRef": "PA1789",
      "dateCosignature": "2012-11-13+01:00",
      "edite": false
    },
    {
      "acteurRef": "PA1844",
      "dateCosignature": "2012-11-13+01:00",
      "edite": false
    },
    {
      "acteurRef": "PA267835",
      "dateCosignature": "2012-11-13+01:00",
      "edite": false
    },
    {
      "acteurRef": "PA1866",
      "dateCosignature": "2012-11-13+01:00",
      "edite": false
    },
    {
      "acteurRef": "PA341246",
      "dateCosignature": "2012-11-13+01:00",
      "edite": false
    },
    {
      "acteurRef": "PA1911",
      "dateCosignature": "2012-11-13+01:00",
      "edite": false
    },
    {
      "acteurRef": "PA605888",
      "dateCosignature": "2012-11-13+01:00",
      "edite": false
    },
    {
      "acteurRef": "PA331658",
      "dateCosignature": "2012-11-13+01:00",
      "edite": false
    },
    {
      "acteurRef": "PA1936",
      "dateCosignature": "2012-11-13+01:00",
      "edite": false
    },
    {
      "acteurRef": "PA331753",
      "dateCosignature": "2012-11-13+01:00",
      "edite": false
    },
    {
      "acteurRef": "PA267965",
      "dateCosignature": "2012-11-13+01:00",
      "edite": false
    },
    {
      "acteurRef": "PA607606",
      "dateCosignature": "2012-11-13+01:00",
      "edite": false
    },
    {
      "acteurRef": "PA330130",
      "dateCosignature": "2012-11-13+01:00",
      "edite": false
    },
    {
      "acteurRef": "PA337483",
      "dateCosignature": "2012-11-13+01:00",
      "edite": false
    },
    {
      "acteurRef": "PA1977",
      "dateCosignature": "2012-11-13+01:00",
      "edite": false
    },
    {
      "acteurRef": "PA607761",
      "dateCosignature": "2012-11-13+01:00",
      "edite": false
    },
    {
      "acteurRef": "PA1991",
      "dateCosignature": "2012-11-13+01:00",
      "edite": false
    },
    {
      "acteurRef": "PA268042",
      "dateCosignature": "2012-11-13+01:00",
      "edite": false
    },
    {
      "acteurRef": "PA609465",
      "dateCosignature": "2012-11-13+01:00",
      "edite": false
    },
    {
      "acteurRef": "PA2051",
      "dateCosignature": "2012-11-13+01:00",
      "edite": false
    },
    {
      "acteurRef": "PA334116",
      "dateCosignature": "2012-11-13+01:00",
      "edite": false
    },
    {
      "acteurRef": "PA330546",
      "dateCosignature": "2012-11-13+01:00",
      "edite": false
    },
    {
      "acteurRef": "PA267091",
      "dateCosignature": "2012-11-13+01:00",
      "edite": false
    },
    {
      "acteurRef": "PA335319",
      "dateCosignature": "2012-11-13+01:00",
      "edite": false
    },
    {
      "acteurRef": "PA332796",
      "dateCosignature": "2012-11-13+01:00",
      "edite": false
    },
    {
      "acteurRef": "PA267479",
      "dateCosignature": "2012-11-13+01:00",
      "edite": false
    },
    {
      "acteurRef": "PA2265",
      "dateCosignature": "2012-11-13+01:00",
      "edite": false
    },
    {
      "acteurRef": "PA609983",
      "dateCosignature": "2012-11-13+01:00",
      "edite": false
    },
    {
      "acteurRef": "PA610729",
      "dateCosignature": "2012-11-13+01:00",
      "edite": false
    },
    {
      "acteurRef": "PA2338",
      "dateCosignature": "2012-11-13+01:00",
      "edite": false
    },
    {
      "acteurRef": "PA607595",
      "dateCosignature": "2012-11-13+01:00",
      "edite": false
    },
    {
      "acteurRef": "PA610075",
      "dateCosignature": "2012-11-13+01:00",
      "edite": false
    },
    {
      "acteurRef": "PA330981",
      "dateCosignature": "2012-11-13+01:00",
      "edite": false
    },
    {
      "acteurRef": "PA608172",
      "dateCosignature": "2012-11-13+01:00",
      "edite": false
    },
    {
      "acteurRef": "PA2430",
      "dateCosignature": "2012-11-13+01:00",
      "edite": false
    },
    {
      "acteurRef": "PA610354",
      "dateCosignature": "2012-11-13+01:00",
      "edite": false
    },
    {
      "acteurRef": "PA606375",
      "dateCosignature": "2012-11-13+01:00",
      "edite": false
    },
    {
      "acteurRef": "PA610954",
      "dateCosignature": "2012-11-13+01:00",
      "edite": false
    },
    {
      "acteurRef": "PA331014",
      "dateCosignature": "2012-11-13+01:00",
      "edite": false
    },
    {
      "acteurRef": "PA2503",
      "dateCosignature": "2012-11-13+01:00",
      "edite": false
    },
    {
      "acteurRef": "PA2549",
      "dateCosignature": "2012-11-13+01:00",
      "edite": false
    },
    {
      "acteurRef": "PA606991",
      "dateCosignature": "2012-11-13+01:00",
      "edite": false
    },
    {
      "acteurRef": "PA2603",
      "dateCosignature": "2012-11-13+01:00",
      "edite": false
    },
    {
      "acteurRef": "PA2611",
      "dateCosignature": "2012-11-13+01:00",
      "edite": false
    },
    {
      "acteurRef": "PA2693",
      "dateCosignature": "2012-11-13+01:00",
      "edite": false
    },
    {
      "acteurRef": "PA610529",
      "dateCosignature": "2012-11-13+01:00",
      "edite": false
    },
    {
      "acteurRef": "PA335017",
      "dateCosignature": "2012-11-13+01:00",
      "edite": false
    },
    {
      "acteurRef": "PA610195",
      "dateCosignature": "2012-11-13+01:00",
      "edite": false
    },
    {
      "acteurRef": "PA2799",
      "dateCosignature": "2012-11-13+01:00",
      "edite": false
    },
    {
      "acteurRef": "PA2800",
      "dateCosignature": "2012-11-13+01:00",
      "edite": false
    },
    {
      "acteurRef": "PA608741",
      "dateCosignature": "2012-11-13+01:00",
      "edite": false
    },
    {
      "acteurRef": "PA607395",
      "dateCosignature": "2012-11-13+01:00",
      "edite": false
    },
    {
      "acteurRef": "PA608695",
      "dateCosignature": "2012-11-13+01:00",
      "edite": false
    },
    {
      "acteurRef": "PA331594",
      "dateCosignature": "2012-11-13+01:00",
      "edite": false
    },
    {
      "acteurRef": "PA336112",
      "dateCosignature": "2012-11-13+01:00",
      "edite": false
    },
    {
      "acteurRef": "PA606230",
      "dateCosignature": "2012-11-13+01:00",
      "edite": false
    },
    {
      "acteurRef": "PA610824",
      "dateCosignature": "2012-11-13+01:00",
      "edite": false
    },
    {
      "acteurRef": "PA2895",
      "dateCosignature": "2012-11-13+01:00",
      "edite": false
    },
    {
      "acteurRef": "PA334951",
      "dateCosignature": "2012-11-13+01:00",
      "edite": false
    },
    {
      "acteurRef": "PA610701",
      "dateCosignature": "2012-11-13+01:00",
      "edite": false
    }
  ],
  "depotAmendements": {
    "amendementsSeance": {
      "amendable": true
    },
    "amendementsCommission": [
      {
        "organeRef": "PO420120",
        "amendable": true
      }
    ]
  }
}