{
  "xsiType": "DossierMissionControle_Type",
  "uid": "DLR5L14N35084",
  "legislature": "14",
  "titreDossier": {
    "titre": "Nouvelle chaîne publique d'information en continu : enjeux et financement",
    "titreChemin": "enjeux_nouvelle_chaine_information_continu"
  },
  "procedureParlementaire": {
    "code": "19",
    "libelle": "Rapport d'information sans mission"
  },
  "actesLegislatifs": [
    {
      "xsiType": "Etape_Type",
      "uid": "L14-AN20-35084",
      "codeActe": "AN20",
      "libelleActe": {
        "nomCanonique": "Travaux"
      },
      "organeRef": "PO644420",
      "actesLegislatifs": [
        {
          "xsiType": "DepotRapport_Type",
          "uid": "L14-VD178903",
          "codeActe": "AN20-RAPPORT",
          "libelleActe": {
            "nomCanonique": "Dépôt de rapport",
            "libelleCourt": "Dépôt de rapport"
          },
          "organeRef": "PO59048",
          "dateActe": "2016-07-13T00:00:00.000+02:00",
          "texteAssocieRef": "RINFANR5L14B3954"
        }
      ]
    }
  ]
}