{
  "xsiType": "texteLoi_Type",
  "uid": "PRJLANR5L14B2489",
  "legislature": "14",
  "cycleDeVie": {
    "chrono": {
      "dateCreation": "2014-12-19T00:00:00.000+01:00",
      "dateDepot": "2014-12-19T00:00:00.000+01:00",
      "datePublication": "2015-06-25T00:00:00.000+02:00",
      "datePublicationWeb": "2015-01-06T17:30:00.000+01:00"
    }
  },
  "denominationStructurelle": "Projet de loi",
  "provenance": "Texte Déposé",
  "titres": {
    "titrePrincipal": "projet de loi autorisant l'approbation de l'accord entre le Gouvernement de la République française et le Gouvernement de la Principauté d'Andorre relatif à la gestion commune de la ressource en eau dans le bassin hydrographique des sources de l'Ariège",
    "titrePrincipalCourt": "Accord avec Andorre relatif à la gestion commune de la ressource en eau dans le bassin hydrographique des sources de l'Ariège"
  },
  "dossierRef": "DLR5L14N32209",
  "classification": {
    "famille": {
      "depot": {
        "code": "INITNAV",
        "libelle": "Initiative en Navette"
      },
      "classe": {
        "code": "PRJLOI",
        "libelle": "Projet de loi"
      },
      "espece": {
        "code": "AUTRATCONV",
        "libelle": "autorisant la ratification d'une convention"
      }
    },
    "type": {
      "code": "PRJL",
      "libelle": "Projet de loi"
    },
    "sousType": {
      "code": "AUTRATCONV",
      "libelle": "autorisant la ratification d'une convention",
      "libelleEdition": "autorisant la ratification d'une convention"
    }
  },
  "auteurs": [
    {
      "organeRef": "PO644420"
    }
  ],
  "notice": {
    "numNotice": "2489",
    "formule": ", adopté par le Sénat, autorisant l'approbation de l'accord entre le Gouvernement de la République française et le Gouvernement de la Principauté d'Andorre relatif à la gestion commune de la ressource en eau dans le bassin hydrographique des sources de l'Ariège",
    "adoptionConforme": false
  },
  "depotAmendements": {
    "amendementsSeance": {
      "amendable": true
    },
    "amendementsCommission": [
      {
        "organeRef": "PO59047",
        "amendable": true
      }
    ]
  }
}