{
  "xsiType": "texteLoi_Type",
  "uid": "PRJLANR5L14B1799",
  "legislature": "14",
  "cycleDeVie": {
    "chrono": {
      "dateCreation": "2014-02-18T00:00:00.000+01:00",
      "dateDepot": "2014-02-18T00:00:00.000+01:00",
      "datePublication": "2015-03-05T00:00:00.000+01:00",
      "datePublicationWeb": "2014-02-20T16:30:00.000+01:00"
    }
  },
  "denominationStructurelle": "Projet de loi",
  "provenance": "Texte Déposé",
  "titres": {
    "titrePrincipal": "projet de loi autorisant la ratification du traité d'extradition entre la République française et la République du Pérou",
    "titrePrincipalCourt": "Ratification du traité d'extradition entre la France et le Pérou"
  },
  "dossierRef": "DLR5L14N31960",
  "classification": {
    "famille": {
      "depot": {
        "code": "INITNAV",
        "libelle": "Initiative en Navette"
      },
      "classe": {
        "code": "PRJLOI",
        "libelle": "Projet de loi"
      },
      "espece": {
        "code": "AUTRATCONV",
        "libelle": "autorisant la ratification d'une convention"
      }
    },
    "type": {
      "code": "PRJL",
      "libelle": "Projet de loi"
    },
    "sousType": {
      "code": "AUTRATCONV",
      "libelle": "autorisant la ratification d'une convention",
      "libelleEdition": "autorisant la ratification d'une convention"
    }
  },
  "auteurs": [
    {
      "organeRef": "PO644420"
    }
  ],
  "notice": {
    "numNotice": "1799",
    "formule": ", adopté par le Sénat, autorisant la ratification du traité d'extradition entre la République française et la République du Pérou",
    "adoptionConforme": false
  },
  "depotAmendements": {
    "amendementsSeance": {
      "amendable": true
    },
    "amendementsCommission": [
      {
        "organeRef": "PO59047",
        "amendable": true
      }
    ]
  }
}