{
  "xsiType": "texteLoi_Type",
  "uid": "PIONANR5L14BTC4312",
  "legislature": "14",
  "cycleDeVie": {
    "chrono": {
      "dateCreation": "2016-12-14T00:00:00.000+01:00",
      "dateDepot": "2016-12-14T00:00:00.000+01:00",
      "datePublication": "2016-12-20T00:00:00.000+01:00",
      "datePublicationWeb": "2016-12-14T19:45:00.000+01:00"
    }
  },
  "denominationStructurelle": "Proposition de loi",
  "provenance": "Texte Déposé",
  "titres": {
    "titrePrincipal": "proposition de loi sur la proposition de loi de M. Olivier Falorni et plusieurs de ses collègues relative au respect de l’animal en abattoir (4203).",
    "titrePrincipalCourt": "respect animal en abattoir"
  },
  "dossierRef": "DLR5L14N35360",
  "classification": {
    "famille": {
      "depot": {
        "code": "INITDEP",
        "libelle": "Initiative en 1er Dépôt"
      },
      "classe": {
        "code": "PIONLOI",
        "libelle": "Proposition de loi"
      }
    },
    "type": {
      "code": "PION",
      "libelle": "Proposition de loi"
    },
    "statutAdoption": "ADOPTCOM"
  },
  "auteurs": [
    {
      "acteur": {
        "acteurRef": "PA605694",
        "qualite": "rapporteur"
      }
    },
    {
      "organeRef": "PO419610"
    }
  ],
  "notice": {
    "numNotice": "4312",
    "formule": "sur la proposition de loi de M. Olivier Falorni et plusieurs de ses collègues relative au respect de l’animal en abattoir (4203).",
    "adoptionConforme": false
  },
  "imprimerie": {
    "prix": "3.0"
  },
  "depotAmendements": {
    "amendementsSeance": {
      "amendable": true
    },
    "amendementsCommission": [
      {
        "organeRef": "PO419610",
        "amendable": true
      }
    ]
  }
}