{
  "xsiType": "texteLoi_Type",
  "uid": "AVISSNR5S219B0344",
  "cycleDeVie": {
    "chrono": {
      "dateCreation": "2014-02-06T00:00:00.000+01:00",
      "dateDepot": "2014-02-05T00:00:00.000+01:00"
    }
  },
  "denominationStructurelle": "Avis",
  "provenance": "Commission",
  "titres": {
    "titrePrincipal": "avis sur   le projet de loi , adopté, par l'Assemblée nationale, d'avenir pour l'agriculture, l'alimentation et la forêt (n°279)",
    "titrePrincipalCourt": "avis sur   le projet de loi , adopté, par l'Assemblée nationale, d'avenir pour l'agriculture, l'alimentation et la forêt (n°279)"
  },
  "dossierRef": "DLR5L14N31757",
  "classification": {
    "famille": {
      "depot": {
        "code": "RAPINIT",
        "libelle": "Rapport sur une initiative"
      },
      "classe": {
        "code": "AVIS",
        "libelle": "Avis"
      }
    },
    "type": {
      "code": "AVIS",
      "libelle": "Avis"
    }
  },
  "auteurs": [
    {
      "acteur": {
        "acteurRef": "PA391505",
        "qualite": "rapporteur pour avis"
      }
    },
    {
      "organeRef": "PO211490"
    }
  ],
  "notice": {
    "numNotice": "344",
    "formule": "sur   le projet de loi , adopté, par l'Assemblée nationale, d'avenir pour l'agriculture, l'alimentation et la forêt (n°279)",
    "adoptionConforme": false
  }
}