{
  "xsiType": "rapportParlementaire_Type",
  "uid": "RAPPANR5L14B2883",
  "legislature": "14",
  "cycleDeVie": {
    "chrono": {
      "dateCreation": "2015-06-17T00:00:00.000+02:00",
      "dateDepot": "2015-06-17T00:00:00.000+02:00",
      "datePublication": "2015-06-23T00:00:00.000+02:00",
      "datePublicationWeb": "2015-06-22T17:00:00.000+02:00"
    }
  },
  "denominationStructurelle": "Rapport",
  "provenance": "Commission",
  "titres": {
    "titrePrincipal": "rapport sur , en nouvelle lecture,  le projet de loi , modifié par le Sénat, relatif à la réforme du droit d'asile (n°2807)",
    "titrePrincipalCourt": "rapport sur , en nouvelle lecture,  le projet de loi , modifié par le Sénat, relatif à la réforme du droit d'asile (n°2807)"
  },
  "dossierRef": "DLR5L14N33347",
  "classification": {
    "famille": {
      "depot": {
        "code": "RAPINIT",
        "libelle": "Rapport sur une initiative"
      },
      "classe": {
        "code": "RAPPORT",
        "libelle": "Rapport"
      }
    },
    "type": {
      "code": "RAPP",
      "libelle": "Rapport"
    },
    "statutAdoption": "ADOPTCOM"
  },
  "auteurs": [
    {
      "acteur": {
        "acteurRef": "PA335319",
        "qualite": "rapporteur"
      }
    },
    {
      "organeRef": "PO59051"
    }
  ],
  "notice": {
    "numNotice": "2883",
    "formule": "sur , en nouvelle lecture,  le projet de loi , modifié par le Sénat, relatif à la réforme du droit d'asile (n°2807)",
    "adoptionConforme": false
  },
  "imprimerie": {
    "prix": "5.0"
  }
}