{
  "xsiType": "DossierLegislatif_Type",
  "uid": "DLR5L14N33354",
  "legislature": "14",
  "titreDossier": {
    "titre": "Entreprises : ventes en liquidation prévues par l'article L. 310-1 du code de commerce",
    "titreChemin": "ratification_ordonnance_2014-295"
  },
  "procedureParlementaire": {
    "code": "1",
    "libelle": "Projet de loi ordinaire"
  },
  "initiateur": {
    "acteurs": [
      {
        "acteurRef": "PA267622",
        "mandatRef": "PM700712"
      }
    ]
  },
  "actesLegislatifs": [
    {
      "xsiType": "Etape_Type",
      "uid": "L14-SN1-33354",
      "codeActe": "SN1",
      "libelleActe": {
        "nomCanonique": "1ère lecture (1ère assemblée saisie)",
        "libelleCourt": "1ère lecture"
      },
      "organeRef": "PO78718",
      "actesLegislatifs": [
        {
          "xsiType": "DepotInitiative_Type",
          "uid": "L14-VD171067DI",
          "codeActe": "SN1-DEPOT",
          "libelleActe": {
            "nomCanonique": "1er dépôt d'une initiative.",
            "libelleCourt": "1er dépôt d'une initiative."
          },
          "organeRef": "PO78718",
          "dateActe": "2014-07-30T00:00:00.000+02:00",
          "texteAssocieRef": "PRJLSNR5S219B0787"
        },
        {
          "xsiType": "Etape_Type",
          "uid": "L14-SN1-COM-33354",
          "codeActe": "SN1-COM",
          "libelleActe": {
            "nomCanonique": "Travaux des commissions",
            "libelleCourt": "Travaux des commissions"
          },
          "organeRef": "PO78718",
          "actesLegislatifs": [
            {
              "xsiType": "Etape_Type",
              "uid": "L14-VD171068CF",
              "codeActe": "SN1-COM-FOND",
              "libelleActe": {
                "nomCanonique": "Travaux de la commission saisie au fond",
                "libelleCourt": "Travaux de la commission saisie au fond"
              },
              "organeRef": "PO211495",
              "actesLegislatifs": [
                {
                  "xsiType": "SaisieComFond_Type",
                  "uid": "L14-VD171068CFS",
                  "codeActe": "SN1-COM-FOND-SAISIE",
                  "libelleActe": {
                    "nomCanonique": "Renvoi en commission au fond",
                    "libelleCourt": "Renvoi en commission au fond"
                  },
                  "organeRef": "PO211495",
                  "dateActe": "2014-07-30T00:00:00.000+02:00"
                }
              ]
            }
          ]
        }
      ]
    }
  ]
}