{
  "xsiType": "texteLoi_Type",
  "uid": "RINFANR5L14B3365",
  "legislature": "14",
  "cycleDeVie": {
    "chrono": {
      "dateCreation": "2015-12-16T00:00:00.000+01:00",
      "dateDepot": "2015-12-16T00:00:00.000+01:00"
    }
  },
  "denominationStructurelle": "Rapport d'information",
  "provenance": "Commission",
  "titres": {
    "titrePrincipal": "rapport d'information déposé par la commission des affaires européennes sur l'examen annuel de croissance pour 2016 et l'avis de la Commission européenne sur les projets de budgets nationaux pour 2016",
    "titrePrincipalCourt": "rapport d'information déposé par la commission des affaires européennes sur l'examen annuel de croissance pour 2016 et l'avis de la Commission européenne sur les projets de budgets nationaux pour 2016"
  },
  "dossierRef": "DLR5L14N34547",
  "classification": {
    "famille": {
      "depot": {
        "code": "RAPAUT",
        "libelle": "Rapport autonome"
      },
      "classe": {
        "code": "RAPINF",
        "libelle": "Rapport d'information"
      },
      "espece": {
        "code": "AUE",
        "libelle": "sur des actes de l'Union européenne"
      }
    },
    "type": {
      "code": "RINF",
      "libelle": "Rapport d'information"
    },
    "sousType": {
      "code": "AUE",
      "libelle": "sur des actes de l'Union européenne"
    }
  },
  "auteurs": [
    {
      "acteur": {
        "acteurRef": "PA735",
        "qualite": "rapporteur"
      }
    },
    {
      "acteur": {
        "acteurRef": "PA1630",
        "qualite": "rapporteur"
      }
    },
    {
      "organeRef": "PO415287"
    }
  ],
  "notice": {
    "numNotice": "3365",
    "formule": "déposé par la commission des affaires européennes sur l'examen annuel de croissance pour 2016 et l'avis de la Commission européenne sur les projets de budgets nationaux pour 2016",
    "adoptionConforme": false
  }
}