{
  "xsiType": "texteLoi_Type",
  "uid": "PIONSNR5S219B0292",
  "cycleDeVie": {
    "chrono": {
      "dateCreation": "2014-10-16T00:00:00.000+02:00",
      "dateDepot": "2014-01-16T00:00:00.000+01:00",
      "datePublication": "2015-03-12T00:00:00.000+01:00"
    }
  },
  "denominationStructurelle": "Proposition de loi",
  "provenance": "Texte Déposé",
  "titres": {
    "titrePrincipal": "proposition de loi tendant à interdire la prescription acquisitive des immeubles du domaine privé des collectivités territoriales et à autoriser l'échange en matière de voies rurales",
    "titrePrincipalCourt": "Interdiction de la prescription acquisitive des immeubles du domaine privé des collectivités territoriales"
  },
  "dossierRef": "DLR5L14N33498",
  "classification": {
    "famille": {
      "depot": {
        "code": "INITDEP",
        "libelle": "Initiative en 1er Dépôt"
      },
      "classe": {
        "code": "PIONLOI",
        "libelle": "Proposition de loi"
      }
    },
    "type": {
      "code": "PION",
      "libelle": "Proposition de loi"
    }
  },
  "auteurs": [
    {
      "acteur": {
        "acteurRef": "PA429848",
        "qualite": "auteur"
      }
    }
  ],
  "notice": {
    "numNotice": "292",
    "formule": "tendant à interdire la prescription acquisitive des immeubles du domaine privé des collectivités territoriales et à autoriser l'échange en matière de voies rurales",
    "adoptionConforme": false
  },
  "coSignataires": [
    {
      "acteurRef": "PA1075",
      "dateCosignature": "2014-01-16+01:00",
      "edite": false
    },
    {
      "acteurRef": "PA227029",
      "dateCosignature": "2014-01-16+01:00",
      "edite": false
    },
    {
      "acteurRef": "PA429849",
      "dateCosignature": "2014-01-16+01:00",
      "edite": false
    },
    {
      "acteurRef": "PA227099",
      "dateCosignature": "2014-01-16+01:00",
      "edite": false
    },
    {
      "acteurRef": "PA429887",
      "dateCosignature": "2014-01-16+01:00",
      "edite": false
    },
    {
      "acteurRef": "PA429863",
      "dateCosignature": "2014-01-16+01:00",
      "edite": false
    },
    {
      "acteurRef": "PA429896",
      "dateCosignature": "2014-01-16+01:00",
      "edite": false
    },
    {
      "acteurRef": "PA262",
      "dateCosignature": "2014-01-16+01:00",
      "edite": false
    },
    {
      "acteurRef": "PA2227",
      "dateCosignature": "2014-01-16+01:00",
      "edite": false
    }
  ],
  "depotAmendements": {
    "amendementsSeance": {
      "amendable": false
    }
  }
}