{
  "xsiType": "rapportParlementaire_Type",
  "uid": "RAPPSNR5S279B0274",
  "cycleDeVie": {
    "chrono": {
      "dateCreation": "2017-01-12T00:00:00.000+01:00",
      "dateDepot": "2016-12-23T00:00:00.000+01:00",
      "datePublication": "2017-07-20T00:00:00.000+02:00"
    }
  },
  "denominationStructurelle": "Projet de loi",
  "provenance": "Texte Déposé",
  "titres": {
    "titrePrincipal": "projet de loi autorisant l'approbation de l'accord relatif aux services de transport aérien entre le Gouvernement de la République française et le Gouvernement de l'Union des Comores",
    "titrePrincipalCourt": "Accord France - Union des Comores relatif au transport aérien"
  },
  "dossierRef": "DLR5L14N34590",
  "classification": {
    "famille": {
      "depot": {
        "code": "INITNAV",
        "libelle": "Initiative en Navette"
      },
      "classe": {
        "code": "PRJLOI",
        "libelle": "Projet de loi"
      },
      "espece": {
        "code": "AUTRATCONV",
        "libelle": "autorisant la ratification d'une convention"
      }
    },
    "type": {
      "code": "PRJL",
      "libelle": "Projet de loi"
    },
    "sousType": {
      "code": "AUTRATCONV",
      "libelle": "autorisant la ratification d'une convention",
      "libelleEdition": "autorisant la ratification d'une convention"
    }
  },
  "auteurs": [
    {
      "organeRef": "PO78718"
    }
  ],
  "notice": {
    "numNotice": "274",
    "formule": ", adopté, par l'Assemblée nationale, autorisant l'approbation de l'accord relatif aux services de transport aérien entre le Gouvernement de la République française et le Gouvernement de l'Union des Comores",
    "adoptionConforme": false
  }
}