{
  "xsiType": "texteLoi_Type",
  "uid": "PIONANR5L14B2289",
  "legislature": "14",
  "cycleDeVie": {
    "chrono": {
      "dateCreation": "2014-10-09T00:00:00.000+02:00",
      "dateDepot": "2014-10-14T00:00:00.000+02:00",
      "datePublicationWeb": "2014-10-16T15:55:00.000+02:00"
    }
  },
  "denominationStructurelle": "Proposition de loi",
  "provenance": "Texte Déposé",
  "titres": {
    "titrePrincipal": "proposition de loi visant à étendre le droit de prescription des infirmiers",
    "titrePrincipalCourt": "extension du droit de prescription des infirmiers"
  },
  "dossierRef": "DLR5L14N33471",
  "classification": {
    "famille": {
      "depot": {
        "code": "INITDEP",
        "libelle": "Initiative en 1er Dépôt"
      },
      "classe": {
        "code": "PIONLOI",
        "libelle": "Proposition de loi"
      }
    },
    "type": {
      "code": "PION",
      "libelle": "Proposition de loi"
    }
  },
  "auteurs": [
    {
      "acteur": {
        "acteurRef": "PA2377",
        "qualite": "auteur"
      }
    }
  ],
  "notice": {
    "numNotice": "2289",
    "formule": "visant à étendre le droit de prescription des infirmiers",
    "adoptionConforme": false
  },
  "depotAmendements": {
    "amendementsSeance": {
      "amendable": false
    },
    "amendementsCommission": [
      {
        "organeRef": "PO420120",
        "amendable": true
      }
    ]
  }
}