{
  "xsiType": "DossierResolutionAN",
  "uid": "DLR5L14N30972",
  "legislature": "14",
  "titreDossier": {
    "titre": "Aménagement du territoire: égalité des territoires",
    "titreChemin": "politique_egalite_territoires"
  },
  "procedureParlementaire": {
    "code": "22",
    "libelle": "Résolution Article 34-1"
  },
  "initiateur": {
    "acteurs": [
      {
        "acteurRef": "PA1886",
        "mandatRef": "PM645099"
      }
    ]
  },
  "actesLegislatifs": [
    {
      "xsiType": "Etape_Type",
      "uid": "L14-ANLUNI-30972",
      "codeActe": "ANLUNI",
      "libelleActe": {
        "nomCanonique": "Lecture unique"
      },
      "organeRef": "PO644420",
      "actesLegislatifs": [
        {
          "xsiType": "DepotInitiative_Type",
          "uid": "L14-VD165413DI",
          "codeActe": "ANLUNI-DEPOT",
          "libelleActe": {
            "nomCanonique": "1er dépôt d'une initiative.",
            "libelleCourt": "1er dépôt d'une initiative."
          },
          "organeRef": "PO644420",
          "dateActe": "2013-07-26T00:00:00.000+02:00",
          "texteAssocieRef": "PNREANR5L14B1333"
        },
        {
          "xsiType": "RetraitInitiative_Type",
          "uid": "L14-VD167331",
          "codeActe": "ANLUNI-RTRINI",
          "libelleActe": {
            "nomCanonique": "Retrait d'une initiative",
            "libelleCourt": "Retrait d'une initiative"
          },
          "organeRef": "PO644420",
          "dateActe": "2013-11-27T00:00:00.000+01:00",
          "texteAssocieRef": "PNREANR5L14B1333"
        }
      ]
    }
  ]
}