{
  "@xsi:type": "texteLoi_Type",
  "uid": "RINFANR5L14B1244",
  "legislature": "14",
  "cycleDeVie": {
    "chrono": {
      "dateCreation": "2013-07-11T00:00:00.000+02:00",
      "dateDepot": "2013-07-11T00:00:00.000+02:00",
      "datePublication": "2013-09-16T00:00:00.000+02:00",
      "datePublicationWeb": "2013-09-11T12:20:00.000+02:00"
    }
  },
  "denominationStructurelle": "Rapport d'information",
  "provenance": "Commission",
  "titres": {
    "titrePrincipal": "rapport d'information déposé en application de l'article 145 du règlement en conclusion des travaux de la mission d'information commune sur l'exécution des crédits 2012 sur le programme 146 \"Equipement des forces\"",
    "titrePrincipalCourt": "rapport d'information déposé en application de l'article 145 du règlement en conclusion des travaux de la mission d'information commune sur l'exécution des crédits 2012 sur le programme 146 \"Equipement des forces\""
  },
  "divisions": null,
  "dossierRef": "DLR5L14N30764",
  "redacteur": null,
  "classification": {
    "famille": {
      "depot": {
        "code": "RAPAUT",
        "libelle": "Rapport autonome"
      },
      "classe": {
        "code": "RAPINF",
        "libelle": "Rapport d'information"
      },
      "espece": {
        "code": "PRPDIT",
        "libelle": "tel quel"
      }
    },
    "type": {
      "code": "RINF",
      "libelle": "Rapport d'information"
    },
    "sousType": {
      "code": "PRPDIT",
      "libelle": "tel quel"
    },
    "statutAdoption": null
  },
  "auteurs": {
    "auteur": [
      {
        "acteur": {
          "acteurRef": "PA672",
          "qualite": "rapporteur"
        }
      },
      {
        "acteur": {
          "acteurRef": "PA923",
          "qualite": "rapporteur"
        }
      },
      {
        "organe": {
          "organeRef": "PO695928"
        }
      }
    ]
  },
  "correction": null,
  "notice": {
    "numNotice": "1244",
    "formule": "déposé en application de l'article 145 du règlement en conclusion des travaux de la mission d'information commune sur l'exécution des crédits 2012 sur le programme 146 \"Equipement des forces\"",
    "adoptionConforme": "false"
  },
  "indexation": {
    "themes": {
      "@niveau": "1",
      "theme": {
        "libelleTheme": "LOIS DE FINANCES"
      }
    }
  },
  "imprimerie": {
    "prix": "3.5"
  },
  "coSignataires": null,
  "depotAmendements": null
}