{
  "@xsi:type": "DossierMissionControle_Type",
  "uid": "DLR5L14N32098",
  "legislature": "14",
  "titreDossier": {
    "titre": "Progrès de l’union bancaire et de l’intégration économique au sein de l’Union économique et monétaire",
    "titreChemin": "progres_integration_bancaire_economique_UEM",
    "senatChemin": null
  },
  "procedureParlementaire": {
    "code": "19",
    "libelle": "Rapport d'information sans mission"
  },
  "initiateur": null,
  "actesLegislatifs": {
    "acteLegislatif": {
      "@xsi:type": "Etape_Type",
      "uid": "L14-AN20-32098",
      "codeActe": "AN20",
      "libelleActe": {
        "nomCanonique": "Travaux"
      },
      "organeRef": "PO644420",
      "dateActe": null,
      "actesLegislatifs": {
        "acteLegislatif": {
          "@xsi:type": "DepotRapport_Type",
          "uid": "L14-VD167851",
          "codeActe": "AN20-RAPPORT",
          "libelleActe": {
            "nomCanonique": "Dépôt de rapport",
            "libelleCourt": "Dépôt de rapport"
          },
          "organeRef": "PO415287",
          "dateActe": "2013-12-18T00:00:00.000+01:00",
          "actesLegislatifs": null,
          "texteAssocie": "RINFANR5L14B1665",
          "texteAdopte": null
        }
      }
    }
  },
  "fusionDossier": null
}