{
  "@xsi:type": "DossierMissionControle_Type",
  "uid": "DLR5L14N33223",
  "legislature": "14",
  "titreDossier": {
    "titre": "Entreprises : optimisation fiscale des entreprises dans un contexte international",
    "titreChemin": "optimisation_fiscale_entreprises",
    "senatChemin": null
  },
  "procedureParlementaire": {
    "code": "19",
    "libelle": "Rapport d'information sans mission"
  },
  "initiateur": null,
  "actesLegislatifs": {
    "acteLegislatif": {
      "@xsi:type": "Etape_Type",
      "uid": "L14-AN20-33223",
      "codeActe": "AN20",
      "libelleActe": {
        "nomCanonique": "Travaux"
      },
      "organeRef": "PO644420",
      "dateActe": null,
      "actesLegislatifs": {
        "acteLegislatif": {
          "@xsi:type": "DepotRapport_Type",
          "uid": "L14-VD170197",
          "codeActe": "AN20-RAPPORT",
          "libelleActe": {
            "nomCanonique": "Dépôt de rapport",
            "libelleCourt": "Dépôt de rapport"
          },
          "organeRef": "PO59048",
          "dateActe": "2014-06-11T00:00:00.000+02:00",
          "actesLegislatifs": null,
          "texteAssocie": "RINFANR5L14B2023",
          "texteAdopte": null
        }
      }
    }
  },
  "fusionDossier": null
}