{
  "@xsi:type": "texteLoi_Type",
  "uid": "PRJLANR5L14B2025",
  "legislature": "14",
  "cycleDeVie": {
    "chrono": {
      "dateCreation": "2014-06-11T00:00:00.000+02:00",
      "dateDepot": "2014-06-11T00:00:00.000+02:00",
      "datePublication": null,
      "datePublicationWeb": "2014-06-12T18:00:00.000+02:00"
    }
  },
  "denominationStructurelle": "Projet de loi",
  "provenance": "Texte Déposé",
  "titres": {
    "titrePrincipal": "projet de loi ratifiant l'ordonnance n° 2013-1208 du 24 décembre 2013 relative à l'adaptation du code de la santé publique à Mayotte",
    "titrePrincipalCourt": "Adaptation du code de la santé publique à Mayotte"
  },
  "divisions": null,
  "dossierRef": "DLR5L14N33226",
  "redacteur": null,
  "classification": {
    "famille": {
      "depot": {
        "code": "INITDEP",
        "libelle": "Initiative en 1er Dépôt"
      },
      "classe": {
        "code": "PRJLOI",
        "libelle": "Projet de loi"
      }
    },
    "type": {
      "code": "PRJL",
      "libelle": "Projet de loi"
    },
    "sousType": null,
    "statutAdoption": null
  },
  "auteurs": {
    "auteur": {
      "acteur": {
        "acteurRef": "PA267622",
        "qualite": "auteur"
      }
    }
  },
  "correction": null,
  "notice": {
    "numNotice": "2025",
    "formule": "ratifiant l'ordonnance n° 2013-1208 du 24 décembre 2013 relative à l'adaptation du code de la santé publique à Mayotte",
    "adoptionConforme": "false"
  },
  "indexation": null,
  "imprimerie": null,
  "coSignataires": {
    "coSignataire": {
      "acteur": {
        "acteurRef": "PA2825"
      },
      "dateCosignature": "2014-06-11+02:00",
      "dateRetraitCosignature": null,
      "edite": "true"
    }
  },
  "depotAmendements": {
    "amendementsSeance": {
      "amendable": "false",
      "dateLimiteDepot": null
    },
    "amendementsCommission": {
      "commission": {
        "organeRef": "PO420120",
        "amendable": "true",
        "dateLimiteDepot": null
      }
    }
  }
}