{
  "@xsi:type": "rapportParlementaire_Type",
  "uid": "RAPPANR5L14B3922",
  "legislature": "14",
  "cycleDeVie": {
    "chrono": {
      "dateCreation": "2016-07-06T00:00:00.000+02:00",
      "dateDepot": "2016-07-05T00:00:00.000+02:00",
      "datePublication": "2016-07-18T00:00:00.000+02:00",
      "datePublicationWeb": "2016-07-15T18:45:00.000+02:00"
    }
  },
  "denominationStructurelle": "Rapport",
  "provenance": "Commission",
  "titres": {
    "titrePrincipal": "rapport d'enquête relative aux moyens mis en œuvre par l'Etat pour lutter contre le terrorisme depuis le 7 janvier 2015",
    "titrePrincipalCourt": "rapport d'enquête relative aux moyens mis en œuvre par l'Etat pour lutter contre le terrorisme depuis le 7 janvier 2015"
  },
  "divisions": {
    "division": [
      {
        "@xsi:type": "rapportParlementaire_Type",
        "uid": "RAPPANR5L14B3922-t1",
        "legislature": "14",
        "cycleDeVie": {
          "chrono": {
            "dateCreation": "2016-07-06T00:00:00.000+02:00",
            "dateDepot": "2016-07-05T00:00:00.000+02:00",
            "datePublication": "2016-07-12T00:00:00.000+02:00",
            "datePublicationWeb": "2016-07-12T09:30:00.000+02:00"
          }
        },
        "denominationStructurelle": "Tome 1",
        "titres": {
          "titrePrincipal": "Rapport",
          "titrePrincipalCourt": "Rapport"
        },
        "divisions": null,
        "dossierRef": "DLR5L14N34659",
        "redacteur": null,
        "classification": {
          "famille": null,
          "type": {
            "code": "RAPP",
            "libelle": "Rapport"
          },
          "sousType": {
            "code": "ENQU",
            "libelle": "d'enquête",
            "libelleEdition": "d'enquête"
          },
          "statutAdoption": null
        },
        "auteurs": {
          "auteur": [
            {
              "acteur": {
                "acteurRef": "PA610075",
                "qualite": "rapporteur"
              }
            },
            {
              "organe": {
                "organeRef": "PO711267"
              }
            }
          ]
        },
        "correction": null,
        "notice": {
          "numNotice": "3922",
          "formule": "relative aux moyens mis en œuvre par l'Etat pour lutter contre le terrorisme depuis le 7 janvier 2015",
          "adoptionConforme": "false"
        },
        "indexation": null,
        "imprimerie": {
          "prix": "9.5"
        }
      },
      {
        "@xsi:type": "rapportParlementaire_Type",
        "uid": "RAPPANR5L14B3922-t2",
        "legislature": "14",
        "cycleDeVie": {
          "chrono": {
            "dateCreation": "2016-07-06T00:00:00.000+02:00",
            "dateDepot": "2016-07-05T00:00:00.000+02:00",
            "datePublication": "2016-07-12T00:00:00.000+02:00",
            "datePublicationWeb": "2016-07-15T20:30:00.000+02:00"
          }
        },
        "denominationStructurelle": "Tome 2",
        "titres": {
          "titrePrincipal": "Comptes rendus des auditions",
          "titrePrincipalCourt": "Comptes rendus des auditions"
        },
        "divisions": null,
        "dossierRef": "DLR5L14N34659",
        "redacteur": null,
        "classification": {
          "famille": null,
          "type": {
            "code": "RAPP",
            "libelle": "Rapport"
          },
          "sousType": {
            "code": "ENQU",
            "libelle": "d'enquête",
            "libelleEdition": "d'enquête"
          },
          "statutAdoption": null
        },
        "auteurs": {
          "auteur": [
            {
              "acteur": {
                "acteurRef": "PA610075",
                "qualite": "rapporteur"
              }
            },
            {
              "organe": {
                "organeRef": "PO711267"
              }
            }
          ]
        },
        "correction": null,
        "notice": {
          "numNotice": "3922",
          "formule": "relative aux moyens mis en œuvre par l'Etat pour lutter contre le terrorisme depuis le 7 janvier 2015",
          "adoptionConforme": "false"
        },
        "indexation": null,
        "imprimerie": {
          "prix": "17.0"
        }
      }
    ]
  },
  "dossierRef": "DLR5L14N34659",
  "redacteur": null,
  "classification": {
    "famille": {
      "depot": {
        "code": "RAPAUT",
        "libelle": "Rapport autonome"
      },
      "classe": {
        "code": "RAPPORT",
        "libelle": "Rapport"
      },
      "espece": {
        "code": "ENQU",
        "libelle": "d'enquête"
      }
    },
    "type": {
      "code": "RAPP",
      "libelle": "Rapport"
    },
    "sousType": {
      "code": "ENQU",
      "libelle": "d'enquête",
      "libelleEdition": "d'enquête"
    },
    "statutAdoption": null
  },
  "auteurs": {
    "auteur": [
      {
        "acteur": {
          "acteurRef": "PA610075",
          "qualite": "rapporteur"
        }
      },
      {
        "organe": {
          "organeRef": "PO711267"
        }
      }
    ]
  },
  "correction": null,
  "notice": {
    "numNotice": "3922",
    "formule": "relative aux moyens mis en œuvre par l'Etat pour lutter contre le terrorisme depuis le 7 janvier 2015",
    "adoptionConforme": "false"
  },
  "indexation": null,
  "imprimerie": null
}