{
  "@xsi:type": "rapportParlementaire_Type",
  "uid": "RAPPANR5L14B0579",
  "legislature": "14",
  "cycleDeVie": {
    "chrono": {
      "dateCreation": "2013-01-09T00:00:00.000+01:00",
      "dateDepot": "2013-01-09T00:00:00.000+01:00",
      "datePublication": "2013-01-16T00:00:00.000+01:00",
      "datePublicationWeb": "2013-01-14T20:30:00.000+01:00"
    }
  },
  "denominationStructurelle": "Rapport",
  "provenance": "Commission",
  "titres": {
    "titrePrincipal": "rapport sur , en nouvelle lecture,  la proposition de loi , adoptée par l'Assemblée nationale après engagement de la procédure accélérée, visant à préparer la transition vers un système énergétique sobre et qui a fait l'objet d'un vote de rejet par le Sénat  au cours de sa séance du 30/10/2012 (n°338)",
    "titrePrincipalCourt": "rapport sur , en nouvelle lecture,  la proposition de loi , adoptée par l'Assemblée nationale après engagement de la procédure accélérée, visant à préparer la transition vers un système énergétique sobre et qui a fait l'objet d'un vote de rejet par le Sénat  au cours de sa séance du 30/10/2012 (n°338)"
  },
  "divisions": null,
  "dossierRef": "DLR5L14N29019",
  "redacteur": null,
  "classification": {
    "famille": {
      "depot": {
        "code": "RAPINIT",
        "libelle": "Rapport sur une initiative"
      },
      "classe": {
        "code": "RAPPORT",
        "libelle": "Rapport"
      }
    },
    "type": {
      "code": "RAPP",
      "libelle": "Rapport"
    },
    "sousType": null,
    "statutAdoption": "ADOPTCOM"
  },
  "auteurs": {
    "auteur": [
      {
        "acteur": {
          "acteurRef": "PA680",
          "qualite": "rapporteur"
        }
      },
      {
        "organe": {
          "organeRef": "PO419610"
        }
      }
    ]
  },
  "correction": null,
  "notice": {
    "numNotice": "579",
    "formule": "sur , en nouvelle lecture,  la proposition de loi , adoptée par l'Assemblée nationale après engagement de la procédure accélérée, visant à préparer la transition vers un système énergétique sobre et qui a fait l'objet d'un vote de rejet par le Sénat  au cours de sa séance du 30/10/2012 (n°338)",
    "adoptionConforme": "false"
  },
  "indexation": {
    "themes": {
      "@niveau": "1",
      "theme": {
        "libelleTheme": "ETRANGERS"
      }
    }
  },
  "imprimerie": {
    "prix": "4.0"
  }
}