{
  "@xsi:type": "texteLoi_Type",
  "uid": "PIONANR5L14B2824",
  "legislature": "14",
  "cycleDeVie": {
    "chrono": {
      "dateCreation": "2015-05-26T00:00:00.000+02:00",
      "dateDepot": "2015-05-28T00:00:00.000+02:00",
      "datePublication": null,
      "datePublicationWeb": "2015-05-29T11:15:00.000+02:00"
    }
  },
  "denominationStructurelle": "Proposition de loi",
  "provenance": "Texte Déposé",
  "titres": {
    "titrePrincipal": "proposition de loi tendant à rendre obligatoire le port de l'uniforme dans chaque établissement du primaire et du secondaire",
    "titrePrincipalCourt": "rendre obligatoire le port de l'uniforme dans chaque établissement du primaire et du secondaire"
  },
  "divisions": null,
  "dossierRef": "DLR5L14N33998",
  "redacteur": null,
  "classification": {
    "famille": {
      "depot": {
        "code": "INITDEP",
        "libelle": "Initiative en 1er Dépôt"
      },
      "classe": {
        "code": "PIONLOI",
        "libelle": "Proposition de loi"
      }
    },
    "type": {
      "code": "PION",
      "libelle": "Proposition de loi"
    },
    "sousType": null,
    "statutAdoption": null
  },
  "auteurs": {
    "auteur": {
      "acteur": {
        "acteurRef": "PA2048",
        "qualite": "auteur"
      }
    }
  },
  "correction": null,
  "notice": {
    "numNotice": "2824",
    "formule": "tendant à rendre obligatoire le port de l'uniforme dans chaque établissement du primaire et du secondaire",
    "adoptionConforme": "false"
  },
  "indexation": null,
  "imprimerie": null,
  "coSignataires": null,
  "depotAmendements": {
    "amendementsSeance": {
      "amendable": "false",
      "dateLimiteDepot": null
    },
    "amendementsCommission": {
      "commission": {
        "organeRef": "PO419604",
        "amendable": "true",
        "dateLimiteDepot": null
      }
    }
  }
}