{
  "@xsi:type": "rapportParlementaire_Type",
  "uid": "RAPPANR5L14B1761",
  "legislature": "14",
  "cycleDeVie": {
    "chrono": {
      "dateCreation": "2014-02-04T00:00:00.000+01:00",
      "dateDepot": "2014-02-04T00:00:00.000+01:00",
      "datePublication": "2014-02-10T00:00:00.000+01:00",
      "datePublicationWeb": "2014-02-06T19:25:00.000+01:00"
    }
  },
  "denominationStructurelle": "Rapport",
  "provenance": "Commission",
  "titres": {
    "titrePrincipal": "rapport sur  les dispositions restant en discussion du projet de loi de programmation pour la ville et la cohésion urbaine",
    "titrePrincipalCourt": "rapport sur  les dispositions restant en discussion du projet de loi de programmation pour la ville et la cohésion urbaine"
  },
  "divisions": null,
  "dossierRef": "DLR5L14N31013",
  "redacteur": null,
  "classification": {
    "famille": {
      "depot": {
        "code": "RAPINIT",
        "libelle": "Rapport sur une initiative"
      },
      "classe": {
        "code": "RAPPORT",
        "libelle": "Rapport"
      }
    },
    "type": {
      "code": "RAPP",
      "libelle": "Rapport"
    },
    "sousType": null,
    "statutAdoption": "ADOPTCOM"
  },
  "auteurs": {
    "auteur": [
      {
        "acteur": {
          "acteurRef": "PA405480",
          "qualite": "rapporteur"
        }
      },
      {
        "organe": {
          "organeRef": "PO699474"
        }
      }
    ]
  },
  "correction": null,
  "notice": {
    "numNotice": "1761",
    "formule": "de la commission mixte paritaire chargée de proposer un texte sur les dispositions restant en discussion du projet de loi de programmation pour la ville et la cohésion urbaine",
    "adoptionConforme": "false"
  },
  "indexation": null,
  "imprimerie": {
    "prix": "1.5"
  }
}