{
  "@xsi:type": "rapportParlementaire_Type",
  "uid": "RAPPANR5L14B3628",
  "legislature": "14",
  "cycleDeVie": {
    "chrono": {
      "dateCreation": "2016-04-05T00:00:00.000+02:00",
      "dateDepot": "2016-04-05T00:00:00.000+02:00",
      "datePublication": "2016-04-06T00:00:00.000+02:00",
      "datePublicationWeb": "2016-04-05T14:45:00.000+02:00"
    }
  },
  "denominationStructurelle": "Rapport",
  "provenance": "Commission",
  "titres": {
    "titrePrincipal": "rapport sur la proposition de loi, modifiée par le Sénat en nouvelle lecture, de modernisation des règles applicables à l'élection présidentielle en vue de la lecture définitive (n° 3625).",
    "titrePrincipalCourt": "rapport sur la proposition de loi, modifiée par le Sénat en nouvelle lecture, de modernisation des règles applicables à l'élection présidentielle en vue de la lecture définitive (n° 3625)."
  },
  "divisions": null,
  "dossierRef": "DLR5L14N34410",
  "redacteur": null,
  "classification": {
    "famille": {
      "depot": {
        "code": "RAPINIT",
        "libelle": "Rapport sur une initiative"
      },
      "classe": {
        "code": "RAPPORT",
        "libelle": "Rapport"
      }
    },
    "type": {
      "code": "RAPP",
      "libelle": "Rapport"
    },
    "sousType": null,
    "statutAdoption": null
  },
  "auteurs": {
    "auteur": [
      {
        "acteur": {
          "acteurRef": "PA610313",
          "qualite": "rapporteur"
        }
      },
      {
        "organe": {
          "organeRef": "PO59051"
        }
      }
    ]
  },
  "correction": null,
  "notice": {
    "numNotice": "3628",
    "formule": "sur la proposition de loi, modifiée par le Sénat en nouvelle lecture, de modernisation des règles applicables à l'élection présidentielle en vue de la lecture définitive (n° 3625).",
    "adoptionConforme": "false"
  },
  "indexation": null,
  "imprimerie": {
    "prix": "0.75"
  }
}