{
  "@xsi:type": "DossierResolutionAN",
  "uid": "DLR5L14N35735",
  "legislature": "14",
  "titreDossier": {
    "titre": "Prise en compte la protection sociale des Français de l'étranger et réflexion afin de  répondre à leurs attentes",
    "titreChemin": "protection_sociale_francais_de_l_etranger",
    "senatChemin": null
  },
  "procedureParlementaire": {
    "code": "22",
    "libelle": "Résolution Article 34-1"
  },
  "initiateur": {
    "acteurs": {
      "acteur": {
        "acteurRef": "PA346886",
        "mandatRef": "PM695110"
      }
    }
  },
  "actesLegislatifs": {
    "acteLegislatif": {
      "@xsi:type": "Etape_Type",
      "uid": "L14-ANLUNI-35735",
      "codeActe": "ANLUNI",
      "libelleActe": {
        "nomCanonique": "Lecture unique"
      },
      "organeRef": "PO644420",
      "dateActe": null,
      "actesLegislatifs": {
        "acteLegislatif": {
          "@xsi:type": "DepotInitiative_Type",
          "uid": "L14-VD181709DI",
          "codeActe": "ANLUNI-DEPOT",
          "libelleActe": {
            "nomCanonique": "1er dépôt d'une initiative.",
            "libelleCourt": "1er dépôt d'une initiative."
          },
          "organeRef": "PO644420",
          "dateActe": "2017-04-12T00:00:00.000+02:00",
          "actesLegislatifs": null,
          "texteAssocie": "PNREANR5L14B4617"
        }
      }
    }
  },
  "fusionDossier": null
}