{
  "@xsi:type": "DossierCommissionEnquete_Type",
  "uid": "DLR5L14N34659",
  "legislature": "14",
  "titreDossier": {
    "titre": "Commission d'enquête relative aux moyens mis en œuvre par l'État pour lutter contre le terrorisme depuis le 7 janvier 2015",
    "titreChemin": "enquete_moyens_lutte_terrorisme",
    "senatChemin": null
  },
  "procedureParlementaire": {
    "code": "9",
    "libelle": "Commission d'enquête"
  },
  "initiateur": {
    "acteurs": {
      "acteur": {
        "acteurRef": "PA1695",
        "mandatRef": "PM645157"
      }
    },
    "organes": {
      "organe": {
        "organeRef": {
          "uid": "PO644420"
        }
      }
    }
  },
  "actesLegislatifs": {
    "acteLegislatif": {
      "@xsi:type": "Etape_Type",
      "uid": "L14-AN20-34659",
      "codeActe": "AN20",
      "libelleActe": {
        "nomCanonique": "Travaux"
      },
      "organeRef": "PO644420",
      "dateActe": null,
      "actesLegislatifs": {
        "acteLegislatif": {
          "@xsi:type": "Etape_Type",
          "uid": "L14-AN20-COMENQ-34659",
          "codeActe": "AN20-COMENQ",
          "libelleActe": {
            "nomCanonique": "Commission d'enquête",
            "libelleCourt": "Commission d'enquête"
          },
          "organeRef": "PO711267",
          "dateActe": null,
          "actesLegislatifs": {
            "acteLegislatif": [
              {
                "@xsi:type": "CreationOrganeTemporaire_Type",
                "uid": "L14-VD176700",
                "codeActe": "AN20-COMENQ-CREA",
                "libelleActe": {
                  "nomCanonique": "Création d'une commission d'enquête",
                  "libelleCourt": "Création d'une commission d'enquête"
                },
                "organeRef": "PO711267",
                "dateActe": "2016-01-27T00:00:00.000+01:00",
                "actesLegislatifs": null,
                "initiateurs": {
                  "organeRef": "PO644420"
                }
              },
              {
                "@xsi:type": "NominRapporteurs_Type",
                "uid": "L14-VD178749",
                "codeActe": "AN20-COMENQ-NOMIN",
                "libelleActe": {
                  "nomCanonique": "Nomination de rapporteur",
                  "libelleCourt": "Nomination de rapporteur"
                },
                "organeRef": "PO711267",
                "dateActe": "2016-02-09T00:00:00.000+01:00",
                "actesLegislatifs": null,
                "rapporteurs": {
                  "rapporteur": {
                    "acteurRef": "PA610075",
                    "typeRapporteur": "rapporteur"
                  }
                },
                "reunion": null
              },
              {
                "@xsi:type": "DepotRapport_Type",
                "uid": "L14-VD178750",
                "codeActe": "AN20-COMENQ-RAPPORT",
                "libelleActe": {
                  "nomCanonique": "Dépôt de rapport",
                  "libelleCourt": "Dépôt de rapport"
                },
                "organeRef": "PO711267",
                "dateActe": "2016-07-05T00:00:00.000+02:00",
                "actesLegislatifs": null,
                "texteAssocie": "RAPPANR5L14B3922",
                "texteAdopte": null
              }
            ]
          }
        }
      }
    }
  },
  "fusionDossier": null
}