{
  "@xsi:type": "texteLoi_Type",
  "uid": "PRJLANR5L14B2800",
  "legislature": "14",
  "cycleDeVie": {
    "chrono": {
      "dateCreation": "2015-05-22T00:00:00.000+02:00",
      "dateDepot": "2015-05-22T00:00:00.000+02:00",
      "datePublication": "2015-06-25T00:00:00.000+02:00",
      "datePublicationWeb": "2015-05-27T14:40:00.000+02:00"
    }
  },
  "denominationStructurelle": "Projet de loi",
  "provenance": "Texte Déposé",
  "titres": {
    "titrePrincipal": "projet de loi ratifiant l'ordonnance n° 2014-1539 du 19 décembre 2014 relative à l'élection des conseillers métropolitains de Lyon",
    "titrePrincipalCourt": "Election des conseillers métropolitains de Lyon"
  },
  "divisions": null,
  "dossierRef": "DLR5L14N33690",
  "redacteur": null,
  "classification": {
    "famille": {
      "depot": {
        "code": "INITNAV",
        "libelle": "Initiative en Navette"
      },
      "classe": {
        "code": "PRJLOI",
        "libelle": "Projet de loi"
      }
    },
    "type": {
      "code": "PRJL",
      "libelle": "Projet de loi"
    },
    "sousType": null,
    "statutAdoption": null
  },
  "auteurs": {
    "auteur": {
      "organe": {
        "organeRef": "PO644420"
      }
    }
  },
  "correction": null,
  "notice": {
    "numNotice": "2800",
    "formule": ", adopté par le Sénat après engagement de la procédure accélérée, ratifiant l'ordonnance n° 2014-1539 du 19 décembre 2014 relative à l'élection des conseillers métropolitains de Lyon",
    "adoptionConforme": "false"
  },
  "indexation": null,
  "imprimerie": null,
  "coSignataires": null,
  "depotAmendements": {
    "amendementsSeance": {
      "amendable": "false",
      "dateLimiteDepot": null
    },
    "amendementsCommission": {
      "commission": {
        "organeRef": "PO59051",
        "amendable": "true",
        "dateLimiteDepot": null
      }
    }
  }
}