{
  "@xsi:type": "texteLoi_Type",
  "uid": "PIONANR5L14B0753",
  "legislature": "14",
  "cycleDeVie": {
    "chrono": {
      "dateCreation": "2013-02-20T00:00:00.000+01:00",
      "dateDepot": "2013-02-27T00:00:00.000+01:00",
      "datePublication": null,
      "datePublicationWeb": "2013-02-28T12:00:00.000+01:00"
    }
  },
  "denominationStructurelle": "Proposition de loi",
  "provenance": "Texte Déposé",
  "titres": {
    "titrePrincipal": "proposition de loi visant à rendre obligatoire l'indication du pays d'origine pour les produits agricoles et alimentaires et les produits de la mer, à l'état brut ou transformé",
    "titrePrincipalCourt": "Indication du pays d'origine pour les produits agricoles et alimentaires"
  },
  "divisions": null,
  "dossierRef": "DLR5L14N29790",
  "redacteur": null,
  "classification": {
    "famille": {
      "depot": {
        "code": "INITDEP",
        "libelle": "Initiative en 1er Dépôt"
      },
      "classe": {
        "code": "PIONLOI",
        "libelle": "Proposition de loi"
      }
    },
    "type": {
      "code": "PION",
      "libelle": "Proposition de loi"
    },
    "sousType": null,
    "statutAdoption": null
  },
  "auteurs": {
    "auteur": {
      "acteur": {
        "acteurRef": "PA267306",
        "qualite": "auteur"
      }
    }
  },
  "correction": null,
  "notice": {
    "numNotice": "753",
    "formule": "visant à rendre obligatoire l'indication du pays d'origine pour les produits agricoles et alimentaires et les produits de la mer, à l'état brut ou transformé",
    "adoptionConforme": "false"
  },
  "indexation": {
    "themes": {
      "@niveau": "1",
      "theme": {
        "libelleTheme": "POLITIQUE ECONOMIQUE ET SOCIALE"
      }
    }
  },
  "imprimerie": null,
  "coSignataires": {
    "coSignataire": [
      {
        "acteur": {
          "acteurRef": "PA295"
        },
        "dateCosignature": "2013-02-27+01:00",
        "dateRetraitCosignature": null,
        "edite": "true"
      },
      {
        "acteur": {
          "acteurRef": "PA551"
        },
        "dateCosignature": "2013-02-27+01:00",
        "dateRetraitCosignature": null,
        "edite": "true"
      },
      {
        "acteur": {
          "acteurRef": "PA689"
        },
        "dateCosignature": "2013-02-27+01:00",
        "dateRetraitCosignature": null,
        "edite": "false"
      },
      {
        "acteur": {
          "acteurRef": "PA267492"
        },
        "dateCosignature": "2013-02-27+01:00",
        "dateRetraitCosignature": null,
        "edite": "false"
      },
      {
        "acteur": {
          "acteurRef": "PA754"
        },
        "dateCosignature": "2013-02-27+01:00",
        "dateRetraitCosignature": null,
        "edite": "false"
      },
      {
        "acteur": {
          "acteurRef": "PA340755"
        },
        "dateCosignature": "2013-02-27+01:00",
        "dateRetraitCosignature": null,
        "edite": "false"
      },
      {
        "acteur": {
          "acteurRef": "PA1364"
        },
        "dateCosignature": "2013-02-27+01:00",
        "dateRetraitCosignature": null,
        "edite": "false"
      },
      {
        "acteur": {
          "acteurRef": "PA605745"
        },
        "dateCosignature": "2013-02-27+01:00",
        "dateRetraitCosignature": null,
        "edite": "false"
      }
    ]
  },
  "depotAmendements": {
    "amendementsSeance": {
      "amendable": "false",
      "dateLimiteDepot": null
    },
    "amendementsCommission": {
      "commission": {
        "organeRef": "PO419610",
        "amendable": "true",
        "dateLimiteDepot": null
      }
    }
  }
}