{
  "@xsi:type": "texteLoi_Type",
  "uid": "RINFANR5L14B4456",
  "legislature": "14",
  "cycleDeVie": {
    "chrono": {
      "dateCreation": "2017-02-08T00:00:00.000+01:00",
      "dateDepot": "2017-02-08T00:00:00.000+01:00",
      "datePublication": "2017-02-14T00:00:00.000+01:00",
      "datePublicationWeb": "2017-02-10T18:00:00.000+01:00"
    }
  },
  "denominationStructurelle": "Rapport d'information",
  "provenance": "Commission",
  "titres": {
    "titrePrincipal": "rapport d'information déposé en application de l'article 146-3 du règlement, par le comité d'évaluation et de contrôle des politiques publiques sur l'évaluation de la régulation des jeux d'argent et de hasard",
    "titrePrincipalCourt": "rapport d'information déposé en application de l'article 146-3 du règlement, par le comité d'évaluation et de contrôle des politiques publiques sur l'évaluation de la régulation des jeux d'argent et de hasard"
  },
  "divisions": null,
  "dossierRef": "DLR5L14N35557",
  "redacteur": null,
  "classification": {
    "famille": {
      "depot": {
        "code": "RAPAUT",
        "libelle": "Rapport autonome"
      },
      "classe": {
        "code": "RAPINF",
        "libelle": "Rapport d'information"
      },
      "espece": {
        "code": "PRPDIT",
        "libelle": "tel quel"
      }
    },
    "type": {
      "code": "RINF",
      "libelle": "Rapport d'information"
    },
    "sousType": {
      "code": "PRPDIT",
      "libelle": "tel quel"
    },
    "statutAdoption": null
  },
  "auteurs": {
    "auteur": [
      {
        "acteur": {
          "acteurRef": "PA332614",
          "qualite": "rapporteur"
        }
      },
      {
        "acteur": {
          "acteurRef": "PA2257",
          "qualite": "rapporteur"
        }
      },
      {
        "organe": {
          "organeRef": "PO420375"
        }
      }
    ]
  },
  "correction": null,
  "notice": {
    "numNotice": "4456",
    "formule": "déposé en application de l'article 146-3 du règlement, par le comité d'évaluation et de contrôle des politiques publiques sur l'évaluation de la régulation des jeux d'argent et de hasard",
    "adoptionConforme": "false"
  },
  "indexation": null,
  "imprimerie": {
    "prix": "8.0"
  },
  "coSignataires": null,
  "depotAmendements": null
}