{
  "@xsi:type": "DossierLegislatif_Type",
  "uid": "DLR5L14N31272",
  "legislature": "14",
  "titreDossier": {
    "titre": "Justice : indemnisation des personnes victimes de prise d'otages",
    "titreChemin": "indemnisation_victimes_prise_otages",
    "senatChemin": "http://www.senat.fr/dossier-legislatif/ppl12-657.html"
  },
  "procedureParlementaire": {
    "code": "2",
    "libelle": "Proposition de loi ordinaire"
  },
  "initiateur": {
    "acteurs": {
      "acteur": {
        "acteurRef": "PA415453",
        "mandatRef": "PM415533"
      }
    },
    "organes": {
      "organe": {
        "organeRef": {
          "uid": "PO78718"
        }
      }
    }
  },
  "actesLegislatifs": {
    "acteLegislatif": [
      {
        "@xsi:type": "Etape_Type",
        "uid": "L14-SN1-31272",
        "codeActe": "SN1",
        "libelleActe": {
          "nomCanonique": "1ère lecture (1ère assemblée saisie)",
          "libelleCourt": "1ère lecture"
        },
        "organeRef": "PO78718",
        "dateActe": null,
        "actesLegislatifs": {
          "acteLegislatif": [
            {
              "@xsi:type": "DepotInitiative_Type",
              "uid": "L14-VD165973DI",
              "codeActe": "SN1-DEPOT",
              "libelleActe": {
                "nomCanonique": "1er dépôt d'une initiative.",
                "libelleCourt": "1er dépôt d'une initiative."
              },
              "organeRef": "PO78718",
              "dateActe": "2013-06-12T00:00:00.000+02:00",
              "actesLegislatifs": null,
              "texteAssocie": "PIONSNR5S199B0657"
            },
            {
              "@xsi:type": "Etape_Type",
              "uid": "L14-SN1-COM-31272",
              "codeActe": "SN1-COM",
              "libelleActe": {
                "nomCanonique": "Travaux des commissions",
                "libelleCourt": "Travaux des commissions"
              },
              "organeRef": "PO78718",
              "dateActe": null,
              "actesLegislatifs": {
                "acteLegislatif": {
                  "@xsi:type": "Etape_Type",
                  "uid": "L14-VD165974CF",
                  "codeActe": "SN1-COM-FOND",
                  "libelleActe": {
                    "nomCanonique": "Travaux de la commission saisie au fond",
                    "libelleCourt": "Travaux de la commission saisie au fond"
                  },
                  "organeRef": "PO211495",
                  "dateActe": null,
                  "actesLegislatifs": {
                    "acteLegislatif": [
                      {
                        "@xsi:type": "SaisieComFond_Type",
                        "uid": "L14-VD165974CFS",
                        "codeActe": "SN1-COM-FOND-SAISIE",
                        "libelleActe": {
                          "nomCanonique": "Renvoi en commission au fond",
                          "libelleCourt": "Renvoi en commission au fond"
                        },
                        "organeRef": "PO211495",
                        "dateActe": "2013-06-12T00:00:00.000+02:00",
                        "actesLegislatifs": null
                      },
                      {
                        "@xsi:type": "NominRapporteurs_Type",
                        "uid": "L14-VD166161",
                        "codeActe": "SN1-COM-FOND-NOMIN",
                        "libelleActe": {
                          "nomCanonique": "Nomination de rapporteur",
                          "libelleCourt": "Nomination de rapporteur"
                        },
                        "organeRef": "PO211495",
                        "dateActe": "2013-09-18T00:00:00.000+02:00",
                        "actesLegislatifs": null,
                        "rapporteurs": {
                          "rapporteur": {
                            "acteurRef": "PA429891",
                            "typeRapporteur": "rapporteur"
                          }
                        },
                        "reunion": null
                      },
                      {
                        "@xsi:type": "DepotRapport_Type",
                        "uid": "L14-VD166162",
                        "codeActe": "SN1-COM-FOND-RAPPORT",
                        "libelleActe": {
                          "nomCanonique": "Dépôt de rapport",
                          "libelleCourt": "Dépôt de rapport"
                        },
                        "organeRef": "PO211495",
                        "dateActe": "2013-10-02T00:00:00.000+02:00",
                        "actesLegislatifs": null,
                        "texteAssocie": "RAPPSNR5S219B0025",
                        "texteAdopte": null
                      }
                    ]
                  }
                }
              }
            },
            {
              "@xsi:type": "Etape_Type",
              "uid": "L14-SN1-DEBATS-31272",
              "codeActe": "SN1-DEBATS",
              "libelleActe": {
                "nomCanonique": "Discussion en séance publique",
                "libelleCourt": "Discussion en séance publique"
              },
              "organeRef": "PO78718",
              "dateActe": null,
              "actesLegislatifs": {
                "acteLegislatif": [
                  {
                    "@xsi:type": "DiscussionSeancePublique_Type",
                    "uid": "L14-VD165976S29074",
                    "codeActe": "SN1-DEBATS-SEANCE",
                    "libelleActe": {
                      "nomCanonique": "Discussion en séance publique",
                      "libelleCourt": "Discussion en séance publique"
                    },
                    "organeRef": "PO78718",
                    "dateActe": "2013-10-09T00:00:00.000+02:00",
                    "actesLegislatifs": null,
                    "reunionRef": "RUSNR5L14S2014IDS17633",
                    "odjRef": "RUSNR5L14S2014IDS17633PT29074"
                  },
                  {
                    "@xsi:type": "Decision_Type",
                    "uid": "L14-VD166282DEC",
                    "codeActe": "SN1-DEBATS-DEC",
                    "libelleActe": {
                      "nomCanonique": "Décision",
                      "libelleCourt": "Décision"
                    },
                    "organeRef": "PO78718",
                    "dateActe": "2013-10-09T00:00:00.000+02:00",
                    "actesLegislatifs": null,
                    "reunionRef": "RUSNR5L14S2014IDS17633",
                    "statutConclusion": {
                      "fam_code": "TSORTF01",
                      "libelle": "adoptée"
                    },
                    "voteRefs": null,
                    "textesAssocies": {
                      "texteAssocie": {
                        "typeTexte": "BTA",
                        "refTexteAssocie": "PIONSNR5S219BTA0010"
                      }
                    }
                  }
                ]
              }
            }
          ]
        }
      },
      {
        "@xsi:type": "Etape_Type",
        "uid": "L14-AN1-31272",
        "codeActe": "AN1",
        "libelleActe": {
          "nomCanonique": "1ère lecture (2ème assemblée saisie)",
          "libelleCourt": "1ère lecture"
        },
        "organeRef": "PO644420",
        "dateActe": null,
        "actesLegislatifs": {
          "acteLegislatif": [
            {
              "@xsi:type": "DepotInitiativeNavette_Type",
              "uid": "L14-VD166283DIN",
              "codeActe": "AN1-DEPOT",
              "libelleActe": {
                "nomCanonique": "Dépôt d'une initiative en navette",
                "libelleCourt": "Dépôt d'une initiative en navette"
              },
              "organeRef": "PO644420",
              "dateActe": "2013-10-09T00:00:00.000+02:00",
              "actesLegislatifs": null,
              "texteAssocie": "PIONANR5L14B1421",
              "provenance": "PO78718"
            },
            {
              "@xsi:type": "Etape_Type",
              "uid": "L14-AN1-COM-31272",
              "codeActe": "AN1-COM",
              "libelleActe": {
                "nomCanonique": "Travaux des commissions",
                "libelleCourt": "Travaux des commissions"
              },
              "organeRef": "PO644420",
              "dateActe": null,
              "actesLegislatifs": {
                "acteLegislatif": {
                  "@xsi:type": "Etape_Type",
                  "uid": "L14-VD166284CF",
                  "codeActe": "AN1-COM-FOND",
                  "libelleActe": {
                    "nomCanonique": "Travaux de la commission saisie au fond",
                    "libelleCourt": "Travaux de la commission saisie au fond"
                  },
                  "organeRef": "PO59051",
                  "dateActe": null,
                  "actesLegislatifs": {
                    "acteLegislatif": {
                      "@xsi:type": "SaisieComFond_Type",
                      "uid": "L14-VD166284CFS",
                      "codeActe": "AN1-COM-FOND-SAISIE",
                      "libelleActe": {
                        "nomCanonique": "Renvoi en commission au fond",
                        "libelleCourt": "Renvoi en commission au fond"
                      },
                      "organeRef": "PO59051",
                      "dateActe": "2013-10-09T00:00:00.000+02:00",
                      "actesLegislatifs": null
                    }
                  }
                }
              }
            }
          ]
        }
      },
      {
        "@xsi:type": "Etape_Type",
        "uid": "L15-AN1-31272",
        "codeActe": "AN1",
        "libelleActe": {
          "nomCanonique": "1ère lecture (2ème assemblée saisie)",
          "libelleCourt": "1ère lecture"
        },
        "organeRef": "PO717460",
        "dateActe": null,
        "actesLegislatifs": {
          "acteLegislatif": [
            {
              "@xsi:type": "DepotInitiativeNavette_Type",
              "uid": "L15-VD182147DIN",
              "codeActe": "AN1-DEPOT",
              "libelleActe": {
                "nomCanonique": "Dépôt d'une initiative en navette",
                "libelleCourt": "Dépôt d'une initiative en navette"
              },
              "organeRef": "PO717460",
              "dateActe": "2017-07-06T00:00:00.000+02:00",
              "actesLegislatifs": null,
              "texteAssocie": "PIONANR5L15B0057",
              "provenance": "PO644420"
            },
            {
              "@xsi:type": "Etape_Type",
              "uid": "L15-AN1-COM-31272",
              "codeActe": "AN1-COM",
              "libelleActe": {
                "nomCanonique": "Travaux des commissions",
                "libelleCourt": "Travaux des commissions"
              },
              "organeRef": "PO717460",
              "dateActe": null,
              "actesLegislatifs": {
                "acteLegislatif": {
                  "@xsi:type": "Etape_Type",
                  "uid": "L15-VD182148CF",
                  "codeActe": "AN1-COM-FOND",
                  "libelleActe": {
                    "nomCanonique": "Travaux de la commission saisie au fond",
                    "libelleCourt": "Travaux de la commission saisie au fond"
                  },
                  "organeRef": "PO59051",
                  "dateActe": null,
                  "actesLegislatifs": {
                    "acteLegislatif": {
                      "@xsi:type": "SaisieComFond_Type",
                      "uid": "L15-VD182148CFS",
                      "codeActe": "AN1-COM-FOND-SAISIE",
                      "libelleActe": {
                        "nomCanonique": "Renvoi en commission au fond",
                        "libelleCourt": "Renvoi en commission au fond"
                      },
                      "organeRef": "PO59051",
                      "dateActe": "2017-07-06T00:00:00.000+02:00",
                      "actesLegislatifs": null
                    }
                  }
                }
              }
            }
          ]
        }
      }
    ]
  },
  "fusionDossier": null
}