{
  "@xsi:type": "texteLoi_Type",
  "uid": "PRJLSNR5S239B0192",
  "legislature": null,
  "cycleDeVie": {
    "chrono": {
      "dateCreation": "2014-12-17T00:00:00.000+01:00",
      "dateDepot": "2014-12-17T00:00:00.000+01:00",
      "datePublication": "2014-12-17T00:00:00.000+01:00",
      "datePublicationWeb": null
    }
  },
  "denominationStructurelle": "Projet de loi",
  "provenance": "Texte Déposé",
  "titres": {
    "titrePrincipal": "projet de loi de programmation des finances publiques pour les années 2014 à 2019",
    "titrePrincipalCourt": "Programmation des finances publiques pour les années 2014 à 2019"
  },
  "divisions": null,
  "dossierRef": "DLR5L14N33440",
  "redacteur": null,
  "classification": {
    "famille": {
      "depot": {
        "code": "INITNAV",
        "libelle": "Initiative en Navette"
      },
      "classe": {
        "code": "PRJLOI",
        "libelle": "Projet de loi"
      }
    },
    "type": {
      "code": "PRJL",
      "libelle": "Projet de loi"
    },
    "sousType": null,
    "statutAdoption": null
  },
  "auteurs": {
    "auteur": {
      "organe": {
        "organeRef": "PO78718"
      }
    }
  },
  "correction": null,
  "notice": {
    "numNotice": "192",
    "formule": ", adopté, par l'Assemblée nationale, en nouvelle lecture, de programmation des finances publiques pour les années 2014 à 2019",
    "adoptionConforme": "false"
  },
  "indexation": null,
  "imprimerie": null,
  "coSignataires": null,
  "depotAmendements": {
    "amendementsSeance": {
      "amendable": "false",
      "dateLimiteDepot": null
    }
  }
}