{
  "@xsi:type": "rapportParlementaire_Type",
  "uid": "RAPPSNR5S199B0478",
  "legislature": null,
  "cycleDeVie": {
    "chrono": {
      "dateCreation": "2013-04-02T00:00:00.000+02:00",
      "dateDepot": "2013-04-02T00:00:00.000+02:00",
      "datePublication": null,
      "datePublicationWeb": null
    }
  },
  "denominationStructurelle": "Rapport",
  "provenance": "Commission",
  "titres": {
    "titrePrincipal": "rapport sur  les dispositions restant en discussion du projet de loi relatif à l'élection des conseillers départementaux, des conseillers municipaux et des délégués communautaires, et modifiant le calendrier électoral",
    "titrePrincipalCourt": "rapport sur  les dispositions restant en discussion du projet de loi relatif à l'élection des conseillers départementaux, des conseillers municipaux et des délégués communautaires, et modifiant le calendrier électoral"
  },
  "divisions": null,
  "dossierRef": "DLR5L14N29393",
  "redacteur": null,
  "classification": {
    "famille": {
      "depot": {
        "code": "RAPINIT",
        "libelle": "Rapport sur une initiative"
      },
      "classe": {
        "code": "RAPPORT",
        "libelle": "Rapport"
      }
    },
    "type": {
      "code": "RAPP",
      "libelle": "Rapport"
    },
    "sousType": null,
    "statutAdoption": null
  },
  "auteurs": {
    "auteur": [
      {
        "acteur": {
          "acteurRef": "PA1048",
          "qualite": "rapporteur"
        }
      },
      {
        "organe": {
          "organeRef": "PO693143"
        }
      }
    ]
  },
  "correction": null,
  "notice": {
    "numNotice": "478",
    "formule": "de la commission mixte paritaire chargée de proposer un texte sur les dispositions restant en discussion du projet de loi relatif à l'élection des conseillers départementaux, des conseillers municipaux et des délégués communautaires, et modifiant le calendrier électoral",
    "adoptionConforme": "false"
  },
  "indexation": null,
  "imprimerie": null
}