{
  "@xsi:type": "DossierLegislatif_Type",
  "uid": "DLR5L14N35289",
  "legislature": "14",
  "titreDossier": {
    "titre": "Questions sociales et santé : diverses dispositions relatives aux produits de santé",
    "titreChemin": "ratification_ordonnance_2016-966",
    "senatChemin": "http://www.senat.fr/dossier-legislatif/pjl16-012.html"
  },
  "procedureParlementaire": {
    "code": "1",
    "libelle": "Projet de loi ordinaire"
  },
  "initiateur": {
    "acteurs": {
      "acteur": {
        "acteurRef": "PA267622",
        "mandatRef": "PM702957"
      }
    }
  },
  "actesLegislatifs": {
    "acteLegislatif": [
      {
        "@xsi:type": "Etape_Type",
        "uid": "L14-SN1-35289",
        "codeActe": "SN1",
        "libelleActe": {
          "nomCanonique": "1ère lecture (1ère assemblée saisie)",
          "libelleCourt": "1ère lecture"
        },
        "organeRef": "PO78718",
        "dateActe": null,
        "actesLegislatifs": {
          "acteLegislatif": [
            {
              "@xsi:type": "DepotInitiative_Type",
              "uid": "L14-VD179570DI",
              "codeActe": "SN1-DEPOT",
              "libelleActe": {
                "nomCanonique": "1er dépôt d'une initiative.",
                "libelleCourt": "1er dépôt d'une initiative."
              },
              "organeRef": "PO78718",
              "dateActe": "2016-10-05T00:00:00.000+02:00",
              "actesLegislatifs": null,
              "texteAssocie": "PRJLSNR5S279B0012"
            },
            {
              "@xsi:type": "ProcedureAccelere_Type",
              "uid": "L14-VD179574",
              "codeActe": "SN1-PROCACC",
              "libelleActe": {
                "nomCanonique": "Le gouvernement déclare l'urgence / engage la procédure accélérée",
                "libelleCourt": "Le gouvernement déclare l'urgence / engage la procédure accélérée"
              },
              "organeRef": "PO702883",
              "dateActe": "2016-10-05T00:00:00.000+02:00",
              "actesLegislatifs": null
            },
            {
              "@xsi:type": "Etape_Type",
              "uid": "L14-SN1-COM-35289",
              "codeActe": "SN1-COM",
              "libelleActe": {
                "nomCanonique": "Travaux des commissions",
                "libelleCourt": "Travaux des commissions"
              },
              "organeRef": "PO78718",
              "dateActe": null,
              "actesLegislatifs": {
                "acteLegislatif": {
                  "@xsi:type": "Etape_Type",
                  "uid": "L14-VD179571CF",
                  "codeActe": "SN1-COM-FOND",
                  "libelleActe": {
                    "nomCanonique": "Travaux de la commission saisie au fond",
                    "libelleCourt": "Travaux de la commission saisie au fond"
                  },
                  "organeRef": "PO211493",
                  "dateActe": null,
                  "actesLegislatifs": {
                    "acteLegislatif": [
                      {
                        "@xsi:type": "SaisieComFond_Type",
                        "uid": "L14-VD179571CFS",
                        "codeActe": "SN1-COM-FOND-SAISIE",
                        "libelleActe": {
                          "nomCanonique": "Renvoi en commission au fond",
                          "libelleCourt": "Renvoi en commission au fond"
                        },
                        "organeRef": "PO211493",
                        "dateActe": "2016-10-05T00:00:00.000+02:00",
                        "actesLegislatifs": null
                      },
                      {
                        "@xsi:type": "NominRapporteurs_Type",
                        "uid": "L14-VD179787",
                        "codeActe": "SN1-COM-FOND-NOMIN",
                        "libelleActe": {
                          "nomCanonique": "Nomination de rapporteur",
                          "libelleCourt": "Nomination de rapporteur"
                        },
                        "organeRef": "PO211493",
                        "dateActe": "2016-09-28T00:00:00.000+02:00",
                        "actesLegislatifs": null,
                        "rapporteurs": {
                          "rapporteur": {
                            "acteurRef": "PA360",
                            "typeRapporteur": "rapporteur"
                          }
                        },
                        "reunion": null
                      },
                      {
                        "@xsi:type": "DepotRapport_Type",
                        "uid": "L14-VD179790",
                        "codeActe": "SN1-COM-FOND-RAPPORT",
                        "libelleActe": {
                          "nomCanonique": "Dépôt de rapport",
                          "libelleCourt": "Dépôt de rapport"
                        },
                        "organeRef": "PO211493",
                        "dateActe": "2016-10-19T00:00:00.000+02:00",
                        "actesLegislatifs": null,
                        "texteAssocie": "RAPPSNR5S279B0012",
                        "texteAdopte": null
                      }
                    ]
                  }
                }
              }
            },
            {
              "@xsi:type": "Etape_Type",
              "uid": "L14-SN1-DEBATS-35289",
              "codeActe": "SN1-DEBATS",
              "libelleActe": {
                "nomCanonique": "Discussion en séance publique",
                "libelleCourt": "Discussion en séance publique"
              },
              "organeRef": "PO78718",
              "dateActe": null,
              "actesLegislatifs": {
                "acteLegislatif": [
                  {
                    "@xsi:type": "DiscussionSeancePublique_Type",
                    "uid": "L14-VD179781S34335",
                    "codeActe": "SN1-DEBATS-SEANCE",
                    "libelleActe": {
                      "nomCanonique": "Discussion en séance publique",
                      "libelleCourt": "Discussion en séance publique"
                    },
                    "organeRef": "PO78718",
                    "dateActe": "2016-10-27T00:00:00.000+02:00",
                    "actesLegislatifs": null,
                    "reunionRef": "RUSNR5L14S2017IDS20374",
                    "odjRef": "RUSNR5L14S2017IDS20374PT34335"
                  },
                  {
                    "@xsi:type": "Decision_Type",
                    "uid": "L14-VD179881DEC",
                    "codeActe": "SN1-DEBATS-DEC",
                    "libelleActe": {
                      "nomCanonique": "Décision",
                      "libelleCourt": "Décision"
                    },
                    "organeRef": "PO78718",
                    "dateActe": "2016-10-27T00:00:00.000+02:00",
                    "actesLegislatifs": null,
                    "reunionRef": "RUSNR5L14S2017IDS20374",
                    "statutConclusion": {
                      "fam_code": "TSORTF01",
                      "libelle": "adopté"
                    },
                    "voteRefs": null,
                    "textesAssocies": {
                      "texteAssocie": {
                        "typeTexte": "BTA",
                        "refTexteAssocie": "PRJLSNR5S279BTA0010"
                      }
                    }
                  }
                ]
              }
            }
          ]
        }
      },
      {
        "@xsi:type": "Etape_Type",
        "uid": "L14-AN1-35289",
        "codeActe": "AN1",
        "libelleActe": {
          "nomCanonique": "1ère lecture (2ème assemblée saisie)",
          "libelleCourt": "1ère lecture"
        },
        "organeRef": "PO644420",
        "dateActe": null,
        "actesLegislatifs": {
          "acteLegislatif": [
            {
              "@xsi:type": "DepotInitiativeNavette_Type",
              "uid": "L14-VD179903DIN",
              "codeActe": "AN1-DEPOT",
              "libelleActe": {
                "nomCanonique": "Dépôt d'une initiative en navette",
                "libelleCourt": "Dépôt d'une initiative en navette"
              },
              "organeRef": "PO644420",
              "dateActe": "2016-10-28T00:00:00.000+02:00",
              "actesLegislatifs": null,
              "texteAssocie": "PRJLANR5L14B4178",
              "provenance": "PO78718"
            },
            {
              "@xsi:type": "Etape_Type",
              "uid": "L14-AN1-COM-35289",
              "codeActe": "AN1-COM",
              "libelleActe": {
                "nomCanonique": "Travaux des commissions",
                "libelleCourt": "Travaux des commissions"
              },
              "organeRef": "PO644420",
              "dateActe": null,
              "actesLegislatifs": {
                "acteLegislatif": {
                  "@xsi:type": "Etape_Type",
                  "uid": "L14-VD179904CF",
                  "codeActe": "AN1-COM-FOND",
                  "libelleActe": {
                    "nomCanonique": "Travaux de la commission saisie au fond",
                    "libelleCourt": "Travaux de la commission saisie au fond"
                  },
                  "organeRef": "PO420120",
                  "dateActe": null,
                  "actesLegislatifs": {
                    "acteLegislatif": [
                      {
                        "@xsi:type": "SaisieComFond_Type",
                        "uid": "L14-VD179904CFS",
                        "codeActe": "AN1-COM-FOND-SAISIE",
                        "libelleActe": {
                          "nomCanonique": "Renvoi en commission au fond",
                          "libelleCourt": "Renvoi en commission au fond"
                        },
                        "organeRef": "PO420120",
                        "dateActe": "2016-10-28T00:00:00.000+02:00",
                        "actesLegislatifs": null
                      },
                      {
                        "@xsi:type": "NominRapporteurs_Type",
                        "uid": "L14-VD180003",
                        "codeActe": "AN1-COM-FOND-NOMIN",
                        "libelleActe": {
                          "nomCanonique": "Nomination de rapporteur",
                          "libelleCourt": "Nomination de rapporteur"
                        },
                        "organeRef": "PO420120",
                        "dateActe": "2016-11-08T00:00:00.000+01:00",
                        "actesLegislatifs": null,
                        "rapporteurs": {
                          "rapporteur": {
                            "acteurRef": "PA334768",
                            "typeRapporteur": "rapporteur"
                          }
                        },
                        "reunion": null
                      },
                      {
                        "@xsi:type": "DiscussionCommission_Type",
                        "uid": "L14-VD179961R24427",
                        "codeActe": "AN1-COM-FOND-REUNION",
                        "libelleActe": {
                          "nomCanonique": "Réunion de commission",
                          "libelleCourt": "Réunion de commission"
                        },
                        "organeRef": "PO420120",
                        "dateActe": "2016-11-08T14:30:00.000+01:00",
                        "actesLegislatifs": null,
                        "reunionRef": "RUANR5L14S2017IDC426502",
                        "odjRef": "RUANR5L14S2017IDC426502PT24427"
                      },
                      {
                        "@xsi:type": "DiscussionCommission_Type",
                        "uid": "L14-VD179961R24430",
                        "codeActe": "AN1-COM-FOND-REUNION",
                        "libelleActe": {
                          "nomCanonique": "Réunion de commission",
                          "libelleCourt": "Réunion de commission"
                        },
                        "organeRef": "PO420120",
                        "dateActe": "2016-11-16T09:30:00.000+01:00",
                        "actesLegislatifs": null,
                        "reunionRef": "RUANR5L14S2017IDC426503",
                        "odjRef": "RUANR5L14S2017IDC426503PT24430"
                      },
                      {
                        "@xsi:type": "DiscussionCommission_Type",
                        "uid": "L14-VD179961R24431",
                        "codeActe": "AN1-COM-FOND-REUNION",
                        "libelleActe": {
                          "nomCanonique": "Réunion de commission",
                          "libelleCourt": "Réunion de commission"
                        },
                        "organeRef": "PO420120",
                        "dateActe": "2016-11-22T14:30:00.000+01:00",
                        "actesLegislatifs": null,
                        "reunionRef": "RUANR5L14S2017IDC426504",
                        "odjRef": "RUANR5L14S2017IDC426504PT24431"
                      },
                      {
                        "@xsi:type": "DepotRapport_Type",
                        "uid": "L14-VD180111",
                        "codeActe": "AN1-COM-FOND-RAPPORT",
                        "libelleActe": {
                          "nomCanonique": "Dépôt de rapport",
                          "libelleCourt": "Dépôt de rapport"
                        },
                        "organeRef": "PO420120",
                        "dateActe": "2016-11-16T00:00:00.000+01:00",
                        "actesLegislatifs": null,
                        "texteAssocie": "RAPPANR5L14B4222",
                        "texteAdopte": "PRJLANR5L14BTC4222"
                      }
                    ]
                  }
                }
              }
            },
            {
              "@xsi:type": "Etape_Type",
              "uid": "L14-AN1-DEBATS-35289",
              "codeActe": "AN1-DEBATS",
              "libelleActe": {
                "nomCanonique": "Discussion en séance publique",
                "libelleCourt": "Discussion en séance publique"
              },
              "organeRef": "PO644420",
              "dateActe": null,
              "actesLegislatifs": {
                "acteLegislatif": [
                  {
                    "@xsi:type": "DiscussionSeancePublique_Type",
                    "uid": "L14-VD179909S34376",
                    "codeActe": "AN1-DEBATS-SEANCE",
                    "libelleActe": {
                      "nomCanonique": "Discussion en séance publique",
                      "libelleCourt": "Discussion en séance publique"
                    },
                    "organeRef": "PO644420",
                    "dateActe": "2016-11-22T00:00:00.000+01:00",
                    "actesLegislatifs": null,
                    "reunionRef": "RUANR5L14S2017IDS20394",
                    "odjRef": "RUANR5L14S2017IDS20394PT34376"
                  },
                  {
                    "@xsi:type": "Decision_Type",
                    "uid": "L14-VD180176DEC",
                    "codeActe": "AN1-DEBATS-DEC",
                    "libelleActe": {
                      "nomCanonique": "Décision",
                      "libelleCourt": "Décision"
                    },
                    "organeRef": "PO644420",
                    "dateActe": "2016-11-22T00:00:00.000+01:00",
                    "actesLegislatifs": null,
                    "reunionRef": "RUANR5L14S2017IDS20394",
                    "statutConclusion": {
                      "fam_code": "TSORTF05",
                      "libelle": "modifié"
                    },
                    "voteRefs": null,
                    "textesAssocies": {
                      "texteAssocie": {
                        "typeTexte": "BTA",
                        "refTexteAssocie": "PRJLANR5L14BTA0834"
                      }
                    }
                  }
                ]
              }
            }
          ]
        }
      },
      {
        "@xsi:type": "Etape_Type",
        "uid": "L14-CMP-35289",
        "codeActe": "CMP",
        "libelleActe": {
          "nomCanonique": "Commission Mixte Paritaire",
          "libelleCourt": "Commission Mixte Paritaire"
        },
        "organeRef": "PO715554",
        "dateActe": null,
        "actesLegislatifs": {
          "acteLegislatif": [
            {
              "@xsi:type": "DepotInitiativeNavette_Type",
              "uid": "L14-VD180210DIN",
              "codeActe": "CMP-DEPOT",
              "libelleActe": {
                "nomCanonique": "Dépôt d'un projet de loi",
                "libelleCourt": "Dépôt d'un projet de loi"
              },
              "organeRef": "PO715554",
              "dateActe": "2016-11-23T00:00:00.000+01:00",
              "actesLegislatifs": null,
              "texteAssocie": "PRJLSNR5S279B0134",
              "provenance": "PO644420"
            },
            {
              "@xsi:type": "RenvoiCMP_Type",
              "uid": "L14-VD180212CMPS",
              "codeActe": "CMP-SAISIE",
              "libelleActe": {
                "nomCanonique": "Convocation d'une CMP",
                "libelleCourt": "Convocation d'une CMP"
              },
              "organeRef": "PO715554",
              "dateActe": "2016-11-23T00:00:00.000+01:00",
              "actesLegislatifs": null,
              "initiateur": {
                "acteurs": {
                  "acteur": {
                    "acteurRef": "PA267622",
                    "mandatRef": "PM702957"
                  }
                }
              }
            },
            {
              "@xsi:type": "Etape_Type",
              "uid": "L14-VD180212COM",
              "codeActe": "CMP-COM",
              "libelleActe": {
                "nomCanonique": "Commission Mixte Paritaire",
                "libelleCourt": "Commission Mixte Paritaire"
              },
              "organeRef": "PO715554",
              "dateActe": null,
              "actesLegislatifs": {
                "acteLegislatif": [
                  {
                    "@xsi:type": "NominRapporteurs_Type",
                    "uid": "L14-VD180878",
                    "codeActe": "CMP-COM-NOMIN",
                    "libelleActe": {
                      "nomCanonique": "Nomination de rapporteur",
                      "libelleCourt": "Nomination de rapporteur"
                    },
                    "organeRef": "PO715554",
                    "dateActe": "2017-01-17T00:00:00.000+01:00",
                    "actesLegislatifs": null,
                    "rapporteurs": {
                      "rapporteur": [
                        {
                          "acteurRef": "PA334768",
                          "typeRapporteur": "rapporteur"
                        },
                        {
                          "acteurRef": "PA360",
                          "typeRapporteur": "rapporteur"
                        }
                      ]
                    },
                    "reunion": null
                  },
                  {
                    "@xsi:type": "DepotRapport_Type",
                    "uid": "L14-VD180881",
                    "codeActe": "CMP-COM-RAPPORT-AN",
                    "libelleActe": {
                      "nomCanonique": "Dépôt du rapport d'une CMP",
                      "libelleCourt": "Dépôt du rapport d'une CMP"
                    },
                    "organeRef": "PO644420",
                    "dateActe": "2017-01-17T00:00:00.000+01:00",
                    "actesLegislatifs": null,
                    "texteAssocie": "RAPPANR5L14B4380",
                    "texteAdopte": null
                  },
                  {
                    "@xsi:type": "DepotRapport_Type",
                    "uid": "L14-VD180929",
                    "codeActe": "CMP-COM-RAPPORT-SN",
                    "libelleActe": {
                      "nomCanonique": "Dépôt du rapport d'une CMP",
                      "libelleCourt": "Dépôt du rapport d'une CMP"
                    },
                    "organeRef": "PO78718",
                    "dateActe": "2017-01-17T00:00:00.000+01:00",
                    "actesLegislatifs": null,
                    "texteAssocie": "RAPPSNR5S279B0304",
                    "texteAdopte": null
                  }
                ]
              }
            },
            {
              "@xsi:type": "Etape_Type",
              "uid": "L14-CMP-DEBATS-AN-35289",
              "codeActe": "CMP-DEBATS-AN",
              "libelleActe": {
                "nomCanonique": "Discussion en séance publique",
                "libelleCourt": "Discussion en séance publique"
              },
              "organeRef": "PO644420",
              "dateActe": null,
              "actesLegislatifs": {
                "acteLegislatif": [
                  {
                    "@xsi:type": "DiscussionSeancePublique_Type",
                    "uid": "L14-VD180962S34633",
                    "codeActe": "CMP-DEBATS-AN-SEANCE",
                    "libelleActe": {
                      "nomCanonique": "Discussion en séance publique",
                      "libelleCourt": "Discussion en séance publique"
                    },
                    "organeRef": "PO644420",
                    "dateActe": "2017-01-26T00:00:00.000+01:00",
                    "actesLegislatifs": null,
                    "reunionRef": "RUANR5L14S2017IDS20496",
                    "odjRef": "RUANR5L14S2017IDS20496PT34633"
                  },
                  {
                    "@xsi:type": "DiscussionSeancePublique_Type",
                    "uid": "L14-VD180962S34639",
                    "codeActe": "CMP-DEBATS-AN-SEANCE",
                    "libelleActe": {
                      "nomCanonique": "Discussion en séance publique",
                      "libelleCourt": "Discussion en séance publique"
                    },
                    "organeRef": "PO644420",
                    "dateActe": "2017-01-26T00:00:00.000+01:00",
                    "actesLegislatifs": null,
                    "reunionRef": "RUANR5L14S2017IDS20497",
                    "odjRef": "RUANR5L14S2017IDS20497PT34639"
                  },
                  {
                    "@xsi:type": "Decision_Type",
                    "uid": "L14-VD181016DEC",
                    "codeActe": "CMP-DEBATS-AN-DEC",
                    "libelleActe": {
                      "nomCanonique": "Décision",
                      "libelleCourt": "Décision"
                    },
                    "organeRef": "PO644420",
                    "dateActe": "2017-01-26T00:00:00.000+01:00",
                    "actesLegislatifs": null,
                    "reunionRef": "RUANR5L14S2017IDS20497",
                    "statutConclusion": {
                      "fam_code": "TSORTF18",
                      "libelle": "adopté, dans les conditions prévues à l'article 45, alinéa 3, de la Constitution"
                    },
                    "voteRefs": null,
                    "textesAssocies": {
                      "texteAssocie": {
                        "typeTexte": "BTA",
                        "refTexteAssocie": "PRJLANR5L14BTA0894"
                      }
                    }
                  }
                ]
              }
            },
            {
              "@xsi:type": "Etape_Type",
              "uid": "L14-CMP-DEBATS-SN-35289",
              "codeActe": "CMP-DEBATS-SN",
              "libelleActe": {
                "nomCanonique": "Discussion en séance publique",
                "libelleCourt": "Discussion en séance publique"
              },
              "organeRef": "PO78718",
              "dateActe": null,
              "actesLegislatifs": {
                "acteLegislatif": [
                  {
                    "@xsi:type": "DiscussionSeancePublique_Type",
                    "uid": "L14-VD181073S34834",
                    "codeActe": "CMP-DEBATS-SN-SEANCE",
                    "libelleActe": {
                      "nomCanonique": "Discussion en séance publique",
                      "libelleCourt": "Discussion en séance publique"
                    },
                    "organeRef": "PO78718",
                    "dateActe": "2017-02-14T00:00:00.000+01:00",
                    "actesLegislatifs": null,
                    "reunionRef": "RUSNR5L14S2017IDS20580",
                    "odjRef": "RUSNR5L14S2017IDS20580PT34834"
                  },
                  {
                    "@xsi:type": "Decision_Type",
                    "uid": "L14-VD181326DEC",
                    "codeActe": "CMP-DEBATS-SN-DEC",
                    "libelleActe": {
                      "nomCanonique": "Décision",
                      "libelleCourt": "Décision"
                    },
                    "organeRef": "PO78718",
                    "dateActe": "2017-02-14T00:00:00.000+01:00",
                    "actesLegislatifs": null,
                    "reunionRef": "RUSNR5L14S2017IDS20580",
                    "statutConclusion": {
                      "fam_code": "TSORTF18",
                      "libelle": "adopté, dans les conditions prévues à l'article 45, alinéa 3, de la Constitution"
                    },
                    "voteRefs": null,
                    "textesAssocies": {
                      "texteAssocie": {
                        "typeTexte": "BTA",
                        "refTexteAssocie": "PRJLSNR5S279BTA0084"
                      }
                    }
                  }
                ]
              }
            },
            {
              "@xsi:type": "Decision_Type",
              "uid": "L14-VD180212DEC",
              "codeActe": "CMP-DEC",
              "libelleActe": {
                "nomCanonique": "Décision de la CMP",
                "libelleCourt": "Décision de la CMP"
              },
              "organeRef": "PO715554",
              "dateActe": "2017-01-18T00:00:00.000+01:00",
              "actesLegislatifs": null,
              "statutConclusion": {
                "fam_code": "TCCMP01",
                "libelle": "Accord"
              },
              "reunionRef": null,
              "voteRefs": null
            }
          ]
        }
      },
      {
        "@xsi:type": "Etape_Type",
        "uid": "L14-PROM-35289",
        "codeActe": "PROM",
        "libelleActe": {
          "nomCanonique": "Promulgation de la loi",
          "libelleCourt": "Promulgation de la loi"
        },
        "organeRef": "PO696251",
        "dateActe": null,
        "actesLegislatifs": {
          "acteLegislatif": {
            "@xsi:type": "Promulgation_Type",
            "uid": "L14-VD181567PL",
            "codeActe": "PROM-PUB",
            "libelleActe": {
              "nomCanonique": "Promulgation d'une loi",
              "libelleCourt": "Promulgation d'une loi"
            },
            "organeRef": "PO696251",
            "dateActe": "2017-02-23T00:00:00.000+01:00",
            "actesLegislatifs": null,
            "texteLoiRef": "PRJLSNR5S279BTA0084",
            "infoJO": {
              "typeJO": "JO_LOI_DECRET",
              "dateJO": "2017-02-24+01:00",
              "pageJO": null,
              "numJO": "47"
            },
            "urlLegifrance": "http://www.legifrance.gouv.fr/WAspad/UnTexteDeJorf?numjo=AFSP1622342L",
            "referenceNOR": "AFSP1622342L",
            "codeLoi": "2017-220",
            "titreLoi": "ratifiant l'ordonnance n° 2016-966 du 15 juillet 2016 portant simplification de procédures mises en œuvre par l'Agence nationale de sécurité du médicament et des produits de santé et comportant diverses dispositions relatives aux produits de santé"
          }
        }
      }
    ]
  },
  "fusionDossier": null
}