{
  "@xsi:type": "rapportParlementaire_Type",
  "uid": "RAPPANR5L14B3515",
  "legislature": "14",
  "cycleDeVie": {
    "chrono": {
      "dateCreation": "2016-02-18T00:00:00.000+01:00",
      "dateDepot": "2016-02-18T00:00:00.000+01:00",
      "datePublication": "2016-02-23T00:00:00.000+01:00",
      "datePublicationWeb": "2016-02-22T12:20:00.000+01:00"
    }
  },
  "denominationStructurelle": "Rapport",
  "provenance": "Commission",
  "titres": {
    "titrePrincipal": "rapport sur le projet de loi , après engagement de la procédure accélérée, renforçant la lutte contre le crime organisé, le terrorisme et leur financement, et améliorant l'efficacité et les garanties de la procédure pénale (n°3473)",
    "titrePrincipalCourt": "rapport sur le projet de loi , après engagement de la procédure accélérée, renforçant la lutte contre le crime organisé, le terrorisme et leur financement, et améliorant l'efficacité et les garanties de la procédure pénale (n°3473)"
  },
  "divisions": null,
  "dossierRef": "DLR5L14N34682",
  "redacteur": null,
  "classification": {
    "famille": {
      "depot": {
        "code": "RAPINIT",
        "libelle": "Rapport sur une initiative"
      },
      "classe": {
        "code": "RAPPORT",
        "libelle": "Rapport"
      }
    },
    "type": {
      "code": "RAPP",
      "libelle": "Rapport"
    },
    "sousType": null,
    "statutAdoption": "ADOPTCOM"
  },
  "auteurs": {
    "auteur": [
      {
        "acteur": {
          "acteurRef": "PA610354",
          "qualite": "rapporteur"
        }
      },
      {
        "acteur": {
          "acteurRef": "PA608264",
          "qualite": "rapporteur"
        }
      },
      {
        "organe": {
          "organeRef": "PO59051"
        }
      }
    ]
  },
  "correction": null,
  "notice": {
    "numNotice": "3515",
    "formule": "sur le projet de loi , après engagement de la procédure accélérée, renforçant la lutte contre le crime organisé, le terrorisme et leur financement, et améliorant l'efficacité et les garanties de la procédure pénale (n°3473)",
    "adoptionConforme": "false"
  },
  "indexation": null,
  "imprimerie": {
    "prix": "10.5"
  }
}