{
  "@xsi:type": "DossierMissionInformation_Type",
  "uid": "DLR5L14N34033",
  "legislature": "14",
  "titreDossier": {
    "titre": "Ouverture d'un dialogue culturel et politique avec l'Amérique latine",
    "titreChemin": "dialogue_culturel_politique_amerique_latine",
    "senatChemin": null
  },
  "procedureParlementaire": {
    "code": "10",
    "libelle": "Mission d'information"
  },
  "initiateur": {
    "organes": {
      "organe": {
        "organeRef": {
          "uid": "PO708484"
        }
      }
    }
  },
  "actesLegislatifs": {
    "acteLegislatif": {
      "@xsi:type": "Etape_Type",
      "uid": "L14-AN20-34033",
      "codeActe": "AN20",
      "libelleActe": {
        "nomCanonique": "Travaux"
      },
      "organeRef": "PO644420",
      "dateActe": null,
      "actesLegislatifs": {
        "acteLegislatif": {
          "@xsi:type": "Etape_Type",
          "uid": "L14-AN20-MISINF-34033",
          "codeActe": "AN20-MISINF",
          "libelleActe": {
            "nomCanonique": "Mission d'information",
            "libelleCourt": "Mission d'information"
          },
          "organeRef": "PO708484",
          "dateActe": null,
          "actesLegislatifs": {
            "acteLegislatif": {
              "@xsi:type": "CreationOrganeTemporaire_Type",
              "uid": "L14-VD174071",
              "codeActe": "AN20-MISINF-CREA",
              "libelleActe": {
                "nomCanonique": "Création d'une mission d'information",
                "libelleCourt": "Création d'une mission d'information"
              },
              "organeRef": "PO708484",
              "dateActe": "2015-06-13T00:00:00.000+02:00",
              "actesLegislatifs": null,
              "initiateurs": {
                "organeRef": "PO708484"
              }
            }
          }
        }
      }
    }
  },
  "fusionDossier": null
}