{
  "@xsi:type": "texteLoi_Type",
  "uid": "PRJLSNR5S279B0534",
  "legislature": null,
  "cycleDeVie": {
    "chrono": {
      "dateCreation": "2017-05-03T00:00:00.000+02:00",
      "dateDepot": "2017-04-27T00:00:00.000+02:00",
      "datePublication": null,
      "datePublicationWeb": null
    }
  },
  "denominationStructurelle": "Projet de loi",
  "provenance": "Texte Déposé",
  "titres": {
    "titrePrincipal": "projet de loi ratifiant l’ordonnance n° 2014-691 du 26 juin 2014 portant suppression des compétences contentieuses et disciplinaires du Conseil supérieur de l’éducation et des conseils académiques de l’éducation nationale",
    "titrePrincipalCourt": "Conseil supérieur de l'éducation"
  },
  "divisions": null,
  "dossierRef": "DLR5L14N35789",
  "redacteur": null,
  "classification": {
    "famille": {
      "depot": {
        "code": "INITDEP",
        "libelle": "Initiative en 1er Dépôt"
      },
      "classe": {
        "code": "PRJLOI",
        "libelle": "Projet de loi"
      }
    },
    "type": {
      "code": "PRJL",
      "libelle": "Projet de loi"
    },
    "sousType": null,
    "statutAdoption": null
  },
  "auteurs": {
    "auteur": {
      "acteur": {
        "acteurRef": "PA785",
        "qualite": "auteur"
      }
    }
  },
  "correction": null,
  "notice": {
    "numNotice": "534",
    "formule": "ratifiant l’ordonnance n° 2014-691 du 26 juin 2014 portant suppression des compétences contentieuses et disciplinaires du Conseil supérieur de l’éducation et des conseils académiques de l’éducation nationale",
    "adoptionConforme": "false"
  },
  "indexation": null,
  "imprimerie": null,
  "coSignataires": {
    "coSignataire": {
      "acteur": {
        "acteurRef": "PA588883"
      },
      "dateCosignature": "2017-04-27+02:00",
      "dateRetraitCosignature": null,
      "edite": "true"
    }
  },
  "depotAmendements": {
    "amendementsSeance": {
      "amendable": "false",
      "dateLimiteDepot": null
    }
  }
}