{
  "@xsi:type": "DossierResolutionAN",
  "uid": "DLR5L14N35306",
  "legislature": "14",
  "titreDossier": {
    "titre": "Les conséquences de la fin des quotas sur la filière laitière française et européenne",
    "titreChemin": "consequences_fin_quotas_filiere_laitiere",
    "senatChemin": null
  },
  "procedureParlementaire": {
    "code": "8",
    "libelle": "Résolution"
  },
  "initiateur": {
    "acteurs": {
      "acteur": {
        "acteurRef": "PA607155",
        "mandatRef": "PM645200"
      }
    }
  },
  "actesLegislatifs": {
    "acteLegislatif": {
      "@xsi:type": "Etape_Type",
      "uid": "L14-ANLUNI-35306",
      "codeActe": "ANLUNI",
      "libelleActe": {
        "nomCanonique": "Lecture unique"
      },
      "organeRef": "PO644420",
      "dateActe": null,
      "actesLegislatifs": {
        "acteLegislatif": [
          {
            "@xsi:type": "DepotInitiative_Type",
            "uid": "L14-VD179670DI",
            "codeActe": "ANLUNI-DEPOT",
            "libelleActe": {
              "nomCanonique": "1er dépôt d'une initiative.",
              "libelleCourt": "1er dépôt d'une initiative."
            },
            "organeRef": "PO644420",
            "dateActe": "2016-10-12T00:00:00.000+02:00",
            "actesLegislatifs": null,
            "texteAssocie": "PNREANR5L14B4124"
          },
          {
            "@xsi:type": "Etape_Type",
            "uid": "L14-ANLUNI-COM-35306",
            "codeActe": "ANLUNI-COM",
            "libelleActe": {
              "nomCanonique": "Travaux des commissions",
              "libelleCourt": "Travaux des commissions"
            },
            "organeRef": "PO644420",
            "dateActe": null,
            "actesLegislatifs": {
              "acteLegislatif": {
                "@xsi:type": "Etape_Type",
                "uid": "L14-VD179671CF",
                "codeActe": "ANLUNI-COM-FOND",
                "libelleActe": {
                  "nomCanonique": "Travaux de la commission saisie au fond",
                  "libelleCourt": "Travaux de la commission saisie au fond"
                },
                "organeRef": "PO419610",
                "dateActe": null,
                "actesLegislatifs": {
                  "acteLegislatif": [
                    {
                      "@xsi:type": "SaisieComFond_Type",
                      "uid": "L14-VD179671CFS",
                      "codeActe": "ANLUNI-COM-FOND-SAISIE",
                      "libelleActe": {
                        "nomCanonique": "Renvoi en commission au fond",
                        "libelleCourt": "Renvoi en commission au fond"
                      },
                      "organeRef": "PO419610",
                      "dateActe": "2016-10-12T00:00:00.000+02:00",
                      "actesLegislatifs": null
                    },
                    {
                      "@xsi:type": "NominRapporteurs_Type",
                      "uid": "L14-VD179737",
                      "codeActe": "ANLUNI-COM-FOND-NOMIN",
                      "libelleActe": {
                        "nomCanonique": "Nomination de rapporteur",
                        "libelleCourt": "Nomination de rapporteur"
                      },
                      "organeRef": "PO419610",
                      "dateActe": "2016-10-19T00:00:00.000+02:00",
                      "actesLegislatifs": null,
                      "rapporteurs": {
                        "rapporteur": {
                          "acteurRef": "PA607595",
                          "typeRapporteur": "rapporteur"
                        }
                      },
                      "reunion": null
                    },
                    {
                      "@xsi:type": "DiscussionCommission_Type",
                      "uid": "L14-VD179772R24349",
                      "codeActe": "ANLUNI-COM-FOND-REUNION",
                      "libelleActe": {
                        "nomCanonique": "Réunion de commission",
                        "libelleCourt": "Réunion de commission"
                      },
                      "organeRef": "PO419610",
                      "dateActe": "2016-11-02T10:30:00.000+01:00",
                      "actesLegislatifs": null,
                      "reunionRef": "RUANR5L14S2017IDC426375",
                      "odjRef": "RUANR5L14S2017IDC426375PT24349"
                    },
                    {
                      "@xsi:type": "DepotRapport_Type",
                      "uid": "L14-VD179921",
                      "codeActe": "ANLUNI-COM-FOND-RAPPORT",
                      "libelleActe": {
                        "nomCanonique": "Dépôt de rapport",
                        "libelleCourt": "Dépôt de rapport"
                      },
                      "organeRef": "PO419610",
                      "dateActe": "2016-11-02T00:00:00.000+01:00",
                      "actesLegislatifs": null,
                      "texteAssocie": "RAPPANR5L14B4180",
                      "texteAdopte": "PNREANR5L14BTC4180"
                    }
                  ]
                }
              }
            }
          },
          {
            "@xsi:type": "Etape_Type",
            "uid": "L14-ANLUNI-DEBATS-35306",
            "codeActe": "ANLUNI-DEBATS",
            "libelleActe": {
              "nomCanonique": "Discussion en séance publique",
              "libelleCourt": "Discussion en séance publique"
            },
            "organeRef": "PO644420",
            "dateActe": null,
            "actesLegislatifs": {
              "acteLegislatif": {
                "@xsi:type": "Decision_Type",
                "uid": "L14-VD180164DEC",
                "codeActe": "ANLUNI-DEBATS-DEC",
                "libelleActe": {
                  "nomCanonique": "Décision",
                  "libelleCourt": "Décision"
                },
                "organeRef": "PO644420",
                "dateActe": "2016-11-19T00:00:00.000+01:00",
                "actesLegislatifs": null,
                "statutConclusion": {
                  "fam_code": "TSORTF19",
                  "libelle": "considérée comme définitive en application de l'article 151-7 du Règlement"
                },
                "reunionRef": null,
                "voteRefs": null,
                "textesAssocies": {
                  "texteAssocie": {
                    "typeTexte": "BTA",
                    "refTexteAssocie": "RIONANR5L14BTA0832"
                  }
                }
              }
            }
          }
        ]
      }
    }
  },
  "fusionDossier": null
}