{
  "@xsi:type": "DossierLegislatif_Type",
  "uid": "DLR5L14N29403",
  "legislature": "14",
  "titreDossier": {
    "titre": "Société : égalité des droits et intégration des personnes handicapées",
    "titreChemin": "egalite_droits_integration_handicapes",
    "senatChemin": null
  },
  "procedureParlementaire": {
    "code": "2",
    "libelle": "Proposition de loi ordinaire"
  },
  "initiateur": {
    "acteurs": {
      "acteur": {
        "acteurRef": "PA605036",
        "mandatRef": "PM645278"
      }
    }
  },
  "actesLegislatifs": {
    "acteLegislatif": {
      "@xsi:type": "Etape_Type",
      "uid": "L14-AN1-29403",
      "codeActe": "AN1",
      "libelleActe": {
        "nomCanonique": "1ère lecture (1ère assemblée saisie)",
        "libelleCourt": "1ère lecture"
      },
      "organeRef": "PO644420",
      "dateActe": null,
      "actesLegislatifs": {
        "acteLegislatif": [
          {
            "@xsi:type": "DepotInitiative_Type",
            "uid": "L14-VD160883DI",
            "codeActe": "AN1-DEPOT",
            "libelleActe": {
              "nomCanonique": "1er dépôt d'une initiative.",
              "libelleCourt": "1er dépôt d'une initiative."
            },
            "organeRef": "PO644420",
            "dateActe": "2012-12-12T00:00:00.000+01:00",
            "actesLegislatifs": null,
            "texteAssocie": "PIONANR5L14B0516"
          },
          {
            "@xsi:type": "Etape_Type",
            "uid": "L14-AN1-COM-29403",
            "codeActe": "AN1-COM",
            "libelleActe": {
              "nomCanonique": "Travaux des commissions",
              "libelleCourt": "Travaux des commissions"
            },
            "organeRef": "PO644420",
            "dateActe": null,
            "actesLegislatifs": {
              "acteLegislatif": {
                "@xsi:type": "Etape_Type",
                "uid": "L14-VD160884CF",
                "codeActe": "AN1-COM-FOND",
                "libelleActe": {
                  "nomCanonique": "Travaux de la commission saisie au fond",
                  "libelleCourt": "Travaux de la commission saisie au fond"
                },
                "organeRef": "PO420120",
                "dateActe": null,
                "actesLegislatifs": {
                  "acteLegislatif": [
                    {
                      "@xsi:type": "SaisieComFond_Type",
                      "uid": "L14-VD160884CFS",
                      "codeActe": "AN1-COM-FOND-SAISIE",
                      "libelleActe": {
                        "nomCanonique": "Renvoi en commission au fond",
                        "libelleCourt": "Renvoi en commission au fond"
                      },
                      "organeRef": "PO420120",
                      "dateActe": "2012-12-12T00:00:00.000+01:00",
                      "actesLegislatifs": null
                    },
                    {
                      "@xsi:type": "NominRapporteurs_Type",
                      "uid": "L14-VD163160",
                      "codeActe": "AN1-COM-FOND-NOMIN",
                      "libelleActe": {
                        "nomCanonique": "Nomination de rapporteur",
                        "libelleCourt": "Nomination de rapporteur"
                      },
                      "organeRef": "PO420120",
                      "dateActe": "2013-04-17T00:00:00.000+02:00",
                      "actesLegislatifs": null,
                      "rapporteurs": {
                        "rapporteur": {
                          "acteurRef": "PA605036",
                          "typeRapporteur": "rapporteur"
                        }
                      },
                      "reunion": null
                    },
                    {
                      "@xsi:type": "DiscussionCommission_Type",
                      "uid": "L14-VD162952R17384",
                      "codeActe": "AN1-COM-FOND-REUNION",
                      "libelleActe": {
                        "nomCanonique": "Réunion de commission",
                        "libelleCourt": "Réunion de commission"
                      },
                      "organeRef": "PO420120",
                      "dateActe": "2013-04-17T11:15:00.000+02:00",
                      "actesLegislatifs": null,
                      "reunionRef": "RUANR5L14S2013IDC416800",
                      "odjRef": "RUANR5L14S2013IDC416800PT17384"
                    },
                    {
                      "@xsi:type": "DiscussionCommission_Type",
                      "uid": "L14-VD162952R17389",
                      "codeActe": "AN1-COM-FOND-REUNION",
                      "libelleActe": {
                        "nomCanonique": "Réunion de commission",
                        "libelleCourt": "Réunion de commission"
                      },
                      "organeRef": "PO420120",
                      "dateActe": "2013-04-17T16:45:00.000+02:00",
                      "actesLegislatifs": null,
                      "reunionRef": "RUANR5L14S2013IDC416882",
                      "odjRef": "RUANR5L14S2013IDC416882PT17389"
                    },
                    {
                      "@xsi:type": "DiscussionCommission_Type",
                      "uid": "L14-VD162952R17414",
                      "codeActe": "AN1-COM-FOND-REUNION",
                      "libelleActe": {
                        "nomCanonique": "Réunion de commission",
                        "libelleCourt": "Réunion de commission"
                      },
                      "organeRef": "PO420120",
                      "dateActe": "2013-04-25T09:30:00.000+02:00",
                      "actesLegislatifs": null,
                      "reunionRef": "RUANR5L14S2013IDC417031",
                      "odjRef": "RUANR5L14S2013IDC417031PT17414"
                    },
                    {
                      "@xsi:type": "DepotRapport_Type",
                      "uid": "L14-VD163193",
                      "codeActe": "AN1-COM-FOND-RAPPORT",
                      "libelleActe": {
                        "nomCanonique": "Dépôt de rapport",
                        "libelleCourt": "Dépôt de rapport"
                      },
                      "organeRef": "PO420120",
                      "dateActe": "2013-04-18T00:00:00.000+02:00",
                      "actesLegislatifs": null,
                      "texteAssocie": "RAPPANR5L14B0972",
                      "texteAdopte": null
                    }
                  ]
                }
              }
            }
          },
          {
            "@xsi:type": "Etape_Type",
            "uid": "L14-AN1-DEBATS-29403",
            "codeActe": "AN1-DEBATS",
            "libelleActe": {
              "nomCanonique": "Discussion en séance publique",
              "libelleCourt": "Discussion en séance publique"
            },
            "organeRef": "PO644420",
            "dateActe": null,
            "actesLegislatifs": {
              "acteLegislatif": [
                {
                  "@xsi:type": "DiscussionSeancePublique_Type",
                  "uid": "L14-VD162772S27847",
                  "codeActe": "AN1-DEBATS-SEANCE",
                  "libelleActe": {
                    "nomCanonique": "Discussion en séance publique",
                    "libelleCourt": "Discussion en séance publique"
                  },
                  "organeRef": "PO644420",
                  "dateActe": "2013-04-25T00:00:00.000+02:00",
                  "actesLegislatifs": null,
                  "reunionRef": "RUANR5L14S2013IDS17094",
                  "odjRef": "RUANR5L14S2013IDS17094PT27847"
                },
                {
                  "@xsi:type": "DiscussionSeancePublique_Type",
                  "uid": "L14-VD162772S27852",
                  "codeActe": "AN1-DEBATS-SEANCE",
                  "libelleActe": {
                    "nomCanonique": "Discussion en séance publique",
                    "libelleCourt": "Discussion en séance publique"
                  },
                  "organeRef": "PO644420",
                  "dateActe": "2013-04-25T00:00:00.000+02:00",
                  "actesLegislatifs": null,
                  "reunionRef": "RUANR5L14S2013IDS17095",
                  "odjRef": "RUANR5L14S2013IDS17095PT27852"
                },
                {
                  "@xsi:type": "Decision_Type",
                  "uid": "L14-VD163376DEC",
                  "codeActe": "AN1-DEBATS-DEC",
                  "libelleActe": {
                    "nomCanonique": "Décision",
                    "libelleCourt": "Décision"
                  },
                  "organeRef": "PO644420",
                  "dateActe": "2013-04-25T00:00:00.000+02:00",
                  "actesLegislatifs": null,
                  "reunionRef": "RUANR5L14S2013IDS17095",
                  "statutConclusion": {
                    "fam_code": "TSORTF07",
                    "libelle": "rejetée"
                  },
                  "voteRefs": null,
                  "textesAssocies": {
                    "texteAssocie": {
                      "typeTexte": "BTA",
                      "refTexteAssocie": "PIONANR5L14BTA0127"
                    }
                  }
                }
              ]
            }
          }
        ]
      }
    }
  },
  "fusionDossier": null,
  "indexation": {
    "themes": {
      "@niveau": "1",
      "theme": {
        "libelleTheme": "DOM-TOM"
      }
    }
  }
}