{
  "@xsi:type": "texteLoi_Type",
  "uid": "PNREANR5L14B0239",
  "legislature": "14",
  "cycleDeVie": {
    "chrono": {
      "dateCreation": "2012-10-02T00:00:00.000+02:00",
      "dateDepot": "2012-10-02T00:00:00.000+02:00",
      "datePublication": null,
      "datePublicationWeb": "2012-10-09T10:45:00.000+02:00"
    }
  },
  "denominationStructurelle": "Proposition de résolution",
  "provenance": "Texte Déposé",
  "titres": {
    "titrePrincipal": "proposition de résolution tendant à la création d'une commission d'enquête sur les circonstances entourant l'attentat du 8 mai 2002 à Karachi et chargée de proposer des pistes d'amélioration de l'information et de la consultation de la Représentation nationale sur les différents contrats d'armement impliquant la France",
    "titrePrincipalCourt": "commission d'enquête sur les circonstances entourant l'attentat du 8 mai 2002 à Karachi et chargée de proposer des pistes d'amélioration de l'information et de la consultation de la Représentation nationale sur les différents contrats d'armement impl"
  },
  "divisions": null,
  "dossierRef": "DLR5L14N29133",
  "redacteur": null,
  "classification": {
    "famille": {
      "depot": {
        "code": "INITDEP",
        "libelle": "Initiative en 1er Dépôt"
      },
      "classe": {
        "code": "PIONRES",
        "libelle": "Proposition de résolution"
      },
      "espece": {
        "code": "COMENQ",
        "libelle": "tendant à la création d'une commission d'enquête"
      }
    },
    "type": {
      "code": "PNRE",
      "libelle": "Proposition de résolution"
    },
    "sousType": {
      "code": "COMENQ",
      "libelle": "tendant à la création d'une commission d'enquête"
    },
    "statutAdoption": null
  },
  "auteurs": {
    "auteur": {
      "acteur": {
        "acteurRef": "PA267492",
        "qualite": "auteur"
      }
    }
  },
  "correction": null,
  "notice": {
    "numNotice": "239",
    "formule": "tendant à la création d'une commission d'enquête sur les circonstances entourant l'attentat du 8 mai 2002 à Karachi et chargée de proposer des pistes d'amélioration de l'information et de la consultation de la Représentation nationale sur les différents contrats d'armement impliquant la France",
    "adoptionConforme": "false"
  },
  "indexation": {
    "themes": {
      "@niveau": "1",
      "theme": {
        "libelleTheme": "POLITIQUE ECONOMIQUE ET SOCIALE"
      }
    }
  },
  "imprimerie": null,
  "coSignataires": {
    "coSignataire": [
      {
        "acteur": {
          "acteurRef": "PA295"
        },
        "dateCosignature": "2012-10-02+02:00",
        "dateRetraitCosignature": null,
        "edite": "false"
      },
      {
        "acteur": {
          "acteurRef": "PA689"
        },
        "dateCosignature": "2012-10-02+02:00",
        "dateRetraitCosignature": null,
        "edite": "false"
      },
      {
        "acteur": {
          "acteurRef": "PA754"
        },
        "dateCosignature": "2012-10-02+02:00",
        "dateRetraitCosignature": null,
        "edite": "false"
      },
      {
        "acteur": {
          "acteurRef": "PA340755"
        },
        "dateCosignature": "2012-10-02+02:00",
        "dateRetraitCosignature": null,
        "edite": "false"
      },
      {
        "acteur": {
          "acteurRef": "PA267306"
        },
        "dateCosignature": "2012-10-02+02:00",
        "dateRetraitCosignature": null,
        "edite": "false"
      },
      {
        "acteur": {
          "acteurRef": "PA1141"
        },
        "dateCosignature": "2012-10-02+02:00",
        "dateRetraitCosignature": null,
        "edite": "false"
      },
      {
        "acteur": {
          "acteurRef": "PA1364"
        },
        "dateCosignature": "2012-10-02+02:00",
        "dateRetraitCosignature": null,
        "edite": "false"
      },
      {
        "acteur": {
          "acteurRef": "PA605745"
        },
        "dateCosignature": "2012-10-02+02:00",
        "dateRetraitCosignature": null,
        "edite": "false"
      }
    ]
  },
  "depotAmendements": null
}