{
  "@xsi:type": "texteLoi_Type",
  "uid": "PRJLANR5L14B0630",
  "legislature": "14",
  "cycleDeVie": {
    "chrono": {
      "dateCreation": "2013-01-21T00:00:00.000+01:00",
      "dateDepot": "2013-01-21T00:00:00.000+01:00",
      "datePublication": "2013-02-26T00:00:00.000+01:00",
      "datePublicationWeb": "2013-01-22T17:30:00.000+01:00"
    }
  },
  "denominationStructurelle": "Projet de loi",
  "provenance": "Texte Déposé",
  "titres": {
    "titrePrincipal": "projet de loi organique relatif à l'élection des conseillers municipaux, des délégués communautaires et des conseillers départementaux",
    "titrePrincipalCourt": "Election des conseillers municipaux, des délégués communautaires et des conseillers départementaux"
  },
  "divisions": null,
  "dossierRef": "DLR5L14N29394",
  "redacteur": null,
  "classification": {
    "famille": {
      "depot": {
        "code": "INITNAV",
        "libelle": "Initiative en Navette"
      },
      "classe": {
        "code": "PRJLOI",
        "libelle": "Projet de loi"
      },
      "espece": {
        "code": "ORG",
        "libelle": "organique"
      }
    },
    "type": {
      "code": "PRJL",
      "libelle": "Projet de loi"
    },
    "sousType": {
      "code": "ORG",
      "libelle": "organique",
      "libelleEdition": "organique"
    },
    "statutAdoption": null
  },
  "auteurs": {
    "auteur": {
      "organe": {
        "organeRef": "PO644420"
      }
    }
  },
  "correction": null,
  "notice": {
    "numNotice": "630",
    "formule": ", adopté par le Sénat, relatif à l'élection des conseillers municipaux, des délégués communautaires et des conseillers départementaux",
    "adoptionConforme": "false"
  },
  "indexation": null,
  "imprimerie": null,
  "coSignataires": null,
  "depotAmendements": {
    "amendementsSeance": {
      "amendable": "false",
      "dateLimiteDepot": null
    },
    "amendementsCommission": {
      "commission": {
        "organeRef": "PO59051",
        "amendable": "true",
        "dateLimiteDepot": null
      }
    }
  }
}