{
  "@xsi:type": "documentEtudeImpact_Type",
  "uid": "ETDISNR5S239B0242",
  "legislature": null,
  "cycleDeVie": {
    "chrono": {
      "dateCreation": "2015-01-26T00:00:00.000+01:00",
      "dateDepot": "2015-01-21T00:00:00.000+01:00",
      "datePublication": "2016-11-09T00:00:00.000+01:00",
      "datePublicationWeb": null
    }
  },
  "denominationStructurelle": "Projet de loi",
  "provenance": "Texte Déposé",
  "titres": {
    "titrePrincipal": "Etude d'impact sur le projet de loi autorisant l’approbation de l’accord relatif aux services de transport aérien entre le Gouvernement de la République française et le Gouvernement de la République démocratique du Congo",
    "titrePrincipalCourt": "Accord avec le Congo sur les services de transport aérien"
  },
  "divisions": null,
  "dossierRef": "DLR5L14N33718",
  "redacteur": null,
  "classification": {
    "famille": {
      "depot": {
        "code": "INITDEP",
        "libelle": "Initiative en 1er Dépôt"
      },
      "classe": {
        "code": "PRJLOI",
        "libelle": "Projet de loi"
      },
      "espece": {
        "code": "AUTRATCONV",
        "libelle": "autorisant la ratification d'une convention"
      }
    },
    "type": {
      "code": "ETDI",
      "libelle": "Etude d'impact"
    },
    "sousType": {
      "code": "AUTRATCONV",
      "libelle": "autorisant la ratification d'une convention",
      "libelleEdition": "autorisant la ratification d'une convention"
    },
    "statutAdoption": null
  },
  "auteurs": {
    "auteur": {
      "acteur": {
        "acteurRef": "PA267622",
        "qualite": "auteur"
      }
    }
  },
  "correction": null,
  "notice": {
    "numNotice": "242",
    "formule": "autorisant l’approbation de l’accord relatif aux services de transport aérien entre le Gouvernement de la République française et le Gouvernement de la République démocratique du Congo",
    "adoptionConforme": "false"
  },
  "indexation": null,
  "imprimerie": null
}