{
  "@xsi:type": "texteLoi_Type",
  "uid": "PIONANR5L14B1137",
  "legislature": "14",
  "cycleDeVie": {
    "chrono": {
      "dateCreation": "2012-12-18T00:00:00.000+01:00",
      "dateDepot": "2013-06-13T00:00:00.000+02:00",
      "datePublication": null,
      "datePublicationWeb": "2013-06-13T16:30:00.000+02:00"
    }
  },
  "denominationStructurelle": "Proposition de loi",
  "provenance": "Texte Déposé",
  "titres": {
    "titrePrincipal": "proposition de loi tendant à partager les droits à la retraite entre ex-conjoints divorcés en faveur du parent au foyer",
    "titrePrincipalCourt": "Partage des droits à la retraite entre ex-conjoints en faveur du parent au foyer"
  },
  "divisions": null,
  "dossierRef": "DLR5L14N29520",
  "redacteur": null,
  "classification": {
    "famille": {
      "depot": {
        "code": "INITDEP",
        "libelle": "Initiative en 1er Dépôt"
      },
      "classe": {
        "code": "PIONLOI",
        "libelle": "Proposition de loi"
      }
    },
    "type": {
      "code": "PION",
      "libelle": "Proposition de loi"
    },
    "sousType": null,
    "statutAdoption": null
  },
  "auteurs": {
    "auteur": {
      "acteur": {
        "acteurRef": "PA267459",
        "qualite": "auteur"
      }
    }
  },
  "correction": null,
  "notice": {
    "numNotice": "1137",
    "formule": "tendant à partager les droits à la retraite entre ex-conjoints divorcés en faveur du parent au foyer",
    "adoptionConforme": "false"
  },
  "indexation": null,
  "imprimerie": null,
  "coSignataires": null,
  "depotAmendements": {
    "amendementsSeance": {
      "amendable": "false",
      "dateLimiteDepot": null
    },
    "amendementsCommission": {
      "commission": {
        "organeRef": "PO420120",
        "amendable": "true",
        "dateLimiteDepot": null
      }
    }
  }
}