{
  "@xsi:type": "texteLoi_Type",
  "uid": "PIONANR5L14B4093",
  "legislature": "14",
  "cycleDeVie": {
    "chrono": {
      "dateCreation": "2016-09-26T00:00:00.000+02:00",
      "dateDepot": "2016-10-07T00:00:00.000+02:00",
      "datePublication": "2016-10-17T00:00:00.000+02:00",
      "datePublicationWeb": "2016-10-25T15:30:00.000+02:00"
    }
  },
  "denominationStructurelle": "Proposition de loi",
  "provenance": "Texte Déposé",
  "titres": {
    "titrePrincipal": "proposition de loi visant à appliquer les peines de l'homicide volontaire aux conducteurs irrespectueux du code de la route ayant provoqué un accident mortel",
    "titrePrincipalCourt": "appliquer les peines de l'homicide volontaire aux conducteurs irrespectueux du code de la route ayant provoqué un accident mortel"
  },
  "divisions": null,
  "dossierRef": "DLR5L14N35251",
  "redacteur": null,
  "classification": {
    "famille": {
      "depot": {
        "code": "INITDEP",
        "libelle": "Initiative en 1er Dépôt"
      },
      "classe": {
        "code": "PIONLOI",
        "libelle": "Proposition de loi"
      }
    },
    "type": {
      "code": "PION",
      "libelle": "Proposition de loi"
    },
    "sousType": null,
    "statutAdoption": null
  },
  "auteurs": {
    "auteur": {
      "acteur": {
        "acteurRef": "PA1459",
        "qualite": "auteur"
      }
    }
  },
  "correction": {
    "typeCorrection": "Rectifié",
    "niveauCorrection": "1"
  },
  "notice": {
    "numNotice": "4093",
    "formule": "visant à appliquer les peines de l'homicide volontaire aux conducteurs irrespectueux du code de la route ayant provoqué un accident mortel",
    "adoptionConforme": "false"
  },
  "indexation": null,
  "imprimerie": null,
  "coSignataires": {
    "coSignataire": [
      {
        "acteur": {
          "acteurRef": "PA712014"
        },
        "dateCosignature": "2016-10-07+02:00",
        "dateRetraitCosignature": null,
        "edite": "false"
      },
      {
        "acteur": {
          "acteurRef": "PA2667"
        },
        "dateCosignature": "2016-10-07+02:00",
        "dateRetraitCosignature": null,
        "edite": "false"
      },
      {
        "acteur": {
          "acteurRef": "PA610820"
        },
        "dateCosignature": "2016-10-07+02:00",
        "dateRetraitCosignature": null,
        "edite": "false"
      },
      {
        "acteur": {
          "acteurRef": "PA2801"
        },
        "dateCosignature": "2016-10-07+02:00",
        "dateRetraitCosignature": null,
        "edite": "false"
      },
      {
        "acteur": {
          "acteurRef": "PA606693"
        },
        "dateCosignature": "2016-10-07+02:00",
        "dateRetraitCosignature": null,
        "edite": "false"
      },
      {
        "acteur": {
          "acteurRef": "PA2529"
        },
        "dateCosignature": "2016-10-07+02:00",
        "dateRetraitCosignature": null,
        "edite": "false"
      },
      {
        "acteur": {
          "acteurRef": "PA610924"
        },
        "dateCosignature": "2016-10-07+02:00",
        "dateRetraitCosignature": null,
        "edite": "false"
      },
      {
        "acteur": {
          "acteurRef": "PA331582"
        },
        "dateCosignature": "2016-10-07+02:00",
        "dateRetraitCosignature": null,
        "edite": "false"
      },
      {
        "acteur": {
          "acteurRef": "PA267762"
        },
        "dateCosignature": "2016-10-07+02:00",
        "dateRetraitCosignature": null,
        "edite": "false"
      },
      {
        "acteur": {
          "acteurRef": "PA1699"
        },
        "dateCosignature": "2016-10-07+02:00",
        "dateRetraitCosignature": null,
        "edite": "false"
      },
      {
        "acteur": {
          "acteurRef": "PA605036"
        },
        "dateCosignature": "2016-10-07+02:00",
        "dateRetraitCosignature": null,
        "edite": "false"
      },
      {
        "acteur": {
          "acteurRef": "PA309643"
        },
        "dateCosignature": "2016-10-07+02:00",
        "dateRetraitCosignature": null,
        "edite": "false"
      },
      {
        "acteur": {
          "acteurRef": "PA1206"
        },
        "dateCosignature": "2016-10-07+02:00",
        "dateRetraitCosignature": null,
        "edite": "false"
      },
      {
        "acteur": {
          "acteurRef": "PA2250"
        },
        "dateCosignature": "2016-10-07+02:00",
        "dateRetraitCosignature": null,
        "edite": "false"
      },
      {
        "acteur": {
          "acteurRef": "PA2377"
        },
        "dateCosignature": "2016-10-07+02:00",
        "dateRetraitCosignature": null,
        "edite": "false"
      },
      {
        "acteur": {
          "acteurRef": "PA267330"
        },
        "dateCosignature": "2016-10-07+02:00",
        "dateRetraitCosignature": null,
        "edite": "false"
      },
      {
        "acteur": {
          "acteurRef": "PA1630"
        },
        "dateCosignature": "2016-10-07+02:00",
        "dateRetraitCosignature": null,
        "edite": "false"
      },
      {
        "acteur": {
          "acteurRef": "PA998"
        },
        "dateCosignature": "2016-10-07+02:00",
        "dateRetraitCosignature": null,
        "edite": "false"
      },
      {
        "acteur": {
          "acteurRef": "PA266788"
        },
        "dateCosignature": "2016-10-07+02:00",
        "dateRetraitCosignature": null,
        "edite": "false"
      },
      {
        "acteur": {
          "acteurRef": "PA2073"
        },
        "dateCosignature": "2016-10-07+02:00",
        "dateRetraitCosignature": null,
        "edite": "false"
      },
      {
        "acteur": {
          "acteurRef": "PA1521"
        },
        "dateCosignature": "2016-10-07+02:00",
        "dateRetraitCosignature": null,
        "edite": "false"
      },
      {
        "acteur": {
          "acteurRef": "PA344776"
        },
        "dateCosignature": "2016-11-24+01:00",
        "dateRetraitCosignature": null,
        "edite": "false"
      }
    ]
  },
  "depotAmendements": {
    "amendementsSeance": {
      "amendable": "false",
      "dateLimiteDepot": null
    },
    "amendementsCommission": {
      "commission": {
        "organeRef": "PO59051",
        "amendable": "true",
        "dateLimiteDepot": null
      }
    }
  }
}