{
  "@xsi:type": "DossierResolutionAN",
  "uid": "DLR5L14N34996",
  "legislature": "14",
  "titreDossier": {
    "titre": "Plan d'action pour l'économie circulaire et propositions révisant le cadre législatif relatif aux déchets (COM(2015) 593 à 596 final) présentés par la Commission européenne le 2 décembre 2015",
    "titreChemin": "plan_economie_circulaire_dechets",
    "senatChemin": null
  },
  "procedureParlementaire": {
    "code": "8",
    "libelle": "Résolution"
  },
  "initiateur": {
    "acteurs": {
      "acteur": [
        {
          "acteurRef": "PA610905",
          "mandatRef": "PM645225"
        },
        {
          "acteurRef": "PA608380",
          "mandatRef": "PM645578"
        }
      ]
    }
  },
  "actesLegislatifs": {
    "acteLegislatif": {
      "@xsi:type": "Etape_Type",
      "uid": "L14-ANLUNI-34996",
      "codeActe": "ANLUNI",
      "libelleActe": {
        "nomCanonique": "Lecture unique"
      },
      "organeRef": "PO644420",
      "dateActe": null,
      "actesLegislatifs": {
        "acteLegislatif": [
          {
            "@xsi:type": "DepotInitiative_Type",
            "uid": "L14-VD178508DI",
            "codeActe": "ANLUNI-DEPOT",
            "libelleActe": {
              "nomCanonique": "1er dépôt d'une initiative.",
              "libelleCourt": "1er dépôt d'une initiative."
            },
            "organeRef": "PO644420",
            "dateActe": "2016-06-21T00:00:00.000+02:00",
            "actesLegislatifs": null,
            "texteAssocie": "PNREANR5L14B3858"
          },
          {
            "@xsi:type": "Etape_Type",
            "uid": "L14-ANLUNI-COM-34996",
            "codeActe": "ANLUNI-COM",
            "libelleActe": {
              "nomCanonique": "Travaux des commissions",
              "libelleCourt": "Travaux des commissions"
            },
            "organeRef": "PO644420",
            "dateActe": null,
            "actesLegislatifs": {
              "acteLegislatif": {
                "@xsi:type": "Etape_Type",
                "uid": "L14-VD178509CF",
                "codeActe": "ANLUNI-COM-FOND",
                "libelleActe": {
                  "nomCanonique": "Travaux de la commission saisie au fond",
                  "libelleCourt": "Travaux de la commission saisie au fond"
                },
                "organeRef": "PO419865",
                "dateActe": null,
                "actesLegislatifs": {
                  "acteLegislatif": {
                    "@xsi:type": "SaisieComFond_Type",
                    "uid": "L14-VD178509CFS",
                    "codeActe": "ANLUNI-COM-FOND-SAISIE",
                    "libelleActe": {
                      "nomCanonique": "Renvoi en commission au fond",
                      "libelleCourt": "Renvoi en commission au fond"
                    },
                    "organeRef": "PO419865",
                    "dateActe": "2016-06-21T00:00:00.000+02:00",
                    "actesLegislatifs": null
                  }
                }
              }
            }
          },
          {
            "@xsi:type": "Etape_Type",
            "uid": "L14-ANLUNI-DEBATS-34996",
            "codeActe": "ANLUNI-DEBATS",
            "libelleActe": {
              "nomCanonique": "Discussion en séance publique",
              "libelleCourt": "Discussion en séance publique"
            },
            "organeRef": "PO644420",
            "dateActe": null,
            "actesLegislatifs": {
              "acteLegislatif": {
                "@xsi:type": "Decision_Type",
                "uid": "L14-VD179095DEC",
                "codeActe": "ANLUNI-DEBATS-DEC",
                "libelleActe": {
                  "nomCanonique": "Décision",
                  "libelleCourt": "Décision"
                },
                "organeRef": "PO644420",
                "dateActe": "2016-08-06T00:00:00.000+02:00",
                "actesLegislatifs": null,
                "statutConclusion": {
                  "fam_code": "TSORTF19",
                  "libelle": "considérée comme définitive en application de l'article 151-7 du Règlement"
                },
                "reunionRef": null,
                "voteRefs": null,
                "textesAssocies": {
                  "texteAssocie": {
                    "typeTexte": "BTA",
                    "refTexteAssocie": "RIONANR5L14BTA0809"
                  }
                }
              }
            }
          }
        ]
      }
    }
  },
  "fusionDossier": null
}