{
  "@xsi:type": "DossierLegislatif_Type",
  "uid": "DLR5L14N33248",
  "legislature": "14",
  "titreDossier": {
    "titre": "Sécurité sociale : loi de financement rectificative 2014",
    "titreChemin": "plfss_rectificative_2014",
    "senatChemin": "http://www.senat.fr/dossier-legislatif/pjl13-689.html"
  },
  "procedureParlementaire": {
    "code": "4",
    "libelle": "Projet de loi de financement de la sécurité sociale"
  },
  "initiateur": {
    "acteurs": {
      "acteur": [
        {
          "acteurRef": "PA267622",
          "mandatRef": "PM700712"
        },
        {
          "acteurRef": "PA2679",
          "mandatRef": "PM700726"
        },
        {
          "acteurRef": "PA2825",
          "mandatRef": "PM700732"
        }
      ]
    }
  },
  "actesLegislatifs": {
    "acteLegislatif": [
      {
        "@xsi:type": "Etape_Type",
        "uid": "L14-AN1-33248",
        "codeActe": "AN1",
        "libelleActe": {
          "nomCanonique": "1ère lecture (1ère assemblée saisie)",
          "libelleCourt": "1ère lecture"
        },
        "organeRef": "PO644420",
        "dateActe": null,
        "actesLegislatifs": {
          "acteLegislatif": [
            {
              "@xsi:type": "DepotInitiative_Type",
              "uid": "L14-VD170395DI",
              "codeActe": "AN1-DEPOT",
              "libelleActe": {
                "nomCanonique": "1er dépôt d'une initiative.",
                "libelleCourt": "1er dépôt d'une initiative."
              },
              "organeRef": "PO644420",
              "dateActe": "2014-06-18T00:00:00.000+02:00",
              "actesLegislatifs": null,
              "texteAssocie": "PRJLANR5L14B2044"
            },
            {
              "@xsi:type": "EtudeImpact_Type",
              "uid": "L14-VD170395ETI",
              "codeActe": "AN1-ETI",
              "libelleActe": {
                "nomCanonique": "Etude d'impact",
                "libelleCourt": "Etude d'impact"
              },
              "organeRef": "PO644420",
              "dateActe": "2014-06-18T00:00:00.000+02:00",
              "actesLegislatifs": null,
              "texteAssocie": "ETDIANR5L14B2044",
              "contributionInternaute": {
                "dateFermeture": "2014-06-30+02:00",
                "dateOuverture": "2014-06-18+02:00"
              }
            },
            {
              "@xsi:type": "ProcedureAccelere_Type",
              "uid": "L14-VD170397",
              "codeActe": "AN1-PROCACC",
              "libelleActe": {
                "nomCanonique": "Le gouvernement déclare l'urgence / engage la procédure accélérée",
                "libelleCourt": "Le gouvernement déclare l'urgence / engage la procédure accélérée"
              },
              "organeRef": "PO700706",
              "dateActe": "2014-06-18T00:00:00.000+02:00",
              "actesLegislatifs": null
            },
            {
              "@xsi:type": "Etape_Type",
              "uid": "L14-AN1-COM-33248",
              "codeActe": "AN1-COM",
              "libelleActe": {
                "nomCanonique": "Travaux des commissions",
                "libelleCourt": "Travaux des commissions"
              },
              "organeRef": "PO644420",
              "dateActe": null,
              "actesLegislatifs": {
                "acteLegislatif": [
                  {
                    "@xsi:type": "Etape_Type",
                    "uid": "L14-VD170396CF",
                    "codeActe": "AN1-COM-FOND",
                    "libelleActe": {
                      "nomCanonique": "Travaux de la commission saisie au fond",
                      "libelleCourt": "Travaux de la commission saisie au fond"
                    },
                    "organeRef": "PO420120",
                    "dateActe": null,
                    "actesLegislatifs": {
                      "acteLegislatif": [
                        {
                          "@xsi:type": "SaisieComFond_Type",
                          "uid": "L14-VD170396CFS",
                          "codeActe": "AN1-COM-FOND-SAISIE",
                          "libelleActe": {
                            "nomCanonique": "Renvoi en commission au fond",
                            "libelleCourt": "Renvoi en commission au fond"
                          },
                          "organeRef": "PO420120",
                          "dateActe": "2014-06-18T00:00:00.000+02:00",
                          "actesLegislatifs": null
                        },
                        {
                          "@xsi:type": "NominRapporteurs_Type",
                          "uid": "L14-VD170493",
                          "codeActe": "AN1-COM-FOND-NOMIN",
                          "libelleActe": {
                            "nomCanonique": "Nomination de rapporteur",
                            "libelleCourt": "Nomination de rapporteur"
                          },
                          "organeRef": "PO420120",
                          "dateActe": "2014-05-28T00:00:00.000+02:00",
                          "actesLegislatifs": null,
                          "rapporteurs": {
                            "rapporteur": {
                              "acteurRef": "PA356",
                              "typeRapporteur": "rapporteur"
                            }
                          },
                          "reunion": null
                        },
                        {
                          "@xsi:type": "DiscussionCommission_Type",
                          "uid": "L14-VD170421R20787",
                          "codeActe": "AN1-COM-FOND-REUNION",
                          "libelleActe": {
                            "nomCanonique": "Réunion de commission",
                            "libelleCourt": "Réunion de commission"
                          },
                          "organeRef": "PO420120",
                          "dateActe": "2014-05-28T09:30:00.000+02:00",
                          "actesLegislatifs": null,
                          "reunionRef": "RUANR5L14S2014IDC421176",
                          "odjRef": "RUANR5L14S2014IDC421176PT20787"
                        },
                        {
                          "@xsi:type": "DiscussionCommission_Type",
                          "uid": "L14-VD170421R20766",
                          "codeActe": "AN1-COM-FOND-REUNION",
                          "libelleActe": {
                            "nomCanonique": "Réunion de commission",
                            "libelleCourt": "Réunion de commission"
                          },
                          "organeRef": "PO420120",
                          "dateActe": "2014-06-18T16:15:00.000+02:00",
                          "actesLegislatifs": null,
                          "reunionRef": "RUANR5L14S2014IDC421505",
                          "odjRef": "RUANR5L14S2014IDC421505PT20766"
                        },
                        {
                          "@xsi:type": "DiscussionCommission_Type",
                          "uid": "L14-VD170421R20773",
                          "codeActe": "AN1-COM-FOND-REUNION",
                          "libelleActe": {
                            "nomCanonique": "Réunion de commission",
                            "libelleCourt": "Réunion de commission"
                          },
                          "organeRef": "PO420120",
                          "dateActe": "2014-06-24T17:15:00.000+02:00",
                          "actesLegislatifs": null,
                          "reunionRef": "RUANR5L14S2014IDC421506",
                          "odjRef": "RUANR5L14S2014IDC421506PT20773"
                        },
                        {
                          "@xsi:type": "DiscussionCommission_Type",
                          "uid": "L14-VD170421R20774",
                          "codeActe": "AN1-COM-FOND-REUNION",
                          "libelleActe": {
                            "nomCanonique": "Réunion de commission",
                            "libelleCourt": "Réunion de commission"
                          },
                          "organeRef": "PO420120",
                          "dateActe": "2014-06-24T21:30:00.000+02:00",
                          "actesLegislatifs": null,
                          "reunionRef": "RUANR5L14S2014IDC421510",
                          "odjRef": "RUANR5L14S2014IDC421510PT20774"
                        },
                        {
                          "@xsi:type": "DiscussionCommission_Type",
                          "uid": "L14-VD170421R20808",
                          "codeActe": "AN1-COM-FOND-REUNION",
                          "libelleActe": {
                            "nomCanonique": "Réunion de commission",
                            "libelleCourt": "Réunion de commission"
                          },
                          "organeRef": "PO420120",
                          "dateActe": "2014-06-30T15:30:00.000+02:00",
                          "actesLegislatifs": null,
                          "reunionRef": "RUANR5L14S2014IDC421623",
                          "odjRef": "RUANR5L14S2014IDC421623PT20808"
                        },
                        {
                          "@xsi:type": "DepotRapport_Type",
                          "uid": "L14-VD170503",
                          "codeActe": "AN1-COM-FOND-RAPPORT",
                          "libelleActe": {
                            "nomCanonique": "Dépôt de rapport",
                            "libelleCourt": "Dépôt de rapport"
                          },
                          "organeRef": "PO420120",
                          "dateActe": "2014-06-25T00:00:00.000+02:00",
                          "actesLegislatifs": null,
                          "texteAssocie": "RAPPANR5L14B2061",
                          "texteAdopte": null
                        }
                      ]
                    }
                  },
                  {
                    "@xsi:type": "Etape_Type",
                    "uid": "L14-VD170443CA",
                    "codeActe": "AN1-COM-AVIS",
                    "libelleActe": {
                      "nomCanonique": "Travaux d'une commission saisie pour avis",
                      "libelleCourt": "Travaux d'une commission saisie pour avis"
                    },
                    "organeRef": "PO59048",
                    "dateActe": null,
                    "actesLegislatifs": {
                      "acteLegislatif": [
                        {
                          "@xsi:type": "SaisieComAvis_Type",
                          "uid": "L14-VD170443CAS",
                          "codeActe": "AN1-COM-AVIS-SAISIE",
                          "libelleActe": {
                            "nomCanonique": "Saisine pour avis d'une commission",
                            "libelleCourt": "Saisine pour avis d'une commission"
                          },
                          "organeRef": "PO59048",
                          "dateActe": "2014-06-18T00:00:00.000+02:00",
                          "actesLegislatifs": null
                        },
                        {
                          "@xsi:type": "NominRapporteurs_Type",
                          "uid": "L14-VD170476",
                          "codeActe": "AN1-COM-AVIS-NOMIN",
                          "libelleActe": {
                            "nomCanonique": "Nomination de rapporteur",
                            "libelleCourt": "Nomination de rapporteur"
                          },
                          "organeRef": "PO59048",
                          "dateActe": "2014-06-11T00:00:00.000+02:00",
                          "actesLegislatifs": null,
                          "rapporteurs": {
                            "rapporteur": {
                              "acteurRef": "PA610594",
                              "typeRapporteur": "rapporteur pour avis"
                            }
                          },
                          "reunion": null
                        },
                        {
                          "@xsi:type": "DepotRapport_Type",
                          "uid": "L14-VD170491",
                          "codeActe": "AN1-COM-AVIS-RAPPORT",
                          "libelleActe": {
                            "nomCanonique": "Dépôt de rapport",
                            "libelleCourt": "Dépôt de rapport"
                          },
                          "organeRef": "PO59048",
                          "dateActe": "2014-06-25T00:00:00.000+02:00",
                          "actesLegislatifs": null,
                          "texteAssocie": "AVISANR5L14B2058",
                          "texteAdopte": null
                        }
                      ]
                    }
                  }
                ]
              }
            },
            {
              "@xsi:type": "Etape_Type",
              "uid": "L14-AN1-DEBATS-33248",
              "codeActe": "AN1-DEBATS",
              "libelleActe": {
                "nomCanonique": "Discussion en séance publique",
                "libelleCourt": "Discussion en séance publique"
              },
              "organeRef": "PO644420",
              "dateActe": null,
              "actesLegislatifs": {
                "acteLegislatif": [
                  {
                    "@xsi:type": "DiscussionSeancePublique_Type",
                    "uid": "L14-VD170460S30974",
                    "codeActe": "AN1-DEBATS-SEANCE",
                    "libelleActe": {
                      "nomCanonique": "Discussion en séance publique",
                      "libelleCourt": "Discussion en séance publique"
                    },
                    "organeRef": "PO644420",
                    "dateActe": "2014-06-30T00:00:00.000+02:00",
                    "actesLegislatifs": null,
                    "reunionRef": "RUANR5L14S2014IDS18584",
                    "odjRef": "RUANR5L14S2014IDS18584PT30974"
                  },
                  {
                    "@xsi:type": "DiscussionSeancePublique_Type",
                    "uid": "L14-VD170460S30975",
                    "codeActe": "AN1-DEBATS-SEANCE",
                    "libelleActe": {
                      "nomCanonique": "Discussion en séance publique",
                      "libelleCourt": "Discussion en séance publique"
                    },
                    "organeRef": "PO644420",
                    "dateActe": "2014-06-30T00:00:00.000+02:00",
                    "actesLegislatifs": null,
                    "reunionRef": "RUANR5L14S2014IDS18585",
                    "odjRef": "RUANR5L14S2014IDS18585PT30975"
                  },
                  {
                    "@xsi:type": "DiscussionSeancePublique_Type",
                    "uid": "L14-VD170460S30978",
                    "codeActe": "AN1-DEBATS-SEANCE",
                    "libelleActe": {
                      "nomCanonique": "Discussion en séance publique",
                      "libelleCourt": "Discussion en séance publique"
                    },
                    "organeRef": "PO644420",
                    "dateActe": "2014-07-01T00:00:00.000+02:00",
                    "actesLegislatifs": null,
                    "reunionRef": "RUANR5L14S2014IDS18586",
                    "odjRef": "RUANR5L14S2014IDS18586PT30978"
                  },
                  {
                    "@xsi:type": "DiscussionSeancePublique_Type",
                    "uid": "L14-VD170460S30979",
                    "codeActe": "AN1-DEBATS-SEANCE",
                    "libelleActe": {
                      "nomCanonique": "Discussion en séance publique",
                      "libelleCourt": "Discussion en séance publique"
                    },
                    "organeRef": "PO644420",
                    "dateActe": "2014-07-01T00:00:00.000+02:00",
                    "actesLegislatifs": null,
                    "reunionRef": "RUANR5L14S2014IDS18587",
                    "odjRef": "RUANR5L14S2014IDS18587PT30979"
                  },
                  {
                    "@xsi:type": "DiscussionSeancePublique_Type",
                    "uid": "L14-VD170460S30996",
                    "codeActe": "AN1-DEBATS-SEANCE",
                    "libelleActe": {
                      "nomCanonique": "Discussion en séance publique",
                      "libelleCourt": "Discussion en séance publique"
                    },
                    "organeRef": "PO644420",
                    "dateActe": "2014-07-02T00:00:00.000+02:00",
                    "actesLegislatifs": null,
                    "reunionRef": "RUANR5L14S2014IDS18588",
                    "odjRef": "RUANR5L14S2014IDS18588PT30996"
                  },
                  {
                    "@xsi:type": "DiscussionSeancePublique_Type",
                    "uid": "L14-VD170460S31081",
                    "codeActe": "AN1-DEBATS-SEANCE",
                    "libelleActe": {
                      "nomCanonique": "Discussion en séance publique",
                      "libelleCourt": "Discussion en séance publique"
                    },
                    "organeRef": "PO644420",
                    "dateActe": "2014-07-08T00:00:00.000+02:00",
                    "actesLegislatifs": null,
                    "reunionRef": "RUANR5L14S2014IDS18611",
                    "odjRef": "RUANR5L14S2014IDS18611PT31081"
                  },
                  {
                    "@xsi:type": "Decision_Type",
                    "uid": "L14-VD170693DEC",
                    "codeActe": "AN1-DEBATS-DEC",
                    "libelleActe": {
                      "nomCanonique": "Décision",
                      "libelleCourt": "Décision"
                    },
                    "organeRef": "PO644420",
                    "dateActe": "2014-07-08T00:00:00.000+02:00",
                    "actesLegislatifs": null,
                    "reunionRef": "RUANR5L14S2014IDS18611",
                    "statutConclusion": {
                      "fam_code": "TSORTF01",
                      "libelle": "adopté"
                    },
                    "voteRefs": {
                      "voteRef": "VTANR5L14V868"
                    },
                    "textesAssocies": {
                      "texteAssocie": {
                        "typeTexte": "BTA",
                        "refTexteAssocie": "PRJLANR5L14BTA0375"
                      }
                    }
                  }
                ]
              }
            }
          ]
        }
      },
      {
        "@xsi:type": "Etape_Type",
        "uid": "L14-SN1-33248",
        "codeActe": "SN1",
        "libelleActe": {
          "nomCanonique": "1ère lecture (2ème assemblée saisie)",
          "libelleCourt": "1ère lecture"
        },
        "organeRef": "PO78718",
        "dateActe": null,
        "actesLegislatifs": {
          "acteLegislatif": [
            {
              "@xsi:type": "DepotInitiativeNavette_Type",
              "uid": "L14-VD170703DIN",
              "codeActe": "SN1-DEPOT",
              "libelleActe": {
                "nomCanonique": "Dépôt d'une initiative en navette",
                "libelleCourt": "Dépôt d'une initiative en navette"
              },
              "organeRef": "PO78718",
              "dateActe": "2014-07-08T00:00:00.000+02:00",
              "actesLegislatifs": null,
              "texteAssocie": "PRJLSNR5S219B0689",
              "provenance": "PO644420"
            },
            {
              "@xsi:type": "Etape_Type",
              "uid": "L14-SN1-COM-33248",
              "codeActe": "SN1-COM",
              "libelleActe": {
                "nomCanonique": "Travaux des commissions",
                "libelleCourt": "Travaux des commissions"
              },
              "organeRef": "PO78718",
              "dateActe": null,
              "actesLegislatifs": {
                "acteLegislatif": [
                  {
                    "@xsi:type": "Etape_Type",
                    "uid": "L14-VD170704CF",
                    "codeActe": "SN1-COM-FOND",
                    "libelleActe": {
                      "nomCanonique": "Travaux de la commission saisie au fond",
                      "libelleCourt": "Travaux de la commission saisie au fond"
                    },
                    "organeRef": "PO211493",
                    "dateActe": null,
                    "actesLegislatifs": {
                      "acteLegislatif": [
                        {
                          "@xsi:type": "SaisieComFond_Type",
                          "uid": "L14-VD170704CFS",
                          "codeActe": "SN1-COM-FOND-SAISIE",
                          "libelleActe": {
                            "nomCanonique": "Renvoi en commission au fond",
                            "libelleCourt": "Renvoi en commission au fond"
                          },
                          "organeRef": "PO211493",
                          "dateActe": "2014-07-08T00:00:00.000+02:00",
                          "actesLegislatifs": null
                        },
                        {
                          "@xsi:type": "NominRapporteurs_Type",
                          "uid": "L14-VD170753",
                          "codeActe": "SN1-COM-FOND-NOMIN",
                          "libelleActe": {
                            "nomCanonique": "Nomination de rapporteur",
                            "libelleCourt": "Nomination de rapporteur"
                          },
                          "organeRef": "PO211493",
                          "dateActe": "2013-07-03T00:00:00.000+02:00",
                          "actesLegislatifs": null,
                          "rapporteurs": {
                            "rapporteur": {
                              "acteurRef": "PA415483",
                              "typeRapporteur": "rapporteur"
                            }
                          },
                          "reunion": null
                        },
                        {
                          "@xsi:type": "DepotRapport_Type",
                          "uid": "L14-VD170754",
                          "codeActe": "SN1-COM-FOND-RAPPORT",
                          "libelleActe": {
                            "nomCanonique": "Dépôt de rapport",
                            "libelleCourt": "Dépôt de rapport"
                          },
                          "organeRef": "PO211493",
                          "dateActe": "2014-07-09T00:00:00.000+02:00",
                          "actesLegislatifs": null,
                          "texteAssocie": "RAPPSNR5S219B0703",
                          "texteAdopte": null
                        }
                      ]
                    }
                  },
                  {
                    "@xsi:type": "Etape_Type",
                    "uid": "L14-VD170766CA",
                    "codeActe": "SN1-COM-AVIS",
                    "libelleActe": {
                      "nomCanonique": "Travaux d'une commission saisie pour avis",
                      "libelleCourt": "Travaux d'une commission saisie pour avis"
                    },
                    "organeRef": "PO211494",
                    "dateActe": null,
                    "actesLegislatifs": {
                      "acteLegislatif": [
                        {
                          "@xsi:type": "SaisieComAvis_Type",
                          "uid": "L14-VD170766CAS",
                          "codeActe": "SN1-COM-AVIS-SAISIE",
                          "libelleActe": {
                            "nomCanonique": "Saisine pour avis d'une commission",
                            "libelleCourt": "Saisine pour avis d'une commission"
                          },
                          "organeRef": "PO211494",
                          "dateActe": "2014-06-24T00:00:00.000+02:00",
                          "actesLegislatifs": null
                        },
                        {
                          "@xsi:type": "NominRapporteurs_Type",
                          "uid": "L14-VD170767",
                          "codeActe": "SN1-COM-AVIS-NOMIN",
                          "libelleActe": {
                            "nomCanonique": "Nomination de rapporteur",
                            "libelleCourt": "Nomination de rapporteur"
                          },
                          "organeRef": "PO211494",
                          "dateActe": "2014-06-24T00:00:00.000+02:00",
                          "actesLegislatifs": null,
                          "rapporteurs": {
                            "rapporteur": {
                              "acteurRef": "PA304005",
                              "typeRapporteur": "rapporteur pour avis"
                            }
                          },
                          "reunion": null
                        },
                        {
                          "@xsi:type": "DepotRapport_Type",
                          "uid": "L14-VD170768",
                          "codeActe": "SN1-COM-AVIS-RAPPORT",
                          "libelleActe": {
                            "nomCanonique": "Dépôt de rapport",
                            "libelleCourt": "Dépôt de rapport"
                          },
                          "organeRef": "PO211494",
                          "dateActe": "2014-07-09T00:00:00.000+02:00",
                          "actesLegislatifs": null,
                          "texteAssocie": "AVISSNR5S219B0701",
                          "texteAdopte": null
                        }
                      ]
                    }
                  }
                ]
              }
            },
            {
              "@xsi:type": "Etape_Type",
              "uid": "L14-SN1-DEBATS-33248",
              "codeActe": "SN1-DEBATS",
              "libelleActe": {
                "nomCanonique": "Discussion en séance publique",
                "libelleCourt": "Discussion en séance publique"
              },
              "organeRef": "PO78718",
              "dateActe": null,
              "actesLegislatifs": {
                "acteLegislatif": [
                  {
                    "@xsi:type": "DiscussionSeancePublique_Type",
                    "uid": "L14-VD170705S31064",
                    "codeActe": "SN1-DEBATS-SEANCE",
                    "libelleActe": {
                      "nomCanonique": "Discussion en séance publique",
                      "libelleCourt": "Discussion en séance publique"
                    },
                    "organeRef": "PO78718",
                    "dateActe": "2014-07-15T00:00:00.000+02:00",
                    "actesLegislatifs": null,
                    "reunionRef": "RUSNR5L14S2014IDS18641",
                    "odjRef": "RUSNR5L14S2014IDS18641PT31064"
                  },
                  {
                    "@xsi:type": "DiscussionSeancePublique_Type",
                    "uid": "L14-VD170705S31066",
                    "codeActe": "SN1-DEBATS-SEANCE",
                    "libelleActe": {
                      "nomCanonique": "Discussion en séance publique",
                      "libelleCourt": "Discussion en séance publique"
                    },
                    "organeRef": "PO78718",
                    "dateActe": "2014-07-16T00:00:00.000+02:00",
                    "actesLegislatifs": null,
                    "reunionRef": "RUSNR5L14S2014IDS18642",
                    "odjRef": "RUSNR5L14S2014IDS18642PT31066"
                  },
                  {
                    "@xsi:type": "Decision_Type",
                    "uid": "L14-VD170871DEC",
                    "codeActe": "SN1-DEBATS-DEC",
                    "libelleActe": {
                      "nomCanonique": "Décision",
                      "libelleCourt": "Décision"
                    },
                    "organeRef": "PO78718",
                    "dateActe": "2014-07-16T00:00:00.000+02:00",
                    "actesLegislatifs": null,
                    "reunionRef": "RUSNR5L14S2014IDS18642",
                    "statutConclusion": {
                      "fam_code": "TSORTF07",
                      "libelle": "rejeté"
                    },
                    "voteRefs": null,
                    "textesAssocies": {
                      "texteAssocie": {
                        "typeTexte": "BTA",
                        "refTexteAssocie": "PRJLSNR5S219BTA0157"
                      }
                    }
                  }
                ]
              }
            }
          ]
        }
      },
      {
        "@xsi:type": "Etape_Type",
        "uid": "L14-CMP-33248",
        "codeActe": "CMP",
        "libelleActe": {
          "nomCanonique": "Commission Mixte Paritaire",
          "libelleCourt": "Commission Mixte Paritaire"
        },
        "organeRef": "PO702586",
        "dateActe": null,
        "actesLegislatifs": {
          "acteLegislatif": [
            {
              "@xsi:type": "RenvoiCMP_Type",
              "uid": "L14-VD170883CMPS",
              "codeActe": "CMP-SAISIE",
              "libelleActe": {
                "nomCanonique": "Convocation d'une CMP",
                "libelleCourt": "Convocation d'une CMP"
              },
              "organeRef": "PO702586",
              "dateActe": "2014-07-17T00:00:00.000+02:00",
              "actesLegislatifs": null,
              "initiateur": {
                "acteurs": {
                  "acteur": {
                    "acteurRef": "PA267622",
                    "mandatRef": "PM700712"
                  }
                }
              }
            },
            {
              "@xsi:type": "Etape_Type",
              "uid": "L14-VD170883COM",
              "codeActe": "CMP-COM",
              "libelleActe": {
                "nomCanonique": "Commission Mixte Paritaire",
                "libelleCourt": "Commission Mixte Paritaire"
              },
              "organeRef": "PO702586",
              "dateActe": null,
              "actesLegislatifs": {
                "acteLegislatif": [
                  {
                    "@xsi:type": "NominRapporteurs_Type",
                    "uid": "L14-VD170898",
                    "codeActe": "CMP-COM-NOMIN",
                    "libelleActe": {
                      "nomCanonique": "Nomination de rapporteur",
                      "libelleCourt": "Nomination de rapporteur"
                    },
                    "organeRef": "PO702586",
                    "dateActe": "2014-07-17T00:00:00.000+02:00",
                    "actesLegislatifs": null,
                    "rapporteurs": {
                      "rapporteur": [
                        {
                          "acteurRef": "PA356",
                          "typeRapporteur": "rapporteur"
                        },
                        {
                          "acteurRef": "PA415483",
                          "typeRapporteur": "rapporteur"
                        }
                      ]
                    },
                    "reunion": null
                  },
                  {
                    "@xsi:type": "DepotRapport_Type",
                    "uid": "L14-VD170899",
                    "codeActe": "CMP-COM-RAPPORT-AN",
                    "libelleActe": {
                      "nomCanonique": "Dépôt du rapport d'une CMP",
                      "libelleCourt": "Dépôt du rapport d'une CMP"
                    },
                    "organeRef": "PO644420",
                    "dateActe": "2014-07-17T00:00:00.000+02:00",
                    "actesLegislatifs": null,
                    "texteAssocie": "RAPPANR5L14B2159",
                    "texteAdopte": null
                  },
                  {
                    "@xsi:type": "DepotRapport_Type",
                    "uid": "L14-VD170917",
                    "codeActe": "CMP-COM-RAPPORT-SN",
                    "libelleActe": {
                      "nomCanonique": "Dépôt du rapport d'une CMP",
                      "libelleCourt": "Dépôt du rapport d'une CMP"
                    },
                    "organeRef": "PO78718",
                    "dateActe": "2014-07-17T00:00:00.000+02:00",
                    "actesLegislatifs": null,
                    "texteAssocie": "RAPPSNR5S219B0755",
                    "texteAdopte": null
                  }
                ]
              }
            },
            {
              "@xsi:type": "Decision_Type",
              "uid": "L14-VD170883DEC",
              "codeActe": "CMP-DEC",
              "libelleActe": {
                "nomCanonique": "Décision de la CMP",
                "libelleCourt": "Décision de la CMP"
              },
              "organeRef": "PO702586",
              "dateActe": "2014-07-17T00:00:00.000+02:00",
              "actesLegislatifs": null,
              "statutConclusion": {
                "fam_code": "TCCMP02",
                "libelle": "Désaccord"
              },
              "reunionRef": null,
              "voteRefs": null
            }
          ]
        }
      },
      {
        "@xsi:type": "Etape_Type",
        "uid": "L14-ANNLEC-33248",
        "codeActe": "ANNLEC",
        "libelleActe": {
          "nomCanonique": "Nouvelle Lecture",
          "libelleCourt": "Nouvelle lecture"
        },
        "organeRef": "PO644420",
        "dateActe": null,
        "actesLegislatifs": {
          "acteLegislatif": [
            {
              "@xsi:type": "DepotInitiativeNavette_Type",
              "uid": "L14-VD170881DIN",
              "codeActe": "ANNLEC-DEPOT",
              "libelleActe": {
                "nomCanonique": "Dépôt d'une initiative en navette",
                "libelleCourt": "Dépôt d'une initiative en navette"
              },
              "organeRef": "PO644420",
              "dateActe": "2014-07-17T00:00:00.000+02:00",
              "actesLegislatifs": null,
              "texteAssocie": "PRJLANR5L14B2154",
              "provenance": "PO702586"
            },
            {
              "@xsi:type": "Etape_Type",
              "uid": "L14-ANNLEC-COM-33248",
              "codeActe": "ANNLEC-COM",
              "libelleActe": {
                "nomCanonique": "Travaux des commissions",
                "libelleCourt": "Travaux des commissions"
              },
              "organeRef": "PO644420",
              "dateActe": null,
              "actesLegislatifs": {
                "acteLegislatif": {
                  "@xsi:type": "Etape_Type",
                  "uid": "L14-VD170882CF",
                  "codeActe": "ANNLEC-COM-FOND",
                  "libelleActe": {
                    "nomCanonique": "Travaux de la commission saisie au fond",
                    "libelleCourt": "Travaux de la commission saisie au fond"
                  },
                  "organeRef": "PO420120",
                  "dateActe": null,
                  "actesLegislatifs": {
                    "acteLegislatif": [
                      {
                        "@xsi:type": "SaisieComFond_Type",
                        "uid": "L14-VD170882CFS",
                        "codeActe": "ANNLEC-COM-FOND-SAISIE",
                        "libelleActe": {
                          "nomCanonique": "Renvoi en commission au fond",
                          "libelleCourt": "Renvoi en commission au fond"
                        },
                        "organeRef": "PO420120",
                        "dateActe": "2014-07-17T00:00:00.000+02:00",
                        "actesLegislatifs": null
                      },
                      {
                        "@xsi:type": "DiscussionCommission_Type",
                        "uid": "L14-VD170911R21204",
                        "codeActe": "ANNLEC-COM-FOND-REUNION",
                        "libelleActe": {
                          "nomCanonique": "Réunion de commission",
                          "libelleCourt": "Réunion de commission"
                        },
                        "organeRef": "PO420120",
                        "dateActe": "2014-07-18T11:00:00.000+02:00",
                        "actesLegislatifs": null,
                        "reunionRef": "RUANR5L14S2014IDC421704",
                        "odjRef": "RUANR5L14S2014IDC421704PT21204"
                      },
                      {
                        "@xsi:type": "DepotRapport_Type",
                        "uid": "L14-VD170912",
                        "codeActe": "ANNLEC-COM-FOND-RAPPORT",
                        "libelleActe": {
                          "nomCanonique": "Dépôt de rapport",
                          "libelleCourt": "Dépôt de rapport"
                        },
                        "organeRef": "PO420120",
                        "dateActe": "2014-07-18T00:00:00.000+02:00",
                        "actesLegislatifs": null,
                        "texteAssocie": "RAPPANR5L14B2160",
                        "texteAdopte": null
                      }
                    ]
                  }
                }
              }
            },
            {
              "@xsi:type": "Etape_Type",
              "uid": "L14-ANNLEC-DEBATS-33248",
              "codeActe": "ANNLEC-DEBATS",
              "libelleActe": {
                "nomCanonique": "Discussion en séance publique",
                "libelleCourt": "Discussion en séance publique"
              },
              "organeRef": "PO644420",
              "dateActe": null,
              "actesLegislatifs": {
                "acteLegislatif": [
                  {
                    "@xsi:type": "DiscussionSeancePublique_Type",
                    "uid": "L14-VD170905S31074",
                    "codeActe": "ANNLEC-DEBATS-SEANCE",
                    "libelleActe": {
                      "nomCanonique": "Discussion en séance publique",
                      "libelleCourt": "Discussion en séance publique"
                    },
                    "organeRef": "PO644420",
                    "dateActe": "2014-07-21T00:00:00.000+02:00",
                    "actesLegislatifs": null,
                    "reunionRef": "RUANR5L14S2014IDS18644",
                    "odjRef": "RUANR5L14S2014IDS18644PT31074"
                  },
                  {
                    "@xsi:type": "Decision_Type",
                    "uid": "L14-VD170940DEC",
                    "codeActe": "ANNLEC-DEBATS-DEC",
                    "libelleActe": {
                      "nomCanonique": "Décision",
                      "libelleCourt": "Décision"
                    },
                    "organeRef": "PO644420",
                    "dateActe": "2014-07-21T00:00:00.000+02:00",
                    "actesLegislatifs": null,
                    "reunionRef": "RUANR5L14S2014IDS18644",
                    "statutConclusion": {
                      "fam_code": "TSORTF01",
                      "libelle": "adopté"
                    },
                    "voteRefs": null,
                    "textesAssocies": {
                      "texteAssocie": {
                        "typeTexte": "BTA",
                        "refTexteAssocie": "PRJLANR5L14BTA0384"
                      }
                    }
                  }
                ]
              }
            }
          ]
        }
      },
      {
        "@xsi:type": "Etape_Type",
        "uid": "L14-SNNLEC-33248",
        "codeActe": "SNNLEC",
        "libelleActe": {
          "nomCanonique": "Nouvelle Lecture",
          "libelleCourt": "Nouvelle lecture"
        },
        "organeRef": "PO78718",
        "dateActe": null,
        "actesLegislatifs": {
          "acteLegislatif": [
            {
              "@xsi:type": "DepotInitiativeNavette_Type",
              "uid": "L14-VD170957DIN",
              "codeActe": "SNNLEC-DEPOT",
              "libelleActe": {
                "nomCanonique": "Dépôt d'une initiative en navette",
                "libelleCourt": "Dépôt d'une initiative en navette"
              },
              "organeRef": "PO78718",
              "dateActe": "2014-07-22T00:00:00.000+02:00",
              "actesLegislatifs": null,
              "texteAssocie": "PRJLSNR5S219B0762",
              "provenance": "PO644420"
            },
            {
              "@xsi:type": "Etape_Type",
              "uid": "L14-SNNLEC-COM-33248",
              "codeActe": "SNNLEC-COM",
              "libelleActe": {
                "nomCanonique": "Travaux des commissions",
                "libelleCourt": "Travaux des commissions"
              },
              "organeRef": "PO78718",
              "dateActe": null,
              "actesLegislatifs": {
                "acteLegislatif": {
                  "@xsi:type": "Etape_Type",
                  "uid": "L14-VD170958CF",
                  "codeActe": "SNNLEC-COM-FOND",
                  "libelleActe": {
                    "nomCanonique": "Travaux de la commission saisie au fond",
                    "libelleCourt": "Travaux de la commission saisie au fond"
                  },
                  "organeRef": "PO211493",
                  "dateActe": null,
                  "actesLegislatifs": {
                    "acteLegislatif": [
                      {
                        "@xsi:type": "SaisieComFond_Type",
                        "uid": "L14-VD170958CFS",
                        "codeActe": "SNNLEC-COM-FOND-SAISIE",
                        "libelleActe": {
                          "nomCanonique": "Renvoi en commission au fond",
                          "libelleCourt": "Renvoi en commission au fond"
                        },
                        "organeRef": "PO211493",
                        "dateActe": "2014-07-22T00:00:00.000+02:00",
                        "actesLegislatifs": null
                      },
                      {
                        "@xsi:type": "DepotRapport_Type",
                        "uid": "L14-VD170982",
                        "codeActe": "SNNLEC-COM-FOND-RAPPORT",
                        "libelleActe": {
                          "nomCanonique": "Dépôt de rapport",
                          "libelleCourt": "Dépôt de rapport"
                        },
                        "organeRef": "PO211493",
                        "dateActe": "2014-07-22T00:00:00.000+02:00",
                        "actesLegislatifs": null,
                        "texteAssocie": "RAPPSNR5S219B0765",
                        "texteAdopte": null
                      }
                    ]
                  }
                }
              }
            },
            {
              "@xsi:type": "Etape_Type",
              "uid": "L14-SNNLEC-DEBATS-33248",
              "codeActe": "SNNLEC-DEBATS",
              "libelleActe": {
                "nomCanonique": "Discussion en séance publique",
                "libelleCourt": "Discussion en séance publique"
              },
              "organeRef": "PO78718",
              "dateActe": null,
              "actesLegislatifs": {
                "acteLegislatif": [
                  {
                    "@xsi:type": "DiscussionSeancePublique_Type",
                    "uid": "L14-VD170960S31150",
                    "codeActe": "SNNLEC-DEBATS-SEANCE",
                    "libelleActe": {
                      "nomCanonique": "Discussion en séance publique",
                      "libelleCourt": "Discussion en séance publique"
                    },
                    "organeRef": "PO78718",
                    "dateActe": "2014-07-22T00:00:00.000+02:00",
                    "actesLegislatifs": null,
                    "reunionRef": "RUSNR5L14S2014IDS18668",
                    "odjRef": "RUSNR5L14S2014IDS18668PT31150"
                  },
                  {
                    "@xsi:type": "Decision_Type",
                    "uid": "L14-VD170995DEC",
                    "codeActe": "SNNLEC-DEBATS-DEC",
                    "libelleActe": {
                      "nomCanonique": "Décision",
                      "libelleCourt": "Décision"
                    },
                    "organeRef": "PO78718",
                    "dateActe": "2014-07-22T00:00:00.000+02:00",
                    "actesLegislatifs": null,
                    "reunionRef": "RUSNR5L14S2014IDS18668",
                    "statutConclusion": {
                      "fam_code": "TSORTF07",
                      "libelle": "rejeté"
                    },
                    "voteRefs": null,
                    "textesAssocies": {
                      "texteAssocie": {
                        "typeTexte": "BTA",
                        "refTexteAssocie": "PRJLSNR5S219BTA0163"
                      }
                    }
                  }
                ]
              }
            }
          ]
        }
      },
      {
        "@xsi:type": "Etape_Type",
        "uid": "L14-ANLDEF-33248",
        "codeActe": "ANLDEF",
        "libelleActe": {
          "nomCanonique": "Lecture définitive",
          "libelleCourt": "Lecture définitive"
        },
        "organeRef": "PO644420",
        "dateActe": null,
        "actesLegislatifs": {
          "acteLegislatif": [
            {
              "@xsi:type": "DepotInitiativeNavette_Type",
              "uid": "L14-VD170988DIN",
              "codeActe": "ANLDEF-DEPOT",
              "libelleActe": {
                "nomCanonique": "Dépôt d'une initiative en navette",
                "libelleCourt": "Dépôt d'une initiative en navette"
              },
              "organeRef": "PO644420",
              "dateActe": "2014-07-22T00:00:00.000+02:00",
              "actesLegislatifs": null,
              "texteAssocie": "PRJLANR5L14B2174",
              "provenance": "PO78718"
            },
            {
              "@xsi:type": "Etape_Type",
              "uid": "L14-ANLDEF-COM-33248",
              "codeActe": "ANLDEF-COM",
              "libelleActe": {
                "nomCanonique": "Travaux des commissions",
                "libelleCourt": "Travaux des commissions"
              },
              "organeRef": "PO644420",
              "dateActe": null,
              "actesLegislatifs": {
                "acteLegislatif": {
                  "@xsi:type": "Etape_Type",
                  "uid": "L14-VD170989CF",
                  "codeActe": "ANLDEF-COM-FOND",
                  "libelleActe": {
                    "nomCanonique": "Travaux de la commission saisie au fond",
                    "libelleCourt": "Travaux de la commission saisie au fond"
                  },
                  "organeRef": "PO420120",
                  "dateActe": null,
                  "actesLegislatifs": {
                    "acteLegislatif": [
                      {
                        "@xsi:type": "SaisieComFond_Type",
                        "uid": "L14-VD170989CFS",
                        "codeActe": "ANLDEF-COM-FOND-SAISIE",
                        "libelleActe": {
                          "nomCanonique": "Renvoi en commission au fond",
                          "libelleCourt": "Renvoi en commission au fond"
                        },
                        "organeRef": "PO420120",
                        "dateActe": "2014-07-22T00:00:00.000+02:00",
                        "actesLegislatifs": null
                      },
                      {
                        "@xsi:type": "DepotRapport_Type",
                        "uid": "L14-VD171007",
                        "codeActe": "ANLDEF-COM-FOND-RAPPORT",
                        "libelleActe": {
                          "nomCanonique": "Dépôt de rapport",
                          "libelleCourt": "Dépôt de rapport"
                        },
                        "organeRef": "PO420120",
                        "dateActe": "2014-07-23T00:00:00.000+02:00",
                        "actesLegislatifs": null,
                        "texteAssocie": "RAPPANR5L14B2178",
                        "texteAdopte": null
                      }
                    ]
                  }
                }
              }
            },
            {
              "@xsi:type": "Etape_Type",
              "uid": "L14-ANLDEF-DEBATS-33248",
              "codeActe": "ANLDEF-DEBATS",
              "libelleActe": {
                "nomCanonique": "Discussion en séance publique",
                "libelleCourt": "Discussion en séance publique"
              },
              "organeRef": "PO644420",
              "dateActe": null,
              "actesLegislatifs": {
                "acteLegislatif": [
                  {
                    "@xsi:type": "DiscussionSeancePublique_Type",
                    "uid": "L14-VD170990S31145",
                    "codeActe": "ANLDEF-DEBATS-SEANCE",
                    "libelleActe": {
                      "nomCanonique": "Discussion en séance publique",
                      "libelleCourt": "Discussion en séance publique"
                    },
                    "organeRef": "PO644420",
                    "dateActe": "2014-07-23T00:00:00.000+02:00",
                    "actesLegislatifs": null,
                    "reunionRef": "RUANR5L14S2014IDS18649",
                    "odjRef": "RUANR5L14S2014IDS18649PT31145"
                  },
                  {
                    "@xsi:type": "Decision_Type",
                    "uid": "L14-VD171035DEC",
                    "codeActe": "ANLDEF-DEBATS-DEC",
                    "libelleActe": {
                      "nomCanonique": "Décision",
                      "libelleCourt": "Décision"
                    },
                    "organeRef": "PO644420",
                    "dateActe": "2014-07-23T00:00:00.000+02:00",
                    "actesLegislatifs": null,
                    "reunionRef": "RUANR5L14S2014IDS18649",
                    "statutConclusion": {
                      "fam_code": "TSORTF01",
                      "libelle": "adopté"
                    },
                    "voteRefs": null,
                    "textesAssocies": {
                      "texteAssocie": {
                        "typeTexte": "BTA",
                        "refTexteAssocie": "PRJLANR5L14BTA0397"
                      }
                    }
                  }
                ]
              }
            }
          ]
        }
      },
      {
        "@xsi:type": "Etape_Type",
        "uid": "L14-CC-33248",
        "codeActe": "CC",
        "libelleActe": {
          "nomCanonique": "Conseil constitutionnel",
          "libelleCourt": "Conseil constitutionnel"
        },
        "organeRef": "PO76034",
        "dateActe": null,
        "actesLegislatifs": {
          "acteLegislatif": [
            {
              "@xsi:type": "SaisineConseilConstit_Type",
              "uid": "L14-VD171045CCS1603",
              "codeActe": "CC-SAISIE-AN",
              "libelleActe": {
                "nomCanonique": "Saisine du conseil constitutionnel",
                "libelleCourt": "Saisine du conseil constitutionnel"
              },
              "organeRef": "PO644420",
              "dateActe": "2014-07-24T00:00:00.000+02:00",
              "actesLegislatifs": null,
              "casSaisine": {
                "fam_code": "TSCCONT05",
                "libelle": "Soixante députés au moins"
              },
              "initiateurs": null,
              "motif": "En application de l'article 61§2 de la Constitution"
            },
            {
              "@xsi:type": "ConclusionEtapeCC_Type",
              "uid": "L14-VD171045CCC",
              "codeActe": "CC-CONCLUSION",
              "libelleActe": {
                "nomCanonique": "Conclusion du conseil constitutionnel",
                "libelleCourt": "Conclusion du conseil constitutionnel"
              },
              "organeRef": "PO76034",
              "dateActe": "2014-08-06T00:00:00.000+02:00",
              "actesLegislatifs": null,
              "statutConclusion": {
                "fam_code": "TCD02",
                "libelle": "Partiellement conforme"
              },
              "urlConclusion": "http://www.conseil-constitutionnel.fr/decision/2014/2014698dc.htm",
              "numDecision": "698",
              "anneeDecision": "2014"
            }
          ]
        }
      },
      {
        "@xsi:type": "Etape_Type",
        "uid": "L14-PROM-33248",
        "codeActe": "PROM",
        "libelleActe": {
          "nomCanonique": "Promulgation de la loi",
          "libelleCourt": "Promulgation de la loi"
        },
        "organeRef": "PO696251",
        "dateActe": null,
        "actesLegislatifs": {
          "acteLegislatif": {
            "@xsi:type": "Promulgation_Type",
            "uid": "L14-VD171090PL",
            "codeActe": "PROM-PUB",
            "libelleActe": {
              "nomCanonique": "Promulgation d'une loi",
              "libelleCourt": "Promulgation d'une loi"
            },
            "organeRef": "PO696251",
            "dateActe": "2014-08-08T00:00:00.000+02:00",
            "actesLegislatifs": null,
            "texteLoiRef": "PRJLANR5L14BTA0397",
            "infoJO": {
              "typeJO": "JO_LOI_DECRET",
              "dateJO": "2014-08-09+02:00",
              "pageJO": null,
              "numJO": "183"
            },
            "urlLegifrance": "http://www.legifrance.gouv.fr/WAspad/UnTexteDeJorf?numjo=FCPX1412917L",
            "referenceNOR": "FCPX1412917L",
            "codeLoi": "2014-892",
            "titreLoi": "de financement rectificative de la sécurité sociale pour 2014"
          }
        }
      }
    ]
  },
  "fusionDossier": null
}