{
  "@xsi:type": "texteLoi_Type",
  "uid": "PIONSNR5S259B0665",
  "legislature": null,
  "cycleDeVie": {
    "chrono": {
      "dateCreation": "2016-06-02T00:00:00.000+02:00",
      "dateDepot": "2016-06-02T00:00:00.000+02:00",
      "datePublication": "2016-10-25T00:00:00.000+02:00",
      "datePublicationWeb": null
    }
  },
  "denominationStructurelle": "Proposition de loi",
  "provenance": "Texte Déposé",
  "titres": {
    "titrePrincipal": "proposition de loi tendant à permettre le maintien des communes associées, sous forme de communes déléguées, en cas de création d'une commune nouvelle",
    "titrePrincipalCourt": "Maintien des communes associées en cas de commune nouvelle"
  },
  "divisions": null,
  "dossierRef": "DLR5L14N34719",
  "redacteur": null,
  "classification": {
    "famille": {
      "depot": {
        "code": "INITNAV",
        "libelle": "Initiative en Navette"
      },
      "classe": {
        "code": "PIONLOI",
        "libelle": "Proposition de loi"
      }
    },
    "type": {
      "code": "PION",
      "libelle": "Proposition de loi"
    },
    "sousType": null,
    "statutAdoption": null
  },
  "auteurs": {
    "auteur": {
      "organe": {
        "organeRef": "PO78718"
      }
    }
  },
  "correction": null,
  "notice": {
    "numNotice": "665",
    "formule": ", modifiée, par l'Assemblée nationale, tendant à permettre le maintien des communes associées, sous forme de communes déléguées, en cas de création d'une commune nouvelle",
    "adoptionConforme": "false"
  },
  "indexation": null,
  "imprimerie": null,
  "coSignataires": null,
  "depotAmendements": {
    "amendementsSeance": {
      "amendable": "false",
      "dateLimiteDepot": null
    }
  }
}