{
  "@xsi:type": "rapportParlementaire_Type",
  "uid": "RAPPANR5L14B1131",
  "legislature": "14",
  "cycleDeVie": {
    "chrono": {
      "dateCreation": "2013-06-12T00:00:00.000+02:00",
      "dateDepot": "2013-06-12T00:00:00.000+02:00",
      "datePublication": "2013-06-19T00:00:00.000+02:00",
      "datePublicationWeb": "2013-06-17T12:10:00.000+02:00"
    }
  },
  "denominationStructurelle": "Rapport",
  "provenance": "Commission",
  "titres": {
    "titrePrincipal": "rapport sur le projet de loi organique , après engagement de la procédure accélérée, relatif au procureur de la République financier (n°1019)",
    "titrePrincipalCourt": "rapport sur le projet de loi organique , après engagement de la procédure accélérée, relatif au procureur de la République financier (n°1019)"
  },
  "divisions": null,
  "dossierRef": "DLR5L14N30265",
  "redacteur": null,
  "classification": {
    "famille": {
      "depot": {
        "code": "RAPINIT",
        "libelle": "Rapport sur une initiative"
      },
      "classe": {
        "code": "RAPPORT",
        "libelle": "Rapport"
      }
    },
    "type": {
      "code": "RAPP",
      "libelle": "Rapport"
    },
    "sousType": null,
    "statutAdoption": "ADOPTCOM"
  },
  "auteurs": {
    "auteur": [
      {
        "acteur": {
          "acteurRef": "PA1401",
          "qualite": "rapporteur"
        }
      },
      {
        "organe": {
          "organeRef": "PO59051"
        }
      }
    ]
  },
  "correction": null,
  "notice": {
    "numNotice": "1131",
    "formule": "sur le projet de loi organique , après engagement de la procédure accélérée, relatif au procureur de la République financier (n°1019)",
    "adoptionConforme": "false"
  },
  "indexation": {
    "themes": {
      "@niveau": "1",
      "theme": {
        "libelleTheme": "LOIS DE FINANCES"
      }
    }
  },
  "imprimerie": {
    "prix": "6.0"
  }
}