{
  "@xsi:type": "rapportParlementaire_Type",
  "uid": "RAPPANR5L14B2144",
  "legislature": "14",
  "cycleDeVie": {
    "chrono": {
      "dateCreation": "2014-07-16T00:00:00.000+02:00",
      "dateDepot": "2014-07-16T00:00:00.000+02:00",
      "datePublication": "2014-07-21T00:00:00.000+02:00",
      "datePublicationWeb": "2014-07-18T17:45:00.000+02:00"
    }
  },
  "denominationStructurelle": "Rapport",
  "provenance": "Commission",
  "titres": {
    "titrePrincipal": "rapport sur  les dispositions restant en discussion de la proposition de loi organique relative à la nomination des dirigeants de la SNCF",
    "titrePrincipalCourt": "rapport sur  les dispositions restant en discussion de la proposition de loi organique relative à la nomination des dirigeants de la SNCF"
  },
  "divisions": null,
  "dossierRef": "DLR5L14N33103",
  "redacteur": null,
  "classification": {
    "famille": {
      "depot": {
        "code": "RAPINIT",
        "libelle": "Rapport sur une initiative"
      },
      "classe": {
        "code": "RAPPORT",
        "libelle": "Rapport"
      }
    },
    "type": {
      "code": "RAPP",
      "libelle": "Rapport"
    },
    "sousType": null,
    "statutAdoption": "ADOPTCOM"
  },
  "auteurs": {
    "auteur": [
      {
        "acteur": {
          "acteurRef": "PA606495",
          "qualite": "rapporteur"
        }
      },
      {
        "organe": {
          "organeRef": "PO702437"
        }
      }
    ]
  },
  "correction": null,
  "notice": {
    "numNotice": "2144",
    "formule": "de la commission mixte paritaire chargée de proposer un texte sur les dispositions restant en discussion de la proposition de loi organique relative à la nomination des dirigeants de la SNCF",
    "adoptionConforme": "false"
  },
  "indexation": null,
  "imprimerie": null
}