{
  "@xsi:type": "rapportParlementaire_Type",
  "uid": "RAPPANR5L15B0641",
  "legislature": "15",
  "cycleDeVie": {
    "chrono": {
      "dateCreation": "2018-02-07T00:00:00.000+01:00",
      "dateDepot": "2018-02-07T00:00:00.000+01:00",
      "datePublication": "2018-02-27T00:00:00.000+01:00",
      "datePublicationWeb": "2018-02-23T14:30:00.000+01:00"
    }
  },
  "denominationStructurelle": "Rapport",
  "provenance": "Commission",
  "titres": {
    "titrePrincipal": "rapport  sur le projet de loi, adopté par le Sénat, autorisant la ratification de l'accord euro-méditerranéen relatif aux services aériens entre l'Union européenne et ses Etats membres, d'une part, et le Gouvernement de l'Etat d'Israël, d'autre part (n°374).",
    "titrePrincipalCourt": "rapport  sur le projet de loi, adopté par le Sénat, autorisant la ratification de l'accord euro-méditerranéen relatif aux services aériens entre l'Union européenne et ses Etats membres, d'une part, et le Gouvernement de l'Etat d'Israël, d'autre part (n°374)."
  },
  "divisions": null,
  "dossierRef": "DLR5L14N35233",
  "redacteur": null,
  "classification": {
    "famille": {
      "depot": {
        "code": "RAPINIT",
        "libelle": "Rapport sur une initiative"
      },
      "classe": {
        "code": "RAPPORT",
        "libelle": "Rapport"
      }
    },
    "type": {
      "code": "RAPP",
      "libelle": "Rapport"
    },
    "sousType": null,
    "statutAdoption": null
  },
  "auteurs": {
    "auteur": [
      {
        "acteur": {
          "acteurRef": "PA719130",
          "qualite": "rapporteur"
        }
      },
      {
        "organe": {
          "organeRef": "PO59047"
        }
      }
    ]
  },
  "correction": null,
  "notice": {
    "numNotice": "641",
    "formule": "sur le projet de loi, adopté par le Sénat, autorisant la ratification de l'accord euro-méditerranéen relatif aux services aériens entre l'Union européenne et ses Etats membres, d'une part, et le Gouvernement de l'Etat d'Israël, d'autre part (n°374).",
    "adoptionConforme": "false"
  },
  "indexation": null,
  "imprimerie": {
    "prix": "0.75"
  }
}