{
  "@xsi:type": "rapportParlementaire_Type",
  "uid": "RAPPANR5L14B3847",
  "legislature": "14",
  "cycleDeVie": {
    "chrono": {
      "dateCreation": "2016-06-16T00:00:00.000+02:00",
      "dateDepot": "2016-06-16T00:00:00.000+02:00",
      "datePublication": "2016-06-21T00:00:00.000+02:00",
      "datePublicationWeb": "2016-06-20T12:00:00.000+02:00"
    }
  },
  "denominationStructurelle": "Rapport",
  "provenance": "Commission",
  "titres": {
    "titrePrincipal": "rapport la commission mixte paritaire chargée de proposer un texte sur les dispositions restant en discussion du projet de loi relatif à la liberté de la création, à l'architecture et au patrimoine.",
    "titrePrincipalCourt": "rapport la commission mixte paritaire chargée de proposer un texte sur les dispositions restant en discussion du projet de loi relatif à la liberté de la création, à l'architecture et au patrimoine."
  },
  "divisions": null,
  "dossierRef": "DLR5L14N34109",
  "redacteur": null,
  "classification": {
    "famille": {
      "depot": {
        "code": "RAPINIT",
        "libelle": "Rapport sur une initiative"
      },
      "classe": {
        "code": "RAPPORT",
        "libelle": "Rapport"
      }
    },
    "type": {
      "code": "RAPP",
      "libelle": "Rapport"
    },
    "sousType": null,
    "statutAdoption": "ADOPTCOM"
  },
  "auteurs": {
    "auteur": [
      {
        "acteur": {
          "acteurRef": "PA543",
          "qualite": "rapporteur"
        }
      },
      {
        "organe": {
          "organeRef": "PO713419"
        }
      }
    ]
  },
  "correction": null,
  "notice": {
    "numNotice": "3847",
    "formule": "de la commission mixte paritaire chargée de proposer un texte sur les dispositions restant en discussion du projet de loi relatif à la liberté de la création, à l'architecture et au patrimoine.",
    "adoptionConforme": "false"
  },
  "indexation": null,
  "imprimerie": {
    "prix": "4.0"
  }
}