{
  "@xsi:type": "texteLoi_Type",
  "uid": "PIONANR5L14B2578",
  "legislature": "14",
  "cycleDeVie": {
    "chrono": {
      "dateCreation": "2015-02-10T00:00:00.000+01:00",
      "dateDepot": "2015-02-11T00:00:00.000+01:00",
      "datePublication": "2015-03-30T00:00:00.000+02:00",
      "datePublicationWeb": "2015-02-13T13:15:00.000+01:00"
    }
  },
  "denominationStructurelle": "Proposition de loi",
  "provenance": "Texte Déposé",
  "titres": {
    "titrePrincipal": "proposition de loi relative au devoir de vigilance des sociétés mères et des entreprises donneuses d'ordre",
    "titrePrincipalCourt": "sociétés mères et entreprises donneuses d'ordre"
  },
  "divisions": null,
  "dossierRef": "DLR5L14N33752",
  "redacteur": null,
  "classification": {
    "famille": {
      "depot": {
        "code": "INITDEP",
        "libelle": "Initiative en 1er Dépôt"
      },
      "classe": {
        "code": "PIONLOI",
        "libelle": "Proposition de loi"
      }
    },
    "type": {
      "code": "PION",
      "libelle": "Proposition de loi"
    },
    "sousType": null,
    "statutAdoption": null
  },
  "auteurs": {
    "auteur": {
      "acteur": {
        "acteurRef": "PA1886",
        "qualite": "auteur"
      }
    }
  },
  "correction": null,
  "notice": {
    "numNotice": "2578",
    "formule": "relative au devoir de vigilance des sociétés mères et des entreprises donneuses d'ordre",
    "adoptionConforme": "false"
  },
  "indexation": null,
  "imprimerie": null,
  "coSignataires": {
    "coSignataire": [
      {
        "acteur": {
          "acteurRef": "PA607553"
        },
        "dateCosignature": "2015-02-11+01:00",
        "dateRetraitCosignature": null,
        "edite": "false"
      },
      {
        "acteur": {
          "acteurRef": "PA607632"
        },
        "dateCosignature": "2015-02-11+01:00",
        "dateRetraitCosignature": null,
        "edite": "false"
      },
      {
        "acteur": {
          "acteurRef": "PA680"
        },
        "dateCosignature": "2015-02-11+01:00",
        "dateRetraitCosignature": null,
        "edite": "false"
      },
      {
        "acteur": {
          "acteurRef": "PA810"
        },
        "dateCosignature": "2015-02-11+01:00",
        "dateRetraitCosignature": null,
        "edite": "false"
      },
      {
        "acteur": {
          "acteurRef": "PA331753"
        },
        "dateCosignature": "2015-02-11+01:00",
        "dateRetraitCosignature": null,
        "edite": "false"
      },
      {
        "acteur": {
          "acteurRef": "PA1579"
        },
        "dateCosignature": "2015-02-11+01:00",
        "dateRetraitCosignature": null,
        "edite": "false"
      },
      {
        "acteur": {
          "acteurRef": "PA331594"
        },
        "dateCosignature": "2015-02-11+01:00",
        "dateRetraitCosignature": null,
        "edite": "false"
      },
      {
        "dateCosignature": "2015-02-11+01:00",
        "dateRetraitCosignature": null,
        "edite": "false",
        "organe": {
          "organeRef": "PO656002",
          "etApparentes": "true"
        }
      },
      {
        "acteur": {
          "acteurRef": "PA610758"
        },
        "dateCosignature": "2015-02-11+01:00",
        "dateRetraitCosignature": null,
        "edite": "false"
      },
      {
        "acteur": {
          "acteurRef": "PA608276"
        },
        "dateCosignature": "2015-02-11+01:00",
        "dateRetraitCosignature": null,
        "edite": "false"
      },
      {
        "acteur": {
          "acteurRef": "PA607892"
        },
        "dateCosignature": "2015-02-11+01:00",
        "dateRetraitCosignature": null,
        "edite": "false"
      },
      {
        "acteur": {
          "acteurRef": "PA610968"
        },
        "dateCosignature": "2015-02-11+01:00",
        "dateRetraitCosignature": null,
        "edite": "false"
      },
      {
        "acteur": {
          "acteurRef": "PA606675"
        },
        "dateCosignature": "2015-02-11+01:00",
        "dateRetraitCosignature": null,
        "edite": "false"
      },
      {
        "acteur": {
          "acteurRef": "PA606631"
        },
        "dateCosignature": "2015-02-11+01:00",
        "dateRetraitCosignature": null,
        "edite": "false"
      },
      {
        "acteur": {
          "acteurRef": "PA642987"
        },
        "dateCosignature": "2015-02-11+01:00",
        "dateRetraitCosignature": null,
        "edite": "false"
      },
      {
        "acteur": {
          "acteurRef": "PA334"
        },
        "dateCosignature": "2015-02-11+01:00",
        "dateRetraitCosignature": null,
        "edite": "false"
      },
      {
        "acteur": {
          "acteurRef": "PA339"
        },
        "dateCosignature": "2015-02-11+01:00",
        "dateRetraitCosignature": null,
        "edite": "false"
      },
      {
        "acteur": {
          "acteurRef": "PA607369"
        },
        "dateCosignature": "2015-02-11+01:00",
        "dateRetraitCosignature": null,
        "edite": "false"
      },
      {
        "acteur": {
          "acteurRef": "PA610681"
        },
        "dateCosignature": "2015-02-11+01:00",
        "dateRetraitCosignature": null,
        "edite": "false"
      },
      {
        "acteur": {
          "acteurRef": "PA335999"
        },
        "dateCosignature": "2015-02-11+01:00",
        "dateRetraitCosignature": null,
        "edite": "false"
      },
      {
        "acteur": {
          "acteurRef": "PA342415"
        },
        "dateCosignature": "2015-02-11+01:00",
        "dateRetraitCosignature": null,
        "edite": "false"
      },
      {
        "acteur": {
          "acteurRef": "PA606793"
        },
        "dateCosignature": "2015-02-11+01:00",
        "dateRetraitCosignature": null,
        "edite": "false"
      },
      {
        "acteur": {
          "acteurRef": "PA608158"
        },
        "dateCosignature": "2015-02-11+01:00",
        "dateRetraitCosignature": null,
        "edite": "false"
      },
      {
        "acteur": {
          "acteurRef": "PA609845"
        },
        "dateCosignature": "2015-02-11+01:00",
        "dateRetraitCosignature": null,
        "edite": "false"
      },
      {
        "acteur": {
          "acteurRef": "PA342332"
        },
        "dateCosignature": "2015-02-11+01:00",
        "dateRetraitCosignature": null,
        "edite": "false"
      },
      {
        "acteur": {
          "acteurRef": "PA605143"
        },
        "dateCosignature": "2015-02-11+01:00",
        "dateRetraitCosignature": null,
        "edite": "false"
      },
      {
        "acteur": {
          "acteurRef": "PA508"
        },
        "dateCosignature": "2015-02-11+01:00",
        "dateRetraitCosignature": null,
        "edite": "false"
      },
      {
        "acteur": {
          "acteurRef": "PA536"
        },
        "dateCosignature": "2015-02-11+01:00",
        "dateRetraitCosignature": null,
        "edite": "false"
      },
      {
        "acteur": {
          "acteurRef": "PA606149"
        },
        "dateCosignature": "2015-02-11+01:00",
        "dateRetraitCosignature": null,
        "edite": "false"
      },
      {
        "acteur": {
          "acteurRef": "PA560"
        },
        "dateCosignature": "2015-02-11+01:00",
        "dateRetraitCosignature": null,
        "edite": "false"
      },
      {
        "acteur": {
          "acteurRef": "PA606363"
        },
        "dateCosignature": "2015-02-11+01:00",
        "dateRetraitCosignature": null,
        "edite": "false"
      },
      {
        "acteur": {
          "acteurRef": "PA267233"
        },
        "dateCosignature": "2015-02-11+01:00",
        "dateRetraitCosignature": null,
        "edite": "false"
      },
      {
        "acteur": {
          "acteurRef": "PA605830"
        },
        "dateCosignature": "2015-02-11+01:00",
        "dateRetraitCosignature": null,
        "edite": "false"
      },
      {
        "acteur": {
          "acteurRef": "PA609314"
        },
        "dateCosignature": "2015-02-11+01:00",
        "dateRetraitCosignature": null,
        "edite": "false"
      },
      {
        "acteur": {
          "acteurRef": "PA606745"
        },
        "dateCosignature": "2015-02-11+01:00",
        "dateRetraitCosignature": null,
        "edite": "false"
      },
      {
        "acteur": {
          "acteurRef": "PA642739"
        },
        "dateCosignature": "2015-02-11+01:00",
        "dateRetraitCosignature": null,
        "edite": "false"
      },
      {
        "acteur": {
          "acteurRef": "PA605261"
        },
        "dateCosignature": "2015-02-11+01:00",
        "dateRetraitCosignature": null,
        "edite": "false"
      },
      {
        "acteur": {
          "acteurRef": "PA609535"
        },
        "dateCosignature": "2015-02-11+01:00",
        "dateRetraitCosignature": null,
        "edite": "false"
      },
      {
        "acteur": {
          "acteurRef": "PA695"
        },
        "dateCosignature": "2015-02-11+01:00",
        "dateRetraitCosignature": null,
        "edite": "false"
      },
      {
        "acteur": {
          "acteurRef": "PA605643"
        },
        "dateCosignature": "2015-02-11+01:00",
        "dateRetraitCosignature": null,
        "edite": "false"
      },
      {
        "acteur": {
          "acteurRef": "PA608264"
        },
        "dateCosignature": "2015-02-11+01:00",
        "dateRetraitCosignature": null,
        "edite": "false"
      },
      {
        "acteur": {
          "acteurRef": "PA642940"
        },
        "dateCosignature": "2015-02-11+01:00",
        "dateRetraitCosignature": null,
        "edite": "false"
      },
      {
        "acteur": {
          "acteurRef": "PA770"
        },
        "dateCosignature": "2015-02-11+01:00",
        "dateRetraitCosignature": null,
        "edite": "false"
      },
      {
        "acteur": {
          "acteurRef": "PA606665"
        },
        "dateCosignature": "2015-02-11+01:00",
        "dateRetraitCosignature": null,
        "edite": "false"
      },
      {
        "acteur": {
          "acteurRef": "PA609222"
        },
        "dateCosignature": "2015-02-11+01:00",
        "dateRetraitCosignature": null,
        "edite": "false"
      },
      {
        "acteur": {
          "acteurRef": "PA609042"
        },
        "dateCosignature": "2015-02-11+01:00",
        "dateRetraitCosignature": null,
        "edite": "false"
      },
      {
        "acteur": {
          "acteurRef": "PA872"
        },
        "dateCosignature": "2015-02-11+01:00",
        "dateRetraitCosignature": null,
        "edite": "false"
      },
      {
        "acteur": {
          "acteurRef": "PA336439"
        },
        "dateCosignature": "2015-02-11+01:00",
        "dateRetraitCosignature": null,
        "edite": "false"
      },
      {
        "acteur": {
          "acteurRef": "PA610891"
        },
        "dateCosignature": "2015-02-11+01:00",
        "dateRetraitCosignature": null,
        "edite": "false"
      },
      {
        "acteur": {
          "acteurRef": "PA344114"
        },
        "dateCosignature": "2015-02-11+01:00",
        "dateRetraitCosignature": null,
        "edite": "false"
      },
      {
        "acteur": {
          "acteurRef": "PA336421"
        },
        "dateCosignature": "2015-02-11+01:00",
        "dateRetraitCosignature": null,
        "edite": "false"
      },
      {
        "acteur": {
          "acteurRef": "PA608310"
        },
        "dateCosignature": "2015-02-11+01:00",
        "dateRetraitCosignature": null,
        "edite": "false"
      },
      {
        "acteur": {
          "acteurRef": "PA334811"
        },
        "dateCosignature": "2015-02-11+01:00",
        "dateRetraitCosignature": null,
        "edite": "false"
      },
      {
        "acteur": {
          "acteurRef": "PA608920"
        },
        "dateCosignature": "2015-02-11+01:00",
        "dateRetraitCosignature": null,
        "edite": "false"
      },
      {
        "acteur": {
          "acteurRef": "PA607155"
        },
        "dateCosignature": "2015-02-11+01:00",
        "dateRetraitCosignature": null,
        "edite": "false"
      },
      {
        "acteur": {
          "acteurRef": "PA267623"
        },
        "dateCosignature": "2015-02-11+01:00",
        "dateRetraitCosignature": null,
        "edite": "false"
      },
      {
        "acteur": {
          "acteurRef": "PA267923"
        },
        "dateCosignature": "2015-02-11+01:00",
        "dateRetraitCosignature": null,
        "edite": "false"
      },
      {
        "acteur": {
          "acteurRef": "PA609435"
        },
        "dateCosignature": "2015-02-11+01:00",
        "dateRetraitCosignature": null,
        "edite": "false"
      },
      {
        "acteur": {
          "acteurRef": "PA606040"
        },
        "dateCosignature": "2015-02-11+01:00",
        "dateRetraitCosignature": null,
        "edite": "false"
      },
      {
        "acteur": {
          "acteurRef": "PA606573"
        },
        "dateCosignature": "2015-02-11+01:00",
        "dateRetraitCosignature": null,
        "edite": "false"
      },
      {
        "acteur": {
          "acteurRef": "PA606412"
        },
        "dateCosignature": "2015-02-11+01:00",
        "dateRetraitCosignature": null,
        "edite": "false"
      },
      {
        "acteur": {
          "acteurRef": "PA1182"
        },
        "dateCosignature": "2015-02-11+01:00",
        "dateRetraitCosignature": null,
        "edite": "false"
      },
      {
        "acteur": {
          "acteurRef": "PA1193"
        },
        "dateCosignature": "2015-02-11+01:00",
        "dateRetraitCosignature": null,
        "edite": "false"
      },
      {
        "acteur": {
          "acteurRef": "PA1198"
        },
        "dateCosignature": "2015-02-11+01:00",
        "dateRetraitCosignature": null,
        "edite": "false"
      },
      {
        "acteur": {
          "acteurRef": "PA1208"
        },
        "dateCosignature": "2015-02-11+01:00",
        "dateRetraitCosignature": null,
        "edite": "false"
      },
      {
        "acteur": {
          "acteurRef": "PA607193"
        },
        "dateCosignature": "2015-02-11+01:00",
        "dateRetraitCosignature": null,
        "edite": "false"
      },
      {
        "acteur": {
          "acteurRef": "PA609332"
        },
        "dateCosignature": "2015-02-11+01:00",
        "dateRetraitCosignature": null,
        "edite": "false"
      },
      {
        "acteur": {
          "acteurRef": "PA333335"
        },
        "dateCosignature": "2015-02-11+01:00",
        "dateRetraitCosignature": null,
        "edite": "false"
      },
      {
        "acteur": {
          "acteurRef": "PA606171"
        },
        "dateCosignature": "2015-02-11+01:00",
        "dateRetraitCosignature": null,
        "edite": "false"
      },
      {
        "acteur": {
          "acteurRef": "PA609691"
        },
        "dateCosignature": "2015-02-11+01:00",
        "dateRetraitCosignature": null,
        "edite": "false"
      },
      {
        "acteur": {
          "acteurRef": "PA1362"
        },
        "dateCosignature": "2015-02-11+01:00",
        "dateRetraitCosignature": null,
        "edite": "false"
      },
      {
        "acteur": {
          "acteurRef": "PA2374"
        },
        "dateCosignature": "2015-02-11+01:00",
        "dateRetraitCosignature": null,
        "edite": "false"
      },
      {
        "acteur": {
          "acteurRef": "PA1401"
        },
        "dateCosignature": "2015-02-11+01:00",
        "dateRetraitCosignature": null,
        "edite": "false"
      },
      {
        "acteur": {
          "acteurRef": "PA608038"
        },
        "dateCosignature": "2015-02-11+01:00",
        "dateRetraitCosignature": null,
        "edite": "false"
      },
      {
        "acteur": {
          "acteurRef": "PA336971"
        },
        "dateCosignature": "2015-02-11+01:00",
        "dateRetraitCosignature": null,
        "edite": "false"
      },
      {
        "acteur": {
          "acteurRef": "PA642836"
        },
        "dateCosignature": "2015-02-11+01:00",
        "dateRetraitCosignature": null,
        "edite": "false"
      },
      {
        "acteur": {
          "acteurRef": "PA331973"
        },
        "dateCosignature": "2015-02-11+01:00",
        "dateRetraitCosignature": null,
        "edite": "false"
      },
      {
        "acteur": {
          "acteurRef": "PA333043"
        },
        "dateCosignature": "2015-02-11+01:00",
        "dateRetraitCosignature": null,
        "edite": "false"
      },
      {
        "acteur": {
          "acteurRef": "PA605804"
        },
        "dateCosignature": "2015-02-11+01:00",
        "dateRetraitCosignature": null,
        "edite": "false"
      },
      {
        "acteur": {
          "acteurRef": "PA609218"
        },
        "dateCosignature": "2015-02-11+01:00",
        "dateRetraitCosignature": null,
        "edite": "false"
      },
      {
        "acteur": {
          "acteurRef": "PA336015"
        },
        "dateCosignature": "2015-02-11+01:00",
        "dateRetraitCosignature": null,
        "edite": "false"
      },
      {
        "acteur": {
          "acteurRef": "PA608684"
        },
        "dateCosignature": "2015-02-11+01:00",
        "dateRetraitCosignature": null,
        "edite": "false"
      },
      {
        "acteur": {
          "acteurRef": "PA606161"
        },
        "dateCosignature": "2015-02-11+01:00",
        "dateRetraitCosignature": null,
        "edite": "false"
      },
      {
        "acteur": {
          "acteurRef": "PA1592"
        },
        "dateCosignature": "2015-02-11+01:00",
        "dateRetraitCosignature": null,
        "edite": "false"
      },
      {
        "acteur": {
          "acteurRef": "PA610291"
        },
        "dateCosignature": "2015-02-11+01:00",
        "dateRetraitCosignature": null,
        "edite": "false"
      },
      {
        "acteur": {
          "acteurRef": "PA606924"
        },
        "dateCosignature": "2015-02-11+01:00",
        "dateRetraitCosignature": null,
        "edite": "false"
      },
      {
        "acteur": {
          "acteurRef": "PA1689"
        },
        "dateCosignature": "2015-02-11+01:00",
        "dateRetraitCosignature": null,
        "edite": "false"
      },
      {
        "acteur": {
          "acteurRef": "PA1710"
        },
        "dateCosignature": "2015-02-11+01:00",
        "dateRetraitCosignature": null,
        "edite": "false"
      },
      {
        "acteur": {
          "acteurRef": "PA332614"
        },
        "dateCosignature": "2015-02-11+01:00",
        "dateRetraitCosignature": null,
        "edite": "false"
      },
      {
        "acteur": {
          "acteurRef": "PA1748"
        },
        "dateCosignature": "2015-02-11+01:00",
        "dateRetraitCosignature": null,
        "edite": "false"
      },
      {
        "acteur": {
          "acteurRef": "PA607691"
        },
        "dateCosignature": "2015-02-11+01:00",
        "dateRetraitCosignature": null,
        "edite": "false"
      },
      {
        "acteur": {
          "acteurRef": "PA335054"
        },
        "dateCosignature": "2015-02-11+01:00",
        "dateRetraitCosignature": null,
        "edite": "false"
      },
      {
        "acteur": {
          "acteurRef": "PA607509"
        },
        "dateCosignature": "2015-02-11+01:00",
        "dateRetraitCosignature": null,
        "edite": "false"
      },
      {
        "acteur": {
          "acteurRef": "PA1844"
        },
        "dateCosignature": "2015-02-11+01:00",
        "dateRetraitCosignature": null,
        "edite": "false"
      },
      {
        "acteur": {
          "acteurRef": "PA267835"
        },
        "dateCosignature": "2015-02-11+01:00",
        "dateRetraitCosignature": null,
        "edite": "false"
      },
      {
        "acteur": {
          "acteurRef": "PA606555"
        },
        "dateCosignature": "2015-02-11+01:00",
        "dateRetraitCosignature": null,
        "edite": "false"
      },
      {
        "acteur": {
          "acteurRef": "PA341246"
        },
        "dateCosignature": "2015-02-11+01:00",
        "dateRetraitCosignature": null,
        "edite": "false"
      },
      {
        "acteur": {
          "acteurRef": "PA610594"
        },
        "dateCosignature": "2015-02-11+01:00",
        "dateRetraitCosignature": null,
        "edite": "false"
      },
      {
        "acteur": {
          "acteurRef": "PA331658"
        },
        "dateCosignature": "2015-02-11+01:00",
        "dateRetraitCosignature": null,
        "edite": "false"
      },
      {
        "acteur": {
          "acteurRef": "PA1936"
        },
        "dateCosignature": "2015-02-11+01:00",
        "dateRetraitCosignature": null,
        "edite": "false"
      },
      {
        "acteur": {
          "acteurRef": "PA605278"
        },
        "dateCosignature": "2015-02-11+01:00",
        "dateRetraitCosignature": null,
        "edite": "false"
      },
      {
        "acteur": {
          "acteurRef": "PA607606"
        },
        "dateCosignature": "2015-02-11+01:00",
        "dateRetraitCosignature": null,
        "edite": "false"
      },
      {
        "acteur": {
          "acteurRef": "PA330130"
        },
        "dateCosignature": "2015-02-11+01:00",
        "dateRetraitCosignature": null,
        "edite": "false"
      },
      {
        "acteur": {
          "acteurRef": "PA1977"
        },
        "dateCosignature": "2015-02-11+01:00",
        "dateRetraitCosignature": null,
        "edite": "false"
      },
      {
        "acteur": {
          "acteurRef": "PA607761"
        },
        "dateCosignature": "2015-02-11+01:00",
        "dateRetraitCosignature": null,
        "edite": "false"
      },
      {
        "acteur": {
          "acteurRef": "PA1991"
        },
        "dateCosignature": "2015-02-11+01:00",
        "dateRetraitCosignature": null,
        "edite": "false"
      },
      {
        "acteur": {
          "acteurRef": "PA607283"
        },
        "dateCosignature": "2015-02-11+01:00",
        "dateRetraitCosignature": null,
        "edite": "false"
      },
      {
        "acteur": {
          "acteurRef": "PA330546"
        },
        "dateCosignature": "2015-02-11+01:00",
        "dateRetraitCosignature": null,
        "edite": "false"
      },
      {
        "acteur": {
          "acteurRef": "PA332206"
        },
        "dateCosignature": "2015-02-11+01:00",
        "dateRetraitCosignature": null,
        "edite": "false"
      },
      {
        "acteur": {
          "acteurRef": "PA267278"
        },
        "dateCosignature": "2015-02-11+01:00",
        "dateRetraitCosignature": null,
        "edite": "false"
      },
      {
        "acteur": {
          "acteurRef": "PA267091"
        },
        "dateCosignature": "2015-02-11+01:00",
        "dateRetraitCosignature": null,
        "edite": "false"
      },
      {
        "acteur": {
          "acteurRef": "PA335319"
        },
        "dateCosignature": "2015-02-11+01:00",
        "dateRetraitCosignature": null,
        "edite": "false"
      },
      {
        "acteur": {
          "acteurRef": "PA332796"
        },
        "dateCosignature": "2015-02-11+01:00",
        "dateRetraitCosignature": null,
        "edite": "false"
      },
      {
        "acteur": {
          "acteurRef": "PA606030"
        },
        "dateCosignature": "2015-02-11+01:00",
        "dateRetraitCosignature": null,
        "edite": "false"
      },
      {
        "acteur": {
          "acteurRef": "PA610729"
        },
        "dateCosignature": "2015-02-11+01:00",
        "dateRetraitCosignature": null,
        "edite": "false"
      },
      {
        "acteur": {
          "acteurRef": "PA267534"
        },
        "dateCosignature": "2015-02-11+01:00",
        "dateRetraitCosignature": null,
        "edite": "false"
      },
      {
        "acteur": {
          "acteurRef": "PA2338"
        },
        "dateCosignature": "2015-02-11+01:00",
        "dateRetraitCosignature": null,
        "edite": "false"
      },
      {
        "acteur": {
          "acteurRef": "PA2343"
        },
        "dateCosignature": "2015-02-11+01:00",
        "dateRetraitCosignature": null,
        "edite": "false"
      },
      {
        "acteur": {
          "acteurRef": "PA607595"
        },
        "dateCosignature": "2015-02-11+01:00",
        "dateRetraitCosignature": null,
        "edite": "false"
      },
      {
        "acteur": {
          "acteurRef": "PA610075"
        },
        "dateCosignature": "2015-02-11+01:00",
        "dateRetraitCosignature": null,
        "edite": "false"
      },
      {
        "acteur": {
          "acteurRef": "PA608172"
        },
        "dateCosignature": "2015-02-11+01:00",
        "dateRetraitCosignature": null,
        "edite": "false"
      },
      {
        "acteur": {
          "acteurRef": "PA2430"
        },
        "dateCosignature": "2015-02-11+01:00",
        "dateRetraitCosignature": null,
        "edite": "false"
      },
      {
        "acteur": {
          "acteurRef": "PA610354"
        },
        "dateCosignature": "2015-02-11+01:00",
        "dateRetraitCosignature": null,
        "edite": "false"
      },
      {
        "acteur": {
          "acteurRef": "PA606225"
        },
        "dateCosignature": "2015-02-11+01:00",
        "dateRetraitCosignature": null,
        "edite": "false"
      },
      {
        "acteur": {
          "acteurRef": "PA331014"
        },
        "dateCosignature": "2015-02-11+01:00",
        "dateRetraitCosignature": null,
        "edite": "false"
      },
      {
        "acteur": {
          "acteurRef": "PA607187"
        },
        "dateCosignature": "2015-02-11+01:00",
        "dateRetraitCosignature": null,
        "edite": "false"
      },
      {
        "acteur": {
          "acteurRef": "PA2503"
        },
        "dateCosignature": "2015-02-11+01:00",
        "dateRetraitCosignature": null,
        "edite": "false"
      },
      {
        "acteur": {
          "acteurRef": "PA341981"
        },
        "dateCosignature": "2015-02-11+01:00",
        "dateRetraitCosignature": null,
        "edite": "false"
      },
      {
        "acteur": {
          "acteurRef": "PA2549"
        },
        "dateCosignature": "2015-02-11+01:00",
        "dateRetraitCosignature": null,
        "edite": "false"
      },
      {
        "acteur": {
          "acteurRef": "PA606991"
        },
        "dateCosignature": "2015-02-11+01:00",
        "dateRetraitCosignature": null,
        "edite": "false"
      },
      {
        "acteur": {
          "acteurRef": "PA606586"
        },
        "dateCosignature": "2015-02-11+01:00",
        "dateRetraitCosignature": null,
        "edite": "false"
      },
      {
        "acteur": {
          "acteurRef": "PA605952"
        },
        "dateCosignature": "2015-02-11+01:00",
        "dateRetraitCosignature": null,
        "edite": "false"
      },
      {
        "acteur": {
          "acteurRef": "PA2611"
        },
        "dateCosignature": "2015-02-11+01:00",
        "dateRetraitCosignature": null,
        "edite": "false"
      },
      {
        "acteur": {
          "acteurRef": "PA2631"
        },
        "dateCosignature": "2015-02-11+01:00",
        "dateRetraitCosignature": null,
        "edite": "false"
      },
      {
        "acteur": {
          "acteurRef": "PA608778"
        },
        "dateCosignature": "2015-02-11+01:00",
        "dateRetraitCosignature": null,
        "edite": "false"
      },
      {
        "acteur": {
          "acteurRef": "PA2693"
        },
        "dateCosignature": "2015-02-11+01:00",
        "dateRetraitCosignature": null,
        "edite": "false"
      },
      {
        "acteur": {
          "acteurRef": "PA606495"
        },
        "dateCosignature": "2015-02-11+01:00",
        "dateRetraitCosignature": null,
        "edite": "false"
      },
      {
        "acteur": {
          "acteurRef": "PA2799"
        },
        "dateCosignature": "2015-02-11+01:00",
        "dateRetraitCosignature": null,
        "edite": "false"
      },
      {
        "acteur": {
          "acteurRef": "PA608741"
        },
        "dateCosignature": "2015-02-11+01:00",
        "dateRetraitCosignature": null,
        "edite": "false"
      },
      {
        "acteur": {
          "acteurRef": "PA334768"
        },
        "dateCosignature": "2015-02-11+01:00",
        "dateRetraitCosignature": null,
        "edite": "false"
      },
      {
        "acteur": {
          "acteurRef": "PA607395"
        },
        "dateCosignature": "2015-02-11+01:00",
        "dateRetraitCosignature": null,
        "edite": "false"
      },
      {
        "acteur": {
          "acteurRef": "PA608695"
        },
        "dateCosignature": "2015-02-11+01:00",
        "dateRetraitCosignature": null,
        "edite": "false"
      },
      {
        "acteur": {
          "acteurRef": "PA336112"
        },
        "dateCosignature": "2015-02-11+01:00",
        "dateRetraitCosignature": null,
        "edite": "false"
      },
      {
        "acteur": {
          "acteurRef": "PA605606"
        },
        "dateCosignature": "2015-02-11+01:00",
        "dateRetraitCosignature": null,
        "edite": "false"
      },
      {
        "acteur": {
          "acteurRef": "PA642788"
        },
        "dateCosignature": "2015-02-11+01:00",
        "dateRetraitCosignature": null,
        "edite": "false"
      },
      {
        "acteur": {
          "acteurRef": "PA606230"
        },
        "dateCosignature": "2015-02-11+01:00",
        "dateRetraitCosignature": null,
        "edite": "false"
      },
      {
        "acteur": {
          "acteurRef": "PA2895"
        },
        "dateCosignature": "2015-02-11+01:00",
        "dateRetraitCosignature": null,
        "edite": "false"
      },
      {
        "acteur": {
          "acteurRef": "PA334951"
        },
        "dateCosignature": "2015-02-11+01:00",
        "dateRetraitCosignature": null,
        "edite": "false"
      },
      {
        "acteur": {
          "acteurRef": "PA605349"
        },
        "dateCosignature": "2015-02-14+01:00",
        "dateRetraitCosignature": null,
        "edite": "false"
      }
    ]
  },
  "depotAmendements": {
    "amendementsSeance": {
      "amendable": "false",
      "dateLimiteDepot": null
    },
    "amendementsCommission": {
      "commission": [
        {
          "organeRef": "PO59051",
          "amendable": "true",
          "dateLimiteDepot": null
        },
        {
          "organeRef": "PO419865",
          "amendable": "true",
          "dateLimiteDepot": null
        },
        {
          "organeRef": "PO419610",
          "amendable": "true",
          "dateLimiteDepot": null
        }
      ]
    }
  }
}