{
  "@xsi:type": "DossierLegislatif_Type",
  "uid": "DLR5L14N35818",
  "legislature": "14",
  "titreDossier": {
    "titre": "Economie : réforme du droit des contrats, du régime général et de la preuve des obligations",
    "titreChemin": "ratification_ordonnance_2016_131",
    "senatChemin": "http://www.senat.fr/dossier-legislatif/pjl16-578.html"
  },
  "procedureParlementaire": {
    "code": "1",
    "libelle": "Projet de loi ordinaire"
  },
  "initiateur": {
    "acteurs": {
      "acteur": {
        "acteurRef": "PA345619",
        "mandatRef": "PM717221"
      }
    }
  },
  "actesLegislatifs": {
    "acteLegislatif": [
      {
        "@xsi:type": "Etape_Type",
        "uid": "L14-SN1-35818",
        "codeActe": "SN1",
        "libelleActe": {
          "nomCanonique": "1ère lecture (1ère assemblée saisie)",
          "libelleCourt": "1ère lecture"
        },
        "organeRef": "PO78718",
        "dateActe": null,
        "actesLegislatifs": {
          "acteLegislatif": [
            {
              "@xsi:type": "DepotInitiative_Type",
              "uid": "L14-VD181911DI",
              "codeActe": "SN1-DEPOT",
              "libelleActe": {
                "nomCanonique": "1er dépôt d'une initiative.",
                "libelleCourt": "1er dépôt d'une initiative."
              },
              "organeRef": "PO78718",
              "dateActe": "2017-06-09T00:00:00.000+02:00",
              "actesLegislatifs": null,
              "texteAssocie": "PRJLSNR5S279B0578"
            },
            {
              "@xsi:type": "Etape_Type",
              "uid": "L14-SN1-COM-35818",
              "codeActe": "SN1-COM",
              "libelleActe": {
                "nomCanonique": "Travaux des commissions",
                "libelleCourt": "Travaux des commissions"
              },
              "organeRef": "PO78718",
              "dateActe": null,
              "actesLegislatifs": {
                "acteLegislatif": {
                  "@xsi:type": "Etape_Type",
                  "uid": "L14-VD181912CF",
                  "codeActe": "SN1-COM-FOND",
                  "libelleActe": {
                    "nomCanonique": "Travaux de la commission saisie au fond",
                    "libelleCourt": "Travaux de la commission saisie au fond"
                  },
                  "organeRef": "PO211495",
                  "dateActe": null,
                  "actesLegislatifs": {
                    "acteLegislatif": [
                      {
                        "@xsi:type": "SaisieComFond_Type",
                        "uid": "L14-VD181912CFS",
                        "codeActe": "SN1-COM-FOND-SAISIE",
                        "libelleActe": {
                          "nomCanonique": "Renvoi en commission au fond",
                          "libelleCourt": "Renvoi en commission au fond"
                        },
                        "organeRef": "PO211495",
                        "dateActe": "2017-06-09T00:00:00.000+02:00",
                        "actesLegislatifs": null
                      },
                      {
                        "@xsi:type": "NominRapporteurs_Type",
                        "uid": "L14-VD183014",
                        "codeActe": "SN1-COM-FOND-NOMIN",
                        "libelleActe": {
                          "nomCanonique": "Nomination de rapporteur",
                          "libelleCourt": "Nomination de rapporteur"
                        },
                        "organeRef": "PO211495",
                        "dateActe": "2016-03-02T00:00:00.000+01:00",
                        "actesLegislatifs": null,
                        "rapporteurs": {
                          "rapporteur": {
                            "acteurRef": "PA406065",
                            "typeRapporteur": "rapporteur"
                          }
                        },
                        "reunion": null
                      },
                      {
                        "@xsi:type": "DepotRapport_Type",
                        "uid": "L14-VD183015",
                        "codeActe": "SN1-COM-FOND-RAPPORT",
                        "libelleActe": {
                          "nomCanonique": "Dépôt de rapport",
                          "libelleCourt": "Dépôt de rapport"
                        },
                        "organeRef": "PO211495",
                        "dateActe": "2017-10-11T00:00:00.000+02:00",
                        "actesLegislatifs": null,
                        "texteAssocie": "RAPPSNR5S299B0022",
                        "texteAdopte": null
                      }
                    ]
                  }
                }
              }
            },
            {
              "@xsi:type": "Etape_Type",
              "uid": "L14-SN1-DEBATS-35818",
              "codeActe": "SN1-DEBATS",
              "libelleActe": {
                "nomCanonique": "Discussion en séance publique",
                "libelleCourt": "Discussion en séance publique"
              },
              "organeRef": "PO78718",
              "dateActe": null,
              "actesLegislatifs": {
                "acteLegislatif": [
                  {
                    "@xsi:type": "DiscussionSeancePublique_Type",
                    "uid": "L15-VD182917S35160",
                    "codeActe": "SN1-DEBATS-SEANCE",
                    "libelleActe": {
                      "nomCanonique": "Discussion en séance publique",
                      "libelleCourt": "Discussion en séance publique"
                    },
                    "organeRef": "PO78718",
                    "dateActe": "2017-10-17T00:00:00.000+02:00",
                    "actesLegislatifs": null,
                    "reunionRef": "RUSNR5L15S2018IDS20720",
                    "odjRef": "RUSNR5L15S2018IDS20720PT35160"
                  },
                  {
                    "@xsi:type": "Decision_Type",
                    "uid": "L15-VD183092DEC",
                    "codeActe": "SN1-DEBATS-DEC",
                    "libelleActe": {
                      "nomCanonique": "Décision",
                      "libelleCourt": "Décision"
                    },
                    "organeRef": "PO78718",
                    "dateActe": "2017-10-17T00:00:00.000+02:00",
                    "actesLegislatifs": null,
                    "reunionRef": "RUSNR5L15S2018IDS20720",
                    "statutConclusion": {
                      "fam_code": "TSORTF01",
                      "libelle": "adopté"
                    },
                    "voteRefs": null,
                    "textesAssocies": {
                      "texteAssocie": {
                        "typeTexte": "BTA",
                        "refTexteAssocie": "PRJLSNR5S299BTA0005"
                      }
                    }
                  }
                ]
              }
            }
          ]
        }
      },
      {
        "@xsi:type": "Etape_Type",
        "uid": "L15-AN1-35818",
        "codeActe": "AN1",
        "libelleActe": {
          "nomCanonique": "1ère lecture (2ème assemblée saisie)",
          "libelleCourt": "1ère lecture"
        },
        "organeRef": "PO717460",
        "dateActe": null,
        "actesLegislatifs": {
          "acteLegislatif": [
            {
              "@xsi:type": "DepotInitiativeNavette_Type",
              "uid": "L15-VD183102DIN",
              "codeActe": "AN1-DEPOT",
              "libelleActe": {
                "nomCanonique": "Dépôt d'une initiative en navette",
                "libelleCourt": "Dépôt d'une initiative en navette"
              },
              "organeRef": "PO717460",
              "dateActe": "2017-10-18T00:00:00.000+02:00",
              "actesLegislatifs": null,
              "texteAssocie": "PRJLANR5L15B0315",
              "provenance": "PO78718"
            },
            {
              "@xsi:type": "Etape_Type",
              "uid": "L15-AN1-COM-35818",
              "codeActe": "AN1-COM",
              "libelleActe": {
                "nomCanonique": "Travaux des commissions",
                "libelleCourt": "Travaux des commissions"
              },
              "organeRef": "PO717460",
              "dateActe": null,
              "actesLegislatifs": {
                "acteLegislatif": {
                  "@xsi:type": "Etape_Type",
                  "uid": "L15-VD183103CF",
                  "codeActe": "AN1-COM-FOND",
                  "libelleActe": {
                    "nomCanonique": "Travaux de la commission saisie au fond",
                    "libelleCourt": "Travaux de la commission saisie au fond"
                  },
                  "organeRef": "PO59051",
                  "dateActe": null,
                  "actesLegislatifs": {
                    "acteLegislatif": [
                      {
                        "@xsi:type": "SaisieComFond_Type",
                        "uid": "L15-VD183103CFS",
                        "codeActe": "AN1-COM-FOND-SAISIE",
                        "libelleActe": {
                          "nomCanonique": "Renvoi en commission au fond",
                          "libelleCourt": "Renvoi en commission au fond"
                        },
                        "organeRef": "PO59051",
                        "dateActe": "2017-10-18T00:00:00.000+02:00",
                        "actesLegislatifs": null
                      },
                      {
                        "@xsi:type": "NominRapporteurs_Type",
                        "uid": "L14-VD183309",
                        "codeActe": "AN1-COM-FOND-NOMIN",
                        "libelleActe": {
                          "nomCanonique": "Nomination de rapporteur",
                          "libelleCourt": "Nomination de rapporteur"
                        },
                        "organeRef": "PO59051",
                        "dateActe": "2017-11-08T00:00:00.000+01:00",
                        "actesLegislatifs": null,
                        "rapporteurs": {
                          "rapporteur": {
                            "acteurRef": "PA722150",
                            "typeRapporteur": "rapporteur"
                          }
                        },
                        "reunion": null
                      },
                      {
                        "@xsi:type": "DiscussionCommission_Type",
                        "uid": "L15-VD183411R25236",
                        "codeActe": "AN1-COM-FOND-REUNION",
                        "libelleActe": {
                          "nomCanonique": "Réunion de commission",
                          "libelleCourt": "Réunion de commission"
                        },
                        "organeRef": "PO59051",
                        "dateActe": "2017-11-21T17:15:00.000+01:00",
                        "actesLegislatifs": null,
                        "reunionRef": null,
                        "odjRef": null
                      },
                      {
                        "@xsi:type": "DiscussionCommission_Type",
                        "uid": "L15-VD183411R25270",
                        "codeActe": "AN1-COM-FOND-REUNION",
                        "libelleActe": {
                          "nomCanonique": "Réunion de commission",
                          "libelleCourt": "Réunion de commission"
                        },
                        "organeRef": "PO59051",
                        "dateActe": "2017-11-29T09:40:00.000+01:00",
                        "actesLegislatifs": null,
                        "reunionRef": "RUANR5L15S2018IDC427925",
                        "odjRef": "RUANR5L15S2018IDC427925PT25270"
                      },
                      {
                        "@xsi:type": "DepotRapport_Type",
                        "uid": "L15-VD183594",
                        "codeActe": "AN1-COM-FOND-RAPPORT",
                        "libelleActe": {
                          "nomCanonique": "Dépôt de rapport",
                          "libelleCourt": "Dépôt de rapport"
                        },
                        "organeRef": "PO59051",
                        "dateActe": "2017-11-29T00:00:00.000+01:00",
                        "actesLegislatifs": null,
                        "texteAssocie": "RAPPANR5L15B0429",
                        "texteAdopte": "PRJLANR5L15BTC0429"
                      }
                    ]
                  }
                }
              }
            },
            {
              "@xsi:type": "Etape_Type",
              "uid": "L15-AN1-DEBATS-35818",
              "codeActe": "AN1-DEBATS",
              "libelleActe": {
                "nomCanonique": "Discussion en séance publique",
                "libelleCourt": "Discussion en séance publique"
              },
              "organeRef": "PO717460",
              "dateActe": null,
              "actesLegislatifs": {
                "acteLegislatif": [
                  {
                    "@xsi:type": "DiscussionSeancePublique_Type",
                    "uid": "L15-VD183421S35345",
                    "codeActe": "AN1-DEBATS-SEANCE",
                    "libelleActe": {
                      "nomCanonique": "Discussion en séance publique",
                      "libelleCourt": "Discussion en séance publique"
                    },
                    "organeRef": "PO717460",
                    "dateActe": "2017-12-11T00:00:00.000+01:00",
                    "actesLegislatifs": null,
                    "reunionRef": "RUANR5L15S2018IDS20830",
                    "odjRef": "RUANR5L15S2018IDS20830PT35345"
                  },
                  {
                    "@xsi:type": "Decision_Type",
                    "uid": "L15-VD183755DEC",
                    "codeActe": "AN1-DEBATS-DEC",
                    "libelleActe": {
                      "nomCanonique": "Décision",
                      "libelleCourt": "Décision"
                    },
                    "organeRef": "PO717460",
                    "dateActe": "2017-12-11T00:00:00.000+01:00",
                    "actesLegislatifs": null,
                    "reunionRef": "RUANR5L15S2018IDS20830",
                    "statutConclusion": {
                      "fam_code": "TSORTF05",
                      "libelle": "modifié"
                    },
                    "voteRefs": null,
                    "textesAssocies": {
                      "texteAssocie": [
                        {
                          "typeTexte": "BTA",
                          "refTexteAssocie": "PRJLANR5L15BTA0046"
                        },
                        {
                          "typeTexte": "TAP",
                          "refTexteAssocie": "PRJLANR5L15TAP0046"
                        }
                      ]
                    }
                  }
                ]
              }
            }
          ]
        }
      },
      {
        "@xsi:type": "Etape_Type",
        "uid": "L15-SN2-35818",
        "codeActe": "SN2",
        "libelleActe": {
          "nomCanonique": "deuxième lecture",
          "libelleCourt": "2ème lecture"
        },
        "organeRef": "PO78718",
        "dateActe": null,
        "actesLegislatifs": {
          "acteLegislatif": [
            {
              "@xsi:type": "DepotInitiativeNavette_Type",
              "uid": "L15-VD183757DIN",
              "codeActe": "SN2-DEPOT",
              "libelleActe": {
                "nomCanonique": "Dépôt d'une initiative en navette",
                "libelleCourt": "Dépôt d'une initiative en navette"
              },
              "organeRef": "PO78718",
              "dateActe": "2017-12-12T00:00:00.000+01:00",
              "actesLegislatifs": null,
              "texteAssocie": "PRJLSNR5S299B0154",
              "provenance": "PO717460"
            },
            {
              "@xsi:type": "Etape_Type",
              "uid": "L15-SN2-COM-35818",
              "codeActe": "SN2-COM",
              "libelleActe": {
                "nomCanonique": "Travaux des commissions",
                "libelleCourt": "Travaux des commissions"
              },
              "organeRef": "PO78718",
              "dateActe": null,
              "actesLegislatifs": {
                "acteLegislatif": {
                  "@xsi:type": "Etape_Type",
                  "uid": "L15-VD183758CF",
                  "codeActe": "SN2-COM-FOND",
                  "libelleActe": {
                    "nomCanonique": "Travaux de la commission saisie au fond",
                    "libelleCourt": "Travaux de la commission saisie au fond"
                  },
                  "organeRef": "PO211495",
                  "dateActe": null,
                  "actesLegislatifs": {
                    "acteLegislatif": [
                      {
                        "@xsi:type": "SaisieComFond_Type",
                        "uid": "L15-VD183758CFS",
                        "codeActe": "SN2-COM-FOND-SAISIE",
                        "libelleActe": {
                          "nomCanonique": "Renvoi en commission au fond",
                          "libelleCourt": "Renvoi en commission au fond"
                        },
                        "organeRef": "PO211495",
                        "dateActe": "2017-12-12T00:00:00.000+01:00",
                        "actesLegislatifs": null
                      },
                      {
                        "@xsi:type": "DepotRapport_Type",
                        "uid": "L14-VD184283",
                        "codeActe": "SN2-COM-FOND-RAPPORT",
                        "libelleActe": {
                          "nomCanonique": "Dépôt de rapport",
                          "libelleCourt": "Dépôt de rapport"
                        },
                        "organeRef": "PO211495",
                        "dateActe": "2018-01-24T00:00:00.000+01:00",
                        "actesLegislatifs": null,
                        "texteAssocie": "RAPPSNR5S299B0247",
                        "texteAdopte": null
                      }
                    ]
                  }
                }
              }
            },
            {
              "@xsi:type": "Etape_Type",
              "uid": "L15-SN2-DEBATS-35818",
              "codeActe": "SN2-DEBATS",
              "libelleActe": {
                "nomCanonique": "Discussion en séance publique",
                "libelleCourt": "Discussion en séance publique"
              },
              "organeRef": "PO78718",
              "dateActe": null,
              "actesLegislatifs": {
                "acteLegislatif": [
                  {
                    "@xsi:type": "DiscussionSeancePublique_Type",
                    "uid": "L15-VD184025S35471",
                    "codeActe": "SN2-DEBATS-SEANCE",
                    "libelleActe": {
                      "nomCanonique": "Discussion en séance publique",
                      "libelleCourt": "Discussion en séance publique"
                    },
                    "organeRef": "PO78718",
                    "dateActe": "2018-02-01T00:00:00.000+01:00",
                    "actesLegislatifs": null,
                    "reunionRef": "RUSNR5L15S2018IDS20882",
                    "odjRef": "RUSNR5L15S2018IDS20882PT35471"
                  },
                  {
                    "@xsi:type": "Decision_Type",
                    "uid": "L15-VD184352DEC",
                    "codeActe": "SN2-DEBATS-DEC",
                    "libelleActe": {
                      "nomCanonique": "Décision",
                      "libelleCourt": "Décision"
                    },
                    "organeRef": "PO78718",
                    "dateActe": "2018-02-01T00:00:00.000+01:00",
                    "actesLegislatifs": null,
                    "reunionRef": "RUSNR5L15S2018IDS20882",
                    "statutConclusion": {
                      "fam_code": "TSORTF02",
                      "libelle": "adopté avec modifications"
                    },
                    "voteRefs": null,
                    "textesAssocies": {
                      "texteAssocie": {
                        "typeTexte": "BTA",
                        "refTexteAssocie": "PRJLSNR5S299BTA0054"
                      }
                    }
                  }
                ]
              }
            }
          ]
        }
      },
      {
        "@xsi:type": "Etape_Type",
        "uid": "L15-AN2-35818",
        "codeActe": "AN2",
        "libelleActe": {
          "nomCanonique": "deuxième lecture",
          "libelleCourt": "2ème lecture"
        },
        "organeRef": "PO717460",
        "dateActe": null,
        "actesLegislatifs": {
          "acteLegislatif": [
            {
              "@xsi:type": "DepotInitiativeNavette_Type",
              "uid": "L15-VD184361DIN",
              "codeActe": "AN2-DEPOT",
              "libelleActe": {
                "nomCanonique": "Dépôt d'une initiative en navette",
                "libelleCourt": "Dépôt d'une initiative en navette"
              },
              "organeRef": "PO717460",
              "dateActe": "2018-02-01T00:00:00.000+01:00",
              "actesLegislatifs": null,
              "texteAssocie": "PRJLANR5L15B0629",
              "provenance": "PO78718"
            },
            {
              "@xsi:type": "Etape_Type",
              "uid": "L15-AN2-COM-35818",
              "codeActe": "AN2-COM",
              "libelleActe": {
                "nomCanonique": "Travaux des commissions",
                "libelleCourt": "Travaux des commissions"
              },
              "organeRef": "PO717460",
              "dateActe": null,
              "actesLegislatifs": {
                "acteLegislatif": {
                  "@xsi:type": "Etape_Type",
                  "uid": "L15-VD184362CF",
                  "codeActe": "AN2-COM-FOND",
                  "libelleActe": {
                    "nomCanonique": "Travaux de la commission saisie au fond",
                    "libelleCourt": "Travaux de la commission saisie au fond"
                  },
                  "organeRef": "PO59051",
                  "dateActe": null,
                  "actesLegislatifs": {
                    "acteLegislatif": [
                      {
                        "@xsi:type": "SaisieComFond_Type",
                        "uid": "L15-VD184362CFS",
                        "codeActe": "AN2-COM-FOND-SAISIE",
                        "libelleActe": {
                          "nomCanonique": "Renvoi en commission au fond",
                          "libelleCourt": "Renvoi en commission au fond"
                        },
                        "organeRef": "PO59051",
                        "dateActe": "2018-02-01T00:00:00.000+01:00",
                        "actesLegislatifs": null
                      },
                      {
                        "@xsi:type": "DiscussionCommission_Type",
                        "uid": "L15-VD184369R25436",
                        "codeActe": "AN2-COM-FOND-REUNION",
                        "libelleActe": {
                          "nomCanonique": "Réunion de commission",
                          "libelleCourt": "Réunion de commission"
                        },
                        "organeRef": "PO59051",
                        "dateActe": "2018-02-07T09:40:00.000+01:00",
                        "actesLegislatifs": null,
                        "reunionRef": null,
                        "odjRef": null
                      },
                      {
                        "@xsi:type": "DiscussionCommission_Type",
                        "uid": "L15-VD184369R25438",
                        "codeActe": "AN2-COM-FOND-REUNION",
                        "libelleActe": {
                          "nomCanonique": "Réunion de commission",
                          "libelleCourt": "Réunion de commission"
                        },
                        "organeRef": "PO59051",
                        "dateActe": "2018-02-15T11:35:00.000+01:00",
                        "actesLegislatifs": null,
                        "reunionRef": null,
                        "odjRef": null
                      },
                      {
                        "@xsi:type": "DepotRapport_Type",
                        "uid": "L15-VD184414",
                        "codeActe": "AN2-COM-FOND-RAPPORT",
                        "libelleActe": {
                          "nomCanonique": "Dépôt de rapport",
                          "libelleCourt": "Dépôt de rapport"
                        },
                        "organeRef": "PO59051",
                        "dateActe": "2018-02-07T00:00:00.000+01:00",
                        "actesLegislatifs": null,
                        "texteAssocie": "RAPPANR5L15B0639",
                        "texteAdopte": "PRJLANR5L15BTC0639"
                      }
                    ]
                  }
                }
              }
            },
            {
              "@xsi:type": "Etape_Type",
              "uid": "L15-AN2-DEBATS-35818",
              "codeActe": "AN2-DEBATS",
              "libelleActe": {
                "nomCanonique": "Discussion en séance publique",
                "libelleCourt": "Discussion en séance publique"
              },
              "organeRef": "PO717460",
              "dateActe": null,
              "actesLegislatifs": {
                "acteLegislatif": [
                  {
                    "@xsi:type": "DiscussionSeancePublique_Type",
                    "uid": "L15-VD184384S35567",
                    "codeActe": "AN2-DEBATS-SEANCE",
                    "libelleActe": {
                      "nomCanonique": "Discussion en séance publique",
                      "libelleCourt": "Discussion en séance publique"
                    },
                    "organeRef": "PO717460",
                    "dateActe": "2018-02-15T00:00:00.000+01:00",
                    "actesLegislatifs": null,
                    "reunionRef": "RUANR5L15S2018IDS20915",
                    "odjRef": "RUANR5L15S2018IDS20915PT35567"
                  },
                  {
                    "@xsi:type": "DiscussionSeancePublique_Type",
                    "uid": "L15-VD184384S35578",
                    "codeActe": "AN2-DEBATS-SEANCE",
                    "libelleActe": {
                      "nomCanonique": "Discussion en séance publique",
                      "libelleCourt": "Discussion en séance publique"
                    },
                    "organeRef": "PO717460",
                    "dateActe": "2018-02-15T00:00:00.000+01:00",
                    "actesLegislatifs": null,
                    "reunionRef": "RUANR5L15S2018IDS20916",
                    "odjRef": "RUANR5L15S2018IDS20916PT35578"
                  },
                  {
                    "@xsi:type": "Decision_Type",
                    "uid": "L15-VD184587DEC",
                    "codeActe": "AN2-DEBATS-DEC",
                    "libelleActe": {
                      "nomCanonique": "Décision",
                      "libelleCourt": "Décision"
                    },
                    "organeRef": "PO717460",
                    "dateActe": "2018-02-15T00:00:00.000+01:00",
                    "actesLegislatifs": null,
                    "reunionRef": "RUANR5L15S2018IDS20916",
                    "statutConclusion": {
                      "fam_code": "TSORTF05",
                      "libelle": "modifié"
                    },
                    "voteRefs": null,
                    "textesAssocies": {
                      "texteAssocie": [
                        {
                          "typeTexte": "BTA",
                          "refTexteAssocie": "PRJLANR5L15BTA0091"
                        },
                        {
                          "typeTexte": "TAP",
                          "refTexteAssocie": "PRJLANR5L15TAP0091"
                        }
                      ]
                    }
                  }
                ]
              }
            }
          ]
        }
      },
      {
        "@xsi:type": "Etape_Type",
        "uid": "L15-CMP-35818",
        "codeActe": "CMP",
        "libelleActe": {
          "nomCanonique": "Commission Mixte Paritaire",
          "libelleCourt": "Commission Mixte Paritaire"
        },
        "organeRef": "PO750828",
        "dateActe": null,
        "actesLegislatifs": {
          "acteLegislatif": [
            {
              "@xsi:type": "DepotInitiativeNavette_Type",
              "uid": "L15-VD184599DIN",
              "codeActe": "CMP-DEPOT",
              "libelleActe": {
                "nomCanonique": "Dépôt d'un projet de loi",
                "libelleCourt": "Dépôt d'un projet de loi"
              },
              "organeRef": "PO750828",
              "dateActe": "2018-02-16T00:00:00.000+01:00",
              "actesLegislatifs": null,
              "texteAssocie": "PRJLSNR5S299B0309",
              "provenance": "PO717460"
            },
            {
              "@xsi:type": "RenvoiCMP_Type",
              "uid": "L15-VD184603CMPS",
              "codeActe": "CMP-SAISIE",
              "libelleActe": {
                "nomCanonique": "Convocation d'une CMP",
                "libelleCourt": "Convocation d'une CMP"
              },
              "organeRef": "PO750828",
              "dateActe": "2018-02-16T00:00:00.000+01:00",
              "actesLegislatifs": null,
              "initiateur": {
                "acteurs": {
                  "acteur": {
                    "acteurRef": "PA345619",
                    "mandatRef": "PM725692"
                  }
                }
              }
            },
            {
              "@xsi:type": "Etape_Type",
              "uid": "L15-VD184603COM",
              "codeActe": "CMP-COM",
              "libelleActe": {
                "nomCanonique": "Commission Mixte Paritaire",
                "libelleCourt": "Commission Mixte Paritaire"
              },
              "organeRef": "PO750828",
              "dateActe": null,
              "actesLegislatifs": null
            }
          ]
        }
      }
    ]
  },
  "fusionDossier": null
}