{
  "@xsi:type": "DossierResolutionAN",
  "uid": "DLR5L14N34856",
  "legislature": "14",
  "titreDossier": {
    "titre": "Proposition de directive relative aux armes à feu",
    "titreChemin": "ppre_directive_armes_feu",
    "senatChemin": null
  },
  "procedureParlementaire": {
    "code": "8",
    "libelle": "Résolution"
  },
  "initiateur": {
    "acteurs": {
      "acteur": [
        {
          "acteurRef": "PA335054",
          "mandatRef": "PM645614"
        },
        {
          "acteurRef": "PA1012",
          "mandatRef": "PM645168"
        }
      ]
    }
  },
  "actesLegislatifs": {
    "acteLegislatif": {
      "@xsi:type": "Etape_Type",
      "uid": "L14-ANLUNI-34856",
      "codeActe": "ANLUNI",
      "libelleActe": {
        "nomCanonique": "Lecture unique"
      },
      "organeRef": "PO644420",
      "dateActe": null,
      "actesLegislatifs": {
        "acteLegislatif": [
          {
            "@xsi:type": "DepotInitiative_Type",
            "uid": "L14-VD177790DI",
            "codeActe": "ANLUNI-DEPOT",
            "libelleActe": {
              "nomCanonique": "1er dépôt d'une initiative.",
              "libelleCourt": "1er dépôt d'une initiative."
            },
            "organeRef": "PO644420",
            "dateActe": "2016-04-26T00:00:00.000+02:00",
            "actesLegislatifs": null,
            "texteAssocie": "PNREANR5L14B3692"
          },
          {
            "@xsi:type": "Etape_Type",
            "uid": "L14-ANLUNI-COM-34856",
            "codeActe": "ANLUNI-COM",
            "libelleActe": {
              "nomCanonique": "Travaux des commissions",
              "libelleCourt": "Travaux des commissions"
            },
            "organeRef": "PO644420",
            "dateActe": null,
            "actesLegislatifs": {
              "acteLegislatif": {
                "@xsi:type": "Etape_Type",
                "uid": "L14-VD177791CF",
                "codeActe": "ANLUNI-COM-FOND",
                "libelleActe": {
                  "nomCanonique": "Travaux de la commission saisie au fond",
                  "libelleCourt": "Travaux de la commission saisie au fond"
                },
                "organeRef": "PO59051",
                "dateActe": null,
                "actesLegislatifs": {
                  "acteLegislatif": {
                    "@xsi:type": "SaisieComFond_Type",
                    "uid": "L14-VD177791CFS",
                    "codeActe": "ANLUNI-COM-FOND-SAISIE",
                    "libelleActe": {
                      "nomCanonique": "Renvoi en commission au fond",
                      "libelleCourt": "Renvoi en commission au fond"
                    },
                    "organeRef": "PO59051",
                    "dateActe": "2016-04-26T00:00:00.000+02:00",
                    "actesLegislatifs": null
                  }
                }
              }
            }
          },
          {
            "@xsi:type": "Etape_Type",
            "uid": "L14-ANLUNI-DEBATS-34856",
            "codeActe": "ANLUNI-DEBATS",
            "libelleActe": {
              "nomCanonique": "Discussion en séance publique",
              "libelleCourt": "Discussion en séance publique"
            },
            "organeRef": "PO644420",
            "dateActe": null,
            "actesLegislatifs": {
              "acteLegislatif": {
                "@xsi:type": "Decision_Type",
                "uid": "L14-VD178399DEC",
                "codeActe": "ANLUNI-DEBATS-DEC",
                "libelleActe": {
                  "nomCanonique": "Décision",
                  "libelleCourt": "Décision"
                },
                "organeRef": "PO644420",
                "dateActe": "2016-06-11T00:00:00.000+02:00",
                "actesLegislatifs": null,
                "statutConclusion": {
                  "fam_code": "TSORTF19",
                  "libelle": "considérée comme définitive en application de l'article 151-7 du Règlement"
                },
                "reunionRef": null,
                "voteRefs": null,
                "textesAssocies": {
                  "texteAssocie": {
                    "typeTexte": "BTA",
                    "refTexteAssocie": "RIONANR5L14BTA0751"
                  }
                }
              }
            }
          }
        ]
      }
    }
  },
  "fusionDossier": null
}