{
  "@xsi:type": "DossierLegislatif_Type",
  "uid": "DLR5L14N33705",
  "legislature": "14",
  "titreDossier": {
    "titre": "Collectivités territoriales : assouplissement du \"droit d'option départemental\"",
    "titreChemin": "assouplissement_droit_option_departemental",
    "senatChemin": null
  },
  "procedureParlementaire": {
    "code": "2",
    "libelle": "Proposition de loi ordinaire"
  },
  "initiateur": {
    "acteurs": {
      "acteur": {
        "acteurRef": "PA605084",
        "mandatRef": "PM645537"
      }
    }
  },
  "actesLegislatifs": {
    "acteLegislatif": {
      "@xsi:type": "Etape_Type",
      "uid": "L14-AN1-33705",
      "codeActe": "AN1",
      "libelleActe": {
        "nomCanonique": "1ère lecture (1ère assemblée saisie)",
        "libelleCourt": "1ère lecture"
      },
      "organeRef": "PO644420",
      "dateActe": null,
      "actesLegislatifs": {
        "acteLegislatif": [
          {
            "@xsi:type": "DepotInitiative_Type",
            "uid": "L14-VD172597DI",
            "codeActe": "AN1-DEPOT",
            "libelleActe": {
              "nomCanonique": "1er dépôt d'une initiative.",
              "libelleCourt": "1er dépôt d'une initiative."
            },
            "organeRef": "PO644420",
            "dateActe": "2015-01-21T00:00:00.000+01:00",
            "actesLegislatifs": null,
            "texteAssocie": "PIONANR5L14B2520"
          },
          {
            "@xsi:type": "Etape_Type",
            "uid": "L14-AN1-COM-33705",
            "codeActe": "AN1-COM",
            "libelleActe": {
              "nomCanonique": "Travaux des commissions",
              "libelleCourt": "Travaux des commissions"
            },
            "organeRef": "PO644420",
            "dateActe": null,
            "actesLegislatifs": {
              "acteLegislatif": {
                "@xsi:type": "Etape_Type",
                "uid": "L14-VD172598CF",
                "codeActe": "AN1-COM-FOND",
                "libelleActe": {
                  "nomCanonique": "Travaux de la commission saisie au fond",
                  "libelleCourt": "Travaux de la commission saisie au fond"
                },
                "organeRef": "PO59051",
                "dateActe": null,
                "actesLegislatifs": {
                  "acteLegislatif": [
                    {
                      "@xsi:type": "SaisieComFond_Type",
                      "uid": "L14-VD172598CFS",
                      "codeActe": "AN1-COM-FOND-SAISIE",
                      "libelleActe": {
                        "nomCanonique": "Renvoi en commission au fond",
                        "libelleCourt": "Renvoi en commission au fond"
                      },
                      "organeRef": "PO59051",
                      "dateActe": "2015-01-21T00:00:00.000+01:00",
                      "actesLegislatifs": null
                    },
                    {
                      "@xsi:type": "NominRapporteurs_Type",
                      "uid": "L14-VD173039",
                      "codeActe": "AN1-COM-FOND-NOMIN",
                      "libelleActe": {
                        "nomCanonique": "Nomination de rapporteur",
                        "libelleCourt": "Nomination de rapporteur"
                      },
                      "organeRef": "PO59051",
                      "dateActe": "2015-03-04T00:00:00.000+01:00",
                      "actesLegislatifs": null,
                      "rapporteurs": {
                        "rapporteur": {
                          "acteurRef": "PA605084",
                          "typeRapporteur": "rapporteur"
                        }
                      },
                      "reunion": null
                    },
                    {
                      "@xsi:type": "DiscussionCommission_Type",
                      "uid": "L14-VD172842R22120",
                      "codeActe": "AN1-COM-FOND-REUNION",
                      "libelleActe": {
                        "nomCanonique": "Réunion de commission",
                        "libelleCourt": "Réunion de commission"
                      },
                      "organeRef": "PO59051",
                      "dateActe": "2015-03-04T09:30:00.000+01:00",
                      "actesLegislatifs": null,
                      "reunionRef": "RUANR5L14S2015IDC423008",
                      "odjRef": "RUANR5L14S2015IDC423008PT22120"
                    },
                    {
                      "@xsi:type": "DiscussionCommission_Type",
                      "uid": "L14-VD172842R22126",
                      "codeActe": "AN1-COM-FOND-REUNION",
                      "libelleActe": {
                        "nomCanonique": "Réunion de commission",
                        "libelleCourt": "Réunion de commission"
                      },
                      "organeRef": "PO59051",
                      "dateActe": "2015-03-04T09:30:00.000+01:00",
                      "actesLegislatifs": null,
                      "reunionRef": "RUANR5L14S2015IDC423008",
                      "odjRef": "RUANR5L14S2015IDC423008PT22126"
                    },
                    {
                      "@xsi:type": "DiscussionCommission_Type",
                      "uid": "L14-VD172842R22155",
                      "codeActe": "AN1-COM-FOND-REUNION",
                      "libelleActe": {
                        "nomCanonique": "Réunion de commission",
                        "libelleCourt": "Réunion de commission"
                      },
                      "organeRef": "PO59051",
                      "dateActe": "2015-03-12T09:15:00.000+01:00",
                      "actesLegislatifs": null,
                      "reunionRef": null,
                      "odjRef": null
                    },
                    {
                      "@xsi:type": "DepotRapport_Type",
                      "uid": "L14-VD173003",
                      "codeActe": "AN1-COM-FOND-RAPPORT",
                      "libelleActe": {
                        "nomCanonique": "Dépôt de rapport",
                        "libelleCourt": "Dépôt de rapport"
                      },
                      "organeRef": "PO59051",
                      "dateActe": "2015-03-04T00:00:00.000+01:00",
                      "actesLegislatifs": null,
                      "texteAssocie": "RAPPANR5L14B2613",
                      "texteAdopte": null
                    }
                  ]
                }
              }
            }
          },
          {
            "@xsi:type": "Etape_Type",
            "uid": "L14-AN1-DEBATS-33705",
            "codeActe": "AN1-DEBATS",
            "libelleActe": {
              "nomCanonique": "Discussion en séance publique",
              "libelleCourt": "Discussion en séance publique"
            },
            "organeRef": "PO644420",
            "dateActe": null,
            "actesLegislatifs": {
              "acteLegislatif": [
                {
                  "@xsi:type": "DiscussionSeancePublique_Type",
                  "uid": "L14-VD172775S31845",
                  "codeActe": "AN1-DEBATS-SEANCE",
                  "libelleActe": {
                    "nomCanonique": "Discussion en séance publique",
                    "libelleCourt": "Discussion en séance publique"
                  },
                  "organeRef": "PO644420",
                  "dateActe": "2015-03-12T00:00:00.000+01:00",
                  "actesLegislatifs": null,
                  "reunionRef": "RUANR5L14S2015IDS19101",
                  "odjRef": "RUANR5L14S2015IDS19101PT31845"
                },
                {
                  "@xsi:type": "Decision_Type",
                  "uid": "L14-VD173144DEC",
                  "codeActe": "AN1-DEBATS-DEC",
                  "libelleActe": {
                    "nomCanonique": "Décision",
                    "libelleCourt": "Décision"
                  },
                  "organeRef": "PO644420",
                  "dateActe": "2015-03-12T00:00:00.000+01:00",
                  "actesLegislatifs": null,
                  "reunionRef": "RUANR5L14S2015IDS19101",
                  "statutConclusion": {
                    "fam_code": "TSORTF07",
                    "libelle": "rejetée"
                  },
                  "voteRefs": null,
                  "textesAssocies": {
                    "texteAssocie": {
                      "typeTexte": "BTA",
                      "refTexteAssocie": "PIONANR5L14BTA0484"
                    }
                  }
                }
              ]
            }
          }
        ]
      }
    }
  },
  "fusionDossier": null
}