{
  "@xsi:type": "texteLoi_Type",
  "uid": "PRJLANR5L15B0160",
  "legislature": "15",
  "cycleDeVie": {
    "chrono": {
      "dateCreation": "2017-09-14T00:00:00.000+02:00",
      "dateDepot": "2017-09-14T00:00:00.000+02:00",
      "datePublication": "2017-09-19T00:00:00.000+02:00",
      "datePublicationWeb": "2017-09-14T18:25:00.000+02:00"
    }
  },
  "denominationStructurelle": "Projet de loi",
  "provenance": "Texte Déposé",
  "titres": {
    "titrePrincipal": "projet de loi autorisant l'approbation de la convention d'entraide judiciaire en matière pénale entre le Gouvernement de la République française et le Gouvernement de la République du Costa Rica",
    "titrePrincipalCourt": "Convention d'entraide judiciaire en matière pénale avec le Costa Rica"
  },
  "divisions": null,
  "dossierRef": "DLR5L14N33604",
  "redacteur": null,
  "classification": {
    "famille": {
      "depot": {
        "code": "INITNAV",
        "libelle": "Initiative en Navette"
      },
      "classe": {
        "code": "PRJLOI",
        "libelle": "Projet de loi"
      },
      "espece": {
        "code": "AUTRATCONV",
        "libelle": "autorisant la ratification d'une convention"
      }
    },
    "type": {
      "code": "PRJL",
      "libelle": "Projet de loi"
    },
    "sousType": {
      "code": "AUTRATCONV",
      "libelle": "autorisant la ratification d'une convention",
      "libelleEdition": "autorisant la ratification d'une convention"
    },
    "statutAdoption": null
  },
  "auteurs": {
    "auteur": {
      "organe": {
        "organeRef": "PO717460"
      }
    }
  },
  "correction": null,
  "notice": {
    "numNotice": "160",
    "formule": ", adopté par le Sénat, autorisant l'approbation de la convention d'entraide judiciaire en matière pénale entre le Gouvernement de la République française et le Gouvernement de la République du Costa Rica",
    "adoptionConforme": "false"
  },
  "indexation": null,
  "imprimerie": null,
  "coSignataires": null,
  "depotAmendements": {
    "amendementsSeance": {
      "amendable": "true",
      "dateLimiteDepot": null
    },
    "amendementsCommission": {
      "commission": {
        "organeRef": "PO59047",
        "amendable": "true",
        "dateLimiteDepot": null
      }
    }
  }
}