{
  "@xsi:type": "texteLoi_Type",
  "uid": "PIONANR5L14B0377",
  "legislature": "14",
  "cycleDeVie": {
    "chrono": {
      "dateCreation": "2012-10-30T00:00:00.000+01:00",
      "dateDepot": "2012-11-13T00:00:00.000+01:00",
      "datePublication": null,
      "datePublicationWeb": "2012-11-14T15:00:00.000+01:00"
    }
  },
  "denominationStructurelle": "Proposition de loi",
  "provenance": "Texte Déposé",
  "titres": {
    "titrePrincipal": "proposition de loi relative à la création d'un crédit d'impôt au titre des contrats d'assurance complémentaire de santé souscrits par les retraités",
    "titrePrincipalCourt": "Crédit d'impôt au titre des contrats d'assurance complémentaire de santé souscrits par les retraités"
  },
  "divisions": null,
  "dossierRef": "DLR5L14N29271",
  "redacteur": null,
  "classification": {
    "famille": {
      "depot": {
        "code": "INITDEP",
        "libelle": "Initiative en 1er Dépôt"
      },
      "classe": {
        "code": "PIONLOI",
        "libelle": "Proposition de loi"
      }
    },
    "type": {
      "code": "PION",
      "libelle": "Proposition de loi"
    },
    "sousType": null,
    "statutAdoption": null
  },
  "auteurs": {
    "auteur": {
      "acteur": {
        "acteurRef": "PA268019",
        "qualite": "auteur"
      }
    }
  },
  "correction": null,
  "notice": {
    "numNotice": "377",
    "formule": "relative à la création d'un crédit d'impôt au titre des contrats d'assurance complémentaire de santé souscrits par les retraités",
    "adoptionConforme": "false"
  },
  "indexation": {
    "themes": {
      "@niveau": "1",
      "theme": {
        "libelleTheme": "POLITIQUE ECONOMIQUE ET SOCIALE"
      }
    }
  },
  "imprimerie": null,
  "coSignataires": {
    "coSignataire": {
      "acteur": {
        "acteurRef": "PA610775"
      },
      "dateCosignature": "2014-12-11+01:00",
      "dateRetraitCosignature": null,
      "edite": "true"
    }
  },
  "depotAmendements": {
    "amendementsSeance": {
      "amendable": "false",
      "dateLimiteDepot": null
    },
    "amendementsCommission": {
      "commission": {
        "organeRef": "PO420120",
        "amendable": "true",
        "dateLimiteDepot": null
      }
    }
  }
}