{
  "@xsi:type": "DossierLegislatif_Type",
  "uid": "DLR5L14N35319",
  "legislature": "14",
  "titreDossier": {
    "titre": "Traités et conventions : ratification du protocole au traité de l'Atlantique Nord sur l'accession du Monténégro",
    "titreChemin": "ratification_accession_montenegro_otan",
    "senatChemin": "http://www.senat.fr/dossier-legislatif/pjl16-173.html"
  },
  "procedureParlementaire": {
    "code": "6",
    "libelle": "Projet de ratification des traités et conventions"
  },
  "initiateur": {
    "acteurs": {
      "acteur": [
        {
          "acteurRef": "PA267622",
          "mandatRef": "PM702957"
        },
        {
          "acteurRef": "PA328",
          "mandatRef": "PM711554"
        }
      ]
    }
  },
  "actesLegislatifs": {
    "acteLegislatif": [
      {
        "@xsi:type": "Etape_Type",
        "uid": "L14-AN1-35319",
        "codeActe": "AN1",
        "libelleActe": {
          "nomCanonique": "1ère lecture (1ère assemblée saisie)",
          "libelleCourt": "1ère lecture"
        },
        "organeRef": "PO644420",
        "dateActe": null,
        "actesLegislatifs": {
          "acteLegislatif": [
            {
              "@xsi:type": "DepotInitiative_Type",
              "uid": "L14-VD179756DI",
              "codeActe": "AN1-DEPOT",
              "libelleActe": {
                "nomCanonique": "1er dépôt d'une initiative.",
                "libelleCourt": "1er dépôt d'une initiative."
              },
              "organeRef": "PO644420",
              "dateActe": "2016-10-19T00:00:00.000+02:00",
              "actesLegislatifs": null,
              "texteAssocie": "PRJLANR5L14B4148"
            },
            {
              "@xsi:type": "EtudeImpact_Type",
              "uid": "L14-VD179756ETI",
              "codeActe": "AN1-ETI",
              "libelleActe": {
                "nomCanonique": "Etude d'impact",
                "libelleCourt": "Etude d'impact"
              },
              "organeRef": "PO644420",
              "dateActe": "2016-10-19T00:00:00.000+02:00",
              "actesLegislatifs": null,
              "texteAssocie": "ETDIANR5L14B4148",
              "contributionInternaute": {
                "dateFermeture": "2016-12-01+01:00",
                "dateOuverture": "2016-10-22+02:00"
              }
            },
            {
              "@xsi:type": "DepotAccordInternational_Type",
              "uid": "L14-VD179756ACIN",
              "codeActe": "AN1-ACIN",
              "libelleActe": {
                "nomCanonique": "Accord international",
                "libelleCourt": "Accord international"
              },
              "organeRef": "PO644420",
              "dateActe": "2016-10-19T00:00:00.000+02:00",
              "actesLegislatifs": null,
              "texteAssocie": "ACINANR5L14B4148"
            },
            {
              "@xsi:type": "ProcedureAccelere_Type",
              "uid": "L14-VD179758",
              "codeActe": "AN1-PROCACC",
              "libelleActe": {
                "nomCanonique": "Le gouvernement déclare l'urgence / engage la procédure accélérée",
                "libelleCourt": "Le gouvernement déclare l'urgence / engage la procédure accélérée"
              },
              "organeRef": "PO702883",
              "dateActe": "2016-10-19T00:00:00.000+02:00",
              "actesLegislatifs": null
            },
            {
              "@xsi:type": "Etape_Type",
              "uid": "L14-AN1-COM-35319",
              "codeActe": "AN1-COM",
              "libelleActe": {
                "nomCanonique": "Travaux des commissions",
                "libelleCourt": "Travaux des commissions"
              },
              "organeRef": "PO644420",
              "dateActe": null,
              "actesLegislatifs": {
                "acteLegislatif": {
                  "@xsi:type": "Etape_Type",
                  "uid": "L14-VD179757CF",
                  "codeActe": "AN1-COM-FOND",
                  "libelleActe": {
                    "nomCanonique": "Travaux de la commission saisie au fond",
                    "libelleCourt": "Travaux de la commission saisie au fond"
                  },
                  "organeRef": "PO59047",
                  "dateActe": null,
                  "actesLegislatifs": {
                    "acteLegislatif": [
                      {
                        "@xsi:type": "SaisieComFond_Type",
                        "uid": "L14-VD179757CFS",
                        "codeActe": "AN1-COM-FOND-SAISIE",
                        "libelleActe": {
                          "nomCanonique": "Renvoi en commission au fond",
                          "libelleCourt": "Renvoi en commission au fond"
                        },
                        "organeRef": "PO59047",
                        "dateActe": "2016-10-19T00:00:00.000+02:00",
                        "actesLegislatifs": null
                      },
                      {
                        "@xsi:type": "NominRapporteurs_Type",
                        "uid": "L14-VD179854",
                        "codeActe": "AN1-COM-FOND-NOMIN",
                        "libelleActe": {
                          "nomCanonique": "Nomination de rapporteur",
                          "libelleCourt": "Nomination de rapporteur"
                        },
                        "organeRef": "PO59047",
                        "dateActe": "2016-10-26T00:00:00.000+02:00",
                        "actesLegislatifs": null,
                        "rapporteurs": {
                          "rapporteur": {
                            "acteurRef": "PA610936",
                            "typeRapporteur": "rapporteur"
                          }
                        },
                        "reunion": null
                      },
                      {
                        "@xsi:type": "DiscussionCommission_Type",
                        "uid": "L14-VD179782R24362",
                        "codeActe": "AN1-COM-FOND-REUNION",
                        "libelleActe": {
                          "nomCanonique": "Réunion de commission",
                          "libelleCourt": "Réunion de commission"
                        },
                        "organeRef": "PO59047",
                        "dateActe": "2016-10-26T09:45:00.000+02:00",
                        "actesLegislatifs": null,
                        "reunionRef": "RUANR5L14S2017IDC426388",
                        "odjRef": "RUANR5L14S2017IDC426388PT24362"
                      },
                      {
                        "@xsi:type": "DiscussionCommission_Type",
                        "uid": "L14-VD179782R24540",
                        "codeActe": "AN1-COM-FOND-REUNION",
                        "libelleActe": {
                          "nomCanonique": "Réunion de commission",
                          "libelleCourt": "Réunion de commission"
                        },
                        "organeRef": "PO59047",
                        "dateActe": "2016-11-29T17:00:00.000+01:00",
                        "actesLegislatifs": null,
                        "reunionRef": "RUANR5L14S2017IDC426627",
                        "odjRef": "RUANR5L14S2017IDC426627PT24540"
                      },
                      {
                        "@xsi:type": "DepotRapport_Type",
                        "uid": "L14-VD180269",
                        "codeActe": "AN1-COM-FOND-RAPPORT",
                        "libelleActe": {
                          "nomCanonique": "Dépôt de rapport",
                          "libelleCourt": "Dépôt de rapport"
                        },
                        "organeRef": "PO59047",
                        "dateActe": "2016-11-29T00:00:00.000+01:00",
                        "actesLegislatifs": null,
                        "texteAssocie": "RAPPANR5L14B4259",
                        "texteAdopte": null
                      }
                    ]
                  }
                }
              }
            },
            {
              "@xsi:type": "Etape_Type",
              "uid": "L14-AN1-DEBATS-35319",
              "codeActe": "AN1-DEBATS",
              "libelleActe": {
                "nomCanonique": "Discussion en séance publique",
                "libelleCourt": "Discussion en séance publique"
              },
              "organeRef": "PO644420",
              "dateActe": null,
              "actesLegislatifs": {
                "acteLegislatif": [
                  {
                    "@xsi:type": "DiscussionSeancePublique_Type",
                    "uid": "L14-VD179980S34426",
                    "codeActe": "AN1-DEBATS-SEANCE",
                    "libelleActe": {
                      "nomCanonique": "Discussion en séance publique",
                      "libelleCourt": "Discussion en séance publique"
                    },
                    "organeRef": "PO644420",
                    "dateActe": "2016-12-01T00:00:00.000+01:00",
                    "actesLegislatifs": null,
                    "reunionRef": "RUANR5L14S2017IDS20410",
                    "odjRef": "RUANR5L14S2017IDS20410PT34426"
                  },
                  {
                    "@xsi:type": "Decision_Type",
                    "uid": "L14-VD180311DEC",
                    "codeActe": "AN1-DEBATS-DEC",
                    "libelleActe": {
                      "nomCanonique": "Décision",
                      "libelleCourt": "Décision"
                    },
                    "organeRef": "PO644420",
                    "dateActe": "2016-12-01T00:00:00.000+01:00",
                    "actesLegislatifs": null,
                    "reunionRef": "RUANR5L14S2017IDS20410",
                    "statutConclusion": {
                      "fam_code": "TSORTF01",
                      "libelle": "adopté"
                    },
                    "voteRefs": null,
                    "textesAssocies": {
                      "texteAssocie": {
                        "typeTexte": "BTA",
                        "refTexteAssocie": "PRJLANR5L14BTA0847"
                      }
                    }
                  }
                ]
              }
            }
          ]
        }
      },
      {
        "@xsi:type": "Etape_Type",
        "uid": "L14-SN1-35319",
        "codeActe": "SN1",
        "libelleActe": {
          "nomCanonique": "1ère lecture (2ème assemblée saisie)",
          "libelleCourt": "1ère lecture"
        },
        "organeRef": "PO78718",
        "dateActe": null,
        "actesLegislatifs": {
          "acteLegislatif": [
            {
              "@xsi:type": "DepotInitiativeNavette_Type",
              "uid": "L14-VD180329DIN",
              "codeActe": "SN1-DEPOT",
              "libelleActe": {
                "nomCanonique": "Dépôt d'une initiative en navette",
                "libelleCourt": "Dépôt d'une initiative en navette"
              },
              "organeRef": "PO78718",
              "dateActe": "2016-12-01T00:00:00.000+01:00",
              "actesLegislatifs": null,
              "texteAssocie": "PRJLSNR5S279B0173",
              "provenance": "PO644420"
            },
            {
              "@xsi:type": "Etape_Type",
              "uid": "L14-SN1-COM-35319",
              "codeActe": "SN1-COM",
              "libelleActe": {
                "nomCanonique": "Travaux des commissions",
                "libelleCourt": "Travaux des commissions"
              },
              "organeRef": "PO78718",
              "dateActe": null,
              "actesLegislatifs": {
                "acteLegislatif": {
                  "@xsi:type": "Etape_Type",
                  "uid": "L14-VD180330CF",
                  "codeActe": "SN1-COM-FOND",
                  "libelleActe": {
                    "nomCanonique": "Travaux de la commission saisie au fond",
                    "libelleCourt": "Travaux de la commission saisie au fond"
                  },
                  "organeRef": "PO211491",
                  "dateActe": null,
                  "actesLegislatifs": {
                    "acteLegislatif": [
                      {
                        "@xsi:type": "SaisieComFond_Type",
                        "uid": "L14-VD180330CFS",
                        "codeActe": "SN1-COM-FOND-SAISIE",
                        "libelleActe": {
                          "nomCanonique": "Renvoi en commission au fond",
                          "libelleCourt": "Renvoi en commission au fond"
                        },
                        "organeRef": "PO211491",
                        "dateActe": "2016-12-01T00:00:00.000+01:00",
                        "actesLegislatifs": null
                      },
                      {
                        "@xsi:type": "NominRapporteurs_Type",
                        "uid": "L14-VD180944",
                        "codeActe": "SN1-COM-FOND-NOMIN",
                        "libelleActe": {
                          "nomCanonique": "Nomination de rapporteur",
                          "libelleCourt": "Nomination de rapporteur"
                        },
                        "organeRef": "PO211491",
                        "dateActe": "2016-12-14T00:00:00.000+01:00",
                        "actesLegislatifs": null,
                        "rapporteurs": {
                          "rapporteur": {
                            "acteurRef": "PA2420",
                            "typeRapporteur": "rapporteur"
                          }
                        },
                        "reunion": null
                      },
                      {
                        "@xsi:type": "DepotRapport_Type",
                        "uid": "L14-VD180945",
                        "codeActe": "SN1-COM-FOND-RAPPORT",
                        "libelleActe": {
                          "nomCanonique": "Dépôt de rapport",
                          "libelleCourt": "Dépôt de rapport"
                        },
                        "organeRef": "PO211491",
                        "dateActe": "2017-01-18T00:00:00.000+01:00",
                        "actesLegislatifs": null,
                        "texteAssocie": "RAPPSNR5S279B0313",
                        "texteAdopte": null
                      }
                    ]
                  }
                }
              }
            },
            {
              "@xsi:type": "Etape_Type",
              "uid": "L14-SN1-DEBATS-35319",
              "codeActe": "SN1-DEBATS",
              "libelleActe": {
                "nomCanonique": "Discussion en séance publique",
                "libelleCourt": "Discussion en séance publique"
              },
              "organeRef": "PO78718",
              "dateActe": null,
              "actesLegislatifs": {
                "acteLegislatif": [
                  {
                    "@xsi:type": "DiscussionSeancePublique_Type",
                    "uid": "L14-VD180600S34665",
                    "codeActe": "SN1-DEBATS-SEANCE",
                    "libelleActe": {
                      "nomCanonique": "Discussion en séance publique",
                      "libelleCourt": "Discussion en séance publique"
                    },
                    "organeRef": "PO78718",
                    "dateActe": "2017-01-26T00:00:00.000+01:00",
                    "actesLegislatifs": null,
                    "reunionRef": "RUSNR5L14S2017IDS20511",
                    "odjRef": "RUSNR5L14S2017IDS20511PT34665"
                  },
                  {
                    "@xsi:type": "Decision_Type",
                    "uid": "L14-VD181018DEC",
                    "codeActe": "SN1-DEBATS-DEC",
                    "libelleActe": {
                      "nomCanonique": "Décision",
                      "libelleCourt": "Décision"
                    },
                    "organeRef": "PO78718",
                    "dateActe": "2017-01-26T00:00:00.000+01:00",
                    "actesLegislatifs": null,
                    "reunionRef": "RUSNR5L14S2017IDS20511",
                    "statutConclusion": {
                      "fam_code": "TSORTF03",
                      "libelle": "adopté sans modification"
                    },
                    "voteRefs": null,
                    "textesAssocies": {
                      "texteAssocie": {
                        "typeTexte": "BTA",
                        "refTexteAssocie": "PRJLSNR5S279BTA0069"
                      }
                    }
                  }
                ]
              }
            }
          ]
        }
      },
      {
        "@xsi:type": "Etape_Type",
        "uid": "L14-PROM-35319",
        "codeActe": "PROM",
        "libelleActe": {
          "nomCanonique": "Promulgation de la loi",
          "libelleCourt": "Promulgation de la loi"
        },
        "organeRef": "PO696251",
        "dateActe": null,
        "actesLegislatifs": {
          "acteLegislatif": {
            "@xsi:type": "Promulgation_Type",
            "uid": "L14-VD181179PL",
            "codeActe": "PROM-PUB",
            "libelleActe": {
              "nomCanonique": "Promulgation d'une loi",
              "libelleCourt": "Promulgation d'une loi"
            },
            "organeRef": "PO696251",
            "dateActe": "2017-02-01T00:00:00.000+01:00",
            "actesLegislatifs": null,
            "texteLoiRef": "PRJLSNR5S279BTA0069",
            "infoJO": {
              "typeJO": "JO_LOI_DECRET",
              "dateJO": "2017-02-02+01:00",
              "pageJO": null,
              "numJO": "28"
            },
            "urlLegifrance": "http://www.legifrance.gouv.fr/WAspad/UnTexteDeJorf?numjo=MAEJ1624956L",
            "referenceNOR": "MAEJ1624956L",
            "codeLoi": "2017-118",
            "titreLoi": "autorisant la ratification du protocole au traité de l'Atlantique Nord sur l'accession du Monténégro"
          }
        }
      }
    ]
  },
  "fusionDossier": null
}