{
  "@xsi:type": "DossierResolutionAN",
  "uid": "DLR5L14N30599",
  "legislature": "14",
  "titreDossier": {
    "titre": "Avis de la Commission européenne sur les programmes de stabilité et de réforme de la France",
    "titreChemin": "avis_Commission_europeenne_reforme_France",
    "senatChemin": null
  },
  "procedureParlementaire": {
    "code": "8",
    "libelle": "Résolution"
  },
  "initiateur": {
    "acteurs": {
      "acteur": {
        "acteurRef": "PA735",
        "mandatRef": "PM645089"
      }
    }
  },
  "actesLegislatifs": {
    "acteLegislatif": {
      "@xsi:type": "Etape_Type",
      "uid": "L14-ANLUNI-30599",
      "codeActe": "ANLUNI",
      "libelleActe": {
        "nomCanonique": "Lecture unique"
      },
      "organeRef": "PO644420",
      "dateActe": null,
      "actesLegislatifs": {
        "acteLegislatif": [
          {
            "@xsi:type": "DepotInitiative_Type",
            "uid": "L14-VD164565DI",
            "codeActe": "ANLUNI-DEPOT",
            "libelleActe": {
              "nomCanonique": "1er dépôt d'une initiative.",
              "libelleCourt": "1er dépôt d'une initiative."
            },
            "organeRef": "PO644420",
            "dateActe": "2013-06-26T00:00:00.000+02:00",
            "actesLegislatifs": null,
            "texteAssocie": "PNREANR5L14B1204"
          },
          {
            "@xsi:type": "Etape_Type",
            "uid": "L14-ANLUNI-COM-30599",
            "codeActe": "ANLUNI-COM",
            "libelleActe": {
              "nomCanonique": "Travaux des commissions",
              "libelleCourt": "Travaux des commissions"
            },
            "organeRef": "PO644420",
            "dateActe": null,
            "actesLegislatifs": {
              "acteLegislatif": {
                "@xsi:type": "Etape_Type",
                "uid": "L14-VD164566CF",
                "codeActe": "ANLUNI-COM-FOND",
                "libelleActe": {
                  "nomCanonique": "Travaux de la commission saisie au fond",
                  "libelleCourt": "Travaux de la commission saisie au fond"
                },
                "organeRef": "PO59048",
                "dateActe": null,
                "actesLegislatifs": {
                  "acteLegislatif": {
                    "@xsi:type": "SaisieComFond_Type",
                    "uid": "L14-VD164566CFS",
                    "codeActe": "ANLUNI-COM-FOND-SAISIE",
                    "libelleActe": {
                      "nomCanonique": "Renvoi en commission au fond",
                      "libelleCourt": "Renvoi en commission au fond"
                    },
                    "organeRef": "PO59048",
                    "dateActe": "2013-06-26T00:00:00.000+02:00",
                    "actesLegislatifs": null
                  }
                }
              }
            }
          },
          {
            "@xsi:type": "Etape_Type",
            "uid": "L14-ANLUNI-DEBATS-30599",
            "codeActe": "ANLUNI-DEBATS",
            "libelleActe": {
              "nomCanonique": "Discussion en séance publique",
              "libelleCourt": "Discussion en séance publique"
            },
            "organeRef": "PO644420",
            "dateActe": null,
            "actesLegislatifs": {
              "acteLegislatif": {
                "@xsi:type": "Decision_Type",
                "uid": "L14-VD165470DEC",
                "codeActe": "ANLUNI-DEBATS-DEC",
                "libelleActe": {
                  "nomCanonique": "Décision",
                  "libelleCourt": "Décision"
                },
                "organeRef": "PO644420",
                "dateActe": "2013-08-11T00:00:00.000+02:00",
                "actesLegislatifs": null,
                "statutConclusion": {
                  "fam_code": "TSORTF19",
                  "libelle": "considérée comme définitive en application de l'article 151-7 du Règlement"
                },
                "reunionRef": null,
                "voteRefs": null,
                "textesAssocies": {
                  "texteAssocie": {
                    "typeTexte": "BTA",
                    "refTexteAssocie": "RIONANR5L14BTA0205"
                  }
                }
              }
            }
          }
        ]
      }
    }
  },
  "fusionDossier": null,
  "indexation": {
    "themes": {
      "@niveau": "1",
      "theme": {
        "libelleTheme": "SECURITE SOCIALE"
      }
    }
  }
}