{
  "@xsi:type": "texteLoi_Type",
  "uid": "PIONSNR5S219B0320",
  "legislature": null,
  "cycleDeVie": {
    "chrono": {
      "dateCreation": "2014-01-29T00:00:00.000+01:00",
      "dateDepot": "2014-01-28T00:00:00.000+01:00",
      "datePublication": null,
      "datePublicationWeb": null
    }
  },
  "denominationStructurelle": "Proposition de loi",
  "provenance": "Texte Déposé",
  "titres": {
    "titrePrincipal": "proposition de loi constitutionnelle autorisant la ratification de la Charte européenne des langues régionales ou minoritaires",
    "titrePrincipalCourt": "Ratification de la Charte européenne des langues régionales ou minoritaires"
  },
  "divisions": null,
  "dossierRef": "DLR5L14N31996",
  "redacteur": null,
  "classification": {
    "famille": {
      "depot": {
        "code": "INITNAV",
        "libelle": "Initiative en Navette"
      },
      "classe": {
        "code": "PIONLOI",
        "libelle": "Proposition de loi"
      },
      "espece": {
        "code": "CONST",
        "libelle": "constitutionnelle"
      }
    },
    "type": {
      "code": "PION",
      "libelle": "Proposition de loi"
    },
    "sousType": {
      "code": "CONST",
      "libelle": "constitutionnelle",
      "libelleEdition": "constitutionnelle"
    },
    "statutAdoption": null
  },
  "auteurs": {
    "auteur": {
      "organe": {
        "organeRef": "PO78718"
      }
    }
  },
  "correction": null,
  "notice": {
    "numNotice": "320",
    "formule": ", adoptée, par l'Assemblée nationale, autorisant la ratification de la Charte européenne des langues régionales ou minoritaires",
    "adoptionConforme": "false"
  },
  "indexation": null,
  "imprimerie": null,
  "coSignataires": null,
  "depotAmendements": {
    "amendementsSeance": {
      "amendable": "false",
      "dateLimiteDepot": null
    }
  }
}