{
  "@xsi:type": "texteLoi_Type",
  "uid": "PIONANR5L14BTC4403",
  "legislature": "14",
  "cycleDeVie": {
    "chrono": {
      "dateCreation": "2017-01-25T00:00:00.000+01:00",
      "dateDepot": "2017-01-25T00:00:00.000+01:00",
      "datePublication": "2017-01-27T00:00:00.000+01:00",
      "datePublicationWeb": "2017-01-25T16:00:00.000+01:00"
    }
  },
  "denominationStructurelle": "Proposition de loi",
  "provenance": "Texte Déposé",
  "titres": {
    "titrePrincipal": "proposition de loi sur la proposition de loi de Mme Huguette Bello, M. André Chassaigne et plusieurs de leurs collègues visant à assurer la revalorisation des pensions de retraites agricoles en France continentale et les Outre-mer (4348).",
    "titrePrincipalCourt": "revalorisation des pensions de retraites agricoles en France continentale et les outre-mer"
  },
  "divisions": null,
  "dossierRef": "DLR5L14N35468",
  "redacteur": null,
  "classification": {
    "famille": {
      "depot": {
        "code": "INITDEP",
        "libelle": "Initiative en 1er Dépôt"
      },
      "classe": {
        "code": "PIONLOI",
        "libelle": "Proposition de loi"
      }
    },
    "type": {
      "code": "PION",
      "libelle": "Proposition de loi"
    },
    "sousType": null,
    "statutAdoption": "ADOPTCOM"
  },
  "auteurs": {
    "auteur": [
      {
        "acteur": {
          "acteurRef": "PA267306",
          "qualite": "rapporteur"
        }
      },
      {
        "organe": {
          "organeRef": "PO420120"
        }
      }
    ]
  },
  "correction": null,
  "notice": {
    "numNotice": "4403",
    "formule": "sur la proposition de loi de Mme Huguette Bello, M. André Chassaigne et plusieurs de leurs collègues visant à assurer la revalorisation des pensions de retraites agricoles en France continentale et les Outre-mer (4348).",
    "adoptionConforme": "false"
  },
  "indexation": null,
  "imprimerie": {
    "prix": "1.5"
  },
  "coSignataires": null,
  "depotAmendements": {
    "amendementsSeance": {
      "amendable": "true",
      "dateLimiteDepot": null
    },
    "amendementsCommission": {
      "commission": {
        "organeRef": "PO420120",
        "amendable": "true",
        "dateLimiteDepot": null
      }
    }
  }
}