{
  "@xsi:type": "rapportParlementaire_Type",
  "uid": "RAPPANR5L14B1541",
  "legislature": "14",
  "cycleDeVie": {
    "chrono": {
      "dateCreation": "2013-11-12T00:00:00.000+01:00",
      "dateDepot": "2013-11-12T00:00:00.000+01:00",
      "datePublication": "2013-11-19T00:00:00.000+01:00",
      "datePublicationWeb": "2013-11-15T17:10:00.000+01:00"
    }
  },
  "denominationStructurelle": "Rapport",
  "provenance": "Commission",
  "titres": {
    "titrePrincipal": "rapport sur , en nouvelle lecture,  le projet de loi , adopté par l'Assemblée nationale après engagement de la procédure accélérée, garantissant l'avenir et la justice du système de retraites et qui a fait l'objet d'un vote de rejet, par le Sénat,  au cours de sa séance du 05/11/2013 (n°1532)",
    "titrePrincipalCourt": "rapport sur , en nouvelle lecture,  le projet de loi , adopté par l'Assemblée nationale après engagement de la procédure accélérée, garantissant l'avenir et la justice du système de retraites et qui a fait l'objet d'un vote de rejet, par le Sénat,  au cours de sa séance du 05/11/2013 (n°1532)"
  },
  "divisions": null,
  "dossierRef": "DLR5L14N31235",
  "redacteur": null,
  "classification": {
    "famille": {
      "depot": {
        "code": "RAPINIT",
        "libelle": "Rapport sur une initiative"
      },
      "classe": {
        "code": "RAPPORT",
        "libelle": "Rapport"
      }
    },
    "type": {
      "code": "RAPP",
      "libelle": "Rapport"
    },
    "sousType": null,
    "statutAdoption": "ADOPTCOM"
  },
  "auteurs": {
    "auteur": [
      {
        "acteur": {
          "acteurRef": "PA332384",
          "qualite": "rapporteur"
        }
      },
      {
        "organe": {
          "organeRef": "PO420120"
        }
      }
    ]
  },
  "correction": null,
  "notice": {
    "numNotice": "1541",
    "formule": "sur , en nouvelle lecture,  le projet de loi , adopté par l'Assemblée nationale après engagement de la procédure accélérée, garantissant l'avenir et la justice du système de retraites et qui a fait l'objet d'un vote de rejet, par le Sénat,  au cours de sa séance du 05/11/2013 (n°1532)",
    "adoptionConforme": "false"
  },
  "indexation": null,
  "imprimerie": {
    "prix": "3.0"
  }
}