{
  "@xsi:type": "texteLoi_Type",
  "uid": "PIONANR5L14B0270",
  "legislature": "14",
  "cycleDeVie": {
    "chrono": {
      "dateCreation": "2012-10-02T00:00:00.000+02:00",
      "dateDepot": "2012-10-10T00:00:00.000+02:00",
      "datePublication": null,
      "datePublicationWeb": "2012-10-11T16:30:00.000+02:00"
    }
  },
  "denominationStructurelle": "Proposition de loi",
  "provenance": "Texte Déposé",
  "titres": {
    "titrePrincipal": "proposition de loi relative au passage au scrutin proportionnel de liste pour les communes de 500 habitants et plus",
    "titrePrincipalCourt": "scrutin proportionnel de liste pour les communes de 500 habitants et plus"
  },
  "divisions": null,
  "dossierRef": "DLR5L14N29125",
  "redacteur": null,
  "classification": {
    "famille": {
      "depot": {
        "code": "INITDEP",
        "libelle": "Initiative en 1er Dépôt"
      },
      "classe": {
        "code": "PIONLOI",
        "libelle": "Proposition de loi"
      }
    },
    "type": {
      "code": "PION",
      "libelle": "Proposition de loi"
    },
    "sousType": null,
    "statutAdoption": null
  },
  "auteurs": {
    "auteur": {
      "acteur": {
        "acteurRef": "PA267492",
        "qualite": "auteur"
      }
    }
  },
  "correction": null,
  "notice": {
    "numNotice": "270",
    "formule": "relative au passage au scrutin proportionnel de liste pour les communes de 500 habitants et plus",
    "adoptionConforme": "false"
  },
  "indexation": null,
  "imprimerie": null,
  "coSignataires": {
    "coSignataire": [
      {
        "acteur": {
          "acteurRef": "PA295"
        },
        "dateCosignature": "2012-10-10+02:00",
        "dateRetraitCosignature": null,
        "edite": "false"
      },
      {
        "acteur": {
          "acteurRef": "PA551"
        },
        "dateCosignature": "2012-10-10+02:00",
        "dateRetraitCosignature": null,
        "edite": "false"
      },
      {
        "acteur": {
          "acteurRef": "PA689"
        },
        "dateCosignature": "2012-10-10+02:00",
        "dateRetraitCosignature": null,
        "edite": "false"
      },
      {
        "acteur": {
          "acteurRef": "PA754"
        },
        "dateCosignature": "2012-10-10+02:00",
        "dateRetraitCosignature": null,
        "edite": "false"
      },
      {
        "acteur": {
          "acteurRef": "PA340755"
        },
        "dateCosignature": "2012-10-10+02:00",
        "dateRetraitCosignature": null,
        "edite": "false"
      },
      {
        "acteur": {
          "acteurRef": "PA267306"
        },
        "dateCosignature": "2012-10-10+02:00",
        "dateRetraitCosignature": null,
        "edite": "false"
      },
      {
        "acteur": {
          "acteurRef": "PA1141"
        },
        "dateCosignature": "2012-10-10+02:00",
        "dateRetraitCosignature": null,
        "edite": "false"
      },
      {
        "acteur": {
          "acteurRef": "PA1364"
        },
        "dateCosignature": "2012-10-10+02:00",
        "dateRetraitCosignature": null,
        "edite": "false"
      },
      {
        "acteur": {
          "acteurRef": "PA605745"
        },
        "dateCosignature": "2012-10-10+02:00",
        "dateRetraitCosignature": null,
        "edite": "false"
      }
    ]
  },
  "depotAmendements": {
    "amendementsSeance": {
      "amendable": "false",
      "dateLimiteDepot": null
    },
    "amendementsCommission": {
      "commission": {
        "organeRef": "PO59051",
        "amendable": "true",
        "dateLimiteDepot": null
      }
    }
  }
}