{
  "@xsi:type": "texteLoi_Type",
  "uid": "AVISSNR5S198B0772",
  "legislature": null,
  "cycleDeVie": {
    "chrono": {
      "dateCreation": "2012-09-25T00:00:00.000+02:00",
      "dateDepot": "2012-09-20T00:00:00.000+02:00",
      "datePublication": null,
      "datePublicationWeb": null
    }
  },
  "denominationStructurelle": "Avis",
  "provenance": "Commission",
  "titres": {
    "titrePrincipal": "avis sur   le projet de loi , adopté par l'Assemblée nationale après engagement de la procédure accélérée, portant création des emplois d'avenir (n°760)",
    "titrePrincipalCourt": "avis sur   le projet de loi , adopté par l'Assemblée nationale après engagement de la procédure accélérée, portant création des emplois d'avenir (n°760)"
  },
  "divisions": null,
  "dossierRef": "DLR5L14N29012",
  "redacteur": null,
  "classification": {
    "famille": {
      "depot": {
        "code": "RAPINIT",
        "libelle": "Rapport sur une initiative"
      },
      "classe": {
        "code": "AVIS",
        "libelle": "Avis"
      }
    },
    "type": {
      "code": "AVIS",
      "libelle": "Avis"
    },
    "sousType": null,
    "statutAdoption": null
  },
  "auteurs": {
    "auteur": [
      {
        "acteur": {
          "acteurRef": "PA415459",
          "qualite": "rapporteur pour avis"
        }
      },
      {
        "organe": {
          "organeRef": "PO211490"
        }
      }
    ]
  },
  "correction": null,
  "notice": {
    "numNotice": "772",
    "formule": "sur   le projet de loi , adopté par l'Assemblée nationale après engagement de la procédure accélérée, portant création des emplois d'avenir (n°760)",
    "adoptionConforme": "false"
  },
  "indexation": {
    "themes": {
      "@niveau": "1",
      "theme": {
        "libelleTheme": "MAGISTRATURE"
      }
    }
  },
  "imprimerie": null,
  "coSignataires": null,
  "depotAmendements": null
}