{
  "@xsi:type": "texteLoi_Type",
  "uid": "AVISSNR5S219B0446",
  "legislature": null,
  "cycleDeVie": {
    "chrono": {
      "dateCreation": "2014-04-16T00:00:00.000+02:00",
      "dateDepot": "2014-04-09T00:00:00.000+02:00",
      "datePublication": null,
      "datePublicationWeb": null
    }
  },
  "denominationStructurelle": "Avis",
  "provenance": "Commission",
  "titres": {
    "titrePrincipal": "avis sur   le projet de loi , adopté, par l'Assemblée nationale après engagement de la procédure accélérée, relatif à l'artisanat, au commerce et aux très petites entreprises (n°376)",
    "titrePrincipalCourt": "avis sur   le projet de loi , adopté, par l'Assemblée nationale après engagement de la procédure accélérée, relatif à l'artisanat, au commerce et aux très petites entreprises (n°376)"
  },
  "divisions": null,
  "dossierRef": "DLR5L14N31032",
  "redacteur": null,
  "classification": {
    "famille": {
      "depot": {
        "code": "RAPINIT",
        "libelle": "Rapport sur une initiative"
      },
      "classe": {
        "code": "AVIS",
        "libelle": "Avis"
      }
    },
    "type": {
      "code": "AVIS",
      "libelle": "Avis"
    },
    "sousType": null,
    "statutAdoption": null
  },
  "auteurs": {
    "auteur": [
      {
        "acteur": {
          "acteurRef": "PA415488",
          "qualite": "rapporteur pour avis"
        }
      },
      {
        "organe": {
          "organeRef": "PO211495"
        }
      }
    ]
  },
  "correction": null,
  "notice": {
    "numNotice": "446",
    "formule": "sur   le projet de loi , adopté, par l'Assemblée nationale après engagement de la procédure accélérée, relatif à l'artisanat, au commerce et aux très petites entreprises (n°376)",
    "adoptionConforme": "false"
  },
  "indexation": null,
  "imprimerie": null,
  "coSignataires": null,
  "depotAmendements": null
}