{
  "@xsi:type": "texteLoi_Type",
  "uid": "RINFANR5L14B2052",
  "legislature": "14",
  "cycleDeVie": {
    "chrono": {
      "dateCreation": "2014-06-19T00:00:00.000+02:00",
      "dateDepot": "2014-06-19T00:00:00.000+02:00",
      "datePublication": "2014-06-25T00:00:00.000+02:00",
      "datePublicationWeb": "2014-06-23T17:55:00.000+02:00"
    }
  },
  "denominationStructurelle": "Rapport d'information",
  "provenance": "Commission",
  "titres": {
    "titrePrincipal": "rapport d'information déposé en application de l'article 146-3 du règlement, par le comité d'évaluation et de contrôle des politiques publiques sur la mise en oeuvre des conclusions du rapport d'information (n° 1225) du 4 juillet 2013 sur l'évaluation du soutien public aux exportations",
    "titrePrincipalCourt": "rapport d'information déposé en application de l'article 146-3 du règlement, par le comité d'évaluation et de contrôle des politiques publiques sur la mise en oeuvre des conclusions du rapport d'information (n° 1225) du 4 juillet 2013 sur l'évaluation du soutien public aux exportations"
  },
  "divisions": null,
  "dossierRef": "DLR5L14N33253",
  "redacteur": null,
  "classification": {
    "famille": {
      "depot": {
        "code": "RAPAUT",
        "libelle": "Rapport autonome"
      },
      "classe": {
        "code": "RAPINF",
        "libelle": "Rapport d'information"
      },
      "espece": {
        "code": "PRPDIT",
        "libelle": "tel quel"
      }
    },
    "type": {
      "code": "RINF",
      "libelle": "Rapport d'information"
    },
    "sousType": {
      "code": "PRPDIT",
      "libelle": "tel quel"
    },
    "statutAdoption": null
  },
  "auteurs": {
    "auteur": [
      {
        "acteur": {
          "acteurRef": "PA610125",
          "qualite": "rapporteur"
        }
      },
      {
        "acteur": {
          "acteurRef": "PA606225",
          "qualite": "rapporteur"
        }
      },
      {
        "organe": {
          "organeRef": "PO420375"
        }
      }
    ]
  },
  "correction": null,
  "notice": {
    "numNotice": "2052",
    "formule": "déposé en application de l'article 146-3 du règlement, par le comité d'évaluation et de contrôle des politiques publiques sur la mise en oeuvre des conclusions du rapport d'information (n° 1225) du 4 juillet 2013 sur l'évaluation du soutien public aux exportations",
    "adoptionConforme": "false"
  },
  "indexation": null,
  "imprimerie": {
    "prix": "3.5"
  },
  "coSignataires": null,
  "depotAmendements": null
}