{
  "@xsi:type": "rapportParlementaire_Type",
  "uid": "RAPPSNR5S259B0260",
  "legislature": null,
  "cycleDeVie": {
    "chrono": {
      "dateCreation": "2015-12-22T00:00:00.000+01:00",
      "dateDepot": "2015-12-16T00:00:00.000+01:00",
      "datePublication": null,
      "datePublicationWeb": null
    }
  },
  "denominationStructurelle": "Rapport",
  "provenance": "Commission",
  "titres": {
    "titrePrincipal": "rapport sur   le projet de loi , adopté, par l'Assemblée nationale après engagement de la procédure accélérée, autorisant l'approbation du quatrième avenant à la convention entre la France et le Grand-Duché de Luxembourg tendant à éviter les doubles impositions et à établir des règles d'assistance administrative réciproque en matière d'impôts sur le revenu et sur la fortune (n°250)",
    "titrePrincipalCourt": "rapport sur   le projet de loi , adopté, par l'Assemblée nationale après engagement de la procédure accélérée, autorisant l'approbation du quatrième avenant à la convention entre la France et le Grand-Duché de Luxembourg tendant à éviter les doubles impositions et à établir des règles d'assistance administrative réciproque en matière d'impôts sur le revenu et sur la fortune (n°250)"
  },
  "divisions": null,
  "dossierRef": "DLR5L14N34082",
  "redacteur": null,
  "classification": {
    "famille": {
      "depot": {
        "code": "RAPINIT",
        "libelle": "Rapport sur une initiative"
      },
      "classe": {
        "code": "RAPPORT",
        "libelle": "Rapport"
      }
    },
    "type": {
      "code": "RAPP",
      "libelle": "Rapport"
    },
    "sousType": null,
    "statutAdoption": null
  },
  "auteurs": {
    "auteur": [
      {
        "acteur": {
          "acteurRef": "PA415448",
          "qualite": "rapporteur"
        }
      },
      {
        "organe": {
          "organeRef": "PO211494"
        }
      }
    ]
  },
  "correction": null,
  "notice": {
    "numNotice": "260",
    "formule": "sur   le projet de loi , adopté, par l'Assemblée nationale après engagement de la procédure accélérée, autorisant l'approbation du quatrième avenant à la convention entre la France et le Grand-Duché de Luxembourg tendant à éviter les doubles impositions et à établir des règles d'assistance administrative réciproque en matière d'impôts sur le revenu et sur la fortune (n°250)",
    "adoptionConforme": "false"
  },
  "indexation": null,
  "imprimerie": null
}