{
  "@xsi:type": "texteLoi_Type",
  "uid": "PRJLANR5L14B4432",
  "legislature": "14",
  "cycleDeVie": {
    "chrono": {
      "dateCreation": "2017-02-01T00:00:00.000+01:00",
      "dateDepot": "2017-02-01T00:00:00.000+01:00",
      "datePublication": null,
      "datePublicationWeb": "2017-02-03T12:30:00.000+01:00"
    }
  },
  "denominationStructurelle": "Projet de loi",
  "provenance": "Texte Déposé",
  "titres": {
    "titrePrincipal": "projet de loi autorisant l’approbation du protocole annexe à la convention générale entre le Gouvernement de la République française et le Gouvernement de la République algérienne démocratique et populaire sur la sécurité sociale du 1er octobre 1980 relatif aux soins de santé programmés dispensés en France aux ressortissants algériens assurés sociaux et démunis non assurés sociaux résidant en Algérie",
    "titrePrincipalCourt": "soins de santé France Algérie"
  },
  "divisions": null,
  "dossierRef": "DLR5L14N35546",
  "redacteur": null,
  "classification": {
    "famille": {
      "depot": {
        "code": "INITDEP",
        "libelle": "Initiative en 1er Dépôt"
      },
      "classe": {
        "code": "PRJLOI",
        "libelle": "Projet de loi"
      },
      "espece": {
        "code": "AUTRATCONV",
        "libelle": "autorisant la ratification d'une convention"
      }
    },
    "type": {
      "code": "PRJL",
      "libelle": "Projet de loi"
    },
    "sousType": {
      "code": "AUTRATCONV",
      "libelle": "autorisant la ratification d'une convention",
      "libelleEdition": "autorisant la ratification d'une convention"
    },
    "statutAdoption": null
  },
  "auteurs": {
    "auteur": {
      "acteur": {
        "acteurRef": "PA785",
        "qualite": "auteur"
      }
    }
  },
  "correction": null,
  "notice": {
    "numNotice": "4432",
    "formule": "autorisant l’approbation du protocole annexe à la convention générale entre le Gouvernement de la République française et le Gouvernement de la République algérienne démocratique et populaire sur la sécurité sociale du 1er octobre 1980 relatif aux soins de santé programmés dispensés en France aux ressortissants algériens assurés sociaux et démunis non assurés sociaux résidant en Algérie",
    "adoptionConforme": "false"
  },
  "indexation": null,
  "imprimerie": null,
  "coSignataires": {
    "coSignataire": {
      "acteur": {
        "acteurRef": "PA328"
      },
      "dateCosignature": "2017-02-01+01:00",
      "dateRetraitCosignature": null,
      "edite": "true"
    }
  },
  "depotAmendements": {
    "amendementsSeance": {
      "amendable": "false",
      "dateLimiteDepot": null
    },
    "amendementsCommission": {
      "commission": {
        "organeRef": "PO59047",
        "amendable": "true",
        "dateLimiteDepot": null
      }
    }
  }
}