{
  "@xsi:type": "DossierLegislatif_Type",
  "uid": "DLR5L14N34141",
  "legislature": "14",
  "titreDossier": {
    "titre": "Entreprises : suppression des freins au développement",
    "titreChemin": "suppression_freins_developpement_entreprises",
    "senatChemin": null
  },
  "procedureParlementaire": {
    "code": "2",
    "libelle": "Proposition de loi ordinaire"
  },
  "initiateur": {
    "acteurs": {
      "acteur": {
        "acteurRef": "PA1695",
        "mandatRef": "PM645157"
      }
    }
  },
  "actesLegislatifs": {
    "acteLegislatif": {
      "@xsi:type": "Etape_Type",
      "uid": "L14-AN1-34141",
      "codeActe": "AN1",
      "libelleActe": {
        "nomCanonique": "1ère lecture (1ère assemblée saisie)",
        "libelleCourt": "1ère lecture"
      },
      "organeRef": "PO644420",
      "dateActe": null,
      "actesLegislatifs": {
        "acteLegislatif": [
          {
            "@xsi:type": "DepotInitiative_Type",
            "uid": "L14-VD174788DI",
            "codeActe": "AN1-DEPOT",
            "libelleActe": {
              "nomCanonique": "1er dépôt d'une initiative.",
              "libelleCourt": "1er dépôt d'une initiative."
            },
            "organeRef": "PO644420",
            "dateActe": "2015-07-22T00:00:00.000+02:00",
            "actesLegislatifs": null,
            "texteAssocie": "PIONANR5L14B3030"
          },
          {
            "@xsi:type": "Etape_Type",
            "uid": "L14-AN1-COM-34141",
            "codeActe": "AN1-COM",
            "libelleActe": {
              "nomCanonique": "Travaux des commissions",
              "libelleCourt": "Travaux des commissions"
            },
            "organeRef": "PO644420",
            "dateActe": null,
            "actesLegislatifs": {
              "acteLegislatif": {
                "@xsi:type": "Etape_Type",
                "uid": "L14-VD174789CF",
                "codeActe": "AN1-COM-FOND",
                "libelleActe": {
                  "nomCanonique": "Travaux de la commission saisie au fond",
                  "libelleCourt": "Travaux de la commission saisie au fond"
                },
                "organeRef": "PO420120",
                "dateActe": null,
                "actesLegislatifs": {
                  "acteLegislatif": [
                    {
                      "@xsi:type": "SaisieComFond_Type",
                      "uid": "L14-VD174789CFS",
                      "codeActe": "AN1-COM-FOND-SAISIE",
                      "libelleActe": {
                        "nomCanonique": "Renvoi en commission au fond",
                        "libelleCourt": "Renvoi en commission au fond"
                      },
                      "organeRef": "PO420120",
                      "dateActe": "2015-07-22T00:00:00.000+02:00",
                      "actesLegislatifs": null
                    },
                    {
                      "@xsi:type": "NominRapporteurs_Type",
                      "uid": "L14-VD174995",
                      "codeActe": "AN1-COM-FOND-NOMIN",
                      "libelleActe": {
                        "nomCanonique": "Nomination de rapporteur",
                        "libelleCourt": "Nomination de rapporteur"
                      },
                      "organeRef": "PO420120",
                      "dateActe": "2015-09-15T00:00:00.000+02:00",
                      "actesLegislatifs": null,
                      "rapporteurs": {
                        "rapporteur": {
                          "acteurRef": "PA856",
                          "typeRapporteur": "rapporteur"
                        }
                      },
                      "reunion": null
                    },
                    {
                      "@xsi:type": "DiscussionCommission_Type",
                      "uid": "L14-VD174953R22633",
                      "codeActe": "AN1-COM-FOND-REUNION",
                      "libelleActe": {
                        "nomCanonique": "Réunion de commission",
                        "libelleCourt": "Réunion de commission"
                      },
                      "organeRef": "PO420120",
                      "dateActe": "2015-09-15T14:30:00.000+02:00",
                      "actesLegislatifs": null,
                      "reunionRef": "RUANR5L14S2015IDC424026",
                      "odjRef": "RUANR5L14S2015IDC424026PT22633"
                    },
                    {
                      "@xsi:type": "DiscussionCommission_Type",
                      "uid": "L14-VD174953R22660",
                      "codeActe": "AN1-COM-FOND-REUNION",
                      "libelleActe": {
                        "nomCanonique": "Réunion de commission",
                        "libelleCourt": "Réunion de commission"
                      },
                      "organeRef": "PO420120",
                      "dateActe": "2015-09-29T15:00:00.000+02:00",
                      "actesLegislatifs": null,
                      "reunionRef": "RUANR5L14S2015IDC424029",
                      "odjRef": "RUANR5L14S2015IDC424029PT22660"
                    },
                    {
                      "@xsi:type": "DepotRapport_Type",
                      "uid": "L14-VD175155",
                      "codeActe": "AN1-COM-FOND-RAPPORT",
                      "libelleActe": {
                        "nomCanonique": "Dépôt de rapport",
                        "libelleCourt": "Dépôt de rapport"
                      },
                      "organeRef": "PO420120",
                      "dateActe": "2015-09-29T00:00:00.000+02:00",
                      "actesLegislatifs": null,
                      "texteAssocie": "RAPPANR5L14B3088",
                      "texteAdopte": null
                    }
                  ]
                }
              }
            }
          },
          {
            "@xsi:type": "Etape_Type",
            "uid": "L14-AN1-DEBATS-34141",
            "codeActe": "AN1-DEBATS",
            "libelleActe": {
              "nomCanonique": "Discussion en séance publique",
              "libelleCourt": "Discussion en séance publique"
            },
            "organeRef": "PO644420",
            "dateActe": null,
            "actesLegislatifs": {
              "acteLegislatif": [
                {
                  "@xsi:type": "DiscussionSeancePublique_Type",
                  "uid": "L14-VD174960S32646",
                  "codeActe": "AN1-DEBATS-SEANCE",
                  "libelleActe": {
                    "nomCanonique": "Discussion en séance publique",
                    "libelleCourt": "Discussion en séance publique"
                  },
                  "organeRef": "PO644420",
                  "dateActe": "2015-10-08T00:00:00.000+02:00",
                  "actesLegislatifs": null,
                  "reunionRef": "RUANR5L14S2016IDS19527",
                  "odjRef": "RUANR5L14S2016IDS19527PT32646"
                },
                {
                  "@xsi:type": "MotionProcedure_Type",
                  "uid": "L14-VD175296",
                  "codeActe": "AN1-DEBATS-MOTION",
                  "libelleActe": {
                    "nomCanonique": "Motion de procédure",
                    "libelleCourt": "Motion de procédure"
                  },
                  "organeRef": "PO644420",
                  "dateActe": "2015-10-08T00:00:00.000+02:00",
                  "actesLegislatifs": null,
                  "voteRefs": null,
                  "typeMotion": {
                    "fam_code": "TMP02",
                    "libelle": "Question préalable"
                  },
                  "auteurMotion": "PA1886",
                  "dateRetrait": null
                },
                {
                  "@xsi:type": "Decision_Type",
                  "uid": "L14-VD175279DEC",
                  "codeActe": "AN1-DEBATS-MOTION-VOTE",
                  "libelleActe": {
                    "nomCanonique": "Décision",
                    "libelleCourt": "Décision"
                  },
                  "organeRef": "PO644420",
                  "dateActe": "2015-10-08T00:00:00.000+02:00",
                  "actesLegislatifs": null,
                  "reunionRef": "RUANR5L14S2016IDS19527",
                  "statutConclusion": {
                    "fam_code": "TSORTF07",
                    "libelle": "rejetée"
                  },
                  "voteRefs": null,
                  "textesAssocies": {
                    "texteAssocie": {
                      "typeTexte": "BTA",
                      "refTexteAssocie": "PIONANR5L14BTA0595"
                    }
                  }
                }
              ]
            }
          }
        ]
      }
    }
  },
  "fusionDossier": null
}