{
  "@xsi:type": "texteLoi_Type",
  "uid": "PRJLSNR5S259B0861",
  "legislature": null,
  "cycleDeVie": {
    "chrono": {
      "dateCreation": "2016-10-04T00:00:00.000+02:00",
      "dateDepot": "2016-09-28T00:00:00.000+02:00",
      "datePublication": "2016-11-07T00:00:00.000+01:00",
      "datePublicationWeb": null
    }
  },
  "denominationStructurelle": "Projet de loi",
  "provenance": "Texte Déposé",
  "titres": {
    "titrePrincipal": "projet de loi relatif à une liaison ferroviaire entre Paris et l'aéroport Paris-Charles de Gaulle",
    "titrePrincipalCourt": "Liaison Paris - Charles de Gaulle"
  },
  "divisions": null,
  "dossierRef": "DLR5L14N35054",
  "redacteur": null,
  "classification": {
    "famille": {
      "depot": {
        "code": "INITNAV",
        "libelle": "Initiative en Navette"
      },
      "classe": {
        "code": "PRJLOI",
        "libelle": "Projet de loi"
      }
    },
    "type": {
      "code": "PRJL",
      "libelle": "Projet de loi"
    },
    "sousType": null,
    "statutAdoption": null
  },
  "auteurs": {
    "auteur": {
      "organe": {
        "organeRef": "PO78718"
      }
    }
  },
  "correction": null,
  "notice": {
    "numNotice": "861",
    "formule": ", adopté, par l'Assemblée nationale après engagement de la procédure accélérée, relatif à une liaison ferroviaire entre Paris et l'aéroport Paris-Charles de Gaulle",
    "adoptionConforme": "false"
  },
  "indexation": null,
  "imprimerie": null,
  "coSignataires": null,
  "depotAmendements": {
    "amendementsSeance": {
      "amendable": "false",
      "dateLimiteDepot": null
    }
  }
}