{
  "@xsi:type": "rapportParlementaire_Type",
  "uid": "RAPPANR5L14B2409",
  "legislature": "14",
  "cycleDeVie": {
    "chrono": {
      "dateCreation": "2014-11-27T00:00:00.000+01:00",
      "dateDepot": "2014-11-27T00:00:00.000+01:00",
      "datePublication": null,
      "datePublicationWeb": null
    }
  },
  "denominationStructurelle": "Rapport",
  "provenance": "Commission",
  "titres": {
    "titrePrincipal": "rapport , établi au nom de cet office, sur le principe d'innovation",
    "titrePrincipalCourt": "rapport , établi au nom de cet office, sur le principe d'innovation"
  },
  "divisions": null,
  "dossierRef": "DLR5L14N33605",
  "redacteur": null,
  "classification": {
    "famille": {
      "depot": {
        "code": "RAPAUT",
        "libelle": "Rapport autonome"
      },
      "classe": {
        "code": "RAPPORT",
        "libelle": "Rapport"
      },
      "espece": {
        "code": "OFFPARL",
        "libelle": "des offices parlementaires ou délégations mixtes"
      }
    },
    "type": {
      "code": "RAPP",
      "libelle": "Rapport"
    },
    "sousType": {
      "code": "OFFPARL",
      "libelle": "des offices parlementaires",
      "libelleEdition": "des offices parlementaires"
    },
    "statutAdoption": null
  },
  "auteurs": {
    "auteur": [
      {
        "acteur": {
          "acteurRef": "PA1871",
          "qualite": "rapporteur"
        }
      },
      {
        "acteur": {
          "acteurRef": "PA227094",
          "qualite": "rapporteur"
        }
      },
      {
        "organe": {
          "organeRef": "PO273589"
        }
      }
    ]
  },
  "correction": null,
  "notice": {
    "numNotice": "2409",
    "formule": ", établi au nom de cet office, sur le principe d'innovation",
    "adoptionConforme": "false"
  },
  "indexation": null,
  "imprimerie": null
}