{
  "@xsi:type": "DossierResolutionAN",
  "uid": "DLR5L14N33104",
  "legislature": "14",
  "titreDossier": {
    "titre": "Outre-mer : maintien d'une administration et de politiques publiques dédiées aux Français rapatriés d'outre-mer",
    "titreChemin": "administration_politique_publique_rapatries_outre-mer",
    "senatChemin": null
  },
  "procedureParlementaire": {
    "code": "22",
    "libelle": "Résolution Article 34-1"
  },
  "initiateur": {
    "acteurs": {
      "acteur": {
        "acteurRef": "PA267457",
        "mandatRef": "PM687216"
      }
    }
  },
  "actesLegislatifs": {
    "acteLegislatif": {
      "@xsi:type": "Etape_Type",
      "uid": "L14-ANLUNI-33104",
      "codeActe": "ANLUNI",
      "libelleActe": {
        "nomCanonique": "Lecture unique"
      },
      "organeRef": "PO644420",
      "dateActe": null,
      "actesLegislatifs": {
        "acteLegislatif": [
          {
            "@xsi:type": "DepotInitiative_Type",
            "uid": "L14-VD169527DI",
            "codeActe": "ANLUNI-DEPOT",
            "libelleActe": {
              "nomCanonique": "1er dépôt d'une initiative.",
              "libelleCourt": "1er dépôt d'une initiative."
            },
            "organeRef": "PO644420",
            "dateActe": "2014-04-10T00:00:00.000+02:00",
            "actesLegislatifs": null,
            "texteAssocie": "PNREANR5L14B1878"
          },
          {
            "@xsi:type": "Etape_Type",
            "uid": "L14-ANLUNI-DEBATS-33104",
            "codeActe": "ANLUNI-DEBATS",
            "libelleActe": {
              "nomCanonique": "Discussion en séance publique",
              "libelleCourt": "Discussion en séance publique"
            },
            "organeRef": "PO644420",
            "dateActe": null,
            "actesLegislatifs": {
              "acteLegislatif": [
                {
                  "@xsi:type": "DiscussionSeancePublique_Type",
                  "uid": "L14-VD169916S30891",
                  "codeActe": "ANLUNI-DEBATS-SEANCE",
                  "libelleActe": {
                    "nomCanonique": "Discussion en séance publique",
                    "libelleCourt": "Discussion en séance publique"
                  },
                  "organeRef": "PO644420",
                  "dateActe": "2014-06-12T00:00:00.000+02:00",
                  "actesLegislatifs": null,
                  "reunionRef": "RUANR5L14S2014IDS18552",
                  "odjRef": "RUANR5L14S2014IDS18552PT30891"
                },
                {
                  "@xsi:type": "DiscussionSeancePublique_Type",
                  "uid": "L14-VD169916S30953",
                  "codeActe": "ANLUNI-DEBATS-SEANCE",
                  "libelleActe": {
                    "nomCanonique": "Discussion en séance publique",
                    "libelleCourt": "Discussion en séance publique"
                  },
                  "organeRef": "PO644420",
                  "dateActe": "2014-06-17T00:00:00.000+02:00",
                  "actesLegislatifs": null,
                  "reunionRef": "RUANR5L14S2014IDS18560",
                  "odjRef": "RUANR5L14S2014IDS18560PT30953"
                },
                {
                  "@xsi:type": "Decision_Type",
                  "uid": "L14-VD170375DEC",
                  "codeActe": "ANLUNI-DEBATS-DEC",
                  "libelleActe": {
                    "nomCanonique": "Décision",
                    "libelleCourt": "Décision"
                  },
                  "organeRef": "PO644420",
                  "dateActe": "2014-06-17T00:00:00.000+02:00",
                  "actesLegislatifs": null,
                  "reunionRef": "RUANR5L14S2014IDS18560",
                  "statutConclusion": {
                    "fam_code": "TSORTF07",
                    "libelle": "rejetée"
                  },
                  "voteRefs": {
                    "voteRef": "VTANR5L14V835"
                  },
                  "textesAssocies": {
                    "texteAssocie": {
                      "typeTexte": "BTA",
                      "refTexteAssocie": "PNREANR5L14BTA0355"
                    }
                  }
                }
              ]
            }
          }
        ]
      }
    }
  },
  "fusionDossier": null
}