{
  "@xsi:type": "texteLoi_Type",
  "uid": "PRJLANR5L14B0426",
  "legislature": "14",
  "cycleDeVie": {
    "chrono": {
      "dateCreation": "2012-11-21T00:00:00.000+01:00",
      "dateDepot": "2012-11-21T00:00:00.000+01:00",
      "datePublication": "2013-06-27T00:00:00.000+02:00",
      "datePublicationWeb": "2012-11-22T18:00:00.000+01:00"
    }
  },
  "denominationStructurelle": "Projet de loi",
  "provenance": "Texte Déposé",
  "titres": {
    "titrePrincipal": "projet de loi autorisant la ratification du traité instituant un partenariat de défense entre la République française et la République de Côte d’Ivoire",
    "titrePrincipalCourt": "ratification du traité instituant un partenariat de défense entre la République française et la République de Côte d’Ivoire"
  },
  "divisions": null,
  "dossierRef": "DLR5L14N29359",
  "redacteur": null,
  "classification": {
    "famille": {
      "depot": {
        "code": "INITDEP",
        "libelle": "Initiative en 1er Dépôt"
      },
      "classe": {
        "code": "PRJLOI",
        "libelle": "Projet de loi"
      },
      "espece": {
        "code": "AUTRATCONV",
        "libelle": "autorisant la ratification d'une convention"
      }
    },
    "type": {
      "code": "PRJL",
      "libelle": "Projet de loi"
    },
    "sousType": {
      "code": "AUTRATCONV",
      "libelle": "autorisant la ratification d'une convention",
      "libelleEdition": "autorisant la ratification d'une convention"
    },
    "statutAdoption": null
  },
  "auteurs": {
    "auteur": {
      "acteur": {
        "acteurRef": "PA328",
        "qualite": "auteur"
      }
    }
  },
  "correction": null,
  "notice": {
    "numNotice": "426",
    "formule": "autorisant la ratification du traité instituant un partenariat de défense entre la République française et la République de Côte d’Ivoire",
    "adoptionConforme": "false"
  },
  "indexation": {
    "themes": {
      "@niveau": "1",
      "theme": {
        "libelleTheme": "LOIS DE FINANCES"
      }
    }
  },
  "imprimerie": null,
  "coSignataires": {
    "coSignataire": {
      "acteur": {
        "acteurRef": "PA1268"
      },
      "dateCosignature": "2012-11-21+01:00",
      "dateRetraitCosignature": null,
      "edite": "true"
    }
  },
  "depotAmendements": {
    "amendementsSeance": {
      "amendable": "false",
      "dateLimiteDepot": null
    },
    "amendementsCommission": {
      "commission": [
        {
          "organeRef": "PO59046",
          "amendable": "true",
          "dateLimiteDepot": null
        },
        {
          "organeRef": "PO59047",
          "amendable": "true",
          "dateLimiteDepot": null
        }
      ]
    }
  }
}