{
  "@xsi:type": "texteLoi_Type",
  "uid": "PRJLANR5L14B3392",
  "legislature": "14",
  "cycleDeVie": {
    "chrono": {
      "dateCreation": "2016-01-13T00:00:00.000+01:00",
      "dateDepot": "2016-01-13T00:00:00.000+01:00",
      "datePublication": null,
      "datePublicationWeb": "2016-01-15T16:35:00.000+01:00"
    }
  },
  "denominationStructurelle": "Projet de loi",
  "provenance": "Texte Déposé",
  "titres": {
    "titrePrincipal": "projet de loi ratifiant l’ordonnance n° 2015-1075 du 27 août 2015 relative à la simplification des modalités d'information des acquéreurs prévues aux articles L. 721-2 et L. 721-3 du code de la construction et de l'habitation",
    "titrePrincipalCourt": "simplification des modalités d'information des acquéreurs"
  },
  "divisions": null,
  "dossierRef": "DLR5L14N34623",
  "redacteur": null,
  "classification": {
    "famille": {
      "depot": {
        "code": "INITDEP",
        "libelle": "Initiative en 1er Dépôt"
      },
      "classe": {
        "code": "PRJLOI",
        "libelle": "Projet de loi"
      }
    },
    "type": {
      "code": "PRJL",
      "libelle": "Projet de loi"
    },
    "sousType": null,
    "statutAdoption": null
  },
  "auteurs": {
    "auteur": {
      "acteur": {
        "acteurRef": "PA267622",
        "qualite": "auteur"
      }
    }
  },
  "correction": null,
  "notice": {
    "numNotice": "3392",
    "formule": "ratifiant l’ordonnance n° 2015-1075 du 27 août 2015 relative à la simplification des modalités d'information des acquéreurs prévues aux articles L. 721-2 et L. 721-3 du code de la construction et de l'habitation",
    "adoptionConforme": "false"
  },
  "indexation": null,
  "imprimerie": null,
  "coSignataires": {
    "coSignataire": {
      "acteur": {
        "acteurRef": "PA336175"
      },
      "dateCosignature": "2016-01-13+01:00",
      "dateRetraitCosignature": null,
      "edite": "true"
    }
  },
  "depotAmendements": {
    "amendementsSeance": {
      "amendable": "false",
      "dateLimiteDepot": null
    },
    "amendementsCommission": {
      "commission": {
        "organeRef": "PO419865",
        "amendable": "true",
        "dateLimiteDepot": null
      }
    }
  }
}