{
  "@xsi:type": "texteLoi_Type",
  "uid": "PIONANR5L14BTC0199",
  "legislature": "14",
  "cycleDeVie": {
    "chrono": {
      "dateCreation": "2012-09-20T00:00:00.000+02:00",
      "dateDepot": "2012-09-20T00:00:00.000+02:00",
      "datePublication": "2012-09-24T00:00:00.000+02:00",
      "datePublicationWeb": "2012-09-20T22:00:00.000+02:00"
    }
  },
  "denominationStructurelle": "Proposition de loi",
  "provenance": "Texte Déposé",
  "titres": {
    "titrePrincipal": "proposition de loi sur la proposition de loi , après engagement de la procédure accélérée,de MM. François Brottes et Bruno Le Roux et plusieurs de leurs collègues instaurant une tarification progressive de l'énergie (150)",
    "titrePrincipalCourt": "tarification progressive de l'énergie"
  },
  "divisions": null,
  "dossierRef": "DLR5L14N29019",
  "redacteur": null,
  "classification": {
    "famille": {
      "depot": {
        "code": "INITDEP",
        "libelle": "Initiative en 1er Dépôt"
      },
      "classe": {
        "code": "PIONLOI",
        "libelle": "Proposition de loi"
      }
    },
    "type": {
      "code": "PION",
      "libelle": "Proposition de loi"
    },
    "sousType": null,
    "statutAdoption": "ADOPTCOM"
  },
  "auteurs": {
    "auteur": [
      {
        "acteur": {
          "acteurRef": "PA680",
          "qualite": "rapporteur"
        }
      },
      {
        "organe": {
          "organeRef": "PO419610"
        }
      }
    ]
  },
  "correction": null,
  "notice": {
    "numNotice": "199",
    "formule": "sur la proposition de loi , après engagement de la procédure accélérée,de MM. François Brottes et Bruno Le Roux et plusieurs de leurs collègues instaurant une tarification progressive de l'énergie (150)",
    "adoptionConforme": "false"
  },
  "indexation": {
    "themes": {
      "@niveau": "1",
      "theme": {
        "libelleTheme": "ETRANGERS"
      }
    }
  },
  "imprimerie": {
    "prix": "4.0"
  },
  "coSignataires": null,
  "depotAmendements": {
    "amendementsSeance": {
      "amendable": "true",
      "dateLimiteDepot": null
    },
    "amendementsCommission": {
      "commission": {
        "organeRef": "PO419610",
        "amendable": "true",
        "dateLimiteDepot": null
      }
    }
  }
}