{
  "@xsi:type": "texteLoi_Type",
  "uid": "PIONANR5L14B0641",
  "legislature": "14",
  "cycleDeVie": {
    "chrono": {
      "dateCreation": "2013-01-17T00:00:00.000+01:00",
      "dateDepot": "2013-01-23T00:00:00.000+01:00",
      "datePublication": null,
      "datePublicationWeb": "2013-01-24T17:45:00.000+01:00"
    }
  },
  "denominationStructurelle": "Proposition de loi",
  "provenance": "Texte Déposé",
  "titres": {
    "titrePrincipal": "proposition de loi tendant à l'amélioration de l'accès aux pharmacies en milieu rural",
    "titrePrincipalCourt": "Amélioration de l'accès aux pharmacies en milieu rural"
  },
  "divisions": null,
  "dossierRef": "DLR5L14N29598",
  "redacteur": null,
  "classification": {
    "famille": {
      "depot": {
        "code": "INITDEP",
        "libelle": "Initiative en 1er Dépôt"
      },
      "classe": {
        "code": "PIONLOI",
        "libelle": "Proposition de loi"
      }
    },
    "type": {
      "code": "PION",
      "libelle": "Proposition de loi"
    },
    "sousType": null,
    "statutAdoption": null
  },
  "auteurs": {
    "auteur": {
      "acteur": {
        "acteurRef": "PA2876",
        "qualite": "auteur"
      }
    }
  },
  "correction": null,
  "notice": {
    "numNotice": "641",
    "formule": "tendant à l'amélioration de l'accès aux pharmacies en milieu rural",
    "adoptionConforme": "false"
  },
  "indexation": null,
  "imprimerie": null,
  "coSignataires": null,
  "depotAmendements": {
    "amendementsSeance": {
      "amendable": "false",
      "dateLimiteDepot": null
    },
    "amendementsCommission": {
      "commission": {
        "organeRef": "PO420120",
        "amendable": "true",
        "dateLimiteDepot": null
      }
    }
  }
}