{
  "@xsi:type": "texteLoi_Type",
  "uid": "PRJLSNR5S199B0805",
  "legislature": null,
  "cycleDeVie": {
    "chrono": {
      "dateCreation": "2013-07-24T00:00:00.000+02:00",
      "dateDepot": "2013-07-24T00:00:00.000+02:00",
      "datePublication": "2013-11-07T00:00:00.000+01:00",
      "datePublicationWeb": null
    }
  },
  "denominationStructurelle": "Projet de loi",
  "provenance": "Texte Déposé",
  "titres": {
    "titrePrincipal": "projet de loi relatif à l'économie sociale et solidaire",
    "titrePrincipalCourt": "Economie sociale et solidaire"
  },
  "divisions": null,
  "dossierRef": "DLR5L14N30940",
  "redacteur": null,
  "classification": {
    "famille": {
      "depot": {
        "code": "INITDEP",
        "libelle": "Initiative en 1er Dépôt"
      },
      "classe": {
        "code": "PRJLOI",
        "libelle": "Projet de loi"
      }
    },
    "type": {
      "code": "PRJL",
      "libelle": "Projet de loi"
    },
    "sousType": null,
    "statutAdoption": null
  },
  "auteurs": {
    "auteur": {
      "acteur": {
        "acteurRef": "PA328",
        "qualite": "auteur"
      }
    }
  },
  "correction": null,
  "notice": {
    "numNotice": "805",
    "formule": "relatif à l'économie sociale et solidaire",
    "adoptionConforme": "false"
  },
  "indexation": null,
  "imprimerie": null,
  "coSignataires": {
    "coSignataire": [
      {
        "acteur": {
          "acteurRef": "PA2240"
        },
        "dateCosignature": "2013-07-24+02:00",
        "dateRetraitCosignature": null,
        "edite": "true"
      },
      {
        "acteur": {
          "acteurRef": "PA590032"
        },
        "dateCosignature": "2013-07-24+02:00",
        "dateRetraitCosignature": null,
        "edite": "true"
      }
    ]
  },
  "depotAmendements": {
    "amendementsSeance": {
      "amendable": "false",
      "dateLimiteDepot": null
    }
  }
}