{
  "@xsi:type": "DossierLegislatif_Type",
  "uid": "DLR5L14N34883",
  "legislature": "14",
  "titreDossier": {
    "titre": "Traités et conventions : ratification de l'accord de Paris sur la COP21",
    "titreChemin": "ratification_accord_cop21",
    "senatChemin": "http://www.senat.fr/dossier-legislatif/pjl15-614.html"
  },
  "procedureParlementaire": {
    "code": "6",
    "libelle": "Projet de ratification des traités et conventions"
  },
  "initiateur": {
    "acteurs": {
      "acteur": [
        {
          "acteurRef": "PA267622",
          "mandatRef": "PM702957"
        },
        {
          "acteurRef": "PA328",
          "mandatRef": "PM711554"
        },
        {
          "acteurRef": "PA2650",
          "mandatRef": "PM711559"
        }
      ]
    }
  },
  "actesLegislatifs": {
    "acteLegislatif": [
      {
        "@xsi:type": "Etape_Type",
        "uid": "L14-AN1-34883",
        "codeActe": "AN1",
        "libelleActe": {
          "nomCanonique": "1ère lecture (1ère assemblée saisie)",
          "libelleCourt": "1ère lecture"
        },
        "organeRef": "PO644420",
        "dateActe": null,
        "actesLegislatifs": {
          "acteLegislatif": [
            {
              "@xsi:type": "DepotInitiative_Type",
              "uid": "L14-VD177898DI",
              "codeActe": "AN1-DEPOT",
              "libelleActe": {
                "nomCanonique": "1er dépôt d'une initiative.",
                "libelleCourt": "1er dépôt d'une initiative."
              },
              "organeRef": "PO644420",
              "dateActe": "2016-05-04T00:00:00.000+02:00",
              "actesLegislatifs": null,
              "texteAssocie": "PRJLANR5L14B3719"
            },
            {
              "@xsi:type": "EtudeImpact_Type",
              "uid": "L14-VD177898ETI",
              "codeActe": "AN1-ETI",
              "libelleActe": {
                "nomCanonique": "Etude d'impact",
                "libelleCourt": "Etude d'impact"
              },
              "organeRef": "PO644420",
              "dateActe": "2016-05-04T00:00:00.000+02:00",
              "actesLegislatifs": null,
              "texteAssocie": "ETDIANR5L14B3719",
              "contributionInternaute": {
                "dateFermeture": "2016-05-17+02:00",
                "dateOuverture": "2016-05-10+02:00"
              }
            },
            {
              "@xsi:type": "DepotAccordInternational_Type",
              "uid": "L14-VD177898ACIN",
              "codeActe": "AN1-ACIN",
              "libelleActe": {
                "nomCanonique": "Accord international",
                "libelleCourt": "Accord international"
              },
              "organeRef": "PO644420",
              "dateActe": "2016-05-04T00:00:00.000+02:00",
              "actesLegislatifs": null,
              "texteAssocie": "ACINANR5L14B3719"
            },
            {
              "@xsi:type": "ProcedureAccelere_Type",
              "uid": "L14-VD177900",
              "codeActe": "AN1-PROCACC",
              "libelleActe": {
                "nomCanonique": "Le gouvernement déclare l'urgence / engage la procédure accélérée",
                "libelleCourt": "Le gouvernement déclare l'urgence / engage la procédure accélérée"
              },
              "organeRef": "PO702883",
              "dateActe": "2016-05-04T00:00:00.000+02:00",
              "actesLegislatifs": null
            },
            {
              "@xsi:type": "Etape_Type",
              "uid": "L14-AN1-COM-34883",
              "codeActe": "AN1-COM",
              "libelleActe": {
                "nomCanonique": "Travaux des commissions",
                "libelleCourt": "Travaux des commissions"
              },
              "organeRef": "PO644420",
              "dateActe": null,
              "actesLegislatifs": {
                "acteLegislatif": [
                  {
                    "@xsi:type": "Etape_Type",
                    "uid": "L14-VD177899CF",
                    "codeActe": "AN1-COM-FOND",
                    "libelleActe": {
                      "nomCanonique": "Travaux de la commission saisie au fond",
                      "libelleCourt": "Travaux de la commission saisie au fond"
                    },
                    "organeRef": "PO59047",
                    "dateActe": null,
                    "actesLegislatifs": {
                      "acteLegislatif": [
                        {
                          "@xsi:type": "SaisieComFond_Type",
                          "uid": "L14-VD177899CFS",
                          "codeActe": "AN1-COM-FOND-SAISIE",
                          "libelleActe": {
                            "nomCanonique": "Renvoi en commission au fond",
                            "libelleCourt": "Renvoi en commission au fond"
                          },
                          "organeRef": "PO59047",
                          "dateActe": "2016-05-04T00:00:00.000+02:00",
                          "actesLegislatifs": null
                        },
                        {
                          "@xsi:type": "NominRapporteurs_Type",
                          "uid": "L14-VD177921",
                          "codeActe": "AN1-COM-FOND-NOMIN",
                          "libelleActe": {
                            "nomCanonique": "Nomination de rapporteur",
                            "libelleCourt": "Nomination de rapporteur"
                          },
                          "organeRef": "PO59047",
                          "dateActe": "2016-03-30T00:00:00.000+02:00",
                          "actesLegislatifs": null,
                          "rapporteurs": {
                            "rapporteur": {
                              "acteurRef": "PA610936",
                              "typeRapporteur": "rapporteur"
                            }
                          },
                          "reunion": null
                        },
                        {
                          "@xsi:type": "DiscussionCommission_Type",
                          "uid": "L14-VD177915R23648",
                          "codeActe": "AN1-COM-FOND-REUNION",
                          "libelleActe": {
                            "nomCanonique": "Réunion de commission",
                            "libelleCourt": "Réunion de commission"
                          },
                          "organeRef": "PO59047",
                          "dateActe": "2016-05-11T16:30:00.000+02:00",
                          "actesLegislatifs": null,
                          "reunionRef": "RUANR5L14S2016IDC425465",
                          "odjRef": "RUANR5L14S2016IDC425465PT23648"
                        },
                        {
                          "@xsi:type": "DepotRapport_Type",
                          "uid": "L14-VD178010",
                          "codeActe": "AN1-COM-FOND-RAPPORT",
                          "libelleActe": {
                            "nomCanonique": "Dépôt de rapport",
                            "libelleCourt": "Dépôt de rapport"
                          },
                          "organeRef": "PO59047",
                          "dateActe": "2016-05-11T00:00:00.000+02:00",
                          "actesLegislatifs": null,
                          "texteAssocie": "RAPPANR5L14B3743",
                          "texteAdopte": null
                        }
                      ]
                    }
                  },
                  {
                    "@xsi:type": "Etape_Type",
                    "uid": "L14-VD177901CA",
                    "codeActe": "AN1-COM-AVIS",
                    "libelleActe": {
                      "nomCanonique": "Travaux d'une commission saisie pour avis",
                      "libelleCourt": "Travaux d'une commission saisie pour avis"
                    },
                    "organeRef": "PO419865",
                    "dateActe": null,
                    "actesLegislatifs": {
                      "acteLegislatif": [
                        {
                          "@xsi:type": "SaisieComAvis_Type",
                          "uid": "L14-VD177901CAS",
                          "codeActe": "AN1-COM-AVIS-SAISIE",
                          "libelleActe": {
                            "nomCanonique": "Saisine pour avis d'une commission",
                            "libelleCourt": "Saisine pour avis d'une commission"
                          },
                          "organeRef": "PO419865",
                          "dateActe": "2016-05-04T00:00:00.000+02:00",
                          "actesLegislatifs": null
                        },
                        {
                          "@xsi:type": "NominRapporteurs_Type",
                          "uid": "L14-VD177965",
                          "codeActe": "AN1-COM-AVIS-NOMIN",
                          "libelleActe": {
                            "nomCanonique": "Nomination de rapporteur",
                            "libelleCourt": "Nomination de rapporteur"
                          },
                          "organeRef": "PO419865",
                          "dateActe": "2016-04-27T00:00:00.000+02:00",
                          "actesLegislatifs": null,
                          "rapporteurs": {
                            "rapporteur": {
                              "acteurRef": "PA810",
                              "typeRapporteur": "rapporteur pour avis"
                            }
                          },
                          "reunion": null
                        },
                        {
                          "@xsi:type": "DiscussionCommission_Type",
                          "uid": "L14-VD177915R23645",
                          "codeActe": "AN1-COM-AVIS-REUNION",
                          "libelleActe": {
                            "nomCanonique": "Réunion de commission",
                            "libelleCourt": "Réunion de commission"
                          },
                          "organeRef": "PO419865",
                          "dateActe": "2016-05-11T09:45:00.000+02:00",
                          "actesLegislatifs": null,
                          "reunionRef": null,
                          "odjRef": null
                        },
                        {
                          "@xsi:type": "DepotRapport_Type",
                          "uid": "L14-VD177988",
                          "codeActe": "AN1-COM-AVIS-RAPPORT",
                          "libelleActe": {
                            "nomCanonique": "Dépôt de rapport",
                            "libelleCourt": "Dépôt de rapport"
                          },
                          "organeRef": "PO419865",
                          "dateActe": "2016-05-11T00:00:00.000+02:00",
                          "actesLegislatifs": null,
                          "texteAssocie": "AVISANR5L14B3733",
                          "texteAdopte": null
                        }
                      ]
                    }
                  }
                ]
              }
            },
            {
              "@xsi:type": "Etape_Type",
              "uid": "L14-AN1-DEBATS-34883",
              "codeActe": "AN1-DEBATS",
              "libelleActe": {
                "nomCanonique": "Discussion en séance publique",
                "libelleCourt": "Discussion en séance publique"
              },
              "organeRef": "PO644420",
              "dateActe": null,
              "actesLegislatifs": {
                "acteLegislatif": [
                  {
                    "@xsi:type": "DiscussionSeancePublique_Type",
                    "uid": "L14-VD177949S33627",
                    "codeActe": "AN1-DEBATS-SEANCE",
                    "libelleActe": {
                      "nomCanonique": "Discussion en séance publique",
                      "libelleCourt": "Discussion en séance publique"
                    },
                    "organeRef": "PO644420",
                    "dateActe": "2016-05-17T00:00:00.000+02:00",
                    "actesLegislatifs": null,
                    "reunionRef": "RUANR5L14S2016IDS20001",
                    "odjRef": "RUANR5L14S2016IDS20001PT33627"
                  },
                  {
                    "@xsi:type": "Decision_Type",
                    "uid": "L14-VD178063DEC",
                    "codeActe": "AN1-DEBATS-DEC",
                    "libelleActe": {
                      "nomCanonique": "Décision",
                      "libelleCourt": "Décision"
                    },
                    "organeRef": "PO644420",
                    "dateActe": "2016-05-17T00:00:00.000+02:00",
                    "actesLegislatifs": null,
                    "reunionRef": "RUANR5L14S2016IDS20001",
                    "statutConclusion": {
                      "fam_code": "TSORTF01",
                      "libelle": "adopté"
                    },
                    "voteRefs": null,
                    "textesAssocies": {
                      "texteAssocie": {
                        "typeTexte": "BTA",
                        "refTexteAssocie": "PRJLANR5L14BTA0729"
                      }
                    }
                  }
                ]
              }
            }
          ]
        }
      },
      {
        "@xsi:type": "Etape_Type",
        "uid": "L14-SN1-34883",
        "codeActe": "SN1",
        "libelleActe": {
          "nomCanonique": "1ère lecture (2ème assemblée saisie)",
          "libelleCourt": "1ère lecture"
        },
        "organeRef": "PO78718",
        "dateActe": null,
        "actesLegislatifs": {
          "acteLegislatif": [
            {
              "@xsi:type": "DepotInitiativeNavette_Type",
              "uid": "L14-VD178145DIN",
              "codeActe": "SN1-DEPOT",
              "libelleActe": {
                "nomCanonique": "Dépôt d'une initiative en navette",
                "libelleCourt": "Dépôt d'une initiative en navette"
              },
              "organeRef": "PO78718",
              "dateActe": "2016-05-18T00:00:00.000+02:00",
              "actesLegislatifs": null,
              "texteAssocie": "PRJLSNR5S259B0614",
              "provenance": "PO644420"
            },
            {
              "@xsi:type": "Etape_Type",
              "uid": "L14-SN1-COM-34883",
              "codeActe": "SN1-COM",
              "libelleActe": {
                "nomCanonique": "Travaux des commissions",
                "libelleCourt": "Travaux des commissions"
              },
              "organeRef": "PO78718",
              "dateActe": null,
              "actesLegislatifs": {
                "acteLegislatif": [
                  {
                    "@xsi:type": "Etape_Type",
                    "uid": "L14-VD178146CF",
                    "codeActe": "SN1-COM-FOND",
                    "libelleActe": {
                      "nomCanonique": "Travaux de la commission saisie au fond",
                      "libelleCourt": "Travaux de la commission saisie au fond"
                    },
                    "organeRef": "PO211491",
                    "dateActe": null,
                    "actesLegislatifs": {
                      "acteLegislatif": [
                        {
                          "@xsi:type": "SaisieComFond_Type",
                          "uid": "L14-VD178146CFS",
                          "codeActe": "SN1-COM-FOND-SAISIE",
                          "libelleActe": {
                            "nomCanonique": "Renvoi en commission au fond",
                            "libelleCourt": "Renvoi en commission au fond"
                          },
                          "organeRef": "PO211491",
                          "dateActe": "2016-05-18T00:00:00.000+02:00",
                          "actesLegislatifs": null
                        },
                        {
                          "@xsi:type": "NominRapporteurs_Type",
                          "uid": "L14-VD178229",
                          "codeActe": "SN1-COM-FOND-NOMIN",
                          "libelleActe": {
                            "nomCanonique": "Nomination de rapporteur",
                            "libelleCourt": "Nomination de rapporteur"
                          },
                          "organeRef": "PO211491",
                          "dateActe": "2016-05-11T00:00:00.000+02:00",
                          "actesLegislatifs": null,
                          "rapporteurs": {
                            "rapporteur": {
                              "acteurRef": "PA304085",
                              "typeRapporteur": "rapporteur"
                            }
                          },
                          "reunion": null
                        },
                        {
                          "@xsi:type": "DepotRapport_Type",
                          "uid": "L14-VD178240",
                          "codeActe": "SN1-COM-FOND-RAPPORT",
                          "libelleActe": {
                            "nomCanonique": "Dépôt de rapport",
                            "libelleCourt": "Dépôt de rapport"
                          },
                          "organeRef": "PO211491",
                          "dateActe": "2016-05-25T00:00:00.000+02:00",
                          "actesLegislatifs": null,
                          "texteAssocie": "RAPPSNR5S259B0628",
                          "texteAdopte": null
                        }
                      ]
                    }
                  },
                  {
                    "@xsi:type": "Etape_Type",
                    "uid": "L14-VD178291CA",
                    "codeActe": "SN1-COM-AVIS",
                    "libelleActe": {
                      "nomCanonique": "Travaux d'une commission saisie pour avis",
                      "libelleCourt": "Travaux d'une commission saisie pour avis"
                    },
                    "organeRef": "PO516754",
                    "dateActe": null,
                    "actesLegislatifs": {
                      "acteLegislatif": [
                        {
                          "@xsi:type": "SaisieComAvis_Type",
                          "uid": "L14-VD178291CAS",
                          "codeActe": "SN1-COM-AVIS-SAISIE",
                          "libelleActe": {
                            "nomCanonique": "Saisine pour avis d'une commission",
                            "libelleCourt": "Saisine pour avis d'une commission"
                          },
                          "organeRef": "PO516754",
                          "dateActe": "2016-05-11T00:00:00.000+02:00",
                          "actesLegislatifs": null
                        },
                        {
                          "@xsi:type": "NominRapporteurs_Type",
                          "uid": "L14-VD178292",
                          "codeActe": "SN1-COM-AVIS-NOMIN",
                          "libelleActe": {
                            "nomCanonique": "Nomination de rapporteur",
                            "libelleCourt": "Nomination de rapporteur"
                          },
                          "organeRef": "PO516754",
                          "dateActe": "2016-05-11T00:00:00.000+02:00",
                          "actesLegislatifs": null,
                          "rapporteurs": {
                            "rapporteur": {
                              "acteurRef": "PA513",
                              "typeRapporteur": "rapporteur pour avis"
                            }
                          },
                          "reunion": null
                        },
                        {
                          "@xsi:type": "DepotRapport_Type",
                          "uid": "L14-VD178293",
                          "codeActe": "SN1-COM-AVIS-RAPPORT",
                          "libelleActe": {
                            "nomCanonique": "Dépôt de rapport",
                            "libelleCourt": "Dépôt de rapport"
                          },
                          "organeRef": "PO516754",
                          "dateActe": "2016-06-01T00:00:00.000+02:00",
                          "actesLegislatifs": null,
                          "texteAssocie": "AVISSNR5S259B0652",
                          "texteAdopte": null
                        }
                      ]
                    }
                  }
                ]
              }
            },
            {
              "@xsi:type": "Etape_Type",
              "uid": "L14-SN1-DEBATS-34883",
              "codeActe": "SN1-DEBATS",
              "libelleActe": {
                "nomCanonique": "Discussion en séance publique",
                "libelleCourt": "Discussion en séance publique"
              },
              "organeRef": "PO78718",
              "dateActe": null,
              "actesLegislatifs": {
                "acteLegislatif": [
                  {
                    "@xsi:type": "DiscussionSeancePublique_Type",
                    "uid": "L14-VD178147S33723",
                    "codeActe": "SN1-DEBATS-SEANCE",
                    "libelleActe": {
                      "nomCanonique": "Discussion en séance publique",
                      "libelleCourt": "Discussion en séance publique"
                    },
                    "organeRef": "PO78718",
                    "dateActe": "2016-06-08T00:00:00.000+02:00",
                    "actesLegislatifs": null,
                    "reunionRef": "RUSNR5L14S2016IDS20076",
                    "odjRef": "RUSNR5L14S2016IDS20076PT33723"
                  },
                  {
                    "@xsi:type": "Decision_Type",
                    "uid": "L14-VD178373DEC",
                    "codeActe": "SN1-DEBATS-DEC",
                    "libelleActe": {
                      "nomCanonique": "Décision",
                      "libelleCourt": "Décision"
                    },
                    "organeRef": "PO78718",
                    "dateActe": "2016-06-08T00:00:00.000+02:00",
                    "actesLegislatifs": null,
                    "reunionRef": "RUSNR5L14S2016IDS20076",
                    "statutConclusion": {
                      "fam_code": "TSORTF03",
                      "libelle": "adopté sans modification"
                    },
                    "voteRefs": null,
                    "textesAssocies": {
                      "texteAssocie": {
                        "typeTexte": "BTA",
                        "refTexteAssocie": "PRJLSNR5S259BTA0153"
                      }
                    }
                  }
                ]
              }
            }
          ]
        }
      },
      {
        "@xsi:type": "Etape_Type",
        "uid": "L14-PROM-34883",
        "codeActe": "PROM",
        "libelleActe": {
          "nomCanonique": "Promulgation de la loi",
          "libelleCourt": "Promulgation de la loi"
        },
        "organeRef": "PO696251",
        "dateActe": null,
        "actesLegislatifs": {
          "acteLegislatif": {
            "@xsi:type": "Promulgation_Type",
            "uid": "L14-VD180324PL",
            "codeActe": "PROM-PUB",
            "libelleActe": {
              "nomCanonique": "Promulgation d'une loi",
              "libelleCourt": "Promulgation d'une loi"
            },
            "organeRef": "PO696251",
            "dateActe": "2016-06-15T00:00:00.000+02:00",
            "actesLegislatifs": null,
            "texteLoiRef": "PRJLSNR5S259BTA0153",
            "infoJO": {
              "typeJO": "JO_LOI_DECRET",
              "dateJO": "2016-06-16+02:00",
              "pageJO": null,
              "numJO": "139"
            },
            "urlLegifrance": "http://www.legifrance.gouv.fr/WAspad/UnTexteDeJorf?numjo=MAEJ1608055L",
            "referenceNOR": "MAEJ1608055L",
            "codeLoi": "2016-786",
            "titreLoi": "autorisant la ratification de l'accord de Paris adopté le 12 décembre 2015"
          }
        }
      }
    ]
  },
  "fusionDossier": null
}