{
  "@xsi:type": "documentEtudeImpact_Type",
  "uid": "ETDIANR5L14B3814",
  "legislature": "14",
  "cycleDeVie": {
    "chrono": {
      "dateCreation": "2016-06-08T00:00:00.000+02:00",
      "dateDepot": "2016-06-08T00:00:00.000+02:00",
      "datePublication": "2016-10-06T00:00:00.000+02:00",
      "datePublicationWeb": "2016-06-10T11:30:00.000+02:00"
    }
  },
  "denominationStructurelle": "Projet de loi",
  "provenance": "Texte Déposé",
  "titres": {
    "titrePrincipal": "Etude d'impact sur le projet de loi ratifiant les ordonnances n° 2016-301 du 14 mars 2016 relative à la partie législative du code de la consommation et n° 2016-351 du 25 mars 2016 sur les contrats de crédit aux consommateurs relatifs aux biens immobiliers à usage d'habitation et simplifiant le dispositif de mise en œuvre des obligations en matière de conformité et de sécurité des produits et services",
    "titrePrincipalCourt": "ratification de deux ordonnances relatives à la consommation"
  },
  "divisions": null,
  "dossierRef": "DLR5L14N34966",
  "redacteur": null,
  "classification": {
    "famille": {
      "depot": {
        "code": "INITDEP",
        "libelle": "Initiative en 1er Dépôt"
      },
      "classe": {
        "code": "PRJLOI",
        "libelle": "Projet de loi"
      }
    },
    "type": {
      "code": "ETDI",
      "libelle": "Etude d'impact"
    },
    "sousType": null,
    "statutAdoption": null
  },
  "auteurs": {
    "auteur": {
      "acteur": {
        "acteurRef": "PA267622",
        "qualite": "auteur"
      }
    }
  },
  "correction": null,
  "notice": {
    "numNotice": "3814",
    "formule": "ratifiant les ordonnances n° 2016-301 du 14 mars 2016 relative à la partie législative du code de la consommation et n° 2016-351 du 25 mars 2016 sur les contrats de crédit aux consommateurs relatifs aux biens immobiliers à usage d'habitation et simplifiant le dispositif de mise en œuvre des obligations en matière de conformité et de sécurité des produits et services",
    "adoptionConforme": "false"
  },
  "indexation": null,
  "imprimerie": null
}