{
  "@xsi:type": "rapportParlementaire_Type",
  "uid": "RAPPANR5L14B0970",
  "legislature": "14",
  "cycleDeVie": {
    "chrono": {
      "dateCreation": "2013-04-17T00:00:00.000+02:00",
      "dateDepot": "2013-04-17T00:00:00.000+02:00",
      "datePublication": "2013-04-24T00:00:00.000+02:00",
      "datePublicationWeb": "2013-04-22T18:10:00.000+02:00"
    }
  },
  "denominationStructurelle": "Rapport",
  "provenance": "Commission",
  "titres": {
    "titrePrincipal": "rapport sur la proposition de loi de MM. Jean Leonetti et Christian Jacob et plusieurs de leurs collègues visant à renforcer les droits des patients en fin de vie (754)",
    "titrePrincipalCourt": "rapport sur la proposition de loi de MM. Jean Leonetti et Christian Jacob et plusieurs de leurs collègues visant à renforcer les droits des patients en fin de vie (754)"
  },
  "divisions": null,
  "dossierRef": "DLR5L14N29808",
  "redacteur": null,
  "classification": {
    "famille": {
      "depot": {
        "code": "RAPINIT",
        "libelle": "Rapport sur une initiative"
      },
      "classe": {
        "code": "RAPPORT",
        "libelle": "Rapport"
      }
    },
    "type": {
      "code": "RAPP",
      "libelle": "Rapport"
    },
    "sousType": null,
    "statutAdoption": null
  },
  "auteurs": {
    "auteur": [
      {
        "acteur": {
          "acteurRef": "PA1946",
          "qualite": "rapporteur"
        }
      },
      {
        "organe": {
          "organeRef": "PO420120"
        }
      }
    ]
  },
  "correction": null,
  "notice": {
    "numNotice": "970",
    "formule": "sur la proposition de loi de MM. Jean Leonetti et Christian Jacob et plusieurs de leurs collègues visant à renforcer les droits des patients en fin de vie (754)",
    "adoptionConforme": "false"
  },
  "indexation": {
    "themes": {
      "@niveau": "1",
      "theme": {
        "libelleTheme": "PRIX ET CONCURRENCE"
      }
    }
  },
  "imprimerie": {
    "prix": "3.0"
  }
}