{
  "@xsi:type": "rapportParlementaire_Type",
  "uid": "RAPPANR5L14B4245",
  "legislature": "14",
  "cycleDeVie": {
    "chrono": {
      "dateCreation": "2016-11-23T00:00:00.000+01:00",
      "dateDepot": "2016-11-23T00:00:00.000+01:00",
      "datePublication": "2016-11-30T00:00:00.000+01:00",
      "datePublicationWeb": "2016-11-28T16:05:00.000+01:00"
    }
  },
  "denominationStructurelle": "Rapport",
  "provenance": "Commission",
  "titres": {
    "titrePrincipal": "rapport sur la proposition de loi, après engagement de la procédure accélérée, de M. Bruno Le Roux, Mmes Catherine Coutelle, Catherine Lemorton, Maud Olivier et plusieurs de leurs collègues relative à l'extension du délit d'entrave à l'interruption volontaire de grossesse (4118).",
    "titrePrincipalCourt": "rapport sur la proposition de loi, après engagement de la procédure accélérée, de M. Bruno Le Roux, Mmes Catherine Coutelle, Catherine Lemorton, Maud Olivier et plusieurs de leurs collègues relative à l'extension du délit d'entrave à l'interruption volontaire de grossesse (4118)."
  },
  "divisions": {
    "division": {
      "@xsi:type": "rapportParlementaire_Type",
      "uid": "RAPPANR5L14B4245-a1",
      "legislature": "14",
      "cycleDeVie": {
        "chrono": {
          "dateCreation": "2016-11-23T00:00:00.000+01:00",
          "dateDepot": "2016-11-23T00:00:00.000+01:00",
          "datePublication": null,
          "datePublicationWeb": "2016-11-24T13:00:00.000+01:00"
        }
      },
      "denominationStructurelle": "Annexe 1",
      "titres": {
        "titrePrincipal": "Tableau comparatif",
        "titrePrincipalCourt": "Tableau comparatif"
      },
      "divisions": null,
      "dossierRef": "DLR5L14N35292",
      "redacteur": null,
      "classification": {
        "famille": null,
        "type": {
          "code": "RAPP",
          "libelle": "Rapport"
        },
        "sousType": null,
        "statutAdoption": "ADOPTCOM"
      },
      "auteurs": {
        "auteur": [
          {
            "acteur": {
              "acteurRef": "PA336421",
              "qualite": "rapporteur"
            }
          },
          {
            "organe": {
              "organeRef": "PO420120"
            }
          }
        ]
      },
      "correction": null,
      "notice": {
        "numNotice": "4245",
        "formule": "sur la proposition de loi, après engagement de la procédure accélérée, de M. Bruno Le Roux, Mmes Catherine Coutelle, Catherine Lemorton, Maud Olivier et plusieurs de leurs collègues relative à l'extension du délit d'entrave à l'interruption volontaire de grossesse (4118).",
        "adoptionConforme": "false"
      },
      "indexation": null,
      "imprimerie": null
    }
  },
  "dossierRef": "DLR5L14N35292",
  "redacteur": null,
  "classification": {
    "famille": {
      "depot": {
        "code": "RAPINIT",
        "libelle": "Rapport sur une initiative"
      },
      "classe": {
        "code": "RAPPORT",
        "libelle": "Rapport"
      }
    },
    "type": {
      "code": "RAPP",
      "libelle": "Rapport"
    },
    "sousType": null,
    "statutAdoption": "ADOPTCOM"
  },
  "auteurs": {
    "auteur": [
      {
        "acteur": {
          "acteurRef": "PA336421",
          "qualite": "rapporteur"
        }
      },
      {
        "organe": {
          "organeRef": "PO420120"
        }
      }
    ]
  },
  "correction": null,
  "notice": {
    "numNotice": "4245",
    "formule": "sur la proposition de loi, après engagement de la procédure accélérée, de M. Bruno Le Roux, Mmes Catherine Coutelle, Catherine Lemorton, Maud Olivier et plusieurs de leurs collègues relative à l'extension du délit d'entrave à l'interruption volontaire de grossesse (4118).",
    "adoptionConforme": "false"
  },
  "indexation": null,
  "imprimerie": {
    "prix": "0.75"
  }
}