{
  "@xsi:type": "texteLoi_Type",
  "uid": "PNREANR5L14BTC3951",
  "legislature": "14",
  "cycleDeVie": {
    "chrono": {
      "dateCreation": "2016-07-13T00:00:00.000+02:00",
      "dateDepot": "2016-07-13T00:00:00.000+02:00",
      "datePublication": "2016-07-20T00:00:00.000+02:00",
      "datePublicationWeb": "2016-07-15T10:00:00.000+02:00"
    }
  },
  "denominationStructurelle": "Proposition de résolution",
  "provenance": "Texte Déposé",
  "titres": {
    "titrePrincipal": "proposition de résolution européenne sur la proposition de résolution européenne de M. Gilles Savary, rapporteur de la commission des affaires européennes sur la proposition de directive du Parlement européen et du Conseil modifiant la directive 96/71/CE du Parlement européen et du Conseil du 16 décembre 1996 concernant le détachement de travailleurs (COM(2016) 128 final) (n°3885).",
    "titrePrincipalCourt": "sur la proposition de directive du Parlement européen et du Conseil modifiant la directive 96/71/CE du Parlement européen et du Conseil du 16 décembre 1996 concernant le détachement de travailleurs (COM(2016) 128 final)"
  },
  "divisions": null,
  "dossierRef": "DLR5L14N35032",
  "redacteur": null,
  "classification": {
    "famille": {
      "depot": {
        "code": "INITDEP",
        "libelle": "Initiative en 1er Dépôt"
      },
      "classe": {
        "code": "PIONRES",
        "libelle": "Proposition de résolution"
      },
      "espece": {
        "code": "TVXINSTITEUROP",
        "libelle": "sur les travaux conduits par les institutions européennes"
      }
    },
    "type": {
      "code": "PNRE",
      "libelle": "Proposition de résolution"
    },
    "sousType": {
      "code": "TVXINSTITEUROP",
      "libelle": "sur les travaux conduits par les institutions européennes"
    },
    "statutAdoption": "ADOPTCOM"
  },
  "auteurs": {
    "auteur": [
      {
        "acteur": {
          "acteurRef": "PA606495",
          "qualite": "rapporteur"
        }
      },
      {
        "organe": {
          "organeRef": "PO420120"
        }
      }
    ]
  },
  "correction": null,
  "notice": {
    "numNotice": "3951",
    "formule": "sur la proposition de résolution européenne de M. Gilles Savary, rapporteur de la commission des affaires européennes sur la proposition de directive du Parlement européen et du Conseil modifiant la directive 96/71/CE du Parlement européen et du Conseil du 16 décembre 1996 concernant le détachement de travailleurs (COM(2016) 128 final) (n°3885).",
    "adoptionConforme": "false"
  },
  "indexation": null,
  "imprimerie": {
    "prix": "1.5"
  },
  "coSignataires": null,
  "depotAmendements": null
}