{
  "@xsi:type": "documentEtudeImpact_Type",
  "uid": "ETDIANR5L14B4000",
  "legislature": "14",
  "cycleDeVie": {
    "chrono": {
      "dateCreation": "2016-08-03T00:00:00.000+02:00",
      "dateDepot": "2016-08-03T00:00:00.000+02:00",
      "datePublication": "2016-10-11T00:00:00.000+02:00",
      "datePublicationWeb": "2016-08-03T19:00:00.000+02:00"
    }
  },
  "denominationStructurelle": "Projet de loi",
  "provenance": "Texte Déposé",
  "titres": {
    "titrePrincipal": "Etude d'impact sur le projet de loi de programmation relatif à l'égalité réelle outre-mer et portant autres dispositions en matière sociale et économique",
    "titrePrincipalCourt": "Egalité réelle outre-mer"
  },
  "divisions": null,
  "dossierRef": "DLR5L14N35137",
  "redacteur": null,
  "classification": {
    "famille": {
      "depot": {
        "code": "INITDEP",
        "libelle": "Initiative en 1er Dépôt"
      },
      "classe": {
        "code": "PRJLOI",
        "libelle": "Projet de loi"
      }
    },
    "type": {
      "code": "ETDI",
      "libelle": "Etude d'impact"
    },
    "sousType": null,
    "statutAdoption": null
  },
  "auteurs": {
    "auteur": {
      "acteur": {
        "acteurRef": "PA267622",
        "qualite": "auteur"
      }
    }
  },
  "correction": null,
  "notice": {
    "numNotice": "4000",
    "formule": "de programmation relatif à l'égalité réelle outre-mer et portant autres dispositions en matière sociale et économique",
    "adoptionConforme": "false"
  },
  "indexation": null,
  "imprimerie": null
}