{
  "@xsi:type": "texteLoi_Type",
  "uid": "PIONANR5L14B0514",
  "legislature": "14",
  "cycleDeVie": {
    "chrono": {
      "dateCreation": "2012-12-03T00:00:00.000+01:00",
      "dateDepot": "2012-12-12T00:00:00.000+01:00",
      "datePublication": null,
      "datePublicationWeb": "2012-12-13T15:00:00.000+01:00"
    }
  },
  "denominationStructurelle": "Proposition de loi",
  "provenance": "Texte Déposé",
  "titres": {
    "titrePrincipal": "proposition de loi tendant à renforcer le respect par les parents séparés de leurs obligations en matière d'autorité parentale",
    "titrePrincipalCourt": "Renforcement des obligations des parents séparés"
  },
  "divisions": null,
  "dossierRef": "DLR5L14N29400",
  "redacteur": null,
  "classification": {
    "famille": {
      "depot": {
        "code": "INITDEP",
        "libelle": "Initiative en 1er Dépôt"
      },
      "classe": {
        "code": "PIONLOI",
        "libelle": "Proposition de loi"
      }
    },
    "type": {
      "code": "PION",
      "libelle": "Proposition de loi"
    },
    "sousType": null,
    "statutAdoption": null
  },
  "auteurs": {
    "auteur": {
      "acteur": {
        "acteurRef": "PA330684",
        "qualite": "auteur"
      }
    }
  },
  "correction": null,
  "notice": {
    "numNotice": "514",
    "formule": "tendant à renforcer le respect par les parents séparés de leurs obligations en matière d'autorité parentale",
    "adoptionConforme": "false"
  },
  "indexation": {
    "themes": {
      "@niveau": "1",
      "theme": {
        "libelleTheme": "DOM-TOM"
      }
    }
  },
  "imprimerie": null,
  "coSignataires": {
    "coSignataire": [
      {
        "acteur": {
          "acteurRef": "PA309643"
        },
        "dateCosignature": "2012-12-12+01:00",
        "dateRetraitCosignature": null,
        "edite": "false"
      },
      {
        "acteur": {
          "acteurRef": "PA998"
        },
        "dateCosignature": "2012-12-12+01:00",
        "dateRetraitCosignature": null,
        "edite": "false"
      },
      {
        "acteur": {
          "acteurRef": "PA267762"
        },
        "dateCosignature": "2012-12-12+01:00",
        "dateRetraitCosignature": null,
        "edite": "false"
      },
      {
        "acteur": {
          "acteurRef": "PA267813"
        },
        "dateCosignature": "2012-12-12+01:00",
        "dateRetraitCosignature": null,
        "edite": "false"
      },
      {
        "acteur": {
          "acteurRef": "PA266797"
        },
        "dateCosignature": "2012-12-12+01:00",
        "dateRetraitCosignature": null,
        "edite": "false"
      },
      {
        "acteur": {
          "acteurRef": "PA609245"
        },
        "dateCosignature": "2012-12-12+01:00",
        "dateRetraitCosignature": null,
        "edite": "false"
      },
      {
        "acteur": {
          "acteurRef": "PA609740"
        },
        "dateCosignature": "2012-12-12+01:00",
        "dateRetraitCosignature": null,
        "edite": "false"
      },
      {
        "acteur": {
          "acteurRef": "PA608016"
        },
        "dateCosignature": "2012-12-12+01:00",
        "dateRetraitCosignature": null,
        "edite": "false"
      },
      {
        "acteur": {
          "acteurRef": "PA606098"
        },
        "dateCosignature": "2012-12-12+01:00",
        "dateRetraitCosignature": null,
        "edite": "false"
      },
      {
        "acteur": {
          "acteurRef": "PA2124"
        },
        "dateCosignature": "2012-12-12+01:00",
        "dateRetraitCosignature": null,
        "edite": "false"
      },
      {
        "acteur": {
          "acteurRef": "PA606299"
        },
        "dateCosignature": "2012-12-12+01:00",
        "dateRetraitCosignature": null,
        "edite": "false"
      },
      {
        "acteur": {
          "acteurRef": "PA2250"
        },
        "dateCosignature": "2012-12-12+01:00",
        "dateRetraitCosignature": null,
        "edite": "false"
      },
      {
        "acteur": {
          "acteurRef": "PA2664"
        },
        "dateCosignature": "2012-12-12+01:00",
        "dateRetraitCosignature": null,
        "edite": "false"
      },
      {
        "acteur": {
          "acteurRef": "PA344492"
        },
        "dateCosignature": "2012-12-12+01:00",
        "dateRetraitCosignature": null,
        "edite": "false"
      },
      {
        "acteur": {
          "acteurRef": "PA2796"
        },
        "dateCosignature": "2012-12-12+01:00",
        "dateRetraitCosignature": null,
        "edite": "false"
      },
      {
        "acteur": {
          "acteurRef": "PA2815"
        },
        "dateCosignature": "2012-12-12+01:00",
        "dateRetraitCosignature": null,
        "edite": "false"
      },
      {
        "acteur": {
          "acteurRef": "PA2936"
        },
        "dateCosignature": "2012-12-12+01:00",
        "dateRetraitCosignature": null,
        "edite": "false"
      }
    ]
  },
  "depotAmendements": {
    "amendementsSeance": {
      "amendable": "false",
      "dateLimiteDepot": null
    },
    "amendementsCommission": {
      "commission": {
        "organeRef": "PO59051",
        "amendable": "true",
        "dateLimiteDepot": null
      }
    }
  }
}