{
  "@xsi:type": "texteLoi_Type",
  "uid": "PIONANR5L14B0621",
  "legislature": "14",
  "cycleDeVie": {
    "chrono": {
      "dateCreation": "2013-01-09T00:00:00.000+01:00",
      "dateDepot": "2013-01-16T00:00:00.000+01:00",
      "datePublication": null,
      "datePublicationWeb": "2013-01-17T16:15:00.000+01:00"
    }
  },
  "denominationStructurelle": "Proposition de loi",
  "provenance": "Texte Déposé",
  "titres": {
    "titrePrincipal": "proposition de loi relative aux campagnes référendaires",
    "titrePrincipalCourt": "campagnes référendaires"
  },
  "divisions": null,
  "dossierRef": "DLR5L14N29561",
  "redacteur": null,
  "classification": {
    "famille": {
      "depot": {
        "code": "INITDEP",
        "libelle": "Initiative en 1er Dépôt"
      },
      "classe": {
        "code": "PIONLOI",
        "libelle": "Proposition de loi"
      }
    },
    "type": {
      "code": "PION",
      "libelle": "Proposition de loi"
    },
    "sousType": null,
    "statutAdoption": null
  },
  "auteurs": {
    "auteur": {
      "acteur": {
        "acteurRef": "PA268019",
        "qualite": "auteur"
      }
    }
  },
  "correction": null,
  "notice": {
    "numNotice": "621",
    "formule": "relative aux campagnes référendaires",
    "adoptionConforme": "false"
  },
  "indexation": {
    "themes": {
      "@niveau": "1",
      "theme": {
        "libelleTheme": "LOIS DE FINANCES"
      }
    }
  },
  "imprimerie": null,
  "coSignataires": null,
  "depotAmendements": {
    "amendementsSeance": {
      "amendable": "false",
      "dateLimiteDepot": null
    },
    "amendementsCommission": {
      "commission": {
        "organeRef": "PO59051",
        "amendable": "true",
        "dateLimiteDepot": null
      }
    }
  }
}