{
  "@xsi:type": "texteLoi_Type",
  "uid": "PRJLSNR5S239B0124",
  "legislature": null,
  "cycleDeVie": {
    "chrono": {
      "dateCreation": "2014-11-26T00:00:00.000+01:00",
      "dateDepot": "2014-11-26T00:00:00.000+01:00",
      "datePublication": "2014-11-27T00:00:00.000+01:00",
      "datePublicationWeb": null
    }
  },
  "denominationStructurelle": "Projet de loi",
  "provenance": "Texte Déposé",
  "titres": {
    "titrePrincipal": "projet de loi de financement de la sécurité sociale pour 2015",
    "titrePrincipalCourt": "PLFSS pour 2015"
  },
  "divisions": null,
  "dossierRef": "DLR5L14N33456",
  "redacteur": null,
  "classification": {
    "famille": {
      "depot": {
        "code": "INITNAV",
        "libelle": "Initiative en Navette"
      },
      "classe": {
        "code": "PRJLOI",
        "libelle": "Projet de loi"
      },
      "espece": {
        "code": "FINSSOC",
        "libelle": "de financement de la sécurité sociale"
      }
    },
    "type": {
      "code": "PRJL",
      "libelle": "Projet de loi"
    },
    "sousType": {
      "code": "FINSSOC",
      "libelle": "de financement de la sécurité sociale",
      "libelleEdition": "de financement de la sécurité sociale"
    },
    "statutAdoption": null
  },
  "auteurs": {
    "auteur": {
      "organe": {
        "organeRef": "PO78718"
      }
    }
  },
  "correction": null,
  "notice": {
    "numNotice": "124",
    "formule": ", adopté, par l'Assemblée nationale, en nouvelle lecture, pour 2015",
    "adoptionConforme": "false"
  },
  "indexation": null,
  "imprimerie": null,
  "coSignataires": null,
  "depotAmendements": {
    "amendementsSeance": {
      "amendable": "false",
      "dateLimiteDepot": null
    }
  }
}