{
  "@xsi:type": "DossierLegislatif_Type",
  "uid": "DLR5L14N28865",
  "legislature": "14",
  "titreDossier": {
    "titre": "Budget : règlement des comptes 2011",
    "titreChemin": "reglement_comptes_2011",
    "senatChemin": "http://www.senat.fr/dossier-legislatif/pjl11-655.html"
  },
  "procedureParlementaire": {
    "code": "2",
    "libelle": "Proposition de loi ordinaire"
  },
  "initiateur": {
    "acteurs": {
      "acteur": [
        {
          "acteurRef": "PA328",
          "mandatRef": "PM653228"
        },
        {
          "acteurRef": "PA2240",
          "mandatRef": "PM653295"
        }
      ]
    }
  },
  "actesLegislatifs": {
    "acteLegislatif": [
      {
        "@xsi:type": "Etape_Type",
        "uid": "L14-AN1-28865",
        "codeActe": "AN1",
        "libelleActe": {
          "nomCanonique": "1ère lecture (1ère assemblée saisie)",
          "libelleCourt": "1ère lecture"
        },
        "organeRef": "PO644420",
        "dateActe": null,
        "actesLegislatifs": {
          "acteLegislatif": [
            {
              "@xsi:type": "DepotInitiative_Type",
              "uid": "L14-VD158453DI",
              "codeActe": "AN1-DEPOT",
              "libelleActe": {
                "nomCanonique": "1er dépôt d'une initiative.",
                "libelleCourt": "1er dépôt d'une initiative."
              },
              "organeRef": "PO644420",
              "dateActe": "2012-06-27T00:00:00.000+02:00",
              "actesLegislatifs": null,
              "texteAssocie": "PRJLANR5L14B0003"
            },
            {
              "@xsi:type": "ProcedureAccelere_Type",
              "uid": "L14-VD158455",
              "codeActe": "AN1-PROCACC",
              "libelleActe": {
                "nomCanonique": "Le gouvernement déclare l'urgence / engage la procédure accélérée",
                "libelleCourt": "Le gouvernement déclare l'urgence / engage la procédure accélérée"
              },
              "organeRef": "PO653199",
              "dateActe": "2012-06-27T00:00:00.000+02:00",
              "actesLegislatifs": null
            },
            {
              "@xsi:type": "Etape_Type",
              "uid": "L14-AN1-COM-28865",
              "codeActe": "AN1-COM",
              "libelleActe": {
                "nomCanonique": "Travaux des commissions",
                "libelleCourt": "Travaux des commissions"
              },
              "organeRef": "PO644420",
              "dateActe": null,
              "actesLegislatifs": {
                "acteLegislatif": {
                  "@xsi:type": "Etape_Type",
                  "uid": "L14-VD158454CF",
                  "codeActe": "AN1-COM-FOND",
                  "libelleActe": {
                    "nomCanonique": "Travaux de la commission saisie au fond",
                    "libelleCourt": "Travaux de la commission saisie au fond"
                  },
                  "organeRef": "PO59048",
                  "dateActe": null,
                  "actesLegislatifs": {
                    "acteLegislatif": [
                      {
                        "@xsi:type": "SaisieComFond_Type",
                        "uid": "L14-VD158454CFS",
                        "codeActe": "AN1-COM-FOND-SAISIE",
                        "libelleActe": {
                          "nomCanonique": "Renvoi en commission au fond",
                          "libelleCourt": "Renvoi en commission au fond"
                        },
                        "organeRef": "PO59048",
                        "dateActe": "2012-06-27T00:00:00.000+02:00",
                        "actesLegislatifs": null
                      },
                      {
                        "@xsi:type": "NominRapporteurs_Type",
                        "uid": "L14-VD158618",
                        "codeActe": "AN1-COM-FOND-NOMIN",
                        "libelleActe": {
                          "nomCanonique": "Nomination de rapporteur",
                          "libelleCourt": "Nomination de rapporteur"
                        },
                        "organeRef": "PO59048",
                        "dateActe": "2012-06-28T00:00:00.000+02:00",
                        "actesLegislatifs": null,
                        "rapporteurs": {
                          "rapporteur": {
                            "acteurRef": "PA1243",
                            "typeRapporteur": "rapporteur général"
                          }
                        },
                        "reunion": null
                      },
                      {
                        "@xsi:type": "DiscussionCommission_Type",
                        "uid": "L14-VD158475R16144",
                        "codeActe": "AN1-COM-FOND-REUNION",
                        "libelleActe": {
                          "nomCanonique": "Réunion de commission",
                          "libelleCourt": "Réunion de commission"
                        },
                        "organeRef": "PO59048",
                        "dateActe": "2012-07-05T09:30:00.000+02:00",
                        "actesLegislatifs": null,
                        "reunionRef": "RUANR5L14S2012IDC414944",
                        "odjRef": "RUANR5L14S2012IDC414944PT16144"
                      },
                      {
                        "@xsi:type": "DepotRapport_Type",
                        "uid": "L14-VD158629",
                        "codeActe": "AN1-COM-FOND-RAPPORT",
                        "libelleActe": {
                          "nomCanonique": "Dépôt de rapport",
                          "libelleCourt": "Dépôt de rapport"
                        },
                        "organeRef": "PO59048",
                        "dateActe": "2012-07-05T00:00:00.000+02:00",
                        "actesLegislatifs": null,
                        "texteAssocie": "RAPPANR5L14B0075",
                        "texteAdopte": null
                      }
                    ]
                  }
                }
              }
            },
            {
              "@xsi:type": "Etape_Type",
              "uid": "L14-AN1-DEBATS-28865",
              "codeActe": "AN1-DEBATS",
              "libelleActe": {
                "nomCanonique": "Discussion en séance publique",
                "libelleCourt": "Discussion en séance publique"
              },
              "organeRef": "PO644420",
              "dateActe": null,
              "actesLegislatifs": {
                "acteLegislatif": [
                  {
                    "@xsi:type": "DiscussionSeancePublique_Type",
                    "uid": "L14-VD158464S26314",
                    "codeActe": "AN1-DEBATS-SEANCE",
                    "libelleActe": {
                      "nomCanonique": "Discussion en séance publique",
                      "libelleCourt": "Discussion en séance publique"
                    },
                    "organeRef": "PO644420",
                    "dateActe": "2012-07-10T00:00:00.000+02:00",
                    "actesLegislatifs": null,
                    "reunionRef": "RUANR5L14S2012IDS16435",
                    "odjRef": "RUANR5L14S2012IDS16435PT26314"
                  },
                  {
                    "@xsi:type": "Decision_Type",
                    "uid": "L14-VD158679DEC",
                    "codeActe": "AN1-DEBATS-DEC",
                    "libelleActe": {
                      "nomCanonique": "Décision",
                      "libelleCourt": "Décision"
                    },
                    "organeRef": "PO644420",
                    "dateActe": "2012-07-10T00:00:00.000+02:00",
                    "actesLegislatifs": null,
                    "reunionRef": "RUANR5L14S2012IDS16435",
                    "statutConclusion": {
                      "fam_code": "TSORTF01",
                      "libelle": "adopté"
                    },
                    "voteRefs": null,
                    "textesAssocies": {
                      "texteAssocie": {
                        "typeTexte": "BTA",
                        "refTexteAssocie": "PRJLANR5L14BTA0001"
                      }
                    }
                  }
                ]
              }
            }
          ]
        }
      },
      {
        "@xsi:type": "Etape_Type",
        "uid": "L14-SN1-28865",
        "codeActe": "SN1",
        "libelleActe": {
          "nomCanonique": "1ère lecture (2ème assemblée saisie)",
          "libelleCourt": "1ère lecture"
        },
        "organeRef": "PO78718",
        "dateActe": null,
        "actesLegislatifs": {
          "acteLegislatif": [
            {
              "@xsi:type": "DepotInitiativeNavette_Type",
              "uid": "L14-VD158690DIN",
              "codeActe": "SN1-DEPOT",
              "libelleActe": {
                "nomCanonique": "Dépôt d'une initiative en navette",
                "libelleCourt": "Dépôt d'une initiative en navette"
              },
              "organeRef": "PO78718",
              "dateActe": "2012-07-10T00:00:00.000+02:00",
              "actesLegislatifs": null,
              "texteAssocie": "PRJLSNR5S198B0655",
              "provenance": "PO644420"
            },
            {
              "@xsi:type": "Etape_Type",
              "uid": "L14-SN1-COM-28865",
              "codeActe": "SN1-COM",
              "libelleActe": {
                "nomCanonique": "Travaux des commissions",
                "libelleCourt": "Travaux des commissions"
              },
              "organeRef": "PO78718",
              "dateActe": null,
              "actesLegislatifs": {
                "acteLegislatif": {
                  "@xsi:type": "Etape_Type",
                  "uid": "L14-VD158691CF",
                  "codeActe": "SN1-COM-FOND",
                  "libelleActe": {
                    "nomCanonique": "Travaux de la commission saisie au fond",
                    "libelleCourt": "Travaux de la commission saisie au fond"
                  },
                  "organeRef": "PO211494",
                  "dateActe": null,
                  "actesLegislatifs": {
                    "acteLegislatif": [
                      {
                        "@xsi:type": "SaisieComFond_Type",
                        "uid": "L14-VD158691CFS",
                        "codeActe": "SN1-COM-FOND-SAISIE",
                        "libelleActe": {
                          "nomCanonique": "Renvoi en commission au fond",
                          "libelleCourt": "Renvoi en commission au fond"
                        },
                        "organeRef": "PO211494",
                        "dateActe": "2012-07-10T00:00:00.000+02:00",
                        "actesLegislatifs": null
                      },
                      {
                        "@xsi:type": "NominRapporteurs_Type",
                        "uid": "L14-VD158711",
                        "codeActe": "SN1-COM-FOND-NOMIN",
                        "libelleActe": {
                          "nomCanonique": "Nomination de rapporteur",
                          "libelleCourt": "Nomination de rapporteur"
                        },
                        "organeRef": "PO211494",
                        "dateActe": "2012-06-20T00:00:00.000+02:00",
                        "actesLegislatifs": null,
                        "rapporteurs": {
                          "rapporteur": {
                            "acteurRef": "PA2056",
                            "typeRapporteur": "rapporteur"
                          }
                        },
                        "reunion": null
                      },
                      {
                        "@xsi:type": "DepotRapport_Type",
                        "uid": "L14-VD158712",
                        "codeActe": "SN1-COM-FOND-RAPPORT",
                        "libelleActe": {
                          "nomCanonique": "Dépôt de rapport",
                          "libelleCourt": "Dépôt de rapport"
                        },
                        "organeRef": "PO211494",
                        "dateActe": "2012-07-11T00:00:00.000+02:00",
                        "actesLegislatifs": null,
                        "texteAssocie": "RAPPSNR5S198B0658",
                        "texteAdopte": null
                      }
                    ]
                  }
                }
              }
            },
            {
              "@xsi:type": "Etape_Type",
              "uid": "L14-SN1-DEBATS-28865",
              "codeActe": "SN1-DEBATS",
              "libelleActe": {
                "nomCanonique": "Discussion en séance publique",
                "libelleCourt": "Discussion en séance publique"
              },
              "organeRef": "PO78718",
              "dateActe": null,
              "actesLegislatifs": {
                "acteLegislatif": [
                  {
                    "@xsi:type": "DiscussionSeancePublique_Type",
                    "uid": "L14-VD158762S26382",
                    "codeActe": "SN1-DEBATS-SEANCE",
                    "libelleActe": {
                      "nomCanonique": "Discussion en séance publique",
                      "libelleCourt": "Discussion en séance publique"
                    },
                    "organeRef": "PO78718",
                    "dateActe": "2012-07-17T00:00:00.000+02:00",
                    "actesLegislatifs": null,
                    "reunionRef": "RUSNR5L14S2012IDS16455",
                    "odjRef": "RUSNR5L14S2012IDS16455PT26382"
                  },
                  {
                    "@xsi:type": "Decision_Type",
                    "uid": "L14-VD158763DEC",
                    "codeActe": "SN1-DEBATS-DEC",
                    "libelleActe": {
                      "nomCanonique": "Décision",
                      "libelleCourt": "Décision"
                    },
                    "organeRef": "PO78718",
                    "dateActe": "2012-07-17T00:00:00.000+02:00",
                    "actesLegislatifs": null,
                    "reunionRef": "RUSNR5L14S2012IDS16455",
                    "statutConclusion": {
                      "fam_code": "TSORTF03",
                      "libelle": "adopté sans modification"
                    },
                    "voteRefs": null,
                    "textesAssocies": {
                      "texteAssocie": {
                        "typeTexte": "BTA",
                        "refTexteAssocie": "PRJLSNR5S198BTA0124"
                      }
                    }
                  }
                ]
              }
            }
          ]
        }
      },
      {
        "@xsi:type": "Etape_Type",
        "uid": "L14-PROM-28865",
        "codeActe": "PROM",
        "libelleActe": {
          "nomCanonique": "Promulgation de la loi",
          "libelleCourt": "Promulgation de la loi"
        },
        "organeRef": "PO696251",
        "dateActe": null,
        "actesLegislatifs": {
          "acteLegislatif": {
            "@xsi:type": "Promulgation_Type",
            "uid": "L14-VD159047PL",
            "codeActe": "PROM-PUB",
            "libelleActe": {
              "nomCanonique": "Promulgation d'une loi",
              "libelleCourt": "Promulgation d'une loi"
            },
            "organeRef": "PO696251",
            "dateActe": "2012-07-31T00:00:00.000+02:00",
            "actesLegislatifs": null,
            "texteLoiRef": "PRJLSNR5S198BTA0124",
            "infoJO": {
              "typeJO": "JO_LOI_DECRET",
              "dateJO": "2012-08-01+02:00",
              "pageJO": null,
              "numJO": "177"
            },
            "urlLegifrance": "http://www.legifrance.gouv.fr/WAspad/UnTexteDeJorf?numjo=EFIX1225601L",
            "referenceNOR": "EFIX1225601L",
            "codeLoi": "2012-926",
            "titreLoi": "de règlement des comptes et rapport de gestion pour l'année 2011"
          }
        }
      }
    ]
  },
  "fusionDossier": null,
  "indexation": {
    "themes": {
      "@niveau": "1",
      "theme": {
        "libelleTheme": "SOCIETES"
      }
    }
  }
}