{
  "@xsi:type": "DossierMissionControle_Type",
  "uid": "DLR5L14N34087",
  "legislature": "14",
  "titreDossier": {
    "titre": "Evaluation de la politique d'accueil touristique",
    "titreChemin": "evaluation_politique_accueil_touristique",
    "senatChemin": null
  },
  "procedureParlementaire": {
    "code": "19",
    "libelle": "Rapport d'information sans mission"
  },
  "initiateur": null,
  "actesLegislatifs": {
    "acteLegislatif": {
      "@xsi:type": "Etape_Type",
      "uid": "L14-AN20-34087",
      "codeActe": "AN20",
      "libelleActe": {
        "nomCanonique": "Travaux"
      },
      "organeRef": "PO644420",
      "dateActe": null,
      "actesLegislatifs": {
        "acteLegislatif": {
          "@xsi:type": "DepotRapport_Type",
          "uid": "L14-VD174364",
          "codeActe": "AN20-RAPPORT",
          "libelleActe": {
            "nomCanonique": "Dépôt de rapport",
            "libelleCourt": "Dépôt de rapport"
          },
          "organeRef": "PO420375",
          "dateActe": "2015-07-02T00:00:00.000+02:00",
          "actesLegislatifs": null,
          "texteAssocie": "RINFANR5L14B2936",
          "texteAdopte": null
        }
      }
    }
  },
  "fusionDossier": null
}