{
  "@xsi:type": "texteLoi_Type",
  "uid": "PIONANR5L14B0310",
  "legislature": "14",
  "cycleDeVie": {
    "chrono": {
      "dateCreation": "2012-09-20T00:00:00.000+02:00",
      "dateDepot": "2012-10-24T00:00:00.000+02:00",
      "datePublication": null,
      "datePublicationWeb": "2012-10-25T12:00:00.000+02:00"
    }
  },
  "denominationStructurelle": "Proposition de loi",
  "provenance": "Texte Déposé",
  "titres": {
    "titrePrincipal": "proposition de loi visant à élargir les conditions d'attribution de la carte du combattant",
    "titrePrincipalCourt": "Elargir les conditions d'attribution de la carte du combattant"
  },
  "divisions": null,
  "dossierRef": "DLR5L14N29100",
  "redacteur": null,
  "classification": {
    "famille": {
      "depot": {
        "code": "INITDEP",
        "libelle": "Initiative en 1er Dépôt"
      },
      "classe": {
        "code": "PIONLOI",
        "libelle": "Proposition de loi"
      }
    },
    "type": {
      "code": "PION",
      "libelle": "Proposition de loi"
    },
    "sousType": null,
    "statutAdoption": null
  },
  "auteurs": {
    "auteur": {
      "acteur": {
        "acteurRef": "PA267327",
        "qualite": "auteur"
      }
    }
  },
  "correction": null,
  "notice": {
    "numNotice": "310",
    "formule": "visant à élargir les conditions d'attribution de la carte du combattant",
    "adoptionConforme": "false"
  },
  "indexation": null,
  "imprimerie": null,
  "coSignataires": null,
  "depotAmendements": {
    "amendementsSeance": {
      "amendable": "false",
      "dateLimiteDepot": null
    },
    "amendementsCommission": {
      "commission": {
        "organeRef": "PO59046",
        "amendable": "true",
        "dateLimiteDepot": null
      }
    }
  }
}