{
  "@xsi:type": "texteLoi_Type",
  "uid": "PIONANR5L14B4627",
  "legislature": "14",
  "cycleDeVie": {
    "chrono": {
      "dateCreation": "2017-04-13T00:00:00.000+02:00",
      "dateDepot": "2017-05-10T00:00:00.000+02:00",
      "datePublication": "2017-05-17T00:00:00.000+02:00",
      "datePublicationWeb": "2017-05-11T11:25:00.000+02:00"
    }
  },
  "denominationStructurelle": "Proposition de loi",
  "provenance": "Texte Déposé",
  "titres": {
    "titrePrincipal": "proposition de loi visant à supprimer l'exigence du caractère consécutif de l'occupation pour l'application de la taxe sur les logements vacants",
    "titrePrincipalCourt": "caractère consécutif taxe logements vacants"
  },
  "divisions": null,
  "dossierRef": "DLR5L14N35737",
  "redacteur": null,
  "classification": {
    "famille": {
      "depot": {
        "code": "INITDEP",
        "libelle": "Initiative en 1er Dépôt"
      },
      "classe": {
        "code": "PIONLOI",
        "libelle": "Proposition de loi"
      }
    },
    "type": {
      "code": "PION",
      "libelle": "Proposition de loi"
    },
    "sousType": null,
    "statutAdoption": null
  },
  "auteurs": {
    "auteur": {
      "acteur": {
        "acteurRef": "PA346886",
        "qualite": "auteur"
      }
    }
  },
  "correction": null,
  "notice": {
    "numNotice": "4627",
    "formule": "visant à supprimer l'exigence du caractère consécutif de l'occupation pour l'application de la taxe sur les logements vacants",
    "adoptionConforme": "false"
  },
  "indexation": null,
  "imprimerie": null,
  "coSignataires": null,
  "depotAmendements": {
    "amendementsSeance": {
      "amendable": "false",
      "dateLimiteDepot": null
    },
    "amendementsCommission": {
      "commission": {
        "organeRef": "PO419610",
        "amendable": "true",
        "dateLimiteDepot": null
      }
    }
  }
}