{
  "@xsi:type": "texteLoi_Type",
  "uid": "AVISSNR5S239B0394",
  "legislature": null,
  "cycleDeVie": {
    "chrono": {
      "dateCreation": "2015-04-13T00:00:00.000+02:00",
      "dateDepot": "2015-04-08T00:00:00.000+02:00",
      "datePublication": null,
      "datePublicationWeb": null
    }
  },
  "denominationStructurelle": "Avis",
  "provenance": "Commission",
  "titres": {
    "titrePrincipal": "avis sur   le projet de loi , adopté, par l'Assemblée nationale après engagement de la procédure accélérée, relatif à la réforme de l'asile (n°193)",
    "titrePrincipalCourt": "avis sur   le projet de loi , adopté, par l'Assemblée nationale après engagement de la procédure accélérée, relatif à la réforme de l'asile (n°193)"
  },
  "divisions": null,
  "dossierRef": "DLR5L14N33347",
  "redacteur": null,
  "classification": {
    "famille": {
      "depot": {
        "code": "RAPINIT",
        "libelle": "Rapport sur une initiative"
      },
      "classe": {
        "code": "AVIS",
        "libelle": "Avis"
      }
    },
    "type": {
      "code": "AVIS",
      "libelle": "Avis"
    },
    "sousType": null,
    "statutAdoption": null
  },
  "auteurs": {
    "auteur": [
      {
        "acteur": {
          "acteurRef": "PA205280",
          "qualite": "rapporteur pour avis"
        }
      },
      {
        "organe": {
          "organeRef": "PO211494"
        }
      }
    ]
  },
  "correction": null,
  "notice": {
    "numNotice": "394",
    "formule": "sur   le projet de loi , adopté, par l'Assemblée nationale après engagement de la procédure accélérée, relatif à la réforme de l'asile (n°193)",
    "adoptionConforme": "false"
  },
  "indexation": null,
  "imprimerie": null,
  "coSignataires": null,
  "depotAmendements": null
}