{
  "@xsi:type": "DossierLegislatif_Type",
  "uid": "DLR5L14N32917",
  "legislature": "14",
  "titreDossier": {
    "titre": "Draperie tricolore sur le cercueil de tout médaillé militaire",
    "titreChemin": "draperie_tricolore_cercueil_medaille_militaire",
    "senatChemin": null
  },
  "procedureParlementaire": {
    "code": "2",
    "libelle": "Proposition de loi ordinaire"
  },
  "initiateur": {
    "acteurs": {
      "acteur": {
        "acteurRef": "PA267762",
        "mandatRef": "PM645455"
      }
    }
  },
  "actesLegislatifs": {
    "acteLegislatif": {
      "@xsi:type": "Etape_Type",
      "uid": "L14-AN1-32917",
      "codeActe": "AN1",
      "libelleActe": {
        "nomCanonique": "1ère lecture (1ère assemblée saisie)",
        "libelleCourt": "1ère lecture"
      },
      "organeRef": "PO644420",
      "dateActe": null,
      "actesLegislatifs": {
        "acteLegislatif": [
          {
            "@xsi:type": "DepotInitiative_Type",
            "uid": "L14-VD170062DI",
            "codeActe": "AN1-DEPOT",
            "libelleActe": {
              "nomCanonique": "1er dépôt d'une initiative.",
              "libelleCourt": "1er dépôt d'une initiative."
            },
            "organeRef": "PO644420",
            "dateActe": "2014-05-28T00:00:00.000+02:00",
            "actesLegislatifs": null,
            "texteAssocie": "PIONANR5L14B1976"
          },
          {
            "@xsi:type": "Etape_Type",
            "uid": "L14-AN1-COM-32917",
            "codeActe": "AN1-COM",
            "libelleActe": {
              "nomCanonique": "Travaux des commissions",
              "libelleCourt": "Travaux des commissions"
            },
            "organeRef": "PO644420",
            "dateActe": null,
            "actesLegislatifs": {
              "acteLegislatif": {
                "@xsi:type": "Etape_Type",
                "uid": "L14-VD170063CF",
                "codeActe": "AN1-COM-FOND",
                "libelleActe": {
                  "nomCanonique": "Travaux de la commission saisie au fond",
                  "libelleCourt": "Travaux de la commission saisie au fond"
                },
                "organeRef": "PO59046",
                "dateActe": null,
                "actesLegislatifs": {
                  "acteLegislatif": {
                    "@xsi:type": "SaisieComFond_Type",
                    "uid": "L14-VD170063CFS",
                    "codeActe": "AN1-COM-FOND-SAISIE",
                    "libelleActe": {
                      "nomCanonique": "Renvoi en commission au fond",
                      "libelleCourt": "Renvoi en commission au fond"
                    },
                    "organeRef": "PO59046",
                    "dateActe": "2014-05-28T00:00:00.000+02:00",
                    "actesLegislatifs": null
                  }
                }
              }
            }
          }
        ]
      }
    }
  },
  "fusionDossier": null
}