{
  "@xsi:type": "avisConseilEtat_Type",
  "uid": "AVCESNR5S279B0263",
  "legislature": null,
  "cycleDeVie": {
    "chrono": {
      "dateCreation": "2016-12-21T00:00:00.000+01:00",
      "dateDepot": "2016-12-21T00:00:00.000+01:00",
      "datePublication": "2017-01-24T00:00:00.000+01:00",
      "datePublicationWeb": null
    }
  },
  "denominationStructurelle": "Projet de loi",
  "provenance": "Texte Déposé",
  "titres": {
    "titrePrincipal": "Avis du Conseil d'Etat sur le projet de loi relatif à la sécurité publique",
    "titrePrincipalCourt": "Sécurité publique"
  },
  "divisions": null,
  "dossierRef": "DLR5L14N35469",
  "redacteur": null,
  "classification": {
    "famille": {
      "depot": {
        "code": "INITDEP",
        "libelle": "Initiative en 1er Dépôt"
      },
      "classe": {
        "code": "PRJLOI",
        "libelle": "Projet de loi"
      }
    },
    "type": {
      "code": "AVCE",
      "libelle": "Avis du Conseil d'Etat"
    },
    "sousType": null,
    "statutAdoption": null
  },
  "auteurs": {
    "auteur": {
      "acteur": {
        "acteurRef": "PA785",
        "qualite": "auteur"
      }
    }
  },
  "correction": null,
  "notice": {
    "numNotice": "263",
    "formule": "relatif à la sécurité publique",
    "adoptionConforme": "false"
  },
  "indexation": null,
  "imprimerie": null
}