{
  "@xsi:type": "texteLoi_Type",
  "uid": "PIONANR5L14B2034",
  "legislature": "14",
  "cycleDeVie": {
    "chrono": {
      "dateCreation": "2014-06-17T00:00:00.000+02:00",
      "dateDepot": "2014-06-17T00:00:00.000+02:00",
      "datePublication": null,
      "datePublicationWeb": "2014-06-23T15:30:00.000+02:00"
    }
  },
  "denominationStructurelle": "Proposition de loi",
  "provenance": "Texte Déposé",
  "titres": {
    "titrePrincipal": "proposition de loi visant à créer des polices territoriales et portant dispositions diverses relatives à leur organisation et leur fonctionnement",
    "titrePrincipalCourt": "Création des polices territoriales"
  },
  "divisions": null,
  "dossierRef": "DLR5L14N33166",
  "redacteur": null,
  "classification": {
    "famille": {
      "depot": {
        "code": "INITNAV",
        "libelle": "Initiative en Navette"
      },
      "classe": {
        "code": "PIONLOI",
        "libelle": "Proposition de loi"
      }
    },
    "type": {
      "code": "PION",
      "libelle": "Proposition de loi"
    },
    "sousType": null,
    "statutAdoption": null
  },
  "auteurs": {
    "auteur": {
      "organe": {
        "organeRef": "PO644420"
      }
    }
  },
  "correction": null,
  "notice": {
    "numNotice": "2034",
    "formule": ", adoptée par le Sénat, visant à créer des polices territoriales et portant dispositions diverses relatives à leur organisation et leur fonctionnement",
    "adoptionConforme": "false"
  },
  "indexation": null,
  "imprimerie": null,
  "coSignataires": null,
  "depotAmendements": {
    "amendementsSeance": {
      "amendable": "false",
      "dateLimiteDepot": null
    },
    "amendementsCommission": {
      "commission": {
        "organeRef": "PO59051",
        "amendable": "true",
        "dateLimiteDepot": null
      }
    }
  }
}