{
  "@xsi:type": "DossierResolutionAN",
  "uid": "DLR5L14N33409",
  "legislature": "14",
  "titreDossier": {
    "titre": "Famille : gestation pour autrui (GPA) suite à la décision de la CEDH du 26 juin 2014",
    "titreChemin": "gestation_pour_autrui_CEDH_260614",
    "senatChemin": null
  },
  "procedureParlementaire": {
    "code": "22",
    "libelle": "Résolution Article 34-1"
  },
  "initiateur": {
    "acteurs": {
      "acteur": {
        "acteurRef": "PA1931",
        "mandatRef": "PM645042"
      }
    }
  },
  "actesLegislatifs": {
    "acteLegislatif": {
      "@xsi:type": "Etape_Type",
      "uid": "L14-ANLUNI-33409",
      "codeActe": "ANLUNI",
      "libelleActe": {
        "nomCanonique": "Lecture unique"
      },
      "organeRef": "PO644420",
      "dateActe": null,
      "actesLegislatifs": {
        "acteLegislatif": {
          "@xsi:type": "DepotInitiative_Type",
          "uid": "L14-VD171156DI",
          "codeActe": "ANLUNI-DEPOT",
          "libelleActe": {
            "nomCanonique": "1er dépôt d'une initiative.",
            "libelleCourt": "1er dépôt d'une initiative."
          },
          "organeRef": "PO644420",
          "dateActe": "2014-09-12T00:00:00.000+02:00",
          "actesLegislatifs": null,
          "texteAssocie": "PNREANR5L14B2198"
        }
      }
    }
  },
  "fusionDossier": null
}