{
  "@xsi:type": "texteLoi_Type",
  "uid": "PIONANR5L14B0754",
  "legislature": "14",
  "cycleDeVie": {
    "chrono": {
      "dateCreation": "2013-02-21T00:00:00.000+01:00",
      "dateDepot": "2013-02-27T00:00:00.000+01:00",
      "datePublication": null,
      "datePublicationWeb": "2013-02-28T12:00:00.000+01:00"
    }
  },
  "denominationStructurelle": "Proposition de loi",
  "provenance": "Texte Déposé",
  "titres": {
    "titrePrincipal": "proposition de loi visant à renforcer les droits des patients en fin de vie",
    "titrePrincipalCourt": "Renforcement des droits des patients en fin de vie"
  },
  "divisions": null,
  "dossierRef": "DLR5L14N29808",
  "redacteur": null,
  "classification": {
    "famille": {
      "depot": {
        "code": "INITDEP",
        "libelle": "Initiative en 1er Dépôt"
      },
      "classe": {
        "code": "PIONLOI",
        "libelle": "Proposition de loi"
      }
    },
    "type": {
      "code": "PION",
      "libelle": "Proposition de loi"
    },
    "sousType": null,
    "statutAdoption": null
  },
  "auteurs": {
    "auteur": {
      "acteur": {
        "acteurRef": "PA1946",
        "qualite": "auteur"
      }
    }
  },
  "correction": null,
  "notice": {
    "numNotice": "754",
    "formule": "visant à renforcer les droits des patients en fin de vie",
    "adoptionConforme": "false"
  },
  "indexation": {
    "themes": {
      "@niveau": "1",
      "theme": {
        "libelleTheme": "PRIX ET CONCURRENCE"
      }
    }
  },
  "imprimerie": null,
  "coSignataires": {
    "coSignataire": [
      {
        "acteur": {
          "acteurRef": "PA1695"
        },
        "dateCosignature": "2013-02-27+01:00",
        "dateRetraitCosignature": null,
        "edite": "true"
      },
      {
        "acteur": {
          "acteurRef": "PA605036"
        },
        "dateCosignature": "2013-02-27+01:00",
        "dateRetraitCosignature": null,
        "edite": "false"
      },
      {
        "acteur": {
          "acteurRef": "PA267457"
        },
        "dateCosignature": "2013-02-27+01:00",
        "dateRetraitCosignature": null,
        "edite": "false"
      },
      {
        "acteur": {
          "acteurRef": "PA230"
        },
        "dateCosignature": "2013-02-27+01:00",
        "dateRetraitCosignature": null,
        "edite": "false"
      },
      {
        "acteur": {
          "acteurRef": "PA243"
        },
        "dateCosignature": "2013-02-27+01:00",
        "dateRetraitCosignature": null,
        "edite": "false"
      },
      {
        "acteur": {
          "acteurRef": "PA259"
        },
        "dateCosignature": "2013-02-27+01:00",
        "dateRetraitCosignature": null,
        "edite": "false"
      },
      {
        "acteur": {
          "acteurRef": "PA333224"
        },
        "dateCosignature": "2013-02-27+01:00",
        "dateRetraitCosignature": null,
        "edite": "false"
      },
      {
        "acteur": {
          "acteurRef": "PA314"
        },
        "dateCosignature": "2013-02-27+01:00",
        "dateRetraitCosignature": null,
        "edite": "false"
      },
      {
        "acteur": {
          "acteurRef": "PA606888"
        },
        "dateCosignature": "2013-02-27+01:00",
        "dateRetraitCosignature": null,
        "edite": "false"
      },
      {
        "acteur": {
          "acteurRef": "PA267822"
        },
        "dateCosignature": "2013-02-27+01:00",
        "dateRetraitCosignature": null,
        "edite": "false"
      },
      {
        "acteur": {
          "acteurRef": "PA687214"
        },
        "dateCosignature": "2013-02-27+01:00",
        "dateRetraitCosignature": null,
        "edite": "false"
      },
      {
        "acteur": {
          "acteurRef": "PA267075"
        },
        "dateCosignature": "2013-02-27+01:00",
        "dateRetraitCosignature": null,
        "edite": "false"
      },
      {
        "acteur": {
          "acteurRef": "PA267576"
        },
        "dateCosignature": "2013-02-27+01:00",
        "dateRetraitCosignature": null,
        "edite": "false"
      },
      {
        "acteur": {
          "acteurRef": "PA336316"
        },
        "dateCosignature": "2013-02-27+01:00",
        "dateRetraitCosignature": null,
        "edite": "false"
      },
      {
        "acteur": {
          "acteurRef": "PA330684"
        },
        "dateCosignature": "2013-02-27+01:00",
        "dateRetraitCosignature": null,
        "edite": "false"
      },
      {
        "acteur": {
          "acteurRef": "PA223837"
        },
        "dateCosignature": "2013-02-27+01:00",
        "dateRetraitCosignature": null,
        "edite": "false"
      },
      {
        "acteur": {
          "acteurRef": "PA746"
        },
        "dateCosignature": "2013-02-27+01:00",
        "dateRetraitCosignature": null,
        "edite": "false"
      },
      {
        "acteur": {
          "acteurRef": "PA267266"
        },
        "dateCosignature": "2013-02-27+01:00",
        "dateRetraitCosignature": null,
        "edite": "false"
      },
      {
        "acteur": {
          "acteurRef": "PA267895"
        },
        "dateCosignature": "2013-02-27+01:00",
        "dateRetraitCosignature": null,
        "edite": "false"
      },
      {
        "acteur": {
          "acteurRef": "PA267165"
        },
        "dateCosignature": "2013-02-27+01:00",
        "dateRetraitCosignature": null,
        "edite": "false"
      },
      {
        "acteur": {
          "acteurRef": "PA856"
        },
        "dateCosignature": "2013-02-27+01:00",
        "dateRetraitCosignature": null,
        "edite": "false"
      },
      {
        "acteur": {
          "acteurRef": "PA267429"
        },
        "dateCosignature": "2013-02-27+01:00",
        "dateRetraitCosignature": null,
        "edite": "false"
      },
      {
        "acteur": {
          "acteurRef": "PA942"
        },
        "dateCosignature": "2013-02-27+01:00",
        "dateRetraitCosignature": null,
        "edite": "false"
      },
      {
        "acteur": {
          "acteurRef": "PA951"
        },
        "dateCosignature": "2013-02-27+01:00",
        "dateRetraitCosignature": null,
        "edite": "false"
      },
      {
        "acteur": {
          "acteurRef": "PA998"
        },
        "dateCosignature": "2013-02-27+01:00",
        "dateRetraitCosignature": null,
        "edite": "false"
      },
      {
        "acteur": {
          "acteurRef": "PA1001"
        },
        "dateCosignature": "2013-02-27+01:00",
        "dateRetraitCosignature": null,
        "edite": "false"
      },
      {
        "acteur": {
          "acteurRef": "PA1020"
        },
        "dateCosignature": "2013-02-27+01:00",
        "dateRetraitCosignature": null,
        "edite": "false"
      },
      {
        "acteur": {
          "acteurRef": "PA267762"
        },
        "dateCosignature": "2013-02-27+01:00",
        "dateRetraitCosignature": null,
        "edite": "false"
      },
      {
        "acteur": {
          "acteurRef": "PA1029"
        },
        "dateCosignature": "2013-02-27+01:00",
        "dateRetraitCosignature": null,
        "edite": "false"
      },
      {
        "acteur": {
          "acteurRef": "PA1031"
        },
        "dateCosignature": "2013-02-27+01:00",
        "dateRetraitCosignature": null,
        "edite": "false"
      },
      {
        "acteur": {
          "acteurRef": "PA267450"
        },
        "dateCosignature": "2013-02-27+01:00",
        "dateRetraitCosignature": null,
        "edite": "false"
      },
      {
        "acteur": {
          "acteurRef": "PA267178"
        },
        "dateCosignature": "2013-02-27+01:00",
        "dateRetraitCosignature": null,
        "edite": "false"
      },
      {
        "acteur": {
          "acteurRef": "PA267289"
        },
        "dateCosignature": "2013-02-27+01:00",
        "dateRetraitCosignature": null,
        "edite": "false"
      },
      {
        "acteur": {
          "acteurRef": "PA342935"
        },
        "dateCosignature": "2013-02-27+01:00",
        "dateRetraitCosignature": null,
        "edite": "false"
      },
      {
        "acteur": {
          "acteurRef": "PA334149"
        },
        "dateCosignature": "2013-02-27+01:00",
        "dateRetraitCosignature": null,
        "edite": "false"
      },
      {
        "acteur": {
          "acteurRef": "PA267042"
        },
        "dateCosignature": "2013-02-27+01:00",
        "dateRetraitCosignature": null,
        "edite": "false"
      },
      {
        "acteur": {
          "acteurRef": "PA267591"
        },
        "dateCosignature": "2013-02-27+01:00",
        "dateRetraitCosignature": null,
        "edite": "false"
      },
      {
        "acteur": {
          "acteurRef": "PA336576"
        },
        "dateCosignature": "2013-02-27+01:00",
        "dateRetraitCosignature": null,
        "edite": "false"
      },
      {
        "acteur": {
          "acteurRef": "PA606478"
        },
        "dateCosignature": "2013-02-27+01:00",
        "dateRetraitCosignature": null,
        "edite": "false"
      },
      {
        "acteur": {
          "acteurRef": "PA267532"
        },
        "dateCosignature": "2013-02-27+01:00",
        "dateRetraitCosignature": null,
        "edite": "false"
      },
      {
        "acteur": {
          "acteurRef": "PA1379"
        },
        "dateCosignature": "2013-02-27+01:00",
        "dateRetraitCosignature": null,
        "edite": "false"
      },
      {
        "acteur": {
          "acteurRef": "PA266774"
        },
        "dateCosignature": "2013-02-27+01:00",
        "dateRetraitCosignature": null,
        "edite": "false"
      },
      {
        "acteur": {
          "acteurRef": "PA267735"
        },
        "dateCosignature": "2013-02-27+01:00",
        "dateRetraitCosignature": null,
        "edite": "false"
      },
      {
        "acteur": {
          "acteurRef": "PA605991"
        },
        "dateCosignature": "2013-02-27+01:00",
        "dateRetraitCosignature": null,
        "edite": "false"
      },
      {
        "acteur": {
          "acteurRef": "PA267813"
        },
        "dateCosignature": "2013-02-27+01:00",
        "dateRetraitCosignature": null,
        "edite": "false"
      },
      {
        "acteur": {
          "acteurRef": "PA1459"
        },
        "dateCosignature": "2013-02-27+01:00",
        "dateRetraitCosignature": null,
        "edite": "false"
      },
      {
        "acteur": {
          "acteurRef": "PA1466"
        },
        "dateCosignature": "2013-02-27+01:00",
        "dateRetraitCosignature": null,
        "edite": "false"
      },
      {
        "acteur": {
          "acteurRef": "PA1477"
        },
        "dateCosignature": "2013-02-27+01:00",
        "dateRetraitCosignature": null,
        "edite": "false"
      },
      {
        "acteur": {
          "acteurRef": "PA267680"
        },
        "dateCosignature": "2013-02-27+01:00",
        "dateRetraitCosignature": null,
        "edite": "false"
      },
      {
        "acteur": {
          "acteurRef": "PA1483"
        },
        "dateCosignature": "2013-02-27+01:00",
        "dateRetraitCosignature": null,
        "edite": "false"
      },
      {
        "acteur": {
          "acteurRef": "PA1498"
        },
        "dateCosignature": "2013-02-27+01:00",
        "dateRetraitCosignature": null,
        "edite": "false"
      },
      {
        "acteur": {
          "acteurRef": "PA1521"
        },
        "dateCosignature": "2013-02-27+01:00",
        "dateRetraitCosignature": null,
        "edite": "false"
      },
      {
        "acteur": {
          "acteurRef": "PA267459"
        },
        "dateCosignature": "2013-02-27+01:00",
        "dateRetraitCosignature": null,
        "edite": "false"
      },
      {
        "acteur": {
          "acteurRef": "PA343623"
        },
        "dateCosignature": "2013-02-27+01:00",
        "dateRetraitCosignature": null,
        "edite": "false"
      },
      {
        "acteur": {
          "acteurRef": "PA267227"
        },
        "dateCosignature": "2013-02-27+01:00",
        "dateRetraitCosignature": null,
        "edite": "false"
      },
      {
        "acteur": {
          "acteurRef": "PA335567"
        },
        "dateCosignature": "2013-02-27+01:00",
        "dateRetraitCosignature": null,
        "edite": "false"
      },
      {
        "acteur": {
          "acteurRef": "PA1574"
        },
        "dateCosignature": "2013-02-27+01:00",
        "dateRetraitCosignature": null,
        "edite": "false"
      },
      {
        "acteur": {
          "acteurRef": "PA1585"
        },
        "dateCosignature": "2013-02-27+01:00",
        "dateRetraitCosignature": null,
        "edite": "false"
      },
      {
        "acteur": {
          "acteurRef": "PA267246"
        },
        "dateCosignature": "2013-02-27+01:00",
        "dateRetraitCosignature": null,
        "edite": "false"
      },
      {
        "acteur": {
          "acteurRef": "PA1630"
        },
        "dateCosignature": "2013-02-27+01:00",
        "dateRetraitCosignature": null,
        "edite": "false"
      },
      {
        "acteur": {
          "acteurRef": "PA267355"
        },
        "dateCosignature": "2013-02-27+01:00",
        "dateRetraitCosignature": null,
        "edite": "false"
      },
      {
        "acteur": {
          "acteurRef": "PA608416"
        },
        "dateCosignature": "2013-02-27+01:00",
        "dateRetraitCosignature": null,
        "edite": "false"
      },
      {
        "acteur": {
          "acteurRef": "PA1661"
        },
        "dateCosignature": "2013-02-27+01:00",
        "dateRetraitCosignature": null,
        "edite": "false"
      },
      {
        "acteur": {
          "acteurRef": "PA333134"
        },
        "dateCosignature": "2013-02-27+01:00",
        "dateRetraitCosignature": null,
        "edite": "false"
      },
      {
        "acteur": {
          "acteurRef": "PA267200"
        },
        "dateCosignature": "2013-02-27+01:00",
        "dateRetraitCosignature": null,
        "edite": "false"
      },
      {
        "acteur": {
          "acteurRef": "PA1699"
        },
        "dateCosignature": "2013-02-27+01:00",
        "dateRetraitCosignature": null,
        "edite": "false"
      },
      {
        "acteur": {
          "acteurRef": "PA1761"
        },
        "dateCosignature": "2013-02-27+01:00",
        "dateRetraitCosignature": null,
        "edite": "false"
      },
      {
        "acteur": {
          "acteurRef": "PA1790"
        },
        "dateCosignature": "2013-02-27+01:00",
        "dateRetraitCosignature": null,
        "edite": "false"
      },
      {
        "acteur": {
          "acteurRef": "PA1012"
        },
        "dateCosignature": "2013-02-27+01:00",
        "dateRetraitCosignature": null,
        "edite": "false"
      },
      {
        "acteur": {
          "acteurRef": "PA606693"
        },
        "dateCosignature": "2013-02-27+01:00",
        "dateRetraitCosignature": null,
        "edite": "false"
      },
      {
        "acteur": {
          "acteurRef": "PA1931"
        },
        "dateCosignature": "2013-02-27+01:00",
        "dateRetraitCosignature": null,
        "edite": "false"
      },
      {
        "acteur": {
          "acteurRef": "PA331481"
        },
        "dateCosignature": "2013-02-27+01:00",
        "dateRetraitCosignature": null,
        "edite": "false"
      },
      {
        "acteur": {
          "acteurRef": "PA1954"
        },
        "dateCosignature": "2013-02-27+01:00",
        "dateRetraitCosignature": null,
        "edite": "false"
      },
      {
        "acteur": {
          "acteurRef": "PA607603"
        },
        "dateCosignature": "2013-02-27+01:00",
        "dateRetraitCosignature": null,
        "edite": "false"
      },
      {
        "acteur": {
          "acteurRef": "PA1960"
        },
        "dateCosignature": "2013-02-27+01:00",
        "dateRetraitCosignature": null,
        "edite": "false"
      },
      {
        "acteur": {
          "acteurRef": "PA267057"
        },
        "dateCosignature": "2013-02-27+01:00",
        "dateRetraitCosignature": null,
        "edite": "false"
      },
      {
        "acteur": {
          "acteurRef": "PA267378"
        },
        "dateCosignature": "2013-02-27+01:00",
        "dateRetraitCosignature": null,
        "edite": "false"
      },
      {
        "acteur": {
          "acteurRef": "PA608016"
        },
        "dateCosignature": "2013-02-27+01:00",
        "dateRetraitCosignature": null,
        "edite": "false"
      },
      {
        "acteur": {
          "acteurRef": "PA2011"
        },
        "dateCosignature": "2013-02-27+01:00",
        "dateRetraitCosignature": null,
        "edite": "false"
      },
      {
        "acteur": {
          "acteurRef": "PA606712"
        },
        "dateCosignature": "2013-02-27+01:00",
        "dateRetraitCosignature": null,
        "edite": "false"
      },
      {
        "acteur": {
          "acteurRef": "PA267512"
        },
        "dateCosignature": "2013-02-27+01:00",
        "dateRetraitCosignature": null,
        "edite": "false"
      },
      {
        "acteur": {
          "acteurRef": "PA605782"
        },
        "dateCosignature": "2013-02-27+01:00",
        "dateRetraitCosignature": null,
        "edite": "false"
      },
      {
        "acteur": {
          "acteurRef": "PA2073"
        },
        "dateCosignature": "2013-02-27+01:00",
        "dateRetraitCosignature": null,
        "edite": "false"
      },
      {
        "acteur": {
          "acteurRef": "PA2086"
        },
        "dateCosignature": "2013-02-27+01:00",
        "dateRetraitCosignature": null,
        "edite": "false"
      },
      {
        "acteur": {
          "acteurRef": "PA2098"
        },
        "dateCosignature": "2013-02-27+01:00",
        "dateRetraitCosignature": null,
        "edite": "false"
      },
      {
        "acteur": {
          "acteurRef": "PA2099"
        },
        "dateCosignature": "2013-02-27+01:00",
        "dateRetraitCosignature": null,
        "edite": "false"
      },
      {
        "acteur": {
          "acteurRef": "PA267556"
        },
        "dateCosignature": "2013-02-27+01:00",
        "dateRetraitCosignature": null,
        "edite": "false"
      },
      {
        "acteur": {
          "acteurRef": "PA2124"
        },
        "dateCosignature": "2013-02-27+01:00",
        "dateRetraitCosignature": null,
        "edite": "false"
      },
      {
        "acteur": {
          "acteurRef": "PA267327"
        },
        "dateCosignature": "2013-02-27+01:00",
        "dateRetraitCosignature": null,
        "edite": "false"
      },
      {
        "acteur": {
          "acteurRef": "PA2191"
        },
        "dateCosignature": "2013-02-27+01:00",
        "dateRetraitCosignature": null,
        "edite": "false"
      },
      {
        "acteur": {
          "acteurRef": "PA2229"
        },
        "dateCosignature": "2013-02-27+01:00",
        "dateRetraitCosignature": null,
        "edite": "false"
      },
      {
        "acteur": {
          "acteurRef": "PA266788"
        },
        "dateCosignature": "2013-02-27+01:00",
        "dateRetraitCosignature": null,
        "edite": "false"
      },
      {
        "acteur": {
          "acteurRef": "PA606299"
        },
        "dateCosignature": "2013-02-27+01:00",
        "dateRetraitCosignature": null,
        "edite": "false"
      },
      {
        "acteur": {
          "acteurRef": "PA2250"
        },
        "dateCosignature": "2013-02-27+01:00",
        "dateRetraitCosignature": null,
        "edite": "false"
      },
      {
        "acteur": {
          "acteurRef": "PA344776"
        },
        "dateCosignature": "2013-02-27+01:00",
        "dateRetraitCosignature": null,
        "edite": "false"
      },
      {
        "acteur": {
          "acteurRef": "PA2277"
        },
        "dateCosignature": "2013-02-27+01:00",
        "dateRetraitCosignature": null,
        "edite": "false"
      },
      {
        "acteur": {
          "acteurRef": "PA2295"
        },
        "dateCosignature": "2013-02-27+01:00",
        "dateRetraitCosignature": null,
        "edite": "false"
      },
      {
        "acteur": {
          "acteurRef": "PA267605"
        },
        "dateCosignature": "2013-02-27+01:00",
        "dateRetraitCosignature": null,
        "edite": "false"
      },
      {
        "acteur": {
          "acteurRef": "PA2345"
        },
        "dateCosignature": "2013-02-27+01:00",
        "dateRetraitCosignature": null,
        "edite": "false"
      },
      {
        "acteur": {
          "acteurRef": "PA2377"
        },
        "dateCosignature": "2013-02-27+01:00",
        "dateRetraitCosignature": null,
        "edite": "false"
      },
      {
        "acteur": {
          "acteurRef": "PA345619"
        },
        "dateCosignature": "2013-02-27+01:00",
        "dateRetraitCosignature": null,
        "edite": "false"
      },
      {
        "acteur": {
          "acteurRef": "PA267469"
        },
        "dateCosignature": "2013-02-27+01:00",
        "dateRetraitCosignature": null,
        "edite": "false"
      },
      {
        "acteur": {
          "acteurRef": "PA267260"
        },
        "dateCosignature": "2013-02-27+01:00",
        "dateRetraitCosignature": null,
        "edite": "false"
      },
      {
        "acteur": {
          "acteurRef": "PA267886"
        },
        "dateCosignature": "2013-02-27+01:00",
        "dateRetraitCosignature": null,
        "edite": "false"
      },
      {
        "acteur": {
          "acteurRef": "PA267728"
        },
        "dateCosignature": "2013-02-27+01:00",
        "dateRetraitCosignature": null,
        "edite": "false"
      },
      {
        "acteur": {
          "acteurRef": "PA2492"
        },
        "dateCosignature": "2013-02-27+01:00",
        "dateRetraitCosignature": null,
        "edite": "false"
      },
      {
        "acteur": {
          "acteurRef": "PA266776"
        },
        "dateCosignature": "2013-02-27+01:00",
        "dateRetraitCosignature": null,
        "edite": "false"
      },
      {
        "acteur": {
          "acteurRef": "PA2529"
        },
        "dateCosignature": "2013-02-27+01:00",
        "dateRetraitCosignature": null,
        "edite": "false"
      },
      {
        "acteur": {
          "acteurRef": "PA417099"
        },
        "dateCosignature": "2013-02-27+01:00",
        "dateRetraitCosignature": null,
        "edite": "false"
      },
      {
        "acteur": {
          "acteurRef": "PA608380"
        },
        "dateCosignature": "2013-02-27+01:00",
        "dateRetraitCosignature": null,
        "edite": "false"
      },
      {
        "acteur": {
          "acteurRef": "PA267527"
        },
        "dateCosignature": "2013-02-27+01:00",
        "dateRetraitCosignature": null,
        "edite": "false"
      },
      {
        "acteur": {
          "acteurRef": "PA2664"
        },
        "dateCosignature": "2013-02-27+01:00",
        "dateRetraitCosignature": null,
        "edite": "false"
      },
      {
        "acteur": {
          "acteurRef": "PA2667"
        },
        "dateCosignature": "2013-02-27+01:00",
        "dateRetraitCosignature": null,
        "edite": "false"
      },
      {
        "acteur": {
          "acteurRef": "PA2700"
        },
        "dateCosignature": "2013-02-27+01:00",
        "dateRetraitCosignature": null,
        "edite": "false"
      },
      {
        "acteur": {
          "acteurRef": "PA610924"
        },
        "dateCosignature": "2013-02-27+01:00",
        "dateRetraitCosignature": null,
        "edite": "false"
      },
      {
        "acteur": {
          "acteurRef": "PA2707"
        },
        "dateCosignature": "2013-02-27+01:00",
        "dateRetraitCosignature": null,
        "edite": "false"
      },
      {
        "acteur": {
          "acteurRef": "PA267204"
        },
        "dateCosignature": "2013-02-27+01:00",
        "dateRetraitCosignature": null,
        "edite": "false"
      },
      {
        "acteur": {
          "acteurRef": "PA344492"
        },
        "dateCosignature": "2013-02-27+01:00",
        "dateRetraitCosignature": null,
        "edite": "false"
      },
      {
        "acteur": {
          "acteurRef": "PA346876"
        },
        "dateCosignature": "2013-02-27+01:00",
        "dateRetraitCosignature": null,
        "edite": "false"
      },
      {
        "acteur": {
          "acteurRef": "PA267013"
        },
        "dateCosignature": "2013-02-27+01:00",
        "dateRetraitCosignature": null,
        "edite": "false"
      },
      {
        "acteur": {
          "acteurRef": "PA334654"
        },
        "dateCosignature": "2013-02-27+01:00",
        "dateRetraitCosignature": null,
        "edite": "false"
      },
      {
        "acteur": {
          "acteurRef": "PA608434"
        },
        "dateCosignature": "2013-02-27+01:00",
        "dateRetraitCosignature": null,
        "edite": "false"
      },
      {
        "acteur": {
          "acteurRef": "PA2775"
        },
        "dateCosignature": "2013-02-27+01:00",
        "dateRetraitCosignature": null,
        "edite": "false"
      },
      {
        "acteur": {
          "acteurRef": "PA335159"
        },
        "dateCosignature": "2013-02-27+01:00",
        "dateRetraitCosignature": null,
        "edite": "false"
      },
      {
        "acteur": {
          "acteurRef": "PA2792"
        },
        "dateCosignature": "2013-02-27+01:00",
        "dateRetraitCosignature": null,
        "edite": "false"
      },
      {
        "acteur": {
          "acteurRef": "PA2801"
        },
        "dateCosignature": "2013-02-27+01:00",
        "dateRetraitCosignature": null,
        "edite": "false"
      },
      {
        "acteur": {
          "acteurRef": "PA609442"
        },
        "dateCosignature": "2013-02-27+01:00",
        "dateRetraitCosignature": null,
        "edite": "false"
      },
      {
        "acteur": {
          "acteurRef": "PA2815"
        },
        "dateCosignature": "2013-02-27+01:00",
        "dateRetraitCosignature": null,
        "edite": "false"
      },
      {
        "acteur": {
          "acteurRef": "PA2876"
        },
        "dateCosignature": "2013-02-27+01:00",
        "dateRetraitCosignature": null,
        "edite": "false"
      },
      {
        "acteur": {
          "acteurRef": "PA267797"
        },
        "dateCosignature": "2013-02-27+01:00",
        "dateRetraitCosignature": null,
        "edite": "false"
      },
      {
        "acteur": {
          "acteurRef": "PA334843"
        },
        "dateCosignature": "2013-02-27+01:00",
        "dateRetraitCosignature": null,
        "edite": "false"
      },
      {
        "acteur": {
          "acteurRef": "PA2907"
        },
        "dateCosignature": "2013-02-27+01:00",
        "dateRetraitCosignature": null,
        "edite": "false"
      },
      {
        "acteur": {
          "acteurRef": "PA607090"
        },
        "dateCosignature": "2013-02-27+01:00",
        "dateRetraitCosignature": null,
        "edite": "false"
      },
      {
        "acteur": {
          "acteurRef": "PA267506"
        },
        "dateCosignature": "2013-02-27+01:00",
        "dateRetraitCosignature": null,
        "edite": "false"
      },
      {
        "acteur": {
          "acteurRef": "PA267285"
        },
        "dateCosignature": "2013-02-27+01:00",
        "dateRetraitCosignature": null,
        "edite": "false"
      },
      {
        "acteur": {
          "acteurRef": "PA2960"
        },
        "dateCosignature": "2013-02-27+01:00",
        "dateRetraitCosignature": null,
        "edite": "false"
      },
      {
        "acteur": {
          "acteurRef": "PA2971"
        },
        "dateCosignature": "2013-02-27+01:00",
        "dateRetraitCosignature": null,
        "edite": "false"
      }
    ]
  },
  "depotAmendements": {
    "amendementsSeance": {
      "amendable": "true",
      "dateLimiteDepot": null
    },
    "amendementsCommission": {
      "commission": {
        "organeRef": "PO420120",
        "amendable": "true",
        "dateLimiteDepot": null
      }
    }
  }
}