{
  "@xsi:type": "rapportParlementaire_Type",
  "uid": "RAPPANR5L14B1133",
  "legislature": "14",
  "cycleDeVie": {
    "chrono": {
      "dateCreation": "2013-06-12T00:00:00.000+02:00",
      "dateDepot": "2013-06-12T00:00:00.000+02:00",
      "datePublication": null,
      "datePublicationWeb": null
    }
  },
  "denominationStructurelle": "Rapport",
  "provenance": "Commission",
  "titres": {
    "titrePrincipal": "rapport , établi au nom de cet office, sur \"Les perspectives d'évolution de l'aviation civile à l'horizon 2040 : préserver l'avance de la France et de l'Europe\"",
    "titrePrincipalCourt": "rapport , établi au nom de cet office, sur \"Les perspectives d'évolution de l'aviation civile à l'horizon 2040 : préserver l'avance de la France et de l'Europe\""
  },
  "divisions": null,
  "dossierRef": "DLR5L14N30492",
  "redacteur": null,
  "classification": {
    "famille": {
      "depot": {
        "code": "RAPAUT",
        "libelle": "Rapport autonome"
      },
      "classe": {
        "code": "RAPPORT",
        "libelle": "Rapport"
      },
      "espece": {
        "code": "OFFPARL",
        "libelle": "des offices parlementaires ou délégations mixtes"
      }
    },
    "type": {
      "code": "RAPP",
      "libelle": "Rapport"
    },
    "sousType": {
      "code": "OFFPARL",
      "libelle": "des offices parlementaires",
      "libelleEdition": "des offices parlementaires"
    },
    "statutAdoption": null
  },
  "auteurs": {
    "auteur": [
      {
        "acteur": {
          "acteurRef": "PA944",
          "qualite": "rapporteur"
        }
      },
      {
        "organe": {
          "organeRef": "PO273589"
        }
      }
    ]
  },
  "correction": null,
  "notice": {
    "numNotice": "1133",
    "formule": ", établi au nom de cet office, sur \"Les perspectives d'évolution de l'aviation civile à l'horizon 2040 : préserver l'avance de la France et de l'Europe\"",
    "adoptionConforme": "false"
  },
  "indexation": {
    "themes": {
      "@niveau": "1",
      "theme": {
        "libelleTheme": "POLITIQUE SOCIALE"
      }
    }
  },
  "imprimerie": null
}