{
  "@xsi:type": "texteLoi_Type",
  "uid": "PIONANR5L14B2755",
  "legislature": "14",
  "cycleDeVie": {
    "chrono": {
      "dateCreation": "2015-04-22T00:00:00.000+02:00",
      "dateDepot": "2015-05-06T00:00:00.000+02:00",
      "datePublication": null,
      "datePublicationWeb": "2015-05-07T17:25:00.000+02:00"
    }
  },
  "denominationStructurelle": "Proposition de loi",
  "provenance": "Texte Déposé",
  "titres": {
    "titrePrincipal": "proposition de loi relative à l'accompagnement des enfants hospitalisés",
    "titrePrincipalCourt": "accompagnement enfants hospitalisés"
  },
  "divisions": null,
  "dossierRef": "DLR5L14N33923",
  "redacteur": null,
  "classification": {
    "famille": {
      "depot": {
        "code": "INITDEP",
        "libelle": "Initiative en 1er Dépôt"
      },
      "classe": {
        "code": "PIONLOI",
        "libelle": "Proposition de loi"
      }
    },
    "type": {
      "code": "PION",
      "libelle": "Proposition de loi"
    },
    "sousType": null,
    "statutAdoption": null
  },
  "auteurs": {
    "auteur": {
      "acteur": {
        "acteurRef": "PA2895",
        "qualite": "auteur"
      }
    }
  },
  "correction": null,
  "notice": {
    "numNotice": "2755",
    "formule": "relative à l'accompagnement des enfants hospitalisés",
    "adoptionConforme": "false"
  },
  "indexation": null,
  "imprimerie": null,
  "coSignataires": null,
  "depotAmendements": {
    "amendementsSeance": {
      "amendable": "false",
      "dateLimiteDepot": null
    },
    "amendementsCommission": {
      "commission": {
        "organeRef": "PO420120",
        "amendable": "true",
        "dateLimiteDepot": null
      }
    }
  }
}