{
  "@xsi:type": "documentEtudeImpact_Type",
  "uid": "ETDIANR5L14B0736",
  "legislature": "14",
  "cycleDeVie": {
    "chrono": {
      "dateCreation": "2013-02-20T00:00:00.000+01:00",
      "dateDepot": "2013-02-20T00:00:00.000+01:00",
      "datePublication": "2013-05-15T00:00:00.000+02:00",
      "datePublicationWeb": "2013-02-21T16:00:00.000+01:00"
    }
  },
  "denominationStructurelle": "Projet de loi",
  "provenance": "Texte Déposé",
  "titres": {
    "titrePrincipal": "Etude d'impact sur le projet de loi portant diverses dispositions d’adaptation dans le domaine de la justice en application du droit de l’Union européenne et des engagements internationaux de la France",
    "titrePrincipalCourt": "adaptation de la justice au droit de l’Union européenne et aux engagements internationaux de la France"
  },
  "divisions": null,
  "dossierRef": "DLR5L14N29788",
  "redacteur": null,
  "classification": {
    "famille": {
      "depot": {
        "code": "INITDEP",
        "libelle": "Initiative en 1er Dépôt"
      },
      "classe": {
        "code": "PRJLOI",
        "libelle": "Projet de loi"
      }
    },
    "type": {
      "code": "ETDI",
      "libelle": "Etude d'impact"
    },
    "sousType": null,
    "statutAdoption": null
  },
  "auteurs": {
    "auteur": {
      "acteur": {
        "acteurRef": "PA328",
        "qualite": "auteur"
      }
    }
  },
  "correction": null,
  "notice": {
    "numNotice": "736",
    "formule": "portant diverses dispositions d’adaptation dans le domaine de la justice en application du droit de l’Union européenne et des engagements internationaux de la France",
    "adoptionConforme": "false"
  },
  "indexation": {
    "themes": {
      "@niveau": "1",
      "theme": {
        "libelleTheme": "POLITIQUE ECONOMIQUE ET SOCIALE"
      }
    }
  },
  "imprimerie": {
    "prix": "3.0"
  }
}