{
  "@xsi:type": "texteLoi_Type",
  "uid": "AVISANR5L14B0257",
  "legislature": "14",
  "cycleDeVie": {
    "chrono": {
      "dateCreation": "2012-10-09T00:00:00.000+02:00",
      "dateDepot": "2012-10-10T00:00:00.000+02:00",
      "datePublication": null,
      "datePublicationWeb": null
    }
  },
  "denominationStructurelle": "Avis",
  "provenance": "Commission",
  "titres": {
    "titrePrincipal": "avis sur le projet de loi de finances  pour 2013 (n°235)",
    "titrePrincipalCourt": "avis sur le projet de loi de finances  pour 2013 (n°235)"
  },
  "divisions": {
    "division": [
      {
        "@xsi:type": "texteLoi_Type",
        "uid": "AVISANR5L14B0257-tI",
        "legislature": "14",
        "cycleDeVie": {
          "chrono": {
            "dateCreation": "2012-10-09T00:00:00.000+02:00",
            "dateDepot": "2012-10-10T00:00:00.000+02:00",
            "datePublication": "2012-11-05T00:00:00.000+01:00",
            "datePublicationWeb": "2012-10-30T11:30:00.000+01:00"
          }
        },
        "denominationStructurelle": "Tome I",
        "titres": {
          "titrePrincipal": "Ecologie, développement et aménagement durables : Protection de l'environnement et prévention des risques",
          "titrePrincipalCourt": "Ecologie, développement et aménagement durables : Protection de l'environnement et prévention des risques"
        },
        "divisions": null,
        "dossierRef": "DLR5L14N28884",
        "redacteur": null,
        "classification": {
          "famille": null,
          "type": {
            "code": "AVIS",
            "libelle": "Avis"
          },
          "sousType": null,
          "statutAdoption": null
        },
        "auteurs": {
          "auteur": [
            {
              "acteur": {
                "acteurRef": "PA605084",
                "qualite": "rapporteur pour avis"
              }
            },
            {
              "organe": {
                "organeRef": "PO419865"
              }
            }
          ]
        },
        "correction": null,
        "notice": {
          "numNotice": "257",
          "formule": "sur le projet de loi de finances  pour 2013 (n°235)",
          "adoptionConforme": "false"
        },
        "indexation": null,
        "imprimerie": {
          "prix": "3.0"
        },
        "coSignataires": null,
        "depotAmendements": null
      },
      {
        "@xsi:type": "texteLoi_Type",
        "uid": "AVISANR5L14B0257-tII",
        "legislature": "14",
        "cycleDeVie": {
          "chrono": {
            "dateCreation": "2012-10-09T00:00:00.000+02:00",
            "dateDepot": "2012-10-10T00:00:00.000+02:00",
            "datePublication": "2012-11-05T00:00:00.000+01:00",
            "datePublicationWeb": "2012-10-30T11:30:00.000+01:00"
          }
        },
        "denominationStructurelle": "Tome II",
        "titres": {
          "titrePrincipal": "Ecologie, développement et aménagement durables : Politiques de développement durable",
          "titrePrincipalCourt": "Ecologie, développement et aménagement durables : Politiques de développement durable"
        },
        "divisions": null,
        "dossierRef": "DLR5L14N28884",
        "redacteur": null,
        "classification": {
          "famille": null,
          "type": {
            "code": "AVIS",
            "libelle": "Avis"
          },
          "sousType": null,
          "statutAdoption": null
        },
        "auteurs": {
          "auteur": [
            {
              "acteur": {
                "acteurRef": "PA267204",
                "qualite": "rapporteur pour avis"
              }
            },
            {
              "organe": {
                "organeRef": "PO419865"
              }
            }
          ]
        },
        "correction": null,
        "notice": {
          "numNotice": "257",
          "formule": "sur le projet de loi de finances  pour 2013 (n°235)",
          "adoptionConforme": "false"
        },
        "indexation": null,
        "imprimerie": {
          "prix": "3.0"
        },
        "coSignataires": null,
        "depotAmendements": null
      },
      {
        "@xsi:type": "texteLoi_Type",
        "uid": "AVISANR5L14B0257-tIII",
        "legislature": "14",
        "cycleDeVie": {
          "chrono": {
            "dateCreation": "2012-10-09T00:00:00.000+02:00",
            "dateDepot": "2012-10-10T00:00:00.000+02:00",
            "datePublication": "2012-11-05T00:00:00.000+01:00",
            "datePublicationWeb": "2012-10-31T16:30:00.000+01:00"
          }
        },
        "denominationStructurelle": "Tome III",
        "titres": {
          "titrePrincipal": "Ecologie, développement et aménagement durables : Paysage, eau et biodiversité",
          "titrePrincipalCourt": "Ecologie, développement et aménagement durables : Paysage, eau et biodiversité"
        },
        "divisions": null,
        "dossierRef": "DLR5L14N28884",
        "redacteur": null,
        "classification": {
          "famille": null,
          "type": {
            "code": "AVIS",
            "libelle": "Avis"
          },
          "sousType": null,
          "statutAdoption": null
        },
        "auteurs": {
          "auteur": [
            {
              "acteur": {
                "acteurRef": "PA2374",
                "qualite": "rapporteur pour avis"
              }
            },
            {
              "organe": {
                "organeRef": "PO419865"
              }
            }
          ]
        },
        "correction": null,
        "notice": {
          "numNotice": "257",
          "formule": "sur le projet de loi de finances  pour 2013 (n°235)",
          "adoptionConforme": "false"
        },
        "indexation": null,
        "imprimerie": {
          "prix": "3.0"
        },
        "coSignataires": null,
        "depotAmendements": null
      },
      {
        "@xsi:type": "texteLoi_Type",
        "uid": "AVISANR5L14B0257-tIV",
        "legislature": "14",
        "cycleDeVie": {
          "chrono": {
            "dateCreation": "2012-10-09T00:00:00.000+02:00",
            "dateDepot": "2012-10-10T00:00:00.000+02:00",
            "datePublication": "2012-11-08T00:00:00.000+01:00",
            "datePublicationWeb": "2012-11-05T16:30:00.000+01:00"
          }
        },
        "denominationStructurelle": "Tome IV",
        "titres": {
          "titrePrincipal": "Ecologie, développement et aménagement durables : Transition écologique",
          "titrePrincipalCourt": "Ecologie, développement et aménagement durables : Transition écologique"
        },
        "divisions": null,
        "dossierRef": "DLR5L14N28884",
        "redacteur": null,
        "classification": {
          "famille": null,
          "type": {
            "code": "AVIS",
            "libelle": "Avis"
          },
          "sousType": null,
          "statutAdoption": null
        },
        "auteurs": {
          "auteur": [
            {
              "acteur": {
                "acteurRef": "PA609016",
                "qualite": "rapporteur pour avis"
              }
            },
            {
              "organe": {
                "organeRef": "PO419865"
              }
            }
          ]
        },
        "correction": null,
        "notice": {
          "numNotice": "257",
          "formule": "sur le projet de loi de finances  pour 2013 (n°235)",
          "adoptionConforme": "false"
        },
        "indexation": null,
        "imprimerie": {
          "prix": "3.0"
        },
        "coSignataires": null,
        "depotAmendements": null
      },
      {
        "@xsi:type": "texteLoi_Type",
        "uid": "AVISANR5L14B0257-tV",
        "legislature": "14",
        "cycleDeVie": {
          "chrono": {
            "dateCreation": "2012-10-09T00:00:00.000+02:00",
            "dateDepot": "2012-10-10T00:00:00.000+02:00",
            "datePublication": "2012-11-08T00:00:00.000+01:00",
            "datePublicationWeb": "2012-10-31T18:00:00.000+01:00"
          }
        },
        "denominationStructurelle": "Tome V",
        "titres": {
          "titrePrincipal": "Ecologie, développement et aménagement durables : Transports : Transports terrestres et fluviaux",
          "titrePrincipalCourt": "Ecologie, développement et aménagement durables : Transports : Transports terrestres et fluviaux"
        },
        "divisions": null,
        "dossierRef": "DLR5L14N28884",
        "redacteur": null,
        "classification": {
          "famille": null,
          "type": {
            "code": "AVIS",
            "libelle": "Avis"
          },
          "sousType": null,
          "statutAdoption": null
        },
        "auteurs": {
          "auteur": [
            {
              "acteur": {
                "acteurRef": "PA607769",
                "qualite": "rapporteur pour avis"
              }
            },
            {
              "organe": {
                "organeRef": "PO419865"
              }
            }
          ]
        },
        "correction": null,
        "notice": {
          "numNotice": "257",
          "formule": "sur le projet de loi de finances  pour 2013 (n°235)",
          "adoptionConforme": "false"
        },
        "indexation": null,
        "imprimerie": {
          "prix": "3.0"
        },
        "coSignataires": null,
        "depotAmendements": null
      },
      {
        "@xsi:type": "texteLoi_Type",
        "uid": "AVISANR5L14B0257-tVI",
        "legislature": "14",
        "cycleDeVie": {
          "chrono": {
            "dateCreation": "2012-10-09T00:00:00.000+02:00",
            "dateDepot": "2012-10-10T00:00:00.000+02:00",
            "datePublication": "2012-11-08T00:00:00.000+01:00",
            "datePublicationWeb": "2012-10-29T16:00:00.000+01:00"
          }
        },
        "denominationStructurelle": "Tome VI",
        "titres": {
          "titrePrincipal": "Ecologie, développement et aménagement durables : Transports : Transports aériens",
          "titrePrincipalCourt": "Ecologie, développement et aménagement durables : Transports : Transports aériens"
        },
        "divisions": null,
        "dossierRef": "DLR5L14N28884",
        "redacteur": null,
        "classification": {
          "famille": null,
          "type": {
            "code": "AVIS",
            "libelle": "Avis"
          },
          "sousType": null,
          "statutAdoption": null
        },
        "auteurs": {
          "auteur": [
            {
              "acteur": {
                "acteurRef": "PA267822",
                "qualite": "rapporteur pour avis"
              }
            },
            {
              "organe": {
                "organeRef": "PO419865"
              }
            }
          ]
        },
        "correction": null,
        "notice": {
          "numNotice": "257",
          "formule": "sur le projet de loi de finances  pour 2013 (n°235)",
          "adoptionConforme": "false"
        },
        "indexation": null,
        "imprimerie": {
          "prix": "3.0"
        },
        "coSignataires": null,
        "depotAmendements": null
      },
      {
        "@xsi:type": "texteLoi_Type",
        "uid": "AVISANR5L14B0257-tVII",
        "legislature": "14",
        "cycleDeVie": {
          "chrono": {
            "dateCreation": "2012-10-09T00:00:00.000+02:00",
            "dateDepot": "2012-10-10T00:00:00.000+02:00",
            "datePublication": "2012-11-08T00:00:00.000+01:00",
            "datePublicationWeb": "2012-11-06T12:30:00.000+01:00"
          }
        },
        "denominationStructurelle": "Tome VII",
        "titres": {
          "titrePrincipal": "Ecologie, développement et aménagement durables : Transports : Affaires maritimes",
          "titrePrincipalCourt": "Ecologie, développement et aménagement durables : Transports : Affaires maritimes"
        },
        "divisions": null,
        "dossierRef": "DLR5L14N28884",
        "redacteur": null,
        "classification": {
          "famille": null,
          "type": {
            "code": "AVIS",
            "libelle": "Avis"
          },
          "sousType": null,
          "statutAdoption": null
        },
        "auteurs": {
          "auteur": [
            {
              "acteur": {
                "acteurRef": "PA610125",
                "qualite": "rapporteur pour avis"
              }
            },
            {
              "organe": {
                "organeRef": "PO419865"
              }
            }
          ]
        },
        "correction": null,
        "notice": {
          "numNotice": "257",
          "formule": "sur le projet de loi de finances  pour 2013 (n°235)",
          "adoptionConforme": "false"
        },
        "indexation": null,
        "imprimerie": {
          "prix": "3.0"
        },
        "coSignataires": null,
        "depotAmendements": null
      },
      {
        "@xsi:type": "texteLoi_Type",
        "uid": "AVISANR5L14B0257-tVIII",
        "legislature": "14",
        "cycleDeVie": {
          "chrono": {
            "dateCreation": "2012-10-09T00:00:00.000+02:00",
            "dateDepot": "2012-10-10T00:00:00.000+02:00",
            "datePublication": "2012-11-05T00:00:00.000+01:00",
            "datePublicationWeb": "2012-10-30T17:00:00.000+01:00"
          }
        },
        "denominationStructurelle": "Tome VIII",
        "titres": {
          "titrePrincipal": "Politique des territoires",
          "titrePrincipalCourt": "Politique des territoires"
        },
        "divisions": null,
        "dossierRef": "DLR5L14N28884",
        "redacteur": null,
        "classification": {
          "famille": null,
          "type": {
            "code": "AVIS",
            "libelle": "Avis"
          },
          "sousType": null,
          "statutAdoption": null
        },
        "auteurs": {
          "auteur": [
            {
              "acteur": {
                "acteurRef": "PA605643",
                "qualite": "rapporteur pour avis"
              }
            },
            {
              "organe": {
                "organeRef": "PO419865"
              }
            }
          ]
        },
        "correction": null,
        "notice": {
          "numNotice": "257",
          "formule": "sur le projet de loi de finances  pour 2013 (n°235)",
          "adoptionConforme": "false"
        },
        "indexation": null,
        "imprimerie": {
          "prix": "1.5"
        },
        "coSignataires": null,
        "depotAmendements": null
      },
      {
        "@xsi:type": "texteLoi_Type",
        "uid": "AVISANR5L14B0257-tIX",
        "legislature": "14",
        "cycleDeVie": {
          "chrono": {
            "dateCreation": "2012-10-09T00:00:00.000+02:00",
            "dateDepot": "2012-10-10T00:00:00.000+02:00",
            "datePublication": "2012-11-08T00:00:00.000+01:00",
            "datePublicationWeb": "2012-10-26T16:00:00.000+02:00"
          }
        },
        "denominationStructurelle": "Tome IX",
        "titres": {
          "titrePrincipal": "Recherche et enseignement supérieur : Recherche dans les domaines du développement durable",
          "titrePrincipalCourt": "Recherche et enseignement supérieur : Recherche dans les domaines du développement durable"
        },
        "divisions": null,
        "dossierRef": "DLR5L14N28884",
        "redacteur": null,
        "classification": {
          "famille": null,
          "type": {
            "code": "AVIS",
            "libelle": "Avis"
          },
          "sousType": null,
          "statutAdoption": null
        },
        "auteurs": {
          "auteur": [
            {
              "acteur": {
                "acteurRef": "PA2430",
                "qualite": "rapporteur pour avis"
              }
            },
            {
              "organe": {
                "organeRef": "PO419865"
              }
            }
          ]
        },
        "correction": null,
        "notice": {
          "numNotice": "257",
          "formule": "sur le projet de loi de finances  pour 2013 (n°235)",
          "adoptionConforme": "false"
        },
        "indexation": null,
        "imprimerie": {
          "prix": "1.5"
        },
        "coSignataires": null,
        "depotAmendements": null
      },
      {
        "@xsi:type": "texteLoi_Type",
        "uid": "AVISANR5L14B0257-tX",
        "legislature": "14",
        "cycleDeVie": {
          "chrono": {
            "dateCreation": "2012-10-09T00:00:00.000+02:00",
            "dateDepot": "2012-10-10T00:00:00.000+02:00",
            "datePublication": "2012-11-08T00:00:00.000+01:00",
            "datePublicationWeb": "2012-10-31T17:30:00.000+01:00"
          }
        },
        "denominationStructurelle": "Tome X",
        "titres": {
          "titrePrincipal": "Recherche et enseignement supérieur : Recherche dans les domaines de la gestion des milieux et des ressources",
          "titrePrincipalCourt": "Recherche et enseignement supérieur : Recherche dans les domaines de la gestion des milieux et des ressources"
        },
        "divisions": null,
        "dossierRef": "DLR5L14N28884",
        "redacteur": null,
        "classification": {
          "famille": null,
          "type": {
            "code": "AVIS",
            "libelle": "Avis"
          },
          "sousType": null,
          "statutAdoption": null
        },
        "auteurs": {
          "auteur": [
            {
              "acteur": {
                "acteurRef": "PA267680",
                "qualite": "rapporteur pour avis"
              }
            },
            {
              "organe": {
                "organeRef": "PO419865"
              }
            }
          ]
        },
        "correction": null,
        "notice": {
          "numNotice": "257",
          "formule": "sur le projet de loi de finances  pour 2013 (n°235)",
          "adoptionConforme": "false"
        },
        "indexation": null,
        "imprimerie": {
          "prix": "1.5"
        },
        "coSignataires": null,
        "depotAmendements": null
      }
    ]
  },
  "dossierRef": "DLR5L14N28884",
  "redacteur": null,
  "classification": {
    "famille": {
      "depot": {
        "code": "RAPINIT",
        "libelle": "Rapport sur une initiative"
      },
      "classe": {
        "code": "AVIS",
        "libelle": "Avis"
      }
    },
    "type": {
      "code": "AVIS",
      "libelle": "Avis"
    },
    "sousType": null,
    "statutAdoption": null
  },
  "auteurs": {
    "auteur": {
      "organe": {
        "organeRef": "PO644420"
      }
    }
  },
  "correction": null,
  "notice": {
    "numNotice": "257",
    "formule": "sur le projet de loi de finances  pour 2013 (n°235)",
    "adoptionConforme": "false"
  },
  "indexation": null,
  "imprimerie": null,
  "coSignataires": null,
  "depotAmendements": null
}