{
  "@xsi:type": "DossierResolutionAN",
  "uid": "DLR5L14N33330",
  "legislature": "14",
  "titreDossier": {
    "titre": "Abrogation des circulaires encourageant la poursuite des militants de la campagne de boycott",
    "titreChemin": "abrogation_circulaires_poursuite_militants_boycott",
    "senatChemin": null
  },
  "procedureParlementaire": {
    "code": "22",
    "libelle": "Résolution Article 34-1"
  },
  "initiateur": {
    "acteurs": {
      "acteur": {
        "acteurRef": "PA267492",
        "mandatRef": "PM645465"
      }
    }
  },
  "actesLegislatifs": {
    "acteLegislatif": {
      "@xsi:type": "Etape_Type",
      "uid": "L14-ANLUNI-33330",
      "codeActe": "ANLUNI",
      "libelleActe": {
        "nomCanonique": "Lecture unique"
      },
      "organeRef": "PO644420",
      "dateActe": null,
      "actesLegislatifs": {
        "acteLegislatif": {
          "@xsi:type": "DepotInitiative_Type",
          "uid": "L14-VD170890DI",
          "codeActe": "ANLUNI-DEPOT",
          "libelleActe": {
            "nomCanonique": "1er dépôt d'une initiative.",
            "libelleCourt": "1er dépôt d'une initiative."
          },
          "organeRef": "PO644420",
          "dateActe": "2014-07-17T00:00:00.000+02:00",
          "actesLegislatifs": null,
          "texteAssocie": "PNREANR5L14B2157"
        }
      }
    }
  },
  "fusionDossier": null
}