{
  "@xsi:type": "texteLoi_Type",
  "uid": "PIONANR5L14B1684",
  "legislature": "14",
  "cycleDeVie": {
    "chrono": {
      "dateCreation": "2014-01-06T00:00:00.000+01:00",
      "dateDepot": "2014-01-08T00:00:00.000+01:00",
      "datePublication": null,
      "datePublicationWeb": "2014-01-09T14:30:00.000+01:00"
    }
  },
  "denominationStructurelle": "Proposition de loi",
  "provenance": "Texte Déposé",
  "titres": {
    "titrePrincipal": "proposition de loi visant à mettre en place un dispositif de réduction d'activité des moniteurs de ski ayant atteint l'âge de liquidation de leur pension de retraite et souhaitant prolonger leur activité au bénéfice des nouveaux moniteurs",
    "titrePrincipalCourt": "dispositif de réduction d'activité des moniteurs de ski"
  },
  "divisions": null,
  "dossierRef": "DLR5L14N32180",
  "redacteur": null,
  "classification": {
    "famille": {
      "depot": {
        "code": "INITDEP",
        "libelle": "Initiative en 1er Dépôt"
      },
      "classe": {
        "code": "PIONLOI",
        "libelle": "Proposition de loi"
      }
    },
    "type": {
      "code": "PION",
      "libelle": "Proposition de loi"
    },
    "sousType": null,
    "statutAdoption": null
  },
  "auteurs": {
    "auteur": {
      "acteur": {
        "acteurRef": "PA267285",
        "qualite": "auteur"
      }
    }
  },
  "correction": null,
  "notice": {
    "numNotice": "1684",
    "formule": "visant à mettre en place un dispositif de réduction d'activité des moniteurs de ski ayant atteint l'âge de liquidation de leur pension de retraite et souhaitant prolonger leur activité au bénéfice des nouveaux moniteurs",
    "adoptionConforme": "false"
  },
  "indexation": null,
  "imprimerie": null,
  "coSignataires": {
    "coSignataire": [
      {
        "acteur": {
          "acteurRef": "PA267527"
        },
        "dateCosignature": "2014-01-08+01:00",
        "dateRetraitCosignature": null,
        "edite": "true"
      },
      {
        "acteur": {
          "acteurRef": "PA605991"
        },
        "dateCosignature": "2014-01-08+01:00",
        "dateRetraitCosignature": null,
        "edite": "true"
      },
      {
        "acteur": {
          "acteurRef": "PA608851"
        },
        "dateCosignature": "2014-01-08+01:00",
        "dateRetraitCosignature": null,
        "edite": "true"
      },
      {
        "acteur": {
          "acteurRef": "PA2876"
        },
        "dateCosignature": "2014-01-08+01:00",
        "dateRetraitCosignature": null,
        "edite": "true"
      }
    ]
  },
  "depotAmendements": {
    "amendementsSeance": {
      "amendable": "false",
      "dateLimiteDepot": null
    },
    "amendementsCommission": {
      "commission": {
        "organeRef": "PO420120",
        "amendable": "true",
        "dateLimiteDepot": null
      }
    }
  }
}