{
  "@xsi:type": "rapportParlementaire_Type",
  "uid": "RAPPSNR5S219B0284",
  "legislature": null,
  "cycleDeVie": {
    "chrono": {
      "dateCreation": "2014-01-17T00:00:00.000+01:00",
      "dateDepot": "2014-01-15T00:00:00.000+01:00",
      "datePublication": null,
      "datePublicationWeb": null
    }
  },
  "denominationStructurelle": "Rapport",
  "provenance": "Commission",
  "titres": {
    "titrePrincipal": "rapport sur le projet de loi , après engagement de la procédure accélérée, relatif à la géolocalisation  (n°257)",
    "titrePrincipalCourt": "rapport sur le projet de loi , après engagement de la procédure accélérée, relatif à la géolocalisation  (n°257)"
  },
  "divisions": null,
  "dossierRef": "DLR5L14N32202",
  "redacteur": null,
  "classification": {
    "famille": {
      "depot": {
        "code": "RAPINIT",
        "libelle": "Rapport sur une initiative"
      },
      "classe": {
        "code": "RAPPORT",
        "libelle": "Rapport"
      }
    },
    "type": {
      "code": "RAPP",
      "libelle": "Rapport"
    },
    "sousType": null,
    "statutAdoption": null
  },
  "auteurs": {
    "auteur": [
      {
        "acteur": {
          "acteurRef": "PA2774",
          "qualite": "rapporteur"
        }
      },
      {
        "organe": {
          "organeRef": "PO211495"
        }
      }
    ]
  },
  "correction": null,
  "notice": {
    "numNotice": "284",
    "formule": "sur le projet de loi , après engagement de la procédure accélérée, relatif à la géolocalisation  (n°257)",
    "adoptionConforme": "false"
  },
  "indexation": null,
  "imprimerie": null
}