{
  "@xsi:type": "DossierMissionInformation_Type",
  "uid": "DLR5L14N33933",
  "legislature": "14",
  "titreDossier": {
    "titre": "Liens entre le lycée et l'enseignement supérieur",
    "titreChemin": "liens_lycee_enseignement_superieur",
    "senatChemin": null
  },
  "procedureParlementaire": {
    "code": "10",
    "libelle": "Mission d'information"
  },
  "initiateur": {
    "organes": {
      "organe": {
        "organeRef": {
          "uid": "PO707403"
        }
      }
    }
  },
  "actesLegislatifs": {
    "acteLegislatif": {
      "@xsi:type": "Etape_Type",
      "uid": "L14-AN20-33933",
      "codeActe": "AN20",
      "libelleActe": {
        "nomCanonique": "Travaux"
      },
      "organeRef": "PO644420",
      "dateActe": null,
      "actesLegislatifs": {
        "acteLegislatif": {
          "@xsi:type": "Etape_Type",
          "uid": "L14-AN20-MISINF-33933",
          "codeActe": "AN20-MISINF",
          "libelleActe": {
            "nomCanonique": "Mission d'information",
            "libelleCourt": "Mission d'information"
          },
          "organeRef": "PO707403",
          "dateActe": null,
          "actesLegislatifs": {
            "acteLegislatif": {
              "@xsi:type": "CreationOrganeTemporaire_Type",
              "uid": "L14-VD173522",
              "codeActe": "AN20-MISINF-CREA",
              "libelleActe": {
                "nomCanonique": "Création d'une mission d'information",
                "libelleCourt": "Création d'une mission d'information"
              },
              "organeRef": "PO707403",
              "dateActe": "2015-04-29T00:00:00.000+02:00",
              "actesLegislatifs": null,
              "initiateurs": {
                "organeRef": "PO707403"
              }
            }
          }
        }
      }
    }
  },
  "fusionDossier": null
}