{
  "@xsi:type": "DossierMissionControle_Type",
  "uid": "DLR5L14N29327",
  "legislature": "14",
  "titreDossier": {
    "titre": "Brevet unitaire européen",
    "titreChemin": "brevet_unitaire_europeen",
    "senatChemin": null
  },
  "procedureParlementaire": {
    "code": "19",
    "libelle": "Rapport d'information sans mission"
  },
  "initiateur": null,
  "actesLegislatifs": {
    "acteLegislatif": {
      "@xsi:type": "Etape_Type",
      "uid": "L14-AN20-29327",
      "codeActe": "AN20",
      "libelleActe": {
        "nomCanonique": "Travaux"
      },
      "organeRef": "PO644420",
      "dateActe": null,
      "actesLegislatifs": {
        "acteLegislatif": {
          "@xsi:type": "DepotRapport_Type",
          "uid": "L14-VD160223",
          "codeActe": "AN20-RAPPORT",
          "libelleActe": {
            "nomCanonique": "Dépôt de rapport",
            "libelleCourt": "Dépôt de rapport"
          },
          "organeRef": "PO415287",
          "dateActe": "2012-11-13T00:00:00.000+01:00",
          "actesLegislatifs": null,
          "texteAssocie": "RINFANR5L14B0395",
          "texteAdopte": null
        }
      }
    }
  },
  "fusionDossier": null,
  "indexation": {
    "themes": {
      "@niveau": "1",
      "theme": {
        "libelleTheme": "DOM-TOM"
      }
    }
  }
}