{
  "@xsi:type": "texteLoi_Type",
  "uid": "PIONANR5L14B0902",
  "legislature": "14",
  "cycleDeVie": {
    "chrono": {
      "dateCreation": "2013-04-03T00:00:00.000+02:00",
      "dateDepot": "2013-04-03T00:00:00.000+02:00",
      "datePublication": null,
      "datePublicationWeb": "2013-04-17T18:00:00.000+02:00"
    }
  },
  "denominationStructurelle": "Proposition de loi",
  "provenance": "Texte Déposé",
  "titres": {
    "titrePrincipal": "proposition de loi constitutionnelle visant à rendre systématique l'inéligibilité pour les personnes ayant fait l'objet, depuis moins de dix ans, d'une condamnation définitive pour l'un des crimes ou des délits dont la liste est fixée par la loi",
    "titrePrincipalCourt": "rendre systématique l'inéligibilité pour les personnes ayant fait l'objet, depuis moins de dix ans, d'une condamnation définitive pour l'un des crimes ou des délits dont la liste est fixée par la loi"
  },
  "divisions": null,
  "dossierRef": "DLR5L14N30004",
  "redacteur": null,
  "classification": {
    "famille": {
      "depot": {
        "code": "INITDEP",
        "libelle": "Initiative en 1er Dépôt"
      },
      "classe": {
        "code": "PIONLOI",
        "libelle": "Proposition de loi"
      },
      "espece": {
        "code": "CONST",
        "libelle": "constitutionnelle"
      }
    },
    "type": {
      "code": "PION",
      "libelle": "Proposition de loi"
    },
    "sousType": {
      "code": "CONST",
      "libelle": "constitutionnelle",
      "libelleEdition": "constitutionnelle"
    },
    "statutAdoption": null
  },
  "auteurs": {
    "auteur": {
      "acteur": {
        "acteurRef": "PA344492",
        "qualite": "auteur"
      }
    }
  },
  "correction": null,
  "notice": {
    "numNotice": "902",
    "formule": "visant à rendre systématique l'inéligibilité pour les personnes ayant fait l'objet, depuis moins de dix ans, d'une condamnation définitive pour l'un des crimes ou des délits dont la liste est fixée par la loi",
    "adoptionConforme": "false"
  },
  "indexation": null,
  "imprimerie": null,
  "coSignataires": {
    "coSignataire": [
      {
        "acteur": {
          "acteurRef": "PA267457"
        },
        "dateCosignature": "2013-04-03+02:00",
        "dateRetraitCosignature": null,
        "edite": "true"
      },
      {
        "acteur": {
          "acteurRef": "PA609726"
        },
        "dateCosignature": "2013-04-03+02:00",
        "dateRetraitCosignature": null,
        "edite": "true"
      },
      {
        "acteur": {
          "acteurRef": "PA267822"
        },
        "dateCosignature": "2013-04-03+02:00",
        "dateRetraitCosignature": null,
        "edite": "false"
      },
      {
        "acteur": {
          "acteurRef": "PA687214"
        },
        "dateCosignature": "2013-04-03+02:00",
        "dateRetraitCosignature": null,
        "edite": "false"
      },
      {
        "acteur": {
          "acteurRef": "PA330008"
        },
        "dateCosignature": "2013-04-03+02:00",
        "dateRetraitCosignature": null,
        "edite": "false"
      },
      {
        "acteur": {
          "acteurRef": "PA223837"
        },
        "dateCosignature": "2013-04-03+02:00",
        "dateRetraitCosignature": null,
        "edite": "false"
      },
      {
        "acteur": {
          "acteurRef": "PA267358"
        },
        "dateCosignature": "2013-04-03+02:00",
        "dateRetraitCosignature": null,
        "edite": "false"
      },
      {
        "acteur": {
          "acteurRef": "PA267762"
        },
        "dateCosignature": "2013-04-03+02:00",
        "dateRetraitCosignature": null,
        "edite": "false"
      },
      {
        "acteur": {
          "acteurRef": "PA267450"
        },
        "dateCosignature": "2013-04-03+02:00",
        "dateRetraitCosignature": null,
        "edite": "false"
      },
      {
        "acteur": {
          "acteurRef": "PA1152"
        },
        "dateCosignature": "2013-04-03+02:00",
        "dateRetraitCosignature": null,
        "edite": "false"
      },
      {
        "acteur": {
          "acteurRef": "PA608826"
        },
        "dateCosignature": "2013-04-03+02:00",
        "dateRetraitCosignature": null,
        "edite": "false"
      },
      {
        "acteur": {
          "acteurRef": "PA1459"
        },
        "dateCosignature": "2013-04-03+02:00",
        "dateRetraitCosignature": null,
        "edite": "false"
      },
      {
        "acteur": {
          "acteurRef": "PA1630"
        },
        "dateCosignature": "2013-04-03+02:00",
        "dateRetraitCosignature": null,
        "edite": "false"
      },
      {
        "acteur": {
          "acteurRef": "PA1770"
        },
        "dateCosignature": "2013-04-03+02:00",
        "dateRetraitCosignature": null,
        "edite": "false"
      },
      {
        "acteur": {
          "acteurRef": "PA1778"
        },
        "dateCosignature": "2013-04-03+02:00",
        "dateRetraitCosignature": null,
        "edite": "false"
      },
      {
        "acteur": {
          "acteurRef": "PA1857"
        },
        "dateCosignature": "2013-04-03+02:00",
        "dateRetraitCosignature": null,
        "edite": "false"
      },
      {
        "acteur": {
          "acteurRef": "PA606693"
        },
        "dateCosignature": "2013-04-03+02:00",
        "dateRetraitCosignature": null,
        "edite": "false"
      },
      {
        "acteur": {
          "acteurRef": "PA267317"
        },
        "dateCosignature": "2013-04-03+02:00",
        "dateRetraitCosignature": null,
        "edite": "false"
      },
      {
        "acteur": {
          "acteurRef": "PA267378"
        },
        "dateCosignature": "2013-04-03+02:00",
        "dateRetraitCosignature": null,
        "edite": "false"
      },
      {
        "acteur": {
          "acteurRef": "PA608016"
        },
        "dateCosignature": "2013-04-03+02:00",
        "dateRetraitCosignature": null,
        "edite": "false"
      },
      {
        "acteur": {
          "acteurRef": "PA2011"
        },
        "dateCosignature": "2013-04-03+02:00",
        "dateRetraitCosignature": null,
        "edite": "false"
      },
      {
        "acteur": {
          "acteurRef": "PA2084"
        },
        "dateCosignature": "2013-04-03+02:00",
        "dateRetraitCosignature": null,
        "edite": "false"
      },
      {
        "acteur": {
          "acteurRef": "PA267278"
        },
        "dateCosignature": "2013-04-03+02:00",
        "dateRetraitCosignature": null,
        "edite": "false"
      },
      {
        "acteur": {
          "acteurRef": "PA2099"
        },
        "dateCosignature": "2013-04-03+02:00",
        "dateRetraitCosignature": null,
        "edite": "false"
      },
      {
        "acteur": {
          "acteurRef": "PA2124"
        },
        "dateCosignature": "2013-04-03+02:00",
        "dateRetraitCosignature": null,
        "edite": "false"
      },
      {
        "acteur": {
          "acteurRef": "PA266788"
        },
        "dateCosignature": "2013-04-03+02:00",
        "dateRetraitCosignature": null,
        "edite": "false"
      },
      {
        "acteur": {
          "acteurRef": "PA606299"
        },
        "dateCosignature": "2013-04-03+02:00",
        "dateRetraitCosignature": null,
        "edite": "false"
      },
      {
        "acteur": {
          "acteurRef": "PA2250"
        },
        "dateCosignature": "2013-04-03+02:00",
        "dateRetraitCosignature": null,
        "edite": "false"
      },
      {
        "acteur": {
          "acteurRef": "PA2345"
        },
        "dateCosignature": "2013-04-03+02:00",
        "dateRetraitCosignature": null,
        "edite": "false"
      },
      {
        "acteur": {
          "acteurRef": "PA2377"
        },
        "dateCosignature": "2013-04-03+02:00",
        "dateRetraitCosignature": null,
        "edite": "false"
      },
      {
        "acteur": {
          "acteurRef": "PA267598"
        },
        "dateCosignature": "2013-04-03+02:00",
        "dateRetraitCosignature": null,
        "edite": "false"
      },
      {
        "acteur": {
          "acteurRef": "PA2700"
        },
        "dateCosignature": "2013-04-03+02:00",
        "dateRetraitCosignature": null,
        "edite": "false"
      },
      {
        "acteur": {
          "acteurRef": "PA2796"
        },
        "dateCosignature": "2013-04-03+02:00",
        "dateRetraitCosignature": null,
        "edite": "false"
      },
      {
        "acteur": {
          "acteurRef": "PA2876"
        },
        "dateCosignature": "2013-04-03+02:00",
        "dateRetraitCosignature": null,
        "edite": "false"
      },
      {
        "acteur": {
          "acteurRef": "PA607090"
        },
        "dateCosignature": "2013-04-03+02:00",
        "dateRetraitCosignature": null,
        "edite": "false"
      },
      {
        "acteur": {
          "acteurRef": "PA2936"
        },
        "dateCosignature": "2013-04-03+02:00",
        "dateRetraitCosignature": null,
        "edite": "false"
      },
      {
        "acteur": {
          "acteurRef": "PA267506"
        },
        "dateCosignature": "2013-07-09+02:00",
        "dateRetraitCosignature": null,
        "edite": "false"
      }
    ]
  },
  "depotAmendements": {
    "amendementsSeance": {
      "amendable": "false",
      "dateLimiteDepot": null
    },
    "amendementsCommission": {
      "commission": {
        "organeRef": "PO59051",
        "amendable": "true",
        "dateLimiteDepot": null
      }
    }
  }
}