{
  "@xsi:type": "DossierResolutionAN",
  "uid": "DLR5L14N33491",
  "legislature": "14",
  "titreDossier": {
    "titre": "Second paquet énergie-climat",
    "titreChemin": "second_paquet_energie-climat",
    "senatChemin": null
  },
  "procedureParlementaire": {
    "code": "8",
    "libelle": "Résolution"
  },
  "initiateur": {
    "acteurs": {
      "acteur": {
        "acteurRef": "PA610905",
        "mandatRef": "PM645225"
      }
    }
  },
  "actesLegislatifs": {
    "acteLegislatif": {
      "@xsi:type": "Etape_Type",
      "uid": "L14-ANLUNI-33491",
      "codeActe": "ANLUNI",
      "libelleActe": {
        "nomCanonique": "Lecture unique"
      },
      "organeRef": "PO644420",
      "dateActe": null,
      "actesLegislatifs": {
        "acteLegislatif": [
          {
            "@xsi:type": "DepotInitiative_Type",
            "uid": "L14-VD171524DI",
            "codeActe": "ANLUNI-DEPOT",
            "libelleActe": {
              "nomCanonique": "1er dépôt d'une initiative.",
              "libelleCourt": "1er dépôt d'une initiative."
            },
            "organeRef": "PO644420",
            "dateActe": "2014-10-14T00:00:00.000+02:00",
            "actesLegislatifs": null,
            "texteAssocie": "PNREANR5L14B2295"
          },
          {
            "@xsi:type": "Etape_Type",
            "uid": "L14-ANLUNI-COM-33491",
            "codeActe": "ANLUNI-COM",
            "libelleActe": {
              "nomCanonique": "Travaux des commissions",
              "libelleCourt": "Travaux des commissions"
            },
            "organeRef": "PO644420",
            "dateActe": null,
            "actesLegislatifs": {
              "acteLegislatif": {
                "@xsi:type": "Etape_Type",
                "uid": "L14-VD171525CF",
                "codeActe": "ANLUNI-COM-FOND",
                "libelleActe": {
                  "nomCanonique": "Travaux de la commission saisie au fond",
                  "libelleCourt": "Travaux de la commission saisie au fond"
                },
                "organeRef": "PO419865",
                "dateActe": null,
                "actesLegislatifs": {
                  "acteLegislatif": [
                    {
                      "@xsi:type": "SaisieComFond_Type",
                      "uid": "L14-VD171525CFS",
                      "codeActe": "ANLUNI-COM-FOND-SAISIE",
                      "libelleActe": {
                        "nomCanonique": "Renvoi en commission au fond",
                        "libelleCourt": "Renvoi en commission au fond"
                      },
                      "organeRef": "PO419865",
                      "dateActe": "2014-10-14T00:00:00.000+02:00",
                      "actesLegislatifs": null
                    },
                    {
                      "@xsi:type": "NominRapporteurs_Type",
                      "uid": "L14-VD171535",
                      "codeActe": "ANLUNI-COM-FOND-NOMIN",
                      "libelleActe": {
                        "nomCanonique": "Nomination de rapporteur",
                        "libelleCourt": "Nomination de rapporteur"
                      },
                      "organeRef": "PO419865",
                      "dateActe": "2014-10-15T00:00:00.000+02:00",
                      "actesLegislatifs": null,
                      "rapporteurs": {
                        "rapporteur": {
                          "acteurRef": "PA610905",
                          "typeRapporteur": "rapporteur"
                        }
                      },
                      "reunion": null
                    },
                    {
                      "@xsi:type": "DiscussionCommission_Type",
                      "uid": "L14-VD171552R21611",
                      "codeActe": "ANLUNI-COM-FOND-REUNION",
                      "libelleActe": {
                        "nomCanonique": "Réunion de commission",
                        "libelleCourt": "Réunion de commission"
                      },
                      "organeRef": "PO419865",
                      "dateActe": "2014-10-22T09:30:00.000+02:00",
                      "actesLegislatifs": null,
                      "reunionRef": "RUANR5L14S2015IDC422231",
                      "odjRef": "RUANR5L14S2015IDC422231PT21611"
                    },
                    {
                      "@xsi:type": "DepotRapport_Type",
                      "uid": "L14-VD171625",
                      "codeActe": "ANLUNI-COM-FOND-RAPPORT",
                      "libelleActe": {
                        "nomCanonique": "Dépôt de rapport",
                        "libelleCourt": "Dépôt de rapport"
                      },
                      "organeRef": "PO419865",
                      "dateActe": "2014-10-22T00:00:00.000+02:00",
                      "actesLegislatifs": null,
                      "texteAssocie": "RAPPANR5L14B2309",
                      "texteAdopte": "PNREANR5L14BTC2309"
                    }
                  ]
                }
              }
            }
          },
          {
            "@xsi:type": "Etape_Type",
            "uid": "L14-ANLUNI-DEBATS-33491",
            "codeActe": "ANLUNI-DEBATS",
            "libelleActe": {
              "nomCanonique": "Discussion en séance publique",
              "libelleCourt": "Discussion en séance publique"
            },
            "organeRef": "PO644420",
            "dateActe": null,
            "actesLegislatifs": {
              "acteLegislatif": {
                "@xsi:type": "Decision_Type",
                "uid": "L14-VD171837DEC",
                "codeActe": "ANLUNI-DEBATS-DEC",
                "libelleActe": {
                  "nomCanonique": "Décision",
                  "libelleCourt": "Décision"
                },
                "organeRef": "PO644420",
                "dateActe": "2014-11-07T00:00:00.000+01:00",
                "actesLegislatifs": null,
                "statutConclusion": {
                  "fam_code": "TSORTF19",
                  "libelle": "considérée comme définitive en application de l'article 151-7 du Règlement"
                },
                "reunionRef": null,
                "voteRefs": null,
                "textesAssocies": {
                  "texteAssocie": {
                    "typeTexte": "BTA",
                    "refTexteAssocie": "RIONANR5L14BTA0418"
                  }
                }
              }
            }
          }
        ]
      }
    }
  },
  "fusionDossier": null
}