{
  "@xsi:type": "rapportParlementaire_Type",
  "uid": "RAPPANR5L14B0758",
  "legislature": "14",
  "cycleDeVie": {
    "chrono": {
      "dateCreation": "2013-02-27T00:00:00.000+01:00",
      "dateDepot": "2013-02-27T00:00:00.000+01:00",
      "datePublication": "2013-03-04T00:00:00.000+01:00",
      "datePublicationWeb": "2013-02-28T21:15:00.000+01:00"
    }
  },
  "denominationStructurelle": "Rapport",
  "provenance": "Commission",
  "titres": {
    "titrePrincipal": "rapport sur la proposition de résolution européenne de M. Christophe Caresche, rapporteur de la commission des affaires européennes sur les orientations européennes de politique économique (n°743)",
    "titrePrincipalCourt": "rapport sur la proposition de résolution européenne de M. Christophe Caresche, rapporteur de la commission des affaires européennes sur les orientations européennes de politique économique (n°743)"
  },
  "divisions": null,
  "dossierRef": "DLR5L14N29843",
  "redacteur": null,
  "classification": {
    "famille": {
      "depot": {
        "code": "RAPINIT",
        "libelle": "Rapport sur une initiative"
      },
      "classe": {
        "code": "RAPPORT",
        "libelle": "Rapport"
      }
    },
    "type": {
      "code": "RAPP",
      "libelle": "Rapport"
    },
    "sousType": null,
    "statutAdoption": "ADOPTCOM"
  },
  "auteurs": {
    "auteur": [
      {
        "acteur": {
          "acteurRef": "PA735",
          "qualite": "rapporteur"
        }
      },
      {
        "organe": {
          "organeRef": "PO59048"
        }
      }
    ]
  },
  "correction": null,
  "notice": {
    "numNotice": "758",
    "formule": "sur la proposition de résolution européenne de M. Christophe Caresche, rapporteur de la commission des affaires européennes sur les orientations européennes de politique économique (n°743)",
    "adoptionConforme": "false"
  },
  "indexation": null,
  "imprimerie": {
    "prix": "0.75"
  }
}