{
  "@xsi:type": "rapportParlementaire_Type",
  "uid": "RAPPSNR5S259B0502",
  "legislature": null,
  "cycleDeVie": {
    "chrono": {
      "dateCreation": "2016-03-25T00:00:00.000+01:00",
      "dateDepot": "2016-03-24T00:00:00.000+01:00",
      "datePublication": "2016-03-31T00:00:00.000+02:00",
      "datePublicationWeb": null
    }
  },
  "denominationStructurelle": "Proposition de loi",
  "provenance": "Texte Déposé",
  "titres": {
    "titrePrincipal": "proposition de loi de modernisation de diverses règles applicables aux élections",
    "titrePrincipalCourt": "règles élection présidentielle"
  },
  "divisions": null,
  "dossierRef": "DLR5L14N34410",
  "redacteur": null,
  "classification": {
    "famille": {
      "depot": {
        "code": "INITNAV",
        "libelle": "Initiative en Navette"
      },
      "classe": {
        "code": "PIONLOI",
        "libelle": "Proposition de loi"
      }
    },
    "type": {
      "code": "PION",
      "libelle": "Proposition de loi"
    },
    "sousType": null,
    "statutAdoption": null
  },
  "auteurs": {
    "auteur": {
      "organe": {
        "organeRef": "PO78718"
      }
    }
  },
  "correction": null,
  "notice": {
    "numNotice": "502",
    "formule": ", adoptée, par l'Assemblée nationale, en nouvelle lecture, de modernisation de diverses règles applicables aux élections",
    "adoptionConforme": "false"
  },
  "indexation": null,
  "imprimerie": null
}