{
  "@xsi:type": "texteLoi_Type",
  "uid": "PRJLSNR5S219B0503",
  "legislature": null,
  "cycleDeVie": {
    "chrono": {
      "dateCreation": "2014-05-06T00:00:00.000+02:00",
      "dateDepot": "2014-05-06T00:00:00.000+02:00",
      "datePublication": null,
      "datePublicationWeb": null
    }
  },
  "denominationStructurelle": "Projet de loi",
  "provenance": "Texte Déposé",
  "titres": {
    "titrePrincipal": "projet de loi portant transposition de la directive 2012/13/UE du Parlement européen et du Conseil, du 22 mai 2012, relative au droit à l'information dans le cadre des procédures pénales",
    "titrePrincipalCourt": "Droit à l'information dans le cadre des procédures pénales"
  },
  "divisions": null,
  "dossierRef": "DLR5L14N32497",
  "redacteur": null,
  "classification": {
    "famille": {
      "depot": {
        "code": "INITNAV",
        "libelle": "Initiative en Navette"
      },
      "classe": {
        "code": "PRJLOI",
        "libelle": "Projet de loi"
      }
    },
    "type": {
      "code": "PRJL",
      "libelle": "Projet de loi"
    },
    "sousType": null,
    "statutAdoption": null
  },
  "auteurs": {
    "auteur": {
      "organe": {
        "organeRef": "PO78718"
      }
    }
  },
  "correction": null,
  "notice": {
    "numNotice": "503",
    "formule": ", modifié, par l'Assemblée nationale, portant transposition de la directive 2012/13/UE du Parlement européen et du Conseil, du 22 mai 2012, relative au droit à l'information dans le cadre des procédures pénales",
    "adoptionConforme": "false"
  },
  "indexation": null,
  "imprimerie": null,
  "coSignataires": null,
  "depotAmendements": {
    "amendementsSeance": {
      "amendable": "false",
      "dateLimiteDepot": null
    }
  }
}