{
  "@xsi:type": "texteLoi_Type",
  "uid": "AVISANR5L14B3841",
  "legislature": "14",
  "cycleDeVie": {
    "chrono": {
      "dateCreation": "2016-06-14T00:00:00.000+02:00",
      "dateDepot": "2016-06-14T00:00:00.000+02:00",
      "datePublication": "2016-06-22T00:00:00.000+02:00",
      "datePublicationWeb": "2016-06-21T11:05:00.000+02:00"
    }
  },
  "denominationStructurelle": "Avis",
  "provenance": "Commission",
  "titres": {
    "titrePrincipal": "avis  sur le projet de loi, adopté, par le Sénat, autorisant la ratification du traité de coopération en matière de défense entre la République française et la République du Mali (n°3498).",
    "titrePrincipalCourt": "avis  sur le projet de loi, adopté, par le Sénat, autorisant la ratification du traité de coopération en matière de défense entre la République française et la République du Mali (n°3498)."
  },
  "divisions": null,
  "dossierRef": "DLR5L14N34020",
  "redacteur": null,
  "classification": {
    "famille": {
      "depot": {
        "code": "RAPINIT",
        "libelle": "Rapport sur une initiative"
      },
      "classe": {
        "code": "AVIS",
        "libelle": "Avis"
      }
    },
    "type": {
      "code": "AVIS",
      "libelle": "Avis"
    },
    "sousType": null,
    "statutAdoption": null
  },
  "auteurs": {
    "auteur": [
      {
        "acteur": {
          "acteurRef": "PA609292",
          "qualite": "rapporteur pour avis"
        }
      },
      {
        "organe": {
          "organeRef": "PO59046"
        }
      }
    ]
  },
  "correction": null,
  "notice": {
    "numNotice": "3841",
    "formule": "sur le projet de loi, adopté, par le Sénat, autorisant la ratification du traité de coopération en matière de défense entre la République française et la République du Mali (n°3498).",
    "adoptionConforme": "false"
  },
  "indexation": null,
  "imprimerie": {
    "prix": "1.5"
  },
  "coSignataires": null,
  "depotAmendements": null
}