{
  "@xsi:type": "rapportParlementaire_Type",
  "uid": "RAPPSNR5S259B0568",
  "legislature": null,
  "cycleDeVie": {
    "chrono": {
      "dateCreation": "2016-05-04T00:00:00.000+02:00",
      "dateDepot": "2016-04-29T00:00:00.000+02:00",
      "datePublication": "2016-06-02T00:00:00.000+02:00",
      "datePublicationWeb": null
    }
  },
  "denominationStructurelle": "Proposition de loi",
  "provenance": "Texte Déposé",
  "titres": {
    "titrePrincipal": "proposition de loi portant statut général des autorités administratives indépendantes et des autorités publiques indépendantes",
    "titrePrincipalCourt": "Statut général des AAI et des API"
  },
  "divisions": null,
  "dossierRef": "DLR5L14N34674",
  "redacteur": null,
  "classification": {
    "famille": {
      "depot": {
        "code": "INITNAV",
        "libelle": "Initiative en Navette"
      },
      "classe": {
        "code": "PIONLOI",
        "libelle": "Proposition de loi"
      }
    },
    "type": {
      "code": "PION",
      "libelle": "Proposition de loi"
    },
    "sousType": null,
    "statutAdoption": null
  },
  "auteurs": {
    "auteur": {
      "organe": {
        "organeRef": "PO78718"
      }
    }
  },
  "correction": null,
  "notice": {
    "numNotice": "568",
    "formule": ", modifiée, par l'Assemblée nationale, portant statut général des autorités administratives indépendantes et des autorités publiques indépendantes",
    "adoptionConforme": "false"
  },
  "indexation": null,
  "imprimerie": null
}