{
  "@xsi:type": "texteLoi_Type",
  "uid": "PIONANR5L14B3874",
  "legislature": "14",
  "cycleDeVie": {
    "chrono": {
      "dateCreation": "2016-06-24T00:00:00.000+02:00",
      "dateDepot": "2016-06-24T00:00:00.000+02:00",
      "datePublication": "2016-07-06T00:00:00.000+02:00",
      "datePublicationWeb": "2016-07-01T14:10:00.000+02:00"
    }
  },
  "denominationStructurelle": "Proposition de loi",
  "provenance": "Texte Déposé",
  "titres": {
    "titrePrincipal": "proposition de loi constitutionnelle visant à étendre le principe de laïcité aux entreprises privées et aux usagers du service public",
    "titrePrincipalCourt": "visant à étendre le principe de laïcité aux entreprises privées et aux usagers du service public"
  },
  "divisions": null,
  "dossierRef": "DLR5L14N35009",
  "redacteur": null,
  "classification": {
    "famille": {
      "depot": {
        "code": "INITDEP",
        "libelle": "Initiative en 1er Dépôt"
      },
      "classe": {
        "code": "PIONLOI",
        "libelle": "Proposition de loi"
      },
      "espece": {
        "code": "CONST",
        "libelle": "constitutionnelle"
      }
    },
    "type": {
      "code": "PION",
      "libelle": "Proposition de loi"
    },
    "sousType": {
      "code": "CONST",
      "libelle": "constitutionnelle",
      "libelleEdition": "constitutionnelle"
    },
    "statutAdoption": null
  },
  "auteurs": {
    "auteur": {
      "acteur": {
        "acteurRef": "PA330240",
        "qualite": "auteur"
      }
    }
  },
  "correction": null,
  "notice": {
    "numNotice": "3874",
    "formule": "visant à étendre le principe de laïcité aux entreprises privées et aux usagers du service public",
    "adoptionConforme": "false"
  },
  "indexation": null,
  "imprimerie": null,
  "coSignataires": {
    "coSignataire": [
      {
        "acteur": {
          "acteurRef": "PA267775"
        },
        "dateCosignature": "2016-06-24+02:00",
        "dateRetraitCosignature": null,
        "edite": "true"
      },
      {
        "acteur": {
          "acteurRef": "PA1031"
        },
        "dateCosignature": "2016-06-24+02:00",
        "dateRetraitCosignature": null,
        "edite": "true"
      },
      {
        "acteur": {
          "acteurRef": "PA267822"
        },
        "dateCosignature": "2016-06-24+02:00",
        "dateRetraitCosignature": null,
        "edite": "false"
      },
      {
        "acteur": {
          "acteurRef": "PA267551"
        },
        "dateCosignature": "2016-06-24+02:00",
        "dateRetraitCosignature": null,
        "edite": "false"
      },
      {
        "acteur": {
          "acteurRef": "PA336316"
        },
        "dateCosignature": "2016-06-24+02:00",
        "dateRetraitCosignature": null,
        "edite": "false"
      },
      {
        "acteur": {
          "acteurRef": "PA1466"
        },
        "dateCosignature": "2016-06-24+02:00",
        "dateRetraitCosignature": null,
        "edite": "false"
      },
      {
        "acteur": {
          "acteurRef": "PA267289"
        },
        "dateCosignature": "2016-06-24+02:00",
        "dateRetraitCosignature": null,
        "edite": "false"
      },
      {
        "acteur": {
          "acteurRef": "PA2250"
        },
        "dateCosignature": "2016-06-24+02:00",
        "dateRetraitCosignature": null,
        "edite": "false"
      },
      {
        "acteur": {
          "acteurRef": "PA605036"
        },
        "dateCosignature": "2016-06-24+02:00",
        "dateRetraitCosignature": null,
        "edite": "false"
      },
      {
        "acteur": {
          "acteurRef": "PA1574"
        },
        "dateCosignature": "2016-06-24+02:00",
        "dateRetraitCosignature": null,
        "edite": "false"
      },
      {
        "acteur": {
          "acteurRef": "PA2277"
        },
        "dateCosignature": "2016-06-24+02:00",
        "dateRetraitCosignature": null,
        "edite": "false"
      },
      {
        "acteur": {
          "acteurRef": "PA610924"
        },
        "dateCosignature": "2016-06-24+02:00",
        "dateRetraitCosignature": null,
        "edite": "false"
      },
      {
        "acteur": {
          "acteurRef": "PA267227"
        },
        "dateCosignature": "2016-06-24+02:00",
        "dateRetraitCosignature": null,
        "edite": "false"
      },
      {
        "acteur": {
          "acteurRef": "PA2073"
        },
        "dateCosignature": "2016-06-24+02:00",
        "dateRetraitCosignature": null,
        "edite": "false"
      },
      {
        "acteur": {
          "acteurRef": "PA330684"
        },
        "dateCosignature": "2016-06-24+02:00",
        "dateRetraitCosignature": null,
        "edite": "false"
      },
      {
        "acteur": {
          "acteurRef": "PA1152"
        },
        "dateCosignature": "2016-06-24+02:00",
        "dateRetraitCosignature": null,
        "edite": "false"
      },
      {
        "acteur": {
          "acteurRef": "PA2377"
        },
        "dateCosignature": "2016-06-24+02:00",
        "dateRetraitCosignature": null,
        "edite": "false"
      },
      {
        "acteur": {
          "acteurRef": "PA336576"
        },
        "dateCosignature": "2016-06-24+02:00",
        "dateRetraitCosignature": null,
        "edite": "false"
      },
      {
        "acteur": {
          "acteurRef": "PA2345"
        },
        "dateCosignature": "2016-06-24+02:00",
        "dateRetraitCosignature": null,
        "edite": "false"
      },
      {
        "acteur": {
          "acteurRef": "PA334149"
        },
        "dateCosignature": "2016-07-07+02:00",
        "dateRetraitCosignature": null,
        "edite": "false"
      },
      {
        "acteur": {
          "acteurRef": "PA2936"
        },
        "dateCosignature": "2016-07-07+02:00",
        "dateRetraitCosignature": null,
        "edite": "false"
      },
      {
        "acteur": {
          "acteurRef": "PA2229"
        },
        "dateCosignature": "2016-07-21+02:00",
        "dateRetraitCosignature": null,
        "edite": "false"
      },
      {
        "acteur": {
          "acteurRef": "PA267886"
        },
        "dateCosignature": "2016-08-01+02:00",
        "dateRetraitCosignature": null,
        "edite": "false"
      }
    ]
  },
  "depotAmendements": {
    "amendementsSeance": {
      "amendable": "false",
      "dateLimiteDepot": null
    },
    "amendementsCommission": {
      "commission": {
        "organeRef": "PO59051",
        "amendable": "true",
        "dateLimiteDepot": null
      }
    }
  }
}