{
  "@xsi:type": "DossierLegislatif_Type",
  "uid": "DLR5L14N30693",
  "legislature": "14",
  "titreDossier": {
    "titre": "Renforcer les sanctions et les peines pénales pour le vol de truffes",
    "titreChemin": "renforcer_sanctions_penales_vol_truffes",
    "senatChemin": null
  },
  "procedureParlementaire": {
    "code": "2",
    "libelle": "Proposition de loi ordinaire"
  },
  "initiateur": {
    "acteurs": {
      "acteur": {
        "acteurRef": "PA609726",
        "mandatRef": "PM645311"
      }
    }
  },
  "actesLegislatifs": {
    "acteLegislatif": {
      "@xsi:type": "Etape_Type",
      "uid": "L14-AN1-30693",
      "codeActe": "AN1",
      "libelleActe": {
        "nomCanonique": "1ère lecture (1ère assemblée saisie)",
        "libelleCourt": "1ère lecture"
      },
      "organeRef": "PO644420",
      "dateActe": null,
      "actesLegislatifs": {
        "acteLegislatif": [
          {
            "@xsi:type": "DepotInitiative_Type",
            "uid": "L14-VD165098DI",
            "codeActe": "AN1-DEPOT",
            "libelleActe": {
              "nomCanonique": "1er dépôt d'une initiative.",
              "libelleCourt": "1er dépôt d'une initiative."
            },
            "organeRef": "PO644420",
            "dateActe": "2013-07-16T00:00:00.000+02:00",
            "actesLegislatifs": null,
            "texteAssocie": "PIONANR5L14B1260"
          },
          {
            "@xsi:type": "Etape_Type",
            "uid": "L14-AN1-COM-30693",
            "codeActe": "AN1-COM",
            "libelleActe": {
              "nomCanonique": "Travaux des commissions",
              "libelleCourt": "Travaux des commissions"
            },
            "organeRef": "PO644420",
            "dateActe": null,
            "actesLegislatifs": {
              "acteLegislatif": {
                "@xsi:type": "Etape_Type",
                "uid": "L14-VD165099CF",
                "codeActe": "AN1-COM-FOND",
                "libelleActe": {
                  "nomCanonique": "Travaux de la commission saisie au fond",
                  "libelleCourt": "Travaux de la commission saisie au fond"
                },
                "organeRef": "PO419610",
                "dateActe": null,
                "actesLegislatifs": {
                  "acteLegislatif": {
                    "@xsi:type": "SaisieComFond_Type",
                    "uid": "L14-VD165099CFS",
                    "codeActe": "AN1-COM-FOND-SAISIE",
                    "libelleActe": {
                      "nomCanonique": "Renvoi en commission au fond",
                      "libelleCourt": "Renvoi en commission au fond"
                    },
                    "organeRef": "PO419610",
                    "dateActe": "2013-07-16T00:00:00.000+02:00",
                    "actesLegislatifs": null
                  }
                }
              }
            }
          }
        ]
      }
    }
  },
  "fusionDossier": null,
  "indexation": {
    "themes": {
      "@niveau": "1",
      "theme": {
        "libelleTheme": "JEUNES"
      }
    }
  }
}