{
  "@xsi:type": "DossierLegislatif_Type",
  "uid": "DLR5L14N28862",
  "legislature": "14",
  "titreDossier": {
    "titre": "Traités et conventions : convention de Hong Kong pour le recyclage des navires",
    "titreChemin": "convention_Hong_Kong_recyclage_navires",
    "senatChemin": "http://www.senat.fr/dossier-legislatif/pjl11-719.html"
  },
  "procedureParlementaire": {
    "code": "6",
    "libelle": "Projet de ratification des traités et conventions"
  },
  "initiateur": {
    "acteurs": {
      "acteur": [
        {
          "acteurRef": "PA328",
          "mandatRef": "PM653228"
        },
        {
          "acteurRef": "PA1268",
          "mandatRef": "PM653525"
        }
      ]
    }
  },
  "actesLegislatifs": {
    "acteLegislatif": [
      {
        "@xsi:type": "Etape_Type",
        "uid": "L14-AN1-28862",
        "codeActe": "AN1",
        "libelleActe": {
          "nomCanonique": "1ère lecture (1ère assemblée saisie)",
          "libelleCourt": "1ère lecture"
        },
        "organeRef": "PO644420",
        "dateActe": null,
        "actesLegislatifs": {
          "acteLegislatif": [
            {
              "@xsi:type": "DepotInitiative_Type",
              "uid": "L14-VD158445DI",
              "codeActe": "AN1-DEPOT",
              "libelleActe": {
                "nomCanonique": "1er dépôt d'une initiative.",
                "libelleCourt": "1er dépôt d'une initiative."
              },
              "organeRef": "PO644420",
              "dateActe": "2012-06-27T00:00:00.000+02:00",
              "actesLegislatifs": null,
              "texteAssocie": "PRJLANR5L14B0008"
            },
            {
              "@xsi:type": "EtudeImpact_Type",
              "uid": "L14-VD158445ETI",
              "codeActe": "AN1-ETI",
              "libelleActe": {
                "nomCanonique": "Etude d'impact",
                "libelleCourt": "Etude d'impact"
              },
              "organeRef": "PO644420",
              "dateActe": "2012-06-27T00:00:00.000+02:00",
              "actesLegislatifs": null,
              "texteAssocie": "ETDIANR5L14B0008",
              "contributionInternaute": {
                "dateFermeture": "2012-07-25+02:00",
                "dateOuverture": "2012-06-30+02:00"
              }
            },
            {
              "@xsi:type": "Etape_Type",
              "uid": "L14-AN1-COM-28862",
              "codeActe": "AN1-COM",
              "libelleActe": {
                "nomCanonique": "Travaux des commissions",
                "libelleCourt": "Travaux des commissions"
              },
              "organeRef": "PO644420",
              "dateActe": null,
              "actesLegislatifs": {
                "acteLegislatif": {
                  "@xsi:type": "Etape_Type",
                  "uid": "L14-VD158446CF",
                  "codeActe": "AN1-COM-FOND",
                  "libelleActe": {
                    "nomCanonique": "Travaux de la commission saisie au fond",
                    "libelleCourt": "Travaux de la commission saisie au fond"
                  },
                  "organeRef": "PO59047",
                  "dateActe": null,
                  "actesLegislatifs": {
                    "acteLegislatif": [
                      {
                        "@xsi:type": "SaisieComFond_Type",
                        "uid": "L14-VD158446CFS",
                        "codeActe": "AN1-COM-FOND-SAISIE",
                        "libelleActe": {
                          "nomCanonique": "Renvoi en commission au fond",
                          "libelleCourt": "Renvoi en commission au fond"
                        },
                        "organeRef": "PO59047",
                        "dateActe": "2012-06-27T00:00:00.000+02:00",
                        "actesLegislatifs": null
                      },
                      {
                        "@xsi:type": "NominRapporteurs_Type",
                        "uid": "L14-VD158695",
                        "codeActe": "AN1-COM-FOND-NOMIN",
                        "libelleActe": {
                          "nomCanonique": "Nomination de rapporteur",
                          "libelleCourt": "Nomination de rapporteur"
                        },
                        "organeRef": "PO59047",
                        "dateActe": "2012-07-11T00:00:00.000+02:00",
                        "actesLegislatifs": null,
                        "rapporteurs": {
                          "rapporteur": {
                            "acteurRef": "PA2045",
                            "typeRapporteur": "rapporteur"
                          }
                        },
                        "reunion": null
                      },
                      {
                        "@xsi:type": "DiscussionCommission_Type",
                        "uid": "L14-VD158630R18039",
                        "codeActe": "AN1-COM-FOND-REUNION",
                        "libelleActe": {
                          "nomCanonique": "Réunion de commission",
                          "libelleCourt": "Réunion de commission"
                        },
                        "organeRef": "PO59047",
                        "dateActe": "2012-07-11T10:00:00.000+02:00",
                        "actesLegislatifs": null,
                        "reunionRef": "RUANR5L14S2012IDC414963",
                        "odjRef": "RUANR5L14S2012IDC414963PT18039"
                      },
                      {
                        "@xsi:type": "DiscussionCommission_Type",
                        "uid": "L14-VD158630R16169",
                        "codeActe": "AN1-COM-FOND-REUNION",
                        "libelleActe": {
                          "nomCanonique": "Réunion de commission",
                          "libelleCourt": "Réunion de commission"
                        },
                        "organeRef": "PO59047",
                        "dateActe": "2012-07-18T09:45:00.000+02:00",
                        "actesLegislatifs": null,
                        "reunionRef": "RUANR5L14S2012IDC415008",
                        "odjRef": "RUANR5L14S2012IDC415008PT16169"
                      },
                      {
                        "@xsi:type": "DepotRapport_Type",
                        "uid": "L14-VD158805",
                        "codeActe": "AN1-COM-FOND-RAPPORT",
                        "libelleActe": {
                          "nomCanonique": "Dépôt de rapport",
                          "libelleCourt": "Dépôt de rapport"
                        },
                        "organeRef": "PO59047",
                        "dateActe": "2012-07-18T00:00:00.000+02:00",
                        "actesLegislatifs": null,
                        "texteAssocie": "RAPPANR5L14B0087",
                        "texteAdopte": null
                      }
                    ]
                  }
                }
              }
            },
            {
              "@xsi:type": "Etape_Type",
              "uid": "L14-AN1-DEBATS-28862",
              "codeActe": "AN1-DEBATS",
              "libelleActe": {
                "nomCanonique": "Discussion en séance publique",
                "libelleCourt": "Discussion en séance publique"
              },
              "organeRef": "PO644420",
              "dateActe": null,
              "actesLegislatifs": {
                "acteLegislatif": [
                  {
                    "@xsi:type": "DiscussionSeancePublique_Type",
                    "uid": "L14-VD158467S26342",
                    "codeActe": "AN1-DEBATS-SEANCE",
                    "libelleActe": {
                      "nomCanonique": "Discussion en séance publique",
                      "libelleCourt": "Discussion en séance publique"
                    },
                    "organeRef": "PO644420",
                    "dateActe": "2012-07-25T00:00:00.000+02:00",
                    "actesLegislatifs": null,
                    "reunionRef": "RUANR5L14S2012IDS16446",
                    "odjRef": "RUANR5L14S2012IDS16446PT26342"
                  },
                  {
                    "@xsi:type": "Decision_Type",
                    "uid": "L14-VD158990DEC",
                    "codeActe": "AN1-DEBATS-DEC",
                    "libelleActe": {
                      "nomCanonique": "Décision",
                      "libelleCourt": "Décision"
                    },
                    "organeRef": "PO644420",
                    "dateActe": "2012-07-25T00:00:00.000+02:00",
                    "actesLegislatifs": null,
                    "reunionRef": "RUANR5L14S2012IDS16446",
                    "statutConclusion": {
                      "fam_code": "TSORTF01",
                      "libelle": "adopté"
                    },
                    "voteRefs": null,
                    "textesAssocies": {
                      "texteAssocie": {
                        "typeTexte": "BTA",
                        "refTexteAssocie": "PRJLANR5L14BTA0011"
                      }
                    }
                  }
                ]
              }
            }
          ]
        }
      },
      {
        "@xsi:type": "Etape_Type",
        "uid": "L14-SN1-28862",
        "codeActe": "SN1",
        "libelleActe": {
          "nomCanonique": "1ère lecture (2ème assemblée saisie)",
          "libelleCourt": "1ère lecture"
        },
        "organeRef": "PO78718",
        "dateActe": null,
        "actesLegislatifs": {
          "acteLegislatif": [
            {
              "@xsi:type": "DepotInitiativeNavette_Type",
              "uid": "L14-VD159011DIN",
              "codeActe": "SN1-DEPOT",
              "libelleActe": {
                "nomCanonique": "Dépôt d'une initiative en navette",
                "libelleCourt": "Dépôt d'une initiative en navette"
              },
              "organeRef": "PO78718",
              "dateActe": "2012-07-26T00:00:00.000+02:00",
              "actesLegislatifs": null,
              "texteAssocie": "PRJLSNR5S198B0719",
              "provenance": "PO644420"
            },
            {
              "@xsi:type": "Etape_Type",
              "uid": "L14-SN1-COM-28862",
              "codeActe": "SN1-COM",
              "libelleActe": {
                "nomCanonique": "Travaux des commissions",
                "libelleCourt": "Travaux des commissions"
              },
              "organeRef": "PO78718",
              "dateActe": null,
              "actesLegislatifs": {
                "acteLegislatif": {
                  "@xsi:type": "Etape_Type",
                  "uid": "L14-VD159012CF",
                  "codeActe": "SN1-COM-FOND",
                  "libelleActe": {
                    "nomCanonique": "Travaux de la commission saisie au fond",
                    "libelleCourt": "Travaux de la commission saisie au fond"
                  },
                  "organeRef": "PO211491",
                  "dateActe": null,
                  "actesLegislatifs": {
                    "acteLegislatif": [
                      {
                        "@xsi:type": "SaisieComFond_Type",
                        "uid": "L14-VD159012CFS",
                        "codeActe": "SN1-COM-FOND-SAISIE",
                        "libelleActe": {
                          "nomCanonique": "Renvoi en commission au fond",
                          "libelleCourt": "Renvoi en commission au fond"
                        },
                        "organeRef": "PO211491",
                        "dateActe": "2012-07-26T00:00:00.000+02:00",
                        "actesLegislatifs": null
                      },
                      {
                        "@xsi:type": "NominRapporteurs_Type",
                        "uid": "L14-VD159937",
                        "codeActe": "SN1-COM-FOND-NOMIN",
                        "libelleActe": {
                          "nomCanonique": "Nomination de rapporteur",
                          "libelleCourt": "Nomination de rapporteur"
                        },
                        "organeRef": "PO211491",
                        "dateActe": "2012-06-26T00:00:00.000+02:00",
                        "actesLegislatifs": null,
                        "rapporteurs": {
                          "rapporteur": {
                            "acteurRef": "PA227097",
                            "typeRapporteur": "rapporteur"
                          }
                        },
                        "reunion": null
                      },
                      {
                        "@xsi:type": "DepotRapport_Type",
                        "uid": "L14-VD159938",
                        "codeActe": "SN1-COM-FOND-RAPPORT",
                        "libelleActe": {
                          "nomCanonique": "Dépôt de rapport",
                          "libelleCourt": "Dépôt de rapport"
                        },
                        "organeRef": "PO211491",
                        "dateActe": "2012-10-24T00:00:00.000+02:00",
                        "actesLegislatifs": null,
                        "texteAssocie": "RAPPSNR5S199B0081",
                        "texteAdopte": null
                      }
                    ]
                  }
                }
              }
            },
            {
              "@xsi:type": "Etape_Type",
              "uid": "L14-SN1-DEBATS-28862",
              "codeActe": "SN1-DEBATS",
              "libelleActe": {
                "nomCanonique": "Discussion en séance publique",
                "libelleCourt": "Discussion en séance publique"
              },
              "organeRef": "PO78718",
              "dateActe": null,
              "actesLegislatifs": {
                "acteLegislatif": [
                  {
                    "@xsi:type": "DiscussionSeancePublique_Type",
                    "uid": "L14-VD159785S26643",
                    "codeActe": "SN1-DEBATS-SEANCE",
                    "libelleActe": {
                      "nomCanonique": "Discussion en séance publique",
                      "libelleCourt": "Discussion en séance publique"
                    },
                    "organeRef": "PO78718",
                    "dateActe": "2012-11-12T00:00:00.000+01:00",
                    "actesLegislatifs": null,
                    "reunionRef": "RUSNR5L14S2013IDS16611",
                    "odjRef": "RUSNR5L14S2013IDS16611PT26643"
                  },
                  {
                    "@xsi:type": "Decision_Type",
                    "uid": "L14-VD160127DEC",
                    "codeActe": "SN1-DEBATS-DEC",
                    "libelleActe": {
                      "nomCanonique": "Décision",
                      "libelleCourt": "Décision"
                    },
                    "organeRef": "PO78718",
                    "dateActe": "2012-11-12T00:00:00.000+01:00",
                    "actesLegislatifs": null,
                    "reunionRef": "RUSNR5L14S2013IDS16611",
                    "statutConclusion": {
                      "fam_code": "TSORTF03",
                      "libelle": "adopté sans modification"
                    },
                    "voteRefs": null,
                    "textesAssocies": {
                      "texteAssocie": {
                        "typeTexte": "BTA",
                        "refTexteAssocie": "PRJLSNR5S199BTA0028"
                      }
                    }
                  }
                ]
              }
            }
          ]
        }
      },
      {
        "@xsi:type": "Etape_Type",
        "uid": "L14-PROM-28862",
        "codeActe": "PROM",
        "libelleActe": {
          "nomCanonique": "Promulgation de la loi",
          "libelleCourt": "Promulgation de la loi"
        },
        "organeRef": "PO696251",
        "dateActe": null,
        "actesLegislatifs": {
          "acteLegislatif": {
            "@xsi:type": "Promulgation_Type",
            "uid": "L14-VD160472PL",
            "codeActe": "PROM-PUB",
            "libelleActe": {
              "nomCanonique": "Promulgation d'une loi",
              "libelleCourt": "Promulgation d'une loi"
            },
            "organeRef": "PO696251",
            "dateActe": "2012-11-22T00:00:00.000+01:00",
            "actesLegislatifs": null,
            "texteLoiRef": "PRJLSNR5S199BTA0028",
            "infoJO": {
              "typeJO": "JO_LOI_DECRET",
              "dateJO": "2012-11-24+01:00",
              "pageJO": null,
              "numJO": "274"
            },
            "urlLegifrance": "http://www.legifrance.gouv.fr/WAspad/UnTexteDeJorf?numjo=MAEJ1125010L",
            "referenceNOR": "MAEJ1125010L",
            "codeLoi": "2012-1290",
            "titreLoi": "autorisant la ratification de la convention de Hong Kong pour le recyclage sûr et écologiquement rationnel des navires"
          }
        }
      }
    ]
  },
  "fusionDossier": null,
  "indexation": {
    "themes": {
      "@niveau": "1",
      "theme": {
        "libelleTheme": "SOCIETES"
      }
    }
  }
}