{
  "@xsi:type": "DossierLegislatif_Type",
  "uid": "DLR5L14N29251",
  "legislature": "14",
  "titreDossier": {
    "titre": "Collectivités territoriales : protection des indications géographiques et des noms",
    "titreChemin": "indications_geographiques_noms_collectivites_territoriales",
    "senatChemin": null
  },
  "procedureParlementaire": {
    "code": "2",
    "libelle": "Proposition de loi ordinaire"
  },
  "initiateur": {
    "acteurs": {
      "acteur": {
        "acteurRef": "PA1695",
        "mandatRef": "PM645157"
      }
    }
  },
  "actesLegislatifs": {
    "acteLegislatif": {
      "@xsi:type": "Etape_Type",
      "uid": "L14-AN1-29251",
      "codeActe": "AN1",
      "libelleActe": {
        "nomCanonique": "1ère lecture (1ère assemblée saisie)",
        "libelleCourt": "1ère lecture"
      },
      "organeRef": "PO644420",
      "dateActe": null,
      "actesLegislatifs": {
        "acteLegislatif": [
          {
            "@xsi:type": "DepotInitiative_Type",
            "uid": "L14-VD159854DI",
            "codeActe": "AN1-DEPOT",
            "libelleActe": {
              "nomCanonique": "1er dépôt d'une initiative.",
              "libelleCourt": "1er dépôt d'une initiative."
            },
            "organeRef": "PO644420",
            "dateActe": "2012-10-24T00:00:00.000+02:00",
            "actesLegislatifs": null,
            "texteAssocie": "PIONANR5L14B0329"
          },
          {
            "@xsi:type": "Etape_Type",
            "uid": "L14-AN1-COM-29251",
            "codeActe": "AN1-COM",
            "libelleActe": {
              "nomCanonique": "Travaux des commissions",
              "libelleCourt": "Travaux des commissions"
            },
            "organeRef": "PO644420",
            "dateActe": null,
            "actesLegislatifs": {
              "acteLegislatif": {
                "@xsi:type": "Etape_Type",
                "uid": "L14-VD159855CF",
                "codeActe": "AN1-COM-FOND",
                "libelleActe": {
                  "nomCanonique": "Travaux de la commission saisie au fond",
                  "libelleCourt": "Travaux de la commission saisie au fond"
                },
                "organeRef": "PO419610",
                "dateActe": null,
                "actesLegislatifs": {
                  "acteLegislatif": [
                    {
                      "@xsi:type": "SaisieComFond_Type",
                      "uid": "L14-VD159855CFS",
                      "codeActe": "AN1-COM-FOND-SAISIE",
                      "libelleActe": {
                        "nomCanonique": "Renvoi en commission au fond",
                        "libelleCourt": "Renvoi en commission au fond"
                      },
                      "organeRef": "PO419610",
                      "dateActe": "2012-10-24T00:00:00.000+02:00",
                      "actesLegislatifs": null
                    },
                    {
                      "@xsi:type": "NominRapporteurs_Type",
                      "uid": "L14-VD160380",
                      "codeActe": "AN1-COM-FOND-NOMIN",
                      "libelleActe": {
                        "nomCanonique": "Nomination de rapporteur",
                        "libelleCourt": "Nomination de rapporteur"
                      },
                      "organeRef": "PO419610",
                      "dateActe": "2012-11-21T00:00:00.000+01:00",
                      "actesLegislatifs": null,
                      "rapporteurs": {
                        "rapporteur": {
                          "acteurRef": "PA334149",
                          "typeRapporteur": "rapporteur"
                        }
                      },
                      "reunion": null
                    },
                    {
                      "@xsi:type": "DepotRapport_Type",
                      "uid": "L14-VD160554",
                      "codeActe": "AN1-COM-FOND-RAPPORT",
                      "libelleActe": {
                        "nomCanonique": "Dépôt de rapport",
                        "libelleCourt": "Dépôt de rapport"
                      },
                      "organeRef": "PO419610",
                      "dateActe": "2012-11-28T00:00:00.000+01:00",
                      "actesLegislatifs": null,
                      "texteAssocie": "RAPPANR5L14B0458",
                      "texteAdopte": null
                    }
                  ]
                }
              }
            }
          },
          {
            "@xsi:type": "Etape_Type",
            "uid": "L14-AN1-DEBATS-29251",
            "codeActe": "AN1-DEBATS",
            "libelleActe": {
              "nomCanonique": "Discussion en séance publique",
              "libelleCourt": "Discussion en séance publique"
            },
            "organeRef": "PO644420",
            "dateActe": null,
            "actesLegislatifs": {
              "acteLegislatif": [
                {
                  "@xsi:type": "DiscussionSeancePublique_Type",
                  "uid": "L14-VD160131S26820",
                  "codeActe": "AN1-DEBATS-SEANCE",
                  "libelleActe": {
                    "nomCanonique": "Discussion en séance publique",
                    "libelleCourt": "Discussion en séance publique"
                  },
                  "organeRef": "PO644420",
                  "dateActe": "2012-12-06T00:00:00.000+01:00",
                  "actesLegislatifs": null,
                  "reunionRef": "RUANR5L14S2013IDS16674",
                  "odjRef": "RUANR5L14S2013IDS16674PT26820"
                },
                {
                  "@xsi:type": "Decision_Type",
                  "uid": "L14-VD160691DEC",
                  "codeActe": "AN1-DEBATS-DEC",
                  "libelleActe": {
                    "nomCanonique": "Décision",
                    "libelleCourt": "Décision"
                  },
                  "organeRef": "PO644420",
                  "dateActe": "2012-12-06T00:00:00.000+01:00",
                  "actesLegislatifs": null,
                  "reunionRef": "RUANR5L14S2013IDS16674",
                  "statutConclusion": {
                    "fam_code": "TSORTF07",
                    "libelle": "rejetée"
                  },
                  "voteRefs": null,
                  "textesAssocies": {
                    "texteAssocie": {
                      "typeTexte": "BTA",
                      "refTexteAssocie": "PIONANR5L14BTA0056"
                    }
                  }
                }
              ]
            }
          }
        ]
      }
    }
  },
  "fusionDossier": null,
  "indexation": {
    "themes": {
      "@niveau": "1",
      "theme": {
        "libelleTheme": "PARTICIPATION"
      }
    }
  }
}