{
  "@xsi:type": "texteLoi_Type",
  "uid": "PIONANR5L14B0750",
  "legislature": "14",
  "cycleDeVie": {
    "chrono": {
      "dateCreation": "2013-02-19T00:00:00.000+01:00",
      "dateDepot": "2013-02-27T00:00:00.000+01:00",
      "datePublication": null,
      "datePublicationWeb": "2013-02-28T12:00:00.000+01:00"
    }
  },
  "denominationStructurelle": "Proposition de loi",
  "provenance": "Texte Déposé",
  "titres": {
    "titrePrincipal": "proposition de loi interdisant le financement par des Etats étrangers des cours d'arabe donnés en France",
    "titrePrincipalCourt": "Financement par des Etats étrangers des cours d'arabe donnés en France"
  },
  "divisions": null,
  "dossierRef": "DLR5L14N29784",
  "redacteur": null,
  "classification": {
    "famille": {
      "depot": {
        "code": "INITDEP",
        "libelle": "Initiative en 1er Dépôt"
      },
      "classe": {
        "code": "PIONLOI",
        "libelle": "Proposition de loi"
      }
    },
    "type": {
      "code": "PION",
      "libelle": "Proposition de loi"
    },
    "sousType": null,
    "statutAdoption": null
  },
  "auteurs": {
    "auteur": {
      "acteur": {
        "acteurRef": "PA267327",
        "qualite": "auteur"
      }
    }
  },
  "correction": null,
  "notice": {
    "numNotice": "750",
    "formule": "interdisant le financement par des Etats étrangers des cours d'arabe donnés en France",
    "adoptionConforme": "false"
  },
  "indexation": null,
  "imprimerie": null,
  "coSignataires": null,
  "depotAmendements": {
    "amendementsSeance": {
      "amendable": "false",
      "dateLimiteDepot": null
    },
    "amendementsCommission": {
      "commission": {
        "organeRef": "PO419604",
        "amendable": "true",
        "dateLimiteDepot": null
      }
    }
  }
}