{
  "@xsi:type": "texteLoi_Type",
  "uid": "PRJLANR5L14B0092",
  "legislature": "14",
  "cycleDeVie": {
    "chrono": {
      "dateCreation": "2012-07-18T00:00:00.000+02:00",
      "dateDepot": "2012-07-18T00:00:00.000+02:00",
      "datePublication": "2012-07-24T00:00:00.000+02:00",
      "datePublicationWeb": "2012-07-18T20:15:00.000+02:00"
    }
  },
  "denominationStructurelle": "Projet de loi",
  "provenance": "Texte Déposé",
  "titres": {
    "titrePrincipal": "projet de loi autorisant l'approbation du protocole entre le Gouvernement de la République française et le Gouvernement de la République de Serbie portant sur l'application de l'accord entre la Communauté européenne et la République de Serbie concernant la réadmission des personnes en séjour irrégulier",
    "titrePrincipalCourt": "protocole France-Serbie sur l'application de l'accord entre la Communauté européenne et la Serbie sur la réadmission des personnes en séjour irrégulier"
  },
  "divisions": null,
  "dossierRef": "DLR5L14N28914",
  "redacteur": null,
  "classification": {
    "famille": {
      "depot": {
        "code": "INITDEP",
        "libelle": "Initiative en 1er Dépôt"
      },
      "classe": {
        "code": "PRJLOI",
        "libelle": "Projet de loi"
      },
      "espece": {
        "code": "AUTRATCONV",
        "libelle": "autorisant la ratification d'une convention"
      }
    },
    "type": {
      "code": "PRJL",
      "libelle": "Projet de loi"
    },
    "sousType": {
      "code": "AUTRATCONV",
      "libelle": "autorisant la ratification d'une convention",
      "libelleEdition": "autorisant la ratification d'une convention"
    },
    "statutAdoption": null
  },
  "auteurs": {
    "auteur": {
      "acteur": {
        "acteurRef": "PA328",
        "qualite": "auteur"
      }
    }
  },
  "correction": null,
  "notice": {
    "numNotice": "92",
    "formule": "autorisant l'approbation du protocole entre le Gouvernement de la République française et le Gouvernement de la République de Serbie portant sur l'application de l'accord entre la Communauté européenne et la République de Serbie concernant la réadmission des personnes en séjour irrégulier",
    "adoptionConforme": "false"
  },
  "indexation": null,
  "imprimerie": {
    "prix": "1.5"
  },
  "coSignataires": {
    "coSignataire": {
      "acteur": {
        "acteurRef": "PA1268"
      },
      "dateCosignature": "2012-07-18+02:00",
      "dateRetraitCosignature": null,
      "edite": "true"
    }
  },
  "depotAmendements": {
    "amendementsSeance": {
      "amendable": "false",
      "dateLimiteDepot": null
    },
    "amendementsCommission": {
      "commission": {
        "organeRef": "PO59047",
        "amendable": "true",
        "dateLimiteDepot": null
      }
    }
  }
}