{
  "@xsi:type": "texteLoi_Type",
  "uid": "PIONANR5L14B0318",
  "legislature": "14",
  "cycleDeVie": {
    "chrono": {
      "dateCreation": "2012-10-15T00:00:00.000+02:00",
      "dateDepot": "2012-10-24T00:00:00.000+02:00",
      "datePublication": null,
      "datePublicationWeb": "2012-10-25T16:15:00.000+02:00"
    }
  },
  "denominationStructurelle": "Proposition de loi",
  "provenance": "Texte Déposé",
  "titres": {
    "titrePrincipal": "proposition de loi visant à prévenir les dangers des addictions telles la drogue, l'alcool et le tabac",
    "titrePrincipalCourt": "Prévention des addictions à la drogue, à l'alcool et au tabac"
  },
  "divisions": null,
  "dossierRef": "DLR5L14N29205",
  "redacteur": null,
  "classification": {
    "famille": {
      "depot": {
        "code": "INITDEP",
        "libelle": "Initiative en 1er Dépôt"
      },
      "classe": {
        "code": "PIONLOI",
        "libelle": "Proposition de loi"
      }
    },
    "type": {
      "code": "PION",
      "libelle": "Proposition de loi"
    },
    "sousType": null,
    "statutAdoption": null
  },
  "auteurs": {
    "auteur": {
      "acteur": {
        "acteurRef": "PA1699",
        "qualite": "auteur"
      }
    }
  },
  "correction": null,
  "notice": {
    "numNotice": "318",
    "formule": "visant à prévenir les dangers des addictions telles la drogue, l'alcool et le tabac",
    "adoptionConforme": "false"
  },
  "indexation": {
    "themes": {
      "@niveau": "1",
      "theme": {
        "libelleTheme": "ENVIRONNEMENT"
      }
    }
  },
  "imprimerie": null,
  "coSignataires": null,
  "depotAmendements": {
    "amendementsSeance": {
      "amendable": "false",
      "dateLimiteDepot": null
    },
    "amendementsCommission": {
      "commission": {
        "organeRef": "PO419604",
        "amendable": "true",
        "dateLimiteDepot": null
      }
    }
  }
}