{
  "@xsi:type": "texteLoi_Type",
  "uid": "PRJLANR5L14BTC0922",
  "legislature": "14",
  "cycleDeVie": {
    "chrono": {
      "dateCreation": "2013-04-16T00:00:00.000+02:00",
      "dateDepot": "2013-04-16T00:00:00.000+02:00",
      "datePublication": "2013-04-17T00:00:00.000+02:00",
      "datePublicationWeb": "2013-04-16T09:57:00.000+02:00"
    }
  },
  "denominationStructurelle": "Projet de loi",
  "provenance": "Texte Déposé",
  "titres": {
    "titrePrincipal": "projet de loi sur   le projet de loi , modifié par le Sénat, ouvrant le mariage aux couples de personnes de même sexe (n°920)",
    "titrePrincipalCourt": "Ouverture du mariage aux couples de même sexe"
  },
  "divisions": null,
  "dossierRef": "DLR5L14N29305",
  "redacteur": null,
  "classification": {
    "famille": {
      "depot": {
        "code": "INITNAV",
        "libelle": "Initiative en Navette"
      },
      "classe": {
        "code": "PRJLOI",
        "libelle": "Projet de loi"
      }
    },
    "type": {
      "code": "PRJL",
      "libelle": "Projet de loi"
    },
    "sousType": null,
    "statutAdoption": "ADOPTCOM"
  },
  "auteurs": {
    "auteur": [
      {
        "acteur": {
          "acteurRef": "PA606899",
          "qualite": "rapporteur"
        }
      },
      {
        "organe": {
          "organeRef": "PO59051"
        }
      }
    ]
  },
  "correction": null,
  "notice": {
    "numNotice": "922",
    "formule": "sur   le projet de loi , modifié par le Sénat, ouvrant le mariage aux couples de personnes de même sexe (n°920)",
    "adoptionConforme": "false"
  },
  "indexation": {
    "themes": {
      "@niveau": "1",
      "theme": {
        "libelleTheme": "JUSTICE"
      }
    }
  },
  "imprimerie": {
    "prix": "4.5"
  },
  "coSignataires": null,
  "depotAmendements": {
    "amendementsSeance": {
      "amendable": "true",
      "dateLimiteDepot": null
    },
    "amendementsCommission": {
      "commission": {
        "organeRef": "PO59051",
        "amendable": "true",
        "dateLimiteDepot": null
      }
    }
  }
}