{
  "@xsi:type": "texteLoi_Type",
  "uid": "PRJLSNR5S239B0224",
  "legislature": null,
  "cycleDeVie": {
    "chrono": {
      "dateCreation": "2015-01-15T00:00:00.000+01:00",
      "dateDepot": "2015-01-14T00:00:00.000+01:00",
      "datePublication": "2015-05-21T00:00:00.000+02:00",
      "datePublicationWeb": null
    }
  },
  "denominationStructurelle": "Projet de loi",
  "provenance": "Texte Déposé",
  "titres": {
    "titrePrincipal": "projet de loi ratifiant l’ordonnance n° 2014-1539 du 19 décembre 2014 relative à l’élection des conseillers métropolitains de Lyon",
    "titrePrincipalCourt": "Election des conseillers métropolitains de Lyon"
  },
  "divisions": null,
  "dossierRef": "DLR5L14N33690",
  "redacteur": null,
  "classification": {
    "famille": {
      "depot": {
        "code": "INITDEP",
        "libelle": "Initiative en 1er Dépôt"
      },
      "classe": {
        "code": "PRJLOI",
        "libelle": "Projet de loi"
      }
    },
    "type": {
      "code": "PRJL",
      "libelle": "Projet de loi"
    },
    "sousType": null,
    "statutAdoption": null
  },
  "auteurs": {
    "auteur": {
      "acteur": {
        "acteurRef": "PA267622",
        "qualite": "auteur"
      }
    }
  },
  "correction": null,
  "notice": {
    "numNotice": "224",
    "formule": "ratifiant l’ordonnance n° 2014-1539 du 19 décembre 2014 relative à l’élection des conseillers métropolitains de Lyon",
    "adoptionConforme": "false"
  },
  "indexation": null,
  "imprimerie": null,
  "coSignataires": {
    "coSignataire": {
      "acteur": {
        "acteurRef": "PA785"
      },
      "dateCosignature": "2015-01-14+01:00",
      "dateRetraitCosignature": null,
      "edite": "true"
    }
  },
  "depotAmendements": {
    "amendementsSeance": {
      "amendable": "false",
      "dateLimiteDepot": null
    }
  }
}