{
  "@xsi:type": "texteLoi_Type",
  "uid": "AVISANR5L14B4132",
  "legislature": "14",
  "cycleDeVie": {
    "chrono": {
      "dateCreation": "2016-10-13T00:00:00.000+02:00",
      "dateDepot": "2016-10-13T00:00:00.000+02:00",
      "datePublication": null,
      "datePublicationWeb": null
    }
  },
  "denominationStructurelle": "Avis",
  "provenance": "Commission",
  "titres": {
    "titrePrincipal": "avis sur le projet de loi de finances pour 2017 (n°4061).",
    "titrePrincipalCourt": "avis sur le projet de loi de finances pour 2017 (n°4061)."
  },
  "divisions": {
    "division": [
      {
        "@xsi:type": "texteLoi_Type",
        "uid": "AVISANR5L14B4132-tI",
        "legislature": "14",
        "cycleDeVie": {
          "chrono": {
            "dateCreation": "2016-10-13T00:00:00.000+02:00",
            "dateDepot": "2016-10-13T00:00:00.000+02:00",
            "datePublication": "2016-11-08T00:00:00.000+01:00",
            "datePublicationWeb": "2016-11-07T16:00:00.000+01:00"
          }
        },
        "denominationStructurelle": "Tome I",
        "titres": {
          "titrePrincipal": "Administration générale et territoriale de l'État : Administration territoriale de l'Etat, conduite et pilotage des politiques de l'Intérieur",
          "titrePrincipalCourt": "Administration générale et territoriale de l'État : Administration territoriale de l'Etat, conduite et pilotage des politiques de l'Intérieur"
        },
        "divisions": null,
        "dossierRef": "DLR5L14N35110",
        "redacteur": null,
        "classification": {
          "famille": null,
          "type": {
            "code": "AVIS",
            "libelle": "Avis"
          },
          "sousType": null,
          "statutAdoption": null
        },
        "auteurs": {
          "auteur": [
            {
              "acteur": {
                "acteurRef": "PA267330",
                "qualite": "rapporteur pour avis"
              }
            },
            {
              "organe": {
                "organeRef": "PO59051"
              }
            }
          ]
        },
        "correction": null,
        "notice": {
          "numNotice": "4132",
          "formule": "sur le projet de loi de finances pour 2017 (n°4061).",
          "adoptionConforme": "false"
        },
        "indexation": null,
        "imprimerie": {
          "prix": "3.0"
        },
        "coSignataires": null,
        "depotAmendements": null
      },
      {
        "@xsi:type": "texteLoi_Type",
        "uid": "AVISANR5L14B4132-tII",
        "legislature": "14",
        "cycleDeVie": {
          "chrono": {
            "dateCreation": "2016-10-13T00:00:00.000+02:00",
            "dateDepot": "2016-10-13T00:00:00.000+02:00",
            "datePublication": "2016-11-08T00:00:00.000+01:00",
            "datePublicationWeb": "2016-11-07T16:15:00.000+01:00"
          }
        },
        "denominationStructurelle": "Tome II",
        "titres": {
          "titrePrincipal": "Administration générale et territoriale de l'État : Vie politique, cultuelle et associative",
          "titrePrincipalCourt": "Administration générale et territoriale de l'État : Vie politique, cultuelle et associative"
        },
        "divisions": null,
        "dossierRef": "DLR5L14N35110",
        "redacteur": null,
        "classification": {
          "famille": null,
          "type": {
            "code": "AVIS",
            "libelle": "Avis"
          },
          "sousType": null,
          "statutAdoption": null
        },
        "auteurs": {
          "auteur": [
            {
              "acteur": {
                "acteurRef": "PA607619",
                "qualite": "rapporteur pour avis"
              }
            },
            {
              "organe": {
                "organeRef": "PO59051"
              }
            }
          ]
        },
        "correction": null,
        "notice": {
          "numNotice": "4132",
          "formule": "sur le projet de loi de finances pour 2017 (n°4061).",
          "adoptionConforme": "false"
        },
        "indexation": null,
        "imprimerie": {
          "prix": "3.0"
        },
        "coSignataires": null,
        "depotAmendements": null
      },
      {
        "@xsi:type": "texteLoi_Type",
        "uid": "AVISANR5L14B4132-tIII",
        "legislature": "14",
        "cycleDeVie": {
          "chrono": {
            "dateCreation": "2016-10-13T00:00:00.000+02:00",
            "dateDepot": "2016-10-13T00:00:00.000+02:00",
            "datePublication": "2016-11-09T00:00:00.000+01:00",
            "datePublicationWeb": "2016-11-08T16:25:00.000+01:00"
          }
        },
        "denominationStructurelle": "Tome III",
        "titres": {
          "titrePrincipal": "Gestion des finances publiques et des ressources humaines : Fonction publique",
          "titrePrincipalCourt": "Gestion des finances publiques et des ressources humaines : Fonction publique"
        },
        "divisions": null,
        "dossierRef": "DLR5L14N35110",
        "redacteur": null,
        "classification": {
          "famille": null,
          "type": {
            "code": "AVIS",
            "libelle": "Avis"
          },
          "sousType": null,
          "statutAdoption": null
        },
        "auteurs": {
          "auteur": [
            {
              "acteur": {
                "acteurRef": "PA2828",
                "qualite": "rapporteur pour avis"
              }
            },
            {
              "organe": {
                "organeRef": "PO59051"
              }
            }
          ]
        },
        "correction": null,
        "notice": {
          "numNotice": "4132",
          "formule": "sur le projet de loi de finances pour 2017 (n°4061).",
          "adoptionConforme": "false"
        },
        "indexation": null,
        "imprimerie": null,
        "coSignataires": null,
        "depotAmendements": null
      },
      {
        "@xsi:type": "texteLoi_Type",
        "uid": "AVISANR5L14B4132-tIV",
        "legislature": "14",
        "cycleDeVie": {
          "chrono": {
            "dateCreation": "2016-10-13T00:00:00.000+02:00",
            "dateDepot": "2016-10-13T00:00:00.000+02:00",
            "datePublication": "2016-11-02T00:00:00.000+01:00",
            "datePublicationWeb": "2016-10-28T13:50:00.000+02:00"
          }
        },
        "denominationStructurelle": "Tome IV",
        "titres": {
          "titrePrincipal": "Immigration, asile et intégration : Immigration, intégration et accès à la nationalité française",
          "titrePrincipalCourt": "Immigration, asile et intégration : Immigration, intégration et accès à la nationalité française"
        },
        "divisions": null,
        "dossierRef": "DLR5L14N35110",
        "redacteur": null,
        "classification": {
          "famille": null,
          "type": {
            "code": "AVIS",
            "libelle": "Avis"
          },
          "sousType": null,
          "statutAdoption": null
        },
        "auteurs": {
          "auteur": [
            {
              "acteur": {
                "acteurRef": "PA605426",
                "qualite": "rapporteur pour avis"
              }
            },
            {
              "organe": {
                "organeRef": "PO59051"
              }
            }
          ]
        },
        "correction": null,
        "notice": {
          "numNotice": "4132",
          "formule": "sur le projet de loi de finances pour 2017 (n°4061).",
          "adoptionConforme": "false"
        },
        "indexation": null,
        "imprimerie": {
          "prix": "1.5"
        },
        "coSignataires": null,
        "depotAmendements": null
      },
      {
        "@xsi:type": "texteLoi_Type",
        "uid": "AVISANR5L14B4132-tV",
        "legislature": "14",
        "cycleDeVie": {
          "chrono": {
            "dateCreation": "2016-10-13T00:00:00.000+02:00",
            "dateDepot": "2016-10-13T00:00:00.000+02:00",
            "datePublication": "2016-11-02T00:00:00.000+01:00",
            "datePublicationWeb": "2016-10-28T13:30:00.000+02:00"
          }
        },
        "denominationStructurelle": "Tome V",
        "titres": {
          "titrePrincipal": "Immigration, asile et intégration : Asile",
          "titrePrincipalCourt": "Immigration, asile et intégration : Asile"
        },
        "divisions": null,
        "dossierRef": "DLR5L14N35110",
        "redacteur": null,
        "classification": {
          "famille": null,
          "type": {
            "code": "AVIS",
            "libelle": "Avis"
          },
          "sousType": null,
          "statutAdoption": null
        },
        "auteurs": {
          "auteur": [
            {
              "acteur": {
                "acteurRef": "PA330240",
                "qualite": "rapporteur pour avis"
              }
            },
            {
              "organe": {
                "organeRef": "PO59051"
              }
            }
          ]
        },
        "correction": null,
        "notice": {
          "numNotice": "4132",
          "formule": "sur le projet de loi de finances pour 2017 (n°4061).",
          "adoptionConforme": "false"
        },
        "indexation": null,
        "imprimerie": {
          "prix": "3.0"
        },
        "coSignataires": null,
        "depotAmendements": null
      },
      {
        "@xsi:type": "texteLoi_Type",
        "uid": "AVISANR5L14B4132-tVI",
        "legislature": "14",
        "cycleDeVie": {
          "chrono": {
            "dateCreation": "2016-10-13T00:00:00.000+02:00",
            "dateDepot": "2016-10-13T00:00:00.000+02:00",
            "datePublication": "2016-11-03T00:00:00.000+01:00",
            "datePublicationWeb": "2016-11-02T15:50:00.000+01:00"
          }
        },
        "denominationStructurelle": "Tome VI",
        "titres": {
          "titrePrincipal": "Justice : Administration pénitentiaire",
          "titrePrincipalCourt": "Justice : Administration pénitentiaire"
        },
        "divisions": null,
        "dossierRef": "DLR5L14N35110",
        "redacteur": null,
        "classification": {
          "famille": null,
          "type": {
            "code": "AVIS",
            "libelle": "Avis"
          },
          "sousType": null,
          "statutAdoption": null
        },
        "auteurs": {
          "auteur": [
            {
              "acteur": {
                "acteurRef": "PA267785",
                "qualite": "rapporteur pour avis"
              }
            },
            {
              "organe": {
                "organeRef": "PO59051"
              }
            }
          ]
        },
        "correction": null,
        "notice": {
          "numNotice": "4132",
          "formule": "sur le projet de loi de finances pour 2017 (n°4061).",
          "adoptionConforme": "false"
        },
        "indexation": null,
        "imprimerie": null,
        "coSignataires": null,
        "depotAmendements": null
      },
      {
        "@xsi:type": "texteLoi_Type",
        "uid": "AVISANR5L14B4132-tVII",
        "legislature": "14",
        "cycleDeVie": {
          "chrono": {
            "dateCreation": "2016-10-13T00:00:00.000+02:00",
            "dateDepot": "2016-10-13T00:00:00.000+02:00",
            "datePublication": "2016-11-03T00:00:00.000+01:00",
            "datePublicationWeb": "2016-11-02T16:45:00.000+01:00"
          }
        },
        "denominationStructurelle": "Tome VII",
        "titres": {
          "titrePrincipal": "Justice : Accès au droit et à la justice et aide aux victimes",
          "titrePrincipalCourt": "Justice : Accès au droit et à la justice et aide aux victimes"
        },
        "divisions": null,
        "dossierRef": "DLR5L14N35110",
        "redacteur": null,
        "classification": {
          "famille": null,
          "type": {
            "code": "AVIS",
            "libelle": "Avis"
          },
          "sousType": null,
          "statutAdoption": null
        },
        "auteurs": {
          "auteur": [
            {
              "acteur": {
                "acteurRef": "PA610313",
                "qualite": "rapporteur pour avis"
              }
            },
            {
              "organe": {
                "organeRef": "PO59051"
              }
            }
          ]
        },
        "correction": null,
        "notice": {
          "numNotice": "4132",
          "formule": "sur le projet de loi de finances pour 2017 (n°4061).",
          "adoptionConforme": "false"
        },
        "indexation": null,
        "imprimerie": null,
        "coSignataires": null,
        "depotAmendements": null
      },
      {
        "@xsi:type": "texteLoi_Type",
        "uid": "AVISANR5L14B4132-tVIII",
        "legislature": "14",
        "cycleDeVie": {
          "chrono": {
            "dateCreation": "2016-10-13T00:00:00.000+02:00",
            "dateDepot": "2016-10-13T00:00:00.000+02:00",
            "datePublication": "2016-11-03T00:00:00.000+01:00",
            "datePublicationWeb": "2016-11-02T17:05:00.000+01:00"
          }
        },
        "denominationStructurelle": "Tome VIII",
        "titres": {
          "titrePrincipal": "Justice : Justice administrative et judiciaire",
          "titrePrincipalCourt": "Justice : Justice administrative et judiciaire"
        },
        "divisions": null,
        "dossierRef": "DLR5L14N35110",
        "redacteur": null,
        "classification": {
          "famille": null,
          "type": {
            "code": "AVIS",
            "libelle": "Avis"
          },
          "sousType": null,
          "statutAdoption": null
        },
        "auteurs": {
          "auteur": [
            {
              "acteur": {
                "acteurRef": "PA267835",
                "qualite": "rapporteur pour avis"
              }
            },
            {
              "organe": {
                "organeRef": "PO59051"
              }
            }
          ]
        },
        "correction": null,
        "notice": {
          "numNotice": "4132",
          "formule": "sur le projet de loi de finances pour 2017 (n°4061).",
          "adoptionConforme": "false"
        },
        "indexation": null,
        "imprimerie": null,
        "coSignataires": null,
        "depotAmendements": null
      },
      {
        "@xsi:type": "texteLoi_Type",
        "uid": "AVISANR5L14B4132-tIX",
        "legislature": "14",
        "cycleDeVie": {
          "chrono": {
            "dateCreation": "2016-10-13T00:00:00.000+02:00",
            "dateDepot": "2016-10-13T00:00:00.000+02:00",
            "datePublication": "2016-11-03T00:00:00.000+01:00",
            "datePublicationWeb": "2016-11-02T15:45:00.000+01:00"
          }
        },
        "denominationStructurelle": "Tome IX",
        "titres": {
          "titrePrincipal": "Justice : Protection judiciaire de la jeunesse",
          "titrePrincipalCourt": "Justice : Protection judiciaire de la jeunesse"
        },
        "divisions": null,
        "dossierRef": "DLR5L14N35110",
        "redacteur": null,
        "classification": {
          "famille": null,
          "type": {
            "code": "AVIS",
            "libelle": "Avis"
          },
          "sousType": null,
          "statutAdoption": null
        },
        "auteurs": {
          "auteur": [
            {
              "acteur": {
                "acteurRef": "PA608264",
                "qualite": "rapporteur pour avis"
              }
            },
            {
              "organe": {
                "organeRef": "PO59051"
              }
            }
          ]
        },
        "correction": null,
        "notice": {
          "numNotice": "4132",
          "formule": "sur le projet de loi de finances pour 2017 (n°4061).",
          "adoptionConforme": "false"
        },
        "indexation": null,
        "imprimerie": {
          "prix": "1.5"
        },
        "coSignataires": null,
        "depotAmendements": null
      },
      {
        "@xsi:type": "texteLoi_Type",
        "uid": "AVISANR5L14B4132-tX",
        "legislature": "14",
        "cycleDeVie": {
          "chrono": {
            "dateCreation": "2016-10-13T00:00:00.000+02:00",
            "dateDepot": "2016-10-13T00:00:00.000+02:00",
            "datePublication": "2016-11-10T00:00:00.000+01:00",
            "datePublicationWeb": "2016-11-08T22:15:00.000+01:00"
          }
        },
        "denominationStructurelle": "Tome X",
        "titres": {
          "titrePrincipal": "Outre-mer : Départements d'Outre-mer",
          "titrePrincipalCourt": "Outre-mer : Départements d'Outre-mer"
        },
        "divisions": null,
        "dossierRef": "DLR5L14N35110",
        "redacteur": null,
        "classification": {
          "famille": null,
          "type": {
            "code": "AVIS",
            "libelle": "Avis"
          },
          "sousType": null,
          "statutAdoption": null
        },
        "auteurs": {
          "auteur": [
            {
              "acteur": {
                "acteurRef": "PA441",
                "qualite": "rapporteur pour avis"
              }
            },
            {
              "organe": {
                "organeRef": "PO59051"
              }
            }
          ]
        },
        "correction": null,
        "notice": {
          "numNotice": "4132",
          "formule": "sur le projet de loi de finances pour 2017 (n°4061).",
          "adoptionConforme": "false"
        },
        "indexation": null,
        "imprimerie": null,
        "coSignataires": null,
        "depotAmendements": null
      },
      {
        "@xsi:type": "texteLoi_Type",
        "uid": "AVISANR5L14B4132-tXI",
        "legislature": "14",
        "cycleDeVie": {
          "chrono": {
            "dateCreation": "2016-10-13T00:00:00.000+02:00",
            "dateDepot": "2016-10-13T00:00:00.000+02:00",
            "datePublication": "2016-11-10T00:00:00.000+01:00",
            "datePublicationWeb": "2016-11-09T20:00:00.000+01:00"
          }
        },
        "denominationStructurelle": "Tome XI",
        "titres": {
          "titrePrincipal": "Outre-mer : Collectivités d'Outre-mer, Nouvelle-Calédonie et Terres Australes et Antarctiques françaises",
          "titrePrincipalCourt": "Outre-mer : Collectivités d'Outre-mer, Nouvelle-Calédonie et Terres Australes et Antarctiques françaises"
        },
        "divisions": null,
        "dossierRef": "DLR5L14N35110",
        "redacteur": null,
        "classification": {
          "famille": null,
          "type": {
            "code": "AVIS",
            "libelle": "Avis"
          },
          "sousType": null,
          "statutAdoption": null
        },
        "auteurs": {
          "auteur": [
            {
              "acteur": {
                "acteurRef": "PA610758",
                "qualite": "rapporteur pour avis"
              }
            },
            {
              "organe": {
                "organeRef": "PO59051"
              }
            }
          ]
        },
        "correction": null,
        "notice": {
          "numNotice": "4132",
          "formule": "sur le projet de loi de finances pour 2017 (n°4061).",
          "adoptionConforme": "false"
        },
        "indexation": null,
        "imprimerie": {
          "prix": "3.0"
        },
        "coSignataires": null,
        "depotAmendements": null
      },
      {
        "@xsi:type": "texteLoi_Type",
        "uid": "AVISANR5L14B4132-tXII",
        "legislature": "14",
        "cycleDeVie": {
          "chrono": {
            "dateCreation": "2016-10-13T00:00:00.000+02:00",
            "dateDepot": "2016-10-13T00:00:00.000+02:00",
            "datePublication": "2016-11-14T00:00:00.000+01:00",
            "datePublicationWeb": "2016-11-10T19:45:00.000+01:00"
          }
        },
        "denominationStructurelle": "Tome XII",
        "titres": {
          "titrePrincipal": "Relations avec les collectivités territoriales",
          "titrePrincipalCourt": "Relations avec les collectivités territoriales"
        },
        "divisions": null,
        "dossierRef": "DLR5L14N35110",
        "redacteur": null,
        "classification": {
          "famille": null,
          "type": {
            "code": "AVIS",
            "libelle": "Avis"
          },
          "sousType": null,
          "statutAdoption": null
        },
        "auteurs": {
          "auteur": [
            {
              "acteur": {
                "acteurRef": "PA609775",
                "qualite": "rapporteur pour avis"
              }
            },
            {
              "organe": {
                "organeRef": "PO59051"
              }
            }
          ]
        },
        "correction": null,
        "notice": {
          "numNotice": "4132",
          "formule": "sur le projet de loi de finances pour 2017 (n°4061).",
          "adoptionConforme": "false"
        },
        "indexation": null,
        "imprimerie": {
          "prix": "3.0"
        },
        "coSignataires": null,
        "depotAmendements": null
      },
      {
        "@xsi:type": "texteLoi_Type",
        "uid": "AVISANR5L14B4132-tXIII",
        "legislature": "14",
        "cycleDeVie": {
          "chrono": {
            "dateCreation": "2016-10-13T00:00:00.000+02:00",
            "dateDepot": "2016-10-13T00:00:00.000+02:00",
            "datePublication": "2016-11-03T00:00:00.000+01:00",
            "datePublicationWeb": "2016-11-02T13:20:00.000+01:00"
          }
        },
        "denominationStructurelle": "Tome XIII",
        "titres": {
          "titrePrincipal": "Sécurités : Sécurité",
          "titrePrincipalCourt": "Sécurités : Sécurité"
        },
        "divisions": null,
        "dossierRef": "DLR5L14N35110",
        "redacteur": null,
        "classification": {
          "famille": null,
          "type": {
            "code": "AVIS",
            "libelle": "Avis"
          },
          "sousType": null,
          "statutAdoption": null
        },
        "auteurs": {
          "auteur": [
            {
              "acteur": {
                "acteurRef": "PA608038",
                "qualite": "rapporteur pour avis"
              }
            },
            {
              "organe": {
                "organeRef": "PO59051"
              }
            }
          ]
        },
        "correction": null,
        "notice": {
          "numNotice": "4132",
          "formule": "sur le projet de loi de finances pour 2017 (n°4061).",
          "adoptionConforme": "false"
        },
        "indexation": null,
        "imprimerie": {
          "prix": "1.5"
        },
        "coSignataires": null,
        "depotAmendements": null
      },
      {
        "@xsi:type": "texteLoi_Type",
        "uid": "AVISANR5L14B4132-tXIV",
        "legislature": "14",
        "cycleDeVie": {
          "chrono": {
            "dateCreation": "2016-10-13T00:00:00.000+02:00",
            "dateDepot": "2016-10-13T00:00:00.000+02:00",
            "datePublication": "2016-11-03T00:00:00.000+01:00",
            "datePublicationWeb": "2016-11-02T12:25:00.000+01:00"
          }
        },
        "denominationStructurelle": "Tome XIV",
        "titres": {
          "titrePrincipal": "Sécurités : Sécurité civile",
          "titrePrincipalCourt": "Sécurités : Sécurité civile"
        },
        "divisions": null,
        "dossierRef": "DLR5L14N35110",
        "redacteur": null,
        "classification": {
          "famille": null,
          "type": {
            "code": "AVIS",
            "libelle": "Avis"
          },
          "sousType": null,
          "statutAdoption": null
        },
        "auteurs": {
          "auteur": [
            {
              "acteur": {
                "acteurRef": "PA266788",
                "qualite": "rapporteur pour avis"
              }
            },
            {
              "organe": {
                "organeRef": "PO59051"
              }
            }
          ]
        },
        "correction": null,
        "notice": {
          "numNotice": "4132",
          "formule": "sur le projet de loi de finances pour 2017 (n°4061).",
          "adoptionConforme": "false"
        },
        "indexation": null,
        "imprimerie": {
          "prix": "1.5"
        },
        "coSignataires": null,
        "depotAmendements": null
      }
    ]
  },
  "dossierRef": "DLR5L14N35110",
  "redacteur": null,
  "classification": {
    "famille": {
      "depot": {
        "code": "RAPINIT",
        "libelle": "Rapport sur une initiative"
      },
      "classe": {
        "code": "AVIS",
        "libelle": "Avis"
      }
    },
    "type": {
      "code": "AVIS",
      "libelle": "Avis"
    },
    "sousType": null,
    "statutAdoption": null
  },
  "auteurs": {
    "auteur": {
      "organe": {
        "organeRef": "PO644420"
      }
    }
  },
  "correction": null,
  "notice": {
    "numNotice": "4132",
    "formule": "sur le projet de loi de finances pour 2017 (n°4061).",
    "adoptionConforme": "false"
  },
  "indexation": null,
  "imprimerie": null,
  "coSignataires": null,
  "depotAmendements": null
}