{
  "@xsi:type": "rapportParlementaire_Type",
  "uid": "RAPPANR5L15B0239",
  "legislature": "15",
  "cycleDeVie": {
    "chrono": {
      "dateCreation": "2017-09-27T00:00:00.000+02:00",
      "dateDepot": "2017-09-27T00:00:00.000+02:00",
      "datePublication": "2017-10-04T00:00:00.000+02:00",
      "datePublicationWeb": "2017-10-02T18:00:00.000+02:00"
    }
  },
  "denominationStructurelle": "Rapport",
  "provenance": "Commission",
  "titres": {
    "titrePrincipal": "rapport  sur le projet de loi, adopté par le Sénat, autorisant l'approbation de l'accord entre le Gouvernement de la République française et le Gouvernement du Royaume hachémite de Jordanie relatif au statut de leurs forces (n°112).",
    "titrePrincipalCourt": "rapport  sur le projet de loi, adopté par le Sénat, autorisant l'approbation de l'accord entre le Gouvernement de la République française et le Gouvernement du Royaume hachémite de Jordanie relatif au statut de leurs forces (n°112)."
  },
  "divisions": null,
  "dossierRef": "DLR5L14N35769",
  "redacteur": null,
  "classification": {
    "famille": {
      "depot": {
        "code": "RAPINIT",
        "libelle": "Rapport sur une initiative"
      },
      "classe": {
        "code": "RAPPORT",
        "libelle": "Rapport"
      }
    },
    "type": {
      "code": "RAPP",
      "libelle": "Rapport"
    },
    "sousType": null,
    "statutAdoption": null
  },
  "auteurs": {
    "auteur": [
      {
        "acteur": {
          "acteurRef": "PA1498",
          "qualite": "rapporteur"
        }
      },
      {
        "organe": {
          "organeRef": "PO59047"
        }
      }
    ]
  },
  "correction": null,
  "notice": {
    "numNotice": "239",
    "formule": "sur le projet de loi, adopté par le Sénat, autorisant l'approbation de l'accord entre le Gouvernement de la République française et le Gouvernement du Royaume hachémite de Jordanie relatif au statut de leurs forces (n°112).",
    "adoptionConforme": "false"
  },
  "indexation": null,
  "imprimerie": {
    "prix": "0.75"
  }
}