{
  "@xsi:type": "texteLoi_Type",
  "uid": "PIONANR5L14B3731",
  "legislature": "14",
  "cycleDeVie": {
    "chrono": {
      "dateCreation": "2016-05-10T00:00:00.000+02:00",
      "dateDepot": "2016-05-10T00:00:00.000+02:00",
      "datePublication": "2016-05-18T00:00:00.000+02:00",
      "datePublicationWeb": "2016-05-12T16:30:00.000+02:00"
    }
  },
  "denominationStructurelle": "Proposition de loi",
  "provenance": "Texte Déposé",
  "titres": {
    "titrePrincipal": "proposition de loi réformant le système de répression des abus de marché",
    "titrePrincipalCourt": "Réforme du système de répression des abus de marché"
  },
  "divisions": null,
  "dossierRef": "DLR5L14N34782",
  "redacteur": null,
  "classification": {
    "famille": {
      "depot": {
        "code": "INITNAV",
        "libelle": "Initiative en Navette"
      },
      "classe": {
        "code": "PIONLOI",
        "libelle": "Proposition de loi"
      }
    },
    "type": {
      "code": "PION",
      "libelle": "Proposition de loi"
    },
    "sousType": null,
    "statutAdoption": null
  },
  "auteurs": {
    "auteur": {
      "organe": {
        "organeRef": "PO644420"
      }
    }
  },
  "correction": null,
  "notice": {
    "numNotice": "3731",
    "formule": ", modifiée par le Sénat, réformant le système de répression des abus de marché",
    "adoptionConforme": "false"
  },
  "indexation": null,
  "imprimerie": null,
  "coSignataires": null,
  "depotAmendements": {
    "amendementsSeance": {
      "amendable": "false",
      "dateLimiteDepot": null
    },
    "amendementsCommission": {
      "commission": {
        "organeRef": "PO59048",
        "amendable": "true",
        "dateLimiteDepot": null
      }
    }
  }
}