{
  "@xsi:type": "texteLoi_Type",
  "uid": "PIONANR5L14BTC0551",
  "legislature": "14",
  "cycleDeVie": {
    "chrono": {
      "dateCreation": "2012-12-19T00:00:00.000+01:00",
      "dateDepot": "2012-12-19T00:00:00.000+01:00",
      "datePublication": "2012-12-20T00:00:00.000+01:00",
      "datePublicationWeb": "2012-12-19T13:50:00.000+01:00"
    }
  },
  "denominationStructurelle": "Proposition de loi",
  "provenance": "Texte Déposé",
  "titres": {
    "titrePrincipal": "proposition de loi organique sur   la proposition de loi organique , modifiée par le Sénat, relative à la nomination du directeur général de la société anonyme BPI-Groupe (n°487)",
    "titrePrincipalCourt": "Nomination du directeur général de BPI-Groupe"
  },
  "divisions": null,
  "dossierRef": "DLR5L14N29314",
  "redacteur": null,
  "classification": {
    "famille": {
      "depot": {
        "code": "INITNAV",
        "libelle": "Initiative en Navette"
      },
      "classe": {
        "code": "PIONLOI",
        "libelle": "Proposition de loi"
      },
      "espece": {
        "code": "ORG",
        "libelle": "organique"
      }
    },
    "type": {
      "code": "PION",
      "libelle": "Proposition de loi"
    },
    "sousType": {
      "code": "ORG",
      "libelle": "organique",
      "libelleEdition": "organique"
    },
    "statutAdoption": "ADOPTCOM"
  },
  "auteurs": {
    "auteur": [
      {
        "acteur": {
          "acteurRef": "PA331594",
          "qualite": "rapporteur"
        }
      },
      {
        "organe": {
          "organeRef": "PO59051"
        }
      }
    ]
  },
  "correction": null,
  "notice": {
    "numNotice": "551",
    "formule": "sur   la proposition de loi organique , modifiée par le Sénat, relative à la nomination du directeur général de la société anonyme BPI-Groupe (n°487)",
    "adoptionConforme": "false"
  },
  "indexation": {
    "themes": {
      "@niveau": "1",
      "theme": {
        "libelleTheme": "JUSTICE"
      }
    }
  },
  "imprimerie": {
    "prix": "0.75"
  },
  "coSignataires": null,
  "depotAmendements": {
    "amendementsSeance": {
      "amendable": "true",
      "dateLimiteDepot": null
    },
    "amendementsCommission": {
      "commission": {
        "organeRef": "PO59051",
        "amendable": "true",
        "dateLimiteDepot": null
      }
    }
  }
}