{
  "@xsi:type": "texteLoi_Type",
  "uid": "RINFANR5L15B0123",
  "legislature": "15",
  "cycleDeVie": {
    "chrono": {
      "dateCreation": "2017-08-02T00:00:00.000+02:00",
      "dateDepot": "2017-08-02T00:00:00.000+02:00",
      "datePublication": "2017-08-04T00:00:00.000+02:00",
      "datePublicationWeb": "2017-08-02T19:30:00.000+02:00"
    }
  },
  "denominationStructurelle": "Rapport d'information",
  "provenance": "Commission",
  "titres": {
    "titrePrincipal": "rapport d'information déposé en application de l'article 145-7 alinéa 1 du règlement, par la commission des affaires sociales , sur la mise en application de la loi n° 2016-1827 du 23 décembre 2016 de financement de la sécurité sociale pour 2017",
    "titrePrincipalCourt": "rapport d'information déposé en application de l'article 145-7 alinéa 1 du règlement, par la commission des affaires sociales , sur la mise en application de la loi n° 2016-1827 du 23 décembre 2016 de financement de la sécurité sociale pour 2017"
  },
  "divisions": null,
  "dossierRef": "DLR5L15N35867",
  "redacteur": null,
  "classification": {
    "famille": {
      "depot": {
        "code": "RAPAUT",
        "libelle": "Rapport autonome"
      },
      "classe": {
        "code": "RAPINF",
        "libelle": "Rapport d'information"
      },
      "espece": {
        "code": "APPLOI",
        "libelle": "sur l'application des lois"
      }
    },
    "type": {
      "code": "RINF",
      "libelle": "Rapport d'information"
    },
    "sousType": {
      "code": "APPLOI",
      "libelle": "sur l'application des lois"
    },
    "statutAdoption": null
  },
  "auteurs": {
    "auteur": [
      {
        "acteur": {
          "acteurRef": "PA642788",
          "qualite": "rapporteur"
        }
      },
      {
        "acteur": {
          "acteurRef": "PA606712",
          "qualite": "rapporteur"
        }
      },
      {
        "organe": {
          "organeRef": "PO420120"
        }
      }
    ]
  },
  "correction": null,
  "notice": {
    "numNotice": "123",
    "formule": "déposé en application de l'article 145-7 alinéa 1 du règlement, par la commission des affaires sociales , sur la mise en application de la loi n° 2016-1827 du 23 décembre 2016 de financement de la sécurité sociale pour 2017",
    "adoptionConforme": "false"
  },
  "indexation": null,
  "imprimerie": {
    "prix": "3.5"
  },
  "coSignataires": null,
  "depotAmendements": null
}