{
  "@xsi:type": "texteLoi_Type",
  "uid": "PIONANR5L14B1253",
  "legislature": "14",
  "cycleDeVie": {
    "chrono": {
      "dateCreation": "2013-06-27T00:00:00.000+02:00",
      "dateDepot": "2013-07-16T00:00:00.000+02:00",
      "datePublication": null,
      "datePublicationWeb": "2013-07-16T17:45:00.000+02:00"
    }
  },
  "denominationStructurelle": "Proposition de loi",
  "provenance": "Texte Déposé",
  "titres": {
    "titrePrincipal": "proposition de loi permettant la coopération internationale des collectivités territoriales et de leurs groupements dans les domaines de la collecte, du traitement et de la valorisation des déchets",
    "titrePrincipalCourt": "Coopération internationale des collectivités territoriales dans les domaines de la collecte, du traitement et de la valorisation des déchets"
  },
  "divisions": null,
  "dossierRef": "DLR5L14N30632",
  "redacteur": null,
  "classification": {
    "famille": {
      "depot": {
        "code": "INITDEP",
        "libelle": "Initiative en 1er Dépôt"
      },
      "classe": {
        "code": "PIONLOI",
        "libelle": "Proposition de loi"
      }
    },
    "type": {
      "code": "PION",
      "libelle": "Proposition de loi"
    },
    "sousType": null,
    "statutAdoption": null
  },
  "auteurs": {
    "auteur": {
      "acteur": {
        "acteurRef": "PA330008",
        "qualite": "auteur"
      }
    }
  },
  "correction": null,
  "notice": {
    "numNotice": "1253",
    "formule": "permettant la coopération internationale des collectivités territoriales et de leurs groupements dans les domaines de la collecte, du traitement et de la valorisation des déchets",
    "adoptionConforme": "false"
  },
  "indexation": {
    "themes": {
      "@niveau": "1",
      "theme": {
        "libelleTheme": "RESPONSABILITE CIVILE"
      }
    }
  },
  "imprimerie": null,
  "coSignataires": {
    "coSignataire": {
      "acteur": {
        "acteurRef": "PA2792"
      },
      "dateCosignature": "2015-12-16+01:00",
      "dateRetraitCosignature": null,
      "edite": "false"
    }
  },
  "depotAmendements": {
    "amendementsSeance": {
      "amendable": "false",
      "dateLimiteDepot": null
    },
    "amendementsCommission": {
      "commission": {
        "organeRef": "PO59051",
        "amendable": "true",
        "dateLimiteDepot": null
      }
    }
  }
}