{
  "@xsi:type": "texteLoi_Type",
  "uid": "PNREANR5L14BTC0968",
  "legislature": "14",
  "cycleDeVie": {
    "chrono": {
      "dateCreation": "2013-04-17T00:00:00.000+02:00",
      "dateDepot": "2013-04-17T00:00:00.000+02:00",
      "datePublication": "2013-04-23T00:00:00.000+02:00",
      "datePublicationWeb": "2013-04-18T15:45:00.000+02:00"
    }
  },
  "denominationStructurelle": "Proposition de résolution",
  "provenance": "Texte Déposé",
  "titres": {
    "titrePrincipal": "proposition de résolution européenne sur la proposition de résolution européenne de Mme Danielle Auroi et M. Hervé Gaymard, rapporteur de la commission des affaires européennes sur l'avenir de la politique agricole commune après 2013 (n°929)",
    "titrePrincipalCourt": "avenir de la politique agricole commune après 2013"
  },
  "divisions": null,
  "dossierRef": "DLR5L14N30078",
  "redacteur": null,
  "classification": {
    "famille": {
      "depot": {
        "code": "INITDEP",
        "libelle": "Initiative en 1er Dépôt"
      },
      "classe": {
        "code": "PIONRES",
        "libelle": "Proposition de résolution"
      },
      "espece": {
        "code": "TVXINSTITEUROP",
        "libelle": "sur les travaux conduits par les institutions européennes"
      }
    },
    "type": {
      "code": "PNRE",
      "libelle": "Proposition de résolution"
    },
    "sousType": {
      "code": "TVXINSTITEUROP",
      "libelle": "sur les travaux conduits par les institutions européennes"
    },
    "statutAdoption": "ADOPTCOM"
  },
  "auteurs": {
    "auteur": [
      {
        "acteur": {
          "acteurRef": "PA267355",
          "qualite": "rapporteur"
        }
      },
      {
        "acteur": {
          "acteurRef": "PA2343",
          "qualite": "rapporteur"
        }
      },
      {
        "organe": {
          "organeRef": "PO419610"
        }
      }
    ]
  },
  "correction": null,
  "notice": {
    "numNotice": "968",
    "formule": "sur la proposition de résolution européenne de Mme Danielle Auroi et M. Hervé Gaymard, rapporteur de la commission des affaires européennes sur l'avenir de la politique agricole commune après 2013 (n°929)",
    "adoptionConforme": "false"
  },
  "indexation": {
    "themes": {
      "@niveau": "1",
      "theme": {
        "libelleTheme": "CHASSE ET PECHE"
      }
    }
  },
  "imprimerie": {
    "prix": "5.5"
  },
  "coSignataires": null,
  "depotAmendements": null
}