{
  "@xsi:type": "documentEtudeImpact_Type",
  "uid": "ETDISNR5S259B0154",
  "legislature": null,
  "cycleDeVie": {
    "chrono": {
      "dateCreation": "2015-11-16T00:00:00.000+01:00",
      "dateDepot": "2015-11-13T00:00:00.000+01:00",
      "datePublication": "2016-12-21T00:00:00.000+01:00",
      "datePublicationWeb": null
    }
  },
  "denominationStructurelle": "Projet de loi",
  "provenance": "Texte Déposé",
  "titres": {
    "titrePrincipal": "Etude d'impact sur le projet de loi autorisant l’approbation de la convention entre le Gouvernement de la République française et le Conseil fédéral suisse relative aux travaux et au cofinancement par la Suisse de l’opération de réactivation du trafic ferroviaire sur la ligne Belfort–Delle ainsi qu’à l’exploitation de la ligne Belfort–Delle–Delémont",
    "titrePrincipalCourt": "Convention avec le Conseil fédéral suisse sur l'exploitation de la ligne Belfort–Delle–Delémont"
  },
  "divisions": null,
  "dossierRef": "DLR5L14N34435",
  "redacteur": null,
  "classification": {
    "famille": {
      "depot": {
        "code": "INITDEP",
        "libelle": "Initiative en 1er Dépôt"
      },
      "classe": {
        "code": "PRJLOI",
        "libelle": "Projet de loi"
      },
      "espece": {
        "code": "AUTRATCONV",
        "libelle": "autorisant la ratification d'une convention"
      }
    },
    "type": {
      "code": "ETDI",
      "libelle": "Etude d'impact"
    },
    "sousType": {
      "code": "AUTRATCONV",
      "libelle": "autorisant la ratification d'une convention",
      "libelleEdition": "autorisant la ratification d'une convention"
    },
    "statutAdoption": null
  },
  "auteurs": {
    "auteur": {
      "acteur": {
        "acteurRef": "PA267622",
        "qualite": "auteur"
      }
    }
  },
  "correction": null,
  "notice": {
    "numNotice": "154",
    "formule": "autorisant l’approbation de la convention entre le Gouvernement de la République française et le Conseil fédéral suisse relative aux travaux et au cofinancement par la Suisse de l’opération de réactivation du trafic ferroviaire sur la ligne Belfort–Delle ainsi qu’à l’exploitation de la ligne Belfort–Delle–Delémont",
    "adoptionConforme": "false"
  },
  "indexation": null,
  "imprimerie": null
}