{
  "@xsi:type": "texteLoi_Type",
  "uid": "PIONANR5L14B3079",
  "legislature": "14",
  "cycleDeVie": {
    "chrono": {
      "dateCreation": "2015-09-29T00:00:00.000+02:00",
      "dateDepot": "2015-09-29T00:00:00.000+02:00",
      "datePublication": "2017-02-01T00:00:00.000+01:00",
      "datePublicationWeb": "2015-10-01T16:00:00.000+02:00"
    }
  },
  "denominationStructurelle": "Proposition de loi",
  "provenance": "Texte Déposé",
  "titres": {
    "titrePrincipal": "proposition de loi relative aux modalités de dépôt de candidature aux élections",
    "titrePrincipalCourt": "modalités de dépôt de candidature aux élections"
  },
  "divisions": null,
  "dossierRef": "DLR5L14N34301",
  "redacteur": null,
  "classification": {
    "famille": {
      "depot": {
        "code": "INITDEP",
        "libelle": "Initiative en 1er Dépôt"
      },
      "classe": {
        "code": "PIONLOI",
        "libelle": "Proposition de loi"
      }
    },
    "type": {
      "code": "PION",
      "libelle": "Proposition de loi"
    },
    "sousType": null,
    "statutAdoption": null
  },
  "auteurs": {
    "auteur": {
      "acteur": {
        "acteurRef": "PA1886",
        "qualite": "auteur"
      }
    }
  },
  "correction": null,
  "notice": {
    "numNotice": "3079",
    "formule": "relative aux modalités de dépôt de candidature aux élections",
    "adoptionConforme": "false"
  },
  "indexation": null,
  "imprimerie": null,
  "coSignataires": {
    "coSignataire": [
      {
        "acteur": {
          "acteurRef": "PA1198"
        },
        "dateCosignature": "2015-09-29+02:00",
        "dateRetraitCosignature": null,
        "edite": "true"
      },
      {
        "acteur": {
          "acteurRef": "PA267695"
        },
        "dateCosignature": "2015-09-29+02:00",
        "dateRetraitCosignature": null,
        "edite": "false"
      },
      {
        "acteur": {
          "acteurRef": "PA608276"
        },
        "dateCosignature": "2015-09-29+02:00",
        "dateRetraitCosignature": null,
        "edite": "false"
      },
      {
        "acteur": {
          "acteurRef": "PA607892"
        },
        "dateCosignature": "2015-09-29+02:00",
        "dateRetraitCosignature": null,
        "edite": "false"
      },
      {
        "acteur": {
          "acteurRef": "PA606675"
        },
        "dateCosignature": "2015-09-29+02:00",
        "dateRetraitCosignature": null,
        "edite": "false"
      },
      {
        "acteur": {
          "acteurRef": "PA590031"
        },
        "dateCosignature": "2015-09-29+02:00",
        "dateRetraitCosignature": null,
        "edite": "false"
      },
      {
        "acteur": {
          "acteurRef": "PA606631"
        },
        "dateCosignature": "2015-09-29+02:00",
        "dateRetraitCosignature": null,
        "edite": "false"
      },
      {
        "acteur": {
          "acteurRef": "PA642987"
        },
        "dateCosignature": "2015-09-29+02:00",
        "dateRetraitCosignature": null,
        "edite": "false"
      },
      {
        "acteur": {
          "acteurRef": "PA334"
        },
        "dateCosignature": "2015-09-29+02:00",
        "dateRetraitCosignature": null,
        "edite": "false"
      },
      {
        "acteur": {
          "acteurRef": "PA339"
        },
        "dateCosignature": "2015-09-29+02:00",
        "dateRetraitCosignature": null,
        "edite": "false"
      },
      {
        "acteur": {
          "acteurRef": "PA642705"
        },
        "dateCosignature": "2015-09-29+02:00",
        "dateRetraitCosignature": null,
        "edite": "false"
      },
      {
        "acteur": {
          "acteurRef": "PA642724"
        },
        "dateCosignature": "2015-09-29+02:00",
        "dateRetraitCosignature": null,
        "edite": "false"
      },
      {
        "acteur": {
          "acteurRef": "PA607369"
        },
        "dateCosignature": "2015-09-29+02:00",
        "dateRetraitCosignature": null,
        "edite": "false"
      },
      {
        "acteur": {
          "acteurRef": "PA610681"
        },
        "dateCosignature": "2015-09-29+02:00",
        "dateRetraitCosignature": null,
        "edite": "false"
      },
      {
        "acteur": {
          "acteurRef": "PA342415"
        },
        "dateCosignature": "2015-09-29+02:00",
        "dateRetraitCosignature": null,
        "edite": "false"
      },
      {
        "acteur": {
          "acteurRef": "PA608686"
        },
        "dateCosignature": "2015-09-29+02:00",
        "dateRetraitCosignature": null,
        "edite": "false"
      },
      {
        "acteur": {
          "acteurRef": "PA608158"
        },
        "dateCosignature": "2015-09-29+02:00",
        "dateRetraitCosignature": null,
        "edite": "false"
      },
      {
        "acteur": {
          "acteurRef": "PA609845"
        },
        "dateCosignature": "2015-09-29+02:00",
        "dateRetraitCosignature": null,
        "edite": "false"
      },
      {
        "acteur": {
          "acteurRef": "PA342332"
        },
        "dateCosignature": "2015-09-29+02:00",
        "dateRetraitCosignature": null,
        "edite": "false"
      },
      {
        "acteur": {
          "acteurRef": "PA608363"
        },
        "dateCosignature": "2015-09-29+02:00",
        "dateRetraitCosignature": null,
        "edite": "false"
      },
      {
        "acteur": {
          "acteurRef": "PA606899"
        },
        "dateCosignature": "2015-09-29+02:00",
        "dateRetraitCosignature": null,
        "edite": "false"
      },
      {
        "acteur": {
          "acteurRef": "PA608641"
        },
        "dateCosignature": "2015-09-29+02:00",
        "dateRetraitCosignature": null,
        "edite": "false"
      },
      {
        "acteur": {
          "acteurRef": "PA610758"
        },
        "dateCosignature": "2015-09-29+02:00",
        "dateRetraitCosignature": null,
        "edite": "false"
      },
      {
        "acteur": {
          "acteurRef": "PA610968"
        },
        "dateCosignature": "2015-09-29+02:00",
        "dateRetraitCosignature": null,
        "edite": "false"
      },
      {
        "acteur": {
          "acteurRef": "PA267706"
        },
        "dateCosignature": "2015-09-29+02:00",
        "dateRetraitCosignature": null,
        "edite": "false"
      },
      {
        "acteur": {
          "acteurRef": "PA608348"
        },
        "dateCosignature": "2015-09-29+02:00",
        "dateRetraitCosignature": null,
        "edite": "false"
      },
      {
        "acteur": {
          "acteurRef": "PA328"
        },
        "dateCosignature": "2015-09-29+02:00",
        "dateRetraitCosignature": null,
        "edite": "false"
      },
      {
        "acteur": {
          "acteurRef": "PA610066"
        },
        "dateCosignature": "2015-09-29+02:00",
        "dateRetraitCosignature": null,
        "edite": "false"
      },
      {
        "acteur": {
          "acteurRef": "PA356"
        },
        "dateCosignature": "2015-09-29+02:00",
        "dateRetraitCosignature": null,
        "edite": "false"
      },
      {
        "acteur": {
          "acteurRef": "PA381"
        },
        "dateCosignature": "2015-09-29+02:00",
        "dateRetraitCosignature": null,
        "edite": "false"
      },
      {
        "acteur": {
          "acteurRef": "PA394"
        },
        "dateCosignature": "2015-09-29+02:00",
        "dateRetraitCosignature": null,
        "edite": "false"
      },
      {
        "acteur": {
          "acteurRef": "PA335999"
        },
        "dateCosignature": "2015-09-29+02:00",
        "dateRetraitCosignature": null,
        "edite": "false"
      },
      {
        "acteur": {
          "acteurRef": "PA606793"
        },
        "dateCosignature": "2015-09-29+02:00",
        "dateRetraitCosignature": null,
        "edite": "false"
      },
      {
        "acteur": {
          "acteurRef": "PA607310"
        },
        "dateCosignature": "2015-09-29+02:00",
        "dateRetraitCosignature": null,
        "edite": "false"
      },
      {
        "acteur": {
          "acteurRef": "PA605143"
        },
        "dateCosignature": "2015-09-29+02:00",
        "dateRetraitCosignature": null,
        "edite": "false"
      },
      {
        "acteur": {
          "acteurRef": "PA508"
        },
        "dateCosignature": "2015-09-29+02:00",
        "dateRetraitCosignature": null,
        "edite": "false"
      },
      {
        "acteur": {
          "acteurRef": "PA536"
        },
        "dateCosignature": "2015-09-29+02:00",
        "dateRetraitCosignature": null,
        "edite": "false"
      },
      {
        "acteur": {
          "acteurRef": "PA543"
        },
        "dateCosignature": "2015-09-29+02:00",
        "dateRetraitCosignature": null,
        "edite": "false"
      },
      {
        "acteur": {
          "acteurRef": "PA560"
        },
        "dateCosignature": "2015-09-29+02:00",
        "dateRetraitCosignature": null,
        "edite": "false"
      },
      {
        "acteur": {
          "acteurRef": "PA606363"
        },
        "dateCosignature": "2015-09-29+02:00",
        "dateRetraitCosignature": null,
        "edite": "false"
      },
      {
        "acteur": {
          "acteurRef": "PA606507"
        },
        "dateCosignature": "2015-09-29+02:00",
        "dateRetraitCosignature": null,
        "edite": "false"
      },
      {
        "acteur": {
          "acteurRef": "PA332843"
        },
        "dateCosignature": "2015-09-29+02:00",
        "dateRetraitCosignature": null,
        "edite": "false"
      },
      {
        "acteur": {
          "acteurRef": "PA267233"
        },
        "dateCosignature": "2015-09-29+02:00",
        "dateRetraitCosignature": null,
        "edite": "false"
      },
      {
        "acteur": {
          "acteurRef": "PA608083"
        },
        "dateCosignature": "2015-09-29+02:00",
        "dateRetraitCosignature": null,
        "edite": "false"
      },
      {
        "acteur": {
          "acteurRef": "PA610045"
        },
        "dateCosignature": "2015-09-29+02:00",
        "dateRetraitCosignature": null,
        "edite": "false"
      },
      {
        "acteur": {
          "acteurRef": "PA605830"
        },
        "dateCosignature": "2015-09-29+02:00",
        "dateRetraitCosignature": null,
        "edite": "false"
      },
      {
        "acteur": {
          "acteurRef": "PA609314"
        },
        "dateCosignature": "2015-09-29+02:00",
        "dateRetraitCosignature": null,
        "edite": "false"
      },
      {
        "acteur": {
          "acteurRef": "PA605069"
        },
        "dateCosignature": "2015-09-29+02:00",
        "dateRetraitCosignature": null,
        "edite": "false"
      },
      {
        "acteur": {
          "acteurRef": "PA672"
        },
        "dateCosignature": "2015-09-29+02:00",
        "dateRetraitCosignature": null,
        "edite": "false"
      },
      {
        "acteur": {
          "acteurRef": "PA606745"
        },
        "dateCosignature": "2015-09-29+02:00",
        "dateRetraitCosignature": null,
        "edite": "false"
      },
      {
        "acteur": {
          "acteurRef": "PA642739"
        },
        "dateCosignature": "2015-09-29+02:00",
        "dateRetraitCosignature": null,
        "edite": "false"
      },
      {
        "acteur": {
          "acteurRef": "PA605261"
        },
        "dateCosignature": "2015-09-29+02:00",
        "dateRetraitCosignature": null,
        "edite": "false"
      },
      {
        "acteur": {
          "acteurRef": "PA609535"
        },
        "dateCosignature": "2015-09-29+02:00",
        "dateRetraitCosignature": null,
        "edite": "false"
      },
      {
        "acteur": {
          "acteurRef": "PA609743"
        },
        "dateCosignature": "2015-09-29+02:00",
        "dateRetraitCosignature": null,
        "edite": "false"
      },
      {
        "acteur": {
          "acteurRef": "PA695"
        },
        "dateCosignature": "2015-09-29+02:00",
        "dateRetraitCosignature": null,
        "edite": "false"
      },
      {
        "acteur": {
          "acteurRef": "PA605643"
        },
        "dateCosignature": "2015-09-29+02:00",
        "dateRetraitCosignature": null,
        "edite": "false"
      },
      {
        "acteur": {
          "acteurRef": "PA719"
        },
        "dateCosignature": "2015-09-29+02:00",
        "dateRetraitCosignature": null,
        "edite": "false"
      },
      {
        "acteur": {
          "acteurRef": "PA608264"
        },
        "dateCosignature": "2015-09-29+02:00",
        "dateRetraitCosignature": null,
        "edite": "false"
      },
      {
        "acteur": {
          "acteurRef": "PA608098"
        },
        "dateCosignature": "2015-09-29+02:00",
        "dateRetraitCosignature": null,
        "edite": "false"
      },
      {
        "acteur": {
          "acteurRef": "PA735"
        },
        "dateCosignature": "2015-09-29+02:00",
        "dateRetraitCosignature": null,
        "edite": "false"
      },
      {
        "acteur": {
          "acteurRef": "PA590034"
        },
        "dateCosignature": "2015-09-29+02:00",
        "dateRetraitCosignature": null,
        "edite": "false"
      },
      {
        "acteur": {
          "acteurRef": "PA642940"
        },
        "dateCosignature": "2015-09-29+02:00",
        "dateRetraitCosignature": null,
        "edite": "false"
      },
      {
        "acteur": {
          "acteurRef": "PA267188"
        },
        "dateCosignature": "2015-09-29+02:00",
        "dateRetraitCosignature": null,
        "edite": "false"
      },
      {
        "acteur": {
          "acteurRef": "PA605131"
        },
        "dateCosignature": "2015-09-29+02:00",
        "dateRetraitCosignature": null,
        "edite": "false"
      },
      {
        "acteur": {
          "acteurRef": "PA765"
        },
        "dateCosignature": "2015-09-29+02:00",
        "dateRetraitCosignature": null,
        "edite": "false"
      },
      {
        "acteur": {
          "acteurRef": "PA770"
        },
        "dateCosignature": "2015-09-29+02:00",
        "dateRetraitCosignature": null,
        "edite": "false"
      },
      {
        "acteur": {
          "acteurRef": "PA608235"
        },
        "dateCosignature": "2015-09-29+02:00",
        "dateRetraitCosignature": null,
        "edite": "false"
      },
      {
        "acteur": {
          "acteurRef": "PA330118"
        },
        "dateCosignature": "2015-09-29+02:00",
        "dateRetraitCosignature": null,
        "edite": "false"
      },
      {
        "acteur": {
          "acteurRef": "PA810"
        },
        "dateCosignature": "2015-09-29+02:00",
        "dateRetraitCosignature": null,
        "edite": "false"
      },
      {
        "acteur": {
          "acteurRef": "PA606665"
        },
        "dateCosignature": "2015-09-29+02:00",
        "dateRetraitCosignature": null,
        "edite": "false"
      },
      {
        "acteur": {
          "acteurRef": "PA840"
        },
        "dateCosignature": "2015-09-29+02:00",
        "dateRetraitCosignature": null,
        "edite": "false"
      },
      {
        "acteur": {
          "acteurRef": "PA609222"
        },
        "dateCosignature": "2015-09-29+02:00",
        "dateRetraitCosignature": null,
        "edite": "false"
      },
      {
        "acteur": {
          "acteurRef": "PA609042"
        },
        "dateCosignature": "2015-09-29+02:00",
        "dateRetraitCosignature": null,
        "edite": "false"
      },
      {
        "acteur": {
          "acteurRef": "PA605557"
        },
        "dateCosignature": "2015-09-29+02:00",
        "dateRetraitCosignature": null,
        "edite": "false"
      },
      {
        "acteur": {
          "acteurRef": "PA872"
        },
        "dateCosignature": "2015-09-29+02:00",
        "dateRetraitCosignature": null,
        "edite": "false"
      },
      {
        "acteur": {
          "acteurRef": "PA336439"
        },
        "dateCosignature": "2015-09-29+02:00",
        "dateRetraitCosignature": null,
        "edite": "false"
      },
      {
        "acteur": {
          "acteurRef": "PA877"
        },
        "dateCosignature": "2015-09-29+02:00",
        "dateRetraitCosignature": null,
        "edite": "false"
      },
      {
        "acteur": {
          "acteurRef": "PA643020"
        },
        "dateCosignature": "2015-09-29+02:00",
        "dateRetraitCosignature": null,
        "edite": "false"
      },
      {
        "acteur": {
          "acteurRef": "PA643177"
        },
        "dateCosignature": "2015-09-29+02:00",
        "dateRetraitCosignature": null,
        "edite": "false"
      },
      {
        "acteur": {
          "acteurRef": "PA610891"
        },
        "dateCosignature": "2015-09-29+02:00",
        "dateRetraitCosignature": null,
        "edite": "false"
      },
      {
        "acteur": {
          "acteurRef": "PA607256"
        },
        "dateCosignature": "2015-09-29+02:00",
        "dateRetraitCosignature": null,
        "edite": "false"
      },
      {
        "acteur": {
          "acteurRef": "PA344114"
        },
        "dateCosignature": "2015-09-29+02:00",
        "dateRetraitCosignature": null,
        "edite": "false"
      },
      {
        "acteur": {
          "acteurRef": "PA336421"
        },
        "dateCosignature": "2015-09-29+02:00",
        "dateRetraitCosignature": null,
        "edite": "false"
      },
      {
        "acteur": {
          "acteurRef": "PA608310"
        },
        "dateCosignature": "2015-09-29+02:00",
        "dateRetraitCosignature": null,
        "edite": "false"
      },
      {
        "acteur": {
          "acteurRef": "PA334811"
        },
        "dateCosignature": "2015-09-29+02:00",
        "dateRetraitCosignature": null,
        "edite": "false"
      },
      {
        "acteur": {
          "acteurRef": "PA334160"
        },
        "dateCosignature": "2015-09-29+02:00",
        "dateRetraitCosignature": null,
        "edite": "false"
      },
      {
        "acteur": {
          "acteurRef": "PA608920"
        },
        "dateCosignature": "2015-09-29+02:00",
        "dateRetraitCosignature": null,
        "edite": "false"
      },
      {
        "acteur": {
          "acteurRef": "PA607155"
        },
        "dateCosignature": "2015-09-29+02:00",
        "dateRetraitCosignature": null,
        "edite": "false"
      },
      {
        "acteur": {
          "acteurRef": "PA267623"
        },
        "dateCosignature": "2015-09-29+02:00",
        "dateRetraitCosignature": null,
        "edite": "false"
      },
      {
        "acteur": {
          "acteurRef": "PA1032"
        },
        "dateCosignature": "2015-09-29+02:00",
        "dateRetraitCosignature": null,
        "edite": "false"
      },
      {
        "acteur": {
          "acteurRef": "PA342539"
        },
        "dateCosignature": "2015-09-29+02:00",
        "dateRetraitCosignature": null,
        "edite": "false"
      },
      {
        "acteur": {
          "acteurRef": "PA331924"
        },
        "dateCosignature": "2015-09-29+02:00",
        "dateRetraitCosignature": null,
        "edite": "false"
      },
      {
        "acteur": {
          "acteurRef": "PA267923"
        },
        "dateCosignature": "2015-09-29+02:00",
        "dateRetraitCosignature": null,
        "edite": "false"
      },
      {
        "acteur": {
          "acteurRef": "PA606351"
        },
        "dateCosignature": "2015-09-29+02:00",
        "dateRetraitCosignature": null,
        "edite": "false"
      },
      {
        "acteur": {
          "acteurRef": "PA643002"
        },
        "dateCosignature": "2015-09-29+02:00",
        "dateRetraitCosignature": null,
        "edite": "false"
      },
      {
        "acteur": {
          "acteurRef": "PA606623"
        },
        "dateCosignature": "2015-09-29+02:00",
        "dateRetraitCosignature": null,
        "edite": "false"
      },
      {
        "acteur": {
          "acteurRef": "PA609435"
        },
        "dateCosignature": "2015-09-29+02:00",
        "dateRetraitCosignature": null,
        "edite": "false"
      },
      {
        "acteur": {
          "acteurRef": "PA605758"
        },
        "dateCosignature": "2015-09-29+02:00",
        "dateRetraitCosignature": null,
        "edite": "false"
      },
      {
        "acteur": {
          "acteurRef": "PA606040"
        },
        "dateCosignature": "2015-09-29+02:00",
        "dateRetraitCosignature": null,
        "edite": "false"
      },
      {
        "acteur": {
          "acteurRef": "PA1116"
        },
        "dateCosignature": "2015-09-29+02:00",
        "dateRetraitCosignature": null,
        "edite": "false"
      },
      {
        "acteur": {
          "acteurRef": "PA606573"
        },
        "dateCosignature": "2015-09-29+02:00",
        "dateRetraitCosignature": null,
        "edite": "false"
      },
      {
        "acteur": {
          "acteurRef": "PA1155"
        },
        "dateCosignature": "2015-09-29+02:00",
        "dateRetraitCosignature": null,
        "edite": "false"
      },
      {
        "acteur": {
          "acteurRef": "PA610539"
        },
        "dateCosignature": "2015-09-29+02:00",
        "dateRetraitCosignature": null,
        "edite": "false"
      },
      {
        "acteur": {
          "acteurRef": "PA606412"
        },
        "dateCosignature": "2015-09-29+02:00",
        "dateRetraitCosignature": null,
        "edite": "false"
      },
      {
        "acteur": {
          "acteurRef": "PA608718"
        },
        "dateCosignature": "2015-09-29+02:00",
        "dateRetraitCosignature": null,
        "edite": "false"
      },
      {
        "acteur": {
          "acteurRef": "PA1182"
        },
        "dateCosignature": "2015-09-29+02:00",
        "dateRetraitCosignature": null,
        "edite": "false"
      },
      {
        "acteur": {
          "acteurRef": "PA607919"
        },
        "dateCosignature": "2015-09-29+02:00",
        "dateRetraitCosignature": null,
        "edite": "false"
      },
      {
        "acteur": {
          "acteurRef": "PA606202"
        },
        "dateCosignature": "2015-09-29+02:00",
        "dateRetraitCosignature": null,
        "edite": "false"
      },
      {
        "acteur": {
          "acteurRef": "PA1193"
        },
        "dateCosignature": "2015-09-29+02:00",
        "dateRetraitCosignature": null,
        "edite": "false"
      },
      {
        "acteur": {
          "acteurRef": "PA1199"
        },
        "dateCosignature": "2015-09-29+02:00",
        "dateRetraitCosignature": null,
        "edite": "false"
      },
      {
        "acteur": {
          "acteurRef": "PA1208"
        },
        "dateCosignature": "2015-09-29+02:00",
        "dateRetraitCosignature": null,
        "edite": "false"
      },
      {
        "acteur": {
          "acteurRef": "PA1214"
        },
        "dateCosignature": "2015-09-29+02:00",
        "dateRetraitCosignature": null,
        "edite": "false"
      },
      {
        "acteur": {
          "acteurRef": "PA1226"
        },
        "dateCosignature": "2015-09-29+02:00",
        "dateRetraitCosignature": null,
        "edite": "false"
      },
      {
        "acteur": {
          "acteurRef": "PA330357"
        },
        "dateCosignature": "2015-09-29+02:00",
        "dateRetraitCosignature": null,
        "edite": "false"
      },
      {
        "acteur": {
          "acteurRef": "PA1252"
        },
        "dateCosignature": "2015-09-29+02:00",
        "dateRetraitCosignature": null,
        "edite": "false"
      },
      {
        "acteur": {
          "acteurRef": "PA331282"
        },
        "dateCosignature": "2015-09-29+02:00",
        "dateRetraitCosignature": null,
        "edite": "false"
      },
      {
        "acteur": {
          "acteurRef": "PA607193"
        },
        "dateCosignature": "2015-09-29+02:00",
        "dateRetraitCosignature": null,
        "edite": "false"
      },
      {
        "acteur": {
          "acteurRef": "PA605349"
        },
        "dateCosignature": "2015-09-29+02:00",
        "dateRetraitCosignature": null,
        "edite": "false"
      },
      {
        "acteur": {
          "acteurRef": "PA340432"
        },
        "dateCosignature": "2015-09-29+02:00",
        "dateRetraitCosignature": null,
        "edite": "false"
      },
      {
        "acteur": {
          "acteurRef": "PA332015"
        },
        "dateCosignature": "2015-09-29+02:00",
        "dateRetraitCosignature": null,
        "edite": "false"
      },
      {
        "acteur": {
          "acteurRef": "PA609332"
        },
        "dateCosignature": "2015-09-29+02:00",
        "dateRetraitCosignature": null,
        "edite": "false"
      },
      {
        "acteur": {
          "acteurRef": "PA333335"
        },
        "dateCosignature": "2015-09-29+02:00",
        "dateRetraitCosignature": null,
        "edite": "false"
      },
      {
        "acteur": {
          "acteurRef": "PA606171"
        },
        "dateCosignature": "2015-09-29+02:00",
        "dateRetraitCosignature": null,
        "edite": "false"
      },
      {
        "acteur": {
          "acteurRef": "PA333611"
        },
        "dateCosignature": "2015-09-29+02:00",
        "dateRetraitCosignature": null,
        "edite": "false"
      },
      {
        "acteur": {
          "acteurRef": "PA332364"
        },
        "dateCosignature": "2015-09-29+02:00",
        "dateRetraitCosignature": null,
        "edite": "false"
      },
      {
        "acteur": {
          "acteurRef": "PA609775"
        },
        "dateCosignature": "2015-09-29+02:00",
        "dateRetraitCosignature": null,
        "edite": "false"
      },
      {
        "acteur": {
          "acteurRef": "PA343408"
        },
        "dateCosignature": "2015-09-29+02:00",
        "dateRetraitCosignature": null,
        "edite": "false"
      },
      {
        "acteur": {
          "acteurRef": "PA335543"
        },
        "dateCosignature": "2015-09-29+02:00",
        "dateRetraitCosignature": null,
        "edite": "false"
      },
      {
        "acteur": {
          "acteurRef": "PA609691"
        },
        "dateCosignature": "2015-09-29+02:00",
        "dateRetraitCosignature": null,
        "edite": "false"
      },
      {
        "acteur": {
          "acteurRef": "PA1353"
        },
        "dateCosignature": "2015-09-29+02:00",
        "dateRetraitCosignature": null,
        "edite": "false"
      },
      {
        "acteur": {
          "acteurRef": "PA1362"
        },
        "dateCosignature": "2015-09-29+02:00",
        "dateRetraitCosignature": null,
        "edite": "false"
      },
      {
        "acteur": {
          "acteurRef": "PA337568"
        },
        "dateCosignature": "2015-09-29+02:00",
        "dateRetraitCosignature": null,
        "edite": "false"
      },
      {
        "acteur": {
          "acteurRef": "PA332636"
        },
        "dateCosignature": "2015-09-29+02:00",
        "dateRetraitCosignature": null,
        "edite": "false"
      },
      {
        "acteur": {
          "acteurRef": "PA2374"
        },
        "dateCosignature": "2015-09-29+02:00",
        "dateRetraitCosignature": null,
        "edite": "false"
      },
      {
        "acteur": {
          "acteurRef": "PA1401"
        },
        "dateCosignature": "2015-09-29+02:00",
        "dateRetraitCosignature": null,
        "edite": "false"
      },
      {
        "acteur": {
          "acteurRef": "PA333285"
        },
        "dateCosignature": "2015-09-29+02:00",
        "dateRetraitCosignature": null,
        "edite": "false"
      },
      {
        "acteur": {
          "acteurRef": "PA608574"
        },
        "dateCosignature": "2015-09-29+02:00",
        "dateRetraitCosignature": null,
        "edite": "false"
      },
      {
        "acteur": {
          "acteurRef": "PA610203"
        },
        "dateCosignature": "2015-09-29+02:00",
        "dateRetraitCosignature": null,
        "edite": "false"
      },
      {
        "acteur": {
          "acteurRef": "PA332305"
        },
        "dateCosignature": "2015-09-29+02:00",
        "dateRetraitCosignature": null,
        "edite": "false"
      },
      {
        "acteur": {
          "acteurRef": "PA1496"
        },
        "dateCosignature": "2015-09-29+02:00",
        "dateRetraitCosignature": null,
        "edite": "false"
      },
      {
        "acteur": {
          "acteurRef": "PA336971"
        },
        "dateCosignature": "2015-09-29+02:00",
        "dateRetraitCosignature": null,
        "edite": "false"
      },
      {
        "acteur": {
          "acteurRef": "PA642836"
        },
        "dateCosignature": "2015-09-29+02:00",
        "dateRetraitCosignature": null,
        "edite": "false"
      },
      {
        "acteur": {
          "acteurRef": "PA331973"
        },
        "dateCosignature": "2015-09-29+02:00",
        "dateRetraitCosignature": null,
        "edite": "false"
      },
      {
        "acteur": {
          "acteurRef": "PA333043"
        },
        "dateCosignature": "2015-09-29+02:00",
        "dateRetraitCosignature": null,
        "edite": "false"
      },
      {
        "acteur": {
          "acteurRef": "PA609578"
        },
        "dateCosignature": "2015-09-29+02:00",
        "dateRetraitCosignature": null,
        "edite": "false"
      },
      {
        "acteur": {
          "acteurRef": "PA605804"
        },
        "dateCosignature": "2015-09-29+02:00",
        "dateRetraitCosignature": null,
        "edite": "false"
      },
      {
        "acteur": {
          "acteurRef": "PA609218"
        },
        "dateCosignature": "2015-09-29+02:00",
        "dateRetraitCosignature": null,
        "edite": "false"
      },
      {
        "acteur": {
          "acteurRef": "PA336015"
        },
        "dateCosignature": "2015-09-29+02:00",
        "dateRetraitCosignature": null,
        "edite": "false"
      },
      {
        "acteur": {
          "acteurRef": "PA1579"
        },
        "dateCosignature": "2015-09-29+02:00",
        "dateRetraitCosignature": null,
        "edite": "false"
      },
      {
        "acteur": {
          "acteurRef": "PA606161"
        },
        "dateCosignature": "2015-09-29+02:00",
        "dateRetraitCosignature": null,
        "edite": "false"
      },
      {
        "acteur": {
          "acteurRef": "PA1592"
        },
        "dateCosignature": "2015-09-29+02:00",
        "dateRetraitCosignature": null,
        "edite": "false"
      },
      {
        "acteur": {
          "acteurRef": "PA610291"
        },
        "dateCosignature": "2015-09-29+02:00",
        "dateRetraitCosignature": null,
        "edite": "false"
      },
      {
        "acteur": {
          "acteurRef": "PA590032"
        },
        "dateCosignature": "2015-09-29+02:00",
        "dateRetraitCosignature": null,
        "edite": "false"
      },
      {
        "acteur": {
          "acteurRef": "PA610245"
        },
        "dateCosignature": "2015-09-29+02:00",
        "dateRetraitCosignature": null,
        "edite": "false"
      },
      {
        "acteur": {
          "acteurRef": "PA606924"
        },
        "dateCosignature": "2015-09-29+02:00",
        "dateRetraitCosignature": null,
        "edite": "false"
      },
      {
        "acteur": {
          "acteurRef": "PA331835"
        },
        "dateCosignature": "2015-09-29+02:00",
        "dateRetraitCosignature": null,
        "edite": "false"
      },
      {
        "acteur": {
          "acteurRef": "PA1689"
        },
        "dateCosignature": "2015-09-29+02:00",
        "dateRetraitCosignature": null,
        "edite": "false"
      },
      {
        "acteur": {
          "acteurRef": "PA332384"
        },
        "dateCosignature": "2015-09-29+02:00",
        "dateRetraitCosignature": null,
        "edite": "false"
      },
      {
        "acteur": {
          "acteurRef": "PA268039"
        },
        "dateCosignature": "2015-09-29+02:00",
        "dateRetraitCosignature": null,
        "edite": "false"
      },
      {
        "acteur": {
          "acteurRef": "PA1710"
        },
        "dateCosignature": "2015-09-29+02:00",
        "dateRetraitCosignature": null,
        "edite": "false"
      },
      {
        "acteur": {
          "acteurRef": "PA330613"
        },
        "dateCosignature": "2015-09-29+02:00",
        "dateRetraitCosignature": null,
        "edite": "false"
      },
      {
        "acteur": {
          "acteurRef": "PA332614"
        },
        "dateCosignature": "2015-09-29+02:00",
        "dateRetraitCosignature": null,
        "edite": "false"
      },
      {
        "acteur": {
          "acteurRef": "PA1748"
        },
        "dateCosignature": "2015-09-29+02:00",
        "dateRetraitCosignature": null,
        "edite": "false"
      },
      {
        "acteur": {
          "acteurRef": "PA607691"
        },
        "dateCosignature": "2015-09-29+02:00",
        "dateRetraitCosignature": null,
        "edite": "false"
      },
      {
        "acteur": {
          "acteurRef": "PA335054"
        },
        "dateCosignature": "2015-09-29+02:00",
        "dateRetraitCosignature": null,
        "edite": "false"
      },
      {
        "acteur": {
          "acteurRef": "PA344242"
        },
        "dateCosignature": "2015-09-29+02:00",
        "dateRetraitCosignature": null,
        "edite": "false"
      },
      {
        "acteur": {
          "acteurRef": "PA607509"
        },
        "dateCosignature": "2015-09-29+02:00",
        "dateRetraitCosignature": null,
        "edite": "false"
      },
      {
        "acteur": {
          "acteurRef": "PA608785"
        },
        "dateCosignature": "2015-09-29+02:00",
        "dateRetraitCosignature": null,
        "edite": "false"
      },
      {
        "acteur": {
          "acteurRef": "PA1789"
        },
        "dateCosignature": "2015-09-29+02:00",
        "dateRetraitCosignature": null,
        "edite": "false"
      },
      {
        "acteur": {
          "acteurRef": "PA1816"
        },
        "dateCosignature": "2015-09-29+02:00",
        "dateRetraitCosignature": null,
        "edite": "false"
      },
      {
        "acteur": {
          "acteurRef": "PA643205"
        },
        "dateCosignature": "2015-09-29+02:00",
        "dateRetraitCosignature": null,
        "edite": "false"
      },
      {
        "acteur": {
          "acteurRef": "PA341339"
        },
        "dateCosignature": "2015-09-29+02:00",
        "dateRetraitCosignature": null,
        "edite": "false"
      },
      {
        "acteur": {
          "acteurRef": "PA1844"
        },
        "dateCosignature": "2015-09-29+02:00",
        "dateRetraitCosignature": null,
        "edite": "false"
      },
      {
        "acteur": {
          "acteurRef": "PA610936"
        },
        "dateCosignature": "2015-09-29+02:00",
        "dateRetraitCosignature": null,
        "edite": "false"
      },
      {
        "acteur": {
          "acteurRef": "PA267835"
        },
        "dateCosignature": "2015-09-29+02:00",
        "dateRetraitCosignature": null,
        "edite": "false"
      },
      {
        "acteur": {
          "acteurRef": "PA337550"
        },
        "dateCosignature": "2015-09-29+02:00",
        "dateRetraitCosignature": null,
        "edite": "false"
      },
      {
        "acteur": {
          "acteurRef": "PA1866"
        },
        "dateCosignature": "2015-09-29+02:00",
        "dateRetraitCosignature": null,
        "edite": "false"
      },
      {
        "acteur": {
          "acteurRef": "PA606555"
        },
        "dateCosignature": "2015-09-29+02:00",
        "dateRetraitCosignature": null,
        "edite": "false"
      },
      {
        "acteur": {
          "acteurRef": "PA1871"
        },
        "dateCosignature": "2015-09-29+02:00",
        "dateRetraitCosignature": null,
        "edite": "false"
      },
      {
        "acteur": {
          "acteurRef": "PA341246"
        },
        "dateCosignature": "2015-09-29+02:00",
        "dateRetraitCosignature": null,
        "edite": "false"
      },
      {
        "acteur": {
          "acteurRef": "PA1911"
        },
        "dateCosignature": "2015-09-29+02:00",
        "dateRetraitCosignature": null,
        "edite": "false"
      },
      {
        "acteur": {
          "acteurRef": "PA610594"
        },
        "dateCosignature": "2015-09-29+02:00",
        "dateRetraitCosignature": null,
        "edite": "false"
      },
      {
        "acteur": {
          "acteurRef": "PA605888"
        },
        "dateCosignature": "2015-09-29+02:00",
        "dateRetraitCosignature": null,
        "edite": "false"
      },
      {
        "acteur": {
          "acteurRef": "PA331658"
        },
        "dateCosignature": "2015-09-29+02:00",
        "dateRetraitCosignature": null,
        "edite": "false"
      },
      {
        "acteur": {
          "acteurRef": "PA1936"
        },
        "dateCosignature": "2015-09-29+02:00",
        "dateRetraitCosignature": null,
        "edite": "false"
      },
      {
        "acteur": {
          "acteurRef": "PA331753"
        },
        "dateCosignature": "2015-09-29+02:00",
        "dateRetraitCosignature": null,
        "edite": "false"
      },
      {
        "acteur": {
          "acteurRef": "PA605278"
        },
        "dateCosignature": "2015-09-29+02:00",
        "dateRetraitCosignature": null,
        "edite": "false"
      },
      {
        "acteur": {
          "acteurRef": "PA267965"
        },
        "dateCosignature": "2015-09-29+02:00",
        "dateRetraitCosignature": null,
        "edite": "false"
      },
      {
        "acteur": {
          "acteurRef": "PA607606"
        },
        "dateCosignature": "2015-09-29+02:00",
        "dateRetraitCosignature": null,
        "edite": "false"
      },
      {
        "acteur": {
          "acteurRef": "PA610905"
        },
        "dateCosignature": "2015-09-29+02:00",
        "dateRetraitCosignature": null,
        "edite": "false"
      },
      {
        "acteur": {
          "acteurRef": "PA1963"
        },
        "dateCosignature": "2015-09-29+02:00",
        "dateRetraitCosignature": null,
        "edite": "false"
      },
      {
        "acteur": {
          "acteurRef": "PA330130"
        },
        "dateCosignature": "2015-09-29+02:00",
        "dateRetraitCosignature": null,
        "edite": "false"
      },
      {
        "acteur": {
          "acteurRef": "PA642962"
        },
        "dateCosignature": "2015-09-29+02:00",
        "dateRetraitCosignature": null,
        "edite": "false"
      },
      {
        "acteur": {
          "acteurRef": "PA1977"
        },
        "dateCosignature": "2015-09-29+02:00",
        "dateRetraitCosignature": null,
        "edite": "false"
      },
      {
        "acteur": {
          "acteurRef": "PA1979"
        },
        "dateCosignature": "2015-09-29+02:00",
        "dateRetraitCosignature": null,
        "edite": "false"
      },
      {
        "acteur": {
          "acteurRef": "PA607761"
        },
        "dateCosignature": "2015-09-29+02:00",
        "dateRetraitCosignature": null,
        "edite": "false"
      },
      {
        "acteur": {
          "acteurRef": "PA1991"
        },
        "dateCosignature": "2015-09-29+02:00",
        "dateRetraitCosignature": null,
        "edite": "false"
      },
      {
        "acteur": {
          "acteurRef": "PA607283"
        },
        "dateCosignature": "2015-09-29+02:00",
        "dateRetraitCosignature": null,
        "edite": "false"
      },
      {
        "acteur": {
          "acteurRef": "PA268048"
        },
        "dateCosignature": "2015-09-29+02:00",
        "dateRetraitCosignature": null,
        "edite": "false"
      },
      {
        "acteur": {
          "acteurRef": "PA334116"
        },
        "dateCosignature": "2015-09-29+02:00",
        "dateRetraitCosignature": null,
        "edite": "false"
      },
      {
        "acteur": {
          "acteurRef": "PA330546"
        },
        "dateCosignature": "2015-09-29+02:00",
        "dateRetraitCosignature": null,
        "edite": "false"
      },
      {
        "acteur": {
          "acteurRef": "PA332206"
        },
        "dateCosignature": "2015-09-29+02:00",
        "dateRetraitCosignature": null,
        "edite": "false"
      },
      {
        "acteur": {
          "acteurRef": "PA267278"
        },
        "dateCosignature": "2015-09-29+02:00",
        "dateRetraitCosignature": null,
        "edite": "false"
      },
      {
        "acteur": {
          "acteurRef": "PA331807"
        },
        "dateCosignature": "2015-09-29+02:00",
        "dateRetraitCosignature": null,
        "edite": "false"
      },
      {
        "acteur": {
          "acteurRef": "PA267091"
        },
        "dateCosignature": "2015-09-29+02:00",
        "dateRetraitCosignature": null,
        "edite": "false"
      },
      {
        "acteur": {
          "acteurRef": "PA335319"
        },
        "dateCosignature": "2015-09-29+02:00",
        "dateRetraitCosignature": null,
        "edite": "false"
      },
      {
        "acteur": {
          "acteurRef": "PA332796"
        },
        "dateCosignature": "2015-09-29+02:00",
        "dateRetraitCosignature": null,
        "edite": "false"
      },
      {
        "acteur": {
          "acteurRef": "PA605426"
        },
        "dateCosignature": "2015-09-29+02:00",
        "dateRetraitCosignature": null,
        "edite": "false"
      },
      {
        "acteur": {
          "acteurRef": "PA267479"
        },
        "dateCosignature": "2015-09-29+02:00",
        "dateRetraitCosignature": null,
        "edite": "false"
      },
      {
        "acteur": {
          "acteurRef": "PA334755"
        },
        "dateCosignature": "2015-09-29+02:00",
        "dateRetraitCosignature": null,
        "edite": "false"
      },
      {
        "acteur": {
          "acteurRef": "PA2265"
        },
        "dateCosignature": "2015-09-29+02:00",
        "dateRetraitCosignature": null,
        "edite": "false"
      },
      {
        "acteur": {
          "acteurRef": "PA606030"
        },
        "dateCosignature": "2015-09-29+02:00",
        "dateRetraitCosignature": null,
        "edite": "false"
      },
      {
        "acteur": {
          "acteurRef": "PA642885"
        },
        "dateCosignature": "2015-09-29+02:00",
        "dateRetraitCosignature": null,
        "edite": "false"
      },
      {
        "acteur": {
          "acteurRef": "PA609983"
        },
        "dateCosignature": "2015-09-29+02:00",
        "dateRetraitCosignature": null,
        "edite": "false"
      },
      {
        "acteur": {
          "acteurRef": "PA610729"
        },
        "dateCosignature": "2015-09-29+02:00",
        "dateRetraitCosignature": null,
        "edite": "false"
      },
      {
        "acteur": {
          "acteurRef": "PA2317"
        },
        "dateCosignature": "2015-09-29+02:00",
        "dateRetraitCosignature": null,
        "edite": "false"
      },
      {
        "acteur": {
          "acteurRef": "PA267534"
        },
        "dateCosignature": "2015-09-29+02:00",
        "dateRetraitCosignature": null,
        "edite": "false"
      },
      {
        "acteur": {
          "acteurRef": "PA2338"
        },
        "dateCosignature": "2015-09-29+02:00",
        "dateRetraitCosignature": null,
        "edite": "false"
      },
      {
        "acteur": {
          "acteurRef": "PA607769"
        },
        "dateCosignature": "2015-09-29+02:00",
        "dateRetraitCosignature": null,
        "edite": "false"
      },
      {
        "acteur": {
          "acteurRef": "PA2343"
        },
        "dateCosignature": "2015-09-29+02:00",
        "dateRetraitCosignature": null,
        "edite": "false"
      },
      {
        "acteur": {
          "acteurRef": "PA2365"
        },
        "dateCosignature": "2015-09-29+02:00",
        "dateRetraitCosignature": null,
        "edite": "false"
      },
      {
        "acteur": {
          "acteurRef": "PA610075"
        },
        "dateCosignature": "2015-09-29+02:00",
        "dateRetraitCosignature": null,
        "edite": "false"
      },
      {
        "acteur": {
          "acteurRef": "PA608172"
        },
        "dateCosignature": "2015-09-29+02:00",
        "dateRetraitCosignature": null,
        "edite": "false"
      },
      {
        "acteur": {
          "acteurRef": "PA2430"
        },
        "dateCosignature": "2015-09-29+02:00",
        "dateRetraitCosignature": null,
        "edite": "false"
      },
      {
        "acteur": {
          "acteurRef": "PA610313"
        },
        "dateCosignature": "2015-09-29+02:00",
        "dateRetraitCosignature": null,
        "edite": "false"
      },
      {
        "acteur": {
          "acteurRef": "PA610354"
        },
        "dateCosignature": "2015-09-29+02:00",
        "dateRetraitCosignature": null,
        "edite": "false"
      },
      {
        "acteur": {
          "acteurRef": "PA607553"
        },
        "dateCosignature": "2015-09-29+02:00",
        "dateRetraitCosignature": null,
        "edite": "false"
      },
      {
        "acteur": {
          "acteurRef": "PA609963"
        },
        "dateCosignature": "2015-09-29+02:00",
        "dateRetraitCosignature": null,
        "edite": "false"
      },
      {
        "acteur": {
          "acteurRef": "PA642805"
        },
        "dateCosignature": "2015-09-29+02:00",
        "dateRetraitCosignature": null,
        "edite": "false"
      },
      {
        "acteur": {
          "acteurRef": "PA606225"
        },
        "dateCosignature": "2015-09-29+02:00",
        "dateRetraitCosignature": null,
        "edite": "false"
      },
      {
        "acteur": {
          "acteurRef": "PA643069"
        },
        "dateCosignature": "2015-09-29+02:00",
        "dateRetraitCosignature": null,
        "edite": "false"
      },
      {
        "acteur": {
          "acteurRef": "PA608011"
        },
        "dateCosignature": "2015-09-29+02:00",
        "dateRetraitCosignature": null,
        "edite": "false"
      },
      {
        "acteur": {
          "acteurRef": "PA405480"
        },
        "dateCosignature": "2015-09-29+02:00",
        "dateRetraitCosignature": null,
        "edite": "false"
      },
      {
        "acteur": {
          "acteurRef": "PA331014"
        },
        "dateCosignature": "2015-09-29+02:00",
        "dateRetraitCosignature": null,
        "edite": "false"
      },
      {
        "acteur": {
          "acteurRef": "PA609590"
        },
        "dateCosignature": "2015-09-29+02:00",
        "dateRetraitCosignature": null,
        "edite": "false"
      },
      {
        "acteur": {
          "acteurRef": "PA607187"
        },
        "dateCosignature": "2015-09-29+02:00",
        "dateRetraitCosignature": null,
        "edite": "false"
      },
      {
        "acteur": {
          "acteurRef": "PA2503"
        },
        "dateCosignature": "2015-09-29+02:00",
        "dateRetraitCosignature": null,
        "edite": "false"
      },
      {
        "acteur": {
          "acteurRef": "PA341981"
        },
        "dateCosignature": "2015-09-29+02:00",
        "dateRetraitCosignature": null,
        "edite": "false"
      },
      {
        "acteur": {
          "acteurRef": "PA2549"
        },
        "dateCosignature": "2015-09-29+02:00",
        "dateRetraitCosignature": null,
        "edite": "false"
      },
      {
        "acteur": {
          "acteurRef": "PA642790"
        },
        "dateCosignature": "2015-09-29+02:00",
        "dateRetraitCosignature": null,
        "edite": "false"
      },
      {
        "acteur": {
          "acteurRef": "PA609292"
        },
        "dateCosignature": "2015-09-29+02:00",
        "dateRetraitCosignature": null,
        "edite": "false"
      },
      {
        "acteur": {
          "acteurRef": "PA606991"
        },
        "dateCosignature": "2015-09-29+02:00",
        "dateRetraitCosignature": null,
        "edite": "false"
      },
      {
        "acteur": {
          "acteurRef": "PA2600"
        },
        "dateCosignature": "2015-09-29+02:00",
        "dateRetraitCosignature": null,
        "edite": "false"
      },
      {
        "acteur": {
          "acteurRef": "PA2603"
        },
        "dateCosignature": "2015-09-29+02:00",
        "dateRetraitCosignature": null,
        "edite": "false"
      },
      {
        "acteur": {
          "acteurRef": "PA606586"
        },
        "dateCosignature": "2015-09-29+02:00",
        "dateRetraitCosignature": null,
        "edite": "false"
      },
      {
        "acteur": {
          "acteurRef": "PA605952"
        },
        "dateCosignature": "2015-09-29+02:00",
        "dateRetraitCosignature": null,
        "edite": "false"
      },
      {
        "acteur": {
          "acteurRef": "PA2611"
        },
        "dateCosignature": "2015-09-29+02:00",
        "dateRetraitCosignature": null,
        "edite": "false"
      },
      {
        "acteur": {
          "acteurRef": "PA343493"
        },
        "dateCosignature": "2015-09-29+02:00",
        "dateRetraitCosignature": null,
        "edite": "false"
      },
      {
        "acteur": {
          "acteurRef": "PA2631"
        },
        "dateCosignature": "2015-09-29+02:00",
        "dateRetraitCosignature": null,
        "edite": "false"
      },
      {
        "acteur": {
          "acteurRef": "PA331990"
        },
        "dateCosignature": "2015-09-29+02:00",
        "dateRetraitCosignature": null,
        "edite": "false"
      },
      {
        "acteur": {
          "acteurRef": "PA608778"
        },
        "dateCosignature": "2015-09-29+02:00",
        "dateRetraitCosignature": null,
        "edite": "false"
      },
      {
        "acteur": {
          "acteurRef": "PA2685"
        },
        "dateCosignature": "2015-09-29+02:00",
        "dateRetraitCosignature": null,
        "edite": "false"
      },
      {
        "acteur": {
          "acteurRef": "PA2693"
        },
        "dateCosignature": "2015-09-29+02:00",
        "dateRetraitCosignature": null,
        "edite": "false"
      },
      {
        "acteur": {
          "acteurRef": "PA606495"
        },
        "dateCosignature": "2015-09-29+02:00",
        "dateRetraitCosignature": null,
        "edite": "false"
      },
      {
        "acteur": {
          "acteurRef": "PA610529"
        },
        "dateCosignature": "2015-09-29+02:00",
        "dateRetraitCosignature": null,
        "edite": "false"
      },
      {
        "acteur": {
          "acteurRef": "PA335017"
        },
        "dateCosignature": "2015-09-29+02:00",
        "dateRetraitCosignature": null,
        "edite": "false"
      },
      {
        "acteur": {
          "acteurRef": "PA610195"
        },
        "dateCosignature": "2015-09-29+02:00",
        "dateRetraitCosignature": null,
        "edite": "false"
      },
      {
        "acteur": {
          "acteurRef": "PA605703"
        },
        "dateCosignature": "2015-09-29+02:00",
        "dateRetraitCosignature": null,
        "edite": "false"
      },
      {
        "acteur": {
          "acteurRef": "PA2799"
        },
        "dateCosignature": "2015-09-29+02:00",
        "dateRetraitCosignature": null,
        "edite": "false"
      },
      {
        "acteur": {
          "acteurRef": "PA608741"
        },
        "dateCosignature": "2015-09-29+02:00",
        "dateRetraitCosignature": null,
        "edite": "false"
      },
      {
        "acteur": {
          "acteurRef": "PA334768"
        },
        "dateCosignature": "2015-09-29+02:00",
        "dateRetraitCosignature": null,
        "edite": "false"
      },
      {
        "acteur": {
          "acteurRef": "PA607395"
        },
        "dateCosignature": "2015-09-29+02:00",
        "dateRetraitCosignature": null,
        "edite": "false"
      },
      {
        "acteur": {
          "acteurRef": "PA609205"
        },
        "dateCosignature": "2015-09-29+02:00",
        "dateRetraitCosignature": null,
        "edite": "false"
      },
      {
        "acteur": {
          "acteurRef": "PA608695"
        },
        "dateCosignature": "2015-09-29+02:00",
        "dateRetraitCosignature": null,
        "edite": "false"
      },
      {
        "acteur": {
          "acteurRef": "PA331594"
        },
        "dateCosignature": "2015-09-29+02:00",
        "dateRetraitCosignature": null,
        "edite": "false"
      },
      {
        "acteur": {
          "acteurRef": "PA2859"
        },
        "dateCosignature": "2015-09-29+02:00",
        "dateRetraitCosignature": null,
        "edite": "false"
      },
      {
        "acteur": {
          "acteurRef": "PA336112"
        },
        "dateCosignature": "2015-09-29+02:00",
        "dateRetraitCosignature": null,
        "edite": "false"
      },
      {
        "acteur": {
          "acteurRef": "PA2883"
        },
        "dateCosignature": "2015-09-29+02:00",
        "dateRetraitCosignature": null,
        "edite": "false"
      },
      {
        "acteur": {
          "acteurRef": "PA606230"
        },
        "dateCosignature": "2015-09-29+02:00",
        "dateRetraitCosignature": null,
        "edite": "false"
      },
      {
        "acteur": {
          "acteurRef": "PA2895"
        },
        "dateCosignature": "2015-09-29+02:00",
        "dateRetraitCosignature": null,
        "edite": "false"
      },
      {
        "acteur": {
          "acteurRef": "PA606639"
        },
        "dateCosignature": "2015-09-29+02:00",
        "dateRetraitCosignature": null,
        "edite": "false"
      },
      {
        "acteur": {
          "acteurRef": "PA334951"
        },
        "dateCosignature": "2015-09-29+02:00",
        "dateRetraitCosignature": null,
        "edite": "false"
      },
      {
        "acteur": {
          "acteurRef": "PA610701"
        },
        "dateCosignature": "2015-09-29+02:00",
        "dateRetraitCosignature": null,
        "edite": "false"
      },
      {
        "acteur": {
          "acteurRef": "PA607699"
        },
        "dateCosignature": "2015-09-29+02:00",
        "dateRetraitCosignature": null,
        "edite": "false"
      },
      {
        "acteur": {
          "acteurRef": "PA605076"
        },
        "dateCosignature": "2015-09-29+02:00",
        "dateRetraitCosignature": null,
        "edite": "false"
      },
      {
        "acteur": {
          "acteurRef": "PA337504"
        },
        "dateCosignature": "2015-09-29+02:00",
        "dateRetraitCosignature": null,
        "edite": "false"
      },
      {
        "acteur": {
          "acteurRef": "PA606149"
        },
        "dateCosignature": "2015-09-29+02:00",
        "dateRetraitCosignature": null,
        "edite": "false"
      },
      {
        "acteur": {
          "acteurRef": "PA608038"
        },
        "dateCosignature": "2015-09-29+02:00",
        "dateRetraitCosignature": null,
        "edite": "false"
      },
      {
        "acteur": {
          "acteurRef": "PA608684"
        },
        "dateCosignature": "2015-09-29+02:00",
        "dateRetraitCosignature": null,
        "edite": "false"
      },
      {
        "acteur": {
          "acteurRef": "PA333818"
        },
        "dateCosignature": "2015-09-29+02:00",
        "dateRetraitCosignature": null,
        "edite": "false"
      },
      {
        "acteur": {
          "acteurRef": "PA610481"
        },
        "dateCosignature": "2015-09-29+02:00",
        "dateRetraitCosignature": null,
        "edite": "false"
      },
      {
        "acteur": {
          "acteurRef": "PA337483"
        },
        "dateCosignature": "2015-09-29+02:00",
        "dateRetraitCosignature": null,
        "edite": "false"
      },
      {
        "acteur": {
          "acteurRef": "PA268042"
        },
        "dateCosignature": "2015-09-29+02:00",
        "dateRetraitCosignature": null,
        "edite": "false"
      },
      {
        "acteur": {
          "acteurRef": "PA607595"
        },
        "dateCosignature": "2015-09-29+02:00",
        "dateRetraitCosignature": null,
        "edite": "false"
      },
      {
        "acteur": {
          "acteurRef": "PA693008"
        },
        "dateCosignature": "2015-09-29+02:00",
        "dateRetraitCosignature": null,
        "edite": "false"
      },
      {
        "acteur": {
          "acteurRef": "PA610752"
        },
        "dateCosignature": "2015-09-29+02:00",
        "dateRetraitCosignature": null,
        "edite": "false"
      }
    ]
  },
  "depotAmendements": {
    "amendementsSeance": {
      "amendable": "false",
      "dateLimiteDepot": null
    },
    "amendementsCommission": {
      "commission": {
        "organeRef": "PO59051",
        "amendable": "true",
        "dateLimiteDepot": null
      }
    }
  }
}