{
  "@xsi:type": "texteLoi_Type",
  "uid": "PIONANR5L14B3438",
  "legislature": "14",
  "cycleDeVie": {
    "chrono": {
      "dateCreation": "2016-01-21T00:00:00.000+01:00",
      "dateDepot": "2016-01-26T00:00:00.000+01:00",
      "datePublication": null,
      "datePublicationWeb": "2016-01-28T12:30:00.000+01:00"
    }
  },
  "denominationStructurelle": "Proposition de loi",
  "provenance": "Texte Déposé",
  "titres": {
    "titrePrincipal": "proposition de loi visant à interdire le gavage des palmipèdes pour la production de foie gras",
    "titrePrincipalCourt": "interdire le gavage des palmipèdes pour la production de foie gras"
  },
  "divisions": null,
  "dossierRef": "DLR5L14N34645",
  "redacteur": null,
  "classification": {
    "famille": {
      "depot": {
        "code": "INITDEP",
        "libelle": "Initiative en 1er Dépôt"
      },
      "classe": {
        "code": "PIONLOI",
        "libelle": "Proposition de loi"
      }
    },
    "type": {
      "code": "PION",
      "libelle": "Proposition de loi"
    },
    "sousType": null,
    "statutAdoption": null
  },
  "auteurs": {
    "auteur": {
      "acteur": {
        "acteurRef": "PA610427",
        "qualite": "auteur"
      }
    }
  },
  "correction": null,
  "notice": {
    "numNotice": "3438",
    "formule": "visant à interdire le gavage des palmipèdes pour la production de foie gras",
    "adoptionConforme": "false"
  },
  "indexation": null,
  "imprimerie": null,
  "coSignataires": {
    "coSignataire": [
      {
        "acteur": {
          "acteurRef": "PA605625"
        },
        "dateCosignature": "2016-01-26+01:00",
        "dateRetraitCosignature": null,
        "edite": "false"
      },
      {
        "acteur": {
          "acteurRef": "PA610860"
        },
        "dateCosignature": "2016-01-26+01:00",
        "dateRetraitCosignature": null,
        "edite": "false"
      }
    ]
  },
  "depotAmendements": {
    "amendementsSeance": {
      "amendable": "false",
      "dateLimiteDepot": null
    },
    "amendementsCommission": {
      "commission": {
        "organeRef": "PO419610",
        "amendable": "true",
        "dateLimiteDepot": null
      }
    }
  }
}