{
  "@xsi:type": "rapportParlementaire_Type",
  "uid": "RAPPSNR5S239B0263",
  "legislature": null,
  "cycleDeVie": {
    "chrono": {
      "dateCreation": "2015-01-29T00:00:00.000+01:00",
      "dateDepot": "2015-01-28T00:00:00.000+01:00",
      "datePublication": null,
      "datePublicationWeb": null
    }
  },
  "denominationStructurelle": "Rapport",
  "provenance": "Commission",
  "titres": {
    "titrePrincipal": "rapport sur   le projet de loi , adopté, par l'Assemblée nationale après engagement de la procédure accélérée, relatif à la transition énergétique pour la croissance verte (n°16)",
    "titrePrincipalCourt": "rapport sur   le projet de loi , adopté, par l'Assemblée nationale après engagement de la procédure accélérée, relatif à la transition énergétique pour la croissance verte (n°16)"
  },
  "divisions": {
    "division": [
      {
        "@xsi:type": "rapportParlementaire_Type",
        "uid": "RAPPSNR5S239B0263-tI",
        "legislature": null,
        "cycleDeVie": {
          "chrono": {
            "dateCreation": "2015-01-29T00:00:00.000+01:00",
            "dateDepot": "2015-01-28T00:00:00.000+01:00",
            "datePublication": null,
            "datePublicationWeb": null
          }
        },
        "denominationStructurelle": "Tome I",
        "titres": {
          "titrePrincipal": "Rapport",
          "titrePrincipalCourt": "Rapport"
        },
        "divisions": null,
        "dossierRef": "DLR5L14N33352",
        "redacteur": null,
        "classification": {
          "famille": null,
          "type": {
            "code": "RAPP",
            "libelle": "Rapport"
          },
          "sousType": null,
          "statutAdoption": null
        },
        "auteurs": {
          "auteur": [
            {
              "acteur": {
                "acteurRef": "PA2447",
                "qualite": "rapporteur"
              }
            },
            {
              "organe": {
                "organeRef": "PO516753"
              }
            }
          ]
        },
        "correction": null,
        "notice": {
          "numNotice": "263",
          "formule": "sur   le projet de loi , adopté, par l'Assemblée nationale après engagement de la procédure accélérée, relatif à la transition énergétique pour la croissance verte (n°16)",
          "adoptionConforme": "false"
        },
        "indexation": null,
        "imprimerie": null
      },
      {
        "@xsi:type": "rapportParlementaire_Type",
        "uid": "RAPPSNR5S239B0263-tII",
        "legislature": null,
        "cycleDeVie": {
          "chrono": {
            "dateCreation": "2015-01-29T00:00:00.000+01:00",
            "dateDepot": "2015-01-28T00:00:00.000+01:00",
            "datePublication": null,
            "datePublicationWeb": null
          }
        },
        "denominationStructurelle": "Tome II",
        "titres": {
          "titrePrincipal": "Tableau comparatif",
          "titrePrincipalCourt": "Tableau comparatif"
        },
        "divisions": null,
        "dossierRef": "DLR5L14N33352",
        "redacteur": null,
        "classification": {
          "famille": null,
          "type": {
            "code": "RAPP",
            "libelle": "Rapport"
          },
          "sousType": null,
          "statutAdoption": null
        },
        "auteurs": {
          "auteur": [
            {
              "acteur": {
                "acteurRef": "PA2447",
                "qualite": "rapporteur"
              }
            },
            {
              "organe": {
                "organeRef": "PO516753"
              }
            }
          ]
        },
        "correction": null,
        "notice": {
          "numNotice": "263",
          "formule": "sur   le projet de loi , adopté, par l'Assemblée nationale après engagement de la procédure accélérée, relatif à la transition énergétique pour la croissance verte (n°16)",
          "adoptionConforme": "false"
        },
        "indexation": null,
        "imprimerie": null
      }
    ]
  },
  "dossierRef": "DLR5L14N33352",
  "redacteur": null,
  "classification": {
    "famille": {
      "depot": {
        "code": "RAPINIT",
        "libelle": "Rapport sur une initiative"
      },
      "classe": {
        "code": "RAPPORT",
        "libelle": "Rapport"
      }
    },
    "type": {
      "code": "RAPP",
      "libelle": "Rapport"
    },
    "sousType": null,
    "statutAdoption": null
  },
  "auteurs": {
    "auteur": [
      {
        "acteur": {
          "acteurRef": "PA2447",
          "qualite": "rapporteur"
        }
      },
      {
        "organe": {
          "organeRef": "PO516753"
        }
      }
    ]
  },
  "correction": null,
  "notice": {
    "numNotice": "263",
    "formule": "sur   le projet de loi , adopté, par l'Assemblée nationale après engagement de la procédure accélérée, relatif à la transition énergétique pour la croissance verte (n°16)",
    "adoptionConforme": "false"
  },
  "indexation": null,
  "imprimerie": null
}