{
  "@xsi:type": "texteLoi_Type",
  "uid": "PRJLANR5L14BTC0883",
  "legislature": "14",
  "cycleDeVie": {
    "chrono": {
      "dateCreation": "2013-04-03T00:00:00.000+02:00",
      "dateDepot": "2013-04-03T00:00:00.000+02:00",
      "datePublication": "2013-04-05T00:00:00.000+02:00",
      "datePublicationWeb": "2013-04-03T19:35:00.000+02:00"
    }
  },
  "denominationStructurelle": "Projet de loi",
  "provenance": "Texte Déposé",
  "titres": {
    "titrePrincipal": "projet de loi sur , en nouvelle lecture,  le projet de loi , modifié par l'Assemblée nationale en deuxième lecture, relatif à l'élection des conseillers départementaux, des conseillers municipaux et des conseillers communautaires, et modifiant le calendrier électoral (n°878)",
    "titrePrincipalCourt": "Election des conseillers départementaux, des conseillers municipaux, des conseillers communautaires et modification du calendrier électoral"
  },
  "divisions": null,
  "dossierRef": "DLR5L14N29393",
  "redacteur": null,
  "classification": {
    "famille": {
      "depot": {
        "code": "INITNAV",
        "libelle": "Initiative en Navette"
      },
      "classe": {
        "code": "PRJLOI",
        "libelle": "Projet de loi"
      }
    },
    "type": {
      "code": "PRJL",
      "libelle": "Projet de loi"
    },
    "sousType": null,
    "statutAdoption": "ADOPTCOM"
  },
  "auteurs": {
    "auteur": [
      {
        "acteur": {
          "acteurRef": "PA610354",
          "qualite": "rapporteur"
        }
      },
      {
        "organe": {
          "organeRef": "PO59051"
        }
      }
    ]
  },
  "correction": null,
  "notice": {
    "numNotice": "883",
    "formule": "sur , en nouvelle lecture,  le projet de loi , modifié par l'Assemblée nationale en deuxième lecture, relatif à l'élection des conseillers départementaux, des conseillers municipaux et des conseillers communautaires, et modifiant le calendrier électoral (n°878)",
    "adoptionConforme": "false"
  },
  "indexation": null,
  "imprimerie": {
    "prix": "3.0"
  },
  "coSignataires": null,
  "depotAmendements": {
    "amendementsSeance": {
      "amendable": "true",
      "dateLimiteDepot": null
    },
    "amendementsCommission": {
      "commission": {
        "organeRef": "PO59051",
        "amendable": "true",
        "dateLimiteDepot": null
      }
    }
  }
}