{
  "@xsi:type": "texteLoi_Type",
  "uid": "PRJLSNR5S219B0596",
  "legislature": null,
  "cycleDeVie": {
    "chrono": {
      "dateCreation": "2014-06-12T00:00:00.000+02:00",
      "dateDepot": "2014-06-11T00:00:00.000+02:00",
      "datePublication": "2014-06-26T00:00:00.000+02:00",
      "datePublicationWeb": null
    }
  },
  "denominationStructurelle": "Projet de loi",
  "provenance": "Texte Déposé",
  "titres": {
    "titrePrincipal": "projet de loi tendant à renforcer l'efficacité des sanctions pénales",
    "titrePrincipalCourt": "Renforcer l'efficacité des sanctions pénales"
  },
  "divisions": null,
  "dossierRef": "DLR5L14N31474",
  "redacteur": null,
  "classification": {
    "famille": {
      "depot": {
        "code": "INITNAV",
        "libelle": "Initiative en Navette"
      },
      "classe": {
        "code": "PRJLOI",
        "libelle": "Projet de loi"
      }
    },
    "type": {
      "code": "PRJL",
      "libelle": "Projet de loi"
    },
    "sousType": null,
    "statutAdoption": null
  },
  "auteurs": {
    "auteur": {
      "organe": {
        "organeRef": "PO78718"
      }
    }
  },
  "correction": null,
  "notice": {
    "numNotice": "596",
    "formule": ", adopté, par l'Assemblée nationale après engagement de la procédure accélérée, tendant à renforcer l'efficacité des sanctions pénales",
    "adoptionConforme": "false"
  },
  "indexation": null,
  "imprimerie": null,
  "coSignataires": null,
  "depotAmendements": {
    "amendementsSeance": {
      "amendable": "false",
      "dateLimiteDepot": null
    }
  }
}