{
  "@xsi:type": "rapportParlementaire_Type",
  "uid": "RAPPANR5L14B4326",
  "legislature": "14",
  "cycleDeVie": {
    "chrono": {
      "dateCreation": "2016-12-20T00:00:00.000+01:00",
      "dateDepot": "2016-12-20T00:00:00.000+01:00",
      "datePublication": "2016-12-22T00:00:00.000+01:00",
      "datePublicationWeb": "2016-12-21T16:00:00.000+01:00"
    }
  },
  "denominationStructurelle": "Rapport",
  "provenance": "Commission",
  "titres": {
    "titrePrincipal": "rapport sur le projet de loi de finances, adopté par l'Assemblée nationale en nouvelle lecture, pour 2017 en vue de la lecture définitive (n° 4325).",
    "titrePrincipalCourt": "rapport sur le projet de loi de finances, adopté par l'Assemblée nationale en nouvelle lecture, pour 2017 en vue de la lecture définitive (n° 4325)."
  },
  "divisions": null,
  "dossierRef": "DLR5L14N35110",
  "redacteur": null,
  "classification": {
    "famille": {
      "depot": {
        "code": "RAPINIT",
        "libelle": "Rapport sur une initiative"
      },
      "classe": {
        "code": "RAPPORT",
        "libelle": "Rapport"
      }
    },
    "type": {
      "code": "RAPP",
      "libelle": "Rapport"
    },
    "sousType": null,
    "statutAdoption": null
  },
  "auteurs": {
    "auteur": [
      {
        "acteur": {
          "acteurRef": "PA609590",
          "qualite": "rapporteur général"
        }
      },
      {
        "organe": {
          "organeRef": "PO59048"
        }
      }
    ]
  },
  "correction": null,
  "notice": {
    "numNotice": "4326",
    "formule": "sur le projet de loi de finances, adopté par l'Assemblée nationale en nouvelle lecture, pour 2017 en vue de la lecture définitive (n° 4325).",
    "adoptionConforme": "false"
  },
  "indexation": null,
  "imprimerie": {
    "prix": "0.75"
  }
}