{
  "@xsi:type": "texteLoi_Type",
  "uid": "PIONANR5L14BTC4406",
  "legislature": "14",
  "cycleDeVie": {
    "chrono": {
      "dateCreation": "2017-01-25T00:00:00.000+01:00",
      "dateDepot": "2017-01-25T00:00:00.000+01:00",
      "datePublication": "2017-01-27T00:00:00.000+01:00",
      "datePublicationWeb": "2017-01-25T20:25:00.000+01:00"
    }
  },
  "denominationStructurelle": "Proposition de loi",
  "provenance": "Texte Déposé",
  "titres": {
    "titrePrincipal": "proposition de loi organique sur la proposition de loi organique de M. Bruno Le Roux, Mme Cécile Untermaier et plusieurs de leurs collègues relative aux obligations déontologiques applicables aux membres du Conseil constitutionnel (4274 rectifié).",
    "titrePrincipalCourt": "obligations déontologiques applicables aux membres du Conseil constitutionnel"
  },
  "divisions": null,
  "dossierRef": "DLR5L14N35419",
  "redacteur": null,
  "classification": {
    "famille": {
      "depot": {
        "code": "INITDEP",
        "libelle": "Initiative en 1er Dépôt"
      },
      "classe": {
        "code": "PIONLOI",
        "libelle": "Proposition de loi"
      },
      "espece": {
        "code": "ORG",
        "libelle": "organique"
      }
    },
    "type": {
      "code": "PION",
      "libelle": "Proposition de loi"
    },
    "sousType": {
      "code": "ORG",
      "libelle": "organique",
      "libelleEdition": "organique"
    },
    "statutAdoption": "ADOPTCOM"
  },
  "auteurs": {
    "auteur": [
      {
        "acteur": {
          "acteurRef": "PA608695",
          "qualite": "rapporteur"
        }
      },
      {
        "organe": {
          "organeRef": "PO59051"
        }
      }
    ]
  },
  "correction": null,
  "notice": {
    "numNotice": "4406",
    "formule": "sur la proposition de loi organique de M. Bruno Le Roux, Mme Cécile Untermaier et plusieurs de leurs collègues relative aux obligations déontologiques applicables aux membres du Conseil constitutionnel (4274 rectifié).",
    "adoptionConforme": "false"
  },
  "indexation": null,
  "imprimerie": {
    "prix": "1.5"
  },
  "coSignataires": null,
  "depotAmendements": {
    "amendementsSeance": {
      "amendable": "true",
      "dateLimiteDepot": null
    },
    "amendementsCommission": {
      "commission": {
        "organeRef": "PO59051",
        "amendable": "true",
        "dateLimiteDepot": null
      }
    }
  }
}