{
  "@xsi:type": "DossierLegislatif_Type",
  "uid": "DLR5L14N33471",
  "legislature": "14",
  "titreDossier": {
    "titre": "Extension du droit de prescription des infirmiers",
    "titreChemin": "extension_droit_prescription_infirmiers",
    "senatChemin": null
  },
  "procedureParlementaire": {
    "code": "2",
    "libelle": "Proposition de loi ordinaire"
  },
  "initiateur": {
    "acteurs": {
      "acteur": {
        "acteurRef": "PA2377",
        "mandatRef": "PM645591"
      }
    }
  },
  "actesLegislatifs": {
    "acteLegislatif": {
      "@xsi:type": "Etape_Type",
      "uid": "L14-AN1-33471",
      "codeActe": "AN1",
      "libelleActe": {
        "nomCanonique": "1ère lecture (1ère assemblée saisie)",
        "libelleCourt": "1ère lecture"
      },
      "organeRef": "PO644420",
      "dateActe": null,
      "actesLegislatifs": {
        "acteLegislatif": [
          {
            "@xsi:type": "DepotInitiative_Type",
            "uid": "L14-VD171508DI",
            "codeActe": "AN1-DEPOT",
            "libelleActe": {
              "nomCanonique": "1er dépôt d'une initiative.",
              "libelleCourt": "1er dépôt d'une initiative."
            },
            "organeRef": "PO644420",
            "dateActe": "2014-10-14T00:00:00.000+02:00",
            "actesLegislatifs": null,
            "texteAssocie": "PIONANR5L14B2289"
          },
          {
            "@xsi:type": "Etape_Type",
            "uid": "L14-AN1-COM-33471",
            "codeActe": "AN1-COM",
            "libelleActe": {
              "nomCanonique": "Travaux des commissions",
              "libelleCourt": "Travaux des commissions"
            },
            "organeRef": "PO644420",
            "dateActe": null,
            "actesLegislatifs": {
              "acteLegislatif": {
                "@xsi:type": "Etape_Type",
                "uid": "L14-VD171509CF",
                "codeActe": "AN1-COM-FOND",
                "libelleActe": {
                  "nomCanonique": "Travaux de la commission saisie au fond",
                  "libelleCourt": "Travaux de la commission saisie au fond"
                },
                "organeRef": "PO420120",
                "dateActe": null,
                "actesLegislatifs": {
                  "acteLegislatif": {
                    "@xsi:type": "SaisieComFond_Type",
                    "uid": "L14-VD171509CFS",
                    "codeActe": "AN1-COM-FOND-SAISIE",
                    "libelleActe": {
                      "nomCanonique": "Renvoi en commission au fond",
                      "libelleCourt": "Renvoi en commission au fond"
                    },
                    "organeRef": "PO420120",
                    "dateActe": "2014-10-14T00:00:00.000+02:00",
                    "actesLegislatifs": null
                  }
                }
              }
            }
          }
        ]
      }
    }
  },
  "fusionDossier": null
}