{
  "@xsi:type": "texteLoi_Type",
  "uid": "RINFANR5L14B4597",
  "legislature": "14",
  "cycleDeVie": {
    "chrono": {
      "dateCreation": "2017-03-29T00:00:00.000+02:00",
      "dateDepot": "2017-03-29T00:00:00.000+02:00",
      "datePublication": null,
      "datePublicationWeb": null
    }
  },
  "denominationStructurelle": "Rapport d'information",
  "provenance": "Commission",
  "titres": {
    "titrePrincipal": "rapport d'information déposé en application de l'article 29 du règlement au nom des délégués de l'Assemblée nationale à l'Assemblée parlementaire du conseil de l'Europe sur l’activité de cette Assemblée au cours de la première partie de sa session ordinaire de 2017",
    "titrePrincipalCourt": "rapport d'information déposé en application de l'article 29 du règlement au nom des délégués de l'Assemblée nationale à l'Assemblée parlementaire du conseil de l'Europe sur l’activité de cette Assemblée au cours de la première partie de sa session ordinaire de 2017"
  },
  "divisions": null,
  "dossierRef": "DLR5L14N35715",
  "redacteur": null,
  "classification": {
    "famille": {
      "depot": {
        "code": "RAPAUT",
        "libelle": "Rapport autonome"
      },
      "classe": {
        "code": "RAPINF",
        "libelle": "Rapport d'information"
      },
      "espece": {
        "code": "PRPDIT",
        "libelle": "tel quel"
      }
    },
    "type": {
      "code": "RINF",
      "libelle": "Rapport d'information"
    },
    "sousType": {
      "code": "PRPDIT",
      "libelle": "tel quel"
    },
    "statutAdoption": null
  },
  "auteurs": {
    "auteur": [
      {
        "acteur": {
          "acteurRef": "PA2631",
          "qualite": "rapporteur"
        }
      },
      {
        "organe": {
          "organeRef": "PO304272"
        }
      }
    ]
  },
  "correction": null,
  "notice": {
    "numNotice": "4597",
    "formule": "déposé en application de l'article 29 du règlement au nom des délégués de l'Assemblée nationale à l'Assemblée parlementaire du conseil de l'Europe sur l’activité de cette Assemblée au cours de la première partie de sa session ordinaire de 2017",
    "adoptionConforme": "false"
  },
  "indexation": null,
  "imprimerie": null,
  "coSignataires": null,
  "depotAmendements": null
}