{
  "@xsi:type": "rapportParlementaire_Type",
  "uid": "RAPPSNR5S259B0295",
  "legislature": null,
  "cycleDeVie": {
    "chrono": {
      "dateCreation": "2016-01-14T00:00:00.000+01:00",
      "dateDepot": "2016-01-13T00:00:00.000+01:00",
      "datePublication": null,
      "datePublicationWeb": null
    }
  },
  "denominationStructurelle": "Rapport",
  "provenance": "Commission",
  "titres": {
    "titrePrincipal": "rapport sur le projet de loi  ratifiant l'ordonnance n° 2015-1127 du 10 septembre 2015 portant réduction du nombre minimal d'actionnaire dans les sociétés anonymes non cotées  (n°222)",
    "titrePrincipalCourt": "rapport sur le projet de loi  ratifiant l'ordonnance n° 2015-1127 du 10 septembre 2015 portant réduction du nombre minimal d'actionnaire dans les sociétés anonymes non cotées  (n°222)"
  },
  "divisions": null,
  "dossierRef": "DLR5L14N34503",
  "redacteur": null,
  "classification": {
    "famille": {
      "depot": {
        "code": "RAPINIT",
        "libelle": "Rapport sur une initiative"
      },
      "classe": {
        "code": "RAPPORT",
        "libelle": "Rapport"
      }
    },
    "type": {
      "code": "RAPP",
      "libelle": "Rapport"
    },
    "sousType": null,
    "statutAdoption": null
  },
  "auteurs": {
    "auteur": [
      {
        "acteur": {
          "acteurRef": "PA426327",
          "qualite": "rapporteur"
        }
      },
      {
        "organe": {
          "organeRef": "PO211495"
        }
      }
    ]
  },
  "correction": null,
  "notice": {
    "numNotice": "295",
    "formule": "sur le projet de loi  ratifiant l'ordonnance n° 2015-1127 du 10 septembre 2015 portant réduction du nombre minimal d'actionnaire dans les sociétés anonymes non cotées  (n°222)",
    "adoptionConforme": "false"
  },
  "indexation": null,
  "imprimerie": null
}