{
  "@xsi:type": "texteLoi_Type",
  "uid": "PRJLANR5L14B1533",
  "legislature": "14",
  "cycleDeVie": {
    "chrono": {
      "dateCreation": "2013-11-06T00:00:00.000+01:00",
      "dateDepot": "2013-11-06T00:00:00.000+01:00",
      "datePublication": "2016-01-28T00:00:00.000+01:00",
      "datePublicationWeb": "2013-11-07T16:15:00.000+01:00"
    }
  },
  "denominationStructurelle": "Projet de loi",
  "provenance": "Texte Déposé",
  "titres": {
    "titrePrincipal": "projet de loi autorisant l’approbation de la convention d’entraide judiciaire en matière pénale entre le Gouvernement de la République française et le Gouvernement de la République du Pérou",
    "titrePrincipalCourt": "Convention d’entraide judiciaire en matière pénale France-Pérou"
  },
  "divisions": null,
  "dossierRef": "DLR5L14N31718",
  "redacteur": null,
  "classification": {
    "famille": {
      "depot": {
        "code": "INITDEP",
        "libelle": "Initiative en 1er Dépôt"
      },
      "classe": {
        "code": "PRJLOI",
        "libelle": "Projet de loi"
      },
      "espece": {
        "code": "AUTRATCONV",
        "libelle": "autorisant la ratification d'une convention"
      }
    },
    "type": {
      "code": "PRJL",
      "libelle": "Projet de loi"
    },
    "sousType": {
      "code": "AUTRATCONV",
      "libelle": "autorisant la ratification d'une convention",
      "libelleEdition": "autorisant la ratification d'une convention"
    },
    "statutAdoption": null
  },
  "auteurs": {
    "auteur": {
      "acteur": {
        "acteurRef": "PA328",
        "qualite": "auteur"
      }
    }
  },
  "correction": null,
  "notice": {
    "numNotice": "1533",
    "formule": "autorisant l’approbation de la convention d’entraide judiciaire en matière pénale entre le Gouvernement de la République française et le Gouvernement de la République du Pérou",
    "adoptionConforme": "false"
  },
  "indexation": null,
  "imprimerie": null,
  "coSignataires": {
    "coSignataire": {
      "acteur": {
        "acteurRef": "PA1268"
      },
      "dateCosignature": "2013-11-06+01:00",
      "dateRetraitCosignature": null,
      "edite": "true"
    }
  },
  "depotAmendements": {
    "amendementsSeance": {
      "amendable": "true",
      "dateLimiteDepot": null
    },
    "amendementsCommission": {
      "commission": {
        "organeRef": "PO59047",
        "amendable": "true",
        "dateLimiteDepot": null
      }
    }
  }
}