{
  "@xsi:type": "texteLoi_Type",
  "uid": "RINFANR5L14B1784",
  "legislature": "14",
  "cycleDeVie": {
    "chrono": {
      "dateCreation": "2014-02-11T00:00:00.000+01:00",
      "dateDepot": "2014-02-11T00:00:00.000+01:00",
      "datePublication": null,
      "datePublicationWeb": null
    }
  },
  "denominationStructurelle": "Rapport d'information",
  "provenance": "Commission",
  "titres": {
    "titrePrincipal": "rapport d'information déposé par la commission des affaires européennes portant observations sur la proposition de loi tendant au développement, à l'encadrement des stages et à l'amélioration du statut des stagiaires",
    "titrePrincipalCourt": "rapport d'information déposé par la commission des affaires européennes portant observations sur la proposition de loi tendant au développement, à l'encadrement des stages et à l'amélioration du statut des stagiaires"
  },
  "divisions": null,
  "dossierRef": "DLR5L14N32677",
  "redacteur": null,
  "classification": {
    "famille": {
      "depot": {
        "code": "RAPAUT",
        "libelle": "Rapport autonome"
      },
      "classe": {
        "code": "RAPINF",
        "libelle": "Rapport d'information"
      },
      "espece": {
        "code": "AUE",
        "libelle": "sur des actes de l'Union européenne"
      }
    },
    "type": {
      "code": "RINF",
      "libelle": "Rapport d'information"
    },
    "sousType": {
      "code": "AUE",
      "libelle": "sur des actes de l'Union européenne"
    },
    "statutAdoption": null
  },
  "auteurs": {
    "auteur": [
      {
        "acteur": {
          "acteurRef": "PA610891",
          "qualite": "rapporteur"
        }
      },
      {
        "organe": {
          "organeRef": "PO415287"
        }
      }
    ]
  },
  "correction": null,
  "notice": {
    "numNotice": "1784",
    "formule": "déposé par la commission des affaires européennes portant observations sur la proposition de loi tendant au développement, à l'encadrement des stages et à l'amélioration du statut des stagiaires",
    "adoptionConforme": "false"
  },
  "indexation": null,
  "imprimerie": null,
  "coSignataires": null,
  "depotAmendements": null
}