{
  "@xsi:type": "DossierMissionControle_Type",
  "uid": "DLR5L14N35557",
  "legislature": "14",
  "titreDossier": {
    "titre": "Jeux d'argent et de hasard",
    "titreChemin": "jeux_argent_hasard",
    "senatChemin": null
  },
  "procedureParlementaire": {
    "code": "19",
    "libelle": "Rapport d'information sans mission"
  },
  "initiateur": null,
  "actesLegislatifs": {
    "acteLegislatif": {
      "@xsi:type": "Etape_Type",
      "uid": "L14-AN20-35557",
      "codeActe": "AN20",
      "libelleActe": {
        "nomCanonique": "Travaux"
      },
      "organeRef": "PO644420",
      "dateActe": null,
      "actesLegislatifs": {
        "acteLegislatif": {
          "@xsi:type": "DepotRapport_Type",
          "uid": "L14-VD181226",
          "codeActe": "AN20-RAPPORT",
          "libelleActe": {
            "nomCanonique": "Dépôt de rapport",
            "libelleCourt": "Dépôt de rapport"
          },
          "organeRef": "PO420375",
          "dateActe": "2017-02-08T00:00:00.000+01:00",
          "actesLegislatifs": null,
          "texteAssocie": "RINFANR5L14B4456",
          "texteAdopte": null
        }
      }
    }
  },
  "fusionDossier": null
}