{
  "@xsi:type": "rapportParlementaire_Type",
  "uid": "RAPPSNR5S259B0557",
  "legislature": null,
  "cycleDeVie": {
    "chrono": {
      "dateCreation": "2016-05-10T00:00:00.000+02:00",
      "dateDepot": "2016-04-27T00:00:00.000+02:00",
      "datePublication": null,
      "datePublicationWeb": null
    }
  },
  "denominationStructurelle": "Rapport",
  "provenance": "Commission",
  "titres": {
    "titrePrincipal": "rapport  sur le projet de loi, adopté, par l'Assemblée nationale, autorisant l'approbation de l'accord entre le Gouvernement de la République française et le Gouvernement de la République d'Irak sur l'encouragement et la protection réciproques des investissements (n°482).",
    "titrePrincipalCourt": "rapport  sur le projet de loi, adopté, par l'Assemblée nationale, autorisant l'approbation de l'accord entre le Gouvernement de la République française et le Gouvernement de la République d'Irak sur l'encouragement et la protection réciproques des investissements (n°482)."
  },
  "divisions": null,
  "dossierRef": "DLR5L14N33827",
  "redacteur": null,
  "classification": {
    "famille": {
      "depot": {
        "code": "RAPINIT",
        "libelle": "Rapport sur une initiative"
      },
      "classe": {
        "code": "RAPPORT",
        "libelle": "Rapport"
      }
    },
    "type": {
      "code": "RAPP",
      "libelle": "Rapport"
    },
    "sousType": null,
    "statutAdoption": null
  },
  "auteurs": {
    "auteur": [
      {
        "acteur": {
          "acteurRef": "PA782",
          "qualite": "rapporteur"
        }
      },
      {
        "organe": {
          "organeRef": "PO211491"
        }
      }
    ]
  },
  "correction": null,
  "notice": {
    "numNotice": "557",
    "formule": "sur le projet de loi, adopté, par l'Assemblée nationale, autorisant l'approbation de l'accord entre le Gouvernement de la République française et le Gouvernement de la République d'Irak sur l'encouragement et la protection réciproques des investissements (n°482).",
    "adoptionConforme": "false"
  },
  "indexation": null,
  "imprimerie": null
}