{
  "@xsi:type": "rapportParlementaire_Type",
  "uid": "RAPPANR5L14B4398",
  "legislature": "14",
  "cycleDeVie": {
    "chrono": {
      "dateCreation": "2017-01-24T00:00:00.000+01:00",
      "dateDepot": "2017-01-24T00:00:00.000+01:00",
      "datePublication": "2017-02-01T00:00:00.000+01:00",
      "datePublicationWeb": "2017-02-01T11:30:00.000+01:00"
    }
  },
  "denominationStructurelle": "Rapport",
  "provenance": "Commission",
  "titres": {
    "titrePrincipal": "rapport sur la proposition de résolution européenne de M. Marc Dolez et plusieurs de ses collègues pour un débat démocratique sur l'accord économique et commercial global (CETA) (n°4335).",
    "titrePrincipalCourt": "rapport sur la proposition de résolution européenne de M. Marc Dolez et plusieurs de ses collègues pour un débat démocratique sur l'accord économique et commercial global (CETA) (n°4335)."
  },
  "divisions": null,
  "dossierRef": "DLR5L14N35470",
  "redacteur": null,
  "classification": {
    "famille": {
      "depot": {
        "code": "RAPINIT",
        "libelle": "Rapport sur une initiative"
      },
      "classe": {
        "code": "RAPPORT",
        "libelle": "Rapport"
      }
    },
    "type": {
      "code": "RAPP",
      "libelle": "Rapport"
    },
    "sousType": null,
    "statutAdoption": null
  },
  "auteurs": {
    "auteur": [
      {
        "acteur": {
          "acteurRef": "PA1141",
          "qualite": "rapporteur"
        }
      },
      {
        "organe": {
          "organeRef": "PO59047"
        }
      }
    ]
  },
  "correction": null,
  "notice": {
    "numNotice": "4398",
    "formule": "sur la proposition de résolution européenne de M. Marc Dolez et plusieurs de ses collègues pour un débat démocratique sur l'accord économique et commercial global (CETA) (n°4335).",
    "adoptionConforme": "false"
  },
  "indexation": null,
  "imprimerie": {
    "prix": "0.75"
  }
}