{
  "uid": "AMANR5L15PO419865B1831P0D1N2529",
  "identifiant": {
    "legislature": "15",
    "numero": "2529",
    "numRect": "0",
    "saisine": {
      "texteLegislatifRef": "PRJLANR5L15B1831",
      "numeroPartiePLF": "0",
      "organeExamen": "PO419865",
      "mentionSecondeDeliberation": "0"
    }
  },
  "numeroLong": "CD2529",
  "etapeTexte": "1ère lecture (2ème assemblée saisie)",
  "triAmendement": "dtaaaaaaaaaaaaaaaaaaaaaaaaaaaaaaaaaaaaaaaaaaaaaaaajgny",
  "cardinaliteAmdtMultiples": "1",
  "etat": "Discuté",
  "signataires": {
    "auteur": {
      "typeAuteur": "Depute",
      "acteurRef": "PA721434",
      "groupePolitiqueRef": "PO730964"
    },
    "cosignatairesRefs": [
      "PA721398",
      "PA721434",
      "PA718710",
      "PA721458"
    ],
    "texteAffichable": "Mme&#160;Lardet,  Mme&#160;Pascale&#160;Boyer, M.&#160;Roseren et Mme&#160;Degois"
  },
  "pointeurFragmentTexte": {
    "division": {
      "titre": "Article 22 bis C",
      "articleDesignationCourte": "ART. 22 BIS C",
      "type": "ARTICLE",
      "avantAApres": "A",
      "divisionRattachee": "ARTICLE 22 BIS C",
      "urlDivisionTexteVise": "/15/textes/1831.asp#D_Article_22_bis_C"
    },
    "alinea": {
      "avantAApres": "Apres",
      "numero": "3"
    }
  },
  "corps": {
    "dispositif": "<p style=\"text-align: justify;\">Compl&#233;ter cet article par les trois alin&#233;as suivants&#160;:</p><p style=\"text-align: justify;\">&#171;&#160;II.&#160;&#8211;&#160;L&#8217;article L.&#160;111&#8209;3&#8209;11 du m&#234;me code, tel qu&#8217;il r&#233;sulte du 3&#176; du IV de l&#8217;article&#160;22 de la pr&#233;sente loi, est ainsi modifi&#233;&#160;:</p><p style=\"text-align: justify;\">&#171;&#160;1&#176; Aux premi&#232;re et seconde phrases du sixi&#232;me alin&#233;a, apr&#232;s la seconde occurrence du mot&#160;: &#171;&#160;stationnement&#160;&#187;, sont ins&#233;r&#233;s les mots&#160;: &#171;&#160;s&#233;curis&#233;, sauf impossibilit&#233; technique av&#233;r&#233;e&#160;&#187;&#160;;</p><p style=\"text-align: justify;\">&#171;&#160;2&#176; &#192; la premi&#232;re phrase du dernier alin&#233;a, apr&#232;s le mot&#160;: &#171;&#160;entrepris&#160;&#187;, sont ins&#233;r&#233;s les mots&#160;: &#171;&#160;et de la s&#233;curisation adapt&#233;e au risque des places de stationnement.&#160;&#187;</p>",
    "exposeSommaire": "<p>Les dispositions propos&#233;es sont un compl&#233;ment n&#233;cessaire aux modifications introduites par le S&#233;nat &#224; l&#8217;article L.&#160;111&#8209;5&#8209;2 du code de la construction et de l&#8217;habitation, qui ne concernent que les b&#226;timents neufs, et non pas les b&#226;timents existants.</p><p style=\"text-align: justify;\">Elles ajoutent le caract&#232;re s&#233;curis&#233; des stationnements qui doivent &#234;tre r&#233;alis&#233;s lorsque des travaux sont entrepris sur des parcs de stationnement existants en ajoutant une restriction &#224; cette obligation lorsqu&#8217;une impossibilit&#233; technique est av&#233;r&#233;e.</p>"
  },
  "representations": [
    {
      "nom": "PDF",
      "typeMime": {
        "type": "application",
        "subType": "PDF"
      },
      "statutRepresentation": {
        "verbatim": true,
        "canonique": true,
        "officielle": true,
        "transcription": false,
        "enregistrement": false
      },
      "contenu": {
        "documentURI": "/15/amendements/1831/CION-DVP/CD2529.pdf"
      }
    }
  ],
  "sort": {
    "dateSaisie": "2019-05-17T17:53:55.000+02:00",
    "sortEnSeance": "Retiré"
  },
  "dateDepot": "2019-05-09T02:00:00.000+02:00",
  "dateDistribution": "2019-05-16T02:00:00.000+02:00",
  "article99": "0",
  "loiReference": {
    "codeLoi": "construction et habitation",
    "divisionCodeLoi": "L111-5-4"
  }
}