{
  "uid": "AMANR5L15SEA717460BTC2401P0D1N931",
  "identifiant": {
    "legislature": "15",
    "numero": "931",
    "numRect": "0",
    "saisine": {
      "texteLegislatifRef": "PRJLANR5L15BTC2401",
      "numeroPartiePLF": "0",
      "organeExamen": "PO717460",
      "mentionSecondeDeliberation": "0"
    }
  },
  "numeroLong": "931",
  "etapeTexte": "1ère lecture (2ème assemblée saisie)",
  "triAmendement": "kgaaaaaaaaaaaaaaaaaaaaaaaaaaaaaaaaaaaaaaaaaaaaaaaaai",
  "cardinaliteAmdtMultiples": "1",
  "etat": "Irrecevable",
  "signataires": {
    "auteur": {
      "typeAuteur": "Depute",
      "acteurRef": "PA721352",
      "groupePolitiqueRef": "PO730964"
    },
    "cosignatairesRefs": [
      "PA720622",
      "PA721278",
      "PA721352",
      "PA719230",
      "PA721450",
      "PA719266",
      "PA719952",
      "PA720854",
      "PA722046",
      "PA720054",
      "PA405480",
      "PA719364",
      "PA720074",
      "PA718978",
      "PA719372",
      "PA719822",
      "PA720222",
      "PA719044",
      "PA721522",
      "PA719118",
      "PA718876",
      "PA724827"
    ],
    "texteAffichable": "Mme&#160;Cazarian,  M.&#160;Pupponi, M.&#160;Haury, Mme&#160;O&apos;Petit, M.&#160;Kerlogot, Mme&#160;Bureau-Bonnard, Mme&#160;Thillaye, M.&#160;Batut, M.&#160;Cormier-Bouligeon, Mme&#160;Janvier, Mme&#160;Ali, M.&#160;Test&#233;, M.&#160;Anato, Mme&#160;Lenne, M.&#160;Kasbarian, M.&#160;Girardin, M.&#160;Besson-Moreau, M.&#160;Mis, Mme&#160;Berg&#233;, M.&#160;Laqhila, M.&#160;Cubertafon et Mme&#160;Essayan"
  },
  "pointeurFragmentTexte": {
    "division": {
      "titre": "Article 23",
      "articleDesignationCourte": "APRÈS ART. 23",
      "type": "ARTICLE",
      "avantAApres": "Apres",
      "divisionRattachee": "APRÈS L'ARTICLE 23, insérer l'article suivant:",
      "articleAdditionnel": "1",
      "urlDivisionTexteVise": "/15/textes/2401.asp#D_Article_23"
    }
  },
  "corps": {},
  "representations": [
    {
      "nom": "PDF",
      "typeMime": {
        "type": "application",
        "subType": "PDF"
      },
      "statutRepresentation": {
        "verbatim": true,
        "canonique": true,
        "officielle": true,
        "transcription": false,
        "enregistrement": false
      },
      "contenu": {
        "documentURI": "/15/amendements/2401/AN/931.pdf"
      }
    }
  ],
  "dateDepot": "2019-11-14T01:00:00.000+01:00",
  "dateDistribution": "2019-11-19T01:00:00.000+01:00",
  "article99": "0",
  "loiReference": {
    "codeLoi": "CGCT",
    "divisionCodeLoi": "L1115-1"
  }
}