{
  "uid": "AMANR5L15SEA717460BTC1761P0D1N355",
  "identifiant": {
    "legislature": "15",
    "numero": "355",
    "numRect": "0",
    "saisine": {
      "texteLegislatifRef": "PRJLANR5L15BTC1761",
      "numeroPartiePLF": "0",
      "organeExamen": "PO717460",
      "mentionSecondeDeliberation": "0"
    }
  },
  "numeroLong": "355",
  "etapeTexte": "Nouvelle Lecture",
  "triAmendement": "aakaaaaaabaaaaaaaaaaaaaaaaaaaaaaaaaaaaaaaaaaaaaaaazzzzi",
  "cardinaliteAmdtMultiples": "1",
  "etat": "Discuté",
  "signataires": {
    "auteur": {
      "typeAuteur": "Depute",
      "acteurRef": "PA721270",
      "groupePolitiqueRef": "PO730940"
    },
    "cosignatairesRefs": [
      "PA722110",
      "PA441",
      "PA335612",
      "PA721118",
      "PA689",
      "PA610667",
      "PA718926",
      "PA267306",
      "PA721012",
      "PA720546",
      "PA718720",
      "PA720692",
      "PA610654",
      "PA722202",
      "PA721270",
      "PA721896"
    ],
    "texteAffichable": "M.&#160;Peu,  M.&#160;Dharr&#233;ville, M.&#160;Jumel, Mme&#160;Bello, M.&#160;Brotherson, M.&#160;Bruneel, Mme&#160;Buffet, M.&#160;Chassaigne, M.&#160;Dufr&#232;gne, Mme&#160;Faucillon, Mme&#160;K&#233;clard-Mond&#233;sir, M.&#160;Lecoq, M.&#160;Nilor, M.&#160;Fabien&#160;Roussel, M.&#160;Serville et M.&#160;Wulfranc"
  },
  "pointeurFragmentTexte": {
    "division": {
      "titre": "Article 45",
      "articleDesignationCourte": "ART. 45",
      "type": "ARTICLE",
      "avantAApres": "A",
      "divisionRattachee": "ARTICLE 45",
      "urlDivisionTexteVise": "/15/textes/1761.asp#D_Article_45"
    },
    "alinea": {
      "numero": "6"
    }
  },
  "corps": {
    "dispositif": "<p>&#192; la premi&#232;re phrase de l&#8217;alin&#233;a&#160;6, apr&#232;s le mot&#160;:</p><p style=\"text-align: justify;\">&#171;&#160;charges&#160;&#187;</p><p style=\"text-align: justify;\">ins&#233;rer les mots&#160;:</p><p style=\"text-align: justify;\">&#171;&#160;approuv&#233; par d&#233;cret en Conseil d&#8217;&#201;tat, apr&#232;s avis conforme du comit&#233; d&#8217;entreprise,&#160;&#187;.</p>",
    "exposeSommaire": "<p>Dans le cadre de la privatisation d&#8217;A&#233;roports de Paris, le cahier des charges pr&#233;vu au sein du code des transports est consid&#233;rablement enrichi par l&#8217;article&#160;45.</p><p style=\"text-align: justify;\">Soucieux d&#8217;int&#233;grer plus largement les salari&#233;s &#224; la vie de l&#8217;entreprise, les d&#233;put&#233;s communistes proposent d&#8217;associer les organisations syndicales au processus de r&#233;daction de ce cahier des charges, afin que les int&#233;r&#234;ts des salari&#233;s puissent &#234;tre repr&#233;sent&#233;s lors de son &#233;laboration et surtout, lors de son application.</p>"
  },
  "representations": [
    {
      "nom": "PDF",
      "typeMime": {
        "type": "application",
        "subType": "PDF"
      },
      "statutRepresentation": {
        "verbatim": true,
        "canonique": true,
        "officielle": true,
        "transcription": false,
        "enregistrement": false
      },
      "contenu": {
        "documentURI": "/15/amendements/1761/AN/355.pdf"
      }
    }
  ],
  "seanceDiscussion": "RUANR5L15S2019IDS21548",
  "sort": {
    "dateSaisie": "2019-03-14T17:24:10.000+01:00",
    "sortEnSeance": "Rejeté"
  },
  "dateDepot": "2019-03-09T01:00:00.000+01:00",
  "dateDistribution": "2019-03-14T01:00:00.000+01:00",
  "article99": "0",
  "loiReference": {}
}