{
  "uid": "AMANR5L15SEA717460BTC1019P0D1N1249",
  "identifiant": {
    "legislature": "15",
    "numero": "1249",
    "numRect": "0",
    "saisine": {
      "texteLegislatifRef": "PRJLANR5L15BTC1019",
      "numeroPartiePLF": "0",
      "organeExamen": "PO717460",
      "mentionSecondeDeliberation": "0"
    }
  },
  "numeroLong": "1249",
  "etapeTexte": "1ère lecture (1ère assemblée saisie)",
  "triAmendement": "as",
  "cardinaliteAmdtMultiples": "1",
  "etat": "Discuté",
  "signataires": {
    "auteur": {
      "typeAuteur": "Depute",
      "acteurRef": "PA719480",
      "groupePolitiqueRef": "PO730964"
    },
    "cosignatairesRefs": [
      "PA606202",
      "PA719480"
    ],
    "texteAffichable": "M.&#160;Gaillard et Mme&#160;Fran&#231;oise&#160;Dumas"
  },
  "pointeurFragmentTexte": {
    "division": {
      "titre": "Article 11",
      "articleDesignationCourte": "ART. 11",
      "type": "ARTICLE",
      "avantAApres": "A",
      "divisionRattachee": "ARTICLE 11",
      "urlDivisionTexteVise": "/15/textes/1019.asp#D_Article_11"
    },
    "alinea": {
      "numero": "7"
    }
  },
  "corps": {
    "dispositif": "<p style=\"text-align: justify;\">Compl&#233;ter l'alin&#233;a&#160;7 par les mots&#160;:</p><p style=\"text-align: justify;\">&#171;&#160;en tenant compte du taux de jeunes lyc&#233;ens qui, souhaitant devenir apprentis, n&#8217;ont pu le devenir, faute d&#8217;avoir trouv&#233; une entreprise.&#160;&#187;</p>",
    "exposeSommaire": "<p style=\"text-align: justify;\">Le pr&#233;sent article introduit &#171;&#160;la valeur ajout&#233;e de l&#8217;&#233;tablissement. Celle-ci est d&#233;finie comme la grandeur qui r&#233;pond &#224; la question de savoir ce qu&#8217;un &#233;tablissement a ajout&#233; au niveau initial de ses &#233;l&#232;ves et mesurant la diff&#233;rence entre les r&#233;sultats obtenus et les r&#233;sultats qui &#233;taient attendus, compte tenu des caract&#233;ristiques scolaires et sociod&#233;mographiques des &#233;l&#232;ves.</p><p style=\"text-align: justify;\">Ce crit&#232;re d&#8217;&#233;valuation des lyc&#233;es gagnerait &#224; &#234;tre affin&#233; pour mesurer avec pertinence des diff&#233;rences de nature. Cela a &#233;t&#233; mis en &#233;vidence par le CEREQ dans le cadre de l&#8217;&#233;valuation du Fonds d&#8217;Exp&#233;rimentation pour la Jeunesse, intitul&#233;e Mesure et analyse des discriminations d&#8217;acc&#232;s &#224; l&#8217;apprentissage a &#233;t&#233; conduit sous la direction scientifique de Prisca Kergoat et s&#8217;est fond&#233; sur un dispositif m&#233;thodologique complexe, m&#234;lant approches quantitatives, qualitatives et statistique publique</p><p style=\"text-align: justify;\">Il met en &#233;vidence la profondeur des diff&#233;rences de profil entre les jeunes qui suivent la m&#234;me formation, les uns par la voie de l&#8217;apprentissage, les autres dans les lyc&#233;es professionnels, ce qui est r&#233;sum&#233; ainsi &#171;&#160;En rel&#233;guant aux formations professionnelles scolaris&#233;es les populations les plus fragilis&#233;es face &#224; l&#8217;emploi, l&#8217;apprentissage permet une insertion professionnelle qui est m&#233;caniquement et sans grand effort sup&#233;rieure &#224; celle des jeunes issus des lyc&#233;es professionnels&#160;&#187;.</p><p style=\"text-align: justify;\">Il faut d&#8217;abord noter que dans les jeunes concern&#233;s, existent 30&#160;% de l&#8217;ensemble qui sont des lyc&#233;en.nes qui auraient souhait&#233; &#234;tre apprenti.e, mais qui n&#8217;ont pas trouv&#233; d&#8217;entreprise (30&#160;%) et que parmi eux ou elles 44&#160;% ont cherch&#233; sur de longues p&#233;riodes. alors que 56&#160;% se sont rapidement d&#233;courag&#233;.es, tandis que 30&#160;% des apprentis ont trouv&#233; une place d&#232;s la premi&#232;re soci&#233;t&#233; contact&#233;e, gr&#226;ce &#224; l&#8217;appui des r&#233;seaux familiaux.</p><p style=\"text-align: justify;\">Parce qu&#8217;il ne peut y avoir apprentissage que si une entreprise d&#233;cide de recruter un apprenti et de lui verser un salaire, le moment cl&#233; du dispositif est celui de l&#8217;acc&#232;s &#224; l&#8217;entreprise qui conditionne l&#8217;acc&#232;s &#224; la formation. Ces r&#233;sultats d&#233;montrent que la s&#233;lection pour l&#8217;acc&#232;s &#224; l&#8217;emploi s&#8217;effectue, en amont, d&#232;s l&#8217;entr&#233;e en formation. La soi-disant &#171;&#160;performance&#160;&#187; de l&#8217;apprentissage en mati&#232;re d&#8217;insertion professionnelle tient pour beaucoup &#224; l&#8217;&#233;viction des jeunes non qualifi&#233;s et issus des milieux les plus pr&#233;caris&#233;s.</p>"
  },
  "representations": [
    {
      "nom": "PDF",
      "typeMime": {
        "type": "application",
        "subType": "PDF"
      },
      "statutRepresentation": {
        "verbatim": true,
        "canonique": true,
        "officielle": true,
        "transcription": false,
        "enregistrement": false
      },
      "contenu": {
        "documentURI": "/15/amendements/1019/AN/1249.pdf"
      }
    }
  ],
  "seanceDiscussion": "RUANR5L15S2018IDS21103",
  "sort": {
    "dateSaisie": "2018-06-15T00:03:09.000+02:00",
    "sortEnSeance": "Non soutenu"
  },
  "dateDepot": "2018-06-07T02:00:00.000+02:00",
  "dateDistribution": "2018-06-11T02:00:00.000+02:00",
  "article99": "0",
  "loiReference": {}
}