{
  "uid": "AMANR5L15SEA717460BTC2208P0D1N59",
  "identifiant": {
    "legislature": "15",
    "numero": "59",
    "numRect": "1",
    "saisine": {
      "texteLegislatifRef": "PIONANR5L15BTC2208",
      "numeroPartiePLF": "0",
      "organeExamen": "PO717460",
      "mentionSecondeDeliberation": "0"
    }
  },
  "numeroLong": "59 (Rect)",
  "etapeTexte": "1ère lecture (2ème assemblée saisie)",
  "triAmendement": "kcaaaaaaaaaaaaaaaaaaaaaaaaaaaaaaaaaaaaaaaaaaaaaaaae",
  "cardinaliteAmdtMultiples": "1",
  "etat": "Discuté",
  "signataires": {
    "auteur": {
      "typeAuteur": "Depute",
      "acteurRef": "PA721296",
      "groupePolitiqueRef": "PO730964"
    },
    "cosignatairesRefs": [
      "PA721296"
    ],
    "texteAffichable": "M.&#160;Gouffier-Cha"
  },
  "pointeurFragmentTexte": {
    "division": {
      "titre": "Article 5 bis A",
      "articleDesignationCourte": "APRÈS ART. 5 BIS A",
      "type": "ARTICLE",
      "avantAApres": "Apres",
      "divisionRattachee": "APRÈS L'ARTICLE 5 BIS A, insérer l'article suivant:",
      "articleAdditionnel": "1",
      "urlDivisionTexteVise": "/15/textes/2208.asp#D_Article_5_bis_A"
    }
  },
  "corps": {
    "dispositif": "<p style=\"text-align: justify;\">Le code &#233;lectoral est ainsi modifi&#233;&#160;:</p><p style=\"text-align: justify;\">1&#176;&#160;L&#8217;article L.&#160;51 est compl&#233;t&#233; par un alin&#233;a ainsi r&#233;dig&#233;&#160;:</p><p style=\"text-align: justify;\">&#171;&#160;&#192; compter du deuxi&#232;me lundi qui pr&#233;c&#232;de la date du scrutin, les collectivit&#233;s territoriales concern&#233;es par le scrutin mettent en ligne la liste des candidats sur leur site internet lorsqu&#8217;il existe.&#160;&#187;</p><p style=\"text-align: justify;\">2&#176;&#160;L&#8217;article L.&#160;353 est compl&#233;t&#233; par un alin&#233;a ainsi r&#233;dig&#233;&#160;:</p><p style=\"text-align: justify;\">&#171;&#160;&#192; compter du deuxi&#232;me lundi qui pr&#233;c&#232;de la date du scrutin, la r&#233;gion met en ligne la liste des candidats sur son site internet lorsqu&#8217;il existe.&#160;&#187;</p>",
    "exposeSommaire": "<p style=\"text-align: justify;\">Le pr&#233;sent amendement vise &#224; renforcer l&#8217;information dont disposent les &#233;lecteurs quant &#224; l&#8217;identit&#233; des candidats se pr&#233;sentant au premier tour d&#8217;&#233;lections locales.</p><p style=\"text-align: justify;\">En ce qui concerne les &#233;lections nationales, c&#8217;est le minist&#232;re de l&#8217;Int&#233;rieur qui publie sur son site internet la liste des candidats.</p><p style=\"text-align: justify;\">Cet amendement a pour objet d&#8217;&#233;tendre cette pratique aux scrutins locaux, en permettant aux citoyens de b&#233;n&#233;ficier d&#8217;un acc&#232;s d&#233;mat&#233;rialis&#233; &#224; la liste des candidats se pr&#233;sentant &#224; l&#8217;&#233;lection gr&#226;ce &#224; sa mise en ligne sur le site internet officiel de la collectivit&#233; territoriale concern&#233;e par le scrutin. Cette obligation est conditionn&#233;e par l&#8217;existence d&#8217;un site internet, conform&#233;ment &#224; la r&#233;daction actuelle du quatri&#232;me alin&#233;a de l&#8217;article R.&#160;7 du code &#233;lectoral.</p>"
  },
  "representations": [
    {
      "nom": "PDF",
      "typeMime": {
        "type": "application",
        "subType": "PDF"
      },
      "statutRepresentation": {
        "verbatim": true,
        "canonique": true,
        "officielle": true,
        "transcription": false,
        "enregistrement": false
      },
      "contenu": {
        "documentURI": "/15/amendements/2208/AN/59.pdf"
      }
    }
  ],
  "seanceDiscussion": "RUANR5L15S2019IDS21813",
  "sort": {
    "dateSaisie": "2019-09-17T19:48:06.000+02:00",
    "sortEnSeance": "Retiré"
  },
  "dateDepot": "2019-09-13T02:00:00.000+02:00",
  "dateDistribution": "2019-09-17T02:00:00.000+02:00",
  "article99": "0",
  "loiReference": {
    "codeLoi": "c  électoral",
    "divisionCodeLoi": "L51"
  }
}