{
  "uid": "AMANR5L15PO744107B0424P0D1N534",
  "identifiant": {
    "legislature": "15",
    "numero": "534",
    "numRect": "0",
    "saisine": {
      "texteLegislatifRef": "PRJLANR5L15B0424",
      "numeroPartiePLF": "0",
      "organeExamen": "PO744107",
      "mentionSecondeDeliberation": "0"
    }
  },
  "numeroLong": "534",
  "etapeTexte": "1ère lecture (1ère assemblée saisie)",
  "triAmendement": "il",
  "cardinaliteAmdtMultiples": "1",
  "etat": "Discuté",
  "signataires": {
    "auteur": {
      "typeAuteur": "Depute",
      "acteurRef": "PA330909",
      "groupePolitiqueRef": "PO730934"
    },
    "cosignatairesRefs": [
      "PA330909"
    ],
    "texteAffichable": "M.&#160;Descoeur"
  },
  "pointeurFragmentTexte": {
    "division": {
      "titre": "Article 21",
      "articleDesignationCourte": "ART. 21",
      "type": "ARTICLE",
      "avantAApres": "A",
      "divisionRattachee": "ARTICLE 21",
      "urlDivisionTexteVise": "/15/textes/0424.asp#D_Article_21"
    },
    "alinea": {
      "numero": "2"
    }
  },
  "corps": {
    "dispositif": "<p style=\"text-align: justify;\">Compl&#233;ter l'alin&#233;a 2 par les mots : </p><p style=\"text-align: justify;\">&#171;&#160;et lui ouvre un droit de rectification.&#160;&#187;</p>",
    "exposeSommaire": "<p style=\"text-align: justify;\">Cet amendement vise &#224; permettre &#224; la personne concern&#233;e de rectifier les erreurs constat&#233;es dans les informations qui lui ont &#233;t&#233; communiqu&#233;es.</p>"
  },
  "representations": [
    {
      "nom": "PDF",
      "typeMime": {
        "type": "application",
        "subType": "PDF"
      },
      "statutRepresentation": {
        "verbatim": true,
        "canonique": true,
        "officielle": true,
        "transcription": false,
        "enregistrement": false
      },
      "contenu": {
        "documentURI": "/15/amendements/0424/CSCONF/534.pdf"
      }
    }
  ],
  "sort": {
    "dateSaisie": "2018-01-17T00:42:27.000+01:00",
    "sortEnSeance": "Non soutenu"
  },
  "dateDepot": "2018-01-11T01:00:00.000+01:00",
  "dateDistribution": "2018-01-15T01:00:00.000+01:00",
  "article99": "0",
  "loiReference": {}
}