{
  "uid": "AMANR5L15PO59048B2272P2D1N764",
  "identifiant": {
    "legislature": "15",
    "numero": "764",
    "numRect": "0",
    "saisine": {
      "texteLegislatifRef": "PRJLANR5L15B2272",
      "numeroPartiePLF": "2",
      "organeExamen": "PO59048",
      "mentionSecondeDeliberation": "0"
    }
  },
  "numeroLong": "II-CF764",
  "etapeTexte": "1ère lecture (1ère assemblée saisie)",
  "triAmendement": "jbaaaaaaaaaaaaaaaaaaaaaaaaaaaaaaaaaaaaaaaaaaaaaaaavi",
  "cardinaliteAmdtMultiples": "1",
  "etat": "Discuté",
  "signataires": {
    "auteur": {
      "typeAuteur": "Depute",
      "acteurRef": "PA720278",
      "groupePolitiqueRef": "PO759900"
    },
    "cosignatairesRefs": [
      "PA720278"
    ],
    "texteAffichable": "M.&#160;Orphelin"
  },
  "pointeurFragmentTexte": {
    "division": {
      "titre": "Article 59",
      "articleDesignationCourte": "APRÈS ART. 59",
      "type": "ARTICLE",
      "avantAApres": "Apres",
      "divisionRattachee": "APRÈS L'ARTICLE 59, insérer l'article suivant:",
      "articleAdditionnel": "1",
      "urlDivisionTexteVise": "/15/textes/2272C.asp#D_Article_59"
    }
  },
  "corps": {
    "dispositif": "<p>Le Gouvernement remet au Parlement, au plus tard neuf mois apr&#232;s la promulgation de la pr&#233;sente loi, un rapport qui &#233;tudie l&#8217;opportunit&#233; d&#8217;une r&#233;vision de la fiscalit&#233; du patrimoine, qu&#8217;il soit financier ou immobilier, ainsi que des droits de succession et de donation, dans l&#8217;objectif de faire contribuer davantage les m&#233;nages propri&#233;taires de capitaux importants au financement de la transition &#233;cologique et solidaire.</p>",
    "exposeSommaire": "<p>Le Gouvernement a fait le choix de supprimer l&#8217;Imp&#244;t sur la fortune (ISF) ainsi que la taxe d&#8217;habitation pour les 20&#160;% les plus ais&#233;, ce qui repr&#233;sente respectivement une perte d&#8217;environ 3,2 Mds&#8364; et de 7 Mds&#8364; en ann&#233;e pleine, alors qu&#8217;il manque entre 7 et 9 Mds&#8364; par an pour financer la transition &#233;cologique selon les derni&#232;res estimations de I4CE.</p><p style=\"text-align: justify;\">Cet amendement reprend une recommandation du Conseil &#233;conomique, social et environnemental (CESE) pr&#233;sent&#233;e dans son Rapport annuel sur l&#8217;&#233;tat de la France de 2019, en demandant au Gouvernement d&#8217;&#233;tudier l&#8217;opportunit&#233; de faire &#233;voluer la fiscalit&#233; du patrimoine au profit du financement de la transition &#233;cologique et solidaire, par exemple par la cr&#233;ation d&#8217;un imp&#244;t de &#171;&#160;contribution &#233;cologique et solidaire du capital&#160;&#187;. Le rapport &#233;tudiera l&#8217;opportunit&#233; de r&#233;former les r&#233;gimes d&#8217;imposition des patrimoines financiers et immobiliers<span class=\"ins cts-1\"  data-cid=\"2\"   data-time=\"1571848169485\">,</span> notamment<span class=\"del cts-1\"  data-cid=\"3\"   data-time=\"1571848173128\">, ainsi que</span> les droits de succession et de donation.</p>"
  },
  "representations": [
    {
      "nom": "PDF",
      "typeMime": {
        "type": "application",
        "subType": "PDF"
      },
      "statutRepresentation": {
        "verbatim": true,
        "canonique": true,
        "officielle": true,
        "transcription": false,
        "enregistrement": false
      },
      "contenu": {
        "documentURI": "/15/amendements/2272C/CION_FIN/CF764.pdf"
      }
    }
  ],
  "sort": {
    "dateSaisie": "2019-11-06T22:54:23.000+01:00",
    "sortEnSeance": "Non soutenu"
  },
  "dateDepot": "2019-10-21T02:00:00.000+02:00",
  "dateDistribution": "2019-11-06T01:00:00.000+01:00",
  "article99": "0",
  "loiReference": {
    "codeLoi": "zz rapport"
  }
}