{
  "uid": "AMANR5L15SEA717460BTC1019P0D1N1907",
  "identifiant": {
    "legislature": "15",
    "numero": "1907",
    "numRect": "0",
    "saisine": {
      "texteLegislatifRef": "PRJLANR5L15BTC1019",
      "numeroPartiePLF": "0",
      "organeExamen": "PO717460",
      "mentionSecondeDeliberation": "0"
    }
  },
  "numeroLong": "1907",
  "etapeTexte": "1ère lecture (1ère assemblée saisie)",
  "triAmendement": "e",
  "cardinaliteAmdtMultiples": "1",
  "etat": "Irrecevable",
  "signataires": {
    "auteur": {
      "typeAuteur": "Depute",
      "acteurRef": "PA721062",
      "groupePolitiqueRef": "PO730958"
    },
    "cosignatairesRefs": [
      "PA720846",
      "PA588884",
      "PA721202",
      "PA718868",
      "PA719676",
      "PA721062",
      "PA720430",
      "PA721226",
      "PA720422",
      "PA720286",
      "PA2150",
      "PA722142",
      "PA721210",
      "PA719578",
      "PA718860",
      "PA721960",
      "PA720892"
    ],
    "texteAffichable": "M.&#160;Ratenon,  Mme&#160;Autain, M.&#160;Bernalicis, M.&#160;Coquerel, M.&#160;Corbi&#232;re, Mme&#160;Fiat, M.&#160;Lachaud, M.&#160;Larive, M.&#160;M&#233;lenchon, Mme&#160;Obono, Mme&#160;Panot, M.&#160;Prud&apos;homme, M.&#160;Quatennens, Mme&#160;Ressiguier, Mme&#160;Rubin, M.&#160;Ruffin et Mme&#160;Taurine"
  },
  "pointeurFragmentTexte": {
    "division": {
      "titre": "Article 2",
      "articleDesignationCourte": "ART. 2",
      "type": "ARTICLE",
      "avantAApres": "A",
      "divisionRattachee": "ARTICLE 2",
      "urlDivisionTexteVise": "/15/textes/1019.asp#D_Article_2"
    },
    "alinea": {
      "avantAApres": "Apres",
      "numero": "8"
    }
  },
  "corps": {
    "dispositif": "<p style=\"text-align: justify;\">Apr&#232;s l&#8217;alin&#233;a&#160;8, ins&#233;rer l&#8217;alin&#233;a suivant&#160;:</p><p style=\"text-align: justify;\">a <i>bis</i>) Le dixi&#232;me alin&#233;a est supprim&#233;.</p>",
    "exposeSommaire": "<p style=\"text-align: justify;\">Le compte d&#8217;engagement citoyen a le m&#233;rite de valoriser les activit&#233;s b&#233;n&#233;voles en permettant &#224; celles et ceux qui les pratiquent d&#8217;acc&#233;der &#224; des formations.</p><p style=\"text-align: justify;\">N&#233;anmoins, ce dispositif est trop restrictif puisqu&#8217;il est r&#233;serv&#233; aux seuls participants aux organes d&#8217;administration et de direction d&#8217;une association. Or, ce n&#8217;est pas un crit&#232;re qui permet de mesurer le degr&#233; d&#8217;intensit&#233; d&#8217;un engagement b&#233;n&#233;vole. Il nous semble n&#233;cessaire d&#8217;&#233;tendre le dispositif &#224; tous les b&#233;n&#233;voles.</p>"
  },
  "representations": [
    {
      "nom": "PDF",
      "typeMime": {
        "type": "application",
        "subType": "PDF"
      },
      "statutRepresentation": {
        "verbatim": true,
        "canonique": true,
        "officielle": true,
        "transcription": false,
        "enregistrement": false
      },
      "contenu": {
        "documentURI": "/15/amendements/1019/AN/1907.pdf"
      }
    }
  ],
  "dateDepot": "2018-06-07T02:00:00.000+02:00",
  "article99": "0",
  "loiReference": {}
}