{
  "uid": "AMANR5L15PO59051B0911P0D1N58",
  "identifiant": {
    "legislature": "15",
    "numero": "58",
    "numRect": "0",
    "saisine": {
      "texteLegislatifRef": "PRJLANR5L15B0911",
      "numeroPartiePLF": "0",
      "organeExamen": "PO59051",
      "mentionSecondeDeliberation": "0"
    }
  },
  "numeroLong": "CL58",
  "etapeTexte": "1ère lecture (1ère assemblée saisie)",
  "triAmendement": "adri",
  "cardinaliteAmdtMultiples": "1",
  "etat": "Discuté",
  "signataires": {
    "auteur": {
      "typeAuteur": "Depute",
      "acteurRef": "PA720996",
      "groupePolitiqueRef": "PO723569"
    },
    "cosignatairesRefs": [
      "PA720996"
    ],
    "texteAffichable": "M.&#160;El Guerrab"
  },
  "pointeurFragmentTexte": {
    "division": {
      "titre": "Article PREMIER",
      "articleDesignationCourte": "AVANT ART. PREMIER",
      "type": "ARTICLE",
      "avantAApres": "Avant",
      "divisionRattachee": "AVANT L'ARTICLE PREMIER, insérer l'article suivant:",
      "articleAdditionnel": "1",
      "urlDivisionTexteVise": "/15/textes/0911.asp#D_Article_1er"
    }
  },
  "corps": {
    "dispositif": "<p>&#192; la deuxi&#232;me phrase du dernier alin&#233;a de l&#8217;article&#160;13 de la Constitution, apr&#232;s le mot&#160;: &#171;&#160;nomination&#160;&#187;, sont ins&#233;r&#233;s les mots&#160;: &#171;&#160;ou, le cas &#233;ch&#233;ant, &#224; une r&#233;vocation&#160;&#187;.</p>",
    "exposeSommaire": "<p>Ces dispositions introduites en 2008 repr&#233;sentent incontestablement une avanc&#233;e en mati&#232;re de contr&#244;le parlementaire, notamment si l&#8217;on songe &#224; l&#8217;enti&#232;re discr&#233;tion dont s&#8217;entouraient jadis les nominations effectu&#233;es sur le fondement de l&#8217;article 13 de la Constitution.<br />Mais des am&#233;liorations sont possibles, voire souhaitables. Voil&#224; pourquoi un autre de mes amendements vise &#224; inverser la logique de cette proc&#233;dure, afin de passer d&#8217;un veto &#224; une majorit&#233; renforc&#233;e &#224; une habilitation &#224; la majorit&#233; absolue.<br />Par ailleurs, absolument rien n&#8217;est pr&#233;vu concernant l'&#233;ventuel retrait des personnes nomm&#233;es. Il y a l&#224; un v&#233;ritable angle mort du droit constitutionnel. Les r&#233;vocations s&#8217;op&#232;rent &#224; la discr&#233;tion de l&#8217;autorit&#233; jouissant du pouvoir de nomination. Il importe, donc, d&#8217;y rem&#233;dier. Cela serait possible en instaurant, par parall&#233;lisme des formes, un droit de regard sur les r&#233;vocations des fonctions vis&#233;es par l&#8217;article 13 de la Constitution. Par le biais de cet amendement, il s&#8217;agit in fine de renforcer le contr&#244;le parlementaire.</p>"
  },
  "representations": [
    {
      "nom": "PDF",
      "typeMime": {
        "type": "application",
        "subType": "PDF"
      },
      "statutRepresentation": {
        "verbatim": true,
        "canonique": true,
        "officielle": true,
        "transcription": false,
        "enregistrement": false
      },
      "contenu": {
        "documentURI": "/15/amendements/0911/CION_LOIS/CL58.pdf"
      }
    }
  ],
  "sort": {
    "dateSaisie": "2018-06-28T14:47:12.000+02:00",
    "sortEnSeance": "Rejeté"
  },
  "dateDepot": "2018-06-06T02:00:00.000+02:00",
  "dateDistribution": "2018-06-25T02:00:00.000+02:00",
  "article99": "0",
  "loiReference": {
    "codeLoi": "13",
    "divisionCodeLoi": "5-1"
  }
}