{
  "uid": "AMANR5L15SEA717460BTC0902P0D1N2549",
  "identifiant": {
    "legislature": "15",
    "numero": "2549",
    "numRect": "0",
    "saisine": {
      "texteLegislatifRef": "PRJLANR5L15BTC0902",
      "numeroPartiePLF": "0",
      "organeExamen": "PO717460",
      "mentionSecondeDeliberation": "0"
    }
  },
  "numeroLong": "2549",
  "etapeTexte": "1ère lecture (1ère assemblée saisie)",
  "triAmendement": "bbezi",
  "cardinaliteAmdtMultiples": "1",
  "etat": "Discuté",
  "signataires": {
    "auteur": {
      "typeAuteur": "Depute",
      "acteurRef": "PA721976",
      "groupePolitiqueRef": "PO730970"
    },
    "cosignatairesRefs": [
      "PA720976",
      "PA721976",
      "PA719938",
      "PA720092",
      "PA720598",
      "PA720162",
      "PA722162"
    ],
    "texteAffichable": "M.&#160;Millienne,  M.&#160;Turquois, M.&#160;Fesneau, M.&#160;Ramos, M.&#160;Bolo, M.&#160;Mathiasin, Mme&#160;Deprez-Audebert et les membres du groupe du Mouvement D&#233;mocrate et apparent&#233;s"
  },
  "pointeurFragmentTexte": {
    "division": {
      "titre": "Article 2",
      "articleDesignationCourte": "ART. 2",
      "type": "ARTICLE",
      "avantAApres": "A",
      "divisionRattachee": "ARTICLE 2",
      "urlDivisionTexteVise": "/15/textes/0902.asp#D_Article_2"
    }
  },
  "corps": {
    "dispositif": "<p style=\"text-align: justify;\">I.&#160;&#8211;&#160;Apr&#232;s le mot&#160;:</p><p style=\"text-align: justify;\">&#171;&#160;&#224;&#160;&#187;,</p><p style=\"text-align: justify;\">r&#233;diger ainsi la fin de l&#8217;alin&#233;a&#160;2&#160;:</p><p style=\"text-align: justify;\">&#171;&#160;2 % du chiffre d&#8217;affaires hors taxes du dernier exercice clos ou, dans le cas des organisations de producteurs ou associations d&#8217;organisations de producteurs assurant la commercialisation des produits sans transfert de propri&#233;t&#233;, &#224; 2 % du chiffre d'affaires agr&#233;g&#233; de l'ensemble des producteurs dont elles commercialisent les produits :&#160;&#187;.</p><p style=\"text-align: justify;\">II.&#160;&#8211;&#160;En cons&#233;quence, &#224; l&#8217;alin&#233;a&#160;9, apr&#232;s le mot&#160;:</p><p style=\"text-align: justify;\">&#171;&#160;faire&#160;&#187;,</p><p style=\"text-align: justify;\">ins&#233;rer le mot&#160;:</p><p style=\"text-align: justify;\">&#171;&#160;d&#233;lib&#233;r&#233;ment&#160;&#187;.</p><p style=\"text-align: justify;\">III&#160;&#8211;&#160;En cons&#233;quence, compl&#233;ter la derni&#232;re phrase de l&#8217;alin&#233;a&#160;12 par les mots&#160;:</p><p style=\"text-align: justify;\">&#171;&#160;dans les publications, journaux ou services de communication au public par voie &#233;lectronique, dans un format et pour une dur&#233;e proportionn&#233;s &#224; la sanction inflig&#233;e. Cette publication est syst&#233;matiquement ordonn&#233;e en cas de r&#233;it&#233;ration du manquement dans un d&#233;lai de deux ans &#224; compter de la premi&#232;re commission des faits&#160;&#187;.</p>",
    "exposeSommaire": "<p style=\"text-align: justify;\">La r&#233;f&#233;rence &#224; un pourcentage du chiffre d&#8217;affaires pour fixer le plafond de la sanction permet d&#8217;appliquer des sanctions beaucoup plus dissuasives pour les op&#233;rateurs de taille importante. &#192; l&#8217;inverse, il est de nature &#224; rassurer les producteurs qui ne pourront pas se voir infliger une sanction disproportionn&#233;e par rapport &#224; leur chiffre d&#8217;affaires. Cette r&#233;daction para&#238;t donc plus adapt&#233;e que celle initialement retenue, qui pr&#233;voyait un plafond de 75&#160;000&#160;&#8364;, pour atteindre l&#8217;objectif de sanctions proportionn&#233;es en fonction de la gravit&#233; des manquements et de la taille des acteurs &#233;conomiques en cause. Toutefois, s&#8217;agissant des OP et AOP qui commercialisent les produits de leurs membres sans transfert de propri&#233;t&#233;, la r&#233;f&#233;rence au chiffre d&#8217;affaires ne peut s&#8217;appliquer qu&#8217;au chiffre d&#8217;affaires agr&#233;g&#233; des membres de l&#8217;OP ou de l&#8217;AOP.</p><p style=\"text-align: justify;\">Enfin, il est propos&#233; de pr&#233;ciser les modalit&#233;s selon lesquelles l&#8217;autorit&#233; comp&#233;tente pourra rendre publiques les sanctions inflig&#233;es, dans l&#8217;esprit du &#171;&#160;name and shame&#160;&#187; pr&#233;conis&#233; par plusieurs amendements parlementaires. Il est notamment pr&#233;vu que la publication des sanctions sera syst&#233;matique en cas de r&#233;it&#233;ration du manquement dans un d&#233;lai de deux mois.</p>"
  },
  "representations": [
    {
      "nom": "PDF",
      "typeMime": {
        "type": "application",
        "subType": "PDF"
      },
      "statutRepresentation": {
        "verbatim": true,
        "canonique": true,
        "officielle": true,
        "transcription": false,
        "enregistrement": false
      },
      "contenu": {
        "documentURI": "/15/amendements/0902/AN/2549.pdf"
      }
    }
  ],
  "seanceDiscussion": "RUANR5L15S2018IDS21052",
  "sort": {
    "dateSaisie": "2018-05-24T15:52:11.000+02:00",
    "sortEnSeance": "Adopté"
  },
  "dateDepot": "2018-05-17T02:00:00.000+02:00",
  "dateDistribution": "2018-05-21T02:00:00.000+02:00",
  "article99": "0",
  "loiReference": {}
}