{
  "uid": "AMANR5L15PO59051B0911P0D1N1323",
  "identifiant": {
    "legislature": "15",
    "numero": "1323",
    "numRect": "0",
    "saisine": {
      "texteLegislatifRef": "PRJLANR5L15B0911",
      "numeroPartiePLF": "0",
      "organeExamen": "PO59051",
      "mentionSecondeDeliberation": "0"
    }
  },
  "numeroLong": "CL1323",
  "etapeTexte": "1ère lecture (1ère assemblée saisie)",
  "triAmendement": "aafbguwknzzzi",
  "cardinaliteAmdtMultiples": "1",
  "etat": "Discuté",
  "signataires": {
    "auteur": {
      "typeAuteur": "Depute",
      "acteurRef": "PA721742",
      "groupePolitiqueRef": "PO730970"
    },
    "cosignatairesRefs": [
      "PA720728",
      "PA721418",
      "PA721734",
      "PA721608",
      "PA719488",
      "PA719558",
      "PA720598",
      "PA721984",
      "PA720772",
      "PA720924",
      "PA721742",
      "PA720092",
      "PA721530",
      "PA719874",
      "PA720976",
      "PA720162",
      "PA719640",
      "PA720256",
      "PA722284",
      "PA610733",
      "PA721992",
      "PA720764",
      "PA720178",
      "PA720334",
      "PA719210",
      "PA720968",
      "PA718978",
      "PA719918",
      "PA721836",
      "PA721182",
      "PA722374",
      "PA721924",
      "PA720326",
      "PA721234",
      "PA720720",
      "PA720746",
      "PA719044",
      "PA719504",
      "PA1276",
      "PA722162",
      "PA721976",
      "PA720652",
      "PA720002",
      "PA717151",
      "PA719266"
    ],
    "texteAffichable": "Mme&#160;Florennes,  M.&#160;Balanant, M.&#160;Bru, M.&#160;Latombe, Mme&#160;Bannier, M.&#160;Barrot, Mme&#160;Benin, M.&#160;Berta, M.&#160;Bolo, M.&#160;Bourlanges, M.&#160;Cubertafon, Mme&#160;de Sarnez, Mme&#160;de Vaucouleurs, Mme&#160;Deprez-Audebert, M.&#160;Duverg&#233;, Mme&#160;El Ha&#239;ry, Mme&#160;Elimas, Mme&#160;Essayan, M.&#160;Fanget, M.&#160;Fuchs, Mme&#160;Gallerneau, M.&#160;Garcia, M.&#160;Hammouche, M.&#160;Isaac-Sibille, Mme&#160;Jacquier-Laforge, M.&#160;Joncour, M.&#160;Lagleize, M.&#160;Lain&#233;, M.&#160;Laqhila, Mme&#160;Lasserre-David, Mme&#160;Luquet, M.&#160;Mathiasin, M.&#160;Mattei, Mme&#160;Mette, M.&#160;Michel-Kleisbauer, M.&#160;Mignola, M.&#160;Millienne, M.&#160;Pahun, M.&#160;Fr&#233;d&#233;ric&#160;Petit, Mme&#160;Maud&#160;Petit, Mme&#160;Poueyto, M.&#160;Ramos, M.&#160;Thierry&#160;Robert, M.&#160;Turquois et M.&#160;Waserman"
  },
  "pointeurFragmentTexte": {
    "division": {
      "titre": "Article PREMIER",
      "articleDesignationCourte": "AVANT ART. PREMIER",
      "type": "ARTICLE",
      "avantAApres": "Avant",
      "divisionRattachee": "AVANT L'ARTICLE PREMIER, insérer l'article suivant:",
      "articleAdditionnel": "1",
      "urlDivisionTexteVise": "/15/textes/0911.asp#D_Article_1er"
    }
  },
  "corps": {
    "dispositif": "<p style=\"text-align: justify;\">&#192; la deuxi&#232;me phrase du premier alin&#233;a de l&#8217;article&#160;1<sup>er</sup> de la Constitution, les mots&#160;: &#171;&#160;,&#160;de race&#160;&#187; sont supprim&#233;s.</p>",
    "exposeSommaire": "<p style=\"text-align: justify;\">Le terme de &#171;&#160;race&#160;&#187; a &#233;t&#233; introduit dans la Constitution en 1946, apr&#232;s le nazisme, pour indiquer que toute race &#233;tait &#233;gale, pour mettre fin aux discriminations et rejeter les th&#233;ories racistes. Toutefois, la persistance de sa mention est aujourd&#8217;hui mal comprise, &#224; rebours de l&#8217;intention initiale.</p><p style=\"text-align: justify;\">Il est donc propos&#233; de supprimer ce terme de l&#8217;article premier.</p>"
  },
  "representations": [
    {
      "nom": "PDF",
      "typeMime": {
        "type": "application",
        "subType": "PDF"
      },
      "statutRepresentation": {
        "verbatim": true,
        "canonique": true,
        "officielle": true,
        "transcription": false,
        "enregistrement": false
      },
      "contenu": {
        "documentURI": "/15/amendements/0911/CION_LOIS/CL1323.pdf"
      }
    }
  ],
  "sort": {
    "dateSaisie": "2018-06-27T11:11:31.000+02:00",
    "sortEnSeance": "Adopté"
  },
  "dateDepot": "2018-06-22T02:00:00.000+02:00",
  "dateDistribution": "2018-06-25T02:00:00.000+02:00",
  "article99": "0",
  "loiReference": {
    "codeLoi": "01",
    "divisionCodeLoi": "04-16 id"
  }
}