{
  "uid": "AMANR5L15SEA717460BTC1482P0D1N281",
  "identifiant": {
    "legislature": "15",
    "numero": "281",
    "numRect": "0",
    "saisine": {
      "texteLegislatifRef": "PRJLANR5L15BTC1482",
      "numeroPartiePLF": "0",
      "organeExamen": "PO717460",
      "mentionSecondeDeliberation": "0"
    }
  },
  "numeroLong": "281",
  "etapeTexte": "1ère lecture (1ère assemblée saisie)",
  "triAmendement": "bcaaaaaaaaaaaaaaaaaaaaaaaaaaaaaaaaaaaaaaaaaaaaaaaaabe",
  "cardinaliteAmdtMultiples": "1",
  "etat": "Discuté",
  "signataires": {
    "auteur": {
      "typeAuteur": "Depute",
      "acteurRef": "PA266788",
      "groupePolitiqueRef": "PO744425"
    },
    "cosignatairesRefs": [
      "PA266788"
    ],
    "texteAffichable": "M.&#160;Morel-&#192;-L&apos;Huissier"
  },
  "pointeurFragmentTexte": {
    "division": {
      "titre": "Article 2",
      "articleDesignationCourte": "APRÈS ART. 2",
      "type": "ARTICLE",
      "avantAApres": "Apres",
      "divisionRattachee": "APRÈS L'ARTICLE 2, insérer l'article suivant:",
      "articleAdditionnel": "1",
      "urlDivisionTexteVise": "/15/textes/1482.asp#D_Article_2"
    }
  },
  "corps": {
    "dispositif": "<p>Le deuxi&#232;me alin&#233;a de l&#8217;article L.&#160;428&#8209;21 du code de l&#8217;environnement est compl&#233;t&#233; par une phrase ainsi r&#233;dig&#233;e&#160;:</p><p style=\"text-align: justify;\">&#171;&#160;La transmission des proc&#232;s-verbaux est soumise aux dispositions de l&#8217;article L.&#160;172&#8209;16.&#160;&#187;</p>",
    "exposeSommaire": "<p>L&#8217;ordonnance du 11 janvier 2012 portant simplification, r&#233;forme et harmonisation des dispositions de police administrative et de police judiciaire du code de l&#8217;environnement a port&#233; pr&#233;judice &#224; la police de la chasse de proximit&#233;.</p><p style=\"text-align: justify;\">Les gardes chasse particuliers et les agents de d&#233;veloppement des f&#233;d&#233;rations des chasseurs sont pourtant des acteurs essentiel de la surveillance et de la police rurale de proximit&#233;.</p><p style=\"text-align: justify;\">Cet amendement vise &#224; r&#233;tablir la situation ant&#233;rieure et &#224; aligner la r&#232;gle avec celle existant par ailleurs &#224; l&#8217;&#233;gard des gardes-p&#234;che particuliers, soit une transmission dans un d&#233;lai de 5 jours suivant la cl&#244;ture du proc&#232;s-verbal par r&#233;f&#233;rence &#224; l&#8217;article&#160;172&#8209;16 du code de l&#8217;environnement.</p>"
  },
  "representations": [
    {
      "nom": "PDF",
      "typeMime": {
        "type": "application",
        "subType": "PDF"
      },
      "statutRepresentation": {
        "verbatim": true,
        "canonique": true,
        "officielle": true,
        "transcription": false,
        "enregistrement": false
      },
      "contenu": {
        "documentURI": "/15/amendements/1482/AN/281.pdf"
      }
    }
  ],
  "seanceDiscussion": "RUANR5L15S2019IDS21461",
  "sort": {
    "dateSaisie": "2019-01-24T12:10:58.000+01:00",
    "sortEnSeance": "Non soutenu"
  },
  "dateDepot": "2018-12-14T01:00:00.000+01:00",
  "dateDistribution": "2019-01-17T01:00:00.000+01:00",
  "article99": "0",
  "loiReference": {
    "codeLoi": "c environnement",
    "divisionCodeLoi": "L428-21"
  }
}