{
  "uid": "AMANR5L15SEA717460BTC1019P0D1N205",
  "identifiant": {
    "legislature": "15",
    "numero": "205",
    "numRect": "0",
    "saisine": {
      "texteLegislatifRef": "PRJLANR5L15BTC1019",
      "numeroPartiePLF": "0",
      "organeExamen": "PO717460",
      "mentionSecondeDeliberation": "1"
    }
  },
  "numeroLong": "205",
  "etapeTexte": "1ère lecture (1ère assemblée saisie)",
  "triAmendement": "bifnzi",
  "cardinaliteAmdtMultiples": "1",
  "etat": "Discuté",
  "signataires": {
    "auteur": {
      "typeAuteur": "Depute",
      "acteurRef": "PA334843",
      "groupePolitiqueRef": "PO730934"
    },
    "cosignatairesRefs": [
      "PA334843"
    ],
    "texteAffichable": "M.&#160;Verch&#232;re"
  },
  "pointeurFragmentTexte": {
    "division": {
      "titre": "Article 16",
      "articleDesignationCourte": "ART. 16",
      "type": "ARTICLE",
      "avantAApres": "A",
      "divisionRattachee": "ARTICLE 16",
      "urlDivisionTexteVise": "/15/textes/1019.asp#D_Article_16"
    },
    "alinea": {
      "numero": "33"
    }
  },
  "corps": {
    "dispositif": "<p style=\"text-align: justify;\">Compl&#233;ter l&#8217;alin&#233;a&#160;33 par les mots&#160;:</p><p style=\"text-align: justify;\">&#171;&#160;qui prennent en compte les crit&#232;res portant sur la population, le nombre d&#8217;apprentis, la densit&#233; de population, le nombre de centres de formation d&#8217;apprentis et de sections de formation dans chacun de ces centres.&#160;&#187;</p>",
    "exposeSommaire": "<p style=\"text-align: justify;\">Afin de contribuer au financement des centres de formation d&#8217;apprentis, le dispositif propos&#233; par le Gouvernement (8&#176; du I de l&#8217;article&#160;15&#160;: nouvel article L.&#160;6211&#8209;3 du code du travail) dispose que les r&#233;gions pourront majorer la prise en charge des contrats r&#233;alis&#233;s par les op&#233;rateurs de comp&#233;tences, quand des besoins d&#8217;am&#233;nagement du territoire et de d&#233;veloppement &#233;conomique qu&#8217;elles identifieront le justifieront.</p><p style=\"text-align: justify;\">Le projet de loi (VIII de l&#8217;article&#160;16&#160;: 2&#176; du nouvel article L.&#160;6123&#8209;5 du code du travail) confie au nouvel op&#233;rateur de l&#8217;&#201;tat, France comp&#233;tences, le versement aux r&#233;gions des fonds allou&#233;s pour majorer la prise en charge des contrats suivant un objectif de p&#233;r&#233;quation.</p><p style=\"text-align: justify;\">En outre, l&#8217;article&#160;17 du texte&#160;alloue &#224; France comp&#233;tences une fraction de la contribution unique &#224; la formation professionnelle et &#224; l&#8217;apprentissage pour assurer notamment le financement des fonds allou&#233;s aux r&#233;gions.</p><p style=\"text-align: justify;\">Le projet de loi renvoie &#224; un d&#233;cret la d&#233;termination des modalit&#233;s de r&#233;partition des fonds allou&#233;s aux r&#233;gions au titre de la p&#233;r&#233;quation territoriale, sans qu&#8217;aucune pr&#233;cision ne soit inscrite sur les crit&#232;res qui seront pris en compte.</p><p style=\"text-align: justify;\">Le pr&#233;sent amendement vise ainsi &#224; pr&#233;ciser les crit&#232;res qui seront pris en compte dans la r&#233;partition des fonds allou&#233;s aux r&#233;gions. Il est propos&#233; de r&#233;partir ces fonds en fonction de la population, du nombre d&#8217;apprentis, de la densit&#233; de population, du nombre de centres de formation d&#8217;apprentis et de sections de formation dans chacun de ces centres.</p>"
  },
  "representations": [
    {
      "nom": "PDF",
      "typeMime": {
        "type": "application",
        "subType": "PDF"
      },
      "statutRepresentation": {
        "verbatim": true,
        "canonique": true,
        "officielle": true,
        "transcription": false,
        "enregistrement": false
      },
      "contenu": {
        "documentURI": "/15/amendements/1019/AN/205.pdf"
      }
    }
  ],
  "seanceDiscussion": "RUANR5L15S2018IDS21105",
  "sort": {
    "dateSaisie": "2018-06-15T15:16:25.000+02:00",
    "sortEnSeance": "Non soutenu"
  },
  "dateDepot": "2018-06-05T02:00:00.000+02:00",
  "dateDistribution": "2018-06-12T02:00:00.000+02:00",
  "article99": "0",
  "loiReference": {}
}