{
  "uid": "AMANR5L15SEA717460BTC0971P0D1N2415",
  "identifiant": {
    "legislature": "15",
    "numero": "2415",
    "numRect": "0",
    "saisine": {
      "texteLegislatifRef": "PRJLANR5L15BTC0971",
      "numeroPartiePLF": "0",
      "organeExamen": "PO717460",
      "mentionSecondeDeliberation": "0"
    }
  },
  "numeroLong": "2415",
  "etapeTexte": "1ère lecture (1ère assemblée saisie)",
  "triAmendement": "ow",
  "cardinaliteAmdtMultiples": "1",
  "etat": "Discuté",
  "signataires": {
    "auteur": {
      "typeAuteur": "Depute",
      "acteurRef": "PA719154",
      "groupePolitiqueRef": "PO730964"
    },
    "cosignatairesRefs": [
      "PA720622",
      "PA722070",
      "PA720576",
      "PA719202",
      "PA720222",
      "PA719186",
      "PA719154"
    ],
    "texteAffichable": "M.&#160;Martin,  M.&#160;Paris, Mme&#160;Khattabi, Mme&#160;Bureau-Bonnard, M.&#160;Bois, M.&#160;Henriet et M.&#160;Girardin"
  },
  "pointeurFragmentTexte": {
    "division": {
      "titre": "Article 14",
      "articleDesignationCourte": "APRÈS ART. 14",
      "type": "ARTICLE",
      "avantAApres": "Apres",
      "divisionRattachee": "APRÈS L'ARTICLE 14, insérer l'article suivant:",
      "articleAdditionnel": "1",
      "urlDivisionTexteVise": "/15/textes/0971.asp#D_Article_14"
    }
  },
  "corps": {
    "dispositif": "<p style=\"text-align: justify;\">Au d&#233;but de l&#8217;article L.&#160;153&#8209;15 du code de l&#8217;urbanisme, les mots&#160;: &#171;&#160;Lorsque l&#8217;une des communes membres&#160;&#187; sont remplac&#233;s par les mots&#160;: &#171;&#160;Lorsqu&#8217;un tiers des communes repr&#233;sentant au moins la moiti&#233; de la population&#160;&#187;.</p>",
    "exposeSommaire": "<p style=\"text-align: justify;\">En cas de d&#233;saccord d&#8217;une commune-membre sur les orientations d&#8217;am&#233;nagement et de programmation ou les dispositions du r&#232;glement qui la concernent directement, il est proc&#233;d&#233; &#224; un nouvel arr&#234;t du PLU &#224; la majorit&#233; des deux tiers des suffrages exprim&#233;s.</p><p style=\"text-align: justify;\">Il suffit ainsi de r&#233;serves formul&#233;es par une seule commune pour ralentir de mani&#232;re consid&#233;rable la proc&#233;dure d&#8217;&#233;laboration du PLU.</p><p style=\"text-align: justify;\">Or il s&#8217;av&#232;re que&#160;:</p><p style=\"text-align: justify;\">- Les communes sont d&#233;j&#224; suffisamment impliqu&#233;es en amont de l&#8217;arr&#234;t de projet, &#224; l&#8217;occasion de la collaboration obligatoire dont les modalit&#233;s font l&#8217;objet d&#8217;une conf&#233;rence intercommunale des maires et d&#8217;une d&#233;lib&#233;ration de l&#8217;&#233;tablissement intercommunal,</p><p style=\"text-align: justify;\">- Les orientations g&#233;n&#233;rales du Projet d&#8217;Am&#233;nagement et de D&#233;veloppement Durables (PADD) sont d&#233;battues avant l&#8217;arr&#234;t de projet dans chacun des conseils municipaux,</p><p style=\"text-align: justify;\">- La majorit&#233; des 2/3 peut &#234;tre difficile &#224; obtenir, et si elle n&#8217;est pas atteinte, la situation risque d&#8217;&#234;tre compl&#232;tement bloqu&#233;e,</p><p style=\"text-align: justify;\">- Cet article ne tient pas compte du nombre de communes dans l&#8217;intercommunalit&#233;. Plus il y en a, plus la probabilit&#233; d&#8217;un avis d&#233;favorable d&#8217;une seule commune sur un point du r&#232;glement ou sur une orientation d&#8217;am&#233;nagement et de programmation (OAP) est grande. D&#232;s lors qu&#8217;il n&#8217;y a pas accord de toutes les communes sur les &#233;l&#233;ments du PLU concernant leurs territoires, il faut de nouveau arr&#234;ter le projet de PLU. Si on le modifie, il faut de nouveau consulter les Personnes Publiques Associ&#233;es et les communes, ce qui rallonge notoirement les d&#233;lais de la proc&#233;dure.</p><p style=\"text-align: justify;\">C&#8217;est la raison pour laquelle il est propos&#233; de modifier l&#8217;article L153&#8209;15 du code de l&#8217;urbanisme en introduisant une minorit&#233; qualifi&#233;e de communes exprimant leur d&#233;saccord pour devoir proc&#233;der &#224; un nouvel arr&#234;t du PLU.</p><p style=\"text-align: justify;\">&#160;</p>"
  },
  "representations": [
    {
      "nom": "PDF",
      "typeMime": {
        "type": "application",
        "subType": "PDF"
      },
      "statutRepresentation": {
        "verbatim": true,
        "canonique": true,
        "officielle": true,
        "transcription": false,
        "enregistrement": false
      },
      "contenu": {
        "documentURI": "/15/amendements/0971/AN/2415.pdf"
      }
    }
  ],
  "seanceDiscussion": "RUANR5L15S2018IDS21082",
  "sort": {
    "dateSaisie": "2018-06-01T15:23:40.000+02:00",
    "sortEnSeance": "Non soutenu"
  },
  "dateDepot": "2018-05-26T02:00:00.000+02:00",
  "dateDistribution": "2018-05-29T02:00:00.000+02:00",
  "article99": "0",
  "loiReference": {
    "codeLoi": "c urbanisme",
    "divisionCodeLoi": "L153-15"
  }
}