{
  "uid": "AMANR5L15SEA717460B1371P0D1N342",
  "identifiant": {
    "legislature": "15",
    "numero": "342",
    "numRect": "0",
    "saisine": {
      "texteLegislatifRef": "PRJLANR5L15B1371",
      "numeroPartiePLF": "0",
      "organeExamen": "PO717460",
      "mentionSecondeDeliberation": "0"
    }
  },
  "numeroLong": "342",
  "etapeTexte": "1ère lecture (1ère assemblée saisie)",
  "triAmendement": "jiaaaaaaaaaaaaaaaaaaaaaaaaaaaaaaaaaaaaaaaaaaaaaaaaaafztqvs",
  "cardinaliteAmdtMultiples": "1",
  "etat": "Discuté",
  "signataires": {
    "auteur": {
      "typeAuteur": "Depute",
      "acteurRef": "PA942",
      "groupePolitiqueRef": "PO759900"
    },
    "cosignatairesRefs": [
      "PA942"
    ],
    "texteAffichable": "M.&#160;Charles&#160;de Courson"
  },
  "pointeurFragmentTexte": {
    "division": {
      "titre": "Article 8",
      "articleDesignationCourte": "APRÈS ART. 8",
      "type": "ARTICLE",
      "avantAApres": "Apres",
      "divisionRattachee": "APRÈS L'ARTICLE 8, insérer l'article suivant:",
      "articleAdditionnel": "1",
      "urlDivisionTexteVise": "/15/textes/1371.asp#D_Article_8"
    }
  },
  "corps": {
    "dispositif": "<p>I.&#160;&#8211;&#160;Le tableau B du I de l&#8217;article 265 du code des douanes est ainsi modifi&#233;:</p><p>1&#176; La quarante-deuxi&#232;me ligne est ainsi r&#233;dig&#233;e:</p><p>&#171;</p><table><tbody><tr><td style=\"width: 65.75pt; border: solid windowtext 1.0pt; padding: 0cm 5.4pt 0cm 5.4pt;\" width=\"91\"><p>... sous condition d'emploi ;</p></td><td style=\"width: 65.75pt; border: solid windowtext 1.0pt; padding: 0cm 5.4pt 0cm 5.4pt;\" width=\"91\"><p>30 bis</p></td><td style=\"width: 75.75pt; border: solid windowtext 1.0pt; border-left: none; padding: 0cm 5.4pt 0cm 5.4pt;\" width=\"103\"><p>100 kg nets</p></td><td style=\"width: 55.75pt; border: solid windowtext 1.0pt; border-left: none; padding: 0cm 5.4pt 0cm 5.4pt;\" width=\"76\"><p>15,9</p></td><td style=\"width: 65.75pt; border: solid windowtext 1.0pt; border-left: none; padding: 0cm 5.4pt 0cm 5.4pt;\" width=\"90\"><p>19,01</p></td><td style=\"width: 65.75pt; border: solid windowtext 1.0pt; border-left: none; padding: 0cm 5.4pt 0cm 5.4pt;\" width=\"90\"><p>19,01</p></td><td style=\"width: 65.75pt; border: solid windowtext 1.0pt; border-left: none; padding: 0cm 5.4pt 0cm 5.4pt;\" width=\"90\"><p>19,01</p></td><td style=\"width: 65.8pt; border: solid windowtext 1.0pt; border-left: none; padding: 0cm 5.4pt 0cm 5.4pt;\" width=\"91\"><p>19,01</p></td></tr></tbody></table><p style=\"text-align: right;\">&#187;</p><p>2&#176; La quarante-septi&#232;me ligne est ainsi r&#233;dig&#233;e:</p><p>&#171;</p><table><tbody><tr><td style=\"width: 65.75pt; border: solid windowtext 1.0pt; padding: 0cm 5.4pt 0cm 5.4pt;\" width=\"91\">... sous condition d'emploi ;</td><td style=\"width: 65.75pt; border: solid windowtext 1.0pt; padding: 0cm 5.4pt 0cm 5.4pt;\" width=\"91\"><p>31 bis</p></td><td style=\"width: 75.75pt; border: solid windowtext 1.0pt; border-left: none; padding: 0cm 5.4pt 0cm 5.4pt;\" width=\"103\"><p>100 kg nets</p></td><td style=\"width: 55.75pt; border: solid windowtext 1.0pt; border-left: none; padding: 0cm 5.4pt 0cm 5.4pt;\" width=\"76\"><p>15,9</p></td><td style=\"width: 65.75pt; border: solid windowtext 1.0pt; border-left: none; padding: 0cm 5.4pt 0cm 5.4pt;\" width=\"90\"><p>19,01</p></td><td style=\"width: 65.75pt; border: solid windowtext 1.0pt; border-left: none; padding: 0cm 5.4pt 0cm 5.4pt;\" width=\"90\"><p>19,01</p></td><td style=\"width: 65.75pt; border: solid windowtext 1.0pt; border-left: none; padding: 0cm 5.4pt 0cm 5.4pt;\" width=\"90\"><p>19,01</p></td><td style=\"width: 65.8pt; border: solid windowtext 1.0pt; border-left: none; padding: 0cm 5.4pt 0cm 5.4pt;\" width=\"91\"><p>19,01</p></td></tr></tbody></table><p style=\"text-align: right;\">&#187;</p><p style=\"text-align: justify;\">II.&#160;&#8211;&#160;La perte de recettes pour l&#8217;&#201;tat est compens&#233;e &#224; due concurrence par la cr&#233;ation d&#8217;une taxe additionnelle aux droits mentionn&#233;s aux articles 575 et 575 A du code g&#233;n&#233;ral des imp&#244;ts.</p>",
    "exposeSommaire": "<p style=\"text-align: justify;\">L&#8217;enjeu du d&#233;veloppement des carburants alternatifs est d&#8217;inciter les automobilistes &#224; modifier leurs habitudes en les orientant vers des solutions moins &#233;mettrices de CO2 et moins polluantes. Bien que performantes, la majorit&#233; des solutions disponibles &#224; l&#8217;heure actuelle sont co&#251;teuses (v&#233;hicules hybrides ou &#233;lectriques) et donc inaccessibles d&#8217;un point de vue financier &#224; la majeure partie de la population.</p><p style=\"text-align: justify;\">&#192; l&#8217;heure o&#249; l&#8217;on s&#8217;interroge sur le d&#233;veloppement et le financement de r&#233;seaux de carburants alternatifs, le GPL dispose d&#8217;atouts incontestables.</p><p style=\"text-align: justify;\">C&#8217;est un carburant alternatif reconnu par la directive 2014/94/UE disponible et pr&#233;sent sur l&#8217;ensemble du territoire fran&#231;ais (1650 stations) et&#160;Europ&#233;en (32&#160;000 stations)</p><p style=\"text-align: justify;\">-En conditions r&#233;elles de circulation un v&#233;hicule GPL n&#8217;&#233;met pratiquement pas de particules, ni de NOx et r&#233;duit les &#233;missions de CO2 (Jusqu&#8217;&#224; &#8211; 20&#160;% compar&#233; &#224; l&#8217;essence et jusqu&#8217;&#224; -80&#160;% lorsqu&#8217;il est d&#8217;origine renouvelable). Il contribue ainsi aux objectifs fix&#233;s en mati&#232;re d&#8217;am&#233;lioration de la qualit&#233; de l&#8217;air et de r&#233;duction d&#8217;&#233;missions de CO2. Un v&#233;hicule GPL est class&#233; Crit&#8217;air 1, quelle que soit son ann&#233;e d&#8217;immatriculation.</p><p style=\"text-align: justify;\">- C&#8217;est une solution &#233;conomique&#160;pour les particuliers comme pour les entreprises pour leurs usages routiers ou non routiers (manutention par chariots &#233;l&#233;vateurs en substitution au diesel). Il est aussi possible de transformer une partie du parc existant fonctionnant &#224; l&#8217;essence. Cette op&#233;ration peut &#234;tre r&#233;alis&#233;e localement par des professionnels de l&#8217;automobile.</p><p style=\"text-align: justify;\">Cet amendement a donc pour objectif de figer le tarif de la TICPE&#160;du GPL utilis&#233; comme carburant, comme cela a &#233;t&#233; fait &#224; pour le Gaz Naturel V&#233;hicule (GNV) en loi de Finances 2018. Cela permettra&#160;:</p><p style=\"text-align: justify;\">- De renforcer la comp&#233;titivit&#233; de ce carburant alternatif par rapport aux carburants conventionnels que sont l&#8217;essence et le diesel.</p><p style=\"text-align: justify;\">- De donner un signal aux m&#233;nages les plus modestes d&#233;sireux de rouler plus propre.</p><p style=\"text-align: justify;\">- D&#8217;apporter de la coh&#233;rence entre la fiscalit&#233; des carburants alternatifs GNV et GPL, deux carburants gazeux disposant des&#160;caract&#233;ristiques &#233;quivalentes.</p><p style=\"text-align: justify;\">Enfin, la valeur propos&#233;e dans cet amendement est situ&#233;e au-dessus de la valeur plancher de 12.5&#160;&#8364;/100 kg pr&#233;vue par la directive 2003/96/CE relative &#224; la fiscalit&#233; des &#233;nergies.</p>"
  },
  "representations": [
    {
      "nom": "PDF",
      "typeMime": {
        "type": "application",
        "subType": "PDF"
      },
      "statutRepresentation": {
        "verbatim": true,
        "canonique": true,
        "officielle": true,
        "transcription": false,
        "enregistrement": false
      },
      "contenu": {
        "documentURI": "/15/amendements/1371/AN/342.pdf"
      }
    }
  ],
  "seanceDiscussion": "RUANR5L15S2019IDS21366",
  "sort": {
    "dateSaisie": "2018-11-13T00:07:03.000+01:00",
    "sortEnSeance": "Rejeté"
  },
  "dateDepot": "2018-11-09T01:00:00.000+01:00",
  "dateDistribution": "2018-11-12T01:00:00.000+01:00",
  "article99": "0",
  "loiReference": {
    "codeLoi": "c douanes",
    "divisionCodeLoi": "265"
  }
}