{
  "uid": "AMANR5L15SEA717460B0911P0D1N2412",
  "identifiant": {
    "legislature": "15",
    "numero": "2412",
    "numRect": "0",
    "saisine": {
      "texteLegislatifRef": "PRJLANR5L15B0911",
      "numeroPartiePLF": "0",
      "organeExamen": "PO717460",
      "mentionSecondeDeliberation": "0"
    }
  },
  "numeroLong": "2412",
  "etapeTexte": "1ère lecture (1ère assemblée saisie)",
  "triAmendement": "aabttthynzi",
  "cardinaliteAmdtMultiples": "1",
  "etat": "Discuté",
  "signataires": {
    "auteur": {
      "typeAuteur": "Depute",
      "acteurRef": "PA702052",
      "groupePolitiqueRef": "PO744425"
    },
    "cosignatairesRefs": [
      "PA267330",
      "PA268019",
      "PA267355",
      "PA719806",
      "PA712014",
      "PA702052",
      "PA267766",
      "PA721110"
    ],
    "texteAffichable": "Mme&#160;Sage,  Mme&#160;Sanquer, Mme&#160;Auconie, M.&#160;Herth, M.&#160;Ledoux, M.&#160;Zumkeller, M.&#160;Lagarde et M.&#160;Guy&#160;Bricout"
  },
  "pointeurFragmentTexte": {
    "division": {
      "titre": "Article 2",
      "articleDesignationCourte": "APRÈS ART. 2",
      "type": "ARTICLE",
      "avantAApres": "Apres",
      "divisionRattachee": "APRÈS L'ARTICLE 2, insérer l'article suivant:",
      "articleAdditionnel": "1",
      "urlDivisionTexteVise": "/15/textes/0911.asp#D_Article_2"
    }
  },
  "corps": {
    "dispositif": "<p style=\"text-align: justify;\">Apr&#232;s le quinzi&#232;me alin&#233;a de l&#8217;article&#160;34 de la Constitution, il est ins&#233;r&#233; un alin&#233;a ainsi r&#233;dig&#233;&#160;:</p><p style=\"text-align: justify;\">&#171;&#160;- de l&#8217;acc&#232;s au num&#233;rique pour tous&#160;;&#160;&#187;.</p>",
    "exposeSommaire": "<p style=\"text-align: justify;\">De nombreux D&#233;put&#233;s ont propos&#233;s d&#8217;ins&#233;rer une Charte du num&#233;rique dans le pr&#233;ambule de la Constitution. Ce texte en sept articles dispose notamment que &#171;&#160;la loi garantit &#224; toute personne un droit d&#8217;acc&#232;s aux r&#233;seaux num&#233;riques libre, &#233;gal et sans discrimination&#160;&#187;, et que les r&#233;seaux num&#233;riques &#171;&#160;respectent le principe de neutralit&#233; qui implique un trafic libre et l&#8217;&#233;galit&#233; de traitement&#160;&#187;. Cette Charte vise aussi &#224; garantir &#171;&#160;la protection des donn&#233;es &#224; caract&#232;re personnel&#160;&#187; ainsi que l&#8217;acc&#232;s aux documents publics.</p><p style=\"text-align: justify;\">Ce sujet est fondamental et doit &#234;tre au moins ins&#233;r&#233; &#224; l&#8217;article&#160;34 de la Constitution, pour permettre au l&#233;gislateur de se d&#233;dier pleinement &#224; ces mati&#232;res.</p>"
  },
  "representations": [
    {
      "nom": "PDF",
      "typeMime": {
        "type": "application",
        "subType": "PDF"
      },
      "statutRepresentation": {
        "verbatim": true,
        "canonique": true,
        "officielle": true,
        "transcription": false,
        "enregistrement": false
      },
      "contenu": {
        "documentURI": "/15/amendements/0911/AN/2412.pdf"
      }
    }
  ],
  "seanceDiscussion": "RUANR5L15S2018IDS21172",
  "sort": {
    "dateSaisie": "2018-07-19T00:47:40.000+02:00",
    "sortEnSeance": "Tombé"
  },
  "dateDepot": "2018-07-06T02:00:00.000+02:00",
  "dateDistribution": "2018-07-10T02:00:00.000+02:00",
  "article99": "0",
  "loiReference": {
    "codeLoi": "Constitution",
    "divisionCodeLoi": "34"
  }
}