{
  "uid": "AMANR5L15PO59048B0235P1D1N68",
  "identifiant": {
    "legislature": "15",
    "numero": "68",
    "numRect": "0",
    "saisine": {
      "texteLegislatifRef": "PRJLANR5L15B0235",
      "numeroPartiePLF": "1",
      "organeExamen": "PO59048",
      "mentionSecondeDeliberation": "0"
    }
  },
  "numeroLong": "I-CF68",
  "etapeTexte": "1ère lecture (1ère assemblée saisie)",
  "triAmendement": "hk",
  "cardinaliteAmdtMultiples": "1",
  "etat": "Discuté",
  "signataires": {
    "auteur": {
      "typeAuteur": "Depute",
      "acteurRef": "PA712014",
      "groupePolitiqueRef": "PO730952"
    },
    "cosignatairesRefs": [
      "PA721054",
      "PA712014",
      "PA721792",
      "PA721004",
      "PA718884",
      "PA642847",
      "PA1960",
      "PA333421"
    ],
    "texteAffichable": "M.&#160;Ledoux,  M.&#160;Pancher, M.&#160;Bazin, Mme&#160;Bazin-Malgras, M.&#160;Leroy, M.&#160;Lorion, Mme&#160;Guerel et Mme&#160;Lakrafi"
  },
  "pointeurFragmentTexte": {
    "division": {
      "titre": "Article 15",
      "articleDesignationCourte": "APRÈS ART. 15",
      "type": "ARTICLE",
      "avantAApres": "Apres",
      "divisionRattachee": "APRÈS L'ARTICLE 15, insérer l'article suivant:",
      "articleAdditionnel": "1",
      "urlDivisionTexteVise": "/15/textes/0235A.asp#D_Article_15"
    }
  },
  "corps": {
    "dispositif": "<p style=\"text-align: justify;\">&#192; la fin du V de l&#8217;article&#160;235 ter ZD du code g&#233;n&#233;ral des imp&#244;ts, le taux&#160;: &#171;&#160;0,3&#160;%&#160;&#187; est remplac&#233; par le taux&#160;: &#171;&#160;0,5&#160;%&#160;&#187;.</p>",
    "exposeSommaire": "<p style=\"text-align: justify;\">Le pr&#233;sent amendement vise &#224; faire passer le taux de la TTF &#224; 0,5&#160;%, sur le mod&#232;le de la Stamp Duty britannique dont le taux est d&#233;j&#224; &#224; 0,5&#160;%. La TTF est d&#8217;une importance capitale pour financer la sant&#233; mondiale, la lutte contre la pauvret&#233; et le changement climatique&#160;: 50&#160;% de ses recettes sont aujourd&#8217;hui allou&#233;es &#224; ces enjeux. Cette taxe a pourtant &#233;t&#233; minor&#233;e par le pr&#233;sent projet de loi de finances par la suppression de la taxation des transactions intra-journali&#232;res de son assiette, se privant ainsi de ressources consid&#233;rables.&#160;</p>"
  },
  "representations": [
    {
      "nom": "PDF",
      "typeMime": {
        "type": "application",
        "subType": "PDF"
      },
      "statutRepresentation": {
        "verbatim": true,
        "canonique": true,
        "officielle": true,
        "transcription": false,
        "enregistrement": false
      },
      "contenu": {
        "documentURI": "/15/amendements/0235A/CION_FIN/CF68.pdf"
      }
    }
  ],
  "sort": {
    "dateSaisie": "2017-10-12T11:24:39.000+02:00",
    "sortEnSeance": "Rejeté"
  },
  "dateDepot": "2017-10-05T02:00:00.000+02:00",
  "dateDistribution": "2017-10-11T02:00:00.000+02:00",
  "article99": "0",
  "loiReference": {
    "codeLoi": "impôts",
    "divisionCodeLoi": "235 ter ZD"
  }
}