{
  "uid": "AMANR5L15PO59048B1255P1D1N113",
  "identifiant": {
    "legislature": "15",
    "numero": "113",
    "numRect": "0",
    "saisine": {
      "texteLegislatifRef": "PRJLANR5L15B1255",
      "numeroPartiePLF": "1",
      "organeExamen": "PO59048",
      "mentionSecondeDeliberation": "0"
    }
  },
  "numeroLong": "I-CF113",
  "etapeTexte": "1ère lecture (1ère assemblée saisie)",
  "triAmendement": "bkaaaaaaaaaaaaaaaaaaaaaaaaaaaaaaaaaaaaaaaaaaaaaaaajbs",
  "cardinaliteAmdtMultiples": "1",
  "etat": "Discuté",
  "signataires": {
    "auteur": {
      "typeAuteur": "Depute",
      "acteurRef": "PA330909",
      "groupePolitiqueRef": "PO730934"
    },
    "cosignatairesRefs": [
      "PA709315",
      "PA605036",
      "PA718884",
      "PA721968",
      "PA330909",
      "PA721678",
      "PA340853",
      "PA721474",
      "PA1874",
      "PA2155",
      "PA266793",
      "PA346054",
      "PA719318",
      "PA332523",
      "PA334654",
      "PA346218"
    ],
    "texteAffichable": "M.&#160;Descoeur,  M.&#160;Le Fur, M.&#160;Straumann, M.&#160;Menuel, M.&#160;Masson, M.&#160;Reda, M.&#160;Leclerc, M.&#160;Vialay, M.&#160;Bony, Mme&#160;Anthoine, Mme&#160;Bazin-Malgras, M.&#160;Viry, M.&#160;Abad, M.&#160;Emmanuel&#160;Maquet, M.&#160;Viala et Mme&#160;Dalloz"
  },
  "pointeurFragmentTexte": {
    "division": {
      "titre": "Article 8",
      "articleDesignationCourte": "ART. 8",
      "type": "ARTICLE",
      "avantAApres": "A",
      "divisionRattachee": "ARTICLE 8",
      "urlDivisionTexteVise": "/15/textes/1255A.asp#D_Article_8"
    },
    "alinea": {
      "avantAApres": "Apres",
      "numero": "22"
    }
  },
  "corps": {
    "dispositif": "<p style=\"text-align: justify;\">I. Apr&#232;s l&#8217;alin&#233;a&#160;22, ins&#233;rer l&#8217;alin&#233;a suivant&#160;: </p><p style=\"text-align: justify;\">&#171;&#160;1 <i>quindecies</i>. Aux r&#233;ceptions de d&#233;chets m&#233;nagers et assimil&#233;s collect&#233;s au titre du service public de gestion des d&#233;chets d&#233;fini aux articles L.&#160;2224&#8209;13 et L.&#160;2224&#8209;14 du code g&#233;n&#233;ral des collectivit&#233;s territoriales, dans une limite annuelle correspondant &#224; 120 kilogrammes de d&#233;chets par habitant collect&#233;.&#160;&#187;</p><p style=\"text-align: justify;\">II. La perte de recettes pour l&#8217;&#201;tat est compens&#233;e, &#224; due concurrence, par la cr&#233;ation d&#8217;une taxe additionnelle aux droits pr&#233;vus aux articles 575 et 575 A du code g&#233;n&#233;ral des imp&#244;ts.</p>",
    "exposeSommaire": "<p style=\"text-align: justify;\">Sur les 568 kg de d&#233;chets produit par un Fran&#231;ais chaque ann&#233;e, 190 kg sont concern&#233;s par la Responsabilit&#233; &#233;largie du producteur (REP) et peuvent donc &#234;tre d&#233;tourn&#233;s de l&#8217;&#233;limination, 194 sont des biod&#233;chets (d&#233;chets alimentaires et d&#233;chets verts) que les collectivit&#233;s sont en charge de valoriser. Les 184 kg/hab restant ne disposent d&#8217;aucune fili&#232;re de recyclage, et sont donc n&#233;cessairement &#233;limin&#233;s dans les installations de stockage et de traitement thermique. Les collectivit&#233;s doivent payer la TGAP pour l&#8217;&#233;limination de ces d&#233;chets.</p><p style=\"text-align: justify;\">&#160;</p><p style=\"text-align: justify;\">Pourtant, les collectivit&#233;s n&#8217;ont aucune prise ni sur la conception de ces produits qui n&#8217;ont aucune fili&#232;re de recyclage, ni sur leur mise sur le march&#233;, ni sur leur consommation. Il semble donc injuste de les taxer pour l&#8217;&#233;limination de ces d&#233;chets pour lesquels il n&#8217;existe aucune alternative. Cet amendement vise donc &#224; accorder aux collectivit&#233;s une franchise correspondant &#224; cette part de d&#233;chets r&#233;siduels in&#233;vitables.</p><p style=\"text-align: justify;\">&#160;</p><p style=\"text-align: justify;\">Le montant de 120 kg/hab correspond aux 184 kg &#233;voqu&#233;s plus haut, moins 64 kg/hab correspondant aux d&#233;chets concern&#233;s par les nouvelles fili&#232;res de recyclage annonc&#233;es par le gouvernement dans le cadre de la feuille de route &#233;conomie circulaire (jouets/jeux, articles de sport et loisir, articles de bricolage et de jardin y compris d&#233;chets du b&#226;timent).&#160;Il est &#233;galement important de noter que ce chiffre est sous-&#233;valu&#233;, car une part significative des d&#233;chets sous REP ne sont pas recyclables.</p><p style=\"text-align: justify;\">&#160;</p><p style=\"text-align: justify;\">Cette mesure est facile &#224; mettre en place pour les exploitants et &#224; contr&#244;ler par les douanes. Elle a &#233;galement le m&#233;rite de maintenir le signal prix voulu par le gouvernement sur l&#8217;&#233;limination des d&#233;chets, qui justifie l&#8217;augmentation de la TGAP en discussion dans ce projet de loi de finances.</p><p style=\"text-align: justify;\">En effet, avec cette mesure, l&#8217;&#233;limination sera toujours plus ch&#232;re que le recyclage pour tous les d&#233;chets pour lesquels les collectivit&#233;s ont v&#233;ritablement des marges de man&#339;uvre. Cette mesure permettrait donc de mettre en place une fiscalit&#233; incitative pour contribuer &#224; la r&#233;duction de l&#8217;&#233;limination des d&#233;chets, sans entra&#238;ner une hausse trop importante de la pression fiscale pour les collectivit&#233;s.</p>"
  },
  "representations": [
    {
      "nom": "PDF",
      "typeMime": {
        "type": "application",
        "subType": "PDF"
      },
      "statutRepresentation": {
        "verbatim": true,
        "canonique": true,
        "officielle": true,
        "transcription": false,
        "enregistrement": false
      },
      "contenu": {
        "documentURI": "/15/amendements/1255A/CION_FIN/CF113.pdf"
      }
    }
  ],
  "sort": {
    "dateSaisie": "2018-10-10T10:51:18.000+02:00",
    "sortEnSeance": "Rejeté"
  },
  "dateDepot": "2018-10-02T02:00:00.000+02:00",
  "dateDistribution": "2018-10-08T02:00:00.000+02:00",
  "article99": "0",
  "loiReference": {}
}