{
  "uid": "AMANR5L15SEA717460B1371P0D1N388",
  "identifiant": {
    "legislature": "15",
    "numero": "388",
    "numRect": "0",
    "saisine": {
      "texteLegislatifRef": "PRJLANR5L15B1371",
      "numeroPartiePLF": "0",
      "organeExamen": "PO717460",
      "mentionSecondeDeliberation": "0"
    }
  },
  "numeroLong": "388",
  "etapeTexte": "1ère lecture (1ère assemblée saisie)",
  "triAmendement": "jiaaaaaaaaaaaaaaaaaaaaaaaaaaaaaaaaaaaaaaaaaaaaaaaainpc",
  "cardinaliteAmdtMultiples": "1",
  "etat": "Discuté",
  "signataires": {
    "auteur": {
      "typeAuteur": "Depute",
      "acteurRef": "PA942",
      "groupePolitiqueRef": "PO759900"
    },
    "cosignatairesRefs": [
      "PA942"
    ],
    "texteAffichable": "M.&#160;Charles&#160;de Courson"
  },
  "pointeurFragmentTexte": {
    "division": {
      "titre": "Article 8",
      "articleDesignationCourte": "APRÈS ART. 8",
      "type": "ARTICLE",
      "avantAApres": "Apres",
      "divisionRattachee": "APRÈS L'ARTICLE 8, insérer l'article suivant:",
      "articleAdditionnel": "1",
      "urlDivisionTexteVise": "/15/textes/1371.asp#D_Article_8"
    }
  },
  "corps": {
    "dispositif": "<p>I.&#160;&#8211;&#160;&#192; la derni&#232;re phrase du deuxi&#232;me alin&#233;a de l&#8217;article&#160;235 ter X du code g&#233;n&#233;ral des imp&#244;ts, le taux&#160;: &#171;&#160;0,40&#160;%&#160;&#187; est remplac&#233; par le taux&#160;: &#171;&#160;0,20&#160;%&#160;&#187;.</p><p>II.&#160;&#8211;&#160;Le I s&#8217;applique au calcul de la taxe pr&#233;vue &#224; l&#8217;article&#160;235 ter X du code g&#233;n&#233;ral des imp&#244;ts au titre des mois &#233;coul&#233;s du 1<sup>er</sup> janvier 2018 au 31 d&#233;cembre 2020.</p><p>III.&#160;&#8211;&#160;La perte de recettes pour l&#8217;&#201;tat est compens&#233;e &#224; due concurrence par la cr&#233;ation d&#8217;une taxe additionnelle aux droits mentionn&#233;s aux articles 575 et 575 A du code g&#233;n&#233;ral des imp&#244;ts.</p>",
    "exposeSommaire": "<p style=\"text-align: justify;\">En coh&#233;rence avec les dispositions vot&#233;es l&#8217;an dernier, le pr&#233;sent amendement propose de r&#233;duire le taux de la taxe sur les bonis dans les m&#234;mes proportions que celui de l&#8217;int&#233;r&#234;t de retard, auquel il se rattache&#160;</p><p style=\"text-align: justify;\">La taxe sur les bonis est due par les entreprises d&#8217;assurance de dommages lorsqu&#8217;il s&#8217;av&#232;re que les provisions pour sinistres qui ont &#233;t&#233; constitu&#233;es&#160;&#8211;&#160;et fiscalement d&#233;duites&#160;&#8211;&#160;&#233;taient exc&#233;dentaires. Elle est auto-liquid&#233;e par l&#8217;entreprise. Comme le pr&#233;cisent les dispositions de l&#8217;article&#160;235 ter X, elle doit &#234;tre repr&#233;sentative de l&#8217;int&#233;r&#234;t correspondant &#224; l&#8217;avantage de tr&#233;sorerie obtenu du fait du provisionnement exc&#233;dentaire.</p><p style=\"text-align: justify;\">Depuis sa cr&#233;ation et jusqu&#8217;&#224; l&#8217;an dernier, son taux &#233;tait donc align&#233; sur celui de l&#8217;int&#233;r&#234;t de retard, qui est lui aussi repr&#233;sentatif du &#171;&#160;prix du temps&#160;&#187;.</p><p style=\"text-align: justify;\">Prenant acte de l&#8217;&#233;volution des conditions de march&#233; au cours des derni&#232;res ann&#233;es, et du caract&#232;re excessif du taux de l&#8217;int&#233;r&#234;t de retard alors en vigueur&#160;&#8211;&#160;de 0.40&#160;% par mois&#160;&#8211;&#160;l&#8217;article&#160;55 de la LFR 2017 a d&#233;sormais r&#233;duit ce dernier de moiti&#233; jusqu&#8217;au 31 d&#233;cembre 2020. En revanche, le taux de la taxe sur les bonis reste encore fix&#233; &#224; 0.40&#160;% par mois,&#160;soit 4.80&#160;% par an, et s&#8217;inscrit donc toujours en fort d&#233;calage par rapport &#224; la r&#233;alit&#233; financi&#232;re.</p><p style=\"text-align: justify;\">Le pr&#233;sent amendement tend &#224; corriger cette situation et &#224; r&#233;aligner le taux de la taxe sur les bonis sur celui de l&#8217;int&#233;r&#234;t de retard.</p>"
  },
  "representations": [
    {
      "nom": "PDF",
      "typeMime": {
        "type": "application",
        "subType": "PDF"
      },
      "statutRepresentation": {
        "verbatim": true,
        "canonique": true,
        "officielle": true,
        "transcription": false,
        "enregistrement": false
      },
      "contenu": {
        "documentURI": "/15/amendements/1371/AN/388.pdf"
      }
    }
  ],
  "seanceDiscussion": "RUANR5L15S2019IDS21366",
  "sort": {
    "dateSaisie": "2018-11-13T01:39:39.000+01:00",
    "sortEnSeance": "Non soutenu"
  },
  "dateDepot": "2018-11-09T01:00:00.000+01:00",
  "dateDistribution": "2018-11-12T01:00:00.000+01:00",
  "article99": "0",
  "loiReference": {
    "codeLoi": "CGI",
    "divisionCodeLoi": "235 ter X"
  }
}