{
  "uid": "AMANR5L15SEA717460BTC0971P0D1N2497",
  "identifiant": {
    "legislature": "15",
    "numero": "2497",
    "numRect": "0",
    "saisine": {
      "texteLegislatifRef": "PRJLANR5L15BTC0971",
      "numeroPartiePLF": "0",
      "organeExamen": "PO717460",
      "mentionSecondeDeliberation": "0"
    }
  },
  "numeroLong": "2497",
  "etapeTexte": "1ère lecture (1ère assemblée saisie)",
  "triAmendement": "k",
  "cardinaliteAmdtMultiples": "1",
  "etat": "Discuté",
  "signataires": {
    "auteur": {
      "typeAuteur": "Depute",
      "acteurRef": "PA336175",
      "groupePolitiqueRef": "PO723569"
    },
    "cosignatairesRefs": [
      "PA608292",
      "PA336175",
      "PA605694"
    ],
    "texteAffichable": "Mme&#160;Pinel,  Mme&#160;Dubi&#233; et M.&#160;Falorni"
  },
  "pointeurFragmentTexte": {
    "division": {
      "titre": "Article 9",
      "articleDesignationCourte": "ART. 9",
      "type": "ARTICLE",
      "avantAApres": "A",
      "divisionRattachee": "ARTICLE 9",
      "urlDivisionTexteVise": "/15/textes/0971.asp#D_Article_9"
    }
  },
  "corps": {
    "dispositif": "<p style=\"text-align: justify;\">R&#233;diger ainsi cet article&#160;:</p><p style=\"text-align: justify;\">&#171;&#160;Au 3&#176; de l'article L.&#160;152-6 du code de l'urbanisme, apr&#232;s le mot&#160;: &#171;&#160;stationnement&#160;&#187;, sont ins&#233;r&#233;s les mots&#160;: &#171;&#160;et, d&#232;s que la commune ne fait pas l&#8217;objet d&#8217;un arr&#234;t&#233; au titre de l&#8217;article L.&#160;302&#8209;9&#8209;1 du code de la construction et de l&#8217;habitation, aux r&#232;gles adopt&#233;es en application de l&#8217;article L.&#160;151&#8209;15,&#160;&#187; et apr&#232;s le mot&#160;: &#171;&#160;limite&#160;&#187;, sont ins&#233;r&#233;s les mots&#160;: &#171;&#160;d&#8217;une majoration de 10&#160;%&#160;&#187;.</p>",
    "exposeSommaire": "<p style=\"text-align: justify;\">L'article 9 remet en cause les avanc&#233;es de la loi &#201;galit&#233; et citoyennet&#233;, qui avait permis que la mixit&#233; sociale soit un objectif principal dans la construction de logements et dans l'attribution de logements sociaux. En effet, cet article accuse la mixit&#233; sociale d'aller &#224; l'encontre de la transformation des bureaux en logements.</p><p style=\"text-align: justify;\">Or, cet article m&#233;connait l'&#233;tat de la situation actuelle. D'une part, les immeubles compos&#233;s de bureaux permettent de r&#233;&#233;quilibrer, dans certains territoires, la part de logements sociaux avec celle de logements libres. D'autre part, les &#233;volutions r&#233;cente en mati&#232;re de fiscalit&#233; a conduit &#224; renforcer l'incitation financi&#232;re des entreprises afin qu'elle puisse ais&#233;ment c&#233;der leurs locaux de bureaux en vue de cr&#233;er des logements.</p><p style=\"text-align: justify;\">Alors que la France doit tendre vers plus de mixit&#233; sociale pour mener un am&#233;nagement des territoires ambitieux et correspondant aux attentes de nos concitoyens, cet article est un recul massif et c'est pourquoi le pr&#233;sent amendement vise &#224; supprimer les dispositions qui portent atteintes &#224; l'objectif de mixit&#233; sociale.</p>"
  },
  "representations": [
    {
      "nom": "PDF",
      "typeMime": {
        "type": "application",
        "subType": "PDF"
      },
      "statutRepresentation": {
        "verbatim": true,
        "canonique": true,
        "officielle": true,
        "transcription": false,
        "enregistrement": false
      },
      "contenu": {
        "documentURI": "/15/amendements/0971/AN/2497.pdf"
      }
    }
  ],
  "seanceDiscussion": "RUANR5L15S2018IDS21065",
  "sort": {
    "dateSaisie": "2018-05-31T21:47:26.000+02:00",
    "sortEnSeance": "Rejeté"
  },
  "dateDepot": "2018-05-26T02:00:00.000+02:00",
  "dateDistribution": "2018-05-29T02:00:00.000+02:00",
  "article99": "0",
  "loiReference": {}
}