{
  "uid": "AMANR5L15SEA717460BTC1019P0D1N746",
  "identifiant": {
    "legislature": "15",
    "numero": "746",
    "numRect": "0",
    "saisine": {
      "texteLegislatifRef": "PRJLANR5L15BTC1019",
      "numeroPartiePLF": "0",
      "organeExamen": "PO717460",
      "mentionSecondeDeliberation": "1"
    }
  },
  "numeroLong": "746",
  "etapeTexte": "1ère lecture (1ère assemblée saisie)",
  "triAmendement": "byzki",
  "cardinaliteAmdtMultiples": "1",
  "etat": "Discuté",
  "signataires": {
    "auteur": {
      "typeAuteur": "Depute",
      "acteurRef": "PA333421",
      "groupePolitiqueRef": "PO744425"
    },
    "cosignatairesRefs": [
      "PA719806",
      "PA712014",
      "PA266788",
      "PA720996",
      "PA702052",
      "PA267780",
      "PA333421"
    ],
    "texteAffichable": "M.&#160;Pancher,  Mme&#160;Firmin Le Bodo, M.&#160;Ledoux, Mme&#160;Auconie, M.&#160;Morel-&#192;-L&apos;Huissier, M.&#160;El Guerrab et Mme&#160;Sage"
  },
  "pointeurFragmentTexte": {
    "division": {
      "titre": "Article 17",
      "articleDesignationCourte": "ART. 17",
      "type": "ARTICLE",
      "avantAApres": "A",
      "divisionRattachee": "ARTICLE 17",
      "urlDivisionTexteVise": "/15/textes/1019.asp#D_Article_17"
    },
    "alinea": {
      "numero": "71"
    }
  },
  "corps": {
    "dispositif": "<p style=\"text-align: justify;\">I.&#160;&#8211;&#160;Compl&#233;ter l&#8217;alin&#233;a&#160;71 la phrase suivante&#160;:</p><p style=\"text-align: justify;\">&#171;&#160;Un accord collectif de branche &#233;tendu peut relever ce seuil d&#8217;effectif dans la limite d&#8217;un plafond d&#233;fini par d&#233;cret ;&#160;&#187;</p><p style=\"text-align: justify;\">II.&#160;&#8211;&#160;En cons&#233;quence, compl&#233;ter l&#8217;alin&#233;a&#160;80 par la phrase suivante&#160;:</p><p style=\"text-align: justify;\">&#171;&#160;Un accord collectif de branche &#233;tendu peut relever ce seuil d&#8217;effectif dans la limite d&#8217;un plafond d&#233;fini par d&#233;cret ;&#160;&#187;</p>",
    "exposeSommaire": "<p style=\"text-align: justify;\">Le l&#233;gislateur a relev&#233; que l&#8217;acc&#232;s des salari&#233;s des petites et moyennes entreprises &#224; la formation professionnelle demeure insuffisant. En ce sens, le pr&#233;sent projet de loi propose une d&#233;finition de l&#8217;action de formation modernis&#233;e, un plan de formation r&#233;nov&#233; et une mutualisation financi&#232;re sp&#233;cifique, autour d&#8217;un syst&#232;me de solidarit&#233; financi&#232;re des grandes entreprises au profit des petites, pour le financement de leur plan de d&#233;veloppement des comp&#233;tences.</p><p style=\"text-align: justify;\">Or, le projet de loi pr&#233;voit que pourront seules b&#233;n&#233;ficier de ces fonds les entreprises d&#8217;une taille inf&#233;rieure &#224; 50 salari&#233;s. Ce faisant, le projet de loi cr&#233;e une diff&#233;rence de traitement particuli&#232;rement p&#233;nalisant notamment pour les PME de 50 &#224; 300 salari&#233;s, dont les probl&#233;matiques de mise en &#339;uvre de la formation sont similaires, sans omettre les effets n&#233;gatifs sur la formation et la s&#233;curisation des parcours professionnels des salari&#233;s concern&#233;s.&#160;</p><p style=\"text-align: justify;\">Le pr&#233;sent amendement propose en cons&#233;quence de pouvoir relever ce seuil par accord collectif de branche &#233;tendu dans la limite d&#8217;un plafond d&#233;fini par d&#233;cret. Ce plafond pourra &#234;tre fix&#233; &#224; 300 salari&#233;s conform&#233;ment &#224; la volont&#233; des partenaires sociaux exprim&#233;e dans l&#8217;accord national interprofessionnel pour l&#8217;accompagnement des &#233;volutions professionnelles, l&#8217;investissement dans les comp&#233;tences et le d&#233;veloppement de l&#8217;alternance du 22 f&#233;vrier 2018.</p>"
  },
  "representations": [
    {
      "nom": "PDF",
      "typeMime": {
        "type": "application",
        "subType": "PDF"
      },
      "statutRepresentation": {
        "verbatim": true,
        "canonique": true,
        "officielle": true,
        "transcription": false,
        "enregistrement": false
      },
      "contenu": {
        "documentURI": "/15/amendements/1019/AN/746.pdf"
      }
    }
  ],
  "seanceDiscussion": "RUANR5L15S2018IDS21105",
  "sort": {
    "dateSaisie": "2018-06-15T17:15:49.000+02:00",
    "sortEnSeance": "Non soutenu"
  },
  "dateDepot": "2018-06-06T02:00:00.000+02:00",
  "dateDistribution": "2018-06-12T02:00:00.000+02:00",
  "article99": "0",
  "loiReference": {}
}