{
  "uid": "AMANR5L15PO419865B1393P0D1N172",
  "identifiant": {
    "legislature": "15",
    "numero": "172",
    "numRect": "0",
    "saisine": {
      "texteLegislatifRef": "PIONANR5L15B1393",
      "numeroPartiePLF": "0",
      "organeExamen": "PO419865",
      "mentionSecondeDeliberation": "0"
    }
  },
  "numeroLong": "CD172",
  "etapeTexte": "1ère lecture (2ème assemblée saisie)",
  "triAmendement": "baaaaaaaaaaaaaaaaaaaaaaaaaaaaaaaaaaaaaaaaaaaaaaaaabaztzzs",
  "cardinaliteAmdtMultiples": "1",
  "etat": "Discuté",
  "signataires": {
    "auteur": {
      "typeAuteur": "Depute",
      "acteurRef": "PA330909",
      "groupePolitiqueRef": "PO730934"
    },
    "cosignatairesRefs": [
      "PA718884",
      "PA720644",
      "PA718838",
      "PA267527",
      "PA266797",
      "PA709315",
      "PA346218",
      "PA266776",
      "PA605036",
      "PA266793",
      "PA330909",
      "PA340853",
      "PA856",
      "PA266808",
      "PA267204",
      "PA642847",
      "PA720210",
      "PA719318",
      "PA346054"
    ],
    "texteAffichable": "M.&#160;Descoeur,  M.&#160;Nury, M.&#160;Sermier, M.&#160;Reiss, Mme&#160;Anthoine, Mme&#160;Bazin-Malgras, M.&#160;Leclerc, M.&#160;Saddier, M.&#160;Cherpion, M.&#160;Bony, M.&#160;Brun, M.&#160;Bazin, M.&#160;Emmanuel&#160;Maquet, M.&#160;Gosselin, M.&#160;Masson, M.&#160;Viala, M.&#160;Rolland, Mme&#160;Beauvais et M.&#160;Abad"
  },
  "pointeurFragmentTexte": {
    "division": {
      "titre": "Article 2",
      "articleDesignationCourte": "ART. 2",
      "type": "ARTICLE",
      "avantAApres": "A",
      "divisionRattachee": "ARTICLE 2",
      "urlDivisionTexteVise": "/15/textes/1393.asp#D_Article_2"
    },
    "alinea": {
      "numero": "13"
    }
  },
  "corps": {
    "dispositif": "<p>Compl&#233;ter l&#8217;alin&#233;a&#160;13 par les mots&#160;:</p><p style=\"text-align: justify;\">&#171;&#160;en lien avec les politiques d&#8217;attractivit&#233; ou d&#8217;accueil d&#8217;actifs mises en &#339;uvre par les collectivit&#233;s territoriales&#160;&#187;.</p>",
    "exposeSommaire": "<p style=\"text-align: justify;\">Il convient que la nouvelle Agence prenne une part active aux politiques de reconqu&#234;te d&#233;mographique mises en &#339;uvre par les collectivit&#233;s locales dans les zones en d&#233;prise d&#233;mographique et, plus largement, aux politiques mises en &#339;uvre par les collectivit&#233;s pour attirer de nouveaux actifs ou habitants, afin de favoriser l&#8217;am&#233;nagement du territoire. Tel est l&#8217;objet du pr&#233;sent amendement.</p>"
  },
  "representations": [
    {
      "nom": "PDF",
      "typeMime": {
        "type": "application",
        "subType": "PDF"
      },
      "statutRepresentation": {
        "verbatim": true,
        "canonique": true,
        "officielle": true,
        "transcription": false,
        "enregistrement": false
      },
      "contenu": {
        "documentURI": "/15/amendements/1393/CION-DVP/CD172.pdf"
      }
    }
  ],
  "sort": {
    "dateSaisie": "2019-02-05T22:37:44.000+01:00",
    "sortEnSeance": "Tombé"
  },
  "dateDepot": "2019-01-31T01:00:00.000+01:00",
  "dateDistribution": "2019-02-03T01:00:00.000+01:00",
  "article99": "0",
  "loiReference": {}
}