{
  "uid": "AMANR5L15PO419604B1481P0D1N444",
  "identifiant": {
    "legislature": "15",
    "numero": "444",
    "numRect": "0",
    "saisine": {
      "texteLegislatifRef": "PRJLANR5L15B1481",
      "numeroPartiePLF": "0",
      "organeExamen": "PO419604",
      "mentionSecondeDeliberation": "0"
    }
  },
  "numeroLong": "AC444",
  "etapeTexte": "1ère lecture (1ère assemblée saisie)",
  "triAmendement": "ecaaaaaaaaaaaaaaaaaaaaaaaaaaaaaaaaaaaaaaaaaaaaaaaabo",
  "cardinaliteAmdtMultiples": "1",
  "etat": "Discuté",
  "signataires": {
    "auteur": {
      "typeAuteur": "Depute",
      "acteurRef": "PA340357",
      "groupePolitiqueRef": "PO758835"
    },
    "cosignatairesRefs": [
      "PA1008",
      "PA642764",
      "PA340357",
      "PA1198",
      "PA608695",
      "PA607553",
      "PA335054",
      "PA605069",
      "PA335532",
      "PA333818",
      "PA508",
      "PA608741",
      "PA720988",
      "PA333285",
      "PA609590",
      "PA719930",
      "PA267233",
      "PA340343",
      "PA610681",
      "PA608011",
      "PA332614",
      "PA342415",
      "PA643145",
      "PA337483",
      "PA608172",
      "PA1809",
      "PA429893",
      "PA1592",
      "PA609332"
    ],
    "texteAffichable": "Mme&#160;Victory,  M.&#160;Juanico, Mme&#160;Manin, Mme&#160;Pau-Langevin, Mme&#160;Tolmont, M.&#160;Aviragnet, Mme&#160;Bareigts, Mme&#160;Battistel, Mme&#160;Bi&#233;mouret, M.&#160;Bouillon, M.&#160;Jean-Louis&#160;Bricout, M.&#160;Carvounas, M.&#160;Alain&#160;David, Mme&#160;Laurence&#160;Dumont, M.&#160;Faure, M.&#160;Garot, M.&#160;David&#160;Habib, M.&#160;Hutin, Mme&#160;Karamanli, M.&#160;J&#233;r&#244;me&#160;Lambert, M.&#160;Letchimy, Mme&#160;Pires Beaune, M.&#160;Potier, M.&#160;Pueyo, Mme&#160;Rabault, M.&#160;Saulignac, Mme&#160;Untermaier, Mme&#160;Vainqueur-Christophe et M.&#160;Vallaud"
  },
  "pointeurFragmentTexte": {
    "division": {
      "titre": "Article 12",
      "articleDesignationCourte": "ART. 12",
      "type": "ARTICLE",
      "avantAApres": "A",
      "divisionRattachee": "ARTICLE 12",
      "urlDivisionTexteVise": "/15/textes/1481.asp#D_Article_12"
    },
    "alinea": {
      "numero": "3"
    }
  },
  "corps": {
    "dispositif": "<p style=\"text-align: justify;\">R&#233;diger ainsi l&#8217;alin&#233;a&#160;3&#160;:</p><p style=\"text-align: justify;\">&#171;&#160;Le directeur de l&#8217;&#233;cole est nomm&#233; pour un mandat de cinq ans par arr&#234;t&#233; conjoint des ministres charg&#233;s de l&#8217;enseignement sup&#233;rieur et de l&#8217;&#233;ducation nationale, sur proposition du conseil de l&#8217;&#233;cole.&#160;&#187;&#160;;&#160;&#187;.</p>",
    "exposeSommaire": "<p style=\"text-align: justify;\">Par cette disposition, c&#8217;est le retour de la main mise du Ministre sur la formation des enseignants qui est act&#233;e. Actuellement, la proposition du nom des directeurs de ces &#233;coles appartient aux conseils des Esp&#233; . Vous d&#233;cidez de reprendre la main en nommant directement les directeurs.</p><p style=\"text-align: justify;\">C&#8217;est pourquoi le groupe Socialistes et apparent&#233;s propose d&#8217;une part de r&#233;introduire la proposition du conseil de l&#8217;&#233;cole en amont et d&#8217;autre part la limitation dans le temps, 5 ans, du mandat.&#160;</p>"
  },
  "representations": [
    {
      "nom": "PDF",
      "typeMime": {
        "type": "application",
        "subType": "PDF"
      },
      "statutRepresentation": {
        "verbatim": true,
        "canonique": true,
        "officielle": true,
        "transcription": false,
        "enregistrement": false
      },
      "contenu": {
        "documentURI": "/15/amendements/1481/CION-CEDU/AC444.pdf"
      }
    }
  ],
  "sort": {
    "dateSaisie": "2019-01-30T23:32:22.000+01:00",
    "sortEnSeance": "Rejeté"
  },
  "dateDepot": "2019-01-25T01:00:00.000+01:00",
  "dateDistribution": "2019-01-28T01:00:00.000+01:00",
  "article99": "0",
  "loiReference": {}
}