{
  "uid": "AMANR5L15SEA717460B1255P2D1N836",
  "identifiant": {
    "legislature": "15",
    "numero": "836",
    "numRect": "0",
    "saisine": {
      "texteLegislatifRef": "PRJLANR5L15B1255",
      "numeroPartiePLF": "2",
      "organeExamen": "PO717460",
      "mentionSecondeDeliberation": "0"
    }
  },
  "numeroLong": "II-836",
  "etapeTexte": "1ère lecture (1ère assemblée saisie)",
  "triAmendement": "fcaaaaaaaaaaaaaaaaaaaaaaaaaaaaaaaaaaaaaaaaaaaaaaaablx",
  "cardinaliteAmdtMultiples": "1",
  "etat": "Discuté",
  "signataires": {
    "auteur": {
      "typeAuteur": "Depute",
      "acteurRef": "PA608016",
      "groupePolitiqueRef": "PO730934"
    },
    "cosignatairesRefs": [
      "PA608016",
      "PA720644",
      "PA643089",
      "PA267429",
      "PA608826",
      "PA609726",
      "PA608416",
      "PA332523",
      "PA346054"
    ],
    "texteAffichable": "Mme&#160;Louwagie,  M.&#160;Emmanuel&#160;Maquet, Mme&#160;Dalloz, M.&#160;Aubert, Mme&#160;Duby-Muller, M.&#160;Cinieri, M.&#160;Thi&#233;riot, M.&#160;Hetzel et M.&#160;Nury"
  },
  "pointeurFragmentTexte": {
    "division": {
      "titre": "Article 56",
      "articleDesignationCourte": "APRÈS ART. 56",
      "type": "ARTICLE",
      "avantAApres": "Apres",
      "divisionRattachee": "APRÈS L'ARTICLE 56, insérer l'article suivant:",
      "articleAdditionnel": "1",
      "urlDivisionTexteVise": "/15/textes/1255C.asp#D_Article_56"
    }
  },
  "corps": {
    "dispositif": "<p style=\"text-align: justify;\">I.&#160;&#8211;&#160;Le code g&#233;n&#233;ral des imp&#244;ts est ainsi modifi&#233;&#160;:</p><p style=\"text-align: justify;\">1&#176; Apr&#232;s l&#8217;article&#160;1382 D, il est ins&#233;r&#233; un article&#160;1382 D <i>bis</i> ainsi r&#233;dig&#233;&#160;:</p><p style=\"text-align: justify;\">&#171;&#160;<i>Art.&#160;1382 D</i> bis.&#160;&#8211;&#160;Les collectivit&#233;s territoriales et les &#233;tablissements publics de coop&#233;ration intercommunale &#224; fiscalit&#233; propre peuvent, par d&#233;lib&#233;ration prise dans les conditions pr&#233;vues &#224; l&#8217;article&#160;1639 A <i>bis</i>, exon&#233;rer de taxe fonci&#232;re les installations et b&#226;timents de toute nature affect&#233;s &#224; la production de biogaz, d&#8217;&#233;lectricit&#233; et de chaleur par m&#233;thanisation, non mentionn&#233;s au 14&#176; de l&#8217;article&#160;1382 et tels qu&#8217;autoris&#233;s, enregistr&#233;s ou d&#233;clar&#233;s au titre de l&#8217;article L.&#160;511&#8209;1 du code de l&#8217;environnement.</p><p style=\"text-align: justify;\">&#171;&#160;Lorsqu&#8217;elle est pr&#233;vue par les collectivit&#233;s territoriales, pour b&#233;n&#233;ficier de cette exon&#233;ration, le propri&#233;taire doit adresser, avant le 1<sup>er</sup> janvier de la premi&#232;re ann&#233;e &#224; compter de laquelle l&#8217;exon&#233;ration est applicable, une d&#233;claration, dont le mod&#232;le est fix&#233; par l&#8217;administration, au service des imp&#244;ts du lieu de situation des biens. Cette d&#233;claration comporte les &#233;l&#233;ments permettant d&#8217;identifier les installations et b&#226;timents concern&#233;s et de v&#233;rifier le respect des conditions mentionn&#233;es au premier alin&#233;a. Lorsque cette d&#233;claration est souscrite hors d&#233;lai, l&#8217;exon&#233;ration s&#8217;applique pour la p&#233;riode restant &#224; courir apr&#232;s le 31 d&#233;cembre de l&#8217;ann&#233;e de souscription.&#160;&#187;</p><p style=\"text-align: justify;\">2&#176; Apr&#232;s l&#8217;article&#160;1464 M, il est ins&#233;r&#233; un article&#160;1464 N ainsi r&#233;dig&#233;&#160;:</p><p style=\"text-align: justify;\">&#171;&#160;<i>Art.&#160;1464 N</i>.&#160;&#8211;&#160;Les collectivit&#233;s territoriales et les &#233;tablissements publics de coop&#233;ration intercommunale &#224; fiscalit&#233; propre peuvent, par d&#233;lib&#233;ration prise dans les conditions pr&#233;vues &#224; l&#8217;article&#160;1639 A <i>bis</i>, exon&#233;rer de cotisation fonci&#232;re des entreprises les soci&#233;t&#233;s produisant du biogaz, de l&#8217;&#233;lectricit&#233; et de la chaleur par la m&#233;thanisation, non mentionn&#233;es au 5&#176; du I de l&#8217;article&#160;1451, et exploitant des installations autoris&#233;es, enregistr&#233;es ou d&#233;clar&#233;es au titre de l&#8217;article L.&#160;511&#8209;1 du code de l&#8217;environnement.</p><p style=\"text-align: justify;\">&#171;&#160;Lorsqu&#8217;elle est pr&#233;vue par les collectivit&#233;s territoriales, pour b&#233;n&#233;ficier de cette exon&#233;ration, le propri&#233;taire doit adresser, avant le 1<sup>er</sup> janvier de la premi&#232;re ann&#233;e &#224; compter de laquelle l&#8217;exon&#233;ration est applicable, une d&#233;claration, dont le mod&#232;le est fix&#233; par l&#8217;administration, au service des imp&#244;ts du lieu de situation des biens. Cette d&#233;claration comporte les &#233;l&#233;ments permettant d&#8217;identifier les installations et b&#226;timents concern&#233;s et de v&#233;rifier le respect des conditions mentionn&#233;es au premier alin&#233;a. Lorsque cette d&#233;claration est souscrite hors d&#233;lai, l&#8217;exon&#233;ration s&#8217;applique pour la p&#233;riode restant &#224; courir apr&#232;s le 31 d&#233;cembre de l&#8217;ann&#233;e de souscription.&#160;&#187;</p><p style=\"text-align: justify;\">III.&#160;&#8211;&#160;La perte de recettes pour les collectivit&#233;s territoriales est compens&#233;e par la majoration &#224; due concurrence de la dotation globale de fonctionnement, et corr&#233;lativement pour l&#8217;&#201;tat par la hausse de la composante carbone int&#233;gr&#233;e aux tarifs des taxes int&#233;rieures sur la consommation des produits &#233;nerg&#233;tiques inscrites au tableau B du 1 de l&#8217;article&#160;265 du code des douanes.&#160;</p>",
    "exposeSommaire": "<p style=\"text-align: justify;\">Le pr&#233;sent amendement a pour objet d&#8217;&#233;tendre, sous r&#233;serve que les collectivit&#233;s le souhaitent, les exon&#233;rations de taxe fonci&#232;re et de cotisation fonci&#232;re des entreprises pr&#233;vues &#224; l&#8217;article&#160;1382 pour les installations de m&#233;thanisation agricole et &#224; l&#8217;article&#160;1451 pour les soci&#233;t&#233;s de m&#233;thanisation agricole &#224; toutes les installations et soci&#233;t&#233;s de m&#233;thanisation.</p><p style=\"text-align: justify;\">En effet, la programmation &#233;nerg&#233;tique fran&#231;aise repose pour une part non n&#233;gligeable sur le d&#233;veloppement de la fili&#232;re biogaz qui est une fili&#232;re &#224; fort potentiel mais encore naissante et faisant face aux difficult&#233;s de rentabilit&#233; des premi&#232;res ann&#233;es de fonctionnement.</p><p style=\"text-align: justify;\">De plus, les &#233;tudes men&#233;es pour caract&#233;riser le gisement disponible pour les installations de m&#233;thanisation montrent que le potentiel de d&#233;veloppement de cette fili&#232;re r&#233;side effectivement au niveau d&#8217;installations agricoles mais &#233;galement dans la fili&#232;re de la m&#233;thanisation d&#8217;autres types de d&#233;chets non dangereux et de mati&#232;re v&#233;g&#233;tale, notamment vis-&#224;-vis du d&#233;veloppement de la collecte et du tri des biod&#233;chets.</p><p style=\"text-align: justify;\">Le d&#233;veloppement de l&#8217;ensemble des types de m&#233;thanisation est n&#233;cessaire. D&#8217;une part, il est indispensable &#224; l&#8217;augmentation de la capacit&#233; de production de biogaz, source d&#8217;&#233;nergie renouvelable non substituable, en vue d&#8217;atteindre l&#8217;objectif de 10&#160;% d&#8217;&#233;nergies renouvelables dans la consommation de gaz fix&#233; par la loi. D&#8217;autre part, le d&#233;veloppement combin&#233; d&#8217;installations agricoles et d&#8217;installations de plus grande taille renforce la viabilit&#233; &#233;conomique de l&#8217;ensemble de la fili&#232;re, en permettant d&#8217;atteindre la taille de march&#233; n&#233;cessaire &#224; l&#8217;&#233;mergence de services au fonctionnement des m&#233;thaniseurs, quels qu&#8217;ils soient, efficaces et comp&#233;titifs sur l&#8217;ensemble du territoire.&#160;</p><p style=\"text-align: justify;\">Le pr&#233;sent amendement vise donc &#224; apporter un soutien indispensable au d&#233;veloppement de la fili&#232;re dans un contexte de difficult&#233;s &#233;conomiques soulign&#233;es par la Commission de r&#233;gulation de l&#8217;&#233;nergie elle-m&#234;me. Il ne pr&#233;voit pas toutefois d&#8217;exon&#233;ration syst&#233;matique mais une exon&#233;ration laiss&#233;e &#224; la main des collectivit&#233;s.</p>"
  },
  "representations": [
    {
      "nom": "PDF",
      "typeMime": {
        "type": "application",
        "subType": "PDF"
      },
      "statutRepresentation": {
        "verbatim": true,
        "canonique": true,
        "officielle": true,
        "transcription": false,
        "enregistrement": false
      },
      "contenu": {
        "documentURI": "/15/amendements/1255C/AN/836.pdf"
      }
    }
  ],
  "seanceDiscussion": "RUANR5L15S2019IDS21344",
  "sort": {
    "dateSaisie": "2018-11-16T10:58:19.000+01:00",
    "sortEnSeance": "Rejeté"
  },
  "dateDepot": "2018-10-31T01:00:00.000+01:00",
  "dateDistribution": "2018-11-15T01:00:00.000+01:00",
  "article99": "0",
  "loiReference": {
    "codeLoi": "CGI",
    "divisionCodeLoi": "1382 D"
  }
}