{
  "uid": "AMANR5L15SEA717460BTC1761P0D1N150",
  "identifiant": {
    "legislature": "15",
    "numero": "150",
    "numRect": "0",
    "saisine": {
      "texteLegislatifRef": "PRJLANR5L15BTC1761",
      "numeroPartiePLF": "0",
      "organeExamen": "PO717460",
      "mentionSecondeDeliberation": "0"
    }
  },
  "numeroLong": "150",
  "etapeTexte": "Nouvelle Lecture",
  "triAmendement": "aakaaaacaaaaaaaaaaaaaaaaaaaaaaaaaaaaaaaaaaaaaaaaaazx",
  "cardinaliteAmdtMultiples": "1",
  "etat": "Discuté",
  "signataires": {
    "auteur": {
      "typeAuteur": "Depute",
      "acteurRef": "PA719608",
      "groupePolitiqueRef": "PO723569"
    },
    "cosignatairesRefs": [
      "PA719608"
    ],
    "texteAffichable": "Mme&#160;M&#233;nard"
  },
  "pointeurFragmentTexte": {
    "division": {
      "titre": "Article 51",
      "articleDesignationCourte": "ART. 51",
      "type": "ARTICLE",
      "avantAApres": "A",
      "divisionRattachee": "ARTICLE 51",
      "urlDivisionTexteVise": "/15/textes/1761.asp#D_Article_51"
    }
  },
  "corps": {
    "dispositif": "<p>Supprimer cet article.</p>",
    "exposeSommaire": "<p style=\"text-align: justify;\">Ce dispositif veut organiser la privatisation de la Fran&#231;aise des Jeux (FDJ) alors que l&#8217;&#201;tat est actionnaire majoritaire &#224; 72&#160;%.</p><p style=\"text-align: justify;\">La privatisation de la FDJ conduit l&#8217;&#201;tat et donc les Fran&#231;ais &#224; perdre &#224; moyen terme une ressource financi&#232;re importante.&#160; En 2017, la FDJ rapportait 5,3&#160;milliards d&#8217;euros.</p>"
  },
  "representations": [
    {
      "nom": "PDF",
      "typeMime": {
        "type": "application",
        "subType": "PDF"
      },
      "statutRepresentation": {
        "verbatim": true,
        "canonique": true,
        "officielle": true,
        "transcription": false,
        "enregistrement": false
      },
      "contenu": {
        "documentURI": "/15/amendements/1761/AN/150.pdf"
      }
    }
  ],
  "seanceDiscussion": "RUANR5L15S2019IDS21550",
  "sort": {
    "dateSaisie": "2019-03-14T22:20:44.000+01:00",
    "sortEnSeance": "Rejeté"
  },
  "dateDepot": "2019-03-09T01:00:00.000+01:00",
  "dateDistribution": "2019-03-14T01:00:00.000+01:00",
  "article99": "0",
  "loiReference": {}
}