{
  "uid": "AMANR5L15SEA717460BTC1416P0D1N13",
  "identifiant": {
    "legislature": "15",
    "numero": "13",
    "numRect": "0",
    "saisine": {
      "texteLegislatifRef": "PIONANR5L15BTC1416",
      "numeroPartiePLF": "0",
      "organeExamen": "PO717460",
      "mentionSecondeDeliberation": "0"
    }
  },
  "numeroLong": "13",
  "etapeTexte": "1ère lecture (1ère assemblée saisie)",
  "triAmendement": "diaaaaaaaaaaaaaaaaaaaaaaaaaaaaaaaaaaaaaaaaaaaaaaaat",
  "cardinaliteAmdtMultiples": "1",
  "etat": "Irrecevable",
  "signataires": {
    "auteur": {
      "typeAuteur": "Depute",
      "acteurRef": "PA702052",
      "groupePolitiqueRef": "PO744425"
    },
    "cosignatairesRefs": [
      "PA267241",
      "PA332228",
      "PA712014",
      "PA266788",
      "PA721194",
      "PA331567",
      "PA421348",
      "PA720696",
      "PA721632",
      "PA1960",
      "PA722030",
      "PA642935",
      "PA720230",
      "PA267330",
      "PA267585",
      "PA267780",
      "PA642868",
      "PA721486",
      "PA267355",
      "PA268019",
      "PA721110",
      "PA2952",
      "PA267766",
      "PA702052",
      "PA610775",
      "PA695100",
      "PA721094",
      "PA719806"
    ],
    "texteAffichable": "Mme&#160;Sage,  Mme&#160;Auconie, M.&#160;Becht, M.&#160;Benoit, M.&#160;Bournazel, M.&#160;Guy&#160;Bricout, M.&#160;Christophe, Mme&#160;de La Raudi&#232;re, M.&#160;Demilly, Mme&#160;Descamps, Mme&#160;Fr&#233;d&#233;rique&#160;Dumas, M.&#160;Dunoyer, Mme&#160;Firmin Le Bodo, M.&#160;Gom&#232;s, M.&#160;Meyer&#160;Habib, M.&#160;Herth, M.&#160;Lagarde, M.&#160;Ledoux, Mme&#160;Lemoine, M.&#160;Leroy, Mme&#160;Magnier, M.&#160;Morel-&#192;-L&apos;Huissier, M.&#160;Naegelen, Mme&#160;Sanquer, M.&#160;Vercamer, M.&#160;Villiers, M.&#160;Warsmann et M.&#160;Zumkeller"
  },
  "pointeurFragmentTexte": {
    "division": {
      "titre": "Article 3",
      "articleDesignationCourte": "APRÈS ART. 3",
      "type": "ARTICLE",
      "avantAApres": "Apres",
      "divisionRattachee": "APRÈS L'ARTICLE 3, insérer l'article suivant:",
      "articleAdditionnel": "1",
      "urlDivisionTexteVise": "/15/textes/1416.asp#D_Article_3"
    }
  },
  "corps": {
    "dispositif": "<p style=\"text-align: justify;\">I.&#160;&#8211;&#160;L&#8217;article L.&#160;544&#8209;6 du code de la s&#233;curit&#233; sociale est compl&#233;t&#233; par une phrase ainsi r&#233;dig&#233;e&#160;: &#171;&#160;Ce montant ne peut &#234;tre inf&#233;rieur au salaire minimum de croissance.&#160;&#187;</p><p style=\"text-align: justify;\">II.&#160;&#8211;&#160;La perte de recettes pour les organismes de s&#233;curit&#233; sociale est compens&#233;e &#224; due concurrence par la majoration des droits mentionn&#233;s aux articles 575 et 575 A du code g&#233;n&#233;ral des imp&#244;ts.</p>",
    "exposeSommaire": "<p style=\"text-align: justify;\">L&#8217;annonce d&#8217;une maladie grave chez un enfant est inattendue et un bouleversement au sein d&#8217;une famille. L&#8217;&#201;tat apporte alors son soutien &#224; travers diverses mesures, qui sont insuffisantes voire porteuse d&#8217;in&#233;galit&#233;s.</p><p style=\"text-align: justify;\">La premi&#232;re aide apport&#233;e est l&#8217;Allocation Journali&#232;re de Pr&#233;sence Parentale (AJPP) d&#8217;un montant inf&#233;rieur &#224; 950&#160;&#8364; par mois pour une personne vivant en couple, c&#8217;est-&#224;-dire en dessous du seuil de pauvret&#233;. Or cette aide est inadapt&#233;e aux parents qui doivent arr&#234;ter de travailler et continuer de subvenir aux besoins familiaux, ce qui engendre une pr&#233;carit&#233; financi&#232;re chez beaucoup de parents. Les associations rappellent par ailleurs que les autres aides d&#8217;urgence sont souvent d&#233;bloqu&#233;es apr&#232;s le d&#233;c&#232;s des enfants.</p><p style=\"text-align: justify;\">Cet amendement vise donc &#224; r&#233;tablir de la justice sociale pour &#233;viter que des familles qui vivent dans la difficult&#233; de la maladie ne soient pas en plus affect&#233;es par des difficult&#233;s financi&#232;res, et qu&#8217;elles puissent ainsi mieux r&#233;pondre aux exigences et aux frais qu&#8217;engendrent les cancers p&#233;diatriques. Pour ce faire, il fait en sorte que l&#8217;AJPP ne soit pas inf&#233;rieure au salaire minimum de croissance.</p>"
  },
  "representations": [
    {
      "nom": "PDF",
      "typeMime": {
        "type": "application",
        "subType": "PDF"
      },
      "statutRepresentation": {
        "verbatim": true,
        "canonique": true,
        "officielle": true,
        "transcription": false,
        "enregistrement": false
      },
      "contenu": {
        "documentURI": "/15/amendements/1416/AN/13.pdf"
      }
    }
  ],
  "dateDepot": "2018-11-26T01:00:00.000+01:00",
  "dateDistribution": "2018-11-27T01:00:00.000+01:00",
  "article99": "0",
  "loiReference": {}
}