{
  "uid": "AMANR5L15SEA717460BTC1974P0D1N1210",
  "identifiant": {
    "legislature": "15",
    "numero": "1210",
    "numRect": "0",
    "saisine": {
      "texteLegislatifRef": "PRJLANR5L15BTC1974",
      "numeroPartiePLF": "0",
      "organeExamen": "PO717460",
      "mentionSecondeDeliberation": "0"
    }
  },
  "numeroLong": "1210",
  "etapeTexte": "1ère lecture (2ème assemblée saisie)",
  "triAmendement": "hiaaaoaaaaaaaaaaaaaaaaaaaaaaaaaaaaaaaaaaaaaaaaaaaahzzzzzzzzzzzzzzzzzzzzzzzzzzzzzzzzzzzzzzzzzzzzzzzzzzzzzzzzzzzzzzzzzzzzzzzw",
  "cardinaliteAmdtMultiples": "1",
  "etat": "Discuté",
  "signataires": {
    "auteur": {
      "typeAuteur": "Depute",
      "acteurRef": "PA720520",
      "groupePolitiqueRef": "PO730964"
    },
    "cosignatairesRefs": [
      "PA267336",
      "PA719472",
      "PA720520"
    ],
    "texteAffichable": "Mme&#160;Cattelot,  M.&#160;Giraud et M.&#160;Cazeneuve"
  },
  "pointeurFragmentTexte": {
    "division": {
      "titre": "RAPPORT ANNEXÉ",
      "articleDesignationCourte": "ART. 1ER A",
      "type": "ANNEXE",
      "avantAApres": "A",
      "divisionRattachee": "ARTICLE 1ER A",
      "urlDivisionTexteVise": "/15/textes/1974.asp#D_RAPPORT_ANNEXE"
    },
    "alinea": {
      "numero": "61"
    }
  },
  "corps": {
    "dispositif": "<p>&#192; l&#8217;alin&#233;a&#160;61, apr&#232;s la premi&#232;re phrase, ins&#233;rer la phrase suivante&#160;:</p><p style=\"text-align: justify;\">&#171;&#160;Une attention particuli&#232;re est port&#233;e aux modalit&#233;s d&#8217;acc&#232;s effectif des communaut&#233;s de communes &#224; ces appels &#224; projets, qui sont engag&#233;s dans des conditions de d&#233;lais et de visibilit&#233; suffisantes, et en fournissant un appui en mati&#232;re de montage de projets.&#160;&#187;</p>",
    "exposeSommaire": "<p>La programmation des infrastructures d&#233;finie par le rapport annex&#233; comprend le financement d&#8217;appels &#224; projets pour &#171;&#160;accompagner les autorit&#233;s organisatrices dans les mutations des mobilit&#233;s du quotidien&#160;&#187;.</p><p style=\"text-align: justify;\">Il s&#8217;agit d&#8217;un total de 1,1 milliard d&#8217;euros engag&#233;s d&#8217;ici 2025 afin de d&#233;velopper les p&#244;les d&#8217;&#233;changes multimodaux et les transports en commun, pour accompagner les innovations et les nouveaux services de mobilit&#233; et pour soutenir les modes actifs de mobilit&#233;.</p><p style=\"text-align: justify;\">Il convient de maximiser l&#8217;effet d&#8217;entra&#238;nement de ces financements en &#233;vitant qu&#8217;ils n&#8217;aillent de fa&#231;on disproportionn&#233;e aux collectivit&#233;s les mieux outill&#233;es pour r&#233;pondre aux appels &#224; projets, ce qui aurait pour effet principal d&#8217;ajouter au financement de projets parfois largement finan&#231;ables. L&#8217;action de l&#8217;&#201;tat doit en effet contribuer en priorit&#233; &#224; susciter des projets l&#224; o&#249; leur mise en &#339;uvre est plus difficile.</p><p style=\"text-align: justify;\">Cette amendement vise donc &#224; conforter la dimension vertueuse des appels &#224; projets en am&#233;liorant les conditions d&#8217;acc&#232;s des autorit&#233;s organisatrices de la mobilit&#233; qui ne disposent pas toujours de ressources suffisantes pour y r&#233;pondre.</p><p style=\"text-align: justify;\">La r&#233;daction propos&#233;e provient d&#8217;un amendement adopt&#233; par la commission des finances et qui est modifi&#233; afin de tenir compte des observations de la Ministre lors de l&#8217;examen en commission du d&#233;veloppement durable.</p><p style=\"text-align: justify;\">Sur le fondement d&#8217;une &#233;valuation et d&#8217;un retour d&#8217;exp&#233;rience des appels &#224; projets toujours en cours, il conviendra de porter une attention particuli&#232;re aux modalit&#233;s de communication sur ces appels &#224; projets et sur les d&#233;lais accord&#233;s pour soumettre des projets.</p><p style=\"text-align: justify;\">En particulier l&#8217;Agence nationale de la coh&#233;sion des territoires pourra fournir un appui en mati&#232;re d&#8217;ing&#233;nierie de projets aux communaut&#233;s de communaut&#233;s qui en ont le plus besoin.</p>"
  },
  "representations": [
    {
      "nom": "PDF",
      "typeMime": {
        "type": "application",
        "subType": "PDF"
      },
      "statutRepresentation": {
        "verbatim": true,
        "canonique": true,
        "officielle": true,
        "transcription": false,
        "enregistrement": false
      },
      "contenu": {
        "documentURI": "/15/amendements/1974/AN/1210.pdf"
      }
    }
  ],
  "seanceDiscussion": "RUANR5L15S2019IDS21699",
  "sort": {
    "dateSaisie": "2019-06-13T19:40:46.000+02:00",
    "sortEnSeance": "Retiré"
  },
  "dateDepot": "2019-05-28T02:00:00.000+02:00",
  "dateDistribution": "2019-06-05T02:00:00.000+02:00",
  "article99": "0",
  "loiReference": {}
}