{
  "uid": "AMANR5L15PO59048B2272P1D1N1124",
  "identifiant": {
    "legislature": "15",
    "numero": "1124",
    "numRect": "0",
    "saisine": {
      "texteLegislatifRef": "PRJLANR5L15B2272",
      "numeroPartiePLF": "1",
      "organeExamen": "PO59048",
      "mentionSecondeDeliberation": "0"
    }
  },
  "numeroLong": "I-CF1124",
  "etapeTexte": "1ère lecture (1ère assemblée saisie)",
  "triAmendement": "aoaaaaaaaaaaaaaaaaaaaaaaaaaaaaaaaaaaaaaaaaaaaaaaaaau",
  "cardinaliteAmdtMultiples": "1",
  "etat": "Discuté",
  "signataires": {
    "auteur": {
      "typeAuteur": "Depute",
      "acteurRef": "PA2960",
      "groupePolitiqueRef": "PO730934"
    },
    "cosignatairesRefs": [
      "PA2960",
      "PA718838",
      "PA609726",
      "PA746",
      "PA923",
      "PA1874",
      "PA332523",
      "PA608016",
      "PA605036",
      "PA721410",
      "PA1327",
      "PA721636",
      "PA608416"
    ],
    "texteAffichable": "M.&#160;Woerth,  Mme&#160;Louwagie, M.&#160;Abad, M.&#160;Aubert, Mme&#160;Bonnivard, M.&#160;Brun, M.&#160;Carrez, M.&#160;Cornut-Gentille, Mme&#160;Dalloz, M.&#160;Forissier, M.&#160;Hetzel, M.&#160;Le Fur et M.&#160;Parigi"
  },
  "pointeurFragmentTexte": {
    "division": {
      "titre": "Article 2",
      "articleDesignationCourte": "APRÈS ART. 2",
      "type": "ARTICLE",
      "avantAApres": "Apres",
      "divisionRattachee": "APRÈS L'ARTICLE 2, insérer l'article suivant:",
      "articleAdditionnel": "1",
      "urlDivisionTexteVise": "/15/textes/2272A.asp#D_Article_2"
    }
  },
  "corps": {
    "dispositif": "<p style=\"text-align: justify;\">I.&#160;&#8211;&#160;Le 4 <i>quater</i> du VIII de la premi&#232;re sous-section de la section 2 du chapitre I<sup>er</sup> du titre I<sup>er</sup> de la premi&#232;re partie du livre I<sup>er</sup> du code g&#233;n&#233;ral des imp&#244;ts est ainsi modifi&#233;&#160;:</p><p style=\"text-align: justify;\">1&#176;&#160;&#192; l&#8217;intitul&#233;, le mot&#160;: &#171;&#160;partielle&#160;&#187; est supprim&#233; et, &#224; la fin, sont ajout&#233;s les mots&#160;: &#171;&#160;et de la contribution au remboursement de la dette sociale&#160;&#187;&#160;;</p><p style=\"text-align: justify;\">2&#176;&#160;L&#8217;article&#160;154 <i>quinquies</i> du code g&#233;n&#233;ral des imp&#244;ts est ainsi modifi&#233;&#160;:</p><p style=\"text-align: justify;\"><i>a)</i> &#192; la premi&#232;re phrase du I, les mots&#160;: &#171;&#160;, &#224; hauteur de 6,8 point ou, pour les revenus mentionn&#233;s au II de l&#8217;article L.&#160;136&#8209;8 du m&#234;me code, &#224; hauteur de 3,8 points lorsqu&#8217;elle est pr&#233;lev&#233;e au taux de 3,8&#160;% ou 6,2&#160;%, &#224; hauteur de 4,2 points lorsqu&#8217;elle est pr&#233;lev&#233;e au taux de 6,6&#160;% et &#224; hauteur de 5,9 points lorsqu&#8217;elle est pr&#233;lev&#233;e au taux de 8,3&#160;%,&#160;&#187; sont supprim&#233;s&#160;;</p><p style=\"text-align: justify;\"><i>b)</i>&#160;Le m&#234;me I est compl&#233;t&#233; par une phrase ainsi r&#233;dig&#233;e&#160;: &#171;&#160;La contribution pr&#233;vue au I de l&#8217;article&#160;14 de l&#8217;ordonnance n&#176;&#160;96&#8209;50 du 24 janvier 1996 relative au remboursement de la dette sociale est admise en d&#233;duction du revenu imposable de l&#8217;ann&#233;e de son paiement.&#160;&#187;&#160;;</p><p style=\"text-align: justify;\"><i>c)</i>&#160;&#192; la fin du premier alin&#233;a du II, les mots&#160;: &#171;&#160;, &#224; hauteur de 6,8 points&#160;&#187; sont supprim&#233;s.</p><p style=\"text-align: justify;\">II.&#160;&#8722;&#160;La perte de recettes pour l&#8217;&#201;tat r&#233;sultant du I est compens&#233;e &#224; due concurrence par la cr&#233;ation d&#8217;une taxe additionnelle aux droits vis&#233;s aux articles 575 et 575A du code g&#233;n&#233;ral des imp&#244;ts.</p>",
    "exposeSommaire": "<p style=\"text-align: justify;\">Le pr&#233;sent amendement vise &#224; supprimer les cas d&#8217;&#171;&#160;imp&#244;t sur l&#8217;imp&#244;t&#160;&#187; r&#233;sultant&#160;des situations dans lesquelles le montant de contribution sociale g&#233;n&#233;ralis&#233;e acquitt&#233;e au titre de certains revenus d&#8217;activit&#233;, de remplacement ou du capital ne sont pas ou pas totalement d&#233;ductibles dans le calcul de l&#8217;imp&#244;t sur le revenu. Dans les conditions actuelles, les m&#233;nages se voient imposer un revenu dont une partie a &#233;t&#233; rendue indisponible par l&#8217;application d&#8217;une autre imposition.</p><p style=\"text-align: justify;\">Ainsi, l&#8217;amendement porte &#224; 100&#160;% la part de CSG d&#233;ductible de l&#8217;IR au titre&#160;des revenus d&#8217;activit&#233; (taux admis en d&#233;duction &#233;gal au taux appliqu&#233;, soit 9,2&#160;%), des allocations de ch&#244;mage tax&#233;es &#224; taux plein (6,2&#160;%), des pensions de retraite tax&#233;es au taux r&#233;duit (6,6&#160;%), des pensions de retraite tax&#233;es au taux interm&#233;diaire (8,3&#160;%)&#160;et des revenus du capital (9,9&#160;%).</p><p style=\"text-align: justify;\">L&#8217;amendement rend &#233;galement la contribution pour le remboursement de la dette sociale (CRDS) acquitt&#233;e sur l&#8217;ensemble des revenus d&#233;ductible de l&#8217;IR (0,5&#160;%).</p><p style=\"text-align: justify;\">Il s&#8217;agit d&#8217;un alignement sur les dispositions d&#233;j&#224; pr&#233;vues en mati&#232;re de pensions de retraite tax&#233;es &#224; taux r&#233;duit (3,8&#160;%) et des allocations de ch&#244;mage tax&#233;es &#224; taux r&#233;duit (3,8&#160;%).</p><p style=\"text-align: justify;\">Limiter l&#8217;&#171;&#160;imp&#244;t sur l&#8217;imp&#244;t&#160;&#187; revient &#224; concilier efficacit&#233; et justice, en garantissant la port&#233;e du principe constitutionnel du caract&#232;re non-confiscatoire de l&#8217;imp&#244;t, en am&#233;liorant l&#8217;intelligibilit&#233; de la loi fiscale et en renfor&#231;ant la lisibilit&#233; du syst&#232;me des pr&#233;l&#232;vements obligatoires, ce qui consolide l&#8217;attractivit&#233; &#233;conomique de notre pays.</p>"
  },
  "representations": [
    {
      "nom": "PDF",
      "typeMime": {
        "type": "application",
        "subType": "PDF"
      },
      "statutRepresentation": {
        "verbatim": true,
        "canonique": true,
        "officielle": true,
        "transcription": false,
        "enregistrement": false
      },
      "contenu": {
        "documentURI": "/15/amendements/2272A/CION_FIN/CF1124.pdf"
      }
    }
  ],
  "sort": {
    "dateSaisie": "2019-10-08T20:02:11.000+02:00",
    "sortEnSeance": "Rejeté"
  },
  "dateDepot": "2019-10-04T02:00:00.000+02:00",
  "dateDistribution": "2019-10-08T02:00:00.000+02:00",
  "article99": "0",
  "loiReference": {
    "codeLoi": "CGI",
    "divisionCodeLoi": "154 quinquies"
  }
}