{
  "uid": "AMANR5L15SEA717460BTC0971P0D1N3126",
  "identifiant": {
    "legislature": "15",
    "numero": "3126",
    "numRect": "0",
    "saisine": {
      "texteLegislatifRef": "PRJLANR5L15BTC0971",
      "numeroPartiePLF": "0",
      "organeExamen": "PO717460",
      "mentionSecondeDeliberation": "0"
    }
  },
  "numeroLong": "3126",
  "etapeTexte": "1ère lecture (1ère assemblée saisie)",
  "triAmendement": "qai",
  "cardinaliteAmdtMultiples": "1",
  "etat": "Discuté",
  "signataires": {
    "auteur": {
      "typeAuteur": "Depute",
      "acteurRef": "PA405480",
      "groupePolitiqueRef": "PO730946"
    },
    "cosignatairesRefs": [
      "PA405480"
    ],
    "texteAffichable": "M.&#160;Pupponi"
  },
  "pointeurFragmentTexte": {
    "division": {
      "titre": "Article 66",
      "articleDesignationCourte": "APRÈS ART. 66",
      "type": "ARTICLE",
      "avantAApres": "Apres",
      "divisionRattachee": "APRÈS L'ARTICLE 66, insérer l'article suivant:",
      "articleAdditionnel": "1",
      "urlDivisionTexteVise": "/15/textes/0971.asp#D_Article_66"
    }
  },
  "corps": {
    "dispositif": "<p style=\"text-align: justify;\">I.&#160;&#8211;&#160;&#192; compter du 1<sup>er</sup> janvier 2019, la&#160;mission de&#769;volue au groupement d&#8217;inte&#769;re&#770;t public pour la reconstitution des titres de proprie&#769;te&#769; en Corse cre&#769;e&#769;e par l&#8217;article&#160;42 de la loi n&#176;&#160;2006&#8209;728 du 23&#160;juin&#160;2006 portant r&#233;forme des successions et des lib&#233;ralit&#233;s est exerce&#769;e par l&#8217;office foncier de la Corse, lui-m&#234;me cre&#769;e&#769; par l&#8217;article&#160;148 de la loi n&#176; 2014&#8209;366 du 24 mars 2014 pour l&#8217;acc&#232;s au logement et un urbanisme r&#233;nov&#233; et mentionn&#233; aux articles L.&#160;4424&#8209;26&#8209;1 et suivants du code g&#233;n&#233;ral des collectivit&#233;s territoriales.</p><p style=\"text-align: justify;\">II.&#160;&#8211;&#160;L&#8217;article L.&#160;4424&#8209;26&#8209;2 du code g&#233;n&#233;ral des collectivit&#233;s territoriales est compl&#233;t&#233; par neuf alin&#233;as ainsi r&#233;dig&#233;s&#160;:</p><p style=\"text-align: justify;\">&#171;&#160;L&#8217;office est &#233;galement charg&#233; de rassembler tous les &#233;l&#233;ments propres &#224; reconstituer les titres de propri&#233;t&#233; en Corse pour les biens fonciers et immobiliers qui en sont d&#233;pourvus, dans les conditions pr&#233;vues aux articles L.&#160;341&#8209;1 &#224; L.&#160;341&#8209;4 du code de la recherche. &#192; cet effet, il peut prendre toute mesure permettant de d&#233;finir ces biens et d&#8217;en identifier leurs propri&#233;taires et cr&#233;er ou g&#233;rer l&#8217;ensemble des &#233;quipements ou services d&#8217;int&#233;r&#234;t commun rendus n&#233;cessaires pour la r&#233;alisation de cette mission.</p><p style=\"text-align: justify;\">&#171;&#160;Afin de pr&#233;server le caract&#232;re ind&#233;pendant des op&#233;rations de titrisation, une commission des titres de propri&#233;t&#233; est constitu&#233;e au sein de l&#8217;office et&#160;charge&#769;e de la reconstitution des titres de proprie&#769;te&#769; en Corse. Cette commission est pre&#769;side&#769;e par un magistrat ou un magistrat honoraire de l&#8217;ordre judiciaire de&#769;signe&#769; par arr&#234;t&#233; du Garde des Sceaux, ministre de la justice. Elle est en outre compos&#233;e&#160;:&#160;</p><p style=\"text-align: justify;\">&#171;&#160;1&#176; du repr&#233;sentant de l&#8217;&#201;tat en Corse&#160;;</p><p style=\"text-align: justify;\">&#171;&#160;2&#176; du pr&#233;sident de l&#8217;office foncier de la Corse&#160;;</p><p style=\"text-align: justify;\">&#171;&#160;3&#176; des pr&#233;sidents des associations des maires de la Haute-Corse et de la Corse-du-Sud&#160;;</p><p style=\"text-align: justify;\">&#171;&#160;4&#176; du pr&#233;sident du conseil r&#233;gional des notaires de Corse.</p><p style=\"text-align: justify;\">&#171;&#160;L&#8217;office ainsi que les personnes missionn&#233;es par lui peuvent se faire communiquer de toute personne, physique ou morale, de droit public ou de droit priv&#233;, tous documents et informations n&#233;cessaires &#224; la r&#233;alisation de la mission du groupement, y compris ceux contenus dans un syst&#232;me informatique ou de traitement de donn&#233;es &#224; caract&#232;re personnel, sans que puisse leur &#234;tre oppos&#233; le secret professionnel.&#160;Les agents de l&#8217;office&#160;et les personnes missionn&#233;es par lui sont tenus de respecter la confidentialit&#233; des informations recueillies au cours de leur mission sous peine des sanctions pr&#233;vues aux articles 226&#8209;13, 226&#8209;31 et 226&#8209;32 du code p&#233;nal.</p><p style=\"text-align: justify;\">&#171;&#160;Toutefois, ces informations peuvent &#234;tre communiqu&#233;es aux officiers publics minist&#233;riels quand elles sont n&#233;cessaires &#224; l&#8217;exercice de leurs missions.&#160;Pour l&#8217;accomplissement de sa mission, l&#8217;office peut cr&#233;er un fichier de donn&#233;es &#224; caract&#232;re personnel dans les conditions d&#233;finies par la loi n&#176;&#160;78&#8209;17 du 6 janvier 1978 relative &#224; l&#8217;informatique, aux fichiers et aux libert&#233;s.</p><p style=\"text-align: justify;\">&#171;&#160;Un d&#233;cret en Conseil d&#8217;&#201;tat d&#233;termine les conditions d&#8217;application du pr&#233;sent article, notamment en ce qui concerne le fonctionnement de la commission des titres de propri&#233;t&#233;, et apr&#232;s avis de la Commission nationale de l&#8217;informatique et des libert&#233;s en ce qui concerne les conditions&#160;d&#8217;application du pr&#233;c&#233;dent alin&#233;a.&#160;&#187;</p><p style=\"text-align: justify;\">III.&#160;&#8211;&#160;Pour l&#8217;application du pr&#233;sent article, les&#160;personnels du&#160;groupement d&#8217;int&#233;r&#234;t public pour la reconstitution des titres de propri&#233;t&#233; en Corse sont inte&#769;gre&#769;s de plein droit dans les services de l&#8217;office foncier de la Corse et conservent les stipulations ante&#769;rieures de leur contrat ainsi que les avantages ante&#769;rieurement acquis.</p><p style=\"text-align: justify;\">IV.&#160;&#8211;&#160;L&#8217;article&#160;42 de&#160;la loi n&#176; 2006&#8209;728 du 23 juin 2006 portant r&#233;forme des successions et des lib&#233;ralit&#233;s est abrog&#233; &#224; compter du 1<sup>er</sup>&#160;janvier&#160;2019.</p>",
    "exposeSommaire": "<p style=\"text-align: justify;\">En Corse la probl&#233;matique fonci&#232;re est actuellement trait&#233;e par deux &#233;tablissements distincts&#160;: le GIRTEC qui s&#8217;occupe principalement de la reconstitution des titres de propri&#233;t&#233; et l&#8217;office foncier qui est charg&#233; de l&#8217;acquisition et du portage du foncier en vue de la r&#233;alisation de logements sociaux et/ou d&#8217;&#233;quipements publics.</p><p style=\"text-align: justify;\">Ces deux outils d&#233;terminants pour la question fonci&#232;re ont tous les deux &#233;t&#233; cr&#233;&#233;s par le l&#233;gislateur &#224; deux &#233;poques diff&#233;rentes et pourtant sont devenus &#233;minemment compl&#233;mentaires.</p><p style=\"text-align: justify;\">C&#8217;est aussi vrai qu&#8217;&#224; l&#8217;heure actuelle l&#8217;office foncier ne peut se porter acqu&#233;reur de foncier si pr&#233;alablement il ne saisit pas le GIRTEC aux fins de v&#233;rification de l&#8217;existence d&#8217;un titre de propri&#233;t&#233;.</p><p style=\"text-align: justify;\">Mais l&#8217;existence de deux outils ne permet pas la mutualisation des &#233;quipe, la mise en synergie des processus et rend aussi complexe les d&#233;marches effectu&#233;es par les &#233;lus souhaitant s&#8217;engager dans des op&#233;rations de ma&#238;trise fonci&#232;re.</p><p style=\"text-align: justify;\">Le rapport du CGEDD demand&#233; par le gouvernement a d&#8217;ailleurs mis en lumi&#232;re l&#8217;utilit&#233; d&#8217;un rapprochement de ces deux structures d&#8217;autant que l&#8217;office foncier dispose de ressources p&#233;rennes (la Taxe Sp&#233;ciale d&#8217;Equipement) alors que le GIRTEC lui ne dispose que de fonds d&#8217;&#201;tat pr&#233;vus au P.E.I. dont l&#8217;extinction est pr&#233;vue en 2020 faisant d&#8217;ailleurs peser une hypoth&#232;se sur la survie d&#8217;un outil d&#233;terminant pour la Corse.</p><p style=\"text-align: justify;\">Il est donc cr&#233;dible et r&#233;alise d&#8217;envisager la fusion de ces deux &#233;tablissements permettant de cr&#233;er en Corse un v&#233;ritable p&#244;le foncier charg&#233; de la ma&#238;trise fonci&#232;re et d&#8217;une lutte plus efficace contre la sp&#233;culation fonci&#232;re qui emp&#234;che les &#233;lus de conduire des op&#233;rations d&#8217;int&#233;r&#234;t g&#233;n&#233;ral.</p>"
  },
  "representations": [
    {
      "nom": "PDF",
      "typeMime": {
        "type": "application",
        "subType": "PDF"
      },
      "statutRepresentation": {
        "verbatim": true,
        "canonique": true,
        "officielle": true,
        "transcription": false,
        "enregistrement": false
      },
      "contenu": {
        "documentURI": "/15/amendements/0971/AN/3126.pdf"
      }
    }
  ],
  "seanceDiscussion": "RUANR5L15S2018IDS21139",
  "sort": {
    "dateSaisie": "2018-06-09T03:14:54.000+02:00",
    "sortEnSeance": "Retiré"
  },
  "dateDepot": "2018-05-26T02:00:00.000+02:00",
  "dateDistribution": "2018-06-02T02:00:00.000+02:00",
  "article99": "0",
  "loiReference": {
    "codeLoi": "loi 2006-728",
    "divisionCodeLoi": "42"
  }
}