{
  "uid": "AMANR5L15PO59048B1255P2D1N1318",
  "identifiant": {
    "legislature": "15",
    "numero": "1318",
    "numRect": "0",
    "saisine": {
      "texteLegislatifRef": "PRJLANR5L15B1255",
      "numeroPartiePLF": "2",
      "organeExamen": "PO59048",
      "mentionSecondeDeliberation": "0"
    }
  },
  "numeroLong": "II-CF1318",
  "etapeTexte": "1ère lecture (1ère assemblée saisie)",
  "triAmendement": "keaaaaaaaaaaaaaaaaaaaaaaaaaaaaaaaaaaaaaaaaaaaaaaaaac",
  "cardinaliteAmdtMultiples": "1",
  "etat": "Irrecevable",
  "signataires": {
    "auteur": {
      "typeAuteur": "Depute",
      "acteurRef": "PA607619",
      "groupePolitiqueRef": "PO759900"
    },
    "cosignatairesRefs": [
      "PA607619"
    ],
    "texteAffichable": "M.&#160;Molac"
  },
  "pointeurFragmentTexte": {
    "division": {
      "titre": "Article 62",
      "articleDesignationCourte": "APRÈS ART. 62",
      "type": "ARTICLE",
      "avantAApres": "Apres",
      "divisionRattachee": "APRÈS L'ARTICLE 62, insérer l'article suivant:",
      "articleAdditionnel": "1",
      "urlDivisionTexteVise": "/15/textes/1255C.asp#D_Article_62"
    }
  },
  "corps": {
    "dispositif": "<p style=\"text-align: justify;\">I. Apr&#232;s l'article 39 decies A du code g&#233;n&#233;ral des imp&#244;ts, ins&#233;rer un article 39 decies B ainsi r&#233;dig&#233; :</p><p style=\"text-align: justify;\">\"Les entreprises soumises &#224; l'imp&#244;t sur les soci&#233;t&#233;s ou &#224; l'imp&#244;t sur le revenu selon un r&#233;gime r&#233;el d'imposition peuvent d&#233;duire de leur r&#233;sultat imposable une somme &#233;gale &#224; 40 % de la valeur d'origine des biens, hors frais financiers, affect&#233;s &#224; leur activit&#233; et qu'elles acqui&#232;rent &#224; compter du 1er janvier 2019 et jusqu'au 31 d&#233;cembre 2020, lorsqu'ils rel&#232;vent des cat&#233;gories de v&#233;hicules non routiers ou engins de chantiers et de travaux publics propres ou faiblement &#233;metteurs de gaz &#224; effet de serre.</p><p style=\"text-align: justify;\">Pour application de l'alin&#233;a pr&#233;c&#233;dent, les v&#233;hicules et engins propres ou faiblement &#233;metteurs de gaz &#224; effet de serre sont les v&#233;hicules enti&#232;rement &#233;lectriques ou \"z&#233;ro &#233;mission\", les v&#233;hicules hybrides et les v&#233;hicules utilisant exclusivement comme &#233;nergie le gaz naturel et le biom&#233;thane carburant, ou le carburant ED95 compos&#233; d'un minimum de 90,0 % d'alcool &#233;thylique d'origine agricole.</p><p style=\"text-align: justify;\">La d&#233;duction est r&#233;partie lin&#233;airement sur la dur&#233;e normale d'utilisation des biens. En cas de cession du bien avant le terme de cette p&#233;riode, elle n'est acquise &#224; l'entreprise qu'&#224; hauteur des montants d&#233;j&#224; d&#233;duits du r&#233;sultat &#224; la date de la cession, qui sont calcul&#233;s pro rata temporis.</p><p style=\"text-align: justify;\">L'entreprise qui prend en location un bien neuf mentionn&#233; au premier alin&#233;a du pr&#233;sent article dans les conditions pr&#233;vues au 1 de l'article L. 313-7 du code mon&#233;taire et financier en application d'un contrat de cr&#233;dit-bail ou dans le cadre d'un contrat de location avec option d'achat, conclu &#224; compter du 1er janvier 2019 et jusqu'au 31 d&#233;cembre 2020, peut d&#233;duire une somme &#233;gale &#224; 40 % de la valeur d'origine du bien, hors frais financiers, au moment de la signature du contrat. Cette d&#233;duction est r&#233;partie sur la dur&#233;e mentionn&#233;e au deuxi&#232;me alin&#233;a du pr&#233;sent article. Si l'entreprise cr&#233;dit-preneuse ou locataire acquiert le bien, elle peut continuer &#224; appliquer la d&#233;duction. La d&#233;duction<br /> cesse &#224; compter de la cession ou de la cessation par l'entreprise du contrat de cr&#233;dit-bail ou de location avec option d'achat ou du bien et ne peut pas s'appliquer au nouvel exploitant.</p><p style=\"text-align: justify;\">L'entreprise qui donne le bien en cr&#233;dit-bail ou en location avec option d'achat ne peut pas pratiquer la d&#233;duction mentionn&#233;e au premier alin&#233;a du pr&#233;sent article.\"</p><p style=\"text-align: justify;\">II. &#8211; La perte de recettes pour l&#8217;&#201;tat est compens&#233;e &#224; due concurrence par la cr&#233;ation d&#8217;une taxe additionnelle aux droits mentionn&#233;s aux articles 575 et 575 A du code g&#233;n&#233;ral des imp&#244;ts.</p>",
    "exposeSommaire": "<p style=\"text-align: justify;\">Cet amendement introduit un suramortissement pour les v&#233;hicules de chantiers et de travaux publics &#224; faible &#233;mission de CO2.</p><p style=\"text-align: justify;\">Cette proposition est le pendant incitatif de la suppression des exon&#233;rations de TICPE applicables au gazole non-routier act&#233;e &#224; l'article 19 de la pr&#233;sente loi. Elle aide les acteurs &#233;conomiques concern&#233;s, qui assumeront d&#233;sormais le co&#251;t de leurs &#233;missions de CO2, &#224; s'&#233;quiper en mat&#233;riel propre ou &#224; faible &#233;mission. Elle s'inscrit donc dans une logique vertueuse et hautement n&#233;cessaire qui a &#233;t&#233; clairement explicit&#233;e par notre majorit&#233; : taxer les &#233;missions de gaz &#224; effet de serre et accompagner les fran&#231;ais dans la transition &#233;nerg&#233;tique, avec une s&#233;rie d'aides cibl&#233;es.</p><p style=\"text-align: justify;\">Ainsi l'amendement propos&#233; repose sur un mod&#232;le identique &#224; celui existant pour les transports lourds codifi&#233; &#224; l'article 39 decies A. Le taux choisi est identique &#224; celui de l'amortissement d&#233;fini par l'article 39 decies qui concerne d&#233;j&#224; le type de v&#233;hicules cibl&#233;s sans tenir compte des &#233;missions de CO2 engendr&#233;es lorsque ceux-ci ont &#233;t&#233; acquis du 1er janvier 2016 au 14 avril 2017. Il permet alors d'accorder cet amortissement sur une nouvelle p&#233;riode, du 1er janvier 2019 au 31 d&#233;cembre 2020, uniquement pour les v&#233;hicules propres ou faiblement &#233;metteurs de CO2.</p><p style=\"text-align: justify;\">Dans cette version, l'amendement favorise l'achat des v&#233;hicules :</p><p style=\"text-align: justify;\">- Z&#233;ro &#233;mission ;</p><p style=\"text-align: justify;\">- ED95, gaz naturel et biom&#233;thane ;</p><p style=\"text-align: justify;\">- Hybride sous un certain seuil d'&#233;missions.</p>"
  },
  "representations": [
    {
      "nom": "PDF",
      "typeMime": {
        "type": "application",
        "subType": "PDF"
      },
      "statutRepresentation": {
        "verbatim": true,
        "canonique": true,
        "officielle": true,
        "transcription": false,
        "enregistrement": false
      },
      "contenu": {
        "documentURI": "/15/amendements/1255C/CION_FIN/CF1318.pdf"
      }
    }
  ],
  "dateDepot": "2018-11-02T01:00:00.000+01:00",
  "article99": "0",
  "loiReference": {
    "codeLoi": "impôts",
    "divisionCodeLoi": "39 decies"
  }
}