{
  "uid": "AMANR5L15PO59048B0235P2D1N500",
  "identifiant": {
    "legislature": "15",
    "numero": "500",
    "numRect": "0",
    "saisine": {
      "texteLegislatifRef": "PRJLANR5L15B0235",
      "numeroPartiePLF": "2",
      "organeExamen": "PO59048",
      "mentionSecondeDeliberation": "0"
    }
  },
  "numeroLong": "II-CF500",
  "etapeTexte": "1ère lecture (1ère assemblée saisie)",
  "triAmendement": "aaeu",
  "cardinaliteAmdtMultiples": "1",
  "etat": "Discuté",
  "signataires": {
    "auteur": {
      "typeAuteur": "Depute",
      "acteurRef": "PA720960",
      "groupePolitiqueRef": "PO730964"
    },
    "cosignatairesRefs": [
      "PA610733",
      "PA722344",
      "PA702052",
      "PA721094",
      "PA720968",
      "PA720960",
      "PA724827",
      "PA721046",
      "PA643145",
      "PA610667",
      "PA610775",
      "PA720976",
      "PA268019",
      "PA718978",
      "PA702054",
      "PA720900",
      "PA721644",
      "PA610634",
      "PA721070",
      "PA721036",
      "PA267901"
    ],
    "texteAffichable": "M.&#160;Serva,  M.&#160;L&#233;na&#239;ck&#160;Adam, Mme&#160;Ali, M.&#160;Azerot, Mme&#160;Bassire, Mme&#160;Benin, M.&#160;Claireaux, M.&#160;Dunoyer, M.&#160;Gom&#232;s, M.&#160;Kamardine, M.&#160;Julien-Laferriere, M.&#160;Kokouendo, M.&#160;Lagarde, M.&#160;Laqhila, M.&#160;Mathiasin, Mme&#160;Ramassamy, Mme&#160;Rilhac, M.&#160;Thierry&#160;Robert, Mme&#160;Sage, M.&#160;Serville et Mme&#160;Vainqueur-Christophe"
  },
  "pointeurFragmentTexte": {
    "division": {
      "titre": "Article 39",
      "articleDesignationCourte": "APRÈS ART. 39",
      "type": "ARTICLE",
      "avantAApres": "Apres",
      "divisionRattachee": "APRÈS L'ARTICLE 39, insérer l'article suivant:",
      "articleAdditionnel": "1",
      "urlDivisionTexteVise": "/15/textes/0235C.asp#D_Article_39"
    }
  },
  "corps": {
    "dispositif": "<p style=\"text-align: justify;\">Le IX de l&#8217;article&#160;199 <i>undecies</i> C du code g&#233;n&#233;ral des imp&#244;ts est ainsi modifi&#233;&#160;:</p><p style=\"text-align: justify;\">I. Apr&#232;s le premier alin&#233;a, sont ins&#233;r&#233;s trois alin&#233;as ainsi r&#233;dig&#233;s&#160;:</p><p style=\"text-align: justify;\">&#171;&#160;Toutefois, pour les acquisitions de logements vis&#233;es au VI, le pr&#233;sent article reste applicable jusqu&#8217;au 31&#160;d&#233;cembre 2020&#160;:</p><p style=\"text-align: justify;\">1&#176; Aux investissements pour l&#8217;agr&#233;ment desquels une demande est parvenue &#224; l&#8217;administration au plus tard le 31 d&#233;cembre 2020, lorsqu&#8217;ils portent sur l&#8217;acquisition de logements faisant l&#8217;objet de travaux de r&#233;habilitation, ou de confortation contre le risque sismique ou cyclonique, si des acomptes au moins &#233;gaux &#224; 50&#160;% du prix de ces derniers ont &#233;t&#233; vers&#233;s au plus tard le 30 juin 2021 et si les travaux sont achev&#233;s au plus tard le 31 d&#233;cembre 2021&#160;;</p><p style=\"text-align: justify;\">&#160;2&#176; Aux acquisitions de logements faisant l&#8217;objet de travaux de r&#233;habilitation ou de confortation contre le risque sismique ou cyclonique, pour lesquels des acomptes au moins &#233;gaux &#224; 50&#160;% de leur prix ont &#233;t&#233; vers&#233;s au plus tard le 31 d&#233;cembre 2020 et qui sont achev&#233;s au plus tard le 31 d&#233;cembre 2021.&#160;&#187;.</p><p style=\"text-align: justify;\">II. Au deuxi&#232;me alin&#233;a,</p><p style=\"text-align: justify;\">a) les mots &#171;&#160;Toutefois,&#160;&#187; sont supprim&#233;s&#160;;</p><p style=\"text-align: justify;\">b) apr&#232;s le mot &#171;&#160;reste&#160;&#187;, le mot &#171;&#160;&#233;galement&#160;&#187; est ins&#233;r&#233;.</p><p style=\"text-align: justify;\">III. Le a) du 1&#176; est supprim&#233;</p><p style=\"text-align: justify;\">IV. Le b) et le c) du 1&#176; deviennent respectivement un a) et un b)</p><p style=\"text-align: justify;\">V. Le 2&#176; est supprim&#233;.</p><p style=\"text-align: justify;\">VI. Le I est applicable aux travaux r&#233;alis&#233;s &#224; compter du 1<sup>er</sup> janvier 2018.</p><p style=\"text-align: justify;\">VII. La perte de recettes pour l&#8217;&#201;tat est compens&#233;e &#224; due concurrence par la cr&#233;ation d&#8217;une taxe additionnelle aux droits vis&#233;s aux articles 575 et 575 A du code g&#233;n&#233;ral des imp&#244;ts.</p>",
    "exposeSommaire": "<p style=\"text-align: justify;\">Cet amendement vise &#224; r&#233;pondre aux besoins de r&#233;habilitation qui repr&#233;sentent sans aucun doute le principal enjeu de la p&#233;riode &#224; venir. Pour ce qui est des op&#233;rations de r&#233;habilitation, le cr&#233;dit d&#8217;imp&#244;t n&#8217;est pas substituable &#224; la r&#233;duction d&#8217;imp&#244;t, comme le montrent les diff&#233;rentes &#233;valuations.</p><p style=\"text-align: justify;\">Il s&#8217;av&#232;re que l&#8217;arr&#234;t du dispositif de d&#233;fiscalisation et le passage en cr&#233;dit d&#8217;imp&#244;t emp&#234;cheraient la r&#233;alisation de nombreuses petites op&#233;rations de r&#233;habilitation de logements sociaux, car des agences immobili&#232;res sociales n&#8217;ont pas droit au cr&#233;dit d&#8217;imp&#244;t et n&#8217;ont pas acc&#232;s aux fonds de la Caisse des d&#233;p&#244;ts.</p><p style=\"text-align: justify;\">Dans un contexte o&#249; l&#8217;intervention de l&#8217;Agence nationale de l&#8217;habitat (ANAH) outre-mer est encore particuli&#232;rement limit&#233;e, cet amendement permet de ne pas mettre un terme &#224; cette mesure qui ne trouve pas d&#8217;&#233;quivalent au travers du cr&#233;dit d&#8217;imp&#244;t.</p><p style=\"text-align: justify;\">Elle permettra de poursuivre la lutte contre la v&#233;tust&#233; du parc social r&#233;sultant en partie de conditions climatiques propres aux outre-mer. En outre, il y a lieu d&#8217;acc&#233;l&#233;rer la mise aux normes des logements et la mise en s&#233;curit&#233; des locataires. Enfin, le d&#233;samiantage du parc social repr&#233;sente aujourd&#8217;hui un enjeu d&#8217;int&#233;r&#234;t g&#233;n&#233;ral, du fait de l&#8217;exposition &#224; un risque sanitaire majeur des populations.</p><p style=\"text-align: justify;\">L&#8217;amendement pr&#233;voit enfin d&#8217;&#233;largir les travaux &#233;ligibles aux travaux de r&#233;habilitation sismique ou para-cyclonique.</p><p style=\"text-align: justify;\">Ce dispositif viendrait s&#8217;inscrire en compl&#233;ment du cr&#233;dit d&#8217;imp&#244;t, par ailleurs limit&#233; au secteur ANRU et pour lequel le montant des travaux est plafonn&#233;.</p>"
  },
  "representations": [
    {
      "nom": "PDF",
      "typeMime": {
        "type": "application",
        "subType": "PDF"
      },
      "statutRepresentation": {
        "verbatim": true,
        "canonique": true,
        "officielle": true,
        "transcription": false,
        "enregistrement": false
      },
      "contenu": {
        "documentURI": "/15/amendements/0235C/CION_TOUTE/CF500.pdf"
      }
    }
  ],
  "sort": {
    "sortEnSeance": "Adopté"
  },
  "dateDepot": "2017-11-06T01:00:00.000+01:00",
  "dateDistribution": "2017-11-09T01:00:00.000+01:00",
  "article99": "0",
  "loiReference": {
    "codeLoi": "impôts",
    "divisionCodeLoi": "199 undecies C"
  }
}