{
  "uid": "AMANR5L15SEA717460B1255P2D1N1547",
  "identifiant": {
    "legislature": "15",
    "numero": "1547",
    "numRect": "0",
    "saisine": {
      "texteLegislatifRef": "PRJLANR5L15B1255",
      "numeroPartiePLF": "2",
      "organeExamen": "PO717460",
      "mentionSecondeDeliberation": "0"
    }
  },
  "numeroLong": "II-1547",
  "etapeTexte": "1ère lecture (1ère assemblée saisie)",
  "triAmendement": "eaaaaaaaaaaaaaaaaaaaaaaaaaaaaaaaaaaaaaaaaaaaaaaaaab",
  "cardinaliteAmdtMultiples": "1",
  "etat": "Irrecevable",
  "signataires": {
    "auteur": {
      "typeAuteur": "Depute",
      "acteurRef": "PA719890",
      "groupePolitiqueRef": "PO730964"
    },
    "cosignatairesRefs": [
      "PA719890"
    ],
    "texteAffichable": "Mme&#160;Brulebois"
  },
  "pointeurFragmentTexte": {
    "division": {
      "titre": "Article 50",
      "articleDesignationCourte": "APRÈS ART. 50",
      "type": "ARTICLE",
      "avantAApres": "Apres",
      "divisionRattachee": "APRÈS L'ARTICLE 50, insérer l'article suivant:",
      "articleAdditionnel": "1",
      "urlDivisionTexteVise": "/15/textes/1255C.asp#D_Article_50"
    }
  },
  "corps": {
    "dispositif": "<p style=\"text-align: justify;\">I.&#160;&#8211;&#160;L&#8217;article&#160;238 <i>bis</i> J du code g&#233;n&#233;ral des imp&#244;ts est compl&#233;t&#233; par un VIII ainsi r&#233;dig&#233;&#160;:</p><p style=\"text-align: justify;\">&#171;&#160;VIII.&#160;&#8211;&#160;Les petites et moyennes entreprises peuvent b&#233;n&#233;ficier d&#8217;un taux d&#8217;imposition fix&#233; &#224; 10&#160;% pour leur plus-value de r&#233;&#233;valuation. Cette plus-value de r&#233;&#233;valuation peut toutefois &#234;tre exon&#233;r&#233;e si elle s&#8217;impute sur un d&#233;ficit d&#8217;&#233;gal montant ou sup&#233;rieur.&#160;&#187;</p><p style=\"text-align: justify;\">II.&#160;&#8211;&#160;La perte de recettes pour l&#8217;&#201;tat est compens&#233;e &#224; due concurrence par la cr&#233;ation d&#8217;une taxe additionnelle aux droits mentionn&#233;s aux articles 575 et 575 A du code g&#233;n&#233;ral des imp&#244;ts.</p><p style=\"text-align: justify;\">III.&#160;&#8211;&#160;Le pr&#233;sent article entre en vigueur &#224; compter du 1<sup>er</sup> janvier 2019.</p>",
    "exposeSommaire": "<p style=\"text-align: justify;\">La r&#233;&#233;valuation d&#8217;actifs constitue un puissant levier de cr&#233;ation de fonds propres pour les TPE et les PME et peut jouer un r&#244;le d&#233;terminant en particulier quand une entreprise traverse une p&#233;riode de difficult&#233;s.</p><p style=\"text-align: justify;\">La mise en place de cette proposition, sans impact pour le budget de l&#8217;&#233;tat, consisterait &#224; imposer la plus-value de r&#233;&#233;valuation au m&#234;me rythme que les nouveaux amortissements pratiqu&#233;s sur les immobilisations r&#233;&#233;valu&#233;es. Elle permet de faire appara&#238;tre la richesse de l&#8217;entreprise non comptabilis&#233;e au bilan. Elle doit respecter les r&#232;gles de sinc&#233;rit&#233; et de prudence du bilan. Ainsi l&#8217;image du patrimoine de l&#8217;entreprise sera plus fid&#232;le &#224; la r&#233;alit&#233;.</p>"
  },
  "representations": [
    {
      "nom": "PDF",
      "typeMime": {
        "type": "application",
        "subType": "PDF"
      },
      "statutRepresentation": {
        "verbatim": true,
        "canonique": true,
        "officielle": true,
        "transcription": false,
        "enregistrement": false
      },
      "contenu": {
        "documentURI": "/15/amendements/1255C/AN/1547.pdf"
      }
    }
  ],
  "dateDepot": "2018-11-07T01:00:00.000+01:00",
  "article99": "0",
  "loiReference": {
    "codeLoi": "CGI",
    "divisionCodeLoi": "238 bis J"
  }
}