{
  "uid": "AMANR5L15PO59048B1255P2D1N15",
  "identifiant": {
    "legislature": "15",
    "numero": "15",
    "numRect": "0",
    "saisine": {
      "texteLegislatifRef": "PRJLANR5L15B1255",
      "numeroPartiePLF": "2",
      "organeExamen": "PO59048",
      "mentionSecondeDeliberation": "0"
    }
  },
  "numeroLong": "II-CF15",
  "etapeTexte": "1ère lecture (1ère assemblée saisie)",
  "triAmendement": "jaaaaaaaaaaaaaaaaaaaaaaaaaaaaaaaaaaaaaaaaaaaaaaaaaaapki",
  "cardinaliteAmdtMultiples": "1",
  "etat": "Discuté",
  "signataires": {
    "auteur": {
      "typeAuteur": "Depute",
      "acteurRef": "PA608016",
      "groupePolitiqueRef": "PO730934"
    },
    "cosignatairesRefs": [
      "PA330684",
      "PA267204",
      "PA719318",
      "PA266793",
      "PA720644",
      "PA1327",
      "PA721636",
      "PA330909",
      "PA267289",
      "PA718838",
      "PA721046",
      "PA607090",
      "PA608416",
      "PA2960",
      "PA608016",
      "PA609726",
      "PA340853",
      "PA746",
      "PA609245",
      "PA266797",
      "PA712015",
      "PA643089",
      "PA856",
      "PA605036",
      "PA923",
      "PA718884"
    ],
    "texteAffichable": "Mme&#160;Louwagie,  M.&#160;Cherpion, M.&#160;Thi&#233;riot, M.&#160;Nury, M.&#160;Sermier, M.&#160;Bony, Mme&#160;Val&#233;rie&#160;Boyer, Mme&#160;Anthoine, Mme&#160;Bazin-Malgras, M.&#160;Dive, M.&#160;Abad, M.&#160;Gosselin, M.&#160;Hetzel, M.&#160;Door, M.&#160;Leclerc, Mme&#160;Bassire, M.&#160;Descoeur, M.&#160;Brun, M.&#160;Aubert, M.&#160;Carrez, M.&#160;Cornut-Gentille, M.&#160;Forissier, Mme&#160;Lacroute, M.&#160;Parigi, M.&#160;Jean-Pierre&#160;Vigier et M.&#160;Woerth"
  },
  "pointeurFragmentTexte": {
    "division": {
      "titre": "Article 52",
      "articleDesignationCourte": "ART. 52",
      "type": "ARTICLE",
      "avantAApres": "A",
      "divisionRattachee": "ARTICLE 52",
      "urlDivisionTexteVise": "/15/textes/1255C.asp#D_Article_52"
    }
  },
  "corps": {
    "dispositif": "<p style=\"text-align: justify;\">Supprimer cet article.</p>",
    "exposeSommaire": "<p style=\"text-align: justify;\">L&#8217;article&#160;52 du Projet de loi de Finances pr&#233;voit la suppression de l&#8217;exon&#233;ration de la taxe sur les conventions d&#8217;assurance (TSCA) sur la garantie d&#233;c&#232;s des contrats d&#8217;assurance emprunteurs. Les recettes r&#233;sultantes de cette taxe sont affect&#233;es &#224; la soci&#233;t&#233; Action Logement Services pour ses besoins de financement.</p><p style=\"text-align: justify;\">Dans sa r&#233;daction d&#8217;origine, l&#8217;article&#160;52 vise tous les cr&#233;dits assortis d&#8217;une assurance emprunteur, qu&#8217;ils soient des cr&#233;dits immobiliers, des cr&#233;dits &#224; la consommation ou des cr&#233;dits professionnels. Or, l&#8217;objet de la soci&#233;t&#233; Action Logement Services est de faciliter l&#8217;acc&#232;s au logement pour favoriser l&#8217;emploi notamment en construisant des logements sociaux. L&#8217;inclusion des cr&#233;dits &#224; la consommation et des cr&#233;dits professionnels dans l&#8217;application de la TSCA aux assurances souscrites n&#8217;a donc pas de fondement, ces cr&#233;dits n&#8217;ayant pas vocation &#224; contribuer aux ressources d&#8217;Action Logement.</p><p style=\"text-align: justify;\">De plus, le rench&#233;rissement du co&#251;t de l&#8217;assurance, qui sera in&#233;vitablement support&#233; par l&#8217;emprunteur, aura pour effet de le dissuader de souscrire cette assurance qui est facultative, notamment en cr&#233;dit &#224; la consommation. Il en r&#233;sultera une moindre couverture des emprunteurs qui peut s&#8217;av&#233;rer pr&#233;judiciable en particulier en cas de surendettement.</p><p style=\"text-align: justify;\">Le pr&#233;sent amendement a pour objet de rem&#233;dier &#224; cette situation, en limitant la port&#233;e de la suppression de l&#8217;exon&#233;ration de taxe aux seuls contrats d&#8217;assurance emprunteur portant sur des pr&#234;ts immobiliers.</p>"
  },
  "representations": [
    {
      "nom": "PDF",
      "typeMime": {
        "type": "application",
        "subType": "PDF"
      },
      "statutRepresentation": {
        "verbatim": true,
        "canonique": true,
        "officielle": true,
        "transcription": false,
        "enregistrement": false
      },
      "contenu": {
        "documentURI": "/15/amendements/1255C/CION_FIN/CF15.pdf"
      }
    }
  ],
  "sort": {
    "dateSaisie": "2018-11-07T14:48:52.000+01:00",
    "sortEnSeance": "Rejeté"
  },
  "dateDepot": "2018-10-15T02:00:00.000+02:00",
  "dateDistribution": "2018-11-06T01:00:00.000+01:00",
  "article99": "0",
  "loiReference": {}
}