{
  "uid": "AMANR5L15SEA717460BTC0902P0D1N1989",
  "identifiant": {
    "legislature": "15",
    "numero": "1989",
    "numRect": "0",
    "saisine": {
      "texteLegislatifRef": "PRJLANR5L15BTC0902",
      "numeroPartiePLF": "0",
      "organeExamen": "PO717460",
      "mentionSecondeDeliberation": "0"
    }
  },
  "numeroLong": "1989",
  "etapeTexte": "1ère lecture (1ère assemblée saisie)",
  "triAmendement": "edztznhhyi",
  "cardinaliteAmdtMultiples": "1",
  "etat": "Discuté",
  "signataires": {
    "auteur": {
      "typeAuteur": "Depute",
      "acteurRef": "PA721166",
      "groupePolitiqueRef": "PO730964"
    },
    "cosignatairesRefs": [
      "PA719790",
      "PA718962",
      "PA719364",
      "PA719258",
      "PA721336",
      "PA719230",
      "PA721398",
      "PA719130",
      "PA720242",
      "PA722190",
      "PA719100",
      "PA721792",
      "PA719504",
      "PA720944",
      "PA720154",
      "PA721726",
      "PA721876",
      "PA642724",
      "PA722344",
      "PA609520",
      "PA720576",
      "PA721844",
      "PA721860",
      "PA722260",
      "PA719448",
      "PA719822",
      "PA721166"
    ],
    "texteAffichable": "Mme&#160;Cazebonne,  Mme&#160;Abba, M.&#160;Ardouin, M.&#160;Attal, M.&#160;Barbier, M.&#160;Bois, Mme&#160;Brocard, M.&#160;Cesarini, M.&#160;Chalumeau, Mme&#160;Chapelier, Mme&#160;Degois, M.&#160;Delpon, Mme&#160;Dubr&#233;-Chirat, Mme&#160;Guerel, M.&#160;Julien-Laferriere, M.&#160;Kerlogot, M.&#160;Lagleize, Mme&#160;Mauborgne, Mme&#160;Michel, M.&#160;Morenas, Mme&#160;O&apos;Petit, Mme&#160;Park, Mme&#160;Piron, Mme&#160;Pompili, Mme&#160;Thillaye, M.&#160;Zulesi et M.&#160;Villani"
  },
  "pointeurFragmentTexte": {
    "division": {
      "titre": "Article 11",
      "articleDesignationCourte": "ART. 11",
      "type": "ARTICLE",
      "avantAApres": "A",
      "divisionRattachee": "ARTICLE 11",
      "urlDivisionTexteVise": "/15/textes/0902.asp#D_Article_11"
    }
  },
  "corps": {
    "dispositif": "<p style=\"text-align: justify;\">Compl&#233;ter cet article par les deux alin&#233;as suivants&#160;:</p><p style=\"text-align: justify;\">&#171;&#160;&#192; titre exp&#233;rimental, au plus tard six mois apr&#232;s la promulgation de la pr&#233;sente loi, pour une dur&#233;e de deux ans, les gestionnaires, publics ou priv&#233;s, des services de restauration collective scolaire, universitaire et des &#233;tablissements d&#8217;accueil des enfants de moins de six ans sont tenus, d&#232;s lors qu&#8217;ils proposent au moins deux entr&#233;es et deux plats principaux diff&#233;rents pour chaque repas, de proposer parmi ceux-ci un menu v&#233;g&#233;tarien quotidien. Ce menu peut &#234;tre compos&#233; de prot&#233;ines animales ou v&#233;g&#233;tales.</p><p style=\"text-align: justify;\">&#171;&#160;Un d&#233;cret en Conseil d&#8217;&#201;tat pr&#233;cise les modalit&#233;s d&#8217;application du pr&#233;sent article.&#160;&#187;</p>",
    "exposeSommaire": "<p style=\"text-align: justify;\">En France, la l&#233;gislation impose de servir de la viande, du poisson et des produits laitiers &#224; une fr&#233;quence d&#233;finie.</p><p style=\"text-align: justify;\">Cette exp&#233;rimentation vise &#224; introduire l&#8217;obligation d&#8217;alternatives v&#233;g&#233;tariennes quotidiennes &#224; base de prot&#233;ines animales (laitages, &#339;ufs) ou v&#233;g&#233;tales (c&#233;r&#233;ales, l&#233;gumineuses) dans la restauration collective scolaire publique et priv&#233;e.</p><p style=\"text-align: justify;\">L&#8217;objectif est d&#8217;&#233;valuer l&#8217;incidence de la pr&#233;sence d&#8217;options v&#233;g&#233;tariennes sur le gaspillage alimentaire, puisque la part &#171;&#160;viande, poissons, &#339;ufs&#160;&#187; repr&#233;sente 20&#160;% du gaspillage alimentaire et pr&#232;s de 50&#160;% du co&#251;t de ce gaspillage</p><p style=\"text-align: justify;\">L&#8217;objectif est &#233;galement d&#8217;&#233;valuer l&#8217;impact d&#8217;options v&#233;g&#233;tariennes quotidiennes, gr&#226;ce auxquelles les convictions de l&#8217;ensemble de la population seraient respect&#233;es, sur l&#8217;acc&#232;s &#224; la restauration scolaire, o&#249; une alimentation saine contribue &#224; la r&#233;ussite scolaire. De plus, &#171;&#160;une offre de choix&#160;&#187; est une pratique qui permet &#224; tous les &#233;l&#232;ves de manger &#224; la m&#234;me table, et donc de faire du repas un moment de vivre-ensemble.</p>"
  },
  "representations": [
    {
      "nom": "PDF",
      "typeMime": {
        "type": "application",
        "subType": "PDF"
      },
      "statutRepresentation": {
        "verbatim": true,
        "canonique": true,
        "officielle": true,
        "transcription": false,
        "enregistrement": false
      },
      "contenu": {
        "documentURI": "/15/amendements/0902/AN/1989.pdf"
      }
    }
  ],
  "seanceDiscussion": "RUANR5L15S2018IDS21107",
  "sort": {
    "dateSaisie": "2018-05-26T10:59:07.000+02:00",
    "sortEnSeance": "Rejeté"
  },
  "dateDepot": "2018-05-17T02:00:00.000+02:00",
  "dateDistribution": "2018-05-22T02:00:00.000+02:00",
  "article99": "0",
  "loiReference": {}
}