{
  "uid": "AMANR5L15PO59051B1331P0D1N3",
  "identifiant": {
    "legislature": "15",
    "numero": "3",
    "numRect": "0",
    "saisine": {
      "texteLegislatifRef": "PIONANR5L15B1331",
      "numeroPartiePLF": "0",
      "organeExamen": "PO59051",
      "mentionSecondeDeliberation": "0"
    }
  },
  "numeroLong": "CL3",
  "etapeTexte": "1ère lecture (1ère assemblée saisie)",
  "triAmendement": "iaaaaaaaaaaaaaaaaaaaaaaaaaaaaaaaaaaaaaaaaaaaaaaaaaci",
  "cardinaliteAmdtMultiples": "1",
  "etat": "Discuté",
  "signataires": {
    "auteur": {
      "typeAuteur": "Depute",
      "acteurRef": "PA721932",
      "groupePolitiqueRef": "PO723569"
    },
    "cosignatairesRefs": [
      "PA721932"
    ],
    "texteAffichable": "Mme&#160;Lorho"
  },
  "pointeurFragmentTexte": {
    "division": {
      "titre": "Article 2",
      "articleDesignationCourte": "ART. 2",
      "type": "ARTICLE",
      "avantAApres": "A",
      "divisionRattachee": "ARTICLE 2",
      "urlDivisionTexteVise": "/15/textes/1331.asp#D_Article_2"
    }
  },
  "corps": {
    "dispositif": "<p>Supprimer cet article.</p>",
    "exposeSommaire": "<p style=\"text-align: justify;\">La parentalit&#233; est au fondement de la communaut&#233; naturelle que constitue la famille&#160;; elle n&#8217;est en aucun cas une construction d&#8217;ordre social, une institution au sein de laquelle le l&#233;gislateur disposerait d&#8217;un pouvoir d&#233;cisionnaire l&#233;gitime. &#171;&#160;La formation &#224; la parentalit&#233;&#160;&#187; propos&#233;e par cette proposition de loi alimente l&#8217;immixtion de l&#8217;Etat dans une communaut&#233; &#224; laquelle il ne lui appartient pas d&#8217;intervenir.</p>"
  },
  "representations": [
    {
      "nom": "PDF",
      "typeMime": {
        "type": "application",
        "subType": "PDF"
      },
      "statutRepresentation": {
        "verbatim": true,
        "canonique": true,
        "officielle": true,
        "transcription": false,
        "enregistrement": false
      },
      "contenu": {
        "documentURI": "/15/amendements/1331/CION_LOIS/CL3.pdf"
      }
    }
  ],
  "sort": {
    "dateSaisie": "2018-11-21T11:25:22.000+01:00",
    "sortEnSeance": "Rejeté"
  },
  "dateDepot": "2018-11-12T01:00:00.000+01:00",
  "dateDistribution": "2018-11-19T01:00:00.000+01:00",
  "article99": "0",
  "loiReference": {}
}