{
  "uid": "AMANR5L15PO419610B0627P0D1N1855",
  "identifiant": {
    "legislature": "15",
    "numero": "1855",
    "numRect": "0",
    "saisine": {
      "texteLegislatifRef": "PRJLANR5L15B0627",
      "numeroPartiePLF": "0",
      "organeExamen": "PO419610",
      "mentionSecondeDeliberation": "0"
    }
  },
  "numeroLong": "CE1855",
  "etapeTexte": "1ère lecture (1ère assemblée saisie)",
  "triAmendement": "ajjdzzzzzzzw",
  "cardinaliteAmdtMultiples": "1",
  "etat": "Discuté",
  "signataires": {
    "auteur": {
      "typeAuteur": "Depute",
      "acteurRef": "PA719938",
      "groupePolitiqueRef": "PO730970"
    },
    "cosignatairesRefs": [
      "PA720162",
      "PA722162",
      "PA719504",
      "PA720976",
      "PA720598",
      "PA720092",
      "PA719938",
      "PA720334"
    ],
    "texteAffichable": "M.&#160;Fesneau,  M.&#160;Pahun, M.&#160;Turquois, M.&#160;Ramos, M.&#160;Bolo, Mme&#160;Deprez-Audebert, M.&#160;Mathiasin et M.&#160;Lagleize"
  },
  "pointeurFragmentTexte": {
    "division": {
      "titre": "Article 15",
      "articleDesignationCourte": "APRÈS ART. 15",
      "type": "ARTICLE",
      "avantAApres": "Apres",
      "divisionRattachee": "APRÈS L'ARTICLE 15, insérer l'article suivant:",
      "articleAdditionnel": "1",
      "urlDivisionTexteVise": "/15/textes/0627.asp#D_Article_15"
    }
  },
  "corps": {
    "dispositif": "<p style=\"text-align: justify;\">Apr&#232;s le II de l&#8217;article L.&#160;211&#8209;1 du code de l&#8217;environnement, il est ins&#233;r&#233; un II <i>bis</i> ainsi r&#233;dig&#233;&#160;:</p><p style=\"text-align: justify;\">&#171;&#160;II <i>bis</i>.&#160;&#8211;&#160;L&#8217;ad&#233;quation entre la disponibilit&#233; de la ressource en eau et les besoins actuels et futurs de l&#8217;agriculture doit &#234;tre garantie dans un contexte d&#8217;adaptation au changement climatique, notamment en mati&#232;re de stockage, conform&#233;ment au 5&#176;&#160;<i>bis</i> du I du pr&#233;sent article.</p><p style=\"text-align: justify;\">&#171;&#160;Les sch&#233;mas directeurs d&#8217;am&#233;nagement et de gestion des eaux et les sch&#233;mas d&#8217;am&#233;nagement et de gestion des eaux priorisent les mesures visant &#224; prendre en compte les besoins actuels et futurs en eau de l&#8217;agriculture et sa capacit&#233; d&#8217;adaptation face au changement climatique, notamment par la mobilisation de la ressource en eau.&#160;&#187;</p>",
    "exposeSommaire": "<p style=\"text-align: justify;\">Le pr&#233;sent amendement vise, dans un contexte de changement climatique et de tension provoqu&#233;e par les multiples usages de la ressource en eau, &#224; s&#233;curiser pour l&#8217;agriculture l&#8217;acc&#232;s &#224; cette ressource. Les sch&#233;mas directeurs d&#8217;am&#233;nagement et de gestion des eaux seront le garant de cette gestion &#233;quilibr&#233;e.</p>"
  },
  "representations": [
    {
      "nom": "PDF",
      "typeMime": {
        "type": "application",
        "subType": "PDF"
      },
      "statutRepresentation": {
        "verbatim": true,
        "canonique": true,
        "officielle": true,
        "transcription": false,
        "enregistrement": false
      },
      "contenu": {
        "documentURI": "/15/amendements/0627/CION-ECO/CE1855.pdf"
      }
    }
  ],
  "sort": {
    "dateSaisie": "2018-04-20T18:08:38.000+02:00",
    "sortEnSeance": "Retiré"
  },
  "dateDepot": "2018-04-13T02:00:00.000+02:00",
  "dateDistribution": "2018-04-17T02:00:00.000+02:00",
  "article99": "0",
  "loiReference": {
    "codeLoi": "environnement",
    "divisionCodeLoi": "L211-1"
  }
}