{
  "uid": "AMANR5L15SEA717460BTC0857P0D1N704",
  "identifiant": {
    "legislature": "15",
    "numero": "704",
    "numRect": "0",
    "saisine": {
      "texteLegislatifRef": "PRJLANR5L15BTC0857",
      "numeroPartiePLF": "0",
      "organeExamen": "PO717460",
      "mentionSecondeDeliberation": "0"
    }
  },
  "numeroLong": "704",
  "etapeTexte": "1ère lecture (1ère assemblée saisie)",
  "triAmendement": "t",
  "cardinaliteAmdtMultiples": "1",
  "etat": "Retiré",
  "signataires": {
    "auteur": {
      "typeAuteur": "Depute",
      "acteurRef": "PA720500",
      "groupePolitiqueRef": "PO730964"
    },
    "cosignatairesRefs": [
      "PA721710",
      "PA719118",
      "PA718876",
      "PA719652",
      "PA719660",
      "PA267336",
      "PA719230",
      "PA718954",
      "PA721776",
      "PA721426",
      "PA722170",
      "PA721024",
      "PA642695",
      "PA718810",
      "PA720552",
      "PA720198",
      "PA719364",
      "PA721600",
      "PA719194",
      "PA719858",
      "PA720362",
      "PA718736",
      "PA720738",
      "PA721194",
      "PA720446",
      "PA721522",
      "PA722252",
      "PA722134",
      "PA606202",
      "PA720014",
      "PA719186",
      "PA719528",
      "PA719338",
      "PA719294",
      "PA719600",
      "PA721246",
      "PA721916",
      "PA702054",
      "PA608083",
      "PA719330",
      "PA720454",
      "PA720900",
      "PA605963",
      "PA719632",
      "PA720116",
      "PA720500",
      "PA643175",
      "PA720870",
      "PA720480",
      "PA721398",
      "PA720952",
      "PA722178",
      "PA719440",
      "PA718962",
      "PA334768",
      "PA719130",
      "PA718902",
      "PA720190",
      "PA719480",
      "PA721542",
      "PA721004",
      "PA720438",
      "PA722398",
      "PA672",
      "PA722054",
      "PA719570",
      "PA717379",
      "PA721296",
      "PA720066",
      "PA718910",
      "PA719162",
      "PA607595",
      "PA720222",
      "PA719154",
      "PA720414",
      "PA334116",
      "PA720538",
      "PA720568",
      "PA722320",
      "PA719350",
      "PA718756",
      "PA721792",
      "PA720124",
      "PA719448",
      "PA719790",
      "PA719100",
      "PA720074",
      "PA719882",
      "PA721860",
      "PA722268",
      "PA722300",
      "PA720242",
      "PA720854",
      "PA721656",
      "PA721888",
      "PA722118",
      "PA721876",
      "PA719170",
      "PA719464",
      "PA719972",
      "PA721218",
      "PA724827",
      "PA720402",
      "PA719756"
    ],
    "texteAffichable": "Mme&#160;Val&#233;rie&#160;Petit,  M.&#160;Houbron, M.&#160;Baich&#232;re, Mme&#160;Beaudouin-Hubiere, M.&#160;Giraud, Mme&#160;Degois, Mme&#160;Guerel, Mme&#160;Rist, Mme&#160;Jacqueline&#160;Dubois, M.&#160;Michels, Mme&#160;Rilhac, Mme&#160;Lakrafi, M.&#160;Touraine, Mme&#160;Amadou, Mme&#160;Dubos, M.&#160;Test&#233;, M.&#160;Sorre, M.&#160;Cormier-Bouligeon, M.&#160;Bothorel, Mme&#160;Sarles, M.&#160;Pellois, Mme&#160;Fr&#233;d&#233;rique&#160;Dumas, Mme&#160;Dupont, Mme&#160;Gaillot, Mme&#160;Sylla, M.&#160;Mbaye, Mme&#160;De Temmerman, Mme&#160;Peyrol, Mme&#160;Wonner, Mme&#160;Tamarelle-Verhaeghe, M.&#160;Raphan, Mme&#160;Rossi, Mme&#160;Yolaine&#160;de Courson, Mme&#160;Limon, Mme&#160;Cloarec, M.&#160;Portarrieu, Mme&#160;Riotton, M.&#160;Paluszkiewicz, Mme&#160;Clapot, Mme&#160;Hammerer, Mme&#160;Melchior, M.&#160;Rebeyrotte, Mme&#160;Fabre, Mme&#160;Genetet, M.&#160;Chalumeau, Mme&#160;O&apos;Petit, M.&#160;C&#233;dric&#160;Roussel, M.&#160;Gaillard, M.&#160;Girardin, Mme&#160;Lecocq, Mme&#160;Liso, M.&#160;Tach&#233;, M.&#160;Cesarini, M.&#160;Di Pompeo, Mme&#160;Janvier, M.&#160;Perrot, Mme&#160;Khattabi, M.&#160;Besson-Moreau, Mme&#160;Peyron, M.&#160;Alauzet, M.&#160;Batut, Mme&#160;Jacqueline&#160;Maquet, Mme&#160;Pitollat, M.&#160;Morenas, M.&#160;Martin, M.&#160;Zulesi, Mme&#160;Rauch, Mme&#160;Charri&#232;re, Mme&#160;Charvier, Mme&#160;Pouzyreff, M.&#160;Poulliat, M.&#160;Cellier, M.&#160;Kerlogot, Mme&#160;Tiegna, Mme&#160;Mireille&#160;Robert, M.&#160;Maire, Mme&#160;Verdier-Jouclas, Mme&#160;Bourguignon, M.&#160;Ahamada, Mme&#160;Thill, M.&#160;Ardouin, M.&#160;Claireaux, Mme&#160;Hai, M.&#160;Fi&#233;vet, M.&#160;Galbadon, M.&#160;Belhaddad, Mme&#160;Michel, Mme&#160;Meynier-Millefert, Mme&#160;Bono-Vandorme, Mme&#160;Ali, Mme&#160;Rixain, M.&#160;Maillard, Mme&#160;Panonacle, Mme&#160;Khedher, M.&#160;Gouffier-Cha, M.&#160;Gouttefarde, Mme&#160;Fran&#231;oise&#160;Dumas, M.&#160;Bridey, Mme&#160;Muschotti, Mme&#160;Chapelier, M.&#160;Nadot, Mme&#160;Abba, M.&#160;Lejeune et Mme&#160;Brunet"
  },
  "pointeurFragmentTexte": {
    "division": {
      "titre": "Article 42",
      "articleDesignationCourte": "APRÈS ART. 42",
      "type": "ARTICLE",
      "avantAApres": "Apres",
      "divisionRattachee": "APRÈS L'ARTICLE 42, insérer l'article suivant:",
      "articleAdditionnel": "1",
      "urlDivisionTexteVise": "/15/textes/0857.asp#D_Article_42"
    }
  },
  "corps": {
    "dispositif": "<p style=\"text-align: justify;\">Les mesures prises sur le fondement de la pr&#233;sente loi font l&#8217;objet d&#8217;une &#233;valuation d&#8217;impact qui s&#8217;appuie sur une m&#233;thodologie rigoureuse et sur une multiplicit&#233; de crit&#232;res. Dans la troisi&#232;me ann&#233;e qui suit la promulgation de la pr&#233;sente loi, cette &#233;valuation fait l&#8217;objet d&#8217;un rapport transmis au Parlement.</p>",
    "exposeSommaire": "<p style=\"text-align: justify;\">Cet amendement vise &#224; pr&#233;voir la mise en place d&#8217;un dispositif d&#8217;&#233;valuation rigoureux et adapt&#233; de la pr&#233;sente loi en proposant une &#233;valuation d&#8217;impact des mesures prises sur son fondement.</p><p style=\"text-align: justify;\">Il constitue un gage non seulement d&#8217;efficacit&#233; mais &#233;galement de l&#233;gitimit&#233; de la loi et in fine de confiance dans l&#8217;action publique.</p><p style=\"text-align: justify;\">L&#8217;&#233;valuation d&#8217;impact (mesure des effets de la loi sur les publics cibl&#233;s) est la seule m&#233;thode d&#8217;&#233;valuation permettant de r&#233;pondre aux questions aussi simples qu&#8217;essentielles que sont&#160;: cette loi a-t-elle effectivement atteint les objectifs qu&#8217;elle s&#8217;est fix&#233;s&#160;? Cette loi a-t-elle eu un effet positif sur le quotidien des fran&#231;ais&#160;? Elle doit s&#8217;appuyer sur des m&#233;thodes scientifiques.</p><p style=\"text-align: justify;\">Mieux &#233;valuer, c&#8217;est mieux agir&#160;: une &#233;valuation de politique publique de qualit&#233; est la garantie d&#8217;une action publique &#224; la fois plus l&#233;gitime et plus efficace. En s&#8217;engageant &#224; mettre en place une &#233;valuation de qualit&#233;, le Gouvernement ferait montre d&#8217;exemplarit&#233; en mati&#232;re de transformation de l&#8217;action publique. La logique de l&#8217;&#233;valuation est celle d&#8217;une action publique qui se donne le droit &#224; l&#8217;erreur et ne craint pas de se remettre en cause pour progresser et am&#233;liorer la vie des citoyens.</p>"
  },
  "representations": [
    {
      "nom": "PDF",
      "typeMime": {
        "type": "application",
        "subType": "PDF"
      },
      "statutRepresentation": {
        "verbatim": true,
        "canonique": true,
        "officielle": true,
        "transcription": false,
        "enregistrement": false
      },
      "contenu": {
        "documentURI": "/15/amendements/0857/AN/704.pdf"
      }
    }
  ],
  "dateDepot": "2018-04-12T02:00:00.000+02:00",
  "dateDistribution": "2018-04-16T02:00:00.000+02:00",
  "article99": "0",
  "loiReference": {}
}