{
  "uid": "AMANR5L15PO59048B2272P1D1N70",
  "identifiant": {
    "legislature": "15",
    "numero": "70",
    "numRect": "0",
    "saisine": {
      "texteLegislatifRef": "PRJLANR5L15B2272",
      "numeroPartiePLF": "1",
      "organeExamen": "PO59048",
      "mentionSecondeDeliberation": "0"
    }
  },
  "numeroLong": "I-CF70",
  "etapeTexte": "1ère lecture (1ère assemblée saisie)",
  "triAmendement": "beaaaaaaaaaaaaaaaaaaaaaaaaaaaaaaaaaaaaaaaaaaaaaaaaabui",
  "cardinaliteAmdtMultiples": "1",
  "etat": "Discuté",
  "signataires": {
    "auteur": {
      "typeAuteur": "Depute",
      "acteurRef": "PA608016",
      "groupePolitiqueRef": "PO730934"
    },
    "cosignatairesRefs": [
      "PA719318",
      "PA712015",
      "PA608016",
      "PA720210",
      "PA267260",
      "PA346054",
      "PA721410",
      "PA266797",
      "PA709315",
      "PA605036",
      "PA330684",
      "PA722390",
      "PA346218",
      "PA267429",
      "PA718884",
      "PA718850",
      "PA2492",
      "PA1327",
      "PA2155",
      "PA2377",
      "PA642847",
      "PA720644",
      "PA608416",
      "PA332523"
    ],
    "texteAffichable": "Mme&#160;Louwagie,  M.&#160;Abad, M.&#160;Hetzel, M.&#160;Gosselin, Mme&#160;Val&#233;rie&#160;Boyer, Mme&#160;Corneloup, M.&#160;Cordier, M.&#160;Cinieri, M.&#160;Nury, M.&#160;Quentin, M.&#160;Viala, M.&#160;Bazin, Mme&#160;Dalloz, M.&#160;Dive, Mme&#160;Beauvais, M.&#160;Emmanuel&#160;Maquet, Mme&#160;Poletti, Mme&#160;Bazin-Malgras, Mme&#160;Anthoine, M.&#160;Menuel, M.&#160;Perrut, M.&#160;Masson, M.&#160;Forissier et Mme&#160;Bonnivard"
  },
  "pointeurFragmentTexte": {
    "division": {
      "titre": "Article 6",
      "articleDesignationCourte": "ART. 6",
      "type": "ARTICLE",
      "avantAApres": "A",
      "divisionRattachee": "ARTICLE 6",
      "urlDivisionTexteVise": "/15/textes/2272A.asp#D_Article_6"
    },
    "alinea": {
      "avantAApres": "Apres",
      "numero": "1"
    }
  },
  "corps": {
    "dispositif": "<p style=\"text-align: justify;\">I.&#160;&#8211;&#160;Apr&#232;s l&#8217;alin&#233;a&#160;1, ins&#233;rer l&#8217;alin&#233;a suivant&#160;:</p><p>&#171;&#160;<i>1&#176;</i>&#160;A L&#8217;article&#160;234&#160;<i>nonies&#160;</i>est abrog&#233;&#160;;&#160;&#187;.</p><p>II.&#160;&#8211;&#160;Compl&#233;ter cet article par l&#8217;alin&#233;a suivant&#160;:</p><p>&#171;&#160;<i>XI.</i>&#160;&#8211;&#160;La perte de recettes pour l&#8217;&#201;tat est compens&#233;e &#224; due concurrence par la cr&#233;ation d&#8217;une taxe additionnelle aux droits vis&#233;s aux articles 575 et 575 A du code g&#233;n&#233;ral des imp&#244;ts.&#160;&#187;.</p>",
    "exposeSommaire": "<p style=\"text-align: justify;\">Cet amendement vise &#224; simplifier le droit fiscal fran&#231;ais.</p><p style=\"text-align: justify;\">La contribution annuelle sur les revenus locatifs (CRL) est une taxe instaur&#233;e &#224; compter du 1er&#160;janvier 2000, en remplacement de deux anciennes taxes portant sur le m&#234;me objet&#160;: la contribution annuelle repr&#233;sentative du droit de bail et la contribution additionnelle &#224; la contribution annuelle repr&#233;sentative du droit de bail.</p><p style=\"text-align: justify;\">Initialement applicable &#224; l&#8217;ensemble des bailleurs, la liste de ses redevables s&#8217;est progressivement restreinte, les personnes physiques en ayant &#233;t&#233; exclues &#224; compter du 1<sup>er</sup> janvier 2006.</p><p style=\"text-align: justify;\">Selon le rapport n&#176; 2013-M-095&#8209;02 de l&#8217;inspection g&#233;n&#233;rale des finances publiques en date du mois de f&#233;vrier 2014, l&#8217;absence d&#8217;objectif de politique publique identifi&#233; et le tr&#232;s faible rendement, expliqu&#233; par une liste de redevables tr&#232;s circonscrite, militent pour sa suppression.</p><p style=\"text-align: justify;\">Aussi, cet amendement propose de supprimer la CRL.</p>"
  },
  "representations": [
    {
      "nom": "PDF",
      "typeMime": {
        "type": "application",
        "subType": "PDF"
      },
      "statutRepresentation": {
        "verbatim": true,
        "canonique": true,
        "officielle": true,
        "transcription": false,
        "enregistrement": false
      },
      "contenu": {
        "documentURI": "/15/amendements/2272A/CION_FIN/CF70.pdf"
      }
    }
  ],
  "sort": {
    "dateSaisie": "2019-10-09T16:26:01.000+02:00",
    "sortEnSeance": "Rejeté"
  },
  "dateDepot": "2019-10-02T02:00:00.000+02:00",
  "dateDistribution": "2019-10-08T02:00:00.000+02:00",
  "article99": "0",
  "loiReference": {}
}