{
  "uid": "AMANR5L15PO419610B2274P0D1N31",
  "identifiant": {
    "legislature": "15",
    "numero": "31",
    "numRect": "0",
    "saisine": {
      "texteLegislatifRef": "PRJLANR5L15B2274",
      "numeroPartiePLF": "0",
      "organeExamen": "PO419610",
      "mentionSecondeDeliberation": "0"
    }
  },
  "numeroLong": "CE31",
  "etapeTexte": "1ère lecture (2ème assemblée saisie)",
  "triAmendement": "joaaaaaaaaaaaaaaaaaaaaaaaaaaaaaaaaaaaaaaaaaaaaaaaagi",
  "cardinaliteAmdtMultiples": "1",
  "etat": "Discuté",
  "signataires": {
    "auteur": {
      "typeAuteur": "Depute",
      "acteurRef": "PA607090",
      "groupePolitiqueRef": "PO730934"
    },
    "cosignatairesRefs": [
      "PA719318",
      "PA267429",
      "PA266808",
      "PA334654",
      "PA346218",
      "PA718884",
      "PA607090",
      "PA722390",
      "PA267204"
    ],
    "texteAffichable": "M.&#160;Jean-Pierre&#160;Vigier,  Mme&#160;Anthoine, Mme&#160;Bazin-Malgras, M.&#160;Cinieri, M.&#160;Masson, M.&#160;Rolland, M.&#160;Sermier, M.&#160;Straumann et Mme&#160;Corneloup"
  },
  "pointeurFragmentTexte": {
    "division": {
      "titre": "Article 10 ter",
      "articleDesignationCourte": "ART. 10 TER",
      "type": "ARTICLE",
      "avantAApres": "A",
      "divisionRattachee": "ARTICLE 10 TER",
      "urlDivisionTexteVise": "/15/textes/2274.asp#D_Article_10_ter"
    },
    "alinea": {
      "numero": "2"
    }
  },
  "corps": {
    "dispositif": "<p style=\"text-align: justify;\">&#192; l&#8217;alin&#233;a&#160;2, apr&#232;s le mot&#160;: </p><p style=\"text-align: justify;\">&#171;&#160;v&#233;g&#233;tales&#160;&#187;,</p><p style=\"text-align: justify;\">ins&#233;rer les mots&#160;:</p><p style=\"text-align: justify;\">&#171;&#160;telles que celles g&#233;n&#233;r&#233;es par l&#8217;entretien des jardins et espaces verts&#160;&#187;.</p>",
    "exposeSommaire": "<p style=\"text-align: justify;\">Le traitement par compostage, mentionn&#233; par l&#8217;article L.&#160;541&#8209;38 (nouveau) du code de l&#8217;environnement, des boues d&#8217;&#233;puration et des mati&#232;res v&#233;g&#233;tales utilis&#233;es comme agents structurants n&#233;cessite de pr&#233;ciser que celles-ci englobent les d&#233;chets verts provenant de l&#8217;entretien des parcs et jardins comme cela est majoritairement le cas. </p><p style=\"text-align: justify;\">C&#8217;est ce que cet amendement vise &#224; faire reconna&#238;tre par la loi, dans un souci de clart&#233; et de pr&#233;cision.</p>"
  },
  "representations": [
    {
      "nom": "PDF",
      "typeMime": {
        "type": "application",
        "subType": "PDF"
      },
      "statutRepresentation": {
        "verbatim": true,
        "canonique": true,
        "officielle": true,
        "transcription": false,
        "enregistrement": false
      },
      "contenu": {
        "documentURI": "/15/amendements/2274/CION-ECO/CE31.pdf"
      }
    }
  ],
  "sort": {
    "dateSaisie": "2019-11-20T00:30:45.000+01:00",
    "sortEnSeance": "Rejeté"
  },
  "dateDepot": "2019-11-12T01:00:00.000+01:00",
  "dateDistribution": "2019-11-19T01:00:00.000+01:00",
  "article99": "0",
  "loiReference": {
    "codeLoi": "2"
  }
}