{
  "uid": "AMANR5L15PO419865B2274P0D1N410",
  "identifiant": {
    "legislature": "15",
    "numero": "410",
    "numRect": "0",
    "saisine": {
      "texteLegislatifRef": "PRJLANR5L15B2274",
      "numeroPartiePLF": "0",
      "organeExamen": "PO419865",
      "mentionSecondeDeliberation": "0"
    }
  },
  "numeroLong": "CD410",
  "etapeTexte": "1ère lecture (2ème assemblée saisie)",
  "triAmendement": "joaaaaaaaaaaaaaaaaaaaaaaaaaaaaaaaaaaaaaaaaaaaaaaaafm",
  "cardinaliteAmdtMultiples": "1",
  "etat": "En traitement",
  "signataires": {
    "auteur": {
      "typeAuteur": "Depute",
      "acteurRef": "PA2155",
      "groupePolitiqueRef": "PO730934"
    },
    "cosignatairesRefs": [
      "PA2155",
      "PA267204",
      "PA609245"
    ],
    "texteAffichable": "M.&#160;Menuel,  Mme&#160;Lacroute et M.&#160;Sermier"
  },
  "pointeurFragmentTexte": {
    "division": {
      "titre": "Article 10 ter",
      "articleDesignationCourte": "ART. 10 TER",
      "type": "ARTICLE",
      "avantAApres": "A",
      "divisionRattachee": "ARTICLE 10 TER",
      "urlDivisionTexteVise": "/15/textes/2274.asp#D_Article_10_ter"
    },
    "alinea": {
      "numero": "2"
    }
  },
  "corps": {
    "dispositif": "<p>&#192; l&#8217;alin&#233;a&#160;2, substituer aux mots&#160;:</p><p style=\"text-align: justify;\">&#171;&#160;voie r&#233;glementaire&#160;&#187;</p><p style=\"text-align: justify;\">le mot&#160;:</p><p style=\"text-align: justify;\">&#171;&#160;d&#233;cret&#160;&#187;.</p>",
    "exposeSommaire": "<p style=\"text-align: justify;\">Le nouvel article L.&#160;541&#8209;38 du code de l&#8217;environnement pr&#233;voit que les conditions de traitement en compostage des mati&#232;res organiques issues du traitement des eaux us&#233;es avec des mati&#232;res v&#233;g&#233;tales soient d&#233;finies par voie r&#233;glementaire.&#160;</p><p style=\"text-align: justify;\">Toutefois, cette expression est trop vague. Il est donc propos&#233; par cet amendement de la remplacer par une d&#233;finition par d&#233;cret.&#160;</p>",
    "cartoucheDelaiDepotDepasse": "Sous réserve de son traitement par les services de l'Assemblée nationale et de sa recevabilité"
  },
  "representations": [
    {
      "nom": "PDF",
      "typeMime": {
        "type": "application",
        "subType": "PDF"
      },
      "statutRepresentation": {
        "verbatim": true,
        "canonique": true,
        "officielle": true,
        "transcription": false,
        "enregistrement": false
      },
      "contenu": {
        "documentURI": "/15/amendements/2274/CION-DVP/CD410.pdf"
      }
    }
  ],
  "dateDepot": "2019-11-19T01:00:00.000+01:00",
  "article99": "0",
  "loiReference": {}
}