{
  "uid": "AMANR5L15SEA717460BTC1396P0D1N1577",
  "identifiant": {
    "legislature": "15",
    "numero": "1577",
    "numRect": "0",
    "saisine": {
      "texteLegislatifRef": "PRJLANR5L15BTC1396",
      "numeroPartiePLF": "0",
      "organeExamen": "PO717460",
      "mentionSecondeDeliberation": "0"
    }
  },
  "numeroLong": "1577",
  "etapeTexte": "1ère lecture (2ème assemblée saisie)",
  "triAmendement": "jqaaaaaaaaaaaaaaaaaaaaaaaaaaaaaaaaaaaaaaaaaaaaaaaai",
  "cardinaliteAmdtMultiples": "1",
  "etat": "Discuté",
  "signataires": {
    "auteur": {
      "typeAuteur": "Depute",
      "acteurRef": "PA719874",
      "groupePolitiqueRef": "PO730970"
    },
    "cosignatairesRefs": [
      "PA719874"
    ],
    "texteAffichable": "Mme&#160;Jacquier-Laforge"
  },
  "pointeurFragmentTexte": {
    "division": {
      "titre": "Article 47",
      "articleDesignationCourte": "ART. 47",
      "type": "ARTICLE",
      "avantAApres": "A",
      "divisionRattachee": "ARTICLE 47",
      "urlDivisionTexteVise": "/15/textes/1396.asp#D_Article_47"
    },
    "alinea": {
      "avantAApres": "Apres",
      "numero": "12"
    }
  },
  "corps": {
    "dispositif": "<p style=\"text-align: justify;\">I.&#160;&#8211;&#160;&#192; l&#8217;alin&#233;a&#160;12, apr&#232;s le mot&#160;:</p><p style=\"text-align: justify;\">&#171;&#160;probation&#160;&#187;,</p><p style=\"text-align: justify;\">ins&#233;rer les mots&#160;:</p><p style=\"text-align: justify;\">&#171;&#160;ou la personne morale habilit&#233;e&#160;&#187;.</p><p style=\"text-align: justify;\">II.&#160;&#8211;&#160;En cons&#233;quence, &#224; l&#8217;alin&#233;a&#160;13,</p><p style=\"text-align: justify;\">apr&#232;s le mot&#160;:</p><p style=\"text-align: justify;\">&#171;&#160;service&#160;&#187;,</p><p style=\"text-align: justify;\">ins&#233;rer les mots&#160;:</p><p style=\"text-align: justify;\">&#171;&#160;ou la personne morale habilit&#233;e&#160;&#187;.</p>",
    "exposeSommaire": "<p style=\"text-align: justify;\">Amendement de coh&#233;rence.</p><p style=\"text-align: justify;\">Le texte pr&#233;voit &#224; l&#8217;article&#160;47 que le suivi de la personne condamn&#233;e &#224; un sursis probatoire peut &#234;tre assur&#233; aussi bien par le SPIP que par une personne morale habilit&#233;e.</p><p style=\"text-align: justify;\">Aussi la personne morale habilit&#233;e sera tout autant que le SPIP amen&#233;e &#224; r&#233;aliser les &#233;valuations pr&#233;vues dans le cadre du sursis probatoire.</p><p style=\"text-align: justify;\">Cet amendement vise &#224; pallier &#224; un oubli r&#233;dactionnel.</p>"
  },
  "representations": [
    {
      "nom": "PDF",
      "typeMime": {
        "type": "application",
        "subType": "PDF"
      },
      "statutRepresentation": {
        "verbatim": true,
        "canonique": true,
        "officielle": true,
        "transcription": false,
        "enregistrement": false
      },
      "contenu": {
        "documentURI": "/15/amendements/1396/AN/1577.pdf"
      }
    }
  ],
  "seanceDiscussion": "RUANR5L15S2019IDS21401",
  "sort": {
    "dateSaisie": "2018-12-04T18:06:21.000+01:00",
    "sortEnSeance": "Rejeté"
  },
  "dateDepot": "2018-11-15T01:00:00.000+01:00",
  "dateDistribution": "2018-11-21T01:00:00.000+01:00",
  "article99": "0",
  "loiReference": {}
}