{
  "uid": "AMANR5L15PO59051B1503P0D1N21",
  "identifiant": {
    "legislature": "15",
    "numero": "21",
    "numRect": "0",
    "saisine": {
      "texteLegislatifRef": "PRJLANR5L15B1503",
      "numeroPartiePLF": "0",
      "organeExamen": "PO59051",
      "mentionSecondeDeliberation": "0"
    }
  },
  "numeroLong": "CL21",
  "etapeTexte": "Nouvelle Lecture",
  "triAmendement": "liaaaaaaaaaaaaaaaaaaaaaaaaaaaaaaaaaaaaaaaaaaaaaaaaaek",
  "cardinaliteAmdtMultiples": "1",
  "etat": "Discuté",
  "signataires": {
    "auteur": {
      "typeAuteur": "Depute",
      "acteurRef": "PA346218",
      "groupePolitiqueRef": "PO730934"
    },
    "cosignatairesRefs": [
      "PA721314",
      "PA267429",
      "PA642847",
      "PA718838",
      "PA1874",
      "PA267378",
      "PA721286",
      "PA334654",
      "PA721506",
      "PA346218",
      "PA330684",
      "PA267204",
      "PA718780",
      "PA721474",
      "PA608016"
    ],
    "texteAffichable": "M.&#160;Masson,  M.&#160;Bazin, Mme&#160;Val&#233;rie&#160;Boyer, M.&#160;Brun, M.&#160;Cinieri, Mme&#160;Kuster, M.&#160;Le Fur, Mme&#160;Levy, Mme&#160;Louwagie, M.&#160;Ramadier, M.&#160;Schellenberger, M.&#160;Sermier, M.&#160;Straumann, Mme&#160;Trastour-Isnart et M.&#160;Viry"
  },
  "pointeurFragmentTexte": {
    "division": {
      "titre": "Articles 52 bis à 52 quinquies",
      "articleDesignationCourte": "ART.S 52 BIS À 52 QUINQUIES",
      "type": "ARTICLE",
      "avantAApres": "A",
      "divisionRattachee": "ARTICLES 52 BIS À 52 QUINQUIES",
      "urlDivisionTexteVise": "/15/textes/1503.asp#D_Articles_52_bis_a_52_quinquies"
    }
  },
  "corps": {
    "dispositif": "<p style=\"text-align: justify;\">R&#233;tablir&#160;l&#8217;article&#160;52&#160;<i>bis</i> dans la r&#233;daction suivante&#160;:</p><p style=\"text-align: justify;\">&#171;&#160;L&#8217;article&#160;1635 <i>bis</i> Q du code g&#233;n&#233;ral des imp&#244;ts est ainsi r&#233;tabli&#160;:</p><p style=\"text-align: justify;\">&#171;&#160;&#171;&#160;<i>Art.&#160;1635</i> bis <i>Q</i>.&#160;&#8211;&#160;I.&#160;&#8211;&#160;Par d&#233;rogation aux articles 1089 A et 1089 B, une contribution pour l&#8217;aide juridique de&#160;20 &#224;&#160;50&#160;&#8364; est per&#231;ue par instance introduite en mati&#232;re civile, commerciale, prud&#8217;homale, sociale ou rurale devant une juridiction judiciaire ou par instance introduite devant une juridiction administrative.</p><p style=\"text-align: justify;\">&#171;&#160;&#171;&#160;II.&#160;&#8211;&#160;La contribution pour l&#8217;aide juridique est exigible lors de l&#8217;introduction de l&#8217;instance. Elle est due par la partie qui introduit une instance.</p><p style=\"text-align: justify;\">&#171;&#160;&#171;&#160;III.&#160;&#8211;&#160;Toutefois, la contribution pour l&#8217;aide juridique n&#8217;est pas due&#160;:</p><p style=\"text-align: justify;\">&#171;&#160;&#171;&#160;1&#176; Par les personnes b&#233;n&#233;ficiaires de l&#8217;aide juridictionnelle&#160;;</p><p style=\"text-align: justify;\">&#171;&#160;&#171;&#160;2&#176; Par l&#8217;&#201;tat&#160;;</p><p style=\"text-align: justify;\">&#171;&#160;&#171;&#160;3&#176; Pour les proc&#233;dures introduites devant la commission d&#8217;indemnisation des victimes d&#8217;infraction, devant le juge des enfants, le juge des libert&#233;s et de la d&#233;tention et le juge des tutelles&#160;;</p><p style=\"text-align: justify;\">&#171;&#160;&#171;&#160;4&#176; Pour les proc&#233;dures de traitement des situations de surendettement des particuliers et les proc&#233;dures de redressement et de liquidation judiciaires&#160;;</p><p style=\"text-align: justify;\">&#171;&#160;&#171;&#160;5&#176; Pour les proc&#233;dures introduites par les salari&#233;s devant un conseil de prud&#8217;hommes&#160;;</p><p style=\"text-align: justify;\">&#171;&#160;&#171;&#160;6&#176; Pour les recours introduits devant une juridiction administrative &#224; l&#8217;encontre de toute d&#233;cision individuelle relative &#224; l&#8217;entr&#233;e, au s&#233;jour et &#224; l&#8217;&#233;loignement d&#8217;un &#233;tranger sur le territoire fran&#231;ais ainsi qu&#8217;au droit d&#8217;asile&#160;;</p><p style=\"text-align: justify;\">&#171;&#160;&#171;&#160;7&#176; Pour la proc&#233;dure mentionn&#233;e &#224; l&#8217;article L.&#160;521&#8209;2 du code de justice administrative&#160;;</p><p style=\"text-align: justify;\">&#171;&#160;&#171;&#160;8&#176; Pour la proc&#233;dure mentionn&#233;e &#224; l&#8217;article&#160;515&#8209;9 du code civil&#160;;</p><p style=\"text-align: justify;\">&#171;&#160;&#171;&#160;9&#176; Pour la proc&#233;dure mentionn&#233;e &#224; l&#8217;article L.&#160;34 du code &#233;lectoral&#160;;</p><p style=\"text-align: justify;\">&#171;&#160;&#171;&#160;10&#176; Pour les proc&#233;dures de conciliation mentionn&#233;es &#224; l&#8217;article&#160;4 de la loi n&#176; 2016&#8209;1547 du 18 novembre 2016 de modernisation de la justice du XXIe si&#232;cle et celles d&#233;l&#233;gu&#233;es par le juge, en vertu d&#8217;une disposition particuli&#232;re, au conciliateur de justice.</p><p style=\"text-align: justify;\">&#171;&#160;&#171;&#160;IV.&#160;&#8211;&#160;Lorsqu&#8217;une m&#234;me instance donne lieu &#224; plusieurs proc&#233;dures successives devant la m&#234;me juridiction, la contribution n&#8217;est due qu&#8217;au titre de la premi&#232;re des proc&#233;dures intent&#233;es.</p><p style=\"text-align: justify;\">&#171;&#160;&#171;&#160;V.&#160;&#8211;&#160;Lorsque l&#8217;instance est introduite par un auxiliaire de justice, ce dernier acquitte pour le compte de son client la contribution par voie &#233;lectronique.</p><p style=\"text-align: justify;\">&#171;&#160;&#171;&#160;Lorsque l&#8217;instance est introduite sans auxiliaire de justice, la partie acquitte cette contribution par voie de timbre mobile ou par voie &#233;lectronique.</p><p style=\"text-align: justify;\">&#171;&#160;&#171;&#160;Les cons&#233;quences sur l&#8217;instance du d&#233;faut de paiement de la contribution pour l&#8217;aide juridique sont fix&#233;es par voie r&#233;glementaire.</p><p style=\"text-align: justify;\">&#171;&#160;&#171;&#160;VI.&#160;&#8211;&#160;La contribution pour l&#8217;aide juridique est affect&#233;e au Conseil national des barreaux.</p><p style=\"text-align: justify;\">&#171;&#160;&#171;&#160;VII.&#160;&#8211;&#160;Un d&#233;cret en Conseil d&#8217;&#201;tat pr&#233;cise les modalit&#233;s d&#8217;application du pr&#233;sent article.&#160;&#187;&#160;&#187;</p>",
    "exposeSommaire": "<p>Cet amendement vise &#224; r&#233;tablir la contribution pour l&#8217;aide juridique supprim&#233;e par la loi n&#176; 2013-1278 du 29 d&#233;cembre 2013 de finances pour 2014, suivant la r&#233;daction retenue par le S&#233;nat lors de l&#8217;adoption, le 24 octobre 2017, de la proposition de loi d&#8217;orientation et de programmation pour le redressement de la justice, pr&#233;sent&#233;e par M. Philippe Bas. Elle serait d&#233;sormais modul&#233;e, de 20 &#224; 50 euros, en fonction du type d&#8217;instance engag&#233;e.</p>"
  },
  "representations": [
    {
      "nom": "PDF",
      "typeMime": {
        "type": "application",
        "subType": "PDF"
      },
      "statutRepresentation": {
        "verbatim": true,
        "canonique": true,
        "officielle": true,
        "transcription": false,
        "enregistrement": false
      },
      "contenu": {
        "documentURI": "/15/amendements/1503/CION_LOIS/CL21.pdf"
      }
    }
  ],
  "sort": {
    "dateSaisie": "2018-12-19T22:56:56.000+01:00",
    "sortEnSeance": "Rejeté"
  },
  "dateDepot": "2018-12-14T01:00:00.000+01:00",
  "dateDistribution": "2018-12-18T01:00:00.000+01:00",
  "article99": "0",
  "loiReference": {
    "codeLoi": "1 id",
    "divisionCodeLoi": "52 bis"
  }
}