{
  "uid": "AMANR5L15PO59048B1490P0D1N607",
  "identifiant": {
    "legislature": "15",
    "numero": "607",
    "numRect": "0",
    "saisine": {
      "texteLegislatifRef": "PRJLANR5L15B1490",
      "numeroPartiePLF": "0",
      "organeExamen": "PO59048",
      "mentionSecondeDeliberation": "0"
    }
  },
  "numeroLong": "CF607",
  "etapeTexte": "Nouvelle Lecture",
  "triAmendement": "pmaaaaaaaaaaaaaaaaaaaaaaaaaaaaaaaaaaaaaaaaaaaaaaaaqo",
  "cardinaliteAmdtMultiples": "1",
  "etat": "Discuté",
  "signataires": {
    "auteur": {
      "typeAuteur": "Depute",
      "acteurRef": "PA608172",
      "groupePolitiqueRef": "PO758835"
    },
    "cosignatairesRefs": [
      "PA608741",
      "PA609332",
      "PA335532",
      "PA720988",
      "PA1008",
      "PA1198",
      "PA508",
      "PA1809",
      "PA337483",
      "PA267233",
      "PA642764",
      "PA610681",
      "PA1592",
      "PA340343",
      "PA332614",
      "PA607553",
      "PA342415",
      "PA340357",
      "PA719930",
      "PA608011",
      "PA643145",
      "PA333285",
      "PA609590",
      "PA608695",
      "PA335054",
      "PA605069",
      "PA333818",
      "PA608172",
      "PA429893"
    ],
    "texteAffichable": "Mme&#160;Pires Beaune,  M.&#160;Jean-Louis&#160;Bricout, Mme&#160;Rabault, M.&#160;Aviragnet, Mme&#160;Bareigts, Mme&#160;Battistel, Mme&#160;Bi&#233;mouret, M.&#160;Bouillon, M.&#160;Carvounas, M.&#160;Alain&#160;David, Mme&#160;Laurence&#160;Dumont, M.&#160;Faure, M.&#160;Garot, M.&#160;David&#160;Habib, M.&#160;Hutin, M.&#160;Juanico, Mme&#160;Karamanli, M.&#160;J&#233;r&#244;me&#160;Lambert, M.&#160;Letchimy, Mme&#160;Manin, Mme&#160;Pau-Langevin, M.&#160;Potier, M.&#160;Pueyo, M.&#160;Saulignac, Mme&#160;Tolmont, Mme&#160;Untermaier, Mme&#160;Vainqueur-Christophe, M.&#160;Vallaud et Mme&#160;Victory"
  },
  "pointeurFragmentTexte": {
    "division": {
      "titre": "Article 79",
      "articleDesignationCourte": "ART. 79",
      "type": "ARTICLE",
      "avantAApres": "A",
      "divisionRattachee": "ARTICLE 79",
      "urlDivisionTexteVise": "/15/textes/1490.asp#D_Article_79"
    },
    "alinea": {
      "numero": "85"
    }
  },
  "corps": {
    "dispositif": "<p>Supprimer les alin&#233;as 85 et 86.</p>",
    "exposeSommaire": "<p>Cet amendement du groupe Socialistes et apparent&#233;s supprime l'alin&#233;a qui pond&#232;re par un coefficient &#233;gal &#224; 1,1 le coefficient d'int&#233;gration fiscale des m&#233;tropoles pour le calcul de la dotation d'intercommunalit&#233;.</p><p>&#160;</p>"
  },
  "representations": [
    {
      "nom": "PDF",
      "typeMime": {
        "type": "application",
        "subType": "PDF"
      },
      "statutRepresentation": {
        "verbatim": true,
        "canonique": true,
        "officielle": true,
        "transcription": false,
        "enregistrement": false
      },
      "contenu": {
        "documentURI": "/15/amendements/1490/CION_FIN/CF607.pdf"
      }
    }
  ],
  "sort": {
    "dateSaisie": "2018-12-14T15:27:03.000+01:00",
    "sortEnSeance": "Tombé"
  },
  "dateDepot": "2018-12-13T01:00:00.000+01:00",
  "dateDistribution": "2018-12-14T01:00:00.000+01:00",
  "article99": "0",
  "loiReference": {}
}