{
  "uid": "AMANR5L15SEA717460BTC2063P0D1N122",
  "identifiant": {
    "legislature": "15",
    "numero": "122",
    "numRect": "0",
    "saisine": {
      "texteLegislatifRef": "PRJLANR5L15BTC2063",
      "numeroPartiePLF": "0",
      "organeExamen": "PO717460",
      "mentionSecondeDeliberation": "0"
    }
  },
  "numeroLong": "122",
  "etapeTexte": "1ère lecture (1ère assemblée saisie)",
  "triAmendement": "abiaaaaaaaaaaaaaaaaaaaaaaaaaaaaaaaaaaaaaaaaaaaaaaaguck",
  "cardinaliteAmdtMultiples": "1",
  "etat": "Discuté",
  "signataires": {
    "auteur": {
      "typeAuteur": "Depute",
      "acteurRef": "PA720278",
      "groupePolitiqueRef": "PO723569"
    },
    "cosignatairesRefs": [
      "PA720278"
    ],
    "texteAffichable": "M.&#160;Orphelin"
  },
  "pointeurFragmentTexte": {
    "division": {
      "titre": "Article PREMIER",
      "articleDesignationCourte": "ART. PREMIER",
      "type": "ARTICLE",
      "avantAApres": "A",
      "divisionRattachee": "ARTICLE PREMIER",
      "urlDivisionTexteVise": "/15/textes/2063.asp#D_Article_1er"
    },
    "alinea": {
      "avantAApres": "Apres",
      "numero": "9"
    }
  },
  "corps": {
    "dispositif": "<p>Apr&#232;s l&#8217;alin&#233;a&#160;9, ins&#233;rer les deux alin&#233;as suivants&#160;:</p><p style=\"text-align: justify;\">&#171;&#160;5&#176; Il est ajout&#233; un 10&#176; ainsi r&#233;dig&#233;&#160;:</p><p style=\"text-align: justify;\">&#171;&#160;10&#176; De mettre en place un plan de d&#233;veloppement de l&#8217;hydrog&#232;ne pour le d&#233;ploiement massif de solutions de stockage de l&#8217;&#233;nergie, de solutions z&#233;ro &#233;mission pour les transports et d&#8217;une fili&#232;re industrielle d&#233;carbon&#233;e.&#160;&#187;</p>",
    "exposeSommaire": "<p>Dans le contexte de la transition &#233;cologique, l&#8217;hydrog&#232;ne est un outil pr&#233;cieux. Il permet de stocker l&#8217;&#233;lectricit&#233;, alimenter des voitures, recycler le CO2, r&#233;duire les pollutions. Le plan de d&#233;ploiement de l&#8217;hydrog&#232;ne pr&#233;sent&#233; par Nicolas Hulot en 2018 pr&#233;voyait, d&#232;s 2019, 100 M&#8364;/an pendant 5 ans, pour le d&#233;ploiement de l&#8217;hydrog&#232;ne dans l&#8217;industrie, la mobilit&#233; (5 000 v&#233;hicules utilitaires l&#233;gers et 200 v&#233;hicules lourds &#224; l&#8217;horizon 2023) et l&#8217;&#233;nergie. Les efforts r&#233;glementaires et budg&#233;taires &#224; la tra&#238;ne n&#8217;ont pas permis &#224; la France de conserver un leadership sur un march&#233; mondial tr&#232;s concurrentiel (Japon, &#201;tats-Unis, Allemagne et Cor&#233;e du Sud sont en avances).</p><p style=\"text-align: justify;\">Il est donc n&#233;cessaire de mettre en place un v&#233;ritable plan hydrog&#232;ne respectant les ambitions initiales. Pour la 1<sup>&#232;re</sup> ann&#233;e, la r&#233;alisation du plan aura du mal &#224; d&#233;passer 50 M&#8364; sur les 100 M&#8364; vis&#233;s.</p>"
  },
  "representations": [
    {
      "nom": "PDF",
      "typeMime": {
        "type": "application",
        "subType": "PDF"
      },
      "statutRepresentation": {
        "verbatim": true,
        "canonique": true,
        "officielle": true,
        "transcription": false,
        "enregistrement": false
      },
      "contenu": {
        "documentURI": "/15/amendements/2063/AN/122.pdf"
      }
    }
  ],
  "seanceDiscussion": "RUANR5L15S2019IDS21735",
  "sort": {
    "dateSaisie": "2019-06-27T12:07:13.000+02:00",
    "sortEnSeance": "Non soutenu"
  },
  "dateDepot": "2019-06-21T02:00:00.000+02:00",
  "dateDistribution": "2019-06-26T02:00:00.000+02:00",
  "article99": "0",
  "loiReference": {}
}