{
  "uid": "AMANR5L15PO59051B0911P0D1N404",
  "identifiant": {
    "legislature": "15",
    "numero": "404",
    "numRect": "0",
    "saisine": {
      "texteLegislatifRef": "PRJLANR5L15B0911",
      "numeroPartiePLF": "0",
      "organeExamen": "PO59051",
      "mentionSecondeDeliberation": "0"
    }
  },
  "numeroLong": "CL404",
  "etapeTexte": "1ère lecture (1ère assemblée saisie)",
  "triAmendement": "adzu",
  "cardinaliteAmdtMultiples": "1",
  "etat": "Discuté",
  "signataires": {
    "auteur": {
      "typeAuteur": "Depute",
      "acteurRef": "PA605518",
      "groupePolitiqueRef": "PO730964"
    },
    "cosignatairesRefs": [
      "PA605518"
    ],
    "texteAffichable": "M.&#160;Fran&#231;ois-Michel&#160;Lambert"
  },
  "pointeurFragmentTexte": {
    "division": {
      "titre": "Article 2",
      "articleDesignationCourte": "ART. 2",
      "type": "ARTICLE",
      "avantAApres": "A",
      "divisionRattachee": "ARTICLE 2",
      "urlDivisionTexteVise": "/15/textes/0911.asp#D_Article_2"
    }
  },
  "corps": {
    "dispositif": "<p>Supprimer cet article.</p>",
    "exposeSommaire": "<p>Amendement de cons&#233;quence de l'amendement CL401.</p><p>I. Le pr&#233;c&#233;dent amendement pr&#233;voit d&#8217;inscrire une r&#233;f&#233;rence au climat au cinqui&#232;me consid&#233;rant introductif de la Charte de l&#8217;environnement. Celui-ci serait alors r&#233;dig&#233; de la mani&#232;re suivante&#160;:</p><p>&#171;&#160;Que la diversit&#233; biologique,&#160;le climat, l&#8217;&#233;panouissement de la personne et le progr&#232;s des soci&#233;t&#233;s humaines sont affect&#233;s par certains modes de consommation ou de production et par l&#8217;exploitation excessive des ressources naturelles&#160;&#187;.</p><p>Cette r&#233;daction met notamment en relief l&#8217;interaction entre la question du climat et celle de la diversit&#233; biologique qui sont &#233;troitement li&#233;es. Elle souligne &#233;galement le lien entre &#233;cologie et &#233;conomie en rappelant que nos modes de consommation et de production ne sont pas toujours durables</p><p>II. Le pr&#233;c&#233;dent amendement pr&#233;voit d&#8217;inscrire l&#8217;objectif de lutte contre le changement climatique &#224; l&#8217;article&#160;6 de la Charte de l&#8217;environnement, lequel serait alors ainsi r&#233;dig&#233;&#160;:</p><p>&#171;&#160;Les politiques publiques doivent promouvoir un d&#233;veloppement durable. A cet effet, elles concilient la protection et la mise en valeur de l&#8217;environnement, le d&#233;veloppement &#233;conomique et le progr&#232;s social. Elles sont conformes &#224; l&#8217;objectif de lutte contre le changement climatique.&#160;&#187;</p><p>Cette r&#233;daction assure une parfaite sym&#233;trie entre la Charte de l&#8217;environnement et l&#8217;article L.&#160;110&#8209;1 du code de l&#8217;environnement qui comporte d&#233;j&#224; une mention de l&#8217;objectif de lutte contre le changement climatique. Il est tr&#232;s important de conserver cette sym&#233;trie pour conserver le lien entre l&#8217;objectif de lutte contre le changement climatique et l&#8217;objectif de d&#233;veloppement durable et donc l&#8217;environnement pris au sens large. Cela pour pr&#233;venir le risque d&#8217;une interpr&#233;tation de cet objectif de lutte contre le changement qui serait r&#233;duite &#224; la seule question des &#233;missions de gaz &#224; effet de serre.&#160;</p><p>Une approche &#171;&#160;carbo-centr&#233;e&#160;&#187; de l&#8217;objectif de lutte contre le changement climatique aurait pour effet ind&#233;sirable d&#8217;encourager certaines activit&#233;s qui, bien que sobres en carbone peuvent s&#8217;av&#233;rer tr&#232;s peu &#233;cologiques par ailleurs. A titre d&#8217;exemple, la production d&#8217;&#233;lectricit&#233; nucl&#233;aire produit des d&#233;chets &#224; longue dur&#233;e m&#234;me si ses partisans soulignent qu&#8217;elle serait peu &#233;mettre de dioxyde de carbone.</p>"
  },
  "representations": [
    {
      "nom": "PDF",
      "typeMime": {
        "type": "application",
        "subType": "PDF"
      },
      "statutRepresentation": {
        "verbatim": true,
        "canonique": true,
        "officielle": true,
        "transcription": false,
        "enregistrement": false
      },
      "contenu": {
        "documentURI": "/15/amendements/0911/CION_LOIS/CL404.pdf"
      }
    }
  ],
  "sort": {
    "dateSaisie": "2018-06-28T22:22:14.000+02:00",
    "sortEnSeance": "Non soutenu"
  },
  "dateDepot": "2018-06-20T02:00:00.000+02:00",
  "dateDistribution": "2018-06-25T02:00:00.000+02:00",
  "article99": "0",
  "loiReference": {}
}