{
  "uid": "AMANR5L15SEA717460BTC1629P0D1N1090",
  "identifiant": {
    "legislature": "15",
    "numero": "1090",
    "numRect": "0",
    "saisine": {
      "texteLegislatifRef": "PRJLANR5L15BTC1629",
      "numeroPartiePLF": "0",
      "organeExamen": "PO717460",
      "mentionSecondeDeliberation": "0"
    }
  },
  "numeroLong": "1090",
  "etapeTexte": "1ère lecture (1ère assemblée saisie)",
  "triAmendement": "efaaaaaaaaaaaaaaaaaaaaaaaaaaaaaaaaaaaaaaaaaaaaaaaanm",
  "cardinaliteAmdtMultiples": "1",
  "etat": "Retiré",
  "signataires": {
    "auteur": {
      "typeAuteur": "Depute",
      "acteurRef": "PA718902",
      "groupePolitiqueRef": "PO730964"
    },
    "cosignatairesRefs": [
      "PA719456",
      "PA720576",
      "PA721844",
      "PA722102",
      "PA719480",
      "PA606202",
      "PA718962",
      "PA720054",
      "PA720190",
      "PA720552",
      "PA721876",
      "PA702054",
      "PA719632",
      "PA722000",
      "PA720622",
      "PA718944",
      "PA718876",
      "PA721278",
      "PA722292",
      "PA718902",
      "PA719032",
      "PA718744",
      "PA722366",
      "PA719326",
      "PA606639",
      "PA720814",
      "PA343493",
      "PA720362",
      "PA720170",
      "PA719960"
    ],
    "texteAffichable": "M.&#160;C&#233;dric&#160;Roussel,  M.&#160;Anato, Mme&#160;Bagarry, M.&#160;Belhaddad, M.&#160;Bois, M.&#160;Bouyx, M.&#160;Besson-Moreau, Mme&#160;Bureau-Bonnard, M.&#160;Buchou, M.&#160;Cazenove, M.&#160;Claireaux, Mme&#160;Fran&#231;oise&#160;Dumas, M.&#160;Fugit, M.&#160;Gaillard, Mme&#160;Grandjean, Mme&#160;Gipson, Mme&#160;Faure-Muntian, M.&#160;Haury, Mme&#160;Panonacle, Mme&#160;Piron, M.&#160;Morenas, Mme&#160;Racon-Bouzon, Mme&#160;Rauch, M.&#160;Rouillard, M.&#160;Rudigoz, M.&#160;Sorre, M.&#160;Vignal, M.&#160;Zulesi, Mme&#160;Vidal et Mme&#160;M&#246;rch"
  },
  "pointeurFragmentTexte": {
    "division": {
      "titre": "Article 9",
      "articleDesignationCourte": "ART. 9",
      "type": "ARTICLE",
      "avantAApres": "A",
      "divisionRattachee": "ARTICLE 9",
      "urlDivisionTexteVise": "/15/textes/1629.asp#D_Article_9"
    },
    "alinea": {
      "numero": "11"
    }
  },
  "corps": {
    "dispositif": "<p style=\"text-align: justify;\">Apr&#232;s les mots &#171; et 2&#176; &#187;, ins&#233;rer &#171; et 4&#176; &#187;</p>",
    "exposeSommaire": "<p style=\"text-align: justify;\">Cet amendement vise &#224; garantir une &#233;gale parit&#233; au coll&#232;ge comprenant deux repr&#233;sentants de parents d&#8217;&#233;l&#232;ves, au m&#234;me titre que celle requise en ce qui concerne les personnalit&#233;s vis&#233;es au 1&#176; et au 2&#176; du pr&#233;sent article.</p>"
  },
  "representations": [
    {
      "nom": "PDF",
      "typeMime": {
        "type": "application",
        "subType": "PDF"
      },
      "statutRepresentation": {
        "verbatim": true,
        "canonique": true,
        "officielle": true,
        "transcription": false,
        "enregistrement": false
      },
      "contenu": {
        "documentURI": "/15/amendements/1629/AN/1090.pdf"
      }
    }
  ],
  "dateDepot": "2019-02-07T01:00:00.000+01:00",
  "dateDistribution": "2019-02-07T01:00:00.000+01:00",
  "article99": "0",
  "loiReference": {}
}