{
  "uid": "AMANR5L15PO419865B1831P0D1N2336",
  "identifiant": {
    "legislature": "15",
    "numero": "2336",
    "numRect": "0",
    "saisine": {
      "texteLegislatifRef": "PRJLANR5L15B1831",
      "numeroPartiePLF": "0",
      "organeExamen": "PO419865",
      "mentionSecondeDeliberation": "0"
    }
  },
  "numeroLong": "CD2336",
  "etapeTexte": "1ère lecture (2ème assemblée saisie)",
  "triAmendement": "btaaaaaaaaaaaaaaaaaaaaaaaaaaaaaaaaaaaaaaaaaaaaaaaaug",
  "cardinaliteAmdtMultiples": "1",
  "etat": "Discuté",
  "signataires": {
    "auteur": {
      "typeAuteur": "Depute",
      "acteurRef": "PA267204",
      "groupePolitiqueRef": "PO730934"
    },
    "cosignatairesRefs": [
      "PA267735",
      "PA642847",
      "PA332523",
      "PA1012",
      "PA267901",
      "PA267450",
      "PA721046",
      "PA606712",
      "PA267204",
      "PA767",
      "PA608416",
      "PA266776",
      "PA719318",
      "PA267260",
      "PA609245",
      "PA720210",
      "PA721678",
      "PA721410",
      "PA340853",
      "PA608016",
      "PA2155",
      "PA605991",
      "PA709315",
      "PA267429",
      "PA605036",
      "PA346218",
      "PA643134"
    ],
    "texteAffichable": "M.&#160;Sermier,  Mme&#160;Lacroute, M.&#160;Kamardine, M.&#160;Cattin, Mme&#160;Bonnivard, M.&#160;Hetzel, M.&#160;Reda, M.&#160;de la Verpilli&#232;re, M.&#160;Leclerc, M.&#160;Cinieri, Mme&#160;Bassire, M.&#160;Masson, M.&#160;R&#233;mi&#160;Delatte, Mme&#160;Louwagie, Mme&#160;Beauvais, M.&#160;Lurton, M.&#160;de Ganay, M.&#160;Bazin, Mme&#160;Anthoine, M.&#160;Reiss, Mme&#160;Valentin, M.&#160;Menuel, Mme&#160;Genevard, M.&#160;Abad, Mme&#160;Poletti, Mme&#160;Dalloz et M.&#160;Viala"
  },
  "pointeurFragmentTexte": {
    "division": {
      "titre": "Article 15",
      "articleDesignationCourte": "ART. 15",
      "type": "ARTICLE",
      "avantAApres": "A",
      "divisionRattachee": "ARTICLE 15",
      "urlDivisionTexteVise": "/15/textes/1831.asp#D_Article_15"
    },
    "alinea": {
      "numero": "18"
    }
  },
  "corps": {
    "dispositif": "<p>Apr&#232;s le mot&#160;:</p><p style=\"text-align: justify;\">&#171;&#160;covoiturage&#160;&#187;,</p><p style=\"text-align: justify;\">supprimer la fin de l&#8217;alin&#233;a&#160;18.</p>",
    "exposeSommaire": "<p>Cet amendement vise &#224; exclure les v&#233;hicules &#224; faibles &#233;missions des facilit&#233;s accord&#233;es aux v&#233;hicules b&#233;n&#233;ficiant du statut d&#8217;autopartage ou de covoiturage. En effet, ce type de service vise un usage partag&#233; des v&#233;hicules individuels pour favoriser une mobilit&#233; plus durable. Les facilit&#233;s accord&#233;es &#224; ces services partag&#233;s participent &#224; la lutte contre l&#8217;autosolisme.</p><p>Se pose &#233;galement la question de l&#8217;identification de ce type de v&#233;hicules au sein du parc routier.</p>"
  },
  "representations": [
    {
      "nom": "PDF",
      "typeMime": {
        "type": "application",
        "subType": "PDF"
      },
      "statutRepresentation": {
        "verbatim": true,
        "canonique": true,
        "officielle": true,
        "transcription": false,
        "enregistrement": false
      },
      "contenu": {
        "documentURI": "/15/amendements/1831/CION-DVP/CD2336.pdf"
      }
    }
  ],
  "sort": {
    "dateSaisie": "2019-05-17T00:32:53.000+02:00",
    "sortEnSeance": "Rejeté"
  },
  "dateDepot": "2019-05-09T02:00:00.000+02:00",
  "dateDistribution": "2019-05-14T02:00:00.000+02:00",
  "article99": "0",
  "loiReference": {}
}