{
  "uid": "AMANR5L15SEA717460BTC1019P0D1N1601",
  "identifiant": {
    "legislature": "15",
    "numero": "1601",
    "numRect": "0",
    "saisine": {
      "texteLegislatifRef": "PRJLANR5L15BTC1019",
      "numeroPartiePLF": "0",
      "organeExamen": "PO717460",
      "mentionSecondeDeliberation": "0"
    }
  },
  "numeroLong": "1601",
  "etapeTexte": "1ère lecture (1ère assemblée saisie)",
  "triAmendement": "b",
  "cardinaliteAmdtMultiples": "1",
  "etat": "Retiré",
  "signataires": {
    "auteur": {
      "typeAuteur": "Depute",
      "acteurRef": "PA719350",
      "groupePolitiqueRef": "PO730964"
    },
    "cosignatairesRefs": [
      "PA719540",
      "PA720854",
      "PA720500",
      "PA720576",
      "PA719364",
      "PA719350",
      "PA643175"
    ],
    "texteAffichable": "Mme&#160;Tamarelle-Verhaeghe,  M.&#160;Bois, Mme&#160;Dupont, Mme&#160;O&apos;Petit, M.&#160;Test&#233;, Mme&#160;Val&#233;rie&#160;Petit et Mme&#160;Toutut-Picard"
  },
  "pointeurFragmentTexte": {
    "division": {
      "titre": "Article 8 bis",
      "articleDesignationCourte": "APRÈS ART. 8 BIS",
      "type": "ARTICLE",
      "avantAApres": "Apres",
      "divisionRattachee": "APRÈS L'ARTICLE 8 BIS, insérer l'article suivant:",
      "articleAdditionnel": "1",
      "urlDivisionTexteVise": "/15/textes/1019.asp#D_Article_8_bis"
    }
  },
  "corps": {
    "dispositif": "<p style=\"text-align: justify;\">Le Gouvernement remet au Parlement, avant le 31 d&#233;cembre 2020, un rapport sur la situation du pr&#233;apprentissage et des dispositifs &#224; destination des &#233;l&#232;ves de coll&#232;ge en d&#233;crochage scolaire.</p><p style=\"text-align: justify;\">Le rapport examine la coh&#233;rence des dispositifs existant, les possibilit&#233;s concr&#232;tes de leur &#233;volution et les impacts que celle-ci aurait.</p>",
    "exposeSommaire": "<p style=\"text-align: justify;\">Le pr&#233;apprentissage vise &#224; faire d&#233;couvrir les m&#233;tiers et les formations, la voie professionnelle et/ou &#224; pr&#233;parer &#224; l&#8217;entr&#233;e en apprentissage. Des dispositifs se sont d&#233;velopp&#233;s voire succ&#233;d&#233;s ces derni&#232;res ann&#233;es (DIMA, apprentissage junior, parcours de d&#233;couverte des m&#233;tiers et des formations, option de d&#233;couverte professionnelle 3 heures et 6 heures (DP3 et DP6), 3<sup>&#232;me</sup> pr&#233;pa-pro etc.). Le dispositif d&#8217;initiation aux m&#233;tiers de l&#8217;alternance (DIMA), en place depuis plusieurs ann&#233;es, vise &#224; pr&#233;parer le jeune &#224; la p&#233;dagogie de l&#8217;alternance, l&#8217;accompagner dans son projet professionnel et lui redonner confiance dans son avenir.</p><p style=\"text-align: justify;\">Comme le souligne le rapport de Sylvie Brunet, remis le 31 janvier 2018, ce dernier dispositif demeure tr&#232;s marginal, souffre d&#8217;une attractivit&#233; tr&#232;s limit&#233;e et ne d&#233;bouche pas n&#233;cessairement sur une orientation vers l&#8217;apprentissage. C&#8217;est le m&#234;me constat qu&#8217;avaient dress&#233; l&#8217;IGA, l&#8217;IGAS, l&#8217;IGEN et l&#8217;IGAENR dans le rapport <i>Les freins non financiers au d&#233;veloppement de l&#8217;apprentissage</i>. Le DIMA est ainsi remplac&#233;, dans l&#8217;&#233;tat actuel du projet de loi, par des classes &#171;&#160;pr&#233;pa m&#233;tiers&#160;&#187; en derni&#232;re ann&#233;e de coll&#232;ge. Ce nouveau dispositif, pour &#234;tre p&#233;renne et d&#233;velopp&#233;, doit &#234;tre &#233;valu&#233;.</p><p style=\"text-align: justify;\">Outre les dispositifs de pr&#233;paration &#224; l&#8217;apprentissage, d&#8217;autres dispositifs tourn&#233;s sp&#233;cifiquement vers les jeunes en d&#233;crochage scolaire se d&#233;veloppent depuis plusieurs ann&#233;es avec notamment le r&#233;seau des &#201;coles de la deuxi&#232;me chance (E2C) ou l&#8217;&#201;tablissement public d&#8217;insertion de la D&#233;fense (EPIDE).</p><p style=\"text-align: justify;\">Enfin, comme le soulignent Marc Ferracci et Pierre Cahuc dans <i>L&#8217;apprentissage, donner la priorit&#233; aux moins qualifi&#233;s</i>, afin de d&#233;velopper ces dispositifs et d&#8217;en assurer l&#8217;efficacit&#233;, il convient d&#8217;en &#233;valuer les r&#233;sultats et la coh&#233;rence. C&#8217;est ce que propose le pr&#233;sent amendement.</p><p style=\"text-align: justify;\">&#160;</p><p style=\"text-align: justify;\">&#160;</p>"
  },
  "representations": [
    {
      "nom": "PDF",
      "typeMime": {
        "type": "application",
        "subType": "PDF"
      },
      "statutRepresentation": {
        "verbatim": true,
        "canonique": true,
        "officielle": true,
        "transcription": false,
        "enregistrement": false
      },
      "contenu": {
        "documentURI": "/15/amendements/1019/AN/1601.pdf"
      }
    }
  ],
  "dateDepot": "2018-06-07T02:00:00.000+02:00",
  "dateDistribution": "2018-06-11T02:00:00.000+02:00",
  "article99": "0",
  "loiReference": {}
}