{
  "uid": "AMANR5L15PO419865B2274P0D1N211",
  "identifiant": {
    "legislature": "15",
    "numero": "211",
    "numRect": "0",
    "saisine": {
      "texteLegislatifRef": "PRJLANR5L15B2274",
      "numeroPartiePLF": "0",
      "organeExamen": "PO419865",
      "mentionSecondeDeliberation": "0"
    }
  },
  "numeroLong": "CD211",
  "etapeTexte": "1ère lecture (2ème assemblée saisie)",
  "triAmendement": "cfaaaaaaaaaaaaaaaaaaaaaaaaaaaaaaaaaaaaaaaaaaaaaaaai",
  "cardinaliteAmdtMultiples": "1",
  "etat": "En traitement",
  "signataires": {
    "auteur": {
      "typeAuteur": "Depute",
      "acteurRef": "PA605518",
      "groupePolitiqueRef": "PO759900"
    },
    "cosignatairesRefs": [
      "PA720038",
      "PA405480",
      "PA605694",
      "PA719138",
      "PA719286",
      "PA755549",
      "PA336175",
      "PA331582",
      "PA607619",
      "PA608292",
      "PA333421",
      "PA942",
      "PA720278",
      "PA267042",
      "PA719146",
      "PA336439",
      "PA605518",
      "PA721194",
      "PA720996"
    ],
    "texteAffichable": "M.&#160;Fran&#231;ois-Michel&#160;Lambert,  M.&#160;Acquaviva, M.&#160;Brial, M.&#160;Castellani, M.&#160;Cl&#233;ment, M.&#160;Colombani, M.&#160;Charles&#160;de Courson, Mme&#160;Dubi&#233;, Mme&#160;Fr&#233;d&#233;rique&#160;Dumas, M.&#160;El Guerrab, M.&#160;Falorni, M.&#160;Favennec Becot, Mme&#160;Josso, M.&#160;Molac, M.&#160;Orphelin, M.&#160;Pancher, Mme&#160;Pinel, M.&#160;Pupponi et M.&#160;Philippe&#160;Vigier"
  },
  "pointeurFragmentTexte": {
    "division": {
      "titre": "Article 5 bis A",
      "articleDesignationCourte": "ART. 5 BIS A",
      "type": "ARTICLE",
      "avantAApres": "A",
      "divisionRattachee": "ARTICLE 5 BIS A",
      "urlDivisionTexteVise": "/15/textes/2274.asp#D_Article_5_bis_A"
    },
    "alinea": {
      "numero": "2"
    }
  },
  "corps": {
    "dispositif": "<p style=\"text-align: justify;\">&#192; l&#8217;alin&#233;a&#160;2, substituer au mot&#160;:</p><p style=\"text-align: justify;\">&#171;&#160;filiale&#160;&#187; </p><p style=\"text-align: justify;\">le mot&#160;:</p><p style=\"text-align: justify;\">&#171;&#160;fili&#232;re&#160;&#187;.</p>",
    "exposeSommaire": "<p>Amendement r&#233;dactionnel</p>",
    "cartoucheDelaiDepotDepasse": "Sous réserve de son traitement par les services de l'Assemblée nationale et de sa recevabilité"
  },
  "representations": [
    {
      "nom": "PDF",
      "typeMime": {
        "type": "application",
        "subType": "PDF"
      },
      "statutRepresentation": {
        "verbatim": true,
        "canonique": true,
        "officielle": true,
        "transcription": false,
        "enregistrement": false
      },
      "contenu": {
        "documentURI": "/15/amendements/2274/CION-DVP/CD211.pdf"
      }
    }
  ],
  "dateDepot": "2019-11-15T01:00:00.000+01:00",
  "article99": "0",
  "loiReference": {}
}