{
  "uid": "AMANR5L15SEA717460BTC0857P0D1N133",
  "identifiant": {
    "legislature": "15",
    "numero": "133",
    "numRect": "0",
    "saisine": {
      "texteLegislatifRef": "PRJLANR5L15BTC0857",
      "numeroPartiePLF": "0",
      "organeExamen": "PO717460",
      "mentionSecondeDeliberation": "0"
    }
  },
  "numeroLong": "133",
  "etapeTexte": "1ère lecture (1ère assemblée saisie)",
  "triAmendement": "q",
  "cardinaliteAmdtMultiples": "1",
  "etat": "Discuté",
  "signataires": {
    "auteur": {
      "typeAuteur": "Depute",
      "acteurRef": "PA720684",
      "groupePolitiqueRef": "PO730934"
    },
    "cosignatairesRefs": [
      "PA720684",
      "PA334654",
      "PA718884",
      "PA642847",
      "PA720210",
      "PA643103",
      "PA720386",
      "PA608416",
      "PA721816",
      "PA720100",
      "PA330684",
      "PA267440",
      "PA346218",
      "PA609726",
      "PA267260",
      "PA721314",
      "PA721678",
      "PA1874",
      "PA722390",
      "PA267200",
      "PA334843",
      "PA267901"
    ],
    "texteAffichable": "M.&#160;Pierre-Henri&#160;Dumont,  M.&#160;Huyghe, M.&#160;Diard, M.&#160;Di Filippo, M.&#160;Bazin, Mme&#160;Bazin-Malgras, M.&#160;Le Fur, M.&#160;Pradi&#233;, M.&#160;Aubert, M.&#160;Boucard, Mme&#160;Beauvais, M.&#160;Hetzel, M.&#160;Masson, M.&#160;Kamardine, M.&#160;Reda, Mme&#160;Poletti, Mme&#160;Val&#233;rie&#160;Boyer, M.&#160;Straumann, M.&#160;Ferrara, Mme&#160;Corneloup, M.&#160;Verch&#232;re et M.&#160;Schellenberger"
  },
  "pointeurFragmentTexte": {
    "division": {
      "titre": "Article 19 bis",
      "articleDesignationCourte": "APRÈS ART. 19 BIS",
      "type": "ARTICLE",
      "avantAApres": "Apres",
      "divisionRattachee": "APRÈS L'ARTICLE 19 BIS, insérer l'article suivant:",
      "articleAdditionnel": "1",
      "urlDivisionTexteVise": "/15/textes/0857.asp#D_Article_19_bis"
    }
  },
  "corps": {
    "dispositif": "<p style=\"text-align: justify;\">L&#8217;&#233;tranger en situation irr&#233;guli&#232;re qui bloque la circulation ou traverse une voie d&#8217;autoroute est plac&#233; automatiquement en centre de r&#233;tention administrative.</p>",
    "exposeSommaire": "<p style=\"text-align: justify;\">Le fait de traverser une voie d&#8217;autoroute ou de bloquer la circulation est de nature &#224; mettre en danger la vie d&#8217;autrui. Il s&#8217;agit l&#224; d&#8217;une pratique courante de la part des migrants dans la r&#233;gion de Calais et du Calaisis.</p><p style=\"text-align: justify;\">R&#233;guli&#232;rement, des barrages sont &#233;rig&#233;s par les migrants sur l&#8217;A16 et la rocade portuaire de Calais, engendrant de nombreux drames. L&#8217;un de ces barrages a co&#251;t&#233; la vie &#224; un chauffeur routier il y a quelques mois. Il est donc imp&#233;ratif d&#8217;y mettre fin en pla&#231;ant les auteurs de tels faits de fa&#231;on syst&#233;matique en centre de r&#233;tention administrative.</p>"
  },
  "representations": [
    {
      "nom": "PDF",
      "typeMime": {
        "type": "application",
        "subType": "PDF"
      },
      "statutRepresentation": {
        "verbatim": true,
        "canonique": true,
        "officielle": true,
        "transcription": false,
        "enregistrement": false
      },
      "contenu": {
        "documentURI": "/15/amendements/0857/AN/133.pdf"
      }
    }
  ],
  "seanceDiscussion": "RUANR5L15S2018IDS21078",
  "sort": {
    "dateSaisie": "2018-04-22T11:11:49.000+02:00",
    "sortEnSeance": "Rejeté"
  },
  "dateDepot": "2018-04-11T02:00:00.000+02:00",
  "dateDistribution": "2018-04-16T02:00:00.000+02:00",
  "article99": "0",
  "loiReference": {}
}