{
  "uid": "AMANR5L15SEA717460B0911P0D1N1108",
  "identifiant": {
    "legislature": "15",
    "numero": "1108",
    "numRect": "0",
    "saisine": {
      "texteLegislatifRef": "PRJLANR5L15B0911",
      "numeroPartiePLF": "0",
      "organeExamen": "PO717460",
      "mentionSecondeDeliberation": "0"
    }
  },
  "numeroLong": "1108",
  "etapeTexte": "1ère lecture (1ère assemblée saisie)",
  "triAmendement": "abzzhyzz",
  "cardinaliteAmdtMultiples": "1",
  "etat": "Discuté",
  "signataires": {
    "auteur": {
      "typeAuteur": "Depute",
      "acteurRef": "PA720846",
      "groupePolitiqueRef": "PO730958"
    },
    "cosignatairesRefs": [
      "PA588884",
      "PA720430",
      "PA721062",
      "PA718860",
      "PA721226",
      "PA720846",
      "PA721960",
      "PA720286",
      "PA718868",
      "PA721202",
      "PA721210",
      "PA2150",
      "PA720892",
      "PA720422",
      "PA719676",
      "PA722142",
      "PA719578"
    ],
    "texteAffichable": "M.&#160;Lachaud,  Mme&#160;Autain, M.&#160;Bernalicis, M.&#160;Coquerel, M.&#160;Corbi&#232;re, Mme&#160;Fiat, M.&#160;Larive, M.&#160;M&#233;lenchon, Mme&#160;Obono, Mme&#160;Panot, M.&#160;Prud&apos;homme, M.&#160;Quatennens, M.&#160;Ratenon, Mme&#160;Ressiguier, Mme&#160;Rubin, M.&#160;Ruffin et Mme&#160;Taurine"
  },
  "pointeurFragmentTexte": {
    "division": {
      "titre": "Article PREMIER",
      "articleDesignationCourte": "AVANT ART. PREMIER",
      "type": "ARTICLE",
      "avantAApres": "Avant",
      "divisionRattachee": "AVANT L'ARTICLE PREMIER, insérer l'article suivant:",
      "articleAdditionnel": "1",
      "urlDivisionTexteVise": "/15/textes/0911.asp#D_Article_1er"
    }
  },
  "corps": {
    "dispositif": "<p style=\"text-align: justify;\">Apr&#232;s le vingti&#232;me alin&#233;a de l&#8217;article&#160;2 de la loi constitutionnelle n&#176;&#160;2005&#8209;205 du&#160;1<sup>er</sup> mars 2005 relative &#224; la Charte de l&#8217;environnement, il est ins&#233;r&#233; un alin&#233;a ainsi r&#233;dig&#233;&#160;:</p><p style=\"text-align: justify;\">&#171;&#160;<i>Art.&#160;9-1</i>.&#160;&#8211;&#160;L&#8217;eau et l&#8217;&#233;nergie sont des ressources indispensables &#224; une vie digne. Nul ne peut en &#234;tre priv&#233;. Leur tarification est progressive. Les quantit&#233;s minimales indispensables sont gratuites et garanties par les autorit&#233;s publiques aux personnes physiques. Les m&#233;susages de ces ressources sont sanctionn&#233;s.&#160;&#187;</p>",
    "exposeSommaire": "<p style=\"text-align: justify;\">Consid&#233;rant &#224; juste titre &#171;&#160;que l&#8217;environnement est le patrimoine commun des &#234;tres humains&#160;&#187;, &#224; l&#8217;heure de l&#8217;urgence &#233;cologique, rien ne nous appara&#238;t plus imp&#233;ratif que l&#8217;application concr&#232;te des articles de la Charte de l&#8217;environnement et notamment de l&#8217;article premier&#160;: &#171;&#160;Chacun a le droit de vivre dans un environnement &#233;quilibr&#233; et respectueux de la sant&#233;&#160;&#187;. L&#8217;eau, au premier chef, constitue une partie indispensable de ce patrimoine commun de l&#8217;humanit&#233;, et doit donc &#234;tre prot&#233;g&#233;e comme ressource, et accessible inconditionnellement &#224; toute personne. Deuxi&#232;mement, l&#8217;&#233;nergie, comme moyen de se chauffer, de s&#8217;&#233;clairer et de se nourrir participe &#233;galement de l&#8217;assouvissement des besoins fondamentaux. Une affirmation d&#8217;une telle importance doit &#234;tre inscrite explicitement dans un texte &#224; valeur constitutionnelle.</p><p style=\"text-align: justify;\">Cet amendement permet d&#8217;instaurer une tarification progressive sur l&#8217;eau et la consommation d&#8217;&#233;nergie en incluant la gratuit&#233; des quantit&#233;s indispensables &#224; une vie digne et en permettant de p&#233;naliser les m&#233;susages et les gaspillages.</p>"
  },
  "representations": [
    {
      "nom": "PDF",
      "typeMime": {
        "type": "application",
        "subType": "PDF"
      },
      "statutRepresentation": {
        "verbatim": true,
        "canonique": true,
        "officielle": true,
        "transcription": false,
        "enregistrement": false
      },
      "contenu": {
        "documentURI": "/15/amendements/0911/AN/1108.pdf"
      }
    }
  ],
  "seanceDiscussion": "RUANR5L15S2018IDS21161",
  "sort": {
    "dateSaisie": "2018-07-12T00:28:54.000+02:00",
    "sortEnSeance": "Rejeté"
  },
  "dateDepot": "2018-07-05T02:00:00.000+02:00",
  "dateDistribution": "2018-07-07T02:00:00.000+02:00",
  "article99": "0",
  "loiReference": {
    "codeLoi": "loi constitutionnelle 2005-205",
    "divisionCodeLoi": "2"
  }
}