{
  "uid": "AMANR5L15SEA717460BTC2124P0D1N8",
  "identifiant": {
    "legislature": "15",
    "numero": "8",
    "numRect": "0",
    "saisine": {
      "texteLegislatifRef": "PRJLANR5L15BTC2124",
      "numeroPartiePLF": "0",
      "organeExamen": "PO717460",
      "mentionSecondeDeliberation": "0"
    }
  },
  "numeroLong": "8",
  "etapeTexte": "1ère lecture (1ère assemblée saisie)",
  "triAmendement": "eaaaaaaaaaaaaaaaaaaaaaaaaaaaaaaaaaaaaaaaaaaaaaaaaas",
  "cardinaliteAmdtMultiples": "1",
  "etat": "Irrecevable",
  "signataires": {
    "auteur": {
      "typeAuteur": "Depute",
      "acteurRef": "PA720684",
      "groupePolitiqueRef": "PO730934"
    },
    "cosignatairesRefs": [
      "PA266797",
      "PA608416",
      "PA720684",
      "PA718884",
      "PA267429",
      "PA346054",
      "PA606712",
      "PA330684",
      "PA340853",
      "PA722390",
      "PA643134",
      "PA2377",
      "PA718850",
      "PA767",
      "PA719318",
      "PA642847",
      "PA609245",
      "PA721816",
      "PA346218",
      "PA330909",
      "PA267735",
      "PA345722",
      "PA643089",
      "PA720586"
    ],
    "texteAffichable": "M.&#160;Pierre-Henri&#160;Dumont,  M.&#160;Bazin, Mme&#160;Bazin-Malgras, Mme&#160;Anthoine, Mme&#160;Le Grip, M.&#160;de Ganay, M.&#160;Lurton, M.&#160;Thi&#233;riot, M.&#160;Cordier, M.&#160;Cattin, M.&#160;Emmanuel&#160;Maquet, Mme&#160;Corneloup, M.&#160;Vatin, M.&#160;Cinieri, M.&#160;Hetzel, M.&#160;Leclerc, M.&#160;Descoeur, M.&#160;Masson, M.&#160;Perrut, M.&#160;Boucard, M.&#160;Gosselin, Mme&#160;Val&#233;rie&#160;Boyer, Mme&#160;Lacroute et Mme&#160;Valentin"
  },
  "pointeurFragmentTexte": {
    "division": {
      "titre": "Article PREMIER",
      "articleDesignationCourte": "APRÈS ART. PREMIER",
      "type": "ARTICLE",
      "avantAApres": "Apres",
      "divisionRattachee": "APRÈS L'ARTICLE PREMIER, insérer l'article suivant:",
      "articleAdditionnel": "1",
      "urlDivisionTexteVise": "/15/textes/2124.asp#D_Article_1er"
    }
  },
  "corps": {},
  "representations": [
    {
      "nom": "PDF",
      "typeMime": {
        "type": "application",
        "subType": "PDF"
      },
      "statutRepresentation": {
        "verbatim": true,
        "canonique": true,
        "officielle": true,
        "transcription": false,
        "enregistrement": false
      },
      "contenu": {
        "documentURI": "/15/amendements/2124/AN/8.pdf"
      }
    }
  ],
  "dateDepot": "2019-07-11T02:00:00.000+02:00",
  "dateDistribution": "2019-07-16T02:00:00.000+02:00",
  "article99": "0",
  "loiReference": {}
}