{
  "uid": "AMANR5L15SEA717460BTC1548P0D1N741",
  "identifiant": {
    "legislature": "15",
    "numero": "741",
    "numRect": "0",
    "saisine": {
      "texteLegislatifRef": "PRJLANR5L15BTC1548",
      "numeroPartiePLF": "0",
      "organeExamen": "PO717460",
      "mentionSecondeDeliberation": "0"
    }
  },
  "numeroLong": "741",
  "etapeTexte": "Nouvelle Lecture",
  "triAmendement": "deiaaaaaaaaaaaaaaaaaaaaaaaaaaaaaaaaaaaaaaaaaaaaaaaav",
  "cardinaliteAmdtMultiples": "1",
  "etat": "Irrecevable",
  "signataires": {
    "auteur": {
      "typeAuteur": "Depute",
      "acteurRef": "PA720430",
      "groupePolitiqueRef": "PO730958"
    },
    "cosignatairesRefs": [
      "PA721062",
      "PA721210",
      "PA720846",
      "PA722142",
      "PA718860",
      "PA720892",
      "PA721226",
      "PA720286",
      "PA721960",
      "PA719578",
      "PA719676",
      "PA721202",
      "PA718868",
      "PA2150",
      "PA720422",
      "PA588884",
      "PA720430"
    ],
    "texteAffichable": "M.&#160;Bernalicis,  Mme&#160;Autain, M.&#160;Coquerel, M.&#160;Corbi&#232;re, Mme&#160;Fiat, M.&#160;Lachaud, M.&#160;Larive, M.&#160;M&#233;lenchon, Mme&#160;Obono, Mme&#160;Panot, M.&#160;Prud&apos;homme, M.&#160;Quatennens, M.&#160;Ratenon, Mme&#160;Ressiguier, Mme&#160;Rubin, M.&#160;Ruffin, Mme&#160;Taurine et les membres du groupe La France insoumise"
  },
  "pointeurFragmentTexte": {
    "division": {
      "titre": "Article 32",
      "articleDesignationCourte": "ART. 32",
      "type": "ARTICLE",
      "avantAApres": "A",
      "divisionRattachee": "ARTICLE 32",
      "urlDivisionTexteVise": "/15/textes/1548.asp#D_Article_32"
    },
    "alinea": {
      "avantAApres": "Apres",
      "numero": "7"
    }
  },
  "corps": {
    "dispositif": "<p>Apr&#232;s l&#8217;alin&#233;a&#160;7, ins&#233;rer les cinq alin&#233;as suivants&#160;:</p><p>&#171;&#160;III&#160;<i>bis</i>.&#160;&#8211;&#160;L&#8217;article&#160;78&#8209;2 du code de proc&#233;dure p&#233;nale est ainsi modifi&#233;&#160;:</p><p>&#171;&#160;1&#176;&#160;Au premier alin&#233;a, le mot&#160;: &#171;&#160;plausibles&#160;&#187; est remplac&#233; par les mots&#160;: &#171;&#160;objectives et individualis&#233;es&#160;&#187;&#160;;</p><p>&#171;&#160;2&#176;&#160;Sont ajout&#233;s deux alin&#233;as ainsi r&#233;dig&#233;s&#160;:</p><p>&#171;&#160;Les contr&#244;les d&#8217;identit&#233; r&#233;alis&#233;s en application de cet article donnent lieu, &#224; peine de nullit&#233;, &#224; l&#8217;&#233;tablissement d&#8217;un document nomm&#233; &#171;&#160;r&#233;c&#233;piss&#233; de contr&#244;le d&#8217;identit&#233;&#160;&#187;, sp&#233;cifiant le motif du contr&#244;le, le num&#233;ro d&#8217;identification individuel du fonctionnaire ou de l&#8217;agent, ainsi que les modalit&#233;s de garantie de l&#8217;anonymat des personnes contr&#244;l&#233;es. Ce dispositif est mis en &#339;uvre dans les conditions pr&#233;vues &#224; l&#8217;alin&#233;a suivant.</p><p>&#171;&#160;&#192; titre exp&#233;rimental, pour une dur&#233;e maximale d&#8217;un an, l&#8217;&#233;tablissement des r&#233;c&#233;piss&#233;s de contr&#244;le d&#8217;identit&#233; mentionn&#233;s au pr&#233;c&#233;dent alin&#233;a peut &#234;tre mis en &#339;uvre dans les communes qui en formulent la demande aupr&#232;s de l&#8217;autorit&#233; administrative comp&#233;tente dans un champ territorial d&#8217;au maximum six d&#233;partements et deux r&#233;gions. Un d&#233;cret en Conseil d&#8217;&#201;tat pr&#233;cise les conditions d&#8217;application du pr&#233;sent article. Cette exp&#233;rimentation fait l&#8217;objet d&#8217;un bilan transmis au Parlement &#233;valuant l&#8217;opportunit&#233; d&#8217;une g&#233;n&#233;ralisation de ce dispositif.&#160;&#187;</p>",
    "exposeSommaire": "<p style=\"text-align: justify;\">Par cet amendement, nous proposons d&#8217;instaurer une exp&#233;rimentation visant &#224; mettre en place des r&#233;c&#233;piss&#233;s de contr&#244;le d&#8217;identit&#233;.</p><p style=\"text-align: justify;\">Toutes les associations antiracistes, tous les observateurs internationaux, toutes les personnes de bon sens nous le disent&#160;: il y a de la discrimination dans la fa&#231;on avec laquelle sont conduits les contr&#244;les d&#8217;identit&#233;. &#192; tel point qu&#8217;un jeune homme noir a 17&#160;% de chances de plus d&#8217;&#234;tre contr&#244;l&#233; qu&#8217;une femme blanche.</p><p style=\"text-align: justify;\">Nous proposons de r&#233;tablir le lien de confiance, entre les forces de police et la population en supprimant tout ce qui pourrait justifier de l&#8217;arbitraire dans les contr&#244;les de police. Ainsi, il est important que des faits mat&#233;riels av&#233;r&#233;s viennent justifier ces contr&#244;les.</p><p style=\"text-align: justify;\">En d&#233;tail</p><p style=\"text-align: justify;\">Voici ici notre proposition de loi d&#233;taill&#233;e avec son expos&#233; des motifs qui reprend toutes les &#233;tudes relatives &#224; l&#8217;importance d&#8217;instaurer un r&#233;c&#233;piss&#233; de contr&#244;le d&#8217;identit&#233; (http&#160;://www.assemblee-nationale.fr/15/propositions/pion0520.asp).</p>"
  },
  "representations": [
    {
      "nom": "PDF",
      "typeMime": {
        "type": "application",
        "subType": "PDF"
      },
      "statutRepresentation": {
        "verbatim": true,
        "canonique": true,
        "officielle": true,
        "transcription": false,
        "enregistrement": false
      },
      "contenu": {
        "documentURI": "/15/amendements/1548/AN/741.pdf"
      }
    }
  ],
  "dateDepot": "2019-01-11T01:00:00.000+01:00",
  "dateDistribution": "2019-01-14T01:00:00.000+01:00",
  "article99": "0",
  "loiReference": {}
}