{
  "uid": "AMANR5L15PO419604B1481P0D1N393",
  "identifiant": {
    "legislature": "15",
    "numero": "393",
    "numRect": "0",
    "saisine": {
      "texteLegislatifRef": "PRJLANR5L15B1481",
      "numeroPartiePLF": "0",
      "organeExamen": "PO419604",
      "mentionSecondeDeliberation": "0"
    }
  },
  "numeroLong": "AC393",
  "etapeTexte": "1ère lecture (1ère assemblée saisie)",
  "triAmendement": "aeaaaaaaaaaaaaaaaaaaaaaaaaaaaaaaaaaaaaaaaaaaaaaaaaszzzzyo",
  "cardinaliteAmdtMultiples": "1",
  "etat": "Retiré",
  "signataires": {
    "auteur": {
      "typeAuteur": "Depute",
      "acteurRef": "PA718944",
      "groupePolitiqueRef": "PO730964"
    },
    "cosignatairesRefs": [
      "PA720190",
      "PA718944",
      "PA718768",
      "PA722062",
      "PA720576",
      "PA719118",
      "PA722038",
      "PA720854",
      "PA718728",
      "PA718962",
      "PA720074",
      "PA721024"
    ],
    "texteAffichable": "Mme&#160;Racon-Bouzon,  Mme&#160;Genetet, M.&#160;Damien&#160;Adam, Mme&#160;Janvier, M.&#160;Zulesi, Mme&#160;Valetta Ardisson, Mme&#160;Granjus, Mme&#160;Vanceunebrock-Mialon, M.&#160;Test&#233;, M.&#160;Bois, M.&#160;Sorre et M.&#160;Cormier-Bouligeon"
  },
  "pointeurFragmentTexte": {
    "division": {
      "titre": "Article PREMIER",
      "articleDesignationCourte": "APRÈS ART. PREMIER",
      "type": "ARTICLE",
      "avantAApres": "Apres",
      "divisionRattachee": "APRÈS L'ARTICLE PREMIER, insérer l'article suivant:",
      "articleAdditionnel": "1",
      "urlDivisionTexteVise": "/15/textes/1481.asp#D_Article_1er"
    }
  },
  "corps": {
    "dispositif": "<p style=\"text-align: justify;\">I.&#160;&#8211;&#160;L&#8217;article L.&#160;551&#8209;1 du code de l&#8217;&#233;ducation est compl&#233;t&#233; par un alin&#233;a ainsi r&#233;dig&#233;&#160;:</p><p style=\"text-align: justify;\">&#171;&#160;Dans le cas o&#249; la commune a accept&#233; un projet &#233;ducatif territorial, les enfants scolaris&#233;s dans les &#233;coles dont elle a la charge b&#233;n&#233;ficient gratuitement, et m&#234;me en cas de gr&#232;ve de son personnel, d&#8217;un accueil organis&#233; par la commune pendant la pause m&#233;ridienne.&#160;&#187;</p><p style=\"text-align: justify;\">II.&#160;&#8211;&#160;La perte de recettes pour les collectivit&#233;s territoriales est compens&#233;e &#224; due concurrence par la majoration de la dotation globale de fonctionnement et, corr&#233;lativement pour l&#8217;&#201;tat, par la cr&#233;ation d&#8217;une taxe additionnelle aux droits mentionn&#233;s aux articles 575 et 575 A du code g&#233;n&#233;ral des imp&#244;ts.</p>",
    "exposeSommaire": "<p style=\"text-align: justify;\">Cet amendement vise &#224; garantir, dans les communes qui ont accept&#233; un projet &#233;ducatif territorial, la continuit&#233; du service public par la prise en charge des enfants pendant la pause m&#233;ridienne, y compris en cas de gr&#232;ve.</p><p style=\"text-align: justify;\">L&#8217;objectif n&#8217;est pas de contraindre les 34&#160;841 communes de France &#224; organiser la pause m&#233;ridienne pour les enfants scolaris&#233;s dans les &#233;coles dont elles ont la charge. Il s&#8217;agit simplement de poursuivre, pour les communes qui se sont engag&#233;es &#224; mettre en place un projet &#233;ducatif territorial, la logique de cet engagement. Celui-ci constitue un &#171;&#160;contrat tacite&#160;&#187; avec les parents leur garantissant la prise en charge de leurs enfants sur le temps p&#233;riscolaire. La pause m&#233;ridienne en faisant partie, il est n&#233;cessaire d&#8217;assurer aux parents que, m&#234;me en temps de gr&#232;ve, la commune se charge de l&#8217;accueil de leurs enfants dans des conditions d&#8217;encadrement satisfaisantes.</p><p style=\"text-align: justify;\">A Marseille, par exemple, des mouvements de gr&#232;ves du personnel municipal positionn&#233;es pr&#233;cis&#233;ment au moment de la pause m&#233;ridienne, pendant plusieurs semaines cons&#233;cutives, affectent grandement le quotidien des parents, laissant les enfants sans encadrement, ni d&#233;jeuner.</p><p style=\"text-align: justify;\">Il est n&#233;cessaire de permettre une continuit&#233; du service public &#224; l&#8217;&#233;cole. Cela passe par la garantie de cette prise en charge b&#233;n&#233;fique pour les enfants, le repas du midi &#233;tant pour certains d&#8217;entre eux leur seul repas &#233;quilibr&#233; de la journ&#233;e, comme pour les parents, qui doivent pouvoir b&#233;n&#233;ficier d&#8217;une r&#233;elle tranquillit&#233; d&#8217;esprit lorsqu&#8217;ils d&#233;posent leurs enfants dans une &#233;cole qui assume la responsabilit&#233; du temps p&#233;riscolaire.</p>"
  },
  "representations": [
    {
      "nom": "PDF",
      "typeMime": {
        "type": "application",
        "subType": "PDF"
      },
      "statutRepresentation": {
        "verbatim": true,
        "canonique": true,
        "officielle": true,
        "transcription": false,
        "enregistrement": false
      },
      "contenu": {
        "documentURI": "/15/amendements/1481/CION-CEDU/AC393.pdf"
      }
    }
  ],
  "dateDepot": "2019-01-25T01:00:00.000+01:00",
  "dateDistribution": "2019-01-28T01:00:00.000+01:00",
  "article99": "0",
  "loiReference": {
    "codeLoi": "éducation",
    "divisionCodeLoi": "L551-1"
  }
}