{
  "uid": "AMANR5L15SEA717460BTC1629P0D1N294",
  "identifiant": {
    "legislature": "15",
    "numero": "294",
    "numRect": "0",
    "saisine": {
      "texteLegislatifRef": "PRJLANR5L15BTC1629",
      "numeroPartiePLF": "0",
      "organeExamen": "PO717460",
      "mentionSecondeDeliberation": "0"
    }
  },
  "numeroLong": "294",
  "etapeTexte": "1ère lecture (1ère assemblée saisie)",
  "triAmendement": "akaaaaaaaaaaaaaaaaaaaaaaaaaaaaaaaaaaaaaaaaaaaaaaaadw",
  "cardinaliteAmdtMultiples": "1",
  "etat": "Discuté",
  "signataires": {
    "auteur": {
      "typeAuteur": "Depute",
      "acteurRef": "PA266776",
      "groupePolitiqueRef": "PO730934"
    },
    "cosignatairesRefs": [
      "PA1695",
      "PA721506",
      "PA721410",
      "PA721070",
      "PA1498",
      "PA721474",
      "PA334149",
      "PA266797",
      "PA923",
      "PA330788",
      "PA330909",
      "PA720644",
      "PA2086",
      "PA643089",
      "PA719318",
      "PA720100",
      "PA767",
      "PA346054",
      "PA2529",
      "PA1029",
      "PA267324",
      "PA266808",
      "PA342935",
      "PA2796",
      "PA608826",
      "PA721126",
      "PA748954",
      "PA2155",
      "PA718850",
      "PA266776",
      "PA267318",
      "PA720586",
      "PA1874",
      "PA267450",
      "PA2792",
      "PA340853",
      "PA2492",
      "PA267527",
      "PA718784",
      "PA609245",
      "PA998",
      "PA267901",
      "PA720684",
      "PA607090",
      "PA606098",
      "PA720630",
      "PA719946",
      "PA722390",
      "PA720386",
      "PA720210",
      "PA746",
      "PA267440",
      "PA223837",
      "PA713448",
      "PA721678",
      "PA267794",
      "PA267200",
      "PA2960",
      "PA718884"
    ],
    "texteAffichable": "M.&#160;Reiss,  M.&#160;Jacob, Mme&#160;Anthoine, Mme&#160;Bazin-Malgras, Mme&#160;Beauvais, Mme&#160;Bonnivard, Mme&#160;Brenier, M.&#160;Brochand, M.&#160;Carrez, M.&#160;Cattin, M.&#160;Cordier, Mme&#160;Corneloup, M.&#160;Cornut-Gentille, M.&#160;Dassault, M.&#160;Deflesselles, M.&#160;R&#233;mi&#160;Delatte, M.&#160;Descoeur, M.&#160;Di Filippo, M.&#160;Diard, Mme&#160;Marianne&#160;Dubois, Mme&#160;Duby-Muller, M.&#160;Pierre-Henri&#160;Dumont, M.&#160;Fasquelle, M.&#160;Gaultier, M.&#160;Goasguen, M.&#160;Gosselin, M.&#160;Grelier, Mme&#160;Guion-Firmin, M.&#160;Huyghe, M.&#160;Kamardine, Mme&#160;Kuster, Mme&#160;Lacroute, M.&#160;Le Fur, M.&#160;Leclerc, M.&#160;Emmanuel&#160;Maquet, M.&#160;Marleix, M.&#160;Marlin, M.&#160;Menuel, M.&#160;Minot, M.&#160;Nury, M.&#160;Pauget, M.&#160;Peltier, M.&#160;Pradi&#233;, M.&#160;Quentin, Mme&#160;Ramassamy, M.&#160;Reda, M.&#160;Reitzer, M.&#160;Reyn&#232;s, M.&#160;Rolland, M.&#160;Saddier, M.&#160;Savignat, Mme&#160;Tabarot, M.&#160;Taugourdeau, M.&#160;Teissier, M.&#160;Thi&#233;riot, M.&#160;Vatin, M.&#160;Jean-Pierre&#160;Vigier, M.&#160;Viry et M.&#160;Woerth"
  },
  "pointeurFragmentTexte": {
    "division": {
      "titre": "Article 2",
      "articleDesignationCourte": "ART. 2",
      "type": "ARTICLE",
      "avantAApres": "A",
      "divisionRattachee": "ARTICLE 2",
      "urlDivisionTexteVise": "/15/textes/1629.asp#D_Article_2"
    }
  },
  "corps": {
    "dispositif": "<p style=\"text-align: justify;\">Supprimer cet article.</p>",
    "exposeSommaire": "<p style=\"text-align: justify;\">Cet amendement du Groupe les R&#233;publicains vise &#224; supprimer la disposition du projet de loi qui fixe l&#8217;&#226;ge de l&#8217;instruction obligatoire &#224; 3 ans</p><p style=\"text-align: justify;\">Pour le Groupe les R&#233;publicains, en voulant fixer l&#8217;&#226;ge de l&#8217;instruction obligatoire &#224; 3 ans, le Gouvernement consid&#232;re que&#160;:</p><ul style=\"text-align: justify;\"><li>L&#8217;&#201;tat est incapable d&#8217;offrir une politique de la petite enfance coh&#233;rente et ambitieuse permettant &#224; de jeunes enfants de s&#8217;&#233;panouir et une politique familiale offrant un r&#233;el soutien aux familles</li><li>Les familles sont incapables d'&#233;duquer leur enfant de trois ans</li><li>L'&#201;cole est incapable d&#8217;offrir un enseignement de qualit&#233; &#224; l&#8217;&#226;ge de six ans permettant de compenser, le cas &#233;ch&#233;ant, les &#233;ventuels retards de certains enfants</li></ul><p style=\"text-align: justify;\">Les d&#233;put&#233;s du groupe les R&#233;publicains ne peuvent se r&#233;soudre &#224; accepter une telle vision. Il faut du courage et de la confiance. Du courage politique pour proposer une politique familiale et pr&#233;scolaire ambitieuses et de la confiance tant dans les familles qui sont le socle de notre pays que dans l&#8217;Ecole et les personnels enseignants qui effectuent un travail formidable pour peu qu&#8217;on leur fixe des objectifs clairs et qu&#8217;on leur donne des moyens suffisants.</p><p style=\"text-align: justify;\">&#160;Par ailleurs, l&#8217;allongement de la dur&#233;e de l&#8217;instruction n&#8217;est pas synonyme de r&#233;ussite.</p><p style=\"text-align: justify;\">&#160;&#192; titre d&#8217;exemple&#160;: l&#8217;&#226;ge obligatoire est de 6 ans en Belgique, au Danemark, en Allemagne, en Irlande ou bien encore en Norv&#232;ge. Le Royaume-Uni a fait le choix de faire commencer la scolarit&#233; plus t&#244;t. Les enfants sont ainsi oblig&#233;s de se rendre en classe d&#232;s 5 ans en Ecosse, au pays de Galles et Angleterre, et m&#234;me d&#232;s 4 ans pour l&#8217;Irlande du Nord qui fait figure d&#8217;exception.</p><p style=\"text-align: justify;\">&#160;Certains pays ont &#233;galement fait le choix de faire commencer la scolarit&#233; obligatoire plus tard. C&#8217;est notamment le cas de l&#8217;Estonie, o&#249; la scolarit&#233; est obligatoire &#224; partir de 7&#160;ans et qui est class&#233;e &#224; la troisi&#232;me place du classement PISA.</p><p style=\"text-align: justify;\">&#160;Tous ces pays devancent la France au classement PISA de 2015.</p><p style=\"text-align: justify;\">&#160;La formation initiale et continue des enseignants reste la pierre angulaire de toutes les r&#233;formes de l&#8217;&#233;ducation. Le titre II du projet de loi proc&#232;de &#224; une modification refonte des &#171;&#160;ESPE&#160;&#187; qui deviendront dor&#233;navant les &#171;&#160;INSPE&#160;&#187;. N&#233;anmoins, force est de constater que le texte reste muet quant &#224; la nature de la formation qui sera dispens&#233;e au sein de ces nouveaux instituts. Il est donc, en l&#8217;&#233;tat, impossible de savoir quelles seront les cons&#233;quences de ce changement.</p><p style=\"text-align: justify;\">&#160;Dans les pays scandinaves si la scolarisation n&#8217;est pas obligatoire avant 6 ans, des objectifs p&#233;dagogiques sont fix&#233;s pour les cr&#232;ches.</p><p style=\"text-align: justify;\">&#160;La formation ne s&#8217;arr&#234;te pas simplement aux professeurs des &#233;coles, elle doit concerner aussi les ATSEM (agents territoriaux sp&#233;cialis&#233;s des &#233;coles maternelles) qui sont des fonctionnaires territoriaux charg&#233;s d&#8217;assister les enseignants dans les classes maternelles. Leur statut n&#8217;est pas, non plus, abord&#233; par le PJL.</p><p style=\"text-align: justify;\">&#160;Les pays &#171;&#160;bon &#233;l&#232;ves&#160;&#187; se caract&#233;risent par une collaboration pouss&#233;e entre l&#8217;accueil pr&#233;scolaire et l&#8217;&#233;cole. Il est important de noter que le but ne doit pas &#234;tre de faire rentrer les &#233;l&#232;ves dans un &#171;&#160;moule scolaire&#160;&#187; d&#232;s le plus jeune &#226;ge. Les p&#233;dagogies utilis&#233;es entre la maternelle et le primaire sont tr&#232;s diff&#233;rentes et ne doivent pas &#234;tre m&#233;lang&#233;es. Cependant, le travail au sein des &#233;quipes sur un &#171;&#160;continuum&#160;&#187; coh&#233;rent entre elles permet un meilleur accueil de l&#8217;enfant et facilite son int&#233;gration dans l&#8217;&#233;cole primaire. Mais rien de tout cela n&#8217;appara&#238;t dans le texte.</p><p style=\"text-align: justify;\">&#160;D&#8217;une mani&#232;re g&#233;n&#233;rale, la question du taux d&#8217;encadrement n&#8217;est pas non plus trait&#233;e par le texte, pourtant il s&#8217;agit-l&#224; d&#8217;un point essentiel dans la prise en charge des enfants et en particulier des enfants en bas &#226;ge.</p><p style=\"text-align: justify;\">&#160;L&#8217;une des questions soulev&#233;es par le passage &#224; trois ans de la scolarit&#233; obligatoire est aussi celle de la prise en charge concr&#232;te des enfants. C&#8217;est une question qui peut para&#238;tre triviale mais &#224; 3 ans un enfant n&#8217;est pas forc&#233;ment &#171;&#160;propre&#160;&#187;, comment donc s&#8217;assurer que les &#233;coles b&#233;n&#233;ficieront des moyens techniques et humains pour les prendre en charge le cas &#233;ch&#233;ant&#160;?</p><p style=\"text-align: justify;\">&#160;Par ailleurs, les parents b&#233;n&#233;ficiaient jusqu&#8217;&#224; pr&#233;sent d&#8217;une certaine libert&#233; et d&#8217;une certaine souplesse leur permettant de ne mettre leurs enfants &#224; l&#8217;&#233;cole qu&#8217;une partie du temps, cela leur permettait aussi de garder un &#233;quilibre en fonction de la maturit&#233; de leur enfant.</p><p style=\"text-align: justify;\">&#160;L&#8217;ensemble de ces consid&#233;rations permet de douter de l&#8217;outil choisi par le ministre. Si un focus sur l&#8217;&#233;cole maternelle est une solution int&#233;ressante celui-ci ne doit pas se faire par une simple baisse de l&#8217;&#226;ge de l&#8217;instruction obligatoire mais par des moyens accrus d&#233;di&#233;s &#224; une meilleure formation des personnels et &#224; un meilleur encadrement.</p>"
  },
  "representations": [
    {
      "nom": "PDF",
      "typeMime": {
        "type": "application",
        "subType": "PDF"
      },
      "statutRepresentation": {
        "verbatim": true,
        "canonique": true,
        "officielle": true,
        "transcription": false,
        "enregistrement": false
      },
      "contenu": {
        "documentURI": "/15/amendements/1629/AN/294.pdf"
      }
    }
  ],
  "seanceDiscussion": "RUANR5L15S2019IDS21501",
  "sort": {
    "dateSaisie": "2019-02-13T19:52:14.000+01:00",
    "sortEnSeance": "Rejeté"
  },
  "dateDepot": "2019-02-06T01:00:00.000+01:00",
  "dateDistribution": "2019-02-08T01:00:00.000+01:00",
  "article99": "0",
  "loiReference": {}
}