{
  "uid": "AMANR5L15PO766718B2187P0D1N1628",
  "identifiant": {
    "legislature": "15",
    "numero": "1628",
    "numRect": "0",
    "saisine": {
      "texteLegislatifRef": "PRJLANR5L15B2187",
      "numeroPartiePLF": "0",
      "organeExamen": "PO766718",
      "mentionSecondeDeliberation": "0"
    }
  },
  "numeroLong": "1628",
  "etapeTexte": "1ère lecture (1ère assemblée saisie)",
  "triAmendement": "haaaaaaaaaaaaaaaaaaaaaaaaaaaaaaaaaaaaaaaaaaaaaaaaahbcs",
  "cardinaliteAmdtMultiples": "1",
  "etat": "Irrecevable",
  "signataires": {
    "auteur": {
      "typeAuteur": "Depute",
      "acteurRef": "PA722374",
      "groupePolitiqueRef": "PO730970"
    },
    "cosignatairesRefs": [
      "PA720598",
      "PA720764",
      "PA720746",
      "PA719942",
      "PA720092",
      "PA722284",
      "PA722162",
      "PA719044",
      "PA720976",
      "PA720704",
      "PA721734",
      "PA720772",
      "PA721984",
      "PA718978",
      "PA719266",
      "PA720720",
      "PA720256",
      "PA720178",
      "PA720728",
      "PA722374",
      "PA721418",
      "PA720162",
      "PA719640",
      "PA721742",
      "PA719874",
      "PA719504",
      "PA720968",
      "PA721924",
      "PA1276",
      "PA719558",
      "PA720334",
      "PA721530",
      "PA720924",
      "PA720002",
      "PA719210",
      "PA720326",
      "PA719918",
      "PA720652",
      "PA721234",
      "PA721182",
      "PA719488",
      "PA717151",
      "PA721976",
      "PA721608"
    ],
    "texteAffichable": "M.&#160;Isaac-Sibille,  M.&#160;Berta, rapporteur Mme&#160;de Vaucouleurs, Mme&#160;Elimas, M.&#160;Fuchs, M.&#160;Hammouche, M.&#160;Balanant, Mme&#160;Bannier, M.&#160;Baudu, Mme&#160;Benin, M.&#160;Bolo, M.&#160;Bourlanges, M.&#160;Bru, M.&#160;Cubertafon, Mme&#160;de Sarnez, Mme&#160;Deprez-Audebert, M.&#160;Duverg&#233;, Mme&#160;El Ha&#239;ry, Mme&#160;Essayan, M.&#160;Fanget, Mme&#160;Florennes, M.&#160;Garcia, Mme&#160;Jacquier-Laforge, M.&#160;Joncour, M.&#160;Lagleize, M.&#160;Lain&#233;, M.&#160;Laqhila, Mme&#160;Lasserre-David, M.&#160;Latombe, Mme&#160;Luquet, M.&#160;Mathiasin, M.&#160;Mattei, Mme&#160;Mette, M.&#160;Michel-Kleisbauer, M.&#160;Mignola, M.&#160;Millienne, M.&#160;Pahun, M.&#160;Fr&#233;d&#233;ric&#160;Petit, Mme&#160;Maud&#160;Petit, Mme&#160;Poueyto, M.&#160;Ramos, M.&#160;Turquois, Mme&#160;Vichnievsky et M.&#160;Waserman"
  },
  "pointeurFragmentTexte": {
    "division": {
      "titre": "Article 19",
      "articleDesignationCourte": "APRÈS ART. 19",
      "type": "ARTICLE",
      "avantAApres": "Apres",
      "divisionRattachee": "APRÈS L'ARTICLE 19, insérer l'article suivant:",
      "articleAdditionnel": "1",
      "urlDivisionTexteVise": "/15/textes/2187.asp#D_Article_19"
    }
  },
  "corps": {},
  "representations": [
    {
      "nom": "PDF",
      "typeMime": {
        "type": "application",
        "subType": "PDF"
      },
      "statutRepresentation": {
        "verbatim": true,
        "canonique": true,
        "officielle": true,
        "transcription": false,
        "enregistrement": false
      },
      "contenu": {
        "documentURI": "/15/amendements/2187/CSBIOETH/1628.pdf"
      }
    }
  ],
  "dateDepot": "2019-09-05T02:00:00.000+02:00",
  "dateDistribution": "2019-09-09T02:00:00.000+02:00",
  "article99": "0",
  "loiReference": {
    "codeLoi": "c santé publique",
    "divisionCodeLoi": "L2131-4-1-1"
  }
}