{
  "uid": "AMANR5L15SEA717460BTC0902P0D1N274",
  "identifiant": {
    "legislature": "15",
    "numero": "274",
    "numRect": "0",
    "saisine": {
      "texteLegislatifRef": "PRJLANR5L15BTC0902",
      "numeroPartiePLF": "0",
      "organeExamen": "PO717460",
      "mentionSecondeDeliberation": "0"
    }
  },
  "numeroLong": "274",
  "etapeTexte": "1ère lecture (1ère assemblée saisie)",
  "triAmendement": "crkzzzzzzo",
  "cardinaliteAmdtMultiples": "1",
  "etat": "Discuté",
  "signataires": {
    "auteur": {
      "typeAuteur": "Depute",
      "acteurRef": "PA267527",
      "groupePolitiqueRef": "PO730934"
    },
    "cosignatairesRefs": [
      "PA332523",
      "PA709315",
      "PA2086",
      "PA608826",
      "PA346054",
      "PA721314",
      "PA718884",
      "PA1327",
      "PA609245",
      "PA267527",
      "PA719318"
    ],
    "texteAffichable": "M.&#160;Saddier,  M.&#160;Emmanuel&#160;Maquet, M.&#160;Marlin, Mme&#160;Duby-Muller, Mme&#160;Dalloz, Mme&#160;Bazin-Malgras, Mme&#160;Anthoine, Mme&#160;Lacroute, M.&#160;Schellenberger, M.&#160;Forissier et M.&#160;Viala"
  },
  "pointeurFragmentTexte": {
    "division": {
      "titre": "Article 10",
      "articleDesignationCourte": "ART. 10",
      "type": "ARTICLE",
      "avantAApres": "A",
      "divisionRattachee": "ARTICLE 10",
      "urlDivisionTexteVise": "/15/textes/0902.asp#D_Article_10"
    },
    "alinea": {
      "avantAApres": "A",
      "numero": "7",
      "alineaDesignation": "Alinéa 7"
    }
  },
  "corps": {
    "dispositif": "<p style=\"text-align: justify;\">R&#233;diger ainsi l&#8217;alin&#233;a&#160;7&#160;:</p><p style=\"text-align: justify;\">&#171;&#160;6&#176;&#160;De modifier les dispositions de l&#8217;article L.&#160;442&#8209;9 du code du commerce pour &#233;largir l&#8217;interdiction de c&#233;der &#224; un prix abusivement bas les produits agricoles et les denr&#233;es alimentaires et red&#233;finir cette notion au regard notamment d&#8217;indicateurs de co&#251;ts de production en agriculture.&#160;&#187;</p>",
    "exposeSommaire": "<p style=\"text-align: justify;\">Cet amendement a pour objectif de pr&#233;ciser la modification l&#233;gislative envisag&#233;e dans l&#8217;ordonnance en faisant clairement r&#233;f&#233;rence aux &#171;&#160;prix de cession abusivement bas&#160;&#187; et en &#233;tablissant un lien direct entre la d&#233;finition de ces prix abusivement bas et les co&#251;ts de production en agriculture.</p>"
  },
  "representations": [
    {
      "nom": "PDF",
      "typeMime": {
        "type": "application",
        "subType": "PDF"
      },
      "statutRepresentation": {
        "verbatim": true,
        "canonique": true,
        "officielle": true,
        "transcription": false,
        "enregistrement": false
      },
      "contenu": {
        "documentURI": "/15/amendements/0902/AN/274.pdf"
      }
    }
  ],
  "seanceDiscussion": "RUANR5L15S2018IDS21055",
  "sort": {
    "dateSaisie": "2018-05-25T16:09:17.000+02:00",
    "sortEnSeance": "Adopté"
  },
  "dateDepot": "2018-05-02T02:00:00.000+02:00",
  "dateDistribution": "2018-05-21T02:00:00.000+02:00",
  "article99": "0",
  "loiReference": {}
}