{
  "uid": "AMANR5L15SEA717460B1490P0D1N763",
  "identifiant": {
    "legislature": "15",
    "numero": "763",
    "numRect": "0",
    "saisine": {
      "texteLegislatifRef": "PRJLANR5L15B1490",
      "numeroPartiePLF": "0",
      "organeExamen": "PO717460",
      "mentionSecondeDeliberation": "0"
    }
  },
  "numeroLong": "763",
  "etapeTexte": "Nouvelle Lecture",
  "triAmendement": "aagaiaaaaaaaaaaaaaaaaaaaaaaaaaaaaaaaaaaaaaaaaaaaaazzzzzi",
  "cardinaliteAmdtMultiples": "1",
  "etat": "Discuté",
  "signataires": {
    "auteur": {
      "typeAuteur": "Depute",
      "acteurRef": "PA721568",
      "groupePolitiqueRef": "PO730964"
    },
    "cosignatairesRefs": [
      "PA719960",
      "PA642695",
      "PA719952",
      "PA722094",
      "PA721568",
      "PA331567"
    ],
    "texteAffichable": "M.&#160;Person,  M.&#160;Mis, Mme&#160;Hennion, M.&#160;Bothorel, Mme&#160;de La Raudi&#232;re et Mme&#160;Faure-Muntian"
  },
  "pointeurFragmentTexte": {
    "division": {
      "titre": "Article 19 ter",
      "articleDesignationCourte": "ART. 19 TER",
      "type": "ARTICLE",
      "avantAApres": "A",
      "divisionRattachee": "ARTICLE 19 TER",
      "urlDivisionTexteVise": "/15/textes/1490.asp#D_Article_19_ter"
    },
    "alinea": {
      "avantAApres": "Apres",
      "numero": "4"
    }
  },
  "corps": {
    "dispositif": "<p style=\"text-align: justify;\">I.&#160;&#8211;&#160;Apr&#232;s l&#8217;alin&#233;a&#160;4, ins&#233;rer les alin&#233;as suivants&#160;:</p><p style=\"text-align: justify;\">&#171;&#160;<i>g</i>. Le tarif de la taxe applicable &#224; l&#8217;&#233;lectricit&#233; consomm&#233;e par un centre de cr&#233;ation d&#8217;actifs num&#233;riques au sens de l&#8217;article&#160;150 BH bis, exploit&#233; par une entreprise est, pour la fraction des quantit&#233;s annuelles exc&#233;dant un gigawattheure et lorsque la consommation totale d&#8217;&#233;lectricit&#233; de ce centre est &#233;gale ou sup&#233;rieure &#224; un kilowattheure par&#160;euro de valeur ajout&#233;e, fix&#233; &#224; 12&#160;&#8364; par m&#233;gawattheure.</p><p style=\"text-align: justify;\">&#171;&#160;Un centre de cr&#233;ation d&#8217;actifs num&#233;riques s&#8217;entend d&#8217;une infrastructure immobili&#232;re consacr&#233;e &#224; l&#8217;activit&#233; de cr&#233;ation d&#8217;actifs num&#233;riques en lien avec la participation &#224; un dispositif d&#8217;enregistrement &#233;lectronique partag&#233;, dont l&#8217;acc&#232;s est s&#233;curis&#233;, et comprenant des dispositifs sp&#233;cifiques et d&#233;di&#233;s de contr&#244;le de son environnement thermique, de la qualit&#233; de son air, d&#8217;alimentation en &#233;nergie et de pr&#233;vention des incendies.&#160;&#187;</p><p style=\"text-align: justify;\">II.&#160;&#8211;&#160;Compl&#233;ter cet article par l&#8217;alin&#233;a suivant&#160;:</p><p style=\"text-align: justify;\">&#171;&#160;II.&#160;&#8211;&#160;La perte de recettes pour l&#8217;&#201;tat est compens&#233;e &#224; due concurrence par la cr&#233;ation d&#8217;une taxe additionnelle aux droits mentionn&#233;s aux articles 575 et 575 A du code g&#233;n&#233;ral des imp&#244;ts.&#160;&#187;.</p>",
    "exposeSommaire": "<p style=\"text-align: justify;\">Le pr&#233;sent amendement a pour objet de mettre en place un tarif r&#233;duit de la taxe int&#233;rieure de consommation d&#8217;&#233;lectricit&#233; au b&#233;n&#233;fice des centres de minage d&#8217;actifs num&#233;riques, ou crypto-actifs.</p><p style=\"text-align: justify;\">En effet, l&#8217;ind&#233;pendance nationale en mati&#232;re de s&#233;curit&#233; juridique des donn&#233;es est un enjeu crucial pour de nombreux secteurs industriels. Pour les soci&#233;t&#233;s de minage qui fonctionnent sous un algorithme de preuve de travail, le choix du positionnement g&#233;ographique des centres est fortement d&#233;termin&#233; par le co&#251;t de l&#8217;&#233;lectricit&#233;, qui repr&#233;sente pr&#232;s plus de 95&#160;% des co&#251;ts de production. Dans ce contexte, la hausse du co&#251;t complet de l&#8217;&#233;lectricit&#233; en France depuis 2012 (+ 12&#160;% pour les tr&#232;s gros consommateurs), alors qu&#8217;il est stable, voire en baisse, dans d&#8217;autres pays h&#233;bergeurs, est de nature &#224; enrayer la dynamique de forte croissance des capacit&#233;s fran&#231;aises d&#8217;h&#233;bergement de donn&#233;es.</p><p style=\"text-align: justify;\">C&#8217;est la raison pour laquelle le pr&#233;sent amendement met en place un tarif r&#233;duit pour les centres de minage.</p>"
  },
  "representations": [
    {
      "nom": "PDF",
      "typeMime": {
        "type": "application",
        "subType": "PDF"
      },
      "statutRepresentation": {
        "verbatim": true,
        "canonique": true,
        "officielle": true,
        "transcription": false,
        "enregistrement": false
      },
      "contenu": {
        "documentURI": "/15/amendements/1490/AN/763.pdf"
      }
    }
  ],
  "seanceDiscussion": "RUANR5L15S2019IDS21432",
  "sort": {
    "dateSaisie": "2018-12-18T17:40:56.000+01:00",
    "sortEnSeance": "Tombé"
  },
  "dateDepot": "2018-12-14T01:00:00.000+01:00",
  "dateDistribution": "2018-12-18T01:00:00.000+01:00",
  "article99": "0",
  "loiReference": {}
}