{
  "uid": "AMANR5L15SEA717460BTC1974P0D1N20",
  "identifiant": {
    "legislature": "15",
    "numero": "20",
    "numRect": "0",
    "saisine": {
      "texteLegislatifRef": "PRJLANR5L15BTC1974",
      "numeroPartiePLF": "0",
      "organeExamen": "PO717460",
      "mentionSecondeDeliberation": "0"
    }
  },
  "numeroLong": "20",
  "etapeTexte": "1ère lecture (2ème assemblée saisie)",
  "triAmendement": "adiaaaaaaaaaaaaaaaaaaaaaaaaaaaaaaaaaaaaaaaaaaaaaaaahk",
  "cardinaliteAmdtMultiples": "1",
  "etat": "Irrecevable",
  "signataires": {
    "auteur": {
      "typeAuteur": "Depute",
      "acteurRef": "PA330909",
      "groupePolitiqueRef": "PO730934"
    },
    "cosignatairesRefs": [
      "PA267204",
      "PA607090",
      "PA346218",
      "PA2377",
      "PA718884",
      "PA712015",
      "PA267527",
      "PA721410",
      "PA721968",
      "PA267429",
      "PA608016",
      "PA1012",
      "PA334654",
      "PA748954",
      "PA340853",
      "PA709315",
      "PA605036",
      "PA721636",
      "PA606712",
      "PA719318",
      "PA332523",
      "PA2155",
      "PA330909",
      "PA720386",
      "PA719272",
      "PA608416",
      "PA718838",
      "PA266793",
      "PA334843",
      "PA643134"
    ],
    "texteAffichable": "M.&#160;Descoeur,  M.&#160;Sermier, M.&#160;Lurton, M.&#160;Dive, M.&#160;Straumann, M.&#160;Hetzel, M.&#160;Abad, Mme&#160;Bonnivard, Mme&#160;Anthoine, Mme&#160;Bazin-Malgras, M.&#160;Saddier, M.&#160;Verch&#232;re, M.&#160;Masson, Mme&#160;Valentin, M.&#160;Bony, M.&#160;Leclerc, Mme&#160;Dalloz, M.&#160;Menuel, M.&#160;Di Filippo, M.&#160;Jean-Pierre&#160;Vigier, M.&#160;Parigi, M.&#160;Savignat, M.&#160;Perrut, M.&#160;Brun, Mme&#160;Meunier, Mme&#160;Louwagie, M.&#160;Cinieri, M.&#160;Vialay, M.&#160;Viala et M.&#160;de la Verpilli&#232;re"
  },
  "pointeurFragmentTexte": {
    "division": {
      "titre": "Article PREMIER",
      "articleDesignationCourte": "APRÈS ART. PREMIER",
      "type": "ARTICLE",
      "avantAApres": "Apres",
      "divisionRattachee": "APRÈS L'ARTICLE PREMIER, insérer l'article suivant:",
      "articleAdditionnel": "1",
      "urlDivisionTexteVise": "/15/textes/1974.asp#D_Article_1er"
    }
  },
  "corps": {},
  "representations": [
    {
      "nom": "PDF",
      "typeMime": {
        "type": "application",
        "subType": "PDF"
      },
      "statutRepresentation": {
        "verbatim": true,
        "canonique": true,
        "officielle": true,
        "transcription": false,
        "enregistrement": false
      },
      "contenu": {
        "documentURI": "/15/amendements/1974/AN/20.pdf"
      }
    }
  ],
  "dateDepot": "2019-05-25T02:00:00.000+02:00",
  "dateDistribution": "2019-06-03T02:00:00.000+02:00",
  "article99": "0",
  "loiReference": {
    "codeLoi": "c transports",
    "divisionCodeLoi": "L2111-2"
  }
}