{
  "uid": "AMANR5L15SEA717460BTC1237P0D1N2761",
  "identifiant": {
    "legislature": "15",
    "numero": "2761",
    "numRect": "0",
    "saisine": {
      "texteLegislatifRef": "PRJLANR5L15BTC1237",
      "numeroPartiePLF": "0",
      "organeExamen": "PO717460",
      "mentionSecondeDeliberation": "0"
    }
  },
  "numeroLong": "2761",
  "etapeTexte": "1ère lecture (1ère assemblée saisie)",
  "triAmendement": "bbbaaaaaaaaaaaaaaaaaaaaaaaaaaaaaaaaaaaaaaaaaaaaaaaaim",
  "cardinaliteAmdtMultiples": "1",
  "etat": "Discuté",
  "signataires": {
    "auteur": {
      "typeAuteur": "Depute",
      "acteurRef": "PA720108",
      "groupePolitiqueRef": "PO730964"
    },
    "cosignatairesRefs": [
      "PA718962",
      "PA719338",
      "PA722008",
      "PA607155",
      "PA607193",
      "PA722000",
      "PA721352",
      "PA719194",
      "PA721860",
      "PA722268",
      "PA720414",
      "PA719814",
      "PA720146",
      "PA720278",
      "PA719790",
      "PA720108",
      "PA719972",
      "PA720402",
      "PA721246",
      "PA719456",
      "PA719130",
      "PA720552",
      "PA721946",
      "PA722094",
      "PA719632",
      "PA718756",
      "PA720622",
      "PA718794",
      "PA721398",
      "PA718902",
      "PA721792",
      "PA720154",
      "PA718876",
      "PA643175",
      "PA718894",
      "PA719162",
      "PA719692",
      "PA721542",
      "PA719858",
      "PA722228",
      "PA721888",
      "PA719798",
      "PA718744"
    ],
    "texteAffichable": "Mme&#160;Oppelt,  Mme&#160;Dupont, Mme&#160;Verdier-Jouclas, Mme&#160;Yolaine&#160;de Courson, Mme&#160;Wonner, Mme&#160;Errante, Mme&#160;Dubr&#233;-Chirat, Mme&#160;Degois, Mme&#160;Melchior, M.&#160;Eliaou, M.&#160;Cesarini, M.&#160;Daniel, M.&#160;Orphelin, Mme&#160;M&#246;rch, Mme&#160;Guerel, Mme&#160;Gaillot, Mme&#160;Limon, Mme&#160;Cazarian, M.&#160;Chalumeau, Mme&#160;Sarles, M.&#160;Leclabart, M.&#160;Mass&#233;glia, Mme&#160;Bagarry, Mme&#160;Colboc, M.&#160;C&#233;dric&#160;Roussel, Mme&#160;Michel, Mme&#160;Leguille-Balloy, Mme&#160;Jacqueline&#160;Dubois, Mme&#160;Bureau-Bonnard, M.&#160;Zulesi, Mme&#160;H&#233;rin, Mme&#160;Panonacle, Mme&#160;Rauch, M.&#160;Raphan, M.&#160;Marilossian, M.&#160;Besson-Moreau, Mme&#160;Hennion, M.&#160;Perrot, M.&#160;Buchou, Mme&#160;Bono-Vandorme, M.&#160;Dombreval, M.&#160;Labaronne et M.&#160;Paluszkiewicz"
  },
  "pointeurFragmentTexte": {
    "division": {
      "titre": "Article 13",
      "articleDesignationCourte": "APRÈS ART. 13",
      "type": "ARTICLE",
      "avantAApres": "Apres",
      "divisionRattachee": "APRÈS L'ARTICLE 13, insérer l'article suivant:",
      "articleAdditionnel": "1",
      "urlDivisionTexteVise": "/15/textes/1237.asp#D_Article_13"
    }
  },
  "corps": {
    "dispositif": "<p style=\"text-align: justify;\">Apr&#232;s le mot&#160;:</p><p style=\"text-align: justify;\">&#171;&#160;exercer&#160;&#187;,</p><p style=\"text-align: justify;\">la fin du deuxi&#232;me alin&#233;a de l&#8217;article L.&#160;713&#8209;1 du code de commerce est ainsi r&#233;dig&#233;e&#160;:</p><p style=\"text-align: justify;\">&#171;&#160;plus de trois mandats de pr&#233;sident de toutes chambres de commerce et d&#8217;industrie du r&#233;seau, quelle que soit la dur&#233;e effective de ces mandats&#160;&#187;.</p>",
    "exposeSommaire": "<p style=\"text-align: justify;\">Cet amendement a pour objectif de permettre une meilleure repr&#233;sentativit&#233; de l&#8217;ensemble des chambres du r&#233;seau dans les instances dirigeantes des chambres de commerce et d&#8217;industrie de r&#233;gion, territoriales, m&#233;tropolitaines, locales et d&#233;partementales d&#8217;&#206;le-de-France, ainsi que de CCI France.</p><p style=\"text-align: justify;\">En effet, la limitation actuelle &#224; trois mandats pour chaque type de chambre ne permet pas &#224; ce jour de favoriser le renouveau et le dynamisme dont le r&#233;seau a besoin, un membre d&#8217;une chambre de commerce et d&#8217;industrie pouvant exercer jusqu&#8217;&#224; 45 ann&#233;es de pr&#233;sidence toutes chambres confondues.</p><p style=\"text-align: justify;\">Cet amendement permet donc, en limitant le nombre de mandats possibles pour un pr&#233;sident de CCI &#224; trois mandats pour toutes chambres confondues, de favoriser le dynamisme du r&#233;seau via un renouvellement plus fr&#233;quent des organes dirigeants.</p>"
  },
  "representations": [
    {
      "nom": "PDF",
      "typeMime": {
        "type": "application",
        "subType": "PDF"
      },
      "statutRepresentation": {
        "verbatim": true,
        "canonique": true,
        "officielle": true,
        "transcription": false,
        "enregistrement": false
      },
      "contenu": {
        "documentURI": "/15/amendements/1237/AN/2761.pdf"
      }
    }
  ],
  "seanceDiscussion": "RUANR5L15S2018IDS21252",
  "sort": {
    "dateSaisie": "2018-09-28T00:44:25.000+02:00",
    "sortEnSeance": "Adopté"
  },
  "dateDepot": "2018-09-21T02:00:00.000+02:00",
  "dateDistribution": "2018-09-24T02:00:00.000+02:00",
  "article99": "0",
  "loiReference": {
    "codeLoi": "c commerce",
    "divisionCodeLoi": "L713-1"
  }
}