{
  "uid": "AMANR5L15SEA717460BTC1770P0D1N2",
  "identifiant": {
    "legislature": "15",
    "numero": "2",
    "numRect": "0",
    "saisine": {
      "texteLegislatifRef": "PIONANR5L15BTC1770",
      "numeroPartiePLF": "0",
      "organeExamen": "PO717460",
      "mentionSecondeDeliberation": "0"
    }
  },
  "numeroLong": "2",
  "etapeTexte": "1ère lecture (2ème assemblée saisie)",
  "triAmendement": "eaaaaaaaaaaaaaaaaaaaaaaaaaaaaaaaaaaaaaaaaaaaaaaaaam",
  "cardinaliteAmdtMultiples": "1",
  "etat": "Retiré",
  "signataires": {
    "auteur": {
      "typeAuteur": "Depute",
      "acteurRef": "PA720976",
      "groupePolitiqueRef": "PO730970"
    },
    "cosignatairesRefs": [
      "PA720976"
    ],
    "texteAffichable": "M.&#160;Mathiasin"
  },
  "pointeurFragmentTexte": {
    "division": {
      "titre": "Article unique",
      "articleDesignationCourte": "ART. UNIQUE",
      "type": "ARTICLE",
      "avantAApres": "A",
      "divisionRattachee": "ARTICLE UNIQUE",
      "urlDivisionTexteVise": "/15/textes/1770.asp#D_Article_unique"
    },
    "alinea": {
      "numero": "2"
    }
  },
  "corps": {
    "dispositif": "<p style=\"text-align: justify;\">&#192; l&#8217;alin&#233;a&#160;2, substituer aux mots&#160;:</p><p style=\"text-align: justify;\">&#171;&#160;un repr&#233;sentant&#160;&#187;</p><p style=\"text-align: justify;\">les mots&#160;:</p><p style=\"text-align: justify;\">&#171;&#160;deux repr&#233;sentants&#160;&#187;.</p>",
    "exposeSommaire": "<p style=\"text-align: justify;\">Cet amendement vise &#224; assurer une juste repr&#233;sentation des fonctionnaires territoriaux du service d&#233;partemental d&#8217;incendie et de secours n&#8217;ayant pas la qualit&#233; de sapeur-pompier professionnel, en parall&#232;le de ce qui existe pour les sapeurs-pompiers professionnels et pour les sapeurs-pompiers volontaires.</p><p style=\"text-align: justify;\">Cette repr&#233;sentation doit en effet &#234;tre &#233;quilibr&#233;e par rapport aux sapeurs-pompiers professionnels et volontaires qui disposent &#224; la fois d&#8217;un repr&#233;sentant officier et d&#8217;un repr&#233;sentant non officier.</p><p style=\"text-align: justify;\">Elle doit aussi &#234;tre &#233;quitable et permettre qu&#8217;il y ait un repr&#233;sentant des fonctionnaires territoriaux de cat&#233;gorie A ou B et un autre de cat&#233;gorie C.</p>"
  },
  "representations": [
    {
      "nom": "PDF",
      "typeMime": {
        "type": "application",
        "subType": "PDF"
      },
      "statutRepresentation": {
        "verbatim": true,
        "canonique": true,
        "officielle": true,
        "transcription": false,
        "enregistrement": false
      },
      "contenu": {
        "documentURI": "/15/amendements/1770/AN/2.pdf"
      }
    }
  ],
  "dateDepot": "2019-03-20T01:00:00.000+01:00",
  "dateDistribution": "2019-03-25T01:00:00.000+01:00",
  "article99": "0",
  "loiReference": {}
}