{
  "uid": "AMANR5L15SEA717460BTC1237P0D1N2537",
  "identifiant": {
    "legislature": "15",
    "numero": "2537",
    "numRect": "0",
    "saisine": {
      "texteLegislatifRef": "PRJLANR5L15BTC1237",
      "numeroPartiePLF": "0",
      "organeExamen": "PO717460",
      "mentionSecondeDeliberation": "1"
    }
  },
  "numeroLong": "2537",
  "etapeTexte": "1ère lecture (1ère assemblée saisie)",
  "triAmendement": "oaoaaaaaaaaaaaaaaaaaaaaaaaaaaaaaaaaaaaaaaaaaaaaaaaqw",
  "cardinaliteAmdtMultiples": "1",
  "etat": "Discuté",
  "signataires": {
    "auteur": {
      "typeAuteur": "Depute",
      "acteurRef": "PA719684",
      "groupePolitiqueRef": "PO730964"
    },
    "cosignatairesRefs": [
      "PA721134",
      "PA719684"
    ],
    "texteAffichable": "Mme&#160;Dubost et M.&#160;Lescure"
  },
  "pointeurFragmentTexte": {
    "division": {
      "titre": "Article 61 septies",
      "articleDesignationCourte": "ART. 61 SEPTIES",
      "type": "ARTICLE",
      "avantAApres": "A",
      "divisionRattachee": "ARTICLE 61 SEPTIES",
      "urlDivisionTexteVise": "/15/textes/1237.asp#D_Article_61_septies"
    },
    "alinea": {
      "avantAApres": "Apres",
      "numero": "6"
    }
  },
  "corps": {
    "dispositif": "<p style=\"text-align: justify;\">Apr&#232;s l&#8217;alin&#233;a&#160;6, ins&#233;rer l&#8217;alin&#233;a suivant&#160;:</p><p style=\"text-align: justify;\">&#171;&#160;Peut faire publiquement &#233;tat de sa qualit&#233; de soci&#233;t&#233; &#224; mission, la personne morale de droit priv&#233; qui r&#233;pond aux conditions mentionn&#233;es au pr&#233;sent article et qui est immatricul&#233;e, sous r&#233;serve de la conformit&#233; de ses statuts, au registre du commerce et des soci&#233;t&#233;s avec la mention de la qualit&#233; de soci&#233;t&#233; &#224; mission, dans des conditions pr&#233;cis&#233;es par d&#233;cret en Conseil d&#8217;&#201;tat.&#160;&#187;</p>",
    "exposeSommaire": "<p style=\"text-align: justify;\">Cet amendement permet d&#8217;organiser le r&#233;gime juridique de la mission et notamment le champ des soci&#233;t&#233;s qui peuvent se pr&#233;valoir d&#8217;&#234;tre des soci&#233;t&#233;s &#224; mission. Un contr&#244;le aura notamment lieu au moment de l&#8217;immatriculation (le cas &#233;ch&#233;ant rectificative) au RCS de la &#171;&#160;soci&#233;t&#233; &#224; mission&#160;&#187;, dont les statuts devront respecter les conditions fix&#233;es au pr&#233;sent article.</p>"
  },
  "representations": [
    {
      "nom": "PDF",
      "typeMime": {
        "type": "application",
        "subType": "PDF"
      },
      "statutRepresentation": {
        "verbatim": true,
        "canonique": true,
        "officielle": true,
        "transcription": false,
        "enregistrement": false
      },
      "contenu": {
        "documentURI": "/15/amendements/1237/AN/2537.pdf"
      }
    }
  ],
  "seanceDiscussion": "RUANR5L15S2019IDS21349",
  "sort": {
    "dateSaisie": "2018-10-05T11:11:17.000+02:00",
    "sortEnSeance": "Adopté"
  },
  "dateDepot": "2018-09-21T02:00:00.000+02:00",
  "dateDistribution": "2018-09-26T02:00:00.000+02:00",
  "article99": "0",
  "loiReference": {}
}