{
  "uid": "AMANR5L15SEA717460B1408P0D1N323",
  "identifiant": {
    "legislature": "15",
    "numero": "323",
    "numRect": "0",
    "saisine": {
      "texteLegislatifRef": "PRJLANR5L15B1408",
      "numeroPartiePLF": "0",
      "organeExamen": "PO717460",
      "mentionSecondeDeliberation": "0"
    }
  },
  "numeroLong": "323",
  "etapeTexte": "Nouvelle Lecture",
  "triAmendement": "becaaaaaaaaaaaaaaaaaaaaaaaaaaaaaaaaaaaaaaaaaaaaaaahzzzzzzzzzzzzzzzzzzzzzzzzzzzzzve",
  "cardinaliteAmdtMultiples": "1",
  "amendementParent": "AMANR5L15SEA717460B1408P0D1N44",
  "etat": "Discuté",
  "signataires": {
    "auteur": {
      "typeAuteur": "Depute",
      "acteurRef": "PA267585",
      "groupePolitiqueRef": "PO744425"
    },
    "cosignatairesRefs": [
      "PA267355",
      "PA267780",
      "PA721632",
      "PA721094",
      "PA1960",
      "PA642935",
      "PA266788",
      "PA610775",
      "PA267585",
      "PA2952",
      "PA332228",
      "PA721194",
      "PA267241",
      "PA721110",
      "PA720230",
      "PA721486",
      "PA642868",
      "PA722030",
      "PA267330",
      "PA268019",
      "PA267766",
      "PA331567",
      "PA695100",
      "PA719806"
    ],
    "texteAffichable": "M.&#160;Vercamer,  Mme&#160;Auconie, M.&#160;Becht, M.&#160;Benoit, M.&#160;Bournazel, M.&#160;Guy&#160;Bricout, M.&#160;Christophe, Mme&#160;de La Raudi&#232;re, M.&#160;Demilly, Mme&#160;Fr&#233;d&#233;rique&#160;Dumas, M.&#160;Dunoyer, Mme&#160;Firmin Le Bodo, M.&#160;Gom&#232;s, M.&#160;Meyer&#160;Habib, M.&#160;Herth, M.&#160;Lagarde, Mme&#160;Lemoine, M.&#160;Leroy, Mme&#160;Magnier, M.&#160;Morel-&#192;-L&apos;Huissier, M.&#160;Naegelen, Mme&#160;Sanquer, M.&#160;Warsmann et M.&#160;Zumkeller"
  },
  "pointeurFragmentTexte": {
    "division": {
      "titre": "Article 8",
      "articleDesignationCourte": "ART. 8",
      "type": "ARTICLE",
      "avantAApres": "A",
      "divisionRattachee": "ARTICLE 8",
      "urlDivisionTexteVise": "/15/textes/1408.asp#D_Article_8"
    },
    "alinea": {
      "numero": "106"
    }
  },
  "corps": {
    "dispositif": "<p style=\"text-align: justify;\">I. &#8211; &#192; l&#8217;alin&#233;a&#160;8, substituer au taux&#160;:</p><p style=\"text-align: justify;\">&#171;&#160;15&#160;%&#160;&#187;</p><p style=\"text-align: justify;\">le taux&#160;:</p><p style=\"text-align: justify;\">&#171;&#160;25&#160;%&#160;&#187;</p><p style=\"text-align: justify;\">II.&#160;&#8211;&#160;Compl&#233;ter cet amendement par les deux alin&#233;as suivants&#160;:</p><p style=\"text-align: justify;\">&#171;&#160;III. &#8211; Compl&#233;ter cet article par l&#8217;alin&#233;a suivant&#160;:</p><p style=\"text-align: justify;\">&#171;&#160;XVI. &#8211; La perte de recettes pour les organismes de s&#233;curit&#233; sociale est compens&#233;e &#224; due concurrence par la majoration des droits mentionn&#233;s aux articles 575 et 575 A du code g&#233;n&#233;ral des imp&#244;ts.&#160;&#187;</p>",
    "exposeSommaire": "<p>Le S&#233;nat a supprim&#233; la suppression de la suppression du TO/DE (dispositif d&#8217;exon&#233;rations de charges pour les emplois saisonniers agricoles pour les travailleurs occasionnels et les demandeurs d&#8217;emploi)</p><p>Un amendement du rapporteur Olivier VERAN adopt&#233; en commission des affaires sociales en nouvelle lecture vise &#224; r&#233;tablir le dispositif adopt&#233; en premi&#232;re lecture &#224; l&#8217;assembl&#233;e nationale, &#224; savoir une exon&#233;ration totale jusqu&#8217;&#224; 1,15 SMIC puis d&#233;gressive jusqu&#8217;&#224; 1,6 SMIC pour l&#8217;ann&#233;e 2019 puis, &#224; partir de 2020, une exon&#233;ration totale jusqu&#8217;&#224; 1,10 SMIC puis d&#233;gressive jusqu&#8217;&#224; 1,6 SMIC.</p><p>Nous regrettons ce retour en arri&#232;re, qui aura comme cons&#233;quence un manque &#224; gagner de 39 millions d&#8217;euros pour les agriculteurs et ce, pour la seule ann&#233;e 2019.</p><p>Alors que nos agriculteurs ont plus que jamais besoin d&#8217;une main d&#8217;&#339;uvre comp&#233;titive, le maintien d&#8217;un plafond d&#8217;exon&#233;ration totale &#224; 1,15 SMIC aggravera les distorsions de concurrence et de comp&#233;titivit&#233; avec les autres pays producteurs. Dans un contexte de dumping social av&#233;r&#233; avec nos concurrents europ&#233;ens, elle se traduira in&#233;vitablement par une hausse du travail ill&#233;gal.</p><p>Nous consid&#233;rons au contraire qu&#8217;il est urgent d&#8217;envoyer des signaux de soutien &#224; notre agriculture, et particuli&#232;rement envers ces fili&#232;res grandes pourvoyeuses de main d&#8217;&#339;uvre que sont l&#8217;arboriculture, la viticulture, le maraichage, ou l&#8217;horticulture.</p><p>Le pr&#233;sent sous amendement vise donc &#224; accorder un sursis &#224; nos agriculteurs et pr&#233;voit un plafond d&#8217;exon&#233;ration total en 2019 &#224; 1,25 SMIC.</p>"
  },
  "representations": [
    {
      "nom": "PDF",
      "typeMime": {
        "type": "application",
        "subType": "PDF"
      },
      "statutRepresentation": {
        "verbatim": true,
        "canonique": true,
        "officielle": true,
        "transcription": false,
        "enregistrement": false
      },
      "contenu": {
        "documentURI": "/15/amendements/1408/AN/323.pdf"
      }
    }
  ],
  "seanceDiscussion": "RUANR5L15S2019IDS21382",
  "sort": {
    "dateSaisie": "2018-11-27T20:12:53.000+01:00",
    "sortEnSeance": "Rejeté"
  },
  "dateDepot": "2018-11-26T01:00:00.000+01:00",
  "dateDistribution": "2018-11-27T01:00:00.000+01:00",
  "article99": "0",
  "loiReference": {}
}