{
  "uid": "AMANR5L15PO757134B1088P0D1N1574",
  "identifiant": {
    "legislature": "15",
    "numero": "1574",
    "numRect": "0",
    "saisine": {
      "texteLegislatifRef": "PRJLANR5L15B1088",
      "numeroPartiePLF": "0",
      "organeExamen": "PO757134",
      "mentionSecondeDeliberation": "0"
    }
  },
  "numeroLong": "1574",
  "etapeTexte": "1ère lecture (1ère assemblée saisie)",
  "triAmendement": "maaaaaaaaaaaaaaaaaaaaaaaaaaaaaaaaaaaaaaaaaaaaaaaaafc",
  "cardinaliteAmdtMultiples": "1",
  "etat": "Discuté",
  "signataires": {
    "auteur": {
      "typeAuteur": "Depute",
      "acteurRef": "PA722142",
      "groupePolitiqueRef": "PO730958"
    },
    "cosignatairesRefs": [
      "PA720422",
      "PA2150",
      "PA588884",
      "PA719578",
      "PA721062",
      "PA720846",
      "PA721202",
      "PA721210",
      "PA721226",
      "PA722142",
      "PA721960",
      "PA720430",
      "PA719676",
      "PA720892",
      "PA718868",
      "PA720286",
      "PA718860"
    ],
    "texteAffichable": "M.&#160;Ruffin,  Mme&#160;Autain, M.&#160;Bernalicis, M.&#160;Coquerel, M.&#160;Corbi&#232;re, Mme&#160;Fiat, M.&#160;Lachaud, M.&#160;Larive, M.&#160;M&#233;lenchon, Mme&#160;Obono, Mme&#160;Panot, M.&#160;Prud&apos;homme, M.&#160;Quatennens, M.&#160;Ratenon, Mme&#160;Ressiguier, Mme&#160;Rubin et Mme&#160;Taurine"
  },
  "pointeurFragmentTexte": {
    "division": {
      "titre": "Article 62",
      "articleDesignationCourte": "APRÈS ART. 62",
      "type": "ARTICLE",
      "avantAApres": "Apres",
      "divisionRattachee": "APRÈS L'ARTICLE 62, insérer l'article suivant:",
      "articleAdditionnel": "1",
      "urlDivisionTexteVise": "/15/textes/1088.asp#D_Article_62"
    }
  },
  "corps": {
    "dispositif": "<p style=\"text-align: justify;\">Le Gouvernement remet au Parlement, dans un d&#233;lai d&#8217;un an &#224; compter de la promulgation de la pr&#233;sente loi, un rapport d&#8217;information sur l&#8217;opportunit&#233; de cr&#233;er des conseils d&#8217;usagers, d&#8217;associations et des collectivit&#233;s territoriales associ&#233;s &#224; la gouvernance des entreprises.</p>",
    "exposeSommaire": "<p style=\"text-align: justify;\">Si l&#8217;entreprise est d&#8217;abord et avant tout un rapport entre le capital et le travail, elle s&#8217;inscrit dans un territoire, concerne ses clients et son activit&#233; a des effets sur l&#8217;environnement o&#249; elle op&#232;re. D&#232;s lors, ils nous semble n&#233;cessaire et b&#233;n&#233;fique que ces diff&#233;rentes parties prenantes aient leur mot &#224; dire que l&#8217;activit&#233; des entreprises en question. Ce rapport fera des propositions sur la forme que pourrait prendre la participation des parties prenantes &#224; la vie de l&#8217;entreprise, &#224; partir de quels seuils, et les mesures &#224; prendre pour cr&#233;er ces conseils d&#8217;usagers, d&#8217;associations et de collectivit&#233;s territoriales.</p>"
  },
  "representations": [
    {
      "nom": "PDF",
      "typeMime": {
        "type": "application",
        "subType": "PDF"
      },
      "statutRepresentation": {
        "verbatim": true,
        "canonique": true,
        "officielle": true,
        "transcription": false,
        "enregistrement": false
      },
      "contenu": {
        "documentURI": "/15/amendements/1088/CSPACTE/1574.pdf"
      }
    }
  ],
  "sort": {
    "dateSaisie": "2018-09-14T23:48:27.000+02:00",
    "sortEnSeance": "Non soutenu"
  },
  "dateDepot": "2018-09-03T02:00:00.000+02:00",
  "dateDistribution": "2018-09-12T02:00:00.000+02:00",
  "article99": "0",
  "loiReference": {
    "codeLoi": "zzzz rapport"
  }
}