{
  "uid": "AMANR5L15SEA717460BTC2062P0D1N199",
  "identifiant": {
    "legislature": "15",
    "numero": "199",
    "numRect": "0",
    "saisine": {
      "texteLegislatifRef": "PIONANR5L15BTC2062",
      "numeroPartiePLF": "0",
      "organeExamen": "PO717460",
      "mentionSecondeDeliberation": "0"
    }
  },
  "numeroLong": "199",
  "etapeTexte": "1ère lecture (1ère assemblée saisie)",
  "triAmendement": "iiaaaaaaaaaaaaaaaaaaaaaaaaaaaaaaaaaaaaaaaaaaaaaaaay",
  "cardinaliteAmdtMultiples": "1",
  "etat": "Retiré",
  "signataires": {
    "auteur": {
      "typeAuteur": "Depute",
      "acteurRef": "PA721888",
      "groupePolitiqueRef": "PO730964"
    },
    "cosignatairesRefs": [
      "PA721888"
    ],
    "texteAffichable": "M.&#160;Raphan"
  },
  "pointeurFragmentTexte": {
    "division": {
      "titre": "Article 6",
      "articleDesignationCourte": "APRÈS ART. 6",
      "type": "ARTICLE",
      "avantAApres": "Apres",
      "divisionRattachee": "APRÈS L'ARTICLE 6, insérer l'article suivant:",
      "articleAdditionnel": "1",
      "urlDivisionTexteVise": "/15/textes/2062.asp#D_Article_6"
    }
  },
  "corps": {
    "dispositif": "<p>Apr&#232;s l&#8217;article 6-4 de la loi du 21 juin 2004 pr&#233;cit&#233;e, tel qu&#8217;il r&#233;sulte de l&#8217;article 6 de la pr&#233;sente loi, est ins&#233;r&#233; un article 6-5 :</p><p>&#160;</p><p>Les op&#233;rateurs de plateformes au sens de l&#8217;article L 111-7 du code de la consommation s&#8217;assurent de la s&#233;curit&#233; de leurs utilisateurs et de la protection de leurs droits fondamentaux, en particulier le respect de leur dignit&#233;. A cet effet, ils mettent en &#339;uvre les moyens proportionn&#233;s et n&#233;cessaires &#224; cette obligation de vigilance sous le contr&#244;le du juge et du r&#233;gulateur.</p><p>&#160;</p><p>Cette obligation se traduit par l&#8217;application raisonn&#233;e et raisonnable de certains principes.</p><p>&#160;</p><p>L&#8217;aspect raisonnable de l&#8217;obligation est soumis &#224; l&#8217;appr&#233;ciation de l'autorit&#233; administrative, notamment en ce qui concerne :</p><p>&#160;- l'ampleur et la gravit&#233; des dommages constat&#233;s sur la plateforme</p><p>&#160;- la taille, la rentabilit&#233; et le niveau de maturit&#233; commerciale de la plateforme</p><p>&#160;- le mod&#232;le &#233;conomique sous-jacent de la plateforme et son approche des risques en ligne.</p>",
    "exposeSommaire": "<p>&#160;</p><p>Les entreprises concern&#233;es doivent, au minimum, effectuer des efforts &#8220;raisonnables&#8221; dans les domaines suivants :</p><p>&#160;- Veiller &#224; ce que les modalit&#233;s et les conditions g&#233;n&#233;rales d&#8217;utilisation de la plateforme soient conformes aux normes fix&#233;es ;</p><p>&#160;- Appliquer leurs propres modalit&#233;s et conditions g&#233;n&#233;rales d&#8217;utilisation de mani&#232;re efficace et coh&#233;rente ;</p><p>&#160;- Prendre des mesures rapides, transparentes et efficaces &#224; la suite des signalements faits par les utilisateurs ;</p><p>&#160;- Agir rapidement contre les contenus criminels les plus graves (par exemple : contenus terroristes, exploitation sexuelle des mineurs);</p><p>&#160;- Soutenir les pouvoirs judiciaires dans leurs enqu&#234;tes afin de poursuivre en justice les criminels enfreignant la r&#233;glementation sur les contenus en ligne ;</p><p>&#160;- Offrir un soutien appropri&#233; aux utilisateurs ayant subi un pr&#233;judice ;</p><p>&#160;- Analyser r&#233;guli&#232;rement leurs efforts dans la lutte contre les dommages en ligne et adapter leurs processus internes pour favoriser une am&#233;lioration au fil du temps ;</p><p>&#160;- Mettre en &#339;uvre les principes de protection de la vie priv&#233;e et de la s&#233;curit&#233; des utilisateurs d&#232;s la conception de leurs produits et pendant leurs cycles de d&#233;veloppements.</p><p>&#160;</p><p>L&#8217;obligation de vigilance ne doit pas interf&#233;rer avec les protections et les obligations pr&#233;vues par les instruments juridiques existants.</p>"
  },
  "representations": [
    {
      "nom": "PDF",
      "typeMime": {
        "type": "application",
        "subType": "PDF"
      },
      "statutRepresentation": {
        "verbatim": true,
        "canonique": true,
        "officielle": true,
        "transcription": false,
        "enregistrement": false
      },
      "contenu": {
        "documentURI": "/15/amendements/2062/AN/199.pdf"
      }
    }
  ],
  "dateDepot": "2019-06-28T02:00:00.000+02:00",
  "dateDistribution": "2019-07-03T02:00:00.000+02:00",
  "article99": "0",
  "loiReference": {}
}