{
  "uid": "AMANR5L15SEA717460B1490P0D1N1185",
  "identifiant": {
    "legislature": "15",
    "numero": "1185",
    "numRect": "0",
    "saisine": {
      "texteLegislatifRef": "PRJLANR5L15B1490",
      "numeroPartiePLF": "0",
      "organeExamen": "PO717460",
      "mentionSecondeDeliberation": "0"
    }
  },
  "numeroLong": "1185",
  "etapeTexte": "Nouvelle Lecture",
  "triAmendement": "cjaaaaaaaaaaaaaaaaaaaaaaaaaaaaaaaaaaaaaaaaaaaaaaaai",
  "cardinaliteAmdtMultiples": "1",
  "etat": "Irrecevable",
  "signataires": {
    "auteur": {
      "typeAuteur": "Depute",
      "acteurRef": "PA643134",
      "groupePolitiqueRef": "PO730934"
    },
    "cosignatairesRefs": [
      "PA643134"
    ],
    "texteAffichable": "Mme&#160;Valentin"
  },
  "pointeurFragmentTexte": {
    "division": {
      "titre": "Article 22 bis",
      "articleDesignationCourte": "ART. 22 BIS",
      "type": "ARTICLE",
      "avantAApres": "A",
      "divisionRattachee": "ARTICLE 22 BIS",
      "urlDivisionTexteVise": "/15/textes/1490.asp#D_Article_22_bis"
    }
  },
  "corps": {
    "dispositif": "<p>compl&#233;ter l'article 22 BIS par :</p><p>&#160;</p><p>Apr&#232;s le f du 2&#176; du A de l'article 278-Bis du code g&#233;n&#233;ral des impots, il est compl&#233;t&#233;&#160; ...les produits &#233;lectriques et &#233;lectroniques reconditionn&#233;s.</p><p>II.&#160;&#8211;&#160;Compl&#233;ter cet article par l&#8217;alin&#233;a suivant&#160;:</p><p>&#171;&#160;II.&#160;&#8211;&#160;La perte de recettes pour les collectivit&#233;s territoriales est compens&#233;e &#224; due concurrence par la majoration de la dotation globale de fonctionnement et, corr&#233;lativement pour l&#8217;&#201;tat, par la cr&#233;ation d&#8217;une taxe additionnelle aux droits mentionn&#233;s aux articles 575 et 575 A du code g&#233;n&#233;ral des imp&#244;ts.&#160;&#187;.</p>",
    "exposeSommaire": "<p>cet amendement vise &#224; rendre eligible au taux r&#233;duit de tva les produit electrique et &#233;lectroniques reconditionn&#233;s</p>"
  },
  "representations": [
    {
      "nom": "PDF",
      "typeMime": {
        "type": "application",
        "subType": "PDF"
      },
      "statutRepresentation": {
        "verbatim": true,
        "canonique": true,
        "officielle": true,
        "transcription": false,
        "enregistrement": false
      },
      "contenu": {
        "documentURI": "/15/amendements/1490/AN/1185.pdf"
      }
    }
  ],
  "dateDepot": "2018-12-15T01:00:00.000+01:00",
  "dateDistribution": "2018-12-15T01:00:00.000+01:00",
  "article99": "0",
  "loiReference": {}
}