{
  "uid": "AMANR5L15SEA717460BTC1761P0D1N639",
  "identifiant": {
    "legislature": "15",
    "numero": "639",
    "numRect": "0",
    "saisine": {
      "texteLegislatifRef": "PRJLANR5L15BTC1761",
      "numeroPartiePLF": "0",
      "organeExamen": "PO717460",
      "mentionSecondeDeliberation": "0"
    }
  },
  "numeroLong": "639",
  "etapeTexte": "Nouvelle Lecture",
  "triAmendement": "aesaaaaaaaaaaaaaaaaaaaaaaaaaaaaaaaaaaaaaaaaaaaaaaadjdu",
  "cardinaliteAmdtMultiples": "1",
  "etat": "Discuté",
  "signataires": {
    "auteur": {
      "typeAuteur": "Depute",
      "acteurRef": "PA718784",
      "groupePolitiqueRef": "PO730934"
    },
    "cosignatairesRefs": [
      "PA720630",
      "PA767",
      "PA709315",
      "PA722390",
      "PA718784",
      "PA642847",
      "PA721474"
    ],
    "texteAffichable": "M.&#160;Pauget,  M.&#160;Viala, M.&#160;Cattin, M.&#160;Minot, M.&#160;Viry, M.&#160;Bazin et Mme&#160;Corneloup"
  },
  "pointeurFragmentTexte": {
    "division": {
      "titre": "Article 6",
      "articleDesignationCourte": "ART. 6",
      "type": "ARTICLE",
      "avantAApres": "A",
      "divisionRattachee": "ARTICLE 6",
      "urlDivisionTexteVise": "/15/textes/1761.asp#D_Article_6"
    },
    "alinea": {
      "numero": "20"
    }
  },
  "corps": {
    "dispositif": "<p style=\"text-align: justify;\">I.&#160;&#8211;&#160;&#192; la fin de l&#8217;alin&#233;a&#160;20, substituer aux mots&#160;:</p><p style=\"text-align: justify;\">&#171;&#160;moins de onze&#160;&#187;</p><p style=\"text-align: justify;\">les mots&#160;:</p><p style=\"text-align: justify;\">&#171;&#160;au moins cinquante&#160;&#187;.</p><p style=\"text-align: justify;\">II.&#160;&#8211;&#160;En cons&#233;quence, proc&#233;der &#224; la m&#234;me substitution &#224; la fin de l&#8217;alin&#233;a&#160;21.</p><p style=\"text-align: justify;\">III.&#160;&#8211;&#160;En cons&#233;quence, &#224; l&#8217;alin&#233;a&#160;22, substituer au mot&#160;:</p><p style=\"text-align: justify;\">&#171;&#160;onze&#160;&#187;</p><p style=\"text-align: justify;\">le mot&#160;:</p><p style=\"text-align: justify;\">&#171;&#160;cinquante&#160;&#187;.</p><p style=\"text-align: justify;\">IV.&#160;&#8211;&#160;En cons&#233;quence, &#224; l&#8217;alin&#233;a&#160;23, substituer au mot&#160;:</p><p style=\"text-align: justify;\">&#171;&#160;onze&#160;&#187;</p><p style=\"text-align: justify;\">le mot&#160;:</p><p style=\"text-align: justify;\">&#171;&#160;cinquante&#160;&#187;.</p>",
    "exposeSommaire": "<p style=\"text-align: justify;\">Les seuils au sein des petites entreprises g&#233;n&#232;rent de nombreuses contraintes (entretien pr&#233;alable en cas de licenciement collectif (au moins 10 salari&#233;s sur une p&#233;riode de 30 jours), consultation des IRP en cas de licenciement collectif, soumission au forfait social des cotisations patronales de pr&#233;voyance compl&#233;mentaire&#8230;) qui nuisent &#224; leur vitalit&#233;.</p><p style=\"text-align: justify;\">Aussi, il est souhaitable, afin de lib&#233;rer leurs &#233;nergies, de supprimer pour les TPE les seuils de 10 et 11 salari&#233;s.</p>"
  },
  "representations": [
    {
      "nom": "PDF",
      "typeMime": {
        "type": "application",
        "subType": "PDF"
      },
      "statutRepresentation": {
        "verbatim": true,
        "canonique": true,
        "officielle": true,
        "transcription": false,
        "enregistrement": false
      },
      "contenu": {
        "documentURI": "/15/amendements/1761/AN/639.pdf"
      }
    }
  ],
  "seanceDiscussion": "RUANR5L15S2019IDS21551",
  "sort": {
    "dateSaisie": "2019-03-15T11:47:43.000+01:00",
    "sortEnSeance": "Non soutenu"
  },
  "dateDepot": "2019-03-11T01:00:00.000+01:00",
  "dateDistribution": "2019-03-13T01:00:00.000+01:00",
  "article99": "0",
  "loiReference": {}
}