{
  "uid": "AMANR5L15SEA717460BTC1173P0D1N287",
  "identifiant": {
    "legislature": "15",
    "numero": "287",
    "numRect": "0",
    "saisine": {
      "texteLegislatifRef": "PRJLANR5L15BTC1173",
      "numeroPartiePLF": "0",
      "organeExamen": "PO717460",
      "mentionSecondeDeliberation": "0"
    }
  },
  "numeroLong": "287",
  "etapeTexte": "Nouvelle Lecture",
  "triAmendement": "n",
  "cardinaliteAmdtMultiples": "1",
  "etat": "Discuté",
  "signataires": {
    "auteur": {
      "typeAuteur": "Depute",
      "acteurRef": "PA719558",
      "groupePolitiqueRef": "PO730970"
    },
    "cosignatairesRefs": [
      "PA720720",
      "PA722162",
      "PA719044",
      "PA721734",
      "PA721182",
      "PA720092",
      "PA719874",
      "PA720178",
      "PA721924",
      "PA719504",
      "PA720772",
      "PA719558",
      "PA721530",
      "PA720326",
      "PA719266",
      "PA720162",
      "PA719640",
      "PA720256",
      "PA720002",
      "PA717151",
      "PA719488",
      "PA720598",
      "PA721234",
      "PA721984",
      "PA719210",
      "PA720334",
      "PA718978",
      "PA719918",
      "PA721836",
      "PA720728",
      "PA720764",
      "PA720652",
      "PA720968",
      "PA1276",
      "PA719938",
      "PA721992",
      "PA721418",
      "PA722284",
      "PA720746",
      "PA720976",
      "PA720924",
      "PA721976",
      "PA721742",
      "PA722374",
      "PA721608"
    ],
    "texteAffichable": "M.&#160;Balanant,  M.&#160;Bru, Mme&#160;Florennes, Mme&#160;Jacquier-Laforge, M.&#160;Latombe, Mme&#160;Bannier, M.&#160;Barrot, Mme&#160;Benin, M.&#160;Berta, M.&#160;Bolo, M.&#160;Bourlanges, M.&#160;Cubertafon, Mme&#160;de Sarnez, Mme&#160;de Vaucouleurs, Mme&#160;Deprez-Audebert, M.&#160;Duverg&#233;, Mme&#160;El Ha&#239;ry, Mme&#160;Elimas, Mme&#160;Essayan, M.&#160;Fanget, M.&#160;Fesneau, M.&#160;Fuchs, Mme&#160;Gallerneau, M.&#160;Garcia, M.&#160;Hammouche, M.&#160;Isaac-Sibille, M.&#160;Joncour, M.&#160;Lagleize, M.&#160;Lain&#233;, M.&#160;Laqhila, Mme&#160;Lasserre-David, Mme&#160;Luquet, M.&#160;Mathiasin, M.&#160;Mattei, Mme&#160;Mette, M.&#160;Michel-Kleisbauer, M.&#160;Mignola, M.&#160;Millienne, M.&#160;Pahun, M.&#160;Fr&#233;d&#233;ric&#160;Petit, Mme&#160;Maud&#160;Petit, Mme&#160;Poueyto, M.&#160;Ramos, M.&#160;Turquois et M.&#160;Waserman"
  },
  "pointeurFragmentTexte": {
    "division": {
      "titre": "Article 33 ter",
      "articleDesignationCourte": "ART. 33 TER",
      "type": "ARTICLE",
      "avantAApres": "A",
      "divisionRattachee": "ARTICLE 33 TER",
      "urlDivisionTexteVise": "/15/textes/1173.asp#D_Article_33_ter"
    }
  },
  "corps": {
    "dispositif": "<p style=\"text-align: justify;\">R&#233;diger ainsi cet article&#160;:</p><p style=\"text-align: justify;\">&#171;&#160;Apr&#232;s l&#8217;article L.&#160;313&#8209;14 du code de l&#8217;entr&#233;e et du s&#233;jour des &#233;trangers et du droit d&#8217;asile, il est ins&#233;r&#233; un article L.&#160;313&#8209;14&#8209;1 ainsi r&#233;dig&#233;&#160;:</p><p style=\"text-align: justify;\">&#171;&#160;<i>Art.&#160;L.&#160;313&#8209;14&#8209;1.&#160;</i>&#8211;&#160;Sauf si sa pr&#233;sence constitue une menace &#224; l&#8217;ordre public et &#224; condition qu&#8217;il ne vive pas en &#233;tat de polygamie, la carte de s&#233;jour temporaire mentionn&#233;e &#224; l&#8217;article L.&#160;313&#8209;11 ou la carte de s&#233;jour mentionn&#233;e aux 1&#176; et 2&#176; de l&#8217;article L.&#160;313&#8209;10 est d&#233;livr&#233;e, sans que soit opposable la condition pr&#233;vue &#224; l&#8217;article L.&#160;313&#8209;2, &#224; l&#8217;&#233;tranger, accueilli par les organismes mentionn&#233;s au premier alin&#233;a de l&#8217;article&#160;265&#8209;1 du code de l&#8217;action sociale et des familles, qui justifie de trois ann&#233;es d&#8217;activit&#233; ininterrompue au sein de ce dernier.&#160;</p><p style=\"text-align: justify;\">&#171;&#160;L&#8217;autorit&#233; administrative d&#233;livre l&#8217;une des cartes de s&#233;jour mentionn&#233;es au premier alin&#233;a du pr&#233;sent article, pour services rendus &#224; la collectivit&#233; et au regard d&#8217;une dur&#233;e de pr&#233;sence en France de l&#8217;&#233;tranger, selon des modalit&#233;s d&#233;finies par le d&#233;cret pr&#233;vu au dernier alin&#233;a qui fixe notamment les conditions dans lesquelles l&#8217;organisme qui accueille l&#8217;&#233;tranger &#233;met un avis sur son parcours d&#8217;int&#233;gration complet et son projet personnel dans le cadre de son activit&#233; au sein de ces organismes.</p><p style=\"text-align: justify;\">&#171;&#160;Un d&#233;cret en Conseil d&#8217;&#201;tat d&#233;finit les modalit&#233;s d&#8217;application du pr&#233;sent article.&#160;&#187;</p>",
    "exposeSommaire": "<p style=\"text-align: justify;\">Cet amendement a pour objet de renforcer la protection des compagnes et des compagnons d&#8217;Emma&#252;s. Leur activit&#233; solidaire au quotidien permettra d&#8217;acc&#233;der &#224; un titre de s&#233;jour au bout de trois ans de vie en communaut&#233;.</p><p style=\"text-align: justify;\">Un titre de s&#233;jour temporaire vie priv&#233;e et familiale pour motif humanitaire ou exceptionnel (comme pr&#233;vu &#224; l&#8217;article L313&#8209;14 du Code de l&#8217;entr&#233;e et du s&#233;jour des &#233;trangers et du droit d&#8217;asile pour services rendus &#224; la collectivit&#233; comme cela est pr&#233;cis&#233; au 2.1.4 de la circulaire du 28 novembre 2012 relative &#224; l&#8217;admission exceptionnelle au s&#233;jour des &#233;trangers en situation irr&#233;guli&#232;re.) existe pour des personnes qui participent &#224; l&#8217;effort national en rendant service &#224; la soci&#233;t&#233; ou en &#233;tant actif dans une association. Cet amendement vise &#224; faire le lien entre ce titre de s&#233;jour sp&#233;cifique et l&#8217;activit&#233; des compagnes et compagnons d&#8217;Emma&#252;s qui s&#8217;inscrit au c&#339;ur de la transition &#233;cologique et solidaire. Leurs actions autour de la collecte, de la r&#233;utilisation et du recyclage ou toutes autres formes d&#8217;activit&#233;s permettent de d&#233;velopper une tr&#232;s importante solidarit&#233; &#224; l&#8217;&#233;chelle locale, r&#233;gionale, nationale et internationale.&#160;</p><p style=\"text-align: justify;\">&#202;tre compagnes ou compagnons d&#8217;Emma&#252;s c&#8217;est aussi acc&#233;der &#224; un parcours d&#8217;int&#233;gration complet &#224; travers l&#8217;apprentissage du fran&#231;ais, l&#8217;acquisition, l&#8217;approfondissement et la valorisation de comp&#233;tences professionnelles, la d&#233;couverte du vivre ensemble et des fondamentaux comme la citoyennet&#233;, la mixit&#233;, la solidarit&#233;, la la&#239;cit&#233; et la tol&#233;rance.<br />Cet amendement permettra &#233;galement de renforcer la circulaire du 28 novembre 2012 qui clarifie les conditions de r&#233;gularisation des &#233;trangers en situation irr&#233;guli&#232;re et d&#8217;inscrire dans la loi la particularit&#233; des compagnes et des compagnons Emma&#252;s.</p><p style=\"text-align: justify;\">Les communaut&#233;s Emma&#252;s existent depuis 1949. Elles sont 119 sur le territoire et accueillent plus de 4 500 femmes et hommes en difficult&#233;s.</p><p style=\"text-align: justify;\">Les compagnes et les compagnons Emma&#252;s en situation irr&#233;guli&#232;re comme r&#233;guli&#232;re participent &#224; un &#233;cosyst&#232;me solidaire. Sans rien co&#251;ter au contribuable, ils cotisent &#224; la s&#233;curit&#233; sociale, &#224; l&#8217;URSSAF, &#224; la caisse de retraite et d&#233;clarent leurs revenus. Cet amendement permettra de valoriser ce travail d&#8217;utilit&#233; citoyenne en permettant leur acc&#232;s &#224; un titre de s&#233;jour.</p><p style=\"text-align: justify;\">De mani&#232;re plus large, ce statut permettrait de respecter la dignit&#233; des personnes accueillies et de reconna&#238;tre l&#8217;int&#233;r&#234;t du mod&#232;le innovant et original propos&#233; par le mouvement Emma&#252;s ou d&#8217;autres associations en mati&#232;re d&#8217;insertion sociale.</p>"
  },
  "representations": [
    {
      "nom": "PDF",
      "typeMime": {
        "type": "application",
        "subType": "PDF"
      },
      "statutRepresentation": {
        "verbatim": true,
        "canonique": true,
        "officielle": true,
        "transcription": false,
        "enregistrement": false
      },
      "contenu": {
        "documentURI": "/15/amendements/1173/AN/287.pdf"
      }
    }
  ],
  "seanceDiscussion": "RUANR5L15S2018IDS21205",
  "sort": {
    "dateSaisie": "2018-07-27T00:37:58.000+02:00",
    "sortEnSeance": "Rejeté"
  },
  "dateDepot": "2018-07-20T02:00:00.000+02:00",
  "dateDistribution": "2018-07-24T02:00:00.000+02:00",
  "article99": "0",
  "loiReference": {}
}