{
  "uid": "AMANR5L15SEA717460B2272P2D1N1225",
  "identifiant": {
    "legislature": "15",
    "numero": "1225",
    "numRect": "0",
    "saisine": {
      "texteLegislatifRef": "PRJLANR5L15B2272",
      "numeroPartiePLF": "2",
      "organeExamen": "PO717460",
      "mentionSecondeDeliberation": "0"
    }
  },
  "numeroLong": "II-1225",
  "etapeTexte": "1ère lecture (1ère assemblée saisie)",
  "triAmendement": "besaaaaaaaaaaaaaaaaaaaaaaaaaaaaaaaaaaaaaaaaaaaaaaaak",
  "cardinaliteAmdtMultiples": "1",
  "etat": "Irrecevable",
  "signataires": {
    "auteur": {
      "typeAuteur": "Depute",
      "acteurRef": "PA332523",
      "groupePolitiqueRef": "PO730934"
    },
    "cosignatairesRefs": [
      "PA608016",
      "PA718850",
      "PA267204",
      "PA267429",
      "PA722390",
      "PA346218",
      "PA266776",
      "PA721678",
      "PA605036",
      "PA712015",
      "PA340853",
      "PA332523",
      "PA719272",
      "PA606712",
      "PA266808",
      "PA720630",
      "PA709315",
      "PA267378",
      "PA608416"
    ],
    "texteAffichable": "Mme&#160;Dalloz,  M.&#160;Abad, M.&#160;Cordier, Mme&#160;Corneloup, M.&#160;Cinieri, M.&#160;Masson, M.&#160;Leclerc, M.&#160;Hetzel, M.&#160;Reiss, M.&#160;Minot, Mme&#160;Levy, M.&#160;Sermier, M.&#160;Lurton, Mme&#160;Louwagie, M.&#160;Rolland, M.&#160;Viala, M.&#160;Reda, Mme&#160;Meunier et M.&#160;Dive"
  },
  "pointeurFragmentTexte": {
    "missionVisee": {
      "idMissionAN": "804",
      "libelleMission": "Cohésion des territoires",
      "codeMissionPLF": "B",
      "libelleMissionPLF": "Répartition, par mission et programme, des crédits du budget général"
    },
    "division": {
      "titre": "Article 75",
      "articleDesignationCourte": "APRÈS ART. 75",
      "type": "ARTICLE",
      "avantAApres": "Apres",
      "divisionRattachee": "APRÈS L'ARTICLE 75, insérer l'article suivant:",
      "articleAdditionnel": "1",
      "urlDivisionTexteVise": "/15/textes/2272C.asp#D_Article_75"
    }
  },
  "corps": {},
  "representations": [
    {
      "nom": "PDF",
      "typeMime": {
        "type": "application",
        "subType": "PDF"
      },
      "statutRepresentation": {
        "verbatim": true,
        "canonique": true,
        "officielle": true,
        "transcription": false,
        "enregistrement": false
      },
      "contenu": {
        "documentURI": "/15/amendements/2272C/AN/1225.pdf"
      }
    }
  ],
  "dateDepot": "2019-10-30T01:00:00.000+01:00",
  "dateDistribution": "2019-11-06T01:00:00.000+01:00",
  "article99": "0",
  "loiReference": {
    "codeLoi": "c action sociale et familles",
    "divisionCodeLoi": "L313-11-12"
  }
}