{
  "uid": "AMANR5L15PO59048B1490P0D1N279",
  "identifiant": {
    "legislature": "15",
    "numero": "279",
    "numRect": "0",
    "saisine": {
      "texteLegislatifRef": "PRJLANR5L15B1490",
      "numeroPartiePLF": "0",
      "organeExamen": "PO59048",
      "mentionSecondeDeliberation": "0"
    }
  },
  "numeroLong": "CF279",
  "etapeTexte": "Nouvelle Lecture",
  "triAmendement": "kciaaaaaaaaaaaaaaaaaaaaaaaaaaaaaaaaaaaaaaaaaaaaaaai",
  "cardinaliteAmdtMultiples": "1",
  "etat": "Irrecevable",
  "signataires": {
    "auteur": {
      "typeAuteur": "Depute",
      "acteurRef": "PA718962",
      "groupePolitiqueRef": "PO730964"
    },
    "cosignatairesRefs": [
      "PA720944",
      "PA718962",
      "PA721372"
    ],
    "texteAffichable": "M.&#160;Zulesi,  Mme&#160;Park et M.&#160;Pichereau"
  },
  "pointeurFragmentTexte": {
    "division": {
      "titre": "Article 58 bis",
      "articleDesignationCourte": "APRÈS ART. 58 BIS",
      "type": "ARTICLE",
      "avantAApres": "Apres",
      "divisionRattachee": "APRÈS L'ARTICLE 58 BIS, insérer l'article suivant:",
      "articleAdditionnel": "1",
      "urlDivisionTexteVise": "/15/textes/1490.asp#D_Article_58_bis"
    }
  },
  "corps": {
    "dispositif": "<p>I. - Le 19&#176; ter de l'article 81 du code g&#233;n&#233;ral des imp&#244;ts est compl&#233;t&#233; par un c ainsi r&#233;dig&#233; :</p><p>&#171; c. En l'absence de prise en charge pr&#233;vue &#224; l'article L. 3261-2 du code du travail, l'avantage r&#233;sultant de la prise en charge, par une collectivit&#233; territoriale, par un &#233;tablissement public de coop&#233;ration intercommunale ou par P&#244;le emploi, des frais de carburant ou d'alimentation de v&#233;hicules &#233;lectriques engag&#233;s par les salari&#233;s pour leurs d&#233;placements entre leur r&#233;sidence habituelle et leur lieu de travail, lorsqu'ils sont situ&#233;s &#224; une distance d'au moins trente kilom&#232;tres l'un de l'autre, ou pour leurs d&#233;placements entre leur r&#233;sidence habituelle et leur lieu de travail, en tant que conducteur en covoiturage quelle que soit la distance, dans la limite de 240 &#8364; par an ; &#187;.</p><p>II. - Le e du 4&#176; du III de l'article L. 136-1-1 du code de la s&#233;curit&#233; sociale est compl&#233;t&#233; par les mots : &#171; , ainsi que l'avantage mentionn&#233; au cdu 19&#176; ter du m&#234;me article, dans la limite pr&#233;vue au m&#234;me c &#187;.</p><p>III. - L'article L. 3261-3-1 du code du travail est ainsi modifi&#233; :</p><p>A. - Le premier alin&#233;a est compl&#233;t&#233; par les mots : &#171; , ou, lorsque les salari&#233;s effectuent ces d&#233;placements en tant que passagers en covoiturage, sous la forme d'une &#171; indemnit&#233; forfaitaire covoiturage &#187; dont les modalit&#233;s sont pr&#233;cis&#233;es par d&#233;cret. &#187; ;</p><p>B. - Au deuxi&#232;me alin&#233;a, les mots : &#171; cette prise en charge &#187; sont remplac&#233;s par les mots : &#171; ces indemnit&#233;s &#187;, le mot : &#171; celle &#187; est remplac&#233; par les mots : &#171; la prise en charge &#187;, et&#160;les mots : &#171; lorsqu'il s'agit d'un trajet de rabattement vers une gare ou une station &#187; sont supprim&#233;s.</p>",
    "exposeSommaire": "<p>Le pr&#233;sent amendement vise &#224; r&#233;introduire dans le PLF l'article 58ter, supprim&#233; par le S&#233;nat.</p><p>L'amendement reprend la proposition initiale de l'amendement&#160;N&#176;II-2575 du gouvernement, adopt&#233; &#224; l'assembl&#233;e, ainsi que les amendements du gouvernement N&#176;II-965 et&#160;N&#176;II-966 tomb&#233;s au S&#233;nat. Cependant il va plus loin que la proposition initiale du gouvernement pour renforcer le soutien &#224; la multimodalit&#233;.</p><p>En premier lieu l'amendement vise donc &#224; limiter les in&#233;galit&#233;s de traitement entre les modes de transport en donnant la possibilit&#233; aux employeurs qui souhaitent accompagner le d&#233;veloppement du covoiturage de rembourser une partie des frais engag&#233;s par leurs salari&#233;s lorsqu'ils se d&#233;placent en covoiturage, en tant que passagers. Il ajoute le covoiturage en tant que passager dans les moyens de transports des trajets domicile-travail pouvant faire l&#8217;objet d&#8217;un soutien de l&#8217;employeur sans charges sociales ni imp&#244;t sur le revenu, dans la limite de 200 &#8364; par an.&#160;Il permet d&#8217;anticiper la loi d&#8217;orientation des mobilit&#233;s qui proc&#233;dera &#224; une refonte plus compl&#232;te des dispositifs de soutien aux trajets domicile-travail.</p><p>En deuxi&#232;me lieu, certaines collectivit&#233;s territoriales ont mis en place des aides au transport vers&#233;es aux salari&#233;s qui utilisent leur v&#233;hicule personnel pour leurs d&#233;placements entre leur r&#233;sidence habituelle et leur lieu de travail. Ces aides constituent en principe un compl&#233;ment de r&#233;mun&#233;ration imposable &#224; l&#8217;imp&#244;t sur le revenu et soumis &#224; cotisations et contributions sociales.</p><p>Le pr&#233;sent amendement pr&#233;voit d&#8217;exon&#233;rer d&#8217;imp&#244;t sur le revenu et de cotisations et contributions sociales, dans la limite de 240 &#8364; par an (soit 20 &#8364; par mois), les aides vers&#233;es, en l&#8217;absence de prise en charge par l&#8217;employeur des titres d'abonnements de transports publics, par les collectivit&#233;s territoriales (ou leurs &#233;tablissements publics de coop&#233;ration intercommunale), destin&#233;es &#224; couvrir les frais de carburant ou d&#8217;alimentation de v&#233;hicules &#233;lectriques engag&#233;s par les salari&#233;s pour leurs d&#233;placements avec leur v&#233;hicule personnel entre le domicile et le lieu de travail, lorsqu&#8217;ils sont situ&#233;s &#224; au moins trente kilom&#232;tres l&#8217;un de l&#8217;autre, ou pour leurs d&#233;placements entre leur r&#233;sidence habituelle et leur lieu de travail en tant que conducteur en covoiturage, quelle que soit la distance s&#233;parant la r&#233;sidence habituelle du lieu de travail.</p><p>En troisi&#232;me lieu, le pr&#233;sent amendement &#233;tend, dans les m&#234;mes conditions, ces exon&#233;rations &#224; l&#8217;aide &#224; la mobilit&#233; relative aux frais de d&#233;placements vers&#233;e par P&#244;le emploi.</p><p>En dernier lieu, le pr&#233;sent amendement va plus loin que la proposition initiale du gouvernement, en permettant &#233;galement &#224; un salari&#233; d'utiliser le covoiturage en compl&#233;ment des transports en commun, en supprimant la restriction aux trajets de rabattement. Le covoiturage peut &#234;tre ainsi &#234;tre utilis&#233; en rabattement et en alternative des transports en commun, selon les jours et trajets de la semaine.</p><p>En effet, en l&#8217;&#233;tat actuel de l'article L.3261-3-1 du code du travail il ne serait possible de cumuler l&#8217;indemnit&#233; &#171;&#160;covoiturage&#160;&#187; avec la prise en charge des frais de transports en commun que dans le cas d&#8217;un trajet de rabattement vers une gare ou une station. L&#8217;objectif est donc de supprimer cette restriction &#224; l&#8217;intermodalit&#233;. A d&#233;faut, la crainte&#160;est que ce premier &#171;&#160;forfait covoiturage&#160;&#187; introduit dans le PLF 2019 soit tr&#232;s peu utilis&#233; par les entreprises car il ne sera pas multimodal. Cela risque de&#160;fragiliser le forfait mobilit&#233; qui doit &#234;tre mis en place dans la Loi d'Orientation des Mobilit&#233;s.</p><p>Ainsi modifi&#233;, le PLF 2019 ouvrira&#160;progressivement la voie au \"Mobility as a Service\" ou \"Mobilit&#233; servicielle\",&#160;en permettant une prise en charge globale des diff&#233;rents modes (v&#233;lo, transport en commun, covoiturage..). Cette r&#233;daction augment&#233;e de l'article 58ter s'inscrit donc dans la philosophie de la Loi d'Orientation des Mobilit&#233;s, et dans l'esprit du r&#233;cent appel &#224; manifestation d'int&#233;r&#234;t lanc&#233; dans le cadre du Grand Plan d'Investissement, par le gouvernement avec l'Ademe, pour le d&#233;veloppement de la mobilit&#233; servicielle.&#160;</p><p>Enfin, dans cette r&#233;daction le pr&#233;sent amendement s&#8217;applique &#224; compter du 1er janvier 2019&#160;dans la logique de l'amendement&#160;N&#176;II-966 du gouvernement, tomb&#233; lors de l'examen du texte au S&#233;nat.</p>"
  },
  "representations": [
    {
      "nom": "PDF",
      "typeMime": {
        "type": "application",
        "subType": "PDF"
      },
      "statutRepresentation": {
        "verbatim": true,
        "canonique": true,
        "officielle": true,
        "transcription": false,
        "enregistrement": false
      },
      "contenu": {
        "documentURI": "/15/amendements/1490/CION_FIN/CF279.pdf"
      }
    }
  ],
  "dateDepot": "2018-12-13T01:00:00.000+01:00",
  "dateDistribution": "2018-12-13T01:00:00.000+01:00",
  "article99": "0",
  "loiReference": {}
}