{
  "uid": "AMANR5L15SEA717460BTC1237P0D1N1231",
  "identifiant": {
    "legislature": "15",
    "numero": "1231",
    "numRect": "0",
    "saisine": {
      "texteLegislatifRef": "PRJLANR5L15BTC1237",
      "numeroPartiePLF": "0",
      "organeExamen": "PO717460",
      "mentionSecondeDeliberation": "0"
    }
  },
  "numeroLong": "1231",
  "etapeTexte": "1ère lecture (1ère assemblée saisie)",
  "triAmendement": "bbaaaaaaaaaaaaaaaaaaaaaaaaaaaaaaaaaaaaaaaaaaaaaaaae",
  "cardinaliteAmdtMultiples": "1",
  "etat": "Discuté",
  "signataires": {
    "auteur": {
      "typeAuteur": "Depute",
      "acteurRef": "PA718978",
      "groupePolitiqueRef": "PO730970"
    },
    "cosignatairesRefs": [
      "PA720002",
      "PA718978"
    ],
    "texteAffichable": "M.&#160;Laqhila et Mme&#160;El Ha&#239;ry"
  },
  "pointeurFragmentTexte": {
    "division": {
      "titre": "Article 13",
      "articleDesignationCourte": "ART. 13",
      "type": "ARTICLE",
      "avantAApres": "A",
      "divisionRattachee": "ARTICLE 13",
      "urlDivisionTexteVise": "/15/textes/1237.asp#D_Article_13"
    },
    "alinea": {
      "numero": "5"
    }
  },
  "corps": {
    "dispositif": "<p style=\"text-align: justify;\">&#192; l&#8217;alin&#233;a&#160;5, substituer aux mots&#160;:</p><p style=\"text-align: justify;\">&#171;&#160;peuvent agir&#160;&#187;</p><p style=\"text-align: justify;\">les mots&#160;:</p><p style=\"text-align: justify;\">&#171;&#160;agissent prioritairement&#160;&#187;.</p>",
    "exposeSommaire": "<p style=\"text-align: justify;\">Le r&#233;seau des CCI &#233;tant aujourd&#8217;hui uniquement calqu&#233; sur la Loi NOTRe, il serait opportun de l&#8217;adapter &#224; la loi MAPTAM. Les m&#233;tropoles &#233;tant &#233;galement des collectivit&#233;s disposant de la comp&#233;tence de d&#233;veloppement &#233;conomique de leur territoire, il para&#238;t plus logique qu&#8217;elles s&#8217;appuient en priorit&#233; sur les CCI m&#233;tropolitaines qui existent d&#8217;une part et qui sont en prise directe avec les entreprises de ce territoire lorsque les CCI r&#233;gionales sont parfois trop &#233;loign&#233;es des enjeux direct li&#233;s au territoire m&#233;tropolitain.</p><p style=\"text-align: justify;\">Enfin, cet amendement s&#8217;inscrit pleinement dans l&#8217;objectif que fixe le projet de loi PACTE &#171;&#160;d&#8217;adapter l&#8217;offre de services des chambres aux nouvelles exigences de leurs ressortissants et des territoires&#160;&#187;.</p>"
  },
  "representations": [
    {
      "nom": "PDF",
      "typeMime": {
        "type": "application",
        "subType": "PDF"
      },
      "statutRepresentation": {
        "verbatim": true,
        "canonique": true,
        "officielle": true,
        "transcription": false,
        "enregistrement": false
      },
      "contenu": {
        "documentURI": "/15/amendements/1237/AN/1231.pdf"
      }
    }
  ],
  "seanceDiscussion": "RUANR5L15S2018IDS21252",
  "sort": {
    "dateSaisie": "2018-09-27T23:46:27.000+02:00",
    "sortEnSeance": "Rejeté"
  },
  "dateDepot": "2018-09-20T02:00:00.000+02:00",
  "dateDistribution": "2018-09-24T02:00:00.000+02:00",
  "article99": "0",
  "loiReference": {}
}