{
  "uid": "AMANR5L15PO766718B2187P0D1N1623",
  "identifiant": {
    "legislature": "15",
    "numero": "1623",
    "numRect": "0",
    "saisine": {
      "texteLegislatifRef": "PRJLANR5L15B2187",
      "numeroPartiePLF": "0",
      "organeExamen": "PO766718",
      "mentionSecondeDeliberation": "0"
    }
  },
  "numeroLong": "1623",
  "etapeTexte": "1ère lecture (1ère assemblée saisie)",
  "triAmendement": "maaaaaaaaaaaaaaaaaaaaaaaaaaaaaaaaaaaaaaaaaaaaaaaaaai",
  "cardinaliteAmdtMultiples": "1",
  "etat": "Discuté",
  "signataires": {
    "auteur": {
      "typeAuteur": "Depute",
      "acteurRef": "PA719488",
      "groupePolitiqueRef": "PO730970"
    },
    "cosignatairesRefs": [
      "PA720728",
      "PA719874",
      "PA720334",
      "PA720924",
      "PA721742",
      "PA719504",
      "PA721182",
      "PA720002",
      "PA720968",
      "PA721418",
      "PA722374",
      "PA721924",
      "PA719044",
      "PA719558",
      "PA719266",
      "PA720746",
      "PA719640",
      "PA718978",
      "PA721530",
      "PA719488",
      "PA720720",
      "PA717151",
      "PA720092",
      "PA719210",
      "PA721836",
      "PA1276",
      "PA721976",
      "PA721734",
      "PA722162",
      "PA721608",
      "PA720772",
      "PA720178",
      "PA720162",
      "PA720256",
      "PA720764",
      "PA720976",
      "PA721984",
      "PA719942",
      "PA720598",
      "PA719918",
      "PA721234",
      "PA720652",
      "PA722284",
      "PA720326"
    ],
    "texteAffichable": "M.&#160;Berta, rapporteur,  Mme&#160;de Vaucouleurs, Mme&#160;Elimas, M.&#160;Fuchs, M.&#160;Hammouche, M.&#160;Isaac-Sibille, M.&#160;Balanant, Mme&#160;Bannier, M.&#160;Barrot, M.&#160;Baudu, Mme&#160;Benin, M.&#160;Bolo, M.&#160;Bourlanges, M.&#160;Bru, M.&#160;Cubertafon, Mme&#160;de Sarnez, Mme&#160;Deprez-Audebert, M.&#160;Duverg&#233;, Mme&#160;El Ha&#239;ry, Mme&#160;Essayan, M.&#160;Fanget, Mme&#160;Florennes, M.&#160;Garcia, Mme&#160;Jacquier-Laforge, M.&#160;Joncour, M.&#160;Lagleize, M.&#160;Lain&#233;, M.&#160;Laqhila, Mme&#160;Lasserre-David, M.&#160;Latombe, Mme&#160;Luquet, M.&#160;Mathiasin, M.&#160;Mattei, Mme&#160;Mette, M.&#160;Michel-Kleisbauer, M.&#160;Mignola, M.&#160;Millienne, M.&#160;Pahun, M.&#160;Fr&#233;d&#233;ric&#160;Petit, Mme&#160;Maud&#160;Petit, Mme&#160;Poueyto, M.&#160;Ramos, M.&#160;Turquois et M.&#160;Waserman"
  },
  "pointeurFragmentTexte": {
    "division": {
      "titre": "Article 30",
      "articleDesignationCourte": "ART. 30",
      "type": "ARTICLE",
      "avantAApres": "A",
      "divisionRattachee": "ARTICLE 30",
      "urlDivisionTexteVise": "/15/textes/2187.asp#D_Article_30"
    },
    "alinea": {
      "avantAApres": "Apres",
      "numero": "2"
    }
  },
  "corps": {
    "dispositif": "<p style=\"text-align: justify;\">Apr&#232;s l&#8217;alin&#233;a&#160;2, ins&#233;rer l&#8217;alin&#233;a suivant&#160;:</p><p style=\"text-align: justify;\">&#171;&#160;<i>aa)</i> <i>(nouveau)</i> Le premier alin&#233;a est compl&#233;t&#233; par les mots&#160;:&#160;&#187;et du ministre charg&#233; de la recherche&#171;&#160;;</p>",
    "exposeSommaire": "<p style=\"text-align: justify;\">Cet amendement vise &#224; placer l&#8217;Agence de la biom&#233;decine sous la double tutelle du ministre charg&#233; de la sant&#233; et du ministre charg&#233; de la recherche. En effet,&#160;le champ de comp&#233;tences de cet&#160;&#233;tablissement public est directement li&#233; aux pr&#233;rogatives du ministre de la recherche. Il appara&#238;t donc pertinent que celui-ci soit associ&#233; au ministre de la sant&#233; dans les activit&#233;s de contr&#244;le r&#233;glementaire de l&#8217;agence.&#160;</p>"
  },
  "representations": [
    {
      "nom": "PDF",
      "typeMime": {
        "type": "application",
        "subType": "PDF"
      },
      "statutRepresentation": {
        "verbatim": true,
        "canonique": true,
        "officielle": true,
        "transcription": false,
        "enregistrement": false
      },
      "contenu": {
        "documentURI": "/15/amendements/2187/CSBIOETH/1623.pdf"
      }
    }
  ],
  "sort": {
    "dateSaisie": "2019-09-14T01:23:01.000+02:00",
    "sortEnSeance": "Rejeté"
  },
  "dateDepot": "2019-09-05T02:00:00.000+02:00",
  "dateDistribution": "2019-09-11T02:00:00.000+02:00",
  "article99": "0",
  "loiReference": {}
}