{
  "uid": "AMANR5L15PO59051B1802P0D1N197",
  "identifiant": {
    "legislature": "15",
    "numero": "197",
    "numRect": "0",
    "saisine": {
      "texteLegislatifRef": "PRJLANR5L15B1802",
      "numeroPartiePLF": "0",
      "organeExamen": "PO59051",
      "mentionSecondeDeliberation": "0"
    }
  },
  "numeroLong": "CL197",
  "etapeTexte": "1ère lecture (1ère assemblée saisie)",
  "triAmendement": "alaaaaaaaaaaaaaaaaaaaaaaaaaaaaaaaaaaaaaaaaaaaaaaaaf",
  "cardinaliteAmdtMultiples": "1",
  "etat": "Discuté",
  "signataires": {
    "auteur": {
      "typeAuteur": "Depute",
      "acteurRef": "PA346218",
      "groupePolitiqueRef": "PO730934"
    },
    "cosignatairesRefs": [
      "PA267429",
      "PA719272",
      "PA605036",
      "PA266776",
      "PA267378",
      "PA330684",
      "PA720684",
      "PA719318",
      "PA608416",
      "PA718884",
      "PA346218",
      "PA721314"
    ],
    "texteAffichable": "M.&#160;Masson,  M.&#160;Abad, Mme&#160;Anthoine, Mme&#160;Bazin-Malgras, Mme&#160;Val&#233;rie&#160;Boyer, M.&#160;Cinieri, M.&#160;Pierre-Henri&#160;Dumont, M.&#160;Hetzel, Mme&#160;Levy, M.&#160;Schellenberger, Mme&#160;Meunier et M.&#160;Reiss"
  },
  "pointeurFragmentTexte": {
    "division": {
      "titre": "Article 4",
      "articleDesignationCourte": "ART. 4",
      "type": "ARTICLE",
      "avantAApres": "A",
      "divisionRattachee": "ARTICLE 4",
      "urlDivisionTexteVise": "/15/textes/1802.asp#D_Article_4"
    },
    "alinea": {
      "numero": "5"
    }
  },
  "corps": {
    "dispositif": "<p style=\"text-align: justify;\">Supprimer la seconde phrase de l&#8217;alin&#233;a&#160;5.</p>",
    "exposeSommaire": "<p style=\"text-align: justify;\">La cr&#233;ation d'une commission administrative paritaire unique pour plusieurs cat&#233;gories hi&#233;rarchiques en cas d'insuffisance des effectifs serait inad&#233;quate puisque des agents de la fonction publique de l'&#201;tat de cat&#233;gorie C seraient amen&#233;s &#224; appr&#233;cier les situations des agents de cat&#233;gorie A sur des dimensions comme leurs licenciements pour insuffisance professionnelle. Cette possibilit&#233; n'est donc pas envisageable.</p>"
  },
  "representations": [
    {
      "nom": "PDF",
      "typeMime": {
        "type": "application",
        "subType": "PDF"
      },
      "statutRepresentation": {
        "verbatim": true,
        "canonique": true,
        "officielle": true,
        "transcription": false,
        "enregistrement": false
      },
      "contenu": {
        "documentURI": "/15/amendements/1802/CION_LOIS/CL197.pdf"
      }
    }
  ],
  "sort": {
    "dateSaisie": "2019-05-02T15:04:09.000+02:00",
    "sortEnSeance": "Rejeté"
  },
  "dateDepot": "2019-04-26T02:00:00.000+02:00",
  "dateDistribution": "2019-05-01T02:00:00.000+02:00",
  "article99": "0",
  "loiReference": {}
}