{
  "uid": "AMANR5L15PO59051B1933P0D1N51",
  "identifiant": {
    "legislature": "15",
    "numero": "51",
    "numRect": "0",
    "saisine": {
      "texteLegislatifRef": "PIONANR5L15B1933",
      "numeroPartiePLF": "0",
      "organeExamen": "PO59051",
      "mentionSecondeDeliberation": "0"
    }
  },
  "numeroLong": "CL51",
  "etapeTexte": "1ère lecture (1ère assemblée saisie)",
  "triAmendement": "oaaaaaaaaaaaaaaaaaaaaaaaaaaaaaaaaaaaaaaaaaaaaaaaaach",
  "cardinaliteAmdtMultiples": "1",
  "etat": "Discuté",
  "signataires": {
    "auteur": {
      "typeAuteur": "Depute",
      "acteurRef": "PA330240",
      "groupePolitiqueRef": "PO730934"
    },
    "cosignatairesRefs": [
      "PA330240"
    ],
    "texteAffichable": "M.&#160;Ciotti, rapporteur"
  },
  "pointeurFragmentTexte": {
    "division": {
      "titre": "Article 10",
      "articleDesignationCourte": "APRÈS ART. 10",
      "type": "ARTICLE",
      "avantAApres": "Apres",
      "divisionRattachee": "APRÈS L'ARTICLE 10, insérer l'article suivant:",
      "articleAdditionnel": "1",
      "urlDivisionTexteVise": "/15/textes/1933.asp#D_Article_10"
    }
  },
  "corps": {
    "dispositif": "<p style=\"text-align: justify;\">&#171;&#160;&#192; la premi&#232;re phrase du sixi&#232;me alin&#233;a de l&#8217;article L.&#160;511&#8209;1 du code de la s&#233;curit&#233; int&#233;rieure, les mots&#160;: &#171;&#160;mentionn&#233;e &#224; l&#8217;article L.&#160;613&#8209;3 du pr&#233;sent code&#160;&#187; sont supprim&#233;s.&#160;&#187;</p>",
    "exposeSommaire": "<p>L'article L. 511-1 du code de la s&#233;curit&#233; int&#233;rieure permet aux policiers municipaux, affect&#233;s sur d&#233;cision du maire &#224; la s&#233;curit&#233; d'une manifestation sportive, r&#233;cr&#233;ative ou culturelle rassemblant plus de 300 spectateurs proc&#233;der &#224; l'inspection visuelle des bagages et, avec le consentement de leur propri&#233;taire, &#224; leur fouille. Ce seuil ne paraissant pas justifi&#233;, il est propos&#233; de le supprimer.</p><p style=\"text-align: justify;\">C'est d'ailleurs l'une des propositions du rapport de nos coll&#232;gues Thourot et Fauvergue dans leur rapport sur le continuum de s&#233;curit&#233;.</p>"
  },
  "representations": [
    {
      "nom": "PDF",
      "typeMime": {
        "type": "application",
        "subType": "PDF"
      },
      "statutRepresentation": {
        "verbatim": true,
        "canonique": true,
        "officielle": true,
        "transcription": false,
        "enregistrement": false
      },
      "contenu": {
        "documentURI": "/15/amendements/1933/CION_LOIS/CL51.pdf"
      }
    }
  ],
  "sort": {
    "dateSaisie": "2019-06-12T11:48:10.000+02:00",
    "sortEnSeance": "Rejeté"
  },
  "dateDepot": "2019-06-11T02:00:00.000+02:00",
  "dateDistribution": "2019-06-11T02:00:00.000+02:00",
  "article99": "0",
  "loiReference": {
    "codeLoi": "27 sécurité intérieure",
    "divisionCodeLoi": "L511-1"
  }
}