{
  "uid": "AMANR5L15PO757134B1088P0D1N677",
  "identifiant": {
    "legislature": "15",
    "numero": "677",
    "numRect": "0",
    "saisine": {
      "texteLegislatifRef": "PRJLANR5L15B1088",
      "numeroPartiePLF": "0",
      "organeExamen": "PO757134",
      "mentionSecondeDeliberation": "0"
    }
  },
  "numeroLong": "677",
  "etapeTexte": "1ère lecture (1ère assemblée saisie)",
  "triAmendement": "isaaaaaaaaaaaaaaaaaaaaaaaaaaaaaaaaaaaaaaaaaaaaaaaaebkkns",
  "cardinaliteAmdtMultiples": "1",
  "etat": "Discuté",
  "signataires": {
    "auteur": {
      "typeAuteur": "Depute",
      "acteurRef": "PA334149",
      "groupePolitiqueRef": "PO730934"
    },
    "cosignatairesRefs": [
      "PA2792",
      "PA330909",
      "PA334149",
      "PA709315",
      "PA267527",
      "PA1327",
      "PA721126",
      "PA746"
    ],
    "texteAffichable": "M.&#160;Fasquelle,  M.&#160;Carrez, M.&#160;Descoeur, M.&#160;Forissier, Mme&#160;Guion-Firmin, M.&#160;Saddier, M.&#160;Taugourdeau et M.&#160;Viala"
  },
  "pointeurFragmentTexte": {
    "division": {
      "titre": "Article 49",
      "articleDesignationCourte": "ART. 49",
      "type": "ARTICLE",
      "avantAApres": "A",
      "divisionRattachee": "ARTICLE 49",
      "urlDivisionTexteVise": "/15/textes/1088.asp#D_Article_49"
    }
  },
  "corps": {
    "dispositif": "<p style=\"text-align: justify;\">Supprimer cet article.</p>",
    "exposeSommaire": "<p style=\"text-align: justify;\">Cet article a pour objet l&#8217;autorisation de la privatisation d&#8217;A&#233;roport de Paris (ADP).</p><p style=\"text-align: justify;\">Inacceptable aux yeux de nombreux Fran&#231;ais, la vente de ce &#171;&#160;bijou de famille&#160;&#187; pour une somme d&#233;risoire s&#8217;il en est, est incompr&#233;hensible. Fili&#232;re d&#8217;excellence mondiale, ADP est une v&#233;ritable &#171;&#160;p&#233;pite&#160;&#187; fran&#231;aise que le gouvernement souhaite brader &#224; des conditions peu acceptables.</p><p style=\"text-align: justify;\">Une telle privatisation ne s&#8217;explique pas. Elle n&#8217;a d&#8217;autant plus aucun sens que l&#8217;&#201;tat devra racheter dans 70 ans ces installations au prix fort. Le seul gagnant de cette op&#233;ration sera l&#8217;acheteur d&#8217;ADP, pas l&#8217;&#201;tat, et encore moins les Fran&#231;ais.</p><p style=\"text-align: justify;\">L&#8217;objectif louable de cr&#233;er un fonds pour l&#8217;innovation abond&#233; de 10Md&#160;&#8364; ne justifie pas que l&#8217;on vende cette entreprise bien g&#233;r&#233;e et qui rapporte. D&#8217;autre options existent, mais elles seraient beaucoup plus compliqu&#233;es &#224; mettre en place et bien moins faciles &#224; vendre&#8230;</p><p style=\"text-align: justify;\">Il convient d&#232;s lors de supprimer cet article en coh&#233;rence avec les amendements pr&#233;voyant la suppression des articles 44 et 45.</p>"
  },
  "representations": [
    {
      "nom": "PDF",
      "typeMime": {
        "type": "application",
        "subType": "PDF"
      },
      "statutRepresentation": {
        "verbatim": true,
        "canonique": true,
        "officielle": true,
        "transcription": false,
        "enregistrement": false
      },
      "contenu": {
        "documentURI": "/15/amendements/1088/CSPACTE/677.pdf"
      }
    }
  ],
  "sort": {
    "dateSaisie": "2018-09-13T21:44:35.000+02:00",
    "sortEnSeance": "Rejeté"
  },
  "dateDepot": "2018-08-29T02:00:00.000+02:00",
  "dateDistribution": "2018-09-11T02:00:00.000+02:00",
  "article99": "0",
  "loiReference": {}
}