{
  "uid": "AMANR5L15SEA717460BTC1662P0D1N259",
  "identifiant": {
    "legislature": "15",
    "numero": "259",
    "numRect": "0",
    "saisine": {
      "texteLegislatifRef": "PIONANR5L15BTC1662",
      "numeroPartiePLF": "0",
      "organeExamen": "PO717460",
      "mentionSecondeDeliberation": "0"
    }
  },
  "numeroLong": "259",
  "etapeTexte": "1ère lecture (2ème assemblée saisie)",
  "triAmendement": "baaaaaaaaaaaaaaaaaaaaaaaaaaaaaaaaaaaaaaaaaaaaaaaaaawkkkkkkkkzzzzxvzk",
  "cardinaliteAmdtMultiples": "1",
  "etat": "Discuté",
  "signataires": {
    "auteur": {
      "typeAuteur": "Depute",
      "acteurRef": "PA642847",
      "groupePolitiqueRef": "PO730934"
    },
    "cosignatairesRefs": [
      "PA340853",
      "PA267289",
      "PA719272",
      "PA722390",
      "PA266793",
      "PA718884",
      "PA267735",
      "PA267429",
      "PA330909",
      "PA642847",
      "PA721286",
      "PA266808",
      "PA720210",
      "PA606712",
      "PA719318",
      "PA718838",
      "PA267901",
      "PA721046",
      "PA720684",
      "PA267204",
      "PA767",
      "PA334843",
      "PA608416",
      "PA336316",
      "PA718850",
      "PA718784",
      "PA1874",
      "PA608016",
      "PA267527"
    ],
    "texteAffichable": "M.&#160;Bazin,  Mme&#160;Anthoine, Mme&#160;Bazin-Malgras, Mme&#160;Beauvais, M.&#160;Bony, M.&#160;Bouchet, M.&#160;Brun, M.&#160;Cattin, M.&#160;Cinieri, M.&#160;Cordier, Mme&#160;Corneloup, M.&#160;de Ganay, M.&#160;Door, M.&#160;Pierre-Henri&#160;Dumont, M.&#160;Hetzel, M.&#160;Kamardine, M.&#160;Leclerc, M.&#160;Le Fur, Mme&#160;Louwagie, Mme&#160;Meunier, M.&#160;Pauget, M.&#160;Ramadier, M.&#160;Rolland, M.&#160;Sermier, M.&#160;Verch&#232;re, M.&#160;Descoeur, M.&#160;Saddier, Mme&#160;Bassire et M.&#160;Lurton"
  },
  "pointeurFragmentTexte": {
    "division": {
      "titre": "Article 2",
      "articleDesignationCourte": "ART. 2",
      "type": "ARTICLE",
      "avantAApres": "A",
      "divisionRattachee": "ARTICLE 2",
      "urlDivisionTexteVise": "/15/textes/1662.asp#D_Article_2"
    },
    "alinea": {
      "numero": "2"
    }
  },
  "corps": {
    "dispositif": "<p>&#192; la premi&#232;re phrase de alin&#233;a&#160;2, apr&#232;s le mot&#160;:</p><p style=\"text-align: justify;\">&#171;&#160;&#233;cologique,&#160;&#187;,</p><p style=\"text-align: justify;\">ins&#233;rer les mots&#160;:</p><p style=\"text-align: justify;\">&#171;&#160;de la lutte contre les affaissements miniers,&#160;&#187;.</p>",
    "exposeSommaire": "<p>En pr&#233;cisant &#171;&#160;les affaissements miniers&#160;&#187;, cet amendement a pour but de souligner les difficult&#233;s des communes touch&#233;es par ce ph&#233;nom&#232;ne&#160;: difficult&#233;s &#224; pr&#233;ciser les possibilit&#233;s de construction, ou d&#8217;extension de constructions quand il y a des risques.</p>"
  },
  "representations": [
    {
      "nom": "PDF",
      "typeMime": {
        "type": "application",
        "subType": "PDF"
      },
      "statutRepresentation": {
        "verbatim": true,
        "canonique": true,
        "officielle": true,
        "transcription": false,
        "enregistrement": false
      },
      "contenu": {
        "documentURI": "/15/amendements/1662/AN/259.pdf"
      }
    }
  ],
  "seanceDiscussion": "RUANR5L15S2019IDS21544",
  "sort": {
    "dateSaisie": "2019-03-12T17:53:30.000+01:00",
    "sortEnSeance": "Rejeté"
  },
  "dateDepot": "2019-03-05T01:00:00.000+01:00",
  "dateDistribution": "2019-03-08T01:00:00.000+01:00",
  "article99": "0",
  "loiReference": {}
}