{
  "uid": "AMANR5L15SEA717460B1297P0D1N1611",
  "identifiant": {
    "legislature": "15",
    "numero": "1611",
    "numRect": "0",
    "saisine": {
      "texteLegislatifRef": "PRJLANR5L15B1297",
      "numeroPartiePLF": "0",
      "organeExamen": "PO717460",
      "mentionSecondeDeliberation": "0"
    }
  },
  "numeroLong": "1611",
  "etapeTexte": "1ère lecture (1ère assemblée saisie)",
  "triAmendement": "epaaaaaaaaaaaaaaaaaaaaaaaaaaaaaaaaaaaaaaaaaaaaaaaaaozs",
  "cardinaliteAmdtMultiples": "1",
  "etat": "Discuté",
  "signataires": {
    "auteur": {
      "typeAuteur": "Gouvernement"
    },
    "texteAffichable": "le Gouvernement"
  },
  "pointeurFragmentTexte": {
    "division": {
      "titre": "Article 29",
      "articleDesignationCourte": "APRÈS ART. 29",
      "type": "ARTICLE",
      "avantAApres": "Apres",
      "divisionRattachee": "APRÈS L'ARTICLE 29, insérer l'article suivant:",
      "articleAdditionnel": "1",
      "urlDivisionTexteVise": "/15/textes/1297.asp#D_Article_29"
    }
  },
  "corps": {
    "dispositif": "<p style=\"text-align: justify;\">I.&#160;&#8211;&#160;Le chapitre 2 du titre 6 du livre 1 du code de la s&#233;curit&#233; sociale est ainsi modifi&#233;&#160;:</p><p style=\"text-align: justify;\">1&#176; L&#8217;article L.&#160;162&#8209;5 est compl&#233;t&#233; par un 27&#176; ainsi r&#233;dig&#233;&#160;:</p><p style=\"text-align: justify;\">&#171;&#160;27&#176;&#160;Les conditions et modalit&#233;s de participation financi&#232;re au recrutement de personnels salari&#233;s intervenant aupr&#232;s de m&#233;decins exer&#231;ant dans le cadre d&#8217;un exercice coordonn&#233; et ayant vocation &#224; les assister dans leur pratique quotidienne et am&#233;liorer ainsi l&#8217;acc&#232;s aux soins.&#160;&#187; ;</p><p style=\"text-align: justify;\">2&#176; L&#8217;article L.&#160;162&#8209;14&#8209;1 est ainsi modifi&#233;&#160;:</p><p style=\"text-align: justify;\"><i>a)</i> Le I est compl&#233;t&#233; par un 7&#176;&#160;ainsi r&#233;dig&#233;&#160;:</p><p style=\"text-align: justify;\">&#171;&#160;7&#176;&#160;Les conditions de modulation de la r&#233;mun&#233;ration des professionnels de sant&#233; en fonction de leur participation &#224; un cadre d&#8217;exercice coordonn&#233;.&#160;&#187;&#160;;</p><p style=\"text-align: justify;\"><i>b)</i>&#160;Le dernier alin&#233;a est ainsi modifi&#233;&#160;:</p><p style=\"text-align: justify;\">- &#192; la premi&#232;re phrase, apr&#232;s le mot&#160;: &#171;&#160;soins&#160;&#187;, sont ins&#233;r&#233;s les mots&#160;: &#171;&#160;des communaut&#233;s professionnelles territoriales de sant&#233;, des &#233;quipes de soins primaires,&#160;&#187;&#160;;</p><p style=\"text-align: justify;\">- &#192; la deuxi&#232;me phrase, apr&#232;s le mot&#160;: &#171;&#160;avec&#160;&#187;, sont ins&#233;r&#233;s les mots&#160;: &#171;&#160;des communaut&#233;s professionnelles territoriales de sant&#233;, des &#233;quipes de soins primaires,&#160;&#187;.</p><p style=\"text-align: justify;\">II.&#160;&#8211;&#160;Le directeur g&#233;n&#233;ral de l&#8217;Union nationale des caisses d&#8217;assurance maladie engage, dans le d&#233;lai d&#8217;un mois &#224; compter de la promulgation de la pr&#233;sente loi, des n&#233;gociations conventionnelles en vue de d&#233;terminer des mesures visant &#224; inciter au d&#233;veloppement de l&#8217;exercice coordonn&#233; et&#160;au recrutement de personnels salari&#233;s ayant vocation &#224; assister les m&#233;decins dans leur pratique quotidienne.</p><p style=\"text-align: justify;\">III.&#160;&#8211;&#160;Le directeur g&#233;n&#233;ral de l&#8217;Union nationale des caisses d&#8217;assurance maladie engage, dans le d&#233;lai d&#8217;un mois &#224; compter de la promulgation de la pr&#233;sente loi, des n&#233;gociations conventionnelles en vue de d&#233;terminer, dans le cadre d&#8217;un accord conventionnel interprofessionnel, les mesures visant &#224; accompagner le d&#233;ploiement sur l&#8217;ensemble du territoire des communaut&#233;s professionnelles territoriales de sant&#233;, conform&#233;ment au II de l&#8217;article L.&#160;162&#8209;14&#8209;1 du code de la s&#233;curit&#233; sociale.</p><p style=\"text-align: justify;\">IV.&#160;&#8211;&#160;Le d&#233;lai d&#8217;entr&#233;e en vigueur mentionn&#233; au premier alin&#233;a de l&#8217;article L.&#160;162&#8209;14&#8209;1&#8209;1 du code de la s&#233;curit&#233; sociale n&#8217;est pas applicable aux mesures conventionnelles prises conform&#233;ment aux II et III du pr&#233;sent article.</p>",
    "exposeSommaire": "<p style=\"text-align: justify;\">Dans le cadre du plan &#171;&#160;Ma sant&#233; 2022&#160;&#187; pr&#233;sent&#233; le 18 septembre 2018, la transformation du syst&#232;me de soins devra poursuivre plusieurs grands objectifs&#160;: am&#233;liorer la qualit&#233; des prises en charge pour tous les patients sur tous les territoires, cr&#233;er un collectif de soins au service des patients, adapter les m&#233;tiers et les formations aux enjeux de demain. Dans cette logique, l&#8217;organisation des professionnels de sant&#233; de ville r&#233;nov&#233;e et plus collective constitue la condition premi&#232;re pour mettre en place des organisations de soins de proximit&#233;, faire travailler ensemble la ville, l&#8217;h&#244;pital et le m&#233;dico-social et ainsi faciliter l&#8217;acc&#232;s aux soins et am&#233;liorer leur qualit&#233;.</p><p style=\"text-align: justify;\">L&#8217;exercice coordonn&#233; doit devenir ainsi le cadre d&#8217;exercice de r&#233;f&#233;rence pour l&#8217;ensemble des professionnels de sant&#233;. Cet exercice coordonn&#233; signifie qu&#8217;&#224; l&#8217;&#233;chelle d&#8217;un territoire l&#8217;ensemble des professionnels doivent s&#8217;organiser pour garantir &#224; tous les patients l&#8217;acc&#232;s &#224; un m&#233;decin traitant, organiser une r&#233;ponse &#224; la demande de soins non programm&#233;s et aux urgences qui rel&#232;vent des soins de ville, proposer plus d&#8217;actions de pr&#233;vention, favoriser le maintien &#224; domicile des personnes &#226;g&#233;es, mieux coop&#233;rer entre professionnels de sant&#233;, notamment autour des patients atteints de pathologies chroniques. C&#8217;est pourquoi le pr&#233;sent amendement inscrit, parmi les dispositions communes aux diff&#233;rentes conventions, la d&#233;finition des conditions de modulation de la r&#233;mun&#233;ration des professionnels de sant&#233; en fonction de leur participation &#224; un cadre d&#8217;exercice coordonn&#233;.</p><p style=\"text-align: justify;\">Toutes ces missions, quand elles s&#8217;expriment &#224; l&#8217;&#233;chelle d&#8217;un territoire, ont vocation &#224; &#234;tre exerc&#233;es par des communaut&#233;s professionnelles territoriales de sant&#233; (CPTS). L&#8217;objectif de d&#233;ployer ces CPTS &#224; l&#8217;&#233;chelle nationale, dans le but de couvrir&#160;tout le territoire dans un d&#233;lai de trois ans, implique qu&#8217;une n&#233;gociation soit engag&#233;e, dans le mois suivant la promulgation de la loi, par les partenaires conventionnels dans le cadre d&#8217;un accord conventionnel interprofessionnel afin de pouvoir cr&#233;er &#224; cette fin un cadre de financement p&#233;renne. L&#8217;amendement inclut donc les CPTS dans le champ des accords-cadres interprofessionnels ainsi que les &#233;quipes de soins primaires (ESP) qui en &#233;taient jusqu&#8217;&#224; pr&#233;sent absentes.</p><p style=\"text-align: justify;\">&#160;Un des leviers pour am&#233;liorer l&#8217;acc&#232;s aux soins passe par la n&#233;cessit&#233; de redonner du temps m&#233;dical aux m&#233;decins, afin de leur permettre de se concentrer sur le c&#339;ur de leur expertise, la prise en charge m&#233;dicale des patients. Le recours &#224; des personnels salari&#233;s ayant vocation &#224; les assister dans le quotidien de leur exercice, notamment dans la pr&#233;paration et le suivi de leurs consultations ou dans l&#8217;aide au parcours des patients, dans le but d&#8217;augmenter le nombre de patients suivis et de raccourcir les d&#233;lais de rendez-vous dans les sp&#233;cialit&#233;s et les territoires o&#249; ils sont devenus aujourd&#8217;hui trop importants. Les conditions de d&#233;ploiement et d&#8217;accompagnement financier de ce nouveau dispositif susceptible de concerner plusieurs milliers de cabinets m&#233;dicaux ou de structures de soins seront d&#233;finies dans les cadres conventionnels correspondant aux diff&#233;rentes structures concern&#233;es (cabinets m&#233;dicaux, maisons et p&#244;les de sant&#233;, centres de sant&#233;). Le pr&#233;sent amendement pr&#233;voit donc que les modalit&#233;s d&#8217;accompagnement et de participation financi&#232;re au recrutement des assistants m&#233;dicaux soient d&#233;sormais pr&#233;vues dans le cadre conventionnel.</p><p style=\"text-align: justify;\">La cr&#233;ation de ces postes d&#8217;assistants m&#233;dicaux devra contribuer &#224; l&#8217;objectif de d&#233;veloppement de l&#8217;exercice coordonn&#233;, ambition majeure du plan &#171;&#160;ma sant&#233; 2022&#160;&#187;. A cet &#233;gard, l&#8217;adh&#233;sion des m&#233;decins, g&#233;n&#233;ralistes comme sp&#233;cialistes, &#224; une structure d&#8217;exercice coordonn&#233; doit devenir la norme et l&#8217;exercice isol&#233;, l&#8217;exception. C&#8217;est pourquoi le pr&#233;sent amendement pr&#233;voit &#233;galement l&#8217;ouverture, dans le mois suivant la promulgation de la loi, d&#8217;une n&#233;gociation avec les m&#233;decins&#160;portant sur la mise en &#339;uvre de mesures incitatives au d&#233;ploiement de l&#8217;exercice coordonn&#233;. Les conditions d&#8217;&#233;ligibilit&#233; au financement de ces assistants m&#233;dicaux seront triples&#160;: exercer en cabinet de groupe, &#234;tre inscrit dans un exercice coordonn&#233; (notamment CPTS), apporter un b&#233;n&#233;fice mesurable &#224; la population en termes d&#8217;acc&#232;s aux soins et de qualit&#233; des soins, notamment en augmentant le nombre de patients suivis. Cette mesure aura vocation &#224; s&#8217;appliquer &#233;galement aux centres de sant&#233; dans le cadre de la proc&#233;dure de transposition dans l&#8217;accord national des centres de sant&#233;, des mesures autres que le paiement &#224; l&#8217;acte d&#233;fini dans les conventions monocat&#233;gorielles.</p><p style=\"text-align: justify;\">Enfin, afin de permettre la mise en &#339;uvre rapide des futurs accords conventionnels ainsi conclus, l&#8217;amendement pr&#233;voit une suspension exceptionnelle de la disposition du code de la s&#233;curit&#233; sociale imposant un d&#233;lai de 6 mois entre l&#8217;approbation de toute convention et l&#8217;entr&#233;e en vigueur de ses effets.</p>"
  },
  "representations": [
    {
      "nom": "PDF",
      "typeMime": {
        "type": "application",
        "subType": "PDF"
      },
      "statutRepresentation": {
        "verbatim": true,
        "canonique": true,
        "officielle": true,
        "transcription": false,
        "enregistrement": false
      },
      "contenu": {
        "documentURI": "/15/amendements/1297/AN/1611.pdf"
      }
    }
  ],
  "seanceDiscussion": "RUANR5L15S2019IDS21294",
  "sort": {
    "dateSaisie": "2018-10-26T16:21:48.000+02:00",
    "sortEnSeance": "Adopté"
  },
  "dateDepot": "2018-10-25T02:00:00.000+02:00",
  "dateDistribution": "2018-10-25T02:00:00.000+02:00",
  "article99": "1",
  "loiReference": {
    "codeLoi": "c sécurité sociale",
    "divisionCodeLoi": "L162-5"
  }
}