{
  "uid": "AMANR5L15PO59048B1255P2D1N998",
  "identifiant": {
    "legislature": "15",
    "numero": "998",
    "numRect": "0",
    "saisine": {
      "texteLegislatifRef": "PRJLANR5L15B1255",
      "numeroPartiePLF": "2",
      "organeExamen": "PO59048",
      "mentionSecondeDeliberation": "0"
    }
  },
  "numeroLong": "II-CF998",
  "etapeTexte": "1ère lecture (1ère assemblée saisie)",
  "triAmendement": "jjaaaaaaaaaaaaaaaaaaaaaaaaaaaaaaaaaaaaaaaaaaaaaaaabfvx",
  "cardinaliteAmdtMultiples": "1",
  "etat": "Irrecevable",
  "signataires": {
    "auteur": {
      "typeAuteur": "Depute",
      "acteurRef": "PA330909",
      "groupePolitiqueRef": "PO730934"
    },
    "cosignatairesRefs": [
      "PA330909"
    ],
    "texteAffichable": "M.&#160;Descoeur"
  },
  "pointeurFragmentTexte": {
    "division": {
      "titre": "Article 56",
      "articleDesignationCourte": "ART. 56",
      "type": "ARTICLE",
      "avantAApres": "A",
      "divisionRattachee": "ARTICLE 56",
      "urlDivisionTexteVise": "/15/textes/1255C.asp#D_Article_56"
    },
    "alinea": {
      "numero": "9"
    }
  },
  "corps": {
    "dispositif": "<p style=\"text-align: justify;\">Supprimer l&#8217;alin&#233;a&#160;9.</p>",
    "exposeSommaire": "<p style=\"text-align: justify;\">Depuis plusieurs ann&#233;es les services fiscaux requalifient en industrielles les valeurs locatives de certaines entreprises avec pour cons&#233;quence des augmentations d&#8217;imp&#244;ts pouvant atteindre des montants consid&#233;rables. Ces rappels d&#8217;imp&#244;t ont des cons&#233;quences financi&#232;res importantes pour les entreprises v&#233;rifi&#233;es et disproportionn&#233;es au regard de leur rentabilit&#233;.</p><p style=\"text-align: justify;\">Visant &#224; s&#233;curiser la situation de ces entreprises, l&#8217;article&#160;56 du PLF propose de d&#233;finir par la loi les activit&#233;s qui doivent &#234;tre regard&#233;es comme industrielles au regard de la taxe fonci&#232;re et de la cotisation fonci&#232;re des entreprises. Si cet objectif de clarification doit &#234;tre soulign&#233;, la proposition ne permettra pas pour autant de r&#233;soudre les difficult&#233;s rencontr&#233;es par nombre de prestataires de services, d&#232;s lors que le projet de d&#233;finition d&#8217;une activit&#233; industrielle reste adoss&#233; &#224; des crit&#232;res &#233;tablis par la jurisprudence au titre de p&#233;riodes anciennes et laisse une consid&#233;rable marge de man&#339;uvre &#224; l&#8217;interpr&#233;tation.</p><p style=\"text-align: justify;\">Or, aujourd&#8217;hui, le caract&#232;re d&#8217;activit&#233; industrielle n&#8217;a &#233;videmment pas la m&#234;me r&#233;alit&#233; qu&#8217;en 1970&#160;: bien naturellement les m&#233;thodes de travail et les &#233;quipements des b&#226;timents se sont modernis&#233;es&#160;; fort heureusement les obligations de sant&#233; publique ont conduit &#224; revoir et &#224; all&#233;ger les taches effectu&#233;es par les personnels et leur ergonomie&#160;; et l&#8217;informatisation a pris une plus grande place, comme elle l&#8217;a fait dans les commerces de ville ou dans notre quotidien.</p><p style=\"text-align: justify;\">Par cons&#233;quent, la terminologie m&#234;me de &#171;&#160;local industriel&#160;&#187; est &#224; mille lieux de la r&#233;alit&#233; des activit&#233;s des entreprises prestataires de services, en particulier de manutention ou de simple stockage. Et la loi doit tenir compte de la r&#233;alit&#233; des conditions d&#8217;activit&#233; et non pas se baser sur un historique de jurisprudence consolid&#233;e.</p><p style=\"text-align: justify;\">D&#232;s lors, cet amendement vise &#224; r&#233;server la qualification d&#8217;activit&#233; industrielle aux seules les activit&#233;s de transformation ou de fabrication. Les autres activit&#233;s litigieuses (notamment les prestataires de services) seraient ainsi commerciales par nature et impos&#233;es en tant que locaux commerciaux aux nouveaux tarifs mis en place depuis le 1<sup>er</sup> janvier 2017.</p><p style=\"text-align: justify;\">Cette &#233;volution ne viserait pas les locaux exceptionnels (stockage p&#233;trolier, m&#233;ga entrep&#244;ts ou m&#233;ga centres de stockage totalement m&#233;canis&#233;s) qui ne pouvant &#234;tre rattach&#233;s &#224; aucune des cat&#233;gories d&#8217;imposition de la grille tarifaire des locaux commerciaux, doivent &#234;tre &#233;valu&#233;s par voie d&#8217;appr&#233;ciation directe au sens du III de l&#8217;article&#160;1498 du CGI.</p><p style=\"text-align: justify;\">&#160;</p>"
  },
  "representations": [
    {
      "nom": "PDF",
      "typeMime": {
        "type": "application",
        "subType": "PDF"
      },
      "statutRepresentation": {
        "verbatim": true,
        "canonique": true,
        "officielle": true,
        "transcription": false,
        "enregistrement": false
      },
      "contenu": {
        "documentURI": "/15/amendements/1255C/CION_FIN/CF998.pdf"
      }
    }
  ],
  "dateDepot": "2018-10-31T01:00:00.000+01:00",
  "article99": "0",
  "loiReference": {}
}