{
  "uid": "AMANR5L15PO419604B0391P0D1N71",
  "identifiant": {
    "legislature": "15",
    "numero": "71",
    "numRect": "0",
    "saisine": {
      "texteLegislatifRef": "PRJLANR5L15B0391",
      "numeroPartiePLF": "0",
      "organeExamen": "PO419604",
      "mentionSecondeDeliberation": "0"
    }
  },
  "numeroLong": "AC71",
  "etapeTexte": "1ère lecture (1ère assemblée saisie)",
  "triAmendement": "sy",
  "cardinaliteAmdtMultiples": "1",
  "etat": "Discuté",
  "signataires": {
    "auteur": {
      "typeAuteur": "Depute",
      "acteurRef": "PA345722",
      "groupePolitiqueRef": "PO730934"
    },
    "cosignatairesRefs": [
      "PA719272",
      "PA718884",
      "PA223837",
      "PA720630",
      "PA266776",
      "PA719946",
      "PA721506",
      "PA267324",
      "PA608826",
      "PA719318",
      "PA605991",
      "PA345722",
      "PA608416"
    ],
    "texteAffichable": "Mme&#160;Le Grip,  Mme&#160;Genevard, Mme&#160;Bazin-Malgras, M.&#160;Hetzel, Mme&#160;Anthoine, M.&#160;Brochand, Mme&#160;Duby-Muller, M.&#160;Gaultier, Mme&#160;Kuster, Mme&#160;Meunier, M.&#160;Minot, M.&#160;Peltier et M.&#160;Reiss"
  },
  "pointeurFragmentTexte": {
    "division": {
      "titre": "Article 4",
      "articleDesignationCourte": "ART. 4",
      "type": "ARTICLE",
      "avantAApres": "A",
      "divisionRattachee": "ARTICLE 4",
      "urlDivisionTexteVise": "/15/textes/0391.asp#D_Article_4"
    },
    "alinea": {
      "numero": "15"
    }
  },
  "corps": {
    "dispositif": "<p style=\"text-align: justify;\">Substituer aux alin&#233;as 15 &#224; 19 l&#8217;alin&#233;a suivant&#160;:</p><p style=\"text-align: justify;\">&#171;&#160;V.&#160;&#8211;&#160;La contribution est acquitt&#233;e aupr&#232;s de l&#8217;&#233;tablissement o&#249; sont r&#233;gl&#233;s les droits d&#8217;inscription.&#160;&#187;</p>",
    "exposeSommaire": "<p style=\"text-align: justify;\">Cet article pr&#233;voit la cr&#233;ation d&#8217;une cotisation qui se substituera &#224; la cotisation de s&#233;curit&#233; sociale, aux droits de m&#233;decine pr&#233;ventive et qui permettra l&#8217;acc&#232;s aux activit&#233;s sportives et culturelles des &#233;tablissements sup&#233;rieurs.</p><p style=\"text-align: justify;\">Il est pr&#233;vu que la contribution soit acquitt&#233;e aupr&#232;s des centres r&#233;gionaux des &#339;uvres universitaires et scolaires (CROUS), qu&#8217;elle leur soit affect&#233;e et que ceux-ci reversent ensuite une part de cette contribution aux &#233;tablissements.</p><p style=\"text-align: justify;\">Le fait d&#8217;inclure les CROUS dans le dispositif cr&#233;e une &#233;tape injustifi&#233;e qui risque d&#8217;impliquer une d&#233;perdition des sommes collect&#233;es notamment du fait des frais de gestion. Pour cette raison, cet amendement propose que la cotisation soit acquitt&#233;e directement aupr&#232;s des &#233;tablissements.</p>"
  },
  "representations": [
    {
      "nom": "PDF",
      "typeMime": {
        "type": "application",
        "subType": "PDF"
      },
      "statutRepresentation": {
        "verbatim": true,
        "canonique": true,
        "officielle": true,
        "transcription": false,
        "enregistrement": false
      },
      "contenu": {
        "documentURI": "/15/amendements/0391/CION-CEDU/AC71.pdf"
      }
    }
  ],
  "sort": {
    "dateSaisie": "2017-12-05T22:52:51.000+01:00",
    "sortEnSeance": "Rejeté"
  },
  "dateDepot": "2017-12-01T01:00:00.000+01:00",
  "dateDistribution": "2017-12-04T01:00:00.000+01:00",
  "article99": "0",
  "loiReference": {}
}