{
  "uid": "AMANR5L15PO59051B2343P0D1N12",
  "identifiant": {
    "legislature": "15",
    "numero": "12",
    "numRect": "0",
    "saisine": {
      "texteLegislatifRef": "PNREANR5L15B2343",
      "numeroPartiePLF": "0",
      "organeExamen": "PO59051",
      "mentionSecondeDeliberation": "0"
    }
  },
  "numeroLong": "CL12",
  "etapeTexte": "Lecture unique",
  "triAmendement": "eaaaaaaaaaaaaaaaaaaaaaaaaaaaaaaaaaaaaaaaaaaaaaaaaahi",
  "cardinaliteAmdtMultiples": "1",
  "etat": "Discuté",
  "signataires": {
    "auteur": {
      "typeAuteur": "Depute",
      "acteurRef": "PA719608",
      "groupePolitiqueRef": "PO723569"
    },
    "cosignatairesRefs": [
      "PA719608"
    ],
    "texteAffichable": "Mme&#160;M&#233;nard"
  },
  "pointeurFragmentTexte": {
    "division": {
      "titre": "Article unique",
      "articleDesignationCourte": "ART. UNIQUE",
      "type": "ARTICLE",
      "avantAApres": "A",
      "divisionRattachee": "ARTICLE UNIQUE",
      "urlDivisionTexteVise": "/15/textes/2343.asp#D_Article_unique"
    },
    "alinea": {
      "numero": "16"
    }
  },
  "corps": {
    "dispositif": "<p style=\"text-align: justify;\">Supprimer l&#8217;alin&#233;a&#160;16.</p>",
    "exposeSommaire": "<p style=\"text-align: justify;\">La proposition de r&#233;solution europ&#233;enne du droit d&#8217;asile se r&#233;jouit &#171;&#160;du choix de recourir majoritairement &#224; des r&#232;glements afin de mener &#224; bien cette r&#233;forme, dans la mesure o&#249; leur applicabilit&#233; directe est porteuse de clart&#233; et d&#8217;efficacit&#233;&#160;&#187;.</p><p>Si la c&#233;l&#233;rit&#233; est n&#233;cessaire dans un contexte migratoire tendu, les r&#232;glements - &#224; l&#8217;inverse des directives - emp&#234;chent tout d&#233;bat parlementaire dans les &#233;tats membres de l&#8217;UE. Elles ne sont donc pas souhaitables parce qu&#8217;elles nient la souverainet&#233; des pays.</p>"
  },
  "representations": [
    {
      "nom": "PDF",
      "typeMime": {
        "type": "application",
        "subType": "PDF"
      },
      "statutRepresentation": {
        "verbatim": true,
        "canonique": true,
        "officielle": true,
        "transcription": false,
        "enregistrement": false
      },
      "contenu": {
        "documentURI": "/15/amendements/2343/CION_LOIS/CL12.pdf"
      }
    }
  ],
  "sort": {
    "dateSaisie": "2019-11-13T11:03:45.000+01:00",
    "sortEnSeance": "Rejeté"
  },
  "dateDepot": "2019-11-08T01:00:00.000+01:00",
  "dateDistribution": "2019-11-12T01:00:00.000+01:00",
  "article99": "0",
  "loiReference": {
    "codeLoi": "1"
  }
}