{
  "uid": "AMANR5L15SEA717460BTC1955P0D1N327",
  "identifiant": {
    "legislature": "15",
    "numero": "327",
    "numRect": "0",
    "saisine": {
      "texteLegislatifRef": "PNREANR5L15BTC1955",
      "numeroPartiePLF": "0",
      "organeExamen": "PO717460",
      "mentionSecondeDeliberation": "0"
    }
  },
  "numeroLong": "327",
  "etapeTexte": "Lecture unique",
  "triAmendement": "blaaaaaaaaaaaaaaaaaaaaaaaaaaaaaaaaaaaaaaaaaaaaaaaaihi",
  "cardinaliteAmdtMultiples": "1",
  "etat": "Discuté",
  "signataires": {
    "auteur": {
      "typeAuteur": "Depute",
      "acteurRef": "PA608416",
      "groupePolitiqueRef": "PO730934"
    },
    "cosignatairesRefs": [
      "PA608416",
      "PA330008"
    ],
    "texteAffichable": "M.&#160;Hetzel et M.&#160;Breton"
  },
  "pointeurFragmentTexte": {
    "division": {
      "titre": "Article 11",
      "articleDesignationCourte": "ART. 11",
      "type": "ARTICLE",
      "avantAApres": "A",
      "divisionRattachee": "ARTICLE 11",
      "urlDivisionTexteVise": "/15/textes/1955.asp#D_Article_11"
    }
  },
  "corps": {
    "dispositif": "<p style=\"text-align: justify;\">Supprimer cet article.</p>",
    "exposeSommaire": "<p style=\"text-align: justify;\">Cet article change les r&#232;gles relatives &#224; l&#8217;intervention des d&#233;put&#233;s sur les articles en s&#233;ance publique.</p><p style=\"text-align: justify;\">De telles dispositions vont affaiblir consid&#233;rablement l&#8217;expression pluraliste au sein des groupes. C&#8217;est pourquoi il convient de le supprimer.</p>"
  },
  "representations": [
    {
      "nom": "PDF",
      "typeMime": {
        "type": "application",
        "subType": "PDF"
      },
      "statutRepresentation": {
        "verbatim": true,
        "canonique": true,
        "officielle": true,
        "transcription": false,
        "enregistrement": false
      },
      "contenu": {
        "documentURI": "/15/amendements/1955/AN/327.pdf"
      }
    }
  ],
  "seanceDiscussion": "RUANR5L15S2019IDS21670",
  "sort": {
    "dateSaisie": "2019-05-29T16:46:58.000+02:00",
    "sortEnSeance": "Non soutenu"
  },
  "dateDepot": "2019-05-23T02:00:00.000+02:00",
  "dateDistribution": "2019-05-27T02:00:00.000+02:00",
  "article99": "0",
  "loiReference": {}
}