{
  "uid": "AMANR5L15PO59048B0384P0D1N276",
  "identifiant": {
    "legislature": "15",
    "numero": "276",
    "numRect": "0",
    "saisine": {
      "texteLegislatifRef": "PRJLANR5L15B0384",
      "numeroPartiePLF": "0",
      "organeExamen": "PO59048",
      "mentionSecondeDeliberation": "0"
    }
  },
  "numeroLong": "CF276",
  "etapeTexte": "1ère lecture (1ère assemblée saisie)",
  "triAmendement": "d",
  "cardinaliteAmdtMultiples": "1",
  "etat": "Discuté",
  "signataires": {
    "auteur": {
      "typeAuteur": "Depute",
      "acteurRef": "PA721202",
      "groupePolitiqueRef": "PO730958"
    },
    "cosignatairesRefs": [
      "PA719578",
      "PA721210",
      "PA720430",
      "PA721960",
      "PA720892",
      "PA718868",
      "PA721226",
      "PA718860",
      "PA722142",
      "PA720846",
      "PA721062",
      "PA721202",
      "PA720422",
      "PA588884",
      "PA719676",
      "PA720286",
      "PA2150"
    ],
    "texteAffichable": "M.&#160;Coquerel,  Mme&#160;Autain, M.&#160;Bernalicis, M.&#160;Corbi&#232;re, Mme&#160;Fiat, M.&#160;Lachaud, M.&#160;Larive, M.&#160;M&#233;lenchon, Mme&#160;Obono, Mme&#160;Panot, M.&#160;Prud&apos;homme, M.&#160;Quatennens, M.&#160;Ratenon, Mme&#160;Ressiguier, Mme&#160;Rubin, M.&#160;Ruffin et Mme&#160;Taurine"
  },
  "pointeurFragmentTexte": {
    "division": {
      "titre": "Article 14",
      "articleDesignationCourte": "ART. 14",
      "type": "ARTICLE",
      "avantAApres": "A",
      "divisionRattachee": "ARTICLE 14",
      "urlDivisionTexteVise": "/15/textes/0384.asp#D_Article_14"
    }
  },
  "corps": {
    "dispositif": "<p style=\"text-align: justify;\">Supprimer cet article.</p>",
    "exposeSommaire": "<p style=\"text-align: justify;\">Cet amendement propose de supprimer cet article.&#160;</p><p style=\"text-align: justify;\">En effet,&#160;il affaiblit la possibilit&#233; de lutte contre la fraude fiscale en facilitant l'acc&#232;s au r&#233;gime d&#233;rogatoire de l'imposition sur les plus-values effectu&#233;es en cas de fusion.&#160;Ce r&#233;gime d&#233;rogatoire dispose que les plus-values nettes et les profits d&#233;gag&#233;s sur l'ensemble des &#233;l&#233;ments d'actifs apport&#233;s du fait d'une fusion ne sont pas soumis &#224; l'imp&#244;t sur les soci&#233;t&#233;s.&#160;</p><p style=\"text-align: justify;\">Par cet article, le Gouvernement veut donc supprimer l&#8217;agr&#233;ment minist&#233;riel pr&#233;alable pour pouvoir b&#233;n&#233;ficier du r&#233;gime d&#233;rogatoire en le rempla&#231;ant par une simple d&#233;claration.</p><p style=\"text-align: justify;\">Le droit actuel&#160;est donc bien plus protecteur. En outre, l&#8217;amende en cas de non d&#233;claration d&#8217;adoption du r&#233;gime d&#233;rogatoire&#160;nous semble bien trop faible, puisqu'elle est forfaitaire et de seulement 10 000 euros. Enfin, le fait de d&#233;roger &#224; la loi et donc de devoir payer cette amende ne remet pas en cause l&#8217;accession ou non au r&#233;gime d&#233;rogatoire...</p>"
  },
  "representations": [
    {
      "nom": "PDF",
      "typeMime": {
        "type": "application",
        "subType": "PDF"
      },
      "statutRepresentation": {
        "verbatim": true,
        "canonique": true,
        "officielle": true,
        "transcription": false,
        "enregistrement": false
      },
      "contenu": {
        "documentURI": "/15/amendements/0384/CION_FIN/CF276.pdf"
      }
    }
  ],
  "sort": {
    "dateSaisie": "2017-11-29T13:05:52.000+01:00",
    "sortEnSeance": "Rejeté"
  },
  "dateDepot": "2017-11-25T01:00:00.000+01:00",
  "dateDistribution": "2017-11-28T01:00:00.000+01:00",
  "article99": "0",
  "loiReference": {}
}