{
  "uid": "AMANR5L15SEA717460B0235P2D1N58",
  "identifiant": {
    "legislature": "15",
    "numero": "58",
    "numRect": "0",
    "saisine": {
      "texteLegislatifRef": "PRJLANR5L15B0235",
      "numeroPartiePLF": "2",
      "organeExamen": "PO717460",
      "mentionSecondeDeliberation": "0"
    }
  },
  "numeroLong": "II-58",
  "etapeTexte": "1ère lecture (1ère assemblée saisie)",
  "triAmendement": "zzz",
  "cardinaliteAmdtMultiples": "1",
  "etat": "Discuté",
  "signataires": {
    "auteur": {
      "typeAuteur": "Depute",
      "acteurRef": "PA267766",
      "groupePolitiqueRef": "PO730952"
    },
    "cosignatairesRefs": [
      "PA942",
      "PA719806",
      "PA720230",
      "PA332228",
      "PA333421",
      "PA720696",
      "PA267766",
      "PA712014",
      "PA267355",
      "PA267780",
      "PA331582",
      "PA693008",
      "PA642868",
      "PA331567",
      "PA267330",
      "PA267585",
      "PA267042",
      "PA1960",
      "PA267241",
      "PA266788"
    ],
    "texteAffichable": "M.&#160;Guy&#160;Bricout,  Mme&#160;Auconie, M.&#160;Zumkeller, M.&#160;Leroy, M.&#160;Ledoux, M.&#160;Charles&#160;de Courson, Mme&#160;Firmin Le Bodo, Mme&#160;Descamps, M.&#160;Favennec Becot, Mme&#160;de La Raudi&#232;re, Mme&#160;Magnier, M.&#160;Christophe, M.&#160;Philippe&#160;Vigier, M.&#160;Morel-&#192;-L&apos;Huissier, M.&#160;Polutele, M.&#160;Herth, M.&#160;Demilly, M.&#160;Vercamer, M.&#160;Benoit et M.&#160;Pancher"
  },
  "pointeurFragmentTexte": {
    "division": {
      "titre": "Article 44",
      "articleDesignationCourte": "APRÈS ART. 44",
      "type": "ARTICLE",
      "avantAApres": "Apres",
      "divisionRattachee": "APRÈS L'ARTICLE 44, insérer l'article suivant:",
      "articleAdditionnel": "1",
      "urlDivisionTexteVise": "/15/textes/0235C.asp#D_Article_44"
    }
  },
  "corps": {
    "dispositif": "<p style=\"text-align: justify;\">I.&#160;&#8211;&#160;Le code g&#233;n&#233;ral des imp&#244;ts est ainsi modifi&#233;</p><p style=\"text-align: justify;\">1&#176; L&#8217;article&#160;72 D <i>bis</i> du code g&#233;n&#233;ral des imp&#244;ts est ainsi r&#233;dig&#233;&#160;:</p><p style=\"text-align: justify;\">&#171;&#160;I.&#160;&#8211;&#160;1.&#160;&#8211;&#160;Les exploitants agricoles soumis &#224; un r&#233;gime r&#233;el d&#8217;imposition peuvent pratiquer une d&#233;duction pour &#233;pargne de pr&#233;caution dans les limites et conditions pr&#233;vues &#224; l&#8217;article&#160;72&#160;D&#160;<i>ter</i>.</p><p style=\"text-align: justify;\">&#171;&#160;La d&#233;duction pour &#233;pargne de pr&#233;caution s&#8217;exerce &#224; la condition que, dans les six mois de la cl&#244;ture de l&#8217;exercice et au plus tard &#224; la date de d&#233;p&#244;t de la d&#233;claration des r&#233;sultats se rapportant &#224; l&#8217;exercice au titre duquel la d&#233;duction est pratiqu&#233;e, l&#8217;exploitant ait inscrit &#224; un compte d&#8217;affectation ouvert aupr&#232;s d&#8217;un &#233;tablissement de cr&#233;dit, une somme comprise entre 50&#160;% et 100&#160;% du montant de la d&#233;duction. L&#8217;&#233;pargne professionnelle de pr&#233;caution ainsi constitu&#233;e doit &#234;tre inscrite &#224; l&#8217;actif du bilan de l&#8217;exploitation. Les int&#233;r&#234;ts produits par cette &#233;pargne professionnelle et qui sont capitalis&#233;s dans le compte d&#8217;affectation ne sont pas soumis &#224; l&#8217;imp&#244;t. &#192; tout moment, la somme de l&#8217;&#233;pargne professionnelle et des int&#233;r&#234;ts capitalis&#233;s est au moins &#233;gale &#224; 50&#160;% du montant des d&#233;ductions non encore rapport&#233;es. Elle ne peut jamais exc&#233;der le montant des d&#233;ductions non encore rapport&#233;es.</p><p style=\"text-align: justify;\">&#171;&#160;La condition d&#8217;inscription au compte d&#8217;affectation vis&#233; au deuxi&#232;me alin&#233;a est r&#233;put&#233;e respect&#233;e &#224; due concurrence de l&#8217;accroissement du stock de fourrages et aliments destin&#233; &#224; &#234;tre consomm&#233; par les animaux de l&#8217;exploitation par rapport &#224; la valeur moyenne du stock en fin d&#8217;exercice calcul&#233;e sur les trois exercices pr&#233;c&#233;dents.</p><p style=\"text-align: justify;\">&#171;&#160;En cas de vente de ces stocks de fourrage ou aliments, le produit de la vente doit &#234;tre inscrit au compte d&#8217;affectation dans la limite du montant ayant &#233;t&#233; dispens&#233; de l&#8217;inscription au compte d&#8217;affectation, d&#233;duction faite des montants exempt&#233;s de l&#8217;obligation d&#8217;inscription et utilis&#233;s de fa&#231;on conforme.</p><p style=\"text-align: justify;\">&#171;&#160;2.&#160;&#8211;&#160;Les sommes d&#233;duites et leurs int&#233;r&#234;ts capitalis&#233;s non soumis &#224; l&#8217;imp&#244;t peuvent &#234;tre utilis&#233;s&#160;:</p><p style=\"text-align: justify;\">&#171;&#160;<i>a)</i> Au titre de chaque exercice, pour l&#8217;acquisition de fourrages et aliments destin&#233;s &#224; &#234;tre consomm&#233;s par les animaux de l&#8217;exploitation dans les six mois qui pr&#233;c&#232;dent ou qui suivent la reconnaissance du caract&#232;re de calamit&#233; agricole sur le canton de l&#8217;exploitation ou les cantons limitrophes&#160;;</p><p style=\"text-align: justify;\">&#171;&#160;<i>b)</i> Pour le r&#232;glement au cours de l&#8217;exercice des primes et cotisations d&#8217;assurance responsabilit&#233; civile professionnelle, de dommage aux biens ou pour perte d&#8217;exploitation souscrite par l&#8217;exploitant&#160;;</p><p style=\"text-align: justify;\">&#171;&#160;<i>c)</i> Au titre de l&#8217;exercice de survenance d&#8217;un incendie ou d&#8217;un dommage aux cultures ou de perte du b&#233;tail assur&#233;, ou des deux exercices suivants&#160;;</p><p style=\"text-align: justify;\">&#171;&#160;<i>d)</i> Au titre de l&#8217;exercice de survenance d&#8217;un al&#233;a non assur&#233; d&#8217;origine climatique, naturelle ou sanitaire, reconnu par une autorit&#233; administrative comp&#233;tente, ou des deux exercices suivants&#160;;</p><p style=\"text-align: justify;\">&#171;&#160;<i>e)</i> Au titre de l&#8217;exercice de survenance d&#8217;un al&#233;a &#233;conomique, lequel est &#233;tabli par une baisse de la valeur ajout&#233;e de l&#8217;exercice, par rapport &#224; la moyenne des valeurs ajout&#233;es des trois ou des cinq exercices pr&#233;c&#233;dents, sup&#233;rieure &#224; 5&#160;%&#160;;</p><p style=\"text-align: justify;\">&#171;&#160;<i>f)</i> Au titre de l&#8217;exercice de mise en service d&#8217;une immobilisation destin&#233;e &#224; la pr&#233;vention des risques de l&#8217;exploitation list&#233;e par d&#233;cret. Lorsque la d&#233;duction est utilis&#233;e &#224; l&#8217;acquisition ou &#224; la cr&#233;ation d&#8217;immobilisations amortissables, la base d&#8217;amortissement de celles-ci est r&#233;duite &#224; due concurrence.</p><p style=\"text-align: justify;\">&#171;&#160;L&#8217;utilisation des sommes d&#233;duites est r&#233;put&#233;e porter sur les d&#233;ductions pratiqu&#233;es les plus anciennes.</p><p style=\"text-align: justify;\">&#171;&#160;3.&#160;&#8211;&#160;Les sommes d&#233;duites et les int&#233;r&#234;ts ainsi utilis&#233;s sont rapport&#233;s au r&#233;sultat de l&#8217;exercice au cours duquel leur utilisation au sens du 2 du I est intervenue.</p><p style=\"text-align: justify;\">&#171;&#160;Lorsque ces sommes et int&#233;r&#234;ts sont pr&#233;lev&#233;s dans des cas autres que ceux mentionn&#233;s au 2 du pr&#233;sent I, ils sont rapport&#233;s au r&#233;sultat de l&#8217;exercice au cours duquel cette utilisation a &#233;t&#233; effectu&#233;e et major&#233;s d&#8217;un montant &#233;gal au produit de ces sommes et int&#233;r&#234;ts par le taux de l&#8217;int&#233;r&#234;t de retard pr&#233;vu &#224; l&#8217;article&#160;1727. Les int&#233;r&#234;ts de retard courent &#224; compter de la date d&#8217;ouverture de l&#8217;exercice suivant celui au titre duquel la d&#233;duction a &#233;t&#233; op&#233;r&#233;e. Ils sont r&#233;put&#233;s porter sur les d&#233;ductions pratiqu&#233;es les plus anciennes et non encore utilis&#233;es.</p><p style=\"text-align: justify;\">&#171;&#160;En cas de non-respect de l&#8217;obligation pr&#233;vue &#224; l&#8217;avant-derni&#232;re phrase du deuxi&#232;me alin&#233;a du 1 du&#160;I, la fraction des d&#233;ductions non encore rapport&#233;es qui exc&#232;de le double de l&#8217;&#233;pargne professionnelle est rapport&#233;e au r&#233;sultat de cet exercice, major&#233;e d&#8217;un montant &#233;gal au produit de cette somme par le taux de l&#8217;int&#233;r&#234;t de retard pr&#233;vu &#224; l&#8217;article&#160;1727. Ils sont r&#233;put&#233;s porter sur les d&#233;ductions pratiqu&#233;es les plus anciennes et non encore utilis&#233;es.</p><p style=\"text-align: justify;\">&#171;&#160;II.&#160;1.&#160;&#8211;&#160;L&#8217;apport d&#8217;une exploitation individuelle, ou d&#8217;une branche compl&#232;te d&#8217;activit&#233;, dans les conditions vis&#233;es au I de l&#8217;article&#160;151&#160;<i>octies</i>, &#224; une soci&#233;t&#233; civile agricole par un exploitant agricole qui a pratiqu&#233; la d&#233;duction au titre d&#8217;un exercice pr&#233;c&#233;dant celui de l&#8217;apport n&#8217;est pas consid&#233;r&#233; pour l&#8217;application du I comme une cessation d&#8217;activit&#233; si la soci&#233;t&#233; b&#233;n&#233;ficiaire de l&#8217;apport en remplit les conditions et s&#8217;engage &#224; utiliser les sommes d&#233;pos&#233;es sur le compte dans les conditions mentionn&#233;es au 2 du I.</p><p style=\"text-align: justify;\">&#171;&#160;La transmission &#224; titre gratuit d&#8217;une exploitation individuelle dans les conditions pr&#233;vues &#224; l&#8217;article&#160;41 par un exploitant agricole qui a pratiqu&#233; la d&#233;duction au titre d&#8217;un exercice pr&#233;c&#233;dant celui de la transmission n&#8217;est pas consid&#233;r&#233;e pour l&#8217;application du I comme une cessation d&#8217;activit&#233; si le ou les b&#233;n&#233;ficiaires de la transmission remplissent les conditions ouvrant droit &#224; la d&#233;duction et s&#8217;engagent &#224; utiliser les sommes d&#233;pos&#233;es sur le compte dans les conditions et les limites d&#233;finies au I.</p><p style=\"text-align: justify;\">&#171;&#160;2.&#160;&#8211;&#160;La cession &#224; titre on&#233;reux d&#8217;une entreprise individuelle, ou d&#8217;une branche compl&#232;te d&#8217;activit&#233;, par un exploitant agricole qui a pratiqu&#233; la d&#233;duction au titre d&#8217;un exercice pr&#233;c&#233;dant celui de la cession n&#8217;est pas consid&#233;r&#233;e pour l&#8217;application du I comme une cessation d&#8217;activit&#233; si le ou les b&#233;n&#233;ficiaires de la cession remplissent les conditions ouvrant droit &#224; la d&#233;duction et s&#8217;engagent &#224; utiliser les sommes d&#233;pos&#233;es sur le compte dans les conditions et les limites d&#233;finies au I.</p><p style=\"text-align: justify;\">&#171;&#160;3. En cas de cessation d&#8217;activit&#233;, ou d&#8217;assujettissement au r&#233;gime d&#8217;imposition vis&#233; &#224; l&#8217;article&#160;64&#160;<i>bis</i> du pr&#233;sent code, les sommes initialement d&#233;duites et les int&#233;r&#234;ts non encore utilis&#233;s sont rapport&#233;s aux r&#233;sultats de l&#8217;exercice clos &#224; l&#8217;occasion de cet &#233;v&#233;nement et impos&#233;es selon les modalit&#233;s de l&#8217;article&#160;163&#160;OA.</p><p style=\"text-align: justify;\">&#171;&#160;III.&#160;&#8211;&#160;Le compte ouvert aupr&#232;s d&#8217;un &#233;tablissement de cr&#233;dit est un compte courant qui retrace exclusivement les op&#233;rations d&#233;finies au I.&#160;&#187;&#160;;</p><p style=\"text-align: justify;\">2&#176; L&#8217;article&#160;72 D <i>ter</i> est ainsi r&#233;dig&#233;&#160;:</p><p style=\"text-align: justify;\">&#171;&#160;<i>Art.&#160;72 D</i> ter.&#160;&#8211;&#160;I.&#160;&#8211;&#160;Dans la limite du b&#233;n&#233;fice, les d&#233;ductions pr&#233;vues aux articles 72 D et 72 D bis sont plafonn&#233;es &#224; un montant global fix&#233;, par exercice de douze mois, &#224; 20&#160;000&#160;&#8364; major&#233; de 30&#160;% du chiffre d&#8217;affaires de l&#8217;exercice. La d&#233;duction pr&#233;vue &#224; l&#8217;article&#160;72 D est toutefois plafonn&#233;e &#224; 20 000&#160;&#8364; dans les m&#234;mes conditions. Pour les exploitations agricoles &#224; responsabilit&#233; limit&#233;e qui n&#8217;ont pas opt&#233; pour le r&#233;gime fiscal des soci&#233;t&#233;s de capitaux, le montant de 20&#160;000&#160;&#8364; est multipli&#233; par le nombre des associ&#233;s exploitants, dans la limite de quatre.</p><p style=\"text-align: justify;\">&#171;&#160;Les d&#233;ductions pratiqu&#233;es et non encore rapport&#233;es au r&#233;sultat pr&#233;vues aux articles 72&#160;D et 72&#160;D&#160;<i>bis</i>, sont plafonn&#233;es &#224; 150&#160;000&#160;&#8364; ou 75&#160;% du chiffre d&#8217;affaires moyen des cinq derniers exercices&#160;; un compl&#233;ment de d&#233;duction peut &#234;tre op&#233;r&#233; en cas de variation &#224; la hausse du chiffre d&#8217;affaires moyen. Toutefois, la d&#233;duction vis&#233;e &#224; l&#8217;article&#160;72&#160;D est plafonn&#233;e &#224; 100&#160;000&#160;&#8364; . Pour les exploitations &#224; responsabilit&#233; limit&#233;e vis&#233;es au premier alin&#233;a, les montants de 100 000 et 150 000&#160;&#8364; sont multipli&#233;s par le nombre des associ&#233;s exploitants, dans la limite de quatre.</p><p style=\"text-align: justify;\">&#171;&#160;II.&#160;&#8211;&#160;Les d&#233;ductions mentionn&#233;es au premier alin&#233;a du I sont pratiqu&#233;es apr&#232;s application des abattements pr&#233;vus aux articles 44&#160;<i>quaterdecies</i> et 73B.&#160;&#187;</p><p style=\"text-align: justify;\">3&#176; Le 4&#176; de l&#8217;article&#160;71 est ainsi r&#233;dig&#233;&#160;:</p><p style=\"text-align: justify;\">&#171;&#160;Les montants de 20 000&#160;&#8364;, 100 000&#160;&#8364; et 150 000&#160;&#8364; vis&#233;s au I de l&#8217;article&#160;72&#160;D&#160;<i>ter</i> sont multipli&#233;s par le nombre d&#8217;associ&#233;s du groupement dans la limite de quatre.&#160;&#187;</p><p style=\"text-align: justify;\">II.&#160;&#8211; Le I est applicable &#224; compter du 1<sup>er</sup> janvier 2019.</p><p style=\"text-align: justify;\">III.&#160;&#8211;&#160;Les pertes de recettes r&#233;sultant pour l&#8217;&#201;tat du I sont compens&#233;es par la cr&#233;ation d&#8217;une taxe additionnelle aux droits pr&#233;vus aux articles 575 et 575 A du code g&#233;n&#233;ral des imp&#244;ts.</p>",
    "exposeSommaire": "<p style=\"text-align: justify;\">Cet amendement vise &#224; permettre aux exploitants agricoles, soumis &#224; un r&#233;gime r&#233;el d&#8217;imposition, de pratiquer une d&#233;duction pour &#233;pargne de pr&#233;caution.</p>"
  },
  "representations": [
    {
      "nom": "PDF",
      "typeMime": {
        "type": "application",
        "subType": "PDF"
      },
      "statutRepresentation": {
        "verbatim": true,
        "canonique": true,
        "officielle": true,
        "transcription": false,
        "enregistrement": false
      },
      "contenu": {
        "documentURI": "/15/amendements/0235C/AN/58.pdf"
      }
    }
  ],
  "seanceDiscussion": "RUANR5L15S2018IDS20763",
  "sort": {
    "dateSaisie": "2017-11-16T23:26:19.000+01:00",
    "sortEnSeance": "Rejeté"
  },
  "dateDepot": "2017-10-25T02:00:00.000+02:00",
  "dateDistribution": "2017-11-15T01:00:00.000+01:00",
  "article99": "0",
  "loiReference": {
    "codeLoi": "CGI",
    "divisionCodeLoi": "72 D bis"
  }
}