{
  "uid": "AMANR5L15SEA717460BTC2243P0D1N1860",
  "identifiant": {
    "legislature": "15",
    "numero": "1860",
    "numRect": "0",
    "saisine": {
      "texteLegislatifRef": "PRJLANR5L15BTC2243",
      "numeroPartiePLF": "0",
      "organeExamen": "PO717460",
      "mentionSecondeDeliberation": "0"
    }
  },
  "numeroLong": "1860",
  "etapeTexte": "1ère lecture (1ère assemblée saisie)",
  "triAmendement": "esaaaaaaaaaaaaaaaaaaaaaaaaaaaaaaaaaaaaaaaaaaaaaaaackknx",
  "cardinaliteAmdtMultiples": "1",
  "etat": "Discuté",
  "signataires": {
    "auteur": {
      "typeAuteur": "Depute",
      "acteurRef": "PA642847",
      "groupePolitiqueRef": "PO730934"
    },
    "cosignatairesRefs": [
      "PA642847"
    ],
    "texteAffichable": "M.&#160;Bazin"
  },
  "pointeurFragmentTexte": {
    "division": {
      "titre": "Article 17",
      "articleDesignationCourte": "ART. 17",
      "type": "ARTICLE",
      "avantAApres": "A",
      "divisionRattachee": "ARTICLE 17",
      "urlDivisionTexteVise": "/15/textes/2243.asp#D_Article_17"
    },
    "alinea": {
      "avantAApres": "A",
      "numero": "1",
      "alineaDesignation": "Alinéa 1"
    }
  },
  "corps": {
    "dispositif": "<p>Supprimer les alin&#233;as 1 et 2.</p>",
    "exposeSommaire": "<p style=\"text-align: justify;\">Les alin&#233;as 1 et 2 de l&#8217;article&#160;17 pr&#233;voient la substitution du second alin&#233;a de l&#8217;article L 2151&#8209;2 du code de la sant&#233; publique qui dispose que &#171;&#160;la cr&#233;ation d&#8217;embryons transg&#233;niques ou chim&#233;riques est interdite&#160;&#187; par &#171;&#160;la modification d&#8217;un embryon humain par adjonction de cellules provenant d&#8217;autres esp&#232;ces est interdite.&#160;&#187;</p><p style=\"text-align: justify;\">Cette substitution signifie a contrario que les chercheurs pourront cr&#233;er en laboratoire des embryons transg&#233;niques et chim&#233;riques.&#160;</p><p style=\"text-align: justify;\">A Embryons transg&#233;niques</p><p style=\"text-align: justify;\">Il convient de s&#8217;interroger sur les motivations de la suppression de cet interdit fondateur du droit fran&#231;ais de la bio&#233;thique. Comme cela a &#233;t&#233; soulign&#233; par le Conseil d&#8217;&#201;tat, l&#8217;interdiction de cr&#233;er des embryons transg&#233;niques &#171;&#160;se heurte d&#233;sormais &#224; l&#8217;&#233;volution des techniques&#160;&#187;. &#160;N&#8217;est-ce-pas une d&#233;rive&#160;: tout ce qui est techniquement possible doit-il &#234;tre l&#233;galis&#233;&#160;?</p><p style=\"text-align: justify;\">En autorisant la cr&#233;ation d&#8217;embryons transg&#233;niques, est-ce qu&#8217;on n&#8217;emprunte pas une pente glissante&#160;?</p><p style=\"text-align: justify;\">La suppression de l&#8217;interdit de cr&#233;er des embryons transg&#233;niques rend possible l&#8217;exp&#233;rimentation de la technique CRISPR-Cas 9 dite du &#171;&#160;ciseau mol&#233;culaire&#160;&#187; sur l&#8217;embryon humain in vitro.</p><p style=\"text-align: justify;\">Elle rend &#233;galement possible l&#8217;exp&#233;rimentation sur l&#8217;embryon in vitro de la technique de la FIV &#224; trois parents. Cette technique permet de cr&#233;er des embryons transg&#233;niques compos&#233;s de 3 ADN&#160;: l&#8217;ADN nucl&#233;aire des deux g&#233;niteurs et l&#8217;ADN mitochondrial de la donneuse.</p><p style=\"text-align: justify;\">Ces deux techniques pourraient aboutir &#224; cr&#233;er en laboratoire des embryons g&#233;n&#233;tiquement modifi&#233;s, mena&#231;ant le patrimoine g&#233;n&#233;tique de l&#8217;humanit&#233;.</p><p style=\"text-align: justify;\">En effet, le cadre l&#233;gal est d&#233;j&#224; pr&#234;t pour faire na&#238;tre des b&#233;b&#233;s transg&#233;niques. Le r&#233;gime de recherches biom&#233;dicales en AMP autorise la recherche sur des embryons et gam&#232;tes avant leur transfert &#224; des fins de gestation.</p><p style=\"text-align: justify;\">Combin&#233; &#224; la lev&#233;e de l&#8217;interdit fondateur, ce r&#233;gime de recherche codifi&#233; &#224; l&#8217;article L 2151&#8209;5 V du code de la sant&#233; publique (alin&#233;as 1 et 2 de l&#8217;article&#160;14 du projet de loi), permettra-il &#224; des femmes qui ont recours &#224; la PMA de donner naissance &#224; des enfants qui ont &#233;t&#233; cr&#233;&#233;s et modifi&#233;s g&#233;n&#233;tiquement en laboratoire&#160;? N&#8217;y a t-il pas un risque d&#8217;atteinte au g&#233;nome de l&#8217;esp&#232;ce humaine&#160;?</p><p style=\"text-align: justify;\">Il convient d&#8217;interdire la cr&#233;ation d&#8217;embryons transg&#233;niques sauf &#224; prendre le risque de modifier le g&#233;nome de la descendance en violation de l&#8217;article&#160;13 de la Convention d&#8217;Oviedo et de l&#8217;article&#160;16&#8209;4 du code civil.</p><p style=\"text-align: justify;\">L&#8217;absence de transfert des embryons &#224; des fins de gestation est illusoire, comme en t&#233;moigne la r&#233;cente actualit&#233; chinoise qui a provoqu&#233; l&#8217;indignation de la communaut&#233; scientifique internationale. En novembre 2018, le chercheur He Jiankui annon&#231;ait avoir fait na&#238;tre des jumelles g&#233;n&#233;tiquement modifi&#233;es, dans le but de les rendre r&#233;sistantes au VIH, le g&#233;nome des embryons ayant &#233;t&#233; modifi&#233; avec l&#8217;outil CRISPR-Cas 9[1].</p><p style=\"text-align: justify;\">Ainsi, si le l&#233;gislateur fran&#231;ais autorise la cr&#233;ation d&#8217;embryons transg&#233;niques, les chercheurs solliciteront demain ou apr&#232;s-demain l&#8217;autorisation de pouvoir les transf&#233;rer une fois que leur technique sera &#233;prouv&#233;e. Dans l&#8217;attente de cette autorisation l&#233;gale, on prend le risque qu&#8217;ils contournent la loi comme cela s&#8217;est d&#233;j&#224; produit. Certes on maintient l&#8217;interdiction d&#8217;adjonction de cellules animales dans l&#8217;embryon humain MAIS on l&#232;ve l&#8217;interdiction de l&#8217;adjonction de cellules humaines dans l&#8217;embryon animal.</p><p style=\"text-align: justify;\">B Embryons chim&#233;riques animal-homme</p><p style=\"text-align: justify;\">Le Conseil d&#8217;&#201;tat a identifi&#233; trois risques relatifs &#224; la cr&#233;ation de chim&#232;res animal-homme&#160;:&#160;</p><p style=\"text-align: justify;\">- &#171;&#160;ne risque-t-on pas de susciter une nouvelle zoonose (ie. une infection ou infestation qui se&#160; transmet naturellement des animaux vert&#233;br&#233;s &#224; l&#8217;homme et vice&#8208;versa)&#160;?</p><p style=\"text-align: justify;\">- ne risque-t-on pas de repr&#233;sentation humaine chez l&#8217;animal (si ce dernier acqu&#233;rait des aspects visibles ou des attributs propres &#224; l&#8217;humain)&#160;;&#160;</p><p style=\"text-align: justify;\">- ne prend-on pas le&#160; risque&#160; de&#160; conscience&#160; humaine&#160; chez &#160;l&#8217;animal&#160; (si&#160; l&#8217;injection&#160; de&#160; cellules&#160; pluripotentes&#160; humaines&#160; produisait&#160; des&#160; r&#233;sultats&#160; collat&#233;raux&#160; induisant&#160; des&#160; modifications&#160; chez&#160; l&#8217;animal&#160; dans&#160; le&#160; sens&#160; d&#8217;une&#160; conscience&#160; ayant&#160; des&#160; caract&#233;ristiques humaines )[2]&#160;?&#160;&#187;.&#160;</p><p style=\"text-align: justify;\">Au regard du risque de transgression des fronti&#232;res entre l&#8217;esp&#232;ce humaine et l&#8217;esp&#232;ce animale, il faut donc interdire la cr&#233;ation d&#8217;embryons chim&#233;riques, qu&#8217;il s&#8217;agisse d&#8217;embryons animal-homme ou d&#8217;embryons homme-animal.</p><p style=\"text-align: justify;\">Compte tenu de la menace pesant sur le patrimoine g&#233;n&#233;tique de l&#8217;humanit&#233;, il convient d&#8217;interdire la cr&#233;ation d&#8217;embryons transg&#233;niques et d&#8217;embryons chim&#233;riques et en cons&#233;quence, les alin&#233;as 1 et 2 de l&#8217;article&#160;17 doivent &#234;tre supprim&#233;s.</p><p style=\"text-align: justify;\"><br /> <br /> [1] G&#232;n&#233;thique, &#171;&#160;Chine&#160;: Naissance de deux b&#233;b&#233;s g&#233;n&#233;tiquement modifi&#233;s&#160;&#187;, 26 novembre 2018<br /> [2] Conseil d&#8217;&#201;tat &#171;&#160;R&#233;vision&#160;de&#160;la&#160;loi&#160;de&#160;bio&#233;thique&#160;:&#160; quelles&#160;options&#160;pour&#160;demain&#160;?&#160;&#187;, 28 juin 2018, p 186 et 187</p>"
  },
  "representations": [
    {
      "nom": "PDF",
      "typeMime": {
        "type": "application",
        "subType": "PDF"
      },
      "statutRepresentation": {
        "verbatim": true,
        "canonique": true,
        "officielle": true,
        "transcription": false,
        "enregistrement": false
      },
      "contenu": {
        "documentURI": "/15/amendements/2243/AN/1860.pdf"
      }
    }
  ],
  "seanceDiscussion": "RUANR5L15S2020IDS21849",
  "sort": {
    "dateSaisie": "2019-10-04T22:01:55.000+02:00",
    "sortEnSeance": "Rejeté"
  },
  "dateDepot": "2019-09-19T02:00:00.000+02:00",
  "dateDistribution": "2019-09-26T02:00:00.000+02:00",
  "article99": "0",
  "loiReference": {}
}