{
  "uid": "AMANR5L15PO744107B0424P0D1N591",
  "identifiant": {
    "legislature": "15",
    "numero": "591",
    "numRect": "0",
    "saisine": {
      "texteLegislatifRef": "PRJLANR5L15B0424",
      "numeroPartiePLF": "0",
      "organeExamen": "PO744107",
      "mentionSecondeDeliberation": "0"
    }
  },
  "numeroLong": "591",
  "etapeTexte": "1ère lecture (1ère assemblée saisie)",
  "triAmendement": "c",
  "cardinaliteAmdtMultiples": "1",
  "etat": "Discuté",
  "signataires": {
    "auteur": {
      "typeAuteur": "Depute",
      "acteurRef": "PA719938",
      "groupePolitiqueRef": "PO730970"
    },
    "cosignatairesRefs": [
      "PA722162",
      "PA720764",
      "PA719938",
      "PA721976",
      "PA719874",
      "PA722284",
      "PA718978"
    ],
    "texteAffichable": "M.&#160;Fesneau,  M.&#160;Fuchs, Mme&#160;Jacquier-Laforge, M.&#160;Laqhila, Mme&#160;Lasserre-David, M.&#160;Millienne, M.&#160;Turquois et les membres du groupe du Mouvement D&#233;mocrate et apparent&#233;s"
  },
  "pointeurFragmentTexte": {
    "division": {
      "titre": "Article 32",
      "articleDesignationCourte": "APRÈS ART. 32",
      "type": "ARTICLE",
      "avantAApres": "Apres",
      "divisionRattachee": "APRÈS L'ARTICLE 32, insérer l'article suivant:",
      "articleAdditionnel": "1",
      "urlDivisionTexteVise": "/15/textes/0424.asp#D_Article_32"
    }
  },
  "corps": {
    "dispositif": "<p style=\"text-align: justify;\">Le deuxi&#232;me alin&#233;a de l&#8217;article L.&#160;561&#8209;46 du code mon&#233;taire et financier est compl&#233;t&#233; par la phrase suivante&#160;:</p><p style=\"text-align: justify;\">&#171;&#160;Ce d&#233;p&#244;t n&#8217;est pas requis si les &#233;l&#233;ments d&#8217;identification et le domicile personnel du b&#233;n&#233;ficiaire effectif ont d&#233;j&#224; &#233;t&#233; d&#233;clar&#233;s au greffe du tribunal en application des dispositions des articles L.&#160;123&#8209;1 et suivants du code de commerce.&#160;&#187;.</p>",
    "exposeSommaire": "<p style=\"text-align: justify;\">Pour les soci&#233;t&#233;s tenues de s&#8217;immatriculer au registre du commerce et des soci&#233;t&#233;s, il est propos&#233; de supprimer l&#8217;obligation de d&#233;poser au greffe du tribunal de commerce un document relatif &#224; leurs b&#233;n&#233;ficiaires effectifs, dans la mesure o&#249; les nformations concern&#233;es lui ont d&#233;j&#224; &#233;t&#233; d&#233;clar&#233;es.</p><p style=\"text-align: justify;\">On entend par b&#233;n&#233;ficiaire effectif la ou les personnes physiques qui d&#233;tiennent, directement ou indirectement, plus de 25&#160;% du capital ou des droits de vote de la soci&#233;t&#233;. Or, devaient d&#233;j&#224; &#234;tre d&#233;clar&#233;s au registre du commerce et des soci&#233;t&#233;s les nom, nom d&#8217;usage, pseudonyme, pr&#233;noms et domicile personnel des associ&#233;s tenus ind&#233;finiment ou tenus ind&#233;finiment et solidairement des dettes sociales.</p><p style=\"text-align: justify;\">Pour les soci&#233;t&#233;s concern&#233;es, l&#8217;obligation de d&#233;claration des b&#233;n&#233;ficiaires effectifs est donc redondante des obligations pr&#233;existantes, tout du moins pour les soci&#233;t&#233;s dont les associ&#233;s ne sont que des personnes physiques.</p>"
  },
  "representations": [
    {
      "nom": "PDF",
      "typeMime": {
        "type": "application",
        "subType": "PDF"
      },
      "statutRepresentation": {
        "verbatim": true,
        "canonique": true,
        "officielle": true,
        "transcription": false,
        "enregistrement": false
      },
      "contenu": {
        "documentURI": "/15/amendements/0424/CSCONF/591.pdf"
      }
    }
  ],
  "sort": {
    "dateSaisie": "2018-01-17T19:41:21.000+01:00",
    "sortEnSeance": "Rejeté"
  },
  "dateDepot": "2018-01-11T01:00:00.000+01:00",
  "dateDistribution": "2018-01-15T01:00:00.000+01:00",
  "article99": "0",
  "loiReference": {
    "codeLoi": "monétaire et financier",
    "divisionCodeLoi": "561-46"
  }
}