{
  "uid": "AMANR5L15PO59048B1255P2D1N539",
  "identifiant": {
    "legislature": "15",
    "numero": "539",
    "numRect": "0",
    "saisine": {
      "texteLegislatifRef": "PRJLANR5L15B1255",
      "numeroPartiePLF": "2",
      "organeExamen": "PO59048",
      "mentionSecondeDeliberation": "0"
    }
  },
  "numeroLong": "II-CF539",
  "etapeTexte": "1ère lecture (1ère assemblée saisie)",
  "triAmendement": "jgaaaaaaaaaaaaaaaaaaaaaaaaaaaaaaaaaaaaaaaaaaaaaaaaabbkss",
  "cardinaliteAmdtMultiples": "1",
  "etat": "Discuté",
  "signataires": {
    "auteur": {
      "typeAuteur": "Depute",
      "acteurRef": "PA720576",
      "groupePolitiqueRef": "PO730964"
    },
    "cosignatairesRefs": [
      "PA719230",
      "PA720030",
      "PA720576",
      "PA606639",
      "PA721328",
      "PA720854"
    ],
    "texteAffichable": "M.&#160;Bois,  Mme&#160;Brugnera, M.&#160;Vignal, M.&#160;Test&#233;, M.&#160;Freschi et M.&#160;Kerlogot"
  },
  "pointeurFragmentTexte": {
    "division": {
      "titre": "Article 55",
      "articleDesignationCourte": "APRÈS ART. 55",
      "type": "ARTICLE",
      "avantAApres": "Apres",
      "divisionRattachee": "APRÈS L'ARTICLE 55, insérer l'article suivant:",
      "articleAdditionnel": "1",
      "urlDivisionTexteVise": "/15/textes/1255C.asp#D_Article_55"
    }
  },
  "corps": {
    "dispositif": "<p style=\"text-align: justify;\">I.&#160;&#8211;&#160;Au premier alin&#233;a du III de l&#8217;article&#160;220 <i>octies</i> du code g&#233;n&#233;ral des imp&#244;ts, l&#8217;ann&#233;e&#160;: &#171;&#160;2019&#160;&#187; est remplac&#233;e par l&#8217;ann&#233;e&#160;: &#171;&#160;2022&#160;&#187;.</p><p style=\"text-align: justify;\">II.&#160;&#8211;&#160;La perte de recettes pour l&#8217;&#201;tat est compens&#233;e &#224; due concurrence par la cr&#233;ation d&#8217;une taxe additionnelle aux droits vis&#233;s aux articles 575 et 575A du code g&#233;n&#233;ral des imp&#244;ts.</p><p style=\"text-align: justify;\">III.&#160;&#8211;&#160;Le I n&#8217;est applicable qu&#8217;aux sommes venant en d&#233;duction de l&#8217;imp&#244;t d&#251;.</p>",
    "exposeSommaire": "<p style=\"text-align: justify;\">Le pr&#233;sent amendement a pour objet de proroger de 3 ans, soit jusqu&#8217;au 31 d&#233;cembre 2022, le cr&#233;dit d&#8217;imp&#244;t pour d&#233;penses de production d&#8217;enregistrements phonographiques, pr&#233;vu &#224; l&#8217;article&#160;220 octies du Code G&#233;n&#233;ral des Imp&#244;ts.</p><p style=\"text-align: justify;\">Ce dispositif, cr&#233;&#233; en 2006, a pour objectif de soutenir la cr&#233;ation, la production musicale, et le renouvellement des talents. Il apporte ainsi un soutien &#224; un secteur qui reprend progressivement la voie de la croissance avec le d&#233;veloppement de l&#8217;offre de musique en streaming par voie d&#8217;abonnement.</p><p style=\"text-align: justify;\">L&#8217;an dernier, le Parlement n&#8217;a souhait&#233; proroger ce dispositif que d&#8217;une ann&#233;e car il souhaitait proc&#233;der &#224; une &#233;valuation de l&#8217;ensemble du cr&#233;dit d&#8217;imp&#244;t b&#233;n&#233;ficiant aux industries culturelles. Une &#233;valuation a &#233;t&#233; ainsi r&#233;alis&#233;e par la DGMIC (Minist&#232;re de la Culture), confi&#233;e au cabinet Bearing Point, publi&#233;e le 21 juillet 2018. Elle conclut &#224; l&#8217;efficience de ce dispositif pour les entreprises de ce secteur et &#224; la n&#233;cessit&#233; de le prolonger au-del&#224; de 2019. Elle a &#233;galement mesur&#233; les effets induits largement positifs de cette mesure sur le budget de l&#8217;&#201;tat&#160;: Pour 1&#160;euro investi le dispositif en rapporte 2,4 au budget de l&#8217;&#201;tat via les cotisations sociales et la TVA.</p><p style=\"text-align: justify;\">Il convient de ne pas attendre l&#8217;ann&#233;e prochaine pour le prolonger, car les entreprises de production phonographique, en particulier les TPE et les PME, qui repr&#233;sentent plus de 80&#160;% des demandes d&#8217;agr&#233;ment, ont besoin de visibilit&#233; pour se projeter sur le moyen/long terme dans leurs investissements en faveur des artistes de la musique.</p><p style=\"text-align: justify;\">Le co&#251;t de l&#8217;amendement est estim&#233; &#224; 10M&#8364; en 2020, 2021 et 2022.</p>"
  },
  "representations": [
    {
      "nom": "PDF",
      "typeMime": {
        "type": "application",
        "subType": "PDF"
      },
      "statutRepresentation": {
        "verbatim": true,
        "canonique": true,
        "officielle": true,
        "transcription": false,
        "enregistrement": false
      },
      "contenu": {
        "documentURI": "/15/amendements/1255C/CION_FIN/CF539.pdf"
      }
    }
  ],
  "sort": {
    "dateSaisie": "2018-11-07T19:18:54.000+01:00",
    "sortEnSeance": "Retiré"
  },
  "dateDepot": "2018-10-24T02:00:00.000+02:00",
  "dateDistribution": "2018-11-06T01:00:00.000+01:00",
  "article99": "0",
  "loiReference": {
    "codeLoi": "impôts",
    "divisionCodeLoi": "220 octies"
  }
}