{
  "uid": "AMANR5L15SEA717460BTC0765P0D1N232",
  "identifiant": {
    "legislature": "15",
    "numero": "232",
    "numRect": "0",
    "saisine": {
      "texteLegislatifRef": "PRJLANR5L15BTC0765",
      "numeroPartiePLF": "0",
      "organeExamen": "PO717460",
      "mentionSecondeDeliberation": "0"
    }
  },
  "numeroLong": "232",
  "etapeTexte": "1ère lecture (1ère assemblée saisie)",
  "triAmendement": "az",
  "cardinaliteAmdtMultiples": "1",
  "etat": "Discuté",
  "signataires": {
    "auteur": {
      "typeAuteur": "Depute",
      "acteurRef": "PA720798",
      "groupePolitiqueRef": "PO723569"
    },
    "cosignatairesRefs": [
      "PA720606",
      "PA720614",
      "PA720798",
      "PA720822",
      "PA606212",
      "PA720468"
    ],
    "texteAffichable": "M.&#160;Aliot,  Mme&#160;Le Pen, M.&#160;Bilde, M.&#160;Chenu, M.&#160;Collard et M.&#160;Pajot"
  },
  "pointeurFragmentTexte": {
    "division": {
      "titre": "Article 32",
      "articleDesignationCourte": "ART. 32",
      "type": "ARTICLE",
      "avantAApres": "A",
      "divisionRattachee": "ARTICLE 32",
      "urlDivisionTexteVise": "/15/textes/0765.asp#D_Article_32"
    }
  },
  "corps": {
    "dispositif": "<p>Supprimer cet article.</p>",
    "exposeSommaire": "<p style=\"text-align: justify;\">La modification apport&#233;e par cet article au code des pensions militaires d&#8217;invalidit&#233; et des victimes de guerre inqui&#232;te les anciens combattants, alors qu&#8217;ils sont les premiers concern&#233;s.</p><p style=\"text-align: justify;\">L&#8217;absence de concertation pr&#233;alable dans l&#8217;&#233;laboration de cet article et donc la forte inqui&#233;tude qu&#8217;il g&#233;n&#232;re nous am&#232;ne &#224; demander un ajournement de cette r&#233;forme et donc &#224; proposer la suppression de cet article.</p>"
  },
  "representations": [
    {
      "nom": "PDF",
      "typeMime": {
        "type": "application",
        "subType": "PDF"
      },
      "statutRepresentation": {
        "verbatim": true,
        "canonique": true,
        "officielle": true,
        "transcription": false,
        "enregistrement": false
      },
      "contenu": {
        "documentURI": "/15/amendements/0765/AN/232.pdf"
      }
    }
  ],
  "seanceDiscussion": "RUANR5L15S2018IDS20957",
  "sort": {
    "dateSaisie": "2018-03-23T02:11:31.000+01:00",
    "sortEnSeance": "Non soutenu"
  },
  "dateDepot": "2018-03-16T01:00:00.000+01:00",
  "dateDistribution": "2018-03-19T01:00:00.000+01:00",
  "article99": "0",
  "loiReference": {}
}