{
  "uid": "AMANR5L15SEA717460BTC0105P0D1N154",
  "identifiant": {
    "legislature": "15",
    "numero": "154",
    "numRect": "0",
    "saisine": {
      "texteLegislatifRef": "PRJLANR5L15BTC0105",
      "numeroPartiePLF": "0",
      "organeExamen": "PO717460",
      "mentionSecondeDeliberation": "0"
    }
  },
  "numeroLong": "154",
  "etapeTexte": "1ère lecture (2ème assemblée saisie)",
  "triAmendement": "he",
  "cardinaliteAmdtMultiples": "1",
  "etat": "Discuté",
  "signataires": {
    "auteur": {
      "typeAuteur": "Depute",
      "acteurRef": "PA607553",
      "groupePolitiqueRef": "PO730946"
    },
    "cosignatairesRefs": [
      "PA429893",
      "PA333818",
      "PA719930",
      "PA607553",
      "PA342415",
      "PA608695"
    ],
    "texteAffichable": "M.&#160;Potier,  M.&#160;Carvounas, M.&#160;Hutin, Mme&#160;Untermaier, M.&#160;Vallaud et Mme&#160;Battistel"
  },
  "pointeurFragmentTexte": {
    "division": {
      "titre": "Article 2 bis",
      "articleDesignationCourte": "APRÈS ART. 2 BIS",
      "type": "ARTICLE",
      "avantAApres": "Apres",
      "divisionRattachee": "APRÈS L'ARTICLE 2 BIS, insérer l'article suivant:",
      "articleAdditionnel": "1",
      "urlDivisionTexteVise": "/15/textes/0105.asp#D_Article_2_bis"
    }
  },
  "corps": {
    "dispositif": "<p style=\"text-align: justify;\">Apr&#232;s l&#8217;article L.O. 127 du code &#233;lectoral, est ins&#233;r&#233; un article L.O. 127&#8209;1 ainsi r&#233;dig&#233;&#160;:</p><p style=\"text-align: justify;\">&#171;&#160;<i>Art.&#160;L.O. 127&#8209;1</i>.&#160;&#8211;&#160;Nul ne peut exercer plus de trois mandats successifs. Cette disposition est applicable &#224; compter du prochain renouvellement en tenant compte des mandats accomplis ant&#233;rieurement.&#160;&#187;</p>",
    "exposeSommaire": "<p style=\"text-align: justify;\">Se justifie par son texte m&#234;me.</p>"
  },
  "representations": [
    {
      "nom": "PDF",
      "typeMime": {
        "type": "application",
        "subType": "PDF"
      },
      "statutRepresentation": {
        "verbatim": true,
        "canonique": true,
        "officielle": true,
        "transcription": false,
        "enregistrement": false
      },
      "contenu": {
        "documentURI": "/15/amendements/0105/AN/154.pdf"
      }
    }
  ],
  "seanceDiscussion": "RUANR5L15S2017IDS20663",
  "sort": {
    "dateSaisie": "2017-07-28T23:18:01.000+02:00",
    "sortEnSeance": "Rejeté"
  },
  "dateDepot": "2017-07-21T02:00:00.000+02:00",
  "dateDistribution": "2017-07-24T02:00:00.000+02:00",
  "article99": "0",
  "loiReference": {}
}