{
  "uid": "AMANR5L15SEA717460BTC0902P0D1N2565",
  "identifiant": {
    "legislature": "15",
    "numero": "2565",
    "numRect": "0",
    "saisine": {
      "texteLegislatifRef": "PRJLANR5L15BTC0902",
      "numeroPartiePLF": "0",
      "organeExamen": "PO717460",
      "mentionSecondeDeliberation": "0"
    }
  },
  "numeroLong": "2565",
  "etapeTexte": "1ère lecture (1ère assemblée saisie)",
  "triAmendement": "coarnzzzzo",
  "cardinaliteAmdtMultiples": "1",
  "etat": "Discuté",
  "signataires": {
    "auteur": {
      "typeAuteur": "Depute",
      "acteurRef": "PA607619",
      "groupePolitiqueRef": "PO730964"
    },
    "cosignatairesRefs": [
      "PA607619"
    ],
    "texteAffichable": "M.&#160;Molac"
  },
  "pointeurFragmentTexte": {
    "division": {
      "titre": "Article PREMIER",
      "articleDesignationCourte": "ART. PREMIER",
      "type": "ARTICLE",
      "avantAApres": "A",
      "divisionRattachee": "ARTICLE PREMIER",
      "urlDivisionTexteVise": "/15/textes/0902.asp#D_Article_1er"
    },
    "alinea": {
      "avantAApres": "A",
      "numero": "27",
      "alineaDesignation": "Alinéa 27"
    }
  },
  "corps": {
    "dispositif": "<p style=\"text-align: justify;\">&#192; la premi&#232;re phrase de l&#8217;alin&#233;a&#160;27, substituer aux mots&#160;:</p><p style=\"text-align: justify;\">&#171;&#160;de trois ans&#160;&#187;</p><p style=\"text-align: justify;\">les mots&#160;:</p><p style=\"text-align: justify;\">&#171;&#160;correspondant au cadre interprofessionnel, s&#8217;il existe&#160;&#187;.</p>",
    "exposeSommaire": "<p style=\"text-align: justify;\">La dur&#233;e minimale du contrat entre les producteurs et leurs acheteurs ne doit pas &#234;tre r&#233;gul&#233;e par la loi. Aujourd&#8217;hui des contrats sont d&#233;j&#224; existants dans certaines fili&#232;res et ont la quasi-totalit&#233; du temps des dur&#233;es inf&#233;rieures &#224; trois ans. Cette dur&#233;e minimale remettrait totalement en cause des organisations de fili&#232;re, plut&#244;t robustes et efficaces et risquerait d&#8217;&#234;tre un frein au d&#233;veloppement de la contractualisation dans les fili&#232;res moins avanc&#233;es. Seul un cadre interprofessionnel doit pouvoir d&#233;finir des dur&#233;es de contrat adapt&#233;es aux fili&#232;res.</p>"
  },
  "representations": [
    {
      "nom": "PDF",
      "typeMime": {
        "type": "application",
        "subType": "PDF"
      },
      "statutRepresentation": {
        "verbatim": true,
        "canonique": true,
        "officielle": true,
        "transcription": false,
        "enregistrement": false
      },
      "contenu": {
        "documentURI": "/15/amendements/0902/AN/2565.pdf"
      }
    }
  ],
  "seanceDiscussion": "RUANR5L15S2018IDS21050",
  "sort": {
    "dateSaisie": "2018-05-23T23:47:49.000+02:00",
    "sortEnSeance": "Retiré"
  },
  "dateDepot": "2018-05-17T02:00:00.000+02:00",
  "dateDistribution": "2018-05-18T02:00:00.000+02:00",
  "article99": "0",
  "loiReference": {}
}