{
  "uid": "AMANR5L15SEA717460B0911P0D1N779",
  "identifiant": {
    "legislature": "15",
    "numero": "779",
    "numRect": "0",
    "saisine": {
      "texteLegislatifRef": "PRJLANR5L15B0911",
      "numeroPartiePLF": "0",
      "organeExamen": "PO717460",
      "mentionSecondeDeliberation": "0"
    }
  },
  "numeroLong": "779",
  "etapeTexte": "1ère lecture (1ère assemblée saisie)",
  "triAmendement": "oji",
  "cardinaliteAmdtMultiples": "1",
  "etat": "A discuter",
  "signataires": {
    "auteur": {
      "typeAuteur": "Depute",
      "acteurRef": "PA721678",
      "groupePolitiqueRef": "PO730934"
    },
    "cosignatairesRefs": [
      "PA721678"
    ],
    "texteAffichable": "M.&#160;Reda"
  },
  "pointeurFragmentTexte": {
    "division": {
      "titre": "Article 6",
      "articleDesignationCourte": "ART. 6",
      "type": "ARTICLE",
      "avantAApres": "A",
      "divisionRattachee": "ARTICLE 6",
      "urlDivisionTexteVise": "/15/textes/0911.asp#D_Article_6"
    },
    "alinea": {
      "numero": "3"
    }
  },
  "corps": {
    "dispositif": "<p style=\"text-align: justify;\">&#192; la fin de l&#8217;alin&#233;a&#160;3, substituer au mot&#160;:</p><p style=\"text-align: justify;\">&#171;&#160;cinquante&#160;&#187;</p><p style=\"text-align: justify;\">le mot&#160;:</p><p style=\"text-align: justify;\">&#171;&#160;soixante&#160;&#187;.</p>",
    "exposeSommaire": "<p style=\"text-align: justify;\">La recherche de l&#8217;efficacit&#233; l&#233;gislative lors de l&#8217;&#233;laboration des projets de loi de finances ne doit pas conduire &#224; une construction budg&#233;taire pr&#233;cipit&#233;e,&#160;&#224; cause de&#160;d&#233;lais&#160;trop contraignants.</p><p style=\"text-align: justify;\">C&#8217;est pourquoi cet amendement propose de porter &#224; soixante jours la dur&#233;e maximale de l&#8217;examen budg&#233;taire par le Parlement.</p>"
  },
  "representations": [
    {
      "nom": "PDF",
      "typeMime": {
        "type": "application",
        "subType": "PDF"
      },
      "statutRepresentation": {
        "verbatim": true,
        "canonique": true,
        "officielle": true,
        "transcription": false,
        "enregistrement": false
      },
      "contenu": {
        "documentURI": "/15/amendements/0911/AN/779.pdf"
      }
    }
  ],
  "dateDepot": "2018-07-05T02:00:00.000+02:00",
  "dateDistribution": "2018-07-10T02:00:00.000+02:00",
  "article99": "0",
  "loiReference": {}
}