{
  "uid": "AMANR5L15SEA717460B1490P0D1N590",
  "identifiant": {
    "legislature": "15",
    "numero": "590",
    "numRect": "0",
    "saisine": {
      "texteLegislatifRef": "PRJLANR5L15B1490",
      "numeroPartiePLF": "0",
      "organeExamen": "PO717460",
      "mentionSecondeDeliberation": "1"
    }
  },
  "numeroLong": "590",
  "etapeTexte": "Nouvelle Lecture",
  "triAmendement": "kkcaaaaaaaaaaaaaaaaaaaaaaaaaaaaaaaaaaaaaaaaaaaaaaabnzz",
  "cardinaliteAmdtMultiples": "1",
  "etat": "Discuté",
  "signataires": {
    "auteur": {
      "typeAuteur": "Depute",
      "acteurRef": "PA720210",
      "groupePolitiqueRef": "PO730934"
    },
    "cosignatairesRefs": [
      "PA267204",
      "PA718838",
      "PA720210",
      "PA767",
      "PA609726",
      "PA334654",
      "PA642847",
      "PA332523"
    ],
    "texteAffichable": "Mme&#160;Beauvais,  M.&#160;Straumann, Mme&#160;Dalloz, M.&#160;Aubert, M.&#160;Cattin, M.&#160;Bazin, M.&#160;Brun et M.&#160;Sermier"
  },
  "pointeurFragmentTexte": {
    "division": {
      "titre": "Article 60",
      "articleDesignationCourte": "ART. 60",
      "type": "ARTICLE",
      "avantAApres": "A",
      "divisionRattachee": "ARTICLE 60",
      "urlDivisionTexteVise": "/15/textes/1490.asp#D_Article_60"
    },
    "alinea": {
      "numero": "17"
    }
  },
  "corps": {
    "dispositif": "<p style=\"text-align: justify;\">Apr&#232;s la deuxi&#232;me ligne du tableau de l&#8217;alin&#233;a&#160;17, ins&#233;rer la ligne suivante&#160;:</p><p style=\"text-align: justify;\">&#171;</p><table style=\"border-collapse: collapse; height: 12px; width: 506px;\"><tbody><tr><td style=\"white-space: normal; border: 1px solid #000000; width: 290px; text-align: center;\">&#160;Sucres non extractibles des &#233;gouts pauvres issus de deux extractions sucri&#232;res et amidon r&#233;siduel en fin de processus de transformation de l&#8217;amidon</td><td style=\"white-space: normal; border: 1px solid #000000; width: 209px; text-align: center;\">0,2 % en 2019<br />et 0,5 % &#224; compter de 2020</td></tr></tbody></table><p style=\"text-align: justify;\">&#160;&#160;&#160;&#160;&#160;&#160;&#160;&#160;&#160;&#160;&#160;&#160;&#160;&#160;&#160;&#160;&#160;&#160;&#160;&#160;&#160;&#160;&#160;&#160;&#160;&#160;&#160;&#160;&#160;&#160;&#160;&#160;&#160;&#160;&#160;&#160;&#160;&#160;&#160;&#160;&#160;&#160;&#160;&#160;&#160;&#160;&#160;&#160;&#160;&#160;&#160;&#160;&#160;&#160;&#160;&#160;&#160;&#160;&#160;&#160;&#160;&#160;&#160;&#160;&#160;&#160;&#160;&#160;&#160;&#160;&#160;&#160;&#160;&#160;&#160;&#160;&#160;&#160;&#160;&#160;&#160;&#160;&#160;&#160;&#160;&#160;&#160;&#160;&#160;&#160;&#160;&#160;&#160;&#160;&#160;&#160;&#160;&#160;&#160;&#160;&#160;&#160;&#160;&#160;&#160;&#160;&#160;&#160; &#160;&#187;.</p>",
    "exposeSommaire": "<p style=\"text-align: justify;\">Afin de rester dans une logique de trajectoire ambitieuse pour la transition &#233;nerg&#233;tique dans les essences et accompagner la croissance de la consommation du Super&#233;thanol E85 tout en prenant en compte les r&#233;centes discussions entre les acteurs de la fili&#232;re &#233;thanol et le gouvernement, il est propos&#233; dans une logique consensuelle de ramener les pourcentages cible d&#8217;&#233;nergie renouvelable dans l&#8217;essence aux niveaux suivants&#160;: 7,9&#160;% pour le pourcentage cible des essences en 2019 et 8,3&#160;% en 2020.</p><p style=\"text-align: justify;\">Par ailleurs, cette augmentation peut &#234;tre utilement compl&#233;t&#233;e par l&#8217;utilisation des bio&#233;thanol de r&#233;sidus sucriers (sucre non extractible) et amidonniers (amidon r&#233;siduel) &#224; hauteur de 0,2&#160;% en 2019 et 10,5&#160;% en 2020. Ces r&#233;sidus n&#8217;entrent pas en concurrence avec la production alimentaire et &#224; ce titre, ne sont pas soumis au plafonnement de 7&#160;% impos&#233; aux biocarburants de premi&#232;re g&#233;n&#233;ration par la r&#232;glementation&#160;europ&#233;enne.</p>"
  },
  "representations": [
    {
      "nom": "PDF",
      "typeMime": {
        "type": "application",
        "subType": "PDF"
      },
      "statutRepresentation": {
        "verbatim": true,
        "canonique": true,
        "officielle": true,
        "transcription": false,
        "enregistrement": false
      },
      "contenu": {
        "documentURI": "/15/amendements/1490/AN/590.pdf"
      }
    }
  ],
  "seanceDiscussion": "RUANR5L15S2019IDS21433",
  "sort": {
    "dateSaisie": "2018-12-19T04:17:50.000+01:00",
    "sortEnSeance": "Tombé"
  },
  "dateDepot": "2018-12-14T01:00:00.000+01:00",
  "dateDistribution": "2018-12-17T01:00:00.000+01:00",
  "article99": "0",
  "loiReference": {}
}