{
  "uid": "AMANR5L15SEA717460BTC1974P0D1N866",
  "identifiant": {
    "legislature": "15",
    "numero": "866",
    "numRect": "0",
    "saisine": {
      "texteLegislatifRef": "PRJLANR5L15BTC1974",
      "numeroPartiePLF": "0",
      "organeExamen": "PO717460",
      "mentionSecondeDeliberation": "0"
    }
  },
  "numeroLong": "866",
  "etapeTexte": "1ère lecture (2ème assemblée saisie)",
  "triAmendement": "aiiaaaaaaaaaaaaaaaaaaaaaaaaaaaaaaaaaaaaaaaaaaaaaaacerztzzy",
  "cardinaliteAmdtMultiples": "1",
  "etat": "Discuté",
  "signataires": {
    "auteur": {
      "typeAuteur": "Depute",
      "acteurRef": "PA718850",
      "groupePolitiqueRef": "PO730934"
    },
    "cosignatairesRefs": [
      "PA267735",
      "PA340853",
      "PA718780",
      "PA267429",
      "PA606712",
      "PA336316",
      "PA767",
      "PA266793",
      "PA718850",
      "PA718884",
      "PA719318",
      "PA608416"
    ],
    "texteAffichable": "M.&#160;Cordier,  M.&#160;Cinieri, M.&#160;Lurton, Mme&#160;Anthoine, Mme&#160;Bazin-Malgras, M.&#160;Leclerc, M.&#160;Bony, M.&#160;Cattin, M.&#160;Hetzel, M.&#160;de Ganay, Mme&#160;Trastour-Isnart et M.&#160;Bouchet"
  },
  "pointeurFragmentTexte": {
    "division": {
      "titre": "Article 2",
      "articleDesignationCourte": "ART. 2",
      "type": "ARTICLE",
      "avantAApres": "A",
      "divisionRattachee": "ARTICLE 2",
      "urlDivisionTexteVise": "/15/textes/1974.asp#D_Article_2"
    },
    "alinea": {
      "numero": "22"
    }
  },
  "corps": {
    "dispositif": "<p style=\"text-align: justify;\">&#192; l&#8217;alin&#233;a&#160;22, apr&#232;s le mot&#160;:</p><p style=\"text-align: justify;\">&#171;&#160;services&#160;&#187;,</p><p style=\"text-align: justify;\">ins&#233;rer les mots&#160;:</p><p style=\"text-align: justify;\">&#171;&#160;et des infrastructures&#160;&#187;.</p>",
    "exposeSommaire": "<p style=\"text-align: justify;\">Le projet de loi propose de remplacer les termes &#171;&#160;versement transport&#160;&#187; par une terminologie plus conforme &#224; l&#8217;usage et &#224; la finalit&#233; de ce mode de financement des mobilit&#233;s. C&#8217;est ainsi que la d&#233;nomination suivante a &#233;t&#233; retenue &#224; l&#8217;issue de l&#8217;examen en premi&#232;re lecture au S&#233;nat&#160;: &#171;&#160;versement destin&#233; au financement des services de mobilit&#233;&#160;&#187;.</p><p style=\"text-align: justify;\">Cette r&#233;daction pr&#233;sente n&#233;anmoins une ambigu&#239;t&#233; dans la mesure o&#249; elle laisse appara&#238;tre une distinction entre le financement des services li&#233;s aux mobilit&#233;s d&#8217;une part, et le financement des infrastructures qui les rendent possibles d&#8217;autre part.</p><p style=\"text-align: justify;\">Ces deux aspects n&#8217;&#233;tant pas dissociables, le pr&#233;sent amendement propose donc faire appara&#238;tre clairement l&#8217;int&#233;gration des infrastructures concourant au d&#233;veloppement des mobilit&#233;s au sein du p&#233;rim&#232;tre de financement du versement mobilit&#233;.</p>"
  },
  "representations": [
    {
      "nom": "PDF",
      "typeMime": {
        "type": "application",
        "subType": "PDF"
      },
      "statutRepresentation": {
        "verbatim": true,
        "canonique": true,
        "officielle": true,
        "transcription": false,
        "enregistrement": false
      },
      "contenu": {
        "documentURI": "/15/amendements/1974/AN/866.pdf"
      }
    }
  ],
  "seanceDiscussion": "RUANR5L15S2019IDS21676",
  "sort": {
    "dateSaisie": "2019-06-05T00:03:07.000+02:00",
    "sortEnSeance": "Rejeté"
  },
  "dateDepot": "2019-05-28T02:00:00.000+02:00",
  "dateDistribution": "2019-06-01T02:00:00.000+02:00",
  "article99": "0",
  "loiReference": {}
}