{
  "uid": "AMANR5L15PO419865B2274P0D1N869",
  "identifiant": {
    "legislature": "15",
    "numero": "869",
    "numRect": "0",
    "saisine": {
      "texteLegislatifRef": "PRJLANR5L15B2274",
      "numeroPartiePLF": "0",
      "organeExamen": "PO419865",
      "mentionSecondeDeliberation": "0"
    }
  },
  "numeroLong": "CD869",
  "etapeTexte": "1ère lecture (2ème assemblée saisie)",
  "triAmendement": "ipaaaaaaaaaaaaaaaaaaaaaaaaaaaaaaaaaaaaaaaaaaaaaaaabnk",
  "cardinaliteAmdtMultiples": "1",
  "etat": "En traitement",
  "signataires": {
    "auteur": {
      "typeAuteur": "Depute",
      "acteurRef": "PA722110",
      "groupePolitiqueRef": "PO730940"
    },
    "cosignatairesRefs": [
      "PA722110",
      "PA720546",
      "PA722202",
      "PA721118",
      "PA610667",
      "PA335612",
      "PA718926",
      "PA721012",
      "PA267306",
      "PA441",
      "PA721270",
      "PA721896",
      "PA610654",
      "PA689",
      "PA720692",
      "PA718720"
    ],
    "texteAffichable": "M.&#160;Wulfranc,  M.&#160;Chassaigne, Mme&#160;Bello, M.&#160;Brotherson, M.&#160;Bruneel, Mme&#160;Buffet, M.&#160;Dharr&#233;ville, M.&#160;Dufr&#232;gne, Mme&#160;Faucillon, M.&#160;Jumel, Mme&#160;K&#233;clard-Mond&#233;sir, M.&#160;Lecoq, M.&#160;Nilor, M.&#160;Peu, M.&#160;Fabien&#160;Roussel et M.&#160;Serville"
  },
  "pointeurFragmentTexte": {
    "division": {
      "titre": "Article 10",
      "articleDesignationCourte": "ART. 10",
      "type": "ARTICLE",
      "avantAApres": "A",
      "divisionRattachee": "ARTICLE 10",
      "urlDivisionTexteVise": "/15/textes/2274.asp#D_Article_10"
    },
    "alinea": {
      "numero": "4"
    }
  },
  "corps": {
    "dispositif": "<p style=\"text-align: justify;\">&#192; l&#8217;alin&#233;a&#160;4, supprimer les mots&#160;:</p><p style=\"text-align: justify;\">&#171;&#160;en compostage domestique&#160;&#187;.</p>",
    "exposeSommaire": "<p style=\"text-align: justify;\">Les auteurs de l&#8217;amendement jugent n&#233;cessaire de supprimer la notion de compostage &#171;&#160;domestique&#160;&#187; afin de laisser libre choix au consommateur et aux collectivit&#233;s dans la mani&#232;re la plus appropri&#233;e de traiter leurs biod&#233;chets&#160;: soit par compostage domestique, soit par compostage industriel. Ce dernier ayant l&#8217;avantage de mieux contr&#244;ler la qualit&#233; du compost obtenu pour permettre son utilisation par les agriculteurs en tant que fertilisant organique naturel.Cette possibilit&#233; permettrait d&#8217;offrir une fin de vie responsable &#224; des produits non valoris&#233;s par recyclage m&#233;canique, de valoriser les biod&#233;chets &#224; grande &#233;chelle et de contribuer &#224; l&#8217;initiative 4 pour 1000 soutenue par l&#8217;INRA pour la s&#233;curit&#233; alimentaire et le climat.</p>",
    "cartoucheDelaiDepotDepasse": "Sous réserve de son traitement par les services de l'Assemblée nationale et de sa recevabilité"
  },
  "representations": [
    {
      "nom": "PDF",
      "typeMime": {
        "type": "application",
        "subType": "PDF"
      },
      "statutRepresentation": {
        "verbatim": true,
        "canonique": true,
        "officielle": true,
        "transcription": false,
        "enregistrement": false
      },
      "contenu": {
        "documentURI": "/15/amendements/2274/CION-DVP/CD869.pdf"
      }
    }
  ],
  "dateDepot": "2019-11-20T01:00:00.000+01:00",
  "article99": "0",
  "loiReference": {}
}