{
  "uid": "AMANR5L15SEA717460BTC2206P0D1N677",
  "identifiant": {
    "legislature": "15",
    "numero": "677",
    "numRect": "0",
    "saisine": {
      "texteLegislatifRef": "PRJLANR5L15BTC2206",
      "numeroPartiePLF": "0",
      "organeExamen": "PO717460",
      "mentionSecondeDeliberation": "0"
    }
  },
  "numeroLong": "677",
  "etapeTexte": "Nouvelle Lecture",
  "triAmendement": "aicaaaaaaaaaaaaaaaaaaaaaaaaaaaaaaaaaaaaaaaaaaaaaaajdo",
  "cardinaliteAmdtMultiples": "1",
  "etat": "Discuté",
  "signataires": {
    "auteur": {
      "typeAuteur": "Depute",
      "acteurRef": "PA609245",
      "groupePolitiqueRef": "PO730934"
    },
    "cosignatairesRefs": [
      "PA606712",
      "PA267429",
      "PA334654",
      "PA1327",
      "PA722390",
      "PA605036",
      "PA266793",
      "PA721968",
      "PA719318",
      "PA267204",
      "PA1874",
      "PA2155",
      "PA267735",
      "PA718838",
      "PA609245",
      "PA720210",
      "PA718884",
      "PA1012",
      "PA642847",
      "PA346218",
      "PA340853",
      "PA267289"
    ],
    "texteAffichable": "Mme&#160;Lacroute,  M.&#160;Sermier, Mme&#160;Anthoine, M.&#160;Abad, Mme&#160;Bazin-Malgras, Mme&#160;Beauvais, M.&#160;Bony, M.&#160;Cinieri, Mme&#160;Corneloup, M.&#160;de Ganay, M.&#160;de la Verpilli&#232;re, M.&#160;Door, M.&#160;Forissier, M.&#160;Leclerc, M.&#160;Lurton, M.&#160;Masson, M.&#160;Menuel, M.&#160;Straumann, M.&#160;Brun, M.&#160;Le Fur, M.&#160;Bazin et M.&#160;Vialay"
  },
  "pointeurFragmentTexte": {
    "division": {
      "titre": "Article 2",
      "articleDesignationCourte": "ART. 2",
      "type": "ARTICLE",
      "avantAApres": "A",
      "divisionRattachee": "ARTICLE 2",
      "urlDivisionTexteVise": "/15/textes/2206.asp#D_Article_2"
    },
    "alinea": {
      "avantAApres": "Apres",
      "numero": "17"
    }
  },
  "corps": {
    "dispositif": "<p style=\"text-align: justify;\">Apr&#232;s l&#8217;alin&#233;a&#160;17, ins&#233;rer&#160;les deux alin&#233;as suivants&#160;:</p><p style=\"text-align: justify;\">&#171;&#160;4&#176;&#160;<i>bis</i>&#160;Le II du m&#234;me article L.&#160;2333&#8209;67 est r&#233;tabli dans la r&#233;daction suivante&#160;:</p><p style=\"text-align: justify;\">&#171;&#160;II.&#160;&#8211;&#160;D&#232;s lors qu&#8217;est institu&#233;e la gratuit&#233; totale des transports dans tout ou partie d&#8217;un ressort territorial, le taux de versement peut &#234;tre r&#233;duit.&#160;&#187;</p>",
    "exposeSommaire": "<p style=\"text-align: justify;\">Les employeurs sont les premiers financeurs des transports en commun. Selon une &#233;tude r&#233;cente du commissariat g&#233;n&#233;ral au d&#233;veloppement durable, les employeurs financent de 45&#160;% &#224; 60&#160;% du co&#251;t du transport collectif urbain &#224; travers, le versement transport (8 milliards d&#8217;euros en 2017- 4 milliards d&#8217;euros en Ile-de-France et 4 milliards d&#8217;euros pour les ressorts territoriaux hors Ile-de-France) que les salari&#233;s utilisent ou non les transports, mais aussi, par la participation &#224; hauteur de 50&#160;% du titre de transport mensuel salari&#233;s (900 millions pour la seule r&#233;gion Ile-de-France).</p><p style=\"text-align: justify;\">Par ailleurs la baisse continue depuis plusieurs ann&#233;es et la part prise en charge par les usagers/clients fragilise le mod&#232;le &#233;conomique. Par exemple, dans les petits r&#233;seaux, les usagers ne financent que 12&#160;% du co&#251;t total. Cette charge financi&#232;re disproportionn&#233;e est &#224; l&#8217;origine des exp&#233;riences de gratuit&#233; men&#233;e dans une trentaine de r&#233;seaux de transport en France.</p><p style=\"text-align: justify;\">Or, la gratuit&#233; a un co&#251;t. La gratuit&#233; totale fragilise le mod&#232;le &#233;conomique des transports en communs qui n&#233;cessitent de plus en plus d&#8217;investissements pour am&#233;liorer la qualit&#233; de services dans des zones urbanis&#233;es de plus en plus congestionn&#233;es.</p><p style=\"text-align: justify;\">Cet amendement propose que l&#8217;on puisse moduler &#224; la baisse le taux du versement transport lorsque l&#8217;autorit&#233; organisatrice ou une de ses communes d&#233;cide de mettre en place la gratuit&#233; totale des transports. Les taux de ce syst&#232;me de malus seront pr&#233;cis&#233;s dans le projet de loi de finances 2020.</p>"
  },
  "representations": [
    {
      "nom": "PDF",
      "typeMime": {
        "type": "application",
        "subType": "PDF"
      },
      "statutRepresentation": {
        "verbatim": true,
        "canonique": true,
        "officielle": true,
        "transcription": false,
        "enregistrement": false
      },
      "contenu": {
        "documentURI": "/15/amendements/2206/AN/677.pdf"
      }
    }
  ],
  "seanceDiscussion": "RUANR5L15S2019IDS21802",
  "sort": {
    "dateSaisie": "2019-09-10T22:47:36.000+02:00",
    "sortEnSeance": "Rejeté"
  },
  "dateDepot": "2019-09-06T02:00:00.000+02:00",
  "dateDistribution": "2019-09-09T02:00:00.000+02:00",
  "article99": "0",
  "loiReference": {}
}