{
  "uid": "AMANR5L15PO59048B2272P1D1N56",
  "identifiant": {
    "legislature": "15",
    "numero": "56",
    "numRect": "0",
    "saisine": {
      "texteLegislatifRef": "PRJLANR5L15B2272",
      "numeroPartiePLF": "1",
      "organeExamen": "PO59048",
      "mentionSecondeDeliberation": "0"
    }
  },
  "numeroLong": "I-CF56",
  "etapeTexte": "1ère lecture (1ère assemblée saisie)",
  "triAmendement": "aoaaaaaaaaaaaaaaaaaaaaaaaaaaaaaaaaaaaaaaaaaaaaaaaaaaw",
  "cardinaliteAmdtMultiples": "1",
  "etat": "Discuté",
  "signataires": {
    "auteur": {
      "typeAuteur": "Depute",
      "acteurRef": "PA608016",
      "groupePolitiqueRef": "PO730934"
    },
    "cosignatairesRefs": [
      "PA642847",
      "PA718884",
      "PA608826",
      "PA608016",
      "PA720644",
      "PA709315",
      "PA721410",
      "PA1327",
      "PA2492",
      "PA608416",
      "PA267429",
      "PA718850",
      "PA2377",
      "PA712015",
      "PA346218",
      "PA719318",
      "PA332523",
      "PA605036",
      "PA720210",
      "PA266797",
      "PA346054",
      "PA267260",
      "PA722390",
      "PA2155",
      "PA330684"
    ],
    "texteAffichable": "Mme&#160;Louwagie,  M.&#160;Abad, M.&#160;Hetzel, M.&#160;Gosselin, Mme&#160;Val&#233;rie&#160;Boyer, M.&#160;Cinieri, M.&#160;Cordier, Mme&#160;Corneloup, M.&#160;Nury, M.&#160;Quentin, M.&#160;Viala, M.&#160;Bazin, Mme&#160;Dalloz, M.&#160;Dive, Mme&#160;Duby-Muller, Mme&#160;Beauvais, M.&#160;Emmanuel&#160;Maquet, Mme&#160;Poletti, Mme&#160;Bazin-Malgras, Mme&#160;Anthoine, M.&#160;Menuel, M.&#160;Perrut, M.&#160;Masson, M.&#160;Forissier et Mme&#160;Bonnivard"
  },
  "pointeurFragmentTexte": {
    "division": {
      "titre": "Article 2",
      "articleDesignationCourte": "APRÈS ART. 2",
      "type": "ARTICLE",
      "avantAApres": "Apres",
      "divisionRattachee": "APRÈS L'ARTICLE 2, insérer l'article suivant:",
      "articleAdditionnel": "1",
      "urlDivisionTexteVise": "/15/textes/2272A.asp#D_Article_2"
    }
  },
  "corps": {
    "dispositif": "<p style=\"text-align: justify;\">I.&#160;&#8211;&#160;Apr&#232;s l&#8217;article&#160;81&#160;<i>quater</i>&#160;du code g&#233;n&#233;ral des imp&#244;ts, il est ins&#233;r&#233; un article&#160;81 <i>quinquies</i> ainsi r&#233;dig&#233;&#160;:</p><p style=\"text-align: justify;\">&#171;&#160;<i>Art.&#160;81 </i><i>quinquies</i><i>&#160;&#8211;&#160;</i>Les personnels m&#233;dicaux qui exercent tout ou partie de leur activit&#233; dans les &#233;tablissements mentionn&#233;s aux 1&#176;&#160;&#224; 4&#176;&#160;de l&#8217;article L.&#160;6112&#8209;3 du code de la sant&#233; publique et situ&#233;s dans une zone de revitalisation rurale mentionn&#233;e &#224; l&#8217;article&#160;1465 A ne sont pas soumis &#224; l&#8217;imp&#244;t sur le revenu &#224; raison des traitements et salaires qui leur sont vers&#233;s par ces &#233;tablissements au titre de leur activit&#233; jusqu&#8217;au 31 d&#233;cembre de la cinqui&#232;me ann&#233;e suivant celle de leur prise de fonctions.</p><p style=\"text-align: justify;\">&#171;&#160;Les traitements et salaires ne sont soumis &#224; l&#8217;imp&#244;t sur le revenu que pour le quart, la moiti&#233; ou les trois quarts de leur montant selon qu&#8217;ils sont r&#233;alis&#233;s respectivement au cours de la premi&#232;re, de la deuxi&#232;me ou de la troisi&#232;me ann&#233;e suivant cette p&#233;riode d&#8217;exon&#233;ration.&#160;&#187;</p><p style=\"text-align: justify;\">II.&#160;&#8211;&#160;La perte de recettes pour l&#8217;&#201;tat est compens&#233;e &#224; due concurrence par la cr&#233;ation d&#8217;une taxe additionnelle aux droits mentionn&#233;s aux articles 575 et 575 A du code g&#233;n&#233;ral des imp&#244;ts.</p>",
    "exposeSommaire": "<p style=\"text-align: justify;\">Si l&#8217;&#201;tat, les collectivit&#233;s territoriales, l&#8217;Assurance Maladie, ont d&#233;j&#224; &#339;uvr&#233; pour inciter les jeunes m&#233;decins &#224; s&#8217;implanter dans des zones sous-m&#233;dicalis&#233;es, en instaurant des aides financi&#232;res et mat&#233;rielles, des bourses, des exon&#233;rations fiscales, les r&#233;sultats ne sont que trop peu visibles. Les professionnels de sant&#233; demeurent peu enclins &#224; contribuer spontan&#233;ment au r&#233;&#233;quilibrage de la d&#233;mographie m&#233;dicale.</p><p style=\"text-align: justify;\">A la lecture de l&#8217;article&#160;44 quindecies du CGI, l&#8217;exon&#233;ration d&#8217;imposition des b&#233;n&#233;fices est pr&#233;vue depuis la loi de finances rectificative pour 2015 pour les m&#233;decins lib&#233;raux venant s&#8217;installer dans les zones de revitalisation rurale (ZRR) mentionn&#233;es &#224; l&#8217;article&#160;1465 A du Code G&#233;n&#233;ral des imp&#244;ts.&#160;Ce dispositif d&#8217;incitation vise &#224; garantir un acc&#232;s aux soins dans nos campagnes, cependant il ne s&#8217;applique qu&#8217;aux m&#233;decins lib&#233;raux.</p><p style=\"text-align: justify;\">Il convient d&#8217;appliquer un r&#233;gime similaire aux praticiens hospitaliers.</p><p style=\"text-align: justify;\">S&#8217;il ne s&#8217;agit pas d&#8217;opposer inutilement service public hospitalier et activit&#233;s priv&#233;es salariales, il convient de trouver les modalit&#233;s permettant de garantir l&#8217;&#233;galit&#233; des territoires et le maintien de m&#233;decins lib&#233;raux exer&#231;ant en zone rurale.</p><p style=\"text-align: justify;\">Aussi, cet amendement propose d&#8217;&#233;tendre cette incitation fiscale aux praticiens hospitaliers.</p>"
  },
  "representations": [
    {
      "nom": "PDF",
      "typeMime": {
        "type": "application",
        "subType": "PDF"
      },
      "statutRepresentation": {
        "verbatim": true,
        "canonique": true,
        "officielle": true,
        "transcription": false,
        "enregistrement": false
      },
      "contenu": {
        "documentURI": "/15/amendements/2272A/CION_FIN/CF56.pdf"
      }
    }
  ],
  "sort": {
    "dateSaisie": "2019-10-08T19:44:14.000+02:00",
    "sortEnSeance": "Rejeté"
  },
  "dateDepot": "2019-10-02T02:00:00.000+02:00",
  "dateDistribution": "2019-10-08T02:00:00.000+02:00",
  "article99": "0",
  "loiReference": {
    "codeLoi": "CGI",
    "divisionCodeLoi": "81 quater"
  }
}