{
  "uid": "AMANR5L15SEA717460BTC0971P0D1N2905",
  "identifiant": {
    "legislature": "15",
    "numero": "2905",
    "numRect": "0",
    "saisine": {
      "texteLegislatifRef": "PRJLANR5L15BTC0971",
      "numeroPartiePLF": "0",
      "organeExamen": "PO717460",
      "mentionSecondeDeliberation": "0"
    }
  },
  "numeroLong": "2905",
  "etapeTexte": "1ère lecture (1ère assemblée saisie)",
  "triAmendement": "o",
  "cardinaliteAmdtMultiples": "1",
  "etat": "Discuté",
  "signataires": {
    "auteur": {
      "typeAuteur": "Depute",
      "acteurRef": "PA721262",
      "groupePolitiqueRef": "PO730964"
    },
    "cosignatairesRefs": [
      "PA721262"
    ],
    "texteAffichable": "M.&#160;Vuilletet"
  },
  "pointeurFragmentTexte": {
    "division": {
      "titre": "Article 31",
      "articleDesignationCourte": "APRÈS ART. 31",
      "type": "ARTICLE",
      "avantAApres": "Apres",
      "divisionRattachee": "APRÈS L'ARTICLE 31, insérer l'article suivant:",
      "articleAdditionnel": "1",
      "urlDivisionTexteVise": "/15/textes/0971.asp#D_Article_31"
    }
  },
  "corps": {
    "dispositif": "<p style=\"text-align: justify;\">I.&#160;&#8211;&#160;Le 14&#176; du 1 de l&#8217;article&#160;207 du code ge&#769;ne&#769;ral des impo&#770;ts est comple&#769;te&#769; par un e ainsi re&#769;dige&#769;&#160;:</p><p style=\"text-align: justify;\">&#171;&#160;<i>e)</i> Les produits financiers issus du placement de sa tre&#769;sorerie.&#160;&#187;</p><p style=\"text-align: justify;\">II. La perte des recettes re&#769;sultat pour l&#8217;E&#769;tat du I ci-dessus est compense&#769;e a&#768; due concurrence par la cre&#769;ation d&#8217;une taxe additionnelle aux droits pre&#769;vus aux articles 575 et 575 A du code ge&#769;ne&#769;ral des impo&#770;ts.</p>",
    "exposeSommaire": "<p style=\"text-align: justify;\">Selon les termes de l&#8217;article&#160;207 du Code Ge&#769;ne&#769;ral des Impo&#770;ts, les organismes d&#8217;habitations a&#768; loyer mode&#769;re&#769; et les socie&#769;te&#769;s d&#8217;e&#769;conomie mixte sont exone&#769;re&#769;s de l&#8217;imp&#244;t sur les socie&#769;te&#769;s pour les produits financiers issus du placement de la tre&#769;sorerie de ces organismes. Or, la socie&#769;te&#769; Action Logement Services ne be&#769;ne&#769;ficie pas de cette exone&#769;ration alors que son activite&#769; rele&#768;ve en grande partie comme les socie&#769;te&#769;s susmentionne&#769;es de l&#8217;inte&#769;re&#770;t ge&#769;ne&#769;ral. Il est donc demande&#769; que les produits issus des placements de tre&#769;sorerie de la socie&#769;te&#769; Action Logement Services be&#769;ne&#769;ficient de la me&#770;me exone&#769;ration.</p>"
  },
  "representations": [
    {
      "nom": "PDF",
      "typeMime": {
        "type": "application",
        "subType": "PDF"
      },
      "statutRepresentation": {
        "verbatim": true,
        "canonique": true,
        "officielle": true,
        "transcription": false,
        "enregistrement": false
      },
      "contenu": {
        "documentURI": "/15/amendements/0971/AN/2905.pdf"
      }
    }
  ],
  "seanceDiscussion": "RUANR5L15S2018IDS21127",
  "sort": {
    "dateSaisie": "2018-06-03T19:10:43.000+02:00",
    "sortEnSeance": "Retiré"
  },
  "dateDepot": "2018-05-26T02:00:00.000+02:00",
  "dateDistribution": "2018-05-30T02:00:00.000+02:00",
  "article99": "0",
  "loiReference": {
    "codeLoi": "CGI",
    "divisionCodeLoi": "207"
  }
}