{
  "uid": "AMANR5L15SEA717460BTC1019P0D1N1179",
  "identifiant": {
    "legislature": "15",
    "numero": "1179",
    "numRect": "0",
    "saisine": {
      "texteLegislatifRef": "PRJLANR5L15BTC1019",
      "numeroPartiePLF": "0",
      "organeExamen": "PO717460",
      "mentionSecondeDeliberation": "0"
    }
  },
  "numeroLong": "1179",
  "etapeTexte": "1ère lecture (1ère assemblée saisie)",
  "triAmendement": "ltv",
  "cardinaliteAmdtMultiples": "1",
  "etat": "Irrecevable",
  "signataires": {
    "auteur": {
      "typeAuteur": "Depute",
      "acteurRef": "PA721776",
      "groupePolitiqueRef": "PO730964"
    },
    "cosignatairesRefs": [
      "PA721776"
    ],
    "texteAffichable": "M.&#160;Baich&#232;re"
  },
  "pointeurFragmentTexte": {
    "division": {
      "titre": "Article 12",
      "articleDesignationCourte": "ART. 12",
      "type": "ARTICLE",
      "avantAApres": "A",
      "divisionRattachee": "ARTICLE 12",
      "urlDivisionTexteVise": "/15/textes/1019.asp#D_Article_12"
    },
    "alinea": {
      "avantAApres": "Apres",
      "numero": "7"
    }
  },
  "corps": {
    "dispositif": "<p style=\"text-align: justify;\">I.&#160;&#8211;&#160;Apr&#232;s l&#8217;alin&#233;a&#160;7, ins&#233;rer les trois alin&#233;as suivants&#160;:</p><p style=\"text-align: justify;\">&#171;&#160;C&#160;&#8211;&#160;1&#176;&#160;&#192; titre exp&#233;rimental, dans les r&#233;gions fix&#233;es par arr&#234;t&#233;, il est d&#233;rog&#233; au niveau de formation pr&#233;vu &#224; l&#8217;article&#160;L.&#160;6243&#8209;1 du code du travail. La limite est port&#233;e &#224; un dipl&#244;me ou un titre &#224; finalit&#233; professionnelle de niveau &#233;quivalent ou sup&#233;rieur &#224; un brevet de technicien sup&#233;rieur ou un dipl&#244;me des instituts universitaires de technologie.</p><p style=\"text-align: justify;\">&#171;&#160;Cette exp&#233;rimentation est mise en place du 1<sup>er&#160;</sup>janvier&#160;2019 au 31&#160;d&#233;cembre&#160;2021.</p><p style=\"text-align: justify;\">&#171;&#160;2&#176;&#160;Le Gouvernement remet au Parlement, au cours du premier semestre 2022, un rapport portant sur les exp&#233;rimentations mises en &#339;uvre au titre du pr&#233;sent C afin de pr&#233;ciser les conditions &#233;ventuelles de leur g&#233;n&#233;ralisation.&#160;&#187;</p><p style=\"text-align: justify;\">II.&#160;&#8211;&#160;Compl&#233;ter cet article par l'alin&#233;a suivant&#160;:</p><p style=\"text-align: justify;\">&#171;&#160;IV.&#160;&#8211;&#160;La perte &#233;ventuelle de ressources pour l&#8217;&#201;tat est compens&#233;e &#224; due concurrence par la cr&#233;ation d&#8217;une taxe additionnelle aux droits vis&#233;s aux articles&#160;575 et 575&#160;A du code g&#233;n&#233;ral des imp&#244;ts.&#187;</p>",
    "exposeSommaire": "<p style=\"text-align: justify;\">L&#8217;article&#160;12 du projet de loi instaure une aide unique aux employeurs d&#8217;apprentis pour les entreprises de moins de 250 salari&#233;s employant un apprenti, afin de pr&#233;parer un dipl&#244;me ou un titre &#224; finalit&#233; professionnelle &#233;quivalent au plus au baccalaur&#233;at. Elle remplace trois dispositifs d&#8217;aides g&#233;r&#233;s par l&#8217;&#201;tat ou les r&#233;gions, ainsi qu&#8217;un cr&#233;dit d&#8217;imp&#244;t.</p><p style=\"text-align: justify;\">Bien que l&#8217;instauration de cette nouvelle aide r&#233;ponde &#224; une forte demande de simplification et de lisibilit&#233; des entreprises, une partie de celles-ci ne seront plus &#233;ligibles aux aides.</p>"
  },
  "representations": [
    {
      "nom": "PDF",
      "typeMime": {
        "type": "application",
        "subType": "PDF"
      },
      "statutRepresentation": {
        "verbatim": true,
        "canonique": true,
        "officielle": true,
        "transcription": false,
        "enregistrement": false
      },
      "contenu": {
        "documentURI": "/15/amendements/1019/AN/1179.pdf"
      }
    }
  ],
  "dateDepot": "2018-06-07T02:00:00.000+02:00",
  "article99": "0",
  "loiReference": {}
}