{
  "uid": "AMANR5L15PO59051B1802P0D1N417",
  "identifiant": {
    "legislature": "15",
    "numero": "417",
    "numRect": "0",
    "saisine": {
      "texteLegislatifRef": "PRJLANR5L15B1802",
      "numeroPartiePLF": "0",
      "organeExamen": "PO59051",
      "mentionSecondeDeliberation": "0"
    }
  },
  "numeroLong": "CL417",
  "etapeTexte": "1ère lecture (1ère assemblée saisie)",
  "triAmendement": "abiaaaaaaaaaaaaaaaaaaaaaaaaaaaaaaaaaaaaaaaaaaaaaaaho",
  "cardinaliteAmdtMultiples": "1",
  "etat": "Discuté",
  "signataires": {
    "auteur": {
      "typeAuteur": "Depute",
      "acteurRef": "PA721860",
      "groupePolitiqueRef": "PO730964"
    },
    "cosignatairesRefs": [
      "PA607155",
      "PA721784",
      "PA721860",
      "PA334116",
      "PA718728",
      "PA719480",
      "PA719396",
      "PA718802",
      "PA722366"
    ],
    "texteAffichable": "M.&#160;Cesarini,  Mme&#160;Gomez-Bassac, M.&#160;Larsonneur, M.&#160;Fugit, Mme&#160;Vanceunebrock-Mialon, M.&#160;Daniel, M.&#160;Gaillard, Mme&#160;Jacqueline&#160;Maquet et M.&#160;Perea"
  },
  "pointeurFragmentTexte": {
    "division": {
      "titre": "Article PREMIER",
      "articleDesignationCourte": "ART. PREMIER",
      "type": "ARTICLE",
      "avantAApres": "A",
      "divisionRattachee": "ARTICLE PREMIER",
      "urlDivisionTexteVise": "/15/textes/1802.asp#D_Article_1er"
    },
    "alinea": {
      "numero": "2"
    }
  },
  "corps": {
    "dispositif": "<p style=\"text-align: justify;\">&#192; la fin de l&#8217;alin&#233;a&#160;2, substituer aux mots&#160;: </p><p style=\"text-align: justify;\">&#171;&#160;dont la liste est &#233;tablie par d&#233;cret en Conseil d&#8217;&#201;tat&#160;&#187;, </p><p style=\"text-align: justify;\">les mots&#160;: </p><p style=\"text-align: justify;\">&#171;&#160;&#224; leur carri&#232;re&#160;&#187;.</p>",
    "exposeSommaire": "<p style=\"text-align: justify;\">Les CAP, instances paritaires permettent de juger de la conformit&#233; les d&#233;cisions individuelles relatives &#224; la carri&#232;re des fonctionnaires. En limitant &#224; une liste fix&#233;e par d&#233;cret en Conseil d'Etat les moments o&#249; les CAP se tiendront, il sera alors tentant pour les les pouvoirs publics de r&#233;duire le nombre de cas o&#249; il sera fait appel au CAP. Un dialogue de gestion n'a pas la finesse des CAP qui permettent de juger la situation au cas par cas des fonctionnaires. Ces CAP permettent souvent de corriger des erreurs sans qu'il y ait besoin d'un recours syst&#233;matique &#224; la voie des recours. Se limiter &#224; un simple dialogue de gestion, risque tr&#232;s rapidement d'aboutir &#224; une multiplication des recours individuels.&#160;</p>"
  },
  "representations": [
    {
      "nom": "PDF",
      "typeMime": {
        "type": "application",
        "subType": "PDF"
      },
      "statutRepresentation": {
        "verbatim": true,
        "canonique": true,
        "officielle": true,
        "transcription": false,
        "enregistrement": false
      },
      "contenu": {
        "documentURI": "/15/amendements/1802/CION_LOIS/CL417.pdf"
      }
    }
  ],
  "sort": {
    "dateSaisie": "2019-05-02T11:01:03.000+02:00",
    "sortEnSeance": "Rejeté"
  },
  "dateDepot": "2019-04-29T02:00:00.000+02:00",
  "dateDistribution": "2019-05-01T02:00:00.000+02:00",
  "article99": "0",
  "loiReference": {
    "codeLoi": "2"
  }
}