{
  "uid": "AMANR5L15SEA717460B1297P0D1N725",
  "identifiant": {
    "legislature": "15",
    "numero": "725",
    "numRect": "0",
    "saisine": {
      "texteLegislatifRef": "PRJLANR5L15B1297",
      "numeroPartiePLF": "0",
      "organeExamen": "PO717460",
      "mentionSecondeDeliberation": "0"
    }
  },
  "numeroLong": "725",
  "etapeTexte": "1ère lecture (1ère assemblée saisie)",
  "triAmendement": "kaaaaaaaaaaaaaaaaaaaaaaaaaaaaaaaaaaaaaaaaaaaaaaaaah",
  "cardinaliteAmdtMultiples": "1",
  "etat": "Irrecevable",
  "signataires": {
    "auteur": {
      "typeAuteur": "Depute",
      "acteurRef": "PA608292",
      "groupePolitiqueRef": "PO759900"
    },
    "cosignatairesRefs": [
      "PA605694",
      "PA608292",
      "PA336175"
    ],
    "texteAffichable": "Mme&#160;Dubi&#233;,  Mme&#160;Pinel et M.&#160;Falorni"
  },
  "pointeurFragmentTexte": {
    "division": {
      "titre": "Article 43",
      "articleDesignationCourte": "APRÈS ART. 43",
      "type": "ARTICLE",
      "avantAApres": "Apres",
      "divisionRattachee": "APRÈS L'ARTICLE 43, insérer l'article suivant:",
      "articleAdditionnel": "1",
      "urlDivisionTexteVise": "/15/textes/1297.asp#D_Article_43"
    }
  },
  "corps": {
    "dispositif": "<p style=\"text-align: justify;\">L&#8217;article L.&#160;5126&#8209;3 du code de la sant&#233; publique est compl&#233;t&#233; par un III ainsi r&#233;dig&#233;&#160;:</p><p style=\"text-align: justify;\">&#171;&#160;III.&#160;&#8211;&#160;L&#8217;obligation faite pour un pharmacien d&#8217;&#234;tre titulaire d&#8217;un dipl&#244;me d&#8217;&#233;tudes sp&#233;cialis&#233;es ne concerne pas les &#233;tablissements de sant&#233; titulaires d&#8217;autorisations d&#8217;activit&#233;s de soins de psychiatrie et de soins de suite et de r&#233;adaptation, d&#233;livr&#233;es sur le fondement des dispositions de l&#8217;article L.&#160;6122&#8209;1.&#160;&#187;</p>",
    "exposeSommaire": "<p style=\"text-align: justify;\">Depuis 2015, l&#8217;encadrement juridique de la pratique des Pharmacies &#224; usage int&#233;rieur (PUI) a &#233;t&#233; pr&#233;cis&#233; par diff&#233;rents textes obligeant le recrutement de pharmaciens ayant un Dipl&#244;me d&#8217;&#233;tudes sp&#233;cialis&#233;es (DES). Si cette obligation peut s&#8217;entendre dans les &#233;tablissements de sant&#233; MCO (s&#233;jours hospitaliers de courte dur&#233;e), rien ne justifie, que ce soit au niveau de la qualit&#233; ou de la s&#233;curit&#233; de la prise en charge du patient, l&#8217;obligation d&#8217;un niveau DES dans les PUI des &#233;tablissements Soins de suite et de r&#233;adaptation (SSR) ou autoris&#233;s en Psychiatrie.</p><p style=\"text-align: justify;\">Parall&#232;lement, le nombre de places en internat de pharmacie (donnant donc l&#8217;acc&#232;s &#224; ce DES) n&#8217;a pas &#233;t&#233; adapt&#233;, et un grand nombre d&#8217;&#233;tablissements de sant&#233; SSR et Psy se trouvent en r&#233;elle situation de tension du fait de cette obligation d&#8217;avoir un pharmacien de PUI titulaire d&#8217;un DES. Cette situation accentue, dans certains territoires, les difficult&#233;s d&#8217;acc&#232;s aux soins.</p><p style=\"text-align: justify;\">Cet amendement vise donc &#224; prendre en compte de possibles d&#233;rogations &#224; l&#8217;obligation pour un pharmacien g&#233;rant de pharmacie &#224; usage int&#233;rieur (PUI) d&#8217;&#234;tre titulaire d&#8217;un DES afin de faciliter l&#8217;acc&#232;s aux soins dans les territoires.</p>"
  },
  "representations": [
    {
      "nom": "PDF",
      "typeMime": {
        "type": "application",
        "subType": "PDF"
      },
      "statutRepresentation": {
        "verbatim": true,
        "canonique": true,
        "officielle": true,
        "transcription": false,
        "enregistrement": false
      },
      "contenu": {
        "documentURI": "/15/amendements/1297/AN/725.pdf"
      }
    }
  ],
  "dateDepot": "2018-10-18T02:00:00.000+02:00",
  "article99": "0",
  "loiReference": {
    "codeLoi": "c santé publique",
    "divisionCodeLoi": "L5126-3"
  }
}