{
  "uid": "AMANR5L15PO744107B0424P0D1N666",
  "identifiant": {
    "legislature": "15",
    "numero": "666",
    "numRect": "0",
    "saisine": {
      "texteLegislatifRef": "PRJLANR5L15B0424",
      "numeroPartiePLF": "0",
      "organeExamen": "PO744107",
      "mentionSecondeDeliberation": "0"
    }
  },
  "numeroLong": "666",
  "etapeTexte": "1ère lecture (1ère assemblée saisie)",
  "triAmendement": "do",
  "cardinaliteAmdtMultiples": "1",
  "etat": "Discuté",
  "signataires": {
    "auteur": {
      "typeAuteur": "Depute",
      "acteurRef": "PA720878",
      "groupePolitiqueRef": "PO730964"
    },
    "cosignatairesRefs": [
      "PA642695",
      "PA720066",
      "PA720862",
      "PA606171",
      "PA718876",
      "PA720342",
      "PA721690",
      "PA722086",
      "PA720170",
      "PA607193",
      "PA608641",
      "PA720014",
      "PA722170",
      "PA677483",
      "PA720960",
      "PA719728",
      "PA719456",
      "PA607595",
      "PA720590",
      "PA721514",
      "PA721398",
      "PA720520",
      "PA719652",
      "PA718902",
      "PA719242",
      "PA643127",
      "PA719302",
      "PA719850",
      "PA719130",
      "PA721584",
      "PA722118",
      "PA722398",
      "PA720878",
      "PA719858",
      "PA720512",
      "PA607155",
      "PA720932"
    ],
    "texteAffichable": "M.&#160;Saint-Martin,  Mme&#160;Beaudouin-Hubiere, M.&#160;Besson-Moreau, M.&#160;Blein, M.&#160;Bothorel, Mme&#160;Cattelot, M.&#160;Da Silva, M.&#160;Daniel, Mme&#160;Degois, M.&#160;Descrozaille, Mme&#160;Errante, Mme&#160;Grandjean, Mme&#160;Hammerer, Mme&#160;Kerbarh, M.&#160;Le Bohec, Mme&#160;Le Peih, Mme&#160;Limon, M.&#160;Mazars, Mme&#160;M&#246;rch, M.&#160;Moreau, Mme&#160;Motin, M.&#160;Pellois, M.&#160;Pietraszewski, M.&#160;Potterie, M.&#160;Questel, M.&#160;Rebeyrotte, Mme&#160;Rist, M.&#160;C&#233;dric&#160;Roussel, M.&#160;Serva, Mme&#160;Sylla, M.&#160;Tan, M.&#160;Taquet, M.&#160;Terlier, Mme&#160;Thourot, Mme&#160;Tiegna, M.&#160;Ferrand, Mme&#160;Michel et les membres du groupe La R&#233;publique en Marche"
  },
  "pointeurFragmentTexte": {
    "division": {
      "titre": "Article 33",
      "articleDesignationCourte": "ART. 33",
      "type": "ARTICLE",
      "avantAApres": "A",
      "divisionRattachee": "ARTICLE 33",
      "urlDivisionTexteVise": "/15/textes/0424.asp#D_Article_33"
    },
    "alinea": {
      "avantAApres": "A",
      "numero": "1",
      "alineaDesignation": "Alinéa 1"
    }
  },
  "corps": {
    "dispositif": "<p style=\"text-align: justify;\">Compl&#233;ter la premi&#232;re phrase de l&#8217;alin&#233;a&#160;1 par les mots&#160;:</p><p style=\"text-align: justify;\">&#171;&#160;, tout en veillant &#224; ce que la participation du public par voie &#233;lectronique pr&#233;voie des dispositifs pour int&#233;grer des citoyens &#233;loign&#233;s du num&#233;rique.&#160;&#187;</p>",
    "exposeSommaire": "<p style=\"text-align: justify;\">Le pr&#233;sent amendement vise &#224; veiller &#224; ce que les consultations par voie &#233;lectronique soient inclusives, c&#8217;est-&#224;-dire prennent en compte les citoyens les plus &#233;loign&#233;s du num&#233;rique. En effet, les in&#233;galit&#233;s &#224; l&#8217;&#232;re num&#233;rique sont encore fortes, encore aujourd&#8217;hui 20&#160;% des citoyens n&#8217;utilisent pas le num&#233;rique.</p>"
  },
  "representations": [
    {
      "nom": "PDF",
      "typeMime": {
        "type": "application",
        "subType": "PDF"
      },
      "statutRepresentation": {
        "verbatim": true,
        "canonique": true,
        "officielle": true,
        "transcription": false,
        "enregistrement": false
      },
      "contenu": {
        "documentURI": "/15/amendements/0424/CSCONF/666.pdf"
      }
    }
  ],
  "sort": {
    "dateSaisie": "2018-01-17T20:03:27.000+01:00",
    "sortEnSeance": "Adopté"
  },
  "dateDepot": "2018-01-11T01:00:00.000+01:00",
  "dateDistribution": "2018-01-15T01:00:00.000+01:00",
  "article99": "0",
  "loiReference": {}
}