{
  "uid": "AMANR5L15PO59048B2272P2D1N824",
  "identifiant": {
    "legislature": "15",
    "numero": "824",
    "numRect": "0",
    "saisine": {
      "texteLegislatifRef": "PRJLANR5L15B2272",
      "numeroPartiePLF": "2",
      "organeExamen": "PO59048",
      "mentionSecondeDeliberation": "0"
    }
  },
  "numeroLong": "II-CF824",
  "etapeTexte": "1ère lecture (1ère assemblée saisie)",
  "triAmendement": "adcaaaaaaaaaaaaaaaaaaaaaaaaaaaaaaaaaaaaaaaaaaaaaaazzo",
  "cardinaliteAmdtMultiples": "1",
  "etat": "Irrecevable",
  "signataires": {
    "auteur": {
      "typeAuteur": "Depute",
      "acteurRef": "PA405480",
      "groupePolitiqueRef": "PO759900"
    },
    "cosignatairesRefs": [
      "PA721194",
      "PA605694",
      "PA755549",
      "PA607619",
      "PA942",
      "PA608292",
      "PA719286",
      "PA605518",
      "PA267042",
      "PA720278",
      "PA719146",
      "PA331582",
      "PA719138",
      "PA336439",
      "PA333421",
      "PA720996",
      "PA336175",
      "PA405480",
      "PA720038"
    ],
    "texteAffichable": "M.&#160;Pupponi,  M.&#160;Acquaviva, M.&#160;Brial, M.&#160;Castellani, M.&#160;Cl&#233;ment, M.&#160;Colombani, M.&#160;Charles&#160;de Courson, Mme&#160;Dubi&#233;, Mme&#160;Fr&#233;d&#233;rique&#160;Dumas, M.&#160;El Guerrab, M.&#160;Falorni, M.&#160;Favennec Becot, Mme&#160;Josso, M.&#160;Fran&#231;ois-Michel&#160;Lambert, M.&#160;Molac, M.&#160;Orphelin, M.&#160;Pancher, Mme&#160;Pinel et M.&#160;Philippe&#160;Vigier"
  },
  "pointeurFragmentTexte": {
    "missionVisee": {
      "idMissionAN": "804",
      "libelleMission": "Cohésion des territoires",
      "codeMissionPLF": "B",
      "libelleMissionPLF": "Répartition, par mission et programme, des crédits du budget général"
    },
    "division": {
      "titre": "Article 75",
      "articleDesignationCourte": "APRÈS ART. 75",
      "type": "ARTICLE",
      "avantAApres": "Apres",
      "divisionRattachee": "APRÈS L'ARTICLE 75, insérer l'article suivant:",
      "articleAdditionnel": "1",
      "urlDivisionTexteVise": "/15/textes/2272C.asp#D_Article_75"
    }
  },
  "corps": {},
  "representations": [
    {
      "nom": "PDF",
      "typeMime": {
        "type": "application",
        "subType": "PDF"
      },
      "statutRepresentation": {
        "verbatim": true,
        "canonique": true,
        "officielle": true,
        "transcription": false,
        "enregistrement": false
      },
      "contenu": {
        "documentURI": "/15/amendements/2272C/CION_FIN/CF824.pdf"
      }
    }
  ],
  "dateDepot": "2019-10-21T02:00:00.000+02:00",
  "dateDistribution": "2019-10-21T02:00:00.000+02:00",
  "article99": "0",
  "loiReference": {}
}