{
  "uid": "AMANR5L15SEA717460BTC2243P0D1N1735",
  "identifiant": {
    "legislature": "15",
    "numero": "1735",
    "numRect": "0",
    "saisine": {
      "texteLegislatifRef": "PRJLANR5L15BTC2243",
      "numeroPartiePLF": "0",
      "organeExamen": "PO717460",
      "mentionSecondeDeliberation": "0"
    }
  },
  "numeroLong": "1735",
  "etapeTexte": "1ère lecture (1ère assemblée saisie)",
  "triAmendement": "dsaaaaaaaaaaaaaaaaaaaaaaaaaaaaaaaaaaaaaaaaaaaaaaaaeelzzzzi",
  "cardinaliteAmdtMultiples": "1",
  "etat": "Discuté",
  "signataires": {
    "auteur": {
      "typeAuteur": "Depute",
      "acteurRef": "PA719608",
      "groupePolitiqueRef": "PO723569"
    },
    "cosignatairesRefs": [
      "PA719608"
    ],
    "texteAffichable": "Mme&#160;M&#233;nard"
  },
  "pointeurFragmentTexte": {
    "division": {
      "titre": "Article 14",
      "articleDesignationCourte": "ART. 14",
      "type": "ARTICLE",
      "avantAApres": "A",
      "divisionRattachee": "ARTICLE 14",
      "urlDivisionTexteVise": "/15/textes/2243.asp#D_Article_14"
    },
    "alinea": {
      "numero": "1"
    }
  },
  "corps": {
    "dispositif": "<p style=\"text-align: justify;\">Supprimer les alin&#233;as 1 et 2.</p>",
    "exposeSommaire": "<p style=\"text-align: justify;\">Ces alin&#233;as ouvrent la porte &#224; la recherche sur des embryons g&#233;n&#233;tiquement modifi&#233;s pouvant &#234;tre implant&#233;s.</p>"
  },
  "representations": [
    {
      "nom": "PDF",
      "typeMime": {
        "type": "application",
        "subType": "PDF"
      },
      "statutRepresentation": {
        "verbatim": true,
        "canonique": true,
        "officielle": true,
        "transcription": false,
        "enregistrement": false
      },
      "contenu": {
        "documentURI": "/15/amendements/2243/AN/1735.pdf"
      }
    }
  ],
  "seanceDiscussion": "RUANR5L15S2020IDS21848",
  "sort": {
    "dateSaisie": "2019-10-04T17:04:06.000+02:00",
    "sortEnSeance": "Non soutenu"
  },
  "dateDepot": "2019-09-19T02:00:00.000+02:00",
  "dateDistribution": "2019-10-01T02:00:00.000+02:00",
  "article99": "0",
  "loiReference": {}
}