{
  "uid": "AMANR5L15SEA717460BTC2401P0D1N874",
  "identifiant": {
    "legislature": "15",
    "numero": "874",
    "numRect": "0",
    "saisine": {
      "texteLegislatifRef": "PRJLANR5L15BTC2401",
      "numeroPartiePLF": "0",
      "organeExamen": "PO717460",
      "mentionSecondeDeliberation": "0"
    }
  },
  "numeroLong": "874",
  "etapeTexte": "1ère lecture (2ème assemblée saisie)",
  "triAmendement": "kdaaaaaaaaaaaaaaaaaaaaaaaaaaaaaaaaaaaaaaaaaaaaaaaadi",
  "cardinaliteAmdtMultiples": "1",
  "etat": "A discuter",
  "signataires": {
    "auteur": {
      "typeAuteur": "Depute",
      "acteurRef": "PA721314",
      "groupePolitiqueRef": "PO730934"
    },
    "cosignatairesRefs": [
      "PA721410",
      "PA923",
      "PA267440",
      "PA1695",
      "PA330008",
      "PA2960",
      "PA2529",
      "PA330240",
      "PA721816",
      "PA721286",
      "PA267289",
      "PA267735",
      "PA1874",
      "PA721054",
      "PA720210",
      "PA605991",
      "PA267794",
      "PA267318",
      "PA720386",
      "PA266776",
      "PA267204",
      "PA718850",
      "PA267324",
      "PA643103",
      "PA1630",
      "PA332523",
      "PA2155",
      "PA719318",
      "PA642847",
      "PA223837",
      "PA1498",
      "PA330684",
      "PA719946",
      "PA856",
      "PA720586",
      "PA334149",
      "PA2792",
      "PA718780",
      "PA721046",
      "PA342935",
      "PA336316",
      "PA643089",
      "PA1012",
      "PA267378",
      "PA608826",
      "PA720630",
      "PA267785",
      "PA721126",
      "PA330788",
      "PA748954",
      "PA346054",
      "PA721314",
      "PA267450",
      "PA345722",
      "PA721968",
      "PA721474",
      "PA334843",
      "PA719272",
      "PA759192",
      "PA721636",
      "PA713448",
      "PA720100",
      "PA2377",
      "PA718784",
      "PA607090",
      "PA340853",
      "PA2492",
      "PA609726",
      "PA266774",
      "PA605036",
      "PA2796",
      "PA334654",
      "PA267901",
      "PA720684",
      "PA746",
      "PA1029",
      "PA267200",
      "PA2086",
      "PA767",
      "PA266797",
      "PA998"
    ],
    "texteAffichable": "M.&#160;Schellenberger,  M.&#160;Abad, Mme&#160;Anthoine, M.&#160;Aubert, Mme&#160;Bassire, M.&#160;Bazin, Mme&#160;Beauvais, Mme&#160;Bonnivard, M.&#160;Boucard, M.&#160;Bouchet, Mme&#160;Val&#233;rie&#160;Boyer, Mme&#160;Brenier, M.&#160;Breton, M.&#160;Brochand, M.&#160;Carrez, M.&#160;Cattin, M.&#160;Cherpion, M.&#160;Ciotti, M.&#160;Cordier, M.&#160;Cornut-Gentille, Mme&#160;Dalloz, M.&#160;Dassault, M.&#160;de Ganay, M.&#160;de la Verpilli&#232;re, M.&#160;Deflesselles, M.&#160;R&#233;mi&#160;Delatte, M.&#160;Di Filippo, M.&#160;Diard, M.&#160;Door, Mme&#160;Marianne&#160;Dubois, Mme&#160;Duby-Muller, M.&#160;Pierre-Henri&#160;Dumont, M.&#160;Fasquelle, M.&#160;Ferrara, M.&#160;Furst, M.&#160;Gaultier, Mme&#160;Genevard, M.&#160;Goasguen, M.&#160;Gosselin, M.&#160;Grelier, Mme&#160;Guion-Firmin, M.&#160;Herbillon, M.&#160;Huyghe, M.&#160;Jacob, M.&#160;Kamardine, M.&#160;Larriv&#233;, M.&#160;Le Fur, Mme&#160;Le Grip, M.&#160;Leclerc, Mme&#160;Levy, M.&#160;Lorion, M.&#160;Emmanuel&#160;Maquet, M.&#160;Marlin, M.&#160;Menuel, Mme&#160;Meunier, M.&#160;Minot, M.&#160;Parigi, M.&#160;Pauget, M.&#160;Peltier, M.&#160;Perrut, M.&#160;Poudroux, M.&#160;Pradi&#233;, M.&#160;Quentin, M.&#160;Ramadier, M.&#160;Reiss, M.&#160;Reitzer, M.&#160;Reyn&#232;s, M.&#160;Savignat, M.&#160;Sermier, M.&#160;Straumann, Mme&#160;Tabarot, M.&#160;Taugourdeau, M.&#160;Teissier, M.&#160;Thi&#233;riot, Mme&#160;Trastour-Isnart, M.&#160;Vatin, M.&#160;Verch&#232;re, M.&#160;Vialay, M.&#160;Jean-Pierre&#160;Vigier, M.&#160;Viry et M.&#160;Woerth"
  },
  "pointeurFragmentTexte": {
    "division": {
      "titre": "Article 22 quater",
      "articleDesignationCourte": "ART. 22 QUATER",
      "type": "ARTICLE",
      "avantAApres": "A",
      "divisionRattachee": "ARTICLE 22 QUATER",
      "urlDivisionTexteVise": "/15/textes/2401.asp#D_Articles_22_ter_et_22_quater"
    }
  },
  "corps": {
    "dispositif": "<p>R&#233;tablir cet article dans sa r&#233;daction suivante&#160;:&#160;</p><p>Le dernier alin&#233;a du&#160;VI de l&#8217;article&#160;L.&#160;1212&#8209;2 du code g&#233;n&#233;ral des collectivit&#233;s territoriales est ainsi r&#233;dig&#233;&#160;:</p><p>&#171;&#160;Lorsque le conseil national &#233;met un avis d&#233;favorable avec recommandations sur tout ou partie d&#8217;un projet de texte mentionn&#233; au premier alin&#233;a du&#160;I, le Gouvernement transmet un projet modifi&#233; ou, &#224; la demande du conseil national, justifie le maintien du projet initial en vue ou &#224; la suite d&#8217;une seconde d&#233;lib&#233;ration.&#160;&#187;<br />&#160;</p>",
    "exposeSommaire": "<p style=\"text-align: justify;\">Cet amendement du&#160;Groupe LR propose de r&#233;tablir cet article supprim&#233; par la commission des lois de l&#8217;Assembl&#233;e nationale.</p><p style=\"text-align: justify;\">Le CNEN est consult&#233; obligatoirement par le Gouvernement sur l&#8217;impact technique et financier, pour les collectivit&#233;s territoriales et leurs &#233;tablissements publics, des projets de textes r&#233;glementaires cr&#233;ant ou modifiant des normes qui leur sont applicables.&#160;Cet article introduit la consultation des &#233;lus et tient compte de leur avis sur la mise en &#339;uvre ou en pratique des mesures nouvelles.&#160;Les minist&#232;res rapporteurs, sur demande du Conseil national, motivent leur d&#233;cision de refus d&#8217;int&#233;grer les recommandations &#233;mises par le CNEN en vue ou lors d&#8217;une seconde d&#233;lib&#233;ration.</p><p style=\"text-align: justify;\">&#160;Il est donc propos&#233; de r&#233;tablir cet article.&#160;</p>"
  },
  "representations": [
    {
      "nom": "PDF",
      "typeMime": {
        "type": "application",
        "subType": "PDF"
      },
      "statutRepresentation": {
        "verbatim": true,
        "canonique": true,
        "officielle": true,
        "transcription": false,
        "enregistrement": false
      },
      "contenu": {
        "documentURI": "/15/amendements/2401/AN/874.pdf"
      }
    }
  ],
  "dateDepot": "2019-11-14T01:00:00.000+01:00",
  "dateDistribution": "2019-11-20T01:00:00.000+01:00",
  "article99": "0",
  "loiReference": {}
}