{
  "uid": "AMANR5L15PO757134B1088P0D1N1730",
  "identifiant": {
    "legislature": "15",
    "numero": "1730",
    "numRect": "0",
    "saisine": {
      "texteLegislatifRef": "PRJLANR5L15B1088",
      "numeroPartiePLF": "0",
      "organeExamen": "PO757134",
      "mentionSecondeDeliberation": "0"
    }
  },
  "numeroLong": "1730",
  "etapeTexte": "1ère lecture (1ère assemblée saisie)",
  "triAmendement": "bciaaaaaaaaaaaaaaaaaaaaaaaaaaaaaaaaaaaaaaaaaaaaaaahit",
  "cardinaliteAmdtMultiples": "1",
  "etat": "Discuté",
  "signataires": {
    "auteur": {
      "typeAuteur": "Depute",
      "acteurRef": "PA722142",
      "groupePolitiqueRef": "PO730958"
    },
    "cosignatairesRefs": [
      "PA720422",
      "PA720286",
      "PA719676",
      "PA721202",
      "PA2150",
      "PA720846",
      "PA720892",
      "PA719578",
      "PA721062",
      "PA588884",
      "PA718860",
      "PA720430",
      "PA721960",
      "PA722142",
      "PA718868",
      "PA721226",
      "PA721210"
    ],
    "texteAffichable": "M.&#160;Ruffin,  Mme&#160;Autain, M.&#160;Bernalicis, M.&#160;Coquerel, M.&#160;Corbi&#232;re, Mme&#160;Fiat, M.&#160;Lachaud, M.&#160;Larive, M.&#160;M&#233;lenchon, Mme&#160;Obono, Mme&#160;Panot, M.&#160;Prud&apos;homme, M.&#160;Quatennens, M.&#160;Ratenon, Mme&#160;Ressiguier, Mme&#160;Rubin et Mme&#160;Taurine"
  },
  "pointeurFragmentTexte": {
    "division": {
      "titre": "Article 14",
      "articleDesignationCourte": "APRÈS ART. 14",
      "type": "ARTICLE",
      "avantAApres": "Apres",
      "divisionRattachee": "APRÈS L'ARTICLE 14, insérer l'article suivant:",
      "articleAdditionnel": "1",
      "urlDivisionTexteVise": "/15/textes/1088.asp#D_Article_14"
    }
  },
  "corps": {
    "dispositif": "<p style=\"text-align: justify;\">Des commissaires au redressement productif, nomm&#233;s par le ministre charg&#233; de l&#8217;&#233;conomie, remplissent une mission de service public d&#8217;accompagnement des dirigeants d&#8217;entreprises, notamment ceux rencontrant des difficult&#233;s pouvant mettre en p&#233;ril la poursuite de leur activit&#233;. Ils facilitent la mobilisation des moyens et les services de l&#8217;&#201;tat pour y parvenir. Ils peuvent aussi &#234;tre sollicit&#233;s par le comit&#233; social et &#233;conomique mentionn&#233; &#224; l&#8217;article L.&#160;2311&#8209;2 du code du travail.</p>",
    "exposeSommaire": "<p style=\"text-align: justify;\">Par cet amendement, nous souhaitons inscrire dans la loi les commissaires au redressement productif cr&#233;&#233;s par M. Montebourg en 2012 avec une mission de service public d&#8217;accompagnement des chefs d&#8217;entreprises notamment ceux en difficult&#233;. </p><p style=\"text-align: justify;\">Lors des auditions que nous avons organis&#233;es, la solitude des chefs d&#8217;entreprises, notamment dans les p&#233;riodes difficiles, revenait en permanence. Il nous para&#238;t n&#233;cessaire qu&#8217;&#224; l&#8217;avenir, les chefs d&#8217;entreprises soient moins seuls pour faire face aux difficult&#233;s et pour prendre des d&#233;cisions qui engagent la vie de l&#8217;entreprise. Cela passe par un renforcement du r&#244;le des salari&#233;s et des instances qui les repr&#233;sentent ainsi que par un accompagnement plus important de l&#8217;&#201;tat. </p><p style=\"text-align: justify;\">Le commissaire au redressement productif peut &#234;tre un interlocuteur pr&#233;cieux pour conseiller le chef d&#8217;entreprise et mobiliser au mieux les services de l&#8217;&#201;tat dans l&#8217;int&#233;r&#234;t g&#233;n&#233;ral.</p>"
  },
  "representations": [
    {
      "nom": "PDF",
      "typeMime": {
        "type": "application",
        "subType": "PDF"
      },
      "statutRepresentation": {
        "verbatim": true,
        "canonique": true,
        "officielle": true,
        "transcription": false,
        "enregistrement": false
      },
      "contenu": {
        "documentURI": "/15/amendements/1088/CSPACTE/1730.pdf"
      }
    }
  ],
  "sort": {
    "dateSaisie": "2018-09-07T22:18:21.000+02:00",
    "sortEnSeance": "Rejeté"
  },
  "dateDepot": "2018-09-03T02:00:00.000+02:00",
  "dateDistribution": "2018-09-06T02:00:00.000+02:00",
  "article99": "0",
  "loiReference": {
    "codeLoi": "xdispositions",
    "divisionCodeLoi": "commissaires redressement productif"
  }
}