{
  "uid": "AMANR5L15PO419865B2135P0D1N429",
  "identifiant": {
    "legislature": "15",
    "numero": "429",
    "numRect": "0",
    "saisine": {
      "texteLegislatifRef": "PRJLANR5L15B2135",
      "numeroPartiePLF": "0",
      "organeExamen": "PO419865",
      "mentionSecondeDeliberation": "0"
    }
  },
  "numeroLong": "CD429",
  "etapeTexte": "Nouvelle Lecture",
  "triAmendement": "goaacaaaaaaaaaaaaaaaaaaaaaaaaaaaaaaaaaaaaaaaaaaaaazzzzzy",
  "cardinaliteAmdtMultiples": "1",
  "etat": "Discuté",
  "signataires": {
    "auteur": {
      "typeAuteur": "Depute",
      "acteurRef": "PA342415",
      "groupePolitiqueRef": "PO758835"
    },
    "cosignatairesRefs": [
      "PA340357",
      "PA1198",
      "PA719930",
      "PA337483",
      "PA609590",
      "PA340343",
      "PA342415",
      "PA508",
      "PA267233",
      "PA333818",
      "PA610681",
      "PA609332",
      "PA335532",
      "PA607553",
      "PA332614",
      "PA643145",
      "PA1809",
      "PA642764",
      "PA333285",
      "PA429893",
      "PA608741",
      "PA1008",
      "PA608011",
      "PA605069",
      "PA608172",
      "PA335054",
      "PA608695",
      "PA1592",
      "PA720988"
    ],
    "texteAffichable": "Mme&#160;Battistel,  M.&#160;Aviragnet, M.&#160;Bouillon, M.&#160;Garot, Mme&#160;Bi&#233;mouret, Mme&#160;Bareigts, M.&#160;Jean-Louis&#160;Bricout, M.&#160;Carvounas, M.&#160;Alain&#160;David, Mme&#160;Laurence&#160;Dumont, M.&#160;Faure, M.&#160;David&#160;Habib, M.&#160;Hutin, M.&#160;Juanico, Mme&#160;Karamanli, M.&#160;J&#233;r&#244;me&#160;Lambert, M.&#160;Letchimy, Mme&#160;Manin, Mme&#160;Pau-Langevin, Mme&#160;Pires Beaune, M.&#160;Potier, M.&#160;Pueyo, Mme&#160;Rabault, M.&#160;Saulignac, Mme&#160;Tolmont, Mme&#160;Untermaier, Mme&#160;Vainqueur-Christophe, M.&#160;Vallaud, Mme&#160;Victory et les membres du groupe Socialistes et apparent&#233;s"
  },
  "pointeurFragmentTexte": {
    "division": {
      "titre": "Article 1er A",
      "articleDesignationCourte": "ART. 1ER A",
      "type": "ARTICLE",
      "avantAApres": "A",
      "divisionRattachee": "ARTICLE 1ER A",
      "urlDivisionTexteVise": "/15/textes/2135.asp#D_Article_1er_A"
    },
    "alinea": {
      "numero": "5"
    }
  },
  "corps": {
    "dispositif": "<p>Compl&#233;ter l&#8217;alin&#233;a&#160;5 par les deux phrases suivantes&#160;:</p><p style=\"text-align: justify;\">&#171;&#160;Le Gouvernement encourage l&#8217;usage du r&#233;seau ferr&#233; existant pour les d&#233;placements intraeurop&#233;ens. Dans ce cadre, les op&#233;rateurs publics ferroviaires coop&#232;rent avec les op&#233;rateurs ferroviaires europ&#233;ens pour la cr&#233;ation et l&#8217;exploitation de nouvelles lignes de trains de nuit&#160;;&#160;&#187;.</p>",
    "exposeSommaire": "<p style=\"text-align: justify;\">Actuellement, la mobilit&#233; intra-europ&#233;enne est principalement assur&#233;e par l&#8217;aviation, qui est la mobilit&#233; la plus &#233;nergivore et &#233;mettrice de GES par passager. L&#8217;Intercit&#233; de nuit est une solution de report modal sur le ferroviaire qui a &#233;t&#233; n&#233;glig&#233;e voire d&#233;nigr&#233;e. Certains pays europ&#233;ens ont d&#233;j&#224; montr&#233; son potentiel. Celui-ci reste &#224; exploiter en France.</p><p style=\"text-align: justify;\">Rappelons qu&#8217;un voyage en train de jour de plus de 3 heures (soit 750 km en TGV) perd en attractivit&#233;. Pour comparaison le voyage de nuit, m&#234;me &#224; petite vitesse, permet des d&#233;placements pendant notre sommeil, sans perte de temps sur des distances deux fois plus longues&#160;: de 800 &#224; 1500 km. Le train de nuit est une activit&#233; particuli&#232;rement complexe, plusieurs op&#233;rateurs ferroviaires europ&#233;ens&#160;&#8211;&#160;dont la DB et &#214;BB&#160;&#8211;&#160;ont analys&#233; que le d&#233;veloppement d&#8217;un r&#233;seau international ambitieux pourra se r&#233;aliser uniquement si les op&#233;rateurs ferroviaires nationaux des diff&#233;rents pays coop&#232;rent.</p><p style=\"text-align: justify;\">En cons&#233;quence, l&#8217;Allemagne a d&#233;j&#224; demand&#233; &#224; son op&#233;rateur public de coop&#233;rer avec les op&#233;rateurs &#233;trangers pour les Intercit&#233;s de nuit. L&#8217;&#201;tat gagnera donc &#224; fixer explicitement dans la feuille de route du groupe SNCF l&#8217;obligation de coop&#233;rer avec les op&#233;rateurs europ&#233;ens pour le d&#233;veloppement des r&#233;seaux Intercit&#233;s de nuit. C&#8217;est un beau projet pour rapprocher l&#8217;Europe tout en r&#233;duisant les impacts environnementaux des transports.</p>"
  },
  "representations": [
    {
      "nom": "PDF",
      "typeMime": {
        "type": "application",
        "subType": "PDF"
      },
      "statutRepresentation": {
        "verbatim": true,
        "canonique": true,
        "officielle": true,
        "transcription": false,
        "enregistrement": false
      },
      "contenu": {
        "documentURI": "/15/amendements/2135/CION-DVP/CD429.pdf"
      }
    }
  ],
  "sort": {
    "dateSaisie": "2019-09-03T18:39:49.000+02:00",
    "sortEnSeance": "Rejeté"
  },
  "dateDepot": "2019-08-27T02:00:00.000+02:00",
  "dateDistribution": "2019-08-31T02:00:00.000+02:00",
  "article99": "0",
  "loiReference": {}
}