{
  "uid": "AMANR5L15SEA717460B1255P2D1N2013",
  "identifiant": {
    "legislature": "15",
    "numero": "2013",
    "numRect": "0",
    "saisine": {
      "texteLegislatifRef": "PRJLANR5L15B1255",
      "numeroPartiePLF": "2",
      "organeExamen": "PO717460",
      "mentionSecondeDeliberation": "0"
    }
  },
  "numeroLong": "II-2013",
  "etapeTexte": "1ère lecture (1ère assemblée saisie)",
  "triAmendement": "esaaaaaaaaaaaaaaaaaaaaaaaaaaaaaaaaaaaaaaaaaaaaaaaaaao",
  "cardinaliteAmdtMultiples": "1",
  "etat": "Discuté",
  "signataires": {
    "auteur": {
      "typeAuteur": "Depute",
      "acteurRef": "PA610775",
      "groupePolitiqueRef": "PO744425"
    },
    "cosignatairesRefs": [
      "PA720960",
      "PA721110",
      "PA702052",
      "PA266788",
      "PA755549",
      "PA1960",
      "PA268019",
      "PA267766",
      "PA721094",
      "PA610775",
      "PA267585",
      "PA267330",
      "PA712014"
    ],
    "texteAffichable": "M.&#160;Gom&#232;s,  M.&#160;Dunoyer, M.&#160;Guy&#160;Bricout, M.&#160;Lagarde, M.&#160;Ledoux, M.&#160;Leroy, M.&#160;Morel-&#192;-L&apos;Huissier, Mme&#160;Sage, Mme&#160;Sanquer, M.&#160;Vercamer, M.&#160;Zumkeller, M.&#160;Serva et M.&#160;Brial"
  },
  "pointeurFragmentTexte": {
    "division": {
      "titre": "Article 55",
      "articleDesignationCourte": "ART. 55",
      "type": "ARTICLE",
      "avantAApres": "A",
      "divisionRattachee": "ARTICLE 55",
      "urlDivisionTexteVise": "/15/textes/1255C.asp#D_Article_55"
    },
    "alinea": {
      "avantAApres": "Apres",
      "numero": "3"
    }
  },
  "corps": {
    "dispositif": "<p style=\"text-align: justify;\">I.&#160;&#8211;&#160;Apr&#232;s l&#8217;alin&#233;a&#160;3,&#160;ins&#233;rer l&#8217;alin&#233;a suivant&#160;:</p><p style=\"text-align: justify;\"><i>aa)</i> &#192; la troisi&#232;me phrase du premier alin&#233;a, l'ann&#233;e&#160;: &#171;&#160;2019&#160;&#187; est remplac&#233;e par l'ann&#233;e&#160;: &#171;&#160;2020&#160;&#187; et l'ann&#233;e&#160;: &#171;&#160;2020&#160;&#187; est remplac&#233;e par l'ann&#233;e&#160;: &#171;&#160;2021&#160;&#187;.</p><p style=\"text-align: justify;\">II.&#160;&#8211;&#160;Compl&#233;ter cet article par l'alin&#233;a suivant&#160;:</p><p style=\"text-align: justify;\">&#171;&#160;IV.&#160;&#8211;&#160;La perte de recettes pour l&#8217;&#201;tat est compens&#233;e &#224; due concurrence par la cr&#233;ation d&#8217;une taxe additionnelle aux droits mentionn&#233;s aux articles 575 et 575 A du code g&#233;n&#233;ral des imp&#244;ts.&#160;&#187;</p>",
    "exposeSommaire": "<p style=\"text-align: justify;\">L&#8217;extinction progressive dans les d&#233;partements et r&#233;gions d'outre-mer (DROM) du dispositif d&#8217;aide fiscale aux investissements productifs outre-mer codifi&#233; &#224; l&#8217;article 199 undecies B au profit du nouveau dispositif du cr&#233;dit d&#8217;imp&#244;t institu&#233; par l&#8217;article 244 W est subordonn&#233;, pour les PME des DROM dont le chiffre d&#8217;affaires est inf&#233;rieur &#224; 20 M&#8364;, &#224; la mise en place d&#8217;un dispositif p&#233;renne de pr&#233;financement du cr&#233;dit d&#8217;imp&#244;t.</p><p style=\"text-align: justify;\">L&#8217;article 55 propose de supprimer cette formulation, alors m&#234;me qu&#8217;aucun m&#233;canisme de pr&#233;financement p&#233;renne n&#8217;est op&#233;rationnel &#224; ce jour.</p><p style=\"text-align: justify;\">Par ailleurs, le gouvernement envisage d&#8217;autres pistes de r&#233;flexion pour financer &#224; l&#8217;avenir ce type d&#8217;investissements.</p><p style=\"text-align: justify;\">Il est donc propos&#233; par sagesse de repousser d&#8217;une ann&#233;e l&#8217;extinction progressive du m&#233;canisme de d&#233;fiscalisation traditionnel applicable aux PME de moins de 20 M&#8364;&#160;de chiffre d&#8217;affaires, de mani&#232;re &#224; permettre la mise en place effective soit d&#8217;un m&#233;canisme de pr&#233;financement p&#233;renne, soit d&#8217;autres m&#233;canismes permettant de financer les investissements productifs des PME et TPE dont le chiffre d&#8217;affaires est inf&#233;rieur &#224; 20 M&#8364;.</p>"
  },
  "representations": [
    {
      "nom": "PDF",
      "typeMime": {
        "type": "application",
        "subType": "PDF"
      },
      "statutRepresentation": {
        "verbatim": true,
        "canonique": true,
        "officielle": true,
        "transcription": false,
        "enregistrement": false
      },
      "contenu": {
        "documentURI": "/15/amendements/1255C/AN/2013.pdf"
      }
    }
  ],
  "seanceDiscussion": "RUANR5L15S2019IDS21342",
  "sort": {
    "dateSaisie": "2018-11-15T18:30:37.000+01:00",
    "sortEnSeance": "Rejeté"
  },
  "dateDepot": "2018-11-09T01:00:00.000+01:00",
  "dateDistribution": "2018-11-15T01:00:00.000+01:00",
  "article99": "0",
  "loiReference": {}
}