{
  "uid": "AMANR5L15PO59048B2272P1D1N997",
  "identifiant": {
    "legislature": "15",
    "numero": "997",
    "numRect": "0",
    "saisine": {
      "texteLegislatifRef": "PRJLANR5L15B2272",
      "numeroPartiePLF": "1",
      "organeExamen": "PO59048",
      "mentionSecondeDeliberation": "0"
    }
  },
  "numeroLong": "I-CF997",
  "etapeTexte": "1ère lecture (1ère assemblée saisie)",
  "triAmendement": "jcaaaaaaaaaaaaaaaaaaaaaaaaaaaaaaaaaaaaaaaaaaaaaaaabbdho",
  "cardinaliteAmdtMultiples": "1",
  "etat": "Discuté",
  "signataires": {
    "auteur": {
      "typeAuteur": "Depute",
      "acteurRef": "PA719592",
      "groupePolitiqueRef": "PO730964"
    },
    "cosignatairesRefs": [
      "PA719592"
    ],
    "texteAffichable": "M.&#160;Simian"
  },
  "pointeurFragmentTexte": {
    "division": {
      "titre": "Article 26",
      "articleDesignationCourte": "APRÈS ART. 26",
      "type": "ARTICLE",
      "avantAApres": "Apres",
      "divisionRattachee": "APRÈS L'ARTICLE 26, insérer l'article suivant:",
      "articleAdditionnel": "1",
      "urlDivisionTexteVise": "/15/textes/2272A.asp#D_Article_26"
    }
  },
  "corps": {
    "dispositif": "<p style=\"text-align: justify;\">I.&#160;&#8211;&#160;Au premier alin&#233;a de l&#8217;article L.&#160;1615&#8209;1 du code g&#233;n&#233;ral des collectivit&#233;s territoriales, apr&#232;s le mot&#160;:&#160;&#171;&#160;voirie&#160;&#187; sont ins&#233;r&#233;s les mots&#160;: &#171;&#160;, et les d&#233;penses de services de l&#8217;informatique en nuage tel que d&#233;fini au Journal officiel de la R&#233;publique fran&#231;aise du 6 juin 2010, et les d&#233;penses de logiciels en tant que services,&#160;&#187;.</p><p style=\"text-align: justify;\">II.&#160;&#8211;&#160;La perte de recettes r&#233;sultant pour l&#8217;&#201;tat de l&#8217;application du 1 est compens&#233;e, &#224; due concurrence, par la cr&#233;ation d&#8217;une taxe additionnelle aux droits pr&#233;vus aux articles 575 et 575 A du code g&#233;n&#233;ral des imp&#244;ts.</p>",
    "exposeSommaire": "<p style=\"text-align: justify;\">Ces derni&#232;res ann&#233;es, les pratiques de gestion des donn&#233;es num&#233;riques ont fortement &#233;volu&#233;. Ainsi, de nombreuses entreprises ne sont plus aujourd&#8217;hui propri&#233;taires de leurs services et louent des capacit&#233;s de stockage aupr&#232;s de prestataires de services, ce qui est g&#233;n&#233;ralement appel&#233; du &#171;&#160;cloud computing&#160;&#187;.</p><p>&#160;</p><p>Cette &#233;volution ne s&#8217;est pas produite dans les collectivit&#233;s territoriales car l&#8217;achat de leurs propres capacit&#233;s de stockage est consid&#233;r&#233; comme une d&#233;pense de fonctionnement et donc in&#233;ligible au fonds de compensation pour la taxe sur la valeur ajout&#233;e (FCTVA). Le m&#233;canisme d&#8217;&#233;ligibilit&#233; du FCTVA en vigueur n&#8217;encourage donc pas les collectivit&#233;s &#224; &#233;voluer vers du stockage dans le &#171;&#160;cloud computing&#160;&#187; car cette d&#233;pense est consid&#233;r&#233;e comme du fonctionnement.</p><p>&#160;</p><p>Alors m&#234;me que le cloud computing repr&#233;sente, d&#8217;une part, une opportunit&#233; r&#233;elle de r&#233;duction des d&#233;penses de fonctionnement pour les collectivit&#233;s, en coh&#233;rence avec les objectifs du Gouvernement de limiter la progression de leurs d&#233;penses r&#233;elles de fonctionnement (DRF) et, d&#8217;autre part, une &#233;tape suppl&#233;mentaire dans la num&#233;risation de l&#8217;administration, il appara&#238;t donc n&#233;cessaire de l&#8217;encourager.</p><p>&#160;</p><p>Par ailleurs, les projets informatiques supposaient auparavant l&#8217;achat d&#8217;&#233;quipements et de logiciels sous forme de licences dont la d&#233;pense &#233;tait comptabilis&#233;e en investissement et donc &#233;ligible au FCTVA. Avec l&#8217;av&#232;nement du cloud et des SaaS (logiciels en tant que services), les &#233;l&#233;ments de stockage sont dans le r&#233;seau et les clients, les collectivit&#233;s en l&#8217;occurrence, ach&#232;tent &#224; la demande cette capacit&#233; de stockage. Le patrimoine n&#8217;appartient donc plus aux collectivit&#233;s qui ne font que r&#233;mun&#233;rer un service. Ces d&#233;penses sont aujourd&#8217;hui comptabilis&#233;es en fonctionnement et sont donc exclues du b&#233;n&#233;fice du FCTVA.</p><p>&#160;</p><p>Le pr&#233;sent amendement propose donc d&#8217;&#233;largir le b&#233;n&#233;fice du FCTVA aux d&#233;penses de services du cloud computing ainsi qu&#8217;aux d&#233;penses de logiciels en tant que services.</p>"
  },
  "representations": [
    {
      "nom": "PDF",
      "typeMime": {
        "type": "application",
        "subType": "PDF"
      },
      "statutRepresentation": {
        "verbatim": true,
        "canonique": true,
        "officielle": true,
        "transcription": false,
        "enregistrement": false
      },
      "contenu": {
        "documentURI": "/15/amendements/2272A/CION_FIN/CF997.pdf"
      }
    }
  ],
  "sort": {
    "dateSaisie": "2019-10-10T12:59:13.000+02:00",
    "sortEnSeance": "Non soutenu"
  },
  "dateDepot": "2019-10-04T02:00:00.000+02:00",
  "dateDistribution": "2019-10-09T02:00:00.000+02:00",
  "article99": "0",
  "loiReference": {
    "codeLoi": "CGCT",
    "divisionCodeLoi": "L 1615-1"
  }
}