{
  "uid": "AMANR5L15PO59051B0911P0D1N142",
  "identifiant": {
    "legislature": "15",
    "numero": "142",
    "numRect": "0",
    "saisine": {
      "texteLegislatifRef": "PRJLANR5L15B0911",
      "numeroPartiePLF": "0",
      "organeExamen": "PO59051",
      "mentionSecondeDeliberation": "0"
    }
  },
  "numeroLong": "CL142",
  "etapeTexte": "1ère lecture (1ère assemblée saisie)",
  "triAmendement": "auhzzy",
  "cardinaliteAmdtMultiples": "1",
  "etat": "Discuté",
  "signataires": {
    "auteur": {
      "typeAuteur": "Depute",
      "acteurRef": "PA718876",
      "groupePolitiqueRef": "PO730964"
    },
    "cosignatairesRefs": [
      "PA718876"
    ],
    "texteAffichable": "M.&#160;Besson-Moreau"
  },
  "pointeurFragmentTexte": {
    "division": {
      "titre": "Article 4",
      "articleDesignationCourte": "APRÈS ART. 4",
      "type": "ARTICLE",
      "avantAApres": "Apres",
      "divisionRattachee": "APRÈS L'ARTICLE 4, insérer l'article suivant:",
      "articleAdditionnel": "1",
      "urlDivisionTexteVise": "/15/textes/0911.asp#D_Article_4"
    }
  },
  "corps": {
    "dispositif": "<p>Le premier alin&#233;a de l'article&#160;43 de la Constitution est ainsi modifi&#233;&#160;:</p><p>1&#176;&#160;Le mot&#160;: &#171;&#160;huit&#160;&#187; est remplac&#233; par le mot&#160;: &#171;&#160;neuf&#160;&#187;&#160;;</p><p>2&#176;&#160;Est ajout&#233;e une phrase ainsi r&#233;dig&#233;e&#160;: &#171;&#160;La commission charg&#233;e des affaires&#160;europ&#233;ennes mentionn&#233;e &#224; l&#8217;article&#160;88&#8209;4 compte parmi les neuf commissions permanentes de chaque assembl&#233;e.&#160;&#187;</p>",
    "exposeSommaire": "<p>&#160;</p><p>Le cadre constitutionnel actuel est paradoxal. Il reconna&#238;t &#224; la fois l&#8217;existence d&#8217;une commission charg&#233;e des affaires europ&#233;ennes &#224; l&#8217;Assembl&#233;e nationale et au S&#233;nat (cf. article 88-4 de la Constitution) mais ces commissions n&#8217;ont pas le statut de commissions permanentes dont le nombre est limit&#233; &#224; huit &#224; la suite de la r&#233;forme constitutionnelle du 23 juillet 2008.</p><p>Or, ces commissions permanentes ont un r&#244;le essentiel. Comme le pr&#233;cise le rapport \"Refaire la d&#233;mocratie\" , elles sont &#171; en premi&#232;re ligne de l&#8217;activit&#233; de contr&#244;le &#8211; via les missions d&#8217;information, le suivi de l&#8217;application des lois, les auditions, le vote sur les nominations &#8211; mais aussi de l&#8217;activit&#233; l&#233;gislative &#8211; l&#8217;examen en commission &#233;tant devenu un niveau de lecture &#224; lui seul &#187; (cf. page 105 de ce rapport).</p><p>Il convient donc d&#8217;autonomiser les questions europ&#233;ennes des questions li&#233;es aux affaires &#233;trang&#232;res. Il est donc propos&#233; de que les deux commissions charg&#233;es des affaires europ&#233;ennes puissent &#234;tre qualifi&#233;es de &#171; plein exercice &#187; et deviennent donc permanentes.</p>"
  },
  "representations": [
    {
      "nom": "PDF",
      "typeMime": {
        "type": "application",
        "subType": "PDF"
      },
      "statutRepresentation": {
        "verbatim": true,
        "canonique": true,
        "officielle": true,
        "transcription": false,
        "enregistrement": false
      },
      "contenu": {
        "documentURI": "/15/amendements/0911/CION_LOIS/CL142.pdf"
      }
    }
  ],
  "sort": {
    "dateSaisie": "2018-06-29T11:41:31.000+02:00",
    "sortEnSeance": "Non soutenu"
  },
  "dateDepot": "2018-06-12T02:00:00.000+02:00",
  "dateDistribution": "2018-06-25T02:00:00.000+02:00",
  "article99": "0",
  "loiReference": {
    "codeLoi": "43",
    "divisionCodeLoi": "1-9 dc"
  }
}