{
  "uid": "AMANR5L15SEA717460BTC2243P0D1N42",
  "identifiant": {
    "legislature": "15",
    "numero": "42",
    "numRect": "0",
    "saisine": {
      "texteLegislatifRef": "PRJLANR5L15BTC2243",
      "numeroPartiePLF": "0",
      "organeExamen": "PO717460",
      "mentionSecondeDeliberation": "0"
    }
  },
  "numeroLong": "42",
  "etapeTexte": "1ère lecture (1ère assemblée saisie)",
  "triAmendement": "acaaaaaaaaaaaaaaaaaaaaaaaaaaaaaaaaaaaaaaaaaaaaaaaahdc",
  "cardinaliteAmdtMultiples": "1",
  "etat": "Discuté",
  "signataires": {
    "auteur": {
      "typeAuteur": "Depute",
      "acteurRef": "PA330008",
      "groupePolitiqueRef": "PO730934"
    },
    "cosignatairesRefs": [
      "PA721286",
      "PA721046",
      "PA643134",
      "PA1012",
      "PA719318",
      "PA606098",
      "PA2796",
      "PA722390",
      "PA330008"
    ],
    "texteAffichable": "M.&#160;Breton,  Mme&#160;Corneloup, M.&#160;Ramadier, Mme&#160;Anthoine, M.&#160;Marleix, Mme&#160;Bassire, Mme&#160;Valentin, M.&#160;Teissier et M.&#160;de la Verpilli&#232;re"
  },
  "pointeurFragmentTexte": {
    "division": {
      "titre": "Article PREMIER",
      "articleDesignationCourte": "ART. PREMIER",
      "type": "ARTICLE",
      "avantAApres": "A",
      "divisionRattachee": "ARTICLE PREMIER",
      "urlDivisionTexteVise": "/15/textes/2243.asp#D_Article_1er"
    },
    "alinea": {
      "numero": "32"
    }
  },
  "corps": {
    "dispositif": "<p style=\"text-align: justify;\">&#192; l&#8217;alin&#233;a&#160;32, apr&#232;s la deuxi&#232;me occurrence du mot&#160;:</p><p style=\"text-align: justify;\">&#171;&#160;couple&#160;&#187;,</p><p style=\"text-align: justify;\">ins&#233;rer les mots&#160;:</p><p style=\"text-align: justify;\">&#171;&#160;ou du pacte civil de solidarit&#233;&#160;&#187;.</p>",
    "exposeSommaire": "<p>La rupture d&#8217;un couple entra&#238;ne l&#8217;impossibilit&#233; de transfert d&#8217;embryons.</p><p style=\"text-align: justify;\">Il convient de pr&#233;ciser que les membres d&#8217;un PACS sont aussi concern&#233;s par cette disposition.</p>"
  },
  "representations": [
    {
      "nom": "PDF",
      "typeMime": {
        "type": "application",
        "subType": "PDF"
      },
      "statutRepresentation": {
        "verbatim": true,
        "canonique": true,
        "officielle": true,
        "transcription": false,
        "enregistrement": false
      },
      "contenu": {
        "documentURI": "/15/amendements/2243/AN/42.pdf"
      }
    }
  ],
  "seanceDiscussion": "RUANR5L15S2019IDS21832",
  "sort": {
    "dateSaisie": "2019-09-27T10:00:50.000+02:00",
    "sortEnSeance": "Rejeté"
  },
  "dateDepot": "2019-09-16T02:00:00.000+02:00",
  "dateDistribution": "2019-09-23T02:00:00.000+02:00",
  "article99": "0",
  "loiReference": {}
}