{
  "uid": "AMANR5L15PO59051B1503P0D1N284",
  "identifiant": {
    "legislature": "15",
    "numero": "284",
    "numRect": "0",
    "saisine": {
      "texteLegislatifRef": "PRJLANR5L15B1503",
      "numeroPartiePLF": "0",
      "organeExamen": "PO59051",
      "mentionSecondeDeliberation": "0"
    }
  },
  "numeroLong": "CL284",
  "etapeTexte": "Nouvelle Lecture",
  "triAmendement": "jeaaaaaaaaaaaaaaaaaaaaaaaaaaaaaaaaaaaaaaaaaaaaaaaamr",
  "cardinaliteAmdtMultiples": "1",
  "etat": "Discuté",
  "signataires": {
    "auteur": {
      "typeAuteur": "Depute",
      "acteurRef": "PA719874",
      "groupePolitiqueRef": "PO730970"
    },
    "cosignatairesRefs": [
      "PA719874"
    ],
    "texteAffichable": "Mme&#160;Jacquier-Laforge"
  },
  "pointeurFragmentTexte": {
    "division": {
      "titre": "Article 46",
      "articleDesignationCourte": "ART. 46",
      "type": "ARTICLE",
      "avantAApres": "A",
      "divisionRattachee": "ARTICLE 46",
      "urlDivisionTexteVise": "/15/textes/1503.asp#D_Article_46"
    },
    "alinea": {
      "numero": "15"
    }
  },
  "corps": {
    "dispositif": "<p style=\"text-align: justify;\">I.&#160;&#8211;&#160;&#192; l&#8217;alin&#233;a&#160;15, apr&#232;s le mot&#160;:</p><p style=\"text-align: justify;\">&#171;&#160;probation&#160;&#187;,</p><p style=\"text-align: justify;\">ins&#233;rer les mots&#160;:</p><p style=\"text-align: justify;\">&#171;&#160;ou par la personne morale habilit&#233;e qui &#233;tait charg&#233;e du contr&#244;le judiciaire&#160;&#187;.</p><p style=\"text-align: justify;\">II.&#160;&#8211;&#160;En cons&#233;quence, proc&#233;der &#224; la m&#234;me insertion &#224; la fin de l&#8217;alin&#233;a&#160;18.</p>",
    "exposeSommaire": "<p>Amendement de repli.</p><p>Depuis l&#8217;adoption par la Commission des lois de l&#8217;Assembl&#233;e nationale de l&#8217;amendement n&#176; CL971 d&#233;pos&#233; par le gouvernement, l&#8217;article 471 du Code de proc&#233;dure p&#233;nale pr&#233;voit que le suivi de la personne condamn&#233;e &#224; un sursis probatoire peut &#234;tre assur&#233; par une personne morale habilit&#233;e &#171; d&#232;s lors qu&#8217;elle aurait d&#233;j&#224; travaill&#233; au titre du contr&#244;le judiciaire et pour permettre la continuit&#233; de la prise en charge du condamn&#233; &#187;.</p><p>Par voie de cons&#233;quence, il para&#238;t opportun, dans un souci de coh&#233;rence et de lisibilit&#233;, que l&#8217;article 132-41-1 du Code de proc&#233;dure p&#233;nale &#233;volue et fasse mention du fait que les personnes morales habilit&#233;es pourront &#234;tre charg&#233;es du suivi et des &#233;valuations pr&#233;vues dans le cadre de la mise &#224; ex&#233;cution de cette peine, m&#234;me si cette intervention se limite &#224; un cas sp&#233;cifique.</p><p>Si d&#8217;une fa&#231;on g&#233;n&#233;rale et tr&#232;s majoritaire, c&#8217;est le SPIP qui sera charg&#233; d&#8217;&#233;valuer et suivre les personnes condamn&#233;es &#224; un sursis probatoire, ce ne sera pas le cas d&#232;s lors que la personne morale habilit&#233;e charg&#233;e du contr&#244;le judiciaire se sera vue confier la mise &#224; ex&#233;cution de cette peine.</p><p>Cet amendement vise &#224; faire reconna&#238;tre cet &#233;tat de fait.</p><p>&#160;</p>"
  },
  "representations": [
    {
      "nom": "PDF",
      "typeMime": {
        "type": "application",
        "subType": "PDF"
      },
      "statutRepresentation": {
        "verbatim": true,
        "canonique": true,
        "officielle": true,
        "transcription": false,
        "enregistrement": false
      },
      "contenu": {
        "documentURI": "/15/amendements/1503/CION_LOIS/CL284.pdf"
      }
    }
  ],
  "sort": {
    "dateSaisie": "2018-12-19T21:34:21.000+01:00",
    "sortEnSeance": "Non soutenu"
  },
  "dateDepot": "2018-12-17T01:00:00.000+01:00",
  "dateDistribution": "2018-12-18T01:00:00.000+01:00",
  "article99": "0",
  "loiReference": {
    "codeLoi": "2 dc"
  }
}