{
  "uid": "AMANR5L15SEA717460B1255P2D1N2406",
  "identifiant": {
    "legislature": "15",
    "numero": "2406",
    "numRect": "0",
    "saisine": {
      "texteLegislatifRef": "PRJLANR5L15B1255",
      "numeroPartiePLF": "2",
      "organeExamen": "PO717460",
      "mentionSecondeDeliberation": "1"
    }
  },
  "numeroLong": "II-2406",
  "etapeTexte": "1ère lecture (1ère assemblée saisie)",
  "triAmendement": "fiaaaaaaaaaaaaaaaaaaaaaaaaaaaaaaaaaaaaaaaaaaaaaaaaaff",
  "cardinaliteAmdtMultiples": "1",
  "etat": "Discuté",
  "signataires": {
    "auteur": {
      "typeAuteur": "Depute",
      "acteurRef": "PA718736",
      "groupePolitiqueRef": "PO730964"
    },
    "cosignatairesRefs": [
      "PA720108",
      "PA719472",
      "PA721246",
      "PA702054",
      "PA722236",
      "PA718954",
      "PA721876",
      "PA606507",
      "PA2449",
      "PA720202",
      "PA720520",
      "PA719790",
      "PA721710",
      "PA722078",
      "PA720932",
      "PA605084",
      "PA720242",
      "PA719496",
      "PA607193",
      "PA720500",
      "PA718756",
      "PA721466",
      "PA718810",
      "PA720310",
      "PA720568",
      "PA720170",
      "PA719972",
      "PA719338",
      "PA719756",
      "PA722086",
      "PA609520",
      "PA719218",
      "PA719740",
      "PA721670",
      "PA720590",
      "PA721458",
      "PA719952",
      "PA719080",
      "PA643127",
      "PA721514",
      "PA719258",
      "PA720480",
      "PA720402",
      "PA719396",
      "PA718962",
      "PA718794",
      "PA719302",
      "PA719700",
      "PA720278",
      "PA721134",
      "PA721564",
      "PA606202",
      "PA719728",
      "PA719830",
      "PA721434",
      "PA721764",
      "PA720830",
      "PA643175",
      "PA721384",
      "PA722118",
      "PA721616",
      "PA719882",
      "PA331835",
      "PA721450",
      "PA721624",
      "PA719170",
      "PA720342",
      "PA719866",
      "PA722150",
      "PA643205",
      "PA672",
      "PA721004",
      "PA721690",
      "PA719072",
      "PA722126",
      "PA719440",
      "PA722170",
      "PA719100",
      "PA720124",
      "PA720154",
      "PA720790",
      "PA719842",
      "PA721522",
      "PA719242",
      "PA720814",
      "PA718902",
      "PA720878",
      "PA719230",
      "PA718944",
      "PA719202",
      "PA721908",
      "PA719624",
      "PA720046",
      "PA721750",
      "PA343493",
      "PA721166",
      "PA721218",
      "PA719520",
      "PA719512",
      "PA721860",
      "PA720138",
      "PA721036",
      "PA720952",
      "PA720560",
      "PA608641",
      "PA721328",
      "PA719550",
      "PA718728",
      "PA719960",
      "PA642788",
      "PA720870",
      "PA721142",
      "PA718894",
      "PA721880",
      "PA606675",
      "PA720298",
      "PA717379",
      "PA721344",
      "PA720146",
      "PA721644",
      "PA719052",
      "PA722252",
      "PA722398",
      "PA721656",
      "PA720622",
      "PA720908",
      "PA718930",
      "PA721718",
      "PA722000",
      "PA720066",
      "PA718682",
      "PA720268",
      "PA642724",
      "PA721498",
      "PA720378",
      "PA722038",
      "PA721776",
      "PA719798",
      "PA719060",
      "PA718990",
      "PA720214",
      "PA346876",
      "PA719310",
      "PA722054",
      "PA720552",
      "PA720576",
      "PA719600",
      "PA607595",
      "PA721584",
      "PA720054",
      "PA605963",
      "PA721568",
      "PA719330",
      "PA719108",
      "PA2828",
      "PA719420",
      "PA267673",
      "PA722260",
      "PA721426",
      "PA722070",
      "PA721946",
      "PA719186",
      "PA721824",
      "PA719032",
      "PA722268",
      "PA721372",
      "PA720454",
      "PA721262",
      "PA719922",
      "PA720362",
      "PA719692",
      "PA722094",
      "PA606639",
      "PA720538",
      "PA721398",
      "PA722366",
      "PA719858",
      "PA720492",
      "PA721888",
      "PA720862",
      "PA722336",
      "PA720780",
      "PA720022",
      "PA721150",
      "PA720944",
      "PA719404",
      "PA720754",
      "PA719910",
      "PA720014",
      "PA720038",
      "PA719412",
      "PA722008",
      "PA719006",
      "PA720354",
      "PA718674",
      "PA719822",
      "PA722228",
      "PA721542",
      "PA719684",
      "PA721352",
      "PA719718",
      "PA722382",
      "PA718876",
      "PA334116",
      "PA720074",
      "PA720738",
      "PA719616",
      "PA721792",
      "PA722358",
      "PA720190",
      "PA722292",
      "PA721024",
      "PA720116",
      "PA719778",
      "PA719372",
      "PA722178",
      "PA722244",
      "PA642695",
      "PA721174",
      "PA722046",
      "PA718694",
      "PA722190",
      "PA720222",
      "PA719448",
      "PA719850",
      "PA722134",
      "PA720318",
      "PA719350",
      "PA720854",
      "PA719748",
      "PA719570",
      "PA720916",
      "PA720370",
      "PA722344",
      "PA721852",
      "PA718918",
      "PA608083",
      "PA719528",
      "PA718768",
      "PA721916",
      "PA719464",
      "PA721364",
      "PA719592",
      "PA607155",
      "PA719890",
      "PA718910",
      "PA719994",
      "PA719092",
      "PA721808",
      "PA720414",
      "PA719480",
      "PA719980",
      "PA719814",
      "PA719154",
      "PA721784",
      "PA722062",
      "PA718744",
      "PA719326",
      "PA721844",
      "PA719668",
      "PA719770",
      "PA719130",
      "PA720198",
      "PA721296",
      "PA718710",
      "PA721726",
      "PA719194",
      "PA720512",
      "PA720806",
      "PA719652",
      "PA720030",
      "PA677483",
      "PA719632",
      "PA721336",
      "PA719024",
      "PA721158",
      "PA721956",
      "PA719540",
      "PA719118",
      "PA719456",
      "PA334768",
      "PA719364",
      "PA724827",
      "PA721702",
      "PA719250",
      "PA722102",
      "PA719162",
      "PA722320",
      "PA718736",
      "PA721278",
      "PA720438",
      "PA720394",
      "PA719388",
      "PA719294",
      "PA721600",
      "PA720960",
      "PA718706",
      "PA722312",
      "PA718802",
      "PA720446",
      "PA722022",
      "PA719710",
      "PA719660",
      "PA722300",
      "PA721800",
      "PA720900"
    ],
    "texteAffichable": "Mme&#160;Peyrol,  Mme&#160;de Montchalin, M.&#160;Cellier, M.&#160;Djebbari, M.&#160;Pichereau, M.&#160;Ahamada, M.&#160;Alauzet, Mme&#160;Cariou, Mme&#160;Cattelot, M.&#160;Cazeneuve, M.&#160;Chassaing, M.&#160;Damaisin, Mme&#160;Dominique&#160;David, M.&#160;Dirx, Mme&#160;Dupont, Mme&#160;Errante, M.&#160;Gaillard, Mme&#160;Goulet, M.&#160;Grau, Mme&#160;Gregoire, M.&#160;Guerini, Mme&#160;Hai, M.&#160;Holroyd, M.&#160;Jerretie, M.&#160;Jolivet, M.&#160;Labaronne, M.&#160;Lauzzana, M.&#160;Le Vigoureux, Mme&#160;Magne, Mme&#160;Motin, Mme&#160;Osson, M.&#160;Paluszkiewicz, M.&#160;Pellois, M.&#160;Person, Mme&#160;Val&#233;rie&#160;Petit, M.&#160;Roseren, M.&#160;Saint-Martin, M.&#160;Savatier, M.&#160;Serva, M.&#160;Simian, Mme&#160;Verdier-Jouclas, Mme&#160;Abadie, Mme&#160;Abba, M.&#160;Damien&#160;Adam, M.&#160;L&#233;na&#239;ck&#160;Adam, Mme&#160;Ali, Mme&#160;Amadou, M.&#160;Anato, M.&#160;Andr&#233;, M.&#160;Anglade, M.&#160;Ardouin, M.&#160;Arend, M.&#160;Attal, Mme&#160;Avia, M.&#160;Bachelier, Mme&#160;Bagarry, M.&#160;Baich&#232;re, M.&#160;Barbier, M.&#160;Batut, Mme&#160;Beaudouin-Hubiere, M.&#160;Belhaddad, M.&#160;Belhamiti, Mme&#160;Berg&#233;, M.&#160;Berville, M.&#160;Besson-Moreau, Mme&#160;Bessot Ballot, Mme&#160;Blanc, M.&#160;Blanchet, M.&#160;Blein, M.&#160;Bois, M.&#160;Bonnell, Mme&#160;Bono-Vandorme, M.&#160;Borowczyk, M.&#160;Bothorel, M.&#160;Boudi&#233;, Mme&#160;Bourguignon, M.&#160;Bouyx, Mme&#160;Pascale&#160;Boyer, Mme&#160;Braun-Pivet, M.&#160;Bridey, Mme&#160;Brocard, Mme&#160;Brugnera, Mme&#160;Brulebois, Mme&#160;Brunet, M.&#160;Buchou, Mme&#160;Bureau-Bonnard, M.&#160;Cabar&#233;, Mme&#160;Calvez, M.&#160;Causse, Mme&#160;Cazarian, Mme&#160;Cazebonne, M.&#160;Cazenove, M.&#160;Cesarini, Mme&#160;Chalas, M.&#160;Chalumeau, Mme&#160;Chapelier, Mme&#160;Charri&#232;re, Mme&#160;Charvier, M.&#160;Chiche, M.&#160;Claireaux, Mme&#160;Clapot, Mme&#160;Cloarec, M.&#160;Colas-Roy, Mme&#160;Colboc, M.&#160;Cormier-Bouligeon, Mme&#160;Couillard, Mme&#160;Crouzet, M.&#160;Da Silva, M.&#160;Daniel, Mme&#160;Yolaine&#160;de Courson, Mme&#160;de Lavergne, Mme&#160;De Temmerman, Mme&#160;Degois, M.&#160;Marc&#160;Delatte, M.&#160;Delpon, M.&#160;Descrozaille, M.&#160;Di Pompeo, Mme&#160;Do, M.&#160;Dombreval, Mme&#160;Jacqueline&#160;Dubois, Mme&#160;Dubos, Mme&#160;Dubost, Mme&#160;Dubr&#233;-Chirat, Mme&#160;Dufeu Schubert, Mme&#160;Fran&#231;oise&#160;Dumas, M.&#160;D&#233;moulin, M.&#160;Eliaou, M.&#160;Euzet, Mme&#160;Fabre, Mme&#160;Fajgeles, Mme&#160;Faure-Muntian, M.&#160;Fauvergue, M.&#160;Fi&#233;vet, M.&#160;Folliot, Mme&#160;Fontaine-Domeizel, Mme&#160;Fontenel-Personne, Mme&#160;Forteza, M.&#160;Freschi, M.&#160;Fugit, Mme&#160;Gaillot, M.&#160;Galbadon, M.&#160;Gassilloud, M.&#160;Gauvain, Mme&#160;Gayte, Mme&#160;Genetet, Mme&#160;Gipson, M.&#160;Girardin, Mme&#160;Givernet, Mme&#160;Gomez-Bassac, M.&#160;Gouffier-Cha, M.&#160;Gouttefarde, Mme&#160;Grandjean, Mme&#160;Granjus, Mme&#160;Guerel, Mme&#160;Gu&#233;venoux, M.&#160;G&#233;rard, Mme&#160;Hammerer, M.&#160;Haury, Mme&#160;Hennion, M.&#160;Henriet, M.&#160;Houbron, M.&#160;Houli&#233;, M.&#160;Hupp&#233;, Mme&#160;H&#233;rin, Mme&#160;Iborra, M.&#160;Jacques, Mme&#160;Janvier, Mme&#160;Josso, M.&#160;Julien-Laferriere, Mme&#160;Kamowski, M.&#160;Kasbarian, Mme&#160;Kerbarh, M.&#160;Kerlogot, M.&#160;Kervran, Mme&#160;Khattabi, Mme&#160;Khedher, M.&#160;Kokouendo, M.&#160;Krabal, Mme&#160;Krimi, Mme&#160;Kuric, M.&#160;Laabid, Mme&#160;Lakrafi, Mme&#160;Lang, Mme&#160;Lardet, M.&#160;Larsonneur, Mme&#160;Lazaar, M.&#160;Le Bohec, Mme&#160;Le Feur, M.&#160;Le Gac, Mme&#160;Le Meur, Mme&#160;Le Peih, Mme&#160;Lebec, M.&#160;Leclabart, Mme&#160;Lecocq, Mme&#160;Leguille-Balloy, M.&#160;Lejeune, Mme&#160;Lenne, M.&#160;Lescure, Mme&#160;Limon, M.&#160;Lioger, Mme&#160;Liso, Mme&#160;Louis, M.&#160;Maillard, Mme&#160;Maillart-M&#233;haignerie, M.&#160;Maire, Mme&#160;Jacqueline&#160;Maquet, M.&#160;Marilossian, Mme&#160;Marsaud, M.&#160;Martin, M.&#160;Mass&#233;glia, M.&#160;Matras, Mme&#160;Mauborgne, M.&#160;Mazars, M.&#160;Mbaye, Mme&#160;Melchior, M.&#160;Mendes, M.&#160;Mesnier, Mme&#160;Meynier-Millefert, Mme&#160;Michel, M.&#160;Michels, Mme&#160;Mirall&#232;s, M.&#160;Mis, M.&#160;Moreau, M.&#160;Morenas, Mme&#160;Moutchou, Mme&#160;Muschotti, Mme&#160;M&#246;rch, M.&#160;Nadot, M.&#160;Nogal, Mme&#160;O, Mme&#160;O&apos;Petit, Mme&#160;Oppelt, M.&#160;Orphelin, Mme&#160;Panonacle, M.&#160;Paris, Mme&#160;Park, M.&#160;Perea, M.&#160;Perrot, Mme&#160;Petel, Mme&#160;Peyron, M.&#160;Pietraszewski, Mme&#160;Piron, Mme&#160;Pitollat, Mme&#160;Pompili, M.&#160;Pont, M.&#160;Portarrieu, M.&#160;Potterie, M.&#160;Poulliat, Mme&#160;Pouzyreff, M.&#160;Questel, Mme&#160;Racon-Bouzon, M.&#160;Raphan, Mme&#160;Rauch, M.&#160;Rebeyrotte, M.&#160;Renson, Mme&#160;Rilhac, Mme&#160;Riotton, Mme&#160;Rist, Mme&#160;Rixain, Mme&#160;Robert, Mme&#160;Romeiro Dias, Mme&#160;Rossi, M.&#160;Rouillard, M.&#160;C&#233;dric&#160;Roussel, M.&#160;Rudigoz, M.&#160;Rupin, Mme&#160;Saint-Paul, Mme&#160;Sarles, M.&#160;Sempastous, M.&#160;Sol&#232;re, M.&#160;Sommer, M.&#160;Son-Forget, M.&#160;Sorre, M.&#160;Studer, Mme&#160;Sylla, M.&#160;Tach&#233;, Mme&#160;Tamarelle-Verhaeghe, M.&#160;Tan, Mme&#160;Tanguy, M.&#160;Taquet, M.&#160;Terlier, M.&#160;Test&#233;, Mme&#160;Thill, Mme&#160;Thillaye, M.&#160;Thi&#233;baut, Mme&#160;Thomas, Mme&#160;Thourot, Mme&#160;Tiegna, M.&#160;Touraine, M.&#160;Tourret, Mme&#160;Toutut-Picard, Mme&#160;Trisse, M.&#160;Trompille, Mme&#160;Tuffnell, Mme&#160;Valetta Ardisson, Mme&#160;Vanceunebrock-Mialon, Mme&#160;Vidal, M.&#160;Vignal, Mme&#160;Vignon, M.&#160;Villani, M.&#160;Vuilletet, M.&#160;V&#233;ran, Mme&#160;Wonner, Mme&#160;Zannier, M.&#160;Zulesi et M.&#160;Le Gendre"
  },
  "pointeurFragmentTexte": {
    "division": {
      "titre": "Article 57",
      "articleDesignationCourte": "ART. 57",
      "type": "ARTICLE",
      "avantAApres": "A",
      "divisionRattachee": "ARTICLE 57",
      "urlDivisionTexteVise": "/15/textes/1255C.asp#D_Article_57"
    }
  },
  "corps": {
    "dispositif": "<p>I.&#160;&#8211;&#160;Apr&#232;s l&#8217;alin&#233;a&#160;7, ins&#233;rer les quatre alin&#233;as suivants&#160;:</p><p>&#171;&#160;2&#176; <i>bis</i> Le premier alin&#233;a du <i>c</i> est compl&#233;t&#233; par les mots&#160;: &#171;&#160;et de la pose&#160;&#187;.</p><p>&#171;&#160;2 <i>ter</i> Au <i>d</i>&#160;:</p><p>&#171;&#160;<i>a)</i> Apr&#232;s les deux occurrences du mot&#160;: &#171;&#160;acquisition&#160;&#187; sont ins&#233;r&#233;s les mots&#160;: &#171;&#160;et de la pose&#160;&#187;&#160;;</p><p>&#171;&#160;<i>b)</i> Les deux occurrences des mots&#160;: &#171;&#160;pour leur seule part repr&#233;sentative du co&#251;t de ces m&#234;mes &#233;quipements&#160;&#187; sont supprim&#233;es.</p><p>II.&#160;&#8211;&#160;En cons&#233;quence, apr&#232;s l&#8217;alin&#233;a&#160;8, ins&#233;rer les deux alin&#233;as suivants&#160;:</p><p>&#171;&#160;4&#176; Il est compl&#233;t&#233; par un m ainsi r&#233;dig&#233;&#160;:</p><p>&#171;&#160;<i>m)</i> Aux d&#233;penses, pay&#233;es entre le 1<sup>er</sup> janvier 2019 et le 31 d&#233;cembre 2019, au titre de la d&#233;pose d&#8217;une cuve &#224; fioul.&#160;&#187;</p><p>III.&#160;&#8211;&#160;En cons&#233;quence, substituer &#224; l&#8217;alin&#233;a&#160;10 les quatre alin&#233;as suivants&#160;:</p><p>&#171;&#160;C. &#8211; Au 5&#160;:</p><p>&#171;&#160;1&#176; Au premier alin&#233;a, apr&#232;s le mot&#160;: &#171;&#160;appareils&#160;&#187; sont ins&#233;r&#233;s les mots&#160;: &#171;&#160;, co&#251;ts de main d&#8217;&#339;uvre&#160;&#187;&#160;;</p><p>&#171;&#160;2&#176; Le second alin&#233;a est compl&#233;t&#233; par les mots&#160;: &#171;&#160;, et pour les d&#233;penses mentionn&#233;es au <i>m</i> du 1, le cr&#233;dit d&#8217;imp&#244;t est &#233;gal &#224; 50&#160;%.&#160;&#187;</p><p>&#171;&#160;C <i>bis</i>. &#8211; Au 4&#176; du <i>b</i> du 6, apr&#232;s le mot&#160;: &#171;&#160;acquisition&#160;&#187; sont ins&#233;r&#233;s les mots&#160;: &#171;&#160;et de la pose&#160;&#187;&#160;&#187;</p><p>IV.&#160;&#8211;&#160;Compl&#233;ter cet article par l&#8217;alin&#233;a suivant&#160;:</p><p>&#171;&#160;III.&#160;&#8211;&#160;Le I n&#8217;est applicable qu&#8217;aux sommes venant en d&#233;duction de l&#8217;imp&#244;t d&#251;.&#160;&#187;</p><p>&#171;&#160;IV.&#160;&#8211;&#160;La perte de recettes pour l&#8217;&#201;tat est compens&#233;e &#224; due concurrence par la cr&#233;ation d&#8217;une taxe additionnelle aux droits mentionn&#233;s aux articles 575 et 575 A du code g&#233;n&#233;ral des imp&#244;ts.&#160;&#187;.</p>",
    "exposeSommaire": "<p style=\"text-align: justify;\">L&#8217;objectif du pr&#233;sent amendement est de faciliter et d&#8217;acc&#233;l&#233;rer la transition de modes de chauffage fossiles &#224; des modes de chauffage renouvelables en rendant &#233;ligible au CITE&#160;:</p><p style=\"text-align: justify;\">- Les co&#251;ts de d&#233;pose des cuves &#224; fioul, au taux de 50&#160;%&#160;;</p><p style=\"text-align: justify;\">- Les co&#251;ts de main d&#8217;&#339;uvre pour l&#8217;installation d&#8217;&#233;quipements de chauffage utilisant les &#233;nergies renouvelables, au taux de 30&#160;%.</p><p style=\"text-align: justify;\">Au 30&#160;juin 2016, parmi les r&#233;sidences principales, 2&#160;925&#160;000 logements en maisons individuelles (soit 18&#160;% des maisons individuelles) et 608&#160;000 logements collectifs (soit 5&#160;% des logements collectifs) sont chauff&#233;s au fioul[1]. En 2015, 154&#160;121&#160;000&#160;m&#178; de surfaces tertiaires sont chauff&#233;es au fioul soit 16&#160;% des surfaces tertiaires2, et 29&#160;TWh de fioul &#233;taient consomm&#233;s dans le tertiaire pour le chauffage, ce qui repr&#233;sente une facture de 2,4&#160;Mds&#8364; et une &#233;mission de 7,9&#160;MteqCO2/an.</p><p style=\"text-align: justify;\">L&#8217;objectif de neutralit&#233; carbone en 2050 inscrit dans le plan Climat n&#233;cessite une action vigoureuse pour le remplacement des chaudi&#232;res fossiles par des chauffages renouvelables. Cet amendement propose de rendre &#233;ligible au CITE les co&#251;ts de main d&#8217;&#339;uvre pour la d&#233;pose des cuves &#224; fioul et pour la pose d&#8217;&#233;quipements de chauffage et production d&#8217;eau chaude sanitaire fonctionnant aux &#233;nergies renouvelables.</p><p style=\"text-align: justify;\"><br /> <br />[1]Donn&#233;es du CEREN</p>"
  },
  "representations": [
    {
      "nom": "PDF",
      "typeMime": {
        "type": "application",
        "subType": "PDF"
      },
      "statutRepresentation": {
        "verbatim": true,
        "canonique": true,
        "officielle": true,
        "transcription": false,
        "enregistrement": false
      },
      "contenu": {
        "documentURI": "/15/amendements/1255C/AN/2406.pdf"
      }
    }
  ],
  "seanceDiscussion": "RUANR5L15S2019IDS21344",
  "sort": {
    "dateSaisie": "2018-11-16T12:42:22.000+01:00",
    "sortEnSeance": "Retiré"
  },
  "dateDepot": "2018-11-12T01:00:00.000+01:00",
  "dateDistribution": "2018-11-14T01:00:00.000+01:00",
  "article99": "0",
  "loiReference": {}
}