{
  "uid": "AMANR5L15PO59051B0099P0D1N33",
  "identifiant": {
    "legislature": "15",
    "numero": "33",
    "numRect": "0",
    "saisine": {
      "texteLegislatifRef": "PRJLANR5L15B0099",
      "numeroPartiePLF": "0",
      "organeExamen": "PO59051",
      "mentionSecondeDeliberation": "0"
    }
  },
  "numeroLong": "CL33",
  "etapeTexte": "1ère lecture (2ème assemblée saisie)",
  "triAmendement": "i",
  "cardinaliteAmdtMultiples": "1",
  "etat": "Discuté",
  "signataires": {
    "auteur": {
      "typeAuteur": "Depute",
      "acteurRef": "PA721960",
      "groupePolitiqueRef": "PO730958"
    },
    "cosignatairesRefs": [
      "PA720422",
      "PA721960",
      "PA720286",
      "PA720430",
      "PA720846",
      "PA721062",
      "PA720892",
      "PA718868",
      "PA588884",
      "PA722142",
      "PA721202",
      "PA719578",
      "PA721210",
      "PA721226",
      "PA2150",
      "PA718860",
      "PA719676"
    ],
    "texteAffichable": "Mme&#160;Obono,  Mme&#160;Autain, M.&#160;Bernalicis, M.&#160;Coquerel, M.&#160;Corbi&#232;re, Mme&#160;Fiat, M.&#160;Lachaud, M.&#160;Larive, M.&#160;M&#233;lenchon, Mme&#160;Panot, M.&#160;Prud&apos;homme, M.&#160;Quatennens, M.&#160;Ratenon, Mme&#160;Ressiguier, Mme&#160;Rubin, M.&#160;Ruffin et Mme&#160;Taurine"
  },
  "pointeurFragmentTexte": {
    "division": {
      "titre": "Article 3",
      "articleDesignationCourte": "ART. 3",
      "type": "ARTICLE",
      "avantAApres": "A",
      "divisionRattachee": "ARTICLE 3",
      "urlDivisionTexteVise": "/15/textes/0099.asp#D_Article_3"
    }
  },
  "corps": {
    "dispositif": "<p>Supprimer cet article.</p>",
    "exposeSommaire": "<p style=\"margin: 0cm 0cm 0pt; border: currentColor; text-align: justify;\">Cet amendement propose la suppression de cet article car il refuse de consacrer le principe qu&#8217;un &#233;lu puisse cumuler son indemnit&#233; d&#8217;&#233;lu avec d&#8217;autres revenus, et encore plus d&#8217;exercer une activit&#233; professionnelle en plus de leur mandat parlementaire, sauf celles li&#233;es aux oeuvres de l'esprit. Ce principe est d&#8217;autant plus &#233;vident quand il s&#8217;agit d&#8217;activit&#233;s de conseil / de lobbying (participations directes ou indirectes conf&#233;rant le contr&#244;le dans des soci&#233;t&#233;s dont l'activit&#233; consiste principalement dans la fourniture d'activit&#233;s de conseil), o&#249; le m&#233;lange des genres entre les fonctions de parlementaire et l&#8217;influence r&#233;mun&#233;r&#233;e est d&#8217;autant plus intol&#233;rable.</p><p style=\"margin: 0cm 0cm 0pt; border: currentColor; text-align: justify;\">&#160;</p><p style=\"margin: 0cm 0cm 0pt; border: currentColor; text-align: justify;\">Quand bien m&#234;me l&#8217;article initialement propos&#233; oblige la compl&#233;tion de la d&#233;claration d'int&#233;r&#234;ts et d'activit&#233;s que les parlementaires doivent remettre &#224; la Haute autorit&#233; pour la transparence de la vie publique, de ces participations dans des soci&#233;t&#233;s de conseil, nous consid&#233;rons qu&#8217;il en va de l&#8217;ind&#233;pendance intellectuelle et financi&#232;re de rester ferme sur ce principe de &#171;&#160;non cumul de r&#233;mun&#233;ration et d&#8217;activit&#233;&#160;&#187; avec un mandat parlementaire.</p><p style=\"margin: 0cm 0cm 0pt; border: currentColor;\">&#160;</p>"
  },
  "representations": [
    {
      "nom": "PDF",
      "typeMime": {
        "type": "application",
        "subType": "PDF"
      },
      "statutRepresentation": {
        "verbatim": true,
        "canonique": true,
        "officielle": true,
        "transcription": false,
        "enregistrement": false
      },
      "contenu": {
        "documentURI": "/15/amendements/0099/CION_LOIS/CL33.pdf"
      }
    }
  ],
  "sort": {
    "dateSaisie": "2017-07-20T00:47:04.000+02:00",
    "sortEnSeance": "Rejeté"
  },
  "dateDepot": "2017-07-17T02:00:00.000+02:00",
  "dateDistribution": "2017-07-19T02:00:00.000+02:00",
  "article99": "0",
  "loiReference": {}
}