{
  "uid": "AMANR5L15SEA717460BTC1767P0D1N1696",
  "identifiant": {
    "legislature": "15",
    "numero": "1696",
    "numRect": "0",
    "saisine": {
      "texteLegislatifRef": "PRJLANR5L15BTC1767",
      "numeroPartiePLF": "0",
      "organeExamen": "PO717460",
      "mentionSecondeDeliberation": "0"
    }
  },
  "numeroLong": "1696",
  "etapeTexte": "1ère lecture (1ère assemblée saisie)",
  "triAmendement": "adiaaaaaaaaaaaaaaaaaaaaaaaaaaaaaaaaaaaaaaaaaaaaaaabci",
  "cardinaliteAmdtMultiples": "1",
  "etat": "Discuté",
  "signataires": {
    "auteur": {
      "typeAuteur": "Depute",
      "acteurRef": "PA643134",
      "groupePolitiqueRef": "PO730934"
    },
    "cosignatairesRefs": [
      "PA346218",
      "PA334654",
      "PA267901",
      "PA718884",
      "PA605036",
      "PA608016",
      "PA266793",
      "PA643134",
      "PA340853",
      "PA719318",
      "PA767",
      "PA267527",
      "PA267378",
      "PA332523",
      "PA721070",
      "PA719272",
      "PA722390",
      "PA267204",
      "PA1874",
      "PA718838"
    ],
    "texteAffichable": "Mme&#160;Valentin,  M.&#160;Abad, Mme&#160;Anthoine, Mme&#160;Bazin-Malgras, Mme&#160;Levy, M.&#160;Sermier, M.&#160;Straumann, M.&#160;Bony, M.&#160;Saddier, Mme&#160;Corneloup, M.&#160;Leclerc, M.&#160;Kamardine, M.&#160;Brun, M.&#160;Le Fur, Mme&#160;Meunier, Mme&#160;Louwagie, Mme&#160;Ramassamy, Mme&#160;Dalloz, M.&#160;Cattin et M.&#160;Masson"
  },
  "pointeurFragmentTexte": {
    "division": {
      "titre": "Article 2",
      "articleDesignationCourte": "ART. 2",
      "type": "ARTICLE",
      "avantAApres": "A",
      "divisionRattachee": "ARTICLE 2",
      "urlDivisionTexteVise": "/15/textes/1767.asp#D_Article_2"
    },
    "alinea": {
      "numero": "27"
    }
  },
  "corps": {
    "dispositif": "<p style=\"text-align: justify;\">Apr&#232;s l&#8217;alin&#233;a&#160;27, ins&#233;rer l&#8217;alin&#233;a suivant&#160;:</p><p style=\"text-align: justify;\">&#171;&#160;Un rapport d&#8217;&#233;tude &#233;valuatif est transmis au Parlement au terme de la premi&#232;re ann&#233;e suivant la prise d&#8217;effet de ce dispositif&#160;&#187;.</p>",
    "exposeSommaire": "<p style=\"text-align: justify;\">Il semble fondamental que la repr&#233;sentation nationale ainsi que les &#233;tudiants, eux-m&#234;mes, puissent disposer d&#8217;un rapport &#233;valuatif pour mesurer pr&#233;cis&#233;ment les effets et impacts de cette r&#233;forme.</p><p style=\"text-align: justify;\">D&#232;s lors, cet amendement vise &#224; solliciter la publication d&#8217;un rapport &#233;valuatif suivant la premi&#232;re ann&#233;e de la r&#233;forme.</p>"
  },
  "representations": [
    {
      "nom": "PDF",
      "typeMime": {
        "type": "application",
        "subType": "PDF"
      },
      "statutRepresentation": {
        "verbatim": true,
        "canonique": true,
        "officielle": true,
        "transcription": false,
        "enregistrement": false
      },
      "contenu": {
        "documentURI": "/15/amendements/1767/AN/1696.pdf"
      }
    }
  ],
  "seanceDiscussion": "RUANR5L15S2019IDS21560",
  "sort": {
    "dateSaisie": "2019-03-19T21:51:18.000+01:00",
    "sortEnSeance": "Rejeté"
  },
  "dateDepot": "2019-03-15T01:00:00.000+01:00",
  "dateDistribution": "2019-03-18T01:00:00.000+01:00",
  "article99": "0",
  "loiReference": {}
}