{
  "uid": "AMANR5L15SEA717460B1255P1D1N2199",
  "identifiant": {
    "legislature": "15",
    "numero": "2199",
    "numRect": "0",
    "saisine": {
      "texteLegislatifRef": "PRJLANR5L15B1255",
      "numeroPartiePLF": "1",
      "organeExamen": "PO717460",
      "mentionSecondeDeliberation": "0"
    }
  },
  "numeroLong": "I-2199",
  "etapeTexte": "1ère lecture (1ère assemblée saisie)",
  "triAmendement": "dsaaaaaaaaaaaaaaaaaaaaaaaaaaaaaaaaaaaaaaaaaaaaaaaaabvy",
  "cardinaliteAmdtMultiples": "1",
  "etat": "Discuté",
  "signataires": {
    "auteur": {
      "typeAuteur": "Depute",
      "acteurRef": "PA721670",
      "groupePolitiqueRef": "PO730964"
    },
    "cosignatairesRefs": [
      "PA721670"
    ],
    "texteAffichable": "Mme&#160;de Montchalin"
  },
  "pointeurFragmentTexte": {
    "division": {
      "titre": "Article 16",
      "articleDesignationCourte": "APRÈS ART. 16",
      "type": "ARTICLE",
      "avantAApres": "Apres",
      "divisionRattachee": "APRÈS L'ARTICLE 16, insérer l'article suivant:",
      "articleAdditionnel": "1",
      "urlDivisionTexteVise": "/15/textes/1255A.asp#D_Article_16"
    }
  },
  "corps": {
    "dispositif": "<p style=\"text-align: justify;\">I.&#160;&#8211;&#160;Apr&#232;s l&#8217;article&#160;150&#8209;0 C du code g&#233;n&#233;ral des imp&#244;ts, il est ins&#233;r&#233; un article&#160;150&#8209;0 C&#160;<i>bis</i>&#160;ainsi r&#233;dig&#233;&#160;:</p><p style=\"text-align: justify;\">&#171;&#160;<i>Art.&#160;150&#8209;0 C&#160;</i>bis.&#160;&#8211;&#160;I.&#160;&#8211;&#160;1. L&#8217;imposition de la plus-value retir&#233;e de la cession de titres mentionn&#233;s au I de l&#8217;article&#160;150&#8209;0 A peut, si le produit de la cession est r&#233;investi avant le 31 d&#233;cembre de l&#8217;ann&#233;e qui suit celle de la cession, dans la souscription en num&#233;raire au capital de petites et moyennes entreprises et d&#8217;entreprises de taille interm&#233;diaire vis&#233;es au 2 de l&#8217;article L.&#160;221&#8209;32&#8209;2 du code mon&#233;taire et financier, &#234;tre report&#233;e au moment o&#249; s&#8217;op&#233;rera la transmission, le rachat ou l&#8217;annulation des titres re&#231;us en contrepartie de ce r&#233;investissement.</p><p style=\"text-align: justify;\">&#171;&#160;Le report est subordonn&#233; &#224; la condition que le contribuable en fasse la demande et d&#233;clare le montant de la plus-value dans la d&#233;claration pr&#233;vue &#224; l&#8217;article&#160;170 et dans le d&#233;lai applicable &#224; cette d&#233;claration.</p><p style=\"text-align: justify;\">&#171;&#160;2. Le report d&#8217;imposition est subordonn&#233; aux conditions suivantes&#160;:</p><p style=\"text-align: justify;\">&#171;&#160;<i>a)</i> Les droits sociaux &#233;mis en contrepartie de l&#8217;apport doivent &#234;tre int&#233;gralement lib&#233;r&#233;s lors de leur souscription&#160;;</p><p style=\"text-align: justify;\">&#171;&#160;<i>b)</i> Les droits sociaux repr&#233;sentatifs de l&#8217;apport en num&#233;raire doivent &#234;tre d&#233;tenus directement et en pleine propri&#233;t&#233; par le contribuable&#160;;</p><p style=\"text-align: justify;\">&#171;&#160;<i>c)</i> Les droits dans les b&#233;n&#233;fices sociaux de la soci&#233;t&#233; b&#233;n&#233;ficiaire de l&#8217;apport d&#233;tenus directement ou indirectement par l&#8217;apporteur ou son conjoint, leurs ascendants et leurs descendants ne doivent pas d&#233;passer ensemble 25&#160;% de ces b&#233;n&#233;fices &#224; un moment quelconque au cours des cinq ann&#233;es qui suivent la r&#233;alisation de l&#8217;apport&#160;;</p><p style=\"text-align: justify;\">&#171;&#160;<i>d)</i> Les personnes mentionn&#233;es au c ne doivent ni &#234;tre associ&#233;es de la soci&#233;t&#233; b&#233;n&#233;ficiaire de l&#8217;apport pr&#233;alablement &#224; l&#8217;op&#233;ration d&#8217;apport, ni y exercer les fonctions &#233;num&#233;r&#233;es au 1&#176; de l&#8217;article&#160;885 O <i>bis</i> depuis sa cr&#233;ation et pendant une p&#233;riode de cinq ans suivant la date de r&#233;alisation de l&#8217;apport.</p><p style=\"text-align: justify;\">&#171;&#160;<i>e)</i> L&#8217;apport de titres est r&#233;alis&#233; en France ou dans un &#201;tat membre de l&#8217;Union&#160;europ&#233;enne ou dans un &#201;tat ou territoire ayant conclu avec la France une convention fiscale contenant une clause d&#8217;assistance administrative en vue de lutter contre la fraude et l&#8217;&#233;vasion fiscales&#160;;</p><p style=\"text-align: justify;\">&#171;&#160;3. Le report d&#8217;imposition pr&#233;vu au pr&#233;sent article est exclusif de l&#8217;application des dispositions de l&#8217;article&#160;199 <i>terdecies</i>-0 A.</p><p style=\"text-align: justify;\">&#171;&#160;4. Le non-respect de l&#8217;une des conditions pr&#233;vues pour l&#8217;application du pr&#233;sent article entra&#238;ne, nonobstant toutes dispositions contraires, l&#8217;exigibilit&#233; imm&#233;diate de l&#8217;imp&#244;t sur la plus-value, sans pr&#233;judice de l&#8217;int&#233;r&#234;t de retard d&#233;compt&#233; de la date &#224; laquelle cet imp&#244;t aurait d&#251; &#234;tre acquitt&#233;.</p><p style=\"text-align: justify;\">&#171;&#160;II. Il est mis fin au report d&#8217;imposition &#224; l&#8217;occasion&#160;:</p><p style=\"text-align: justify;\">&#171;&#160;1&#176; De la cession &#224; titre on&#233;reux, du rachat, du remboursement ou de l&#8217;annulation des titres re&#231;us en r&#233;mun&#233;ration de l&#8217;apport&#160;;</p><p style=\"text-align: justify;\">&#171;&#160;2&#176; De la cession &#224; titre on&#233;reux, du rachat, du remboursement ou de l&#8217;annulation des titres apport&#233;s, si cet &#233;v&#233;nement intervient dans un d&#233;lai, d&#233;compt&#233; de date &#224; date, de cinq ans &#224; compter de l&#8217;apport des titres.</p><p style=\"text-align: justify;\">&#171;&#160;3&#176; De la cession &#224; titre on&#233;reux, du rachat, du remboursement ou de l&#8217;annulation des parts ou droits dans les soci&#233;t&#233;s ou groupements interpos&#233;s&#160;;</p><p style=\"text-align: justify;\">&#171;&#160;4&#176; Ou, si cet &#233;v&#233;nement est ant&#233;rieur, lorsque le contribuable transf&#232;re son domicile fiscal hors de France dans les conditions pr&#233;vues &#224; l&#8217;article&#160;167 <i>bis</i>.</p><p style=\"text-align: justify;\">&#171;&#160;La fin du report d&#8217;imposition entra&#238;ne l&#8217;imposition de la plus-value dans les conditions pr&#233;vues au 2 <i>ter</i> de l&#8217;article&#160;200 A, sans pr&#233;judice de l&#8217;int&#233;r&#234;t de retard pr&#233;vu &#224; l&#8217;article&#160;1727, d&#233;compt&#233; de la date de l&#8217;apport des titres, en cas de manquement &#224; l&#8217;une des conditions de r&#233;investissement mentionn&#233;es au 2&#176; du pr&#233;sent I.</p><p style=\"text-align: justify;\">II.&#160;&#8211;&#160;La perte de recettes pour l&#8217;&#201;tat est compens&#233;e &#224; due concurrence par la cr&#233;ation d&#8217;une taxe additionnelle aux droits mentionn&#233;s aux articles 575 et 575 A du code g&#233;n&#233;ral des imp&#244;ts.</p>",
    "exposeSommaire": "<p style=\"text-align: justify;\">Le pr&#233;sent amendement vise &#224; pr&#233;voir un nouveau m&#233;canisme de report d&#8217;imposition de l&#8217;ensemble des plus-values mobili&#232;res des particuliers soumis &#224; l&#8217;imp&#244;t sur le revenu en cas de cession d&#8217;un titre d&#233;tenu en direct, sous condition de r&#233;investissement dans le capital d&#8217;une PME ou d&#8217;une ETI (dont les crit&#232;res d&#8217;&#233;ligibilit&#233; sont fix&#233;s dans le dispositif du PEA-PME).</p><p style=\"text-align: justify;\">Compte tenu du m&#233;canisme de report, l&#8217;imposition de la plus-value ne sera op&#233;r&#233;e que lors de la cession des titres de PME ou d&#8217;ETI acquis dans le cadre du r&#233;investissement. Dans l&#8217;&#233;ventualit&#233; o&#249; le redevable enregistre une perte dans le cadre de son r&#233;investissement, il ne sera impos&#233; que sur la plus-value nette de l&#8217;ensemble de ses investissements.</p>"
  },
  "representations": [
    {
      "nom": "PDF",
      "typeMime": {
        "type": "application",
        "subType": "PDF"
      },
      "statutRepresentation": {
        "verbatim": true,
        "canonique": true,
        "officielle": true,
        "transcription": false,
        "enregistrement": false
      },
      "contenu": {
        "documentURI": "/15/amendements/1255A/AN/2199.pdf"
      }
    }
  ],
  "seanceDiscussion": "RUANR5L15S2019IDS21282",
  "sort": {
    "dateSaisie": "2018-10-19T17:46:32.000+02:00",
    "sortEnSeance": "Retiré"
  },
  "dateDepot": "2018-10-11T02:00:00.000+02:00",
  "dateDistribution": "2018-10-16T02:00:00.000+02:00",
  "article99": "0",
  "loiReference": {
    "codeLoi": "CGI",
    "divisionCodeLoi": "150-0 C"
  }
}