{
  "uid": "AMANR5L15PO419865B1831P0D1N1732",
  "identifiant": {
    "legislature": "15",
    "numero": "1732",
    "numRect": "0",
    "saisine": {
      "texteLegislatifRef": "PRJLANR5L15B1831",
      "numeroPartiePLF": "0",
      "organeExamen": "PO419865",
      "mentionSecondeDeliberation": "0"
    }
  },
  "numeroLong": "CD1732",
  "etapeTexte": "1ère lecture (2ème assemblée saisie)",
  "triAmendement": "idoaaaaaaaaaaaaaaaaaaaaaaaaaaaaaaaaaaaaaaaaaaaaaaazzzzzzzzzzzzzzzzzzzzzzzzzzzzzzzzzzzzzzzzzzzzzzzi",
  "cardinaliteAmdtMultiples": "1",
  "etat": "Discuté",
  "signataires": {
    "auteur": {
      "typeAuteur": "Depute",
      "acteurRef": "PA720764",
      "groupePolitiqueRef": "PO730970"
    },
    "cosignatairesRefs": [
      "PA719918",
      "PA720334",
      "PA720764"
    ],
    "texteAffichable": "Mme&#160;Lasserre-David,  M.&#160;Pahun et M.&#160;Lain&#233;"
  },
  "pointeurFragmentTexte": {
    "division": {
      "titre": "Article 1er A",
      "articleDesignationCourte": "ART. 1ER A",
      "type": "ARTICLE",
      "avantAApres": "A",
      "divisionRattachee": "ARTICLE 1ER A",
      "urlDivisionTexteVise": "/15/textes/1831.asp#D_Article_1er_A"
    },
    "alinea": {
      "numero": "11"
    }
  },
  "corps": {
    "dispositif": "<p style=\"text-align: justify;\">Compl&#233;ter l&#8217;alin&#233;a&#160;11 par les mots&#160;: </p><p style=\"text-align: justify;\">&#171;&#160;et l&#8217;acc&#233;l&#233;ration de la r&#233;alisation de r&#233;seaux cyclables continus et s&#251;rs&#160;&#224; toutes les &#233;chelles territoriales&#160;;&#160;&#187;.</p>",
    "exposeSommaire": "<p style=\"text-align: justify;\">La France accuse un retard important pour la pratique du v&#233;lo dans la mobilit&#233; du quotidien et se place au 25<sup>&#232;me</sup> rang des pays europ&#233;ens.&#160;</p><p style=\"text-align: justify;\">Notre pays s&#8217;est fix&#233; l&#8217;objectif ambitieux de tripler la part du v&#233;lo dans la mobilit&#233; d&#8217;ici 2024 et a adopt&#233; un Plan national pour y parvenir , pr&#233;sent&#233; par le Premier ministre le 14 septembre 2018.&#160;</p><p style=\"text-align: justify;\">La Loi d&#8217;orientation des mobilit&#233;s doit inscrire cette ambition dans une strat&#233;gie nationale et acter une programmation budg&#233;taire de nature &#224; acc&#233;l&#233;rer les transitions &#224; l&#8217;&#339;uvre dans les territoires et dans les comportements de mobilit&#233; de nos concitoyens.</p><p style=\"text-align: justify;\">Tel est l&#8217;objectif poursuivi par le pr&#233;sent amendement.</p>"
  },
  "representations": [
    {
      "nom": "PDF",
      "typeMime": {
        "type": "application",
        "subType": "PDF"
      },
      "statutRepresentation": {
        "verbatim": true,
        "canonique": true,
        "officielle": true,
        "transcription": false,
        "enregistrement": false
      },
      "contenu": {
        "documentURI": "/15/amendements/1831/CION-DVP/CD1732.pdf"
      }
    }
  ],
  "sort": {
    "dateSaisie": "2019-05-20T21:45:40.000+02:00",
    "sortEnSeance": "Non soutenu"
  },
  "dateDepot": "2019-05-09T02:00:00.000+02:00",
  "dateDistribution": "2019-05-20T02:00:00.000+02:00",
  "article99": "0",
  "loiReference": {}
}