{
  "uid": "AMANR5L15PO420120B1681P0D1N504",
  "identifiant": {
    "legislature": "15",
    "numero": "504",
    "numRect": "0",
    "saisine": {
      "texteLegislatifRef": "PRJLANR5L15B1681",
      "numeroPartiePLF": "0",
      "organeExamen": "PO420120",
      "mentionSecondeDeliberation": "0"
    }
  },
  "numeroLong": "AS504",
  "etapeTexte": "1ère lecture (1ère assemblée saisie)",
  "triAmendement": "ecaaaaaaaaaaaaaaaaaaaaaaaaaaaaaaaaaaaaaaaaaaaaaaaado",
  "cardinaliteAmdtMultiples": "1",
  "etat": "Discuté",
  "signataires": {
    "auteur": {
      "typeAuteur": "Depute",
      "acteurRef": "PA720402",
      "groupePolitiqueRef": "PO730964"
    },
    "cosignatairesRefs": [
      "PA720402"
    ],
    "texteAffichable": "M.&#160;Paluszkiewicz"
  },
  "pointeurFragmentTexte": {
    "division": {
      "titre": "Article 12",
      "articleDesignationCourte": "ART. 12",
      "type": "ARTICLE",
      "avantAApres": "A",
      "divisionRattachee": "ARTICLE 12",
      "urlDivisionTexteVise": "/15/textes/1681.asp#D_Article_12"
    },
    "alinea": {
      "avantAApres": "Apres",
      "numero": "7"
    }
  },
  "corps": {
    "dispositif": "<p style=\"text-align: justify;\">Apr&#232;s l&#8217;alin&#233;a&#160;7, ins&#233;rer l&#8217;alin&#233;a suivant&#160;:</p><p style=\"text-align: justify;\">&#171;&#160;L&#8217;espace num&#233;rique de sant&#233; est accessible par son titulaire &#224; travers ses identifiants France Connect.&#160;&#187;</p>",
    "exposeSommaire": "<p style=\"text-align: justify;\">Dans le cadre de la strat&#233;gie num&#233;rique de l&#8217;&#201;tat, ou &#171;&#160;&#201;tat-Plateforme&#160;&#187;, cet amendement vise &#224; enrichir l&#8217;identifiant num&#233;rique unique d&#8217;acc&#232;s aux Services Publics, la plateforme France Connect. Il doit permettre de renforcer notre strat&#233;gie num&#233;rique pour des syst&#232;mes d&#8217;information interop&#233;rables, dans le cadre de la cr&#233;ation d&#8217;une plateforme des donn&#233;es de sant&#233;.</p><p style=\"text-align: justify;\">La r&#233;forme de notre strat&#233;gie sanitaire doit ainsi &#234;tre corr&#233;l&#233;e la transition num&#233;rique &#224; l&#8217;&#339;uvre dans notre pays. &#160;</p>"
  },
  "representations": [
    {
      "nom": "PDF",
      "typeMime": {
        "type": "application",
        "subType": "PDF"
      },
      "statutRepresentation": {
        "verbatim": true,
        "canonique": true,
        "officielle": true,
        "transcription": false,
        "enregistrement": false
      },
      "contenu": {
        "documentURI": "/15/amendements/1681/CION-SOC/AS504.pdf"
      }
    }
  ],
  "sort": {
    "dateSaisie": "2019-03-14T09:56:56.000+01:00",
    "sortEnSeance": "Non soutenu"
  },
  "dateDepot": "2019-03-07T01:00:00.000+01:00",
  "dateDistribution": "2019-03-12T01:00:00.000+01:00",
  "article99": "0",
  "loiReference": {}
}