{
  "uid": "AMANR5L15SEA717460BTC0971P0D1N506",
  "identifiant": {
    "legislature": "15",
    "numero": "506",
    "numRect": "0",
    "saisine": {
      "texteLegislatifRef": "PRJLANR5L15BTC0971",
      "numeroPartiePLF": "0",
      "organeExamen": "PO717460",
      "mentionSecondeDeliberation": "0"
    }
  },
  "numeroLong": "506",
  "etapeTexte": "1ère lecture (1ère assemblée saisie)",
  "triAmendement": "dvol",
  "cardinaliteAmdtMultiples": "1",
  "etat": "Discuté",
  "signataires": {
    "auteur": {
      "typeAuteur": "Depute",
      "acteurRef": "PA721286",
      "groupePolitiqueRef": "PO730934"
    },
    "cosignatairesRefs": [
      "PA748954",
      "PA709315",
      "PA608416",
      "PA721506",
      "PA266808",
      "PA718884",
      "PA718850",
      "PA721054",
      "PA721636",
      "PA721678",
      "PA721286",
      "PA267527",
      "PA267378",
      "PA267429",
      "PA267735",
      "PA267318",
      "PA608016",
      "PA606712"
    ],
    "texteAffichable": "M.&#160;Ramadier,  M.&#160;Reda, M.&#160;Lurton, M.&#160;Saddier, M.&#160;Cordier, M.&#160;Viala, M.&#160;Rolland, Mme&#160;Bazin-Malgras, M.&#160;Savignat, M.&#160;Parigi, Mme&#160;Louwagie, M.&#160;Hetzel, M.&#160;de Ganay, M.&#160;Cinieri, M.&#160;Lorion, M.&#160;Grelier, Mme&#160;Levy et Mme&#160;Kuster"
  },
  "pointeurFragmentTexte": {
    "division": {
      "titre": "Article 28",
      "articleDesignationCourte": "ART. 28",
      "type": "ARTICLE",
      "avantAApres": "A",
      "divisionRattachee": "ARTICLE 28",
      "urlDivisionTexteVise": "/15/textes/0971.asp#D_Article_28"
    },
    "alinea": {
      "avantAApres": "Apres",
      "numero": "35"
    }
  },
  "corps": {
    "dispositif": "<p>Apr&#232;s l&#8217;alin&#233;a&#160;35, ins&#233;rer les dix alin&#233;as suivants&#160;:</p><p>&#171;&#160;6&#160;bis&#160;L&#8217;article L.&#160;421&#8209;8 est ainsi modifi&#233;&#160;:</p><p>&#171;&#160;a) Apr&#232;s le mot&#160;: &#171;&#160;d&#233;lib&#233;rant&#160;&#187;, la fin du&#160;1&#176; est ainsi r&#233;dig&#233;e&#160;:</p><p>&#171;&#160;ou parmi les &#233;lus des collectivit&#233;s territoriales ou des &#233;tablissements publics de coop&#233;ration intercommunale autres que celle ou celui de rattachement, sur les territoires desquels l&#8217;office d&#233;tient du patrimoine&#160;;</p><p>&#171;&#160;b) Le 2&#176; est ainsi r&#233;dig&#233;&#160;:</p><p>&#171;&#160;2&#176; De membres repr&#233;sentant la collectivit&#233; territoriale ou l&#8217;&#233;tablissement public de rattachement, qu&#8217;ils d&#233;signent parmi des personnalit&#233;s qualifi&#233;es en mati&#232;re d&#8217;urbanisme, de logement, d&#8217;environnement et de financement de ces politiques, ou en mati&#232;re d&#8217;action sociale et d&#8217;insertion&#160;;&#160;&#187;</p><p>&#171;&#160;c) Le&#160;3&#176; est abrog&#233; ;</p><p>&#171;&#160;e) Le 5&#176; est ainsi r&#233;dig&#233;&#160;:</p><p>&#171;&#160;5&#176; D&#8217;un repr&#233;sentant du comit&#233; social et &#233;conomique de l&#8217;office au sens des articles L.&#160;2312&#8209;72 &#224; L.&#160;2312&#8209;77 du code du travail, en la personne de son secr&#233;taire, qui dispose d&#8217;une voix consultative&#160;;</p><p>&#171;&#160;f) Apr&#232;s le&#160;5&#176;,&#160;il est ins&#233;r&#233; un&#160;6&#176; ainsi r&#233;dig&#233;&#160;:</p><p>&#171;&#160;6&#176; De deux membres du personnel de l&#8217;office ayant voix d&#233;lib&#233;rative d&#233;sign&#233;s par les deux organisations syndicales repr&#233;sentatives ayant obtenu le plus de suffrages au premier tour des &#233;lections professionnelles du comit&#233; social et &#233;conomique. &#192; d&#233;faut, d&#8217;organisation syndicale repr&#233;sentative dans l&#8217;office, ils seront d&#233;sign&#233;s par le comit&#233; social et &#233;conomique ou, &#224; d&#233;faut de comit&#233; social et &#233;conomique, par l&#8217;organisation d&#8217;une &#233;lection aupr&#232;s du personnel.&#160;&#187;</p>",
    "exposeSommaire": "<p>La pr&#233;sente proposition a pour objectifs :</p><p>- d&#8217;adapter la gouvernance des OPH aux besoins des territoires et de faciliter la restructuration du secteur,</p><p>- de renforcer la participation des collectivit&#233;s et EPCI autres que celle ou celui de rattachement dans les territoires desquels l&#8217;organisme dispose de patrimoine, cela afin de mieux les impliquer dans ses politiques patrimoniale et sociale,</p><p>- de renforcer la participation du personnel de l&#8217;organisme au sein de la gouvernance de l&#8217;OPH.</p>"
  },
  "representations": [
    {
      "nom": "PDF",
      "typeMime": {
        "type": "application",
        "subType": "PDF"
      },
      "statutRepresentation": {
        "verbatim": true,
        "canonique": true,
        "officielle": true,
        "transcription": false,
        "enregistrement": false
      },
      "contenu": {
        "documentURI": "/15/amendements/0971/AN/506.pdf"
      }
    }
  ],
  "seanceDiscussion": "RUANR5L15S2018IDS21114",
  "sort": {
    "dateSaisie": "2018-06-02T19:04:01.000+02:00",
    "sortEnSeance": "Rejeté"
  },
  "dateDepot": "2018-05-24T02:00:00.000+02:00",
  "dateDistribution": "2018-05-30T02:00:00.000+02:00",
  "article99": "0",
  "loiReference": {}
}