{
  "uid": "AMANR5L15SEA717460BTC1761P0D1N108",
  "identifiant": {
    "legislature": "15",
    "numero": "108",
    "numRect": "0",
    "saisine": {
      "texteLegislatifRef": "PRJLANR5L15BTC1761",
      "numeroPartiePLF": "0",
      "organeExamen": "PO717460",
      "mentionSecondeDeliberation": "0"
    }
  },
  "numeroLong": "108",
  "etapeTexte": "Nouvelle Lecture",
  "triAmendement": "abcaaaaaaaaaaaaaaaaaaaaaaaaaaaaaaaaaaaaaaaaaaaaaaakni",
  "cardinaliteAmdtMultiples": "1",
  "etat": "Discuté",
  "signataires": {
    "auteur": {
      "typeAuteur": "Depute",
      "acteurRef": "PA330909",
      "groupePolitiqueRef": "PO730934"
    },
    "cosignatairesRefs": [
      "PA1874",
      "PA606712",
      "PA718838",
      "PA330909",
      "PA267260",
      "PA266793",
      "PA267735",
      "PA332523"
    ],
    "texteAffichable": "M.&#160;Descoeur,  M.&#160;Lurton, M.&#160;Bony, M.&#160;Brun, M.&#160;Le Fur, Mme&#160;Poletti, M.&#160;de Ganay et Mme&#160;Dalloz"
  },
  "pointeurFragmentTexte": {
    "division": {
      "titre": "Article 4",
      "articleDesignationCourte": "ART. 4",
      "type": "ARTICLE",
      "avantAApres": "A",
      "divisionRattachee": "ARTICLE 4",
      "urlDivisionTexteVise": "/15/textes/1761.asp#D_Article_4"
    }
  },
  "corps": {
    "dispositif": "<p style=\"text-align: justify;\">Supprimer cet article.</p>",
    "exposeSommaire": "<p style=\"text-align: justify;\">Le stage pr&#233;alable &#224; l&#8217;installation (SPI) est actuellement une condition pr&#233;alable syst&#233;matique &#224; la cr&#233;ation d&#8217;une entreprise artisanale. Les micro-entrepreneurs sont &#233;galement assujettis &#224; cette formation depuis la loi du 18 juin 2014 relative &#224; l&#8217;artisanat, au commerce et aux tr&#232;s petites entreprises. L&#8217;article&#160;4 du projet de loi relatif &#224; la croissance et &#224; la transformation des entreprises revient sur ces dispositions en conf&#233;rant au SPI un caract&#232;re facultatif.</p><p style=\"text-align: justify;\">Or, cette formation permet de rappeler au cr&#233;ateur les notions fondamentales et minimales qui lui seront indispensables pour g&#233;rer son activit&#233;. Elle pr&#233;sente donc une r&#233;elle utilit&#233;, surtout pour les anciens ouvriers qui disposent de comp&#233;tences techniques solides mais n&#8217;ont pas forc&#233;ment les connaissances requises en mati&#232;re de gestion d&#8217;entreprise.</p><p style=\"text-align: justify;\">Une &#233;tude r&#233;alis&#233;e aupr&#232;s des chambres des m&#233;tiers et de l&#8217;artisanat a, d&#8217;ailleurs, d&#233;montr&#233; que les micro-entreprises et artisans ayant suivi le SPI avaient un taux de survie beaucoup plus important sur trois ans que les autres (respectivement 75&#160;% et 82&#160;% contre 30 et 75&#160;%). C&#8217;est tout particuli&#232;rement vrai pour les micro-entreprises, qui ont donc 2,5 fois plus de chances d&#8217;avoir une activit&#233; p&#233;renne. Supprimer le stage conduirait immanquablement &#224; fragiliser les nouvelles entreprises.</p><p style=\"text-align: justify;\">Par ailleurs, l&#8217;argument selon lequel le prix de ce stage d&#233;couragerait la cr&#233;ation d&#8217;entreprise n&#8217;est pas judicieux. Le SPI, qui a un co&#251;t de 192&#160;euros, est dans la majorit&#233; des cas enti&#232;rement pris en charge&#160;: soit par les organismes de formation ou le plan de formation de l&#8217;entreprise s&#8217;agissant des salari&#233;s, soit par P&#244;le emploi s&#8217;agissant des demandeurs d&#8217;emploi, ces derniers repr&#233;sentant la majorit&#233; des cr&#233;ateurs d&#8217;entreprise.</p><p style=\"text-align: justify;\">En outre, &#224; l&#8217;appui de l&#8217;article&#160;4, il est indiqu&#233; que le SPI ralentirait le cr&#233;ateur d&#8217;entreprise. Or les chambre des m&#233;tiers et de l&#8217;artisanat ont l&#8217;obligation de l&#8217;organiser dans le mois qui suit la demande, faute de quoi le cr&#233;ateur est dispens&#233;.&#160;</p><p style=\"text-align: justify;\">Enfin, ne pas rendre obligatoire le SPI constituerait un facteur de concurrence d&#233;loyale&#160;: en ma&#238;trisant mal leur rentabilit&#233;, les cr&#233;ateurs auront tendance &#224; pratiquer des prix trop bas, n&#233;fastes pour leur secteur.</p>"
  },
  "representations": [
    {
      "nom": "PDF",
      "typeMime": {
        "type": "application",
        "subType": "PDF"
      },
      "statutRepresentation": {
        "verbatim": true,
        "canonique": true,
        "officielle": true,
        "transcription": false,
        "enregistrement": false
      },
      "contenu": {
        "documentURI": "/15/amendements/1761/AN/108.pdf"
      }
    }
  ],
  "seanceDiscussion": "RUANR5L15S2019IDS21551",
  "sort": {
    "dateSaisie": "2019-03-15T09:48:25.000+01:00",
    "sortEnSeance": "Non soutenu"
  },
  "dateDepot": "2019-03-09T01:00:00.000+01:00",
  "dateDistribution": "2019-03-12T01:00:00.000+01:00",
  "article99": "0",
  "loiReference": {}
}