{
  "uid": "AMANR5L15PO59051B1106P0D1N306",
  "identifiant": {
    "legislature": "15",
    "numero": "306",
    "numRect": "0",
    "saisine": {
      "texteLegislatifRef": "PRJLANR5L15B1106",
      "numeroPartiePLF": "0",
      "organeExamen": "PO59051",
      "mentionSecondeDeliberation": "0"
    }
  },
  "numeroLong": "CL306",
  "etapeTexte": "Nouvelle Lecture",
  "triAmendement": "i",
  "cardinaliteAmdtMultiples": "1",
  "etat": "Discuté",
  "signataires": {
    "auteur": {
      "typeAuteur": "Depute",
      "acteurRef": "PA721564",
      "groupePolitiqueRef": "PO730964"
    },
    "cosignatairesRefs": [
      "PA721564"
    ],
    "texteAffichable": "Mme&#160;Fajgeles, rapporteure"
  },
  "pointeurFragmentTexte": {
    "division": {
      "titre": "TITRE Ier bis",
      "articleDesignationCourte": "AVANT ART. 9 TER",
      "type": "CHAPITRE",
      "avantAApres": "A",
      "divisionRattachee": "AVANT  L'ARTICLE 9 TER",
      "urlDivisionTexteVise": "/15/textes/1106.asp#D_TITRE_Ier_bis_29"
    }
  },
  "corps": {
    "dispositif": "<p style=\"text-align: justify;\">R&#233;diger ainsi l&#8217;intitul&#233; du titre I<sup>er</sup>&#160;<i>bis</i>&#160;:</p><p style=\"text-align: justify;\"><i>&#171;</i>&#160;Adapter l&#8217;application du droit du sol pour l&#8217;acc&#232;s &#224; la nationalit&#233; fran&#231;aise &#224; Mayotte&#160;&#187;</p>",
    "exposeSommaire": "<p style=\"text-align: justify;\">Tel que r&#233;dig&#233; par le S&#233;nat, l'intitul&#233; du titre I<sup>er</sup> <i>bis</i> est inutilement long et donne une id&#233;e inexacte de la port&#233;e de la r&#233;forme poursuivie par les articles qu&#8217;il contient&#160;: il ne s&#8217;agit pas, en effet, de modifier les r&#232;gles de nationalit&#233; d&#8217;une mani&#232;re g&#233;n&#233;rale mais simplement d&#8217;apporter des adaptations aux modalit&#233;s d&#8217;application du droit du sol, dans le respect de l'article 73 de la Constitution et des latitudes de man&#339;uvre qu'il autorise.</p><p>Le pr&#233;sent amendement propose donc une r&#233;daction &#224; la fois plus simple et plus exacte.</p>"
  },
  "representations": [
    {
      "nom": "PDF",
      "typeMime": {
        "type": "application",
        "subType": "PDF"
      },
      "statutRepresentation": {
        "verbatim": true,
        "canonique": true,
        "officielle": true,
        "transcription": false,
        "enregistrement": false
      },
      "contenu": {
        "documentURI": "/15/amendements/1106/CION_LOIS/CL306.pdf"
      }
    }
  ],
  "sort": {
    "dateSaisie": "2018-07-11T11:36:42.000+02:00",
    "sortEnSeance": "Adopté"
  },
  "dateDepot": "2018-07-10T02:00:00.000+02:00",
  "dateDistribution": "2018-07-10T02:00:00.000+02:00",
  "article99": "0",
  "loiReference": {}
}