{
  "uid": "AMANR5L15SEA717460BTC0417P0D1N50",
  "identifiant": {
    "legislature": "15",
    "numero": "50",
    "numRect": "0",
    "saisine": {
      "texteLegislatifRef": "PRJLANR5L15BTC0417",
      "numeroPartiePLF": "0",
      "organeExamen": "PO717460",
      "mentionSecondeDeliberation": "0"
    }
  },
  "numeroLong": "50",
  "etapeTexte": "Nouvelle Lecture",
  "triAmendement": "i",
  "cardinaliteAmdtMultiples": "1",
  "etat": "Discuté",
  "signataires": {
    "auteur": {
      "typeAuteur": "Depute",
      "acteurRef": "PA335999",
      "groupePolitiqueRef": "PO730946"
    },
    "cosignatairesRefs": [
      "PA333285",
      "PA333818",
      "PA719930",
      "PA605069",
      "PA337483",
      "PA643145",
      "PA340343",
      "PA335532",
      "PA610681",
      "PA720988",
      "PA608172",
      "PA608011",
      "PA608695",
      "PA1008",
      "PA405480",
      "PA1198",
      "PA332614",
      "PA508",
      "PA642764",
      "PA335999",
      "PA609590",
      "PA342415",
      "PA588886",
      "PA1809",
      "PA429893",
      "PA609332",
      "PA335054",
      "PA607553",
      "PA267233"
    ],
    "texteAffichable": "Mme&#160;Batho,  Mme&#160;Bareigts, M.&#160;Aviragnet, Mme&#160;Battistel, Mme&#160;Bi&#233;mouret, M.&#160;Bouillon, M.&#160;Jean-Louis&#160;Bricout, M.&#160;Carvounas, M.&#160;Alain&#160;David, Mme&#160;Laurence&#160;Dumont, M.&#160;Faure, M.&#160;Garot, M.&#160;Hutin, M.&#160;Juanico, Mme&#160;Karamanli, M.&#160;J&#233;r&#244;me&#160;Lambert, M.&#160;Le Foll, M.&#160;Letchimy, Mme&#160;Manin, Mme&#160;Pau-Langevin, Mme&#160;Pires Beaune, M.&#160;Potier, M.&#160;Pueyo, M.&#160;Pupponi, Mme&#160;Rabault, M.&#160;Saulignac, Mme&#160;Untermaier, Mme&#160;Vainqueur-Christophe et M.&#160;Vallaud"
  },
  "pointeurFragmentTexte": {
    "division": {
      "titre": "Article 3 bis",
      "articleDesignationCourte": "ART. 3 BIS",
      "type": "ARTICLE",
      "avantAApres": "A",
      "divisionRattachee": "ARTICLE 3 BIS",
      "urlDivisionTexteVise": "/15/textes/0417.asp#D_Article_3_bis"
    },
    "alinea": {
      "numero": "2"
    }
  },
  "corps": {
    "dispositif": "<p style=\"text-align: justify;\">&#192; la premi&#232;re phrase de l'alin&#233;a 2, apr&#232;s le mot&#160;: </p><p style=\"text-align: justify;\">&#171;&#160;anticiper&#160;&#187;, </p><p style=\"text-align: justify;\">ins&#233;rer les mots&#160;: </p><p style=\"text-align: justify;\">&#171;&#160;et accompagner&#160;&#187;.</p>",
    "exposeSommaire": "<p style=\"text-align: justify;\">Amendement de clarification. Le rapport demand&#233; au gouvernement ne doit pas porter seulement sur les mesures d&#8217;anticipation des mutations, mais aussi sur leur accompagnement.</p>"
  },
  "representations": [
    {
      "nom": "PDF",
      "typeMime": {
        "type": "application",
        "subType": "PDF"
      },
      "statutRepresentation": {
        "verbatim": true,
        "canonique": true,
        "officielle": true,
        "transcription": false,
        "enregistrement": false
      },
      "contenu": {
        "documentURI": "/15/amendements/0417/AN/50.pdf"
      }
    }
  ],
  "seanceDiscussion": "RUANR5L15S2018IDS20843",
  "sort": {
    "dateSaisie": "2017-12-01T13:10:56.000+01:00",
    "sortEnSeance": "Adopté"
  },
  "dateDepot": "2017-11-25T01:00:00.000+01:00",
  "dateDistribution": "2017-11-28T01:00:00.000+01:00",
  "article99": "0",
  "loiReference": {}
}