{
  "uid": "AMANR5L15SEA717460BTC1974P0D1N1410",
  "identifiant": {
    "legislature": "15",
    "numero": "1410",
    "numRect": "0",
    "saisine": {
      "texteLegislatifRef": "PRJLANR5L15BTC1974",
      "numeroPartiePLF": "0",
      "organeExamen": "PO717460",
      "mentionSecondeDeliberation": "0"
    }
  },
  "numeroLong": "1410",
  "etapeTexte": "1ère lecture (2ème assemblée saisie)",
  "triAmendement": "ckiaaaaaaaaaaaaaaaaaaaaaaaaaaaaaaaaaaaaaaaaaaaaaaae",
  "cardinaliteAmdtMultiples": "1",
  "etat": "Discuté",
  "signataires": {
    "auteur": {
      "typeAuteur": "Depute",
      "acteurRef": "PA720278",
      "groupePolitiqueRef": "PO723569"
    },
    "cosignatairesRefs": [
      "PA267336",
      "PA720878",
      "PA721262",
      "PA719138",
      "PA719570",
      "PA721336",
      "PA719294",
      "PA267042",
      "PA721352",
      "PA719942",
      "PA721024",
      "PA721656",
      "PA719952",
      "PA718930",
      "PA719592",
      "PA721776",
      "PA719286",
      "PA719456",
      "PA335054",
      "PA719882",
      "PA719412",
      "PA719994",
      "PA607553",
      "PA722000",
      "PA720202",
      "PA719806",
      "PA606202",
      "PA702052",
      "PA722126",
      "PA340343",
      "PA718744",
      "PA720230",
      "PA721110",
      "PA333421",
      "PA767",
      "PA721384",
      "PA606507",
      "PA720512",
      "PA719338",
      "PA722062",
      "PA720976",
      "PA722178",
      "PA720214",
      "PA266774",
      "PA722022",
      "PA267241",
      "PA642935",
      "PA643175",
      "PA718794",
      "PA719814",
      "PA718710",
      "PA722336",
      "PA609520",
      "PA720242",
      "PA718728",
      "PA336439",
      "PA721718",
      "PA607155",
      "PA724827",
      "PA719448",
      "PA720378",
      "PA608292",
      "PA720870",
      "PA719874",
      "PA720892",
      "PA720900",
      "PA722118",
      "PA333818",
      "PA717379",
      "PA722030",
      "PA720054",
      "PA720830",
      "PA722170",
      "PA722054",
      "PA719052",
      "PA608695",
      "PA718894",
      "PA334768",
      "PA331582",
      "PA942",
      "PA721860",
      "PA721946",
      "PA606712",
      "PA335999",
      "PA722134",
      "PA720568",
      "PA720500",
      "PA719624",
      "PA719684",
      "PA718706",
      "PA607193",
      "PA719330",
      "PA719798",
      "PA695100",
      "PA721824",
      "PA719540",
      "PA702054",
      "PA719146",
      "PA719718",
      "PA720996",
      "PA605694",
      "PA719512",
      "PA405480",
      "PA720754",
      "PA721976",
      "PA719396",
      "PA642868",
      "PA719230",
      "PA719550",
      "PA722260",
      "PA720538",
      "PA719092",
      "PA607619",
      "PA722344",
      "PA722194",
      "PA719464",
      "PA720334",
      "PA718910",
      "PA719388",
      "PA720924",
      "PA720552",
      "PA718720",
      "PA721458",
      "PA267780",
      "PA721246",
      "PA719520",
      "PA718990",
      "PA719420",
      "PA719130",
      "PA607595",
      "PA720022",
      "PA719972",
      "PA721844",
      "PA719632",
      "PA721808",
      "PA721372",
      "PA720696",
      "PA721498",
      "PA722268",
      "PA605036",
      "PA643127",
      "PA642764",
      "PA720806",
      "PA721600",
      "PA722102",
      "PA605518",
      "PA267260",
      "PA333285",
      "PA722110",
      "PA2449",
      "PA719100",
      "PA720780",
      "PA719910",
      "PA722078",
      "PA721328",
      "PA721924",
      "PA721296",
      "PA719266",
      "PA720046",
      "PA721726",
      "PA719194",
      "PA721450",
      "PA719822",
      "PA1008",
      "PA721932",
      "PA721434",
      "PA755549",
      "PA332614",
      "PA718810",
      "PA721836",
      "PA721426",
      "PA267355",
      "PA719558",
      "PA1630",
      "PA719668",
      "PA720862",
      "PA721194",
      "PA719578",
      "PA721568",
      "PA722252",
      "PA336175",
      "PA720108",
      "PA720278"
    ],
    "texteAffichable": "M.&#160;Orphelin,  M.&#160;Gouffier-Cha, Mme&#160;Dubi&#233;, Mme&#160;Pompili, M.&#160;Pichereau, M.&#160;Person, M.&#160;Abad, Mme&#160;Abba, M.&#160;Acquaviva, Mme&#160;Ali, M.&#160;Ardouin, Mme&#160;Auconie, M.&#160;Aviragnet, M.&#160;Baich&#232;re, Mme&#160;Bagarry, M.&#160;Balanant, M.&#160;Barrot, M.&#160;Baudu, Mme&#160;Beaudouin-Hubiere, M.&#160;Becht, M.&#160;Belhamiti, Mme&#160;Blanc, M.&#160;Boudi&#233;, M.&#160;Bournazel, Mme&#160;Pascale&#160;Boyer, M.&#160;Brial, Mme&#160;Brocard, Mme&#160;Brugnera, M.&#160;Buchou, M.&#160;Castellani, M.&#160;Cattin, Mme&#160;Cazarian, M.&#160;Cesarini, Mme&#160;Chapelier, M.&#160;Chiche, M.&#160;Christophe, M.&#160;Claireaux, Mme&#160;Clapot, M.&#160;Cl&#233;ment, Mme&#160;Colboc, M.&#160;Colombani, Mme&#160;Couillard, Mme&#160;Yolaine&#160;de Courson, Mme&#160;Crouzet, M.&#160;Cubertafon, M.&#160;Daniel, M.&#160;Alain&#160;David, M.&#160;Charles&#160;de Courson, M.&#160;Demilly, Mme&#160;Descamps, M.&#160;Descrozaille, Mme&#160;Do, M.&#160;Dombreval, Mme&#160;Dubost, Mme&#160;Dufeu Schubert, M.&#160;Dufr&#232;gne, Mme&#160;Fran&#231;oise&#160;Dumas, Mme&#160;Fr&#233;d&#233;rique&#160;Dumas, Mme&#160;Dupont, M.&#160;El Guerrab, Mme&#160;Elimas, Mme&#160;Errante, Mme&#160;Fabre, M.&#160;Falorni, M.&#160;Favennec Becot, M.&#160;Fi&#233;vet, Mme&#160;Firmin Le Bodo, Mme&#160;Fontaine-Domeizel, Mme&#160;Fontenel-Personne, M.&#160;Furst, Mme&#160;Gaillot, M.&#160;Garot, Mme&#160;Gayte, Mme&#160;Genetet, M.&#160;Giraud, M.&#160;Gouttefarde, Mme&#160;Granjus, M.&#160;Guerini, M.&#160;Meyer&#160;Habib, Mme&#160;Hai, M.&#160;Haury, M.&#160;Herbillon, Mme&#160;H&#233;rin, M.&#160;Herth, M.&#160;Hutin, Mme&#160;Jacquier-Laforge, M.&#160;Juanico, M.&#160;Julien-Laferri&#232;re, Mme&#160;Kamowski, Mme&#160;Karamanli, M.&#160;Kerlogot, M.&#160;Kervran, Mme&#160;Krimi, Mme&#160;Kuric, M.&#160;Labaronne, M.&#160;Fran&#231;ois-Michel&#160;Lambert, Mme&#160;Lardet, M.&#160;Larsonneur, M.&#160;Lauzzana, Mme&#160;Le Feur, Mme&#160;Le Meur, Mme&#160;Lenne, M.&#160;Lioger, Mme&#160;Lorho, M.&#160;Lurton, Mme&#160;Magnier, M.&#160;Maillard, Mme&#160;Maillart-M&#233;haignerie, M.&#160;Maire, M.&#160;Marilossian, M.&#160;Mathiasin, Mme&#160;Mauborgne, M.&#160;Mbaye, Mme&#160;Melchior, Mme&#160;Meynier-Millefert, Mme&#160;Michel, M.&#160;Millienne, Mme&#160;Mirall&#232;s, M.&#160;Mis, M.&#160;Molac, Mme&#160;M&#246;rch, Mme&#160;Muschotti, M.&#160;Nadot, M.&#160;Nogal, Mme&#160;Oppelt, M.&#160;Pahun, M.&#160;Pancher, Mme&#160;Panonacle, Mme&#160;Panot, M.&#160;Pellois, Mme&#160;Petel, Mme&#160;Val&#233;rie&#160;Petit, M.&#160;Pietraszewski, Mme&#160;Pinel, Mme&#160;Piron, Mme&#160;Pitollat, Mme&#160;Poletti, M.&#160;Pont, M.&#160;Potier, Mme&#160;Provendier, M.&#160;Prud&apos;homme, M.&#160;Pupponi, M.&#160;Questel, Mme&#160;Rauch, M.&#160;Renson, Mme&#160;Rilhac, Mme&#160;Rixain, Mme&#160;Riotton, Mme&#160;Robert, Mme&#160;Romeiro Dias, M.&#160;Roseren, Mme&#160;Rossi, Mme&#160;Sage, M.&#160;Saint-Martin, Mme&#160;Sarles, M.&#160;Saulignac, M.&#160;Savatier, M.&#160;Sempastous, M.&#160;Simian, M.&#160;Sommer, M.&#160;Studer, Mme&#160;Sylla, Mme&#160;Tanguy, Mme&#160;De Temmerman, M.&#160;Thi&#233;baut, Mme&#160;Thillaye, Mme&#160;Thill, Mme&#160;Thomas, M.&#160;Touraine, Mme&#160;Toutut-Picard, Mme&#160;Tuffnell, Mme&#160;Untermaier, Mme&#160;Vanceunebrock-Mialon, Mme&#160;de Vaucouleurs, M.&#160;Philippe&#160;Vigier, Mme&#160;Vidal, Mme&#160;Vignon, M.&#160;Villani, M.&#160;Vuilletet, Mme&#160;Wonner, Mme&#160;Sanquer, M.&#160;Wulfranc et Mme&#160;Batho"
  },
  "pointeurFragmentTexte": {
    "division": {
      "titre": "Article 22 bis AA",
      "articleDesignationCourte": "APRÈS ART. 22 BIS AA",
      "type": "ARTICLE",
      "avantAApres": "Apres",
      "divisionRattachee": "APRÈS L'ARTICLE 22 BIS AA, insérer l'article suivant:",
      "articleAdditionnel": "1",
      "urlDivisionTexteVise": "/15/textes/1974.asp#D_Article_22_bis_AA"
    }
  },
  "corps": {
    "dispositif": "<p style=\"text-align: justify;\">Apr&#232;s l&#8217;article L.&#160;2213&#8209;5 du code g&#233;n&#233;ral des collectivit&#233;s territoriales, il est ins&#233;r&#233; un article L.&#160;2213&#8209;5&#8209;1 ainsi r&#233;dig&#233;&#160;:</p><p style=\"text-align: justify;\">&#171;&#160;<i>Art.&#160;L.&#160;2213&#8209;5&#8209;1.</i>&#160;&#8211;&#160;Le maire peut, par arr&#234;t&#233; motiv&#233;, interdire &#224; certaines heures l&#8217;acc&#232;s de tout ou partie des voies de l&#8217;agglom&#233;ration ouvertes &#224; la circulation publique aux v&#233;hicules dont le poids total autoris&#233; en charge exc&#232;de 3,5 tonnes et qui ne sont pas &#233;quip&#233;s de syste&#768;mes avance&#769;s capables de de&#769;tecter les usagers vulne&#769;rables de la route se trouvant a&#768; proximite&#769; imme&#769;diate de l&#8217;avant ou du co&#770;te&#769; droit du ve&#769;hicule en vue d&#8217;avertir le conducteur de leur pre&#769;sence et de le mettre en mesure d&#8217;e&#769;viter une collision.</p><p style=\"text-align: justify;\">&#171;&#160;Les v&#233;hicules dont le poids total autoris&#233; en charge exc&#232;de 3,5 tonnes font l&#8217;objet d&#8217;une identification attestant de la pr&#233;sence &#224; leur bord des syst&#232;mes mentionn&#233;s &#224; l&#8217;alin&#233;a pr&#233;c&#233;dent.</p><p style=\"text-align: justify;\">&#171;&#160;Les modalit&#233;s d&#8217;application du pr&#233;sent article sont d&#233;termin&#233;es par d&#233;cret en Conseil d&#8217;&#201;tat.&#160;&#187;</p>",
    "exposeSommaire": "<p style=\"text-align: justify;\">Cet amendement vise &#224; donner la possibilit&#233; au maire de restreindre la circulation des poids-lourds d&#233;pourvus de dispositif de d&#233;tection des usagers vuln&#233;rables.</p><p style=\"text-align: justify;\">A Paris, un accident mortel de cycliste sur deux concerne une collision avec un poids-lourd.</p><p style=\"text-align: justify;\">De nombreux accidents graves impliquant un poids-lourd et un usager de la route plus vuln&#233;rable, souvent un cycliste ou un autre utilisateur de deux roues, sont dus aux angles morts importants que comportent la plupart des poids-lourds. Le conducteur n&#8217;a g&#233;n&#233;ralement pas de visibilit&#233; sur plusieurs zones situ&#233;es &#224; l&#8217;avant (sur 1 &#224; 2 m&#232;tres), sur les c&#244;t&#233;s et &#224; l&#8217;arri&#232;re du v&#233;hicule.</p><p style=\"text-align: justify;\">A Paris, un accident mortel de cycliste sur deux concerne une collision avec un poids-lourd.</p><p style=\"text-align: justify;\">Il existe des dispositifs techniques permettant d&#8217;alerter le conducteur d&#8217;un poids-lourd de la pr&#233;sence d&#8217;un usager vuln&#233;rable dans l&#8217;un des angles morts du v&#233;hicule. Ces dispositifs, dont certaines marques &#233;quipent d&#233;j&#224; leurs v&#233;hicules, pr&#233;viennent le conducteur &#224; l&#8217;aide de signaux sonores et lumineux &#224; l&#8217;int&#233;rieur de la cabine, &#224; temps pour lui permettre d&#8217;&#233;viter une collision.</p><p style=\"text-align: justify;\">Des discussions sont en cours au sein de l&#8217;Union europ&#233;enne pour rendre ces dispositifs obligatoires d&#8217;ici deux ans. L&#8217;obligation ne concernera cependant que les v&#233;hicules neufs. Le dispositif ne se r&#233;pandra donc largement qu&#8217;&#224; moyen terme, au fur et &#224; mesure du renouvellement de la flotte.</p><p style=\"text-align: justify;\">Or il est possible techniquement d&#8217;&#233;quiper les poids-lourds existants d&#8217;un tel dispositif de d&#233;tection, pour un co&#251;t d&#8217;environ 1 500&#160;euros.</p><p style=\"text-align: justify;\">A titre d&#8217;exemple, la ville de Londres instaure actuellement un classement des poids-lourds visant &#224; interdire &#224; partir d&#8217;octobre 2020 l&#8217;entr&#233;e du Grand Londres pour les poids-lourds dont la visibilit&#233; depuis la cabine est mauvaise et qui ne disposent pas de dispositif d&#8217;alerte permettant de d&#233;tecter les usagers vuln&#233;rables situ&#233;s &#224; proximit&#233; du poids-lourd.&#160;</p><p style=\"text-align: justify;\">Afin de r&#233;duire au plus t&#244;t les risques tr&#232;s importants encourus en cas de cohabitation sur la voirie routi&#232;re entre les poids-lourds et les usagers de deux roues, en particulier les cyclistes, cet amendement vise &#224; donner la possibilit&#233; aux maires qui le souhaitent de restreindre la circulation des poids-lourds non &#233;quip&#233;s de ce dispositif.</p><p style=\"text-align: justify;\">Cette disposition permettra d&#8217;acc&#233;l&#233;rer l&#8217;&#233;quipement de la flotte de poids-lourds avec ce dispositif vertueux, par un m&#233;canisme laissant aux maires le soin de d&#233;terminer ce qui est le plus adapt&#233; &#224; leur territoire, sur le mod&#232;le de la mise en place des zones &#224; faibles &#233;missions.</p>"
  },
  "representations": [
    {
      "nom": "PDF",
      "typeMime": {
        "type": "application",
        "subType": "PDF"
      },
      "statutRepresentation": {
        "verbatim": true,
        "canonique": true,
        "officielle": true,
        "transcription": false,
        "enregistrement": false
      },
      "contenu": {
        "documentURI": "/15/amendements/1974/AN/1410.pdf"
      }
    }
  ],
  "seanceDiscussion": "RUANR5L15S2019IDS21683",
  "sort": {
    "dateSaisie": "2019-06-07T19:41:55.000+02:00",
    "sortEnSeance": "Retiré"
  },
  "dateDepot": "2019-05-29T02:00:00.000+02:00",
  "dateDistribution": "2019-06-04T02:00:00.000+02:00",
  "article99": "0",
  "loiReference": {
    "codeLoi": "CGCT",
    "divisionCodeLoi": "L2213-5-1"
  }
}