{
  "uid": "AMANR5L15PO744107B0424P0D1N562",
  "identifiant": {
    "legislature": "15",
    "numero": "562",
    "numRect": "0",
    "saisine": {
      "texteLegislatifRef": "PRJLANR5L15B0424",
      "numeroPartiePLF": "0",
      "organeExamen": "PO744107",
      "mentionSecondeDeliberation": "0"
    }
  },
  "numeroLong": "562",
  "etapeTexte": "1ère lecture (1ère assemblée saisie)",
  "triAmendement": "b",
  "cardinaliteAmdtMultiples": "1",
  "etat": "Discuté",
  "signataires": {
    "auteur": {
      "typeAuteur": "Depute",
      "acteurRef": "PA718978",
      "groupePolitiqueRef": "PO730970"
    },
    "cosignatairesRefs": [
      "PA719874",
      "PA720764",
      "PA718978",
      "PA722284",
      "PA722162",
      "PA721976"
    ],
    "texteAffichable": "M.&#160;Laqhila,  Mme&#160;Lasserre-David, Mme&#160;Jacquier-Laforge, M.&#160;Fuchs, M.&#160;Millienne, M.&#160;Turquois et les membres du groupe du Mouvement D&#233;mocrate et apparent&#233;s"
  },
  "pointeurFragmentTexte": {
    "division": {
      "titre": "Article 18",
      "articleDesignationCourte": "APRÈS ART. 18",
      "type": "ARTICLE",
      "avantAApres": "Apres",
      "divisionRattachee": "APRÈS L'ARTICLE 18, insérer l'article suivant:",
      "articleAdditionnel": "1",
      "urlDivisionTexteVise": "/15/textes/0424.asp#D_Article_18"
    }
  },
  "corps": {
    "dispositif": "<p style=\"text-align: justify;\">Le 4&#176; de l&#8217;article L. 121&#8209;2 du code des relations entre le public et l&#8217;administration est abrog&#233;.</p>",
    "exposeSommaire": "<p style=\"text-align: justify;\">Cet alin&#233;a exclut les organismes de s&#233;curit&#233; sociale et p&#244;le emploi de l&#8217;obligation de respecter une proc&#233;dure contradictoire pr&#233;alable lorsqu&#8217;une erreur est constat&#233;e par l&#8217;administration. Ainsi l&#8217;administr&#233; n&#8217;a pas la possibilit&#233; de formuler ses observations qui permettraient d&#8217;&#233;viter un contentieux. L&#8217;amendement vise donc &#224; &#233;tendre cette proc&#233;dure &#224; l&#8217;ensemble des administrations.&#160;</p>"
  },
  "representations": [
    {
      "nom": "PDF",
      "typeMime": {
        "type": "application",
        "subType": "PDF"
      },
      "statutRepresentation": {
        "verbatim": true,
        "canonique": true,
        "officielle": true,
        "transcription": false,
        "enregistrement": false
      },
      "contenu": {
        "documentURI": "/15/amendements/0424/CSCONF/562.pdf"
      }
    }
  ],
  "sort": {
    "dateSaisie": "2018-01-16T22:11:36.000+01:00",
    "sortEnSeance": "Retiré"
  },
  "dateDepot": "2018-01-11T01:00:00.000+01:00",
  "dateDistribution": "2018-01-15T01:00:00.000+01:00",
  "article99": "0",
  "loiReference": {
    "codeLoi": "relations public et administration",
    "divisionCodeLoi": "121-2"
  }
}