{
  "uid": "AMANR5L15PO420120B0714P0D1N7",
  "identifiant": {
    "legislature": "15",
    "numero": "7",
    "numRect": "0",
    "saisine": {
      "texteLegislatifRef": "PRJLANR5L15B0714",
      "numeroPartiePLF": "0",
      "organeExamen": "PO420120",
      "mentionSecondeDeliberation": "0"
    }
  },
  "numeroLong": "AS7",
  "etapeTexte": "1ère lecture (1ère assemblée saisie)",
  "triAmendement": "k",
  "cardinaliteAmdtMultiples": "1",
  "etat": "Discuté",
  "signataires": {
    "auteur": {
      "typeAuteur": "Depute",
      "acteurRef": "PA335054",
      "groupePolitiqueRef": "PO730946"
    },
    "cosignatairesRefs": [
      "PA335054",
      "PA719930",
      "PA610681",
      "PA643145",
      "PA642764",
      "PA508"
    ],
    "texteAffichable": "Mme&#160;Karamanli,  M.&#160;Vallaud, M.&#160;Aviragnet, Mme&#160;Bi&#233;mouret, Mme&#160;Bareigts, Mme&#160;Vainqueur-Christophe et les membres du groupe Nouvelle Gauche"
  },
  "pointeurFragmentTexte": {
    "division": {
      "titre": "Article 28",
      "articleDesignationCourte": "ART. 28",
      "type": "ARTICLE",
      "avantAApres": "A",
      "divisionRattachee": "ARTICLE 28",
      "urlDivisionTexteVise": "/15/textes/0714.asp#D_Article_28"
    }
  },
  "corps": {
    "dispositif": "<p style=\"text-align: justify;\">Supprimer cet article.</p>",
    "exposeSommaire": "<p style=\"text-align: justify;\">En l&#8217;&#233;tat actuel du droit, la carte de s&#233;jour temporaire &#171;&#160;visiteur&#160;&#187; est d&#233;livr&#233;e au ressortissant &#233;tranger qui apporte la preuve qu&#8217;il peut vivre de ses seules ressources et qui prend l&#8217;engagement de n&#8217;exercer en France aucune activit&#233; professionnelle (article L.&#160;313&#8209;6 du CESEDA).</p><p style=\"text-align: justify;\">Ce titre est g&#233;n&#233;ralement utilis&#233; pour permettre le s&#233;jour en France de membres de familles de Fran&#231;ais ou d&#8217;&#233;trangers en situation r&#233;guli&#232;re ne pouvant toutefois pr&#233;tendre &#224; la d&#233;livrance de titres sur d&#8217;autres fondements du CESEDA&#160;: ascendants de Fran&#231;ais ou d&#8217;&#233;trangers en situation r&#233;guli&#232;re ne satisfaisant pas &#224; la condition de prise en charge, partenaires pacs&#233;s ne satisfaisant pas &#224; la condition de vie commune fix&#233;e par la circulaire du 30 octobre 2004. La circulaire du 17 janvier 2006 pr&#233;voit express&#233;ment quant &#224; elle la d&#233;livrance d&#8217;une carte de &#171;&#160;visiteur&#160;&#187; pour les ascendants d&#8217;&#233;trangers en situation r&#233;guli&#232;re.</p><p style=\"text-align: justify;\">L&#8217;article&#160;28 de ce projet de loi vient pr&#233;ciser que les ressources exig&#233;es doivent atteindre un montant au moins &#233;gal au SMIC net annuel, ind&#233;pendamment des prestations familiales, du revenu de solidarit&#233; active, de l&#8217;allocation de solidarit&#233; sp&#233;cifique et de l&#8217;allocation temporaire d&#8217;attente.</p><p style=\"text-align: justify;\">En outre, il ajoute une nouvelle condition&#160;: le demandeur doit justifier de la possession d&#8217;une assurance maladie couvrant la dur&#233;e de son s&#233;jour.</p><p style=\"text-align: justify;\">En fixant au SMIC le montant minimal devant &#234;tre atteint par les ressources du demandeur et en mentionnant les ressources &#224; exclure sans pr&#233;ciser par ailleurs les ressources autres que celles propres du demandeur pouvant &#234;tre prises en compte, cet article conduit &#224; un durcissement de l&#8217;appr&#233;ciation de la condition de ressources exig&#233;e pour la d&#233;livrance de la carte &#171;&#160;visiteur&#160;&#187;.</p><p style=\"text-align: justify;\">De plus, les conditions d&#8217;acc&#232;s &#224; la carte &#171;&#160;visiteur&#160;&#187; sont durcies avec l&#8217;ajout de l&#8217;obligation de justifier d&#8217;une assurance maladie couvrant la dur&#233;e du s&#233;jour. Les personnes ne pouvant justifier d&#8217;une assurance priv&#233;e contract&#233;e pr&#233;alablement au s&#233;jour se verront refuser la d&#233;livrance de la carte. Or une assurance priv&#233;e pr&#233;alable repr&#233;sente un budget cons&#233;quent (de l&#8217;ordre de 3&#160;000&#160;euros), alors qu&#8217;en l&#8217;&#233;tat actuel du droit, la carte &#171;&#160;visiteur&#160;&#187; permet d&#8217;ouvrir des droits &#224; la prise en charge des frais de sant&#233;.</p><p style=\"text-align: justify;\">L&#8217;&#233;tude d&#8217;impact du projet de loi ne justifie ce durcissement des conditions d&#8217;acc&#232;s &#224; la carte visiteur par aucune n&#233;cessit&#233;. Elle indique seulement que la &#171;&#160;pr&#233;cision du montant minimal de ressources retenu facilitera l&#8217;instruction des demandes de visas de long s&#233;jour et de cartes de s&#233;jour portant la mention &#171;&#160;visiteur&#160;&#187; respectivement par les services consulaires et pr&#233;fectoraux&#160;&#187;.</p><p style=\"text-align: justify;\">Dans son avis rendu le 15 mars dernier, le D&#233;fenseur des droits &#171;&#160;s&#8217;inqui&#232;te du durcissement des conditions d&#8217;acc&#232;s &#224; la carte &#171;&#160;visiteur&#160;&#187; dans la mesure o&#249; celle-ci participe &#224; la protection du droit au respect de la vie priv&#233;e&#160;et familiale&#160;&#187; et recommande l&#8217;abandon de cet article&#160;28. A d&#233;faut, il recommande que soient mentionn&#233;es&#160;:</p><p style=\"text-align: justify;\">-la r&#233;f&#233;rence au SMIC de fa&#231;on indicative et non imp&#233;rative, afin de laisser au pr&#233;fet une marge d&#8217;appr&#233;ciation pour tenir compte, notamment, des enjeux relatifs au respect de la vie priv&#233;e et familiale&#160;;</p><p style=\"text-align: justify;\">-la n&#233;cessit&#233; d&#8217;appr&#233;cier largement les ressources du demandeur, en tenant compte de la participation de membres de familles ou de proches, des conditions de logement, de l&#8217;&#233;pargne du demandeur, ou encore de cautions fournies par des personnes solvables.</p><p style=\"text-align: justify;\">Cet amendement propose de supprimer cet article.</p>"
  },
  "representations": [
    {
      "nom": "PDF",
      "typeMime": {
        "type": "application",
        "subType": "PDF"
      },
      "statutRepresentation": {
        "verbatim": true,
        "canonique": true,
        "officielle": true,
        "transcription": false,
        "enregistrement": false
      },
      "contenu": {
        "documentURI": "/15/amendements/0714/CION-SOC/AS7.pdf"
      }
    }
  ],
  "sort": {
    "dateSaisie": "2018-03-27T19:07:56.000+02:00",
    "sortEnSeance": "Rejeté"
  },
  "dateDepot": "2018-03-22T01:00:00.000+01:00",
  "dateDistribution": "2018-03-23T01:00:00.000+01:00",
  "article99": "0",
  "loiReference": {}
}