{
  "uid": "AMANR5L15SEA717460B0235P2D1N1686",
  "identifiant": {
    "legislature": "15",
    "numero": "1686",
    "numRect": "0",
    "saisine": {
      "texteLegislatifRef": "PRJLANR5L15B0235",
      "numeroPartiePLF": "2",
      "organeExamen": "PO717460",
      "mentionSecondeDeliberation": "0"
    }
  },
  "numeroLong": "II-1686",
  "etapeTexte": "1ère lecture (1ère assemblée saisie)",
  "triAmendement": "zzwy",
  "cardinaliteAmdtMultiples": "1",
  "etat": "Discuté",
  "signataires": {
    "auteur": {
      "typeAuteur": "Depute",
      "acteurRef": "PA330357",
      "groupePolitiqueRef": "PO730946"
    },
    "cosignatairesRefs": [
      "PA330357"
    ],
    "texteAffichable": "M.&#160;Dussopt"
  },
  "pointeurFragmentTexte": {
    "division": {
      "titre": "Article 45",
      "articleDesignationCourte": "APRÈS ART. 45",
      "type": "ARTICLE",
      "avantAApres": "Apres",
      "divisionRattachee": "APRÈS L'ARTICLE 45, insérer l'article suivant:",
      "articleAdditionnel": "1",
      "urlDivisionTexteVise": "/15/textes/0235C.asp#D_Article_45"
    }
  },
  "corps": {
    "dispositif": "<p style=\"text-align: justify;\">I. &#8211; L&#8217;article L.&#160;2333&#8209;34 du code g&#233;n&#233;ral des collectivit&#233;s territoriales est ainsi modifi&#233;&#160;:</p><p style=\"text-align: justify;\">1&#176; Au I, apr&#232;s la r&#233;f&#233;rence&#160;: &#171;&#160;L.&#160;2333&#8209;33&#160;&#187;, sont ins&#233;r&#233;s les mots&#160;: &#171;&#160;et les op&#233;rateurs de plateformes, au sens de l&#8217;article&#160;L.&#160;111&#8209;7 du code de la consommation, qui assurent un service de mise en relation en vue de la location d&#8217;h&#233;bergements et qui sont interm&#233;diaires de paiement pour le compte de loueurs non professionnels&#160;&#187;&#160;;</p><p style=\"text-align: justify;\">2&#176; &#192; la premi&#232;re phrase du premier alin&#233;a du II, les mots&#160;: &#171;&#160;professionnels qui, par voie &#233;lectronique, assurent un service de r&#233;servation ou de location ou de mise en relation en vue de la location d&#8217;h&#233;bergements pour le compte des logeurs, des h&#244;teliers, des propri&#233;taires ou des interm&#233;diaires mentionn&#233;s &#224; l&#8217;article&#160;L.&#160;2333&#8209;33 peuvent, sous r&#233;serve d&#8217;avoir &#233;t&#233; habilit&#233;s &#224; cet effet par ces derniers, &#234;tre&#160;&#187; sont remplac&#233;s par les mots&#160;: &#171;&#160;op&#233;rateurs de plateformes, au sens de l&#8217;article&#160;L.&#160;111&#8209;7 du code de la consommation, qui assurent un service de mise en relation en vue de la location d&#8217;h&#233;bergements pour le compte de loueurs professionnels sont, sous r&#233;serve d&#8217;avoir &#233;t&#233; habilit&#233;s &#224; cet effet par ces derniers,&#160;&#187;.&#160;&#187;</p><p style=\"text-align: justify;\">II. &#8211; Le I s&#8217;applique &#224; compter du 1<sup>er</sup> juillet 2019.</p>",
    "exposeSommaire": "<p>La loi de finances pour 2015 a proc&#233;d&#233; &#224; une r&#233;forme d&#8217;envergure de la taxe de s&#233;jour. &#192; ce titre, elle a ouvert la possibilit&#233; aux plateformes internet assurant un service de r&#233;servation ou de mise en relation en vue de la location d&#8217;h&#233;bergements de collecter la taxe de s&#233;jour sur habilitation des propri&#233;taires.</p><p>Afin d&#8217;accompagner le d&#233;veloppement de la location touristique par le biais des plateformes internet et assurer la juste collecte de la taxe, le pr&#233;sent amendement vise &#224; rendre automatique la collecte de la taxe de s&#233;jour par les plateformes qui sont interm&#233;diaires de paiement &#224; compter du 1er juillet 2019.</p><p>Cette &#233;volution a pour objectif que ne se d&#233;veloppe pas d&#8217;&#233;cart entre les plateformes qui ont effectivement proc&#233;d&#233; aux adaptations informatiques permettant d&#8217;op&#233;rer la collecte de la taxe de s&#233;jour et celles qui s&#8217;y refuseraient. En effet, les conditions juridiques (publication de l&#8217;arr&#234;t&#233; du 17 mai 2016) et op&#233;rationnelles (ouverture de l&#8217;application Ocsitan par la DGFIP) sont d&#233;sormais satisfaites.</p><p>Il est propos&#233; que le caract&#232;re obligatoire de la collecte ne soit effectif qu&#8217;au&#160;1er juillet 2019 afin de laisser le temps n&#233;cessaire aux d&#233;veloppements informatiques des &#171; petites &#187; plateformes.</p>"
  },
  "representations": [
    {
      "nom": "PDF",
      "typeMime": {
        "type": "application",
        "subType": "PDF"
      },
      "statutRepresentation": {
        "verbatim": true,
        "canonique": true,
        "officielle": true,
        "transcription": false,
        "enregistrement": false
      },
      "contenu": {
        "documentURI": "/15/amendements/0235C/AN/1686.pdf"
      }
    }
  ],
  "seanceDiscussion": "RUANR5L15S2018IDS20765",
  "sort": {
    "dateSaisie": "2017-11-17T10:15:54.000+01:00",
    "sortEnSeance": "Non soutenu"
  },
  "dateDepot": "2017-11-13T01:00:00.000+01:00",
  "dateDistribution": "2017-11-15T01:00:00.000+01:00",
  "article99": "0",
  "loiReference": {
    "codeLoi": "CGCT",
    "divisionCodeLoi": "L2333-34"
  }
}