{
  "uid": "AMANR5L15SEA717460BTC1974P0D1N187",
  "identifiant": {
    "legislature": "15",
    "numero": "187",
    "numRect": "0",
    "saisine": {
      "texteLegislatifRef": "PRJLANR5L15BTC1974",
      "numeroPartiePLF": "0",
      "organeExamen": "PO717460",
      "mentionSecondeDeliberation": "0"
    }
  },
  "numeroLong": "187",
  "etapeTexte": "1ère lecture (2ème assemblée saisie)",
  "triAmendement": "hiaaaiaaaaaaaaaaaaaaaaaaaaaaaaaaaaaaaaaaaaaaaaaaaazzznc",
  "cardinaliteAmdtMultiples": "1",
  "etat": "Discuté",
  "signataires": {
    "auteur": {
      "typeAuteur": "Depute",
      "acteurRef": "PA405480",
      "groupePolitiqueRef": "PO759900"
    },
    "cosignatairesRefs": [
      "PA405480",
      "PA608292",
      "PA607619",
      "PA719286",
      "PA331582",
      "PA755549",
      "PA720996",
      "PA605694",
      "PA333421",
      "PA719138",
      "PA336175",
      "PA719146",
      "PA605518",
      "PA267042"
    ],
    "texteAffichable": "M.&#160;Pupponi,  M.&#160;Acquaviva, M.&#160;Brial, M.&#160;Castellani, M.&#160;Colombani, Mme&#160;Dubi&#233;, M.&#160;El Guerrab, M.&#160;Falorni, M.&#160;Favennec Becot, M.&#160;Fran&#231;ois-Michel&#160;Lambert, M.&#160;Molac, M.&#160;Pancher, Mme&#160;Pinel et M.&#160;Philippe&#160;Vigier"
  },
  "pointeurFragmentTexte": {
    "division": {
      "titre": "Article 1er A",
      "articleDesignationCourte": "ART. 1ER A",
      "type": "ARTICLE",
      "avantAApres": "A",
      "divisionRattachee": "ARTICLE 1ER A",
      "urlDivisionTexteVise": "/15/textes/1974.asp#D_Article_1er_A"
    },
    "alinea": {
      "numero": "4"
    }
  },
  "corps": {
    "dispositif": "<p style=\"text-align: justify;\">I.&#160;&#8211;&#160;&#192; l&#8217;alin&#233;a&#160;4, apr&#232;s le mot&#160;:</p><p style=\"text-align: justify;\">&#171;&#160;quotidien&#160;&#187;,</p><p style=\"text-align: justify;\">ins&#233;rer les mots&#160;:</p><p style=\"text-align: justify;\">&#171;&#160;, en priorit&#233; dans les quartiers de la politique de la ville&#160;&#187;,</p><p style=\"text-align: justify;\">II.&#160;&#8211;&#160;En cons&#233;quence, compl&#233;ter le m&#234;me alin&#233;a par les mots&#160;: </p><p style=\"text-align: justify;\">&#171;&#160;en donnant la priorit&#233; au d&#233;senclavement des quartiers de la politique de la ville&#160;&#187;.</p>",
    "exposeSommaire": "<p style=\"text-align: justify;\">Cet amendement entend pr&#233;ciser que priorit&#233; doit &#234;tre donn&#233;e aux quartiers de la politique de la ville.</p><p style=\"text-align: justify;\">Ces territoires restent aujourd&#8217;hui largement d&#233;ficitaires en termes d&#8217;infrastructures et d&#8217;acc&#232;s &#224; la mobilit&#233; alors que leurs populations sont d&#233;j&#224; marginalis&#233;es socialement et &#233;conomiquement.</p><p style=\"text-align: justify;\">Le recours &#224; une mobilit&#233; efficiente &#224; destination de ces territoires est une urgence aux fins de r&#233;sorber le ph&#233;nom&#232;ne de ghetto&#239;sation dont les habitants de ces quartiers sont h&#233;las victimes.</p>"
  },
  "representations": [
    {
      "nom": "PDF",
      "typeMime": {
        "type": "application",
        "subType": "PDF"
      },
      "statutRepresentation": {
        "verbatim": true,
        "canonique": true,
        "officielle": true,
        "transcription": false,
        "enregistrement": false
      },
      "contenu": {
        "documentURI": "/15/amendements/1974/AN/187.pdf"
      }
    }
  ],
  "seanceDiscussion": "RUANR5L15S2019IDS21698",
  "sort": {
    "dateSaisie": "2019-06-13T11:55:52.000+02:00",
    "sortEnSeance": "Rejeté"
  },
  "dateDepot": "2019-05-27T02:00:00.000+02:00",
  "dateDistribution": "2019-06-07T02:00:00.000+02:00",
  "article99": "0",
  "loiReference": {}
}