{
  "uid": "AMANR5L15PO420120B1081P0D1N3",
  "identifiant": {
    "legislature": "15",
    "numero": "3",
    "numRect": "0",
    "saisine": {
      "texteLegislatifRef": "PIONANR5L15B1081",
      "numeroPartiePLF": "0",
      "organeExamen": "PO420120",
      "mentionSecondeDeliberation": "0"
    }
  },
  "numeroLong": "AS3",
  "etapeTexte": "1ère lecture (1ère assemblée saisie)",
  "triAmendement": "ac",
  "cardinaliteAmdtMultiples": "1",
  "etat": "Discuté",
  "signataires": {
    "auteur": {
      "typeAuteur": "Depute",
      "acteurRef": "PA721924",
      "groupePolitiqueRef": "PO730970"
    },
    "cosignatairesRefs": [
      "PA721924"
    ],
    "texteAffichable": "Mme&#160;de Vaucouleurs"
  },
  "pointeurFragmentTexte": {
    "division": {
      "titre": "Article 7",
      "articleDesignationCourte": "ART. 7",
      "type": "ARTICLE",
      "avantAApres": "A",
      "divisionRattachee": "ARTICLE 7",
      "urlDivisionTexteVise": "/15/textes/1081.asp#D_Article_7"
    }
  },
  "corps": {
    "dispositif": "<p style=\"text-align: justify;\">Supprimer cet article.</p>",
    "exposeSommaire": "<p style=\"text-align: justify;\">La mise en &#339;uvre de la garantie jeunes est aujourd&#8217;hui assur&#233;e par les mission locales, avec toutefois la possibilit&#233; de la confier &#224; d&#8217;autres acteurs que les missions locales comme cela est pr&#233;cis&#233; aux articles L5131&#8209;4 et L5131- 6 du Code du travail, lorsque le repr&#233;sentant de L&#8217;&#201;tat dans le d&#233;partement donne son accord.</p><p style=\"text-align: justify;\">Si des exp&#233;rimentations de co-pilotage peuvent &#234;tre initi&#233;es, il convient cependant que ce dispositif r&#233;cent soit aujourd&#8217;hui bien mis en &#339;uvre par les missions locales afin de ne pas d&#233;stabiliser leur mise en &#339;uvre. En effet, celles-ci se sont structur&#233;es et ont renforc&#233; leurs &#233;quipes en personnels comp&#233;tents pour mener &#224; bien ce dispositif.</p><p style=\"text-align: justify;\">Par ailleurs, les missions locales sont soumises &#224; des restrictions budg&#233;taires de la part de nombreuses collectivit&#233;s locales, et dans ce contexte, la perte d&#8217;une stabilit&#233; de leurs ressources pourrait compromettre leur capacit&#233; &#224; poursuivre leur action dans la mise en &#339;uvre de ce dispositif qui mis en place par cet acteur donne de bons r&#233;sultats, et d&#8217;une mani&#232;re g&#233;n&#233;rale compromettre leur capacit&#233; &#224; poursuivre l&#8217;ensemble de leurs missions vis-&#224;-vis des jeunes.</p><p style=\"text-align: justify;\">Enfin, les missions locales ont un r&#244;le d&#8217;ensemblier et orientent autant que de besoins vers les EPIDE et les E2C qui repr&#233;sentent des services non concurrentiel, avec des objectifs diff&#233;rents.</p>"
  },
  "representations": [
    {
      "nom": "PDF",
      "typeMime": {
        "type": "application",
        "subType": "PDF"
      },
      "statutRepresentation": {
        "verbatim": true,
        "canonique": true,
        "officielle": true,
        "transcription": false,
        "enregistrement": false
      },
      "contenu": {
        "documentURI": "/15/amendements/1081/CION-SOC/AS3.pdf"
      }
    }
  ],
  "sort": {
    "dateSaisie": "2018-07-11T11:34:37.000+02:00",
    "sortEnSeance": "Rejeté"
  },
  "dateDepot": "2018-07-06T02:00:00.000+02:00",
  "dateDistribution": "2018-07-09T02:00:00.000+02:00",
  "article99": "0",
  "loiReference": {}
}