{
  "uid": "AMANR5L15PO59048B0235P2D1N152",
  "identifiant": {
    "legislature": "15",
    "numero": "152",
    "numRect": "0",
    "saisine": {
      "texteLegislatifRef": "PRJLANR5L15B0235",
      "numeroPartiePLF": "2",
      "organeExamen": "PO59048",
      "mentionSecondeDeliberation": "0"
    }
  },
  "numeroLong": "II-CF152",
  "etapeTexte": "1ère lecture (1ère assemblée saisie)",
  "triAmendement": "btu",
  "cardinaliteAmdtMultiples": "1",
  "etat": "Discuté",
  "signataires": {
    "auteur": {
      "typeAuteur": "Depute",
      "acteurRef": "PA1874",
      "groupePolitiqueRef": "PO730934"
    },
    "cosignatairesRefs": [
      "PA1874",
      "PA718838"
    ],
    "texteAffichable": "M.&#160;Le Fur et M.&#160;Brun"
  },
  "pointeurFragmentTexte": {
    "missionVisee": {
      "idMissionAN": "7",
      "libelleMission": "Cohésion des territoires",
      "codeMissionPLF": "B",
      "libelleMissionPLF": "Répartition, par mission et programme, des crédits du budget général"
    },
    "division": {
      "titre": "Article 52",
      "articleDesignationCourte": "ART. 52",
      "type": "ARTICLE",
      "avantAApres": "A",
      "divisionRattachee": "ARTICLE 52",
      "urlDivisionTexteVise": "/15/textes/0235C.asp#D_Article_52"
    },
    "alinea": {
      "numero": "31"
    }
  },
  "corps": {
    "dispositif": "<p style=\"text-align: justify;\">Supprimer les alin&#233;as&#160;31 &#224; 34.</p>",
    "exposeSommaire": "<p style=\"text-align: justify;\">L&#8217;article&#160;52 supprime le dispositif d&#8217;APL Accession (alin&#233;as 2 et 3&#160;; alin&#233;as 31 &#224; 34). Dans l&#8217;&#233;valuation pr&#233;alable de l&#8217;article, il est indiqu&#233; que &#171;&#160;l&#8217;objectif est de supprimer un dispositif peu efficace et peu attractif d&#8217;accession &#224; la propri&#233;t&#233; afin de red&#233;ployer une partie des financements en faveur de la prorogation du PTZ dans les zones tendues&#160;&#187;.</p><p style=\"text-align: justify;\">Cet argument n&#8217;est pas tenable&#160;:</p><p style=\"text-align: justify;\">1. Tout ce qui contribue &#224; am&#233;liorer l&#8217;acc&#232;s &#224; la propri&#233;t&#233; doit &#234;tre soutenu et valoris&#233;, et notamment l&#8217;APL Accession qui permet &#224; des m&#233;nages modestes de devenir propri&#233;taires et de transmettre un patrimoine &#224; leurs enfants.</p><p style=\"text-align: justify;\">2. Le prolongement du PTZ pr&#233;vu &#224; l&#8217;article&#160;40 du PLF ne sera applicable que dans certaines zones, les territoires ruraux &#233;tant compl&#232;tement mis &#224; l&#8217;&#233;cart. Dans ces territoires, l&#8217;acc&#232;s &#224; la propri&#233;t&#233; pour les habitants sera donc plus difficile.</p><p style=\"text-align: justify;\">Le pr&#233;sent amendement&#160;vise par cons&#233;quent &#224; maintenir le dispositif de l&#8217;APL Accession qui s&#8217;applique sur tous les territoires.</p>"
  },
  "representations": [
    {
      "nom": "PDF",
      "typeMime": {
        "type": "application",
        "subType": "PDF"
      },
      "statutRepresentation": {
        "verbatim": true,
        "canonique": true,
        "officielle": true,
        "transcription": false,
        "enregistrement": false
      },
      "contenu": {
        "documentURI": "/15/amendements/0235C/CION_TOUTE/CF152.pdf"
      }
    }
  ],
  "sort": {
    "dateSaisie": "2017-10-27T13:41:53.000+02:00",
    "sortEnSeance": "Non soutenu"
  },
  "dateDepot": "2017-10-24T02:00:00.000+02:00",
  "dateDistribution": "2017-10-27T02:00:00.000+02:00",
  "article99": "0",
  "loiReference": {}
}