{
  "uid": "AMANR5L15SEA717460BTC2401P0D1N1325",
  "identifiant": {
    "legislature": "15",
    "numero": "1325",
    "numRect": "0",
    "saisine": {
      "texteLegislatifRef": "PRJLANR5L15BTC2401",
      "numeroPartiePLF": "0",
      "organeExamen": "PO717460",
      "mentionSecondeDeliberation": "0"
    }
  },
  "numeroLong": "1325",
  "etapeTexte": "1ère lecture (2ème assemblée saisie)",
  "triAmendement": "baiaaaaaaaaaaaaaaaaaaaaaaaaaaaaaaaaaaaaaaaaaaaaaaaaabozzzzvhzs",
  "cardinaliteAmdtMultiples": "1",
  "etat": "Discuté",
  "signataires": {
    "auteur": {
      "typeAuteur": "Depute",
      "acteurRef": "PA643134",
      "groupePolitiqueRef": "PO730934"
    },
    "cosignatairesRefs": [
      "PA721506",
      "PA643134",
      "PA267794"
    ],
    "texteAffichable": "Mme&#160;Valentin,  Mme&#160;Kuster et Mme&#160;Tabarot"
  },
  "pointeurFragmentTexte": {
    "division": {
      "titre": "Article 5",
      "articleDesignationCourte": "ART. 5",
      "type": "ARTICLE",
      "avantAApres": "A",
      "divisionRattachee": "ARTICLE 5",
      "urlDivisionTexteVise": "/15/textes/2401.asp#D_Article_5"
    }
  },
  "corps": {
    "dispositif": "<p style=\"text-align: justify;\">Compl&#233;ter cet article par les deux alin&#233;as suivants&#160;:</p><p style=\"text-align: justify;\">&#171;&#160;VI.&#160;&#8211;&#160;Les communes membres d&#8217;une communaut&#233; d&#8217;agglom&#233;ration qui n&#8217;exercent pas, &#224; la date de publication de la pr&#233;sente loi, &#224; titre optionnel ou facultatif, les comp&#233;tences relatives &#224; l&#8217;eau ou &#224; l&#8217;assainissement, peuvent s&#8217;opposer au transfert obligatoire de ces deux comp&#233;tences, ou de l&#8217;une d&#8217;entre elles, &#224; la communaut&#233; d&#8217;agglom&#233;ration, r&#233;sultant du II de l&#8217;article&#160;66 de la loi&#160;n&#176;&#160;2015&#8209;991 du 7&#160;ao&#251;t&#160;2015 portant nouvelle organisation territoriale de la R&#233;publique, si, avant le 31&#160;d&#233;cembre 2020, au moins 25&#160;% des communes membres de la communaut&#233; d&#8217;agglom&#233;ration repr&#233;sentant au moins 20&#160;% de la population d&#233;lib&#232;rent en ce sens.</p><p style=\"text-align: justify;\">&#171;&#160;Si, apr&#232;s le 1<sup>er</sup> janvier 2021, une communaut&#233; d&#8217;agglom&#233;ration n&#8217;exerce pas les comp&#233;tences relatives &#224; l&#8217;eau et &#224; l&#8217;assainissement ou l&#8217;une d&#8217;entre elles, l&#8217;organe d&#233;lib&#233;rant de la communaut&#233; d&#8217;agglom&#233;ration peut &#233;galement, &#224; tout moment, se prononcer par un vote sur l&#8217;exercice de plein droit d&#8217;une ou de ces comp&#233;tences par la communaut&#233;. Les communes membres peuvent toutefois s&#8217;opposer &#224; cette d&#233;lib&#233;ration, dans les trois mois, dans les conditions pr&#233;vues au premier alin&#233;a.&#160;&#187;</p>",
    "exposeSommaire": "<p style=\"text-align: justify;\">Cet amendement propose que les communes membres d&#8217;une communaut&#233; d&#8217;agglom&#233;ration qui n&#8217;exercent pas, &#224; la date de la publication de la pr&#233;sente loi, &#224; titre optionnel ou facultatif, les comp&#233;tences relatives &#224; l&#8217;eau ou &#224; l&#8217;assainissement, puissent s&#8217;opposer au transfert obligatoire de ces deux comp&#233;tences. <br /><br />Il offre la facult&#233; &#224; ces communes qui ne souhaitent pas transf&#233;rer ces deux comp&#233;tences, ou l&#8217;une d&#8217;entre elles, &#224; la communaut&#233; d&#8217;agglom&#233;ration, r&#233;sultant du II de l&#8217;article&#160;66 de la loi&#160;n&#176;&#160;2015&#8209;991 du 7&#160;ao&#251;t&#160;2015 portant nouvelle organisation territoriale de la R&#233;publique, de s&#8217;y opposer si, avant le 31&#160;d&#233;cembre 2020, au moins 25&#160;% des communes membres de la communaut&#233; d&#8217;agglom&#233;ration repr&#233;sentant au moins 20&#160;% de la population d&#233;lib&#232;rent en ce sens.</p><p style=\"text-align: justify;\">Aussi, si apr&#232;s le 1<sup>er</sup> janvier 2021, une communaut&#233; d&#8217;agglom&#233;ration n&#8217;exerce pas les comp&#233;tences relatives &#224; l&#8217;eau et &#224; l&#8217;assainissement ou l&#8217;une d&#8217;entre elles, l&#8217;organe d&#233;lib&#233;rant de la communaut&#233; d&#8217;agglom&#233;ration peut &#233;galement, &#224; tout moment, se prononcer par un vote sur l&#8217;exercice de plein droit d&#8217;une ou de ces comp&#233;tences par la communaut&#233;. Les communes membres peuvent toutefois s&#8217;opposer &#224; cette d&#233;lib&#233;ration, dans les trois mois, dans les conditions pr&#233;vues au premier alin&#233;a.</p>"
  },
  "representations": [
    {
      "nom": "PDF",
      "typeMime": {
        "type": "application",
        "subType": "PDF"
      },
      "statutRepresentation": {
        "verbatim": true,
        "canonique": true,
        "officielle": true,
        "transcription": false,
        "enregistrement": false
      },
      "contenu": {
        "documentURI": "/15/amendements/2401/AN/1325.pdf"
      }
    }
  ],
  "seanceDiscussion": "RUANR5L15S2020IDS21950",
  "sort": {
    "dateSaisie": "2019-11-20T15:07:18.000+01:00",
    "sortEnSeance": "Non soutenu"
  },
  "dateDepot": "2019-11-14T01:00:00.000+01:00",
  "dateDistribution": "2019-11-19T01:00:00.000+01:00",
  "article99": "0",
  "loiReference": {}
}