{
  "uid": "AMANR5L15SEA717460BTC0164P0D1N445",
  "identifiant": {
    "legislature": "15",
    "numero": "445",
    "numRect": "0",
    "saisine": {
      "texteLegislatifRef": "PRJLANR5L15BTC0164",
      "numeroPartiePLF": "0",
      "organeExamen": "PO717460",
      "mentionSecondeDeliberation": "0"
    }
  },
  "numeroLong": "445",
  "etapeTexte": "1ère lecture (2ème assemblée saisie)",
  "triAmendement": "fkm",
  "cardinaliteAmdtMultiples": "1",
  "etat": "Discuté",
  "signataires": {
    "auteur": {
      "typeAuteur": "Depute",
      "acteurRef": "PA330684",
      "groupePolitiqueRef": "PO730934"
    },
    "cosignatairesRefs": [
      "PA330684"
    ],
    "texteAffichable": "Mme&#160;Val&#233;rie&#160;Boyer"
  },
  "pointeurFragmentTexte": {
    "division": {
      "titre": "Article 7 bis",
      "articleDesignationCourte": "APRÈS ART. 7 BIS",
      "type": "ARTICLE",
      "avantAApres": "Apres",
      "divisionRattachee": "APRÈS L'ARTICLE 7 BIS, insérer l'article suivant:",
      "articleAdditionnel": "1",
      "urlDivisionTexteVise": "/15/textes/0164.asp#D_Article_7_bis"
    }
  },
  "corps": {
    "dispositif": "<p style=\"text-align: justify;\">Le titre II du livre II du code de la s&#233;curit&#233; int&#233;rieure est compl&#233;t&#233; par un chapitre X ainsi r&#233;dig&#233;&#160;:</p><p style=\"text-align: justify;\">&#171;&#160;CHAPITRE X</p><p style=\"text-align: justify;\">&#171;&#160;Interdiction de retour sur le territoire</p><p style=\"text-align: justify;\">&#171;&#160;Art.&#160;L.&#160;22-10-1.&#160;&#8211;&#160;Tout ressortissant fran&#231;ais ayant une double nationalit&#233; peut faire l&#8217;objet d&#8217;une interdiction de retour sur le territoire fran&#231;ais lorsqu&#8217;il existe de s&#233;rieuses raisons de croire qu&#8217;il a effectu&#233;&#160;:</p><p style=\"text-align: justify;\">&#171;&#160;-&#160;des d&#233;placements &#224; l&#8217;&#233;tranger ayant pour objet la participation &#224; des activit&#233;s terroristes, des crimes de guerre ou des crimes contre l&#8217;humanit&#233;&#160;;</p><p style=\"text-align: justify;\">&#171;&#160;-&#160;des d&#233;placements &#224; l&#8217;&#233;tranger sur un th&#233;&#226;tre d&#8217;op&#233;rations de groupements terroristes et dans des conditions susceptibles de le conduire &#224; porter atteinte &#224; la s&#233;curit&#233; publique lors de son retour sur le territoire fran&#231;ais.</p><p style=\"text-align: justify;\">&#171;&#160;L&#8217;interdiction de retour sur territoire est prononc&#233;e par le ministre de l&#8217;int&#233;rieur pour une dur&#233;e maximale de six&#160;mois &#224; compter de sa notification. Le ministre de l&#8217;int&#233;rieur ou son repr&#233;sentant entend, sans d&#233;lai, la personne concern&#233;e et, au plus tard, quinze&#160;jours apr&#232;s que la d&#233;cision lui a &#233;t&#233; notifi&#233;e. Cette personne peut se faire assister par un conseil ou repr&#233;senter par un mandataire de son choix.</p><p style=\"text-align: justify;\">&#171;&#160;Aussi longtemps que les conditions en sont r&#233;unies, l&#8217;interdiction de retour du territoire peut &#234;tre renouvel&#233;e par d&#233;cision expresse. Elle est lev&#233;e aussit&#244;t que ces conditions ne sont plus satisfaites.</p><p style=\"text-align: justify;\">&#171;&#160;L&#8217;interdiction de retour du territoire emporte retrait du passeport fran&#231;ais et de la carte nationale d&#8217;identit&#233; fran&#231;aise de la personne concern&#233;e.</p><p style=\"text-align: justify;\">&#171;&#160;Le fait de rentrer ou de tenter de rentrer le territoire fran&#231;ais en violation d&#8217;une interdiction de retour sur le territoire prise en application du pr&#233;sent article est puni de trois ans d&#8217;emprisonnement et de 45&#160;000&#160;&#8364; d&#8217;amende.&#160;&#187;</p>",
    "exposeSommaire": "<p style=\"text-align: justify;\">Dans le contexte que nous traversons actuellement, nous ne pouvons plus nous contenter de gu&#233;rir les blessures de notre pays avec des minutes de silence, des comm&#233;morations et des marches silencieuses.</p><p style=\"text-align: justify;\">Cela n&#8217;a que trop dur&#233;. C&#8217;est la raison pour laquelle nous devons prendre de r&#233;elles mesures permettant de lutter efficacement en amont contre le terrorisme.</p><p style=\"text-align: justify;\">Trop de temps a d&#233;j&#224; &#233;t&#233; perdu&#160;! En tant que l&#233;gislateur et dans le cadre de l&#8217;&#233;tude de ce projet de loi, nous devons prendre nos responsabilit&#233;s et enfin doter notre pays de dispositifs nous permettant de lutter efficacement contre le terrorisme.</p><p style=\"text-align: justify;\">Tel est l&#8217;objet du pr&#233;sent amendement, qui propose de mettre en place une interdiction de retour sur le territoire national de tout ressortissant fran&#231;ais ayant une double nationalit&#233;, si il existe de s&#233;rieuses raisons de croire que celui-ci a effectu&#233;&#160;:</p><p style=\"text-align: justify;\">&#171;&#160;&#8208; des d&#233;placements &#224; l&#8217;&#233;tranger ayant pour objet la participation &#224; des activit&#233;s terroristes, des crimes de guerre ou des crimes contre l&#8217;humanit&#233;&#160;;</p><p style=\"text-align: justify;\">&#171;&#160;&#8208; des d&#233;placements &#224; l&#8217;&#233;tranger sur un th&#233;&#226;tre d&#8217;op&#233;rations de groupements terroristes et dans des conditions susceptibles de le conduire &#224; porter atteinte &#224; la s&#233;curit&#233; publique lors de son retour sur le territoire fran&#231;ais.&#160;&#187;</p><p style=\"text-align: justify;\">Le retour de ces individus repr&#233;sente en effet un danger majeur pour la s&#233;curit&#233; de notre pays et de l&#8217;ensemble des Fran&#231;ais. La mise en place d&#8217;une telle disposition nous permettant d&#8217;agir en amont est donc aujourd&#8217;hui essentielle.</p><p style=\"text-align: justify;\">Les pr&#233;sentes dispositions que proposent cet amendement, entrainent donc le retrait du passeport fran&#231;ais et de la pi&#232;ce d&#8217;identit&#233; fran&#231;aise des personnes concern&#233;es, lorsque celles&#8208;ci poss&#232;dent la double nationalit&#233;. Par cons&#233;quent, ces dispositions ne s&#8217;opposent pas &#224; l&#8217;article&#160;3 de la Convention&#160;europ&#233;enne de sauvegarde des droits de l&#8217;homme et des libert&#233;s fondamentales qui dispose que &#171;&#160;nul ne peut &#234;tre priv&#233; du droit d&#8217;entrer sur le territoire de l&#8217;&#201;tat dont il est le ressortissant.&#160;&#187;</p><p style=\"text-align: justify;\">Cette interdiction de retour du territoire sera prononc&#233;e par le ministre de l&#8217;int&#233;rieur pour une dur&#233;e de six mois est renouvelable autant de fois que les pr&#233;sentes conditions sont r&#233;unies.</p>"
  },
  "representations": [
    {
      "nom": "PDF",
      "typeMime": {
        "type": "application",
        "subType": "PDF"
      },
      "statutRepresentation": {
        "verbatim": true,
        "canonique": true,
        "officielle": true,
        "transcription": false,
        "enregistrement": false
      },
      "contenu": {
        "documentURI": "/15/amendements/0164/AN/445.pdf"
      }
    }
  ],
  "seanceDiscussion": "RUANR5L15S2017IDS20675",
  "sort": {
    "dateSaisie": "2017-09-28T15:07:44.000+02:00",
    "sortEnSeance": "Non soutenu"
  },
  "dateDepot": "2017-09-21T02:00:00.000+02:00",
  "dateDistribution": "2017-09-25T02:00:00.000+02:00",
  "article99": "0",
  "loiReference": {
    "codeLoi": "c sécurité intérieure",
    "divisionCodeLoi": "L224-1"
  }
}