{
  "uid": "AMANR5L15SEA717460BTC1767P0D1N1758",
  "identifiant": {
    "legislature": "15",
    "numero": "1758",
    "numRect": "0",
    "saisine": {
      "texteLegislatifRef": "PRJLANR5L15BTC1767",
      "numeroPartiePLF": "0",
      "organeExamen": "PO717460",
      "mentionSecondeDeliberation": "0"
    }
  },
  "numeroLong": "1758",
  "etapeTexte": "1ère lecture (1ère assemblée saisie)",
  "triAmendement": "bcaaaaaaaaaaaaaaaaaaaaaaaaaaaaaaaaaaaaaaaaaaaaaaaaf",
  "cardinaliteAmdtMultiples": "1",
  "etat": "Irrecevable",
  "signataires": {
    "auteur": {
      "typeAuteur": "Depute",
      "acteurRef": "PA719154",
      "groupePolitiqueRef": "PO730964"
    },
    "cosignatairesRefs": [
      "PA719154"
    ],
    "texteAffichable": "M.&#160;Martin"
  },
  "pointeurFragmentTexte": {
    "division": {
      "titre": "Article 6",
      "articleDesignationCourte": "APRÈS ART. 6",
      "type": "ARTICLE",
      "avantAApres": "Apres",
      "divisionRattachee": "APRÈS L'ARTICLE 6, insérer l'article suivant:",
      "articleAdditionnel": "1",
      "urlDivisionTexteVise": "/15/textes/1767.asp#D_Article_6"
    }
  },
  "corps": {
    "dispositif": "<p>Apr&#232;s l'article 6, ins&#233;rer l'article suivant:</p><p style=\"text-align: justify;\">I. - A l'article 81 quater du code g&#233;n&#233;ral des imp&#244;ts, remplacer \"5 000 &#8364;\" par \"18 000 &#8364;\".</p><p>II.&#160;&#8211;&#160;La perte de recettes pour l&#8217;&#201;tat est compens&#233;e &#224; due concurrence par la cr&#233;ation d&#8217;une taxe additionnelle aux droits mentionn&#233;s aux articles 575 et 575 A du code g&#233;n&#233;ral des imp&#244;ts.&#160;</p>",
    "exposeSommaire": "<p>L'objectif de cet amendement est de valoriser l'investissement des praticiens hospitaliers titulaires en augmentant la limite annuelle jusqu'&#224; laquelle il est possible d'exon&#233;rer de l'imp&#244;t sur le revenu les r&#233;mun&#233;rations, les majorations et les &#233;l&#233;ments de r&#233;mun&#233;rations mentionn&#233;s aux I et III de l'article L. 241-17 du code de la s&#233;curit&#233; sociale.</p><p style=\"text-align: justify;\">En effet, la lib&#233;ralisation g&#233;n&#233;rale et massive du recours aux contractuels ne constitue pas une r&#233;ponse satisfaisante &#224; la crise de d&#233;mographie m&#233;dicale dans les territoires. Il est au contraire n&#233;cessaire de valoriser davantage les parcours hospitaliers titulaires afin de fid&#233;liser les praticiens titulaires.</p>"
  },
  "representations": [
    {
      "nom": "PDF",
      "typeMime": {
        "type": "application",
        "subType": "PDF"
      },
      "statutRepresentation": {
        "verbatim": true,
        "canonique": true,
        "officielle": true,
        "transcription": false,
        "enregistrement": false
      },
      "contenu": {
        "documentURI": "/15/amendements/1767/AN/1758.pdf"
      }
    }
  ],
  "dateDepot": "2019-03-16T01:00:00.000+01:00",
  "dateDistribution": "2019-03-18T01:00:00.000+01:00",
  "article99": "0",
  "loiReference": {
    "codeLoi": "CGI",
    "divisionCodeLoi": "81 quater"
  }
}