{
  "uid": "AMANR5L15SEA717460BTC1767P0D1N77",
  "identifiant": {
    "legislature": "15",
    "numero": "77",
    "numRect": "0",
    "saisine": {
      "texteLegislatifRef": "PRJLANR5L15BTC1767",
      "numeroPartiePLF": "0",
      "organeExamen": "PO717460",
      "mentionSecondeDeliberation": "0"
    }
  },
  "numeroLong": "77",
  "etapeTexte": "1ère lecture (1ère assemblée saisie)",
  "triAmendement": "daaaaaaaaaaaaaaaaaaaaaaaaaaaaaaaaaaaaaaaaaaaaaaaaaoit",
  "cardinaliteAmdtMultiples": "1",
  "etat": "Discuté",
  "signataires": {
    "auteur": {
      "typeAuteur": "Depute",
      "acteurRef": "PA2377",
      "groupePolitiqueRef": "PO730934"
    },
    "cosignatairesRefs": [
      "PA2377"
    ],
    "texteAffichable": "M.&#160;Perrut"
  },
  "pointeurFragmentTexte": {
    "division": {
      "titre": "Article 7 quinquies",
      "articleDesignationCourte": "APRÈS ART. 7 QUINQUIES",
      "type": "ARTICLE",
      "avantAApres": "Apres",
      "divisionRattachee": "APRÈS L'ARTICLE 7 QUINQUIES, insérer l'article suivant:",
      "articleAdditionnel": "1",
      "urlDivisionTexteVise": "/15/textes/1767.asp#D_Article_7_quinquies"
    }
  },
  "corps": {
    "dispositif": "<p style=\"text-align: justify;\">L'article L.&#160;4311-1 du code de la sant&#233; publique est ainsi modifi&#233;&#160;:</p><p style=\"text-align: justify;\">1&#176;&#160;Le troisi&#232;me alin&#233;a est ainsi r&#233;dig&#233;&#160;:</p><p style=\"text-align: justify;\">&#171;&#160;L&#8217;infirmi&#232;re ou l&#8217;infirmier peut effectuer les vaccinations de l&#8217;ensemble des adultes, &#224; l&#8217;exception de la premi&#232;re injection, sans prescription m&#233;dicale. Les modalit&#233;s et les conditions de r&#233;alisation sont fix&#233;es par d&#233;cret en Conseil d&#8217;&#201;tat, pris apr&#232;s avis du Haut conseil de la sant&#233; publique.&#160;&#187;</p><p style=\"text-align: justify;\">2&#176;&#160;Le cinqui&#232;me alin&#233;a est ainsi modifi&#233;&#160;:</p><p style=\"text-align: justify;\"><i>a)</i> &#192; la premi&#232;re phrase, les mots&#160;: &#171;&#160;dispositifs m&#233;dicaux&#160;&#187; sont remplac&#233;s par les mots&#160;: &#171;&#160;produits de sant&#233;&#160;&#187;&#160;;</p><p style=\"text-align: justify;\"><i>b)</i> Est ajout&#233;e une phrase ainsi r&#233;dig&#233;e&#160;: &#171;&#160;Dans ce cadre, les infirmiers peuvent &#233;galement prescrire les solutions et produits antiseptiques en vente libre.&#160;&#187;</p>",
    "exposeSommaire": "<p>Depuis 2008, les infirmiers vaccinent sans prescription m&#233;dicale pr&#233;alable les personnes fragiles contre la grippe, &#224; l&#8217;exception de la primo-vaccination. Cette mesure de sant&#233; publique a ainsi permis la vaccination de plus d&#8217;un million de personnes lors de la derni&#232;re campagne (chiffres CNAMTS).</p><p style=\"text-align: justify;\">L&#8217;article de loi avait pr&#233;vu que l&#8217;infirmi&#232;re puisse revacciner l&#8217;ensemble de la population adulte, afin d&#8217;&#233;largir la couverture vaccinale. Or, le d&#233;cret d&#8217;application&#160;2008&#8209;877 a &#233;t&#233; doublement restrictif.</p><p style=\"text-align: justify;\">D&#8217;une part, en limitant uniquement &#224; la grippe, alors que les comp&#233;tences requises sont les m&#234;mes pour toute vaccination.</p><p style=\"text-align: justify;\">D&#8217;autre part, en limitant aux personnes &#226;g&#233;es et aux malades chroniques&#160;: l&#8217;infirmi&#232;re est comp&#233;tente pour les plus fragiles, mais ne le serait pas pour les personnes en bonne sant&#233;&#160;! L&#8217;entourage est donc exclu, ce qui limite la port&#233;e de la couverture vaccinale.</p><p style=\"text-align: justify;\">Par ailleurs, des adultes en bonne sant&#233; viennent spontan&#233;ment dans des cabinets lib&#233;raux pour &#234;tre vaccin&#233;s, car les 90&#160;000&#160;infirmiers lib&#233;raux couvrent l&#8217;ensemble du territoire.</p><p style=\"text-align: justify;\">Le co&#251;t de la prise en charge par l&#8217;Assurance maladie de l&#8217;acte d&#8217;injection pour vaccination antigrippale pratiqu&#233;e par une infirmi&#232;re varie de&#160;4,5 &#224;&#160;6,3&#160;&#8364;, consid&#233;ration que les pouvoirs publics devraient &#233;galement prendre en compte.</p><p style=\"text-align: justify;\">Comme ils ont la comp&#233;tence acquise pour vacciner, il convient donc d&#8217;&#233;largir la possibilit&#233; l&#233;gale de vaccination par les infirmiers.</p><p style=\"text-align: justify;\">L&#8217;alin&#233;a&#160;4 de l&#8217;article L.&#160;4311&#8209;1 du code de la sant&#233; publique introduit par l&#8217;art.&#160;51 de la loi de financement de la s&#233;curit&#233; sociale pour 2006 a ouvert un droit de prescription pour les infirmiers. L&#8217;expos&#233; des motifs de cet article pr&#233;cisait qu&#8217;il s&#8217;agissait permettre aux infirmiers &#171;&#160;d&#8217;exercer leur activit&#233; sans que le patient n&#8217;ait &#224; retourner consulter son m&#233;decin traitant&#160;&#187; afin que ce soit &#171;&#160;source de simplification pour les professionnels, m&#233;decins et infirmiers, et pour les patients, et source potentielle d&#8217;&#233;conomies pour l&#8217;assurance maladie.&#160;&#187;</p><p style=\"text-align: justify;\">Lors de l&#8217;adoption de cette disposition, le Gouvernement rappelait que cette mesure d&#8217;ouverture du droit de prescription des infirmiers constituait &#233;galement &#171;&#160;la reconnaissance d&#8217;une comp&#233;tence nouvelle des infirmiers. Comme le m&#233;tier m&#233;dical s&#8217;enrichit, il est logique que le m&#233;tier des professions de sant&#233; dites auxiliaires du m&#233;decin s&#8217;enrichisse parall&#232;lement.&#160;&#187;</p><p style=\"text-align: justify;\">Ainsi cet &#233;largissement du champ de la prescription pourrait concerner notamment certains produits tels que les solutions antiseptiques indispensables &#224; la d&#233;sinfection des tissus lors de la pose ou de la d&#233;pose des dispositifs m&#233;dicaux que les infirmiers peuvent d&#233;j&#224; prescrire, compl&#233;ments alimentaires et certains dispositifs tels que lits m&#233;dicaux ou tire-lait.</p>"
  },
  "representations": [
    {
      "nom": "PDF",
      "typeMime": {
        "type": "application",
        "subType": "PDF"
      },
      "statutRepresentation": {
        "verbatim": true,
        "canonique": true,
        "officielle": true,
        "transcription": false,
        "enregistrement": false
      },
      "contenu": {
        "documentURI": "/15/amendements/1767/AN/77.pdf"
      }
    }
  ],
  "seanceDiscussion": "RUANR5L15S2019IDS21564",
  "sort": {
    "dateSaisie": "2019-03-21T22:20:22.000+01:00",
    "sortEnSeance": "Rejeté"
  },
  "dateDepot": "2019-03-14T01:00:00.000+01:00",
  "dateDistribution": "2019-03-18T01:00:00.000+01:00",
  "article99": "0",
  "loiReference": {
    "codeLoi": "c santé publique",
    "divisionCodeLoi": "L4311-1"
  }
}