{
  "uid": "AMANR5L15SEA717460BTC0990P0D1N44",
  "identifiant": {
    "legislature": "15",
    "numero": "44",
    "numRect": "0",
    "saisine": {
      "texteLegislatifRef": "PIONANR5L15BTC0990",
      "numeroPartiePLF": "0",
      "organeExamen": "PO717460",
      "mentionSecondeDeliberation": "0"
    }
  },
  "numeroLong": "44",
  "etapeTexte": "1ère lecture (1ère assemblée saisie)",
  "triAmendement": "d",
  "cardinaliteAmdtMultiples": "1",
  "etat": "Discuté",
  "signataires": {
    "auteur": {
      "typeAuteur": "Depute",
      "acteurRef": "PA719608",
      "groupePolitiqueRef": "PO723569"
    },
    "cosignatairesRefs": [
      "PA719608"
    ],
    "texteAffichable": "Mme&#160;M&#233;nard"
  },
  "pointeurFragmentTexte": {
    "division": {
      "titre": "Article 6",
      "articleDesignationCourte": "ART. 6",
      "type": "ARTICLE",
      "avantAApres": "A",
      "divisionRattachee": "ARTICLE 6",
      "urlDivisionTexteVise": "/15/textes/0990.asp#D_Article_6"
    }
  },
  "corps": {
    "dispositif": "<p style=\"text-align: justify;\">Supprimer cet article.</p>",
    "exposeSommaire": "<p style=\"text-align: justify;\">Philippe Muray s&#8217;exclamait dans l&#8217;Empire du Bien&#160;: &#171;&#160;Des lois&#160;! Des lois&#160;! Encore&#160;! De nouvelles lois&#160;! Des d&#233;crets pour tout&#160;! Des lois cadres&#160;! Une nouvelle l&#233;gislation&#160;! Des punitions&#160;! Des ch&#226;timents&#160;! (&#8230;) Nous voulons des barri&#232;res juridiques, des limites, encore du p&#233;nal&#160;!&#160;&#187;</p><p style=\"text-align: justify;\">Il s&#8217;agit d&#8217;une mise en garde contre une soci&#233;t&#233; qui dit quoi penser, quoi faire, quoi dire.</p><p style=\"text-align: justify;\">Tocqueville quant &#224; lui a eu cette vison presque proph&#233;tique de la r&#233;duction de &#171;&#160;chaque nation &#224; n&#8217;&#234;tre plus qu&#8217;un troupeau d&#8217;animaux timides et industrieux, dont le gouvernement est le berger&#160;&#187;.</p><p style=\"text-align: justify;\">Pour ne pas en arriver &#224; une telle extr&#233;mit&#233;, il convient de supprimer cet article pour prot&#233;ger la libert&#233; d&#8217;expression.</p>"
  },
  "representations": [
    {
      "nom": "PDF",
      "typeMime": {
        "type": "application",
        "subType": "PDF"
      },
      "statutRepresentation": {
        "verbatim": true,
        "canonique": true,
        "officielle": true,
        "transcription": false,
        "enregistrement": false
      },
      "contenu": {
        "documentURI": "/15/amendements/0990/AN/44.pdf"
      }
    }
  ],
  "seanceDiscussion": "RUANR5L15S2018IDS21151",
  "sort": {
    "dateSaisie": "2018-07-03T19:25:49.000+02:00",
    "sortEnSeance": "Rejeté"
  },
  "dateDepot": "2018-06-04T02:00:00.000+02:00",
  "dateDistribution": "2018-06-05T02:00:00.000+02:00",
  "article99": "0",
  "loiReference": {}
}