{
  "uid": "AMANR5L15SEA717460BTC1767P0D1N1792",
  "identifiant": {
    "legislature": "15",
    "numero": "1792",
    "numRect": "0",
    "saisine": {
      "texteLegislatifRef": "PRJLANR5L15BTC1767",
      "numeroPartiePLF": "0",
      "organeExamen": "PO717460",
      "mentionSecondeDeliberation": "0"
    }
  },
  "numeroLong": "1792",
  "etapeTexte": "1ère lecture (1ère assemblée saisie)",
  "triAmendement": "buaaaaaaaaaaaaaaaaaaaaaaaaaaaaaaaaaaaaaaaaaaaaaaaabsjo",
  "cardinaliteAmdtMultiples": "1",
  "etat": "Discuté",
  "signataires": {
    "auteur": {
      "typeAuteur": "Depute",
      "acteurRef": "PA722374",
      "groupePolitiqueRef": "PO730970"
    },
    "cosignatairesRefs": [
      "PA719504",
      "PA720652",
      "PA719640",
      "PA721836",
      "PA721742",
      "PA720764",
      "PA719874",
      "PA720326",
      "PA719918",
      "PA720746",
      "PA719044",
      "PA721976",
      "PA718978",
      "PA720002",
      "PA719488",
      "PA720598",
      "PA720178",
      "PA720968",
      "PA720704",
      "PA720924",
      "PA719210",
      "PA721924",
      "PA719942",
      "PA720092",
      "PA720334",
      "PA721182",
      "PA720772",
      "PA720728",
      "PA721418",
      "PA720720",
      "PA721734",
      "PA720256",
      "PA722374",
      "PA717151",
      "PA719266",
      "PA719558",
      "PA721984",
      "PA721234",
      "PA720976",
      "PA722162",
      "PA721530",
      "PA722284",
      "PA721608",
      "PA1276",
      "PA720162",
      "PA721992"
    ],
    "texteAffichable": "M.&#160;Isaac-Sibille,  Mme&#160;Benin, Mme&#160;de Vaucouleurs, Mme&#160;Elimas, M.&#160;Hammouche, M.&#160;Mignola, M.&#160;Balanant, Mme&#160;Bannier, M.&#160;Barrot, M.&#160;Baudu, M.&#160;Berta, M.&#160;Bolo, M.&#160;Bourlanges, M.&#160;Bru, M.&#160;Cubertafon, Mme&#160;de Sarnez, Mme&#160;Deprez-Audebert, M.&#160;Duverg&#233;, Mme&#160;El Ha&#239;ry, Mme&#160;Essayan, M.&#160;Fanget, Mme&#160;Florennes, M.&#160;Fuchs, Mme&#160;Gallerneau, M.&#160;Garcia, Mme&#160;Jacquier-Laforge, M.&#160;Joncour, M.&#160;Lagleize, M.&#160;Lain&#233;, M.&#160;Laqhila, Mme&#160;Lasserre-David, M.&#160;Latombe, Mme&#160;Luquet, M.&#160;Mathiasin, M.&#160;Mattei, Mme&#160;Mette, M.&#160;Michel-Kleisbauer, M.&#160;Millienne, M.&#160;Pahun, M.&#160;Fr&#233;d&#233;ric&#160;Petit, Mme&#160;Maud&#160;Petit, Mme&#160;Poueyto, M.&#160;Ramos, M.&#160;Turquois, Mme&#160;Vichnievsky et M.&#160;Waserman"
  },
  "pointeurFragmentTexte": {
    "division": {
      "titre": "Article 7",
      "articleDesignationCourte": "ART. 7",
      "type": "ARTICLE",
      "avantAApres": "A",
      "divisionRattachee": "ARTICLE 7",
      "urlDivisionTexteVise": "/15/textes/1767.asp#D_Article_7"
    },
    "alinea": {
      "avantAApres": "Apres",
      "numero": "14"
    }
  },
  "corps": {
    "dispositif": "<p style=\"text-align: justify;\">Substituer aux alin&#233;as 14 &#224; 21 les cinq alin&#233;as suivants&#160;:</p><p style=\"text-align: justify;\"><i>&#171;&#160;aa)</i> Apr&#232;s le deuxi&#232;me alin&#233;a, sont ins&#233;r&#233;s quatre alin&#233;as ainsi r&#233;dig&#233;s&#160;:</p><p style=\"text-align: justify;\">&#171;&#160;Les actions des communaut&#233;s professionnelles territoriales de sant&#233; s&#8217;exercent en ad&#233;quation avec les objectifs du projet r&#233;gional de sant&#233; tel que mentionn&#233; &#224; l&#8217;article L.&#160;1434&#8209;1.</p><p style=\"text-align: justify;\">&#171;&#160;Elles sont le lieu de coordination des professionnels de sant&#233; au niveau du territoire concern&#233; avec une approche populationnelle.</p><p style=\"text-align: justify;\">&#171;&#160;Elles concourent, notamment,&#224; la mise en &#339;uvre d&#8217;actions de pr&#233;vention et &#224; la coordination des soins.</p><p style=\"text-align: justify;\">&#171;&#160;Elles sont les interlocuteurs des agences r&#233;gionales de sant&#233;, des collectivit&#233;s territoriales et des &#233;tablissements de soins pr&#233;sents sur le territoire concern&#233;.&#160;&#187;</p>",
    "exposeSommaire": "<p style=\"text-align: justify;\">Le pr&#233;sent amendement vise &#224; d&#233;finir, de mani&#232;re globale, dans le code de la sant&#233; publique, le champs d&#8217;intervention des communaut&#233;s professionnelles territoriales de sant&#233;, comme le recommande la mission IGAS 2018 sur les CPTS en proposant qu&#8217;un cadre g&#233;n&#233;ral de l&#8217;exercice en CPTS soit fix&#233;.</p><p style=\"text-align: justify;\">Ces pr&#233;cisions sont volontairement globales et larges, l&#8217;objectif n&#8217;&#233;tant pas de restreindre les initiatives des CPTS ou de complexifier leur mise en &#339;uvre. Cet amendement rappelle, par ailleurs, la responsabilit&#233; populationnelle qui incombe aux CPTS.</p>"
  },
  "representations": [
    {
      "nom": "PDF",
      "typeMime": {
        "type": "application",
        "subType": "PDF"
      },
      "statutRepresentation": {
        "verbatim": true,
        "canonique": true,
        "officielle": true,
        "transcription": false,
        "enregistrement": false
      },
      "contenu": {
        "documentURI": "/15/amendements/1767/AN/1792.pdf"
      }
    }
  ],
  "seanceDiscussion": "RUANR5L15S2019IDS21563",
  "sort": {
    "dateSaisie": "2019-03-21T18:15:24.000+01:00",
    "sortEnSeance": "Tombé"
  },
  "dateDepot": "2019-03-16T01:00:00.000+01:00",
  "dateDistribution": "2019-03-18T01:00:00.000+01:00",
  "article99": "0",
  "loiReference": {}
}