{
  "uid": "AMANR5L15PO420120B2296P0D1N873",
  "identifiant": {
    "legislature": "15",
    "numero": "873",
    "numRect": "0",
    "saisine": {
      "texteLegislatifRef": "PRJLANR5L15B2296",
      "numeroPartiePLF": "0",
      "organeExamen": "PO420120",
      "mentionSecondeDeliberation": "0"
    }
  },
  "numeroLong": "AS873",
  "etapeTexte": "1ère lecture (1ère assemblée saisie)",
  "triAmendement": "jiaaaaaaaaaaaaaaaaaaaaaaaaaaaaaaaaaaaaaaaaaaaaaaaaao",
  "cardinaliteAmdtMultiples": "1",
  "etat": "En traitement",
  "signataires": {
    "auteur": {
      "typeAuteur": "Depute",
      "acteurRef": "PA720924",
      "groupePolitiqueRef": "PO730970"
    },
    "cosignatairesRefs": [
      "PA721924",
      "PA720924"
    ],
    "texteAffichable": "Mme&#160;Elimas et Mme&#160;de Vaucouleurs"
  },
  "pointeurFragmentTexte": {
    "division": {
      "titre": "Article 45",
      "articleDesignationCourte": "APRÈS ART. 45",
      "type": "ARTICLE",
      "avantAApres": "Apres",
      "divisionRattachee": "APRÈS L'ARTICLE 45, insérer l'article suivant:",
      "articleAdditionnel": "1",
      "urlDivisionTexteVise": "/15/textes/2296.asp#D_Article_45"
    }
  },
  "corps": {
    "dispositif": "<p style=\"text-align: justify;\">I. &#160;&#8211;&#160;&#192; l&#8217;article&#160;81 du code g&#233;n&#233;ral des imp&#244;ts, apr&#232;s le 9&#176;&#160;<i>ter</i>, ins&#233;rer un alin&#233;a ainsi r&#233;dig&#233;&#160;:</p><p style=\"text-align: justify;\">&#171;&#160;9&#176;&#160;<i>quater</i>&#160;Les sommes per&#231;ues &#224; titre de d&#233;dommagement par les aidants familiaux, dans les conditions pr&#233;vues &#224; l&#8217;article L.&#160;245&#8209;12 du code de l&#8217;action sociale et des familles.&#160;&#187;</p><p style=\"text-align: justify;\">II.&#160;&#8211;&#160;La perte de recettes pour l&#8217;&#201;tat est compens&#233;e &#224; due concurrence par la cr&#233;ation d&#8217;une taxe additionnelle aux droits mentionn&#233;s aux articles 575 et 575 A du code g&#233;n&#233;ral des imp&#244;ts.</p><p style=\"text-align: justify;\">III.&#160;&#8211;&#160;La perte de recettes pour les organismes de s&#233;curit&#233; sociale est compens&#233;e &#224; due concurrence par la majoration des droits mentionn&#233;s aux articles 575 et 575 A du code g&#233;n&#233;ral des imp&#244;ts.</p>",
    "exposeSommaire": "<p style=\"text-align: justify;\">Un rescrit de l&#8217;administration fiscale (n&#176;&#160;2007&#8209;26 du 24/07/07) pr&#233;cise que les sommes per&#231;ues en tant que d&#233;dommagement par les aidants familiaux au titre de la prestation de compensation du handicap, sont imposables en tant que b&#233;n&#233;fices non commerciaux.</p><p style=\"text-align: justify;\">Cette imposition abaisse de fait le niveau de d&#233;dommagement, d&#233;j&#224; faible, de ces derniers.</p><p style=\"text-align: justify;\">De plus, ce d&#233;dommagement est soumis aux pr&#233;l&#232;vements sociaux (CSG, CRDS), ce qui diminue d&#8217;autant (9,7&#160;%) le montant effectivement per&#231;u par l&#8217;aidant ainsi d&#233;dommag&#233;.</p><p style=\"text-align: justify;\">Par ailleurs, cette fiscalit&#233; peut impacter d&#8217;autres aides auxquelles peut pr&#233;tendre la famille, le foyer fiscal. En effet, la prise en compte par les Caisses d&#8217;allocations familiales (CAF) de tous les revenus imposables peut conduire &#224; une r&#233;duction voire une suppression des allocations soumises &#224; conditions de ressources (Allocation Personnalis&#233;e au Logement, Allocation de Rentr&#233;e Scolaire...).</p><p style=\"text-align: justify;\">Cette prise de position de l&#8217;administration fiscale est contraire &#224; l&#8217;esprit de la loi du 11 f&#233;vrier 2005 qui vise &#224; reconna&#238;tre le r&#244;le important qu&#8217;assurent les aidants familiaux en permettant &#224; leurs proches handicap&#233;s de les d&#233;dommager (aux tarifs de 3,90&#160;euros/heure ou 5,84&#160;euros/heure suivant les circonstances).</p><p style=\"text-align: justify;\">Afin de mettre fin &#224; cette situation, il est propos&#233;, en concertation avec APF France handicap, qu&#8217;&#224; l&#8217;instar de la prestation de compensation en tant que telle, les sommes vers&#233;es &#224; titre de d&#233;dommagement aux aidants familiaux des personnes handicap&#233;es, par le biais de cette prestation, soient explicitement exon&#233;r&#233;es de l&#8217;imp&#244;t sur le revenu.</p><p style=\"text-align: justify;\">&#160;</p>",
    "cartoucheDelaiDepotDepasse": "Sous réserve de son traitement par les services de l'Assemblée nationale et de sa recevabilité"
  },
  "representations": [
    {
      "nom": "PDF",
      "typeMime": {
        "type": "application",
        "subType": "PDF"
      },
      "statutRepresentation": {
        "verbatim": true,
        "canonique": true,
        "officielle": true,
        "transcription": false,
        "enregistrement": false
      },
      "contenu": {
        "documentURI": "/15/amendements/2296/CION-SOC/AS873.pdf"
      }
    }
  ],
  "dateDepot": "2019-10-11T02:00:00.000+02:00",
  "dateDistribution": "2019-10-12T02:00:00.000+02:00",
  "article99": "0",
  "loiReference": {
    "codeLoi": "CGI",
    "divisionCodeLoi": "81"
  }
}