{
  "uid": "AMANR5L15SEA717460B1371P0D1N37",
  "identifiant": {
    "legislature": "15",
    "numero": "37",
    "numRect": "0",
    "saisine": {
      "texteLegislatifRef": "PRJLANR5L15B1371",
      "numeroPartiePLF": "0",
      "organeExamen": "PO717460",
      "mentionSecondeDeliberation": "0"
    }
  },
  "numeroLong": "37",
  "etapeTexte": "1ère lecture (1ère assemblée saisie)",
  "triAmendement": "jiaaaaaaaaaaaaaaaaaaaaaaaaaaaaaaaaaaaaaaaaaaaaaaaainxi",
  "cardinaliteAmdtMultiples": "1",
  "etat": "Discuté",
  "signataires": {
    "auteur": {
      "typeAuteur": "Depute",
      "acteurRef": "PA1874",
      "groupePolitiqueRef": "PO730934"
    },
    "cosignatairesRefs": [
      "PA720586",
      "PA721410",
      "PA330684",
      "PA266793",
      "PA720210",
      "PA346218",
      "PA608416",
      "PA2086",
      "PA267429",
      "PA2492",
      "PA718838",
      "PA267204",
      "PA340853",
      "PA267901",
      "PA719318",
      "PA720386",
      "PA718884",
      "PA605036",
      "PA720684",
      "PA2529",
      "PA642847",
      "PA1874",
      "PA709315",
      "PA721636",
      "PA718850",
      "PA606712",
      "PA267735",
      "PA607090",
      "PA718780",
      "PA267527",
      "PA2377",
      "PA609245",
      "PA334654",
      "PA609726"
    ],
    "texteAffichable": "M.&#160;Le Fur,  M.&#160;Abad, Mme&#160;Anthoine, M.&#160;Aubert, M.&#160;Bazin, Mme&#160;Bazin-Malgras, Mme&#160;Beauvais, Mme&#160;Bonnivard, M.&#160;Bony, Mme&#160;Val&#233;rie&#160;Boyer, M.&#160;Brun, M.&#160;Cinieri, M.&#160;Cordier, M.&#160;Di Filippo, M.&#160;Pierre-Henri&#160;Dumont, M.&#160;de Ganay, M.&#160;Hetzel, M.&#160;Kamardine, Mme&#160;Lacroute, M.&#160;Leclerc, M.&#160;Lurton, M.&#160;Marlin, M.&#160;Masson, M.&#160;Parigi, M.&#160;Perrut, M.&#160;Quentin, M.&#160;Reitzer, M.&#160;Saddier, M.&#160;Sermier, M.&#160;Straumann, Mme&#160;Trastour-Isnart, M.&#160;Vatin, M.&#160;Viala et M.&#160;Jean-Pierre&#160;Vigier"
  },
  "pointeurFragmentTexte": {
    "division": {
      "titre": "Article 8",
      "articleDesignationCourte": "APRÈS ART. 8",
      "type": "ARTICLE",
      "avantAApres": "Apres",
      "divisionRattachee": "APRÈS L'ARTICLE 8, insérer l'article suivant:",
      "articleAdditionnel": "1",
      "urlDivisionTexteVise": "/15/textes/1371.asp#D_Article_8"
    }
  },
  "corps": {
    "dispositif": "<p style=\"text-align: justify;\">I.&#160;&#8211;&#160;Apr&#232;s l&#8217;article&#160;267&#160;<i>bis</i> du code g&#233;n&#233;ral des imp&#244;ts, il est ins&#233;r&#233; un article&#160;267&#160;<i>ter</i> ainsi r&#233;dig&#233;&#160;:</p><p style=\"text-align: justify;\">&#171;<i>&#160;Art.&#160;267</i>&#160;ter.&#160;&#8211;&#160;Les imp&#244;ts, taxes, droits et pr&#233;l&#232;vements de toute nature sont exclus de la base d&#8217;imposition de la taxe sur la valeur ajout&#233;e pour la fourniture d&#8217;eau, de gaz par le r&#233;seau de distribution de gaz naturel, et d&#8217;&#233;lectricit&#233;.&#160;&#187;</p><p style=\"text-align: justify;\">II.&#160;&#8211;&#160;Le I est applicable &#224; compter du 1<sup>er</sup> janvier 2019.</p><p style=\"text-align: justify;\">III.&#160;&#8211;&#160;La perte de recettes pour l&#8217;&#201;tat est compens&#233;e &#224; due concurrence par la cr&#233;ation d&#8217;une taxe additionnelle aux droits mentionn&#233;s aux articles&#160;575 et&#160;575&#160;A du code g&#233;n&#233;ral des imp&#244;ts.</p>",
    "exposeSommaire": "<p style=\"text-align: justify;\">Selon l&#8217;article&#160;256 du code g&#233;n&#233;ral des imp&#244;ts, &#171;&#160;sont soumises &#224; la TVA les livraisons de biens et les prestations de service effectu&#233;es &#224; titre on&#233;reux par un sujet assujetti agissant en tant que tel&#160;&#187;. il en r&#233;sulte que la TVA repr&#233;sente la recette fiscale la plus importante pour l&#8217;&#201;tat et sauf exon&#233;ration pr&#233;vue par la loi, l&#8217;essentiel des biens consomm&#233;s et des services fournis, y est assujetti.</p><p style=\"text-align: justify;\">En outre, cette taxe a une base d&#8217;imposition extr&#234;mement large, pr&#233;cis&#233;e par l&#8217;article&#160;267 du CGI pr&#233;cit&#233; et qui comprend &#171;&#160;les imp&#244;ts, taxes et droits de pr&#233;l&#232;vements de toute nature&#160;&#187;. Dans les faits les Fran&#231;ais acquittent la TVA sur un bien ou un service d&#233;j&#224; soumis &#224; une autre taxe ou &#224; un autre pr&#233;l&#232;vement. Ainsi, en mati&#232;re d&#8217;&#233;nergie &#233;lectrique, le fournisseur r&#233;percute sur le prix de vente, les taxes auxquelles il est soumis (comme notamment la contribution forfaitaire d&#8217;acheminement) et prend en compte les consommations et les taxes pay&#233;es pour bases de calcul du montant de la TVA &#224; acquitter par le consommateur.</p><p style=\"text-align: justify;\">Ainsi, une &#171;&#160;double peine&#160;&#187; est appliqu&#233;e &#224; ce dernier qui paye une taxe sur les taxes. Alors que nombre de nos concitoyens doivent faire face &#224; une augmentation de la contribution sociale g&#233;n&#233;ralis&#233;e (CSG), les fragilisant et amputant injustement leur pouvoir d&#8217;achat, il appara&#238;t essentiel d&#8217;exclure de la base d&#8217;imposition de la TVA, toutes les taxes et imp&#244;ts divers appliqu&#233;s aux biens de premi&#232;res n&#233;cessit&#233; que sont l&#8217;&#233;lectricit&#233;, le gaz et l&#8217;eau.</p><p style=\"text-align: justify;\">C&#8217;est pourquoi, le pr&#233;sent amendement vise &#224; compl&#233;ter le code g&#233;n&#233;ral des imp&#244;ts en y introduisant un article&#160;267&#160;ter qui exclut de la base d&#8217;imposition de la TVA, les dites taxes pour la fourniture d&#8217;&#233;lectricit&#233;, de gaz et d&#8217;eau.</p>"
  },
  "representations": [
    {
      "nom": "PDF",
      "typeMime": {
        "type": "application",
        "subType": "PDF"
      },
      "statutRepresentation": {
        "verbatim": true,
        "canonique": true,
        "officielle": true,
        "transcription": false,
        "enregistrement": false
      },
      "contenu": {
        "documentURI": "/15/amendements/1371/AN/37.pdf"
      }
    }
  ],
  "seanceDiscussion": "RUANR5L15S2019IDS21366",
  "sort": {
    "dateSaisie": "2018-11-13T01:47:42.000+01:00",
    "sortEnSeance": "Rejeté"
  },
  "dateDepot": "2018-11-08T01:00:00.000+01:00",
  "dateDistribution": "2018-11-12T01:00:00.000+01:00",
  "article99": "0",
  "loiReference": {
    "codeLoi": "CGI",
    "divisionCodeLoi": "267 ter"
  }
}