{
  "uid": "AMANR5L15SEA717460BTC1761P0D1N749",
  "identifiant": {
    "legislature": "15",
    "numero": "749",
    "numRect": "0",
    "saisine": {
      "texteLegislatifRef": "PRJLANR5L15BTC1761",
      "numeroPartiePLF": "0",
      "organeExamen": "PO717460",
      "mentionSecondeDeliberation": "0"
    }
  },
  "numeroLong": "749",
  "etapeTexte": "Nouvelle Lecture",
  "triAmendement": "aesaaaaaaaaaaaaaaaaaaaaaaaaaaaaaaaaaaaaaaaaaaaaaaabbcdy",
  "cardinaliteAmdtMultiples": "1",
  "etat": "Discuté",
  "signataires": {
    "auteur": {
      "typeAuteur": "Depute",
      "acteurRef": "PA608016",
      "groupePolitiqueRef": "PO730934"
    },
    "cosignatairesRefs": [
      "PA642847",
      "PA608016",
      "PA720644",
      "PA721474",
      "PA332523"
    ],
    "texteAffichable": "Mme&#160;Louwagie,  M.&#160;Bazin, M.&#160;Viry, Mme&#160;Dalloz et M.&#160;Nury"
  },
  "pointeurFragmentTexte": {
    "division": {
      "titre": "Article 6",
      "articleDesignationCourte": "ART. 6",
      "type": "ARTICLE",
      "avantAApres": "A",
      "divisionRattachee": "ARTICLE 6",
      "urlDivisionTexteVise": "/15/textes/1761.asp#D_Article_6"
    },
    "alinea": {
      "avantAApres": "A",
      "numero": "5",
      "alineaDesignation": "Alinéa 5"
    }
  },
  "corps": {
    "dispositif": "<p style=\"text-align: justify;\">I.&#160;&#8211;&#160;&#192; l&#8217;alin&#233;a&#160;5, apr&#232;s le mot&#160;: &#171;&#160;correspond&#160;&#187;, substituer aux mots&#160;:</p><p style=\"text-align: justify;\">&#171;&#160;&#224; la moyenne du nombre de personnes employ&#233;es au cours de chacun des mois&#160;&#187;</p><p style=\"text-align: justify;\">les mots&#160;:</p><p style=\"text-align: justify;\">&#171;&#160;au nombre de personnes le plus faible enregistr&#233; sur un trimestre au cours&#160;&#187;.</p><p style=\"text-align: justify;\">II.&#160;&#8211;&#160;Compl&#233;ter cet article par les deux alin&#233;as suivants&#160;:</p><p style=\"text-align: justify;\">&#171;&#160;XII.&#160;&#8211;&#160;La perte de recettes pour l&#8217;&#201;tat est compens&#233;e &#224; due concurrence par la cr&#233;ation d&#8217;une taxe additionnelle aux droits mentionn&#233;s aux articles 575 et 575 A du code g&#233;n&#233;ral des imp&#244;ts.</p><p style=\"text-align: justify;\">&#171;&#160;XIII.&#160;&#8211;&#160;La perte de recettes pour les organismes de s&#233;curit&#233; sociale est compens&#233;e &#224; due concurrence par la majoration des droits mentionn&#233;s aux articles 575 et 575 A du code g&#233;n&#233;ral des imp&#244;ts.&#160;&#187;</p>",
    "exposeSommaire": "<p style=\"text-align: justify;\">Le texte soumis &#224; notre examen se veut avoir pour philosophie globale de faciliter la vie des entreprises afin de lever les entraves &#224; la cr&#233;ation de richesses et de valeur. Aussi, il faut proposer une m&#233;thode de calcul des effectifs qui soit simple, favorable et &#233;vite aux dirigeants de faire des choix en fonction des effets de seuil.</p><p style=\"text-align: justify;\">&#192; cet &#233;gard il convient de ne pas retenir la moyenne des fluctuations d&#8217;effectifs au cours de chacun des mois pour pr&#233;f&#233;rer comptabiliser l&#8217;effectif le plus faible sur un trimestre. En m&#234;me temps, ce choix, meilleur pour l&#8217;entreprise, ne l&#232;se pas les salari&#233;s.</p>"
  },
  "representations": [
    {
      "nom": "PDF",
      "typeMime": {
        "type": "application",
        "subType": "PDF"
      },
      "statutRepresentation": {
        "verbatim": true,
        "canonique": true,
        "officielle": true,
        "transcription": false,
        "enregistrement": false
      },
      "contenu": {
        "documentURI": "/15/amendements/1761/AN/749.pdf"
      }
    }
  ],
  "seanceDiscussion": "RUANR5L15S2019IDS21551",
  "sort": {
    "dateSaisie": "2019-03-15T11:09:11.000+01:00",
    "sortEnSeance": "Rejeté"
  },
  "dateDepot": "2019-03-11T01:00:00.000+01:00",
  "dateDistribution": "2019-03-13T01:00:00.000+01:00",
  "article99": "0",
  "loiReference": {}
}