{
  "uid": "AMANR5L15SEA717460B0235P2D1N225",
  "identifiant": {
    "legislature": "15",
    "numero": "225",
    "numRect": "0",
    "saisine": {
      "texteLegislatifRef": "PRJLANR5L15B0235",
      "numeroPartiePLF": "2",
      "organeExamen": "PO717460",
      "mentionSecondeDeliberation": "0"
    }
  },
  "numeroLong": "II-225",
  "etapeTexte": "1ère lecture (1ère assemblée saisie)",
  "triAmendement": "i",
  "cardinaliteAmdtMultiples": "1",
  "etat": "Discuté",
  "signataires": {
    "auteur": {
      "typeAuteur": "Depute",
      "acteurRef": "PA709315",
      "groupePolitiqueRef": "PO730934"
    },
    "cosignatairesRefs": [
      "PA606712",
      "PA609245",
      "PA1327",
      "PA721968",
      "PA267735",
      "PA608016",
      "PA719946",
      "PA720630",
      "PA609726",
      "PA334654",
      "PA608416",
      "PA718884",
      "PA718780",
      "PA1874",
      "PA267204",
      "PA642847",
      "PA643134",
      "PA720684",
      "PA340853",
      "PA2377",
      "PA718838",
      "PA266797",
      "PA607090",
      "PA330684",
      "PA709315"
    ],
    "texteAffichable": "M.&#160;Viala,  M.&#160;Lurton, M.&#160;Sermier, M.&#160;Straumann, M.&#160;Peltier, Mme&#160;Val&#233;rie&#160;Boyer, Mme&#160;Bazin-Malgras, M.&#160;Le Fur, M.&#160;Brun, Mme&#160;Valentin, M.&#160;Bazin, M.&#160;Hetzel, M.&#160;Minot, M.&#160;Perrut, M.&#160;Leclerc, M.&#160;Vialay, M.&#160;Aubert, M.&#160;Jean-Pierre&#160;Vigier, Mme&#160;Louwagie, M.&#160;Gosselin, M.&#160;de Ganay, M.&#160;Pierre-Henri&#160;Dumont, M.&#160;Forissier, Mme&#160;Trastour-Isnart et Mme&#160;Lacroute"
  },
  "pointeurFragmentTexte": {
    "missionVisee": {
      "idMissionAN": "26",
      "libelleMission": "Relations avec les collectivités territoriales",
      "codeMissionPLF": "B",
      "libelleMissionPLF": "Répartition, par mission et programme, des crédits du budget général"
    },
    "division": {
      "titre": "Article 58",
      "articleDesignationCourte": "ART. 58",
      "type": "ARTICLE",
      "avantAApres": "A",
      "divisionRattachee": "ARTICLE 58",
      "urlDivisionTexteVise": "/15/textes/0235C.asp#D_Article_58"
    },
    "alinea": {
      "avantAApres": "Apres",
      "numero": "2"
    }
  },
  "corps": {
    "dispositif": "<p style=\"text-align: justify;\">Compl&#233;ter cet article par l&#8217;alin&#233;a suivant&#160;:</p><p style=\"text-align: justify;\">&#171;&#160;Un d&#233;cret fixe de mani&#232;re pr&#233;cise et d&#233;taill&#233;e les moyens allou&#233;s &#224; ce fonds.&#160;&#187;</p>",
    "exposeSommaire": "<p style=\"text-align: justify;\">Le Fonds de compensation pour la taxe sur la valeur ajout&#233;e compense de mani&#232;re forfaitaire la TVA que les b&#233;n&#233;ficiaires du fond ont acquitt&#233;e sur certaines de leurs d&#233;penses et qu&#8217;ils ne peuvent pas r&#233;cup&#233;rer par voie fiscale.</p><p style=\"text-align: justify;\">Concernant l&#8217;automatisation du Fonds de compensation pour la taxe sur la valeur ajout&#233;e (FCTVA), il appara&#238;t que les conditions d&#8217;&#233;quivalence par rapport aux pr&#233;c&#233;dents moyens allou&#233;s aux r&#233;gions ne soient pas r&#233;unies. De plus, ce fond ne parvient pas &#224; compenser la perte subie par les collectivit&#233;s territoriales du fait de la suppression du dispositif transitoire sous la forme du fond de 450 millions d&#8217;euros. Ce dernier visait &#224; financer leur nouvelle comp&#233;tence de d&#233;veloppement &#233;conomique. Le Gouvernement actuel estime que les r&#233;gions b&#233;n&#233;ficieront d&#233;j&#224; du dynamisme naturel de leur nouvelle fraction de TVA&#160;&#8211;&#160;estim&#233; entre 100 et 150 millions d&#8217;euros annuels&#160;&#8211;&#160;et n&#8217;a donc pas inclus ces 450 millions d&#8217;euros dans le calcul, occasionnant une perte s&#232;che de ressources pour les r&#233;gions. Ce faisant, il importe de pr&#233;ciser les moyens allou&#233;s par ce fond et de s&#8217;assurer que les r&#233;gions soient accompagn&#233;es dans les m&#234;mes conditions que celles promises il y a quelques mois.</p><p style=\"text-align: justify;\">Ainsi, les contributions de l&#8217;&#201;tat doivent &#234;tre maintenues &#224; un niveau suffisant afin de prolonger la mont&#233;e en gamme des entreprises et des fili&#232;res &#233;mergentes, porteuses de l&#8217;&#233;conomie de demain. Il est n&#233;cessaire de maintenir l&#8217;investissement sur l&#8217;ensemble du territoire dans le but de garantir des ressources dynamiques pour tous. Ce sont autant de secteurs comme l&#8217;industrie, les services, et m&#234;me l&#8217;&#233;ducation qui doivent pouvoir b&#233;n&#233;ficier de ces progr&#232;s.</p><p style=\"text-align: justify;\">Dans ces relations avec les collectivit&#233;s territoriales, les enjeux sont multiples et n&#233;cessitent notre plus grande attention, d&#8217;o&#249; la n&#233;cessit&#233; de pr&#233;ciser de mani&#232;re pr&#233;cise et d&#233;taill&#233;e les moyens qui sont allou&#233;s &#224; ce fonds. Cela permettra une meilleure visibilit&#233; et compr&#233;hension pour les acteurs locaux.</p>"
  },
  "representations": [
    {
      "nom": "PDF",
      "typeMime": {
        "type": "application",
        "subType": "PDF"
      },
      "statutRepresentation": {
        "verbatim": true,
        "canonique": true,
        "officielle": true,
        "transcription": false,
        "enregistrement": false
      },
      "contenu": {
        "documentURI": "/15/amendements/0235C/AN/225.pdf"
      }
    }
  ],
  "seanceDiscussion": "RUANR5L15S2018IDS20759",
  "sort": {
    "dateSaisie": "2017-11-15T01:14:30.000+01:00",
    "sortEnSeance": "Rejeté"
  },
  "dateDepot": "2017-10-27T02:00:00.000+02:00",
  "dateDistribution": "2017-11-13T01:00:00.000+01:00",
  "article99": "0",
  "loiReference": {}
}