{
  "uid": "AMANR5L15PO419865B1393P0D1N295",
  "identifiant": {
    "legislature": "15",
    "numero": "295",
    "numRect": "0",
    "saisine": {
      "texteLegislatifRef": "PIONANR5L15B1393",
      "numeroPartiePLF": "0",
      "organeExamen": "PO419865",
      "mentionSecondeDeliberation": "0"
    }
  },
  "numeroLong": "CD295",
  "etapeTexte": "1ère lecture (2ème assemblée saisie)",
  "triAmendement": "biaaaaaaaaaaaaaaaaaaaaaaaaaaaaaaaaaaaaaaaaaaaaaaaaozv",
  "cardinaliteAmdtMultiples": "1",
  "etat": "Discuté",
  "signataires": {
    "auteur": {
      "typeAuteur": "Depute",
      "acteurRef": "PA719186",
      "groupePolitiqueRef": "PO730964"
    },
    "cosignatairesRefs": [
      "PA721246",
      "PA718728",
      "PA720074",
      "PA718810",
      "PA719910",
      "PA720538",
      "PA719330",
      "PA719890",
      "PA722118",
      "PA719512",
      "PA721726",
      "PA719186",
      "PA606639"
    ],
    "texteAffichable": "Mme&#160;Khattabi,  Mme&#160;Gaillot, M.&#160;Belhamiti, Mme&#160;Robert, M.&#160;Gouttefarde, Mme&#160;Mauborgne, Mme&#160;Vignon, Mme&#160;Sylla, Mme&#160;Janvier, M.&#160;Vignal, Mme&#160;Vanceunebrock-Mialon, Mme&#160;Brulebois et Mme&#160;De Temmerman"
  },
  "pointeurFragmentTexte": {
    "division": {
      "titre": "Article 3",
      "articleDesignationCourte": "ART. 3",
      "type": "ARTICLE",
      "avantAApres": "A",
      "divisionRattachee": "ARTICLE 3",
      "urlDivisionTexteVise": "/15/textes/1393.asp#D_Article_3"
    },
    "alinea": {
      "numero": "8"
    }
  },
  "corps": {
    "dispositif": "<p>Compl&#233;ter l&#8217;alin&#233;a&#160;8 par la phrase suivante&#160;:</p><p>&#171;&#160;Si le conseil d&#8217;administration compte un nombre impair de membres, la pr&#233;sidence est assur&#233;e par une personne du sexe le moins repr&#233;sent&#233;.&#160;&#187;</p>",
    "exposeSommaire": "<p style=\"text-align: justify;\">Dans la continuit&#233; de l&#8217;alin&#233;a&#160;7 qui garantit une juste repr&#233;sentation des femmes et des hommes au sein du conseil d&#8217;administration de l&#8217;Agence nationale de la coh&#233;sion des territoires, le pr&#233;sent amendement vise &#224; &#233;lire &#224; la t&#234;te de ce dernier une personne du sexe le moins repr&#233;sent&#233;, dans le cas o&#249; le conseil d&#8217;administration totalise un nombre impair de membres.</p>"
  },
  "representations": [
    {
      "nom": "PDF",
      "typeMime": {
        "type": "application",
        "subType": "PDF"
      },
      "statutRepresentation": {
        "verbatim": true,
        "canonique": true,
        "officielle": true,
        "transcription": false,
        "enregistrement": false
      },
      "contenu": {
        "documentURI": "/15/amendements/1393/CION-DVP/CD295.pdf"
      }
    }
  ],
  "sort": {
    "dateSaisie": "2019-02-06T00:07:08.000+01:00",
    "sortEnSeance": "Rejeté"
  },
  "dateDepot": "2019-02-01T01:00:00.000+01:00",
  "dateDistribution": "2019-02-01T01:00:00.000+01:00",
  "article99": "0",
  "loiReference": {}
}