{
  "uid": "AMANR5L15PO59051B2357P0D1N1182",
  "identifiant": {
    "legislature": "15",
    "numero": "1182",
    "numRect": "0",
    "saisine": {
      "texteLegislatifRef": "PRJLANR5L15B2357",
      "numeroPartiePLF": "0",
      "organeExamen": "PO59051",
      "mentionSecondeDeliberation": "0"
    }
  },
  "numeroLong": "CL1182",
  "etapeTexte": "1ère lecture (2ème assemblée saisie)",
  "triAmendement": "dqaaaaaaaaaaaaaaaaaaaaaaaaaaaaaaaaaaaaaaaaaaaaaaaaq",
  "cardinaliteAmdtMultiples": "1",
  "etat": "Discuté",
  "signataires": {
    "auteur": {
      "typeAuteur": "Depute",
      "acteurRef": "PA643127",
      "groupePolitiqueRef": "PO730964"
    },
    "cosignatairesRefs": [
      "PA643127"
    ],
    "texteAffichable": "M.&#160;Questel, rapporteur"
  },
  "pointeurFragmentTexte": {
    "division": {
      "titre": "Article 11 nonies",
      "articleDesignationCourte": "ART. 11 NONIES",
      "type": "ARTICLE",
      "avantAApres": "A",
      "divisionRattachee": "ARTICLE 11 NONIES",
      "urlDivisionTexteVise": "/15/textes/2357.asp#D_Article_11_nonies"
    },
    "alinea": {
      "avantAApres": "Apres",
      "numero": "21"
    }
  },
  "corps": {
    "dispositif": "<p style=\"text-align: justify;\">Compl&#233;ter cet article par l&#8217;alin&#233;a suivant&#160;:</p><p style=\"text-align: justify;\">&#171;&#160;IV.&#160;&#8211;&#160;Le&#160;I du pr&#233;sent article est applicable en Polyn&#233;sie fran&#231;aise.&#160;&#187;</p>",
    "exposeSommaire": "<p>Cet amendement rend applicable&#160; l&#8217;article L. 2121-2-1 nouveau &#224; la Polyn&#233;sie fran&#231;aise.&#160;</p>"
  },
  "representations": [
    {
      "nom": "PDF",
      "typeMime": {
        "type": "application",
        "subType": "PDF"
      },
      "statutRepresentation": {
        "verbatim": true,
        "canonique": true,
        "officielle": true,
        "transcription": false,
        "enregistrement": false
      },
      "contenu": {
        "documentURI": "/15/amendements/2357/CION_LOIS/CL1182.pdf"
      }
    }
  ],
  "sort": {
    "dateSaisie": "2019-11-07T12:38:01.000+01:00",
    "sortEnSeance": "Adopté"
  },
  "dateDepot": "2019-11-04T01:00:00.000+01:00",
  "dateDistribution": "2019-11-05T01:00:00.000+01:00",
  "article99": "0",
  "loiReference": {}
}