{
  "uid": "AMANR5L15SEA717460BTC2243P0D1N981",
  "identifiant": {
    "legislature": "15",
    "numero": "981",
    "numRect": "0",
    "saisine": {
      "texteLegislatifRef": "PRJLANR5L15BTC2243",
      "numeroPartiePLF": "0",
      "organeExamen": "PO717460",
      "mentionSecondeDeliberation": "0"
    }
  },
  "numeroLong": "981",
  "etapeTexte": "1ère lecture (1ère assemblée saisie)",
  "triAmendement": "auaaaaaaaaaaaaaaaaaaaaaaaaaaaaaaaaaaaaaaaaaaaaaaaahklzu",
  "cardinaliteAmdtMultiples": "1",
  "etat": "Discuté",
  "signataires": {
    "auteur": {
      "typeAuteur": "Depute",
      "acteurRef": "PA1874",
      "groupePolitiqueRef": "PO730934"
    },
    "cosignatairesRefs": [
      "PA722390",
      "PA608016",
      "PA330684",
      "PA2492",
      "PA1874",
      "PA719318",
      "PA609726"
    ],
    "texteAffichable": "M.&#160;Le Fur,  Mme&#160;Anthoine, Mme&#160;Val&#233;rie&#160;Boyer, Mme&#160;Corneloup, Mme&#160;Louwagie, M.&#160;Quentin et M.&#160;Aubert"
  },
  "pointeurFragmentTexte": {
    "division": {
      "titre": "Article 4",
      "articleDesignationCourte": "ART. 4",
      "type": "ARTICLE",
      "avantAApres": "A",
      "divisionRattachee": "ARTICLE 4",
      "urlDivisionTexteVise": "/15/textes/2243.asp#D_Article_4"
    },
    "alinea": {
      "avantAApres": "A",
      "numero": "21",
      "alineaDesignation": "Alinéa 21"
    }
  },
  "corps": {
    "dispositif": "<p style=\"text-align: justify;\">Substituer aux alin&#233;as <span  data-cid=\"17\"   data-time=\"1568715277493\">21 et 22</span> l&#8217;alin&#233;a suivant&#160;:</p><p style=\"text-align: justify;\">&#171;&#160;La filiation de l&#8217;enfant issu d&#8217;une assistance m&#233;dicale &#224; la procr&#233;ation est &#233;tablie &#224; l&#8217;&#233;gard de la femme qui accouche conform&#233;ment &#224; l&#8217;article&#160;311&#8209;25 du code civil. Si l&#8217;autre membre du couple est un homme, la filiation est &#233;tablie &#224; son &#233;gard par la pr&#233;somption de paternit&#233; ou par la reconnaissance&#160;dans les conditions de la section 2 du chapitre II du titre VII du livre premier du code civil, sous r&#233;serve de l&#8217;application des dispositions sp&#233;ciales du pr&#233;sent chapitre. Si l&#8217;autre membre du couple est une femme,&#160;la filiation est &#233;tablie &#224; son &#233;gard par une adoption pl&#233;ni&#232;re si les conditions sont r&#233;unies.&#160;&#187;</p>",
    "exposeSommaire": "<p style=\"text-align: justify;\">Cet amendement vise &#224; maintenir le syst&#232;me actuel d&#8217;&#233;tablissement du lien de filiation de l&#8217;enfant issu d&#8217;une assistance m&#233;dicale &#224; la procr&#233;ation avec tiers donneur dans les couples hommes femmes.</p><p style=\"text-align: justify;\">Concernant les couples de femmes, la filiation est &#233;tablie &#224; l&#8217;&#233;gard de la femme qui accouche conform&#233;ment &#224; l&#8217;article&#160;311&#8209;25 du Code civil et &#224; l&#8217;&#233;gard de l&#8217;autre femme par une adoption pl&#233;ni&#232;re. Puisque, conform&#233;ment &#224; l&#8217;article&#160;358 du Code civil, l&#8217;adopt&#233; en forme pl&#233;ni&#232;re a les m&#234;mes droits que l&#8217;enfant ayant sa filiation &#233;tablie par l&#8217;un des modes du titre VII du livre premier, cette solution est satisfaisante.</p>"
  },
  "representations": [
    {
      "nom": "PDF",
      "typeMime": {
        "type": "application",
        "subType": "PDF"
      },
      "statutRepresentation": {
        "verbatim": true,
        "canonique": true,
        "officielle": true,
        "transcription": false,
        "enregistrement": false
      },
      "contenu": {
        "documentURI": "/15/amendements/2243/AN/981.pdf"
      }
    }
  ],
  "seanceDiscussion": "RUANR5L15S2020IDS21845",
  "sort": {
    "dateSaisie": "2019-10-03T18:36:52.000+02:00",
    "sortEnSeance": "Non soutenu"
  },
  "dateDepot": "2019-09-18T02:00:00.000+02:00",
  "dateDistribution": "2019-09-25T02:00:00.000+02:00",
  "article99": "0",
  "loiReference": {}
}