{
  "uid": "AMANR5L15PO59051B1802P0D1N516",
  "identifiant": {
    "legislature": "15",
    "numero": "516",
    "numRect": "0",
    "saisine": {
      "texteLegislatifRef": "PRJLANR5L15B1802",
      "numeroPartiePLF": "0",
      "organeExamen": "PO59051",
      "mentionSecondeDeliberation": "0"
    }
  },
  "numeroLong": "CL516",
  "etapeTexte": "1ère lecture (1ère assemblée saisie)",
  "triAmendement": "bgaaaaaaaaaaaaaaaaaaaaaaaaaaaaaaaaaaaaaaaaaaaaaaaaawo",
  "cardinaliteAmdtMultiples": "1",
  "etat": "Discuté",
  "signataires": {
    "auteur": {
      "typeAuteur": "Depute",
      "acteurRef": "PA335054",
      "groupePolitiqueRef": "PO758835"
    },
    "cosignatairesRefs": [
      "PA1008",
      "PA267233",
      "PA332614",
      "PA610681",
      "PA1809",
      "PA720988",
      "PA608172",
      "PA642764",
      "PA337483",
      "PA340343",
      "PA508",
      "PA342415",
      "PA333818",
      "PA608011",
      "PA335054",
      "PA1198",
      "PA643145",
      "PA340357",
      "PA719930",
      "PA605069",
      "PA335532",
      "PA608695",
      "PA1592",
      "PA609332",
      "PA333285",
      "PA429893",
      "PA607553",
      "PA609590",
      "PA608741"
    ],
    "texteAffichable": "Mme&#160;Karamanli,  M.&#160;Vallaud, Mme&#160;Untermaier, Mme&#160;Pau-Langevin, M.&#160;Saulignac, Mme&#160;Pires Beaune, Mme&#160;Rabault, M.&#160;Aviragnet, Mme&#160;Bareigts, Mme&#160;Battistel, Mme&#160;Bi&#233;mouret, M.&#160;Bouillon, M.&#160;Jean-Louis&#160;Bricout, M.&#160;Carvounas, M.&#160;Alain&#160;David, Mme&#160;Laurence&#160;Dumont, M.&#160;Faure, M.&#160;Garot, M.&#160;David&#160;Habib, M.&#160;Hutin, M.&#160;Juanico, M.&#160;J&#233;r&#244;me&#160;Lambert, M.&#160;Letchimy, Mme&#160;Manin, M.&#160;Potier, M.&#160;Pueyo, Mme&#160;Tolmont, Mme&#160;Vainqueur-Christophe et Mme&#160;Victory"
  },
  "pointeurFragmentTexte": {
    "division": {
      "titre": "Article 8",
      "articleDesignationCourte": "ART. 8",
      "type": "ARTICLE",
      "avantAApres": "A",
      "divisionRattachee": "ARTICLE 8",
      "urlDivisionTexteVise": "/15/textes/1802.asp#D_Article_8"
    },
    "alinea": {
      "numero": "2"
    }
  },
  "corps": {
    "dispositif": "<p style=\"text-align: justify;\">I.&#160;&#8211;&#160;Compl&#233;ter l&#8217;alin&#233;a&#160;2 par la phrase suivante&#160;:</p><p style=\"text-align: justify;\">&#171;&#160;Ce contrat peut &#234;tre conclu pour un projet ou une mission pour lequel pourrait &#234;tre recrut&#233; un fonctionnaire de cat&#233;gorie A ou B.&#160;&#187;</p><p style=\"text-align: justify;\">II.&#160;&#8211;&#160;En cons&#233;quence, compl&#233;ter les alin&#233;as&#160;16 et&#160;28 par la m&#234;me phrase.</p>",
    "exposeSommaire": "<p style=\"text-align: justify;\">Cet amendement du groupe Socialistes et apparent&#233;s limite la possibilit&#233; de conclure un contrat de projet aux seuls missions ou projets qui pourraient &#234;tre confi&#233;s &#224; des fonctionnaires de cat&#233;gorie A ou B.</p><p>En effet, l&#8217;objet de ces contrats ne semble pas correspondre aux missions et projets qui sont habituellement exerc&#233;s par les fonctionnaires de cat&#233;gorie C. L&#8217;&#233;tude d&#8217;impact de l&#8217;article 8 parle par exemple de projets de &#171;<i>&#160;refonte du syst&#232;me informatique&#160;</i>&#187; ou de &#171;<i>&#160;mutualisation obligatoire de certaines services&#160;</i>&#187;.</p><p>Par ailleurs, la limitation du contrat de projet &#224; certains missions et projets seulement circonscrira la pr&#233;carit&#233; qu&#8217;il induira in&#233;vitablement.</p><p>Ce contrat de projet, s'il permettra de r&#233;pondre &#224; certains besoins tr&#232;s sp&#233;cifiques, constitue avant tout une nouvelle voie pour recruter des agents contractuels dans la fonction publique, au prix d'une grande pr&#233;carit&#233;.</p><p>Les d&#233;put&#233;s socialistes et apparent&#233;s souhaitent donc d&#233;poser plusieurs amendements &#224; l'article 8 dont l'objectif est de limiter cette pr&#233;carit&#233;.</p>"
  },
  "representations": [
    {
      "nom": "PDF",
      "typeMime": {
        "type": "application",
        "subType": "PDF"
      },
      "statutRepresentation": {
        "verbatim": true,
        "canonique": true,
        "officielle": true,
        "transcription": false,
        "enregistrement": false
      },
      "contenu": {
        "documentURI": "/15/amendements/1802/CION_LOIS/CL516.pdf"
      }
    }
  ],
  "sort": {
    "dateSaisie": "2019-05-02T18:39:05.000+02:00",
    "sortEnSeance": "Rejeté"
  },
  "dateDepot": "2019-04-29T02:00:00.000+02:00",
  "dateDistribution": "2019-05-01T02:00:00.000+02:00",
  "article99": "0",
  "loiReference": {
    "codeLoi": "3 id"
  }
}