{
  "uid": "AMANR5L15SEA717460BTC1761P0D1N17",
  "identifiant": {
    "legislature": "15",
    "numero": "17",
    "numRect": "0",
    "saisine": {
      "texteLegislatifRef": "PRJLANR5L15BTC1761",
      "numeroPartiePLF": "0",
      "organeExamen": "PO717460",
      "mentionSecondeDeliberation": "0"
    }
  },
  "numeroLong": "17",
  "etapeTexte": "Nouvelle Lecture",
  "triAmendement": "aakaaacaaaaaaaaaaaaaaaaaaaaaaaaaaaaaaaaaaaaaaaaaaazo",
  "cardinaliteAmdtMultiples": "1",
  "etat": "Discuté",
  "signataires": {
    "auteur": {
      "typeAuteur": "Depute",
      "acteurRef": "PA607553",
      "groupePolitiqueRef": "PO758835"
    },
    "cosignatairesRefs": [
      "PA267233",
      "PA337483",
      "PA1008",
      "PA340357",
      "PA719930",
      "PA1592",
      "PA609332",
      "PA720988",
      "PA1809",
      "PA508",
      "PA608011",
      "PA605069",
      "PA333285",
      "PA335532",
      "PA608172",
      "PA332614",
      "PA333818",
      "PA610681",
      "PA608695",
      "PA1198",
      "PA642764",
      "PA429893",
      "PA643145",
      "PA342415",
      "PA335054",
      "PA609590",
      "PA340343",
      "PA608741",
      "PA607553"
    ],
    "texteAffichable": "M.&#160;Potier,  Mme&#160;Battistel, M.&#160;Juanico, M.&#160;Vallaud, M.&#160;Aviragnet, Mme&#160;Bareigts, Mme&#160;Bi&#233;mouret, M.&#160;Bouillon, M.&#160;Jean-Louis&#160;Bricout, M.&#160;Carvounas, M.&#160;Alain&#160;David, Mme&#160;Laurence&#160;Dumont, M.&#160;Faure, M.&#160;Garot, M.&#160;David&#160;Habib, M.&#160;Hutin, Mme&#160;Karamanli, M.&#160;J&#233;r&#244;me&#160;Lambert, M.&#160;Letchimy, Mme&#160;Manin, Mme&#160;Pau-Langevin, Mme&#160;Pires Beaune, M.&#160;Pueyo, Mme&#160;Rabault, M.&#160;Saulignac, Mme&#160;Tolmont, Mme&#160;Untermaier, Mme&#160;Vainqueur-Christophe et Mme&#160;Victory"
  },
  "pointeurFragmentTexte": {
    "division": {
      "titre": "Article 52",
      "articleDesignationCourte": "ART. 52",
      "type": "ARTICLE",
      "avantAApres": "A",
      "divisionRattachee": "ARTICLE 52",
      "urlDivisionTexteVise": "/15/textes/1761.asp#D_Article_52"
    }
  },
  "corps": {
    "dispositif": "<p style=\"text-align: justify;\">Supprimer cet article.</p>",
    "exposeSommaire": "<p style=\"text-align: justify;\">Les d&#233;put&#233;s socialistes et apparent&#233;s consid&#232;rent que le m&#233;canisme de cession d&#8217;actifs, visant &#224; permettre le financement du fonds de l&#8217;innovation de rupture, est un non-sens &#233;conomique. En effet, le fl&#233;chage d&#8217;une partie du produit des dividendes actuellement per&#231;us par l&#8217;&#201;tat sur la base du capital d&#233;tenu dans ces entreprises suffirait amplement au financement de ce fonds. Il n&#8217;y a alors aucune raison de c&#233;der des entreprises strat&#233;giques comme cela a &#233;t&#233; d&#233;montr&#233; dans les amendements pr&#233;c&#233;dents. Il en va de m&#234;me donc avec la soci&#233;t&#233; GDF-SUEZ.</p>"
  },
  "representations": [
    {
      "nom": "PDF",
      "typeMime": {
        "type": "application",
        "subType": "PDF"
      },
      "statutRepresentation": {
        "verbatim": true,
        "canonique": true,
        "officielle": true,
        "transcription": false,
        "enregistrement": false
      },
      "contenu": {
        "documentURI": "/15/amendements/1761/AN/17.pdf"
      }
    }
  ],
  "seanceDiscussion": "RUANR5L15S2019IDS21550",
  "sort": {
    "dateSaisie": "2019-03-15T00:18:43.000+01:00",
    "sortEnSeance": "Rejeté"
  },
  "dateDepot": "2019-03-08T01:00:00.000+01:00",
  "dateDistribution": "2019-03-14T01:00:00.000+01:00",
  "article99": "0",
  "loiReference": {}
}