{
  "uid": "AMANR5L15PO420120B0235P2D1N25",
  "identifiant": {
    "legislature": "15",
    "numero": "25",
    "numRect": "0",
    "saisine": {
      "texteLegislatifRef": "PRJLANR5L15B0235",
      "numeroPartiePLF": "2",
      "organeExamen": "PO420120",
      "mentionSecondeDeliberation": "0"
    }
  },
  "numeroLong": "II-AS25",
  "etapeTexte": "1ère lecture (1ère assemblée saisie)",
  "triAmendement": "zzt",
  "cardinaliteAmdtMultiples": "1",
  "etat": "Irrecevable",
  "signataires": {
    "auteur": {
      "typeAuteur": "Depute",
      "acteurRef": "PA721062",
      "groupePolitiqueRef": "PO730958"
    },
    "cosignatairesRefs": [
      "PA2150",
      "PA721960",
      "PA720892",
      "PA720846",
      "PA588884",
      "PA720286",
      "PA718860",
      "PA720430",
      "PA720422",
      "PA722142",
      "PA721202",
      "PA721062",
      "PA721210",
      "PA721226",
      "PA718868",
      "PA719578",
      "PA719676"
    ],
    "texteAffichable": "M.&#160;Ratenon,  Mme&#160;Autain, M.&#160;Bernalicis, M.&#160;Coquerel, M.&#160;Corbi&#232;re, Mme&#160;Fiat, M.&#160;Lachaud, M.&#160;Larive, M.&#160;M&#233;lenchon, Mme&#160;Obono, Mme&#160;Panot, M.&#160;Prud&apos;homme, M.&#160;Quatennens, Mme&#160;Ressiguier, Mme&#160;Rubin, M.&#160;Ruffin et Mme&#160;Taurine"
  },
  "pointeurFragmentTexte": {
    "missionVisee": {
      "idMissionAN": "22",
      "libelleMission": "Outre-mer",
      "codeMissionPLF": "B",
      "libelleMissionPLF": "Répartition, par mission et programme, des crédits du budget général"
    },
    "division": {
      "titre": "Article 63",
      "articleDesignationCourte": "APRÈS ART. 63",
      "type": "ARTICLE",
      "avantAApres": "Apres",
      "divisionRattachee": "APRÈS L'ARTICLE 63, insérer l'article suivant:",
      "articleAdditionnel": "1",
      "urlDivisionTexteVise": "/15/textes/0235C.asp#D_Article_63"
    }
  },
  "corps": {
    "dispositif": "<p>I. Le Gouvernement remet au Parlement, dans un d&#233;lai de trois mois &#224; compter de la promulgation de la pr&#233;sente loi, un rapport d&#8217;information sur le co&#251;t et les &#233;conomies qu&#8217;induirait la valorisation du patrimoine gr&#226;ce &#224; une &#171; charte architecturale &#187; adapt&#233;e au paysage urbain et aux contraintes climatiques des territoires.</p><p>II.- Ce rapport sera r&#233;dig&#233; par un groupe de travail constitu&#233; de quatre repr&#233;sentants de l&#8217;administration, &#224; savoir un repr&#233;sentant de l&#8217;inspection g&#233;n&#233;rale des finances, un repr&#233;sentant de l&#8217;inspection g&#233;n&#233;rale de l&#8217;administration, un repr&#233;sentant de l&#8217;inspection g&#233;n&#233;rale de l&#8217;environnement, un repr&#233;sentant de l&#8217;inspection g&#233;n&#233;rale des affaires culturelles, ainsi que des repr&#233;sentants de chaque collectivit&#233; territoriale concern&#233;e.</p>",
    "exposeSommaire": "<p>L'&#233;tablissement d'une charte architecturale permettrai d'inscrire l'urbanisation des Outre-Mer dans une dynamique de respect des paysages et de l'environnement.</p><p>Par ailleurs, cette charte permettrait de conserver les styles architecturaux typiques de chaque territoire ainsi que d'&#233;tablir un cahier des charges pr&#233;cis permettant l'adaptation des projets de construction aux contraintes particuli&#232;res li&#233;es aux Outre-Mer comme la pr&#233;vention des risques li&#233;s aux s&#233;ismes ou aux ph&#233;nom&#232;nes m&#233;t&#233;orologiques.</p><p>&#160;</p>"
  },
  "representations": [
    {
      "nom": "PDF",
      "typeMime": {
        "type": "application",
        "subType": "PDF"
      },
      "statutRepresentation": {
        "verbatim": true,
        "canonique": true,
        "officielle": true,
        "transcription": false,
        "enregistrement": false
      },
      "contenu": {
        "documentURI": "/15/amendements/0235C/CION_TOUTE/AS25.pdf"
      }
    }
  ],
  "dateDepot": "2017-10-26T02:00:00.000+02:00",
  "article99": "0",
  "loiReference": {}
}