{
  "uid": "AMANR5L15SEA717460B1408P0D1N94",
  "identifiant": {
    "legislature": "15",
    "numero": "94",
    "numRect": "0",
    "saisine": {
      "texteLegislatifRef": "PRJLANR5L15B1408",
      "numeroPartiePLF": "0",
      "organeExamen": "PO717460",
      "mentionSecondeDeliberation": "0"
    }
  },
  "numeroLong": "94",
  "etapeTexte": "Nouvelle Lecture",
  "triAmendement": "becaaaaaaaaaaaaaaaaaaaaaaaaaaaaaaaaaaaaaaaaaaaaaaahzzzzzzzzzzzzzzzm",
  "cardinaliteAmdtMultiples": "1",
  "etat": "Discuté",
  "signataires": {
    "auteur": {
      "typeAuteur": "Depute",
      "acteurRef": "PA721126",
      "groupePolitiqueRef": "PO730934"
    },
    "cosignatairesRefs": [
      "PA721126",
      "PA722390",
      "PA267289",
      "PA721474"
    ],
    "texteAffichable": "Mme&#160;Guion-Firmin,  M.&#160;Door, Mme&#160;Corneloup et M.&#160;Viry"
  },
  "pointeurFragmentTexte": {
    "division": {
      "titre": "Article 8",
      "articleDesignationCourte": "ART. 8",
      "type": "ARTICLE",
      "avantAApres": "A",
      "divisionRattachee": "ARTICLE 8",
      "urlDivisionTexteVise": "/15/textes/1408.asp#D_Article_8"
    },
    "alinea": {
      "avantAApres": "A",
      "numero": "35",
      "alineaDesignation": "Alinéa 35"
    }
  },
  "corps": {
    "dispositif": "<p style=\"text-align: justify;\">I.&#160;-&#160;&#192; l&#8217;alin&#233;a&#160;35, substituer aux mots&#160;:</p><p style=\"text-align: justify;\">&#171;&#160;, &#224; La R&#233;union et &#224; Saint-Martin&#160;&#187;</p><p style=\"text-align: justify;\">les mots&#160;:</p><p style=\"text-align: justify;\">&#171;&#160;et &#224; La R&#233;union&#160;&#187;.</p><p style=\"text-align: justify;\">II.&#160;&#8211;&#160;En cons&#233;quence, &#224; la fin de l&#8217;alin&#233;a&#160;40, substituer aux mots&#160;:</p><p style=\"text-align: justify;\">&#171;&#160;, La R&#233;union et Saint-Martin&#160;&#187;</p><p style=\"text-align: justify;\">les mots&#160;:</p><p style=\"text-align: justify;\">&#171;&#160;et La R&#233;union&#160;&#187;.</p><p style=\"text-align: justify;\">III.&#160;&#8211;&#160;En cons&#233;quence, &#224; la fin de l&#8217;alin&#233;a&#160;42, substituer aux mots&#160;:</p><p style=\"text-align: justify;\">&#171;&#160;, de La R&#233;union ou de Saint-Martin&#160;&#187;</p><p style=\"text-align: justify;\">les mots&#160;:</p><p style=\"text-align: justify;\">&#171;&#160;ou de La R&#233;union&#160;&#187;.</p><p style=\"text-align: justify;\">IV.&#160;&#8211;&#160;En cons&#233;quence, &#224; la fin de l&#8217;alin&#233;a&#160;43, supprimer les mots&#160;:</p><p style=\"text-align: justify;\">&#171;&#160;ou &#224; Saint-Martin&#160;&#187;.</p><p style=\"text-align: justify;\">V.&#160;&#8211;&#160;En cons&#233;quence, &#224; l&#8217;alin&#233;a&#160;44, substituer aux mots&#160;:</p><p style=\"text-align: justify;\">&#171;&#160;, de La R&#233;union ou de Saint-Martin&#160;&#187;,</p><p style=\"text-align: justify;\">les mots&#160;:</p><p style=\"text-align: justify;\">&#171;&#160;ou de La R&#233;union&#160;&#187;.</p><p style=\"text-align: justify;\">VI.&#160;&#8211;&#160;En cons&#233;quence, au m&#234;me alin&#233;a, supprimer les mots&#160;:</p><p style=\"text-align: justify;\">&#171;&#160;Saint-Martin et&#160;&#187;.</p><p style=\"text-align: justify;\">VII.&#160;&#8211;&#160;Apr&#232;s l&#8217;alin&#233;a&#160;100, ins&#233;rer les dix-huit alin&#233;as suivants:</p><p style=\"text-align: justify;\">&#171;&#160;<i>Art.&#160;L.&#160;752&#8209;3&#8209;5&#160;</i>I.&#160;&#8211;&#160;&#192; Saint-Martin, les employeurs, &#224; l&#8217;exclusion des entreprises publiques et &#233;tablissements publics mentionn&#233;s &#224; l&#8217;article&#160;L.&#160;2233&#8209;1 du code du travail et les particuliers employeurs, sont exon&#233;r&#233;s du paiement des cotisations &#224; leur charge au titre de la l&#233;gislation de la s&#233;curit&#233; sociale, &#224; l&#8217;exclusion de celles dues au titre des accidents du travail et des maladies professionnelles dans les conditions d&#233;finies au pr&#233;sent article.</p><p style=\"text-align: justify;\">&#171;&#160;II.&#160;&#8211;&#160;L&#8217;exon&#233;ration s&#8217;applique&#160;:</p><p style=\"text-align: justify;\">&#171;&#160;1&#176;&#160;Aux employeurs occupant moins de onze salari&#233;s. Si l&#8217;effectif vient a&#768; atteindre ou de&#769;passer le seuil de onze salari&#233;s, le b&#233;n&#233;fice int&#233;gral de l&#8217;exon&#233;ration est&#160;maintenu dans la limite des onze salari&#233;s pre&#769;ce&#769;demment occupe&#769;s ou, en cas de de&#769;part, remplace&#769;s. Un d&#233;cret fixe les conditions dans lesquelles le be&#769;ne&#769;fice de l&#8217;exone&#769;ration est acquis dans le cas ou&#768; l&#8217;effectif passe au-dessous de onze salarie&#769;s&#160;;</p><p style=\"text-align: justify;\">&#171;&#160;2&#176;&#160;Quel que soit leur effectif, aux employeurs des secteurs du ba&#770;timent et des travaux publics, de l&#8217;industrie, de la restauration, de la presse, de la production audiovisuelle, de l&#8217;environnement, de l&#8217;agronutrition, des e&#769;nergies renouvelables, des nouvelles technologies de l&#8217;information et de la communication et des centres d&#8217;appel, de la pe&#770;che, des cultures marines, de l&#8217;aquaculture, de l&#8217;agriculture, du tourisme, de la restauration de tourisme y compris les activit&#233;s de loisirs s&#8217;y rapportant, de l&#8217;h&#244;tellerie, de la recherche et du d&#233;veloppement&#160;;</p><p style=\"text-align: justify;\">&#171;&#160;3&#176;&#160;Aux employeurs de transport a&#233;rien assurant&#160;:</p><p style=\"text-align: justify;\">&#171;&#160;<i>a</i>) La liaison entre la m&#233;tropole, la Guadeloupe, la Martinique, Saint-Martin et Saint-Barthe&#769;lemy&#160;;</p><p style=\"text-align: justify;\">&#171;&#160;<i>b</i>) La liaison entre Saint-Martin et ces d&#233;partements ou collectivit&#233;s.</p><p style=\"text-align: justify;\">&#171;&#160;Seuls sont pris en compte les personnels des employeurs concourant exclusivement aux dessertes mentionne&#769;es au <i>b</i> du pre&#769;sent 3&#176;&#160;et affecte&#769;s dans des e&#769;tablissements situe&#769;s dans l&#8217;un de ces de&#769;partements, a&#768; Saint-Barthe&#769;lemy ou a&#768; Saint-Martin&#160;;</p><p style=\"text-align: justify;\">&#171;&#160;4&#176;&#160;Aux employeurs assurant la desserte maritime de Saint-Martin, ou la liaison entre les ports de Saint-Barth&#233;lemy et de Saint-Martin.</p><p style=\"text-align: justify;\">&#171;&#160;III.&#160;&#8211;&#160;A.&#160;&#8211;&#160;Pour les employeurs mentionne&#769;s aux 1&#176;&#160;, 3&#176;&#160;et 4&#176;&#160;du II et ceux mentionne&#769;s au 2&#176;&#160;du me&#770;me II relevant des secteurs du ba&#770;timent et des travaux publics, de la presse et de la production audiovisuelle, lorsque le montant du revenu d&#8217;activit&#233; de chaque mois civil, pour chaque salari&#233;, tel qu&#8217;il est pris en compte pour la d&#233;termination de l&#8217;assiette des cotisations d&#233;finie &#224; l&#8217;article&#160;L.&#160;242&#8209;1 est infe&#769;rieur a&#768; un seuil e&#769;gal au salaire minimum de croissance majore&#769; de 40&#160;%, le montant de l&#8217;exone&#769;ration est e&#769;gal au montant des cotisations et contributions a&#768; la charge de l&#8217;employeur, mentionne&#769;es au I. A&#768; partir de ce seuil, la part du revenu d&#8217;activite&#769; de sur laquelle est calcule&#769;e l&#8217;exone&#769;ration de&#769;croi&#770;t et devient nulle lorsque le revenu d&#8217;activite&#769; est e&#769;gal au salaire minimum de croissance majore&#769; de 200&#160;%.</p><p style=\"text-align: justify;\">&#171;&#160;B.&#160;&#8211;&#160;Pour les employeurs, quel que soit leur effectif, relevant des secteurs mentionne&#769;s au 2&#176;&#160;du II, a&#768; l&#8217;exception des secteurs du ba&#770;timent et des travaux publics, de la presse et de la production audiovisuelle, lorsque le montant du revenu d&#8217;activit&#233; de chaque mois civil, pour chaque salari&#233;, tel qu&#8217;il est pris en compte pour la d&#233;termination de l&#8217;assiette des cotisations d&#233;finie &#224; l&#8217;article&#160;L.&#160;242&#8209;1 est infe&#769;rieur a&#768; un seuil e&#769;gal au salaire minimum de croissance majore&#769; de 70&#160;%, le montant de l&#8217;exone&#769;ration est e&#769;gal au montant des cotisations et contributions a&#768; la charge de l&#8217;employeur mentionne&#769;es au I. Lorsque la r&#233;mun&#233;ration est sup&#233;rieure &#224; un seuil &#233;gal au salaire minimum de croissance major&#233; de 70&#160;% et inf&#233;rieure &#224; un seuil &#233;gal au salaire minimum de croissance major&#233; de 150&#160;%, la r&#233;mun&#233;ration est exon&#233;r&#233;e des cotisations de s&#233;curit&#233; sociale &#224; la charge de l&#8217;employeur, dans la limite de la part correspondant &#224; une r&#233;mun&#233;ration &#233;gale au salaire minimum de croissance major&#233; de 70&#160;%. A&#768; partir du seuil &#233;gal au salaire minimum major&#233; de 150&#160;%, la part du revenu d&#8217;activite&#769; sur laquelle est calcule&#769;e l&#8217;exone&#769;ration de&#769;croi&#770;t et devient nulle lorsque le revenu d&#8217;activite&#769; est e&#769;gal au salaire minimum de croissance majore&#769; de 350&#160;%.</p><p style=\"text-align: justify;\">&#171;&#160;V.&#160;&#8211;&#160;Pour l&#8217;application du pr&#233;sent article, l&#8217;effectif pris en compte est celui qui est employ&#233; par l&#8217;entreprise &#224; Saint-Martin, tous &#233;tablissements confondus dans le cas o&#249; l&#8217;entreprise y compte plusieurs &#233;tablissements. L&#8217;effectif est appr&#233;ci&#233; dans les conditions pr&#233;vues par les&#160;articles L.&#160;1111&#8211;2 et L.&#160;1251&#8211;54 du code du travail.</p><p style=\"text-align: justify;\">&#171;&#160;Lorsque dans une m&#234;me entreprise ou un m&#234;me &#233;tablissement sont exerc&#233;es plusieurs activit&#233;s, l&#8217;exon&#233;ration est applicable au titre de l&#8217;activit&#233; exerc&#233;e par chacun des salari&#233;s employ&#233;s.</p><p style=\"text-align: justify;\">&#171;&#160;VI.&#160;&#8211;&#160;Le b&#233;n&#233;fice de l&#8217;exon&#233;ration pr&#233;vue au pr&#233;sent article&#160;est subordonn&#233; au fait, pour l&#8217;employeur, d&#8217;&#234;tre &#224; jour de ses obligations d&#233;claratives ou de paiement &#224; l&#8217;&#233;gard de l&#8217;organisme de recouvrement. La condition de paiement est consid&#233;r&#233;e comme remplie d&#232;s lors que l&#8217;employeur a, d&#8217;une part, souscrit et respecte un plan d&#8217;apurement des cotisations restant dues et, d&#8217;autre part, acquitte les cotisations en cours &#224; leur date normale d&#8217;exigibilit&#233;.</p><p style=\"text-align: justify;\">&#171;&#160;Les exon&#233;rations pr&#233;vues par le pr&#233;sent article&#160;ne peuvent &#234;tre cumul&#233;es avec une autre exon&#233;ration totale ou partielle de cotisations patronales de s&#233;curit&#233; sociale, &#224; l&#8217;exception de la d&#233;duction forfaitaire pr&#233;vue &#224; l&#8217;article&#160;L.&#160;241&#8209;18 du pr&#233;sent code.</p><p style=\"text-align: justify;\">&#171;&#160;VII.&#160;&#8211;&#160;Le b&#233;n&#233;fice de l&#8217;exon&#233;ration pr&#233;vue au pr&#233;sent article, ainsi que de tous autres all&#233;gements et exon&#233;rations de cotisations patronales pr&#233;vus par le pr&#233;sent code, est subordonn&#233; au fait, pour l&#8217;entreprise ou le chef d&#8217;entreprise, de ne pas avoir fait l&#8217;objet d&#8217;une condamnation p&#233;nale pass&#233;e en force de chose jug&#233;e soit pour fraude fiscale, soit pour travail dissimul&#233;, marchandage ou pr&#234;t illicite de&#160;main-d&#8217;&#339;uvre, en application des articles&#160;L.&#160;5224&#8209;2,&#160;L.&#160;8224&#8209;1,&#160;L.&#160;8224&#8209;3, L.&#160;8224&#8209;4, L.&#160;8224&#8209;5, L.&#160;8224&#8209;6,&#160;L.&#160;8234&#8209;1 et L.&#160;8234&#8209;2 du code du travail.</p><p style=\"text-align: justify;\">&#171;&#160;Lorsqu&#8217;un organisme charg&#233; du recouvrement est avis&#233;, par la transmission du proc&#232;s-verbal &#233;tabli par un des agents de contr&#244;le mentionn&#233;s &#224; l&#8217;article&#160;L.&#160;8271&#8209;1&#8209;2 du code du travail, de la commission d&#8217;une des infractions mentionn&#233;es &#224; l&#8217;alin&#233;a pr&#233;c&#233;dent, il suspend la mise en &#339;uvre des exon&#233;rations pr&#233;vues par le pr&#233;sent article&#160;jusqu&#8217;au terme de la proc&#233;dure judiciaire.</p><p style=\"text-align: justify;\">&#171;&#160;VIII.&#160;&#8211;&#160;Lorsque les exon&#233;rations mentionn&#233;es aux&#160;III et&#160;IV sont d&#233;gressives, le montant de celles-ci est d&#233;termin&#233; par l&#8217;application d&#8217;une formule de calcul d&#233;finie par d&#233;cret. La valeur maximale du coefficient de d&#233;gressivit&#233; retenu pour cette formule est fix&#233;e par d&#233;cret, dans la limite de la somme des taux des cotisations mentionn&#233;es au I pour une r&#233;mun&#233;ration &#233;gale au salaire minimum de croissance.&#160;&#187;</p><p style=\"text-align: justify;\">VIII.&#160;&#8211;&#160;Compl&#233;ter cet article par l&#8217;alin&#233;a suivant&#160;:</p><p>&#160;</p><p>XVI.&#160;&#8211;&#160;La perte de recettes pour les organismes de s&#233;curit&#233; sociale est compens&#233;e &#224; due concurrence par la majoration des droits mentionn&#233;s aux articles 575 et 575 A du code g&#233;n&#233;ral des imp&#244;ts.&#160;&#187;.</p><p style=\"text-align: justify;\">&#160;</p>",
    "exposeSommaire": "<p style=\"text-align: justify;\">Cet amendement vise &#224; ins&#233;rer&#160;un article additionnel&#160;au sein du code de la s&#233;curit&#233; sociale afin de maintenir &#224; Saint-Martin&#160;les r&#232;gles d&#8217;exon&#233;rations de cotisations patronales issues de la LODEOM du 27 Mai 2009 et&#160;actuellement en vigueur. Et ce, dans une logique de v&#233;ritable diff&#233;renciation, visant notamment &#224; compenser l&#8217;absence d&#8217;instauration du CICE major&#233; dans cette Collectivit&#233; d&#8217;Outre-mer en 2014.</p><p style=\"text-align: justify;\">L&#8217;&#233;conomie saint-martinoise se caract&#233;rise en effet par sa d&#233;pendance aux importations (impactant les prix et la r&#233;partition des salaires). Elle propose &#233;galement une offre de services dense, notamment dans le secteur de l&#8217;h&#244;tellerie-restauration, l&#8217;&#233;conomie touristique ayant vocation &#224; monter encore en gamme. Cette &#233;volution qualitative, qui doit &#233;viter toute constitution de &#171;&#160;trappe &#224; bas salaires&#160;&#187;, suppose une am&#233;lioration de l&#8217;attractivit&#233;&#160;du territoire.</p><p style=\"text-align: justify;\">Le co&#251;t du travail est, dans ces conditions, un des principaux leviers de comp&#233;titivit&#233; des entreprises, lesquelles doivent structurellement faire face &#224; la concurrence des &#238;les carib&#233;ennes voisines et, surtout, de la partie n&#233;erlandaise de l&#8217;&#238;le qui pratique un dumping social et fiscal massif et d&#233;lib&#233;r&#233;.</p><p style=\"text-align: justify;\">De plus, les entreprises locales ont &#233;t&#233; fragilis&#233;es par le passage de l&#8217;ouragan Irma il y a quatorze mois&#160;: il convient d&#232;s lors de maintenir la stabilit&#233; du dispositif pour les&#160;entreprises saint-martinoises, dans une logique de consolidation du processus de reconstruction du territoire.</p><p style=\"text-align: justify;\">Enfin, en l&#8217;absence d&#8217;&#233;tude d&#8217;impact permettant d&#8217;&#233;valuer les cons&#233;quences d&#8217;une modification des r&#232;gles de cotisations, il est pragmatique de maintenir en l&#8217;&#233;tat la l&#233;gislation, avant de concevoir, dans le cadre du PLFSS 2020, un dispositif adapt&#233; et affin&#233;.</p>"
  },
  "representations": [
    {
      "nom": "PDF",
      "typeMime": {
        "type": "application",
        "subType": "PDF"
      },
      "statutRepresentation": {
        "verbatim": true,
        "canonique": true,
        "officielle": true,
        "transcription": false,
        "enregistrement": false
      },
      "contenu": {
        "documentURI": "/15/amendements/1408/AN/94.pdf"
      }
    }
  ],
  "seanceDiscussion": "RUANR5L15S2019IDS21382",
  "sort": {
    "dateSaisie": "2018-11-27T19:01:20.000+01:00",
    "sortEnSeance": "Retiré"
  },
  "dateDepot": "2018-11-22T01:00:00.000+01:00",
  "dateDistribution": "2018-11-27T01:00:00.000+01:00",
  "article99": "0",
  "loiReference": {}
}