{
  "uid": "AMANR5L15SEA717460BTC1482P0D1N177",
  "identifiant": {
    "legislature": "15",
    "numero": "177",
    "numRect": "0",
    "saisine": {
      "texteLegislatifRef": "PRJLANR5L15BTC1482",
      "numeroPartiePLF": "0",
      "organeExamen": "PO717460",
      "mentionSecondeDeliberation": "0"
    }
  },
  "numeroLong": "177",
  "etapeTexte": "1ère lecture (1ère assemblée saisie)",
  "triAmendement": "aiaaaaaaaaaaaaaaaaaaaaaaaaaaaaaaaaaaaaaaaaaaaaaaaabpo",
  "cardinaliteAmdtMultiples": "1",
  "etat": "Discuté",
  "signataires": {
    "auteur": {
      "typeAuteur": "Depute",
      "acteurRef": "PA718838",
      "groupePolitiqueRef": "PO730934"
    },
    "cosignatairesRefs": [
      "PA1874",
      "PA718850",
      "PA609726",
      "PA267429",
      "PA718838",
      "PA334843",
      "PA2492"
    ],
    "texteAffichable": "M.&#160;Brun,  M.&#160;Aubert, M.&#160;Cinieri, M.&#160;Cordier, M.&#160;Le Fur, M.&#160;Quentin et M.&#160;Verch&#232;re"
  },
  "pointeurFragmentTexte": {
    "division": {
      "titre": "Article PREMIER",
      "articleDesignationCourte": "ART. PREMIER",
      "type": "ARTICLE",
      "avantAApres": "A",
      "divisionRattachee": "ARTICLE PREMIER",
      "urlDivisionTexteVise": "/15/textes/1482.asp#D_Article_1er"
    },
    "alinea": {
      "numero": "7"
    }
  },
  "corps": {
    "dispositif": "<p style=\"text-align: justify;\">Compl&#233;ter l&#8217;alin&#233;a&#160;7 par les mots&#160;:</p><p style=\"text-align: justify;\">&#171;&#160;L&#8217;office fran&#231;ais de la biodiversit&#233; est charg&#233; de coordonner la lutte contre le frelon asiatique.&#160;&#187;</p>",
    "exposeSommaire": "<p>La propagation du frelon asiatique est en train de devenir le sujet majeur en terme d&#8217;&#233;quilibre de la biodiversit&#233;.</p><p style=\"text-align: justify;\">Le frelon asiatique (Vespa velutina) est une esp&#232;ce d&#8217;hym&#233;nopt&#232;re de la famille des Vespidae originaire d&#8217;Asie. Elle aurait &#233;t&#233; introduite en France en 2004 via des importations de poteries chinoises. Observ&#233;e pour la premi&#232;re fois en Lot-et-Garonne, l&#8217;esp&#232;ce a peu &#224; peu colonis&#233; le territoire fran&#231;ais, et a commenc&#233; &#224; s&#8217;&#233;tendre en&#160;Europe.</p><p style=\"text-align: justify;\">&#160;</p><p style=\"text-align: justify;\">Le frelon asiatique (Vespa velutina) est une esp&#232;ce d&#8217;hym&#233;nopt&#232;re de la famille des Vespidae originaire d&#8217;Asie. Elle aurait &#233;t&#233; introduite en France en 2004 via des importations de poteries chinoises. Observ&#233;e pour la premi&#232;re fois en Lot-et-Garonne, l&#8217;esp&#232;ce a peu &#224; peu colonis&#233; le territoire fran&#231;ais, et a commenc&#233; &#224; s&#8217;&#233;tendre en&#160;Europe.</p><p style=\"text-align: justify;\">Si la prolif&#233;ration de ce frelon ne constitue pas un probl&#232;me de sant&#233; publique (depuis son introduction, il n&#8217;y a pas eu de hausse significative du nombre de piq&#251;res sur l&#8217;homme), elle repr&#233;sente un danger pour l&#8217;apiculture ainsi que, plus globalement, sur la culture fruiti&#232;re. En effet, la pr&#233;dation de l&#8217;abeille, qui constitue environ les 2/3 du r&#233;gime alimentaire du frelon asiatique, a un effet direct sur la population de la ruche. De plus, la pr&#233;sence du frelon autour de la colonie stresse les abeilles, conduisant ainsi &#224; un d&#233;p&#233;rissement de la ruche.</p><p style=\"text-align: justify;\">Deux arr&#234;t&#233;s minist&#233;riels ont d&#233;fini le statut de cette esp&#232;ce. Elle a tout d&#8217;abord &#233;t&#233; class&#233;e comme danger sanitaire de 2e cat&#233;gorie au titre du code rural et de la p&#234;che maritime le 26 d&#233;cembre 2012 par le minist&#232;re de l&#8217;agriculture, de l&#8217;agroalimentaire et de la for&#234;t (MAAF). Puis, le 22 janvier 2013, un arr&#234;t&#233; du minist&#232;re de l&#8217;&#233;cologie du d&#233;veloppement durable et de l&#8217;&#233;nergie (MEDDE) a class&#233; le frelon asiatique comme &#171;&#160;esp&#232;ce exotique envahissante&#160;&#187; au titre du code de l&#8217;environnement (janvier 2013) et interdit son introduction sur le territoire national. Par ailleurs, dans le cadre de la loi n&#176; 2016&#8209;1087 du 8 ao&#251;t 2016 pour la reconqu&#234;te de la biodiversit&#233;, de la nature et des paysages, il conviendrait de classer le frelon asiatique dans la cat&#233;gorie des organismes nuisibles, au sens du code rural et de la p&#234;che maritime.</p><p style=\"text-align: justify;\">C&#8217;est pourquoi le pr&#233;sent amendement vise &#224; pr&#233;ciser que l&#8217;office fran&#231;ais de la biodiversit&#233; est charg&#233; de coordonner la lutte contre le frelon asiatique.</p>"
  },
  "representations": [
    {
      "nom": "PDF",
      "typeMime": {
        "type": "application",
        "subType": "PDF"
      },
      "statutRepresentation": {
        "verbatim": true,
        "canonique": true,
        "officielle": true,
        "transcription": false,
        "enregistrement": false
      },
      "contenu": {
        "documentURI": "/15/amendements/1482/AN/177.pdf"
      }
    }
  ],
  "seanceDiscussion": "RUANR5L15S2019IDS21460",
  "sort": {
    "dateSaisie": "2019-01-23T23:17:46.000+01:00",
    "sortEnSeance": "Rejeté"
  },
  "dateDepot": "2018-12-13T01:00:00.000+01:00",
  "dateDistribution": "2019-01-17T01:00:00.000+01:00",
  "article99": "0",
  "loiReference": {}
}