{
  "uid": "AMANR5L15SEA717460BTC0857P0D1N400",
  "identifiant": {
    "legislature": "15",
    "numero": "400",
    "numRect": "0",
    "saisine": {
      "texteLegislatifRef": "PRJLANR5L15BTC0857",
      "numeroPartiePLF": "0",
      "organeExamen": "PO717460",
      "mentionSecondeDeliberation": "0"
    }
  },
  "numeroLong": "400",
  "etapeTexte": "1ère lecture (1ère assemblée saisie)",
  "triAmendement": "d",
  "cardinaliteAmdtMultiples": "1",
  "etat": "Discuté",
  "signataires": {
    "auteur": {
      "typeAuteur": "Depute",
      "acteurRef": "PA330684",
      "groupePolitiqueRef": "PO730934"
    },
    "cosignatairesRefs": [
      "PA720684",
      "PA330684",
      "PA267260",
      "PA334654",
      "PA267527",
      "PA719272",
      "PA720210",
      "PA608416",
      "PA721506",
      "PA1874",
      "PA2796",
      "PA345722",
      "PA266776",
      "PA721678",
      "PA719318",
      "PA334843"
    ],
    "texteAffichable": "Mme&#160;Val&#233;rie&#160;Boyer,  Mme&#160;Poletti, Mme&#160;Beauvais, M.&#160;Verch&#232;re, M.&#160;Reiss, M.&#160;Reda, M.&#160;Hetzel, M.&#160;Straumann, Mme&#160;Anthoine, M.&#160;Le Fur, Mme&#160;Kuster, M.&#160;Pierre-Henri&#160;Dumont, M.&#160;Teissier, M.&#160;Saddier, Mme&#160;Le Grip et Mme&#160;Meunier"
  },
  "pointeurFragmentTexte": {
    "division": {
      "titre": "Article 30",
      "articleDesignationCourte": "APRÈS ART. 30",
      "type": "ARTICLE",
      "avantAApres": "Apres",
      "divisionRattachee": "APRÈS L'ARTICLE 30, insérer l'article suivant:",
      "articleAdditionnel": "1",
      "urlDivisionTexteVise": "/15/textes/0857.asp#D_Article_30"
    }
  },
  "corps": {
    "dispositif": "<p>&#192; la premi&#232;re phrase du premier alin&#233;a de l&#8217;article&#160;175&#8209;2 du code civil, les mots&#160;: &#171;&#160;peut saisir&#160;&#187; sont remplac&#233;s par le mot&#160;: &#171;&#160;saisit&#160;&#187;.</p>",
    "exposeSommaire": "<p><i>Cet amendement est issu de la proposition de loi du&#160;21 f&#233;vrier 2018 visant &#224; renforcer la lutte contre les mariages frauduleux</i></p><p>L&#8217;article 175-2 du code civil pr&#233;voit notamment que&#160;: &#171;&#160;lorsqu'il existe des indices s&#233;rieux laissant pr&#233;sumer, le cas &#233;ch&#233;ant au vu de l'audition pr&#233;vue par l'article 63, que le mariage envisag&#233; est susceptible d'&#234;tre annul&#233; au titre de l'article 146 ou de l'article 180, l'officier de l'&#233;tat civil peut saisir sans d&#233;lai le procureur de la R&#233;publique.&#160;&#187;.</p><p>Cette saisine ne doit plus &#234;tre facultative.</p><p>Il convient donc de modifier l&#8217;article 175-2 du code civil afin de pr&#233;voir, qu&#8217;en cas de doute sur la sinc&#233;rit&#233; ou la r&#233;alit&#233; des intentions matrimoniales, l&#8217;officier d&#8217;&#233;tat civil a l&#8217;obligation juridique de saisir le procureur de la R&#233;publique afin qu&#8217;il statue sur ce mariage.</p>"
  },
  "representations": [
    {
      "nom": "PDF",
      "typeMime": {
        "type": "application",
        "subType": "PDF"
      },
      "statutRepresentation": {
        "verbatim": true,
        "canonique": true,
        "officielle": true,
        "transcription": false,
        "enregistrement": false
      },
      "contenu": {
        "documentURI": "/15/amendements/0857/AN/400.pdf"
      }
    }
  ],
  "seanceDiscussion": "RUANR5L15S2018IDS21078",
  "sort": {
    "dateSaisie": "2018-04-22T15:57:33.000+02:00",
    "sortEnSeance": "Rejeté"
  },
  "dateDepot": "2018-04-11T02:00:00.000+02:00",
  "dateDistribution": "2018-04-17T02:00:00.000+02:00",
  "article99": "0",
  "loiReference": {
    "codeLoi": "c civil",
    "divisionCodeLoi": "175-2"
  }
}