{
  "uid": "AMANR5L15SEA717460B2272P2D1N2236",
  "identifiant": {
    "legislature": "15",
    "numero": "2236",
    "numRect": "0",
    "saisine": {
      "texteLegislatifRef": "PRJLANR5L15B2272",
      "numeroPartiePLF": "2",
      "organeExamen": "PO717460",
      "mentionSecondeDeliberation": "0"
    }
  },
  "numeroLong": "II-2236",
  "etapeTexte": "1ère lecture (1ère assemblée saisie)",
  "triAmendement": "bdoaaaaaaaaaaaaaaaaaaaaaaaaaaaaaaaaaaaaaaaaaaaaaaaabknwdi",
  "cardinaliteAmdtMultiples": "1",
  "amendementParent": "AMANR5L15SEA717460B2272P2D1N2155",
  "etat": "Discuté",
  "signataires": {
    "auteur": {
      "typeAuteur": "Depute",
      "acteurRef": "PA643175",
      "groupePolitiqueRef": "PO730964"
    },
    "cosignatairesRefs": [
      "PA720952",
      "PA720916",
      "PA719456",
      "PA642695",
      "PA718744",
      "PA721888",
      "PA722054",
      "PA721824",
      "PA722090",
      "PA643175",
      "PA720900",
      "PA719294",
      "PA721624",
      "PA721296",
      "PA721142",
      "PA607395",
      "PA719684",
      "PA722344",
      "PA718944",
      "PA722126",
      "PA721246",
      "PA721860",
      "PA609520",
      "PA720538",
      "PA720108",
      "PA719972",
      "PA642788",
      "PA722178",
      "PA720870"
    ],
    "texteAffichable": "Mme&#160;Dupont,  Mme&#160;Hai, Mme&#160;Bagarry, Mme&#160;Oppelt, M.&#160;Tach&#233;, M.&#160;Renson, Mme&#160;Dubost, M.&#160;V&#233;ran, M.&#160;Travert, Mme&#160;Lazaar, M.&#160;Gouffier-Cha, Mme&#160;Avia, M.&#160;Bothorel, M.&#160;Maire, Mme&#160;Pompili, Mme&#160;Clapot, Mme&#160;De Temmerman, Mme&#160;Gaillot, Mme&#160;M&#246;rch, M.&#160;Raphan, M.&#160;Mbaye, Mme&#160;Sarles, M.&#160;Julien-Laferri&#232;re, M.&#160;Cesarini, Mme&#160;Rilhac, Mme&#160;P&#233;telle, Mme&#160;Racon-Bouzon, M.&#160;Chiche et Mme&#160;Forteza"
  },
  "pointeurFragmentTexte": {
    "missionVisee": {
      "idMissionAN": "825",
      "libelleMission": "Santé",
      "codeMissionPLF": "B",
      "libelleMissionPLF": "Répartition, par mission et programme, des crédits du budget général"
    },
    "division": {
      "titre": "Article 78",
      "articleDesignationCourte": "APRÈS ART. 78",
      "type": "ARTICLE",
      "avantAApres": "Apres",
      "divisionRattachee": "APRÈS L'ARTICLE 78, insérer l'article suivant:",
      "articleAdditionnel": "1",
      "urlDivisionTexteVise": "/15/textes/2272C.asp#D_Article_78"
    }
  },
  "corps": {
    "dispositif": "<p style=\"text-align: justify;\">&#160;</p><p style=\"text-align: justify;\">I.&#160;&#8211;&#160;&#192; l&#8217;alin&#233;a&#160;9, apr&#232;s le mot&#160;:</p><p style=\"text-align: justify;\">&#171;&#160;La&#160;&#187;</p><p style=\"text-align: justify;\">ins&#233;rer le mot&#160;:</p><p style=\"text-align: justify;\">&#171;&#160;premi&#232;re&#160;&#187;</p><p style=\"text-align: justify;\">II.&#160;&#8211;&#160;En cons&#233;quence, apr&#232;s l&#8217;alin&#233;a&#160;10, ins&#233;rer les deux alin&#233;as suivants&#160;:</p><p style=\"text-align: justify;\">&#171;&#160;Toute demande de renouvellement de l&#8217;aide m&#233;dicale de l&#8217;&#201;tat peut &#234;tre d&#233;pos&#233;e aupr&#232;s&#160;: d&#8217;un organisme d&#8217;assurance maladie qui en assure l&#8217;instruction par d&#233;l&#233;gation de l&#8217;&#201;tat&#160;; d&#8217;un &#233;tablissement de sant&#233; dans lesquels le demandeur est pris en charge&#160;; d&#8217;un centre communal ou intercommunal d&#8217;action sociale du lieu de r&#233;sidence de l&#8217;int&#233;ress&#233;&#160;; des services sanitaires et sociaux du d&#233;partement de r&#233;sidence&#160;; des associations ou organismes &#224; but non lucratif agr&#233;&#233;s &#224; cet effet par d&#233;cision du repr&#233;sentant de l&#8217;&#201;tat dans le d&#233;partement.</p><p style=\"text-align: justify;\">&#171;&#160;Dans tous ces cas, l&#8217;organisme transmet le dossier de demande pour instruction &#224; l&#8217;organisme d&#8217;assurance maladie.&#160;&#187;</p>",
    "exposeSommaire": "<p style=\"text-align: justify;\">Sous-amendement de repli</p><p>L&#8217;amendement du Gouvernement pr&#233;voit de limiter les possibilit&#233;s de d&#233;p&#244;t de la demande d&#8217;Aide m&#233;dicale d&#8217;Etat (AME) &#224; une comparution physique en Caisse primaire d&#8217;assurance maladie (CPAM) ou bien, en cas d&#8217;emp&#234;chement, &#224; un d&#233;p&#244;t par l&#8217;interm&#233;diaire de l&#8217;h&#244;pital ou de la permanence d&#8217;acc&#232;s aux soins de sant&#233;.</p><p>Au sein de la population concern&#233;e par cette mesure, il convient de lutter contre le non-recours aux droits et de garantir l&#8217;acc&#232;s aux soins.</p><p>Ce sous-amendement propose de maintenir les possibilit&#233;s de d&#233;p&#244;t de la demande d&#8217;AME existantes pour les demandes de renouvellement d&#8217;Aide m&#233;dicale d&#8217;Etat.&#160;</p><p>La limitation des possibilit&#233;s de d&#233;p&#244;t de la demande d&#8217;Aide m&#233;dicale d&#8217;Etat (AME) &#224; une comparution physique en Caisse primaire d&#8217;assurance pour les premi&#232;res demande d&#8217;AME est de nature &#224; remplir les objectifs poursuivis par le Gouvernement, &#224; savoir la lutte contre des comportements qu&#8217;il qualifie de frauduleux.</p><p>L&#8217;adoption de ce sous-amendement permettrait notamment d&#8217;&#233;viter un engorgement des CPAM et des h&#244;pitaux.</p>"
  },
  "representations": [
    {
      "nom": "PDF",
      "typeMime": {
        "type": "application",
        "subType": "PDF"
      },
      "statutRepresentation": {
        "verbatim": true,
        "canonique": true,
        "officielle": true,
        "transcription": false,
        "enregistrement": false
      },
      "contenu": {
        "documentURI": "/15/amendements/2272C/AN/2236.pdf"
      }
    }
  ],
  "seanceDiscussion": "RUANR5L15S2020IDS21908",
  "sort": {
    "dateSaisie": "2019-11-07T16:35:43.000+01:00",
    "sortEnSeance": "Adopté"
  },
  "dateDepot": "2019-11-07T01:00:00.000+01:00",
  "dateDistribution": "2019-11-07T01:00:00.000+01:00",
  "article99": "0",
  "loiReference": {
    "codeLoi": "c action sociale et familles",
    "divisionCodeLoi": "L251-1"
  }
}