{
  "uid": "AMANR5L15SEA717460BTC1237P0D1N29",
  "identifiant": {
    "legislature": "15",
    "numero": "29",
    "numRect": "0",
    "saisine": {
      "texteLegislatifRef": "PRJLANR5L15BTC1237",
      "numeroPartiePLF": "0",
      "organeExamen": "PO717460",
      "mentionSecondeDeliberation": "0"
    }
  },
  "numeroLong": "29",
  "etapeTexte": "1ère lecture (1ère assemblée saisie)",
  "triAmendement": "accaaaaaaaaaaaaaaaaaaaaaaaaaaaaaaaaaaaaaaaaaaaaaaat",
  "cardinaliteAmdtMultiples": "1",
  "etat": "Discuté",
  "signataires": {
    "auteur": {
      "typeAuteur": "Depute",
      "acteurRef": "PA334149",
      "groupePolitiqueRef": "PO730934"
    },
    "cosignatairesRefs": [
      "PA606712",
      "PA721506",
      "PA713448",
      "PA334149",
      "PA267378",
      "PA642847",
      "PA608016",
      "PA267204",
      "PA266776",
      "PA1327",
      "PA332523",
      "PA721816",
      "PA609245",
      "PA266793",
      "PA605991",
      "PA709315",
      "PA2792",
      "PA346054",
      "PA340853",
      "PA336316",
      "PA346218",
      "PA720684"
    ],
    "texteAffichable": "M.&#160;Fasquelle,  M.&#160;Bony, M.&#160;Boucard, M.&#160;Bouchet, Mme&#160;Brenier, Mme&#160;Dalloz, M.&#160;Pierre-Henri&#160;Dumont, Mme&#160;Genevard, Mme&#160;Kuster, Mme&#160;Lacroute, M.&#160;Leclerc, Mme&#160;Levy, Mme&#160;Louwagie, M.&#160;Lurton, M.&#160;Emmanuel&#160;Maquet, M.&#160;Masson, M.&#160;Reiss, M.&#160;Sermier, M.&#160;Viala, M.&#160;Forissier, M.&#160;Taugourdeau et M.&#160;Bazin"
  },
  "pointeurFragmentTexte": {
    "division": {
      "titre": "Article 5",
      "articleDesignationCourte": "ART. 5",
      "type": "ARTICLE",
      "avantAApres": "A",
      "divisionRattachee": "ARTICLE 5",
      "urlDivisionTexteVise": "/15/textes/1237.asp#D_Article_5"
    },
    "alinea": {
      "numero": "13"
    }
  },
  "corps": {
    "dispositif": "<p style=\"text-align: justify;\">&#192; la premi&#232;re phrase de l&#8217;alin&#233;a&#160;13, supprimer le mot&#160;:</p><p style=\"text-align: justify;\">&#171;&#160;conjointement&#160;&#187;.</p>",
    "exposeSommaire": "<p style=\"text-align: justify;\">La loi de finances pour 2018 a supprim&#233;, &#224; compter du 1<sup>er</sup>janvier 2018, la taxe fiscale affect&#233;e (TFA) qui alimente le Fonds national de promotion et de communication de l&#8217;artisanat (FNPCA). La TFA provient d&#8217;une majoration de 10&#160;% de la taxe pour frais de chambres de m&#233;tiers (art.&#160;1601 A du CGI) et repr&#233;sente une contribution de 11&#160;&#8364; par an, pour chaque entreprise artisanale.</p><p style=\"text-align: justify;\">La suppression de cette taxe emporte de facto la suppression du FNPCA, dont l&#8217;objet est de contribuer au financement d&#8217;actions de promotion et de communication &#224; caract&#232;re national en faveur de l&#8217;artisanat.</p><p style=\"text-align: justify;\">Or ce dispositif de mutualisation est pleinement voulu par les artisans car il s&#8217;agit du seul moyen pour leurs entreprises d&#8217;acc&#233;der &#224; une communication grand public d&#8217;envergure&#160;: depuis sa cr&#233;ation en 1997, le FNPCA a contribu&#233; &#224; installer durablement, dans l&#8217;esprit du public, une image positive de l&#8217;artisanat et une valorisation essentielle de ses m&#233;tiers.Il a permis de stimuler l&#8217;orientation des jeunes vers l&#8217;apprentissage et l&#8217;emploi dans l&#8217;artisanat. C&#8217;est gr&#226;ce &#224; ce dispositif que l&#8217;Artisanat est aujourd&#8217;hui reconnu par une majorit&#233; des Fran&#231;ais comme &#171;&#160;la Premi&#232;re entreprise de France&#160;&#187;.</p><p style=\"text-align: justify;\">L&#8217;article&#160;5 vise &#224; garantir la continuation du principe de mutualisation, auquel les repr&#233;sentants de l&#8217;artisanat sont attach&#233;s.</p><p style=\"text-align: justify;\">Modifiant la loi n&#176; 96&#8209;603 du 5 juillet 1996 relative au d&#233;veloppement et &#224; la promotion du commerce et de l&#8217;artisanat, l&#8217;article&#160;5 vise &#224; habiliter les organisations professionnelles d&#8217;employeurs reconnues repr&#233;sentatives au niveau national et interprofessionnel, en application de l&#8217;article L.&#160;2152&#8209;6 du code du travail, &#224; conclure un accord pour mettre en &#339;uvre des actions collectives de communication et de promotion &#224; caract&#232;re national en faveur de l&#8217;artisanat et des entreprises artisanales qui sont d&#233;finies &#224; l&#8217;article&#160;19 de la loi n&#176; 96&#8209;603 du 5 juillet 1996 pr&#233;cit&#233;e.</p><p style=\"text-align: justify;\">Ce m&#233;canisme de substitution est compatible avec les r&#232;gles du droit&#160;europ&#233;en et reposera sur une contribution priv&#233;e, port&#233;e par un organisme priv&#233;.</p><p style=\"text-align: justify;\">Le pr&#233;sent amendement a pour objet de sp&#233;cifier que lesdites organisations doivent faire la preuve de leur repr&#233;sentativit&#233; interprofessionnelle sur le champ de l&#8217;artisanat et que l&#8217;accord est r&#233;put&#233; valide, y compris dans le cas o&#249; une seule organisation professionnelle d&#8217;employeurs int&#233;ress&#233;e par l&#8217;artisanat et reconnue repr&#233;sentative au niveau national et interprofessionnel en serait signataire.</p>"
  },
  "representations": [
    {
      "nom": "PDF",
      "typeMime": {
        "type": "application",
        "subType": "PDF"
      },
      "statutRepresentation": {
        "verbatim": true,
        "canonique": true,
        "officielle": true,
        "transcription": false,
        "enregistrement": false
      },
      "contenu": {
        "documentURI": "/15/amendements/1237/AN/29.pdf"
      }
    }
  ],
  "seanceDiscussion": "RUANR5L15S2018IDS21250",
  "sort": {
    "dateSaisie": "2018-09-27T09:58:14.000+02:00",
    "sortEnSeance": "Rejeté"
  },
  "dateDepot": "2018-09-19T02:00:00.000+02:00",
  "dateDistribution": "2018-09-24T02:00:00.000+02:00",
  "article99": "0",
  "loiReference": {}
}