{
  "uid": "AMANR5L15SEA717460B2272P2D1N1040",
  "identifiant": {
    "legislature": "15",
    "numero": "1040",
    "numRect": "0",
    "saisine": {
      "texteLegislatifRef": "PRJLANR5L15B2272",
      "numeroPartiePLF": "2",
      "organeExamen": "PO717460",
      "mentionSecondeDeliberation": "1"
    }
  },
  "numeroLong": "II-1040",
  "etapeTexte": "1ère lecture (1ère assemblée saisie)",
  "triAmendement": "fcaaaaaaaaaaaaaaaaaaaaaaaaaaaaaaaaaaaaaaaaaaaaaaaafchk",
  "cardinaliteAmdtMultiples": "1",
  "etat": "Discuté",
  "signataires": {
    "auteur": {
      "typeAuteur": "Depute",
      "acteurRef": "PA719100",
      "groupePolitiqueRef": "PO730964"
    },
    "cosignatairesRefs": [
      "PA722336",
      "PA722134",
      "PA721036",
      "PA721644",
      "PA720622",
      "PA721522",
      "PA719100",
      "PA719540",
      "PA720146",
      "PA721726",
      "PA720202",
      "PA718876",
      "PA721398",
      "PA719890"
    ],
    "texteAffichable": "M.&#160;Ardouin,  Mme&#160;Degois, Mme&#160;Toutut-Picard, M.&#160;Fi&#233;vet, M.&#160;Batut, M.&#160;Mass&#233;glia, Mme&#160;Mauborgne, Mme&#160;Brulebois, Mme&#160;Bureau-Bonnard, M.&#160;L&#233;na&#239;ck&#160;Adam, M.&#160;Kokouendo, Mme&#160;Krimi, M.&#160;Besson-Moreau et M.&#160;Thi&#233;baut"
  },
  "pointeurFragmentTexte": {
    "division": {
      "titre": "Article 50",
      "articleDesignationCourte": "APRÈS ART. 50",
      "type": "ARTICLE",
      "avantAApres": "Apres",
      "divisionRattachee": "APRÈS L'ARTICLE 50, insérer l'article suivant:",
      "articleAdditionnel": "1",
      "urlDivisionTexteVise": "/15/textes/2272C.asp#D_Article_50"
    }
  },
  "corps": {
    "dispositif": "<p>I.&#160;&#8211;&#160;Le II de la premi&#232;re sous-section de la section II du chapitre I<sup>er</sup> du titre I<sup>er</sup> de la premi&#232;re partie du livre I<sup>er</sup> du code g&#233;n&#233;ral des imp&#244;ts est ainsi modifi&#233;&#160;:</p><p style=\"text-align: justify;\">1&#176;&#160;Au premier alin&#233;a du I de l&#8217;article&#160;44 <i>quindecies</i>, la date&#160;: &#171;&#160;31 d&#233;cembre 2020&#160;&#187; est remplac&#233;e par la date&#160;: &#171;&#160;31&#160;d&#233;cembre 2025&#160;&#187;&#160;;</p><p style=\"text-align: justify;\">2&#176;&#160;Au premier alin&#233;a du I de l&#8217;article&#160;44 <i>sexdecies</i>, la date&#160;: &#171;&#160;31 d&#233;cembre 2020&#160;&#187; est remplac&#233;e par la date&#160;: &#171;&#160;31 d&#233;cembre 2025&#160;&#187;&#160;;</p><p style=\"text-align: justify;\">3&#176;&#160;Au premier alin&#233;a du I de l&#8217;article&#160;44 <i>septdecies</i>, la date&#160;: &#171;&#160;31 d&#233;cembre 2020&#160;&#187; est remplac&#233;e par la date&#160;: &#171;&#160;31 d&#233;cembre 2025&#160;&#187;.</p><p style=\"text-align: justify;\">II.&#160;&#8211;&#160;La perte de recettes pour l&#8217;&#201;tat est compens&#233;e &#224; due concurrence par la cr&#233;ation d&#8217;une taxe additionnelle aux droits mentionn&#233;s aux articles 575 et 575 A du code g&#233;n&#233;ral des imp&#244;ts.&#160;</p>",
    "exposeSommaire": "<p>Cet article additionnel s&#8217;ajouterait apr&#232;s l&#8217;article&#160;48 du PLF 2020 qui vise &#224; permettre une exon&#233;ration de contribution &#233;conomique territoriale et de taxe fonci&#232;re sur les propri&#233;t&#233;s b&#226;ties pour les entreprises commerciales ou artisanales situ&#233;es dans les communes ayant sign&#233; une convention d&#8217;op&#233;ration de revitalisation du territoire, et apr&#232;s l&#8217;article&#160;47 qui pr&#233;voit ce m&#234;me dispositif pour les activit&#233;s commerciales situ&#233;es dans les communes rurales isol&#233;es.</p><p style=\"text-align: justify;\">L&#8217;objet de cet amendement est d&#8217;aligner, comme nous l&#8217;avons propos&#233; dans d&#8217;autres amendements aux articles 47 et 48 du PLF 2020, tous les dispositifs de d&#233;veloppement de l&#8217;activit&#233; en milieu rural (en y incluant, en raison des enjeux similaires, les bassins urbains &#224; dynamiser et les zones de d&#233;veloppement prioritaire) sur une m&#234;me ann&#233;e d&#8217;&#233;ch&#233;ance (en l&#8217;occurrence 2025) permettant une r&#233;flexion globale, id&#233;alement quinquennale ou triennale, sur l&#8217;ensemble de ces mesures.</p>"
  },
  "representations": [
    {
      "nom": "PDF",
      "typeMime": {
        "type": "application",
        "subType": "PDF"
      },
      "statutRepresentation": {
        "verbatim": true,
        "canonique": true,
        "officielle": true,
        "transcription": false,
        "enregistrement": false
      },
      "contenu": {
        "documentURI": "/15/amendements/2272C/AN/1040.pdf"
      }
    }
  ],
  "seanceDiscussion": "RUANR5L15S2020IDS21925",
  "sort": {
    "dateSaisie": "2019-11-15T16:58:01.000+01:00",
    "sortEnSeance": "Non soutenu"
  },
  "dateDepot": "2019-10-28T01:00:00.000+01:00",
  "dateDistribution": "2019-11-13T01:00:00.000+01:00",
  "article99": "0",
  "loiReference": {
    "codeLoi": "CGI",
    "divisionCodeLoi": "44 quindecies"
  }
}