{
  "uid": "AMANR5L15PO59048B1255P1D1N717",
  "identifiant": {
    "legislature": "15",
    "numero": "717",
    "numRect": "0",
    "saisine": {
      "texteLegislatifRef": "PRJLANR5L15B1255",
      "numeroPartiePLF": "1",
      "organeExamen": "PO59048",
      "mentionSecondeDeliberation": "0"
    }
  },
  "numeroLong": "I-CF717",
  "etapeTexte": "1ère lecture (1ère assemblée saisie)",
  "triAmendement": "csaaaaaaaaaaaaaaaaaaaaaaaaaaaaaaaaaaaaaaaaaaaaaaaadsi",
  "cardinaliteAmdtMultiples": "1",
  "etat": "Discuté",
  "signataires": {
    "auteur": {
      "typeAuteur": "Depute",
      "acteurRef": "PA942",
      "groupePolitiqueRef": "PO744425"
    },
    "cosignatairesRefs": [
      "PA712014",
      "PA720230",
      "PA331582",
      "PA942"
    ],
    "texteAffichable": "M.&#160;Charles&#160;de Courson,  M.&#160;Philippe&#160;Vigier, Mme&#160;Magnier et M.&#160;Ledoux"
  },
  "pointeurFragmentTexte": {
    "division": {
      "titre": "Article 13",
      "articleDesignationCourte": "ART. 13",
      "type": "ARTICLE",
      "avantAApres": "A",
      "divisionRattachee": "ARTICLE 13",
      "urlDivisionTexteVise": "/15/textes/1255A.asp#D_Article_13"
    },
    "alinea": {
      "avantAApres": "Apres",
      "numero": "50"
    }
  },
  "corps": {
    "dispositif": "<p style=\"text-align: justify;\">I.&#160;&#8211;&#160;Apr&#232;s l&#8217;alin&#233;a&#160;50, ins&#233;rer les six alin&#233;as suivants&#160;:</p><p style=\"text-align: justify;\">&#171;&#160;V <i>bis.</i>&#160;&#8211;&#160;Les I et V ne s&#8217;appliquent pas aux charges financi&#232;res support&#233;es par le concessionnaire, d&#233;l&#233;gataire, ou partenaire priv&#233;, aff&#233;rentes aux biens acquis ou construits par lui dans le cadre&#160;:</p><p style=\"text-align: justify;\">&#171;&#160;1&#176; D&#8217;un contrat de concession, au sens de l&#8217;article&#160;5 de l&#8217;ordonnance n&#176;2016&#8209;65 du 29 janvier 2016 relative aux contrats de concession&#160;;</p><p style=\"text-align: justify;\">&#171;&#160;2&#176; D&#8217;une d&#233;l&#233;gation de service public mentionn&#233;e &#224; l&#8217;article L.&#160;1411&#8209;1 du code g&#233;n&#233;ral des collectivit&#233;s territoriales, tel que modifi&#233; par l&#8217;ordonnance pr&#233;cit&#233;e&#160;;</p><p style=\"text-align: justify;\">&#171;&#160;3&#176; D&#8217;un march&#233; de partenariat, au sens de l&#8217;article&#160;67 de l&#8217;ordonnance n&#176;2015&#8209;899 du 23 juillet 2015, relative aux march&#233;s publics&#160;;</p><p style=\"text-align: justify;\">&#171;&#160;4&#176; D&#8217;un contrat qui aurait relev&#233; du champ d&#8217;application des textes vis&#233;s aux 1&#176;, 2&#176; et 3&#176;, avant l&#8217;entr&#233;e en vigueur de ces textes.</p><p style=\"text-align: justify;\">&#171;&#160;Les charges financi&#232;res mentionn&#233;es au premier alin&#233;a du pr&#233;sent V bis s&#8217;entendent &#233;galement de celles support&#233;es par la soci&#233;t&#233; dont l&#8217;objet unique est la d&#233;tention de titres de soci&#233;t&#233;s agissant exclusivement en tant que d&#233;l&#233;gataire, concessionnaire ou partenaire priv&#233; dans le cadre de contrats mentionn&#233;s aux 1&#176; &#224; 4&#176;.&#160;&#187;.</p><p style=\"text-align: justify;\">II.&#160;&#8211;&#160;En cons&#233;quence, apr&#232;s l&#8217;alin&#233;a&#160;82, proc&#233;der &#224; la m&#234;me insertion.</p><p style=\"text-align: justify;\">III.&#160;&#8211;&#160;La perte de recettes pour l&#8217;&#201;tat est compens&#233;e &#224; due concurrence par la cr&#233;ation d&#8217;une taxe additionnelle aux droits mentionn&#233;s aux articles 575 et 575 A du code g&#233;n&#233;ral des imp&#244;ts.&#160;&#187;.</p>",
    "exposeSommaire": "<p style=\"text-align: justify;\">L&#8217;article&#160;13 transpose l&#8217;article&#160;4 de la directive (UE) 2016/1164 du conseil du 12 juillet 2016 &#233;tablissant des r&#232;gles pour lutter contre les pratiques d&#8217;&#233;vasion fiscale qui ont une incidence directe sur le fonctionnement du march&#233;&#160;int&#233;rieur (dite &#171;&#160;ATAD&#160;&#187;).</p><p style=\"text-align: justify;\">Le paragraphe 4 de l&#8217;article&#160;4 du chapitre II de la directive (UE) 2016/1164 du conseil du 12 juillet 2016 autorise les &#201;tats membres &#224; exclure les &#171;&#160;emprunts utilis&#233;s pour financer un projet d&#8217;infrastructures publique &#224; long terme,&#8230;&#160;&#187;.</p><p style=\"text-align: justify;\">Cette exception pr&#233;vue par la directive tient compte des efforts exceptionnels n&#233;cessairement consentis dans le financement des projets d&#8217;infrastructures. En effet compte tenu de la taille de ces investissements, dans le cadre de contrats sign&#233;s avec des personnes publiques, certaines entreprises priv&#233;es sont amen&#233;es &#224; s&#8217;endetter massivement et sur le long terme, eu &#233;gard aux montants tr&#232;s significatifs &#224; financer (en dizaines, voire centaines ou milliards d&#8217;euros). En pratique, l&#8217;&#233;quipement est construit ou acquis par la personne priv&#233;e. Ce mode contractuel permet de disposer de cet &#233;quipement et en contrepartie, la personne publique s&#8217;acquitte d&#8217;un loyer, qui prend en compte tous les co&#251;ts expos&#233;s par la personne priv&#233;e, y compris le co&#251;t des emprunts.</p><p style=\"text-align: justify;\">Ne pas transposer l&#8217;exception pr&#233;vue par la directive aurait plusieurs impacts n&#233;gatifs&#160;:</p><ul style=\"text-align: justify;\"><li style=\"text-align: justify;\">Un rench&#233;rissement des co&#251;ts pour les collectivit&#233;s locales&#160;: dans le cadre de l&#8217;article 13 tel que r&#233;dig&#233; aujourd&#8217;hui, le co&#251;t du capital des projets d&#8217;infrastructure va devenir plus cher car il am&#232;nera une augmentation du financement en fonds propres et sera donc r&#233;percut&#233; sur les co-contractants publics et les utilisateurs. Or le loyer expos&#233; par la personne publique tient compte de tous les co&#251;ts expos&#233;s par la personne priv&#233;e dont les co&#251;ts des emprunts, et sera donc r&#233;percut&#233; sur les co-contractants publics. Certes pour l&#8217;Etat, le dispositif est neutre puisqu&#8217;il per&#231;oit un gain d&#8217;imp&#244;t sur les soci&#233;t&#233;s mais cela cr&#233;erait une grande distorsion avec les collectivit&#233;s locales freinant ainsi leurs projets.</li><li style=\"text-align: justify;\">Une baisse s&#233;rieuse de l&#8217;attractivit&#233; de la place de Paris qui est en passe de se positionner comme le centre des investissements dans le domaine des infrastructures. En effet la plupart des pays europ&#233;ens ont repris cette possibilit&#233; d&#8217;exception dans leur droit national.</li><li style=\"text-align: justify;\">Un impact s&#233;rieux sur la relance de l&#8217;&#233;conomie compte tenu de l&#8217;importance du secteur des infrastructures en France.</li><li style=\"text-align: justify;\">Un effet d&#8217;&#233;viction des PME et ETI des march&#233;s publics concern&#233;s, dans la mesure o&#249; l&#8217;effet recherch&#233; par le texte initial est d&#8217;inciter &#224; financer les projets d&#8217;infrastructures publiques de long terme par une plus grande part de fonds propres, plut&#244;t que par endettement. Or les PME et ETI peuvent avoir plus de difficult&#233; &#224; r&#233;unir, m&#234;me pour une quote-part minoritaire, les fonds propres n&#233;cessaires</li><li style=\"text-align: justify;\">De nombreux projets existants verraient une d&#233;gradation de leurs finances car leur structure de financement ne serait plus en ad&#233;quation avec les r&#232;gles de d&#233;ductibilit&#233;. Cela r&#233;duirait aussi leur capacit&#233; &#224; se refinancer, impactant l&#8217;Etat qui est le premier b&#233;n&#233;ficiaire des gains de refinancement des projets d&#8217;infrastructure.</li></ul><p style=\"text-align: justify;\">Le pr&#233;sent amendement a donc pour objet d&#8217;exclure du champ d&#8217;application de l&#8217;article&#160;13 les charges financi&#232;res se rapportant &#224; des emprunts effectu&#233;s en vue de r&#233;aliser ou de g&#233;rer des &#233;quipements publics dans le cadre d&#8217;un contrat de concession, de d&#233;l&#233;gation de service public ou d&#8217;un march&#233; de partenariat.</p><p style=\"text-align: justify;\">&#160;</p>"
  },
  "representations": [
    {
      "nom": "PDF",
      "typeMime": {
        "type": "application",
        "subType": "PDF"
      },
      "statutRepresentation": {
        "verbatim": true,
        "canonique": true,
        "officielle": true,
        "transcription": false,
        "enregistrement": false
      },
      "contenu": {
        "documentURI": "/15/amendements/1255A/CION_FIN/CF717.pdf"
      }
    }
  ],
  "sort": {
    "dateSaisie": "2018-10-10T18:35:55.000+02:00",
    "sortEnSeance": "Retiré"
  },
  "dateDepot": "2018-10-05T02:00:00.000+02:00",
  "dateDistribution": "2018-10-08T02:00:00.000+02:00",
  "article99": "0",
  "loiReference": {}
}