{
  "uid": "AMANR5L15SEA717460BTC1237P0D1N2278",
  "identifiant": {
    "legislature": "15",
    "numero": "2278",
    "numRect": "0",
    "saisine": {
      "texteLegislatifRef": "PRJLANR5L15BTC1237",
      "numeroPartiePLF": "0",
      "organeExamen": "PO717460",
      "mentionSecondeDeliberation": "0"
    }
  },
  "numeroLong": "2278",
  "etapeTexte": "1ère lecture (1ère assemblée saisie)",
  "triAmendement": "ipaaaaaaaaaaaaaaaaaaaaaaaaaaaaaaaaaaaaaaaaaaaaaaaage",
  "cardinaliteAmdtMultiples": "1",
  "etat": "Discuté",
  "signataires": {
    "auteur": {
      "typeAuteur": "Depute",
      "acteurRef": "PA267440",
      "groupePolitiqueRef": "PO730934"
    },
    "cosignatairesRefs": [
      "PA267440"
    ],
    "texteAffichable": "M.&#160;Diard"
  },
  "pointeurFragmentTexte": {
    "division": {
      "titre": "Article 48",
      "articleDesignationCourte": "ART. 48",
      "type": "ARTICLE",
      "avantAApres": "A",
      "divisionRattachee": "ARTICLE 48",
      "urlDivisionTexteVise": "/15/textes/1237.asp#D_Article_48"
    },
    "alinea": {
      "avantAApres": "Apres",
      "numero": "2"
    }
  },
  "corps": {
    "dispositif": "<p style=\"text-align: justify;\">Apr&#232;s l&#8217;alin&#233;a&#160;2, ins&#233;rer l&#8217;alin&#233;a suivant&#160;:</p><p style=\"text-align: justify;\">&#171;&#160;Pour prot&#233;ger les exploitants d&#8217;a&#233;ronefs d&#8217;une situation de monopole g&#233;ographique pouvant entra&#238;ner des niveaux de tarifs de redevances trop &#233;lev&#233;s, le prochain contrat de r&#233;gulation &#233;conomique conclu entre l&#8217;&#201;tat et A&#233;roports de Paris prend effet au 1<sup>er</sup> avril 2020.&#160;&#187;</p>",
    "exposeSommaire": "<p style=\"text-align: justify;\">Si le contrat de r&#233;gulation &#233;conomique 2016&#8209;2020&#160;conclu entre l&#8217;&#201;tat et ADP a gel&#233; le niveau des redevances a&#233;roportuaires pr&#233;lev&#233;es par ADP aux compagnies a&#233;riennes en 2016 (hors inflation), il a, en revanche, autoris&#233; le gestionnaire des a&#233;roports parisiens &#224; augmenter les redevances a&#233;roportuaires de 1,25&#160;% par an (hors inflation) pour les quatre ann&#233;es suivantes.</p><p style=\"text-align: justify;\">C&#8217;est pourquoi il importe que le prochain CRE favorise une mod&#233;ration du niveau des redevances afin de tenir compte de l&#8217;environnement concurrentiel dans lequel &#233;voluent les compagnies a&#233;riennes utilisatrices et plus particuli&#232;rement les compagnies fran&#231;aises et le groupe Air France pour lesquelles les a&#233;roports parisiens sont la base d&#8217;exploitation.</p>"
  },
  "representations": [
    {
      "nom": "PDF",
      "typeMime": {
        "type": "application",
        "subType": "PDF"
      },
      "statutRepresentation": {
        "verbatim": true,
        "canonique": true,
        "officielle": true,
        "transcription": false,
        "enregistrement": false
      },
      "contenu": {
        "documentURI": "/15/amendements/1237/AN/2278.pdf"
      }
    }
  ],
  "seanceDiscussion": "RUANR5L15S2019IDS21261",
  "sort": {
    "dateSaisie": "2018-10-04T09:37:33.000+02:00",
    "sortEnSeance": "Non soutenu"
  },
  "dateDepot": "2018-09-21T02:00:00.000+02:00",
  "dateDistribution": "2018-09-25T02:00:00.000+02:00",
  "article99": "0",
  "loiReference": {}
}