{
  "uid": "AMANR5L15SEA717460B1255P2D1N1596",
  "identifiant": {
    "legislature": "15",
    "numero": "1596",
    "numRect": "0",
    "saisine": {
      "texteLegislatifRef": "PRJLANR5L15B1255",
      "numeroPartiePLF": "2",
      "organeExamen": "PO717460",
      "mentionSecondeDeliberation": "0"
    }
  },
  "numeroLong": "II-1596",
  "etapeTexte": "1ère lecture (1ère assemblée saisie)",
  "triAmendement": "baaeaaaaaaaaaaaaaaaaaaaaaaaaaaaaaaaaaaaaaaaaaaaaaaai",
  "cardinaliteAmdtMultiples": "1",
  "etat": "Discuté",
  "signataires": {
    "auteur": {
      "typeAuteur": "Gouvernement"
    },
    "texteAffichable": "le Gouvernement"
  },
  "pointeurFragmentTexte": {
    "missionVisee": {
      "idMissionAN": "419",
      "libelleMission": "Solidarité, insertion et égalité des chances",
      "codeMissionPLF": "B",
      "libelleMissionPLF": "Répartition, par mission et programme, des crédits du budget général"
    },
    "division": {
      "titre": "ÉTAT B",
      "articleDesignationCourte": "ART. 39",
      "type": "ANNEXE",
      "avantAApres": "A",
      "divisionRattachee": "ARTICLE 39",
      "urlDivisionTexteVise": "/15/textes/1255C.asp#D_ETAT_B"
    }
  },
  "corps": {
    "exposeSommaire": "<p style=\"text-align: justify;\">Afin d&#8217;assurer la revalorisation de la prime d&#8217;activit&#233; de 80 &#8364; au niveau du SMIC d&#8217;ici &#224; 2021, le pr&#233;sent amendement pr&#233;voit les cr&#233;dits suppl&#233;mentaires au financement d&#8217;une bonification de 30 &#8364; au 1er avril 2019. Cette majoration du montant des cr&#233;dits tient compte de ceux qui figuraient initialement dans la budg&#233;tisation pour un bonus cr&#233;&#233; au 1er septembre 2019.</p>",
    "dispositifAmdtCredit": {
      "listeProgrammes": [
        {
          "libelle": "Inclusion sociale et protection des personnes",
          "id": "45635",
          "AE": {
            "montantPositif": "116450000",
            "montantNegatif": "0"
          },
          "CP": {
            "montantPositif": "116450000",
            "montantNegatif": "0"
          },
          "action": "modification"
        },
        {
          "libelle": "Handicap et dépendance",
          "id": "45636",
          "AE": {
            "montantPositif": "0",
            "montantNegatif": "0"
          },
          "CP": {
            "montantPositif": "0",
            "montantNegatif": "0"
          },
          "action": "modification"
        },
        {
          "libelle": "Égalité entre les femmes et les hommes",
          "id": "45637",
          "AE": {
            "montantPositif": "0",
            "montantNegatif": "0"
          },
          "CP": {
            "montantPositif": "0",
            "montantNegatif": "0"
          },
          "action": "modification"
        },
        {
          "libelle": "Conduite et soutien des politiques sanitaires, sociales, du sport, de la jeunesse et de la vie associative",
          "id": "45638",
          "AE": {
            "montantPositif": "0",
            "montantNegatif": "0"
          },
          "CP": {
            "montantPositif": "0",
            "montantNegatif": "0"
          },
          "action": "modification"
        }
      ],
      "totalAE": {
        "montantPositif": "116450000",
        "montantNegatif": "0",
        "solde": "116450000"
      },
      "totalCP": {
        "montantPositif": "116450000",
        "montantNegatif": "0",
        "solde": "116450000"
      }
    }
  },
  "representations": [
    {
      "nom": "PDF",
      "typeMime": {
        "type": "application",
        "subType": "PDF"
      },
      "statutRepresentation": {
        "verbatim": true,
        "canonique": true,
        "officielle": true,
        "transcription": false,
        "enregistrement": false
      },
      "contenu": {
        "documentURI": "/15/amendements/1255C/AN/1596.pdf"
      }
    }
  ],
  "seanceDiscussion": "RUANR5L15S2019IDS21332",
  "sort": {
    "dateSaisie": "2018-11-08T15:40:59.000+01:00",
    "sortEnSeance": "Adopté"
  },
  "dateDepot": "2018-11-07T01:00:00.000+01:00",
  "dateDistribution": "2018-11-07T01:00:00.000+01:00",
  "article99": "1",
  "loiReference": {}
}