{
  "uid": "AMANR5L15SEA717460BTC1883P0D1N111",
  "identifiant": {
    "legislature": "15",
    "numero": "111",
    "numRect": "0",
    "saisine": {
      "texteLegislatifRef": "PIONANR5L15BTC1883",
      "numeroPartiePLF": "0",
      "organeExamen": "PO717460",
      "mentionSecondeDeliberation": "0"
    }
  },
  "numeroLong": "111",
  "etapeTexte": "1ère lecture (1ère assemblée saisie)",
  "triAmendement": "aoaaaaaaaaaaaaaaaaaaaaaaaaaaaaaaaaaaaaaaaaaaaaaaaaem",
  "cardinaliteAmdtMultiples": "1",
  "etat": "Irrecevable",
  "signataires": {
    "auteur": {
      "typeAuteur": "Depute",
      "acteurRef": "PA345722",
      "groupePolitiqueRef": "PO730934"
    },
    "cosignatairesRefs": [
      "PA345722"
    ],
    "texteAffichable": "Mme&#160;Le Grip"
  },
  "pointeurFragmentTexte": {
    "division": {
      "titre": "Article PREMIER",
      "articleDesignationCourte": "ART. PREMIER",
      "type": "ARTICLE",
      "avantAApres": "A",
      "divisionRattachee": "ARTICLE PREMIER",
      "urlDivisionTexteVise": "/15/textes/1883.asp#D_Article_1er"
    },
    "alinea": {
      "numero": "4"
    }
  },
  "corps": {},
  "representations": [
    {
      "nom": "PDF",
      "typeMime": {
        "type": "application",
        "subType": "PDF"
      },
      "statutRepresentation": {
        "verbatim": true,
        "canonique": true,
        "officielle": true,
        "transcription": false,
        "enregistrement": false
      },
      "contenu": {
        "documentURI": "/15/amendements/1883/AN/111.pdf"
      }
    }
  ],
  "dateDepot": "2019-05-02T02:00:00.000+02:00",
  "dateDistribution": "2019-05-03T02:00:00.000+02:00",
  "article99": "0",
  "loiReference": {}
}