{
  "uid": "AMANR5L15SEA717460BTC1924P0D1N764",
  "identifiant": {
    "legislature": "15",
    "numero": "764",
    "numRect": "0",
    "saisine": {
      "texteLegislatifRef": "PRJLANR5L15BTC1924",
      "numeroPartiePLF": "0",
      "organeExamen": "PO717460",
      "mentionSecondeDeliberation": "0"
    }
  },
  "numeroLong": "764",
  "etapeTexte": "1ère lecture (1ère assemblée saisie)",
  "triAmendement": "ebaaaaaaaaaaaaaaaaaaaaaaaaaaaaaaaaaaaaaaaaaaaaaaaabje",
  "cardinaliteAmdtMultiples": "1",
  "etat": "Discuté",
  "signataires": {
    "auteur": {
      "typeAuteur": "Depute",
      "acteurRef": "PA721486",
      "groupePolitiqueRef": "PO744425"
    },
    "cosignatairesRefs": [
      "PA695100",
      "PA267780",
      "PA721486",
      "PA719806"
    ],
    "texteAffichable": "M.&#160;Naegelen,  Mme&#160;Auconie, Mme&#160;Firmin Le Bodo et M.&#160;Meyer&#160;Habib"
  },
  "pointeurFragmentTexte": {
    "division": {
      "titre": "Article 16",
      "articleDesignationCourte": "ART. 16",
      "type": "ARTICLE",
      "avantAApres": "A",
      "divisionRattachee": "ARTICLE 16",
      "urlDivisionTexteVise": "/15/textes/1924.asp#D_Article_16"
    },
    "alinea": {
      "avantAApres": "Apres",
      "numero": "2"
    }
  },
  "corps": {
    "dispositif": "<p>Apr&#232;s l&#8217;alin&#233;a&#160;2, ins&#233;rer les deux alin&#233;as suivants&#160;:</p><p style=\"text-align: justify;\">&#171;&#160;1&#176;B L&#8217;article&#160;14&#160;<i>bis</i> est compl&#233;t&#233; par un alin&#233;a ainsi r&#233;dig&#233;&#160;:</p><p style=\"text-align: justify;\">&#171;&#160;Apr&#232;s une mise en disponibilit&#233; dans un organisme priv&#233; d&#8217;accueil, le fonctionnaire doit repasser le concours correspondant au poste auquel il souhaite &#234;tre r&#233;affect&#233;, si celui-ci est diff&#233;rent du poste qu&#8217;il occupait pr&#233;c&#233;demment &#224; sa mise en disponibilit&#233;, dans les conditions pr&#233;vues par l&#8217;article&#160;16 de la pr&#233;sente loi.&#160;&#187;</p>",
    "exposeSommaire": "<p>Amendement de repli.</p><p style=\"text-align: justify;\">Le pr&#233;sent article vise &#224; une plus grande fluidit&#233; du parcours des agents publics entre le secteur public et le secteur priv&#233; afin de leur permettre d&#8217;acqu&#233;rir et de d&#233;velopper des comp&#233;tences nouvelles et n&#233;cessaires au bon fonctionnement des services publics.</p><p style=\"text-align: justify;\">N&#233;anmoins s&#8217;ils veulent revenir dans le secteur public apr&#232;s un passage dans le priv&#233;, les agents doivent repasser le concours du poste qu&#8217;ils souhaitent reprendre, pour des raisons d&#8217;&#233;quit&#233; des chances, de traitement et de contr&#244;le des comp&#233;tences, et ce si l&#8217;emploi vis&#233; est diff&#233;rent du poste qu&#8217;il occupait pr&#233;c&#233;demment &#224; sa mise en disponibilit&#233;.</p>"
  },
  "representations": [
    {
      "nom": "PDF",
      "typeMime": {
        "type": "application",
        "subType": "PDF"
      },
      "statutRepresentation": {
        "verbatim": true,
        "canonique": true,
        "officielle": true,
        "transcription": false,
        "enregistrement": false
      },
      "contenu": {
        "documentURI": "/15/amendements/1924/AN/764.pdf"
      }
    }
  ],
  "sort": {
    "dateSaisie": "2019-05-17T15:06:28.000+02:00",
    "sortEnSeance": "Non soutenu"
  },
  "dateDepot": "2019-05-09T02:00:00.000+02:00",
  "dateDistribution": "2019-05-16T02:00:00.000+02:00",
  "article99": "0",
  "loiReference": {}
}