{
  "uid": "AMANR5L15PO766718B2187P0D1N365",
  "identifiant": {
    "legislature": "15",
    "numero": "365",
    "numRect": "0",
    "saisine": {
      "texteLegislatifRef": "PRJLANR5L15B2187",
      "numeroPartiePLF": "0",
      "organeExamen": "PO766718",
      "mentionSecondeDeliberation": "0"
    }
  },
  "numeroLong": "365",
  "etapeTexte": "1ère lecture (1ère assemblée saisie)",
  "triAmendement": "haaaaaaaaaaaaaaaaaaaaaaaaaaaaaaaaaaaaaaaaaaaaaaaaahbl",
  "cardinaliteAmdtMultiples": "1",
  "etat": "Retiré",
  "signataires": {
    "auteur": {
      "typeAuteur": "Depute",
      "acteurRef": "PA608416",
      "groupePolitiqueRef": "PO730934"
    },
    "cosignatairesRefs": [
      "PA608416"
    ],
    "texteAffichable": "M.&#160;Hetzel"
  },
  "pointeurFragmentTexte": {
    "division": {
      "titre": "Article 19",
      "articleDesignationCourte": "APRÈS ART. 19",
      "type": "ARTICLE",
      "avantAApres": "Apres",
      "divisionRattachee": "APRÈS L'ARTICLE 19, insérer l'article suivant:",
      "articleAdditionnel": "1",
      "urlDivisionTexteVise": "/15/textes/2187.asp#D_Article_19"
    }
  },
  "corps": {
    "dispositif": "<p style=\"text-align: justify;\">Apr&#232;s le premier alin&#233;a de l&#8217;article L.&#160;1245&#8209;2 du code de la sant&#233; publique, il est ins&#233;r&#233; un alin&#233;a ainsi r&#233;dig&#233;&#160;:</p><p style=\"text-align: justify;\">&#171;&#160;Lorsque le placenta est pr&#233;lev&#233; en vue de l&#8217;&#233;ventuelle utilisation ult&#233;rieure au b&#233;n&#233;fice de l&#8217;enfant des cellules du sang de cordon ombilical conform&#233;ment &#224; l&#8217;article L.&#160;1243&#8209;2-1-A, le consentement pr&#233;alable de la donneuse est requis, apr&#232;s qu&#8217;elle a &#233;t&#233; inform&#233;e des modalit&#233;s de sa conservation.&#160;&#187;</p>",
    "exposeSommaire": "<p>Cet amendement vise &#224; pr&#233;voir le consentement pr&#233;alable de la m&#232;re, apr&#232;s qu&#8217;une information pr&#233;cise sur les modalit&#233;s de conservation du placenta, ses composants et notamment le sang du cordon ombilical lui a &#233;t&#233; d&#233;livr&#233;e.</p><p>&#160;</p>"
  },
  "representations": [
    {
      "nom": "PDF",
      "typeMime": {
        "type": "application",
        "subType": "PDF"
      },
      "statutRepresentation": {
        "verbatim": true,
        "canonique": true,
        "officielle": true,
        "transcription": false,
        "enregistrement": false
      },
      "contenu": {
        "documentURI": "/15/amendements/2187/CSBIOETH/365.pdf"
      }
    }
  ],
  "dateDepot": "2019-08-01T02:00:00.000+02:00",
  "dateDistribution": "2019-09-09T02:00:00.000+02:00",
  "article99": "0",
  "loiReference": {
    "codeLoi": "c santé publique",
    "divisionCodeLoi": "L1245-2"
  }
}