{
  "uid": "AMANR5L15SEA717460BTC2062P0D1N219",
  "identifiant": {
    "legislature": "15",
    "numero": "219",
    "numRect": "0",
    "saisine": {
      "texteLegislatifRef": "PIONANR5L15BTC2062",
      "numeroPartiePLF": "0",
      "organeExamen": "PO717460",
      "mentionSecondeDeliberation": "0"
    }
  },
  "numeroLong": "219",
  "etapeTexte": "1ère lecture (1ère assemblée saisie)",
  "triAmendement": "iiaaaaaaaaaaaaaaaaaaaaaaaaaaaaaaaaaaaaaaaaaaaaaaaaabi",
  "cardinaliteAmdtMultiples": "1",
  "etat": "Discuté",
  "signataires": {
    "auteur": {
      "typeAuteur": "Depute",
      "acteurRef": "PA722170",
      "groupePolitiqueRef": "PO730964"
    },
    "cosignatairesRefs": [
      "PA719728",
      "PA722170",
      "PA718876",
      "PA719664",
      "PA720414",
      "PA719692",
      "PA720538",
      "PA720268",
      "PA721876",
      "PA721398",
      "PA719890",
      "PA719850",
      "PA720854",
      "PA718728",
      "PA721150",
      "PA721726"
    ],
    "texteAffichable": "Mme&#160;Beaudouin-Hubiere,  M.&#160;Lavergne, M.&#160;Damaisin, M.&#160;Besson-Moreau, Mme&#160;Degois, M.&#160;Test&#233;, Mme&#160;Motin, M.&#160;Morenas, M.&#160;Eliaou, Mme&#160;Vanceunebrock-Mialon, Mme&#160;Mauborgne, M.&#160;Perrot, M.&#160;Le Bohec, Mme&#160;De Temmerman, M.&#160;Holroyd et Mme&#160;Brulebois"
  },
  "pointeurFragmentTexte": {
    "division": {
      "titre": "Article 6",
      "articleDesignationCourte": "APRÈS ART. 6",
      "type": "ARTICLE",
      "avantAApres": "Apres",
      "divisionRattachee": "APRÈS L'ARTICLE 6, insérer l'article suivant:",
      "articleAdditionnel": "1",
      "urlDivisionTexteVise": "/15/textes/2062.asp#D_Article_6"
    }
  },
  "corps": {
    "dispositif": "<p>I.&#160;&#8211;&#160;Apr&#232;s le 3&#176;&#160;de l&#8217;article L.&#160;45&#8209;2 du code des postes et des t&#233;l&#233;communications &#233;lectroniques, il est ins&#233;r&#233; un alin&#233;a ainsi r&#233;dig&#233;&#160;:</p><p style=\"text-align: justify;\">&#171;&#160;4&#176; Identique ou apparent&#233; &#224; celui d&#8217;un site&#160;permettant d&#8217;acc&#233;der aux contenus pour lesquels une d&#233;cision pass&#233;e en force de chose jug&#233;e, selon les modalit&#233;s mentionn&#233;es &#224; l&#8217;article&#160;6&#8209;4 de la loi n&#176;&#160;2004&#8209;575 du 21 juin 2004, a &#233;t&#233; rendue.&#160;&#187;</p><p style=\"text-align: justify;\">II.&#160;&#8211;&#160;L&#8217;autorit&#233; administrative transmet aux offices d&#8217;enregistrement mentionn&#233;s &#224; l&#8217;article L.&#160;45 du code des t&#233;l&#233;communications et des postes les noms de domaine des sites&#160;permettant d&#8217;acc&#233;der &#224; des contenus pour lesquels une d&#233;cision pass&#233;e en force de chose jug&#233;e, selon les modalit&#233;s mentionn&#233;es &#224; l&#8217;article&#160;6&#8209;4 de la loi n&#176; 2004&#8209;575 du 21 juin 2004 pour la confiance dans l&#8217;&#233;conomie num&#233;rique, a &#233;t&#233; rendue.</p>",
    "exposeSommaire": "<p>Le pr&#233;sent amendement vise &#224; renforcer la lutte contre les sites miroirs en donnant directement la possibilit&#233; aux fournisseurs de noms de domaines de refuser l&#8217;enregistrement de nom de sites identiques ou apparent&#233;s au nom de sites donnant acc&#232;s &#224; un contenu qui a d&#233;j&#224; &#233;t&#233; condamn&#233; par la justice.</p><p style=\"text-align: justify;\">Il pr&#233;voit ainsi que l&#8217;autorit&#233; administrative communique aux fournisseurs de noms de domaines les sites ayant fait l&#8217;objet d&#8217;une condamnation (1) pour que ces derniers puissent bloquer l&#8217;enregistrement d&#8217;un nom de domaine identique ou apparent&#233; (2).</p>"
  },
  "representations": [
    {
      "nom": "PDF",
      "typeMime": {
        "type": "application",
        "subType": "PDF"
      },
      "statutRepresentation": {
        "verbatim": true,
        "canonique": true,
        "officielle": true,
        "transcription": false,
        "enregistrement": false
      },
      "contenu": {
        "documentURI": "/15/amendements/2062/AN/219.pdf"
      }
    }
  ],
  "seanceDiscussion": "RUANR5L15S2019IDS21752",
  "sort": {
    "dateSaisie": "2019-07-04T21:53:33.000+02:00",
    "sortEnSeance": "Non soutenu"
  },
  "dateDepot": "2019-06-28T02:00:00.000+02:00",
  "dateDistribution": "2019-07-03T02:00:00.000+02:00",
  "article99": "0",
  "loiReference": {
    "codeLoi": "c postes et télécommunications électroniques",
    "divisionCodeLoi": "L45-2"
  }
}