{
  "uid": "AMANR5L15SEA717460B1255P2D1N733",
  "identifiant": {
    "legislature": "15",
    "numero": "733",
    "numRect": "0",
    "saisine": {
      "texteLegislatifRef": "PRJLANR5L15B1255",
      "numeroPartiePLF": "2",
      "organeExamen": "PO717460",
      "mentionSecondeDeliberation": "0"
    }
  },
  "numeroLong": "II-733",
  "etapeTexte": "1ère lecture (1ère assemblée saisie)",
  "triAmendement": "agoaaaaaaaaaaaaaaaaaaaaaaaaaaaaaaaaaaaaaaaaaaaaaaazrw",
  "cardinaliteAmdtMultiples": "1",
  "etat": "Discuté",
  "signataires": {
    "auteur": {
      "typeAuteur": "Depute",
      "acteurRef": "PA720054",
      "groupePolitiqueRef": "PO730964"
    },
    "cosignatairesRefs": [
      "PA719952",
      "PA719154",
      "PA721514",
      "PA719700",
      "PA722292",
      "PA718810",
      "PA718728",
      "PA718710",
      "PA720038",
      "PA720054",
      "PA719464",
      "PA721726",
      "PA606639",
      "PA718876",
      "PA721398",
      "PA722000",
      "PA720154",
      "PA720568",
      "PA720190",
      "PA718802",
      "PA720146",
      "PA719972"
    ],
    "texteAffichable": "M.&#160;Haury,  M.&#160;Nadot, M.&#160;Perea, Mme&#160;Josso, M.&#160;Buchou, M.&#160;Rudigoz, M.&#160;Besson-Moreau, Mme&#160;Vanceunebrock-Mialon, M.&#160;Sorre, Mme&#160;Robert, M.&#160;Mis, M.&#160;Martin, M.&#160;Vignal, M.&#160;Mass&#233;glia, Mme&#160;Sarles, Mme&#160;Mauborgne, Mme&#160;Pascale&#160;Boyer, M.&#160;Hupp&#233;, Mme&#160;Kerbarh, Mme&#160;Degois, Mme&#160;Thill et Mme&#160;Dubr&#233;-Chirat"
  },
  "pointeurFragmentTexte": {
    "missionVisee": {
      "idMissionAN": "402",
      "libelleMission": "Écologie, développement et mobilité durables",
      "codeMissionPLF": "B",
      "libelleMissionPLF": "Répartition, par mission et programme, des crédits du budget général"
    },
    "division": {
      "titre": "ÉTAT B",
      "articleDesignationCourte": "ART. 39",
      "type": "ANNEXE",
      "avantAApres": "A",
      "divisionRattachee": "ARTICLE 39",
      "urlDivisionTexteVise": "/15/textes/1255C.asp#D_ETAT_B"
    }
  },
  "corps": {
    "exposeSommaire": "<p style=\"text-align: justify;\">Le pr&#233;sent amendement vise, au sein de la mission &#201;cologie, &#224; augmenter les cr&#233;dits de l&#8217;expertise, information g&#233;ographique et m&#233;t&#233;orologie de 5&#160;millions d&#8217;euros.</p><p style=\"text-align: justify;\">Cette augmentation de 5&#160;millions d&#8217;euros serait affect&#233;e &#224; M&#233;t&#233;o-France (action 13), qui lance en 2019 l&#8217;acquisition d&#8217;un nouveau supercalculateur, indispensable &#224; son expertise, qui lui permettra de multiplier par 5 sa puissance de calcul. Cet &#233;quipement, dont le retour sur investissement pour l&#8217;ensemble de la collectivit&#233;, en termes de dommages aux biens et aux personnes &#233;vit&#233;s notamment, est estim&#233; &#224; 12&#160;euros pour 1&#160;euro investi, conditionne le maintien du positionnement de cet op&#233;rateur strat&#233;gique au plan mondial ainsi que la qualit&#233; de la recherche, des pr&#233;visions et de la veille assur&#233;es.</p><p style=\"text-align: justify;\">Le minist&#232;re a certes dot&#233; M&#233;t&#233;o-France de 5&#160;millions d&#8217;euros suppl&#233;mentaires en 2019 pour r&#233;aliser cet investissement. Mais cette somme ne couvre pas le co&#251;t r&#233;el de l&#8217;op&#233;ration en 2019, estim&#233; &#224; 10&#160;millions d&#8217;euros. Il est par ailleurs demand&#233; &#224; l&#8217;op&#233;rateur de r&#233;duire ses cr&#233;dits et ses effectifs dans des proportions tr&#232;s importantes, annonc&#233;es d&#232;s 2018.</p><p style=\"text-align: justify;\">L&#8217;op&#233;rateur serait en cons&#233;quence en d&#233;ficit budg&#233;taire &#224; un niveau trop &#233;lev&#233; en 2019. Il est donc propos&#233; d&#8217;affecter 5 millions d&#8217;euros de cr&#233;dits suppl&#233;mentaires au programme 159. Votre rapporteur attire &#233;galement l&#8217;attention sur la n&#233;cessit&#233;, pour M&#233;t&#233;o-France, de disposer d&#8217;une visibilit&#233; &#224; moyen terme sur ses capacit&#233;s d&#8217;investissement pour r&#233;aliser cette op&#233;ration.</p><p style=\"text-align: justify;\">Le pr&#233;sent amendement diminue en cons&#233;quence les cr&#233;dits de l&#8217;action 41 &#171;&#160;ferroviaire&#160;&#187; sur le budget du programme 203 des infrastructures et services de transports de 5 millions d&#8217;euros. Cette ligne budg&#233;taire est dot&#233;e de 2,3 milliards d&#8217;euros.</p>",
    "dispositifAmdtCredit": {
      "listeProgrammes": [
        {
          "libelle": "Infrastructures et services de transports",
          "id": "38719",
          "AE": {
            "montantPositif": "0",
            "montantNegatif": "5000000"
          },
          "CP": {
            "montantPositif": "0",
            "montantNegatif": "5000000"
          },
          "action": "modification"
        },
        {
          "libelle": "Affaires maritimes",
          "id": "38720",
          "AE": {
            "montantPositif": "0",
            "montantNegatif": "0"
          },
          "CP": {
            "montantPositif": "0",
            "montantNegatif": "0"
          },
          "action": "modification"
        },
        {
          "libelle": "Paysages, eau et biodiversité",
          "id": "38721",
          "AE": {
            "montantPositif": "0",
            "montantNegatif": "0"
          },
          "CP": {
            "montantPositif": "0",
            "montantNegatif": "0"
          },
          "action": "modification"
        },
        {
          "libelle": "Expertise, information géographique et météorologie",
          "id": "38722",
          "AE": {
            "montantPositif": "5000000",
            "montantNegatif": "0"
          },
          "CP": {
            "montantPositif": "5000000",
            "montantNegatif": "0"
          },
          "action": "modification"
        },
        {
          "libelle": "Prévention des risques",
          "id": "38723",
          "AE": {
            "montantPositif": "0",
            "montantNegatif": "0"
          },
          "CP": {
            "montantPositif": "0",
            "montantNegatif": "0"
          },
          "action": "modification"
        },
        {
          "libelle": "Énergie, climat et après-mines",
          "id": "38724",
          "AE": {
            "montantPositif": "0",
            "montantNegatif": "0"
          },
          "CP": {
            "montantPositif": "0",
            "montantNegatif": "0"
          },
          "action": "modification"
        },
        {
          "libelle": "Service public de l'énergie",
          "id": "38725",
          "AE": {
            "montantPositif": "0",
            "montantNegatif": "0"
          },
          "CP": {
            "montantPositif": "0",
            "montantNegatif": "0"
          },
          "action": "modification"
        },
        {
          "libelle": "Conduite et pilotage des politiques de l'écologie, du développement et de la mobilité durables",
          "id": "38726",
          "AE": {
            "montantPositif": "0",
            "montantNegatif": "0"
          },
          "CP": {
            "montantPositif": "0",
            "montantNegatif": "0"
          },
          "action": "modification"
        }
      ],
      "totalAE": {
        "montantPositif": "5000000",
        "montantNegatif": "5000000",
        "solde": "0"
      },
      "totalCP": {
        "montantPositif": "5000000",
        "montantNegatif": "5000000",
        "solde": "0"
      }
    }
  },
  "representations": [
    {
      "nom": "PDF",
      "typeMime": {
        "type": "application",
        "subType": "PDF"
      },
      "statutRepresentation": {
        "verbatim": true,
        "canonique": true,
        "officielle": true,
        "transcription": false,
        "enregistrement": false
      },
      "contenu": {
        "documentURI": "/15/amendements/1255C/AN/733.pdf"
      }
    }
  ],
  "seanceDiscussion": "RUANR5L15S2019IDS21326",
  "sort": {
    "dateSaisie": "2018-11-05T23:02:46.000+01:00",
    "sortEnSeance": "Rejeté"
  },
  "dateDepot": "2018-10-30T01:00:00.000+01:00",
  "dateDistribution": "2018-11-02T01:00:00.000+01:00",
  "article99": "0",
  "loiReference": {}
}