{
  "uid": "AMANR5L15SEA717460B2296P0D1N841",
  "identifiant": {
    "legislature": "15",
    "numero": "841",
    "numRect": "0",
    "saisine": {
      "texteLegislatifRef": "PRJLANR5L15B2296",
      "numeroPartiePLF": "0",
      "organeExamen": "PO717460",
      "mentionSecondeDeliberation": "1"
    }
  },
  "numeroLong": "841",
  "etapeTexte": "1ère lecture (1ère assemblée saisie)",
  "triAmendement": "eaiaaaaaaaaaaaaaaaaaaaaaaaaaaaaaaaaaaaaaaaaaaaaaaakkabw",
  "cardinaliteAmdtMultiples": "1",
  "etat": "Discuté",
  "signataires": {
    "auteur": {
      "typeAuteur": "Depute",
      "acteurRef": "PA643134",
      "groupePolitiqueRef": "PO730934"
    },
    "cosignatairesRefs": [
      "PA721410",
      "PA643134",
      "PA340853",
      "PA332523",
      "PA643089",
      "PA330909",
      "PA718838",
      "PA267204",
      "PA605991",
      "PA643103",
      "PA721816",
      "PA1874"
    ],
    "texteAffichable": "Mme&#160;Valentin,  Mme&#160;Bonnivard, Mme&#160;Genevard, M.&#160;Thi&#233;riot, M.&#160;Ferrara, M.&#160;Sermier, Mme&#160;Dalloz, M.&#160;Leclerc, M.&#160;Descoeur, M.&#160;Brun, M.&#160;Le Fur et M.&#160;Boucard"
  },
  "pointeurFragmentTexte": {
    "division": {
      "titre": "Article 28",
      "articleDesignationCourte": "ART. 28",
      "type": "ARTICLE",
      "avantAApres": "A",
      "divisionRattachee": "ARTICLE 28",
      "urlDivisionTexteVise": "/15/textes/2296.asp#D_Article_28"
    },
    "alinea": {
      "numero": "47"
    }
  },
  "corps": {
    "dispositif": "<p style=\"text-align: justify;\">Supprimer les alin&#233;as&#160;47 et 48.</p>",
    "exposeSommaire": "<p style=\"text-align: justify;\">Les fauteuils roulants sont des mat&#233;riels qui s&#8217;usent rapidement. Leurs utilisateurs rencontrent des difficult&#233;s fr&#233;quentes&#160;: probl&#232;mes de rev&#234;tement sur les routes, chemins, trottoirs etc.<br /><br />Il n&#8217;est donc pas admissible de traiter les personnes utilisatrices de tels mat&#233;riels comme de simples consommateurs.<br /><br />C&#8217;est pourquoi cet amendement vise &#224; supprimer la mise en place d&#8217;un syst&#232;me de consigne pour les fauteuils roulants.</p>",
    "cartoucheDelaiDepotDepasse": "Sous réserve de son traitement par les services de l'Assemblée nationale et de sa recevabilité"
  },
  "representations": [
    {
      "nom": "PDF",
      "typeMime": {
        "type": "application",
        "subType": "PDF"
      },
      "statutRepresentation": {
        "verbatim": true,
        "canonique": true,
        "officielle": true,
        "transcription": false,
        "enregistrement": false
      },
      "contenu": {
        "documentURI": "/15/amendements/2296/AN/841.pdf"
      }
    }
  ],
  "seanceDiscussion": "RUANR5L15S2020IDS21879",
  "sort": {
    "dateSaisie": "2019-10-24T22:43:49.000+02:00",
    "sortEnSeance": "Adopté"
  },
  "dateDepot": "2019-10-17T02:00:00.000+02:00",
  "dateDistribution": "2019-10-24T02:00:00.000+02:00",
  "article99": "0",
  "loiReference": {}
}