{
  "uid": "AMANR5L15SEA717460B1255P2D1N805",
  "identifiant": {
    "legislature": "15",
    "numero": "805",
    "numRect": "0",
    "saisine": {
      "texteLegislatifRef": "PRJLANR5L15B1255",
      "numeroPartiePLF": "2",
      "organeExamen": "PO717460",
      "mentionSecondeDeliberation": "0"
    }
  },
  "numeroLong": "II-805",
  "etapeTexte": "1ère lecture (1ère assemblée saisie)",
  "triAmendement": "bagiaaaaaaaaaaaaaaaaaaaaaaaaaaaaaaaaaaaaaaaaaaaaaaji",
  "cardinaliteAmdtMultiples": "1",
  "etat": "Discuté",
  "signataires": {
    "auteur": {
      "typeAuteur": "Rapporteur",
      "acteurRef": "PA719060",
      "organeRef": "PO59048",
      "groupePolitiqueRef": "PO730964"
    },
    "cosignatairesRefs": [
      "PA719472",
      "PA719060",
      "PA746"
    ],
    "texteAffichable": "M.&#160;Jerretie, rapporteur sp&#233;cial au nom de la commission des finances,  M.&#160;Cazeneuve et M.&#160;Carrez"
  },
  "pointeurFragmentTexte": {
    "missionVisee": {
      "idMissionAN": "415",
      "libelleMission": "Relations avec les collectivités territoriales",
      "codeMissionPLF": "B",
      "libelleMissionPLF": "Répartition, par mission et programme, des crédits du budget général"
    },
    "division": {
      "titre": "Article 79",
      "articleDesignationCourte": "APRÈS ART. 79",
      "type": "ARTICLE",
      "avantAApres": "Apres",
      "divisionRattachee": "APRÈS L'ARTICLE 79, insérer l'article suivant:",
      "articleAdditionnel": "1",
      "urlDivisionTexteVise": "/15/textes/1255C.asp#D_Article_79"
    }
  },
  "corps": {
    "dispositif": "<p style=\"text-align: justify;\">Au second alin&#233;a du <i>b</i> du 2 du G du XV de l&#8217;article&#160;59 de la loi n&#176; 2015&#8209;991 du 7 ao&#251;t 2015 portant nouvelle organisation territoriale de la R&#233;publique, l&#8217;ann&#233;e&#160;: &#171;&#160;2018&#160;&#187; est remplac&#233;e par l&#8217;ann&#233;e&#160;:&#160;&#171;&#160;2019&#160;&#187;.</p>",
    "exposeSommaire": "<p style=\"text-align: justify;\">Afin de viser la neutralit&#233; financi&#232;re &#224; l&#8217;occasion de la cr&#233;ation de la M&#233;tropole du Grand Paris (MGP), une dotation d&#8217;&#233;quilibre a &#233;t&#233; institu&#233;e entre la MGP et chaque &#233;tablissement public territorial (EPT).</p><p style=\"text-align: justify;\">Pour chaque EPT, la dotation d&#8217;&#233;quilibre vers&#233;e ou per&#231;ue, &#224; compter de 2016, par la MGP est &#233;gale &#224; la diff&#233;rence entre&#160;: les produits per&#231;us en 2015 par les &#233;tablissements publics de coop&#233;ration intercommunale (EPCI) pr&#233;existants (cotisation fonci&#232;re des entreprises, cotisation sur la valeur ajout&#233;e des entreprises, imposition forfaitaire pour les entreprises de r&#233;seaux, taxe sur les surfaces commerciales, taxe additionnelle &#224; la taxe fonci&#232;re sur les propri&#233;t&#233;s non b&#226;ties, dotation de compensation de la part salaires, dotation d&#8217;intercommunalit&#233; index&#233;e &#224; compter de 2016 selon le taux d&#8217;&#233;volution de la dotation per&#231;ue par la MGP, taxe d&#8217;habitation, taxe fonci&#232;re sur les propri&#233;t&#233;s b&#226;ties, taxe fonci&#232;re sur les propri&#233;t&#233;s non b&#226;ties) apr&#232;s d&#233;duction des attributions de compensation vers&#233;es ou per&#231;ues au titre du m&#234;me exercice par ces EPCI (premier terme)&#160;; et la somme du produit de la cotisation fonci&#232;re des entreprises et du produit de la taxe d&#8217;habitation, de la taxe fonci&#232;re sur les propri&#233;t&#233;s b&#226;ties et de la taxe fonci&#232;re sur les propri&#233;t&#233;s non b&#226;ties per&#231;us en 2015 par les EPCI pr&#233;existants, major&#233; de la dotation de compensation de la part salaires (second terme).</p><p style=\"text-align: justify;\">&#192; noter que pour les communes qui n&#8217;&#233;taient pas membres d&#8217;un EPCI au 31 d&#233;cembre 2015, l&#8217;EPT acquitte &#224; la MGP une dotation &#233;gale au produit de la cotisation fonci&#232;re des entreprises per&#231;u par lesdites communes l&#8217;ann&#233;e pr&#233;c&#233;dant la cr&#233;ation de la m&#233;tropole.</p><p style=\"text-align: justify;\">Aux termes du dernier alin&#233;a du <i>a</i> du 2 du G du XV de l&#8217;article&#160;59 de la loi n&#176; 2015&#8209;991 du 7 ao&#251;t 2015 portant nouvelle organisation territoriale de la R&#233;publique (NOTRE), la dotation d&#8217;intercommunalit&#233; est bien incluse dans le premier terme de la dotation d&#8217;&#233;quilibre, soit le panier de produits per&#231;us en 2015 par les &#233;tablissements publics de coop&#233;ration intercommunale (EPCI) pr&#233;existants, dont la perception est garantie pour les EPT, moyennant son indexation, &#224; compter de 2016, selon le taux d&#8217;&#233;volution de la dotation per&#231;ue par la MGP. Cette disposition logique correspond bien &#224; la demande de neutralit&#233; financi&#232;re exprim&#233;e par la quasi-unanimit&#233; des maires de la m&#233;tropole.</p><p style=\"text-align: justify;\">Cependant, la loi n&#8217;organise &#224; ce jour cette neutralit&#233; financi&#232;re que de mani&#232;re provisoire, puisque le second alin&#233;a du <i>b</i> du 2 du G du XV de l&#8217;article&#160;59 de la loi n&#176; 2015&#8209;991 du 7 ao&#251;t 2015 portant nouvelle organisation territoriale de la R&#233;publique dispose que &#171;&#160;le dernier alin&#233;a du <i>a</i> du pr&#233;sent 2 est applicable jusqu&#8217;&#224; l&#8217;exercice budg&#233;taire 2018 inclus&#160;&#187;. Ainsi, la dotation d&#8217;intercommunalit&#233; index&#233;e ne serait compens&#233;e aux EPT que jusqu&#8217;en 2018, qui perdraient cette ressource en 2019 au profit de la MGP.</p><p style=\"text-align: justify;\">Or, la dotation d&#8217;intercommunalit&#233; &#233;tait per&#231;ue par les anciens EPCI pour participer au financement des comp&#233;tences obligatoires et facultatives qu&#8217;ils exer&#231;aient et qui ont &#233;t&#233; reprises par les EPT. La disparition de la compensation de la dotation d&#8217;intercommunalit&#233; des ex-EPCI dans la dotation d&#8217;&#233;quilibre en 2019 priverait donc les EPT des ressources indispensables pour financer les comp&#233;tences qu&#8217;ils continuent d&#8217;exercer aujourd&#8217;hui. La neutralit&#233; financi&#232;re ne serait ainsi plus assur&#233;e &#224; compter de cette date, alors m&#234;me qu&#8217;en vertu de ce principe la dotation d&#8217;&#233;quilibre a vocation &#171;&#160;&#224; garantir le niveau de financement de chaque &#233;tablissement public territorial&#160;&#187;.</p><p style=\"text-align: justify;\">De mani&#232;re g&#233;n&#233;rale, rien ne justifie que le b&#233;n&#233;fice de cette dotation, qui int&#232;gre des crit&#232;res de p&#233;r&#233;quation et qui vient financer les constructions intercommunales tr&#232;s int&#233;gr&#233;es, soit retir&#233; aux EPT concern&#233;s. Il convient de rappeler que le panel des comp&#233;tences de ces &#233;tablissements est vari&#233; et qu&#8217;ils exercent, pour certains d&#8217;entre eux, des comp&#233;tences de proximit&#233; comme la gestion d&#8217;&#233;quipements publics (piscines, biblioth&#232;ques, conservatoires&#8230;) n&#8217;ayant pas vocation &#224; &#234;tre transf&#233;r&#233;s &#224; la m&#233;tropole et pour lesquels ils doivent conserver des marges d&#8217;autofinancement.</p><p style=\"text-align: justify;\">La fin de la compensation de la dotation d&#8217;intercommunalit&#233; repr&#233;senterait ainsi pour les EPT une perte de ressources de plusieurs dizaines de millions d&#8217;euros d&#232;s 2019. Pour la plupart dont les investissements sont aujourd&#8217;hui particuli&#232;rement strat&#233;giques pour le d&#233;veloppement de leurs territoires respectifs, cette perte s&#232;che serait insupportable et se traduirait d&#232;s 2019 par une &#233;pargne nette n&#233;gative pour quatre d&#8217;entre eux et pour six autres, une capacit&#233; d&#8217;investissement quasi nulle, un seul GPSO, conservant des finances exc&#233;dentaires.</p><p style=\"text-align: justify;\">Tant que la n&#233;cessaire simplification du mille-feuille institutionnel mis en place par la loi NOTRE en r&#233;gion parisienne ne sera pas intervenue, les &#233;quilibres financiers actuels ne peuvent qu&#8217;&#234;tre maintenus.</p><p style=\"text-align: justify;\">Tel est l&#8217;objet de cet amendement qui propose de prolonger en 2019 le dispositif mis en place depuis la cr&#233;ation de la MGP et des EPT en 2016.</p>"
  },
  "representations": [
    {
      "nom": "PDF",
      "typeMime": {
        "type": "application",
        "subType": "PDF"
      },
      "statutRepresentation": {
        "verbatim": true,
        "canonique": true,
        "officielle": true,
        "transcription": false,
        "enregistrement": false
      },
      "contenu": {
        "documentURI": "/15/amendements/1255C/AN/805.pdf"
      }
    }
  ],
  "seanceDiscussion": "RUANR5L15S2019IDS21333",
  "sort": {
    "dateSaisie": "2018-11-09T01:04:28.000+01:00",
    "sortEnSeance": "Adopté"
  },
  "dateDepot": "2018-10-30T01:00:00.000+01:00",
  "dateDistribution": "2018-11-07T01:00:00.000+01:00",
  "article99": "0",
  "loiReference": {
    "codeLoi": "loi 2015-991",
    "divisionCodeLoi": "59"
  }
}