{
  "uid": "AMANR5L15SEA717460BTC1974P0D1N1091",
  "identifiant": {
    "legislature": "15",
    "numero": "1091",
    "numRect": "1",
    "saisine": {
      "texteLegislatifRef": "PRJLANR5L15BTC1974",
      "numeroPartiePLF": "0",
      "organeExamen": "PO717460",
      "mentionSecondeDeliberation": "0"
    }
  },
  "numeroLong": "1091 (Rect)",
  "etapeTexte": "1ère lecture (2ème assemblée saisie)",
  "triAmendement": "hiaaaiaaaaaaaaaaaaaaaaaaaaaaaaaaaaaaaaaaaaaaaaaaaazzznzzyzzzzz",
  "cardinaliteAmdtMultiples": "1",
  "etat": "Discuté",
  "signataires": {
    "auteur": {
      "typeAuteur": "Depute",
      "acteurRef": "PA267429",
      "groupePolitiqueRef": "PO730934"
    },
    "cosignatairesRefs": [
      "PA267429"
    ],
    "texteAffichable": "M.&#160;Cinieri"
  },
  "pointeurFragmentTexte": {
    "division": {
      "titre": "Article 1er A",
      "articleDesignationCourte": "ART. 1ER A",
      "type": "ARTICLE",
      "avantAApres": "A",
      "divisionRattachee": "ARTICLE 1ER A",
      "urlDivisionTexteVise": "/15/textes/1974.asp#D_Article_1er_A"
    }
  },
  "corps": {
    "dispositif": "<p style=\"text-align: justify;\">Compl&#233;ter l&#8217;alin&#233;a&#160;5 par la phrase suivante&#160;:</p><p style=\"text-align: justify;\">&#171;&#160;L&#8217;&#201;tat impulse une exp&#233;rimentation d&#8217;une ou plusieurs lignes Intercit&#233;s de nuit avec une haute qualit&#233; de service de bout en bout jusqu&#8217;en gare, dont un service douches, une vari&#233;t&#233; de conforts suivant les crit&#232;res europ&#233;ens, des horaires optimis&#233;s et un effort de promotion.&#160;&#187;</p>",
    "exposeSommaire": "<p style=\"text-align: justify;\">Les clients estiment que la qualit&#233; de service est insuffisante sur les trains Intercit&#233;s de nuit,&#160; alors qu&#8217; il existe une demande croissante en France et en Europe pour des mobilit&#233;s longue distance peu &#233;nergivores.</p><p style=\"text-align: justify;\">Aujourd&#8217;hui la gare terminus Paris-Austerlitz n&#8217;offre plus de douche, quand en Europe il y a des douches m&#234;me dans les trains. Les horaires sont d&#233;grad&#233;s, avec par exemple une arriv&#233;e trop t&#244;t &#224; Toulouse et trop tard &#224; Perpignan.</p><p style=\"text-align: justify;\">Les trains de nuit europ&#233;ens disposent d&#8217;au moins 4 niveaux de conforts tandis que le service SNCF risque de perdre les si&#232;ges inclinables qui sont pourtant appr&#233;ci&#233;s pour les &#171;&#160;petits prix&#160;&#187;. L&#8217;offre premium est aussi d&#233;sesp&#233;r&#233;ment absente, alors qu&#8217;elle permettrait de faire monter les d&#233;cideurs dans le train. La France prend du retard pour cette mobilit&#233; pourtant cl&#233; pour l&#8217;am&#233;nagement du territoire et pour le climat.</p><p style=\"text-align: justify;\">Une exp&#233;rimentation &#224; haut niveau de service est donc n&#233;cessaire pour &#233;valuer le potentiel r&#233;el de cette mobilit&#233; innovante.</p>"
  },
  "representations": [
    {
      "nom": "PDF",
      "typeMime": {
        "type": "application",
        "subType": "PDF"
      },
      "statutRepresentation": {
        "verbatim": true,
        "canonique": true,
        "officielle": true,
        "transcription": false,
        "enregistrement": false
      },
      "contenu": {
        "documentURI": "/15/amendements/1974/AN/1091.pdf"
      }
    }
  ],
  "seanceDiscussion": "RUANR5L15S2019IDS21698",
  "sort": {
    "dateSaisie": "2019-06-13T12:51:25.000+02:00",
    "sortEnSeance": "Non soutenu"
  },
  "dateDepot": "2019-05-28T02:00:00.000+02:00",
  "dateDistribution": "2019-06-11T02:00:00.000+02:00",
  "article99": "0",
  "loiReference": {}
}