{
  "uid": "AMANR5L15SEA717460BTC1662P0D1N133",
  "identifiant": {
    "legislature": "15",
    "numero": "133",
    "numRect": "0",
    "saisine": {
      "texteLegislatifRef": "PIONANR5L15BTC1662",
      "numeroPartiePLF": "0",
      "organeExamen": "PO717460",
      "mentionSecondeDeliberation": "0"
    }
  },
  "numeroLong": "133",
  "etapeTexte": "1ère lecture (2ème assemblée saisie)",
  "triAmendement": "biaaaaaaaaaaaaaaaaaaaaaaaaaaaaaaaaaaaaaaaaaaaaaaaaiem",
  "cardinaliteAmdtMultiples": "1",
  "etat": "Discuté",
  "signataires": {
    "auteur": {
      "typeAuteur": "Depute",
      "acteurRef": "PA608016",
      "groupePolitiqueRef": "PO730934"
    },
    "cosignatairesRefs": [
      "PA1327",
      "PA609245",
      "PA721054",
      "PA330684",
      "PA1029",
      "PA1012",
      "PA608016",
      "PA722390",
      "PA720684"
    ],
    "texteAffichable": "Mme&#160;Louwagie,  M.&#160;Deflesselles, M.&#160;Pierre-Henri&#160;Dumont, Mme&#160;Val&#233;rie&#160;Boyer, M.&#160;de la Verpilli&#232;re, Mme&#160;Corneloup, M.&#160;Lorion, M.&#160;Forissier et Mme&#160;Lacroute"
  },
  "pointeurFragmentTexte": {
    "division": {
      "titre": "Article 3",
      "articleDesignationCourte": "ART. 3",
      "type": "ARTICLE",
      "avantAApres": "A",
      "divisionRattachee": "ARTICLE 3",
      "urlDivisionTexteVise": "/15/textes/1662.asp#D_Article_3"
    },
    "alinea": {
      "numero": "5"
    }
  },
  "corps": {
    "dispositif": "<p style=\"text-align: justify;\">&#192; l&#8217;alin&#233;a&#160;5, apr&#232;s la seconde occurrence du mot&#160;:</p><p style=\"text-align: justify;\">&#171;&#160;repr&#233;sentants&#160;&#187;,</p><p style=\"text-align: justify;\">ins&#233;rer les mots&#160;:</p><p style=\"text-align: justify;\">&#171;&#160;de chaque niveau&#160;&#187;.</p>",
    "exposeSommaire": "<p style=\"text-align: justify;\">Au sein du conseil d&#8217;administration, il est essentiel de pr&#233;voir une repr&#233;sentation de chaque niveau des collectivit&#233;s territoriales. Tel est l&#8217;objet de cet amendement.</p>"
  },
  "representations": [
    {
      "nom": "PDF",
      "typeMime": {
        "type": "application",
        "subType": "PDF"
      },
      "statutRepresentation": {
        "verbatim": true,
        "canonique": true,
        "officielle": true,
        "transcription": false,
        "enregistrement": false
      },
      "contenu": {
        "documentURI": "/15/amendements/1662/AN/133.pdf"
      }
    }
  ],
  "seanceDiscussion": "RUANR5L15S2019IDS21545",
  "sort": {
    "dateSaisie": "2019-03-12T23:09:15.000+01:00",
    "sortEnSeance": "Rejeté"
  },
  "dateDepot": "2019-02-18T01:00:00.000+01:00",
  "dateDistribution": "2019-03-08T01:00:00.000+01:00",
  "article99": "0",
  "loiReference": {}
}