{
  "uid": "AMANR5L15SEA717460BTC1924P0D1N933",
  "identifiant": {
    "legislature": "15",
    "numero": "933",
    "numRect": "0",
    "saisine": {
      "texteLegislatifRef": "PRJLANR5L15BTC1924",
      "numeroPartiePLF": "0",
      "organeExamen": "PO717460",
      "mentionSecondeDeliberation": "0"
    }
  },
  "numeroLong": "933",
  "etapeTexte": "1ère lecture (1ère assemblée saisie)",
  "triAmendement": "isaaaaaaaaaaaaaaaaaaaaaaaaaaaaaaaaaaaaaaaaaaaaaaaag",
  "cardinaliteAmdtMultiples": "1",
  "etat": "En recevabilité",
  "signataires": {
    "auteur": {
      "typeAuteur": "Depute",
      "acteurRef": "PA719570",
      "groupePolitiqueRef": "PO730964"
    },
    "cosignatairesRefs": [
      "PA719570"
    ],
    "texteAffichable": "Mme&#160;Fabre"
  },
  "pointeurFragmentTexte": {
    "division": {
      "titre": "Article 22",
      "articleDesignationCourte": "APRÈS ART. 22",
      "type": "ARTICLE",
      "avantAApres": "Apres",
      "divisionRattachee": "APRÈS L'ARTICLE 22, insérer l'article suivant:",
      "articleAdditionnel": "1",
      "urlDivisionTexteVise": "/15/textes/1924.asp#D_Article_22"
    }
  },
  "corps": {
    "dispositif": "<p>Le 5&#176;&#160;de l&#8217;article&#160;12&#8209;1 de la loi n&#176; 84&#8209;53 du 26 janvier 1984 portant dispositions statutaires relatives &#224; la fonction publique territoriale est ainsi r&#233;dig&#233;&#160;:</p><p style=\"text-align: justify;\">&#171;&#160;5&#176;&#160;Le recensement des m&#233;tiers et des capacit&#233;s d&#8217;accueil en mati&#232;re d&#8217;apprentissage dans les collectivit&#233;s territoriales et les &#233;tablissements mentionn&#233;s &#224; l&#8217;article&#160;2 ainsi que le financement et la mise en &#339;uvre d&#8217;actions visant au d&#233;veloppement de l&#8217;apprentissage dans les collectivit&#233;s et les &#233;tablissements pr&#233;cit&#233;s. Les modalit&#233;s de mise en &#339;uvre de ces actions sont d&#233;finies dans le cadre d&#8217;une convention annuelle d&#8217;objectifs et de moyens conclue entre l&#8217;&#201;tat et le Centre national de la fonction publique territoriale. L&#8217;&#201;tat et le Centre national de la fonction publique territoriale conviennent lors de cette convention d&#8217;un objectif quantitatif de contrats d&#8217;apprentissage dans la fonction publique territoriale. Le Centre national de la fonction publique territoriale consacre des financements d&#233;di&#233;s &#224; l&#8217;apprentissage et mutualise ces financements.&#160;&#187;</p>",
    "exposeSommaire": "<p>Cet amendement a pour objectif de renforcer l&#8217;action du CNFPT pour l&#8217;apprentissage en int&#233;grant dans ses missions un volet financement de l&#8217;apprentissage et un volet objectif chiffr&#233; de formations en apprentissage. Il pose aussi le principe d&#8217;une mutualisation de ce financement.</p><p style=\"text-align: justify;\">Cette pr&#233;cision permet d&#8217;assurer le financement des actions de d&#233;veloppement de l&#8217;apprentissage au sein de la fonction publique territoriale mais &#233;galement de r&#233;fl&#233;chir via convention &#224; des objectifs chiffr&#233;s de r&#233;sultats de formation en apprentissage permettant ainsi d&#8217;assurer un nombre croissant d&#8217;apprentis dans la fonction publique territoriale.</p><p style=\"text-align: justify;\">Cet amendement ne constitue pas une charge puisqu&#8217;il ne requiert pas d&#8217;augmentation du budget du CNFPT mais simplement une clarification dans la distribution de l&#8217;enveloppe budg&#233;taire existante.</p><p style=\"text-align: justify;\">La mutualisation est essentielle pour le financement de l&#8217;apprentissage dans les petites collectivit&#233;s territoriales qui ont du mal &#224; se financer seules.</p>",
    "cartoucheDelaiDepotDepasse": "Sous réserve de son traitement par les services de l'Assemblée nationale et de sa recevabilité"
  },
  "representations": [
    {
      "nom": "PDF",
      "typeMime": {
        "type": "application",
        "subType": "PDF"
      },
      "statutRepresentation": {
        "verbatim": true,
        "canonique": true,
        "officielle": true,
        "transcription": false,
        "enregistrement": false
      },
      "contenu": {
        "documentURI": "/15/amendements/1924/AN/933.pdf"
      }
    }
  ],
  "dateDepot": "2019-05-09T02:00:00.000+02:00",
  "dateDistribution": "2019-05-10T02:00:00.000+02:00",
  "article99": "0",
  "loiReference": {
    "codeLoi": "loi 84-53",
    "divisionCodeLoi": "12-1"
  }
}