{
  "uid": "AMANR5L15PO757134B1088P0D1N394",
  "identifiant": {
    "legislature": "15",
    "numero": "394",
    "numRect": "0",
    "saisine": {
      "texteLegislatifRef": "PRJLANR5L15B1088",
      "numeroPartiePLF": "0",
      "organeExamen": "PO757134",
      "mentionSecondeDeliberation": "0"
    }
  },
  "numeroLong": "394",
  "etapeTexte": "1ère lecture (1ère assemblée saisie)",
  "triAmendement": "bbcaaaaaaaaaaaaaaaaaaaaaaaaaaaaaaaaaaaaaaaaaaaaaaaej",
  "cardinaliteAmdtMultiples": "1",
  "etat": "Discuté",
  "signataires": {
    "auteur": {
      "typeAuteur": "Depute",
      "acteurRef": "PA942",
      "groupePolitiqueRef": "PO744425"
    },
    "cosignatairesRefs": [
      "PA331567",
      "PA642868",
      "PA332228",
      "PA942"
    ],
    "texteAffichable": "M.&#160;Charles&#160;de Courson,  M.&#160;Christophe, Mme&#160;de La Raudi&#232;re et M.&#160;Benoit"
  },
  "pointeurFragmentTexte": {
    "division": {
      "titre": "Article 13",
      "articleDesignationCourte": "ART. 13",
      "type": "ARTICLE",
      "avantAApres": "A",
      "divisionRattachee": "ARTICLE 13",
      "urlDivisionTexteVise": "/15/textes/1088.asp#D_Article_13"
    },
    "alinea": {
      "numero": "6"
    }
  },
  "corps": {
    "dispositif": "<p style=\"text-align: justify;\">I.&#160;&#8211;&#160;R&#233;diger ainsi l&#8217;alin&#233;a&#160;7&#160;:</p><p style=\"text-align: justify;\">&#171;&#160;Les personnels de CCI France, des chambres de commerce et d&#8217;industrie de r&#233;gion et des chambres de commerce et d&#8217;industrie territoriales rel&#232;vent des dispositions du code du travail applicables aux salari&#233;s de droit priv&#233;.&#160;&#187;.</p><p style=\"text-align: justify;\">II.&#160;&#8211;&#160;En cons&#233;quence, compl&#233;ter l&#8217;alin&#233;a&#160;11 par les mots&#160;:</p><p style=\"text-align: justify;\">&#171;&#160;et dans cette phrase les mots&#160;: &#171;&#160;agents de droit priv&#233; et, le cas &#233;ch&#233;ant, de droit public&#160;&#187; sont remplac&#233;s par les mots &#171;&#160;personnels&#160;&#187;&#160;&#187;</p><p style=\"text-align: justify;\">III.&#160;&#8211;&#160;En cons&#233;quence, &#224; l&#8217;alin&#233;a&#160;13, les mots&#160;: &#171;&#160;apr&#232;s les mots&#160;: &#171;&#160;les personnels&#160;&#187; sont ins&#233;r&#233;s les mots&#160;: &#171;&#160;de droit priv&#233; ou&#160;&#187;&#160;&#187; sont remplac&#233;s par les mots&#160;: &#171;&#160;de droit public, dont ceux soumis au statut pr&#233;vu par la loi n&#176;&#160;52&#8209;1311 du 10 d&#233;cembre 1952 relative &#224; l&#8217;&#233;tablissement obligatoire d&#8217;un statut du personnel administratif des chambres d&#8217;agriculture, des chambres de commerce et des chambres de m&#233;tiers,&#160;&#187; sont supprim&#233;s&#160;&#187;</p><p style=\"text-align: justify;\">IV.&#160;&#8211;&#160;En cons&#233;quence, compl&#233;ter l&#8217;alin&#233;a&#160;17 par les mots&#160;:</p><p style=\"text-align: justify;\">&#171;&#160;et apr&#232;s le mot&#160;: &#171;&#160;r&#233;mun&#233;rations&#160;&#187;, sont ins&#233;r&#233;s les mots&#160;&#171;&#160;ainsi que la convention collective pr&#233;vue &#224; l&#8217;article L.&#160;710&#8209;1&#160;&#187;&#160;&#187;.</p><p style=\"text-align: justify;\">V.&#160;&#8211;&#160;En cons&#233;quence, compl&#233;ter cet article par les deux alin&#233;as suivants&#160;:</p><p style=\"text-align: justify;\">&#171;&#160;II.&#160;&#8211;&#160;&#192; l&#8217;article&#160;1<sup>er</sup> de la loi n&#176;&#160;52&#8209;1311 du 10 d&#233;cembre 1952 relative &#224; l&#8217;&#233;tablissement obligatoire d&#8217;un statut du personnel administratif des chambres d&#8217;agriculture, des chambres de commerce et des chambres de m&#233;tiers, les mots&#160;: &#171;&#160;, des chambres de commerce&#160;&#187; sont supprim&#233;s.</p><p style=\"text-align: justify;\">&#171;&#160;III.&#160;&#8211;&#160;Dans un d&#233;lai de deux ans &#224; compter de la promulgation de la pr&#233;sente loi, les partenaires sociaux n&#233;gocient avec CCI France une convention collective nationale applicable aux personnels des chambres de commerce et de CCI France.</p><p style=\"text-align: justify;\">VI.&#160;&#8211;&#160;Les&#160;I &#224; IV entrent en vigueur &#224; une date fix&#233;e par d&#233;cret et qui ne peut &#234;tre ant&#233;rieure &#224; l&#8217;&#233;tablissement de la convention collective pr&#233;vue au V.</p>",
    "exposeSommaire": "<p style=\"text-align: justify;\">Le pr&#233;sent amendement propose une solution alternative &#224; l&#8217;extinction progressive du statut.</p><p style=\"text-align: justify;\">Il s&#8217;agit de pr&#233;voir la transformation compl&#232;te du statut en convention collective. A l&#8217;instar de ce qui avait &#233;t&#233; pr&#233;vu dans la loi de 2005 relative aux a&#233;roports, les partenaires sociaux disposeront d&#8217;un d&#233;lai pour n&#233;gocier une convention collective sous l&#8217;&#233;gide de CCI France.</p><p style=\"text-align: justify;\">Tous les personnels des CCI rel&#232;veront alors du droit priv&#233;, avec les garanties attach&#233;es &#224; la convention collective.</p><p style=\"text-align: justify;\">Il s&#8217;agit d&#8217;une mani&#232;re de faire confiance aux partenaires sociaux, en offrant aux personnels une solution plus souple que le statut, sans qu&#8217;elle soit moins protectrice.</p>"
  },
  "representations": [
    {
      "nom": "PDF",
      "typeMime": {
        "type": "application",
        "subType": "PDF"
      },
      "statutRepresentation": {
        "verbatim": true,
        "canonique": true,
        "officielle": true,
        "transcription": false,
        "enregistrement": false
      },
      "contenu": {
        "documentURI": "/15/amendements/1088/CSPACTE/394.pdf"
      }
    }
  ],
  "sort": {
    "dateSaisie": "2018-09-07T17:46:29.000+02:00",
    "sortEnSeance": "Retiré"
  },
  "dateDepot": "2018-08-09T02:00:00.000+02:00",
  "dateDistribution": "2018-09-06T02:00:00.000+02:00",
  "article99": "0",
  "loiReference": {}
}