{
  "uid": "AMANR5L15SEA717460BTC0938P0D1N125",
  "identifiant": {
    "legislature": "15",
    "numero": "125",
    "numRect": "51",
    "saisine": {
      "texteLegislatifRef": "PRJLANR5L15BTC0938",
      "numeroPartiePLF": "0",
      "organeExamen": "PO717460",
      "mentionSecondeDeliberation": "0"
    }
  },
  "numeroLong": "125 (3ème Rect)",
  "etapeTexte": "1ère lecture (1ère assemblée saisie)",
  "triAmendement": "abwjdhz",
  "cardinaliteAmdtMultiples": "1",
  "etat": "Discuté",
  "signataires": {
    "auteur": {
      "typeAuteur": "Depute",
      "acteurRef": "PA441",
      "groupePolitiqueRef": "PO730940"
    },
    "cosignatairesRefs": [
      "PA721270",
      "PA335612",
      "PA689",
      "PA722202",
      "PA721118",
      "PA441",
      "PA720546",
      "PA267306",
      "PA721896",
      "PA720692",
      "PA722110",
      "PA718720",
      "PA721012",
      "PA610654",
      "PA610667",
      "PA718926"
    ],
    "texteAffichable": "Mme&#160;Bello,  Mme&#160;Buffet, M.&#160;Fabien&#160;Roussel, M.&#160;Wulfranc, M.&#160;Serville, M.&#160;Jumel, M.&#160;Peu, M.&#160;Nilor, M.&#160;Lecoq, Mme&#160;K&#233;clard-Mond&#233;sir, M.&#160;Brotherson, M.&#160;Dufr&#232;gne, Mme&#160;Faucillon, M.&#160;Bruneel, M.&#160;Dharr&#233;ville et M.&#160;Chassaigne"
  },
  "pointeurFragmentTexte": {
    "division": {
      "titre": "Article 2",
      "articleDesignationCourte": "ART. 2",
      "type": "ARTICLE",
      "avantAApres": "A",
      "divisionRattachee": "ARTICLE 2",
      "urlDivisionTexteVise": "/15/textes/0938.asp#D_Article_2"
    },
    "alinea": {
      "avantAApres": "A",
      "numero": "1",
      "alineaDesignation": "Alinéa 1"
    }
  },
  "corps": {
    "dispositif": "<p style=\"text-align: justify;\">I.&#160;&#8211;&#160;Apr&#232;s l'alin&#233;a 1, ins&#233;rer les deux alin&#233;as suivants&#160;:</p><p style=\"text-align: justify;\">&#171;&#160;1&#176;&#160;A Apr&#232;s le premier alin&#233;a de l&#8217;article&#160;222&#8209;22, il est ins&#233;r&#233; un alin&#233;a ainsi r&#233;dig&#233;&#160;:</p><p style=\"text-align: justify;\">&#171;&#160;Le fait, par un majeur, de commettre une atteinte sexuelle sur la personne d&#8217;un mineur de treize ans, constitue &#233;galement une agression sexuelle.&#160;</p><p style=\"text-align: justify;\">II.&#160;&#8211;&#160;En cons&#233;quence, &#224; l'alin&#233;a 16, apr&#232;s la troisi&#232;me occurrence du mot&#160;: &#171;&#160;de&#160;&#187;, ins&#233;rer les mots&#160;: &#171;&#160;treize &#224;&#160;&#187;.</p><p style=\"text-align: justify;\">III.&#160;&#8211;&#160;En cons&#233;quence, &#224; l'alin&#233;a 18, proc&#233;der &#224; la m&#234;me insertion apr&#232;s la seconde occurrence du mot&#160;: &#171;&#160;de&#160;&#187;.</p>",
    "exposeSommaire": "<p style=\"text-align: justify;\">Cet amendement propose la qualification de toute atteinte sexuelle sur un mineur de moins de treize ans en agression sexuelle. En effet, l&#8217;&#226;ge de treize ans est un &#226;ge charni&#232;re, justifiant une protection sp&#233;cifique pour les mineurs en dessous de cet &#226;ge.</p><p style=\"text-align: justify;\">&#160;Ainsi, tout acte sexuel sans p&#233;n&#233;tration commis par un majeur sur un mineur de treize ans doit &#234;tre qualifi&#233; d&#8217;agression sexuelle. La diff&#233;rence d&#8217;&#226;ge significative entre l&#8217;enfant et l&#8217;adulte agresseur mais aussi l&#8217;absence de maturit&#233; d&#8217;un enfant de moins de treize ans pour consentir librement &#224; un acte sexuel avec un adulte suffisent &#224; caract&#233;riser l&#8217;agression, sans qu&#8217;il y ait besoin de prouver la pr&#233;sence d&#8217;une contrainte, d&#8217;une menace ou de la surprise.</p><p style=\"text-align: justify;\">En instaurant un nouveau seuil de protection renforc&#233;e en dessous de treize ans, cet amendement, suit les recommandations des associations de protection de l&#8217;enfance, du Haut Conseil &#224; l&#8217;&#233;galit&#233; entre les femmes et les hommes et de la d&#233;l&#233;gation aux droits des femmes de l&#8217;Assembl&#233;e nationale. Si l&#8217;on veut que ce projet de loi assure la meilleure protection possible aux enfants, il convient de compl&#233;ter le seuil de quinze ans par une protection accrue &#224; treize ans.&#160;</p>"
  },
  "representations": [
    {
      "nom": "PDF",
      "typeMime": {
        "type": "application",
        "subType": "PDF"
      },
      "statutRepresentation": {
        "verbatim": true,
        "canonique": true,
        "officielle": true,
        "transcription": false,
        "enregistrement": false
      },
      "contenu": {
        "documentURI": "/15/amendements/0938/AN/125.pdf"
      }
    }
  ],
  "seanceDiscussion": "RUANR5L15S2018IDS21031",
  "sort": {
    "dateSaisie": "2018-05-15T22:51:05.000+02:00",
    "sortEnSeance": "Rejeté"
  },
  "dateDepot": "2018-05-11T02:00:00.000+02:00",
  "dateDistribution": "2018-05-14T02:00:00.000+02:00",
  "article99": "0",
  "loiReference": {}
}