{
  "uid": "AMANR5L15PO419610B1831P0D1N146",
  "identifiant": {
    "legislature": "15",
    "numero": "146",
    "numRect": "0",
    "saisine": {
      "texteLegislatifRef": "PRJLANR5L15B1831",
      "numeroPartiePLF": "0",
      "organeExamen": "PO419610",
      "mentionSecondeDeliberation": "0"
    }
  },
  "numeroLong": "CE146",
  "etapeTexte": "1ère lecture (2ème assemblée saisie)",
  "triAmendement": "fkaaaaaaaaaaaaaaaaaaaaaaaaaaaaaaaaaaaaaaaaaaaaaaaau",
  "cardinaliteAmdtMultiples": "1",
  "etat": "Discuté",
  "signataires": {
    "auteur": {
      "typeAuteur": "Depute",
      "acteurRef": "PA722038",
      "groupePolitiqueRef": "PO730964"
    },
    "cosignatairesRefs": [
      "PA722038"
    ],
    "texteAffichable": "M.&#160;Damien&#160;Adam, rapporteur"
  },
  "pointeurFragmentTexte": {
    "division": {
      "titre": "Article 26 B",
      "articleDesignationCourte": "ART. 26 B",
      "type": "ARTICLE",
      "avantAApres": "A",
      "divisionRattachee": "ARTICLE 26 B",
      "urlDivisionTexteVise": "/15/textes/1831.asp#D_Article_26_B"
    },
    "alinea": {
      "numero": "4"
    }
  },
  "corps": {
    "dispositif": "<p>Apr&#232;s l&#8217;alin&#233;a&#160;4, ins&#233;rer les six alin&#233;as suivants&#160;:</p><p style=\"text-align: justify;\">&#171;&#160;<i>Art.</i> <i>L.&#160;224&#8209;12.&#160;&#8211;&#160;</i>Pour contr&#244;ler l&#8217;application des articles L.&#160;224&#8209;10 et L.&#160;224&#8209;11, les loueurs de v&#233;hicules automobiles, les exploitants de taxis, les exploitants de voitures de transport avec chauffeur et les entreprises qui g&#232;rent un parc de plus de cent v&#233;hicules automobiles dont le poids total autoris&#233; en charge est inf&#233;rieur &#224; 3,5 tonnes transmettent, chaque ann&#233;e, un bilan au repr&#233;sentant de l&#8217;&#201;tat dans le d&#233;partement o&#249; ils ont leur si&#232;ge, relatif aux v&#233;hicules acquis ou utilis&#233;s lors du renouvellement de leur parc. Ce bilan est rendu public.</p><p style=\"text-align: justify;\">&#171;&#160;Le manquement &#224; l&#8217;obligation mentionn&#233;e au premier alin&#233;a du pr&#233;sent article est puni d&#8217;une amende administrative, prononc&#233;e par le repr&#233;sentant de l&#8217;&#201;tat dans le d&#233;partement, dont le montant ne peut &#234;tre sup&#233;rieur &#224; 20 000&#160;&#8364;.</p><p style=\"text-align: justify;\">&#171;&#160;&#192; compter du bilan r&#233;alis&#233; en 2025, les entreprises, les loueurs et les exploitants n&#8217;ayant pas atteint au 1<sup>er</sup> janvier de l&#8217;ann&#233;e les taux fix&#233;s par les articles L.&#160;224&#8209;10 et L.&#160;224&#8209;11 sont passibles d&#8217;une amende administrative, prononc&#233;e par le repr&#233;sentant de l&#8217;&#201;tat dans le d&#233;partement o&#249; ils ont leur si&#232;ge, dont le montant ne peut &#234;tre sup&#233;rieur &#224; 10 000&#160;&#8364; par v&#233;hicule manquant pour atteindre les taux pr&#233;cit&#233;s.</p><p style=\"text-align: justify;\">&#171;&#160;Les amendes mentionn&#233;es aux deuxi&#232;me et troisi&#232;me alin&#233;as du pr&#233;sent article sont prononc&#233;es apr&#232;s que l&#8217;int&#233;ress&#233; a &#233;t&#233; inform&#233; de la possibilit&#233; de pr&#233;senter ses observations dans un d&#233;lai d&#233;termin&#233;.</p><p style=\"text-align: justify;\">&#171;&#160;Le premier alin&#233;a du pr&#233;sent article s&#8217;applique &#224; compter du 1<sup>er</sup> juin 2020 pour les loueurs de v&#233;hicules automobiles, les exploitants de taxis et les exploitants de voitures avec chauffeur et &#224; compter du 1<sup>er</sup> juin 2025 pour les entreprises qui g&#232;rent un parc de plus de cent v&#233;hicules automobiles dont le poids total autoris&#233; en charge est inf&#233;rieur &#224; 3,5 tonnes.&#160;</p><p style=\"text-align: justify;\">&#171;&#160;Un d&#233;cret en Conseil d&#8217;&#201;tat pr&#233;cise les conditions d&#8217;application du pr&#233;sent article.&#160;&#187;</p>",
    "exposeSommaire": "<p style=\"text-align: justify;\">Cet amendement vise &#224; introduire un m&#233;canisme de suivi et de sanction des obligations de certaines entreprises en mati&#232;re d&#8217;acquisition ou d&#8217;utilisation de v&#233;hicules propres afin de rendre ces obligations effectives.</p><p style=\"text-align: justify;\">Les sanctions financi&#232;res, calcul&#233;es &#224; partir du nombre de v&#233;hicules propres manquants, s&#8217;appliqueraient &#224; partir de 2025 pour toutes les entreprises concern&#233;es, l&#8217;obligation de <i>reporting&#160;</i>entrant en vigueur d&#232;s 2020 pour les loueurs de v&#233;hicules et les exploitants de taxis, conform&#233;ment aux obligations issues de la loi du 17 ao&#251;t 2015 relative &#224; la transition &#233;nerg&#233;tique.</p>"
  },
  "representations": [
    {
      "nom": "PDF",
      "typeMime": {
        "type": "application",
        "subType": "PDF"
      },
      "statutRepresentation": {
        "verbatim": true,
        "canonique": true,
        "officielle": true,
        "transcription": false,
        "enregistrement": false
      },
      "contenu": {
        "documentURI": "/15/amendements/1831/CION-ECO/CE146.pdf"
      }
    }
  ],
  "sort": {
    "dateSaisie": "2019-05-07T18:40:59.000+02:00",
    "sortEnSeance": "Adopté"
  },
  "dateDepot": "2019-05-03T02:00:00.000+02:00",
  "dateDistribution": "2019-05-07T02:00:00.000+02:00",
  "article99": "0",
  "loiReference": {}
}