{
  "uid": "AMANR5L15PO420120B0904P0D1N528",
  "identifiant": {
    "legislature": "15",
    "numero": "528",
    "numRect": "0",
    "saisine": {
      "texteLegislatifRef": "PRJLANR5L15B0904",
      "numeroPartiePLF": "0",
      "organeExamen": "PO420120",
      "mentionSecondeDeliberation": "0"
    }
  },
  "numeroLong": "AS528",
  "etapeTexte": "1ère lecture (1ère assemblée saisie)",
  "triAmendement": "t",
  "cardinaliteAmdtMultiples": "1",
  "etat": "Discuté",
  "signataires": {
    "auteur": {
      "typeAuteur": "Depute",
      "acteurRef": "PA722126",
      "groupePolitiqueRef": "PO730964"
    },
    "cosignatairesRefs": [
      "PA722126"
    ],
    "texteAffichable": "M.&#160;Chiche"
  },
  "pointeurFragmentTexte": {
    "division": {
      "titre": "Article 61",
      "articleDesignationCourte": "ART. 61",
      "type": "ARTICLE",
      "avantAApres": "A",
      "divisionRattachee": "ARTICLE 61",
      "urlDivisionTexteVise": "/15/textes/0904.asp#D_Article_61"
    },
    "alinea": {
      "avantAApres": "Apres",
      "numero": "8"
    }
  },
  "corps": {
    "dispositif": "<p style=\"text-align: justify;\">Compl&#233;ter cet article par l&#8217;alin&#233;a suivant&#160;:</p><p style=\"text-align: justify;\">&#171;&#160;VI&#160;(<i>nouveau</i>).&#160;&#8211;&#160;La mise en place de l&#8217;indicateur chiffr&#233; et anonymis&#233; mesurant les &#233;carts &#233;ventuels de r&#233;mun&#233;ration mentionn&#233;s au&#160;I fait l&#8217;objet d&#8217;un contr&#244;le dans les deux ans suivant la date de sa mise en application.&#160;&#187;</p>",
    "exposeSommaire": "<p style=\"text-align: justify;\">Cet amendement vise &#224; s&#8217;assurer de la bonne mise en place de ce dispositif par un contr&#244;le deux ans apr&#232;s la mise en application.</p>"
  },
  "representations": [
    {
      "nom": "PDF",
      "typeMime": {
        "type": "application",
        "subType": "PDF"
      },
      "statutRepresentation": {
        "verbatim": true,
        "canonique": true,
        "officielle": true,
        "transcription": false,
        "enregistrement": false
      },
      "contenu": {
        "documentURI": "/15/amendements/0904/CION-SOC/AS528.pdf"
      }
    }
  ],
  "sort": {
    "dateSaisie": "2018-06-01T01:01:38.000+02:00",
    "sortEnSeance": "Non soutenu"
  },
  "dateDepot": "2018-05-25T02:00:00.000+02:00",
  "dateDistribution": "2018-05-29T02:00:00.000+02:00",
  "article99": "0",
  "loiReference": {}
}