{
  "uid": "AMANR5L15PO59048B0235P1D1N232",
  "identifiant": {
    "legislature": "15",
    "numero": "232",
    "numRect": "0",
    "saisine": {
      "texteLegislatifRef": "PRJLANR5L15B0235",
      "numeroPartiePLF": "1",
      "organeExamen": "PO59048",
      "mentionSecondeDeliberation": "0"
    }
  },
  "numeroLong": "I-CF232",
  "etapeTexte": "1ère lecture (1ère assemblée saisie)",
  "triAmendement": "ahi",
  "cardinaliteAmdtMultiples": "1",
  "etat": "Discuté",
  "signataires": {
    "auteur": {
      "typeAuteur": "Depute",
      "acteurRef": "PA721608",
      "groupePolitiqueRef": "PO730970"
    },
    "cosignatairesRefs": [
      "PA718978",
      "PA721608",
      "PA719210",
      "PA720598",
      "PA719488"
    ],
    "texteAffichable": "M.&#160;Bourlanges,  M.&#160;Laqhila, M.&#160;Berta, Mme&#160;Deprez-Audebert et M.&#160;Joncour"
  },
  "pointeurFragmentTexte": {
    "division": {
      "titre": "Article 12",
      "articleDesignationCourte": "ART. 12",
      "type": "ARTICLE",
      "avantAApres": "A",
      "divisionRattachee": "ARTICLE 12",
      "urlDivisionTexteVise": "/15/textes/0235A.asp#D_Article_12"
    }
  },
  "corps": {
    "dispositif": "<p style=\"text-align: justify;\">R&#233;diger ainsi cet article :</p><p style=\"text-align: justify;\">I. &#8213; Le code g&#233;n&#233;ral des imp&#244;ts est ainsi modifi&#233; :</p><p style=\"text-align: justify;\">A. &#8213; A la fin du premier alin&#233;a de l'article 885 A, le montant&#160;: &#171;&#160;1&#160;300&#160;000&#8364;&#160;&#187; est remplac&#233; par le montant : &#171; 1 800 000 &#8364; &#187;.</p><p style=\"text-align: justify;\">B. &#8213;&#160;L'article 885 U est ainsi r&#233;dig&#233; :</p><p style=\"text-align: justify;\">&#171; Art. 885 U.-1. Le tarif de l'imp&#244;t est fix&#233; &#224; :</p><p style=\"text-align: justify;\"><br /> (En pourcentage)</p><table style=\"border-collapse: collapse; height: 113px; width: 480px;\"><tbody><tr><td style=\"white-space: normal; border: 1px solid #000000; width: 325px; text-align: center;\"><br /><b> FRACTION DE LA VALEUR NETTE TAXABLE&#160;</b><br /><b> du patrimoine</b></td><td style=\"white-space: normal; border: 1px solid #000000; width: 151px; text-align: center;\"><b>TARIF </b><br /><b>applicable (en %)</b></td></tr><tr><td style=\"white-space: normal; border: 1px solid #000000; width: 325px; text-align: center;\">N'exc&#233;dant pas 1 300 000 &#8364;</td><td style=\"white-space: normal; border: 1px solid #000000; width: 151px; text-align: center;\">0</td></tr><tr><td style=\"white-space: normal; border: 1px solid #000000; width: 325px; text-align: center;\"><br /> Sup&#233;rieure &#224; 1 300 000 &#8364; et inf&#233;rieure ou &#233;gale &#224; 5 000 000 &#8364;</td><td style=\"white-space: normal; border: 1px solid #000000; width: 151px; text-align: center;\">0,25</td></tr><tr><td style=\"white-space: normal; border: 1px solid #000000; width: 325px; text-align: center;\">Sup&#233;rieure &#224; 5 000 000 &#8364; et inf&#233;rieure ou &#233;gale &#224; 10 000 000 &#8364;</td><td style=\"white-space: normal; border: 1px solid #000000; width: 151px; text-align: center;\">0,37</td></tr><tr><td style=\"white-space: normal; border: 1px solid #000000; width: 325px; text-align: center;\">Sup&#233;rieure &#224; 10 000 000 &#8364;</td><td style=\"white-space: normal; border: 1px solid #000000; width: 151px; text-align: center;\">0,50</td></tr></tbody></table><p style=\"text-align: justify;\">&#160;</p><p style=\"text-align: justify;\">&#171; 2. Pour les redevables dont le patrimoine a une valeur nette taxable &#233;gale ou sup&#233;rieure &#224; 1&#160;800 000 &#8364; et inf&#233;rieure &#224; 1 900 000 &#8364;, le montant de l'imp&#244;t calcul&#233; selon le tarif pr&#233;vu au tableau du 1 est r&#233;duit d'une somme &#233;gale &#224; 19 000 &#8364; &#8213; 1,0 % P, o&#249; P est la valeur nette taxable du patrimoine. &#187;.</p><p style=\"text-align: justify;\">II. &#8213; La perte de recettes &#233;ventuelle pour l&#8217;&#201;tat est compens&#233;e &#224; due concurrence par la cr&#233;ation d&#8217;une taxe additionnelle aux droits mentionn&#233;s aux articles 575 et 575 A du code g&#233;n&#233;ral des imp&#244;ts.</p>",
    "exposeSommaire": "<p style=\"text-align: justify;\">Le remplacement de l&#8217;imp&#244;t de solidarit&#233; sur le fortune (ISF) par l&#8217;imp&#244;t sur la fortune Immobili&#232;re (IFI) cr&#233;e un d&#233;savantage comparatif des investissements immobilier par rapport aux investissements mobiliers. Il est ainsi propos&#233; une suppression en deux temps de l&#8217;ISF sans remplacement par un nouvel imp&#244;t.</p><p style=\"text-align: justify;\">En 2018, le seuil de d&#233;clenchement de la taxe est relev&#233;, passant d&#8217;un patrimoine d&#8217;1&#160;300&#160;000&#160;euros &#224; un patrimoine d&#8217;1&#160;800&#160;000&#160;euros. La fraction du patrimoine comprise entre 800&#160;000&#160;euros et 1&#160;300&#160;000&#160;euros cesse d&#8217;&#234;tre tax&#233;e, et les taux applicables seront diminu&#233;s de 50&#160;% environ.</p><p style=\"text-align: justify;\">Les seuils fix&#233;s dans le pr&#233;sent amendement visent &#224; assurer un niveau de recettes 2018 au titre de l&#8217;ISF au moins &#233;gal au gain estim&#233; au titre de l&#8217;IFI tel que pr&#233;sent&#233; &#224; l&#8217;article&#160;12 du PLF 2018.</p><p style=\"text-align: justify;\">En 2019, l&#8217;ISF sera int&#233;gralement supprim&#233;.</p>"
  },
  "representations": [
    {
      "nom": "PDF",
      "typeMime": {
        "type": "application",
        "subType": "PDF"
      },
      "statutRepresentation": {
        "verbatim": true,
        "canonique": true,
        "officielle": true,
        "transcription": false,
        "enregistrement": false
      },
      "contenu": {
        "documentURI": "/15/amendements/0235A/CION_FIN/CF232.pdf"
      }
    }
  ],
  "sort": {
    "dateSaisie": "2017-10-12T08:41:51.000+02:00",
    "sortEnSeance": "Rejeté"
  },
  "dateDepot": "2017-10-06T02:00:00.000+02:00",
  "dateDistribution": "2017-10-11T02:00:00.000+02:00",
  "article99": "0",
  "loiReference": {}
}