{
  "uid": "AMANR5L15PO419604B1785P0D1N32",
  "identifiant": {
    "legislature": "15",
    "numero": "32",
    "numRect": "0",
    "saisine": {
      "texteLegislatifRef": "PIONANR5L15B1785",
      "numeroPartiePLF": "0",
      "organeExamen": "PO419604",
      "mentionSecondeDeliberation": "0"
    }
  },
  "numeroLong": "AC32",
  "etapeTexte": "1ère lecture (1ère assemblée saisie)",
  "triAmendement": "aoaaaaaaaaaaaaaaaaaaaaaaaaaaaaaaaaaaaaaaaaaaaaaaaabue",
  "cardinaliteAmdtMultiples": "1",
  "etat": "Discuté",
  "signataires": {
    "auteur": {
      "typeAuteur": "Depute",
      "acteurRef": "PA719108",
      "groupePolitiqueRef": "PO730964"
    },
    "cosignatairesRefs": [
      "PA719108",
      "PA718728",
      "PA719230"
    ],
    "texteAffichable": "M.&#160;G&#233;rard,  M.&#160;Kerlogot et Mme&#160;Vanceunebrock-Mialon"
  },
  "pointeurFragmentTexte": {
    "division": {
      "titre": "Article PREMIER",
      "articleDesignationCourte": "ART. PREMIER",
      "type": "ARTICLE",
      "avantAApres": "A",
      "divisionRattachee": "ARTICLE PREMIER",
      "urlDivisionTexteVise": "/15/textes/1785.asp#D_Article_1er"
    },
    "alinea": {
      "numero": "1"
    }
  },
  "corps": {
    "dispositif": "<p style=\"text-align: justify;\">&#192; l&#8217;alin&#233;a&#160;1, apr&#232;s le mot&#160;:</p><p style=\"text-align: justify;\">&#171;&#160;sexuelle&#160;&#187;,</p><p style=\"text-align: justify;\">ins&#233;rer les mots&#160;:</p><p style=\"text-align: justify;\">&#171;&#160;, de l&#8217;identit&#233; de genre&#160;&#187;.</p>",
    "exposeSommaire": "<p>Cet amendement vise &#224; int&#233;grer &#224; la pr&#233;sente loi, la lutte contre les contenus transphobes sur internet, laquelle participe de l&#8217;int&#233;r&#234;t g&#233;n&#233;ral. <br /><br /></p><p style=\"text-align: justify;\">En effet, dans sa d&#233;cision du 10 juin 2004 relative &#224; la loi pour la confiance dans l&#8217;&#233;conomie num&#233;rique (LCEN), le Conseil constitutionnel a pr&#233;cis&#233; que l&#8217;information d&#233;nonc&#233;e dans le cadre d&#8217;un signalement aux h&#233;bergeurs de contenus devait avoir un caract&#232;re &#171;&#160;manifestement illicite&#160;&#187;. Or, les juridictions ont eu tendance &#224; retenir comme manifestement illicites les contenus vis&#233;s &#224; l&#8217;article&#160;6-I-7 de la LCEN qui int&#232;gre l&#8217;incitation &#224; la haine fond&#233;e sur l&#8217;identit&#233; de genre. <br /><br /></p><p style=\"text-align: justify;\">Par ailleurs, l&#8217;identit&#233; de genre est mentionn&#233;e &#224; l&#8217;alin&#233;a&#160;4 de l&#8217;article&#160;33 de la loi du 29 juillet 1881 sur la libert&#233; de la presse et entre bien dans le champ de l&#8217;obligation de retrait des contenus injurieux vis&#233; par le pr&#233;sent article.</p>"
  },
  "representations": [
    {
      "nom": "PDF",
      "typeMime": {
        "type": "application",
        "subType": "PDF"
      },
      "statutRepresentation": {
        "verbatim": true,
        "canonique": true,
        "officielle": true,
        "transcription": false,
        "enregistrement": false
      },
      "contenu": {
        "documentURI": "/15/amendements/1785/CION-CEDU/AC32.pdf"
      }
    }
  ],
  "sort": {
    "dateSaisie": "2019-06-05T10:48:59.000+02:00",
    "sortEnSeance": "Adopté"
  },
  "dateDepot": "2019-05-31T02:00:00.000+02:00",
  "dateDistribution": "2019-06-03T02:00:00.000+02:00",
  "article99": "0",
  "loiReference": {
    "codeLoi": "6"
  }
}