{
  "uid": "AMANR5L15PO419610B0846P0D1N233",
  "identifiant": {
    "legislature": "15",
    "numero": "233",
    "numRect": "0",
    "saisine": {
      "texteLegislatifRef": "PRJLANR5L15B0846",
      "numeroPartiePLF": "0",
      "organeExamen": "PO419610",
      "mentionSecondeDeliberation": "0"
    }
  },
  "numeroLong": "CE233",
  "etapeTexte": "1ère lecture (1ère assemblée saisie)",
  "triAmendement": "ci",
  "cardinaliteAmdtMultiples": "1",
  "etat": "Discuté",
  "signataires": {
    "auteur": {
      "typeAuteur": "Depute",
      "acteurRef": "PA721718",
      "groupePolitiqueRef": "PO730964"
    },
    "cosignatairesRefs": [
      "PA719540",
      "PA719528",
      "PA720268",
      "PA721718",
      "PA722094",
      "PA719130",
      "PA721726",
      "PA721384",
      "PA721194",
      "PA722336",
      "PA720014",
      "PA719890",
      "PA718990",
      "PA718768",
      "PA606202",
      "PA719480",
      "PA718810",
      "PA720190",
      "PA720814",
      "PA719388",
      "PA718902",
      "PA721024",
      "PA719960",
      "PA718876",
      "PA720878",
      "PA719338",
      "PA719822",
      "PA720854",
      "PA718794",
      "PA720146"
    ],
    "texteAffichable": "Mme&#160;Do,  M.&#160;Portarrieu, Mme&#160;Brulebois, Mme&#160;Blanc, M.&#160;Besson-Moreau, M.&#160;C&#233;dric&#160;Roussel, Mme&#160;Michel, M.&#160;Mass&#233;glia, Mme&#160;Mireille&#160;Robert, Mme&#160;Fontenel-Personne, Mme&#160;Faure-Muntian, M.&#160;Cazenove, Mme&#160;Hennion, M.&#160;Saint-Martin, M.&#160;Thi&#233;baut, Mme&#160;Mauborgne, Mme&#160;Toutut-Picard, Mme&#160;H&#233;rin, Mme&#160;Melchior, M.&#160;Sorre, Mme&#160;Thillaye, M.&#160;Damaisin, M.&#160;Gaillard, M.&#160;Test&#233;, Mme&#160;Valetta Ardisson, Mme&#160;Tiegna, Mme&#160;Genetet, Mme&#160;Le Meur, Mme&#160;Fran&#231;oise&#160;Dumas et Mme&#160;Fr&#233;d&#233;rique&#160;Dumas"
  },
  "pointeurFragmentTexte": {
    "division": {
      "titre": "Article 34",
      "articleDesignationCourte": "ART. 34",
      "type": "ARTICLE",
      "avantAApres": "A",
      "divisionRattachee": "ARTICLE 34",
      "urlDivisionTexteVise": "/15/textes/0846.asp#D_Article_34"
    },
    "alinea": {
      "avantAApres": "Apres",
      "numero": "24"
    }
  },
  "corps": {
    "dispositif": "<p style=\"text-align: justify;\">Apr&#232;s l&#8217;alin&#233;a&#160;24, ins&#233;rer les cinq alin&#233;as suivants&#160;:</p><p style=\"text-align: justify;\">&#171;&#160;Une pr&#233;sentation synth&#233;tique du r&#233;sultat des diagnostics suivants est annex&#233;e au contrat de bail&#160;:</p><p style=\"text-align: justify;\">&#171;&#160;<i>a)</i> Constat de risque d&#8217;exposition au plomb pr&#233;vu aux articles L.&#160;1334&#8209;5 et L.&#160;1334&#8209;7 du code de la sant&#233; publique&#160;;</p><p style=\"text-align: justify;\">&#171;&#160;<i>b)</i> Diagnostic amiante pr&#233;vu au 3&#176; de l&#8217;article&#160;3&#8209;3 de la loi n&#176; 89&#8209;462 du 6 juillet 1989 tendant &#224; am&#233;liorer les rapports locatifs et portant modification de la loi n&#176; 86&#8209;1290 du 23 d&#233;cembre 1986&#160;;</p><p style=\"text-align: justify;\">&#171;&#160;<i>c)</i> &#201;tat int&#233;rieur d&#8217;&#233;lectricit&#233; et de gaz pr&#233;vu au 4&#176; de de l&#8217;article&#160;3&#8209;3 de la loi n&#176; 89&#8209;462 du 6 juillet 1989 tendant &#224; am&#233;liorer les rapports locatifs et portant modification de la loi n&#176; 86&#8209;1290 du 23 d&#233;cembre 1986.</p><p style=\"text-align: justify;\">&#171;&#160;Les modalit&#233;s de mise en &#339;uvre des quatre alin&#233;a pr&#233;c&#233;dents sont d&#233;finies par d&#233;cret. Ces diagnostics doivent &#234;tre en cours de validit&#233;, ou bien doivent avoir &#233;t&#233; &#233;tablis depuis moins de cinq ans &#224; la date de la signature du bail sign&#233; &#224; l&#8217;entr&#233;e du locataire dans les lieux.&#160;&#187;</p>",
    "exposeSommaire": "<p style=\"text-align: justify;\">Par souci de simplification, le projet de loi ELAN ne pr&#233;voit pas d&#8217;ajouter des diagnostics techniques au bail mobilit&#233;. Nous souscrivons &#224; cette intention de simplification. Cependant, il ne faudrait pas que des marchands de sommeil se servent de ce bail afin de proposer un habitat indigne &#224; leurs locataires. C&#8217;est pourquoi il serait souhaitable d&#8217;annexer au contrat une version simplifi&#233;e de certains diagnostics techniques, tout en leur donnant une validit&#233; minimum de 5 ans. Cette mesure, que nous avons voulu &#233;quilibr&#233;e, permettra de ne pas contraindre les bailleurs avec des formalit&#233;s on&#233;reuses tout en garantissant un contr&#244;le suffisant sur la qualit&#233; du logement lou&#233;.</p><p style=\"text-align: justify;\">Dans cette optique il parait ainsi judicieux d&#8217;adjoindre au bail les r&#233;sultats des diagnostics concernant le gaz, l&#8217;&#233;lectricit&#233;, l&#8217;exposition &#224; l&#8217;amiante et au plomb, afin d&#8217;avertir les occupants contre les dangers pour la sant&#233; qui pourrait r&#233;sulter d&#8217;un r&#233;sultat d&#233;favorable.</p><p style=\"text-align: justify;\">Le fait d&#8217;annexer des documents d&#8217;une quarantaine de pages que personne ne lit est une proc&#233;dure qui peut sembler lourde et inutile, notamment dans ce contexte. On sait que les diagnostiqueurs fournissent d&#233;j&#224; des r&#233;sum&#233;s synth&#233;tiques de leurs r&#233;sultats. C&#8217;est pourquoi il m&#8217;a sembl&#233; utile d&#8217;avoir &#224; annexer uniquement une pr&#233;sentation synth&#233;tique. Un d&#233;cret permettra d&#8217;&#233;tablir selon quelles modalit&#233;s celle-ci devra &#234;tre faite.</p><p style=\"text-align: justify;\">Cet amendement permettra de se pr&#233;munir contre les bailleurs irresponsables et les marchands de sommeil, tout en limitant les contraintes pour les autres bailleurs &#224; ce qui est n&#233;cessaire, et selon des modalit&#233;s simplifi&#233;es. Se pr&#233;munir contre des mauvais usages tout en conservant de la souplesse &#224; ce type de contrat est un gage de r&#233;ussite qui m&#233;rite d&#8217;&#234;tre retenu.</p>"
  },
  "representations": [
    {
      "nom": "PDF",
      "typeMime": {
        "type": "application",
        "subType": "PDF"
      },
      "statutRepresentation": {
        "verbatim": true,
        "canonique": true,
        "officielle": true,
        "transcription": false,
        "enregistrement": false
      },
      "contenu": {
        "documentURI": "/15/amendements/0846/CION-ECO/CE233.pdf"
      }
    }
  ],
  "sort": {
    "dateSaisie": "2018-05-17T19:43:49.000+02:00",
    "sortEnSeance": "Rejeté"
  },
  "dateDepot": "2018-05-02T02:00:00.000+02:00",
  "dateDistribution": "2018-05-15T02:00:00.000+02:00",
  "article99": "0",
  "loiReference": {}
}