{
  "uid": "AMANR5L15SEA717460BTC0971P0D1N910",
  "identifiant": {
    "legislature": "15",
    "numero": "910",
    "numRect": "50",
    "saisine": {
      "texteLegislatifRef": "PRJLANR5L15BTC0971",
      "numeroPartiePLF": "0",
      "organeExamen": "PO717460",
      "mentionSecondeDeliberation": "0"
    }
  },
  "numeroLong": "910 (2ème Rect)",
  "etapeTexte": "1ère lecture (1ère assemblée saisie)",
  "triAmendement": "bki",
  "cardinaliteAmdtMultiples": "1",
  "etat": "Discuté",
  "signataires": {
    "auteur": {
      "typeAuteur": "Depute",
      "acteurRef": "PA642847",
      "groupePolitiqueRef": "PO730934"
    },
    "cosignatairesRefs": [
      "PA642847"
    ],
    "texteAffichable": "M.&#160;Bazin"
  },
  "pointeurFragmentTexte": {
    "division": {
      "titre": "Article 27",
      "articleDesignationCourte": "APRÈS ART. 27",
      "type": "ARTICLE",
      "avantAApres": "Apres",
      "divisionRattachee": "APRÈS L'ARTICLE 27, insérer l'article suivant:",
      "articleAdditionnel": "1",
      "urlDivisionTexteVise": "/15/textes/0971.asp#D_Article_27"
    }
  },
  "corps": {
    "dispositif": "<p style=\"text-align: justify;\">Le code de la construction et de l&#8217;habitation est ainsi modifi&#233; :</p><p style=\"text-align: justify;\">1&#176; L&#8217;article L.&#160;421&#8209;2 est compl&#233;t&#233; par un&#160;8&#176; ainsi r&#233;dig&#233;&#160;:</p><p style=\"text-align: justify;\">&#171;&#160;8&#176;&#160;Des actions ou parts de soci&#233;t&#233;s de gestion de portefeuille.&#160;&#187;</p><p style=\"text-align: justify;\">2&#176; L&#8217;article L.&#160;421&#8209;18 est ainsi modifi&#233;&#160;:</p><p style=\"text-align: justify;\">1&#176;&#160;Apr&#232;s le mot&#160;: &#171;&#160;plac&#233;s&#160;&#187;, la fin de l&#8217;alin&#233;a est ainsi r&#233;dig&#233;e&#160;: &#171;&#160;qu&#8217;en titres, parts ou actions suivants&#160;:&#160;&#187;&#160;;</p><p style=\"text-align: justify;\">2&#176; Il est compl&#233;t&#233; par quatre alin&#233;as ainsi r&#233;dig&#233;s&#160;:</p><p style=\"text-align: justify;\">&#171;&#160;1&#176;&#160;en titres &#233;mis ou garantis par les &#201;tats membres de la Communaut&#233;&#160;europ&#233;enne ou les autres &#201;tats parties &#224; l&#8217;accord sur l&#8217;Espace &#233;conomique&#160;europ&#233;en&#160;;</p><p style=\"text-align: justify;\">&#171;&#160;2&#176;&#160;en parts ou actions d&#8217;organismes de placement collectif en valeurs mobili&#232;res ou de placements collectifs relevant des paragraphes&#160;1, 2 et&#160;6 de la sous-section&#160;2, du paragraphe&#160;2 ou du sous-paragraphe&#160;1 du paragraphe&#160;1 de la sous-section&#160;3 de la section&#160;2 du chapitre&#160;IV du titre&#160;Ier du livre&#160;II du code mon&#233;taire et financier g&#233;rant exclusivement des titres &#233;mis ou garantis par les &#201;tats membres de la Communaut&#233;&#160;europ&#233;enne ou les autres &#201;tats parties &#224; l&#8217;accord sur l&#8217;Espace &#233;conomique&#160;europ&#233;en, libell&#233;s en&#160;euros&#160;;</p><p style=\"text-align: justify;\">&#171;&#160;3&#176;&#160;en titres &#233;mis par une soci&#233;t&#233; vis&#233;e &#224; l&#8217;article L.&#160;423&#8209;1&#8209;1 du pr&#233;sent code&#160;;</p><p style=\"text-align: justify;\">&#171;&#160;4&#176;&#160;en parts ou actions d&#8217;organismes de placement collectif en valeurs mobili&#232;res ou de placements collectifs relevant des paragraphes&#160;1, 2 et&#160;6 de la sous-section&#160;2, du paragraphe&#160;2 ou du sous-paragraphe&#160;1 du paragraphe&#160;1 de la sous-section&#160;3 de la section&#160;2 du chapitre&#160;IV du titre&#160;Ier du livre&#160;II du code mon&#233;taire et financier cr&#233;&#233;s &#224; l&#8217;initiative d&#8217;un office public de l&#8217;habitat ou d&#8217;une soci&#233;t&#233; vis&#233;e &#224; l&#8217;article L.&#160;423&#8209;1&#8209;1 du pr&#233;sent code.&#160;&#187;<br />&#160;</p>",
    "exposeSommaire": "<p style=\"text-align: justify;\">L&#8217;article L.&#160;421&#8209;18 du code de la construction et de l&#8217;habitation interdit aux offices publics de l&#8217;habitat de souscrire des titres qui ne sont pas &#233;mis ou garantis par les &#201;tats membres de l&#8217;Union&#160;europ&#233;enne.</p><p style=\"text-align: justify;\">De ce fait, les offices ne sont pas en mesure de souscrire aux titres qui seraient &#233;mis par une entit&#233; appartenant &#224; un &#171;&#160;groupe d&#8217;organismes de logement social&#160;&#187; tel que vis&#233; au futur article L.&#160;423&#8209;1&#8209;1 du code de la construction et de l&#8217;habitation, ce qui limite consid&#233;rablement la circulation des flux financiers entre organismes de logement social. Aussi, d&#232;s lors que les offices ne peuvent placer leurs liquidit&#233;s que dans un nombre tr&#232;s limit&#233; de fonds d&#8217;investissement (ceux vis&#233;s &#224; l&#8217;article L.&#160;421&#8209;18 du code de la construction et de l&#8217;habitation dont les titres sont &#233;mis ou garantis par les &#201;tats membres de l&#8217;Union&#160;europ&#233;enne), ils ne peuvent que marginalement participer au financement d&#8217;activit&#233;s &#224; caract&#232;re social.</p><p style=\"text-align: justify;\">Il est donc propos&#233; de favoriser (i) la cr&#233;ation de fonds d&#8217;investissement ayant pour seul objet la gestion d&#8217;un portefeuille d&#8217;instruments financiers et de d&#233;p&#244;ts compatibles avec le caract&#232;re social et territorial du secteur HLM et (ii) d&#8217;autoriser les offices &#224; investir dans ces fonds.</p><p style=\"text-align: justify;\">Ces fonds pourraient &#234;tre cr&#233;&#233;s et g&#233;r&#233;s (le cas &#233;ch&#233;ant avec l&#8217;aide d&#8217;une soci&#233;t&#233; de gestion) par les soci&#233;t&#233;s de coordination objets du projet de loi ou par les offices. Il conviendrait en outre de modifier l&#8217;article L.&#160;421&#8209;18 du code de la construction et de l&#8217;habitation afin d&#8217;autoriser les offices &#224; placer leurs fonds dans les titres financiers &#233;mis par de tels fonds d&#8217;investissement. Il s&#8217;agit de permettre aux offices et aux groupes de logement social de cr&#233;er des soci&#233;t&#233;s de gestion de portefeuille et des fonds d&#8217;investissement &#224; caract&#232;re social pr&#233;sentant des politiques d&#8217;investissement socialement responsable, r&#233;mun&#233;rant les investisseurs &#224; des taux compatibles avec les taux de march&#233; du secteur. Ces fonds d&#8217;investissement permettraient ainsi de diversifier les modes de financements externes et constitueraient &#233;galement un support de placement pour les organismes.</p><p style=\"text-align: justify;\">La modification propos&#233;e de l&#8217;article L.&#160;421&#8209;2 du code de la construction et de l&#8217;habitation va dans le m&#234;me sens.</p><p style=\"text-align: justify;\">Une modification des articles pr&#233;cit&#233;s offrirait la possibilit&#233; aux offices de souscrire aux emprunts obligataires et titres participatifs des groupe d&#8217;organismes de logement social ainsi qu&#8217;&#224; des parts ou actions d&#8217;organismes de placement collectif en valeurs mobili&#232;res ou de placements collectifs qui seraient cr&#233;&#233;s &#224; l&#8217;initiative de ces groupes ou des offices et seraient g&#233;r&#233;s directement par ces derniers, le cas &#233;ch&#233;ant par l&#8217;interm&#233;diaire de soci&#233;t&#233;s de gestion de portefeuille, &#233;ventuellement leurs filiales.</p>"
  },
  "representations": [
    {
      "nom": "PDF",
      "typeMime": {
        "type": "application",
        "subType": "PDF"
      },
      "statutRepresentation": {
        "verbatim": true,
        "canonique": true,
        "officielle": true,
        "transcription": false,
        "enregistrement": false
      },
      "contenu": {
        "documentURI": "/15/amendements/0971/AN/910.pdf"
      }
    }
  ],
  "seanceDiscussion": "RUANR5L15S2018IDS21114",
  "sort": {
    "dateSaisie": "2018-06-02T16:46:53.000+02:00",
    "sortEnSeance": "Retiré"
  },
  "dateDepot": "2018-05-24T02:00:00.000+02:00",
  "dateDistribution": "2018-05-30T02:00:00.000+02:00",
  "article99": "0",
  "loiReference": {
    "codeLoi": "c construction et habitation",
    "divisionCodeLoi": "L421-2"
  }
}