{
  "uid": "AMANR5L15SEA717460BTC0902P0D1N1493",
  "identifiant": {
    "legislature": "15",
    "numero": "1493",
    "numRect": "0",
    "saisine": {
      "texteLegislatifRef": "PRJLANR5L15BTC0902",
      "numeroPartiePLF": "0",
      "organeExamen": "PO717460",
      "mentionSecondeDeliberation": "0"
    }
  },
  "numeroLong": "1493",
  "etapeTexte": "1ère lecture (1ère assemblée saisie)",
  "triAmendement": "azx",
  "cardinaliteAmdtMultiples": "1",
  "etat": "Discuté",
  "signataires": {
    "auteur": {
      "typeAuteur": "Depute",
      "acteurRef": "PA2377",
      "groupePolitiqueRef": "PO730934"
    },
    "cosignatairesRefs": [
      "PA2377"
    ],
    "texteAffichable": "M.&#160;Perrut"
  },
  "pointeurFragmentTexte": {
    "division": {
      "titre": "Article 5",
      "articleDesignationCourte": "APRÈS ART. 5",
      "type": "ARTICLE",
      "avantAApres": "Apres",
      "divisionRattachee": "APRÈS L'ARTICLE 5, insérer l'article suivant:",
      "articleAdditionnel": "1",
      "urlDivisionTexteVise": "/15/textes/0902.asp#D_Article_5"
    }
  },
  "corps": {
    "dispositif": "<p style=\"text-align: justify;\">Au premier alin&#233;a de l&#8217;article L.&#160;632&#8209;1&#8209;3 du code rural et de la p&#234;che maritime, apr&#232;s le mot&#160;: &#171;&#160;membres&#160;&#187;, sont ins&#233;r&#233;s les mots&#160;: &#171;&#160;, ou les acteurs &#233;conomiques qu&#8217;elles repr&#233;sentent,&#160;&#187;.</p>",
    "exposeSommaire": "<p style=\"text-align: justify;\">Dans un article existant sur la r&#233;solution des litiges au sein des interprofessions, il est propos&#233; de pr&#233;voir qu&#8217;une partie &#224; un contrat peut saisir une instance de conciliation des litiges. A ce jour seule les organisations professionnelles membres de l&#8217;interprofession peuvent saisir cette commission des litiges. Cette instance ne traite que de l&#8217;application des accords interprofessionnels, des contrats types et des guides de bonnes pratiques contractuelles. Il faut donc au pr&#233;alable que les interprofessions travaillent &#224; la r&#233;daction de ce type d&#8217;outils.</p>"
  },
  "representations": [
    {
      "nom": "PDF",
      "typeMime": {
        "type": "application",
        "subType": "PDF"
      },
      "statutRepresentation": {
        "verbatim": true,
        "canonique": true,
        "officielle": true,
        "transcription": false,
        "enregistrement": false
      },
      "contenu": {
        "documentURI": "/15/amendements/0902/AN/1493.pdf"
      }
    }
  ],
  "seanceDiscussion": "RUANR5L15S2018IDS21053",
  "sort": {
    "dateSaisie": "2018-05-24T21:50:59.000+02:00",
    "sortEnSeance": "Non soutenu"
  },
  "dateDepot": "2018-05-17T02:00:00.000+02:00",
  "dateDistribution": "2018-05-21T02:00:00.000+02:00",
  "article99": "0",
  "loiReference": {
    "codeLoi": "c rural et pêche maritime",
    "divisionCodeLoi": "L632-1-3"
  }
}