{
  "uid": "AMANR5L15SEA717460BTC1019P0D1N1321",
  "identifiant": {
    "legislature": "15",
    "numero": "1321",
    "numRect": "0",
    "saisine": {
      "texteLegislatifRef": "PRJLANR5L15BTC1019",
      "numeroPartiePLF": "0",
      "organeExamen": "PO717460",
      "mentionSecondeDeliberation": "0"
    }
  },
  "numeroLong": "1321",
  "etapeTexte": "1ère lecture (1ère assemblée saisie)",
  "triAmendement": "khxvzzzzrzzzvzs",
  "cardinaliteAmdtMultiples": "1",
  "etat": "Discuté",
  "signataires": {
    "auteur": {
      "typeAuteur": "Depute",
      "acteurRef": "PA642764",
      "groupePolitiqueRef": "PO730946"
    },
    "cosignatairesRefs": [
      "PA335054",
      "PA508",
      "PA333818",
      "PA609332",
      "PA340357",
      "PA642764",
      "PA429893",
      "PA337483",
      "PA1008",
      "PA588886",
      "PA643145",
      "PA608695",
      "PA608011",
      "PA342415",
      "PA405480",
      "PA610681",
      "PA267233",
      "PA1809",
      "PA719930",
      "PA335532",
      "PA1198",
      "PA332614",
      "PA607553",
      "PA340343",
      "PA605069",
      "PA333285",
      "PA1592",
      "PA608172",
      "PA609590",
      "PA720988"
    ],
    "texteAffichable": "M.&#160;Aviragnet,  Mme&#160;Bareigts, Mme&#160;Bi&#233;mouret, Mme&#160;Vainqueur-Christophe, M.&#160;Vallaud, Mme&#160;Victory, Mme&#160;Rabault, Mme&#160;Battistel, M.&#160;Bouillon, M.&#160;Jean-Louis&#160;Bricout, M.&#160;Carvounas, M.&#160;Alain&#160;David, Mme&#160;Laurence&#160;Dumont, M.&#160;Faure, M.&#160;Garot, M.&#160;David&#160;Habib, M.&#160;Hutin, M.&#160;Juanico, Mme&#160;Karamanli, M.&#160;J&#233;r&#244;me&#160;Lambert, M.&#160;Le Foll, M.&#160;Letchimy, Mme&#160;Manin, Mme&#160;Pau-Langevin, Mme&#160;Pires Beaune, M.&#160;Potier, M.&#160;Pueyo, M.&#160;Pupponi, M.&#160;Saulignac et Mme&#160;Untermaier"
  },
  "pointeurFragmentTexte": {
    "division": {
      "titre": "Article 10",
      "articleDesignationCourte": "ART. 10",
      "type": "ARTICLE",
      "avantAApres": "A",
      "divisionRattachee": "ARTICLE 10",
      "urlDivisionTexteVise": "/15/textes/1019.asp#D_Article_10"
    },
    "alinea": {
      "avantAApres": "A",
      "numero": "25",
      "alineaDesignation": "Alinéa 25"
    }
  },
  "corps": {
    "dispositif": "<p style=\"text-align: justify;\">I.&#160;&#8211;&#160;&#192; la premi&#232;re phrase de l&#8217;alin&#233;a&#160;25, substituer aux mots&#160;:</p><p style=\"text-align: justify;\">&#171;&#160;mettre &#224; la disposition des&#160;&#187;</p><p style=\"text-align: justify;\">les mots&#160;:</p><p style=\"text-align: justify;\">&#171;&#160;transf&#233;rer aux&#160;&#187;.</p><p style=\"text-align: justify;\">II.&#160;&#8211;&#160;En cons&#233;quence, supprimer la seconde phrase du m&#234;me alin&#233;a.</p>",
    "exposeSommaire": "<p style=\"text-align: justify;\">Cet article pr&#233;voit, dans le cadre d&#8217;une exp&#233;rimentation d&#8217;une dur&#233;e de 3 ans, de permettre &#224; l&#8217;&#201;tat de mettre gratuitement &#224; la disposition des r&#233;gions des agents relevant du minist&#232;re de l&#8217;&#233;ducation nationale, avec l&#8217;accord des int&#233;ress&#233;s afin d&#8217;assurer l&#8217;exercice de la mission d&#8217;information des &#233;l&#232;ves et des &#233;tudiants sur les formations et les m&#233;tiers.</p><p style=\"text-align: justify;\">Cet amendement, qui partage l&#8217;esprit de la loi, propose plut&#244;t que d&#8217;envisager une &#171;&#160;mise &#224; disposition&#160;&#187; des agents des centres d&#8217;information et d&#8217;orientation, d&#8217;assurer un &#171;&#160;transfert&#160;&#187; avec l&#8217;accord de ces derniers.</p><p style=\"text-align: justify;\">Privil&#233;gier le transfert &#224; la mise &#224; la disposition acte d&#8217;une meilleure prise en compte des nouvelles comp&#233;tences r&#233;gionales en mati&#232;re d&#8217;orientation et permet de mieux pr&#233;ciser la situation statutaire des agents en identifiant clairement la r&#233;gion comme &#233;tant leur employeur durant la phase d&#8217;exp&#233;rimentation.</p><p style=\"text-align: justify;\">Enfin, dans le souci de renforcer la protection des agents concern&#233;s, il convient de proc&#233;der &#224; un &#171;&#160;transfert&#160;&#187; plut&#244;t qu&#8217;&#224; une &#171;&#160;mise &#224; disposition&#160;&#187; de ces derniers.</p>"
  },
  "representations": [
    {
      "nom": "PDF",
      "typeMime": {
        "type": "application",
        "subType": "PDF"
      },
      "statutRepresentation": {
        "verbatim": true,
        "canonique": true,
        "officielle": true,
        "transcription": false,
        "enregistrement": false
      },
      "contenu": {
        "documentURI": "/15/amendements/1019/AN/1321.pdf"
      }
    }
  ],
  "seanceDiscussion": "RUANR5L15S2018IDS21103",
  "sort": {
    "dateSaisie": "2018-06-14T23:07:22.000+02:00",
    "sortEnSeance": "Rejeté"
  },
  "dateDepot": "2018-06-07T02:00:00.000+02:00",
  "dateDistribution": "2018-06-11T02:00:00.000+02:00",
  "article99": "0",
  "loiReference": {}
}