{
  "uid": "AMANR5L15PO757134B1088P0D1N93",
  "identifiant": {
    "legislature": "15",
    "numero": "93",
    "numRect": "0",
    "saisine": {
      "texteLegislatifRef": "PRJLANR5L15B1088",
      "numeroPartiePLF": "0",
      "organeExamen": "PO757134",
      "mentionSecondeDeliberation": "0"
    }
  },
  "numeroLong": "93",
  "etapeTexte": "1ère lecture (1ère assemblée saisie)",
  "triAmendement": "abaaaaaaaaaaaaaaaaaaaaaaaaaaaaaaaaaaaaaaaaaaaaaaaaodddddddddddw",
  "cardinaliteAmdtMultiples": "1",
  "etat": "Discuté",
  "signataires": {
    "auteur": {
      "typeAuteur": "Depute",
      "acteurRef": "PA608416",
      "groupePolitiqueRef": "PO730934"
    },
    "cosignatairesRefs": [
      "PA720210",
      "PA608416",
      "PA1012",
      "PA2492",
      "PA721506",
      "PA718884",
      "PA267204"
    ],
    "texteAffichable": "M.&#160;Hetzel,  M.&#160;Quentin, Mme&#160;Kuster, M.&#160;Sermier, M.&#160;de la Verpilli&#232;re, Mme&#160;Bazin-Malgras et Mme&#160;Beauvais"
  },
  "pointeurFragmentTexte": {
    "division": {
      "titre": "Article PREMIER",
      "articleDesignationCourte": "ART. PREMIER",
      "type": "ARTICLE",
      "avantAApres": "A",
      "divisionRattachee": "ARTICLE PREMIER",
      "urlDivisionTexteVise": "/15/textes/1088.asp#D_Article_1er"
    },
    "alinea": {
      "numero": "9"
    }
  },
  "corps": {
    "dispositif": "<p>&#192; la seconde phrase de l&#8217;alin&#233;a&#160;9, substituer aux mots&#160;:</p><p>&#171;&#160;vaut d&#233;claration d&#232;s lors qu&#8217;il est r&#233;gulier et complet au regard des r&#232;gles applicables aux formalit&#233;s &#224; accomplir aupr&#232;s des&#160;&#187;,</p><p>les mots&#160;:</p><p>&#171;&#160;ne vaut d&#233;claration que lorsque le dossier est r&#233;gulier et complet au regard des r&#232;gles applicables aux formalit&#233;s &#224; accomplir aupr&#232;s de tous les organismes&#160;&#187;.</p>",
    "exposeSommaire": "<p>L&#8217;article 1er vise &#224; &#160;rendre obligatoires par voie &#233;lectronique les d&#233;clarations des entreprises pour leurs formalit&#233;s de cr&#233;ation, de modification de leur situation et la cessation de leur activit&#233;.</p><p>&#160;Cet amendement vise &#224; pr&#233;ciser que les dossiers d&#233;pos&#233;s ne sont &#160;r&#233;put&#233;s r&#233;guliers et complets, et par cons&#233;quent conformes juridiquement, qu&#8217;&#224; partir du moment o&#249; l&#8217;ensemble des organismes destinataires (les services fiscaux, les Urssaf, les caisses sociales, les r&#233;pertoires des m&#233;tiers et les registres du commerce et des soci&#233;t&#233;s) ont pu en contr&#244;ler la r&#233;gularit&#233; ou en appr&#233;cier la validit&#233;, conform&#233;ment &#224; leurs missions.</p><p>&#160;En effet, l&#8217;accus&#233; de r&#233;ception envoy&#233; par le guichet &#233;lectronique ne doit pas pouvoir &#234;tre consid&#233;r&#233; par le d&#233;clarant comme une validation l&#233;gale avant que tous les organismes n&#8217;aient &#233;t&#233; en mesure de contr&#244;ler le dossier.</p>"
  },
  "representations": [
    {
      "nom": "PDF",
      "typeMime": {
        "type": "application",
        "subType": "PDF"
      },
      "statutRepresentation": {
        "verbatim": true,
        "canonique": true,
        "officielle": true,
        "transcription": false,
        "enregistrement": false
      },
      "contenu": {
        "documentURI": "/15/amendements/1088/CSPACTE/93.pdf"
      }
    }
  ],
  "sort": {
    "dateSaisie": "2018-09-06T16:05:09.000+02:00",
    "sortEnSeance": "Adopté"
  },
  "dateDepot": "2018-07-30T02:00:00.000+02:00",
  "dateDistribution": "2018-09-05T02:00:00.000+02:00",
  "article99": "0",
  "loiReference": {}
}