{
  "uid": "AMANR5L15SEA717460BTC1175P0D1N595",
  "identifiant": {
    "legislature": "15",
    "numero": "595",
    "numRect": "0",
    "saisine": {
      "texteLegislatifRef": "PRJLANR5L15BTC1175",
      "numeroPartiePLF": "0",
      "organeExamen": "PO717460",
      "mentionSecondeDeliberation": "0"
    }
  },
  "numeroLong": "595",
  "etapeTexte": "Nouvelle Lecture",
  "triAmendement": "daaaaaaaaaaaaaaaaaaaaaaaaaaaaaaaaaaaaaaaaaaaaaaaaadmo",
  "cardinaliteAmdtMultiples": "1",
  "etat": "Discuté",
  "signataires": {
    "auteur": {
      "typeAuteur": "Depute",
      "acteurRef": "PA719608",
      "groupePolitiqueRef": "PO723569"
    },
    "cosignatairesRefs": [
      "PA719608"
    ],
    "texteAffichable": "Mme&#160;M&#233;nard"
  },
  "pointeurFragmentTexte": {
    "division": {
      "titre": "Article 11",
      "articleDesignationCourte": "ART. 11",
      "type": "ARTICLE",
      "avantAApres": "A",
      "divisionRattachee": "ARTICLE 11",
      "urlDivisionTexteVise": "/15/textes/1175.asp#D_Article_11"
    },
    "alinea": {
      "avantAApres": "Apres",
      "numero": "9"
    }
  },
  "corps": {
    "dispositif": "<p style=\"text-align: justify;\">Apr&#232;s l&#8217;alin&#233;a&#160;9, ins&#233;rer l&#8217;alin&#233;a suivant&#160;:</p><p style=\"text-align: justify;\">&#171;&#160;Pour chacun de ces produits, une pr&#233;f&#233;rence est faite pour les produits dont le lieu de production et le lieu de consommation sont les plus proches&#160;&#187;.</p>",
    "exposeSommaire": "<p style=\"text-align: justify;\">Cet amendement est un amendement de pr&#233;cision. Le poids environnemental des produits agricoles import&#233;s nuit au respect de l&#8217;environnement. Par exemple, on estime que 50&#160;% &#171;&#160;des produits bio vendus en Europe viennent de pays hors Union&#160;Europ&#233;enne (UE)&#160;&#187;.</p><p style=\"text-align: justify;\">Pour prot&#233;ger les agriculteurs fran&#231;ais et l&#8217;environnement, il apparait opportun de promouvoir une pr&#233;f&#233;rence entre des produits dont le lieu de production et le lieu de consommation sont proches. Cette mesure vise ainsi &#224; encourager et &#224; mieux connaitre les productions agricoles locales.</p><p style=\"text-align: justify;\">Cette d&#233;marche serait un r&#233;el soutien tant pour les agriculteurs ind&#233;pendants que pour les organisations de producteurs.</p>"
  },
  "representations": [
    {
      "nom": "PDF",
      "typeMime": {
        "type": "application",
        "subType": "PDF"
      },
      "statutRepresentation": {
        "verbatim": true,
        "canonique": true,
        "officielle": true,
        "transcription": false,
        "enregistrement": false
      },
      "contenu": {
        "documentURI": "/15/amendements/1175/AN/595.pdf"
      }
    }
  ],
  "seanceDiscussion": "RUANR5L15S2018IDS21235",
  "sort": {
    "dateSaisie": "2018-09-14T11:23:07.000+02:00",
    "sortEnSeance": "Rejeté"
  },
  "dateDepot": "2018-09-07T02:00:00.000+02:00",
  "dateDistribution": "2018-09-10T02:00:00.000+02:00",
  "article99": "0",
  "loiReference": {}
}