{
  "uid": "AMANR5L15SEA717460BTC0971P0D1N1843",
  "identifiant": {
    "legislature": "15",
    "numero": "1843",
    "numRect": "0",
    "saisine": {
      "texteLegislatifRef": "PRJLANR5L15BTC0971",
      "numeroPartiePLF": "0",
      "organeExamen": "PO717460",
      "mentionSecondeDeliberation": "0"
    }
  },
  "numeroLong": "1843",
  "etapeTexte": "1ère lecture (1ère assemblée saisie)",
  "triAmendement": "auvfti",
  "cardinaliteAmdtMultiples": "1",
  "etat": "Discuté",
  "signataires": {
    "auteur": {
      "typeAuteur": "Depute",
      "acteurRef": "PA722252",
      "groupePolitiqueRef": "PO730964"
    },
    "cosignatairesRefs": [
      "PA718768",
      "PA719790",
      "PA718728",
      "PA719294",
      "PA722252"
    ],
    "texteAffichable": "Mme&#160;Rixain,  M.&#160;Chalumeau, Mme&#160;Vanceunebrock-Mialon, Mme&#160;Valetta Ardisson et Mme&#160;Clapot"
  },
  "pointeurFragmentTexte": {
    "division": {
      "titre": "Article PREMIER",
      "articleDesignationCourte": "ART. PREMIER",
      "type": "ARTICLE",
      "avantAApres": "A",
      "divisionRattachee": "ARTICLE PREMIER",
      "urlDivisionTexteVise": "/15/textes/0971.asp#D_Article_1er"
    },
    "alinea": {
      "avantAApres": "A",
      "numero": "19",
      "alineaDesignation": "Alinéa 19"
    }
  },
  "corps": {
    "dispositif": "<p style=\"text-align: justify;\">&#192; la deuxi&#232;me phrase de l&#8217;alin&#233;a&#160;19, apr&#232;s le mot&#160;:</p><p style=\"text-align: justify;\">&#171;&#160;d&#233;partement&#160;&#187;,</p><p style=\"text-align: justify;\">ins&#233;rer les mots&#160;:</p><p style=\"text-align: justify;\">&#171;&#160;,pris en concertation avec la ou les communes concern&#233;es, et&#160;&#187;.</p>",
    "exposeSommaire": "<p style=\"text-align: justify;\">Dans l&#8217;&#233;laboration d&#8217;une grande op&#233;ration d&#8217;urbanisme (GOU), les communes dont le territoire est concern&#233; par le projet peuvent &#233;mettre un avis d&#233;favorable qui oblige le repr&#233;sentant de l&#8217;&#201;tat dans le d&#233;partement &#224; prendre un d&#233;cret pour qualifier le projet de GOU.&#160;Afin de conserver aux communes un droit de regard sur l&#8217;am&#233;nagement de leur territoire et dans un esprit de conciliation, cet amendement vise &#224; associer les services pr&#233;fectoraux et les communes dans la qualification d&#8217;une GOU lorsque celles-ci ont &#233;mis en premier lieu un avis d&#233;favorable.</p>"
  },
  "representations": [
    {
      "nom": "PDF",
      "typeMime": {
        "type": "application",
        "subType": "PDF"
      },
      "statutRepresentation": {
        "verbatim": true,
        "canonique": true,
        "officielle": true,
        "transcription": false,
        "enregistrement": false
      },
      "contenu": {
        "documentURI": "/15/amendements/0971/AN/1843.pdf"
      }
    }
  ],
  "seanceDiscussion": "RUANR5L15S2018IDS21064",
  "sort": {
    "dateSaisie": "2018-05-31T16:38:50.000+02:00",
    "sortEnSeance": "Non soutenu"
  },
  "dateDepot": "2018-05-25T02:00:00.000+02:00",
  "dateDistribution": "2018-05-28T02:00:00.000+02:00",
  "article99": "0",
  "loiReference": {}
}