{
  "uid": "AMANR5L15SEA717460BTC1629P0D1N706",
  "identifiant": {
    "legislature": "15",
    "numero": "706",
    "numRect": "0",
    "saisine": {
      "texteLegislatifRef": "PRJLANR5L15BTC1629",
      "numeroPartiePLF": "0",
      "organeExamen": "PO717460",
      "mentionSecondeDeliberation": "0"
    }
  },
  "numeroLong": "706",
  "etapeTexte": "1ère lecture (1ère assemblée saisie)",
  "triAmendement": "bpaaaaaaaaaaaaaaaaaaaaaaaaaaaaaaaaaaaaaaaaaaaaaaaaaklm",
  "cardinaliteAmdtMultiples": "1",
  "etat": "Discuté",
  "signataires": {
    "auteur": {
      "typeAuteur": "Depute",
      "acteurRef": "PA267233",
      "groupePolitiqueRef": "PO758835"
    },
    "cosignatairesRefs": [
      "PA720988",
      "PA608741",
      "PA643145",
      "PA267233",
      "PA719930",
      "PA429893",
      "PA337483",
      "PA642764",
      "PA333818",
      "PA609332",
      "PA608695",
      "PA335054",
      "PA1008",
      "PA335532",
      "PA340343",
      "PA607553",
      "PA610681",
      "PA333285",
      "PA1198",
      "PA1592",
      "PA332614",
      "PA1809",
      "PA605069",
      "PA608172",
      "PA608011",
      "PA508",
      "PA342415",
      "PA340357",
      "PA609590"
    ],
    "texteAffichable": "M.&#160;Bouillon,  Mme&#160;Pau-Langevin, M.&#160;Juanico, Mme&#160;Manin, Mme&#160;Tolmont, Mme&#160;Laurence&#160;Dumont, Mme&#160;Victory, M.&#160;Aviragnet, Mme&#160;Bareigts, Mme&#160;Battistel, Mme&#160;Bi&#233;mouret, M.&#160;Jean-Louis&#160;Bricout, M.&#160;Carvounas, M.&#160;Alain&#160;David, M.&#160;Faure, M.&#160;Garot, M.&#160;David&#160;Habib, M.&#160;Hutin, Mme&#160;Karamanli, M.&#160;J&#233;r&#244;me&#160;Lambert, M.&#160;Letchimy, Mme&#160;Pires Beaune, M.&#160;Potier, M.&#160;Pueyo, Mme&#160;Rabault, M.&#160;Saulignac, Mme&#160;Untermaier, Mme&#160;Vainqueur-Christophe et M.&#160;Vallaud"
  },
  "pointeurFragmentTexte": {
    "division": {
      "titre": "Article 5 quater",
      "articleDesignationCourte": "APRÈS ART. 5 QUATER",
      "type": "ARTICLE",
      "avantAApres": "Apres",
      "divisionRattachee": "APRÈS L'ARTICLE 5 QUATER, insérer l'article suivant:",
      "articleAdditionnel": "1",
      "urlDivisionTexteVise": "/15/textes/1629.asp#D_Article_5_quater"
    }
  },
  "corps": {
    "dispositif": "<p style=\"text-align: justify;\">L&#8217;article L.&#160;112&#8209;2&#8209;1 du code de l&#8217;&#233;ducation est ainsi modifi&#233;&#160;:</p><p style=\"text-align: justify;\">1&#176;&#160;La seconde phrase du premier alin&#233;a est compl&#233;t&#233;e par les mots&#160;:&#160;&#171;&#160;,&#160;et l&#8217;accompagnement des familles&#160;&#187;&#160;;</p><p style=\"text-align: justify;\">2&#176;&#160;Le deuxi&#232;me alin&#233;a est compl&#233;t&#233; par les mots&#160;: &#171;&#160;ainsi que les personnes charg&#233;es de l&#8217;aide individuelle ou mutualis&#233;e prescrite par la commission mentionn&#233;e &#224; l&#8217;article L.&#160;146&#8209;9 du m&#234;me code. Elles se r&#233;unissent au moins une fois par trimestre.&#160;&#187;</p>",
    "exposeSommaire": "<p style=\"text-align: justify;\">Compte tenu du rejet de cette disposition dans le cadre de la loi pour une &#233;cole vraiment inclusive que le groupe Socialistes et apparent&#233;s a r&#233;cemment pr&#233;sent&#233; &#224; l&#8217;Assembl&#233;e nationale, et compte tenu du flou qui entoure le v&#233;hicule l&#233;gislatif qui pourrait accueillir les mesures l&#233;gislatives r&#233;sultant de la concertation&#160;&#171;&#160;Ensemble pour une &#233;cole inclusive&#160;&#187; cens&#233;e aboutir autour de la mi-f&#233;vrier 2019, le pr&#233;sent amendement propose d&#8217;introduire dans le pr&#233;sent projet de loi les dispositions de l&#8217;article&#160;3 de la proposition de loi n&#176; 1598 pr&#233;cit&#233;e.</p><p style=\"text-align: justify;\">Il s&#8217;agit de garantir, par la loi, que les personnes qui accompagnent les &#233;l&#232;ves en situation de handicap soient associ&#233;es aux &#233;quipes de suivi de la scolarisation (ESS) qui veillent &#224; la mise en &#339;uvre des projets personnalis&#233;s de scolarisation (PPS) de ces &#233;l&#232;ves.</p><p style=\"text-align: justify;\">La r&#233;daction propos&#233;e tient compte&#160;de&#160;:</p><p style=\"text-align: justify;\">-&#160;1&#176; la pr&#233;cision apport&#233;e, &#224; l&#8217;initiative de M. Philippe Berta et de plusieurs de ses coll&#232;gues, selon laquelle les ESS doivent avoir une mission d&#8217;accompagnement des familles (et pas seulement de suivi de la mise en &#339;uvre du PPS&#160;;</p><p style=\"text-align: justify;\">-&#160;2&#176; la pr&#233;cision souhait&#233;e par M. Aur&#233;lien Pradi&#233; et plusieurs de ses coll&#232;gues, &#224; travers leur amendement AC 16, lors de l&#8217;examen de la proposition de loi pr&#233;cit&#233;e en commission des Affaires culturelles et de l&#8217;&#233;ducation, selon laquelle les ESS seraient tenues de se r&#233;unir au moins une fois par trimestre, plut&#244;t qu&#8217;&#171;&#160;au moins une fois par an&#160;&#187;, comme le pr&#233;cise aujourd&#8217;hui l&#8217;article D. 351&#8209;10 du code de l&#8217;&#233;ducation.</p><p style=\"text-align: justify;\">Le rapporteur avait donn&#233; un avis favorable &#224; cette derni&#232;re pr&#233;cision qui a malheureusement &#233;t&#233; rejet&#233;e par la commission.</p><p style=\"text-align: justify;\">&#160;</p>"
  },
  "representations": [
    {
      "nom": "PDF",
      "typeMime": {
        "type": "application",
        "subType": "PDF"
      },
      "statutRepresentation": {
        "verbatim": true,
        "canonique": true,
        "officielle": true,
        "transcription": false,
        "enregistrement": false
      },
      "contenu": {
        "documentURI": "/15/amendements/1629/AN/706.pdf"
      }
    }
  ],
  "seanceDiscussion": "RUANR5L15S2019IDS21504",
  "sort": {
    "dateSaisie": "2019-02-14T20:30:17.000+01:00",
    "sortEnSeance": "Tombé"
  },
  "dateDepot": "2019-02-07T01:00:00.000+01:00",
  "dateDistribution": "2019-02-11T01:00:00.000+01:00",
  "article99": "0",
  "loiReference": {
    "codeLoi": "c éducation",
    "divisionCodeLoi": "L112-2-1"
  }
}