{
  "uid": "AMANR5L15PO59051B0714P0D1N44",
  "identifiant": {
    "legislature": "15",
    "numero": "44",
    "numRect": "0",
    "saisine": {
      "texteLegislatifRef": "PRJLANR5L15B0714",
      "numeroPartiePLF": "0",
      "organeExamen": "PO59051",
      "mentionSecondeDeliberation": "0"
    }
  },
  "numeroLong": "CL44",
  "etapeTexte": "1ère lecture (1ère assemblée saisie)",
  "triAmendement": "vcc",
  "cardinaliteAmdtMultiples": "1",
  "etat": "Discuté",
  "signataires": {
    "auteur": {
      "typeAuteur": "Rapporteur",
      "acteurRef": "PA720916",
      "organeRef": "PO420120",
      "groupePolitiqueRef": "PO730964"
    },
    "cosignatairesRefs": [
      "PA720916"
    ],
    "texteAffichable": "Mme&#160;Lazaar, rapporteure pour avis au nom de la commission des affaires sociales"
  },
  "pointeurFragmentTexte": {
    "division": {
      "titre": "Article 5",
      "articleDesignationCourte": "ART. 5",
      "type": "ARTICLE",
      "avantAApres": "A",
      "divisionRattachee": "ARTICLE 5",
      "urlDivisionTexteVise": "/15/textes/0714.asp#D_Article_5"
    },
    "alinea": {
      "avantAApres": "Apres",
      "numero": "6"
    }
  },
  "corps": {
    "dispositif": "<p>Apr&#232;s l&#8217;alin&#233;a&#160;6, ins&#233;rer l&#8217;alin&#233;a suivant&#160;:</p><p>&#171;&#160;<i>c)</i>&#160;&#192; la premi&#232;re phrase du huiti&#232;me alin&#233;a, apr&#232;s le mot&#160;: &#171;&#160;asile,&#160;&#187;, sont ins&#233;r&#233;s les mots&#160;: &#171;&#160;d&#8217;une association d&#8217;aide et d&#8217;information aux personnes en situation de handicap,&#160;&#187;&#160;;&#160;&#187;.</p>",
    "exposeSommaire": "<p style=\"text-align: justify;\">Cet amendement tend &#224; pr&#233;ciser les conditions de l&#8217;entretien entre l&#8217;OFPRA et le demandeur d&#8217;asile. Cet entretien est d&#233;terminant pour &#233;valuer la vuln&#233;rabilit&#233; de la personne, surtout s&#8217;il est est en situation de handicap.</p><p style=\"text-align: justify;\">Il pr&#233;voit la possibilit&#233;, pour le demandeur, de se faire accompagner par une association d&#8217;aide et d&#8217;information aux personnes en situation de handicap afin de garantir pour ce public l&#8217;effectivit&#233; de l&#8217;acc&#232;s &#224; l&#8217;examen de la demande d&#8217;asile.</p>"
  },
  "representations": [
    {
      "nom": "PDF",
      "typeMime": {
        "type": "application",
        "subType": "PDF"
      },
      "statutRepresentation": {
        "verbatim": true,
        "canonique": true,
        "officielle": true,
        "transcription": false,
        "enregistrement": false
      },
      "contenu": {
        "documentURI": "/15/amendements/0714/CION_LOIS/CL44.pdf"
      }
    }
  ],
  "sort": {
    "dateSaisie": "2018-04-04T21:14:26.000+02:00",
    "sortEnSeance": "Retiré"
  },
  "dateDepot": "2018-03-27T02:00:00.000+02:00",
  "dateDistribution": "2018-04-02T02:00:00.000+02:00",
  "article99": "0",
  "loiReference": {
    "codeLoi": "1"
  }
}