{
  "uid": "AMANR5L15PO744107B0424P0D1N199",
  "identifiant": {
    "legislature": "15",
    "numero": "199",
    "numRect": "0",
    "saisine": {
      "texteLegislatifRef": "PRJLANR5L15B0424",
      "numeroPartiePLF": "0",
      "organeExamen": "PO744107",
      "mentionSecondeDeliberation": "0"
    }
  },
  "numeroLong": "199",
  "etapeTexte": "1ère lecture (1ère assemblée saisie)",
  "triAmendement": "gi",
  "cardinaliteAmdtMultiples": "1",
  "etat": "Irrecevable",
  "signataires": {
    "auteur": {
      "typeAuteur": "Depute",
      "acteurRef": "PA718838",
      "groupePolitiqueRef": "PO730934"
    },
    "cosignatairesRefs": [
      "PA609245",
      "PA334654",
      "PA719946",
      "PA2492",
      "PA718838",
      "PA605036",
      "PA718850",
      "PA767",
      "PA266797",
      "PA2086",
      "PA223837",
      "PA642847",
      "PA267429",
      "PA1874",
      "PA330909",
      "PA608416"
    ],
    "texteAffichable": "M.&#160;Brun,  M.&#160;Abad, M.&#160;Bazin, M.&#160;Brochand, M.&#160;Cattin, M.&#160;Cinieri, M.&#160;Cordier, M.&#160;Descoeur, M.&#160;Gosselin, M.&#160;Hetzel, Mme&#160;Lacroute, M.&#160;Le Fur, M.&#160;Marlin, M.&#160;Peltier, M.&#160;Quentin et M.&#160;Straumann"
  },
  "pointeurFragmentTexte": {
    "division": {
      "titre": "ANNEXE",
      "articleDesignationCourte": "ART. PREMIER",
      "type": "ANNEXE",
      "avantAApres": "A",
      "divisionRattachee": "ARTICLE PREMIER",
      "urlDivisionTexteVise": "/15/textes/0424.asp#D_Annexe"
    },
    "alinea": {
      "avantAApres": "Apres",
      "numero": "10"
    }
  },
  "corps": {
    "dispositif": "<p style=\"text-align: justify;\">Apr&#232;s l&#8217;alin&#233;a&#160;10, ins&#233;rer l&#8217;alin&#233;a suivant&#160;:</p><p style=\"text-align: justify;\">&#171;&#160;En cas de redressement, les agents proposent automatiquement un plan de r&#232;glement &#233;chelonn&#233; des droits sur la base d&#8217;une analyse financi&#232;re juste.&#160;&#187;</p>",
    "exposeSommaire": "<p style=\"text-align: justify;\">L&#8217;article pr&#233;liminaire du projet de loi pour un &#233;tat au service d&#8217;une soci&#233;t&#233; de confiance d&#233;finit les objectifs de l&#8217;action publique &#224; horizon 2022. Elle s&#8217;articule autour de l&#8217;affirmation de principes g&#233;n&#233;raux d&#8217;organisation et d&#8217;action, lesquels n&#233;cessitent des compl&#233;ments, c&#8217;est l&#8217;objet du pr&#233;sent amendement.</p><p style=\"text-align: justify;\">En effet, les petites entreprises peuvent avoir des difficult&#233;s de tr&#233;sorerie pour acquitter les sommes dues. L&#8217;administration devrait automatiquement proposer un &#233;chelonnement de la somme due. En effet, la raison budg&#233;taire de l&#8217;&#201;tat et la raison &#233;conomique sont li&#233;es. Une part de r&#233;alisme et d&#8217;&#233;quit&#233;, du moins &#233;conomique, devrait avoir un &#233;cho dans l&#8217;appr&#233;ciation des rectifications. Il faut distinguer entre le supportable et l&#8217;intenable.</p><p style=\"text-align: justify;\">C&#8217;est pourquoi, il devrait &#234;tre pr&#233;vu automatiquement un plan de r&#232;glement &#233;chelonn&#233; des droits sur la base d&#8217;une analyse financi&#232;re juste permettant de calculer des &#233;ch&#233;ances de paiements des redressements assurant ainsi la viabilit&#233; de l&#8217;entreprise malgr&#233; l&#8217;impact du redressement.</p><p style=\"text-align: justify;\">Enfin, il convient d&#8217;accro&#238;tre les garanties des entreprises en mati&#232;re de p&#233;nalit&#233;s. Les statistiques sur la mise en &#339;uvre des p&#233;nalit&#233;s devront &#234;tre publi&#233;es, en distinguant celles qui figurent dans les propositions de rectification ou les notifications de bases impos&#233;es d&#8217;office et celles qui sont maintenues &#224; l&#8217;issue de la proc&#233;dure de redressement.</p>"
  },
  "representations": [
    {
      "nom": "PDF",
      "typeMime": {
        "type": "application",
        "subType": "PDF"
      },
      "statutRepresentation": {
        "verbatim": true,
        "canonique": true,
        "officielle": true,
        "transcription": false,
        "enregistrement": false
      },
      "contenu": {
        "documentURI": "/15/amendements/0424/CSCONF/199.pdf"
      }
    }
  ],
  "dateDepot": "2018-01-09T01:00:00.000+01:00",
  "dateDistribution": "2018-01-15T01:00:00.000+01:00",
  "article99": "0",
  "loiReference": {}
}