{
  "uid": "AMANR5L15SEA717460B0235P2D1N1456",
  "identifiant": {
    "legislature": "15",
    "numero": "1456",
    "numRect": "0",
    "saisine": {
      "texteLegislatifRef": "PRJLANR5L15B0235",
      "numeroPartiePLF": "2",
      "organeExamen": "PO717460",
      "mentionSecondeDeliberation": "1"
    }
  },
  "numeroLong": "II-1456",
  "etapeTexte": "1ère lecture (1ère assemblée saisie)",
  "triAmendement": "zx",
  "cardinaliteAmdtMultiples": "1",
  "etat": "Discuté",
  "signataires": {
    "auteur": {
      "typeAuteur": "Depute",
      "acteurRef": "PA942",
      "groupePolitiqueRef": "PO730952"
    },
    "cosignatairesRefs": [
      "PA720696",
      "PA942",
      "PA266788",
      "PA2952",
      "PA267355",
      "PA335758",
      "PA721486",
      "PA346876",
      "PA695100",
      "PA642935",
      "PA721110",
      "PA421348",
      "PA719806",
      "PA712014",
      "PA718978",
      "PA267241",
      "PA1960",
      "PA332228",
      "PA722030",
      "PA720230",
      "PA331582",
      "PA702052",
      "PA713448",
      "PA267780",
      "PA267042",
      "PA267585",
      "PA721094",
      "PA331567",
      "PA267801",
      "PA693008",
      "PA268019",
      "PA333421",
      "PA610775"
    ],
    "texteAffichable": "M.&#160;Charles&#160;de Courson,  M.&#160;Ledoux, M.&#160;Becht, Mme&#160;de La Raudi&#232;re, Mme&#160;Descamps, Mme&#160;Firmin Le Bodo, M.&#160;Gom&#232;s, M.&#160;Leroy, M.&#160;Pancher, Mme&#160;Sage, M.&#160;Vercamer, M.&#160;Warsmann, M.&#160;Laqhila, M.&#160;Benoit, Mme&#160;Auconie, M.&#160;Bournazel, Mme&#160;Brenier, M.&#160;Demilly, M.&#160;Dunoyer, M.&#160;Favennec Becot, M.&#160;Meyer&#160;Habib, M.&#160;Herth, M.&#160;J&#233;go, M.&#160;Lagarde, Mme&#160;Magnier, M.&#160;Morel-&#192;-L&apos;Huissier, M.&#160;Naegelen, M.&#160;Polutele, M.&#160;Riester, Mme&#160;Sanquer, M.&#160;Sol&#232;re, M.&#160;Philippe&#160;Vigier et M.&#160;Villiers"
  },
  "pointeurFragmentTexte": {
    "division": {
      "titre": "Article 46",
      "articleDesignationCourte": "APRÈS ART. 46",
      "type": "ARTICLE",
      "avantAApres": "Apres",
      "divisionRattachee": "APRÈS L'ARTICLE 46, insérer l'article suivant:",
      "articleAdditionnel": "1",
      "urlDivisionTexteVise": "/15/textes/0235C.asp#D_Article_46"
    }
  },
  "corps": {
    "dispositif": "<p style=\"text-align: justify;\">Avant le 15 juin 2018, le Gouvernement remet un rapport au Parlement &#233;tudiant les possibilit&#233;s de mise en &#339;uvre d&#8217;un compte <span  data-cid=\"2\" data-userid=\"33\" data-username=\"Charles De Courson\" data-time=\"1510327019023\">d&#8217;</span>affectation sp&#233;ciale, dans le projet de loi de finances pour 2019, destin&#233; &#224; distribuer les produits de la redevance d&#8217;arch&#233;ologie pr&#233;ventive.</p>",
    "exposeSommaire": "<p style=\"text-align: justify;\">Les activit&#233;s arch&#233;ologiques pr&#233;ventives sont divis&#233;es en deux cat&#233;gories&#160;:</p><p style=\"text-align: justify;\">1. une mission de service public, pour &#171;&#160;les diagnostics arch&#233;ologiques pr&#233;alables&#160;&#187;, dont le monopole est confi&#233; &#224; l&#8217;INRAP,</p><p style=\"text-align: justify;\">2. une mission du secteur marchand, &#171;&#160;les fouilles arch&#233;ologiques&#160;&#187;, mettant en concurrence l&#8217;INRAP, certains services de collectivit&#233;s, et les op&#233;rateurs priv&#233;s.</p><p style=\"text-align: justify;\">Tous les rapports pointent la distorsion de concurrence, et l&#8217;urgence d&#8217;instaurer une comptabilit&#233; analytique&#160;:</p><p style=\"text-align: justify;\">- d&#233;cision de l&#8217;Autorit&#233; de la concurrence, 1<sup>er</sup> juin 2017. Extrait&#160;: Il s&#8217;agit de &#171;&#160;pr&#233;venir tout risque de subventions crois&#233;es&#160;&#187;, au &#171;&#160;risque d&#8217;engendrer des distorsions de concurrence avec les autres acteurs du secteur de l&#8217;arch&#233;ologie pr&#233;ventive&#160;&#187;</p><p style=\"text-align: justify;\">- rapport budg&#233;taire &#171;&#160;Patrimoines&#160;&#187; du PLF 2017. Extrait&#160;: &#171;&#160;Une partie de cette subvention, pourtant destin&#233;e &#224; la conduite des diagnostics, peut donc &#234;tre utilis&#233;e par l&#8217;INRAP pour la r&#233;alisation des op&#233;rations de fouilles arch&#233;ologiques, au risque d&#8217;engendrer des distorsions de concurrence&#160;&#187;</p><p style=\"text-align: justify;\">- r&#233;f&#233;r&#233; de la Cour des Comptes, 2013. Extrait&#160;: &#171;&#160;le perfectionnement de la m&#233;thode de comptabilit&#233; analytique actuellement utilis&#233;e par l&#8217;INRAP doivent permettre de garantir un exercice transparent et non fauss&#233; du jeu de la concurrence&#160;&#187;</p><p style=\"text-align: justify;\">- une note de l&#8217;administration d&#8217;octobre 2012 d&#233;taillant les modalit&#233;s de sa mise en &#339;uvre et qui pr&#233;voyait une application effective au 1er janvier 2014.</p><p style=\"text-align: justify;\">- le principe d&#8217;un compte d&#8217;affectation sp&#233;ciale avait notamment &#233;t&#233; valid&#233; dans des d&#233;bats parlementaires (d&#233;bats PLFR2011)</p><p style=\"text-align: justify;\">Cet amendement vise &#224; mettre en &#339;uvre cette transparence en cr&#233;ant un compte affectation sp&#233;ciale destin&#233; &#224; distribuer les produits de la redevance d&#8217;arch&#233;ologie pr&#233;ventive (RAP). Il permet de r&#233;pondre aux inqui&#233;tudes de la Cour des comptes et d&#8217;assurer une meilleure gestion de la redevance et un contr&#244;le de son emploi.&#160;</p>"
  },
  "representations": [
    {
      "nom": "PDF",
      "typeMime": {
        "type": "application",
        "subType": "PDF"
      },
      "statutRepresentation": {
        "verbatim": true,
        "canonique": true,
        "officielle": true,
        "transcription": false,
        "enregistrement": false
      },
      "contenu": {
        "documentURI": "/15/amendements/0235C/AN/1456.pdf"
      }
    }
  ],
  "seanceDiscussion": "RUANR5L15S2018IDS20772",
  "sort": {
    "dateSaisie": "2017-11-20T17:47:49.000+01:00",
    "sortEnSeance": "Rejeté"
  },
  "dateDepot": "2017-11-10T01:00:00.000+01:00",
  "dateDistribution": "2017-11-16T01:00:00.000+01:00",
  "article99": "0",
  "loiReference": {}
}