{
  "uid": "AMANR5L15PO419865B1839P0D1N124",
  "identifiant": {
    "legislature": "15",
    "numero": "124",
    "numRect": "0",
    "saisine": {
      "texteLegislatifRef": "PIONANR5L15B1839",
      "numeroPartiePLF": "0",
      "organeExamen": "PO419865",
      "mentionSecondeDeliberation": "0"
    }
  },
  "numeroLong": "CD124",
  "etapeTexte": "Nouvelle Lecture",
  "triAmendement": "asaaaaaaaaaaaaaaaaaaaaaaaaaaaaaaaaaaaaaaaaaaaaaaaaapkknztgu",
  "cardinaliteAmdtMultiples": "1",
  "etat": "Discuté",
  "signataires": {
    "auteur": {
      "typeAuteur": "Depute",
      "acteurRef": "PA331582",
      "groupePolitiqueRef": "PO759900"
    },
    "cosignatairesRefs": [
      "PA605694",
      "PA336439",
      "PA719286",
      "PA608292",
      "PA336175",
      "PA755549",
      "PA405480",
      "PA605518",
      "PA267042",
      "PA331582",
      "PA719138",
      "PA719146",
      "PA720996",
      "PA607619"
    ],
    "texteAffichable": "M.&#160;Philippe&#160;Vigier,  M.&#160;Acquaviva, M.&#160;Brial, M.&#160;Castellani, M.&#160;Cl&#233;ment, M.&#160;Colombani, Mme&#160;Dubi&#233;, M.&#160;El Guerrab, M.&#160;Falorni, M.&#160;Favennec Becot, M.&#160;Fran&#231;ois-Michel&#160;Lambert, M.&#160;Molac, Mme&#160;Pinel et M.&#160;Pupponi"
  },
  "pointeurFragmentTexte": {
    "division": {
      "titre": "Article 2",
      "articleDesignationCourte": "ART. 2",
      "type": "ARTICLE",
      "avantAApres": "A",
      "divisionRattachee": "ARTICLE 2",
      "urlDivisionTexteVise": "/15/textes/1839.asp#D_Article_2"
    },
    "alinea": {
      "numero": "2"
    }
  },
  "corps": {
    "dispositif": "<p>&#192; la premi&#232;re phrase de l&#8217;alin&#233;a&#160;2,&#160;apr&#232;s le mot&#160;:</p><p style=\"text-align: justify;\">&#171;&#160;centres-bourgs&#160;&#187;,</p><p style=\"text-align: justify;\">ins&#233;rer les mots&#160;:</p><p style=\"text-align: justify;\">&#171;&#160;, de la lutte contre l&#8217;habitat indigne et d&#233;grad&#233;, de la r&#233;habilitation de l&#8217;immobilier de loisir&#160;&#187;.</p>",
    "exposeSommaire": "<p>Dans le cadre d&#8217;une politique d&#8217;am&#233;nagement du territoire plus harmonieuse, le pr&#233;sent amendement vise &#224; inclure dans les missions confi&#233;es &#224; la Future ANCT celles relatives &#224; la lutte contre l&#8217;habitat indigne, d&#233;grad&#233;s, ainsi qu&#8217;&#224; la r&#233;habilitation de l&#8217;immobilier de loisir.</p><p style=\"text-align: justify;\">Confier cette mission &#224; l&#8217;ANCT permettrait de mieux coordonner les actions men&#233;es actuellement par l&#8217;&#201;tat et les collectivit&#233;s territoriales.</p>"
  },
  "representations": [
    {
      "nom": "PDF",
      "typeMime": {
        "type": "application",
        "subType": "PDF"
      },
      "statutRepresentation": {
        "verbatim": true,
        "canonique": true,
        "officielle": true,
        "transcription": false,
        "enregistrement": false
      },
      "contenu": {
        "documentURI": "/15/amendements/1839/CION-DVP/CD124.pdf"
      }
    }
  ],
  "sort": {
    "dateSaisie": "2019-05-07T17:11:50.000+02:00",
    "sortEnSeance": "Rejeté"
  },
  "dateDepot": "2019-05-03T02:00:00.000+02:00",
  "dateDistribution": "2019-05-06T02:00:00.000+02:00",
  "article99": "0",
  "loiReference": {
    "codeLoi": "p1"
  }
}