{
  "uid": "AMANR5L15PO419604B0941P0D1N16",
  "identifiant": {
    "legislature": "15",
    "numero": "16",
    "numRect": "0",
    "saisine": {
      "texteLegislatifRef": "PIONANR5L15B0941",
      "numeroPartiePLF": "0",
      "organeExamen": "PO419604",
      "mentionSecondeDeliberation": "0"
    }
  },
  "numeroLong": "AC16",
  "etapeTexte": "1ère lecture (1ère assemblée saisie)",
  "triAmendement": "al",
  "cardinaliteAmdtMultiples": "1",
  "etat": "Discuté",
  "signataires": {
    "auteur": {
      "typeAuteur": "Depute",
      "acteurRef": "PA266776",
      "groupePolitiqueRef": "PO730934"
    },
    "cosignatairesRefs": [
      "PA266776"
    ],
    "texteAffichable": "M.&#160;Reiss"
  },
  "pointeurFragmentTexte": {
    "division": {
      "titre": "Article unique",
      "articleDesignationCourte": "ART. UNIQUE",
      "type": "ARTICLE",
      "avantAApres": "A",
      "divisionRattachee": "ARTICLE UNIQUE",
      "urlDivisionTexteVise": "/15/textes/0941.asp#D_Article_unique"
    }
  },
  "corps": {
    "dispositif": "<p style=\"text-align: justify;\">Supprimer cet article.</p>",
    "exposeSommaire": "<p style=\"text-align: justify;\">L&#8217;article L 511&#8209;5 du code de l&#8217;Education dans sa r&#233;daction issue de la loi du 12 juillet 2010 est aujourd&#8217;hui appliqu&#233; dans les &#233;coles primaires et les coll&#232;ges.<br />Cette proposition de loi est inutile.</p>"
  },
  "representations": [
    {
      "nom": "PDF",
      "typeMime": {
        "type": "application",
        "subType": "PDF"
      },
      "statutRepresentation": {
        "verbatim": true,
        "canonique": true,
        "officielle": true,
        "transcription": false,
        "enregistrement": false
      },
      "contenu": {
        "documentURI": "/15/amendements/0941/CION-CEDU/AC16.pdf"
      }
    }
  ],
  "sort": {
    "dateSaisie": "2018-05-29T17:33:05.000+02:00",
    "sortEnSeance": "Rejeté"
  },
  "dateDepot": "2018-05-25T02:00:00.000+02:00",
  "dateDistribution": "2018-05-27T02:00:00.000+02:00",
  "article99": "0",
  "loiReference": {}
}