{
  "uid": "AMANR5L15SEA717460BTC1548P0D1N334",
  "identifiant": {
    "legislature": "15",
    "numero": "334",
    "numRect": "0",
    "saisine": {
      "texteLegislatifRef": "PRJLANR5L15BTC1548",
      "numeroPartiePLF": "0",
      "organeExamen": "PO717460",
      "mentionSecondeDeliberation": "0"
    }
  },
  "numeroLong": "334",
  "etapeTexte": "Nouvelle Lecture",
  "triAmendement": "odiaaaaaaaaaaaaaaaaaaaaaaaaaaaaaaaaaaaaaaaaaaaaaaaihy",
  "cardinaliteAmdtMultiples": "1",
  "etat": "Discuté",
  "signataires": {
    "auteur": {
      "typeAuteur": "Depute",
      "acteurRef": "PA720386",
      "groupePolitiqueRef": "PO730934"
    },
    "cosignatairesRefs": [
      "PA1012",
      "PA720386"
    ],
    "texteAffichable": "M.&#160;Di Filippo et M.&#160;de la Verpilli&#232;re"
  },
  "pointeurFragmentTexte": {
    "division": {
      "titre": "Article 55",
      "articleDesignationCourte": "ART. 55",
      "type": "ARTICLE",
      "avantAApres": "A",
      "divisionRattachee": "ARTICLE 55",
      "urlDivisionTexteVise": "/15/textes/1548.asp#D_Article_55"
    }
  },
  "corps": {
    "dispositif": "<p style=\"text-align: justify;\">Supprimer cet article.</p>",
    "exposeSommaire": "<p style=\"text-align: justify;\">Le pr&#233;sent amendement vise &#224; supprimer l&#8217;article&#160;55 qui permet au gouvernement de &#171;&#160;tirer les cons&#233;quences&#160;&#187; de la fusion du Tribunal d&#8217;instance et du Tribunal de Grande instance pr&#233;vue par l&#8217;article&#160;53 du projet de loi, en coh&#233;rence avec la suppression demand&#233;e de cet article&#160;53.</p>"
  },
  "representations": [
    {
      "nom": "PDF",
      "typeMime": {
        "type": "application",
        "subType": "PDF"
      },
      "statutRepresentation": {
        "verbatim": true,
        "canonique": true,
        "officielle": true,
        "transcription": false,
        "enregistrement": false
      },
      "contenu": {
        "documentURI": "/15/amendements/1548/AN/334.pdf"
      }
    }
  ],
  "seanceDiscussion": "RUANR5L15S2019IDS21452",
  "sort": {
    "dateSaisie": "2019-01-18T02:52:32.000+01:00",
    "sortEnSeance": "Non soutenu"
  },
  "dateDepot": "2019-01-10T01:00:00.000+01:00",
  "dateDistribution": "2019-01-15T01:00:00.000+01:00",
  "article99": "0",
  "loiReference": {}
}