{
  "uid": "AMANR5L15PO420120B1297P0D1N621",
  "identifiant": {
    "legislature": "15",
    "numero": "621",
    "numRect": "0",
    "saisine": {
      "texteLegislatifRef": "PRJLANR5L15B1297",
      "numeroPartiePLF": "0",
      "organeExamen": "PO420120",
      "mentionSecondeDeliberation": "0"
    }
  },
  "numeroLong": "AS621",
  "etapeTexte": "1ère lecture (1ère assemblée saisie)",
  "triAmendement": "baaaaaaaaaaaaaaaaaaaaaaaaaaaaaaaaaaaaaaaaaaaaaaaaabtzzzzi",
  "cardinaliteAmdtMultiples": "1",
  "etat": "Discuté",
  "signataires": {
    "auteur": {
      "typeAuteur": "Depute",
      "acteurRef": "PA607619",
      "groupePolitiqueRef": "PO730964"
    },
    "cosignatairesRefs": [
      "PA607595",
      "PA607619"
    ],
    "texteAffichable": "M.&#160;Molac et M.&#160;Pellois"
  },
  "pointeurFragmentTexte": {
    "division": {
      "titre": "Article 8",
      "articleDesignationCourte": "ART. 8",
      "type": "ARTICLE",
      "avantAApres": "A",
      "divisionRattachee": "ARTICLE 8",
      "urlDivisionTexteVise": "/15/textes/1297.asp#D_Article_8"
    },
    "alinea": {
      "numero": "34"
    }
  },
  "corps": {
    "dispositif": "<p style=\"text-align: justify;\">Supprimer l&#8217;alin&#233;a&#160;34.</p>",
    "exposeSommaire": "<p style=\"text-align: justify;\">En vue de la transformation du Cr&#233;dit d&#8217;imp&#244;t pour la Comp&#233;titivit&#233; et l&#8217;emploi (CICE) en Cr&#233;dit d&#8217;imp&#244;t sur la taxe sur les salaires (CITS), cet article pr&#233;voit la suppression de l&#8217;exon&#233;ration de charges pour les Travailleurs Occasionnels Demandeurs d&#8217;Emploi (TODE). Ce dispositif permettait &#224; l&#8217;agriculture fran&#231;aise de maintenir une certaine comp&#233;titivit&#233; dans des fili&#232;res demandant beaucoup de main d&#8217;&#339;uvre saisonni&#232;re.</p><p style=\"text-align: justify;\">Cet all&#232;gement de charges patronales sp&#233;cifiques aux salari&#233;s saisonniers agricoles venait en effet s&#8217;ajouter au CICE. Avec leur disparition l&#8217;ann&#233;e prochaine, les deux dispositifs devraient &#234;tre compens&#233;s par un all&#233;gement de charge g&#233;n&#233;ral qui concerne tous les secteurs. N&#233;anmoins, dans sa forme actuelle, celui-ci sera d&#233;gressif &#224; 1 Smic, alors que la barre &#233;tait fix&#233;e &#224; 1,25 Smic pour le TODE. Avec les cong&#233;s pay&#233;s et les heures suppl&#233;mentaires, les salaires des saisonniers se situent entre 1,1 et 1,2 Smic.</p><p style=\"text-align: justify;\">Les 6 points de perte du CICE qui ne seront pas compens&#233;s, font peser d&#8217;importantes menaces &#233;conomiques sur les secteurs agricoles les plus pourvoyeurs de main d&#8217;&#339;uvre et met en danger la p&#233;rennit&#233; des emplois dans les territoires ruraux.</p><p style=\"text-align: justify;\">C&#8217;est la raison pour laquelle cet amendement pr&#233;voit de se donner le temps de trouver une v&#233;ritable exon&#233;ration sp&#233;cifique aux travailleurs saisonniers et l&#8217;amplification de toutes mesures visant &#224; compenser effectivement les 6 points de perte du CICE.</p>"
  },
  "representations": [
    {
      "nom": "PDF",
      "typeMime": {
        "type": "application",
        "subType": "PDF"
      },
      "statutRepresentation": {
        "verbatim": true,
        "canonique": true,
        "officielle": true,
        "transcription": false,
        "enregistrement": false
      },
      "contenu": {
        "documentURI": "/15/amendements/1297/CION-SOC/AS621.pdf"
      }
    }
  ],
  "sort": {
    "dateSaisie": "2018-10-16T17:57:53.000+02:00",
    "sortEnSeance": "Non soutenu"
  },
  "dateDepot": "2018-10-12T02:00:00.000+02:00",
  "dateDistribution": "2018-10-15T02:00:00.000+02:00",
  "article99": "0",
  "loiReference": {}
}