{
  "uid": "AMANR5L15SEA717460BTC1482P0D1N409",
  "identifiant": {
    "legislature": "15",
    "numero": "409",
    "numRect": "0",
    "saisine": {
      "texteLegislatifRef": "PRJLANR5L15BTC1482",
      "numeroPartiePLF": "0",
      "organeExamen": "PO717460",
      "mentionSecondeDeliberation": "0"
    }
  },
  "numeroLong": "409",
  "etapeTexte": "1ère lecture (1ère assemblée saisie)",
  "triAmendement": "ciaaaaaaaaaaaaaaaaaaaaaaaaaaaaaaaaaaaaaaaaaaaaaaaahwu",
  "cardinaliteAmdtMultiples": "1",
  "etat": "Discuté",
  "signataires": {
    "auteur": {
      "typeAuteur": "Depute",
      "acteurRef": "PA609520",
      "groupePolitiqueRef": "PO730964"
    },
    "cosignatairesRefs": [
      "PA609520"
    ],
    "texteAffichable": "Mme&#160;Pompili"
  },
  "pointeurFragmentTexte": {
    "division": {
      "titre": "Article 3",
      "articleDesignationCourte": "ART. 3",
      "type": "ARTICLE",
      "avantAApres": "A",
      "divisionRattachee": "ARTICLE 3",
      "urlDivisionTexteVise": "/15/textes/1482.asp#D_Article_3"
    },
    "alinea": {
      "numero": "13"
    }
  },
  "corps": {
    "dispositif": "<p>I.&#160;&#8211;&#160;&#192; l'alin&#233;a 13, supprimer les mots&#160;:</p><p>&#171;&#160;de violation grave de ses statuts ou de son r&#232;glement de chasse, de d&#233;ficit gave et continu,&#160;&#187;.</p><p>II.&#160;&#8211;&#160;En cons&#233;quence, au m&#234;me alin&#233;a, apr&#232;s le mot&#160;:</p><p>&#171;&#160;agr&#233;&#233;e,&#160;&#187;,</p><p>ins&#233;rer les mots&#160;:</p><p>&#171;&#160;de violation grave de ses statuts ou de son r&#232;glement de chasse ou de dysfonctionnement grave et continu de l'association,&#160;&#187;.</p>",
    "exposeSommaire": "<p style=\"text-align: justify;\">Amendement r&#233;dactionnel.</p>",
    "cartoucheDelaiDepotDepasse": "Sous réserve de son traitement par les services de l'Assemblée nationale et de sa recevabilité"
  },
  "representations": [
    {
      "nom": "PDF",
      "typeMime": {
        "type": "application",
        "subType": "PDF"
      },
      "statutRepresentation": {
        "verbatim": true,
        "canonique": true,
        "officielle": true,
        "transcription": false,
        "enregistrement": false
      },
      "contenu": {
        "documentURI": "/15/amendements/1482/AN/409.pdf"
      }
    }
  ],
  "seanceDiscussion": "RUANR5L15S2019IDS21462",
  "sort": {
    "dateSaisie": "2019-01-24T16:23:00.000+01:00",
    "sortEnSeance": "Adopté"
  },
  "dateDepot": "2018-12-14T01:00:00.000+01:00",
  "dateDistribution": "2019-01-24T01:00:00.000+01:00",
  "article99": "0",
  "loiReference": {}
}