{
  "uid": "AMANR5L15SEA717460B2272P1D1N2613",
  "identifiant": {
    "legislature": "15",
    "numero": "2613",
    "numRect": "1",
    "saisine": {
      "texteLegislatifRef": "PRJLANR5L15B2272",
      "numeroPartiePLF": "1",
      "organeExamen": "PO717460",
      "mentionSecondeDeliberation": "0"
    }
  },
  "numeroLong": "I-2613 (Rect)",
  "etapeTexte": "1ère lecture (1ère assemblée saisie)",
  "triAmendement": "daaaaaaaaaaaaaaaaaaaaaaaaaaaaaaaaaaaaaaaaaaaaaaaaaagkkkkkkknzzzzi",
  "cardinaliteAmdtMultiples": "1",
  "etat": "Discuté",
  "signataires": {
    "auteur": {
      "typeAuteur": "Depute",
      "acteurRef": "PA609726",
      "groupePolitiqueRef": "PO730934"
    },
    "cosignatairesRefs": [
      "PA609726"
    ],
    "texteAffichable": "M.&#160;Aubert"
  },
  "pointeurFragmentTexte": {
    "division": {
      "titre": "Article 13",
      "articleDesignationCourte": "APRÈS ART. 13",
      "type": "ARTICLE",
      "avantAApres": "Apres",
      "divisionRattachee": "APRÈS L'ARTICLE 13, insérer l'article suivant:",
      "articleAdditionnel": "1",
      "urlDivisionTexteVise": "/15/textes/2272A.asp#D_Article_13"
    }
  },
  "corps": {
    "dispositif": "<p>I.&#160;&#8211;&#160;Au second alin&#233;a du II de l&#8217;article&#160;72 B bis du code g&#233;n&#233;ral des imp&#244;ts, les mots&#160;: &#171;&#160;aux articles 75&#8209;0 A et&#160;&#187; sont remplac&#233;s par les mots&#160;: &#171;&#160;&#224; l&#8217;article&#160;&#187;.</p><p>II.&#160;&#8211;&#160;La perte de recettes pour l&#8217;&#201;tat est compens&#233;e &#224; due concurrence par la cr&#233;ation d&#8217;une taxe additionnelle aux droits mentionn&#233;s aux articles 575 et 575 A du code g&#233;n&#233;ral des imp&#244;ts.&#160;</p><p>&#160;</p><p>&#160;</p><p style=\"text-align: justify;\">&#160;</p>",
    "exposeSommaire": "<p>L&#8217;article&#160;58 de la loi de finances pour 2019 a r&#233;introduit un r&#233;gime optionnel de blocage de la valeur des stocks &#224; rotation lente en faveur des exploitants agricoles.</p><p style=\"text-align: justify;\">L&#8217;objectif recherch&#233; &#233;tant d&#8217;all&#233;ger le poids de la fiscalit&#233; li&#233; &#224; la valorisation de stocks des exploitants. En d&#233;rogeant &#224; la r&#232;gle de la r&#233;vision, &#224; la cl&#244;ture de chaque exercice, de l&#8217;&#233;valuation des produits qui demeurent en stocks pendant plusieurs ann&#233;es, le m&#233;canisme permet ainsi de reporter l&#8217;imposition des stocks jusqu&#8217;&#224; leur vente et d&#8217;all&#233;ger ainsi le r&#233;sultat imposable de l&#8217;exploitant.</p><p style=\"text-align: justify;\">Si ce m&#233;canisme est positif pour de nombreuses fili&#232;res dont le poids de la fiscalit&#233; des stocks p&#232;se lourdement sur l&#8217;exploitation (viticulture, &#233;levage), son application reste n&#233;anmoins extr&#234;mement limit&#233;e puisque les exploitants ayant opt&#233;, pour la d&#233;termination de leur r&#233;sultat imposable, &#224; la moyenne triennale (article&#160;75&#8209;0 B du CGI) en sont tout simplement exclus.</p><p style=\"text-align: justify;\">A noter que dans certains d&#233;partements, ce sont plus de 70&#160;% des agriculteurs qui ont fait le choix de la moyenne triennale.</p><p style=\"text-align: justify;\">Ainsi, afin de redonner de l&#8217;efficience au m&#233;canisme du blocage des stocks, il est propos&#233; de supprimer cette exclusion.</p>"
  },
  "representations": [
    {
      "nom": "PDF",
      "typeMime": {
        "type": "application",
        "subType": "PDF"
      },
      "statutRepresentation": {
        "verbatim": true,
        "canonique": true,
        "officielle": true,
        "transcription": false,
        "enregistrement": false
      },
      "contenu": {
        "documentURI": "/15/amendements/2272A/AN/2613.pdf"
      }
    }
  ],
  "seanceDiscussion": "RUANR5L15S2020IDS21871",
  "sort": {
    "dateSaisie": "2019-10-18T23:01:49.000+02:00",
    "sortEnSeance": "Non soutenu"
  },
  "dateDepot": "2019-10-10T02:00:00.000+02:00",
  "dateDistribution": "2019-10-17T02:00:00.000+02:00",
  "article99": "0",
  "loiReference": {
    "codeLoi": "CGI",
    "divisionCodeLoi": "72 B"
  }
}