{
  "uid": "AMANR5L15PO419865B1831P0D1N348",
  "identifiant": {
    "legislature": "15",
    "numero": "348",
    "numRect": "0",
    "saisine": {
      "texteLegislatifRef": "PRJLANR5L15B1831",
      "numeroPartiePLF": "0",
      "organeExamen": "PO419865",
      "mentionSecondeDeliberation": "0"
    }
  },
  "numeroLong": "CD348",
  "etapeTexte": "1ère lecture (2ème assemblée saisie)",
  "triAmendement": "hcaaaaaaaaaaaaaaaaaaaaaaaaaaaaaaaaaaaaaaaaaaaaaaaanabdx",
  "cardinaliteAmdtMultiples": "1",
  "etat": "Discuté",
  "signataires": {
    "auteur": {
      "typeAuteur": "Depute",
      "acteurRef": "PA266808",
      "groupePolitiqueRef": "PO730934"
    },
    "cosignatairesRefs": [
      "PA709315",
      "PA721678",
      "PA1029",
      "PA266808"
    ],
    "texteAffichable": "M.&#160;Rolland,  M.&#160;Reda, M.&#160;Deflesselles et M.&#160;Viala"
  },
  "pointeurFragmentTexte": {
    "division": {
      "titre": "Article 28",
      "articleDesignationCourte": "ART. 28",
      "type": "ARTICLE",
      "avantAApres": "A",
      "divisionRattachee": "ARTICLE 28",
      "urlDivisionTexteVise": "/15/textes/1831.asp#D_Article_28"
    },
    "alinea": {
      "avantAApres": "A",
      "numero": "13",
      "alineaDesignation": "Alinéa 13"
    }
  },
  "corps": {
    "dispositif": "<p style=\"text-align: justify;\">Apr&#232;s l&#8217;alin&#233;a&#160;13, ins&#233;rer l&#8217;alin&#233;a suivant&#160;:</p><p style=\"text-align: justify;\">&#171;&#160;a&#160;<i>bis</i>) &#192; la m&#234;me phrase du premier alin&#233;a, apr&#232;s le mot&#160;: &#171;&#160;voirie,&#160;&#187; sont ins&#233;r&#233;s les mots&#160;: &#171;&#160;aux organisations professionnelles du secteur des transports&#160;&#187;&#160;;&#160;&#187;.</p>",
    "exposeSommaire": "<p style=\"text-align: justify;\">Cet amendement vise &#224; associer les organisations professionnelles du secteur des transports &#224; la concertation relative &#224; la cr&#233;ation des zones &#224; faibles &#233;missions et aux limitations de circulations dans ces zones.</p>"
  },
  "representations": [
    {
      "nom": "PDF",
      "typeMime": {
        "type": "application",
        "subType": "PDF"
      },
      "statutRepresentation": {
        "verbatim": true,
        "canonique": true,
        "officielle": true,
        "transcription": false,
        "enregistrement": false
      },
      "contenu": {
        "documentURI": "/15/amendements/1831/CION-DVP/CD348.pdf"
      }
    }
  ],
  "sort": {
    "dateSaisie": "2019-05-18T01:40:15.000+02:00",
    "sortEnSeance": "Non soutenu"
  },
  "dateDepot": "2019-04-30T02:00:00.000+02:00",
  "dateDistribution": "2019-05-16T02:00:00.000+02:00",
  "article99": "0",
  "loiReference": {}
}