{
  "uid": "AMANR5L15PO420120B1681P0D1N228",
  "identifiant": {
    "legislature": "15",
    "numero": "228",
    "numRect": "0",
    "saisine": {
      "texteLegislatifRef": "PRJLANR5L15B1681",
      "numeroPartiePLF": "0",
      "organeExamen": "PO420120",
      "mentionSecondeDeliberation": "0"
    }
  },
  "numeroLong": "AS228",
  "etapeTexte": "1ère lecture (1ère assemblée saisie)",
  "triAmendement": "caaaaaaaaaaaaaaaaaaaaaaaaaaaaaaaaaaaaaaaaaaaaaaaaady",
  "cardinaliteAmdtMultiples": "1",
  "etat": "Discuté",
  "signataires": {
    "auteur": {
      "typeAuteur": "Depute",
      "acteurRef": "PA719194",
      "groupePolitiqueRef": "PO730964"
    },
    "cosignatairesRefs": [
      "PA720394",
      "PA718728",
      "PA719194",
      "PA721844",
      "PA722312",
      "PA720414",
      "PA719326",
      "PA722320",
      "PA718710",
      "PA721776",
      "PA721784",
      "PA721860",
      "PA719186",
      "PA718794",
      "PA719980",
      "PA719080",
      "PA722000",
      "PA719890",
      "PA720622",
      "PA722228",
      "PA721522",
      "PA719652",
      "PA721398",
      "PA720342",
      "PA720222",
      "PA721426",
      "PA719718",
      "PA721726"
    ],
    "texteAffichable": "Mme&#160;Yolaine&#160;de Courson,  Mme&#160;Bureau-Bonnard, Mme&#160;Maillart-M&#233;haignerie, Mme&#160;Brulebois, Mme&#160;Mauborgne, M.&#160;Girardin, Mme&#160;Piron, M.&#160;Baich&#232;re, Mme&#160;Trisse, M.&#160;Cesarini, M.&#160;Leclabart, M.&#160;Lejeune, Mme&#160;Bessot Ballot, Mme&#160;H&#233;rin, M.&#160;Batut, Mme&#160;Hammerer, Mme&#160;Degois, Mme&#160;Pascale&#160;Boyer, Mme&#160;Marsaud, M.&#160;Borowczyk, Mme&#160;Gomez-Bassac, M.&#160;Perrot, Mme&#160;Vanceunebrock-Mialon, Mme&#160;Le Peih, Mme&#160;Khattabi, M.&#160;Buchou, Mme&#160;Gipson et Mme&#160;Riotton"
  },
  "pointeurFragmentTexte": {
    "division": {
      "titre": "Article 8",
      "articleDesignationCourte": "ART. 8",
      "type": "ARTICLE",
      "avantAApres": "A",
      "divisionRattachee": "ARTICLE 8",
      "urlDivisionTexteVise": "/15/textes/1681.asp#D_Article_8"
    },
    "alinea": {
      "numero": "2"
    }
  },
  "corps": {
    "dispositif": "<p style=\"text-align: justify;\">Apr&#232;s le mot&#160;:</p><p style=\"text-align: justify;\">&#171;&#160;activit&#233;s&#160;&#187;</p><p style=\"text-align: justify;\">r&#233;diger ainsi la fin de l&#8217;alin&#233;a&#160;2&#160;:</p><p style=\"text-align: justify;\">&#171;&#160;principales, les missions prioritaires, et les conditions d&#8217;intervention de ces &#233;tablissements, en coordination avec les autres acteurs du syst&#232;me de sant&#233; et du secteur m&#233;dico&#8209;social, sans pr&#233;judice des activit&#233;s, missions et conditions d&#8217;intervention actuelles de ces &#233;tablissements&#160;;&#160;&#187;.</p>",
    "exposeSommaire": "<p>Si le Gouvernement est autoris&#233; &#224; red&#233;finir l&#8217;activit&#233; et les missions des h&#244;pitaux de proximit&#233;, la r&#233;daction actuelle suppose que certaines missions d&#233;j&#224; exerc&#233;es par les h&#244;pitaux de proximit&#233;, qui fonctionnent par ailleurs correctement, seraient amen&#233;es &#224; s&#8217;arr&#234;ter. Cet amendement vise &#224; garantir que la qualification en h&#244;pital de proximit&#233; ne r&#233;duira pas le champ d&#8217;action de ces h&#244;pitaux.</p>"
  },
  "representations": [
    {
      "nom": "PDF",
      "typeMime": {
        "type": "application",
        "subType": "PDF"
      },
      "statutRepresentation": {
        "verbatim": true,
        "canonique": true,
        "officielle": true,
        "transcription": false,
        "enregistrement": false
      },
      "contenu": {
        "documentURI": "/15/amendements/1681/CION-SOC/AS228.pdf"
      }
    }
  ],
  "sort": {
    "dateSaisie": "2019-03-13T20:16:11.000+01:00",
    "sortEnSeance": "Tombé"
  },
  "dateDepot": "2019-03-06T01:00:00.000+01:00",
  "dateDistribution": "2019-03-12T01:00:00.000+01:00",
  "article99": "0",
  "loiReference": {
    "codeLoi": "1"
  }
}