{
  "uid": "AMANR5L15SEA717460B2272P2D1N427",
  "identifiant": {
    "legislature": "15",
    "numero": "427",
    "numRect": "0",
    "saisine": {
      "texteLegislatifRef": "PRJLANR5L15B2272",
      "numeroPartiePLF": "2",
      "organeExamen": "PO717460",
      "mentionSecondeDeliberation": "0"
    }
  },
  "numeroLong": "II-427",
  "etapeTexte": "1ère lecture (1ère assemblée saisie)",
  "triAmendement": "bcoaaaaaaaaaaaaaaaaaaaaaaaaaaaaaaaaaaaaaaaaaaaaaaaahzzzo",
  "cardinaliteAmdtMultiples": "1",
  "etat": "Discuté",
  "signataires": {
    "auteur": {
      "typeAuteur": "Depute",
      "acteurRef": "PA721094",
      "groupePolitiqueRef": "PO767217"
    },
    "cosignatairesRefs": [
      "PA695100",
      "PA610775",
      "PA721486",
      "PA712014",
      "PA610654",
      "PA266788",
      "PA720968",
      "PA721110",
      "PA719806",
      "PA720696",
      "PA642935",
      "PA331567",
      "PA268019",
      "PA702052",
      "PA267766",
      "PA267780",
      "PA721632",
      "PA332228",
      "PA267355",
      "PA721094",
      "PA721234",
      "PA720230",
      "PA267330",
      "PA642868",
      "PA267585"
    ],
    "texteAffichable": "M.&#160;Dunoyer,  M.&#160;Gom&#232;s, Mme&#160;Auconie, M.&#160;Becht, M.&#160;Benoit, M.&#160;Guy&#160;Bricout, M.&#160;Christophe, Mme&#160;de La Raudi&#232;re, M.&#160;Meyer&#160;Habib, Mme&#160;Firmin Le Bodo, Mme&#160;Descamps, M.&#160;Herth, M.&#160;Lagarde, M.&#160;Ledoux, Mme&#160;Lemoine, Mme&#160;Magnier, M.&#160;Naegelen, M.&#160;Morel-&#192;-L&apos;Huissier, Mme&#160;Sage, M.&#160;Vercamer, Mme&#160;Sanquer, M.&#160;Zumkeller, M.&#160;Nilor, Mme&#160;Maud&#160;Petit et Mme&#160;Benin"
  },
  "pointeurFragmentTexte": {
    "missionVisee": {
      "idMissionAN": "819",
      "libelleMission": "Outre-mer",
      "codeMissionPLF": "B",
      "libelleMissionPLF": "Répartition, par mission et programme, des crédits du budget général"
    },
    "division": {
      "titre": "ÉTAT B",
      "articleDesignationCourte": "ART. 38",
      "type": "ANNEXE",
      "avantAApres": "A",
      "divisionRattachee": "ARTICLE 38",
      "urlDivisionTexteVise": "/15/textes/2272C.asp#D_ETAT_B"
    }
  },
  "corps": {
    "exposeSommaire": "<p style=\"text-align: justify;\">Le pr&#233;sent amendement propose le transfert de cr&#233;dits de 500 000&#160;euros, de l&#8217;action 1&#160; &#171;&#160;logement&#160;&#187; du programme 123 &#171;&#160;conditions de vie outre-mer&#160;&#187;&#160;vers l&#8217;action 2&#160;&#171;&#160;aide &#224; l&#8217;insertion et &#224; la qualification professionnelle&#160;&#187; du programme 138 &#171;&#160;Emploi outre-mer&#160;&#187; afin de favoriser la prise en charge au titre de la continuit&#233; territoriale, des d&#233;placements&#160;des &#233;tudiants&#160;au titre de leur formation, mais dont les carences du syst&#232;me d&#8217;attribution des bourses sur crit&#232;re sociaux les rendent in&#233;ligibles aux bourses, et donc in&#233;ligibles &#224; la prise en charge totale de leur d&#233;placement dans le cadre du dispositif passeport mobilit&#233;.</p><p style=\"text-align: justify;\">Ainsi, seuls 27&#160;% des &#233;tudiants Cal&#233;doniens remplissent les crit&#232;res d&#8217;&#233;ligibilit&#233; pour les bourses, contre 38&#160;% des &#233;tudiants en m&#233;tropole, et 63&#160;% dans le reste des Outre-mer (65&#160;% &#224; Mayotte).</p><p style=\"text-align: justify;\">600 &#233;tudiants cal&#233;doniens ont sollicit&#233; une bourse sur crit&#232;res sociaux l&#8217;ann&#233;e derni&#232;re mais se la sont vus refuser au motif que les revenus de leurs parents d&#233;passaient les plafonds d&#8217;&#233;ligibilit&#233;. Seulement, ces plafonds sont d&#233;termin&#233;s pour tout le territoire de la R&#233;publique, et ne prennent pas en compte la vie ch&#232;re en Nouvelle Cal&#233;donie et donc les revenus plus &#233;lev&#233;s des Cal&#233;doniens. En 2015, l&#8217;&#233;cart de prix moyen entre la Nouvelle Cal&#233;donie et la m&#233;tropole est de 33&#160;%, un &#233;cart qui ceux de la R&#233;union et de Mayotte (+7&#160;%) et les Antilles (+12&#160;%), mais moindre que la Polyn&#233;sie (+ 39&#160;%).</p><p style=\"text-align: justify;\">Pour autant, en raison de la vie ch&#232;re, le reste &#224; vivre des m&#233;nages cal&#233;doniens est souvent faible, et ne permet pas de subvenir aux besoins de d&#233;placements des &#233;tudiants en m&#233;tropole dans le cadre de leur formation.&#160;</p><p style=\"text-align: justify;\">Aussi, le pr&#233;sent amendement anticipe l&#8217;extension du b&#233;n&#233;fice des dispositifs de continuit&#233; territoriale destin&#233;s aux &#233;tudiants boursiers, &#224; certains &#233;tudiants qui, tout en &#233;tant non-boursiers,&#160;sont en difficult&#233; pour prendre &#224; leur charge les d&#233;placements rendus n&#233;cessaires pour les besoins de leur formation.</p>",
    "dispositifAmdtCredit": {
      "listeProgrammes": [
        {
          "libelle": "Emploi outre-mer",
          "id": "100274",
          "AE": {
            "montantPositif": "500000",
            "montantNegatif": "0"
          },
          "CP": {
            "montantPositif": "500000",
            "montantNegatif": "0"
          },
          "action": "modification"
        },
        {
          "libelle": "Conditions de vie outre-mer",
          "id": "100275",
          "AE": {
            "montantPositif": "0",
            "montantNegatif": "500000"
          },
          "CP": {
            "montantPositif": "0",
            "montantNegatif": "500000"
          },
          "action": "modification"
        }
      ],
      "totalAE": {
        "montantPositif": "500000",
        "montantNegatif": "500000",
        "solde": "0"
      },
      "totalCP": {
        "montantPositif": "500000",
        "montantNegatif": "500000",
        "solde": "0"
      }
    }
  },
  "representations": [
    {
      "nom": "PDF",
      "typeMime": {
        "type": "application",
        "subType": "PDF"
      },
      "statutRepresentation": {
        "verbatim": true,
        "canonique": true,
        "officielle": true,
        "transcription": false,
        "enregistrement": false
      },
      "contenu": {
        "documentURI": "/15/amendements/2272C/AN/427.pdf"
      }
    }
  ],
  "seanceDiscussion": "RUANR5L15S2020IDS21904",
  "sort": {
    "dateSaisie": "2019-11-06T21:37:15.000+01:00",
    "sortEnSeance": "Retiré"
  },
  "dateDepot": "2019-10-24T02:00:00.000+02:00",
  "dateDistribution": "2019-11-06T01:00:00.000+01:00",
  "article99": "0",
  "loiReference": {}
}