{
  "uid": "AMANR5L15SEA717460BTC1396P0D1N427",
  "identifiant": {
    "legislature": "15",
    "numero": "427",
    "numRect": "0",
    "saisine": {
      "texteLegislatifRef": "PRJLANR5L15BTC1396",
      "numeroPartiePLF": "0",
      "organeExamen": "PO717460",
      "mentionSecondeDeliberation": "0"
    }
  },
  "numeroLong": "427",
  "etapeTexte": "1ère lecture (2ème assemblée saisie)",
  "triAmendement": "bbeaaaaaaaaaaaaaaaaaaaaaaaaaaaaaaaaaaaaaaaaaaaaaaabji",
  "cardinaliteAmdtMultiples": "1",
  "etat": "Discuté",
  "signataires": {
    "auteur": {
      "typeAuteur": "Depute",
      "acteurRef": "PA721296",
      "groupePolitiqueRef": "PO730964"
    },
    "cosignatairesRefs": [
      "PA719520",
      "PA719624",
      "PA720202",
      "PA719558",
      "PA722252",
      "PA719806",
      "PA722022",
      "PA719318",
      "PA721750",
      "PA721656",
      "PA722054",
      "PA719632",
      "PA720342",
      "PA721296",
      "PA719496",
      "PA722126",
      "PA721742",
      "PA720552"
    ],
    "texteAffichable": "M.&#160;Gouffier-Cha,  Mme&#160;Rixain, Mme&#160;Romeiro Dias, Mme&#160;Le Peih, M.&#160;Cabar&#233;, M.&#160;Balanant, Mme&#160;Couillard, Mme&#160;Anthoine, Mme&#160;Hai, Mme&#160;Muschotti, M.&#160;Nogal, M.&#160;Chiche, Mme&#160;Panonacle, Mme&#160;Auconie, Mme&#160;Rauch, Mme&#160;Calvez, Mme&#160;Krimi et Mme&#160;Florennes"
  },
  "pointeurFragmentTexte": {
    "division": {
      "titre": "Article 12",
      "articleDesignationCourte": "ART. 12",
      "type": "ARTICLE",
      "avantAApres": "A",
      "divisionRattachee": "ARTICLE 12",
      "urlDivisionTexteVise": "/15/textes/1396.asp#D_Article_12"
    },
    "alinea": {
      "numero": "27"
    }
  },
  "corps": {
    "dispositif": "<p style=\"text-align: justify;\">Compl&#233;ter l&#8217;alin&#233;a&#160;27 par la phrase suivante&#160;: </p><p style=\"text-align: justify;\">&#171;&#160;Avant l&#8217;audience introductive de fixation des mesures provisoires, chacun des deux &#233;poux peut, &#224; sa demande, &#234;tre entendu individuellement par le juge aux affaires familiales.&#160;&#187;</p>",
    "exposeSommaire": "<p style=\"text-align: justify;\">Issu de la recommandation n&#176;&#160;8 du rapport de la D&#233;l&#233;gation aux droits des femmes et &#224; l&#8217;&#233;galit&#233; des chances entre les hommes et les femmes, cet amendement pr&#233;cise la proc&#233;dure de l&#8217;audience introductive de fixation des mesures provisoires dans le cadre d&#8217;un divorce contentieux. Il pr&#233;voit que chacun des deux &#233;poux peut, &#224; sa demande, &#234;tre re&#231;u individuellement par le juge aux affaires familiales concern&#233;.</p><p style=\"text-align: justify;\">Cet espace de parole confidentiel est particuli&#232;rement utile dans une situation de divorce pouvant exacerber les tensions et parfois les violences au sein du couple. Compte tenu de l&#8217;ampleur des violences conjugales et intrafamiliales, aucun moment o&#249; la parole des victimes peut &#234;tre recueillie ne doit &#234;tre n&#233;glig&#233;, y compris au cours des proc&#233;dures de divorce.</p>"
  },
  "representations": [
    {
      "nom": "PDF",
      "typeMime": {
        "type": "application",
        "subType": "PDF"
      },
      "statutRepresentation": {
        "verbatim": true,
        "canonique": true,
        "officielle": true,
        "transcription": false,
        "enregistrement": false
      },
      "contenu": {
        "documentURI": "/15/amendements/1396/AN/427.pdf"
      }
    }
  ],
  "seanceDiscussion": "RUANR5L15S2019IDS21374",
  "sort": {
    "dateSaisie": "2018-11-22T15:15:33.000+01:00",
    "sortEnSeance": "Retiré"
  },
  "dateDepot": "2018-11-14T01:00:00.000+01:00",
  "dateDistribution": "2018-11-19T01:00:00.000+01:00",
  "article99": "0",
  "loiReference": {}
}