{
  "uid": "AMANR5L15SEA717460B0384P0D1N206",
  "identifiant": {
    "legislature": "15",
    "numero": "206",
    "numRect": "0",
    "saisine": {
      "texteLegislatifRef": "PRJLANR5L15B0384",
      "numeroPartiePLF": "0",
      "organeExamen": "PO717460",
      "mentionSecondeDeliberation": "0"
    }
  },
  "numeroLong": "206",
  "etapeTexte": "1ère lecture (1ère assemblée saisie)",
  "triAmendement": "zzzrot",
  "cardinaliteAmdtMultiples": "1",
  "etat": "Discuté",
  "signataires": {
    "auteur": {
      "typeAuteur": "Depute",
      "acteurRef": "PA1874",
      "groupePolitiqueRef": "PO730934"
    },
    "cosignatairesRefs": [
      "PA1874"
    ],
    "texteAffichable": "M.&#160;Le Fur"
  },
  "pointeurFragmentTexte": {
    "division": {
      "titre": "Article 9",
      "articleDesignationCourte": "ART. 9",
      "type": "ARTICLE",
      "avantAApres": "A",
      "divisionRattachee": "ARTICLE 9",
      "urlDivisionTexteVise": "/15/textes/0384.asp#D_Article_9"
    },
    "alinea": {
      "avantAApres": "Apres",
      "numero": "24"
    }
  },
  "corps": {
    "dispositif": "<p>I.&#160;&#8211;&#160;Apr&#232;s l&#8217;alin&#233;a&#160;24, ins&#233;rer l&#8217;alin&#233;a suivant&#160;:</p><p>&#171;&#160;I <i>bis</i>.&#160;&#8211;&#160;Au premier alin&#233;a de l&#8217;article&#160;1665 <i>bis</i> du m&#234;me code, dans sa r&#233;daction issue de l&#8217;article&#160;82 de la loi&#160;n&#176;&#160;2016&#8209;1917 du 29 d&#233;cembre 2016 pr&#233;cit&#233;e, apr&#232;s la r&#233;f&#233;rence&#160;: &#171;&#160;199 <i>sexdecies</i>&#160;&#187;, est ins&#233;r&#233;e la r&#233;f&#233;rence&#160;: &#171;&#160;, 199 <i>sexvicies</i>&#160;&#187;.</p><p>II.&#160;&#8211;&#160;Compl&#233;ter cet article par l&#8217;alin&#233;a suivant&#160;:</p><p>&#171;&#160;V.&#160;&#8211;&#160;La perte de recettes pour l&#8217;&#201;tat est compens&#233;e, &#224; due concurrence, par la cr&#233;ation d&#8217;une taxe additionnelle aux droits sur les tabacs mentionn&#233;e aux articles 575 et 575 A du code g&#233;n&#233;ral des imp&#244;ts.&#160;&#187;</p>",
    "exposeSommaire": "<p style=\"text-align: justify;\">Le pr&#233;sent amendement vise &#224; &#233;largir le dispositif pr&#233;vu par l&#8217;article&#160;1665 bis du code g&#233;n&#233;ral des imp&#244;ts &#224; la r&#233;duction d&#8217;imp&#244;t Censi-Bouvard.</p>"
  },
  "representations": [
    {
      "nom": "PDF",
      "typeMime": {
        "type": "application",
        "subType": "PDF"
      },
      "statutRepresentation": {
        "verbatim": true,
        "canonique": true,
        "officielle": true,
        "transcription": false,
        "enregistrement": false
      },
      "contenu": {
        "documentURI": "/15/amendements/0384/AN/206.pdf"
      }
    }
  ],
  "seanceDiscussion": "RUANR5L15S2018IDS20815",
  "sort": {
    "dateSaisie": "2017-12-05T19:08:38.000+01:00",
    "sortEnSeance": "Rejeté"
  },
  "dateDepot": "2017-11-30T01:00:00.000+01:00",
  "dateDistribution": "2017-12-01T01:00:00.000+01:00",
  "article99": "0",
  "loiReference": {}
}