{
  "uid": "AMANR5L15PO419610B0587P0D1N4",
  "identifiant": {
    "legislature": "15",
    "numero": "4",
    "numRect": "0",
    "saisine": {
      "texteLegislatifRef": "PIONANR5L15B0587",
      "numeroPartiePLF": "0",
      "organeExamen": "PO419610",
      "mentionSecondeDeliberation": "0"
    }
  },
  "numeroLong": "CE4",
  "etapeTexte": "1ère lecture (1ère assemblée saisie)",
  "triAmendement": "ah",
  "cardinaliteAmdtMultiples": "1",
  "etat": "Discuté",
  "signataires": {
    "auteur": {
      "typeAuteur": "Depute",
      "acteurRef": "PA721678",
      "groupePolitiqueRef": "PO730934"
    },
    "cosignatairesRefs": [
      "PA2529",
      "PA346054",
      "PA721506",
      "PA608016",
      "PA267785",
      "PA721046",
      "PA606712",
      "PA608826",
      "PA643134",
      "PA346218",
      "PA267200",
      "PA721286",
      "PA721070",
      "PA721678",
      "PA712015",
      "PA718784",
      "PA266793",
      "PA642847",
      "PA605036"
    ],
    "texteAffichable": "M.&#160;Reda,  M.&#160;Larriv&#233;, M.&#160;Dive, M.&#160;Ramadier, Mme&#160;Louwagie, M.&#160;Masson, M.&#160;Emmanuel&#160;Maquet, Mme&#160;Valentin, M.&#160;Bazin, Mme&#160;Kuster, M.&#160;Huyghe, M.&#160;Abad, Mme&#160;Duby-Muller, Mme&#160;Ramassamy, M.&#160;Lurton, M.&#160;Pauget, M.&#160;Bony, Mme&#160;Bassire et M.&#160;Reitzer"
  },
  "pointeurFragmentTexte": {
    "division": {
      "titre": "Article PREMIER",
      "articleDesignationCourte": "APRÈS ART. PREMIER",
      "type": "ARTICLE",
      "avantAApres": "Apres",
      "divisionRattachee": "APRÈS L'ARTICLE PREMIER, insérer l'article suivant:",
      "articleAdditionnel": "1",
      "urlDivisionTexteVise": "/15/textes/0587.asp#D_Article_1er"
    }
  },
  "corps": {
    "dispositif": "<p style=\"text-align: justify;\">Apr&#232;s l&#8217;article&#160;225&#8209;19 du code p&#233;nal, il est ins&#233;r&#233; un article&#160;225&#8209;19&#8209;1 ainsi r&#233;dig&#233;&#160;:</p><p style=\"text-align: justify;\">&#171;&#160;<i>Art.&#160;225-19-1.</i>&#160;&#8211;&#160;Les biens meubles ou immeubles, quelle qu&#8217;en soit la nature, divis ou indivis, ayant servi &#224; commettre les infractions pr&#233;vues aux articles&#160;225&#8209;13 &#224;&#160;225&#8209;14&#8209;2 et commises par un marchand de sommeil tel que d&#233;fini &#224; l&#8217;article&#160;225&#8209;14&#8209;3 sont syst&#233;matiquement confisqu&#233;s.&#160;&#187;</p>",
    "exposeSommaire": "<p style=\"text-align: justify;\">Cet article propose de rendre syst&#233;matique la confiscation des biens utilis&#233;s par un marchand de sommeil.</p>"
  },
  "representations": [
    {
      "nom": "PDF",
      "typeMime": {
        "type": "application",
        "subType": "PDF"
      },
      "statutRepresentation": {
        "verbatim": true,
        "canonique": true,
        "officielle": true,
        "transcription": false,
        "enregistrement": false
      },
      "contenu": {
        "documentURI": "/15/amendements/0587/CION-ECO/CE4.pdf"
      }
    }
  ],
  "sort": {
    "dateSaisie": "2018-02-20T18:30:37.000+01:00",
    "sortEnSeance": "Tombé"
  },
  "dateDepot": "2018-02-13T01:00:00.000+01:00",
  "dateDistribution": "2018-02-19T01:00:00.000+01:00",
  "article99": "0",
  "loiReference": {
    "codeLoi": "pénal",
    "divisionCodeLoi": "225-19"
  }
}