{
  "uid": "AMANR5L15PO419865B1831P0D1N585",
  "identifiant": {
    "legislature": "15",
    "numero": "585",
    "numRect": "0",
    "saisine": {
      "texteLegislatifRef": "PRJLANR5L15B1831",
      "numeroPartiePLF": "0",
      "organeExamen": "PO419865",
      "mentionSecondeDeliberation": "0"
    }
  },
  "numeroLong": "CD585",
  "etapeTexte": "1ère lecture (2ème assemblée saisie)",
  "triAmendement": "idsaaaaaaaaaaaaaaaaaaaaaaaaaaaaaaaaaaaaaaaaaaaaaaazzzzzzzzzzzzzzzzy",
  "cardinaliteAmdtMultiples": "1",
  "etat": "Discuté",
  "signataires": {
    "auteur": {
      "typeAuteur": "Depute",
      "acteurRef": "PA721458",
      "groupePolitiqueRef": "PO730964"
    },
    "cosignatairesRefs": [
      "PA719326",
      "PA267336",
      "PA721522",
      "PA720170",
      "PA718768",
      "PA720622",
      "PA722134",
      "PA718894",
      "PA719024",
      "PA720814",
      "PA719448",
      "PA721458",
      "PA721434",
      "PA719890",
      "PA721398",
      "PA718728",
      "PA721426",
      "PA722170"
    ],
    "texteAffichable": "M.&#160;Roseren,  Mme&#160;Lardet, M.&#160;Batut, Mme&#160;Beaudouin-Hubiere, M.&#160;Blanchet, Mme&#160;Brulebois, Mme&#160;Bureau-Bonnard, M.&#160;Cazenove, Mme&#160;Chapelier, Mme&#160;Degois, M.&#160;Dombreval, M.&#160;Fi&#233;vet, Mme&#160;Gipson, M.&#160;Giraud, Mme&#160;Grandjean, Mme&#160;Riotton, Mme&#160;Valetta Ardisson et Mme&#160;Vanceunebrock-Mialon"
  },
  "pointeurFragmentTexte": {
    "division": {
      "titre": "RAPPORT ANNEXÉ",
      "articleDesignationCourte": "ART. 1ER A",
      "type": "ANNEXE",
      "avantAApres": "A",
      "divisionRattachee": "ARTICLE 1ER A",
      "urlDivisionTexteVise": "/15/textes/1831.asp#D_RAPPORT_ANNEXE"
    },
    "alinea": {
      "numero": "36"
    }
  },
  "corps": {
    "dispositif": "<p style=\"text-align: justify;\">&#192; la premi&#232;re phrase de l&#8217;alin&#233;a&#160;36, apr&#232;s le mot&#160;:</p><p style=\"text-align: justify;\">&#171;&#160;structurant&#160;&#187;,</p><p style=\"text-align: justify;\">ins&#233;rer les mots&#160;:</p><p style=\"text-align: justify;\">&#171;&#160;, notamment celui des trains d&#8217;&#233;quilibre du territoire et des trains d&#8217;am&#233;nagement du territoire,&#160;&#187;.</p>",
    "exposeSommaire": "<p style=\"text-align: justify;\">Cet amendement vise &#224; modifier le rapport annex&#233; &#224; la loi et approuv&#233; par l&#8217;article&#160;30 afin d&#8217;y apporter diverses pr&#233;cisions relatives aux territoires de montagne.</p><p style=\"text-align: justify;\">Il est ainsi propos&#233; que&#160;:&#160;</p><p style=\"text-align: justify;\">- L&#8217;acc&#233;l&#233;ration du d&#233;senclavement routier concerne &#233;galement les zones de montagne&#160;;</p><p style=\"text-align: justify;\">- L&#8217;&#201;tat reprenne une politique d&#8217;investissement dans les trains d&#8217;&#233;quilibre du territoire (TET) et les trains d&#8217;am&#233;nagement du territoire, les deux &#233;tant essentiels pour un maillage des territoires&#160;;</p><p style=\"text-align: justify;\">- Les travaux d&#8217;entretien, de s&#233;curisation et de modernisation du r&#233;seau routier, reconnu comme essentiel pour l&#8217;attractivit&#233; d&#8217;un territoire, comprennent des ouvrages de pr&#233;vention de risques naturels, ouvrages qui sont particuli&#232;rement n&#233;cessaires en montagne.<br />&#8195;</p>"
  },
  "representations": [
    {
      "nom": "PDF",
      "typeMime": {
        "type": "application",
        "subType": "PDF"
      },
      "statutRepresentation": {
        "verbatim": true,
        "canonique": true,
        "officielle": true,
        "transcription": false,
        "enregistrement": false
      },
      "contenu": {
        "documentURI": "/15/amendements/1831/CION-DVP/CD585.pdf"
      }
    }
  ],
  "sort": {
    "dateSaisie": "2019-05-21T00:00:58.000+02:00",
    "sortEnSeance": "Retiré"
  },
  "dateDepot": "2019-05-02T02:00:00.000+02:00",
  "dateDistribution": "2019-05-20T02:00:00.000+02:00",
  "article99": "0",
  "loiReference": {}
}