{
  "uid": "AMANR5L15PO59051B2357P0D1N518",
  "identifiant": {
    "legislature": "15",
    "numero": "518",
    "numRect": "0",
    "saisine": {
      "texteLegislatifRef": "PRJLANR5L15B2357",
      "numeroPartiePLF": "0",
      "organeExamen": "PO59051",
      "mentionSecondeDeliberation": "0"
    }
  },
  "numeroLong": "CL518",
  "etapeTexte": "1ère lecture (2ème assemblée saisie)",
  "triAmendement": "aaoaaaaaaaaaaaaaaaaaaaaaaaaaaaaaaaaaaaaaaaaaaaaaaabndi",
  "cardinaliteAmdtMultiples": "1",
  "etat": "Discuté",
  "signataires": {
    "auteur": {
      "typeAuteur": "Depute",
      "acteurRef": "PA942",
      "groupePolitiqueRef": "PO759900"
    },
    "cosignatairesRefs": [
      "PA942"
    ],
    "texteAffichable": "M.&#160;Charles&#160;de Courson"
  },
  "pointeurFragmentTexte": {
    "division": {
      "titre": "Article PREMIER",
      "articleDesignationCourte": "ART. PREMIER",
      "type": "ARTICLE",
      "avantAApres": "A",
      "divisionRattachee": "ARTICLE PREMIER",
      "urlDivisionTexteVise": "/15/textes/2357.asp#D_Article_1er"
    },
    "alinea": {
      "avantAApres": "Apres",
      "numero": "16"
    }
  },
  "corps": {
    "dispositif": "<p style=\"text-align: justify;\">Apr&#232;s l&#8217;alin&#233;a&#160;16, ins&#233;rer l&#8217;alin&#233;a suivant&#160;:</p><p style=\"text-align: justify;\">&#171;&#160;3&#176;&#160;Les conditions dans lesquelles l&#8217;&#233;tablissement public peut d&#233;cider de la cr&#233;ation de conf&#233;rences territoriales des maires pouvant &#234;tre consult&#233;es lors de l&#8217;&#233;laboration et de la mise en &#339;uvre de politiques de l&#8217;intercommunalit&#233;. Le pacte fixe, en outre, les modalit&#233;s de fonctionnement de ces conf&#233;rences territoriales.&#160;&#187;</p>",
    "exposeSommaire": "<p style=\"text-align: justify;\">Cet amendement est issu des travaux du groupe de travail de la D&#233;l&#233;gation aux collectivit&#233;s territoriales et &#224; la d&#233;centralisation sur le projet de loi.</p><p>Le pr&#233;sent amendement permet aux &#233;lus de s&#8217;interroger, dans le cadre du pacte de gouvernance, sur la meilleure mani&#232;re d&#8217;associer les Maires des communes aux travaux de l&#8217;intercommunalit&#233;. En effet, si les t&#233;moignages des Maires sur le terrain sont unanimes sur leur besoin d&#8217;&#234;tre mieux associ&#233;s, en dehors des instances de l&#8217;organe d&#233;lib&#233;rant, &#224; l&#8217;&#233;laboration des projets et &#224; la pr&#233;paration des prises de d&#233;cisions, beaucoup sont sceptiques &#224; l&#8217;id&#233;e que la Conf&#233;rence des Maires, introduite par le pr&#233;sent texte, serait la solution adapt&#233;e &#224; tous les territoires. En particulier dans les territoires g&#233;ographiquement vastes, ou comprenant un nombre important de communes, le fait de r&#233;unir l&#8217;ensemble des Maires peut &#234;tre compliqu&#233; d&#8217;un point de vue logistique, et ne garantit pas l&#8217;am&#233;lioration du dialogue. En outre, dans des EPCI aux p&#233;rim&#232;tres d&#233;sormais &#233;largis, les politiques port&#233;es par l&#8217;intercommunalit&#233; ne sont pas uniformes. Et il peut &#234;tre utile, pour des politiques publiques donn&#233;es ou des projets donn&#233;s qui concernent un groupe restreint de communes, de mettre en place des lieux d&#8217;&#233;changes avec les Maires sur un secteur donn&#233; de l&#8217;intercommunalit&#233;, et non sur l&#8217;ensemble du territoire.</p><p>Dans ces conditions, la mise en place de conf&#233;rences territoriales des Maires peut &#234;tre une solution compl&#233;mentaire ou alternative &#224; la conf&#233;rence des Maires, d&#232;s lors que le d&#233;bat ouvert lors de l&#8217;&#233;laboration du pacte de gouvernance aura permis aux &#233;lus de d&#233;terminer le dispositif le mieux adapt&#233; &#224; leurs besoins.</p><p><br /> &#160;</p>"
  },
  "representations": [
    {
      "nom": "PDF",
      "typeMime": {
        "type": "application",
        "subType": "PDF"
      },
      "statutRepresentation": {
        "verbatim": true,
        "canonique": true,
        "officielle": true,
        "transcription": false,
        "enregistrement": false
      },
      "contenu": {
        "documentURI": "/15/amendements/2357/CION_LOIS/CL518.pdf"
      }
    }
  ],
  "sort": {
    "dateSaisie": "2019-11-06T10:14:12.000+01:00",
    "sortEnSeance": "Tombé"
  },
  "dateDepot": "2019-10-31T01:00:00.000+01:00",
  "dateDistribution": "2019-11-05T01:00:00.000+01:00",
  "article99": "0",
  "loiReference": {
    "codeLoi": "1 id"
  }
}