{
  "uid": "AMANR5L15SEA717460B1490P0D1N720",
  "identifiant": {
    "legislature": "15",
    "numero": "720",
    "numRect": "0",
    "saisine": {
      "texteLegislatifRef": "PRJLANR5L15B1490",
      "numeroPartiePLF": "0",
      "organeExamen": "PO717460",
      "mentionSecondeDeliberation": "0"
    }
  },
  "numeroLong": "720",
  "etapeTexte": "Nouvelle Lecture",
  "triAmendement": "ebaaaaaaaaaaaaaaaaaaaaaaaaaaaaaaaaaaaaaaaaaaaaaaaaqbro",
  "cardinaliteAmdtMultiples": "1",
  "etat": "Discuté",
  "signataires": {
    "auteur": {
      "typeAuteur": "Depute",
      "acteurRef": "PA609590",
      "groupePolitiqueRef": "PO758835"
    },
    "cosignatairesRefs": [
      "PA342415",
      "PA332614",
      "PA608695",
      "PA267233",
      "PA340357",
      "PA610681",
      "PA1008",
      "PA608011",
      "PA333285",
      "PA1809",
      "PA1198",
      "PA608741",
      "PA609332",
      "PA429893",
      "PA1592",
      "PA333818",
      "PA642764",
      "PA643145",
      "PA335054",
      "PA605069",
      "PA335532",
      "PA609590",
      "PA508",
      "PA340343",
      "PA608172",
      "PA607553",
      "PA719930",
      "PA720988",
      "PA337483"
    ],
    "texteAffichable": "Mme&#160;Rabault,  M.&#160;Pueyo, M.&#160;Carvounas, M.&#160;Faure, M.&#160;Jean-Louis&#160;Bricout, Mme&#160;Pires Beaune, M.&#160;Aviragnet, Mme&#160;Bareigts, Mme&#160;Battistel, Mme&#160;Bi&#233;mouret, M.&#160;Bouillon, M.&#160;Alain&#160;David, Mme&#160;Laurence&#160;Dumont, M.&#160;Garot, M.&#160;David&#160;Habib, M.&#160;Hutin, M.&#160;Juanico, Mme&#160;Karamanli, M.&#160;J&#233;r&#244;me&#160;Lambert, M.&#160;Letchimy, Mme&#160;Manin, Mme&#160;Pau-Langevin, M.&#160;Potier, M.&#160;Saulignac, Mme&#160;Tolmont, Mme&#160;Untermaier, Mme&#160;Vainqueur-Christophe, M.&#160;Vallaud et Mme&#160;Victory"
  },
  "pointeurFragmentTexte": {
    "missionVisee": {
      "idMissionAN": "706",
      "libelleMission": "Défense",
      "codeMissionPLF": "B",
      "libelleMissionPLF": "Répartition, par mission et programme, des crédits du budget général"
    },
    "division": {
      "titre": "ÉTAT B",
      "articleDesignationCourte": "ART. 39",
      "type": "ANNEXE",
      "avantAApres": "A",
      "divisionRattachee": "ARTICLE 39",
      "urlDivisionTexteVise": "/15/textes/1490.asp#D_Etat_B"
    }
  },
  "corps": {
    "exposeSommaire": "<p style=\"text-align: justify;\">La mission &#171;&#160;D&#233;fense&#160;&#187; pr&#233;voit pour 2019 une dotation&#160;en carburants op&#233;rationnels de 39,5 millions&#160;d&#8217;euros pour nos forces arm&#233;es, en baisse par rapport au PLF 2018 de 4,1 millions d&#8217;euros.</p><p style=\"text-align: justify;\">Cependant, plusieurs facteurs sont susceptibles d&#8217;entra&#238;ner une augmentation substantielle des d&#233;penses de carburant de nos forces arm&#233;es&#160;:</p><p style=\"text-align: justify;\">- La hausse de la taxation du carburant d&#233;cid&#233;e dans le pr&#233;sent projet de loi, qui devrait faire augmenter en 2019 le prix du gazole de 7 centimes par rapport &#224; 2018, ce qui revient &#224; une hausse moyenne de 5&#160;%&#160;;</p><p style=\"text-align: justify;\">- La hausse du prix du baril de p&#233;trole, qui devrait augmenter d&#8217;environ 9,3&#160;% en 2019 (prix moyen du baril de brent &#224; 82 dollars contre 75 dollars en 2018 selon l&#8217;Institut Fran&#231;ais du P&#233;trole, Energies Nouvelles, IFPEN). Le Gouvernement table sur un prix du p&#233;trole de 73 dollars. Cette pr&#233;vision ne tient pas compte de la grande volatilit&#233; des cours du baril li&#233;s &#224; l&#8217;&#233;volution du march&#233; mais aussi aux risques &#233;conomiques internationaux.</p><p style=\"text-align: justify;\">Cet amendement propose donc d&#8217;augmenter de 6 millions d&#8217;euros la dotation en carburants op&#233;rationnels, pour que ces diff&#233;rents facteurs aient un impact neutre sur le budget de nos forces arm&#233;es.</p><p style=\"text-align: justify;\">Cet amendement&#160;:</p><p style=\"text-align: justify;\">- fl&#232;che&#160;6 millions d&#8217;euros de cr&#233;dits de paiement suppl&#233;mentaires vers l&#8217;action &#171;&#160;logistique et soutien interarm&#233;es&#160;&#187; (au sein du programme &#171;&#160;pr&#233;paration et emploi des forces&#160;&#187;)&#160;;</p><p style=\"text-align: justify;\">- et r&#233;duit de 6 millions d&#8217;euros les cr&#233;dits de paiement de l&#8217;action &#171;&#160;relations internationales et diplomatie de d&#233;fense&#160;&#187; (au sein du programme &#171;&#160;environnement et prospective de la politique de d&#233;fense&#160;&#187;).</p>",
    "dispositifAmdtCredit": {
      "listeProgrammes": [
        {
          "libelle": "Environnement et prospective de la politique de défense",
          "id": "56369",
          "AE": {
            "montantPositif": "0",
            "montantNegatif": "6000000"
          },
          "CP": {
            "montantPositif": "0",
            "montantNegatif": "6000000"
          },
          "action": "modification"
        },
        {
          "libelle": "Préparation et emploi des forces",
          "id": "56370",
          "AE": {
            "montantPositif": "6000000",
            "montantNegatif": "0"
          },
          "CP": {
            "montantPositif": "6000000",
            "montantNegatif": "0"
          },
          "action": "modification"
        },
        {
          "libelle": "Soutien de la politique de la défense",
          "id": "56371",
          "AE": {
            "montantPositif": "0",
            "montantNegatif": "0"
          },
          "CP": {
            "montantPositif": "0",
            "montantNegatif": "0"
          },
          "action": "modification"
        },
        {
          "libelle": "Équipement des forces",
          "id": "56372",
          "AE": {
            "montantPositif": "0",
            "montantNegatif": "0"
          },
          "CP": {
            "montantPositif": "0",
            "montantNegatif": "0"
          },
          "action": "modification"
        }
      ],
      "totalAE": {
        "montantPositif": "6000000",
        "montantNegatif": "6000000",
        "solde": "0"
      },
      "totalCP": {
        "montantPositif": "6000000",
        "montantNegatif": "6000000",
        "solde": "0"
      }
    }
  },
  "representations": [
    {
      "nom": "PDF",
      "typeMime": {
        "type": "application",
        "subType": "PDF"
      },
      "statutRepresentation": {
        "verbatim": true,
        "canonique": true,
        "officielle": true,
        "transcription": false,
        "enregistrement": false
      },
      "contenu": {
        "documentURI": "/15/amendements/1490/AN/720.pdf"
      }
    }
  ],
  "seanceDiscussion": "RUANR5L15S2019IDS21433",
  "sort": {
    "dateSaisie": "2018-12-19T01:37:45.000+01:00",
    "sortEnSeance": "Rejeté"
  },
  "dateDepot": "2018-12-14T01:00:00.000+01:00",
  "dateDistribution": "2018-12-17T01:00:00.000+01:00",
  "article99": "0",
  "loiReference": {}
}