{
  "uid": "AMANR5L15PO419610B0627P0D1N906",
  "identifiant": {
    "legislature": "15",
    "numero": "906",
    "numRect": "0",
    "saisine": {
      "texteLegislatifRef": "PRJLANR5L15B0627",
      "numeroPartiePLF": "0",
      "organeExamen": "PO419610",
      "mentionSecondeDeliberation": "0"
    }
  },
  "numeroLong": "CE906",
  "etapeTexte": "1ère lecture (1ère assemblée saisie)",
  "triAmendement": "bzo",
  "cardinaliteAmdtMultiples": "1",
  "etat": "Discuté",
  "signataires": {
    "auteur": {
      "typeAuteur": "Depute",
      "acteurRef": "PA267355",
      "groupePolitiqueRef": "PO744425"
    },
    "cosignatairesRefs": [
      "PA1960",
      "PA267780",
      "PA266788",
      "PA942",
      "PA642868",
      "PA267355",
      "PA331567",
      "PA721486",
      "PA268019",
      "PA642935",
      "PA267330",
      "PA333421"
    ],
    "texteAffichable": "M.&#160;Herth,  M.&#160;Leroy, M.&#160;Morel-&#192;-L&apos;Huissier, M.&#160;Charles&#160;de Courson, M.&#160;Becht, M.&#160;Pancher, M.&#160;Naegelen, Mme&#160;Firmin Le Bodo, Mme&#160;de La Raudi&#232;re, M.&#160;Christophe, M.&#160;Zumkeller et M.&#160;Lagarde"
  },
  "pointeurFragmentTexte": {
    "division": {
      "titre": "Article 13",
      "articleDesignationCourte": "ART. 13",
      "type": "ARTICLE",
      "avantAApres": "A",
      "divisionRattachee": "ARTICLE 13",
      "urlDivisionTexteVise": "/15/textes/0627.asp#D_Article_13"
    },
    "alinea": {
      "numero": "1"
    }
  },
  "corps": {
    "dispositif": "<p>Supprimer les alin&#233;as&#160;1,&#160;3 et&#160;4.</p>",
    "exposeSommaire": "<p style=\"text-align: justify;\">Le renforcement de l&#8217;arsenal r&#233;pressif en mati&#232;re de protection animale peut poser question, d&#8217;autant plus qu&#8217;aucun atelier des &#201;tats g&#233;n&#233;raux de l&#8217;alimentation&#160;(EGA) n&#8217;avait conclu sur de telles mesures. La priorit&#233; doit plut&#244;t &#234;tre d&#8217;accompagner les d&#233;marches de progr&#232;s engag&#233;es par les professionnels par du soutien aux investissements, de la formation et de r&#233;mun&#233;rer les &#233;leveurs &#224; un prix juste. Dans les cas d&#8217;&#233;leveurs en d&#233;sh&#233;rence, rares mais qui sont le reflet d&#8217;une d&#233;tresse humaine profonde, les r&#233;seaux professionnels privil&#233;gient la pr&#233;vention et la d&#233;tection de ces grandes difficult&#233;s de la fa&#231;on la plus pr&#233;coce possible pour &#233;viter les d&#233;fauts de soin apport&#233;s aux animaux, en accompagnant au plus pr&#232;s les &#233;leveurs concern&#233;s.</p><p style=\"text-align: justify;\">L&#8217;article&#160;2&#8209;13 du code de proc&#233;dure p&#233;nale ouvre d&#233;j&#224; aux associations la possibilit&#233; d&#8217;exercer les droits reconnus &#224; la partie civile pour les d&#233;lits envers des animaux d&#233;finis par le code p&#233;nal. Ces dispositions sont l&#233;gitimes et protectrices. Le risque de leur extension au code rural serait d&#8217;accentuer la pression de la part des ONG sur le terrain, alors que certaines sont fondamentalement anti-&#233;levage et pourraient avoir int&#233;r&#234;t &#224; multiplier les signalements pour demander des dommages et int&#233;r&#234;ts.</p>"
  },
  "representations": [
    {
      "nom": "PDF",
      "typeMime": {
        "type": "application",
        "subType": "PDF"
      },
      "statutRepresentation": {
        "verbatim": true,
        "canonique": true,
        "officielle": true,
        "transcription": false,
        "enregistrement": false
      },
      "contenu": {
        "documentURI": "/15/amendements/0627/CION-ECO/CE906.pdf"
      }
    }
  ],
  "sort": {
    "dateSaisie": "2018-04-20T00:01:05.000+02:00",
    "sortEnSeance": "Non soutenu"
  },
  "dateDepot": "2018-04-12T02:00:00.000+02:00",
  "dateDistribution": "2018-04-17T02:00:00.000+02:00",
  "article99": "0",
  "loiReference": {
    "codeLoi": "s"
  }
}