{
  "uid": "AMANR5L15SEA717460B2272P1D1N3013",
  "identifiant": {
    "legislature": "15",
    "numero": "3013",
    "numRect": "0",
    "saisine": {
      "texteLegislatifRef": "PRJLANR5L15B2272",
      "numeroPartiePLF": "1",
      "organeExamen": "PO717460",
      "mentionSecondeDeliberation": "0"
    }
  },
  "numeroLong": "I-3013",
  "etapeTexte": "1ère lecture (1ère assemblée saisie)",
  "triAmendement": "aobaaaaaaaaaaaaaaaaaaaaaaaaaaaaaaaaaaaaaaaaaaaaaaazzzzzzzzzzzzzzzzzzzs",
  "cardinaliteAmdtMultiples": "1",
  "amendementParent": "AMANR5L15SEA717460B2272P1D1N3002",
  "etat": "Discuté",
  "signataires": {
    "auteur": {
      "typeAuteur": "Depute",
      "acteurRef": "PA719138",
      "groupePolitiqueRef": "PO759900"
    },
    "cosignatairesRefs": [
      "PA607619",
      "PA942",
      "PA331582",
      "PA719138",
      "PA405480",
      "PA719286",
      "PA336175",
      "PA719146",
      "PA608292"
    ],
    "texteAffichable": "M.&#160;Castellani,  M.&#160;Acquaviva, M.&#160;Colombani, M.&#160;Charles&#160;de Courson, Mme&#160;Dubi&#233;, M.&#160;Molac, Mme&#160;Pinel, M.&#160;Pupponi et M.&#160;Philippe&#160;Vigier"
  },
  "pointeurFragmentTexte": {
    "division": {
      "titre": "Article 20",
      "articleDesignationCourte": "ART. 20",
      "type": "ARTICLE",
      "avantAApres": "A",
      "divisionRattachee": "ARTICLE 20",
      "urlDivisionTexteVise": "/15/textes/2272A.asp#D_Article_20"
    },
    "alinea": {
      "numero": "21"
    }
  },
  "corps": {
    "dispositif": "<p style=\"text-align: justify;\">&#192; l&#8217;alin&#233;a&#160;2, substituer aux mots&#160;:</p><p style=\"text-align: justify;\">&#171;&#160;de trois&#160;&#187;</p><p style=\"text-align: justify;\">les mots&#160;:</p><p style=\"text-align: justify;\">&#171;&#160;d&#8217;un&#160;&#187;.</p>",
    "exposeSommaire": "<p style=\"text-align: justify;\">L&#8217;amendement 3002 du Gouvernement pr&#233;voit un report, pour la Corse et les d&#233;partements ou collectivit&#233;s d&#8217;outre-mer, de l&#8217;exon&#233;ration de hausse de la taxe sur les billets d&#8217;avion au profit de l&#8217;Agence de financement des infrastructures de transport de France (AFITF).</p><p style=\"text-align: justify;\">Ce sous-amendement vise &#224; r&#233;pondre au plus vite &#224; cette perte &#233;conomique pour les usagers ultra-marins et corse. Il vise ainsi &#224; garantir une application plus rapide du 3&#176;&#160;du A du pr&#233;sent article, en comparaison &#224; ce que propose l&#8217;amendement d&#233;pos&#233; par le Gouvernement.</p><p style=\"text-align: justify;\">Pour garantir d&#8217;un point de vue juridique le dispositif propos&#233; et &#233;carter tout risque pour les compagnies a&#233;riennes, le pr&#233;sent sous-amendement fixe l&#8217;entr&#233;e en vigueur de ces dispositions &#224; une date fix&#233;e par arr&#234;t&#233;, ne pouvant &#234;tre post&#233;rieure de plus d&#8217;un mois - au lieu de trois comme propos&#233; par le Gouvernement - &#224; la r&#233;ponse de la Commission europ&#233;enne permettant de consid&#233;rer ce dispositif comme conforme au droit de l&#8217;Union europ&#233;enne.</p><p style=\"text-align: justify;\">La perte &#224; pr&#233;voir pour les populations ultra-marines et corses, d&#233;j&#224; p&#233;nalis&#233;es par ce d&#233;lai impos&#233; &#224; cette mesure d&#8217;&#233;cocontribution, sera ainsi plus vite annul&#233;e avec le d&#233;lai pr&#233;vu par ce sous-amendement.</p>"
  },
  "representations": [
    {
      "nom": "PDF",
      "typeMime": {
        "type": "application",
        "subType": "PDF"
      },
      "statutRepresentation": {
        "verbatim": true,
        "canonique": true,
        "officielle": true,
        "transcription": false,
        "enregistrement": false
      },
      "contenu": {
        "documentURI": "/15/amendements/2272A/AN/3013.pdf"
      }
    }
  ],
  "seanceDiscussion": "RUANR5L15S2020IDS21866",
  "sort": {
    "dateSaisie": "2019-10-17T12:28:51.000+02:00",
    "sortEnSeance": "Adopté"
  },
  "dateDepot": "2019-10-16T02:00:00.000+02:00",
  "dateDistribution": "2019-10-17T02:00:00.000+02:00",
  "article99": "0",
  "loiReference": {}
}