{
  "uid": "AMANR5L15SEA717460B0911P0D1N1308",
  "identifiant": {
    "legislature": "15",
    "numero": "1308",
    "numRect": "0",
    "saisine": {
      "texteLegislatifRef": "PRJLANR5L15B0911",
      "numeroPartiePLF": "0",
      "organeExamen": "PO717460",
      "mentionSecondeDeliberation": "0"
    }
  },
  "numeroLong": "1308",
  "etapeTexte": "1ère lecture (1ère assemblée saisie)",
  "triAmendement": "abzzhyzi",
  "cardinaliteAmdtMultiples": "1",
  "etat": "Discuté",
  "signataires": {
    "auteur": {
      "typeAuteur": "Depute",
      "acteurRef": "PA721896",
      "groupePolitiqueRef": "PO730940"
    },
    "cosignatairesRefs": [
      "PA718926",
      "PA335612",
      "PA720546",
      "PA721270",
      "PA720692",
      "PA722110",
      "PA721118",
      "PA610667",
      "PA441",
      "PA610654",
      "PA718720",
      "PA722202",
      "PA267306",
      "PA689",
      "PA721012",
      "PA721896"
    ],
    "texteAffichable": "Mme&#160;Faucillon,  M.&#160;Chassaigne, M.&#160;Jumel, Mme&#160;Bello, Mme&#160;Buffet, M.&#160;Wulfranc, M.&#160;Brotherson, M.&#160;Peu, M.&#160;Serville, M.&#160;Fabien&#160;Roussel, M.&#160;Lecoq, M.&#160;Bruneel, M.&#160;Nilor, M.&#160;Dufr&#232;gne, M.&#160;Dharr&#233;ville et Mme&#160;K&#233;clard-Mond&#233;sir"
  },
  "pointeurFragmentTexte": {
    "division": {
      "titre": "Article PREMIER",
      "articleDesignationCourte": "AVANT ART. PREMIER",
      "type": "ARTICLE",
      "avantAApres": "Avant",
      "divisionRattachee": "AVANT L'ARTICLE PREMIER, insérer l'article suivant:",
      "articleAdditionnel": "1",
      "urlDivisionTexteVise": "/15/textes/0911.asp#D_Article_1er"
    }
  },
  "corps": {
    "dispositif": "<p style=\"text-align: justify;\">Le dix-septi&#232;me alin&#233;a de l'article 2 de la loi constitutionnelle n&#176;&#160;2005&#8209;205 du 1<sup>er</sup>&#160;mars 2005 relative &#224; la Charte de l&#8217;environnement est compl&#233;t&#233; par une phrase ainsi r&#233;dig&#233;e&#160;: &#171;&#160;Elles garantissent l&#8217;&#233;gal acc&#232;s de chacun aux biens communs de l&#8217;humanit&#233; indispensables &#224; la vie et &#224; la protection de la sant&#233;, dans des conditions &#233;conomiquement acceptables par toutes et tous.&#160;&#187;</p>",
    "exposeSommaire": "<p style=\"text-align: justify;\">Il s&#8217;agit par cet amendement de garantir le droit &#233;gal d&#8217;acc&#232;s aux bien communs (air sain, eau, alimentation&#8230;) &#224; l&#8217;ensemble des citoyens dans le bloc constitutionnel.</p>"
  },
  "representations": [
    {
      "nom": "PDF",
      "typeMime": {
        "type": "application",
        "subType": "PDF"
      },
      "statutRepresentation": {
        "verbatim": true,
        "canonique": true,
        "officielle": true,
        "transcription": false,
        "enregistrement": false
      },
      "contenu": {
        "documentURI": "/15/amendements/0911/AN/1308.pdf"
      }
    }
  ],
  "seanceDiscussion": "RUANR5L15S2018IDS21161",
  "sort": {
    "dateSaisie": "2018-07-12T00:17:31.000+02:00",
    "sortEnSeance": "Rejeté"
  },
  "dateDepot": "2018-07-05T02:00:00.000+02:00",
  "dateDistribution": "2018-07-07T02:00:00.000+02:00",
  "article99": "0",
  "loiReference": {
    "codeLoi": "loi constitutionnelle 2005-205",
    "divisionCodeLoi": "6"
  }
}