{
  "uid": "AMANR5L15SEA717460BTC0857P0D1N143",
  "identifiant": {
    "legislature": "15",
    "numero": "143",
    "numRect": "0",
    "saisine": {
      "texteLegislatifRef": "PRJLANR5L15BTC0857",
      "numeroPartiePLF": "0",
      "organeExamen": "PO717460",
      "mentionSecondeDeliberation": "0"
    }
  },
  "numeroLong": "143",
  "etapeTexte": "1ère lecture (1ère assemblée saisie)",
  "triAmendement": "yji",
  "cardinaliteAmdtMultiples": "1",
  "etat": "Discuté",
  "signataires": {
    "auteur": {
      "typeAuteur": "Depute",
      "acteurRef": "PA608292",
      "groupePolitiqueRef": "PO723569"
    },
    "cosignatairesRefs": [
      "PA608292",
      "PA336175",
      "PA605694"
    ],
    "texteAffichable": "Mme&#160;Dubi&#233;,  M.&#160;Falorni et Mme&#160;Pinel"
  },
  "pointeurFragmentTexte": {
    "division": {
      "titre": "Article 5",
      "articleDesignationCourte": "ART. 5",
      "type": "ARTICLE",
      "avantAApres": "A",
      "divisionRattachee": "ARTICLE 5",
      "urlDivisionTexteVise": "/15/textes/0857.asp#D_Article_5"
    },
    "alinea": {
      "numero": "16"
    }
  },
  "corps": {
    "dispositif": "<p style=\"text-align: justify;\">I.&#160;&#8211;&#160;&#192; l&#8217;alin&#233;a&#160;15, substituer aux mots&#160;:</p><p style=\"text-align: justify;\">&#171;&#160;deux alin&#233;as ainsi r&#233;dig&#233;s&#160;&#187;</p><p style=\"text-align: justify;\">les mots&#160;:</p><p style=\"text-align: justify;\">&#171;&#160;un alin&#233;a ainsi r&#233;dig&#233;&#160;&#187;.</p><p style=\"text-align: justify;\">II. - En cons&#233;quence, supprimer l'alin&#233;a 16. </p>",
    "exposeSommaire": "<p style=\"text-align: justify;\">Le projet de loi donne la possibilit&#233; &#224; l&#8217;OFPRA d&#8217;adresser au demandeur d&#8217;asile la convocation &#224; l&#8217;entretien individuel et de notifier ses d&#233;cisions &#233;crites &#171;&#160;par tout moyen&#160;&#187; ouvrant ainsi la possibilit&#233; d&#8217;un envoi par voie d&#233;mat&#233;rialis&#233;e.</p><p style=\"text-align: justify;\">Toutefois, au regard de la situation particuli&#232;re de vuln&#233;rabilit&#233; des demandeurs d&#8217;asile, il n&#8217;est pas possible d&#8217;apporter les garanties ad&#233;quates &#224; de telles notifications notamment en mati&#232;re de confidentialit&#233; et de droit d&#8217;acc&#232;s &#224; la proc&#233;dure.</p><p style=\"text-align: justify;\">Les demandeurs d&#8217;asile font partie des personnes confront&#233;es &#224; la fracture num&#233;rique. La plupart n&#8217;ont pas un acc&#232;s continu &#224; internet faute de ressources financi&#232;res suffisantes et tous les centres d&#8217;h&#233;bergement qui peuvent les accueillir ne sont pas &#233;quip&#233;s faute de moyens.</p><p style=\"text-align: justify;\">Cet amendement pr&#233;voit d&#232;s lors de supprimer la convocation et la notification par tout moyen tel que le recommande le D&#233;fenseur des droits.</p>"
  },
  "representations": [
    {
      "nom": "PDF",
      "typeMime": {
        "type": "application",
        "subType": "PDF"
      },
      "statutRepresentation": {
        "verbatim": true,
        "canonique": true,
        "officielle": true,
        "transcription": false,
        "enregistrement": false
      },
      "contenu": {
        "documentURI": "/15/amendements/0857/AN/143.pdf"
      }
    }
  ],
  "seanceDiscussion": "RUANR5L15S2018IDS21016",
  "sort": {
    "dateSaisie": "2018-04-19T22:39:06.000+02:00",
    "sortEnSeance": "Rejeté"
  },
  "dateDepot": "2018-04-11T02:00:00.000+02:00",
  "dateDistribution": "2018-04-13T02:00:00.000+02:00",
  "article99": "0",
  "loiReference": {}
}