{
  "uid": "AMANR5L15SEA717460B1255P2D1N841",
  "identifiant": {
    "legislature": "15",
    "numero": "841",
    "numRect": "0",
    "saisine": {
      "texteLegislatifRef": "PRJLANR5L15B1255",
      "numeroPartiePLF": "2",
      "organeExamen": "PO717460",
      "mentionSecondeDeliberation": "0"
    }
  },
  "numeroLong": "II-841",
  "etapeTexte": "1ère lecture (1ère assemblée saisie)",
  "triAmendement": "bbfaaaaaaaaaaaaaaaaaaaaaaaaaaaaaaaaaaaaaaaaaaaaaaaazzw",
  "cardinaliteAmdtMultiples": "1",
  "etat": "Discuté",
  "signataires": {
    "auteur": {
      "typeAuteur": "Depute",
      "acteurRef": "PA605069",
      "groupePolitiqueRef": "PO758835"
    },
    "cosignatairesRefs": [
      "PA719930",
      "PA610681",
      "PA333285",
      "PA720988",
      "PA609332",
      "PA335054",
      "PA607553",
      "PA340343",
      "PA608011",
      "PA1592",
      "PA333818",
      "PA642764",
      "PA337483",
      "PA342415",
      "PA608172",
      "PA609590",
      "PA340357",
      "PA608741",
      "PA335532",
      "PA1809",
      "PA1008",
      "PA267233",
      "PA508",
      "PA1198",
      "PA605069",
      "PA332614",
      "PA643145",
      "PA608695",
      "PA429893"
    ],
    "texteAffichable": "M.&#160;Jean-Louis&#160;Bricout,  Mme&#160;Pires Beaune, Mme&#160;Rabault, Mme&#160;Battistel, M.&#160;Letchimy, M.&#160;Potier, Mme&#160;Tolmont, M.&#160;Aviragnet, Mme&#160;Bareigts, Mme&#160;Bi&#233;mouret, M.&#160;Bouillon, M.&#160;Carvounas, M.&#160;Alain&#160;David, Mme&#160;Laurence&#160;Dumont, M.&#160;Faure, M.&#160;Garot, M.&#160;David&#160;Habib, M.&#160;Hutin, M.&#160;Juanico, Mme&#160;Karamanli, M.&#160;J&#233;r&#244;me&#160;Lambert, Mme&#160;Manin, Mme&#160;Pau-Langevin, M.&#160;Pueyo, M.&#160;Saulignac, Mme&#160;Untermaier, Mme&#160;Vainqueur-Christophe, M.&#160;Vallaud et Mme&#160;Victory"
  },
  "pointeurFragmentTexte": {
    "missionVisee": {
      "idMissionAN": "396",
      "libelleMission": "Cohésion des territoires",
      "codeMissionPLF": "B",
      "libelleMissionPLF": "Répartition, par mission et programme, des crédits du budget général"
    },
    "division": {
      "titre": "ÉTAT B",
      "articleDesignationCourte": "ART. 39",
      "type": "ANNEXE",
      "avantAApres": "A",
      "divisionRattachee": "ARTICLE 39",
      "urlDivisionTexteVise": "/15/textes/1255C.asp#D_ETAT_B"
    }
  },
  "corps": {
    "exposeSommaire": "<p style=\"text-align: justify;\">Cet amendement vise &#224; maintenir une contribution de l&#8217;&#201;tat au financement du Fonds national des aides &#224; la pierre (FNAP) &#224; un niveau &#233;gal &#224; celui de 2018, c&#8217;est-&#224;-dire 38,8 millions d&#8217;euros.</p><p style=\"text-align: justify;\">La suppression de toute contribution de l&#8217;&#201;tat au FNAP serait un mauvais signal alors m&#234;me que les objectifs de construction fix&#233;s au bailleurs sociaux (40 000 PLAI) demeurent &#233;lev&#233;s pour r&#233;pondre &#224; une demande en hausse. Dans un contexte de rationalisation du secteur HLM, l&#8217;&#201;tat doit continuer &#224; soutenir et orienter l&#8217;effort de construction de logements locatifs sociaux.</p><p style=\"text-align: justify;\">Il est donc propos&#233; d&#8217;augmenter les cr&#233;dits de l&#8217;action n&#176;01 du programme 135 de 38,8 millions d&#8217;euros. Afin d&#8217;assurer la recevabilit&#233; financi&#232;re de cet amendement au titre de l&#8217;article&#160;40 de la Constitution, les cr&#233;dits de l&#8217;action n&#176;2 du programme 112 sont diminu&#233;s d&#8217;autant. Si cet amendement avait vocation &#224; &#234;tre adopt&#233;, il serait cependant souhaitable que le Gouvernement l&#232;ve ce gage pour ne pas p&#233;naliser le programme 112.</p>",
    "dispositifAmdtCredit": {
      "listeProgrammes": [
        {
          "libelle": "Hébergement, parcours vers le logement et insertion des personnes vulnérables",
          "id": "39661",
          "AE": {
            "montantPositif": "0",
            "montantNegatif": "0"
          },
          "CP": {
            "montantPositif": "0",
            "montantNegatif": "0"
          },
          "action": "modification"
        },
        {
          "libelle": "Aide à l'accès au logement",
          "id": "39662",
          "AE": {
            "montantPositif": "0",
            "montantNegatif": "0"
          },
          "CP": {
            "montantPositif": "0",
            "montantNegatif": "0"
          },
          "action": "modification"
        },
        {
          "libelle": "Urbanisme, territoires et amélioration de l'habitat",
          "id": "39663",
          "AE": {
            "montantPositif": "38800000",
            "montantNegatif": "0"
          },
          "CP": {
            "montantPositif": "38800000",
            "montantNegatif": "0"
          },
          "action": "modification"
        },
        {
          "libelle": "Impulsion et coordination de la politique d'aménagement du territoire",
          "id": "39664",
          "AE": {
            "montantPositif": "0",
            "montantNegatif": "38800000"
          },
          "CP": {
            "montantPositif": "0",
            "montantNegatif": "38800000"
          },
          "action": "modification"
        },
        {
          "libelle": "Interventions territoriales de l'État",
          "id": "39665",
          "AE": {
            "montantPositif": "0",
            "montantNegatif": "0"
          },
          "CP": {
            "montantPositif": "0",
            "montantNegatif": "0"
          },
          "action": "modification"
        },
        {
          "libelle": "Politique de la ville",
          "id": "39666",
          "AE": {
            "montantPositif": "0",
            "montantNegatif": "0"
          },
          "CP": {
            "montantPositif": "0",
            "montantNegatif": "0"
          },
          "action": "modification"
        }
      ],
      "totalAE": {
        "montantPositif": "38800000",
        "montantNegatif": "38800000",
        "solde": "0"
      },
      "totalCP": {
        "montantPositif": "38800000",
        "montantNegatif": "38800000",
        "solde": "0"
      }
    }
  },
  "representations": [
    {
      "nom": "PDF",
      "typeMime": {
        "type": "application",
        "subType": "PDF"
      },
      "statutRepresentation": {
        "verbatim": true,
        "canonique": true,
        "officielle": true,
        "transcription": false,
        "enregistrement": false
      },
      "contenu": {
        "documentURI": "/15/amendements/1255C/AN/841.pdf"
      }
    }
  ],
  "seanceDiscussion": "RUANR5L15S2019IDS21335",
  "sort": {
    "dateSaisie": "2018-11-09T20:00:02.000+01:00",
    "sortEnSeance": "Rejeté"
  },
  "dateDepot": "2018-10-31T01:00:00.000+01:00",
  "dateDistribution": "2018-11-07T01:00:00.000+01:00",
  "article99": "0",
  "loiReference": {}
}