{
  "uid": "AMANR5L15PO419610B0846P0D1N92",
  "identifiant": {
    "legislature": "15",
    "numero": "92",
    "numRect": "0",
    "saisine": {
      "texteLegislatifRef": "PRJLANR5L15B0846",
      "numeroPartiePLF": "0",
      "organeExamen": "PO419610",
      "mentionSecondeDeliberation": "0"
    }
  },
  "numeroLong": "CE92",
  "etapeTexte": "1ère lecture (1ère assemblée saisie)",
  "triAmendement": "xq",
  "cardinaliteAmdtMultiples": "1",
  "etat": "Discuté",
  "signataires": {
    "auteur": {
      "typeAuteur": "Depute",
      "acteurRef": "PA712015",
      "groupePolitiqueRef": "PO730934"
    },
    "cosignatairesRefs": [
      "PA266776",
      "PA720210",
      "PA719272",
      "PA2377",
      "PA1327",
      "PA608416",
      "PA267450",
      "PA712015",
      "PA346054",
      "PA266808",
      "PA721046",
      "PA608016",
      "PA709315",
      "PA721968"
    ],
    "texteAffichable": "M.&#160;Dive,  M.&#160;Viala, M.&#160;Rolland, Mme&#160;Bassire, M.&#160;Vialay, M.&#160;R&#233;mi&#160;Delatte, M.&#160;Perrut, M.&#160;Hetzel, M.&#160;Reiss, Mme&#160;Meunier, Mme&#160;Louwagie, M.&#160;Forissier, Mme&#160;Beauvais et M.&#160;Emmanuel&#160;Maquet"
  },
  "pointeurFragmentTexte": {
    "division": {
      "titre": "Article 54",
      "articleDesignationCourte": "ART. 54",
      "type": "ARTICLE",
      "avantAApres": "A",
      "divisionRattachee": "ARTICLE 54",
      "urlDivisionTexteVise": "/15/textes/0846.asp#D_Article_54"
    },
    "alinea": {
      "avantAApres": "A",
      "numero": "7",
      "alineaDesignation": "Alinéa 7"
    }
  },
  "corps": {
    "dispositif": "<p style=\"text-align: justify;\">Apr&#232;s le mot&#160;: </p><p style=\"text-align: justify;\">&#171;&#160;ville&#160;&#187;,</p><p style=\"text-align: justify;\">r&#233;diger ainsi la fin de l&#8217;alin&#233;a&#160;7&#160;:</p><p style=\"text-align: justify;\">&#171;&#160;du territoire comptant le plus grand nombre d&#8217;habitants&#160;&#187;.</p>",
    "exposeSommaire": "<p style=\"text-align: justify;\">Amendement de pr&#233;cision. Le terme de &#171;&#160;ville principale du territoire&#160;&#187; est en effet assez vague et peut &#234;tre sujet &#224; interpr&#233;tation, une d&#233;finition plus claire et plus objective s&#8217;impose pour cet alin&#233;a. Ainsi, l&#8217;on retiendra que lors de la signature d&#8217;une convention de revitalisation entre l&#8217;&#201;tat et les collectivit&#233;s locales, la principale commune d&#8217;un territoire donn&#233; est celle qui compte le plus d&#8217;habitants.</p>"
  },
  "representations": [
    {
      "nom": "PDF",
      "typeMime": {
        "type": "application",
        "subType": "PDF"
      },
      "statutRepresentation": {
        "verbatim": true,
        "canonique": true,
        "officielle": true,
        "transcription": false,
        "enregistrement": false
      },
      "contenu": {
        "documentURI": "/15/amendements/0846/CION-ECO/CE92.pdf"
      }
    }
  ],
  "sort": {
    "dateSaisie": "2018-05-18T19:41:54.000+02:00",
    "sortEnSeance": "Non soutenu"
  },
  "dateDepot": "2018-04-23T02:00:00.000+02:00",
  "dateDistribution": "2018-05-15T02:00:00.000+02:00",
  "article99": "0",
  "loiReference": {}
}