{
  "uid": "AMANR5L15SEA717460B0384P0D1N424",
  "identifiant": {
    "legislature": "15",
    "numero": "424",
    "numRect": "0",
    "saisine": {
      "texteLegislatifRef": "PRJLANR5L15B0384",
      "numeroPartiePLF": "0",
      "organeExamen": "PO717460",
      "mentionSecondeDeliberation": "0"
    }
  },
  "numeroLong": "424",
  "etapeTexte": "1ère lecture (1ère assemblée saisie)",
  "triAmendement": "aer",
  "cardinaliteAmdtMultiples": "1",
  "etat": "Discuté",
  "signataires": {
    "auteur": {
      "typeAuteur": "Depute",
      "acteurRef": "PA608172",
      "groupePolitiqueRef": "PO730946"
    },
    "cosignatairesRefs": [
      "PA1592",
      "PA609332",
      "PA429893",
      "PA340343",
      "PA608172",
      "PA1198",
      "PA608011",
      "PA337483",
      "PA588886",
      "PA609590",
      "PA332614",
      "PA608695",
      "PA342415",
      "PA508",
      "PA642764",
      "PA607553",
      "PA1008",
      "PA1809",
      "PA333285",
      "PA333818",
      "PA267233",
      "PA335054",
      "PA610681",
      "PA719930",
      "PA720988",
      "PA605069",
      "PA335999",
      "PA643145",
      "PA335532"
    ],
    "texteAffichable": "Mme&#160;Pires Beaune,  Mme&#160;Rabault, M.&#160;Jean-Louis&#160;Bricout, M.&#160;Faure, M.&#160;Aviragnet, Mme&#160;Bareigts, Mme&#160;Batho, Mme&#160;Battistel, Mme&#160;Bi&#233;mouret, M.&#160;Bouillon, M.&#160;Carvounas, M.&#160;Alain&#160;David, Mme&#160;Laurence&#160;Dumont, M.&#160;Garot, M.&#160;David&#160;Habib, M.&#160;Hutin, M.&#160;Juanico, Mme&#160;Karamanli, M.&#160;J&#233;r&#244;me&#160;Lambert, M.&#160;Le Foll, M.&#160;Letchimy, Mme&#160;Manin, Mme&#160;Pau-Langevin, M.&#160;Potier, M.&#160;Pueyo, M.&#160;Saulignac, Mme&#160;Untermaier, Mme&#160;Vainqueur-Christophe et M.&#160;Vallaud"
  },
  "pointeurFragmentTexte": {
    "division": {
      "titre": "Article 23",
      "articleDesignationCourte": "APRÈS ART. 23",
      "type": "ARTICLE",
      "avantAApres": "Apres",
      "divisionRattachee": "APRÈS L'ARTICLE 23, insérer l'article suivant:",
      "articleAdditionnel": "1",
      "urlDivisionTexteVise": "/15/textes/0384.asp#D_Article_23"
    }
  },
  "corps": {
    "dispositif": "<p style=\"text-align: justify;\">Le deuxi&#232;me alin&#233;a du I de l&#8217;article&#160;1530 <i>bis</i> du code g&#233;n&#233;ral des imp&#244;ts est compl&#233;t&#233; par une phrase ainsi r&#233;dig&#233;e&#160;: &#171;&#160;Par exception, les d&#233;lib&#233;rations pr&#233;vues par les &#233;tablissements publics de coop&#233;ration intercommunale &#224; fiscalit&#233; propre pour l&#8217;institution et la perception de la taxe au titre de l&#8217;exercice 2018 peuvent &#234;tre prises ou modifi&#233;es jusqu&#8217;au 15 f&#233;vrier 2018.&#160;&#187;</p>",
    "exposeSommaire": "<p style=\"text-align: justify;\">Les d&#233;lib&#233;rations relatives &#224; la fiscalit&#233; directe locale des EPCI &#224; fiscalit&#233; propre doivent &#234;tre adopt&#233;es, sauf cas particuliers, avant le 1<sup>er</sup> octobre d&#8217;une ann&#233;e pour &#234;tre applicables au 1er&#160;janvier de l&#8217;ann&#233;e suivante.</p><p style=\"text-align: justify;\">La taxe GEMAPI est concern&#233;e par ce d&#233;lai, ce qui n&#8217;a pas de sens au regard du transfert obligatoire de cette comp&#233;tence d&#232;s le 1er janvier 2018, beaucoup de territoires ayant anticip&#233; l&#8217;institution de la taxe avant ce transfert.</p><p style=\"text-align: justify;\">En effet, s&#8217;agissant de l&#8217;institution de cette taxe pour 2018, les services l&#8217;&#201;tat consid&#232;rent que les EPCI ne peuvent pas d&#233;lib&#233;rer avant le 1er&#160;octobre 2017 afin d&#8217;&#234;tre en mesure de la lever d&#232;s le 1er&#160;janvier 2018&#160;; une telle d&#233;lib&#233;ration serait susceptible de faire l&#8217;objet d&#8217;un recours pour vice de comp&#233;tence.</p><p style=\"text-align: justify;\">C&#8217;est pourquoi, le pr&#233;sent amendement propose de pr&#233;voir un d&#233;lai suppl&#233;mentaire au d&#233;but de l&#8217;ann&#233;e 2018 afin de permettre aux EPCI &#224; fiscalit&#233; propre, qui seront comp&#233;tents de plein droit au 1er&#160;janvier 2018, de lever cette taxe d&#232;s 2018 soit le 15 f&#233;vrier 2018 (ou le 31 janvier 2018).</p>"
  },
  "representations": [
    {
      "nom": "PDF",
      "typeMime": {
        "type": "application",
        "subType": "PDF"
      },
      "statutRepresentation": {
        "verbatim": true,
        "canonique": true,
        "officielle": true,
        "transcription": false,
        "enregistrement": false
      },
      "contenu": {
        "documentURI": "/15/amendements/0384/AN/424.pdf"
      }
    }
  ],
  "seanceDiscussion": "RUANR5L15S2018IDS20823",
  "sort": {
    "dateSaisie": "2017-12-08T10:23:38.000+01:00",
    "sortEnSeance": "Retiré"
  },
  "dateDepot": "2017-11-30T01:00:00.000+01:00",
  "dateDistribution": "2017-12-04T01:00:00.000+01:00",
  "article99": "0",
  "loiReference": {
    "codeLoi": "CGI",
    "divisionCodeLoi": "1530 bis"
  }
}