{
  "uid": "AMANR5L15SEA717460BTC1924P0D1N708",
  "identifiant": {
    "legislature": "15",
    "numero": "708",
    "numRect": "0",
    "saisine": {
      "texteLegislatifRef": "PRJLANR5L15BTC1924",
      "numeroPartiePLF": "0",
      "organeExamen": "PO717460",
      "mentionSecondeDeliberation": "0"
    }
  },
  "numeroLong": "708",
  "etapeTexte": "1ère lecture (1ère assemblée saisie)",
  "triAmendement": "efaaaaaaaaaaaaaaaaaaaaaaaaaaaaaaaaaaaaaaaaaaaaaaaaafwzzzzzi",
  "cardinaliteAmdtMultiples": "1",
  "etat": "Discuté",
  "signataires": {
    "auteur": {
      "typeAuteur": "Depute",
      "acteurRef": "PA720430",
      "groupePolitiqueRef": "PO730958"
    },
    "cosignatairesRefs": [
      "PA719676",
      "PA720430",
      "PA720846",
      "PA2150",
      "PA720422",
      "PA722142",
      "PA719578",
      "PA721960",
      "PA721210",
      "PA588884",
      "PA720286",
      "PA721062",
      "PA720892",
      "PA721202",
      "PA718860",
      "PA718868",
      "PA721226"
    ],
    "texteAffichable": "M.&#160;Bernalicis,  Mme&#160;Autain, M.&#160;Coquerel, M.&#160;Corbi&#232;re, Mme&#160;Fiat, M.&#160;Lachaud, M.&#160;Larive, M.&#160;M&#233;lenchon, Mme&#160;Obono, Mme&#160;Panot, M.&#160;Prud&apos;homme, M.&#160;Quatennens, M.&#160;Ratenon, Mme&#160;Ressiguier, Mme&#160;Rubin, M.&#160;Ruffin et Mme&#160;Taurine"
  },
  "pointeurFragmentTexte": {
    "division": {
      "titre": "Article 16 bis",
      "articleDesignationCourte": "APRÈS ART. 16 BIS",
      "type": "ARTICLE",
      "avantAApres": "Apres",
      "divisionRattachee": "APRÈS L'ARTICLE 16 BIS, insérer l'article suivant:",
      "articleAdditionnel": "1",
      "urlDivisionTexteVise": "/15/textes/1924.asp#D_Article_16_bis"
    }
  },
  "corps": {
    "dispositif": "<p>&#171;&#160;I.&#160;&#8211;&#160;Les personnes ayant exerc&#233; l&#8217;activit&#233; de repr&#233;sentant d&#8217;int&#233;r&#234;ts telle que d&#233;finie au neuvi&#232;me alin&#233;a de l&#8217;article&#160;18&#8209;2 de la loi n&#176;&#160;2013&#8209;907 du 11 octobre 2013 relative &#224; la transparence de la vie publique ne sauraient &#234;tre admises au conseil d&#8217;administration ou au conseil scientifique des organismes suivants, dans les cinq ans pr&#233;c&#233;dents cette nomination&#160;:</p><p style=\"text-align: justify;\">&#171;&#160;&#8211; l&#8217;Agence fran&#231;aise de lutte contre le dopage&#160;;</p><p style=\"text-align: justify;\">&#171;&#160;&#8211; l&#8217;Autorit&#233; de la concurrence&#160;;</p><p style=\"text-align: justify;\">&#171;&#160;&#8211; l&#8217;Autorit&#233; de contr&#244;le des nuisances a&#233;roportuaires&#160;;</p><p style=\"text-align: justify;\">&#171;&#160;&#8211; l&#8217;Autorit&#233; de contr&#244;le prudentiel et de r&#233;solution&#160;;</p><p style=\"text-align: justify;\">&#171;&#160;&#8211; l&#8217;Autorit&#233; de r&#233;gulation de la distribution de la presse&#160;;</p><p style=\"text-align: justify;\">&#171;&#160;&#8211; l&#8217;Autorit&#233; des march&#233;s financiers&#160;;</p><p style=\"text-align: justify;\">&#171;&#160;&#8211; l&#8217;Autorit&#233; de r&#233;gulation des activit&#233;s ferroviaires et routi&#232;res&#160;;</p><p style=\"text-align: justify;\">&#171;&#160;&#8211; l&#8217;Autorit&#233; de r&#233;gulation des communications &#233;lectroniques et des postes&#160;;</p><p style=\"text-align: justify;\">&#171;&#160;&#8211; l&#8217;Autorit&#233; de r&#233;gulation des jeux en ligne&#160;;</p><p style=\"text-align: justify;\">&#171;&#160;&#8211; l&#8217;Autorit&#233; de s&#251;ret&#233; nucl&#233;aire&#160;;</p><p style=\"text-align: justify;\">&#171;&#160;&#8211; le Comit&#233; consultatif national d&#8217;&#233;thique pour les sciences de la vie et de la sant&#233;&#160;;</p><p style=\"text-align: justify;\">&#171;&#160;&#8211; la Commission nationale d&#8217;am&#233;nagement cin&#233;matographique&#160;;</p><p style=\"text-align: justify;\">&#171;&#160;&#8211; la Commission nationale d&#8217;am&#233;nagement commercial&#160;;</p><p style=\"text-align: justify;\">&#171;&#160;&#8211; la Commission nationale des comptes de campagne et des financements politiques&#160;;</p><p style=\"text-align: justify;\">&#171;&#160;&#8211; la Commission nationale consultative des droits de l&#8217;homme&#160;;</p><p style=\"text-align: justify;\">&#171;&#160;&#8211; la Commission nationale de contr&#244;le des techniques de renseignement&#160;;</p><p style=\"text-align: justify;\">&#171;&#160;&#8211; la Commission nationale du d&#233;bat public&#160;;</p><p style=\"text-align: justify;\">&#171;&#160;&#8211; la Commission nationale de l&#8217;informatique et des libert&#233;s&#160;;</p><p style=\"text-align: justify;\">&#171;&#160;&#8211; la Commission du secret de la d&#233;fense nationale&#160;;</p><p style=\"text-align: justify;\">&#171;&#160;&#8211; le Comit&#233; d&#8217;indemnisation des victimes des essais nucl&#233;aires&#160;;</p><p style=\"text-align: justify;\">&#171;&#160;&#8211; la Commission d&#8217;acc&#232;s aux documents administratifs&#160;;</p><p style=\"text-align: justify;\">&#171;&#160;&#8211; la Commission des participations et des transferts&#160;;</p><p style=\"text-align: justify;\">&#171;&#160;&#8211; la Commission de r&#233;gulation de l&#8217;&#233;nergie&#160;;</p><p style=\"text-align: justify;\">&#171;&#160;&#8211; le Conseil sup&#233;rieur de l&#8217;audiovisuel&#160;;</p><p style=\"text-align: justify;\">&#171;&#160;&#8211; le Contr&#244;leur g&#233;n&#233;ral des lieux de privation de libert&#233;&#160;;</p><p style=\"text-align: justify;\">&#171;&#160;&#8211; le D&#233;fenseur des droits&#160;;</p><p style=\"text-align: justify;\">&#171;&#160;&#8211; la Haute Autorit&#233; pour la diffusion des &#339;uvres et la protection des droits sur internet&#160;;</p><p style=\"text-align: justify;\">&#171;&#160;&#8211; la Haute Autorit&#233; de sant&#233;&#160;;</p><p style=\"text-align: justify;\">&#171;&#160;&#8211; la Haute Autorit&#233; pour la transparence de la vie publique&#160;;</p><p style=\"text-align: justify;\">&#171;&#160;&#8211; le Haut Conseil du commissariat aux comptes&#160;;</p><p style=\"text-align: justify;\">&#171;&#160;&#8211; le Haut Conseil de l&#8217;&#233;valuation de la recherche et de l&#8217;enseignement sup&#233;rieur&#160;;</p><p style=\"text-align: justify;\">&#171;&#160;&#8211; le M&#233;diateur national de l&#8217;&#233;nergie&#160;;</p><p style=\"text-align: justify;\">&#171;&#160;&#8211; le Conseil national de l&#8217;Alimentation.</p><p style=\"text-align: justify;\">&#171;&#160;II.&#160;&#8211;&#160;La fonction de membre du conseil d&#8217;administration d&#8217;&#233;tablissements publics ou de groupements d&#8217;int&#233;r&#234;t public est incompatible avec l&#8217;exercice de toute fonction dans un conseil d&#8217;administration de soci&#233;t&#233; commerciale.</p><p style=\"line-height: 1.2; text-align: justify;\">&#171;&#160;III.&#160;&#8211;&#160;L&#8217;article L.&#160;225&#8209;21 du code de commerce est ainsi modifi&#233;&#160;:</p><p style=\"text-align: justify;\">&#171;&#160;1&#176;&#160;Au premier alin&#233;a, le nombre&#160;: &#171;&#160;cinq&#160;&#187; est remplac&#233; par le nombre&#160;: &#171;&#160;deux&#160;&#187;&#160;;</p><p style=\"text-align: justify;\">&#171;&#160;2&#176;&#160;Le premier alin&#233;a est compl&#233;t&#233; par les mots et une phrase ainsi r&#233;dig&#233;e&#160;: &#171;&#160;ou un au maximum dans des soci&#233;t&#233;s dont les titres sont admis aux n&#233;gociations sur un march&#233; r&#233;glement&#233;. Une personne physique ne peut exercer deux mandats cons&#233;cutifs d&#8217;administrateur de soci&#233;t&#233;s anonymes ayant leur si&#232;ge sur le territoire fran&#231;ais.&#160;&#187;&#160;;</p><p style=\"text-align: justify;\">&#171;&#160;3&#176;&#160;Les deuxi&#232;me et avant-dernier alin&#233;as sont remplac&#233;s par un alin&#233;a ainsi r&#233;dig&#233;&#160;:</p><p style=\"line-height: 1.2; text-align: justify;\">&#171;&#160;&#171;&#160;Pour l&#8217;application des dispositions du pr&#233;sent article, les mandats d&#8217;administrateur ou de membre de conseil de surveillance de soci&#233;t&#233;s, contr&#244;l&#233;es au sens de l&#8217;article L.&#160;233&#8209;16 par une m&#234;me soci&#233;t&#233; ne comptent que pour un seul mandat, sous r&#233;serve que le nombre de mandats d&#233;tenus &#224; ce titre n&#8217;exc&#232;de pas cinq.&#160;&#187;&#160;&#187;</p><p style=\"text-align: justify;\">&#171;&#160;IV.&#160;&#8211;&#160;Le premier alin&#233;a de l&#8217;article&#160;11 de la loi n&#176;&#160;83&#8209;675 du 26 juillet 1983 relative &#224; la d&#233;mocratisation du secteur public est compl&#233;t&#233; par une phrase ainsi r&#233;dig&#233;e&#160;: &#171;&#160;Ils ne peuvent exercer plus de deux mandats cons&#233;cutifs.&#160;&#187;&#160;&#187;</p>",
    "exposeSommaire": "<p style=\"line-height: 1.2;\">Par cet amendement nous proposons de lutter contre le cumul de responsabilit&#233;s et les conflits d&#8217;int&#233;r&#234;ts au sein des conseils d&#8217;administrations.</p><p style=\"text-align: justify;\">En effet, cet amendement&#160;:</p><p style=\"line-height: 1.2; text-align: justify;\">- (I 1&#176;) retire aux repr&#233;sentants d&#8217;int&#233;r&#234;ts des grandes entreprises le droit de si&#233;ger imm&#233;diatement dans des instances de r&#233;gulation publiques qui r&#233;gulent des domaines particuli&#232;rement importants, en instaurant un d&#233;lai de carence de cinq ans et (I 2&#176;) vise &#224; mettre fin &#224; des pratiques de pantouflage qui permettent &#224; des personnes ayant occup&#233; des fonctions publiques de pouvoir b&#233;n&#233;ficier du carnet d&#8217;adresse alors acquis et l&#8217;utiliser dans le priv&#233; pour leur int&#233;r&#234;t personnel&#160;;</p><p style=\"text-align: justify;\">- (II) interdit le cumul de plus de deux mandats dans les conseils d&#8217;administration de soci&#233;t&#233;s commerciales - ou un seul si la soci&#233;t&#233; est pr&#233;sente sur un march&#233; r&#233;glement&#233; - et seuls deux mandats successifs d&#8217;administrateurs deviennent l&#233;gaux, dans les &#233;tablissements publics industriels et commerciaux ainsi que le secteur priv&#233;.</p>"
  },
  "representations": [
    {
      "nom": "PDF",
      "typeMime": {
        "type": "application",
        "subType": "PDF"
      },
      "statutRepresentation": {
        "verbatim": true,
        "canonique": true,
        "officielle": true,
        "transcription": false,
        "enregistrement": false
      },
      "contenu": {
        "documentURI": "/15/amendements/1924/AN/708.pdf"
      }
    }
  ],
  "sort": {
    "dateSaisie": "2019-05-17T19:22:21.000+02:00",
    "sortEnSeance": "Rejeté"
  },
  "dateDepot": "2019-05-09T02:00:00.000+02:00",
  "dateDistribution": "2019-05-13T02:00:00.000+02:00",
  "article99": "0",
  "loiReference": {}
}