{
  "uid": "AMANR5L15PO419865B1831P0D1N855",
  "identifiant": {
    "legislature": "15",
    "numero": "855",
    "numRect": "0",
    "saisine": {
      "texteLegislatifRef": "PRJLANR5L15B1831",
      "numeroPartiePLF": "0",
      "organeExamen": "PO419865",
      "mentionSecondeDeliberation": "0"
    }
  },
  "numeroLong": "CD855",
  "etapeTexte": "1ère lecture (2ème assemblée saisie)",
  "triAmendement": "gsaaaaaaaaaaaaaaaaaaaaaaaaaaaaaaaaaaaaaaaaaaaaaaaaekknzi",
  "cardinaliteAmdtMultiples": "1",
  "etat": "Irrecevable",
  "signataires": {
    "auteur": {
      "typeAuteur": "Depute",
      "acteurRef": "PA718838",
      "groupePolitiqueRef": "PO730934"
    },
    "cosignatairesRefs": [
      "PA721474",
      "PA608016",
      "PA1029",
      "PA721410",
      "PA2492",
      "PA721678",
      "PA330909",
      "PA266776",
      "PA267527",
      "PA718838"
    ],
    "texteAffichable": "M.&#160;Brun,  Mme&#160;Bonnivard, M.&#160;Deflesselles, M.&#160;Descoeur, Mme&#160;Louwagie, M.&#160;Quentin, M.&#160;Reda, M.&#160;Reiss, M.&#160;Saddier et M.&#160;Viry"
  },
  "pointeurFragmentTexte": {
    "division": {
      "titre": "Article 27",
      "articleDesignationCourte": "APRÈS ART. 27",
      "type": "ARTICLE",
      "avantAApres": "Apres",
      "divisionRattachee": "APRÈS L'ARTICLE 27, insérer l'article suivant:",
      "articleAdditionnel": "1",
      "urlDivisionTexteVise": "/15/textes/1831.asp#D_Article_27"
    }
  },
  "corps": {},
  "representations": [
    {
      "nom": "PDF",
      "typeMime": {
        "type": "application",
        "subType": "PDF"
      },
      "statutRepresentation": {
        "verbatim": true,
        "canonique": true,
        "officielle": true,
        "transcription": false,
        "enregistrement": false
      },
      "contenu": {
        "documentURI": "/15/amendements/1831/CION-DVP/CD855.pdf"
      }
    }
  ],
  "dateDepot": "2019-05-07T02:00:00.000+02:00",
  "dateDistribution": "2019-05-09T02:00:00.000+02:00",
  "article99": "0",
  "loiReference": {
    "codeLoi": "transports",
    "divisionCodeLoi": "L3114-2-2"
  }
}