{
  "uid": "AMANR5L15SEA717460B2296P0D1N208",
  "identifiant": {
    "legislature": "15",
    "numero": "208",
    "numRect": "0",
    "saisine": {
      "texteLegislatifRef": "PRJLANR5L15B2296",
      "numeroPartiePLF": "0",
      "organeExamen": "PO717460",
      "mentionSecondeDeliberation": "1"
    }
  },
  "numeroLong": "208",
  "etapeTexte": "1ère lecture (1ère assemblée saisie)",
  "triAmendement": "eaiaaaaaaaaaaaaaaaaaaaaaaaaaaaaaaaaaaaaaaaaaaaaaaakkabzwnz",
  "cardinaliteAmdtMultiples": "1",
  "etat": "Discuté",
  "signataires": {
    "auteur": {
      "typeAuteur": "Depute",
      "acteurRef": "PA719318",
      "groupePolitiqueRef": "PO730934"
    },
    "cosignatairesRefs": [
      "PA346218",
      "PA332523",
      "PA606712",
      "PA605036",
      "PA713448",
      "PA718780",
      "PA643134",
      "PA721286",
      "PA340853",
      "PA267204",
      "PA767",
      "PA719318",
      "PA722390",
      "PA721070",
      "PA608016"
    ],
    "texteAffichable": "Mme&#160;Anthoine,  M.&#160;Leclerc, Mme&#160;Corneloup, M.&#160;Masson, Mme&#160;Brenier, M.&#160;Lurton, M.&#160;Ramadier, M.&#160;Sermier, Mme&#160;Louwagie, M.&#160;Cattin, Mme&#160;Ramassamy, M.&#160;Abad, Mme&#160;Dalloz, Mme&#160;Valentin et Mme&#160;Trastour-Isnart"
  },
  "pointeurFragmentTexte": {
    "division": {
      "titre": "Article 28",
      "articleDesignationCourte": "ART. 28",
      "type": "ARTICLE",
      "avantAApres": "A",
      "divisionRattachee": "ARTICLE 28",
      "urlDivisionTexteVise": "/15/textes/2296.asp#D_Article_28"
    },
    "alinea": {
      "avantAApres": "Apres",
      "numero": "48"
    }
  },
  "corps": {
    "dispositif": "<p>Apr&#232;s l&#8217;alin&#233;a&#160;48, ins&#233;rer l&#8217;alin&#233;a suivant&#160;:</p><p style=\"text-align: justify;\">&#171;&#160;3&#176;&#160;S&#8217;assurer que le libre choix de l&#8217;usager est respect&#233;, garantir que son choix entre un dispositif m&#233;dical neuf et un dispositif m&#233;dical faisant l&#8217;objet d&#8217;une remise en &#233;tat ne lui est pas impos&#233;, conform&#233;ment &#224; l&#8217;article&#160;11 de la loi n&#176;&#160;2005&#8209;102 du 11 f&#233;vrier 2005 pour l&#8217;&#233;galit&#233; des droits et des chances, la participation et la citoyennet&#233; des personnes handicap&#233;es&#160;&#187;</p>",
    "exposeSommaire": "<p>Nous constatons que le respect du libre choix des personnes, qui pourtant fait l&#8217;objet de nombreux textes l&#233;gislatifs et r&#233;glementaires, est dans son application souvent remis en question, notamment lors des instructions des demandes de prestations de compensation par les MDPH. Cet amendement a pour objet d&#8217;assurer &#224; la personne qu&#8217;il ne lui sera pas impos&#233; le choix d&#8217;un dispositif m&#233;dical faisant l&#8217;objet d&#8217;une remise en &#233;tat alors que ce n&#8217;est pas son choix.</p>"
  },
  "representations": [
    {
      "nom": "PDF",
      "typeMime": {
        "type": "application",
        "subType": "PDF"
      },
      "statutRepresentation": {
        "verbatim": true,
        "canonique": true,
        "officielle": true,
        "transcription": false,
        "enregistrement": false
      },
      "contenu": {
        "documentURI": "/15/amendements/2296/AN/208.pdf"
      }
    }
  ],
  "seanceDiscussion": "RUANR5L15S2020IDS21879",
  "sort": {
    "dateSaisie": "2019-10-24T22:44:47.000+02:00",
    "sortEnSeance": "Tombé"
  },
  "dateDepot": "2019-10-16T02:00:00.000+02:00",
  "dateDistribution": "2019-10-23T02:00:00.000+02:00",
  "article99": "0",
  "loiReference": {}
}