{
  "uid": "AMANR5L15SEA717460BTC1924P0D1N572",
  "identifiant": {
    "legislature": "15",
    "numero": "572",
    "numRect": "0",
    "saisine": {
      "texteLegislatifRef": "PRJLANR5L15BTC1924",
      "numeroPartiePLF": "0",
      "organeExamen": "PO717460",
      "mentionSecondeDeliberation": "0"
    }
  },
  "numeroLong": "572",
  "etapeTexte": "1ère lecture (1ère assemblée saisie)",
  "triAmendement": "dfaaaaaaaaaaaaaaaaaaaaaaaaaaaaaaaaaaaaaaaaaaaaaaaaooo",
  "cardinaliteAmdtMultiples": "1",
  "etat": "Discuté",
  "signataires": {
    "auteur": {
      "typeAuteur": "Depute",
      "acteurRef": "PA335054",
      "groupePolitiqueRef": "PO758835"
    },
    "cosignatairesRefs": [
      "PA643145",
      "PA642764",
      "PA608741",
      "PA609332",
      "PA608011",
      "PA332614",
      "PA607553",
      "PA335532",
      "PA267233",
      "PA1198",
      "PA333285",
      "PA609590",
      "PA340343",
      "PA608172",
      "PA605069",
      "PA340357",
      "PA608695",
      "PA337483",
      "PA342415",
      "PA610681",
      "PA1008",
      "PA1809",
      "PA720988",
      "PA508",
      "PA1592",
      "PA719930",
      "PA335054",
      "PA429893",
      "PA333818"
    ],
    "texteAffichable": "Mme&#160;Karamanli,  M.&#160;Vallaud, Mme&#160;Untermaier, Mme&#160;Pau-Langevin, M.&#160;Saulignac, Mme&#160;Pires Beaune, Mme&#160;Rabault, M.&#160;Aviragnet, Mme&#160;Bareigts, Mme&#160;Battistel, Mme&#160;Bi&#233;mouret, M.&#160;Bouillon, M.&#160;Jean-Louis&#160;Bricout, M.&#160;Carvounas, M.&#160;Alain&#160;David, Mme&#160;Laurence&#160;Dumont, M.&#160;Faure, M.&#160;Garot, M.&#160;David&#160;Habib, M.&#160;Hutin, M.&#160;Juanico, M.&#160;J&#233;r&#244;me&#160;Lambert, M.&#160;Letchimy, Mme&#160;Manin, M.&#160;Potier, M.&#160;Pueyo, Mme&#160;Tolmont, Mme&#160;Vainqueur-Christophe et Mme&#160;Victory"
  },
  "pointeurFragmentTexte": {
    "division": {
      "titre": "Article 14",
      "articleDesignationCourte": "ART. 14",
      "type": "ARTICLE",
      "avantAApres": "A",
      "divisionRattachee": "ARTICLE 14",
      "urlDivisionTexteVise": "/15/textes/1924.asp#D_Article_14"
    },
    "alinea": {
      "numero": "26"
    }
  },
  "corps": {
    "dispositif": "<p style=\"text-align: justify;\">Supprimer l&#8217;alin&#233;a&#160;26.</p>",
    "exposeSommaire": "<p style=\"text-align: justify;\">Cet amendement de repli du groupe Socialistes et apparent&#233;s vise &#224; r&#233;tablir la consultation des commissions administratives paritaires (CAP) au sein de la fonction publique territoriale en mati&#232;re&#160;d&#8217;avancement &#224; &#233;chelon sp&#233;cial.</p><p style=\"text-align: justify;\">Cette consultation permet de renforcer l&#8217;acceptabilit&#233; des d&#233;cisions prises en la mati&#232;re par l&#8217;administration aupr&#232;s des agents, notamment parce qu&#8217;elle est source de transparence.&#160;</p>"
  },
  "representations": [
    {
      "nom": "PDF",
      "typeMime": {
        "type": "application",
        "subType": "PDF"
      },
      "statutRepresentation": {
        "verbatim": true,
        "canonique": true,
        "officielle": true,
        "transcription": false,
        "enregistrement": false
      },
      "contenu": {
        "documentURI": "/15/amendements/1924/AN/572.pdf"
      }
    }
  ],
  "sort": {
    "dateSaisie": "2019-05-17T11:41:25.000+02:00",
    "sortEnSeance": "Rejeté"
  },
  "dateDepot": "2019-05-09T02:00:00.000+02:00",
  "dateDistribution": "2019-05-13T02:00:00.000+02:00",
  "article99": "0",
  "loiReference": {}
}