{
  "uid": "AMANR5L15SEA717460B1255P2D1N2331",
  "identifiant": {
    "legislature": "15",
    "numero": "2331",
    "numRect": "0",
    "saisine": {
      "texteLegislatifRef": "PRJLANR5L15B1255",
      "numeroPartiePLF": "2",
      "organeExamen": "PO717460",
      "mentionSecondeDeliberation": "0"
    }
  },
  "numeroLong": "II-2331",
  "etapeTexte": "1ère lecture (1ère assemblée saisie)",
  "triAmendement": "euaaaaaaaaaaaaaaaaaaaaaaaaaaaaaaaaaaaaaaaaaaaaaaaabw",
  "cardinaliteAmdtMultiples": "1",
  "etat": "Discuté",
  "signataires": {
    "auteur": {
      "typeAuteur": "Depute",
      "acteurRef": "PA719930",
      "groupePolitiqueRef": "PO758835"
    },
    "cosignatairesRefs": [
      "PA342415",
      "PA605069",
      "PA1198",
      "PA332614",
      "PA608172",
      "PA610681",
      "PA719930",
      "PA267233",
      "PA642764",
      "PA429893",
      "PA335532",
      "PA607553",
      "PA609332",
      "PA335054",
      "PA340343",
      "PA333285",
      "PA1008",
      "PA333818",
      "PA340357",
      "PA337483",
      "PA508",
      "PA608741"
    ],
    "texteAffichable": "M.&#160;Vallaud,  M.&#160;Potier, Mme&#160;Pires Beaune, Mme&#160;Bareigts, M.&#160;Faure, M.&#160;Aviragnet, M.&#160;Saulignac, Mme&#160;Pau-Langevin, Mme&#160;Tolmont, M.&#160;Hutin, M.&#160;Bouillon, Mme&#160;Victory, Mme&#160;Laurence&#160;Dumont, M.&#160;Alain&#160;David, M.&#160;Juanico, Mme&#160;Bi&#233;mouret, Mme&#160;Battistel, M.&#160;Garot, M.&#160;Jean-Louis&#160;Bricout, Mme&#160;Karamanli, M.&#160;Carvounas et M.&#160;Letchimy"
  },
  "pointeurFragmentTexte": {
    "division": {
      "titre": "Article 55",
      "articleDesignationCourte": "APRÈS ART. 55",
      "type": "ARTICLE",
      "avantAApres": "Apres",
      "divisionRattachee": "APRÈS L'ARTICLE 55, insérer l'article suivant:",
      "articleAdditionnel": "1",
      "urlDivisionTexteVise": "/15/textes/1255C.asp#D_Article_55"
    }
  },
  "corps": {
    "dispositif": "<p style=\"text-align: justify;\">I.&#160;&#8211;&#160;Le code g&#233;n&#233;ral des imp&#244;ts est ainsi modifi&#233;&#160;:</p><p style=\"text-align: justify;\">1&#176; Le I de l&#8217;article&#160;164 B est compl&#233;t&#233; par un <i>h </i>ainsi r&#233;dig&#233;&#160;:</p><p style=\"text-align: justify;\"><i>&#171;&#160;h.</i> Dans les conditions d&#233;finies par l&#8217;article&#160;209 C, les b&#233;n&#233;fices r&#233;alis&#233;s &#224; raison de la livraison ou de la fourniture de biens ou de services en France au sens des articles 258, 259, 259 A, 259 B, 259 C et 259 D.&#160;&#187;</p><p style=\"text-align: justify;\">2&#176; Le premier alin&#233;a du I de l&#8217;article&#160;209 est remplac&#233; par trois alin&#233;as ainsi r&#233;dig&#233;s&#160;:</p><p style=\"text-align: justify;\">&#171;&#160;Sous r&#233;serve des dispositions de la pr&#233;sente section, les b&#233;n&#233;fices passibles de l&#8217;imp&#244;t sur les soci&#233;t&#233;s sont d&#233;termin&#233;s d&#8217;apr&#232;s les r&#232;gles fix&#233;es par les articles 34 &#224; 45, 53 A &#224; 57, 108 &#224; 117, 237 <i>ter</i> A et 302 <i>septies</i> A <i>bis</i>&#160;:</p><p style=\"text-align: justify;\">&#171;&#160;a) pour les personnes autres que celles mentionn&#233;es &#224; l&#8217;article&#160;209 C, en tenant compte uniquement des b&#233;n&#233;fices r&#233;alis&#233;s dans les entreprises exploit&#233;es en France, de ceux mentionn&#233;s aux a, e, e <i>bis</i> et e <i>ter</i> du I de l&#8217;article&#160;164 B ainsi que de ceux dont l&#8217;imposition est attribu&#233;e &#224; la France par une convention internationale relative aux doubles impositions,</p><p style=\"text-align: justify;\">&#171;&#160;b) pour les personnes mentionn&#233;es &#224; l&#8217;article&#160;209 C, en tenant compte uniquement, dans les conditions pr&#233;vues par cet article, des b&#233;n&#233;fices r&#233;alis&#233;s &#224; raison de la livraison ou de la fourniture de biens ou de services en France mentionn&#233;s au h du I de l&#8217;article&#160;164 B ou, pour les exercices ouverts jusqu&#8217;au 31 d&#233;cembre 2028, des b&#233;n&#233;fices mentionn&#233;s au a du I du pr&#233;sent article s&#8217;ils sont sup&#233;rieurs.&#160;&#187;</p><p style=\"text-align: justify;\">3&#176; Apr&#232;s l&#8217;article&#160;209 B, il est ins&#233;r&#233; un article&#160;209 C ainsi r&#233;dig&#233;&#160;:</p><p style=\"text-align: justify;\">&#171;&#160;<i>Art.&#160;209 C.&#160;&#8211;&#160;</i>I.&#160;&#8211;&#160;Pour les personnes appartenant &#224; un groupe au sens du II du pr&#233;sent article qui, au cours de l&#8217;exercice ou des douze derniers mois, livre des biens ou fournit des prestations en France au sens des articles 258, 259, 259 A, 259 B, 259 C et 259 D dont la valeur exc&#232;de 150 millions d&#8217;euros, les b&#233;n&#233;fices passibles de l&#8217;imp&#244;t sur les soci&#233;t&#233;s sont d&#233;termin&#233;s en retenant, dans les conditions d&#233;finies au IV du pr&#233;sent article, l&#8217;ensemble des r&#233;sultats de leurs exploitations directes ou indirectes, qu&#8217;elles soient situ&#233;es en France ou &#224; l&#8217;&#233;tranger, du groupe auquel elles appartiennent.</p><p style=\"text-align: justify;\">&#171;&#160;Les dispositions du premier alin&#233;a du pr&#233;sent I sont &#233;galement applicables &#224; toute entit&#233; juridique n&#8217;appartenant pas &#224; un groupe qui, au cours de l&#8217;exercice ou des douze derniers mois, livre des biens ou fournit des prestations en France au sens des articles 258, 259, 259 A, 259 B, 259 C et 259 D dont la valeur exc&#232;de 150 millions d&#8217;euros.</p><p style=\"text-align: justify;\">&#171;&#160;II.&#160;&#8211;&#160;Le groupe au sens du I du pr&#233;sent article comprend les entit&#233;s juridiques, personnes morales, organismes, fiducies ou institutions comparables, &#233;tablies ou constitu&#233;es en France ou hors de France plac&#233;s sous le contr&#244;le exclusif ou conjoint d&#8217;une m&#234;me personne au sens de l&#8217;article L.&#160;233&#8209;16 du code de commerce.</p><p style=\"text-align: justify;\">&#171;&#160;III.&#160;&#8211;&#160;Une soci&#233;t&#233; membre du groupe mentionn&#233; au II est constitu&#233;e, &#224; son initiative ou, &#224; d&#233;faut, par d&#233;signation de l&#8217;administration, seule redevable de l&#8217;imp&#244;t sur les soci&#233;t&#233;s d&#251; par elle-m&#234;me et les autres entit&#233;s juridiques membres du m&#234;me groupe.</p><p style=\"text-align: justify;\">&#171;&#160;Le r&#233;sultat d&#8217;ensemble est d&#233;termin&#233; par cette soci&#233;t&#233; en faisant la somme alg&#233;brique des r&#233;sultats de chacune des entit&#233;s du groupe dans les conditions pr&#233;vues aux articles 223 A &#224; 223 K.</p><p style=\"text-align: justify;\">&#171;&#160;IV. La part du r&#233;sultat d&#8217;ensemble du groupe mentionn&#233; au II correspondant aux b&#233;n&#233;fices r&#233;alis&#233;s par ses membres &#224; raison de la livraison ou de la fourniture de biens ou de services en France au sens du h du 1 de l&#8217;article&#160;164 est r&#233;put&#233;e &#233;gale &#224; la part des ventes et prestations du groupe en France dans le total des ventes et prestations r&#233;alis&#233;s par le groupe en France et hors de France.</p><p style=\"text-align: justify;\">&#171;&#160;Pour calculer la part des ventes et prestations r&#233;alis&#233;s en France dans le total des ventes et prestations r&#233;alis&#233;s en France et hors de France, il n&#8217;est pas tenu compte des ventes et prestations r&#233;alis&#233;s entre entit&#233;s appartenant au groupe. Il n&#8217;est pas non plus tenu compte des ventes et prestations r&#233;alis&#233;s &#224; des entit&#233;s domicili&#233;es ou &#233;tablies dans un &#201;tat &#233;tranger ou un territoire situ&#233; hors de France et qui y sont soumises &#224; un r&#233;gime fiscal privil&#233;gi&#233; au sens de l&#8217;article&#160;238 A.</p><p style=\"text-align: justify;\">&#171;&#160;Pour les entit&#233;s mentionn&#233;es au dernier alin&#233;a du I du pr&#233;sent article et n&#8217;appartenant pas &#224; un groupe, la part des b&#233;n&#233;fices r&#233;put&#233;e r&#233;alis&#233;e &#224; raison de la livraison ou de la fourniture de biens ou de services en France au sens du h du 1 de l&#8217;article&#160;164 est &#233;gale &#224; la part des ventes et prestations de l&#8217;entit&#233; en France dans le total des ventes et prestations r&#233;alis&#233;s par l&#8217;entit&#233; en France et hors de France.&#160;&#187;</p><p style=\"text-align: justify;\">II.&#160;&#8211;&#160;Le I entre en vigueur le 1<sup>er</sup> janvier 2020.</p><p style=\"text-align: justify;\">III.&#160;&#8211;&#160;La perte de recettes pour l&#8217;&#201;tat est compens&#233;e &#224; due concurrence par la cr&#233;ation d&#8217;une taxe additionnelle aux droits mentionn&#233;s aux articles 575 et 575 A du code g&#233;n&#233;ral des imp&#244;ts.</p>",
    "exposeSommaire": "<p style=\"text-align: justify;\">Cet amendement de repli port&#233; par des d&#233;put&#233;s socialistes et apparent&#233;s vise &#224; changer la d&#233;finition de la base imposable en France. Chaque soci&#233;t&#233; domicili&#233;e &#224; l&#8217;&#233;tranger vendant des biens ou des services en France pour un montant exc&#233;dent 150 millions d&#8217;euros (ce montant pouvant ult&#233;rieurement &#233;voluer) deviendrait sujette &#224; l&#8217;imp&#244;t sur les soci&#233;t&#233;s, qu&#8217;elle poss&#232;de un &#233;tablissement stable en France ou non. Les b&#233;n&#233;fices imposables seraient calcul&#233;s en multipliant les b&#233;n&#233;fices mondiaux consolid&#233;s du groupe par la fraction de ses ventes mondiales faites en France.</p><p style=\"text-align: justify;\">Chaque ann&#233;e, 40&#160;% des b&#233;n&#233;fices des multinationales sont transf&#233;r&#233;s artificiellement vers des paradis fiscaux et ainsi, 600 milliards de dollars de base taxable &#233;chappent aux &#201;tats.</p><p style=\"text-align: justify;\">En 2016, les entreprises am&#233;ricaines ont enregistr&#233; plus de profits en Irlande qu&#8217;en Chine, au Japon, au Mexique, en Allemagne et en France r&#233;unis. Et sur ces profits faramineux, elles se sont acquitt&#233;es du taux d&#233;risoire de 5,7&#160;%.</p><p style=\"text-align: justify;\">L&#8217;Union&#160;Europ&#233;enne, pour sa part, perd chaque ann&#233;e, par le jeu des d&#233;localisations artificielles de profits vers les paradis fiscaux, l&#8217;&#233;quivalent de 20&#160;% du montant de l&#8217;imp&#244;t sur les soci&#233;t&#233;s collect&#233;. Pour la France seule, cette optimisation fiscale agressive correspond &#224; une perte de plus de 5 milliards d&#8217;euros par an.</p><p style=\"text-align: justify;\">Quant aux pays en d&#233;veloppement, ils se trouvent priv&#233;s de ressources majeures au regard de l&#8217;aide publique au d&#233;veloppement qu&#8217;ils re&#231;oivent. Selon certaines ONG, ils perdent en ressources fiscales jusqu&#8217;&#224; 10 fois ce qu&#8217;ils re&#231;oivent en aide publique.</p><p style=\"text-align: justify;\">La course au moins-disant fiscal d&#233;sarme les &#201;tats et &#233;rode chaque jour un peu plus leur souverainet&#233;. Elle affecte tout, la loyaut&#233; de l&#8217;&#233;conomie, le pouvoir d&#8217;achat des m&#233;nages sur lesquels est report&#233;e la fiscalit&#233;, les services publics qui manquent de moyens, l&#8217;environnement qui n&#8217;est jamais la priorit&#233;. Cette faiblesse des &#201;tats les prive des moyens n&#233;cessaires &#224; la lutte contre les in&#233;galit&#233;s via des investissements dans l&#8217;&#233;ducation, dans les syst&#232;mes de sant&#233;, dans la pr&#233;servation de l&#8217;environnement. Un cercle vicieux se met en place, l&#8217;optimisation fiscale agressive alimente jusqu&#8217;&#224; l&#8217;insoutenable les in&#233;galit&#233;s et compromet l&#8217;avenir. Elle nourrit toutes les frustrations, tous les ressentiments, toutes les contestations de la d&#233;mocratie lib&#233;rale.</p><p style=\"text-align: justify;\">Pourtant, nous pouvons agir.</p><p style=\"text-align: justify;\">Nombreux et document&#233;s sont d&#233;sormais les travaux de chercheurs proposant de r&#233;former les dispositifs l&#233;gaux afin de ramener les multinationales dans le droit commun de l&#8217;imp&#244;t sur les soci&#233;t&#233;s, en r&#233;cup&#233;rant la base taxable qui &#233;chappent aux &#201;tats du fait de pratiques d&#8217;optimisation fiscale agressive. Ils sugg&#232;rent en g&#233;n&#233;rale, pour plus d&#8217;efficacit&#233;, une forte coop&#233;ration entre &#201;tats pour y parvenir. C&#8217;est ainsi que l&#8217;Union&#160;europ&#233;enne en a fait un chantier prioritaire, mais sans r&#233;sultat pour le moment, le projet de r&#233;forme de l&#8217;imposition des soci&#233;t&#233;s (ACCIS) con&#231;u par la Commission&#160;europ&#233;enne reste bloqu&#233; par le Conseil&#160;europ&#233;en depuis 2011.</p><p style=\"text-align: justify;\">Si la coop&#233;ration&#160;europ&#233;enne et internationale demeure un objectif premier, il est possible d&#8217;agir sans attendre que l&#8217;ensemble de la communaut&#233; internationale se d&#233;cide. C&#8217;est le sens du pr&#233;sent amendement, &#233;crit en collaboration avec l&#8217;&#233;conomiste Gabriel Zucman.</p><p style=\"text-align: justify;\">Comme il l&#8217;est dit plus haut, le dispositif propos&#233; vise &#224; changer la d&#233;finition de la base imposable en France. Chaque soci&#233;t&#233; domicili&#233;e &#224; l&#8217;&#233;tranger vendant des biens ou des services en France pour un montant exc&#233;dent 150 millions d&#8217;euros (ce montant pouvant ult&#233;rieurement &#233;voluer) deviendrait sujette &#224; l&#8217;imp&#244;t sur les soci&#233;t&#233;s, qu&#8217;elle poss&#232;de un &#233;tablissement stable en France ou non. Les b&#233;n&#233;fices imposables seraient calcul&#233;s en multipliant les b&#233;n&#233;fices mondiaux consolid&#233;s du groupe par la fraction de ses ventes mondiales faites en France.</p><p style=\"text-align: justify;\">Ce faisant, ce dispositif vise &#224; donner corps &#224; un principe simple&#160;: les multinationales doivent payer leurs imp&#244;ts l&#224; o&#249; elles font leur chiffre d&#8217;affaires. Cet amendement propose de modifier le mode de calcul de l&#8217;assiette de l&#8217;Imp&#244;t sur les Soci&#233;t&#233;s, sans en changer le taux. L&#8217;adoption de cet amendement modifierait le Code g&#233;n&#233;ral des imp&#244;ts de mani&#232;re &#224; ce que les multinationales payent en France leur imp&#244;t sur les soci&#233;t&#233;s au prorata du pourcentage de leurs ventes mondiales r&#233;alis&#233;es dans le Pays.</p><p style=\"text-align: justify;\">Si, par exemple, une multinationale fait 10 milliards d&#8217;Euros de b&#233;n&#233;fices consolid&#233;s dans le monde, et qu&#8217;elle r&#233;alise 10&#160;% de son chiffre d&#8217;affaires en France, alors le calcul de son imp&#244;t sur les soci&#233;t&#233;s se fera sur la base de 10&#160;% de ces 10 milliards, soit 1 milliard d&#8217;Euros. Quand bien m&#234;me ces b&#233;n&#233;fices auraient &#233;t&#233; artificiellement transf&#233;r&#233;s comptablement vers des pays &#224; fiscalit&#233; nulle ou tr&#232;s faible.</p><p style=\"text-align: justify;\">Pour aller au bout de la logique de cet amendement et lutter r&#233;ellement contre l&#8217;&#233;vasion fiscale, il est pr&#233;vu une clause anti-abus. L&#8217;administration fiscale se r&#233;serve le droit d&#8217;ignorer les ventes faites &#224; des territoires &#224; fiscalit&#233; nulle ou faible dans le calcul de la proportion des ventes mondiales faites en France. Cette mesure permet d&#8217;&#233;viter que les soci&#233;t&#233;s d&#233;clarent une fraction disproportionn&#233;e de leurs ventes &#224; des clients hors-groupe implant&#233;s dans des paradis fiscaux.</p><p style=\"text-align: justify;\">Cette r&#233;forme n&#233;cessite de ren&#233;gocier les conventions fiscales internationales, en particulier afin d&#8217;&#233;viter la double imposition. Un principe g&#233;n&#233;ral peut &#234;tre le suivant&#160;:</p><ul style=\"text-align: justify;\"><li>Les groupes dont le si&#232;ge social est en France sont imposables en France sur leurs profits mondiaux (quelle que soit la fraction de leurs ventes faites en France), avec cr&#233;dit d&#8217;imp&#244;t pour annuler tous les imp&#244;ts sur les soci&#233;t&#233;s pay&#233;s &#224; des &#201;tats &#233;trangers.</li><li>Les groupes dont le si&#232;ge social est &#224; l&#8217;&#233;tranger sont imposables en France sur leurs b&#233;n&#233;fices mondiaux ventil&#233;s au prorata des ventes faites en France. Les pays o&#249; les si&#232;ges sociaux sont domicili&#233;s accordent des cr&#233;dits d&#8217;imp&#244;t pour effacer l&#8217;imp&#244;t pay&#233; en France.</li></ul><p style=\"text-align: justify;\">Dans une p&#233;riode interm&#233;diaire permettant la conduite des n&#233;gociations, jusqu&#8217;&#224; fin 2028, les b&#233;n&#233;fices r&#233;alis&#233;s en France calcul&#233;s en l&#8217;&#233;tat du droit resteraient pleinement impos&#233;s en France s&#8217;ils sont sup&#233;rieurs &#224; ceux r&#233;sultant de l&#8217;application des nouvelles r&#232;gles propos&#233;es. Pendant cette p&#233;riode, les nouvelles r&#232;gles propos&#233;es permettraient, en droit interne, de taxer les b&#233;n&#233;fices suppl&#233;mentaires actuellement taxables &#224; l&#8217;&#233;tranger au fur et &#224; mesure de la ren&#233;gociation des conventions fiscales concern&#233;es. Il s&#8217;agit par cette mesure transitoire d&#8217;&#233;viter la double non-imposition le temps que les autres pays (et les conventions fiscales) s&#8217;adaptent.</p><p style=\"text-align: justify;\">Avec cet amendement la France peut engager un travail pionnier de r&#233;&#233;quilibrage des rapports de force entre &#201;tats et multinationales. C&#8217;est un chemin n&#233;cessaire qui n&#8217;&#233;puise pas le monumental chantier de la lutte contre l&#8217;optimisation fiscale et la loyaut&#233; de l&#8217;imp&#244;t mais s&#8217;y engage r&#233;solument.</p><p style=\"text-align: justify;\">Il formule des choix que le travail futur pourra faire &#233;voluer.</p><p style=\"text-align: justify;\">S&#8217;agissant de la clef de r&#233;partition du chiffre d&#8217;affaires, la r&#233;forme ici propos&#233;e ne s&#8217;appliquant qu&#8217;en France seule, il a &#233;t&#233; fait le choix de ne pas retenir l&#8217;hypoth&#232;se d&#8217;y inclure la masse salariale et le capital pour &#233;viter le risque d&#8217;une incitation &#224; la d&#233;localisation des multinationales vers des pays &#224; fiscalit&#233; faible. Le choix retenu a d&#8217;abord &#233;t&#233; guid&#233; par la d&#233;fense des int&#233;r&#234;ts fran&#231;ais et de son tissu industriel, et donc &#224; ne retenir qu&#8217;une formule fond&#233;e sur les ventes uniquement.</p><p style=\"text-align: justify;\">Ce choix laisse les autres pays libres de choisir un syst&#232;me prenant en compte les trois facteurs dans la mesure o&#249; il n&#8217;est pas n&#233;cessaire que tous les pays appliquent la m&#234;me formule pour que l&#8217;imposition fonctionne (les &#201;tats am&#233;ricains appliquent des formules diff&#233;rentes).</p><p style=\"text-align: justify;\">La recherche d&#8217;un imp&#244;t mondialement juste pose la question des pays en voie de d&#233;veloppement, pays de production ne disposant pas d&#8217;un march&#233; int&#233;rieur susceptible d&#8217;offrir une base taxable significative. La r&#233;forme engag&#233;e par le pr&#233;sent amendement a vocation &#224; r&#233;cup&#233;rer la base taxable des multinationales &#233;chappant &#224; l&#8217;ensemble des &#201;tats du monde, elle aura un effet collat&#233;rale positif pour les pays en voie de d&#233;veloppement qui sont d&#8217;ores et d&#233;j&#224; les premi&#232;res victimes de l&#8217;optimisation fiscale que leur imposent les multinationales. La poursuite des travaux engag&#233;s au plan mondial ( comme le projet&#160;europ&#233;en ACCIS, bloqu&#233; depuis 2011, envisage la prise en compte, en plus du chiffre d&#8217;affaire, de la r&#233;partition des actifs et de la masse salariale), comme la ren&#233;gociation des conventions fiscales dans le cas de la France devront &#234;tre l&#8217;occasion de traiter de l&#8217;&#233;quit&#233; fiscale entre pays de production et pays de consommation, en envisageant par exemple les voies et moyens d&#8217;une d&#233;duction d&#8217;autres imp&#244;ts et taxes (imp&#244;ts de production, droits d&#8217;exploitation...) de la base de l&#8217;imp&#244;t sur les soci&#233;t&#233;s.</p><p style=\"text-align: justify;\">S&#8217;agissant des groupes int&#233;gr&#233;s, la ventilation par les ventes change la localisation de leur assiette taxable au profit des pays o&#249; r&#233;sident les clients des soci&#233;t&#233;s de l&#8217;aval. C&#8217;est n&#233;anmoins un gros progr&#232;s par rapport au syst&#232;me actuel dans lequel on laisse de facto &#224; ces groupes le choix du pays o&#249; elles souhaitent d&#233;clarer leurs profits via l&#8217;utilisation des prix de transfert (en pratique, elles choisissent le plus souvent l&#8217;Irlande ou les Bermudes). L&#8217;amendement avantage donc &#224; nouveau la France.</p><p style=\"text-align: justify;\">S&#8217;agissant de la d&#233;termination de la localisation du chiffre d&#8217;affaires dans le num&#233;rique, il faut partir des relev&#233;s de TVA (les publicit&#233;s vendues par Google &#224; des clients fran&#231;ais sont soumises &#224; la TVA en France), et inclure un nombre d&#8217;utilisateurs dans le calcul du CA par pays. Cette r&#233;forme peut aussi servir &#224; am&#233;liorer les normes comptables qui s&#8217;appliquent aux entreprises du num&#233;rique et la transparence dans ce secteur.</p><p style=\"text-align: justify;\">S&#8217;agissant des groupes &#233;trangers avec si&#232;ges hors de France, il faudra conditionner l&#8217;acc&#232;s au march&#233; fran&#231;ais au fait de fournir au fisc une ventilation pays par pays de leurs ventes mondiales, ainsi que le montant des profits mondiaux consolid&#233;s. L&#8217;information fournie sur le montant des ventes faites en France pourra &#234;tre v&#233;rifi&#233;e en utilisant les relev&#233;s de TVA. Les questions de double imposition vont &#234;tre instrumentalis&#233;es par certains lobbys mais en pratique sont d&#8217;une importance secondaire par rapport &#224; la double non-imposition actuelle. Un bon exemple&#160;: les multinationales am&#233;ricaines aimaient se plaindre du fait que le cr&#233;dit d&#8217;imp&#244;t accord&#233; par le fisc am&#233;ricain n&#8217;effa&#231;ait pas 100&#160;% des imp&#244;ts &#233;trangers mais en pratique il effa&#231;ait largement plus de 90&#160;%...</p><p style=\"text-align: justify;\">Cet amendement s&#8217;inscrit dans un combat de long terme, qui doit prioritairement conduire &#224; ce que les &#201;tats retrouvent leurs bases fiscales, condition et expression de leur souverainet&#233;. Ce ne sont pas aux multinationales de faire jouer la concurrence entre les &#201;tats, mais le cas &#233;ch&#233;ant, aux &#201;tats de d&#233;finir des r&#232;gles qui s&#8217;imposent aux acteurs &#233;conomiques et d&#233;velopper si n&#233;cessaire des coop&#233;rations et des politiques d&#8217;aide au d&#233;veloppement entre eux.</p><p style=\"text-align: justify;\">L&#8217;amendement propose une entr&#233;e en vigueur de la r&#233;forme au 1<sup>er</sup> janvier 2020, laissant au gouvernement le temps de sa mise en &#339;uvre dans les meilleures conditions.</p><p style=\"text-align: justify;\">La d&#233;marche de cet amendement est explicit&#233;e dans une tribune cosign&#233;e par Boris Vallaud et Gabriel Zucman, publi&#233;e dans Le Monde, accessible sur le lien suivant&#160;:</p><p style=\"text-align: justify;\">https&#160;://www.lemonde.fr/idees/article/2018/11/12/evasion-fiscale-la-france-peut-prendre-l-initiative-d-un-nouvel-impot-fonde-sur-l-activite-reelle-des-multinationales_5382161_3232.html</p>"
  },
  "representations": [
    {
      "nom": "PDF",
      "typeMime": {
        "type": "application",
        "subType": "PDF"
      },
      "statutRepresentation": {
        "verbatim": true,
        "canonique": true,
        "officielle": true,
        "transcription": false,
        "enregistrement": false
      },
      "contenu": {
        "documentURI": "/15/amendements/1255C/AN/2331.pdf"
      }
    }
  ],
  "seanceDiscussion": "RUANR5L15S2019IDS21342",
  "sort": {
    "dateSaisie": "2018-11-15T20:06:03.000+01:00",
    "sortEnSeance": "Rejeté"
  },
  "dateDepot": "2018-11-12T01:00:00.000+01:00",
  "dateDistribution": "2018-11-14T01:00:00.000+01:00",
  "article99": "0",
  "loiReference": {
    "codeLoi": "CGI",
    "divisionCodeLoi": "164 B"
  }
}