{
  "uid": "AMANR5L15PO420120B2296P0D1N706",
  "identifiant": {
    "legislature": "15",
    "numero": "706",
    "numRect": "0",
    "saisine": {
      "texteLegislatifRef": "PRJLANR5L15B2296",
      "numeroPartiePLF": "0",
      "organeExamen": "PO420120",
      "mentionSecondeDeliberation": "0"
    }
  },
  "numeroLong": "AS706",
  "etapeTexte": "1ère lecture (1ère assemblée saisie)",
  "triAmendement": "ddaaaaaaaaaaaaaaaaaaaaaaaaaaaaaaaaaaaaaaaaaaaaaaaalg",
  "cardinaliteAmdtMultiples": "1",
  "etat": "Irrecevable",
  "signataires": {
    "auteur": {
      "typeAuteur": "Depute",
      "acteurRef": "PA267318",
      "groupePolitiqueRef": "PO730934"
    },
    "cosignatairesRefs": [
      "PA267289",
      "PA2377",
      "PA721678",
      "PA606098",
      "PA719318",
      "PA267318",
      "PA336316",
      "PA718884",
      "PA721286",
      "PA722390",
      "PA267378"
    ],
    "texteAffichable": "M.&#160;Grelier,  M.&#160;Ramadier, Mme&#160;Anthoine, Mme&#160;Bazin-Malgras, Mme&#160;Levy, M.&#160;Reda, M.&#160;Perrut, Mme&#160;Corneloup, M.&#160;Marleix, M.&#160;Bouchet et M.&#160;Door"
  },
  "pointeurFragmentTexte": {
    "division": {
      "titre": "Article 24",
      "articleDesignationCourte": "ART. 24",
      "type": "ARTICLE",
      "avantAApres": "A",
      "divisionRattachee": "ARTICLE 24",
      "urlDivisionTexteVise": "/15/textes/2296.asp#D_Article_24"
    },
    "alinea": {
      "avantAApres": "Apres",
      "numero": "3"
    }
  },
  "corps": {},
  "representations": [
    {
      "nom": "PDF",
      "typeMime": {
        "type": "application",
        "subType": "PDF"
      },
      "statutRepresentation": {
        "verbatim": true,
        "canonique": true,
        "officielle": true,
        "transcription": false,
        "enregistrement": false
      },
      "contenu": {
        "documentURI": "/15/amendements/2296/CION-SOC/AS706.pdf"
      }
    }
  ],
  "dateDepot": "2019-10-11T02:00:00.000+02:00",
  "dateDistribution": "2019-10-12T02:00:00.000+02:00",
  "article99": "0",
  "loiReference": {}
}