{
  "uid": "AMANR5L15SEA717460BTC1237P0D1N1147",
  "identifiant": {
    "legislature": "15",
    "numero": "1147",
    "numRect": "0",
    "saisine": {
      "texteLegislatifRef": "PRJLANR5L15BTC1237",
      "numeroPartiePLF": "0",
      "organeExamen": "PO717460",
      "mentionSecondeDeliberation": "0"
    }
  },
  "numeroLong": "1147",
  "etapeTexte": "1ère lecture (1ère assemblée saisie)",
  "triAmendement": "idaaaaaaaaaaaaaaaaaaaaaaaaaaaaaaaaaaaaaaaaaaaaaaaaf",
  "cardinaliteAmdtMultiples": "1",
  "etat": "Discuté",
  "signataires": {
    "auteur": {
      "typeAuteur": "Depute",
      "acteurRef": "PA2792",
      "groupePolitiqueRef": "PO730934"
    },
    "cosignatairesRefs": [
      "PA2792"
    ],
    "texteAffichable": "M.&#160;Taugourdeau"
  },
  "pointeurFragmentTexte": {
    "division": {
      "titre": "Article 43 quinquies",
      "articleDesignationCourte": "APRÈS ART. 43 QUINQUIES",
      "type": "ARTICLE",
      "avantAApres": "Apres",
      "divisionRattachee": "APRÈS L'ARTICLE 43 QUINQUIES, insérer l'article suivant:",
      "articleAdditionnel": "1",
      "urlDivisionTexteVise": "/15/textes/1237.asp#D_Article_43_quinquies"
    }
  },
  "corps": {
    "dispositif": "<p style=\"text-align: justify;\">L&#8217;article L.&#160;5311&#8209;1 du code du travail est compl&#233;t&#233; par sept alin&#233;as ainsi r&#233;dig&#233;s&#160;:</p><p style=\"text-align: justify;\">&#171;&#160;L&#8217;&#201;tat peut autoriser, &#224; titre exp&#233;rimental et pour une dur&#233;e maximale de trois ans, P&#244;le emploi &#224; d&#233;livrer gratuitement une carte &#233;lectronique individuelle, appel&#233; &#171;&#160;pass&#160;travail&#160;&#187;, &#224; toute personne en recherche d&#8217;emploi.</p><p style=\"text-align: justify;\">&#171;&#160;Ce &#171;&#160;pass travail&#160;&#187; permet&#160;:</p><p style=\"text-align: justify;\">&#171;&#160;- La gestion par le ou les employeurs des heures travaill&#233;es&#160;;</p><p style=\"text-align: justify;\">&#171;&#160;- L&#8217;&#233;dition du bulletin de paie&#160;;</p><p style=\"text-align: justify;\">&#171;&#160;- La consultation de son compte par le salari&#233;&#160;;</p><p style=\"text-align: justify;\">&#171;&#160;- Le virement automatique du salaire, par le ou les employeurs, sur le compte bancaire du salari&#233; d&#232;s le soir m&#234;me pour un temps de travail n&#8217;exc&#233;dant pas une journ&#233;e&#160;;</p><p style=\"text-align: justify;\">&#171;&#160;- L&#8217;embauche simultan&#233;e du salari&#233; par plusieurs employeurs.&#160;&#187;</p>",
    "exposeSommaire": "<p style=\"text-align: justify;\">Une mine d&#8217;or pour les caisses de l&#8217;&#201;tat&#160;!</p><p style=\"text-align: justify;\">Cet amendement conf&#232;re un droit &#224; l&#8217;exp&#233;rimentation &#224; l&#8217;&#201;tat afin de cr&#233;er un &#171;&#160;pass&#160;travail&#160;&#187; favorisant la simplification de la gestion par l&#8217;employeur des heures travaill&#233;es par le salari&#233;.</p><p style=\"text-align: justify;\">Ce dispositif poursuit plusieurs objectifs&#160;:</p><p style=\"text-align: justify;\">- mettre fin aux contraintes de gestion pesant sur les employeurs. La gestion des heures travaill&#233;es p&#232;se lourd dans le budget des entreprises. Elle suppose l&#8217;embauche de professionnels sp&#233;cialis&#233;s dans la gestion des r&#233;mun&#233;rations, l&#8217;&#233;dition des bulletins de paie, les op&#233;rations bancaires...etc.</p><p style=\"text-align: justify;\">De telles contraintes participent des raisons conduisant les employeurs &#224; recourir au travail au noir qui, outre son moindre co&#251;t, permet aux employeurs de faire l&#8217;&#233;conomie des contraintes administratives.</p><p style=\"text-align: justify;\">Afin de simplifier la gestion des heures travaill&#233;es, tant pour les employeurs que pour les salari&#233;s, et de ce fait, relancer l&#8217;embauche, cet amendement propose la mise en place d&#8217;une carte &#171;&#160;travail&#160;&#187; qui fonctionnerait comme une carte vitale ou une carte bancaire, sur un mode &#233;lectronique et informatis&#233;.</p><p style=\"text-align: justify;\">- red&#233;finir la notion de travail fond&#233;e sur le nombre d&#8217;heures travaill&#233;es productrices de richesse. Cette carte &#233;lectronique permettrait de g&#233;rer toutes les transactions concernant les heures travaill&#233;es par un salari&#233;, et de ce fait, cr&#233;er des milliers d&#8217;heures, non travaill&#233;es ou non d&#233;clar&#233;es &#224; ce jour. Elle permettrait aussi de faire une distinction plus nette entre heures travaill&#233;es productrices de richesse, heures travaill&#233;es consommatrices de richesse et heures assist&#233;es.</p><p style=\"text-align: justify;\">Elle participerait ainsi de la red&#233;finition de la notion de travail en ce sens que la carte favoriserait l&#8217;embauche de demandeurs d&#8217;emplois, m&#234;me pour un tr&#232;s petit nombre d&#8217;heures de travail</p><p style=\"text-align: justify;\">- fonder cette simplification administrative sur la gestion informatis&#233;e des donn&#233;es.</p><p style=\"text-align: justify;\">Le pass &#171;&#160;travail&#160;&#187; (qui pourra &#234;tre d&#233;mat&#233;rialis&#233;e en application pour smartphone) fonctionnera de fa&#231;on simple&#160;: tout employeur potentiel poss&#233;dera un lecteur de carte. Gr&#226;ce &#224; sa carte nominative et personnelle, chaque salari&#233; pourra pointer avant de travailler, puis une fois le travail accompli. Ce pointage constituera ainsi un acte de d&#233;claration d&#8217;embauche automatis&#233;.</p>"
  },
  "representations": [
    {
      "nom": "PDF",
      "typeMime": {
        "type": "application",
        "subType": "PDF"
      },
      "statutRepresentation": {
        "verbatim": true,
        "canonique": true,
        "officielle": true,
        "transcription": false,
        "enregistrement": false
      },
      "contenu": {
        "documentURI": "/15/amendements/1237/AN/1147.pdf"
      }
    }
  ],
  "seanceDiscussion": "RUANR5L15S2019IDS21258",
  "sort": {
    "dateSaisie": "2018-10-03T00:45:00.000+02:00",
    "sortEnSeance": "Non soutenu"
  },
  "dateDepot": "2018-09-20T02:00:00.000+02:00",
  "dateDistribution": "2018-09-25T02:00:00.000+02:00",
  "article99": "0",
  "loiReference": {
    "codeLoi": "c travail",
    "divisionCodeLoi": "L5311-1"
  }
}