{
  "uid": "AMANR5L15SEA717460B1255P2D1N1475",
  "identifiant": {
    "legislature": "15",
    "numero": "1475",
    "numRect": "0",
    "saisine": {
      "texteLegislatifRef": "PRJLANR5L15B1255",
      "numeroPartiePLF": "2",
      "organeExamen": "PO717460",
      "mentionSecondeDeliberation": "0"
    }
  },
  "numeroLong": "II-1475",
  "etapeTexte": "1ère lecture (1ère assemblée saisie)",
  "triAmendement": "bbfaaaaaaaaaaaaaaaaaaaaaaaaaaaaaaaaaaaaaaaaaaaaaaaro",
  "cardinaliteAmdtMultiples": "1",
  "etat": "Discuté",
  "signataires": {
    "auteur": {
      "typeAuteur": "Depute",
      "acteurRef": "PA719608",
      "groupePolitiqueRef": "PO723569"
    },
    "cosignatairesRefs": [
      "PA719608"
    ],
    "texteAffichable": "Mme&#160;M&#233;nard"
  },
  "pointeurFragmentTexte": {
    "missionVisee": {
      "idMissionAN": "396",
      "libelleMission": "Cohésion des territoires",
      "codeMissionPLF": "B",
      "libelleMissionPLF": "Répartition, par mission et programme, des crédits du budget général"
    },
    "division": {
      "titre": "ÉTAT B",
      "articleDesignationCourte": "ART. 39",
      "type": "ANNEXE",
      "avantAApres": "A",
      "divisionRattachee": "ARTICLE 39",
      "urlDivisionTexteVise": "/15/textes/1255C.asp#D_ETAT_B"
    }
  },
  "corps": {
    "exposeSommaire": "<p style=\"text-align: justify;\">Transf&#233;rer 1&#160;000&#160;000&#160;euros du programme 112 &#171;&#160;Impulsion et coordination de la politique d&#8217;am&#233;nagement du territoire&#160;&#187;, action 04 &#171;&#160;Instruments de pilotage et d&#8217;&#233;tude&#160;&#187; vers le programme 177 &#171;&#160;h&#233;bergement, parcours vers le logement et insertion des personnes vuln&#233;rables&#160;&#187;, action 12 &#171;&#160;h&#233;bergement et logement adapt&#233;&#160;&#187;.</p><p style=\"text-align: justify;\">Le transfert est symbolique.</p><p style=\"text-align: justify;\">Chaque ann&#233;e, des places d&#8217;accueil pour les personnes sans domicile font d&#233;faut ou certaines restent vacantes &#224; cause de l&#8217;ins&#233;curit&#233; qui y r&#232;gne. Au lieu de baisser ce budget - il passera de 1&#160;894&#160;189&#160;982 en 2018 &#224; 1&#160;819&#160;669&#160;457&#160;euros en 2019 -, il conviendrait a minima de le reconduire. Le mieux serait bien s&#251;r de l&#8217;augmenter.</p><p style=\"text-align: justify;\">Au sein de cette action, il faut aussi mener une r&#233;flexion sur les cons&#233;quences de la hausse des flux migratoires (mentionn&#233;s au sein de l&#8217;action 12) pour mettre en place une immigration ma&#238;tris&#233;e qui ne porte pas pr&#233;judice &#224; l&#8217;accueil des personnes en difficult&#233;.</p>",
    "dispositifAmdtCredit": {
      "listeProgrammes": [
        {
          "libelle": "Hébergement, parcours vers le logement et insertion des personnes vulnérables",
          "id": "44550",
          "AE": {
            "montantPositif": "0",
            "montantNegatif": "0"
          },
          "CP": {
            "montantPositif": "1000000",
            "montantNegatif": "0"
          },
          "action": "modification"
        },
        {
          "libelle": "Aide à l'accès au logement",
          "id": "44551",
          "AE": {
            "montantPositif": "0",
            "montantNegatif": "0"
          },
          "CP": {
            "montantPositif": "0",
            "montantNegatif": "0"
          },
          "action": "modification"
        },
        {
          "libelle": "Urbanisme, territoires et amélioration de l'habitat",
          "id": "44552",
          "AE": {
            "montantPositif": "0",
            "montantNegatif": "0"
          },
          "CP": {
            "montantPositif": "0",
            "montantNegatif": "0"
          },
          "action": "modification"
        },
        {
          "libelle": "Impulsion et coordination de la politique d'aménagement du territoire",
          "id": "44553",
          "AE": {
            "montantPositif": "0",
            "montantNegatif": "0"
          },
          "CP": {
            "montantPositif": "0",
            "montantNegatif": "1000000"
          },
          "action": "modification"
        },
        {
          "libelle": "Interventions territoriales de l'État",
          "id": "44554",
          "AE": {
            "montantPositif": "0",
            "montantNegatif": "0"
          },
          "CP": {
            "montantPositif": "0",
            "montantNegatif": "0"
          },
          "action": "modification"
        },
        {
          "libelle": "Politique de la ville",
          "id": "44555",
          "AE": {
            "montantPositif": "0",
            "montantNegatif": "0"
          },
          "CP": {
            "montantPositif": "0",
            "montantNegatif": "0"
          },
          "action": "modification"
        }
      ],
      "totalAE": {
        "montantPositif": "0",
        "montantNegatif": "0",
        "solde": "0"
      },
      "totalCP": {
        "montantPositif": "1000000",
        "montantNegatif": "1000000",
        "solde": "0"
      }
    }
  },
  "representations": [
    {
      "nom": "PDF",
      "typeMime": {
        "type": "application",
        "subType": "PDF"
      },
      "statutRepresentation": {
        "verbatim": true,
        "canonique": true,
        "officielle": true,
        "transcription": false,
        "enregistrement": false
      },
      "contenu": {
        "documentURI": "/15/amendements/1255C/AN/1475.pdf"
      }
    }
  ],
  "seanceDiscussion": "RUANR5L15S2019IDS21335",
  "sort": {
    "dateSaisie": "2018-11-09T20:32:59.000+01:00",
    "sortEnSeance": "Non soutenu"
  },
  "dateDepot": "2018-11-06T01:00:00.000+01:00",
  "dateDistribution": "2018-11-07T01:00:00.000+01:00",
  "article99": "0",
  "loiReference": {}
}