{
  "uid": "AMANR5L15SEA717460BTC0971P0D1N1966",
  "identifiant": {
    "legislature": "15",
    "numero": "1966",
    "numRect": "0",
    "saisine": {
      "texteLegislatifRef": "PRJLANR5L15BTC0971",
      "numeroPartiePLF": "0",
      "organeExamen": "PO717460",
      "mentionSecondeDeliberation": "0"
    }
  },
  "numeroLong": "1966",
  "etapeTexte": "1ère lecture (1ère assemblée saisie)",
  "triAmendement": "alo",
  "cardinaliteAmdtMultiples": "1",
  "etat": "Retiré",
  "signataires": {
    "auteur": {
      "typeAuteur": "Depute",
      "acteurRef": "PA721458",
      "groupePolitiqueRef": "PO730964"
    },
    "cosignatairesRefs": [
      "PA721434",
      "PA722366",
      "PA721426",
      "PA721450",
      "PA721458"
    ],
    "texteAffichable": "M.&#160;Roseren,  Mme&#160;Riotton, Mme&#160;Lenne, Mme&#160;Lardet et M.&#160;Fugit"
  },
  "pointeurFragmentTexte": {
    "division": {
      "titre": "Article 21",
      "articleDesignationCourte": "APRÈS ART. 21",
      "type": "ARTICLE",
      "avantAApres": "Apres",
      "divisionRattachee": "APRÈS L'ARTICLE 21, insérer l'article suivant:",
      "articleAdditionnel": "1",
      "urlDivisionTexteVise": "/15/textes/0971.asp#D_Article_21"
    }
  },
  "corps": {
    "dispositif": "<p style=\"text-align: justify;\">I.&#160;&#8211;&#160;Dans les zones g&#233;ographiques couvertes par un plan de protection de l&#8217;atmosph&#232;re, le repr&#233;sentant de l'&#201;tat territorialement comp&#233;tent peut interdire l&#8217;usage de foyers non conformes au r&#232;glement du plan de protection de l&#8217;atmosph&#232;re.</p><p style=\"text-align: justify;\">II.&#160;&#8211;&#160;Les foyers install&#233;s non conformes&#160;doivent &#234;tre r&#233;gularis&#233;s dans un d&#233;lai de deux ans &#224; compter de la promulgation de la pr&#233;sente loi.</p>",
    "exposeSommaire": "<p style=\"text-align: justify;\">En hiver, la combustion de biomasse est &#224; l&#8217;origine de 62&#160;% &#224; 73&#160;% en moyenne des particules fines en hiver. Or, diff&#233;rentes &#233;tudes ont d&#233;montr&#233; que les chemin&#233;es &#224; foyer ouvert d&#233;gageaient deux fois plus de particules que les chemin&#233;es &#224; foyer ferm&#233; et &#233;mettaient vingt fois plus de particules que les chaudi&#232;res &#224; bois de derni&#232;re g&#233;n&#233;ration.</p><p style=\"text-align: justify;\">L&#8217;objet de cet amendement est donc de permettre au Pr&#233;fet d&#8217;interdire l&#8217;usage d&#8217;appareils de chauffage de bois non conformes au r&#232;glement du plan de protection de l&#8217;Atmosph&#232;re dans les zones concern&#233;es par l&#8217;application de ces plans, comme dans la Vall&#233;e de l&#8217;Arve.</p><p style=\"text-align: justify;\">Il d&#233;termine &#233;galement une p&#233;riode transitoire de deux ans pendant laquelle les foyers non conformes devront &#234;tre mis en conformit&#233;.</p>"
  },
  "representations": [
    {
      "nom": "PDF",
      "typeMime": {
        "type": "application",
        "subType": "PDF"
      },
      "statutRepresentation": {
        "verbatim": true,
        "canonique": true,
        "officielle": true,
        "transcription": false,
        "enregistrement": false
      },
      "contenu": {
        "documentURI": "/15/amendements/0971/AN/1966.pdf"
      }
    }
  ],
  "dateDepot": "2018-05-25T02:00:00.000+02:00",
  "dateDistribution": "2018-05-30T02:00:00.000+02:00",
  "article99": "0",
  "loiReference": {}
}