{
  "uid": "AMANR5L15PO757134B1673P0D1N721",
  "identifiant": {
    "legislature": "15",
    "numero": "721",
    "numRect": "0",
    "saisine": {
      "texteLegislatifRef": "PRJLANR5L15B1673",
      "numeroPartiePLF": "0",
      "organeExamen": "PO757134",
      "mentionSecondeDeliberation": "0"
    }
  },
  "numeroLong": "721",
  "etapeTexte": "Nouvelle Lecture",
  "triAmendement": "kiiaaaaaaaaaaaaaaaaaaaaaaaaaaaaaaaaaaaaaaaaaaaaaaapi",
  "cardinaliteAmdtMultiples": "1",
  "etat": "Discuté",
  "signataires": {
    "auteur": {
      "typeAuteur": "Depute",
      "acteurRef": "PA342415",
      "groupePolitiqueRef": "PO758835"
    },
    "cosignatairesRefs": [
      "PA605069",
      "PA1592",
      "PA607553",
      "PA508",
      "PA608695",
      "PA608172",
      "PA335054",
      "PA719930",
      "PA337483",
      "PA642764",
      "PA342415",
      "PA609590",
      "PA608741",
      "PA1008",
      "PA333818",
      "PA610681",
      "PA333285",
      "PA1198",
      "PA335532",
      "PA340343",
      "PA429893",
      "PA643145",
      "PA609332",
      "PA340357",
      "PA608011",
      "PA267233",
      "PA332614",
      "PA720988",
      "PA1809"
    ],
    "texteAffichable": "Mme&#160;Battistel,  M.&#160;Potier, M.&#160;Juanico, M.&#160;Vallaud, M.&#160;Aviragnet, Mme&#160;Bareigts, Mme&#160;Bi&#233;mouret, M.&#160;Bouillon, M.&#160;Jean-Louis&#160;Bricout, M.&#160;Carvounas, M.&#160;Alain&#160;David, Mme&#160;Laurence&#160;Dumont, M.&#160;Faure, M.&#160;Garot, M.&#160;David&#160;Habib, M.&#160;Hutin, Mme&#160;Karamanli, M.&#160;J&#233;r&#244;me&#160;Lambert, M.&#160;Letchimy, Mme&#160;Manin, Mme&#160;Pau-Langevin, Mme&#160;Pires Beaune, M.&#160;Pueyo, Mme&#160;Rabault, M.&#160;Saulignac, Mme&#160;Tolmont, Mme&#160;Untermaier, Mme&#160;Vainqueur-Christophe et Mme&#160;Victory"
  },
  "pointeurFragmentTexte": {
    "division": {
      "titre": "Article 55 ter",
      "articleDesignationCourte": "ART. 55 TER",
      "type": "ARTICLE",
      "avantAApres": "A",
      "divisionRattachee": "ARTICLE 55 TER",
      "urlDivisionTexteVise": "/15/textes/1673.asp#D_Article_55_ter"
    }
  },
  "corps": {
    "dispositif": "<p style=\"text-align: justify;\">R&#233;tablir l&#8217;article&#160;55 <i>ter</i> ainsi r&#233;dig&#233;&#160;:</p><p style=\"text-align: justify;\">&#171;&#160;Apr&#232;s l&#8217;article&#160;6&#160;<i>decies</i> de l&#8217;ordonnance n&#176;&#160;58&#8209;1100 du&#160;17&#160;novembre&#160;1958 relative au fonctionnement des assembl&#233;es parlementaires, il est ins&#233;r&#233; un article&#160;6&#160;undecies ainsi r&#233;dig&#233;&#160;:&#160;</p><p style=\"text-align: justify;\">&#171;&#160;Art.&#160;6&#160;undecies.&#160;&#8211;&#160;I.&#160;&#8211;&#160;Il est constitu&#233; une d&#233;l&#233;gation parlementaire &#224; la s&#233;curit&#233; &#233;conomique, commune &#224; l&#8217;Assembl&#233;e nationale et au S&#233;nat. Cette d&#233;l&#233;gation est compos&#233;e de huit d&#233;put&#233;s et de huit s&#233;nateurs.</p><p style=\"text-align: justify;\">&#171;&#160;II.&#160;&#8211;&#160;Les pr&#233;sidents des commissions permanentes de l&#8217;Assembl&#233;e nationale et du S&#233;nat charg&#233;es des affaires &#233;conomiques et des finances sont membres de droit de la d&#233;l&#233;gation parlementaire &#224; la s&#233;curit&#233; &#233;conomique. La fonction de pr&#233;sident de la d&#233;l&#233;gation est assur&#233;e alternativement, pour un an, par un d&#233;put&#233; et un s&#233;nateur, membres de droit. Les autres membres de la d&#233;l&#233;gation sont d&#233;sign&#233;s par le pr&#233;sident de leur assembl&#233;e respective en t&#226;chant de reproduire les &#233;quilibres entre groupes politiques de chacune d&#8217;entre elles. Les six d&#233;put&#233;s qui ne sont pas membres de droit sont d&#233;sign&#233;s au d&#233;but de chaque l&#233;gislature et pour la dur&#233;e de celle-ci. Les six s&#233;nateurs sont d&#233;sign&#233;s apr&#232;s chaque renouvellement partiel du S&#233;nat.</p><p style=\"text-align: justify;\">&#171;&#160;III.&#160;&#8211;&#160;Sans pr&#233;judice des comp&#233;tences des commissions permanentes et sous r&#233;serve des comp&#233;tences de la d&#233;l&#233;gation parlementaire au renseignement, la d&#233;l&#233;gation parlementaire &#224; la s&#233;curit&#233; &#233;conomique a pour mission de suivre l&#8217;action du Gouvernement en mati&#232;re de protection et de promotion des int&#233;r&#234;ts &#233;conomiques, industriels et scientifiques de la Nation, ainsi qu&#8217;en mati&#232;re de contr&#244;le des investissements &#233;trangers dans le cadre de la proc&#233;dure pr&#233;vue aux articles L.&#160;151&#8209;3 et suivants du code mon&#233;taire et financier. &#192; cette fin, le Gouvernement lui transmet chaque ann&#233;e un rapport comportant&#160;:</p><p style=\"text-align: justify;\">&#171;&#160;1&#176;&#160;Une description de l&#8217;action du Gouvernement en mati&#232;re de protection et de promotion des int&#233;r&#234;ts &#233;conomiques, industriels et scientifiques de la Nation, notamment des mesures prises en mati&#232;re de s&#233;curit&#233; &#233;conomique et de protection des entreprises strat&#233;giques, des objectifs poursuivis, des actions d&#233;ploy&#233;es et des r&#233;sultats obtenus&#160;;</p><p style=\"text-align: justify;\">&#171;&#160;2&#176;&#160;Des informations relatives &#224; la proc&#233;dure d&#8217;autorisation pr&#233;alable des investissements &#233;trangers dans une activit&#233; en France, comprenant notamment des &#233;l&#233;ments d&#233;taill&#233;s relatifs au nombre de demandes d&#8217;autorisation pr&#233;alables adress&#233;es au ministre charg&#233; de l&#8217;&#233;conomie, de refus d&#8217;autorisation, d&#8217;op&#233;rations autoris&#233;es, d&#8217;op&#233;rations autoris&#233;es assorties de conditions pr&#233;vues au&#160;II de l&#8217;article L.&#160;151&#8209;3 du code mon&#233;taire et financier, ainsi que des &#233;l&#233;ments relatifs &#224; l&#8217;exercice par le ministre du pouvoir de sanction pr&#233;vu au m&#234;me article L.&#160;151&#160;&#8211;&#160;3, &#224; l&#8217;exclusion des &#233;l&#233;ments permettant l&#8217;identification des personnes physiques ou morales concern&#233;es par la proc&#233;dure d&#8217;autorisation pr&#233;alable des investissements &#233;trangers dans une activit&#233; en France.</p><p style=\"text-align: justify;\">&#171;&#160;La d&#233;l&#233;gation peut entendre le Premier ministre, les ministres comp&#233;tents, le commissaire &#224; l&#8217;information strat&#233;gique et &#224; la s&#233;curit&#233; &#233;conomiques et les directeurs des administrations centrales concern&#233;es, accompagn&#233;s des collaborateurs de leur choix. Ces &#233;changes peuvent porter sur des &#233;l&#233;ments permettant l&#8217;identification des personnes mentionn&#233;es au premier alin&#233;a du pr&#233;sent&#160;III.</p><p style=\"text-align: justify;\">&#171;&#160;IV.&#160;&#8211;&#160;Les travaux de la d&#233;l&#233;gation parlementaire &#224; la s&#233;curit&#233; &#233;conomique ne sont pas rendus publics.</p><p style=\"text-align: justify;\">&#171;&#160;V.&#160;&#8211;&#160;Chaque ann&#233;e, par d&#233;rogation au&#160;IV, la d&#233;l&#233;gation &#233;tablit un rapport public dressant le bilan de son activit&#233;. Ce document ne peut faire &#233;tat d&#8217;aucune information ni d&#8217;aucun &#233;l&#233;ment d&#8217;appr&#233;ciation permettant d&#8217;identifier les personnes mentionn&#233;es au&#160;III du pr&#233;sent article.</p><p style=\"text-align: justify;\">&#171;&#160;Dans le cadre de ses travaux, la d&#233;l&#233;gation peut adresser des recommandations et des observations au Pr&#233;sident de la R&#233;publique et au Premier ministre ainsi qu&#8217;aux ministres mentionn&#233;s au m&#234;me&#160;III. Elle les transmet au pr&#233;sident de chaque assembl&#233;e.</p><p style=\"text-align: justify;\">&#171;&#160;VI.&#160;&#8211;&#160;La d&#233;l&#233;gation parlementaire &#224; la s&#233;curit&#233; &#233;conomique &#233;tablit son r&#232;glement int&#233;rieur. Celui-ci est soumis &#224; l&#8217;approbation du bureau de chaque assembl&#233;e.</p><p style=\"text-align: justify;\">&#171;&#160;Les d&#233;penses aff&#233;rentes au fonctionnement de la d&#233;l&#233;gation sont financ&#233;es et ex&#233;cut&#233;es comme d&#233;penses des assembl&#233;es parlementaires dans les conditions fix&#233;es par l&#8217;article&#160;7.&#160;&#187;</p>",
    "exposeSommaire": "<p style=\"text-align: justify;\">Cet amendement a pour objet de r&#233;tablir la d&#233;l&#233;gation parlementaire &#224; la s&#233;curit&#233; &#233;conomique, cr&#233;&#233;e en premi&#232;re lecture &#224; l&#8217;Assembl&#233;e nationale, et supprim&#233;e par le S&#233;nat.</p>"
  },
  "representations": [
    {
      "nom": "PDF",
      "typeMime": {
        "type": "application",
        "subType": "PDF"
      },
      "statutRepresentation": {
        "verbatim": true,
        "canonique": true,
        "officielle": true,
        "transcription": false,
        "enregistrement": false
      },
      "contenu": {
        "documentURI": "/15/amendements/1673/CSPACTE/721.pdf"
      }
    }
  ],
  "sort": {
    "dateSaisie": "2019-03-07T11:43:41.000+01:00",
    "sortEnSeance": "Adopté"
  },
  "dateDepot": "2019-03-01T01:00:00.000+01:00",
  "dateDistribution": "2019-03-05T01:00:00.000+01:00",
  "article99": "0",
  "loiReference": {}
}