{
  "uid": "AMANR5L15PO59048B1255P1D1N635",
  "identifiant": {
    "legislature": "15",
    "numero": "635",
    "numRect": "0",
    "saisine": {
      "texteLegislatifRef": "PRJLANR5L15B1255",
      "numeroPartiePLF": "1",
      "organeExamen": "PO59048",
      "mentionSecondeDeliberation": "0"
    }
  },
  "numeroLong": "I-CF635",
  "etapeTexte": "1ère lecture (1ère assemblée saisie)",
  "triAmendement": "ekaaaaaaaaaaaaaaaaaaaaaaaaaaaaaaaaaaaaaaaaaaaaaaaag",
  "cardinaliteAmdtMultiples": "1",
  "etat": "Discuté",
  "signataires": {
    "auteur": {
      "typeAuteur": "Depute",
      "acteurRef": "PA606712",
      "groupePolitiqueRef": "PO730934"
    },
    "cosignatairesRefs": [
      "PA606712"
    ],
    "texteAffichable": "M.&#160;Lurton"
  },
  "pointeurFragmentTexte": {
    "division": {
      "titre": "Article 19",
      "articleDesignationCourte": "ART. 19",
      "type": "ARTICLE",
      "avantAApres": "A",
      "divisionRattachee": "ARTICLE 19",
      "urlDivisionTexteVise": "/15/textes/1255A.asp#D_Article_19"
    },
    "alinea": {
      "numero": "50"
    }
  },
  "corps": {
    "dispositif": "<p>Supprimer l'alin&#233;a 50.</p>",
    "exposeSommaire": "<p>L'alin&#233;a 50 du Pr&#233;sent article vise &#224; r&#233;server l'usage du gaz non routier (GNR) aux seuls exploitant agricoles, et excluant de fait les industries cimenti&#232;res pour lesquelles sont usage a &#233;t&#233; g&#233;n&#233;ralis&#233; depis 2011.</p><p>Cette exclusion a pour effet d'imposer aux industries cimenti&#232;res les r&#232;gles de droit commun en mati&#232;re de fiscalit&#233; des carburants, ce qui correspondraient pour elles &#224; un triplement de la Taxe int&#233;rieure de consommation (TICPE) au 1er janvier 2019, induisant un co&#251;t minimal pour ces entreprises de 100 millions d'euros.</p><p>A br&#232;ve &#233;ch&#233;ance, ces co&#251;t nouveaux pour l'industrie cimenti&#232;re impactera par r&#233;percussion sur la formation des prix les fili&#232;res du b&#226;timent et des travaux publics, et donc bien souvent les finances des collectivit&#233;s locales et territoriales.</p><p>Aussi, le pr&#233;sent article vise &#224; supprimer l'alin&#233;a 50 du pr&#233;sent article et &#224; maintenir la norme r&#233;gissant l'usage du GNR dans sa situation actuelle.</p>"
  },
  "representations": [
    {
      "nom": "PDF",
      "typeMime": {
        "type": "application",
        "subType": "PDF"
      },
      "statutRepresentation": {
        "verbatim": true,
        "canonique": true,
        "officielle": true,
        "transcription": false,
        "enregistrement": false
      },
      "contenu": {
        "documentURI": "/15/amendements/1255A/CION_FIN/CF635.pdf"
      }
    }
  ],
  "sort": {
    "dateSaisie": "2018-10-11T09:11:14.000+02:00",
    "sortEnSeance": "Tombé"
  },
  "dateDepot": "2018-10-05T02:00:00.000+02:00",
  "dateDistribution": "2018-10-09T02:00:00.000+02:00",
  "article99": "0",
  "loiReference": {}
}