{
  "uid": "AMANR5L15PO59048B1255P2D1N1040",
  "identifiant": {
    "legislature": "15",
    "numero": "1040",
    "numRect": "0",
    "saisine": {
      "texteLegislatifRef": "PRJLANR5L15B1255",
      "numeroPartiePLF": "2",
      "organeExamen": "PO59048",
      "mentionSecondeDeliberation": "0"
    }
  },
  "numeroLong": "II-CF1040",
  "etapeTexte": "1ère lecture (1ère assemblée saisie)",
  "triAmendement": "jlaaaaaaaaaaaaaaaaaaaaaaaaaaaaaaaaaaaaaaaaaaaaaaaah",
  "cardinaliteAmdtMultiples": "1",
  "etat": "Irrecevable",
  "signataires": {
    "auteur": {
      "typeAuteur": "Depute",
      "acteurRef": "PA721202",
      "groupePolitiqueRef": "PO730958"
    },
    "cosignatairesRefs": [
      "PA721960",
      "PA721210",
      "PA720892",
      "PA718860",
      "PA720430",
      "PA721062",
      "PA720286",
      "PA588884",
      "PA721226",
      "PA719676",
      "PA720846",
      "PA721202",
      "PA2150",
      "PA719578",
      "PA720422",
      "PA722142",
      "PA718868"
    ],
    "texteAffichable": "M.&#160;Coquerel,  Mme&#160;Autain, M.&#160;Bernalicis, M.&#160;Corbi&#232;re, Mme&#160;Fiat, M.&#160;Lachaud, M.&#160;Larive, M.&#160;M&#233;lenchon, Mme&#160;Obono, Mme&#160;Panot, M.&#160;Prud&apos;homme, M.&#160;Quatennens, M.&#160;Ratenon, Mme&#160;Ressiguier, Mme&#160;Rubin, M.&#160;Ruffin et Mme&#160;Taurine"
  },
  "pointeurFragmentTexte": {
    "division": {
      "titre": "Article 57",
      "articleDesignationCourte": "ART. 57",
      "type": "ARTICLE",
      "avantAApres": "A",
      "divisionRattachee": "ARTICLE 57",
      "urlDivisionTexteVise": "/15/textes/1255C.asp#D_Article_57"
    },
    "alinea": {
      "numero": "10"
    }
  },
  "corps": {
    "dispositif": "<p>Remplacer cet alin&#233;a par un alin&#233;a ainsi r&#233;dig&#233; :</p><p>&#171;&#160; C &#8211; Le second alin&#233;a du 5 est remplac&#233; par la phrase suivante :</p><p>&#171; Le cr&#233;dit d&#8217;imp&#244;t est port&#233; &#224; 40% du montant des mat&#233;riaux, &#233;quipement, appareils et d&#233;penses de diagnostic de performance &#233;nerg&#233;tique et d&#8217;audit mentionn&#233;s au 1 pour les m&#233;nages dont le revenu fiscal de r&#233;f&#233;rence est, compte tenu de la composition du m&#233;nage, inf&#233;rieur &#224; un plafond d&#233;fini en Conseil d&#8217;Etat &#187;</p><p>&#160;</p>",
    "exposeSommaire": "<p>Le cr&#233;dit d&#8217;imp&#244;t pour la transition &#233;nerg&#233;tique est un instrument efficace. Cependant, ce dispositif fiscal est excluant car il favorise les foyers aux revenus les plus &#233;lev&#233;s. Le rapport de l&#8217;IGF-CGEDD1 indique ainsi que les m&#233;nages modestes et tr&#232;s modestes (1er et 2&#232;me quintile de revenus) b&#233;n&#233;ficient de seulement 9% de la d&#233;pense fiscale li&#233;e au CITE. Celle-ci &#233;tant concentr&#233;e sur les plus hauts revenus (5&#232;me quintile de revenus) &#224; plus de 50%.</p><p>En l&#8217;Etat, le CITE semble donc jouer un r&#244;le mineur dans la capacit&#233; des m&#233;nages moins ais&#233;s &#224; r&#233;nover &#233;nerg&#233;tiquement leur logement. En effet, pour b&#233;n&#233;ficier d&#8217;un tel dispositif, et r&#233;nover son logement, encore faut-il disposer des fonds au pr&#233;alable&#160;!</p><p>Le pr&#233;sent amendement propos&#233; par &#171;&#160;Initiative R&#233;novons&#160;!&#160;&#187; membre du CLER vise &#224; bonifier le cr&#233;dit d&#8217;imp&#244;t pour la transition &#233;nerg&#233;tique &#224; destination des m&#233;nages les plus modestes pour lesquels le montant du cr&#233;dit d&#8217;imp&#244;t n&#8217;est aujourd&#8217;hui pas adapt&#233;.</p>"
  },
  "representations": [
    {
      "nom": "PDF",
      "typeMime": {
        "type": "application",
        "subType": "PDF"
      },
      "statutRepresentation": {
        "verbatim": true,
        "canonique": true,
        "officielle": true,
        "transcription": false,
        "enregistrement": false
      },
      "contenu": {
        "documentURI": "/15/amendements/1255C/CION_FIN/CF1040.pdf"
      }
    }
  ],
  "dateDepot": "2018-10-31T01:00:00.000+01:00",
  "article99": "0",
  "loiReference": {}
}