{
  "uid": "AMANR5L15SEA717460BTC2243P0D1N2498",
  "identifiant": {
    "legislature": "15",
    "numero": "2498",
    "numRect": "0",
    "saisine": {
      "texteLegislatifRef": "PRJLANR5L15BTC2243",
      "numeroPartiePLF": "0",
      "organeExamen": "PO717460",
      "mentionSecondeDeliberation": "1"
    }
  },
  "numeroLong": "2498",
  "etapeTexte": "1ère lecture (1ère assemblée saisie)",
  "triAmendement": "ioaaaaaaaaaaaaaaaaaaaaaaaaaaaaaaaaaaaaaaaaaaaaaaaaagknu",
  "cardinaliteAmdtMultiples": "1",
  "etat": "Discuté",
  "signataires": {
    "auteur": {
      "typeAuteur": "Depute",
      "acteurRef": "PA721234",
      "groupePolitiqueRef": "PO730970"
    },
    "cosignatairesRefs": [
      "PA721234",
      "PA718918"
    ],
    "texteAffichable": "Mme&#160;Maud&#160;Petit et Mme&#160;Louis"
  },
  "pointeurFragmentTexte": {
    "division": {
      "titre": "Article 21",
      "articleDesignationCourte": "APRÈS ART. 21",
      "type": "ARTICLE",
      "avantAApres": "Apres",
      "divisionRattachee": "APRÈS L'ARTICLE 21, insérer l'article suivant:",
      "articleAdditionnel": "1",
      "urlDivisionTexteVise": "/15/textes/2243.asp#D_Article_21"
    }
  },
  "corps": {
    "dispositif": "<p>I.&#160;&#8211;&#160;Apr&#232;s le septi&#232;me alin&#233;a de l&#8217;article L.&#160;1111&#8209;4 du code de la sant&#233; publique, il est ins&#233;r&#233; un alin&#233;a ainsi r&#233;dig&#233;&#160;:</p><p style=\"text-align: justify;\">&#171;&#160;Hors n&#233;cessit&#233; vitale imm&#233;diate, aucun acte m&#233;dical de conformation sexu&#233;e irr&#233;versible visant &#224; modifier les caract&#233;ristiques sexuelles ne peut &#234;tre effectu&#233; sur une personne mineure tant que l&#8217;int&#233;ress&#233;e n&#8217;est pas en mesure d&#8217;exprimer par elle-m&#234;me son consentement&#160; apr&#232;s avoir re&#231;u une information adapt&#233;e &#224; son &#226;ge.&#160;&#187;</p><p style=\"text-align: justify;\">II.&#160;&#8211;&#160;Le dernier alin&#233;a de l&#8217;article&#160;371&#8209;1 du code civil est compl&#233;t&#233; par une phrase ainsi r&#233;dig&#233;e&#160;: &#171;&#160;En cas de d&#233;saccord sur une d&#233;cision de nature m&#233;dicale relevant de l&#8217;alin&#233;a&#160;7 de l&#8217;article L.&#160;1111&#8209;4, le juge des tutelles appr&#233;cie la volont&#233; du mineur.&#160;&#187;</p>",
    "exposeSommaire": "<p style=\"text-align: justify;\">Cet amendement est issu des &#233;changes de vue et d&#8217;un travail en commun transpartisan entre les membres du groupe d&#8217;&#233;tudes sur les discriminations et LGBTQIphobies dans le monde ainsi que du groupe d&#8217;&#233;tudes droits de l&#8217;enfant et protection de la jeunesse.</p><p style=\"text-align: justify;\">Il existe&#160;aujourd&#8217;hui une injonction de la soci&#233;t&#233; afin&#160;qu&#8217;un enfant sorte de la maternit&#233; avec un sexe d&#233;fini. Cependant, des voix &#233;mergentes red&#233;finissent la notion de genre et de sa d&#233;termination. Il&#160;est du devoir du l&#233;gislateur de se saisir de la question.</p><p style=\"text-align: justify;\">L&#8217;amendement&#160;vise &#224; diff&#233;rer tout acte m&#233;dical de conformation sexu&#233;e, hors cas d&#8217;urgence vitale imm&#233;diate, afin que la personne mineure concern&#233;e puisse exprimer son consentement &#233;clair&#233;, en ayant re&#231;u une information adapt&#233;e quant aux cons&#233;quences de ces op&#233;rations.&#160;</p><p style=\"text-align: justify;\">L&#8217;enjeu ici r&#233;side ici dans le droit d&#8217;avoir le choix. Certains actes m&#233;dicaux, pratiqu&#233;s en France sur des nourrissons, sont irr&#233;versibles. Si nous ne doutons pas de l&#8217;intention d&#8217;agir pour l&#8217;int&#233;r&#234;t de l&#8217;enfant, pourquoi agir imm&#233;diatement quand il est possible de&#160;laisser &#224; l&#8217;enfant, un &#234;tre en pleine construction, le droit de comprendre qui il est, et qui il veut devenir&#160;?&#160;</p><p style=\"text-align: justify;\">En 2017 d&#233;j&#224;, le D&#233;fenseur des droits faisait &#233;tat de la n&#233;cessit&#233; d&#8217;une &#233;volution de la prise en charge des personnes&#160;intersexes, dans le respect des droits humains&#160;que sont l&#8217;int&#233;grit&#233; du corps, et la libre disposition de soi.&#160;Comme nous le rappelle l&#8217;article&#160;16.1 du Code civil &#171;&#160;Chacun a le droit au respect de son corps&#160;&#187;.&#160;</p><p style=\"text-align: justify;\">C&#8217;est aussi ce que rappelle&#160;Le Conseil d&#8217;&#201;tat dans son rapport sur la r&#233;vision de la loi de bio&#233;thique, remis au Premier ministre en 2018&#160;: des professionnels de sant&#233; r&#233;alisent des actes m&#233;dicaux tendant &#224; conformer les caract&#233;ristiques sexuelles primaires ou secondaires des personnes pr&#233;sentant des variations du d&#233;veloppement sexuel, en dehors du cadre l&#233;gal de l&#8217;article&#160;16&#8209;3 du code civil. Le Conseil d&#8217;&#201;tat pr&#233;cise par ailleurs&#160;que seules sont envisageables les interventions &#171;&#160;qui s&#8217;imposent afin d&#8217;&#233;viter de mettre en jeu le pronostic vital de la personne ou les souffrances physiques associ&#233;es &#224; ces variations.&#160;&#187;.&#160;</p><p style=\"text-align: justify;\">Le droit de d&#233;cider pour son propre corps est un droit fondamental, qui n&#8217;est malheureusement pas respect&#233; lors d&#8217;interventions pr&#233;coces, non urgentes, o&#249; le consentement de l&#8217;enfant n&#8217;est pas recherch&#233;. &#160;Pourtant, l&#8217;article L.&#160;1111&#8209;5 du code de la sant&#233; publique d&#233;montre que le consentement libre et &#233;clair&#233; du mineur peut &#234;tre recueilli sans l&#8217;aval de ses repr&#233;sentants l&#233;gaux. Ainsi, un droit d&#8217;exercice &#224; consentir au mineur est pr&#233;vu lorsque celui-ci refuse que ses repr&#233;sentants l&#233;gaux soient consult&#233;s sur les d&#233;cisions m&#233;dicales int&#233;ressant la sauvegarde de sa sant&#233;. Dans le cas d&#8217;acte m&#233;dical de conformation sexu&#233;e, hors urgence imm&#233;diate, ce droit devrait pouvoir &#234;tre respect&#233;. En l&#8217;absence de n&#233;cessit&#233; vitale absolue, il faut attendre que l&#8217;enfant soit en capacit&#233; d&#8217;exprimer son consentement si une op&#233;ration le concerne directement.&#160;</p><p style=\"text-align: justify;\">Comme le rappelle l&#8217;Article&#160;12 de la Convention Internationale des Droits de l&#8217;Enfant (qui engage la France depuis 30 ans cette ann&#233;e) &#171;&#160;Les &#201;tats parties garantissent &#224; l&#8217;enfant qui est capable de discernement, le droit d&#8217;exprimer librement son opinion sur toute question l&#8217;int&#233;ressant, les opinions de l&#8217;enfant &#233;tant d&#251;ment prises en consid&#233;ration eu &#233;gard &#224; son &#226;ge et &#224; son degr&#233; de maturit&#233;.&#160;&#187;</p><p style=\"text-align: justify;\">Compte tenu du contexte difficile qui peut&#160;entourer les parents au moment de la naissance (injonction de la soci&#233;t&#233; afin qu&#8217;un enfant sorte de la maternit&#233; avec un sexe d&#233;fini), nous proposons donc par cet amendement que ce type d&#8217;intervention irr&#233;versible soit soumis au pr&#233;alable au consentement personnel du mineur. D&#233;cider de pratiquer une telle op&#233;ration engage la vie future de l&#8217;enfant.&#160;Il est&#160;l&#233;gitime que ce dernier d&#233;cide pour lui-m&#234;me, tout en &#233;tant &#233;videmment accompagn&#233; et &#233;clair&#233; dans sa d&#233;cision.&#160;</p>"
  },
  "representations": [
    {
      "nom": "PDF",
      "typeMime": {
        "type": "application",
        "subType": "PDF"
      },
      "statutRepresentation": {
        "verbatim": true,
        "canonique": true,
        "officielle": true,
        "transcription": false,
        "enregistrement": false
      },
      "contenu": {
        "documentURI": "/15/amendements/2243/AN/2498.pdf"
      }
    }
  ],
  "seanceDiscussion": "RUANR5L15S2020IDS21853",
  "sort": {
    "dateSaisie": "2019-10-08T22:44:56.000+02:00",
    "sortEnSeance": "Rejeté"
  },
  "dateDepot": "2019-09-20T02:00:00.000+02:00",
  "dateDistribution": "2019-10-02T02:00:00.000+02:00",
  "article99": "0",
  "loiReference": {
    "codeLoi": "c santé publique",
    "divisionCodeLoi": "L1111-4"
  }
}