{
  "uid": "AMANR5L15SEA717460BTC1237P0D1N389",
  "identifiant": {
    "legislature": "15",
    "numero": "389",
    "numRect": "0",
    "saisine": {
      "texteLegislatifRef": "PRJLANR5L15BTC1237",
      "numeroPartiePLF": "0",
      "organeExamen": "PO717460",
      "mentionSecondeDeliberation": "1"
    }
  },
  "numeroLong": "389",
  "etapeTexte": "1ère lecture (1ère assemblée saisie)",
  "triAmendement": "taaaaaaaaaaaaaaaaaaaaaaaaaaaaaaaaaaaaaaaaaaaaaaaaaali",
  "cardinaliteAmdtMultiples": "1",
  "etat": "Discuté",
  "signataires": {
    "auteur": {
      "typeAuteur": "Depute",
      "acteurRef": "PA608826",
      "groupePolitiqueRef": "PO730934"
    },
    "cosignatairesRefs": [
      "PA721816",
      "PA334149",
      "PA721678",
      "PA334654",
      "PA643089",
      "PA719318",
      "PA719272",
      "PA608416",
      "PA720210",
      "PA267429",
      "PA608826",
      "PA266797",
      "PA267527",
      "PA606098",
      "PA267324",
      "PA605036",
      "PA346218",
      "PA721054",
      "PA267378",
      "PA1874",
      "PA609245",
      "PA330909",
      "PA718784",
      "PA642847",
      "PA330240",
      "PA1327",
      "PA1012",
      "PA721314",
      "PA605991",
      "PA340853",
      "PA721968",
      "PA720684"
    ],
    "texteAffichable": "Mme&#160;Duby-Muller,  M.&#160;Saddier, M.&#160;Le Fur, Mme&#160;Levy, M.&#160;Cinieri, Mme&#160;Anthoine, M.&#160;de la Verpilli&#232;re, M.&#160;Boucard, M.&#160;Straumann, M.&#160;Lorion, M.&#160;Gaultier, Mme&#160;Beauvais, M.&#160;Schellenberger, M.&#160;Descoeur, M.&#160;Vialay, M.&#160;Abad, M.&#160;Pierre-Henri&#160;Dumont, M.&#160;Reda, Mme&#160;Genevard, M.&#160;Leclerc, M.&#160;Thi&#233;riot, M.&#160;Gosselin, M.&#160;Forissier, M.&#160;Marleix, Mme&#160;Lacroute, M.&#160;Hetzel, M.&#160;Masson, Mme&#160;Meunier, M.&#160;Bazin, M.&#160;Ciotti, M.&#160;Fasquelle et M.&#160;Pauget"
  },
  "pointeurFragmentTexte": {
    "division": {
      "titre": "Article 73",
      "articleDesignationCourte": "APRÈS ART. 73",
      "type": "ARTICLE",
      "avantAApres": "Apres",
      "divisionRattachee": "APRÈS L'ARTICLE 73, insérer l'article suivant:",
      "articleAdditionnel": "1",
      "urlDivisionTexteVise": "/15/textes/1237.asp#D_Article_73"
    }
  },
  "corps": {
    "dispositif": "<p style=\"text-align: justify;\">I.&#160;&#8211;&#160;Le&#160;2&#176; du&#160;I de l&#8217;article&#160;150&#8209;0&#160;B <i>ter</i> du code g&#233;n&#233;ral des imp&#244;ts est ainsi modifi&#233;&#160;:</p><p style=\"text-align: justify;\">1&#176;&#160;La seconde phrase du premier alin&#233;a est ainsi modifi&#233;e&#160;:</p><p style=\"text-align: justify;\"><i>a)</i>&#160;Apr&#232;s le mot&#160;: &#171;&#160;c&#232;de&#160;&#187;, sont ins&#233;r&#233;s les mots&#160;: &#171;&#160;&#224; titre on&#233;reux, ou se voit racheter, rembourser ou annuler&#160;&#187;&#160;;</p><p style=\"text-align: justify;\"><i>b)</i>&#160;Apr&#232;s les mots&#160;: &#171;&#160;leur cession&#160;&#187;, sont ins&#233;r&#233;s les mots&#160;: &#171;&#160;ou du r&#233;investissement correspondant&#160;&#187;&#160;;</p><p style=\"text-align: justify;\">2&#176;&#160;Le&#160;<i>b</i>&#160;est compl&#233;t&#233; par une phrase ainsi r&#233;dig&#233;e&#160;: &#171;&#160;Cette derni&#232;re condition ne s&#8217;applique pas lorsque le r&#233;investissement est op&#233;r&#233; au profit d&#8217;une soci&#233;t&#233; appartenant &#224; la cat&#233;gorie des petites et moyennes entreprises au sens de l&#8217;annexe I au r&#232;glement&#160;(UE) n&#176;&#160;651/2014 de la Commission du 17&#160;juin&#160;2014 d&#233;clarant certaines cat&#233;gories d&#8217;aides compatibles avec le march&#233; int&#233;rieur en application des articles 107 et 108 du trait&#233;.&#160;&#187;&#160;;</p><p style=\"text-align: justify;\">3&#176;&#160;Apr&#232;s le&#160;<i>c</i>, il est ins&#233;r&#233; un alin&#233;a ainsi r&#233;dig&#233;&#160;:</p><p style=\"text-align: justify;\">&#171;&#160;Lorsque le d&#233;lai de deux&#160;ans mentionn&#233; &#224; la seconde phrase du premier alin&#233;a du pr&#233;sent&#160;2&#176; arrive &#224; expiration, il est prorog&#233; d&#8217;un an si le b&#233;n&#233;ficiaire de l&#8217;investissement appartient &#224; la cat&#233;gorie des petites et moyennes entreprises au sens de l&#8217;annexe&#160;I au r&#232;glement&#160;(UE) n&#176;&#160;651/2014 de la Commission du 17&#160;juin&#160;2014 pr&#233;cit&#233;.&#160;&#187;&#160;;</p><p style=\"text-align: justify;\">4&#176;&#160;Au cinqui&#232;me alin&#233;a et aux deuxi&#232;me et troisi&#232;me phrases du dernier alin&#233;a, apr&#232;s les mots&#160;: &#171;&#160;deux&#160;ans&#160;&#187;, sont ins&#233;r&#233;s les mots&#160;: &#171;&#160;ou, le cas &#233;ch&#233;ant de trois&#160;ans,&#160;&#187;&#160;;</p><p style=\"text-align: justify;\">5&#176;&#160;Apr&#232;s le cinqui&#232;me alin&#233;a, il est ins&#233;r&#233; un alin&#233;a ainsi r&#233;dig&#233;&#160;:</p><p style=\"text-align: justify;\">&#171;&#160;Le pr&#233;sent&#160;2&#176; s&#8217;applique &#233;galement aux r&#233;investissements ayant pour effet de prendre le contr&#244;le ou de souscrire en num&#233;raire au capital d&#8217;une holding animatrice au sens de l&#8217;article&#160;787&#160;D.&#160;&#187;</p><p style=\"text-align: justify;\">II.&#160;&#8211;&#160;La perte de recettes pour l&#8217;&#201;tat est compens&#233;e &#224; due concurrence par la cr&#233;ation d&#8217;une taxe additionnelle aux droits mentionn&#233;s aux articles 575 et 575 A du code g&#233;n&#233;ral des imp&#244;ts.&#160;</p>",
    "exposeSommaire": "<p style=\"text-align: justify;\">Cet amendement reprend une disposition de la proposition de loi visant &#224; moderniser la transmission d&#8217;entreprise, adopt&#233;e au S&#233;nat le 7 juin 2018. Ce texte, d&#233;pos&#233; par MM. Claude Nougein et Michel Vaspart et plusieurs de leurs coll&#232;gues, tend &#224; &#171;&#160;simplifier, moderniser et s&#233;curiser la transmission d&#8217;entreprise dans nos territoires&#160;&#187;.</p><p style=\"text-align: justify;\">Cet amendement concerne le report d&#8217;imposition dans le cadre d&#8217;un apport de titres&#160;; il assouplit et pr&#233;cise le r&#233;gime de l&#8217;apport-cession qui permet &#224; des entrepreneurs de c&#233;der les titres d&#8217;une soci&#233;t&#233; qu&#8217;ils contr&#244;lent pour en r&#233;investir le produit dans des activit&#233;s &#233;conomiques. Il modifie ainsi l&#8217;article&#160;150&#8209;0 B ter du code g&#233;n&#233;ral des imp&#244;ts pour notamment&#160;:</p><p style=\"text-align: justify;\">- permettre de prolonger d&#8217;un an le d&#233;lai actuel de deux ans de r&#233;investissement lorsque ce dernier est op&#233;r&#233; au b&#233;n&#233;fice d&#8217;une PME&#160;;</p><p style=\"text-align: justify;\">- permettre &#224; des &#171;&#160;business angels&#160;&#187; de prendre des participations dans des PME sans pour autant en prendre le contr&#244;le, en d&#233;rogeant donc &#224; la condition de prise de contr&#244;le des soci&#233;t&#233;s dont le capital est acquis&#160;;</p><p style=\"text-align: justify;\">- confirmer une interpr&#233;tation large du texte en ne limitant pas le maintien du report d&#8217;imposition au seul r&#233;investissement du produit des seules cessions mais en l&#8217;&#233;largissant &#233;galement au produit des autres op&#233;rations permettant un r&#233;investissement dans une activit&#233; op&#233;rationnelle.</p><p style=\"text-align: justify;\">La transmission d&#8217;entreprise est un sujet vital pour l&#8217;&#233;conomie fran&#231;aise, en particulier dans nos territoires ruraux, et notamment en Haute-Savoie. Alors que les petites et moyennes entreprises (PME) et les entreprises de taille interm&#233;diaire (ETI) repr&#233;sentent la majeure part de l&#8217;emploi en France, 20&#160;% des dirigeants des PME sont &#226;g&#233;s de plus de 60 ans et plus de 60&#160;% des dirigeants d&#8217;ETI ont au moins 55 ans. Le nombre d&#8217;entreprises &#224; transmettre dans les prochaines ann&#233;es va donc consid&#233;rablement augmenter. Or la transmission d&#8217;une entreprise repr&#233;sente un moment d&#233;licat&#160;: l&#8217;existence d&#8217;un repreneur int&#233;ress&#233; et l&#8217;acc&#232;s au financement constituent deux premi&#232;res difficult&#233;s, auxquelles s&#8217;ajoute la question du maintien de l&#8217;emploi dans les territoires&#160;&#8211;&#160;les repreneurs pouvant &#234;tre tent&#233;s de r&#233;duire la masse salariale lorsqu&#8217;ils restructurent l&#8217;activit&#233;.</p><p style=\"text-align: justify;\">Le projet de loi relatif &#224; la croissance et la transformation des entreprises pr&#233;voit, dans son chapitre Ier, un ensemble de mesures visant &#171;&#160;&#224; lib&#233;rer les entreprises, pour en faciliter la cr&#233;ation, mieux accompagner leur croissance, faciliter le rebond des entreprises et des entrepreneurs et rendre les transmissions d&#8217;entreprises plus fluides&#160;&#187;. Sur ce dernier point, cet amendement vise &#224; aller plus loin et profiter du travail de co-construction l&#233;gislative de nos coll&#232;gues s&#233;nateurs.</p>"
  },
  "representations": [
    {
      "nom": "PDF",
      "typeMime": {
        "type": "application",
        "subType": "PDF"
      },
      "statutRepresentation": {
        "verbatim": true,
        "canonique": true,
        "officielle": true,
        "transcription": false,
        "enregistrement": false
      },
      "contenu": {
        "documentURI": "/15/amendements/1237/AN/389.pdf"
      }
    }
  ],
  "seanceDiscussion": "RUANR5L15S2019IDS21349",
  "sort": {
    "dateSaisie": "2018-10-05T18:08:20.000+02:00",
    "sortEnSeance": "Non soutenu"
  },
  "dateDepot": "2018-09-19T02:00:00.000+02:00",
  "dateDistribution": "2018-09-27T02:00:00.000+02:00",
  "article99": "0",
  "loiReference": {
    "codeLoi": "CGI",
    "divisionCodeLoi": "150-0 B"
  }
}