{
  "uid": "AMANR5L15PO757134B1673P0D1N441",
  "identifiant": {
    "legislature": "15",
    "numero": "441",
    "numRect": "0",
    "saisine": {
      "texteLegislatifRef": "PRJLANR5L15B1673",
      "numeroPartiePLF": "0",
      "organeExamen": "PO757134",
      "mentionSecondeDeliberation": "0"
    }
  },
  "numeroLong": "441",
  "etapeTexte": "Nouvelle Lecture",
  "triAmendement": "taaaaaaaaaaaaaaaaaaaaaaaaaaaaaaaaaaaaaaaaaaaaaaaaatdi",
  "cardinaliteAmdtMultiples": "1",
  "etat": "Discuté",
  "signataires": {
    "auteur": {
      "typeAuteur": "Depute",
      "acteurRef": "PA608016",
      "groupePolitiqueRef": "PO730934"
    },
    "cosignatairesRefs": [
      "PA718784",
      "PA720644",
      "PA720630",
      "PA721506",
      "PA267429",
      "PA267289",
      "PA330684",
      "PA266776",
      "PA608016"
    ],
    "texteAffichable": "Mme&#160;Louwagie,  M.&#160;Door, M.&#160;Minot, M.&#160;Reiss, M.&#160;Nury, Mme&#160;Val&#233;rie&#160;Boyer, M.&#160;Cinieri, M.&#160;Pauget et Mme&#160;Kuster"
  },
  "pointeurFragmentTexte": {
    "division": {
      "titre": "Article 71 quater AA",
      "articleDesignationCourte": "ART. 71 QUATER AA",
      "type": "ARTICLE",
      "avantAApres": "A",
      "divisionRattachee": "ARTICLE 71 QUATER AA",
      "urlDivisionTexteVise": "/15/textes/1673.asp#D_Article_71_quater_AA"
    }
  },
  "corps": {
    "dispositif": "<p style=\"text-align: justify;\">Supprimer cet article.</p>",
    "exposeSommaire": "<p style=\"text-align: justify;\">L&#8217;article&#160;71 ter du texte adopt&#233; par l'Assembl&#233;e habilitait le Gouvernement &#224; l&#233;gif&#233;rer par voie d&#8217;ordonnance afin de mettre fin au tarif r&#233;glement&#233; du gaz pour les particuliers et de l&#8217;&#233;lectricit&#233; pour les entreprises &#233;lectro-intensives. Le S&#233;nat, par souci de ne pas soustraire cette question essentielle du d&#233;bat parlementaire, a remplac&#233; cette habilitation par trois articles de l&#233;gislation directe (articles 71 ter et 71 quater AA et AB).&#160;</p><p>Ceci &#233;tant, le v&#233;hicule l&#233;gislatif choisi par le Gouvernement en premier lieu &#233;tait particuli&#232;rement surprenant&#160;en ce qu'il ne portait d&#8217;aucune mani&#232;re que ce soit sur les questions d&#8217;&#233;nergies ou du droit des consommateurs, et n&#8217;avait fait l&#8217;objet d&#8217;aucune &#233;tude d&#8217;impact en bonne et due forme.</p><p>En outre, il a &#233;t&#233; soulev&#233; qu&#8217;il parait encore plus surprenant que le gouvernement d&#233;fende une telle proposition &#224; la veille de l&#8217;hiver, ainsi qu&#8217;apr&#232;s une augmentation massive des co&#251;ts de l&#8217;&#233;nergie touchant l&#8217;ensemble des m&#233;nages fran&#231;ais.</p><p>Le tarif r&#233;glement&#233; est consid&#233;r&#233; par les Fran&#231;ais comme un acquis qu&#8217;ils ne souhaitent aucunement remettre en cause&#160;: il permet un tarif fixe, non volatile et moins soumis aux fluctuations du march&#233;. D&#8217;ailleurs, nos voisins&#160;europ&#233;ens ayant pris la d&#233;cision de supprimer ce type de tarif ont vu les co&#251;ts du gaz et de l&#8217;&#233;lectricit&#233; exploser.</p><p>Par ailleurs, la fin du tarif r&#233;glement&#233; pour les entreprises &#233;lectro-intensives n&#8217;est rien d&#8217;autre qu&#8217;un nouveau coup dur port&#233; aux entreprises industrielles, le tarif r&#232;glement&#233; leur offrant la possibilit&#233; d&#8217;avoir recours &#224; une source &#233;nerg&#233;tique &#224; tarif fixe et donc moins volatile. Revenir sur ce tarif risquera de mettre &#224; mal l&#8217;activit&#233; de beaucoup de petites entreprises industrielles.</p><p>C&#8217;est pourquoi il convient, en d&#233;pit de l'intention louable du S&#233;nat de soumettre cette question au d&#233;bat parlementaire, de supprimer ces articles afin d&#8217;&#233;tudier cette question comme il se doit, comme par exemple dans le cadre de la programmation pluriannuelle de l&#8217;&#233;nergie (PPE), et non au d&#233;tour d&#8217;un texte ayant pour vocation de simplifier la vie des entreprises et des entrepreneurs.</p>"
  },
  "representations": [
    {
      "nom": "PDF",
      "typeMime": {
        "type": "application",
        "subType": "PDF"
      },
      "statutRepresentation": {
        "verbatim": true,
        "canonique": true,
        "officielle": true,
        "transcription": false,
        "enregistrement": false
      },
      "contenu": {
        "documentURI": "/15/amendements/1673/CSPACTE/441.pdf"
      }
    }
  ],
  "sort": {
    "dateSaisie": "2019-03-07T17:10:51.000+01:00",
    "sortEnSeance": "Non soutenu"
  },
  "dateDepot": "2019-02-28T01:00:00.000+01:00",
  "dateDistribution": "2019-03-06T01:00:00.000+01:00",
  "article99": "0",
  "loiReference": {}
}