{
  "uid": "AMANR5L15PO420120B1681P0D1N1380",
  "identifiant": {
    "legislature": "15",
    "numero": "1380",
    "numRect": "0",
    "saisine": {
      "texteLegislatifRef": "PRJLANR5L15B1681",
      "numeroPartiePLF": "0",
      "organeExamen": "PO420120",
      "mentionSecondeDeliberation": "0"
    }
  },
  "numeroLong": "AS1380",
  "etapeTexte": "1ère lecture (1ère assemblée saisie)",
  "triAmendement": "bpaaaaaaaaaaaaaaaaaaaaaaaaaaaaaaaaaaaaaaaaaaaaaaaaaaadhvzxhwlzznzy",
  "cardinaliteAmdtMultiples": "1",
  "etat": "Retiré",
  "signataires": {
    "auteur": {
      "typeAuteur": "Depute",
      "acteurRef": "PA721246",
      "groupePolitiqueRef": "PO730964"
    },
    "cosignatairesRefs": [
      "PA719858",
      "PA718728",
      "PA722102",
      "PA719540",
      "PA721246",
      "PA721336",
      "PA718706",
      "PA720480",
      "PA718694",
      "PA720362",
      "PA719186",
      "PA719756",
      "PA719512",
      "PA720916",
      "PA334768",
      "PA720074",
      "PA720738",
      "PA719570",
      "PA721466",
      "PA718744",
      "PA720512",
      "PA718810",
      "PA720952",
      "PA608083",
      "PA719842",
      "PA722268",
      "PA642788",
      "PA719980",
      "PA719350",
      "PA719032",
      "PA331835",
      "PA721710",
      "PA722022",
      "PA722126",
      "PA720170",
      "PA718910",
      "PA717379",
      "PA720932",
      "PA720046"
    ],
    "texteAffichable": "Mme&#160;Gaillot,  Mme&#160;Tamarelle-Verhaeghe, Mme&#160;Bagarry, M.&#160;Bouyx, M.&#160;Pietraszewski, M.&#160;Belhaddad, M.&#160;Borowczyk, Mme&#160;Bourguignon, Mme&#160;Brocard, M.&#160;Chiche, Mme&#160;Cloarec, M.&#160;Da Silva, M.&#160;Marc&#160;Delatte, Mme&#160;Dufeu Schubert, Mme&#160;Fabre, Mme&#160;Fontaine-Domeizel, Mme&#160;Grandjean, Mme&#160;Iborra, Mme&#160;Janvier, Mme&#160;Khattabi, M.&#160;Laabid, Mme&#160;Lazaar, Mme&#160;Lecocq, Mme&#160;Limon, M.&#160;Maillard, M.&#160;Michels, Mme&#160;Peyron, Mme&#160;Pitollat, Mme&#160;Robert, Mme&#160;Romeiro Dias, M.&#160;Tach&#233;, M.&#160;Touraine, Mme&#160;Toutut-Picard, Mme&#160;Vanceunebrock-Mialon, Mme&#160;Vidal, Mme&#160;Vignon, M.&#160;V&#233;ran, Mme&#160;Wonner et M.&#160;Le Gendre"
  },
  "pointeurFragmentTexte": {
    "division": {
      "titre": "Article 7",
      "articleDesignationCourte": "APRÈS ART. 7",
      "type": "ARTICLE",
      "avantAApres": "Apres",
      "divisionRattachee": "APRÈS L'ARTICLE 7, insérer l'article suivant:",
      "articleAdditionnel": "1",
      "urlDivisionTexteVise": "/15/textes/1681.asp#D_Article_7"
    }
  },
  "corps": {
    "dispositif": "<p style=\"text-align: justify;\">I.&#160;&#8211;&#160;L&#8217;article L.&#160;5125&#8209;1&#8209;1 A du code de la sant&#233; publique est ainsi modifi&#233;&#160;:</p><p style=\"text-align: justify;\">1&#176;&#160;Apr&#232;s le 9&#176;&#160;, il est ins&#233;r&#233; un 10&#176;&#160;ainsi r&#233;dig&#233;&#160;:</p><p style=\"text-align: justify;\">&#171;&#160;10&#176;&#160;Peuvent, dans le cadre de protocoles inscrits dans les projets de sant&#233; des communaut&#233;s professionnelles territoriales de sant&#233; d&#233;finies &#224; l&#8217;article L.&#160;1434&#8209;12, d&#233;livrer des m&#233;dicaments dont la liste est fix&#233;e par arr&#234;t&#233;, pris apr&#232;s avis de la Haute autorit&#233; de sant&#233;, et sur la base de protocoles d&#233;finis par celle-ci.</p><p style=\"text-align: justify;\">2&#176;&#160;Le dernier alin&#233;a est compl&#233;t&#233; par une phrase ainsi r&#233;dig&#233;e&#160;: &#171;&#160;Un d&#233;cret fixe les conditions d&#8217;application du 10&#176;, notamment les conditions de formation pr&#233;alable des pharmaciens et les modalit&#233;s d&#8217;information du m&#233;decin traitant.&#160;&#187;</p><p style=\"text-align: justify;\">II.&#160;&#8211;&#160;Le I entre en vigueur au 1<sup>er</sup> janvier 2020.</p>",
    "exposeSommaire": "<p style=\"text-align: justify;\">Cet amendement est inspir&#233; du syst&#232;me suisse &#171;&#160;Net Care&#160;&#187;, permettant aux pharmaciens de dispenser des consultations de premier recours pour des situations simples en suivant des arbres de d&#233;cision b&#226;tis entre pharmaciens et m&#233;decins.</p><p style=\"text-align: justify;\">Le dispositif propos&#233; ici permettrait aux pharmaciens d&#8217;officine, dans le cadre de d&#233;marches inscrites dans les projets de sant&#233; des CPTS, de d&#233;livrer certains m&#233;dicaments, selon des protocoles &#233;tablis par la HAS. Il s&#8217;agirait notamment du traitement des cystites aigu&#235;s ou de certaines angines.</p>"
  },
  "representations": [
    {
      "nom": "PDF",
      "typeMime": {
        "type": "application",
        "subType": "PDF"
      },
      "statutRepresentation": {
        "verbatim": true,
        "canonique": true,
        "officielle": true,
        "transcription": false,
        "enregistrement": false
      },
      "contenu": {
        "documentURI": "/15/amendements/1681/CION-SOC/AS1380.pdf"
      }
    }
  ],
  "dateDepot": "2019-03-08T01:00:00.000+01:00",
  "dateDistribution": "2019-03-12T01:00:00.000+01:00",
  "article99": "0",
  "loiReference": {
    "codeLoi": "santé publique",
    "divisionCodeLoi": "l5125-1-1 A"
  }
}