{
  "uid": "AMANR5L15PO420120B1681P0D1N934",
  "identifiant": {
    "legislature": "15",
    "numero": "934",
    "numRect": "0",
    "saisine": {
      "texteLegislatifRef": "PRJLANR5L15B1681",
      "numeroPartiePLF": "0",
      "organeExamen": "PO420120",
      "mentionSecondeDeliberation": "0"
    }
  },
  "numeroLong": "AS934",
  "etapeTexte": "1ère lecture (1ère assemblée saisie)",
  "triAmendement": "caaaaaaaaaaaaaaaaaaaaaaaaaaaaaaaaaaaaaaaaaaaaaaaaabbkkkzw",
  "cardinaliteAmdtMultiples": "1",
  "etat": "Discuté",
  "signataires": {
    "auteur": {
      "typeAuteur": "Depute",
      "acteurRef": "PA642764",
      "groupePolitiqueRef": "PO758835"
    },
    "cosignatairesRefs": [
      "PA340357",
      "PA643145",
      "PA508",
      "PA332614",
      "PA610681",
      "PA333285",
      "PA342415",
      "PA335054",
      "PA1008",
      "PA335532",
      "PA1592",
      "PA609332",
      "PA719930",
      "PA337483",
      "PA720988",
      "PA608011",
      "PA340343",
      "PA608741",
      "PA429893",
      "PA1198",
      "PA608695",
      "PA333818",
      "PA608172",
      "PA642764",
      "PA267233",
      "PA609590",
      "PA1809",
      "PA607553",
      "PA605069"
    ],
    "texteAffichable": "M.&#160;Aviragnet,  Mme&#160;Bareigts, Mme&#160;Bi&#233;mouret, M.&#160;Vallaud, Mme&#160;Rabault, Mme&#160;Battistel, M.&#160;Bouillon, M.&#160;Jean-Louis&#160;Bricout, M.&#160;Carvounas, M.&#160;Alain&#160;David, Mme&#160;Laurence&#160;Dumont, M.&#160;Faure, M.&#160;Garot, M.&#160;David&#160;Habib, M.&#160;Hutin, M.&#160;Juanico, Mme&#160;Karamanli, M.&#160;J&#233;r&#244;me&#160;Lambert, M.&#160;Letchimy, Mme&#160;Manin, Mme&#160;Pau-Langevin, Mme&#160;Pires Beaune, M.&#160;Potier, M.&#160;Pueyo, M.&#160;Saulignac, Mme&#160;Tolmont, Mme&#160;Untermaier, Mme&#160;Vainqueur-Christophe et Mme&#160;Victory"
  },
  "pointeurFragmentTexte": {
    "division": {
      "titre": "Article 8",
      "articleDesignationCourte": "ART. 8",
      "type": "ARTICLE",
      "avantAApres": "A",
      "divisionRattachee": "ARTICLE 8",
      "urlDivisionTexteVise": "/15/textes/1681.asp#D_Article_8"
    }
  },
  "corps": {
    "dispositif": "<p style=\"text-align: justify;\">Supprimer cet article.</p>",
    "exposeSommaire": "<p style=\"text-align: justify;\">Le groupe socialiste s'oppose &#224; la d&#233;marche du Gouvernement qui consiste &#224; l&#233;gif&#233;rer par ordonnances sur un sujet aussi important et structurant pour les territoires comme l'est le sujet de la carte hospitali&#232;re.</p><p>Nous demandons au Gouvernement de nous pr&#233;senter la carte hospitali&#232;re pr&#233;visionnelle des h&#244;pitaux de proximit&#233;.</p><p>Avec cet article le Gouvernement propose de d&#233;finir par la l'interm&#233;diaire d'une ordonnance les crit&#232;res caract&#233;risant les h&#244;pitaux de proximit&#233;s. Cet article organise le d&#233;classement des centres hospitaliers de province et p&#233;riph&#233;riques pour les requalifier en h&#244;pitaux de proximit&#233; avec, en pr&#233;vision, des fermetures de plateaux techniques, de services d'urgences, de maternit&#233;s, etc.</p><p>Par ailleurs, on ne peut ignorer la tendance comptable et technocratique qui tend &#224; r&#233;duire l'activit&#233; des h&#244;pitaux faute de moyens, puis &#224; terme, &#224; organiser la fermeture de ces h&#244;pitaux par manque d'activit&#233;.</p><p>Actuellement, le Parlement m&#233;connait les crit&#232;res retenus pour le label \"h&#244;pital de proximit&#233;\", ainsi que la future carte hospitali&#232;re de France qui se dessine. Nous demandons donc la suppression de cet article contraire &#224; notre ambition de conserver des h&#244;pitaux de qualit&#233; dans tous les territoires de la R&#233;publique.</p>"
  },
  "representations": [
    {
      "nom": "PDF",
      "typeMime": {
        "type": "application",
        "subType": "PDF"
      },
      "statutRepresentation": {
        "verbatim": true,
        "canonique": true,
        "officielle": true,
        "transcription": false,
        "enregistrement": false
      },
      "contenu": {
        "documentURI": "/15/amendements/1681/CION-SOC/AS934.pdf"
      }
    }
  ],
  "sort": {
    "dateSaisie": "2019-03-13T19:53:12.000+01:00",
    "sortEnSeance": "Rejeté"
  },
  "dateDepot": "2019-03-08T01:00:00.000+01:00",
  "dateDistribution": "2019-03-12T01:00:00.000+01:00",
  "article99": "0",
  "loiReference": {}
}