{
  "uid": "AMANR5L15SEA717460BTC0971P0D1N287",
  "identifiant": {
    "legislature": "15",
    "numero": "287",
    "numRect": "0",
    "saisine": {
      "texteLegislatifRef": "PRJLANR5L15BTC0971",
      "numeroPartiePLF": "0",
      "organeExamen": "PO717460",
      "mentionSecondeDeliberation": "0"
    }
  },
  "numeroLong": "287",
  "etapeTexte": "1ère lecture (1ère assemblée saisie)",
  "triAmendement": "cc",
  "cardinaliteAmdtMultiples": "1",
  "etat": "Discuté",
  "signataires": {
    "auteur": {
      "typeAuteur": "Depute",
      "acteurRef": "PA718884",
      "groupePolitiqueRef": "PO730934"
    },
    "cosignatairesRefs": [
      "PA719318",
      "PA718884"
    ],
    "texteAffichable": "Mme&#160;Bazin-Malgras et Mme&#160;Anthoine"
  },
  "pointeurFragmentTexte": {
    "division": {
      "titre": "Article 18",
      "articleDesignationCourte": "ART. 18",
      "type": "ARTICLE",
      "avantAApres": "A",
      "divisionRattachee": "ARTICLE 18",
      "urlDivisionTexteVise": "/15/textes/0971.asp#D_Article_18"
    }
  },
  "corps": {
    "dispositif": "<p>Supprimer cet article.</p>",
    "exposeSommaire": "<p style=\"text-align: justify;\">La loi handicap du 11 f&#233;vrier 2005 est une de ces lois dont la R&#233;publique peut s&#8217;enorgueillir. Elle participe &#224; la construction du mod&#232;le de soci&#233;t&#233; de vivre ensemble qui est aux fondements du projet r&#233;publicain.</p><p style=\"text-align: justify;\">C&#8217;est une fiert&#233; et c&#8217;est cette fiert&#233; que le gouvernement veut nous enlever aujourd&#8217;hui.</p><p style=\"text-align: justify;\">L&#8217;accessibilit&#233; des logements est essentielle pour des personnes qui souffrent d&#8217;un handicap au quotidien et qui ne sauraient souffrir &#233;galement d&#8217;un manque de consid&#233;ration.</p><p style=\"text-align: justify;\">Par cet article, le Gouvernement va restreindre consid&#233;rablement le taux de logements accessibles aux personnes &#224; mobilit&#233; r&#233;duite. Celles-ci se verraient imposer des logements pr&#233;destin&#233;s et n&#8217;auraient plus la libert&#233; de choisir leur lieu de vie.</p><p style=\"text-align: justify;\">La localisation des logements accessibles ne correspondrait pas n&#233;cessairement aux besoins. Il faut en effet veiller &#224; des crit&#232;res environnementaux&#160;: proximit&#233; des services publics, des commerces, des diff&#233;rents modes de transports, etc...</p><p style=\"text-align: justify;\">La puissance publique ne respecte toujours pas la l&#233;gislation permettant &#224; ces citoyens de vivre une vie moins difficile, voil&#224; qu&#8217;elle souhaite les en priver.</p><p style=\"text-align: justify;\">Ce n&#8217;est pas acceptable, c&#8217;est pour cette raison que cet amendement s&#8217;oppose &#224; un tel recul.</p>"
  },
  "representations": [
    {
      "nom": "PDF",
      "typeMime": {
        "type": "application",
        "subType": "PDF"
      },
      "statutRepresentation": {
        "verbatim": true,
        "canonique": true,
        "officielle": true,
        "transcription": false,
        "enregistrement": false
      },
      "contenu": {
        "documentURI": "/15/amendements/0971/AN/287.pdf"
      }
    }
  ],
  "seanceDiscussion": "RUANR5L15S2018IDS21082",
  "sort": {
    "dateSaisie": "2018-06-01T18:40:13.000+02:00",
    "sortEnSeance": "Non soutenu"
  },
  "dateDepot": "2018-05-23T02:00:00.000+02:00",
  "dateDistribution": "2018-05-29T02:00:00.000+02:00",
  "article99": "0",
  "loiReference": {}
}