{
  "uid": "AMANR5L15PO59048B2272P1D1N1135",
  "identifiant": {
    "legislature": "15",
    "numero": "1135",
    "numRect": "0",
    "saisine": {
      "texteLegislatifRef": "PRJLANR5L15B2272",
      "numeroPartiePLF": "1",
      "organeExamen": "PO59048",
      "mentionSecondeDeliberation": "0"
    }
  },
  "numeroLong": "I-CF1135",
  "etapeTexte": "1ère lecture (1ère assemblée saisie)",
  "triAmendement": "duaaaaaaaaaaaaaaaaaaaaaaaaaaaaaaaaaaaaaaaaaaaaaaaagz",
  "cardinaliteAmdtMultiples": "1",
  "etat": "Irrecevable",
  "signataires": {
    "auteur": {
      "typeAuteur": "Depute",
      "acteurRef": "PA712015",
      "groupePolitiqueRef": "PO730934"
    },
    "cosignatairesRefs": [
      "PA267429",
      "PA767",
      "PA713448",
      "PA346218",
      "PA267450",
      "PA605036",
      "PA718850",
      "PA720630",
      "PA2377",
      "PA712015"
    ],
    "texteAffichable": "M.&#160;Dive,  M.&#160;R&#233;mi&#160;Delatte, M.&#160;Cattin, M.&#160;Abad, Mme&#160;Brenier, M.&#160;Masson, M.&#160;Cinieri, M.&#160;Cordier, M.&#160;Perrut et M.&#160;Minot"
  },
  "pointeurFragmentTexte": {
    "division": {
      "titre": "Article 16",
      "articleDesignationCourte": "APRÈS ART. 16",
      "type": "ARTICLE",
      "avantAApres": "Apres",
      "divisionRattachee": "APRÈS L'ARTICLE 16, insérer l'article suivant:",
      "articleAdditionnel": "1",
      "urlDivisionTexteVise": "/15/textes/2272A.asp#D_Article_16"
    }
  },
  "corps": {},
  "representations": [
    {
      "nom": "PDF",
      "typeMime": {
        "type": "application",
        "subType": "PDF"
      },
      "statutRepresentation": {
        "verbatim": true,
        "canonique": true,
        "officielle": true,
        "transcription": false,
        "enregistrement": false
      },
      "contenu": {
        "documentURI": "/15/amendements/2272A/CION_FIN/CF1135.pdf"
      }
    }
  ],
  "dateDepot": "2019-10-04T02:00:00.000+02:00",
  "dateDistribution": "2019-10-05T02:00:00.000+02:00",
  "article99": "0",
  "loiReference": {
    "codeLoi": "zz rapport"
  }
}