{
  "uid": "AMANR5L15SEA717460BTC2062P0D1N381",
  "identifiant": {
    "legislature": "15",
    "numero": "381",
    "numRect": "0",
    "saisine": {
      "texteLegislatifRef": "PIONANR5L15BTC2062",
      "numeroPartiePLF": "0",
      "organeExamen": "PO717460",
      "mentionSecondeDeliberation": "0"
    }
  },
  "numeroLong": "381",
  "etapeTexte": "1ère lecture (1ère assemblée saisie)",
  "triAmendement": "boaaaaaaaaaaaaaaaaaaaaaaaaaaaaaaaaaaaaaaaaaaaaaaaatx",
  "cardinaliteAmdtMultiples": "1",
  "amendementParent": "AMANR5L15SEA717460BTC2062P0D1N349",
  "etat": "Discuté",
  "signataires": {
    "auteur": {
      "typeAuteur": "Depute",
      "acteurRef": "PA721624",
      "groupePolitiqueRef": "PO730964"
    },
    "cosignatairesRefs": [
      "PA721624"
    ],
    "texteAffichable": "Mme&#160;Avia"
  },
  "pointeurFragmentTexte": {
    "division": {
      "titre": "Article 2",
      "articleDesignationCourte": "ART. 2",
      "type": "ARTICLE",
      "avantAApres": "A",
      "divisionRattachee": "ARTICLE 2",
      "urlDivisionTexteVise": "/15/textes/2062.asp#D_Article_2"
    },
    "alinea": {
      "avantAApres": "Apres",
      "numero": "10"
    }
  },
  "corps": {
    "dispositif": "<p style=\"text-align: justify;\">&#192; l&#8217;alin&#233;a&#160;2, substituer aux mots&#160;:</p><p style=\"text-align: justify;\">&#171;&#160;tout moyen&#160;&#187;</p><p style=\"text-align: justify;\">les mots&#160;:</p><p style=\"text-align: justify;\">&#171;&#160;les moyens appropri&#233;s&#160;&#187;.</p>",
    "exposeSommaire": "<p style=\"text-align: justify;\">Le pr&#233;sent amendement vise &#224; mieux d&#233;finir la port&#233;e de l&#8217;obligation de moyens relative &#224; la pr&#233;vention de la rediffusion des contenus manifestement haineux, afin que ces moyens ne conduisent pas &#224; emp&#234;cher la rediffusion &#171;&#160;pour motif l&#233;gitime&#160;&#187; de ces contenus, par exemple dans le but de les d&#233;noncer ou de les critiquer.</p>"
  },
  "representations": [
    {
      "nom": "PDF",
      "typeMime": {
        "type": "application",
        "subType": "PDF"
      },
      "statutRepresentation": {
        "verbatim": true,
        "canonique": true,
        "officielle": true,
        "transcription": false,
        "enregistrement": false
      },
      "contenu": {
        "documentURI": "/15/amendements/2062/AN/381.pdf"
      }
    }
  ],
  "seanceDiscussion": "RUANR5L15S2019IDS21751",
  "sort": {
    "dateSaisie": "2019-07-04T17:55:40.000+02:00",
    "sortEnSeance": "Adopté"
  },
  "dateDepot": "2019-07-02T02:00:00.000+02:00",
  "dateDistribution": "2019-07-04T02:00:00.000+02:00",
  "article99": "0",
  "loiReference": {}
}