{
  "uid": "AMANR5L15PO59051B0778P0D1N172",
  "identifiant": {
    "legislature": "15",
    "numero": "172",
    "numRect": "0",
    "saisine": {
      "texteLegislatifRef": "PRJLANR5L15B0778",
      "numeroPartiePLF": "0",
      "organeExamen": "PO59051",
      "mentionSecondeDeliberation": "0"
    }
  },
  "numeroLong": "CL172",
  "etapeTexte": "1ère lecture (1ère assemblée saisie)",
  "triAmendement": "afw",
  "cardinaliteAmdtMultiples": "1",
  "etat": "Discuté",
  "signataires": {
    "auteur": {
      "typeAuteur": "Depute",
      "acteurRef": "PA718860",
      "groupePolitiqueRef": "PO730958"
    },
    "cosignatairesRefs": [
      "PA721226",
      "PA588884",
      "PA720846",
      "PA722142",
      "PA719676",
      "PA718868",
      "PA721960",
      "PA719578",
      "PA721210",
      "PA721202",
      "PA720892",
      "PA721062",
      "PA720286",
      "PA720422",
      "PA718860",
      "PA720430",
      "PA2150"
    ],
    "texteAffichable": "Mme&#160;Taurine,  Mme&#160;Autain, M.&#160;Bernalicis, M.&#160;Coquerel, M.&#160;Corbi&#232;re, Mme&#160;Fiat, M.&#160;Lachaud, M.&#160;Larive, M.&#160;M&#233;lenchon, Mme&#160;Obono, Mme&#160;Panot, M.&#160;Prud&apos;homme, M.&#160;Quatennens, M.&#160;Ratenon, Mme&#160;Ressiguier, Mme&#160;Rubin et M.&#160;Ruffin"
  },
  "pointeurFragmentTexte": {
    "division": {
      "titre": "Article 4",
      "articleDesignationCourte": "APRÈS ART. 4",
      "type": "ARTICLE",
      "avantAApres": "Apres",
      "divisionRattachee": "APRÈS L'ARTICLE 4, insérer l'article suivant:",
      "articleAdditionnel": "1",
      "urlDivisionTexteVise": "/15/textes/0778.asp#D_Article_4"
    }
  },
  "corps": {
    "dispositif": "<p style=\"text-align: justify;\">&#171;&#160;Le Gouvernement remet au Parlement, dans un d&#233;lai de trois mois &#224; compter de la promulgation de la pr&#233;sente loi, un rapport d&#8217;information faisant un bilan d&#233;taill&#233; de la g&#233;n&#233;ralisation du dispositif de t&#233;l&#233;protection des personnes en grave danger (&#171;&#160;TGD&#160;&#187;).&#160;&#187;</p>",
    "exposeSommaire": "<p>Par cet amendement, nous souhaitons que le Gouvernement remette un rapport &#224; la repr&#233;sentation nationale permettant un bilan du dispositif de t&#233;l&#233;protection des personnes en grave danger (&#171; TGD &#187;).</p><p>Le rapport doit permettre de rendre compte de la r&#233;alit&#233; de sa g&#233;n&#233;ralisation en pr&#233;sentant notamment les contraintes budg&#233;taires et humaines, qui freinent sa r&#233;alisation. Il rend compte &#233;galement de la place de ce dispositif parmi l&#8217;ensemble des mesures visant &#224; lutter contre les violences faites aux femmes. Enfin, il associera des chercheurs et des associations.</p><p>Le dispositif TGD, parmi un ensemble de mesures de lutte contre les violences faites aux femmes, consiste &#224; assurer l&#8217;effectivit&#233; de la protection des personnes particuli&#232;rement vuln&#233;rables et en grave danger, victimes de viol ou de violences conjugales.</p><p>G&#233;n&#233;ralis&#233; par la loi du 4 ao&#251;t 2014 sur l&#8217;&#233;galit&#233; r&#233;elle entre les femmes et les hommes et consacr&#233; dans un nouvel article 41-3-1 du code de proc&#233;dure p&#233;nale, l&#8217;objectif &#233;tait d&#8217;avoir sur l&#8217;ensemble du territoire fran&#231;ais une r&#233;ponse harmonis&#233;e aux violences conjugales. Mais ce dispositif TGD reste &#224; l&#8217;heure actuelle in&#233;galement r&#233;parti et certains parquets ne sont pas suffisamment dot&#233;s. Or ce dispositif est une composante importante parmi d&#8217;autres mesures et a d&#233;montr&#233; son efficacit&#233; contre les violences faites aux femmes.</p><p>Il faut rappeler que ce dispositif s&#8217;adresse aux victimes de violences au sein des couples et aux victimes de viol. Le procureur d&#233;cide de l&#8217;attribution d&#8217;un t&#233;l&#233;phone pour une dur&#233;e de six mois renouvelable et permet &#224; la personne victime d&#8217;&#234;tre mieux rep&#233;r&#233;e par les forces de s&#233;curit&#233; en facilitant la rapidit&#233; de l&#8217;intervention. Concr&#232;tement, le TGD est un t&#233;l&#233;phone portable disposant d&#8217;un bouton d&#8217;urgence, permettant &#224; la victime de joindre, en cas de danger, une plateforme d&#8217;assistance accessible 24h/24 et 7J/7. En cas de danger, le t&#233;l&#233;op&#233;rateur reli&#233; par un canal d&#233;di&#233; &#224; la salle de commandement op&#233;rationnelle de la police et de la gendarmerie, demande imm&#233;diatement l&#8217;intervention des forces de l&#8217;ordre.</p>"
  },
  "representations": [
    {
      "nom": "PDF",
      "typeMime": {
        "type": "application",
        "subType": "PDF"
      },
      "statutRepresentation": {
        "verbatim": true,
        "canonique": true,
        "officielle": true,
        "transcription": false,
        "enregistrement": false
      },
      "contenu": {
        "documentURI": "/15/amendements/0778/CION_LOIS/CL172.pdf"
      }
    }
  ],
  "sort": {
    "dateSaisie": "2018-05-09T23:32:03.000+02:00",
    "sortEnSeance": "Rejeté"
  },
  "dateDepot": "2018-05-04T02:00:00.000+02:00",
  "dateDistribution": "2018-05-07T02:00:00.000+02:00",
  "article99": "0",
  "loiReference": {
    "codeLoi": "zzzz"
  }
}