{
  "uid": "AMANR5L15SEA717460B0235P2D1N1468",
  "identifiant": {
    "legislature": "15",
    "numero": "1468",
    "numRect": "0",
    "saisine": {
      "texteLegislatifRef": "PRJLANR5L15B0235",
      "numeroPartiePLF": "2",
      "organeExamen": "PO717460",
      "mentionSecondeDeliberation": "0"
    }
  },
  "numeroLong": "II-1468",
  "etapeTexte": "1ère lecture (1ère assemblée saisie)",
  "triAmendement": "rn",
  "cardinaliteAmdtMultiples": "1",
  "etat": "Discuté",
  "signataires": {
    "auteur": {
      "typeAuteur": "Depute",
      "acteurRef": "PA608172",
      "groupePolitiqueRef": "PO730946"
    },
    "cosignatairesRefs": [
      "PA342415",
      "PA267233",
      "PA719930",
      "PA720988",
      "PA333818",
      "PA405480",
      "PA333285",
      "PA609590",
      "PA429893",
      "PA1198",
      "PA337483",
      "PA335532",
      "PA335054",
      "PA643145",
      "PA340343",
      "PA608172",
      "PA607553",
      "PA335999",
      "PA642764",
      "PA609332",
      "PA588886",
      "PA1592",
      "PA330357",
      "PA332614",
      "PA608011",
      "PA1809",
      "PA608695",
      "PA610681",
      "PA605069",
      "PA508",
      "PA1008"
    ],
    "texteAffichable": "Mme&#160;Pires Beaune,  M.&#160;Dussopt, M.&#160;Pupponi, Mme&#160;Rabault, M.&#160;Jean-Louis&#160;Bricout, M.&#160;David&#160;Habib, Mme&#160;Karamanli, Mme&#160;Untermaier, M.&#160;Faure, M.&#160;Aviragnet, Mme&#160;Bareigts, Mme&#160;Batho, Mme&#160;Battistel, Mme&#160;Bi&#233;mouret, M.&#160;Bouillon, M.&#160;Carvounas, M.&#160;Alain&#160;David, Mme&#160;Laurence&#160;Dumont, M.&#160;Garot, M.&#160;Hutin, M.&#160;Juanico, M.&#160;J&#233;r&#244;me&#160;Lambert, M.&#160;Le Foll, M.&#160;Letchimy, Mme&#160;Manin, Mme&#160;Pau-Langevin, M.&#160;Potier, M.&#160;Pueyo, M.&#160;Saulignac, Mme&#160;Vainqueur-Christophe et M.&#160;Vallaud"
  },
  "pointeurFragmentTexte": {
    "missionVisee": {
      "idMissionAN": "26",
      "libelleMission": "Relations avec les collectivités territoriales",
      "codeMissionPLF": "B",
      "libelleMissionPLF": "Répartition, par mission et programme, des crédits du budget général"
    },
    "division": {
      "titre": "Article 59",
      "articleDesignationCourte": "ART. 59",
      "type": "ARTICLE",
      "avantAApres": "A",
      "divisionRattachee": "ARTICLE 59",
      "urlDivisionTexteVise": "/15/textes/0235C.asp#D_Article_59"
    },
    "alinea": {
      "numero": "17"
    }
  },
  "corps": {
    "dispositif": "<p style=\"text-align: justify;\">&#192; l&#8217;alin&#233;a&#160;17, supprimer les mots&#160;:</p><p style=\"text-align: justify;\">&#171;&#160;la r&#233;gion ou dans&#160;&#187;.</p><p style=\"text-align: justify;\">&#160;</p>",
    "exposeSommaire": "<p style=\"text-align: justify;\">Les subventions accord&#233;es au titre de la DETR sont accord&#233;es par le pr&#233;fet de d&#233;partement. Il est n&#233;cessaire d&#8217;harmoniser les r&#232;gles entre les diff&#233;rents fonds d&#8217;investissement destin&#233;s aux collectivit&#233;s territoriales. Aussi, cet amendement propose que le pr&#233;fet de d&#233;partement accorde les subventions au titre de la DSIL.</p>"
  },
  "representations": [
    {
      "nom": "PDF",
      "typeMime": {
        "type": "application",
        "subType": "PDF"
      },
      "statutRepresentation": {
        "verbatim": true,
        "canonique": true,
        "officielle": true,
        "transcription": false,
        "enregistrement": false
      },
      "contenu": {
        "documentURI": "/15/amendements/0235C/AN/1468.pdf"
      }
    }
  ],
  "seanceDiscussion": "RUANR5L15S2018IDS20760",
  "sort": {
    "dateSaisie": "2017-11-15T17:34:38.000+01:00",
    "sortEnSeance": "Rejeté"
  },
  "dateDepot": "2017-11-10T01:00:00.000+01:00",
  "dateDistribution": "2017-11-13T01:00:00.000+01:00",
  "article99": "0",
  "loiReference": {}
}