{
  "uid": "AMANR5L15SEA717460BTC2206P0D1N296",
  "identifiant": {
    "legislature": "15",
    "numero": "296",
    "numRect": "0",
    "saisine": {
      "texteLegislatifRef": "PRJLANR5L15BTC2206",
      "numeroPartiePLF": "0",
      "organeExamen": "PO717460",
      "mentionSecondeDeliberation": "0"
    }
  },
  "numeroLong": "296",
  "etapeTexte": "Nouvelle Lecture",
  "triAmendement": "joiaaaaaaaaaaaaaaaaaaaaaaaaaaaaaaaaaaaaaaaaaaaaaaaas",
  "cardinaliteAmdtMultiples": "1",
  "etat": "Discuté",
  "signataires": {
    "auteur": {
      "typeAuteur": "Depute",
      "acteurRef": "PA721932",
      "groupePolitiqueRef": "PO723569"
    },
    "cosignatairesRefs": [
      "PA721932"
    ],
    "texteAffichable": "Mme&#160;Lorho"
  },
  "pointeurFragmentTexte": {
    "division": {
      "titre": "Article 33 ter",
      "articleDesignationCourte": "ART. 33 TER",
      "type": "ARTICLE",
      "avantAApres": "A",
      "divisionRattachee": "ARTICLE 33 TER",
      "urlDivisionTexteVise": "/15/textes/2206.asp#D_Article_33_ter"
    }
  },
  "corps": {
    "dispositif": "<p>Supprimer cet article.</p>",
    "exposeSommaire": "<p style=\"text-align: justify;\">Les services r&#233;guliers de transport de voyageurs empruntent des itin&#233;raires faisant l&#8217;objet d&#8217;une reconnaissance pr&#233;alable obligatoire par les conducteurs et pour lesquels la pr&#233;sence de passage &#224; niveau est connue. En outre, les itin&#233;raires alternatifs permettant d&#8217;&#233;viter les passages &#224; niveaux sont privil&#233;gi&#233;s dans la mesure du possible. S&#8217;agissant des services touristiques, ils disposent tous de syst&#232;mes de g&#233;olocalisation leur permettant d&#8217;adapter leur itin&#233;raire.</p>"
  },
  "representations": [
    {
      "nom": "PDF",
      "typeMime": {
        "type": "application",
        "subType": "PDF"
      },
      "statutRepresentation": {
        "verbatim": true,
        "canonique": true,
        "officielle": true,
        "transcription": false,
        "enregistrement": false
      },
      "contenu": {
        "documentURI": "/15/amendements/2206/AN/296.pdf"
      }
    }
  ],
  "seanceDiscussion": "RUANR5L15S2019IDS21806",
  "sort": {
    "dateSaisie": "2019-09-12T17:41:41.000+02:00",
    "sortEnSeance": "Non soutenu"
  },
  "dateDepot": "2019-09-05T02:00:00.000+02:00",
  "dateDistribution": "2019-09-10T02:00:00.000+02:00",
  "article99": "0",
  "loiReference": {}
}