{
  "uid": "AMANR5L15SEA717460B2272P1D1N2371",
  "identifiant": {
    "legislature": "15",
    "numero": "2371",
    "numRect": "0",
    "saisine": {
      "texteLegislatifRef": "PRJLANR5L15B2272",
      "numeroPartiePLF": "1",
      "organeExamen": "PO717460",
      "mentionSecondeDeliberation": "0"
    }
  },
  "numeroLong": "I-2371",
  "etapeTexte": "1ère lecture (1ère assemblée saisie)",
  "triAmendement": "auaaaaaaaaaaaaaaaaaaaaaaaaaaaaaaaaaaaaaaaaaaaaaaaagae",
  "cardinaliteAmdtMultiples": "1",
  "etat": "Discuté",
  "signataires": {
    "auteur": {
      "typeAuteur": "Rapporteur",
      "acteurRef": "PA718962",
      "organeRef": "PO419865",
      "groupePolitiqueRef": "PO730964"
    },
    "cosignatairesRefs": [
      "PA609520",
      "PA720538",
      "PA718962"
    ],
    "texteAffichable": "M.&#160;Zulesi, rapporteur pour avis au nom de la commission du d&#233;veloppement durable et de l&apos;am&#233;nagement du territoire,  Mme&#160;Pompili et Mme&#160;De Temmerman"
  },
  "pointeurFragmentTexte": {
    "division": {
      "titre": "Article 3",
      "articleDesignationCourte": "APRÈS ART. 3",
      "type": "ARTICLE",
      "avantAApres": "Apres",
      "divisionRattachee": "APRÈS L'ARTICLE 3, insérer l'article suivant:",
      "articleAdditionnel": "1",
      "urlDivisionTexteVise": "/15/textes/2272A.asp#D_Article_3"
    }
  },
  "corps": {
    "dispositif": "<p style=\"text-align: justify;\">I.&#160;&#8211;&#160;Le code g&#233;n&#233;ral des imp&#244;ts est ainsi modifi&#233;&#160;:</p><p style=\"text-align: justify;\">1&#176;&#160;Apr&#232;s l&#8217;article&#160;691&#160;<i>bis</i>, il est ins&#233;r&#233; un article&#160;691&#160;<i>ter</i> ainsi r&#233;dig&#233;&#160;:</p><p style=\"text-align: justify;\">&#171;&#160;<i>Art.&#160;691&#160;</i><i>ter</i>.&#160;&#8211;&#160;Les actes d&#8217;acquisition vis&#233;s &#224; l&#8217;article&#160;1594&#8209;0&#160;G&#160;<i>bis</i> donnent lieu &#224; la perception d&#8217;une taxe de publicit&#233; fonci&#232;re ou d&#8217;un droit d&#8217;enregistrement de 125&#160;&#8364;.&#160;&#187;&#160;;</p><p style=\"text-align: justify;\">2&#176;&#160;Apr&#232;s l&#8217;article&#160;1594&#8209;0&#160;G, il est ins&#233;r&#233; un article&#160;1594&#8209;0&#160;G&#160;<i>bis</i> ainsi r&#233;dig&#233;&#160;:</p><p style=\"text-align: justify;\">&#171;&#160;<i>Art.&#160;1594&#8209;0&#160;G&#160;</i>bis.&#160;&#8211;&#160;Sous r&#233;serve de l&#8217;article&#160;691&#160;<i>ter</i>, sont exon&#233;r&#233;es de taxe de publicit&#233; fonci&#232;re ou de droits d&#8217;enregistrement les acquisitions d&#8217;immeubles situ&#233;s sur des sites pollu&#233;s en friche lorsque l&#8217;acte d&#8217;acquisition contient l&#8217;engagement pris par l&#8217;acqu&#233;reur de confier, dans un d&#233;lai de deux ans, &#224; une soci&#233;t&#233; certifi&#233;e dans le domaine des sites et sols pollu&#233;s ou &#233;quivalent, la r&#233;alisation de diagnostics de pollution et, le cas &#233;ch&#233;ant, de travaux de d&#233;pollution.&#160;&#187;</p><p style=\"text-align: justify;\">II.&#160;&#8211;&#160;Le I s&#8217;applique aux acquisitions d&#8217;immeubles r&#233;alis&#233;es &#224; compter du 1<sup>er</sup>&#160;janvier&#160;2020.</p><p style=\"text-align: justify;\">III.&#160;&#8211;&#160;La perte de recettes pour l&#8217;&#201;tat est compens&#233;e &#224; due concurrence par la cr&#233;ation d&#8217;une taxe additionnelle aux droits mentionn&#233;s aux articles 575 et 575 A du code g&#233;n&#233;ral des imp&#244;ts.</p>",
    "exposeSommaire": "<p>Le Pr&#233;sident de la R&#233;publique a fix&#233; des objectifs ambitieux en mati&#232;re de lutte contre l&#8216;artificialisation des sols, limitation de l&#8217;&#233;talement urbain et pr&#233;servation de la biodiversit&#233;, le 6 mai dernier &#224; l&#8217;issue de sa rencontre avec les experts de l&#8217;IPBES. Cet article propose par cons&#233;quent une disposition fiscale incitative en faveur de la restauration de la qualit&#233; des sols, qui participe &#224; la pr&#233;servation de la biodiversit&#233; et de la sant&#233; publique. La pr&#233;sente disposition fiscale s&#8217;inspire des r&#233;gimes de faveur pr&#233;vus entre autres &#224; l&#8217;article&#160;1594 F et suivants du Code G&#233;n&#233;ral des Imp&#244;ts. En incitant &#224; l&#8217;acquisition de friches pollu&#233;es, elle contribuerait de ce fait &#224; limiter l&#8217;&#233;talement urbain et l&#8217;artificialisation de terres agricoles.</p><p style=\"text-align: justify;\">Par ailleurs, en subordonnant cette incitation fiscale au fait de confier les diagnostics de pollution et/ou les travaux de d&#233;pollution &#224; des soci&#233;t&#233;s certifi&#233;es dans le domaine des Sites et Sols Pollu&#233;s (SSP) ou &#233;quivalent, l&#8217;&#201;tat s&#8217;assurerait que les solutions propos&#233;es sont en ad&#233;quation avec la m&#233;thodologie nationale de gestion des sites et sols pollu&#233;s &#233;labor&#233;e par la Direction g&#233;n&#233;rale de la pr&#233;vention des risques et respectent l&#8217;&#233;tat de l&#8217;art dans ce domaine, c&#8217;est &#224; dire la norme NFX31&#8209;620, issue des travaux de la commission AFNOR X31EF pr&#233;sid&#233;e par un repr&#233;sentant de la DGPR.</p>"
  },
  "representations": [
    {
      "nom": "PDF",
      "typeMime": {
        "type": "application",
        "subType": "PDF"
      },
      "statutRepresentation": {
        "verbatim": true,
        "canonique": true,
        "officielle": true,
        "transcription": false,
        "enregistrement": false
      },
      "contenu": {
        "documentURI": "/15/amendements/2272A/AN/2371.pdf"
      }
    }
  ],
  "seanceDiscussion": "RUANR5L15S2020IDS21867",
  "sort": {
    "dateSaisie": "2019-10-17T16:19:04.000+02:00",
    "sortEnSeance": "Rejeté"
  },
  "dateDepot": "2019-10-10T02:00:00.000+02:00",
  "dateDistribution": "2019-10-16T02:00:00.000+02:00",
  "article99": "0",
  "loiReference": {
    "codeLoi": "CGI",
    "divisionCodeLoi": "1594-0 G bis"
  }
}