{
  "uid": "AMANR5L15SEA717460B1255P1D1N2259",
  "identifiant": {
    "legislature": "15",
    "numero": "2259",
    "numRect": "0",
    "saisine": {
      "texteLegislatifRef": "PRJLANR5L15B1255",
      "numeroPartiePLF": "1",
      "organeExamen": "PO717460",
      "mentionSecondeDeliberation": "0"
    }
  },
  "numeroLong": "I-2259",
  "etapeTexte": "1ère lecture (1ère assemblée saisie)",
  "triAmendement": "eeaaaaaaaaaaaaaaaaaaaaaaaaaaaaaaaaaaaaaaaaaaaaaaaabknzzzu",
  "cardinaliteAmdtMultiples": "1",
  "etat": "Discuté",
  "signataires": {
    "auteur": {
      "typeAuteur": "Depute",
      "acteurRef": "PA2377",
      "groupePolitiqueRef": "PO730934"
    },
    "cosignatairesRefs": [
      "PA2377"
    ],
    "texteAffichable": "M.&#160;Perrut"
  },
  "pointeurFragmentTexte": {
    "division": {
      "titre": "Article 18",
      "articleDesignationCourte": "ART. 18",
      "type": "ARTICLE",
      "avantAApres": "A",
      "divisionRattachee": "ARTICLE 18",
      "urlDivisionTexteVise": "/15/textes/1255A.asp#D_Article_18"
    },
    "alinea": {
      "numero": "9"
    }
  },
  "corps": {
    "dispositif": "<p style=\"text-align: justify;\">I.&#160;&#8211;&#160;&#192; la fin de l&#8217;alin&#233;a&#160;9, supprimer les mots&#160;:</p><p style=\"text-align: justify;\">&#171;&#160;, dans la limite de quatre&#160;&#187;.</p><p style=\"text-align: justify;\">II.&#160;&#8211;&#160;En cons&#233;quence, proc&#233;der &#224; la m&#234;me suppression &#224; l&#8217;alin&#233;a&#160;12.</p><p style=\"text-align: justify;\">III.&#160;&#8211;&#160;Compl&#233;ter cet article par l&#8217;alin&#233;a suivant&#160;:</p><p style=\"text-align: justify;\">&#171;&#160;IV.&#160;&#8211;&#160;Les pertes de recettes r&#233;sultant pour l&#8217;&#201;tat du I sont compens&#233;es par la cr&#233;ation d&#8217;une taxe additionnelle aux droits pr&#233;vus aux articles 575 et 575 A du code g&#233;n&#233;ral des imp&#244;ts.&#160;&#187;</p>",
    "exposeSommaire": "<p style=\"text-align: justify;\">Cet amendement propose d&#8217;adapter l&#8217;&#233;pargne de pr&#233;caution aux sp&#233;cificit&#233;s de l&#8217;agriculture de groupe dont les associ&#233;s repr&#233;sentent le quart des agriculteurs professionnels.</p><p style=\"text-align: justify;\">Alors que l&#8217;article&#160;18 du projet de loi de finances pour 2019 pr&#233;voit le plafonnement de la multiplication des montants de d&#233;duction &#224; quatre associ&#233;s, il faut rappeler que ls groupements agricoles d&#8217;exploitation en commun (GAEC) b&#233;n&#233;ficient du principe de transparence qui permet &#224; leurs associ&#233;s de conserver les droits auxquels ils auraient pu pr&#233;tendre s&#8217;ils &#233;taient rest&#233;s chefs d&#8217;exploitation &#224; titre individuel, en mati&#232;re fiscale, sociale et &#233;conomique. Cela se traduit notamment par une multiplication des seuils et des plafonds par le nombre d&#8217;associ&#233;s afin d&#8217;assurer l&#8217;effectivit&#233; fiscale de la reconnaissance de l&#8217;associ&#233; de GAEC, &#224; l&#8217;identique d&#8217;un exploitant exer&#231;ant son activit&#233; agricole sous la forme individuelle.</p><p style=\"text-align: justify;\">Les associ&#233;s de ces GAEC doivent pouvoir b&#233;n&#233;ficier des m&#234;mes montants de d&#233;duction que les chefs d&#8217;exploitation individuelle, quel que soit le nombre des associ&#233;s du groupement, en tout &#233;tat de cause limit&#233; &#224; dix.</p><p style=\"text-align: justify;\">La proc&#233;dure d&#8217;agr&#233;ment et les contr&#244;les renforc&#233;s auxquels sont soumis les GAEC, comme le faible nombre de GAEC concern&#233;s (moins de 2&#160;% des GAEC en activit&#233; ont 5 associ&#233;s et plus, ce qui repr&#233;sente environ 2000 associ&#233;s), &#233;vite tout risque de d&#233;rapage, notamment budg&#233;taire, li&#233;s au d&#233;plafonnement du nombre d&#8217;associ&#233;s.</p>"
  },
  "representations": [
    {
      "nom": "PDF",
      "typeMime": {
        "type": "application",
        "subType": "PDF"
      },
      "statutRepresentation": {
        "verbatim": true,
        "canonique": true,
        "officielle": true,
        "transcription": false,
        "enregistrement": false
      },
      "contenu": {
        "documentURI": "/15/amendements/1255A/AN/2259.pdf"
      }
    }
  ],
  "seanceDiscussion": "RUANR5L15S2019IDS21283",
  "sort": {
    "dateSaisie": "2018-10-19T22:06:23.000+02:00",
    "sortEnSeance": "Non soutenu"
  },
  "dateDepot": "2018-10-11T02:00:00.000+02:00",
  "dateDistribution": "2018-10-16T02:00:00.000+02:00",
  "article99": "0",
  "loiReference": {}
}