{
  "uid": "AMANR5L15SEA717460BTC1924P0D1N921",
  "identifiant": {
    "legislature": "15",
    "numero": "921",
    "numRect": "0",
    "saisine": {
      "texteLegislatifRef": "PRJLANR5L15BTC1924",
      "numeroPartiePLF": "0",
      "organeExamen": "PO717460",
      "mentionSecondeDeliberation": "0"
    }
  },
  "numeroLong": "921",
  "etapeTexte": "1ère lecture (1ère assemblée saisie)",
  "triAmendement": "ckaaaaaaaaaaaaaaaaaaaaaaaaaaaaaaaaaaaaaaaaaaaaaaaaciy",
  "cardinaliteAmdtMultiples": "1",
  "etat": "Discuté",
  "signataires": {
    "auteur": {
      "typeAuteur": "Depute",
      "acteurRef": "PA721062",
      "groupePolitiqueRef": "PO730958"
    },
    "cosignatairesRefs": [
      "PA720286",
      "PA722142",
      "PA721960",
      "PA720422",
      "PA721202",
      "PA588884",
      "PA2150",
      "PA720892",
      "PA718860",
      "PA720846",
      "PA721210",
      "PA718868",
      "PA720430",
      "PA721226",
      "PA721062",
      "PA719676",
      "PA719578"
    ],
    "texteAffichable": "M.&#160;Ratenon,  Mme&#160;Autain, M.&#160;Bernalicis, M.&#160;Coquerel, M.&#160;Corbi&#232;re, Mme&#160;Fiat, M.&#160;Lachaud, M.&#160;Larive, M.&#160;M&#233;lenchon, Mme&#160;Obono, Mme&#160;Panot, M.&#160;Prud&apos;homme, M.&#160;Quatennens, Mme&#160;Ressiguier, Mme&#160;Rubin, M.&#160;Ruffin et Mme&#160;Taurine"
  },
  "pointeurFragmentTexte": {
    "division": {
      "titre": "Article 11",
      "articleDesignationCourte": "ART. 11",
      "type": "ARTICLE",
      "avantAApres": "A",
      "divisionRattachee": "ARTICLE 11",
      "urlDivisionTexteVise": "/15/textes/1924.asp#D_Article_11"
    },
    "alinea": {
      "numero": "10"
    }
  },
  "corps": {
    "dispositif": "<p style=\"text-align: justify;\">&#192; la premi&#232;re phrase de l&#8217;alin&#233;a&#160;10, apr&#232;s le mot&#160;:</p><p style=\"text-align: justify;\">&#171;&#160;&#201;tat&#160;&#187;,</p><p style=\"text-align: justify;\">ins&#233;rer les mots&#160;:</p><p style=\"text-align: justify;\">&#171;&#160;et, &#224; titre exp&#233;rimental, dans les instituts r&#233;gionaux d&#8217;administration&#160;&#187;.</p>",
    "exposeSommaire": "<p style=\"text-align: justify;\">L&#8217;affectation des fonctionnaires ultramarins en Outre-mer a &#233;t&#233; simplifi&#233;e par la loi n&#176; 2017&#8209;256 du 28 f&#233;vrier 2017 de programmation relative &#224; l&#8217;&#233;galit&#233; r&#233;elle outre-mer et portant autres dispositions en mati&#232;re sociale et &#233;conomique. Le recours aux Centres d&#8217;Int&#233;r&#234;ts Moraux et Mat&#233;riels (CIMM), pour la fonction publique d&#8217;&#201;tat, permet une affectation reconnaissant le lien entre les fonctionnaires et le territoire d&#8217;affectation, pour une vie professionnelle et familiale accomplies.</p><p style=\"text-align: justify;\">Afin de poursuivre ce travail, il est demand&#233; d&#8217;&#233;largir le recours aux CIMM aux nouveaux fonctionnaires issus des Instituts R&#233;gionaux d&#8217;Administration.</p>"
  },
  "representations": [
    {
      "nom": "PDF",
      "typeMime": {
        "type": "application",
        "subType": "PDF"
      },
      "statutRepresentation": {
        "verbatim": true,
        "canonique": true,
        "officielle": true,
        "transcription": false,
        "enregistrement": false
      },
      "contenu": {
        "documentURI": "/15/amendements/1924/AN/921.pdf"
      }
    }
  ],
  "sort": {
    "dateSaisie": "2019-05-17T09:49:20.000+02:00",
    "sortEnSeance": "Rejeté"
  },
  "dateDepot": "2019-05-09T02:00:00.000+02:00",
  "dateDistribution": "2019-05-13T02:00:00.000+02:00",
  "article99": "0",
  "loiReference": {}
}