{
  "uid": "AMANR5L15SEA717460B2272P2D1N2990",
  "identifiant": {
    "legislature": "15",
    "numero": "2990",
    "numRect": "0",
    "saisine": {
      "texteLegislatifRef": "PRJLANR5L15B2272",
      "numeroPartiePLF": "2",
      "organeExamen": "PO717460",
      "mentionSecondeDeliberation": "1"
    }
  },
  "numeroLong": "II-2990",
  "etapeTexte": "1ère lecture (1ère assemblée saisie)",
  "triAmendement": "kuaaaaaaaaaaaaaaaaaaaaaaaaaaaaaaaaaaaaaaaaaaaaaaaaaeo",
  "cardinaliteAmdtMultiples": "1",
  "etat": "Discuté",
  "signataires": {
    "auteur": {
      "typeAuteur": "Depute",
      "acteurRef": "PA719440",
      "groupePolitiqueRef": "PO730964"
    },
    "cosignatairesRefs": [
      "PA719060",
      "PA722062",
      "PA720944",
      "PA720402",
      "PA721498",
      "PA718710",
      "PA719372",
      "PA722038",
      "PA722366",
      "PA721466",
      "PA721158",
      "PA721004",
      "PA721036",
      "PA718744",
      "PA642788",
      "PA719770",
      "PA719728",
      "PA721328",
      "PA718802",
      "PA719412",
      "PA720370",
      "PA719388",
      "PA719822",
      "PA721824",
      "PA722126",
      "PA607595",
      "PA721434",
      "PA719980",
      "PA719616",
      "PA721542",
      "PA721560",
      "PA719748",
      "PA721844",
      "PA720190",
      "PA642724",
      "PA720054",
      "PA719790",
      "PA720394",
      "PA721908",
      "PA719170",
      "PA720780",
      "PA719756",
      "PA721142",
      "PA719350",
      "PA2449",
      "PA719440",
      "PA719922",
      "PA718918",
      "PA720342",
      "PA720354",
      "PA722344",
      "PA719404",
      "PA721916",
      "PA720520",
      "PA608641",
      "PA719668",
      "PA719960",
      "PA720622",
      "PA719218",
      "PA718756",
      "PA719118",
      "PA643205",
      "PA719540",
      "PA334116",
      "PA721726",
      "PA720538",
      "PA721750",
      "PA720222",
      "PA721372",
      "PA719420",
      "PA719890",
      "PA720378",
      "PA722228",
      "PA719092",
      "PA718794",
      "PA720138",
      "PA718902",
      "PA677483",
      "PA605963",
      "PA719496",
      "PA720878",
      "PA719310",
      "PA718682",
      "PA720362",
      "PA722252",
      "PA720124",
      "PA720030",
      "PA722358",
      "PA719456",
      "PA722244",
      "PA343493",
      "PA721458",
      "PA721644",
      "PA719652",
      "PA722292",
      "PA606639",
      "PA719866",
      "PA719186",
      "PA719202",
      "PA607193",
      "PA720202",
      "PA720446",
      "PA719294",
      "PA718768",
      "PA722398",
      "PA719448",
      "PA719480",
      "PA719162",
      "PA721364",
      "PA720318",
      "PA719242",
      "PA718962",
      "PA718910",
      "PA719024",
      "PA760658",
      "PA722312",
      "PA720298",
      "PA719700",
      "PA722150",
      "PA722194",
      "PA721776",
      "PA720814",
      "PA720790",
      "PA722240",
      "PA718876",
      "PA719778",
      "PA702054",
      "PA720492",
      "PA718894",
      "PA721150",
      "PA720170",
      "PA720116",
      "PA718736",
      "PA721450",
      "PA719710",
      "PA607155",
      "PA719396",
      "PA720146",
      "PA721352",
      "PA722336",
      "PA720916",
      "PA721246",
      "PA721166",
      "PA720022",
      "PA721616",
      "PA721568",
      "PA720154",
      "PA720512",
      "PA719952",
      "PA720414",
      "PA719882",
      "PA720066",
      "PA721624",
      "PA721278",
      "PA722300",
      "PA346876",
      "PA608083",
      "PA606202",
      "PA717167",
      "PA718954",
      "PA719850",
      "PA609520",
      "PA719052",
      "PA721876",
      "PA719842",
      "PA720806",
      "PA720500",
      "PA719258",
      "PA719072",
      "PA720952",
      "PA719994",
      "PA605084",
      "PA722070",
      "PA719632",
      "PA719330",
      "PA720014",
      "PA720108",
      "PA721800",
      "PA722022",
      "PA722260",
      "PA643127",
      "PA719740",
      "PA718810",
      "PA643175",
      "PA720590",
      "PA721808",
      "PA719830",
      "PA719364",
      "PA719624",
      "PA719154",
      "PA722134",
      "PA719692",
      "PA721384",
      "PA722320",
      "PA721674",
      "PA332747",
      "PA719520",
      "PA719512",
      "PA718944",
      "PA721710",
      "PA722054",
      "PA718990",
      "PA721398",
      "PA606675",
      "PA718706",
      "PA717379",
      "PA721426",
      "PA720268",
      "PA720480",
      "PA720214",
      "PA719472",
      "PA2828",
      "PA721218",
      "PA721336",
      "PA719230",
      "PA720754",
      "PA719302",
      "PA719080",
      "PA720830",
      "PA719006",
      "PA721600",
      "PA719032",
      "PA722382",
      "PA720908",
      "PA720046",
      "PA721296",
      "PA722178",
      "PA718674",
      "PA720310",
      "PA719528",
      "PA721514",
      "PA720900",
      "PA719326",
      "PA719972",
      "PA724827",
      "PA722008",
      "PA721584",
      "PA721860",
      "PA606507",
      "PA719550",
      "PA719108",
      "PA720870",
      "PA721522",
      "PA719100",
      "PA718694",
      "PA719718",
      "PA720242",
      "PA718930",
      "PA720862",
      "PA719130",
      "PA722170",
      "PA721888",
      "PA719570",
      "PA267673",
      "PA721262",
      "PA721718",
      "PA718728",
      "PA721134",
      "PA719798",
      "PA720932",
      "PA721784",
      "PA331835",
      "PA720854",
      "PA721690",
      "PA722078",
      "PA722268",
      "PA722102",
      "PA722046",
      "PA720438",
      "PA721344",
      "PA722118",
      "PA720074",
      "PA720552",
      "PA720738",
      "PA719858",
      "PA719250",
      "PA721946",
      "PA719600",
      "PA719592",
      "PA719194",
      "PA722094",
      "PA721792",
      "PA607395",
      "PA719664",
      "PA721656",
      "PA722000",
      "PA721764",
      "PA642695",
      "PA720960",
      "PA721024",
      "PA720454",
      "PA672",
      "PA334768",
      "PA719338",
      "PA720576",
      "PA719814",
      "PA719684",
      "PA720560",
      "PA721702",
      "PA722090",
      "PA721880"
    ],
    "texteAffichable": "M.&#160;Cellier,  Mme&#160;Peyrol, Mme&#160;Pompili, Mme&#160;Cariou, M.&#160;Ahamada, M.&#160;Andr&#233;, Mme&#160;Cattelot, M.&#160;Cazeneuve, M.&#160;Chassaing, M.&#160;Chouat, M.&#160;Damaisin, Mme&#160;Dominique&#160;David, M.&#160;Dirx, Mme&#160;Dupont, Mme&#160;Errante, M.&#160;Gaillard, Mme&#160;Goulet, M.&#160;Grau, Mme&#160;Gregoire, Mme&#160;Hai, M.&#160;Holroyd, M.&#160;Jerretie, M.&#160;Jolivet, M.&#160;Labaronne, M.&#160;Lauzzana, M.&#160;Le Vigoureux, Mme&#160;Magne, Mme&#160;Motin, Mme&#160;Osson, M.&#160;Paluszkiewicz, M.&#160;Pellois, Mme&#160;Val&#233;rie&#160;Petit, M.&#160;Potterie, M.&#160;Roseren, M.&#160;Saint-Martin, M.&#160;Savatier, M.&#160;Serva, M.&#160;Simian, Mme&#160;Verdier-Jouclas, Mme&#160;Abadie, Mme&#160;Abba, M.&#160;Damien&#160;Adam, M.&#160;L&#233;na&#239;ck&#160;Adam, M.&#160;Alauzet, Mme&#160;Ali, Mme&#160;Amadou, M.&#160;Anato, M.&#160;Anglade, M.&#160;Ardouin, M.&#160;Arend, Mme&#160;Atger, Mme&#160;Avia, M.&#160;Bachelier, Mme&#160;Bagarry, M.&#160;Baich&#232;re, M.&#160;Barbier, M.&#160;Batut, Mme&#160;Beaudouin-Hubiere, M.&#160;Belhaddad, Mme&#160;Berg&#233;, M.&#160;Berville, M.&#160;Besson-Moreau, Mme&#160;Bessot Ballot, Mme&#160;Blanc, M.&#160;Blanchet, M.&#160;Blein, M.&#160;Bois, M.&#160;Bonnell, Mme&#160;Bono-Vandorme, M.&#160;Borowczyk, M.&#160;Bothorel, M.&#160;Boudi&#233;, Mme&#160;Bourguignon, M.&#160;Bouyx, Mme&#160;Pascale&#160;Boyer, Mme&#160;Braun-Pivet, M.&#160;Bridey, Mme&#160;Brocard, Mme&#160;Brugnera, Mme&#160;Brulebois, Mme&#160;Brunet, M.&#160;Buchou, Mme&#160;Bureau-Bonnard, M.&#160;Cabar&#233;, Mme&#160;Calvez, M.&#160;Causse, Mme&#160;Cazarian, Mme&#160;Cazebonne, M.&#160;Cazenove, M.&#160;Cesarini, Mme&#160;Chalas, M.&#160;Chalumeau, Mme&#160;Chapelier, Mme&#160;Charri&#232;re, Mme&#160;Charvier, M.&#160;Chiche, M.&#160;Claireaux, Mme&#160;Clapot, Mme&#160;Cloarec-Le Nabour, M.&#160;Colas-Roy, Mme&#160;Colboc, M.&#160;Cormier-Bouligeon, Mme&#160;Couillard, Mme&#160;Crouzet, M.&#160;Da Silva, M.&#160;Daniel, Mme&#160;Yolaine&#160;de Courson, Mme&#160;de Lavergne, M.&#160;de Rugy, Mme&#160;De Temmerman, Mme&#160;Degois, M.&#160;Marc&#160;Delatte, M.&#160;Delpon, M.&#160;Descrozaille, M.&#160;Di Pompeo, Mme&#160;Do, M.&#160;Dombreval, Mme&#160;Jacqueline&#160;Dubois, Mme&#160;Dubost, Mme&#160;Dubr&#233;-Chirat, Mme&#160;Dufeu Schubert, Mme&#160;Fran&#231;oise&#160;Dumas, M.&#160;D&#233;moulin, M.&#160;Eliaou, M.&#160;Euzet, Mme&#160;Fabre, Mme&#160;Faure-Muntian, M.&#160;Fauvergue, M.&#160;Fi&#233;vet, M.&#160;Folliot, Mme&#160;Fontaine-Domeizel, Mme&#160;Fontenel-Personne, Mme&#160;Forteza, M.&#160;Freschi, M.&#160;Fugit, Mme&#160;Gaillot, M.&#160;Gassilloud, M.&#160;Gauvain, Mme&#160;Gayte, Mme&#160;Genetet, Mme&#160;Gipson, M.&#160;Girardin, Mme&#160;Givernet, Mme&#160;Gomez-Bassac, M.&#160;Gouffier-Cha, M.&#160;Gouttefarde, Mme&#160;Grandjean, Mme&#160;Granjus, M.&#160;Griveaux, Mme&#160;Guerel, M.&#160;Guerini, Mme&#160;Gu&#233;venoux, M.&#160;G&#233;rard, Mme&#160;Hammerer, M.&#160;Haury, Mme&#160;Hennion, M.&#160;Henriet, M.&#160;Houbron, M.&#160;Houli&#233;, M.&#160;Hupp&#233;, Mme&#160;H&#233;rin, Mme&#160;Iborra, M.&#160;Jacques, Mme&#160;Janvier, M.&#160;Julien-Laferri&#232;re, Mme&#160;Kamowski, M.&#160;Kasbarian, Mme&#160;Kerbarh, M.&#160;Kerlogot, M.&#160;Kervran, Mme&#160;Khattabi, Mme&#160;Khedher, M.&#160;Kokouendo, M.&#160;Krabal, Mme&#160;Krimi, Mme&#160;Kuric, M.&#160;Laabid, Mme&#160;Lakrafi, Mme&#160;Lang, Mme&#160;Lardet, M.&#160;Larsonneur, M.&#160;Lavergne, Mme&#160;Lazaar, M.&#160;Le Bohec, Mme&#160;Le Feur, M.&#160;Le Gac, Mme&#160;Le Meur, Mme&#160;Le Peih, M.&#160;Leclabart, Mme&#160;Lecocq, Mme&#160;Leguille-Balloy, M.&#160;Lejeune, Mme&#160;Lenne, M.&#160;Lescure, Mme&#160;Limon, M.&#160;Lioger, Mme&#160;Liso, Mme&#160;Louis, M.&#160;Mahjoubi, M.&#160;Maillard, Mme&#160;Maillart-M&#233;haignerie, M.&#160;Maire, Mme&#160;Jacqueline&#160;Maquet, M.&#160;Marilossian, Mme&#160;Marsaud, M.&#160;Martin, M.&#160;Mass&#233;glia, M.&#160;Matras, Mme&#160;Mauborgne, M.&#160;Mazars, M.&#160;Mbaye, Mme&#160;Melchior, M.&#160;Mendes, M.&#160;Mesnier, Mme&#160;Meynier-Millefert, Mme&#160;Michel, M.&#160;Michels, Mme&#160;Mirall&#232;s, M.&#160;Mis, M.&#160;Moreau, M.&#160;Morenas, Mme&#160;Moutchou, Mme&#160;Muschotti, Mme&#160;M&#246;rch, M.&#160;Nogal, Mme&#160;O&apos;Petit, Mme&#160;Oppelt, Mme&#160;Panonacle, M.&#160;Paris, Mme&#160;Park, M.&#160;Perea, M.&#160;Perrot, M.&#160;Person, Mme&#160;Petel, Mme&#160;Peyron, M.&#160;Pichereau, M.&#160;Pietraszewski, Mme&#160;Piron, Mme&#160;Pitollat, M.&#160;Pont, M.&#160;Portarrieu, M.&#160;Poulliat, Mme&#160;Pouzyreff, Mme&#160;Provendier, Mme&#160;P&#233;telle, M.&#160;Questel, Mme&#160;Racon-Bouzon, M.&#160;Raphan, Mme&#160;Rauch, M.&#160;Rebeyrotte, M.&#160;Renson, Mme&#160;Rilhac, Mme&#160;Riotton, Mme&#160;Rist, Mme&#160;Rixain, Mme&#160;Robert, Mme&#160;Romeiro Dias, Mme&#160;Rossi, M.&#160;Rouillard, M.&#160;C&#233;dric&#160;Roussel, M.&#160;Rudigoz, M.&#160;Rupin, Mme&#160;Saint-Paul, Mme&#160;Sarles, M.&#160;Sempastous, M.&#160;Sol&#232;re, M.&#160;Sommer, M.&#160;Sorre, M.&#160;Studer, Mme&#160;Sylla, M.&#160;Tach&#233;, Mme&#160;Tamarelle-Verhaeghe, M.&#160;Tan, Mme&#160;Tanguy, M.&#160;Terlier, M.&#160;Test&#233;, Mme&#160;Thillaye, M.&#160;Thi&#233;baut, Mme&#160;Thomas, Mme&#160;Thourot, Mme&#160;Tiegna, M.&#160;Touraine, M.&#160;Tourret, Mme&#160;Toutut-Picard, M.&#160;Travert, Mme&#160;Trisse, M.&#160;Trompille, Mme&#160;Tuffnell, Mme&#160;Valetta Ardisson, Mme&#160;Vanceunebrock-Mialon, M.&#160;Venteau, Mme&#160;Vidal, M.&#160;Vignal, Mme&#160;Vignon, M.&#160;Villani, M.&#160;Vuilletet, M.&#160;V&#233;ran, Mme&#160;Wonner, Mme&#160;Zannier, M.&#160;Zulesi, M.&#160;Le Gendre et les membres du groupe La R&#233;publique en Marche"
  },
  "pointeurFragmentTexte": {
    "division": {
      "titre": "Article 68",
      "articleDesignationCourte": "ART. 68",
      "type": "ARTICLE",
      "avantAApres": "A",
      "divisionRattachee": "ARTICLE 68",
      "urlDivisionTexteVise": "/15/textes/2272C.asp#D_Article_68"
    },
    "alinea": {
      "avantAApres": "Apres",
      "numero": "2"
    }
  },
  "corps": {
    "dispositif": "<p>Compl&#233;ter cet article par l&#8217;alin&#233;a suivant&#160;:</p><p style=\"text-align: justify;\">&#171;&#160;La garantie de l&#8217;&#201;tat pr&#233;vue au pr&#233;sent article ne peut &#234;tre accord&#233;e pour des op&#233;rations ayant pour objet&#160;la recherche, l&#8217;exploitation et la production d&#8217;hydrocarbures liquides ou gazeux par fracturation hydraulique ou par toute autre m&#233;thode non conventionnelle, telles que d&#233;finies &#224; l&#8217;article L.&#160;111&#8209;13 du code minier.&#160;&#187;</p>",
    "exposeSommaire": "<p>Depuis 2015, la France a pris l&#8217;engagement&#160;de ne plus subventionner via la Coface puis BPIFrance Assurance Export des projets li&#233;s au charbon.&#160;</p><p style=\"text-align: justify;\">L&#8217;article&#160;68 permet donc d&#8217;ancrer dans la loi cette pratique de la France et ainsi de peser davantage dans les discussions de l&#8217;OCDE sur ce sujet afin d&#8217;enclencher un mouvement de toutes les agences &#233;tatiques d&#8217;assurance de cr&#233;dit &#224; l&#8217;export vers la fin du soutien au charbon.&#160;</p><p style=\"text-align: justify;\">Cependant, il est n&#233;cessaire d&#8217;aller plus loin et d&#8217;&#234;tre notamment en phase avec nos engagements sur le sol fran&#231;ais, pris dans le cadre de la loi du 30 d&#233;cembre 2017 mettant fin &#224; la recherche ainsi qu&#8217;&#224; l&#8217;exploitation des hydrocarbures et portant diverses dispositions relatives &#224; l&#8217;&#233;nergie et &#224; l&#8217;environnement, qui interdit la recherche et l&#8217;exploitation des hydrocarbures liquides ou gazeux par fracturation hydraulique ou par toute autre m&#233;thode non conventionnelle.&#160;</p><p style=\"text-align: justify;\">Cet amendement vise &#224; interdire qu&#8217;une garantie de l&#8217;&#201;tat soit accord&#233;e &#224; tout projet de recherche, d&#8217;exploitation ou de production d&#8217;hydrocarbures liquides ou gazeux par fracturation hydraulique ou par toute autre m&#233;thode non conventionnelle (ex. gaz ou p&#233;trole de schiste).</p>",
    "cartoucheDelaiDepotDepasse": "Sous réserve de son traitement par les services de l'Assemblée nationale et de sa recevabilité"
  },
  "representations": [
    {
      "nom": "PDF",
      "typeMime": {
        "type": "application",
        "subType": "PDF"
      },
      "statutRepresentation": {
        "verbatim": true,
        "canonique": true,
        "officielle": true,
        "transcription": false,
        "enregistrement": false
      },
      "contenu": {
        "documentURI": "/15/amendements/2272C/AN/2990.pdf"
      }
    }
  ],
  "seanceDiscussion": "RUANR5L15S2020IDS21925",
  "sort": {
    "dateSaisie": "2019-11-15T19:01:26.000+01:00",
    "sortEnSeance": "Adopté"
  },
  "dateDepot": "2019-11-09T01:00:00.000+01:00",
  "dateDistribution": "2019-11-15T01:00:00.000+01:00",
  "article99": "0",
  "loiReference": {}
}