{
  "uid": "AMANR5L15PO419604B1813P0D1N161",
  "identifiant": {
    "legislature": "15",
    "numero": "161",
    "numRect": "0",
    "saisine": {
      "texteLegislatifRef": "PIONANR5L15B1813",
      "numeroPartiePLF": "0",
      "organeExamen": "PO419604",
      "mentionSecondeDeliberation": "0"
    }
  },
  "numeroLong": "AC161",
  "etapeTexte": "1ère lecture (1ère assemblée saisie)",
  "triAmendement": "aoaaaaaaaaaaaaaaaaaaaaaaaaaaaaaaaaaaaaaaaaaaaaaaaacg",
  "cardinaliteAmdtMultiples": "1",
  "etat": "Irrecevable",
  "signataires": {
    "auteur": {
      "typeAuteur": "Depute",
      "acteurRef": "PA689",
      "groupePolitiqueRef": "PO730940"
    },
    "cosignatairesRefs": [
      "PA720692",
      "PA722202",
      "PA721012",
      "PA335612",
      "PA610654",
      "PA689",
      "PA718926",
      "PA610667",
      "PA720546",
      "PA718720",
      "PA441",
      "PA721270",
      "PA721896",
      "PA721118",
      "PA267306",
      "PA722110"
    ],
    "texteAffichable": "Mme&#160;Buffet,  Mme&#160;Faucillon, Mme&#160;Bello, M.&#160;Brotherson, M.&#160;Bruneel, M.&#160;Chassaigne, M.&#160;Dharr&#233;ville, M.&#160;Dufr&#232;gne, M.&#160;Jumel, Mme&#160;K&#233;clard-Mond&#233;sir, M.&#160;Lecoq, M.&#160;Nilor, M.&#160;Peu, M.&#160;Fabien&#160;Roussel, M.&#160;Serville et M.&#160;Wulfranc"
  },
  "pointeurFragmentTexte": {
    "division": {
      "titre": "Article PREMIER",
      "articleDesignationCourte": "ART. PREMIER",
      "type": "ARTICLE",
      "avantAApres": "A",
      "divisionRattachee": "ARTICLE PREMIER",
      "urlDivisionTexteVise": "/15/textes/1813.asp#D_Article_1er"
    },
    "alinea": {
      "avantAApres": "Apres",
      "numero": "6"
    }
  },
  "corps": {},
  "representations": [
    {
      "nom": "PDF",
      "typeMime": {
        "type": "application",
        "subType": "PDF"
      },
      "statutRepresentation": {
        "verbatim": true,
        "canonique": true,
        "officielle": true,
        "transcription": false,
        "enregistrement": false
      },
      "contenu": {
        "documentURI": "/15/amendements/1813/CION-CEDU/AC161.pdf"
      }
    }
  ],
  "dateDepot": "2019-04-25T02:00:00.000+02:00",
  "dateDistribution": "2019-04-26T02:00:00.000+02:00",
  "article99": "0",
  "loiReference": {}
}