{
  "uid": "AMANR5L15PO59048B2272P2D1N90",
  "identifiant": {
    "legislature": "15",
    "numero": "90",
    "numRect": "0",
    "saisine": {
      "texteLegislatifRef": "PRJLANR5L15B2272",
      "numeroPartiePLF": "2",
      "organeExamen": "PO59048",
      "mentionSecondeDeliberation": "0"
    }
  },
  "numeroLong": "II-CF90",
  "etapeTexte": "1ère lecture (1ère assemblée saisie)",
  "triAmendement": "fiaaaaaaaaaaaaaaaaaaaaaaaaaaaaaaaaaaaaaaaaaaaaaaaaqbhwwo",
  "cardinaliteAmdtMultiples": "1",
  "etat": "Discuté",
  "signataires": {
    "auteur": {
      "typeAuteur": "Depute",
      "acteurRef": "PA719024",
      "groupePolitiqueRef": "PO730964"
    },
    "cosignatairesRefs": [
      "PA720054",
      "PA721726",
      "PA721522",
      "PA722292",
      "PA720074",
      "PA720362",
      "PA606639",
      "PA720814",
      "PA719118",
      "PA722320",
      "PA719024",
      "PA719664",
      "PA719154",
      "PA720154",
      "PA719364"
    ],
    "texteAffichable": "M.&#160;Blanchet,  M.&#160;Haury, M.&#160;Lejeune, M.&#160;Batut, Mme&#160;O&apos;Petit, M.&#160;Rudigoz, Mme&#160;Mauborgne, M.&#160;Vignal, M.&#160;Cazenove, M.&#160;Martin, Mme&#160;Janvier, M.&#160;Belhaddad, M.&#160;Cormier-Bouligeon, Mme&#160;Dubr&#233;-Chirat et M.&#160;Lavergne"
  },
  "pointeurFragmentTexte": {
    "division": {
      "titre": "Article 51",
      "articleDesignationCourte": "ART. 51",
      "type": "ARTICLE",
      "avantAApres": "A",
      "divisionRattachee": "ARTICLE 51",
      "urlDivisionTexteVise": "/15/textes/2272C.asp#D_Article_51"
    },
    "alinea": {
      "avantAApres": "Avant",
      "numero": "7",
      "alineaDesignation": "Avant l'alinéa 7"
    }
  },
  "corps": {
    "dispositif": "<p style=\"text-align: justify;\">Apr&#232;s l&#8217;alin&#233;a&#160;6, ins&#233;rer l&#8217;alin&#233;a suivant&#160;:</p><p style=\"text-align: justify;\">&#171;&#160;II <i>bis</i>.&#160;&#8211;&#160;La taxe mentionn&#233;e au I est fix&#233;e &#224; un montant de 1,05&#160;&#8364; jusqu&#8217;au 1<sup>er</sup> janvier 2021 pour les contrats conclus par les entreprises relevant de la Convention collective nationale des h&#244;tels, caf&#233;s restaurants (HCR) du 30 avril 1997 en application du 4&#176;&#160;de l&#8217;article D.&#160;1242&#8209;1 du code du travail.&#160;&#187;</p>",
    "exposeSommaire": "<p style=\"text-align: justify;\">Les entreprises du secteur des h&#244;tels, caf&#233;s, restaurants sont tenues en raison de la nature fluctuante et al&#233;atoire de leur activit&#233; de recourir aux CDDU.</p><p style=\"text-align: justify;\">Ces CDDU d&#8217;extra se distinguent des contrats conclus pour faire face &#224; un surcroit d&#8217;activit&#233; ou &#224; une activit&#233; saisonni&#232;re. Ils se caract&#233;risent notamment par l&#8217;absence de d&#233;lais de carence entre deux CDDU.</p><p style=\"text-align: justify;\">Le Code du travail et la Convention Collective Nationale des h&#244;tels, caf&#233;s, restaurants organisent en cons&#233;quence le recours &#224; ces CDDU.</p><p style=\"text-align: justify;\">L&#8217;instauration de la taxe de 10&#160;euros pr&#233;vue &#224; l&#8217;article&#160;51 du PLF 2020 sur les CDDU aurait des cons&#233;quences dramatiques pour ces entreprises en pesant sur leur comp&#233;titivit&#233; et leur marge alors qu&#8217;elles ne disposent pas &#224; ce jour de solution alternative s&#233;curis&#233;e aux recours &#224; ces CDDU.</p><p style=\"text-align: justify;\">Les organisations professionnelles officiellement reconnues repr&#233;sentatives dans la branche des h&#244;tels, caf&#233;s, restaurants se sont engag&#233;es dans des n&#233;gociations avec les partenaires sociaux afin de proposer aux entreprises du secteur des solutions permettant de limiter le recours &#224; ces CDDU et de privil&#233;gier des contrats moins pr&#233;caires et plus longs aux salari&#233;s. Ces n&#233;gociations exigent du temps avant qu&#8217;elles n&#8217;aboutissent.</p><p style=\"text-align: justify;\">Dans ces conditions, le pr&#233;sent amendement pr&#233;voit de reporter au 1<sup>er</sup> janvier 2021 l&#8217;application compl&#232;te de cette taxe de cette taxe pour les CDDU conclus dans la branche des h&#244;tels caf&#233;s restaurants et de ne les taxer qu&#8217;&#224; hauteur d&#8217;un&#160;euro et cinq centimes par CDDU afin de permettre aux partenaires sociaux de mettre en &#339;uvre des solutions alternatives non p&#233;nalisantes pour les entreprises dans l&#8217;int&#233;r&#234;t de leurs salari&#233;s.</p>"
  },
  "representations": [
    {
      "nom": "PDF",
      "typeMime": {
        "type": "application",
        "subType": "PDF"
      },
      "statutRepresentation": {
        "verbatim": true,
        "canonique": true,
        "officielle": true,
        "transcription": false,
        "enregistrement": false
      },
      "contenu": {
        "documentURI": "/15/amendements/2272C/CION_FIN/CF90.pdf"
      }
    }
  ],
  "sort": {
    "dateSaisie": "2019-11-06T18:54:50.000+01:00",
    "sortEnSeance": "Retiré"
  },
  "dateDepot": "2019-10-15T02:00:00.000+02:00",
  "dateDistribution": "2019-11-06T01:00:00.000+01:00",
  "article99": "0",
  "loiReference": {}
}