{
  "uid": "AMANR5L15PO419865B2274P0D1N85",
  "identifiant": {
    "legislature": "15",
    "numero": "85",
    "numRect": "0",
    "saisine": {
      "texteLegislatifRef": "PRJLANR5L15B2274",
      "numeroPartiePLF": "0",
      "organeExamen": "PO419865",
      "mentionSecondeDeliberation": "0"
    }
  },
  "numeroLong": "CD85",
  "etapeTexte": "1ère lecture (2ème assemblée saisie)",
  "triAmendement": "biiaaaaaaaaaaaaaaaaaaaaaaaaaaaaaaaaaaaaaaaaaaaaaaai",
  "cardinaliteAmdtMultiples": "1",
  "etat": "En traitement",
  "signataires": {
    "auteur": {
      "typeAuteur": "Depute",
      "acteurRef": "PA266793",
      "groupePolitiqueRef": "PO730934"
    },
    "cosignatairesRefs": [
      "PA722390",
      "PA340853",
      "PA718884",
      "PA719318",
      "PA267429",
      "PA346218",
      "PA266793",
      "PA332523",
      "PA267260",
      "PA721506",
      "PA642847"
    ],
    "texteAffichable": "M.&#160;Bony,  Mme&#160;Anthoine, Mme&#160;Bazin-Malgras, M.&#160;Cinieri, M.&#160;Masson, M.&#160;Bazin, Mme&#160;Poletti, M.&#160;Leclerc, Mme&#160;Corneloup, Mme&#160;Dalloz et Mme&#160;Kuster"
  },
  "pointeurFragmentTexte": {
    "division": {
      "titre": "Article 4 quater B",
      "articleDesignationCourte": "ART. 4 QUATER B",
      "type": "ARTICLE",
      "avantAApres": "A",
      "divisionRattachee": "ARTICLE 4 QUATER B",
      "urlDivisionTexteVise": "/15/textes/2274.asp#D_Article_4_quater_B"
    }
  },
  "corps": {
    "dispositif": "<p style=\"text-align: justify;\">Supprimer cet article.</p>",
    "exposeSommaire": "<p style=\"text-align: justify;\">Alors que des travaux sont en cours sur la mise en &#339;uvre d&#8217;un indice de r&#233;parabilit&#233;, l&#8217;inscription de la notion de durabilit&#233; dans la loi apparait comme pr&#233;matur&#233;e. La notion de durabilit&#233; reste &#224; ce jour flou&#160;puisqu&#8217;elle d&#233;pend notamment des conditions d&#8217;usage qui sont souvent variables selon les consommateurs et selon les produits. Aussi, les exp&#233;rimentations men&#233;es par l&#8217;ADEME en 2015 lors de l&#8217;&#233;laboration de la loi relative &#224; la transition &#233;nerg&#233;tique pour la croissance verte avaient soulev&#233; des difficult&#233;s sur la mani&#232;re de pr&#233;senter cette information au consommateur.</p><p style=\"text-align: justify;\">L&#8217;objectif de cette disposition d&#8217;apporter une meilleure information aux consommateurs sur la durabilit&#233; de vie des produits n&#8217;&#233;tant pas atteint, il est propos&#233; de supprimer cet article.</p>",
    "cartoucheDelaiDepotDepasse": "Sous réserve de son traitement par les services de l'Assemblée nationale et de sa recevabilité"
  },
  "representations": [
    {
      "nom": "PDF",
      "typeMime": {
        "type": "application",
        "subType": "PDF"
      },
      "statutRepresentation": {
        "verbatim": true,
        "canonique": true,
        "officielle": true,
        "transcription": false,
        "enregistrement": false
      },
      "contenu": {
        "documentURI": "/15/amendements/2274/CION-DVP/CD85.pdf"
      }
    }
  ],
  "dateDepot": "2019-11-13T01:00:00.000+01:00",
  "article99": "0",
  "loiReference": {}
}