{
  "uid": "AMANR5L15SEA717460B1255P2D1N1814",
  "identifiant": {
    "legislature": "15",
    "numero": "1814",
    "numRect": "0",
    "saisine": {
      "texteLegislatifRef": "PRJLANR5L15B1255",
      "numeroPartiePLF": "2",
      "organeExamen": "PO717460",
      "mentionSecondeDeliberation": "0"
    }
  },
  "numeroLong": "II-1814",
  "etapeTexte": "1ère lecture (1ère assemblée saisie)",
  "triAmendement": "bceaaaaaaaaaaaaaaaaaaaaaaaaaaaaaaaaaaaaaaaaaaaaaaaaazzrs",
  "cardinaliteAmdtMultiples": "1",
  "etat": "Discuté",
  "signataires": {
    "auteur": {
      "typeAuteur": "Depute",
      "acteurRef": "PA720054",
      "groupePolitiqueRef": "PO730964"
    },
    "cosignatairesRefs": [
      "PA720054",
      "PA722000",
      "PA609520"
    ],
    "texteAffichable": "M.&#160;Haury,  M.&#160;Buchou et Mme&#160;Pompili"
  },
  "pointeurFragmentTexte": {
    "missionVisee": {
      "idMissionAN": "413",
      "libelleMission": "Recherche et enseignement supérieur",
      "codeMissionPLF": "B",
      "libelleMissionPLF": "Répartition, par mission et programme, des crédits du budget général"
    },
    "division": {
      "titre": "ÉTAT B",
      "articleDesignationCourte": "ART. 39",
      "type": "ANNEXE",
      "avantAApres": "A",
      "divisionRattachee": "ARTICLE 39",
      "urlDivisionTexteVise": "/15/textes/1255C.asp#D_ETAT_B"
    }
  },
  "corps": {
    "exposeSommaire": "<p style=\"text-align: justify;\">Les r&#233;cents rapports du GIEC et de WWF sont des signaux alarmants quant aux enjeux li&#233;s aux changements climatiques et au recul dramatique de la biodiversit&#233;. En ce qui concerne la&#160;connaissance de la biodiversit&#233;, j&#8217;ai soulign&#233; dans mon rapport budg&#233;taire de cette ann&#233;e sur les programmes 113 et 159 de la mission Ecologie, le&#160;r&#244;le majeur du Mus&#233;um national d&#8217;histoire naturelle (MHNH).</p><p style=\"text-align: justify;\"><br />En effet, le MNHN a notamment la responsabilit&#233; scientifique de l&#8217;inventaire national du patrimoine naturel et 75 de ses personnels ont constitu&#233; l&#8217;unit&#233; mixte de service &#171;&#160;Patrinat&#160;&#187; mise en place fin 2017 avec l&#8217;AFB et le CNRS. Il apporte la plus grande contribution au budget de fonctionnement de l&#8217;unit&#233; mixte de service. H&#233;ritier du Jardin royal des plantes cr&#233;&#233; en 1635, le MNHN a la responsabilit&#233; des collections naturalistes et conserve 80&#160;millions de sp&#233;cimens, se classant au troisi&#232;me rang des plus grandes collections du monde. Enfin, le MNHN fournit de nombreuses expertises pointues et est un acteur de premier plan dans le champ des rapportages obligatoires au titre des directives europ&#233;ennes (directive-cadre Strat&#233;gie pour le milieu marin, directive-cadre sur l&#8217;eau). <br /><br /></p><p style=\"text-align: justify;\">Cependant, l&#8217;&#233;tablissement doit faire face aujourd&#8217;hui &#224; de&#160;grandes difficult&#233;s financi&#232;res et &#224; la faiblesse des dotations qui lui sont attribu&#233;es. &#160;Comme j&#8217;ai pu le constater lors de ma visite sur site, l&#8217;entretien du patrimoine immobilier de l&#8217;&#233;tablissement est devenu impossible et&#160;certains sites majeurs, tels que la galerie de pal&#233;ontologie et d&#8217;anatomie compar&#233;e ou certains b&#226;timents de la M&#233;nagerie du jardin des plantes, sont&#160;menac&#233;s de fermeture pour des raisons de s&#233;curit&#233;. Et il ne s&#8217;agit pas d&#8217;une hypoth&#232;se d&#8217;&#233;cole puisque cette ann&#233;e il a fallu fermer le Nocturama du b&#226;timent des reptiles de la M&#233;nagerie. <br /><br /></p><p style=\"text-align: justify;\">La subvention pour charges de service public vers&#233;e par le minist&#232;re de la recherche et de l&#8217;enseignement sup&#233;rieur, &#233;gale &#224; 50&#160;% du budget de l&#8217;&#233;tablissement, ne lui permet pas de faire face aux charges qui sont les siennes. A mon sens les&#160;modalit&#233;s de subvention du MNHN devraient &#234;tre revues en profondeur&#160;car cet &#233;tablissement&#160;sui generis&#160;ne peut &#234;tre assimil&#233; ni &#224; un mus&#233;e, ni &#224; un centre de recherche, ni &#224; une universit&#233;. La Cour des comptes a dress&#233; des pistes de redressement dans son rapport public annuel 2017 mais la situation n&#233;cessite une prise en charge &#224; la hauteur des enjeux.<br /><br /></p><p style=\"text-align: justify;\">Cet amendement vise donc &#224; augmenter au sein de la mission Recherche et Enseignement sup&#233;rieur les cr&#233;dits du programme 150 &#171;&#160;Formations sup&#233;rieurs et recherche universitaire&#160;&#187; pour accro&#238;tre le budget du MNHN afin de faire face aux investissements n&#233;cessaires &#224; son fonctionnement voire &#224; sa survie. <br /><br /></p><p style=\"text-align: justify;\">Il augmente ainsi de 5 millions d&#8217;euros les cr&#233;dits de l&#8217;action 14 du programme 150 et diminue en cons&#233;quence les cr&#233;dits de l&#8217;action 11 &#171;&#160;recherches interdisciplinaires et transversales&#160;&#187; du programme 172. &#160;<br />&#160;</p>",
    "dispositifAmdtCredit": {
      "listeProgrammes": [
        {
          "libelle": "Formations supérieures et recherche universitaire",
          "id": "50694",
          "AE": {
            "montantPositif": "5000000",
            "montantNegatif": "0"
          },
          "CP": {
            "montantPositif": "5000000",
            "montantNegatif": "0"
          },
          "action": "modification"
        },
        {
          "libelle": "Vie étudiante",
          "id": "50695",
          "AE": {
            "montantPositif": "0",
            "montantNegatif": "0"
          },
          "CP": {
            "montantPositif": "0",
            "montantNegatif": "0"
          },
          "action": "modification"
        },
        {
          "libelle": "Recherches scientifiques et technologiques pluridisciplinaires",
          "id": "50696",
          "AE": {
            "montantPositif": "0",
            "montantNegatif": "5000000"
          },
          "CP": {
            "montantPositif": "0",
            "montantNegatif": "5000000"
          },
          "action": "modification"
        },
        {
          "libelle": "Recherche spatiale",
          "id": "50697",
          "AE": {
            "montantPositif": "0",
            "montantNegatif": "0"
          },
          "CP": {
            "montantPositif": "0",
            "montantNegatif": "0"
          },
          "action": "modification"
        },
        {
          "libelle": "Recherche dans les domaines de l'énergie, du développement et de la mobilité durables",
          "id": "50698",
          "AE": {
            "montantPositif": "0",
            "montantNegatif": "0"
          },
          "CP": {
            "montantPositif": "0",
            "montantNegatif": "0"
          },
          "action": "modification"
        },
        {
          "libelle": "Recherche et enseignement supérieur en matière économique et industrielle",
          "id": "50699",
          "AE": {
            "montantPositif": "0",
            "montantNegatif": "0"
          },
          "CP": {
            "montantPositif": "0",
            "montantNegatif": "0"
          },
          "action": "modification"
        },
        {
          "libelle": "Recherche duale (civile et militaire)",
          "id": "50700",
          "AE": {
            "montantPositif": "0",
            "montantNegatif": "0"
          },
          "CP": {
            "montantPositif": "0",
            "montantNegatif": "0"
          },
          "action": "modification"
        },
        {
          "libelle": "Recherche culturelle et culture scientifique",
          "id": "50701",
          "AE": {
            "montantPositif": "0",
            "montantNegatif": "0"
          },
          "CP": {
            "montantPositif": "0",
            "montantNegatif": "0"
          },
          "action": "modification"
        },
        {
          "libelle": "Enseignement supérieur et recherche agricoles",
          "id": "50702",
          "AE": {
            "montantPositif": "0",
            "montantNegatif": "0"
          },
          "CP": {
            "montantPositif": "0",
            "montantNegatif": "0"
          },
          "action": "modification"
        }
      ],
      "totalAE": {
        "montantPositif": "5000000",
        "montantNegatif": "5000000",
        "solde": "0"
      },
      "totalCP": {
        "montantPositif": "5000000",
        "montantNegatif": "5000000",
        "solde": "0"
      }
    }
  },
  "representations": [
    {
      "nom": "PDF",
      "typeMime": {
        "type": "application",
        "subType": "PDF"
      },
      "statutRepresentation": {
        "verbatim": true,
        "canonique": true,
        "officielle": true,
        "transcription": false,
        "enregistrement": false
      },
      "contenu": {
        "documentURI": "/15/amendements/1255C/AN/1814.pdf"
      }
    }
  ],
  "seanceDiscussion": "RUANR5L15S2019IDS21338",
  "sort": {
    "dateSaisie": "2018-11-14T05:46:56.000+01:00",
    "sortEnSeance": "Non soutenu"
  },
  "dateDepot": "2018-11-09T01:00:00.000+01:00",
  "dateDistribution": "2018-11-12T01:00:00.000+01:00",
  "article99": "0",
  "loiReference": {}
}