{
  "uid": "AMANR5L15PO59051B1352P0D1N30",
  "identifiant": {
    "legislature": "15",
    "numero": "30",
    "numRect": "0",
    "saisine": {
      "texteLegislatifRef": "PIONANR5L15B1352",
      "numeroPartiePLF": "0",
      "organeExamen": "PO59051",
      "mentionSecondeDeliberation": "0"
    }
  },
  "numeroLong": "CL30",
  "etapeTexte": "1ère lecture (2ème assemblée saisie)",
  "triAmendement": "caaaaaaaaaaaaaaaaaaaaaaaaaaaaaaaaaaaaaaaaaaaaaaaaaw",
  "cardinaliteAmdtMultiples": "1",
  "etat": "Irrecevable",
  "signataires": {
    "auteur": {
      "typeAuteur": "Depute",
      "acteurRef": "PA330240",
      "groupePolitiqueRef": "PO730934"
    },
    "cosignatairesRefs": [
      "PA608826",
      "PA642847",
      "PA267735",
      "PA267429",
      "PA609245",
      "PA605036",
      "PA718780",
      "PA767",
      "PA719272",
      "PA330788",
      "PA721678",
      "PA998",
      "PA712015",
      "PA719318",
      "PA267289",
      "PA721636",
      "PA330240",
      "PA267794",
      "PA346218",
      "PA330684"
    ],
    "texteAffichable": "M.&#160;Ciotti,  Mme&#160;Anthoine, M.&#160;Door, M.&#160;Cattin, M.&#160;Bazin, Mme&#160;Meunier, M.&#160;Masson, Mme&#160;Lacroute, M.&#160;Reyn&#232;s, M.&#160;Reda, M.&#160;Cinieri, M.&#160;Parigi, Mme&#160;Tabarot, Mme&#160;Duby-Muller, M.&#160;de Ganay, M.&#160;Dive, Mme&#160;Val&#233;rie&#160;Boyer, M.&#160;Dassault, M.&#160;Abad et Mme&#160;Trastour-Isnart"
  },
  "pointeurFragmentTexte": {
    "division": {
      "titre": "Article 3",
      "articleDesignationCourte": "APRÈS ART. 3",
      "type": "ARTICLE",
      "avantAApres": "Apres",
      "divisionRattachee": "APRÈS L'ARTICLE 3, insérer l'article suivant:",
      "articleAdditionnel": "1",
      "urlDivisionTexteVise": "/15/textes/1352.asp#D_Article_3"
    }
  },
  "corps": {
    "dispositif": "<p style=\"text-align: justify;\">&#171;&#160;&#192; titre exp&#233;rimental, pour une dur&#233;e de trois ans, dans la r&#233;gion d&#8217;Ile de France, le Gouvernement peut pr&#233;voir que l&#8217;acc&#232;s aux traitements automatis&#233;s mentionn&#233;s aux articles L.&#160;222&#8209;1, L.&#160;232&#8209;2 et L.&#160;232&#8209;7 ainsi qu&#8217;&#224; l&#8217;article&#160;230&#8209;10 du code de proc&#233;dure p&#233;nale s&#8217;effectue au moyen d&#8217;une interface d&#8217;acc&#232;s unique, selon des modalit&#233;s fix&#233;es par un d&#233;cret en Conseil d&#8217;&#201;tat, pris apr&#232;s avis de la Commission nationale de l&#8217;informatique et des libert&#233;s.&#160;&#187;</p>",
    "exposeSommaire": "<p style=\"text-align: justify;\">Cet amendement vise &#224; cr&#233;er une interface informatique unique, destin&#233;e &#224; faciliter les recherches entreprises par les services en charge de la lutte contre le terrorisme. Cette interface permettrait, en saisissant le nom de la personne sur laquelle portent ces recherches, de savoir si cette personne figure dans un ou plusieurs fichiers et d&#8217;engager ainsi plus efficacement les d&#233;marches pour acc&#233;der aux informations qu&#8217;ils contiennent.</p><p>Ces dispositions s&#8217;inspirent de nombreux travaux parlementaires, et notamment d&#8217;une proposition formul&#233;e en ce sens par le rapport n&#176; 2828 de la commission d&#8217;enqu&#234;te sur la surveillance des fili&#232;res et des individus djihadistes, adopt&#233; le 2 juin 2015 par la commission des lois.</p>",
    "cartoucheDelaiDepotDepasse": "Sous réserve de son traitement par les services de l'Assemblée nationale et de sa recevabilité"
  },
  "representations": [
    {
      "nom": "PDF",
      "typeMime": {
        "type": "application",
        "subType": "PDF"
      },
      "statutRepresentation": {
        "verbatim": true,
        "canonique": true,
        "officielle": true,
        "transcription": false,
        "enregistrement": false
      },
      "contenu": {
        "documentURI": "/15/amendements/1352/CION_LOIS/CL30.pdf"
      }
    }
  ],
  "dateDepot": "2019-01-19T01:00:00.000+01:00",
  "article99": "0",
  "loiReference": {
    "codeLoi": "zzz"
  }
}