{
  "uid": "AMANR5L15SEA717460B2272P1D1N2601",
  "identifiant": {
    "legislature": "15",
    "numero": "2601",
    "numRect": "0",
    "saisine": {
      "texteLegislatifRef": "PRJLANR5L15B2272",
      "numeroPartiePLF": "1",
      "organeExamen": "PO717460",
      "mentionSecondeDeliberation": "0"
    }
  },
  "numeroLong": "I-2601",
  "etapeTexte": "1ère lecture (1ère assemblée saisie)",
  "triAmendement": "aicaaaaaaaaaaaaaaaaaaaaaaaaaaaaaaaaaaaaaaaaaaaaaaazzzzzzzzzo",
  "cardinaliteAmdtMultiples": "1",
  "etat": "Discuté",
  "signataires": {
    "auteur": {
      "typeAuteur": "Depute",
      "acteurRef": "PA609726",
      "groupePolitiqueRef": "PO730934"
    },
    "cosignatairesRefs": [
      "PA609726"
    ],
    "texteAffichable": "M.&#160;Aubert"
  },
  "pointeurFragmentTexte": {
    "division": {
      "titre": "Article 16",
      "articleDesignationCourte": "ART. 16",
      "type": "ARTICLE",
      "avantAApres": "A",
      "divisionRattachee": "ARTICLE 16",
      "urlDivisionTexteVise": "/15/textes/2272A.asp#D_Article_16"
    }
  },
  "corps": {
    "dispositif": "<p>Supprimer cet article.</p>",
    "exposeSommaire": "<p style=\"text-align: justify;\">Cet amendement a pour objet de maintenir l&#8217;utilisation du Gazole Non Routier &#224; l&#8217;ensemble des secteurs d&#8217;activit&#233; aujourd&#8217;hui b&#233;n&#233;ficiaires, en particulier celui des travaux publics. La suppression du gazole destin&#233; &#224; &#234;tre utilis&#233; comme carburant sous condition d&#8217;emploi, tel que le pr&#233;voit l&#8217;article&#160;16 dans sa r&#233;daction actuelle, entra&#238;nera un surco&#251;t de pr&#232;s de 900 millions d&#8217;euros pour les seules entreprises de travaux publics (soit l&#8217;&#233;quivalent de 60&#160;% de leur marge).</p><p style=\"text-align: justify;\">Cette mesure est d&#8217;autant plus brutale que les entreprises de travaux publics, qui d&#233;pendent de la commande publique &#224; hauteur des deux tiers de leur activit&#233;, ne pourront r&#233;percuter la hausse de leurs co&#251;ts de production dans les contrats en cours. Consid&#233;rant que les contrats g&#233;n&#233;ralement conclus dans le cadre des march&#233;s de travaux sont pluriannuels, le d&#233;s&#233;quilibre contractuel qui r&#233;sulterait de la suppression du GNR dans les travaux publics, sera des plus pr&#233;judiciables pour l&#8217;ensemble de la fili&#232;re, notamment les PME, qui composent &#224; 80&#160;% le tissu des entreprises de travaux publics. A supposer que les co&#251;ts induits par la suppression du GNR seraient r&#233;percut&#233;s dans les contrats en cours, l&#8217;inflation des prix limitera n&#233;cessairement &#224; budgets constants le volume d&#8217;investissement des donneurs d&#8217;ordre public et ce, dans un contexte de sous investissement r&#233;current en mati&#232;re d&#8217;infrastructures.</p><p style=\"text-align: justify;\">Au regard de ce qui pr&#233;c&#232;de, il convient donc de maintenir le r&#233;gime applicable existant en mati&#232;re de carburant sous condition d&#8217;emploi pour l&#8217;ensemble des secteurs d&#8217;activit&#233;.</p>"
  },
  "representations": [
    {
      "nom": "PDF",
      "typeMime": {
        "type": "application",
        "subType": "PDF"
      },
      "statutRepresentation": {
        "verbatim": true,
        "canonique": true,
        "officielle": true,
        "transcription": false,
        "enregistrement": false
      },
      "contenu": {
        "documentURI": "/15/amendements/2272A/AN/2601.pdf"
      }
    }
  ],
  "seanceDiscussion": "RUANR5L15S2020IDS21861",
  "sort": {
    "dateSaisie": "2019-10-14T23:55:22.000+02:00",
    "sortEnSeance": "Non soutenu"
  },
  "dateDepot": "2019-10-10T02:00:00.000+02:00",
  "dateDistribution": "2019-10-14T02:00:00.000+02:00",
  "article99": "0",
  "loiReference": {}
}