{
  "uid": "AMANR5L15PO766718B2187P0D1N1863",
  "identifiant": {
    "legislature": "15",
    "numero": "1863",
    "numRect": "0",
    "saisine": {
      "texteLegislatifRef": "PRJLANR5L15B2187",
      "numeroPartiePLF": "0",
      "organeExamen": "PO766718",
      "mentionSecondeDeliberation": "0"
    }
  },
  "numeroLong": "1863",
  "etapeTexte": "1ère lecture (1ère assemblée saisie)",
  "triAmendement": "ieaaaaaaaaaaaaaaaaaaaaaaaaaaaaaaaaaaaaaaaaaaaaaaaaam",
  "cardinaliteAmdtMultiples": "1",
  "etat": "Discuté",
  "signataires": {
    "auteur": {
      "typeAuteur": "Depute",
      "acteurRef": "PA334768",
      "groupePolitiqueRef": "PO730964"
    },
    "cosignatairesRefs": [
      "PA334768"
    ],
    "texteAffichable": "M.&#160;Touraine, rapporteur"
  },
  "pointeurFragmentTexte": {
    "division": {
      "titre": "Article 21",
      "articleDesignationCourte": "APRÈS ART. 21",
      "type": "ARTICLE",
      "avantAApres": "Apres",
      "divisionRattachee": "APRÈS L'ARTICLE 21, insérer l'article suivant:",
      "articleAdditionnel": "1",
      "urlDivisionTexteVise": "/15/textes/2187.asp#D_Article_21"
    }
  },
  "corps": {
    "dispositif": "<p style=\"text-align: justify;\">La seconde phrase du septi&#232;me alin&#233;a de l&#8217;article L.&#160;1111&#8209;4 du code de la sant&#233; publique est ainsi r&#233;dig&#233;e&#160;:</p><p style=\"text-align: justify;\">&#171;&#160;Sauf urgence vitale, aucun acte chirurgical sur les organes g&#233;nitaux visant seulement &#224; conformer l&#8217;apparence au sexe d&#233;clar&#233; ne peut &#234;tre entrepris avant que le mineur ne soit apte &#224; y consentir apr&#232;s une information appropri&#233;e.&#160;&#187;&#160;</p>",
    "exposeSommaire": "<p style=\"text-align: justify;\">La prise en charge m&#233;dicale des enfants pr&#233;sentant des variations du d&#233;veloppement sexuel (intersexes) est un des probl&#232;mes majeurs apparu au cours des d&#233;bats pr&#233;c&#233;dant la r&#233;vision de la loi relative &#224; la bio&#233;thique. D&#233;j&#224; point&#233;e du doigt par de nombreuses organisations et institutions nationales et internationales, celle-ci a &#233;galement fait l&#8217;objet de recommandations d&#8217;am&#233;lioration par le Conseil d&#8217;&#201;tat et dans le rapport de la mission d&#8217;information de l&#8217;Assembl&#233;e Nationale.&#160;</p><p style=\"text-align: justify;\">Ces interventions &#233;tant le plus souvent r&#233;alis&#233;es sur des enfants de moins de trois ans, ceux-ci ne peuvent &#234;tre associ&#233;s &#224; la d&#233;cision m&#233;dicale ou consentir &#224; un traitement, comme l&#8217;exige pourtant le code de la sant&#233; publique. C&#8217;est donc aux titulaires de l&#8217;autorit&#233; parentale de consentir de fa&#231;on &#233;clair&#233;e &#224; un traitement hormonal ou &#224; une op&#233;ration chirurgicale, sur la base d&#8217;une information pr&#233;alable donn&#233;e par le corps m&#233;dical. Toutefois, le caract&#232;re &#233;clair&#233;, et par voie de cons&#233;quence l&#8217;int&#233;grit&#233; du consentement des parents, est contestable dans le cas de traitements m&#233;dicaux effectu&#233;s sur des enfants en bas &#226;ge dans un but d&#8217;assignation sexu&#233;e, comme l&#8217;a montr&#233; le Conseil d&#8217;&#201;tat.&#160;</p><p style=\"text-align: justify;\">Le pr&#233;sent amendement propose que le consentement de l&#8217;enfant concern&#233; soit n&#233;cessaire pour proc&#233;der &#224; des interventions chirurgicales d&#8217;assignation sexu&#233;e, en dehors de toute urgence vitale.&#160;</p>"
  },
  "representations": [
    {
      "nom": "PDF",
      "typeMime": {
        "type": "application",
        "subType": "PDF"
      },
      "statutRepresentation": {
        "verbatim": true,
        "canonique": true,
        "officielle": true,
        "transcription": false,
        "enregistrement": false
      },
      "contenu": {
        "documentURI": "/15/amendements/2187/CSBIOETH/1863.pdf"
      }
    }
  ],
  "sort": {
    "dateSaisie": "2019-09-13T23:32:19.000+02:00",
    "sortEnSeance": "Retiré"
  },
  "dateDepot": "2019-09-05T02:00:00.000+02:00",
  "dateDistribution": "2019-09-11T02:00:00.000+02:00",
  "article99": "0",
  "loiReference": {
    "codeLoi": "c santé publique",
    "divisionCodeLoi": "L1111-4"
  }
}