{
  "uid": "AMANR5L15SEA717460BTC0902P0D1N1818",
  "identifiant": {
    "legislature": "15",
    "numero": "1818",
    "numRect": "0",
    "saisine": {
      "texteLegislatifRef": "PRJLANR5L15BTC0902",
      "numeroPartiePLF": "0",
      "organeExamen": "PO717460",
      "mentionSecondeDeliberation": "0"
    }
  },
  "numeroLong": "1818",
  "etapeTexte": "1ère lecture (1ère assemblée saisie)",
  "triAmendement": "djezx",
  "cardinaliteAmdtMultiples": "1",
  "etat": "Discuté",
  "signataires": {
    "auteur": {
      "typeAuteur": "Depute",
      "acteurRef": "PA722398",
      "groupePolitiqueRef": "PO730964"
    },
    "cosignatairesRefs": [
      "PA722398"
    ],
    "texteAffichable": "M.&#160;Rebeyrotte"
  },
  "pointeurFragmentTexte": {
    "division": {
      "titre": "Article 9",
      "articleDesignationCourte": "ART. 9",
      "type": "ARTICLE",
      "avantAApres": "A",
      "divisionRattachee": "ARTICLE 9",
      "urlDivisionTexteVise": "/15/textes/0902.asp#D_Article_9"
    },
    "alinea": {
      "avantAApres": "A",
      "numero": "3",
      "alineaDesignation": "Alinéa 3"
    }
  },
  "corps": {
    "dispositif": "<p>&#192; l&#8217;alin&#233;a&#160;3, apr&#232;s le mot&#160;:</p><p>&#171;&#160;promotionnelles&#160;&#187;,</p><p>ins&#233;rer les mots&#160;:</p><p>&#171;&#160;instantan&#233;es ou diff&#233;r&#233;es dans le temps, financ&#233;es par le distributeur ou le fournisseur&#160;&#187;.</p>",
    "exposeSommaire": "<p style=\"text-align: justify;\">Le texte de loi devrait &#234;tre plus pr&#233;cis sur le contenu de l&#8217;ordonnance afin de s&#8217;assurer que l&#8217;&#233;quilibre des EGA soit respect&#233;. En particulier, il est important que&#160;:</p><p style=\"text-align: justify;\">&#183; L&#8217;encadrement en valeur et en volume des op&#233;rations promotionnelles qu&#8217;elles soient financ&#233;es par le distributeur et/ou par le fournisseur.</p><p style=\"text-align: justify;\">&#183; Les promotions sur les produits sous marque de distributeur doivent &#234;tre concern&#233;es par l&#8217;encadrement l&#233;gislatif en volume et en valeur. Le risque est &#233;norme que si les MDD ne sont pas concern&#233;es par l&#8217;encadrement, elles fassent l&#8217;objet d&#8217;une guerre des promotions destructrices de valeur pour l&#8217;ensemble des op&#233;rateurs de la cha&#238;ne d&#8217;approvisionnement. Certains comportements sont d&#233;j&#224; &#224; l&#8217;&#339;uvre en la mati&#232;re, la loi doit donc &#234;tre tr&#232;s claire sur le contenu de l&#8217;ordonnance.</p><p style=\"text-align: justify;\">&#183; De m&#234;me la grande distribution accorde des r&#233;ductions importantes sur des achats ult&#233;rieurs. Il est donc raisonnable d&#8217;envisager un encadrement strict de ces pratiques d&#232;s le projet de loi.</p><p style=\"text-align: justify;\">Aucun contournement de l&#8217;encadrement des promotions ne doit &#234;tre permis&#160;: mieux vaut pr&#233;server ce point d&#232;s le projet de loi, afin que l&#8217;ordonnance soit conforme aux engagements.</p>"
  },
  "representations": [
    {
      "nom": "PDF",
      "typeMime": {
        "type": "application",
        "subType": "PDF"
      },
      "statutRepresentation": {
        "verbatim": true,
        "canonique": true,
        "officielle": true,
        "transcription": false,
        "enregistrement": false
      },
      "contenu": {
        "documentURI": "/15/amendements/0902/AN/1818.pdf"
      }
    }
  ],
  "seanceDiscussion": "RUANR5L15S2018IDS21054",
  "sort": {
    "dateSaisie": "2018-05-25T12:22:58.000+02:00",
    "sortEnSeance": "Non soutenu"
  },
  "dateDepot": "2018-05-17T02:00:00.000+02:00",
  "dateDistribution": "2018-05-21T02:00:00.000+02:00",
  "article99": "0",
  "loiReference": {}
}