{
  "uid": "AMANR5L15PO59051B2357P0D1N971",
  "identifiant": {
    "legislature": "15",
    "numero": "971",
    "numRect": "0",
    "saisine": {
      "texteLegislatifRef": "PRJLANR5L15B2357",
      "numeroPartiePLF": "0",
      "organeExamen": "PO59051",
      "mentionSecondeDeliberation": "0"
    }
  },
  "numeroLong": "CL971",
  "etapeTexte": "1ère lecture (2ème assemblée saisie)",
  "triAmendement": "itaaaaaaaaaaaaaaaaaaaaaaaaaaaaaaaaaaaaaaaaaaaaaaaab",
  "cardinaliteAmdtMultiples": "1",
  "etat": "Discuté",
  "signataires": {
    "auteur": {
      "typeAuteur": "Depute",
      "acteurRef": "PA719942",
      "groupePolitiqueRef": "PO730970"
    },
    "cosignatairesRefs": [
      "PA719942"
    ],
    "texteAffichable": "M.&#160;Baudu"
  },
  "pointeurFragmentTexte": {
    "division": {
      "titre": "Article 18",
      "articleDesignationCourte": "ART. 18",
      "type": "ARTICLE",
      "avantAApres": "A",
      "divisionRattachee": "ARTICLE 18",
      "urlDivisionTexteVise": "/15/textes/2357.asp#D_Article_18"
    },
    "alinea": {
      "numero": "1"
    }
  },
  "corps": {
    "dispositif": "<p style=\"text-align: justify;\">Supprimer les alin&#233;as 1 &#224; 6.</p>",
    "exposeSommaire": "<p style=\"text-align: justify;\">L&#8217;ensemble des acteurs publics ainsi que la population aspirent &#224; une stabilit&#233; et &#224; une lisibilit&#233; dans la r&#233;partition des comp&#233;tences entre collectivit&#233;s.</p><p>Le pr&#233;sent article vise dans sa r&#233;daction initiale &#224; introduire une souplesse dans la mobilisation de financements &#224; destination des acteurs &#233;conomiques afin de prendre en compte des situations exceptionnelles, li&#233;es &#224; une catastrophe naturelle.</p><p>Le pr&#233;sent amendement vise &#224; se limiter &#224; ce strict objectif et &#224; supprimer les dispositions des I et II introduites par le S&#233;nat en mati&#232;re de comp&#233;tence &#233;conomique dans les domaines de l&#8217;agriculture et de la p&#234;che. Ces derni&#232;res dispositions, en outre, n&#8217;ont pas fait l&#8217;objet de concertation suffisante entre les diff&#233;rents niveaux de collectivit&#233; et ne font pas consensus.</p>"
  },
  "representations": [
    {
      "nom": "PDF",
      "typeMime": {
        "type": "application",
        "subType": "PDF"
      },
      "statutRepresentation": {
        "verbatim": true,
        "canonique": true,
        "officielle": true,
        "transcription": false,
        "enregistrement": false
      },
      "contenu": {
        "documentURI": "/15/amendements/2357/CION_LOIS/CL971.pdf"
      }
    }
  ],
  "sort": {
    "dateSaisie": "2019-11-07T16:58:46.000+01:00",
    "sortEnSeance": "Retiré"
  },
  "dateDepot": "2019-11-02T01:00:00.000+01:00",
  "dateDistribution": "2019-11-05T01:00:00.000+01:00",
  "article99": "0",
  "loiReference": {}
}