{
  "uid": "AMANR5L15SEA717460B0235P2D1N945",
  "identifiant": {
    "legislature": "15",
    "numero": "945",
    "numRect": "0",
    "saisine": {
      "texteLegislatifRef": "PRJLANR5L15B0235",
      "numeroPartiePLF": "2",
      "organeExamen": "PO717460",
      "mentionSecondeDeliberation": "0"
    }
  },
  "numeroLong": "II-945",
  "etapeTexte": "1ère lecture (1ère assemblée saisie)",
  "triAmendement": "zrzw",
  "cardinaliteAmdtMultiples": "1",
  "etat": "Irrecevable",
  "signataires": {
    "auteur": {
      "typeAuteur": "Depute",
      "acteurRef": "PA721062",
      "groupePolitiqueRef": "PO730958"
    },
    "cosignatairesRefs": [
      "PA718860",
      "PA722142",
      "PA721210",
      "PA721062",
      "PA720430",
      "PA720846",
      "PA721960",
      "PA588884",
      "PA720892",
      "PA721202",
      "PA719578",
      "PA718868",
      "PA719676",
      "PA720422",
      "PA720286",
      "PA2150",
      "PA721226"
    ],
    "texteAffichable": "M.&#160;Ratenon,  Mme&#160;Autain, M.&#160;Bernalicis, M.&#160;Coquerel, M.&#160;Corbi&#232;re, Mme&#160;Fiat, M.&#160;Lachaud, M.&#160;Larive, M.&#160;M&#233;lenchon, Mme&#160;Obono, Mme&#160;Panot, M.&#160;Prud&apos;homme, M.&#160;Quatennens, Mme&#160;Ressiguier, Mme&#160;Rubin, M.&#160;Ruffin et Mme&#160;Taurine"
  },
  "pointeurFragmentTexte": {
    "missionVisee": {
      "idMissionAN": "22",
      "libelleMission": "Outre-mer",
      "codeMissionPLF": "B",
      "libelleMissionPLF": "Répartition, par mission et programme, des crédits du budget général"
    },
    "division": {
      "titre": "Article 57",
      "articleDesignationCourte": "APRÈS ART. 57",
      "type": "ARTICLE",
      "avantAApres": "Apres",
      "divisionRattachee": "APRÈS L'ARTICLE 57, insérer l'article suivant:",
      "articleAdditionnel": "1",
      "urlDivisionTexteVise": "/15/textes/0235C.asp#D_Article_57"
    }
  },
  "corps": {
    "dispositif": "<p style=\"text-align: justify;\">Le Gouvernement remet au Parlement, dans un d&#233;lai de neuf mois &#224; compter de la promulgation de la pr&#233;sente loi, un rapport qui &#233;value le co&#251;t ou les &#233;conomies en termes de moyens humains, financiers et organisationnels ainsi que l&#8217;impact environnemental et &#233;conomique qu&#8217;induirait la mise en &#339;uvre d&#8217;un plan public d&#8217;investissement pour la r&#233;alisation de grands projets structurants au titre de la croissance bleue qui pourraient &#234;tre envisag&#233;s et financ&#233;s. Le rapport fournit un d&#233;tail chiffr&#233; par projet et pour chaque collectivit&#233; d&#8217;outre-mer.</p>",
    "exposeSommaire": "<p style=\"text-align: justify;\">Par cet amendement nous demandons un rapport d&#8217;information sur les grands projets structurant qui peuvent repr&#233;senter un b&#233;n&#233;fice significatif dans les Outre-mers au titre de la croissance bleu.</p><p style=\"text-align: justify;\">En effet, gr&#226;ce aux Outre-mers, la France est le deuxi&#232;me territoire maritime mondial juste derri&#232;re les &#201;tats-Unis d&#8217;Am&#233;rique. Ce fait souvent ignor&#233; repr&#233;sente une opportunit&#233; importante de d&#233;veloppement des Outre-mers. Pour en faire une r&#233;alit&#233; une s&#233;rie de grands projets initi&#233;s et financ&#233;s&#160;par l&#8217;&#201;tat fran&#231;ais sont n&#233;cessaires. Ils auront un effet d&#8217;entra&#238;nement sur chaque collectivit&#233; d&#8217;Outre-mer. Ils permettront de r&#233;sorber les in&#233;galit&#233;s inacceptables qui perdurent entre la m&#233;tropole et les Outre-mers.</p><p style=\"text-align: justify;\">L&#8217;objet de ce rapport sera d&#8217;identifier et de chiffrer ces projets par collectivit&#233; d&#8217;Outre-mer.</p>"
  },
  "representations": [
    {
      "nom": "PDF",
      "typeMime": {
        "type": "application",
        "subType": "PDF"
      },
      "statutRepresentation": {
        "verbatim": true,
        "canonique": true,
        "officielle": true,
        "transcription": false,
        "enregistrement": false
      },
      "contenu": {
        "documentURI": "/15/amendements/0235C/AN/945.pdf"
      }
    }
  ],
  "dateDepot": "2017-11-06T01:00:00.000+01:00",
  "article99": "0",
  "loiReference": {}
}