{
  "uid": "AMANR5L15SEA717460B1297P0D1N816",
  "identifiant": {
    "legislature": "15",
    "numero": "816",
    "numRect": "0",
    "saisine": {
      "texteLegislatifRef": "PRJLANR5L15B1297",
      "numeroPartiePLF": "0",
      "organeExamen": "PO717460",
      "mentionSecondeDeliberation": "0"
    }
  },
  "numeroLong": "816",
  "etapeTexte": "1ère lecture (1ère assemblée saisie)",
  "triAmendement": "eoaaaaaaaaaaaaaaaaaaaaaaaaaaaaaaaaaaaaaaaaaaaaaaaazo",
  "cardinaliteAmdtMultiples": "1",
  "etat": "Irrecevable",
  "signataires": {
    "auteur": {
      "typeAuteur": "Depute",
      "acteurRef": "PA721932",
      "groupePolitiqueRef": "PO723569"
    },
    "cosignatairesRefs": [
      "PA721932"
    ],
    "texteAffichable": "Mme&#160;Lorho"
  },
  "pointeurFragmentTexte": {
    "division": {
      "titre": "Article 29",
      "articleDesignationCourte": "ART. 29",
      "type": "ARTICLE",
      "avantAApres": "A",
      "divisionRattachee": "ARTICLE 29",
      "urlDivisionTexteVise": "/15/textes/1297.asp#D_Article_29"
    }
  },
  "corps": {
    "dispositif": "<p>Cr&#233;ation d&#8217;un article additionnel&#160;:</p><p style=\"text-align: justify;\">&#171;&#160;En annexe au projet de loi de financement de la s&#233;curit&#233; sociale, il est pr&#233;sent&#233; une &#233;tude d&#8217;impact sur la qualit&#233; de vie au travail des professionnels de sant&#233; &#187;.</p>",
    "exposeSommaire": "<p style=\"text-align: justify;\">La F&#233;d&#233;ration Nationale des &#233;tudiants en soins infirmiers (FNESI) r&#233;v&#233;lait r&#233;cemment le mal-&#234;tre des infirmiers en formation dans le cadre hospitalier. Sur les 14&#160;000 personnes (soit 15 % des infirmiers en formation) y ayant r&#233;pondu, 40 % ont admis &#234;tre confront&#233;s &#224; des situations de harc&#232;lement. Leur mal-&#234;tre &#233;merge dans le cadre de stage au sein des h&#244;pitaux. Afin que cet &#233;tat de fait ne porte pas pr&#233;judice aux patients, il est n&#233;cessaire qu&#8217;il soit &#233;valu&#233; l&#8217;impact du PLFSS sur la qualit&#233; de vie des professionnels de sant&#233; au travail. &#160;Cet article s'inscrit dans la poursuite des objectifs de l'article 29, visant &#224; la transformation de notre syst&#232;me de sant&#233; par des modes d'organisation innovants.&#160;</p>"
  },
  "representations": [
    {
      "nom": "PDF",
      "typeMime": {
        "type": "application",
        "subType": "PDF"
      },
      "statutRepresentation": {
        "verbatim": true,
        "canonique": true,
        "officielle": true,
        "transcription": false,
        "enregistrement": false
      },
      "contenu": {
        "documentURI": "/15/amendements/1297/AN/816.pdf"
      }
    }
  ],
  "dateDepot": "2018-10-19T02:00:00.000+02:00",
  "article99": "0",
  "loiReference": {}
}