{
  "uid": "AMANR5L15SEA717460B0911P0D1N1722",
  "identifiant": {
    "legislature": "15",
    "numero": "1722",
    "numRect": "0",
    "saisine": {
      "texteLegislatifRef": "PRJLANR5L15B0911",
      "numeroPartiePLF": "0",
      "organeExamen": "PO717460",
      "mentionSecondeDeliberation": "0"
    }
  },
  "numeroLong": "1722",
  "etapeTexte": "1ère lecture (1ère assemblée saisie)",
  "triAmendement": "aslzzzi",
  "cardinaliteAmdtMultiples": "1",
  "etat": "Discuté",
  "signataires": {
    "auteur": {
      "typeAuteur": "Depute",
      "acteurRef": "PA336175",
      "groupePolitiqueRef": "PO723569"
    },
    "cosignatairesRefs": [
      "PA336175",
      "PA608292"
    ],
    "texteAffichable": "Mme&#160;Pinel et Mme&#160;Dubi&#233;"
  },
  "pointeurFragmentTexte": {
    "division": {
      "titre": "Article PREMIER",
      "articleDesignationCourte": "AVANT ART. PREMIER",
      "type": "ARTICLE",
      "avantAApres": "Avant",
      "divisionRattachee": "AVANT L'ARTICLE PREMIER, insérer l'article suivant:",
      "articleAdditionnel": "1",
      "urlDivisionTexteVise": "/15/textes/0911.asp#D_Article_1er"
    }
  },
  "corps": {
    "dispositif": "<p style=\"text-align: justify;\">&#192; la seconde phrase du deuxi&#232;me alin&#233;a de l&#8217;article&#160;18 de la Constitution, les mots&#160;:&#160;&#171;&#160;, hors sa pr&#233;sence,&#160;&#187; sont supprim&#233;s.</p>",
    "exposeSommaire": "<p style=\"text-align: justify;\">L&#8217;adresse du Pr&#233;sident de la R&#233;publique au Parlement r&#233;uni en Congr&#232;s peut &#234;tre consid&#233;r&#233; comme contrevenant au principe de s&#233;paration des pouvoirs.</p><p style=\"text-align: justify;\">Mais, l&#8217;impossibilit&#233; pour le l&#233;gislateur de pouvoir lui r&#233;pondre en sa pr&#233;sence, constitue quant &#224; elle, la manifestation d&#8217;un d&#233;s&#233;quilibre en faveur du pouvoir ex&#233;cutif, ce qui fragilise la d&#233;mocratie repr&#233;sentative.</p><p style=\"text-align: justify;\">Par cons&#233;quent, cet amendement vise &#224; rem&#233;dier &#224; cette situation.</p>"
  },
  "representations": [
    {
      "nom": "PDF",
      "typeMime": {
        "type": "application",
        "subType": "PDF"
      },
      "statutRepresentation": {
        "verbatim": true,
        "canonique": true,
        "officielle": true,
        "transcription": false,
        "enregistrement": false
      },
      "contenu": {
        "documentURI": "/15/amendements/0911/AN/1722.pdf"
      }
    }
  ],
  "seanceDiscussion": "RUANR5L15S2018IDS21168",
  "sort": {
    "dateSaisie": "2018-07-17T01:36:25.000+02:00",
    "sortEnSeance": "Adopté"
  },
  "dateDepot": "2018-07-06T02:00:00.000+02:00",
  "dateDistribution": "2018-07-09T02:00:00.000+02:00",
  "article99": "0",
  "loiReference": {
    "codeLoi": "Constitution",
    "divisionCodeLoi": "18"
  }
}