{
  "uid": "AMANR5L15SEA717460BTC1237P0D1N639",
  "identifiant": {
    "legislature": "15",
    "numero": "639",
    "numRect": "0",
    "saisine": {
      "texteLegislatifRef": "PRJLANR5L15BTC1237",
      "numeroPartiePLF": "0",
      "organeExamen": "PO717460",
      "mentionSecondeDeliberation": "0"
    }
  },
  "numeroLong": "639",
  "etapeTexte": "1ère lecture (1ère assemblée saisie)",
  "triAmendement": "aboaaaaaaaaaaaaaaaaaaaaaaaaaaaaaaaaaaaaaaaaaaaaaaaski",
  "cardinaliteAmdtMultiples": "1",
  "etat": "Discuté",
  "signataires": {
    "auteur": {
      "typeAuteur": "Depute",
      "acteurRef": "PA709315",
      "groupePolitiqueRef": "PO730934"
    },
    "cosignatairesRefs": [
      "PA330909",
      "PA267527",
      "PA709315",
      "PA718884",
      "PA856",
      "PA721286",
      "PA718784",
      "PA334654",
      "PA346218",
      "PA712015",
      "PA334149",
      "PA718780",
      "PA266808",
      "PA609245",
      "PA719318",
      "PA608016",
      "PA718838",
      "PA721314",
      "PA721070",
      "PA346054",
      "PA721474",
      "PA336316"
    ],
    "texteAffichable": "M.&#160;Viala,  M.&#160;Fasquelle, Mme&#160;Anthoine, Mme&#160;Bazin-Malgras, M.&#160;Brun, M.&#160;Straumann, M.&#160;Saddier, M.&#160;Emmanuel&#160;Maquet, M.&#160;Cherpion, M.&#160;Masson, M.&#160;Bouchet, Mme&#160;Ramassamy, M.&#160;Dive, Mme&#160;Louwagie, M.&#160;Pauget, M.&#160;Ramadier, Mme&#160;Lacroute, M.&#160;Schellenberger, M.&#160;Rolland, M.&#160;Viry, Mme&#160;Trastour-Isnart et M.&#160;Descoeur"
  },
  "pointeurFragmentTexte": {
    "division": {
      "titre": "Article 4",
      "articleDesignationCourte": "ART. 4",
      "type": "ARTICLE",
      "avantAApres": "A",
      "divisionRattachee": "ARTICLE 4",
      "urlDivisionTexteVise": "/15/textes/1237.asp#D_Article_4"
    },
    "alinea": {
      "numero": "6"
    }
  },
  "corps": {
    "dispositif": "<p>Supprimer les alin&#233;as 6 &#224; 8.</p>",
    "exposeSommaire": "<p style=\"text-align: justify;\">Il est pr&#233;f&#233;rable de conserver l&#8217;ancienne r&#233;daction de l&#8217;article&#160;59 de la loi n&#176;73&#8209;1193 car cela permet aux chambres de m&#233;tiers et les chambres de commerce et d&#8217;industrie territoriales de disposer de plus d&#8217;autonomie dans la gestion et l&#8217;organisation de ces stages.</p>"
  },
  "representations": [
    {
      "nom": "PDF",
      "typeMime": {
        "type": "application",
        "subType": "PDF"
      },
      "statutRepresentation": {
        "verbatim": true,
        "canonique": true,
        "officielle": true,
        "transcription": false,
        "enregistrement": false
      },
      "contenu": {
        "documentURI": "/15/amendements/1237/AN/639.pdf"
      }
    }
  ],
  "seanceDiscussion": "RUANR5L15S2018IDS21248",
  "sort": {
    "dateSaisie": "2018-09-27T00:51:35.000+02:00",
    "sortEnSeance": "Rejeté"
  },
  "dateDepot": "2018-09-19T02:00:00.000+02:00",
  "dateDistribution": "2018-09-24T02:00:00.000+02:00",
  "article99": "0",
  "loiReference": {}
}