{
  "uid": "AMANR5L15SEA717460B1255P2D1N1666",
  "identifiant": {
    "legislature": "15",
    "numero": "1666",
    "numRect": "0",
    "saisine": {
      "texteLegislatifRef": "PRJLANR5L15B1255",
      "numeroPartiePLF": "2",
      "organeExamen": "PO717460",
      "mentionSecondeDeliberation": "1"
    }
  },
  "numeroLong": "II-1666",
  "etapeTexte": "1ère lecture (1ère assemblée saisie)",
  "triAmendement": "gaaaaaaaaaaaaaaaaaaaaaaaaaaaaaaaaaaaaaaaaaaaaaaaaacjbs",
  "cardinaliteAmdtMultiples": "1",
  "etat": "Discuté",
  "signataires": {
    "auteur": {
      "typeAuteur": "Depute",
      "acteurRef": "PA720230",
      "groupePolitiqueRef": "PO744425"
    },
    "cosignatairesRefs": [
      "PA720230",
      "PA702052",
      "PA267355",
      "PA642868",
      "PA610775",
      "PA267330",
      "PA1960",
      "PA721194",
      "PA721094",
      "PA721110",
      "PA712014",
      "PA721486",
      "PA719806",
      "PA266788",
      "PA267780"
    ],
    "texteAffichable": "Mme&#160;Magnier,  Mme&#160;Auconie, M.&#160;Christophe, Mme&#160;Fr&#233;d&#233;rique&#160;Dumas, M.&#160;Dunoyer, Mme&#160;Firmin Le Bodo, M.&#160;Gom&#232;s, M.&#160;Herth, M.&#160;Ledoux, M.&#160;Leroy, M.&#160;Morel-&#192;-L&apos;Huissier, M.&#160;Naegelen, Mme&#160;Sage, Mme&#160;Sanquer et M.&#160;Zumkeller"
  },
  "pointeurFragmentTexte": {
    "division": {
      "titre": "Article 58",
      "articleDesignationCourte": "APRÈS ART. 58",
      "type": "ARTICLE",
      "avantAApres": "Apres",
      "divisionRattachee": "APRÈS L'ARTICLE 58, insérer l'article suivant:",
      "articleAdditionnel": "1",
      "urlDivisionTexteVise": "/15/textes/1255C.asp#D_Article_58"
    }
  },
  "corps": {
    "dispositif": "<p style=\"text-align: justify;\">I.&#160;&#8211;&#160;&#192; la fin du second alin&#233;a du III de l&#8217;article&#160;68 de la loi n&#176; 2017&#8209;1837 du 30 d&#233;cembre 2017 de finances pour 2018, la date&#160;: &#171;&#160;31 d&#233;cembre 2018&#160;&#187; est remplac&#233;e par la date&#160;: &#171;&#160;30 juin 2019&#160;&#187;.</p><p style=\"text-align: justify;\">II.&#160;&#8211;&#160;La perte de recettes pour l&#8217;&#201;tat est compens&#233;e &#224; due concurrence par la cr&#233;ation d&#8217;une taxe additionnelle aux droits mentionn&#233;s aux articles 575 et 575 A du code g&#233;n&#233;ral des imp&#244;ts.</p>",
    "exposeSommaire": "<p style=\"text-align: justify;\">Le Gouvernement a annonc&#233; fin 2017 la prorogation pour quatre ans et le recentrage g&#233;ographique du dispositif d&#8217;investissement locatif Pinel dans les zones tendues (A bis, A et B1).</p><p style=\"text-align: justify;\">Inversement, l&#8217;article&#160;68 de la LF2018 pr&#233;voit la fin du dispositif Pinel dans les zones B2 et C, pour les logements neufs acquis apr&#232;s le 31 d&#233;cembre 2017. Or nombre de projets immobiliers avaient &#233;t&#233; lanc&#233;s avant cette date dans les communes concern&#233;es, et &#233;taient en cours de commercialisation au 31 d&#233;cembre 2017.</p><p style=\"text-align: justify;\">Pour tenir compte de ces projets en cours, le l&#233;gislateur a pr&#233;vu des r&#232;gles d&#8217;entr&#233;e en vigueur particuli&#232;res&#160;: il maintient ainsi l&#8217;&#233;ligibilit&#233; au dispositif Pinel des logements neufs vendus post&#233;rieurement au 31 d&#233;cembre 2017, &#224; la double condition qu&#8217;ils aient fait l&#8217;objet d&#8217;une demande de permis de construire avant le 31 d&#233;cembre 2017 et que l&#8217;acquisition soit r&#233;alis&#233;e avant le 31 d&#233;cembre 2018.</p><p style=\"text-align: justify;\">En pratique, le l&#233;gislateur a donc laiss&#233; 12 mois aux constructeurs pour conclure les ventes sous le r&#233;gime Pinel. Cette dur&#233;e para&#238;t trop restrictive&#160;et un d&#233;lai de 18 mois correspondrait davantage &#224; la r&#233;alit&#233; des op&#233;rations immobili&#232;res, qui ob&#233;issent &#224; un cycle long de production.</p><p style=\"text-align: justify;\">En effet, apr&#232;s la demande de d&#233;p&#244;t du permis de construire, il faut compter successivement l&#8217;obtention du permis de construire (le d&#233;lai l&#233;gal maximum est de 3 mois, mais dans les faits, il n&#8217;est pas rare d&#8217;aller jusqu&#8217;&#224; 5 ou 6 mois, voire plus), les recours (le d&#233;lai pour purger le permis de construire de tout recours est al&#233;atoire mais a minima de 3 mois), le lancement de la commercialisation, l&#8217;obtention des financements d&#232;s lors que 40 &#224; 50&#160;% des logements sont pr&#233;commercialis&#233;s, l&#8217;obtention de la garantie financi&#232;re d&#8217;ach&#232;vement (GFA), le lancement des travaux et enfin la signature des actes. Tous ces d&#233;lais peuvent s&#8217;allonger pour des programmes r&#233;alis&#233;s par tranches.</p><p style=\"text-align: justify;\">Afin de ne pas mettre en p&#233;ril de nombreux programmes immobiliers en cours de commercialisation dans la zone B2 (aucune commune, en pratique, n&#8217;est &#233;ligible au dispositif Pinel en zone C), o&#249; la construction baisse d&#233;j&#224; nettement depuis le d&#233;but de l&#8217;ann&#233;e 2018, le pr&#233;sent amendement propose d&#8217;allonger de six mois le d&#233;lai entre la date limite de d&#233;p&#244;t du permis de construire (31 d&#233;cembre 2017) et la date de signature de l&#8217;acte d&#8217;acquisition (30 juin 2019).</p><p style=\"text-align: justify;\">La mesure propos&#233;e ne cr&#233;e pas d&#8217;effet d&#8217;aubaine&#160;: les logements pour lesquels les demandes de permis de construire ont &#233;t&#233; d&#233;pos&#233;s apr&#232;s 31 d&#233;cembre 2017 continueront de ne pas pouvoir b&#233;n&#233;ficier du dispositif Pinel. En revanche, elle permet de conduire &#224; leur terme des projets d&#233;j&#224; lanc&#233;s &#224; cette date. A d&#233;faut, des programmes de logements soit ne pourraient pas sortir de terre, soit ne pourraient pas &#234;tre commercialis&#233;s en totalit&#233;, conduisant &#224; la fragilisation des copropri&#233;t&#233;s concern&#233;es.&#160;</p><p style=\"text-align: justify;\">Tel est l&#8217;objet du pr&#233;sent amendement.</p>"
  },
  "representations": [
    {
      "nom": "PDF",
      "typeMime": {
        "type": "application",
        "subType": "PDF"
      },
      "statutRepresentation": {
        "verbatim": true,
        "canonique": true,
        "officielle": true,
        "transcription": false,
        "enregistrement": false
      },
      "contenu": {
        "documentURI": "/15/amendements/1255C/AN/1666.pdf"
      }
    }
  ],
  "seanceDiscussion": "RUANR5L15S2019IDS21345",
  "sort": {
    "dateSaisie": "2018-11-16T16:15:02.000+01:00",
    "sortEnSeance": "Retiré"
  },
  "dateDepot": "2018-11-08T01:00:00.000+01:00",
  "dateDistribution": "2018-11-14T01:00:00.000+01:00",
  "article99": "0",
  "loiReference": {
    "codeLoi": "loi 2017-1837",
    "divisionCodeLoi": "68"
  }
}