{
  "uid": "AMANR5L15PO757134B1673P0D1N307",
  "identifiant": {
    "legislature": "15",
    "numero": "307",
    "numRect": "0",
    "saisine": {
      "texteLegislatifRef": "PRJLANR5L15B1673",
      "numeroPartiePLF": "0",
      "organeExamen": "PO757134",
      "mentionSecondeDeliberation": "0"
    }
  },
  "numeroLong": "307",
  "etapeTexte": "Nouvelle Lecture",
  "triAmendement": "euaaaaaaaaaaaaaaaaaaaaaaaaaaaaaaaaaaaaaaaaaaaaaaaai",
  "cardinaliteAmdtMultiples": "1",
  "etat": "Discuté",
  "signataires": {
    "auteur": {
      "typeAuteur": "Depute",
      "acteurRef": "PA721270",
      "groupePolitiqueRef": "PO730940"
    },
    "cosignatairesRefs": [
      "PA718926",
      "PA267306",
      "PA721118",
      "PA610667",
      "PA610654",
      "PA722202",
      "PA720546",
      "PA441",
      "PA720692",
      "PA722110",
      "PA721012",
      "PA718720",
      "PA721270",
      "PA721896",
      "PA689",
      "PA335612"
    ],
    "texteAffichable": "M.&#160;Peu,  M.&#160;Dharr&#233;ville, M.&#160;Jumel, Mme&#160;Bello, M.&#160;Brotherson, M.&#160;Bruneel, Mme&#160;Buffet, M.&#160;Chassaigne, M.&#160;Dufr&#232;gne, Mme&#160;Faucillon, Mme&#160;K&#233;clard-Mond&#233;sir, M.&#160;Lecoq, M.&#160;Nilor, M.&#160;Fabien&#160;Roussel, M.&#160;Serville et M.&#160;Wulfranc"
  },
  "pointeurFragmentTexte": {
    "division": {
      "titre": "Article 28",
      "articleDesignationCourte": "ART. 28",
      "type": "ARTICLE",
      "avantAApres": "A",
      "divisionRattachee": "ARTICLE 28",
      "urlDivisionTexteVise": "/15/textes/1673.asp#D_Article_28"
    }
  },
  "corps": {
    "dispositif": "<p style=\"text-align: justify;\">Supprimer cet article.</p>",
    "exposeSommaire": "<p style=\"text-align: justify;\">Les auteurs de cet amendement sont oppos&#233;s au d&#233;veloppement des actions de pr&#233;f&#233;rence, puisque celui-ci va accro&#238;tre la d&#233;pendance des PME et ETI envers les march&#233;s financiers.</p><p style=\"text-align: justify;\">Les actions de pr&#233;f&#233;rence, qui sont en fait des actions &#224; droits particuliers, ont &#233;t&#233; introduites en droit fran&#231;ais par l&#8217;ordonnance du 24 juin 2004, elle-m&#234;me inspir&#233;e des l&#233;gislations &#233;trang&#232;res, notamment celles des pays anglo-saxons.</p><p style=\"text-align: justify;\">Elles permettent entre autres &#224; des actionnaires minoritaires, qui ont des objectifs strictement financiers et qui ne souhaitent pas s&#8217;impliquer dans la gestion de la soci&#233;t&#233;, d&#8217;am&#233;nager leur droit financier prioritaire pour b&#233;n&#233;ficier d&#8217;un dividende prioritaire ou d&#8217;une r&#233;partition pr&#233;f&#233;rentielle du prix en cas de scission de la soci&#233;t&#233;.</p><p style=\"text-align: justify;\">De plus, dans les soci&#233;t&#233;s non cot&#233;es, les actions de pr&#233;f&#233;rence s&#8217;adressent tout particuli&#232;rement &#224; ce qu&#8217;on appelle des actionnaires de passage, pour qui la prise de participation est par nature temporaire.</p><p style=\"text-align: justify;\">Les d&#233;put&#233;s communistes s&#8217;opposent &#224; ce capitalisme de locataires, qui entra&#238;ne une augmentation des taux de profit, alors que, dans le m&#234;me temps, le taux d&#8217;investissement diminue.</p>"
  },
  "representations": [
    {
      "nom": "PDF",
      "typeMime": {
        "type": "application",
        "subType": "PDF"
      },
      "statutRepresentation": {
        "verbatim": true,
        "canonique": true,
        "officielle": true,
        "transcription": false,
        "enregistrement": false
      },
      "contenu": {
        "documentURI": "/15/amendements/1673/CSPACTE/307.pdf"
      }
    }
  ],
  "sort": {
    "dateSaisie": "2019-03-07T09:46:28.000+01:00",
    "sortEnSeance": "Non soutenu"
  },
  "dateDepot": "2019-02-28T01:00:00.000+01:00",
  "dateDistribution": "2019-03-05T01:00:00.000+01:00",
  "article99": "0",
  "loiReference": {}
}