{
  "uid": "AMANR5L15SEA717460BTC1955P0D1N836",
  "identifiant": {
    "legislature": "15",
    "numero": "836",
    "numRect": "0",
    "saisine": {
      "texteLegislatifRef": "PNREANR5L15BTC1955",
      "numeroPartiePLF": "0",
      "organeExamen": "PO717460",
      "mentionSecondeDeliberation": "0"
    }
  },
  "numeroLong": "836",
  "etapeTexte": "Lecture unique",
  "triAmendement": "bboaaaaaaaaaaaaaaaaaaaaaaaaaaaaaaaaaaaaaaaaaaaaaaaglypw",
  "cardinaliteAmdtMultiples": "1",
  "etat": "Discuté",
  "signataires": {
    "auteur": {
      "typeAuteur": "Depute",
      "acteurRef": "PA336175",
      "groupePolitiqueRef": "PO759900"
    },
    "cosignatairesRefs": [
      "PA755549",
      "PA336439",
      "PA720996",
      "PA405480",
      "PA719146",
      "PA333421",
      "PA719138",
      "PA605694",
      "PA336175",
      "PA942",
      "PA331582",
      "PA607619",
      "PA719286",
      "PA267042",
      "PA608292",
      "PA605518"
    ],
    "texteAffichable": "Mme&#160;Pinel,  M.&#160;Acquaviva, M.&#160;Brial, M.&#160;Castellani, M.&#160;Cl&#233;ment, M.&#160;Colombani, M.&#160;Charles&#160;de Courson, Mme&#160;Dubi&#233;, M.&#160;El Guerrab, M.&#160;Falorni, M.&#160;Favennec Becot, M.&#160;Fran&#231;ois-Michel&#160;Lambert, M.&#160;Molac, M.&#160;Pancher, M.&#160;Pupponi et M.&#160;Philippe&#160;Vigier"
  },
  "pointeurFragmentTexte": {
    "division": {
      "titre": "Article 8",
      "articleDesignationCourte": "ART. 8",
      "type": "ARTICLE",
      "avantAApres": "A",
      "divisionRattachee": "ARTICLE 8",
      "urlDivisionTexteVise": "/15/textes/1955.asp#D_Article_8"
    },
    "alinea": {
      "numero": "3"
    }
  },
  "corps": {
    "dispositif": "<p style=\"text-align: justify;\">Apr&#232;s le mot&#160;:</p><p style=\"text-align: justify;\">&#171;&#160;r&#233;dig&#233;e&#160;:&#160;&#187;,</p><p style=\"text-align: justify;\">r&#233;diger ainsi la fin de l&#8217;alin&#233;a&#160;3&#160;:</p><p style=\"text-align: justify;\">&#171;&#160;&#171;&#160;Pour chaque texte examin&#233; en s&#233;ance publique, la Conf&#233;rence des pr&#233;sidents d&#233;termine des temps de parole identiques, de 5 minutes ou 10 minutes, dans la discussion g&#233;n&#233;rale, pour chaque groupe politique ainsi que pour un d&#233;put&#233; n&#8217;appartenant &#224; aucun groupe, en fonction, &#224; la fois, de l&#8217;importance et du volume de chaque texte&#160;&#187;&#160;;&#160;</p>",
    "exposeSommaire": "<p style=\"text-align: justify;\">Si les auteurs de l&#8217;amendement comprennent la volont&#233; du pr&#233;sident de l&#8217;Assembl&#233;e nationale d&#8217;all&#233;ger la discussion g&#233;n&#233;rale, il ne faudrait pas pour autant n&#233;gliger l&#8217;enjeu que repr&#233;sente cette phase de l&#8217;examen d&#8217;un texte de loi.</p><p style=\"text-align: justify;\">Elle permet en effet de pr&#233;ciser le positionnement des orateurs et de leur groupe, s&#8217;ils appartiennent &#224; un groupe, mais &#233;galement d&#8217;annoncer, en partie, les points sur lesquels le groupe va se mobiliser.</p><p style=\"text-align: justify;\">Le pr&#233;sent amendement vise &#224; permettre une diff&#233;renciation entre les textes, avec la possibilit&#233;, pour la Conf&#233;rence des pr&#233;sidents, d&#8217;accorder un temps de discussion g&#233;n&#233;ral de cinq ou dix minutes, en fonction, &#224; la fois, de l&#8217;importance et du volume des textes examin&#233;s.</p>"
  },
  "representations": [
    {
      "nom": "PDF",
      "typeMime": {
        "type": "application",
        "subType": "PDF"
      },
      "statutRepresentation": {
        "verbatim": true,
        "canonique": true,
        "officielle": true,
        "transcription": false,
        "enregistrement": false
      },
      "contenu": {
        "documentURI": "/15/amendements/1955/AN/836.pdf"
      }
    }
  ],
  "seanceDiscussion": "RUANR5L15S2019IDS21669",
  "sort": {
    "dateSaisie": "2019-05-28T23:01:35.000+02:00",
    "sortEnSeance": "Rejeté"
  },
  "dateDepot": "2019-05-24T02:00:00.000+02:00",
  "dateDistribution": "2019-05-27T02:00:00.000+02:00",
  "article99": "0",
  "loiReference": {}
}