{
  "uid": "AMANR5L15PO419604B1481P0D1N295",
  "identifiant": {
    "legislature": "15",
    "numero": "295",
    "numRect": "0",
    "saisine": {
      "texteLegislatifRef": "PRJLANR5L15B1481",
      "numeroPartiePLF": "0",
      "organeExamen": "PO419604",
      "mentionSecondeDeliberation": "0"
    }
  },
  "numeroLong": "AC295",
  "etapeTexte": "1ère lecture (1ère assemblée saisie)",
  "triAmendement": "eeaaaaaaaaaaaaaaaaaaaaaaaaaaaaaaaaaaaaaaaaaaaaaaaadk",
  "cardinaliteAmdtMultiples": "1",
  "etat": "Discuté",
  "signataires": {
    "auteur": {
      "typeAuteur": "Depute",
      "acteurRef": "PA718868",
      "groupePolitiqueRef": "PO730958"
    },
    "cosignatairesRefs": [
      "PA2150",
      "PA721202",
      "PA721210",
      "PA719578",
      "PA588884",
      "PA720892",
      "PA718860",
      "PA721226",
      "PA718868",
      "PA721062",
      "PA720286",
      "PA722142",
      "PA720430",
      "PA720846",
      "PA720422",
      "PA721960",
      "PA719676"
    ],
    "texteAffichable": "M.&#160;Larive,  Mme&#160;Autain, M.&#160;Bernalicis, M.&#160;Coquerel, M.&#160;Corbi&#232;re, Mme&#160;Fiat, M.&#160;Lachaud, M.&#160;M&#233;lenchon, Mme&#160;Obono, Mme&#160;Panot, M.&#160;Prud&apos;homme, M.&#160;Quatennens, M.&#160;Ratenon, Mme&#160;Ressiguier, Mme&#160;Rubin, M.&#160;Ruffin et Mme&#160;Taurine"
  },
  "pointeurFragmentTexte": {
    "division": {
      "titre": "Article 12",
      "articleDesignationCourte": "APRÈS ART. 12",
      "type": "ARTICLE",
      "avantAApres": "Apres",
      "divisionRattachee": "APRÈS L'ARTICLE 12, insérer l'article suivant:",
      "articleAdditionnel": "1",
      "urlDivisionTexteVise": "/15/textes/1481.asp#D_Article_12"
    }
  },
  "corps": {
    "dispositif": "<p style=\"text-align: justify;\">&#192; la deuxi&#232;me phrase de l&#8217;avant-dernier alin&#233;a de l&#8217;article L.&#160;721&#8209;2 du code de l&#8217;&#233;ducation, apr&#232;s le mot&#160;: &#171;&#160;discriminations,&#160;&#187;, sont ins&#233;r&#233;s les mots&#160;: &#171;&#160;&#224; la lutte contre les in&#233;galit&#233;s scolaires,&#160;&#187;.</p>",
    "exposeSommaire": "<p style=\"text-align: justify;\">Par cet amendement, nous proposons d&#8217;&#233;largir le champ de formation des instituts nationaux sup&#233;rieurs du professorat et de l&#8217;&#233;ducation &#224; la lutte contre les in&#233;galit&#233;s scolaires. Aux termes de l&#8217;article L.&#160;111&#8209;1 du code de l&#8217;&#233;ducation&#160;: &#171;&#160;L&#8217;&#233;ducation est la premi&#232;re priorit&#233; nationale. Le service public de l&#8217;&#233;ducation [&#8230;] contribue &#224; l&#8217;&#233;galit&#233; des chances et &#224; lutter contre les in&#233;galit&#233;s sociales et territoriales en mati&#232;re de r&#233;ussite scolaire et &#233;ducative.&#160;&#187; Cette priorit&#233; de notre syst&#232;me &#233;ducatif doit &#234;tre partag&#233;e par le sommet de la structure administrative comme par tous ces agents &#224; qui il appartient de pr&#233;parer la r&#233;ussite de tous les &#233;l&#232;ves. Ainsi que le montrent les &#233;tudes les plus r&#233;centes, l&#8217;efficacit&#233; de la lutte contre les in&#233;galit&#233;s sociales dans l&#8217;&#233;ducation est optimale dans l&#8217;enseignement primaire et au coll&#232;ge. Pourtant, la formation des enseignants est r&#233;guli&#232;rement point&#233;e du doigt par les organisations syndicales qui d&#233;noncent la pauvret&#233; de leur contenu et leur manque de pertinence. Une formation initiale qui traiterait du probl&#232;me des in&#233;galit&#233;s scolaires et des risques de reproduction sociale par l&#8217;&#233;cole permettrait aux futurs enseignants d&#8217;avoir les outils les plus innovants pour les combattre.</p>"
  },
  "representations": [
    {
      "nom": "PDF",
      "typeMime": {
        "type": "application",
        "subType": "PDF"
      },
      "statutRepresentation": {
        "verbatim": true,
        "canonique": true,
        "officielle": true,
        "transcription": false,
        "enregistrement": false
      },
      "contenu": {
        "documentURI": "/15/amendements/1481/CION-CEDU/AC295.pdf"
      }
    }
  ],
  "sort": {
    "dateSaisie": "2019-01-30T23:54:06.000+01:00",
    "sortEnSeance": "Rejeté"
  },
  "dateDepot": "2019-01-25T01:00:00.000+01:00",
  "dateDistribution": "2019-01-29T01:00:00.000+01:00",
  "article99": "0",
  "loiReference": {
    "codeLoi": "éducation",
    "divisionCodeLoi": "L721-2"
  }
}