{
  "uid": "AMANR5L15SEA717460BTC1548P0D1N218",
  "identifiant": {
    "legislature": "15",
    "numero": "218",
    "numRect": "0",
    "saisine": {
      "texteLegislatifRef": "PRJLANR5L15BTC1548",
      "numeroPartiePLF": "0",
      "organeExamen": "PO717460",
      "mentionSecondeDeliberation": "0"
    }
  },
  "numeroLong": "218",
  "etapeTexte": "Nouvelle Lecture",
  "triAmendement": "bakaaaaaaaaaaaaaaaaaaaaaaaaaaaaaaaaaaaaaaaaaaaaaaabao",
  "cardinaliteAmdtMultiples": "1",
  "etat": "Discuté",
  "signataires": {
    "auteur": {
      "typeAuteur": "Depute",
      "acteurRef": "PA719608",
      "groupePolitiqueRef": "PO723569"
    },
    "cosignatairesRefs": [
      "PA719608"
    ],
    "texteAffichable": "Mme&#160;M&#233;nard"
  },
  "pointeurFragmentTexte": {
    "division": {
      "titre": "Article 12",
      "articleDesignationCourte": "ART. 12",
      "type": "ARTICLE",
      "avantAApres": "A",
      "divisionRattachee": "ARTICLE 12",
      "urlDivisionTexteVise": "/15/textes/1548.asp#D_Article_12"
    },
    "alinea": {
      "numero": "11"
    }
  },
  "corps": {
    "dispositif": "<p style=\"text-align: justify;\">Supprimer l&#8217;alin&#233;a&#160;11.</p>",
    "exposeSommaire": "<p style=\"text-align: justify;\">Il n&#8217;est pas souhaitable de r&#233;duire le d&#233;lai de deux ans requis par la proc&#233;dure de divorce pour alt&#233;ration d&#233;finitive du lien conjugal.</p>"
  },
  "representations": [
    {
      "nom": "PDF",
      "typeMime": {
        "type": "application",
        "subType": "PDF"
      },
      "statutRepresentation": {
        "verbatim": true,
        "canonique": true,
        "officielle": true,
        "transcription": false,
        "enregistrement": false
      },
      "contenu": {
        "documentURI": "/15/amendements/1548/AN/218.pdf"
      }
    }
  ],
  "seanceDiscussion": "RUANR5L15S2019IDS21450",
  "sort": {
    "dateSaisie": "2019-01-17T11:49:18.000+01:00",
    "sortEnSeance": "Non soutenu"
  },
  "dateDepot": "2019-01-09T01:00:00.000+01:00",
  "dateDistribution": "2019-01-14T01:00:00.000+01:00",
  "article99": "0",
  "loiReference": {}
}