{
  "uid": "AMANR5L15SEA717460BTC0105P0D1N310",
  "identifiant": {
    "legislature": "15",
    "numero": "310",
    "numRect": "0",
    "saisine": {
      "texteLegislatifRef": "PRJLANR5L15BTC0105",
      "numeroPartiePLF": "0",
      "organeExamen": "PO717460",
      "mentionSecondeDeliberation": "0"
    }
  },
  "numeroLong": "310",
  "etapeTexte": "1ère lecture (2ème assemblée saisie)",
  "triAmendement": "zc",
  "cardinaliteAmdtMultiples": "1",
  "etat": "Irrecevable",
  "signataires": {
    "auteur": {
      "typeAuteur": "Depute",
      "acteurRef": "PA643134",
      "groupePolitiqueRef": "PO730934"
    },
    "cosignatairesRefs": [
      "PA643134"
    ],
    "texteAffichable": "Mme&#160;Valentin"
  },
  "pointeurFragmentTexte": {
    "division": {
      "titre": "Article PREMIER",
      "articleDesignationCourte": "APRÈS ART. PREMIER",
      "type": "ARTICLE",
      "avantAApres": "Apres",
      "divisionRattachee": "APRÈS L'ARTICLE PREMIER, insérer l'article suivant:",
      "articleAdditionnel": "1",
      "urlDivisionTexteVise": "/15/textes/0105.asp#D_Article_1er"
    }
  },
  "corps": {
    "dispositif": "<p style=\"text-align: justify;\">Les avantages des anciens Pr&#233;sidents de la R&#233;publique sont limit&#233;s &#224; trois ans.</p>",
    "exposeSommaire": "<p style=\"text-align: justify;\">La confiance des citoyens envers leurs repr&#233;sentants passe par de l&#8217;exemplarit&#233;.</p><p style=\"text-align: justify;\">Cette exemplarit&#233; doit d&#8217;abord &#234;tre respect&#233; au sommet de l&#8217;&#201;tat.</p><p style=\"text-align: justify;\">D&#232;s lors, cet amendement propose de limiter les avantages des anciens Pr&#233;sidents de la R&#233;publique &#224; trois ans.</p>"
  },
  "representations": [
    {
      "nom": "PDF",
      "typeMime": {
        "type": "application",
        "subType": "PDF"
      },
      "statutRepresentation": {
        "verbatim": true,
        "canonique": true,
        "officielle": true,
        "transcription": false,
        "enregistrement": false
      },
      "contenu": {
        "documentURI": "/15/amendements/0105/AN/310.pdf"
      }
    }
  ],
  "dateDepot": "2017-07-21T02:00:00.000+02:00",
  "dateDistribution": "2017-07-24T02:00:00.000+02:00",
  "article99": "0",
  "loiReference": {}
}