{
  "uid": "AMANR5L15SEA717460B1255P2D1N500",
  "identifiant": {
    "legislature": "15",
    "numero": "500",
    "numRect": "0",
    "saisine": {
      "texteLegislatifRef": "PRJLANR5L15B1255",
      "numeroPartiePLF": "2",
      "organeExamen": "PO717460",
      "mentionSecondeDeliberation": "0"
    }
  },
  "numeroLong": "II-500",
  "etapeTexte": "1ère lecture (1ère assemblée saisie)",
  "triAmendement": "adlaaaaaaaaaaaaaaaaaaaaaaaaaaaaaaaaaaaaaaaaaaaaaaaxo",
  "cardinaliteAmdtMultiples": "1",
  "etat": "Discuté",
  "signataires": {
    "auteur": {
      "typeAuteur": "Depute",
      "acteurRef": "PA643089",
      "groupePolitiqueRef": "PO730934"
    },
    "cosignatairesRefs": [
      "PA643089"
    ],
    "texteAffichable": "M.&#160;Thi&#233;riot"
  },
  "pointeurFragmentTexte": {
    "missionVisee": {
      "idMissionAN": "400",
      "libelleMission": "Défense",
      "codeMissionPLF": "B",
      "libelleMissionPLF": "Répartition, par mission et programme, des crédits du budget général"
    },
    "division": {
      "titre": "ÉTAT B",
      "articleDesignationCourte": "ART. 39",
      "type": "ANNEXE",
      "avantAApres": "A",
      "divisionRattachee": "ARTICLE 39",
      "urlDivisionTexteVise": "/15/textes/1255C.asp#D_ETAT_B"
    }
  },
  "corps": {
    "exposeSommaire": "<p style=\"text-align: justify;\">La mission D&#233;fense pr&#233;voit pour 2019 une augmentation des d&#233;penses de personnel travaillant pour le programme &#171;&#160;Liens entre Nation et son arm&#233;e&#160;&#187;. Cette hausse ne para&#238;t pas justifi&#233;e &#233;tant donn&#233; que la JDC n&#8217;a pas chang&#233; de nature et qu&#8217;elle pr&#233;voit d&#8217;accueillir 792&#160;745 jeunes en 2019 contre plus 804&#160;000 en 2018, soit une baisse cons&#233;quente du nombre de jeunes accueillis.</p><p style=\"text-align: justify;\">&#160;En application des dispositions de la loi organique relative aux lois de finances, les signataires proposent une diminution des cr&#233;dits de l&#8217;action 212&#8209;65 &#171;&#160;JDC Personnel travaillant pour le programme&#160;&#187;Liens la Nation et son arm&#233;e&#171;&#160;qui doivent pouvoir &#234;tre rationalis&#233;s. Ces cr&#233;dits sont transf&#233;r&#233;s vers l&#8217;action 178&#8209;05&#8209;80&#160;&#187;Logistique et soutien interarm&#233;es-Fonction sant&#233;&#171;&#160;.</p>",
    "dispositifAmdtCredit": {
      "listeProgrammes": [
        {
          "libelle": "Environnement et prospective de la politique de défense",
          "id": "36493",
          "AE": {
            "montantPositif": "0",
            "montantNegatif": "0"
          },
          "CP": {
            "montantPositif": "0",
            "montantNegatif": "0"
          },
          "action": "modification"
        },
        {
          "libelle": "Préparation et emploi des forces",
          "id": "36494",
          "AE": {
            "montantPositif": "9000000",
            "montantNegatif": "0"
          },
          "CP": {
            "montantPositif": "9000000",
            "montantNegatif": "0"
          },
          "action": "modification"
        },
        {
          "libelle": "Soutien de la politique de la défense",
          "id": "36495",
          "AE": {
            "montantPositif": "0",
            "montantNegatif": "9000000"
          },
          "CP": {
            "montantPositif": "0",
            "montantNegatif": "9000000"
          },
          "action": "modification",
          "lignesCredits": [
            {
              "id": "1395",
              "libelle": "Dont titre 2",
              "AE": {
                "montantPositif": "0",
                "montantNegatif": "9000000"
              },
              "CP": {
                "montantPositif": "0",
                "montantNegatif": "9000000"
              }
            }
          ]
        },
        {
          "libelle": "Équipement des forces",
          "id": "36496",
          "AE": {
            "montantPositif": "0",
            "montantNegatif": "0"
          },
          "CP": {
            "montantPositif": "0",
            "montantNegatif": "0"
          },
          "action": "modification"
        }
      ],
      "totalAE": {
        "montantPositif": "9000000",
        "montantNegatif": "9000000",
        "solde": "0"
      },
      "totalCP": {
        "montantPositif": "9000000",
        "montantNegatif": "9000000",
        "solde": "0"
      }
    }
  },
  "representations": [
    {
      "nom": "PDF",
      "typeMime": {
        "type": "application",
        "subType": "PDF"
      },
      "statutRepresentation": {
        "verbatim": true,
        "canonique": true,
        "officielle": true,
        "transcription": false,
        "enregistrement": false
      },
      "contenu": {
        "documentURI": "/15/amendements/1255C/AN/500.pdf"
      }
    }
  ],
  "seanceDiscussion": "RUANR5L15S2019IDS21322",
  "sort": {
    "dateSaisie": "2018-11-02T12:24:35.000+01:00",
    "sortEnSeance": "Rejeté"
  },
  "dateDepot": "2018-10-26T02:00:00.000+02:00",
  "dateDistribution": "2018-10-31T01:00:00.000+01:00",
  "article99": "0",
  "loiReference": {}
}