{
  "uid": "AMANR5L15PO419865B1831P0D1N1702",
  "identifiant": {
    "legislature": "15",
    "numero": "1702",
    "numRect": "0",
    "saisine": {
      "texteLegislatifRef": "PRJLANR5L15B1831",
      "numeroPartiePLF": "0",
      "organeExamen": "PO419865",
      "mentionSecondeDeliberation": "0"
    }
  },
  "numeroLong": "CD1702",
  "etapeTexte": "1ère lecture (2ème assemblée saisie)",
  "triAmendement": "djaaaaaaaaaaaaaaaaaaaaaaaaaaaaaaaaaaaaaaaaaaaaaaaabacbzwvi",
  "cardinaliteAmdtMultiples": "1",
  "etat": "Discuté",
  "signataires": {
    "auteur": {
      "typeAuteur": "Depute",
      "acteurRef": "PA721054",
      "groupePolitiqueRef": "PO730934"
    },
    "cosignatairesRefs": [
      "PA721054"
    ],
    "texteAffichable": "M.&#160;Lorion"
  },
  "pointeurFragmentTexte": {
    "division": {
      "titre": "Article 22",
      "articleDesignationCourte": "ART. 22",
      "type": "ARTICLE",
      "avantAApres": "A",
      "divisionRattachee": "ARTICLE 22",
      "urlDivisionTexteVise": "/15/textes/1831.asp#D_Article_22"
    },
    "alinea": {
      "numero": "20"
    }
  },
  "corps": {
    "dispositif": "<p style=\"text-align: justify;\">I.&#160;&#8211;&#160;&#192; l&#8217;alin&#233;a&#160;20, apr&#232;s le mot&#160;:</p><p style=\"text-align: justify;\">&#171;&#160;intermodalit&#233;&#160;&#187;, ins&#233;rer les mots</p><p style=\"text-align: justify;\">&#171;&#160;, par les contrats op&#233;rationnels de mobilit&#233;&#160;&#187;.</p><p style=\"text-align: justify;\">II.&#160;&#8211;&#160;En cons&#233;quence, &#224; l&#8217;alin&#233;a&#160;22, substituer aux mots&#160;:</p><p style=\"text-align: justify;\">&#171;&#160;avec les autres collectivit&#233;s et personnes morales concern&#233;es&#160;&#187;</p><p style=\"text-align: justify;\">les mots&#160;:</p><p style=\"text-align: justify;\">&#171;&#160;men&#233;e dans le cadre de l&#8217;&#233;laboration des contrats op&#233;rationnels de mobilit&#233;&#160;&#187;.</p>",
    "exposeSommaire": "<p style=\"text-align: justify;\">L&#8217;essentiel de l&#8217;article&#160;22, peu modifi&#233; par le S&#233;nat, a &#233;t&#233; r&#233;dig&#233; dans le cadre du projet de loi d&#233;pos&#233; par le Gouvernement. De ce fait, il ne prend pas en compte les avanc&#233;es issues de la discussion du projet de loi au S&#233;nat, et notamment l&#8217;instauration de contrats op&#233;rationnels de mobilit&#233; obligatoires sur tous les bassins de mobilit&#233;. Le pr&#233;sent amendement se propose de rem&#233;dier &#224; cette lacune en pr&#233;cisant, lorsque cela semble n&#233;cessaire, que les discussions entre collectivit&#233;s doivent se faire dans le cadre des contrats op&#233;rationnels de mobilit&#233;. Il propose donc que les contrats op&#233;rationnels de mobilit&#233; soient le lieu o&#249; les autorit&#233;s organisatrices de la mobilit&#233;, les gestionnaires de gares et les collectivit&#233;s comp&#233;tentes en mati&#232;re d&#8217;urbanisme &#233;laborent la liste des p&#244;les d&#8217;&#233;change et des gares qui devront &#234;tre &#233;quip&#233;s d&#8217;emplacements de stationnements s&#233;curis&#233;s pour les v&#233;los.</p>"
  },
  "representations": [
    {
      "nom": "PDF",
      "typeMime": {
        "type": "application",
        "subType": "PDF"
      },
      "statutRepresentation": {
        "verbatim": true,
        "canonique": true,
        "officielle": true,
        "transcription": false,
        "enregistrement": false
      },
      "contenu": {
        "documentURI": "/15/amendements/1831/CION-DVP/CD1702.pdf"
      }
    }
  ],
  "sort": {
    "dateSaisie": "2019-05-17T15:59:37.000+02:00",
    "sortEnSeance": "Non soutenu"
  },
  "dateDepot": "2019-05-09T02:00:00.000+02:00",
  "dateDistribution": "2019-05-16T02:00:00.000+02:00",
  "article99": "0",
  "loiReference": {}
}