{
  "uid": "AMANR5L15SEA717460BTC1955P0D1N148",
  "identifiant": {
    "legislature": "15",
    "numero": "148",
    "numRect": "0",
    "saisine": {
      "texteLegislatifRef": "PNREANR5L15BTC1955",
      "numeroPartiePLF": "0",
      "organeExamen": "PO717460",
      "mentionSecondeDeliberation": "1"
    }
  },
  "numeroLong": "148",
  "etapeTexte": "Lecture unique",
  "triAmendement": "jaaaaaaaaaaaaaaaaaaaaaaaaaaaaaaaaaaaaaaaaaaaaaaaaaafwts",
  "cardinaliteAmdtMultiples": "1",
  "etat": "Discuté",
  "signataires": {
    "auteur": {
      "typeAuteur": "Depute",
      "acteurRef": "PA1874",
      "groupePolitiqueRef": "PO730934"
    },
    "cosignatairesRefs": [
      "PA334149",
      "PA2086",
      "PA722390",
      "PA266793",
      "PA1029",
      "PA609726",
      "PA334843",
      "PA332523",
      "PA330684",
      "PA266776",
      "PA340853",
      "PA609245",
      "PA720100",
      "PA720684",
      "PA605036",
      "PA607090",
      "PA721046",
      "PA1874",
      "PA267204",
      "PA2492",
      "PA334654",
      "PA721070",
      "PA1012",
      "PA345722",
      "PA2529",
      "PA718838",
      "PA718780",
      "PA330909",
      "PA713448",
      "PA267450",
      "PA721636",
      "PA720644",
      "PA721506",
      "PA266808",
      "PA2155",
      "PA720210",
      "PA606098",
      "PA608416",
      "PA606712"
    ],
    "texteAffichable": "M.&#160;Le Fur,  M.&#160;Abad, M.&#160;Aubert, Mme&#160;Bassire, Mme&#160;Beauvais, M.&#160;Bony, Mme&#160;Val&#233;rie&#160;Boyer, Mme&#160;Brenier, M.&#160;Brun, Mme&#160;Corneloup, Mme&#160;Dalloz, M.&#160;Deflesselles, M.&#160;R&#233;mi&#160;Delatte, M.&#160;Descoeur, M.&#160;Pierre-Henri&#160;Dumont, M.&#160;Fasquelle, M.&#160;Hetzel, Mme&#160;Kuster, Mme&#160;Lacroute, M.&#160;de la Verpilli&#232;re, Mme&#160;Le Grip, M.&#160;Leclerc, M.&#160;Lurton, M.&#160;Marleix, M.&#160;Marlin, M.&#160;Menuel, M.&#160;Nury, M.&#160;Parigi, M.&#160;Pradi&#233;, M.&#160;Quentin, Mme&#160;Ramassamy, M.&#160;Reiss, M.&#160;Reitzer, M.&#160;Rolland, M.&#160;Sermier, M.&#160;Straumann, Mme&#160;Trastour-Isnart, M.&#160;Verch&#232;re et M.&#160;Jean-Pierre&#160;Vigier"
  },
  "pointeurFragmentTexte": {
    "division": {
      "titre": "Article 26",
      "articleDesignationCourte": "APRÈS ART. 26",
      "type": "ARTICLE",
      "avantAApres": "Apres",
      "divisionRattachee": "APRÈS L'ARTICLE 26, insérer l'article suivant:",
      "articleAdditionnel": "1",
      "urlDivisionTexteVise": "/15/textes/1955.asp#D_Article_26"
    }
  },
  "corps": {
    "dispositif": "<p style=\"text-align: justify;\">L&#8217;article&#160;99 du R&#232;glement est compl&#233;t&#233; par un alin&#233;a ainsi r&#233;dig&#233;&#160;:</p><p style=\"text-align: justify;\">&#171;&#160;Ce d&#233;lai ne s&#8217;applique pas lorsque le texte n&#8217;a pas &#233;t&#233; publi&#233; et diffus&#233; avant l&#8217;expiration de celui&#8209;ci.&#160;&#187;</p>",
    "exposeSommaire": "<p style=\"text-align: justify;\">Cet amendement vise &#224; corriger un probl&#232;me majeur et in&#233;dit auquel fait face notre Assembl&#233;e, qui est la publication tardive et la diffusion des textes, notamment post-commission, au point que celle-ci ait parfois lieu apr&#232;s l&#8217;expiration du d&#233;lai de d&#233;p&#244;t des amendements.</p><p style=\"text-align: justify;\">Il est inconcevable de travailler &#224; l&#8217;&#233;laboration de la loi dans des contraintes de temps qui font que l&#8217;on ait acc&#232;s au texte seulement quelques heures avant l&#8217;expiration de d&#233;lai de d&#233;p&#244;t des amendements.</p><p style=\"text-align: justify;\">Cela &#233;tait d&#233;j&#224; le cas pour le projet de loi de r&#233;forme de la Justice s&#8217;est de nouveau r&#233;p&#233;t&#233; avec le texte de r&#233;forme de la Fonction publique, o&#249;, bien qu&#8217;ayant &#233;t&#233; mis en ligne, le texte de la commission a &#233;t&#233; diffus&#233; apr&#232;s l&#8217;expiration d&#233;lai de d&#233;p&#244;t des amendements.</p><p style=\"text-align: justify;\">Afin que ceci ne se reproduise pas, il est propos&#233; par cet amendement de faire tomber ce d&#233;lai, lorsque les textes ne seront pas publi&#233;s et diffus&#233;s avant l&#8217;expiration dudit d&#233;lai.</p>"
  },
  "representations": [
    {
      "nom": "PDF",
      "typeMime": {
        "type": "application",
        "subType": "PDF"
      },
      "statutRepresentation": {
        "verbatim": true,
        "canonique": true,
        "officielle": true,
        "transcription": false,
        "enregistrement": false
      },
      "contenu": {
        "documentURI": "/15/amendements/1955/AN/148.pdf"
      }
    }
  ],
  "seanceDiscussion": "RUANR5L15S2019IDS21670",
  "sort": {
    "dateSaisie": "2019-05-29T18:35:16.000+02:00",
    "sortEnSeance": "Non soutenu"
  },
  "dateDepot": "2019-05-22T02:00:00.000+02:00",
  "dateDistribution": "2019-05-27T02:00:00.000+02:00",
  "article99": "0",
  "loiReference": {
    "divisionCodeLoi": "99"
  }
}