{
  "uid": "AMANR5L15SEA717460BTC0971P0D1N1658",
  "identifiant": {
    "legislature": "15",
    "numero": "1658",
    "numRect": "0",
    "saisine": {
      "texteLegislatifRef": "PRJLANR5L15BTC0971",
      "numeroPartiePLF": "0",
      "organeExamen": "PO717460",
      "mentionSecondeDeliberation": "0"
    }
  },
  "numeroLong": "1658",
  "etapeTexte": "1ère lecture (1ère assemblée saisie)",
  "triAmendement": "gm",
  "cardinaliteAmdtMultiples": "1",
  "etat": "Discuté",
  "signataires": {
    "auteur": {
      "typeAuteur": "Depute",
      "acteurRef": "PA720334",
      "groupePolitiqueRef": "PO730970"
    },
    "cosignatairesRefs": [
      "PA719938",
      "PA720746",
      "PA722284",
      "PA720162",
      "PA721836",
      "PA720976",
      "PA720256",
      "PA721734",
      "PA722162",
      "PA721418",
      "PA718978",
      "PA720728",
      "PA719266",
      "PA719874",
      "PA720326",
      "PA719640",
      "PA721984",
      "PA719044",
      "PA721742",
      "PA720968",
      "PA721976",
      "PA720924",
      "PA720598",
      "PA720704",
      "PA1276",
      "PA720764",
      "PA720720",
      "PA719488",
      "PA717151",
      "PA721992",
      "PA720002",
      "PA721530",
      "PA720652",
      "PA719210",
      "PA721924",
      "PA719918",
      "PA720334",
      "PA719558",
      "PA721182",
      "PA721608",
      "PA722374",
      "PA721234",
      "PA720092",
      "PA720178",
      "PA720772"
    ],
    "texteAffichable": "M.&#160;Pahun,  M.&#160;Bolo, Mme&#160;Deprez-Audebert, M.&#160;Mathiasin, M.&#160;Ramos, M.&#160;Turquois, M.&#160;Barrot, Mme&#160;Elimas, Mme&#160;Florennes, M.&#160;Garcia, M.&#160;Lain&#233;, Mme&#160;Lasserre-David, M.&#160;Mignola, Mme&#160;Poueyto, M.&#160;Balanant, Mme&#160;Bannier, Mme&#160;Benin, M.&#160;Berta, M.&#160;Bourlanges, M.&#160;Bru, M.&#160;Cubertafon, Mme&#160;de Sarnez, Mme&#160;de Vaucouleurs, M.&#160;Duverg&#233;, Mme&#160;El Ha&#239;ry, Mme&#160;Essayan, M.&#160;Fanget, M.&#160;Fesneau, M.&#160;Fuchs, Mme&#160;Gallerneau, M.&#160;Hammouche, M.&#160;Isaac-Sibille, Mme&#160;Jacquier-Laforge, M.&#160;Joncour, M.&#160;Laqhila, M.&#160;Latombe, Mme&#160;Luquet, M.&#160;Mattei, Mme&#160;Mette, M.&#160;Michel-Kleisbauer, M.&#160;Millienne, M.&#160;Fr&#233;d&#233;ric&#160;Petit, Mme&#160;Maud&#160;Petit, Mme&#160;Vichnievsky et M.&#160;Waserman"
  },
  "pointeurFragmentTexte": {
    "division": {
      "titre": "Article 12 quinquies",
      "articleDesignationCourte": "ART. 12 QUINQUIES",
      "type": "ARTICLE",
      "avantAApres": "A",
      "divisionRattachee": "ARTICLE 12 QUINQUIES",
      "urlDivisionTexteVise": "/15/textes/0971.asp#D_Article_12_quinquies"
    },
    "alinea": {
      "avantAApres": "A",
      "numero": "3",
      "alineaDesignation": "Alinéa 3"
    }
  },
  "corps": {
    "dispositif": "<p style=\"text-align: justify;\">Compl&#233;ter l&#8217;alin&#233;a&#160;3 par la phrase suivante&#160;:</p><p style=\"text-align: justify;\">&#171;&#160;Il pr&#233;cise la limite &#224; l&#8217;int&#233;rieur des terres de la bande littorale des cent m&#232;tres mentionn&#233;e &#224; l&#8217;article L.&#160;121&#8209;16 et des espaces proches du rivage et des rives des plans d&#8217;eau mentionn&#233;s &#224; l&#8217;article L.&#160;121&#8209;13.&#160;&#187;.</p>",
    "exposeSommaire": "<p style=\"text-align: justify;\">Cet amendement de pr&#233;cision a pour objet de pr&#233;voir que les SCOT comportent la d&#233;limitation de la bande des 100 m&#232;tres et des espaces proches du rivage, de mani&#232;re &#224; &#233;viter tout litige portant sur cette d&#233;limitation.</p>"
  },
  "representations": [
    {
      "nom": "PDF",
      "typeMime": {
        "type": "application",
        "subType": "PDF"
      },
      "statutRepresentation": {
        "verbatim": true,
        "canonique": true,
        "officielle": true,
        "transcription": false,
        "enregistrement": false
      },
      "contenu": {
        "documentURI": "/15/amendements/0971/AN/1658.pdf"
      }
    }
  ],
  "seanceDiscussion": "RUANR5L15S2018IDS21081",
  "sort": {
    "dateSaisie": "2018-06-01T10:06:21.000+02:00",
    "sortEnSeance": "Retiré"
  },
  "dateDepot": "2018-05-25T02:00:00.000+02:00",
  "dateDistribution": "2018-05-29T02:00:00.000+02:00",
  "article99": "0",
  "loiReference": {}
}