{
  "uid": "AMANR5L15SEA717460BTC1761P0D1N1096",
  "identifiant": {
    "legislature": "15",
    "numero": "1096",
    "numRect": "0",
    "saisine": {
      "texteLegislatifRef": "PRJLANR5L15BTC1761",
      "numeroPartiePLF": "0",
      "organeExamen": "PO717460",
      "mentionSecondeDeliberation": "0"
    }
  },
  "numeroLong": "1096",
  "etapeTexte": "Nouvelle Lecture",
  "triAmendement": "abcaaaaaaaaaaaaaaaaaaaaaaaaaaaaaaaaaaaaaaaaaaaaaaaknzzpy",
  "cardinaliteAmdtMultiples": "1",
  "etat": "Discuté",
  "signataires": {
    "auteur": {
      "typeAuteur": "Depute",
      "acteurRef": "PA722336",
      "groupePolitiqueRef": "PO730964"
    },
    "cosignatairesRefs": [
      "PA722336"
    ],
    "texteAffichable": "M.&#160;Thi&#233;baut"
  },
  "pointeurFragmentTexte": {
    "division": {
      "titre": "Article 4",
      "articleDesignationCourte": "ART. 4",
      "type": "ARTICLE",
      "avantAApres": "A",
      "divisionRattachee": "ARTICLE 4",
      "urlDivisionTexteVise": "/15/textes/1761.asp#D_Article_4"
    }
  },
  "corps": {
    "dispositif": "<p>R&#233;diger ainsi cet article&#160;:</p><p>&#171;&#160;I.&#160;&#8211;&#160;L&#8217;article&#160;2 de la loi n&#176; 82&#8209;1091 du 23 d&#233;cembre 1982 relative &#224; la formation professionnelle des artisans est ainsi r&#233;dig&#233;&#160;:</p><p>&#171;&#160;Art.&#160;2.&#160;&#8211;&#160;I.&#160;&#8211;&#160;L&#8217;immatriculation au r&#233;pertoire des m&#233;tiers ou, pour les d&#233;partements du Bas-Rhin, du Haut-Rhin et de la Moselle, au registre des entreprises, du futur chef d&#8217;entreprise implique le suivi d&#8217;un stage d&#8217;accompagnement &#224; l&#8217;installation organis&#233;, en liaison avec les organisations professionnelles int&#233;ress&#233;es, par les chambres de m&#233;tiers et de l&#8217;artisanat et, en tant que de besoin, par des &#233;tablissements publics d&#8217;enseignement ou par des centres conventionn&#233;s dans les conditions fix&#233;es par les articles L.&#160;6122&#8209;1 et L.&#160;6122&#8209;3 du code du travail. Ce stage d&#8217;accompagnement &#224; l&#8217;installation est compos&#233; de deux journ&#233;es obligatoires&#160;: l&#8217;une suivie avant l&#8217;immatriculation et l&#8217;autre apr&#232;s l&#8217;immatriculation dans un d&#233;lai maximum de trois mois. Le stage peut donner lieu &#224; la prescription par la chambre de m&#233;tiers et de l&#8217;artisanat d&#8217;un parcours d&#8217;accompagnement &#224; l&#8217;installation modulaire pouvant &#234;tre suivi dans les premiers mois de l&#8217;entreprise en fonction des besoins des porteurs de projet. Ce stage est ouvert au conjoint du futur chef d&#8217;entreprise et &#224; ses auxiliaires familiaux.</p><p>&#171;&#160;II.&#160;&#8211;&#160;Le futur chef d&#8217;entreprise est dispens&#233; de suivre le stage d&#8217;accompagnement &#224; l&#8217;installation&#160;:</p><p>&#171;&#160;1&#176; S&#8217;il a b&#233;n&#233;fici&#233; d&#8217;une formation &#224; la gestion d&#8217;un niveau au moins &#233;gal &#224; celui du stage, dont la liste est fix&#233;e par arr&#234;t&#233; du ministre charg&#233; de l&#8217;artisanat&#160;;</p><p>&#171;&#160;2&#176; S&#8217;il a b&#233;n&#233;fici&#233; d&#8217;un accompagnement &#224; la cr&#233;ation d&#8217;entreprise d&#8217;une dur&#233;e minimale de trente heures d&#233;livr&#233; par un r&#233;seau d&#8217;aide &#224; la cr&#233;ation d&#8217;entreprise, sous r&#233;serve que cet accompagnement dispense une formation &#224; la gestion d&#8217;un niveau au moins &#233;quivalent &#224; celui du stage et qu&#8217;il soit inscrit &#224; l&#8217;inventaire mentionn&#233; au II de l&#8217;article L.&#160;335&#8209;6 du code de l&#8217;&#233;ducation. La liste des actions d&#8217;accompagnement concern&#233;es est arr&#234;t&#233;e par le ministre charg&#233; de l&#8217;artisanat&#160;;</p><p>&#171;&#160;3&#176; S&#8217;il a exerc&#233;, pendant au moins trois ans, une activit&#233; professionnelle requ&#233;rant un niveau de connaissance au moins &#233;quivalent &#224; celui fourni par le stage.</p><p>&#171;&#160;Pour s&#8217;&#233;tablir en France, un professionnel qualifi&#233; ressortissant d&#8217;un &#201;tat membre de la Communaut&#233; europ&#233;enne ou d&#8217;un autre &#201;tat partie &#224; l&#8217;accord sur l&#8217;Espace &#233;conomique europ&#233;en est dispens&#233; de suivre le stage pr&#233;vu au premier alin&#233;a. Un d&#233;cret en Conseil d&#8217;&#201;tat d&#233;finit les conditions dans lesquelles, si l&#8217;examen des qualifications professionnelles attest&#233;es par le professionnel fait appara&#238;tre des diff&#233;rences substantielles au regard des qualifications requises pour la direction d&#8217;une entreprise artisanale, l&#8217;autorit&#233; comp&#233;tente peut exiger que le demandeur se soumette &#224; une &#233;preuve d&#8217;aptitude ou un stage d&#8217;adaptation, &#224; son choix.</p><p>&#171;&#160;Lorsque le futur chef d&#8217;entreprise est dispens&#233; de participer au stage, celui-ci reste ouvert &#224; son conjoint et &#224; ses auxiliaires familiaux.</p><p>&#171;&#160;III.&#160;&#8211;&#160;Le prix du stage d&#8217;accompagnement &#224; l&#8217;installation ne peut &#234;tre sup&#233;rieur &#224; un montant arr&#234;t&#233; par d&#233;lib&#233;ration de l&#8217;Assembl&#233;e permanente des chambres de m&#233;tiers et de l&#8217;artisanat. Il ne peut exc&#233;der le co&#251;t du service rendu.</p><p>&#171;&#160;Le stage d&#8217;accompagnement &#224; l&#8217;installation peut &#234;tre financ&#233; par un organisme de financement de la formation professionnelle continue des professions salari&#233;es ou des demandeurs d&#8217;emploi, ou &#224; d&#233;faut, dans le cas o&#249; il est suivi par les futurs chefs d&#8217;entreprise artisanale, par la fraction mentionn&#233;e au a du 2&#176; de l&#8217;article L.&#160;6331&#8209;48 du code du travail. Ce financement intervient&#160; sous r&#233;serve que le stage ait &#233;t&#233; accompli dans les d&#233;lais mentionn&#233;s au II.</p><p>&#171;&#160;IV.&#160;&#8211;&#160;Un d&#233;cret en Conseil d&#8217;&#201;tat fixe les conditions d&#8217;application du pr&#233;sent article.&#160;&#187;</p><p>II.&#160;&#8211;&#160;L&#8217;article&#160;118 de la loi n&#176; 83&#8209;1179 du 29 d&#233;cembre 1983 de finances pour 1984 est abrog&#233;.</p><p>III.&#160;&#8211;&#160;L&#8217;article&#160;59 de la loi n&#176; 73&#8209;1193 du 27 d&#233;cembre 1973 d&#8217;orientation du commerce et de l&#8217;artisanat est ainsi modifi&#233;&#160;:</p><p>1&#176; Au premier alin&#233;a, les mots&#160;: &#171;&#160;, en ce qui concerne tant la technologie que la gestion,&#160;&#187; sont supprim&#233;s&#160;;</p><p>2&#176; Le second alin&#233;a est ainsi modifi&#233;&#160;:</p><p>a) &#192; la premi&#232;re phrase, le mot&#160;: &#171;&#160;fixera&#160;&#187; est remplac&#233; par le mot&#160;: &#171;&#160;fixe&#160;&#187;, les mots&#160;: &#171;&#160;territoriales seront tenues d&#8217;organiser des stages de courte dur&#233;e d&#8217;initiation &#224; la gestion&#160;&#187; sont remplac&#233;s par les mots&#160;: &#171;&#160;organisent des stages d&#8217;accompagnement &#224; l&#8217;installation&#160;&#187; et les mots&#160;: &#171;&#160;de d&#233;livrer&#160;&#187; sont remplac&#233;s par le mot&#160;: &#171;&#160;d&#233;livrent&#160;&#187;&#160;;</p><p>b) &#192; la seconde phrase, le mot&#160;: &#171;&#160;pourront&#160;&#187; est remplac&#233; par le mot&#160;: &#171;&#160;peuvent&#160;&#187;</p>",
    "exposeSommaire": "<p>Cet amendement vise &#224; r&#233;tablir le texte adopt&#233; par les s&#233;nateurs qui ont souhait&#233; maintenir l&#8217;obligation d&#8217;un stage d&#8217;accompagnement &#224; la cr&#233;ation d&#8217;entreprise artisanale organis&#233; notamment par les chambres de m&#233;tiers et de l&#8217;artisanat, pertinent pour accompagner les cr&#233;ateurs d&#8217;entreprise et assurer la p&#233;rennit&#233; de leur activit&#233;.</p><p style=\"text-align: justify;\">L&#8217;amendement apporte des pr&#233;cisions afin de d&#233;finir une temporalit&#233; dans le d&#233;roulement du stage d&#8217;accompagnement &#224; l&#8217;installation, dans des d&#233;lais qui ne soient pas contraignants pour les porteurs de projet. Ainsi, la premi&#232;re journ&#233;e permettra d&#8217;apporter les bases indispensables &#224; tout cr&#233;ateur avant son immatriculation, notamment dans le choix du statut juridique. La deuxi&#232;me journ&#233;e contribuera &#224; r&#233;pondre aux premi&#232;res r&#233;ponses op&#233;rationnelles que le porteur de projet se pose d&#232;s que son activit&#233; a d&#233;but&#233;.</p>"
  },
  "representations": [
    {
      "nom": "PDF",
      "typeMime": {
        "type": "application",
        "subType": "PDF"
      },
      "statutRepresentation": {
        "verbatim": true,
        "canonique": true,
        "officielle": true,
        "transcription": false,
        "enregistrement": false
      },
      "contenu": {
        "documentURI": "/15/amendements/1761/AN/1096.pdf"
      }
    }
  ],
  "seanceDiscussion": "RUANR5L15S2019IDS21551",
  "sort": {
    "dateSaisie": "2019-03-15T10:23:50.000+01:00",
    "sortEnSeance": "Non soutenu"
  },
  "dateDepot": "2019-03-11T01:00:00.000+01:00",
  "dateDistribution": "2019-03-12T01:00:00.000+01:00",
  "article99": "0",
  "loiReference": {}
}