{
  "uid": "AMANR5L15PO419610B1393P0D1N16",
  "identifiant": {
    "legislature": "15",
    "numero": "16",
    "numRect": "0",
    "saisine": {
      "texteLegislatifRef": "PIONANR5L15B1393",
      "numeroPartiePLF": "0",
      "organeExamen": "PO419610",
      "mentionSecondeDeliberation": "0"
    }
  },
  "numeroLong": "CE16",
  "etapeTexte": "1ère lecture (2ème assemblée saisie)",
  "triAmendement": "baaaaaaaaaaaaaaaaaaaaaaaaaaaaaaaaaaaaaaaaaaaaaaaaaebi",
  "cardinaliteAmdtMultiples": "1",
  "etat": "Discuté",
  "signataires": {
    "auteur": {
      "typeAuteur": "Depute",
      "acteurRef": "PA720976",
      "groupePolitiqueRef": "PO730970"
    },
    "cosignatairesRefs": [
      "PA720976",
      "PA720968"
    ],
    "texteAffichable": "M.&#160;Mathiasin et Mme&#160;Benin"
  },
  "pointeurFragmentTexte": {
    "division": {
      "titre": "Article 2",
      "articleDesignationCourte": "ART. 2",
      "type": "ARTICLE",
      "avantAApres": "A",
      "divisionRattachee": "ARTICLE 2",
      "urlDivisionTexteVise": "/15/textes/1393.asp#D_Article_2"
    },
    "alinea": {
      "avantAApres": "A",
      "numero": "2",
      "alineaDesignation": "Alinéa 2"
    }
  },
  "corps": {
    "dispositif": "<p style=\"text-align: justify;\">&#192; la premi&#232;re phrase de l&#8217;alin&#233;a&#160;2, apr&#232;s le mot&#160;:</p><p style=\"text-align: justify;\">&#171;&#160;sols&#160;&#187;, </p><p style=\"text-align: justify;\">ins&#233;rer les mots&#160;:</p><p style=\"text-align: justify;\">&#171;&#160;et des eaux&#160;&#187;.</p>",
    "exposeSommaire": "<p style=\"text-align: justify;\">Cet amendement vise &#224; prendre en compte la pollution des eaux. L&#8217;Agence nationale de la coh&#233;sion des territoires&#160;(ANCT) doit &#234;tre en mesure de soutenir les collectivit&#233;s dans la lutte contre la pollution li&#233;e, entre autres, aux produits phytopharmaceutiques, phytosanitaires ou aux pesticides, que l&#8217;on retrouve dans les eaux.</p>"
  },
  "representations": [
    {
      "nom": "PDF",
      "typeMime": {
        "type": "application",
        "subType": "PDF"
      },
      "statutRepresentation": {
        "verbatim": true,
        "canonique": true,
        "officielle": true,
        "transcription": false,
        "enregistrement": false
      },
      "contenu": {
        "documentURI": "/15/amendements/1393/CION-ECO/CE16.pdf"
      }
    }
  ],
  "sort": {
    "dateSaisie": "2019-01-30T11:02:52.000+01:00",
    "sortEnSeance": "Rejeté"
  },
  "dateDepot": "2019-01-23T01:00:00.000+01:00",
  "dateDistribution": "2019-02-05T01:00:00.000+01:00",
  "article99": "0",
  "loiReference": {
    "codeLoi": "1-3"
  }
}