{
  "uid": "AMANR5L15SEA717460BTC2401P0D1N547",
  "identifiant": {
    "legislature": "15",
    "numero": "547",
    "numRect": "0",
    "saisine": {
      "texteLegislatifRef": "PRJLANR5L15BTC2401",
      "numeroPartiePLF": "0",
      "organeExamen": "PO717460",
      "mentionSecondeDeliberation": "0"
    }
  },
  "numeroLong": "547",
  "etapeTexte": "1ère lecture (2ème assemblée saisie)",
  "triAmendement": "tpacaaaaaaaaaaaaaaaaaaaaaaaaaaaaaaaaaaaaaaaaaaaaaazzzzzzzzo",
  "cardinaliteAmdtMultiples": "1",
  "etat": "A discuter",
  "signataires": {
    "auteur": {
      "typeAuteur": "Depute",
      "acteurRef": "PA719266",
      "groupePolitiqueRef": "PO730970"
    },
    "cosignatairesRefs": [
      "PA719266",
      "PA720720"
    ],
    "texteAffichable": "M.&#160;Cubertafon et Mme&#160;Poueyto"
  },
  "pointeurFragmentTexte": {
    "division": {
      "titre": "Article 7",
      "articleDesignationCourte": "ART. 7",
      "type": "ARTICLE",
      "avantAApres": "A",
      "divisionRattachee": "ARTICLE 7",
      "urlDivisionTexteVise": "/15/textes/2401.asp#D_Article_7"
    },
    "alinea": {
      "avantAApres": "Apres",
      "numero": "3"
    }
  },
  "corps": {
    "dispositif": "<p style=\"text-align: justify;\">Apr&#232;s l&#8217;alin&#233;a&#160;3, ins&#233;rer les deux alin&#233;as suivants&#160;:</p><p style=\"text-align: justify;\">&#171;&#160;1&#176;&#160;<i>bis</i>&#160;Apr&#232;s l&#8217;article L.&#160;151&#8209;3, il est ins&#233;r&#233; un article L.&#160;151&#8209;3&#8209;1 ainsi r&#233;dig&#233;&#160;:</p><p style=\"text-align: justify;\">&#171;&#160;<i>L.&#160;151&#8209;3&#8209;1.</i>&#160;&#8211;&#160;Lorsqu&#8217;il est &#233;labor&#233; par un &#233;tablissement public de coop&#233;ration intercommunale comp&#233;tent, le plan local d&#8217;urbanisme comporte un volet commercial permettant d&#8217;encadrer pr&#233;cis&#233;ment les p&#233;rim&#232;tres d&#8217;implantation commerciale.&#160;&#187;</p>",
    "exposeSommaire": "<p style=\"text-align: justify;\">Le pr&#233;sent amendement vise &#224; cr&#233;er un document de planification sp&#233;cifique permettant d&#8217;encadrer pr&#233;cis&#233;ment des p&#233;rim&#232;tres d&#8217;implantation commerciale dans une commune.</p><p style=\"text-align: justify;\">Aujourd&#8217;hui, dans de nombreuses communes, l&#8217;implantation commerciale est un enjeu majeur. De nombreux &#233;lus se retrouvent d&#233;munis face &#224; l&#8217;implantation d&#8217;importantes surfaces commerciales dans leur p&#233;riph&#233;rie, implantations qui participent &#224; la d&#233;sertification des centres bourg et des centres-ville.</p><p style=\"text-align: justify;\">Aussi, dans le champ de l&#8217;urbanisme commercial, la cr&#233;ation, au niveau du bloc communal, d&#8217;un document de planification sp&#233;cifique, comme un volet commercial obligatoire du PLUi, permettrait d&#8217;encadrer pr&#233;cis&#233;ment des p&#233;rim&#232;tres d&#8217;implantation commerciale en p&#233;riph&#233;rie et une prise en compte de l&#8217;objectif d&#8217;int&#233;r&#234;t g&#233;n&#233;ral li&#233; &#224; l&#8217;am&#233;nagement du territoire.</p><p style=\"text-align: justify;\">Tel est l&#8217;objet du pr&#233;sent amendement.</p>"
  },
  "representations": [
    {
      "nom": "PDF",
      "typeMime": {
        "type": "application",
        "subType": "PDF"
      },
      "statutRepresentation": {
        "verbatim": true,
        "canonique": true,
        "officielle": true,
        "transcription": false,
        "enregistrement": false
      },
      "contenu": {
        "documentURI": "/15/amendements/2401/AN/547.pdf"
      }
    }
  ],
  "dateDepot": "2019-11-14T01:00:00.000+01:00",
  "dateDistribution": "2019-11-18T01:00:00.000+01:00",
  "article99": "0",
  "loiReference": {}
}