{
  "uid": "AMANR5L15PO59051B0235P2D1N37",
  "identifiant": {
    "legislature": "15",
    "numero": "37",
    "numRect": "0",
    "saisine": {
      "texteLegislatifRef": "PRJLANR5L15B0235",
      "numeroPartiePLF": "2",
      "organeExamen": "PO59051",
      "mentionSecondeDeliberation": "0"
    }
  },
  "numeroLong": "II-CL37",
  "etapeTexte": "1ère lecture (1ère assemblée saisie)",
  "triAmendement": "m",
  "cardinaliteAmdtMultiples": "1",
  "etat": "Discuté",
  "signataires": {
    "auteur": {
      "typeAuteur": "Depute",
      "acteurRef": "PA720430",
      "groupePolitiqueRef": "PO730958"
    },
    "cosignatairesRefs": [
      "PA721210",
      "PA2150",
      "PA719676",
      "PA588884",
      "PA720430",
      "PA721960",
      "PA720846",
      "PA720892",
      "PA722142",
      "PA718860",
      "PA720422",
      "PA720286",
      "PA718868",
      "PA721062",
      "PA721202",
      "PA721226",
      "PA719578"
    ],
    "texteAffichable": "M.&#160;Bernalicis,  Mme&#160;Autain, M.&#160;Coquerel, M.&#160;Corbi&#232;re, Mme&#160;Fiat, M.&#160;Lachaud, M.&#160;Larive, M.&#160;M&#233;lenchon, Mme&#160;Obono, Mme&#160;Panot, M.&#160;Prud&apos;homme, M.&#160;Quatennens, M.&#160;Ratenon, Mme&#160;Ressiguier, Mme&#160;Rubin, M.&#160;Ruffin et Mme&#160;Taurine"
  },
  "pointeurFragmentTexte": {
    "missionVisee": {
      "idMissionAN": "20",
      "libelleMission": "Justice",
      "codeMissionPLF": "B",
      "libelleMissionPLF": "Répartition, par mission et programme, des crédits du budget général"
    },
    "division": {
      "titre": "Article 57",
      "articleDesignationCourte": "APRÈS ART. 57",
      "type": "ARTICLE",
      "avantAApres": "Apres",
      "divisionRattachee": "APRÈS L'ARTICLE 57, insérer l'article suivant:",
      "articleAdditionnel": "1",
      "urlDivisionTexteVise": "/15/textes/0235C.asp#D_Article_57"
    }
  },
  "corps": {
    "dispositif": "<p style=\"text-align: justify;\">I.&#160;&#8211;&#160;Le Gouvernement remet au Parlement, dans un d&#233;lai de trois mois &#224; compter de la promulgation de la pr&#233;sente loi, un rapport d&#8217;information faisant une pr&#233;sentation de la gestion budg&#233;taire pour chaque mesure d&#8217;am&#233;nagement de peine et d&#8217;alternative &#224; l&#8217;incarc&#233;ration.</p><p style=\"text-align: justify;\">II.&#160;&#8211;&#160;Ce rapport est r&#233;dig&#233; par un groupe de travail associant l&#8217;administration p&#233;nitentiaire, l&#8217;inspection g&#233;n&#233;rale des finances, et des associations intervenant dans le champ de la r&#233;insertion et de la pr&#233;vention de la r&#233;cidive.</p>",
    "exposeSommaire": "<p>Les politiques de r&#233;insertion mises en &#339;uvre par le Gouvernement et ses partenaires constituent un volet essentiel de la pr&#233;vention de la r&#233;cidive. Le gouvernement pr&#233;tend en ce sens mener une politique de d&#233;veloppement des am&#233;nagements de peine et des alternatives &#224; l&#8217;incarc&#233;ration.</p><p>Si le PLF 2018 indique que les cr&#233;dits de la mission &#171; Justice &#187; seront augment&#233;s de 0,3 Md&#8364; en 2018, il n&#8217;en reste pas moins que cette augmentation est trompeuse car l&#8217;analyse des bleus budg&#233;taires annex&#233;s au PLF montre au contraire une baisse du budget de certaines mesures.</p><p>En effet l&#8217;exemple de la mesure de placement &#224; l&#8217;ext&#233;rieur est flagrant en ce sens qu&#8217;entre la loi de finance pour 2017 et le projet de loi de finance pour 2018, le budget relatif &#224; cette mesure diminue de 35 % passant de 9,5 M&#8364; (AE et CP) &#224; 7 M&#8364; (AE et CP). Il est d&#8217;ailleurs remarquable qu&#8217;aucun &#233;l&#233;ment ne soit disponible pour les mesures d&#8217;alternatives &#224; l&#8217;incarc&#233;ration.</p><p>L&#8217;Assembl&#233;e nationale doit avoir un &#233;clairage non seulement sur ces baisses budg&#233;taires, mais aussi sur les cr&#233;dits affect&#233;s &#224; l&#8217;ensemble des mesures, parce que le Gouvernement ne saurait ne pas justifier de sa gestion au regard des enjeux des politiques de r&#233;insertion. Un tel manque ne permet pas &#224; l&#8217;Assembl&#233;e nationale de voter en toute sinc&#233;rit&#233; le budget relatif &#224; cette &#233;mission essentielle. Cet amendement vise &#224; ce que le Gouvernement produisent un rapport d&#8217;information faisant un bilan du co&#251;t humain et financier des am&#233;nagements de peine et des alternatives &#224; l&#8217;incarc&#233;ration.</p>"
  },
  "representations": [
    {
      "nom": "PDF",
      "typeMime": {
        "type": "application",
        "subType": "PDF"
      },
      "statutRepresentation": {
        "verbatim": true,
        "canonique": true,
        "officielle": true,
        "transcription": false,
        "enregistrement": false
      },
      "contenu": {
        "documentURI": "/15/amendements/0235C/CION_TOUTE/CL37.pdf"
      }
    }
  ],
  "sort": {
    "sortEnSeance": "Rejeté"
  },
  "dateDepot": "2017-10-20T02:00:00.000+02:00",
  "dateDistribution": "2017-10-23T02:00:00.000+02:00",
  "article99": "0",
  "loiReference": {
    "codeLoi": "zzzz"
  }
}