{
  "uid": "AMANR5L15SEA717460BTC0938P0D1N189",
  "identifiant": {
    "legislature": "15",
    "numero": "189",
    "numRect": "0",
    "saisine": {
      "texteLegislatifRef": "PRJLANR5L15BTC0938",
      "numeroPartiePLF": "0",
      "organeExamen": "PO717460",
      "mentionSecondeDeliberation": "0"
    }
  },
  "numeroLong": "189",
  "etapeTexte": "1ère lecture (1ère assemblée saisie)",
  "triAmendement": "bo",
  "cardinaliteAmdtMultiples": "1",
  "etat": "Discuté",
  "signataires": {
    "auteur": {
      "typeAuteur": "Depute",
      "acteurRef": "PA610681",
      "groupePolitiqueRef": "PO730946"
    },
    "cosignatairesRefs": [
      "PA643145",
      "PA608172",
      "PA342415",
      "PA337483",
      "PA720988",
      "PA267233",
      "PA610681"
    ],
    "texteAffichable": "Mme&#160;Bareigts,  Mme&#160;Battistel, M.&#160;Letchimy, Mme&#160;Manin, M.&#160;Bouillon, Mme&#160;Vainqueur-Christophe et Mme&#160;Pires Beaune"
  },
  "pointeurFragmentTexte": {
    "division": {
      "titre": "Article 4",
      "articleDesignationCourte": "APRÈS ART. 4",
      "type": "ARTICLE",
      "avantAApres": "Apres",
      "divisionRattachee": "APRÈS L'ARTICLE 4, insérer l'article suivant:",
      "articleAdditionnel": "1",
      "urlDivisionTexteVise": "/15/textes/0938.asp#D_Article_4"
    }
  },
  "corps": {
    "dispositif": "<p style=\"text-align: justify;\">L&#8217;&#233;galit&#233; entre les femmes et les hommes est d&#233;clar&#233;e &#171;&#160;Grande cause nationale&#160;&#187; du quinquennat 2017&#8209;2022.</p><p style=\"text-align: justify;\">Les collectivit&#233;s r&#233;gies par l&#8217;article&#160;73 de la Constitution sont d&#233;finies comme des cibles prioritaires des actions qui sont men&#233;es dans ce cadre.</p><p style=\"text-align: justify;\">&#160;</p>",
    "exposeSommaire": "<p style=\"text-align: justify;\">Les taux de violences physiques et sexuelles dans les D&#233;partements et R&#233;gions d&#8217;Outre-mer sont sans commune mesure avec ceux enregistr&#233;s dans l&#8217;Hexagone. Avec 10 f&#233;minicides d&#233;nombr&#233;s dans ces territoires sur les 138 recens&#233;s dans l&#8217;ensemble du pays en 2016 (soit 7,25&#160;% des homicides constat&#233;s dans notre pays alors que les Outre-mer ne comptent que 4&#160;% de la population), les collectivit&#233;s r&#233;gies par l&#8217;article&#160;73 de la Constitution sont en moyenne davantage touch&#233;es par ce ph&#233;nom&#232;ne alarmant. En 2016, 4 femmes sont mortes suite &#224; des violences conjugales &#224; La R&#233;union. La R&#233;union fait partie des 10 d&#233;partements les plus touch&#233;s et La R&#233;union est le d&#233;partement d&#8217;Outre-mer qui compte le plus grand nombre de cas. En 2017, 5 femmes ont &#233;t&#233; tu&#233;es par leur conjoint. Encore dans la nuit du 2 au 3 mai 2018, une femme fut tu&#233;e dans la nuit par son compagnon. Les gendarmes ont &#233;t&#233; oblig&#233;s de forcer la porte pour intervenir mais le drame avait d&#233;j&#224; eu lieu. Il nous faut tout faire pour emp&#234;cher de telles trag&#233;dies.</p><p style=\"text-align: justify;\">Si l&#8217;on se r&#233;f&#232;re &#224; l&#8217;avis du Conseil &#233;conomique social et environnemental (CESE) intitul&#233; &#171;&#160;Combattre les violences faites aux femmes en Outre-mer&#160;&#187;, &#224; La R&#233;union, les violences sexuelles par une personne ext&#233;rieure au m&#233;nage sont les plus fr&#233;quentes et concernent 7&#160;% de la population ( 4 , 4&#160;% en France hexagonale ). Les violences sexuelles plus graves concernent 1 , 2&#160;% de la population soit deux fois plus qu&#8217;en France hexagonale. C&#8217;est pourquoi le CESE recommandait de d&#233;finir les Outre-mer &#171;&#160;comme cible d&#8217;action prioritaire compte tenu de l&#8217;insuffisance des moyens au regard de l&#8217;ampleur des violences&#160;&#187;.</p><p style=\"text-align: justify;\">De plus, dans un avis sur les violences de genre et les droits sexuels et reproductifs dans les Outre-mer publi&#233; le 21 novembre 2017, la Commission nationale consultative des droits de l&#8217;Homme notait que &#171;&#160;si 17&#160;% des femmes de France continentale d&#233;clarent que leur premier rapport sexuel n&#8217;&#233;tait pas &#171;&#160;vraiment souhait&#233;&#160;&#187; et 2&#160;% qu&#8217;il &#233;tait &#171;&#160;forc&#233;&#160;&#187;, ces taux chez les Guyanaises sont respectivement de 24&#160;% et 6&#160;%, 23&#160;% et 4&#160;% en Martinique et en Guadeloupe et 20&#160;% et 4&#160;% &#224; La R&#233;union&#160;&#187;.</p><p style=\"text-align: justify;\">L&#8217;in&#233;galit&#233; entre les femmes ultramarines et hexagonales n&#8217;est pas seulement face aux violences mais &#233;galement face &#224; la maternit&#233;. L&#8217;enqu&#234;te men&#233;e par l&#8217;Institut National d&#8217;Etudes D&#233;mographiques (INED) intitul&#233;e &#171;&#160;Migrations, Famille et Vieillissement&#160;&#187; montrait ainsi qu&#8217;en Guyane, en Martinique, en Guadeloupe et &#224; La R&#233;union la proportion de jeunes m&#232;res &#233;tait tr&#232;s sup&#233;rieure &#224; la moyenne nationale. Plus grave, si le nombre de maternit&#233;s pr&#233;coces affiche une baisse significative en Martinique et en Guadeloupe au cours des derni&#232;res d&#233;cennies, il n&#8217;y a quasiment pas d&#8217;&#233;volution en Guyane et &#224; La R&#233;union o&#249; les taux demeurent sensiblement similaires. Rappelons ainsi qu&#8217;&#224; La R&#233;union une femme sur quatre a son premier enfant avant l&#8217;&#226;ge de 20 ans.</p><p style=\"text-align: justify;\">Le Pr&#233;sident de la R&#233;publique a d&#233;fini l&#8217;&#233;galit&#233; entre les femmes et les hommes comme Grande cause nationale du quinquennat. Il est important de donner une base l&#233;gale &#224; celle-ci pour renforcer sa l&#233;gitimit&#233;. Compte tenu des taux de violences et de grossesses pr&#233;coces dans les D&#233;partements et R&#233;gions d&#8217;Outre-mer, il est vital que ces territoires soient d&#233;finis comme des cibles d&#8217;action prioritaires pour les actions qui seront men&#233;es dans le cadre de la Grande Cause nationale du quinquennat.</p>"
  },
  "representations": [
    {
      "nom": "PDF",
      "typeMime": {
        "type": "application",
        "subType": "PDF"
      },
      "statutRepresentation": {
        "verbatim": true,
        "canonique": true,
        "officielle": true,
        "transcription": false,
        "enregistrement": false
      },
      "contenu": {
        "documentURI": "/15/amendements/0938/AN/189.pdf"
      }
    }
  ],
  "seanceDiscussion": "RUANR5L15S2018IDS21032",
  "sort": {
    "dateSaisie": "2018-05-16T22:43:41.000+02:00",
    "sortEnSeance": "Rejeté"
  },
  "dateDepot": "2018-05-11T02:00:00.000+02:00",
  "dateDistribution": "2018-05-14T02:00:00.000+02:00",
  "article99": "0",
  "loiReference": {}
}