{
  "uid": "AMANR5L15PO59048B0384P0D1N22",
  "identifiant": {
    "legislature": "15",
    "numero": "22",
    "numRect": "0",
    "saisine": {
      "texteLegislatifRef": "PRJLANR5L15B0384",
      "numeroPartiePLF": "0",
      "organeExamen": "PO59048",
      "mentionSecondeDeliberation": "0"
    }
  },
  "numeroLong": "CF22",
  "etapeTexte": "1ère lecture (1ère assemblée saisie)",
  "triAmendement": "zzu",
  "cardinaliteAmdtMultiples": "1",
  "etat": "Discuté",
  "signataires": {
    "auteur": {
      "typeAuteur": "Depute",
      "acteurRef": "PA1874",
      "groupePolitiqueRef": "PO730934"
    },
    "cosignatairesRefs": [
      "PA720684",
      "PA608016",
      "PA2492",
      "PA642847",
      "PA267429",
      "PA346218",
      "PA608416",
      "PA1874",
      "PA266774",
      "PA721968",
      "PA609726",
      "PA608826",
      "PA719318",
      "PA607090",
      "PA267204",
      "PA334654",
      "PA718850",
      "PA330684",
      "PA1012",
      "PA332523"
    ],
    "texteAffichable": "M.&#160;Le Fur,  Mme&#160;Anthoine, M.&#160;Aubert, M.&#160;Bazin, Mme&#160;Val&#233;rie&#160;Boyer, M.&#160;Cinieri, M.&#160;Cordier, Mme&#160;Dalloz, Mme&#160;Duby-Muller, M.&#160;Pierre-Henri&#160;Dumont, M.&#160;Furst, M.&#160;Hetzel, M.&#160;de la Verpilli&#232;re, Mme&#160;Louwagie, M.&#160;Masson, M.&#160;Quentin, M.&#160;Sermier, M.&#160;Straumann, M.&#160;Vialay et M.&#160;Jean-Pierre&#160;Vigier"
  },
  "pointeurFragmentTexte": {
    "division": {
      "titre": "Article 9",
      "articleDesignationCourte": "ART. 9",
      "type": "ARTICLE",
      "avantAApres": "A",
      "divisionRattachee": "ARTICLE 9",
      "urlDivisionTexteVise": "/15/textes/0384.asp#D_Article_9"
    },
    "alinea": {
      "avantAApres": "Avant",
      "numero": "13",
      "alineaDesignation": "Avant l'alinéa 13"
    }
  },
  "corps": {
    "dispositif": "<p style=\"text-align: justify;\">I.&#160;&#8211; Avant l&#8217;alin&#233;a&#160;13, ins&#233;rer les huit alin&#233;as suivants&#160;:</p><p style=\"text-align: justify;\">Le code g&#233;n&#233;ral des imp&#244;ts est ainsi modifi&#233;&#160;:</p><p style=\"text-align: justify;\">A.&#160;&#8211;&#160;L&#8217;article&#160;1729 G, dans sa r&#233;daction issue de la loi n&#176; 2016&#8209;1917 du 29 d&#233;cembre 2016 de finances pour 2017, est abrog&#233;&#160;;</p><p style=\"text-align: justify;\">B.&#160;&#8211;&#160;Le 2 de l&#8217;article&#160;1730 est ainsi modifi&#233;&#160;:</p><p style=\"text-align: justify;\">1&#176; Le <i>b</i> est ainsi r&#233;dig&#233;&#160;:</p><p style=\"text-align: justify;\">&#171;&#160;<i>b</i>. Aux sommes dues au titre de l&#8217;acompte pr&#233;vu au 2&#176; du 2 de l&#8217;article&#160;204&#160;A ou du compl&#233;ment de retenue &#224; la source pr&#233;vu au&#160;3 de l&#8217;article&#160;204&#160;H, dans leur r&#233;daction issue de la loi n&#176;&#160;2016&#8209;1917 du 29&#160;d&#233;cembre 2016 de finances pour 2017.&#160;&#187;&#160;;</p><p style=\"text-align: justify;\">&#171;&#160;2&#176; Apr&#232;s le <i>b</i>, il est ins&#233;r&#233; un <i>b&#160;bis</i> ainsi r&#233;dig&#233;&#160;:</p><p style=\"text-align: justify;\">&#171;&#160;<i>b bis)</i> &#192; la diff&#233;rence entre le montant du pr&#233;l&#232;vement et le montant du pr&#233;l&#232;vement effectu&#233; lorsque le contribuable a ind&#251;ment b&#233;n&#233;fici&#233; d&#8217;une modulation &#224; la baisse du pr&#233;l&#232;vement pr&#233;vue &#224; l&#8217;article&#160;204&#160;J, soit car il ne remplissait pas les conditions pr&#233;vues par ce texte, soit parce que le montant du pr&#233;l&#232;vement effectu&#233; s&#8217;av&#232;re &#234;tre inf&#233;rieur de plus de 10&#160;% au montant qui aurait d&#251; l&#8217;&#234;tre selon les revenus constat&#233;s au titre de l&#8217;imp&#244;t sur le revenu y aff&#233;rent.</p><p style=\"text-align: justify;\">&#171;&#160;La majoration pr&#233;vue &#224; l&#8217;alin&#233;a pr&#233;c&#233;dent ne s&#8217;applique pas lorsque le contribuable justifie que l&#8217;estimation erron&#233;e de sa situation ou de ses revenus a &#233;t&#233;, en tout ou partie, r&#233;alis&#233;e de bonne foi &#224; la date de sa demande de modulation ou provient d&#8217;&#233;l&#233;ments difficilement pr&#233;visibles &#224; cette date, ou lorsque le contribuable justifie que le pr&#233;l&#232;vement qui aurait &#233;t&#233; effectu&#233; en l&#8217;absence de modulation &#224; la baisse est diff&#233;rent de celui calcul&#233; par l&#8217;administration en raison de la r&#233;partition de ses revenus au cours de l&#8217;ann&#233;e.&#160;&#187;</p><p style=\"text-align: justify;\">II.&#160;&#8211;&#160;La perte de recettes pour l&#8217;&#201;tat est compens&#233;e &#224; due concurrence par la cr&#233;ation d&#8217;une taxe additionnelle aux droits mentionn&#233;s aux articles 575 et 575&#160;A du code g&#233;n&#233;ral des imp&#244;ts.&#160;</p>",
    "exposeSommaire": "<p style=\"text-align: justify;\">Le pr&#233;sent amendement &#224; supprimer l&#8217;augmentation de p&#233;nalit&#233;s et &#224; fixer le taux de la majoration pour retard de paiement &#224; 10&#160;%.</p>"
  },
  "representations": [
    {
      "nom": "PDF",
      "typeMime": {
        "type": "application",
        "subType": "PDF"
      },
      "statutRepresentation": {
        "verbatim": true,
        "canonique": true,
        "officielle": true,
        "transcription": false,
        "enregistrement": false
      },
      "contenu": {
        "documentURI": "/15/amendements/0384/CION_FIN/CF22.pdf"
      }
    }
  ],
  "sort": {
    "dateSaisie": "2017-11-29T10:51:22.000+01:00",
    "sortEnSeance": "Rejeté"
  },
  "dateDepot": "2017-11-17T01:00:00.000+01:00",
  "dateDistribution": "2017-11-28T01:00:00.000+01:00",
  "article99": "0",
  "loiReference": {}
}