{
  "uid": "AMANR5L15PO419610B1135P0D1N30",
  "identifiant": {
    "legislature": "15",
    "numero": "30",
    "numRect": "0",
    "saisine": {
      "texteLegislatifRef": "PRJLANR5L15B1135",
      "numeroPartiePLF": "0",
      "organeExamen": "PO419610",
      "mentionSecondeDeliberation": "0"
    }
  },
  "numeroLong": "CE30",
  "etapeTexte": "Nouvelle Lecture",
  "triAmendement": "wc",
  "cardinaliteAmdtMultiples": "1",
  "etat": "Discuté",
  "signataires": {
    "auteur": {
      "typeAuteur": "Depute",
      "acteurRef": "PA332228",
      "groupePolitiqueRef": "PO744425"
    },
    "cosignatairesRefs": [
      "PA267355",
      "PA332228",
      "PA421348"
    ],
    "texteAffichable": "M.&#160;Benoit,  M.&#160;Herth et M.&#160;Villiers"
  },
  "pointeurFragmentTexte": {
    "division": {
      "titre": "Article PREMIER",
      "articleDesignationCourte": "ART. PREMIER",
      "type": "ARTICLE",
      "avantAApres": "A",
      "divisionRattachee": "ARTICLE PREMIER",
      "urlDivisionTexteVise": "/15/textes/1135.asp#D_Article_1er"
    },
    "alinea": {
      "avantAApres": "Apres",
      "numero": "36"
    }
  },
  "corps": {
    "dispositif": "<p style=\"text-align: justify;\">Apr&#232;s l&#8217;alin&#233;a&#160;36, ins&#233;rer l&#8217;alin&#233;a suivant&#160;:</p><p style=\"text-align: justify;\">&#171;&#160;I <i>bis</i>. &#8211; Lorsque, dans le contrat ou l&#8217;accord-cadre, le prix est seulement d&#233;terminable, l&#8217;acheteur communique au producteur et &#224; l&#8217;organisation de producteurs ou &#224; l&#8217;association d&#8217;organisations de producteurs, avant le premier jour de la livraison des produits concern&#233;s par le contrat, de mani&#232;re lisible et compr&#233;hensible, le prix qui sera pay&#233;.&#160;&#187;</p>",
    "exposeSommaire": "<p style=\"text-align: justify;\">Afin de renforcer la transparence et la protection de la partie la plus faible dans la relation commerciale, il est propos&#233; de cr&#233;er une obligation d&#8217;information renforc&#233;e sur la t&#234;te de l&#8217;acheteur &#224; l&#8217;&#233;gard des producteurs &#224; l&#8217;image de ce qu&#8217;il se pratique en droit de la consommation entre un consommateur et un vendeur professionnel. Cette obligation d&#8217;information renforc&#233;e porte sur le prix qui, lorsqu&#8217;il est seulement d&#233;terminable dans le contrat, devra &#234;tre lisible et compr&#233;hensible pour le producteur, l&#8217;OP ou l&#8217;association d&#8217;OP afin de savoir quel prix sera pay&#233; la marchandise, objet du contrat.</p>"
  },
  "representations": [
    {
      "nom": "PDF",
      "typeMime": {
        "type": "application",
        "subType": "PDF"
      },
      "statutRepresentation": {
        "verbatim": true,
        "canonique": true,
        "officielle": true,
        "transcription": false,
        "enregistrement": false
      },
      "contenu": {
        "documentURI": "/15/amendements/1135/CION-ECO/CE30.pdf"
      }
    }
  ],
  "sort": {
    "dateSaisie": "2018-07-17T19:41:08.000+02:00",
    "sortEnSeance": "Adopté"
  },
  "dateDepot": "2018-07-11T02:00:00.000+02:00",
  "dateDistribution": "2018-07-16T02:00:00.000+02:00",
  "article99": "0",
  "loiReference": {}
}