{
  "uid": "AMANR5L15SEA717460BTC2062P0D1N244",
  "identifiant": {
    "legislature": "15",
    "numero": "244",
    "numRect": "0",
    "saisine": {
      "texteLegislatifRef": "PIONANR5L15BTC2062",
      "numeroPartiePLF": "0",
      "organeExamen": "PO717460",
      "mentionSecondeDeliberation": "0"
    }
  },
  "numeroLong": "244",
  "etapeTexte": "1ère lecture (1ère assemblée saisie)",
  "triAmendement": "ecaaaaaaaaaaaaaaaaaaaaaaaaaaaaaaaaaaaaaaaaaaaaaaaajni",
  "cardinaliteAmdtMultiples": "1",
  "etat": "Discuté",
  "signataires": {
    "auteur": {
      "typeAuteur": "Depute",
      "acteurRef": "PA721270",
      "groupePolitiqueRef": "PO730940"
    },
    "cosignatairesRefs": [
      "PA721012",
      "PA721270",
      "PA721118",
      "PA441",
      "PA718926",
      "PA718720",
      "PA335612",
      "PA689",
      "PA722110",
      "PA722202",
      "PA267306",
      "PA610667",
      "PA720692",
      "PA610654",
      "PA721896",
      "PA720546"
    ],
    "texteAffichable": "M.&#160;Peu,  Mme&#160;Bello, M.&#160;Brotherson, M.&#160;Bruneel, Mme&#160;Buffet, M.&#160;Chassaigne, M.&#160;Dharr&#233;ville, M.&#160;Dufr&#232;gne, Mme&#160;Faucillon, M.&#160;Jumel, Mme&#160;K&#233;clard-Mond&#233;sir, M.&#160;Lecoq, M.&#160;Nilor, M.&#160;Fabien&#160;Roussel, M.&#160;Serville et M.&#160;Wulfranc"
  },
  "pointeurFragmentTexte": {
    "division": {
      "titre": "Article 4",
      "articleDesignationCourte": "ART. 4",
      "type": "ARTICLE",
      "avantAApres": "A",
      "divisionRattachee": "ARTICLE 4",
      "urlDivisionTexteVise": "/15/textes/2062.asp#D_Article_4"
    },
    "alinea": {
      "numero": "12"
    }
  },
  "corps": {
    "dispositif": "<p>&#192; la premi&#232;re phrase de l&#8217;alin&#233;a&#160;12, substituer aux mots&#160;:</p><p style=\"text-align: justify;\">&#171;&#160;peut rendre&#160;&#187;</p><p style=\"text-align: justify;\">le mot&#160;:</p><p style=\"text-align: justify;\">&#171;&#160;rend&#160;&#187;.</p>",
    "exposeSommaire": "<p style=\"text-align: justify;\">L&#8217;article&#160;4 d&#233;crit la proc&#233;dure que le CSA devra suivre avant le prononc&#233; d&#8217;une sanction p&#233;cuniaire en cas de manquement par un op&#233;rateur &#224; ses obligations et donne au CSA la possibilit&#233; de rendre publique ces mises en demeure et sanctions. Le pr&#233;sent amendement vise &#224; rendre obligatoire la publicit&#233; de ces mises en demeure et sanctions dans une logique de transparence.</p>",
    "cartoucheDelaiDepotDepasse": "Sous réserve de son traitement par les services de l'Assemblée nationale et de sa recevabilité"
  },
  "representations": [
    {
      "nom": "PDF",
      "typeMime": {
        "type": "application",
        "subType": "PDF"
      },
      "statutRepresentation": {
        "verbatim": true,
        "canonique": true,
        "officielle": true,
        "transcription": false,
        "enregistrement": false
      },
      "contenu": {
        "documentURI": "/15/amendements/2062/AN/244.pdf"
      }
    }
  ],
  "seanceDiscussion": "RUANR5L15S2019IDS21751",
  "sort": {
    "dateSaisie": "2019-07-04T19:30:45.000+02:00",
    "sortEnSeance": "Adopté"
  },
  "dateDepot": "2019-06-28T02:00:00.000+02:00",
  "dateDistribution": "2019-07-04T02:00:00.000+02:00",
  "article99": "0",
  "loiReference": {}
}