{
  "uid": "AMANR5L15PO419610B2274P0D1N183",
  "identifiant": {
    "legislature": "15",
    "numero": "183",
    "numRect": "0",
    "saisine": {
      "texteLegislatifRef": "PRJLANR5L15B2274",
      "numeroPartiePLF": "0",
      "organeExamen": "PO419610",
      "mentionSecondeDeliberation": "0"
    }
  },
  "numeroLong": "CE183",
  "etapeTexte": "1ère lecture (2ème assemblée saisie)",
  "triAmendement": "bdiaaaaaaaaaaaaaaaaaaaaaaaaaaaaaaaaaaaaaaaaaaaaaaab",
  "cardinaliteAmdtMultiples": "1",
  "etat": "Discuté",
  "signataires": {
    "auteur": {
      "typeAuteur": "Depute",
      "acteurRef": "PA607553",
      "groupePolitiqueRef": "PO758835"
    },
    "cosignatairesRefs": [
      "PA429893",
      "PA607553",
      "PA610681",
      "PA333285",
      "PA342415",
      "PA340357",
      "PA1008",
      "PA608172",
      "PA720988",
      "PA609590",
      "PA340343",
      "PA719930",
      "PA333818",
      "PA642764",
      "PA608741",
      "PA608695",
      "PA508",
      "PA608011",
      "PA1198",
      "PA643145",
      "PA605069",
      "PA609332",
      "PA1809",
      "PA332614",
      "PA335054",
      "PA335532",
      "PA337483",
      "PA267233",
      "PA1592"
    ],
    "texteAffichable": "M.&#160;Potier,  Mme&#160;Battistel, M.&#160;Letchimy, M.&#160;Garot, M.&#160;Bouillon, Mme&#160;Bareigts, M.&#160;Aviragnet, Mme&#160;Bi&#233;mouret, M.&#160;Jean-Louis&#160;Bricout, M.&#160;Carvounas, M.&#160;Alain&#160;David, Mme&#160;Laurence&#160;Dumont, M.&#160;Faure, M.&#160;David&#160;Habib, M.&#160;Hutin, M.&#160;Juanico, Mme&#160;Karamanli, M.&#160;J&#233;r&#244;me&#160;Lambert, Mme&#160;Manin, Mme&#160;Pau-Langevin, Mme&#160;Pires Beaune, M.&#160;Pueyo, Mme&#160;Rabault, M.&#160;Saulignac, Mme&#160;Tolmont, Mme&#160;Untermaier, Mme&#160;Vainqueur-Christophe, M.&#160;Vallaud, Mme&#160;Victory et les membres du groupe Socialistes et apparent&#233;s"
  },
  "pointeurFragmentTexte": {
    "division": {
      "titre": "Article 4 ter",
      "articleDesignationCourte": "ART. 4 TER",
      "type": "ARTICLE",
      "avantAApres": "A",
      "divisionRattachee": "ARTICLE 4 TER",
      "urlDivisionTexteVise": "/15/textes/2274.asp#D_Article_4_ter"
    },
    "alinea": {
      "numero": "1"
    }
  },
  "corps": {
    "dispositif": "<p style=\"text-align: justify;\">I-&#160;&#8211;&#160;&#192; l&#8217;alin&#233;a&#160;1, substituer &#224; l&#8217;ann&#233;e&#160;:</p><p style=\"text-align: justify;\">&#171;&#160;2022&#160;&#187;,</p><p style=\"text-align: justify;\">l&#8217;ann&#233;e&#160;:</p><p style=\"text-align: justify;\">&#171;&#160;2021&#160;&#187;.</p><p style=\"text-align: justify;\">II-&#160;&#8211;&#160;&#192; l&#8217;alin&#233;a&#160;2, substituer au mot&#160;:</p><p style=\"text-align: justify;\">&#171;&#160;explore&#160;&#187;,</p><p style=\"text-align: justify;\">le mot&#160;:</p><p style=\"text-align: justify;\">&#171;&#160;explorant&#160;&#187;.</p><p style=\"text-align: justify;\">III-&#160;&#8211;&#160;Compl&#233;ter l&#8217;alin&#233;a&#160;2 par la phrase suivante&#160;: &#171;&#160;Ce rapport pr&#233;voit &#233;galement les modalit&#233;s selon lesquelles les produits &#233;quip&#233;s d&#8217;un compteur d&#8217;usage pourraient b&#233;n&#233;ficier d&#8217;une garantie assurantielle fond&#233;e &#224; la fois sur la dur&#233;e d&#8217;utilisation et le nombre d&#8217;usages.&#160;&#187;</p><p style=\"text-align: justify;\">&#160;</p>",
    "exposeSommaire": "<p style=\"text-align: justify;\">Cet amendement du Groupe Socialistes et apparent&#233;s vise &#224; rendre obligatoire l&#8217;installation d&#8217;un compteur d&#8217;usage sur les gros appareils m&#233;nagers et les &#233;quipements informatiques et de t&#233;l&#233;communication. Ce compteur d&#8217;usage devra &#234;tre visible par le consommateur qui pourra ainsi contr&#244;ler et &#233;valuer la dur&#233;e de vie des produits.</p><p style=\"text-align: justify;\">Les auteurs de cet amendement pr&#233;cisent qu&#8217;un rapport du Gouvernement remis au Parlement, au plus tard le 1<sup>er</sup> janvier 2022, devra notamment examiner les modalit&#233;s par lesquelles les produits &#233;quip&#233;s d&#8217;un compteur d&#8217;usage pourraient b&#233;n&#233;ficier d&#8217;une garantie assurantielle fond&#233;e &#224; la fois sur la dur&#233;e d&#8217;utilisation et le nombre d&#8217;usages.</p>"
  },
  "representations": [
    {
      "nom": "PDF",
      "typeMime": {
        "type": "application",
        "subType": "PDF"
      },
      "statutRepresentation": {
        "verbatim": true,
        "canonique": true,
        "officielle": true,
        "transcription": false,
        "enregistrement": false
      },
      "contenu": {
        "documentURI": "/15/amendements/2274/CION-ECO/CE183.pdf"
      }
    }
  ],
  "sort": {
    "dateSaisie": "2019-11-19T22:33:46.000+01:00",
    "sortEnSeance": "Rejeté"
  },
  "dateDepot": "2019-11-15T01:00:00.000+01:00",
  "dateDistribution": "2019-11-18T01:00:00.000+01:00",
  "article99": "0",
  "loiReference": {}
}