{
  "uid": "AMANR5L15SEA717460BTC2243P0D1N1707",
  "identifiant": {
    "legislature": "15",
    "numero": "1707",
    "numRect": "0",
    "saisine": {
      "texteLegislatifRef": "PRJLANR5L15BTC2243",
      "numeroPartiePLF": "0",
      "organeExamen": "PO717460",
      "mentionSecondeDeliberation": "0"
    }
  },
  "numeroLong": "1707",
  "etapeTexte": "1ère lecture (1ère assemblée saisie)",
  "triAmendement": "kkaaaaaaaaaaaaaaaaaaaaaaaaaaaaaaaaaaaaaaaaaaaaaaaao",
  "cardinaliteAmdtMultiples": "1",
  "etat": "Retiré",
  "signataires": {
    "auteur": {
      "typeAuteur": "Depute",
      "acteurRef": "PA721852",
      "groupePolitiqueRef": "PO730964"
    },
    "cosignatairesRefs": [
      "PA721852"
    ],
    "texteAffichable": "Mme&#160;Lebec"
  },
  "pointeurFragmentTexte": {
    "division": {
      "titre": "Article 27",
      "articleDesignationCourte": "APRÈS ART. 27",
      "type": "ARTICLE",
      "avantAApres": "Apres",
      "divisionRattachee": "APRÈS L'ARTICLE 27, insérer l'article suivant:",
      "articleAdditionnel": "1",
      "urlDivisionTexteVise": "/15/textes/2243.asp#D_Article_27"
    }
  },
  "corps": {
    "dispositif": "<p style=\"text-align: justify;\">I.&#160;&#8211;&#160;Apr&#232;s le quatri&#232;me alin&#233;a de l&#8217;article L1243&#8209;2 du code de la sant&#233; publique, sont ins&#233;r&#233;s deux alin&#233;as ainsi r&#233;dig&#233;s&#160;:</p><p style=\"text-align: justify;\">&#171;&#160;Toute personne dont la prise en charge m&#233;dicale est susceptible de provoquer une d&#233;g&#233;n&#233;rescence cellulaire peut b&#233;n&#233;ficier, apr&#232;s avis de l&#8217;&#233;quipe m&#233;dicale pluridisciplinaire, du recueil et de la conservation de ses cellules, en vue de l&#8217;administration ult&#233;rieure, &#224; son b&#233;n&#233;fice, d&#8217;un traitement innovant d&#233;fini au 17&#176;&#160;de l&#8217;article L5121&#8209;1 du code de la sant&#233; publique, &#224; la condition que le donneur, d&#251;ment inform&#233; de l&#8217;objet du recueil et de la conservation, ait donn&#233; son consentement.</p><p style=\"text-align: justify;\">&#171;&#160;Le consentement est recueilli par &#233;crit par l&#8217;&#233;quipe m&#233;dicale pluridisciplinaire et peut &#234;tre r&#233;voqu&#233; &#224; tout moment jusqu&#8217;&#224; l&#8217;utilisation des cellules. Lorsque la personne est un mineur ou un majeur sous tutelle, le consentement est exerc&#233; par les titulaires de l&#8217;autorit&#233; parentale ou le tuteur.&#160;&#187;</p><p style=\"text-align: justify;\">II.&#160;&#8211;&#160;Les modalit&#233;s d&#8217;application du pr&#233;sent article, notamment concernant d&#8217;une part les conditions sp&#233;cifiques d&#8217;&#233;ligibilit&#233; des patients et d&#8217;autre part les proc&#233;d&#233;s de conservation, sont fix&#233;es par d&#233;cret.</p>",
    "exposeSommaire": "<p style=\"text-align: justify;\">Les th&#233;rapies cellulaires et g&#233;niques ont connu ces derni&#232;res ann&#233;es d&#8217;importants d&#233;veloppements. Les r&#233;sultats viennent progressivement r&#233;pondre aux attentes th&#233;rapeutiques pour des maladies extr&#234;mement graves, comme par exemple dans le cas de certains types de cancers du sang.</p><p style=\"text-align: justify;\">Les cellules du patient sont pr&#233;lev&#233;es, modifi&#233;es g&#233;n&#233;tiquement afin de reconna&#238;tre et d&#233;truire les cellules canc&#233;reuses puis r&#233;inject&#233;es au patient. Dans le cadre de ces traitements, la qualit&#233; des cellules pr&#233;lev&#233;es et s&#233;lectionn&#233;es en amont par aph&#233;r&#232;se est donc tr&#232;s importante.</p><p style=\"text-align: justify;\">Or, ces traitements par th&#233;rapies cellulaires et g&#233;niques ne sont r&#233;alis&#233;s et administr&#233;s que lorsque les patients sont en situation d&#8217;&#233;chec th&#233;rapeutique apr&#232;s au moins 2 lignes de traitements syst&#233;miques (par exemple chimioth&#233;rapie et radioth&#233;rapie).</p><p style=\"text-align: justify;\">La qualit&#233; et la quantit&#233; des cellules pr&#233;lev&#233;es sont alors susceptibles d&#8217;avoir &#233;t&#233; fortement alt&#233;r&#233;es par ces traitements administr&#233;s en priorit&#233;, avec pour cons&#233;quence un risque de perte de chance pour les patients li&#233; &#224; des &#233;checs de production.</p><p style=\"text-align: justify;\">Le cadre l&#233;gislatif actuel ne permet pas de pr&#233;lever et conserver les cellules du patient avant les traitements de premi&#232;res lignes.</p><p style=\"text-align: justify;\">Le pr&#233;sent amendement vise donc &#224; augmenter les chances de r&#233;ussite des th&#233;rapies cellulaires et g&#233;niques en ouvrant la possibilit&#233; de pr&#233;lever et de conserver les cellules du patient d&#232;s les premiers stades de la maladie dans un contexte de diagnostic p&#233;joratif, afin de garantir leur qualit&#233; et de favoriser la mise au point des traitements les plus adapt&#233;s.</p>"
  },
  "representations": [
    {
      "nom": "PDF",
      "typeMime": {
        "type": "application",
        "subType": "PDF"
      },
      "statutRepresentation": {
        "verbatim": true,
        "canonique": true,
        "officielle": true,
        "transcription": false,
        "enregistrement": false
      },
      "contenu": {
        "documentURI": "/15/amendements/2243/AN/1707.pdf"
      }
    }
  ],
  "dateDepot": "2019-09-19T02:00:00.000+02:00",
  "dateDistribution": "2019-09-24T02:00:00.000+02:00",
  "article99": "0",
  "loiReference": {
    "codeLoi": "c santé publique",
    "divisionCodeLoi": "L1243-2"
  }
}