{
  "uid": "AMANR5L15SEA717460BTC2401P0D1N958",
  "identifiant": {
    "legislature": "15",
    "numero": "958",
    "numRect": "0",
    "saisine": {
      "texteLegislatifRef": "PRJLANR5L15BTC2401",
      "numeroPartiePLF": "0",
      "organeExamen": "PO717460",
      "mentionSecondeDeliberation": "0"
    }
  },
  "numeroLong": "958",
  "etapeTexte": "1ère lecture (2ème assemblée saisie)",
  "triAmendement": "ncaaaaaaaaaaaaaaaaaaaaaaaaaaaaaaaaaaaaaaaaaaaaaaaaabe",
  "cardinaliteAmdtMultiples": "1",
  "etat": "A discuter",
  "signataires": {
    "auteur": {
      "typeAuteur": "Depute",
      "acteurRef": "PA720468",
      "groupePolitiqueRef": "PO723569"
    },
    "cosignatairesRefs": [
      "PA720822",
      "PA720606",
      "PA720798",
      "PA720614",
      "PA720468"
    ],
    "texteAffichable": "M.&#160;Chenu,  M.&#160;Aliot, M.&#160;Bilde, Mme&#160;Le Pen et M.&#160;Pajot"
  },
  "pointeurFragmentTexte": {
    "division": {
      "titre": "Article 27",
      "articleDesignationCourte": "ART. 27",
      "type": "ARTICLE",
      "avantAApres": "A",
      "divisionRattachee": "ARTICLE 27",
      "urlDivisionTexteVise": "/15/textes/2401.asp#D_Article_27"
    },
    "alinea": {
      "numero": "3"
    }
  },
  "corps": {
    "dispositif": "<p>&#192; la deuxi&#232;me phrase de l&#8217;alin&#233;a&#160;3, supprimer les mots :</p><p style=\"text-align: justify;\">&#171;&#160;, par heure,&#160;&#187;.</p>",
    "exposeSommaire": "<p>Amendement r&#233;dactionnel.</p><p style=\"text-align: justify;\">Le terme &#171;&#160;par heure&#160;&#187; est superflu puisque les mots &#171;&#160;montant horaire&#160;&#187; se suffisent &#224; eux-m&#234;mes.</p>",
    "cartoucheDelaiDepotDepasse": "Sous réserve de son traitement par les services de l'Assemblée nationale et de sa recevabilité"
  },
  "representations": [
    {
      "nom": "PDF",
      "typeMime": {
        "type": "application",
        "subType": "PDF"
      },
      "statutRepresentation": {
        "verbatim": true,
        "canonique": true,
        "officielle": true,
        "transcription": false,
        "enregistrement": false
      },
      "contenu": {
        "documentURI": "/15/amendements/2401/AN/958.pdf"
      }
    }
  ],
  "dateDepot": "2019-11-14T01:00:00.000+01:00",
  "dateDistribution": "2019-11-20T01:00:00.000+01:00",
  "article99": "0",
  "loiReference": {}
}