{
  "uid": "AMANR5L15SEA717460BTC1396P0D1N1547",
  "identifiant": {
    "legislature": "15",
    "numero": "1547",
    "numRect": "0",
    "saisine": {
      "texteLegislatifRef": "PRJLANR5L15BTC1396",
      "numeroPartiePLF": "0",
      "organeExamen": "PO717460",
      "mentionSecondeDeliberation": "0"
    }
  },
  "numeroLong": "1547",
  "etapeTexte": "1ère lecture (2ème assemblée saisie)",
  "triAmendement": "ddaaaaaaaaaaaaaaaaaaaaaaaaaaaaaaaaaaaaaaaaaaaaaaaale",
  "cardinaliteAmdtMultiples": "1",
  "etat": "Discuté",
  "signataires": {
    "auteur": {
      "typeAuteur": "Depute",
      "acteurRef": "PA607619",
      "groupePolitiqueRef": "PO759900"
    },
    "cosignatairesRefs": [
      "PA336175",
      "PA331582",
      "PA719146",
      "PA605518",
      "PA608292",
      "PA719286",
      "PA755549",
      "PA607619",
      "PA720996",
      "PA719138",
      "PA333421",
      "PA336439"
    ],
    "texteAffichable": "M.&#160;Molac,  M.&#160;Acquaviva, M.&#160;Cl&#233;ment, M.&#160;Philippe&#160;Vigier, M.&#160;Pancher, M.&#160;Brial, M.&#160;Castellani, M.&#160;Colombani, Mme&#160;Dubi&#233;, M.&#160;El Guerrab, M.&#160;Fran&#231;ois-Michel&#160;Lambert et Mme&#160;Pinel"
  },
  "pointeurFragmentTexte": {
    "division": {
      "titre": "Article 29",
      "articleDesignationCourte": "ART. 29",
      "type": "ARTICLE",
      "avantAApres": "A",
      "divisionRattachee": "ARTICLE 29",
      "urlDivisionTexteVise": "/15/textes/1396.asp#D_Article_29"
    },
    "alinea": {
      "avantAApres": "A",
      "numero": "22",
      "alineaDesignation": "Alinéa 22"
    }
  },
  "corps": {
    "dispositif": "<p style=\"text-align: justify;\">Supprimer l&#8217;alin&#233;a&#160;22.</p>",
    "exposeSommaire": "<p style=\"text-align: justify;\">Cet article a pour objet d&#8217;unifier le r&#233;gime juridique applicable aux techniques sp&#233;ciales d&#8217;enqu&#234;te de sonorisation, de captation d&#8217;images, de recueil des donn&#233;es techniques de connexion et de captation de donn&#233;es informatiques malgr&#233; leur caract&#232;re attentatoire aux libert&#233;s fondamentales.</p><p style=\"text-align: justify;\">Ainsi, cet article pr&#233;voit qu&#8217;en cas &#171;&#160;d&#8217;urgence&#160;&#187;, dont la notion est juridiquement floue, les techniques sp&#233;ciales d&#8217;enqu&#234;te peuvent &#234;tre autoris&#233;es par le procureur de la R&#233;publique sans autorisation pr&#233;alable du juge des libert&#233;s et de la d&#233;tention.</p><p style=\"text-align: justify;\">Cette mesure est disproportionn&#233;e, et le juge des libert&#233;s et de la d&#233;tention doit pouvoir intervenir, au cours de l&#8217;enqu&#234;te, en amont de l&#8217;autorisation.</p><p style=\"text-align: justify;\">Cet amendement propose donc de supprimer cette mesure.</p>"
  },
  "representations": [
    {
      "nom": "PDF",
      "typeMime": {
        "type": "application",
        "subType": "PDF"
      },
      "statutRepresentation": {
        "verbatim": true,
        "canonique": true,
        "officielle": true,
        "transcription": false,
        "enregistrement": false
      },
      "contenu": {
        "documentURI": "/15/amendements/1396/AN/1547.pdf"
      }
    }
  ],
  "seanceDiscussion": "RUANR5L15S2019IDS21376",
  "sort": {
    "dateSaisie": "2018-11-23T12:08:05.000+01:00",
    "sortEnSeance": "Non soutenu"
  },
  "dateDepot": "2018-11-15T01:00:00.000+01:00",
  "dateDistribution": "2018-11-20T01:00:00.000+01:00",
  "article99": "0",
  "loiReference": {}
}