{
  "uid": "AMANR5L15PO59051B0714P0D1N792",
  "identifiant": {
    "legislature": "15",
    "numero": "792",
    "numRect": "0",
    "saisine": {
      "texteLegislatifRef": "PRJLANR5L15B0714",
      "numeroPartiePLF": "0",
      "organeExamen": "PO59051",
      "mentionSecondeDeliberation": "0"
    }
  },
  "numeroLong": "CL792",
  "etapeTexte": "1ère lecture (1ère assemblée saisie)",
  "triAmendement": "bh",
  "cardinaliteAmdtMultiples": "1",
  "etat": "Discuté",
  "signataires": {
    "auteur": {
      "typeAuteur": "Depute",
      "acteurRef": "PA722268",
      "groupePolitiqueRef": "PO730964"
    },
    "cosignatairesRefs": [
      "PA720552",
      "PA721956",
      "PA722268",
      "PA718744",
      "PA719464",
      "PA718710",
      "PA607619",
      "PA719364",
      "PA336439",
      "PA720394",
      "PA719480",
      "PA720202",
      "PA722170",
      "PA720900",
      "PA719194",
      "PA720738",
      "PA722062",
      "PA720124",
      "PA719448",
      "PA609520",
      "PA608083",
      "PA721860",
      "PA719350",
      "PA721514",
      "PA720870",
      "PA719456",
      "PA720146",
      "PA719170",
      "PA643175",
      "PA719230"
    ],
    "texteAffichable": "Mme&#160;Wonner,  Mme&#160;Bagarry, M.&#160;Michels, Mme&#160;Chapelier, Mme&#160;Trisse, Mme&#160;Beaudouin-Hubiere, Mme&#160;Charvier, Mme&#160;Pascale&#160;Boyer, M.&#160;Molac, Mme&#160;Bourguignon, Mme&#160;O&apos;Petit, Mme&#160;O, M.&#160;Nadot, Mme&#160;Rauch, M.&#160;Gaillard, M.&#160;Cesarini, Mme&#160;Rilhac, M.&#160;Mass&#233;glia, Mme&#160;Pompili, M.&#160;Cl&#233;ment, Mme&#160;Dupont, M.&#160;Mbaye, Mme&#160;Tamarelle-Verhaeghe, Mme&#160;Kerbarh, M.&#160;Kerlogot, Mme&#160;Granjus, Mme&#160;Yolaine&#160;de Courson, Mme&#160;Krimi, Mme&#160;Amadou et Mme&#160;M&#246;rch"
  },
  "pointeurFragmentTexte": {
    "division": {
      "titre": "pour une immigration maîtrisée et un droit d’asile effectif.",
      "articleDesignationCourte": "TITRE",
      "type": "TITRE",
      "avantAApres": "A",
      "divisionRattachee": "TITRE",
      "urlDivisionTexteVise": "/15/textes/0714.asp#D_pour_une_immigration_maitrisee_et_un_d"
    }
  },
  "corps": {
    "dispositif": "<p style=\"text-align: justify;\">Au titre du projet, substituer aux mots&#160;:</p><p style=\"text-align: justify;\">&#171;&#160;et un droit d&#8217;asile effectif&#160;&#187;</p><p style=\"text-align: justify;\">les mots&#160;:</p><p style=\"text-align: justify;\">&#171;&#160;,&#160;un droit d&#8217;asile effectif et une int&#233;gration r&#233;ussie&#160;&#187;.</p>",
    "exposeSommaire": "<p>Cet amendement vise &#224; modifier le titre afin d&#8217;y inclure le titre III &#171; Am&#233;liorer les conditions d&#8217;int&#233;gration et d&#8217;accueil des &#233;trangers en situation r&#233;guli&#232;re &#187;</p>"
  },
  "representations": [
    {
      "nom": "PDF",
      "typeMime": {
        "type": "application",
        "subType": "PDF"
      },
      "statutRepresentation": {
        "verbatim": true,
        "canonique": true,
        "officielle": true,
        "transcription": false,
        "enregistrement": false
      },
      "contenu": {
        "documentURI": "/15/amendements/0714/CION_LOIS/CL792.pdf"
      }
    }
  ],
  "sort": {
    "dateSaisie": "2018-04-06T20:53:09.000+02:00",
    "sortEnSeance": "Non soutenu"
  },
  "dateDepot": "2018-03-30T02:00:00.000+02:00",
  "dateDistribution": "2018-04-02T02:00:00.000+02:00",
  "article99": "0",
  "loiReference": {
    "codeLoi": "2.0 id"
  }
}