{
  "uid": "AMANR5L15PO419865B1393P0D1N184",
  "identifiant": {
    "legislature": "15",
    "numero": "184",
    "numRect": "0",
    "saisine": {
      "texteLegislatifRef": "PIONANR5L15B1393",
      "numeroPartiePLF": "0",
      "organeExamen": "PO419865",
      "mentionSecondeDeliberation": "0"
    }
  },
  "numeroLong": "CD184",
  "etapeTexte": "1ère lecture (2ème assemblée saisie)",
  "triAmendement": "biaaaaaaaaaaaaaaaaaaaaaaaaaaaaaaaaaaaaaaaaaaaaaaaaodny",
  "cardinaliteAmdtMultiples": "1",
  "etat": "Discuté",
  "signataires": {
    "auteur": {
      "typeAuteur": "Depute",
      "acteurRef": "PA267766",
      "groupePolitiqueRef": "PO744425"
    },
    "cosignatairesRefs": [
      "PA267241",
      "PA719806",
      "PA267766"
    ],
    "texteAffichable": "M.&#160;Guy&#160;Bricout,  Mme&#160;Auconie et M.&#160;Demilly"
  },
  "pointeurFragmentTexte": {
    "division": {
      "titre": "Article 3",
      "articleDesignationCourte": "ART. 3",
      "type": "ARTICLE",
      "avantAApres": "A",
      "divisionRattachee": "ARTICLE 3",
      "urlDivisionTexteVise": "/15/textes/1393.asp#D_Article_3"
    },
    "alinea": {
      "numero": "6"
    }
  },
  "corps": {
    "dispositif": "<p style=\"text-align: justify;\">Apr&#232;s le mot&#160;:</p><p style=\"text-align: justify;\">&#171;&#160;tous&#160;&#187;,</p><p style=\"text-align: justify;\">r&#233;diger ainsi la fin de l&#8217;alin&#233;a&#160;6&#160;:</p><p style=\"text-align: justify;\">&#171;&#160;les territoires, notamment des territoires ruraux, ultramarins et de montagne et des territoires comprenant des quartiers prioritaires de la politique de la ville.&#160;&#187;</p>",
    "exposeSommaire": "<p style=\"text-align: justify;\">Cet amendement reprend l&#8217;amendement de la Rapporteur, adopt&#233; en commission des affaires &#233;conomiques pour avis, afin d&#8217;assurer une repr&#233;sentation de tous les territoires au sein du conseil d&#8217;administration de l&#8217;agence, et en particulier les territoires d'outre-mer.</p>"
  },
  "representations": [
    {
      "nom": "PDF",
      "typeMime": {
        "type": "application",
        "subType": "PDF"
      },
      "statutRepresentation": {
        "verbatim": true,
        "canonique": true,
        "officielle": true,
        "transcription": false,
        "enregistrement": false
      },
      "contenu": {
        "documentURI": "/15/amendements/1393/CION-DVP/CD184.pdf"
      }
    }
  ],
  "sort": {
    "dateSaisie": "2019-02-05T23:57:56.000+01:00",
    "sortEnSeance": "Tombé"
  },
  "dateDepot": "2019-01-31T01:00:00.000+01:00",
  "dateDistribution": "2019-02-04T01:00:00.000+01:00",
  "article99": "0",
  "loiReference": {}
}