{
  "uid": "AMANR5L15SEA717460BTC2208P0D1N35",
  "identifiant": {
    "legislature": "15",
    "numero": "35",
    "numRect": "0",
    "saisine": {
      "texteLegislatifRef": "PIONANR5L15BTC2208",
      "numeroPartiePLF": "0",
      "organeExamen": "PO717460",
      "mentionSecondeDeliberation": "0"
    }
  },
  "numeroLong": "35",
  "etapeTexte": "1ère lecture (2ème assemblée saisie)",
  "triAmendement": "kcaaaaaaaaaaaaaaaaaaaaaaaaaaaaaaaaaaaaaaaaaaaaaaaad",
  "cardinaliteAmdtMultiples": "1",
  "etat": "Discuté",
  "signataires": {
    "auteur": {
      "typeAuteur": "Depute",
      "acteurRef": "PA722312",
      "groupePolitiqueRef": "PO730964"
    },
    "cosignatairesRefs": [
      "PA722170",
      "PA721398",
      "PA718876",
      "PA719890",
      "PA722312",
      "PA718694"
    ],
    "texteAffichable": "Mme&#160;Bessot Ballot,  Mme&#160;Degois, M.&#160;Marc&#160;Delatte, Mme&#160;Brulebois, M.&#160;Besson-Moreau et Mme&#160;Beaudouin-Hubiere"
  },
  "pointeurFragmentTexte": {
    "division": {
      "titre": "Article 5 bis A",
      "articleDesignationCourte": "APRÈS ART. 5 BIS A",
      "type": "ARTICLE",
      "avantAApres": "Apres",
      "divisionRattachee": "APRÈS L'ARTICLE 5 BIS A, insérer l'article suivant:",
      "articleAdditionnel": "1",
      "urlDivisionTexteVise": "/15/textes/2208.asp#D_Article_5_bis_A"
    }
  },
  "corps": {
    "dispositif": "<p style=\"text-align: justify;\">Apr&#232;s le deuxi&#232;me alin&#233;a de l&#8217;article L.&#160;51 du code &#233;lectoral, sont ins&#233;r&#233;s deux alin&#233;as ainsi r&#233;dig&#233;s&#160;:</p><p style=\"text-align: justify;\">&#171;&#160;Le nombre maximal d&#8217;affiches pouvant &#234;tre appos&#233;es sur les emplacements sp&#233;ciaux pr&#233;vus &#224; cet effet est fix&#233; &#224; un par candidat, bin&#244;me de candidats ou liste de candidats.</p><p style=\"text-align: justify;\">&#171;&#160;Les modalit&#233;s d&#8217;application de l&#8217;alin&#233;a pr&#233;c&#233;dent sont d&#233;finies par d&#233;cret en Conseil d&#8217;&#201;tat.&#160;&#187;</p>",
    "exposeSommaire": "<p style=\"text-align: justify;\">Selon l&#8217;article L51 du code &#233;lectoral, pendant la dur&#233;e de la p&#233;riode &#233;lectorale, dans chaque commune, des emplacements sp&#233;ciaux sont r&#233;serv&#233;s par l&#8217;autorit&#233; municipale pour l&#8217;apposition des affiches &#233;lectorales.</p><p style=\"text-align: justify;\">Par ailleurs,&#160;dans chacun de ces emplacements, une surface &#233;gale est attribu&#233;e &#224; chaque candidat, chaque bin&#244;me de candidats ou &#224; chaque liste de candidats.</p><p style=\"text-align: justify;\">A ce jour,&#160;le nombre maximal d&#8217;affiches pouvant &#234;tre appos&#233;es sur les emplacements pr&#233;vus &#224; cet effet n&#8217;est pas limit&#233;.</p><p style=\"text-align: justify;\">Seul est r&#233;glement&#233; le nombre d&#8217;affiches pouvant faire l&#8217;objet d&#8217;un remboursement dans le cadre des d&#233;penses de propagande.</p><p style=\"text-align: justify;\">Dans un objectif d&#8217;efficacit&#233;, de visibilit&#233;, de meilleure communication de l&#8217;information mais aussi dans contexte d&#8217;acc&#233;l&#233;ration vers la transition &#233;cologique, il semble alors plus pertinent&#160;de limiter &#224; une seule affiche par candidat le nombre maximal d&#8217;affiches pouvant &#234;tre appos&#233;es sur les emplacements pr&#233;vus &#224; cet effet.</p><p style=\"text-align: justify;\">Tel est l&#8217;objectif de cet&#160;amendement d&#8217;appel.&#160;</p>"
  },
  "representations": [
    {
      "nom": "PDF",
      "typeMime": {
        "type": "application",
        "subType": "PDF"
      },
      "statutRepresentation": {
        "verbatim": true,
        "canonique": true,
        "officielle": true,
        "transcription": false,
        "enregistrement": false
      },
      "contenu": {
        "documentURI": "/15/amendements/2208/AN/35.pdf"
      }
    }
  ],
  "seanceDiscussion": "RUANR5L15S2019IDS21813",
  "sort": {
    "dateSaisie": "2019-09-17T19:45:27.000+02:00",
    "sortEnSeance": "Rejeté"
  },
  "dateDepot": "2019-09-13T02:00:00.000+02:00",
  "dateDistribution": "2019-09-16T02:00:00.000+02:00",
  "article99": "0",
  "loiReference": {
    "codeLoi": "c  électoral",
    "divisionCodeLoi": "L51"
  }
}