{
  "uid": "AMANR5L15PO59051B0911P0D1N1119",
  "identifiant": {
    "legislature": "15",
    "numero": "1119",
    "numRect": "0",
    "saisine": {
      "texteLegislatifRef": "PRJLANR5L15B0911",
      "numeroPartiePLF": "0",
      "organeExamen": "PO59051",
      "mentionSecondeDeliberation": "0"
    }
  },
  "numeroLong": "CL1119",
  "etapeTexte": "1ère lecture (1ère assemblée saisie)",
  "triAmendement": "bi",
  "cardinaliteAmdtMultiples": "1",
  "etat": "Discuté",
  "signataires": {
    "auteur": {
      "typeAuteur": "Depute",
      "acteurRef": "PA719138",
      "groupePolitiqueRef": "PO723569"
    },
    "cosignatairesRefs": [
      "PA719138"
    ],
    "texteAffichable": "M.&#160;Castellani"
  },
  "pointeurFragmentTexte": {
    "division": {
      "titre": "Article 12",
      "articleDesignationCourte": "APRÈS ART. 12",
      "type": "ARTICLE",
      "avantAApres": "Apres",
      "divisionRattachee": "APRÈS L'ARTICLE 12, insérer l'article suivant:",
      "articleAdditionnel": "1",
      "urlDivisionTexteVise": "/15/textes/0911.asp#D_Article_12"
    }
  },
  "corps": {
    "dispositif": "<p style=\"text-align: justify;\">L&#8217;article&#160;66&#8209;1 de la Constitution est compl&#233;t&#233; par un alin&#233;a ainsi r&#233;dig&#233;&#160;: &#171;&#160;Tout d&#233;tenu a vocation &#224; &#234;tre r&#233;ins&#233;r&#233;.&#160;&#187;</p>",
    "exposeSommaire": "<p style=\"text-align: justify;\">La punition et la privation de libert&#233; ne sont pas les seules pr&#233;rogatives de l&#8217;administration p&#233;nitentiaire. Cette derni&#232;re doit aussi contribuer &#224; l&#8217;insertion ou la r&#233;insertion des personnes confi&#233;es par l&#8217;autorit&#233; judiciaire.</p><p style=\"text-align: justify;\">Le l&#233;gislateur pourra se pr&#233;valoir de ce principe inscrit dans la Constitution pour favoriser des dispositions portant sur le travail en prison ou la formation professionnelle, autant de facteurs pouvant aider &#224; la r&#233;insertion des d&#233;tenus. 80&#160;000 personnes sortent de prison chaque ann&#233;e et ces derni&#232;res sont confront&#233;es &#224; un fort risque de&#160;r&#233;cidive et de marginalisation.</p><p style=\"text-align: justify;\">Il s&#8217;agit pour le l&#233;gislateur de r&#233;pondre &#224; cette situation en se fondant sur ce principe qu&#8217;il est propos&#233; de constitutionnaliser.</p>"
  },
  "representations": [
    {
      "nom": "PDF",
      "typeMime": {
        "type": "application",
        "subType": "PDF"
      },
      "statutRepresentation": {
        "verbatim": true,
        "canonique": true,
        "officielle": true,
        "transcription": false,
        "enregistrement": false
      },
      "contenu": {
        "documentURI": "/15/amendements/0911/CION_LOIS/CL1119.pdf"
      }
    }
  ],
  "sort": {
    "dateSaisie": "2018-06-29T21:41:01.000+02:00",
    "sortEnSeance": "Non soutenu"
  },
  "dateDepot": "2018-06-22T02:00:00.000+02:00",
  "dateDistribution": "2018-06-28T02:00:00.000+02:00",
  "article99": "0",
  "loiReference": {
    "codeLoi": "66-1",
    "divisionCodeLoi": "2"
  }
}