{
  "uid": "AMANR5L15SEA717460BTC2401P0D1N153",
  "identifiant": {
    "legislature": "15",
    "numero": "153",
    "numRect": "0",
    "saisine": {
      "texteLegislatifRef": "PRJLANR5L15BTC2401",
      "numeroPartiePLF": "0",
      "organeExamen": "PO717460",
      "mentionSecondeDeliberation": "0"
    }
  },
  "numeroLong": "153",
  "etapeTexte": "1ère lecture (2ème assemblée saisie)",
  "triAmendement": "aaiaaaaaaaaaaaaaaaaaaaaaaaaaaaaaaaaaaaaaaaaaaaaaaaq",
  "cardinaliteAmdtMultiples": "1",
  "etat": "Irrecevable",
  "signataires": {
    "auteur": {
      "typeAuteur": "Depute",
      "acteurRef": "PA721678",
      "groupePolitiqueRef": "PO730934"
    },
    "cosignatairesRefs": [
      "PA719272",
      "PA608416",
      "PA643089",
      "PA642847",
      "PA719318",
      "PA334654",
      "PA721506",
      "PA267204",
      "PA605036",
      "PA720630",
      "PA2155",
      "PA721678",
      "PA709315",
      "PA720644"
    ],
    "texteAffichable": "M.&#160;Reda,  M.&#160;Viala, M.&#160;Thi&#233;riot, M.&#160;Nury, M.&#160;Abad, M.&#160;Menuel, M.&#160;Minot, Mme&#160;Meunier, Mme&#160;Kuster, M.&#160;Sermier, M.&#160;Hetzel, Mme&#160;Anthoine, M.&#160;Straumann et M.&#160;Bazin"
  },
  "pointeurFragmentTexte": {
    "division": {
      "titre": "Article PREMIER",
      "articleDesignationCourte": "AVANT ART. PREMIER",
      "type": "ARTICLE",
      "avantAApres": "Avant",
      "divisionRattachee": "AVANT L'ARTICLE PREMIER, insérer l'article suivant:",
      "articleAdditionnel": "1",
      "urlDivisionTexteVise": "/15/textes/2401.asp#D_Article_1er"
    }
  },
  "corps": {},
  "representations": [
    {
      "nom": "PDF",
      "typeMime": {
        "type": "application",
        "subType": "PDF"
      },
      "statutRepresentation": {
        "verbatim": true,
        "canonique": true,
        "officielle": true,
        "transcription": false,
        "enregistrement": false
      },
      "contenu": {
        "documentURI": "/15/amendements/2401/AN/153.pdf"
      }
    }
  ],
  "dateDepot": "2019-11-12T01:00:00.000+01:00",
  "dateDistribution": "2019-11-14T01:00:00.000+01:00",
  "article99": "0",
  "loiReference": {
    "codeLoi": "c santé publique",
    "divisionCodeLoi": "L3213-2"
  }
}