{
  "uid": "AMANR5L15SEA717460B2272P1D1N1267",
  "identifiant": {
    "legislature": "15",
    "numero": "1267",
    "numRect": "0",
    "saisine": {
      "texteLegislatifRef": "PRJLANR5L15B2272",
      "numeroPartiePLF": "1",
      "organeExamen": "PO717460",
      "mentionSecondeDeliberation": "0"
    }
  },
  "numeroLong": "I-1267",
  "etapeTexte": "1ère lecture (1ère assemblée saisie)",
  "triAmendement": "daaaaaaaaaaaaaaaaaaaaaaaaaaaaaaaaaaaaaaaaaaaaaaaaaaibzzx",
  "cardinaliteAmdtMultiples": "1",
  "etat": "Discuté",
  "signataires": {
    "auteur": {
      "typeAuteur": "Depute",
      "acteurRef": "PA720586",
      "groupePolitiqueRef": "PO730934"
    },
    "cosignatairesRefs": [
      "PA721070",
      "PA720586"
    ],
    "texteAffichable": "M.&#160;Vatin et Mme&#160;Ramassamy"
  },
  "pointeurFragmentTexte": {
    "division": {
      "titre": "Article 13",
      "articleDesignationCourte": "APRÈS ART. 13",
      "type": "ARTICLE",
      "avantAApres": "Apres",
      "divisionRattachee": "APRÈS L'ARTICLE 13, insérer l'article suivant:",
      "articleAdditionnel": "1",
      "urlDivisionTexteVise": "/15/textes/2272A.asp#D_Article_13"
    }
  },
  "corps": {
    "dispositif": "<p>I.&#160;&#8211;&#160;&#192; la seconde phrase du deuxi&#232;me alin&#233;a de&#160;l&#8217;article&#160;75 du code g&#233;n&#233;ral des imp&#244;ts, apr&#232;s le mot&#160;:&#171;&#160;activit&#233;s&#160;&#187;, sont ins&#233;r&#233;s les mots&#160;:&#160;&#171;&#160;, exerc&#233;es &#224; titre non professionnel,&#160;&#187;.</p><p style=\"text-align: justify;\">II.&#160;&#8211;&#160;La perte de recettes pour l&#8217;&#201;tat est compens&#233;e par la cr&#233;ation d&#8217;une taxe additionnelle aux droits mentionn&#233;s aux articles 575 et 575 A du code g&#233;n&#233;ral des imp&#244;ts.</p>",
    "exposeSommaire": "<p>L&#8217;article&#160;75 du Code g&#233;n&#233;ral des imp&#244;ts a &#233;t&#233; instaur&#233; afin de favoriser le d&#233;veloppement de la pluriactivit&#233; en simplifiant les obligations d&#233;claratives des exploitants agricoles. Cet article &#233;vite aux exploitants se livrant &#224; des activit&#233;s tax&#233;es dans les c&#233;dules des b&#233;n&#233;fices industriels et commerciaux ou des b&#233;n&#233;fices non commerciaux, de tenir une comptabilit&#233; propre &#224; ces activit&#233;s, en plus de la comptabilit&#233; li&#233;e &#224; leur activit&#233; agricole.</p><p style=\"text-align: justify;\">Toutefois, et en toute logique, le b&#233;n&#233;fice de dispositifs purement agricoles tels que les d&#233;ductions pour investissements ou pour al&#233;as, ou encore l&#8217;abattement Jeunes Agriculteurs ne peut avoir pour base de calcul un r&#233;sultat compos&#233; non exclusivement de recettes issues d&#8217;une activit&#233; agricole. La m&#234;me logique s&#8217;applique pour l&#8217;imputation des d&#233;ficits. Un retraitement du r&#233;sultat global de l&#8217;exploitation s&#8217;impose donc en comptabilit&#233;, en extournant du r&#233;sultat global de l&#8217;exploitant l&#8217;ensemble des produits et charges aff&#233;rents aux activit&#233;s accessoires.</p><p style=\"text-align: justify;\">Mais cette distinction est en pratique fastidieuse, sinon impossible sauf &#224; mesurer l&#8217;ensemble des charges et usures de chaque mat&#233;riel dues &#224; l&#8217;exercice d&#8217;une activit&#233; accessoire.</p><p style=\"text-align: justify;\">Consciente de cette difficult&#233;, l&#8217;Administration a entendu simplifier la d&#233;termination du r&#233;sultat issu exclusivement d&#8217;activit&#233;s agricoles en n&#8217;extournant du r&#233;sultat global seulement les produits et charges directement rattachables aux activit&#233;s accessoires.&#160;</p><p style=\"text-align: justify;\">Ces r&#232;gles de simplification ne sont toutefois pas suffisantes, puisque cela suppose encore la tenue d&#8217;une comptabilit&#233; propre aux activit&#233;s accessoires, ce qui va &#224; l&#8217;encontre de la volont&#233; de simplification voulue par le l&#233;gislateur lors de l&#8217;adoption de l&#8217;article&#160;75 du Code g&#233;n&#233;ral des Imp&#244;ts et en r&#233;duit consid&#233;rablement la port&#233;e.</p><p style=\"text-align: justify;\">Il est donc propos&#233;, &#224; titre de r&#232;gle pratique, d&#8217;appliquer au r&#233;sultat de l&#8217;exploitant, qu&#8217;il s&#8217;agisse d&#8217;un b&#233;n&#233;fice ou d&#8217;un d&#233;ficit, le rapport entre les produits des activit&#233;s accessoires relevant de la cat&#233;gorie des b&#233;n&#233;fices industriels et commerciaux et de celle des b&#233;n&#233;fices non commerciaux r&#233;alis&#233;s au titre de l&#8217;exercice sur les produits totaux r&#233;alis&#233;s au titre du m&#234;me exercice. Puis d&#8217;exclure la fraction de b&#233;n&#233;fice ainsi d&#233;termin&#233;e des dispositifs propres aux b&#233;n&#233;fices agricoles ou d&#8217;imputer la fraction de d&#233;ficit ainsi &#233;tablie selon les r&#232;gles de droit commun applicables aux b&#233;n&#233;fices industriels et commerciaux et aux b&#233;n&#233;fices non commerciaux.</p><p style=\"text-align: justify;\">Ce rapport, ais&#233; &#224; d&#233;terminer par l&#8217;exploitant, apportera la simplicit&#233; n&#233;cessaire &#224; la mise en &#339;uvre de l&#8217;article&#160;75 du CGI.</p>"
  },
  "representations": [
    {
      "nom": "PDF",
      "typeMime": {
        "type": "application",
        "subType": "PDF"
      },
      "statutRepresentation": {
        "verbatim": true,
        "canonique": true,
        "officielle": true,
        "transcription": false,
        "enregistrement": false
      },
      "contenu": {
        "documentURI": "/15/amendements/2272A/AN/1267.pdf"
      }
    }
  ],
  "seanceDiscussion": "RUANR5L15S2020IDS21871",
  "sort": {
    "dateSaisie": "2019-10-18T23:10:14.000+02:00",
    "sortEnSeance": "Non soutenu"
  },
  "dateDepot": "2019-10-10T02:00:00.000+02:00",
  "dateDistribution": "2019-10-17T02:00:00.000+02:00",
  "article99": "0",
  "loiReference": {
    "codeLoi": "CGI",
    "divisionCodeLoi": "75"
  }
}