{
  "uid": "AMANR5L15PO419865B1831P0D1N2081",
  "identifiant": {
    "legislature": "15",
    "numero": "2081",
    "numRect": "0",
    "saisine": {
      "texteLegislatifRef": "PRJLANR5L15B1831",
      "numeroPartiePLF": "0",
      "organeExamen": "PO419865",
      "mentionSecondeDeliberation": "0"
    }
  },
  "numeroLong": "CD2081",
  "etapeTexte": "1ère lecture (2ème assemblée saisie)",
  "triAmendement": "qiaaaaaaaaaaaaaaaaaaaaaaaaaaaaaaaaaaaaaaaaaaaaaaaay",
  "cardinaliteAmdtMultiples": "1",
  "etat": "Retiré",
  "signataires": {
    "auteur": {
      "typeAuteur": "Depute",
      "acteurRef": "PA719890",
      "groupePolitiqueRef": "PO730964"
    },
    "cosignatairesRefs": [
      "PA606639",
      "PA606202",
      "PA719822",
      "PA718728",
      "PA719496",
      "PA721328",
      "PA719890",
      "PA718710",
      "PA718894",
      "PA720900",
      "PA720622",
      "PA720814",
      "PA607155",
      "PA721726",
      "PA719230",
      "PA719154"
    ],
    "texteAffichable": "Mme&#160;Brulebois,  Mme&#160;Pascale&#160;Boyer, Mme&#160;Brugnera, Mme&#160;Bureau-Bonnard, M.&#160;Cabar&#233;, M.&#160;Cazenove, M.&#160;Daniel, M.&#160;Dombreval, Mme&#160;Fran&#231;oise&#160;Dumas, M.&#160;Kerlogot, M.&#160;Martin, Mme&#160;Mauborgne, Mme&#160;Rilhac, Mme&#160;Thillaye, Mme&#160;Vanceunebrock-Mialon et M.&#160;Vignal"
  },
  "pointeurFragmentTexte": {
    "division": {
      "titre": "Article 50",
      "articleDesignationCourte": "APRÈS ART. 50",
      "type": "ARTICLE",
      "avantAApres": "Apres",
      "divisionRattachee": "APRÈS L'ARTICLE 50, insérer l'article suivant:",
      "articleAdditionnel": "1",
      "urlDivisionTexteVise": "/15/textes/1831.asp#D_Article_50"
    }
  },
  "corps": {
    "dispositif": "<p>A l&#8217;Article R431-1-3 du code la route,<br />Au premier alin&#233;a, supprimer&#160;:<br />&#171; s'ils sont &#226;g&#233;s de moins de douze ans,&#160;&#187;<br />&#160;<br />Au 2&#232;me alin&#233;a, supprimer&#160;:<br />&#171;&#160;&#226;g&#233; de moins de douze ans&#160;&#187;<br />&#160;<br />Au 3&#232;me alin&#233;a, supprimer&#160;:<br />&#171;&#160;&#226;g&#233; de moins de douze ans&#160;&#187;</p>",
    "exposeSommaire": "<p>Le cyclisme conna&#238;t un engouement croissant et sa pratique se d&#233;veloppe sans cesse et de fa&#231;on importante ces derni&#232;res ann&#233;es, que ce soit pour les d&#233;placements professionnels, personnels ou de loisirs.<br />&#160;<br />La progression des ventes de v&#233;los atteste de ce succ&#232;s : plus de 3 millions de v&#233;los ont vendus en 2016.<br />&#160;<br />Les politiques publiques, indemnit&#233; kilom&#233;trique v&#233;lo et prime &#224; l&#8217;achat libre service et partage des flottes ont favoris&#233; le d&#233;veloppement de ce mode de transport.<br />Ses avantages pour la n&#233;cessaire transition &#233;cologique mais aussi pour la sant&#233; vertus sont reconnus&#160;par tous.<br />&#160;<br />Mais aujourd&#8217;hui un adulte qui roule &#224; v&#233;lo n'a aucune obligation de porter un casque, contrairement aux r&#232;gles applicables aux motos ou aux scooters. Il ne risque donc pas d'amende en cas de contr&#244;le, sauf s'il transporte ou qu'il accompagne un enfant de moins de 12 ans ne portant pas lui-m&#234;me son casque. Or avoir plus de 12ans n&#8217;emp&#234;che pas les cyclistes d&#8217;&#234;tre victime d&#8217;accident. Il est donc primordial de pr&#233;venir les risques de blessures graves &#224; la t&#234;te et au visage. Il est d&#8217;autant plus important de prot&#233;ger les cyclistes que ceux-ci constituent les usagers les plus &#171;&#160;vuln&#233;rables&#160;&#187; des routes.<br />Malgr&#233; les am&#233;nagements des collectivit&#233;s locales pour mieux les prot&#233;ger, les cyclistes, circulant sans protection, restent tr&#232;s vuln&#233;rables. Les accidents, m&#234;me mineurs, une simple chute par exemple, peuvent entra&#238;ner des cons&#233;quences majeures, telles qu&#8217;un traumatisme cr&#226;nien.<br />&#160;<br />&#160;<br />En 2016, ce n&#8217;est pas moins de 4400 accidents de v&#233;lo qui ont &#233;t&#233; recens&#233;s causant la mort de 162 cyclistes.<br />Ces chiffres ne cessent d&#8217;augmenter Le deuxi&#232;me trimestre 2017 est le plus meurtrier enregistr&#233; pour les amateurs de v&#233;lo depuis sept ans. 65 cyclistes sont morts au cours des trois mois d'avril, de mai et de juin 2017, contre 40 en 2016 ou encore 39 en 2010.<br />&#160;<br />Les accidents en v&#233;lo sont en effet particuli&#232;rement dangereux.<br />Le risque d&#8217;&#234;tre tu&#233; par heure pass&#233;e sur la route est trois fois plus important pour un cycliste que pour un automobiliste.<br />Celui d&#8217;&#234;tre gravement bless&#233; est 16 fois plus &#233;lev&#233;.<br />Selon plusieurs &#233;tudes r&#233;centes sur le sujet, le port du casque r&#233;duit les risques de blessures graves &#224; la t&#234;te,&#160; risques de traumatisme cr&#226;nien entra&#238;nant la mort de presque 70 % et de 65 %.<br />&#160;<br />Le l&#233;gislateur veut encourager le d&#233;veloppement de mobilit&#233;s propres pour r&#233;duire l&#8217;utilisation de la voiture en particulier le cyclisme avec des mesures incitatives et un ambitieux plan v&#233;lo. Nos concitoyens ont bien compris l&#8217;int&#233;r&#234;t du message et l&#8217;on constate un v&#233;ritable engouement pour le v&#233;lo.<br />Aujourd&#8217;hui l&#233;gislateur a la responsabilit&#233; de renforcer la l&#233;gislation pour garantir la s&#233;curit&#233; de modes de d&#233;placement qu&#8217;il encourage activement.<br />Cette l&#233;gislation doit donc s&#8217;adapter rapidement aux nouveaux usages .<br />&#160;<br />Cet amendement vise de ce fait &#224; renforcer la s&#233;curit&#233; des cyclistes en &#233;largissement le port du casque obligatoire &#224; tous les cyclistes.<br />&#160;</p>"
  },
  "representations": [
    {
      "nom": "PDF",
      "typeMime": {
        "type": "application",
        "subType": "PDF"
      },
      "statutRepresentation": {
        "verbatim": true,
        "canonique": true,
        "officielle": true,
        "transcription": false,
        "enregistrement": false
      },
      "contenu": {
        "documentURI": "/15/amendements/1831/CION-DVP/CD2081.pdf"
      }
    }
  ],
  "dateDepot": "2019-05-09T02:00:00.000+02:00",
  "dateDistribution": "2019-05-14T02:00:00.000+02:00",
  "article99": "0",
  "loiReference": {}
}