{
  "uid": "AMANR5L15SEA717460BTC1019P0D1N1902",
  "identifiant": {
    "legislature": "15",
    "numero": "1902",
    "numRect": "0",
    "saisine": {
      "texteLegislatifRef": "PRJLANR5L15BTC1019",
      "numeroPartiePLF": "0",
      "organeExamen": "PO717460",
      "mentionSecondeDeliberation": "1"
    }
  },
  "numeroLong": "1902",
  "etapeTexte": "1ère lecture (1ère assemblée saisie)",
  "triAmendement": "au",
  "cardinaliteAmdtMultiples": "1",
  "etat": "Discuté",
  "signataires": {
    "auteur": {
      "typeAuteur": "Depute",
      "acteurRef": "PA720422",
      "groupePolitiqueRef": "PO730958"
    },
    "cosignatairesRefs": [
      "PA720422",
      "PA721226",
      "PA720846",
      "PA721210",
      "PA2150",
      "PA721202",
      "PA720286",
      "PA720430",
      "PA718860",
      "PA722142",
      "PA719676",
      "PA721062",
      "PA720892",
      "PA588884",
      "PA719578",
      "PA718868",
      "PA721960"
    ],
    "texteAffichable": "M.&#160;Quatennens,  M.&#160;Bernalicis, Mme&#160;Autain, Mme&#160;Taurine, M.&#160;Ruffin, Mme&#160;Rubin, Mme&#160;Obono, M.&#160;M&#233;lenchon, M.&#160;Larive, Mme&#160;Panot, Mme&#160;Ressiguier, M.&#160;Prud&apos;homme, M.&#160;Ratenon, M.&#160;Coquerel, M.&#160;Corbi&#232;re, M.&#160;Lachaud et Mme&#160;Fiat"
  },
  "pointeurFragmentTexte": {
    "division": {
      "titre": "Article 34",
      "articleDesignationCourte": "ART. 34",
      "type": "ARTICLE",
      "avantAApres": "A",
      "divisionRattachee": "ARTICLE 34",
      "urlDivisionTexteVise": "/15/textes/1019.asp#D_Article_34"
    }
  },
  "corps": {
    "dispositif": "<p style=\"text-align: justify;\">Supprimer cet article.</p>",
    "exposeSommaire": "<p style=\"text-align: justify;\">Inutile d&#8217;ajouter du stress et de la culpabilit&#233; &#224; priv&#233;s d&#8217;emploi dont les moyens de subsistance sont suffisamment remis en cause par les d&#233;cisions de ce gouvernement.</p><p style=\"text-align: justify;\">De nombreux conseillers de P&#244;le Emploi demandent d&#8217;ores et d&#233;j&#224; aux demandeurs d&#8217;emploi qu&#8217;ils accompagnent de r&#233;aliser un &#233;tat d&#8217;avancement de leur recherche d&#8217;emploi. Cela leur permet en effet de m&#251;rir leurs projets professionnels. Mais dans certains cas, cet &#233;tat d&#8217;avancement n&#8217;est pas adapt&#233;. Fracture num&#233;rique, illettrisme, priorit&#233;s autres que la recherche d&#8217;emploi (recherche d&#8217;une situation plus stable pour pouvoir proc&#233;der ensuite &#224; des recherches efficaces)... les conseillers s&#8217;adaptent &#224; la grande diversit&#233; des situations qu&#8217;ils rencontrent.</p><p style=\"text-align: justify;\">Selon les chiffres de P&#244;le Emploi, 86&#160;% des priv&#233;s d&#8217;emploi r&#233;pondent d&#233;j&#224; aux obligations qui sont les leurs.</p><p style=\"text-align: justify;\">Obliger les demandeurs d&#8217;emploi &#224; r&#233;aliser ce suivi est non seulement un non-sens et un m&#233;pris de leurs comp&#233;tences, mais en plus, conditionner le maintien sur la liste des demandeurs d&#8217;emploi &#224; la bonne tenue de ce &#171;&#160;journal de bord&#160;&#187; est une insulte &#224; tous les demandeurs d&#8217;emploi qui sont d&#233;j&#224; assaillis par les contraintes administrative. Que de temps perdu &#224; ne pas pouvoir proc&#233;der &#224; ces recherches ou r&#233;fl&#233;chir &#224; son parcours professionnel.</p><p style=\"text-align: justify;\">Les auteurs de l&#8217;amendement s&#8217;opposent donc &#224; cet article et en demandent la suppression.</p>"
  },
  "representations": [
    {
      "nom": "PDF",
      "typeMime": {
        "type": "application",
        "subType": "PDF"
      },
      "statutRepresentation": {
        "verbatim": true,
        "canonique": true,
        "officielle": true,
        "transcription": false,
        "enregistrement": false
      },
      "contenu": {
        "documentURI": "/15/amendements/1019/AN/1902.pdf"
      }
    }
  ],
  "seanceDiscussion": "RUANR5L15S2018IDS21106",
  "sort": {
    "dateSaisie": "2018-06-15T23:51:55.000+02:00",
    "sortEnSeance": "Rejeté"
  },
  "dateDepot": "2018-06-07T02:00:00.000+02:00",
  "dateDistribution": "2018-06-12T02:00:00.000+02:00",
  "article99": "0",
  "loiReference": {}
}