{
  "uid": "AMANR5L15PO59048B2272P2D1N1076",
  "identifiant": {
    "legislature": "15",
    "numero": "1076",
    "numRect": "0",
    "saisine": {
      "texteLegislatifRef": "PRJLANR5L15B2272",
      "numeroPartiePLF": "2",
      "organeExamen": "PO59048",
      "mentionSecondeDeliberation": "0"
    }
  },
  "numeroLong": "II-CF1076",
  "etapeTexte": "1ère lecture (1ère assemblée saisie)",
  "triAmendement": "foaaaaaaaaaaaaaaaaaaaaaaaaaaaaaaaaaaaaaaaaaaaaaaaae",
  "cardinaliteAmdtMultiples": "1",
  "etat": "Irrecevable",
  "signataires": {
    "auteur": {
      "typeAuteur": "Depute",
      "acteurRef": "PA1874",
      "groupePolitiqueRef": "PO730934"
    },
    "cosignatairesRefs": [
      "PA334654",
      "PA330909",
      "PA721474",
      "PA2377",
      "PA267794",
      "PA267429",
      "PA642847",
      "PA346218",
      "PA332523",
      "PA608416",
      "PA2492",
      "PA1874",
      "PA719318",
      "PA605036",
      "PA998",
      "PA709315",
      "PA718884",
      "PA267204",
      "PA722390",
      "PA266776",
      "PA718838",
      "PA720684"
    ],
    "texteAffichable": "M.&#160;Le Fur,  M.&#160;Abad, Mme&#160;Anthoine, M.&#160;Bazin, Mme&#160;Bazin-Malgras, M.&#160;Brun, M.&#160;Cinieri, Mme&#160;Corneloup, Mme&#160;Dalloz, M.&#160;Dassault, M.&#160;Descoeur, M.&#160;Pierre-Henri&#160;Dumont, M.&#160;Hetzel, M.&#160;Masson, M.&#160;Perrut, M.&#160;Quentin, M.&#160;Reiss, M.&#160;Sermier, M.&#160;Straumann, Mme&#160;Tabarot, M.&#160;Viala et M.&#160;Viry"
  },
  "pointeurFragmentTexte": {
    "division": {
      "titre": "Article 52",
      "articleDesignationCourte": "AVANT ART. 52",
      "type": "ARTICLE",
      "avantAApres": "Avant",
      "divisionRattachee": "AVANT L'ARTICLE 52, insérer l'article suivant:",
      "articleAdditionnel": "1",
      "urlDivisionTexteVise": "/15/textes/2272C.asp#D_Article_52"
    }
  },
  "corps": {},
  "representations": [
    {
      "nom": "PDF",
      "typeMime": {
        "type": "application",
        "subType": "PDF"
      },
      "statutRepresentation": {
        "verbatim": true,
        "canonique": true,
        "officielle": true,
        "transcription": false,
        "enregistrement": false
      },
      "contenu": {
        "documentURI": "/15/amendements/2272C/CION_FIN/CF1076.pdf"
      }
    }
  ],
  "dateDepot": "2019-10-30T01:00:00.000+01:00",
  "dateDistribution": "2019-11-03T01:00:00.000+01:00",
  "article99": "0",
  "loiReference": {
    "codeLoi": "xx loi 2018-1317",
    "divisionCodeLoi": "141"
  }
}