{
  "uid": "AMANR5L15PO420120B2296P0D1N629",
  "identifiant": {
    "legislature": "15",
    "numero": "629",
    "numRect": "0",
    "saisine": {
      "texteLegislatifRef": "PRJLANR5L15B2296",
      "numeroPartiePLF": "0",
      "organeExamen": "PO420120",
      "mentionSecondeDeliberation": "0"
    }
  },
  "numeroLong": "AS629",
  "etapeTexte": "1ère lecture (1ère assemblée saisie)",
  "triAmendement": "ecaaaaaaaaaaaaaaaaaaaaaaaaaaaaaaaaaaaaaaaaaaaaaaaaeo",
  "cardinaliteAmdtMultiples": "1",
  "etat": "Retiré",
  "signataires": {
    "auteur": {
      "typeAuteur": "Depute",
      "acteurRef": "PA606712",
      "groupePolitiqueRef": "PO730934"
    },
    "cosignatairesRefs": [
      "PA606712",
      "PA334654",
      "PA267260",
      "PA720630",
      "PA722390",
      "PA712015",
      "PA718838",
      "PA2377",
      "PA267318",
      "PA336316",
      "PA709315",
      "PA267785",
      "PA721678",
      "PA1874",
      "PA721286"
    ],
    "texteAffichable": "M.&#160;Lurton,  M.&#160;Larriv&#233;, M.&#160;Minot, M.&#160;Perrut, Mme&#160;Poletti, M.&#160;Viala, M.&#160;Bouchet, M.&#160;Dive, Mme&#160;Corneloup, M.&#160;Grelier, M.&#160;Le Fur, M.&#160;Ramadier, M.&#160;Reda, M.&#160;Brun et M.&#160;Straumann"
  },
  "pointeurFragmentTexte": {
    "division": {
      "titre": "Article 29",
      "articleDesignationCourte": "ART. 29",
      "type": "ARTICLE",
      "avantAApres": "A",
      "divisionRattachee": "ARTICLE 29",
      "urlDivisionTexteVise": "/15/textes/2296.asp#D_Article_29"
    },
    "alinea": {
      "avantAApres": "Apres",
      "numero": "22"
    }
  },
  "corps": {},
  "representations": [
    {
      "nom": "PDF",
      "typeMime": {
        "type": "application",
        "subType": "PDF"
      },
      "statutRepresentation": {
        "verbatim": true,
        "canonique": true,
        "officielle": true,
        "transcription": false,
        "enregistrement": false
      },
      "contenu": {
        "documentURI": "/15/amendements/2296/CION-SOC/AS629.pdf"
      }
    }
  ],
  "dateDepot": "2019-10-11T02:00:00.000+02:00",
  "dateDistribution": "2019-10-12T02:00:00.000+02:00",
  "article99": "0",
  "loiReference": {}
}