{
  "uid": "AMANR5L15PO59048B0499P0D1N38",
  "identifiant": {
    "legislature": "15",
    "numero": "38",
    "numRect": "0",
    "saisine": {
      "texteLegislatifRef": "PRJLANR5L15B0499",
      "numeroPartiePLF": "0",
      "organeExamen": "PO59048",
      "mentionSecondeDeliberation": "0"
    }
  },
  "numeroLong": "CF38",
  "etapeTexte": "Nouvelle Lecture",
  "triAmendement": "l",
  "cardinaliteAmdtMultiples": "1",
  "etat": "Discuté",
  "signataires": {
    "auteur": {
      "typeAuteur": "Depute",
      "acteurRef": "PA405480",
      "groupePolitiqueRef": "PO730946"
    },
    "cosignatairesRefs": [
      "PA588886",
      "PA429893",
      "PA1198",
      "PA643145",
      "PA508",
      "PA609590",
      "PA405480",
      "PA333285",
      "PA337483",
      "PA1008",
      "PA267233",
      "PA642764",
      "PA719930",
      "PA608695",
      "PA610681",
      "PA335532",
      "PA607553",
      "PA605069",
      "PA335054",
      "PA609332",
      "PA333818",
      "PA608011",
      "PA342415",
      "PA332614",
      "PA1809",
      "PA1592",
      "PA340343",
      "PA608172",
      "PA335999",
      "PA720988"
    ],
    "texteAffichable": "M.&#160;Pupponi,  Mme&#160;Rabault, Mme&#160;Pires Beaune, M.&#160;Jean-Louis&#160;Bricout, M.&#160;Aviragnet, Mme&#160;Bareigts, Mme&#160;Batho, Mme&#160;Battistel, Mme&#160;Bi&#233;mouret, M.&#160;Bouillon, M.&#160;Carvounas, M.&#160;Alain&#160;David, Mme&#160;Laurence&#160;Dumont, M.&#160;Faure, M.&#160;Garot, M.&#160;David&#160;Habib, M.&#160;Hutin, M.&#160;Juanico, Mme&#160;Karamanli, M.&#160;J&#233;r&#244;me&#160;Lambert, M.&#160;Le Foll, M.&#160;Letchimy, Mme&#160;Manin, Mme&#160;Pau-Langevin, M.&#160;Potier, M.&#160;Pueyo, M.&#160;Saulignac, Mme&#160;Untermaier, Mme&#160;Vainqueur-Christophe et M.&#160;Vallaud"
  },
  "pointeurFragmentTexte": {
    "division": {
      "titre": "Article 17 ter A",
      "articleDesignationCourte": "ART. 17 TER A",
      "type": "ARTICLE",
      "avantAApres": "A",
      "divisionRattachee": "ARTICLE 17 TER A",
      "urlDivisionTexteVise": "/15/textes/0499.asp#D_Article_17_ter_A"
    }
  },
  "corps": {
    "dispositif": "<p style=\"text-align: justify;\">Supprimer cet article.</p><p style=\"text-align: justify;\">&#160;</p>",
    "exposeSommaire": "<p style=\"text-align: justify;\">Si l&#8217;esprit de la disposition introduite par les s&#233;nateurs peut &#234;tre louable, elle pose &#224; nouveau le probl&#232;me fondamental de la quasi non-compensation des exon&#233;rations de TFPB par l&#8217;&#201;tat aux collectivit&#233;s territoriales.</p><p style=\"text-align: justify;\">Le rapport transmis &#224; la Commission des finances mi-d&#233;cembre et d&#233;taillant ce co&#251;t, d&#233;montre la charge cons&#233;quente support&#233;e par les communes et en particulier par celles disposant du plus grand nombre de logements sociaux et de structures de ce type.</p><p style=\"text-align: justify;\">Afin de ne pas p&#233;naliser plus encore ces communes, le pr&#233;sent amendement propose de supprimer cet article.</p>"
  },
  "representations": [
    {
      "nom": "PDF",
      "typeMime": {
        "type": "application",
        "subType": "PDF"
      },
      "statutRepresentation": {
        "verbatim": true,
        "canonique": true,
        "officielle": true,
        "transcription": false,
        "enregistrement": false
      },
      "contenu": {
        "documentURI": "/15/amendements/0499/CION_FIN/CF38.pdf"
      }
    }
  ],
  "sort": {
    "dateSaisie": "2017-12-18T17:25:22.000+01:00",
    "sortEnSeance": "Adopté"
  },
  "dateDepot": "2017-12-18T01:00:00.000+01:00",
  "dateDistribution": "2017-12-18T01:00:00.000+01:00",
  "article99": "0",
  "loiReference": {}
}