{
  "uid": "AMANR5L15SEA717460BTC0857P0D1N506",
  "identifiant": {
    "legislature": "15",
    "numero": "506",
    "numRect": "0",
    "saisine": {
      "texteLegislatifRef": "PRJLANR5L15BTC0857",
      "numeroPartiePLF": "0",
      "organeExamen": "PO717460",
      "mentionSecondeDeliberation": "0"
    }
  },
  "numeroLong": "506",
  "etapeTexte": "1ère lecture (1ère assemblée saisie)",
  "triAmendement": "cubs",
  "cardinaliteAmdtMultiples": "1",
  "etat": "Discuté",
  "signataires": {
    "auteur": {
      "typeAuteur": "Depute",
      "acteurRef": "PA330240",
      "groupePolitiqueRef": "PO730934"
    },
    "cosignatairesRefs": [
      "PA718838",
      "PA720100",
      "PA330684",
      "PA606098",
      "PA746",
      "PA767",
      "PA345722",
      "PA267378",
      "PA720644",
      "PA267450",
      "PA609726",
      "PA266776",
      "PA721506",
      "PA856",
      "PA721678",
      "PA643103",
      "PA721816",
      "PA334843",
      "PA267260",
      "PA720684",
      "PA330909",
      "PA267200",
      "PA332523",
      "PA642847",
      "PA1874",
      "PA2377",
      "PA267318",
      "PA608416",
      "PA266774",
      "PA342935",
      "PA267440",
      "PA267289",
      "PA2155",
      "PA334149",
      "PA998",
      "PA719946",
      "PA334654",
      "PA923",
      "PA719318",
      "PA266797",
      "PA346218",
      "PA606712",
      "PA1498",
      "PA2960",
      "PA712015",
      "PA721046",
      "PA267527",
      "PA720586",
      "PA330008",
      "PA2492",
      "PA2086",
      "PA340853",
      "PA608826",
      "PA605036",
      "PA266808",
      "PA346054",
      "PA722390",
      "PA721286",
      "PA721314",
      "PA720386",
      "PA267735",
      "PA223837",
      "PA267901",
      "PA720630",
      "PA718884",
      "PA267785",
      "PA643134",
      "PA1029",
      "PA721474",
      "PA266793",
      "PA330240",
      "PA713448",
      "PA1695",
      "PA721126",
      "PA609245",
      "PA721070",
      "PA721054",
      "PA2529",
      "PA709315",
      "PA1327",
      "PA1012",
      "PA2796",
      "PA718784",
      "PA605991",
      "PA1630",
      "PA608016",
      "PA721410",
      "PA336316",
      "PA267429",
      "PA267204",
      "PA748954",
      "PA267794",
      "PA718850",
      "PA330788",
      "PA2792",
      "PA267324",
      "PA721968",
      "PA721636",
      "PA719272",
      "PA720210",
      "PA718780",
      "PA607090"
    ],
    "texteAffichable": "M.&#160;Ciotti,  M.&#160;Jacob, M.&#160;Abad, Mme&#160;Anthoine, M.&#160;Aubert, Mme&#160;Bassire, M.&#160;Bazin, Mme&#160;Bazin-Malgras, Mme&#160;Beauvais, Mme&#160;Bonnivard, M.&#160;Bony, M.&#160;Boucard, M.&#160;Bouchet, Mme&#160;Val&#233;rie&#160;Boyer, Mme&#160;Brenier, M.&#160;Breton, M.&#160;Brochand, M.&#160;Brun, M.&#160;Carrez, M.&#160;Cattin, M.&#160;Cherpion, M.&#160;Cinieri, M.&#160;Cordier, Mme&#160;Corneloup, M.&#160;Cornut-Gentille, Mme&#160;Dalloz, M.&#160;Dassault, M.&#160;de Ganay, M.&#160;de la Verpilli&#232;re, M.&#160;Deflesselles, M.&#160;R&#233;mi&#160;Delatte, M.&#160;Descoeur, M.&#160;Di Filippo, M.&#160;Diard, M.&#160;Dive, M.&#160;Door, Mme&#160;Marianne&#160;Dubois, Mme&#160;Duby-Muller, M.&#160;Pierre-Henri&#160;Dumont, M.&#160;Fasquelle, M.&#160;Ferrara, M.&#160;Forissier, M.&#160;Furst, M.&#160;Gaultier, Mme&#160;Genevard, M.&#160;Goasguen, M.&#160;Gosselin, M.&#160;Grelier, Mme&#160;Guion-Firmin, M.&#160;Herbillon, M.&#160;Hetzel, M.&#160;Huyghe, M.&#160;Kamardine, Mme&#160;Kuster, Mme&#160;Lacroute, M.&#160;Larriv&#233;, M.&#160;Le Fur, Mme&#160;Le Grip, M.&#160;Leclerc, Mme&#160;Levy, M.&#160;Lorion, Mme&#160;Louwagie, M.&#160;Lurton, M.&#160;Emmanuel&#160;Maquet, M.&#160;Marleix, M.&#160;Marlin, M.&#160;Masson, M.&#160;Menuel, Mme&#160;Meunier, M.&#160;Minot, M.&#160;Nury, M.&#160;Parigi, M.&#160;Pauget, M.&#160;Peltier, M.&#160;Perrut, Mme&#160;Poletti, M.&#160;Pradi&#233;, M.&#160;Quentin, M.&#160;Ramadier, Mme&#160;Ramassamy, M.&#160;Reda, M.&#160;Reiss, M.&#160;Reitzer, M.&#160;Reyn&#232;s, M.&#160;Rolland, M.&#160;Saddier, M.&#160;Savignat, M.&#160;Schellenberger, M.&#160;Sermier, M.&#160;Straumann, Mme&#160;Tabarot, M.&#160;Taugourdeau, M.&#160;Teissier, Mme&#160;Trastour-Isnart, Mme&#160;Valentin, M.&#160;Vatin, M.&#160;Verch&#232;re, M.&#160;Viala, M.&#160;Vialay, M.&#160;Jean-Pierre&#160;Vigier, M.&#160;Viry et M.&#160;Woerth"
  },
  "pointeurFragmentTexte": {
    "division": {
      "titre": "Article 11",
      "articleDesignationCourte": "ART. 11",
      "type": "ARTICLE",
      "avantAApres": "A",
      "divisionRattachee": "ARTICLE 11",
      "urlDivisionTexteVise": "/15/textes/0857.asp#D_Article_11"
    },
    "alinea": {
      "avantAApres": "Apres",
      "numero": "12"
    }
  },
  "corps": {
    "dispositif": "<p style=\"text-align: justify;\">Apr&#232;s l&#8217;alin&#233;a&#160;12, ins&#233;rer l&#8217;alin&#233;a suivant&#160;:</p><p style=\"text-align: justify;\">&#171;&#160;<i>aa)</i> Au premier alin&#233;a, le mot&#160;: &#171;&#160;trois&#160;&#187; est remplac&#233; par le mot&#160;: &#171;&#160;dix&#160;&#187;.&#160;&#187;</p>",
    "exposeSommaire": "<p style=\"text-align: justify;\">L&#8217;article&#160;511&#8209;1 du Ceseda pr&#233;voit que l&#8217;autorit&#233; administrative peut assortir l&#8217;obligation de quitter le territoire fran&#231;ais d&#8217;une interdiction de retour sur le territoire fran&#231;ais, d&#8217;une dur&#233;e maximale de trois ans.</p><p style=\"text-align: justify;\">Ce d&#233;lai de trois ans maximum apparait insuffisant au regard des objectifs poursuivis, le pr&#233;sent amendement propose de le porter &#224; 10 ans maximum.</p><p style=\"text-align: justify;\">Cet amendement se justifie d&#8217;autant plus que des circonstances humanitaires peuvent permettre &#224; l&#8217;autorit&#233; administrative de ne pas prononcer d&#8217;interdiction de retour.</p>"
  },
  "representations": [
    {
      "nom": "PDF",
      "typeMime": {
        "type": "application",
        "subType": "PDF"
      },
      "statutRepresentation": {
        "verbatim": true,
        "canonique": true,
        "officielle": true,
        "transcription": false,
        "enregistrement": false
      },
      "contenu": {
        "documentURI": "/15/amendements/0857/AN/506.pdf"
      }
    }
  ],
  "seanceDiscussion": "RUANR5L15S2018IDS21026",
  "sort": {
    "dateSaisie": "2018-04-21T00:24:40.000+02:00",
    "sortEnSeance": "Rejeté"
  },
  "dateDepot": "2018-04-12T02:00:00.000+02:00",
  "dateDistribution": "2018-04-16T02:00:00.000+02:00",
  "article99": "0",
  "loiReference": {}
}