{
  "uid": "AMANR5L15PO59048B1255P1D1N392",
  "identifiant": {
    "legislature": "15",
    "numero": "392",
    "numRect": "0",
    "saisine": {
      "texteLegislatifRef": "PRJLANR5L15B1255",
      "numeroPartiePLF": "1",
      "organeExamen": "PO59048",
      "mentionSecondeDeliberation": "0"
    }
  },
  "numeroLong": "I-CF392",
  "etapeTexte": "1ère lecture (1ère assemblée saisie)",
  "triAmendement": "dsaaaaaaaaaaaaaaaaaaaaaaaaaaaaaaaaaaaaaaaaaaaaaaaaadvtb",
  "cardinaliteAmdtMultiples": "1",
  "etat": "Discuté",
  "signataires": {
    "auteur": {
      "typeAuteur": "Rapporteur",
      "acteurRef": "PA721600",
      "organeRef": "PO419865",
      "groupePolitiqueRef": "PO730964"
    },
    "cosignatairesRefs": [
      "PA722000",
      "PA720054",
      "PA721426",
      "PA720538",
      "PA719092",
      "PA718962",
      "PA609520",
      "PA719972",
      "PA720278",
      "PA719080",
      "PA720944",
      "PA722336",
      "PA721600",
      "PA722366"
    ],
    "texteAffichable": "Mme&#160;Rossi, rapporteure pour avis au nom de la commission du d&#233;veloppement durable et de l&apos;am&#233;nagement du territoire,  M.&#160;Orphelin, M.&#160;Buchou, M.&#160;Fugit, M.&#160;Haury, Mme&#160;Marsaud, Mme&#160;Park, Mme&#160;Pompili, Mme&#160;Riotton, Mme&#160;Sarles, M.&#160;Thi&#233;baut, Mme&#160;Tuffnell, Mme&#160;De Temmerman et M.&#160;Zulesi"
  },
  "pointeurFragmentTexte": {
    "division": {
      "titre": "Article 16",
      "articleDesignationCourte": "APRÈS ART. 16",
      "type": "ARTICLE",
      "avantAApres": "Apres",
      "divisionRattachee": "APRÈS L'ARTICLE 16, insérer l'article suivant:",
      "articleAdditionnel": "1",
      "urlDivisionTexteVise": "/15/textes/1255A.asp#D_Article_16"
    }
  },
  "corps": {
    "dispositif": "<p style=\"text-align: justify;\">I.&#160;&#8211;&#160;Le code g&#233;n&#233;ral des imp&#244;ts est ainsi modifi&#233;&#160;:</p><p style=\"text-align: justify;\">1&#176;&#160;La section V du chapitre II <i>bis</i> du titre IV de la premi&#232;re partie du livre I<sup>er</sup> est compl&#233;t&#233;e par un article 976 <i>bis</i> ainsi r&#233;dig&#233;&#160;:</p><p style=\"text-align: justify;\">&#171;&#160;<i>Art.&#160;976</i>&#160;bis.&#160;&#8211;&#160;Est exon&#233;r&#233; le foncier non b&#226;ti.&#160;&#187; ;</p><p style=\"text-align: justify;\">2&#176;&#160;Au premier alin&#233;a de l&#8217;article&#160;979, apr&#232;s le mot&#160;: &#171;&#160;que&#160;&#187;, ins&#233;rer&#160;les mots&#160;: &#171;&#160;des revenus fonciers ruraux et&#160;&#187;.</p><p style=\"text-align: justify;\">II.&#160;&#8211;&#160;La perte de recettes pour l&#8217;&#201;tat r&#233;sultant de l&#8217;instauration de ces exon&#233;rations est compens&#233;e &#224; due concurrence par la cr&#233;ation d&#8217;une taxe additionnelle aux droits pr&#233;vus aux articles 575 et 575 A du code g&#233;n&#233;ral des imp&#244;ts.</p>",
    "exposeSommaire": "<p style=\"text-align: justify;\">Le pr&#233;sent amendement vise &#224; supprimer l&#8217;IFI sur le foncier non-b&#226;ti, dans une logique de lutte contre l&#8217;artificialisation des sols.&#160;Pour rappel, l&#8217;ISF a &#233;t&#233; supprim&#233; dans la LFI pour 2018 et un nouvel imp&#244;t, l&#8217;IFI, a &#233;t&#233; cr&#233;&#233; dans cette m&#234;me loi. Il est codifi&#233; &#224; l&#8217;article&#160;964 du CGI. Selon les estimations issues du PLF, il rapportera 1,53 Md&#8364; en 2019.</p><p style=\"text-align: justify;\">Le foncier rural, type de bien dont le rendement est le plus faible, b&#233;n&#233;ficiait, jusqu&#8217;ici, d&#8217;un taux d&#8217;imposition &#224; l&#8217;ISF inferieur aux autres biens (application des taux de l&#8217;ISF sur 25&#160;% de la valeur pour certains bois et for&#234;ts et sur 50&#160;% de la valeur pour les terres agricoles donn&#233;es &#224; bail &#224; long terme (sauf 25&#160;% sur les 100&#160;000 premiers&#160;euros)).</p><p style=\"text-align: justify;\">Le Conseil constitutionnel a toujours justifi&#233; ce r&#233;gime particulier par&#160;la faible rentabilit&#233; et la faible liquidit&#233; de ce type de biens. Il a indiqu&#233; express&#233;ment que les dispositions de l&#8217;article&#160;885 H du CGI &#171;&#160;instituent des exon&#233;rations partielles sur la valeur de certains biens ruraux au titre de l&#8217;assujettissement &#224; l&#8217;ISF, afin d&#8217;inciter &#224; l&#8217;acquisition et &#224; la d&#233;tention de ce type de biens&#160;&#187; (Conseil constitutionnel, D&#233;cision n&#176; 2014&#8209;707 DC du 29 d&#233;cembre 2014). Le r&#233;gime de l&#8217;IFI, institu&#233; par la LFI pour 2018 ne permet plus &#171;&#160;d&#8217;inciter &#224; l&#8217;acquisition et &#224; la d&#233;tention de ce type de biens&#160;&#187;. Au contraire, il les p&#233;nalise puisqu&#8217;il conserve un assujettissement &#224; l&#8217;IFI de ces biens, alors qu&#8217;il en exon&#232;re la quasi-totalit&#233; des autres. Pour conserver une incitation &#171;&#160;&#224; l&#8217;acquisition et &#224; la d&#233;tention de ce type de biens&#160;&#187; comme l&#8217;avait d&#233;cid&#233; le l&#233;gislateur et pleinement justifi&#233; le juge constitutionnel, malgr&#233; leurs loyers administr&#233;s et tr&#232;s bas et les suj&#233;tions exorbitantes du droit commun auquel leur statut soumet le bailleur, le pr&#233;sent amendement propose d&#8217;exon&#233;rer les biens ruraux d&#8217;IFI.</p><p style=\"text-align: justify;\">Force est de constater qu&#8217;aujourd&#8217;hui la taxation globale du foncier non-b&#226;ti est tr&#232;s &#233;lev&#233;e (taxe fonci&#232;re sur les propri&#233;t&#233;s non b&#226;ties (TFNB), taxe pour frais de chambres d&#8217;agriculture, DMTO et droits annexes, plus-values immobili&#232;res, imp&#244;t sur le revenu &#224; un taux progressif, pr&#233;l&#232;vements sociaux et IFI - allant de 0,5 &#224; 1,5&#160;%). La France fait partie d&#8217;un des pays de l&#8217;OCDE o&#249; les imp&#244;ts fonciers sont les plus &#233;lev&#233;s (6&#160;% des pr&#233;l&#232;vements obligatoires, versus 3,3&#160;% dans le reste de l&#8217;OCDE).</p><p style=\"text-align: justify;\">D&#8217;un c&#244;t&#233;, le foncier non b&#226;ti est fortement tax&#233; - rendant sa rentabilit&#233; apr&#232;s imp&#244;ts quasi nulle, voire n&#233;gative (comme d&#233;montr&#233; par le Conseil des imp&#244;ts). De l&#8217;autre, les revenus du patrimoine hors immobilier, donc sous forme de valeurs mobili&#232;res ou encore de parts sociales, ne sont tax&#233;s qu&#8217;&#224; hauteur de 30&#160;%. Cette absence de rentabilit&#233; du foncier non-b&#226;ti et une taxation moindre des actions poussent ses d&#233;tenteurs &#224; l&#8217;artificialisation pour &#233;chapper &#224; ce rendement n&#233;gatif. En effet, si on effectue une comparaison entre les diff&#233;rents types de biens, on remarque que la taxation des terrains agricoles, for&#234;ts et espaces naturels est anormalement &#233;lev&#233;e&#160;:</p><table style=\"width: 586px; height: 123px; border-collapse: collapse;\"><tbody><tr><td style=\"border: 1px solid #000000; width: 110px; white-space: normal;\">Type de biens</td><td style=\"border: 1px solid #000000; width: 110px; text-align: center; white-space: normal;\">Actions entreprise p&#233;troli&#232;re</td><td style=\"border: 1px solid #000000; width: 134.69px; text-align: center; white-space: normal;\">Terrains agricoles</td><td style=\"border: 1px solid #000000; width: 120.3px; text-align: center; white-space: normal;\">For&#234;t</td><td style=\"border: 1px solid #000000; width: 94px; text-align: center; white-space: normal;\">Espace naturel</td></tr><tr><td style=\"border: 1px solid #000000; width: 110px; white-space: normal;\">Rendement annuel r&#233;el avant imp&#244;ts</td><td style=\"border: 1px solid #000000; width: 110px; text-align: center; white-space: normal;\"><br />5%<br />&#160;</td><td style=\"border: 1px solid #000000; width: 134.69px; text-align: center; white-space: normal;\">&amp;lt; 0%</td><td style=\"border: 1px solid #000000; width: 120.3px; text-align: center; white-space: normal;\">&amp;lt; 0%</td><td style=\"border: 1px solid #000000; width: 94px; text-align: center; white-space: normal;\">-</td></tr><tr><td style=\"border: 1px solid #000000; width: 110px; white-space: normal;\">TFNB/ TCA</td><td style=\"border: 1px solid #000000; width: 110px; text-align: center; white-space: normal;\"><p>0</p></td><td style=\"border: 1px solid #000000; width: 134.69px; text-align: center; white-space: normal;\">Oui</td><td style=\"border: 1px solid #000000; width: 120.3px; text-align: center; white-space: normal;\">Oui</td><td style=\"border: 1px solid #000000; width: 94px; text-align: center; white-space: normal;\">Oui</td></tr><tr><td style=\"border: 1px solid #000000; width: 110px; white-space: normal;\">DMTO+ droits annexes</td><td style=\"border: 1px solid #000000; width: 110px; text-align: center; white-space: normal;\">0,30%&#160;</td><td style=\"border: 1px solid #000000; width: 134.69px; text-align: center; white-space: normal;\">8%</td><td style=\"border: 1px solid #000000; width: 120.3px; text-align: center; white-space: normal;\">8%</td><td style=\"border: 1px solid #000000; width: 94px; text-align: center; white-space: normal;\">8%</td></tr><tr><td style=\"border: 1px solid #000000; width: 110px; white-space: normal;\">IFI (2018)</td><td style=\"border: 1px solid #000000; width: 110px; text-align: center; white-space: normal;\"><p>0</p></td><td style=\"border: 1px solid #000000; width: 134.69px; text-align: center; white-space: normal;\">0,5 &#224; 1,5 %</td><td style=\"border: 1px solid #000000; width: 120.3px; text-align: center; white-space: normal;\">0,5 &#224; 1,5 %</td><td style=\"border: 1px solid #000000; width: 94px; text-align: center; white-space: normal;\">0,5 &#224; 1,5 %</td></tr><tr><td style=\"border: 1px solid #000000; width: 110px; white-space: normal;\">Taux d&#8217;imp&#244;t global</td><td style=\"border: 1px solid #000000; width: 110px; text-align: center; white-space: normal;\">30,2 %</td><td style=\"border: 1px solid #000000; width: 134.69px; text-align: center; white-space: normal;\">111 % ou 97,1 %</td><td style=\"border: 1px solid #000000; width: 120.3px; text-align: center; white-space: normal;\">74 % ou 54,5 %</td><td style=\"border: 1px solid #000000; width: 94px; text-align: center; white-space: normal;\">&amp;gt;100 %</td></tr></tbody></table><p style=\"text-align: justify;\">Outre l&#8217;impact sur l&#8217;artificialisation des sols, le pr&#233;sent amendement est aussi un signal positif pour les agriculteurs retrait&#233;s. En effet, la location de la terre pour le fermage leur apporte un revenu compl&#233;mentaire. Or, avec le paiement pour l&#8217;IFI et l&#8217;imp&#244;t sur le loyer de 62,2&#160;%, ce compl&#233;ment devient quasi nul. Les agriculteurs retrait&#233;s dont les retraites sont tr&#232;s faibles conservent souvent la propri&#233;t&#233; des terres agricoles qui leur appartiennent pour s&#8217;assurer un compl&#233;ment de retraite via le fermage. Mais une fois retrait&#233;s, ils perdent le statut d&#8217;exploitant agricole et deviennent donc soumis &#224; la fiscalit&#233; de droit commun (IFI, TFNB, IR, PS). Le revenu net apr&#232;s imp&#244;ts des fermages qu&#8217;ils per&#231;oivent est donc tr&#232;s faible et ne permet pas v&#233;ritablement d&#8217;am&#233;liorer leurs retraites.</p><p style=\"text-align: justify;\">Le pr&#233;sent amendement vise &#233;galement &#224; ce que soient exclus de l&#8217;assiette de l&#8217;IFI pour le calcul du plafonnement les revenus des biens ruraux (sinon, ces revenus ruraux seraient, de fait, tax&#233;s &#224; 75&#160;%, ce qui reviendrait &#224; les conserver soumis &#224; l&#8217;IFI).</p><p style=\"text-align: justify;\">Cette modulation de taux sur crit&#232;re g&#233;ographique r&#233;pond &#224; un crit&#232;re objectif et rationnel correspondant &#224; un objectif d&#8217;int&#233;r&#234;t g&#233;n&#233;ral de lutte contre l&#8217;artificialisation des sols, 65 000 hectares &#233;tant artificialis&#233;s chaque ann&#233;e, et de lutte contre le changement climatique.&#160;</p>"
  },
  "representations": [
    {
      "nom": "PDF",
      "typeMime": {
        "type": "application",
        "subType": "PDF"
      },
      "statutRepresentation": {
        "verbatim": true,
        "canonique": true,
        "officielle": true,
        "transcription": false,
        "enregistrement": false
      },
      "contenu": {
        "documentURI": "/15/amendements/1255A/CION_FIN/CF392.pdf"
      }
    }
  ],
  "sort": {
    "dateSaisie": "2018-10-10T22:19:20.000+02:00",
    "sortEnSeance": "Rejeté"
  },
  "dateDepot": "2018-10-04T02:00:00.000+02:00",
  "dateDistribution": "2018-10-08T02:00:00.000+02:00",
  "article99": "0",
  "loiReference": {
    "codeLoi": "impôts",
    "divisionCodeLoi": "976 bis"
  }
}