{
  "uid": "AMANR5L15SEA717460BTC2243P0D1N2107",
  "identifiant": {
    "legislature": "15",
    "numero": "2107",
    "numRect": "0",
    "saisine": {
      "texteLegislatifRef": "PRJLANR5L15BTC2243",
      "numeroPartiePLF": "0",
      "organeExamen": "PO717460",
      "mentionSecondeDeliberation": "0"
    }
  },
  "numeroLong": "2107",
  "etapeTexte": "1ère lecture (1ère assemblée saisie)",
  "triAmendement": "auaaaaaaaaaaaaaaaaaaaaaaaaaaaaaaaaaaaaaaaaaaaaaaaahtzs",
  "cardinaliteAmdtMultiples": "1",
  "etat": "Discuté",
  "signataires": {
    "auteur": {
      "typeAuteur": "Depute",
      "acteurRef": "PA267901",
      "groupePolitiqueRef": "PO730934"
    },
    "cosignatairesRefs": [
      "PA267901"
    ],
    "texteAffichable": "M.&#160;Kamardine"
  },
  "pointeurFragmentTexte": {
    "division": {
      "titre": "Article 4",
      "articleDesignationCourte": "ART. 4",
      "type": "ARTICLE",
      "avantAApres": "A",
      "divisionRattachee": "ARTICLE 4",
      "urlDivisionTexteVise": "/15/textes/2243.asp#D_Article_4"
    },
    "alinea": {
      "numero": "21"
    }
  },
  "corps": {
    "dispositif": "<p>&#192; l&#8217;alin&#233;a&#160;21, apr&#232;s le mot&#160;:</p><p style=\"text-align: justify;\">&#171;&#160;notaire&#160;&#187;,</p><p style=\"text-align: justify;\">ins&#233;rer les mots&#160;:</p><p style=\"text-align: justify;\">&#171;&#160;ou l&#8217;avocat&#160;&#187;.</p>",
    "exposeSommaire": "<p>Cet amendement pr&#233;voit que le dispositif mis en oeuvre par le nouvel article&#160;342&#8209;11 du code civil puisse &#234;tre re&#231;u, non seulement par un notaire, mais &#233;galement par un avocat sous la forme d&#8217;acte sous seing priv&#233; contresign&#233; par avocat.</p>"
  },
  "representations": [
    {
      "nom": "PDF",
      "typeMime": {
        "type": "application",
        "subType": "PDF"
      },
      "statutRepresentation": {
        "verbatim": true,
        "canonique": true,
        "officielle": true,
        "transcription": false,
        "enregistrement": false
      },
      "contenu": {
        "documentURI": "/15/amendements/2243/AN/2107.pdf"
      }
    }
  ],
  "seanceDiscussion": "RUANR5L15S2020IDS21845",
  "sort": {
    "dateSaisie": "2019-10-03T19:21:57.000+02:00",
    "sortEnSeance": "Non soutenu"
  },
  "dateDepot": "2019-09-20T02:00:00.000+02:00",
  "dateDistribution": "2019-09-25T02:00:00.000+02:00",
  "article99": "0",
  "loiReference": {}
}