{
  "uid": "AMANR5L15SEA717460BTC0971P0D1N2323",
  "identifiant": {
    "legislature": "15",
    "numero": "2323",
    "numRect": "0",
    "saisine": {
      "texteLegislatifRef": "PRJLANR5L15BTC0971",
      "numeroPartiePLF": "0",
      "organeExamen": "PO717460",
      "mentionSecondeDeliberation": "0"
    }
  },
  "numeroLong": "2323",
  "etapeTexte": "1ère lecture (1ère assemblée saisie)",
  "triAmendement": "ii",
  "cardinaliteAmdtMultiples": "1",
  "etat": "Discuté",
  "signataires": {
    "auteur": {
      "typeAuteur": "Depute",
      "acteurRef": "PA720892",
      "groupePolitiqueRef": "PO730958"
    },
    "cosignatairesRefs": [
      "PA720422",
      "PA588884",
      "PA719578",
      "PA721202",
      "PA722142",
      "PA721960",
      "PA720892",
      "PA721062",
      "PA721226",
      "PA719676",
      "PA720846",
      "PA721210",
      "PA720286",
      "PA2150",
      "PA718860",
      "PA720430",
      "PA718868"
    ],
    "texteAffichable": "Mme&#160;Panot,  Mme&#160;Autain, M.&#160;Bernalicis, M.&#160;Coquerel, M.&#160;Corbi&#232;re, Mme&#160;Fiat, M.&#160;Lachaud, M.&#160;Larive, M.&#160;M&#233;lenchon, Mme&#160;Obono, M.&#160;Prud&apos;homme, M.&#160;Quatennens, M.&#160;Ratenon, Mme&#160;Ressiguier, Mme&#160;Rubin, M.&#160;Ruffin et Mme&#160;Taurine"
  },
  "pointeurFragmentTexte": {
    "division": {
      "titre": "Article 48",
      "articleDesignationCourte": "ART. 48",
      "type": "ARTICLE",
      "avantAApres": "A",
      "divisionRattachee": "ARTICLE 48",
      "urlDivisionTexteVise": "/15/textes/0971.asp#D_Article_48"
    },
    "alinea": {
      "avantAApres": "A",
      "numero": "8",
      "alineaDesignation": "Alinéa 8"
    }
  },
  "corps": {
    "dispositif": "<p style=\"text-align: justify;\">Supprimer les alin&#233;as 8 &#224; 10.</p>",
    "exposeSommaire": "<p style=\"text-align: justify;\">Par cet amendement nous souhaitons r&#233;tablir l&#8217;encadrement des loyers pr&#233;vu par la&#160;loi ALUR en 2014. Cet encadrement pr&#233;vu &#224; l&#8217;origine dans une trentaine d&#8217;agglom&#233;rations a &#233;t&#233; r&#233;duit &#224; sa portion congrue par Manuel Valls &#224; son arriv&#233;e &#224; Matignon. Comme le fait le Gouvernement pour enterrer ce dispositif, il l&#8217;a transform&#233; en exp&#233;rimentation &#224; Paris et &#224; Lille. Les arr&#234;t&#233;s pr&#233;fectoraux le mettant en place ont &#233;t&#233; annul&#233;s par la justice car l&#8217;encadrement des loyers se limitait &#224; la municipalit&#233; et non &#224; l&#8217;agglom&#233;ration. L&#8217;encadrement des loyers a donc &#233;t&#233; annul&#233; pour une question de forme juridique et non de fond.</p><p style=\"text-align: justify;\">Cet encadrement des loyers &#233;tait bien timide et ne visait pas &#224; les faire baisser mais seulement &#224; encadrer les exc&#232;s et &#224; enrayer leur&#160;hausse. Ce dispositif &#233;tait n&#233;anmoins un premier pas qui avait le m&#233;rite d&#8217;&#234;tre obligatoire dans l&#8217;ensemble des zones tendues et non exp&#233;rimental. Nous demandons donc que le Gouvernement r&#233;tablisse au moins ce dispositif, ce qui n&#8217;emp&#234;chera pas de l&#8217;&#233;valuer et de le faire &#233;voluer par la suite si n&#233;cessaire.</p>"
  },
  "representations": [
    {
      "nom": "PDF",
      "typeMime": {
        "type": "application",
        "subType": "PDF"
      },
      "statutRepresentation": {
        "verbatim": true,
        "canonique": true,
        "officielle": true,
        "transcription": false,
        "enregistrement": false
      },
      "contenu": {
        "documentURI": "/15/amendements/0971/AN/2323.pdf"
      }
    }
  ],
  "seanceDiscussion": "RUANR5L15S2018IDS21137",
  "sort": {
    "dateSaisie": "2018-06-08T10:17:35.000+02:00",
    "sortEnSeance": "Rejeté"
  },
  "dateDepot": "2018-05-25T02:00:00.000+02:00",
  "dateDistribution": "2018-05-31T02:00:00.000+02:00",
  "article99": "0",
  "loiReference": {}
}