{
  "uid": "AMANR5L15SEA717460BTC1019P0D1N957",
  "identifiant": {
    "legislature": "15",
    "numero": "957",
    "numRect": "0",
    "saisine": {
      "texteLegislatifRef": "PRJLANR5L15BTC1019",
      "numeroPartiePLF": "0",
      "organeExamen": "PO717460",
      "mentionSecondeDeliberation": "1"
    }
  },
  "numeroLong": "957",
  "etapeTexte": "1ère lecture (1ère assemblée saisie)",
  "triAmendement": "acg",
  "cardinaliteAmdtMultiples": "1",
  "etat": "Discuté",
  "signataires": {
    "auteur": {
      "typeAuteur": "Depute",
      "acteurRef": "PA718926",
      "groupePolitiqueRef": "PO730940"
    },
    "cosignatairesRefs": [
      "PA718720",
      "PA721012",
      "PA722202",
      "PA721270",
      "PA267306",
      "PA610667",
      "PA689",
      "PA441",
      "PA720692",
      "PA335612",
      "PA721896",
      "PA721118",
      "PA610654",
      "PA720546",
      "PA718926",
      "PA722110"
    ],
    "texteAffichable": "M.&#160;Dharr&#233;ville,  Mme&#160;Bello, M.&#160;Brotherson, M.&#160;Bruneel, Mme&#160;Buffet, M.&#160;Chassaigne, M.&#160;Dufr&#232;gne, Mme&#160;Faucillon, M.&#160;Jumel, Mme&#160;K&#233;clard-Mond&#233;sir, M.&#160;Lecoq, M.&#160;Nilor, M.&#160;Peu, M.&#160;Fabien&#160;Roussel, M.&#160;Serville et M.&#160;Wulfranc"
  },
  "pointeurFragmentTexte": {
    "division": {
      "titre": "Article 16",
      "articleDesignationCourte": "ART. 16",
      "type": "ARTICLE",
      "avantAApres": "A",
      "divisionRattachee": "ARTICLE 16",
      "urlDivisionTexteVise": "/15/textes/1019.asp#D_Article_16"
    }
  },
  "corps": {
    "dispositif": "<p>Supprimer cet article.</p>",
    "exposeSommaire": "<p style=\"text-align: justify;\">Cet article pr&#233;voit la cr&#233;ation de France Comp&#233;tences en lieu et place des trois instances nationales actuelles (Copanef, Cnefop et Fonds Paritaire de S&#233;curisation des Parcours Professionnels). Il t&#233;moigne de l'esprit de ce projet de loi visant &#224; r&#233;duire le r&#244;le des organisations syndicales dans la gestion de la formation professionnelle.</p><p style=\"text-align: justify;\">Loin de mettre en place un grand service public de la formation, il s'agit en r&#233;alit&#233; d'&#233;tatiser la gouvernance de la formation professionnelle dans une logique de marchandisation de la formation et d'hyper individualisation des droits.</p><p style=\"text-align: justify;\">Nous y sommes oppos&#233;s.</p>"
  },
  "representations": [
    {
      "nom": "PDF",
      "typeMime": {
        "type": "application",
        "subType": "PDF"
      },
      "statutRepresentation": {
        "verbatim": true,
        "canonique": true,
        "officielle": true,
        "transcription": false,
        "enregistrement": false
      },
      "contenu": {
        "documentURI": "/15/amendements/1019/AN/957.pdf"
      }
    }
  ],
  "seanceDiscussion": "RUANR5L15S2018IDS21105",
  "sort": {
    "dateSaisie": "2018-06-15T15:03:59.000+02:00",
    "sortEnSeance": "Rejeté"
  },
  "dateDepot": "2018-06-07T02:00:00.000+02:00",
  "dateDistribution": "2018-06-12T02:00:00.000+02:00",
  "article99": "0",
  "loiReference": {}
}