{
  "uid": "AMANR5L15PO59051B0104P0D1N268",
  "identifiant": {
    "legislature": "15",
    "numero": "268",
    "numRect": "0",
    "saisine": {
      "texteLegislatifRef": "PRJLANR5L15B0104",
      "numeroPartiePLF": "0",
      "organeExamen": "PO59051",
      "mentionSecondeDeliberation": "0"
    }
  },
  "numeroLong": "CL268",
  "etapeTexte": "1ère lecture (2ème assemblée saisie)",
  "triAmendement": "eq",
  "cardinaliteAmdtMultiples": "1",
  "etat": "Retiré",
  "signataires": {
    "auteur": {
      "typeAuteur": "Gouvernement"
    },
    "texteAffichable": "le Gouvernement"
  },
  "pointeurFragmentTexte": {
    "division": {
      "titre": "Article 8",
      "articleDesignationCourte": "ART. 8",
      "type": "ARTICLE",
      "avantAApres": "A",
      "divisionRattachee": "ARTICLE 8",
      "urlDivisionTexteVise": "/15/textes/0104.asp#D_Article_8"
    },
    "alinea": {
      "numero": "14"
    }
  },
  "corps": {
    "dispositif": "<p style=\"text-align: justify;\">&#192; la seconde phrase de l&#8217;alin&#233;a&#160;14, apr&#232;s le mot&#160;:</p><p style=\"text-align: justify;\">&#171;&#160;collect&#233;s&#160;&#187;,</p><p style=\"margin: 0cm 0cm 0pt; text-align: justify; line-height: normal;\">ins&#233;rer les mots&#160;:</p><p style=\"text-align: justify;\">&#171;&#160;qui ont &#233;t&#233; conserv&#233;s&#160;&#187;.</p>",
    "exposeSommaire": "<p style=\"margin: 0cm 0cm 10pt; text-align: justify; line-height: normal;\">Amendement de pr&#233;cision.</p>"
  },
  "representations": [
    {
      "nom": "PDF",
      "typeMime": {
        "type": "application",
        "subType": "PDF"
      },
      "statutRepresentation": {
        "verbatim": true,
        "canonique": true,
        "officielle": true,
        "transcription": false,
        "enregistrement": false
      },
      "contenu": {
        "documentURI": "/15/amendements/0104/CION_LOIS/CL268.pdf"
      }
    }
  ],
  "dateDepot": "2017-09-11T02:00:00.000+02:00",
  "dateDistribution": "2017-09-11T02:00:00.000+02:00",
  "article99": "0",
  "loiReference": {
    "codeLoi": "2"
  }
}