{
  "uid": "AMANR5L15SEA717460BTC1237P0D1N2935",
  "identifiant": {
    "legislature": "15",
    "numero": "2935",
    "numRect": "0",
    "saisine": {
      "texteLegislatifRef": "PRJLANR5L15BTC1237",
      "numeroPartiePLF": "0",
      "organeExamen": "PO717460",
      "mentionSecondeDeliberation": "1"
    }
  },
  "numeroLong": "2935",
  "etapeTexte": "1ère lecture (1ère assemblée saisie)",
  "triAmendement": "ojaaaaaaaaaaaaaaaaaaaaaaaaaaaaaaaaaaaaaaaaaaaaaaaaedc",
  "cardinaliteAmdtMultiples": "1",
  "etat": "Discuté",
  "signataires": {
    "auteur": {
      "typeAuteur": "Depute",
      "acteurRef": "PA607553",
      "groupePolitiqueRef": "PO758835"
    },
    "cosignatairesRefs": [
      "PA340357",
      "PA608011",
      "PA610681",
      "PA337483",
      "PA608695",
      "PA267233",
      "PA1198",
      "PA1592",
      "PA335532",
      "PA609332",
      "PA643145",
      "PA333818",
      "PA719930",
      "PA335054",
      "PA720988",
      "PA340343",
      "PA405480",
      "PA607553",
      "PA605069",
      "PA608172",
      "PA332614",
      "PA342415",
      "PA608741",
      "PA333285",
      "PA609590",
      "PA429893",
      "PA508",
      "PA1008",
      "PA1809",
      "PA642764"
    ],
    "texteAffichable": "M.&#160;Potier,  Mme&#160;Battistel, M.&#160;Juanico, M.&#160;Vallaud, Mme&#160;Rabault, M.&#160;Aviragnet, Mme&#160;Bareigts, Mme&#160;Bi&#233;mouret, M.&#160;Bouillon, M.&#160;Jean-Louis&#160;Bricout, M.&#160;Carvounas, M.&#160;Alain&#160;David, Mme&#160;Laurence&#160;Dumont, M.&#160;Faure, M.&#160;Garot, M.&#160;David&#160;Habib, M.&#160;Hutin, Mme&#160;Karamanli, M.&#160;J&#233;r&#244;me&#160;Lambert, M.&#160;Letchimy, Mme&#160;Manin, Mme&#160;Pau-Langevin, Mme&#160;Pires Beaune, M.&#160;Pueyo, M.&#160;Pupponi, M.&#160;Saulignac, Mme&#160;Tolmont, Mme&#160;Untermaier, Mme&#160;Vainqueur-Christophe et Mme&#160;Victory"
  },
  "pointeurFragmentTexte": {
    "division": {
      "titre": "Article 62 ter",
      "articleDesignationCourte": "ART. 62 TER",
      "type": "ARTICLE",
      "avantAApres": "A",
      "divisionRattachee": "ARTICLE 62 TER",
      "urlDivisionTexteVise": "/15/textes/1237.asp#D_Article_62_ter"
    },
    "alinea": {
      "numero": "3"
    }
  },
  "corps": {
    "dispositif": "<p style=\"text-align: justify;\">Substituer aux alin&#233;as 3 et 4 les neuf alin&#233;as suivants&#160;:</p><p style=\"text-align: justify;\">&#171;&#160;Ce rapport mentionne en troisi&#232;me lieu le niveau de r&#233;mun&#233;ration de chaque mandataire social ainsi que les informations suivantes, dans chaque pays o&#249; l&#8217;entreprise est implant&#233;e&#160;:</p><p style=\"text-align: justify;\">&#171;&#160;1&#176; La r&#233;mun&#233;ration moyenne des salari&#233;s de la soci&#233;t&#233; sur une base &#233;quivalent temps plein&#160;;</p><p style=\"text-align: justify;\">&#171;&#160;2&#176; La r&#233;mun&#233;ration du premier quartile des salari&#233;s de la soci&#233;t&#233; sur une base &#233;quivalent temps plein&#160;;</p><p style=\"text-align: justify;\">&#171;&#160;3&#176; La r&#233;mun&#233;ration m&#233;diane des salari&#233;s de la soci&#233;t&#233; sur une base &#233;quivalent temps plein&#160;;</p><p style=\"text-align: justify;\">&#171;&#160;4&#176; La r&#233;mun&#233;ration du troisi&#232;me quartile de la soci&#233;t&#233; sur une base &#233;quivalent temps plein&#160;;</p><p style=\"text-align: justify;\">&#171;&#160;5&#176; Le ratio entre la r&#233;mun&#233;ration moyenne et la r&#233;mun&#233;ration de chaque mandataire social&#160;et son &#233;volution au cours des cinq exercices les plus r&#233;cents au moins&#160;;</p><p style=\"text-align: justify;\">&#171;&#160;6&#176; Le ratio entre la r&#233;mun&#233;ration m&#233;diane et la r&#233;mun&#233;ration&#160;de chaque mandataire social et son &#233;volution au cours des cinq exercices les plus r&#233;cents au moins&#160;;</p><p style=\"text-align: justify;\">&#171;&#160;7&#176; Une explication de l&#8217;&#233;volution de ces informations.</p><p style=\"text-align: justify;\">&#171;&#160;Ces informations sont pr&#233;sent&#233;es ensemble d&#8217;une mani&#232;re qui permette la comparaison.&#160;&#187;</p>",
    "exposeSommaire": "<p style=\"text-align: justify;\">Dans l'hypoth&#232;se o&#249; l'amendement de r&#233;&#233;criture g&#233;n&#233;rale du groupe Socialistes et apparent&#233;s serait rejet&#233;, le pr&#233;sent amendement a pour but de pr&#233;ciser les informations publi&#233;es dans le cadre du rapport d&#8217;&#233;quit&#233; afin de demander une publication des &#233;carts de salaires par quartiles dans chaque pays o&#249; l&#8217;entreprise vis&#233;e est implant&#233;e. La seule divulgation du salaire moyen et m&#233;dian ne permet pas de comprendre la distribution des salaires au sein d&#8217;une entreprise et de savoir si ce sont les tr&#232;s hauts salaires qui augmentent, les hauts salaires, les bas salaires o&#249; les tr&#232;s bas salaires. Les ONG et notamment Oxfam qui ont beaucoup travaill&#233; sur cette question nous confirment que les r&#233;dactions propos&#233;es par les amendements du gouvernement et de M. Orphelin sont inop&#233;rantes et ne permettront pas une transparence effective.</p><p style=\"text-align: justify;\">Alors que le gouvernement conservateur de Theresa May vient de voter une mesure de transparence sur les &#233;carts de salaires par quartile avec le soutien de l&#8217;opposition, l&#8217;&#233;tude d&#8217;impact du projet a &#233;valu&#233; que la mise en place d&#8217;une telle publication aurait des impacts minimes pour les entreprises. Les repr&#233;sentants d&#8217;organisations patronales et d&#8217;investisseurs ont ouvertement soutenu la mesure.</p><p style=\"text-align: justify;\">Par ailleurs, la pr&#233;sentation d&#8217;informations agr&#233;g&#233;es au niveau de l&#8217;entreprise p&#233;naliserait les entreprises op&#233;rant dans des pays &#224; faible niveau de r&#233;mun&#233;ration. Une pr&#233;sentation des &#233;carts par pays permet d&#8217;adapter l&#8217;information au niveau de vie du pays.</p>"
  },
  "representations": [
    {
      "nom": "PDF",
      "typeMime": {
        "type": "application",
        "subType": "PDF"
      },
      "statutRepresentation": {
        "verbatim": true,
        "canonique": true,
        "officielle": true,
        "transcription": false,
        "enregistrement": false
      },
      "contenu": {
        "documentURI": "/15/amendements/1237/AN/2935.pdf"
      }
    }
  ],
  "seanceDiscussion": "RUANR5L15S2019IDS21349",
  "sort": {
    "dateSaisie": "2018-10-05T15:21:14.000+02:00",
    "sortEnSeance": "Rejeté"
  },
  "dateDepot": "2018-10-04T02:00:00.000+02:00",
  "dateDistribution": "2018-10-04T02:00:00.000+02:00",
  "article99": "0",
  "loiReference": {}
}