{
  "uid": "AMANR5L15PO419604B1481P0D1N61",
  "identifiant": {
    "legislature": "15",
    "numero": "61",
    "numRect": "0",
    "saisine": {
      "texteLegislatifRef": "PRJLANR5L15B1481",
      "numeroPartiePLF": "0",
      "organeExamen": "PO419604",
      "mentionSecondeDeliberation": "0"
    }
  },
  "numeroLong": "AC61",
  "etapeTexte": "1ère lecture (1ère assemblée saisie)",
  "triAmendement": "beaaaaaaaaaaaaaaaaaaaaaaaaaaaaaaaaaaaaaaaaaaaaaaaabvu",
  "cardinaliteAmdtMultiples": "1",
  "etat": "Retiré",
  "signataires": {
    "auteur": {
      "typeAuteur": "Depute",
      "acteurRef": "PA719318",
      "groupePolitiqueRef": "PO730934"
    },
    "cosignatairesRefs": [
      "PA346218",
      "PA721046",
      "PA721506",
      "PA267378",
      "PA767",
      "PA267735",
      "PA330909",
      "PA721968",
      "PA712015",
      "PA718780",
      "PA720630",
      "PA719272",
      "PA605036",
      "PA709315",
      "PA340853",
      "PA332523",
      "PA719318",
      "PA718838"
    ],
    "texteAffichable": "Mme&#160;Anthoine,  Mme&#160;Levy, M.&#160;Cattin, Mme&#160;Trastour-Isnart, M.&#160;Brun, M.&#160;Leclerc, M.&#160;Minot, Mme&#160;Kuster, M.&#160;Dive, Mme&#160;Meunier, M.&#160;Vialay, M.&#160;Abad, Mme&#160;Bassire, M.&#160;de Ganay, M.&#160;Masson, M.&#160;Viala, Mme&#160;Dalloz et M.&#160;Descoeur"
  },
  "pointeurFragmentTexte": {
    "division": {
      "titre": "Article 5",
      "articleDesignationCourte": "APRÈS ART. 5",
      "type": "ARTICLE",
      "avantAApres": "Apres",
      "divisionRattachee": "APRÈS L'ARTICLE 5, insérer l'article suivant:",
      "articleAdditionnel": "1",
      "urlDivisionTexteVise": "/15/textes/1481.asp#D_Article_5"
    }
  },
  "corps": {
    "dispositif": "<p style=\"text-align: justify;\">I.&#160;&#8211;&#160;L&#8217;article L.&#160;917&#8209;1 du code de l&#8217;&#233;ducation est ainsi modifi&#233;&#160;:</p><p style=\"text-align: justify;\">1&#176;&#160;&#192; la premi&#232;re phrase du premier alin&#233;a, les mots&#160;: &#171;&#160;accompagnants des &#233;l&#232;ves en situation de handicap&#160;&#187;, sont remplac&#233;s par les mots&#160;: &#171;&#160;aidants &#224; l&#8217;inclusion scolaire&#160;&#187;.</p><p style=\"text-align: justify;\">2&#176;&#160;Il est proc&#233;d&#233; &#224; la m&#234;me substitution aux d&#233;buts du deuxi&#232;me alin&#233;a, de la premi&#232;re phrase du cinqui&#232;me alin&#233;a et de l&#8217;avant-dernier alin&#233;a.</p><p style=\"text-align: justify;\">3&#176;&#160;Apr&#232;s le troisi&#232;me alin&#233;a, il est ins&#233;r&#233; un alin&#233;a ainsi r&#233;dig&#233;&#160;:</p><p style=\"text-align: justify;\">&#171;&#160;Ils peuvent accompagner les &#233;l&#232;ves dans les sorties scolaires.&#160;&#187;</p><p style=\"text-align: justify;\">4&#176;&#160;Le cinqui&#232;me alin&#233;a est ainsi modifi&#233;&#160;:</p><p style=\"text-align: justify;\"><i>a)</i>&#160;&#192; la premi&#232;re phrase, apr&#232;s le mot&#160;: &#171;&#160;sp&#233;cifique&#160;&#187;, sont ins&#233;r&#233;s les mots&#160;: &#171;&#160;d&#233;finie &#224; l&#8217;article L.&#160;917&#8209;1&#8209;1 du pr&#233;sent code&#160;&#187;&#160;;</p><p style=\"text-align: justify;\"><i>b)</i>&#160;&#192; la seconde phrase, apr&#232;s le mot&#160;: &#171;&#160;demander&#160;&#187;, sont ins&#233;r&#233;s les mots&#160;: &#171;&#160;une reconnaissance des qualifications professionnelles ou&#160;&#187;.</p><p style=\"text-align: justify;\">5&#176;&#160;Les sixi&#232;me et septi&#232;me alin&#233;as sont remplac&#233;s par un alin&#233;a ainsi r&#233;dig&#233;&#160;:</p><p style=\"text-align: justify;\">&#171;&#160;Les accompagnants des &#233;l&#232;ves en situation de handicap sont recrut&#233;s par contrat &#224; dur&#233;e ind&#233;termin&#233;e.&#160;&#187;</p><p style=\"text-align: justify;\">6&#176;&#160;Le dernier alin&#233;a est compl&#233;t&#233; par une phrase ainsi r&#233;dig&#233;e&#160;:</p><p style=\"text-align: justify;\">&#171;&#160;Ces d&#233;crets portent notamment sur les conditions de r&#233;mun&#233;ration et le r&#233;gime indemnitaire applicable &#224; ces personnels.&#160;&#187;</p><p style=\"text-align: justify;\">II.&#160;&#8211;&#160;La perte de recettes pour l&#8217;&#201;tat est compens&#233;e &#224; due concurrence par la cr&#233;ation d&#8217;une taxe additionnelle aux droits mentionn&#233;s aux articles 575 et 575 A du code g&#233;n&#233;ral des imp&#244;ts.&#160;</p><p style=\"text-align: justify;\">III.&#160;&#8211;&#160;La perte de recettes pour les collectivit&#233;s territoriales est compens&#233;e &#224; due concurrence par la majoration de la dotation globale de fonctionnement et, corr&#233;lativement pour l&#8217;&#201;tat, par la cr&#233;ation d&#8217;une taxe additionnelle aux droits mentionn&#233;s aux articles 575 et 575 A du code g&#233;n&#233;ral des imp&#244;ts.</p>",
    "exposeSommaire": "<p>Cet amendement reprend une disposition de la proposition de loi d'Aur&#233;lien Pradi&#233; relative &#224; l&#8217;inclusion des &#233;l&#232;ves en situation de handicap.</p><p>Il pr&#233;voit la cr&#233;ation d&#8217;un statut &#171;&#160;d&#8217;aidant &#224; l&#8217;inclusion scolaire&#160;&#187;. Ces aidants doivent suivre une formation, pour les accompagnants actuels, ils pourront demander une reconnaissance facilit&#233;e de leurs qualifications ou une validation de l&#8217;exp&#233;rience acquise. La sp&#233;cificit&#233; actuelle du statut qui implique que les accompagnants aient &#224; effectuer deux contrats &#224; dur&#233;e d&#233;termin&#233;e (CDD) avant de pouvoir obtenir un contrat &#224; dur&#233;e ind&#233;termin&#233;e (CDI) est supprim&#233;e. Les aidants seront d&#233;sormais recrut&#233;s dans le cadre de CDI, et non plus de CDD.</p><p>Enfin cet amendement pr&#233;voit la possibilit&#233; pour les aidants &#224; l&#8217;inclusion scolaire d&#8217;accompagner les &#233;l&#232;ves pendant les sorties scolaires.</p>"
  },
  "representations": [
    {
      "nom": "PDF",
      "typeMime": {
        "type": "application",
        "subType": "PDF"
      },
      "statutRepresentation": {
        "verbatim": true,
        "canonique": true,
        "officielle": true,
        "transcription": false,
        "enregistrement": false
      },
      "contenu": {
        "documentURI": "/15/amendements/1481/CION-CEDU/AC61.pdf"
      }
    }
  ],
  "dateDepot": "2019-01-23T01:00:00.000+01:00",
  "dateDistribution": "2019-01-28T01:00:00.000+01:00",
  "article99": "0",
  "loiReference": {
    "codeLoi": "éducation",
    "divisionCodeLoi": "L917-1"
  }
}