{
  "uid": "AMANR5L15SEA717460BTC2039P0D1N72",
  "identifiant": {
    "legislature": "15",
    "numero": "72",
    "numRect": "0",
    "saisine": {
      "texteLegislatifRef": "PRJLANR5L15BTC2039",
      "numeroPartiePLF": "0",
      "organeExamen": "PO717460",
      "mentionSecondeDeliberation": "0"
    }
  },
  "numeroLong": "72",
  "etapeTexte": "1ère lecture (2ème assemblée saisie)",
  "triAmendement": "doaaaaaaaaaaaaaaaaaaaaaaaaaaaaaaaaaaaaaaaaaaaaaaaaamu",
  "cardinaliteAmdtMultiples": "1",
  "etat": "Discuté",
  "signataires": {
    "auteur": {
      "typeAuteur": "Depute",
      "acteurRef": "PA334654",
      "groupePolitiqueRef": "PO730934"
    },
    "cosignatairesRefs": [
      "PA767",
      "PA334654"
    ],
    "texteAffichable": "M.&#160;Straumann et M.&#160;Cattin"
  },
  "pointeurFragmentTexte": {
    "division": {
      "titre": "Article 3",
      "articleDesignationCourte": "ART. 3",
      "type": "ARTICLE",
      "avantAApres": "A",
      "divisionRattachee": "ARTICLE 3",
      "urlDivisionTexteVise": "/15/textes/2039.asp#D_Article_3"
    },
    "alinea": {
      "numero": "1"
    }
  },
  "corps": {
    "dispositif": "<p style=\"text-align: justify;\">I.&#160;&#8211;&#160;Compl&#233;ter l&#8217;alin&#233;a&#160;1 par les mots&#160;:</p><p style=\"text-align: justify;\">&#171;&#160;et dans celui de l&#8217;eurom&#233;tropole de Strasbourg pour celles de ces routes et autoroutes non conc&#233;d&#233;es situ&#233;es sur le territoire de celle-ci&#160;&#187;.</p><p style=\"text-align: justify;\">II.&#160;&#8211;&#160;En cons&#233;quence, compl&#233;ter l&#8217;alin&#233;a&#160;2 par les mots&#160;:</p><p style=\"text-align: justify;\">&#171;&#160;et &#224; l&#8217;eurom&#233;tropole de Strasbourg pour ce qui concerne son territoire&#160;&#187;.</p><p style=\"text-align: justify;\">III.&#160;&#8211;&#160;En cons&#233;quence, &#224; la deuxi&#232;me phrase de l&#8217;alin&#233;a&#160;3, apr&#232;s le mot&#160;:</p><p style=\"text-align: justify;\">&#171;&#160;Alsace&#160;&#187;, </p><p style=\"text-align: justify;\">ins&#233;rer les mots&#160;:</p><p style=\"text-align: justify;\">&#171;&#160;et &#224; l&#8217;eurom&#233;tropole de Strasbourg pour ce qui concerne son territoire&#160;&#187;.</p><p style=\"text-align: justify;\">IV.&#160;&#8211;&#160;En cons&#233;quence, compl&#233;ter la m&#234;me phrase par les mots&#160;: </p><p style=\"text-align: justify;\">&#171;&#160;ou dans le domaine public de l&#8217;eurom&#233;tropole&#160;&#187;.</p><p style=\"text-align: justify;\">V.&#160;&#8211;&#160;En cons&#233;quence, compl&#233;ter l&#8217;alin&#233;a&#160;4 par les mots&#160;:</p><p style=\"text-align: justify;\">&#171;&#160;et &#224; l&#8217;eurom&#233;tropole de Strasbourg pour ce qui concerne son territoire&#160;&#187;.</p><p style=\"text-align: justify;\">VI.&#160;&#8211;&#160;En cons&#233;quence, &#224; la deuxi&#232;me phrase de l&#8217;alin&#233;a&#160;7, apr&#232;s le mot&#160;: </p><p style=\"text-align: justify;\">&#171;&#160;d&#233;partemental&#160;&#187;, </p><p style=\"text-align: justify;\">ins&#233;rer les mots&#160;:</p><p style=\"text-align: justify;\">&#171;&#160;ou l&#8217;eurom&#233;tropole de Strasbourg pour ce qui concerne son territoire&#160;&#187;.</p><p style=\"text-align: justify;\">VII.&#160;&#8211;&#160;En cons&#233;quence, supprimer les alin&#233;as 8 et 9.</p>",
    "exposeSommaire": "<p style=\"text-align: justify;\">La loi de modernisation de l&#8217;action publique territoriale et d&#8217;affirmation des m&#233;tropoles (MAPTAM) a prescrit le transfert obligatoire des routes d&#233;partementales aux m&#233;tropoles (article L.&#160;5217&#8209;2 du code g&#233;n&#233;ral des collectivit&#233;s territoriales). En cons&#233;quence, il n&#8217;y a donc plus de routes d&#233;partementales sur le territoire de l&#8217;Eurom&#233;tropole de Strasbourg.</p><p style=\"text-align: justify;\">Aussi, dans le m&#234;me souci d&#8217;assurer la coh&#233;rence entre la loi MAPTAM et la loi relative aux comp&#233;tences de la collectivit&#233; europ&#233;enne d&#8217;Alsace, l&#8217;article&#160;3 du projet de loi pourrait &#234;tre amend&#233;.</p><p style=\"text-align: justify;\">Au regard des incidences du transfert, notamment sur les personnels concern&#233;s, il para&#238;t indispensable de pr&#233;voir un mouvement concomitant.</p>"
  },
  "representations": [
    {
      "nom": "PDF",
      "typeMime": {
        "type": "application",
        "subType": "PDF"
      },
      "statutRepresentation": {
        "verbatim": true,
        "canonique": true,
        "officielle": true,
        "transcription": false,
        "enregistrement": false
      },
      "contenu": {
        "documentURI": "/15/amendements/2039/AN/72.pdf"
      }
    }
  ],
  "seanceDiscussion": "RUANR5L15S2019IDS21732",
  "sort": {
    "dateSaisie": "2019-06-25T23:08:05.000+02:00",
    "sortEnSeance": "Retiré"
  },
  "dateDepot": "2019-06-20T02:00:00.000+02:00",
  "dateDistribution": "2019-06-24T02:00:00.000+02:00",
  "article99": "0",
  "loiReference": {}
}