{
  "uid": "AMANR5L15PO59051B1802P0D1N40",
  "identifiant": {
    "legislature": "15",
    "numero": "40",
    "numRect": "0",
    "saisine": {
      "texteLegislatifRef": "PRJLANR5L15B1802",
      "numeroPartiePLF": "0",
      "organeExamen": "PO59051",
      "mentionSecondeDeliberation": "0"
    }
  },
  "numeroLong": "CL40",
  "etapeTexte": "1ère lecture (1ère assemblée saisie)",
  "triAmendement": "duaaaaaaaaaaaaaaaaaaaaaaaaaaaaaaaaaaaaaaaaaaaaaaaaabny",
  "cardinaliteAmdtMultiples": "1",
  "etat": "Discuté",
  "signataires": {
    "auteur": {
      "typeAuteur": "Depute",
      "acteurRef": "PA606098",
      "groupePolitiqueRef": "PO730934"
    },
    "cosignatairesRefs": [
      "PA606098"
    ],
    "texteAffichable": "M.&#160;Marleix"
  },
  "pointeurFragmentTexte": {
    "division": {
      "titre": "Article 16",
      "articleDesignationCourte": "APRÈS ART. 16",
      "type": "ARTICLE",
      "avantAApres": "Apres",
      "divisionRattachee": "APRÈS L'ARTICLE 16, insérer l'article suivant:",
      "articleAdditionnel": "1",
      "urlDivisionTexteVise": "/15/textes/1802.asp#D_Article_16"
    }
  },
  "corps": {
    "dispositif": "<p style=\"text-align: justify;\">Les articles&#160;108 &#224;&#160;110 de loi n&#176;&#160;2018-771 du 5 septembre 2018 pour la libert&#233; de choisir son avenir professionnel sont abrog&#233;s.</p>",
    "exposeSommaire": "<p style=\"text-align: justify;\">Cet amendement&#160;supprime la possibilit&#233; de b&#233;n&#233;ficier des avantages du statut de la fonction publique (avancement, droits &#224; la retraite) tout en exer&#231;ant une activit&#233; priv&#233;e.</p><p>Ces dispositions avaient &#233;t&#233; introduites subrepticement par le Gouvernement lors de l&#8217;examen de la loi n&#176; 2018-771 du 5 septembre 2018 pour la libert&#233; de choisir son avenir professionnel, alors m&#234;me que le Conseil d&#8217;Etat, dans son avis, les avait &#233;cart&#233;es consid&#233;rant que &#171;&#160;le droit applicable favorise d&#233;j&#224; la mobilit&#233; entre le secteur public et le secteur priv&#233;.&#160;&#187;</p>"
  },
  "representations": [
    {
      "nom": "PDF",
      "typeMime": {
        "type": "application",
        "subType": "PDF"
      },
      "statutRepresentation": {
        "verbatim": true,
        "canonique": true,
        "officielle": true,
        "transcription": false,
        "enregistrement": false
      },
      "contenu": {
        "documentURI": "/15/amendements/1802/CION_LOIS/CL40.pdf"
      }
    }
  ],
  "sort": {
    "dateSaisie": "2019-05-03T11:15:48.000+02:00",
    "sortEnSeance": "Rejeté"
  },
  "dateDepot": "2019-04-18T02:00:00.000+02:00",
  "dateDistribution": "2019-05-01T02:00:00.000+02:00",
  "article99": "0",
  "loiReference": {
    "codeLoi": "35-z2018-771",
    "divisionCodeLoi": "108"
  }
}