{
  "uid": "AMANR5L15SEA717460BTC1629P0D1N282",
  "identifiant": {
    "legislature": "15",
    "numero": "282",
    "numRect": "0",
    "saisine": {
      "texteLegislatifRef": "PRJLANR5L15BTC1629",
      "numeroPartiePLF": "0",
      "organeExamen": "PO717460",
      "mentionSecondeDeliberation": "0"
    }
  },
  "numeroLong": "282",
  "etapeTexte": "1ère lecture (1ère assemblée saisie)",
  "triAmendement": "cbaaaaaaaaaaaaaaaaaaaaaaaaaaaaaaaaaaaaaaaaaaaaaaaadlo",
  "cardinaliteAmdtMultiples": "1",
  "etat": "Discuté",
  "signataires": {
    "auteur": {
      "typeAuteur": "Depute",
      "acteurRef": "PA606712",
      "groupePolitiqueRef": "PO730934"
    },
    "cosignatairesRefs": [
      "PA719318",
      "PA334654",
      "PA336316",
      "PA267289",
      "PA266808",
      "PA718780",
      "PA346218",
      "PA330909",
      "PA605036",
      "PA267378",
      "PA606712",
      "PA330008",
      "PA609726",
      "PA718850",
      "PA267429",
      "PA709315",
      "PA718884",
      "PA719272",
      "PA267260"
    ],
    "texteAffichable": "M.&#160;Lurton,  M.&#160;Abad, Mme&#160;Anthoine, Mme&#160;Bazin-Malgras, M.&#160;Breton, M.&#160;Bouchet, M.&#160;Straumann, Mme&#160;Meunier, M.&#160;Masson, Mme&#160;Levy, Mme&#160;Poletti, M.&#160;Rolland, M.&#160;Cinieri, M.&#160;Cordier, M.&#160;Descoeur, M.&#160;Viala, Mme&#160;Trastour-Isnart, M.&#160;Aubert et M.&#160;Door"
  },
  "pointeurFragmentTexte": {
    "division": {
      "titre": "Article 6",
      "articleDesignationCourte": "APRÈS ART. 6",
      "type": "ARTICLE",
      "avantAApres": "Apres",
      "divisionRattachee": "APRÈS L'ARTICLE 6, insérer l'article suivant:",
      "articleAdditionnel": "1",
      "urlDivisionTexteVise": "/15/textes/1629.asp#D_Article_6"
    }
  },
  "corps": {
    "dispositif": "<p>La section&#160;4 du chapitre&#160;II du titre&#160;I<sup>er</sup> du livre&#160;III de la deuxi&#232;me partie du code de l&#8217;&#233;ducation est compl&#233;t&#233;e par un article&#160;L.&#160;312&#8209;11&#8209;2 ainsi r&#233;dig&#233;&#160;:</p><p style=\"text-align: justify;\">&#171;&#160;<i>Art.&#160;L.&#160;312&#8209;11&#8209;2</i>.&#160;&#8211;&#160;Sans pr&#233;judice de l&#8217;article L.&#160;312&#8209;11&#8209;1, dans le cadre de conventions entre l&#8217;&#201;tat et les r&#233;gions, la collectivit&#233; territoriale de Corse ou les collectivit&#233;s territoriales r&#233;gies par l&#8217;article&#160;73 de la Constitution, la langue r&#233;gionale est une mati&#232;re enseign&#233;e dans le cadre de l&#8217;horaire normal des &#233;coles maternelles et &#233;l&#233;mentaires, des coll&#232;ges et des lyc&#233;es sur tout ou partie des territoires concern&#233;s.&#160;&#187;</p>",
    "exposeSommaire": "<p>La France, qui est constitutionnellement une et indivisible, a &#233;galement la chance de se composer de r&#233;gions ayant une culture et un patrimoine propre qu&#8217;il nous appartient de pr&#233;server. La langue est l&#8217;une des premi&#232;res composante de ces cultures r&#233;gionales et, si son apprentissage doit &#234;tre facultatif, l&#8217;acc&#232;s &#224; son enseignement doit &#234;tre rendu plus accessible.</p><p style=\"text-align: justify;\">L&#8217;article L.&#160;312&#8209;11&#8209;1 du code de l&#8217;&#233;ducation organise cette possibilit&#233; pour les &#233;coles maternelles et &#233;l&#233;mentaires Corse uniquement. Il nous apparait d&#232;s lors important d&#8217;&#233;tendre cette possibilit&#233; &#224; l&#8217;ensemble des r&#233;gions mais dans un cadre plus normatif plus souple, bas&#233; sur la signature d&#8217;une convention entre l&#8217;&#201;tat et la R&#233;gion volontaire.</p><p style=\"text-align: justify;\">L&#8217;amendement ici propos&#233; ne vise pas &#224; l&#8217;obligation d&#8217;apprentissage des langues r&#233;gionales mais bien &#224; organiser la reconnaissance de celles-ci en int&#233;grant leur enseignant, bien que facultatif, dans le cadre de l&#8217;horaire normal normal des &#233;tablissements scolaires de premier et second degr&#233;s.</p>"
  },
  "representations": [
    {
      "nom": "PDF",
      "typeMime": {
        "type": "application",
        "subType": "PDF"
      },
      "statutRepresentation": {
        "verbatim": true,
        "canonique": true,
        "officielle": true,
        "transcription": false,
        "enregistrement": false
      },
      "contenu": {
        "documentURI": "/15/amendements/1629/AN/282.pdf"
      }
    }
  ],
  "seanceDiscussion": "RUANR5L15S2019IDS21506",
  "sort": {
    "dateSaisie": "2019-02-15T12:01:26.000+01:00",
    "sortEnSeance": "Rejeté"
  },
  "dateDepot": "2019-02-06T01:00:00.000+01:00",
  "dateDistribution": "2019-02-11T01:00:00.000+01:00",
  "article99": "0",
  "loiReference": {
    "codeLoi": "c éducation",
    "divisionCodeLoi": "L312-11-2"
  }
}