{
  "uid": "AMANR5L15PO419865B1831P0D1N2942",
  "identifiant": {
    "legislature": "15",
    "numero": "2942",
    "numRect": "0",
    "saisine": {
      "texteLegislatifRef": "PRJLANR5L15B1831",
      "numeroPartiePLF": "0",
      "organeExamen": "PO419865",
      "mentionSecondeDeliberation": "0"
    }
  },
  "numeroLong": "CD2942",
  "etapeTexte": "1ère lecture (2ème assemblée saisie)",
  "triAmendement": "hcaaaaaaaaaaaaaaaaaaaaaaaaaaaaaaaaaaaaaaaaaaaaaaaavk",
  "cardinaliteAmdtMultiples": "1",
  "etat": "Discuté",
  "signataires": {
    "auteur": {
      "typeAuteur": "Depute",
      "acteurRef": "PA722366",
      "groupePolitiqueRef": "PO730964"
    },
    "cosignatairesRefs": [
      "PA722366"
    ],
    "texteAffichable": "M.&#160;Fugit, rapporteur"
  },
  "pointeurFragmentTexte": {
    "division": {
      "titre": "Article 28",
      "articleDesignationCourte": "ART. 28",
      "type": "ARTICLE",
      "avantAApres": "A",
      "divisionRattachee": "ARTICLE 28",
      "urlDivisionTexteVise": "/15/textes/1831.asp#D_Article_28"
    },
    "alinea": {
      "numero": "18"
    }
  },
  "corps": {
    "dispositif": "<p style=\"text-align: justify;\">&#192; l&#8217;alin&#233;a&#160;18, apr&#232;s la premi&#232;re occurrence de la r&#233;f&#233;rence&#160;:</p><p style=\"text-align: justify;\">&#171;&#160;3&#176;&#160;&#187;</p><p style=\"text-align: justify;\">ins&#233;rer la r&#233;f&#233;rence&#160;:</p><p style=\"text-align: justify;\">&#171;&#160;du II&#160;&#187;.</p>",
    "exposeSommaire": "<p>Correction d'une erreur mat&#233;rielle.</p>"
  },
  "representations": [
    {
      "nom": "PDF",
      "typeMime": {
        "type": "application",
        "subType": "PDF"
      },
      "statutRepresentation": {
        "verbatim": true,
        "canonique": true,
        "officielle": true,
        "transcription": false,
        "enregistrement": false
      },
      "contenu": {
        "documentURI": "/15/amendements/1831/CION-DVP/CD2942.pdf"
      }
    }
  ],
  "sort": {
    "dateSaisie": "2019-05-18T01:41:12.000+02:00",
    "sortEnSeance": "Adopté"
  },
  "dateDepot": "2019-05-11T02:00:00.000+02:00",
  "dateDistribution": "2019-05-15T02:00:00.000+02:00",
  "article99": "0",
  "loiReference": {
    "codeLoi": "1"
  }
}