{
  "uid": "AMANR5L15SEA717460BTC0575P0D1N281",
  "identifiant": {
    "legislature": "15",
    "numero": "281",
    "numRect": "0",
    "saisine": {
      "texteLegislatifRef": "PRJLANR5L15BTC0575",
      "numeroPartiePLF": "0",
      "organeExamen": "PO717460",
      "mentionSecondeDeliberation": "0"
    }
  },
  "numeroLong": "281",
  "etapeTexte": "1ère lecture (1ère assemblée saisie)",
  "triAmendement": "bs",
  "cardinaliteAmdtMultiples": "1",
  "etat": "Discuté",
  "signataires": {
    "auteur": {
      "typeAuteur": "Depute",
      "acteurRef": "PA608016",
      "groupePolitiqueRef": "PO730934"
    },
    "cosignatairesRefs": [
      "PA267260",
      "PA334654",
      "PA607090",
      "PA1012",
      "PA266776",
      "PA718884",
      "PA340853",
      "PA642847",
      "PA712015",
      "PA330909",
      "PA856",
      "PA608016",
      "PA606712",
      "PA330684",
      "PA718838",
      "PA608416",
      "PA719318",
      "PA720644",
      "PA332523"
    ],
    "texteAffichable": "Mme&#160;Louwagie,  M.&#160;Nury, M.&#160;Straumann, Mme&#160;Bazin-Malgras, Mme&#160;Val&#233;rie&#160;Boyer, Mme&#160;Anthoine, M.&#160;Reiss, M.&#160;Lurton, Mme&#160;Poletti, M.&#160;Brun, M.&#160;de la Verpilli&#232;re, M.&#160;Descoeur, M.&#160;Hetzel, M.&#160;Jean-Pierre&#160;Vigier, M.&#160;Leclerc, M.&#160;Dive, M.&#160;Bazin, Mme&#160;Dalloz et M.&#160;Cherpion"
  },
  "pointeurFragmentTexte": {
    "division": {
      "titre": "Article 26",
      "articleDesignationCourte": "APRÈS ART. 26",
      "type": "ARTICLE",
      "avantAApres": "Apres",
      "divisionRattachee": "APRÈS L'ARTICLE 26, insérer l'article suivant:",
      "articleAdditionnel": "1",
      "urlDivisionTexteVise": "/15/textes/0575.asp#D_Article_26"
    }
  },
  "corps": {
    "dispositif": "<p style=\"text-align: justify;\">L&#8217;article L.&#160;300&#8209;6&#8209;1 du code de l&#8217;urbanisme est ainsi modifi&#233;&#160;:</p><p style=\"text-align: justify;\">&#171;&#160;1&#176;&#160;Au premier alin&#233;a du I <i>bis</i>, les mots&#160;: &#171;&#160;immobilier de cr&#233;ation ou d&#8217;extension de locaux d&#8217;activit&#233;s &#233;conomiques&#160;&#187; sont supprim&#233;s&#160;;</p><p style=\"text-align: justify;\">&#171;&#160;2&#176;&#160;Aux I <i>bis</i>, II, III, IV et VI, les mots&#160;: &#171;&#160;l&#8217;immobilier d&#8217;entreprise&#160;&#187; sont remplac&#233;s par les mots&#160;: &#171;&#160;les projets d&#8217;int&#233;r&#234;t &#233;conomique majeur&#160;&#187;.</p>",
    "exposeSommaire": "<p style=\"text-align: justify;\">Il s&#8217;agit de d&#8217;&#233;largir le champ d&#8217;application de la proc&#233;dure int&#233;gr&#233;e pour l&#8217;immobilier d&#8217;entreprise &#224; tous les projets d&#8217;int&#233;r&#234;t &#233;conomique majeur.</p>"
  },
  "representations": [
    {
      "nom": "PDF",
      "typeMime": {
        "type": "application",
        "subType": "PDF"
      },
      "statutRepresentation": {
        "verbatim": true,
        "canonique": true,
        "officielle": true,
        "transcription": false,
        "enregistrement": false
      },
      "contenu": {
        "documentURI": "/15/amendements/0575/AN/281.pdf"
      }
    }
  ],
  "seanceDiscussion": "RUANR5L15S2018IDS20867",
  "sort": {
    "dateSaisie": "2018-01-25T12:21:13.000+01:00",
    "sortEnSeance": "Rejeté"
  },
  "dateDepot": "2018-01-19T01:00:00.000+01:00",
  "dateDistribution": "2018-01-22T01:00:00.000+01:00",
  "article99": "0",
  "loiReference": {
    "codeLoi": "c urbanisme",
    "divisionCodeLoi": "L300-6-1"
  }
}