{
  "uid": "AMANR5L15SEA717460BTC0971P0D1N850",
  "identifiant": {
    "legislature": "15",
    "numero": "850",
    "numRect": "0",
    "saisine": {
      "texteLegislatifRef": "PRJLANR5L15BTC0971",
      "numeroPartiePLF": "0",
      "organeExamen": "PO717460",
      "mentionSecondeDeliberation": "0"
    }
  },
  "numeroLong": "850",
  "etapeTexte": "1ère lecture (1ère assemblée saisie)",
  "triAmendement": "bl",
  "cardinaliteAmdtMultiples": "1",
  "etat": "Retiré",
  "signataires": {
    "auteur": {
      "typeAuteur": "Depute",
      "acteurRef": "PA722312",
      "groupePolitiqueRef": "PO730964"
    },
    "cosignatairesRefs": [
      "PA719170",
      "PA722312",
      "PA719790"
    ],
    "texteAffichable": "Mme&#160;Bessot Ballot,  Mme&#160;Charvier et M.&#160;Chalumeau"
  },
  "pointeurFragmentTexte": {
    "division": {
      "titre": "Article 66",
      "articleDesignationCourte": "APRÈS ART. 66",
      "type": "ARTICLE",
      "avantAApres": "Apres",
      "divisionRattachee": "APRÈS L'ARTICLE 66, insérer l'article suivant:",
      "articleAdditionnel": "1",
      "urlDivisionTexteVise": "/15/textes/0971.asp#D_Article_66"
    }
  },
  "corps": {
    "dispositif": "<p>&#160;<br />&#160;<br />Le titre II du Livre 1er du code de la construction et de l&#8217;habitation est compl&#233;t&#233; par un chapitre X ainsi r&#233;dig&#233;&#160;:</p><p>&#171;&#160;Chapitre X</p><p>&#171;&#160;Certification des armatures</p><p>&#171;&#160;Art.&#160;L.&#160;129&#8209;10.&#160;&#8211;&#160;Les armatures du b&#233;ton doivent &#234;tre admises &#224; la marque NF Armatures et &#234;tre estampill&#233;es comme telles, ou faire l&#8217;objet de toute autre certification de qualit&#233; en vigueur dans un &#201;tat membre de l&#8217;Union&#160;europ&#233;enne. Cette certification doit alors pr&#233;senter des garanties &#233;quivalentes &#224; celles de la marque NF Armatures, notamment en ce qui concerne l&#8217;intervention d&#8217;une tierce partie accr&#233;dit&#233;e et les performances pr&#233;vues dans les normes correspondantes.</p><p>&#171;&#160;La mise en &#339;uvre de ces armatures doit &#234;tre r&#233;alis&#233;e par des entreprises sp&#233;cialis&#233;es et d&#251;ment qualifi&#233;es titulaires de la marque Association fran&#231;aise certificat armature b&#233;ton pose d&#8217;armatures du b&#233;ton.</p><p>&#171;&#160;Les modalit&#233;s de cette certification sont d&#233;finies par d&#233;cret&#160;&#187;.</p>",
    "exposeSommaire": "<p style=\"text-align: justify;\">Les accidents li&#233;s aux chutes de balcons se multiplient en France ces derniers mois et ces derni&#232;res ann&#233;es mettant en cause des d&#233;fauts de conception et des malfa&#231;ons en lien avec les armatures du b&#233;ton. Encore 3 balcons &#224; Nanterre le 21 mars dernier, &#224; B&#233;ziers le 14 avril. En avril 2017 &#224; Grenoble, &#224; Montrouge, &#224; Issy-les-Moulineaux, &#224; Toulouse, etc. Cette liste n&#8217;est pas exhaustive.</p><p style=\"text-align: justify;\">Et nous avons tous bien entendu ici &#233;t&#233; directement interpell&#233;s par le terrible drame survenu &#224; Angers le 15 octobre 2016 avec l&#8217;effondrement d&#8217;un balcon qui a fait 4 morts.</p><p style=\"text-align: justify;\">Nous savons que le Minist&#232;re en charge du Logement s&#8217;est engag&#233; &#224; lancer une &#233;tude sur cet enjeu de s&#233;curit&#233; majeur qui va au-del&#224; des balcons et concerne la construction dans son ensemble. En effet, certaines armatures peuvent &#234;tre l&#8217;objet de d&#233;fauts de fabrication et &#234;tre mal pos&#233;es, ce qui peut &#234;tre &#224; l&#8217;origine d&#8217;accidents qui dans certains cas peuvent tourner aux drames humains.</p><p style=\"text-align: justify;\">Or il existe en France une certification d&#233;livr&#233;e par l&#8217;AFNOR qui atteste de la qualit&#233; des armatures et de leur mise en &#339;uvre. Nous souhaitons donc par cet amendement alerter les pouvoirs publics sur l&#8217;urgence &#224; agir et &#224; faire &#233;voluer la r&#233;glementation.</p><p style=\"text-align: justify;\">La France est en effet en retard par rapport &#224; ses voisins&#160;europ&#233;ens, qui ont d&#233;j&#224; introduit une certification obligatoire pour les entreprises fabriquant ou mettant en &#339;uvre les armatures du b&#233;ton.</p><p style=\"text-align: justify;\">L&#8217;objectif ici est d&#8217;&#233;viter que de nouveaux drames tels celui d&#8217;Angers ne se reproduisent et nous partageons tous ici cette volont&#233;.</p><p style=\"text-align: justify;\">&#160;</p>"
  },
  "representations": [
    {
      "nom": "PDF",
      "typeMime": {
        "type": "application",
        "subType": "PDF"
      },
      "statutRepresentation": {
        "verbatim": true,
        "canonique": true,
        "officielle": true,
        "transcription": false,
        "enregistrement": false
      },
      "contenu": {
        "documentURI": "/15/amendements/0971/AN/850.pdf"
      }
    }
  ],
  "dateDepot": "2018-05-24T02:00:00.000+02:00",
  "dateDistribution": "2018-06-02T02:00:00.000+02:00",
  "article99": "0",
  "loiReference": {
    "codeLoi": "c construction et habitation",
    "divisionCodeLoi": "Livre Ier Titre II"
  }
}