{
  "uid": "AMANR5L15SEA717460BTC0369P0D1N291",
  "identifiant": {
    "legislature": "15",
    "numero": "291",
    "numRect": "0",
    "saisine": {
      "texteLegislatifRef": "PRJLANR5L15BTC0369",
      "numeroPartiePLF": "0",
      "organeExamen": "PO717460",
      "mentionSecondeDeliberation": "0"
    }
  },
  "numeroLong": "291",
  "etapeTexte": "1ère lecture (1ère assemblée saisie)",
  "triAmendement": "mok",
  "cardinaliteAmdtMultiples": "1",
  "etat": "Discuté",
  "signataires": {
    "auteur": {
      "typeAuteur": "Depute",
      "acteurRef": "PA721062",
      "groupePolitiqueRef": "PO730958"
    },
    "cosignatairesRefs": [
      "PA720846",
      "PA720422",
      "PA588884",
      "PA721210",
      "PA719676",
      "PA719578",
      "PA718868",
      "PA720430",
      "PA721960",
      "PA718860",
      "PA720286",
      "PA2150",
      "PA721226",
      "PA721062",
      "PA722142",
      "PA721202",
      "PA720892"
    ],
    "texteAffichable": "M.&#160;Ratenon,  Mme&#160;Autain, M.&#160;Bernalicis, M.&#160;Coquerel, M.&#160;Corbi&#232;re, Mme&#160;Fiat, M.&#160;Lachaud, M.&#160;Larive, M.&#160;M&#233;lenchon, Mme&#160;Obono, Mme&#160;Panot, M.&#160;Prud&apos;homme, M.&#160;Quatennens, Mme&#160;Ressiguier, Mme&#160;Rubin, M.&#160;Ruffin et Mme&#160;Taurine"
  },
  "pointeurFragmentTexte": {
    "division": {
      "titre": "Article 4",
      "articleDesignationCourte": "ART. 4",
      "type": "ARTICLE",
      "avantAApres": "A",
      "divisionRattachee": "ARTICLE 4",
      "urlDivisionTexteVise": "/15/textes/0369.asp#D_Article_4"
    },
    "alinea": {
      "avantAApres": "Apres",
      "numero": "5"
    }
  },
  "corps": {
    "dispositif": "<p style=\"text-align: justify;\">Compl&#233;ter cet article par les deux alin&#233;as suivants&#160;:</p><p style=\"text-align: justify;\">&#171;&#160;L&#8217;article L.&#160;2411&#8209;1 est compl&#233;t&#233; par un 21&#176; ainsi r&#233;dig&#233;&#160;:</p><p style=\"text-align: justify;\">&#171;&#160;21&#176; Lanceur d&#8217;alerte, d&#233;fini &#224; l&#8217;article&#160;6 de la loi n&#176;&#160;2016&#8209;1691 du 9 d&#233;cembre 2016 relative &#224; la transparence, &#224; la lutte contre la corruption et &#224; la modernisation de la vie &#233;conomique.&#160;&#187;</p>",
    "exposeSommaire": "<p style=\"text-align: justify;\">Les lanceurs d&#8217;alerte, d&#233;finis par la loi Sapin 2 comme &#8220;une personne physique qui r&#233;v&#232;le ou signale, de mani&#232;re d&#233;sint&#233;ress&#233;e et de bonne foi, un crime ou un d&#233;lit, une violation grave et manifeste d&#8217;un engagement international r&#233;guli&#232;rement ratifi&#233; ou approuv&#233; par la France, d&#8217;un acte unilat&#233;ral d&#8217;une organisation internationale pris sur le fondement d&#8217;un tel engagement, de la loi ou du r&#232;glement, ou une menace ou un pr&#233;judice graves pour l&#8217;int&#233;r&#234;t g&#233;n&#233;ral, dont elle a eu personnellement connaissance.&#8221;</p><p style=\"text-align: justify;\">Actuellement, le droit du travail ne donne pas de r&#233;gime d&#8217;exception, face aux licenciements, aux personnes qui alertent la soci&#233;t&#233; sur les menaces ou les pr&#233;judices &#224; l&#8217;int&#233;r&#234;t g&#233;n&#233;ral. Par cons&#233;quent, les femmes et les hommes qui ont eu le courage de d&#233;noncer des malversations ou des faits graves commis par leur entreprise, se sont presque tous retrouv&#233;&#183;e&#183;s dans des situations difficiles.</p><p style=\"text-align: justify;\">Nous pensons &#224; Raphael Halet, qui a contribu&#233; &#224; r&#233;v&#233;ler le scandale de &#8220;Lux Leaks&#8221;, ou encore &#224; C&#233;line Boussi&#233;, qui a d&#233;nonc&#233; la violence syst&#233;mique au sein d&#8217;un institut m&#233;dico-&#233;ducatif. Ces deux lanceurs d&#8217;alerte ont &#233;t&#233; mis dans une situation de grande pr&#233;carit&#233; suite &#224; leur licenciement, et auraient m&#233;rit&#233; une plus grande protection de la part du droit du travail.</p><p style=\"text-align: justify;\">Cet amendement se situe d&#8217;ailleurs dans la droite ligne de l&#8217;arr&#234;t de la Cour de Cassation du 30 juin 2016, qui explique&#160;: &#8220;En raison de l&#8217;atteinte qu&#8217;il porte &#224; la libert&#233; d&#8217;expression, en particulier du droit pour les salari&#233;s de signaler les conduites ou actes illicites constat&#233;s par eux sur leur lieu de travail, le licenciement d&#8217;un salari&#233; prononc&#233; pour avoir relat&#233; ou t&#233;moign&#233;, de bonne foi, de faits dont il a eu connaissance dans l&#8217;exercice de ses fonctions et qui, s&#8217;ils &#233;taient &#233;tablis, seraient de nature &#224; caract&#233;riser des infractions p&#233;nales, est atteint de nullit&#233;.&#160;&#187;</p><p style=\"text-align: justify;\">Il ne fait que traduire cet arr&#234;t dans le Code du travail.</p>"
  },
  "representations": [
    {
      "nom": "PDF",
      "typeMime": {
        "type": "application",
        "subType": "PDF"
      },
      "statutRepresentation": {
        "verbatim": true,
        "canonique": true,
        "officielle": true,
        "transcription": false,
        "enregistrement": false
      },
      "contenu": {
        "documentURI": "/15/amendements/0369/AN/291.pdf"
      }
    }
  ],
  "seanceDiscussion": "RUANR5L15S2018IDS20777",
  "sort": {
    "dateSaisie": "2017-11-23T00:47:49.000+01:00",
    "sortEnSeance": "Rejeté"
  },
  "dateDepot": "2017-11-17T01:00:00.000+01:00",
  "dateDistribution": "2017-11-20T01:00:00.000+01:00",
  "article99": "0",
  "loiReference": {
    "codeLoi": "travail",
    "divisionCodeLoi": "2411-1"
  }
}