{
  "uid": "AMANR5L15SEA717460BTC1629P0D1N414",
  "identifiant": {
    "legislature": "15",
    "numero": "414",
    "numRect": "0",
    "saisine": {
      "texteLegislatifRef": "PRJLANR5L15BTC1629",
      "numeroPartiePLF": "0",
      "organeExamen": "PO717460",
      "mentionSecondeDeliberation": "1"
    }
  },
  "numeroLong": "414",
  "etapeTexte": "1ère lecture (1ère assemblée saisie)",
  "triAmendement": "ebaaaaaaaaaaaaaaaaaaaaaaaaaaaaaaaaaaaaaaaaaaaaaaaaaby",
  "cardinaliteAmdtMultiples": "1",
  "etat": "Discuté",
  "signataires": {
    "auteur": {
      "typeAuteur": "Depute",
      "acteurRef": "PA721210",
      "groupePolitiqueRef": "PO730958"
    },
    "cosignatairesRefs": [
      "PA721226",
      "PA718860",
      "PA721062",
      "PA719578",
      "PA719676",
      "PA720430",
      "PA720422",
      "PA721202",
      "PA722142",
      "PA721210",
      "PA720846",
      "PA588884",
      "PA718868",
      "PA720286",
      "PA2150",
      "PA720892",
      "PA721960"
    ],
    "texteAffichable": "M.&#160;Corbi&#232;re,  Mme&#160;Autain, M.&#160;Bernalicis, M.&#160;Coquerel, Mme&#160;Fiat, M.&#160;Lachaud, M.&#160;Larive, M.&#160;M&#233;lenchon, Mme&#160;Obono, Mme&#160;Panot, M.&#160;Prud&apos;homme, M.&#160;Quatennens, M.&#160;Ratenon, Mme&#160;Ressiguier, Mme&#160;Rubin, M.&#160;Ruffin et Mme&#160;Taurine"
  },
  "pointeurFragmentTexte": {
    "division": {
      "titre": "Article 8",
      "articleDesignationCourte": "APRÈS ART. 8",
      "type": "ARTICLE",
      "avantAApres": "Apres",
      "divisionRattachee": "APRÈS L'ARTICLE 8, insérer la division et l'intitulé suivants:",
      "chapitreAdditionnel": "1",
      "urlDivisionTexteVise": "/15/textes/1629.asp#D_Article_8"
    }
  },
  "corps": {
    "dispositif": "<p style=\"text-align: justify;\">Chapitre II <i>bis</i></p><p style=\"text-align: justify;\">Le r&#233;tablissement de la confiance par le r&#233;tablissement de l&#8217;&#233;galit&#233;</p><p style=\"text-align: justify;\">Article</p><p style=\"text-align: justify;\">&#192; titre exp&#233;rimental et pour une dur&#233;e de deux ans, le Gouvernement peut, dans les acad&#233;mies qu&#8217;il identifie comme &#233;tant particuli&#232;rement pertinentes par leur caract&#232;re vari&#233;, mettre en place l&#8217;exp&#233;rimentation d&#8217;une journ&#233;e de l&#8217;&#233;galit&#233; &#224; destination de tous les enfants scolaris&#233;s dans les &#233;coles publiques.</p><p style=\"text-align: justify;\">Cette journ&#233;e peut avoir vocation &#224; d&#233;construire les st&#233;r&#233;otypes sexistes et racistes, en adaptant la formation aux besoins des enfants en fonction de leur &#226;ge. Cette formation peut &#234;tre d&#233;livr&#233;e par des associations sp&#233;cialis&#233;es sur ces questions.</p>",
    "exposeSommaire": "<p style=\"text-align: justify;\">Par cet amendement, nous proposons &#224; titre exp&#233;rimental l&#8217;instauration d&#8217;une journ&#233;e banalis&#233;e de l&#8217;&#233;galit&#233;, pour lutter contre les discriminations sexistes et racistes.</p><p style=\"text-align: justify;\">Nous consid&#233;rons d&#8217;une part que c&#8217;est un des r&#244;les de l&#8217;&#233;cole que de former les futures citoyens et citoyennes. C&#8217;est &#224; l&#8217;&#233;cole, notamment pr&#233;&#233;l&#233;mentaire et primaire que se structurent les rapports de domination, il faut imp&#233;rativement que les professeur&#183;e&#183;s soient form&#233;&#183;e&#183;s &#224; les d&#233;tecter et &#224; avoir des solution de lutte contre ces ph&#233;nom&#232;nes. Loin d&#8217;&#234;tre anodine, une telle formation permettrait de lutter de fa&#231;on efficace et rapide contre les st&#233;r&#233;otypes sexistes, au moment m&#234;me de leur &#233;mergence.</p><p style=\"text-align: justify;\">Par ailleurs, ces rapports peuvent se manifester avec beaucoup de violence &#224; l&#8217;adolescence, avec des situations de harc&#232;lement des jeunes filles, notamment.</p><p style=\"text-align: justify;\">Ces enseignements pourront donc aussi permettre de r&#233;pondre aux probl&#233;matiques imm&#233;diates rencontr&#233;es par les &#233;l&#232;ves et leurs professeurs, et permettre de d&#233;sar&#231;onner des situations parfois douloureuses dans l&#8217;&#233;cole.</p>"
  },
  "representations": [
    {
      "nom": "PDF",
      "typeMime": {
        "type": "application",
        "subType": "PDF"
      },
      "statutRepresentation": {
        "verbatim": true,
        "canonique": true,
        "officielle": true,
        "transcription": false,
        "enregistrement": false
      },
      "contenu": {
        "documentURI": "/15/amendements/1629/AN/414.pdf"
      }
    }
  ],
  "seanceDiscussion": "RUANR5L15S2019IDS21507",
  "sort": {
    "dateSaisie": "2019-02-15T17:12:01.000+01:00",
    "sortEnSeance": "Rejeté"
  },
  "dateDepot": "2019-02-06T01:00:00.000+01:00",
  "dateDistribution": "2019-02-11T01:00:00.000+01:00",
  "article99": "0",
  "loiReference": {}
}