{
  "uid": "AMANR5L15SEA717460BTC2243P0D1N714",
  "identifiant": {
    "legislature": "15",
    "numero": "714",
    "numRect": "0",
    "saisine": {
      "texteLegislatifRef": "PRJLANR5L15BTC2243",
      "numeroPartiePLF": "0",
      "organeExamen": "PO717460",
      "mentionSecondeDeliberation": "0"
    }
  },
  "numeroLong": "714",
  "etapeTexte": "1ère lecture (1ère assemblée saisie)",
  "triAmendement": "ajaaaaaaaaaaaaaaaaaaaaaaaaaaaaaaaaaaaaaaaaaaaaaaaaborzzkw",
  "cardinaliteAmdtMultiples": "1",
  "etat": "Discuté",
  "signataires": {
    "auteur": {
      "typeAuteur": "Depute",
      "acteurRef": "PA720586",
      "groupePolitiqueRef": "PO730934"
    },
    "cosignatairesRefs": [
      "PA720586"
    ],
    "texteAffichable": "M.&#160;Vatin"
  },
  "pointeurFragmentTexte": {
    "division": {
      "titre": "Article 2",
      "articleDesignationCourte": "ART. 2",
      "type": "ARTICLE",
      "avantAApres": "A",
      "divisionRattachee": "ARTICLE 2",
      "urlDivisionTexteVise": "/15/textes/2243.asp#D_Article_2"
    },
    "alinea": {
      "avantAApres": "Apres",
      "numero": "2"
    }
  },
  "corps": {
    "dispositif": "<p>Apr&#232;s l'alin&#233;a 2, ins&#233;rer l'alin&#233;a suivant&#160;:</p><p style=\"text-align: justify;\">&#171;&#160;Toute personne ayant r&#233;mun&#233;r&#233; ou octroy&#233; un avantage &#224; une autre personne pour obtenir un don de gam&#232;tes est punie de deux ans d&#8217;emprisonnement et de 30 000&#160;euros d&#8217;amende.&#160;&#187;</p>",
    "exposeSommaire": "<p style=\"text-align: justify;\">Il convient de punir tout abus contrevenant &#224; la gratuit&#233; du don. En effet, la procr&#233;ation est un v&#233;ritable march&#233; lucratif dans de nombreux pays. Avec ce projet de loi, les pressions pour installer un march&#233; de la procr&#233;ation en France vont &#234;tre de plus en plus fortes (notamment en raison de la future p&#233;nurie de dons). Il convient donc de s&#8217;en pr&#233;munir avec des moyens appropri&#233;s.</p>"
  },
  "representations": [
    {
      "nom": "PDF",
      "typeMime": {
        "type": "application",
        "subType": "PDF"
      },
      "statutRepresentation": {
        "verbatim": true,
        "canonique": true,
        "officielle": true,
        "transcription": false,
        "enregistrement": false
      },
      "contenu": {
        "documentURI": "/15/amendements/2243/AN/714.pdf"
      }
    }
  ],
  "seanceDiscussion": "RUANR5L15S2019IDS21833",
  "sort": {
    "dateSaisie": "2019-09-27T16:51:59.000+02:00",
    "sortEnSeance": "Non soutenu"
  },
  "dateDepot": "2019-09-17T02:00:00.000+02:00",
  "dateDistribution": "2019-09-24T02:00:00.000+02:00",
  "article99": "0",
  "loiReference": {}
}