{
  "uid": "AMANR5L15PO59051B0911P0D1N1386",
  "identifiant": {
    "legislature": "15",
    "numero": "1386",
    "numRect": "0",
    "saisine": {
      "texteLegislatifRef": "PRJLANR5L15B0911",
      "numeroPartiePLF": "0",
      "organeExamen": "PO59051",
      "mentionSecondeDeliberation": "0"
    }
  },
  "numeroLong": "CL1386",
  "etapeTexte": "1ère lecture (1ère assemblée saisie)",
  "triAmendement": "clsx",
  "cardinaliteAmdtMultiples": "1",
  "etat": "Discuté",
  "signataires": {
    "auteur": {
      "typeAuteur": "Depute",
      "acteurRef": "PA719728",
      "groupePolitiqueRef": "PO730964"
    },
    "cosignatairesRefs": [
      "PA719728",
      "PA721784"
    ],
    "texteAffichable": "M.&#160;Le Bohec et Mme&#160;Gomez-Bassac"
  },
  "pointeurFragmentTexte": {
    "division": {
      "titre": "Article 3",
      "articleDesignationCourte": "ART. 3",
      "type": "ARTICLE",
      "avantAApres": "A",
      "divisionRattachee": "ARTICLE 3",
      "urlDivisionTexteVise": "/15/textes/0911.asp#D_Article_3"
    },
    "alinea": {
      "numero": "3"
    }
  },
  "corps": {
    "dispositif": "<p style=\"text-align: justify;\">Supprimer l&#8217;alin&#233;a&#160;3.</p>",
    "exposeSommaire": "<p style=\"text-align: justify;\">L&#8217;objectif de l&#8217;alin&#233;a 3 de l&#8217;article 3 du pr&#233;sent projet de loi est de limiter le droit d&#8217;initiative des parlementaires. Cet article dispose en effet que seront irrecevables les propositions de loi (qui sont donc d&#8217;origine parlementaire) et les amendements qui rel&#232;veraient du domaine r&#233;glementaire. Or, la jurisprudence du conseil constitutionnel en la mati&#232;re n&#8217;a pas syst&#233;matiquement sanctionn&#233; les empi&#232;tements l&#233;gislatifs sur le domaine r&#233;glementaire. Il a en effet consid&#233;r&#233; qu&#8217;une loi empi&#233;tant sur ce domaine n&#8217;&#233;tait pas de ce seul fait inconstitutionnelle d&#232;s lors que, pendant la discussion parlementaire, le Gouvernement avait eu la facult&#233; d&#8217;opposer l&#8217;irrecevabilit&#233; (d&#233;cision 143-DC du 30 juillet 1982, <i>Blocage des prix et des revenus</i>).</p><p style=\"text-align: justify;\">Par ailleurs, il arrive que le Gouvernement pr&#233;sente au l&#233;gislateur des projets de loi comportant un certain nombre de dispositions de port&#233;e normative. D&#232;s lors, il semble incongru de limiter le droit d&#8217;amendement du Parlement sur des articles d&#8217;ordre r&#233;glementaires, ces amendements ayant toutes les chances d&#8217;avoir, eux aussi, une telle port&#233;e normative.</p><p style=\"text-align: justify;\">Concernant l&#8217;interdiction, pour les Parlementaires, de d&#233;poser des amendements sans lien direct avec un texte de loi en premi&#232;re lecture vient &#233;galement limiter leur droit d&#8217;amendement et contrevient &#224; l&#8217;article 45 de la Constitution qui pr&#233;voit&#160;: <i>&#171;&#160;Tout projet ou proposition de loi est examin&#233; successivement dans les deux assembl&#233;es du Parlement en vue de l'adoption d'un texte identique. Sans pr&#233;judice de l'application des articles 40 et 41, tout amendement est recevable en premi&#232;re lecture d&#232;s lors qu'il pr&#233;sente un lien, m&#234;me indirect, avec le texte d&#233;pos&#233; ou transmis.&#160;&#187;</i></p>"
  },
  "representations": [
    {
      "nom": "PDF",
      "typeMime": {
        "type": "application",
        "subType": "PDF"
      },
      "statutRepresentation": {
        "verbatim": true,
        "canonique": true,
        "officielle": true,
        "transcription": false,
        "enregistrement": false
      },
      "contenu": {
        "documentURI": "/15/amendements/0911/CION_LOIS/CL1386.pdf"
      }
    }
  ],
  "sort": {
    "dateSaisie": "2018-06-29T10:00:56.000+02:00",
    "sortEnSeance": "Tombé"
  },
  "dateDepot": "2018-06-22T02:00:00.000+02:00",
  "dateDistribution": "2018-06-25T02:00:00.000+02:00",
  "article99": "0",
  "loiReference": {
    "codeLoi": "1.1 id"
  }
}