{
  "uid": "AMANR5L15SEA717460B1255P1D1N628",
  "identifiant": {
    "legislature": "15",
    "numero": "628",
    "numRect": "0",
    "saisine": {
      "texteLegislatifRef": "PRJLANR5L15B1255",
      "numeroPartiePLF": "1",
      "organeExamen": "PO717460",
      "mentionSecondeDeliberation": "0"
    }
  },
  "numeroLong": "I-628",
  "etapeTexte": "1ère lecture (1ère assemblée saisie)",
  "triAmendement": "dsaaaaaaaaaaaaaaaaaaaaaaaaaaaaaaaaaaaaaaaaaaaaaaaaabvzzztznzzzxzxzhs",
  "cardinaliteAmdtMultiples": "1",
  "etat": "Discuté",
  "signataires": {
    "auteur": {
      "typeAuteur": "Depute",
      "acteurRef": "PA605036",
      "groupePolitiqueRef": "PO730934"
    },
    "cosignatairesRefs": [
      "PA721506",
      "PA267378",
      "PA267735",
      "PA267901",
      "PA607090",
      "PA643134",
      "PA721636",
      "PA267204",
      "PA718784",
      "PA767",
      "PA1874",
      "PA1012",
      "PA718884",
      "PA718850",
      "PA2155",
      "PA267260",
      "PA267289",
      "PA719318",
      "PA330909",
      "PA721968",
      "PA608016",
      "PA336316",
      "PA346218",
      "PA605036",
      "PA643103",
      "PA720684",
      "PA712015",
      "PA346054",
      "PA721474",
      "PA721678",
      "PA266776",
      "PA334654",
      "PA718838",
      "PA642847",
      "PA267429"
    ],
    "texteAffichable": "M.&#160;Abad,  M.&#160;Le Fur, M.&#160;Brun, M.&#160;Cattin, Mme&#160;Kuster, M.&#160;Jean-Pierre&#160;Vigier, Mme&#160;Levy, Mme&#160;Valentin, M.&#160;Door, M.&#160;Bazin, M.&#160;Sermier, M.&#160;Straumann, M.&#160;Dive, M.&#160;Menuel, Mme&#160;Bazin-Malgras, Mme&#160;Anthoine, M.&#160;Vialay, M.&#160;Cinieri, M.&#160;Cordier, M.&#160;Pierre-Henri&#160;Dumont, M.&#160;Masson, M.&#160;Pauget, M.&#160;de la Verpilli&#232;re, M.&#160;Descoeur, M.&#160;Kamardine, M.&#160;Bouchet, M.&#160;Viry, M.&#160;Reiss, M.&#160;Ferrara, M.&#160;de Ganay, Mme&#160;Poletti, Mme&#160;Louwagie, M.&#160;Reda, M.&#160;Parigi et M.&#160;Emmanuel&#160;Maquet"
  },
  "pointeurFragmentTexte": {
    "division": {
      "titre": "Article 16",
      "articleDesignationCourte": "APRÈS ART. 16",
      "type": "ARTICLE",
      "avantAApres": "Apres",
      "divisionRattachee": "APRÈS L'ARTICLE 16, insérer l'article suivant:",
      "articleAdditionnel": "1",
      "urlDivisionTexteVise": "/15/textes/1255A.asp#D_Article_16"
    }
  },
  "corps": {
    "dispositif": "<p style=\"text-align: justify;\">I.&#160;&#8211;&#160;L&#8217;article&#160;1701 du code g&#233;n&#233;ral des imp&#244;ts est compl&#233;t&#233; par trois alin&#233;as ainsi r&#233;dig&#233;s&#160;:</p><p style=\"text-align: justify;\">&#171;&#160;Les droits de mutation par d&#233;c&#232;s des exploitations agricoles, commerces et entreprises, dont l&#8217;actif net est inf&#233;rieur &#224; un million d&#8217;euros, peuvent &#234;tre acquitt&#233;s en parts &#233;gales sur quinze ans &#224; compter du d&#233;p&#244;t de la d&#233;claration de succession, &#224; la condition que l&#8217;un des h&#233;ritiers exerce la fonction de chef d&#8217;exploitation ou de dirigeant de l&#8217;entreprise.&#160;&#187;</p><p style=\"text-align: justify;\">&#171;&#160;Cette facult&#233; n&#8217;entra&#238;ne pas le paiement d&#8217;int&#233;r&#234;ts moratoires, ni la constitution de garanties.&#160;&#187;</p><p style=\"text-align: justify;\">&#171;&#160;Cette facult&#233; s&#8217;ach&#232;ve six mois apr&#232;s la cessation des fonctions d&#8217;exploitant ou de dirigeant de l&#8217;entreprise sauf si le successeur est un conjoint ou un descendant en ligne directe.&#160;&#187;</p><p style=\"text-align: justify;\">II.&#160;&#8211;&#160;La perte de recettes pour l&#8217;&#201;tat est compens&#233;e &#224; due concurrence par la cr&#233;ation d&#8217;une taxe additionnelle aux droits mentionn&#233;s aux articles 575 et 575 A du code g&#233;n&#233;ral des imp&#244;ts.&#160;</p>",
    "exposeSommaire": "<p style=\"text-align: justify;\">Les exploitations agricoles connaissent depuis quelques mois de tr&#232;s graves difficult&#233;s &#233;conomiques qui ne font que s&#8217;accentuer et qui mettent en p&#233;ril l&#8217;avenir m&#234;me de la production agricole et d&#8217;un pan entier de notre industrie agroalimentaire.</p><p style=\"text-align: justify;\">Il parait n&#233;cessaire de prendre des mesures fiscales pour lutter contre la fragilisation de ce secteur et de nos territoires.</p><p style=\"text-align: justify;\">Cet amendement permet de faciliter le r&#232;glement des successions au sein des exploitations agricoles par un dispositif de lissage dans le temps sous certaines conditions.</p>"
  },
  "representations": [
    {
      "nom": "PDF",
      "typeMime": {
        "type": "application",
        "subType": "PDF"
      },
      "statutRepresentation": {
        "verbatim": true,
        "canonique": true,
        "officielle": true,
        "transcription": false,
        "enregistrement": false
      },
      "contenu": {
        "documentURI": "/15/amendements/1255A/AN/628.pdf"
      }
    }
  ],
  "seanceDiscussion": "RUANR5L15S2019IDS21283",
  "sort": {
    "dateSaisie": "2018-10-19T21:48:02.000+02:00",
    "sortEnSeance": "Rejeté"
  },
  "dateDepot": "2018-10-09T02:00:00.000+02:00",
  "dateDistribution": "2018-10-16T02:00:00.000+02:00",
  "article99": "0",
  "loiReference": {
    "codeLoi": "CGI",
    "divisionCodeLoi": "1701"
  }
}