{
  "uid": "AMANR5L15SEA717460BTC1771P0D1N44",
  "identifiant": {
    "legislature": "15",
    "numero": "44",
    "numRect": "0",
    "saisine": {
      "texteLegislatifRef": "PIONANR5L15BTC1771",
      "numeroPartiePLF": "0",
      "organeExamen": "PO717460",
      "mentionSecondeDeliberation": "0"
    }
  },
  "numeroLong": "44",
  "etapeTexte": "1ère lecture (2ème assemblée saisie)",
  "triAmendement": "ilaaaaaaaaaaaaaaaaaaaaaaaaaaaaaaaaaaaaaaaaaaaaaaaac",
  "cardinaliteAmdtMultiples": "1",
  "etat": "Discuté",
  "signataires": {
    "auteur": {
      "typeAuteur": "Gouvernement"
    },
    "texteAffichable": "le Gouvernement"
  },
  "pointeurFragmentTexte": {
    "division": {
      "titre": "Article 33 bis",
      "articleDesignationCourte": "ART. 33 BIS",
      "type": "ARTICLE",
      "avantAApres": "A",
      "divisionRattachee": "ARTICLE 33 BIS",
      "urlDivisionTexteVise": "/15/textes/1771.asp#D_Article_33_bis"
    },
    "alinea": {
      "numero": "3"
    }
  },
  "corps": {
    "dispositif": "<p style=\"text-align: justify;\">Supprimer l'alin&#233;a 3.</p>",
    "exposeSommaire": "<p style=\"text-align: justify;\">L&#8217;alin&#233;a (2&#176;) dont la suppression est propos&#233;e n&#8217;apparait pas conforme au droit europ&#233;en. En effet, cet ali&#233;na permettrait de fixer un simple plafond aux sommes consacr&#233;es au rachat d&#8217;actions, sans tenir compte de la provenance des fonds. Or, l&#8217;article 82 de la directive 2017/1132/UE impose que &#171; le rachat [par une soci&#233;t&#233;] de ses propres actions ne peut avoir lieu qu&#8217;&#224; l&#8217;aide de sommes distribuables&#8230; &#187;. Il faut donc &#233;galement tenir compte de la provenance des fonds, ce qui impose de maintenir la r&#232;gle actuelle.</p>"
  },
  "representations": [
    {
      "nom": "PDF",
      "typeMime": {
        "type": "application",
        "subType": "PDF"
      },
      "statutRepresentation": {
        "verbatim": true,
        "canonique": true,
        "officielle": true,
        "transcription": false,
        "enregistrement": false
      },
      "contenu": {
        "documentURI": "/15/amendements/1771/AN/44.pdf"
      }
    }
  ],
  "sort": {
    "dateSaisie": "2019-03-28T01:00:18.000+01:00",
    "sortEnSeance": "Adopté"
  },
  "dateDepot": "2019-03-27T01:00:00.000+01:00",
  "dateDistribution": "2019-03-27T01:00:00.000+01:00",
  "article99": "1",
  "loiReference": {}
}