{
  "uid": "AMANR5L15PO59051B0714P0D1N531",
  "identifiant": {
    "legislature": "15",
    "numero": "531",
    "numRect": "0",
    "saisine": {
      "texteLegislatifRef": "PRJLANR5L15B0714",
      "numeroPartiePLF": "0",
      "organeExamen": "PO59051",
      "mentionSecondeDeliberation": "0"
    }
  },
  "numeroLong": "CL531",
  "etapeTexte": "1ère lecture (1ère assemblée saisie)",
  "triAmendement": "bvjk",
  "cardinaliteAmdtMultiples": "1",
  "etat": "Discuté",
  "signataires": {
    "auteur": {
      "typeAuteur": "Depute",
      "acteurRef": "PA606098",
      "groupePolitiqueRef": "PO730934"
    },
    "cosignatairesRefs": [
      "PA606098",
      "PA346218",
      "PA709315"
    ],
    "texteAffichable": "M.&#160;Marleix,  M.&#160;Viala et M.&#160;Masson"
  },
  "pointeurFragmentTexte": {
    "division": {
      "titre": "Article 33",
      "articleDesignationCourte": "APRÈS ART. 33",
      "type": "ARTICLE",
      "avantAApres": "Apres",
      "divisionRattachee": "APRÈS L'ARTICLE 33, insérer l'article suivant:",
      "articleAdditionnel": "1",
      "urlDivisionTexteVise": "/15/textes/0714.asp#D_Article_33"
    }
  },
  "corps": {
    "dispositif": "<p style=\"text-align: justify;\">&#192; l&#8217;article L.&#160;313&#8209;3 du code de l&#8217;entr&#233;e et du s&#233;jour des &#233;trangers et du droit d&#8217;asile, les mots&#160;: &#171;&#160;peut, par une d&#233;cision motiv&#233;e, &#234;tre&#160;&#187; sont remplac&#233;s par les mots&#160;: &#171;&#160;est, par une d&#233;cision motiv&#233;e,&#160;&#187;.</p>",
    "exposeSommaire": "<p>Le pr&#233;sent amendement a pour objet de rendre automatique le retrait de la carte de s&#233;jour &#224; des individus identifi&#233;s comme constituant une menace grave pour l&#8217;ordre public. Il serait en effet incompr&#233;hensible que de tels individus puissent rester sur le territoire. Il s&#8217;agit donc de transformer la facult&#233; donn&#233;e &#224; l&#8217;autorit&#233; comp&#233;tente (pr&#233;fet ou ministre) en obligation, sous le contr&#244;le du juge.</p><p>&#160;</p>"
  },
  "representations": [
    {
      "nom": "PDF",
      "typeMime": {
        "type": "application",
        "subType": "PDF"
      },
      "statutRepresentation": {
        "verbatim": true,
        "canonique": true,
        "officielle": true,
        "transcription": false,
        "enregistrement": false
      },
      "contenu": {
        "documentURI": "/15/amendements/0714/CION_LOIS/CL531.pdf"
      }
    }
  ],
  "sort": {
    "dateSaisie": "2018-04-06T20:23:14.000+02:00",
    "sortEnSeance": "Non soutenu"
  },
  "dateDepot": "2018-03-30T02:00:00.000+02:00",
  "dateDistribution": "2018-04-02T02:00:00.000+02:00",
  "article99": "0",
  "loiReference": {
    "codeLoi": "entrée et séjour étrangers",
    "divisionCodeLoi": "L313-3 1"
  }
}