{
  "uid": "AMANR5L15SEA717460BTC1237P0D1N2423",
  "identifiant": {
    "legislature": "15",
    "numero": "2423",
    "numRect": "1",
    "saisine": {
      "texteLegislatifRef": "PRJLANR5L15BTC1237",
      "numeroPartiePLF": "0",
      "organeExamen": "PO717460",
      "mentionSecondeDeliberation": "0"
    }
  },
  "numeroLong": "2423 (Rect)",
  "etapeTexte": "1ère lecture (1ère assemblée saisie)",
  "triAmendement": "eaoaaaaaaaaaaaaaaaaaaaaaaaaaaaaaaaaaaaaaaaaaaaaaaaebc",
  "cardinaliteAmdtMultiples": "1",
  "etat": "Discuté",
  "signataires": {
    "auteur": {
      "typeAuteur": "Depute",
      "acteurRef": "PA607553",
      "groupePolitiqueRef": "PO758835"
    },
    "cosignatairesRefs": [
      "PA605069",
      "PA1008",
      "PA608695",
      "PA508",
      "PA340343",
      "PA642764",
      "PA610681",
      "PA342415",
      "PA340357",
      "PA267233",
      "PA332614",
      "PA405480",
      "PA719930",
      "PA333818",
      "PA337483",
      "PA608172",
      "PA607553",
      "PA1809",
      "PA608741",
      "PA720988",
      "PA335532",
      "PA429893",
      "PA335054",
      "PA608011",
      "PA609590",
      "PA1592",
      "PA609332",
      "PA643145",
      "PA333285",
      "PA1198"
    ],
    "texteAffichable": "M.&#160;Potier,  Mme&#160;Battistel, M.&#160;Juanico, M.&#160;Vallaud, M.&#160;Aviragnet, Mme&#160;Bareigts, Mme&#160;Bi&#233;mouret, M.&#160;Bouillon, M.&#160;Jean-Louis&#160;Bricout, M.&#160;Carvounas, M.&#160;Alain&#160;David, Mme&#160;Laurence&#160;Dumont, M.&#160;Faure, M.&#160;Garot, M.&#160;David&#160;Habib, M.&#160;Hutin, Mme&#160;Karamanli, M.&#160;J&#233;r&#244;me&#160;Lambert, M.&#160;Letchimy, Mme&#160;Manin, Mme&#160;Pau-Langevin, Mme&#160;Pires Beaune, M.&#160;Pueyo, M.&#160;Pupponi, Mme&#160;Rabault, M.&#160;Saulignac, Mme&#160;Tolmont, Mme&#160;Untermaier, Mme&#160;Vainqueur-Christophe et Mme&#160;Victory"
  },
  "pointeurFragmentTexte": {
    "division": {
      "titre": "Article 28",
      "articleDesignationCourte": "APRÈS ART. 28",
      "type": "ARTICLE",
      "avantAApres": "Apres",
      "divisionRattachee": "APRÈS L'ARTICLE 28, insérer l'article suivant:",
      "articleAdditionnel": "1",
      "urlDivisionTexteVise": "/15/textes/1237.asp#D_Article_28"
    }
  },
  "corps": {
    "dispositif": "<p style=\"text-align: justify;\">I.&#160;&#8211;&#160;Apr&#232;s l&#8217;article&#160;1833 du code civil, il est ins&#233;r&#233; un article&#160;1833&#8209;1 ainsi r&#233;dig&#233;&#160;:</p><p style=\"text-align: justify;\">&#171;&#160;<i>Art.&#160;1833&#8209;1</i>.&#160;&#8211;&#160;Le b&#233;n&#233;fice de l&#8217;entreprise apr&#232;s imp&#244;t, charges d&#8217;int&#233;r&#234;ts et autres transferts est distribu&#233; dans le respect de la r&#232;gle suivante&#160;:</p><p style=\"text-align: justify;\">&#171;&#160;Le montant distribu&#233; aux actionnaires <i>via</i> les dividendes en esp&#232;ces, les dividendes en actions et les rachats d&#8217;actions sur l&#8217;exercice et lors de l&#8217;exercice pr&#233;c&#233;dent ne peut &#234;tre sup&#233;rieur &#224; la somme du r&#233;sultat net de l&#8217;exercice pr&#233;sent et pr&#233;c&#233;dent. Le r&#233;sultat net est celui qui est indiqu&#233; dans les comptes annuels approuv&#233;s</p><p style=\"text-align: justify;\">II.&#160;&#8211;&#160;Apr&#232;s le premier alin&#233;a de l&#8217;article L.&#160;232&#8209;11 du code de commerce, il est ins&#233;r&#233; un alin&#233;a ainsi r&#233;dig&#233;&#160;:</p><p style=\"text-align: justify;\">&#171;&#160;Pour les soci&#233;t&#233;s ayant opt&#233; pour le r&#233;gime fiscal m&#232;re-fille tel que d&#233;fini &#224; l&#8217;article&#160;216 du code g&#233;n&#233;ral des imp&#244;ts, le b&#233;n&#233;fice de l&#8217;exercice mentionn&#233; &#224; l&#8217;alin&#233;a pr&#233;c&#233;dent d&#233;signe le b&#233;n&#233;fice net du groupe, issu des comptes consolid&#233;s.&#160;&#187;</p><p style=\"text-align: justify;\">&#160;</p>",
    "exposeSommaire": "<p style=\"text-align: justify;\">Cet amendement propose d&#8217;ajouter un article au code civil afin de mieux encadrer le versement de dividendes et promouvoir une gestion de long terme des entreprises.</p><p style=\"text-align: justify;\">Il s&#8217;agit notamment de supprimer la possibilit&#233; de verser des dividendes quand l&#8217;entreprise affiche des pertes et de supprimer la possibilit&#233; de verser des dividendes sup&#233;rieurs aux b&#233;n&#233;fices.</p><p style=\"text-align: justify;\">Depuis la crise financi&#232;re on observe une explosion des dividendes vers&#233;s par les entreprises fran&#231;aise. Entre 2009 et 2016, les entreprises du CAC 40 ont vers&#233; 67,4&#160;% de leur b&#233;n&#233;fice en dividendes, ne consacrant que 27,3&#160;% &#224; l&#8217;investissement et seulement 5,3&#160;% en primes d&#8217;int&#233;ressement et de participation pour leurs salari&#233;s. En 2017, la France &#233;tait ainsi le premier pays distributeur en&#160;Europe, loin devant l&#8217;Allemagne.</p><p style=\"text-align: justify;\">La priorit&#233; donn&#233;e &#224; la distribution de dividendes se fait &#233;galement au d&#233;triment de l&#8217;investissement. Entre 2012 et 2014, les entreprises du CAC 40 ont par exemple augment&#233; les dividendes de 44&#160;% tout en diminuant leur capacit&#233; &#224; investir de 34&#160;%. Le Pr&#233;sident Emmanuel Macron en 2014, alors Ministre de l&#8217;&#233;conomie, regrettait lui aussi ce choix en soulignant que les entreprises fran&#231;aises &#171;&#160;[avaient] pr&#233;f&#233;r&#233; servir des dividendes &#224; l&#8217;investissement&#160;&#187;, quand les entreprises allemandes &#171; [avaient] une pr&#233;f&#233;rence continue pour l&#8217;emploi et l&#8217;investissement&#160;&#187;.</p><p style=\"text-align: justify;\">La limitation de ces pratiques de versement de dividendes vis&#233;e par le pr&#233;sent amendement permettrait de promouvoir une gestion de long terme de l&#8217;entreprise et contribuerait &#224; &#171;&#160;rendre les entreprises plus justes&#160;&#187;, ce qui est l&#8217;un des objectifs du projet de loi Pacte.</p>"
  },
  "representations": [
    {
      "nom": "PDF",
      "typeMime": {
        "type": "application",
        "subType": "PDF"
      },
      "statutRepresentation": {
        "verbatim": true,
        "canonique": true,
        "officielle": true,
        "transcription": false,
        "enregistrement": false
      },
      "contenu": {
        "documentURI": "/15/amendements/1237/AN/2423.pdf"
      }
    }
  ],
  "seanceDiscussion": "RUANR5L15S2018IDS21255",
  "sort": {
    "dateSaisie": "2018-09-29T00:44:24.000+02:00",
    "sortEnSeance": "Rejeté"
  },
  "dateDepot": "2018-09-21T02:00:00.000+02:00",
  "dateDistribution": "2018-09-25T02:00:00.000+02:00",
  "article99": "0",
  "loiReference": {
    "codeLoi": "c civil",
    "divisionCodeLoi": "1833"
  }
}