{
  "uid": "AMANR5L15SEA717460BTC0902P0D1N1500",
  "identifiant": {
    "legislature": "15",
    "numero": "1500",
    "numRect": "0",
    "saisine": {
      "texteLegislatifRef": "PRJLANR5L15BTC0902",
      "numeroPartiePLF": "0",
      "organeExamen": "PO717460",
      "mentionSecondeDeliberation": "0"
    }
  },
  "numeroLong": "1500",
  "etapeTexte": "1ère lecture (1ère assemblée saisie)",
  "triAmendement": "djezzzzy",
  "cardinaliteAmdtMultiples": "1",
  "etat": "Discuté",
  "signataires": {
    "auteur": {
      "typeAuteur": "Depute",
      "acteurRef": "PA2377",
      "groupePolitiqueRef": "PO730934"
    },
    "cosignatairesRefs": [
      "PA2377"
    ],
    "texteAffichable": "M.&#160;Perrut"
  },
  "pointeurFragmentTexte": {
    "division": {
      "titre": "Article 9",
      "articleDesignationCourte": "ART. 9",
      "type": "ARTICLE",
      "avantAApres": "A",
      "divisionRattachee": "ARTICLE 9",
      "urlDivisionTexteVise": "/15/textes/0902.asp#D_Article_9"
    },
    "alinea": {
      "avantAApres": "A",
      "numero": "3",
      "alineaDesignation": "Alinéa 3"
    }
  },
  "corps": {
    "dispositif": "<p>&#192; l&#8217;alin&#233;a&#160;3, apr&#232;s le mot&#160;:</p><p>&#171;&#160;promotionnelles&#160;&#187;,</p><p>ins&#233;rer les mots&#160;:</p><p>&#171; financ&#233;es par le distributeur ou le fournisseur&#160;&#187;.</p>",
    "exposeSommaire": "<p style=\"text-align: justify;\">Le texte de loi pourrait &#234;tre plus pr&#233;cis afin de pr&#233;server l&#8217;acquis des EGA, &#224; savoir&#160;: l&#8217;encadrement en valeur et en volume des op&#233;rations promotionnelles qu&#8217;elles soient financ&#233;es par le distributeur et/ou par le fournisseur. De m&#234;me les promotions sur les produits sous marque de distributeur doivent &#234;tre concern&#233;es par l&#8217;encadrement l&#233;gislatif en volume et en valeur. Le dispositif du Seuil de Revente &#224; perte ne concerne que les denr&#233;es alimentaires revendues en l&#8217;&#233;tat. Ainsi les denr&#233;es alimentaires qui subiraient une modification par le distributeur ou qui seraient fabriqu&#233;es par le distributeur ne sont pas concern&#233;es par cet encadrement. Il est donc indispensable de pr&#233;voir pour ces cas pr&#233;cis un encadrement des promotions</p>"
  },
  "representations": [
    {
      "nom": "PDF",
      "typeMime": {
        "type": "application",
        "subType": "PDF"
      },
      "statutRepresentation": {
        "verbatim": true,
        "canonique": true,
        "officielle": true,
        "transcription": false,
        "enregistrement": false
      },
      "contenu": {
        "documentURI": "/15/amendements/0902/AN/1500.pdf"
      }
    }
  ],
  "seanceDiscussion": "RUANR5L15S2018IDS21054",
  "sort": {
    "dateSaisie": "2018-05-25T12:25:27.000+02:00",
    "sortEnSeance": "Non soutenu"
  },
  "dateDepot": "2018-05-17T02:00:00.000+02:00",
  "dateDistribution": "2018-05-21T02:00:00.000+02:00",
  "article99": "0",
  "loiReference": {}
}