{
  "uid": "AMANR5L15PO59048B2272P1D1N222",
  "identifiant": {
    "legislature": "15",
    "numero": "222",
    "numRect": "0",
    "saisine": {
      "texteLegislatifRef": "PRJLANR5L15B2272",
      "numeroPartiePLF": "1",
      "organeExamen": "PO59048",
      "mentionSecondeDeliberation": "0"
    }
  },
  "numeroLong": "I-CF222",
  "etapeTexte": "1ère lecture (1ère assemblée saisie)",
  "triAmendement": "baaaaaaaaaaaaaaaaaaaaaaaaaaaaaaaaaaaaaaaaaaaaaaaaatkaaadi",
  "cardinaliteAmdtMultiples": "1",
  "etat": "Discuté",
  "signataires": {
    "auteur": {
      "typeAuteur": "Depute",
      "acteurRef": "PA330909",
      "groupePolitiqueRef": "PO730934"
    },
    "cosignatairesRefs": [
      "PA330909",
      "PA718884",
      "PA719318",
      "PA334654",
      "PA605036",
      "PA266797",
      "PA767",
      "PA722390",
      "PA642847"
    ],
    "texteAffichable": "M.&#160;Descoeur,  M.&#160;Abad, M.&#160;Straumann, M.&#160;Bazin, Mme&#160;Bazin-Malgras, Mme&#160;Anthoine, Mme&#160;Corneloup, M.&#160;Gosselin et M.&#160;Cattin"
  },
  "pointeurFragmentTexte": {
    "division": {
      "titre": "Article 4",
      "articleDesignationCourte": "ART. 4",
      "type": "ARTICLE",
      "avantAApres": "A",
      "divisionRattachee": "ARTICLE 4",
      "urlDivisionTexteVise": "/15/textes/2272A.asp#D_Article_4"
    },
    "alinea": {
      "avantAApres": "Apres",
      "numero": "84"
    }
  },
  "corps": {
    "dispositif": "<p style=\"text-align: justify;\">Compl&#233;ter cet article par l&#8217;alin&#233;a suivant&#160;:</p><p style=\"text-align: justify;\">&#171;&#160;Avant le d&#233;p&#244;t &#224; l&#8217;Assembl&#233;e nationale du projet de loi de finances pour 2021, le Gouvernement remet au Parlement un rapport &#233;valuant, pour chaque type de travaux b&#233;n&#233;ficiant du cr&#233;dit d&#8217;imp&#244;ts ou de la prime de transition &#233;nerg&#233;tique, le nombre d&#8217;op&#233;rations ayant &#233;t&#233; comptabilis&#233;es, le montant global allou&#233;, la r&#233;duction de la consommation d&#8217;&#233;nergie primaire et les &#233;missions de gaz &#224; effet de serre et de kilowattheure non renouvelables &#233;conomis&#233;s. Sur cette base, ce rapport compare notamment les &#233;missions de gaz &#224; effet de serre &#233;vit&#233;es au regard des aides accord&#233;es pour chaque op&#233;ration, et propose des &#233;volutions des montants forfaitaires des primes et cr&#233;dits d&#8217;imp&#244;ts dans un souci d&#8217;optimisation de la d&#233;pense publique.&#160;&#187;</p>",
    "exposeSommaire": "<p style=\"text-align: justify;\">Principal levier fiscal en faveur de la r&#233;novation &#233;nerg&#233;tique, le cr&#233;dit d&#8217;imp&#244;t pour la transition &#233;nerg&#233;tique contribue depuis plusieurs ann&#233;es &#224; d&#233;clencher des travaux.&#160; Au vu des d&#233;penses engag&#233;es pour ce dispositif et de l&#8217;urgence &#224; agir pour remettre la France sur la trajectoire de ses objectifs de transition &#233;nerg&#233;tique, il est indispensable que les aides accord&#233;es soient orient&#233;es vers les op&#233;rations les plus efficaces pour r&#233;duire la consommation d&#8217;&#233;nergie fossile et les &#233;missions de gaz &#224; effet de serre. Or, les montants forfaitaires pr&#233;vus pour 2020 privil&#233;gient des solutions qui ne sont pas toujours les plus pertinentes du point de vue des r&#233;ductions des &#233;missions de gaz &#224; effet de serre&#160;: le raccordement &#224; un r&#233;seau de chaleur est par exemple nettement moins aid&#233; que l&#8217;installation d&#8217;un po&#234;le &#224; b&#251;che ou granul&#233; (entre 400 et 1200&#160;euros contre entre 1000 et 4000&#160;euros). Pourtant, le raccordement &#224; un r&#233;seau de chaleur est une op&#233;ration plus efficace du point de vue &#233;nerg&#233;tique et aussi co&#251;teuse, voire plus, que l&#8217;installation d&#8217;un po&#234;le &#224; b&#251;che ou &#224; granul&#233;. De mani&#232;re g&#233;n&#233;rale, les &#233;quipements de chauffage individuel sont &#233;galement privil&#233;gi&#233;s par rapport aux solutions de chauffage collectifs, qui peuvent pourtant &#234;tre plus vertueuses pour l&#8217;environnement. Les &#233;quipements de chauffage sont &#233;galement privil&#233;gi&#233;s au d&#233;triment des op&#233;rations d&#8217;isolation, alors que ces derni&#232;res sont les plus pertinentes pour l&#8217;environnement puisqu&#8217;elles permettent de r&#233;duire effectivement la consommation &#233;nerg&#233;tique, l&#8217;&#233;nergie la moins polluante &#233;tant celle qu&#8217;on ne consomme pas.</p><p style=\"text-align: justify;\">Il semble donc indispensable d&#8217;&#233;valuer op&#233;ration par op&#233;ration le niveau des aides accord&#233;es, au regard du co&#251;t de chaque op&#233;ration aid&#233;e et de l&#8217;impact environnemental, afin d&#8217;orienter les aides du CITE et de la prime &#224; la transition &#233;nerg&#233;tique vers les op&#233;rations les plus pertinentes. Cet amendement vise &#224; r&#233;aliser cette &#233;valuation, dans le cadre de l&#8217;&#233;volution du cr&#233;dit d&#8217;imp&#244;t en prime, &#224; la fois pour rationaliser la d&#233;pense publique et pour contribuer plus efficacement &#224; la transition &#233;nerg&#233;tique.</p>"
  },
  "representations": [
    {
      "nom": "PDF",
      "typeMime": {
        "type": "application",
        "subType": "PDF"
      },
      "statutRepresentation": {
        "verbatim": true,
        "canonique": true,
        "officielle": true,
        "transcription": false,
        "enregistrement": false
      },
      "contenu": {
        "documentURI": "/15/amendements/2272A/CION_FIN/CF222.pdf"
      }
    }
  ],
  "sort": {
    "dateSaisie": "2019-10-09T10:57:06.000+02:00",
    "sortEnSeance": "Rejeté"
  },
  "dateDepot": "2019-10-03T02:00:00.000+02:00",
  "dateDistribution": "2019-10-08T02:00:00.000+02:00",
  "article99": "0",
  "loiReference": {}
}