{
  "uid": "AMANR5L15SEA717460BTC1237P0D1N417",
  "identifiant": {
    "legislature": "15",
    "numero": "417",
    "numRect": "0",
    "saisine": {
      "texteLegislatifRef": "PRJLANR5L15BTC1237",
      "numeroPartiePLF": "0",
      "organeExamen": "PO717460",
      "mentionSecondeDeliberation": "0"
    }
  },
  "numeroLong": "417",
  "etapeTexte": "1ère lecture (1ère assemblée saisie)",
  "triAmendement": "deiaaaaaaaaaaaaaaaaaaaaaaaaaaaaaaaaaaaaaaaaaaaaaaabk",
  "cardinaliteAmdtMultiples": "1",
  "etat": "Discuté",
  "signataires": {
    "auteur": {
      "typeAuteur": "Depute",
      "acteurRef": "PA608016",
      "groupePolitiqueRef": "PO730934"
    },
    "cosignatairesRefs": [
      "PA1327",
      "PA1874",
      "PA721474",
      "PA332523",
      "PA721968",
      "PA267260",
      "PA720644",
      "PA267527",
      "PA330909",
      "PA720210",
      "PA608016",
      "PA718884",
      "PA718838",
      "PA721678",
      "PA721506",
      "PA340853",
      "PA2377",
      "PA334149",
      "PA1012",
      "PA346218",
      "PA719318",
      "PA642847",
      "PA336316",
      "PA606712",
      "PA721054",
      "PA608416",
      "PA2492",
      "PA346054",
      "PA609245",
      "PA721816",
      "PA266797",
      "PA334654",
      "PA267204",
      "PA267901",
      "PA709315"
    ],
    "texteAffichable": "Mme&#160;Louwagie,  M.&#160;Bazin, M.&#160;Masson, Mme&#160;Anthoine, Mme&#160;Bazin-Malgras, Mme&#160;Dalloz, M.&#160;Saddier, M.&#160;Lorion, M.&#160;Lurton, M.&#160;Fasquelle, Mme&#160;Kuster, M.&#160;Emmanuel&#160;Maquet, M.&#160;Kamardine, M.&#160;Straumann, M.&#160;Bouchet, M.&#160;Viala, M.&#160;Hetzel, M.&#160;Boucard, M.&#160;Descoeur, M.&#160;Forissier, M.&#160;Brun, Mme&#160;Lacroute, M.&#160;de la Verpilli&#232;re, M.&#160;Perrut, M.&#160;Sermier, M.&#160;Nury, M.&#160;Quentin, M.&#160;Vialay, M.&#160;Le Fur, M.&#160;Leclerc, M.&#160;Reda, M.&#160;Viry, Mme&#160;Beauvais, M.&#160;Gosselin et Mme&#160;Poletti"
  },
  "pointeurFragmentTexte": {
    "division": {
      "titre": "Article 27",
      "articleDesignationCourte": "ART. 27",
      "type": "ARTICLE",
      "avantAApres": "A",
      "divisionRattachee": "ARTICLE 27",
      "urlDivisionTexteVise": "/15/textes/1237.asp#D_Article_27"
    },
    "alinea": {
      "numero": "2"
    }
  },
  "corps": {
    "dispositif": "<p style=\"text-align: justify;\">I.&#160;&#8211;&#160;Apr&#232;s le mot&#160;:</p><p style=\"text-align: justify;\">&#171;&#160;r&#233;dig&#233;e&#160;&#187;,</p><p style=\"text-align: justify;\">r&#233;diger ainsi la fin de l&#8217;alin&#233;a&#160;2&#160;:</p><p style=\"text-align: justify;\">&#171;&#160;500&#160;000&#160;euros. Ce plafond est r&#233;duit des sommes vers&#233;es sur un plan d&#8217;&#233;pargne en actions en application de l&#8217;article L.&#160;221&#8209;30.&#160;&#187;</p><p style=\"text-align: justify;\">II.&#160;&#8211;&#160;Compl&#233;ter cet article par l&#8217;alin&#233;a suivant&#160;:</p><p style=\"text-align: justify;\">&#171;&#160;II.&#160;&#8211;&#160;La perte de recettes pour l&#8217;&#201;tat est compens&#233;e &#224; due concurrence par la cr&#233;ation d&#8217;une taxe additionnelle aux droits mentionn&#233;s aux articles 575 et 575 A du code g&#233;n&#233;ral des imp&#244;ts.&#160;&#187;.</p>",
    "exposeSommaire": "<p style=\"text-align: justify;\">Le pr&#233;sent amendement vise &#224; d&#233;velopper le financement des entreprises via le PEA-PME.</p><p style=\"text-align: justify;\">Le PEA permet d&#8217;acqu&#233;rir un portefeuille d&#8217;actions d&#8217;entreprises&#160;europ&#233;ennes tout en b&#233;n&#233;ficiant d&#8217;une exon&#233;ration d&#8217;imp&#244;t sur le revenu au bout de huit ans. Le plafond des versements est actuellement de&#160;150 000&#160;euros.</p><p style=\"text-align: justify;\">Le PEA-PME a, quant &#224; lui, &#233;t&#233; mis en place en 2014 pour soutenir le financement en fonds propres des PME et des ETI et offrir &#224; tous les fran&#231;ais un outil d&#8217;investisseur, qui leur permette de s&#8217;impliquer dans la vie &#233;conomique et financi&#232;re des entreprises. Il fonctionne comme le PEA mais avec un plafond de versements de 75&#160;000&#160;euros.</p><p style=\"text-align: justify;\">Les r&#233;sultats sont malheureusement d&#233;cevants, le PEA-PME n&#8217;ayant pas suscit&#233; l&#8217;engouement des &#233;pargnants. Alors que l&#8217;objectif affich&#233; &#233;tait de collecter un &#224; deux milliards d&#8217;euros d&#232;s la premi&#232;re ann&#233;e, c&#8217;est au deuxi&#232;me trimestre 2017 que les encours peinent &#224; d&#233;passer un milliard d&#8217;euros.</p><p style=\"text-align: justify;\">Plusieurs freins &#224; l&#8217;attrait du PEA-PME pourraient &#234;tre lev&#233;s pour d&#233;velopper cet outil de financement direct dans les entreprises.</p><p style=\"text-align: justify;\">Ainsi, le montant maximal des versements en num&#233;raire devrait &#234;tre significativement r&#233;&#233;valu&#233; pour rendre le PEA-PME plus attractif et r&#233;pondre mieux aux besoins de financement des entreprises. Le montant propos&#233; s&#8217;inscrit en coh&#233;rence avec le dispositif anglais, l&#8217;Enterprise Investment Scheme.</p><p style=\"text-align: justify;\">&#160;</p>"
  },
  "representations": [
    {
      "nom": "PDF",
      "typeMime": {
        "type": "application",
        "subType": "PDF"
      },
      "statutRepresentation": {
        "verbatim": true,
        "canonique": true,
        "officielle": true,
        "transcription": false,
        "enregistrement": false
      },
      "contenu": {
        "documentURI": "/15/amendements/1237/AN/417.pdf"
      }
    }
  ],
  "seanceDiscussion": "RUANR5L15S2018IDS21255",
  "sort": {
    "dateSaisie": "2018-09-28T22:31:04.000+02:00",
    "sortEnSeance": "Rejeté"
  },
  "dateDepot": "2018-09-19T02:00:00.000+02:00",
  "dateDistribution": "2018-09-25T02:00:00.000+02:00",
  "article99": "0",
  "loiReference": {}
}