{
  "uid": "AMANR5L15SEA717460BTC0369P0D1N11",
  "identifiant": {
    "legislature": "15",
    "numero": "11",
    "numRect": "0",
    "saisine": {
      "texteLegislatifRef": "PRJLANR5L15BTC0369",
      "numeroPartiePLF": "0",
      "organeExamen": "PO717460",
      "mentionSecondeDeliberation": "0"
    }
  },
  "numeroLong": "11",
  "etapeTexte": "1ère lecture (1ère assemblée saisie)",
  "triAmendement": "acnyi",
  "cardinaliteAmdtMultiples": "1",
  "etat": "Discuté",
  "signataires": {
    "auteur": {
      "typeAuteur": "Depute",
      "acteurRef": "PA856",
      "groupePolitiqueRef": "PO730934"
    },
    "cosignatairesRefs": [
      "PA267794",
      "PA266808",
      "PA720386",
      "PA608416",
      "PA332523",
      "PA336316",
      "PA267260",
      "PA267324",
      "PA721506",
      "PA330240",
      "PA721286",
      "PA2960",
      "PA267204",
      "PA266776",
      "PA1029",
      "PA923",
      "PA605991",
      "PA609245",
      "PA334654",
      "PA720630",
      "PA346218",
      "PA267200",
      "PA609726",
      "PA346054",
      "PA2377",
      "PA334843",
      "PA342935",
      "PA1695",
      "PA330788",
      "PA2796",
      "PA767",
      "PA720644",
      "PA330909",
      "PA718838",
      "PA2492",
      "PA608016",
      "PA721314",
      "PA720210",
      "PA267735",
      "PA722390",
      "PA606712",
      "PA267289",
      "PA712015",
      "PA719946",
      "PA606098",
      "PA330008",
      "PA1630",
      "PA720100",
      "PA608826",
      "PA718884",
      "PA267429",
      "PA267318",
      "PA856",
      "PA998",
      "PA718784",
      "PA266797",
      "PA267378",
      "PA721410",
      "PA643103",
      "PA719272",
      "PA1327",
      "PA721636",
      "PA607090",
      "PA721054",
      "PA266774",
      "PA719318",
      "PA266793",
      "PA1498",
      "PA746",
      "PA642847",
      "PA718780",
      "PA1012",
      "PA267527",
      "PA721126",
      "PA721816",
      "PA334149",
      "PA720684",
      "PA721968",
      "PA721474",
      "PA1874",
      "PA267901",
      "PA2529",
      "PA720586",
      "PA345722",
      "PA267440",
      "PA340853",
      "PA605036",
      "PA709315",
      "PA643134",
      "PA267785",
      "PA2155",
      "PA2086",
      "PA721046",
      "PA223837",
      "PA721678",
      "PA330684"
    ],
    "texteAffichable": "M.&#160;Cherpion,  M.&#160;Viry, M.&#160;Jacob, M.&#160;Abad, Mme&#160;Anthoine, M.&#160;Aubert, Mme&#160;Bassire, M.&#160;Bazin, Mme&#160;Bazin-Malgras, Mme&#160;Beauvais, Mme&#160;Bonnivard, M.&#160;Bony, M.&#160;Boucard, M.&#160;Bouchet, Mme&#160;Val&#233;rie&#160;Boyer, M.&#160;Breton, M.&#160;Brochand, M.&#160;Brun, M.&#160;Carrez, M.&#160;Cattin, M.&#160;Cinieri, M.&#160;Ciotti, Mme&#160;Corneloup, M.&#160;Cornut-Gentille, Mme&#160;Dalloz, M.&#160;Dassault, M.&#160;de Ganay, M.&#160;de la Verpilli&#232;re, M.&#160;Deflesselles, M.&#160;Descoeur, M.&#160;Di Filippo, M.&#160;Diard, M.&#160;Dive, M.&#160;Door, Mme&#160;Marianne&#160;Dubois, Mme&#160;Duby-Muller, M.&#160;Pierre-Henri&#160;Dumont, M.&#160;Fasquelle, M.&#160;Ferrara, M.&#160;Forissier, M.&#160;Furst, M.&#160;Gaultier, Mme&#160;Genevard, M.&#160;Goasguen, M.&#160;Gosselin, M.&#160;Grelier, Mme&#160;Guion-Firmin, M.&#160;Herbillon, M.&#160;Hetzel, M.&#160;Huyghe, M.&#160;Kamardine, Mme&#160;Kuster, Mme&#160;Lacroute, M.&#160;Larriv&#233;, M.&#160;Le Fur, Mme&#160;Le Grip, M.&#160;Leclerc, Mme&#160;Levy, M.&#160;Lorion, Mme&#160;Louwagie, M.&#160;Lurton, M.&#160;Emmanuel&#160;Maquet, M.&#160;Marleix, M.&#160;Marlin, M.&#160;Masson, M.&#160;Menuel, Mme&#160;Meunier, M.&#160;Minot, M.&#160;Nury, M.&#160;Parigi, M.&#160;Pauget, M.&#160;Peltier, M.&#160;Perrut, Mme&#160;Poletti, M.&#160;Pradi&#233;, M.&#160;Quentin, M.&#160;Ramadier, M.&#160;Reda, M.&#160;Reiss, M.&#160;Reitzer, M.&#160;Reyn&#232;s, M.&#160;Rolland, M.&#160;Saddier, M.&#160;Schellenberger, M.&#160;Sermier, M.&#160;Straumann, Mme&#160;Tabarot, M.&#160;Teissier, Mme&#160;Trastour-Isnart, Mme&#160;Valentin, M.&#160;Vatin, M.&#160;Verch&#232;re, M.&#160;Viala, M.&#160;Vialay, M.&#160;Jean-Pierre&#160;Vigier et M.&#160;Woerth"
  },
  "pointeurFragmentTexte": {
    "division": {
      "titre": "Article 2",
      "articleDesignationCourte": "ART. 2",
      "type": "ARTICLE",
      "avantAApres": "A",
      "divisionRattachee": "ARTICLE 2",
      "urlDivisionTexteVise": "/15/textes/0369.asp#D_Article_2"
    },
    "alinea": {
      "avantAApres": "Apres",
      "numero": "9"
    }
  },
  "corps": {
    "dispositif": "<p style=\"text-align: justify;\">Apr&#232;s l'alin&#233;a 9, ins&#233;rer les deux alin&#233;as suivants&#160;:</p><p style=\"text-align: justify;\">&#171;&#160;3&#176;&#160;<i>bis</i>&#160;Le II de l&#8217;article L.&#160;2254&#8209;2 est&#160;compl&#233;t&#233; par un alin&#233;a 4&#176; ainsi r&#233;dig&#233;&#160;:&#160;</p><p style=\"text-align: justify;\">&#171;4&#176;&#160;Les modalit&#233;s d&#8217;accompagnement des salari&#233;s mentionn&#233;s au V, ainsi que l&#8217;abondement du compte personnel de formation au-del&#224; des limites d&#233;finies par le d&#233;cret mentionn&#233; au VI du pr&#233;sent article.&#160;&#187;</p>",
    "exposeSommaire": "<p style=\"text-align: justify;\">L&#8217;article&#160;3 de l&#8217;ordonnance n&#176; 2017&#8209;1385 fusionne les accords de pr&#233;servation et de d&#233;veloppement de l&#8217;emploi (APDE), de maintien dans l&#8217;emploi (AME), de r&#233;duction du temps de travail et de mobilit&#233; interne, au profit d&#8217;un nouveau type d&#8217;accord destin&#233; &#224; &#171;&#160;r&#233;pondre aux n&#233;cessit&#233;s li&#233;es au fonctionnement de l&#8217;entreprise ou en vue de pr&#233;server, ou de d&#233;velopper l&#8217;emploi&#160;&#187;. Il s&#8217;agit d&#8217;une harmonisation bienvenue des diff&#233;rents accords pouvant primer sur le contrat de travail.&#160;</p><p style=\"text-align: justify;\">Pour rendre le dispositif plus souple, le Gouvernement a fait le choix de retenir un motif de licenciement sui g&#233;n&#233;ris qui constitue une cause r&#233;elle et s&#233;rieuse et qui ob&#233;it aux r&#232;gles du licenciement pour motif personnel, sans toutefois pr&#233;voir de dispositif sp&#233;cifique d&#8217;accompagnement pour les salari&#233;s refusant de se voir appliquer l&#8217;accord, contrairement &#224; ce qui &#233;tait pr&#233;vu dans les accords APDE. Est simplement pr&#233;vu un abondement du CPF &#224; hauteur de 100 heures.&#160;</p><p style=\"text-align: justify;\">Pour aller au bout de la logique de n&#233;gociation encourag&#233;e par ce dispositif, il convient de faire de l&#8217;accompagnement des salari&#233;s refusant l&#8217;accord, une modalit&#233; de l&#8217;accord de comp&#233;titivit&#233;. Il s&#8217;agit de donner la possibilit&#233; &#224; l&#8217;employeur d&#8217;aller plus loin que le simple abondement du compte &#224; hauteur de 100 heures.</p>"
  },
  "representations": [
    {
      "nom": "PDF",
      "typeMime": {
        "type": "application",
        "subType": "PDF"
      },
      "statutRepresentation": {
        "verbatim": true,
        "canonique": true,
        "officielle": true,
        "transcription": false,
        "enregistrement": false
      },
      "contenu": {
        "documentURI": "/15/amendements/0369/AN/11.pdf"
      }
    }
  ],
  "seanceDiscussion": "RUANR5L15S2018IDS20776",
  "sort": {
    "dateSaisie": "2017-11-22T17:04:40.000+01:00",
    "sortEnSeance": "Adopté"
  },
  "dateDepot": "2017-11-16T01:00:00.000+01:00",
  "dateDistribution": "2017-11-20T01:00:00.000+01:00",
  "article99": "0",
  "loiReference": {}
}