{
  "uid": "AMANR5L15PO59051B1106P0D1N128",
  "identifiant": {
    "legislature": "15",
    "numero": "128",
    "numRect": "0",
    "saisine": {
      "texteLegislatifRef": "PRJLANR5L15B1106",
      "numeroPartiePLF": "0",
      "organeExamen": "PO59051",
      "mentionSecondeDeliberation": "0"
    }
  },
  "numeroLong": "CL128",
  "etapeTexte": "Nouvelle Lecture",
  "triAmendement": "co",
  "cardinaliteAmdtMultiples": "1",
  "etat": "Discuté",
  "signataires": {
    "auteur": {
      "typeAuteur": "Depute",
      "acteurRef": "PA335054",
      "groupePolitiqueRef": "PO730946"
    },
    "cosignatairesRefs": [
      "PA335054",
      "PA340343",
      "PA1592",
      "PA608695"
    ],
    "texteAffichable": "Mme&#160;Karamanli,  Mme&#160;Untermaier, M.&#160;Saulignac, M.&#160;David&#160;Habib et les membres du groupe Nouvelle Gauche"
  },
  "pointeurFragmentTexte": {
    "division": {
      "titre": "Article 6",
      "articleDesignationCourte": "ART. 6",
      "type": "ARTICLE",
      "avantAApres": "A",
      "divisionRattachee": "ARTICLE 6",
      "urlDivisionTexteVise": "/15/textes/1106.asp#D_Article_6"
    },
    "alinea": {
      "avantAApres": "A",
      "numero": "7",
      "alineaDesignation": "Alinéa 7"
    }
  },
  "corps": {
    "dispositif": "<p style=\"text-align: justify;\">Substituer aux alin&#233;as 7 &#224; 15 l&#8217;alin&#233;a suivant</p><p style=\"text-align: justify;\">&#171;&#160;2&#176;&#160;Le deuxi&#232;me alin&#233;a de l&#8217;article L.&#160;733&#8209;1 est supprim&#233;.&#160;&#187;</p>",
    "exposeSommaire": "<p>L&#8217;organisation des audiences par visio-conf&#233;rence est pr&#233;judiciable aux droits de la d&#233;fense. Dans tous les cas, l&#8217;avocat perdra soit le b&#233;n&#233;fice d&#8217;une pr&#233;sence &#224; l&#8217;audience soit celui d&#8217;&#234;tre aux c&#244;t&#233;s du requ&#233;rant. Dans tous les cas &#233;galement, ces moyens de communication audiovisuelle pr&#233;sentent des d&#233;fauts techniques peu compatibles avec l&#8217;exigence d&#8217;un proc&#232;s &#233;quitable. Dans certains cas encore, les raisons qui motivent la demande d&#8217;asile sont d&#233;licates &#224; exprimer en particulier lorsqu&#8217;il est question de violence ou de s&#233;vices sexuelles et la communication audiovisuelle peut naturellement avoir pour effet d&#8217;inhiber les requ&#233;rants concern&#233;s.&#160;</p><p>Pour ces raisons, cet amendement pr&#233;voit de supprimer la possibilit&#233; d&#8217;organiser des audiences par un moyen de communication audiovisuelle.</p><p>&#160;</p><p>&#160;</p>"
  },
  "representations": [
    {
      "nom": "PDF",
      "typeMime": {
        "type": "application",
        "subType": "PDF"
      },
      "statutRepresentation": {
        "verbatim": true,
        "canonique": true,
        "officielle": true,
        "transcription": false,
        "enregistrement": false
      },
      "contenu": {
        "documentURI": "/15/amendements/1106/CION_LOIS/CL128.pdf"
      }
    }
  ],
  "sort": {
    "dateSaisie": "2018-07-11T10:48:20.000+02:00",
    "sortEnSeance": "Tombé"
  },
  "dateDepot": "2018-07-06T02:00:00.000+02:00",
  "dateDistribution": "2018-07-09T02:00:00.000+02:00",
  "article99": "0",
  "loiReference": {}
}