{
  "uid": "AMANR5L15PO59048B1255P1D1N367",
  "identifiant": {
    "legislature": "15",
    "numero": "367",
    "numRect": "0",
    "saisine": {
      "texteLegislatifRef": "PRJLANR5L15B1255",
      "numeroPartiePLF": "1",
      "organeExamen": "PO59048",
      "mentionSecondeDeliberation": "0"
    }
  },
  "numeroLong": "I-CF367",
  "etapeTexte": "1ère lecture (1ère assemblée saisie)",
  "triAmendement": "eoaaaaaaaaaaaaaaaaaaaaaaaaaaaaaaaaaaaaaaaaaaaaaaaabbbddi",
  "cardinaliteAmdtMultiples": "1",
  "etat": "Discuté",
  "signataires": {
    "auteur": {
      "typeAuteur": "Depute",
      "acteurRef": "PA721410",
      "groupePolitiqueRef": "PO730934"
    },
    "cosignatairesRefs": [
      "PA608826",
      "PA609726",
      "PA267527",
      "PA718838",
      "PA267289",
      "PA643134",
      "PA608416",
      "PA721410"
    ],
    "texteAffichable": "Mme&#160;Bonnivard,  M.&#160;Hetzel, M.&#160;Brun, M.&#160;Aubert, M.&#160;Door, Mme&#160;Duby-Muller, Mme&#160;Valentin et M.&#160;Saddier"
  },
  "pointeurFragmentTexte": {
    "division": {
      "titre": "Article 19",
      "articleDesignationCourte": "APRÈS ART. 19",
      "type": "ARTICLE",
      "avantAApres": "Apres",
      "divisionRattachee": "APRÈS L'ARTICLE 19, insérer l'article suivant:",
      "articleAdditionnel": "1",
      "urlDivisionTexteVise": "/15/textes/1255A.asp#D_Article_19"
    }
  },
  "corps": {
    "dispositif": "<p style=\"text-align: justify;\">I. Une fraction du produit de la taxe int&#233;rieure de consommation sur les produits &#233;nerg&#233;tiques pr&#233;vue &#224; l&#8217;article&#160;265 du code des douanes revenant &#224; l&#8217;&#201;tat est attribu&#233;e aux collectivit&#233;s territoriales ou leurs groupements ayant adopt&#233; un plan climat-air-&#233;nergie territorial conform&#233;ment au I de l&#8217;article L.&#160;229&#8209;26 du code de l&#8217;environnement.</p><p style=\"text-align: justify;\">Cette fraction est calcul&#233;e de mani&#232;re &#224; ce que le montant vers&#233; &#224; chaque collectivit&#233; concern&#233;e s&#8217;&#233;l&#232;ve &#224; 10&#160;&#8364; par habitant.</p><p style=\"text-align: justify;\">II. &#8211; Une fraction du produit de la taxe int&#233;rieure de consommation sur les produits &#233;nerg&#233;tiques pr&#233;vue &#224; l&#8217;article&#160;265 du code des douanes revenant &#224; l&#8217;&#201;tat est attribu&#233;e aux collectivit&#233;s territoriales ayant adopt&#233; un sch&#233;ma r&#233;gional du climat, de l&#8217;air et de l&#8217;&#233;nergie conform&#233;ment &#224; l&#8217;article L.&#160;222&#8209;1 du code de l&#8217;environnement ou un sch&#233;ma r&#233;gional d&#8217;am&#233;nagement, de d&#233;veloppement durable et d&#8217;&#233;galit&#233; des territoires conform&#233;ment &#224; l&#8217;article L.&#160;4251&#8209;1 du code g&#233;n&#233;ral des collectivit&#233;s territoriales.</p><p style=\"text-align: justify;\">Cette fraction est calcul&#233;e de mani&#232;re &#224; ce que le montant vers&#233; &#224; chaque collectivit&#233; concern&#233;e s&#8217;&#233;l&#232;ve &#224; 5&#160;&#8364; par habitant.</p><p style=\"text-align: justify;\">III. &#8211; La perte de recettes r&#233;sultant pour l&#8217;&#201;tat du I et du II ci-dessus est compens&#233;e, &#224; due concurrence, par la cr&#233;ation d&#8217;une taxe additionnelle aux droits pr&#233;vus aux articles 575 et 575 A du code g&#233;n&#233;ral des imp&#244;ts.</p>",
    "exposeSommaire": "<p style=\"text-align: justify;\">La loi de transition &#233;nerg&#233;tique a fix&#233; des objectifs pr&#233;cis et ambitieux (r&#233;duction de 40&#160;% des &#233;missions de gaz &#224; effet de serre, r&#233;duction de 50&#160;% de la consommation d&#8217;&#233;nergie finale, augmentation &#224; 32&#160;% de la part des &#233;nergies renouvelables dans la consommation d&#8217;&#233;nergie, r&#233;novation &#233;nerg&#233;tique de 500 000 logements par an &#224; partir de 2017).</p><p style=\"text-align: justify;\">&#160;</p><p style=\"text-align: justify;\">Cependant, force est de constater que le risque que ces objectifs nationaux vot&#233;s par une grande majorit&#233; des parlementaires ne soient pas atteints est important, &#224; la fois en raison des prix bas de l&#8217;&#233;nergie et en raison du manque de moyens financiers des acteurs potentiels de la transition &#233;nerg&#233;tique.</p><p style=\"text-align: justify;\">&#160;</p><p style=\"text-align: justify;\">En France, l&#8217;&#233;laboration et la mise en &#339;uvre des Plans Climat-Air-&#201;nergie territoriaux (PCAET) &#224; l&#8217;&#233;chelle des intercommunalit&#233;s et du volet &#233;nergie des Sch&#233;mas R&#233;gionaux d&#8217;Am&#233;nagement et de D&#233;veloppement Durable et d&#8217;&#201;galit&#233; des Territoires (SRADDET) &#224; l&#8217;&#233;chelle des r&#233;gions doivent permettre de structurer cette mise en mouvement g&#233;n&#233;ralis&#233;e des territoires en faveur de la transition &#233;nerg&#233;tique.</p><p style=\"text-align: justify;\">&#160;</p><p style=\"text-align: justify;\">Mais les collectivit&#233;s comp&#233;tentes (EPCI, R&#233;gion) se sont vues transf&#233;rer de nouvelles comp&#233;tences sans aucun transfert de moyens. Sans moyens, ces plans et sch&#233;mas ne pourront &#234;tre mis en &#339;uvre et risquent de rester en grande partie &#224; l&#8217;&#233;tat d&#8217;intention. Ce risque est aggrav&#233; en cette p&#233;riode de restriction budg&#233;taire et de r&#233;forme des finances publiques locales privant quasiment de toute marge de man&#339;uvre les collectivit&#233;s.</p><p style=\"text-align: justify;\">&#160;</p><p style=\"text-align: justify;\">Si l&#8217;&#233;laboration d&#8217;un plan ou sch&#233;ma co&#251;te environ 1&#160;euro/habitant, sa mise en &#339;uvre &#224; l&#8217;&#233;chelle du territoire co&#251;te 100 &#224; 200&#160;euros/habitant. L&#8217;atteinte des objectifs de ces documents de planification suppose en effet des actions importantes et co&#251;teuses pour les collectivit&#233;s&#160;: r&#233;novation &#233;nerg&#233;tique de leur propre patrimoine (rendue obligatoire par la loi de transition &#233;nerg&#233;tique pour les b&#226;timents &#224; usage tertiaire), accompagnement de la r&#233;novation des particuliers (notamment via la mise en place des Plateformes Territoriales de la R&#233;novation &#201;nerg&#233;tique, qui doivent couvrir l&#8217;ensemble du territoire d&#8217;apr&#232;s la loi de transition &#233;nerg&#233;tique, et dont le financement est assur&#233; en partie par les collectivit&#233;s), d&#233;veloppement de projets d&#8217;&#233;nergies&#160;renouvelables &#233;lectriques et thermiques&#8230;</p><p style=\"text-align: justify;\">&#160;</p><p style=\"text-align: justify;\">Dans le m&#234;me temps, la loi de finances pour 2018 a act&#233; une acc&#233;l&#233;ration de l&#8217;augmentation de la Contribution Climat &#201;nergie (CCE), qui atteindra 86&#160;&#8364;/t CO2 en 2022. La CCE est pass&#233;e de 30 &#224; 44,6&#160;&#8364;/t de CO2 cette ann&#233;e, ce qui a g&#233;n&#233;r&#233; environ plus de 2 milliards d&#8217;euros de recettes suppl&#233;mentaires, portant la CCE &#224; environ 8 milliards d&#8217;euros au total. Alors que l&#8217;impact de cette fiscalit&#233; sur le budget des fran&#231;ais commence d&#233;j&#224; &#224; susciter des r&#233;actions, le niveau de pr&#233;l&#232;vement est appel&#233; &#224; presque doubler d&#8217;ici 2022 (plus de 15 milliards d&#8217;euros de recettes). Si rien n&#8217;est fait pour donner plus de coh&#233;rence &#224; cette fiscalit&#233; en consacrant une part significative aux financements des actions qui permettront de r&#233;duire la consommation d&#8217;&#233;nergie fossile, celle-ci risque de rencontrer une tr&#232;s vive opposition.</p><p style=\"text-align: justify;\">&#160;</p><p style=\"text-align: justify;\">&#160;</p><p style=\"text-align: justify;\">&#160;</p><table style=\"border-collapse: collapse; height: 117px; width: 657px;\"><tbody><tr><td style=\"white-space: normal; border: 1px solid #000000; width: 138.667px; text-align: center;\">Trajectoire d'augmentation</td><td style=\"white-space: normal; border: 1px solid #000000; width: 291.333px; text-align: center;\">de la contribution</td><td style=\"white-space: normal; border: 1px solid #000000; width: 215px; text-align: center;\">Climat Energie</td></tr><tr><td style=\"white-space: normal; border: 1px solid #000000; width: 138.667px; text-align: center;\">Ann&#233;e</td><td style=\"white-space: normal; border: 1px solid #000000; width: 291.333px; text-align: center;\">Taux de CCE</td><td style=\"white-space: normal; border: 1px solid #000000; width: 215px; text-align: center;\">Recettes</td></tr><tr><td style=\"white-space: normal; border: 1px solid #000000; width: 138.667px; text-align: center;\">2018</td><td style=\"white-space: normal; border: 1px solid #000000; width: 291.333px; text-align: center;\">44,6 &#8364;/t CO2</td><td style=\"white-space: normal; border: 1px solid #000000; width: 215px; text-align: center;\">8 milliards &#8364;</td></tr><tr><td style=\"white-space: normal; border: 1px solid #000000; width: 138.667px; text-align: center;\">2019</td><td style=\"white-space: normal; border: 1px solid #000000; width: 291.333px; text-align: center;\">&#160;55 &#8364;/t CO2</td><td style=\"white-space: normal; border: 1px solid #000000; width: 215px; text-align: center;\">9,8 milliards &#8364;&#160;</td></tr><tr><td style=\"white-space: normal; border: 1px solid #000000; width: 138.667px; text-align: center;\">2020</td><td style=\"white-space: normal; border: 1px solid #000000; width: 291.333px; text-align: center;\">65,4 &#8364;&#160;/t CO2</td><td style=\"white-space: normal; border: 1px solid #000000; width: 215px; text-align: center;\">11,7 milliards &#8364;&#160;</td></tr><tr><td style=\"white-space: normal; border: 1px solid #000000; width: 138.667px; text-align: center;\">2021</td><td style=\"white-space: normal; border: 1px solid #000000; width: 291.333px; text-align: center;\">&#160;75,8 &#8364;/t CO2</td><td style=\"white-space: normal; border: 1px solid #000000; width: 215px; text-align: center;\">13,56 milliards &#8364;&#160;</td></tr><tr><td style=\"white-space: normal; border: 1px solid #000000; width: 138.667px; text-align: center;\">2022</td><td style=\"white-space: normal; border: 1px solid #000000; width: 291.333px; text-align: center;\">86,20 &#8364;/t CO2&#160;</td><td style=\"white-space: normal; border: 1px solid #000000; width: 215px; text-align: center;\">15 milliards &#8364;&#160;</td></tr></tbody></table><p style=\"text-align: justify;\">&#160;</p><p style=\"text-align: justify;\">Les associations de collectivit&#233;s (AMORCE, AdCF, France Urbaine, R&#233;gions de France&#8230;) et plusieurs ONG proposent donc de doter les EPCI et les r&#233;gions d&#8217;une partie des recettes g&#233;n&#233;r&#233;es par cette augmentation de la fiscalit&#233; sur le carbone. Cette dotation donnerait droit &#224; un versement de 10&#160;euros par habitant aux EPCI ayant adopt&#233; un PCAET, ou de 5&#160;euros par habitant aux R&#233;gions ayant adopt&#233; un SRCAE ou un SRADDET. Son versement pourrait &#234;tre conditionn&#233; par des engagements concrets des collectivit&#233;s b&#233;n&#233;ficiaires sur leurs actions en faveur de la transition &#233;nerg&#233;tique. Cette mesure a &#233;t&#233; adopt&#233;e &#224; deux reprises par le S&#233;nat en 2016 et 2017.</p><p style=\"text-align: justify;\"><br />&#160;</p>"
  },
  "representations": [
    {
      "nom": "PDF",
      "typeMime": {
        "type": "application",
        "subType": "PDF"
      },
      "statutRepresentation": {
        "verbatim": true,
        "canonique": true,
        "officielle": true,
        "transcription": false,
        "enregistrement": false
      },
      "contenu": {
        "documentURI": "/15/amendements/1255A/CION_FIN/CF367.pdf"
      }
    }
  ],
  "sort": {
    "dateSaisie": "2018-10-11T09:13:18.000+02:00",
    "sortEnSeance": "Rejeté"
  },
  "dateDepot": "2018-10-04T02:00:00.000+02:00",
  "dateDistribution": "2018-10-09T02:00:00.000+02:00",
  "article99": "0",
  "loiReference": {
    "codeLoi": "douanes",
    "divisionCodeLoi": "265"
  }
}