{
  "uid": "AMANR5L15PO419865B1393P0D1N375",
  "identifiant": {
    "legislature": "15",
    "numero": "375",
    "numRect": "0",
    "saisine": {
      "texteLegislatifRef": "PIONANR5L15B1393",
      "numeroPartiePLF": "0",
      "organeExamen": "PO419865",
      "mentionSecondeDeliberation": "0"
    }
  },
  "numeroLong": "CD375",
  "etapeTexte": "1ère lecture (2ème assemblée saisie)",
  "triAmendement": "diaaaaaaaaaaaaaaaaaaaaaaaaaaaaaaaaaaaaaaaaaaaaaaaair",
  "cardinaliteAmdtMultiples": "1",
  "etat": "Retiré",
  "signataires": {
    "auteur": {
      "typeAuteur": "Depute",
      "acteurRef": "PA721860",
      "groupePolitiqueRef": "PO730964"
    },
    "cosignatairesRefs": [
      "PA722336",
      "PA721600",
      "PA720054",
      "PA719456",
      "PA720590",
      "PA718802",
      "PA606639",
      "PA721296",
      "PA721860",
      "PA718962",
      "PA334116"
    ],
    "texteAffichable": "M.&#160;Cesarini,  Mme&#160;M&#246;rch, Mme&#160;Jacqueline&#160;Maquet, M.&#160;Haury, Mme&#160;Rossi, M.&#160;Gouffier-Cha, M.&#160;Potterie, M.&#160;Zulesi, M.&#160;Vignal, M.&#160;Perea et M.&#160;Thi&#233;baut"
  },
  "pointeurFragmentTexte": {
    "division": {
      "titre": "Article 5",
      "articleDesignationCourte": "ART. 5",
      "type": "ARTICLE",
      "avantAApres": "A",
      "divisionRattachee": "ARTICLE 5",
      "urlDivisionTexteVise": "/15/textes/1393.asp#D_Article_5"
    },
    "alinea": {
      "numero": "2"
    }
  },
  "corps": {
    "dispositif": "<p style=\"text-align: justify;\">&#192; l&#8217;alin&#233;a&#160;2, substituer aux mots&#160;:</p><p style=\"text-align: justify;\">&#171;&#160;le d&#233;partement&#160;&#187;</p><p style=\"text-align: justify;\">les mots&#160;:</p><p style=\"text-align: justify;\">&#171;&#160;la r&#233;gion&#160;&#187;.</p>",
    "exposeSommaire": "<p style=\"text-align: justify;\">Afin d&#8217;avoir une vision d&#8217;ensemble sur les projets port&#233;s, le repr&#233;sentant de l&#8217;&#201;tat en r&#233;gion, &#224; savoir le SGAR, dispose de la vision la plus pertinente pour l&#8217;observation et l&#8217;accompagnement des projets de territoire, en lien avec les outils et instances de concertation des conseils r&#233;gionaux comme les SRADDET, les SRDEII, les CTAP, ...</p>"
  },
  "representations": [
    {
      "nom": "PDF",
      "typeMime": {
        "type": "application",
        "subType": "PDF"
      },
      "statutRepresentation": {
        "verbatim": true,
        "canonique": true,
        "officielle": true,
        "transcription": false,
        "enregistrement": false
      },
      "contenu": {
        "documentURI": "/15/amendements/1393/CION-DVP/CD375.pdf"
      }
    }
  ],
  "dateDepot": "2019-02-01T01:00:00.000+01:00",
  "dateDistribution": "2019-02-05T01:00:00.000+01:00",
  "article99": "0",
  "loiReference": {}
}