{
  "uid": "AMANR5L15SEA717460B1297P0D1N1128",
  "identifiant": {
    "legislature": "15",
    "numero": "1128",
    "numRect": "0",
    "saisine": {
      "texteLegislatifRef": "PRJLANR5L15B1297",
      "numeroPartiePLF": "0",
      "organeExamen": "PO717460",
      "mentionSecondeDeliberation": "0"
    }
  },
  "numeroLong": "1128",
  "etapeTexte": "1ère lecture (1ère assemblée saisie)",
  "triAmendement": "beaaaaaaaaaaaaaaaaaaaaaaaaaaaaaaaaaaaaaaaaaaaaaaaajdi",
  "cardinaliteAmdtMultiples": "1",
  "etat": "Discuté",
  "signataires": {
    "auteur": {
      "typeAuteur": "Depute",
      "acteurRef": "PA267585",
      "groupePolitiqueRef": "PO744425"
    },
    "cosignatairesRefs": [
      "PA642935",
      "PA268019",
      "PA267780",
      "PA712014",
      "PA267241",
      "PA266788",
      "PA695100",
      "PA267355",
      "PA721486",
      "PA332228",
      "PA722030",
      "PA719806",
      "PA642868",
      "PA1960",
      "PA267585",
      "PA267330",
      "PA720230",
      "PA610775",
      "PA721110",
      "PA702052",
      "PA720696"
    ],
    "texteAffichable": "M.&#160;Vercamer,  Mme&#160;Auconie, M.&#160;Becht, M.&#160;Benoit, M.&#160;Bournazel, M.&#160;Christophe, M.&#160;Demilly, Mme&#160;Descamps, Mme&#160;Firmin Le Bodo, M.&#160;Gom&#232;s, M.&#160;Meyer&#160;Habib, M.&#160;Herth, M.&#160;Lagarde, M.&#160;Ledoux, M.&#160;Leroy, Mme&#160;Magnier, M.&#160;Morel-&#192;-L&apos;Huissier, M.&#160;Naegelen, Mme&#160;Sage, Mme&#160;Sanquer et M.&#160;Zumkeller"
  },
  "pointeurFragmentTexte": {
    "division": {
      "titre": "Article 11",
      "articleDesignationCourte": "ART. 11",
      "type": "ARTICLE",
      "avantAApres": "A",
      "divisionRattachee": "ARTICLE 11",
      "urlDivisionTexteVise": "/15/textes/1297.asp#D_Article_11"
    },
    "alinea": {
      "numero": "4"
    }
  },
  "corps": {
    "dispositif": "<p style=\"text-align: justify;\">I.&#160;&#8211;&#160;Apr&#232;s le mot&#160;:</p><p style=\"text-align: justify;\">&#171;&#160;per&#231;us&#160;&#187;,</p><p style=\"text-align: justify;\">r&#233;diger ainsi la fin de l'alin&#233;a 4&#160;:</p><p style=\"text-align: justify;\">&#171;&#160;pendant trois ann&#233;es cons&#233;cutives&#160;&#187;.</p><p style=\"text-align: justify;\">II.&#160;&#8211;&#160;Compl&#233;ter cet article par l&#8217;alin&#233;a suivant&#160;:</p><p style=\"text-align: justify;\">&#171;&#160;III.&#160;&#8211;&#160;La perte de recettes pour les organismes de s&#233;curit&#233; sociale est compens&#233;e &#224; due concurrence par la majoration des droits mentionn&#233;s aux articles 575 et 575 A du code g&#233;n&#233;ral des imp&#244;ts.&#160;&#187;</p>",
    "exposeSommaire": "<p style=\"text-align: justify;\">Le pr&#233;sent amendement vise &#224; accentuer les engagements pris par le Gouvernement afin d&#8217;att&#233;nuer la hausse de la CSG pour les foyers dont les revenus sont &#224; la limite du seuil de revenu d&#233;clenchant le taux normal de CSG.</p><p style=\"text-align: justify;\">Aussi, il est propos&#233; de passer de deux &#224; trois ann&#233;es cons&#233;cutives le nombre d&#8217;ann&#233;es du revenu de r&#233;f&#233;rence des assur&#233;s prises en compte pour l&#8217;application du taux normal de CSG.</p>"
  },
  "representations": [
    {
      "nom": "PDF",
      "typeMime": {
        "type": "application",
        "subType": "PDF"
      },
      "statutRepresentation": {
        "verbatim": true,
        "canonique": true,
        "officielle": true,
        "transcription": false,
        "enregistrement": false
      },
      "contenu": {
        "documentURI": "/15/amendements/1297/AN/1128.pdf"
      }
    }
  ],
  "seanceDiscussion": "RUANR5L15S2019IDS21292",
  "sort": {
    "dateSaisie": "2018-10-25T22:37:42.000+02:00",
    "sortEnSeance": "Rejeté"
  },
  "dateDepot": "2018-10-19T02:00:00.000+02:00",
  "dateDistribution": "2018-10-22T02:00:00.000+02:00",
  "article99": "0",
  "loiReference": {}
}