{
  "uid": "AMANR5L15PO59048B2272P2D1N836",
  "identifiant": {
    "legislature": "15",
    "numero": "836",
    "numRect": "0",
    "saisine": {
      "texteLegislatifRef": "PRJLANR5L15B2272",
      "numeroPartiePLF": "2",
      "organeExamen": "PO59048",
      "mentionSecondeDeliberation": "0"
    }
  },
  "numeroLong": "II-CF836",
  "etapeTexte": "1ère lecture (1ère assemblée saisie)",
  "triAmendement": "bdoaaaaaaaaaaaaaaaaaaaaaaaaaaaaaaaaaaaaaaaaaaaaaaaarzzvs",
  "cardinaliteAmdtMultiples": "1",
  "etat": "Discuté",
  "signataires": {
    "auteur": {
      "typeAuteur": "Depute",
      "acteurRef": "PA721202",
      "groupePolitiqueRef": "PO730958"
    },
    "cosignatairesRefs": [
      "PA2150",
      "PA718868",
      "PA720430",
      "PA721226",
      "PA718860",
      "PA720422",
      "PA721960",
      "PA720286",
      "PA722142",
      "PA719676",
      "PA720846",
      "PA719578",
      "PA721062",
      "PA721210",
      "PA588884",
      "PA721202",
      "PA720892"
    ],
    "texteAffichable": "M.&#160;Coquerel,  Mme&#160;Autain, M.&#160;Bernalicis, M.&#160;Corbi&#232;re, Mme&#160;Fiat, M.&#160;Lachaud, M.&#160;Larive, M.&#160;M&#233;lenchon, Mme&#160;Obono, Mme&#160;Panot, M.&#160;Prud&apos;homme, M.&#160;Quatennens, M.&#160;Ratenon, Mme&#160;Ressiguier, Mme&#160;Rubin, M.&#160;Ruffin et Mme&#160;Taurine"
  },
  "pointeurFragmentTexte": {
    "missionVisee": {
      "idMissionAN": "823",
      "libelleMission": "Relations avec les collectivités territoriales",
      "codeMissionPLF": "B",
      "libelleMissionPLF": "Répartition, par mission et programme, des crédits du budget général"
    },
    "division": {
      "titre": "Article 78",
      "articleDesignationCourte": "APRÈS ART. 78",
      "type": "ARTICLE",
      "avantAApres": "Apres",
      "divisionRattachee": "APRÈS L'ARTICLE 78, insérer l'article suivant:",
      "articleAdditionnel": "1",
      "urlDivisionTexteVise": "/15/textes/2272C.asp#D_Article_78"
    }
  },
  "corps": {
    "dispositif": "<p style=\"text-align: justify;\">Le chapitre&#160;VI du titre&#160;III du livre&#160;III de la deuxi&#232;me partie du code g&#233;n&#233;ral des collectivit&#233;s territoriales est ainsi modifi&#233;&#160;:</p><p style=\"text-align: justify;\">1&#176;&#160;Le&#160;1 du&#160;II de l&#8217;article L.&#160;2336&#8209;1 est compl&#233;t&#233; par les mots&#160;: &#171;&#160;ainsi que, &#224; partir de l&#8217;ann&#233;e civile 2021, &#224; hauteur de 100 millions d&#8217;euros par an, par la cr&#233;ation d&#8217;une taxe additionnelle aux droits mentionn&#233;s aux articles&#160;575 et&#160;575&#160;A du code g&#233;n&#233;ral des imp&#244;ts&#160;;&#160;&#187;&#160;;</p><p style=\"text-align: justify;\">2&#176;&#160;Le&#160;2&#176;&#160;du&#160;I de l&#8217;article L.&#160;2336&#8209;3 du code g&#233;n&#233;ral des collectivit&#233;s territoriales est compl&#233;t&#233; par un&#160;<i>c</i> ainsi r&#233;dig&#233;&#160;:</p><p style=\"text-align: justify;\">&#171;&#160;<i>c)</i> De l&#8217;&#233;cart relatif entre le revenu par habitant de l&#8217;ensemble intercommunal ou le revenu par habitant de la commune isol&#233;e, d&#8217;une part, et le revenu par habitant m&#233;dian, d&#8217;autre part. Le revenu pris en compte est le dernier revenu fiscal de r&#233;f&#233;rence connu. La population prise en compte est celle issue du dernier recensement.&#160;&#187;</p>",
    "exposeSommaire": "<p style=\"text-align: justify;\">Cet amendement pr&#233;voit un renforcement de la p&#233;r&#233;quation au niveau territorial et donc de la redistribution financi&#232;re entre collectivit&#233;s.</p><p style=\"text-align: justify;\">A cet effet, &#224; partir de 2021, nous proposons que le fonds de p&#233;r&#233;quation des collectivit&#233;s soit abond&#233; d&#8217;une nouvelle recette ext&#233;rieure qui ne soit plus une seule redistribution du produit fiscal autonome des collectivit&#233;s, tel que pr&#233;vu par le 1) de cet amendement.</p><p style=\"text-align: justify;\">En outre, le 2) pr&#233;voit que d&#8217;autres crit&#232;res soient pris en compte pour &#233;tablir le caract&#232;re de collectivit&#233;s b&#233;n&#233;ficiaires, &#224; savoir la prise en compte non plus uniquement du revenu fiscal moyen des habitants, qui peut cacher de nombreuses in&#233;galit&#233;s, mais du revenu fiscal m&#233;dian des habitants.</p><p style=\"text-align: justify;\">La p&#233;r&#233;quation est un outil indispensable &#224; l&#8217;&#233;galit&#233; r&#233;elle entre les collectivit&#233;s territoriales. Les fonds qui lui sont allou&#233;s doivent ainsi &#234;tre renforc&#233;s. Mais il faut &#233;galement l&#8217;organiser sur la base de crit&#232;res plus justes. Notre amendement permet de r&#233;pondre &#224; ces deux enjeux&#160;!</p><p style=\"text-align: justify;\">A l&#8217;heure o&#249; le Gouvernement d&#233;mant&#232;le la fiscalit&#233; locale, il est plus que jamais indispensable de renforcer ce pilier essentiel&#160;&#224; l&#8217;&#233;galit&#233; territoriale&#160;qu&#8217;est la p&#233;r&#233;quation&#160;! C&#8217;est le sens de notre amendement.</p>"
  },
  "representations": [
    {
      "nom": "PDF",
      "typeMime": {
        "type": "application",
        "subType": "PDF"
      },
      "statutRepresentation": {
        "verbatim": true,
        "canonique": true,
        "officielle": true,
        "transcription": false,
        "enregistrement": false
      },
      "contenu": {
        "documentURI": "/15/amendements/2272C/CION_FIN/CF836.pdf"
      }
    }
  ],
  "sort": {
    "dateSaisie": "2019-10-24T11:19:42.000+02:00",
    "sortEnSeance": "Non soutenu"
  },
  "dateDepot": "2019-10-21T02:00:00.000+02:00",
  "dateDistribution": "2019-10-24T02:00:00.000+02:00",
  "article99": "0",
  "loiReference": {
    "codeLoi": "CGCT",
    "divisionCodeLoi": "L 2336-1"
  }
}