{
  "uid": "AMANR5L15SEA717460BTC1761P0D1N148",
  "identifiant": {
    "legislature": "15",
    "numero": "148",
    "numRect": "0",
    "saisine": {
      "texteLegislatifRef": "PRJLANR5L15BTC1761",
      "numeroPartiePLF": "0",
      "organeExamen": "PO717460",
      "mentionSecondeDeliberation": "0"
    }
  },
  "numeroLong": "148",
  "etapeTexte": "Nouvelle Lecture",
  "triAmendement": "aakaaaaaacaaaaaaaaaaaaaaaaaaaaaaaaaaaaaaaaaaaaaaaazo",
  "cardinaliteAmdtMultiples": "1",
  "etat": "Discuté",
  "signataires": {
    "auteur": {
      "typeAuteur": "Depute",
      "acteurRef": "PA719608",
      "groupePolitiqueRef": "PO723569"
    },
    "cosignatairesRefs": [
      "PA719608"
    ],
    "texteAffichable": "Mme&#160;M&#233;nard"
  },
  "pointeurFragmentTexte": {
    "division": {
      "titre": "Article 46",
      "articleDesignationCourte": "ART. 46",
      "type": "ARTICLE",
      "avantAApres": "A",
      "divisionRattachee": "ARTICLE 46",
      "urlDivisionTexteVise": "/15/textes/1761.asp#D_Article_46"
    }
  },
  "corps": {
    "dispositif": "<p style=\"text-align: justify;\">Supprimer cet article.</p>",
    "exposeSommaire": "<p style=\"text-align: justify;\">En mai dernier, le ministre de l&#8217;&#201;conomie et des Finances, Bruno Le Maire, avait indiqu&#233; que la cession de parts du capital d&#8217;A&#233;roports de Paris (ADP) pourrait &#234;tre &#171;&#160;l&#8217;op&#233;ration financi&#232;re de privatisation la plus importante dans le monde en 2018&#160;&#187;.</p><p>Et lorsque le fruit de l&#8217;op&#233;ration est estim&#233; &#224; plus de 17 milliards et que l&#8217;&#201;tat a besoin d&#8217;argent frais, on comprend bien que le gouvernement soit tent&#233;.</p><p>Oui mais si cet article est adopt&#233;, ce sera aussi l&#8217;op&#233;ration la plus risqu&#233;e de l&#8217;ann&#233;e car il s&#8217;agira aussi de la privatisation de la premi&#232;re fronti&#232;re de France.</p>"
  },
  "representations": [
    {
      "nom": "PDF",
      "typeMime": {
        "type": "application",
        "subType": "PDF"
      },
      "statutRepresentation": {
        "verbatim": true,
        "canonique": true,
        "officielle": true,
        "transcription": false,
        "enregistrement": false
      },
      "contenu": {
        "documentURI": "/15/amendements/1761/AN/148.pdf"
      }
    }
  ],
  "seanceDiscussion": "RUANR5L15S2019IDS21548",
  "sort": {
    "dateSaisie": "2019-03-14T19:04:59.000+01:00",
    "sortEnSeance": "Rejeté"
  },
  "dateDepot": "2019-03-09T01:00:00.000+01:00",
  "dateDistribution": "2019-03-14T01:00:00.000+01:00",
  "article99": "0",
  "loiReference": {}
}