{
  "uid": "AMANR5L15PO59048B0235P1D1N556",
  "identifiant": {
    "legislature": "15",
    "numero": "556",
    "numRect": "0",
    "saisine": {
      "texteLegislatifRef": "PRJLANR5L15B0235",
      "numeroPartiePLF": "1",
      "organeExamen": "PO59048",
      "mentionSecondeDeliberation": "0"
    }
  },
  "numeroLong": "I-CF556",
  "etapeTexte": "1ère lecture (1ère assemblée saisie)",
  "triAmendement": "bg",
  "cardinaliteAmdtMultiples": "1",
  "etat": "Discuté",
  "signataires": {
    "auteur": {
      "typeAuteur": "Depute",
      "acteurRef": "PA267336",
      "groupePolitiqueRef": "PO730964"
    },
    "cosignatairesRefs": [
      "PA267336"
    ],
    "texteAffichable": "M.&#160;Giraud, rapporteur g&#233;n&#233;ral"
  },
  "pointeurFragmentTexte": {
    "division": {
      "titre": "Article 23",
      "articleDesignationCourte": "ART. 23",
      "type": "ARTICLE",
      "avantAApres": "A",
      "divisionRattachee": "ARTICLE 23",
      "urlDivisionTexteVise": "/15/textes/0235A.asp#D_Article_23"
    },
    "alinea": {
      "numero": "6"
    }
  },
  "corps": {
    "dispositif": "<p>Au sixi&#232;me alin&#233;a, apr&#232;s la r&#233;f&#233;rence&#160;:</p><p>&#171;&#160;d)&#160;&#187;,</p><p>ins&#233;rer les mots&#160;:</p><p>&#171;&#160;une fraction de&#160;&#187;.</p>",
    "exposeSommaire": "<p>Amendement r&#233;dactionnel</p>"
  },
  "representations": [
    {
      "nom": "PDF",
      "typeMime": {
        "type": "application",
        "subType": "PDF"
      },
      "statutRepresentation": {
        "verbatim": true,
        "canonique": true,
        "officielle": true,
        "transcription": false,
        "enregistrement": false
      },
      "contenu": {
        "documentURI": "/15/amendements/0235A/CION_FIN/CF556.pdf"
      }
    }
  ],
  "sort": {
    "dateSaisie": "2017-10-12T13:51:06.000+02:00",
    "sortEnSeance": "Adopté"
  },
  "dateDepot": "2017-10-07T02:00:00.000+02:00",
  "dateDistribution": "2017-10-11T02:00:00.000+02:00",
  "article99": "0",
  "loiReference": {}
}