{
  "uid": "AMANR5L15PO419865B2272P1D1N169",
  "identifiant": {
    "legislature": "15",
    "numero": "169",
    "numRect": "0",
    "saisine": {
      "texteLegislatifRef": "PRJLANR5L15B2272",
      "numeroPartiePLF": "1",
      "organeExamen": "PO419865",
      "mentionSecondeDeliberation": "0"
    }
  },
  "numeroLong": "I-CD169",
  "etapeTexte": "1ère lecture (1ère assemblée saisie)",
  "triAmendement": "miaaaaaaaaaaaaaaaaaaaaaaaaaaaaaaaaaaaaaaaaaaaaaaaapf",
  "cardinaliteAmdtMultiples": "1",
  "etat": "Discuté",
  "signataires": {
    "auteur": {
      "typeAuteur": "Depute",
      "acteurRef": "PA720892",
      "groupePolitiqueRef": "PO730958"
    },
    "cosignatairesRefs": [
      "PA588884",
      "PA721062",
      "PA2150",
      "PA720422",
      "PA718868",
      "PA720846",
      "PA721226",
      "PA719676",
      "PA720892",
      "PA719578",
      "PA721960",
      "PA718860",
      "PA720430",
      "PA721210",
      "PA720286",
      "PA722142",
      "PA721202"
    ],
    "texteAffichable": "Mme&#160;Panot,  Mme&#160;Autain, M.&#160;Bernalicis, M.&#160;Coquerel, M.&#160;Corbi&#232;re, Mme&#160;Fiat, M.&#160;Lachaud, M.&#160;Larive, M.&#160;M&#233;lenchon, Mme&#160;Obono, M.&#160;Prud&apos;homme, M.&#160;Quatennens, M.&#160;Ratenon, Mme&#160;Ressiguier, Mme&#160;Rubin, M.&#160;Ruffin et Mme&#160;Taurine"
  },
  "pointeurFragmentTexte": {
    "division": {
      "titre": "Article 33",
      "articleDesignationCourte": "APRÈS ART. 33",
      "type": "ARTICLE",
      "avantAApres": "Apres",
      "divisionRattachee": "APRÈS L'ARTICLE 33, insérer l'article suivant:",
      "articleAdditionnel": "1",
      "urlDivisionTexteVise": "/15/textes/2272A.asp#D_Article_33"
    }
  },
  "corps": {
    "dispositif": "<p style=\"text-align: justify;\">L&#8217;article&#160;302&#160;<i>bis&#160;</i>MA du code g&#233;n&#233;ral des imp&#244;ts est ainsi modifi&#233;&#160;:</p><p style=\"text-align: justify;\">I.&#160;&#8211;&#160;Le&#160;III est compl&#233;t&#233; par un&#160;3&#176;&#160;ainsi r&#233;dig&#233;&#160;:</p><p style=\"text-align: justify;\">&#171;&#160;3&#176;&#160;La location ou la pose de panneaux publicitaires num&#233;riques.&#160;&#187;</p><p style=\"text-align: justify;\">II.&#160;&#8211;&#160;Le&#160;IV est compl&#233;t&#233; par une phrase ainsi r&#233;dig&#233;e&#160;: &#171;&#160;Le taux de la taxe est fix&#233; &#224; 10&#160;% pour les d&#233;penses relatives au 3&#176;&#160;du III du pr&#233;sent article.&#160;&#187;</p>",
    "exposeSommaire": "<p style=\"text-align: justify;\">15 milliards d&#8217;euros sont investis dans la publicit&#233;. A la t&#233;l&#233;vision, sur internet, dans la presse, dans l&#8217;espace public, dans les centres commerciaux, dans les gares. Dans nos esprits, au final. Pour limiter cette prolif&#233;ration, nous proposons une taxe sur l&#8217;exploitation des &#233;crans publicitaires, afin de d&#233;sinciter le d&#233;veloppement de ce support.</p><p style=\"text-align: justify;\">La plan&#232;te ne sera pas sauv&#233;e, seulement, par des mesures techniques, ni m&#234;me par des injonctions politiques. C&#8217;est une r&#233;volution de l&#8217;imaginaire qui est n&#233;cessaire, de l&#8217;imaginaire social, mais aussi de l&#8217;imaginaire personnel, intime. La publicit&#233;, par ses images, ses slogans, la publicit&#233; est l&#224; pour soutenir cette &#233;quivalence&#160;: avoir, c&#8217;est &#234;tre. On n&#8217;ach&#232;te pas une voiture, mais de l&#8217;amour, de la libert&#233;, de la fiert&#233;, en une promesse jamais tenue, toujours frustr&#233;e. D&#8217;ailleurs, des chercheurs en sciences cognitives alertent quant aux s&#233;quelles de la publicit&#233; sur la sant&#233; mentale&#160;: avec ses images de marques ressass&#233;es, avec ses stimulations positives, la publicit&#233; d&#233;r&#233;gule &#171;&#160;le syst&#232;me de r&#233;compense&#160;&#187;, provoque des troubles psychologiques et psychiatriques, tels que les addictions aux drogues, le jeu compulsif, la d&#233;pression, les troubles du d&#233;ficit de l&#8217;attention. D&#8217;autant plus chez l&#8217;enfant.</p><p style=\"text-align: justify;\">Mais nous voulons surtout pointer l&#8217;exc&#232;s en cours, autour des &#233;crans publicitaires num&#233;riques. Selon le barom&#232;tre unifi&#233; du march&#233; publicitaire, le budget des annonceurs via &#233;crans publicitaires num&#233;riques, rassembl&#233;s sous l&#8217;acronyme de DOOH (Digital Out-Of-Home), a augment&#233; de 16&#160;% entre 2016 et 2017, de 22&#160;% entre 2017 et 2018. Au premier trimestre 2019, l&#8217;expansion &#233;tait d&#233;j&#224; de 33&#160;% par rapport &#224; l&#8217;ann&#233;e pr&#233;c&#233;dente.</p><p style=\"text-align: justify;\">Ces &#233;crans constituent un gaspillage &#233;nerg&#233;tique que la loi Energie Climat n&#8217;a nullement entrav&#233;&#160;: un &#233;cran de 2m&#178; consomme au moins 7000&#160;KWh/an. Soit la consommation d&#8217;un couple avec enfant. Une gabegie tellement &#233;vidente que, dans ses analyses pr&#233;visionnelles, le distributeur d&#8217;&#233;lectricit&#233; RTE parle de consommations &#171;&#160;superflues&#160;&#187; ...</p><p style=\"text-align: justify;\">Ces &#233;crans constituent une pollution lumineuse.&#160;Les &#233;crans num&#233;riques, &#224; base de DEL, &#233;mettent une lumi&#232;re particuli&#232;re, dans la partie bleue du spectre. D&#8217;apr&#232;s l&#8217;Anses elle-m&#234;me, &#171;&#160;la lumi&#232;re bleue est reconnue pour ses effets n&#233;fastes et dangereux sur la r&#233;tine, r&#233;sultant d&#8217;un stress oxydatif cellulaire.&#160;&#187;et sur les esp&#232;ces animales riveraines dont le cycle est perturb&#233; par des lumi&#232;res artificielles trop fortes.</p><p style=\"text-align: justify;\">Ces &#233;crans constituent une atteinte &#224; la libert&#233; de r&#233;ception des citoyens. Les citoyens sont constamment sollicit&#233;s visuellement par ces &#233;crans dans l&#8217;espace public. Ils se voient imposer des publicit&#233;s qu&#8217;ils n&#8217;ont jamais demand&#233;. De plus les &#233;volutions des technologies sont inqui&#233;tantes&#160;: dot&#233;s de capteurs, ces &#233;crans pourraient nous scruter avec des cam&#233;ras, ou avec des capteurs thermiques, pour en faire une analyse fine&#160;: le message est-il re&#231;u ou non&#160;? qui y est sensible&#160;? de quelle mani&#232;re&#160;?</p><p style=\"text-align: justify;\">Pour limiter cette prolif&#233;ration, nous proposons une taxe sur l&#8217;exploitation des &#233;crans publicitaires, afin de d&#233;sinciter le d&#233;veloppement de ce support.</p>"
  },
  "representations": [
    {
      "nom": "PDF",
      "typeMime": {
        "type": "application",
        "subType": "PDF"
      },
      "statutRepresentation": {
        "verbatim": true,
        "canonique": true,
        "officielle": true,
        "transcription": false,
        "enregistrement": false
      },
      "contenu": {
        "documentURI": "/15/amendements/2272A/CION-DVP/CD169.pdf"
      }
    }
  ],
  "sort": {
    "dateSaisie": "2019-10-08T01:59:41.000+02:00",
    "sortEnSeance": "Rejeté"
  },
  "dateDepot": "2019-10-03T02:00:00.000+02:00",
  "dateDistribution": "2019-10-06T02:00:00.000+02:00",
  "article99": "0",
  "loiReference": {
    "codeLoi": "CGI",
    "divisionCodeLoi": "302 bis MA"
  }
}