{
  "uid": "AMANR5L15PO419865B0627P0D1N192",
  "identifiant": {
    "legislature": "15",
    "numero": "192",
    "numRect": "0",
    "saisine": {
      "texteLegislatifRef": "PRJLANR5L15B0627",
      "numeroPartiePLF": "0",
      "organeExamen": "PO419865",
      "mentionSecondeDeliberation": "0"
    }
  },
  "numeroLong": "CD192",
  "etapeTexte": "1ère lecture (1ère assemblée saisie)",
  "triAmendement": "bzkx",
  "cardinaliteAmdtMultiples": "1",
  "etat": "Discuté",
  "signataires": {
    "auteur": {
      "typeAuteur": "Depute",
      "acteurRef": "PA720278",
      "groupePolitiqueRef": "PO730964"
    },
    "cosignatairesRefs": [
      "PA720278"
    ],
    "texteAffichable": "M.&#160;Orphelin"
  },
  "pointeurFragmentTexte": {
    "division": {
      "titre": "Article 11",
      "articleDesignationCourte": "ART. 11",
      "type": "ARTICLE",
      "avantAApres": "A",
      "divisionRattachee": "ARTICLE 11",
      "urlDivisionTexteVise": "/15/textes/0627.asp#D_Article_11"
    },
    "alinea": {
      "avantAApres": "Apres",
      "numero": "3"
    }
  },
  "corps": {
    "dispositif": "<p style=\"text-align: justify;\">I.&#160;&#8211;&#160;Compl&#233;ter cet article par l&#8217;alin&#233;a suivant&#160;: </p><p style=\"text-align: justify;\">&#171;&#160;Art.&#160;L.<i>&#160;230&#8209;5&#8209;2</i>.&#160;&#8211;&#160;Les gestionnaires d&#8217;organismes de restauration collective publique servant plus de 100 couverts par jour en moyenne sur l&#8217;ann&#233;e sont tenus de pr&#233;senter annuellement &#224; leurs structures dirigeantes un plan de diversification de prot&#233;ines, incluant des alternatives &#224; base de prot&#233;ines v&#233;g&#233;tales aux repas qu&#8217;ils proposent.&#160;&#187;</p><p style=\"text-align: justify;\">II.&#160;&#8211;&#160;En cons&#233;quence, &#224; l&#8217;alin&#233;a&#160;1, substituer aux mots&#160;: </p><p style=\"text-align: justify;\">&#171;&#160;il est ins&#233;r&#233; un article L.&#160;230&#8209;5&#8209;1 ainsi r&#233;dig&#233;&#160;&#187;,</p><p style=\"text-align: justify;\">les mots&#160;:</p><p style=\"text-align: justify;\">&#171;&#160;sont ins&#233;r&#233;s deux articles L.&#160;230&#8209;5&#8209;1 et L.&#160;230&#8209;5&#8209;2 ainsi r&#233;dig&#233;s&#160;&#187;. </p>",
    "exposeSommaire": "<p style=\"text-align: justify;\">En France, la l&#233;gislation oblige de servir de la viande, du poisson et des produits laitiers &#224; des fr&#233;quences d&#233;finies.</p><p style=\"text-align: justify;\">Cet amendement vise &#224; ce que chaque structure de restauration collective publique pr&#233;sente annuellement un plan de propositions visant &#224; l&#8217;augmentation des prot&#233;ines v&#233;g&#233;tales dans la composition des repas servis.</p><p style=\"text-align: justify;\">L&#8217;objectif est d&#8217;amener, &#224; terme, les principales structures de restauration collectives (servant plus de 100 couverts par jour) &#224; proposer des alternatives de repas &#224; base de prot&#233;ines v&#233;g&#233;tales. Il vise &#224; l&#8217;introduction de davantage de prot&#233;ines v&#233;g&#233;tales par rapport aux prot&#233;ines animales et permettra de d&#233;velopper les fili&#232;res fran&#231;aises de prot&#233;ines v&#233;g&#233;tales (pois chiches, lentilles).</p><p style=\"text-align: justify;\">Le gain sur les repas permettra en outre d&#8217;acheter de la viande de meilleure qualit&#233; (Label Rouge, agriculture biologique, &#8230;) et plus locale. Pour rappel, aujourd&#8217;hui, plus de 60&#160;% de la viande servie dans la restauration collective n&#8217;est pas d&#8217;origine Fran&#231;aise.</p>"
  },
  "representations": [
    {
      "nom": "PDF",
      "typeMime": {
        "type": "application",
        "subType": "PDF"
      },
      "statutRepresentation": {
        "verbatim": true,
        "canonique": true,
        "officielle": true,
        "transcription": false,
        "enregistrement": false
      },
      "contenu": {
        "documentURI": "/15/amendements/0627/CION-DVP/CD192.pdf"
      }
    }
  ],
  "sort": {
    "dateSaisie": "2018-03-27T23:49:41.000+02:00",
    "sortEnSeance": "Adopté"
  },
  "dateDepot": "2018-03-23T01:00:00.000+01:00",
  "dateDistribution": "2018-03-27T02:00:00.000+02:00",
  "article99": "0",
  "loiReference": {}
}