{
  "uid": "AMANR5L15PO59048B0235P1D1N320",
  "identifiant": {
    "legislature": "15",
    "numero": "320",
    "numRect": "0",
    "saisine": {
      "texteLegislatifRef": "PRJLANR5L15B0235",
      "numeroPartiePLF": "1",
      "organeExamen": "PO59048",
      "mentionSecondeDeliberation": "0"
    }
  },
  "numeroLong": "I-CF320",
  "etapeTexte": "1ère lecture (1ère assemblée saisie)",
  "triAmendement": "ji",
  "cardinaliteAmdtMultiples": "1",
  "etat": "Discuté",
  "signataires": {
    "auteur": {
      "typeAuteur": "Depute",
      "acteurRef": "PA332523",
      "groupePolitiqueRef": "PO730934"
    },
    "cosignatairesRefs": [
      "PA332523"
    ],
    "texteAffichable": "Mme&#160;Dalloz"
  },
  "pointeurFragmentTexte": {
    "division": {
      "titre": "Article 11",
      "articleDesignationCourte": "ART. 11",
      "type": "ARTICLE",
      "avantAApres": "A",
      "divisionRattachee": "ARTICLE 11",
      "urlDivisionTexteVise": "/15/textes/0235A.asp#D_Article_11"
    },
    "alinea": {
      "numero": "152"
    }
  },
  "corps": {
    "dispositif": "<p>Supprimer l&#8217;alin&#233;a 152.</p>",
    "exposeSommaire": "<p style=\"text-align: justify;\">Selon le PLF, l&#8217;article&#160;11 &#171;&#160;proc&#232;de &#224; une refonte globale du r&#233;gime d&#8217;imposition des revenus de l&#8217;&#233;pargne dans une logique de simplification&#160;&#187;.</p><p style=\"text-align: justify;\">Concernant les PEL, le r&#233;sultat obtenu est loin d&#8217;atteindre cet objectif de simplification&#160;:</p><p style=\"text-align: justify;\">- une partie des anciens PEL est tax&#233;e,</p><p style=\"text-align: justify;\">- les nouveaux PEL le sont &#233;galement d&#232;s la premi&#232;re ann&#233;e,</p><p style=\"text-align: justify;\">- et enfin les PEL de 0 &#224; 12 ans ne sont pas soumis &#224; taxation.</p><p style=\"text-align: justify;\">Cet amendement permet tout d&#8217;abord une simplification effective de la situation en appliquant une r&#232;gle simple&#160;: le PFU est applicable aux PEL d&#233;j&#224; fiscalis&#233;s, c&#8217;est &#224; dire les PEL de plus de 12 ans.</p><p style=\"text-align: justify;\">Les PEL de moins de 12 ans continueraient d&#8217;&#234;tre exon&#233;r&#233;s de toute nouvelle taxation, tout comme les nouveaux PEL.</p><p style=\"text-align: justify;\">Cet amendement permet aussi et surtout d&#8217;&#233;viter toute nouvelle taxation d&#233;savantageuse pour les &#233;pargnants les plus modestes qui sont tr&#232;s attach&#233;s au PEL puisqu&#8217;&#224; la fin 2016, 16 millions de personnes d&#233;tenaient un PEL.</p><p style=\"text-align: justify;\">Il s&#8217;agit l&#224; d&#8217;un des placements privil&#233;gi&#233;s des Fran&#231;ais, et notamment de tous ceux qui souhaiteraient pouvoir acc&#233;der &#224; la propri&#233;t&#233; de leur logement.</p>"
  },
  "representations": [
    {
      "nom": "PDF",
      "typeMime": {
        "type": "application",
        "subType": "PDF"
      },
      "statutRepresentation": {
        "verbatim": true,
        "canonique": true,
        "officielle": true,
        "transcription": false,
        "enregistrement": false
      },
      "contenu": {
        "documentURI": "/15/amendements/0235A/CION_FIN/CF320.pdf"
      }
    }
  ],
  "sort": {
    "dateSaisie": "2017-10-11T23:51:40.000+02:00",
    "sortEnSeance": "Non soutenu"
  },
  "dateDepot": "2017-10-06T02:00:00.000+02:00",
  "dateDistribution": "2017-10-11T02:00:00.000+02:00",
  "article99": "0",
  "loiReference": {}
}