{
  "uid": "AMANR5L15SEA717460B2272P2D1N1049",
  "identifiant": {
    "legislature": "15",
    "numero": "1049",
    "numRect": "0",
    "saisine": {
      "texteLegislatifRef": "PRJLANR5L15B2272",
      "numeroPartiePLF": "2",
      "organeExamen": "PO717460",
      "mentionSecondeDeliberation": "0"
    }
  },
  "numeroLong": "II-1049",
  "etapeTexte": "1ère lecture (1ère assemblée saisie)",
  "triAmendement": "aloaaaaaaaaaaaaaaaaaaaaaaaaaaaaaaaaaaaaaaaaaaaaaaai",
  "cardinaliteAmdtMultiples": "1",
  "etat": "Discuté",
  "signataires": {
    "auteur": {
      "typeAuteur": "Depute",
      "acteurRef": "PA721690",
      "groupePolitiqueRef": "PO730964"
    },
    "cosignatairesRefs": [
      "PA721690"
    ],
    "texteAffichable": "M.&#160;Tan"
  },
  "pointeurFragmentTexte": {
    "missionVisee": {
      "idMissionAN": "812",
      "libelleMission": "Engagements financiers de l'État",
      "codeMissionPLF": "B",
      "libelleMissionPLF": "Répartition, par mission et programme, des crédits du budget général"
    },
    "division": {
      "titre": "ÉTAT B",
      "articleDesignationCourte": "ART. 38",
      "type": "ANNEXE",
      "avantAApres": "A",
      "divisionRattachee": "ARTICLE 38",
      "urlDivisionTexteVise": "/15/textes/2272C.asp#D_ETAT_B"
    }
  },
  "corps": {
    "exposeSommaire": "<p style=\"text-align: justify;\">Le pr&#233;sent amendement vise &#224; compl&#233;ter la subvention budg&#233;taire au financement des garanties publiques &#224; l&#8217;export qui figure &#224; l&#8217;action&#160;04 (D&#233;veloppement international de l&#8217;&#233;conomie fran&#231;aise) du programme&#160;114 de la mission Engagements financiers de l&#8217;&#201;tat, &#224; hauteur de 30&#160;millions d&#8217;euros, en pr&#233;levant cette somme sur l&#8217;action&#160;01 du programme&#160;117 (int&#233;r&#234;ts de la dette).</p><p style=\"text-align: justify;\">Cette augmentation des cr&#233;dits d&#233;di&#233;s aux garanties publiques &#224; l&#8217;export pourrait se mat&#233;rialiser par la cr&#233;ation d&#8217;une nouvelle ligne, dot&#233;e de ces 30 millions d&#8217;euros et nomm&#233;e &#171;&#160;Fonds de garantie des pr&#234;ts de prospection&#160;&#187;.</p><p style=\"text-align: justify;\">En effet, le Gouvernement a fix&#233; l&#8217;objectif de passer de 125&#160;000 &#224; 200&#160;000&#160;entreprises exportatrices, ce qui implique une mobilisation sans pr&#233;c&#233;dent de nos PME. C&#8217;est l&#8217;un des objets de la r&#233;forme de l&#8217;accompagnement des entreprises (Team France Export), mais il faut aussi d&#233;velopper les instruments financiers publics&#160;&#8211;&#160;pr&#234;ts et assurances&#160;&#8211;&#160;de soutien &#224; l&#8217;export. Parmi ceux-ci, l&#8217;assurance prospection est le seul sp&#233;cifiquement d&#233;di&#233; aux PME et est tr&#232;s appr&#233;ci&#233;e de celles-ci.</p><p style=\"text-align: justify;\">Pour parvenir &#224; cet objectif, le pr&#233;sent amendement propose d&#8217;accroitre les budgets de prospection pris en charge tout en en ma&#238;trisant le co&#251;t budg&#233;taire, en instituant un dispositif de pr&#234;ts &#224; taux z&#233;ro pour le financement de d&#233;penses de prospection (&#171;&#160;Pr&#234;t &#224; Taux Z&#233;ro Export&#160;&#187;). Un tel dispositif, adoss&#233; &#224; un fonds de garantie abond&#233; de 30 millions d&#8217;euros, permettrait de g&#233;n&#233;rer 150 millions d&#8217;euros de pr&#234;ts.</p><p style=\"text-align: justify;\">Bien que l&#233;g&#232;rement moins avantageux que l&#8217;assurance prospection, il serait en revanche moins co&#251;teux budg&#233;tairement&#160;: il s&#8217;adresserait en effet aux gros budgets de prospection d&#8217;entreprises d&#233;j&#224; solides &#224; l&#8217;export, de sorte que l&#8217;assurance prospection elle-m&#234;me serait r&#233;orient&#233;e vers les entreprises plus petites et/ou primo-exportatrices (qui n&#233;cessitent un produit attractif prenant en compte le risque d&#8217;&#233;chec). Ainsi, le co&#251;t actuel de l&#8217;assurance prospection diminuerait au fur et &#224; mesure de la mont&#233;e en puissance du Pr&#234;t &#224; Taux Z&#233;ro Export.</p><p style=\"text-align: justify;\">Ces pr&#234;ts seraient g&#233;r&#233;s par Bpifrance, sous sa responsabilit&#233;. L&#8217;&#201;tat se contenterait ainsi d&#8217;apporter une garantie contre les d&#233;fauts de remboursement en dotant ab initio un fonds de garantie. C&#8217;est l&#8217;objet du pr&#233;sent amendement.</p>",
    "dispositifAmdtCredit": {
      "listeProgrammes": [
        {
          "libelle": "Charge de la dette et trésorerie de l'État (crédits évaluatifs)",
          "id": "92244",
          "AE": {
            "montantPositif": "0",
            "montantNegatif": "30000000"
          },
          "CP": {
            "montantPositif": "0",
            "montantNegatif": "30000000"
          },
          "action": "modification"
        },
        {
          "libelle": "Appels en garantie de l'État (crédits évaluatifs)",
          "id": "92245",
          "AE": {
            "montantPositif": "30000000",
            "montantNegatif": "0"
          },
          "CP": {
            "montantPositif": "30000000",
            "montantNegatif": "0"
          },
          "action": "modification"
        },
        {
          "libelle": "Épargne",
          "id": "92246",
          "AE": {
            "montantPositif": "0",
            "montantNegatif": "0"
          },
          "CP": {
            "montantPositif": "0",
            "montantNegatif": "0"
          },
          "action": "modification"
        },
        {
          "libelle": "Dotation du Mécanisme européen de stabilité",
          "id": "92247",
          "AE": {
            "montantPositif": "0",
            "montantNegatif": "0"
          },
          "CP": {
            "montantPositif": "0",
            "montantNegatif": "0"
          },
          "action": "modification"
        },
        {
          "libelle": "Augmentation de capital de la Banque européenne d'investissement",
          "id": "92248",
          "AE": {
            "montantPositif": "0",
            "montantNegatif": "0"
          },
          "CP": {
            "montantPositif": "0",
            "montantNegatif": "0"
          },
          "action": "modification"
        },
        {
          "libelle": "Fonds de soutien relatif aux prêts et contrats financiers structurés à risque",
          "id": "92249",
          "AE": {
            "montantPositif": "0",
            "montantNegatif": "0"
          },
          "CP": {
            "montantPositif": "0",
            "montantNegatif": "0"
          },
          "action": "modification"
        }
      ],
      "totalAE": {
        "montantPositif": "30000000",
        "montantNegatif": "30000000",
        "solde": "0"
      },
      "totalCP": {
        "montantPositif": "30000000",
        "montantNegatif": "30000000",
        "solde": "0"
      }
    }
  },
  "representations": [
    {
      "nom": "PDF",
      "typeMime": {
        "type": "application",
        "subType": "PDF"
      },
      "statutRepresentation": {
        "verbatim": true,
        "canonique": true,
        "officielle": true,
        "transcription": false,
        "enregistrement": false
      },
      "contenu": {
        "documentURI": "/15/amendements/2272C/AN/1049.pdf"
      }
    }
  ],
  "seanceDiscussion": "RUANR5L15S2020IDS21898",
  "sort": {
    "dateSaisie": "2019-10-31T15:11:47.000+01:00",
    "sortEnSeance": "Retiré"
  },
  "dateDepot": "2019-10-28T01:00:00.000+01:00",
  "dateDistribution": "2019-10-30T01:00:00.000+01:00",
  "article99": "0",
  "loiReference": {}
}