{
  "uid": "AMANR5L15SEA717460B2272P1D1N3062",
  "identifiant": {
    "legislature": "15",
    "numero": "3062",
    "numRect": "0",
    "saisine": {
      "texteLegislatifRef": "PRJLANR5L15B2272",
      "numeroPartiePLF": "1",
      "organeExamen": "PO717460",
      "mentionSecondeDeliberation": "0"
    }
  },
  "numeroLong": "I-3062",
  "etapeTexte": "1ère lecture (1ère assemblée saisie)",
  "triAmendement": "bfaaaaaaaaaaaaaaaaaaaaaaaaaaaaaaaaaaaaaaaaaaaaaaaaaaejdhu",
  "cardinaliteAmdtMultiples": "1",
  "etat": "Discuté",
  "signataires": {
    "auteur": {
      "typeAuteur": "Depute",
      "acteurRef": "PA643175",
      "groupePolitiqueRef": "PO730964"
    },
    "cosignatairesRefs": [
      "PA719850",
      "PA719202",
      "PA721328",
      "PA722046",
      "PA719718",
      "PA720916",
      "PA719456",
      "PA719814",
      "PA721702",
      "PA721844",
      "PA719866",
      "PA719242",
      "PA720202",
      "PA2828",
      "PA718768",
      "PA720170",
      "PA721644",
      "PA719830",
      "PA606507",
      "PA718736",
      "PA719388",
      "PA722078",
      "PA607193",
      "PA719230",
      "PA720446",
      "PA720394",
      "PA721278",
      "PA722070",
      "PA720054",
      "PA721426",
      "PA720622",
      "PA719100",
      "PA720806",
      "PA720790",
      "PA722268",
      "PA677483",
      "PA722118",
      "PA721150",
      "PA721800",
      "PA721560",
      "PA721522",
      "PA718694",
      "PA722126",
      "PA719118",
      "PA719338",
      "PA722260",
      "PA643175",
      "PA722358",
      "PA719350",
      "PA721344",
      "PA719072",
      "PA721784",
      "PA643127",
      "PA718990",
      "PA719770",
      "PA760658",
      "PA717167",
      "PA719664",
      "PA720870",
      "PA719728",
      "PA722170",
      "PA720268",
      "PA606675",
      "PA722054",
      "PA719472",
      "PA721246",
      "PA720138",
      "PA719684",
      "PA721710",
      "PA718802",
      "PA719756",
      "PA720154",
      "PA719778",
      "PA722240",
      "PA720738",
      "PA606639",
      "PA720754",
      "PA609520",
      "PA334768",
      "PA719858",
      "PA718706",
      "PA720222",
      "PA720492",
      "PA721466",
      "PA718794",
      "PA720116",
      "PA719154",
      "PA672",
      "PA721262",
      "PA721584",
      "PA721888",
      "PA719550",
      "PA719600",
      "PA720074",
      "PA719790",
      "PA719616",
      "PA720952",
      "PA719372",
      "PA718876",
      "PA608083",
      "PA720214",
      "PA721674",
      "PA720124",
      "PA719822",
      "PA721908",
      "PA721458",
      "PA722252",
      "PA606202",
      "PA721336",
      "PA721158",
      "PA332747",
      "PA720378",
      "PA702054",
      "PA718682",
      "PA719922",
      "PA719798",
      "PA721434",
      "PA722228",
      "PA346876",
      "PA605963",
      "PA719006",
      "PA720310",
      "PA721398",
      "PA721600",
      "PA719108",
      "PA720414",
      "PA720046",
      "PA718894",
      "PA721352",
      "PA721624",
      "PA721726",
      "PA721372",
      "PA331835",
      "PA719480",
      "PA721498",
      "PA722344",
      "PA719330",
      "PA719740",
      "PA718674",
      "PA720780",
      "PA721166",
      "PA721568",
      "PA718918",
      "PA642724",
      "PA722312",
      "PA718930",
      "PA719302",
      "PA722382",
      "PA721450",
      "PA722134",
      "PA719396",
      "PA720900",
      "PA719632",
      "PA719130",
      "PA718954",
      "PA719528",
      "PA719960",
      "PA719748",
      "PA721776",
      "PA719842",
      "PA607155",
      "PA722194",
      "PA722320",
      "PA719412",
      "PA721218",
      "PA719710",
      "PA720298",
      "PA719258",
      "PA719162",
      "PA722022",
      "PA721764",
      "PA719080",
      "PA334116",
      "PA720576",
      "PA721860",
      "PA719972",
      "PA717379",
      "PA721852",
      "PA719032",
      "PA719496",
      "PA720362",
      "PA721542",
      "PA722008",
      "PA719624",
      "PA608641",
      "PA720932",
      "PA721296",
      "PA719882",
      "PA720520",
      "PA719570",
      "PA722102",
      "PA719170",
      "PA721690",
      "PA722244",
      "PA719310",
      "PA721876",
      "PA720022",
      "PA720030",
      "PA722178",
      "PA721616",
      "PA605084",
      "PA721880",
      "PA720370",
      "PA719540",
      "PA722094",
      "PA722000",
      "PA721824",
      "PA719890",
      "PA722300",
      "PA719700",
      "PA607395",
      "PA721024",
      "PA720512",
      "PA722150",
      "PA722292",
      "PA720862",
      "PA721142",
      "PA719404",
      "PA720354",
      "PA721916",
      "PA720944",
      "PA720438",
      "PA720960",
      "PA720538",
      "PA719952",
      "PA722366",
      "PA719520",
      "PA720146",
      "PA720454",
      "PA343493",
      "PA721384",
      "PA718744",
      "PA642788",
      "PA718944",
      "PA721750",
      "PA719652",
      "PA720108",
      "PA720190",
      "PA720066",
      "PA720854",
      "PA720342",
      "PA720242",
      "PA719448",
      "PA720480",
      "PA718962",
      "PA643205",
      "PA719186",
      "PA720014",
      "PA721134",
      "PA718710",
      "PA719060",
      "PA719024",
      "PA722038",
      "PA719194",
      "PA720908",
      "PA722398",
      "PA719980",
      "PA267673",
      "PA719440",
      "PA720878",
      "PA721808",
      "PA720552",
      "PA721656",
      "PA718728",
      "PA718902",
      "PA721718",
      "PA720318",
      "PA722062",
      "PA719994",
      "PA719250",
      "PA720830",
      "PA719592",
      "PA267336",
      "PA724827",
      "PA721514",
      "PA719420",
      "PA720814",
      "PA642695",
      "PA722336",
      "PA718910",
      "PA720590",
      "PA721004",
      "PA719692",
      "PA721364",
      "PA720500",
      "PA2449",
      "PA720402",
      "PA719326",
      "PA719052",
      "PA718810",
      "PA719294",
      "PA721792",
      "PA719668",
      "PA720560",
      "PA718756",
      "PA722090",
      "PA721946",
      "PA719092",
      "PA719364",
      "PA719218",
      "PA721036",
      "PA607595",
      "PA719512"
    ],
    "texteAffichable": "Mme&#160;Dupont,  Mme&#160;Cariou, M.&#160;Giraud, M.&#160;Ahamada, M.&#160;Andr&#233;, Mme&#160;Cattelot, M.&#160;Cazeneuve, M.&#160;Chassaing, M.&#160;Chouat, M.&#160;Damaisin, Mme&#160;Dominique&#160;David, M.&#160;Dirx, Mme&#160;Errante, M.&#160;Gaillard, Mme&#160;Goulet, M.&#160;Grau, Mme&#160;Gregoire, Mme&#160;Hai, M.&#160;Holroyd, M.&#160;Jerretie, M.&#160;Jolivet, M.&#160;Labaronne, M.&#160;Lauzzana, M.&#160;Le Vigoureux, Mme&#160;Magne, Mme&#160;Motin, Mme&#160;Osson, M.&#160;Paluszkiewicz, M.&#160;Pellois, Mme&#160;Val&#233;rie&#160;Petit, Mme&#160;Peyrol, M.&#160;Potterie, M.&#160;Roseren, M.&#160;Saint-Martin, M.&#160;Savatier, M.&#160;Serva, M.&#160;Simian, Mme&#160;Verdier-Jouclas, Mme&#160;Abadie, Mme&#160;Abba, M.&#160;Damien&#160;Adam, M.&#160;L&#233;na&#239;ck&#160;Adam, M.&#160;Alauzet, Mme&#160;Ali, Mme&#160;Amadou, M.&#160;Anato, M.&#160;Anglade, M.&#160;Ardouin, M.&#160;Arend, Mme&#160;Atger, Mme&#160;Avia, M.&#160;Bachelier, Mme&#160;Bagarry, M.&#160;Baich&#232;re, M.&#160;Barbier, M.&#160;Batut, Mme&#160;Beaudouin-Hubiere, M.&#160;Belhaddad, Mme&#160;Berg&#233;, M.&#160;Berville, M.&#160;Besson-Moreau, Mme&#160;Bessot Ballot, Mme&#160;Blanc, M.&#160;Blanchet, M.&#160;Blein, M.&#160;Bois, M.&#160;Bonnell, Mme&#160;Bono-Vandorme, M.&#160;Borowczyk, M.&#160;Bothorel, M.&#160;Boudi&#233;, Mme&#160;Bourguignon, M.&#160;Bouyx, Mme&#160;Pascale&#160;Boyer, Mme&#160;Braun-Pivet, M.&#160;Bridey, Mme&#160;Brocard, Mme&#160;Brugnera, Mme&#160;Brulebois, Mme&#160;Brunet, M.&#160;Buchou, Mme&#160;Bureau-Bonnard, M.&#160;Cabar&#233;, Mme&#160;Calvez, M.&#160;Causse, Mme&#160;Cazarian, Mme&#160;Cazebonne, M.&#160;Cazenove, M.&#160;Cellier, M.&#160;Cesarini, Mme&#160;Chalas, M.&#160;Chalumeau, Mme&#160;Chapelier, Mme&#160;Charri&#232;re, Mme&#160;Charvier, M.&#160;Chiche, M.&#160;Claireaux, Mme&#160;Clapot, Mme&#160;Cloarec-Le Nabour, M.&#160;Colas-Roy, Mme&#160;Colboc, M.&#160;Cormier-Bouligeon, Mme&#160;Couillard, Mme&#160;Crouzet, M.&#160;Da Silva, M.&#160;Daniel, Mme&#160;Yolaine&#160;de Courson, Mme&#160;de Lavergne, M.&#160;de Rugy, Mme&#160;De Temmerman, Mme&#160;Degois, M.&#160;Marc&#160;Delatte, M.&#160;Delpon, M.&#160;Descrozaille, M.&#160;Di Pompeo, Mme&#160;Do, M.&#160;Dombreval, Mme&#160;Jacqueline&#160;Dubois, Mme&#160;Dubost, Mme&#160;Dubr&#233;-Chirat, Mme&#160;Dufeu Schubert, Mme&#160;Fran&#231;oise&#160;Dumas, M.&#160;D&#233;moulin, M.&#160;Eliaou, M.&#160;Euzet, Mme&#160;Fabre, Mme&#160;Faure-Muntian, M.&#160;Fauvergue, M.&#160;Fi&#233;vet, M.&#160;Folliot, Mme&#160;Fontaine-Domeizel, Mme&#160;Fontenel-Personne, Mme&#160;Forteza, M.&#160;Freschi, M.&#160;Fugit, Mme&#160;Gaillot, M.&#160;Gassilloud, M.&#160;Gauvain, Mme&#160;Gayte, Mme&#160;Genetet, Mme&#160;Gipson, M.&#160;Girardin, Mme&#160;Givernet, Mme&#160;Gomez-Bassac, M.&#160;Gouffier-Cha, M.&#160;Gouttefarde, Mme&#160;Grandjean, Mme&#160;Granjus, M.&#160;Griveaux, Mme&#160;Guerel, M.&#160;Guerini, Mme&#160;Gu&#233;venoux, M.&#160;G&#233;rard, Mme&#160;Hammerer, M.&#160;Haury, Mme&#160;Hennion, M.&#160;Henriet, M.&#160;Houbron, M.&#160;Houli&#233;, M.&#160;Hupp&#233;, Mme&#160;H&#233;rin, Mme&#160;Iborra, M.&#160;Jacques, Mme&#160;Janvier, M.&#160;Julien-Laferri&#232;re, Mme&#160;Kamowski, M.&#160;Kasbarian, Mme&#160;Kerbarh, M.&#160;Kerlogot, M.&#160;Kervran, Mme&#160;Khattabi, Mme&#160;Khedher, M.&#160;Kokouendo, M.&#160;Krabal, Mme&#160;Krimi, Mme&#160;Kuric, M.&#160;Laabid, Mme&#160;Lakrafi, Mme&#160;Lang, Mme&#160;Lardet, M.&#160;Larsonneur, M.&#160;Lavergne, Mme&#160;Lazaar, M.&#160;Le Bohec, Mme&#160;Le Feur, M.&#160;Le Gac, Mme&#160;Le Meur, Mme&#160;Le Peih, Mme&#160;Lebec, M.&#160;Leclabart, Mme&#160;Lecocq, Mme&#160;Leguille-Balloy, M.&#160;Lejeune, Mme&#160;Lenne, M.&#160;Lescure, Mme&#160;Limon, M.&#160;Lioger, Mme&#160;Liso, Mme&#160;Louis, M.&#160;Mahjoubi, M.&#160;Maillard, Mme&#160;Maillart-M&#233;haignerie, M.&#160;Maire, Mme&#160;Jacqueline&#160;Maquet, M.&#160;Marilossian, Mme&#160;Marsaud, M.&#160;Martin, M.&#160;Mass&#233;glia, M.&#160;Matras, Mme&#160;Mauborgne, M.&#160;Mazars, M.&#160;Mbaye, Mme&#160;Melchior, M.&#160;Mendes, M.&#160;Mesnier, Mme&#160;Meynier-Millefert, Mme&#160;Michel, M.&#160;Michels, Mme&#160;Mirall&#232;s, M.&#160;Mis, M.&#160;Moreau, M.&#160;Morenas, Mme&#160;Moutchou, Mme&#160;Muschotti, Mme&#160;M&#246;rch, M.&#160;Nogal, Mme&#160;O&apos;Petit, Mme&#160;Oppelt, Mme&#160;Panonacle, M.&#160;Paris, Mme&#160;Park, M.&#160;Perea, M.&#160;Perrot, M.&#160;Person, Mme&#160;Petel, Mme&#160;Peyron, M.&#160;Pichereau, M.&#160;Pietraszewski, Mme&#160;Piron, Mme&#160;Pitollat, Mme&#160;Pompili, M.&#160;Pont, M.&#160;Portarrieu, M.&#160;Poulliat, Mme&#160;Pouzyreff, Mme&#160;Provendier, Mme&#160;P&#233;telle, M.&#160;Questel, Mme&#160;Racon-Bouzon, M.&#160;Raphan, Mme&#160;Rauch, M.&#160;Rebeyrotte, M.&#160;Renson, Mme&#160;Rilhac, Mme&#160;Riotton, Mme&#160;Rist, Mme&#160;Rixain, Mme&#160;Robert, Mme&#160;Romeiro Dias, Mme&#160;Rossi, M.&#160;Rouillard, M.&#160;C&#233;dric&#160;Roussel, M.&#160;Rudigoz, M.&#160;Rupin, Mme&#160;Saint-Paul, Mme&#160;Sarles, M.&#160;Sempastous, M.&#160;Sol&#232;re, M.&#160;Sommer, M.&#160;Sorre, M.&#160;Studer, Mme&#160;Sylla, M.&#160;Tach&#233;, Mme&#160;Tamarelle-Verhaeghe, M.&#160;Tan, Mme&#160;Tanguy, M.&#160;Terlier, M.&#160;Test&#233;, Mme&#160;Thillaye, M.&#160;Thi&#233;baut, Mme&#160;Thomas, Mme&#160;Thourot, Mme&#160;Tiegna, M.&#160;Touraine, M.&#160;Tourret, Mme&#160;Toutut-Picard, M.&#160;Travert, Mme&#160;Trisse, M.&#160;Trompille, Mme&#160;Tuffnell, Mme&#160;Valetta Ardisson, Mme&#160;Vanceunebrock-Mialon, M.&#160;Venteau, Mme&#160;Vidal, M.&#160;Vignal, Mme&#160;Vignon, M.&#160;Villani, M.&#160;Vuilletet, M.&#160;V&#233;ran, Mme&#160;Wonner, Mme&#160;Zannier, M.&#160;Zulesi, M.&#160;Le Gendre et les membres du groupe La R&#233;publique en Marche"
  },
  "pointeurFragmentTexte": {
    "division": {
      "titre": "Article 6",
      "articleDesignationCourte": "APRÈS ART. 6",
      "type": "ARTICLE",
      "avantAApres": "Apres",
      "divisionRattachee": "APRÈS L'ARTICLE 6, insérer l'article suivant:",
      "articleAdditionnel": "1",
      "urlDivisionTexteVise": "/15/textes/2272A.asp#D_Article_6"
    }
  },
  "corps": {
    "dispositif": "<p style=\"text-align: justify;\">Le code de l&#8217;entr&#233;e et du s&#233;jour des &#233;trangers et du droit d&#8217;asile est ainsi modifi&#233;&#160;:</p><p style=\"text-align: justify;\">1&#176;&#160;L&#8217;article&#160;L.&#160;311&#8209;13 est ainsi modifi&#233;&#160;:</p><p style=\"text-align: justify;\"><i>a)</i> Les A et B sont ainsi r&#233;dig&#233;s&#160;:</p><p style=\"text-align: justify;\">&#171;&#160;A. &#8211; La d&#233;livrance et le renouvellement d&#8217;un titre de s&#233;jour donne lieu &#224; la perception d&#8217;une taxe dont le montant est fix&#233; &#224; 200&#160;euros.</p><p style=\"text-align: justify;\">&#171;&#160;Ce montant est ramen&#233; &#224; 50&#160;euros pour les &#233;trangers auxquels est d&#233;livr&#233;e une carte de s&#233;jour sur le fondement des articles L.&#160;313&#8209;7, L.&#160;313&#8209;7&#8209;1, L.&#160;313&#8209;8, L.&#160;313&#8209;9, des 1&#176;&#160;et 9&#176;&#160;de l&#8217;article L.&#160;313&#8209;11, des articles L.&#160;313&#8209;23, L.&#160;313&#8209;27 et du 3&#176;&#160;de l&#8217;article L.&#160;314&#8209;11.</p><p style=\"text-align: justify;\">&#171;&#160;Le premier alin&#233;a du pr&#233;sent A n&#8217;est pas applicable pour la d&#233;livrance d&#8217;une carte de s&#233;jour d&#233;livr&#233;e sur le fondement de l&#8217;article L.&#160;317&#8209;1.</p><p style=\"text-align: justify;\">&#171;&#160;Le m&#234;me alin&#233;a n&#8217;est pas applicable pour la premi&#232;re d&#233;livrance d&#8217;une carte de s&#233;jour d&#233;livr&#233;e sur le fondement des 2&#176;&#160;<i>bis</i> et 11&#176;&#160;de l&#8217;article L.&#160;313&#8209;11, des articles L.&#160;313&#8209;25 et L.&#160;313&#8209;26 et des 4&#176;&#160;, 5&#176;&#160;, 6&#176;&#160;et 8&#176;&#160;de l&#8217;article L.&#160;314&#8209;11.</p><p style=\"text-align: justify;\">&#171;&#160;La d&#233;livrance d&#8217;un visa de long s&#233;jour valant ou dispensant de titre de s&#233;jour donne lieu, outre les droits de visa pr&#233;vus par la r&#233;glementation en vigueur, &#224; la perception de la taxe correspondant au titre de s&#233;jour que ce visa remplace.</p><p style=\"text-align: justify;\">&#171;&#160;B. &#8211; La fourniture de duplicata donne lieu &#224; la perception d&#8217;une taxe du m&#234;me montant que celui applicable lors du renouvellement du titre de s&#233;jour pour le m&#234;me motif.&#160;&#187;&#160;;</p><p style=\"text-align: justify;\"><i>b) </i>le C est ainsi modifi&#233;&#160;:&#160;</p><p style=\"text-align: justify;\">&#8211; Les mots&#160;: &#171;&#160;au titre&#160;&#187; sont remplac&#233;s par les mots&#160;: &#171;&#160;sur le fondement&#160;&#187;&#160;;</p><p style=\"text-align: justify;\">&#8211; &#192; la fin du C, le montant&#160;: &#171;&#160;45&#160;euros&#160;&#187; est remplac&#233; par le montant&#160;: &#171;&#160;50&#160;euros&#160;&#187;&#160;;</p><p style=\"text-align: justify;\"><i>c)</i>&#160;Au 2 du D, les mots&#160;: &#171;&#160;pr&#233;c&#233;dent titre de s&#233;jour&#160;&#187; sont remplac&#233;s par les mots&#160;: &#171;&#160;du d&#233;lai requis pour le d&#233;p&#244;t de la demande&#160;&#187;&#160;;</p><p style=\"text-align: justify;\"><i>d)</i>&#160;Au F, les mots&#160;: &#171;&#160;, en tant que de besoin,&#160;&#187; sont supprim&#233;s&#160;;</p><p style=\"text-align: justify;\">2&#176;&#160;&#192; la fin de l&#8217;article L.&#160;311&#8209;16, le montant&#160;: &#171;&#160;19&#160;&#8364;&#160;&#187; est remplac&#233; par le montant&#160;: &#171;&#160;25&#160;euros&#160;&#187;.</p>",
    "exposeSommaire": "<p style=\"text-align: justify;\">Le groupe La R&#233;publique en marche soutient le travail engag&#233; par Stella DUPONT et Jean-Fran&#231;ois&#160;PARIGI sur les taxes sur les titres de s&#233;jour. Ce travail a notamment pris la forme d'un rapport d&#8217;information de la Commission des finances. Ce rapport a &#233;mis diverses recommandations tendant &#224; revisiter ces taxes, afin qu&#8217;elles soient plus simples, plus justes et plus fonctionnelles. Le travail men&#233; s&#8217;est traduit par le d&#233;p&#244;t de plusieurs amendements en commission ainsi qu&#8217;en s&#233;ance. Le pr&#233;sent amendement concr&#233;tise cette d&#233;marche et constitue une premi&#232;re &#233;tape&#160;d'une r&#233;forme plus compl&#232;te&#160;des taxes sur les titres de s&#233;jour&#160;qui pourra notamment se mat&#233;rialiser lors de l'examen en nouvelle lecture &#224; l'Assembl&#233;e nationale du PLF 2020.</p><p>Le r&#233;gime actuel des taxes sur les titres de s&#233;jour appara&#238;t en effet complexe et peu lisible, la piste de simplification de la grille des tarifs propos&#233;e par les auteurs du rapport doit donc &#234;tre retenue. Il s&#8217;agit de faire en sorte que le dispositif de taxation soit &#224; la fois plus &#233;quitable pour l&#8217;&#233;tranger concern&#233; et plus fonctionnel pour l&#8217;administration charg&#233;e de percevoir les taxes lors de l&#8217;instruction des demandes de titre de s&#233;jour, ce qui sera de nature &#224; en am&#233;liorer la compr&#233;hension et donc l&#8217;acceptation. Il s&#8217;agit &#233;galement d&#8217;en diminuer le montant pour tenir compte des pr&#233;conisations issues du travail parlementaire.</p><p>&#160;Le pr&#233;sent amendement vise donc &#224; r&#233;duire le nombre de tarifs existants, &#224; simplifier et &#224; rationaliser les r&#232;gles existantes et &#224; diminuer le niveau global des taxes applicables. Pour limiter l&#8217;impact sur le budget de l&#8217;Etat, il proc&#232;de simultan&#233;ment &#224; diff&#233;rents ajustements, dont une hausse mod&#233;r&#233;e du droit de timbre, rejoignant sur ce point les propositions de la mission d&#8217;information parlementaire.</p><p>Concr&#232;tement, il est propos&#233; l&#8217;instauration d&#8217;un seul tarif de base fix&#233; &#224; 200 &#8364; (au lieu de 250 &#8364;).</p><p>Il propose &#233;galement l&#8217;institution d&#8217;un seul tarif minor&#233; (au lieu de 3 actuellement) de 50 &#8364;, quelle que soit la dur&#233;e du titre, pour la premi&#232;re d&#233;livrance et le renouvellement du titre, au profit :</p><p>-&#160;&#160;&#160;&#160;&#160;&#160; des &#233;tudiants et assimil&#233;s (stagiaires, jeunes au pair, &#233;tudiants en recherche d&#8217;emploi), au lieu actuellement de 60 &#8364; ou, lors du renouvellement d&#8217;un titre d&#8217;un an, 30 &#8364; ;</p><p>-&#160;&#160;&#160;&#160;&#160;&#160; des titulaires de rente accident-maladie (au lieu actuellement de 60 &#8364; pour une carte de s&#233;jour temporaire ou pluriannuelle et 120&#8364; pour une carte de r&#233;sident) ;</p><p>-&#160;&#160;&#160;&#160;&#160;&#160; des enfants majeurs admis au regroupement familial depuis leur minorit&#233; (au lieu de 120 &#8364; jusqu&#8217;&#224; pr&#233;sent).</p><p>Les exemptions totales de taxes sont maintenues pour les personnes prot&#233;g&#233;es ou vuln&#233;rables : r&#233;fugi&#233;s, prot&#233;g&#233;s subsidiaires, apatrides et membres de leur famille, anciens combattants, mineurs isol&#233;s, malades (primo-d&#233;livrance de titre), retrait&#233;s et victimes de violences conjugales ou de traite (primo-d&#233;livrance et renouvellement).</p><p>La surtaxe (actuellement fix&#233;e &#224; 9 &#8364; pour les cartes de r&#233;sident et 16 &#8364; pour les autres titres), qui s&#8217;ajoute &#224; la taxe li&#233;e &#224; la d&#233;livrance du titre de s&#233;jour en cas de remise d&#8217;un duplicata suite &#224; une perte, source de complexit&#233; et au rendement n&#233;gligeable, est supprim&#233;e.</p><p>Le droit de timbre est port&#233; de 19 &#224; 25 &#8364;, ainsi que le pr&#233;conise le rapport. Ce rel&#232;vement permet de financer une partie du co&#251;t de la diminution de 250 &#224; 200 &#8364; du niveau de la taxe de droit commun.</p><p>Il r&#233;sulte de ces &#233;volutions une grille tarifaire simplifi&#233;e avec 6 niveaux de taxe (0, 25, 50, 180, 200 et 290), au lieu de 13 actuellement. L&#8217;impact sur les recettes de l&#8217;Etat est &#233;valu&#233; &#224; 24,6 M&#8364;.</p>",
    "cartoucheDelaiDepotDepasse": "Sous réserve de son traitement par les services de l'Assemblée nationale et de sa recevabilité"
  },
  "representations": [
    {
      "nom": "PDF",
      "typeMime": {
        "type": "application",
        "subType": "PDF"
      },
      "statutRepresentation": {
        "verbatim": true,
        "canonique": true,
        "officielle": true,
        "transcription": false,
        "enregistrement": false
      },
      "contenu": {
        "documentURI": "/15/amendements/2272A/AN/3062.pdf"
      }
    }
  ],
  "seanceDiscussion": "RUANR5L15S2020IDS21870",
  "sort": {
    "dateSaisie": "2019-10-18T17:16:32.000+02:00",
    "sortEnSeance": "Adopté"
  },
  "dateDepot": "2019-10-17T02:00:00.000+02:00",
  "dateDistribution": "2019-10-18T02:00:00.000+02:00",
  "article99": "0",
  "loiReference": {}
}