{
  "uid": "AMANR5L15SEA717460B1933P0D1N26",
  "identifiant": {
    "legislature": "15",
    "numero": "26",
    "numRect": "0",
    "saisine": {
      "texteLegislatifRef": "PIONANR5L15B1933",
      "numeroPartiePLF": "0",
      "organeExamen": "PO717460",
      "mentionSecondeDeliberation": "0"
    }
  },
  "numeroLong": "26",
  "etapeTexte": "1ère lecture (1ère assemblée saisie)",
  "triAmendement": "iiaaaaaaaaaaaaaaaaaaaaaaaaaaaaaaaaaaaaaaaaaaaaaaaabi",
  "cardinaliteAmdtMultiples": "1",
  "etat": "Discuté",
  "signataires": {
    "auteur": {
      "typeAuteur": "Depute",
      "acteurRef": "PA720430",
      "groupePolitiqueRef": "PO730958"
    },
    "cosignatairesRefs": [
      "PA722142",
      "PA721226",
      "PA721062",
      "PA719676",
      "PA720286",
      "PA720430",
      "PA721202",
      "PA718860",
      "PA588884",
      "PA718868",
      "PA719578",
      "PA721210",
      "PA2150",
      "PA720846",
      "PA721960",
      "PA720892",
      "PA720422"
    ],
    "texteAffichable": "M.&#160;Bernalicis,  Mme&#160;Taurine, Mme&#160;Autain, M.&#160;Coquerel, M.&#160;Corbi&#232;re, Mme&#160;Fiat, M.&#160;Lachaud, M.&#160;Larive, M.&#160;M&#233;lenchon, Mme&#160;Obono, Mme&#160;Panot, M.&#160;Prud&apos;homme, M.&#160;Quatennens, M.&#160;Ratenon, Mme&#160;Ressiguier, Mme&#160;Rubin et M.&#160;Ruffin"
  },
  "pointeurFragmentTexte": {
    "division": {
      "titre": "Article 7",
      "articleDesignationCourte": "ART. 7",
      "type": "ARTICLE",
      "avantAApres": "A",
      "divisionRattachee": "ARTICLE 7",
      "urlDivisionTexteVise": "/15/textes/1933.asp#D_Article_7"
    }
  },
  "corps": {
    "dispositif": "<p style=\"text-align: justify;\">Supprimer cet article.</p>",
    "exposeSommaire": "<p style=\"text-align: justify;\">Par cet amendement, nous proposons de supprimer cet article&#160;7 qui pr&#233;voit que &#171;&#160;l&#8217;excuse de minorit&#233;&#160;&#187; sera par principe &#233;cart&#233;e lorsqu&#8217;un mineur de seize &#224; dix-huit ans sera d&#233;clar&#233; coupable d&#8217;un crime ou d&#8217;un d&#233;lit commis &#224; l&#8217;encontre des forces de l&#8217;ordre, sauf d&#233;cision motiv&#233;e du juge. Lorsqu&#8217;ils s&#8217;en prennent aux forces de l&#8217;ordre, les mineurs seraient passibles des m&#234;mes peines que les personnes majeures.</p><p style=\"text-align: justify;\">Les mineurs sont des personnes vuln&#233;rables, potentiellement devant faire l&#8217;objet de la protection publique - et qui doivent faire l&#8217;objet d&#8217;un traitement distinct des adultes&#160;&#8211;&#160;c&#8217;est tout le fondement de la justice p&#233;nale des mineurs -. A ce titre, ils ne peuvent voir leur statut rapproch&#233; de celui des adultes, ce pour quelque exception que ce soit. L&#8217;&#201;tat du droit permet d&#8217;ores et d&#233;j&#224; &#224; un juge de ne pas retenir l&#8217;excuse att&#233;nuante de minorit&#233;&#160;: &#171;&#160;&#224; titre exceptionnel et compte tenu des circonstances de l&#8217;esp&#232;ce et de la personnalit&#233; du mineur ainsi que de sa situation&#160;&#187;. L&#8217;automaticit&#233; n&#8217;est pas acceptable en soi, et contraire au principe &#224; valeur constitutionnelle de l&#8217;individualisation des peines.</p>"
  },
  "representations": [
    {
      "nom": "PDF",
      "typeMime": {
        "type": "application",
        "subType": "PDF"
      },
      "statutRepresentation": {
        "verbatim": true,
        "canonique": true,
        "officielle": true,
        "transcription": false,
        "enregistrement": false
      },
      "contenu": {
        "documentURI": "/15/amendements/1933/AN/26.pdf"
      }
    }
  ],
  "seanceDiscussion": "RUANR5L15S2019IDS21720",
  "sort": {
    "dateSaisie": "2019-06-20T18:20:37.000+02:00",
    "sortEnSeance": "Non soutenu"
  },
  "dateDepot": "2019-06-14T02:00:00.000+02:00",
  "dateDistribution": "2019-06-19T02:00:00.000+02:00",
  "article99": "0",
  "loiReference": {}
}