{
  "uid": "AMANR5L15SEA717460BTC1924P0D1N220",
  "identifiant": {
    "legislature": "15",
    "numero": "220",
    "numRect": "0",
    "saisine": {
      "texteLegislatifRef": "PRJLANR5L15BTC1924",
      "numeroPartiePLF": "0",
      "organeExamen": "PO717460",
      "mentionSecondeDeliberation": "0"
    }
  },
  "numeroLong": "220",
  "etapeTexte": "1ère lecture (1ère assemblée saisie)",
  "triAmendement": "boaaaaaaaaaaaaaaaaaaaaaaaaaaaaaaaaaaaaaaaaaaaaaaaaajxs",
  "cardinaliteAmdtMultiples": "1",
  "etat": "Discuté",
  "signataires": {
    "auteur": {
      "typeAuteur": "Depute",
      "acteurRef": "PA721314",
      "groupePolitiqueRef": "PO730934"
    },
    "cosignatairesRefs": [
      "PA767",
      "PA267260",
      "PA266776",
      "PA330909",
      "PA608416",
      "PA340853",
      "PA718780",
      "PA1327",
      "PA643089",
      "PA721314",
      "PA267378",
      "PA721636",
      "PA267901",
      "PA721506",
      "PA608016",
      "PA266808"
    ],
    "texteAffichable": "M.&#160;Schellenberger,  M.&#160;Kamardine, Mme&#160;Louwagie, Mme&#160;Levy, M.&#160;Hetzel, M.&#160;Rolland, M.&#160;Leclerc, M.&#160;Forissier, M.&#160;Reiss, M.&#160;Thi&#233;riot, M.&#160;Parigi, M.&#160;Cattin, Mme&#160;Poletti, M.&#160;Descoeur, Mme&#160;Trastour-Isnart et Mme&#160;Kuster"
  },
  "pointeurFragmentTexte": {
    "division": {
      "titre": "Article 7",
      "articleDesignationCourte": "ART. 7",
      "type": "ARTICLE",
      "avantAApres": "A",
      "divisionRattachee": "ARTICLE 7",
      "urlDivisionTexteVise": "/15/textes/1924.asp#D_Article_7"
    },
    "alinea": {
      "avantAApres": "A",
      "numero": "6",
      "alineaDesignation": "Alinéa 6"
    }
  },
  "corps": {
    "dispositif": "<p style=\"text-align: justify;\">&#192; l&#8217;alin&#233;a&#160;6, substituer &#224; la premi&#232;re occurrence du nombre&#160;:</p><p style=\"text-align: justify;\">&#171;&#160;40&#160;000&#160;&#187;</p><p style=\"text-align: justify;\">le nombre&#160;:</p><p style=\"text-align: justify;\">&#171;&#160;10&#160;000&#160;&#187;.</p>",
    "exposeSommaire": "<p style=\"text-align: justify;\">L&#8217;article&#160;7 du projet de loi propose de diversifier les viviers de recrutement dans l&#8217;encadrement sup&#233;rieur de la fonction publique en &#233;largissant la possibilit&#233; de nommer des personnes n&#8217;ayant pas la qualit&#233; de fonctionnaire aux postes de directeur g&#233;n&#233;ral des services, directeur g&#233;n&#233;ral adjoint des services et directeur g&#233;n&#233;ral des services techniques des communes de plus de 40 000 habitants et des &#233;tablissements publics de coop&#233;ration intercommunale &#224; fiscalit&#233; propre de plus de 40 000 habitants &#233;galement.</p><p style=\"text-align: justify;\">Le pr&#233;sent amendement &#233;tend cette possibilit&#233; &#224; l&#8217;ensemble des communes de plus de 10 000 habitants et des &#233;tablissements publics de coop&#233;ration intercommunale &#224; fiscalit&#233; propre de plus de 10 000 habitants.</p>"
  },
  "representations": [
    {
      "nom": "PDF",
      "typeMime": {
        "type": "application",
        "subType": "PDF"
      },
      "statutRepresentation": {
        "verbatim": true,
        "canonique": true,
        "officielle": true,
        "transcription": false,
        "enregistrement": false
      },
      "contenu": {
        "documentURI": "/15/amendements/1924/AN/220.pdf"
      }
    }
  ],
  "sort": {
    "dateSaisie": "2019-05-16T17:41:58.000+02:00",
    "sortEnSeance": "Rejeté"
  },
  "dateDepot": "2019-05-07T02:00:00.000+02:00",
  "dateDistribution": "2019-05-10T02:00:00.000+02:00",
  "article99": "0",
  "loiReference": {}
}