{
  "uid": "AMANR5L15PO419865B1831P0D1N393",
  "identifiant": {
    "legislature": "15",
    "numero": "393",
    "numRect": "0",
    "saisine": {
      "texteLegislatifRef": "PRJLANR5L15B1831",
      "numeroPartiePLF": "0",
      "organeExamen": "PO419865",
      "mentionSecondeDeliberation": "0"
    }
  },
  "numeroLong": "CD393",
  "etapeTexte": "1ère lecture (2ème assemblée saisie)",
  "triAmendement": "bdaaaaaaaaaaaaaaaaaaaaaaaaaaaaaaaaaaaaaaaaaaaaaaaadod",
  "cardinaliteAmdtMultiples": "1",
  "etat": "Discuté",
  "signataires": {
    "auteur": {
      "typeAuteur": "Depute",
      "acteurRef": "PA719624",
      "groupePolitiqueRef": "PO730964"
    },
    "cosignatairesRefs": [
      "PA719624"
    ],
    "texteAffichable": "Mme&#160;Couillard, rapporteure"
  },
  "pointeurFragmentTexte": {
    "division": {
      "titre": "Article 9",
      "articleDesignationCourte": "ART. 9",
      "type": "ARTICLE",
      "avantAApres": "A",
      "divisionRattachee": "ARTICLE 9",
      "urlDivisionTexteVise": "/15/textes/1831.asp#D_Article_9"
    },
    "alinea": {
      "numero": "6"
    }
  },
  "corps": {
    "dispositif": "<p style=\"text-align: justify;\">&#192; la premi&#232;re phrase de l&#8217;alin&#233;a&#160;6, substituer aux mots&#160;:</p><p style=\"text-align: justify;\">&#171;&#160;r&#232;glement mentionn&#233; au premier alin&#233;a du pr&#233;sent article&#160;&#187;</p><p style=\"text-align: justify;\">les mots&#160;:</p><p style=\"text-align: justify;\">&#171;&#160;m&#234;me r&#232;glement d&#233;l&#233;gu&#233;&#160;&#187;.</p>",
    "exposeSommaire": "<p style=\"text-align: justify;\">Amendement r&#233;dactionnel.</p>"
  },
  "representations": [
    {
      "nom": "PDF",
      "typeMime": {
        "type": "application",
        "subType": "PDF"
      },
      "statutRepresentation": {
        "verbatim": true,
        "canonique": true,
        "officielle": true,
        "transcription": false,
        "enregistrement": false
      },
      "contenu": {
        "documentURI": "/15/amendements/1831/CION-DVP/CD393.pdf"
      }
    }
  ],
  "sort": {
    "dateSaisie": "2019-05-16T21:34:35.000+02:00",
    "sortEnSeance": "Adopté"
  },
  "dateDepot": "2019-04-30T02:00:00.000+02:00",
  "dateDistribution": "2019-05-14T02:00:00.000+02:00",
  "article99": "0",
  "loiReference": {
    "codeLoi": "1"
  }
}