{
  "uid": "AMANR5L15SEA717460BTC2401P0D1N1121",
  "identifiant": {
    "legislature": "15",
    "numero": "1121",
    "numRect": "0",
    "saisine": {
      "texteLegislatifRef": "PRJLANR5L15BTC2401",
      "numeroPartiePLF": "0",
      "organeExamen": "PO717460",
      "mentionSecondeDeliberation": "0"
    }
  },
  "numeroLong": "1121",
  "etapeTexte": "1ère lecture (2ème assemblée saisie)",
  "triAmendement": "bbiaaaaaaaaaaaaaaaaaaaaaaaaaaaaaaaaaaaaaaaaaaaaaaatjdv",
  "cardinaliteAmdtMultiples": "1",
  "etat": "Retiré",
  "signataires": {
    "auteur": {
      "typeAuteur": "Depute",
      "acteurRef": "PA334149",
      "groupePolitiqueRef": "PO730934"
    },
    "cosignatairesRefs": [
      "PA721506",
      "PA718884",
      "PA334149",
      "PA267429"
    ],
    "texteAffichable": "M.&#160;Fasquelle,  M.&#160;Cinieri, Mme&#160;Bazin-Malgras et Mme&#160;Kuster"
  },
  "pointeurFragmentTexte": {
    "division": {
      "titre": "Article 6",
      "articleDesignationCourte": "ART. 6",
      "type": "ARTICLE",
      "avantAApres": "A",
      "divisionRattachee": "ARTICLE 6",
      "urlDivisionTexteVise": "/15/textes/2401.asp#D_Article_6"
    },
    "alinea": {
      "avantAApres": "A",
      "numero": "7",
      "alineaDesignation": "Alinéa 7"
    }
  },
  "corps": {
    "dispositif": "<p style=\"text-align: justify; page-break-after: avoid;\">I.&#160;&#8211;&#160;R&#233;tablir les 3&#176;&#160;et 4&#176;&#160;de l&#8217;alin&#233;a&#160;7 dans la r&#233;daction suivante&#160;:</p><p style=\"text-align: justify; page-break-after: avoid;\">&#171;&#160;3&#176;&#160;Le I de l&#8217;article L.&#160;5215&#8209;20 est compl&#233;t&#233; par deux alin&#233;as ainsi r&#233;dig&#233;s&#160;:</p><p style=\"text-align: justify;\">&#171;&#160;Par d&#233;rogation au <i>e</i> du 1&#176;&#160;du pr&#233;sent I, les communes touristiques &#233;rig&#233;es en stations class&#233;es de tourisme en application des articles L.&#160;133&#8209;13 et L.&#160;151&#8209;3 du code du tourisme peuvent d&#233;cider, par d&#233;lib&#233;ration et apr&#232;s avis de l&#8217;organe d&#233;lib&#233;rant de la communaut&#233; urbaine, de conserver ou de retrouver l&#8217;exercice de la comp&#233;tence &#171;&#160;promotion du tourisme, dont la cr&#233;ation d&#8217;offices de tourisme&#160;&#187;. L&#8217;organe d&#233;lib&#233;rant &#233;met cet avis lors de la premi&#232;re r&#233;union suivant la saisine de la commune concern&#233;e. La communaut&#233; urbaine conserve, concurremment &#224; ladite commune et sur son territoire, l&#8217;exercice de cette m&#234;me comp&#233;tence, &#224; l&#8217;exclusion de la cr&#233;ation d&#8217;offices de tourisme.</p><p style=\"text-align: justify;\">&#171;&#160;En cas de perte du classement en station de tourisme, la d&#233;lib&#233;ration du conseil municipal par laquelle la commune a d&#233;cid&#233; de conserver ou de retrouver la comp&#233;tence &#171;&#160;promotion du tourisme, dont la cr&#233;ation d&#8217;offices de tourisme&#160;&#187; cesse de produire ses effets et la comp&#233;tence est int&#233;gralement exerc&#233;e par la communaut&#233; urbaine en lieu et place de la commune.&#160;&#187;&#160;;</p><p style=\"text-align: justify; page-break-after: avoid;\">&#171;&#160;4&#176;&#160;Le I de l&#8217;article L.&#160;5215&#8209;20&#8209;1 est compl&#233;t&#233; par deux alin&#233;as ainsi r&#233;dig&#233;s&#160;:</p><p style=\"text-align: justify;\">&#171;&#160;Par d&#233;rogation au 2&#176;&#160;du pr&#233;sent I, les communes touristiques &#233;rig&#233;es en stations class&#233;es de tourisme en application des articles L.&#160;133&#8209;13 et L.&#160;151&#8209;3 du code du tourisme peuvent d&#233;cider, par d&#233;lib&#233;ration et apr&#232;s avis de l&#8217;organe d&#233;lib&#233;rant de la communaut&#233; urbaine, de conserver ou de retrouver l&#8217;exercice de la comp&#233;tence&#160;&#187;promotion du tourisme, dont la cr&#233;ation d&#8217;offices de tourisme&#171;&#160;. L&#8217;organe d&#233;lib&#233;rant &#233;met cet avis lors de la premi&#232;re r&#233;union suivant la saisine de la commune concern&#233;e. La communaut&#233; urbaine conserve, concurremment &#224; ladite commune et sur son territoire, l&#8217;exercice de cette m&#234;me comp&#233;tence, &#224; l&#8217;exclusion de la cr&#233;ation d&#8217;offices de tourisme.</p><p style=\"text-align: justify;\">&#171;&#160;En cas de perte du classement en station de tourisme, la d&#233;lib&#233;ration du conseil municipal par laquelle la commune a d&#233;cid&#233; de conserver ou de retrouver la comp&#233;tence &#171;&#160;promotion du tourisme, dont la cr&#233;ation d&#8217;offices de tourisme&#160;&#187; cesse de produire ses effets et la comp&#233;tence est int&#233;gralement exerc&#233;e par la communaut&#233; urbaine en lieu et place de la commune.&#160;&#187;</p><p style=\"text-align: justify; page-break-after: avoid;\">II.&#160;&#8211;&#160;En cons&#233;quence, r&#233;tablir les 6&#176;&#160;et 7&#176;&#160;de l&#8217;alin&#233;a&#160;11 dans la r&#233;daction suivante&#160;:</p><p style=\"text-align: justify; page-break-after: avoid;\">&#171;&#160;6&#176;&#160;Le I de l&#8217;article L.&#160;5217&#8209;2 est compl&#233;t&#233; par deux alin&#233;as ainsi r&#233;dig&#233;s&#160;:</p><p style=\"text-align: justify;\">&#171;&#160;Par d&#233;rogation au <i>d</i> du 1&#176;&#160;du pr&#233;sent I, les communes touristiques &#233;rig&#233;es en stations class&#233;es de tourisme en application des articles L.&#160;133&#8209;13 et L.&#160;151&#8209;3 du code du tourisme peuvent d&#233;cider, par d&#233;lib&#233;ration et apr&#232;s avis de l&#8217;organe d&#233;lib&#233;rant de la m&#233;tropole, de conserver ou de retrouver l&#8217;exercice de la comp&#233;tence &#171;&#160;promotion du tourisme, dont la cr&#233;ation d&#8217;offices de tourisme&#160;&#187;. L&#8217;organe d&#233;lib&#233;rant &#233;met cet avis lors de la premi&#232;re r&#233;union suivant la saisine de la commune concern&#233;e. La m&#233;tropole conserve, concurremment &#224; ladite commune et sur son territoire, l&#8217;exercice de cette m&#234;me comp&#233;tence, &#224; l&#8217;exclusion de la cr&#233;ation d&#8217;offices de tourisme.</p><p style=\"text-align: justify;\">&#171;&#160;En cas de perte du classement en station de tourisme, la d&#233;lib&#233;ration du conseil municipal par laquelle la commune a d&#233;cid&#233; de conserver ou de retrouver la comp&#233;tence &#171;&#160;promotion du tourisme, dont la cr&#233;ation d&#8217;offices de tourisme&#160;&#187; cesse de produire ses effets et la comp&#233;tence est int&#233;gralement exerc&#233;e par la m&#233;tropole en lieu et place de la commune.&#160;&#187;&#160;;</p><p style=\"text-align: justify;\">&#171;&#160;7&#176;&#160;Les deuxi&#232;me et dernier alin&#233;a du I de l&#8217;article L.&#160;5218&#8209;2 sont supprim&#233;s.&#160;&#187;</p>",
    "exposeSommaire": "<p style=\"text-align: justify;\">Les communes touristiques &#233;rig&#233;es en stations class&#233;es de tourisme en application des articles L.&#160;133&#8209;13 et L.&#160;151&#8209;3 du code du tourisme qui appartiennent &#224; des communaut&#233;s de communes et des communaut&#233;s d&#8217;agglom&#233;rations peuvent d&#233;cider de conserver ou retrouver l&#8217;exercice de la comp&#233;tence &#171;&#160;promotion du tourisme, dont la cr&#233;ation d&#8217;offices de tourisme&#160;&#187;.</p><p style=\"text-align: justify;\">Ne pas ouvrir cette possibilit&#233; aux stations class&#233; de tourisme appartenant &#224; des communaut&#233;s urbaines ou des m&#233;tropoles repr&#233;sente une in&#233;galit&#233; entre les territoires.</p><p style=\"text-align: justify;\">Cet amendement vise &#224; pallier &#224; cette in&#233;galit&#233;.</p><p style=\"text-align: justify;\">De plus, au sein des m&#233;tropoles et des communaut&#233;s urbaines, les communes conservent les comp&#233;tences de proximit&#233;. Les m&#233;tropoles et les communaut&#233;s ont les comp&#233;tences d&#8217;am&#233;nagement et de travaux. Le tourisme doit &#234;tre port&#233; par les communes en ce sens qu&#8217;il est g&#233;r&#233; en proximit&#233; par les communes.</p>"
  },
  "representations": [
    {
      "nom": "PDF",
      "typeMime": {
        "type": "application",
        "subType": "PDF"
      },
      "statutRepresentation": {
        "verbatim": true,
        "canonique": true,
        "officielle": true,
        "transcription": false,
        "enregistrement": false
      },
      "contenu": {
        "documentURI": "/15/amendements/2401/AN/1121.pdf"
      }
    }
  ],
  "dateDepot": "2019-11-14T01:00:00.000+01:00",
  "dateDistribution": "2019-11-18T01:00:00.000+01:00",
  "article99": "0",
  "loiReference": {}
}