{
  "uid": "AMANR5L15SEA717460B2272P1D1N375",
  "identifiant": {
    "legislature": "15",
    "numero": "375",
    "numRect": "0",
    "saisine": {
      "texteLegislatifRef": "PRJLANR5L15B2272",
      "numeroPartiePLF": "1",
      "organeExamen": "PO717460",
      "mentionSecondeDeliberation": "1"
    }
  },
  "numeroLong": "I-375",
  "etapeTexte": "1ère lecture (1ère assemblée saisie)",
  "triAmendement": "jccaaaaaaaaaaaaaaaaaaaaaaaaaaaaaaaaaaaaaaaaaaaaaaazzzzzzzzzzzzzzzzzzzzzzzzzzzzzzzzzzzzzzzzzzwjzzzzzzzzu",
  "cardinaliteAmdtMultiples": "1",
  "etat": "Discuté",
  "signataires": {
    "auteur": {
      "typeAuteur": "Depute",
      "acteurRef": "PA607090",
      "groupePolitiqueRef": "PO730934"
    },
    "cosignatairesRefs": [
      "PA607090"
    ],
    "texteAffichable": "M.&#160;Jean-Pierre&#160;Vigier"
  },
  "pointeurFragmentTexte": {
    "division": {
      "titre": "Article 27",
      "articleDesignationCourte": "ART. 27",
      "type": "ARTICLE",
      "avantAApres": "A",
      "divisionRattachee": "ARTICLE 27",
      "urlDivisionTexteVise": "/15/textes/2272A.asp#D_Article_27"
    },
    "alinea": {
      "numero": "21"
    }
  },
  "corps": {
    "dispositif": "<p style=\"text-align: justify;\">Supprimer l&#8217;alin&#233;a&#160;21.</p>",
    "exposeSommaire": "<p style=\"text-align: justify;\">Le pr&#233;sent amendement a pour objet de maintenir le montant de la taxe (TATFNB) notifi&#233; aux Chambres d&#8217;agriculture pour 2020 &#224; hauteur du montant de la taxe notifi&#233; pour 2019.</p><p style=\"text-align: justify;\">L&#8217;agriculture est confront&#233;e &#224; de multiples d&#233;fis &#233;conomiques, environnementaux et climatiques et les attentes tant soci&#233;tales qu&#8217;en mati&#232;re de transition s&#8217;accentuent vis-&#224;-vis des agriculteurs. D&#233;j&#224; engag&#233;s dans l&#8217;&#233;volution de leurs pratiques, les agriculteurs sont pr&#234;ts &#224; poursuivre leurs efforts et les Chambres d&#8217;agriculture sont d&#233;termin&#233;es &#224; accompagner au quotidien cette &#233;volution. </p><p style=\"text-align: justify;\">Des discussions ont &#233;t&#233; initi&#233;es d&#232;s l&#8217;automne 2018 avec le Premier ministre afin de formaliser cette ambition par la signature d&#8217;un Contrat d&#8217;objectifs entre l&#8217;&#201;tat et le r&#233;seau. Depuis le 26 septembre 2019, les Chambres ont franchi une &#233;tape suppl&#233;mentaire dans cette ambition en pr&#233;sentant leur projet strat&#233;gique 2019&#8209;2025. Ce projet collectif est voulu dans ses orientations comme une r&#233;ponse aux attentes plac&#233;es dans la transition de notre mod&#232;le agricole.</p><p style=\"text-align: justify;\">Imposer une baisse des ressources des Chambres d&#8217;agriculture est, au regard de ces enjeux majeurs, &#224; la fois paradoxal et contreproductif alors que ces orientations requi&#232;rent &#224; minima une stabilit&#233; de moyens financiers. En cela, toute diminution du plafond de la TATFNB est inacceptable car elle remet gravement en cause les ambitions port&#233;es pour l&#8217;agriculture ainsi que l&#8217;atteinte des objectifs fix&#233;s dans le cadre du projet strat&#233;gique des Chambres.</p><p style=\"text-align: justify;\">Un parall&#233;lisme de forme avec les baisses de financement impos&#233;es aux CCI et CMA ne saurait &#234;tre raisonnablement &#233;voqu&#233;, tant les missions et le p&#233;rim&#232;tre d&#8217;intervention du r&#233;seau consulaire agricole est &#224; la fois sp&#233;cifique et complexe.</p><p style=\"text-align: justify;\">D&#8217;une part, la baisse du plafond impactera les capacit&#233;s financi&#232;res du r&#233;seau dans une proportion tr&#232;s sup&#233;rieure au montant affich&#233;. En effet, mobilis&#233; sur des politiques publiques et dispositifs cofinanc&#233;s, le produit de cette taxe permet de g&#233;n&#233;rer syst&#233;matiquement un financement au moins &#233;quivalent &#224; la somme investie par les Chambres.</p><p style=\"text-align: justify;\">D&#8217;autre part, la perte de recette impos&#233;e aux Chambres d&#8217;agriculture ne b&#233;n&#233;ficiera pas aux finances de l&#8217;&#201;tat et ne fournira pas de regain de comp&#233;titivit&#233; aux agriculteurs. Cette baisse de taxe s&#8217;effectuera avant tout au profit des propri&#233;taires fonciers et sera imparfaitement r&#233;percut&#233;e au profit des exploitants, dont seulement pr&#232;s de 20&#160;% sont propri&#233;taires de leurs terres.</p><p style=\"text-align: justify;\">De plus, cette baisse conduira &#224; une r&#233;duction des offres de services propos&#233;es par les Chambres d&#8217;agriculture et &#224; une hausse de leur co&#251;t, r&#233;servant ainsi l&#8217;accompagnement et la transition aux seuls agriculteurs financi&#232;rement en capacit&#233; de se faire conseiller.</p><p style=\"text-align: justify;\">Enfin, il faut noter que l&#8217;&#233;volution de la TATFNB a &#233;t&#233; nettement inf&#233;rieure &#224; l&#8217;inflation ces 10 derni&#232;res ann&#233;es et tr&#232;s en-de&#231;&#224; de l&#8217;&#233;volution des autres taxes et imp&#244;ts locaux, d&#8217;autant que la TATFNB, fix&#233;e en valeur et non en taux, ne b&#233;n&#233;ficie pas de la revalorisation des bases imposables.</p>"
  },
  "representations": [
    {
      "nom": "PDF",
      "typeMime": {
        "type": "application",
        "subType": "PDF"
      },
      "statutRepresentation": {
        "verbatim": true,
        "canonique": true,
        "officielle": true,
        "transcription": false,
        "enregistrement": false
      },
      "contenu": {
        "documentURI": "/15/amendements/2272A/AN/375.pdf"
      }
    }
  ],
  "seanceDiscussion": "RUANR5L15S2020IDS21886",
  "sort": {
    "dateSaisie": "2019-10-22T00:28:42.000+02:00",
    "sortEnSeance": "Tombé"
  },
  "dateDepot": "2019-10-08T02:00:00.000+02:00",
  "dateDistribution": "2019-10-21T02:00:00.000+02:00",
  "article99": "0",
  "loiReference": {}
}