{
  "uid": "AMANR5L15SEA717460B1255P2D1N1274",
  "identifiant": {
    "legislature": "15",
    "numero": "1274",
    "numRect": "0",
    "saisine": {
      "texteLegislatifRef": "PRJLANR5L15B1255",
      "numeroPartiePLF": "2",
      "organeExamen": "PO717460",
      "mentionSecondeDeliberation": "0"
    }
  },
  "numeroLong": "II-1274",
  "etapeTexte": "1ère lecture (1ère assemblée saisie)",
  "triAmendement": "bagaaaaaaaaaaaaaaaaaaaaaaaaaaaaaaaaaaaaaaaaaaaaaaaanm",
  "cardinaliteAmdtMultiples": "1",
  "etat": "Discuté",
  "signataires": {
    "auteur": {
      "typeAuteur": "Depute",
      "acteurRef": "PA719472",
      "groupePolitiqueRef": "PO730964"
    },
    "cosignatairesRefs": [
      "PA719060",
      "PA719472"
    ],
    "texteAffichable": "M.&#160;Cazeneuve et M.&#160;Jerretie"
  },
  "pointeurFragmentTexte": {
    "missionVisee": {
      "idMissionAN": "415",
      "libelleMission": "Relations avec les collectivités territoriales",
      "codeMissionPLF": "B",
      "libelleMissionPLF": "Répartition, par mission et programme, des crédits du budget général"
    },
    "division": {
      "titre": "Article 79",
      "articleDesignationCourte": "ART. 79",
      "type": "ARTICLE",
      "avantAApres": "A",
      "divisionRattachee": "ARTICLE 79",
      "urlDivisionTexteVise": "/15/textes/1255C.asp#D_Article_79"
    },
    "alinea": {
      "numero": "39"
    }
  },
  "corps": {
    "dispositif": "<p style=\"text-align: justify;\">I. &#8211; &#192; l&#8217;alin&#233;a&#160;39, substituer &#224; la seconde occurrence du mot&#160;:</p><p style=\"text-align: justify;\">&#171;&#160;du&#160;&#187;,</p><p style=\"text-align: justify;\">le mot&#160;:</p><p style=\"text-align: justify;\">&#171;&#160;le&#160;&#187;.</p><p style=\"text-align: justify;\">II. &#8211; En cons&#233;quence, proc&#233;der &#224; la m&#234;me substitution &#224; l&#8217;alin&#233;a&#160;40.</p>",
    "exposeSommaire": "<p>R&#233;dactionnel.</p>"
  },
  "representations": [
    {
      "nom": "PDF",
      "typeMime": {
        "type": "application",
        "subType": "PDF"
      },
      "statutRepresentation": {
        "verbatim": true,
        "canonique": true,
        "officielle": true,
        "transcription": false,
        "enregistrement": false
      },
      "contenu": {
        "documentURI": "/15/amendements/1255C/AN/1274.pdf"
      }
    }
  ],
  "seanceDiscussion": "RUANR5L15S2019IDS21333",
  "sort": {
    "dateSaisie": "2018-11-08T22:34:30.000+01:00",
    "sortEnSeance": "Adopté"
  },
  "dateDepot": "2018-11-05T01:00:00.000+01:00",
  "dateDistribution": "2018-11-07T01:00:00.000+01:00",
  "article99": "0",
  "loiReference": {}
}