{
  "uid": "AMANR5L15PO420120B1297P0D1N401",
  "identifiant": {
    "legislature": "15",
    "numero": "401",
    "numRect": "0",
    "saisine": {
      "texteLegislatifRef": "PRJLANR5L15B1297",
      "numeroPartiePLF": "0",
      "organeExamen": "PO420120",
      "mentionSecondeDeliberation": "0"
    }
  },
  "numeroLong": "AS401",
  "etapeTexte": "1ère lecture (1ère assemblée saisie)",
  "triAmendement": "jjaaaaaaaaaaaaaaaaaaaaaaaaaaaaaaaaaaaaaaaaaaaaaaaacjg",
  "cardinaliteAmdtMultiples": "1",
  "etat": "Discuté",
  "signataires": {
    "auteur": {
      "typeAuteur": "Depute",
      "acteurRef": "PA608292",
      "groupePolitiqueRef": "PO723569"
    },
    "cosignatairesRefs": [
      "PA608292"
    ],
    "texteAffichable": "Mme&#160;Dubi&#233;"
  },
  "pointeurFragmentTexte": {
    "division": {
      "titre": "Article 41",
      "articleDesignationCourte": "APRÈS ART. 41",
      "type": "ARTICLE",
      "avantAApres": "Apres",
      "divisionRattachee": "APRÈS L'ARTICLE 41, insérer l'article suivant:",
      "articleAdditionnel": "1",
      "urlDivisionTexteVise": "/15/textes/1297.asp#D_Article_41"
    }
  },
  "corps": {
    "dispositif": "<p style=\"text-align: justify;\">L&#8217;article L.&#160;314&#8209;7&#8209;1 du code de l&#8217;action sociale est des familles est ainsi modifi&#233;&#160;:</p><p style=\"text-align: justify;\">1&#176;&#160;La premi&#232;re phrase du premier alin&#233;a est ainsi r&#233;dig&#233;e&#160;:</p><p style=\"text-align: justify;\">&#171;&#160;Les deux premiers alin&#233;as de l&#8217;article L.&#160;314&#8209;5 ainsi que le 3&#176; du I, le premier alin&#233;a du II et le III de l&#8217;article L.&#160;314&#8209;7 ne s&#8217;appliquent pas aux &#233;tablissements et services mentionn&#233;s aux 2&#176;, 3&#176;, 5&#176;, 6&#176;, 7&#176;, 9&#176; et 12&#176; du I de l&#8217;article L.&#160;312&#8209;1.&#160;&#187;&#160;</p><p style=\"text-align: justify;\">2&#176;&#160;Il est ajout&#233; un alin&#233;a ainsi r&#233;dig&#233;&#160;:</p><p style=\"text-align: justify;\">&#171;&#160;Lorsque ces &#233;tablissements et services ne rel&#232;vent pas du IV <i>ter</i> de l&#8217;article L.&#160;313&#8209;12 et de l&#8217;article L.&#160;313&#8209;12&#8209;2, le remplacement des documents mentionn&#233;s &#224; l&#8217;alin&#233;a pr&#233;c&#233;dent est subordonn&#233; &#224; l&#8217;accord de la personne morale gestionnaire de ces &#233;tablissements et services.&#160;&#187;</p>",
    "exposeSommaire": "<p>L&#8217;article 58 de la loi d&#8217;adaptation de la soci&#233;t&#233; au vieillissement du 28 d&#233;cembre 2015 a pr&#233;vu la g&#233;n&#233;ralisation progressive des CPOM dans les EHPAD. Il g&#233;n&#233;ralise &#233;galement de mani&#232;re imm&#233;diate (au 1er janvier 2017) le passage &#224; l&#8217;EPRD de ces &#233;tablissements, d&#233;connectant ainsi CPOM et EPRD pour assouplir le dialogue de gestion entre les autorit&#233;s de contr&#244;le et de tarification et les gestionnaires et permettre une plus grande souplesse de gestion. L&#8217;EPRD permet de concilier la transparence sur l&#8217;emploi des cr&#233;dits et une souplesse de gestion accrue pour les organismes gestionnaires afin, notamment, de pouvoir conduire la transformation de l&#8217;offre attendue par les pouvoirs publics.</p><p>Le pr&#233;sent article vise &#224; &#233;tendre l'Etat pr&#233;visionnel des recettes et des d&#233;penses (EPRD), pour les gestionnaires qui le souhaitent, &#224; l'ensemble des ESMS (&#201;tablissement et services m&#233;dicaux-sociaux accompagnants les personnes handicap&#233;es - notamment, les structures de la pr&#233;vention et des soins en addictologie/ lits halte soins sant&#233;/lits d'accueil m&#233;dicalis&#233;s) dans un souci de simplification et d'&#233;galit&#233; de traitement entre les &#233;tablissements. Il s&#8217;agit d&#8217;une mesure de coh&#233;rence permettant d&#8217;homog&#233;n&#233;iser les r&#232;gles de pr&#233;sentation budg&#233;taire pour l&#8217;ensemble des ESMS (CPOM ou non, tarification &#224; la ressource ou non) et d&#8217;assurer une pr&#233;sentation des budgets de fonctionnement plus lisible et plus adapt&#233;e, notamment pour les organismes gestionnaires g&#233;rant plusieurs autorisations.</p><p>&#160;</p>"
  },
  "representations": [
    {
      "nom": "PDF",
      "typeMime": {
        "type": "application",
        "subType": "PDF"
      },
      "statutRepresentation": {
        "verbatim": true,
        "canonique": true,
        "officielle": true,
        "transcription": false,
        "enregistrement": false
      },
      "contenu": {
        "documentURI": "/15/amendements/1297/CION-SOC/AS401.pdf"
      }
    }
  ],
  "sort": {
    "dateSaisie": "2018-10-17T16:50:20.000+02:00",
    "sortEnSeance": "Non soutenu"
  },
  "dateDepot": "2018-10-12T02:00:00.000+02:00",
  "dateDistribution": "2018-10-16T02:00:00.000+02:00",
  "article99": "0",
  "loiReference": {
    "codeLoi": "action sociale et familles",
    "divisionCodeLoi": "L314-7-1"
  }
}