{
  "uid": "AMANR5L15SEA717460BTC1629P0D1N905",
  "identifiant": {
    "legislature": "15",
    "numero": "905",
    "numRect": "0",
    "saisine": {
      "texteLegislatifRef": "PRJLANR5L15BTC1629",
      "numeroPartiePLF": "0",
      "organeExamen": "PO717460",
      "mentionSecondeDeliberation": "1"
    }
  },
  "numeroLong": "905",
  "etapeTexte": "1ère lecture (1ère assemblée saisie)",
  "triAmendement": "daaaaaaaaaaaaaaaaaaaaaaaaaaaaaaaaaaaaaaaaaaaaaaaaaam",
  "cardinaliteAmdtMultiples": "1",
  "etat": "Discuté",
  "signataires": {
    "auteur": {
      "typeAuteur": "Depute",
      "acteurRef": "PA719170",
      "groupePolitiqueRef": "PO730964"
    },
    "cosignatairesRefs": [
      "PA719170"
    ],
    "texteAffichable": "Mme&#160;Charvier"
  },
  "pointeurFragmentTexte": {
    "division": {
      "titre": "Article 6 quater",
      "articleDesignationCourte": "ART. 6 QUATER",
      "type": "ARTICLE",
      "avantAApres": "A",
      "divisionRattachee": "ARTICLE 6 QUATER",
      "urlDivisionTexteVise": "/15/textes/1629.asp#D_Article_6_quater"
    },
    "alinea": {
      "numero": "3"
    }
  },
  "corps": {
    "dispositif": "<p>I.&#160;&#8211;&#160;&#192; l&#8217;alin&#233;a&#160;3, apr&#232;s le mot&#160;: </p><p>&#171;&#160;publics&#160;&#187;, </p><p>ins&#233;rer les mots&#160;:</p><p>&#171;&#160;locaux d&#8217;enseignement&#160;&#187;.</p><p>II.&#160;&#8211;&#160;En cons&#233;quence, proc&#233;der &#224; la m&#234;me insertion &#224; la premi&#232;re phrase des alin&#233;as 4 et 8.</p><p>III.&#160;&#8211;&#160;En cons&#233;quence, &#224; la premi&#232;re phrase de l&#8217;alin&#233;a&#160;13, supprimer les mots&#160;:</p><p>&#171;&#160;du r&#233;seau&#160;&#187;.</p>",
    "exposeSommaire": "<p style=\"text-align: justify;\">Cet amendement vise &#224; nommer les &#233;tablissements regroupant le premier et le second degr&#233;s des &#171;&#160;&#233;tablissements publics locaux d&#8217;enseignement des savoirs fondamentaux&#160;&#187;. Il s&#8217;agit en effet avant tout d&#8217;&#233;tablissements publics locaux d&#8217;enseignement (EPLE) au m&#234;me titre que les coll&#232;ges et les lyc&#233;es.</p>"
  },
  "representations": [
    {
      "nom": "PDF",
      "typeMime": {
        "type": "application",
        "subType": "PDF"
      },
      "statutRepresentation": {
        "verbatim": true,
        "canonique": true,
        "officielle": true,
        "transcription": false,
        "enregistrement": false
      },
      "contenu": {
        "documentURI": "/15/amendements/1629/AN/905.pdf"
      }
    }
  ],
  "seanceDiscussion": "RUANR5L15S2019IDS21507",
  "sort": {
    "dateSaisie": "2019-02-15T15:05:12.000+01:00",
    "sortEnSeance": "Adopté"
  },
  "dateDepot": "2019-02-07T01:00:00.000+01:00",
  "dateDistribution": "2019-02-15T01:00:00.000+01:00",
  "article99": "0",
  "loiReference": {}
}