{
  "uid": "AMANR5L15SEA717460BTC2243P0D1N1945",
  "identifiant": {
    "legislature": "15",
    "numero": "1945",
    "numRect": "0",
    "saisine": {
      "texteLegislatifRef": "PRJLANR5L15BTC2243",
      "numeroPartiePLF": "0",
      "organeExamen": "PO717460",
      "mentionSecondeDeliberation": "0"
    }
  },
  "numeroLong": "1945",
  "etapeTexte": "1ère lecture (1ère assemblée saisie)",
  "triAmendement": "dsaaaaaaaaaaaaaaaaaaaaaaaaaaaaaaaaaaaaaaaaaaaaaaaaewozo",
  "cardinaliteAmdtMultiples": "1",
  "etat": "Retiré",
  "signataires": {
    "auteur": {
      "typeAuteur": "Depute",
      "acteurRef": "PA720568",
      "groupePolitiqueRef": "PO723569"
    },
    "cosignatairesRefs": [
      "PA720664",
      "PA720568"
    ],
    "texteAffichable": "Mme&#160;Thill et M.&#160;Evrard"
  },
  "pointeurFragmentTexte": {
    "division": {
      "titre": "Article 14",
      "articleDesignationCourte": "ART. 14",
      "type": "ARTICLE",
      "avantAApres": "A",
      "divisionRattachee": "ARTICLE 14",
      "urlDivisionTexteVise": "/15/textes/2243.asp#D_Article_14"
    },
    "alinea": {
      "numero": "1"
    }
  },
  "corps": {},
  "representations": [
    {
      "nom": "PDF",
      "typeMime": {
        "type": "application",
        "subType": "PDF"
      },
      "statutRepresentation": {
        "verbatim": true,
        "canonique": true,
        "officielle": true,
        "transcription": false,
        "enregistrement": false
      },
      "contenu": {
        "documentURI": "/15/amendements/2243/AN/1945.pdf"
      }
    }
  ],
  "dateDepot": "2019-09-20T02:00:00.000+02:00",
  "dateDistribution": "2019-09-20T02:00:00.000+02:00",
  "article99": "0",
  "loiReference": {}
}