{
  "uid": "AMANR5L15PO419610B1135P0D1N229",
  "identifiant": {
    "legislature": "15",
    "numero": "229",
    "numRect": "0",
    "saisine": {
      "texteLegislatifRef": "PRJLANR5L15B1135",
      "numeroPartiePLF": "0",
      "organeExamen": "PO419610",
      "mentionSecondeDeliberation": "0"
    }
  },
  "numeroLong": "CE229",
  "etapeTexte": "Nouvelle Lecture",
  "triAmendement": "s",
  "cardinaliteAmdtMultiples": "1",
  "etat": "Discuté",
  "signataires": {
    "auteur": {
      "typeAuteur": "Depute",
      "acteurRef": "PA719242",
      "groupePolitiqueRef": "PO730964"
    },
    "cosignatairesRefs": [
      "PA719242"
    ],
    "texteAffichable": "M.&#160;Moreau, rapporteur"
  },
  "pointeurFragmentTexte": {
    "division": {
      "titre": "Article 13 bis",
      "articleDesignationCourte": "ART. 13 BIS",
      "type": "ARTICLE",
      "avantAApres": "A",
      "divisionRattachee": "ARTICLE 13 BIS",
      "urlDivisionTexteVise": "/15/textes/1135.asp#D_Article_13_bis"
    },
    "alinea": {
      "numero": "1"
    }
  },
  "corps": {
    "dispositif": "<p style=\"text-align: justify;\">&#192; l&#8217;alin&#233;a&#160;1, apr&#232;s les mots&#160;: &#171;&#160;rapport&#160;&#187;, substituer aux mots&#160;:</p><p style=\"text-align: justify;\">&#171;&#160;&#233;valuant les r&#233;alisations concr&#232;tes en mati&#232;re d&#8217;am&#233;lioration du bien-&#234;tre animal au regard des objectifs fix&#233;s&#160;&#187;,</p><p style=\"text-align: justify;\">les mots&#160;:</p><p style=\"text-align: justify;\">&#171;&#160;portant sur les &#233;volutions souhait&#233;es et les r&#233;alisations concr&#232;tes des volets relatifs au bien-&#234;tre animal pr&#233;vus&#160;&#187;.</p>",
    "exposeSommaire": "<p style=\"text-align: justify;\">Cet amendement vise &#224; r&#233;tablir l&#8217;article&#160;13 <i>bis</i> dans sa r&#233;daction issue du vote de l&#8217;Assembl&#233;e nationale en premi&#232;re lecture.</p>"
  },
  "representations": [
    {
      "nom": "PDF",
      "typeMime": {
        "type": "application",
        "subType": "PDF"
      },
      "statutRepresentation": {
        "verbatim": true,
        "canonique": true,
        "officielle": true,
        "transcription": false,
        "enregistrement": false
      },
      "contenu": {
        "documentURI": "/15/amendements/1135/CION-ECO/CE229.pdf"
      }
    }
  ],
  "sort": {
    "dateSaisie": "2018-07-18T10:16:01.000+02:00",
    "sortEnSeance": "Adopté"
  },
  "dateDepot": "2018-07-12T02:00:00.000+02:00",
  "dateDistribution": "2018-07-16T02:00:00.000+02:00",
  "article99": "0",
  "loiReference": {}
}