{
  "uid": "AMANR5L15PO59051B2357P0D1N220",
  "identifiant": {
    "legislature": "15",
    "numero": "220",
    "numRect": "0",
    "saisine": {
      "texteLegislatifRef": "PRJLANR5L15B2357",
      "numeroPartiePLF": "0",
      "organeExamen": "PO59051",
      "mentionSecondeDeliberation": "0"
    }
  },
  "numeroLong": "CL220",
  "etapeTexte": "1ère lecture (2ème assemblée saisie)",
  "triAmendement": "aaoaaaaaaaaaaaaaaaaaaaaaaaaaaaaaaaaaaaaaaaaaaaaaaabnw",
  "cardinaliteAmdtMultiples": "1",
  "etat": "Discuté",
  "signataires": {
    "auteur": {
      "typeAuteur": "Depute",
      "acteurRef": "PA721314",
      "groupePolitiqueRef": "PO730934"
    },
    "cosignatairesRefs": [
      "PA767",
      "PA267429",
      "PA266808",
      "PA718850",
      "PA266776",
      "PA722390",
      "PA608016",
      "PA712015",
      "PA346218",
      "PA267204",
      "PA719318",
      "PA718884",
      "PA340853",
      "PA334654",
      "PA709315",
      "PA642847",
      "PA266793",
      "PA721678",
      "PA336316",
      "PA721314",
      "PA606712",
      "PA608416"
    ],
    "texteAffichable": "M.&#160;Schellenberger,  M.&#160;Viala, M.&#160;Straumann, M.&#160;Lurton, M.&#160;Hetzel, M.&#160;Cattin, M.&#160;Sermier, M.&#160;Cinieri, M.&#160;Bazin, M.&#160;Reda, M.&#160;Masson, Mme&#160;Corneloup, Mme&#160;Anthoine, Mme&#160;Bazin-Malgras, M.&#160;Reiss, M.&#160;Dive, M.&#160;Cordier, Mme&#160;Louwagie, M.&#160;Rolland, M.&#160;Leclerc, M.&#160;Bony et M.&#160;Bouchet"
  },
  "pointeurFragmentTexte": {
    "division": {
      "titre": "Article PREMIER",
      "articleDesignationCourte": "ART. PREMIER",
      "type": "ARTICLE",
      "avantAApres": "A",
      "divisionRattachee": "ARTICLE PREMIER",
      "urlDivisionTexteVise": "/15/textes/2357.asp#D_Article_1er"
    },
    "alinea": {
      "avantAApres": "Apres",
      "numero": "18"
    }
  },
  "corps": {
    "dispositif": "<p style=\"text-align: justify;\">Apr&#232;s l&#8217;alin&#233;a&#160;18, ins&#233;rer l&#8217;alin&#233;a suivant&#160;:</p><p style=\"text-align: justify;\">&#171;&#160;La conf&#233;rence des maires peut d&#233;terminer, selon ses modalit&#233;s de fonctionnement telles que d&#233;finies au sein du pacte de gouvernance mentionn&#233; &#224; l&#8217;article L.&#160;5211&#8209;11&#8209;1 du pr&#233;sent code, les r&#232;gles relatives &#224; l&#8217;exercice par l&#8217;&#233;tablissement public de coop&#233;ration intercommunale &#224; fiscalit&#233; propre d&#8217;une comp&#233;tence transf&#233;r&#233;e. Ces r&#232;gles d&#233;finies lors du transfert s&#8217;appliquent alors de mani&#232;re contraignante et durable &#224; l&#8217;exercice de ladite comp&#233;tence par l&#8217;&#233;tablissement public de coop&#233;ration intercommunale &#224; fiscalit&#233; propre. Une d&#233;cision ult&#233;rieure de la conf&#233;rence des maires peut &#224; tout moment modifier ces r&#232;gles.&#160;&#187;</p>",
    "exposeSommaire": "<p style=\"text-align: justify;\">L'article 1er de ce projet de loi entend promouvoir un pacte de gouvernance afin de &#171; <i>permettre aux &#233;lus locaux de s'accorder sur le fonctionnement quotidien de leur EPCI</i> &#187;.</p><p style=\"text-align: justify;\">Le pr&#233;sent amendement s'inscrit dans la poursuite de cet objectif en permettant &#224; la conf&#233;rence des maires de d&#233;terminer les r&#232;gles relatives &#224; l'exercice par l&#8217;&#233;tablissement public de coop&#233;ration intercommunale &#224; fiscalit&#233; propre d'une comp&#233;tence transf&#233;r&#233;e. Avec un tel dispositif, les communes pourraient b&#233;n&#233;ficier de garanties solides et durables sur le mode de fonctionnement de leur EPCI lors de son exercice d'une comp&#233;tence transf&#233;r&#233;e sensible. En effet, si des engagements peuvent &#234;tre pris par les &#233;lus au moment du transfert &#224; l'EPCI d'une comp&#233;tence jusqu'alors communale, leur application dans le temps n'est pas s&#233;curis&#233;e alors m&#234;me que le transfert de la comp&#233;tence appara&#238;t bien quant &#224; lui comme &#233;tant irr&#233;versible. L'arr&#234;t, via la conf&#233;rence des maires, de r&#232;gles d'exercice solides et durables peut combler cette difficult&#233; et garantir un respect des r&#232;gles ayant pr&#233;sid&#233;es au transfert de ladite comp&#233;tence.</p><p style=\"text-align: justify;\">Tel est l'objet du pr&#233;sent amendement.</p><p>&#160;</p>"
  },
  "representations": [
    {
      "nom": "PDF",
      "typeMime": {
        "type": "application",
        "subType": "PDF"
      },
      "statutRepresentation": {
        "verbatim": true,
        "canonique": true,
        "officielle": true,
        "transcription": false,
        "enregistrement": false
      },
      "contenu": {
        "documentURI": "/15/amendements/2357/CION_LOIS/CL220.pdf"
      }
    }
  ],
  "sort": {
    "dateSaisie": "2019-11-06T10:37:10.000+01:00",
    "sortEnSeance": "Tombé"
  },
  "dateDepot": "2019-10-30T01:00:00.000+01:00",
  "dateDistribution": "2019-11-05T01:00:00.000+01:00",
  "article99": "0",
  "loiReference": {}
}