{
  "uid": "AMANR5L15SEA717460BTC1974P0D1N2076",
  "identifiant": {
    "legislature": "15",
    "numero": "2076",
    "numRect": "0",
    "saisine": {
      "texteLegislatifRef": "PRJLANR5L15BTC1974",
      "numeroPartiePLF": "0",
      "organeExamen": "PO717460",
      "mentionSecondeDeliberation": "0"
    }
  },
  "numeroLong": "2076",
  "etapeTexte": "1ère lecture (2ème assemblée saisie)",
  "triAmendement": "hiacaaaaaaaaaaaaaaaaaaaaaaaaaaaaaaaaaaaaaaaaaaaaaazzzzzzzzzzzzzzzzzzzzx",
  "cardinaliteAmdtMultiples": "1",
  "etat": "Retiré",
  "signataires": {
    "auteur": {
      "typeAuteur": "Depute",
      "acteurRef": "PA720242",
      "groupePolitiqueRef": "PO730964"
    },
    "cosignatairesRefs": [
      "PA720242"
    ],
    "texteAffichable": "Mme&#160;Abba"
  },
  "pointeurFragmentTexte": {
    "division": {
      "titre": "Article 1er C",
      "articleDesignationCourte": "ART. 1ER C",
      "type": "ARTICLE",
      "avantAApres": "A",
      "divisionRattachee": "ARTICLE 1ER C",
      "urlDivisionTexteVise": "/15/textes/1974.asp#D_Article_1er_C"
    },
    "alinea": {
      "numero": "6"
    }
  },
  "corps": {
    "dispositif": "<p style=\"text-align: justify;\">Supprimer l&#8217;alin&#233;a&#160;6.</p>",
    "exposeSommaire": "<p style=\"text-align: justify;\">Le texte du projet de loi, tel qu&#8217;issu du vote au S&#233;nat, institutionnalise le Conseil d&#8217;orientation des infrastructures (COI) et pr&#233;voit la remise d&#8217;un rapport par le Gouvernement, suivie d&#8217;un d&#233;bat, sur la mise en &#339;uvre de la programmation financi&#232;re et op&#233;rationnelle des investissements de l&#8217;&#201;tat dans les transports fix&#233;e par le pr&#233;sent projet de loi.</p><p style=\"text-align: justify;\">La remise d&#8217;un rapport annuel sur la mise en &#339;uvre de la programmation financi&#232;re et op&#233;rationnelle des investissements ne se justifie pas dans la mesure o&#249; les parlementaires disposent d&#233;j&#224; de la possibilit&#233; d&#8217;une part, d&#8217;auditionner l&#8217;Agence de financement des infrastructures de transport de France (AFITF) s&#8217;ils le souhaitent et d&#8217;autre part, de consulter le rapport d&#8217;activit&#233; annuel de l&#8217;agence qui demeurera au c&#339;ur des projets d&#8217;infrastructures port&#233;s par le pr&#233;sent projet de loi.</p><p style=\"text-align: justify;\">Par ailleurs, le fait d&#8217;imposer la tenue d&#8217;un d&#233;bat sur le rapport gouvernemental annuel ne rel&#232;ve pas du domaine de la loi, qui n&#8217;a pas vocation &#224; pr&#233;d&#233;terminer les modalit&#233;s dont les acteurs et notamment les chambres parlementaires se saisissent des rapports que le Gouvernement s&#8217;engage &#224; produire.</p><p style=\"text-align: justify;\">Enfin, l&#8217;examen parlementaire annuel du projet de loi de finances offrira la possibilit&#233; de d&#233;battre sur la programmation financi&#232;re et op&#233;rationnelle des investissements de l&#8217;&#201;tat dans les transports dans la mesure o&#249; les recettes d&#233;di&#233;es devront &#234;tre vot&#233;es chaque ann&#233;e dans ce cadre.</p><p style=\"text-align: justify;\">Le pr&#233;sent amendement supprime donc l&#8217;obligation de remise d&#8217;un rapport gouvernemental annuel suivi d&#8217;un d&#233;bat sur la mise en &#339;uvre de la programmation financi&#232;re et op&#233;rationnelle des investissements de l&#8217;&#201;tat.</p>"
  },
  "representations": [
    {
      "nom": "PDF",
      "typeMime": {
        "type": "application",
        "subType": "PDF"
      },
      "statutRepresentation": {
        "verbatim": true,
        "canonique": true,
        "officielle": true,
        "transcription": false,
        "enregistrement": false
      },
      "contenu": {
        "documentURI": "/15/amendements/1974/AN/2076.pdf"
      }
    }
  ],
  "dateDepot": "2019-05-29T02:00:00.000+02:00",
  "dateDistribution": "2019-06-06T02:00:00.000+02:00",
  "article99": "0",
  "loiReference": {}
}