{
  "uid": "AMANR5L15SEA717460B0911P0D1N522",
  "identifiant": {
    "legislature": "15",
    "numero": "522",
    "numRect": "0",
    "saisine": {
      "texteLegislatifRef": "PRJLANR5L15B0911",
      "numeroPartiePLF": "0",
      "organeExamen": "PO717460",
      "mentionSecondeDeliberation": "0"
    }
  },
  "numeroLong": "522",
  "etapeTexte": "1ère lecture (1ère assemblée saisie)",
  "triAmendement": "bano",
  "cardinaliteAmdtMultiples": "1",
  "etat": "A discuter",
  "signataires": {
    "auteur": {
      "typeAuteur": "Depute",
      "acteurRef": "PA605036",
      "groupePolitiqueRef": "PO730934"
    },
    "cosignatairesRefs": [
      "PA607090",
      "PA718784",
      "PA334654",
      "PA267450",
      "PA346218",
      "PA267429",
      "PA721314",
      "PA767",
      "PA266793",
      "PA721410",
      "PA605036",
      "PA721968",
      "PA718884",
      "PA267204",
      "PA266776",
      "PA223837",
      "PA609245",
      "PA721678",
      "PA330684",
      "PA721636",
      "PA340853",
      "PA721054",
      "PA719318"
    ],
    "texteAffichable": "M.&#160;Abad,  M.&#160;Straumann, M.&#160;Cattin, M.&#160;Leclerc, M.&#160;Pauget, M.&#160;Jean-Pierre&#160;Vigier, Mme&#160;Lacroute, M.&#160;Reda, M.&#160;Lorion, M.&#160;Masson, M.&#160;Sermier, M.&#160;Parigi, Mme&#160;Bonnivard, M.&#160;Vialay, M.&#160;Brochand, M.&#160;Cinieri, Mme&#160;Val&#233;rie&#160;Boyer, M.&#160;Bony, Mme&#160;Anthoine, Mme&#160;Bazin-Malgras, M.&#160;R&#233;mi&#160;Delatte, M.&#160;Reiss et M.&#160;Schellenberger"
  },
  "pointeurFragmentTexte": {
    "division": {
      "titre": "Article 11",
      "articleDesignationCourte": "APRÈS ART. 11",
      "type": "ARTICLE",
      "avantAApres": "Apres",
      "divisionRattachee": "APRÈS L'ARTICLE 11, insérer l'article suivant:",
      "articleAdditionnel": "1",
      "urlDivisionTexteVise": "/15/textes/0911.asp#D_Article_11"
    }
  },
  "corps": {
    "dispositif": "<p style=\"text-align: justify;\">Au d&#233;but de l&#8217;intitul&#233; du titre VIII de la Constitution, les mots&#160;: &#171;&#160;De l&#8217;autorit&#233;&#160;&#187; sont remplac&#233;s par les mots&#160;: &#171; Du pouvoir&#160;&#187;.</p>",
    "exposeSommaire": "<p style=\"text-align: justify;\">Selon Montesquieu, dans L&#8217;Esprit des Lois&#160;: &#171;&#160;Il n&#8217;y a point de libert&#233; si la puissance de juger n&#8217;est pas s&#233;par&#233;e de la puissance l&#233;gislative et de l&#8217;ex&#233;cutive&#160;&#187;.</p><p style=\"text-align: justify;\">Le pouvoir judiciaire, troisi&#232;me composante de l&#8217;appareil gouvernemental, devrait &#234;tre aussi important.</p><p style=\"text-align: justify;\">Pourtant, la Constitution de 1958 ne d&#233;signe pas la Justice comme un &#171;&#160;pouvoir&#160;&#187;&#160;mais comme une &#171;&#160;autorit&#233;&#160;&#187;. Or, une autorit&#233; provient d&#8217;un pouvoir qui la d&#233;l&#232;gue, l&#8217;attribue, l&#8217;institue en quelque sorte.</p><p style=\"text-align: justify;\">La justice doit &#234;tre r&#233;ellement la plus ind&#233;pendante possible &#233;tant donn&#233; le r&#244;le central qu&#8217;elle joue dans le progr&#232;s de la civilisation, et ce bien que les juges soient en g&#233;n&#233;ral d&#233;sign&#233;s par le pouvoir ex&#233;cutif.</p><p style=\"text-align: justify;\">C&#8217;est pourquoi, il est propos&#233; de modifier la norme fondamentale afin que la justice ne soit plus une simple autorit&#233; mais bien un pouvoir ind&#233;pendant.</p>"
  },
  "representations": [
    {
      "nom": "PDF",
      "typeMime": {
        "type": "application",
        "subType": "PDF"
      },
      "statutRepresentation": {
        "verbatim": true,
        "canonique": true,
        "officielle": true,
        "transcription": false,
        "enregistrement": false
      },
      "contenu": {
        "documentURI": "/15/amendements/0911/AN/522.pdf"
      }
    }
  ],
  "dateDepot": "2018-07-04T02:00:00.000+02:00",
  "dateDistribution": "2018-07-11T02:00:00.000+02:00",
  "article99": "0",
  "loiReference": {
    "codeLoi": "Constitution",
    "divisionCodeLoi": "titre VIII"
  }
}