{
  "uid": "AMANR5L15SEA717460B0235P2D1N1799",
  "identifiant": {
    "legislature": "15",
    "numero": "1799",
    "numRect": "0",
    "saisine": {
      "texteLegislatifRef": "PRJLANR5L15B0235",
      "numeroPartiePLF": "2",
      "organeExamen": "PO717460",
      "mentionSecondeDeliberation": "1"
    }
  },
  "numeroLong": "II-1799",
  "etapeTexte": "1ère lecture (1ère assemblée saisie)",
  "triAmendement": "h",
  "cardinaliteAmdtMultiples": "1",
  "etat": "Discuté",
  "signataires": {
    "auteur": {
      "typeAuteur": "Depute",
      "acteurRef": "PA605963",
      "groupePolitiqueRef": "PO730964"
    },
    "cosignatairesRefs": [
      "PA605963"
    ],
    "texteAffichable": "M.&#160;Alauzet"
  },
  "pointeurFragmentTexte": {
    "division": {
      "titre": "Article 46",
      "articleDesignationCourte": "APRÈS ART. 46",
      "type": "ARTICLE",
      "avantAApres": "Apres",
      "divisionRattachee": "APRÈS L'ARTICLE 46, insérer l'article suivant:",
      "articleAdditionnel": "1",
      "urlDivisionTexteVise": "/15/textes/0235C.asp#D_Article_46"
    }
  },
  "corps": {
    "dispositif": "<p style=\"text-align: justify;\">I.&#160;&#8211;&#160;L&#8217;article&#160;223 du code g&#233;n&#233;ral des imp&#244;ts est compl&#233;t&#233; par un 4. ainsi r&#233;dig&#233;&#160;:&#160;</p><p style=\"text-align: justify;\">&#171;&#160;4.&#160;Les personnes morales ou groupements de droit ou de fait, dont le chiffre d&#8217;affaires hors taxes ou le total de l&#8217;actif brut figurant au bilan est sup&#233;rieur ou &#233;gal &#224; 400 millions d&#8217;euros &#224; la cl&#244;ture de l&#8217;exercice sont tenues de joindre&#160;:&#160;</p><p style=\"text-align: justify;\">&#171; 1&#176;&#160;Les informations relatives &#224; la conception et &#224; l&#8217;utilisation de dispositifs de planification fiscale &#224; caract&#232;re potentiellement agressif, et ayant une dimension transfrontali&#232;re. Ces dispositifs de planification fiscale ayant pour but l&#8217;obtention d&#8217;un avantage fiscal.</p><p style=\"text-align: justify;\">&#171; 2&#176;&#160;La liste des personnes morales ou groupements de personnes de droit ou de fait qui ont particip&#233; &#224; l&#8217;&#233;tablissement des sch&#233;mas fiscaux de l&#8217;entreprise ou ont &#233;t&#233; consult&#233; dans le but de r&#233;duire la charge fiscale de l&#8217;entreprise, en indiquant leur d&#233;nomination, leur adresse et, pour ceux &#233;tablis en France, leur num&#233;ro d&#8217;identification au r&#233;pertoire national des &#233;tablissements.&#160;&#187;</p><p style=\"text-align: justify;\">II.&#160;&#8211;&#160;Le fait de ne pas satisfaire &#224; l&#8217;obligation de communication pr&#233;vue au I dans un d&#233;lai de trois mois apr&#232;s la date de cl&#244;ture de l&#8217;exercice est puni d&#8217;une amende de 10&#160;000&#160;euros. Pass&#233; ce d&#233;lai de trois mois, le montant de l&#8217;amende est augment&#233; de 0,05&#160;% du chiffre d&#8217;affaire de l&#8217;entreprise pour chaque p&#233;riode additionnelle de 6 mois durant laquelle l&#8217;obligation n&#8217;est pas satisfaite. Le montant est plafonn&#233;e &#224; 0,5&#160;% du chiffre d&#8217;affaire de l&#8217;entreprise.</p><p style=\"text-align: justify;\">III.&#160;&#8211;&#160;Le I est applicable &#224; partir du 1<sup>er</sup> janvier 2019 &#224; compter de l&#8217;entr&#233;e en vigueur d&#8217;une disposition adopt&#233;e par l&#8217;Union&#160;europ&#233;enne et poursuivant le m&#234;me objectif.</p>",
    "exposeSommaire": "<p style=\"text-align: justify;\">Les &#171;&#160;Paradisepapers&#160;&#187; ont r&#233;v&#233;l&#233; l&#8217;existence d&#8217;un syst&#232;me g&#233;n&#233;ralis&#233; d&#8217;optimisation fiscale, un syst&#232;me qui flirte dangereusement avec la fraude fiscale. En jouant avec les diff&#233;rentes r&#233;glementations fiscales, gr&#226;ce &#224; l&#8217;aide d&#8217;&#233;quipes d&#8217;experts travaillant dans le plus grand secret, les entreprises minimisent l&#8217;imp&#244;t dont elles s&#8217;acquittent tout en se pr&#233;servant des poursuites judiciaires. Ceux sont ainsi des milliards d&#8217;euros de recettes fiscales qui disparaissent&#160;: 20 milliards pour la France, 120 pour l&#8217;Union&#160;Europ&#233;enne et 360 au total d&#8217;apr&#232;s les estimations de G. Zucman.</p><p style=\"text-align: justify;\">Ces pratiques sont immorales, elles remettent en cause les valeurs que portent la France et les grands principes fondateurs de la R&#233;publique fran&#231;aise. Les entreprises qui les suivent rompent avec l&#8217;&#233;galit&#233; devant l&#8217;imp&#244;t, ce faisant, elles refusent de contribuer au financement l&#8217;&#201;tat fran&#231;ais et rejettent la solidarit&#233; qui est au fondement de notre mod&#232;le social. Elles laissent la France subir l&#8217;&#233;rosion de sa base d&#8217;imposition et b&#233;n&#233;ficient de l&#8217;aide d&#8217;interm&#233;diaires promouvant la cr&#233;ation de dispositifs de planification fiscale &#224; caract&#232;re agressif.</p><p style=\"text-align: justify;\">Pour lutter contre l&#8217;optimisation fiscale abusive, qui d&#233;connecte l&#8217;activit&#233; &#233;conomique et le b&#233;n&#233;fice r&#233;alis&#233;s en France du montant de l&#8217;imp&#244;t acquitt&#233; par l&#8217;entreprise aupr&#232;s de l&#8217;&#201;tat fran&#231;ais en favorisant les transferts vers les juridictions &#224; taux d&#8217;imposition tr&#232;s faible, la transparence constitue un outil essentiel. La transparence permet aux citoyens d&#8217;&#233;valuer, selon leurs propres crit&#232;res &#233;thiques, l&#8217;attitude des entreprises desquelles ils sont clients et d&#8217;adapter leurs comportements en cons&#233;quence. La transparence permet &#224; l&#8217;administration fiscale de mieux d&#233;tecter et sanctionner les cas de fraudes. La transparence permet de rendre l&#8217;optimisation fiscale abusive inacceptable.</p><p style=\"text-align: justify;\">Malgr&#233; tout, la transparence est souvent accus&#233;e de d&#233;savantager les entreprises en situation de concurrence en r&#233;v&#233;lant leurs strat&#233;gies. Le Conseil constitutionnel a suivi cette logique en censurant en 2016 le reporting fiscal public[1], disposition qui existe pourtant depuis 2013 pour les banques, pour cause d&#8217;entrave &#224; la libert&#233; d&#8217;entreprise de l&#8217;article&#160;4 de la D&#233;claration des droits de l&#8217;Homme et du citoyen de 1789. Cependant, l&#8217;&#233;vasion et l&#8217;optimisation abusive constitue sans doute possible des entraves aux principes constitutionnels du consentement &#224; l&#8217;imp&#244;t et de l&#8217;&#233;galit&#233; devant l&#8217;imp&#244;t des articles 14 et 13 de la D&#233;claration des droits de l&#8217;Homme et du citoyen de 1789. C&#8217;est une jurisprudence du Conseil constitutionnel datant de 2010[2], la lutte contre l&#8217;&#233;vasion fiscale elle-m&#234;me est un objectif &#224; valeur constitutionnel.</p><p style=\"text-align: justify;\">L&#8217;&#201;tat n&#8217;ayant pas acc&#232;s aux informations relatives &#224; l&#8217;organisation comptable et fiscale de l&#8217;entreprise, il ne peut faire respecter les principes constitutionnels mentionn&#233;s&#160;: la transparence fiscale est donc essentielle pour garantir le respect de la Constitution. Si la libert&#233; d&#8217;entreprendre est elle aussi un principe &#224; valeur constitutionnel, elle n&#8217;a jamais &#233;t&#233; con&#231;ue pour &#234;tre absolue. Les jurisprudences du Conseil constitutionnel l&#8217;ont maintes fois soulign&#233;[3], elle peut &#234;tre limit&#233;e afin de d&#233;fendre l&#8217;int&#233;r&#234;t g&#233;n&#233;ral ou de prot&#233;ger d&#8217;autres exigences constitutionnelles.</p><p style=\"text-align: justify;\">En un mot&#160;: la transparence est possible, elle est m&#234;me n&#233;cessaire.</p><p style=\"text-align: justify;\">Cet amendement propose une premi&#232;re avanc&#233;e en mati&#232;re de transparence pour les grandes entreprises&#160;: la transmission, &#224; l&#8217;administration fiscale, des dispositifs de planification fiscale et de la liste des intervenants contract&#233;s sur ces probl&#233;matiques.</p><p style=\"text-align: justify;\">La mesure propos&#233;e ne repr&#233;sente pas un obstacle &#224; l&#8217;activit&#233; des entreprises concern&#233;es, les informations communiqu&#233;es sont relativement g&#233;n&#233;rales et donc connues des concurrents directs. De plus, la communication est faite uniquement aupr&#232;s de l&#8217;administration fiscale donc dans un cadre particuli&#232;rement limit&#233;. Ces informations permettront &#224; l&#8217;administration de mieux cerner les risques de fraude pour cibler les contr&#244;les.</p><p style=\"text-align: justify;\">La mesure s&#8217;inscrit dans la continuit&#233; du projet BEPS de l&#8217;OCDE. Elle participe activement &#224; la recherche d&#8217;une solution&#160;europ&#233;enne &#224; l&#8217;&#233;vasion et &#224; l&#8217;optimisation fiscale. Conditionn&#233;e &#224; l&#8217;adoption de mesures proches au niveau&#160;europ&#233;en, la mesure permet &#224; la France d&#8217;assumer le r&#244;le de leader en mati&#232;re de lutte contre l&#8217;&#233;vasion et l&#8217;optimisation fiscale et envoie un signal fort aux &#201;tats membres, aux acteurs &#233;conomiques et aux citoyens.</p><p style=\"text-align: justify;\">[1] D&#233;cision n&#176; 2016&#8209;741 DC du 08 d&#233;cembre 2016 - Loi relative &#224; la transparence, &#224; la lutte contre la corruption et &#224; la modernisation de la vie &#233;conomique</p><p style=\"text-align: justify;\">[2] 2010&#8209;70 QPC, 26 novembre 2010, cons. 4, Journal officiel du 27 novembre 2010, page 21118, texte n&#176; 41, Rec. p. 340</p><p style=\"text-align: justify;\">[3] D&#233;cision n&#176; 89&#8209;254 DC du 4 juillet 1989 / 2010&#8209;55 QPC, 18 octobre 2010, cons. 4, Journal</p>"
  },
  "representations": [
    {
      "nom": "PDF",
      "typeMime": {
        "type": "application",
        "subType": "PDF"
      },
      "statutRepresentation": {
        "verbatim": true,
        "canonique": true,
        "officielle": true,
        "transcription": false,
        "enregistrement": false
      },
      "contenu": {
        "documentURI": "/15/amendements/0235C/AN/1799.pdf"
      }
    }
  ],
  "seanceDiscussion": "RUANR5L15S2018IDS20772",
  "sort": {
    "dateSaisie": "2017-11-20T16:36:30.000+01:00",
    "sortEnSeance": "Retiré"
  },
  "dateDepot": "2017-11-13T01:00:00.000+01:00",
  "dateDistribution": "2017-11-16T01:00:00.000+01:00",
  "article99": "0",
  "loiReference": {
    "codeLoi": "CGI",
    "divisionCodeLoi": "223"
  }
}