{
  "uid": "AMANR5L15PO419610B0846P0D1N684",
  "identifiant": {
    "legislature": "15",
    "numero": "684",
    "numRect": "0",
    "saisine": {
      "texteLegislatifRef": "PRJLANR5L15B0846",
      "numeroPartiePLF": "0",
      "organeExamen": "PO419610",
      "mentionSecondeDeliberation": "0"
    }
  },
  "numeroLong": "CE684",
  "etapeTexte": "1ère lecture (1ère assemblée saisie)",
  "triAmendement": "aadc",
  "cardinaliteAmdtMultiples": "1",
  "etat": "Discuté",
  "signataires": {
    "auteur": {
      "typeAuteur": "Depute",
      "acteurRef": "PA718780",
      "groupePolitiqueRef": "PO730934"
    },
    "cosignatairesRefs": [
      "PA718838",
      "PA718780",
      "PA643134",
      "PA709315",
      "PA608416",
      "PA721968",
      "PA346218",
      "PA718884",
      "PA721410"
    ],
    "texteAffichable": "Mme&#160;Trastour-Isnart,  Mme&#160;Bonnivard, M.&#160;Viala, M.&#160;Vialay, M.&#160;Masson, M.&#160;Hetzel, M.&#160;Brun, Mme&#160;Valentin et Mme&#160;Bazin-Malgras"
  },
  "pointeurFragmentTexte": {
    "division": {
      "titre": "Article 59",
      "articleDesignationCourte": "APRÈS ART. 59",
      "type": "ARTICLE",
      "avantAApres": "Apres",
      "divisionRattachee": "APRÈS L'ARTICLE 59, insérer l'article suivant:",
      "articleAdditionnel": "1",
      "urlDivisionTexteVise": "/15/textes/0846.asp#D_Article_59"
    }
  },
  "corps": {
    "dispositif": "<p style=\"text-align: justify;\">L&#8217;avant-dernier alin&#233;a de l&#8217;article L.&#160;443&#8209;15 du code de la construction et de l&#8217;habitation est supprim&#233;.</p>",
    "exposeSommaire": "<p style=\"text-align: justify;\">La loi du 10 juillet 1965 pr&#233;voit une disposition qui pr&#233;cise que pour &#233;viter des abus de majorit&#233; en assembl&#233;e g&#233;n&#233;rale, lorsqu&#8217;un copropri&#233;taire poss&#232;de plus de 50&#160;% des voix, ce dernier est r&#233;duit &#224; la somme des voix des autres copropri&#233;taires pr&#233;sents et repr&#233;sent&#233;s.</p><p style=\"text-align: justify;\">Or, ce dispositif ne s&#8217;applique pas aux organismes d&#8217;Habitations &#224; Loyer Mod&#233;r&#233;, conform&#233;ment &#224; l&#8217;article L443&#8209;15 du code la Construction et de l&#8217;Habitation, cr&#233;ant ainsi une distorsion de r&#233;gime entre les copropri&#233;taires priv&#233;s et les bailleurs sociaux.</p><p style=\"text-align: justify;\">Il est donc n&#233;cessaire d&#8217;homog&#233;n&#233;iser ce dispositif en pr&#233;voyant la suppression de l&#8217;article L443&#8209;15 du code de la construction.</p>"
  },
  "representations": [
    {
      "nom": "PDF",
      "typeMime": {
        "type": "application",
        "subType": "PDF"
      },
      "statutRepresentation": {
        "verbatim": true,
        "canonique": true,
        "officielle": true,
        "transcription": false,
        "enregistrement": false
      },
      "contenu": {
        "documentURI": "/15/amendements/0846/CION-ECO/CE684.pdf"
      }
    }
  ],
  "sort": {
    "dateSaisie": "2018-05-19T00:11:56.000+02:00",
    "sortEnSeance": "Non soutenu"
  },
  "dateDepot": "2018-05-05T02:00:00.000+02:00",
  "dateDistribution": "2018-05-15T02:00:00.000+02:00",
  "article99": "0",
  "loiReference": {
    "codeLoi": "construction et habitation",
    "divisionCodeLoi": "L443-15"
  }
}