{
  "uid": "AMANR5L15SEA717460BTC0860P0D1N5",
  "identifiant": {
    "legislature": "15",
    "numero": "5",
    "numRect": "0",
    "saisine": {
      "texteLegislatifRef": "PRJLANR5L15BTC0860",
      "numeroPartiePLF": "0",
      "organeExamen": "PO717460",
      "mentionSecondeDeliberation": "0"
    }
  },
  "numeroLong": "5",
  "etapeTexte": "Nouvelle Lecture",
  "triAmendement": "m",
  "cardinaliteAmdtMultiples": "1",
  "etat": "Discuté",
  "signataires": {
    "auteur": {
      "typeAuteur": "Depute",
      "acteurRef": "PA721960",
      "groupePolitiqueRef": "PO730958"
    },
    "cosignatairesRefs": [
      "PA721202",
      "PA719578",
      "PA721960",
      "PA721210",
      "PA721226",
      "PA720422",
      "PA720430",
      "PA720286",
      "PA718860",
      "PA719676",
      "PA722142",
      "PA720892",
      "PA721062",
      "PA718868",
      "PA588884",
      "PA720846",
      "PA2150"
    ],
    "texteAffichable": "Mme&#160;Obono,  Mme&#160;Autain, M.&#160;Bernalicis, M.&#160;Coquerel, M.&#160;Corbi&#232;re, Mme&#160;Fiat, M.&#160;Lachaud, M.&#160;Larive, M.&#160;M&#233;lenchon, Mme&#160;Panot, M.&#160;Prud&apos;homme, M.&#160;Quatennens, M.&#160;Ratenon, Mme&#160;Ressiguier, Mme&#160;Rubin, M.&#160;Ruffin et Mme&#160;Taurine"
  },
  "pointeurFragmentTexte": {
    "division": {
      "titre": "Article 6",
      "articleDesignationCourte": "ART. 6",
      "type": "ARTICLE",
      "avantAApres": "A",
      "divisionRattachee": "ARTICLE 6",
      "urlDivisionTexteVise": "/15/textes/0860.asp#D_Article_6"
    },
    "alinea": {
      "numero": "12"
    }
  },
  "corps": {
    "dispositif": "<p style=\"text-align: justify;\">Compl&#233;ter l&#8217;alin&#233;a&#160;12 par la phrase suivante&#160;:</p><p style=\"text-align: justify;\">&#171;&#160;Pour les hypoth&#232;ses pr&#233;vues aux articles&#160;4 &#224;&#160;6 de l&#8217;article&#160;83 du r&#232;glement&#160;(UE)&#160;n&#176;&#160;2016/679 du Parlement&#160;europ&#233;en et du Conseil du&#160;27&#160;avril&#160;2016 pr&#233;cit&#233;, en cas de r&#233;cidive, les plafonds d&#8217;amendes administratives peuvent &#234;tre multipli&#233;s par deux.&#160;&#187;</p>",
    "exposeSommaire": "<p style=\"text-align: justify;\">Le r&#232;glement&#160;europ&#233;en RGPD pr&#233;voit des sanctions pouvant s&#8217;&#233;lever de 10 000 / 20 000&#160;euros ou, dans le cas d&#8217;une entreprise, jusqu&#8217;&#224; 2&#160;% / 4&#160;% du chiffre d&#8217;affaires annuel mondial total de l&#8217;exercice pr&#233;c&#233;dent. Ceci permettra de pouvoir exercer un effet r&#233;ellement dissuasif sur les grandes entreprises (notamment les GAFA) qui pourraient, &#224; d&#233;faut d&#8217;amendes aux montants dissuasifs, consid&#233;rer que l&#8217;ill&#233;galit&#233; n&#8217;est qu&#8217;un risque financier qui vaut la peine d&#8217;&#234;tre couru.</p><p style=\"text-align: justify;\">Le l&#233;gislateur&#160;europ&#233;en n&#8217;ayant pas &#233;puis&#233; sa comp&#233;tence sur le cas pr&#233;cis d&#8217;une r&#233;cidive en l&#8217;&#233;tat du r&#232;glement RGPD, le l&#233;gislateur national peut tout &#224; fait d&#233;cider de pr&#233;ciser et compl&#233;ter les dispositions&#160;europ&#233;ennes.</p><p style=\"text-align: justify;\">En transposant par ailleurs le raisonnement de cet arr&#234;t du droit administratif qu&#8217;&#233;tait la jurisprudence CE, 18 Avril 1902, Commune De N&#233;ris Le-Bains, nous pouvons estimer qu&#8217;eu &#233;gard aux circonstances propres &#224; la France (une attention particuli&#232;re men&#233;e contre certaines entreprises attir&#233;es par les perspectives de lucre et r&#233;cidivistes <a href=\"http://www.zdnet.fr/actualites/geolocalisation-la-cnil-inflige-100-000-euros-d-amende-a-google-39759236.htm\">http&#160;://www.zdnet.fr/actualites/geolocalisation-la-cnil-inflige-100&#8209;000-euros-d-amende-a-google-39759236.htm</a>, et plus r&#233;cemment <a href=\"http://www.lemonde.fr/pixels/article/2017/05/16/donnees-personnelles-facebook-condamne-par-la-cnil-a-150-000-euros-d-amende_5128370_4408996.html\">http&#160;://www.lemonde.fr/pixels/article/2017/05/16/donnees-personnelles-facebook-condamne-par-la-cnil-a-150&#8209;000-euros-d-amende_5128370_4408996.html</a>), il est pleinement justifi&#233; de recourir &#224; un compl&#233;ment de sanctions administratives dans le sens de la rigueur.</p>"
  },
  "representations": [
    {
      "nom": "PDF",
      "typeMime": {
        "type": "application",
        "subType": "PDF"
      },
      "statutRepresentation": {
        "verbatim": true,
        "canonique": true,
        "officielle": true,
        "transcription": false,
        "enregistrement": false
      },
      "contenu": {
        "documentURI": "/15/amendements/0860/AN/5.pdf"
      }
    }
  ],
  "seanceDiscussion": "RUANR5L15S2018IDS20996",
  "sort": {
    "dateSaisie": "2018-04-12T11:40:57.000+02:00",
    "sortEnSeance": "Rejeté"
  },
  "dateDepot": "2018-04-11T02:00:00.000+02:00",
  "dateDistribution": "2018-04-12T02:00:00.000+02:00",
  "article99": "0",
  "loiReference": {}
}