{
  "uid": "AMANR5L15PO419610B0846P0D1N1247",
  "identifiant": {
    "legislature": "15",
    "numero": "1247",
    "numRect": "0",
    "saisine": {
      "texteLegislatifRef": "PRJLANR5L15B0846",
      "numeroPartiePLF": "0",
      "organeExamen": "PO419610",
      "mentionSecondeDeliberation": "0"
    }
  },
  "numeroLong": "CE1247",
  "etapeTexte": "1ère lecture (1ère assemblée saisie)",
  "triAmendement": "zzzo",
  "cardinaliteAmdtMultiples": "1",
  "etat": "Retiré",
  "signataires": {
    "auteur": {
      "typeAuteur": "Depute",
      "acteurRef": "PA720378",
      "groupePolitiqueRef": "PO730964"
    },
    "cosignatairesRefs": [
      "PA720378"
    ],
    "texteAffichable": "M.&#160;Lioger, rapporteur"
  },
  "pointeurFragmentTexte": {
    "division": {
      "titre": "Article 23",
      "articleDesignationCourte": "ART. 23",
      "type": "ARTICLE",
      "avantAApres": "A",
      "divisionRattachee": "ARTICLE 23",
      "urlDivisionTexteVise": "/15/textes/0846.asp#D_Article_23"
    },
    "alinea": {
      "avantAApres": "A",
      "numero": "45",
      "alineaDesignation": "Alinéa 45"
    }
  },
  "corps": {
    "dispositif": "<p>Modifier ainsi l&#8217;alin&#233;a 45 :</p><p>1&#176; Substituer aux mots&#160;:</p><p>&#171;&#160;dans les lieux mentionn&#233;s&#160;&#187;,</p><p>le mot&#160;:</p><p>&#171;&#160;pr&#233;vu&#160;&#187;.</p><p>2&#176; En cons&#233;quence, substituer aux mots&#160;:</p><p>&#171;&#160;ces lieux&#160;&#187;,</p><p>les mots&#160;:</p><p>&#171;&#160;les lieux concern&#233;s&#160;&#187;.</p>",
    "exposeSommaire": "<p>Amendement r&#233;dactionnel.</p>"
  },
  "representations": [
    {
      "nom": "PDF",
      "typeMime": {
        "type": "application",
        "subType": "PDF"
      },
      "statutRepresentation": {
        "verbatim": true,
        "canonique": true,
        "officielle": true,
        "transcription": false,
        "enregistrement": false
      },
      "contenu": {
        "documentURI": "/15/amendements/0846/CION-ECO/CE1247.pdf"
      }
    }
  ],
  "dateDepot": "2018-05-09T02:00:00.000+02:00",
  "dateDistribution": "2018-05-15T02:00:00.000+02:00",
  "article99": "0",
  "loiReference": {}
}