{
  "uid": "AMANR5L15SEA717460BTC0857P0D1N103",
  "identifiant": {
    "legislature": "15",
    "numero": "103",
    "numRect": "0",
    "saisine": {
      "texteLegislatifRef": "PRJLANR5L15BTC0857",
      "numeroPartiePLF": "0",
      "organeExamen": "PO717460",
      "mentionSecondeDeliberation": "0"
    }
  },
  "numeroLong": "103",
  "etapeTexte": "1ère lecture (1ère assemblée saisie)",
  "triAmendement": "aejdh",
  "cardinaliteAmdtMultiples": "1",
  "etat": "Discuté",
  "signataires": {
    "auteur": {
      "typeAuteur": "Depute",
      "acteurRef": "PA721314",
      "groupePolitiqueRef": "PO730934"
    },
    "cosignatairesRefs": [
      "PA336316",
      "PA609726",
      "PA346218",
      "PA923",
      "PA1874",
      "PA267200",
      "PA608416",
      "PA720684",
      "PA267429",
      "PA719318",
      "PA767",
      "PA721286",
      "PA266776",
      "PA721314",
      "PA718850",
      "PA721816",
      "PA642847",
      "PA608016",
      "PA267260",
      "PA720386",
      "PA267901",
      "PA334654",
      "PA266793",
      "PA267735",
      "PA721506",
      "PA267440"
    ],
    "texteAffichable": "M.&#160;Schellenberger,  Mme&#160;Anthoine, M.&#160;Aubert, M.&#160;Bazin, M.&#160;Bony, M.&#160;Boucard, M.&#160;Bouchet, M.&#160;Cattin, M.&#160;Cinieri, M.&#160;Cordier, M.&#160;Cornut-Gentille, M.&#160;de Ganay, M.&#160;Di Filippo, M.&#160;Diard, M.&#160;Pierre-Henri&#160;Dumont, M.&#160;Hetzel, M.&#160;Huyghe, M.&#160;Kamardine, Mme&#160;Kuster, M.&#160;Le Fur, Mme&#160;Louwagie, M.&#160;Masson, Mme&#160;Poletti, M.&#160;Ramadier, M.&#160;Reiss et M.&#160;Straumann"
  },
  "pointeurFragmentTexte": {
    "division": {
      "titre": "Article 4",
      "articleDesignationCourte": "ART. 4",
      "type": "ARTICLE",
      "avantAApres": "A",
      "divisionRattachee": "ARTICLE 4",
      "urlDivisionTexteVise": "/15/textes/0857.asp#D_Article_4"
    },
    "alinea": {
      "numero": "2"
    }
  },
  "corps": {
    "dispositif": "<p>Substituer &#224; l'alin&#233;a&#160;2 les sept alin&#233;as suivants&#160;:</p><p>&#171;&#160;1&#176;&#160;L'article L.&#160;711-6 est ainsi modifi&#233;&#160;:</p><p>a)&#160;Le 2&#176; est ainsi modifi&#233;&#160;:</p><p>&#8211;&#160;le mot&#160;&#171;&#160;dix&#160;&#187; est remplac&#233; par le mot&#160;&#171;&#160;deux&#160;&#187;&#160;;</p><p>&#8211;&#160;apr&#232;s le mot&#160;:&#160;&#171;&#160;France&#160;&#187;, sont ins&#233;r&#233;s les mots &#171;&#160;ou dans un autre &#201;tat membre de l'Union europ&#233;enne&#160;&#187;&#160;;</p><p>&#8211;&#160;les mots&#160;: &#171;&#160;et sa pr&#233;sence constitue une menace grave pour la soci&#233;t&#233;&#160;&#187; sont supprim&#233;s&#160;;</p><p>b)&#160;Il est ajout&#233; un 3&#176; ainsi r&#233;dig&#233;&#160;:</p><p>&#171;&#160;3&#176;&#160;Il y a des raisons s&#233;rieuses de consid&#233;rer que la pr&#233;sence en France de la personne concern&#233;e constitue une menace grave pour la soci&#233;t&#233; fran&#231;aise&#160;&#187;.&#187;</p>",
    "exposeSommaire": "<p style=\"text-align: justify;\">Amendement de repli.</p><p style=\"text-align: justify;\">Le premier alin&#233;a de l&#8217;article L.&#160;711&#8209;6 du CESEDA dispose que le statut de r&#233;fugi&#233; peut &#234;tre refus&#233;, ou qu&#8217;il peut y &#234;tre mis fin lorsqu&#8217;il y a des raisons s&#233;rieuses de consid&#233;rer que la pr&#233;sence en France de la personne concern&#233;e constitue une menace grave pour la s&#251;ret&#233; de l&#8217;&#201;tat.</p><p style=\"text-align: justify;\">Il est propos&#233; &#224; travers cet amendement, en modifiant la r&#233;daction de l&#8217;alin&#233;a&#160;2 dudit article, de consid&#233;rer que le statut de r&#233;fugi&#233; peut &#233;galement &#234;tre refus&#233; ou qu&#8217;il puisse y &#234;tre mis fin lorsque la personne concern&#233;e se trouve dans l&#8217;une des situations suivantes&#160;:</p><ul style=\"text-align: justify;\"><li>La personne concern&#233;e a &#233;t&#233; condamn&#233;e en dernier ressort en France pour un crime&#160;;</li><li>La personne concern&#233;e a &#233;t&#233; condamn&#233;e en dernier ressort en France pour un d&#233;lit constituant un acte de terrorisme&#160;;</li><li>La personne concern&#233;e a &#233;t&#233; condamn&#233;e en dernier ressort en France pour un d&#233;lit puni de deux ans d'emprisonnement&#160;;</li><li>Sa pr&#233;sence constitue une menace grave pour la soci&#233;t&#233; fran&#231;aise.</li></ul>"
  },
  "representations": [
    {
      "nom": "PDF",
      "typeMime": {
        "type": "application",
        "subType": "PDF"
      },
      "statutRepresentation": {
        "verbatim": true,
        "canonique": true,
        "officielle": true,
        "transcription": false,
        "enregistrement": false
      },
      "contenu": {
        "documentURI": "/15/amendements/0857/AN/103.pdf"
      }
    }
  ],
  "seanceDiscussion": "RUANR5L15S2018IDS21014",
  "sort": {
    "dateSaisie": "2018-04-19T12:22:39.000+02:00",
    "sortEnSeance": "Rejeté"
  },
  "dateDepot": "2018-04-10T02:00:00.000+02:00",
  "dateDistribution": "2018-04-13T02:00:00.000+02:00",
  "article99": "0",
  "loiReference": {}
}