{
  "uid": "AMANR5L15PO419865B2274P0D1N279",
  "identifiant": {
    "legislature": "15",
    "numero": "279",
    "numRect": "0",
    "saisine": {
      "texteLegislatifRef": "PRJLANR5L15B2274",
      "numeroPartiePLF": "0",
      "organeExamen": "PO419865",
      "mentionSecondeDeliberation": "0"
    }
  },
  "numeroLong": "CD279",
  "etapeTexte": "1ère lecture (2ème assemblée saisie)",
  "triAmendement": "qaaaaaaaaaaaaaaaaaaaaaaaaaaaaaaaaaaaaaaaaaaaaaaaaai",
  "cardinaliteAmdtMultiples": "1",
  "etat": "En traitement",
  "signataires": {
    "auteur": {
      "typeAuteur": "Depute",
      "acteurRef": "PA605518",
      "groupePolitiqueRef": "PO759900"
    },
    "cosignatairesRefs": [
      "PA720278",
      "PA608292",
      "PA605694",
      "PA336175",
      "PA719138",
      "PA719146",
      "PA755549",
      "PA607619",
      "PA333421",
      "PA942",
      "PA405480",
      "PA720996",
      "PA267042",
      "PA605518",
      "PA721194",
      "PA720038",
      "PA331582",
      "PA336439",
      "PA719286"
    ],
    "texteAffichable": "M.&#160;Fran&#231;ois-Michel&#160;Lambert,  M.&#160;Acquaviva, M.&#160;Brial, M.&#160;Castellani, M.&#160;Cl&#233;ment, M.&#160;Colombani, M.&#160;Charles&#160;de Courson, Mme&#160;Dubi&#233;, Mme&#160;Fr&#233;d&#233;rique&#160;Dumas, M.&#160;El Guerrab, M.&#160;Falorni, M.&#160;Favennec Becot, Mme&#160;Josso, M.&#160;Molac, M.&#160;Orphelin, M.&#160;Pancher, Mme&#160;Pinel, M.&#160;Pupponi et M.&#160;Philippe&#160;Vigier"
  },
  "pointeurFragmentTexte": {
    "division": {
      "titre": "Article 12 J",
      "articleDesignationCourte": "APRÈS ART. 12 J",
      "type": "ARTICLE",
      "avantAApres": "Apres",
      "divisionRattachee": "APRÈS L'ARTICLE 12 J, insérer l'article suivant:",
      "articleAdditionnel": "1",
      "urlDivisionTexteVise": "/15/textes/2274.asp#D_Article_12_J"
    }
  },
  "corps": {
    "dispositif": "<p style=\"text-align: justify;\">Les I et II de l&#8217;article L.&#160;541&#8209;13 du code de l&#8217;environnement sont ainsi r&#233;dig&#233;s&#160;:</p><p style=\"text-align: justify;\">&#171;&#160;I.&#160;&#8211;&#160;Chaque r&#233;gion est couverte par un plan r&#233;gional d&#8217;&#233;conomie circulaire int&#233;grant la pr&#233;vention et la gestion des d&#233;chets corr&#233;l&#233;e &#224; l&#8217;objectif d&#233;fini &#224; l&#8217;article&#160;74 de la loi n&#176;&#160;2015&#8209;992 du 17&#160;ao&#251;t 2015 relative &#224; la transition &#233;nerg&#233;tique pour la croissance verte.</p><p style=\"text-align: justify;\">&#171;&#160;II.&#160;&#8211;&#160;Pour atteindre les objectifs mentionn&#233;s &#224; l&#8217;article L.&#160;541&#8209;1, le plan comprend&#160;:&#160;</p><p style=\"text-align: justify;\">&#171;&#160;1&#176;&#160;Un &#233;tat des lieux des ressources disponibles dans la r&#233;gion int&#233;grant les d&#233;chets selon leur origine, leur nature, leur composition et les modalit&#233;s de leur transport&#160;;&#160;</p><p style=\"text-align: justify;\">&#171;&#160;2&#176;&#160;Une prospective &#224; termes de six ans et de douze ans de l&#8217;&#233;volution tendancielle des quantit&#233;s de ressources disponibles dans la r&#233;gion int&#233;grant les d&#233;chets &#224; traiter&#160;;&#160;</p><p style=\"text-align: justify;\">&#171;&#160;3&#176;&#160;Des objectifs en mati&#232;re de pr&#233;vention, de recyclage et de valorisation des d&#233;chets, d&#233;clinant les objectifs nationaux de mani&#232;re adapt&#233;e aux particularit&#233;s territoriales ainsi que les priorit&#233;s &#224; retenir pour atteindre ces objectifs&#160;;&#160;</p><p style=\"text-align: justify;\">&#171;&#160;4&#176;&#160;Une planification de la pr&#233;vention et de la gestion des d&#233;chets &#224; termes de six ans et de douze ans, comportant notamment la mention des installations qu&#8217;il appara&#238;t n&#233;cessaire de cr&#233;er ou d&#8217;adapter afin d&#8217;atteindre les objectifs fix&#233;s au 3&#176;&#160;du pr&#233;sent II, dans le respect de la limite mentionn&#233;e au IV&#160;;&#160;</p><p style=\"text-align: justify;\">&#171;&#160;5&#176;&#160;Un plan r&#233;gional d&#8217;impl&#233;mentation syst&#233;matique des synergies territoriales afin de cr&#233;er de la valeur &#224; partir de ressources inexploit&#233;es ou sous-exploit&#233;es.&#160;&#187;</p><p style=\"text-align: justify;\">II.&#160;&#8211;&#160;En cons&#233;quence, au premier alin&#233;a de l&#8217;article L.&#160;4424&#8209;37et &#224; l&#8217;article L.&#160;4424&#8209;38 du code g&#233;n&#233;ral des collectivit&#233;s territoriales, les mots&#160;: &#171;&#160;de pr&#233;vention et de&#160;&#187; sont remplac&#233;s les mots&#160;: &#171;&#160;d&#8217;&#233;conomie circulaire int&#233;grant la pr&#233;vention et la&#160;&#187;&#160;;</p><p style=\"text-align: justify;\"><u><i>-&#160; dans le paragraphe III apr&#232;s &#171;&#160;Les plans r&#233;gionaux&#160;&#187; rajouter &#171;&#160;d&#8217;&#233;conomie circulaire int&#233;grant la&#160;&#187; et apr&#232;s &#171;&#160;du plan r&#233;gional&#160;&#187; rajouter &#171;&#160;d&#8217;&#233;conomie circulaire int&#233;grant la&#160;&#187;&#160;</i> </u></p><p style=\"text-align: justify;\">III.&#160;&#8211;&#160;En cons&#233;quence, &#224; la seconde phrase du premier alin&#233;a du 2 de l&#8217;article&#160;1636 B <i>undecies</i> du code g&#233;n&#233;ral des imp&#244;ts, les mots&#160;: &#171;&#160;de pr&#233;vention et de&#160;&#187; sont remplac&#233;s les mots&#160;: &#171;&#160;d&#8217;&#233;conomie circulaire int&#233;grant la pr&#233;vention et la&#160;.</p>",
    "exposeSommaire": "<p style=\"text-align: justify;\">Cet amendement vise &#224; transformer les plans r&#233;gionaux de gestion des d&#233;chets en plans r&#233;gionaux d&#8217;&#233;conomie circulaire. Cela permettra une v&#233;ritable d&#233;marche d&#8217;&#233;conomie circulaire &#224; l&#8217;&#233;chelle r&#233;gionale, en prenant en compte les ressources du territoire, en sus des d&#233;chets. Il s&#8217;agit de mieux conna&#238;tre les ressources r&#233;gionales, intrins&#232;ques ou import&#233;es par la production et la consommation locales, afin de d&#233;ployer des programmes de d&#233;veloppement &#233;conomiques autour de celles-ci.</p>",
    "cartoucheDelaiDepotDepasse": "Sous réserve de son traitement par les services de l'Assemblée nationale et de sa recevabilité"
  },
  "representations": [
    {
      "nom": "PDF",
      "typeMime": {
        "type": "application",
        "subType": "PDF"
      },
      "statutRepresentation": {
        "verbatim": true,
        "canonique": true,
        "officielle": true,
        "transcription": false,
        "enregistrement": false
      },
      "contenu": {
        "documentURI": "/15/amendements/2274/CION-DVP/CD279.pdf"
      }
    }
  ],
  "dateDepot": "2019-11-18T01:00:00.000+01:00",
  "article99": "0",
  "loiReference": {
    "codeLoi": "c environnement",
    "divisionCodeLoi": "L541-13"
  }
}