{
  "uid": "AMANR5L15SEA717460BTC0575P0D1N15",
  "identifiant": {
    "legislature": "15",
    "numero": "15",
    "numRect": "0",
    "saisine": {
      "texteLegislatifRef": "PRJLANR5L15BTC0575",
      "numeroPartiePLF": "0",
      "organeExamen": "PO717460",
      "mentionSecondeDeliberation": "0"
    }
  },
  "numeroLong": "15",
  "etapeTexte": "1ère lecture (1ère assemblée saisie)",
  "triAmendement": "aaabdhzztszy",
  "cardinaliteAmdtMultiples": "1",
  "etat": "Discuté",
  "signataires": {
    "auteur": {
      "typeAuteur": "Depute",
      "acteurRef": "PA718850",
      "groupePolitiqueRef": "PO730934"
    },
    "cosignatairesRefs": [
      "PA608826",
      "PA718780",
      "PA712015",
      "PA720586",
      "PA223837",
      "PA719946",
      "PA609726",
      "PA606712",
      "PA720684",
      "PA2529",
      "PA606098",
      "PA346054",
      "PA266776",
      "PA2377",
      "PA719318",
      "PA719272",
      "PA720100",
      "PA718850",
      "PA334654",
      "PA722390",
      "PA608016",
      "PA266793",
      "PA334149",
      "PA721968",
      "PA330684",
      "PA1630",
      "PA330240",
      "PA720644",
      "PA609245",
      "PA605036",
      "PA720630",
      "PA332523",
      "PA267318",
      "PA718884",
      "PA267794",
      "PA642847",
      "PA605991",
      "PA1874",
      "PA721286",
      "PA2792",
      "PA767",
      "PA267429",
      "PA1012",
      "PA721636",
      "PA718838",
      "PA2155",
      "PA266797",
      "PA2492",
      "PA998",
      "PA721314",
      "PA266774",
      "PA608416",
      "PA2086",
      "PA267527",
      "PA340853",
      "PA267378"
    ],
    "texteAffichable": "M.&#160;Cordier,  M.&#160;Abad, Mme&#160;Anthoine, M.&#160;Aubert, M.&#160;Bazin, Mme&#160;Bazin-Malgras, Mme&#160;Val&#233;rie&#160;Boyer, M.&#160;Cattin, M.&#160;Cinieri, M.&#160;Ciotti, Mme&#160;Genevard, M.&#160;Herbillon, M.&#160;Hetzel, Mme&#160;Lacroute, M.&#160;Grelier, M.&#160;Gosselin, M.&#160;Leclerc, Mme&#160;Levy, Mme&#160;Louwagie, Mme&#160;Duby-Muller, M.&#160;Dive, Mme&#160;Dalloz, M.&#160;Menuel, M.&#160;Dassault, Mme&#160;Meunier, M.&#160;Marleix, M.&#160;Fasquelle, M.&#160;Nury, M.&#160;Pierre-Henri&#160;Dumont, M.&#160;Perrut, M.&#160;Peltier, M.&#160;Ramadier, M.&#160;Saddier, M.&#160;Schellenberger, Mme&#160;Tabarot, M.&#160;Taugourdeau, M.&#160;Vialay, M.&#160;Parigi, M.&#160;Bony, M.&#160;de la Verpilli&#232;re, M.&#160;Furst, M.&#160;Pradi&#233;, M.&#160;Emmanuel&#160;Maquet, M.&#160;Brun, M.&#160;Le Fur, M.&#160;Vatin, M.&#160;Lurton, M.&#160;Quentin, M.&#160;Reiss, Mme&#160;Corneloup, Mme&#160;Trastour-Isnart, M.&#160;Straumann, M.&#160;Minot, M.&#160;Reitzer, M.&#160;Marlin et M.&#160;Brochand"
  },
  "pointeurFragmentTexte": {
    "division": {
      "titre": "Article 3",
      "articleDesignationCourte": "APRÈS ART. 3",
      "type": "ARTICLE",
      "avantAApres": "Apres",
      "divisionRattachee": "APRÈS L'ARTICLE 3, insérer l'article suivant:",
      "articleAdditionnel": "1",
      "urlDivisionTexteVise": "/15/textes/0575.asp#D_Article_3"
    }
  },
  "corps": {
    "dispositif": "<p>Le code g&#233;n&#233;ral des imp&#244;ts est ainsi modifi&#233; :</p><p>I.&#160;&#8211;&#160;L&#8217;article&#160;1649&#160;quater&#160;B&#160;quinquies&#160;est compl&#233;t&#233; par un alin&#233;a ainsi r&#233;dig&#233;&#160;:</p><p style=\"text-align: justify;\">&#171;&#160;Les contribuables, personnes physiques, qui r&#233;sident dans des &#171;&#160;zones blanches&#160;&#187; sont dispens&#233;s de l&#8217;obligation de t&#233;l&#233;d&#233;claration de leurs revenus et du t&#233;l&#233;paiement de leurs imp&#244;ts jusqu&#8217;au 31&#160;d&#233;cembre 2025.&#160;&#187;</p><p style=\"text-align: justify;\">II.&#160;&#8211;&#160;L&#8217;article&#160;1738 est compl&#233;t&#233; par un alin&#233;a ainsi r&#233;dig&#233;&#160;:</p><p style=\"text-align: justify;\">&#171;&#160;6. Les contribuables, personnes physiques, qui r&#233;sident dans des &#171;&#160;zones blanches&#160;&#187; sont dispens&#233;s de l&#8217;obligation de t&#233;l&#233;d&#233;claration de leurs revenus et du t&#233;l&#233;paiement de leurs imp&#244;ts jusqu&#8217;au 31 d&#233;cembre 2025.&#160;&#187;</p>",
    "exposeSommaire": "<p style=\"text-align: justify;\">Depuis 2016, les contribuables dont le revenu fiscal de r&#233;f&#233;rence est sup&#233;rieur &#224; 40 000&#160;euros sont d&#233;j&#224; oblig&#233;s de t&#233;l&#233;d&#233;clarer leurs revenus. Et &#224; partir de 2019 (revenus 2018), la d&#233;claration num&#233;rique et le t&#233;l&#233;paiement seront obligatoires pour tous les contribuables.</p><p style=\"text-align: justify;\">Cet amendement propose par cons&#233;quent de reporter cette obligation pour les contribuables qui vivent dans des &#171;&#160;zones blanches&#160;&#187; jusqu&#8217;&#224; 2026.</p><p style=\"text-align: justify;\">En effet, notre territoire n&#8217;est pas encore parfaitement couvert en Internet et certains n&#8217;ont toujours pas acc&#232;s au Haut D&#233;bit permettant une connexion suffisante pour t&#233;l&#233;d&#233;clarer ses revenus.</p>"
  },
  "representations": [
    {
      "nom": "PDF",
      "typeMime": {
        "type": "application",
        "subType": "PDF"
      },
      "statutRepresentation": {
        "verbatim": true,
        "canonique": true,
        "officielle": true,
        "transcription": false,
        "enregistrement": false
      },
      "contenu": {
        "documentURI": "/15/amendements/0575/AN/15.pdf"
      }
    }
  ],
  "seanceDiscussion": "RUANR5L15S2018IDS20865",
  "sort": {
    "dateSaisie": "2018-01-24T17:30:49.000+01:00",
    "sortEnSeance": "Rejeté"
  },
  "dateDepot": "2018-01-18T01:00:00.000+01:00",
  "dateDistribution": "2018-01-23T01:00:00.000+01:00",
  "article99": "0",
  "loiReference": {
    "codeLoi": "CGI",
    "divisionCodeLoi": "1649 quater B quinquies"
  }
}