{
  "uid": "AMANR5L15PO757134B1088P0D1N1442",
  "identifiant": {
    "legislature": "15",
    "numero": "1442",
    "numRect": "0",
    "saisine": {
      "texteLegislatifRef": "PRJLANR5L15B1088",
      "numeroPartiePLF": "0",
      "organeExamen": "PO757134",
      "mentionSecondeDeliberation": "0"
    }
  },
  "numeroLong": "1442",
  "etapeTexte": "1ère lecture (1ère assemblée saisie)",
  "triAmendement": "abcaaaaaaaaaaaaaaaaaaaaaaaaaaaaaaaaaaaaaaaaaaaaaaai",
  "cardinaliteAmdtMultiples": "1",
  "etat": "Discuté",
  "signataires": {
    "auteur": {
      "typeAuteur": "Depute",
      "acteurRef": "PA719850",
      "groupePolitiqueRef": "PO730964"
    },
    "cosignatairesRefs": [
      "PA719850"
    ],
    "texteAffichable": "Mme&#160;Motin"
  },
  "pointeurFragmentTexte": {
    "division": {
      "titre": "Article PREMIER",
      "articleDesignationCourte": "APRÈS ART. PREMIER",
      "type": "ARTICLE",
      "avantAApres": "Apres",
      "divisionRattachee": "APRÈS L'ARTICLE PREMIER, insérer l'article suivant:",
      "articleAdditionnel": "1",
      "urlDivisionTexteVise": "/15/textes/1088.asp#D_Article_1er"
    }
  },
  "corps": {
    "dispositif": "<p style=\"text-align: justify;\">Pour chaque forme juridique d&#8217;entreprise, un mod&#232;le de statut-type comportant les clauses obligatoires pour la validit&#233; des statuts est mis &#224; disposition du public par l&#8217;administration ou par le groupement d&#8217;int&#233;r&#234;t &#233;conomique constitu&#233; ou par les greffiers sur le fondement des dispositions de l&#8217;article L.&#160;743&#8209;12 du code de commerce, sous format d&#233;mat&#233;rialis&#233; t&#233;l&#233;chargeable.</p><p style=\"text-align: justify;\">Ce mod&#232;le de statut-type est r&#233;guli&#232;rement mis &#224; jour par l&#8217;administration ou par le groupement d&#8217;int&#233;r&#234;t &#233;conomique constitu&#233; par les greffiers sur le fondement des dispositions de l&#8217;article L.&#160;743&#8209;12 du code de commerce.</p>",
    "exposeSommaire": "<p style=\"text-align: justify;\">Cet amendement vise &#224; mettre &#224; disposition des cr&#233;ateurs d&#8217;entreprises des mod&#232;les de statuts-types.</p><p style=\"text-align: justify;\">Aujourd&#8217;hui, seuls les statuts types des EURL sont publi&#233;s et n&#8217;ont pas &#233;t&#233; mis &#224; jour depuis 2008. Les cr&#233;ateurs d&#8217;entreprise se reposent donc souvent sur des mod&#232;les &#224; la fiabilit&#233; juridique variable ou ach&#232;tent d&#8217;autres mod&#232;les aupr&#232;s d&#8217;organismes.</p>"
  },
  "representations": [
    {
      "nom": "PDF",
      "typeMime": {
        "type": "application",
        "subType": "PDF"
      },
      "statutRepresentation": {
        "verbatim": true,
        "canonique": true,
        "officielle": true,
        "transcription": false,
        "enregistrement": false
      },
      "contenu": {
        "documentURI": "/15/amendements/1088/CSPACTE/1442.pdf"
      }
    }
  ],
  "sort": {
    "dateSaisie": "2018-09-06T16:50:38.000+02:00",
    "sortEnSeance": "Non soutenu"
  },
  "dateDepot": "2018-09-03T02:00:00.000+02:00",
  "dateDistribution": "2018-09-05T02:00:00.000+02:00",
  "article99": "0",
  "loiReference": {
    "codeLoi": "xxx"
  }
}