{
  "uid": "AMANR5L15SEA717460BTC1548P0D1N645",
  "identifiant": {
    "legislature": "15",
    "numero": "645",
    "numRect": "0",
    "saisine": {
      "texteLegislatifRef": "PRJLANR5L15BTC1548",
      "numeroPartiePLF": "0",
      "organeExamen": "PO717460",
      "mentionSecondeDeliberation": "0"
    }
  },
  "numeroLong": "645",
  "etapeTexte": "Nouvelle Lecture",
  "triAmendement": "ldaaaaaaaaaaaaaaaaaaaaaaaaaaaaaaaaaaaaaaaaaaaaaaaahaho",
  "cardinaliteAmdtMultiples": "1",
  "etat": "Discuté",
  "signataires": {
    "auteur": {
      "typeAuteur": "Depute",
      "acteurRef": "PA607619",
      "groupePolitiqueRef": "PO759900"
    },
    "cosignatairesRefs": [
      "PA605518",
      "PA719146",
      "PA405480",
      "PA333421",
      "PA755549",
      "PA336439",
      "PA267042",
      "PA607619",
      "PA608292",
      "PA336175",
      "PA331582",
      "PA719138"
    ],
    "texteAffichable": "M.&#160;Molac,  M.&#160;Acquaviva, M.&#160;Brial, M.&#160;Castellani, M.&#160;Cl&#233;ment, Mme&#160;Dubi&#233;, M.&#160;Favennec Becot, M.&#160;Fran&#231;ois-Michel&#160;Lambert, M.&#160;Pancher, Mme&#160;Pinel, M.&#160;Pupponi et M.&#160;Philippe&#160;Vigier"
  },
  "pointeurFragmentTexte": {
    "division": {
      "titre": "Article 53",
      "articleDesignationCourte": "ART. 53",
      "type": "ARTICLE",
      "avantAApres": "A",
      "divisionRattachee": "ARTICLE 53",
      "urlDivisionTexteVise": "/15/textes/1548.asp#D_Article_53"
    },
    "alinea": {
      "numero": "30"
    }
  },
  "corps": {
    "dispositif": "<p>&#192; l&#8217;alin&#233;a&#160;30, substituer aux mots&#160;:</p><p>&#171;&#160;volume des affaires concern&#233;es et de la technicit&#233;&#160;&#187;</p><p>les mots&#160;:</p><p>&#171;&#160;tr&#232;s faible volume des affaires concern&#233;es et de la haute technicit&#233; juridique&#160;&#187;.</p>",
    "exposeSommaire": "<p style=\"text-align: justify;\">Cet article pr&#233;voit le regroupement de l&#8217;ensemble des contentieux relevant du tribunal d&#8217;instance au tribunal de grande instance afin d&#8217;unifier la comp&#233;tence civile au sein d&#8217;une m&#234;me juridiction.</p><p style=\"text-align: justify;\">Dans les d&#233;partements dans lesquels plusieurs TGI sont implant&#233;s, la d&#233;signation de l&#8217;un par d&#233;cret pour traiter de contentieux d&#233;termin&#233;s, qu&#8217;ils soient civils ou p&#233;naux sera d&#233;termin&#233;e &#224; partir d&#8217;une liste de contentieux limitativement fix&#233;e par d&#233;cret en Conseil d&#8217;&#201;tat et respectant, s&#8217;agissant des d&#233;lits, des crit&#232;res l&#233;gislatifs li&#233;s &#224; la coll&#233;gialit&#233; et au volume d&#8217;affaires.</p><p style=\"text-align: justify;\">Cet amendement tend &#224; pr&#233;ciser ces crit&#232;res&#160;: des contentieux &#224; haute sp&#233;cificit&#233; juridique et &#224; tr&#232;s faible volum&#233;trie.</p>"
  },
  "representations": [
    {
      "nom": "PDF",
      "typeMime": {
        "type": "application",
        "subType": "PDF"
      },
      "statutRepresentation": {
        "verbatim": true,
        "canonique": true,
        "officielle": true,
        "transcription": false,
        "enregistrement": false
      },
      "contenu": {
        "documentURI": "/15/amendements/1548/AN/645.pdf"
      }
    }
  ],
  "seanceDiscussion": "RUANR5L15S2019IDS21452",
  "sort": {
    "dateSaisie": "2019-01-18T02:16:12.000+01:00",
    "sortEnSeance": "Rejeté"
  },
  "dateDepot": "2019-01-11T01:00:00.000+01:00",
  "dateDistribution": "2019-01-16T01:00:00.000+01:00",
  "article99": "0",
  "loiReference": {}
}