{
  "uid": "AMANR5L15SEA717460B2272P1D1N641",
  "identifiant": {
    "legislature": "15",
    "numero": "641",
    "numRect": "0",
    "saisine": {
      "texteLegislatifRef": "PRJLANR5L15B2272",
      "numeroPartiePLF": "1",
      "organeExamen": "PO717460",
      "mentionSecondeDeliberation": "0"
    }
  },
  "numeroLong": "I-641",
  "etapeTexte": "1ère lecture (1ère assemblée saisie)",
  "triAmendement": "aocaaaaaaaaaaaaaaaaaaaaaaaaaaaaaaaaaaaaaaaaaaaaaaazzzzzzzzzzzzzzzzzzo",
  "cardinaliteAmdtMultiples": "1",
  "etat": "Irrecevable",
  "signataires": {
    "auteur": {
      "typeAuteur": "Depute",
      "acteurRef": "PA332523",
      "groupePolitiqueRef": "PO730934"
    },
    "cosignatairesRefs": [
      "PA722390",
      "PA718884",
      "PA605036",
      "PA334654",
      "PA1327",
      "PA721678",
      "PA332523",
      "PA606712",
      "PA719318",
      "PA267204",
      "PA643134",
      "PA720684",
      "PA608416",
      "PA606098",
      "PA718838",
      "PA712015",
      "PA718850",
      "PA267429",
      "PA346218",
      "PA334149",
      "PA720210"
    ],
    "texteAffichable": "Mme&#160;Dalloz,  Mme&#160;Corneloup, Mme&#160;Valentin, M.&#160;Pierre-Henri&#160;Dumont, M.&#160;Abad, Mme&#160;Beauvais, M.&#160;Sermier, M.&#160;Straumann, M.&#160;Lurton, M.&#160;Masson, M.&#160;Dive, M.&#160;Hetzel, M.&#160;Reda, M.&#160;Brun, M.&#160;Cinieri, M.&#160;Cordier, M.&#160;Fasquelle, M.&#160;Marleix, Mme&#160;Anthoine, Mme&#160;Bazin-Malgras et M.&#160;Forissier"
  },
  "pointeurFragmentTexte": {
    "division": {
      "titre": "Article 20",
      "articleDesignationCourte": "APRÈS ART. 20",
      "type": "ARTICLE",
      "avantAApres": "Apres",
      "divisionRattachee": "APRÈS L'ARTICLE 20, insérer l'article suivant:",
      "articleAdditionnel": "1",
      "urlDivisionTexteVise": "/15/textes/2272A.asp#D_Article_20"
    }
  },
  "corps": {},
  "representations": [
    {
      "nom": "PDF",
      "typeMime": {
        "type": "application",
        "subType": "PDF"
      },
      "statutRepresentation": {
        "verbatim": true,
        "canonique": true,
        "officielle": true,
        "transcription": false,
        "enregistrement": false
      },
      "contenu": {
        "documentURI": "/15/amendements/2272A/AN/641.pdf"
      }
    }
  ],
  "dateDepot": "2019-10-09T02:00:00.000+02:00",
  "dateDistribution": "2019-10-14T02:00:00.000+02:00",
  "article99": "0",
  "loiReference": {
    "codeLoi": "CGI",
    "divisionCodeLoi": "1520"
  }
}