{
  "uid": "AMANR5L15SEA717460BTC1448P0D1N22",
  "identifiant": {
    "legislature": "15",
    "numero": "22",
    "numRect": "0",
    "saisine": {
      "texteLegislatifRef": "PIONANR5L15BTC1448",
      "numeroPartiePLF": "0",
      "organeExamen": "PO717460",
      "mentionSecondeDeliberation": "0"
    }
  },
  "numeroLong": "22",
  "etapeTexte": "1ère lecture (1ère assemblée saisie)",
  "triAmendement": "doaaaaaaaaaaaaaaaaaaaaaaaaaaaaaaaaaaaaaaaaaaaaaaaai",
  "cardinaliteAmdtMultiples": "1",
  "etat": "Discuté",
  "signataires": {
    "auteur": {
      "typeAuteur": "Depute",
      "acteurRef": "PA721932",
      "groupePolitiqueRef": "PO723569"
    },
    "cosignatairesRefs": [
      "PA719608",
      "PA721932"
    ],
    "texteAffichable": "Mme&#160;Lorho et Mme&#160;M&#233;nard"
  },
  "pointeurFragmentTexte": {
    "division": {
      "titre": "Article 2 ter",
      "articleDesignationCourte": "ART. 2 TER",
      "type": "ARTICLE",
      "avantAApres": "A",
      "divisionRattachee": "ARTICLE 2 TER",
      "urlDivisionTexteVise": "/15/textes/1448.asp#D_Article_2_ter"
    },
    "alinea": {
      "avantAApres": "Apres",
      "numero": "3"
    }
  },
  "corps": {
    "dispositif": "<p style=\"text-align: justify;\">Compl&#233;ter cet article par l'alin&#233;a suivant&#160;:</p><p style=\"text-align: justify;\">&#171;&#160;3&#176; Il est compl&#233;t&#233; par une phrase ainsi r&#233;dig&#233;e&#160;:&#160;&#171;&#160;Ces montants sont doubl&#233;s, respectivement pour la personne physique et la personne morale, lorsque l&#8217;op&#233;rateur &#224; l&#8217;origine de l&#8217;appel se situe &#224; l&#8217;&#233;tranger.&#160;&#187;&#160;&#187;</p>",
    "exposeSommaire": "<p style=\"text-align: justify;\">Les cas d&#8217;escroquerie &#233;manant de d&#233;marchages t&#233;l&#233;phoniques pass&#233;s depuis l&#8217;&#233;tranger sont innombrables. Entre 2015 et 2018, des salari&#233;s de la PME Viva Multimedia ont ainsi r&#233;colt&#233; 38 millions d&#8217;euros, en se servant d&#8217;un op&#233;rateur bas&#233; &#224; l&#8217;&#233;tranger. La proc&#233;dure employ&#233;e consiste &#224; faire rappeler un num&#233;ro au consommateur&#160;; ce num&#233;ro, bas&#233; &#224; l&#8217;&#233;tranger, engendre des co&#251;ts consid&#233;rables pour le num&#233;ro appelant. Il est donc n&#233;cessaire de condamner avec force cette technique, en doublant la peine financi&#232;re des personnes physiques ou morales usant de ce proc&#233;d&#233;.</p>"
  },
  "representations": [
    {
      "nom": "PDF",
      "typeMime": {
        "type": "application",
        "subType": "PDF"
      },
      "statutRepresentation": {
        "verbatim": true,
        "canonique": true,
        "officielle": true,
        "transcription": false,
        "enregistrement": false
      },
      "contenu": {
        "documentURI": "/15/amendements/1448/AN/22.pdf"
      }
    }
  ],
  "seanceDiscussion": "RUANR5L15S2019IDS21407",
  "sort": {
    "dateSaisie": "2018-12-06T15:19:28.000+01:00",
    "sortEnSeance": "Non soutenu"
  },
  "dateDepot": "2018-12-03T01:00:00.000+01:00",
  "dateDistribution": "2018-12-05T01:00:00.000+01:00",
  "article99": "0",
  "loiReference": {}
}