{
  "uid": "AMANR5L15PO420120B1681P0D1N1253",
  "identifiant": {
    "legislature": "15",
    "numero": "1253",
    "numRect": "0",
    "saisine": {
      "texteLegislatifRef": "PRJLANR5L15B1681",
      "numeroPartiePLF": "0",
      "organeExamen": "PO420120",
      "mentionSecondeDeliberation": "0"
    }
  },
  "numeroLong": "AS1253",
  "etapeTexte": "1ère lecture (1ère assemblée saisie)",
  "triAmendement": "dkaaaaaaaaaaaaaaaaaaaaaaaaaaaaaaaaaaaaaaaaaaaaaaaaeoac",
  "cardinaliteAmdtMultiples": "1",
  "etat": "Discuté",
  "signataires": {
    "auteur": {
      "typeAuteur": "Depute",
      "acteurRef": "PA608416",
      "groupePolitiqueRef": "PO730934"
    },
    "cosignatairesRefs": [
      "PA721286",
      "PA608416",
      "PA267289"
    ],
    "texteAffichable": "M.&#160;Hetzel,  M.&#160;Door et M.&#160;Ramadier"
  },
  "pointeurFragmentTexte": {
    "division": {
      "titre": "Article 11",
      "articleDesignationCourte": "ART. 11",
      "type": "ARTICLE",
      "avantAApres": "A",
      "divisionRattachee": "ARTICLE 11",
      "urlDivisionTexteVise": "/15/textes/1681.asp#D_Article_11"
    },
    "alinea": {
      "avantAApres": "Apres",
      "numero": "29"
    }
  },
  "corps": {
    "dispositif": "<p style=\"text-align: justify;\">Apr&#232;s l&#8217;alin&#233;a&#160;29, ins&#233;rer les trois alin&#233;as suivants&#160;:</p><p style=\"text-align: justify;\">&#171;&#160;V <i>bis (nouveau)</i>.&#160;&#8211;&#160;Le m&#234;me article L.&#160;1461&#8209;5 est compl&#233;t&#233; par deux alin&#233;as ainsi r&#233;dig&#233;s&#160;:</p><p style=\"text-align: justify;\">&#171;&#160;Le syst&#232;me national des donn&#233;es de sant&#233; ne permet d&#8217;acc&#233;der ni aux noms et pr&#233;noms des personnes, ni &#224; leur num&#233;ro d&#8217;inscription au r&#233;pertoire national d&#8217;identification des personnes physiques. Les num&#233;ros d&#8217;identification des professionnels de sant&#233; sont conserv&#233;s et g&#233;r&#233;s s&#233;par&#233;ment des autres donn&#233;es.</p><p style=\"text-align: justify;\">&#171;&#160;Les codes permettant l&#8217;identification de la personne sont confi&#233;s &#224; un organisme distinct du responsable du syst&#232;me national des donn&#233;es de sant&#233; et des responsables des traitements.&#160;&#187;</p>",
    "exposeSommaire": "<p style=\"text-align: justify;\">Il convient d&#8217;organiser et de s&#233;curiser les donn&#233;es de sant&#233;.</p>"
  },
  "representations": [
    {
      "nom": "PDF",
      "typeMime": {
        "type": "application",
        "subType": "PDF"
      },
      "statutRepresentation": {
        "verbatim": true,
        "canonique": true,
        "officielle": true,
        "transcription": false,
        "enregistrement": false
      },
      "contenu": {
        "documentURI": "/15/amendements/1681/CION-SOC/AS1253.pdf"
      }
    }
  ],
  "sort": {
    "dateSaisie": "2019-03-14T00:11:43.000+01:00",
    "sortEnSeance": "Rejeté"
  },
  "dateDepot": "2019-03-08T01:00:00.000+01:00",
  "dateDistribution": "2019-03-12T01:00:00.000+01:00",
  "article99": "0",
  "loiReference": {}
}