{
  "uid": "AMANR5L15PO59048B1255P1D1N712",
  "identifiant": {
    "legislature": "15",
    "numero": "712",
    "numRect": "0",
    "saisine": {
      "texteLegislatifRef": "PRJLANR5L15B1255",
      "numeroPartiePLF": "1",
      "organeExamen": "PO59048",
      "mentionSecondeDeliberation": "0"
    }
  },
  "numeroLong": "I-CF712",
  "etapeTexte": "1ère lecture (1ère assemblée saisie)",
  "triAmendement": "ekaaaaaaaaaaaaaaaaaaaaaaaaaaaaaaaaaaaaaaaaaaaaaaaabwny",
  "cardinaliteAmdtMultiples": "1",
  "etat": "Discuté",
  "signataires": {
    "auteur": {
      "typeAuteur": "Depute",
      "acteurRef": "PA346218",
      "groupePolitiqueRef": "PO730934"
    },
    "cosignatairesRefs": [
      "PA720210",
      "PA608016",
      "PA718784",
      "PA1327",
      "PA267289",
      "PA606098",
      "PA330684",
      "PA767",
      "PA721816",
      "PA346218",
      "PA609726",
      "PA721286",
      "PA722390"
    ],
    "texteAffichable": "M.&#160;Masson,  M.&#160;Aubert, M.&#160;Boucard, Mme&#160;Beauvais, Mme&#160;Val&#233;rie&#160;Boyer, M.&#160;Cattin, Mme&#160;Corneloup, M.&#160;Door, Mme&#160;Louwagie, M.&#160;Marleix, M.&#160;Pauget, M.&#160;Ramadier et M.&#160;Forissier"
  },
  "pointeurFragmentTexte": {
    "division": {
      "titre": "Article 19",
      "articleDesignationCourte": "ART. 19",
      "type": "ARTICLE",
      "avantAApres": "A",
      "divisionRattachee": "ARTICLE 19",
      "urlDivisionTexteVise": "/15/textes/1255A.asp#D_Article_19"
    },
    "alinea": {
      "avantAApres": "A",
      "numero": "3",
      "alineaDesignation": "Alinéa 3"
    }
  },
  "corps": {
    "dispositif": "<p>Supprimer les alin&#233;as 3 et 4.</p>",
    "exposeSommaire": "<p>Cet amendement a pour objet de maintenir l&#8217;utilisation du Gazole Non Routier &#224; l&#8217;ensemble des secteurs d&#8217;activit&#233; aujourd&#8217;hui b&#233;n&#233;ficiaires, en particulier celui des travaux publics.</p><p>La suppression du gazole destin&#233; &#224; &#234;tre utilis&#233; comme carburant sous condition d&#8217;emploi, tel que le pr&#233;voit l&#8217;article 19 dans sa r&#233;daction actuelle, entra&#238;nera un surco&#251;t de pr&#232;s de 500 millions d&#8217;euros pour les seules entreprises de travaux publics (soit l&#8217;&#233;quivalent de 60% de leur marge) sur les 900 millions d&#8217;euros d&#8217;&#233;conomie budg&#233;taire attendue par le Gouvernement.</p><p>Cette mesure est d&#8217;autant plus brutale que les entreprises de travaux publics, qui d&#233;pendent de la commande publique &#224; hauteur des deux tiers de leur activit&#233;, ne pourront r&#233;percuter la hausse de leurs co&#251;ts de production dans les contrats en cours.</p><p>Consid&#233;rant que les contrats g&#233;n&#233;ralement conclus dans le cadre des march&#233;s de travaux sont pluriannuels, le d&#233;s&#233;quilibre contractuel qui r&#233;sulterait de la suppression du GNR dans les travaux publics, sera des plus pr&#233;judiciables pour l&#8217;ensemble de la fili&#232;re, notamment les PME, qui composent &#224; 80% le tissu des entreprises de travaux publics.</p><p>A supposer que les co&#251;ts induits par la suppression du GNR seraient r&#233;percut&#233;s dans les contrats en cours, l&#8217;inflation des prix limitera n&#233;cessairement &#224; budgets constants le volume d&#8217;investissement des donneurs d&#8217;ordre public et ce, dans un contexte de sous-investissement r&#233;current en mati&#232;re d&#8217;infrastructures.</p><p>Au regard de ce qui pr&#233;c&#232;de, il convient donc de maintenir le r&#233;gime applicable existant en mati&#232;re de carburant sous condition d&#8217;emploi pour l&#8217;ensemble des secteurs d&#8217;activit&#233;.</p>"
  },
  "representations": [
    {
      "nom": "PDF",
      "typeMime": {
        "type": "application",
        "subType": "PDF"
      },
      "statutRepresentation": {
        "verbatim": true,
        "canonique": true,
        "officielle": true,
        "transcription": false,
        "enregistrement": false
      },
      "contenu": {
        "documentURI": "/15/amendements/1255A/CION_FIN/CF712.pdf"
      }
    }
  ],
  "sort": {
    "dateSaisie": "2018-10-11T09:11:14.000+02:00",
    "sortEnSeance": "Tombé"
  },
  "dateDepot": "2018-10-05T02:00:00.000+02:00",
  "dateDistribution": "2018-10-09T02:00:00.000+02:00",
  "article99": "0",
  "loiReference": {}
}