{
  "uid": "AMANR5L15SEA717460BTC2243P0D1N538",
  "identifiant": {
    "legislature": "15",
    "numero": "538",
    "numRect": "0",
    "saisine": {
      "texteLegislatifRef": "PRJLANR5L15BTC2243",
      "numeroPartiePLF": "0",
      "organeExamen": "PO717460",
      "mentionSecondeDeliberation": "0"
    }
  },
  "numeroLong": "538",
  "etapeTexte": "1ère lecture (1ère assemblée saisie)",
  "triAmendement": "esaaaaaaaaaaaaaaaaaaaaaaaaaaaaaaaaaaaaaaaaaaaaaaaamw",
  "cardinaliteAmdtMultiples": "1",
  "etat": "Discuté",
  "signataires": {
    "auteur": {
      "typeAuteur": "Depute",
      "acteurRef": "PA608416",
      "groupePolitiqueRef": "PO730934"
    },
    "cosignatairesRefs": [
      "PA266776",
      "PA608416"
    ],
    "texteAffichable": "M.&#160;Hetzel et M.&#160;Reiss"
  },
  "pointeurFragmentTexte": {
    "division": {
      "titre": "Article 17",
      "articleDesignationCourte": "ART. 17",
      "type": "ARTICLE",
      "avantAApres": "A",
      "divisionRattachee": "ARTICLE 17",
      "urlDivisionTexteVise": "/15/textes/2243.asp#D_Article_17"
    },
    "alinea": {
      "numero": "3"
    }
  },
  "corps": {
    "dispositif": "<p>Supprimer les alin&#233;as 3 &#224; 5.</p>",
    "exposeSommaire": "<p style=\"text-align: justify;\">L&#8217;article&#160;16&#8209;4 du code civil rappelle que toute pratique eug&#233;nique est interdite. Mais l&#8217;ouverture des recherches sur les caract&#232;res g&#233;n&#233;tiques d&#8217;une personne, impliquant le diagnostic et l&#8217;extension de ce diagnostic &#224; toute maladie, y compris non g&#233;n&#233;tique, contredit ce pr&#233;requis.</p>"
  },
  "representations": [
    {
      "nom": "PDF",
      "typeMime": {
        "type": "application",
        "subType": "PDF"
      },
      "statutRepresentation": {
        "verbatim": true,
        "canonique": true,
        "officielle": true,
        "transcription": false,
        "enregistrement": false
      },
      "contenu": {
        "documentURI": "/15/amendements/2243/AN/538.pdf"
      }
    }
  ],
  "seanceDiscussion": "RUANR5L15S2020IDS21849",
  "sort": {
    "dateSaisie": "2019-10-04T22:16:30.000+02:00",
    "sortEnSeance": "Rejeté"
  },
  "dateDepot": "2019-09-16T02:00:00.000+02:00",
  "dateDistribution": "2019-09-30T02:00:00.000+02:00",
  "article99": "0",
  "loiReference": {}
}