{
  "uid": "AMANR5L15SEA717460B0235P2D1N840",
  "identifiant": {
    "legislature": "15",
    "numero": "840",
    "numRect": "0",
    "saisine": {
      "texteLegislatifRef": "PRJLANR5L15B0235",
      "numeroPartiePLF": "2",
      "organeExamen": "PO717460",
      "mentionSecondeDeliberation": "0"
    }
  },
  "numeroLong": "II-840",
  "etapeTexte": "1ère lecture (1ère assemblée saisie)",
  "triAmendement": "y",
  "cardinaliteAmdtMultiples": "1",
  "etat": "Irrecevable",
  "signataires": {
    "auteur": {
      "typeAuteur": "Depute",
      "acteurRef": "PA335054",
      "groupePolitiqueRef": "PO730946"
    },
    "cosignatairesRefs": [
      "PA335054"
    ],
    "texteAffichable": "Mme&#160;Karamanli et les membres du groupe Nouvelle Gauche"
  },
  "pointeurFragmentTexte": {
    "missionVisee": {
      "idMissionAN": "18",
      "libelleMission": "Immigration, asile et intégration",
      "codeMissionPLF": "B",
      "libelleMissionPLF": "Répartition, par mission et programme, des crédits du budget général"
    },
    "division": {
      "titre": "ÉTAT B",
      "articleDesignationCourte": "ART. 29",
      "type": "ANNEXE",
      "avantAApres": "A",
      "divisionRattachee": "ARTICLE 29",
      "urlDivisionTexteVise": "/15/textes/0235C.asp#D_ETAT_B"
    }
  },
  "corps": {
    "exposeSommaire": "<p style=\"text-align: justify;\">Cet amendement d&#8217;appel vise &#224; souligner l&#8217;insuffisance des cr&#233;dits de cette mission.</p><p>Il transf&#232;re des cr&#233;dits de l&#8217;action 14 &#171;&#160;Acc&#232;s &#224; la nationalit&#233; fran&#231;aise&#160;&#187; du programme 104 &#171;&#160;Int&#233;gration et acc&#232;s &#224; la nationalit&#233; fran&#231;aise&#160;&#187; vers l&#8217;action 3 &#171;&#160;Lutte contre l&#8217;immigration irr&#233;guli&#232;re&#160;&#187; du programme 303 &#171;&#160;Immigration et asile&#160;&#187;. </p>",
    "dispositifAmdtCredit": {
      "listeProgrammes": [
        {
          "libelle": "Immigration et asile",
          "id": "9889",
          "AE": {
            "montantPositif": "84167",
            "montantNegatif": "0"
          },
          "CP": {
            "montantPositif": "84167",
            "montantNegatif": "0"
          },
          "action": "modification"
        },
        {
          "libelle": "Intégration et accès à la nationalité française",
          "id": "9890",
          "AE": {
            "montantPositif": "0",
            "montantNegatif": "84167"
          },
          "CP": {
            "montantPositif": "0",
            "montantNegatif": "84167"
          },
          "action": "modification"
        }
      ],
      "totalAE": {
        "montantPositif": "84167",
        "montantNegatif": "84167",
        "solde": "0"
      },
      "totalCP": {
        "montantPositif": "84167",
        "montantNegatif": "84167",
        "solde": "0"
      }
    }
  },
  "representations": [
    {
      "nom": "PDF",
      "typeMime": {
        "type": "application",
        "subType": "PDF"
      },
      "statutRepresentation": {
        "verbatim": true,
        "canonique": true,
        "officielle": true,
        "transcription": false,
        "enregistrement": false
      },
      "contenu": {
        "documentURI": "/15/amendements/0235C/AN/840.pdf"
      }
    }
  ],
  "dateDepot": "2017-11-04T01:00:00.000+01:00",
  "article99": "0",
  "loiReference": {}
}