{
  "uid": "AMANR5L15SEA717460BTC1629P0D1N856",
  "identifiant": {
    "legislature": "15",
    "numero": "856",
    "numRect": "0",
    "saisine": {
      "texteLegislatifRef": "PRJLANR5L15BTC1629",
      "numeroPartiePLF": "0",
      "organeExamen": "PO717460",
      "mentionSecondeDeliberation": "1"
    }
  },
  "numeroLong": "856",
  "etapeTexte": "1ère lecture (1ère assemblée saisie)",
  "triAmendement": "juaaaaaaaaaaaaaaaaaaaaaaaaaaaaaaaaaaaaaaaaaaaaaaaabc",
  "cardinaliteAmdtMultiples": "1",
  "etat": "Discuté",
  "signataires": {
    "auteur": {
      "typeAuteur": "Depute",
      "acteurRef": "PA720326",
      "groupePolitiqueRef": "PO730970"
    },
    "cosignatairesRefs": [
      "PA720326",
      "PA720976"
    ],
    "texteAffichable": "M.&#160;Hammouche et M.&#160;Mathiasin"
  },
  "pointeurFragmentTexte": {
    "division": {
      "titre": "Article 16",
      "articleDesignationCourte": "APRÈS ART. 16",
      "type": "ARTICLE",
      "avantAApres": "Apres",
      "divisionRattachee": "APRÈS L'ARTICLE 16, insérer l'article suivant:",
      "articleAdditionnel": "1",
      "urlDivisionTexteVise": "/15/textes/1629.asp#D_Article_16"
    }
  },
  "corps": {
    "dispositif": "<p>L&#8217;article L. 913-1 du code de l&#8217;&#233;ducation est compl&#233;t&#233; par un alin&#233;a ainsi r&#233;dig&#233; :</p><p style=\"text-align: justify;\">&#171;&#160;Dans leur mission de conseiller technique, les personnels de sant&#233; et les psychologues de l&#8217;&#233;ducation nationale contribuent, dans leur champ de comp&#233;tence, &#224; l&#8217;&#233;laboration, l&#8217;impulsion, la mise en &#339;uvre, le suivi et l&#8217;&#233;valuation de la politique de l&#8217;&#233;ducation nationale en mati&#232;re de sant&#233; et de sant&#233; mentale.&#160;&#187;</p>",
    "exposeSommaire": "<p style=\"text-align: justify;\">Cet amendement d&#8217;appel pr&#233;cise les missions des personnels de sant&#233; et des psychologues de l&#8217;&#233;ducation nationale en tant que conseillers techniques aupr&#232;s des diff&#233;rentes autorit&#233;s administratives de l&#8217;&#233;ducation nationale&#160;: ils &#233;laborent, impulsent mettent en &#339;uvre, suivent et &#233;valuent la politique de l&#8217;&#233;ducation nationale en mati&#232;re de sant&#233; et de sant&#233; mentale.</p>"
  },
  "representations": [
    {
      "nom": "PDF",
      "typeMime": {
        "type": "application",
        "subType": "PDF"
      },
      "statutRepresentation": {
        "verbatim": true,
        "canonique": true,
        "officielle": true,
        "transcription": false,
        "enregistrement": false
      },
      "contenu": {
        "documentURI": "/15/amendements/1629/AN/856.pdf"
      }
    }
  ],
  "seanceDiscussion": "RUANR5L15S2019IDS21508",
  "sort": {
    "dateSaisie": "2019-02-15T22:12:46.000+01:00",
    "sortEnSeance": "Non soutenu"
  },
  "dateDepot": "2019-02-07T01:00:00.000+01:00",
  "dateDistribution": "2019-02-12T01:00:00.000+01:00",
  "article99": "0",
  "loiReference": {
    "codeLoi": "c éducation",
    "divisionCodeLoi": "L913-1"
  }
}