{
  "uid": "AMANR5L15SEA717460B0911P0D1N171",
  "identifiant": {
    "legislature": "15",
    "numero": "171",
    "numRect": "0",
    "saisine": {
      "texteLegislatifRef": "PRJLANR5L15B0911",
      "numeroPartiePLF": "0",
      "organeExamen": "PO717460",
      "mentionSecondeDeliberation": "0"
    }
  },
  "numeroLong": "171",
  "etapeTexte": "1ère lecture (1ère assemblée saisie)",
  "triAmendement": "oas",
  "cardinaliteAmdtMultiples": "1",
  "etat": "A discuter",
  "signataires": {
    "auteur": {
      "typeAuteur": "Depute",
      "acteurRef": "PA942",
      "groupePolitiqueRef": "PO744425"
    },
    "cosignatairesRefs": [
      "PA605036",
      "PA719600",
      "PA721328",
      "PA718990",
      "PA722228",
      "PA719480",
      "PA722102",
      "PA719404",
      "PA719154",
      "PA719472",
      "PA642868",
      "PA642847",
      "PA608016",
      "PA942",
      "PA721860",
      "PA643175",
      "PA719756",
      "PA719060"
    ],
    "texteAffichable": "M.&#160;Charles&#160;de Courson,  M.&#160;Jerretie, M.&#160;Cazeneuve, M.&#160;Abad, M.&#160;Bazin, Mme&#160;Blanc, Mme&#160;Brugnera, M.&#160;Cesarini, M.&#160;Christophe, Mme&#160;Cloarec, Mme&#160;Dupont, M.&#160;Gaillard, M.&#160;Le Gac, M.&#160;Leclabart, Mme&#160;Louwagie, M.&#160;Martin, M.&#160;Poulliat et Mme&#160;Vidal"
  },
  "pointeurFragmentTexte": {
    "division": {
      "titre": "Article 7",
      "articleDesignationCourte": "ART. 7",
      "type": "ARTICLE",
      "avantAApres": "A",
      "divisionRattachee": "ARTICLE 7",
      "urlDivisionTexteVise": "/15/textes/0911.asp#D_Article_7"
    },
    "alinea": {
      "numero": "3"
    }
  },
  "corps": {
    "dispositif": "<p style=\"text-align: justify;\">Supprimer les alin&#233;as 3 et 4.</p>",
    "exposeSommaire": "<p style=\"text-align: justify;\">Amendement de coordination avec l'amendement pr&#233;sent&#233; &#224; l'article 2 visant &#224; cr&#233;er la cat&#233;gorie des lois de financement des collectivit&#233;s territoriales, et avec celui, pr&#233;sent&#233; apr&#232;s l'article 7, visant &#224; d&#233;finir la proc&#233;dure d'examen de ces lois (dans un nouvel article 47-1-1) et &#224; permettre l'examen conjoint, en tout ou partie, non seulement du projet de loi de finances et du projet de loi de financement de la s&#233;curit&#233; sociale (comme le pr&#233;voient les alin&#233;as ici supprim&#233;s) mais aussi des projets de loi de financement des collectivit&#233;s territoriales.</p>"
  },
  "representations": [
    {
      "nom": "PDF",
      "typeMime": {
        "type": "application",
        "subType": "PDF"
      },
      "statutRepresentation": {
        "verbatim": true,
        "canonique": true,
        "officielle": true,
        "transcription": false,
        "enregistrement": false
      },
      "contenu": {
        "documentURI": "/15/amendements/0911/AN/171.pdf"
      }
    }
  ],
  "dateDepot": "2018-07-03T02:00:00.000+02:00",
  "dateDistribution": "2018-07-10T02:00:00.000+02:00",
  "article99": "0",
  "loiReference": {}
}