{
  "uid": "AMANR5L15SEA717460BTC0575P0D1N856",
  "identifiant": {
    "legislature": "15",
    "numero": "856",
    "numRect": "0",
    "saisine": {
      "texteLegislatifRef": "PRJLANR5L15BTC0575",
      "numeroPartiePLF": "0",
      "organeExamen": "PO717460",
      "mentionSecondeDeliberation": "0"
    }
  },
  "numeroLong": "856",
  "etapeTexte": "1ère lecture (1ère assemblée saisie)",
  "triAmendement": "g",
  "cardinaliteAmdtMultiples": "1",
  "etat": "Discuté",
  "signataires": {
    "auteur": {
      "typeAuteur": "Depute",
      "acteurRef": "PA719608",
      "groupePolitiqueRef": "PO723569"
    },
    "cosignatairesRefs": [
      "PA719608"
    ],
    "texteAffichable": "Mme&#160;M&#233;nard"
  },
  "pointeurFragmentTexte": {
    "division": {
      "titre": "Article 25",
      "articleDesignationCourte": "ART. 25",
      "type": "ARTICLE",
      "avantAApres": "A",
      "divisionRattachee": "ARTICLE 25",
      "urlDivisionTexteVise": "/15/textes/0575.asp#D_Article_25"
    }
  },
  "corps": {
    "dispositif": "<p>Supprimer cet article.</p>",
    "exposeSommaire": "<p style=\"text-align: justify;\">Le tout num&#233;rique s&#8217;invite jusque dans nos lieux de culte.</p><p style=\"text-align: justify;\">Alors que la collecte de dons par SMS aux associations pourrait sembler positive, puisqu&#8217;elle aurait pour objectif de favoriser les dons, elle emporte avec elle un certain nombre de probl&#232;mes.</p><p style=\"text-align: justify;\">Les dons par SMS aux associations posent aussi certaines difficult&#233;s en mati&#232;re de tra&#231;abilit&#233; des financements, car nul ne peut assurer que les dons ne proviendront pas de r&#233;seaux terroristes ou de donateurs &#233;trangers (notamment &#224; cause du probable piratage des comptes et du possible refus de coop&#233;ration des op&#233;rateurs).</p><p style=\"text-align: justify;\">En outre, cette pratique pose de s&#233;rieuses questions en terme de protection de la vie priv&#233;e puisque l&#8217;op&#233;rateur sera inform&#233; de tous les dons que les fid&#232;les feront.</p><p style=\"text-align: justify;\">Enfin, cet article ne semble avoir aucun rapport avec le pr&#233;sent projet loi, ce qui laisse penser qu&#8217;il s&#8217;agit d&#8217;un cavalier l&#233;gislatif.</p><p style=\"text-align: justify;\">Pour ces diff&#233;rentes raisons, il convient de le supprimer.</p>"
  },
  "representations": [
    {
      "nom": "PDF",
      "typeMime": {
        "type": "application",
        "subType": "PDF"
      },
      "statutRepresentation": {
        "verbatim": true,
        "canonique": true,
        "officielle": true,
        "transcription": false,
        "enregistrement": false
      },
      "contenu": {
        "documentURI": "/15/amendements/0575/AN/856.pdf"
      }
    }
  ],
  "seanceDiscussion": "RUANR5L15S2018IDS20867",
  "sort": {
    "dateSaisie": "2018-01-25T11:33:13.000+01:00",
    "sortEnSeance": "Non soutenu"
  },
  "dateDepot": "2018-01-19T01:00:00.000+01:00",
  "dateDistribution": "2018-01-22T01:00:00.000+01:00",
  "article99": "0",
  "loiReference": {}
}