{
  "uid": "AMANR5L15SEA717460BTC1761P0D1N792",
  "identifiant": {
    "legislature": "15",
    "numero": "792",
    "numRect": "0",
    "saisine": {
      "texteLegislatifRef": "PRJLANR5L15BTC1761",
      "numeroPartiePLF": "0",
      "organeExamen": "PO717460",
      "mentionSecondeDeliberation": "0"
    }
  },
  "numeroLong": "792",
  "etapeTexte": "Nouvelle Lecture",
  "triAmendement": "aakaaaaaaaiaaaaaaaaaaaaaaaaaaaaaaaaaaaaaaaaaaaaaaazzzzzzzzzzzzx",
  "cardinaliteAmdtMultiples": "1",
  "etat": "Retiré",
  "signataires": {
    "auteur": {
      "typeAuteur": "Depute",
      "acteurRef": "PA942",
      "groupePolitiqueRef": "PO759900"
    },
    "cosignatairesRefs": [
      "PA942"
    ],
    "texteAffichable": "M.&#160;Charles&#160;de Courson"
  },
  "pointeurFragmentTexte": {
    "division": {
      "titre": "Article 44",
      "articleDesignationCourte": "ART. 44",
      "type": "ARTICLE",
      "avantAApres": "A",
      "divisionRattachee": "ARTICLE 44",
      "urlDivisionTexteVise": "/15/textes/1761.asp#D_Article_44"
    },
    "alinea": {
      "avantAApres": "Apres",
      "numero": "3"
    }
  },
  "corps": {
    "dispositif": "<p style=\"text-align: justify;\">Apr&#232;s l&#8217;alin&#233;a&#160;3, ins&#233;rer l&#8217;alin&#233;a suivant&#160;:</p><p style=\"text-align: justify;\">&#171;&#160;La proc&#233;dure mentionn&#233;e &#224; l&#8217;alin&#233;a pr&#233;c&#233;dent s&#8217;applique &#233;galement aux transferts d&#8217;activit&#233;s qui impliquent ou non des transferts d&#8217;actifs et qui rel&#232;vent de la mission d&#233;finie &#224; la premi&#232;re phrase de l&#8217;article L.&#160;6323&#8209;2, vers des entit&#233;s juridiques qui ne sont pas en charge de ladite mission.&#160;&#187;</p>",
    "exposeSommaire": "<p style=\"text-align: justify;\">Cet amendement a pour but de clarifier le p&#233;rim&#232;tre des autorisations d&#233;livr&#233;es par l&#8217;&#201;tat en cas de r&#233;organisation interne du groupe ADP ou de volont&#233; de cession d&#8217;activit&#233;s. Cet amendement permet de s&#233;curiser que les ressources n&#233;cessaires pour assurer les missions de service public a&#233;roportuaires restent au sein du groupe ADP et sont transf&#233;r&#233;s &#224; l&#8217;&#201;tat dans 70 ans.&#160;</p>"
  },
  "representations": [
    {
      "nom": "PDF",
      "typeMime": {
        "type": "application",
        "subType": "PDF"
      },
      "statutRepresentation": {
        "verbatim": true,
        "canonique": true,
        "officielle": true,
        "transcription": false,
        "enregistrement": false
      },
      "contenu": {
        "documentURI": "/15/amendements/1761/AN/792.pdf"
      }
    }
  ],
  "dateDepot": "2019-03-11T01:00:00.000+01:00",
  "dateDistribution": "2019-03-12T01:00:00.000+01:00",
  "article99": "0",
  "loiReference": {}
}