{
  "uid": "AMANR5L15PO766718B2187P0D1N69",
  "identifiant": {
    "legislature": "15",
    "numero": "69",
    "numRect": "0",
    "saisine": {
      "texteLegislatifRef": "PRJLANR5L15B2187",
      "numeroPartiePLF": "0",
      "organeExamen": "PO766718",
      "mentionSecondeDeliberation": "0"
    }
  },
  "numeroLong": "69",
  "etapeTexte": "1ère lecture (1ère assemblée saisie)",
  "triAmendement": "dkaaaaaaaaaaaaaaaaaaaaaaaaaaaaaaaaaaaaaaaaaaaaaaaaek",
  "cardinaliteAmdtMultiples": "1",
  "etat": "Discuté",
  "signataires": {
    "auteur": {
      "typeAuteur": "Depute",
      "acteurRef": "PA330008",
      "groupePolitiqueRef": "PO730934"
    },
    "cosignatairesRefs": [
      "PA720210",
      "PA722390",
      "PA721286",
      "PA330008"
    ],
    "texteAffichable": "M.&#160;Breton,  Mme&#160;Corneloup, Mme&#160;Beauvais et M.&#160;Ramadier"
  },
  "pointeurFragmentTexte": {
    "division": {
      "titre": "Article 14",
      "articleDesignationCourte": "ART. 14",
      "type": "ARTICLE",
      "avantAApres": "A",
      "divisionRattachee": "ARTICLE 14",
      "urlDivisionTexteVise": "/15/textes/2187.asp#D_Article_14"
    }
  },
  "corps": {
    "dispositif": "<p style=\"text-align: justify;\">Supprimer cet article.</p>",
    "exposeSommaire": "<p style=\"text-align: justify;\">Cet article vise &#224; distinguer les recherches sur les embryons humains et sur les cellules-souches embryonnaires.</p><p style=\"text-align: justify;\">Ainsi, il pr&#233;voit de passer la recherche sur les cellules souches embryonnaires du r&#233;gime d&#8217;autorisation encadr&#233;e &#224; la simple d&#233;claration &#224; l&#8217;Agence de la biom&#233;decine.</p><p style=\"text-align: justify;\">Si une cellule souche embryonnaire n&#8217;est pas un embryon humain en soi, le l&#233;gislateur ne peut oublier qu&#8217;elle en &#233;mane et que son pr&#233;l&#232;vement en provoque la destruction.</p>"
  },
  "representations": [
    {
      "nom": "PDF",
      "typeMime": {
        "type": "application",
        "subType": "PDF"
      },
      "statutRepresentation": {
        "verbatim": true,
        "canonique": true,
        "officielle": true,
        "transcription": false,
        "enregistrement": false
      },
      "contenu": {
        "documentURI": "/15/amendements/2187/CSBIOETH/69.pdf"
      }
    }
  ],
  "sort": {
    "dateSaisie": "2019-09-13T14:40:38.000+02:00",
    "sortEnSeance": "Rejeté"
  },
  "dateDepot": "2019-08-01T02:00:00.000+02:00",
  "dateDistribution": "2019-09-13T02:00:00.000+02:00",
  "article99": "0",
  "loiReference": {}
}