{
  "uid": "AMANR5L15PO420120B1681P0D1N555",
  "identifiant": {
    "legislature": "15",
    "numero": "555",
    "numRect": "0",
    "saisine": {
      "texteLegislatifRef": "PRJLANR5L15B1681",
      "numeroPartiePLF": "0",
      "organeExamen": "PO420120",
      "mentionSecondeDeliberation": "0"
    }
  },
  "numeroLong": "AS555",
  "etapeTexte": "1ère lecture (1ère assemblée saisie)",
  "triAmendement": "adaaaaaaaaaaaaaaaaaaaaaaaaaaaaaaaaaaaaaaaaaaaaaaaani",
  "cardinaliteAmdtMultiples": "1",
  "etat": "Discuté",
  "signataires": {
    "auteur": {
      "typeAuteur": "Depute",
      "acteurRef": "PA719266",
      "groupePolitiqueRef": "PO730970"
    },
    "cosignatairesRefs": [
      "PA719266",
      "PA720256"
    ],
    "texteAffichable": "M.&#160;Cubertafon et Mme&#160;Bannier"
  },
  "pointeurFragmentTexte": {
    "division": {
      "titre": "Article PREMIER",
      "articleDesignationCourte": "ART. PREMIER",
      "type": "ARTICLE",
      "avantAApres": "A",
      "divisionRattachee": "ARTICLE PREMIER",
      "urlDivisionTexteVise": "/15/textes/1681.asp#D_Article_1er"
    },
    "alinea": {
      "numero": "8"
    }
  },
  "corps": {
    "dispositif": "<p style=\"text-align: justify;\">Compl&#233;ter l&#8217;alin&#233;a&#160;8 par la phrase suivante&#160;:</p><p style=\"text-align: justify;\">&#171;&#160;Ces parcours de formation&#160;incluront notamment une sensibilisation &#224; la probl&#233;matique de la d&#233;sertification m&#233;dicale.&#160;&#187;</p>",
    "exposeSommaire": "<p>Le pr&#233;sent amendement vise &#224; renforcer la formation des futurs professionnels de sant&#233;, et notamment des m&#233;decins, &#224; la probl&#233;matique de la d&#233;sertification m&#233;dicale en inscrivant cette question dans leur parcours de formation.</p><p style=\"text-align: justify;\">La d&#233;sertification m&#233;dicale est un probl&#232;me majeur qui touche de plus en plus de territoires et de plus en plus de citoyens. Alors qu'en 2007,&#160;600.000 personnes habitaient dans un d&#233;sert m&#233;dical, elles sont dix fois plus, soit pr&#232;s de 6 millions, en 2015. Les cons&#233;quences de ce ph&#233;nom&#232;ne sont nombreuses et d&#233;l&#233;t&#232;res : sentiment d'abandon de la population, non-recours aux soins, r&#233;duction de l'attractivit&#233; du territoire, fracture territoriale ...</p><p style=\"text-align: justify;\">Or, il appara&#238;t que les futurs professionnels de sant&#233; ne sont pas forc&#233;ment sensibilis&#233;s &#224; cette probl&#233;matique lors de leur formation. Concentr&#233;s sur l'apprentissage de savoir et savoir-faire exigeants, ils demeurent &#233;loign&#233;s des r&#233;alit&#233;s des d&#233;serts m&#233;dicaux, des r&#233;alit&#233;s souvent m&#233;connues et caricatur&#233;es.</p><p style=\"text-align: justify;\">Le pr&#233;sent amendement propose donc d'inclure la sensibilisation &#224; la probl&#233;matique de la d&#233;sertification m&#233;dicale&#160;dans le parcours de formation des futurs professionnels de sant&#233;. Cette sensibilisation devra permettre, &#224; la fois, une prise de conscience des futurs professionnels, mais aussi de les&#160;rassurer sur la r&#233;alit&#233; de l'exercice dans les territoires victimes de la p&#233;nurie m&#233;dicale.</p><p>&#160;</p>"
  },
  "representations": [
    {
      "nom": "PDF",
      "typeMime": {
        "type": "application",
        "subType": "PDF"
      },
      "statutRepresentation": {
        "verbatim": true,
        "canonique": true,
        "officielle": true,
        "transcription": false,
        "enregistrement": false
      },
      "contenu": {
        "documentURI": "/15/amendements/1681/CION-SOC/AS555.pdf"
      }
    }
  ],
  "sort": {
    "dateSaisie": "2019-03-12T17:45:50.000+01:00",
    "sortEnSeance": "Non soutenu"
  },
  "dateDepot": "2019-03-07T01:00:00.000+01:00",
  "dateDistribution": "2019-03-12T01:00:00.000+01:00",
  "article99": "0",
  "loiReference": {}
}