{
  "uid": "AMANR5L15SEA717460BTC1974P0D1N2999",
  "identifiant": {
    "legislature": "15",
    "numero": "2999",
    "numRect": "0",
    "saisine": {
      "texteLegislatifRef": "PRJLANR5L15BTC1974",
      "numeroPartiePLF": "0",
      "organeExamen": "PO717460",
      "mentionSecondeDeliberation": "0"
    }
  },
  "numeroLong": "2999",
  "etapeTexte": "1ère lecture (2ème assemblée saisie)",
  "triAmendement": "adcaaaaaaaaaaaaaaaaaaaaaaaaaaaaaaaaaaaaaaaaaaaaaaals",
  "cardinaliteAmdtMultiples": "1",
  "etat": "Irrecevable",
  "signataires": {
    "auteur": {
      "typeAuteur": "Depute",
      "acteurRef": "PA721522",
      "groupePolitiqueRef": "PO730964"
    },
    "cosignatairesRefs": [
      "PA721522"
    ],
    "texteAffichable": "M.&#160;Batut"
  },
  "pointeurFragmentTexte": {
    "division": {
      "titre": "Article PREMIER",
      "articleDesignationCourte": "ART. PREMIER",
      "type": "ARTICLE",
      "avantAApres": "A",
      "divisionRattachee": "ARTICLE PREMIER",
      "urlDivisionTexteVise": "/15/textes/1974.asp#D_Article_1er"
    },
    "alinea": {
      "avantAApres": "A",
      "numero": "16",
      "alineaDesignation": "Alinéa 16"
    }
  },
  "corps": {},
  "representations": [
    {
      "nom": "PDF",
      "typeMime": {
        "type": "application",
        "subType": "PDF"
      },
      "statutRepresentation": {
        "verbatim": true,
        "canonique": true,
        "officielle": true,
        "transcription": false,
        "enregistrement": false
      },
      "contenu": {
        "documentURI": "/15/amendements/1974/AN/2999.pdf"
      }
    }
  ],
  "dateDepot": "2019-05-29T02:00:00.000+02:00",
  "dateDistribution": "2019-06-03T02:00:00.000+02:00",
  "article99": "0",
  "loiReference": {}
}