{
  "uid": "AMANR5L15SEA717460BTC2063P0D1N66",
  "identifiant": {
    "legislature": "15",
    "numero": "66",
    "numRect": "0",
    "saisine": {
      "texteLegislatifRef": "PRJLANR5L15BTC2063",
      "numeroPartiePLF": "0",
      "organeExamen": "PO717460",
      "mentionSecondeDeliberation": "0"
    }
  },
  "numeroLong": "66",
  "etapeTexte": "1ère lecture (1ère assemblée saisie)",
  "triAmendement": "auaaaaaaaaaaaaaaaaaaaaaaaaaaaaaaaaaaaaaaaaaaaaaaaacn",
  "cardinaliteAmdtMultiples": "1",
  "etat": "Discuté",
  "signataires": {
    "auteur": {
      "typeAuteur": "Depute",
      "acteurRef": "PA642847",
      "groupePolitiqueRef": "PO730934"
    },
    "cosignatairesRefs": [
      "PA642847"
    ],
    "texteAffichable": "M.&#160;Bazin"
  },
  "pointeurFragmentTexte": {
    "division": {
      "titre": "Article 1er sexies",
      "articleDesignationCourte": "ART. 1ER SEXIES",
      "type": "ARTICLE",
      "avantAApres": "A",
      "divisionRattachee": "ARTICLE 1ER SEXIES",
      "urlDivisionTexteVise": "/15/textes/2063.asp#D_Article_1er_sexies"
    },
    "alinea": {
      "numero": "3"
    }
  },
  "corps": {
    "dispositif": "<p style=\"text-align: justify;\">&#192; la fin de l&#8217;alin&#233;a&#160;3, substituer &#224; l&#8217;ann&#233;e&#160;:</p><p style=\"text-align: justify;\">&#171;&#160;2022&#160;&#187;</p><p style=\"text-align: justify;\">l&#8217;ann&#233;e&#160;:</p><p style=\"text-align: justify;\">&#171;&#160;2020&#160;&#187;.</p>",
    "exposeSommaire": "<p style=\"text-align: justify;\">L&#8217;article&#160;1<sup>er</sup> <i>sexies</i>, tel qu&#8217;adopt&#233; en commission, se r&#233;v&#232;le bien peu exigeant puisqu&#8217;il ne pr&#233;voit &#160;l&#8217;application des mesures contenues dans le deuxi&#232;me alin&#233;a, soit la mise en &#339;uvre des &#160;objectifs de r&#233;duction de l&#8217;empreinte carbone de la France, qu&#8217;apr&#232;s le 1<sup>er</sup> janvier 2022,</p><p style=\"text-align: justify;\">Compte tenu de l&#8217;urgence de r&#233;duction de l&#8217;empreinte carbone de la France, cet amendement vous propose de l&#8217;avancer &#224; 2020.</p>"
  },
  "representations": [
    {
      "nom": "PDF",
      "typeMime": {
        "type": "application",
        "subType": "PDF"
      },
      "statutRepresentation": {
        "verbatim": true,
        "canonique": true,
        "officielle": true,
        "transcription": false,
        "enregistrement": false
      },
      "contenu": {
        "documentURI": "/15/amendements/2063/AN/66.pdf"
      }
    }
  ],
  "seanceDiscussion": "RUANR5L15S2019IDS21736",
  "sort": {
    "dateSaisie": "2019-06-27T17:58:53.000+02:00",
    "sortEnSeance": "Non soutenu"
  },
  "dateDepot": "2019-06-21T02:00:00.000+02:00",
  "dateDistribution": "2019-06-25T02:00:00.000+02:00",
  "article99": "0",
  "loiReference": {}
}