{
  "uid": "AMANR5L15PO59051B1349P0D1N157",
  "identifiant": {
    "legislature": "15",
    "numero": "157",
    "numRect": "0",
    "saisine": {
      "texteLegislatifRef": "PRJLANR5L15B1349",
      "numeroPartiePLF": "0",
      "organeExamen": "PO59051",
      "mentionSecondeDeliberation": "0"
    }
  },
  "numeroLong": "CL157",
  "etapeTexte": "1ère lecture (2ème assemblée saisie)",
  "triAmendement": "emaaaaaaaaaaaaaaaaaaaaaaaaaaaaaaaaaaaaaaaaaaaaaaaai",
  "cardinaliteAmdtMultiples": "1",
  "etat": "Discuté",
  "signataires": {
    "auteur": {
      "typeAuteur": "Depute",
      "acteurRef": "PA721960",
      "groupePolitiqueRef": "PO730958"
    },
    "cosignatairesRefs": [
      "PA721210",
      "PA720422",
      "PA718868",
      "PA588884",
      "PA720286",
      "PA719676",
      "PA721960",
      "PA720430",
      "PA2150",
      "PA720846",
      "PA722142",
      "PA719578",
      "PA721202",
      "PA720892",
      "PA718860",
      "PA721062",
      "PA721226"
    ],
    "texteAffichable": "Mme&#160;Obono,  Mme&#160;Autain, M.&#160;Bernalicis, M.&#160;Coquerel, M.&#160;Corbi&#232;re, Mme&#160;Fiat, M.&#160;Lachaud, M.&#160;Larive, M.&#160;M&#233;lenchon, Mme&#160;Panot, M.&#160;Prud&apos;homme, M.&#160;Quatennens, M.&#160;Ratenon, Mme&#160;Ressiguier, Mme&#160;Rubin, M.&#160;Ruffin et Mme&#160;Taurine"
  },
  "pointeurFragmentTexte": {
    "division": {
      "titre": "Article 36",
      "articleDesignationCourte": "APRÈS ART. 36",
      "type": "ARTICLE",
      "avantAApres": "Apres",
      "divisionRattachee": "APRÈS L'ARTICLE 36, insérer l'article suivant:",
      "articleAdditionnel": "1",
      "urlDivisionTexteVise": "/15/textes/1349.asp#D_Article_36"
    }
  },
  "corps": {
    "dispositif": "<p style=\"text-align: justify;\">L&#8217;article&#160;144 du code de proc&#233;dure p&#233;nale est compl&#233;t&#233; de deux alin&#233;as ainsi r&#233;dig&#233;s&#160;:</p><p style=\"text-align: justify;\">&#171;&#160;L&#8217;autorit&#233; judiciaire pronon&#231;ant une d&#233;tention provisoire doit express&#233;ment motiv&#233; sa d&#233;cision au regard de toute autre mesure pouvant &#234;tre effectu&#233;e en milieu libre.</p><p style=\"text-align: justify;\">&#171;&#160;La d&#233;cision ordonnant ou prolongeant une d&#233;tention provisoire doit &#234;tre prononc&#233;e en pr&#233;sence physique du magistrat et de la personne. Elle ne peut &#234;tre prononc&#233;e en toute hypoth&#232;se par un moyen de t&#233;l&#233;communications vis&#233;s par l&#8217;article&#160;706&#8209;71 du Code de proc&#233;dure p&#233;nale.&#160;&#187;</p>",
    "exposeSommaire": "<p style=\"text-align: justify;\">Cet amendement vise &#224; d&#8217;une part renforcer l&#8217;obligation de motivation des magistrats quant au choix de la d&#233;tention provisoire au d&#233;triment d&#8217;une mesure en milieu libre comme le contr&#244;le judiciaire. D&#8217;autre part cet amendement oblige &#224; ce que les magistrats soit en pr&#233;sence des personnes lors du prononc&#233; ou du renouvellement d&#8217;une mesure de d&#233;tention provisoire.</p><p style=\"text-align: justify;\">Pour le groupe de la France insoumise, la loi doit renforcer la conscience des cons&#233;quences des d&#233;cisions de privations de libert&#233; que constitue la d&#233;tention provisoire. Aussi, il important de renforcer l&#8217;obligation de motivation et d&#8217;interdire en toute hypoth&#232;se le recours &#224; la visio-conf&#233;rence dans ces situations.</p>"
  },
  "representations": [
    {
      "nom": "PDF",
      "typeMime": {
        "type": "application",
        "subType": "PDF"
      },
      "statutRepresentation": {
        "verbatim": true,
        "canonique": true,
        "officielle": true,
        "transcription": false,
        "enregistrement": false
      },
      "contenu": {
        "documentURI": "/15/amendements/1349/CION_LOIS/CL157.pdf"
      }
    }
  ],
  "sort": {
    "dateSaisie": "2018-11-08T22:49:58.000+01:00",
    "sortEnSeance": "Rejeté"
  },
  "dateDepot": "2018-10-30T01:00:00.000+01:00",
  "dateDistribution": "2018-11-07T01:00:00.000+01:00",
  "article99": "0",
  "loiReference": {
    "codeLoi": "procédure pénale",
    "divisionCodeLoi": "144"
  }
}