{
  "uid": "AMANR5L15SEA717460BTC0938P0D1N255",
  "identifiant": {
    "legislature": "15",
    "numero": "255",
    "numRect": "1",
    "saisine": {
      "texteLegislatifRef": "PRJLANR5L15BTC0938",
      "numeroPartiePLF": "0",
      "organeExamen": "PO717460",
      "mentionSecondeDeliberation": "0"
    }
  },
  "numeroLong": "255 (Rect)",
  "etapeTexte": "1ère lecture (1ère assemblée saisie)",
  "triAmendement": "ahx",
  "cardinaliteAmdtMultiples": "1",
  "etat": "Discuté",
  "signataires": {
    "auteur": {
      "typeAuteur": "Depute",
      "acteurRef": "PA721234",
      "groupePolitiqueRef": "PO730970"
    },
    "cosignatairesRefs": [
      "PA721234"
    ],
    "texteAffichable": "Mme&#160;Maud&#160;Petit"
  },
  "pointeurFragmentTexte": {
    "division": {
      "titre": "Article 2",
      "articleDesignationCourte": "ART. 2",
      "type": "ARTICLE",
      "avantAApres": "A",
      "divisionRattachee": "ARTICLE 2",
      "urlDivisionTexteVise": "/15/textes/0938.asp#D_Article_2"
    },
    "alinea": {
      "avantAApres": "A",
      "numero": "3",
      "alineaDesignation": "Alinéa 3"
    }
  },
  "corps": {
    "dispositif": "<p style=\"text-align: justify;\">Compl&#233;ter l&#8217;alin&#233;a 3 par la phrase suivante&#160;:&#160;</p><p style=\"text-align: justify;\">&#171;&#160;La contrainte est alors pr&#233;sum&#233;e.&#160;&#187;</p>",
    "exposeSommaire": "<p style=\"text-align: justify;\">Le pr&#233;sent amendement vise &#224; clarifier la pr&#233;somption de non-consentement d&#8217;un mineur de quinze ans. La charge de la preuve est alors invers&#233;e.&#160;</p>"
  },
  "representations": [
    {
      "nom": "PDF",
      "typeMime": {
        "type": "application",
        "subType": "PDF"
      },
      "statutRepresentation": {
        "verbatim": true,
        "canonique": true,
        "officielle": true,
        "transcription": false,
        "enregistrement": false
      },
      "contenu": {
        "documentURI": "/15/amendements/0938/AN/255.pdf"
      }
    }
  ],
  "seanceDiscussion": "RUANR5L15S2018IDS21031",
  "sort": {
    "dateSaisie": "2018-05-15T23:28:54.000+02:00",
    "sortEnSeance": "Rejeté"
  },
  "dateDepot": "2018-05-11T02:00:00.000+02:00",
  "dateDistribution": "2018-05-14T02:00:00.000+02:00",
  "article99": "0",
  "loiReference": {}
}