{
  "uid": "AMANR5L15SEA717460BTC1662P0D1N378",
  "identifiant": {
    "legislature": "15",
    "numero": "378",
    "numRect": "1",
    "saisine": {
      "texteLegislatifRef": "PIONANR5L15BTC1662",
      "numeroPartiePLF": "0",
      "organeExamen": "PO717460",
      "mentionSecondeDeliberation": "0"
    }
  },
  "numeroLong": "378 (Rect)",
  "etapeTexte": "1ère lecture (2ème assemblée saisie)",
  "triAmendement": "aiaaaaaaaaaaaaaaaaaaaaaaaaaaaaaaaaaaaaaaaaaaaaaaaazxwv",
  "cardinaliteAmdtMultiples": "1",
  "etat": "Discuté",
  "signataires": {
    "auteur": {
      "typeAuteur": "Depute",
      "acteurRef": "PA720598",
      "groupePolitiqueRef": "PO730970"
    },
    "cosignatairesRefs": [
      "PA720598"
    ],
    "texteAffichable": "Mme&#160;Deprez-Audebert"
  },
  "pointeurFragmentTexte": {
    "division": {
      "titre": "Article PREMIER",
      "articleDesignationCourte": "ART. PREMIER",
      "type": "ARTICLE",
      "avantAApres": "A",
      "divisionRattachee": "ARTICLE PREMIER",
      "urlDivisionTexteVise": "/15/textes/1662.asp#D_Article_1er"
    },
    "alinea": {
      "numero": "7"
    }
  },
  "corps": {
    "dispositif": "<p>Compl&#233;ter cet article par l'alin&#233;a suivant&#160;:</p><p style=\"text-align: justify;\">&#171;&#160;Son si&#232;ge est situ&#233; dans une commune autre que Paris, d&#233;sign&#233;e par d&#233;cret.&#160;&#187;</p>",
    "exposeSommaire": "<p>Installer le si&#232;ge de l&#8217;Agence d&#233;di&#233;e &#224; la Coh&#233;sion des Territoires dans une commune autre que Paris et hors r&#233;gion parisienne serait un symbole fort et en accord avec les d&#233;clarations du Pr&#233;sident de la R&#233;publique d&#8217;une part, et de M. le Ministre S&#233;bastien Lecornu d&#8217;autre part. Plusieurs autres agences sont actuellement d&#233;centralis&#233;es, c&#8217;est le cas de l&#8217;EPARECA, dont le si&#232;ge est &#224; Lille, ou de l&#8217;Agence nationale pour l&#8217;am&#233;lioration des conditions de travail (ANACT) dont le si&#232;ge est &#224; Lyon. Certaines communes, comme Amiens par exemple, pas trop &#233;loign&#233;e de Paris et facilement accessible, seraient tout &#224; fait capables d&#8217;accueillir l&#8217;Agence nationale de la coh&#233;sion des territoires.</p>"
  },
  "representations": [
    {
      "nom": "PDF",
      "typeMime": {
        "type": "application",
        "subType": "PDF"
      },
      "statutRepresentation": {
        "verbatim": true,
        "canonique": true,
        "officielle": true,
        "transcription": false,
        "enregistrement": false
      },
      "contenu": {
        "documentURI": "/15/amendements/1662/AN/378.pdf"
      }
    }
  ],
  "seanceDiscussion": "RUANR5L15S2019IDS21543",
  "sort": {
    "dateSaisie": "2019-03-12T00:41:08.000+01:00",
    "sortEnSeance": "Rejeté"
  },
  "dateDepot": "2019-03-07T01:00:00.000+01:00",
  "dateDistribution": "2019-03-11T01:00:00.000+01:00",
  "article99": "0",
  "loiReference": {}
}