{
  "uid": "AMANR5L15PO59051B0675P0D1N7",
  "identifiant": {
    "legislature": "15",
    "numero": "7",
    "numRect": "0",
    "saisine": {
      "texteLegislatifRef": "PIONANR5L15B0675",
      "numeroPartiePLF": "0",
      "organeExamen": "PO59051",
      "mentionSecondeDeliberation": "0"
    }
  },
  "numeroLong": "CL7",
  "etapeTexte": "1ère lecture (1ère assemblée saisie)",
  "triAmendement": "p",
  "cardinaliteAmdtMultiples": "1",
  "etat": "A discuter",
  "signataires": {
    "auteur": {
      "typeAuteur": "Depute",
      "acteurRef": "PA722142",
      "groupePolitiqueRef": "PO730958"
    },
    "cosignatairesRefs": [
      "PA718860",
      "PA588884",
      "PA2150",
      "PA721062",
      "PA718868",
      "PA720422",
      "PA721210",
      "PA720286",
      "PA719578",
      "PA720892",
      "PA721226",
      "PA721960",
      "PA719676",
      "PA722142",
      "PA720846",
      "PA720430",
      "PA721202"
    ],
    "texteAffichable": "M.&#160;Ruffin,  Mme&#160;Autain, M.&#160;Bernalicis, M.&#160;Coquerel, M.&#160;Corbi&#232;re, Mme&#160;Fiat, M.&#160;Lachaud, M.&#160;Larive, M.&#160;M&#233;lenchon, Mme&#160;Obono, Mme&#160;Panot, M.&#160;Prud&apos;homme, M.&#160;Quatennens, M.&#160;Ratenon, Mme&#160;Ressiguier, Mme&#160;Rubin et Mme&#160;Taurine"
  },
  "pointeurFragmentTexte": {
    "division": {
      "titre": "Article 2",
      "articleDesignationCourte": "APRÈS ART. 2",
      "type": "ARTICLE",
      "avantAApres": "Apres",
      "divisionRattachee": "APRÈS L'ARTICLE 2, insérer l'article suivant:",
      "articleAdditionnel": "1",
      "urlDivisionTexteVise": "/15/textes/0675.asp#D_Article_2"
    }
  },
  "corps": {
    "dispositif": "<p style=\"text-align: justify;\">&#171;&#160;La pr&#233;sente loi entre en vigueur lorsque l&#8217;harmonisation sociale et fiscale&#160;europ&#233;enne aura &#233;t&#233; effectivement r&#233;alis&#233;e.&#160;&#187;</p>",
    "exposeSommaire": "<p style=\"line-height: 1.2; text-align: justify;\">Il n&#8217;est pas normal qu&#8217;une nouvelle fois sous la pression des grands groupes multinationaux, l&#8217;Union europ&#233;enne s&#8217;active pour l&#8217;int&#233;r&#234;t des grandes entreprises, et d&#233;laisse totalement les droits sociaux et fiscaux des peuples, des citoyennes et des citoyens.</p><p style=\"text-align: justify;\">La Banque mondiale a publi&#233; le 8 mars dernier un <a style=\"text-decoration: none;\" href=\"http://pubdocs.worldbank.org/en/244481520499464074/Growing-United-v03-online-18-03-08.pdf\">rapport</a> qui r&#233;v&#232;le :</p><p style=\"line-height: 1.2; text-align: justify;\">- &#160;qu&#8217;entre 1980 et aujourd&#8217;hui, les 10% des europ&#233;ens les plus pauvres ont connu une perte de revenus de 7% et les 10% les plus riches + 66% entre 1980 et 2010 (page 20 du rapport complet) ;</p><p style=\"line-height: 1.2; text-align: justify;\">- que la part des in&#233;galit&#233;s due aux revenus du travail sur le total des in&#233;galit&#233;s est de plus de 70% dans tous les pays, ce ph&#233;nom&#232;ne s&#8217;&#233;tant fortement d&#233;velopp&#233; depuis les ann&#233;es 1990 et ayant brutalement acc&#233;l&#233;r&#233; d&#232;s 1998 (page 19) ;</p><p style=\"line-height: 1.2; text-align: justify;\">- une conclusion sans appel : &#8220;la machine &#224; convergence de l&#8217;UE doit faire un tour au garage&#8221; (&#8220;the convergence machine is due for upgrading&#8221;.</p><p style=\"text-align: justify;\">L&#8217;absence de convergence sociale (droit du travail, revenu minimum de subsistance, salaire minimum) constitue un nivellement vers le bas inacceptable avec pour cons&#233;quence une r&#233;elle rapacit&#233; des grands groupes multinationaux qui d&#233;localisent &#224; l&#8217;int&#233;rieur de l&#8217;Europe et exercent une pression &#224; la baisse sur les pays les plus avanc&#233;s socialement. Le 26 f&#233;vrier dernier, m&#234;me Le Figaro s&#8217;&#233;mouvait du fait que le salaire minimum dans l&#8217;Union europ&#233;enne oscillait de 261 &#224; 1 999 euros (Avec notablement la Bulgarie (546 &#8364;) la Lituanie (400&#8364;), la Roumanie (408&#8364;), la Lettonie (430&#8364;), la Hongrie (445&#8364;), la Croatie (462&#8364;), la R&#233;publique tch&#232;que (478&#8364;), la Slovaquie (480&#8364;) et l'Estonie (500&#8364;))...</p><p style=\"text-align: justify;\">Et que dire de l&#8217;absence de convergence fiscale ? 15 milliards d&#8217;euros perdus (ou plut&#244;t donn&#233;s aux grands groupes multinationaux) par an pour la France selon un <a style=\"text-decoration: none;\" href=\"http://www.assemblee-nationale.fr/14/europe/rap-info/i3101.asp\">rapport parlementaire de 2015</a>. Tout cela notamment de par l&#8217;impunit&#233; dont b&#233;n&#233;ficient les pays pratiquant un dumping fiscal extr&#234;mement agressif : &#160;Luxembourg, l&#8217;Irlande, les Pays Bas. N&#8217;oublions pas par ailleurs que le Pr&#233;sident de la Commission europ&#233;enne qui a dirig&#233; le Luxembourg durant 18 ans (de 1995 &#224; 2013), pays qui a v&#233;cu sur la b&#234;te de l&#8217;optimisation fiscale au d&#233;triment de tous les peuples europ&#233;ens (<a style=\"text-decoration: none;\" href=\"https://fr.wikipedia.org/wiki/Luxembourg_Leaks\">voire le scandale Luxleaks qui concerne des accords secrets sign&#233;s de 2002 &#224; 2010 par le FISC luxembourgeois&#8230;</a>).</p><p style=\"text-align: justify;\">Cette situation inacceptable doit cesser. Il ne peut &#234;tre s&#233;rieusement envisag&#233; une nouvelle harmonisation d&#8217;ampleur qui b&#233;n&#233;ficie majoritairement aux entreprises multinationales implant&#233;es dans l&#8217;Union europ&#233;enne, SANS qu&#8217;il n&#8217;y ait une r&#233;elle harmonisation sociale et fiscale dans l&#8217;Union europ&#233;enne.</p>"
  },
  "representations": [
    {
      "nom": "PDF",
      "typeMime": {
        "type": "application",
        "subType": "PDF"
      },
      "statutRepresentation": {
        "verbatim": true,
        "canonique": true,
        "officielle": true,
        "transcription": false,
        "enregistrement": false
      },
      "contenu": {
        "documentURI": "/15/amendements/0675/CION_LOIS/CL7.pdf"
      }
    }
  ],
  "dateDepot": "2018-03-16T01:00:00.000+01:00",
  "dateDistribution": "2018-03-19T01:00:00.000+01:00",
  "article99": "0",
  "loiReference": {
    "codeLoi": "zzzzz"
  }
}