{
  "uid": "AMANR5L15PO419604B0235P2D1N78",
  "identifiant": {
    "legislature": "15",
    "numero": "78",
    "numRect": "0",
    "saisine": {
      "texteLegislatifRef": "PRJLANR5L15B0235",
      "numeroPartiePLF": "2",
      "organeExamen": "PO419604",
      "mentionSecondeDeliberation": "0"
    }
  },
  "numeroLong": "II-AC78",
  "etapeTexte": "1ère lecture (1ère assemblée saisie)",
  "triAmendement": "ao",
  "cardinaliteAmdtMultiples": "1",
  "etat": "Discuté",
  "signataires": {
    "auteur": {
      "typeAuteur": "Depute",
      "acteurRef": "PA719640",
      "groupePolitiqueRef": "PO730970"
    },
    "cosignatairesRefs": [
      "PA719044",
      "PA719640",
      "PA721234",
      "PA720178"
    ],
    "texteAffichable": "Mme&#160;Mette,  Mme&#160;Essayan, M.&#160;Garcia et Mme&#160;Maud&#160;Petit"
  },
  "pointeurFragmentTexte": {
    "missionVisee": {
      "idMissionAN": "10",
      "libelleMission": "Culture",
      "codeMissionPLF": "B",
      "libelleMissionPLF": "Répartition, par mission et programme, des crédits du budget général"
    },
    "division": {
      "titre": "ÉTAT B",
      "articleDesignationCourte": "ART. 29",
      "type": "ANNEXE",
      "avantAApres": "A",
      "divisionRattachee": "ARTICLE 29",
      "urlDivisionTexteVise": "/15/textes/0235C.asp#D_ETAT_B"
    }
  },
  "corps": {
    "exposeSommaire": "<p style=\"text-align: justify;\">Cet amendement vise &#224; proposer une nouvelle r&#233;partition des cr&#233;dits de la Culture afin d&#8217;apporter un soutien &#224; l&#8217;architecture et aux espaces prot&#233;g&#233;s et plus particuli&#232;rement &#224; la revitalisation des centres anciens. En effet cela passe par une action compl&#232;te et combin&#233;e sur tous les leviers qui permettront d&#8217;am&#233;liorer la qualit&#233; de vie des habitants des centres-bourgs mais &#233;galement des bassins de vie, de r&#233;duire la d&#233;sertification des centres villes des territoires ruraux et ainsi contribuer &#224; la coh&#233;sion sociale des territoires, &#224; leur mise en valeur et &#224; leur attractivit&#233;.</p><p style=\"text-align: justify;\">Si les politiques port&#233;es par le minist&#232;re en faveur du patrimoine et de l&#8217;architecture s&#8217;inscrivent aussi dans l&#8217;accompagnement des projets de revitalisation des centres-bourgs, des villes patrimoniales et des sites prot&#233;g&#233;s, il convient donc de mener une politique ambitieuse au risque de voir les centres villes des territoires ruraux ou p&#233;riurbains s&#8217;&#233;tioler.</p><p style=\"text-align: justify;\">L&#8217;objectif est d&#8217;aider &#224; redonner l&#8217;envie de fr&#233;quenter le centre-bourg, d&#8217;y vivre, en offrant plus de moyen &#224; cette action, en aidant &#224; valoriser le patrimoine, &#224; d&#233;velopper la cr&#233;ation architecturale et la vie culturelle mais aussi &#224; conforter la pr&#233;sence de centres-bourgs dynamiques et anim&#233;s, dans les campagnes et les zones p&#233;riurbaines.</p><p style=\"text-align: justify;\">Pour ce faire, le pr&#233;sent amendement a donc pour objet de red&#233;ployer une partie des cr&#233;dits de paiements d&#233;volus &#224; l&#8217;action n&#176;7 &#171;&#160;Fonctions de soutien du minist&#232;re&#160;&#187; du programme 224 &#171;&#160;Transmission des savoirs et d&#233;mocratisation de la culture&#160;&#187; pour les affecter au b&#233;n&#233;fice de l&#8217;action n&#176;2 &#171;&#160;Architecture et espaces prot&#233;g&#233;s &#187; port&#233;e par le programme 175 &#171;&#160;Patrimoines&#160;&#187;</p>",
    "dispositifAmdtCredit": {
      "listeProgrammes": [
        {
          "libelle": "Patrimoines",
          "id": "9427",
          "AE": {
            "montantPositif": "4000000",
            "montantNegatif": "0"
          },
          "CP": {
            "montantPositif": "4000000",
            "montantNegatif": "0"
          },
          "action": "modification"
        },
        {
          "libelle": "Création",
          "id": "9428",
          "AE": {
            "montantPositif": "0",
            "montantNegatif": "0"
          },
          "CP": {
            "montantPositif": "0",
            "montantNegatif": "0"
          },
          "action": "modification"
        },
        {
          "libelle": "Transmission des savoirs et démocratisation de la culture",
          "id": "9429",
          "AE": {
            "montantPositif": "0",
            "montantNegatif": "4000000"
          },
          "CP": {
            "montantPositif": "0",
            "montantNegatif": "4000000"
          },
          "action": "modification"
        }
      ],
      "totalAE": {
        "montantPositif": "4000000",
        "montantNegatif": "4000000",
        "solde": "0"
      },
      "totalCP": {
        "montantPositif": "4000000",
        "montantNegatif": "4000000",
        "solde": "0"
      }
    }
  },
  "representations": [
    {
      "nom": "PDF",
      "typeMime": {
        "type": "application",
        "subType": "PDF"
      },
      "statutRepresentation": {
        "verbatim": true,
        "canonique": true,
        "officielle": true,
        "transcription": false,
        "enregistrement": false
      },
      "contenu": {
        "documentURI": "/15/amendements/0235C/CION_TOUTE/AC78.pdf"
      }
    }
  ],
  "sort": {
    "sortEnSeance": "Rejeté"
  },
  "dateDepot": "2017-11-03T01:00:00.000+01:00",
  "dateDistribution": "2017-11-06T01:00:00.000+01:00",
  "article99": "0",
  "loiReference": {}
}