{
  "uid": "AMANR5L15PO766718B2187P0D1N1851",
  "identifiant": {
    "legislature": "15",
    "numero": "1851",
    "numRect": "0",
    "saisine": {
      "texteLegislatifRef": "PRJLANR5L15B2187",
      "numeroPartiePLF": "0",
      "organeExamen": "PO766718",
      "mentionSecondeDeliberation": "0"
    }
  },
  "numeroLong": "1851",
  "etapeTexte": "1ère lecture (1ère assemblée saisie)",
  "triAmendement": "hoaaaaaaaaaaaaaaaaaaaaaaaaaaaaaaaaaaaaaaaaaaaaaaaavarp",
  "cardinaliteAmdtMultiples": "1",
  "etat": "Discuté",
  "signataires": {
    "auteur": {
      "typeAuteur": "Depute",
      "acteurRef": "PA336175",
      "groupePolitiqueRef": "PO759900"
    },
    "cosignatairesRefs": [
      "PA605694",
      "PA755549",
      "PA608292",
      "PA336175",
      "PA607619",
      "PA331582",
      "PA405480"
    ],
    "texteAffichable": "Mme&#160;Pinel,  M.&#160;Philippe&#160;Vigier, M.&#160;Brial, Mme&#160;Dubi&#233;, M.&#160;Falorni, M.&#160;Molac et M.&#160;Pupponi"
  },
  "pointeurFragmentTexte": {
    "division": {
      "titre": "Article 20",
      "articleDesignationCourte": "ART. 20",
      "type": "ARTICLE",
      "avantAApres": "A",
      "divisionRattachee": "ARTICLE 20",
      "urlDivisionTexteVise": "/15/textes/2187.asp#D_Article_20"
    }
  },
  "corps": {
    "dispositif": "<p style=\"text-align: justify;\">I.&#8211;&#160;Apr&#232;s l&#8217;alin&#233;a&#160;4, ins&#233;rer l&#8217;alin&#233;a suivant&#160;:</p><p style=\"text-align: justify;\">&#171;&#160;I <i>bis</i> <i>(nouveau).&#160;&#8211;&#160;En</i> cas de grossesse multiple dont un f&#339;tus est porteur d&#8217;une malformation, l&#8217;interruption volontaire s&#233;lective d&#8217;un f&#339;tus peut, &#224; toute &#233;poque, &#234;tre pratiqu&#233;e si deux m&#233;decins membres du centre pluridisciplinaire de diagnostic pr&#233;natal attestent, apr&#232;s que cette &#233;quipe a rendu son avis consultatif, qu&#8217;il existe une forte probabilit&#233; que l&#8217;enfant &#224; na&#238;tre soit atteint d&#8217;une affection d&#8217;une particuli&#232;re gravit&#233; reconnue comme incurable au moment du diagnostic. Tout geste d&#8217;interruption s&#233;lective doit &#234;tre r&#233;alis&#233; au sein d&#8217;un centre pluridisciplinaire de diagnostic pr&#233;natal.&#160;&#187;&#160;</p><p style=\"text-align: justify;\">II.&#160;&#8211;&#160;En cons&#233;quence, &#224; la premi&#232;re phrase de l&#8217;alin&#233;a&#160;5, supprimer les mots&#160;:&#160;</p><p style=\"text-align: justify;\">&#171;&#160;des embryons ou des f&#339;tus,&#160;&#187;.&#160;</p>",
    "exposeSommaire": "<p style=\"text-align: justify;\">Pour les interruptions s&#233;lectives de grossesse, le texte propos&#233; n&#8217;est pas clair.</p><p style=\"text-align: justify;\">Il tente de concilier les pathologies maternelles et f&#339;tales mais pr&#233;cise qu&#8217;aucun crit&#232;re relatif aux caract&#233;ristiques des embryons ou des f&#339;tus ne peut &#234;tre pris en compte.</p><p style=\"text-align: justify;\">Or en pratique, l&#8217;ISG peut &#234;tre r&#233;alis&#233;e en cas de grossesse multiple, &#224; toute &#233;poque, lorsqu&#8217;un f&#339;tus est atteint d&#8217;une affection d&#8217;une particuli&#232;re gravit&#233; reconnue comme incurable au moment du diagnostic. L&#8217;ISG peut &#233;galement &#234;tre r&#233;alis&#233;e en l&#8217;absence de pathologie f&#339;tale lorsqu&#8217;elle permet de r&#233;duire les risques d&#8217;une grossesse dont le caract&#232;re multiple met en p&#233;ril la sant&#233; de la femme.</p><p style=\"text-align: justify;\">Mais pour le premier cas, il est n&#233;cessaire que les caract&#233;ristiques des embryons ou des f&#339;tus soient prises en compte puisqu&#8217;il faut d&#233;terminer l&#8217;affection grave.&#160;</p>"
  },
  "representations": [
    {
      "nom": "PDF",
      "typeMime": {
        "type": "application",
        "subType": "PDF"
      },
      "statutRepresentation": {
        "verbatim": true,
        "canonique": true,
        "officielle": true,
        "transcription": false,
        "enregistrement": false
      },
      "contenu": {
        "documentURI": "/15/amendements/2187/CSBIOETH/1851.pdf"
      }
    }
  ],
  "sort": {
    "dateSaisie": "2019-09-13T22:27:19.000+02:00",
    "sortEnSeance": "Non soutenu"
  },
  "dateDepot": "2019-09-05T02:00:00.000+02:00",
  "dateDistribution": "2019-09-11T02:00:00.000+02:00",
  "article99": "0",
  "loiReference": {}
}