{
  "uid": "AMANR5L15PO59051B1785P0D1N172",
  "identifiant": {
    "legislature": "15",
    "numero": "172",
    "numRect": "0",
    "saisine": {
      "texteLegislatifRef": "PIONANR5L15B1785",
      "numeroPartiePLF": "0",
      "organeExamen": "PO59051",
      "mentionSecondeDeliberation": "0"
    }
  },
  "numeroLong": "CL172",
  "etapeTexte": "1ère lecture (1ère assemblée saisie)",
  "triAmendement": "oaaaaaaaaaaaaaaaaaaaaaaaaaaaaaaaaaaaaaaaaaaaaaaaaac",
  "cardinaliteAmdtMultiples": "1",
  "etat": "Discuté",
  "signataires": {
    "auteur": {
      "typeAuteur": "Depute",
      "acteurRef": "PA718868",
      "groupePolitiqueRef": "PO730958"
    },
    "cosignatairesRefs": [
      "PA721960",
      "PA721202",
      "PA719578",
      "PA722142",
      "PA720286",
      "PA719676",
      "PA720430",
      "PA720422",
      "PA721210",
      "PA720892",
      "PA2150",
      "PA588884",
      "PA720846",
      "PA721226",
      "PA718860",
      "PA721062",
      "PA718868"
    ],
    "texteAffichable": "M.&#160;Larive,  Mme&#160;Autain, M.&#160;Bernalicis, M.&#160;Coquerel, M.&#160;Corbi&#232;re, Mme&#160;Fiat, M.&#160;Lachaud, M.&#160;M&#233;lenchon, Mme&#160;Obono, Mme&#160;Panot, M.&#160;Prud&apos;homme, M.&#160;Quatennens, M.&#160;Ratenon, Mme&#160;Ressiguier, Mme&#160;Rubin, M.&#160;Ruffin et Mme&#160;Taurine"
  },
  "pointeurFragmentTexte": {
    "division": {
      "titre": "Article 7",
      "articleDesignationCourte": "APRÈS ART. 7",
      "type": "ARTICLE",
      "avantAApres": "Apres",
      "divisionRattachee": "APRÈS L'ARTICLE 7, insérer l'article suivant:",
      "articleAdditionnel": "1",
      "urlDivisionTexteVise": "/15/textes/1785.asp#D_Article_7"
    }
  },
  "corps": {
    "dispositif": "<p style=\"text-align: justify;\">&#171;&#160;Dans un d&#233;lai de deux mois &#224; compter de la promulgation de la pr&#233;sente loi, le Gouvernement remet au Parlement un rapport sur la Constitution d&#8217;un observatoire de la haine en ligne. Ce rapport peut en d&#233;finir les missions de pr&#233;vention et de pr&#233;conisations, et aussi la Constitution. Il s&#8217;attache &#224; ce que les associations qui luttent contre la cyberhaine ainsi que les utilisatrices et utilisateurs y soient repr&#233;sent&#233;&#183;e&#183;s.&#160;&#187;</p>",
    "exposeSommaire": "<p>Actuellement, ce sont les associations de lutte contre la cyberhaine et les utilisatrices et utilisateurs qui sont les seul&#183;e&#183;s sur lesquel&#183;le&#183;s reposent la r&#233;gulation sur internet. <br />Sans nier que l'autogestion fait partie de la philosophie premi&#232;re d'internet, il nous semble important de pouvoir b&#233;n&#233;ficier de donn&#233;es sur l'&#233;volution de la haine sur internet, d'un point de vue quantitatif et qualitatif. C'est pour cette raison que nous proposons, par cet amendement, la mise en place d'un observatoire de la haine sur internet, afin de comprendre les m&#233;canismes &#224; l'oeuvre dans les cyberagressions, qui op&#232;rent un miroir grossissant des discriminations qui sont faites dans la soci&#233;t&#233;, le plus souvent &#224; l'encontre des femmes, des personnes racis&#233;es et LGBTI.</p>"
  },
  "representations": [
    {
      "nom": "PDF",
      "typeMime": {
        "type": "application",
        "subType": "PDF"
      },
      "statutRepresentation": {
        "verbatim": true,
        "canonique": true,
        "officielle": true,
        "transcription": false,
        "enregistrement": false
      },
      "contenu": {
        "documentURI": "/15/amendements/1785/CION_LOIS/CL172.pdf"
      }
    }
  ],
  "sort": {
    "dateSaisie": "2019-06-19T19:14:24.000+02:00",
    "sortEnSeance": "Non soutenu"
  },
  "dateDepot": "2019-06-14T02:00:00.000+02:00",
  "dateDistribution": "2019-06-17T02:00:00.000+02:00",
  "article99": "0",
  "loiReference": {
    "codeLoi": "zzzz"
  }
}