{
  "uid": "AMANR5L15PO419604B0904P0D1N93",
  "identifiant": {
    "legislature": "15",
    "numero": "93",
    "numRect": "0",
    "saisine": {
      "texteLegislatifRef": "PRJLANR5L15B0904",
      "numeroPartiePLF": "0",
      "organeExamen": "PO419604",
      "mentionSecondeDeliberation": "0"
    }
  },
  "numeroLong": "AC93",
  "etapeTexte": "1ère lecture (1ère assemblée saisie)",
  "triAmendement": "bg",
  "cardinaliteAmdtMultiples": "1",
  "etat": "Discuté",
  "signataires": {
    "auteur": {
      "typeAuteur": "Depute",
      "acteurRef": "PA721218",
      "groupePolitiqueRef": "PO730964"
    },
    "cosignatairesRefs": [
      "PA721218"
    ],
    "texteAffichable": "Mme&#160;Charri&#232;re, rapporteure"
  },
  "pointeurFragmentTexte": {
    "division": {
      "titre": "Article 10",
      "articleDesignationCourte": "ART. 10",
      "type": "ARTICLE",
      "avantAApres": "A",
      "divisionRattachee": "ARTICLE 10",
      "urlDivisionTexteVise": "/15/textes/0904.asp#D_Article_10"
    },
    "alinea": {
      "avantAApres": "A",
      "numero": "2",
      "alineaDesignation": "Alinéa 2"
    }
  },
  "corps": {
    "dispositif": "<p style=\"text-align: justify;\">R&#233;diger ainsi l&#8217;alin&#233;a&#160;2&#160;:</p><p style=\"text-align: justify;\">&#171;&#160;1&#176;&#160;Au d&#233;but, sont ajout&#233;es deux phrases ainsi r&#233;dig&#233;es&#160;: &#171;&#160;La r&#233;gion organise des actions d&#8217;information sur les m&#233;tiers et les formations en direction des &#233;l&#232;ves et de leurs familles et des &#233;tudiants, notamment dans les &#233;tablissements scolaires. Lorsque ces actions ont lieu dans un &#233;tablissement scolaire, elles sont organis&#233;es en coordination avec les psychologues de l&#8217;&#201;ducation nationale et les enseignants volontaires et form&#233;s &#224; cet effet.&#160;&#187;&#160;;&#160;&#187;.</p>",
    "exposeSommaire": "<p style=\"text-align: justify;\">Cet amendement vise &#224; pr&#233;voir que la r&#233;gion organise des actions d&#8217;information sur les m&#233;tiers et les formations, non seulement en direction des &#233;l&#232;ves, mais aussi de leurs familles.</p><p style=\"text-align: justify;\">Il pr&#233;voit &#233;galement que lorsque ces actions sont r&#233;alis&#233;es dans des &#233;tablissements scolaires, elles se d&#233;roulent en coordination avec les psychologues de l&#8217;&#201;ducation nationale et les enseignants volontaires et form&#233;s &#224; cet effet. Il s&#8217;agit de de garantir un accompagnement individualis&#233; des &#233;l&#232;ves afin de compl&#233;ter l&#8217;information re&#231;ue sur les m&#233;tiers et les formations. &#192; cet &#233;gard, il pourrait &#234;tre utile de renforcer la formation des enseignants en mati&#232;re d&#8217;orientation au sein des &#233;coles sup&#233;rieures du professorat et de l&#8217;&#233;ducation et des dispositifs de formation continue.</p>"
  },
  "representations": [
    {
      "nom": "PDF",
      "typeMime": {
        "type": "application",
        "subType": "PDF"
      },
      "statutRepresentation": {
        "verbatim": true,
        "canonique": true,
        "officielle": true,
        "transcription": false,
        "enregistrement": false
      },
      "contenu": {
        "documentURI": "/15/amendements/0904/CION-CEDU/AC93.pdf"
      }
    }
  ],
  "sort": {
    "dateSaisie": "2018-05-23T11:04:15.000+02:00",
    "sortEnSeance": "Adopté"
  },
  "dateDepot": "2018-05-21T02:00:00.000+02:00",
  "dateDistribution": "2018-05-22T02:00:00.000+02:00",
  "article99": "0",
  "loiReference": {
    "divisionCodeLoi": "0"
  }
}