{
  "uid": "AMANR5L15PO59048B1255P1D1N1177",
  "identifiant": {
    "legislature": "15",
    "numero": "1177",
    "numRect": "0",
    "saisine": {
      "texteLegislatifRef": "PRJLANR5L15B1255",
      "numeroPartiePLF": "1",
      "organeExamen": "PO59048",
      "mentionSecondeDeliberation": "0"
    }
  },
  "numeroLong": "I-CF1177",
  "etapeTexte": "1ère lecture (1ère assemblée saisie)",
  "triAmendement": "kaaaaaaaaaaaaaaaaaaaaaaaaaaaaaaaaaaaaaaaaaaaaaaaaalee",
  "cardinaliteAmdtMultiples": "1",
  "etat": "Discuté",
  "signataires": {
    "auteur": {
      "typeAuteur": "Depute",
      "acteurRef": "PA718962",
      "groupePolitiqueRef": "PO730964"
    },
    "cosignatairesRefs": [
      "PA718962",
      "PA720054",
      "PA609520",
      "PA721876",
      "PA720278"
    ],
    "texteAffichable": "M.&#160;Zulesi,  Mme&#160;Pompili, M.&#160;Morenas, M.&#160;Orphelin et M.&#160;Haury"
  },
  "pointeurFragmentTexte": {
    "division": {
      "titre": "Article 29",
      "articleDesignationCourte": "ART. 29",
      "type": "ARTICLE",
      "avantAApres": "A",
      "divisionRattachee": "ARTICLE 29",
      "urlDivisionTexteVise": "/15/textes/1255A.asp#D_Article_29"
    },
    "alinea": {
      "avantAApres": "Apres",
      "numero": "4"
    }
  },
  "corps": {
    "dispositif": "<p style=\"text-align: justify;\">I.&#160;&#8211;&#160;Apr&#232;s l&#8217;alin&#233;a&#160;4, ins&#233;rer l&#8217;alin&#233;a suivant&#160;:</p><p style=\"text-align: justify;\">&#171;&#160;2&#176;&#160;<i>bis&#160;</i>&#192; la quatri&#232;me ligne, colonne C, le montant&#160;: &#171;&#160;2&#160;105&#160;000&#160;&#187; est remplac&#233; par le montant&#160;: &#171;&#160;2&#160;535&#160;473&#160;&#187;.&#160;&#187;</p><p style=\"text-align: justify;\">II.&#160;&#8211;&#160;Compl&#233;ter cet article par l&#8217;alin&#233;a suivant&#160;:</p><p style=\"text-align: justify;\">&#171;&#160;VII.&#160;&#8211;&#160;La perte de recettes pour l&#8217;&#201;tat est compens&#233;e, &#224; due concurrence, par la cr&#233;ation d&#8217;une taxe additionnelle aux droits pr&#233;vus aux articles 575 et 575 A du code g&#233;n&#233;ral des imp&#244;ts.&#160;&#187;</p>",
    "exposeSommaire": "<p style=\"text-align: justify;\">Le gouvernement a pris des engagements le 28 ao&#251;t 2018 visant &#224; r&#233;duire le montant des redevances cyn&#233;g&#233;tiques. Concr&#232;tement il s&#8217;agit de r&#233;duire le co&#251;t du permis de chasse.</p><p style=\"text-align: justify;\">Pour cela l&#8217;article&#160;75 du projet de loi de finances pour 2019 (PLF pour 2019) pr&#233;voit une modification de l&#8217;article L.&#160;423&#8209;21&#8209;1 du Code de l&#8217;environnement qui fixe le montant des redevances cyn&#233;g&#233;tiques. Concr&#232;tement le gouvernement propose de baisser en moyenne de 20,45&#160;% les redevances qui se rapportent &#224; la chasse.</p><p style=\"text-align: justify;\">Afin de compenser la r&#233;duction de ces redevances le gouvernement propose, au m&#234;me article, de p&#233;renniser la contribution financi&#232;re apport&#233;e au budget de l&#8217;Office National de la Chasse et de la Faune Sauvage (ONCFS), alors m&#234;me que les dispositions actuelles pr&#233;voient ce versement jusqu&#8217;en 2018. De mani&#232;re plus simple le gouvernement pr&#233;voit d&#8217;assurer le financement de l&#8217;ONCFS par les agences de l&#8217;eau.</p><p style=\"text-align: justify;\">Pourtant les Agences de l&#8217;eau n&#8217;ont pas vocation &#224; compenser la r&#233;duction du co&#251;t du permis de chasse. Dans ces circonstances, les Agences de l&#8217;eau seront dans l&#8217;obligation de r&#233;duire leurs investissements alors m&#234;me que la France est loin d&#8217;atteindre son objectif de 100&#160;% &#171;&#160;de bon &#233;tat des eaux&#160;&#187; d&#8217;ici 2027, et que les nouvelles r&#232;gles en mati&#232;re d&#8217;eau et assainissement adopt&#233;es cette ann&#233;e appellent &#224; de nouveaux investissements de la part des agences.</p><p style=\"text-align: justify;\">D&#233;j&#224; lors de l&#8217;examen du PLF 2018 les pr&#233;sidents des comit&#233;s de bassin estimaient qu&#8217;en l&#8217;&#233;tat du budget &#171;&#160;400 millions d&#8217;euros par an au total&#160;&#187;&#160;viendraient &#224; manquer.</p><p style=\"text-align: justify;\">Afin de compenser la nouvelle ponction sur le budget des agences de l&#8217;eau, il est donc propos&#233; de rehausser le plafond mordant &#224; hauteur de la baisse moyenne des redevances cyn&#233;g&#233;tiques. Concr&#232;tement il s&#8217;agit de relever le plafond au-dessus duquel les recettes per&#231;ues par les agences de l&#8217;eau sont revers&#233;e au budget g&#233;n&#233;ral d&#8217;un montant de 20,45&#160;%, et ainsi pr&#233;server le budget des agences de l&#8217;eau pour leur garantir les ressources n&#233;cessaires &#224; la r&#233;alisation de leurs missions.</p><p style=\"text-align: justify;\">De cette mani&#232;re l&#8217;amendement ne remet pas en cause le m&#233;canisme de plafond mordant propos&#233; par le gouvernement. Il permettrait en revanche de compenser de mani&#232;re &#233;quitable la contribution des Agences de l&#8217;Eau au budget de l&#8217;ONCFS, et ainsi assurer que la fiscalit&#233; environnementale soit pleinement utilis&#233;e comme un levier au service de la transition &#233;cologique et participe aux objectifs ambitieux de la France en mati&#232;re de d&#233;veloppement durable.</p>"
  },
  "representations": [
    {
      "nom": "PDF",
      "typeMime": {
        "type": "application",
        "subType": "PDF"
      },
      "statutRepresentation": {
        "verbatim": true,
        "canonique": true,
        "officielle": true,
        "transcription": false,
        "enregistrement": false
      },
      "contenu": {
        "documentURI": "/15/amendements/1255A/CION_FIN/CF1177.pdf"
      }
    }
  ],
  "sort": {
    "dateSaisie": "2018-10-11T12:04:12.000+02:00",
    "sortEnSeance": "Non soutenu"
  },
  "dateDepot": "2018-10-05T02:00:00.000+02:00",
  "dateDistribution": "2018-10-09T02:00:00.000+02:00",
  "article99": "0",
  "loiReference": {
    "codeLoi": "2535473"
  }
}