{
  "uid": "AMANR5L15PO766718B2187P0D1N2035",
  "identifiant": {
    "legislature": "15",
    "numero": "2035",
    "numRect": "0",
    "saisine": {
      "texteLegislatifRef": "PRJLANR5L15B2187",
      "numeroPartiePLF": "0",
      "organeExamen": "PO766718",
      "mentionSecondeDeliberation": "0"
    }
  },
  "numeroLong": "2035",
  "etapeTexte": "1ère lecture (1ère assemblée saisie)",
  "triAmendement": "apaaaaaaaaaaaaaaaaaaaaaaaaaaaaaaaaaaaaaaaaaaaaaaaakzzi",
  "cardinaliteAmdtMultiples": "1",
  "etat": "Discuté",
  "signataires": {
    "auteur": {
      "typeAuteur": "Depute",
      "acteurRef": "PA719154",
      "groupePolitiqueRef": "PO730964"
    },
    "cosignatairesRefs": [
      "PA720378",
      "PA719326",
      "PA719154",
      "PA719186"
    ],
    "texteAffichable": "M.&#160;Martin,  Mme&#160;Khattabi, M.&#160;Lioger et Mme&#160;Gipson"
  },
  "pointeurFragmentTexte": {
    "division": {
      "titre": "Article 4",
      "articleDesignationCourte": "ART. 4",
      "type": "ARTICLE",
      "avantAApres": "A",
      "divisionRattachee": "ARTICLE 4",
      "urlDivisionTexteVise": "/15/textes/2187.asp#D_Article_4"
    },
    "alinea": {
      "avantAApres": "Apres",
      "numero": "9"
    }
  },
  "corps": {
    "dispositif": "<p style=\"text-align: justify;\">Apr&#232;s l&#8217;article&#160;9, ins&#233;rer les deux alin&#233;as suivants&#160;:</p><p style=\"text-align: justify;\">&#171;&#160;II&#160;<i><i>bis</i>&#160;(nouveau)</i>.&#160;&#8211;&#160;Apr&#232;s l&#8217;article&#160;311&#8209;22 du code civil, ins&#233;rer un article&#160;311&#8209;20&#8209;1 ainsi r&#233;dig&#233;&#160;:</p><p style=\"text-align: justify;\">&#171;&#160;<i>Art.&#160;L.&#160;311&#8209;22&#8209;1.&#160;</i>&#8211;&#160;La femme c&#233;libataire qui, pour procr&#233;er, a eu recours &#224; une assistance m&#233;dicale &#224; la procr&#233;ation n&#233;cessitant l&#8217;intervention d&#8217;un tiers donneur peut signer devant le notaire un consentement au don, sous r&#233;serve de la production de preuves justificatives du recours &#224; une assistance m&#233;dicale &#224; la procr&#233;ation en France ou &#224; l&#8217;&#233;tranger la mentionnant seule. La liste des preuves est fix&#233;e par d&#233;cret pris en Conseil d&#8217;&#201;tat.&#160;&#187;&#160;&#187;</p>",
    "exposeSommaire": "<p>L&#8217;objectif de cet amendement est de permettre aux femmes c&#233;libataires ayant eu recours seules avant la pr&#233;sente loi &#224; une assistance m&#233;dicale &#224; la procr&#233;ation (AMP) de r&#233;aliser chez le notaire un consentement au don a posteriori en pr&#233;sentant des pi&#232;ces justifiant qu&#8217;elles ont eu recours seules &#224; une AMP avec don.</p>"
  },
  "representations": [
    {
      "nom": "PDF",
      "typeMime": {
        "type": "application",
        "subType": "PDF"
      },
      "statutRepresentation": {
        "verbatim": true,
        "canonique": true,
        "officielle": true,
        "transcription": false,
        "enregistrement": false
      },
      "contenu": {
        "documentURI": "/15/amendements/2187/CSBIOETH/2035.pdf"
      }
    }
  ],
  "sort": {
    "dateSaisie": "2019-09-13T00:07:49.000+02:00",
    "sortEnSeance": "Tombé"
  },
  "dateDepot": "2019-09-05T02:00:00.000+02:00",
  "dateDistribution": "2019-09-10T02:00:00.000+02:00",
  "article99": "0",
  "loiReference": {}
}