{
  "uid": "AMANR5L15SEA717460BTC1761P0D1N747",
  "identifiant": {
    "legislature": "15",
    "numero": "747",
    "numRect": "0",
    "saisine": {
      "texteLegislatifRef": "PRJLANR5L15BTC1761",
      "numeroPartiePLF": "0",
      "organeExamen": "PO717460",
      "mentionSecondeDeliberation": "0"
    }
  },
  "numeroLong": "747",
  "etapeTexte": "Nouvelle Lecture",
  "triAmendement": "aakaaaaaaaaaaaaaaaaaaaaaaaaaaaaaaaaaaaaaaaaaaaaaaakaknzi",
  "cardinaliteAmdtMultiples": "1",
  "etat": "Discuté",
  "signataires": {
    "auteur": {
      "typeAuteur": "Depute",
      "acteurRef": "PA608016",
      "groupePolitiqueRef": "PO730934"
    },
    "cosignatairesRefs": [
      "PA642847",
      "PA332523",
      "PA709315",
      "PA720644",
      "PA721474",
      "PA608016"
    ],
    "texteAffichable": "Mme&#160;Louwagie,  M.&#160;Bazin, M.&#160;Viry, Mme&#160;Dalloz, M.&#160;Nury et M.&#160;Viala"
  },
  "pointeurFragmentTexte": {
    "division": {
      "titre": "Article 2",
      "articleDesignationCourte": "ART. 2",
      "type": "ARTICLE",
      "avantAApres": "A",
      "divisionRattachee": "ARTICLE 2",
      "urlDivisionTexteVise": "/15/textes/1761.asp#D_Article_2"
    },
    "alinea": {
      "avantAApres": "A",
      "numero": "1",
      "alineaDesignation": "Alinéa 1"
    }
  },
  "corps": {
    "dispositif": "<p style=\"text-align: justify;\">&#192; l&#8217;alin&#233;a&#160;1, substituer au mot&#160;:&#160;</p><p style=\"text-align: justify;\">&#171;&#160;vingt-quatre&#160;&#187;,</p><p style=\"text-align: justify;\">le mot&#160;:&#160;</p><p style=\"text-align: justify;\">&#171;&#160;dix-huit&#160;&#187;.</p>",
    "exposeSommaire": "<p style=\"text-align: justify;\">Compte tenu des enjeux sensibles que rev&#234;t la simplification des proc&#233;dures en termes de co&#251;t, de comp&#233;titivit&#233;, rentabilit&#233; et d&#8217;efficacit&#233;, compte tenu du temps incompressible li&#233; &#224; l&#8217;examen par les assembl&#233;es et la promulgation du texte, de la n&#233;cessaire ratification parlementaire des ordonnances &#224; venir et de l&#8217;urgence &#224; agir, compte tenu de l&#8217;ensemble des rapports et &#233;tudes d&#233;j&#224; disponibles sur le sujet, compte tenu des d&#233;lais plus courts pr&#233;vus dans d&#8217;autres articles du texte (article&#160;42), il convient de presser le Gouvernement de faire en sorte que ses administrations proc&#232;dent aux r&#233;formes n&#233;cessaires dans un d&#233;lai de dix-huit mois.</p>"
  },
  "representations": [
    {
      "nom": "PDF",
      "typeMime": {
        "type": "application",
        "subType": "PDF"
      },
      "statutRepresentation": {
        "verbatim": true,
        "canonique": true,
        "officielle": true,
        "transcription": false,
        "enregistrement": false
      },
      "contenu": {
        "documentURI": "/15/amendements/1761/AN/747.pdf"
      }
    }
  ],
  "seanceDiscussion": "RUANR5L15S2019IDS21546",
  "sort": {
    "dateSaisie": "2019-03-14T00:44:46.000+01:00",
    "sortEnSeance": "Rejeté"
  },
  "dateDepot": "2019-03-11T01:00:00.000+01:00",
  "dateDistribution": "2019-03-12T01:00:00.000+01:00",
  "article99": "0",
  "loiReference": {}
}