{
  "uid": "AMANR5L15PO420120B1297P0D1N55",
  "identifiant": {
    "legislature": "15",
    "numero": "55",
    "numRect": "0",
    "saisine": {
      "texteLegislatifRef": "PRJLANR5L15B1297",
      "numeroPartiePLF": "0",
      "organeExamen": "PO420120",
      "mentionSecondeDeliberation": "0"
    }
  },
  "numeroLong": "AS55",
  "etapeTexte": "1ère lecture (1ère assemblée saisie)",
  "triAmendement": "ipaaaaaaaaaaaaaaaaaaaaaaaaaaaaaaaaaaaaaaaaaaaaaaaaai",
  "cardinaliteAmdtMultiples": "1",
  "etat": "Irrecevable",
  "signataires": {
    "auteur": {
      "typeAuteur": "Depute",
      "acteurRef": "PA722022",
      "groupePolitiqueRef": "PO730964"
    },
    "cosignatairesRefs": [
      "PA606639",
      "PA721776",
      "PA722118",
      "PA719850",
      "PA722022",
      "PA719186",
      "PA719130",
      "PA718910",
      "PA721024",
      "PA720622",
      "PA719994",
      "PA718728",
      "PA718756",
      "PA720854",
      "PA720014"
    ],
    "texteAffichable": "Mme&#160;Romeiro Dias,  M.&#160;Test&#233;, Mme&#160;Motin, Mme&#160;Pitollat, M.&#160;Baich&#232;re, M.&#160;Vignal, Mme&#160;Kamowski, Mme&#160;Vanceunebrock-Mialon, Mme&#160;Bono-Vandorme, Mme&#160;Genetet, Mme&#160;Michel, Mme&#160;Bureau-Bonnard, Mme&#160;Khattabi, Mme&#160;Tiegna et Mme&#160;Sylla"
  },
  "pointeurFragmentTexte": {
    "division": {
      "titre": "Article 38",
      "articleDesignationCourte": "ART. 38",
      "type": "ARTICLE",
      "avantAApres": "A",
      "divisionRattachee": "ARTICLE 38",
      "urlDivisionTexteVise": "/15/textes/1297.asp#D_Article_38"
    },
    "alinea": {
      "numero": "3"
    }
  },
  "corps": {
    "dispositif": "<p style=\"text-align: justify;\">Compl&#233;ter l&#8217;alin&#233;a&#160;3 par les mots et les phrases&#160;:</p><p style=\"text-align: justify;\">&#171;&#160;et aux jeux d&#8217;argent et de hasard.&#160;Ce fonds est financ&#233; par le produit des pr&#233;l&#232;vements sur les jeux, concours et paris pr&#233;vus aux articles L.&#160;137&#8209;20, L.&#160;137&#8209;21 et L.&#160;137&#8209;22 ainsi que les taxes pr&#233;vues aux articles 575 et 575 A du code g&#233;n&#233;ral des imp&#244;ts. Il est &#233;galement dot&#233; d&#8217;un montant correspondant au produit des amendes forfaitaires sanctionnant la consommation de cannabis, fix&#233; par arr&#234;t&#233;.&#160;&#187;</p>",
    "exposeSommaire": "<p style=\"text-align: justify;\">Cet amendement vise &#224; &#233;largir le p&#233;rim&#232;tre d&#8217;action du Fonds de lutte contre les addictions aux jeux d&#8217;argent et de hasard.</p><p style=\"text-align: justify;\">La pratique des jeux d&#8217;argent et de hasard est une habitude assez r&#233;pandue et bien ancr&#233;e dans notre pays, qu&#8217;il s&#8217;agisse de la loterie, des jeux de grattage, des paris hippiques, des paris sportifs, du poker ou encore des machines &#224; sous dans les casinos. Ainsi, plus de la moiti&#233; des adultes fran&#231;ais jouent au moins une fois par an &#224; l&#8217;un ou l&#8217;autre de ces jeux, chez les buralistes, dans les casinos, ou sur des sites internet. Pour la grande majorit&#233;, cette pratique dite &#171;&#160;sociale&#160;&#187; ou &#171;&#160;r&#233;cr&#233;ative&#160;&#187; demeure source de plaisir.</p><p style=\"text-align: justify;\">N&#233;anmoins, la pratique du jeu peut devenir excessive lorsqu&#8217;on retrouve le caract&#232;re compulsif de la conduite. La personne perd progressivement sa libert&#233; et se sent petit &#224; petit oblig&#233;e de retourner jouer.</p><p style=\"text-align: justify;\">Par ces aspects, le jeu pathologique pr&#233;sente des points communs avec d&#8217;autres troubles, li&#233;s &#224; l&#8217;utilisation de substances psychoactives&#160;: alcool, tabac, substances illicites ou certains m&#233;dicaments, ou &#224; d&#8217;autres addictions comme les achats compulsifs, les troubles du comportement alimentaire, l&#8217;addiction au sport, les d&#233;pendances sexuelles et affectives...</p><p style=\"text-align: justify;\">En 2010, une &#233;tude de l&#8217;Inpes et de l&#8217;Observatoire fran&#231;ais des drogues et toxicomanies estimait qu&#8217;il y avait, en France, 400&#160;000 joueurs &#224; risque et 200&#160;000 joueurs en situation de d&#233;pendance.</p><p style=\"text-align: justify;\">Le pr&#233;sent amendement vise donc &#224; &#233;largir le p&#233;rim&#232;tre d&#8217;intervention du Fonds de lutte contre les substances psychoactives &#224; la lutte contre l&#8217;addiction aux jeux d&#8217;argent et de hasard.</p>"
  },
  "representations": [
    {
      "nom": "PDF",
      "typeMime": {
        "type": "application",
        "subType": "PDF"
      },
      "statutRepresentation": {
        "verbatim": true,
        "canonique": true,
        "officielle": true,
        "transcription": false,
        "enregistrement": false
      },
      "contenu": {
        "documentURI": "/15/amendements/1297/CION-SOC/AS55.pdf"
      }
    }
  ],
  "dateDepot": "2018-10-11T02:00:00.000+02:00",
  "article99": "0",
  "loiReference": {}
}