{
  "uid": "AMANR5L15SEA717460BTC1629P0D1N434",
  "identifiant": {
    "legislature": "15",
    "numero": "434",
    "numRect": "0",
    "saisine": {
      "texteLegislatifRef": "PRJLANR5L15BTC1629",
      "numeroPartiePLF": "0",
      "organeExamen": "PO717460",
      "mentionSecondeDeliberation": "0"
    }
  },
  "numeroLong": "434",
  "etapeTexte": "1ère lecture (1ère assemblée saisie)",
  "triAmendement": "hoaaaaaaaaaaaaaaaaaaaaaaaaaaaaaaaaaaaaaaaaaaaaaaaabho",
  "cardinaliteAmdtMultiples": "1",
  "etat": "Retiré",
  "signataires": {
    "auteur": {
      "typeAuteur": "Depute",
      "acteurRef": "PA720846",
      "groupePolitiqueRef": "PO730958"
    },
    "cosignatairesRefs": [
      "PA721062",
      "PA720846",
      "PA718860",
      "PA721960",
      "PA720422",
      "PA720430",
      "PA719578",
      "PA2150",
      "PA718868",
      "PA588884",
      "PA722142",
      "PA720892",
      "PA721226",
      "PA720286",
      "PA721210",
      "PA721202",
      "PA719676"
    ],
    "texteAffichable": "M.&#160;Lachaud,  Mme&#160;Autain, M.&#160;Bernalicis, M.&#160;Coquerel, M.&#160;Corbi&#232;re, Mme&#160;Fiat, M.&#160;Larive, M.&#160;M&#233;lenchon, Mme&#160;Obono, Mme&#160;Panot, M.&#160;Prud&apos;homme, M.&#160;Quatennens, M.&#160;Ratenon, Mme&#160;Ressiguier, Mme&#160;Rubin, M.&#160;Ruffin et Mme&#160;Taurine"
  },
  "pointeurFragmentTexte": {
    "division": {
      "titre": "Article 12",
      "articleDesignationCourte": "APRÈS ART. 12",
      "type": "ARTICLE",
      "avantAApres": "Apres",
      "divisionRattachee": "APRÈS L'ARTICLE 12, insérer l'article suivant:",
      "articleAdditionnel": "1",
      "urlDivisionTexteVise": "/15/textes/1629.asp#D_Article_12"
    }
  },
  "corps": {
    "dispositif": "<p style=\"text-align: justify;\">&#192; la deuxi&#232;me phrase de l&#8217;avant-dernier alin&#233;a de l&#8217;article L.&#160;721&#8209;2 du code de l&#8217;&#233;ducation, apr&#232;s le mot&#160;: &#171;&#160;hommes,&#160;&#187; sont ins&#233;r&#233;s les mots&#160;: &#171;&#160;&#224; la d&#233;construction des st&#233;r&#233;otypes sexistes et racistes qui se structurent pendant l&#8217;enfance, &#224; la lutte contre les in&#233;galit&#233;s scolaires,&#160;et aux m&#233;thodes permettant d&#8217;apporter des solutions p&#233;dagogiques concr&#232;tes afin de pouvoir convenablement lutter contre ces in&#233;galit&#233;s,&#160;ainsi qu&#8217;un approfondissement sur les diff&#233;rentes formes d&#8217;accompagnement adapt&#233;es aux diff&#233;rentes situations de handicap et&#160;&#187;.</p>",
    "exposeSommaire": "<p style=\"text-align: justify;\">Par cet amendement, nous proposons d&#8217;&#233;largir le champ de formation des instituts nationaux sup&#233;rieurs du professorat et de l&#8217;&#233;ducation &#224; la lutte contre les in&#233;galit&#233;s scolaires, aux m&#233;thodes permettant d&#8217;apporter des solutions p&#233;dagogiques concr&#232;tes afin de pouvoir convenablement lutter contre ces in&#233;galit&#233;s, ainsi qu&#8217;un approfondissement sur les diff&#233;rentes formes d&#8217;accompagnement adapt&#233;es aux diff&#233;rentes situations de handicap et &#224; la d&#233;construction des st&#233;r&#233;otypes sexistes et racistes qui se structurent pendant l&#8217;enfance.</p><p style=\"text-align: justify;\">Aux termes de l&#8217;article L.&#160;111&#8209;1 du code de l&#8217;&#233;ducation&#160;: &#171;&#160;L&#8217;&#233;ducation est la premi&#232;re priorit&#233; nationale. Le service public de l&#8217;&#233;ducation [&#8230;] contribue &#224; l&#8217;&#233;galit&#233; des chances et &#224; lutter contre les in&#233;galit&#233;s sociales et territoriales en mati&#232;re de r&#233;ussite scolaire et &#233;ducative.&#160;&#187; Cette priorit&#233; de notre syst&#232;me &#233;ducatif doit &#234;tre partag&#233;e par le sommet de la structure administrative comme par tous ces agents &#224; qui il appartient de pr&#233;parer la r&#233;ussite de tous les &#233;l&#232;ves. Ainsi que le montrent les &#233;tudes les plus r&#233;centes, l&#8217;efficacit&#233; de la lutte contre les in&#233;galit&#233;s sociales dans l&#8217;&#233;ducation est optimale dans l&#8217;enseignement primaire et au coll&#232;ge. Pourtant, la formation des enseignants est r&#233;guli&#232;rement point&#233;e du doigt par les organisations syndicales qui d&#233;noncent la pauvret&#233; de leur contenu et leur manque de pertinence. Une formation initiale qui traiterait du probl&#232;me des in&#233;galit&#233;s scolaires et des risques de reproduction sociale par l&#8217;&#233;cole permettrait aux futurs enseignants d&#8217;avoir les outils les plus innovants pour les combattre.</p><p style=\"text-align: justify;\">Concernant les&#160;discriminations&#160;: alors que c&#8217;est &#224; l&#8217;&#233;cole, notamment pr&#233;&#233;l&#233;mentaire et primaire que se structurent les rapports de domination, il faut imp&#233;rativement que les professeur&#183;e&#183;s soient form&#233;&#183;e&#183;s &#224; les d&#233;tecter et &#224; avoir des solution de lutte contre ces ph&#233;nom&#232;nes.<br /> Loin d&#8217;&#234;tre anodine, une telle formation permettrait de lutter de fa&#231;on efficace et rapide contre les st&#233;r&#233;otypes sexistes, au moment m&#234;me de leur &#233;mergence.<br /> Par ailleurs, ces rapports peuvent se manifester avec beaucoup de violence &#224; l&#8217;adolescence, avec des situations de harc&#232;lement des jeunes filles, notamment. Les professeur&#183;e&#183;s, souvent non form&#233;&#183;e&#183;s sur la question, sont souvent pris au d&#233;pourvu, voire ne les d&#233;tectent pas.<br /> Il faut donc renforcer la formation des professeur&#183;e&#183;s sur ces questions, pour leur donner des outils utiles en la mati&#232;re.</p><p style=\"text-align: justify;\">Enfin, concernant les &#233;l&#232;ves en situation de handicap, le d&#233;bat est revenu r&#233;guli&#232;rement lors de cette session parlementaire&#160;: il est n&#233;cessaire que l&#8217;accompagnement des &#233;l&#232;ves en situation de handicap se fasse dans de meilleures conditions. Pour cela, il est essentiel de revoir le statut des accompagnant&#183;e&#183;s des &#233;l&#232;ves en situation de handicap - qui au demeurant devait figurer dans ce projet de loi et est introuvable - mais il faut aussi s&#8217;assurer que les professeur&#183;e&#183;s ont re&#231;u &#224; cet &#233;gard une formation solide. C&#8217;est pour cette raison que nous proposons de ne pas seulement d&#233;livrer une &#171;&#160;sensibilisation &#224; la scolarisation des enfants en situation de handicap&#160;&#187;, mais bien un approfondissement sur les accompagnements qui peuvent &#234;tre apport&#233;s aux &#233;l&#232;ves en situation de handicap par leurs professeurs.</p>",
    "cartoucheDelaiDepotDepasse": "Sous réserve de son traitement par les services de l'Assemblée nationale et de sa recevabilité"
  },
  "representations": [
    {
      "nom": "PDF",
      "typeMime": {
        "type": "application",
        "subType": "PDF"
      },
      "statutRepresentation": {
        "verbatim": true,
        "canonique": true,
        "officielle": true,
        "transcription": false,
        "enregistrement": false
      },
      "contenu": {
        "documentURI": "/15/amendements/1629/AN/434.pdf"
      }
    }
  ],
  "dateDepot": "2019-02-06T01:00:00.000+01:00",
  "article99": "0",
  "loiReference": {
    "codeLoi": "c éducation",
    "divisionCodeLoi": "L721-2"
  }
}