{
  "uid": "AMANR5L15SEA717460BTC1237P0D1N448",
  "identifiant": {
    "legislature": "15",
    "numero": "448",
    "numRect": "0",
    "saisine": {
      "texteLegislatifRef": "PRJLANR5L15BTC1237",
      "numeroPartiePLF": "0",
      "organeExamen": "PO717460",
      "mentionSecondeDeliberation": "0"
    }
  },
  "numeroLong": "448",
  "etapeTexte": "1ère lecture (1ère assemblée saisie)",
  "triAmendement": "cciaaaaaaaaaaaaaaaaaaaaaaaaaaaaaaaaaaaaaaaaaaaaaaabjzo",
  "cardinaliteAmdtMultiples": "1",
  "etat": "Discuté",
  "signataires": {
    "auteur": {
      "typeAuteur": "Depute",
      "acteurRef": "PA608016",
      "groupePolitiqueRef": "PO730934"
    },
    "cosignatairesRefs": [
      "PA608016",
      "PA334654",
      "PA332523",
      "PA718884",
      "PA1874",
      "PA721506",
      "PA718838",
      "PA721678",
      "PA709315",
      "PA721474",
      "PA330909",
      "PA719318",
      "PA2492",
      "PA1012",
      "PA721816",
      "PA642847",
      "PA346054",
      "PA267260",
      "PA346218",
      "PA721968",
      "PA606712",
      "PA608416",
      "PA340853",
      "PA334149",
      "PA2377",
      "PA266797",
      "PA267901",
      "PA267204",
      "PA1327",
      "PA336316",
      "PA609245",
      "PA720644",
      "PA720210"
    ],
    "texteAffichable": "Mme&#160;Louwagie,  M.&#160;Bazin, M.&#160;Masson, Mme&#160;Anthoine, Mme&#160;Bazin-Malgras, Mme&#160;Dalloz, M.&#160;Lurton, M.&#160;Fasquelle, Mme&#160;Kuster, M.&#160;Emmanuel&#160;Maquet, M.&#160;Kamardine, M.&#160;Straumann, M.&#160;Bouchet, M.&#160;Viala, M.&#160;Hetzel, M.&#160;Boucard, M.&#160;Descoeur, M.&#160;Forissier, M.&#160;Brun, Mme&#160;Lacroute, M.&#160;de la Verpilli&#232;re, M.&#160;Perrut, M.&#160;Sermier, M.&#160;Nury, M.&#160;Quentin, M.&#160;Vialay, M.&#160;Le Fur, M.&#160;Leclerc, M.&#160;Reda, M.&#160;Viry, Mme&#160;Beauvais, M.&#160;Gosselin et Mme&#160;Poletti"
  },
  "pointeurFragmentTexte": {
    "division": {
      "titre": "Article 21",
      "articleDesignationCourte": "ART. 21",
      "type": "ARTICLE",
      "avantAApres": "A",
      "divisionRattachee": "ARTICLE 21",
      "urlDivisionTexteVise": "/15/textes/1237.asp#D_Article_21"
    },
    "alinea": {
      "avantAApres": "Apres",
      "numero": "37"
    }
  },
  "corps": {
    "dispositif": "<p style=\"text-align: justify;\">Apr&#232;s l&#8217;alin&#233;a&#160;37, ins&#233;rer les deux alin&#233;as suivants&#160;:</p><p style=\"text-align: justify;\">&#171;&#160;9&#176;&#160;L&#8217;article L.&#160;310&#8209;3&#8209;2 est compl&#233;t&#233; par un alin&#233;a ainsi r&#233;dig&#233;&#160;:</p><p style=\"text-align: justify;\">&#171;&#160;Un d&#233;cret en Conseil d&#8217;&#201;tat pr&#233;cise la valeur maximum au bilan d&#8217;une entreprise d&#8217;assurance mentionn&#233;e au pr&#233;sent article de chacune des cat&#233;gories d&#8217;actifs &#233;num&#233;r&#233;es en repr&#233;sentation des engagements r&#233;glement&#233;s.&#160;&#187;</p>",
    "exposeSommaire": "<p style=\"text-align: justify;\">Le pr&#233;sent amendement a pour objet de red&#233;finir le quota maximum des cat&#233;gories d&#8217;actifs consid&#233;r&#233;es en repr&#233;sentation des engagements r&#233;glement&#233;s des entreprises d&#8217;assurance, afin de permettre d&#8217;accompagner un rehaussement du niveau des actifs repr&#233;sent&#233;s par des valeurs mobili&#232;res et titres assimil&#233;s pour encourager l&#8217;investissement en titres de PME et ETI.</p><p style=\"text-align: justify;\">Il fait, par ailleurs, &#233;cho &#224; la volont&#233; du gouvernement de revenir sur les cas de surtransposition du droit&#160;europ&#233;en dans les services financiers afin de renforcer l&#8217;attractivit&#233; de la place de Paris.</p>"
  },
  "representations": [
    {
      "nom": "PDF",
      "typeMime": {
        "type": "application",
        "subType": "PDF"
      },
      "statutRepresentation": {
        "verbatim": true,
        "canonique": true,
        "officielle": true,
        "transcription": false,
        "enregistrement": false
      },
      "contenu": {
        "documentURI": "/15/amendements/1237/AN/448.pdf"
      }
    }
  ],
  "seanceDiscussion": "RUANR5L15S2018IDS21254",
  "sort": {
    "dateSaisie": "2018-09-28T18:46:35.000+02:00",
    "sortEnSeance": "Rejeté"
  },
  "dateDepot": "2018-09-19T02:00:00.000+02:00",
  "dateDistribution": "2018-09-25T02:00:00.000+02:00",
  "article99": "0",
  "loiReference": {}
}