{
  "uid": "AMANR5L15PO419610B0846P0D1N1496",
  "identifiant": {
    "legislature": "15",
    "numero": "1496",
    "numRect": "0",
    "saisine": {
      "texteLegislatifRef": "PRJLANR5L15B0846",
      "numeroPartiePLF": "0",
      "organeExamen": "PO419610",
      "mentionSecondeDeliberation": "0"
    }
  },
  "numeroLong": "CE1496",
  "etapeTexte": "1ère lecture (1ère assemblée saisie)",
  "triAmendement": "pte",
  "cardinaliteAmdtMultiples": "1",
  "etat": "Discuté",
  "signataires": {
    "auteur": {
      "typeAuteur": "Depute",
      "acteurRef": "PA718756",
      "groupePolitiqueRef": "PO730964"
    },
    "cosignatairesRefs": [
      "PA718756"
    ],
    "texteAffichable": "Mme&#160;Bono-Vandorme"
  },
  "pointeurFragmentTexte": {
    "division": {
      "titre": "Article 29",
      "articleDesignationCourte": "ART. 29",
      "type": "ARTICLE",
      "avantAApres": "A",
      "divisionRattachee": "ARTICLE 29",
      "urlDivisionTexteVise": "/15/textes/0846.asp#D_Article_29"
    },
    "alinea": {
      "avantAApres": "Apres",
      "numero": "60"
    }
  },
  "corps": {
    "dispositif": "<p style=\"text-align: justify;\">Apr&#232;s l&#8217;alin&#233;a&#160;60, ins&#233;rer l&#8217;alin&#233;a suivant&#160;:</p><p style=\"text-align: justify;\">&#171;&#160;&#8211;&#160;est ajout&#233;e une phrase ainsi r&#233;dig&#233;e&#160;:&#160;&#171;&#160;Lorsque le logement a &#233;t&#233; achet&#233; en dessous du prix fix&#233; par les services des domaines, il doit constituer la r&#233;sidence principale de l&#8217;acqu&#233;reur pendant au moins cinq ans.&#160;&#187;&#160;;</p>",
    "exposeSommaire": "<p style=\"text-align: justify;\">Actuellement, le propri&#233;taire dispose de la possibilit&#233; de vendre un logement acquis aupr&#232;s d&#8217;un organisme social dans les cinq ans qui suivent son acquisition. Dans le cas o&#249; l&#8217;acqu&#233;reur a acquis son logement &#224; un prix inf&#233;rieur &#224; l&#8217;&#233;valuation faite par le service des domaines, il est tenu de verser &#224; l&#8217;organisme d&#8217;habitations &#224; loyer mod&#233;r&#233; une somme &#233;gale &#224; la diff&#233;rence entre le prix de vente et le prix de l&#8217;acquisition (article L443&#8209;12&#8209;1 du code de la construction et de l&#8217;habitation).</p><p style=\"text-align: justify;\">Lorsque le prix d&#8217;achat est bien en de&#231;&#224; du prix du march&#233; et dans un souci d&#8217;&#233;quit&#233; cet amendement vise &#224; diff&#233;rer toute transaction au del&#224; du d&#233;lai de cinq ans. Le logement doit par cons&#233;quent constituer la r&#233;sidence principale de son propri&#233;taire pendant une dur&#233;e minimale de cinq ans.</p>"
  },
  "representations": [
    {
      "nom": "PDF",
      "typeMime": {
        "type": "application",
        "subType": "PDF"
      },
      "statutRepresentation": {
        "verbatim": true,
        "canonique": true,
        "officielle": true,
        "transcription": false,
        "enregistrement": false
      },
      "contenu": {
        "documentURI": "/15/amendements/0846/CION-ECO/CE1496.pdf"
      }
    }
  ],
  "sort": {
    "dateSaisie": "2018-05-17T17:07:40.000+02:00",
    "sortEnSeance": "Non soutenu"
  },
  "dateDepot": "2018-05-09T02:00:00.000+02:00",
  "dateDistribution": "2018-05-14T02:00:00.000+02:00",
  "article99": "0",
  "loiReference": {}
}