{
  "uid": "AMANR5L15SEA717460BTC1761P0D1N848",
  "identifiant": {
    "legislature": "15",
    "numero": "848",
    "numRect": "0",
    "saisine": {
      "texteLegislatifRef": "PRJLANR5L15BTC1761",
      "numeroPartiePLF": "0",
      "organeExamen": "PO717460",
      "mentionSecondeDeliberation": "0"
    }
  },
  "numeroLong": "848",
  "etapeTexte": "Nouvelle Lecture",
  "triAmendement": "aesaaaaaaaaaaaaaaaaaaaaaaaaaaaaaaaaaaaaaaaaaaaaaaabbcdzs",
  "cardinaliteAmdtMultiples": "1",
  "etat": "Discuté",
  "signataires": {
    "auteur": {
      "typeAuteur": "Depute",
      "acteurRef": "PA608016",
      "groupePolitiqueRef": "PO730934"
    },
    "cosignatairesRefs": [
      "PA720644",
      "PA267204",
      "PA712015",
      "PA767",
      "PA267260",
      "PA721474",
      "PA642847",
      "PA332523",
      "PA609245",
      "PA608016",
      "PA330684"
    ],
    "texteAffichable": "Mme&#160;Louwagie,  M.&#160;Dive, M.&#160;Bazin, M.&#160;Viry, Mme&#160;Poletti, Mme&#160;Dalloz, M.&#160;Sermier, M.&#160;Cattin, Mme&#160;Lacroute, M.&#160;Nury et Mme&#160;Val&#233;rie&#160;Boyer"
  },
  "pointeurFragmentTexte": {
    "division": {
      "titre": "Article 6",
      "articleDesignationCourte": "ART. 6",
      "type": "ARTICLE",
      "avantAApres": "A",
      "divisionRattachee": "ARTICLE 6",
      "urlDivisionTexteVise": "/15/textes/1761.asp#D_Article_6"
    },
    "alinea": {
      "numero": "5"
    }
  },
  "corps": {
    "dispositif": "<p style=\"text-align: justify;\">&#192; l&#8217;alin&#233;a&#160;5, apr&#232;s le mot&#160;:</p><p style=\"text-align: justify;\">&#171;&#160;moyenne&#160;&#187;, </p><p style=\"text-align: justify;\">ins&#233;rer les mots&#160;:</p><p style=\"text-align: justify;\">&#171;&#160;, en ne tenant pas compte du mois de plus fort effectif, ni du mois de plus faible effectif&#160;&#187;.</p>",
    "exposeSommaire": "<p>Le pr&#233;sent amendement propose de ne pas prendre en compte le mois de plus fort effectif, ni le mois de plus faible effectif, pour ne pas tronquer l&#8217;effectif retenu d&#8217;une entreprise dont la saisonnalit&#233; de la main d&#8217;&#339;uvre serait tr&#232;s importante.</p>"
  },
  "representations": [
    {
      "nom": "PDF",
      "typeMime": {
        "type": "application",
        "subType": "PDF"
      },
      "statutRepresentation": {
        "verbatim": true,
        "canonique": true,
        "officielle": true,
        "transcription": false,
        "enregistrement": false
      },
      "contenu": {
        "documentURI": "/15/amendements/1761/AN/848.pdf"
      }
    }
  ],
  "seanceDiscussion": "RUANR5L15S2019IDS21551",
  "sort": {
    "dateSaisie": "2019-03-15T11:09:18.000+01:00",
    "sortEnSeance": "Rejeté"
  },
  "dateDepot": "2019-03-11T01:00:00.000+01:00",
  "dateDistribution": "2019-03-13T01:00:00.000+01:00",
  "article99": "0",
  "loiReference": {}
}