{
  "uid": "AMANR5L15SEA717460BTC1974P0D1N1360",
  "identifiant": {
    "legislature": "15",
    "numero": "1360",
    "numRect": "0",
    "saisine": {
      "texteLegislatifRef": "PRJLANR5L15BTC1974",
      "numeroPartiePLF": "0",
      "organeExamen": "PO717460",
      "mentionSecondeDeliberation": "0"
    }
  },
  "numeroLong": "1360",
  "etapeTexte": "1ère lecture (2ème assemblée saisie)",
  "triAmendement": "elaaaaaaaaaaaaaaaaaaaaaaaaaaaaaaaaaaaaaaaaaaaaaaaaoeeyo",
  "cardinaliteAmdtMultiples": "1",
  "etat": "Discuté",
  "signataires": {
    "auteur": {
      "typeAuteur": "Depute",
      "acteurRef": "PA721860",
      "groupePolitiqueRef": "PO730964"
    },
    "cosignatairesRefs": [
      "PA720170",
      "PA721844",
      "PA719540",
      "PA719130",
      "PA719230",
      "PA606639",
      "PA719024",
      "PA720298",
      "PA722000",
      "PA721860",
      "PA718910",
      "PA720074",
      "PA722336",
      "PA720900",
      "PA720538",
      "PA720790",
      "PA718756",
      "PA722134",
      "PA722008",
      "PA718744",
      "PA720378"
    ],
    "texteAffichable": "M.&#160;Cesarini,  M.&#160;Vignal, Mme&#160;Bono-Vandorme, M.&#160;Blanchet, Mme&#160;Bagarry, Mme&#160;Pitollat, M.&#160;Fi&#233;vet, Mme&#160;Leguille-Balloy, Mme&#160;Rilhac, Mme&#160;Toutut-Picard, M.&#160;Buchou, M.&#160;Lioger, M.&#160;Grau, Mme&#160;Grandjean, M.&#160;Kerlogot, Mme&#160;Cariou, Mme&#160;Janvier, Mme&#160;De Temmerman, M.&#160;Thi&#233;baut, Mme&#160;Michel et Mme&#160;Piron"
  },
  "pointeurFragmentTexte": {
    "division": {
      "titre": "Article 26",
      "articleDesignationCourte": "ART. 26",
      "type": "ARTICLE",
      "avantAApres": "A",
      "divisionRattachee": "ARTICLE 26",
      "urlDivisionTexteVise": "/15/textes/1974.asp#D_Article_26"
    },
    "alinea": {
      "numero": "8"
    }
  },
  "corps": {
    "dispositif": "<p style=\"text-align: justify;\">Compl&#233;ter l&#8217;alin&#233;a&#160;8 par les mots&#160;:</p><p style=\"text-align: justify;\">&#171;&#160;, uniquement pour les v&#233;hicules de moins de sept chevaux-fiscaux&#160;&#187;.</p>",
    "exposeSommaire": "<p style=\"text-align: justify;\">L&#8217;article&#160;26 vise &#224; inciter au covoiturage par l&#8217;attribution d&#8217;une prime de 400&#160;euros pour un v&#233;hicule propre et 200&#160;euros pour les autres v&#233;hicules. Or la fiscalit&#233; incitative doit pousser &#224; changer les comportements&#160;: il faut covoiturer mais il faut le faire dans des v&#233;hicules les moins polluants possibles. En l&#8217;&#233;tat actuel de r&#233;daction la prime concernera aussi les personnes covoiturant avec des v&#233;hicules polluants de type SUV ou 4x4. L&#8217;amendement propose de d&#233;dier cette prime aux v&#233;hicules de moins de&#160;7 chevaux-fiscaux.</p>"
  },
  "representations": [
    {
      "nom": "PDF",
      "typeMime": {
        "type": "application",
        "subType": "PDF"
      },
      "statutRepresentation": {
        "verbatim": true,
        "canonique": true,
        "officielle": true,
        "transcription": false,
        "enregistrement": false
      },
      "contenu": {
        "documentURI": "/15/amendements/1974/AN/1360.pdf"
      }
    }
  ],
  "seanceDiscussion": "RUANR5L15S2019IDS21695",
  "sort": {
    "dateSaisie": "2019-06-11T23:27:27.000+02:00",
    "sortEnSeance": "Tombé"
  },
  "dateDepot": "2019-05-29T02:00:00.000+02:00",
  "dateDistribution": "2019-06-04T02:00:00.000+02:00",
  "article99": "0",
  "loiReference": {}
}