{
  "uid": "AMANR5L15SEA717460BTC0105P0D1N343",
  "identifiant": {
    "legislature": "15",
    "numero": "343",
    "numRect": "0",
    "saisine": {
      "texteLegislatifRef": "PRJLANR5L15BTC0105",
      "numeroPartiePLF": "0",
      "organeExamen": "PO717460",
      "mentionSecondeDeliberation": "0"
    }
  },
  "numeroLong": "343",
  "etapeTexte": "1ère lecture (2ème assemblée saisie)",
  "triAmendement": "ahzzzzzzzzzo",
  "cardinaliteAmdtMultiples": "1",
  "etat": "Discuté",
  "signataires": {
    "auteur": {
      "typeAuteur": "Depute",
      "acteurRef": "PA267440",
      "groupePolitiqueRef": "PO730934"
    },
    "cosignatairesRefs": [
      "PA267440"
    ],
    "texteAffichable": "M.&#160;Diard"
  },
  "pointeurFragmentTexte": {
    "division": {
      "titre": "Article 9",
      "articleDesignationCourte": "ART. 9",
      "type": "ARTICLE",
      "avantAApres": "A",
      "divisionRattachee": "ARTICLE 9",
      "urlDivisionTexteVise": "/15/textes/0105.asp#D_Article_9"
    }
  },
  "corps": {
    "dispositif": "<p>Supprimer cet article.</p>",
    "exposeSommaire": "<p>Le pr&#233;sent projet de loi organique entend accroitre la confiance dans la vie publique, or, le l&#233;gislateur commettrait une erreur en pensant que supprimer la \"r&#233;serve parlementaire\" mettrait fin &#224; une pratique contraire &#224; l'objectif de transparence et de bon usage des deniers publics. C'est en r&#233;alit&#233; tout l'inverse qu'il commettrait, puisqu'il laisserait au seul pouvoir ex&#233;cutif la possibilit&#233; de financer des projets locaux d'int&#233;r&#234;t public.</p><p>Tous les projets peuvent trouver une oreille attentive pour r&#233;pondre &#224; leurs sollicitations. Des d&#233;put&#233;s de la majorit&#233;, comme de l'opposition, ont la possibilit&#233; de participer indirectement, par ce dispositif, et de mani&#232;re plafonn&#233;e, au d&#233;veloppement de projets dont ils estiment qu'ils r&#233;pondent &#224; l'int&#233;r&#234;t g&#233;n&#233;ral. En supprimant cette r&#233;serve parlementaire, tout en maintenant les r&#233;serves minist&#233;rielles et pr&#233;sidentielles, la majorit&#233; enverrait comme signal la fin de cette gestion par l'ensemble des parlementaires de la r&#233;serve, en d&#233;l&#233;guant exclusivement sa gestion par la majorit&#233;, ce qui est contraire &#224; l'esprit de la loi dont nous d&#233;battons actuellement.</p><p>Si l'ancrage local des parlementaires ne peut &#233;videmment pas se r&#233;sumer &#224; l'octroi de la r&#233;serve parlementaire, il permet, en revanche, de d&#233;terminer mieux que les ministres, en charge de responsabilit&#233;s nationales, quels projets n&#233;cessitent cette aide d&#8217;&#201;tat.</p><p>Supprimer la r&#233;serve parlementaire, c'est annihiler de mani&#232;re m&#233;canique des subventions aux communes, qui ont &#233;t&#233; de 83 millions d'euros en 2016.</p><p>De plus, la r&#233;serve parlementaire est une v&#233;ritable bouff&#233;e d'oxyg&#232;ne pour les associations qui ont vu, ces derni&#232;res ann&#233;es, les subventions &#233;manant des collectivit&#233;s territoriales se r&#233;duire compte tenu de la baisse des dotations.</p><p>Pour les petites communes, la r&#233;serve parlementaire permettrait de r&#233;aliser des investissements que l&#8217;&#201;tat ne leur permettrait pas. Elle permet &#233;galement de se substituer aux subventions, en baisse, des petites communes aux associations, qui vont chercher dans ces lignes budg&#233;taires l'argent manquant pour les projets municipaux. Ainsi, la r&#233;serve parlementaire permet de compenser l'in&#233;galit&#233; subie par les associations selon qu'elles se situent dans une petite ou une grande commune, ou selon que leur commune soit riche ou pauvre. Cette r&#233;alit&#233; du terrain, seul le parlementaire, &#233;lu dans une circonscription &#224; taille humaine, peut en rendre compte au sein de cette Assembl&#233;e.</p><p>Des r&#232;gles r&#233;gissent d&#233;j&#224; l'attribution de la r&#233;serve parlementaire aux collectivit&#233;s locales et aux associations, dont les assembl&#233;es effectuent d&#233;j&#224; un contr&#244;le souverain mais rigoureux pour s'assurer du bienfond&#233; de la r&#233;serve octroy&#233;e.</p><p>Enfin, l'attribution de la r&#233;serve parlementaire est on ne peut plus transparente : elle est r&#233;guli&#232;rement publi&#233;e par les soins de l'Assembl&#233;e nationale, notamment sur son site internet.</p><p>Il est vital pour les communes et le tissu associatif et social fran&#231;ais de maintenir ce dispositif. Il est donc demand&#233; &#224; la nouvelle majorit&#233; de lui laisser une chance, au moins le temps pour elle de constater son utilit&#233;, ses modalit&#233;s impartiales de mise en place et de contr&#244;le, et la transparence de ce dispositif. C'est pourquoi cet amendement demande la suppression de cet article.</p>"
  },
  "representations": [
    {
      "nom": "PDF",
      "typeMime": {
        "type": "application",
        "subType": "PDF"
      },
      "statutRepresentation": {
        "verbatim": true,
        "canonique": true,
        "officielle": true,
        "transcription": false,
        "enregistrement": false
      },
      "contenu": {
        "documentURI": "/15/amendements/0105/AN/343.pdf"
      }
    }
  ],
  "seanceDiscussion": "RUANR5L15S2017IDS20662",
  "sort": {
    "dateSaisie": "2017-07-28T18:29:15.000+02:00",
    "sortEnSeance": "Rejeté"
  },
  "dateDepot": "2017-07-21T02:00:00.000+02:00",
  "dateDistribution": "2017-07-25T02:00:00.000+02:00",
  "article99": "0",
  "loiReference": {}
}