{
  "uid": "AMANR5L15SEA717460BTC0902P0D1N127",
  "identifiant": {
    "legislature": "15",
    "numero": "127",
    "numRect": "0",
    "saisine": {
      "texteLegislatifRef": "PRJLANR5L15BTC0902",
      "numeroPartiePLF": "0",
      "organeExamen": "PO717460",
      "mentionSecondeDeliberation": "0"
    }
  },
  "numeroLong": "127",
  "etapeTexte": "1ère lecture (1ère assemblée saisie)",
  "triAmendement": "heu",
  "cardinaliteAmdtMultiples": "1",
  "etat": "Discuté",
  "signataires": {
    "auteur": {
      "typeAuteur": "Depute",
      "acteurRef": "PA334843",
      "groupePolitiqueRef": "PO730934"
    },
    "cosignatairesRefs": [
      "PA334843"
    ],
    "texteAffichable": "M.&#160;Verch&#232;re"
  },
  "pointeurFragmentTexte": {
    "division": {
      "titre": "Article 9",
      "articleDesignationCourte": "APRÈS ART. 9",
      "type": "ARTICLE",
      "avantAApres": "Apres",
      "divisionRattachee": "APRÈS L'ARTICLE 9, insérer l'article suivant:",
      "articleAdditionnel": "1",
      "urlDivisionTexteVise": "/15/textes/0902.asp#D_Article_9"
    }
  },
  "corps": {
    "dispositif": "<p style=\"text-align: justify;\">Apr&#232;s le premier alin&#233;a de l'article L.&#160;643&#8209;2 du code rural et de la p&#234;che maritime, il est ins&#233;r&#233; un alin&#233;a ainsi r&#233;dig&#233;&#160;:</p><p style=\"text-align: justify;\">&#171;&#160;Est interdite toute pratique commerciale qui consiste en la mise en avant d&#8217;un produit b&#233;n&#233;ficiant d&#8217;une appellation d&#8217;origine ou d&#8217;une indication g&#233;ographique, notamment dans le cadre d&#8217;offres promotionnelles, qui est susceptible d&#8217;avoir pour objet ou pour effet de d&#233;tourner ou d&#8217;affaiblir la notori&#233;t&#233; de ladite appellation ou ladite indication. Constitue, notamment, une telle pratique, la mise en avant exclusive ou cibl&#233;e d&#8217;un tel produit sur un support promotionnel, afin de faire b&#233;n&#233;ficier au point de vente de l&#8217;attractivit&#233; dudit produit.&#160;&#187;</p>",
    "exposeSommaire": "<p style=\"text-align: justify;\">La probl&#233;matique du &#171;&#160;cagnottage&#160;&#187; concerne particuli&#232;rement les entreprises de grande distribution, qui tirent avantage de la mise en avant de produits &#224; appellations d&#8217;origine contr&#244;l&#233;es dans le seul but de promouvoir leurs enseignes. Cela se mat&#233;rialise par exemple en mettant en &#233;vidence en couverture d&#8217;un catalogue des vins &#224; appellation d&#8217;origine en promotion de type &#171;&#160;deux bouteilles pour le prix d&#8217;une&#160;&#187;.</p><p style=\"text-align: justify;\">La r&#233;glementation applicable &#224; la protection des appellations d&#8217;origine ne permet pas de sanctionner ces comportements.</p><p style=\"text-align: justify;\">Ce type de pratiques va avoir deux effets n&#233;fastes pour les appellations d&#8217;origine contr&#244;l&#233;es.</p><p style=\"text-align: justify;\">D&#8217;une part, les prix pratiqu&#233;s par les enseignes de distribution entra&#238;nent une confusion de la perception des consommateurs sur le produit, car le consommateur ne va plus porter attention &#224; la valeur r&#233;elle du produit mais &#224; celui pratiqu&#233;.</p><p style=\"text-align: justify;\">D&#8217;autre part, cela porte une atteinte &#224; l&#8217;image et &#224; la notori&#233;t&#233; propre de l&#8217;appellation d&#8217;origine en cause. En pratiquant des prix sensiblement inf&#233;rieurs &#224; la valeur r&#233;elle des produits, l&#8217;image renvoy&#233;e n&#8217;est plus fid&#232;le &#224; la qualit&#233; du produit et nuit &#224; sa notori&#233;t&#233; &#224; terme.</p><p style=\"text-align: justify;\">Ces pratiques, nombreuses, mettent en &#233;vidence les lacunes de r&#232;gles relatives &#224; la protection des appellations contre le d&#233;tournement de leur notori&#233;t&#233; lorsqu&#8217;elles sont le fait des revendeurs.</p><p style=\"text-align: justify;\">L&#8217;appellation d&#8217;origine est garante d&#8217;une origine g&#233;ographique ainsi que d&#8217;une qualit&#233; particuli&#232;re du produit auquel elle est attach&#233;e. Parmi les conditions de reconnaissance d&#8217;une appellation d&#8217;origine, la notori&#233;t&#233; du produit doit &#234;tre au pr&#233;alable d&#251;ment &#233;tablie. Il en ressort que tout produit d&#8217;appellation d&#8217;origine est, par principe, notoirement connu. A ce titre, l&#8217;appellation d&#8217;origine doit b&#233;n&#233;ficier d&#8217;une large protection contre toute utilisation ou d&#233;tournement.</p><p style=\"text-align: justify;\">L&#8217;amendement vise &#224; interdire ce type de pratiques.</p>"
  },
  "representations": [
    {
      "nom": "PDF",
      "typeMime": {
        "type": "application",
        "subType": "PDF"
      },
      "statutRepresentation": {
        "verbatim": true,
        "canonique": true,
        "officielle": true,
        "transcription": false,
        "enregistrement": false
      },
      "contenu": {
        "documentURI": "/15/amendements/0902/AN/127.pdf"
      }
    }
  ],
  "seanceDiscussion": "RUANR5L15S2018IDS21055",
  "sort": {
    "dateSaisie": "2018-05-25T15:19:56.000+02:00",
    "sortEnSeance": "Non soutenu"
  },
  "dateDepot": "2018-04-27T02:00:00.000+02:00",
  "dateDistribution": "2018-05-21T02:00:00.000+02:00",
  "article99": "0",
  "loiReference": {
    "codeLoi": "c rural et pêche maritime",
    "divisionCodeLoi": "L643-2"
  }
}