{
  "uid": "AMANR5L15SEA717460B2296P0D1N1289",
  "identifiant": {
    "legislature": "15",
    "numero": "1289",
    "numRect": "0",
    "saisine": {
      "texteLegislatifRef": "PRJLANR5L15B2296",
      "numeroPartiePLF": "0",
      "organeExamen": "PO717460",
      "mentionSecondeDeliberation": "0"
    }
  },
  "numeroLong": "1289",
  "etapeTexte": "1ère lecture (1ère assemblée saisie)",
  "triAmendement": "ipaaaaaaaaaaaaaaaaaaaaaaaaaaaaaaaaaaaaaaaaaaaaaaaam",
  "cardinaliteAmdtMultiples": "1",
  "etat": "Retiré",
  "signataires": {
    "auteur": {
      "typeAuteur": "Depute",
      "acteurRef": "PA721816",
      "groupePolitiqueRef": "PO730934"
    },
    "cosignatairesRefs": [
      "PA721816"
    ],
    "texteAffichable": "M.&#160;Boucard"
  },
  "pointeurFragmentTexte": {
    "division": {
      "titre": "Article 42",
      "articleDesignationCourte": "APRÈS ART. 42",
      "type": "ARTICLE",
      "avantAApres": "Apres",
      "divisionRattachee": "APRÈS L'ARTICLE 42, insérer l'article suivant:",
      "articleAdditionnel": "1",
      "urlDivisionTexteVise": "/15/textes/2296.asp#D_Article_42"
    }
  },
  "corps": {},
  "representations": [
    {
      "nom": "PDF",
      "typeMime": {
        "type": "application",
        "subType": "PDF"
      },
      "statutRepresentation": {
        "verbatim": true,
        "canonique": true,
        "officielle": true,
        "transcription": false,
        "enregistrement": false
      },
      "contenu": {
        "documentURI": "/15/amendements/2296/AN/1289.pdf"
      }
    }
  ],
  "dateDepot": "2019-10-18T02:00:00.000+02:00",
  "dateDistribution": "2019-10-18T02:00:00.000+02:00",
  "article99": "0",
  "loiReference": {}
}