{
  "uid": "AMANR5L15SEA717460B1255P1D1N2419",
  "identifiant": {
    "legislature": "15",
    "numero": "2419",
    "numRect": "0",
    "saisine": {
      "texteLegislatifRef": "PRJLANR5L15B1255",
      "numeroPartiePLF": "1",
      "organeExamen": "PO717460",
      "mentionSecondeDeliberation": "0"
    }
  },
  "numeroLong": "I-2419",
  "etapeTexte": "1ère lecture (1ère assemblée saisie)",
  "triAmendement": "ataaaaaaaaaaaaaaaaaaaaaaaaaaaaaaaaaaaaaaaaaaaaaaaazzzzzzzzzx",
  "cardinaliteAmdtMultiples": "1",
  "etat": "Discuté",
  "signataires": {
    "auteur": {
      "typeAuteur": "Depute",
      "acteurRef": "PA718756",
      "groupePolitiqueRef": "PO730964"
    },
    "cosignatairesRefs": [
      "PA718756",
      "PA719778"
    ],
    "texteAffichable": "Mme&#160;Bono-Vandorme et M.&#160;Jolivet"
  },
  "pointeurFragmentTexte": {
    "division": {
      "titre": "Article 19",
      "articleDesignationCourte": "APRÈS ART. 19",
      "type": "ARTICLE",
      "avantAApres": "Apres",
      "divisionRattachee": "APRÈS L'ARTICLE 19, insérer l'article suivant:",
      "articleAdditionnel": "1",
      "urlDivisionTexteVise": "/15/textes/1255A.asp#D_Article_19"
    }
  },
  "corps": {
    "dispositif": "<p style=\"text-align: justify;\">I.&#160;&#8211;&#160;Apr&#232;s le troisi&#232;me alin&#233;a de l&#8217;article&#160;265 <i>nonies</i> du code des douanes il est ins&#233;r&#233; un alin&#233;a ainsi r&#233;dig&#233;&#160;:</p><p style=\"text-align: justify;\">&#171;&#160;Pour les personnes qui exploitent dans l&#8217;industrie agro-alimentaire des installations grandes consommatrices d&#8217;&#233;nergie au sens de l&#8217;article&#160;17 de la directive 2003/96/CE du Conseil, du 27 octobre 2003, pr&#233;cit&#233;e, sans que celles-ci soient soumises &#224; la directive 2003/87/CE du Parlement&#160;europ&#233;en et du Conseil, du 13 octobre 2003, pr&#233;cit&#233;e, et sans que celles-ci rel&#232;vent de la liste des secteurs et sous-secteurs consid&#233;r&#233;s comme expos&#233;s &#224; un risque important de fuite de carbone, &#233;tablie par la d&#233;cision 2014/746/UE de la Commission, du 27 octobre 2014, pr&#233;cit&#233;e, le tarif de la taxe int&#233;rieure de consommation applicable aux consommations de produits &#224; usage combustible effectu&#233;es pour les besoins de ces installations est celui qui leur est applicable &#224; la date du 31 d&#233;cembre 2014, major&#233;, s&#8217;agissant de la taxe mentionn&#233;e &#224; l&#8217;article&#160;266 <i>quinquies</i>, de 0,33&#160;&#8364; par m&#233;gawattheure en pouvoir calorifique sup&#233;rieur, &#224; la condition que le montant total des taxes &#233;nerg&#233;tiques nationales dues sur la consommation de gaz naturel soit d&#8217;au moins 0,5&#160;% de la valeur ajout&#233;e pour les installations concern&#233;es.&#160;&#187;</p><p style=\"text-align: justify;\">II.&#160;&#8211;&#160;La perte de recettes pour l&#8217;&#201;tat est compens&#233;e &#224; due concurrence par la cr&#233;ation d&#8217;une taxe additionnelle aux droits mentionn&#233;s aux articles 575 et 575 A du code g&#233;n&#233;ral des imp&#244;ts.</p>",
    "exposeSommaire": "<p style=\"text-align: justify;\">De nombreuses entreprises rurales du secteur agro-alimentaire sont aujourd&#8217;hui confront&#233;es &#224; une v&#233;ritable injustice. Grandes consommatrices d&#8217;&#233;nergie - &#224; l&#8217;instar de la sid&#233;rurgie, de la production d&#8217;ammoniac, d&#8217;acide nitrique, ou de chaux&#8230; - elles sont les seules &#224; devoir s&#8217;acquitter de la TICGN &#224; taux plein.</p><p style=\"text-align: justify;\">Elles se retrouvent ainsi p&#233;nalis&#233;es face &#224; leurs concurrents&#160;europ&#233;ens et mondiaux en termes financiers et en termes de fuite de carbone. Ces entreprises sont souvent structurantes pour des territoires ruraux et, au-del&#224; des emplois directs qu&#8217;elles g&#233;n&#232;rent. Elles constituent un d&#233;bouch&#233; indispensable pour les exploitants agricoles.</p><p style=\"text-align: justify;\">Elles ne peuvent pas b&#233;n&#233;ficier des r&#233;ductions fiscales pr&#233;vues par l&#8217;article&#160;265 nonies du code des douanes du fait des conditions d&#8217;inscription sur la liste&#160;europ&#233;enne que vise cet article. L&#8217;inscription sur cette liste n&#8217;est pas automatique et n&#233;cessite en effet la constitution d&#8217;un dossier technique impliquant une collaboration des entreprises du secteur &#224; l&#8217;&#233;chelle&#160;europ&#233;enne. Les m&#233;canismes de taxation sur le gaz diff&#233;rant d&#8217;un &#201;tat membre &#224; l&#8217;autre, cette collaboration n&#8217;est pas mise en &#339;uvre. De plus cela suppose des moyens en mati&#232;re de conseil juridique et de lobbying que n&#8217;ont pas, &#224; titre d&#8217;exemple, la plupart des entreprises du secteur de la d&#233;shydratation de l&#233;gumes ou d&#8217;herbes aromatiques.</p><p style=\"text-align: justify;\">Un exemple flagrant dans l&#8217;Aisne&#160;: une soci&#233;t&#233; productrice de l&#233;gumes d&#233;shydrat&#233;s dont le chiffre d&#8217;affaire s&#8217;&#233;l&#232;ve &#224; 130 millions d&#8217;euros, qui emploie 117 ETP en milieu rural et fait travailler plus de 75 agriculteurs locaux payait en 2014 95&#160;000&#160;&#8364; de TICGN et en 2017 395&#160;000&#160;&#8364;. Elle payera en 2018 567&#160;000&#160;&#8364; et 1,1 million en 2022.</p><p style=\"text-align: justify;\">Le droit&#160;europ&#233;en permet aux &#201;tats membres de pr&#233;voir des tarifs r&#233;duits de taxe sur les produits &#233;nerg&#233;tiques pour les entreprises grandes consommatrices d&#8217;&#233;nergie. Il permet d&#8217;appliquer ces tarifs r&#233;duits sur un p&#233;rim&#232;tre restreint, par exemple limit&#233; &#224; certains secteurs de l&#8217;&#233;conomie et c&#8217;est le choix qu&#8217;a fait la France. L&#8217;objectif de ces tarifs r&#233;duits consiste &#224; ne pas faire supporter &#224; ces acteurs &#233;conomiques les &#233;volutions de tarifs intervenues ces derni&#232;res ann&#233;es.</p><p style=\"text-align: justify;\">Pour tenir compte des sp&#233;cificit&#233;s du secteur et de son importance pour l&#8217;industrie nationale, l&#8217;amendement propos&#233; a pour objet d&#8217;exon&#233;rer de la majoration progressive de TICGN mise en &#339;uvre depuis 2014 au titre de la taxe carbone toutes les entreprises du secteur agro-alimentaire pour lesquelles les TIC repr&#233;sentent plus de 0,5&#160;% de la valeur ajout&#233;e.</p>"
  },
  "representations": [
    {
      "nom": "PDF",
      "typeMime": {
        "type": "application",
        "subType": "PDF"
      },
      "statutRepresentation": {
        "verbatim": true,
        "canonique": true,
        "officielle": true,
        "transcription": false,
        "enregistrement": false
      },
      "contenu": {
        "documentURI": "/15/amendements/1255A/AN/2419.pdf"
      }
    }
  ],
  "seanceDiscussion": "RUANR5L15S2019IDS21278",
  "sort": {
    "dateSaisie": "2018-10-18T10:12:15.000+02:00",
    "sortEnSeance": "Rejeté"
  },
  "dateDepot": "2018-10-11T02:00:00.000+02:00",
  "dateDistribution": "2018-10-15T02:00:00.000+02:00",
  "article99": "0",
  "loiReference": {
    "codeLoi": "c douanes",
    "divisionCodeLoi": "265 nonies"
  }
}