{
  "uid": "AMANR5L15PO59051B2357P0D1N723",
  "identifiant": {
    "legislature": "15",
    "numero": "723",
    "numRect": "0",
    "saisine": {
      "texteLegislatifRef": "PRJLANR5L15B2357",
      "numeroPartiePLF": "0",
      "organeExamen": "PO59051",
      "mentionSecondeDeliberation": "0"
    }
  },
  "numeroLong": "CL723",
  "etapeTexte": "1ère lecture (2ème assemblée saisie)",
  "triAmendement": "aaoaaaaaaaaaaaaaaaaaaaaaaaaaaaaaaaaaaaaaaaaaaaaaaablfx",
  "cardinaliteAmdtMultiples": "1",
  "etat": "Discuté",
  "signataires": {
    "auteur": {
      "typeAuteur": "Depute",
      "acteurRef": "PA266808",
      "groupePolitiqueRef": "PO730934"
    },
    "cosignatairesRefs": [
      "PA266808"
    ],
    "texteAffichable": "M.&#160;Rolland"
  },
  "pointeurFragmentTexte": {
    "division": {
      "titre": "Article PREMIER",
      "articleDesignationCourte": "ART. PREMIER",
      "type": "ARTICLE",
      "avantAApres": "A",
      "divisionRattachee": "ARTICLE PREMIER",
      "urlDivisionTexteVise": "/15/textes/2357.asp#D_Article_1er"
    },
    "alinea": {
      "avantAApres": "Apres",
      "numero": "13"
    }
  },
  "corps": {
    "dispositif": "<p style=\"text-align: justify;\">Apr&#232;s l&#8217;alin&#233;a&#160;13, ins&#233;rer l&#8217;alin&#233;a suivant&#160;:</p><p style=\"text-align: justify;\">&#171;&#160;7&#176;&#160;Les d&#233;lib&#233;rations qui doivent faire l&#8217;objet d&#8217;un vote &#224; bulletin secret.&#160;&#187;</p>",
    "exposeSommaire": "<p style=\"text-align: justify;\">Le pr&#233;sent amendement vise &#224; &#233;largir le contenu du pacte de gouvernance. Ce dernier devra ainsi&#160;d&#233;terminer le champ des d&#233;cisions qui devront faire l&#8217;objet d&#8217;un vote &#224; bulletin secret pour l&#8217;organe&#160;d&#233;lib&#233;rant d&#8217;un EPCI. Il appara&#238;t en effet n&#233;cessaire, dans certaines hypoth&#232;ses, de pr&#233;voir un vote &#224;<br />bulletin secret, notamment lorsque ledit organe d&#233;lib&#233;rant est amen&#233; &#224; se prononcer sur certaines&#160;questions int&#233;ressants l&#8217;intercommunalit&#233;.</p>"
  },
  "representations": [
    {
      "nom": "PDF",
      "typeMime": {
        "type": "application",
        "subType": "PDF"
      },
      "statutRepresentation": {
        "verbatim": true,
        "canonique": true,
        "officielle": true,
        "transcription": false,
        "enregistrement": false
      },
      "contenu": {
        "documentURI": "/15/amendements/2357/CION_LOIS/CL723.pdf"
      }
    }
  ],
  "sort": {
    "dateSaisie": "2019-11-06T10:14:12.000+01:00",
    "sortEnSeance": "Tombé"
  },
  "dateDepot": "2019-11-01T01:00:00.000+01:00",
  "dateDistribution": "2019-11-05T01:00:00.000+01:00",
  "article99": "0",
  "loiReference": {
    "codeLoi": "1 id"
  }
}