{
  "uid": "AMANR5L15SEA717460BTC1019P0D1N2224",
  "identifiant": {
    "legislature": "15",
    "numero": "2224",
    "numRect": "0",
    "saisine": {
      "texteLegislatifRef": "PRJLANR5L15BTC1019",
      "numeroPartiePLF": "0",
      "organeExamen": "PO717460",
      "mentionSecondeDeliberation": "0"
    }
  },
  "numeroLong": "2224",
  "etapeTexte": "1ère lecture (1ère assemblée saisie)",
  "triAmendement": "khyi",
  "cardinaliteAmdtMultiples": "1",
  "amendementParent": "AMANR5L15SEA717460BTC1019P0D1N1155",
  "etat": "Discuté",
  "signataires": {
    "auteur": {
      "typeAuteur": "Depute",
      "acteurRef": "PA720370",
      "groupePolitiqueRef": "PO730964"
    },
    "cosignatairesRefs": [
      "PA721860",
      "PA720370"
    ],
    "texteAffichable": "M.&#160;Mendes et M.&#160;Cesarini"
  },
  "pointeurFragmentTexte": {
    "division": {
      "titre": "Article 8",
      "articleDesignationCourte": "ART. 8",
      "type": "ARTICLE",
      "avantAApres": "A",
      "divisionRattachee": "ARTICLE 8",
      "urlDivisionTexteVise": "/15/textes/1019.asp#D_Article_8"
    },
    "alinea": {
      "avantAApres": "Apres",
      "numero": "49"
    }
  },
  "corps": {
    "dispositif": "<p style=\"text-align: justify;\">Compl&#233;ter la premi&#232;re phrase de l'alin&#233;a 2 par les mots :&#160;</p><p style=\"text-align: justify;\">&#171; ainsi que la possibilit&#233; d&#8217;ouvrir les formations en apprentissage aux actifs au ch&#244;mage ainsi qu&#8217;aux b&#233;n&#233;ficiaires du revenu de solidarit&#233; active sous condition d&#8217;inscription dans une formation d&#8217;apprentissage au sein d&#8217;un secteur en tension &#187;</p>",
    "exposeSommaire": "<p>Le manque de comp&#233;tences et l'inad&#233;quation entre l'offre et la demande des travailleurs p&#233;nalise fortement le march&#233; du travail, notamment face &#224; un grand nombre d&#8217;actifs ne disposant pas des comp&#233;tences n&#233;cessaires pour r&#233;pondre aux besoins des entreprises. <br />Permettre aux personnes se trouvant dans une situation de ch&#244;mage de courte ou de longue dur&#233;e ou qui souhaitent poursuivre une reconversion professionnelle, de conclure un contrat d&#8217;apprentissage leur permettant de r&#233;int&#233;grer le monde du travail ou d&#8217;acqu&#233;rir de nouvelles comp&#233;tences semble une mesure int&#233;ressante. Cette d&#233;rogation d&#8217;&#226;ge doit cependant &#234;tre conditionn&#233;e par une obligation de formation au sein d&#8217;un secteur en p&#233;nurie de main d&#8217;&#339;uvre (m&#233;tiers de l&#8217;industrie, du num&#233;rique de l&#8217;artisanat, h&#244;tellerie, restauration, b&#226;timent&#8230;) dans l&#8217;objectif de mieux r&#233;pondre aux besoins des entreprises. Par ailleurs, avant la g&#233;n&#233;ralisation d&#8217;un tel dispositif et afin de mesurer l&#8217;efficacit&#233; une exp&#233;rimentation limit&#233;e dans le temps semble n&#233;cessaire.</p>"
  },
  "representations": [
    {
      "nom": "PDF",
      "typeMime": {
        "type": "application",
        "subType": "PDF"
      },
      "statutRepresentation": {
        "verbatim": true,
        "canonique": true,
        "officielle": true,
        "transcription": false,
        "enregistrement": false
      },
      "contenu": {
        "documentURI": "/15/amendements/1019/AN/2224.pdf"
      }
    }
  ],
  "seanceDiscussion": "RUANR5L15S2018IDS21102",
  "sort": {
    "dateSaisie": "2018-06-14T18:41:24.000+02:00",
    "sortEnSeance": "Adopté"
  },
  "dateDepot": "2018-06-14T02:00:00.000+02:00",
  "dateDistribution": "2018-06-14T02:00:00.000+02:00",
  "article99": "0",
  "loiReference": {}
}