{
  "uid": "AMANR5L15SEA717460BTC1019P0D1N1184",
  "identifiant": {
    "legislature": "15",
    "numero": "1184",
    "numRect": "0",
    "saisine": {
      "texteLegislatifRef": "PRJLANR5L15BTC1019",
      "numeroPartiePLF": "0",
      "organeExamen": "PO717460",
      "mentionSecondeDeliberation": "0"
    }
  },
  "numeroLong": "1184",
  "etapeTexte": "1ère lecture (1ère assemblée saisie)",
  "triAmendement": "fnu",
  "cardinaliteAmdtMultiples": "1",
  "etat": "Discuté",
  "signataires": {
    "auteur": {
      "typeAuteur": "Depute",
      "acteurRef": "PA605991",
      "groupePolitiqueRef": "PO730934"
    },
    "cosignatairesRefs": [
      "PA609726",
      "PA266808",
      "PA605991",
      "PA642847",
      "PA2492",
      "PA334654",
      "PA2792",
      "PA643134",
      "PA721636"
    ],
    "texteAffichable": "Mme&#160;Genevard,  M.&#160;Bazin, M.&#160;Straumann, M.&#160;Quentin, Mme&#160;Valentin, M.&#160;Parigi, M.&#160;Rolland, M.&#160;Aubert et M.&#160;Taugourdeau"
  },
  "pointeurFragmentTexte": {
    "division": {
      "titre": "Article 10",
      "articleDesignationCourte": "ART. 10",
      "type": "ARTICLE",
      "avantAApres": "A",
      "divisionRattachee": "ARTICLE 10",
      "urlDivisionTexteVise": "/15/textes/1019.asp#D_Article_10"
    },
    "alinea": {
      "numero": "4"
    }
  },
  "corps": {
    "dispositif": "<p style=\"text-align: justify;\">&#192; la premi&#232;re phrase de l'alin&#233;a&#160;4, apr&#232;s le mot&#160;:</p><p style=\"text-align: justify;\">&#171;&#160;organise&#160;&#187;,</p><p style=\"text-align: justify;\">ins&#233;rer les mots&#160;:</p><p style=\"text-align: justify;\">&#171;&#160;, en partenariat avec les chambres consulaires,&#160;&#187;.</p>",
    "exposeSommaire": "<p style=\"text-align: justify;\">Fortement ancr&#233;es dans les territoires, les chambres consulaires jouent un r&#244;le essentiel de trait d&#8217;union entre les jeunes, les m&#233;tiers et les acteurs &#233;conomiques.</p><p style=\"text-align: justify;\">Elles doivent donc &#234;tre pleinement associ&#233;es aux r&#233;gions pour les accompagner dans l&#8217;organisation des actions d&#8217;information en direction des jeunes notamment dans les &#233;tablissements scolaires. Tel est l&#8217;objet de cet amendement.</p>"
  },
  "representations": [
    {
      "nom": "PDF",
      "typeMime": {
        "type": "application",
        "subType": "PDF"
      },
      "statutRepresentation": {
        "verbatim": true,
        "canonique": true,
        "officielle": true,
        "transcription": false,
        "enregistrement": false
      },
      "contenu": {
        "documentURI": "/15/amendements/1019/AN/1184.pdf"
      }
    }
  ],
  "seanceDiscussion": "RUANR5L15S2018IDS21103",
  "sort": {
    "dateSaisie": "2018-06-14T22:25:14.000+02:00",
    "sortEnSeance": "Rejeté"
  },
  "dateDepot": "2018-06-07T02:00:00.000+02:00",
  "dateDistribution": "2018-06-11T02:00:00.000+02:00",
  "article99": "0",
  "loiReference": {}
}