{
  "uid": "AMANR5L15SEA717460B2272P1D1N2302",
  "identifiant": {
    "legislature": "15",
    "numero": "2302",
    "numRect": "0",
    "saisine": {
      "texteLegislatifRef": "PRJLANR5L15B2272",
      "numeroPartiePLF": "1",
      "organeExamen": "PO717460",
      "mentionSecondeDeliberation": "0"
    }
  },
  "numeroLong": "I-2302",
  "etapeTexte": "1ère lecture (1ère assemblée saisie)",
  "triAmendement": "baaaaaaaaaaaaaaaaaaaaaaaaaaaaaaaaaaaaaaaaaaaaaaaaaakzs",
  "cardinaliteAmdtMultiples": "1",
  "etat": "Irrecevable",
  "signataires": {
    "auteur": {
      "typeAuteur": "Depute",
      "acteurRef": "PA336175",
      "groupePolitiqueRef": "PO759900"
    },
    "cosignatairesRefs": [
      "PA607619",
      "PA719138",
      "PA719286",
      "PA605518",
      "PA336175",
      "PA720278",
      "PA336439",
      "PA405480",
      "PA721194",
      "PA331582",
      "PA267042",
      "PA720996",
      "PA719146",
      "PA608292",
      "PA605694",
      "PA333421",
      "PA942",
      "PA755549",
      "PA720038"
    ],
    "texteAffichable": "Mme&#160;Pinel,  M.&#160;Acquaviva, M.&#160;Brial, M.&#160;Castellani, M.&#160;Colombani, M.&#160;Cl&#233;ment, M.&#160;Charles&#160;de Courson, Mme&#160;Dubi&#233;, M.&#160;El Guerrab, Mme&#160;Fr&#233;d&#233;rique&#160;Dumas, M.&#160;Falorni, M.&#160;Favennec Becot, Mme&#160;Josso, M.&#160;Fran&#231;ois-Michel&#160;Lambert, M.&#160;Molac, M.&#160;Orphelin, M.&#160;Pancher, M.&#160;Pupponi et M.&#160;Philippe&#160;Vigier"
  },
  "pointeurFragmentTexte": {
    "division": {
      "titre": "Article 4",
      "articleDesignationCourte": "ART. 4",
      "type": "ARTICLE",
      "avantAApres": "A",
      "divisionRattachee": "ARTICLE 4",
      "urlDivisionTexteVise": "/15/textes/2272A.asp#D_Article_4"
    },
    "alinea": {
      "avantAApres": "Apres",
      "numero": "30"
    }
  },
  "corps": {},
  "representations": [
    {
      "nom": "PDF",
      "typeMime": {
        "type": "application",
        "subType": "PDF"
      },
      "statutRepresentation": {
        "verbatim": true,
        "canonique": true,
        "officielle": true,
        "transcription": false,
        "enregistrement": false
      },
      "contenu": {
        "documentURI": "/15/amendements/2272A/AN/2302.pdf"
      }
    }
  ],
  "dateDepot": "2019-10-10T02:00:00.000+02:00",
  "dateDistribution": "2019-10-14T02:00:00.000+02:00",
  "article99": "0",
  "loiReference": {}
}