{
  "uid": "AMANR5L15PO59051B0104P0D1N211",
  "identifiant": {
    "legislature": "15",
    "numero": "211",
    "numRect": "0",
    "saisine": {
      "texteLegislatifRef": "PRJLANR5L15B0104",
      "numeroPartiePLF": "0",
      "organeExamen": "PO59051",
      "mentionSecondeDeliberation": "0"
    }
  },
  "numeroLong": "CL211",
  "etapeTexte": "1ère lecture (2ème assemblée saisie)",
  "triAmendement": "hf",
  "cardinaliteAmdtMultiples": "1",
  "etat": "Discuté",
  "signataires": {
    "auteur": {
      "typeAuteur": "Depute",
      "acteurRef": "PA267440",
      "groupePolitiqueRef": "PO730934"
    },
    "cosignatairesRefs": [
      "PA2796",
      "PA718838",
      "PA608826",
      "PA767",
      "PA608016",
      "PA267440",
      "PA721314",
      "PA267527",
      "PA267429",
      "PA334843",
      "PA336316",
      "PA720386",
      "PA721046",
      "PA718850",
      "PA718884",
      "PA266774",
      "PA606712",
      "PA346218",
      "PA721286",
      "PA721968",
      "PA608416",
      "PA642847",
      "PA334654"
    ],
    "texteAffichable": "M.&#160;Diard,  M.&#160;Ramadier, M.&#160;Cattin, M.&#160;Bazin, M.&#160;Straumann, M.&#160;Vialay, Mme&#160;Bazin-Malgras, Mme&#160;Louwagie, M.&#160;Di Filippo, M.&#160;Schellenberger, M.&#160;Hetzel, M.&#160;Brun, Mme&#160;Bassire, M.&#160;Masson, M.&#160;Cinieri, M.&#160;Cordier, M.&#160;Lurton, M.&#160;Saddier, M.&#160;Bouchet, M.&#160;Furst, M.&#160;Teissier, M.&#160;Verch&#232;re et Mme&#160;Duby-Muller"
  },
  "pointeurFragmentTexte": {
    "division": {
      "titre": "Article 3",
      "articleDesignationCourte": "ART. 3",
      "type": "ARTICLE",
      "avantAApres": "A",
      "divisionRattachee": "ARTICLE 3",
      "urlDivisionTexteVise": "/15/textes/0104.asp#D_Article_3"
    },
    "alinea": {
      "numero": "10"
    }
  },
  "corps": {
    "dispositif": "<p style=\"text-align: justify;\">I.&#160;&#8211;&#160;&#192; la seconde phrase de l&#8217;alin&#233;a&#160;10, supprimer les mots&#160;:</p><p style=\"text-align: justify;\">&#171;&#160;ou d&#8217;autres d&#233;partements&#160;&#187;.</p><p style=\"text-align: justify;\">II.&#160;&#8211;&#160;En cons&#233;quence, substituer au mot&#160;: </p><p style=\"text-align: justify;\">&#171;&#160;ceux&#160;&#187;,</p><p style=\"text-align: justify;\">le mot&#160;: </p><p style=\"text-align: justify;\">&#171;&#160;celles&#160;&#187;.</p>",
    "exposeSommaire": "<p>Amendement de repli.</p><p>Il est demand&#233; ici de donner une plus grande libert&#233; d'action, au ministre de l'Int&#233;rieur, dans la d&#233;limitation d'un p&#233;rim&#232;tre g&#233;ographique auquel est assign&#233;e une personne vis&#233;e par l'article L.228-1 du Code de la s&#233;curit&#233; int&#233;rieure, tout en respectant le droit &#224; mener une vie familiale et professionnelle normales, qui sera &#233;videmment pris en compte dans la d&#233;limitation dudit p&#233;rim&#232;tre, et par le juge administratif dans son contr&#244;le de la proportionnalit&#233; des moyens mis en &#339;uvre.</p><p>Cet amendement de repli consiste &#224; pr&#233;server un cadre dans lequel peut &#233;voluer la personne assujettie au respect d'un p&#233;rim&#232;tre g&#233;ographique, qui est celui de communes autres que sa commune de r&#233;sidence, pour lui garantir une vie familiale et professionnelle normales, tout en supprimant le cadre, trop souple, de plusieurs d&#233;partements.</p>"
  },
  "representations": [
    {
      "nom": "PDF",
      "typeMime": {
        "type": "application",
        "subType": "PDF"
      },
      "statutRepresentation": {
        "verbatim": true,
        "canonique": true,
        "officielle": true,
        "transcription": false,
        "enregistrement": false
      },
      "contenu": {
        "documentURI": "/15/amendements/0104/CION_LOIS/CL211.pdf"
      }
    }
  ],
  "sort": {
    "dateSaisie": "2017-09-13T16:24:24.000+02:00",
    "sortEnSeance": "Rejeté"
  },
  "dateDepot": "2017-09-09T02:00:00.000+02:00",
  "dateDistribution": "2017-09-11T02:00:00.000+02:00",
  "article99": "0",
  "loiReference": {
    "codeLoi": "2.7"
  }
}