{
  "uid": "AMANR5L15PO59051B0536P0D1N23",
  "identifiant": {
    "legislature": "15",
    "numero": "23",
    "numRect": "0",
    "saisine": {
      "texteLegislatifRef": "PIONANR5L15B0536",
      "numeroPartiePLF": "0",
      "organeExamen": "PO59051",
      "mentionSecondeDeliberation": "0"
    }
  },
  "numeroLong": "CL23",
  "etapeTexte": "1ère lecture (1ère assemblée saisie)",
  "triAmendement": "i",
  "cardinaliteAmdtMultiples": "1",
  "etat": "Discuté",
  "signataires": {
    "auteur": {
      "typeAuteur": "Depute",
      "acteurRef": "PA718894",
      "groupePolitiqueRef": "PO730964"
    },
    "cosignatairesRefs": [
      "PA718894"
    ],
    "texteAffichable": "M.&#160;Dombreval"
  },
  "pointeurFragmentTexte": {
    "division": {
      "titre": "relative à la mise en œuvre du transfert des compétences eau et assainissement aux communautés de communes,",
      "articleDesignationCourte": "TITRE",
      "type": "TITRE",
      "avantAApres": "A",
      "divisionRattachee": "TITRE",
      "urlDivisionTexteVise": "/15/textes/0536.asp#D_relative_a_la_mise_en_uvre_du_transfer"
    }
  },
  "corps": {
    "dispositif": "<p style=\"text-align: justify;\">Compl&#233;ter le titre de la proposition par les mots&#160;:</p><p style=\"text-align: justify;\">&#171;&#160;et aux communaut&#233;s d&#8217;agglom&#233;rations&#160;&#187;.</p>",
    "exposeSommaire": "<p>Le transfert &#233;tant obligatoire aux communaut&#233;s de communes et aux communaut&#233;s d'agglom&#233;ration &#224; compter du 1er janvier 2020.&#160;</p><p>cette proposition de loi entend apporter des r&#233;ponses pragmatiques aux pr&#233;occupations des &#233;lus locaux, sans remettre en cause le caract&#232;re obligatoire du transfert de la comp&#233;tence. Ainsi les communes qui n'auraient pas d&#233;j&#224; transf&#233;r&#233; les comp&#233;tences \"eau\" et \"assainissement\" ou l'une d'entre elles, pourront b&#233;n&#233;ficier de l'am&#233;nagement des conditions du transfert qu'elle fasse partie d'une communaut&#233; de communes ou d'une communaut&#233; d'agglom&#233;ration.&#160;</p><p>&#160;</p>"
  },
  "representations": [
    {
      "nom": "PDF",
      "typeMime": {
        "type": "application",
        "subType": "PDF"
      },
      "statutRepresentation": {
        "verbatim": true,
        "canonique": true,
        "officielle": true,
        "transcription": false,
        "enregistrement": false
      },
      "contenu": {
        "documentURI": "/15/amendements/0536/CION_LOIS/CL23.pdf"
      }
    }
  ],
  "sort": {
    "dateSaisie": "2018-01-24T11:46:48.000+01:00",
    "sortEnSeance": "Non soutenu"
  },
  "dateDepot": "2018-01-19T01:00:00.000+01:00",
  "dateDistribution": "2018-01-22T01:00:00.000+01:00",
  "article99": "0",
  "loiReference": {}
}