{
  "uid": "AMANR5L15SEA717460BTC2062P0D1N364",
  "identifiant": {
    "legislature": "15",
    "numero": "364",
    "numRect": "0",
    "saisine": {
      "texteLegislatifRef": "PIONANR5L15BTC2062",
      "numeroPartiePLF": "0",
      "organeExamen": "PO717460",
      "mentionSecondeDeliberation": "0"
    }
  },
  "numeroLong": "364",
  "etapeTexte": "1ère lecture (1ère assemblée saisie)",
  "triAmendement": "boaaaaaaaaaaaaaaaaaaaaaaaaaaaaaaaaaaaaaaaaaaaaaaaadcc",
  "cardinaliteAmdtMultiples": "1",
  "etat": "Discuté",
  "signataires": {
    "auteur": {
      "typeAuteur": "Depute",
      "acteurRef": "PA607619",
      "groupePolitiqueRef": "PO759900"
    },
    "cosignatairesRefs": [
      "PA405480",
      "PA719146",
      "PA331582",
      "PA755549",
      "PA719138",
      "PA608292",
      "PA336175",
      "PA719286",
      "PA607619",
      "PA267042",
      "PA605518",
      "PA336439",
      "PA720996",
      "PA333421",
      "PA720038"
    ],
    "texteAffichable": "M.&#160;Molac,  M.&#160;Acquaviva, M.&#160;Brial, M.&#160;Castellani, M.&#160;Cl&#233;ment, M.&#160;Colombani, Mme&#160;Dubi&#233;, M.&#160;El Guerrab, M.&#160;Favennec Becot, Mme&#160;Josso, M.&#160;Fran&#231;ois-Michel&#160;Lambert, M.&#160;Pancher, Mme&#160;Pinel, M.&#160;Pupponi et M.&#160;Philippe&#160;Vigier"
  },
  "pointeurFragmentTexte": {
    "division": {
      "titre": "Article 2",
      "articleDesignationCourte": "ART. 2",
      "type": "ARTICLE",
      "avantAApres": "A",
      "divisionRattachee": "ARTICLE 2",
      "urlDivisionTexteVise": "/15/textes/2062.asp#D_Article_2"
    },
    "alinea": {
      "avantAApres": "A",
      "numero": "5",
      "alineaDesignation": "Alinéa 5"
    }
  },
  "corps": {
    "dispositif": "<p style=\"text-align: justify;\">&#192; la deuxi&#232;me phrase de l&#8217;alin&#233;a&#160;5, apr&#232;s le mot&#160;:</p><p style=\"text-align: justify;\">&#171;&#160;heures&#160;&#187;,</p><p style=\"text-align: justify;\">ins&#233;rer les mots&#160;:</p><p style=\"text-align: justify;\">&#171;&#160;&#224; compter de la r&#233;ception de la notification&#160;&#187;.</p>",
    "exposeSommaire": "<p style=\"text-align: justify;\">Afin d&#8217;assurer une r&#233;action rapide de la part des op&#233;rateurs et une information tout aussi rapide des notifiants, il appara&#238;t pertinent de pr&#233;ciser que le d&#233;lai &#224; partir duquel ces derniers seront inform&#233;s des suites donn&#233;es &#224; leur demande de retrait sera de vingt-quatre heures &#224; compter de la r&#233;ception de la notification par l&#8217;op&#233;rateur.</p>"
  },
  "representations": [
    {
      "nom": "PDF",
      "typeMime": {
        "type": "application",
        "subType": "PDF"
      },
      "statutRepresentation": {
        "verbatim": true,
        "canonique": true,
        "officielle": true,
        "transcription": false,
        "enregistrement": false
      },
      "contenu": {
        "documentURI": "/15/amendements/2062/AN/364.pdf"
      }
    }
  ],
  "seanceDiscussion": "RUANR5L15S2019IDS21751",
  "sort": {
    "dateSaisie": "2019-07-04T17:20:43.000+02:00",
    "sortEnSeance": "Non soutenu"
  },
  "dateDepot": "2019-06-29T02:00:00.000+02:00",
  "dateDistribution": "2019-07-03T02:00:00.000+02:00",
  "article99": "0",
  "loiReference": {}
}