{
  "uid": "AMANR5L15SEA717460B1490P0D1N1001",
  "identifiant": {
    "legislature": "15",
    "numero": "1001",
    "numRect": "0",
    "saisine": {
      "texteLegislatifRef": "PRJLANR5L15B1490",
      "numeroPartiePLF": "0",
      "organeExamen": "PO717460",
      "mentionSecondeDeliberation": "0"
    }
  },
  "numeroLong": "1001",
  "etapeTexte": "Nouvelle Lecture",
  "triAmendement": "aagaabaaaaaaaaaaaaaaaaaaaaaaaaaaaaaaaaaaaaaaaaaaaazu",
  "cardinaliteAmdtMultiples": "1",
  "etat": "Irrecevable",
  "signataires": {
    "auteur": {
      "typeAuteur": "Depute",
      "acteurRef": "PA720230",
      "groupePolitiqueRef": "PO744425"
    },
    "cosignatairesRefs": [
      "PA267766",
      "PA712014",
      "PA267241",
      "PA702052",
      "PA2952",
      "PA642935",
      "PA720230",
      "PA721486",
      "PA695100",
      "PA267585",
      "PA721110",
      "PA267330",
      "PA719806",
      "PA267355",
      "PA268019",
      "PA610775",
      "PA722030",
      "PA721094",
      "PA1960",
      "PA642868",
      "PA721194",
      "PA331567",
      "PA720696",
      "PA721632",
      "PA332228",
      "PA267780",
      "PA266788",
      "PA421348"
    ],
    "texteAffichable": "Mme&#160;Magnier,  Mme&#160;Auconie, M.&#160;Becht, M.&#160;Benoit, M.&#160;Bournazel, M.&#160;Guy&#160;Bricout, M.&#160;Christophe, Mme&#160;de La Raudi&#232;re, M.&#160;Demilly, Mme&#160;Descamps, Mme&#160;Fr&#233;d&#233;rique&#160;Dumas, M.&#160;Dunoyer, Mme&#160;Firmin Le Bodo, M.&#160;Gom&#232;s, M.&#160;Meyer&#160;Habib, M.&#160;Herth, M.&#160;Lagarde, M.&#160;Ledoux, Mme&#160;Lemoine, M.&#160;Leroy, M.&#160;Morel-&#192;-L&apos;Huissier, M.&#160;Naegelen, Mme&#160;Sage, Mme&#160;Sanquer, M.&#160;Vercamer, M.&#160;Villiers, M.&#160;Warsmann et M.&#160;Zumkeller"
  },
  "pointeurFragmentTexte": {
    "division": {
      "titre": "Article 19 bis B",
      "articleDesignationCourte": "ART. 19 BIS B",
      "type": "ARTICLE",
      "avantAApres": "A",
      "divisionRattachee": "ARTICLE 19 BIS B",
      "urlDivisionTexteVise": "/15/textes/1490.asp#D_Article_19_bis_B"
    },
    "alinea": {
      "avantAApres": "Apres",
      "numero": "7"
    }
  },
  "corps": {
    "dispositif": "<p style=\"text-align: justify;\">I.&#160;&#8211;&#160;Au d&#233;but, ajouter les deux alin&#233;as suivants&#160;:</p><p style=\"text-align: justify;\">&#171;&#160;I A.&#160;&#8211;&#160;Le <i>a</i> du 2&#176; du 1 de l&#8217;article&#160;265 du code des douanes est ainsi r&#233;tabli&#160;:</p><p style=\"text-align: justify;\">&#171;&#160;<i>a)</i> L&#8217;&#233;largissement progressif de la composante carbone est assis sur le contenu en carbone fossile des produits assujettis &#224; la taxe int&#233;rieure de consommation.&#160;&#187;</p><p style=\"text-align: justify;\">II.&#160;&#8211;&#160;Compl&#233;ter cet article par l'alin&#233;a suivant&#160;:</p><p style=\"text-align: justify;\">&#171;&#160;III.&#160;&#8211;&#160;La perte de recettes pour l&#8217;&#201;tat est compens&#233;e &#224; due concurrence par la cr&#233;ation d&#8217;une taxe additionnelle aux droits mentionn&#233;s aux articles 575 et 575 A du code g&#233;n&#233;ral des imp&#244;ts.&#160;&#187;</p>",
    "exposeSommaire": "<p style=\"text-align: justify;\">Mise en place par la loi de finances pour 2014, la composante carbone des taxes int&#233;rieures de consommation a pour objet de moduler la fiscalit&#233; des produits en fonction des &#233;missions de CO&#8322;. Le taux de la composante carbone a &#233;t&#233; progressivement augment&#233; en lois de finances et suit d&#233;sormais, en ad&#233;quation avec une cible de 100&#160;&#8364;/tCO&#8322; en 2030 pr&#233;vue par la loi de transition &#233;nerg&#233;tique de 2015, une trajectoire d&#8217;augmentation acc&#233;l&#233;r&#233;e jusqu&#8217;en 2022.</p><p style=\"text-align: justify;\">Cette trajectoire d&#8217;augmentation confirm&#233;e par le projet de loi de finances pour 2019 est fondamentale pour r&#233;&#233;quilibrer la comp&#233;titivit&#233; des &#233;nergies renouvelables.</p><p style=\"text-align: justify;\">L&#8217;article&#160;1<sup>er</sup> de la loi de transition &#233;nerg&#233;tique relative &#224; la transition &#233;nerg&#233;tique pour la croissance verte du 17 ao&#251;t 2015, sur laquelle s&#8217;appuie l&#8217;augmentation de la composante carbone des TIC, pr&#233;voit l&#8217;&#160;&#171;&#160;&#233;largissement progressif de la part carbone, assise sur le contenu en carbone fossile, dans les taxes int&#233;rieures de consommation sur les &#233;nergies, dans la perspective d&#8217;une division par quatre des &#233;missions de gaz &#224; effet de serre, cette augmentation &#233;tant compens&#233;e, &#224; due concurrence, par un all&#232;gement de la fiscalit&#233; pesant sur d&#8217;autres produits, travaux ou revenus [&#8230;]&#160;&#187;.</p><p style=\"text-align: justify;\">Dans ce contexte, il est propos&#233; d&#8217;asseoir la composante carbone des taxes int&#233;rieures de consommation sur le seul contenu en carbone fossile des produits &#233;nerg&#233;tiques assujettis, afin d&#8217;exclure de la composante carbone les produits et &#233;nergies issues de la biomasse.</p><p style=\"text-align: justify;\">Inscrire dans la loi de finances le principe selon lequel la composante carbone des taxes int&#233;rieures de consommation est assise uniquement sur le contenu en carbone fossile des produits &#233;nerg&#233;tiques assujettis permet de lui donner une valeur normative.</p>"
  },
  "representations": [
    {
      "nom": "PDF",
      "typeMime": {
        "type": "application",
        "subType": "PDF"
      },
      "statutRepresentation": {
        "verbatim": true,
        "canonique": true,
        "officielle": true,
        "transcription": false,
        "enregistrement": false
      },
      "contenu": {
        "documentURI": "/15/amendements/1490/AN/1001.pdf"
      }
    }
  ],
  "dateDepot": "2018-12-14T01:00:00.000+01:00",
  "dateDistribution": "2018-12-16T01:00:00.000+01:00",
  "article99": "0",
  "loiReference": {}
}