{
  "uid": "AMANR5L15PO59048B2272P2D1N959",
  "identifiant": {
    "legislature": "15",
    "numero": "959",
    "numRect": "0",
    "saisine": {
      "texteLegislatifRef": "PRJLANR5L15B2272",
      "numeroPartiePLF": "2",
      "organeExamen": "PO59048",
      "mentionSecondeDeliberation": "0"
    }
  },
  "numeroLong": "II-CF959",
  "etapeTexte": "1ère lecture (1ère assemblée saisie)",
  "triAmendement": "ajfaaaaaaaaaaaaaaaaaaaaaaaaaaaaaaaaaaaaaaaaaaaaaaajo",
  "cardinaliteAmdtMultiples": "1",
  "etat": "Discuté",
  "signataires": {
    "auteur": {
      "typeAuteur": "Rapporteur",
      "acteurRef": "PA342415",
      "organeRef": "PO419610",
      "groupePolitiqueRef": "PO758835"
    },
    "cosignatairesRefs": [
      "PA342415"
    ],
    "texteAffichable": "Mme&#160;Battistel, rapporteure pour avis au nom de la commission des affaires &#233;conomiques"
  },
  "pointeurFragmentTexte": {
    "missionVisee": {
      "idMissionAN": "810",
      "libelleMission": "Écologie, développement et mobilité durables",
      "codeMissionPLF": "B",
      "libelleMissionPLF": "Répartition, par mission et programme, des crédits du budget général"
    },
    "division": {
      "titre": "Article 76",
      "articleDesignationCourte": "APRÈS ART. 76",
      "type": "ARTICLE",
      "avantAApres": "Apres",
      "divisionRattachee": "APRÈS L'ARTICLE 76, insérer l'article suivant:",
      "articleAdditionnel": "1",
      "urlDivisionTexteVise": "/15/textes/2272C.asp#D_Article_76"
    }
  },
  "corps": {
    "dispositif": "<p style=\"text-align: justify;\">Le Gouvernement remet au Parlement, avant le 1<sup>er&#160;</sup>septembre&#160;2020, un rapport examinant l&#8217;opportunit&#233; de renforcer les aides qui permettent de financer l&#8217;assistance &#224; la ma&#238;trise d&#8217;ouvrage dans le cadre de travaux de r&#233;novation &#233;nerg&#233;tique r&#233;alis&#233;s par des particuliers.&#160;</p>",
    "exposeSommaire": "<p style=\"text-align: justify;\">R&#233;aliser des travaux de r&#233;novation &#233;nerg&#233;tique peut se r&#233;v&#233;ler extr&#234;mement compliqu&#233; pour les particuliers qui ne disposent souvent pas d&#8217;expertise technique solide sur le sujet. L&#8217;assistance &#224; la ma&#238;trise d&#8217;ouvrage est d&#233;terminante dans la r&#233;alisation des travaux (pour &#233;tablir un programme de travaux et mobiliser les diff&#233;rents financements disponibles) et est un garde-fou pr&#233;cieux vis&#8209;&#224;-vis de toute forme d&#8217;escroquerie. La nouvelle prime, r&#233;sultant de la transformation du cr&#233;dit d&#8217;imp&#244;t transition &#233;nerg&#233;tique (CITE) devrait permettre de renforcer l&#8217;assistance &#224; la ma&#238;trise d&#8217;ouvrage.</p><p style=\"text-align: justify;\">Le pr&#233;sent amendement demande un rapport au Gouvernement sur le sujet afin de renforcer, dans le PLF 2021, les aides finan&#231;ant l&#8217;assistance &#224; la maitrise d&#8217;ouvrage, si cela se r&#233;v&#232;le opportun.</p>"
  },
  "representations": [
    {
      "nom": "PDF",
      "typeMime": {
        "type": "application",
        "subType": "PDF"
      },
      "statutRepresentation": {
        "verbatim": true,
        "canonique": true,
        "officielle": true,
        "transcription": false,
        "enregistrement": false
      },
      "contenu": {
        "documentURI": "/15/amendements/2272C/CION_FIN/CF959.pdf"
      }
    }
  ],
  "sort": {
    "dateSaisie": "2019-10-24T18:22:20.000+02:00",
    "sortEnSeance": "Rejeté"
  },
  "dateDepot": "2019-10-23T02:00:00.000+02:00",
  "dateDistribution": "2019-10-24T02:00:00.000+02:00",
  "article99": "0",
  "loiReference": {
    "codeLoi": "zz rapport"
  }
}