{
  "uid": "AMANR5L15PO59048B1255P2D1N250",
  "identifiant": {
    "legislature": "15",
    "numero": "250",
    "numRect": "0",
    "saisine": {
      "texteLegislatifRef": "PRJLANR5L15B1255",
      "numeroPartiePLF": "2",
      "organeExamen": "PO59048",
      "mentionSecondeDeliberation": "0"
    }
  },
  "numeroLong": "II-CF250",
  "etapeTexte": "1ère lecture (1ère assemblée saisie)",
  "triAmendement": "bqaaaaaaaaaaaaaaaaaaaaaaaaaaaaaaaaaaaaaaaaaaaaaaaazi",
  "cardinaliteAmdtMultiples": "1",
  "etat": "Retiré",
  "signataires": {
    "auteur": {
      "typeAuteur": "Depute",
      "acteurRef": "PA720454",
      "groupePolitiqueRef": "PO730964"
    },
    "cosignatairesRefs": [
      "PA330008",
      "PA720454"
    ],
    "texteAffichable": "M.&#160;Houbron et M.&#160;Breton"
  },
  "pointeurFragmentTexte": {
    "missionVisee": {
      "idMissionAN": "409",
      "libelleMission": "Justice",
      "codeMissionPLF": "B",
      "libelleMissionPLF": "Répartition, par mission et programme, des crédits du budget général"
    },
    "division": {
      "titre": "ÉTAT B",
      "articleDesignationCourte": "ART. 39",
      "type": "ANNEXE",
      "avantAApres": "A",
      "divisionRattachee": "ARTICLE 39",
      "urlDivisionTexteVise": "/15/textes/1255C.asp#D_ETAT_B"
    }
  },
  "corps": {
    "exposeSommaire": "<p style=\"text-align: justify;\">Le projet de loi de finances consacre 50,2&#160;millions d&#8217;euros d&#8217;autorisations d&#8217;engagement et de cr&#233;dits de paiement &#224; la s&#233;curisation des &#233;tablissements p&#233;nitentiaires.</p><p style=\"text-align: justify;\">Le rapport de la mission d&#8217;information relative au r&#233;gime juridique des fouilles en d&#233;tention a montr&#233; que la probl&#233;matique des fouilles pose la question plus g&#233;n&#233;rale de la s&#233;curit&#233; en d&#233;tention et des moyens dont disposent les chefs d&#8217;&#233;tablissement et les surveillants pour lutter contre l&#8217;entr&#233;e d&#8217;objets dangereux et illicites. En 2017, l&#8217;administration p&#233;nitentiaire a d&#233;nombr&#233; 4&#160;314 violences physiques exerc&#233;es contre le personnel et 90&#160;096 objets illicites ou dangereux ont &#233;t&#233; saisis en d&#233;tention. Face &#224; cette situation pr&#233;occupante, il est n&#233;cessaire de consacrer des moyens budg&#233;taires plus importants &#224; la s&#233;curit&#233; des &#233;tablissements p&#233;nitentiaires.</p><p style=\"text-align: justify;\">La mission d&#8217;information propose notamment de renforcer les moyens de contr&#244;le des d&#233;tenus notamment en d&#233;veloppant l&#8217;&#233;quipement des &#233;tablissements pour peine en portiques &#224; ondes millim&#233;triques ou le contr&#244;le renforc&#233; des d&#233;tenus avec l&#8217;aide d&#8217;unit&#233;s cynotechniques. Par ailleurs, la s&#233;curit&#233; des &#233;tablissements p&#233;nitentiaires doit &#234;tre augment&#233;e en poursuivant &#233;galement la mise en place de dispositifs anti-projection, la modernisation du syst&#232;me de vid&#233;o-protection et le d&#233;veloppement de techniques de brouillages de t&#233;l&#233;phones portables efficaces.</p><p style=\"text-align: justify;\">Il est donc propos&#233; d&#8217;augmenter les cr&#233;dits consacr&#233;s &#224; la s&#233;curisation des &#233;tablissements p&#233;nitentiaires de 20&#160;% soit 10&#160;millions d&#8217;euros et d&#8217;augmenter d&#8217;autant les cr&#233;dits de l&#8217;action &#171;&#160;Garde et contr&#244;le des personnes plac&#233;es sous-main de justice&#160;&#187; du programme &#171;&#160;administration p&#233;nitentiaire&#160;&#187;.</p><p style=\"text-align: justify;\">Cet amendement&#160;:</p><p style=\"text-align: justify;\">&#8211;&#160;augmente de 10&#160;millions d&#8217;euros les autorisations d&#8217;engagement et les cr&#233;dits de paiement de l&#8217;action &#171;&#160;garde et contr&#244;le des personnes plac&#233;es sous-main de justice&#160;&#187; au sein du programme &#171;&#160;administration p&#233;nitentiaire&#160;&#187;&#160;;</p><p style=\"text-align: justify;\">&#8211;&#160;et r&#233;duit concomitamment de 10 millions d&#8217;euros les autorisations d&#8217;engagement et de cr&#233;dits de paiement de l&#8217;action &#171;&#160;gestion de l&#8217;administration centrale&#160;&#187; au sein du programme &#171;&#160;conduite et pilotage de la politique de la justice&#160;&#187;.</p>",
    "dispositifAmdtCredit": {
      "listeProgrammes": [
        {
          "libelle": "Justice judiciaire",
          "id": "22494",
          "AE": {
            "montantPositif": "0",
            "montantNegatif": "0"
          },
          "CP": {
            "montantPositif": "0",
            "montantNegatif": "0"
          },
          "action": "modification"
        },
        {
          "libelle": "Administration pénitentiaire",
          "id": "22495",
          "AE": {
            "montantPositif": "10000000",
            "montantNegatif": "0"
          },
          "CP": {
            "montantPositif": "10000000",
            "montantNegatif": "0"
          },
          "action": "modification"
        },
        {
          "libelle": "Protection judiciaire de la jeunesse",
          "id": "22496",
          "AE": {
            "montantPositif": "0",
            "montantNegatif": "0"
          },
          "CP": {
            "montantPositif": "0",
            "montantNegatif": "0"
          },
          "action": "modification"
        },
        {
          "libelle": "Accès au droit et à la justice",
          "id": "22497",
          "AE": {
            "montantPositif": "0",
            "montantNegatif": "0"
          },
          "CP": {
            "montantPositif": "0",
            "montantNegatif": "0"
          },
          "action": "modification"
        },
        {
          "libelle": "Conduite et pilotage de la politique de la justice",
          "id": "22498",
          "AE": {
            "montantPositif": "0",
            "montantNegatif": "10000000"
          },
          "CP": {
            "montantPositif": "0",
            "montantNegatif": "10000000"
          },
          "action": "modification"
        },
        {
          "libelle": "Conseil supérieur de la magistrature",
          "id": "22499",
          "AE": {
            "montantPositif": "0",
            "montantNegatif": "0"
          },
          "CP": {
            "montantPositif": "0",
            "montantNegatif": "0"
          },
          "action": "modification"
        }
      ],
      "totalAE": {
        "montantPositif": "10000000",
        "montantNegatif": "10000000",
        "solde": "0"
      },
      "totalCP": {
        "montantPositif": "10000000",
        "montantNegatif": "10000000",
        "solde": "0"
      }
    }
  },
  "representations": [
    {
      "nom": "PDF",
      "typeMime": {
        "type": "application",
        "subType": "PDF"
      },
      "statutRepresentation": {
        "verbatim": true,
        "canonique": true,
        "officielle": true,
        "transcription": false,
        "enregistrement": false
      },
      "contenu": {
        "documentURI": "/15/amendements/1255C/CION_FIN/CF250.pdf"
      }
    }
  ],
  "dateDepot": "2018-10-19T02:00:00.000+02:00",
  "dateDistribution": "2018-10-24T02:00:00.000+02:00",
  "article99": "0",
  "loiReference": {}
}