{
  "uid": "AMANR5L15SEA717460BTC2206P0D1N221",
  "identifiant": {
    "legislature": "15",
    "numero": "221",
    "numRect": "0",
    "saisine": {
      "texteLegislatifRef": "PRJLANR5L15BTC2206",
      "numeroPartiePLF": "0",
      "organeExamen": "PO717460",
      "mentionSecondeDeliberation": "0"
    }
  },
  "numeroLong": "221",
  "etapeTexte": "Nouvelle Lecture",
  "triAmendement": "aliaaaaaaaaaaaaaaaaaaaaaaaaaaaaaaaaaaaaaaaaaaaaaaaas",
  "cardinaliteAmdtMultiples": "1",
  "etat": "Discuté",
  "signataires": {
    "auteur": {
      "typeAuteur": "Depute",
      "acteurRef": "PA267527",
      "groupePolitiqueRef": "PO730934"
    },
    "cosignatairesRefs": [
      "PA722390",
      "PA266776",
      "PA266793",
      "PA608016",
      "PA608826",
      "PA718838",
      "PA2155",
      "PA721506",
      "PA718850",
      "PA721474",
      "PA267527",
      "PA334654",
      "PA718884",
      "PA718780",
      "PA607090",
      "PA267429",
      "PA267735",
      "PA721968",
      "PA340853",
      "PA267260",
      "PA719318",
      "PA346218",
      "PA642847",
      "PA709315"
    ],
    "texteAffichable": "M.&#160;Saddier,  Mme&#160;Duby-Muller, M.&#160;Straumann, M.&#160;Brun, M.&#160;Menuel, M.&#160;Bazin, M.&#160;Jean-Pierre&#160;Vigier, Mme&#160;Corneloup, M.&#160;Bony, M.&#160;Leclerc, M.&#160;Viala, Mme&#160;Trastour-Isnart, M.&#160;Vialay, M.&#160;Viry, Mme&#160;Anthoine, Mme&#160;Bazin-Malgras, M.&#160;Cordier, M.&#160;Cinieri, Mme&#160;Poletti, M.&#160;Reiss, Mme&#160;Louwagie, Mme&#160;Kuster, M.&#160;Masson et M.&#160;de Ganay"
  },
  "pointeurFragmentTexte": {
    "division": {
      "titre": "Article 5",
      "articleDesignationCourte": "ART. 5",
      "type": "ARTICLE",
      "avantAApres": "A",
      "divisionRattachee": "ARTICLE 5",
      "urlDivisionTexteVise": "/15/textes/2206.asp#D_Article_5"
    },
    "alinea": {
      "avantAApres": "Apres",
      "numero": "76"
    }
  },
  "corps": {
    "dispositif": "<p style=\"text-align: justify;\">Apr&#232;s l&#8217;alin&#233;a&#160;76, ins&#233;rer l&#8217;alin&#233;a suivant&#160;:</p><p style=\"text-align: justify;\">&#171;&#160;Il int&#232;gre le sch&#233;ma r&#233;gional des v&#233;loroutes et le sch&#233;ma d&#233;partemental v&#233;lo lorsqu&#8217;il existe.&#160;&#187;</p>",
    "exposeSommaire": "<p style=\"text-align: justify;\">Des itin&#233;raires cyclables lin&#233;aires, continus et s&#233;curis&#233;s sont indispensables &#224; un maillage cyclable coh&#233;rent. Le report modal de la voiture individuelle vers le v&#233;lo, pour des distances allant jusqu&#8217;&#224; 15 km voire au-del&#224; (gr&#226;ce au v&#233;lo &#224; assistance &#233;lectrique) sera rendu possible gr&#226;ce &#224; ce maillage du territoire local &amp;lt; d&#233;partemental &amp;lt; r&#233;gional &amp;lt; national.</p><p style=\"text-align: justify;\">Les plans de mobilit&#233; doivent assurer la meilleure coh&#233;rence territoriale possible y compris pour la circulation &#224; v&#233;lo pour le plus grand nombre. Cela suppose&#160;une planification de l&#8217;offre d&#8217;itin&#233;raires cyclables locaux en ad&#233;quation avec l&#8217;outil de planification de r&#233;f&#233;rence que constitue le sch&#233;ma r&#233;gional cyclable et les sch&#233;ma v&#233;los d&#233;partementaux. Ces derniers sont &#233;tablis en coh&#233;rence avec les Sch&#233;mas de niveau supra (europ&#233;en &amp;gt; national) et sont &#233;tablis en lien avec les acteurs publics du territoire (m&#233;tropoles, intercommunalit&#233;s, communes).</p>"
  },
  "representations": [
    {
      "nom": "PDF",
      "typeMime": {
        "type": "application",
        "subType": "PDF"
      },
      "statutRepresentation": {
        "verbatim": true,
        "canonique": true,
        "officielle": true,
        "transcription": false,
        "enregistrement": false
      },
      "contenu": {
        "documentURI": "/15/amendements/2206/AN/221.pdf"
      }
    }
  ],
  "seanceDiscussion": "RUANR5L15S2019IDS21802",
  "sort": {
    "dateSaisie": "2019-09-10T23:57:05.000+02:00",
    "sortEnSeance": "Rejeté"
  },
  "dateDepot": "2019-09-05T02:00:00.000+02:00",
  "dateDistribution": "2019-09-09T02:00:00.000+02:00",
  "article99": "0",
  "loiReference": {}
}