{
  "uid": "AMANR5L15SEA717460BTC1019P0D1N725",
  "identifiant": {
    "legislature": "15",
    "numero": "725",
    "numRect": "0",
    "saisine": {
      "texteLegislatifRef": "PRJLANR5L15BTC1019",
      "numeroPartiePLF": "0",
      "organeExamen": "PO717460",
      "mentionSecondeDeliberation": "1"
    }
  },
  "numeroLong": "725",
  "etapeTexte": "1ère lecture (1ère assemblée saisie)",
  "triAmendement": "hlkni",
  "cardinaliteAmdtMultiples": "1",
  "etat": "Discuté",
  "signataires": {
    "auteur": {
      "typeAuteur": "Depute",
      "acteurRef": "PA333421",
      "groupePolitiqueRef": "PO744425"
    },
    "cosignatairesRefs": [
      "PA719806",
      "PA712014",
      "PA267780",
      "PA266788",
      "PA702052",
      "PA720996",
      "PA333421"
    ],
    "texteAffichable": "M.&#160;Pancher,  Mme&#160;Firmin Le Bodo, M.&#160;Ledoux, Mme&#160;Auconie, M.&#160;Morel-&#192;-L&apos;Huissier, M.&#160;El Guerrab et Mme&#160;Sage"
  },
  "pointeurFragmentTexte": {
    "division": {
      "titre": "Article 15",
      "articleDesignationCourte": "ART. 15",
      "type": "ARTICLE",
      "avantAApres": "A",
      "divisionRattachee": "ARTICLE 15",
      "urlDivisionTexteVise": "/15/textes/1019.asp#D_Article_15"
    },
    "alinea": {
      "avantAApres": "Apres",
      "numero": "81"
    }
  },
  "corps": {
    "dispositif": "<p>Compl&#233;ter cet article par l&#8217;alin&#233;a suivant&#160;:</p><p>&#171;&#160;VI.&#160;&#8211;&#160;Pour les r&#233;gions de Guadeloupe, de La R&#233;union et les collectivit&#233;s territoriales de Guyane et de Martinique, le pr&#233;sent article entre en vigueur le 1er janvier 2023.&#160;&#187;</p>",
    "exposeSommaire": "<p style=\"text-align: justify;\">La quasi absence de branches professionnelles en Guadeloupe, &#224; La R&#233;union, en Guyane et en Martinique rend de fait inapplicable l&#8217;entr&#233;e en vigueur de la r&#233;forme pr&#233;vue au 1<sup>er</sup> janvier 2020. Aussi le pr&#233;sent amendement la repousse pour ces territoires au 1er janvier 2023.</p>"
  },
  "representations": [
    {
      "nom": "PDF",
      "typeMime": {
        "type": "application",
        "subType": "PDF"
      },
      "statutRepresentation": {
        "verbatim": true,
        "canonique": true,
        "officielle": true,
        "transcription": false,
        "enregistrement": false
      },
      "contenu": {
        "documentURI": "/15/amendements/1019/AN/725.pdf"
      }
    }
  ],
  "seanceDiscussion": "RUANR5L15S2018IDS21104",
  "sort": {
    "dateSaisie": "2018-06-15T12:47:15.000+02:00",
    "sortEnSeance": "Non soutenu"
  },
  "dateDepot": "2018-06-06T02:00:00.000+02:00",
  "dateDistribution": "2018-06-12T02:00:00.000+02:00",
  "article99": "0",
  "loiReference": {}
}