{
  "uid": "AMANR5L15SEA717460B2296P0D1N1513",
  "identifiant": {
    "legislature": "15",
    "numero": "1513",
    "numRect": "0",
    "saisine": {
      "texteLegislatifRef": "PRJLANR5L15B2296",
      "numeroPartiePLF": "0",
      "organeExamen": "PO717460",
      "mentionSecondeDeliberation": "1"
    }
  },
  "numeroLong": "1513",
  "etapeTexte": "1ère lecture (1ère assemblée saisie)",
  "triAmendement": "ecaaaaaaaaaaaaaaaaaaaaaaaaaaaaaaaaaaaaaaaaaaaaaaaabom",
  "cardinaliteAmdtMultiples": "1",
  "etat": "Discuté",
  "signataires": {
    "auteur": {
      "typeAuteur": "Depute",
      "acteurRef": "PA719032",
      "groupePolitiqueRef": "PO730964"
    },
    "cosignatairesRefs": [
      "PA720622",
      "PA719032",
      "PA721888",
      "PA719664",
      "PA607395",
      "PA720190",
      "PA720538",
      "PA720170",
      "PA722008",
      "PA719326"
    ],
    "texteAffichable": "M.&#160;Bouyx,  Mme&#160;Leguille-Balloy, Mme&#160;Gipson, Mme&#160;Bureau-Bonnard, M.&#160;Travert, Mme&#160;Grandjean, M.&#160;Sorre, M.&#160;Lavergne, Mme&#160;De Temmerman et M.&#160;Raphan"
  },
  "pointeurFragmentTexte": {
    "division": {
      "titre": "Article 29",
      "articleDesignationCourte": "ART. 29",
      "type": "ARTICLE",
      "avantAApres": "A",
      "divisionRattachee": "ARTICLE 29",
      "urlDivisionTexteVise": "/15/textes/2296.asp#D_Article_29"
    },
    "alinea": {
      "numero": "10"
    }
  },
  "corps": {
    "dispositif": "<p>Substituer &#224; l&#8217;alin&#233;a&#160;10 les quatre alin&#233;as suivants&#160;:</p><p style=\"text-align: justify;\">&#171;&#160;5&#176; L&#8217;article L.&#160;5125&#8209;23&#8209;3 du code de la sant&#233; publique est ainsi modifi&#233;&#160;:</p><p style=\"text-align: justify;\">&#171;&#160;1&#176;&#160;Le 2&#176;&#160;et le dernier alin&#233;a sont supprim&#233;s&#160;;</p><p style=\"text-align: justify;\">&#171;&#160;2&#176;&#160;Apr&#232;s le 4&#176;&#160;, il est ins&#233;r&#233; un 5&#176;&#160;ainsi r&#233;dig&#233;&#160;:</p><p style=\"text-align: justify;\">&#171;&#160;5&#176;&#160;La substitution dans le groupe biologique similaire sp&#233;cifique est autoris&#233;e par l&#8217;Agence nationale de s&#233;curit&#233; du m&#233;dicament et des produits de sant&#233;.&#160;&#187;&#160;&#187;</p>",
    "exposeSommaire": "<p>Compte tenu des mati&#232;res premi&#232;res utilis&#233;es, des proc&#233;d&#233;s de production, des modes d&#8217;action des m&#233;dicaments biologiques et de leurs r&#233;actions biologiques, les m&#233;dicaments biologiques similaires font l&#8217;objet de contr&#244;les extr&#234;mement stricts afin de garantir leur s&#233;curit&#233; et leur similarit&#233; au m&#233;dicament biologique de r&#233;f&#233;rence. En d&#233;pit de ces pr&#233;cautions et des suivis sp&#233;cifiques et syst&#233;matiques post-AMM, afin de tenir compte de possibles cas particuliers et de rassurer tous les acteurs concern&#233;s sur les conditions de la substitution, il est n&#233;cessaire que les mol&#233;cules substituables comme leurs modalit&#233;s de substitution au sein d&#8217;un groupe biologique similaire soient fix&#233;es, au pr&#233;alable, par l&#8217;ANSM. En effet, comme le soulignent les associations de patients, l&#8217;arriv&#233;e des biosimilaires constitue une avanc&#233;e importante mais n&#233;cessite un accompagnement des patients et de l&#8217;ensemble des acteurs. <br /> <br />En amont de toute substitution &#224; l&#8217;int&#233;rieur d&#8217;un m&#234;me groupe biologique de r&#233;f&#233;rence, l&#8217;ANSM s&#8217;assurera ainsi que toutes les conditions sont remplies pour garantir la s&#233;curit&#233; du patient. Cette disposition permettra aux autorit&#233;s de sant&#233; de conserver le contr&#244;le sur la substituabilit&#233; des produits, dans l&#8217;int&#233;r&#234;t des patients et dans le cadre du renforcement de l&#8217;interprofessionnalit&#233; du parcours de soins. Enfin, la suppression du dernier alin&#233;a d&#233;coule de l&#8217;ajout de la nouvelle version du 4&#176;&#160;, la publication d&#8217;un d&#233;cret d&#8217;application n&#8217;&#233;tant plus n&#233;cessaire, compte tenu du r&#244;le d&#233;sormais d&#233;volu &#224; l&#8217;ANSM.</p>"
  },
  "representations": [
    {
      "nom": "PDF",
      "typeMime": {
        "type": "application",
        "subType": "PDF"
      },
      "statutRepresentation": {
        "verbatim": true,
        "canonique": true,
        "officielle": true,
        "transcription": false,
        "enregistrement": false
      },
      "contenu": {
        "documentURI": "/15/amendements/2296/AN/1513.pdf"
      }
    }
  ],
  "seanceDiscussion": "RUANR5L15S2020IDS21880",
  "sort": {
    "dateSaisie": "2019-10-25T09:05:46.000+02:00",
    "sortEnSeance": "Retiré"
  },
  "dateDepot": "2019-10-18T02:00:00.000+02:00",
  "dateDistribution": "2019-10-23T02:00:00.000+02:00",
  "article99": "0",
  "loiReference": {}
}