{
  "uid": "AMANR5L15PO419865B1831P0D1N2299",
  "identifiant": {
    "legislature": "15",
    "numero": "2299",
    "numRect": "0",
    "saisine": {
      "texteLegislatifRef": "PRJLANR5L15B1831",
      "numeroPartiePLF": "0",
      "organeExamen": "PO419865",
      "mentionSecondeDeliberation": "0"
    }
  },
  "numeroLong": "CD2299",
  "etapeTexte": "1ère lecture (2ème assemblée saisie)",
  "triAmendement": "aooaaaaaaaaaaaaaaaaaaaaaaaaaaaaaaaaaaaaaaaaaaaaaaas",
  "cardinaliteAmdtMultiples": "1",
  "etat": "Irrecevable",
  "signataires": {
    "auteur": {
      "typeAuteur": "Depute",
      "acteurRef": "PA267204",
      "groupePolitiqueRef": "PO730934"
    },
    "cosignatairesRefs": [
      "PA267450",
      "PA267429",
      "PA606712",
      "PA608416",
      "PA721046",
      "PA267260",
      "PA340853",
      "PA721410",
      "PA2155",
      "PA721678",
      "PA608016",
      "PA643134",
      "PA1012",
      "PA346218",
      "PA720210",
      "PA609245",
      "PA267901",
      "PA266776",
      "PA719318",
      "PA332523",
      "PA605991",
      "PA267735",
      "PA267204",
      "PA709315",
      "PA642847",
      "PA605036",
      "PA767"
    ],
    "texteAffichable": "M.&#160;Sermier,  Mme&#160;Lacroute, M.&#160;Kamardine, M.&#160;Cattin, Mme&#160;Bonnivard, M.&#160;Hetzel, M.&#160;Reda, M.&#160;de la Verpilli&#232;re, M.&#160;Leclerc, M.&#160;Cinieri, Mme&#160;Bassire, M.&#160;Masson, M.&#160;R&#233;mi&#160;Delatte, Mme&#160;Louwagie, Mme&#160;Beauvais, M.&#160;Lurton, M.&#160;de Ganay, M.&#160;Bazin, Mme&#160;Anthoine, M.&#160;Reiss, Mme&#160;Valentin, M.&#160;Menuel, Mme&#160;Genevard, M.&#160;Abad, Mme&#160;Poletti, Mme&#160;Dalloz et M.&#160;Viala"
  },
  "pointeurFragmentTexte": {
    "division": {
      "titre": "Article 4",
      "articleDesignationCourte": "APRÈS ART. 4",
      "type": "ARTICLE",
      "avantAApres": "Apres",
      "divisionRattachee": "APRÈS L'ARTICLE 4, insérer l'article suivant:",
      "articleAdditionnel": "1",
      "urlDivisionTexteVise": "/15/textes/1831.asp#D_Article_4"
    }
  },
  "corps": {},
  "representations": [
    {
      "nom": "PDF",
      "typeMime": {
        "type": "application",
        "subType": "PDF"
      },
      "statutRepresentation": {
        "verbatim": true,
        "canonique": true,
        "officielle": true,
        "transcription": false,
        "enregistrement": false
      },
      "contenu": {
        "documentURI": "/15/amendements/1831/CION-DVP/CD2299.pdf"
      }
    }
  ],
  "dateDepot": "2019-05-09T02:00:00.000+02:00",
  "dateDistribution": "2019-05-11T02:00:00.000+02:00",
  "article99": "0",
  "loiReference": {
    "codeLoi": "transports",
    "divisionCodeLoi": "L3114-2-2"
  }
}