{
  "uid": "AMANR5L15SEA717460BTC0857P0D1N359",
  "identifiant": {
    "legislature": "15",
    "numero": "359",
    "numRect": "0",
    "saisine": {
      "texteLegislatifRef": "PRJLANR5L15BTC0857",
      "numeroPartiePLF": "0",
      "organeExamen": "PO717460",
      "mentionSecondeDeliberation": "0"
    }
  },
  "numeroLong": "359",
  "etapeTexte": "1ère lecture (1ère assemblée saisie)",
  "triAmendement": "ei",
  "cardinaliteAmdtMultiples": "1",
  "etat": "Discuté",
  "signataires": {
    "auteur": {
      "typeAuteur": "Depute",
      "acteurRef": "PA719608",
      "groupePolitiqueRef": "PO723569"
    },
    "cosignatairesRefs": [
      "PA719608"
    ],
    "texteAffichable": "Mme&#160;M&#233;nard"
  },
  "pointeurFragmentTexte": {
    "division": {
      "titre": "Article 15",
      "articleDesignationCourte": "ART. 15",
      "type": "ARTICLE",
      "avantAApres": "A",
      "divisionRattachee": "ARTICLE 15",
      "urlDivisionTexteVise": "/15/textes/0857.asp#D_Article_15"
    },
    "alinea": {
      "numero": "5"
    }
  },
  "corps": {
    "dispositif": "<p style=\"text-align: justify;\">A l'alin&#233;a&#160;5, supprimer les mots&#160;: </p><p style=\"text-align: justify;\">&#171;&#160;, actuelle et suffisamment grave&#160;&#187;.</p>",
    "exposeSommaire": "<p style=\"text-align: justify;\">Les motifs d&#8217;interdiction de circulation d&#8217;un &#233;tranger sur le territoire fran&#231;ais ne doivent pas permettre &#224; une personne dangereuse de circuler librement parce que la menace dont il est question doit &#234;tre triplement caract&#233;ris&#233;e. En effet la menace doit &#234;tre &#171;&#160;r&#233;elle, actuelle et suffisamment grave&#160;&#187;.</p><p style=\"text-align: justify;\">Il semble que le gouvernement, par cet article, soit plus soucieux de prot&#233;ger la libert&#233; de circulation d&#8217;un &#233;tranger potentiellement nuisible plut&#244;t que la s&#233;curit&#233; des Fran&#231;aise eux-m&#234;mes.</p><p style=\"text-align: justify;\">Cet amendement vise &#224; supprimer deux crit&#232;res superf&#233;tatoires. Seul &#171;&#160;la menace r&#233;elle&#160;&#187; d&#8217;un danger doit compter.</p>"
  },
  "representations": [
    {
      "nom": "PDF",
      "typeMime": {
        "type": "application",
        "subType": "PDF"
      },
      "statutRepresentation": {
        "verbatim": true,
        "canonique": true,
        "officielle": true,
        "transcription": false,
        "enregistrement": false
      },
      "contenu": {
        "documentURI": "/15/amendements/0857/AN/359.pdf"
      }
    }
  ],
  "seanceDiscussion": "RUANR5L15S2018IDS21026",
  "sort": {
    "dateSaisie": "2018-04-21T10:18:32.000+02:00",
    "sortEnSeance": "Rejeté"
  },
  "dateDepot": "2018-04-11T02:00:00.000+02:00",
  "dateDistribution": "2018-04-16T02:00:00.000+02:00",
  "article99": "0",
  "loiReference": {}
}