{
  "uid": "AMANR5L15SEA717460BTC1767P0D1N1145",
  "identifiant": {
    "legislature": "15",
    "numero": "1145",
    "numRect": "0",
    "saisine": {
      "texteLegislatifRef": "PRJLANR5L15BTC1767",
      "numeroPartiePLF": "0",
      "organeExamen": "PO717460",
      "mentionSecondeDeliberation": "0"
    }
  },
  "numeroLong": "1145",
  "etapeTexte": "1ère lecture (1ère assemblée saisie)",
  "triAmendement": "bboaaaaaaaaaaaaaaaaaaaaaaaaaaaaaaaaaaaaaaaaaaaaaaabhs",
  "cardinaliteAmdtMultiples": "1",
  "etat": "Irrecevable",
  "signataires": {
    "auteur": {
      "typeAuteur": "Depute",
      "acteurRef": "PA334654",
      "groupePolitiqueRef": "PO730934"
    },
    "cosignatairesRefs": [
      "PA334654",
      "PA767"
    ],
    "texteAffichable": "M.&#160;Straumann et M.&#160;Cattin"
  },
  "pointeurFragmentTexte": {
    "division": {
      "titre": "Article 6",
      "articleDesignationCourte": "ART. 6",
      "type": "ARTICLE",
      "avantAApres": "A",
      "divisionRattachee": "ARTICLE 6",
      "urlDivisionTexteVise": "/15/textes/1767.asp#D_Article_6"
    },
    "alinea": {
      "numero": "2"
    }
  },
  "corps": {
    "dispositif": "<p>R&#233;diger ainsi le d&#233;but de l&#8217;alin&#233;a : &#171; Valoriser les carri&#232;res hospitali&#232;res, encadrer les &#233;carts de r&#233;mun&#233;ration et faciliter la diversification des activit&#233;s (le reste sans changement) &#187;</p><p>II. - A l&#8217;alin&#233;a 3 :</p><p>1&#176; Supprimer le mot &#171; notamment &#187; ;</p><p>2&#176; Apr&#232;s les mots &#171; dans les sp&#233;cialit&#233;s &#187;, ins&#233;rer les mots &#171; et les territoires &#187;.</p>",
    "exposeSommaire": "<p>Le soutien &#224; l&#8217;attractivit&#233; de l&#8217;exercice m&#233;dical hospitalier est aujourd&#8217;hui une priorit&#233; aigue sur des sp&#233;cialit&#233;s et des territoires en crise de d&#233;mographie m&#233;dicale.</p><p>La lib&#233;ralisation g&#233;n&#233;rale et massive du recours aux contractuels n&#8217;appara&#238;t cependant pas comme la r&#233;ponse appropri&#233;e. Un d&#233;plafonnement des r&#233;mun&#233;rations des contractuels au-del&#224; des grilles statutaires, alors qu&#8217;aucune revalorisation des titulaires ne serait pr&#233;vue, risquerait de cr&#233;er un pr&#233;c&#233;dent sur lequel il sera difficile de revenir par la suite, ainsi que des iniquit&#233;s majeures au sein</p><p>des &#233;quipes et des parcours professionnels. Il s&#8217;agirait d&#8217;un signal d&#233;l&#233;t&#232;re pour les praticiens hospitaliers en poste, avec un impact attendu en termes de fid&#233;lisation.</p><p>Pour l&#8217;h&#244;pital public, particuli&#232;rement mais pas exclusivement dans les sp&#233;cialit&#233;s confront&#233;es &#224; un risque d&#8217;attractivit&#233; majeur, se battre &#224; armes &#233;gales, c&#8217;est :</p><p>&#8212; valoriser les carri&#232;res hospitali&#232;res et encadrer par la voie l&#233;gislative les &#233;carts de r&#233;mun&#233;ration entre le secteur priv&#233; &#224; but lucratif et le service public hospitalier.</p><p>La non-imposition du temps de travail additionnel (TTA) constitue ainsi une avanc&#233;e forte, de nature &#224; rendre le TTA plus attractif que l&#8217;int&#233;rim. Limiter &#224; 5000 euros minore cependant l&#8217;effet de cette disposition. Le pr&#233;sent amendement propose donc de supprimer ce plafond. Il s&#8217;agit d&#8217;une mesure en faveur de l&#8217;attractivit&#233; mais &#233;galement &#233;conomique (par rapport &#224; l&#8217;int&#233;rim) pour les &#233;tablissements.</p><p>&#8212; prendre en compte, dans les possibilit&#233;s de recours au contrat, les situations particuli&#232;rement aigu&#235;s de crise de d&#233;mographie m&#233;dicale dans certains territoires. Ces situations se retrouvent dans certains territoires de l&#8217;Hexagone mais aussi outre-mer.</p>"
  },
  "representations": [
    {
      "nom": "PDF",
      "typeMime": {
        "type": "application",
        "subType": "PDF"
      },
      "statutRepresentation": {
        "verbatim": true,
        "canonique": true,
        "officielle": true,
        "transcription": false,
        "enregistrement": false
      },
      "contenu": {
        "documentURI": "/15/amendements/1767/AN/1145.pdf"
      }
    }
  ],
  "dateDepot": "2019-03-15T01:00:00.000+01:00",
  "dateDistribution": "2019-03-16T01:00:00.000+01:00",
  "article99": "0",
  "loiReference": {}
}