{
  "uid": "AMANR5L15PO419610B0846P0D1N1888",
  "identifiant": {
    "legislature": "15",
    "numero": "1888",
    "numRect": "0",
    "saisine": {
      "texteLegislatifRef": "PRJLANR5L15B0846",
      "numeroPartiePLF": "0",
      "organeExamen": "PO419610",
      "mentionSecondeDeliberation": "0"
    }
  },
  "numeroLong": "CE1888",
  "etapeTexte": "1ère lecture (1ère assemblée saisie)",
  "triAmendement": "aq",
  "cardinaliteAmdtMultiples": "1",
  "etat": "Discuté",
  "signataires": {
    "auteur": {
      "typeAuteur": "Depute",
      "acteurRef": "PA722086",
      "groupePolitiqueRef": "PO730964"
    },
    "cosignatairesRefs": [
      "PA722086"
    ],
    "texteAffichable": "M.&#160;Taquet"
  },
  "pointeurFragmentTexte": {
    "division": {
      "titre": "Article 35",
      "articleDesignationCourte": "ART. 35",
      "type": "ARTICLE",
      "avantAApres": "A",
      "divisionRattachee": "ARTICLE 35",
      "urlDivisionTexteVise": "/15/textes/0846.asp#D_Article_35"
    },
    "alinea": {
      "avantAApres": "A",
      "numero": "3",
      "alineaDesignation": "Alinéa 3"
    }
  },
  "corps": {
    "dispositif": "<p style=\"text-align: justify;\">R&#233;diger ainsi l&#8217;alin&#233;a&#160;3&#160;:</p><p style=\"text-align: justify;\">&#171;&#160;Une commission d&#8217;attribution des logements et d&#8217;examen de l&#8217;occupation de logements est obligatoirement cr&#233;&#233;e dans chaque &#233;tablissement de coop&#233;ration intercommunale tenu de se doter d&#8217;un programme local de l&#8217;habitat.&#160;&#187;</p>",
    "exposeSommaire": "<p style=\"text-align: justify;\">L&#8217;amendement vise &#224; permettre un meilleur traitement des demandes de logements sociaux, pour l&#8217;ensemble des citoyens et sur la totalit&#233; du territoire.</p><p style=\"text-align: justify;\">Il est ainsi souhait&#233; rendre obligatoire l&#8217;instauration d&#8217;une commission d&#8217;attribution des logements et d&#8217;examen de l&#8217;occupation des logements.</p><p style=\"text-align: justify;\">Si l&#8217;article&#160;35 du projet de loi pr&#233;voit qu&#8217;une commission d&#8217;attribution des logements et d&#8217;examen de l&#8217;occupation de logements est cr&#233;&#233;e sur demande d&#8217;un &#233;tablissement de coop&#233;ration intercommunale (EPCI), ceci demeure toutefois une simple facult&#233; laiss&#233;e &#224; l&#8217;appr&#233;ciation des EPCI.</p><p style=\"text-align: justify;\">D&#232;s lors, telle qu&#8217;est actuellement envisag&#233;e l&#8217;&#233;volution de la l&#233;gislation, il existe le risque que seules les collectivit&#233;s d&#233;j&#224; exemplaires et performantes en mati&#232;re de gestion de logements sociaux entreprennent la d&#233;marche de cr&#233;er une commission d&#8217;attribution des logements et d&#8217;examen de l&#8217;occupation de logement.</p><p style=\"text-align: justify;\">L&#8217;amendement vise donc &#224; rendre celle-ci obligatoire afin que l&#8217;ensemble des foyers puissent b&#233;n&#233;ficier, dans le traitement de leur situation, de la rationalisation des proc&#233;dures induites par l&#8217;existence d&#8217;une commission d&#8217;attribution des logements et d&#8217;examen de l&#8217;occupation des logements.</p>"
  },
  "representations": [
    {
      "nom": "PDF",
      "typeMime": {
        "type": "application",
        "subType": "PDF"
      },
      "statutRepresentation": {
        "verbatim": true,
        "canonique": true,
        "officielle": true,
        "transcription": false,
        "enregistrement": false
      },
      "contenu": {
        "documentURI": "/15/amendements/0846/CION-ECO/CE1888.pdf"
      }
    }
  ],
  "sort": {
    "dateSaisie": "2018-05-17T23:00:05.000+02:00",
    "sortEnSeance": "Non soutenu"
  },
  "dateDepot": "2018-05-09T02:00:00.000+02:00",
  "dateDistribution": "2018-05-15T02:00:00.000+02:00",
  "article99": "0",
  "loiReference": {}
}