{
  "uid": "AMANR5L15SEA717460BTC0902P0D1N1651",
  "identifiant": {
    "legislature": "15",
    "numero": "1651",
    "numRect": "0",
    "saisine": {
      "texteLegislatifRef": "PRJLANR5L15BTC0902",
      "numeroPartiePLF": "0",
      "organeExamen": "PO717460",
      "mentionSecondeDeliberation": "0"
    }
  },
  "numeroLong": "1651",
  "etapeTexte": "1ère lecture (1ère assemblée saisie)",
  "triAmendement": "qzu",
  "cardinaliteAmdtMultiples": "1",
  "etat": "Discuté",
  "signataires": {
    "auteur": {
      "typeAuteur": "Depute",
      "acteurRef": "PA336175",
      "groupePolitiqueRef": "PO723569"
    },
    "cosignatairesRefs": [
      "PA605694",
      "PA336175",
      "PA608292"
    ],
    "texteAffichable": "Mme&#160;Pinel,  Mme&#160;Dubi&#233; et M.&#160;Falorni"
  },
  "pointeurFragmentTexte": {
    "division": {
      "titre": "Article 16",
      "articleDesignationCourte": "ART. 16",
      "type": "ARTICLE",
      "avantAApres": "A",
      "divisionRattachee": "ARTICLE 16",
      "urlDivisionTexteVise": "/15/textes/0902.asp#D_Article_16"
    },
    "alinea": {
      "avantAApres": "A",
      "numero": "9",
      "alineaDesignation": "Alinéa 9"
    }
  },
  "corps": {
    "dispositif": "<p>&#192; l&#8217;alin&#233;a&#160;9, substituer aux mots&#160;:</p><p>&#171;&#160;la date pr&#233;vue au premier alin&#233;a du I du pr&#233;sent article&#160;&#187;</p><p>les mots&#160;:</p><p>&#171;&#160;compter du premier jour du sixi&#232;me mois suivant la publication de la pr&#233;sente loi&#160;&#187;.</p>",
    "exposeSommaire": "<p style=\"text-align: justify;\">Cet amendement &#233;tend le d&#233;lai d'entr&#233;e en vigueur de l'article 14 de trois mois &#224; six mois, &#224; compter de la publication de la loi. Ce nouveau d&#233;lai de six mois est un d&#233;lai raisonnable non dilatoire pour permettre aux vendeurs de revoir leurs conditions g&#233;n&#233;rales de vente, aux acheteurs d'en appr&#233;cier la nouvelle teneur, et aux parties de pouvoir formaliser leurs nouveaux contrats annuels &#224; l'issue de leurs n&#233;gociations.</p><p style=\"text-align: justify;\">En effet, d&#232;s lors que le prix des produits, notamment phytopharmaceutiques, fait l'objet d'une n&#233;gociation entre professionnels, ils doivent &#234;tre formalis&#233;s dans le cadre de contrats-cadre annuels pour la tr&#232;s grande majorit&#233; d'entre eux, conform&#233;ment &#224; la r&#232;glementation. A ce titre &#233;galement, la n&#233;gociation est initi&#233;e sur la base des conditions g&#233;n&#233;rales de vente des vendeurs, qui, &#233;tant susceptibles de proposer plusieurs gammes de produits phytopharmaceutiques correspondant &#224; des usages diff&#233;rents, sont tenus d'&#233;tablir plusieurs conditions g&#233;n&#233;rales de vente diff&#233;rentes par cons&#233;quent car en fonction des produits.</p><p style=\"text-align: justify;\">De plus, la date de d&#233;but de commercialisation des produits phytopharmaceutiques soumis &#224; un cycle de commercialisation particulier peut varier selon les produits, et ce, m&#234;me au sein d'une m&#234;me cat&#233;gorie de produits phytopharmaceutiques. Contrairement &#224; d'autres secteurs tel que celui de la grande distribution, la p&#233;riode d'organisation et de d&#233;roulement des n&#233;gociations ne peut donc pas s'envisager sur une courte p&#233;riode de quelques mois, quels que soient les fournisseurs et les produits phytopharmaceutiques concern&#233;s.</p><p style=\"text-align: justify;\">C'est pourquoi le d&#233;lai d'entr&#233;e en vigueur de la loi doit &#234;tre fix&#233; &#224; six mois &#224; compter de sa publication.</p>"
  },
  "representations": [
    {
      "nom": "PDF",
      "typeMime": {
        "type": "application",
        "subType": "PDF"
      },
      "statutRepresentation": {
        "verbatim": true,
        "canonique": true,
        "officielle": true,
        "transcription": false,
        "enregistrement": false
      },
      "contenu": {
        "documentURI": "/15/amendements/0902/AN/1651.pdf"
      }
    }
  ],
  "seanceDiscussion": "RUANR5L15S2018IDS21060",
  "sort": {
    "dateSaisie": "2018-05-30T02:10:08.000+02:00",
    "sortEnSeance": "Non soutenu"
  },
  "dateDepot": "2018-05-17T02:00:00.000+02:00",
  "dateDistribution": "2018-05-23T02:00:00.000+02:00",
  "article99": "0",
  "loiReference": {}
}