{
  "uid": "AMANR5L15SEA717460B2296P0D1N456",
  "identifiant": {
    "legislature": "15",
    "numero": "456",
    "numRect": "0",
    "saisine": {
      "texteLegislatifRef": "PRJLANR5L15B2296",
      "numeroPartiePLF": "0",
      "organeExamen": "PO717460",
      "mentionSecondeDeliberation": "0"
    }
  },
  "numeroLong": "456",
  "etapeTexte": "1ère lecture (1ère assemblée saisie)",
  "triAmendement": "bkaaaaaaaaaaaaaaaaaaaaaaaaaaaaaaaaaaaaaaaaaaaaaaaatdo",
  "cardinaliteAmdtMultiples": "1",
  "etat": "Discuté",
  "signataires": {
    "auteur": {
      "typeAuteur": "Depute",
      "acteurRef": "PA267318",
      "groupePolitiqueRef": "PO730934"
    },
    "cosignatairesRefs": [
      "PA267289",
      "PA2377",
      "PA722390",
      "PA719318",
      "PA718884",
      "PA267429",
      "PA605036",
      "PA643134",
      "PA267318",
      "PA721286",
      "PA267378",
      "PA721070",
      "PA346218",
      "PA721474",
      "PA336316",
      "PA2155"
    ],
    "texteAffichable": "M.&#160;Grelier,  M.&#160;Door, M.&#160;Abad, M.&#160;Cinieri, Mme&#160;Corneloup, Mme&#160;Levy, M.&#160;Masson, M.&#160;Menuel, M.&#160;Ramadier, Mme&#160;Ramassamy, Mme&#160;Valentin, M.&#160;Viry, Mme&#160;Bazin-Malgras, Mme&#160;Anthoine, M.&#160;Bouchet et M.&#160;Perrut"
  },
  "pointeurFragmentTexte": {
    "division": {
      "titre": "Article 15",
      "articleDesignationCourte": "ART. 15",
      "type": "ARTICLE",
      "avantAApres": "A",
      "divisionRattachee": "ARTICLE 15",
      "urlDivisionTexteVise": "/15/textes/2296.asp#D_Article_15"
    },
    "alinea": {
      "numero": "2"
    }
  },
  "corps": {
    "dispositif": "<p style=\"text-align: justify;\">I.&#160;&#8211;&#160;Supprimer les alin&#233;as 2 &#224; 16.</p><p style=\"text-align: justify;\">II.&#160;&#8211;&#160;En cons&#233;quence, supprimer l&#8217;alin&#233;a&#160;20.</p>",
    "exposeSommaire": "<p style=\"text-align: justify;\">L&#8217;article&#160;15 pr&#233;voit de mettre en place une clause de sauvegarde sur des dispositifs m&#233;dicaux innovants pris en charge en sus des budgets des h&#244;pitaux (&#171;&#160;liste en sus&#160;&#187;). La mise en place d&#8217;un tel m&#233;canisme &#224; la logique exclusivement &#171;&#160;comptable&#160;&#187;&#160;s&#8217;oppose &#224; la capacit&#233; de r&#233;pondre aux probl&#233;matiques de l&#8217;acc&#232;s, de la qualit&#233; et de la pertinence des soins, pourtant port&#233;e par &#171;&#160;Ma Sant&#233; 2022&#160;&#187;. Il convient de lui pr&#233;f&#233;rer une approche qui repose davantage sur la capacit&#233; du CEPS et de l&#8217;accord cadre dans le secteur des dispositifs m&#233;dicaux &#224; g&#233;n&#233;rer des &#233;conomies bas&#233;es sur la ma&#238;trise m&#233;dicalis&#233;e.</p><p style=\"text-align: justify;\">Si les m&#233;canismes existants permettent toutefois encore de pr&#233;server une approche conventionnelle de n&#233;gociation entre les parties prenantes, la clause de sauvegarde constitue une approche purement m&#233;canique et comptable en opposition aux vrais enjeux de sant&#233; et &#224; la volont&#233; gouvernementale de r&#233;former le financement des d&#233;penses de sant&#233; bas&#233; sur la qualit&#233; et la pertinence des soins.</p><p style=\"text-align: justify;\">En outre, un tel outil pour r&#233;guler le secteur est d&#8217;autre part injustifi&#233;, les d&#233;penses li&#233;es &#224; ces dispositifs m&#233;dicaux &#233;tant d&#233;j&#224; soumises &#224; des m&#233;canismes s&#233;curis&#233;s de ma&#238;trise de r&#233;gulation financi&#232;re (baisses de prix r&#233;currentes, accord prix/volume donnant lieu &#224; des remises&#8230;) qui se traduisent ces derni&#232;res ann&#233;es par une baisse r&#233;guli&#232;re des d&#233;penses sur ce p&#233;rim&#232;tre (de 5,6&#160;% en 2016 jusqu&#8217;&#224; 3,2&#160;% en 2018, source ATIH).</p><p style=\"text-align: justify;\">Une clause de sauvegarde est par ailleurs totalement inadapt&#233;e au secteur des DM&#160;: alors qu&#8217;existe une forte h&#233;t&#233;rog&#233;n&#233;it&#233; des produits, y compris sur la liste en sus, le m&#233;canisme propos&#233; est une r&#233;ponse globale, incapable d&#8217;assurer une finesse de la r&#233;gulation pourtant indispensable.&#160; Elle ne tient absolument pas compte d&#8217;un mod&#232;le propre au dispositif m&#233;dical qui cumule petites s&#233;ries de fabrication et tr&#232;s nombreux r&#233;f&#233;rencements de produits, sans comparaison possible avec le secteur pharmaceutique. La clause de sauvegarde sur la liste en sus constitue ainsi une menace pour tout un &#233;cosyst&#232;me d&#8217;entreprises innovantes (dont de nombreuses entreprises fran&#231;aises) alors qu&#8217;elles sont d&#233;j&#224; limit&#233;es dans leur capacit&#233; &#224; g&#233;n&#233;rer des gains de productivit&#233; et qu&#8217;elles doivent faire face au d&#233;fi colossal de la mise en place d&#8217;un nouveau r&#232;glement europ&#233;en.</p><p style=\"text-align: justify;\">Enfin, ce m&#233;canisme est injuste car il pose le principe de contributions financi&#232;res sur des entreprises qui ne ma&#238;trisent pas l&#8217;activit&#233; m&#233;dicale et l&#8217;organisation des soins &#224; l&#8217;h&#244;pital. L&#8217;utilisation de leurs produits est enti&#232;rement corr&#233;l&#233;e aux besoins m&#233;dicaux. Les entreprises n&#8217;ont donc aucune prise pour r&#233;duire une d&#233;pense sur des dispositifs (dont 99&#160;% sont implantables) et qui sont au demeurant des leviers d&#8217;efficience des soins.</p>"
  },
  "representations": [
    {
      "nom": "PDF",
      "typeMime": {
        "type": "application",
        "subType": "PDF"
      },
      "statutRepresentation": {
        "verbatim": true,
        "canonique": true,
        "officielle": true,
        "transcription": false,
        "enregistrement": false
      },
      "contenu": {
        "documentURI": "/15/amendements/2296/AN/456.pdf"
      }
    }
  ],
  "seanceDiscussion": "RUANR5L15S2020IDS21877",
  "sort": {
    "dateSaisie": "2019-10-24T12:58:28.000+02:00",
    "sortEnSeance": "Rejeté"
  },
  "dateDepot": "2019-10-17T02:00:00.000+02:00",
  "dateDistribution": "2019-10-21T02:00:00.000+02:00",
  "article99": "0",
  "loiReference": {}
}