{
  "uid": "AMANR5L15PO419610B0846P0D1N439",
  "identifiant": {
    "legislature": "15",
    "numero": "439",
    "numRect": "0",
    "saisine": {
      "texteLegislatifRef": "PRJLANR5L15B0846",
      "numeroPartiePLF": "0",
      "organeExamen": "PO419610",
      "mentionSecondeDeliberation": "0"
    }
  },
  "numeroLong": "CE439",
  "etapeTexte": "1ère lecture (1ère assemblée saisie)",
  "triAmendement": "q",
  "cardinaliteAmdtMultiples": "1",
  "etat": "Discuté",
  "signataires": {
    "auteur": {
      "typeAuteur": "Depute",
      "acteurRef": "PA642847",
      "groupePolitiqueRef": "PO730934"
    },
    "cosignatairesRefs": [
      "PA642847"
    ],
    "texteAffichable": "M.&#160;Bazin"
  },
  "pointeurFragmentTexte": {
    "division": {
      "titre": "Article 3",
      "articleDesignationCourte": "ART. 3",
      "type": "ARTICLE",
      "avantAApres": "A",
      "divisionRattachee": "ARTICLE 3",
      "urlDivisionTexteVise": "/15/textes/0846.asp#D_Article_3"
    },
    "alinea": {
      "avantAApres": "A",
      "numero": "33",
      "alineaDesignation": "Alinéa 33"
    }
  },
  "corps": {
    "dispositif": "<p style=\"text-align: justify;\">Apr&#232;s le mots&#160;: </p><p style=\"text-align: justify;\">&#171;&#160;p&#233;rim&#232;tre&#160;&#187;,</p><p style=\"text-align: justify;\">r&#233;diger ainsi la fin de l&#8217;alin&#233;a&#160;33&#160;: </p><p style=\"text-align: justify;\">&#171;&#160;d&#8217;une grande op&#233;ration d&#8217;urbanisme ou d&#8217;une op&#233;ration d&#8217;int&#233;r&#234;t national au sens du chapitre II du titre pr&#233;liminaire du livre I du code de l&#8217;urbanisme&#160;;&#160;&#187;.</p><p style=\"text-align: justify;\">&#160;</p>",
    "exposeSommaire": "<p style=\"text-align: justify;\">L&#8217;article&#160;3-V cr&#233;e un nouveau cas de d&#233;rogation &#224; la loi MOP.</p><p style=\"text-align: justify;\">Actuellement la loi MOP ne s&#8217;applique pas&#160;:</p><p style=\"text-align: justify;\">- aux ouvrages de b&#226;timent ou d&#8217;infrastructure destin&#233;s &#224; une activit&#233; industrielle dont la conception est d&#233;termin&#233;e par le processus d&#8217;exploitation. Un d&#233;cret en Conseil d&#8217;&#201;tat d&#233;termine les cat&#233;gories d&#8217;ouvrages mentionn&#233;s au pr&#233;sent alin&#233;a&#160;;</p><p style=\"text-align: justify;\">- aux ouvrages d&#8217;infrastructure r&#233;alis&#233;s dans le cadre d&#8217;une zone d&#8217;am&#233;nagement concert&#233; ou d&#8217;un lotissement au sens du titre premier du livre III du code de l&#8217;urbanisme&#160;;</p><p style=\"text-align: justify;\">La loi MOP impose une d&#233;marche qualit&#233; tant aux ma&#238;tres d&#8217;ouvrage publics qu&#8217;aux prestataires priv&#233;s, l&#8217;objectif &#233;tant l&#8217;int&#233;r&#234;t g&#233;n&#233;ral et la protection des usagers finaux.</p><p style=\"text-align: justify;\">Les op&#233;rations vis&#233;es par les OIN ou les GOU sont des op&#233;rations d&#8217;envergure dont les enjeux sont d&#8217;importance. Elles doivent donc &#234;tre exemplaires. La r&#233;alisation de tout type d&#8217;&#233;quipements publics (b&#226;timent ou infrastructure) dans leur p&#233;rim&#232;tre doit relever des principes impos&#233;s par la loi MOP.</p><p style=\"text-align: justify;\">Il est donc propos&#233; de supprimer cette d&#233;rogation.&#160;</p><p style=\"text-align: justify;\">&#160;</p>"
  },
  "representations": [
    {
      "nom": "PDF",
      "typeMime": {
        "type": "application",
        "subType": "PDF"
      },
      "statutRepresentation": {
        "verbatim": true,
        "canonique": true,
        "officielle": true,
        "transcription": false,
        "enregistrement": false
      },
      "contenu": {
        "documentURI": "/15/amendements/0846/CION-ECO/CE439.pdf"
      }
    }
  ],
  "sort": {
    "dateSaisie": "2018-05-15T22:38:28.000+02:00",
    "sortEnSeance": "Retiré"
  },
  "dateDepot": "2018-05-04T02:00:00.000+02:00",
  "dateDistribution": "2018-05-14T02:00:00.000+02:00",
  "article99": "0",
  "loiReference": {}
}