{
  "uid": "AMANR5L15PO419610B0846P0D1N1166",
  "identifiant": {
    "legislature": "15",
    "numero": "1166",
    "numRect": "0",
    "saisine": {
      "texteLegislatifRef": "PRJLANR5L15B0846",
      "numeroPartiePLF": "0",
      "organeExamen": "PO419610",
      "mentionSecondeDeliberation": "0"
    }
  },
  "numeroLong": "CE1166",
  "etapeTexte": "1ère lecture (1ère assemblée saisie)",
  "triAmendement": "ons",
  "cardinaliteAmdtMultiples": "1",
  "etat": "Discuté",
  "signataires": {
    "auteur": {
      "typeAuteur": "Depute",
      "acteurRef": "PA266808",
      "groupePolitiqueRef": "PO730934"
    },
    "cosignatairesRefs": [
      "PA712015",
      "PA266797",
      "PA642847",
      "PA709315",
      "PA267735",
      "PA267527",
      "PA767",
      "PA605036",
      "PA266808",
      "PA2377",
      "PA266793",
      "PA720644",
      "PA340853"
    ],
    "texteAffichable": "M.&#160;Rolland,  M.&#160;Abad, M.&#160;Bony, M.&#160;de Ganay, M.&#160;Dive, M.&#160;Gosselin, M.&#160;Leclerc, M.&#160;Perrut, M.&#160;Viala, M.&#160;Saddier, M.&#160;Cattin, M.&#160;Nury et M.&#160;Bazin"
  },
  "pointeurFragmentTexte": {
    "division": {
      "titre": "Article 17",
      "articleDesignationCourte": "ART. 17",
      "type": "ARTICLE",
      "avantAApres": "A",
      "divisionRattachee": "ARTICLE 17",
      "urlDivisionTexteVise": "/15/textes/0846.asp#D_Article_17"
    },
    "alinea": {
      "avantAApres": "A",
      "numero": "4",
      "alineaDesignation": "Alinéa 4"
    }
  },
  "corps": {
    "dispositif": "<p style=\"text-align: justify;\">Compl&#233;ter l&#8217;alin&#233;a&#160;4 par la phrase suivante&#160;:</p><p style=\"text-align: justify;\">&#171;&#160;Ce seuil fix&#233; par d&#233;cret ne pourra pas &#234;tre inf&#233;rieur &#224; 5 000 dans un premier temps&#160;&#187;.</p>",
    "exposeSommaire": "<p style=\"text-align: justify;\">Cet amendement vise &#224; exon&#233;rer, au moins dans un premier temps, les communes ayant moins de 5 000 habitants de l&#8217;obligation de d&#233;mat&#233;rialisation des demandes d&#8217;autorisation d&#8217;urbanisme.</p><p style=\"text-align: justify;\">En effet, ces communes n&#8217;ont pas toujours les moyens financiers et humains pour s&#8217;adapter &#224; ces nouvelles normes. De plus, le volume de demandes d&#8217;urbanisme qu&#8217;elles traitent est forc&#233;ment moins cons&#233;quent.</p><p style=\"text-align: justify;\">Par cons&#233;quent, cet amendement laisse le pouvoir aux &#233;lus locaux des communes de moins de 5 000 habitants de d&#233;cider du bien fond&#233; de la d&#233;mat&#233;rialisation, et d&#8217;y adh&#233;rer volontairement si ils en ressentent le besoin et l&#8217;int&#233;r&#234;t pour leurs administr&#233;s.</p>"
  },
  "representations": [
    {
      "nom": "PDF",
      "typeMime": {
        "type": "application",
        "subType": "PDF"
      },
      "statutRepresentation": {
        "verbatim": true,
        "canonique": true,
        "officielle": true,
        "transcription": false,
        "enregistrement": false
      },
      "contenu": {
        "documentURI": "/15/amendements/0846/CION-ECO/CE1166.pdf"
      }
    }
  ],
  "sort": {
    "dateSaisie": "2018-05-16T18:06:51.000+02:00",
    "sortEnSeance": "Rejeté"
  },
  "dateDepot": "2018-05-09T02:00:00.000+02:00",
  "dateDistribution": "2018-05-14T02:00:00.000+02:00",
  "article99": "0",
  "loiReference": {}
}