{
  "uid": "AMANR5L15PO419604B2272P2D1N17",
  "identifiant": {
    "legislature": "15",
    "numero": "17",
    "numRect": "0",
    "saisine": {
      "texteLegislatifRef": "PRJLANR5L15B2272",
      "numeroPartiePLF": "2",
      "organeExamen": "PO419604",
      "mentionSecondeDeliberation": "0"
    }
  },
  "numeroLong": "II-AC17",
  "etapeTexte": "1ère lecture (1ère assemblée saisie)",
  "triAmendement": "abeiaaaaaaaaaaaaaaaaaaaaaaaaaaaaaaaaaaaaaaaaaaaaaai",
  "cardinaliteAmdtMultiples": "1",
  "etat": "Discuté",
  "signataires": {
    "auteur": {
      "typeAuteur": "Depute",
      "acteurRef": "PA340357",
      "groupePolitiqueRef": "PO758835"
    },
    "cosignatairesRefs": [
      "PA429893",
      "PA608741",
      "PA607553",
      "PA1809",
      "PA608695",
      "PA609590",
      "PA335532",
      "PA1198",
      "PA1008",
      "PA642764",
      "PA340357",
      "PA340343",
      "PA333818",
      "PA337483",
      "PA720988",
      "PA335054",
      "PA608172",
      "PA719930",
      "PA342415",
      "PA508",
      "PA605069",
      "PA608011",
      "PA1592",
      "PA643145",
      "PA267233",
      "PA610681",
      "PA609332",
      "PA333285",
      "PA332614"
    ],
    "texteAffichable": "Mme&#160;Victory,  Mme&#160;Laurence&#160;Dumont, Mme&#160;Manin, Mme&#160;Tolmont, M.&#160;Aviragnet, Mme&#160;Bareigts, Mme&#160;Battistel, Mme&#160;Bi&#233;mouret, M.&#160;Bouillon, M.&#160;Jean-Louis&#160;Bricout, M.&#160;Carvounas, M.&#160;Alain&#160;David, M.&#160;Faure, M.&#160;Garot, M.&#160;David&#160;Habib, M.&#160;Hutin, M.&#160;Juanico, Mme&#160;Karamanli, M.&#160;J&#233;r&#244;me&#160;Lambert, M.&#160;Letchimy, Mme&#160;Pau-Langevin, Mme&#160;Pires Beaune, M.&#160;Potier, M.&#160;Pueyo, Mme&#160;Rabault, M.&#160;Saulignac, Mme&#160;Untermaier, Mme&#160;Vainqueur-Christophe et M.&#160;Vallaud"
  },
  "pointeurFragmentTexte": {
    "missionVisee": {
      "idMissionAN": "813",
      "libelleMission": "Enseignement scolaire",
      "codeMissionPLF": "B",
      "libelleMissionPLF": "Répartition, par mission et programme, des crédits du budget général"
    },
    "division": {
      "titre": "Article 76",
      "articleDesignationCourte": "APRÈS ART. 76",
      "type": "ARTICLE",
      "avantAApres": "Apres",
      "divisionRattachee": "APRÈS L'ARTICLE 76, insérer l'article suivant:",
      "articleAdditionnel": "1",
      "urlDivisionTexteVise": "/15/textes/2272C.asp#D_Article_76"
    }
  },
  "corps": {
    "dispositif": "<p style=\"text-align: justify;\">Dans un d&#233;lai de six mois &#224; compter de la promulgation de la pr&#233;sente loi, le Gouvernement remet au Parlement un rapport sur le recrutement des enseignants contractuels et leurs &#233;volutions de carri&#232;re.</p>",
    "exposeSommaire": "<p style=\"text-align: justify;\">Cet amendement du groupe Socialistes et apparent&#233;s vise &#224; demander au Gouvernement de remettre au Parlement un rapport sur la situation des enseignants contractuels dans le premier et le second degr&#233;.</p><p style=\"text-align: justify;\">L&#8217;Education nationale emploie pr&#232;s de 39&#160;000 enseignants contractuels, et ce chiffre est en constante augmentation. Derri&#232;re une apparence de flexibilit&#233; et d&#8217;adaptabilit&#233; se cache une tr&#232;s forte pr&#233;carit&#233; de ces enseignants, et une instabilit&#233; dans leur parcours.</p><p style=\"text-align: justify;\">Alors qu&#8217;ils exercent aujourd&#8217;hui les m&#234;mes fonctions que les enseignants titulaires, ils travaillent au quotidien avec un risque de non renouvellement de contrat, qui ne peut &#234;tre propice &#224; un enseignement de qualit&#233;.</p><p style=\"text-align: justify;\">L&#8217;augmentation massive du recours &#224; ces types de contrats dans certaines acad&#233;mies alerte sur la gestion des ressources humaines de l&#8217;&#233;ducation nationale.</p><p style=\"text-align: justify;\">Afin d&#8217;&#233;claircir les modalit&#233;s de recours aux enseignants contractuels, leur co&#251;t, les possibilit&#233;s de titularisation et d&#8217;&#233;volution de carri&#232;re de ces enseignants, le pr&#233;sent amendement propose la remise d&#8217;un rapport sur le sujet.</p>"
  },
  "representations": [
    {
      "nom": "PDF",
      "typeMime": {
        "type": "application",
        "subType": "PDF"
      },
      "statutRepresentation": {
        "verbatim": true,
        "canonique": true,
        "officielle": true,
        "transcription": false,
        "enregistrement": false
      },
      "contenu": {
        "documentURI": "/15/amendements/2272C/CION-CEDU/AC17.pdf"
      }
    }
  ],
  "sort": {
    "dateSaisie": "2019-10-23T18:36:41.000+02:00",
    "sortEnSeance": "Rejeté"
  },
  "dateDepot": "2019-10-17T02:00:00.000+02:00",
  "dateDistribution": "2019-10-22T02:00:00.000+02:00",
  "article99": "0",
  "loiReference": {}
}