{
  "uid": "AMANR5L15PO59051B1785P0D1N180",
  "identifiant": {
    "legislature": "15",
    "numero": "180",
    "numRect": "0",
    "saisine": {
      "texteLegislatifRef": "PIONANR5L15B1785",
      "numeroPartiePLF": "0",
      "organeExamen": "PO59051",
      "mentionSecondeDeliberation": "0"
    }
  },
  "numeroLong": "CL180",
  "etapeTexte": "1ère lecture (1ère assemblée saisie)",
  "triAmendement": "diaaaaaaaaaaaaaaaaaaaaaaaaaaaaaaaaaaaaaaaaaaaaaaaaj",
  "cardinaliteAmdtMultiples": "1",
  "etat": "Discuté",
  "signataires": {
    "auteur": {
      "typeAuteur": "Depute",
      "acteurRef": "PA720430",
      "groupePolitiqueRef": "PO730958"
    },
    "cosignatairesRefs": [
      "PA721226",
      "PA588884",
      "PA719578",
      "PA719676",
      "PA722142",
      "PA718868",
      "PA720422",
      "PA720286",
      "PA721210",
      "PA720430",
      "PA721202",
      "PA720846",
      "PA2150",
      "PA718860",
      "PA721062",
      "PA721960",
      "PA720892"
    ],
    "texteAffichable": "M.&#160;Bernalicis,  Mme&#160;Autain, M.&#160;Coquerel, M.&#160;Corbi&#232;re, Mme&#160;Fiat, M.&#160;Lachaud, M.&#160;Larive, M.&#160;M&#233;lenchon, Mme&#160;Obono, Mme&#160;Panot, M.&#160;Prud&apos;homme, M.&#160;Quatennens, M.&#160;Ratenon, Mme&#160;Ressiguier, Mme&#160;Rubin, M.&#160;Ruffin et Mme&#160;Taurine"
  },
  "pointeurFragmentTexte": {
    "division": {
      "titre": "Article 3",
      "articleDesignationCourte": "APRÈS ART. 3",
      "type": "ARTICLE",
      "avantAApres": "Apres",
      "divisionRattachee": "APRÈS L'ARTICLE 3, insérer l'article suivant:",
      "articleAdditionnel": "1",
      "urlDivisionTexteVise": "/15/textes/1785.asp#D_Article_3"
    }
  },
  "corps": {
    "dispositif": "<p>&#171;&#160;Les op&#233;rateurs d&#233;sign&#233;s &#224; l&#8217;article&#160;1<sup>er</sup> mettent &#224; disposition une information relative &#224; l&#8217;accompagnement des personnes qui ont fait l&#8217;objet de haine cibl&#233;e ou de campagne de harc&#232;lement par des associations ou des organes publics.&#160;&#187;</p>",
    "exposeSommaire": "<p style=\"text-align: justify;\">Par cet amendement, nous souhaitons que les plateformes num&#233;riques mettent en place des dispositifs d'information et de communication visant &#224; lutter contre la haine en ligne. Aujourd'hui, le r&#233;gime de responsabilit&#233; et les obligations qui reposent sur les plateformes ne sont pas &#224; la hauteur de l'importance de ces derni&#232;res dans les usages num&#233;riques quotidiens des citoyens. 40% des jeunes disent avoir &#233;t&#233; victimes d&#8217;une agression en ligne et pourtant, les plateformes, et notamment les grandes plateformes de r&#233;seaux sociaux, jouent de l&#8217;ambigu&#239;t&#233; inh&#233;rente &#224; leur statut juridique d'h&#233;bergeur, laissant se d&#233;ployer une culture de l'impunit&#233;. De ce fait, est indirectement tol&#233;r&#233; le d&#233;ferlement de propos de haine viraux. Dans les espaces en ligne, malgr&#233; le contexte #MeToo et le mouvement de lib&#233;ration de la parole des femmes, 73% de femmes d&#233;clarent avoir d&#233;j&#224; &#233;t&#233; victimes d&#8217;agressions en ligne. <br />Cependant, la r&#233;ponse &#224; adresser &#224; ce fl&#233;au ne saurait &#234;tre uniquement p&#233;nale, les dispositifs exstants nous semblant d&#233;j&#224; satisfaisants. A la lumi&#232;re des d&#233;bats r&#233;cents sur la &#171; Ligue du Lol &#187; qui ont vu &#233;merger une prise de conscience tardive de l'existence de comportements en ligne d&#233;gradants, l'enjeu de la sensibilisation et de la bonne information est central sur ces sujets. Il s'agit d'alerter les citoyen&#183;ne&#183;s sur le fait que leur responsabilit&#233; est engag&#233;e dans les espaces en ligne et que le monde virtuel n'emp&#234;che pas le respect de principes &#233;l&#233;mentaires. Concernant les victimes, nous proposons une campagne d'information visant &#224; faire conna&#238;tre les associations principales, qui luttent pour la reconnaissance des victimes de cyberviolence et de cyberharc&#232;lement et qui leur apportent soutien et prise en charge. Afin de mener &#224; bien ce projet, l'une des pistes &#224; &#233;tudier pourrait &#234;tre l'allocation d'une partie de l'espace publicitaire disponible des plateformes &#224; ces campagnes.</p>"
  },
  "representations": [
    {
      "nom": "PDF",
      "typeMime": {
        "type": "application",
        "subType": "PDF"
      },
      "statutRepresentation": {
        "verbatim": true,
        "canonique": true,
        "officielle": true,
        "transcription": false,
        "enregistrement": false
      },
      "contenu": {
        "documentURI": "/15/amendements/1785/CION_LOIS/CL180.pdf"
      }
    }
  ],
  "sort": {
    "dateSaisie": "2019-06-19T17:43:01.000+02:00",
    "sortEnSeance": "Rejeté"
  },
  "dateDepot": "2019-06-14T02:00:00.000+02:00",
  "dateDistribution": "2019-06-17T02:00:00.000+02:00",
  "article99": "0",
  "loiReference": {
    "codeLoi": "zzz"
  }
}