{
  "uid": "AMANR5L15SEA717460BTC1955P0D1N598",
  "identifiant": {
    "legislature": "15",
    "numero": "598",
    "numRect": "0",
    "saisine": {
      "texteLegislatifRef": "PNREANR5L15BTC1955",
      "numeroPartiePLF": "0",
      "organeExamen": "PO717460",
      "mentionSecondeDeliberation": "1"
    }
  },
  "numeroLong": "598",
  "etapeTexte": "Lecture unique",
  "triAmendement": "jcaaaaaaaaaaaaaaaaaaaaaaaaaaaaaaaaaaaaaaaaaaaaaaaams",
  "cardinaliteAmdtMultiples": "1",
  "etat": "Discuté",
  "signataires": {
    "auteur": {
      "typeAuteur": "Depute",
      "acteurRef": "PA346218",
      "groupePolitiqueRef": "PO730934"
    },
    "cosignatairesRefs": [
      "PA267204",
      "PA607090",
      "PA334654",
      "PA720386",
      "PA332523",
      "PA336316",
      "PA267378",
      "PA1327",
      "PA721506",
      "PA606098",
      "PA643089",
      "PA642847",
      "PA721286",
      "PA718884",
      "PA721474",
      "PA330909",
      "PA266774",
      "PA719318",
      "PA721816",
      "PA606712",
      "PA267450",
      "PA267429",
      "PA718780",
      "PA340853",
      "PA721314",
      "PA266793",
      "PA266808",
      "PA346218",
      "PA718838",
      "PA330684",
      "PA709315",
      "PA608016",
      "PA267260",
      "PA267735"
    ],
    "texteAffichable": "M.&#160;Masson,  M.&#160;Bazin, Mme&#160;Bazin-Malgras, Mme&#160;Anthoine, M.&#160;Bony, M.&#160;Boucard, M.&#160;Bouchet, Mme&#160;Val&#233;rie&#160;Boyer, M.&#160;Brun, M.&#160;Cinieri, Mme&#160;Dalloz, M.&#160;R&#233;mi&#160;Delatte, M.&#160;de Ganay, M.&#160;Descoeur, M.&#160;Di Filippo, M.&#160;Forissier, M.&#160;Furst, Mme&#160;Kuster, M.&#160;Leclerc, Mme&#160;Levy, Mme&#160;Louwagie, M.&#160;Lurton, M.&#160;Marleix, Mme&#160;Poletti, M.&#160;Ramadier, M.&#160;Rolland, M.&#160;Schellenberger, M.&#160;Sermier, M.&#160;Straumann, M.&#160;Thi&#233;riot, Mme&#160;Trastour-Isnart, M.&#160;Viala, M.&#160;Jean-Pierre&#160;Vigier et M.&#160;Viry"
  },
  "pointeurFragmentTexte": {
    "division": {
      "titre": "Article 27",
      "articleDesignationCourte": "ART. 27",
      "type": "ARTICLE",
      "avantAApres": "A",
      "divisionRattachee": "ARTICLE 27",
      "urlDivisionTexteVise": "/15/textes/1955.asp#D_Article_27"
    },
    "alinea": {
      "numero": "2"
    }
  },
  "corps": {
    "dispositif": "<p style=\"text-align: justify;\">&#192; la premi&#232;re phrase de l&#8217;alin&#233;a&#160;2, apr&#232;s le mot&#160;: </p><p style=\"text-align: justify;\">&#171;&#160;identiques&#160;&#187;, </p><p style=\"text-align: justify;\">ins&#233;rer les mots&#160;: </p><p style=\"text-align: justify;\">&#171;&#160;dans leurs dispositifs et leurs expos&#233;s des motifs&#160;&#187;.</p>",
    "exposeSommaire": "<p style=\"text-align: justify;\">Amendement de repli.</p><p style=\"text-align: justify;\">La limitation des interventions &#224; un seul orateur par groupe parlementaire sur les amendements identiques restreint consid&#233;rablement la possibilit&#233; d&#8217;enrichir le d&#233;bat sur l&#8217;examen des projets et des propositions de loi en premi&#232;re lecture puisque des d&#233;put&#233;s appartenant &#224; un m&#234;me groupe parlementaire et pr&#233;sentant des amendements identiques ne pourraient plus exposer les diff&#233;rentes opportunit&#233;s et motivations de ces amendements.</p>"
  },
  "representations": [
    {
      "nom": "PDF",
      "typeMime": {
        "type": "application",
        "subType": "PDF"
      },
      "statutRepresentation": {
        "verbatim": true,
        "canonique": true,
        "officielle": true,
        "transcription": false,
        "enregistrement": false
      },
      "contenu": {
        "documentURI": "/15/amendements/1955/AN/598.pdf"
      }
    }
  ],
  "seanceDiscussion": "RUANR5L15S2019IDS21670",
  "sort": {
    "dateSaisie": "2019-05-29T18:37:07.000+02:00",
    "sortEnSeance": "Non soutenu"
  },
  "dateDepot": "2019-05-24T02:00:00.000+02:00",
  "dateDistribution": "2019-05-27T02:00:00.000+02:00",
  "article99": "0",
  "loiReference": {}
}