{
  "uid": "AMANR5L15SEA717460BTC1662P0D1N442",
  "identifiant": {
    "legislature": "15",
    "numero": "442",
    "numRect": "1",
    "saisine": {
      "texteLegislatifRef": "PIONANR5L15BTC1662",
      "numeroPartiePLF": "0",
      "organeExamen": "PO717460",
      "mentionSecondeDeliberation": "1"
    }
  },
  "numeroLong": "442 (Rect)",
  "etapeTexte": "1ère lecture (2ème assemblée saisie)",
  "triAmendement": "jaaaaaaaaaaaaaaaaaaaaaaaaaaaaaaaaaaaaaaaaaaaaaaaaajo",
  "cardinaliteAmdtMultiples": "1",
  "etat": "Discuté",
  "signataires": {
    "auteur": {
      "typeAuteur": "Depute",
      "acteurRef": "PA722110",
      "groupePolitiqueRef": "PO730940"
    },
    "cosignatairesRefs": [
      "PA720546",
      "PA610667",
      "PA718926",
      "PA335612",
      "PA721270",
      "PA722110",
      "PA721012",
      "PA720692",
      "PA267306",
      "PA610654",
      "PA721118",
      "PA441",
      "PA689",
      "PA718720",
      "PA722202",
      "PA721896"
    ],
    "texteAffichable": "M.&#160;Wulfranc,  M.&#160;Jumel, Mme&#160;Bello, M.&#160;Brotherson, M.&#160;Bruneel, Mme&#160;Buffet, M.&#160;Chassaigne, M.&#160;Dharr&#233;ville, M.&#160;Dufr&#232;gne, Mme&#160;Faucillon, Mme&#160;K&#233;clard-Mond&#233;sir, M.&#160;Lecoq, M.&#160;Nilor, M.&#160;Peu, M.&#160;Fabien&#160;Roussel et M.&#160;Serville"
  },
  "pointeurFragmentTexte": {
    "division": {
      "titre": "Article 8",
      "articleDesignationCourte": "ART. 8",
      "type": "ARTICLE",
      "avantAApres": "A",
      "divisionRattachee": "ARTICLE 8",
      "urlDivisionTexteVise": "/15/textes/1662.asp#D_Article_8"
    },
    "alinea": {
      "numero": "5"
    }
  },
  "corps": {
    "dispositif": "<p>Supprimer l&#8217;alin&#233;a&#160;5.</p>",
    "exposeSommaire": "<p style=\"text-align: justify;\">Les auteurs de cet amendement ne souhaitent pas que la future Agence Nationale de Coh&#233;sion des Territoires embauche des salari&#233;s de droit priv&#233;. Ils estiment que sa forme d&#8217;&#233;tablissement public et les missions particuli&#232;res qui lui sont confi&#233;es n&#233;cessitent le recours exclusif &#224; l&#8217;emploi de droit public. Ils pr&#233;conisent d&#8217;ailleurs que les agents du CGET, de l&#8217;agence num&#233;rique et de l&#8217;EPARECA soient repris sous contrat public comme la loi le permet.</p>"
  },
  "representations": [
    {
      "nom": "PDF",
      "typeMime": {
        "type": "application",
        "subType": "PDF"
      },
      "statutRepresentation": {
        "verbatim": true,
        "canonique": true,
        "officielle": true,
        "transcription": false,
        "enregistrement": false
      },
      "contenu": {
        "documentURI": "/15/amendements/1662/AN/442.pdf"
      }
    }
  ],
  "seanceDiscussion": "RUANR5L15S2019IDS21545",
  "sort": {
    "dateSaisie": "2019-03-13T02:36:25.000+01:00",
    "sortEnSeance": "Tombé"
  },
  "dateDepot": "2019-03-07T01:00:00.000+01:00",
  "dateDistribution": "2019-03-11T01:00:00.000+01:00",
  "article99": "0",
  "loiReference": {}
}