{
  "uid": "AMANR5L15PO419865B1831P0D1N1973",
  "identifiant": {
    "legislature": "15",
    "numero": "1973",
    "numRect": "0",
    "saisine": {
      "texteLegislatifRef": "PRJLANR5L15B1831",
      "numeroPartiePLF": "0",
      "organeExamen": "PO419865",
      "mentionSecondeDeliberation": "0"
    }
  },
  "numeroLong": "CD1973",
  "etapeTexte": "1ère lecture (2ème assemblée saisie)",
  "triAmendement": "jkaaaaaaaaaaaaaaaaaaaaaaaaaaaaaaaaaaaaaaaaaaaaaaaabwzy",
  "cardinaliteAmdtMultiples": "1",
  "etat": "Discuté",
  "signataires": {
    "auteur": {
      "typeAuteur": "Depute",
      "acteurRef": "PA609245",
      "groupePolitiqueRef": "PO730934"
    },
    "cosignatairesRefs": [
      "PA720210",
      "PA721636",
      "PA330684",
      "PA643089",
      "PA609245"
    ],
    "texteAffichable": "Mme&#160;Lacroute,  M.&#160;Thi&#233;riot, Mme&#160;Beauvais, M.&#160;Parigi et Mme&#160;Val&#233;rie&#160;Boyer"
  },
  "pointeurFragmentTexte": {
    "division": {
      "titre": "Article 33 ter",
      "articleDesignationCourte": "ART. 33 TER",
      "type": "ARTICLE",
      "avantAApres": "A",
      "divisionRattachee": "ARTICLE 33 TER",
      "urlDivisionTexteVise": "/15/textes/1831.asp#D_Article_33_ter"
    },
    "alinea": {
      "numero": "4"
    }
  },
  "corps": {
    "dispositif": "<p style=\"text-align: justify;\">I.&#160;&#8211;&#160;R&#233;diger ainsi le d&#233;but de l&#8217;alin&#233;a&#160;4&#160;:</p><p style=\"text-align: justify;\">&#171;&#160;<i>Art.&#160;L.&#160;3117&#8209;1</i>.&#160;&#8211;&#160;Les conducteurs de transport en commun affect&#233;s &#224; l&#8217;ex&#233;cution des services de transport public collectif de personnes dont la liste est d&#233;finie par arr&#234;t&#233; disposent d&#8217;un syst&#232;me d&#8217;information...<i>(le reste sans changement)</i>.&#160;&#187;</p><p style=\"text-align: justify;\">II.&#160;&#8211;&#160;Compl&#233;ter cet article par l&#8217;alin&#233;a suivant&#160;:</p><p style=\"text-align: justify;\">&#171;&#160;L&#8217;obligation mentionn&#233;e au premier alin&#233;a ne s&#8217;applique pas aux services pour lesquels une reconnaissance pr&#233;alable du parcours est obligatoire.&#160;&#187;</p>",
    "exposeSommaire": "<p style=\"text-align: justify;\">Cet amendement vise &#224; apporter plusieurs pr&#233;cisions&#160;:</p><p style=\"text-align: justify;\">-&#160; tout d&#8217;abord que l&#8217;obligation s&#8217;applique aux transports en commun de personnes et non pas &#224; l&#8217;ensemble des services</p><p style=\"text-align: justify;\">-&#160; ensuite que l&#8217;&#233;quipement n&#8217;est pas forc&#233;ment li&#233; au v&#233;hicule mais doit &#234;tre disponible pour le conducteur (possibilit&#233; d&#8217;utiliser une application mobile)</p><p style=\"text-align: justify;\">-&#160; enfin que les prestations de transport en commun soumises &#224; l&#8217;obligation d&#8217;&#233;quipement d&#8217;un dispositif d&#8217;information signalant la pr&#233;sence d&#8217;un passage &#224; niveau sont d&#233;finies par arr&#234;t&#233;.</p><p style=\"text-align: justify;\">En effet, l&#8217;&#233;quipement en GPS ou en smartphone de l&#8217;ensemble des 100&#160;000 v&#233;hicules composant le parc fran&#231;ais des autobus et autocars n&#8217;est pas utile pour les circuits sur lesquels une reconnaissance du parcours est effectu&#233;e ou pour ceux qui n&#8217;empruntent pas de passage &#224; niveau.</p><p style=\"text-align: justify;\">Il convient donc de lister par voie r&#232;glementaire les services concern&#233;s afin d&#8217;exclure les services urbains et les services r&#233;guliers pour lesquels une reconnaissance pr&#233;alable du parcours est obligatoire.</p>"
  },
  "representations": [
    {
      "nom": "PDF",
      "typeMime": {
        "type": "application",
        "subType": "PDF"
      },
      "statutRepresentation": {
        "verbatim": true,
        "canonique": true,
        "officielle": true,
        "transcription": false,
        "enregistrement": false
      },
      "contenu": {
        "documentURI": "/15/amendements/1831/CION-DVP/CD1973.pdf"
      }
    }
  ],
  "sort": {
    "dateSaisie": "2019-05-22T18:51:22.000+02:00",
    "sortEnSeance": "Retiré"
  },
  "dateDepot": "2019-05-09T02:00:00.000+02:00",
  "dateDistribution": "2019-05-19T02:00:00.000+02:00",
  "article99": "0",
  "loiReference": {}
}