{
  "uid": "AMANR5L15PO59048B1255P2D1N185",
  "identifiant": {
    "legislature": "15",
    "numero": "185",
    "numRect": "0",
    "saisine": {
      "texteLegislatifRef": "PRJLANR5L15B1255",
      "numeroPartiePLF": "2",
      "organeExamen": "PO59048",
      "mentionSecondeDeliberation": "0"
    }
  },
  "numeroLong": "II-CF185",
  "etapeTexte": "1ère lecture (1ère assemblée saisie)",
  "triAmendement": "baoaaaaaaaaaaaaaaaaaaaaaaaaaaaaaaaaaaaaaaaaaaaaaaasi",
  "cardinaliteAmdtMultiples": "1",
  "etat": "Discuté",
  "signataires": {
    "auteur": {
      "typeAuteur": "Depute",
      "acteurRef": "PA608172",
      "groupePolitiqueRef": "PO758835"
    },
    "cosignatairesRefs": [
      "PA608172",
      "PA609590",
      "PA605069"
    ],
    "texteAffichable": "Mme&#160;Pires Beaune,  M.&#160;Jean-Louis&#160;Bricout, Mme&#160;Rabault et les membres du groupe Socialistes et apparent&#233;s"
  },
  "pointeurFragmentTexte": {
    "missionVisee": {
      "idMissionAN": "401",
      "libelleMission": "Direction de l'action du Gouvernement",
      "codeMissionPLF": "B",
      "libelleMissionPLF": "Répartition, par mission et programme, des crédits du budget général"
    },
    "division": {
      "titre": "ÉTAT B",
      "articleDesignationCourte": "ART. 39",
      "type": "ANNEXE",
      "avantAApres": "A",
      "divisionRattachee": "ARTICLE 39",
      "urlDivisionTexteVise": "/15/textes/1255C.asp#D_ETAT_B"
    }
  },
  "corps": {
    "exposeSommaire": "<p style=\"text-align: justify;\">Le groupe socialiste propose, &#224; travers cet amendement, d&#8217;augmenter le budget du D&#233;fenseur des droits de 2 millions d&#8217;euros.</p><p style=\"text-align: justify;\">En effet, les missions essentielles conf&#233;r&#233;es &#224; cette autorit&#233; constitutionnelle justifie que l&#8217;&#201;tat y consacre les efforts budg&#233;taires adapt&#233;s et ce d&#8217;autant plus que, de plus en plus populaire, les r&#233;clamations aupr&#232;s du D&#233;fenseur des droits ont bondi de +17,3&#160;% en 2 ans.</p><p style=\"text-align: justify;\">Cet amendement vise donc &#224; augmenter le programme &#171;&#160;Protection des droits et libert&#233;s&#160;&#187;, et plus particuli&#232;rement l&#8217;action 09 &#171;&#160;D&#233;fenseur des droits&#160;&#187; de 2 millions d&#8217;euros pr&#233;lev&#233;s sur le programme &#171;&#160;Moyens mutualis&#233;s des administrations d&#233;concentr&#233;es&#160;&#187; en plus particuli&#232;rement l&#8217;action 01 &#171;&#160;fonctionnement courant des directions d&#233;partementales et interminist&#233;rielles&#160;&#187;.&#160;</p>",
    "dispositifAmdtCredit": {
      "listeProgrammes": [
        {
          "libelle": "Coordination du travail gouvernemental",
          "id": "22224",
          "AE": {
            "montantPositif": "0",
            "montantNegatif": "0"
          },
          "CP": {
            "montantPositif": "0",
            "montantNegatif": "0"
          },
          "action": "modification"
        },
        {
          "libelle": "Protection des droits et libertés",
          "id": "22225",
          "AE": {
            "montantPositif": "2000000",
            "montantNegatif": "0"
          },
          "CP": {
            "montantPositif": "2000000",
            "montantNegatif": "0"
          },
          "action": "modification"
        },
        {
          "libelle": "Moyens mutualisés des administrations déconcentrées",
          "id": "22226",
          "AE": {
            "montantPositif": "0",
            "montantNegatif": "2000000"
          },
          "CP": {
            "montantPositif": "0",
            "montantNegatif": "2000000"
          },
          "action": "modification"
        }
      ],
      "totalAE": {
        "montantPositif": "2000000",
        "montantNegatif": "2000000",
        "solde": "0"
      },
      "totalCP": {
        "montantPositif": "2000000",
        "montantNegatif": "2000000",
        "solde": "0"
      }
    }
  },
  "representations": [
    {
      "nom": "PDF",
      "typeMime": {
        "type": "application",
        "subType": "PDF"
      },
      "statutRepresentation": {
        "verbatim": true,
        "canonique": true,
        "officielle": true,
        "transcription": false,
        "enregistrement": false
      },
      "contenu": {
        "documentURI": "/15/amendements/1255C/CION_FIN/CF185.pdf"
      }
    }
  ],
  "sort": {
    "dateSaisie": "2018-10-25T09:20:20.000+02:00",
    "sortEnSeance": "Non soutenu"
  },
  "dateDepot": "2018-10-18T02:00:00.000+02:00",
  "dateDistribution": "2018-10-24T02:00:00.000+02:00",
  "article99": "0",
  "loiReference": {}
}