{
  "uid": "AMANR5L15PO419610B0627P0D1N1537",
  "identifiant": {
    "legislature": "15",
    "numero": "1537",
    "numRect": "0",
    "saisine": {
      "texteLegislatifRef": "PRJLANR5L15B0627",
      "numeroPartiePLF": "0",
      "organeExamen": "PO419610",
      "mentionSecondeDeliberation": "0"
    }
  },
  "numeroLong": "CE1537",
  "etapeTexte": "1ère lecture (1ère assemblée saisie)",
  "triAmendement": "qjho",
  "cardinaliteAmdtMultiples": "1",
  "etat": "Discuté",
  "signataires": {
    "auteur": {
      "typeAuteur": "Depute",
      "acteurRef": "PA719480",
      "groupePolitiqueRef": "PO730964"
    },
    "cosignatairesRefs": [
      "PA719480"
    ],
    "texteAffichable": "M.&#160;Gaillard"
  },
  "pointeurFragmentTexte": {
    "division": {
      "titre": "Article PREMIER",
      "articleDesignationCourte": "ART. PREMIER",
      "type": "ARTICLE",
      "avantAApres": "A",
      "divisionRattachee": "ARTICLE PREMIER",
      "urlDivisionTexteVise": "/15/textes/0627.asp#D_Article_1er"
    },
    "alinea": {
      "numero": "40"
    }
  },
  "corps": {
    "dispositif": "<p style=\"text-align: justify;\">A l&#8217;alin&#233;a&#160;40, supprimer les mots&#160;: </p><p style=\"text-align: justify;\">&#171;&#160;la coop&#233;rative,&#160;&#187;. </p><p style=\"text-align: justify;\">&#160;</p>",
    "exposeSommaire": "<p style=\"text-align: justify;\">L&#8217;article L.&#160;631&#8209;24&#8209;3 II alin&#233;a&#160;2 pr&#233;voit que les coop&#233;ratives, comme les organisations de producteurs, r&#233;v&#232;lent &#171;&#160;en cascade&#160;&#187; les indicateurs auxquels elles se r&#233;f&#232;rent pour faire &#233;voluer le prix des apports aupr&#232;s de leurs coop&#233;rateurs. L&#8217;&#233;tude d&#8217;impact rel&#232;ve que cette r&#233;f&#233;rence faite dans les contrats avals des indicateurs pertinents &#224; l&#8217;amont conduira &#224; responsabiliser l&#8217;aval. Outre le fait que cette information rel&#232;ve du secret des affaires entre la coop&#233;rative et ses coop&#233;rateurs, le fait de la d&#233;voiler aux clients de la coop&#233;rative place cette derni&#232;re dans une situation de vuln&#233;rabilit&#233; vis-&#224;-vis de ses clients, notamment de la grande distribution, qui utiliseront la connaissance accrue qu&#8217;ils en tireront de la construction du prix du produits pour s&#8217;immiscer dans la politique de r&#233;mun&#233;ration des coop&#233;ratives. Dans les coop&#233;ratives, il y a une politique de retour de la valeur aux associ&#233;s coop&#233;rateurs qui repose fonci&#232;rement sur la possibilit&#233; d&#8217;ajuster a posteriori, en fin d&#8217;exercice, la redistribution des exc&#233;dents qui ont pu &#234;tre d&#233;gag&#233;s de l&#8217;activit&#233; aval. La mention des indicateurs &#171;&#160;en cascade&#160;&#187; ob&#232;re cette capacit&#233; des coop&#233;ratives &#224; faire jouer pleinement cette redistribution.</p>"
  },
  "representations": [
    {
      "nom": "PDF",
      "typeMime": {
        "type": "application",
        "subType": "PDF"
      },
      "statutRepresentation": {
        "verbatim": true,
        "canonique": true,
        "officielle": true,
        "transcription": false,
        "enregistrement": false
      },
      "contenu": {
        "documentURI": "/15/amendements/0627/CION-ECO/CE1537.pdf"
      }
    }
  ],
  "sort": {
    "dateSaisie": "2018-04-17T23:20:35.000+02:00",
    "sortEnSeance": "Non soutenu"
  },
  "dateDepot": "2018-04-13T02:00:00.000+02:00",
  "dateDistribution": "2018-04-16T02:00:00.000+02:00",
  "article99": "0",
  "loiReference": {}
}