{
  "uid": "AMANR5L15PO419610B0627P0D1N1046",
  "identifiant": {
    "legislature": "15",
    "numero": "1046",
    "numRect": "0",
    "saisine": {
      "texteLegislatifRef": "PRJLANR5L15B0627",
      "numeroPartiePLF": "0",
      "organeExamen": "PO419610",
      "mentionSecondeDeliberation": "0"
    }
  },
  "numeroLong": "CE1046",
  "etapeTexte": "1ère lecture (1ère assemblée saisie)",
  "triAmendement": "aabzrhnr",
  "cardinaliteAmdtMultiples": "1",
  "etat": "Discuté",
  "signataires": {
    "auteur": {
      "typeAuteur": "Depute",
      "acteurRef": "PA642788",
      "groupePolitiqueRef": "PO730964"
    },
    "cosignatairesRefs": [
      "PA642788"
    ],
    "texteAffichable": "M.&#160;V&#233;ran"
  },
  "pointeurFragmentTexte": {
    "division": {
      "titre": "Article 11",
      "articleDesignationCourte": "APRÈS ART. 11",
      "type": "ARTICLE",
      "avantAApres": "Apres",
      "divisionRattachee": "APRÈS L'ARTICLE 11, insérer l'article suivant:",
      "articleAdditionnel": "1",
      "urlDivisionTexteVise": "/15/textes/0627.asp#D_Article_11"
    }
  },
  "corps": {
    "dispositif": "<p style=\"text-align: justify;\">Le chapitre III du titre III du livre I<sup>er</sup> de la deuxi&#232;me partie du code de la sant&#233; publique est compl&#233;t&#233; par un article L.&#160;2133&#8209;1&#8209;1 ainsi r&#233;dig&#233;&#160;:</p><p style=\"text-align: justify;\">&#171;&#160;<i>Art.&#160;L.&#160;2133&#8209;1&#8209;1</i>.&#160;&#8211;&#160;Les messages publicitaires en faveur de denr&#233;es alimentaires sont accompagn&#233;s de la forme de pr&#233;sentation compl&#233;mentaire &#224; la d&#233;claration nutritionnelle recommand&#233;e par l&#8217;&#201;tat en application de l&#8217;article L.&#160;3232&#8209;8. Dans le cas des messages publicitaires sur internet, t&#233;l&#233;vis&#233;s ou radiodiffus&#233;s, cette obligation ne s&#8217;applique qu&#8217;aux messages &#233;mis et diffus&#233;s &#224; partir du territoire fran&#231;ais et re&#231;us sur ce territoire. La m&#234;me obligation d&#8217;information s&#8217;impose &#224; toute promotion, destin&#233;e au public, par voie d&#8217;imprim&#233;s et de publications p&#233;riodiques &#233;dit&#233;s par les producteurs ou distributeurs de ces produits.</p><p style=\"text-align: justify;\">&#171;&#160;Les annonceurs et les promoteurs peuvent d&#233;roger &#224; cette obligation sous r&#233;serve du versement d&#8217;une contribution dont le produit est affect&#233; &#224; l&#8217;Agence nationale de sant&#233; publique.</p><p style=\"text-align: justify;\">&#171;&#160;La contribution pr&#233;vue &#224; l&#8217;alin&#233;a pr&#233;c&#233;dent est assise, s&#8217;agissant des messages publicitaires, sur le montant annuel des sommes destin&#233;es &#224; l&#8217;&#233;mission et &#224; la diffusion de ces messages, hors remise, rabais, ristourne et taxe sur la valeur ajout&#233;e, pay&#233;es par les annonceurs. Le montant de cette contribution est &#233;gal &#224; 5&#160;% du montant de ces sommes.</p><p style=\"text-align: justify;\">&#171;&#160;La contribution pr&#233;vue au deuxi&#232;me alin&#233;a est assise, s&#8217;agissant des autres types de promotion de ces produits, sur la valeur hors taxe sur la valeur ajout&#233;e des d&#233;penses de r&#233;alisation et de distribution qui ont &#233;t&#233; engag&#233;es au titre de l&#8217;ann&#233;e civile pr&#233;c&#233;dente, diminu&#233;e des r&#233;ductions de prix obtenues des fournisseurs qui se rapportent express&#233;ment &#224; ces d&#233;penses. La base d&#8217;imposition des promoteurs qui effectuent tout ou partie des op&#233;rations de r&#233;alisation et de distribution avec leurs propres moyens d&#8217;exploitation est constitu&#233;e par le prix de revient hors taxe sur la valeur ajout&#233;e de toutes les d&#233;penses ayant concouru &#224; la r&#233;alisation desdites op&#233;rations. Le taux de la contribution est fix&#233; &#224; 5&#160;% du montant hors taxe sur la valeur ajout&#233;e de ces d&#233;penses.</p><p style=\"text-align: justify;\">&#171;&#160;Le fait g&#233;n&#233;rateur est constitu&#233; par la diffusion des messages publicitaires ou la mise &#224; disposition des documents vis&#233;s au premier alin&#233;a. La contribution est exigible au moment du paiement par l&#8217;annonceur aux r&#233;gies ou au moment de la premi&#232;re mise &#224; disposition des documents vis&#233;s. La contribution est d&#233;clar&#233;e, liquid&#233;e, recouvr&#233;e et contr&#244;l&#233;e selon les proc&#233;dures et sous les m&#234;mes sanctions, garanties et privil&#232;ges que la taxe sur la valeur ajout&#233;e. Les r&#233;clamations sont pr&#233;sent&#233;es, instruites et jug&#233;es selon les r&#232;gles applicables &#224; cette m&#234;me taxe. Il est op&#233;r&#233; un pr&#233;l&#232;vement de 1,5&#160;% effectu&#233; par l&#8217;&#201;tat sur le montant de cette contribution pour frais d&#8217;assiette et de recouvrement.</p><p style=\"text-align: justify;\">&#171;&#160;Les modalit&#233;s d&#8217;application du pr&#233;sent article sont d&#233;termin&#233;es par d&#233;cret en Conseil d&#8217;&#201;tat pris apr&#232;s avis de l&#8217;Agence nationale charg&#233;e de la s&#233;curit&#233; sanitaire de l&#8217;alimentation, de l&#8217;environnement et du travail et apr&#232;s consultation de l&#8217;Autorit&#233; de r&#233;gulation professionnelle de la publicit&#233;.</p><p style=\"text-align: justify;\">&#171;&#160;Le pr&#233;sent article entre en vigueur &#224; la date de publication du d&#233;cret mentionn&#233; au pr&#233;c&#233;dent alin&#233;a, et au plus tard le 1<sup>er</sup> janvier 2019.&#160;&#187;</p>",
    "exposeSommaire": "<p style=\"text-align: justify;\">Le Nutri-Score&#160;est une &#233;chelle graphique et visuelle de l&#8217;&#233;tiquetage nutritionnel, con&#231;ue par Sant&#233; Publique France, l&#8217;Anses et le Haut Conseil de la Sant&#233; Publique, recommand&#233;e par le Minist&#232;re de la Sant&#233;, salu&#233;e par l&#8217;OMS, les organisations de consommateurs et les professionnels de sant&#233;.</p><p style=\"text-align: justify;\">&#201;galement appel&#233; syst&#232;me 5 couleurs, il classe en 5 cat&#233;gories allant du A au E et du vert au rouge, les produits alimentaires, en fonction de leurs qualit&#233;s nutritionnelles. Ainsi, les produits riches en nutriments &#224; favoriser comme les fibres, les prot&#233;ines, les fruits et les l&#233;gumes, obtiendront un score plus proche du vert et du A, et ceux riches en nutriments &#224; limiter&#160;(sel, sucre, gras), un score plus proche du rouge et du E.</p><p style=\"text-align: justify;\">Cette information transparente et directe du grand public permet de r&#233;pondre &#224; un double objectif&#160;: mieux informer et sensibiliser le consommateur dans ses choix, et inciter les industriels &#224; am&#233;liorer la composition et la qualit&#233; nutritionnelle de leurs produits. Des &#233;tudes men&#233;es par les autorit&#233;s sanitaires ont d&#233;montr&#233; que le Nutri-Score orientait le choix des consommateurs vers des produits plus sains, en particulier les plus jeunes.</p><p style=\"text-align: justify;\">La mention du Nutri-Score sur les emballages n&#8217;est aujourd&#8217;hui pas obligatoire pour des raisons de conformit&#233; au droit&#160;europ&#233;en, mais recommand&#233;e par les autorit&#233;s. Aujourd&#8217;hui une cinquantaine d&#8217;entreprises se sont d&#233;j&#224; engag&#233;es &#224; l&#8217;apposer sur leurs produits.</p><p style=\"text-align: justify;\">Dans la lign&#233;e de la r&#233;volution de la pr&#233;vention que souhaite mener le Gouvernement, le pr&#233;sent amendement vise &#224; rendre obligatoire la mention du Nutri-Score sur tous les supports publicitaires pour les denr&#233;es alimentaires.</p><p style=\"text-align: justify;\">Le Nutri-Score viendrait ainsi s&#8217;ajouter aux dispositifs d&#233;j&#224; en place &#224; travers le programme &#171;&#160;Manger Bouger&#160;&#187;. Il concernerait les m&#234;mes produits que dans les moyennes et grandes surfaces, excluant donc les produits artisanaux, traiteur, bruts, infantiles et les boissons alcoolis&#233;es.</p><p style=\"text-align: justify;\">Cette disposition est une mesure de sant&#233; publique, pour mieux orienter le consommateur et mieux pr&#233;venir le d&#233;veloppement de maladies comme le diab&#232;te et l&#8217;ob&#233;sit&#233;.</p>"
  },
  "representations": [
    {
      "nom": "PDF",
      "typeMime": {
        "type": "application",
        "subType": "PDF"
      },
      "statutRepresentation": {
        "verbatim": true,
        "canonique": true,
        "officielle": true,
        "transcription": false,
        "enregistrement": false
      },
      "contenu": {
        "documentURI": "/15/amendements/0627/CION-ECO/CE1046.pdf"
      }
    }
  ],
  "sort": {
    "dateSaisie": "2018-04-19T21:47:30.000+02:00",
    "sortEnSeance": "Rejeté"
  },
  "dateDepot": "2018-04-12T02:00:00.000+02:00",
  "dateDistribution": "2018-04-17T02:00:00.000+02:00",
  "article99": "0",
  "loiReference": {
    "codeLoi": "santé publique",
    "divisionCodeLoi": "L2133-1-1"
  }
}