{
  "uid": "AMANR5L15PO59051B2357P0D1N866",
  "identifiant": {
    "legislature": "15",
    "numero": "866",
    "numRect": "0",
    "saisine": {
      "texteLegislatifRef": "PRJLANR5L15B2357",
      "numeroPartiePLF": "0",
      "organeExamen": "PO59051",
      "mentionSecondeDeliberation": "0"
    }
  },
  "numeroLong": "CL866",
  "etapeTexte": "1ère lecture (2ème assemblée saisie)",
  "triAmendement": "spaaaaaaaaaaaaaaaaaaaaaaaaaaaaaaaaaaaaaaaaaaaaaaaaoe",
  "cardinaliteAmdtMultiples": "1",
  "etat": "Discuté",
  "signataires": {
    "auteur": {
      "typeAuteur": "Depute",
      "acteurRef": "PA721094",
      "groupePolitiqueRef": "PO767217"
    },
    "cosignatairesRefs": [
      "PA721094",
      "PA610775"
    ],
    "texteAffichable": "M.&#160;Dunoyer et M.&#160;Gom&#232;s"
  },
  "pointeurFragmentTexte": {
    "division": {
      "titre": "Article 33",
      "articleDesignationCourte": "ART. 33",
      "type": "ARTICLE",
      "avantAApres": "A",
      "divisionRattachee": "ARTICLE 33",
      "urlDivisionTexteVise": "/15/textes/2357.asp#D_Article_33"
    },
    "alinea": {
      "numero": "36"
    }
  },
  "corps": {
    "dispositif": "<p style=\"text-align: justify;\">Compl&#233;ter l&#8217;alin&#233;a&#160;36 par les mots&#160;:</p><p style=\"text-align: justify;\">&#171;&#160;, nationales et relevant du&#160;2&#176;&#160;du&#160;I de l&#8217;article L.&#160;388.&#160;&#187;</p>",
    "exposeSommaire": "<p>L&#8217;article 33 cr&#233;&#233; un nouvel article L. 388-1 du code &#233;lectoral qui pr&#233;voit des modalit&#233;s sp&#233;cifiques d&#8217;application des dispositions introduites par le pr&#233;sent projet de loi sur la simplification du vote par procuration et le droit de vote des personnes d&#233;tenues, dans l&#8217;hypoth&#232;se o&#249; une personne d&#233;tenue dans tout &#233;tablissement p&#233;nitentiaire du territoire aurait vocation &#224; &#234;tre inscrite, sur sa demande ou d&#8217;office, dans une commune n&#233;ocal&#233;donienne. Cet amendement vise &#224; pr&#233;ciser la notion d&#8217; &#171;&#160;&#233;lections g&#233;n&#233;rales&#160;&#187; pour tenir compte du r&#233;gime &#233;lectoral sp&#233;cifique de la Nouvelle-Cal&#233;donie et &#233;viter toute difficult&#233; d&#8217;appr&#233;ciation, conform&#233;ment &#224; l&#8217;avis rendu par le Congr&#232;s de Nouvelle-Cal&#233;donie le 10 septembre dernier. Il serait ainsi pr&#233;cis&#233; que s&#8217;agissant de son application en Nouvelle-Cal&#233;donie, cette notion s&#8217;entend &#224; la fois des &#233;lections nationales et des &#233;lections des membres du congr&#232;s et des assembl&#233;es de province.</p>"
  },
  "representations": [
    {
      "nom": "PDF",
      "typeMime": {
        "type": "application",
        "subType": "PDF"
      },
      "statutRepresentation": {
        "verbatim": true,
        "canonique": true,
        "officielle": true,
        "transcription": false,
        "enregistrement": false
      },
      "contenu": {
        "documentURI": "/15/amendements/2357/CION_LOIS/CL866.pdf"
      }
    }
  ],
  "sort": {
    "dateSaisie": "2019-11-07T20:23:01.000+01:00",
    "sortEnSeance": "Retiré"
  },
  "dateDepot": "2019-11-02T01:00:00.000+01:00",
  "dateDistribution": "2019-11-05T01:00:00.000+01:00",
  "article99": "0",
  "loiReference": {}
}