{
  "uid": "AMANR5L15SEA717460B0485P0D1N462",
  "identifiant": {
    "legislature": "15",
    "numero": "462",
    "numRect": "0",
    "saisine": {
      "texteLegislatifRef": "PRJLANR5L15B0485",
      "numeroPartiePLF": "0",
      "organeExamen": "PO717460",
      "mentionSecondeDeliberation": "1"
    }
  },
  "numeroLong": "462",
  "etapeTexte": "Nouvelle Lecture",
  "triAmendement": "bdg",
  "cardinaliteAmdtMultiples": "1",
  "etat": "Discuté",
  "signataires": {
    "auteur": {
      "typeAuteur": "Rapporteur",
      "acteurRef": "PA267336",
      "organeRef": "PO59048",
      "groupePolitiqueRef": "PO730964"
    },
    "cosignatairesRefs": [
      "PA719480",
      "PA643175",
      "PA267336",
      "PA722054",
      "PA719472",
      "PA719060"
    ],
    "texteAffichable": "M.&#160;Giraud, rapporteur g&#233;n&#233;ral au nom de la commission des finances,  Mme&#160;Dupont, M.&#160;Cazeneuve, M.&#160;Jerretie, Mme&#160;Hai et M.&#160;Gaillard"
  },
  "pointeurFragmentTexte": {
    "division": {
      "titre": "Article 60",
      "articleDesignationCourte": "ART. 60",
      "type": "ARTICLE",
      "avantAApres": "A",
      "divisionRattachee": "ARTICLE 60",
      "urlDivisionTexteVise": "/15/textes/0485.asp#D_Article_60"
    },
    "alinea": {
      "numero": "28"
    }
  },
  "corps": {
    "dispositif": "<p style=\"text-align: justify;\">&#192; la premi&#232;re phrase de l&#8217;alin&#233;a&#160;28, substituer &#160;au premier montant&#160;:</p><p style=\"text-align: justify;\">&#171;&#160;90 millions d&#8217;euros&#160;&#187;</p><p style=\"text-align: justify;\">le montant&#160;:</p><p style=\"text-align: justify;\">&#171;&#160;110 millions d&#8217;euros&#160;&#187;</p>",
    "exposeSommaire": "<p style=\"text-align: justify;\">Le pr&#233;sent amendement vise &#224; majorer de 20M&#8364; la progression de la dotation de solidarit&#233; urbaine (DSU)</p><p style=\"text-align: justify;\">A l&#8217;aune des engagements du Chef de l&#8217;Etat et du gouvernement en mati&#232;re de coh&#233;sion des territoires, il semble n&#233;cessaire d&#8217;&#234;tre au rendez-vous afin qu&#8217;aucun citoyen ne soit mis de c&#244;t&#233;.</p><p style=\"text-align: justify;\">Il semble n&#233;cessaire de rappeler que la solidarit&#233; entre les territoires est le c&#339;ur de la p&#233;r&#233;quation. Il nous faut &#234;tre toujours vigilants afin d&#8217;envisager la r&#233;duction des &#233;carts de richesses entre communes riches et communes pauvres.</p>"
  },
  "representations": [
    {
      "nom": "PDF",
      "typeMime": {
        "type": "application",
        "subType": "PDF"
      },
      "statutRepresentation": {
        "verbatim": true,
        "canonique": true,
        "officielle": true,
        "transcription": false,
        "enregistrement": false
      },
      "contenu": {
        "documentURI": "/15/amendements/0485/AN/462.pdf"
      }
    }
  ],
  "seanceDiscussion": "RUANR5L15S2018IDS20842",
  "sort": {
    "dateSaisie": "2017-12-16T00:54:56.000+01:00",
    "sortEnSeance": "Adopté"
  },
  "dateDepot": "2017-12-14T01:00:00.000+01:00",
  "dateDistribution": "2017-12-14T01:00:00.000+01:00",
  "article99": "1",
  "loiReference": {}
}