{
  "uid": "AMANR5L15PO59048B0235P1D1N522",
  "identifiant": {
    "legislature": "15",
    "numero": "522",
    "numRect": "0",
    "saisine": {
      "texteLegislatifRef": "PRJLANR5L15B0235",
      "numeroPartiePLF": "1",
      "organeExamen": "PO59048",
      "mentionSecondeDeliberation": "0"
    }
  },
  "numeroLong": "I-CF522",
  "etapeTexte": "1ère lecture (1ère assemblée saisie)",
  "triAmendement": "dzi",
  "cardinaliteAmdtMultiples": "1",
  "etat": "Discuté",
  "signataires": {
    "auteur": {
      "typeAuteur": "Depute",
      "acteurRef": "PA942",
      "groupePolitiqueRef": "PO730952"
    },
    "cosignatairesRefs": [
      "PA942",
      "PA720230"
    ],
    "texteAffichable": "M.&#160;Charles&#160;de Courson et Mme&#160;Magnier"
  },
  "pointeurFragmentTexte": {
    "division": {
      "titre": "Article 12",
      "articleDesignationCourte": "ART. 12",
      "type": "ARTICLE",
      "avantAApres": "A",
      "divisionRattachee": "ARTICLE 12",
      "urlDivisionTexteVise": "/15/textes/0235A.asp#D_Article_12"
    },
    "alinea": {
      "avantAApres": "Apres",
      "numero": "16"
    }
  },
  "corps": {
    "dispositif": "<p style=\"text-align: justify;\">Apr&#232;s l&#8217;alin&#233;a&#160;16, ins&#233;rer l&#8217;alin&#233;a suivant&#160;: &#171;&#160;Des obligations, mentionn&#233;es &#224; l&#8217;article L213&#8209;5 du code mon&#233;taire et financier, appartenant aux personnes mentionn&#233;es au 1&#176;&#160;&#187;.</p>",
    "exposeSommaire": "<p style=\"text-align: justify;\">Cet amendement vise &#224; inclure dans l&#8217;assiette de l&#8217;imp&#244;t sur la fortune immobili&#232;re les obligations au sens de l&#8217;article L213-5 du code mon&#233;taire et financier.</p>"
  },
  "representations": [
    {
      "nom": "PDF",
      "typeMime": {
        "type": "application",
        "subType": "PDF"
      },
      "statutRepresentation": {
        "verbatim": true,
        "canonique": true,
        "officielle": true,
        "transcription": false,
        "enregistrement": false
      },
      "contenu": {
        "documentURI": "/15/amendements/0235A/CION_FIN/CF522.pdf"
      }
    }
  ],
  "sort": {
    "dateSaisie": "2017-10-12T09:06:29.000+02:00",
    "sortEnSeance": "Rejeté"
  },
  "dateDepot": "2017-10-07T02:00:00.000+02:00",
  "dateDistribution": "2017-10-11T02:00:00.000+02:00",
  "article99": "0",
  "loiReference": {}
}