{
  "uid": "AMANR5L15SEA717460BTC1974P0D1N2479",
  "identifiant": {
    "legislature": "15",
    "numero": "2479",
    "numRect": "0",
    "saisine": {
      "texteLegislatifRef": "PRJLANR5L15BTC1974",
      "numeroPartiePLF": "0",
      "organeExamen": "PO717460",
      "mentionSecondeDeliberation": "0"
    }
  },
  "numeroLong": "2479",
  "etapeTexte": "1ère lecture (2ème assemblée saisie)",
  "triAmendement": "odiaaaaaaaaaaaaaaaaaaaaaaaaaaaaaaaaaaaaaaaaaaaaaaac",
  "cardinaliteAmdtMultiples": "1",
  "etat": "Discuté",
  "signataires": {
    "auteur": {
      "typeAuteur": "Depute",
      "acteurRef": "PA722110",
      "groupePolitiqueRef": "PO730940"
    },
    "cosignatairesRefs": [
      "PA335612",
      "PA721896",
      "PA689",
      "PA718720",
      "PA441",
      "PA721118",
      "PA722110",
      "PA720546",
      "PA718926",
      "PA720692",
      "PA722202",
      "PA721012",
      "PA610667",
      "PA721270",
      "PA610654",
      "PA267306"
    ],
    "texteAffichable": "M.&#160;Wulfranc,  Mme&#160;Bello, M.&#160;Brotherson, M.&#160;Bruneel, Mme&#160;Buffet, M.&#160;Chassaigne, M.&#160;Dharr&#233;ville, M.&#160;Dufr&#232;gne, Mme&#160;Faucillon, M.&#160;Jumel, Mme&#160;K&#233;clard-Mond&#233;sir, M.&#160;Lecoq, M.&#160;Nilor, M.&#160;Peu, M.&#160;Fabien&#160;Roussel et M.&#160;Serville"
  },
  "pointeurFragmentTexte": {
    "division": {
      "titre": "Article 39",
      "articleDesignationCourte": "ART. 39",
      "type": "ARTICLE",
      "avantAApres": "A",
      "divisionRattachee": "ARTICLE 39",
      "urlDivisionTexteVise": "/15/textes/1974.asp#D_Article_39"
    },
    "alinea": {
      "avantAApres": "Apres",
      "numero": "6"
    }
  },
  "corps": {
    "dispositif": "<p style=\"text-align: justify;\">Apr&#232;s l&#8217;alin&#233;a&#160;6, ins&#233;rer l'alin&#233;a suivant&#160;:</p><p style=\"text-align: justify;\">&#171;&#160;Si les salari&#233;s concern&#233;s ne souhaitent pas &#234;tre transf&#233;r&#233;s, leur contrat ne peut &#234;tre rompu.&#160;&#187;</p>",
    "exposeSommaire": "<p style=\"text-align: justify;\">Le pr&#233;sent amendement souhaite garantir un droit de maintien des salari&#233;s au sein de la RATP.</p>"
  },
  "representations": [
    {
      "nom": "PDF",
      "typeMime": {
        "type": "application",
        "subType": "PDF"
      },
      "statutRepresentation": {
        "verbatim": true,
        "canonique": true,
        "officielle": true,
        "transcription": false,
        "enregistrement": false
      },
      "contenu": {
        "documentURI": "/15/amendements/1974/AN/2479.pdf"
      }
    }
  ],
  "seanceDiscussion": "RUANR5L15S2019IDS21702",
  "sort": {
    "dateSaisie": "2019-06-14T22:44:50.000+02:00",
    "sortEnSeance": "Rejeté"
  },
  "dateDepot": "2019-05-29T02:00:00.000+02:00",
  "dateDistribution": "2019-06-07T02:00:00.000+02:00",
  "article99": "0",
  "loiReference": {}
}