{
  "uid": "AMANR5L15PO419610B0846P0D1N1054",
  "identifiant": {
    "legislature": "15",
    "numero": "1054",
    "numRect": "0",
    "saisine": {
      "texteLegislatifRef": "PRJLANR5L15B0846",
      "numeroPartiePLF": "0",
      "organeExamen": "PO419610",
      "mentionSecondeDeliberation": "0"
    }
  },
  "numeroLong": "CE1054",
  "etapeTexte": "1ère lecture (1ère assemblée saisie)",
  "triAmendement": "bkpkku",
  "cardinaliteAmdtMultiples": "1",
  "etat": "Discuté",
  "signataires": {
    "auteur": {
      "typeAuteur": "Depute",
      "acteurRef": "PA267429",
      "groupePolitiqueRef": "PO730934"
    },
    "cosignatairesRefs": [
      "PA718838",
      "PA720684",
      "PA330684",
      "PA267429",
      "PA721286",
      "PA605036",
      "PA721968",
      "PA267260",
      "PA643134",
      "PA748954",
      "PA346218"
    ],
    "texteAffichable": "M.&#160;Cinieri,  Mme&#160;Val&#233;rie&#160;Boyer, Mme&#160;Valentin, M.&#160;Masson, M.&#160;Brun, M.&#160;Vialay, M.&#160;Savignat, Mme&#160;Poletti, M.&#160;Abad, M.&#160;Ramadier et M.&#160;Pierre-Henri&#160;Dumont"
  },
  "pointeurFragmentTexte": {
    "division": {
      "titre": "Article 28",
      "articleDesignationCourte": "ART. 28",
      "type": "ARTICLE",
      "avantAApres": "A",
      "divisionRattachee": "ARTICLE 28",
      "urlDivisionTexteVise": "/15/textes/0846.asp#D_Article_28"
    },
    "alinea": {
      "avantAApres": "A",
      "numero": "42",
      "alineaDesignation": "Alinéa 42"
    }
  },
  "corps": {
    "dispositif": "<p style=\"text-align: justify;\">Au d&#233;but de l&#8217;alin&#233;a&#160;42, ins&#233;rer les mots suivants&#160;:</p><p style=\"text-align: justify;\">&#171;&#160;En cas de carence av&#233;r&#233;e du secteur priv&#233;,&#160;&#187;.</p><p style=\"text-align: justify;\">&#160;</p>",
    "exposeSommaire": "<p style=\"text-align: justify;\">La cr&#233;ation des filiales exer&#231;ant des activit&#233;s qui ne rel&#232;vent pas du service public d&#8217;int&#233;r&#234;t g&#233;n&#233;ral du logement social et qui sont habituellement exerc&#233;es par des prestataires de droit priv&#233;, am&#233;nageurs, constructeurs, concepteurs, ing&#233;nieurs, ma&#238;tres d&#8217;&#339;uvre, etc. sont justifi&#233;es par le fait qu&#8217;il existerait des zones en carence sur le territoire. Or, la pr&#233;sence des professionnels de l&#8217;am&#233;nagement, de l&#8217;ing&#233;nierie et de la ma&#238;trise d&#8217;&#339;uvre semble parfaitement assur&#233;e sur l&#8217;ensemble du territoire national.</p><p style=\"text-align: justify;\">Il est par cons&#233;quent propos&#233; que la cr&#233;ation de ces filiales soit limit&#233;e aux seuls cas de carence av&#233;r&#233;e du secteur priv&#233;, ce qui permettra de pr&#233;server les TPE et PME et le tissu &#233;conomique local.</p>"
  },
  "representations": [
    {
      "nom": "PDF",
      "typeMime": {
        "type": "application",
        "subType": "PDF"
      },
      "statutRepresentation": {
        "verbatim": true,
        "canonique": true,
        "officielle": true,
        "transcription": false,
        "enregistrement": false
      },
      "contenu": {
        "documentURI": "/15/amendements/0846/CION-ECO/CE1054.pdf"
      }
    }
  ],
  "sort": {
    "dateSaisie": "2018-05-17T12:17:18.000+02:00",
    "sortEnSeance": "Non soutenu"
  },
  "dateDepot": "2018-05-08T02:00:00.000+02:00",
  "dateDistribution": "2018-05-14T02:00:00.000+02:00",
  "article99": "0",
  "loiReference": {}
}