{
  "uid": "AMANR5L15PO420120B2296P0D1N570",
  "identifiant": {
    "legislature": "15",
    "numero": "570",
    "numRect": "0",
    "saisine": {
      "texteLegislatifRef": "PRJLANR5L15B2296",
      "numeroPartiePLF": "0",
      "organeExamen": "PO420120",
      "mentionSecondeDeliberation": "0"
    }
  },
  "numeroLong": "AS570",
  "etapeTexte": "1ère lecture (1ère assemblée saisie)",
  "triAmendement": "jbaaaaaaaaaaaaaaaaaaaaaaaaaaaaaaaaaaaaaaaaaaaaaaaaei",
  "cardinaliteAmdtMultiples": "1",
  "etat": "Discuté",
  "signataires": {
    "auteur": {
      "typeAuteur": "Depute",
      "acteurRef": "PA719032",
      "groupePolitiqueRef": "PO730964"
    },
    "cosignatairesRefs": [
      "PA719032"
    ],
    "texteAffichable": "M.&#160;Bouyx"
  },
  "pointeurFragmentTexte": {
    "division": {
      "titre": "Article 44",
      "articleDesignationCourte": "ART. 44",
      "type": "ARTICLE",
      "avantAApres": "A",
      "divisionRattachee": "ARTICLE 44",
      "urlDivisionTexteVise": "/15/textes/2296.asp#D_Article_44"
    },
    "alinea": {
      "numero": "7"
    }
  },
  "corps": {
    "dispositif": "<p style=\"text-align: justify;\">Supprimer l&#8217;alin&#233;a&#160;7.</p>",
    "exposeSommaire": "<p style=\"text-align: justify;\">L&#8217;alin&#233;a&#160;7 pr&#233;voit d&#8217;exp&#233;rimenter l&#8217;extension des lieux et des conditions de pr&#233;l&#232;vement et de r&#233;alisation de la phase analytique des examens de biologie m&#233;dicale, en d&#233;rogeant aux r&#232;gles existantes. <br />Cette mesure, ins&#233;r&#233;e dans un article relatif au transport sanitaire, ne fait l&#8217;objet d&#8217;aucune explication dans l&#8217;expos&#233; des motifs. Il convient d&#8217;en expliquer le sens et le p&#233;rim&#232;tre.<br />Cette disposition pr&#233;sente en effet un risque en mati&#232;re de sant&#233; publique en ce qu&#8217;elle permettrait notamment la r&#233;alisation d&#8217;examens de biologie m&#233;dicale d&#233;localis&#233;e, c&#8217;est-&#224;-dire la r&#233;alisation par des automates d&#8217;examens de biologie m&#233;dicale dans un cabinet m&#233;dical, un centre ou une maison de sant&#233;. <br />De tels automates n&#233;cessitent une organisation exigeante et un investissement lourd pour en assurer la qualit&#233;. <br />Le co&#251;t d&#8217;un tel examen est en moyenne 5 fois plus cher qu&#8217;un examen r&#233;alis&#233; en laboratoire. <br />D&#233;connect&#233; des phases pr&#233;-analytique et post-analytique (ant&#233;c&#233;dents du patients, prise en compte du contexte th&#233;rapeutique&#8230;), cet examen d&#233;localis&#233; r&#233;alis&#233; par des automates fournit des r&#233;sultats dont la fiabilit&#233; est toute relative. <br />Se pose en d&#233;finitive et de mani&#232;re cruciale la question de la responsabilit&#233; et du contr&#244;le par un biologiste m&#233;dical. Il convient d&#8217;&#233;viter que des examens soient r&#233;alis&#233;s dans des conditions d&#233;grad&#233;es de qualit&#233; et de s&#233;curit&#233;.</p>"
  },
  "representations": [
    {
      "nom": "PDF",
      "typeMime": {
        "type": "application",
        "subType": "PDF"
      },
      "statutRepresentation": {
        "verbatim": true,
        "canonique": true,
        "officielle": true,
        "transcription": false,
        "enregistrement": false
      },
      "contenu": {
        "documentURI": "/15/amendements/2296/CION-SOC/AS570.pdf"
      }
    }
  ],
  "sort": {
    "dateSaisie": "2019-10-16T19:03:28.000+02:00",
    "sortEnSeance": "Non soutenu"
  },
  "dateDepot": "2019-10-11T02:00:00.000+02:00",
  "dateDistribution": "2019-10-15T02:00:00.000+02:00",
  "article99": "0",
  "loiReference": {}
}