{
  "uid": "AMANR5L15SEA717460BTC1974P0D1N1745",
  "identifiant": {
    "legislature": "15",
    "numero": "1745",
    "numRect": "1",
    "saisine": {
      "texteLegislatifRef": "PRJLANR5L15BTC1974",
      "numeroPartiePLF": "0",
      "organeExamen": "PO717460",
      "mentionSecondeDeliberation": "0"
    }
  },
  "numeroLong": "1745 (Rect)",
  "etapeTexte": "1ère lecture (2ème assemblée saisie)",
  "triAmendement": "ediaaaaaaaaaaaaaaaaaaaaaaaaaaaaaaaaaaaaaaaaaaaaaaabvzo",
  "cardinaliteAmdtMultiples": "1",
  "etat": "Discuté",
  "signataires": {
    "auteur": {
      "typeAuteur": "Depute",
      "acteurRef": "PA719790",
      "groupePolitiqueRef": "PO730964"
    },
    "cosignatairesRefs": [
      "PA720538",
      "PA719790",
      "PA719798",
      "PA721784",
      "PA719592",
      "PA720652",
      "PA720268",
      "PA719186",
      "PA719258"
    ],
    "texteAffichable": "M.&#160;Chalumeau,  Mme&#160;Gomez-Bassac, Mme&#160;De Temmerman, Mme&#160;Khattabi, M.&#160;Labaronne, M.&#160;Delpon, M.&#160;Duverg&#233;, M.&#160;Damaisin et M.&#160;Simian"
  },
  "pointeurFragmentTexte": {
    "division": {
      "titre": "Article 26 AB",
      "articleDesignationCourte": "APRÈS ART. 26 AB",
      "type": "ARTICLE",
      "avantAApres": "Apres",
      "divisionRattachee": "APRÈS L'ARTICLE 26 AB, insérer l'article suivant:",
      "articleAdditionnel": "1",
      "urlDivisionTexteVise": "/15/textes/1974.asp#D_Article_26_AB"
    }
  },
  "corps": {
    "dispositif": "<p style=\"text-align: justify;\">Au 1&#176; de l&#8217;article L.&#160;224&#8209;7 du code de l&#8217;environnement, apr&#232;s le mot&#160;: &#171;&#160;&#233;lectriques&#160;&#187;, sont ins&#233;r&#233;s les mots&#160;: &#171;&#160;, au biogaz et &#224; hydrog&#232;ne&#160;&#187;.</p>",
    "exposeSommaire": "<p style=\"text-align: justify;\">L&#8217;article L.&#160;224&#8209;7 du code de l&#8217;environnement a &#233;t&#233; introduit par la loi n&#176;2015&#8209;992 du 17 ao&#251;t 2015 relative &#224; la transition &#233;nerg&#233;tique pour la croissance verte. L&#8217;article pr&#233;voit notamment l&#8217;obligation, pour l&#8217;&#201;tat et ses &#233;tablissements publics, d&#8217;acqu&#233;rir, dans le cadre du renouvellement de leurs flottes de v&#233;hicules, au moins 50&#160;% de v&#233;hicules &#224; faibles &#233;missions.</p><p style=\"text-align: justify;\">En effet, comme le soulignent d&#8217;ailleurs les auditions r&#233;alis&#233;es lors de la s&#233;ance du 24 janvier 2019 de la mission d&#8217;information sur les freins &#224; la transition &#233;nerg&#233;tique, la commande publique a un r&#244;le primordial &#224; jouer pour le d&#233;veloppement de l&#8217;hydrog&#232;ne, tant pour assurer le d&#233;ploiement d&#8217;un r&#233;seau de recharge que pour accro&#238;tre le volume des v&#233;hicules en circulation.</p><p style=\"text-align: justify;\">D&#232;s lors, le pr&#233;sent amendement vise &#224; modifier l&#8217;article L.&#160;224&#8209;7 du code de l&#8217;environnement pour introduire l&#8217;obligation, pour l&#8217;&#201;tat et ses &#233;tablissements publics, l&#8217;obligation d&#8217;int&#233;grer, dans la part des 50&#160;% du renouvellement de leur flotte consacr&#233;s &#224; des v&#233;hicules &#224; faibles &#233;missions, les v&#233;hicules &#224; hydrog&#232;ne et au biogaz.</p>"
  },
  "representations": [
    {
      "nom": "PDF",
      "typeMime": {
        "type": "application",
        "subType": "PDF"
      },
      "statutRepresentation": {
        "verbatim": true,
        "canonique": true,
        "officielle": true,
        "transcription": false,
        "enregistrement": false
      },
      "contenu": {
        "documentURI": "/15/amendements/1974/AN/1745.pdf"
      }
    }
  ],
  "seanceDiscussion": "RUANR5L15S2019IDS21694",
  "sort": {
    "dateSaisie": "2019-06-11T19:50:31.000+02:00",
    "sortEnSeance": "Tombé"
  },
  "dateDepot": "2019-05-29T02:00:00.000+02:00",
  "dateDistribution": "2019-06-06T02:00:00.000+02:00",
  "article99": "0",
  "loiReference": {
    "codeLoi": "c environnement",
    "divisionCodeLoi": "L224-7"
  }
}