{
  "uid": "AMANR5L15SEA717460BTC2062P0D1N71",
  "identifiant": {
    "legislature": "15",
    "numero": "71",
    "numRect": "0",
    "saisine": {
      "texteLegislatifRef": "PIONANR5L15BTC2062",
      "numeroPartiePLF": "0",
      "organeExamen": "PO717460",
      "mentionSecondeDeliberation": "0"
    }
  },
  "numeroLong": "71",
  "etapeTexte": "1ère lecture (1ère assemblée saisie)",
  "triAmendement": "ecaaaaaaaaaaaaaaaaaaaaaaaaaaaaaaaaaaaaaaaaaaaaaaaabdi",
  "cardinaliteAmdtMultiples": "1",
  "etat": "Discuté",
  "signataires": {
    "auteur": {
      "typeAuteur": "Depute",
      "acteurRef": "PA335532",
      "groupePolitiqueRef": "PO758835"
    },
    "cosignatairesRefs": [
      "PA267233",
      "PA608741",
      "PA340357",
      "PA1198",
      "PA1592",
      "PA335054",
      "PA342415",
      "PA605069",
      "PA608695",
      "PA333285",
      "PA720988",
      "PA610681",
      "PA609590",
      "PA337483",
      "PA607553",
      "PA608172",
      "PA332614",
      "PA429893",
      "PA643145",
      "PA335532",
      "PA609332",
      "PA333818",
      "PA719930",
      "PA1008",
      "PA642764",
      "PA340343",
      "PA508",
      "PA608011",
      "PA1809"
    ],
    "texteAffichable": "Mme&#160;Pau-Langevin,  M.&#160;Saulignac, Mme&#160;Untermaier, Mme&#160;Karamanli, Mme&#160;Victory, M.&#160;Aviragnet, Mme&#160;Bareigts, Mme&#160;Battistel, Mme&#160;Bi&#233;mouret, M.&#160;Bouillon, M.&#160;Jean-Louis&#160;Bricout, M.&#160;Carvounas, M.&#160;Alain&#160;David, Mme&#160;Laurence&#160;Dumont, M.&#160;Faure, M.&#160;Garot, M.&#160;David&#160;Habib, M.&#160;Hutin, M.&#160;Juanico, M.&#160;J&#233;r&#244;me&#160;Lambert, M.&#160;Letchimy, Mme&#160;Manin, Mme&#160;Pires Beaune, M.&#160;Potier, M.&#160;Pueyo, Mme&#160;Rabault, Mme&#160;Tolmont, Mme&#160;Vainqueur-Christophe, M.&#160;Vallaud et les membres du groupe Socialistes et apparent&#233;s"
  },
  "pointeurFragmentTexte": {
    "division": {
      "titre": "Article 4",
      "articleDesignationCourte": "ART. 4",
      "type": "ARTICLE",
      "avantAApres": "A",
      "divisionRattachee": "ARTICLE 4",
      "urlDivisionTexteVise": "/15/textes/2062.asp#D_Article_4"
    },
    "alinea": {
      "numero": "4"
    }
  },
  "corps": {
    "dispositif": "<p style=\"text-align: justify;\">Compl&#233;ter l&#8217;alin&#233;a&#160;4 par la phrase suivante&#160;: </p><p style=\"text-align: justify;\">&#171;&#160;Il contr&#244;le &#224; ce titre la mise en &#339;uvre des moyens technologiques et humains par les op&#233;rateurs mentionn&#233;s &#224; l&#8217;article&#160;6&#8209;2 de la loi n&#176;&#160;2004&#8209;575 du 21&#160;juin 2004 pour la confiance dans l&#8217;&#233;conomie num&#233;rique afin de lutter contre la haine sur internet.&#160;&#187;</p>",
    "exposeSommaire": "<p style=\"text-align: justify;\">Cet amendement du groupe socialiste vise &#224; int&#233;grer dans le champ des missions du CSA le contr&#244;le de la mise en oeuvre des moyens technologiques et humains par les op&#233;rateurs vis&#233;s par le texte.</p><p style=\"text-align: justify;\">L&#8217;effectivit&#233; d&#8217;un tel texte d&#233;pendra en effet des moyens mis en oeuvre par les op&#233;rateurs concern&#233;s. Il importe &#224; cet &#233;gard que le CSA soit investi d&#8217;une mission de contr&#244;le &#224; cet &#233;gard.</p><p style=\"text-align: justify;\">Tel est le sens de cet amendement.</p>"
  },
  "representations": [
    {
      "nom": "PDF",
      "typeMime": {
        "type": "application",
        "subType": "PDF"
      },
      "statutRepresentation": {
        "verbatim": true,
        "canonique": true,
        "officielle": true,
        "transcription": false,
        "enregistrement": false
      },
      "contenu": {
        "documentURI": "/15/amendements/2062/AN/71.pdf"
      }
    }
  ],
  "seanceDiscussion": "RUANR5L15S2019IDS21751",
  "sort": {
    "dateSaisie": "2019-07-04T19:17:32.000+02:00",
    "sortEnSeance": "Rejeté"
  },
  "dateDepot": "2019-06-27T02:00:00.000+02:00",
  "dateDistribution": "2019-07-02T02:00:00.000+02:00",
  "article99": "0",
  "loiReference": {}
}