{
  "uid": "AMANR5L15SEA717460BTC0446P0D1N148",
  "identifiant": {
    "legislature": "15",
    "numero": "148",
    "numRect": "0",
    "saisine": {
      "texteLegislatifRef": "PRJLANR5L15BTC0446",
      "numeroPartiePLF": "0",
      "organeExamen": "PO717460",
      "mentionSecondeDeliberation": "0"
    }
  },
  "numeroLong": "148",
  "etapeTexte": "1ère lecture (1ère assemblée saisie)",
  "triAmendement": "ogq",
  "cardinaliteAmdtMultiples": "1",
  "etat": "Retiré",
  "signataires": {
    "auteur": {
      "typeAuteur": "Depute",
      "acteurRef": "PA721070",
      "groupePolitiqueRef": "PO730934"
    },
    "cosignatairesRefs": [
      "PA721070"
    ],
    "texteAffichable": "Mme&#160;Ramassamy"
  },
  "pointeurFragmentTexte": {
    "division": {
      "titre": "Article 4",
      "articleDesignationCourte": "ART. 4",
      "type": "ARTICLE",
      "avantAApres": "A",
      "divisionRattachee": "ARTICLE 4",
      "urlDivisionTexteVise": "/15/textes/0446.asp#D_Article_4"
    },
    "alinea": {
      "numero": "6"
    }
  },
  "corps": {
    "dispositif": "<p style=\"text-align: justify;\">A&#768; l&#8217;aline&#769;a 6, apre&#768;s le mot&#160;:</p><p style=\"text-align: justify;\">&#171;&#160;administration&#160;&#187;</p><p style=\"text-align: justify;\">inse&#769;rer les mots&#160;:</p><p style=\"text-align: justify;\">&#171;&#160;, ainsi que les mutuelles e&#769;tudiantes,&#160;&#187;.</p>",
    "exposeSommaire": "<p style=\"text-align: justify;\">Les actions de pre&#769;vention et d&#8217;e&#769;ducation a&#768; la sante&#769; sont ne&#769;cessaires et doivent e&#770;tre renforce&#769;es dans un objectif d&#8217;ame&#769;lioration de la sante&#769; publique.</p><p style=\"text-align: justify;\">Il est ne&#769;cessaire d&#8217;e&#769;largir le champ de l&#8217;article&#160;4 aux mutuelles e&#769;tudiantes, lesquelles ont un ro&#770;le important aupre&#768;s des jeunes. Les mutuelles e&#769;tudiantes sont des interlocuteurs pre&#769;sents au quotidien du fait du nombre important de permanences sur les campus.</p><p style=\"text-align: justify;\">Elles accompagnent les jeunes en leur permettant d&#8217;appre&#769;hender de nombreux enjeux en matie&#768;re de sante&#769; publique et en les sensibilisant sur la notion de capital sante&#769;. Les mutuelles e&#769;tudiantes sont des interlocuteurs privile&#769;gie&#769;s des e&#769;tudiants, tant en amont, qu&#8217;en aval.</p><p style=\"text-align: justify;\">Les mutuelles e&#769;tudiantes ont de&#769;veloppe&#769; une expertise qui leur permet d&#8217;avoir un ro&#770;le de lanceur d&#8217;alerte aupre&#768;s des pouvoirs publics sur la sante&#769; des e&#769;tudiants.</p><p style=\"text-align: justify;\">Ainsi, elles doivent e&#770;tre soutenues davantage par la puissance publique.</p>"
  },
  "representations": [
    {
      "nom": "PDF",
      "typeMime": {
        "type": "application",
        "subType": "PDF"
      },
      "statutRepresentation": {
        "verbatim": true,
        "canonique": true,
        "officielle": true,
        "transcription": false,
        "enregistrement": false
      },
      "contenu": {
        "documentURI": "/15/amendements/0446/AN/148.pdf"
      }
    }
  ],
  "dateDepot": "2017-12-08T01:00:00.000+01:00",
  "dateDistribution": "2017-12-11T01:00:00.000+01:00",
  "article99": "0",
  "loiReference": {}
}