{
  "uid": "AMANR5L15PO420120B1297P0D1N625",
  "identifiant": {
    "legislature": "15",
    "numero": "625",
    "numRect": "0",
    "saisine": {
      "texteLegislatifRef": "PRJLANR5L15B1297",
      "numeroPartiePLF": "0",
      "organeExamen": "PO420120",
      "mentionSecondeDeliberation": "0"
    }
  },
  "numeroLong": "AS625",
  "etapeTexte": "1ère lecture (1ère assemblée saisie)",
  "triAmendement": "bpaaaaaaaaaaaaaaaaaaaaaaaaaaaaaaaaaaaaaaaaaaaaaaaaim",
  "cardinaliteAmdtMultiples": "1",
  "etat": "Discuté",
  "signataires": {
    "auteur": {
      "typeAuteur": "Depute",
      "acteurRef": "PA722390",
      "groupePolitiqueRef": "PO730934"
    },
    "cosignatairesRefs": [
      "PA718780",
      "PA767",
      "PA722390",
      "PA267318",
      "PA267289"
    ],
    "texteAffichable": "Mme&#160;Corneloup,  M.&#160;Cattin, M.&#160;Door, M.&#160;Grelier et Mme&#160;Trastour-Isnart"
  },
  "pointeurFragmentTexte": {
    "division": {
      "titre": "Article 15",
      "articleDesignationCourte": "APRÈS ART. 15",
      "type": "ARTICLE",
      "avantAApres": "Apres",
      "divisionRattachee": "APRÈS L'ARTICLE 15, insérer l'article suivant:",
      "articleAdditionnel": "1",
      "urlDivisionTexteVise": "/15/textes/1297.asp#D_Article_15"
    }
  },
  "corps": {
    "dispositif": "<p style=\"text-align: justify;\">I.&#160;&#8211;&#160;L&#8217;article L.&#160;138&#8209;2 du code de la s&#233;curit&#233; sociale est ainsi modifi&#233;&#160;:</p><p style=\"text-align: justify;\">1&#176;&#160;Le deuxi&#232;me alin&#233;a est ainsi modifi&#233;&#160;:</p><p style=\"text-align: justify;\"><i>a)</i> &#192; la premi&#232;re phrase, le mot&#160;: &#171;&#160;trois&#160;&#187; est remplac&#233; par le mot&#160;: &#171;&#160;deux&#160;&#187;&#160;;</p><p style=\"text-align: justify;\"><i>b)</i>&#160;&#192; la seconde phrase, les mots&#160;: &#171;&#160;le chiffre d&#8217;affaires hors taxes r&#233;alis&#233; par l&#8217;entreprise au cours de l&#8217;ann&#233;e civile&#160;; une deuxi&#232;me part est constitu&#233;e par&#160;&#187; sont supprim&#233;s&#160;;</p><p style=\"text-align: justify;\"><i>c)</i>&#160;En cons&#233;quence, &#224; la troisi&#232;me et &#224; la derni&#232;re phrases, le mot&#160;: &#171;&#160;troisi&#232;me&#160;&#187; est remplac&#233; par le mot&#160;: &#171;&#160;seconde&#160;&#187;&#160;;</p><p style=\"text-align: justify;\">2&#176;&#160;Le <i>a </i>est supprim&#233;&#160;;</p><p style=\"text-align: justify;\">3&#176;&#160;Au <i>b&#160;</i>, le mot&#160;: &#171;&#160;deuxi&#232;me&#160;&#187; est remplac&#233; par le mot&#160;: &#171;&#160;premi&#232;re&#160;&#187;&#160;;</p><p style=\"text-align: justify;\">4&#176;&#160;Au <i>c, </i>le mot&#160;: &#171;&#160;troisi&#232;me&#160;&#187; est remplac&#233; par le mot&#160;:&#171;&#160;seconde&#160;&#187;&#160;;</p><p style=\"text-align: justify;\">5&#176;&#160;Le septi&#232;me alin&#233;a est supprim&#233;&#160;;</p><p style=\"text-align: justify;\">6&#176;&#160;L&#8217;avant-dernier alin&#233;a est ainsi r&#233;dig&#233;&#160;:</p><p style=\"text-align: justify;\">&#171;&#160;Lorsqu&#8217;une entreprise est soumise pour la premi&#232;re fois &#224; la contribution, elle n&#8217;est redevable la premi&#232;re ann&#233;e que de la seconde part. En ce qui concerne le calcul de la premi&#232;re part pour la deuxi&#232;me ann&#233;e d&#8217;acquittement de la contribution, et dans le cas o&#249; l&#8217;entreprise n&#8217;a pas eu d&#8217;activit&#233; commerciale tout au long de la premi&#232;re ann&#233;e civile, le chiffre d&#8217;affaires pris en compte au titre de la premi&#232;re ann&#233;e est calcul&#233; au prorata de la dur&#233;e &#233;coul&#233;e afin de couvrir une ann&#233;e civile dans son int&#233;gralit&#233;.&#160;&#187;</p><p style=\"text-align: justify;\">II.&#160;&#8211;&#160;La perte de recettes pour les organismes de s&#233;curit&#233; sociale est compens&#233;e &#224; due concurrence par la cr&#233;ation d&#8217;une taxe additionnelle aux droits vis&#233;s aux articles 575 et 575 A du code g&#233;n&#233;ral des imp&#244;ts.</p>",
    "exposeSommaire": "<p>La r&#233;partition pharmaceutique joue un r&#244;le important dans le circuit du m&#233;dicament.</p><p>La profession connait depuis 10 ans des difficult&#233;s qui pourraient avoir des cons&#233;quences sur les services qu&#8217;elle propose aux pharmacies et &#224; travers elles, aux patients, dans le contexte tendu de p&#233;nuries r&#233;currentes de m&#233;dicaments.</p><p>En effet, le mod&#232;le de r&#233;mun&#233;ration des grossistes r&#233;partiteurs, assis sur le prix des m&#233;dicaments n&#8217;est plus adapt&#233;, notamment en raison de l&#8217;essor des m&#233;dicaments g&#233;n&#233;riques.</p><p>A la suite de l&#8217;examen du PLFSS pour 2018, une concertation s&#8217;est ouverte avec la Direction de la S&#233;curit&#233; Sociale. Les premiers r&#233;sultats de cette concertation n&#8217;est pas satisfaisante et n&#8217;est pas mesure d&#8217;assurer la p&#233;rennit&#233; de la r&#233;partition.</p><p>Aussi, afin d&#8217;assurer la p&#233;rennit&#233; du mod&#232;le de la r&#233;partition pharmaceutique, il est propos&#233; par cet amendement de supprimer l&#8217;article L.&#160;138&#8209;1 du code de la s&#233;curit&#233; sociale qui instaure la taxe sur le chiffre d&#8217;affaires des distributeurs en gros. Cette taxe repr&#233;sente pr&#232;s de 20% de la marge, un pr&#233;l&#232;vement disproportionn&#233; par rapport &#224; d&#8217;autres &#233;l&#233;ments de fiscalit&#233; applicable aux autres acteurs de la chaine du m&#233;dicament.</p>"
  },
  "representations": [
    {
      "nom": "PDF",
      "typeMime": {
        "type": "application",
        "subType": "PDF"
      },
      "statutRepresentation": {
        "verbatim": true,
        "canonique": true,
        "officielle": true,
        "transcription": false,
        "enregistrement": false
      },
      "contenu": {
        "documentURI": "/15/amendements/1297/CION-SOC/AS625.pdf"
      }
    }
  ],
  "sort": {
    "dateSaisie": "2018-10-16T22:10:39.000+02:00",
    "sortEnSeance": "Rejeté"
  },
  "dateDepot": "2018-10-12T02:00:00.000+02:00",
  "dateDistribution": "2018-10-15T02:00:00.000+02:00",
  "article99": "0",
  "loiReference": {
    "codeLoi": "sécurité sociale",
    "divisionCodeLoi": "L138-2"
  }
}