{
  "uid": "AMANR5L15SEA717460BTC1396P0D1N339",
  "identifiant": {
    "legislature": "15",
    "numero": "339",
    "numRect": "0",
    "saisine": {
      "texteLegislatifRef": "PRJLANR5L15BTC1396",
      "numeroPartiePLF": "0",
      "organeExamen": "PO717460",
      "mentionSecondeDeliberation": "0"
    }
  },
  "numeroLong": "339",
  "etapeTexte": "1ère lecture (2ème assemblée saisie)",
  "triAmendement": "afaaaaaaaaaaaaaaaaaaaaaaaaaaaaaaaaaaaaaaaaaaaaaaaabo",
  "cardinaliteAmdtMultiples": "1",
  "etat": "Discuté",
  "signataires": {
    "auteur": {
      "typeAuteur": "Depute",
      "acteurRef": "PA642847",
      "groupePolitiqueRef": "PO730934"
    },
    "cosignatairesRefs": [
      "PA642847"
    ],
    "texteAffichable": "M.&#160;Bazin"
  },
  "pointeurFragmentTexte": {
    "division": {
      "titre": "Article 5",
      "articleDesignationCourte": "ART. 5",
      "type": "ARTICLE",
      "avantAApres": "A",
      "divisionRattachee": "ARTICLE 5",
      "urlDivisionTexteVise": "/15/textes/1396.asp#D_Article_5"
    }
  },
  "corps": {
    "dispositif": "<p>Supprimer cet article.</p>",
    "exposeSommaire": "<p style=\"text-align: justify;\">L&#8217;article&#160;5 confie au notaire la r&#233;daction de l&#8217;acte de notori&#233;t&#233; constatant la possession d&#8217;&#233;tat en mati&#232;re de filiation relevant actuellement de la comp&#233;tence du juge du tribunal d&#8217;instance dans un souci de traitement plus rapide des demandes des usagers et afin d&#8217;uniformiser les r&#232;gles du code civil r&#233;gissant les actes de notori&#233;t&#233;.</p><p style=\"text-align: justify;\">Il convient de maintenir la comp&#233;tence judiciaire en mati&#232;re de filiation.</p><p style=\"text-align: justify;\">Un tel acte &#233;tablit la filiation d&#8217;un enfant. Le juge a un pouvoir d&#8217;appr&#233;ciation que n&#8217;a pas le notaire.</p><p style=\"text-align: justify;\">Le mouvement actuel associant la d&#233;judiciarisation &#224; la contractualisation du droit de la famille entra&#238;ne une fragilisation des familles, une augmentation des contentieux (contrairement &#224; l&#8217;objectif affich&#233; de diminution des co&#251;ts), et un recul de la protection judiciaire des enfants et des int&#233;r&#234;ts du plus faible. Le r&#244;le du juge n&#8217;est pas n&#233;cessairement de trancher un litige. La juridiction gracieuse a pr&#233;cis&#233;ment pour objet l&#8217;introduction d&#8217;un contr&#244;le judiciaire en raison de la nature de l&#8217;affaire ou de la qualit&#233; du requ&#233;rant. S&#8217;agissant de la filiation d&#8217;un enfant et d&#8217;appr&#233;cier un mode de preuve l&#8217;&#233;tablissant, le contr&#244;le du juge est indispensable.</p>"
  },
  "representations": [
    {
      "nom": "PDF",
      "typeMime": {
        "type": "application",
        "subType": "PDF"
      },
      "statutRepresentation": {
        "verbatim": true,
        "canonique": true,
        "officielle": true,
        "transcription": false,
        "enregistrement": false
      },
      "contenu": {
        "documentURI": "/15/amendements/1396/AN/339.pdf"
      }
    }
  ],
  "seanceDiscussion": "RUANR5L15S2019IDS21372",
  "sort": {
    "dateSaisie": "2018-11-21T23:11:51.000+01:00",
    "sortEnSeance": "Rejeté"
  },
  "dateDepot": "2018-11-14T01:00:00.000+01:00",
  "dateDistribution": "2018-11-19T01:00:00.000+01:00",
  "article99": "0",
  "loiReference": {}
}