{
  "uid": "AMANR5L15SEA717460BTC2401P0D1N973",
  "identifiant": {
    "legislature": "15",
    "numero": "973",
    "numRect": "0",
    "saisine": {
      "texteLegislatifRef": "PRJLANR5L15BTC2401",
      "numeroPartiePLF": "0",
      "organeExamen": "PO717460",
      "mentionSecondeDeliberation": "0"
    }
  },
  "numeroLong": "973",
  "etapeTexte": "1ère lecture (2ème assemblée saisie)",
  "triAmendement": "cdaaaaaaaaaaaaaaaaaaaaaaaaaaaaaaaaaaaaaaaaaaaaaaaans",
  "cardinaliteAmdtMultiples": "1",
  "etat": "Irrecevable",
  "signataires": {
    "auteur": {
      "typeAuteur": "Depute",
      "acteurRef": "PA266788",
      "groupePolitiqueRef": "PO767217"
    },
    "cosignatairesRefs": [
      "PA267241",
      "PA268019",
      "PA720696",
      "PA712014",
      "PA721486",
      "PA267330",
      "PA266788",
      "PA695100",
      "PA720230",
      "PA719806"
    ],
    "texteAffichable": "M.&#160;Morel-&#192;-L&apos;Huissier,  Mme&#160;Auconie, M.&#160;Demilly, Mme&#160;Descamps, M.&#160;Meyer&#160;Habib, M.&#160;Lagarde, M.&#160;Ledoux, Mme&#160;Magnier, M.&#160;Naegelen et M.&#160;Zumkeller"
  },
  "pointeurFragmentTexte": {
    "division": {
      "titre": "Article 11 bis AA",
      "articleDesignationCourte": "ART. 11 BIS AA",
      "type": "ARTICLE",
      "avantAApres": "A",
      "divisionRattachee": "ARTICLE 11 BIS AA",
      "urlDivisionTexteVise": "/15/textes/2401.asp#D_Article_11_bis_AA"
    },
    "alinea": {
      "numero": "4"
    }
  },
  "corps": {},
  "representations": [
    {
      "nom": "PDF",
      "typeMime": {
        "type": "application",
        "subType": "PDF"
      },
      "statutRepresentation": {
        "verbatim": true,
        "canonique": true,
        "officielle": true,
        "transcription": false,
        "enregistrement": false
      },
      "contenu": {
        "documentURI": "/15/amendements/2401/AN/973.pdf"
      }
    }
  ],
  "dateDepot": "2019-11-14T01:00:00.000+01:00",
  "dateDistribution": "2019-11-18T01:00:00.000+01:00",
  "article99": "0",
  "loiReference": {
    "codeLoi": "c électoral"
  }
}