{
  "uid": "AMANR5L15SEA717460B2272P2D1N2440",
  "identifiant": {
    "legislature": "15",
    "numero": "2440",
    "numRect": "0",
    "saisine": {
      "texteLegislatifRef": "PRJLANR5L15B2272",
      "numeroPartiePLF": "2",
      "organeExamen": "PO717460",
      "mentionSecondeDeliberation": "0"
    }
  },
  "numeroLong": "II-2440",
  "etapeTexte": "1ère lecture (1ère assemblée saisie)",
  "triAmendement": "ecaaacaaaaaaaaaaaaaaaaaaaaaaaaaaaaaaaaaaaaaaaaaaaax",
  "cardinaliteAmdtMultiples": "1",
  "etat": "Discuté",
  "signataires": {
    "auteur": {
      "typeAuteur": "Depute",
      "acteurRef": "PA719138",
      "groupePolitiqueRef": "PO759900"
    },
    "cosignatairesRefs": [
      "PA608292",
      "PA331582",
      "PA719146",
      "PA720996",
      "PA719138",
      "PA605694",
      "PA721194",
      "PA267042",
      "PA405480",
      "PA333421",
      "PA336175",
      "PA336439",
      "PA942"
    ],
    "texteAffichable": "M.&#160;Castellani,  M.&#160;Acquaviva, M.&#160;Cl&#233;ment, M.&#160;Charles&#160;de Courson, Mme&#160;Dubi&#233;, Mme&#160;Fr&#233;d&#233;rique&#160;Dumas, M.&#160;El Guerrab, M.&#160;Falorni, M.&#160;Favennec Becot, M.&#160;Pancher, Mme&#160;Pinel, M.&#160;Pupponi et M.&#160;Philippe&#160;Vigier"
  },
  "pointeurFragmentTexte": {
    "division": {
      "titre": "Article 61",
      "articleDesignationCourte": "ART. 61",
      "type": "ARTICLE",
      "avantAApres": "A",
      "divisionRattachee": "ARTICLE 61",
      "urlDivisionTexteVise": "/15/textes/2272C.asp#D_Article_61"
    }
  },
  "corps": {
    "dispositif": "<p>Supprimer cet article.</p>",
    "exposeSommaire": "<p style=\"text-align: justify;\">Nous pouvons reconna&#238;tre, aujourd&#8217;hui, un besoin de clarification et de modernisation dans le mode de recouvrement des taxes collect&#233;es. En ce sens, le transfert des missions des douanes &#224; la direction g&#233;n&#233;rale des finances publiques (DGFiP) est un moyen d&#8217;y parvenir. Cependant, cette transformation ne doit ni cr&#233;er une situation de d&#233;sarroi pour les agents du service public des douanes ni conduire &#224; une surcharge de travail pour la DGFiP.</p><p style=\"text-align: justify;\">Cette r&#233;forme concernerait 400 agents au niveau national. En Corse, elle impacterait la moiti&#233; des op&#233;rateurs commerciaux. A ce jour, aucune perspective ne semble se pr&#233;senter &#224; ces agents des douanes. En outre, avec l&#8217;entr&#233;e en vigueur de la loi de la fonction publique, ces agents pourraient &#234;tre sujets &#224; des mutations voire des licenciements, avec des cons&#233;quences familiales insupportables.</p><p style=\"text-align: justify;\">Par ailleurs, il serait utile de doter la DGFiP des moyens budg&#233;taires suffisants pour assurer ses nouvelles missions. Or, cela ne semble pas &#234;tre le cas dans le projet de budget, bien au contraire. Cette administration risque d&#8217;&#234;tre soumise &#224; une forte pression budg&#233;taire dans les ann&#233;es &#224; venir. En cons&#233;quence, la qualit&#233; du service en p&#226;tira. La rationalisation ne peut s&#8217;inscrire dans le cadre d&#8217;une d&#233;gradation du service rendu aux usagers, en particulier aux entreprises. Faute de garantie face &#224; ces inqui&#233;tudes, cet amendement vise donc &#224; supprimer le pr&#233;sent article.</p>"
  },
  "representations": [
    {
      "nom": "PDF",
      "typeMime": {
        "type": "application",
        "subType": "PDF"
      },
      "statutRepresentation": {
        "verbatim": true,
        "canonique": true,
        "officielle": true,
        "transcription": false,
        "enregistrement": false
      },
      "contenu": {
        "documentURI": "/15/amendements/2272C/AN/2440.pdf"
      }
    }
  ],
  "seanceDiscussion": "RUANR5L15S2020IDS21921",
  "sort": {
    "dateSaisie": "2019-11-14T12:51:24.000+01:00",
    "sortEnSeance": "Rejeté"
  },
  "dateDepot": "2019-11-07T01:00:00.000+01:00",
  "dateDistribution": "2019-11-13T01:00:00.000+01:00",
  "article99": "0",
  "loiReference": {}
}