{
  "uid": "AMANR5L15SEA717460B1490P0D1N252",
  "identifiant": {
    "legislature": "15",
    "numero": "252",
    "numRect": "0",
    "saisine": {
      "texteLegislatifRef": "PRJLANR5L15B1490",
      "numeroPartiePLF": "0",
      "organeExamen": "PO717460",
      "mentionSecondeDeliberation": "0"
    }
  },
  "numeroLong": "252",
  "etapeTexte": "Nouvelle Lecture",
  "triAmendement": "aagaaacaaaaaaaaaaaaaaaaaaaaaaaaaaaaaaaaaaaaaaaaaaazzzzzzzz",
  "cardinaliteAmdtMultiples": "1",
  "etat": "Discuté",
  "signataires": {
    "auteur": {
      "typeAuteur": "Depute",
      "acteurRef": "PA720644",
      "groupePolitiqueRef": "PO730934"
    },
    "cosignatairesRefs": [
      "PA267289",
      "PA718780",
      "PA340853",
      "PA605991",
      "PA606712",
      "PA720644",
      "PA721506"
    ],
    "texteAffichable": "M.&#160;Nury,  Mme&#160;Trastour-Isnart, M.&#160;Lurton, M.&#160;Leclerc, Mme&#160;Kuster, Mme&#160;Genevard et M.&#160;Door"
  },
  "pointeurFragmentTexte": {
    "division": {
      "titre": "Article 19",
      "articleDesignationCourte": "ART. 19",
      "type": "ARTICLE",
      "avantAApres": "A",
      "divisionRattachee": "ARTICLE 19",
      "urlDivisionTexteVise": "/15/textes/1490.asp#D_Article_19"
    },
    "alinea": {
      "numero": "3"
    }
  },
  "corps": {
    "dispositif": "<p style=\"text-align: justify;\">Supprimer les alin&#233;as 3 et 4.</p>",
    "exposeSommaire": "<p style=\"text-align: justify;\">Cet amendement a pour objet de maintenir l&#8217;utilisation du Gazole Non Routier &#224; l&#8217;ensemble des secteurs d&#8217;activit&#233; aujourd&#8217;hui b&#233;n&#233;ficiaires, en particulier celui des travaux publics.</p><p style=\"text-align: justify;\">La suppression du gazole destin&#233; &#224; &#234;tre utilis&#233; comme carburant sous condition d&#8217;emploi, tel que le pr&#233;voit l&#8217;article&#160;19 dans sa r&#233;daction actuelle, entra&#238;nera un surco&#251;t de pr&#232;s de 500 millions d&#8217;euros pour les seules entreprises de travaux publics (soit l&#8217;&#233;quivalent de 60&#160;% de leur marge) sur les 900 millions d&#8217;euros d&#8217;&#233;conomie budg&#233;taire attendue par le Gouvernement.&#160;</p><p style=\"text-align: justify;\">Cette mesure est d&#8217;autant plus brutale que les entreprises de travaux publics, qui d&#233;pendent de la commande publique &#224; hauteur des deux tiers de leur activit&#233;, ne pourront r&#233;percuter la hausse de leurs co&#251;ts de production dans les contrats en cours.</p><p style=\"text-align: justify;\">Consid&#233;rant que les contrats g&#233;n&#233;ralement conclus dans le cadre des march&#233;s de travaux sont pluriannuels, le d&#233;s&#233;quilibre contractuel qui r&#233;sulterait de la suppression du GNR dans les travaux publics, sera des plus pr&#233;judiciables pour l&#8217;ensemble de la fili&#232;re, notamment les PME, qui composent &#224; 80&#160;% le tissu des entreprises de travaux publics.</p><p style=\"text-align: justify;\">A supposer que les co&#251;ts induits par la suppression du GNR seraient r&#233;percut&#233;s dans les contrats en cours, l&#8217;inflation des prix limitera n&#233;cessairement &#224; budgets constants le volume d&#8217;investissement des donneurs d&#8217;ordre public et ce, dans un contexte de sous-investissement r&#233;current en mati&#232;re d&#8217;infrastructures.</p><p style=\"text-align: justify;\">Au regard de ce qui pr&#233;c&#232;de, il convient donc de maintenir le r&#233;gime applicable existant en mati&#232;re de carburant sous condition d&#8217;emploi pour l&#8217;ensemble des secteurs d&#8217;activit&#233;.</p>"
  },
  "representations": [
    {
      "nom": "PDF",
      "typeMime": {
        "type": "application",
        "subType": "PDF"
      },
      "statutRepresentation": {
        "verbatim": true,
        "canonique": true,
        "officielle": true,
        "transcription": false,
        "enregistrement": false
      },
      "contenu": {
        "documentURI": "/15/amendements/1490/AN/252.pdf"
      }
    }
  ],
  "seanceDiscussion": "RUANR5L15S2019IDS21432",
  "sort": {
    "dateSaisie": "2018-12-18T17:24:25.000+01:00",
    "sortEnSeance": "Tombé"
  },
  "dateDepot": "2018-12-14T01:00:00.000+01:00",
  "dateDistribution": "2018-12-17T01:00:00.000+01:00",
  "article99": "0",
  "loiReference": {}
}