{
  "uid": "AMANR5L15PO420120B0904P0D1N534",
  "identifiant": {
    "legislature": "15",
    "numero": "534",
    "numRect": "0",
    "saisine": {
      "texteLegislatifRef": "PRJLANR5L15B0904",
      "numeroPartiePLF": "0",
      "organeExamen": "PO420120",
      "mentionSecondeDeliberation": "0"
    }
  },
  "numeroLong": "AS534",
  "etapeTexte": "1ère lecture (1ère assemblée saisie)",
  "triAmendement": "fs",
  "cardinaliteAmdtMultiples": "1",
  "etat": "Discuté",
  "signataires": {
    "auteur": {
      "typeAuteur": "Depute",
      "acteurRef": "PA722312",
      "groupePolitiqueRef": "PO730964"
    },
    "cosignatairesRefs": [
      "PA719092",
      "PA722312",
      "PA719790",
      "PA720190",
      "PA719890",
      "PA719592",
      "PA719024",
      "PA606639",
      "PA719100",
      "PA718876"
    ],
    "texteAffichable": "Mme&#160;Bessot Ballot,  M.&#160;Besson-Moreau, M.&#160;Sorre, M.&#160;Vignal, M.&#160;Chalumeau, M.&#160;Blanchet, M.&#160;Simian, Mme&#160;Brulebois, Mme&#160;Tuffnell et M.&#160;Ardouin"
  },
  "pointeurFragmentTexte": {
    "division": {
      "titre": "Article 7",
      "articleDesignationCourte": "ART. 7",
      "type": "ARTICLE",
      "avantAApres": "A",
      "divisionRattachee": "ARTICLE 7",
      "urlDivisionTexteVise": "/15/textes/0904.asp#D_Article_7"
    },
    "alinea": {
      "avantAApres": "A",
      "numero": "8",
      "alineaDesignation": "Alinéa 8"
    }
  },
  "corps": {
    "dispositif": "<p style=\"text-align: justify;\">I.&#160;&#8211;&#160;R&#233;diger ainsi l&#8217;alin&#233;a&#160;8&#160;:</p><p style=\"text-align: justify;\">&#171;&#160;3&#176; Le dernier alin&#233;a de l&#8217;article L.&#160;6222&#8209;22&#8209;1 est ainsi r&#233;dig&#233;&#160;:</p><p style=\"text-align: justify;\">&#171;&#160;Il fait l&#8217;objet d&#8217;un d&#233;p&#244;t suspensif dans les conditions fix&#233;es au chapitre IV du pr&#233;sent titre.&#160;&#187;&#160;;</p><p style=\"text-align: justify;\">II.&#160;&#8211;&#160;En cons&#233;quence, &#224; l&#8217;alin&#233;a&#160;9, apr&#232;s le mot&#160;:</p><p style=\"text-align: justify;\">&#171;&#160;D&#233;p&#244;t&#160;&#187;,</p><p style=\"text-align: justify;\">ins&#233;rer le mot&#160;:</p><p style=\"text-align: justify;\">&#171;&#160;suspensif&#160;&#187;.</p><p style=\"text-align: justify;\">III.&#160;&#8211;&#160;En cons&#233;quence, &#224; l&#8217;alin&#233;a&#160;11, substituer aux mots&#160;:</p><p style=\"text-align: justify;\">&#171;&#160;sont d&#233;pos&#233;s aupr&#232;s de l&#8217;op&#233;rateur de comp&#233;tences&#160;&#187;,</p><p style=\"text-align: justify;\">les mots&#160;:</p><p style=\"text-align: justify;\">&#171;&#160;font l&#8217;objet d&#8217;un d&#233;p&#244;t suspensif aupr&#232;s de la chambre consulaire comp&#233;tente&#160;&#187;.</p><p style=\"text-align: justify;\">IV.&#160;&#8211;&#160;En cons&#233;quence, supprimer les alin&#233;as 12 et 13.</p><p style=\"text-align: justify;\">V.&#160;&#8211;&#160;En cons&#233;quence, &#224; l&#8217;alin&#233;a&#160;15, substituer aux mots&#160;:</p><p style=\"text-align: justify;\">&#171;&#160;&#171;&#160;adress&#233; pour enregistrement au&#160;&#187; sont remplac&#233;s par le mot&#160;: &#171;&#160;d&#233;pos&#233;&#160;&#187;,</p><p style=\"text-align: justify;\">les mots&#160;:</p><p style=\"text-align: justify;\">&#171;&#160;&#171;&#160;est adress&#233; pour enregistrement au&#160;&#187; sont remplac&#233;s par les mots&#160;:&#160;&#171;&#160;fait l&#8217;objet d&#8217;un d&#233;p&#244;t suspensif&#160;&#187;.</p>",
    "exposeSommaire": "<p>Cet amendement, propos&#233; par le r&#233;seau des CCI, vise &#224; s&#233;curiser les contrats d&#8217;enregistrement par une proc&#233;dure de d&#233;p&#244;t suspensif. </p><p>Alors que le pr&#233;sent projet de loi pr&#233;voit la suppression de la proc&#233;dure d&#8217;enregistrement des contrats d&#8217;apprentissage et son remplacement par une simple proc&#233;dure de d&#233;p&#244;t, &#224; l&#8217;instar des modalit&#233;s du contrat de professionnalisation, il appara&#238;t un risque d&#8217;ins&#233;curiser les contrats d&#8217;apprentissage, au d&#233;triment des jeunes comme des entreprises.</p><p>Les contrats d&#8217;apprentissage concernent majoritairement des jeunes de 18 ans et moins &#8211; 51.2 % des nouvelles entr&#233;es en apprentissage[1]. Pour beaucoup d&#8217;entre eux, il s&#8217;agit d&#8217;une premi&#232;re exp&#233;rience sur le march&#233; du travail, qu&#8217;il convient de s&#233;curiser. Plus de 70% des entreprises embauchant des apprentis ont moins de 50 salari&#233;s et sont donc souvent d&#233;pourvues de sp&#233;cialistes en droit du travail[2]. A titre d&#8217;exemple, le r&#233;seau des chambres de commerce note que pr&#232;s de 40 % des contrats re&#231;us par les services d&#8217;enregistrement, font l&#8217;objet d&#8217;erreurs et sont potentiellement source de contentieux.</p><p>La volont&#233; de simplification du syst&#232;me d&#8217;apprentissage ne doit pas se faire au d&#233;triment de la s&#233;curisation des apprentis et des entreprises, notamment les plus petites d&#8217;entre elles. C&#8217;est pourquoi le pr&#233;sent amendement propose de renforcer la proc&#233;dure du d&#233;p&#244;t par un d&#233;p&#244;t suspensif&#160;permettant de ne pas engager les jeunes et les entreprises dans un contrat qui ne serait pas juridiquement correct. Ce qualificatif suspensif permet de mettre un terme provisoire au contrat s&#8217;il est invalide juridiquement. L&#8217;amendement propose &#233;galement que cette &#233;tape soit d&#233;volue aux chambres consulaires, acteurs exp&#233;riment&#233;s sur le sujet.</p><p><br />[1] Publication DARES &#8211; Les caract&#233;ristiques des contrats d&#8217;apprentissage<br />[2] Idem</p>"
  },
  "representations": [
    {
      "nom": "PDF",
      "typeMime": {
        "type": "application",
        "subType": "PDF"
      },
      "statutRepresentation": {
        "verbatim": true,
        "canonique": true,
        "officielle": true,
        "transcription": false,
        "enregistrement": false
      },
      "contenu": {
        "documentURI": "/15/amendements/0904/CION-SOC/AS534.pdf"
      }
    }
  ],
  "sort": {
    "dateSaisie": "2018-05-30T12:14:39.000+02:00",
    "sortEnSeance": "Rejeté"
  },
  "dateDepot": "2018-05-25T02:00:00.000+02:00",
  "dateDistribution": "2018-05-28T02:00:00.000+02:00",
  "article99": "0",
  "loiReference": {}
}