{
  "uid": "AMANR5L15PO59048B0235P2D1N49",
  "identifiant": {
    "legislature": "15",
    "numero": "49",
    "numRect": "0",
    "saisine": {
      "texteLegislatifRef": "PRJLANR5L15B0235",
      "numeroPartiePLF": "2",
      "organeExamen": "PO59048",
      "mentionSecondeDeliberation": "0"
    }
  },
  "numeroLong": "II-CF49",
  "etapeTexte": "1ère lecture (1ère assemblée saisie)",
  "triAmendement": "ahai",
  "cardinaliteAmdtMultiples": "1",
  "etat": "Discuté",
  "signataires": {
    "auteur": {
      "typeAuteur": "Depute",
      "acteurRef": "PA1874",
      "groupePolitiqueRef": "PO730934"
    },
    "cosignatairesRefs": [
      "PA721506",
      "PA334654",
      "PA332523",
      "PA605036",
      "PA721410",
      "PA267429",
      "PA608416",
      "PA720684",
      "PA721474",
      "PA267204",
      "PA2492",
      "PA346218",
      "PA721046",
      "PA608826",
      "PA767",
      "PA721968",
      "PA2155",
      "PA1874",
      "PA609726",
      "PA642847",
      "PA719318",
      "PA718850",
      "PA720386",
      "PA330008",
      "PA267260",
      "PA712015",
      "PA718838"
    ],
    "texteAffichable": "M.&#160;Le Fur,  M.&#160;Abad, Mme&#160;Anthoine, M.&#160;Aubert, Mme&#160;Bassire, M.&#160;Bazin, Mme&#160;Bonnivard, M.&#160;Breton, M.&#160;Brun, M.&#160;Cattin, M.&#160;Cinieri, M.&#160;Cordier, Mme&#160;Dalloz, M.&#160;Dive, M.&#160;Pierre-Henri&#160;Dumont, Mme&#160;Duby-Muller, M.&#160;Di Filippo, M.&#160;Hetzel, Mme&#160;Kuster, M.&#160;Masson, M.&#160;Menuel, Mme&#160;Poletti, M.&#160;Quentin, M.&#160;Sermier, M.&#160;Straumann, M.&#160;Vialay et M.&#160;Viry"
  },
  "pointeurFragmentTexte": {
    "division": {
      "titre": "Article 39",
      "articleDesignationCourte": "APRÈS ART. 39",
      "type": "ARTICLE",
      "avantAApres": "Apres",
      "divisionRattachee": "APRÈS L'ARTICLE 39, insérer l'article suivant:",
      "articleAdditionnel": "1",
      "urlDivisionTexteVise": "/15/textes/0235C.asp#D_Article_39"
    }
  },
  "corps": {
    "dispositif": "<p style=\"text-align: justify;\">I.&#160;&#8211; Le 8&#176; du C du II de l'article 60 de la loi n&#176; 2016-1917 du 29 d&#233;cembre 2016 de finances pour 2017&#160; est abrog&#233;.</p><p style=\"text-align: justify;\">II. &#8211;&#160;La perte de recettes pour l&#8217;&#201;tat est compens&#233;e &#224; due concurrence par la cr&#233;ation d&#8217;une taxe additionnelle aux droits mentionn&#233;s aux articles 575 et 575 A du code g&#233;n&#233;ral des imp&#244;ts.&#160;&#187;.</p>",
    "exposeSommaire": "<p style=\"text-align: justify;\">Le A du II de l'article 60 de la loi n&#176; 2016-1917 du 29 d&#233;cembre 2016 de finances pour 2017 d&#233;termine les modalit&#233;s du cr&#233;dit d&#8217;imp&#244;t &#171;&#160;modernisation du recouvrement&#160;&#187; visant &#224; annuler l&#8217;imp&#244;t sur les revenus non exceptionnels per&#231;us en 2018 et par cons&#233;quent &#224; assurer pour le contribuable lors de l&#8217;ann&#233;e de transition 2019 l&#8217;absence de double contribution aux charges publiques.</p><p style=\"text-align: justify;\">Le C du II de l'article 60 la loi n&#176; 2016-1917 du 29 d&#233;cembre 2016 de finances pour 2017 fixe la liste des revenus dits exceptionnels per&#231;us en 2018 qui resteront impos&#233;s normalement en 2019 selon les modalit&#233;s habituelles.</p><p style=\"text-align: justify;\">Il s&#8217;agit selon le minist&#232;re des finances &#224; travers cette liste de lutter contre l&#8217;optimisation et d&#8217;&#233;viter que certains contribuables ne majorent artificiellement leurs revenus de l&#8217;ann&#233;e 2018.</p><p style=\"text-align: justify;\">Selon le 8&#176; du C du II de l'article 60 de la loi n&#176; 2016-1917 du 29 d&#233;cembre 2016 de finances pour 2017 constituent des revenus exceptionnels, qui doivent rester imposables au titre de l&#8217;ann&#233;e 2018, les aides et allocations capitalis&#233;es servies en cas de conversion ou de r&#233;insertion ou pour la reprise d'une activit&#233; professionnelle.</p><p style=\"text-align: justify;\">Cette disposition constitue clairement une p&#233;nalisation des contribuables en transition professionnelle engag&#233;s dans la voie de la reprise d&#8217;activit&#233;.</p><p style=\"text-align: justify;\">C&#8217;est pourquoi le pr&#233;sent amendement vise &#224; supprimer le 8&#176; du C du II de l'article 60 de la loi n&#176; 2016-1917 du 29 d&#233;cembre 2016 de finances pour 2017.</p>"
  },
  "representations": [
    {
      "nom": "PDF",
      "typeMime": {
        "type": "application",
        "subType": "PDF"
      },
      "statutRepresentation": {
        "verbatim": true,
        "canonique": true,
        "officielle": true,
        "transcription": false,
        "enregistrement": false
      },
      "contenu": {
        "documentURI": "/15/amendements/0235C/CION_TOUTE/CF49.pdf"
      }
    }
  ],
  "sort": {
    "sortEnSeance": "Rejeté"
  },
  "dateDepot": "2017-10-18T02:00:00.000+02:00",
  "dateDistribution": "2017-11-09T01:00:00.000+01:00",
  "article99": "0",
  "loiReference": {
    "codeLoi": "Loi 2016-1917",
    "divisionCodeLoi": "60 II C 8"
  }
}