{
  "uid": "AMANR5L15SEA717460BTC1924P0D1N308",
  "identifiant": {
    "legislature": "15",
    "numero": "308",
    "numRect": "0",
    "saisine": {
      "texteLegislatifRef": "PRJLANR5L15BTC1924",
      "numeroPartiePLF": "0",
      "organeExamen": "PO717460",
      "mentionSecondeDeliberation": "0"
    }
  },
  "numeroLong": "308",
  "etapeTexte": "1ère lecture (1ère assemblée saisie)",
  "triAmendement": "aeaaaaaaaaaaaaaaaaaaaaaaaaaaaaaaaaaaaaaaaaaaaaaaaajob",
  "cardinaliteAmdtMultiples": "1",
  "etat": "Discuté",
  "signataires": {
    "auteur": {
      "typeAuteur": "Depute",
      "acteurRef": "PA607619",
      "groupePolitiqueRef": "PO759900"
    },
    "cosignatairesRefs": [
      "PA719146",
      "PA942",
      "PA605518",
      "PA333421",
      "PA719138",
      "PA608292",
      "PA405480",
      "PA331582",
      "PA336439",
      "PA336175",
      "PA607619",
      "PA755549",
      "PA719286",
      "PA267042",
      "PA720996",
      "PA605694"
    ],
    "texteAffichable": "M.&#160;Molac,  M.&#160;Acquaviva, M.&#160;Brial, M.&#160;Castellani, M.&#160;Cl&#233;ment, M.&#160;Colombani, M.&#160;Charles&#160;de Courson, Mme&#160;Dubi&#233;, M.&#160;El Guerrab, M.&#160;Falorni, M.&#160;Favennec Becot, M.&#160;Fran&#231;ois-Michel&#160;Lambert, M.&#160;Pancher, Mme&#160;Pinel, M.&#160;Pupponi et M.&#160;Philippe&#160;Vigier"
  },
  "pointeurFragmentTexte": {
    "division": {
      "titre": "Article 3",
      "articleDesignationCourte": "ART. 3",
      "type": "ARTICLE",
      "avantAApres": "A",
      "divisionRattachee": "ARTICLE 3",
      "urlDivisionTexteVise": "/15/textes/1924.asp#D_Article_3"
    },
    "alinea": {
      "numero": "49"
    }
  },
  "corps": {
    "dispositif": "<p style=\"text-align: justify;\">&#192; la fin de l&#8217;alin&#233;a&#160;49, supprimer les mots&#160;:</p><p style=\"text-align: justify;\">&#171;&#160;ayant un impact sur les personnels&#160;&#187;.</p>",
    "exposeSommaire": "<p style=\"text-align: justify;\">Cet amendement propose de ne pas faire figurer dans l&#8217;article la notion non pertinente &#171;&#160;d&#8217;impact sur les personnels&#160;&#187;, dans la mesure o&#249; celle-ci est consubstantielle de toute d&#233;cision relative &#224; l&#8217;organisation, au fonctionnement des services, &#224; l&#8217;&#233;galit&#233; professionnelle et aux &#233;volutions des administrations.</p>"
  },
  "representations": [
    {
      "nom": "PDF",
      "typeMime": {
        "type": "application",
        "subType": "PDF"
      },
      "statutRepresentation": {
        "verbatim": true,
        "canonique": true,
        "officielle": true,
        "transcription": false,
        "enregistrement": false
      },
      "contenu": {
        "documentURI": "/15/amendements/1924/AN/308.pdf"
      }
    }
  ],
  "sort": {
    "dateSaisie": "2019-05-15T00:05:48.000+02:00",
    "sortEnSeance": "Rejeté"
  },
  "dateDepot": "2019-05-08T02:00:00.000+02:00",
  "dateDistribution": "2019-05-10T02:00:00.000+02:00",
  "article99": "0",
  "loiReference": {}
}