{
  "uid": "AMANR5L15SEA717460B2272P1D1N107",
  "identifiant": {
    "legislature": "15",
    "numero": "107",
    "numRect": "0",
    "saisine": {
      "texteLegislatifRef": "PRJLANR5L15B2272",
      "numeroPartiePLF": "1",
      "organeExamen": "PO717460",
      "mentionSecondeDeliberation": "0"
    }
  },
  "numeroLong": "I-107",
  "etapeTexte": "1ère lecture (1ère assemblée saisie)",
  "triAmendement": "duaaaaaaaaaaaaaaaaaaaaaaaaaaaaaaaaaaaaaaaaaaaaaaaaxd",
  "cardinaliteAmdtMultiples": "1",
  "etat": "Irrecevable",
  "signataires": {
    "auteur": {
      "typeAuteur": "Depute",
      "acteurRef": "PA330909",
      "groupePolitiqueRef": "PO730934"
    },
    "cosignatairesRefs": [
      "PA721678",
      "PA643103",
      "PA720210",
      "PA332523",
      "PA712015",
      "PA643134",
      "PA719272",
      "PA608016",
      "PA722390",
      "PA2155",
      "PA605036",
      "PA267204",
      "PA330909",
      "PA346218",
      "PA718838",
      "PA606712"
    ],
    "texteAffichable": "M.&#160;Descoeur,  Mme&#160;Dalloz, M.&#160;Abad, Mme&#160;Beauvais, M.&#160;Menuel, M.&#160;Lurton, Mme&#160;Meunier, M.&#160;Reda, M.&#160;Sermier, M.&#160;Masson, Mme&#160;Corneloup, M.&#160;Dive, M.&#160;Brun, M.&#160;Ferrara, Mme&#160;Louwagie et Mme&#160;Valentin"
  },
  "pointeurFragmentTexte": {
    "division": {
      "titre": "Article 16",
      "articleDesignationCourte": "APRÈS ART. 16",
      "type": "ARTICLE",
      "avantAApres": "Apres",
      "divisionRattachee": "APRÈS L'ARTICLE 16, insérer l'article suivant:",
      "articleAdditionnel": "1",
      "urlDivisionTexteVise": "/15/textes/2272A.asp#D_Article_16"
    }
  },
  "corps": {},
  "representations": [
    {
      "nom": "PDF",
      "typeMime": {
        "type": "application",
        "subType": "PDF"
      },
      "statutRepresentation": {
        "verbatim": true,
        "canonique": true,
        "officielle": true,
        "transcription": false,
        "enregistrement": false
      },
      "contenu": {
        "documentURI": "/15/amendements/2272A/AN/107.pdf"
      }
    }
  ],
  "dateDepot": "2019-10-03T02:00:00.000+02:00",
  "dateDistribution": "2019-10-14T02:00:00.000+02:00",
  "article99": "0",
  "loiReference": {}
}