{
  "uid": "AMANR5L15SEA717460BTC0105P0D1N62",
  "identifiant": {
    "legislature": "15",
    "numero": "62",
    "numRect": "0",
    "saisine": {
      "texteLegislatifRef": "PRJLANR5L15BTC0105",
      "numeroPartiePLF": "0",
      "organeExamen": "PO717460",
      "mentionSecondeDeliberation": "0"
    }
  },
  "numeroLong": "62",
  "etapeTexte": "1ère lecture (2ème assemblée saisie)",
  "triAmendement": "d",
  "cardinaliteAmdtMultiples": "1",
  "etat": "Discuté",
  "signataires": {
    "auteur": {
      "typeAuteur": "Depute",
      "acteurRef": "PA709315",
      "groupePolitiqueRef": "PO730934"
    },
    "cosignatairesRefs": [
      "PA718884",
      "PA712015",
      "PA605036",
      "PA2492",
      "PA267735",
      "PA709315",
      "PA721046",
      "PA720210"
    ],
    "texteAffichable": "M.&#160;Viala,  M.&#160;Dive, Mme&#160;Bazin-Malgras, Mme&#160;Bassire, Mme&#160;Beauvais, M.&#160;de Ganay, M.&#160;Abad et M.&#160;Quentin"
  },
  "pointeurFragmentTexte": {
    "division": {
      "titre": "Article 6",
      "articleDesignationCourte": "ART. 6",
      "type": "ARTICLE",
      "avantAApres": "A",
      "divisionRattachee": "ARTICLE 6",
      "urlDivisionTexteVise": "/15/textes/0105.asp#D_Article_6"
    },
    "alinea": {
      "avantAApres": "A",
      "numero": "5",
      "alineaDesignation": "Alinéa 5"
    }
  },
  "corps": {
    "dispositif": "<p style=\"page-break-after: avoid; text-align: justify;\">Compl&#233;ter cet article par l&#8217;alin&#233;a suivant&#160;:</p><p style=\"text-align: justify;\">&#171;&#160;Ces interdictions s&#8217;appliquent &#224; tous les &#233;lus dont le niveau de responsabilit&#233; le justifie&#160;: s&#233;nateurs, pr&#233;sidents de conseils r&#233;gionaux, de conseils d&#233;partementaux, de communaut&#233;s de communes et d&#8217;agglom&#233;ration et de communes de grande taille.&#160;&#187;</p>",
    "exposeSommaire": "<p style=\"text-align: justify;\">De la m&#234;me mani&#232;re que tout d&#233;put&#233;, quelles que soient ses responsabilit&#233;s au sein de l&#8217;Assembl&#233;e nationale, devra se soumettre &#224; ces obligations une fois le texte vot&#233;, tout &#233;lu devra &#233;galement s&#8217;y soumettre, quel que soit son niveau de responsabilit&#233; au sein de la collectivit&#233; qu&#8217;il repr&#233;sente. Les probl&#233;matiques li&#233;es aux activit&#233;s de conseil quand elles sont exerc&#233;es par les parlementaires sont identiques au niveau local quand celles-ci sont exerc&#233;es par un dirigeant d&#8217;ex&#233;cutif local.</p>"
  },
  "representations": [
    {
      "nom": "PDF",
      "typeMime": {
        "type": "application",
        "subType": "PDF"
      },
      "statutRepresentation": {
        "verbatim": true,
        "canonique": true,
        "officielle": true,
        "transcription": false,
        "enregistrement": false
      },
      "contenu": {
        "documentURI": "/15/amendements/0105/AN/62.pdf"
      }
    }
  ],
  "seanceDiscussion": "RUANR5L15S2017IDS20663",
  "sort": {
    "dateSaisie": "2017-07-29T00:56:49.000+02:00",
    "sortEnSeance": "Rejeté"
  },
  "dateDepot": "2017-07-21T02:00:00.000+02:00",
  "dateDistribution": "2017-07-24T02:00:00.000+02:00",
  "article99": "0",
  "loiReference": {}
}