{
  "uid": "AMANR5L15SEA717460BTC1547P0D1N209",
  "identifiant": {
    "legislature": "15",
    "numero": "209",
    "numRect": "0",
    "saisine": {
      "texteLegislatifRef": "PRJLANR5L15BTC1547",
      "numeroPartiePLF": "0",
      "organeExamen": "PO717460",
      "mentionSecondeDeliberation": "0"
    }
  },
  "numeroLong": "209",
  "etapeTexte": "1ère lecture (1ère assemblée saisie)",
  "triAmendement": "oaaaaaaaaaaaaaaaaaaaaaaaaaaaaaaaaaaaaaaaaaaaaaaaaazzzu",
  "cardinaliteAmdtMultiples": "1",
  "etat": "Irrecevable",
  "signataires": {
    "auteur": {
      "typeAuteur": "Depute",
      "acteurRef": "PA643134",
      "groupePolitiqueRef": "PO730934"
    },
    "cosignatairesRefs": [
      "PA643134"
    ],
    "texteAffichable": "Mme&#160;Valentin"
  },
  "pointeurFragmentTexte": {
    "division": {
      "titre": "Article 4",
      "articleDesignationCourte": "APRÈS ART. 4",
      "type": "ARTICLE",
      "avantAApres": "Apres",
      "divisionRattachee": "APRÈS L'ARTICLE 4, insérer l'article suivant:",
      "articleAdditionnel": "1",
      "urlDivisionTexteVise": "/15/textes/1547.asp#D_Article_4"
    }
  },
  "corps": {
    "dispositif": "<p>Compl&#233;ter cet article par l&#8217;alin&#233;a suivant :</p><p>&#171; Cette prime d&#8217;activit&#233; est destin&#233;e &#224; l&#8217;ensemble des salari&#233;s concern&#233;s peu importe le montant des m&#233;nages. &#187;</p>",
    "exposeSommaire": "<p>Cette prime ne d&#233;pend, contrairement &#224; ce qui &#233;tait annonc&#233;, pas seulement du revenu de chacun des salari&#233;s mais aussi du montant des revenus de leur m&#233;nage.</p><p>Or, une Fran&#231;aise gagne en moyenne 9 % de moins que son homologue masculin et que 58,5 % des b&#233;n&#233;ficiaires du SMIC sont des femmes, comment ne pas voir dans le choix de la revalorisation de la prime d&#8217;activit&#233; pour augmenter le SMIC une pr&#233;carisation du statut de la travailleuse ?</p><p>Priver les b&#233;n&#233;ficiaires du SMIC de la revalorisation de la prime d&#8217;activit&#233; en invoquant les revenus du conjoint, c&#8217;est ass&#233;ner une v&#233;ritable estocade &#224; l&#8217;ind&#233;pendance &#233;conomique de la femme acquise de haute lutte. Et si les femmes ne sont pas les seules victimes des r&#232;gles encadrant cette revalorisation de la prime d&#8217;activit&#233;, elles repr&#233;sentent une majorit&#233; suffisante parmi les plus pauvres des salari&#233;s pour ne pas d&#233;noncer l&#8217;atteinte symbolique que porte cette mesure au combat en faveur de l&#8217;&#233;galit&#233; entre les femmes et les hommes.</p><p>Cet amendement vise donc &#224; faire en sorte que les femmes ne soient pas une nouvelle fois sacrifi&#233;es sur l&#8217;autel d&#8217;enjeux technocratiques d&#233;connect&#233;s d&#8217;une r&#233;alit&#233; socio-&#233;conomique qui leur est encore et toujours d&#233;favorable. L&#8217;augmentation de la prime d&#8217;activit&#233; doit concerner tous les b&#233;n&#233;ficiaires du salaire minimum, sans distinction de situation, ni de sexe</p><p>En somme, cet amendement vise &#224; rendre cette prime attribuable &#224; chacun des salari&#233;s.</p>"
  },
  "representations": [
    {
      "nom": "PDF",
      "typeMime": {
        "type": "application",
        "subType": "PDF"
      },
      "statutRepresentation": {
        "verbatim": true,
        "canonique": true,
        "officielle": true,
        "transcription": false,
        "enregistrement": false
      },
      "contenu": {
        "documentURI": "/15/amendements/1547/AN/209.pdf"
      }
    }
  ],
  "dateDepot": "2018-12-20T01:00:00.000+01:00",
  "dateDistribution": "2018-12-20T01:00:00.000+01:00",
  "article99": "0",
  "loiReference": {}
}