{
  "uid": "AMANR5L15PO419610B2336P0D1N36",
  "identifiant": {
    "legislature": "15",
    "numero": "36",
    "numRect": "0",
    "saisine": {
      "texteLegislatifRef": "PIONANR5L15B2336",
      "numeroPartiePLF": "0",
      "organeExamen": "PO419610",
      "mentionSecondeDeliberation": "0"
    }
  },
  "numeroLong": "CE36",
  "etapeTexte": "1ère lecture (1ère assemblée saisie)",
  "triAmendement": "kiaaaaaaaaaaaaaaaaaaaaaaaaaaaaaaaaaaaaaaaaaaaaaaaao",
  "cardinaliteAmdtMultiples": "1",
  "amendementParent": "AMANR5L15PO419610B2336P0D1N28",
  "etat": "Discuté",
  "signataires": {
    "auteur": {
      "typeAuteur": "Depute",
      "acteurRef": "PA642847",
      "groupePolitiqueRef": "PO730934"
    },
    "cosignatairesRefs": [
      "PA642847"
    ],
    "texteAffichable": "M.&#160;Bazin"
  },
  "pointeurFragmentTexte": {
    "division": {
      "titre": "Article 7",
      "articleDesignationCourte": "ART. 7",
      "type": "ARTICLE",
      "avantAApres": "A",
      "divisionRattachee": "ARTICLE 7",
      "urlDivisionTexteVise": "/15/textes/2336.asp#D_Article_7"
    }
  },
  "corps": {
    "dispositif": "<p>&#192; la premi&#232;re phrase de l&#8217;alin&#233;a&#160;6, substituer au mot&#160;: </p><p>&#171;&#160;est&#160;&#187;,</p><p style=\"text-align: justify;\">les mots&#160;:</p><p style=\"text-align: justify;\">&#171;&#160;peut &#234;tre&#160;&#187;.</p>",
    "exposeSommaire": "<p>A l&#8217;heure o&#249; nos collectivit&#233;s territoriales demandent moins de contraintes administratives, ce sous-amendement vise &#224; ne pas rendre obligatoire le compte rendu annuel pour toutes les communes. Il conviendrait de tenir compte de la taille des communes pour ne pas imposer &#224; toutes des contraintes inadapt&#233;es.</p>"
  },
  "representations": [
    {
      "nom": "PDF",
      "typeMime": {
        "type": "application",
        "subType": "PDF"
      },
      "statutRepresentation": {
        "verbatim": true,
        "canonique": true,
        "officielle": true,
        "transcription": false,
        "enregistrement": false
      },
      "contenu": {
        "documentURI": "/15/amendements/2336/CION-ECO/CE36.pdf"
      }
    }
  ],
  "sort": {
    "dateSaisie": "2019-11-20T17:20:27.000+01:00",
    "sortEnSeance": "Rejeté"
  },
  "dateDepot": "2019-11-19T01:00:00.000+01:00",
  "dateDistribution": "2019-11-20T01:00:00.000+01:00",
  "article99": "0",
  "loiReference": {}
}