{
  "uid": "AMANR5L15PO419610B0627P0D1N1671",
  "identifiant": {
    "legislature": "15",
    "numero": "1671",
    "numRect": "0",
    "saisine": {
      "texteLegislatifRef": "PRJLANR5L15B0627",
      "numeroPartiePLF": "0",
      "organeExamen": "PO419610",
      "mentionSecondeDeliberation": "0"
    }
  },
  "numeroLong": "CE1671",
  "etapeTexte": "1ère lecture (1ère assemblée saisie)",
  "triAmendement": "acj",
  "cardinaliteAmdtMultiples": "1",
  "etat": "Discuté",
  "signataires": {
    "auteur": {
      "typeAuteur": "Depute",
      "acteurRef": "PA719310",
      "groupePolitiqueRef": "PO730964"
    },
    "cosignatairesRefs": [
      "PA719310"
    ],
    "texteAffichable": "Mme&#160;de Lavergne"
  },
  "pointeurFragmentTexte": {
    "division": {
      "titre": "Article 5",
      "articleDesignationCourte": "APRÈS ART. 5",
      "type": "ARTICLE",
      "avantAApres": "Apres",
      "divisionRattachee": "APRÈS L'ARTICLE 5, insérer l'article suivant:",
      "articleAdditionnel": "1",
      "urlDivisionTexteVise": "/15/textes/0627.asp#D_Article_5"
    }
  },
  "corps": {
    "dispositif": "<p style=\"text-align: justify;\">Apr&#232;s l&#8217;article L.&#160;631&#8209;24&#8209;2 du code rural et de la p&#234;che maritime ainsi r&#233;dig&#233;, il est ins&#233;r&#233; un article L.&#160;631&#8209;24&#8209;3 ainsi r&#233;dig&#233;&#160;:</p><p style=\"text-align: justify;\">&#171;&#160;<i>Art.&#160;L.&#160;631&#8209;24&#8209;3</i>.&#160;&#8211;&#160;Les acteurs &#233;conomiques se r&#233;unissent et concluent tous les 3 ans une charte d&#8217;engagement pour une relance de la cr&#233;ation de valeur et pour son &#233;quitable r&#233;partition au sein des fili&#232;res agroalimentaires, sur le mod&#232;le de celle conclue le 14 novembre 2017 dans le cadre des &#201;tats g&#233;n&#233;raux de l&#8217;alimentation. Cette charte comprend des mesures relatives &#224; la garantie d&#8217;une r&#233;mun&#233;ration &#233;quitable et transparente des producteurs, &#224; la mise en place de partenariats durables et &#233;quitables entre les acteurs de la production, de la transformation et de la distribution, au d&#233;ploiement des plans de fili&#232;re, &#224; la poursuite de la transformation des syst&#232;mes agricoles vers une agriculture durable, &#224; la garantie de la tra&#231;abilit&#233; des produits pour une meilleure information des consommateurs et &#224; la mont&#233;e en gamme de l&#8217;offre alimentaire.</p><p style=\"text-align: justify;\">&#171;&#160;Cette charte est annex&#233;e aux contrats conclus entre les producteurs et les distributeurs.</p><p style=\"text-align: justify;\">&#171;&#160;En cas de manquement aux engagements pris dans cette charte, l&#8217;article&#160;1217 du code civil s&#8217;applique.&#160;&#187;</p>",
    "exposeSommaire": "<p style=\"text-align: justify;\">La Charte des &#233;tats g&#233;n&#233;raux de l&#8217;alimentation a &#233;t&#233; conclue le 14 novembre 2017 par les principales organisations agricoles et les grandes enseignes de distribution, dans un esprit de responsabilit&#233; partag&#233;e. Les diff&#233;rents acteurs y ont d&#233;fini des engagements qui sont au c&#339;ur des relations contractuelles entre producteurs et distributeurs. Elle contient notamment des engagements relatifs &#224; la tra&#231;abilit&#233; des produits, &#224; la loyaut&#233; contractuelle, ou au respect strict du cadre l&#233;gislatif et r&#233;glementaire en vigueur et &#224; venir (en mati&#232;re de seuil de revente &#224; pertes ou de promotions). L&#8217;ensemble de ces engagements a vocation &#224; s&#8217;inscrire dans la dur&#233;e, afin de construire ou de maintenir des relations contractuelles respectueuses et durables entre les acteurs de la cha&#238;ne.</p><p style=\"text-align: justify;\">Ces engagements seront toutefois amen&#233;s &#224; &#233;voluer au cours de la relation contractuelle. C&#8217;est pourquoi il convient de conduire les acteurs &#224; ren&#233;gocier &#224; &#233;ch&#233;ance r&#233;guli&#232;re, afin de conclure une nouvelle charte d&#8217;engagement.</p><p style=\"text-align: justify;\">A ce jour, la charte des &#233;tats g&#233;n&#233;raux de l&#8217;alimentation n&#8217;a toutefois pas de valeur contractuelle opposable. Cet amendement a donc vocation &#224; rendre obligatoire, tous les trois ans, la conclusion (et non la seule n&#233;gociation) d&#8217;une charte, qui engagerait l&#8217;ensemble de ses cosignataires et serait annex&#233;e aux contrats de vente. Cette charte aurait une pleine valeur contractuelle.</p><p style=\"text-align: justify;\">La Charte des &#233;tats g&#233;n&#233;raux de l&#8217;alimentation est le fruit d&#8217;un engagement collectif impuls&#233; par le gouvernement. Elle doit servir de base &#224; des n&#233;gociations futures, notamment en ce qui concerne le respect mutuel des acteurs de la cha&#238;ne.</p><p style=\"text-align: justify;\"><br />&#160;</p>"
  },
  "representations": [
    {
      "nom": "PDF",
      "typeMime": {
        "type": "application",
        "subType": "PDF"
      },
      "statutRepresentation": {
        "verbatim": true,
        "canonique": true,
        "officielle": true,
        "transcription": false,
        "enregistrement": false
      },
      "contenu": {
        "documentURI": "/15/amendements/0627/CION-ECO/CE1671.pdf"
      }
    }
  ],
  "sort": {
    "dateSaisie": "2018-04-18T12:07:58.000+02:00",
    "sortEnSeance": "Retiré"
  },
  "dateDepot": "2018-04-13T02:00:00.000+02:00",
  "dateDistribution": "2018-04-16T02:00:00.000+02:00",
  "article99": "0",
  "loiReference": {
    "codeLoi": "rural et pêche maritime",
    "divisionCodeLoi": "L631-24-3"
  }
}