{
  "uid": "AMANR5L15SEA717460BTC2401P0D1N1334",
  "identifiant": {
    "legislature": "15",
    "numero": "1334",
    "numRect": "0",
    "saisine": {
      "texteLegislatifRef": "PRJLANR5L15BTC2401",
      "numeroPartiePLF": "0",
      "organeExamen": "PO717460",
      "mentionSecondeDeliberation": "0"
    }
  },
  "numeroLong": "1334",
  "etapeTexte": "1ère lecture (2ème assemblée saisie)",
  "triAmendement": "obaaaaaaaaaaaaaaaaaaaaaaaaaaaaaaaaaaaaaaaaaaaaaaaawbi",
  "cardinaliteAmdtMultiples": "1",
  "etat": "A discuter",
  "signataires": {
    "auteur": {
      "typeAuteur": "Depute",
      "acteurRef": "PA643127",
      "groupePolitiqueRef": "PO730964"
    },
    "cosignatairesRefs": [
      "PA643127"
    ],
    "texteAffichable": "M.&#160;Questel"
  },
  "pointeurFragmentTexte": {
    "division": {
      "titre": "Article 28 bis",
      "articleDesignationCourte": "ART. 28 BIS",
      "type": "ARTICLE",
      "avantAApres": "A",
      "divisionRattachee": "ARTICLE 28 BIS",
      "urlDivisionTexteVise": "/15/textes/2401.asp#D_Article_28_bis"
    },
    "alinea": {
      "numero": "4"
    }
  },
  "corps": {
    "dispositif": "<p style=\"text-align: justify;\">Supprimer les alin&#233;as 4 &#224; 7.</p>",
    "exposeSommaire": "<p style=\"text-align: justify;\">Amendement de coordination.</p><p style=\"text-align: justify;\">La modulation des indemnit&#233;s des conseillers d&#233;partementaux et r&#233;gionaux est d&#233;j&#224; pr&#233;vue par le droit en vigueur.</p>"
  },
  "representations": [
    {
      "nom": "PDF",
      "typeMime": {
        "type": "application",
        "subType": "PDF"
      },
      "statutRepresentation": {
        "verbatim": true,
        "canonique": true,
        "officielle": true,
        "transcription": false,
        "enregistrement": false
      },
      "contenu": {
        "documentURI": "/15/amendements/2401/AN/1334.pdf"
      }
    }
  ],
  "dateDepot": "2019-11-14T01:00:00.000+01:00",
  "dateDistribution": "2019-11-18T01:00:00.000+01:00",
  "article99": "0",
  "loiReference": {}
}