{
  "uid": "AMANR5L15PO744107B0424P0D1N443",
  "identifiant": {
    "legislature": "15",
    "numero": "443",
    "numRect": "0",
    "saisine": {
      "texteLegislatifRef": "PRJLANR5L15B0424",
      "numeroPartiePLF": "0",
      "organeExamen": "PO744107",
      "mentionSecondeDeliberation": "0"
    }
  },
  "numeroLong": "443",
  "etapeTexte": "1ère lecture (1ère assemblée saisie)",
  "triAmendement": "f",
  "cardinaliteAmdtMultiples": "1",
  "etat": "Discuté",
  "signataires": {
    "auteur": {
      "typeAuteur": "Depute",
      "acteurRef": "PA331567",
      "groupePolitiqueRef": "PO744425"
    },
    "cosignatairesRefs": [
      "PA331567"
    ],
    "texteAffichable": "Mme&#160;de La Raudi&#232;re"
  },
  "pointeurFragmentTexte": {
    "division": {
      "titre": "Article 9",
      "articleDesignationCourte": "AVANT ART. 9",
      "type": "ARTICLE",
      "avantAApres": "Avant",
      "divisionRattachee": "AVANT L'ARTICLE 9, insérer l'article suivant:",
      "articleAdditionnel": "1",
      "urlDivisionTexteVise": "/15/textes/0424.asp#D_Article_9"
    }
  },
  "corps": {
    "dispositif": "<p style=\"text-align: justify;\">L&#8217;article L.&#160;231&#8209;1 du code des relations entre le public et l&#8217;administration est compl&#233;t&#233; par un alin&#233;a ainsi r&#233;dig&#233;&#160;:</p><p style=\"text-align: justify;\">&#171;&#160;La liste des proc&#233;dures pour lesquelles le silence gard&#233; sur une demande vaut d&#233;cision d&#8217;acceptation est publi&#233;e dans des conditions fix&#233;es par d&#233;cret. Elle est r&#233;vis&#233;e annuellement.&#160;&#187;</p>",
    "exposeSommaire": "<p style=\"text-align: justify;\">Lorsqu&#8217;une personne effectue une proc&#233;dure potentiellement soumise au principe du SVA, il faut qu&#8217;elle sache clairement si elle y est &#233;ligible et sous quel d&#233;lai (sachant qu&#8217;il y a de nombreuses exceptions au d&#233;lai de principe de 2 mois).</p><p style=\"text-align: justify;\">L&#8217;id&#233;al serait de l&#8217;indiquer clairement sur l&#8217;accus&#233; de r&#233;ception que l&#8217;administration est cens&#233;e adresser au demandeur pour acter de la compl&#233;tude de dossier&#8230;&#160;accus&#233; qui n&#8217;est malheureusement pas remis syst&#233;matiquement.</p><p style=\"text-align: justify;\">Dans tous les cas, la liste des proc&#233;dures et le r&#233;gime qui leur est applicable doit &#234;tre tr&#232;s clair, en particulier pour les chefs d&#8217;entreprises. Ce n&#8217;est pas le cas de la liste diffus&#233;e actuellement sur L&#233;gifrance qui prend la forme de tableaux indigestes (par code) au format PDF et qui n&#8217;a pas de valeur juridique (https&#160;://www.legifrance.gouv.fr/Droit-francais/Silence-vaut-accord-SVA).</p><p style=\"text-align: justify;\">L&#8217;actuel gouvernement s&#8217;&#233;tant montr&#233; ouvert la lisibilit&#233;, &#224; la transparence et &#224; l&#8217;efficacit&#233; des relations avec l&#8217;administration, le pr&#233;sent amendement pr&#233;voit de mentionner cette liste dans la loi, et qu&#8217;un d&#233;cret vienne organiser sa publication. Elle devra &#234;tre r&#233;vis&#233;e annuellement par le gouvernement&#160;: c&#8217;est-&#224;-dire que ce dernier devra passer en revue les proc&#233;dures pour voir les exceptions qui pourraient passer dans le droit commun.</p>"
  },
  "representations": [
    {
      "nom": "PDF",
      "typeMime": {
        "type": "application",
        "subType": "PDF"
      },
      "statutRepresentation": {
        "verbatim": true,
        "canonique": true,
        "officielle": true,
        "transcription": false,
        "enregistrement": false
      },
      "contenu": {
        "documentURI": "/15/amendements/0424/CSCONF/443.pdf"
      }
    }
  ],
  "sort": {
    "dateSaisie": "2018-01-15T23:20:45.000+01:00",
    "sortEnSeance": "Non soutenu"
  },
  "dateDepot": "2018-01-11T01:00:00.000+01:00",
  "dateDistribution": "2018-01-15T01:00:00.000+01:00",
  "article99": "0",
  "loiReference": {
    "codeLoi": "relations public et administration",
    "divisionCodeLoi": "231-1"
  }
}