{
  "uid": "AMANR5L15SEA717460B1297P0D1N834",
  "identifiant": {
    "legislature": "15",
    "numero": "834",
    "numRect": "0",
    "saisine": {
      "texteLegislatifRef": "PRJLANR5L15B1297",
      "numeroPartiePLF": "0",
      "organeExamen": "PO717460",
      "mentionSecondeDeliberation": "0"
    }
  },
  "numeroLong": "834",
  "etapeTexte": "1ère lecture (1ère assemblée saisie)",
  "triAmendement": "faaaaaaaaaaaaaaaaaaaaaaaaaaaaaaaaaaaaaaaaaaaaaaaaaajc",
  "cardinaliteAmdtMultiples": "1",
  "etat": "Discuté",
  "signataires": {
    "auteur": {
      "typeAuteur": "Depute",
      "acteurRef": "PA331582",
      "groupePolitiqueRef": "PO759900"
    },
    "cosignatairesRefs": [
      "PA331582"
    ],
    "texteAffichable": "M.&#160;Philippe&#160;Vigier"
  },
  "pointeurFragmentTexte": {
    "division": {
      "titre": "Article 30",
      "articleDesignationCourte": "APRÈS ART. 30",
      "type": "ARTICLE",
      "avantAApres": "Apres",
      "divisionRattachee": "APRÈS L'ARTICLE 30, insérer l'article suivant:",
      "articleAdditionnel": "1",
      "urlDivisionTexteVise": "/15/textes/1297.asp#D_Article_30"
    }
  },
  "corps": {
    "dispositif": "<p style=\"text-align: justify;\">Le titre III du livre IV de la premi&#232;re partie du code de la sant&#233; publique est abrog&#233;.</p>",
    "exposeSommaire": "<p style=\"text-align: justify;\">Cet amendement d&#8217;appel supprime les Agences R&#233;gionales de Sant&#233;. Leurs missions doivent &#234;tre prises en charge par des directions d&#233;partementales de la sant&#233; publique plac&#233;es sous l&#8217;autorit&#233; du pr&#233;fet.</p>"
  },
  "representations": [
    {
      "nom": "PDF",
      "typeMime": {
        "type": "application",
        "subType": "PDF"
      },
      "statutRepresentation": {
        "verbatim": true,
        "canonique": true,
        "officielle": true,
        "transcription": false,
        "enregistrement": false
      },
      "contenu": {
        "documentURI": "/15/amendements/1297/AN/834.pdf"
      }
    }
  ],
  "seanceDiscussion": "RUANR5L15S2019IDS21294",
  "sort": {
    "dateSaisie": "2018-10-26T17:55:04.000+02:00",
    "sortEnSeance": "Non soutenu"
  },
  "dateDepot": "2018-10-19T02:00:00.000+02:00",
  "dateDistribution": "2018-10-22T02:00:00.000+02:00",
  "article99": "0",
  "loiReference": {
    "codeLoi": "c santé publique",
    "divisionCodeLoi": "Livre IV titre III"
  }
}