{
  "uid": "AMANR5L15PO59048B2272P1D1N1398",
  "identifiant": {
    "legislature": "15",
    "numero": "1398",
    "numRect": "0",
    "saisine": {
      "texteLegislatifRef": "PRJLANR5L15B2272",
      "numeroPartiePLF": "1",
      "organeExamen": "PO59048",
      "mentionSecondeDeliberation": "0"
    }
  },
  "numeroLong": "I-CF1398",
  "etapeTexte": "1ère lecture (1ère assemblée saisie)",
  "triAmendement": "auaaaaaaaaaaaaaaaaaaaaaaaaaaaaaaaaaaaaaaaaaaaaaaaatkvi",
  "cardinaliteAmdtMultiples": "1",
  "etat": "Discuté",
  "signataires": {
    "auteur": {
      "typeAuteur": "Depute",
      "acteurRef": "PA721202",
      "groupePolitiqueRef": "PO730958"
    },
    "cosignatairesRefs": [
      "PA720286",
      "PA720422",
      "PA721062",
      "PA720846",
      "PA718868",
      "PA721202",
      "PA721226",
      "PA720892",
      "PA720430",
      "PA719578",
      "PA722142",
      "PA588884",
      "PA721210",
      "PA721960",
      "PA718860",
      "PA719676",
      "PA2150"
    ],
    "texteAffichable": "M.&#160;Coquerel,  Mme&#160;Autain, M.&#160;Bernalicis, M.&#160;Corbi&#232;re, Mme&#160;Fiat, M.&#160;Lachaud, M.&#160;Larive, M.&#160;M&#233;lenchon, Mme&#160;Obono, Mme&#160;Panot, M.&#160;Prud&apos;homme, M.&#160;Quatennens, M.&#160;Ratenon, Mme&#160;Ressiguier, Mme&#160;Rubin, M.&#160;Ruffin et Mme&#160;Taurine"
  },
  "pointeurFragmentTexte": {
    "division": {
      "titre": "Article 3",
      "articleDesignationCourte": "APRÈS ART. 3",
      "type": "ARTICLE",
      "avantAApres": "Apres",
      "divisionRattachee": "APRÈS L'ARTICLE 3, insérer l'article suivant:",
      "articleAdditionnel": "1",
      "urlDivisionTexteVise": "/15/textes/2272A.asp#D_Article_3"
    }
  },
  "corps": {
    "dispositif": "<p style=\"text-align: justify;\">I.&#160;&#8211;&#160;Les articles du code g&#233;n&#233;ral des imp&#244;ts modifi&#233;s par l&#8217;article&#160;31 de la loi n&#176;&#160;2017&#8209;1837 du 30 d&#233;cembre 2017 de finances pour 2018 sont r&#233;tablis dans leur r&#233;daction ant&#233;rieure &#224; la publication de la m&#234;me loi, &#224; l&#8217;exception des articles 885 U et 885 S du m&#234;me code, r&#233;tablis dans leur r&#233;daction ant&#233;rieure &#224; ladite loi et ainsi modifi&#233;s&#160;:</p><p style=\"text-align: justify;\">1&#176;&#160;L&#8217;article&#160;885 U, dans sa r&#233;daction ant&#233;rieure &#224; la loi n&#176;&#160;2017&#8209;1837 du 30 d&#233;cembre 2017 pr&#233;cit&#233;e, est ainsi modifi&#233;&#160;:</p><p style=\"text-align: justify;\">a) Le tableau du 1 est ainsi r&#233;dig&#233;&#160;:</p><p style=\"text-align: justify;\">&#171;&#160;</p><table style=\"border-collapse: collapse; width: 273px;\"><tbody><tr><td style=\"white-space: normal; border: 1px solid #000000; width: 136.594px;\">Fraction de la valeur nette taxable du patrimoine</td><td style=\"white-space: normal; border: 1px solid #000000; width: 151.406px;\">Tarif applicable (en %</td></tr><tr><td style=\"white-space: normal; border: 1px solid #000000; width: 136.594px;\">N&#8217;exc&#233;dant pas 400 000&#160;&#8364;</td><td style=\"white-space: normal; border: 1px solid #000000; width: 151.406px;\">0</td></tr><tr><td style=\"white-space: normal; border: 1px solid #000000; width: 136.594px;\">Sup&#233;rieure &#224; 400 000&#160;&#8364; et inf&#233;rieure ou &#233;gale &#224; 800 000&#160;&#8364;</td><td style=\"white-space: normal; border: 1px solid #000000; width: 151.406px;\">0,1</td></tr><tr><td style=\"white-space: normal; border: 1px solid #000000; width: 136.594px;\">Sup&#233;rieure &#224; 800 000&#160;&#8364; et inf&#233;rieure ou &#233;gale &#224; 2 000 000&#160;&#8364;</td><td style=\"white-space: normal; border: 1px solid #000000; width: 151.406px;\">0,5</td></tr><tr><td style=\"white-space: normal; border: 1px solid #000000; width: 136.594px;\">Sup&#233;rieure &#224; 2 000 000 et inf&#233;rieure ou &#233;gale &#224; 3 000 000&#160;&#8364;</td><td style=\"white-space: normal; border: 1px solid #000000; width: 151.406px;\">1</td></tr><tr><td style=\"white-space: normal; border: 1px solid #000000; width: 136.594px;\">Sup&#233;rieure &#224; 3 000 000 et inf&#233;rieure ou &#233;gale &#224; 5 000 000&#160;&#8364;</td><td style=\"white-space: normal; border: 1px solid #000000; width: 151.406px;\">1,5</td></tr><tr><td style=\"white-space: normal; border: 1px solid #000000; width: 136.594px;\">Sup&#233;rieure &#224; 5 000 000&#160;&#8364;</td><td style=\"white-space: normal; border: 1px solid #000000; width: 151.406px;\">2</td></tr></tbody></table><p style=\"text-align: justify;\">b) Le 2 est abrog&#233;&#160;;</p><p style=\"text-align: justify;\">2&#176;&#160;Au second alin&#233;a de l&#8217;article&#160;885 S, dans sa r&#233;daction ant&#233;rieure &#224; la loi n&#176;&#160;2017&#8209;1837 du 30 d&#233;cembre 2017 pr&#233;cit&#233;e, le taux&#160;: &#171;&#160;30&#160;%&#160;&#187; est remplac&#233; par le montant&#160;: &#171;&#160;400 000&#160;&#8364;&#160;&#187;.</p><p style=\"text-align: justify;\">II.&#160;&#8211;&#160;Les articles du livre des proc&#233;dures fiscales modifi&#233;s par l&#8217;article&#160;31 de la loi n&#176;&#160;2017&#8209;1837 du 30 d&#233;cembre 2017 de finances pour 2018 sont r&#233;tablis dans leur r&#233;daction ant&#233;rieure &#224; la publication de la loi n&#176;&#160;2017&#8209;1837 du 30 d&#233;cembre 2017 de finances pour 2018.</p><p style=\"text-align: justify;\">III.&#160;&#8211;&#160;L&#8217;article du code de la d&#233;fense modifi&#233; par l&#8217;article&#160;31 de la loi n&#176;&#160;2017&#8209;1837 du 30 d&#233;cembre 2017 de finances pour 2018 est r&#233;tabli dans sa r&#233;daction ant&#233;rieure &#224; la publication de la loi n&#176;&#160;2017&#8209;1837 du 30 d&#233;cembre 2017 de finances pour 2018.</p><p style=\"text-align: justify;\">IV.&#160;&#8211;&#160;Les articles du code mon&#233;taire et financier modifi&#233;s par l&#8217;article&#160;31 de la loi n&#176;&#160;2017&#8209;1837 du 30 d&#233;cembre 2017 de finances pour 2018 sont r&#233;tablis dans leur r&#233;daction ant&#233;rieure &#224; la publication de la loi n&#176;&#160;2017&#8209;1837 du 30 d&#233;cembre 2017 de finances pour 2018.</p><p style=\"text-align: justify;\">V.&#160;&#8211;&#160;L&#8217;article L.&#160;122&#8209;10 du code du patrimoine abrog&#233; par l&#8217;article&#160;31 de la loi n&#176;&#160;2017&#8209;1837 du 30 d&#233;cembre 2017 de finances pour 2018 est r&#233;tabli dans sa r&#233;daction ant&#233;rieure &#224; la publication de la loi n&#176;&#160;2017&#8209;1837 du 30 d&#233;cembre 2017 de finances pour 2018.</p><p style=\"text-align: justify;\">VI.&#160;&#8211;&#160;L&#8217;article&#160;25 <i>quinquies</i> de la loi n&#176;&#160;83&#8209;634 portant droits et obligations des fonctionnaires modifi&#233; par l&#8217;article&#160;31 de la loi n&#176;&#160;2017&#8209;1837 du 30 d&#233;cembre 2017 de finances pour 2018 est r&#233;tabli dans sa r&#233;daction ant&#233;rieure &#224; la publication de la loi n&#176;&#160;2017&#8209;1837 du 30 d&#233;cembre 2017 de finances pour 2018.</p><p style=\"text-align: justify;\">VII.&#160;&#8211;&#160;Les articles de la loi n&#176;&#160;2013&#8209;907 du 11 octobre 2013 relative &#224; la transparence de la vie publique modifi&#233;s par l&#8217;article&#160;31 de la loi n&#176;&#160;2017&#8209;1837 du 30 d&#233;cembre 2017 de finances pour 2018 sont r&#233;tablis dans leur r&#233;daction ant&#233;rieure &#224; la publication de la loi n&#176;&#160;2017&#8209;1837 du 30 d&#233;cembre 2017 de finances pour 2018.</p><p style=\"text-align: justify;\">VIII.&#160;&#8211;&#160;L&#8217;article&#160;16 de l&#8217;ordonnance n&#176;&#160;2017&#8209;1107 du 22 juin 2017 relative aux march&#233;s d&#8217;instruments financiers et &#224; la s&#233;paration du r&#233;gime juridique des soci&#233;t&#233;s de gestion de portefeuille de celui des entreprises d&#8217;investissement modifi&#233; par l&#8217;article&#160;31 de la loi n&#176;&#160;2017&#8209;1837 du 30 d&#233;cembre 2017 de finances pour 2018 est r&#233;tabli dans sa r&#233;daction ant&#233;rieure &#224; la publication de la loi n&#176;&#160;2017&#8209;1837 du 30 d&#233;cembre 2017 de finances pour 2018.</p>",
    "exposeSommaire": "<p style=\"text-align: justify;\">Cet amendement a pour but de permettre une v&#233;ritable redistribution des richesses, garante de l&#8217;&#233;galit&#233; r&#233;publicaine, et de r&#233;tablir une progressivit&#233; r&#233;elle de l&#8217;imp&#244;t, en &#233;tablissant une nouvelle fiscalit&#233; sur le patrimoine.</p><p style=\"text-align: justify;\">Au m&#234;me titre que nous appelons de nos v&#339;ux la mise en place d&#8217;une r&#233;elle progressivit&#233; de l&#8217;imp&#244;t sur le revenu, nous souhaitons instaurer un ISF plus fort et progressif.</p><p style=\"text-align: justify;\">Notre syst&#232;me de redistribution implique que les riches soient solidaires et contribuent &#224; l&#8217;effort national. Loin des arguments fallacieux du Gouvernement en 2017 qui invoquait l&#8217;&#233;vasion migratoire des ultra riches et affirmait que l&#8217;ISF ne rapportait rien, rappelons que selon un rapport de la DGFIP, les exil&#233;s fiscaux repr&#233;sentaient seulement 0,2% des personnes qui &#233;taient assujetties &#224; l&#8217;ISF et que les recettes de l&#8217;ISF avaient quadrupl&#233; ces trente derni&#232;res ann&#233;es. Le co&#251;t de ces d&#233;parts &#233;tait d&#8217;ailleurs estim&#233; par le quotidien Les Echos &#224; 20 millions d&#8217;euros par an, soit 160 fois moins que le co&#251;t de la suppression de l&#8217;ISF.</p><p style=\"text-align: justify;\">Ce cadeau de 7 milliards - qui repr&#233;sentent ce qu&#8217;a co&#251;t&#233; la suppression de l&#8217;ISF depuis votre arriv&#233;e au pouvoir - est donc injustifiable. Or, nos concitoyens des classes moyennes et populaires ne se verront pas redistribuer pr&#232;s de 7 milliards d&#8217;euros en deux ans. 7 milliards d&#8217;euros qui sont tout autant de services publics en moins pour ceux qui en ont besoin. 7 milliards d&#8217;euros de manque &#224; gagner qui sont utilis&#233;s par le Gouvernement pour justifier une politique aust&#233;ritaire d&#233;l&#233;taire.</p><p style=\"text-align: justify;\">Ensuite, car il est sain que l&#8217;effort fiscal soit correctement r&#233;parti entre les personnes fortun&#233;es et les tr&#232;s grandes fortunes.&#160; Ces premi&#232;res s&#8217;acquitteraient d&#8217;un taux marginal de 0,1% et les tr&#232;s grandes fortunes, au-del&#224; de 5 millions d&#8217;euros, s&#8217;acquitteraient d&#8217;un taux de 2%.</p><p style=\"text-align: justify;\">Ce bar&#232;me, d&#233;fendu par la fondation Copernic et l&#8217;&#233;conomiste Thomas Piketty, est donc plus juste, car plus progressif, et fait contribuer les riches en fonction de leur fortune.</p>"
  },
  "representations": [
    {
      "nom": "PDF",
      "typeMime": {
        "type": "application",
        "subType": "PDF"
      },
      "statutRepresentation": {
        "verbatim": true,
        "canonique": true,
        "officielle": true,
        "transcription": false,
        "enregistrement": false
      },
      "contenu": {
        "documentURI": "/15/amendements/2272A/CION_FIN/CF1398.pdf"
      }
    }
  ],
  "sort": {
    "dateSaisie": "2019-10-09T10:00:46.000+02:00",
    "sortEnSeance": "Rejeté"
  },
  "dateDepot": "2019-10-04T02:00:00.000+02:00",
  "dateDistribution": "2019-10-08T02:00:00.000+02:00",
  "article99": "0",
  "loiReference": {
    "codeLoi": "xx loi 2017-1837",
    "divisionCodeLoi": "31 (1)"
  }
}