{
  "uid": "AMANR5L15SEA717460B2272P2D1N908",
  "identifiant": {
    "legislature": "15",
    "numero": "908",
    "numRect": "0",
    "saisine": {
      "texteLegislatifRef": "PRJLANR5L15B2272",
      "numeroPartiePLF": "2",
      "organeExamen": "PO717460",
      "mentionSecondeDeliberation": "0"
    }
  },
  "numeroLong": "II-908",
  "etapeTexte": "1ère lecture (1ère assemblée saisie)",
  "triAmendement": "abtiaaaaaaaaaaaaaaaaaaaaaaaaaaaaaaaaaaaaaaaaaaaaaaamzyi",
  "cardinaliteAmdtMultiples": "1",
  "etat": "Discuté",
  "signataires": {
    "auteur": {
      "typeAuteur": "Depute",
      "acteurRef": "PA722202",
      "groupePolitiqueRef": "PO730940"
    },
    "cosignatairesRefs": [
      "PA720692",
      "PA689",
      "PA722110",
      "PA718926",
      "PA441",
      "PA722202",
      "PA721896",
      "PA721118",
      "PA721012",
      "PA267306",
      "PA721270",
      "PA720546",
      "PA335612",
      "PA610667",
      "PA610654",
      "PA718720"
    ],
    "texteAffichable": "M.&#160;Jumel,  Mme&#160;Buffet, Mme&#160;Faucillon, Mme&#160;Bello, M.&#160;Brotherson, M.&#160;Bruneel, M.&#160;Chassaigne, M.&#160;Dharr&#233;ville, M.&#160;Dufr&#232;gne, Mme&#160;K&#233;clard-Mond&#233;sir, M.&#160;Lecoq, M.&#160;Nilor, M.&#160;Peu, M.&#160;Fabien&#160;Roussel, M.&#160;Serville et M.&#160;Wulfranc"
  },
  "pointeurFragmentTexte": {
    "missionVisee": {
      "idMissionAN": "813",
      "libelleMission": "Enseignement scolaire",
      "codeMissionPLF": "B",
      "libelleMissionPLF": "Répartition, par mission et programme, des crédits du budget général"
    },
    "division": {
      "titre": "ÉTAT B",
      "articleDesignationCourte": "ART. 38",
      "type": "ANNEXE",
      "avantAApres": "A",
      "divisionRattachee": "ARTICLE 38",
      "urlDivisionTexteVise": "/15/textes/2272C.asp#D_ETAT_B"
    }
  },
  "corps": {
    "exposeSommaire": "<p style=\"text-align: justify;\">Le pr&#233;sent amendement vise &#224; abonder l'action 3 \"Besoins &#233;ducatifs particuliers\" du programme 140 \"Enseignement scolaire public du premier degr&#233;\" en ponctionnant l'action 03 \"Enseignement en coll&#232;ge\" du programme 139 \" Enseignement priv&#233; du premier et du second degr&#233;s\"\" dans le but d'atteindre un objectif de 100 &#233;l&#232;ves en situation de handicap suivis pour chaque enseignant-r&#233;f&#233;rent, comme le pr&#233;conise la proposition n&#176;8 du rapport de la commission d'enqu&#234;te sur l'inclusion des &#233;l&#232;ves handicap&#233;s dans l'&#233;cole et l'universit&#233; de la R&#233;publique.</p>",
    "dispositifAmdtCredit": {
      "listeProgrammes": [
        {
          "libelle": "Enseignement scolaire public du premier degré",
          "id": "89145",
          "AE": {
            "montantPositif": "435000",
            "montantNegatif": "0"
          },
          "CP": {
            "montantPositif": "435000",
            "montantNegatif": "0"
          },
          "action": "modification"
        },
        {
          "libelle": "Enseignement scolaire public du second degré",
          "id": "89146",
          "AE": {
            "montantPositif": "0",
            "montantNegatif": "0"
          },
          "CP": {
            "montantPositif": "0",
            "montantNegatif": "0"
          },
          "action": "modification"
        },
        {
          "libelle": "Vie de l'élève",
          "id": "89147",
          "AE": {
            "montantPositif": "0",
            "montantNegatif": "0"
          },
          "CP": {
            "montantPositif": "0",
            "montantNegatif": "0"
          },
          "action": "modification"
        },
        {
          "libelle": "Enseignement privé du premier et du second degrés",
          "id": "89148",
          "AE": {
            "montantPositif": "0",
            "montantNegatif": "435000"
          },
          "CP": {
            "montantPositif": "0",
            "montantNegatif": "435000"
          },
          "action": "modification"
        },
        {
          "libelle": "Soutien de la politique de l'éducation nationale",
          "id": "89149",
          "AE": {
            "montantPositif": "0",
            "montantNegatif": "0"
          },
          "CP": {
            "montantPositif": "0",
            "montantNegatif": "0"
          },
          "action": "modification"
        },
        {
          "libelle": "Enseignement technique agricole",
          "id": "89150",
          "AE": {
            "montantPositif": "0",
            "montantNegatif": "0"
          },
          "CP": {
            "montantPositif": "0",
            "montantNegatif": "0"
          },
          "action": "modification"
        }
      ],
      "totalAE": {
        "montantPositif": "435000",
        "montantNegatif": "435000",
        "solde": "0"
      },
      "totalCP": {
        "montantPositif": "435000",
        "montantNegatif": "435000",
        "solde": "0"
      }
    }
  },
  "representations": [
    {
      "nom": "PDF",
      "typeMime": {
        "type": "application",
        "subType": "PDF"
      },
      "statutRepresentation": {
        "verbatim": true,
        "canonique": true,
        "officielle": true,
        "transcription": false,
        "enregistrement": false
      },
      "contenu": {
        "documentURI": "/15/amendements/2272C/AN/908.pdf"
      }
    }
  ],
  "seanceDiscussion": "RUANR5L15S2020IDS21894",
  "sort": {
    "dateSaisie": "2019-10-30T02:05:19.000+01:00",
    "sortEnSeance": "Rejeté"
  },
  "dateDepot": "2019-10-25T02:00:00.000+02:00",
  "dateDistribution": "2019-10-29T01:00:00.000+01:00",
  "article99": "0",
  "loiReference": {}
}