{
  "uid": "AMANR5L15SEA717460BTC1019P0D1N1947",
  "identifiant": {
    "legislature": "15",
    "numero": "1947",
    "numRect": "0",
    "saisine": {
      "texteLegislatifRef": "PRJLANR5L15BTC1019",
      "numeroPartiePLF": "0",
      "organeExamen": "PO717460",
      "mentionSecondeDeliberation": "1"
    }
  },
  "numeroLong": "1947",
  "etapeTexte": "1ère lecture (1ère assemblée saisie)",
  "triAmendement": "dc",
  "cardinaliteAmdtMultiples": "1",
  "etat": "Discuté",
  "signataires": {
    "auteur": {
      "typeAuteur": "Depute",
      "acteurRef": "PA720422",
      "groupePolitiqueRef": "PO730958"
    },
    "cosignatairesRefs": [
      "PA720846",
      "PA721226",
      "PA721210",
      "PA720892",
      "PA719676",
      "PA721202",
      "PA722142",
      "PA718860",
      "PA719578",
      "PA2150",
      "PA721960",
      "PA720430",
      "PA588884",
      "PA720286",
      "PA720422",
      "PA718868",
      "PA721062"
    ],
    "texteAffichable": "M.&#160;Quatennens,  Mme&#160;Autain, M.&#160;Larive, Mme&#160;Ressiguier, Mme&#160;Rubin, M.&#160;Ruffin, Mme&#160;Taurine, M.&#160;M&#233;lenchon, Mme&#160;Obono, Mme&#160;Panot, M.&#160;Prud&apos;homme, M.&#160;Ratenon, M.&#160;Bernalicis, M.&#160;Corbi&#232;re, M.&#160;Coquerel, Mme&#160;Fiat et M.&#160;Lachaud"
  },
  "pointeurFragmentTexte": {
    "division": {
      "titre": "Article 65",
      "articleDesignationCourte": "APRÈS ART. 65",
      "type": "ARTICLE",
      "avantAApres": "Apres",
      "divisionRattachee": "APRÈS L'ARTICLE 65, insérer l'article suivant:",
      "articleAdditionnel": "1",
      "urlDivisionTexteVise": "/15/textes/1019.asp#D_Article_65"
    }
  },
  "corps": {
    "dispositif": "<p style=\"text-align: justify;\">Apr&#232;s le 9&#176; de l&#8217;article&#160;18&#8209;5 de la loi n&#176; 2013&#8209;907 du 11 octobre 2013 relative &#224; la transparence de la vie publique, il est ins&#233;r&#233; un 10&#176; ainsi r&#233;dig&#233;&#160;:</p><p style=\"text-align: justify;\">&#171;&#160;10&#176; S&#8217;abstenir d&#8217;exercer toute action pour le compte ou aupr&#232;s d&#8217;une personne morale de droit public.&#160;&#187;</p>",
    "exposeSommaire": "<p style=\"text-align: justify;\">Afin de pr&#233;venir toute situation de conflit d&#8217;int&#233;r&#234;t et de garantir l&#8217;entier engagement du fonctionnaire au service de l&#8217;int&#233;r&#234;t g&#233;n&#233;ral, le passage dans le priv&#233; pour des activit&#233;s de conseil qui auraient trait directement ou indirectement aux missions de service public attach&#233;es &#224; ses nouvelles fonctions, ce en prenant en compte les niveau de responsabilit&#233; et la nature des emplois occup&#233;s, ne peut &#234;tre effectu&#233; avant une p&#233;riode d&#8217;attente.</p><p style=\"text-align: justify;\">Il nous semble impensable que la loi puisse autoriser un ancien fonctionnaire ou agent public &#224; effectuer des actions de lobbying en tant que repr&#233;sentant d&#8217;int&#233;r&#234;ts priv&#233;s aupr&#232;s d&#8217;une institution publique o&#249; il a d&#233;j&#224; travaill&#233;.</p><p style=\"text-align: justify;\">En effet, valider l&#8217;existence m&#234;me de ce principe signifie que des int&#233;r&#234;ts priv&#233;s peuvent recruter des agents bien introduits et connaissant le fonctionnement intime de l&#8217;institution publique pour mener une action de lobbying plus efficace-. Ceci pourrait totalement d&#233;voyer l&#8217;exercice des fonctions au service de l&#8217;int&#233;r&#234;t g&#233;n&#233;ral dans une telle institution, en laissant penser que tout fonctionnaire ou agent public peut envisager un futur passage vers le priv&#233; en tant que lobbyiste aupr&#232;s de son institution d&#8217;accueil.</p>"
  },
  "representations": [
    {
      "nom": "PDF",
      "typeMime": {
        "type": "application",
        "subType": "PDF"
      },
      "statutRepresentation": {
        "verbatim": true,
        "canonique": true,
        "officielle": true,
        "transcription": false,
        "enregistrement": false
      },
      "contenu": {
        "documentURI": "/15/amendements/1019/AN/1947.pdf"
      }
    }
  ],
  "seanceDiscussion": "RUANR5L15S2018IDS21106",
  "sort": {
    "dateSaisie": "2018-06-16T03:30:54.000+02:00",
    "sortEnSeance": "Rejeté"
  },
  "dateDepot": "2018-06-07T02:00:00.000+02:00",
  "dateDistribution": "2018-06-13T02:00:00.000+02:00",
  "article99": "0",
  "loiReference": {
    "codeLoi": "loi 2013-907",
    "divisionCodeLoi": "18-5"
  }
}