{
  "uid": "AMANR5L15SEA717460B2272P2D1N1424",
  "identifiant": {
    "legislature": "15",
    "numero": "1424",
    "numRect": "0",
    "saisine": {
      "texteLegislatifRef": "PRJLANR5L15B2272",
      "numeroPartiePLF": "2",
      "organeExamen": "PO717460",
      "mentionSecondeDeliberation": "0"
    }
  },
  "numeroLong": "II-1424",
  "etapeTexte": "1ère lecture (1ère assemblée saisie)",
  "triAmendement": "bfiaaaaaaaaaaaaaaaaaaaaaaaaaaaaaaaaaaaaaaaaaaaaaaazzzzzwddg",
  "cardinaliteAmdtMultiples": "1",
  "etat": "Discuté",
  "signataires": {
    "auteur": {
      "typeAuteur": "Depute",
      "acteurRef": "PA330909",
      "groupePolitiqueRef": "PO730934"
    },
    "cosignatairesRefs": [
      "PA266776",
      "PA330909",
      "PA720210",
      "PA643089",
      "PA767",
      "PA336316",
      "PA607090",
      "PA267429",
      "PA608416"
    ],
    "texteAffichable": "M.&#160;Descoeur,  M.&#160;Cinieri, M.&#160;Jean-Pierre&#160;Vigier, M.&#160;Cattin, M.&#160;Bouchet, M.&#160;Hetzel, Mme&#160;Beauvais, M.&#160;Thi&#233;riot et M.&#160;Reiss"
  },
  "pointeurFragmentTexte": {
    "missionVisee": {
      "idMissionAN": "823",
      "libelleMission": "Relations avec les collectivités territoriales",
      "codeMissionPLF": "B",
      "libelleMissionPLF": "Répartition, par mission et programme, des crédits du budget général"
    },
    "division": {
      "titre": "Article 78",
      "articleDesignationCourte": "APRÈS ART. 78",
      "type": "ARTICLE",
      "avantAApres": "Apres",
      "divisionRattachee": "APRÈS L'ARTICLE 78, insérer l'article suivant:",
      "articleAdditionnel": "1",
      "urlDivisionTexteVise": "/15/textes/2272C.asp#D_Article_78"
    }
  },
  "corps": {
    "dispositif": "<p style=\"text-align: justify;\">Le Gouvernement transmet au Parlement, avant le&#160;1<sup>er</sup> avril 2020, un rapport relatif &#224; l&#8217;ex&#233;cution par les collectivit&#233;s territoriales des contrats d&#233;finis &#224; l&#8217;article&#160;29 de la loi n&#176;&#160;2018&#8209;32 du 22 janvier 2018 de programmation des finances publiques pour les ann&#233;es 2018 &#224; 2022. Ce rapport pr&#233;sente les modalit&#233;s d&#8217;int&#233;gration, dans l&#8217;appr&#233;ciation d&#8217;&#233;volution des d&#233;penses r&#233;elles de fonctionnement&#160;: de la prise en compte de la r&#233;vision de l&#8217;inflation,&#160; de l&#8217;&#233;cr&#234;tement des d&#233;penses d&#8217;allocations individuelles de solidarit&#233; au niveau de l&#8217;objectif associ&#233; au contrat ou &#224; l&#8217;arr&#234;t&#233;, du retraitement des d&#233;penses inscrites dans le cadre de politiques partenariales, de la neutralisation de l&#8217;impact financier des charges nouvelles des collectivit&#233;s et des d&#233;penses relatives &#224; l&#8217;application des normes, de l&#8217;analyse des d&#233;penses nettes, soustraction faite des recettes affect&#233;es, de la neutralisation des flux crois&#233;s, de l&#8217;exclusion du p&#233;rim&#232;tre des d&#233;penses de fonctionnement des participations vers&#233;es &#224; un budget annexe ou un syndicat et destin&#233;es &#224; financer des d&#233;penses d&#8217;investissement, et de la prise en compte du caract&#232;re potentiellement vertueux de certaines d&#233;penses de fonctionnement.</p>",
    "exposeSommaire": "<p style=\"text-align: justify;\">Le dispositif de contractualisation financi&#232;re, pr&#233;vu par la loi de programmation des finances publiques 2018&#8209;2022 a voulu encadrer l&#8217;&#233;volution des d&#233;penses de fonctionnement d&#8217;a minima 322 collectivit&#233;s locales.</p><p style=\"text-align: justify;\">Dans le cadre du suivi de la contractualisation financi&#232;re entre l&#8217;&#201;tat et les collectivit&#233;s locales, un groupe de travail r&#233;unissant des repr&#233;sentants de la DGFiP, de la DGCL et des associations d&#8217;&#233;lus a &#233;t&#233; mis en place. Un &#171;&#160;guide pratique des modalit&#233;s financi&#232;res et comptables de retraitements des d&#233;penses r&#233;elles de fonctionnement&#160;&#187; a &#233;t&#233; communiqu&#233; en janvier 2019.</p><p style=\"text-align: justify;\">Si on peut globalement y noter un assouplissement des positions initialement prises &#224; l&#8217;&#233;gard des collectivit&#233;s concern&#233;es par le dispositif de contractualisation financi&#232;re, l&#8217;Assembl&#233;e des D&#233;partements de France (ADF) souhaiterait que des modifications compl&#233;mentaires y soient apport&#233;es dans le du projet de loi de programmation des finances publiques, dont la pr&#233;sentation et la discussion a &#233;t&#233; report&#233;e au printemps prochain.</p><p style=\"text-align: justify;\">Eu &#233;gard &#224; la n&#233;cessit&#233; pour le l&#233;gislateur de b&#233;n&#233;ficier de tous les &#233;l&#233;ments en amont de la discussion, il est demand&#233; au Gouvernement de r&#233;aliser, au plus tard pour le 1<sup>er</sup> avril 2020, un rapport relatif aux modalit&#233;s d&#8217;int&#233;gration des modifications suivantes&#160;dans l&#8217;appr&#233;ciation d&#8217;&#233;volution des d&#233;penses r&#233;elles de fonctionnement&#160;:</p><p style=\"text-align: justify;\">-&#160; la prise en compte de la r&#233;vision de l&#8217;inflation,&#160;</p><p style=\"text-align: justify;\">-&#160; l&#8217;&#233;cr&#234;tement des d&#233;penses d&#8217;allocations individuelles de solidarit&#233; (AIS) au niveau de l&#8217;objectif associ&#233; au contrat ou &#224; l&#8217;arr&#234;t&#233;,</p><p style=\"text-align: justify;\">-&#160; le retraitement des d&#233;penses qui s&#8217;inscrivent dans le cadre de politiques partenariales (fonds europ&#233;ens, aide &#224; la coop&#233;ration d&#233;centralis&#233;e, etc.),</p><p style=\"text-align: justify;\">-&#160; la neutralisation de l&#8217;impact financier des charges nouvelles des collectivit&#233;s et des d&#233;penses relatives &#224; l&#8217;application des normes,</p><p style=\"text-align: justify;\">-&#160; l&#8217;analyse des d&#233;penses nettes, soustraction faites des recettes affect&#233;es,</p><p style=\"text-align: justify;\">-&#160; la neutralisation des flux crois&#233;s,</p><p style=\"text-align: justify;\">-&#160; l&#8217;exclusion du p&#233;rim&#232;tre des d&#233;penses de fonctionnement des participations vers&#233;es &#224; un budget annexe ou un syndicat et destin&#233;es &#224; financer des d&#233;penses d&#8217;investissement,</p><p style=\"text-align: justify;\">-&#160; la prise en compte du caract&#232;re potentiellement vertueux de certaines d&#233;penses de fonctionnement.</p><p style=\"text-align: justify;\">Tel est l&#8217;objet de cet amendement.</p>"
  },
  "representations": [
    {
      "nom": "PDF",
      "typeMime": {
        "type": "application",
        "subType": "PDF"
      },
      "statutRepresentation": {
        "verbatim": true,
        "canonique": true,
        "officielle": true,
        "transcription": false,
        "enregistrement": false
      },
      "contenu": {
        "documentURI": "/15/amendements/2272C/AN/1424.pdf"
      }
    }
  ],
  "seanceDiscussion": "RUANR5L15S2020IDS21915",
  "sort": {
    "dateSaisie": "2019-11-08T15:04:12.000+01:00",
    "sortEnSeance": "Non soutenu"
  },
  "dateDepot": "2019-10-31T01:00:00.000+01:00",
  "dateDistribution": "2019-11-07T01:00:00.000+01:00",
  "article99": "0",
  "loiReference": {}
}