{
  "uid": "AMANR5L15SEA717460B0235P2D1N262",
  "identifiant": {
    "legislature": "15",
    "numero": "262",
    "numRect": "1",
    "saisine": {
      "texteLegislatifRef": "PRJLANR5L15B0235",
      "numeroPartiePLF": "2",
      "organeExamen": "PO717460",
      "mentionSecondeDeliberation": "0"
    }
  },
  "numeroLong": "II-262 (Rect)",
  "etapeTexte": "1ère lecture (1ère assemblée saisie)",
  "triAmendement": "zzce",
  "cardinaliteAmdtMultiples": "1",
  "etat": "Retiré",
  "signataires": {
    "auteur": {
      "typeAuteur": "Depute",
      "acteurRef": "PA721718",
      "groupePolitiqueRef": "PO730964"
    },
    "cosignatairesRefs": [
      "PA721718"
    ],
    "texteAffichable": "Mme&#160;Do"
  },
  "pointeurFragmentTexte": {
    "missionVisee": {
      "idMissionAN": "7",
      "libelleMission": "Cohésion des territoires",
      "codeMissionPLF": "B",
      "libelleMissionPLF": "Répartition, par mission et programme, des crédits du budget général"
    },
    "division": {
      "titre": "Article 52",
      "articleDesignationCourte": "ART. 52",
      "type": "ARTICLE",
      "avantAApres": "A",
      "divisionRattachee": "ARTICLE 52",
      "urlDivisionTexteVise": "/15/textes/0235C.asp#D_Article_52"
    },
    "alinea": {
      "numero": "27"
    }
  },
  "corps": {
    "dispositif": "<p style=\"text-align: justify;\">Compl&#233;ter l&#8217;alin&#233;a&#160;27 par les mots&#160;:</p><p style=\"text-align: justify;\">&#171;&#160;, en fonction de la situation financi&#232;re de chaque organisme et de la proportion de locataires b&#233;n&#233;ficiant d&#8217;une r&#233;duction de loyer de solidarit&#233; dans le parc de chaque organisme.&#160;&#187;</p>",
    "exposeSommaire": "<p style=\"text-align: justify;\">Cet amendement vise &#224; pr&#233;ciser que les concours financiers de la Caisse de garantie du logement locatif social (CGLLS) destin&#233;s &#224; soutenir les organismes HLM dans la mise en &#339;uvre des r&#233;ductions de loyer doivent &#234;tre orient&#233;s en priorit&#233; vers les organismes HLM dont la situation financi&#232;re globale est fragile et dont la proportion de locataires b&#233;n&#233;ficiant d&#8217;une APL est &#233;lev&#233;e. Une telle p&#233;r&#233;quation permettrait ainsi au m&#233;canisme de r&#233;duction de loyer de solidarit&#233; de ne pas p&#233;naliser plus fortement les bailleurs accueillant une majorit&#233; de locataires modestes.</p>"
  },
  "representations": [
    {
      "nom": "PDF",
      "typeMime": {
        "type": "application",
        "subType": "PDF"
      },
      "statutRepresentation": {
        "verbatim": true,
        "canonique": true,
        "officielle": true,
        "transcription": false,
        "enregistrement": false
      },
      "contenu": {
        "documentURI": "/15/amendements/0235C/AN/262.pdf"
      }
    }
  ],
  "dateDepot": "2017-10-27T02:00:00.000+02:00",
  "dateDistribution": "2017-10-31T01:00:00.000+01:00",
  "article99": "0",
  "loiReference": {}
}