{
  "uid": "AMANR5L15SEA717460BTC0857P0D1N837",
  "identifiant": {
    "legislature": "15",
    "numero": "837",
    "numRect": "0",
    "saisine": {
      "texteLegislatifRef": "PRJLANR5L15BTC0857",
      "numeroPartiePLF": "0",
      "organeExamen": "PO717460",
      "mentionSecondeDeliberation": "0"
    }
  },
  "numeroLong": "837",
  "etapeTexte": "1ère lecture (1ère assemblée saisie)",
  "triAmendement": "eg",
  "cardinaliteAmdtMultiples": "1",
  "etat": "Discuté",
  "signataires": {
    "auteur": {
      "typeAuteur": "Depute",
      "acteurRef": "PA721896",
      "groupePolitiqueRef": "PO730940"
    },
    "cosignatairesRefs": [
      "PA721896",
      "PA335612",
      "PA689",
      "PA267306",
      "PA441",
      "PA720692",
      "PA610667",
      "PA722202",
      "PA721270",
      "PA718926",
      "PA718720",
      "PA722110",
      "PA720546",
      "PA610654",
      "PA610634",
      "PA721118"
    ],
    "texteAffichable": "Mme&#160;Faucillon,  M.&#160;Peu, M.&#160;Azerot, Mme&#160;Bello, M.&#160;Brotherson, M.&#160;Bruneel, Mme&#160;Buffet, M.&#160;Chassaigne, M.&#160;Dharr&#233;ville, M.&#160;Dufr&#232;gne, M.&#160;Jumel, M.&#160;Lecoq, M.&#160;Nilor, M.&#160;Fabien&#160;Roussel, M.&#160;Serville et M.&#160;Wulfranc"
  },
  "pointeurFragmentTexte": {
    "division": {
      "titre": "Article 22",
      "articleDesignationCourte": "ART. 22",
      "type": "ARTICLE",
      "avantAApres": "A",
      "divisionRattachee": "ARTICLE 22",
      "urlDivisionTexteVise": "/15/textes/0857.asp#D_Article_22"
    },
    "alinea": {
      "numero": "5"
    }
  },
  "corps": {
    "dispositif": "<p style=\"text-align: justify;\">Compl&#233;ter l&#8217;alin&#233;a&#160;5 par les trois phrases suivantes&#160;:</p><p style=\"text-align: justify;\">&#171;&#160;La convention pr&#233;cise &#233;galement, en annexe, les droits du&#160;&#171;&#160;jeune au pair&#160;&#187;&#160;en cas de violation de ses clauses. Les dispositions du code pe&#769;nal sanctionnant la traite d&#8217;e&#770;tres humains et les infractions d&#8217;exploitation ainsi que les droits garantis par la loi a&#768; la victime y sont &#233;galement retranscrits ainsi que les sanctions pe&#769;nales encourues par l&#8217;employeur. Les coordonne&#769;es d&#8217;associations spe&#769;cialise&#769;es dans l&#8217;assistance aux victimes figurent &#224; la fin de l&#8217;annexe&#160;&#187;.</p>",
    "exposeSommaire": "<p style=\"text-align: justify;\">Cet amendement reprend une pr&#233;conisation du comit&#233; contre l&#8217;esclavage moderne (CCEM).</p><p style=\"text-align: justify;\">Le statut de &#171;&#160;jeune au pair&#160;&#187; cre&#769;e&#769; des conditions propices a&#768; des formes graves d&#8217;exploitation par le travail en raison de la forte de&#769;pendance entre la personne au pair et son employeur, du fait que ces dernie&#768;res sont he&#769;berge&#769;es chez leur employeur et que la re&#769;gularite&#769; de leur se&#769;jour de&#769;pend de cet emploi.</p><p style=\"text-align: justify;\">Partant, cette de&#769;pendance restreint conside&#769;rablement la capacite&#769; des travailleurs &#171;&#160;au pair&#160;&#187; a&#768; de&#769;noncer d&#8217;e&#769;ventuelles conditions de travail ou d&#8217;he&#769;bergement contraires a&#768; la dignite&#769; humaine et autres infractions d&#8217;exploitation plus graves.</p><p style=\"text-align: justify;\">C&#8217;est la raison pour laquelle, il est ici propos&#233; de pr&#233;voir que la convention contienne des informations a&#768; destination des &#171;&#160;jeunes au pair&#160;&#187; sur leurs droits sur le territoire franc&#807;ais et la communication des coordonne&#769;es des associations pouvant les assister en cas d&#8217;infraction. Par ailleurs, il est indispensable que la convention contienne aussi des informations a&#768; destination de l&#8217;employeur quant aux pe&#769;nalite&#769;s encourues en cas de non-respect du contrat &#171;&#160;au pair&#160;&#187; et, surtout, en cas d&#8217;exploitation de la personne.</p>"
  },
  "representations": [
    {
      "nom": "PDF",
      "typeMime": {
        "type": "application",
        "subType": "PDF"
      },
      "statutRepresentation": {
        "verbatim": true,
        "canonique": true,
        "officielle": true,
        "transcription": false,
        "enregistrement": false
      },
      "contenu": {
        "documentURI": "/15/amendements/0857/AN/837.pdf"
      }
    }
  ],
  "seanceDiscussion": "RUANR5L15S2018IDS21078",
  "sort": {
    "dateSaisie": "2018-04-22T12:35:58.000+02:00",
    "sortEnSeance": "Rejeté"
  },
  "dateDepot": "2018-04-12T02:00:00.000+02:00",
  "dateDistribution": "2018-04-16T02:00:00.000+02:00",
  "article99": "0",
  "loiReference": {}
}