{
  "uid": "AMANR5L15PO420120B0904P0D1N134",
  "identifiant": {
    "legislature": "15",
    "numero": "134",
    "numRect": "0",
    "saisine": {
      "texteLegislatifRef": "PRJLANR5L15B0904",
      "numeroPartiePLF": "0",
      "organeExamen": "PO420120",
      "mentionSecondeDeliberation": "0"
    }
  },
  "numeroLong": "AS134",
  "etapeTexte": "1ère lecture (1ère assemblée saisie)",
  "triAmendement": "abf",
  "cardinaliteAmdtMultiples": "1",
  "etat": "Discuté",
  "signataires": {
    "auteur": {
      "typeAuteur": "Depute",
      "acteurRef": "PA330909",
      "groupePolitiqueRef": "PO730934"
    },
    "cosignatairesRefs": [
      "PA330909",
      "PA718838",
      "PA718884",
      "PA334654",
      "PA340853",
      "PA266793",
      "PA721968",
      "PA266808",
      "PA607090",
      "PA719272",
      "PA605036",
      "PA267204",
      "PA608016",
      "PA267527",
      "PA334149",
      "PA719318"
    ],
    "texteAffichable": "M.&#160;Descoeur,  M.&#160;Sermier, M.&#160;Bony, M.&#160;Leclerc, M.&#160;Straumann, Mme&#160;Meunier, Mme&#160;Louwagie, M.&#160;Vialay, M.&#160;Brun, Mme&#160;Anthoine, Mme&#160;Bazin-Malgras, M.&#160;Abad, M.&#160;Rolland, M.&#160;Fasquelle, M.&#160;Saddier et M.&#160;Jean-Pierre&#160;Vigier"
  },
  "pointeurFragmentTexte": {
    "division": {
      "titre": "Article 4",
      "articleDesignationCourte": "APRÈS ART. 4",
      "type": "ARTICLE",
      "avantAApres": "Apres",
      "divisionRattachee": "APRÈS L'ARTICLE 4, insérer l'article suivant:",
      "articleAdditionnel": "1",
      "urlDivisionTexteVise": "/15/textes/0904.asp#D_Article_4"
    }
  },
  "corps": {
    "dispositif": "<p style=\"text-align: justify;\">L&#8217;article L.&#160;265&#8209;1 du code de l&#8217;action sociale et des familles est compl&#233;t&#233; par un alin&#233;a ainsi r&#233;dig&#233;&#160;:</p><p style=\"text-align: justify;\">&#171;&#160;Les personnes accueillies et accompagn&#233;es par les organismes vis&#233;s au premier alin&#233;a du pr&#233;sent article pourront, au terme d&#8217;au moins douze mois de pr&#233;sence au sein desdits organismes, engager une proc&#233;dure de validation des acquis de l&#8217;exp&#233;rience comme pr&#233;vue &#224; l&#8217;article L.&#160;6411&#8209;1 du code du travail.&#160;&#187;</p>",
    "exposeSommaire": "<p style=\"text-align: justify;\">Cet amendement a pour objet de permettre l&#8217;ouverture de la proc&#233;dure de validation des acquis de l&#8217;exp&#233;rience aux travailleurs solidaires effectuant depuis au moins 12 mois des activit&#233;s solidaires au sein d&#8217;Organismes d&#8217;Accueil Communautaire et d&#8217;Activit&#233;s Solidaires (OACAS). Ce dispositif aurait pour but de faciliter l&#8217;insertion professionnelle des compagnes et compagnons d&#8217;Emma&#252;s en leur assurant la possibilit&#233; d&#8217;une certification qualifiante, reconnue par les employeurs aupr&#232;s desquels ils seront en mesure de faire valoir l&#8217;expertise d&#233;velopp&#233;e dans le cadre des missions exerc&#233;es au sein de ces organismes OACAS.&#160;</p><p style=\"text-align: justify;\">Les compagnes et compagnons d&#8217;Emma&#252;s, travailleurs solidaires, d&#233;veloppent les activit&#233;s des Communaut&#233;s au sein desquelles ils vivent. Ces activit&#233;s, souvent li&#233;es &#224; la collecte d&#8217;objets, &#224; leur r&#233;emploi, au recyclage, et plus r&#233;cemment &#224; l&#8217;agriculture d&#233;veloppent une tr&#232;s importante solidarit&#233; &#224; l&#8217;&#233;chelle locale, r&#233;gionale, nationale et internationale. Dans le cadre de ces activit&#233;s, les travailleurs solidaires d&#233;veloppent diff&#233;rents m&#233;tiers li&#233;s &#224; la menuiserie (relookage ou transformation de meubles, etc&#8230;) &#224; la m&#233;canique (r&#233;paration de mat&#233;riel de jardin, de v&#233;los, etc&#8230;), &#224; la restauration, &#224; l&#8217;informatique, &#224; la vente, erc&#8230;.</p><p style=\"text-align: justify;\">Les compagnes et les compagnons des Communaut&#233;s/OACAS Emma&#252;s participent &#224; un &#233;cosyst&#232;me solidaire. Leurs activit&#233;s apportant &#224; la Communaut&#233; les ressources n&#233;cessaires &#224; son fonctionnement et &#224; leur prise en charge. Donc, sans rien co&#251;ter au contribuable, ils cotisent &#224; la s&#233;curit&#233; sociale, &#224; l&#8217;URSSAF, &#224; la caisse de retraite et d&#233;clarent leurs revenus.</p><p style=\"text-align: justify;\">Les communaut&#233;s Emma&#252;s existent depuis 1949. Elles sont actuellement 119 sur le territoire et accueillent annuellement plus de 5000 femmes et hommes exclues ou marginalis&#233;es, c&#233;libataires ou en familles. D&#233;veloppant les activit&#233;s de la Communaut&#233;, et vivant en son sein, les compagnes ou compagnons d&#8217;Emma&#252;s b&#233;n&#233;ficient d&#8217;un accompagnement leur assurant, suivant leurs besoins, la d&#233;couverte ou l&#8217;approfondissement des fondamentaux (vie en soci&#233;t&#233;, solidarit&#233;, tol&#233;rance, citoyennet&#233;, la&#239;cit&#233; etc&#8230;), mais aussi l&#8217;acquisition, l&#8217;approfondissement et la valorisation de comp&#233;tences professionnelles. Les Communaut&#233;s Emma&#252;s OACAS offrent ainsi la possibilit&#233; de parcours complets d&#8217;insertion ou de r&#233;insertion sociale.</p><p style=\"text-align: justify;\">Cet amendement permettra de valoriser l&#8217;activit&#233; d&#8217;utilit&#233; citoyenne des compagnes et compagnons, travailleurs solidaires, en permettant leur acc&#232;s &#224; une certification officielle.</p><p style=\"text-align: justify;\">De mani&#232;re plus large, l&#8217;acc&#232;s possible &#224; une VAE irait dans le sens d&#8217;une reconnaissance de leur dignit&#233;, et, au-del&#224;, reconna&#238;trait l&#8217;int&#233;r&#234;t du mod&#232;le innovant et original propos&#233; par le mouvement Emma&#252;s ou d&#8217;autres associations en mati&#232;re d&#8217;insertion sociale.</p>"
  },
  "representations": [
    {
      "nom": "PDF",
      "typeMime": {
        "type": "application",
        "subType": "PDF"
      },
      "statutRepresentation": {
        "verbatim": true,
        "canonique": true,
        "officielle": true,
        "transcription": false,
        "enregistrement": false
      },
      "contenu": {
        "documentURI": "/15/amendements/0904/CION-SOC/AS134.pdf"
      }
    }
  ],
  "sort": {
    "dateSaisie": "2018-05-30T09:34:07.000+02:00",
    "sortEnSeance": "Non soutenu"
  },
  "dateDepot": "2018-05-23T02:00:00.000+02:00",
  "dateDistribution": "2018-05-28T02:00:00.000+02:00",
  "article99": "0",
  "loiReference": {
    "codeLoi": "action sociale et familles",
    "divisionCodeLoi": "L265-1"
  }
}