{
  "uid": "AMANR5L15SEA717460BTC1396P0D1N692",
  "identifiant": {
    "legislature": "15",
    "numero": "692",
    "numRect": "0",
    "saisine": {
      "texteLegislatifRef": "PRJLANR5L15BTC1396",
      "numeroPartiePLF": "0",
      "organeExamen": "PO717460",
      "mentionSecondeDeliberation": "0"
    }
  },
  "numeroLong": "692",
  "etapeTexte": "1ère lecture (2ème assemblée saisie)",
  "triAmendement": "etaaaaaaaaaaaaaaaaaaaaaaaaaaaaaaaaaaaaaaaaaaaaaaaaog",
  "cardinaliteAmdtMultiples": "1",
  "etat": "Discuté",
  "signataires": {
    "auteur": {
      "typeAuteur": "Depute",
      "acteurRef": "PA719668",
      "groupePolitiqueRef": "PO730964"
    },
    "cosignatairesRefs": [
      "PA719668"
    ],
    "texteAffichable": "Mme&#160;Mirall&#232;s"
  },
  "pointeurFragmentTexte": {
    "division": {
      "titre": "Article 37",
      "articleDesignationCourte": "ART. 37",
      "type": "ARTICLE",
      "avantAApres": "A",
      "divisionRattachee": "ARTICLE 37",
      "urlDivisionTexteVise": "/15/textes/1396.asp#D_Article_37"
    },
    "alinea": {
      "avantAApres": "Apres",
      "numero": "8"
    }
  },
  "corps": {
    "dispositif": "<p style=\"text-align: justify;\">Apr&#232;s l&#8217;alin&#233;a&#160;10 ins&#233;rer les deux alin&#233;as suivants&#160;:</p><p style=\"text-align: justify;\">&#171;&#160;II <i>bis.&#160;&#8211;&#160;L&#8217;article</i> L.&#160;433&#8209;6 du code p&#233;nal est compl&#233;t&#233; par un alin&#233;a ainsi r&#233;dig&#233;&#160;:</p><p style=\"text-align: justify;\">&#171;&#160;Pour le d&#233;lit pr&#233;vu au premier alin&#233;a du pr&#233;sent article, y compris en cas de r&#233;cidive, l&#8217;action publique peut &#234;tre &#233;teinte, dans les conditions pr&#233;vues aux articles&#160;495&#8209;17 &#224;&#160;495&#8209;25 du code de proc&#233;dure p&#233;nale, par le versement d&#8217;une amende forfaitaire d&#8217;un montant de&#160;300&#160;&#8364;. Le montant de l&#8217;amende forfaitaire minor&#233;e est de&#160;250&#160;&#8364; et le montant de l&#8217;amende forfaitaire major&#233;e est de&#160;600&#160;&#8364;&#160;&#187;.&#160;&#187;</p>",
    "exposeSommaire": "<p style=\"text-align: justify;\">Le d&#233;lit de rebellion, aux fins de d&#233;sencombrer les r&#244;les des tribunaux correctionnels et d&#8217;&#234;tre plus efficacement punis, &#234;tre sanctionn&#233; par une amende forfaitaire d&#233;lictuelle. Dans ce type de d&#233;lit, qui peut &#234;tre mineur et n&#8217;occasionne pas forc&#233;ment de partie civile, offrir la possibilit&#233;, qui n&#8217;est qu&#8217;une possibilit&#233;, de recourir &#224; une amende forfaitaire d&#233;lictuelle peut concourir &#224; une r&#233;ponse p&#233;nale plus efficace et rapide.</p>"
  },
  "representations": [
    {
      "nom": "PDF",
      "typeMime": {
        "type": "application",
        "subType": "PDF"
      },
      "statutRepresentation": {
        "verbatim": true,
        "canonique": true,
        "officielle": true,
        "transcription": false,
        "enregistrement": false
      },
      "contenu": {
        "documentURI": "/15/amendements/1396/AN/692.pdf"
      }
    }
  ],
  "seanceDiscussion": "RUANR5L15S2019IDS21378",
  "sort": {
    "dateSaisie": "2018-11-23T22:57:11.000+01:00",
    "sortEnSeance": "Non soutenu"
  },
  "dateDepot": "2018-11-15T01:00:00.000+01:00",
  "dateDistribution": "2018-11-20T01:00:00.000+01:00",
  "article99": "0",
  "loiReference": {}
}