{
  "uid": "AMANR5L15PO59051B0310P0D1N25",
  "identifiant": {
    "legislature": "15",
    "numero": "25",
    "numRect": "0",
    "saisine": {
      "texteLegislatifRef": "PIONANR5L15B0310",
      "numeroPartiePLF": "0",
      "organeExamen": "PO59051",
      "mentionSecondeDeliberation": "0"
    }
  },
  "numeroLong": "CL25",
  "etapeTexte": "1ère lecture (1ère assemblée saisie)",
  "triAmendement": "ado",
  "cardinaliteAmdtMultiples": "1",
  "etat": "Discuté",
  "signataires": {
    "auteur": {
      "typeAuteur": "Depute",
      "acteurRef": "PA721960",
      "groupePolitiqueRef": "PO730958"
    },
    "cosignatairesRefs": [
      "PA588884",
      "PA2150",
      "PA720846",
      "PA721062",
      "PA721960",
      "PA720286",
      "PA721202",
      "PA718868",
      "PA722142",
      "PA718860",
      "PA721210",
      "PA720892",
      "PA720422",
      "PA721226",
      "PA719676",
      "PA719578",
      "PA720430"
    ],
    "texteAffichable": "Mme&#160;Obono,  Mme&#160;Autain, M.&#160;Bernalicis, M.&#160;Coquerel, M.&#160;Corbi&#232;re, Mme&#160;Fiat, M.&#160;Lachaud, M.&#160;Larive, M.&#160;M&#233;lenchon, Mme&#160;Panot, M.&#160;Prud&apos;homme, M.&#160;Quatennens, M.&#160;Ratenon, Mme&#160;Ressiguier, Mme&#160;Rubin, M.&#160;Ruffin et Mme&#160;Taurine"
  },
  "pointeurFragmentTexte": {
    "division": {
      "titre": "Article 7",
      "articleDesignationCourte": "APRÈS ART. 7",
      "type": "ARTICLE",
      "avantAApres": "Apres",
      "divisionRattachee": "APRÈS L'ARTICLE 7, insérer l'article suivant:",
      "articleAdditionnel": "1",
      "urlDivisionTexteVise": "/15/textes/0310.asp#D_Article_7"
    }
  },
  "corps": {
    "dispositif": "<p style=\"text-align: justify;\">I.&#160;&#8211;&#160;L&#8217;article L.&#160;2224&#8209;12&#8209;1 du code g&#233;n&#233;ral des collectivit&#233;s territoriales est compl&#233;t&#233; par un alin&#233;a ainsi r&#233;dig&#233;&#160;:</p><p style=\"text-align: justify;\">&#171;&#160;Les autorit&#233;s publiques garantissent la gratuit&#233; de l&#8217;acc&#232;s &#224; l&#8217;eau pour son usage vital. Ces besoins incluent un seuil de non-tarification comprenant les premiers m&#232;tres cube d&#8217;eau n&#233;cessaires pour chaque personne physique. Ce seuil, qui ne peut &#234;tre inf&#233;rieur &#224; 40 litres d&#8217;eau par jour, est fix&#233; par d&#233;cret en Conseil d&#8217;&#201;tat.&#160;&#187;</p><p style=\"text-align: justify;\">II.&#160;&#8211;&#160;La perte de recettes pour les collectivit&#233;s territoriales est compens&#233;e &#224; due concurrence par la majoration de la dotation globale de fonctionnement et, corr&#233;lativement pour l&#8217;&#201;tat, par la cr&#233;ation d&#8217;une taxe additionnelle aux droits mentionn&#233;s aux articles 575 et 575 A du code g&#233;n&#233;ral des imp&#244;ts.</p>",
    "exposeSommaire": "<p>Cet amendement est pr&#233;sent&#233; en application de et en coh&#233;rence avec notre programme l&#8217;Avenir en commun (Point 9 : La R&#233;publique garante des biens communs) et notre livret th&#233;matique Eau bien commun (https://avenirencommun.fr/le-livret-eau/).</p><p>Afin de consacrer un droit de l&#8217;acc&#232;s &#224; l&#8217;eau, nous proposons une gratuit&#233; de l&#8217;eau (potable) pour les 14,6 premiers m3 au moins par ann&#233;e et par personne physique (soit 40 litres par jour).</p><p>En effet, selon l&#8217;Organisation mondiale de la sant&#233;, chaque personne a besoin, chaque jour, de 20 &#224; 50 litres d&#8217;eau ne contenant ni produits chimiques dangereux ni contaminants microbiens pour boire et satisfaire ses besoins d&#8217;hygi&#232;ne de base. Nous proposons de retenir un seuil minimal de 40 litres d&#8217;eau par jour, en dessous duquel le chiffre exact qui sera fix&#233; par d&#233;cret &#160;ne pourra pas descendre. De fait le Gouvernement pourra ult&#233;rieurement mener &#233;tudes et expertises afin de d&#233;terminer combien de litres d&#8217;eau par jour serait le seuil le plus appropri&#233; devant &#234;tre fix&#233; &#224; l&#8217;&#233;chelle nationale.</p><p>Cet amendement n&#8217;induit en aucun cas par lui-m&#234;me une baisse de recettes. pouvant &#234;tre compens&#233; par une &#233;volution faible de la tarification. Toutefois, afin de parer &#224; tout risque d&#8217;irrecevabilit&#233;, un gage sera pos&#233;, bien que probablement simplement formel.</p>"
  },
  "representations": [
    {
      "nom": "PDF",
      "typeMime": {
        "type": "application",
        "subType": "PDF"
      },
      "statutRepresentation": {
        "verbatim": true,
        "canonique": true,
        "officielle": true,
        "transcription": false,
        "enregistrement": false
      },
      "contenu": {
        "documentURI": "/15/amendements/0310/CION_LOIS/CL25.pdf"
      }
    }
  ],
  "sort": {
    "dateSaisie": "2017-11-22T11:48:43.000+01:00",
    "sortEnSeance": "Rejeté"
  },
  "dateDepot": "2017-11-17T01:00:00.000+01:00",
  "dateDistribution": "2017-11-20T01:00:00.000+01:00",
  "article99": "0",
  "loiReference": {
    "codeLoi": "général des collectivités territoriales",
    "divisionCodeLoi": "L2224-12-1"
  }
}