{
  "uid": "AMANR5L15PO419865B1831P0D1N1728",
  "identifiant": {
    "legislature": "15",
    "numero": "1728",
    "numRect": "0",
    "saisine": {
      "texteLegislatifRef": "PRJLANR5L15B1831",
      "numeroPartiePLF": "0",
      "organeExamen": "PO419865",
      "mentionSecondeDeliberation": "0"
    }
  },
  "numeroLong": "CD1728",
  "etapeTexte": "1ère lecture (2ème assemblée saisie)",
  "triAmendement": "heaaaaaaaaaaaaaaaaaaaaaaaaaaaaaaaaaaaaaaaaaaaaaaaaad",
  "cardinaliteAmdtMultiples": "1",
  "etat": "Discuté",
  "signataires": {
    "auteur": {
      "typeAuteur": "Depute",
      "acteurRef": "PA719718",
      "groupePolitiqueRef": "PO730964"
    },
    "cosignatairesRefs": [
      "PA719396",
      "PA606639",
      "PA721434",
      "PA720806",
      "PA607595",
      "PA721600",
      "PA720074",
      "PA718744",
      "PA720362",
      "PA719822",
      "PA718794",
      "PA719718",
      "PA720814",
      "PA718894",
      "PA720414",
      "PA719230",
      "PA607155",
      "PA722134"
    ],
    "texteAffichable": "Mme&#160;Maillart-M&#233;haignerie,  M.&#160;Dombreval, Mme&#160;Lardet, M.&#160;Larsonneur, Mme&#160;H&#233;rin, M.&#160;Kerlogot, Mme&#160;Gayte, Mme&#160;Janvier, M.&#160;Vignal, M.&#160;Daniel, M.&#160;Fi&#233;vet, M.&#160;Pellois, Mme&#160;Rossi, M.&#160;Cazenove, M.&#160;Belhaddad, M.&#160;Perrot, Mme&#160;Bagarry et Mme&#160;Thillaye"
  },
  "pointeurFragmentTexte": {
    "division": {
      "titre": "Article 28",
      "articleDesignationCourte": "APRÈS ART. 28",
      "type": "ARTICLE",
      "avantAApres": "Apres",
      "divisionRattachee": "APRÈS L'ARTICLE 28, insérer l'article suivant:",
      "articleAdditionnel": "1",
      "urlDivisionTexteVise": "/15/textes/1831.asp#D_Article_28"
    }
  },
  "corps": {
    "dispositif": "<p style=\"text-align: justify;\">L&#8217;article L.&#160;752&#8209;1-2 du Code du commerce est ainsi modifi&#233;&#160;:</p><p style=\"text-align: justify;\">1&#176; Le premier alin&#233;a est compl&#233;t&#233; par une phrase ainsi r&#233;dig&#233;e&#160;: &#171;&#160;La d&#233;cision du repr&#233;sentant de l&#8217;&#201;tat dans le d&#233;partement peut &#233;galement se fonder sur l&#8217;&#233;volution de la circulation des v&#233;hicules terrestres &#224; moteur et sur le niveau des &#233;missions de polluants atmosph&#233;riques sur les territoires concern&#233;s.&#160;&#187;</p><p style=\"text-align: justify;\">2&#176; Apr&#232;s la premi&#232;re phrase du deuxi&#232;me alin&#233;a, il est ins&#233;r&#233; une phrase ainsi r&#233;dig&#233;e&#160;: &#171;&#160;La d&#233;cision du repr&#233;sentant de l&#8217;&#201;tat dans le d&#233;partement peut &#233;galement se fonder sur l&#8217;&#233;volution de la circulation des v&#233;hicules terrestres &#224; moteur et sur le niveau des &#233;missions de polluants atmosph&#233;riques sur les territoires concern&#233;s.&#160;&#187;</p>",
    "exposeSommaire": "<p style=\"text-align: justify;\">La loi ELAN a mis en place la possibilit&#233; pour le pr&#233;fet de suspendre par arr&#234;t&#233;, apr&#232;s avis ou &#224; la demande de l&#8217;&#233;tablissement public de coop&#233;ration intercommunale &#224; fiscalit&#233; propre et des communes signataire d&#8217;une convention d&#8217;op&#233;ration de revitalisation de territoire mentionn&#233;e &#224; l&#8217;article L.&#160;303&#8209;2 du code de la construction et de l&#8217;habitation, l&#8217;enregistrement et l&#8217;examen en commission d&#233;partementale d&#8217;am&#233;nagement commercial des demandes d&#8217;autorisation d&#8217;exploitation commerciale dont l&#8217;implantation est pr&#233;vue sur les territoires concern&#233;s.</p><p style=\"text-align: justify;\">Le pr&#233;fet a donc la possibilit&#233; d&#8217;emp&#234;cher la construction d&#8217;une nouvelle surface commerciale au regard de plusieurs crit&#232;res dont l&#8217;&#233;volution des taux de vacance commerciale et du ch&#244;mage dans les territoires concern&#233;s.</p><p style=\"text-align: justify;\">Cet amendement vise &#224; permettre au pr&#233;fet de fonder sa d&#233;cision sur deux crit&#232;res additionnels, la circulation des v&#233;hicules terrestres &#224; moteur et le niveau des &#233;missions de polluants atmosph&#233;riques.</p><p style=\"text-align: justify;\">L&#8217;expansion commerciale en p&#233;riph&#233;rie entraine le plus souvent une hausse des d&#233;placements en voitures et des &#233;missions de polluants atmosph&#233;riques. Il est l&#233;gitime que le pr&#233;fet puisse se fonder sur ces crit&#232;res lorsqu&#8217;il d&#233;cide de suspendre l&#8217;examen d&#8217;une demande d&#8217;autorisation d&#8217;exploitation commerciale.</p>"
  },
  "representations": [
    {
      "nom": "PDF",
      "typeMime": {
        "type": "application",
        "subType": "PDF"
      },
      "statutRepresentation": {
        "verbatim": true,
        "canonique": true,
        "officielle": true,
        "transcription": false,
        "enregistrement": false
      },
      "contenu": {
        "documentURI": "/15/amendements/1831/CION-DVP/CD1728.pdf"
      }
    }
  ],
  "sort": {
    "dateSaisie": "2019-05-20T16:09:47.000+02:00",
    "sortEnSeance": "Rejeté"
  },
  "dateDepot": "2019-05-09T02:00:00.000+02:00",
  "dateDistribution": "2019-05-16T02:00:00.000+02:00",
  "article99": "0",
  "loiReference": {
    "codeLoi": "commerce",
    "divisionCodeLoi": "L752-1-2"
  }
}