{
  "uid": "AMANR5L15SEA717460B1255P2D1N1058",
  "identifiant": {
    "legislature": "15",
    "numero": "1058",
    "numRect": "0",
    "saisine": {
      "texteLegislatifRef": "PRJLANR5L15B1255",
      "numeroPartiePLF": "2",
      "organeExamen": "PO717460",
      "mentionSecondeDeliberation": "0"
    }
  },
  "numeroLong": "II-1058",
  "etapeTexte": "1ère lecture (1ère assemblée saisie)",
  "triAmendement": "bauaaaaaaaaaaaaaaaaaaaaaaaaaaaaaaaaaaaaaaaaaaaaaaazhs",
  "cardinaliteAmdtMultiples": "1",
  "etat": "Discuté",
  "signataires": {
    "auteur": {
      "typeAuteur": "Depute",
      "acteurRef": "PA722142",
      "groupePolitiqueRef": "PO730958"
    },
    "cosignatairesRefs": [
      "PA722142",
      "PA721202",
      "PA720892",
      "PA718868",
      "PA721062",
      "PA721210",
      "PA2150",
      "PA720422",
      "PA718860",
      "PA720846",
      "PA721226",
      "PA588884",
      "PA720430",
      "PA721960",
      "PA720286",
      "PA719676",
      "PA719578"
    ],
    "texteAffichable": "M.&#160;Ruffin,  Mme&#160;Autain, M.&#160;Bernalicis, M.&#160;Coquerel, M.&#160;Corbi&#232;re, Mme&#160;Fiat, M.&#160;Lachaud, M.&#160;Larive, M.&#160;M&#233;lenchon, Mme&#160;Obono, Mme&#160;Panot, M.&#160;Prud&apos;homme, M.&#160;Quatennens, M.&#160;Ratenon, Mme&#160;Ressiguier, Mme&#160;Rubin et Mme&#160;Taurine"
  },
  "pointeurFragmentTexte": {
    "missionVisee": {
      "idMissionAN": "421",
      "libelleMission": "Travail et emploi",
      "codeMissionPLF": "B",
      "libelleMissionPLF": "Répartition, par mission et programme, des crédits du budget général"
    },
    "division": {
      "titre": "ÉTAT B",
      "articleDesignationCourte": "ART. 39",
      "type": "ANNEXE",
      "avantAApres": "A",
      "divisionRattachee": "ARTICLE 39",
      "urlDivisionTexteVise": "/15/textes/1255C.asp#D_ETAT_B"
    }
  },
  "corps": {
    "exposeSommaire": "<p>En 2016, la CNAF recensait 328 000 assistant(e)s maternel(le)s, pay&#233;e &#224; un taux horaire moyen de 3,38 &#8364;, avec en moyenne 3,3 employeurs.</p><p>En France, on compte 328&#160;000 assistantes et assistants maternels, &#224; 99% des femmes. Et c'est sans doute parce que ce sont des femmes, de milieu populaire, que leur pr&#233;carit&#233;, massive, est aujourd'hui accept&#233;e, rendue invisible, jamais questionn&#233;e par les m&#233;dias ou les politiques. Qu'aucune solution n'est recherch&#233;e pour am&#233;liorer leur existence, pour structurer ces secteurs&#160;: comme si le soin des enfants, hier (et aujourd'hui encore) d&#233;livr&#233; gratuitement au sein de la famille par les femmes, devait l'&#234;tre &#224; moindre co&#251;t dans la soci&#233;t&#233;. Aujourd&#8217;hui, les assistantes maternelles sont pay&#233;es &#224; un taux horaire moyen de moins de 3,5&#8364;, m&#234;me pas la moiti&#233; du SMIC. A ces revenus tr&#232;s bas s&#8217;ajoute une complexit&#233; et une pr&#233;carit&#233; accrue&#160;: elles ont en moyenne 3,3 employeurs diff&#233;rents, pour des contrats plus ou moins courts, avec des volumes horaires variables. Comme nous l&#8217;explique Anne, &#171;&#160;Pour mon cas personnel, en travaillant 11h/jour, 6 jours/7, sans les compl&#233;ments du ch&#244;mage, je n'attendrai pas les 900&#8364; net par mois. Difficile de s'en sortir avec un salaire comme celui-l&#224;&#8230;&#160;&#187;.</p><p>Pour lutter contre cette injustice et cette pr&#233;carit&#233;, nous proposons que l&#8217;Etat budg&#232;te la cr&#233;ation de 200&#160;000 postes mis &#224; disposition des communes, aujourd&#8217;hui comp&#233;tentes pour la petite enfance, avec des contrats stables et &#224; temps plein, en parall&#232;le des emplois d&#233;j&#224; existants dans les structures collectives. A termes, ces emplois s&#8217;inscriront dans un service public national de la d&#233;pendance.</p><p>&#160;La r&#233;alisation de cet amendement d&#8217;appel passe par le transfert de 10 000 000 d&#8217;euros de l&#8217;action 09 du programme 155 vers un nouveau programme intitul&#233; &#171;&#160;Soutien aux m&#233;tiers de la petite enfance&#160;&#187;.</p>",
    "dispositifAmdtCredit": {
      "listeProgrammes": [
        {
          "libelle": "Accès et retour à l'emploi",
          "id": "39139",
          "AE": {
            "montantPositif": "0",
            "montantNegatif": "0"
          },
          "CP": {
            "montantPositif": "0",
            "montantNegatif": "0"
          },
          "action": "modification"
        },
        {
          "libelle": "Accompagnement des mutations économiques et développement de l'emploi",
          "id": "39140",
          "AE": {
            "montantPositif": "0",
            "montantNegatif": "0"
          },
          "CP": {
            "montantPositif": "0",
            "montantNegatif": "0"
          },
          "action": "modification"
        },
        {
          "libelle": "Amélioration de la qualité de l'emploi et des relations du travail",
          "id": "39141",
          "AE": {
            "montantPositif": "0",
            "montantNegatif": "0"
          },
          "CP": {
            "montantPositif": "0",
            "montantNegatif": "0"
          },
          "action": "modification"
        },
        {
          "libelle": "Conception, gestion et évaluation des politiques de l'emploi et du travail",
          "id": "39142",
          "AE": {
            "montantPositif": "0",
            "montantNegatif": "10000000"
          },
          "CP": {
            "montantPositif": "0",
            "montantNegatif": "10000000"
          },
          "action": "modification"
        },
        {
          "libelle": "Soutien aux métiers de la petite enfance",
          "id": "39143",
          "AE": {
            "montantPositif": "10000000",
            "montantNegatif": "0"
          },
          "CP": {
            "montantPositif": "10000000",
            "montantNegatif": "0"
          },
          "action": "creation"
        }
      ],
      "totalAE": {
        "montantPositif": "10000000",
        "montantNegatif": "10000000",
        "solde": "0"
      },
      "totalCP": {
        "montantPositif": "10000000",
        "montantNegatif": "10000000",
        "solde": "0"
      }
    }
  },
  "representations": [
    {
      "nom": "PDF",
      "typeMime": {
        "type": "application",
        "subType": "PDF"
      },
      "statutRepresentation": {
        "verbatim": true,
        "canonique": true,
        "officielle": true,
        "transcription": false,
        "enregistrement": false
      },
      "contenu": {
        "documentURI": "/15/amendements/1255C/AN/1058.pdf"
      }
    }
  ],
  "seanceDiscussion": "RUANR5L15S2019IDS21335",
  "sort": {
    "dateSaisie": "2018-11-09T15:16:41.000+01:00",
    "sortEnSeance": "Rejeté"
  },
  "dateDepot": "2018-10-31T01:00:00.000+01:00",
  "dateDistribution": "2018-11-07T01:00:00.000+01:00",
  "article99": "0",
  "loiReference": {}
}