{
  "uid": "AMANR5L15PO59048B2272P2D1N437",
  "identifiant": {
    "legislature": "15",
    "numero": "437",
    "numRect": "0",
    "saisine": {
      "texteLegislatifRef": "PRJLANR5L15B2272",
      "numeroPartiePLF": "2",
      "organeExamen": "PO59048",
      "mentionSecondeDeliberation": "0"
    }
  },
  "numeroLong": "II-CF437",
  "etapeTexte": "1ère lecture (1ère assemblée saisie)",
  "triAmendement": "fcaaaaaaaaaaaaaaaaaaaaaaaaaaaaaaaaaaaaaaaaaaaaaaaaaaesmo",
  "cardinaliteAmdtMultiples": "1",
  "etat": "Discuté",
  "signataires": {
    "auteur": {
      "typeAuteur": "Depute",
      "acteurRef": "PA721270",
      "groupePolitiqueRef": "PO730940"
    },
    "cosignatairesRefs": [
      "PA722202",
      "PA721270",
      "PA721896",
      "PA267306",
      "PA718926",
      "PA335612",
      "PA720692",
      "PA720546",
      "PA718720",
      "PA689",
      "PA722110"
    ],
    "texteAffichable": "M.&#160;Peu,  M.&#160;Bruneel, Mme&#160;Buffet, M.&#160;Chassaigne, M.&#160;Dharr&#233;ville, M.&#160;Dufr&#232;gne, Mme&#160;Faucillon, M.&#160;Jumel, M.&#160;Lecoq, M.&#160;Fabien&#160;Roussel et M.&#160;Wulfranc"
  },
  "pointeurFragmentTexte": {
    "division": {
      "titre": "Article 50",
      "articleDesignationCourte": "APRÈS ART. 50",
      "type": "ARTICLE",
      "avantAApres": "Apres",
      "divisionRattachee": "APRÈS L'ARTICLE 50, insérer l'article suivant:",
      "articleAdditionnel": "1",
      "urlDivisionTexteVise": "/15/textes/2272C.asp#D_Article_50"
    }
  },
  "corps": {
    "dispositif": "<p style=\"text-align: justify;\">I.&#160;&#8211;&#160;&#192; la derni&#232;re phrase du troisi&#232;me alin&#233;a de l&#8217;article L.&#160;31&#8209;10&#8209;2 du code de la construction et de l&#8217;habitation, les mots&#160;: &#171;&#160;sign&#233; avant le 1<sup>er</sup> janvier 2020&#160;&#187; sont remplac&#233;s par les mots&#160;: &#171;&#160;ou &#224; bail r&#233;el solidaire&#160;&#187;.</p><p style=\"text-align: justify;\">II.&#160;&#8211;&#160;Les dispositions ci-dessus ne sont applicables qu&#8217;aux sommes venant en d&#233;duction de l&#8217;imp&#244;t d&#251;.</p><p style=\"text-align: justify;\">III.&#160;&#8211;&#160;La perte de recettes pour l&#8217;&#201;tat est compens&#233;e &#224; due concurrence par la cr&#233;ation d&#8217;une taxe additionnelle aux droits vis&#233;s aux articles 575 et 575 A du code g&#233;n&#233;ral des imp&#244;ts.</p>",
    "exposeSommaire": "<p style=\"text-align: justify;\">A compter du 1<sup>er</sup> janvier 2020, le PTZ sera r&#233;serv&#233; aux logements neufs situ&#233;s en zones tr&#232;s tendues (zones A et B1) mais supprim&#233; pour ceux situ&#233;s en zones B2 et C, &#224; l&#8217;exception des logements ayant donn&#233; lieu &#224; un contrat de location-accession sign&#233; avant le 1<sup>er</sup> janvier 2020.</p><p style=\"text-align: justify;\">Or cette limitation aura pour cons&#233;quence d&#8217;exclure de ce financement une immense partie du territoire et une majorit&#233; de m&#233;nages modestes susceptibles d&#8217;acc&#233;der &#224; la propri&#233;t&#233; hors des grandes villes ou m&#233;tropoles.</p><p style=\"text-align: justify;\">Le pr&#234;t &#224; taux z&#233;ro est le principal dispositif de financement de l&#8217;accession sociale &#224; la propri&#233;t&#233;.</p><p style=\"text-align: justify;\">Or la diminution, d&#233;j&#224; constat&#233;e, du nombre de PTZ &#233;mis sur ces territoires, a un impact tr&#232;s fort sur l&#8217;activit&#233; de construction.</p><p style=\"text-align: justify;\">Le recentrage progressif du dispositif sur le neuf et les zones dites tendues, cumul&#233; au recentrage du Pinel dans ces m&#234;mes zones et &#224; la suppression de l&#8217;APL accession ont port&#233; un coup d&#8217;arr&#234;t majeur &#224; la construction et &#224; la r&#233;servation de logements en France, en particulier dans les zones B2 et C.</p><p style=\"text-align: justify;\">Il convient donc de maintenir, dans ces territoires ruraux ou de villes moyennes, au-del&#224; du 31 d&#233;cembre 2019, l&#8217;acc&#232;s &#224; ce financement pour les acc&#233;dants &#224; la propri&#233;t&#233; ayant sign&#233; un contrat de location-accession, y compris en 2020 et 2021, ou un contrat de bail r&#233;el solidaire, ce qui participera &#233;galement &#224; la redynamisation et &#224; la revitalisation de ces villes et centres bourgs.</p><p style=\"text-align: justify;\">Cet amendement a pour objet de maintenir le PTZ pour les logements donnant lieu &#224; un bail r&#233;el solidaire ou &#224; un contrat de location-accession, sur tout le territoire, jusqu&#8217;au 31 d&#233;cembre 2021.</p>"
  },
  "representations": [
    {
      "nom": "PDF",
      "typeMime": {
        "type": "application",
        "subType": "PDF"
      },
      "statutRepresentation": {
        "verbatim": true,
        "canonique": true,
        "officielle": true,
        "transcription": false,
        "enregistrement": false
      },
      "contenu": {
        "documentURI": "/15/amendements/2272C/CION_FIN/CF437.pdf"
      }
    }
  ],
  "sort": {
    "dateSaisie": "2019-11-06T17:17:31.000+01:00",
    "sortEnSeance": "Rejeté"
  },
  "dateDepot": "2019-10-18T02:00:00.000+02:00",
  "dateDistribution": "2019-11-06T01:00:00.000+01:00",
  "article99": "0",
  "loiReference": {
    "codeLoi": "c construction habitation",
    "divisionCodeLoi": "L 31-10-2 al 3 dp"
  }
}