{
  "uid": "AMANR5L15PO419865B1831P0D1N1294",
  "identifiant": {
    "legislature": "15",
    "numero": "1294",
    "numRect": "0",
    "saisine": {
      "texteLegislatifRef": "PRJLANR5L15B1831",
      "numeroPartiePLF": "0",
      "organeExamen": "PO419865",
      "mentionSecondeDeliberation": "0"
    }
  },
  "numeroLong": "CD1294",
  "etapeTexte": "1ère lecture (2ème assemblée saisie)",
  "triAmendement": "iqaaaaaaaaaaaaaaaaaaaaaaaaaaaaaaaaaaaaaaaaaaaaaaaabazzze",
  "cardinaliteAmdtMultiples": "1",
  "etat": "Discuté",
  "signataires": {
    "auteur": {
      "typeAuteur": "Depute",
      "acteurRef": "PA333421",
      "groupePolitiqueRef": "PO759900"
    },
    "cosignatairesRefs": [
      "PA331582",
      "PA605694",
      "PA405480",
      "PA719146",
      "PA607619",
      "PA720996",
      "PA605518",
      "PA719286",
      "PA719138",
      "PA333421"
    ],
    "texteAffichable": "M.&#160;Pancher,  M.&#160;Acquaviva, M.&#160;Castellani, M.&#160;Colombani, M.&#160;El Guerrab, M.&#160;Falorni, M.&#160;Fran&#231;ois-Michel&#160;Lambert, M.&#160;Molac, M.&#160;Pupponi et M.&#160;Philippe&#160;Vigier"
  },
  "pointeurFragmentTexte": {
    "division": {
      "titre": "Article 31 bis",
      "articleDesignationCourte": "APRÈS ART. 31 BIS",
      "type": "ARTICLE",
      "avantAApres": "Apres",
      "divisionRattachee": "APRÈS L'ARTICLE 31 BIS, insérer l'article suivant:",
      "articleAdditionnel": "1",
      "urlDivisionTexteVise": "/15/textes/1831.asp#D_Article_31_bis"
    }
  },
  "corps": {
    "dispositif": "<p style=\"text-align: justify;\">La section&#160;1 du chapitre&#160;VI du titre&#160;I<sup>er</sup> du livre&#160;I<sup>er</sup> de la troisi&#232;me partie du code des transports est compl&#233;t&#233;e par un article L.&#160;3116&#8209;1&#8209;1 ainsi r&#233;dig&#233;&#160;:</p><p style=\"text-align: justify;\">&#171;&#160;<i>Art.&#160;L.&#160;3116&#8209;1-1</i>.&#160;&#8211;&#160;En application de l&#8217;article&#160;24 du r&#232;glement&#160;(UE) n&#176;&#160;181/2011 du Parlement europ&#233;en et du Conseil du 16&#160;f&#233;vrier 2011 concernant les droits des passagers dans le transport par autobus et autocar et modifiant le r&#232;glement&#160;(CE) n&#176;&#160;2006/2004, les personnes fournissant des services r&#233;guliers ou occasionnels de transport routier international de voyageurs d&#233;livrent une information ad&#233;quate aux passagers en provenance d&#8217;un &#201;tat membre sur les limites maximales autoris&#233;es de transport pour leurs besoins propres de tabacs manufactur&#233;s et de boissons alcoolis&#233;es ainsi que sur les sanctions encourues en cas de d&#233;passement de ces limites.</p><p style=\"text-align: justify;\">&#171;&#160;Les personnes fournissant des services r&#233;guliers ou occasionnels de transport routier international de voyageurs informent &#233;galement leurs clients en provenance de pays tiers des limites maximales autoris&#233;es de transport pour leurs besoins propres de tabacs manufactur&#233;s et de boissons alcoolis&#233;es et des sanctions encourues en cas de d&#233;passement de ces limites. La m&#233;connaissance de cette obligation est passible de l&#8217;amende administrative pr&#233;vue au&#160;1&#176; de l&#8217;article L.&#160;3116&#8209;2.</p><p style=\"text-align: justify;\">&#171;&#160;Les modalit&#233;s d&#8217;application du pr&#233;sent article sont fix&#233;es par d&#233;cret en Conseil d&#8217;&#201;tat.&#160;&#187;</p>",
    "exposeSommaire": "<p style=\"text-align: justify;\">Justifi&#233;e par des pr&#233;occupations de sant&#233; publique, la politique de taxation importante des produits du tabac et des boissons alcoolis&#233;es men&#233;e par l&#8217;&#201;tat est contourn&#233;e de fa&#231;on croissante par la contrebande de ces produits, tout particuli&#232;rement en provenance de pays voisins tels que l&#8217;Espagne, Andorre, la Belgique ou encore le Luxembourg. Ainsi, la consommation parall&#232;le de tabac repr&#233;senterait plus de 25&#160;% de la consommation fran&#231;aise.</p><p style=\"text-align: justify;\">La mont&#233;e en puissance des services r&#233;guliers ou occasionnels de transport routier international de voyageurs par autobus ou autocar est &#233;vidente&#160;: chaque ann&#233;e 4 &#224; 5 millions de personnes franchissent chaque ann&#233;e les fronti&#232;res fran&#231;aises par autobus ou autocar. Ce ph&#233;nom&#232;ne se traduit par une augmentation des importations illicites de ces produits, non seulement en raison de l&#8217;inexistence de contr&#244;les de bagages aussi pouss&#233;s que pour les voyages par avion, mais &#233;galement &#224; cause du manque d&#8217;information des voyageurs.</p><p style=\"text-align: justify;\">En effet, ces derniers ignorent souvent qu&#8217;ils ne peuvent emporter dans leurs bagages qu&#8217;une quantit&#233; maximale de produits du tabac manufactur&#233; ou de boissons alcoolis&#233;es (art.&#160;302 D du code g&#233;n&#233;ral des imp&#244;ts et art.&#160;50 <i>octies</i> de l&#8217;annexe IV du m&#234;me code). Le droit de l&#8217;Union impose aux personnes fournissant des services de transport routier international de voyageurs par autobus ou autocar l&#8217;obligation de d&#233;livrer des informations ad&#233;quates aux passagers tout au long du voyage.</p><p style=\"text-align: justify;\">Le pr&#233;sent amendement a pour objet de les associer &#224; l&#8217;effort de lutte contre les trafics desdits produits en d&#233;livrant une information ad&#233;quate &#224; leurs clients sur ces sujets. Il &#233;tend &#233;galement une telle obligation aux personnes fournissant de tels services en provenance d&#8217;&#201;tats tiers.</p>"
  },
  "representations": [
    {
      "nom": "PDF",
      "typeMime": {
        "type": "application",
        "subType": "PDF"
      },
      "statutRepresentation": {
        "verbatim": true,
        "canonique": true,
        "officielle": true,
        "transcription": false,
        "enregistrement": false
      },
      "contenu": {
        "documentURI": "/15/amendements/1831/CION-DVP/CD1294.pdf"
      }
    }
  ],
  "sort": {
    "dateSaisie": "2019-05-22T01:00:11.000+02:00",
    "sortEnSeance": "Retiré"
  },
  "dateDepot": "2019-05-08T02:00:00.000+02:00",
  "dateDistribution": "2019-05-19T02:00:00.000+02:00",
  "article99": "0",
  "loiReference": {
    "codeLoi": "transports",
    "divisionCodeLoi": "L3116-1-2"
  }
}