{
  "uid": "AMANR5L15PO59051B0911P0D1N458",
  "identifiant": {
    "legislature": "15",
    "numero": "458",
    "numRect": "0",
    "saisine": {
      "texteLegislatifRef": "PRJLANR5L15B0911",
      "numeroPartiePLF": "0",
      "organeExamen": "PO59051",
      "mentionSecondeDeliberation": "0"
    }
  },
  "numeroLong": "CL458",
  "etapeTexte": "1ère lecture (1ère assemblée saisie)",
  "triAmendement": "epk",
  "cardinaliteAmdtMultiples": "1",
  "etat": "Discuté",
  "signataires": {
    "auteur": {
      "typeAuteur": "Depute",
      "acteurRef": "PA608695",
      "groupePolitiqueRef": "PO730946"
    },
    "cosignatairesRefs": [
      "PA609590",
      "PA608172",
      "PA335054",
      "PA333818",
      "PA429893",
      "PA342415",
      "PA607553",
      "PA1008",
      "PA588886",
      "PA1198",
      "PA337483",
      "PA643145",
      "PA605069",
      "PA267233",
      "PA719930",
      "PA1592",
      "PA340357",
      "PA332614",
      "PA642764",
      "PA333285",
      "PA608695",
      "PA335532",
      "PA405480",
      "PA609332",
      "PA608011",
      "PA720988",
      "PA340343",
      "PA1809",
      "PA508",
      "PA610681"
    ],
    "texteAffichable": "Mme&#160;Untermaier,  M.&#160;David&#160;Habib, Mme&#160;Karamanli, M.&#160;Saulignac, M.&#160;Aviragnet, Mme&#160;Bareigts, Mme&#160;Battistel, Mme&#160;Bi&#233;mouret, M.&#160;Bouillon, M.&#160;Jean-Louis&#160;Bricout, M.&#160;Carvounas, M.&#160;Alain&#160;David, Mme&#160;Laurence&#160;Dumont, M.&#160;Faure, M.&#160;Garot, M.&#160;Hutin, M.&#160;Juanico, M.&#160;J&#233;r&#244;me&#160;Lambert, M.&#160;Le Foll, M.&#160;Letchimy, Mme&#160;Manin, Mme&#160;Pau-Langevin, Mme&#160;Pires Beaune, M.&#160;Potier, M.&#160;Pueyo, M.&#160;Pupponi, Mme&#160;Rabault, Mme&#160;Vainqueur-Christophe, M.&#160;Vallaud, Mme&#160;Victory et les membres du groupe Nouvelle Gauche"
  },
  "pointeurFragmentTexte": {
    "division": {
      "titre": "Article 2",
      "articleDesignationCourte": "ART. 2",
      "type": "ARTICLE",
      "avantAApres": "A",
      "divisionRattachee": "ARTICLE 2",
      "urlDivisionTexteVise": "/15/textes/0911.asp#D_Article_2"
    },
    "alinea": {
      "avantAApres": "Avant",
      "numero": "1",
      "alineaDesignation": "Avant l'alinéa 1"
    }
  },
  "corps": {
    "dispositif": "<p style=\"text-align: justify;\">I.&#160;&#8211;&#160;Avant l&#8217;alin&#233;a&#160;1, ins&#233;rer les&#160;deux alin&#233;as suivants&#160;:</p><p style=\"text-align: justify;\">&#171;&#160;L&#8217;article&#160;34 de la Constitution est ainsi modifi&#233;&#160;:</p><p style=\"text-align: justify;\">&#171;&#160;1&#176;&#160;&#192; la fin du treizi&#232;me alin&#233;a, les mots&#160;: &#171;&#160;,&#160;de leurs comp&#233;tences et de leurs ressources&#160;&#187; sont remplac&#233;s par les mots&#160;: &#171;&#160;et de leurs comp&#233;tences&#160;&#187;&#160;;&#160;&#187;.</p><p style=\"text-align: justify;\">II.&#160;&#8211;&#160;En cons&#233;quence, r&#233;diger ainsi le d&#233;but de l&#8217;alin&#233;a&#160;1&#160;:</p><p style=\"text-align: justify;\">&#171;&#160;2&#176;&#160;Au quinzi&#232;me alin&#233;a, apr&#232;s...&#160;<i>(le reste sans changement)</i>&#160;;&#160;&#187;.</p><p style=\"text-align: justify;\">III.&#160;&#8211;&#160;En cons&#233;quence, compl&#233;ter cet article par les deux alin&#233;as suivants&#160;:</p><p style=\"text-align: justify;\">&#171;&#160;3&#176;&#160;Apr&#232;s le dix-neuvi&#232;me alin&#233;a, il est ins&#233;r&#233; un alin&#233;a ainsi r&#233;dig&#233;&#160;:</p><p style=\"text-align: justify;\">&#171;&#160;&#171;&#160;Les lois de financement des collectivit&#233;s territoriales d&#233;terminent le montant des transferts financiers de l&#8217;&#201;tat ou de la s&#233;curit&#233; sociale aux collectivit&#233;s territoriales et les conditions g&#233;n&#233;rales d&#8217;&#233;quilibre de leurs comptes, dans les conditions et sous les r&#233;serves pr&#233;vues par une loi organique.&#160;&#187;&#160;&#187;</p>",
    "exposeSommaire": "<p>Cet amendement vise &#224; cr&#233;er une loi de financement des collectivit&#233;s territoriales.</p><p>Il reprend la proposition n&#176; 4 de la mission flash sur l&#8217;autonomie financi&#232;re des collectivit&#233;s territoriales, rapport&#233;e par Messieurs Jerretie et Courson et approuv&#233;e par la D&#233;l&#233;gation aux collectivit&#233;s territoriales et &#224; la d&#233;centralisation lors de sa r&#233;union du 9 mai 2018. Il a pour objet d&#8217;instituer une loi annuelle de financement des collectivit&#233;s territoriales.</p><p>Contrairement aux finances de l&#8217;&#201;tat et de la s&#233;curit&#233; sociale, il n&#8217;existe pas de cadre retra&#231;ant les pr&#233;visions de recettes et de d&#233;penses des collectivit&#233;s territoriales.</p><p>Actuellement, les dispositions ayant un impact sur les finances locales sont diss&#233;min&#233;es dans le projet de loi de finances (PLF) : en premi&#232;re partie mais &#233;galement en deuxi&#232;me partie, dans plusieurs missions budg&#233;taires dont la mission \"Relations avec les collectivit&#233;s territoriales\".</p><p>Sans avoir de caract&#232;re prescriptif, pour respecter l'article 72 de la Constitution, cette loi de financement permettrait de retracer l'ensemble des relations financi&#232;res des collectivit&#233;s territoriales avec l'&#201;tat.</p><p>Le projet de loi de financement des collectivit&#233;s territoriales (PLFCT) serait discut&#233; ind&#233;pendamment du PLF, mais &#233;videmment en coh&#233;rence avec lui comme peut l&#8217;&#234;tre le projet de loi de financement de la s&#233;curit&#233; sociale (PLFSS).</p><p>Comme la loi organique relative aux lois de finances (LOLF) et les dispositions organiques du code de la s&#233;curit&#233; sociale relative aux lois de financement de la s&#233;curit&#233; sociale d&#233;finissent le contenu, l&#8217;organisation et les modalit&#233;s de pr&#233;sentation et de discussion de ces lois particuli&#232;res, une loi organique sera n&#233;cessaire pour la mise en &#339;uvre de cette nouvelle disposition constitutionnelle. Cette loi organique devra d&#233;finir avec pr&#233;cision les dispositions que devront et pourront contenir ces lois, mais aussi celles qu&#8217;elles ne pourront pas contenir, dans le respect des principes constitutionnels de libre administration et d&#8217;autonomie financi&#232;re et fiscale des collectivit&#233;s territoriales.</p><p>Un autre amendement cr&#233;e un nouvel article 47-1-1 de la Constitution qui, sur le mod&#232;le de l'article 47-1 relatif &#224; la discussion des projets de loi de financement de la s&#233;curit&#233; sociale, d&#233;finit les r&#232;gles de rang constitutionnel relatives &#224; la proc&#233;dure d'examen des PLFCT. Un amendement de coordination est &#233;galement pr&#233;sent&#233; &#224; l'article 7 du projet de loi, pour &#233;tendre la possibilit&#233; d'examen conjoint, total ou partiel, que le projet de loi pr&#233;voit pour le PLF et le PLFSS, au PLFCT. Des amendements de coordination pour modifier les articles 42, 47-2 et 48 de la Constitution sont &#233;galement pr&#233;sent&#233;s.</p><p>Pour m&#233;moire, la cr&#233;ation d'une loi de financement des collectivit&#233;s territoriales a &#233;t&#233; propos&#233;e dans le rapport Lambert-Malvy d'avril 2014 (proposition n&#176; 48) et dans deux rapports de la Cour des comptes (rapport sur les finances publiques locales en 2013 et rapport sur la situation financi&#232;re et la gestion des collectivit&#233;s territoriales et de leurs &#233;tablissements publics en 2016).</p><p>&#160;</p><p>&#160;</p>"
  },
  "representations": [
    {
      "nom": "PDF",
      "typeMime": {
        "type": "application",
        "subType": "PDF"
      },
      "statutRepresentation": {
        "verbatim": true,
        "canonique": true,
        "officielle": true,
        "transcription": false,
        "enregistrement": false
      },
      "contenu": {
        "documentURI": "/15/amendements/0911/CION_LOIS/CL458.pdf"
      }
    }
  ],
  "sort": {
    "dateSaisie": "2018-06-28T23:05:51.000+02:00",
    "sortEnSeance": "Tombé"
  },
  "dateDepot": "2018-06-20T02:00:00.000+02:00",
  "dateDistribution": "2018-06-25T02:00:00.000+02:00",
  "article99": "0",
  "loiReference": {
    "codeLoi": "13-2",
    "divisionCodeLoi": "id"
  }
}