{
  "uid": "AMANR5L15SEA717460BTC1974P0D1N1364",
  "identifiant": {
    "legislature": "15",
    "numero": "1364",
    "numRect": "0",
    "saisine": {
      "texteLegislatifRef": "PRJLANR5L15BTC1974",
      "numeroPartiePLF": "0",
      "organeExamen": "PO717460",
      "mentionSecondeDeliberation": "0"
    }
  },
  "numeroLong": "1364",
  "etapeTexte": "1ère lecture (2ème assemblée saisie)",
  "triAmendement": "baoaaaaaaaaaaaaaaaaaaaaaaaaaaaaaaaaaaaaaaaaaaaaaaaae",
  "cardinaliteAmdtMultiples": "1",
  "etat": "Discuté",
  "signataires": {
    "auteur": {
      "typeAuteur": "Depute",
      "acteurRef": "PA719910",
      "groupePolitiqueRef": "PO730964"
    },
    "cosignatairesRefs": [
      "PA721600",
      "PA334768",
      "PA719910",
      "PA720622",
      "PA720108",
      "PA720538",
      "PA607155"
    ],
    "texteAffichable": "M.&#160;Belhamiti,  Mme&#160;Oppelt, M.&#160;Touraine, M.&#160;Daniel, Mme&#160;De Temmerman, Mme&#160;Bureau-Bonnard et Mme&#160;Rossi"
  },
  "pointeurFragmentTexte": {
    "division": {
      "titre": "Article 9",
      "articleDesignationCourte": "ART. 9",
      "type": "ARTICLE",
      "avantAApres": "A",
      "divisionRattachee": "ARTICLE 9",
      "urlDivisionTexteVise": "/15/textes/1974.asp#D_Article_9"
    },
    "alinea": {
      "numero": "3"
    }
  },
  "corps": {
    "dispositif": "<p style=\"text-align: justify;\">&#192; l&#8217;alin&#233;a&#160;3, substituer aux mots&#160;:</p><p style=\"text-align: justify;\">&#171;&#160;n&#233;cessaires &#224; l&#8217;information du voyageur&#160;&#187;</p><p style=\"text-align: justify;\">les mots&#160;:</p><p style=\"text-align: justify;\">&#171;&#160;de mobilit&#233; d&#8217;int&#233;r&#234;t g&#233;n&#233;ral&#160;&#187;.</p>",
    "exposeSommaire": "<p style=\"text-align: justify;\">Cet amendement se base sur la notion de &#171;&#160;donn&#233;e d&#8217;int&#233;r&#234;t g&#233;n&#233;ral&#160;&#187; inscrite dans la loi n&#176; 2016&#8209;1321 du 7 octobre 2016 pour une R&#233;publique num&#233;rique qui avait notamment pour ambition de donner une longueur d&#8217;avance &#224; la France dans le domaine du num&#233;rique en favorisant une politique d&#8217;ouverture des donn&#233;es et des connaissances.</p><p style=\"text-align: justify;\">Il s&#8217;agit d&#8217;enrichir le projet de loi d&#8217;orientation des mobilit&#233;s par la notion de service public de la donn&#233;e en prenant exemple sur l&#8217;initiative de Rennes m&#233;tropole qui a lanc&#233; le premier Service public m&#233;tropolitain de la donn&#233;e (SPMD), une initiative in&#233;dite en France qui vise &#224; faire de la gestion et du partage des donn&#233;es du territoire un service public &#224; part enti&#232;re.</p><p style=\"text-align: justify;\">Toute donn&#233;e de mobilit&#233; permettant &#224; une autorit&#233; organisatrice des mobilit&#233;s de mettre en &#339;uvre son plan de mobilit&#233; doit &#234;tre consid&#233;r&#233;e comme une donn&#233;e d&#8217;int&#233;r&#234;t g&#233;n&#233;ral.</p><p style=\"text-align: justify;\">Ces donn&#233;es de mobilit&#233; d&#8217;int&#233;r&#234;t g&#233;n&#233;ral sont produites par des acteurs publics ou par des acteurs priv&#233;s et sont indispensables &#224; la mise en &#339;uvre des services de mobilit&#233;.</p><p style=\"text-align: justify;\">En effet, la section 1 du projet de loi &#224; laquelle se rattache cet article&#160;9 a pour objet &#171;&#160;l&#8217;ouverture des donn&#233;es n&#233;cessaires au d&#233;veloppement de services num&#233;riques de mobilit&#233;&#160;&#187;. Il convient ainsi de se baser non pas uniquement sur les donn&#233;es relatives &#224; l&#8217;information des voyageurs, mais aussi sur les donn&#233;es d&#8217;int&#233;r&#234;t g&#233;n&#233;ral permettant la cr&#233;ation et l&#8217;am&#233;lioration des services de mobilit&#233; par les fournisseurs de services.</p>"
  },
  "representations": [
    {
      "nom": "PDF",
      "typeMime": {
        "type": "application",
        "subType": "PDF"
      },
      "statutRepresentation": {
        "verbatim": true,
        "canonique": true,
        "officielle": true,
        "transcription": false,
        "enregistrement": false
      },
      "contenu": {
        "documentURI": "/15/amendements/1974/AN/1364.pdf"
      }
    }
  ],
  "seanceDiscussion": "RUANR5L15S2019IDS21679",
  "sort": {
    "dateSaisie": "2019-06-06T12:33:42.000+02:00",
    "sortEnSeance": "Non soutenu"
  },
  "dateDepot": "2019-05-29T02:00:00.000+02:00",
  "dateDistribution": "2019-06-03T02:00:00.000+02:00",
  "article99": "0",
  "loiReference": {}
}