{
  "uid": "AMANR5L15PO59048B2272P1D1N632",
  "identifiant": {
    "legislature": "15",
    "numero": "632",
    "numRect": "0",
    "saisine": {
      "texteLegislatifRef": "PRJLANR5L15B2272",
      "numeroPartiePLF": "1",
      "organeExamen": "PO59048",
      "mentionSecondeDeliberation": "0"
    }
  },
  "numeroLong": "I-CF632",
  "etapeTexte": "1ère lecture (1ère assemblée saisie)",
  "triAmendement": "baiaaaaaaaaaaaaaaaaaaaaaaaaaaaaaaaaaaaaaaaaaaaaaaaj",
  "cardinaliteAmdtMultiples": "1",
  "etat": "Retiré",
  "signataires": {
    "auteur": {
      "typeAuteur": "Depute",
      "acteurRef": "PA720278",
      "groupePolitiqueRef": "PO759900"
    },
    "cosignatairesRefs": [
      "PA333421",
      "PA720278",
      "PA335999"
    ],
    "texteAffichable": "M.&#160;Orphelin,  M.&#160;Pancher et Mme&#160;Batho"
  },
  "pointeurFragmentTexte": {
    "division": {
      "titre": "Article 4",
      "articleDesignationCourte": "APRÈS ART. 4",
      "type": "ARTICLE",
      "avantAApres": "Apres",
      "divisionRattachee": "APRÈS L'ARTICLE 4, insérer l'article suivant:",
      "articleAdditionnel": "1",
      "urlDivisionTexteVise": "/15/textes/2272A.asp#D_Article_4"
    }
  },
  "corps": {
    "dispositif": "<p style=\"text-align: justify;\">Dans un d&#233;lai de trois mois &#224; compter de la promulgation de la pr&#233;sente loi, le Gouvernement remet au Parlement un rapport portant sur l&#8217;opportunit&#233; de d&#233;finir les montants des primes de transition &#233;nerg&#233;tique de mani&#232;re &#224; encourager une r&#233;novation compl&#232;te et performante en s&#8217;assurant que les primes pour la r&#233;novation compl&#232;te et performante soit plus favorables que le cumul des primes pour des op&#233;rations uniques.</p>",
    "exposeSommaire": "<p style=\"text-align: justify;\">Cet amendement vise &#224; rendre la r&#233;novation compl&#232;te et performante plus int&#233;ressante que le cumul des aides pour des gestes uniques. La nouvelle prime doit soutenir la r&#233;novation &#233;nerg&#233;tique des logements compl&#232;te et performante. Selon l&#8217;enqu&#234;te TREMI (Travaux de R&#233;novation &#201;nerg&#233;tique des Maisons Individuelles) de l&#8217;ADEME publi&#233;e en 2018, 25% des r&#233;novations ont un impact &#233;nerg&#233;tique significatif (saut de 1 classe &#233;nerg&#233;tique) et seulement 5 % pr&#233;sentant un impact &#233;nerg&#233;tique important (saut de 2 classes &#233;nerg&#233;tiques ou plus). ll semble donc important de rendre les aides pour la r&#233;novation compl&#232;te et performante plus int&#233;ressantes que les aides pour des gestes uniques.</p>"
  },
  "representations": [
    {
      "nom": "PDF",
      "typeMime": {
        "type": "application",
        "subType": "PDF"
      },
      "statutRepresentation": {
        "verbatim": true,
        "canonique": true,
        "officielle": true,
        "transcription": false,
        "enregistrement": false
      },
      "contenu": {
        "documentURI": "/15/amendements/2272A/CION_FIN/CF632.pdf"
      }
    }
  ],
  "dateDepot": "2019-10-04T02:00:00.000+02:00",
  "dateDistribution": "2019-10-04T02:00:00.000+02:00",
  "article99": "0",
  "loiReference": {
    "codeLoi": "zz rapport"
  }
}