{
  "uid": "AMANR5L15SEA717460BTC0971P0D1N3192",
  "identifiant": {
    "legislature": "15",
    "numero": "3192",
    "numRect": "0",
    "saisine": {
      "texteLegislatifRef": "PRJLANR5L15BTC0971",
      "numeroPartiePLF": "0",
      "organeExamen": "PO717460",
      "mentionSecondeDeliberation": "0"
    }
  },
  "numeroLong": "3192",
  "etapeTexte": "1ère lecture (1ère assemblée saisie)",
  "triAmendement": "fzi",
  "cardinaliteAmdtMultiples": "1",
  "amendementParent": "AMANR5L15SEA717460BTC0971P0D1N2986",
  "etat": "Discuté",
  "signataires": {
    "auteur": {
      "typeAuteur": "Depute",
      "acteurRef": "PA405480",
      "groupePolitiqueRef": "PO730946"
    },
    "cosignatairesRefs": [
      "PA405480",
      "PA1008",
      "PA608011",
      "PA335054",
      "PA342415",
      "PA1198",
      "PA508",
      "PA1592",
      "PA1809",
      "PA609332",
      "PA333818",
      "PA332614",
      "PA335532",
      "PA642764",
      "PA607553",
      "PA643145",
      "PA340343",
      "PA605069",
      "PA609590",
      "PA610681",
      "PA429893",
      "PA337483",
      "PA340357",
      "PA719930",
      "PA588886",
      "PA608695",
      "PA267233",
      "PA333285",
      "PA720988",
      "PA608172"
    ],
    "texteAffichable": "M.&#160;Pupponi,  M.&#160;Aviragnet, Mme&#160;Bareigts, Mme&#160;Battistel, Mme&#160;Bi&#233;mouret, M.&#160;Bouillon, M.&#160;Jean-Louis&#160;Bricout, M.&#160;Carvounas, M.&#160;Alain&#160;David, Mme&#160;Laurence&#160;Dumont, M.&#160;Faure, M.&#160;Garot, M.&#160;David&#160;Habib, M.&#160;Hutin, M.&#160;Juanico, Mme&#160;Karamanli, M.&#160;J&#233;r&#244;me&#160;Lambert, M.&#160;Le Foll, M.&#160;Letchimy, Mme&#160;Manin, Mme&#160;Pau-Langevin, Mme&#160;Pires Beaune, M.&#160;Potier, M.&#160;Pueyo, Mme&#160;Rabault, M.&#160;Saulignac, Mme&#160;Untermaier, Mme&#160;Vainqueur-Christophe, M.&#160;Vallaud et Mme&#160;Victory"
  },
  "pointeurFragmentTexte": {
    "division": {
      "titre": "Article 9 bis",
      "articleDesignationCourte": "ART. 9 BIS",
      "type": "ARTICLE",
      "avantAApres": "A",
      "divisionRattachee": "ARTICLE 9 BIS",
      "urlDivisionTexteVise": "/15/textes/0971.asp#D_Article_9_bis"
    }
  },
  "corps": {
    "dispositif": "<p style=\"text-align: justify;\">Apr&#232;s l&#8217;alin&#233;a&#160;6, ins&#233;rer l&#8217;alin&#233;a suivant&#160;:</p><p style=\"text-align: justify;\">&#171;&#160;Pour les locaux situ&#233;s dans les quartiers prioritaires de la politique de la ville mentionn&#233;s &#224; l&#8217;article&#160;5 de la loi n&#176;&#160;2014&#8209;173 du 21 f&#233;vrier 2014 de programmation pour la ville et la coh&#233;sion urbaine, la conclusion du contrat de r&#233;sidence temporaire est soumise &#224; l&#8217;accord pr&#233;alable du maire dans des conditions pr&#233;cis&#233;es par d&#233;cret.&#160;&#187;</p>",
    "exposeSommaire": "<p>Le dispositif propos&#233; &#224; l&#8217;article&#160;9 bis et introduit en Commission des affaires &#233;conomiques est un dispositif int&#233;ressant mais qui pose, comme d&#8217;autres articles de ce texte, le risque de voir, ici dans le cadre des contrats de r&#233;sidence temporaire, l&#8217;arriv&#233;e de nouvelles populations en fragilit&#233; dans des territoires d&#233;j&#224; fragilis&#233;s lorsque les locaux sont situ&#233;s dans les QPV, consid&#233;rant que l&#8217;objet de l&#8217;article porte sur l&#8217;insertion et l&#8217;accompagnement social.</p><p>En tout &#233;tat de cause, dans ces quartiers d&#233;j&#224; en grande difficult&#233; et afin que ces structures constituent bien un outil d&#8217;int&#233;gration plut&#244;t qu&#8217;un risque de concentration des populations en difficult&#233; toujours dans les m&#234;mes territoires, il appara&#238;t pertinent de soumettre la conclusion des contrats de r&#233;sidence temporaire &#224; l&#8217;accord pr&#233;alable du maire.&#160;</p>"
  },
  "representations": [
    {
      "nom": "PDF",
      "typeMime": {
        "type": "application",
        "subType": "PDF"
      },
      "statutRepresentation": {
        "verbatim": true,
        "canonique": true,
        "officielle": true,
        "transcription": false,
        "enregistrement": false
      },
      "contenu": {
        "documentURI": "/15/amendements/0971/AN/3192.pdf"
      }
    }
  ],
  "seanceDiscussion": "RUANR5L15S2018IDS21065",
  "sort": {
    "dateSaisie": "2018-05-31T22:40:40.000+02:00",
    "sortEnSeance": "Rejeté"
  },
  "dateDepot": "2018-05-31T02:00:00.000+02:00",
  "dateDistribution": "2018-05-31T02:00:00.000+02:00",
  "article99": "0",
  "loiReference": {}
}