{
  "uid": "AMANR5L15PO419604B1881P0D1N134",
  "identifiant": {
    "legislature": "15",
    "numero": "134",
    "numRect": "0",
    "saisine": {
      "texteLegislatifRef": "PRJLANR5L15B1881",
      "numeroPartiePLF": "0",
      "organeExamen": "PO419604",
      "mentionSecondeDeliberation": "0"
    }
  },
  "numeroLong": "AC134",
  "etapeTexte": "1ère lecture (1ère assemblée saisie)",
  "triAmendement": "ciaaaaaaaaaaaaaaaaaaaaaaaaaaaaaaaaaaaaaaaaaaaaaaaaeyi",
  "cardinaliteAmdtMultiples": "1",
  "etat": "Discuté",
  "signataires": {
    "auteur": {
      "typeAuteur": "Depute",
      "acteurRef": "PA721328",
      "groupePolitiqueRef": "PO730964"
    },
    "cosignatairesRefs": [
      "PA721328"
    ],
    "texteAffichable": "Mme&#160;Brugnera, rapporteure"
  },
  "pointeurFragmentTexte": {
    "division": {
      "titre": "Article 3",
      "articleDesignationCourte": "ART. 3",
      "type": "ARTICLE",
      "avantAApres": "A",
      "divisionRattachee": "ARTICLE 3",
      "urlDivisionTexteVise": "/15/textes/1881.asp#D_Article_3"
    },
    "alinea": {
      "numero": "1"
    }
  },
  "corps": {
    "dispositif": "<p style=\"text-align: justify;\">Substituer aux mots&#160;:</p><p>&#171;&#160;restauration et la conservation&#160;&#187;,</p><p>les mots&#160;:</p><p>&#171;&#160;conservation et la restauration&#160;&#187;.</p>",
    "exposeSommaire": "<p style=\"text-align: justify;\">Cet amendement vise &#224; marquer l'objectif prioritaire des travaux qui doivent s'engager sur la cath&#233;drale Notre-Dame, &#224; savoir la conservation de l'&#233;difice afin qu'il ne subisse pas de d&#233;gradations suppl&#233;mentaires. Il s'agit en effet d'un pr&#233;alable indispensable aux travaux de restauration.</p>"
  },
  "representations": [
    {
      "nom": "PDF",
      "typeMime": {
        "type": "application",
        "subType": "PDF"
      },
      "statutRepresentation": {
        "verbatim": true,
        "canonique": true,
        "officielle": true,
        "transcription": false,
        "enregistrement": false
      },
      "contenu": {
        "documentURI": "/15/amendements/1881/CION-CEDU/AC134.pdf"
      }
    }
  ],
  "sort": {
    "dateSaisie": "2019-05-02T11:22:06.000+02:00",
    "sortEnSeance": "Adopté"
  },
  "dateDepot": "2019-05-01T02:00:00.000+02:00",
  "dateDistribution": "2019-05-02T02:00:00.000+02:00",
  "article99": "0",
  "loiReference": {}
}