{
  "uid": "AMANR5L15PO766718B2187P0D1N1203",
  "identifiant": {
    "legislature": "15",
    "numero": "1203",
    "numRect": "0",
    "saisine": {
      "texteLegislatifRef": "PRJLANR5L15B2187",
      "numeroPartiePLF": "0",
      "organeExamen": "PO766718",
      "mentionSecondeDeliberation": "0"
    }
  },
  "numeroLong": "1203",
  "etapeTexte": "1ère lecture (1ère assemblée saisie)",
  "triAmendement": "dcaaaaaaaaaaaaaaaaaaaaaaaaaaaaaaaaaaaaaaaaaaaaaaaag",
  "cardinaliteAmdtMultiples": "1",
  "etat": "Discuté",
  "signataires": {
    "auteur": {
      "typeAuteur": "Depute",
      "acteurRef": "PA721932",
      "groupePolitiqueRef": "PO723569"
    },
    "cosignatairesRefs": [
      "PA721932"
    ],
    "texteAffichable": "Mme&#160;Lorho"
  },
  "pointeurFragmentTexte": {
    "division": {
      "titre": "TITRE IV",
      "articleDesignationCourte": "AVANT ART. 14",
      "type": "CHAPITRE",
      "avantAApres": "A",
      "divisionRattachee": "AVANT  L'ARTICLE 14",
      "urlDivisionTexteVise": "/15/textes/2187.asp#D_TITRE_IV_22"
    }
  },
  "corps": {
    "dispositif": "<p style=\"text-align: justify;\">Dans l&#8217;intitul&#233; du titre IV, substituer au mot&#160;:</p><p style=\"text-align: justify;\">&#171;&#160;libre&#160;&#187;</p><p style=\"text-align: justify;\">le mot&#160;:</p><p style=\"text-align: justify;\">&#171;&#160;&#233;thique&#160;&#187;.</p>",
    "exposeSommaire": "<p style=\"text-align: justify;\">La recherche en France n&#8217;est contrainte que par l&#8217;encadrement de la loi&#160;; il n&#8217;est donc pas n&#233;cessaire de la lib&#233;rer de quelque emprise que ce soit. En revanche, la recherche se doit de conserver une valeur &#233;thique, objectif de cet amendement.</p>"
  },
  "representations": [
    {
      "nom": "PDF",
      "typeMime": {
        "type": "application",
        "subType": "PDF"
      },
      "statutRepresentation": {
        "verbatim": true,
        "canonique": true,
        "officielle": true,
        "transcription": false,
        "enregistrement": false
      },
      "contenu": {
        "documentURI": "/15/amendements/2187/CSBIOETH/1203.pdf"
      }
    }
  ],
  "sort": {
    "dateSaisie": "2019-09-13T12:35:22.000+02:00",
    "sortEnSeance": "Non soutenu"
  },
  "dateDepot": "2019-09-05T02:00:00.000+02:00",
  "dateDistribution": "2019-09-10T02:00:00.000+02:00",
  "article99": "0",
  "loiReference": {}
}