{
  "uid": "AMANR5L15SEA717460BTC0857P0D1N48",
  "identifiant": {
    "legislature": "15",
    "numero": "48",
    "numRect": "0",
    "saisine": {
      "texteLegislatifRef": "PRJLANR5L15BTC0857",
      "numeroPartiePLF": "0",
      "organeExamen": "PO717460",
      "mentionSecondeDeliberation": "0"
    }
  },
  "numeroLong": "48",
  "etapeTexte": "1ère lecture (1ère assemblée saisie)",
  "triAmendement": "ads",
  "cardinaliteAmdtMultiples": "1",
  "etat": "Discuté",
  "signataires": {
    "auteur": {
      "typeAuteur": "Depute",
      "acteurRef": "PA267330",
      "groupePolitiqueRef": "PO744425"
    },
    "cosignatairesRefs": [
      "PA1960",
      "PA267042",
      "PA722030",
      "PA332228",
      "PA267780",
      "PA702052",
      "PA720230",
      "PA610775",
      "PA942",
      "PA719806",
      "PA721094",
      "PA267585",
      "PA695100",
      "PA266788",
      "PA267355",
      "PA331567",
      "PA267241",
      "PA642935",
      "PA335758",
      "PA267766",
      "PA268019",
      "PA267330",
      "PA331582",
      "PA721486",
      "PA720696",
      "PA642868"
    ],
    "texteAffichable": "M.&#160;Zumkeller,  M.&#160;Lagarde, M.&#160;Riester, Mme&#160;Auconie, M.&#160;Becht, M.&#160;Benoit, M.&#160;Bournazel, M.&#160;Guy&#160;Bricout, M.&#160;Christophe, M.&#160;Charles&#160;de Courson, Mme&#160;de La Raudi&#232;re, M.&#160;Demilly, Mme&#160;Descamps, M.&#160;Dunoyer, M.&#160;Favennec Becot, Mme&#160;Firmin Le Bodo, M.&#160;Gom&#232;s, M.&#160;Meyer&#160;Habib, M.&#160;Herth, M.&#160;Leroy, Mme&#160;Magnier, M.&#160;Morel-&#192;-L&apos;Huissier, M.&#160;Naegelen, Mme&#160;Sage, M.&#160;Vercamer et M.&#160;Philippe&#160;Vigier"
  },
  "pointeurFragmentTexte": {
    "division": {
      "titre": "Article 33 bis",
      "articleDesignationCourte": "APRÈS ART. 33 BIS",
      "type": "ARTICLE",
      "avantAApres": "Apres",
      "divisionRattachee": "APRÈS L'ARTICLE 33 BIS, insérer l'article suivant:",
      "articleAdditionnel": "1",
      "urlDivisionTexteVise": "/15/textes/0857.asp#D_Article_33_bis"
    }
  },
  "corps": {
    "dispositif": "<p style=\"text-align: justify;\">Le paragraphe&#160;5 de la section&#160;1 du chapitre&#160;III du titre&#160;I<sup>er</sup>&#160;<i>bis</i> du livre&#160;I<sup>er</sup> du code civil est compl&#233;t&#233; par un article&#160;21&#8209;25&#8209;2 ainsi r&#233;dig&#233;&#160;:</p><p style=\"text-align: justify;\">&#171;&#160;<i>Art.&#160;21&#8209;25&#8209;2.</i>&#160;&#8211;&#160;Lorsqu&#8217;au terme du d&#233;lai mentionn&#233; au deuxi&#232;me alin&#233;a de l&#8217;article&#160;21&#8209;25&#8209;1 aucune d&#233;cision de l&#8217;autorit&#233; administrative ne lui a &#233;t&#233; notifi&#233;e, l&#8217;&#233;tranger qui r&#233;side habituellement en France depuis au moins dix ans au jour de la remise mentionn&#233;e au premier alin&#233;a du m&#234;me article peut saisir le juge afin que ce dernier v&#233;rifie que l&#8217;&#233;tranger remplit l&#8217;ensemble des conditions qui lui permettent d&#8217;acqu&#233;rir la nationalit&#233; fran&#231;aise. Si l&#8217;&#233;tranger remplit ces conditions, l&#8217;acquisition de la nationalit&#233; fran&#231;aise est de droit.&#160;&#187;</p>",
    "exposeSommaire": "<p style=\"text-align: justify;\">Dans certains d&#233;partements, les demandes de naturalisation font l&#8217;objet d&#8217;une attente excessivement longue.</p><p style=\"text-align: justify;\">Aussi, afin d&#8217;inciter les autorit&#233;s publiques &#224; prendre les dispositions n&#233;cessaires pour acc&#233;l&#233;rer ces proc&#233;dures, l&#8217;amendement pr&#233;voit qu&#8217;au-del&#224;&#160;du d&#233;lai de 12 mois fix&#233; au 2e alin&#233;a de l&#8217;article&#160;21&#8209;25&#8209;1 du code civil, si aucune d&#233;cision de l&#8217;autorit&#233; administrative n&#8217;est intervenue, l&#8217;&#233;tranger qui r&#233;side habituellement en France depuis dix ans peut saisir le juge afin que ce dernier v&#233;rifie que l&#8217;&#233;tranger remplit l&#8217;ensemble des conditions qui lui permettent d&#8217;acqu&#233;rir la nationalit&#233; fran&#231;aise. Si l&#8217;&#233;tranger remplit ces conditions, l&#8217;acquisition de la nationalit&#233; fran&#231;aise est de droit.</p>"
  },
  "representations": [
    {
      "nom": "PDF",
      "typeMime": {
        "type": "application",
        "subType": "PDF"
      },
      "statutRepresentation": {
        "verbatim": true,
        "canonique": true,
        "officielle": true,
        "transcription": false,
        "enregistrement": false
      },
      "contenu": {
        "documentURI": "/15/amendements/0857/AN/48.pdf"
      }
    }
  ],
  "seanceDiscussion": "RUANR5L15S2018IDS21078",
  "sort": {
    "dateSaisie": "2018-04-22T18:48:09.000+02:00",
    "sortEnSeance": "Rejeté"
  },
  "dateDepot": "2018-04-10T02:00:00.000+02:00",
  "dateDistribution": "2018-04-16T02:00:00.000+02:00",
  "article99": "0",
  "loiReference": {
    "codeLoi": "c civil",
    "divisionCodeLoi": "21-25-2"
  }
}