{
  "uid": "AMANR5L15SEA717460BTC1482P0D1N113",
  "identifiant": {
    "legislature": "15",
    "numero": "113",
    "numRect": "1",
    "saisine": {
      "texteLegislatifRef": "PRJLANR5L15BTC1482",
      "numeroPartiePLF": "0",
      "organeExamen": "PO717460",
      "mentionSecondeDeliberation": "0"
    }
  },
  "numeroLong": "113 (Rect)",
  "etapeTexte": "1ère lecture (1ère assemblée saisie)",
  "triAmendement": "baaaaaaaaaaaaaaaaaaaaaaaaaaaaaaaaaaaaaaaaaaaaaaaaaldo",
  "cardinaliteAmdtMultiples": "1",
  "etat": "Discuté",
  "signataires": {
    "auteur": {
      "typeAuteur": "Depute",
      "acteurRef": "PA721522",
      "groupePolitiqueRef": "PO730964"
    },
    "cosignatairesRefs": [
      "PA721522"
    ],
    "texteAffichable": "M.&#160;Batut"
  },
  "pointeurFragmentTexte": {
    "division": {
      "titre": "Article 2",
      "articleDesignationCourte": "ART. 2",
      "type": "ARTICLE",
      "avantAApres": "A",
      "divisionRattachee": "ARTICLE 2",
      "urlDivisionTexteVise": "/15/textes/1482.asp#D_Article_2"
    },
    "alinea": {
      "numero": "25"
    }
  },
  "corps": {
    "dispositif": "<p>Supprimer les alin&#233;as 25 et 26.</p>",
    "exposeSommaire": "<p>Les inspecteurs de l&#8217;environnement ne peuvent pas &#234;tre juges et parties. Charg&#233;s de relever les infractions, il ne peuvent se substituer &#224; l&#8217;autorit&#233; judiciaire qui appr&#233;cie souverainement l&#8217;opportunit&#233; des poursuites au regard des ant&#233;c&#233;dents, de la personnalit&#233;, de la situation et de la nature de l&#8217;infraction commise par un contrevenant avant de lui proposer le cas &#233;ch&#233;ant une mesure&#160;alternative aux poursuites p&#233;nales.</p><p style=\"text-align: justify;\">La mise en &#339;uvre des stages alternatifs aux poursuites d&#8217;auteurs d&#8217;infractions de chasse est actuellement r&#233;gie par des conventions tripartites entre les Parquets, les f&#233;d&#233;rations d&#233;partementales des chasseurs et l&#8217;ONCFS. Ce dispositif permet&#160;d&#233;j&#224; de concourir &#224; l&#8217;objectif de traiter les contraventions par des mesures alternatives.</p>"
  },
  "representations": [
    {
      "nom": "PDF",
      "typeMime": {
        "type": "application",
        "subType": "PDF"
      },
      "statutRepresentation": {
        "verbatim": true,
        "canonique": true,
        "officielle": true,
        "transcription": false,
        "enregistrement": false
      },
      "contenu": {
        "documentURI": "/15/amendements/1482/AN/113.pdf"
      }
    }
  ],
  "seanceDiscussion": "RUANR5L15S2019IDS21461",
  "sort": {
    "dateSaisie": "2019-01-24T11:49:30.000+01:00",
    "sortEnSeance": "Rejeté"
  },
  "dateDepot": "2018-12-12T01:00:00.000+01:00",
  "dateDistribution": "2019-01-17T01:00:00.000+01:00",
  "article99": "0",
  "loiReference": {}
}