{
  "uid": "AMANR5L15PO59051B1695P0D1N10",
  "identifiant": {
    "legislature": "15",
    "numero": "10",
    "numRect": "0",
    "saisine": {
      "texteLegislatifRef": "PRJLANR5L15B1695",
      "numeroPartiePLF": "0",
      "organeExamen": "PO59051",
      "mentionSecondeDeliberation": "0"
    }
  },
  "numeroLong": "CL10",
  "etapeTexte": "1ère lecture (2ème assemblée saisie)",
  "triAmendement": "acaaaaaaaaaaaaaaaaaaaaaaaaaaaaaaaaaaaaaaaaaaaaaaaax",
  "cardinaliteAmdtMultiples": "1",
  "etat": "Discuté",
  "signataires": {
    "auteur": {
      "typeAuteur": "Depute",
      "acteurRef": "PA721960",
      "groupePolitiqueRef": "PO730958"
    },
    "cosignatairesRefs": [
      "PA720422",
      "PA721210",
      "PA719578",
      "PA720892",
      "PA2150",
      "PA720430",
      "PA721062",
      "PA588884",
      "PA720286",
      "PA719676",
      "PA722142",
      "PA721960",
      "PA720846",
      "PA718860",
      "PA721226",
      "PA721202",
      "PA718868"
    ],
    "texteAffichable": "Mme&#160;Obono,  Mme&#160;Autain, M.&#160;Bernalicis, M.&#160;Coquerel, M.&#160;Corbi&#232;re, Mme&#160;Fiat, M.&#160;Lachaud, M.&#160;Larive, M.&#160;M&#233;lenchon, Mme&#160;Panot, M.&#160;Prud&apos;homme, M.&#160;Quatennens, M.&#160;Ratenon, Mme&#160;Ressiguier, Mme&#160;Rubin, M.&#160;Ruffin et Mme&#160;Taurine"
  },
  "pointeurFragmentTexte": {
    "division": {
      "titre": "Article PREMIER",
      "articleDesignationCourte": "APRÈS ART. PREMIER",
      "type": "ARTICLE",
      "avantAApres": "Apres",
      "divisionRattachee": "APRÈS L'ARTICLE PREMIER, insérer l'article suivant:",
      "articleAdditionnel": "1",
      "urlDivisionTexteVise": "/15/textes/1695.asp#D_Article_1er"
    }
  },
  "corps": {
    "dispositif": "<p>Le titre&#160;I<sup>er</sup> de la loi organique n&#176;&#160;2004&#8209;192 du&#160;27&#160;f&#233;vrier&#160;2004 portant statut d&#8217;autonomie de la Polyn&#233;sie fran&#231;aise est compl&#233;t&#233; par une section&#160;3 ainsi r&#233;dig&#233;e&#160;:</p><p style=\"line-height: 1.2; text-align: justify;\">&#171;&#160;Section 3</p><p style=\"line-height: 1.2; text-align: justify;\">&#171;&#160;De l&#8217;&#233;galit&#233; r&#233;elle</p><p style=\"line-height: 1.2; text-align: justify;\">&#171;&#160;Sous-section 1</p><p style=\"line-height: 1.2; text-align: justify;\">&#171;&#160;Protectionnisme solidaire</p><p style=\"line-height: 1.2; text-align: justify;\">&#171;&#160;<i>Art.&#160;6&#8209;3</i>.&#160;&#8211;&#160;I.&#160;&#8211;&#160;La R&#233;publique reconna&#238;t la n&#233;cessit&#233; de garantir l&#8217;&#233;galit&#233; r&#233;elle en ce que l&#8217;&#201;tat contribue, sur la demande de la Polyn&#233;sie fran&#231;aise, et en partenariat avec elle, &#224; l&#8217;accompagnement de la mise en place d&#8217;un protectionnisme solidaire par cette collectivit&#233;.</p><p style=\"line-height: 1.2; text-align: justify;\">&#171;&#160;II.&#160;&#8211;&#160;Si le Gouvernement ou l&#8217;assembl&#233;e de la Polyn&#233;sie fran&#231;aise d&#233;cide de mettre en place des politiques de protectionnisme solidaire, tel un bouclier douanier constitu&#233; par exemple d&#8217;une taxe kilom&#233;trique modul&#233;e en fonction de l&#8217;impact &#233;cologique ou d&#8217;un octroi de mer r&#233;form&#233; et s&#233;curis&#233; qui pr&#233;serve les productions locales, conform&#233;ment &#224; l&#8217;article&#160;37&#8209;1 de la Constitution et pour une dur&#233;e maximale de cinq ans, le ministre charg&#233; des outre-mer peut exp&#233;rimenter la mise &#224; disposition au sens de l&#8217;article&#160;41 de la loi n&#176; 84&#8209;16 du 11 janvier 1984 d&#8217;agents publics pouvant exercer les fonctions d&#8217;experts et de supports techniques aupr&#232;s du Gouvernement de la Polyn&#233;sie fran&#231;aise.</p><p style=\"text-align: justify;\">&#171;&#160;Le cas &#233;ch&#233;ant, cette exp&#233;rimentation donne lieu &#224; un rapport permettant d&#8217;appr&#233;cier le retour d&#8217;exp&#233;rience pour les agents publics quant &#224; la mise en place d&#8217;un tel m&#233;canisme de protectionnisme solidaire en Polyn&#233;sie fran&#231;aise pour d&#233;fendre une &#233;conomie locale dynamique et limiter l&#8217;importation de produits pour lutter contre la vie ch&#232;re, ainsi qu&#8217;&#224; l&#8217;urgence et &#224; la n&#233;cessit&#233; de le promouvoir dans d&#8217;autre collectivit&#233;s et territoires d&#8217;outre-mer.</p><p style=\"text-align: justify;\">&#171;&#160;III.&#160;&#8211;&#160;Les dispositions des pr&#233;sents I et II s&#8217;appliquent dans le strict respect de la r&#233;partition des comp&#233;tences entre l&#8217;&#201;tat et la Polyn&#233;sie fran&#231;aise, telle qu&#8217;organis&#233;e par les titres II et III de la pr&#233;sente loi organique.&#160;&#187;</p>",
    "exposeSommaire": "<p style=\"line-height: 1.2; text-align: justify;\">Par cet amendement, nous proposons, dans le respect des comp&#233;tences statutaires de la collectivit&#233; de Polyn&#233;sie fran&#231;aise, d&#8217;accompagner cette collectivit&#233;, sur sa demande, et si elle souhaite mettre en place un protectionnisme solidaire afin de lutter contre les graves cons&#233;quences sociales et &#233;conomiques que ce territoire conna&#238;t, notamment la forte part d&#8217;importations de biens, le niveau global des prix relativement &#233;lev&#233;, ainsi que la concurrence in&#233;quitable de son &#233;conomie locale avec l&#8217;&#233;conomie extra-polyn&#233;sienne.</p><p style=\"text-align: justify;\">En soutenant la collectivit&#233; &#224; instaurer des m&#233;canismes de protection tels que la taxe kilom&#233;trique et l&#8217;octroi de mer, l&#8217;Etat fran&#231;ais contribuera au d&#233;veloppement des productions locales tout en luttant contre l&#8217;impact &#233;cologique des importations, s&#8217;ajoutant &#224; l&#8217;impact &#233;conomique et social.</p><p style=\"text-align: justify;\">A cet effet, sur demande de la Polyn&#233;sie fran&#231;aise, le Gouvernement peut exp&#233;rimenter la mise &#224; disposition de fonctionnaires (ils sont pay&#233;s par l&#8217;Etat fran&#231;ais, mais exercent leurs fonctions gratuitement aupr&#232;s de la collectivit&#233; de Polyn&#233;sie fran&#231;aise) pour accompagner la mise en oeuvre de telles politiques, et faire un retour d&#8217;exp&#233;rience qui sera b&#233;n&#233;fique pour l&#8217;&#233;ventuel d&#233;veloppement de telles politiques dans d&#8217;autres collectivit&#233;s ou territoires.<br /><br />Loin de vouloir revenir sur les comp&#233;tences de la Polyn&#233;sie fran&#231;aise et son autonomie, cette proposition s'inscrit au contraire dans l'id&#233;e d'acter d'un soutien renforc&#233; de l'Etat si la Polyn&#233;sie fran&#231;aise le sollicite.</p><p style=\"text-align: justify;\">&#160;</p><p style=\"text-align: justify;\">En d&#233;tail&#160;:</p><p style=\"text-align: justify;\">&#160;</p><p style=\"text-align: justify;\">Cet amendement respecte int&#233;gralement les comp&#233;tences actuelles de la collectivit&#233; polyn&#233;sienne, en ce qu&#8217;il ne propose que d&#8217;accompagner la Polyn&#233;sie fran&#231;aise si elle souhaite mettre en place un m&#233;canisme de protectionnisme solidaire (sur la r&#233;partition des comp&#233;tences Etat &#8211; collectivit&#233; polyn&#233;sienne en mati&#232;re douani&#232;re, voir l&#8217;article 7 point 8&#176; du statut).</p><p style=\"text-align: justify;\">En 2012, le secteur tertiaire repr&#233;sentait 85% de l&#8217;&#233;conomie polyn&#233;sienne alors que le primaire n&#8217;en repr&#233;sentait que 3% (<a style=\"text-decoration: none;\" href=\"https://www.ieom.fr/IMG/pdf/ra2015_polynesie_francaise.pdf\">https://www.ieom.fr/IMG/pdf/ra2015_polynesie_francaise.pdf</a>). Ce secteur primaire est limit&#233; principalement &#224; la perliculture et &#224; la p&#234;che et il ne r&#233;pond pas aux besoins alimentaires locaux, d&#8217;o&#249; la n&#233;cessit&#233; de recourir &#224; l&#8217;importation (<a style=\"text-decoration: none;\" href=\"http://www.outre-mer.gouv.fr/polynesie-francaise-economie\">http://www.outre-mer.gouv.fr/polynesie-francaise-economie</a>). En 2015, les industries agricoles et alimentaires sont le premier poste d&#8217;importation et repr&#233;sentent plus de 23% du total d&#8217;importation.</p><p style=\"line-height: 1.2; text-align: justify;\">Ainsi, l&#8217;&#233;cart entre le prix des produits alimentaires en m&#233;tropole et en Polyn&#233;sie fran&#231;aise est de 81% - alors qu&#8217;il est de 48% en Martinique, 42% en Guadeloupe, 45% en Guyane et 37% &#224; La R&#233;union - (<a style=\"text-decoration: none;\" href=\"http://www.ispf.pf/docs/default-source/publi-pf-bilans-et-etudes/pf-etudes-01-2016-comparaison-spatiale-des-prix.pdf?sfvrsn=6\">http://www.ispf.pf/docs/default-source/publi-pf-bilans-et-etudes/pf-etudes-01-2016-comparaison-spatiale-des-prix.pdf?sfvrsn=6</a>)</p><p style=\"text-align: justify;\">Favoriser les productions locales s&#8217;inscrirait &#233;galement dans une dynamique de lutte contre le ch&#244;mage tr&#232;s &#233;lev&#233; (22% selon l&#8217;INSEE) en diversifiant l&#8217;emploi (8 salari&#233;s polyn&#233;siens sur 10 travaillent dans le tertiaire).</p>"
  },
  "representations": [
    {
      "nom": "PDF",
      "typeMime": {
        "type": "application",
        "subType": "PDF"
      },
      "statutRepresentation": {
        "verbatim": true,
        "canonique": true,
        "officielle": true,
        "transcription": false,
        "enregistrement": false
      },
      "contenu": {
        "documentURI": "/15/amendements/1695/CION_LOIS/CL10.pdf"
      }
    }
  ],
  "sort": {
    "dateSaisie": "2019-03-27T19:35:35.000+01:00",
    "sortEnSeance": "Rejeté"
  },
  "dateDepot": "2019-03-22T01:00:00.000+01:00",
  "dateDistribution": "2019-03-26T01:00:00.000+01:00",
  "article99": "0",
  "loiReference": {
    "codeLoi": "6"
  }
}