{
  "uid": "AMANR5L15SEA717460BTC0106P0D1N364",
  "identifiant": {
    "legislature": "15",
    "numero": "364",
    "numRect": "0",
    "saisine": {
      "texteLegislatifRef": "PRJLANR5L15BTC0106",
      "numeroPartiePLF": "0",
      "organeExamen": "PO717460",
      "mentionSecondeDeliberation": "0"
    }
  },
  "numeroLong": "364",
  "etapeTexte": "1ère lecture (2ème assemblée saisie)",
  "triAmendement": "kns",
  "cardinaliteAmdtMultiples": "1",
  "etat": "Discuté",
  "signataires": {
    "auteur": {
      "typeAuteur": "Depute",
      "acteurRef": "PA608695",
      "groupePolitiqueRef": "PO730946"
    },
    "cosignatairesRefs": [
      "PA608172",
      "PA588886",
      "PA610681",
      "PA609590",
      "PA608695",
      "PA342415",
      "PA642764"
    ],
    "texteAffichable": "Mme&#160;Untermaier,  M.&#160;Aviragnet, Mme&#160;Bareigts, Mme&#160;Battistel, M.&#160;Le Foll, Mme&#160;Pires Beaune et Mme&#160;Rabault"
  },
  "pointeurFragmentTexte": {
    "division": {
      "titre": "Article 2 ter E",
      "articleDesignationCourte": "APRÈS ART. 2 TER E",
      "type": "ARTICLE",
      "avantAApres": "Apres",
      "divisionRattachee": "APRÈS L'ARTICLE 2 TER E, insérer l'article suivant:",
      "articleAdditionnel": "1",
      "urlDivisionTexteVise": "/15/textes/0106.asp#D_659"
    }
  },
  "corps": {
    "dispositif": "<p style=\"text-align: justify;\">I.&#160;&#8211;&#160;L&#8217;article&#160;25 <i>octies</i> de la loi n&#176; 83&#8209;634 du 13 juillet 1983 portant droits et obligations des fonctionnaires est ainsi modifi&#233;&#160;:</p><p style=\"text-align: justify;\">1&#176; Au d&#233;but du premier alin&#233;a du III, sont ins&#233;r&#233;s les mots&#160;: &#171;&#160;Sauf s&#8217;il a exerc&#233;, dans les trois ann&#233;es pr&#233;c&#233;dant la cessation de ses fonctions, une des fonctions mentionn&#233;es au premier alin&#233;a de l&#8217;article&#160;23 de la loi n&#176; 2013&#8209;907 du 11 octobre 2013 relative &#224; la transparence de la vie publique,&#160;&#187;&#160;;</p><p style=\"text-align: justify;\">2&#176; La seconde phrase du troisi&#232;me alin&#233;a du IV est supprim&#233;e.</p><p style=\"text-align: justify;\">II.&#160;&#8211;&#160;La section 4 de la loi n&#176; 2013&#8209;907 du 11 octobre 2013 relative &#224; la transparence de la vie publique est ainsi modifi&#233;e&#160;:</p><p style=\"text-align: justify;\">1&#176; Au 4&#176; du I de l&#8217;article&#160;20, les mots&#160;: &#171;&#160;ou des fonctions ex&#233;cutives locales &#233;num&#233;r&#233;es au&#160;2&#176; du&#160;I de l&#8217;article&#160;11&#160;&#187; sont remplac&#233;s par les mots&#160;: &#171;&#160;, des fonctions ex&#233;cutives locales &#233;num&#233;r&#233;es au&#160;2&#176; du&#160;I de l&#8217;article&#160;11 ou des fonctions mentionn&#233;es aux&#160;4&#176; et 7&#176; du m&#234;me I&#160;&#187;&#160;;</p><p style=\"text-align: justify;\">2&#176; L&#8217;article&#160;23 est ainsi modifi&#233;&#160;:</p><p style=\"text-align: justify;\"><i>a)</i> &#192; la premi&#232;re phrase du premier alin&#233;a du I, les mots&#160;: &#171;&#160;ou des fonctions ex&#233;cutives locales &#233;num&#233;r&#233;es au&#160;2&#176; du&#160;I de l&#8217;article&#160;11&#160;&#187; sont remplac&#233;s par les mots&#160;: &#171;&#160;, des fonctions ex&#233;cutives locales &#233;num&#233;r&#233;es au 2&#176; du I de l&#8217;article&#160;11 ou des fonctions mentionn&#233;es aux 4&#176; et 7&#176; du m&#234;me&#160;I&#160;&#187;&#160;;</p><p style=\"text-align: justify;\"><i>b)</i> La derni&#232;re phrase du m&#234;me alin&#233;a est remplac&#233;e par deux phrases ainsi r&#233;dig&#233;es&#160;:</p><p style=\"text-align: justify;\">&#171;&#160;D&#232;s lors qu&#8217;une personne a exerc&#233; l&#8217;une des fonctions vis&#233;es au pr&#233;sent alin&#233;a dans les trois ann&#233;es pr&#233;c&#233;dant le d&#233;but de cette activit&#233;, la Haute Autorit&#233; est seule comp&#233;tente pour assurer ce contr&#244;le. S&#8217;il s&#8217;agit d&#8217;un agent public, elle informe la commission de d&#233;ontologie mentionn&#233;e &#224; l&#8217;article&#160;25&#160;<i>octies</i> de la loi n&#176; 83&#8209;634 du 13 juillet 1983 pr&#233;cit&#233;e d&#8217;une telle saisine et lui communique, le cas &#233;ch&#233;ant, son avis.&#160;&#187;&#160;;</p><p style=\"text-align: justify;\"><i>c)</i> &#192; la fin des deux premiers alin&#233;as du II, les mots&#160;: &#171;&#160;ou des fonctions ex&#233;cutives locales&#160;&#187; sont remplac&#233;s par les mots&#160;: &#171;&#160;, des fonctions ex&#233;cutives locales ou des fonctions mentionn&#233;es aux&#160;4&#176; et&#160;7&#176; du I de l&#8217;article&#160;11 de la pr&#233;sente loi&#160;&#187;.</p><p style=\"text-align: justify;\">III.&#160;&#8211;&#160;Le pr&#233;sent article entre en vigueur le 1<sup>er</sup> janvier 2018. &#192; cette date, tous les dossiers en cours d&#8217;instruction par la commission de d&#233;ontologie mentionn&#233;e &#224; l&#8217;article&#160;25 <i>octies</i> de la loi n&#176; 83 634 du 13 juillet 1983 concernant des personnes ayant occup&#233;, dans les trois ann&#233;es pr&#233;c&#233;dant la saisine de la commission, l&#8217;une des fonctions vis&#233;es aux 4&#176; et 7&#176; du I de l&#8217;article&#160;11 de la loi n&#176; 2013&#8209;907 du 11 octobre 2013 relative &#224; la transparence de la vie publique, sont transf&#233;r&#233;s &#224; la Haute Autorit&#233; pour la transparence de la vie publique. Par d&#233;rogation aux dispositions du cinqui&#232;me alin&#233;a de l&#8217;article&#160;23 de la m&#234;me loi, cette derni&#232;re dispose d&#8217;un d&#233;lai de deux mois &#224; compter de cette date pour rendre son avis sur ces situations.</p>",
    "exposeSommaire": "<p style=\"text-align: justify;\">Cet amendement vise &#224; lutter plus efficacement contre le pantouflage en soumettant certains hauts fonctionnaires au contr&#244;le de la HATVP. Il s&#8217;agit des membres de cabinets et des personnes exer&#231;ant un emploi ou des fonctions &#224; la d&#233;cision du Gouvernement.</p><p style=\"text-align: justify;\">Cette proposition avait &#233;t&#233; initialement adopt&#233;e par le Parlement lors de l&#8217;examen de la loi dite &#171;&#160;Sapin 2&#160;&#187;, mais le Conseil l&#8217;avait censur&#233; pour une simple raison de l&#233;gistique&#160;: faute de pr&#233;cision, les dites personnes relevaient &#224; la fois de la comp&#233;tence de la commission de d&#233;ontologie des fonctionnaires et de celle de la HATVP.</p><p style=\"text-align: justify;\">Cet amendement reprend donc ce dispositif, modifi&#233; afin de satisfaire aux exigences du Conseil constitutionnel. Ont ainsi &#233;t&#233; ajout&#233;s&#160;:</p><p style=\"text-align: justify;\">- un report d&#8217;entr&#233;e en vigueur (01.01.2018)</p><p style=\"text-align: justify;\">- une pr&#233;cision afin de donner une priorit&#233; donn&#233;e &#224; la HATVP en cas de double comp&#233;tence avec la commission de d&#233;ontologie.</p><p style=\"text-align: justify;\">- une adaptation de coh&#233;rence de la loi du 13 juillet 1983.</p>"
  },
  "representations": [
    {
      "nom": "PDF",
      "typeMime": {
        "type": "application",
        "subType": "PDF"
      },
      "statutRepresentation": {
        "verbatim": true,
        "canonique": true,
        "officielle": true,
        "transcription": false,
        "enregistrement": false
      },
      "contenu": {
        "documentURI": "/15/amendements/0106/AN/364.pdf"
      }
    }
  ],
  "seanceDiscussion": "RUANR5L15S2017IDS20629",
  "sort": {
    "dateSaisie": "2017-07-26T19:19:09.000+02:00",
    "sortEnSeance": "Rejeté"
  },
  "dateDepot": "2017-07-21T02:00:00.000+02:00",
  "dateDistribution": "2017-07-22T02:00:00.000+02:00",
  "article99": "0",
  "loiReference": {
    "codeLoi": "loi 83-634",
    "divisionCodeLoi": "25 octies"
  }
}