{
  "uid": "AMANR5L15SEA717460BTC1237P0D1N2814",
  "identifiant": {
    "legislature": "15",
    "numero": "2814",
    "numRect": "0",
    "saisine": {
      "texteLegislatifRef": "PRJLANR5L15BTC1237",
      "numeroPartiePLF": "0",
      "organeExamen": "PO717460",
      "mentionSecondeDeliberation": "0"
    }
  },
  "numeroLong": "2814",
  "etapeTexte": "1ère lecture (1ère assemblée saisie)",
  "triAmendement": "ediaaaaaaaaaaaaaaaaaaaaaaaaaaaaaaaaaaaaaaaaaaaaaaay",
  "cardinaliteAmdtMultiples": "1",
  "etat": "Irrecevable",
  "signataires": {
    "auteur": {
      "typeAuteur": "Depute",
      "acteurRef": "PA607553",
      "groupePolitiqueRef": "PO758835"
    },
    "cosignatairesRefs": [
      "PA1198",
      "PA719930",
      "PA333285",
      "PA508",
      "PA610681",
      "PA332614",
      "PA1008",
      "PA333818",
      "PA609332",
      "PA429893",
      "PA609590",
      "PA267233",
      "PA608011",
      "PA607553",
      "PA608741",
      "PA340343",
      "PA342415",
      "PA1592",
      "PA337483",
      "PA720988",
      "PA405480",
      "PA608172",
      "PA608695",
      "PA335532",
      "PA642764",
      "PA335054",
      "PA605069",
      "PA1809",
      "PA340357",
      "PA643145"
    ],
    "texteAffichable": "M.&#160;Potier,  M.&#160;Aviragnet, Mme&#160;Bareigts, Mme&#160;Battistel, Mme&#160;Bi&#233;mouret, M.&#160;Bouillon, M.&#160;Jean-Louis&#160;Bricout, M.&#160;Carvounas, M.&#160;Alain&#160;David, Mme&#160;Laurence&#160;Dumont, M.&#160;Faure, M.&#160;Garot, M.&#160;David&#160;Habib, M.&#160;Hutin, M.&#160;Juanico, Mme&#160;Karamanli, M.&#160;J&#233;r&#244;me&#160;Lambert, M.&#160;Letchimy, Mme&#160;Manin, Mme&#160;Pau-Langevin, Mme&#160;Pires Beaune, M.&#160;Pueyo, M.&#160;Pupponi, Mme&#160;Rabault, M.&#160;Saulignac, Mme&#160;Tolmont, Mme&#160;Untermaier, Mme&#160;Vainqueur-Christophe, M.&#160;Vallaud et Mme&#160;Victory"
  },
  "pointeurFragmentTexte": {
    "division": {
      "titre": "Article 30",
      "articleDesignationCourte": "AVANT ART. 30",
      "type": "ARTICLE",
      "avantAApres": "Avant",
      "divisionRattachee": "AVANT L'ARTICLE 30, insérer l'article suivant:",
      "articleAdditionnel": "1",
      "urlDivisionTexteVise": "/15/textes/1237.asp#D_Article_30"
    }
  },
  "corps": {
    "dispositif": "<p style=\"text-align: justify;\">Apr&#232;s le deuxi&#232;me alin&#233;a de l&#8217;article L.&#160;518&#8209;2 du code mon&#233;taire et financier, il est ins&#233;r&#233; un alin&#233;a ainsi r&#233;dig&#233;&#160;:</p><p style=\"text-align: justify;\">&#171;&#160;La Caisse des d&#233;p&#244;ts et consignations concourt &#224; l&#8217;expression d&#233;mocratique par l&#8217;octroi, en pr&#234;teur de dernier recours, de pr&#234;ts aux particuliers et partis politiques candidats aux &#233;lections locales et nationales, dans des conditions pr&#233;cis&#233;es par un d&#233;cret pris en Conseil d&#8217;&#201;tat.&#160;&#187;</p>",
    "exposeSommaire": "<p style=\"text-align: justify;\">Le pr&#233;sent amendement tire les cons&#233;quences de l&#8217;abandon d&#8217;une promesse &#233;lectorale du Pr&#233;sident de la R&#233;publique, qui visait &#224; cr&#233;er une banque de la d&#233;mocratie afin de favoriser l&#8217;acc&#232;s de tous les candidats et notamment ceux issus des petits partis, &#224; des pr&#234;ts pour financer une campagne &#233;lectorale. Plut&#244;t que de cr&#233;er une structure ad hoc, il propose que la Caisse des d&#233;p&#244;ts soit appel&#233;e, en dernier ressort, &#224; fournir de tels pr&#234;ts aux candidats aux &#233;lections dans des conditions qui seront pr&#233;cis&#233;es par d&#233;cret.</p>"
  },
  "representations": [
    {
      "nom": "PDF",
      "typeMime": {
        "type": "application",
        "subType": "PDF"
      },
      "statutRepresentation": {
        "verbatim": true,
        "canonique": true,
        "officielle": true,
        "transcription": false,
        "enregistrement": false
      },
      "contenu": {
        "documentURI": "/15/amendements/1237/AN/2814.pdf"
      }
    }
  ],
  "dateDepot": "2018-09-21T02:00:00.000+02:00",
  "article99": "0",
  "loiReference": {
    "codeLoi": "santé publique",
    "divisionCodeLoi": "L518-2"
  }
}