{
  "uid": "AMANR5L15PO59048B2272P1D1N1437",
  "identifiant": {
    "legislature": "15",
    "numero": "1437",
    "numRect": "0",
    "saisine": {
      "texteLegislatifRef": "PRJLANR5L15B2272",
      "numeroPartiePLF": "1",
      "organeExamen": "PO59048",
      "mentionSecondeDeliberation": "0"
    }
  },
  "numeroLong": "I-CF1437",
  "etapeTexte": "1ère lecture (1ère assemblée saisie)",
  "triAmendement": "jiaaaaaaaaaaaaaaaaaaaaaaaaaaaaaaaaaaaaaaaaaaaaaaaacddzx",
  "cardinaliteAmdtMultiples": "1",
  "etat": "Discuté",
  "signataires": {
    "auteur": {
      "typeAuteur": "Depute",
      "acteurRef": "PA721202",
      "groupePolitiqueRef": "PO730958"
    },
    "cosignatairesRefs": [
      "PA722142",
      "PA719676",
      "PA718860",
      "PA721062",
      "PA2150",
      "PA721960",
      "PA719578",
      "PA721202",
      "PA720422",
      "PA721226",
      "PA720286",
      "PA718868",
      "PA588884",
      "PA720846",
      "PA720430",
      "PA721210",
      "PA720892"
    ],
    "texteAffichable": "M.&#160;Coquerel,  Mme&#160;Autain, M.&#160;Bernalicis, M.&#160;Corbi&#232;re, Mme&#160;Fiat, M.&#160;Lachaud, M.&#160;Larive, M.&#160;M&#233;lenchon, Mme&#160;Obono, Mme&#160;Panot, M.&#160;Prud&apos;homme, M.&#160;Quatennens, M.&#160;Ratenon, Mme&#160;Ressiguier, Mme&#160;Rubin, M.&#160;Ruffin et Mme&#160;Taurine"
  },
  "pointeurFragmentTexte": {
    "division": {
      "titre": "Article 27",
      "articleDesignationCourte": "ART. 27",
      "type": "ARTICLE",
      "avantAApres": "A",
      "divisionRattachee": "ARTICLE 27",
      "urlDivisionTexteVise": "/15/textes/2272A.asp#D_Article_27"
    },
    "alinea": {
      "avantAApres": "A",
      "numero": "8",
      "alineaDesignation": "Alinéa 8"
    }
  },
  "corps": {
    "dispositif": "<p style=\"text-align: justify;\">I.&#160;-&#160;&#192; la fin de l&#8217;alin&#233;a&#160;8, substituer au montant&#160;: </p><p style=\"text-align: justify;\">&#171;&#160;2&#160;151&#160;120&#160;&#187;</p><p style=\"text-align: justify;\">le montant&#160;: </p><p style=\"text-align: justify;\">&#171;&#160;2&#160;372&#160;720&#160;&#187;.</p><p style=\"text-align: justify;\">II.&#160;&#8211;&#160;Compl&#233;ter cet article par l&#8217;alin&#233;a suivant&#160;:</p><p style=\"text-align: justify;\">&#171;&#160;XIV.&#160;&#8211;&#160;La perte de recettes pour l&#8217;&#201;tat est compens&#233;e &#224; due concurrence par la cr&#233;ation d&#8217;une taxe additionnelle aux droits mentionn&#233;s aux articles 575 et 575 A du code g&#233;n&#233;ral des imp&#244;ts.&#160;&#187;.</p>",
    "exposeSommaire": "<p style=\"text-align: justify;\">Le plafond des recettes affect&#233;es aux agences de l&#8217;eau a &#233;t&#233; abaiss&#233; de 2,3 &#224; 2,105 milliards d&#8217;euros par la loi de finances pour 2018. Dans le m&#234;me temps, le Gouvernement supprimait la subvention pour charges de service public allou&#233;e &#224; l&#8217;Agence fran&#231;aise pour la biodiversit&#233; (AFB) et &#224; l&#8217;Office national de la chasse et de la faune sauvage (ONCFS) et augmentait &#224; due concurrence la part de financement de ces &#233;tablissements issue des recettes des agences de l&#8217;eau.</p><p style=\"text-align: justify;\">Les agences de l&#8217;eau ont ainsi connu une diminution tr&#232;s sensible de leurs ressources, d&#8217;autant plus dommageable pour l&#8217;accomplissement de leurs missions que les effectifs connaissent parall&#232;lement une baisse continue.</p><p style=\"text-align: justify;\">Le pr&#233;sent projet de loi de finances pr&#233;voit un l&#233;ger rel&#232;vement du plafond, de 2,105 &#224; 2,151 milliards, afin de tenir compte de la fusion de l&#8217;AFB et de l&#8217;ONCFS dans l&#8217;Office fran&#231;ais de la biodiversit&#233; au 1<sup>er</sup> janvier 2020 en int&#233;grant dans les recettes des agences de l&#8217;eau le produit des redevances cyn&#233;g&#233;tiques, pr&#233;c&#233;demment affect&#233; directement &#224; l&#8217;ONCFS.</p><p style=\"text-align: justify;\">Il est &#224; noter que cette ressource a consid&#233;rablement diminu&#233; en raison de la d&#233;cision du Pr&#233;sident de la R&#233;publique, en ao&#251;t 2018, d&#8217;abaisser le prix du permis de chasser (jusqu&#8217;&#224; - 80&#160;% pour le permis de chasser national annuel). Alors qu&#8217;elle &#233;tait de 72,7&#160;millions d&#8217;euros en r&#233;alisation 2018, elle n&#8217;est plus que de 46,1&#160;million d&#8217;euros en pr&#233;vision 2020.</p><p style=\"text-align: justify;\">Cet amendement vise &#224; relever le plafond des ressources des agences de l&#8217;eau &#224; son niveau ant&#233;rieur &#224; 2018 (soit 2,3 milliards d&#8217;euros), en y ajoutant un produit pr&#233;visionnel des redevances cyn&#233;g&#233;tiques de 72&#160;720 millions, c&#8217;est-&#224;-dire le niveau de 2018, avant que l&#8217;article&#160;233 de la loi de finances pour 2019 n&#8217;abaisse les redevances cyn&#233;g&#233;tiques. Un amendement d&#233;pos&#233; sur la deuxi&#232;me partie du pr&#233;sent de loi de finances proposera de r&#233;tablir les redevances cyn&#233;g&#233;tiques &#224; leur niveau ant&#233;rieur.</p><p style=\"text-align: justify;\">&#160;</p>"
  },
  "representations": [
    {
      "nom": "PDF",
      "typeMime": {
        "type": "application",
        "subType": "PDF"
      },
      "statutRepresentation": {
        "verbatim": true,
        "canonique": true,
        "officielle": true,
        "transcription": false,
        "enregistrement": false
      },
      "contenu": {
        "documentURI": "/15/amendements/2272A/CION_FIN/CF1437.pdf"
      }
    }
  ],
  "sort": {
    "dateSaisie": "2019-10-10T14:47:21.000+02:00",
    "sortEnSeance": "Non soutenu"
  },
  "dateDepot": "2019-10-04T02:00:00.000+02:00",
  "dateDistribution": "2019-10-10T02:00:00.000+02:00",
  "article99": "0",
  "loiReference": {}
}