{
  "uid": "AMANR5L15PO419865B1831P0D1N1151",
  "identifiant": {
    "legislature": "15",
    "numero": "1151",
    "numRect": "0",
    "saisine": {
      "texteLegislatifRef": "PRJLANR5L15B1831",
      "numeroPartiePLF": "0",
      "organeExamen": "PO419865",
      "mentionSecondeDeliberation": "0"
    }
  },
  "numeroLong": "CD1151",
  "etapeTexte": "1ère lecture (2ème assemblée saisie)",
  "triAmendement": "feaaaaaaaaaaaaaaaaaaaaaaaaaaaaaaaaaaaaaaaaaaaaaaaacbp",
  "cardinaliteAmdtMultiples": "1",
  "etat": "Discuté",
  "signataires": {
    "auteur": {
      "typeAuteur": "Depute",
      "acteurRef": "PA720278",
      "groupePolitiqueRef": "PO723569"
    },
    "cosignatairesRefs": [
      "PA719448",
      "PA610681",
      "PA720538",
      "PA643175",
      "PA720278",
      "PA720500",
      "PA721110",
      "PA719822",
      "PA722268",
      "PA719396",
      "PA719338",
      "PA721600",
      "PA332614",
      "PA718894",
      "PA719464",
      "PA720996",
      "PA719558",
      "PA719266",
      "PA607553",
      "PA702052",
      "PA722260",
      "PA719632",
      "PA719882",
      "PA722336",
      "PA718728"
    ],
    "texteAffichable": "M.&#160;Orphelin,  Mme&#160;Bareigts, Mme&#160;Chapelier, M.&#160;Dombreval, Mme&#160;Dupont, Mme&#160;Meynier-Millefert, M.&#160;Nadot, Mme&#160;Panonacle, Mme&#160;Thillaye, Mme&#160;Vanceunebrock-Mialon, M.&#160;Villani, Mme&#160;De Temmerman, M.&#160;El Guerrab, M.&#160;Juanico, M.&#160;Larsonneur, Mme&#160;Melchior, M.&#160;Thi&#233;baut, M.&#160;Balanant, M.&#160;Cubertafon, M.&#160;Potier, Mme&#160;Rossi, Mme&#160;Sage, Mme&#160;Sanquer, Mme&#160;Wonner et Mme&#160;Val&#233;rie&#160;Petit"
  },
  "pointeurFragmentTexte": {
    "division": {
      "titre": "Article 26 A",
      "articleDesignationCourte": "ART. 26 A",
      "type": "ARTICLE",
      "avantAApres": "A",
      "divisionRattachee": "ARTICLE 26 A",
      "urlDivisionTexteVise": "/15/textes/1831.asp#D_Article_26_A"
    },
    "alinea": {
      "numero": "2"
    }
  },
  "corps": {
    "dispositif": "<p>Apr&#232;s l&#8217;alin&#233;a&#160;2, ins&#233;rer un alin&#233;a ainsi r&#233;dig&#233;&#160;:</p><p style=\"text-align: justify;\">&#171;&#160;Les entreprises qui g&#232;rent un parc compris entre vingt et cent v&#233;hicules automobiles dont le poids total autoris&#233; en charge est inf&#233;rieur &#224; 3,5 tonnes acqui&#232;rent ou utilisent, lors du renouvellement de leur parc, des v&#233;hicules d&#233;finis au 1&#176; de l&#8217;article L.&#160;224&#8209;7, dans la proportion minimale de 5&#160;% avant 2022, de 15&#160;% d&#8217;ici 2025, de 40&#160;% d&#8217;ici 2028 et 100&#160;% en 2030.&#160;&#187;</p>",
    "exposeSommaire": "<p>Cet amendement vise &#224; verdir les flottes automobiles des entreprises dont le parc est sup&#233;rieur &#224; 20 v&#233;hicules, afin de les orienter vers les v&#233;hicules &#224; faibles et tr&#232;s faibles &#233;missions.<br />La loi de transition &#233;nerg&#233;tique pour la croissance verte a fix&#233; des objectifs de renouvellement de v&#233;hicules vers des v&#233;hicules &#224; faibles &#233;missions pour l&#8217;&#201;tat et le secteur priv&#233; &#224; l&#8217;horizon 2020. Il s&#8217;agit ici d&#8217;engager les entreprises g&#233;rant un parc compris entre vingt et cent v&#233;hicules &#224; travers un objectif de renouvellement vers de v&#233;hicules faibles ou tr&#232;s faibles &#233;missions de 5&#160;% avant 2022, 15&#160;% d&#8217;ici 2025 et 40&#160;% d&#8217;ici 2028 et 100&#160;% en 2030.</p><p style=\"text-align: justify;\">L&#8217;enjeu est de diminuer les &#233;missions de gaz &#224; effets de serre li&#233;es au secteur des transports selon une trajectoire coh&#233;rente avec les engagements climatiques de la France et de fixer un cap pour engager l&#8217;industrie automobile dans la transition vers une sortie des v&#233;hicules diesel et essence.</p><p style=\"text-align: justify;\">De plus, les derni&#232;res &#233;tudes sur l&#8217;&#233;volution du co&#251;t global de possession (TCO) du v&#233;hicule &#233;lectrique ont d&#233;montr&#233; qu&#8217;il &#233;tait, dans la plupart des cas, inf&#233;rieur &#224; celui de ses &#233;quivalents thermiques (inf&#233;rieur de 3&#160;% par rapport &#224; un v&#233;hicule di&#233;sel et de 5&#160;% par rapport &#224; un v&#233;hicule essence, d&#232;s quatre ans de possession selon une &#233;tude UFC Que Choisir).<br />Cet amendement a &#233;t&#233; propos&#233; par le R&#233;seau Action Climat.</p>"
  },
  "representations": [
    {
      "nom": "PDF",
      "typeMime": {
        "type": "application",
        "subType": "PDF"
      },
      "statutRepresentation": {
        "verbatim": true,
        "canonique": true,
        "officielle": true,
        "transcription": false,
        "enregistrement": false
      },
      "contenu": {
        "documentURI": "/15/amendements/1831/CION-DVP/CD1151.pdf"
      }
    }
  ],
  "sort": {
    "dateSaisie": "2019-05-17T23:25:05.000+02:00",
    "sortEnSeance": "Rejeté"
  },
  "dateDepot": "2019-05-07T02:00:00.000+02:00",
  "dateDistribution": "2019-05-16T02:00:00.000+02:00",
  "article99": "0",
  "loiReference": {
    "codeLoi": "rg"
  }
}