{
  "uid": "AMANR5L15SEA717460BTC0369P0D1N102",
  "identifiant": {
    "legislature": "15",
    "numero": "102",
    "numRect": "0",
    "saisine": {
      "texteLegislatifRef": "PRJLANR5L15BTC0369",
      "numeroPartiePLF": "0",
      "organeExamen": "PO717460",
      "mentionSecondeDeliberation": "0"
    }
  },
  "numeroLong": "102",
  "etapeTexte": "1ère lecture (1ère assemblée saisie)",
  "triAmendement": "ieids",
  "cardinaliteAmdtMultiples": "1",
  "etat": "Discuté",
  "signataires": {
    "auteur": {
      "typeAuteur": "Depute",
      "acteurRef": "PA720614",
      "groupePolitiqueRef": "PO723569"
    },
    "cosignatairesRefs": [
      "PA720606",
      "PA720468",
      "PA720664",
      "PA606212",
      "PA720614",
      "PA720822",
      "PA720798"
    ],
    "texteAffichable": "Mme&#160;Le Pen,  M.&#160;Aliot, M.&#160;Bilde, M.&#160;Chenu, M.&#160;Collard, M.&#160;Evrard et M.&#160;Pajot"
  },
  "pointeurFragmentTexte": {
    "division": {
      "titre": "Article 6",
      "articleDesignationCourte": "ART. 6",
      "type": "ARTICLE",
      "avantAApres": "A",
      "divisionRattachee": "ARTICLE 6",
      "urlDivisionTexteVise": "/15/textes/0369.asp#D_Article_6"
    },
    "alinea": {
      "avantAApres": "Apres",
      "numero": "4"
    }
  },
  "corps": {
    "dispositif": "<p style=\"text-align: justify;\">Apr&#232;s l&#8217;alin&#233;a&#160;4, ins&#233;rer les trois alin&#233;as suivants&#160;:</p><p style=\"text-align: justify;\">&#171;&#160;2&#176; <i>bis</i> L&#8217;article L.&#160;1233&#8209;3 est ainsi modifi&#233;&#160;:</p><p style=\"text-align: justify;\">&#171;&#160;a) &#192; la fin du douzi&#232;me alin&#233;a, les mots&#160;: &#171;&#160;&#233;tablies sur le territoire national&#160;&#187; sont supprim&#233;s&#160;;</p><p style=\"text-align: justify;\">&#171;&#160;b) Le treizi&#232;me alin&#233;a est supprim&#233;&#160;;&#160;&#187;.</p>",
    "exposeSommaire": "<p style=\"text-align: justify;\">Cet amendement vise &#224; supprimer la restriction du p&#233;rim&#232;tre au seul territoire national pour l&#8217;appr&#233;ciation des difficult&#233;s &#233;conomiques.</p><p style=\"text-align: justify;\">Les groupes multinationaux sont les premiers b&#233;n&#233;ficiaires de la mondialisation sauvage que l&#8217;on connait actuellement. Il convient qu&#8217;une certaine solidarit&#233; s&#8217;exerce entre les diff&#233;rentes entit&#233;s de ces groupes.</p>"
  },
  "representations": [
    {
      "nom": "PDF",
      "typeMime": {
        "type": "application",
        "subType": "PDF"
      },
      "statutRepresentation": {
        "verbatim": true,
        "canonique": true,
        "officielle": true,
        "transcription": false,
        "enregistrement": false
      },
      "contenu": {
        "documentURI": "/15/amendements/0369/AN/102.pdf"
      }
    }
  ],
  "seanceDiscussion": "RUANR5L15S2018IDS20779",
  "sort": {
    "dateSaisie": "2017-11-23T15:41:12.000+01:00",
    "sortEnSeance": "Rejeté"
  },
  "dateDepot": "2017-11-17T01:00:00.000+01:00",
  "dateDistribution": "2017-11-20T01:00:00.000+01:00",
  "article99": "0",
  "loiReference": {}
}