{
  "uid": "AMANR5L15PO766718B2187P0D1N141",
  "identifiant": {
    "legislature": "15",
    "numero": "141",
    "numRect": "0",
    "saisine": {
      "texteLegislatifRef": "PRJLANR5L15B2187",
      "numeroPartiePLF": "0",
      "organeExamen": "PO766718",
      "mentionSecondeDeliberation": "0"
    }
  },
  "numeroLong": "141",
  "etapeTexte": "1ère lecture (1ère assemblée saisie)",
  "triAmendement": "dkaaaaaaaaaaaaaaaaaaaaaaaaaaaaaaaaaaaaaaaaaaaaaaaazzyoaaztk",
  "cardinaliteAmdtMultiples": "1",
  "etat": "Discuté",
  "signataires": {
    "auteur": {
      "typeAuteur": "Depute",
      "acteurRef": "PA330008",
      "groupePolitiqueRef": "PO730934"
    },
    "cosignatairesRefs": [
      "PA330008",
      "PA722390",
      "PA721286"
    ],
    "texteAffichable": "M.&#160;Breton,  Mme&#160;Corneloup et M.&#160;Ramadier"
  },
  "pointeurFragmentTexte": {
    "division": {
      "titre": "Article 14",
      "articleDesignationCourte": "ART. 14",
      "type": "ARTICLE",
      "avantAApres": "A",
      "divisionRattachee": "ARTICLE 14",
      "urlDivisionTexteVise": "/15/textes/2187.asp#D_Article_14"
    },
    "alinea": {
      "avantAApres": "Apres",
      "numero": "23"
    }
  },
  "corps": {
    "dispositif": "<p style=\"text-align: justify;\">Apr&#232;s l&#8217;alin&#233;a&#160;23, ins&#233;rer l&#8217;alin&#233;a suivant&#160;:</p><p style=\"text-align: justify;\">&#171;&#160;Les protocoles de recherches mentionn&#233;s au I ne peuvent avoir pour objet la mod&#233;lisation de pathologies et le criblage de mol&#233;cules.&#160;&#187;</p>",
    "exposeSommaire": "<p style=\"text-align: justify;\">L&#8217;industrie pharmaceutique a pour principal objectif la mise au point de m&#233;dicaments. Elle consiste notamment &#224; cribler des mol&#233;cules, mod&#233;liser des pathologies et tester la toxicit&#233; des m&#233;dicaments.</p><p style=\"text-align: justify;\">Le criblage de mol&#233;cules sur les cellules souches vise &#224; identifier pr&#233;cocement les probl&#232;mes de toxicit&#233; (innocuit&#233;) et l&#8217;efficacit&#233; d&#8217;une mol&#233;cule th&#233;rapeutique sur des cultures cellulaires humaines.</p><p style=\"text-align: justify;\">La mod&#233;lisation de pathologies&#160;vise &#224; cr&#233;er des mod&#232;les de &#171;&#160;cellules souches&#160;&#187; repr&#233;sentatives de maladies humaines, qu&#8217;elles soient d&#233;g&#233;n&#233;ratives ou g&#233;n&#233;tiques, pour tester l&#8217;efficacit&#233; comparative de mol&#233;cules th&#233;rapeutiques sur ces cellules.</p><p style=\"text-align: justify;\">Il est act&#233; de fa&#231;on consensuelle aujourd&#8217;hui que, pour la recherche de l&#8217;industrie pharmaceutique, les cellules souches embryonnaires humaines peuvent &#234;tre remplac&#233;es. Les cellules souches pluripotentes induites (iPS), sont une alternative reconnue et effective, dans ce domaine. Il n&#8217;y a plus aucun d&#233;bat sur ce point.</p>"
  },
  "representations": [
    {
      "nom": "PDF",
      "typeMime": {
        "type": "application",
        "subType": "PDF"
      },
      "statutRepresentation": {
        "verbatim": true,
        "canonique": true,
        "officielle": true,
        "transcription": false,
        "enregistrement": false
      },
      "contenu": {
        "documentURI": "/15/amendements/2187/CSBIOETH/141.pdf"
      }
    }
  ],
  "sort": {
    "dateSaisie": "2019-09-13T16:37:47.000+02:00",
    "sortEnSeance": "Rejeté"
  },
  "dateDepot": "2019-08-01T02:00:00.000+02:00",
  "dateDistribution": "2019-09-11T02:00:00.000+02:00",
  "article99": "0",
  "loiReference": {}
}