{
  "uid": "AMANR5L15PO59048B1255P1D1N1295",
  "identifiant": {
    "legislature": "15",
    "numero": "1295",
    "numRect": "0",
    "saisine": {
      "texteLegislatifRef": "PRJLANR5L15B1255",
      "numeroPartiePLF": "1",
      "organeExamen": "PO59048",
      "mentionSecondeDeliberation": "0"
    }
  },
  "numeroLong": "I-CF1295",
  "etapeTexte": "1ère lecture (1ère assemblée saisie)",
  "triAmendement": "asaaaaaaaaaaaaaaaaaaaaaaaaaaaaaaaaaaaaaaaaaaaaaaaar",
  "cardinaliteAmdtMultiples": "1",
  "etat": "Discuté",
  "signataires": {
    "auteur": {
      "typeAuteur": "Depute",
      "acteurRef": "PA718720",
      "groupePolitiqueRef": "PO730940"
    },
    "cosignatairesRefs": [
      "PA610667",
      "PA610654",
      "PA721270",
      "PA718926",
      "PA718720",
      "PA441",
      "PA722202",
      "PA721118",
      "PA689",
      "PA722110",
      "PA720546",
      "PA267306",
      "PA721012",
      "PA335612",
      "PA720692",
      "PA721896"
    ],
    "texteAffichable": "M.&#160;Dufr&#232;gne,  M.&#160;Fabien&#160;Roussel, Mme&#160;Bello, M.&#160;Brotherson, M.&#160;Bruneel, Mme&#160;Buffet, M.&#160;Chassaigne, M.&#160;Dharr&#233;ville, Mme&#160;Faucillon, M.&#160;Jumel, Mme&#160;K&#233;clard-Mond&#233;sir, M.&#160;Lecoq, M.&#160;Nilor, M.&#160;Peu, M.&#160;Serville et M.&#160;Wulfranc"
  },
  "pointeurFragmentTexte": {
    "division": {
      "titre": "Article 3",
      "articleDesignationCourte": "ART. 3",
      "type": "ARTICLE",
      "avantAApres": "A",
      "divisionRattachee": "ARTICLE 3",
      "urlDivisionTexteVise": "/15/textes/1255A.asp#D_Article_3"
    },
    "alinea": {
      "avantAApres": "Apres",
      "numero": "20"
    }
  },
  "corps": {
    "dispositif": "<p style=\"text-align: justify;\">Compl&#233;ter cet article par les trois alin&#233;as suivants&#160;:</p><p style=\"text-align: justify;\">&#171;&#160;IV.&#160;&#8211; &#192; titre exp&#233;rimental et jusqu&#8217;au 31 d&#233;cembre 2020, l&#8217;&#201;tat peut autoriser l&#8217;&#233;tablissement d&#8217;une convention entre les maisons de services au public, d&#233;finies &#224; l&#8217;article&#160;27 de la loi n&#176;&#160;2000&#8209;321 du 12&#160;avril 2000 relative aux droits des citoyens dans leurs relations avec les administrations, et l&#8217;administration fiscale, ayant pour objet de d&#233;finir les modalit&#233;s d&#8217;accompagnement des contribuables susceptibles de s&#8217;adresser &#224; ces structures dans le cadre de la mise en place du pr&#233;l&#232;vement &#224; la source de l&#8217;imp&#244;t sur le revenu.&#160;Cette exp&#233;rimentation est limit&#233;e aux d&#233;partements de l&#8217;Allier et de la Meuse.</p><p style=\"text-align: justify;\">&#171;&#160;Le IV entre en vigueur &#224; compter du 1<sup>er</sup> janvier 2019.</p><p style=\"text-align: justify;\">&#171;&#160;Le Gouvernement remet au Parlement un rapport de l&#8217;&#233;valuation de l&#8217;exp&#233;rimentation au plus tard le 15 septembre 2020.&#160;&#187;</p>",
    "exposeSommaire": "<p style=\"text-align: justify;\">La mise en place du pr&#233;l&#232;vement &#224; la source le 1<sup>er</sup> janvier prochain va profond&#233;ment transformer les habitudes des contribuables. Cette r&#233;forme, particuli&#232;rement complexe, suscite craintes et incompr&#233;hensions, comme le manque d&#8217;information et les difficult&#233;s &#224; propos du choix du taux applicable au 1er janvier (taux neutre, taux personnalis&#233;, etc.), qui &#233;tait &#224; effectuer avant mi-septembre, l&#8217;ont bien illustr&#233;.</p><p style=\"text-align: justify;\">Pour pr&#233;venir toute difficult&#233;, il y a lieu de mettre en &#339;uvre un accompagnement renforc&#233;.</p><p style=\"text-align: justify;\">Le pr&#233;sent amendement propose la mise en place d&#8217;une exp&#233;rimentation limit&#233;e aux territoires des d&#233;partements de l&#8217;Allier et de la Meuse et pour une dur&#233;e de trois. Elle porte sur la d&#233;finition des conditions d&#8217;accueil du public susceptible de s&#8217;adresser aux maisons de services au public (MSAP) dans le cadre de la mise en &#339;uvre du pr&#233;l&#232;vement &#224; la source de l&#8217;imp&#244;t sur le revenu et propose qu&#8217;une convention soit conclue entre ces MSAP et l&#8217;administration fiscale.</p>"
  },
  "representations": [
    {
      "nom": "PDF",
      "typeMime": {
        "type": "application",
        "subType": "PDF"
      },
      "statutRepresentation": {
        "verbatim": true,
        "canonique": true,
        "officielle": true,
        "transcription": false,
        "enregistrement": false
      },
      "contenu": {
        "documentURI": "/15/amendements/1255A/CION_FIN/CF1295.pdf"
      }
    }
  ],
  "sort": {
    "dateSaisie": "2018-10-09T22:54:49.000+02:00",
    "sortEnSeance": "Adopté"
  },
  "dateDepot": "2018-10-05T02:00:00.000+02:00",
  "dateDistribution": "2018-10-08T02:00:00.000+02:00",
  "article99": "0",
  "loiReference": {}
}