{
  "uid": "AMANR5L15SEA717460BTC2401P0D1N505",
  "identifiant": {
    "legislature": "15",
    "numero": "505",
    "numRect": "0",
    "saisine": {
      "texteLegislatifRef": "PRJLANR5L15BTC2401",
      "numeroPartiePLF": "0",
      "organeExamen": "PO717460",
      "mentionSecondeDeliberation": "0"
    }
  },
  "numeroLong": "505",
  "etapeTexte": "1ère lecture (2ème assemblée saisie)",
  "triAmendement": "emaaaaaaaaaaaaaaaaaaaaaaaaaaaaaaaaaaaaaaaaaaaaaaaabp",
  "cardinaliteAmdtMultiples": "1",
  "etat": "A discuter",
  "signataires": {
    "auteur": {
      "typeAuteur": "Depute",
      "acteurRef": "PA719162",
      "groupePolitiqueRef": "PO730964"
    },
    "cosignatairesRefs": [
      "PA722240",
      "PA719972",
      "PA721702",
      "PA719456",
      "PA719162",
      "PA606639",
      "PA721336"
    ],
    "texteAffichable": "Mme&#160;Jacqueline&#160;Dubois,  M.&#160;Vignal, Mme&#160;Brocard, M.&#160;Fauvergue, Mme&#160;Sarles, M.&#160;Venteau et Mme&#160;M&#246;rch"
  },
  "pointeurFragmentTexte": {
    "division": {
      "titre": "Article 15",
      "articleDesignationCourte": "APRÈS ART. 15",
      "type": "ARTICLE",
      "avantAApres": "Apres",
      "divisionRattachee": "APRÈS L'ARTICLE 15, insérer l'article suivant:",
      "articleAdditionnel": "1",
      "urlDivisionTexteVise": "/15/textes/2401.asp#D_Article_15"
    }
  },
  "corps": {
    "dispositif": "<p style=\"text-align: justify;\">Apr&#232;s le IV de l&#8217;article L.&#160;5211&#8209;9&#8209;2 du code g&#233;n&#233;ral de collectivit&#233;s territoriales, il est ins&#233;r&#233; un IV&#160;<i>bis</i> ainsi r&#233;dig&#233;&#160;:</p><p style=\"text-align: justify;\">&#171;&#160;IV <i>bis</i>.&#160;&#8211;&#160;Lorsqu&#8217;une comp&#233;tence communale est transf&#233;r&#233;e &#224; un &#233;tablissement public de coop&#233;ration intercommunale, les maires des communes concern&#233;es peuvent d&#233;cider de transf&#233;rer &#233;galement les pouvoirs de police qui lui sont li&#233;s.&#160;&#187;</p>",
    "exposeSommaire": "<p>Cet amendement vise &#224; assurer une certaine coh&#233;rence entre le transfert de comp&#233;tence &#224; un &#233;tablissement public de coop&#233;ration intercommunale et les pouvoirs de police administratifs qui lui sont li&#233;s.</p><p style=\"text-align: justify;\">Cette demande est issue des entretiens avec des maires et adjoints de la circonscription situ&#233;e en zone rurale.</p>"
  },
  "representations": [
    {
      "nom": "PDF",
      "typeMime": {
        "type": "application",
        "subType": "PDF"
      },
      "statutRepresentation": {
        "verbatim": true,
        "canonique": true,
        "officielle": true,
        "transcription": false,
        "enregistrement": false
      },
      "contenu": {
        "documentURI": "/15/amendements/2401/AN/505.pdf"
      }
    }
  ],
  "dateDepot": "2019-11-13T01:00:00.000+01:00",
  "dateDistribution": "2019-11-16T01:00:00.000+01:00",
  "article99": "0",
  "loiReference": {
    "codeLoi": "CGCT",
    "divisionCodeLoi": "L5211-9-2"
  }
}