{
  "uid": "AMANR5L15SEA717460BTC2243P0D1N452",
  "identifiant": {
    "legislature": "15",
    "numero": "452",
    "numRect": "0",
    "saisine": {
      "texteLegislatifRef": "PRJLANR5L15BTC2243",
      "numeroPartiePLF": "0",
      "organeExamen": "PO717460",
      "mentionSecondeDeliberation": "0"
    }
  },
  "numeroLong": "452",
  "etapeTexte": "1ère lecture (1ère assemblée saisie)",
  "triAmendement": "bboaaaaaaaaaaaaaaaaaaaaaaaaaaaaaaaaaaaaaaaaaaaaaaabbabi",
  "cardinaliteAmdtMultiples": "1",
  "etat": "Discuté",
  "signataires": {
    "auteur": {
      "typeAuteur": "Depute",
      "acteurRef": "PA608416",
      "groupePolitiqueRef": "PO730934"
    },
    "cosignatairesRefs": [
      "PA266776",
      "PA608416"
    ],
    "texteAffichable": "M.&#160;Hetzel et M.&#160;Reiss"
  },
  "pointeurFragmentTexte": {
    "division": {
      "titre": "Article 5",
      "articleDesignationCourte": "APRÈS ART. 5",
      "type": "ARTICLE",
      "avantAApres": "Apres",
      "divisionRattachee": "APRÈS L'ARTICLE 5, insérer l'article suivant:",
      "articleAdditionnel": "1",
      "urlDivisionTexteVise": "/15/textes/2243.asp#D_Article_5"
    }
  },
  "corps": {
    "dispositif": "<p style=\"text-align: justify;\">Apr&#232;s le premier alin&#233;a de l&#8217;article L.&#160;1111&#8209;4 du code de la sant&#233; publique, il est ins&#233;r&#233; un alin&#233;a ainsi r&#233;dig&#233;&#160;:</p><p style=\"text-align: justify;\">&#171;&#160;La mention &#171;&#160;donneur d&#8217;organe&#160;&#187; est sp&#233;cifi&#233;e sur le dossier m&#233;dical partag&#233;. Un d&#233;cret pris en Conseil d&#8217;&#201;tat pr&#233;cise les modalit&#233;s et la possibilit&#233; pour les donneurs potentiels de se r&#233;tracter.&#160;&#187;</p>",
    "exposeSommaire": "<p style=\"text-align: justify;\">Inscrire la mention de &#171;&#160;donneur d&#8217;organe&#160;&#187; dans le dossier m&#233;dical partag&#233; et sur la carte vitale constituerait un moyen efficace d&#8217;information sur le souhait des personnes.</p>"
  },
  "representations": [
    {
      "nom": "PDF",
      "typeMime": {
        "type": "application",
        "subType": "PDF"
      },
      "statutRepresentation": {
        "verbatim": true,
        "canonique": true,
        "officielle": true,
        "transcription": false,
        "enregistrement": false
      },
      "contenu": {
        "documentURI": "/15/amendements/2243/AN/452.pdf"
      }
    }
  ],
  "seanceDiscussion": "RUANR5L15S2020IDS21846",
  "sort": {
    "dateSaisie": "2019-10-03T23:57:19.000+02:00",
    "sortEnSeance": "Retiré"
  },
  "dateDepot": "2019-09-16T02:00:00.000+02:00",
  "dateDistribution": "2019-09-24T02:00:00.000+02:00",
  "article99": "0",
  "loiReference": {
    "codeLoi": "c santé publique",
    "divisionCodeLoi": "L1111-4"
  }
}