{
  "uid": "AMANR5L15PO59048B1255P2D1N789",
  "identifiant": {
    "legislature": "15",
    "numero": "789",
    "numRect": "0",
    "saisine": {
      "texteLegislatifRef": "PRJLANR5L15B1255",
      "numeroPartiePLF": "2",
      "organeExamen": "PO59048",
      "mentionSecondeDeliberation": "0"
    }
  },
  "numeroLong": "II-CF789",
  "etapeTexte": "1ère lecture (1ère assemblée saisie)",
  "triAmendement": "daoaaaaaaaaaaaaaaaaaaaaaaaaaaaaaaaaaaaaaaaaaaaaaaai",
  "cardinaliteAmdtMultiples": "1",
  "etat": "Irrecevable",
  "signataires": {
    "auteur": {
      "typeAuteur": "Depute",
      "acteurRef": "PA721202",
      "groupePolitiqueRef": "PO730958"
    },
    "cosignatairesRefs": [
      "PA721210",
      "PA718860",
      "PA2150",
      "PA721202",
      "PA722142",
      "PA720430",
      "PA719578",
      "PA721062",
      "PA588884",
      "PA720422",
      "PA719676",
      "PA721960",
      "PA720286",
      "PA720846",
      "PA721226",
      "PA720892",
      "PA718868"
    ],
    "texteAffichable": "M.&#160;Coquerel,  Mme&#160;Autain, M.&#160;Bernalicis, M.&#160;Corbi&#232;re, Mme&#160;Fiat, M.&#160;Lachaud, M.&#160;Larive, M.&#160;M&#233;lenchon, Mme&#160;Obono, Mme&#160;Panot, M.&#160;Prud&apos;homme, M.&#160;Quatennens, M.&#160;Ratenon, Mme&#160;Ressiguier, Mme&#160;Rubin, M.&#160;Ruffin et Mme&#160;Taurine"
  },
  "pointeurFragmentTexte": {
    "missionVisee": {
      "idMissionAN": "417",
      "libelleMission": "Santé",
      "codeMissionPLF": "B",
      "libelleMissionPLF": "Répartition, par mission et programme, des crédits du budget général"
    },
    "division": {
      "titre": "Article 81",
      "articleDesignationCourte": "APRÈS ART. 81",
      "type": "ARTICLE",
      "avantAApres": "Apres",
      "divisionRattachee": "APRÈS L'ARTICLE 81, insérer l'article suivant:",
      "articleAdditionnel": "1",
      "urlDivisionTexteVise": "/15/textes/1255C.asp#D_Article_81"
    }
  },
  "corps": {
    "dispositif": "<p>Le Gouvernement remet<span class=\"ins cts-1\"  data-cid=\"8\" data-userid=\"2912\" data-username=\"BORIS BOUZOL-BROITMAN\" data-time=\"1540556766256\"> au Parlement</span>, dans les six mois suivant la promulgation de la pr&#233;sente loi, un rapport sur le co&#251;t et l&#8217;opportunit&#233; sociale&#160;de transf&#233;rer l'aide m&#233;dicale d'Etat de la mission sant&#233; du PLF&#160;au r&#233;gime g&#233;n&#233;ral de s&#233;curit&#233; sociale.</p>",
    "exposeSommaire": "<p style=\"text-align: justify;\">L&#8217;acc&#232;s effectif aux soins des personnes en situation de pr&#233;carit&#233; est entrav&#233; par un ph&#233;nom&#232;ne persistant de non-recours et des ruptures de droit &#224; la couverture maladie. La complexit&#233; des d&#233;marches administratives et la coexistence de plusieurs dispositifs ont des cons&#233;quences n&#233;gatives sur les plans humains, administratifs, &#233;conomiques et de sant&#233; publique. Les personnes en <span class=\"ins cts-1\"  data-cid=\"16\" data-userid=\"2912\" data-username=\"BORIS BOUZOL-BROITMAN\" data-time=\"1540556926244\">s</span><span class=\"ins cts-1\"  data-cid=\"3\" data-userid=\"2912\" data-username=\"BORIS BOUZOL-BROITMAN\" data-time=\"1540556922701\">ituation de </span>pr&#233;carit&#233; qui ont des droits potentiels &#224; l&#8217;AME rencontrent de multiples obstacles pour l&#8217;ouverture et le maintien de ce droit, et leur acc&#232;s &#224; la pr&#233;vention et aux soins est difficile, alors m&#234;me<span class=\"del cts-1\"  data-cid=\"17\" data-userid=\"2912\" data-username=\"BORIS BOUZOL-BROITMAN\" data-time=\"1540556941157\">s</span> qu&#8217;elles cumulent de nombreux facteurs de vuln&#233;rabilit&#233;. Il faut donc rendre plus simple le dispositif d&#8217;acc&#232;s &#224; la couverture maladie et &#224; la part compl&#233;mentaire pour garantir son effectivit&#233;.</p><p style=\"text-align: justify;\">De nombreuses institutions recommandent depuis plusieurs ann&#233;es d&#8217;inclure l&#8217;AME dans le r&#233;gime g&#233;n&#233;ral de s&#233;curit&#233; sociale (dont l&#8217;IGAS<span class=\"ins cts-1\"  data-cid=\"23\" data-userid=\"2912\" data-username=\"BORIS BOUZOL-BROITMAN\" data-time=\"1540556979523\">,</span><span class=\"del cts-1\"  data-cid=\"18\" data-userid=\"2912\" data-username=\"BORIS BOUZOL-BROITMAN\" data-time=\"1540556976821\"> et</span> l&#8217;IGF<span class=\"ins cts-1\"  data-cid=\"25\" data-userid=\"2912\" data-username=\"BORIS BOUZOL-BROITMAN\" data-time=\"1540556981510\"> et</span><span class=\"del cts-1\"  data-cid=\"24\" data-userid=\"2912\" data-username=\"BORIS BOUZOL-BROITMAN\" data-time=\"1540556981415\">,</span> le D&#233;fenseur des droits). En juin 2017, c&#8217;est l&#8217;Acad&#233;mie nationale de m&#233;decine qui recommandait cette r&#233;forme. Elle permettrait une grande simplification administrative &#339;uvrant pour un acc&#232;s facilit&#233; de tous aux droits, &#224; la pr&#233;vention et aux soins. Ce serait une mesure de sant&#233; publique majeure am&#233;liorant la pr&#233;vention et la promotion de la sant&#233; ainsi que l&#8217;acc&#232;s aux soins des &#233;trangers en situation de pr&#233;carit&#233;, m&#234;me quand ils sont en situation irr&#233;guli&#232;re, avec un b&#233;n&#233;fice induit sur la sant&#233; de l&#8217;ensemble de la population. Elle constituerait &#233;galement un avantage pour les finances publiques en favorisant un acc&#232;s aux soins moins tardif et en supprimant le co&#251;t de gestion du dispositif sp&#233;cifique de l&#8217;AME. Le pr&#233;sent amendement, propos&#233; par M&#233;decins du monde, propose en cons&#233;quence d&#8217;int&#233;grer les b&#233;n&#233;ficiaires de l&#8217;AME au r&#233;gime g&#233;n&#233;ral de la s&#233;curit&#233; sociale.</p>"
  },
  "representations": [
    {
      "nom": "PDF",
      "typeMime": {
        "type": "application",
        "subType": "PDF"
      },
      "statutRepresentation": {
        "verbatim": true,
        "canonique": true,
        "officielle": true,
        "transcription": false,
        "enregistrement": false
      },
      "contenu": {
        "documentURI": "/15/amendements/1255C/CION_FIN/CF789.pdf"
      }
    }
  ],
  "dateDepot": "2018-10-26T02:00:00.000+02:00",
  "article99": "0",
  "loiReference": {}
}