{
  "uid": "AMANR5L15SEA717460BTC2401P0D1N414",
  "identifiant": {
    "legislature": "15",
    "numero": "414",
    "numRect": "0",
    "saisine": {
      "texteLegislatifRef": "PRJLANR5L15BTC2401",
      "numeroPartiePLF": "0",
      "organeExamen": "PO717460",
      "mentionSecondeDeliberation": "0"
    }
  },
  "numeroLong": "414",
  "etapeTexte": "1ère lecture (2ème assemblée saisie)",
  "triAmendement": "akoaaaaaaaaaaaaaaaaaaaaaaaaaaaaaaaaaaaaaaaaaaaaaaaai",
  "cardinaliteAmdtMultiples": "1",
  "etat": "Discuté",
  "signataires": {
    "auteur": {
      "typeAuteur": "Depute",
      "acteurRef": "PA608695",
      "groupePolitiqueRef": "PO758835"
    },
    "cosignatairesRefs": [
      "PA719930",
      "PA608172",
      "PA333285",
      "PA508",
      "PA720988",
      "PA335054",
      "PA335532",
      "PA333818",
      "PA609332",
      "PA1592",
      "PA337483",
      "PA267233",
      "PA332614",
      "PA340357",
      "PA1008",
      "PA642764",
      "PA342415",
      "PA643145",
      "PA608741",
      "PA340343",
      "PA605069",
      "PA1809",
      "PA610681",
      "PA429893",
      "PA608011",
      "PA609590",
      "PA607553",
      "PA608695",
      "PA1198"
    ],
    "texteAffichable": "Mme&#160;Untermaier,  Mme&#160;Pires Beaune, Mme&#160;Battistel, Mme&#160;Pau-Langevin, Mme&#160;Karamanli, M.&#160;Potier, M.&#160;Saulignac, M.&#160;Carvounas, M.&#160;Aviragnet, Mme&#160;Bareigts, Mme&#160;Bi&#233;mouret, M.&#160;Bouillon, M.&#160;Jean-Louis&#160;Bricout, M.&#160;Alain&#160;David, Mme&#160;Laurence&#160;Dumont, M.&#160;Faure, M.&#160;Garot, M.&#160;David&#160;Habib, M.&#160;Hutin, M.&#160;Juanico, M.&#160;J&#233;r&#244;me&#160;Lambert, M.&#160;Letchimy, Mme&#160;Manin, M.&#160;Pueyo, Mme&#160;Rabault, Mme&#160;Tolmont, Mme&#160;Vainqueur-Christophe, M.&#160;Vallaud, Mme&#160;Victory et les membres du groupe Socialistes et apparent&#233;s"
  },
  "pointeurFragmentTexte": {
    "division": {
      "titre": "Article 4",
      "articleDesignationCourte": "ART. 4",
      "type": "ARTICLE",
      "avantAApres": "A",
      "divisionRattachee": "ARTICLE 4",
      "urlDivisionTexteVise": "/15/textes/2401.asp#D_Article_4"
    },
    "alinea": {
      "numero": "2"
    }
  },
  "corps": {
    "dispositif": "<p>&#192; l&#8217;alin&#233;a&#160;2, substituer aux mots&#160;:</p><p style=\"text-align: justify;\">&#171;&#160;qui font&#160;&#187;</p><p style=\"text-align: justify;\">le mot&#160;:</p><p style=\"text-align: justify;\">&#171;&#160;faisant&#160;&#187;.</p>",
    "exposeSommaire": "<p>Amendement r&#233;dactionnel.</p>"
  },
  "representations": [
    {
      "nom": "PDF",
      "typeMime": {
        "type": "application",
        "subType": "PDF"
      },
      "statutRepresentation": {
        "verbatim": true,
        "canonique": true,
        "officielle": true,
        "transcription": false,
        "enregistrement": false
      },
      "contenu": {
        "documentURI": "/15/amendements/2401/AN/414.pdf"
      }
    }
  ],
  "seanceDiscussion": "RUANR5L15S2020IDS21948",
  "sort": {
    "dateSaisie": "2019-11-19T19:46:35.000+01:00",
    "sortEnSeance": "Adopté"
  },
  "dateDepot": "2019-11-13T01:00:00.000+01:00",
  "dateDistribution": "2019-11-17T01:00:00.000+01:00",
  "article99": "0",
  "loiReference": {}
}