{
  "uid": "AMANR5L15SEA717460B2272P2D1N2583",
  "identifiant": {
    "legislature": "15",
    "numero": "2583",
    "numRect": "0",
    "saisine": {
      "texteLegislatifRef": "PRJLANR5L15B2272",
      "numeroPartiePLF": "2",
      "organeExamen": "PO717460",
      "mentionSecondeDeliberation": "0"
    }
  },
  "numeroLong": "II-2583",
  "etapeTexte": "1ère lecture (1ère assemblée saisie)",
  "triAmendement": "ecaaaacaaaaaaaaaaaaaaaaaaaaaaaaaaaaaaaaaaaaaaaaaaazzzzzzzzzzzzzu",
  "cardinaliteAmdtMultiples": "1",
  "etat": "Discuté",
  "signataires": {
    "auteur": {
      "typeAuteur": "Rapporteur",
      "acteurRef": "PA267336",
      "organeRef": "PO59048",
      "groupePolitiqueRef": "PO730964"
    },
    "cosignatairesRefs": [
      "PA720790",
      "PA718736",
      "PA721466",
      "PA719850",
      "PA722244",
      "PA721458",
      "PA722382",
      "PA720878",
      "PA760658",
      "PA719778",
      "PA719250",
      "PA719472",
      "PA267336",
      "PA721764",
      "PA720298",
      "PA720520",
      "PA722054",
      "PA719480",
      "PA607193",
      "PA720500",
      "PA720492",
      "PA720268",
      "PA720590",
      "PA722078",
      "PA720402",
      "PA718954",
      "PA719006",
      "PA720022",
      "PA721150",
      "PA719710",
      "PA720960",
      "PA719060",
      "PA606675",
      "PA719798",
      "PA721542",
      "PA719592",
      "PA607595",
      "PA643175"
    ],
    "texteAffichable": "M.&#160;Giraud, rapporteur g&#233;n&#233;ral au nom de la commission des finances,  Mme&#160;Cariou, M.&#160;Ahamada, M.&#160;Andr&#233;, Mme&#160;Cattelot, M.&#160;Cazeneuve, M.&#160;Chassaing, M.&#160;Chouat, M.&#160;Damaisin, Mme&#160;Dominique&#160;David, M.&#160;Dirx, Mme&#160;Dupont, Mme&#160;Errante, M.&#160;Gaillard, M.&#160;Grau, Mme&#160;Gregoire, Mme&#160;Hai, M.&#160;Holroyd, M.&#160;Jerretie, M.&#160;Jolivet, M.&#160;Labaronne, M.&#160;Lauzzana, M.&#160;Le Vigoureux, Mme&#160;Magne, Mme&#160;Motin, Mme&#160;Osson, M.&#160;Paluszkiewicz, M.&#160;Pellois, Mme&#160;Val&#233;rie&#160;Petit, Mme&#160;Peyrol, M.&#160;Potterie, M.&#160;Roseren, M.&#160;Saint-Martin, M.&#160;Savatier, M.&#160;Serva, M.&#160;Simian, Mme&#160;Verdier-Jouclas et M.&#160;Le Gendre"
  },
  "pointeurFragmentTexte": {
    "division": {
      "titre": "Article 59",
      "articleDesignationCourte": "APRÈS ART. 59",
      "type": "ARTICLE",
      "avantAApres": "Apres",
      "divisionRattachee": "APRÈS L'ARTICLE 59, insérer l'article suivant:",
      "articleAdditionnel": "1",
      "urlDivisionTexteVise": "/15/textes/2272C.asp#D_Article_59"
    }
  },
  "corps": {
    "dispositif": "<p style=\"text-align: justify;\">Au deuxi&#232;me alin&#233;a de l&#8217;article L.&#160;16 du livre des proc&#233;dures fiscales, la r&#233;f&#233;rence&#160;: &#171;&#160;150 VH&#160;&#187; est remplac&#233;e par la r&#233;f&#233;rence&#160;: &#171;&#160;150 VH&#160;<i>bis</i>&#160;&#187;.</p>",
    "exposeSommaire": "<p style=\"text-align: justify;\">L&#8217;article&#160;41 de la loi n&#176;&#160;2018&#8209;1317 du 28&#160;d&#233;cembre&#160;2018 de finances pour 2019 a cr&#233;&#233; un nouveau r&#233;gime fiscal applicable aux particuliers qui r&#233;alisent &#224; titre occasionnel, directement ou par personnes interpos&#233;es, des plus-values de cessions d&#8217;actifs num&#233;riques ou de droits s&#8217;y rapportant.</p><p style=\"text-align: justify;\">Les contribuables qui r&#233;alisent de telles cessions sont en cons&#233;quence tenus de d&#233;clarer le montant global de la plus ou moins-value r&#233;alis&#233;e au titre des cessions imposables de l&#8217;ann&#233;e ainsi que le prix de cession, le prix d&#8217;acquisition du portefeuille d&#8217;actifs num&#233;riques et sa valeur globale au moment de la cession. Cette d&#233;claration est soumise au contr&#244;le de l&#8217;administration&#160;: les contribuables devront alors produire, sur demande de l&#8217;administration, tout &#233;l&#233;ment de nature &#224; justifier les informations d&#233;clar&#233;es.</p><p style=\"text-align: justify;\">Toutefois, en l&#8217;&#233;tat actuel du droit, si un contribuable ne r&#233;pond pas ou r&#233;pond de mani&#232;re insuffisante &#224; une demande de l&#8217;administration relative &#224; ses cessions d&#8217;actifs num&#233;riques, celle-ci n&#8217;est pas en mesure de le mettre en demeure de compl&#233;ter sa r&#233;ponse, voire de taxer d&#8217;office ses plus-values de cessions d&#8217;actifs num&#233;riques s&#8217;il ne donne pas suite &#224; cette mise en demeure, ce qui permet &#224; un contribuable fraudeur d&#8217;&#233;chapper &#224; l&#8217;imp&#244;t.</p><p style=\"text-align: justify;\">Il est donc propos&#233; d&#8217;&#233;tendre le champ d&#8217;application de l&#8217;article L.&#160;16 du livre des proc&#233;dures fiscales (LPF), qui permet &#224; l&#8217;administration de formuler des demandes d&#8217;information contraignantes, aux plus-values de cession d&#8217;actifs num&#233;riques, &#224; l&#8217;instar de ce qui est d&#233;j&#224; pr&#233;vu pour les plus-values de cessions de biens immeubles, meubles ou de droits sociaux.</p><p style=\"text-align: justify;\">Ainsi, l&#8217;administration fiscale sera en mesure d&#8217;exercer pleinement son pouvoir de contr&#244;le en mati&#232;re de plus-values d&#8217;actifs num&#233;riques, ce qui constitue une contrepartie &#233;quilibr&#233;e &#224; l&#8217;all&#232;gement de la charge d&#233;clarative des contribuables.</p><p style=\"text-align: justify;\">&#160;</p><p style=\"text-align: justify;\">&#160;</p><p style=\"text-align: justify;\">&#160;</p>",
    "cartoucheDelaiDepotDepasse": "Sous réserve de son traitement par les services de l'Assemblée nationale et de sa recevabilité"
  },
  "representations": [
    {
      "nom": "PDF",
      "typeMime": {
        "type": "application",
        "subType": "PDF"
      },
      "statutRepresentation": {
        "verbatim": true,
        "canonique": true,
        "officielle": true,
        "transcription": false,
        "enregistrement": false
      },
      "contenu": {
        "documentURI": "/15/amendements/2272C/AN/2583.pdf"
      }
    }
  ],
  "seanceDiscussion": "RUANR5L15S2020IDS21921",
  "sort": {
    "dateSaisie": "2019-11-14T11:35:44.000+01:00",
    "sortEnSeance": "Adopté"
  },
  "dateDepot": "2019-11-08T01:00:00.000+01:00",
  "dateDistribution": "2019-11-14T01:00:00.000+01:00",
  "article99": "0",
  "loiReference": {
    "codeLoi": "livre procédures fiscales",
    "divisionCodeLoi": "L16"
  }
}