{
  "uid": "AMANR5L15SEA717460BTA0303P0D1N90",
  "identifiant": {
    "legislature": "15",
    "numero": "90",
    "numRect": "0",
    "saisine": {
      "texteLegislatifRef": "PRJLANR5L15BTA0303",
      "numeroPartiePLF": "0",
      "organeExamen": "PO717460",
      "mentionSecondeDeliberation": "0"
    }
  },
  "numeroLong": "90",
  "etapeTexte": "Lecture définitive",
  "triAmendement": "bcaaaaaaaaaaaaaaaaaaaaaaaaaaaaaaaaaaaaaaaaaaaaaaaaopnzx",
  "cardinaliteAmdtMultiples": "1",
  "etat": "Discuté",
  "signataires": {
    "auteur": {
      "typeAuteur": "Depute",
      "acteurRef": "PA267429",
      "groupePolitiqueRef": "PO730934"
    },
    "cosignatairesRefs": [
      "PA267429"
    ],
    "texteAffichable": "M.&#160;Cinieri"
  },
  "pointeurFragmentTexte": {
    "division": {
      "titre": "Article 2",
      "articleDesignationCourte": "ART. 2",
      "type": "ARTICLE",
      "avantAApres": "A",
      "divisionRattachee": "ARTICLE 2",
      "urlDivisionTexteVise": "/15/textes/TA0303.asp#D_Article_2"
    },
    "alinea": {
      "numero": "2"
    }
  },
  "corps": {
    "dispositif": "<p style=\"text-align: justify;\">Alin&#233;a 2</p><p>Compl&#233;ter cet alin&#233;a par les mots et deux phrases ainsi r&#233;dig&#233;es :</p><p>, conform&#233;ment aux principes mentionn&#233;s dans la Charte internationale sur la conservation et la restauration des monuments et des sites adopt&#233;e &#224; Venise en 1964. Ils respectent l'authenticit&#233; et l'int&#233;grit&#233; du monument attach&#233;es &#224; sa valeur universelle exceptionnelle d&#233;coulant de son inscription sur la liste du patrimoine mondial en tant qu'&#233;l&#233;ment du bien \"Paris, rives de la Seine\", en application de la convention concernant la protection du patrimoine mondial, culturel et naturel, adopt&#233;e par la Conf&#233;rence g&#233;n&#233;rale de l'Organisation des Nations unies pour l'&#233;ducation, la science et la culture, le 16 novembre 1972, lors de sa XVIIe session. Ils restituent le monument dans le dernier &#233;tat visuel connu avant le sinistre.</p>",
    "exposeSommaire": "<p style=\"text-align: justify;\">Cet amendement vise &#224; r&#233;tablir la r&#233;daction adopt&#233;e par les s&#233;nateurs pour garantir une reconstruction dans le dernier &#233;tat visuel connu de Notre-Dame de Paris.</p>"
  },
  "representations": [
    {
      "nom": "PDF",
      "typeMime": {
        "type": "application",
        "subType": "PDF"
      },
      "statutRepresentation": {
        "verbatim": true,
        "canonique": true,
        "officielle": true,
        "transcription": false,
        "enregistrement": false
      },
      "contenu": {
        "documentURI": "/15/amendements/TA0303/AN/90.pdf"
      }
    }
  ],
  "sort": {
    "dateSaisie": "2019-07-16T17:59:24.000+02:00",
    "sortEnSeance": "Rejeté"
  },
  "dateDepot": "2019-07-16T02:00:00.000+02:00",
  "dateDistribution": "2019-07-16T02:00:00.000+02:00",
  "article99": "0",
  "loiReference": {}
}