{
  "uid": "AMANR5L15PO420120B1681P0D1N1628",
  "identifiant": {
    "legislature": "15",
    "numero": "1628",
    "numRect": "0",
    "saisine": {
      "texteLegislatifRef": "PRJLANR5L15B1681",
      "numeroPartiePLF": "0",
      "organeExamen": "PO420120",
      "mentionSecondeDeliberation": "0"
    }
  },
  "numeroLong": "AS1628",
  "etapeTexte": "1ère lecture (1ère assemblée saisie)",
  "triAmendement": "ecaaaaaaaaaaaaaaaaaaaaaaaaaaaaaaaaaaaaaaaaaaaaaaaaskt",
  "cardinaliteAmdtMultiples": "1",
  "etat": "Discuté",
  "signataires": {
    "auteur": {
      "typeAuteur": "Depute",
      "acteurRef": "PA719072",
      "groupePolitiqueRef": "PO730964"
    },
    "cosignatairesRefs": [
      "PA719072"
    ],
    "texteAffichable": "M.&#160;Mesnier, rapporteur"
  },
  "pointeurFragmentTexte": {
    "division": {
      "titre": "Article 12",
      "articleDesignationCourte": "ART. 12",
      "type": "ARTICLE",
      "avantAApres": "A",
      "divisionRattachee": "ARTICLE 12",
      "urlDivisionTexteVise": "/15/textes/1681.asp#D_Article_12"
    },
    "alinea": {
      "numero": "22"
    }
  },
  "corps": {
    "dispositif": "<p>Apr&#232;s le mot&#160;:</p><p style=\"text-align: justify;\">&#171;&#160;conditions&#160;&#187;</p><p style=\"text-align: justify;\">r&#233;diger ainsi la fin de l&#8217;alin&#233;a&#160;22&#160;:</p><p style=\"text-align: justify;\">&#171;&#160;et modalit&#233;s d&#8217;application de cet article sont d&#233;finies par d&#233;cret en Conseil d&#8217;&#201;tat, pris apr&#232;s avis de la Commission nationale de l&#8217;informatique et des libert&#233;s.&#160;&#187;</p>",
    "exposeSommaire": "<p>Cet amendement impose la consultation de la CNIL dans l&#8217;&#233;laboration du d&#233;cret en Conseil d&#8217;&#201;tat d&#233;taillant les modalit&#233;s de la conception de l&#8217;espace num&#233;rique de sant&#233;.</p>"
  },
  "representations": [
    {
      "nom": "PDF",
      "typeMime": {
        "type": "application",
        "subType": "PDF"
      },
      "statutRepresentation": {
        "verbatim": true,
        "canonique": true,
        "officielle": true,
        "transcription": false,
        "enregistrement": false
      },
      "contenu": {
        "documentURI": "/15/amendements/1681/CION-SOC/AS1628.pdf"
      }
    }
  ],
  "sort": {
    "dateSaisie": "2019-03-14T11:09:28.000+01:00",
    "sortEnSeance": "Adopté"
  },
  "dateDepot": "2019-03-12T01:00:00.000+01:00",
  "dateDistribution": "2019-03-12T01:00:00.000+01:00",
  "article99": "0",
  "loiReference": {}
}