{
  "uid": "AMANR5L15SEA717460B0911P0D1N1151",
  "identifiant": {
    "legislature": "15",
    "numero": "1151",
    "numRect": "0",
    "saisine": {
      "texteLegislatifRef": "PRJLANR5L15B0911",
      "numeroPartiePLF": "0",
      "organeExamen": "PO717460",
      "mentionSecondeDeliberation": "0"
    }
  },
  "numeroLong": "1151",
  "etapeTexte": "1ère lecture (1ère assemblée saisie)",
  "triAmendement": "aorts",
  "cardinaliteAmdtMultiples": "1",
  "etat": "Discuté",
  "signataires": {
    "auteur": {
      "typeAuteur": "Depute",
      "acteurRef": "PA720468",
      "groupePolitiqueRef": "PO723569"
    },
    "cosignatairesRefs": [
      "PA720606",
      "PA720798",
      "PA606212",
      "PA720822",
      "PA720468",
      "PA720614"
    ],
    "texteAffichable": "M.&#160;Chenu,  M.&#160;Aliot, M.&#160;Bilde, M.&#160;Collard, Mme&#160;Le Pen et M.&#160;Pajot"
  },
  "pointeurFragmentTexte": {
    "division": {
      "titre": "Article PREMIER",
      "articleDesignationCourte": "AVANT ART. PREMIER",
      "type": "ARTICLE",
      "avantAApres": "Avant",
      "divisionRattachee": "AVANT L'ARTICLE PREMIER, insérer l'article suivant:",
      "articleAdditionnel": "1",
      "urlDivisionTexteVise": "/15/textes/0911.asp#D_Article_1er"
    }
  },
  "corps": {
    "dispositif": "<p style=\"text-align: justify;\">La Constitution est ainsi modifi&#233;e&#160;:</p><p style=\"text-align: justify;\">1&#176;&#160;L&#8217;article&#160;10 est compl&#233;t&#233; par un alin&#233;a ainsi r&#233;dig&#233;&#160;:</p><p style=\"text-align: justify;\">&#171;&#160;Il peut &#233;galement, dans le m&#234;me d&#233;lai, d&#233;cider de soumettre pour approbation au r&#233;f&#233;rendum la loi ou certains de ses articles, dans les conditions pr&#233;vues aux deuxi&#232;me et troisi&#232;me alin&#233;as de l&#8217;article&#160;11&#160;;</p><p style=\"text-align: justify;\">2&#176;&#160;L&#8217;article&#160;11 est ainsi r&#233;dig&#233;&#160;:</p><p style=\"text-align: justify;\">&#171;&#160;Le Pr&#233;sident de la R&#233;publique peut soumettre au r&#233;f&#233;rendum toute question portant sur des orientations importantes pour la vie de la Nation.</p><p style=\"text-align: justify;\">&#171;&#160;Le Pr&#233;sident de la R&#233;publique, sur proposition du Gouvernement pendant la dur&#233;e des sessions ou sur proposition de l&#8217;Assembl&#233;e nationale ou du S&#233;nat, peut soumettre au r&#233;f&#233;rendum toute loi en instance de promulgation, tout projet ou proposition de loi, ou certaines de leurs dispositions.</p><p style=\"text-align: justify;\">&#171;&#160;Une demande de r&#233;f&#233;rendum portant sur un objet mentionn&#233; &#224; l&#8217;alin&#233;a pr&#233;c&#233;dent peut &#233;galement &#234;tre pr&#233;sent&#233;e par une fraction des &#233;lecteurs inscrits ou par des titulaires de fonctions ou de mandats &#233;lectifs, dont le nombre est d&#233;termin&#233; par une loi organique.</p><p style=\"text-align: justify;\">&#171;&#160;Lorsque le r&#233;f&#233;rendum est organis&#233; sur proposition du Gouvernement, celui-ci fait, devant chaque assembl&#233;e, une d&#233;claration qui est suivie d&#8217;un d&#233;bat.</p><p style=\"text-align: justify;\">&#171;&#160;Lorsque le r&#233;f&#233;rendum a conclu &#224; l&#8217;adoption du projet ou de la proposition de loi ou &#224; l&#8217;approbation de la loi en instance de promulgation, le Pr&#233;sident de la R&#233;publique le promulgue dans les quinze jours qui suivent la proclamation des r&#233;sultats du scrutin.</p><p style=\"text-align: justify;\">&#171;&#160;Une loi organique d&#233;termine les modalit&#233;s d&#8217;application du pr&#233;sent article.&#160;&#187;&#160;;</p><p style=\"text-align: justify;\">3&#176; Apr&#232;s l&#8217;avant-dernier alin&#233;a de l&#8217;article&#160;34, il est ins&#233;r&#233; un alin&#233;a ainsi r&#233;dig&#233;&#160;:</p><p style=\"text-align: justify;\">&#171;&#160;La loi peut d&#233;cider de soumettre au r&#233;f&#233;rendum toute question portant sur des orientations importantes pour la vie de la Nation.&#160;&#187;&#160;;</p><p style=\"text-align: justify;\">4&#176;&#160;Le titre XV est compl&#233;t&#233; par un article&#160;88&#8209;8 ainsi r&#233;dig&#233;&#160;:</p><p style=\"text-align: justify;\">&#171;&#160;<i>Art.&#160;88&#8209;8</i>.&#160;&#8211;&#160;Le Pr&#233;sident de la R&#233;publique peut, de sa propre initiative, soumettre au r&#233;f&#233;rendum tout avant-projet de trait&#233; relatif &#224; l&#8217;Union&#160;europ&#233;enne ou toute orientation de la politique de la Nation au sein de l&#8217;Union&#160;europ&#233;enne.</p><p style=\"text-align: justify;\">&#171;&#160;Il peut &#233;galement, dans les conditions pr&#233;vues aux deuxi&#232;me et troisi&#232;me alin&#233;as de l&#8217;article&#160;11, soumettre au r&#233;f&#233;rendum tout projet ou proposition d&#8217;acte de l&#8217;Union&#160;europ&#233;enne.</p><p style=\"text-align: justify;\">&#171;&#160;Les modalit&#233;s d&#8217;application du pr&#233;sent article sont fix&#233;es par une loi organique.&#160;&#187;</p>",
    "exposeSommaire": "<p style=\"text-align: justify;\">Cet amendement a pour but d&#8217;ouvrir les possibilit&#233;s pour recourir au r&#233;f&#233;rendum. Il vise &#224; rendre la voix au peuple fran&#231;ais, en ce qui concerne l&#8217;orientation de la vie de la Nation, tant au niveau national qu&#8217;europ&#233;en. Il est primordial que le peuple puisse s&#8217;exprimer sur des mesures qui auront pour effet d&#8217;affecter leur vie au quotidien et de fa&#231;on durable. Rendons ici&#160;&#224; l&#8217;ensemble du peuple, sa souverainet&#233;. Qu&#8217;il puisse se saisir pleinement de ce qui lui revient de droit et ma&#238;triser son destin.</p>"
  },
  "representations": [
    {
      "nom": "PDF",
      "typeMime": {
        "type": "application",
        "subType": "PDF"
      },
      "statutRepresentation": {
        "verbatim": true,
        "canonique": true,
        "officielle": true,
        "transcription": false,
        "enregistrement": false
      },
      "contenu": {
        "documentURI": "/15/amendements/0911/AN/1151.pdf"
      }
    }
  ],
  "seanceDiscussion": "RUANR5L15S2018IDS21167",
  "sort": {
    "dateSaisie": "2018-07-16T18:46:17.000+02:00",
    "sortEnSeance": "Rejeté"
  },
  "dateDepot": "2018-07-05T02:00:00.000+02:00",
  "dateDistribution": "2018-07-09T02:00:00.000+02:00",
  "article99": "0",
  "loiReference": {
    "codeLoi": "Constitution",
    "divisionCodeLoi": "10"
  }
}