{
  "uid": "AMANR5L15PO766718B2187P0D1N1557",
  "identifiant": {
    "legislature": "15",
    "numero": "1557",
    "numRect": "0",
    "saisine": {
      "texteLegislatifRef": "PRJLANR5L15B2187",
      "numeroPartiePLF": "0",
      "organeExamen": "PO766718",
      "mentionSecondeDeliberation": "0"
    }
  },
  "numeroLong": "1557",
  "etapeTexte": "1ère lecture (1ère assemblée saisie)",
  "triAmendement": "acaaaaaaaaaaaaaaaaaaaaaaaaaaaaaaaaaaaaaaaaaaaaaaaazzoqu",
  "cardinaliteAmdtMultiples": "1",
  "etat": "Discuté",
  "signataires": {
    "auteur": {
      "typeAuteur": "Depute",
      "acteurRef": "PA722284",
      "groupePolitiqueRef": "PO730970"
    },
    "cosignatairesRefs": [
      "PA720326",
      "PA722284"
    ],
    "texteAffichable": "M.&#160;Fuchs et M.&#160;Hammouche"
  },
  "pointeurFragmentTexte": {
    "division": {
      "titre": "Article PREMIER",
      "articleDesignationCourte": "ART. PREMIER",
      "type": "ARTICLE",
      "avantAApres": "A",
      "divisionRattachee": "ARTICLE PREMIER",
      "urlDivisionTexteVise": "/15/textes/2187.asp#D_Article_1er"
    },
    "alinea": {
      "numero": "28"
    }
  },
  "corps": {
    "dispositif": "<p style=\"text-align: justify;\">&#192; l&#8217;alin&#233;a 28, supprimer les mots:</p><p>&#171; et psychologique &#187;</p><p>&#160;</p>",
    "exposeSommaire": "<p>Il est d&#233;j&#224; pr&#233;vu dans les textes la v&#233;rification de la motivation. Il est superflu de rajouter une &#233;valuation psychologique obligatoire, source de d&#233;lai, d&#8217;inqui&#233;tude et d&#8217;&#233;ventuelles discriminations qui engendre un fort sentiment de stigmatisation pour les personnes ayant recours &#224; une AMP.</p><p>Cette &#233;valuation resterait possible, notamment en cas de doute sur la motivation, mais rel&#232;verait de la d&#233;cision des professionnels du centre d&#8217;AMP et non d&#8217;une obligation l&#233;gislative.</p><p>Un accompagnement psychosocial pendant le parcours d&#8217;AMP devrait cependant &#234;tre syst&#233;matiquement propos&#233; pour que les personnes puissent &#234;tre soutenues et se sentir libres de faire part de leurs interrogations, doutes et inqui&#233;tudes.</p>"
  },
  "representations": [
    {
      "nom": "PDF",
      "typeMime": {
        "type": "application",
        "subType": "PDF"
      },
      "statutRepresentation": {
        "verbatim": true,
        "canonique": true,
        "officielle": true,
        "transcription": false,
        "enregistrement": false
      },
      "contenu": {
        "documentURI": "/15/amendements/2187/CSBIOETH/1557.pdf"
      }
    }
  ],
  "sort": {
    "dateSaisie": "2019-09-11T18:42:19.000+02:00",
    "sortEnSeance": "Adopté"
  },
  "dateDepot": "2019-09-05T02:00:00.000+02:00",
  "dateDistribution": "2019-09-09T02:00:00.000+02:00",
  "article99": "0",
  "loiReference": {}
}