{
  "uid": "AMANR5L15SEA717460B0235P2D1N1695",
  "identifiant": {
    "legislature": "15",
    "numero": "1695",
    "numRect": "0",
    "saisine": {
      "texteLegislatifRef": "PRJLANR5L15B0235",
      "numeroPartiePLF": "2",
      "organeExamen": "PO717460",
      "mentionSecondeDeliberation": "0"
    }
  },
  "numeroLong": "II-1695",
  "etapeTexte": "1ère lecture (1ère assemblée saisie)",
  "triAmendement": "azrhzzzyki",
  "cardinaliteAmdtMultiples": "1",
  "etat": "Discuté",
  "signataires": {
    "auteur": {
      "typeAuteur": "Depute",
      "acteurRef": "PA721984",
      "groupePolitiqueRef": "PO730970"
    },
    "cosignatairesRefs": [
      "PA719918",
      "PA720652",
      "PA722374",
      "PA721976",
      "PA721530",
      "PA720256",
      "PA720704",
      "PA720334",
      "PA720968",
      "PA717151",
      "PA721734",
      "PA720772",
      "PA719640",
      "PA718978",
      "PA720178",
      "PA720162",
      "PA720092",
      "PA1276",
      "PA721836",
      "PA721418",
      "PA721608",
      "PA720746",
      "PA721984",
      "PA610733",
      "PA720002",
      "PA719044",
      "PA722284",
      "PA720764",
      "PA720326",
      "PA720720",
      "PA720598",
      "PA720924",
      "PA721742",
      "PA719874",
      "PA719266",
      "PA722162",
      "PA721992",
      "PA721234",
      "PA719938",
      "PA719210",
      "PA719488",
      "PA721924",
      "PA719558",
      "PA720976",
      "PA720728",
      "PA721182"
    ],
    "texteAffichable": "M.&#160;Latombe,  M.&#160;Mignola, M.&#160;Barrot, M.&#160;Bourlanges, Mme&#160;El Ha&#239;ry, M.&#160;Laqhila, M.&#160;Mattei, M.&#160;Balanant, Mme&#160;Bannier, Mme&#160;Benin, M.&#160;Berta, M.&#160;Bolo, M.&#160;Bru, M.&#160;Cubertafon, Mme&#160;de Sarnez, Mme&#160;de Vaucouleurs, Mme&#160;Deprez-Audebert, M.&#160;Duverg&#233;, Mme&#160;Elimas, Mme&#160;Essayan, M.&#160;Fanget, M.&#160;Fesneau, Mme&#160;Florennes, M.&#160;Fuchs, Mme&#160;Gallerneau, M.&#160;Garcia, M.&#160;Hammouche, M.&#160;Isaac-Sibille, Mme&#160;Jacquier-Laforge, M.&#160;Joncour, M.&#160;Lain&#233;, Mme&#160;Lasserre-David, Mme&#160;Luquet, M.&#160;Mathiasin, Mme&#160;Mette, M.&#160;Michel-Kleisbauer, M.&#160;Millienne, M.&#160;Pahun, M.&#160;Fr&#233;d&#233;ric&#160;Petit, Mme&#160;Maud&#160;Petit, Mme&#160;Poueyto, M.&#160;Ramos, M.&#160;Thierry&#160;Robert, M.&#160;Turquois, Mme&#160;Vichnievsky et M.&#160;Waserman"
  },
  "pointeurFragmentTexte": {
    "division": {
      "titre": "Article 39",
      "articleDesignationCourte": "APRÈS ART. 39",
      "type": "ARTICLE",
      "avantAApres": "Apres",
      "divisionRattachee": "APRÈS L'ARTICLE 39, insérer l'article suivant:",
      "articleAdditionnel": "1",
      "urlDivisionTexteVise": "/15/textes/0235C.asp#D_Article_39"
    }
  },
  "corps": {
    "dispositif": "<p style=\"text-align: justify;\">I.&#160;&#8211;&#160;L&#8217;article&#160;199<i> sexvicies</i> du code g&#233;n&#233;ral des imp&#244;ts est ainsi modifi&#233;&#160;:</p><p style=\"text-align: justify;\">1&#176; Au premier alin&#233;a, l&#8217;ann&#233;e&#160;: &#171;&#160;2017&#160;&#187; est remplac&#233;e par l&#8217;ann&#233;e&#160;: &#171;&#160;2021&#160;&#187;.</p><p style=\"text-align: justify;\">2&#176; Apr&#232;s l&#8217;ann&#233;e&#160;: &#171;&#160;2011&#160;&#187;,&#160;la fin du septi&#232;me alin&#233;a est ainsi r&#233;dig&#233;e&#160;: &#171;&#160;8&#160;% pour ceux acquis &#224; compter de 2018.&#160;&#187;</p><p style=\"text-align: justify;\">3&#176; Le huiti&#232;me alin&#233;a est ainsi r&#233;dig&#233;&#160;:</p><p style=\"text-align: justify;\"><i>a)</i> &#192; la premi&#232;re phrase, l&#8217;ann&#233;e&#160;: &#171;&#160;2012&#160;&#187; est remplac&#233;e par l&#8217;ann&#233;e&#160;: &#171;&#160;2018&#160;&#187;, le taux&#160;: &#171;&#160;18&#160;%&#160;&#187; est remplac&#233; par le taux&#160;: &#171;&#160;11&#160;%&#160;&#187; et l&#8217;ann&#233;e&#160;: &#171;&#160;2011&#160;&#187; est remplac&#233;e par l&#8217;ann&#233;e&#160;: &#171;&#160;2017&#160;&#187;.</p><p style=\"text-align: justify;\"><i>b)</i> &#192; la seconde phrase, l&#8217;ann&#233;e&#160;: &#171;&#160;2011&#160;&#187; est remplac&#233;e par l&#8217;ann&#233;e&#160;: &#171;&#160;2017&#160;&#187; et l&#8217;ann&#233;e &#171;&#160;2012&#160;&#187; par l&#8217;ann&#233;e&#160;: &#171;&#160;2018&#160;&#187;.</p><p style=\"text-align: justify;\">&#160;4&#176; Le II est compl&#233;t&#233; par un alin&#233;a ainsi r&#233;dig&#233;&#160;:</p><p style=\"text-align: justify;\">&#171;&#160;Les dispositions de l&#8217;article&#160;39 G ne sont pas applicables aux acquisitions de logements vis&#233;s au I qui b&#233;n&#233;ficient du taux de r&#233;duction d&#8217;imp&#244;t de 8&#160;%&#160;&#187;.</p><p style=\"text-align: justify;\">II.&#160;&#8211;&#160;La perte de recettes pour l&#8217;&#201;tat r&#233;sultant du pr&#233;sent I est compens&#233;e &#224; due concurrence par la cr&#233;ation d&#8217;une taxe additionnelle aux droits pr&#233;vus aux articles 575 et 575 A du code g&#233;n&#233;ral des imp&#244;ts.</p>",
    "exposeSommaire": "<p style=\"text-align: justify;\">Le projet de loi de finances pour 2018, qui consacre deux articles aux dispositifs Pinel et PTZ, ne contient toutefois aucune disposition sur le dispositif commun&#233;ment d&#233;sign&#233; sous le nom de &#171;&#160;Censi-Bouvard&#160;&#187;, lequel arrive &#224; &#233;ch&#233;ance le 31 d&#233;cembre 2017.</p><p style=\"text-align: justify;\">Le dispositif Censi-Bouvard s&#8217;applique aux personnes physiques loueurs en meubl&#233; non professionnels, qui ont acquis jusqu&#8217;au 31 d&#233;cembre 2016 un logement neuf ou r&#233;habilit&#233; en vue de sa location meubl&#233;e. Le logement doit &#234;tre situ&#233; dans des &#233;tablissements sociaux ou m&#233;dico-sociaux accueillant des personnes &#226;g&#233;es ou handicap&#233;es, des &#233;tablissements de soin de longue dur&#233;e pour personnes en perte d&#8217;autonomie, des r&#233;sidences avec services pour personnes &#226;g&#233;es ou handicap&#233;es, des r&#233;sidences pour &#233;tudiants ou encore des r&#233;sidences de tourisme class&#233;es.</p><p style=\"text-align: justify;\">Ce m&#233;canisme pr&#233;voit une r&#233;duction d&#8217;imp&#244;t correspondant &#224; 11&#160;% de l&#8217;investissement (plafonn&#233; &#224; 300 000&#160;&#8364; HT), sur 9 ans.</p><p style=\"text-align: justify;\">Cette r&#233;duction d&#8217;imp&#244;t permet ainsi d&#8217;encourager l&#8217;investissement des particuliers dans les domaines des r&#233;sidences pour &#233;tudiants, des r&#233;sidences pour s&#233;niors et des r&#233;sidences pour personnes &#226;g&#233;es d&#233;pendantes &#224; travers une r&#233;duction d&#8217;imp&#244;t.</p><p style=\"text-align: justify;\">A l&#8217;heure o&#249; le Gouvernement pr&#233;voit un grand plan de 80 000 logements pour les jeunes (60 000 logements pour les &#233;tudiants et 20 000 logements pour les jeunes actifs) sur 5 ans et o&#249; les besoins en logements pour les s&#233;niors restent importants, l&#8217;arr&#234;t du dispositif est contreproductif. Cette r&#233;duction d&#8217;imp&#244;t r&#233;pond effectivement &#224; des enjeux soci&#233;taux forts dans les domaines de l&#8217;h&#233;bergement des &#233;tudiants et des personnes &#226;g&#233;es, pr&#233;occupations essentielles du Gouvernement. Si elle venait &#224; s&#8217;&#233;teindre au 31 d&#233;cembre 2017, le d&#233;veloppement des r&#233;sidences vis&#233;es ci-dessus s&#8217;en trouverait consid&#233;rablement ralenti voir arr&#234;t&#233;.</p><p style=\"text-align: justify;\">En effet, dans le cadre du dispositif &#171;&#160;Pinel&#160;&#187;, les particuliers b&#233;n&#233;ficieraient d&#8217;un avantage fiscal significatif pour investir dans l&#8217;immobilier locatif classique (r&#233;duction d&#8217;imp&#244;t jusqu&#8217;&#224; 21&#160;%) et &#224; contrario concernant les r&#233;sidences g&#233;r&#233;es, ils seraient renvoy&#233;s vers le r&#233;gime g&#233;n&#233;ral de la location meubl&#233;e sans aucune r&#233;duction fiscale possible. Cette situation cr&#233;erait une importante distorsion de march&#233; d&#233;tournant ainsi les investisseurs des r&#233;sidences pour &#233;tudiants et personnes &#226;g&#233;es.</p><p style=\"text-align: justify;\">Le pr&#233;sent amendement propose donc de proroger pour quatre ans le dispositif Censi-Bouvard, &#224; l&#8217;instar du PTZ et du dispositif Pinel, jusqu&#8217;au 31 d&#233;cembre 2021, &#224; un taux r&#233;duit de r&#233;duction d&#8217;imp&#244;t de 8&#160;% de l&#8217;investissement (plafonn&#233; &#224; 300 000&#160;&#8364; HT), sur 9 ans et de permettre aux contribuables de b&#233;n&#233;ficier de la d&#233;duction fiscale des amortissements comptabilis&#233;s selon les r&#232;gles g&#233;n&#233;rales applicables au secteur de la location meubl&#233;e.</p><p style=\"text-align: justify;\">Ce taux r&#233;duit est un &#233;quilibre entre relance de l&#8217;&#233;conomie, justice sociale et &#233;quilibre budg&#233;taire.</p>"
  },
  "representations": [
    {
      "nom": "PDF",
      "typeMime": {
        "type": "application",
        "subType": "PDF"
      },
      "statutRepresentation": {
        "verbatim": true,
        "canonique": true,
        "officielle": true,
        "transcription": false,
        "enregistrement": false
      },
      "contenu": {
        "documentURI": "/15/amendements/0235C/AN/1695.pdf"
      }
    }
  ],
  "seanceDiscussion": "RUANR5L15S2018IDS20766",
  "sort": {
    "dateSaisie": "2017-11-17T19:46:07.000+01:00",
    "sortEnSeance": "Retiré"
  },
  "dateDepot": "2017-11-13T01:00:00.000+01:00",
  "dateDistribution": "2017-11-15T01:00:00.000+01:00",
  "article99": "0",
  "loiReference": {
    "codeLoi": "CGI",
    "divisionCodeLoi": "199 sexvicies"
  }
}