{
  "uid": "AMANR5L15SEA717460B2272P2D1N1388",
  "identifiant": {
    "legislature": "15",
    "numero": "1388",
    "numRect": "0",
    "saisine": {
      "texteLegislatifRef": "PRJLANR5L15B2272",
      "numeroPartiePLF": "2",
      "organeExamen": "PO717460",
      "mentionSecondeDeliberation": "0"
    }
  },
  "numeroLong": "II-1388",
  "etapeTexte": "1ère lecture (1ère assemblée saisie)",
  "triAmendement": "bbeoaaaaaaaaaaaaaaaaaaaaaaaaaaaaaaaaaaaaaaaaaaaaaavz",
  "cardinaliteAmdtMultiples": "1",
  "etat": "Discuté",
  "signataires": {
    "auteur": {
      "typeAuteur": "Depute",
      "acteurRef": "PA721486",
      "groupePolitiqueRef": "PO767217"
    },
    "cosignatairesRefs": [
      "PA267355",
      "PA610775",
      "PA332228",
      "PA267780",
      "PA266788",
      "PA642868",
      "PA720230",
      "PA267241",
      "PA720696",
      "PA712014",
      "PA721486",
      "PA721632",
      "PA267330",
      "PA331567",
      "PA695100",
      "PA721110",
      "PA268019",
      "PA267585",
      "PA719806",
      "PA721094"
    ],
    "texteAffichable": "M.&#160;Naegelen,  M.&#160;Benoit, M.&#160;Christophe, Mme&#160;de La Raudi&#232;re, M.&#160;Demilly, Mme&#160;Auconie, Mme&#160;Descamps, M.&#160;Dunoyer, Mme&#160;Firmin Le Bodo, M.&#160;Gom&#232;s, M.&#160;Meyer&#160;Habib, M.&#160;Herth, M.&#160;Lagarde, M.&#160;Ledoux, Mme&#160;Lemoine, Mme&#160;Magnier, M.&#160;Morel-&#192;-L&apos;Huissier, Mme&#160;Sanquer, M.&#160;Vercamer et M.&#160;Zumkeller"
  },
  "pointeurFragmentTexte": {
    "missionVisee": {
      "idMissionAN": "826",
      "libelleMission": "Sécurités",
      "codeMissionPLF": "B",
      "libelleMissionPLF": "Répartition, par mission et programme, des crédits du budget général"
    },
    "division": {
      "titre": "ÉTAT B",
      "articleDesignationCourte": "ART. 38",
      "type": "ANNEXE",
      "avantAApres": "A",
      "divisionRattachee": "ARTICLE 38",
      "urlDivisionTexteVise": "/15/textes/2272C.asp#D_ETAT_B"
    }
  },
  "corps": {
    "exposeSommaire": "<p style=\"text-align: justify;\">Cet amendement est issu des propositions du rapport n&#176;&#160;2111 &#171;&#160;Forces de s&#233;curit&#233; int&#233;rieure&#160;: face &#224; une situation d&#233;grad&#233;e, des moyens &#224; renforcer, des missions &#224; red&#233;finir&#160;&#187; de Christophe Naegelen sous la pr&#233;sidence de Jean-Michel Fauvergue.</p><p style=\"text-align: justify;\">Les V&#233;hicules Blind&#233;s &#224; Roues de la Gendarmerie (VBRG), sont r&#233;guli&#232;rement utilis&#233;s pour des op&#233;rations de maintien et de r&#233;tablissement de l&#8217;ordre. Pourtant, leur &#233;tat de fonctionnement est &#224; d&#233;plorer puisqu&#8217;ils affichent plus de 40 ans de service. Leur renouvellement est n&#233;cessaire mais repr&#233;sentent un r&#233;el d&#233;fi. En effet, ces types de v&#233;hicules sont indispensables pour la protection des gendarmes, afin qu&#8217;ils ne soient pas expos&#233;s &#224; des tirs d&#8217;armes. Pourtant, ce type de v&#233;hicule blind&#233; dot&#233; d&#8217;une lame &#224; l&#8217;avant, qui suppose un moteur &#224; l&#8217;arri&#232;re, ne se trouve plus sur le march&#233;. La direction g&#233;n&#233;rale de la gendarmerie nationale appelle &#224; un renouvellement de cette flotte de VBRG. L&#8217;objectif serait de disposer de 80 v&#233;hicules blind&#233;s r&#233;am&#233;nag&#233;s, dont 36 v&#233;hicules en outre-mer.</p><p style=\"text-align: justify;\">Le r&#233;am&#233;nagement des VBRG appelle &#224; un investissement estim&#233; au minimum &#224; 40 millions d&#8217;euros. En l&#8217;&#233;tat, la mission ne pr&#233;voit que 7 millions de d&#233;penses d&#8217;investissement dans le renouvellement de ces v&#233;hicules, ce qui parait insuffisant.</p><p style=\"text-align: justify;\">&#160;</p><p style=\"text-align: justify;\">L&#8217;amendement propose d&#8217;attribuer 40 millions d&#8217;euros de cr&#233;dits suppl&#233;mentaires vers l&#8217;action 4 &#171;&#160;&#171;&#160;Commandement, ressources humaines et logistiques&#160;&#187; du programme 152 &#171;&#160;Gendarmerie nationale&#160;&#187; pour le renouvellement de la flotte de VBRG.</p><p style=\"text-align: justify;\">Il r&#233;duit en cons&#233;quence d&#8217;autant les cr&#233;dits de l&#8217;action 13&#160;&#171;&#160;Soutien aux acteurs de la s&#233;curit&#233; civile&#160;&#187; au sein du programme 161 &#171;&#160;S&#233;curit&#233; civile&#160;&#187;.&#160;Cette r&#233;duction a pour but de se conformer aux exigences de la loi organique relative aux lois de finances (LOLF) qui oblige, lorsque l&#8217;auteur d&#8217;un amendement souhaite augmenter les cr&#233;dits d&#8217;un programme, &#224; diminuer les cr&#233;dits d&#8217;un autre programme d&#8217;autant. Il n&#8217;est pas envisag&#233; de restreindre les moyens de la mission &#171;&#160;S&#233;curit&#233; civile&#160;&#187;.</p>",
    "dispositifAmdtCredit": {
      "listeProgrammes": [
        {
          "libelle": "Police nationale",
          "id": "97553",
          "AE": {
            "montantPositif": "0",
            "montantNegatif": "0"
          },
          "CP": {
            "montantPositif": "0",
            "montantNegatif": "0"
          },
          "action": "modification"
        },
        {
          "libelle": "Gendarmerie nationale",
          "id": "97554",
          "AE": {
            "montantPositif": "40000000",
            "montantNegatif": "0"
          },
          "CP": {
            "montantPositif": "40000000",
            "montantNegatif": "0"
          },
          "action": "modification"
        },
        {
          "libelle": "Sécurité et éducation routières",
          "id": "97555",
          "AE": {
            "montantPositif": "0",
            "montantNegatif": "0"
          },
          "CP": {
            "montantPositif": "0",
            "montantNegatif": "0"
          },
          "action": "modification"
        },
        {
          "libelle": "Sécurité civile",
          "id": "97556",
          "AE": {
            "montantPositif": "0",
            "montantNegatif": "40000000"
          },
          "CP": {
            "montantPositif": "0",
            "montantNegatif": "40000000"
          },
          "action": "modification"
        }
      ],
      "totalAE": {
        "montantPositif": "40000000",
        "montantNegatif": "40000000",
        "solde": "0"
      },
      "totalCP": {
        "montantPositif": "40000000",
        "montantNegatif": "40000000",
        "solde": "0"
      }
    }
  },
  "representations": [
    {
      "nom": "PDF",
      "typeMime": {
        "type": "application",
        "subType": "PDF"
      },
      "statutRepresentation": {
        "verbatim": true,
        "canonique": true,
        "officielle": true,
        "transcription": false,
        "enregistrement": false
      },
      "contenu": {
        "documentURI": "/15/amendements/2272C/AN/1388.pdf"
      }
    }
  ],
  "seanceDiscussion": "RUANR5L15S2020IDS21903",
  "sort": {
    "dateSaisie": "2019-11-05T22:12:08.000+01:00",
    "sortEnSeance": "Rejeté"
  },
  "dateDepot": "2019-10-31T01:00:00.000+01:00",
  "dateDistribution": "2019-11-05T01:00:00.000+01:00",
  "article99": "0",
  "loiReference": {}
}