{
  "uid": "AMANR5L15SEA717460B2272P1D1N1926",
  "identifiant": {
    "legislature": "15",
    "numero": "1926",
    "numRect": "0",
    "saisine": {
      "texteLegislatifRef": "PRJLANR5L15B2272",
      "numeroPartiePLF": "1",
      "organeExamen": "PO717460",
      "mentionSecondeDeliberation": "0"
    }
  },
  "numeroLong": "I-1926",
  "etapeTexte": "1ère lecture (1ère assemblée saisie)",
  "triAmendement": "blaaaaaaaaaaaaaaaaaaaaaaaaaaaaaaaaaaaaaaaaaaaaaaaahhwzzrzs",
  "cardinaliteAmdtMultiples": "1",
  "etat": "Discuté",
  "signataires": {
    "auteur": {
      "typeAuteur": "Depute",
      "acteurRef": "PA719464",
      "groupePolitiqueRef": "PO723569"
    },
    "cosignatairesRefs": [
      "PA719464"
    ],
    "texteAffichable": "M.&#160;Nadot"
  },
  "pointeurFragmentTexte": {
    "division": {
      "titre": "Article 8",
      "articleDesignationCourte": "ART. 8",
      "type": "ARTICLE",
      "avantAApres": "A",
      "divisionRattachee": "ARTICLE 8",
      "urlDivisionTexteVise": "/15/textes/2272A.asp#D_Article_8"
    },
    "alinea": {
      "numero": "50"
    }
  },
  "corps": {
    "dispositif": "<p style=\"text-align: justify;\">I.&#160;&#8211;&#160;&#192; l&#8217;alin&#233;a&#160;50, substituer aux mots&#160;:</p><p style=\"text-align: justify;\">&#171;&#160;dont les acqu&#233;reurs sont les&#160;&#187;</p><p style=\"text-align: justify;\">les mots&#160;:</p><p style=\"text-align: justify;\">&#171;&#160;destin&#233;s aux&#160;&#187;.</p><p style=\"text-align: justify;\">II.&#160;&#8211;&#160;Compl&#233;ter cet article par l&#8217;alin&#233;a suivant&#160;:</p><p style=\"text-align: justify;\">&#171;&#160;IV.&#160;&#8211;&#160;La perte de recettes pour l&#8217;&#201;tat est compens&#233;e &#224; due concurrence par la cr&#233;ation d&#8217;une taxe additionnelle aux droits mentionn&#233;s aux articles 575 et 575 A du code g&#233;n&#233;ral des imp&#244;ts.&#160;&#187;</p>",
    "exposeSommaire": "<p style=\"text-align: justify;\">Maintenir le taux de TVA r&#233;duit &#224; l&#8217;ensemble des constructions de locaux destin&#233;s &#224; certains &#233;tablissements m&#233;dico-sociaux g&#233;r&#233;s par des organismes sans but lucratif</p><p style=\"text-align: justify;\">L&#8217;article&#160;8 du projet de loi pr&#233;voit le maintien du taux r&#233;duit de 5,5&#160;% pour les constructions de locaux destin&#233;s &#224; certains &#233;tablissements m&#233;dico-sociaux g&#233;r&#233;s par des organismes sans but lucratif (&#233;tablissements d&#8217;h&#233;bergement de personnes &#226;g&#233;es ou handicap&#233;es etc). Il &#233;tend par ailleurs la liste des &#233;tablissements concern&#233;s (centres d&#8217;h&#233;bergement et de r&#233;insertion sociale, lits &#171;&#160;halte soin sant&#233;&#160;&#187;&#8230;).</p><p style=\"text-align: justify;\">Toutefois, la r&#233;daction propos&#233;e modifie les r&#232;gles actuelles en r&#233;servant le b&#233;n&#233;fice de ce taux aux cas dans lesquels l&#8217;exploitant de ces &#233;tablissements est lui-m&#234;me propri&#233;taire des locaux. Or, en pratique, il est tr&#232;s courant que les exploitants de ces &#233;tablissements n&#8217;aient pas la capacit&#233; de financer eux-m&#234;mes leurs locaux et que ceux-ci soient &#171;&#160;port&#233;s&#160;&#187; par un investisseur, en particulier un organisme HLM, qui va ensuite les louer &#224; cet exploitant. En excluant le taux r&#233;duit dans ce type de situation, on va rench&#233;rir le prix de revient des locaux en question, ce qui se traduira par une augmentation du prix de la location consentie &#224; ces exploitants.</p><p style=\"text-align: justify;\">Il est donc propos&#233; de corriger ce probl&#232;me de r&#233;daction en subordonnant le taux r&#233;duit non pas &#224; la qualit&#233; de l&#8217;acqu&#233;reur des locaux mais &#224; leur destination, laquelle est garantie et contr&#244;l&#233;e par une convention sign&#233;e avec le repr&#233;sentant de l&#8217;&#201;tat dans le d&#233;partement.</p><p style=\"text-align: justify;\">&#160;</p>"
  },
  "representations": [
    {
      "nom": "PDF",
      "typeMime": {
        "type": "application",
        "subType": "PDF"
      },
      "statutRepresentation": {
        "verbatim": true,
        "canonique": true,
        "officielle": true,
        "transcription": false,
        "enregistrement": false
      },
      "contenu": {
        "documentURI": "/15/amendements/2272A/AN/1926.pdf"
      }
    }
  ],
  "seanceDiscussion": "RUANR5L15S2020IDS21870",
  "sort": {
    "dateSaisie": "2019-10-18T19:24:52.000+02:00",
    "sortEnSeance": "Non soutenu"
  },
  "dateDepot": "2019-10-10T02:00:00.000+02:00",
  "dateDistribution": "2019-10-16T02:00:00.000+02:00",
  "article99": "0",
  "loiReference": {}
}