{
  "uid": "AMANR5L15SEA717460BTC1237P0D1N2804",
  "identifiant": {
    "legislature": "15",
    "numero": "2804",
    "numRect": "50",
    "saisine": {
      "texteLegislatifRef": "PRJLANR5L15BTC1237",
      "numeroPartiePLF": "0",
      "organeExamen": "PO717460",
      "mentionSecondeDeliberation": "0"
    }
  },
  "numeroLong": "2804 (2ème Rect)",
  "etapeTexte": "1ère lecture (1ère assemblée saisie)",
  "triAmendement": "eaaaaaaaaaaaaaaaaaaaaaaaaaaaaaaaaaaaaaaaaaaaaaaaaaabaaaaaafnzzzi",
  "cardinaliteAmdtMultiples": "1",
  "etat": "Discuté",
  "signataires": {
    "auteur": {
      "typeAuteur": "Depute",
      "acteurRef": "PA719286",
      "groupePolitiqueRef": "PO723569"
    },
    "cosignatairesRefs": [
      "PA719286"
    ],
    "texteAffichable": "M.&#160;Colombani"
  },
  "pointeurFragmentTexte": {
    "division": {
      "titre": "Article 27 septies",
      "articleDesignationCourte": "APRÈS ART. 27 SEPTIES",
      "type": "ARTICLE",
      "avantAApres": "Apres",
      "divisionRattachee": "APRÈS L'ARTICLE 27 SEPTIES, insérer l'article suivant:",
      "articleAdditionnel": "1",
      "urlDivisionTexteVise": "/15/textes/1237.asp#D_Article_27_septies"
    }
  },
  "corps": {
    "dispositif": "<p>&#160;Apr&#232;s le deuxi&#232;me alin&#233;a de l&#8217;article L.&#160;133&#8209;18 du code mon&#233;taire et financier, il est ins&#233;r&#233; un alin&#233;a ainsi r&#233;dig&#233;&#160;:</p><p>&#171;&#160;Si les sommes pr&#233;lev&#233;es ind&#251;ment ne sont pas rembours&#233;es dans les d&#233;lais pr&#233;vus au deuxi&#232;me alin&#233;a, ou que le compte ind&#251;ment d&#233;bit&#233; n&#8217;est pas r&#233;tabli dans son &#233;tat ant&#233;rieur dans le m&#234;me d&#233;lai, les sommes dues porteront int&#233;r&#234;t au taux l&#233;gal major&#233; de dix points. Au-del&#224; de trente jours, les p&#233;nalit&#233;s seront major&#233;es de 20&#160;% par mois de retard.&#160;&#187;</p>",
    "exposeSommaire": "<p style=\"text-align: justify;\">De nombreux titulaires de comptes bancaires sont victimes de pr&#233;l&#232;vements non autoris&#233;s par piratage de leurs donn&#233;es bancaires. Le code Mon&#233;taire et Financier dispose en son article L.&#160;133&#8209;18 qu&#8217;&#171;&#160;en cas d&#8217;op&#233;ration non autoris&#233;e signal&#233;e par l&#8217;utilisateur dans les conditions pr&#233;vues &#224; l&#8217;article L133&#8209;24, le prestataire de services de paiement du payeur rembourse au payeur le montant de l&#8217;op&#233;ration non autoris&#233;e imm&#233;diatement apr&#232;s avoir pris connaissance de l&#8217;op&#233;ration ou apr&#232;s en avoir &#233;t&#233; inform&#233;, et en tout &#233;tat de cause au plus tard &#224; la fin du premier jour ouvrable suivant&#160;&#187;.</p><p style=\"text-align: justify;\">Alors que l&#8217;ordonnance n&#176; 2017&#8209;1252 du 9 ao&#251;t 2017 portant transposition de la directive 2015/2366 du Parlement&#160;europ&#233;en et du Conseil du 25 novembre 2015 concernant les services de paiement dans le march&#233; int&#233;rieur a introduit un d&#233;lai dans lequel le remboursement doit &#234;tre effectu&#233;, aucune sanction ou p&#233;nalit&#233; n&#8217;est &#224; ce jour pr&#233;vue par la loi. En cons&#233;quence, il n&#8217;existe aucun moyen de contraindre les prestataires de services de paiement &#224; rembourser les clients rapidement. Pourtant, l&#8217;allongement du d&#233;lai de remboursement peut avoir des cons&#233;quences co&#251;teuses notamment en cas de d&#233;couverts sanctionn&#233;s par des commissions d&#8217;intervention.</p><p style=\"text-align: justify;\">A titre d&#8217;exemple, s&#8217;agissant de la vente &#224; distance, l&#8217;article L242&#8209;4 du Code de la consommation pr&#233;voit qu&#8217;en cas d&#8217;exercice par le consommateur de son droit de r&#233;tractation, les sommes dues en cas de non remboursement dans les d&#233;lais sont major&#233;es de p&#233;nalit&#233;s proportionnelles au retard. Cet amendement propose d&#8217;introduire la m&#234;me proc&#233;dure d&#232;s lors que les d&#233;lais de remboursement ne sont pas respect&#233;s.</p>"
  },
  "representations": [
    {
      "nom": "PDF",
      "typeMime": {
        "type": "application",
        "subType": "PDF"
      },
      "statutRepresentation": {
        "verbatim": true,
        "canonique": true,
        "officielle": true,
        "transcription": false,
        "enregistrement": false
      },
      "contenu": {
        "documentURI": "/15/amendements/1237/AN/2804.pdf"
      }
    }
  ],
  "seanceDiscussion": "RUANR5L15S2018IDS21255",
  "sort": {
    "dateSaisie": "2018-09-28T23:44:20.000+02:00",
    "sortEnSeance": "Non soutenu"
  },
  "dateDepot": "2018-09-21T02:00:00.000+02:00",
  "dateDistribution": "2018-09-22T02:00:00.000+02:00",
  "article99": "0",
  "loiReference": {
    "codeLoi": "c monétaire et financier",
    "divisionCodeLoi": "L133-18"
  }
}