{
  "uid": "AMANR5L15SEA717460BTC0259P0D1N95",
  "identifiant": {
    "legislature": "15",
    "numero": "95",
    "numRect": "0",
    "saisine": {
      "texteLegislatifRef": "PNREANR5L15BTC0259",
      "numeroPartiePLF": "0",
      "organeExamen": "PO717460",
      "mentionSecondeDeliberation": "0"
    }
  },
  "numeroLong": "95",
  "etapeTexte": "Lecture unique",
  "triAmendement": "bxe",
  "cardinaliteAmdtMultiples": "1",
  "etat": "A discuter",
  "signataires": {
    "auteur": {
      "typeAuteur": "Depute",
      "acteurRef": "PA720606",
      "groupePolitiqueRef": "PO723569"
    },
    "cosignatairesRefs": [
      "PA720798",
      "PA720822",
      "PA720606",
      "PA720468",
      "PA606212",
      "PA720664",
      "PA720614"
    ],
    "texteAffichable": "M.&#160;Pajot,  M.&#160;Aliot, M.&#160;Bilde, M.&#160;Chenu, M.&#160;Collard, M.&#160;Evrard et Mme&#160;Le Pen"
  },
  "pointeurFragmentTexte": {
    "division": {
      "titre": "Article unique",
      "articleDesignationCourte": "APRÈS ART. UNIQUE",
      "type": "ARTICLE",
      "avantAApres": "Apres",
      "divisionRattachee": "APRÈS L'ARTICLE UNIQUE, insérer l'article suivant:",
      "articleAdditionnel": "1",
      "urlDivisionTexteVise": "/15/textes/0259.asp#D_Article_unique"
    }
  },
  "corps": {
    "dispositif": "<p style=\"text-align: justify;\">La premi&#232;re phrase de l&#8217;alin&#233;a&#160;10 de l&#8217;article&#160;48 du R&#232;glement est compl&#233;t&#233; par les mots&#160;: &#171;&#160;ainsi qu&#8217;aux d&#233;put&#233;s qui en font la demande.&#160;&#187;</p>",
    "exposeSommaire": "<p style=\"text-align: justify;\">L&#8217;affichage des d&#233;cisions de la Conf&#233;rence des Pr&#233;sidents est post&#233;rieur &#224; l&#8217;information d&#233;livr&#233;e dans les groupes. Il y a donc rupture de l&#8217;&#233;galit&#233; entre les d&#233;put&#233;s, ce qui est contraire &#224; tous les principes de droit.</p><p style=\"text-align: justify;\">L&#8217;objet du pr&#233;sent amendement est de permettre l&#8217;acc&#232;s &#224; une meilleure information directe pour tous les d&#233;put&#233;s des d&#233;cisions &#233;manant de la Conf&#233;rence des Pr&#233;sidents.</p><p style=\"text-align: justify;\">Cette information d&#233;livr&#233;e par courrier &#233;lectronique n&#8217;a aucune incidence financi&#232;re et contribue, de surcro&#238;t, &#224; une meilleure information des parlementaires.</p>"
  },
  "representations": [
    {
      "nom": "PDF",
      "typeMime": {
        "type": "application",
        "subType": "PDF"
      },
      "statutRepresentation": {
        "verbatim": true,
        "canonique": true,
        "officielle": true,
        "transcription": false,
        "enregistrement": false
      },
      "contenu": {
        "documentURI": "/15/amendements/0259/AN/95.pdf"
      }
    }
  ],
  "dateDepot": "2017-10-06T02:00:00.000+02:00",
  "dateDistribution": "2017-10-09T02:00:00.000+02:00",
  "article99": "0",
  "loiReference": {
    "codeLoi": "R 48"
  }
}