{
  "uid": "AMANR5L15SEA717460BTC1482P0D1N284",
  "identifiant": {
    "legislature": "15",
    "numero": "284",
    "numRect": "0",
    "saisine": {
      "texteLegislatifRef": "PRJLANR5L15BTC1482",
      "numeroPartiePLF": "0",
      "organeExamen": "PO717460",
      "mentionSecondeDeliberation": "0"
    }
  },
  "numeroLong": "284",
  "etapeTexte": "1ère lecture (1ère assemblée saisie)",
  "triAmendement": "aiaaaaaaaaaaaaaaaaaaaaaaaaaaaaaaaaaaaaaaaaaaaaaaaacs",
  "cardinaliteAmdtMultiples": "1",
  "etat": "Discuté",
  "signataires": {
    "auteur": {
      "typeAuteur": "Depute",
      "acteurRef": "PA718910",
      "groupePolitiqueRef": "PO730964"
    },
    "cosignatairesRefs": [
      "PA717379",
      "PA720538",
      "PA606639",
      "PA718706",
      "PA722022",
      "PA720414",
      "PA721792",
      "PA719994",
      "PA718910",
      "PA722366",
      "PA718744",
      "PA719464",
      "PA718710",
      "PA719130",
      "PA721398",
      "PA720014",
      "PA719540",
      "PA721876",
      "PA718944",
      "PA719448",
      "PA702054",
      "PA720190",
      "PA719330",
      "PA721800",
      "PA718876",
      "PA607155",
      "PA720870",
      "PA718962",
      "PA720854",
      "PA718728",
      "PA719364",
      "PA722300"
    ],
    "texteAffichable": "Mme&#160;Pitollat,  Mme&#160;O&apos;Petit, M.&#160;Besson-Moreau, Mme&#160;Pascale&#160;Boyer, M.&#160;Nadot, M.&#160;Gouttefarde, M.&#160;Perrot, M.&#160;Sorre, Mme&#160;Bagarry, Mme&#160;Fontaine-Domeizel, M.&#160;Vignal, M.&#160;Matras, Mme&#160;Khedher, Mme&#160;De Temmerman, Mme&#160;Degois, M.&#160;Mbaye, M.&#160;Test&#233;, M.&#160;Morenas, Mme&#160;Romeiro Dias, Mme&#160;Tiegna, Mme&#160;Kamowski, Mme&#160;Racon-Bouzon, M.&#160;Fugit, M.&#160;Maillard, Mme&#160;Guerel, Mme&#160;Toutut-Picard, M.&#160;Zulesi, M.&#160;Claireaux, Mme&#160;Michel, Mme&#160;Chapelier, Mme&#160;Vanceunebrock-Mialon et M.&#160;Daniel"
  },
  "pointeurFragmentTexte": {
    "division": {
      "titre": "Article PREMIER",
      "articleDesignationCourte": "ART. PREMIER",
      "type": "ARTICLE",
      "avantAApres": "A",
      "divisionRattachee": "ARTICLE PREMIER",
      "urlDivisionTexteVise": "/15/textes/1482.asp#D_Article_1er"
    },
    "alinea": {
      "avantAApres": "Apres",
      "numero": "20"
    }
  },
  "corps": {
    "dispositif": "<p style=\"text-align: justify;\">Apr&#232;s l&#8217;alin&#233;a&#160;20, ins&#233;rer l&#8217;alin&#233;a suivant&#160;:</p><p style=\"text-align: justify;\">&#171;&#160;8&#176; Recensement et suivi obligatoires des esp&#232;ces d&#233;tenues tant &#224; des fins commerciales que domestiques. Eu &#233;gard &#224; leur particuli&#232;re vuln&#233;rabilit&#233; et &#224; leur r&#244;le pr&#233;pond&#233;rant pour la pr&#233;servation de la biodiversit&#233;, les cheptels apicoles font l&#8217;objet de proc&#233;dures sp&#233;cifiques de contr&#244;le administratif et de r&#233;pression des fraudes, portant notamment sur la protection sanitaire des cheptels et la qualit&#233; des produits d&#8217;exploitation, et <i>via</i> des dispositifs sp&#233;cifiques d&#8217;alertes.&#160;&#187;</p>",
    "exposeSommaire": "<p style=\"text-align: justify;\">Le pr&#233;sent amendement vise d&#8217;une part &#224; inscrire dans les missions du nouvel &#233;tablissement, le recensement et le suivi des esp&#232;ces exploit&#233;es par l&#8217;homme, dans un but de mieux pr&#233;venir et mieux juguler les risques sanitaires, tant pour la pr&#233;servation des esp&#232;ces que pour la sant&#233; humaine, et d&#8217;autre part, &#224; garantir la prise en compte adapt&#233;e des cheptels apicoles, cheville ouvri&#232;re capitale et vuln&#233;rable de la biodiversit&#233;.</p><p style=\"text-align: justify;\">La pr&#233;servation de la biodiversit&#233; requiert, pour &#234;tre efficace, une connaissance exhaustive et fiable des esp&#232;ces d&#233;tenues par l&#8217;homme, soit &#224; des fins d&#8217;exploitation commerciale, soit &#224; des fins domestiques. La ma&#238;trise des risques sanitaires de propagation de maladies et parasites, au pr&#233;judice des esp&#232;ces comme de l&#8217;homme, est s&#233;v&#232;rement limit&#233;e par l&#8217;importation et la d&#233;tention sauvages d&#8217;esp&#232;ces.</p><p style=\"text-align: justify;\">Au-del&#224; des manquements professionnels et des fraudes li&#233;es &#224; des exploitations commerciales sauvages, les risques sanitaires sont accrus par les ph&#233;nom&#232;nes de modes observ&#233;s d&#8217;exploitation par des particuliers d&#8217;esp&#232;ces jusqu&#8217;ici r&#233;serv&#233;es &#224; l&#8217;exploitation agricole, et tout particuli&#232;rement les cheptels apicoles.</p><p style=\"text-align: justify;\">Dans le sillage du plan biodiversit&#233; du 4 juillet 2018 et de la loi du 8 ao&#251;t 2016 pour la reconqu&#234;te de la biodiversit&#233;, la v&#233;ritable pr&#233;servation de cette derni&#232;re repose sur un acteur indispensable que sont nos abeilles. Le pr&#233;sent amendement vise &#224; faire apparaitre dans la loi, l&#8217;imp&#233;rieuse n&#233;cessit&#233; de pr&#233;server notre patrimoine apicole par la pr&#233;servation du cheptel professionnel, particulier et sauvage. Cette pr&#233;cision dans la d&#233;finition des missions du futur organe permet de diff&#233;rencier le r&#244;le capital des abeilles dans l&#8217;ensemble des objectifs du plan biodiversit&#233; du 4 juillet 2018. Ainsi, les moyens pratiques de protection, rendus particuli&#232;rement n&#233;cessaires depuis le classement de l&#8217;esp&#232;ce comme &#233;tant en voie de disparition, devront obligatoirement prendre en compte la sp&#233;cificit&#233; du r&#244;le fondamental de ces ouvri&#232;res dans la p&#233;rennit&#233; notre environnement.</p><p style=\"text-align: justify;\">La vuln&#233;rabilit&#233; des abeilles exige des mesures de protection propres des cheptels et de leurs milieux, avec pour objectif principal leur repeuplement. La multiplication des cheptels amateurs requiert des proc&#233;dures autres que celles habituellement appliqu&#233;es aux professionnels de l&#8217;apiculture. Des mesures de responsabilisation sont indispensables &#224; la ma&#238;trise des risques sanitaires qu&#8217;impliquent la d&#233;tention de telles esp&#232;ces par des particuliers. Il s&#8217;agit &#233;galement de renforcer la tra&#231;abilit&#233; afin de garantir le bon traitement des abeilles et la qualit&#233; des produits destin&#233;s &#224; la consommation. Les dispositifs d&#8217;alertes en cas de risque doivent eux-aussi &#234;tre adapt&#233;s tant &#224; la vuln&#233;rabilit&#233; des esp&#232;ces apicoles, qu&#8217;&#224; la nouvelle diversit&#233; des acteurs intervenants.</p>"
  },
  "representations": [
    {
      "nom": "PDF",
      "typeMime": {
        "type": "application",
        "subType": "PDF"
      },
      "statutRepresentation": {
        "verbatim": true,
        "canonique": true,
        "officielle": true,
        "transcription": false,
        "enregistrement": false
      },
      "contenu": {
        "documentURI": "/15/amendements/1482/AN/284.pdf"
      }
    }
  ],
  "seanceDiscussion": "RUANR5L15S2019IDS21460",
  "sort": {
    "dateSaisie": "2019-01-24T00:13:36.000+01:00",
    "sortEnSeance": "Retiré"
  },
  "dateDepot": "2018-12-14T01:00:00.000+01:00",
  "dateDistribution": "2019-01-17T01:00:00.000+01:00",
  "article99": "0",
  "loiReference": {}
}