{
  "uid": "AMANR5L15SEA717460BTC1019P0D1N1653",
  "identifiant": {
    "legislature": "15",
    "numero": "1653",
    "numRect": "0",
    "saisine": {
      "texteLegislatifRef": "PRJLANR5L15BTC1019",
      "numeroPartiePLF": "0",
      "organeExamen": "PO717460",
      "mentionSecondeDeliberation": "0"
    }
  },
  "numeroLong": "1653",
  "etapeTexte": "1ère lecture (1ère assemblée saisie)",
  "triAmendement": "mikzx",
  "cardinaliteAmdtMultiples": "1",
  "etat": "Discuté",
  "signataires": {
    "auteur": {
      "typeAuteur": "Depute",
      "acteurRef": "PA720386",
      "groupePolitiqueRef": "PO730934"
    },
    "cosignatairesRefs": [
      "PA720386"
    ],
    "texteAffichable": "M.&#160;Di Filippo"
  },
  "pointeurFragmentTexte": {
    "division": {
      "titre": "Article 7",
      "articleDesignationCourte": "ART. 7",
      "type": "ARTICLE",
      "avantAApres": "A",
      "divisionRattachee": "ARTICLE 7",
      "urlDivisionTexteVise": "/15/textes/1019.asp#D_Article_7"
    },
    "alinea": {
      "avantAApres": "Apres",
      "numero": "15"
    }
  },
  "corps": {
    "dispositif": "<p style=\"text-align: justify;\">Apr&#232;s l&#8217;alin&#233;a&#160;15, ins&#233;rer les trois alin&#233;as suivants&#160;:</p><p style=\"text-align: justify;\">&#171;&#160;6&#176;&#160;De participer, en partenariat avec les r&#233;gions, &#224; l&#8217;orientation vers leurs m&#233;tiers par la mobilisation des entreprises et l&#8217;organisation d&#8217;actions de sensibilisation dans les &#233;tablissements scolaires&#160;;</p><p style=\"text-align: justify;\">&#171;&#160;7&#176;&#160;D&#8217;assurer une repr&#233;sentation de leurs ressortissants dans les territoires&#160;;</p><p style=\"text-align: justify;\">&#171;&#160;8&#176;&#160;D&#8217;identifier les besoins en comp&#233;tences des entreprises dans les territoires.&#160;&#187;</p><p style=\"text-align: justify;\">&#160;</p>",
    "exposeSommaire": "<p style=\"text-align: justify;\">Il apparait essentiel de pr&#233;ciser les missions des chambres de m&#233;tiers et de l&#8217;artisanat, dont l&#8217;expertise en mati&#232;re d&#8217;apprentissage est un atout qu&#8217;il convient de mettre en valeur. Alors que les branches professionnelles sont appel&#233;es &#224; assurer le pilotage de l&#8217;apprentissage, il convient &#233;galement de repr&#233;senter l&#8217;ensemble des professions. A ce titre les chambres de m&#233;tiers et de l&#8217;artisanat permettent de garantir cette repr&#233;sentation, au plus pr&#232;s de la r&#233;alit&#233; des territoires.</p>"
  },
  "representations": [
    {
      "nom": "PDF",
      "typeMime": {
        "type": "application",
        "subType": "PDF"
      },
      "statutRepresentation": {
        "verbatim": true,
        "canonique": true,
        "officielle": true,
        "transcription": false,
        "enregistrement": false
      },
      "contenu": {
        "documentURI": "/15/amendements/1019/AN/1653.pdf"
      }
    }
  ],
  "seanceDiscussion": "RUANR5L15S2018IDS21102",
  "sort": {
    "dateSaisie": "2018-06-14T16:03:05.000+02:00",
    "sortEnSeance": "Non soutenu"
  },
  "dateDepot": "2018-06-07T02:00:00.000+02:00",
  "dateDistribution": "2018-06-11T02:00:00.000+02:00",
  "article99": "0",
  "loiReference": {}
}