{
  "uid": "AMANR5L15PO59051B0911P0D1N603",
  "identifiant": {
    "legislature": "15",
    "numero": "603",
    "numRect": "0",
    "saisine": {
      "texteLegislatifRef": "PRJLANR5L15B0911",
      "numeroPartiePLF": "0",
      "organeExamen": "PO59051",
      "mentionSecondeDeliberation": "0"
    }
  },
  "numeroLong": "CL603",
  "etapeTexte": "1ère lecture (1ère assemblée saisie)",
  "triAmendement": "exxi",
  "cardinaliteAmdtMultiples": "1",
  "etat": "Discuté",
  "signataires": {
    "auteur": {
      "typeAuteur": "Depute",
      "acteurRef": "PA721094",
      "groupePolitiqueRef": "PO744425"
    },
    "cosignatairesRefs": [
      "PA267585",
      "PA267766",
      "PA267780",
      "PA267330",
      "PA720230",
      "PA332228",
      "PA331567",
      "PA721094",
      "PA267241",
      "PA610775",
      "PA721110",
      "PA721486",
      "PA642935",
      "PA267355",
      "PA695100",
      "PA720696",
      "PA719806",
      "PA642868",
      "PA1960",
      "PA267042",
      "PA722030",
      "PA268019",
      "PA712014"
    ],
    "texteAffichable": "M.&#160;Dunoyer,  M.&#160;Gom&#232;s, M.&#160;Lagarde, Mme&#160;Auconie, M.&#160;Becht, M.&#160;Benoit, M.&#160;Bournazel, M.&#160;Guy&#160;Bricout, M.&#160;Christophe, Mme&#160;de La Raudi&#232;re, M.&#160;Demilly, Mme&#160;Descamps, M.&#160;Favennec Becot, Mme&#160;Firmin Le Bodo, M.&#160;Meyer&#160;Habib, M.&#160;Herth, M.&#160;Ledoux, M.&#160;Leroy, Mme&#160;Magnier, M.&#160;Naegelen, Mme&#160;Sanquer, M.&#160;Vercamer et M.&#160;Zumkeller"
  },
  "pointeurFragmentTexte": {
    "division": {
      "titre": "Article 4",
      "articleDesignationCourte": "APRÈS ART. 4",
      "type": "ARTICLE",
      "avantAApres": "Apres",
      "divisionRattachee": "APRÈS L'ARTICLE 4, insérer l'article suivant:",
      "articleAdditionnel": "1",
      "urlDivisionTexteVise": "/15/textes/0911.asp#D_Article_4"
    }
  },
  "corps": {
    "dispositif": "<p style=\"text-align: justify;\">Apr&#232;s le deuxi&#232;me alin&#233;a de l&#8217;article&#160;44 de la Constitution, il est ins&#233;r&#233; un alin&#233;a ainsi r&#233;dig&#233;&#160;:</p><p style=\"text-align: justify;\">&#171;&#160;Lorsqu&#8217;un amendement a &#233;t&#233; adopt&#233; par une assembl&#233;e, le Gouvernement ne peut demander une nouvelle d&#233;lib&#233;ration de l&#8217;article amend&#233; au cours de la m&#234;me lecture devant ladite assembl&#233;e.&#160;&#187;</p>",
    "exposeSommaire": "<p>La navette parlementaire permet au Gouvernement de repr&#233;senter ses arguments devant l&#8217;une ou l&#8217;autre des assembl&#233;es. Il n&#8217;est donc pas n&#233;cessaire de proc&#233;der &#224; une seconde d&#233;lib&#233;ration d&#8217;un amendement au cours de la m&#234;me lecture, devant la m&#234;me assembl&#233;e. La facult&#233; donn&#233;e au Gouvernement de demander une seconde d&#233;lib&#233;ration revient &#224; nier le travail du l&#233;gislateur.</p>"
  },
  "representations": [
    {
      "nom": "PDF",
      "typeMime": {
        "type": "application",
        "subType": "PDF"
      },
      "statutRepresentation": {
        "verbatim": true,
        "canonique": true,
        "officielle": true,
        "transcription": false,
        "enregistrement": false
      },
      "contenu": {
        "documentURI": "/15/amendements/0911/CION_LOIS/CL603.pdf"
      }
    }
  ],
  "sort": {
    "dateSaisie": "2018-06-29T12:58:23.000+02:00",
    "sortEnSeance": "Non soutenu"
  },
  "dateDepot": "2018-06-21T02:00:00.000+02:00",
  "dateDistribution": "2018-06-26T02:00:00.000+02:00",
  "article99": "0",
  "loiReference": {
    "codeLoi": "44",
    "divisionCodeLoi": "2-5 id"
  }
}