{
  "uid": "AMANR5L15PO420120B1561P0D1N22",
  "identifiant": {
    "legislature": "15",
    "numero": "22",
    "numRect": "0",
    "saisine": {
      "texteLegislatifRef": "PIONANR5L15B1561",
      "numeroPartiePLF": "0",
      "organeExamen": "PO420120",
      "mentionSecondeDeliberation": "0"
    }
  },
  "numeroLong": "AS22",
  "etapeTexte": "1ère lecture (1ère assemblée saisie)",
  "triAmendement": "daaaaaaaaaaaaaaaaaaaaaaaaaaaaaaaaaaaaaaaaaaaaaaaaac",
  "cardinaliteAmdtMultiples": "1",
  "etat": "Discuté",
  "signataires": {
    "auteur": {
      "typeAuteur": "Depute",
      "acteurRef": "PA719578",
      "groupePolitiqueRef": "PO730958"
    },
    "cosignatairesRefs": [
      "PA719578"
    ],
    "texteAffichable": "M.&#160;Prud&apos;homme, rapporteur"
  },
  "pointeurFragmentTexte": {
    "division": {
      "titre": "Article 2",
      "articleDesignationCourte": "ART. 2",
      "type": "ARTICLE",
      "avantAApres": "A",
      "divisionRattachee": "ARTICLE 2",
      "urlDivisionTexteVise": "/15/textes/1561.asp#D_Article_2"
    },
    "alinea": {
      "numero": "2"
    }
  },
  "corps": {
    "dispositif": "<p>R&#233;diger ainsi l'alin&#233;a 2 :</p><p style=\"text-align: justify;\">&#171;&#160;<i>Art.&#160;L.&#160;3231&#8209;3.&#160;&#8211;&#160;</i>Les teneurs en sel, en sucre et en acide gras satur&#233; des aliments transform&#233;s doivent &#234;tre conformes aux recommandations de l&#8217;Organisation mondiale de la sant&#233; en mati&#232;re de consommation journali&#232;re. Une liste, propos&#233;e par la direction g&#233;n&#233;rale de l&#8217;alimentation au plus tard le&#160;1<sup>er&#160;</sup>janvier&#160;2021 et publi&#233;e par d&#233;cret, d&#233;termine les teneurs maximales en sel, en sucre et en acide gras satur&#233; accept&#233;es par cat&#233;gories d&#8217;aliments.&#160;&#187;&#160;</p>",
    "exposeSommaire": "<p>Cet amendement vise &#224; am&#233;liorer la r&#233;daction de l'article 2 de la proposition de loi.</p><p>En effet, dans chaque famille de produits pr&#233;sents sur le march&#233;, une grande variabilit&#233; en mati&#232;re de teneur en sel, en sucre et en acide gras satur&#233; est constat&#233;e, et certains produits, selon les observations de l'Oqali, sont d'ores et d&#233;j&#224; bien positionn&#233;s.&#160;</p><p style=\"text-align: justify;\">L'enjeu &#233;tant d'amener progressivement les produits les moins bons vers des teneurs inf&#233;rieures en sel, en sucre et acides gras satur&#233;s afin d'am&#233;liorer leur qualit&#233; nutritionnelle, il est n&#233;cessaire d'introduire dans l'article la notion de teneur maximum.</p><p style=\"text-align: justify;\">Le dispositif adopt&#233; restera ainsi fid&#232;le &#224; l'esprit des chartes d'engagements volontaires en d&#233;terminant des standards de qualit&#233; sur lesquels les entreprises devront ajuster leurs productions.</p>"
  },
  "representations": [
    {
      "nom": "PDF",
      "typeMime": {
        "type": "application",
        "subType": "PDF"
      },
      "statutRepresentation": {
        "verbatim": true,
        "canonique": true,
        "officielle": true,
        "transcription": false,
        "enregistrement": false
      },
      "contenu": {
        "documentURI": "/15/amendements/1561/CION-SOC/AS22.pdf"
      }
    }
  ],
  "sort": {
    "dateSaisie": "2019-02-13T10:56:08.000+01:00",
    "sortEnSeance": "Tombé"
  },
  "dateDepot": "2019-02-11T01:00:00.000+01:00",
  "dateDistribution": "2019-02-12T01:00:00.000+01:00",
  "article99": "0",
  "loiReference": {}
}