{
  "uid": "AMANR5L15SEA717460B2296P0D1N509",
  "identifiant": {
    "legislature": "15",
    "numero": "509",
    "numRect": "0",
    "saisine": {
      "texteLegislatifRef": "PRJLANR5L15B2296",
      "numeroPartiePLF": "0",
      "organeExamen": "PO717460",
      "mentionSecondeDeliberation": "0"
    }
  },
  "numeroLong": "509",
  "etapeTexte": "1ère lecture (1ère assemblée saisie)",
  "triAmendement": "adiaaaaaaaaaaaaaaaaaaaaaaaaaaaaaaaaaaaaaaaaaaaaaaaak",
  "cardinaliteAmdtMultiples": "1",
  "etat": "Discuté",
  "signataires": {
    "auteur": {
      "typeAuteur": "Depute",
      "acteurRef": "PA720422",
      "groupePolitiqueRef": "PO730958"
    },
    "cosignatairesRefs": [
      "PA720286",
      "PA718868",
      "PA721210",
      "PA720846",
      "PA720422",
      "PA588884",
      "PA720430",
      "PA720892",
      "PA719578",
      "PA721960",
      "PA722142",
      "PA721226",
      "PA719676",
      "PA721062",
      "PA2150",
      "PA721202",
      "PA718860"
    ],
    "texteAffichable": "M.&#160;Quatennens,  Mme&#160;Autain, M.&#160;Bernalicis, M.&#160;Coquerel, M.&#160;Corbi&#232;re, Mme&#160;Fiat, M.&#160;Lachaud, M.&#160;Larive, M.&#160;M&#233;lenchon, Mme&#160;Obono, Mme&#160;Panot, M.&#160;Prud&apos;homme, M.&#160;Ratenon, Mme&#160;Ressiguier, Mme&#160;Rubin, M.&#160;Ruffin et Mme&#160;Taurine"
  },
  "pointeurFragmentTexte": {
    "division": {
      "titre": "Article 3",
      "articleDesignationCourte": "ART. 3",
      "type": "ARTICLE",
      "avantAApres": "A",
      "divisionRattachee": "ARTICLE 3",
      "urlDivisionTexteVise": "/15/textes/2296.asp#D_Article_3"
    }
  },
  "corps": {
    "dispositif": "<p style=\"text-align: justify;\">Supprimer cet article.</p>",
    "exposeSommaire": "<p style=\"text-align: justify;\">La crise des Gilets jaunes est le sympt&#244;me de la profonde crise sociale que traverse notre pays. Elle est un fait nouveau dans notre &#233;poque, remet en question l&#8217;ordre &#233;tabli et appelle &#224; un nouveau partage de la valeur et des richesses.<br />Force est de constater que leur combat est&#160;juste. En effet, pour 100&#160;euros de b&#233;n&#233;fices, 67 sont r&#233;serv&#233;s &#224; la r&#233;mun&#233;ration des actionnaires alors que 5 seulement sont consacr&#233;s &#224; des primes pour les salari&#233;s. <br />Face &#224; ce d&#233;fi, la n&#233;cessit&#233; serait d&#8217;installer un nouveau rapport de force pour une plus juste r&#233;partition des richesses. Le Gouvernement a pr&#233;f&#233;r&#233; recycler le vieux logiciel us&#233; de ses pr&#233;d&#233;cesseurs. Cette politique d&#8217;exon&#233;ration de cotisations sociales est pourtant dangereuse. Elle permet certes un gain temporaire sur le salaire net mais a des cons&#233;quences directes sur le financement de notre syst&#232;me collectif de protection sociale.<br />En r&#233;alit&#233;, les cotisations sociales sont une partie int&#233;grante du salaire socialis&#233; et leur suppression affaiblit durablement les protections dont les assur&#233;s sociaux peuvent b&#233;n&#233;ficier. Il n&#8217;est &#224; cet &#233;gard pas &#233;tonnant de le v&#233;rifier dans le dernier rapport de la Cour des comptes&#160;: le d&#233;s&#233;quilibre des comptes de la S&#233;curit&#233; sociale s&#8217;explique avant tout par la politique d&#8217;exon&#233;ration des cotisations sociales. Il s&#8217;explique aussi par une fraude patronale de 7 &#224; 9 milliards d&#8217;euros annuels que le Gouvernement ne cherche toujours pas &#224; endiguer.<br />Finalement, la politique d&#8217;exon&#233;ration de cotisations sociales a un but clair&#160;: ass&#233;cher le financement de la S&#233;curit&#233; sociale pour la rendre indigente et organiser un syst&#232;me &#224; deux vitesses au profit de protections priv&#233;es. D&#8217;une part, un mince filet de protection pour la grande masse et, d&#8217;autre part, un syst&#232;me priv&#233; pour ceux qui en auraient les moyens. <br />Nous nous opposons &#224; cette logique. C&#8217;est la raison pour laquelle nous demandons la suppression de cet article.</p>"
  },
  "representations": [
    {
      "nom": "PDF",
      "typeMime": {
        "type": "application",
        "subType": "PDF"
      },
      "statutRepresentation": {
        "verbatim": true,
        "canonique": true,
        "officielle": true,
        "transcription": false,
        "enregistrement": false
      },
      "contenu": {
        "documentURI": "/15/amendements/2296/AN/509.pdf"
      }
    }
  ],
  "seanceDiscussion": "RUANR5L15S2020IDS21874",
  "sort": {
    "dateSaisie": "2019-10-22T23:40:03.000+02:00",
    "sortEnSeance": "Rejeté"
  },
  "dateDepot": "2019-10-17T02:00:00.000+02:00",
  "dateDistribution": "2019-10-21T02:00:00.000+02:00",
  "article99": "0",
  "loiReference": {}
}