{
  "uid": "AMANR5L15PO59051B1933P0D1N16",
  "identifiant": {
    "legislature": "15",
    "numero": "16",
    "numRect": "0",
    "saisine": {
      "texteLegislatifRef": "PIONANR5L15B1933",
      "numeroPartiePLF": "0",
      "organeExamen": "PO59051",
      "mentionSecondeDeliberation": "0"
    }
  },
  "numeroLong": "CL16",
  "etapeTexte": "1ère lecture (1ère assemblée saisie)",
  "triAmendement": "oaaaaaaaaaaaaaaaaaaaaaaaaaaaaaaaaaaaaaaaaaaaaaaaaachi",
  "cardinaliteAmdtMultiples": "1",
  "etat": "Discuté",
  "signataires": {
    "auteur": {
      "typeAuteur": "Depute",
      "acteurRef": "PA719608",
      "groupePolitiqueRef": "PO723569"
    },
    "cosignatairesRefs": [
      "PA719608"
    ],
    "texteAffichable": "Mme&#160;M&#233;nard"
  },
  "pointeurFragmentTexte": {
    "division": {
      "titre": "Article 10",
      "articleDesignationCourte": "APRÈS ART. 10",
      "type": "ARTICLE",
      "avantAApres": "Apres",
      "divisionRattachee": "APRÈS L'ARTICLE 10, insérer l'article suivant:",
      "articleAdditionnel": "1",
      "urlDivisionTexteVise": "/15/textes/1933.asp#D_Article_10"
    }
  },
  "corps": {
    "dispositif": "<p style=\"text-align: justify;\">&#192; la premi&#232;re phrase du premier alin&#233;a de l&#8217;article L.&#160;613&#8209;3 du code de s&#233;curit&#233; int&#233;rieure, les mots&#160;: &#171;&#160;rassemblant plus de 300 spectateurs&#160;&#187; sont supprim&#233;s.</p>",
    "exposeSommaire": "<p>Dans le contexte d&#8217;ins&#233;curit&#233; qui est le n&#244;tre, il convient de supprimer ce seuil qui limite les forces de l&#8217;ordre dans leur mission d&#8217;assurer la s&#233;curit&#233; des Fran&#231;ais convenablement.</p>"
  },
  "representations": [
    {
      "nom": "PDF",
      "typeMime": {
        "type": "application",
        "subType": "PDF"
      },
      "statutRepresentation": {
        "verbatim": true,
        "canonique": true,
        "officielle": true,
        "transcription": false,
        "enregistrement": false
      },
      "contenu": {
        "documentURI": "/15/amendements/1933/CION_LOIS/CL16.pdf"
      }
    }
  ],
  "sort": {
    "dateSaisie": "2019-06-12T11:48:11.000+02:00",
    "sortEnSeance": "Non soutenu"
  },
  "dateDepot": "2019-06-06T02:00:00.000+02:00",
  "dateDistribution": "2019-06-11T02:00:00.000+02:00",
  "article99": "0",
  "loiReference": {
    "codeLoi": "28 sécurité intérieure",
    "divisionCodeLoi": "L613-3"
  }
}