{
  "uid": "AMANR5L15SEA717460BTC2063P0D1N418",
  "identifiant": {
    "legislature": "15",
    "numero": "418",
    "numRect": "0",
    "saisine": {
      "texteLegislatifRef": "PRJLANR5L15BTC2063",
      "numeroPartiePLF": "0",
      "organeExamen": "PO717460",
      "mentionSecondeDeliberation": "0"
    }
  },
  "numeroLong": "418",
  "etapeTexte": "1ère lecture (1ère assemblée saisie)",
  "triAmendement": "fiaaaaaaaaaaaaaaaaaaaaaaaaaaaaaaaaaaaaaaaaaaaaaaaadl",
  "cardinaliteAmdtMultiples": "1",
  "etat": "Discuté",
  "signataires": {
    "auteur": {
      "typeAuteur": "Depute",
      "acteurRef": "PA719592",
      "groupePolitiqueRef": "PO730964"
    },
    "cosignatairesRefs": [
      "PA719592"
    ],
    "texteAffichable": "M.&#160;Simian"
  },
  "pointeurFragmentTexte": {
    "division": {
      "titre": "Article 4",
      "articleDesignationCourte": "APRÈS ART. 4",
      "type": "ARTICLE",
      "avantAApres": "Apres",
      "divisionRattachee": "APRÈS L'ARTICLE 4, insérer l'article suivant:",
      "articleAdditionnel": "1",
      "urlDivisionTexteVise": "/15/textes/2063.asp#D_Article_4"
    }
  },
  "corps": {
    "dispositif": "<p>Le premier alin&#233;a de l&#8217;article L.&#160;121&#8209;12 du code de l&#8217;urbanisme est ainsi modifi&#233;&#160;:</p><p>1&#176;&#160;Les mots&#160;: &#171;&#160;m&#233;canique du vent&#160;&#187; sont remplac&#233;s par le mot&#160;: &#171;&#160;solaire&#160;&#187;&#160;;</p><p>2&#176;&#160;Les mots&#160;: &#171;&#160;lorsqu&#8217;ils&#160;&#187; sont remplac&#233;s par les mots&#160;: &#171;&#160;. Il en est de m&#234;me pour celles &#224; partir de l&#8217;&#233;nergie m&#233;canique du vent lorsqu&#8217;elles&#160;&#187;</p>",
    "exposeSommaire": "<p style=\"text-align: justify;\">Le pr&#233;sent amendement vise&#160;&#224; simplifier les installations solaires en zone littorale.</p><p style=\"text-align: justify;\">Le pr&#233;sent amendement vise &#224; corriger un oubli.</p><p style=\"text-align: justify;\">La loi de Transition &#201;nerg&#233;tique pour la Croissance Verte a permis de corriger une contradiction au sein du code de l&#8217;urbanisme en adoptant une disposition sp&#233;cifique pour l&#8217;&#233;nergie &#233;olienne. Le pr&#233;sent amendement vise &#224; corriger l&#8217;oubli d&#8217;alors de l&#8217;&#233;nergie solaire et &#224; ce qu&#8217;elle b&#233;n&#233;ficie &#233;galement de cette disposition encadr&#233;e afin d&#8217;&#233;viter que le photovolta&#239;que ne soit d&#233;favoris&#233;.</p><p style=\"text-align: justify;\">L&#8217;implantation des centrales solaires au sol dans certaines communes est&#160;en effet aujourd&#8217;hui entrav&#233;e par l&#8217;articulation entre la r&#232;gle de continuit&#233; de l&#8217;urbanisation et le souhait issu des diff&#233;rents appels d&#8217;offres photovolta&#239;ques de privil&#233;gier l&#8217;implantation des centrales sur des sites d&#233;grad&#233;s. En effet, ces sites d&#233;grad&#233;s sont le plus fr&#233;quemment situ&#233;s &#224; distance de l&#8217;urbanisation existante. Ils ne peuvent de ce fait, en l&#8217;&#233;tat de la loi, faire l&#8217;objet d&#8217;un permis de construire malgr&#233; l&#8217;int&#233;r&#234;t de les revaloriser pour les collectivit&#233;s locales. A cela s&#8217;ajoutent les contraintes techniques inh&#233;rentes &#224; de tels projets qui rendent complexe leur implantation en continuit&#233; des agglom&#233;rations, telle que la n&#233;cessit&#233; d&#8217;une disponibilit&#233; fonci&#232;re cons&#233;quente.</p><p style=\"text-align: justify;\">Toutes les dispositions relatives aux autorisations et aux caract&#233;ristiques de ces installations photovolta&#239;ques (consultations, autorisations, caract&#233;ristiques des terrains, etc&#8230;) s&#8217;appliquent &#224; ces projets en zone littorale de mani&#232;re strictement identique au reste du territoire.</p><p style=\"text-align: justify;\">En outre, comme le pr&#233;cise l&#8217;article lui-m&#234;me, les installations n&#233;cessiteront en tous les cas une d&#233;lib&#233;ration favorable de l&#8217;organe d&#233;lib&#233;rant de l&#8217;&#233;tablissement public de coop&#233;ration intercommunale comp&#233;tent en mati&#232;re de plan local d&#8217;urbanisme ou, &#224; d&#233;faut, du conseil municipal de la commune concern&#233;e par l&#8217;ouvrage, et apr&#232;s avis de la commission d&#233;partementale de la nature, des paysages et des sites et ne pourrons porter atteinte &#224; l&#8217;environnement ou aux sites et paysages remarquables.</p><p style=\"text-align: justify;\">Ces installations ne peuvent par ailleurs, comme le pr&#233;cise l&#8217;article L.&#160;121&#8209;12, en aucun cas se faire sur la zone la plus proche du littoral &#224; moins d&#8217;un kilom&#232;tre de ce dernier.</p><p style=\"text-align: justify;\">Il est donc propos&#233; ici d&#8217;autoriser ces implantations sur des terrains situ&#233;s sur le territoire de communes littorales, &#233;loign&#233;s des c&#244;tes et avec l&#8217;ensemble des garanties inh&#233;rentes au d&#233;veloppement de parcs solaires qui s&#8217;appliquent par ailleurs sur le territoire m&#233;tropolitain.</p>"
  },
  "representations": [
    {
      "nom": "PDF",
      "typeMime": {
        "type": "application",
        "subType": "PDF"
      },
      "statutRepresentation": {
        "verbatim": true,
        "canonique": true,
        "officielle": true,
        "transcription": false,
        "enregistrement": false
      },
      "contenu": {
        "documentURI": "/15/amendements/2063/AN/418.pdf"
      }
    }
  ],
  "seanceDiscussion": "RUANR5L15S2019IDS21738",
  "sort": {
    "dateSaisie": "2019-06-28T12:28:39.000+02:00",
    "sortEnSeance": "Non soutenu"
  },
  "dateDepot": "2019-06-21T02:00:00.000+02:00",
  "dateDistribution": "2019-06-25T02:00:00.000+02:00",
  "article99": "0",
  "loiReference": {
    "codeLoi": "c urbanisme",
    "divisionCodeLoi": "L121-12"
  }
}