{
  "uid": "AMANR5L15PO419865B2274P0D1N626",
  "identifiant": {
    "legislature": "15",
    "numero": "626",
    "numRect": "0",
    "saisine": {
      "texteLegislatifRef": "PRJLANR5L15B2274",
      "numeroPartiePLF": "0",
      "organeExamen": "PO419865",
      "mentionSecondeDeliberation": "0"
    }
  },
  "numeroLong": "CD626",
  "etapeTexte": "1ère lecture (2ème assemblée saisie)",
  "triAmendement": "klaaaaaaaaaaaaaaaaaaaaaaaaaaaaaaaaaaaaaaaaaaaaaaaaf",
  "cardinaliteAmdtMultiples": "1",
  "etat": "En traitement",
  "signataires": {
    "auteur": {
      "typeAuteur": "Depute",
      "acteurRef": "PA721784",
      "groupePolitiqueRef": "PO730964"
    },
    "cosignatairesRefs": [
      "PA722252",
      "PA721726",
      "PA721784",
      "PA719170",
      "PA721844",
      "PA722300",
      "PA721644",
      "PA720854",
      "PA720054",
      "PA719728",
      "PA607595",
      "PA722194",
      "PA722046"
    ],
    "texteAffichable": "Mme&#160;Gomez-Bassac,  M.&#160;Kokouendo, M.&#160;Le Bohec, M.&#160;Pellois, Mme&#160;Berg&#233;, Mme&#160;Piron, Mme&#160;Mauborgne, Mme&#160;Rixain, M.&#160;Test&#233;, Mme&#160;Charvier, Mme&#160;Khedher, M.&#160;Haury et Mme&#160;Provendier"
  },
  "pointeurFragmentTexte": {
    "division": {
      "titre": "Article 11 quinquies",
      "articleDesignationCourte": "ART. 11 QUINQUIES",
      "type": "ARTICLE",
      "avantAApres": "A",
      "divisionRattachee": "ARTICLE 11 QUINQUIES",
      "urlDivisionTexteVise": "/15/textes/2274.asp#D_Article_11_quinquies"
    },
    "alinea": {
      "numero": "1"
    }
  },
  "corps": {
    "dispositif": "<p style=\"text-align: justify;\">Compl&#233;ter cet article par les deux phrases suivantes&#160;:</p><p style=\"text-align: justify;\">&#171;&#160;Le fait, pour le responsable ou le pr&#233;pos&#233; d&#8217;une entreprise tenue &#224; la gestion de d&#233;chets produits dans le cadre de son activit&#233;, de ne pas respecter cette obligation en commettant l&#8217;infraction mentionn&#233;e au 4&#176;&#160;du m&#234;me I, est puni d&#8217;une confiscation imm&#233;diate du v&#233;hicule qui a servi ou &#233;tait destin&#233; &#224; commettre l&#8217;infraction d&#232;s sa premi&#232;re occurrence. Le v&#233;hicule est alors remis au service des domaines en vue de sa destruction ou de son ali&#233;nation.&#160;&#187;</p>",
    "exposeSommaire": "<p style=\"text-align: justify;\">Le ph&#233;nom&#232;ne de d&#233;p&#244;t sauvage de d&#233;chets se d&#233;veloppe dans notre pays. La gestion des d&#233;p&#244;ts sauvages engendre des co&#251;ts de plusieurs millions d&#8217;euros pay&#233;s par la collectivit&#233;. Ce co&#251;t est imput&#233; sur le contribuable jusqu&#8217;&#224; environ 50&#160;&#8364; par habitant par an (Caract&#233;risation de la probl&#233;matique des d&#233;chets sauvages, ADEME, 2019). Ce ph&#233;nom&#232;ne suscite par ailleurs chaque ann&#233;e plusieurs millions d&#8217;euros de manque &#224; gagner par l&#8217;&#201;tat et une distorsion r&#233;elle de la concurrence entre professionnels.</p><p style=\"text-align: justify;\">Face &#224; ce constat et &#224; l&#8217;industrialisation de ce ph&#233;nom&#232;ne, il appara&#238;t n&#233;cessaire que dans le cadre d&#8217;un d&#233;p&#244;t sauvage de d&#233;chets par un acteur professionnel, la confiscation du v&#233;hicule visant ou ayant servi au d&#233;p&#244;t des d&#233;chets puisse se faire au moment de la constatation de l&#8217;infraction.</p><p style=\"text-align: justify;\">Les v&#233;hicules ayant un r&#244;le majeur dans certaines activit&#233;s g&#233;n&#233;ratrices de d&#233;chets, cette mesure se veut dissuader les professionnels ayant g&#233;n&#233;ralis&#233; cette pratique. Cet amendement veut enfin apporter des outils compl&#233;mentaires aux d&#233;positaires de l&#8217;autorit&#233; publique pour faire face au d&#233;veloppement de ces d&#233;charges sauvages.</p>",
    "cartoucheDelaiDepotDepasse": "Sous réserve de son traitement par les services de l'Assemblée nationale et de sa recevabilité"
  },
  "representations": [
    {
      "nom": "PDF",
      "typeMime": {
        "type": "application",
        "subType": "PDF"
      },
      "statutRepresentation": {
        "verbatim": true,
        "canonique": true,
        "officielle": true,
        "transcription": false,
        "enregistrement": false
      },
      "contenu": {
        "documentURI": "/15/amendements/2274/CION-DVP/CD626.pdf"
      }
    }
  ],
  "dateDepot": "2019-11-19T01:00:00.000+01:00",
  "article99": "0",
  "loiReference": {}
}