{
  "uid": "AMANR5L15SEA717460BTA0216P0D1N164",
  "identifiant": {
    "legislature": "15",
    "numero": "164",
    "numRect": "0",
    "saisine": {
      "texteLegislatifRef": "PRJLANR5L15BTA0216",
      "numeroPartiePLF": "0",
      "organeExamen": "PO717460",
      "mentionSecondeDeliberation": "0"
    }
  },
  "numeroLong": "164",
  "etapeTexte": "Lecture définitive",
  "triAmendement": "lbsaaaaaaaaaaaaaaaaaaaaaaaaaaaaaaaaaaaaaaaaaaaaaaai",
  "cardinaliteAmdtMultiples": "1",
  "etat": "Discuté",
  "signataires": {
    "auteur": {
      "typeAuteur": "Depute",
      "acteurRef": "PA266797",
      "groupePolitiqueRef": "PO730934"
    },
    "cosignatairesRefs": [
      "PA330909",
      "PA330008",
      "PA336316",
      "PA267429",
      "PA267318",
      "PA856",
      "PA643134",
      "PA346218",
      "PA719272",
      "PA998",
      "PA643089",
      "PA721506",
      "PA346054",
      "PA720630",
      "PA720210",
      "PA2529",
      "PA719946",
      "PA267204",
      "PA330240",
      "PA267324",
      "PA266797",
      "PA342935",
      "PA767",
      "PA721410",
      "PA2086",
      "PA606098",
      "PA720586",
      "PA1874",
      "PA608416",
      "PA334149",
      "PA1012",
      "PA267260",
      "PA266776",
      "PA722390",
      "PA718884",
      "PA267289",
      "PA330684",
      "PA746",
      "PA721126",
      "PA223837",
      "PA2792",
      "PA1498",
      "PA1695",
      "PA748954",
      "PA330788",
      "PA642847",
      "PA606712",
      "PA267378",
      "PA720100",
      "PA713448",
      "PA721314",
      "PA643103",
      "PA267901",
      "PA2796",
      "PA332523",
      "PA718850",
      "PA267527",
      "PA1029",
      "PA721816",
      "PA709315",
      "PA334654",
      "PA721678",
      "PA2492",
      "PA759192",
      "PA266808",
      "PA608826",
      "PA718838",
      "PA605991",
      "PA2377",
      "PA718780",
      "PA718784",
      "PA2155",
      "PA720644",
      "PA267735",
      "PA267794",
      "PA923",
      "PA607090",
      "PA721636",
      "PA1630",
      "PA340853",
      "PA608016",
      "PA345722",
      "PA267200",
      "PA1327",
      "PA609726",
      "PA720684",
      "PA266793",
      "PA334843",
      "PA605036",
      "PA267440",
      "PA719318",
      "PA712015",
      "PA721474",
      "PA609245",
      "PA721070",
      "PA266774",
      "PA267450",
      "PA721286",
      "PA720386",
      "PA2960",
      "PA721968"
    ],
    "texteAffichable": "M.&#160;Gosselin,  M.&#160;Masson, M.&#160;Savignat, M.&#160;Jacob, M.&#160;Abad, Mme&#160;Anthoine, M.&#160;Aubert, M.&#160;Bazin, Mme&#160;Bazin-Malgras, Mme&#160;Beauvais, Mme&#160;Bonnivard, M.&#160;Bony, M.&#160;Boucard, M.&#160;Bouchet, Mme&#160;Val&#233;rie&#160;Boyer, Mme&#160;Brenier, M.&#160;Breton, M.&#160;Brochand, M.&#160;Brun, M.&#160;Carrez, M.&#160;Cattin, M.&#160;Cherpion, M.&#160;Cinieri, M.&#160;Ciotti, M.&#160;Cordier, Mme&#160;Corneloup, M.&#160;Cornut-Gentille, Mme&#160;Dalloz, M.&#160;Dassault, M.&#160;de Ganay, M.&#160;de la Verpilli&#232;re, M.&#160;Deflesselles, M.&#160;R&#233;mi&#160;Delatte, M.&#160;Descoeur, M.&#160;Di Filippo, M.&#160;Diard, M.&#160;Dive, M.&#160;Door, Mme&#160;Marianne&#160;Dubois, Mme&#160;Duby-Muller, M.&#160;Pierre-Henri&#160;Dumont, M.&#160;Fasquelle, M.&#160;Ferrara, M.&#160;Forissier, M.&#160;Furst, M.&#160;Gaultier, Mme&#160;Genevard, M.&#160;Goasguen, M.&#160;Grelier, Mme&#160;Guion-Firmin, M.&#160;Herbillon, M.&#160;Hetzel, M.&#160;Huyghe, M.&#160;Kamardine, Mme&#160;Kuster, Mme&#160;Lacroute, M.&#160;Le Fur, Mme&#160;Le Grip, M.&#160;Leclerc, Mme&#160;Levy, Mme&#160;Louwagie, M.&#160;Lurton, M.&#160;Emmanuel&#160;Maquet, M.&#160;Marleix, M.&#160;Marlin, M.&#160;Menuel, Mme&#160;Meunier, M.&#160;Minot, M.&#160;Nury, M.&#160;Parigi, M.&#160;Pauget, M.&#160;Peltier, M.&#160;Perrut, Mme&#160;Poletti, M.&#160;Poudroux, M.&#160;Pradi&#233;, M.&#160;Quentin, M.&#160;Ramadier, Mme&#160;Ramassamy, M.&#160;Reda, M.&#160;Reiss, M.&#160;Reitzer, M.&#160;Reyn&#232;s, M.&#160;Rolland, M.&#160;Saddier, M.&#160;Schellenberger, M.&#160;Sermier, M.&#160;Straumann, Mme&#160;Tabarot, M.&#160;Taugourdeau, M.&#160;Teissier, M.&#160;Thi&#233;riot, Mme&#160;Trastour-Isnart, Mme&#160;Valentin, M.&#160;Vatin, M.&#160;Verch&#232;re, M.&#160;Viala, M.&#160;Vialay, M.&#160;Jean-Pierre&#160;Vigier, M.&#160;Viry et M.&#160;Woerth"
  },
  "pointeurFragmentTexte": {
    "division": {
      "titre": "Article 52 quater",
      "articleDesignationCourte": "ART. 52 QUATER",
      "type": "ARTICLE",
      "avantAApres": "A",
      "divisionRattachee": "ARTICLE 52 QUATER",
      "urlDivisionTexteVise": "/15/textes/TA0216.asp#D_13400"
    }
  },
  "corps": {
    "dispositif": "<p style=\"text-align: justify;\">R&#233;diger ainsi cet article&#160;:</p><p>L'article&#160;21 de la loi&#160;n&#176;&#160;91-647 du 10&#160;juillet&#160;1991 relative &#224; l'aide juridique est ainsi modifi&#233;&#160;:</p><p>1&#176;&#160;Au premier alin&#233;a, les mots&#160;: &#171;&#160;peut recueillir&#160;&#187; sont remplac&#233;s par le mot&#160;: &#171;&#160;recueille&#160;&#187;&#160;;</p><p>2&#176;&#160;Le deuxi&#232;me alin&#233;a est ainsi r&#233;dig&#233;&#160;:</p><p>&#171;&#160;&#192; cet effet, il consulte les services de l'&#201;tat et des collectivit&#233;s publiques, les organismes de s&#233;curit&#233; sociale et les organismes qui assurent la gestion des prestations sociales. Ceux-ci sont tenus de lui communiquer, sans pouvoir opposer le secret professionnel, tous renseignements permettant de v&#233;rifier que l'int&#233;ress&#233; satisfait aux conditions exig&#233;es pour b&#233;n&#233;ficier de l'aide juridictionnelle.&#160;&#187;</p>",
    "exposeSommaire": "<p style=\"text-align: justify;\">Sans pr&#233;juger des conclusions que rendra la mission sur l&#8217;aide juridictionnelle, ces articles adopt&#233;s par le S&#233;nat en premi&#232;re lecture pr&#233;voient&#160;:&#160;</p><p>I/ Le&#160;r&#233;tablissement de la contribution pour l&#8217;aide juridique supprim&#233;e par la loi n&#176;&#160;2013&#8209;1278 du 29 d&#233;cembre 2013 de finances pour 2014. Elle serait d&#233;sormais modul&#233;e, de 20 &#224; 50&#160;euros, en fonction du type d&#8217;instance engag&#233;e (elle est due par la partie qui introduit une instance).</p><p>II/&#160;pr&#233;voir la consultation obligatoire d&#8217;un avocat pr&#233;alablement au d&#233;p&#244;t d&#8217;une demande d&#8217;aide juridictionnelle, &#224; l&#8217;exception des actions pour lesquelles le justiciable est d&#233;fendeur ou, en mati&#232;re p&#233;nale, des demandes relevant de l&#8217;admission provisoire &#224; l&#8217;aide juridictionnelle en raison de leur caract&#232;re urgent. Cette consultation serait r&#233;tribu&#233;e comme un acte d&#8217;aide juridictionnelle, d&#232;s lors que le demandeur de l&#8217;aide remplirait bien les autres conditions que celle relative au bien-fond&#233; de son action.</p><p>III/ rendre obligatoire, &#224; l&#8217;article&#160;21 de la loi n&#176; 91&#8209;647 du 10 juillet 1991 relative &#224; l&#8217;aide juridique, la consultation par les bureaux d&#8217;aide juridictionnelle (BAJ) des services ou des organismes sociaux comp&#233;tents pour appr&#233;cier les ressources des demandeurs.</p><p>IV/&#160;am&#233;liorer le taux de recouvrement des sommes vers&#233;es au b&#233;n&#233;ficiaire de l&#8217;aide juridictionnelle &#224; la suite d&#8217;une d&#233;cision de retrait de l&#8217;aide ou aupr&#232;s de la partie condamn&#233;e aux d&#233;pens ou qui perd son proc&#232;s, d&#232;s lors que celle-ci n&#8217;est pas b&#233;n&#233;ficiaire de l&#8217;aide juridictionnelle, en confiant ce recouvrement au Tr&#233;sor public.&#160;</p>"
  },
  "representations": [
    {
      "nom": "PDF",
      "typeMime": {
        "type": "application",
        "subType": "PDF"
      },
      "statutRepresentation": {
        "verbatim": true,
        "canonique": true,
        "officielle": true,
        "transcription": false,
        "enregistrement": false
      },
      "contenu": {
        "documentURI": "/15/amendements/TA0216/AN/164.pdf"
      }
    }
  ],
  "sort": {
    "dateSaisie": "2019-02-19T00:07:59.000+01:00",
    "sortEnSeance": "Rejeté"
  },
  "dateDepot": "2019-02-15T01:00:00.000+01:00",
  "dateDistribution": "2019-02-18T01:00:00.000+01:00",
  "article99": "0",
  "loiReference": {}
}