{
  "uid": "AMANR5L15PO59051B1882P0D1N92",
  "identifiant": {
    "legislature": "15",
    "numero": "92",
    "numRect": "0",
    "saisine": {
      "texteLegislatifRef": "PNREANR5L15B1882",
      "numeroPartiePLF": "0",
      "organeExamen": "PO59051",
      "mentionSecondeDeliberation": "0"
    }
  },
  "numeroLong": "CL92",
  "etapeTexte": "Lecture unique",
  "triAmendement": "alaaaaaaaaaaaaaaaaaaaaaaaaaaaaaaaaaaaaaaaaaaaaaaaak",
  "cardinaliteAmdtMultiples": "1",
  "etat": "Discuté",
  "signataires": {
    "auteur": {
      "typeAuteur": "Depute",
      "acteurRef": "PA721314",
      "groupePolitiqueRef": "PO730934"
    },
    "cosignatairesRefs": [
      "PA606712",
      "PA718884",
      "PA719318",
      "PA767",
      "PA709315",
      "PA346218",
      "PA721314",
      "PA721054",
      "PA267901",
      "PA605036",
      "PA334654"
    ],
    "texteAffichable": "M.&#160;Schellenberger,  M.&#160;Straumann, Mme&#160;Anthoine, M.&#160;Abad, Mme&#160;Bazin-Malgras, M.&#160;Cattin, M.&#160;Masson, M.&#160;Lurton, M.&#160;Kamardine, M.&#160;Lorion et M.&#160;Viala"
  },
  "pointeurFragmentTexte": {
    "division": {
      "titre": "Article 4",
      "articleDesignationCourte": "ART. 4",
      "type": "ARTICLE",
      "avantAApres": "A",
      "divisionRattachee": "ARTICLE 4",
      "urlDivisionTexteVise": "/15/textes/1882.asp#D_Article_4"
    },
    "alinea": {
      "avantAApres": "Avant",
      "numero": "1",
      "alineaDesignation": "Avant l'alinéa 1"
    }
  },
  "corps": {
    "dispositif": "<p style=\"text-align: justify;\">I.&#160;&#8211;&#160;Avant l&#8217;alin&#233;a&#160;1, ins&#233;rer les quatre alin&#233;as suivants&#160;:</p><p style=\"text-align: justify;\">&#171;&#160;L&#8217;article&#160;36 du R&#232;glement est ainsi modifi&#233;&#160;:</p><p style=\"text-align: justify;\">&#171;&#160;1&#176;&#160;Le sixi&#232;me alin&#233;a est compl&#233;t&#233; par les mots&#160;: &#171;&#160;droit commercial&#160;;&#160;&#187;</p><p style=\"text-align: justify;\">&#171;&#160;2&#176;&#160;Le dix-huiti&#232;me alin&#233;a est ainsi modifi&#233;&#160;:</p><p style=\"text-align: justify;\"><i>&#171;&#160;a)</i>&#160;Le mot&#160;: &#171;&#160;,&#160;commercial&#160;&#187; est supprim&#233;&#160;;&#160;&#187;.&#160;&#187;</p><p style=\"text-align: justify;\">II.&#160;&#8211;&#160;En cons&#233;quence, au d&#233;but de l&#8217;alin&#233;a&#160;1, substituer aux mots&#160;:</p><p style=\"text-align: justify;\">&#171;&#160;Au dix&#8209;huiti&#232;me alin&#233;a de l&#8217;article&#160;36 du R&#232;glement,&#160;&#187;</p><p style=\"text-align: justify;\">la mention&#160;:</p><p style=\"text-align: justify;\">&#171;&#160;<i>b)</i>&#160;&#187;.</p>",
    "exposeSommaire": "<p>L'alin&#233;a 18 de l'article 36 du R&#232;glement d&#233;finit le p&#233;rim&#232;tre des comp&#233;tences de la commission des Lois dont le pr&#233;sent amendement propose de retirer le droit commercial au profit d'un traitement de ce champ par la commission des Affaires &#233;conomiques. Cette articulation appara&#238;t plus coh&#233;rente avec l'ensemble de comp&#233;tences actuel de la commission des Affaires &#233;conomiques qui couvre d&#233;j&#224; le commerce int&#233;rieur et ext&#233;rieur. Cet amendement tend &#233;galement &#224; r&#233;&#233;quilibrer la saisine des diff&#233;rentes commissions permanentes, la commission des Lois &#233;tant aujourd'hui saisie &#224; hauteur de la moiti&#233; des textes inscrits &#224; l'ordre du jour des travaux de notre assembl&#233;e.</p>"
  },
  "representations": [
    {
      "nom": "PDF",
      "typeMime": {
        "type": "application",
        "subType": "PDF"
      },
      "statutRepresentation": {
        "verbatim": true,
        "canonique": true,
        "officielle": true,
        "transcription": false,
        "enregistrement": false
      },
      "contenu": {
        "documentURI": "/15/amendements/1882/CION_LOIS/CL92.pdf"
      }
    }
  ],
  "sort": {
    "dateSaisie": "2019-05-15T12:39:26.000+02:00",
    "sortEnSeance": "Rejeté"
  },
  "dateDepot": "2019-05-09T02:00:00.000+02:00",
  "dateDistribution": "2019-05-14T02:00:00.000+02:00",
  "article99": "0",
  "loiReference": {
    "codeLoi": "2"
  }
}