{
  "uid": "AMANR5L15SEA717460BTC1767P0D1N145",
  "identifiant": {
    "legislature": "15",
    "numero": "145",
    "numRect": "0",
    "saisine": {
      "texteLegislatifRef": "PRJLANR5L15BTC1767",
      "numeroPartiePLF": "0",
      "organeExamen": "PO717460",
      "mentionSecondeDeliberation": "0"
    }
  },
  "numeroLong": "145",
  "etapeTexte": "1ère lecture (1ère assemblée saisie)",
  "triAmendement": "agaaaaaaaaaaaaaaaaaaaaaaaaaaaaaaaaaaaaaaaaaaaaaaaaar",
  "cardinaliteAmdtMultiples": "1",
  "etat": "Discuté",
  "signataires": {
    "auteur": {
      "typeAuteur": "Depute",
      "acteurRef": "PA721410",
      "groupePolitiqueRef": "PO730934"
    },
    "cosignatairesRefs": [
      "PA721410",
      "PA267260",
      "PA346218",
      "PA266793",
      "PA267735",
      "PA718850",
      "PA608826",
      "PA267429"
    ],
    "texteAffichable": "Mme&#160;Bonnivard,  M.&#160;Cordier, M.&#160;Bony, M.&#160;Masson, Mme&#160;Poletti, M.&#160;de Ganay, M.&#160;Cinieri et Mme&#160;Duby-Muller"
  },
  "pointeurFragmentTexte": {
    "division": {
      "titre": "Article 3",
      "articleDesignationCourte": "ART. 3",
      "type": "ARTICLE",
      "avantAApres": "A",
      "divisionRattachee": "ARTICLE 3",
      "urlDivisionTexteVise": "/15/textes/1767.asp#D_Article_3"
    }
  },
  "corps": {
    "dispositif": "<p style=\"text-align: justify;\">Supprimer cet article.</p>",
    "exposeSommaire": "<p style=\"text-align: justify;\">Cet article pr&#233;voit l&#8217;adoption par voie d&#8217;ordonnances des mesures de re-certification des comp&#233;tences des m&#233;decins en pr&#233;voyant des cons&#233;quences pour ces professionnels.</p><p style=\"text-align: justify;\">Face &#224; un sujet aussi sensible, il n&#8217;est pas tol&#233;rable d&#8217;avoir recours &#224; des ordonnances. C&#8217;est en ce sens que nous souhaitons la suppression de cet article.</p>"
  },
  "representations": [
    {
      "nom": "PDF",
      "typeMime": {
        "type": "application",
        "subType": "PDF"
      },
      "statutRepresentation": {
        "verbatim": true,
        "canonique": true,
        "officielle": true,
        "transcription": false,
        "enregistrement": false
      },
      "contenu": {
        "documentURI": "/15/amendements/1767/AN/145.pdf"
      }
    }
  ],
  "seanceDiscussion": "RUANR5L15S2019IDS21560",
  "sort": {
    "dateSaisie": "2019-03-19T23:52:13.000+01:00",
    "sortEnSeance": "Non soutenu"
  },
  "dateDepot": "2019-03-15T01:00:00.000+01:00",
  "dateDistribution": "2019-03-16T01:00:00.000+01:00",
  "article99": "0",
  "loiReference": {}
}