{
  "uid": "AMANR5L15SEA717460BTC0971P0D1N2088",
  "identifiant": {
    "legislature": "15",
    "numero": "2088",
    "numRect": "0",
    "saisine": {
      "texteLegislatifRef": "PRJLANR5L15BTC0971",
      "numeroPartiePLF": "0",
      "organeExamen": "PO717460",
      "mentionSecondeDeliberation": "0"
    }
  },
  "numeroLong": "2088",
  "etapeTexte": "1ère lecture (1ère assemblée saisie)",
  "triAmendement": "aaq",
  "cardinaliteAmdtMultiples": "1",
  "etat": "Discuté",
  "signataires": {
    "auteur": {
      "typeAuteur": "Depute",
      "acteurRef": "PA721270",
      "groupePolitiqueRef": "PO730940"
    },
    "cosignatairesRefs": [
      "PA722110",
      "PA335612",
      "PA689",
      "PA721270",
      "PA721118",
      "PA441",
      "PA721896",
      "PA718926",
      "PA720692",
      "PA721012",
      "PA610667",
      "PA718720",
      "PA722202",
      "PA720546",
      "PA267306",
      "PA610654"
    ],
    "texteAffichable": "M.&#160;Peu,  M.&#160;Wulfranc, M.&#160;Bruneel, Mme&#160;Bello, M.&#160;Brotherson, Mme&#160;Buffet, M.&#160;Chassaigne, M.&#160;Dharr&#233;ville, M.&#160;Dufr&#232;gne, Mme&#160;Faucillon, M.&#160;Jumel, Mme&#160;K&#233;clard-Mond&#233;sir, M.&#160;Lecoq, M.&#160;Nilor, M.&#160;Fabien&#160;Roussel et M.&#160;Serville"
  },
  "pointeurFragmentTexte": {
    "division": {
      "titre": "Article 28",
      "articleDesignationCourte": "ART. 28",
      "type": "ARTICLE",
      "avantAApres": "A",
      "divisionRattachee": "ARTICLE 28",
      "urlDivisionTexteVise": "/15/textes/0971.asp#D_Article_28"
    },
    "alinea": {
      "avantAApres": "A",
      "numero": "5",
      "alineaDesignation": "Alinéa 5"
    }
  },
  "corps": {
    "dispositif": "<p style=\"text-align: justify;\">Supprimer l&#8217;alin&#233;a&#160;5.</p>",
    "exposeSommaire": "<p style=\"text-align: justify;\">Cet amendement vise &#224; sortir du dispositif de l&#8217;article&#160;28 les soci&#233;t&#233;s anonymes de vente d&#8217;habitation &#224; loyer mod&#233;r&#233;.</p><p style=\"text-align: justify;\">En effet, la cr&#233;ation d&#8217;une soci&#233;t&#233; de vente d&#8217;habitation &#224; loyer mod&#233;r&#233; ne constitue pas une r&#233;ponse &#224; la p&#233;nurie de logements sociaux. Le logement social est avant tout le patrimoine de ceux qui n&#8217;en ont pas et donc ne doit pas faire l&#8217;objet de vente.</p><p style=\"text-align: justify;\">Ainsi, l&#8217;orientation prise par cet article de constituer des soci&#233;t&#233;s de vente s&#8217;apparente &#224; de la promotion immobili&#232;re, d&#233;voie les principes fondamentaux constitutifs du mod&#232;le social HLM. &#201;difier une nouvelle offre de logement social accessible ne peut se faire que par un investissement massif de l&#8217;&#201;tat dans la production de logement locatif social et en aucun cas par la vente de patrimoine.</p>"
  },
  "representations": [
    {
      "nom": "PDF",
      "typeMime": {
        "type": "application",
        "subType": "PDF"
      },
      "statutRepresentation": {
        "verbatim": true,
        "canonique": true,
        "officielle": true,
        "transcription": false,
        "enregistrement": false
      },
      "contenu": {
        "documentURI": "/15/amendements/0971/AN/2088.pdf"
      }
    }
  ],
  "seanceDiscussion": "RUANR5L15S2018IDS21114",
  "sort": {
    "dateSaisie": "2018-06-02T17:43:20.000+02:00",
    "sortEnSeance": "Rejeté"
  },
  "dateDepot": "2018-05-25T02:00:00.000+02:00",
  "dateDistribution": "2018-05-30T02:00:00.000+02:00",
  "article99": "0",
  "loiReference": {}
}