{
  "uid": "AMANR5L15PO744107B0424P0D1N480",
  "identifiant": {
    "legislature": "15",
    "numero": "480",
    "numRect": "0",
    "saisine": {
      "texteLegislatifRef": "PRJLANR5L15B0424",
      "numeroPartiePLF": "0",
      "organeExamen": "PO744107",
      "mentionSecondeDeliberation": "0"
    }
  },
  "numeroLong": "480",
  "etapeTexte": "1ère lecture (1ère assemblée saisie)",
  "triAmendement": "s",
  "cardinaliteAmdtMultiples": "1",
  "etat": "Discuté",
  "signataires": {
    "auteur": {
      "typeAuteur": "Depute",
      "acteurRef": "PA331567",
      "groupePolitiqueRef": "PO744425"
    },
    "cosignatairesRefs": [
      "PA331567"
    ],
    "texteAffichable": "Mme&#160;de La Raudi&#232;re"
  },
  "pointeurFragmentTexte": {
    "division": {
      "titre": "ANNEXE",
      "articleDesignationCourte": "ART. PREMIER",
      "type": "ANNEXE",
      "avantAApres": "A",
      "divisionRattachee": "ARTICLE PREMIER",
      "urlDivisionTexteVise": "/15/textes/0424.asp#D_Annexe"
    },
    "alinea": {
      "avantAApres": "Apres",
      "numero": "26"
    }
  },
  "corps": {
    "dispositif": "<p style=\"text-align: justify;\">Compl&#233;ter l&#8217;annexe par les cinq&#160;alin&#233;as suivants&#160;:</p><p style=\"text-align: justify;\">&#171;&#160;<b>C.&#160;Vers un pilotage par minist&#232;re de la charge normative</b></p><p style=\"text-align: justify;\">&#171;&#160;La politique de simplification en France souffre d&#8217;un manque de pilotage auquel il faut imp&#233;rativement rem&#233;dier afin d&#8217;acc&#233;der &#224; une soci&#233;t&#233; de confiance.</p><p style=\"text-align: justify;\">&#171;&#160;Un tableau de bord de pilotage de la charge normative sera rendu public par le gouvernement, et consultable en ligne&#160;: il d&#233;taillera par minist&#232;re les charges normatives cr&#233;&#233;es et les charges normatives supprim&#233;es &#224; compter du 1<sup>er</sup>&#160;mai 2017. Ce tableau de bord devra &#234;tre actualis&#233; au minimum tous les trois mois.</p><p style=\"text-align: justify;\">&#171;&#160;Toute nouvelle charge normative devra &#234;tre compens&#233;e par la suppression de deux charges normatives existantes dans le m&#234;me champ minist&#233;riel.</p><p style=\"text-align: justify;\">&#171;&#160;Des objectifs de r&#233;duction des charges seront fix&#233;s &#224; chaque minist&#232;re.&#160;&#187;</p>",
    "exposeSommaire": "<p>La politique de simplification en France souffre d&#8217;un manque de pilotage.</p><p>Comme le Royaume-Uni ou les Pays-Bas, la France doit installer une culture de l&#8217;&#233;valuation concr&#232;te des normes cr&#233;&#233;es et supprim&#233;es.</p><p>Cela doit &#234;tre inscrit dans la Strat&#233;gie nationale d&#8217;orientation de l&#8217;action publique.</p><p>Aussi, cet amendement propose que le gouvernement publie et permette la consultation en ligne, d&#8217;un tableau de bord, d&#233;taillant minist&#232;re par minist&#232;re, quelles ont &#233;t&#233; les charges normatives cr&#233;&#233;es, et les charges normatives supprim&#233;es &#224; compter de mai 2017. Le d&#233;tail de ces charges devra &#234;tre mentionn&#233;, et ce tableau de bord devra &#234;tre r&#233;actualis&#233; au moins tous les trois mois.</p><p>Chaque minist&#232;re se verra assigner un objectif de r&#233;duction des charges.</p><p>Par ailleurs, la r&#232;gle &#171;&#160;one in, two out&#160;&#187; qui a permis de mener &#224; bien la politique de simplification du Royaume-Unis, devra s&#8217;appliquer. Ainsi, toute nouvelle charge normative devra &#234;tre compens&#233;e par la suppression de deux charges normatives existantes dans le m&#234;me champ minist&#233;riel.</p><p>C&#8217;&#233;tait d&#8217;ailleurs la strat&#233;gie retenue dans la circulaire du Premier ministre du 26 juillet 2017 relative &#224; la ma&#238;trise du flux des textes r&#233;glementaires et de leur impact.</p><p>Au-del&#224; du simple nombre de normes, l&#8217;utilisation du terme &#171;&#160;charge normative&#160;&#187; incite le gouvernement &#224; qualifier ces normes en termes de co&#251;t (comme le font nos voisins europ&#233;ens) ou en termes de temps pass&#233; &#224; r&#233;aliser une d&#233;marche (pour les particuliers notamment).</p><p>Cet amendement est en parfaite coh&#233;rence avec la &#171;&#160;Strat&#233;gie nationale d&#8217;orientation de l&#8217;action publique&#160;&#187; annex&#233;e au projet de loi qui pr&#233;voit que &#171;&#160;Toute d&#233;cision publique prend en compte le co&#251;t qu&#8217;elle implique pour son auteur, ses destinataires et les tiers ainsi que la complexit&#233; des r&#232;gles particuli&#232;res qu&#8217;ils doivent appliquer et respecter&#160;&#187;.</p><p>&#160;</p>"
  },
  "representations": [
    {
      "nom": "PDF",
      "typeMime": {
        "type": "application",
        "subType": "PDF"
      },
      "statutRepresentation": {
        "verbatim": true,
        "canonique": true,
        "officielle": true,
        "transcription": false,
        "enregistrement": false
      },
      "contenu": {
        "documentURI": "/15/amendements/0424/CSCONF/480.pdf"
      }
    }
  ],
  "sort": {
    "dateSaisie": "2018-01-15T17:43:06.000+01:00",
    "sortEnSeance": "Non soutenu"
  },
  "dateDepot": "2018-01-11T01:00:00.000+01:00",
  "dateDistribution": "2018-01-15T01:00:00.000+01:00",
  "article99": "0",
  "loiReference": {}
}