{
  "uid": "AMANR5L15PO59051B1349P0D1N888",
  "identifiant": {
    "legislature": "15",
    "numero": "888",
    "numRect": "0",
    "saisine": {
      "texteLegislatifRef": "PRJLANR5L15B1349",
      "numeroPartiePLF": "0",
      "organeExamen": "PO59051",
      "mentionSecondeDeliberation": "0"
    }
  },
  "numeroLong": "CL888",
  "etapeTexte": "1ère lecture (2ème assemblée saisie)",
  "triAmendement": "elaaaaaaaaaaaaaaaaaaaaaaaaaaaaaaaaaaaaaaaaaaaaaaaaci",
  "cardinaliteAmdtMultiples": "1",
  "etat": "Discuté",
  "signataires": {
    "auteur": {
      "typeAuteur": "Depute",
      "acteurRef": "PA719202",
      "groupePolitiqueRef": "PO730964"
    },
    "cosignatairesRefs": [
      "PA719202"
    ],
    "texteAffichable": "M.&#160;Paris, rapporteur"
  },
  "pointeurFragmentTexte": {
    "division": {
      "titre": "Article 36",
      "articleDesignationCourte": "ART. 36",
      "type": "ARTICLE",
      "avantAApres": "A",
      "divisionRattachee": "ARTICLE 36",
      "urlDivisionTexteVise": "/15/textes/1349.asp#D_Article_36"
    },
    "alinea": {
      "numero": "6"
    }
  },
  "corps": {
    "dispositif": "<p style=\"text-align: justify;\">&#192; la seconde phrase de l&#8217;alin&#233;a&#160;6, substituer aux mots&#160;:</p><p style=\"text-align: justify;\">&#171;&#160;n&#8217;ont pas d&#8217;avocats&#160;&#187;</p><p style=\"text-align: justify;\">les mots&#160;:</p><p style=\"text-align: justify;\">&#171;&#160;ne sont pas assist&#233;es par un avocat&#160;&#187;.</p>",
    "exposeSommaire": "<p>Amendement de coh&#233;rence.</p>"
  },
  "representations": [
    {
      "nom": "PDF",
      "typeMime": {
        "type": "application",
        "subType": "PDF"
      },
      "statutRepresentation": {
        "verbatim": true,
        "canonique": true,
        "officielle": true,
        "transcription": false,
        "enregistrement": false
      },
      "contenu": {
        "documentURI": "/15/amendements/1349/CION_LOIS/CL888.pdf"
      }
    }
  ],
  "sort": {
    "dateSaisie": "2018-11-08T22:36:38.000+01:00",
    "sortEnSeance": "Adopté"
  },
  "dateDepot": "2018-11-06T01:00:00.000+01:00",
  "dateDistribution": "2018-11-07T01:00:00.000+01:00",
  "article99": "0",
  "loiReference": {}
}