{
  "uid": "AMANR5L15SEA717460B1649P0D1N5",
  "identifiant": {
    "legislature": "15",
    "numero": "5",
    "numRect": "0",
    "saisine": {
      "texteLegislatifRef": "PIONANR5L15B1649",
      "numeroPartiePLF": "0",
      "organeExamen": "PO717460",
      "mentionSecondeDeliberation": "0"
    }
  },
  "numeroLong": "5",
  "etapeTexte": "1ère lecture (1ère assemblée saisie)",
  "triAmendement": "kaaaaaaaaaaaaaaaaaaaaaaaaaaaaaaaaaaaaaaaaaaaaaaaaao",
  "cardinaliteAmdtMultiples": "1",
  "etat": "A discuter",
  "signataires": {
    "auteur": {
      "typeAuteur": "Depute",
      "acteurRef": "PA721410",
      "groupePolitiqueRef": "PO730934"
    },
    "cosignatairesRefs": [
      "PA267204",
      "PA267289",
      "PA1874",
      "PA267785",
      "PA998",
      "PA718780",
      "PA2529",
      "PA330909",
      "PA267260",
      "PA642847",
      "PA609726",
      "PA718884",
      "PA266793",
      "PA336316",
      "PA721070",
      "PA721816",
      "PA719318",
      "PA605036",
      "PA608016",
      "PA340853",
      "PA721410",
      "PA267324",
      "PA721054",
      "PA608826",
      "PA722390",
      "PA720684",
      "PA1029",
      "PA267735",
      "PA334843",
      "PA607090",
      "PA1327",
      "PA267527",
      "PA721968",
      "PA718838",
      "PA718850",
      "PA721474",
      "PA721506"
    ],
    "texteAffichable": "Mme&#160;Bonnivard,  M.&#160;Le Fur, M.&#160;Bony, Mme&#160;Corneloup, M.&#160;Brun, M.&#160;Saddier, M.&#160;Pierre-Henri&#160;Dumont, M.&#160;Leclerc, M.&#160;Lorion, M.&#160;de Ganay, M.&#160;Door, M.&#160;Bazin, M.&#160;Larriv&#233;, Mme&#160;Kuster, M.&#160;Cordier, M.&#160;Verch&#232;re, M.&#160;Viry, M.&#160;Jean-Pierre&#160;Vigier, Mme&#160;Bazin-Malgras, Mme&#160;Anthoine, M.&#160;Bouchet, M.&#160;Dassault, M.&#160;Abad, Mme&#160;Poletti, M.&#160;Deflesselles, Mme&#160;Louwagie, Mme&#160;Ramassamy, M.&#160;Gaultier, M.&#160;Boucard, Mme&#160;Duby-Muller, M.&#160;Descoeur, M.&#160;Sermier, M.&#160;Vialay, M.&#160;Reitzer, M.&#160;Forissier, M.&#160;Aubert et Mme&#160;Trastour-Isnart"
  },
  "pointeurFragmentTexte": {
    "division": {
      "titre": "Article 10",
      "articleDesignationCourte": "APRÈS ART. 10",
      "type": "ARTICLE",
      "avantAApres": "Apres",
      "divisionRattachee": "APRÈS L'ARTICLE 10, insérer l'article suivant:",
      "articleAdditionnel": "1",
      "urlDivisionTexteVise": "/15/textes/1649.asp#D_Article_10"
    }
  },
  "corps": {
    "dispositif": "<p style=\"text-align: justify;\">I.&#160;&#8211;&#160;La section&#160;1 du chapitre&#160;III du titre&#160;II du livre&#160;VII du code de la s&#233;curit&#233; int&#233;rieure est compl&#233;t&#233;e par un article&#160;L.&#160;723&#8209;1&#8209;1 ainsi r&#233;dig&#233;&#160;:</p><p style=\"text-align: justify;\">&#171;&#160;<i>Art.&#160;L.&#160;723&#8209;1&#8209;1</i>.&#160;&#8211;&#160;I.&#160;&#8211;&#160;Tout sapeur-pompier professionnel ou volontaire et tout militaire de la brigade des sapeurs-pompiers de Paris et du bataillon des marins-pompiers de Marseille, victime dans l&#8217;exercice de ses fonctions ou du fait de ses fonctions d&#8217;une atteinte volontaire &#224; l&#8217;int&#233;grit&#233; de sa personne, de violence, de menace, d&#8217;injure, de diffamation ou d&#8217;outrage, peut &#234;tre autoris&#233; &#224; ne pas &#234;tre identifi&#233; par ses nom et pr&#233;nom dans tous les actes de proc&#233;dure des instances civiles ou p&#233;nales engag&#233;es ou n&#233;cessaires &#224; la d&#233;fense de ses droits, lorsque la r&#233;v&#233;lation de son identit&#233; est susceptible, compte tenu des conditions d&#8217;exercice de ses missions ou de ses fonctions, des circonstances particuli&#232;res dans la commission des faits ou de la personnalit&#233; des personnes mises en cause, de mettre en danger sa vie ou son int&#233;grit&#233; physique ou celles de ses proches.</p><p style=\"text-align: justify;\">&#171;&#160;II.&#160;&#8211;&#160;L&#8217;autorisation est d&#233;livr&#233;e nominativement par le procureur de la R&#233;publique ou le juge d&#8217;instruction sur proposition du responsable hi&#233;rarchique d&#8217;un niveau suffisant, d&#233;fini par d&#233;cret, statuant par une d&#233;cision motiv&#233;e.</p><p style=\"text-align: justify;\">&#171;&#160;Cette autorisation permet &#224; l&#8217;agent qui en b&#233;n&#233;ficie d&#8217;&#234;tre identifi&#233; par un num&#233;ro d&#8217;immatriculation administrative.</p><p style=\"text-align: justify;\">&#171;&#160;Le b&#233;n&#233;ficiaire de l&#8217;autorisation est &#233;galement autoris&#233; &#224; d&#233;poser ou &#224; compara&#238;tre comme t&#233;moin au cours de l&#8217;enqu&#234;te ou devant les juridictions d&#8217;instruction ou de jugement et &#224; se constituer partie civile en utilisant ces m&#234;mes &#233;l&#233;ments d&#8217;identification, qui sont seuls mentionn&#233;s dans les proc&#232;s-verbaux, citations, convocations, ordonnances, jugements ou arr&#234;ts. Il ne peut &#234;tre fait &#233;tat de ses nom et pr&#233;nom au cours des audiences publiques.</p><p style=\"text-align: justify;\">&#171;&#160;Le&#160;I du pr&#233;sent article n&#8217;est pas applicable lorsque, en raison d&#8217;un acte commis dans l&#8217;exercice de ses fonctions, le b&#233;n&#233;ficiaire de l&#8217;autorisation est entendu en application des articles 61&#8209;1 ou 62&#8209;2 du code de proc&#233;dure p&#233;nale ou qu&#8217;il fait l&#8217;objet de poursuites p&#233;nales.&#160;&#187;</p>",
    "exposeSommaire": "<p style=\"text-align: justify;\">Cet amendement vise &#224; permettre l&#8217;anonymat lors d&#8217;un d&#233;p&#244;t de plainte &#224; la suite d&#8217;agressions subies par les sapeur-pompiers lors de leurs interventions.</p><p style=\"text-align: justify;\">En effet, alors que les sapeurs-pompiers sont trop souvent victimes d&#8217;agressions au cours de leurs interventions, ils ne b&#233;n&#233;ficient pas de la m&#234;me protection que celle accord&#233;e aux forces de police ou de gendarmerie.</p><p style=\"text-align: justify;\">Permettre le d&#233;p&#244;t de plainte de fa&#231;on anonyme pour les sapeurs-pompiers, en maintenant l&#8217;identification par matricule, &#233;vitera de les dissuader de d&#233;poser plainte.</p>"
  },
  "representations": [
    {
      "nom": "PDF",
      "typeMime": {
        "type": "application",
        "subType": "PDF"
      },
      "statutRepresentation": {
        "verbatim": true,
        "canonique": true,
        "officielle": true,
        "transcription": false,
        "enregistrement": false
      },
      "contenu": {
        "documentURI": "/15/amendements/1649/AN/5.pdf"
      }
    }
  ],
  "dateDepot": "2019-03-27T01:00:00.000+01:00",
  "dateDistribution": "2019-04-02T02:00:00.000+02:00",
  "article99": "0",
  "loiReference": {
    "codeLoi": "c sécurité intérieure",
    "divisionCodeLoi": "L723-1-1"
  }
}