{
  "uid": "AMANR5L15PO419865B1831P0D1N1094",
  "identifiant": {
    "legislature": "15",
    "numero": "1094",
    "numRect": "0",
    "saisine": {
      "texteLegislatifRef": "PRJLANR5L15B1831",
      "numeroPartiePLF": "0",
      "organeExamen": "PO419865",
      "mentionSecondeDeliberation": "0"
    }
  },
  "numeroLong": "CD1094",
  "etapeTexte": "1ère lecture (2ème assemblée saisie)",
  "triAmendement": "fbaaaaaaaaaaaaaaaaaaaaaaaaaaaaaaaaaaaaaaaaaaaaaaaau",
  "cardinaliteAmdtMultiples": "1",
  "etat": "Discuté",
  "signataires": {
    "auteur": {
      "typeAuteur": "Rapporteur",
      "acteurRef": "PA722038",
      "organeRef": "PO419610",
      "groupePolitiqueRef": "PO730964"
    },
    "cosignatairesRefs": [
      "PA722038"
    ],
    "texteAffichable": "M.&#160;Damien&#160;Adam, rapporteur pour avis au nom de la commission des affaires &#233;conomiques"
  },
  "pointeurFragmentTexte": {
    "division": {
      "titre": "Article 25 bis",
      "articleDesignationCourte": "APRÈS ART. 25 BIS",
      "type": "ARTICLE",
      "avantAApres": "Apres",
      "divisionRattachee": "APRÈS L'ARTICLE 25 BIS, insérer l'article suivant:",
      "articleAdditionnel": "1",
      "urlDivisionTexteVise": "/15/textes/1831.asp#D_Article_25_bis"
    }
  },
  "corps": {
    "dispositif": "<p style=\"text-align: justify;\">&#192; la fin de l'article L.&#160;151&#8209;31 du code de l&#8217;urbanisme, les mots&#160;: &#171;&#160;, dans des conditions d&#233;finies par d&#233;cret&#160;&#187; sont supprim&#233;s.</p>",
    "exposeSommaire": "<p>Cet amendement vise &#224; rendre op&#233;rationnelle une mesure non-appliqu&#233;e de la loi de 2015 relative &#224; la transition &#233;nerg&#233;tique permettant de r&#233;duire de 15&#160;% les obligations r&#233;glementaires de construction de parkings dans les immeubles neufs dans le cas o&#249; des v&#233;hicules &#233;lectriques dot&#233;es de bornes ou des v&#233;hicules propres en auto-partage sont mis &#224; disposition par le promoteur.</p><p style=\"text-align: justify;\">Cette mesure n&#8217;est toujours pas appliqu&#233;e en raison de l&#8217;absence de publication du d&#233;cret d&#8217;application pr&#233;vue par la loi. Il ressort des &#233;changes que ce d&#233;cret n&#8217;est en r&#233;alit&#233; pas n&#233;cessaire, chaque r&#232;glement de plan local d&#8217;urbanisme pouvant d&#233;terminer les modalit&#233;s d&#8217;application de cette mesure.</p>"
  },
  "representations": [
    {
      "nom": "PDF",
      "typeMime": {
        "type": "application",
        "subType": "PDF"
      },
      "statutRepresentation": {
        "verbatim": true,
        "canonique": true,
        "officielle": true,
        "transcription": false,
        "enregistrement": false
      },
      "contenu": {
        "documentURI": "/15/amendements/1831/CION-DVP/CD1094.pdf"
      }
    }
  ],
  "sort": {
    "dateSaisie": "2019-05-17T22:22:06.000+02:00",
    "sortEnSeance": "Adopté"
  },
  "dateDepot": "2019-05-07T02:00:00.000+02:00",
  "dateDistribution": "2019-05-16T02:00:00.000+02:00",
  "article99": "0",
  "loiReference": {}
}