{
  "uid": "AMANR5L15SEA717460BTC0902P0D1N2518",
  "identifiant": {
    "legislature": "15",
    "numero": "2518",
    "numRect": "0",
    "saisine": {
      "texteLegislatifRef": "PRJLANR5L15BTC0902",
      "numeroPartiePLF": "0",
      "organeExamen": "PO717460",
      "mentionSecondeDeliberation": "0"
    }
  },
  "numeroLong": "2518",
  "etapeTexte": "1ère lecture (1ère assemblée saisie)",
  "triAmendement": "bi",
  "cardinaliteAmdtMultiples": "1",
  "etat": "Discuté",
  "signataires": {
    "auteur": {
      "typeAuteur": "Depute",
      "acteurRef": "PA720092",
      "groupePolitiqueRef": "PO730970"
    },
    "cosignatairesRefs": [
      "PA720598",
      "PA720976",
      "PA722162",
      "PA719938",
      "PA720092",
      "PA719504",
      "PA720162"
    ],
    "texteAffichable": "M.&#160;Ramos,  M.&#160;Turquois, M.&#160;Fesneau, M.&#160;Bolo, Mme&#160;Deprez-Audebert, M.&#160;Mathiasin, M.&#160;Lagleize et les membres du groupe du Mouvement D&#233;mocrate et apparent&#233;s"
  },
  "pointeurFragmentTexte": {
    "division": {
      "titre": "Chapitre Ier",
      "articleDesignationCourte": "AVANT ART. 11",
      "type": "CHAPITRE",
      "avantAApres": "A",
      "divisionRattachee": "AVANT  L'ARTICLE 11",
      "urlDivisionTexteVise": "/15/textes/0902.asp#D_Chapitre_Ier_25"
    }
  },
  "corps": {
    "dispositif": "<p style=\"text-align: justify;\">&#192; l&#8217;intitul&#233; du titre II, apr&#232;s le mot&#160;:</p><p style=\"text-align: justify;\">&#171;&#160;durable&#160;&#187;</p><p style=\"text-align: justify;\">ins&#233;rer les mots&#160;:</p><p style=\"text-align: justify;\">&#171;&#160;, accessible &#224; tous&#160;&#187;.</p>",
    "exposeSommaire": "<p style=\"text-align: justify;\">Un travail de r&#233;flexion et de concertation a &#233;t&#233; engag&#233; lors des &#201;tats G&#233;n&#233;raux de l&#8217;Alimentation qui ont suscit&#233; un grand int&#233;r&#234;t chez les agriculteurs. Les EGA ont repr&#233;sent&#233; 5 mois de travail et 14 ateliers nationaux auxquels ont &#233;t&#233; associ&#233;es toutes les parties prenantes.</p><p style=\"text-align: justify;\">Ces ateliers ont &#233;t&#233; r&#233;partis en deux chantiers, le premier relatif &#224; la cr&#233;ation et la r&#233;partition de la valeur et le deuxi&#232;me intitul&#233; &#171;&#160;une alimentation saine, s&#251;re, durable et accessible &#224; tous&#160;&#187;.</p><p style=\"text-align: justify;\">Dans un souci de coh&#233;rence avec les EGA, cet amendement propose de reprendre les mots &#171;&#160;accessible &#224; tous&#160;&#187;. Les travaux r&#233;alis&#233;s durant ces 5 mois ainsi que le pr&#233;sent projet de loi avaient, en effet, pour objectif de s&#8217;assurer que chacun puisse avoir acc&#232;s &#224; une alimentation suffisante et de qualit&#233; en France et dans le monde.</p>"
  },
  "representations": [
    {
      "nom": "PDF",
      "typeMime": {
        "type": "application",
        "subType": "PDF"
      },
      "statutRepresentation": {
        "verbatim": true,
        "canonique": true,
        "officielle": true,
        "transcription": false,
        "enregistrement": false
      },
      "contenu": {
        "documentURI": "/15/amendements/0902/AN/2518.pdf"
      }
    }
  ],
  "seanceDiscussion": "RUANR5L15S2018IDS21055",
  "sort": {
    "dateSaisie": "2018-05-25T19:36:10.000+02:00",
    "sortEnSeance": "Adopté"
  },
  "dateDepot": "2018-05-17T02:00:00.000+02:00",
  "dateDistribution": "2018-05-22T02:00:00.000+02:00",
  "article99": "0",
  "loiReference": {}
}