{
  "uid": "AMANR5L15SEA717460BTC1662P0D1N135",
  "identifiant": {
    "legislature": "15",
    "numero": "135",
    "numRect": "0",
    "saisine": {
      "texteLegislatifRef": "PIONANR5L15BTC1662",
      "numeroPartiePLF": "0",
      "organeExamen": "PO717460",
      "mentionSecondeDeliberation": "1"
    }
  },
  "numeroLong": "135",
  "etapeTexte": "1ère lecture (2ème assemblée saisie)",
  "triAmendement": "daaaaaaaaaaaaaaaaaaaaaaaaaaaaaaaaaaaaaaaaaaaaaaaaaco",
  "cardinaliteAmdtMultiples": "1",
  "etat": "Discuté",
  "signataires": {
    "auteur": {
      "typeAuteur": "Depute",
      "acteurRef": "PA608016",
      "groupePolitiqueRef": "PO730934"
    },
    "cosignatairesRefs": [
      "PA721054",
      "PA1327",
      "PA330684",
      "PA720684",
      "PA1012",
      "PA709315",
      "PA1029",
      "PA722390",
      "PA608016"
    ],
    "texteAffichable": "Mme&#160;Louwagie,  M.&#160;Deflesselles, M.&#160;Pierre-Henri&#160;Dumont, Mme&#160;Val&#233;rie&#160;Boyer, M.&#160;de la Verpilli&#232;re, Mme&#160;Corneloup, M.&#160;Lorion, M.&#160;Forissier et M.&#160;Viala"
  },
  "pointeurFragmentTexte": {
    "division": {
      "titre": "Article 5",
      "articleDesignationCourte": "APRÈS ART. 5",
      "type": "ARTICLE",
      "avantAApres": "Apres",
      "divisionRattachee": "APRÈS L'ARTICLE 5, insérer l'article suivant:",
      "articleAdditionnel": "1",
      "urlDivisionTexteVise": "/15/textes/1662.asp#D_Article_5"
    }
  },
  "corps": {
    "dispositif": "<p style=\"text-align: justify;\">Le chapitre II du titre III du livre II de la premi&#232;re partie du code g&#233;n&#233;ral des collectivit&#233;s territoriales, tel qu&#8217;il r&#233;sulte de la pr&#233;sente loi, est compl&#233;t&#233; par un article L.&#160;1232&#8209;4 ainsi r&#233;dig&#233;&#160;:</p><p style=\"text-align: justify;\">&#171;&#160;<i>Art.&#160;L.&#160;1232&#8209;4</i>.&#160;&#8211;&#160;L&#8217;Agence nationale de la coh&#233;sion des territoires a la possibilit&#233; de passer des contrats d&#8217;objectifs et de moyens avec les conseils d&#233;partementaux, dans des conditions d&#233;finies par d&#233;cret, afin de confier des missions aux agences d&#233;partementales d&#8217;ing&#233;nierie pr&#233;sentes dans les d&#233;partements et d&#8217;utiliser leurs comp&#233;tences.&#160;&#187;</p>",
    "exposeSommaire": "<p>Les d&#233;partements jouissent aujourd&#8217;hui d&#8217;une v&#233;ritable expertise en mati&#232;re d&#8217;ing&#233;nierie. Aussi, il est fondamental de continuer &#224; s&#8217;appuyer sur cette ressource dont b&#233;n&#233;ficient les territoires et de mobiliser les ressources locales. C'est la raison pour laquelle - afin d'&#233;viter les doublons entre structures et pour favoriser la coh&#233;rence entre les actions initi&#233;es par celles-ci - il faut pr&#233;voir la possibilit&#233; de passer des contrats d'objectifs et de moyens entre l&#8217;&#201;tat et les d&#233;partements visant &#224; confier aux agences d&#233;partementales des missions pour le compte de l&#8217;agence nationale de coh&#233;sion des territoires. Tel est l&#8217;objet de cet amendement.</p>"
  },
  "representations": [
    {
      "nom": "PDF",
      "typeMime": {
        "type": "application",
        "subType": "PDF"
      },
      "statutRepresentation": {
        "verbatim": true,
        "canonique": true,
        "officielle": true,
        "transcription": false,
        "enregistrement": false
      },
      "contenu": {
        "documentURI": "/15/amendements/1662/AN/135.pdf"
      }
    }
  ],
  "seanceDiscussion": "RUANR5L15S2019IDS21545",
  "sort": {
    "dateSaisie": "2019-03-13T01:40:58.000+01:00",
    "sortEnSeance": "Non soutenu"
  },
  "dateDepot": "2019-02-18T01:00:00.000+01:00",
  "dateDistribution": "2019-03-08T01:00:00.000+01:00",
  "article99": "0",
  "loiReference": {
    "codeLoi": "CGCT",
    "divisionCodeLoi": "L1232-4"
  }
}