{
  "uid": "AMANR5L15PO419610B0846P0D1N1380",
  "identifiant": {
    "legislature": "15",
    "numero": "1380",
    "numRect": "0",
    "saisine": {
      "texteLegislatifRef": "PRJLANR5L15B0846",
      "numeroPartiePLF": "0",
      "organeExamen": "PO419610",
      "mentionSecondeDeliberation": "0"
    }
  },
  "numeroLong": "CE1380",
  "etapeTexte": "1ère lecture (1ère assemblée saisie)",
  "triAmendement": "bo",
  "cardinaliteAmdtMultiples": "1",
  "etat": "Discuté",
  "signataires": {
    "auteur": {
      "typeAuteur": "Depute",
      "acteurRef": "PA268019",
      "groupePolitiqueRef": "PO744425"
    },
    "cosignatairesRefs": [
      "PA267585",
      "PA267766",
      "PA267780",
      "PA266788",
      "PA610775",
      "PA267042",
      "PA267330",
      "PA268019",
      "PA720230",
      "PA720696",
      "PA332228",
      "PA719806",
      "PA721094",
      "PA1960"
    ],
    "texteAffichable": "M.&#160;Lagarde,  Mme&#160;Auconie, M.&#160;Benoit, M.&#160;Guy&#160;Bricout, Mme&#160;Descamps, M.&#160;Dunoyer, M.&#160;Favennec Becot, Mme&#160;Firmin Le Bodo, M.&#160;Gom&#232;s, M.&#160;Leroy, Mme&#160;Magnier, M.&#160;Morel-&#192;-L&apos;Huissier, M.&#160;Vercamer et M.&#160;Zumkeller"
  },
  "pointeurFragmentTexte": {
    "division": {
      "titre": "Article 57",
      "articleDesignationCourte": "ART. 57",
      "type": "ARTICLE",
      "avantAApres": "A",
      "divisionRattachee": "ARTICLE 57",
      "urlDivisionTexteVise": "/15/textes/0846.asp#D_Article_57"
    },
    "alinea": {
      "avantAApres": "A",
      "numero": "31",
      "alineaDesignation": "Alinéa 31"
    }
  },
  "corps": {
    "dispositif": "<p style=\"text-align: justify;\">I.&#160;&#8211;&#160;Supprimer la seconde phrase de l&#8217;alin&#233;a&#160;31.</p><p style=\"text-align: justify;\">II.&#160;&#8211;&#160;En cons&#233;quence, &#224; la premi&#232;re phrase de l&#8217;alin&#233;a&#160;32, apr&#232;s le mot&#160;:</p><p style=\"text-align: justify;\">&#171;&#160;maire&#160;&#187;,</p><p style=\"text-align: justify;\">supprimer les mots&#160;:</p><p style=\"text-align: justify;\">*&#171;&#160;ou, le cas &#233;ch&#233;ant, le pr&#233;sident de l&#8217;&#233;tablissement public de coop&#233;ration intercommunale&#160;&#187;.</p>",
    "exposeSommaire": "<p style=\"text-align: justify;\">L&#8217;astreinte vers&#233;e suite &#224; un arr&#234;t&#233; de p&#233;ril doit &#234;tre vers&#233;e par d&#233;faut au maire, et non au pr&#233;sident de l&#8217;EPCI. En effet, c&#8217;est le maire qui peut, au plus pr&#232;s du terrain, rep&#233;rer les situations d&#8217;habitat indigne et c&#8217;est la commune qui effectue le travail de surveillance et de contr&#244;le. Il est donc logique que le produit des astreintes lui revienne.</p>"
  },
  "representations": [
    {
      "nom": "PDF",
      "typeMime": {
        "type": "application",
        "subType": "PDF"
      },
      "statutRepresentation": {
        "verbatim": true,
        "canonique": true,
        "officielle": true,
        "transcription": false,
        "enregistrement": false
      },
      "contenu": {
        "documentURI": "/15/amendements/0846/CION-ECO/CE1380.pdf"
      }
    }
  ],
  "sort": {
    "dateSaisie": "2018-05-18T23:54:49.000+02:00",
    "sortEnSeance": "Non soutenu"
  },
  "dateDepot": "2018-05-09T02:00:00.000+02:00",
  "dateDistribution": "2018-05-15T02:00:00.000+02:00",
  "article99": "0",
  "loiReference": {}
}