{
  "uid": "AMANR5L15PO59048B1737P0D1N139",
  "identifiant": {
    "legislature": "15",
    "numero": "139",
    "numRect": "0",
    "saisine": {
      "texteLegislatifRef": "PRJLANR5L15B1737",
      "numeroPartiePLF": "0",
      "organeExamen": "PO59048",
      "mentionSecondeDeliberation": "0"
    }
  },
  "numeroLong": "CF139",
  "etapeTexte": "1ère lecture (1ère assemblée saisie)",
  "triAmendement": "caaaaaaaaaaaaaaaaaaaaaaaaaaaaaaaaaaaaaaaaaaaaaaaaazvh",
  "cardinaliteAmdtMultiples": "1",
  "etat": "Discuté",
  "signataires": {
    "auteur": {
      "typeAuteur": "Depute",
      "acteurRef": "PA721194",
      "groupePolitiqueRef": "PO744425"
    },
    "cosignatairesRefs": [
      "PA721632",
      "PA720230",
      "PA721194"
    ],
    "texteAffichable": "Mme&#160;Fr&#233;d&#233;rique&#160;Dumas,  Mme&#160;Magnier et Mme&#160;Lemoine"
  },
  "pointeurFragmentTexte": {
    "division": {
      "titre": "Article PREMIER",
      "articleDesignationCourte": "ART. PREMIER",
      "type": "ARTICLE",
      "avantAApres": "A",
      "divisionRattachee": "ARTICLE PREMIER",
      "urlDivisionTexteVise": "/15/textes/1737.asp#D_Article_1er"
    },
    "alinea": {
      "avantAApres": "Apres",
      "numero": "64"
    }
  },
  "corps": {
    "dispositif": "<p>Apr&#232;s l&#8217;alin&#233;a&#160;64, ins&#233;rer les trois ali&#233;nas suivants&#160;:</p><p style=\"text-align: justify;\">&#171;&#160;Le montant de la taxe &#224; acquitter par une entreprise redevable de cette taxe est r&#233;duit par l&#8217;imputation sur la taxe calcul&#233;e en application du I d&#8217;un cr&#233;dit de taxe correspondant &#224; l&#8217;imp&#244;t sur les soci&#233;t&#233;s d&#251; par cette m&#234;me entreprise, soumise &#224; cet imp&#244;t en application de l&#8217;article&#160;209 I du code g&#233;n&#233;ral des imp&#244;ts ou par toute entreprise qui, en application de l&#8217;article&#160;223 A du m&#234;me code, se sera constitu&#233;e seule redevable de cet imp&#244;t avec les soci&#233;t&#233;s dont elle d&#233;tient 95&#160;% au moins du capital. Dans ce dernier cas, la soci&#233;t&#233; m&#232;re du groupe fiscal int&#233;gr&#233; selon les articles 223 A &#224; 223 U du code g&#233;n&#233;ral des imp&#244;ts sera seule redevable de la taxe pr&#233;vue &#224; l&#8217;article&#160;299 du code g&#233;n&#233;ral des imp&#244;ts &#224; raison de l&#8217;ensemble des taxes dues par les soci&#233;t&#233;s membres du groupe fiscal int&#233;gr&#233;. Les soci&#233;t&#233;s filiales, membres du groupe fiscal int&#233;gr&#233;, verseront &#224; la soci&#233;t&#233; m&#232;re la taxe due par chacune d&#8217;entre elle, sous d&#233;duction d&#8217;un cr&#233;dit de taxe, correspondant &#224; l&#8217;imp&#244;t sur les soci&#233;t&#233;s dont elles seraient redevables seules, si elles n&#8217;&#233;taient pas int&#233;gr&#233;es.</p><p style=\"text-align: justify;\">&#171;&#160;Le cr&#233;dit de taxe ainsi calcul&#233; sera imput&#233; dans la d&#233;claration pr&#233;vue &#224; l&#8217;article&#160;300 I 1&#176; du code g&#233;n&#233;ral des imp&#244;ts pour les redevables soumis &#224; un r&#233;gime r&#233;el d&#8217;imposition ou pour la soci&#233;t&#233; m&#232;re d&#8217;un groupe fiscal int&#233;gr&#233; et dans les conditions pr&#233;vues au 2&#176; et 3&#176; du m&#234;me article pour les autres redevables. &#160;</p><p style=\"text-align: justify;\">&#171;&#160;Le cr&#233;dit de taxe qui exc&#232;de le montant de la taxe calcul&#233;e en application du I de l&#8217;article&#160;299 du code g&#233;n&#233;ral des imp&#244;ts et du premier alin&#233;a du II de l&#8217;article&#160;299 <i>quater</i> du m&#234;me code n&#8217;est ni remboursable ni reportable.&#160;&#187;</p>",
    "exposeSommaire": "<p>Les acteurs de l&#8217;&#233;conomie num&#233;rique fran&#231;ais et europ&#233;ens, qui paient d&#233;j&#224; leur part d&#8217;imp&#244;t sur les soci&#233;t&#233;s en France et dans les autres &#201;tats de l&#8217;UE, s&#8217;inqui&#232;tent de la charge d&#8217;imp&#244;t suppl&#233;mentaire que la taxe peut cr&#233;er. Diff&#233;rentes solutions peuvent &#234;tre envisag&#233;es afin d&#8217;en att&#233;nuer les effets n&#233;gatifs sans que cette att&#233;nuation n&#8217;&#233;limine pour autant l&#8217;int&#233;r&#234;t du dispositif.</p><p style=\"text-align: justify;\">Cet amendement propose que le montant de l&#8217;IS d&#233;j&#224; pay&#233; par le m&#234;me contribuable puisse r&#233;duire, par le m&#233;canisme de l&#8217;imputation, le montant de la taxe sur les services num&#233;riques due, dans la limite du montant de cette m&#234;me taxe.</p><p style=\"text-align: justify;\">Cette option permet de neutraliser le risque de double imposition que repr&#233;sente la taxe sur les services num&#233;riques sans pour autant poser de probl&#233;matique nouvelle vis-&#224;-vis des conventions fiscales internationales.</p>"
  },
  "representations": [
    {
      "nom": "PDF",
      "typeMime": {
        "type": "application",
        "subType": "PDF"
      },
      "statutRepresentation": {
        "verbatim": true,
        "canonique": true,
        "officielle": true,
        "transcription": false,
        "enregistrement": false
      },
      "contenu": {
        "documentURI": "/15/amendements/1737/CION_FIN/CF139.pdf"
      }
    }
  ],
  "sort": {
    "dateSaisie": "2019-04-03T18:09:26.000+02:00",
    "sortEnSeance": "Rejeté"
  },
  "dateDepot": "2019-03-29T01:00:00.000+01:00",
  "dateDistribution": "2019-04-02T02:00:00.000+02:00",
  "article99": "0",
  "loiReference": {}
}