{
  "uid": "AMANR5L15SEA717460BTC2243P0D1N950",
  "identifiant": {
    "legislature": "15",
    "numero": "950",
    "numRect": "0",
    "saisine": {
      "texteLegislatifRef": "PRJLANR5L15BTC2243",
      "numeroPartiePLF": "0",
      "organeExamen": "PO717460",
      "mentionSecondeDeliberation": "0"
    }
  },
  "numeroLong": "950",
  "etapeTexte": "1ère lecture (1ère assemblée saisie)",
  "triAmendement": "amaaaaaaaaaaaaaaaaaaaaaaaaaaaaaaaaaaaaaaaaaaaaaaaaikkn",
  "cardinaliteAmdtMultiples": "1",
  "etat": "Discuté",
  "signataires": {
    "auteur": {
      "typeAuteur": "Depute",
      "acteurRef": "PA1874",
      "groupePolitiqueRef": "PO730934"
    },
    "cosignatairesRefs": [
      "PA1874",
      "PA609726",
      "PA608016",
      "PA2492",
      "PA330684"
    ],
    "texteAffichable": "M.&#160;Le Fur,  Mme&#160;Val&#233;rie&#160;Boyer, Mme&#160;Louwagie, M.&#160;Quentin et M.&#160;Aubert"
  },
  "pointeurFragmentTexte": {
    "division": {
      "titre": "Article 3",
      "articleDesignationCourte": "AVANT ART. 3",
      "type": "ARTICLE",
      "avantAApres": "Avant",
      "divisionRattachee": "AVANT L'ARTICLE 3, insérer l'article suivant:",
      "articleAdditionnel": "1",
      "urlDivisionTexteVise": "/15/textes/2243.asp#D_Article_3"
    }
  },
  "corps": {
    "dispositif": "<p>Apr&#232;s l&#8217;article&#160;8 du code civil, il est ins&#233;r&#233; un article&#160;8&#8209;1 ainsi r&#233;dig&#233;&#160;:</p><p style=\"text-align: justify;\">&#171;&#160;<i>Art.&#160;8&#8209;1</i>.&#160;&#8211;&#160;L&#8217;enfant a droit &#224; la protection. La loi lui assure l&#8217;interdiction de toute atteinte &#224; sa dignit&#233;, &#224; son int&#233;grit&#233; physique et morale et garantit sp&#233;cialement le respect qui est d&#251; &#224; sa personne.&#160;&#187;</p>",
    "exposeSommaire": "<p style=\"text-align: justify;\">Les textes internationaux et europ&#233;ens invitent &#224; prot&#233;ger l&#8217;enfant et &#224; tenir son int&#233;r&#234;t sup&#233;rieur pour une consid&#233;ration primordiale.</p><p style=\"text-align: justify;\">La r&#233;f&#233;rence &#224; l&#8217;int&#233;r&#234;t sup&#233;rieur de l&#8217;enfant dans ces trait&#233;s renvoie &#224; l&#8217;objectif de protection de l&#8217;enfant &#224; l&#8217;&#233;chelle internationale.</p><p style=\"text-align: justify;\">La loi fran&#231;aise doit consacrer le m&#234;me concept&#160;: l&#8217;int&#233;r&#234;t sup&#233;rieur de l&#8217;enfant. Tel est l&#8217;objet de cet amendement.</p>"
  },
  "representations": [
    {
      "nom": "PDF",
      "typeMime": {
        "type": "application",
        "subType": "PDF"
      },
      "statutRepresentation": {
        "verbatim": true,
        "canonique": true,
        "officielle": true,
        "transcription": false,
        "enregistrement": false
      },
      "contenu": {
        "documentURI": "/15/amendements/2243/AN/950.pdf"
      }
    }
  ],
  "seanceDiscussion": "RUANR5L15S2019IDS21834",
  "sort": {
    "dateSaisie": "2019-09-27T22:05:41.000+02:00",
    "sortEnSeance": "Non soutenu"
  },
  "dateDepot": "2019-09-18T02:00:00.000+02:00",
  "dateDistribution": "2019-09-24T02:00:00.000+02:00",
  "article99": "0",
  "loiReference": {
    "codeLoi": "c civil",
    "divisionCodeLoi": "8-1"
  }
}