{
  "uid": "AMANR5L15SEA717460BTC1019P0D1N577",
  "identifiant": {
    "legislature": "15",
    "numero": "577",
    "numRect": "0",
    "saisine": {
      "texteLegislatifRef": "PRJLANR5L15BTC1019",
      "numeroPartiePLF": "0",
      "organeExamen": "PO717460",
      "mentionSecondeDeliberation": "0"
    }
  },
  "numeroLong": "577",
  "etapeTexte": "1ère lecture (1ère assemblée saisie)",
  "triAmendement": "bjrhm",
  "cardinaliteAmdtMultiples": "1",
  "etat": "Discuté",
  "signataires": {
    "auteur": {
      "typeAuteur": "Depute",
      "acteurRef": "PA332523",
      "groupePolitiqueRef": "PO730934"
    },
    "cosignatairesRefs": [
      "PA266797",
      "PA267204",
      "PA1874",
      "PA720684",
      "PA720100",
      "PA608416",
      "PA721410",
      "PA340853",
      "PA266793",
      "PA330684",
      "PA332523",
      "PA346054",
      "PA346218",
      "PA606712"
    ],
    "texteAffichable": "Mme&#160;Dalloz,  Mme&#160;Bonnivard, M.&#160;Bony, M.&#160;Pradi&#233;, M.&#160;Pierre-Henri&#160;Dumont, M.&#160;Leclerc, M.&#160;Hetzel, Mme&#160;Val&#233;rie&#160;Boyer, M.&#160;Le Fur, M.&#160;Emmanuel&#160;Maquet, M.&#160;Gosselin, M.&#160;Sermier, M.&#160;Masson et M.&#160;Lurton"
  },
  "pointeurFragmentTexte": {
    "division": {
      "titre": "Article 8",
      "articleDesignationCourte": "ART. 8",
      "type": "ARTICLE",
      "avantAApres": "A",
      "divisionRattachee": "ARTICLE 8",
      "urlDivisionTexteVise": "/15/textes/1019.asp#D_Article_8"
    },
    "alinea": {
      "numero": "44"
    }
  },
  "corps": {
    "dispositif": "<p style=\"text-align: justify;\">I.&#160;&#8211;&#160;&#192; la premi&#232;re phrase de l'alin&#233;a&#160;44, apr&#232;s le mot&#160;:</p><p style=\"text-align: justify;\">&#171;&#160;apprentissage&#160;&#187;,</p><p style=\"text-align: justify;\">ins&#233;rer les mots&#160;:</p><p style=\"text-align: justify;\">&#171;&#160;mentionn&#233; &#224; l'article L.&#160;6223-5&#160;&#187;</p><p style=\"text-align: justify;\">II.&#160;&#8211;&#160;En cons&#233;quence, &#224; la m&#234;me phrase, apr&#232;s le mot&#160;:</p><p style=\"text-align: justify;\">&#171;&#160;entreprise,&#160;&#187;,</p><p style=\"text-align: justify;\">ins&#233;rer les mots&#160;:</p><p style=\"text-align: justify;\">&#171;&#160;b&#233;n&#233;vole au sein d'une structure &#224; forme associative, mutualiste ou soci&#233;t&#233; coop&#233;rative d'int&#233;r&#234;t collectif,&#160;&#187;</p>",
    "exposeSommaire": "<p style=\"text-align: justify;\">Le d&#233;veloppement de l&#8217;apprentissage dans le secteur associatif peut &#234;tre entrav&#233; par la difficult&#233; de d&#233;signation d&#8217;un ma&#238;tre d&#8217;apprentissage.</p><p style=\"text-align: justify;\">Dans les petites structures, qui comptent peu ou pas de salari&#233;s, la seule personne susceptible d&#8217;assurer l&#8217;encadrement d&#8217;un apprenti et de poss&#233;der les comp&#233;tences et l&#8217;exp&#233;rience requises &#224; cet effet est souvent un b&#233;n&#233;vole. Cette situation se rencontre notamment dans les secteurs du sport et de l&#8217;animation.</p><p style=\"text-align: justify;\">Or, leurs dirigeants h&#233;sitent souvent &#224; d&#233;signer des b&#233;n&#233;voles pour exercer les fonctions de ma&#238;tre d&#8217;apprentissage, d&#232;s lors qu&#8217;ils s&#8217;interrogent sur la l&#233;galit&#233; d&#8217;une telle pratique.</p><p style=\"text-align: justify;\">Les dispositions du code du travail relatives aux ma&#238;tres d&#8217;apprentissage peuvent en effet donner lieu &#224; des interpr&#233;tations contradictoires, les unes &#233;voquant des &#171;&#160;personnes&#160;&#187; et les autres des &#171;&#160;salari&#233;s&#160;&#187;.</p><p style=\"text-align: justify;\">D&#232;s lors, il est propos&#233; de compl&#233;ter les dispositions du Code du travail relatives aux ma&#238;tres d&#8217;apprentissage en pr&#233;cisant que ces fonctions peuvent &#234;tre exerc&#233;es par des b&#233;n&#233;voles.</p><p style=\"text-align: justify;\">&#160;</p><p style=\"text-align: justify;\">&#160;</p>"
  },
  "representations": [
    {
      "nom": "PDF",
      "typeMime": {
        "type": "application",
        "subType": "PDF"
      },
      "statutRepresentation": {
        "verbatim": true,
        "canonique": true,
        "officielle": true,
        "transcription": false,
        "enregistrement": false
      },
      "contenu": {
        "documentURI": "/15/amendements/1019/AN/577.pdf"
      }
    }
  ],
  "seanceDiscussion": "RUANR5L15S2018IDS21102",
  "sort": {
    "dateSaisie": "2018-06-14T17:54:46.000+02:00",
    "sortEnSeance": "Rejeté"
  },
  "dateDepot": "2018-06-06T02:00:00.000+02:00",
  "dateDistribution": "2018-06-11T02:00:00.000+02:00",
  "article99": "0",
  "loiReference": {}
}