{
  "uid": "AMANR5L15SEA717460B2272P1D1N1743",
  "identifiant": {
    "legislature": "15",
    "numero": "1743",
    "numRect": "0",
    "saisine": {
      "texteLegislatifRef": "PRJLANR5L15B2272",
      "numeroPartiePLF": "1",
      "organeExamen": "PO717460",
      "mentionSecondeDeliberation": "0"
    }
  },
  "numeroLong": "I-1743",
  "etapeTexte": "1ère lecture (1ère assemblée saisie)",
  "triAmendement": "aiaiaaaaaaaaaaaaaaaaaaaaaaaaaaaaaaaaaaaaaaaaaaaaaazzu",
  "cardinaliteAmdtMultiples": "1",
  "etat": "Discuté",
  "signataires": {
    "auteur": {
      "typeAuteur": "Depute",
      "acteurRef": "PA346218",
      "groupePolitiqueRef": "PO730934"
    },
    "cosignatairesRefs": [
      "PA346218"
    ],
    "texteAffichable": "M.&#160;Masson"
  },
  "pointeurFragmentTexte": {
    "division": {
      "titre": "Article 11",
      "articleDesignationCourte": "ART. 11",
      "type": "ARTICLE",
      "avantAApres": "A",
      "divisionRattachee": "ARTICLE 11",
      "urlDivisionTexteVise": "/15/textes/2272A.asp#D_Article_11"
    }
  },
  "corps": {
    "dispositif": "<p style=\"text-align: justify;\">Supprimer cet article.</p>",
    "exposeSommaire": "<p style=\"text-align: justify;\">La pr&#233;visibilit&#233; comme la stabilit&#233; fiscale sont des &#233;l&#233;ments fondamentaux pour les entreprises et notamment pour leurs investissements. Aussi, il convient de conserver la trajectoire initialement pr&#233;vue et annonc&#233;e par le Gouvernement et vot&#233;e en Juillet 2019.</p>"
  },
  "representations": [
    {
      "nom": "PDF",
      "typeMime": {
        "type": "application",
        "subType": "PDF"
      },
      "statutRepresentation": {
        "verbatim": true,
        "canonique": true,
        "officielle": true,
        "transcription": false,
        "enregistrement": false
      },
      "contenu": {
        "documentURI": "/15/amendements/2272A/AN/1743.pdf"
      }
    }
  ],
  "seanceDiscussion": "RUANR5L15S2020IDS21861",
  "sort": {
    "dateSaisie": "2019-10-14T22:29:41.000+02:00",
    "sortEnSeance": "Non soutenu"
  },
  "dateDepot": "2019-10-10T02:00:00.000+02:00",
  "dateDistribution": "2019-10-14T02:00:00.000+02:00",
  "article99": "0",
  "loiReference": {}
}