{
  "uid": "AMANR5L15SEA717460B1490P0D1N331",
  "identifiant": {
    "legislature": "15",
    "numero": "331",
    "numRect": "0",
    "saisine": {
      "texteLegislatifRef": "PRJLANR5L15B1490",
      "numeroPartiePLF": "0",
      "organeExamen": "PO717460",
      "mentionSecondeDeliberation": "0"
    }
  },
  "numeroLong": "331",
  "etapeTexte": "Nouvelle Lecture",
  "triAmendement": "dbeaaaaaaaaaaaaaaaaaaaaaaaaaaaaaaaaaaaaaaaaaaaaaaac",
  "cardinaliteAmdtMultiples": "1",
  "etat": "Discuté",
  "signataires": {
    "auteur": {
      "typeAuteur": "Depute",
      "acteurRef": "PA720230",
      "groupePolitiqueRef": "PO744425"
    },
    "cosignatairesRefs": [
      "PA721110",
      "PA267766",
      "PA721486",
      "PA267330",
      "PA720230",
      "PA332228",
      "PA331567",
      "PA267585",
      "PA721194",
      "PA267780",
      "PA719806",
      "PA721632",
      "PA267241",
      "PA267355",
      "PA712014"
    ],
    "texteAffichable": "Mme&#160;Magnier,  Mme&#160;Auconie, M.&#160;Benoit, M.&#160;Guy&#160;Bricout, Mme&#160;de La Raudi&#232;re, M.&#160;Demilly, Mme&#160;Fr&#233;d&#233;rique&#160;Dumas, Mme&#160;Firmin Le Bodo, M.&#160;Herth, M.&#160;Ledoux, Mme&#160;Lemoine, M.&#160;Naegelen, Mme&#160;Sanquer, M.&#160;Vercamer et M.&#160;Zumkeller"
  },
  "pointeurFragmentTexte": {
    "division": {
      "titre": "Article 26 bis",
      "articleDesignationCourte": "ART. 26 BIS",
      "type": "ARTICLE",
      "avantAApres": "A",
      "divisionRattachee": "ARTICLE 26 BIS",
      "urlDivisionTexteVise": "/15/textes/1490.asp#D_Article_26_bis"
    }
  },
  "corps": {
    "dispositif": "<p style=\"text-align: justify;\">R&#233;diger ainsi cet article&#160;:</p><p style=\"text-align: justify;\">&#171;&#160;I.&#160;&#8211;&#160;Apr&#232;s le quatri&#232;me alin&#233;a de l&#8217;article L.&#160;1615&#8209;2 du code g&#233;n&#233;ral des collectivit&#233;s territoriales, sont ins&#233;r&#233;s cinq alin&#233;as ainsi r&#233;dig&#233;s&#160;:</p><p style=\"text-align: justify;\">&#171;&#160;Les collectivit&#233;s territoriales et leurs groupements qui prennent en location, pour une dur&#233;e de deux ans ou plus&#160;:</p><p style=\"text-align: justify;\">&#171;&#160;- un v&#233;hicule relevant des cat&#233;gories M1 ou N1 d&#233;finies au A de l&#8217;annexe II &#224; la directive 2007/46/CE du Parlement&#160;europ&#233;en et du Conseil du 5 septembre 2007 &#233;tablissant un cadre pour la r&#233;ception des v&#233;hicules &#224; moteur, de leurs remorques et des syst&#232;mes, des composants et des entit&#233;s techniques destin&#233;s &#224; ces v&#233;hicules&#160;;</p><p style=\"text-align: justify;\">&#171;&#160;- le mat&#233;riel informatique et num&#233;rique mis &#224; disposition du public dans les &#233;tablissements dont elles assurent la gestion&#160;;</p><p style=\"text-align: justify;\">&#171;&#160;b&#233;n&#233;ficient &#233;galement des attributions du Fonds de compensation pour la taxe sur la valeur ajout&#233;e au titre de la fraction des loyers correspondant &#224; la d&#233;pense d&#8217;investissement r&#233;alis&#233;e par le loueur. Ce montant leur est communiqu&#233; par le loueur et ne peut exc&#233;der, hors taxe sur la valeur ajout&#233;e, la dotation aux amortissements pratiqu&#233;e par ce dernier au titre de la p&#233;riode couverte par le loyer.&#160;&#187;.</p><p style=\"text-align: justify;\">&#171;&#160;II.&#160;&#8211;&#160;La perte de recettes pour l&#8217;&#201;tat est compens&#233;e &#224; due concurrence par la cr&#233;ation d&#8217;une taxe additionnelle aux droits mentionn&#233;s aux articles 575 et 575 A du code g&#233;n&#233;ral des imp&#244;ts.&#160;&#187;</p>",
    "exposeSommaire": "<p style=\"text-align: justify;\">L&#8217;article&#160;26bis facilite le recours &#224; la location longue dur&#233;e pour les collectivit&#233;s territoriales qui opteront pour ce mode de gestion, en leur permettant de b&#233;n&#233;ficier du FCTVA uniquement sur le loyer financier, c&#8217;est-&#224;-dire la quote-part du loyer correspondant au seul financement de l&#8217;investissement.</p><p style=\"text-align: justify;\">L&#8217;objectif de ce dispositif, qui modifie de mani&#232;re strictement encadr&#233;e l&#8217;&#233;ligibilit&#233; au FCTVA, est de faciliter le recours &#224; la LLD pour les collectivit&#233;s territoriales qui le souhaitent.</p><p style=\"text-align: justify;\">Le dispositif concerne le parc automobile des collectivit&#233;s qui comptent 180 000 v&#233;hicules dont la moyenne d&#8217;&#226;ge est de neuf ans mais aussi le mat&#233;riel num&#233;rique.</p><p style=\"text-align: justify;\">La transformation num&#233;rique de notre Pays est en marche. Pour autant, cette transformation ne se fera pas de la m&#234;me fa&#231;on sur l&#8217;ensemble des territoires et n&#233;cessite l&#8217;intervention des communes et intercommunalit&#233;s.</p><p style=\"text-align: justify;\">Celles-ci adaptent en effet leurs services publics avec les nouveaux outils num&#233;riques mais vont &#233;galement devoir proposer un accompagnement aux personnes les plus &#233;loign&#233;es de ces nouveaux outils.</p><p style=\"text-align: justify;\">Pour autant, il semble aujourd&#8217;hui pertinent de favoriser la LLD de ces mat&#233;riels, plut&#244;t que l&#8217;investissement, compte tenu de l&#8217;&#233;volution extr&#234;mement rapide des tablettes, tableaux&#160;num&#233;riques, vid&#233;oprojecteurs interactifs&#8230; Nous devons donc adapter nos outils de soutien aux collectivit&#233;s &#224; ces &#233;volutions. C&#8217;est pourquoi il est propos&#233; de faire b&#233;n&#233;ficier aux communes et EPCI du FCTVA pour la location longue dur&#233;e, minimum deux ans, des &#233;quipements num&#233;riques qu&#8217;elles mettraient &#224; disposition du public, dans les &#233;coles, biblioth&#232;ques, mus&#233;es ou tout simplement en mairie pour un acc&#232;s au service public en ligne.</p><p style=\"text-align: justify;\">Cela permettrait en outre de mettre en place un m&#233;canisme d&#8217;incitation pour que les collectivit&#233;s territoriales sortent de la logique de l&#8217;achat qu&#8217;elles privil&#233;gient traditionnellement pour ce mat&#233;riel num&#233;rique qui devient rapidement obsol&#232;te.</p>"
  },
  "representations": [
    {
      "nom": "PDF",
      "typeMime": {
        "type": "application",
        "subType": "PDF"
      },
      "statutRepresentation": {
        "verbatim": true,
        "canonique": true,
        "officielle": true,
        "transcription": false,
        "enregistrement": false
      },
      "contenu": {
        "documentURI": "/15/amendements/1490/AN/331.pdf"
      }
    }
  ],
  "seanceDiscussion": "RUANR5L15S2019IDS21433",
  "sort": {
    "dateSaisie": "2018-12-18T23:05:45.000+01:00",
    "sortEnSeance": "Tombé"
  },
  "dateDepot": "2018-12-14T01:00:00.000+01:00",
  "dateDistribution": "2018-12-17T01:00:00.000+01:00",
  "article99": "0",
  "loiReference": {}
}