{
  "uid": "AMANR5L15SEA717460BTC1767P0D1N1173",
  "identifiant": {
    "legislature": "15",
    "numero": "1173",
    "numRect": "0",
    "saisine": {
      "texteLegislatifRef": "PRJLANR5L15BTC1767",
      "numeroPartiePLF": "0",
      "organeExamen": "PO717460",
      "mentionSecondeDeliberation": "0"
    }
  },
  "numeroLong": "1173",
  "etapeTexte": "1ère lecture (1ère assemblée saisie)",
  "triAmendement": "aiaaaaaaaaaaaaaaaaaaaaaaaaaaaaaaaaaaaaaaaaaaaaaaaaaapkkkzzx",
  "cardinaliteAmdtMultiples": "1",
  "etat": "Discuté",
  "signataires": {
    "auteur": {
      "typeAuteur": "Depute",
      "acteurRef": "PA605963",
      "groupePolitiqueRef": "PO730964"
    },
    "cosignatairesRefs": [
      "PA605963"
    ],
    "texteAffichable": "M.&#160;Alauzet"
  },
  "pointeurFragmentTexte": {
    "division": {
      "titre": "Article 3",
      "articleDesignationCourte": "APRÈS ART. 3",
      "type": "ARTICLE",
      "avantAApres": "Apres",
      "divisionRattachee": "APRÈS L'ARTICLE 3, insérer l'article suivant:",
      "articleAdditionnel": "1",
      "urlDivisionTexteVise": "/15/textes/1767.asp#D_Article_3"
    }
  },
  "corps": {
    "dispositif": "<p>L&#8217;article L.&#160;1110&#8209;1&#8209;1 du code de la sant&#233; publique est ainsi modifi&#233;&#160;:</p><p style=\"text-align: justify;\">1&#176;&#160;Apr&#232;s le mot&#160;:&#160;&#171;&#160;handicap&#233;es,&#160;&#187;, la fin est ainsi r&#233;dig&#233;e&#160;: &#171;&#160;l'annonce du handicap, le r&#244;le des aidants et leur impact sur la sant&#233;.&#160;&#187;&#160;;</p><p style=\"text-align: justify;\">2&#176;&#160;Il est ajout&#233; un alin&#233;a ainsi r&#233;dig&#233;&#160;:</p><p style=\"text-align: justify;\">&#171;&#160;Un d&#233;cret pr&#233;cise les modalit&#233;s d&#8217;application du pr&#233;sent article pour chaque formation initiale et continue des professionnels de sant&#233; et du secteur m&#233;dico-social.&#160;&#187;</p>",
    "exposeSommaire": "<p>Cet amendement vise &#224; rendre op&#233;rationnelles les dispositions de l&#8217;article L1110&#8209;1-1 du code de la sant&#233; publique -&#160;&#233;tablissant une obligation de formation sp&#233;cifique au handicap - et &#224; &#233;tendre son b&#233;n&#233;ficie &#224; la formation relative &#224; la sant&#233; des aidants.</p><p style=\"text-align: justify;\">L&#8217;obligation d&#8217;int&#233;grer dans la formation initiale et continue une formation sp&#233;cifique au handicap &#233;tablit par la loi du 11 f&#233;vrier 2005 reste peu appliqu&#233;e. Les rapporteurs Marianne Cornu-Pachet et Philippe Denormandie le constate dans leur rapport sur l&#8217;acc&#232;s aux soins des personnes en situation de handicap et en situation de pr&#233;carit&#233;. Pourtant, la m&#233;connaissance du handicap et de son impact sur la vie quotidienne des personnes rend le syst&#232;me de sant&#233; peu accessible aux personnes en situation de handicap. La formation des professionnels de sant&#233; est un enjeu important dans l&#8217;optique de transformer les pratiques. Il s&#8217;agit de trouver le meilleur &#233;quilibre entre refus de soins et une surm&#233;dicalisation, et de pr&#233;venir le renoncement aux soins.</p><p style=\"text-align: justify;\">Par ailleurs, plus de huit millions d&#8217;aidants non professionnels, souvent familiaux, jouent aujourd&#8217;hui un r&#244;le central dans l&#8217;aide et l&#8217;accompagnement d&#8217;un proche d&#233;pendant de son entourage pour les actes de la vie quotidienne, en raison d&#8217;un handicap, d&#8217;une maladie&#8230; A travers leur formation initiale et continue, les professionnels de sant&#233; comme du m&#233;dico-social doivent &#234;tre sensibilis&#233;s aux signes de fragilit&#233; physique et psychique des aidants pour contribuer &#224; la pr&#233;servation de leur sant&#233; globale. Le r&#244;le d&#8217;aidant peut avoir des retentissements graves sur la sant&#233; (fatigue physique et psychique, stress et isolement pouvant conduire au &#171;&#160;burn out&#160;&#187;) qui doivent &#234;tre bien pris en compte par les acteurs professionnels qui les c&#244;toient. En plus du domaine de la sant&#233;, ces formations doivent permettre &#224; ces professionnels d&#8217;appr&#233;hender la situation et les besoins des aidants, de reconna&#238;tre leur &#171;&#160;expertise&#160;&#187; afin de faciliter le dialogue et une relation de partenariat avec ces derniers.</p>"
  },
  "representations": [
    {
      "nom": "PDF",
      "typeMime": {
        "type": "application",
        "subType": "PDF"
      },
      "statutRepresentation": {
        "verbatim": true,
        "canonique": true,
        "officielle": true,
        "transcription": false,
        "enregistrement": false
      },
      "contenu": {
        "documentURI": "/15/amendements/1767/AN/1173.pdf"
      }
    }
  ],
  "seanceDiscussion": "RUANR5L15S2019IDS21561",
  "sort": {
    "dateSaisie": "2019-03-20T16:35:30.000+01:00",
    "sortEnSeance": "Non soutenu"
  },
  "dateDepot": "2019-03-15T01:00:00.000+01:00",
  "dateDistribution": "2019-03-17T01:00:00.000+01:00",
  "article99": "0",
  "loiReference": {
    "codeLoi": "c santé publique",
    "divisionCodeLoi": "L1110-1-1"
  }
}