{
  "uid": "AMANR5L15PO59048B0384P0D1N181",
  "identifiant": {
    "legislature": "15",
    "numero": "181",
    "numRect": "0",
    "saisine": {
      "texteLegislatifRef": "PRJLANR5L15B0384",
      "numeroPartiePLF": "0",
      "organeExamen": "PO59048",
      "mentionSecondeDeliberation": "0"
    }
  },
  "numeroLong": "CF181",
  "etapeTexte": "1ère lecture (1ère assemblée saisie)",
  "triAmendement": "u",
  "cardinaliteAmdtMultiples": "1",
  "etat": "Discuté",
  "signataires": {
    "auteur": {
      "typeAuteur": "Depute",
      "acteurRef": "PA720692",
      "groupePolitiqueRef": "PO730940"
    },
    "cosignatairesRefs": [
      "PA720546",
      "PA720692",
      "PA718720"
    ],
    "texteAffichable": "M.&#160;Fabien&#160;Roussel,  M.&#160;Bruneel et M.&#160;Dufr&#232;gne"
  },
  "pointeurFragmentTexte": {
    "division": {
      "titre": "Article 13",
      "articleDesignationCourte": "ART. 13",
      "type": "ARTICLE",
      "avantAApres": "A",
      "divisionRattachee": "ARTICLE 13",
      "urlDivisionTexteVise": "/15/textes/0384.asp#D_Article_13"
    },
    "alinea": {
      "avantAApres": "Apres",
      "numero": "89"
    }
  },
  "corps": {
    "dispositif": "<p style=\"text-align: justify;\">Compl&#233;ter cet article par l&#8217;alin&#233;a suivant&#160;:</p><p style=\"text-align: justify;\">&#171;&#160;VI.&#160;&#8211;&#160;Chaque ann&#233;e avant le d&#233;p&#244;t du projet de loi de finances, le Gouvernement remet au Parlement un rapport d&#8217;&#233;valuation du pr&#233;sent dispositif dans le bassin urbain &#224; dynamiser portant notamment sur la cr&#233;ation et l&#8217;implantation d&#8217;entreprises et le niveau de l&#8217;emploi. Cette &#233;valuation est notamment pr&#233;sent&#233;e par commune et par secteur d&#8217;activit&#233;.&#160;&#187;</p>",
    "exposeSommaire": "<p style=\"text-align: justify;\">Cet amendement entend informer la repr&#233;sentation nationale sur les effets du dispositif d&#8217;exon&#233;ration fiscale pr&#233;vue au pr&#233;sent article sur l&#8217;activit&#233; et l&#8217;emploi au sein du bassin urbain &#224; dynamiser. Cette &#233;volution pourrait porter sur les cr&#233;ations d&#8217;entreprises et la situation de l&#8217;emploi.</p>"
  },
  "representations": [
    {
      "nom": "PDF",
      "typeMime": {
        "type": "application",
        "subType": "PDF"
      },
      "statutRepresentation": {
        "verbatim": true,
        "canonique": true,
        "officielle": true,
        "transcription": false,
        "enregistrement": false
      },
      "contenu": {
        "documentURI": "/15/amendements/0384/CION_FIN/CF181.pdf"
      }
    }
  ],
  "sort": {
    "dateSaisie": "2017-11-29T12:33:06.000+01:00",
    "sortEnSeance": "Rejeté"
  },
  "dateDepot": "2017-11-24T01:00:00.000+01:00",
  "dateDistribution": "2017-11-28T01:00:00.000+01:00",
  "article99": "0",
  "loiReference": {
    "codeLoi": "yy rapport"
  }
}