{
  "uid": "AMANR5L15SEA717460B1255P1D1N91",
  "identifiant": {
    "legislature": "15",
    "numero": "91",
    "numRect": "0",
    "saisine": {
      "texteLegislatifRef": "PRJLANR5L15B1255",
      "numeroPartiePLF": "1",
      "organeExamen": "PO717460",
      "mentionSecondeDeliberation": "0"
    }
  },
  "numeroLong": "I-91",
  "etapeTexte": "1ère lecture (1ère assemblée saisie)",
  "triAmendement": "kaaaaaaaaaaaaaaaaaaaaaaaaaaaaaaaaaaaaaaaaaaaaaaaaal",
  "cardinaliteAmdtMultiples": "1",
  "etat": "Irrecevable",
  "signataires": {
    "auteur": {
      "typeAuteur": "Depute",
      "acteurRef": "PA330909",
      "groupePolitiqueRef": "PO730934"
    },
    "cosignatairesRefs": [
      "PA330909",
      "PA267527",
      "PA346218",
      "PA718838",
      "PA721968",
      "PA267901",
      "PA1874",
      "PA719318",
      "PA642847",
      "PA334654",
      "PA267204",
      "PA332523",
      "PA608416",
      "PA721410",
      "PA718884",
      "PA267260",
      "PA721474",
      "PA608016",
      "PA346054",
      "PA605036",
      "PA709315",
      "PA721678",
      "PA340853",
      "PA266793"
    ],
    "texteAffichable": "M.&#160;Descoeur,  M.&#160;Straumann, Mme&#160;Anthoine, Mme&#160;Bazin-Malgras, M.&#160;Leclerc, M.&#160;Bony, M.&#160;Kamardine, Mme&#160;Dalloz, M.&#160;Viry, M.&#160;Brun, M.&#160;Le Fur, M.&#160;Sermier, M.&#160;Vialay, Mme&#160;Louwagie, Mme&#160;Bonnivard, M.&#160;Masson, M.&#160;Bazin, M.&#160;Saddier, M.&#160;Hetzel, M.&#160;Viala, Mme&#160;Poletti, M.&#160;Emmanuel&#160;Maquet, M.&#160;Abad et M.&#160;Reda"
  },
  "pointeurFragmentTexte": {
    "division": {
      "titre": "Article 29",
      "articleDesignationCourte": "ART. 29",
      "type": "ARTICLE",
      "avantAApres": "A",
      "divisionRattachee": "ARTICLE 29",
      "urlDivisionTexteVise": "/15/textes/1255A.asp#D_Article_29"
    },
    "alinea": {
      "avantAApres": "Apres",
      "numero": "59"
    }
  },
  "corps": {
    "dispositif": "<p style=\"text-align: justify;\">Apr&#232;s l&#8217;alin&#233;a&#160;59, ins&#233;rer les deux alin&#233;as suivants&#160;:</p><p style=\"text-align: justify;\">&#171;&#160;C.&#160;&#8211;&#160;Apr&#232;s le&#160;III&#160;<i>bis</i>, il est ins&#233;r&#233; un III&#160;<i>ter</i> ainsi r&#233;dig&#233;&#160;:</p><p style=\"text-align: justify;\">&#171;&#160;III&#160;<i>ter</i>.&#160;&#8211;&#160;L&#8217;&#201;tat garantit une p&#233;r&#233;quation des ressources entre les chambres de commerce et d&#8217;industrie afin de permettre le maintien d&#8217;un &#233;tablissement de plein exercice dans chaque d&#233;partement et principalement dans les territoires ruraux.&#160;&#187;</p>",
    "exposeSommaire": "<p style=\"text-align: justify;\">Les alin&#233;as&#160;26 et&#160;68 de l&#8217;article&#160;29 du projet de loi de finances visent une nouvelle fois &#224; diminuer la part affect&#233;e aux chambres de commerce et d&#8217;industrie&#160;(CCI) de la taxe additionnelle &#224; la cotisation fonci&#232;re des entreprises (article&#160;1600 du code g&#233;n&#233;ral des imp&#244;ts). Alors que le r&#233;seau des CCI a d&#233;j&#224; largement particip&#233; &#224; l&#8217;effort national de r&#233;duction de la d&#233;pense publique, il convient d&#8217;assurer une p&#233;r&#233;quation des ressources entre les chambres afin de maintenir un maillage du territoire.</p><p style=\"text-align: justify;\">Les CCI sont les seules structures d&#8217;appui pr&#233;sentes dans une vingtaine de territoires hyper-ruraux, aussi l&#8217;accompagnement des entreprises pourrait y dispara&#238;tre. &#192; ce stade, aucun m&#233;canisme n&#8217;est pr&#233;vu par le Gouvernement pour maintenir un socle de base de services aux TPE-PME dans ces territoires. Assurer la p&#233;r&#233;quation des ressources est le seul moyen de permettre la survie des chambres consulaires des territoires ruraux.</p>"
  },
  "representations": [
    {
      "nom": "PDF",
      "typeMime": {
        "type": "application",
        "subType": "PDF"
      },
      "statutRepresentation": {
        "verbatim": true,
        "canonique": true,
        "officielle": true,
        "transcription": false,
        "enregistrement": false
      },
      "contenu": {
        "documentURI": "/15/amendements/1255A/AN/91.pdf"
      }
    }
  ],
  "dateDepot": "2018-10-03T02:00:00.000+02:00",
  "article99": "0",
  "loiReference": {}
}