{
  "uid": "AMANR5L15PO59048B2272P2D1N913",
  "identifiant": {
    "legislature": "15",
    "numero": "913",
    "numRect": "0",
    "saisine": {
      "texteLegislatifRef": "PRJLANR5L15B2272",
      "numeroPartiePLF": "2",
      "organeExamen": "PO59048",
      "mentionSecondeDeliberation": "0"
    }
  },
  "numeroLong": "II-CF913",
  "etapeTexte": "1ère lecture (1ère assemblée saisie)",
  "triAmendement": "aniaaaaaaaaaaaaaaaaaaaaaaaaaaaaaaaaaaaaaaaaaaaaaaazzi",
  "cardinaliteAmdtMultiples": "1",
  "etat": "Discuté",
  "signataires": {
    "auteur": {
      "typeAuteur": "Rapporteur",
      "acteurRef": "PA267450",
      "organeRef": "PO419610",
      "groupePolitiqueRef": "PO730934"
    },
    "cosignatairesRefs": [
      "PA267450"
    ],
    "texteAffichable": "M.&#160;R&#233;mi&#160;Delatte, rapporteur pour avis au nom de la commission des affaires &#233;conomiques"
  },
  "pointeurFragmentTexte": {
    "missionVisee": {
      "idMissionAN": "811",
      "libelleMission": "Économie",
      "codeMissionPLF": "B",
      "libelleMissionPLF": "Répartition, par mission et programme, des crédits du budget général"
    },
    "division": {
      "titre": "ÉTAT B",
      "articleDesignationCourte": "ART. 38",
      "type": "ANNEXE",
      "avantAApres": "A",
      "divisionRattachee": "ARTICLE 38",
      "urlDivisionTexteVise": "/15/textes/2272C.asp#D_ETAT_B"
    }
  },
  "corps": {
    "exposeSommaire": "<p style=\"text-align: justify;\">Cet amendement vise &#224; r&#233;tablir les cr&#233;dits de l&#8217;action n&#176;&#160;23 consacr&#233;s au soutien public pour les m&#233;tiers d&#8217;art, &#224; hauteur de 2,25 millions d&#8217;euros, soit le montant vot&#233; l&#8217;ann&#233;e pr&#233;c&#233;dente.</p><p style=\"text-align: justify;\">Les m&#233;tiers d&#8217;art, reconnus par le l&#233;gislateur &#224; l&#8217;occasion de la loi du 18&#160;juin 2014 relative &#224; l&#8217;artisanat, au commerce et aux tr&#232;s petites entreprises, participent au rayonnement &#233;conomique, culturel et touristique fran&#231;ais, et repr&#233;sentent en France 60&#160;000&#160;entreprises, 120&#160;000&#160;emplois et 15&#160;milliards d&#8217;euros.</p><p style=\"text-align: justify;\">La ligne &#171;&#160;Actions du d&#233;veloppement des PME&#160;&#187; de l&#8217;action n&#176;&#160;23 &#171;&#160;Industrie et services&#160;&#187; est supprim&#233;e dans le cadre du pr&#233;sent projet de loi de finances. Elle contribuait au financement de l&#8217;Institut sup&#233;rieur des m&#233;tiers (ISM) et de l&#8217;Institut national des m&#233;tiers d&#8217;art (INMA). Elle abondait &#233;galement le label &#171;&#160;entreprises du patrimoine vivant&#160;&#187;.</p><p style=\"text-align: justify;\">La suppression de la dotation para&#238;t largement dommageable pour l&#8217;avenir des m&#233;tiers d&#8217;art. Les pouvoirs publics envoient des signaux n&#233;gatifs au secteur, dans un contexte o&#249; la suppression de cette ligne budg&#233;taire intervient alors que le Gouvernement n&#8217;a pas souhait&#233; renouveler le cr&#233;dit d&#8217;imp&#244;t en faveur des m&#233;tiers d&#8217;art (CIMA) en 2020. Il s&#8217;agit pourtant d&#8217;un secteur strat&#233;gique pour l&#8217;emploi, la pr&#233;servation de savoir-faire, et le rayonnement des produits fran&#231;ais. Pour toutes ces raisons, le pr&#233;sent amendement vise &#224; r&#233;tablir la ligne budg&#233;taire consacr&#233;e aux m&#233;tiers d&#8217;art dans l&#8217;action n&#176;&#160;23 du programme 134.</p><p style=\"text-align: justify;\">Pour ce faire, le pr&#233;sent amendement proc&#232;de aux mouvements de cr&#233;dits suivants&#160;:</p><p style=\"text-align: justify;\">- ouverture de 2,25 millions d&#8217;euros en autorisations d&#8217;engagement et en cr&#233;dits de paiement sur l&#8217;action n&#176;&#160;23 &#171;&#160;Industrie et service&#160;&#187; du programme 134 &#171;&#160;D&#233;veloppement des entreprises et r&#233;gulations&#160;&#187;&#160;;</p><p style=\"text-align: justify;\">- annulation de 2,25 millions d&#8217;euros en autorisations d&#8217;engagement et en cr&#233;dits de paiement sur l&#8217;action n&#176;&#160;1 &#171;&#160;D&#233;finition et mise en &#339;uvre de la politique &#233;conomique et financi&#232;re de la France dans le cadre national, international et europ&#233;en&#160;&#187; du programme 305 &#171;&#160;Strat&#233;gie &#233;conomique et fiscale.</p>",
    "dispositifAmdtCredit": {
      "listeProgrammes": [
        {
          "libelle": "Développement des entreprises et régulations",
          "id": "73518",
          "AE": {
            "montantPositif": "2250000",
            "montantNegatif": "0"
          },
          "CP": {
            "montantPositif": "2250000",
            "montantNegatif": "0"
          },
          "action": "modification"
        },
        {
          "libelle": "Plan France Très haut débit",
          "id": "73519",
          "AE": {
            "montantPositif": "0",
            "montantNegatif": "0"
          },
          "CP": {
            "montantPositif": "0",
            "montantNegatif": "0"
          },
          "action": "modification"
        },
        {
          "libelle": "Statistiques et études économiques",
          "id": "73520",
          "AE": {
            "montantPositif": "0",
            "montantNegatif": "0"
          },
          "CP": {
            "montantPositif": "0",
            "montantNegatif": "0"
          },
          "action": "modification"
        },
        {
          "libelle": "Stratégie économique et fiscale",
          "id": "73521",
          "AE": {
            "montantPositif": "0",
            "montantNegatif": "2250000"
          },
          "CP": {
            "montantPositif": "0",
            "montantNegatif": "2250000"
          },
          "action": "modification"
        }
      ],
      "totalAE": {
        "montantPositif": "2250000",
        "montantNegatif": "2250000",
        "solde": "0"
      },
      "totalCP": {
        "montantPositif": "2250000",
        "montantNegatif": "2250000",
        "solde": "0"
      }
    }
  },
  "representations": [
    {
      "nom": "PDF",
      "typeMime": {
        "type": "application",
        "subType": "PDF"
      },
      "statutRepresentation": {
        "verbatim": true,
        "canonique": true,
        "officielle": true,
        "transcription": false,
        "enregistrement": false
      },
      "contenu": {
        "documentURI": "/15/amendements/2272C/CION_FIN/CF913.pdf"
      }
    }
  ],
  "sort": {
    "dateSaisie": "2019-10-23T16:17:22.000+02:00",
    "sortEnSeance": "Rejeté"
  },
  "dateDepot": "2019-10-22T02:00:00.000+02:00",
  "dateDistribution": "2019-10-23T02:00:00.000+02:00",
  "article99": "0",
  "loiReference": {}
}