{
  "uid": "AMANR5L15PO59051B1349P0D1N180",
  "identifiant": {
    "legislature": "15",
    "numero": "180",
    "numRect": "0",
    "saisine": {
      "texteLegislatifRef": "PRJLANR5L15B1349",
      "numeroPartiePLF": "0",
      "organeExamen": "PO59051",
      "mentionSecondeDeliberation": "0"
    }
  },
  "numeroLong": "CL180",
  "etapeTexte": "1ère lecture (2ème assemblée saisie)",
  "triAmendement": "kjiaaaaaaaaaaaaaaaaaaaaaaaaaaaaaaaaaaaaaaaaaaaaaaai",
  "cardinaliteAmdtMultiples": "1",
  "etat": "Discuté",
  "signataires": {
    "auteur": {
      "typeAuteur": "Depute",
      "acteurRef": "PA721960",
      "groupePolitiqueRef": "PO730958"
    },
    "cosignatairesRefs": [
      "PA588884",
      "PA721226",
      "PA720422",
      "PA722142",
      "PA721062",
      "PA720846",
      "PA719676",
      "PA720286",
      "PA720892",
      "PA718868",
      "PA719578",
      "PA721960",
      "PA718860",
      "PA720430",
      "PA721202",
      "PA721210",
      "PA2150"
    ],
    "texteAffichable": "Mme&#160;Obono,  Mme&#160;Autain, M.&#160;Bernalicis, M.&#160;Coquerel, M.&#160;Corbi&#232;re, Mme&#160;Fiat, M.&#160;Lachaud, M.&#160;Larive, M.&#160;M&#233;lenchon, Mme&#160;Panot, M.&#160;Prud&apos;homme, M.&#160;Quatennens, M.&#160;Ratenon, Mme&#160;Ressiguier, Mme&#160;Rubin, M.&#160;Ruffin et Mme&#160;Taurine"
  },
  "pointeurFragmentTexte": {
    "division": {
      "titre": "Article 50 quater",
      "articleDesignationCourte": "APRÈS ART. 50 QUATER",
      "type": "ARTICLE",
      "avantAApres": "Apres",
      "divisionRattachee": "APRÈS L'ARTICLE 50 QUATER, insérer l'article suivant:",
      "articleAdditionnel": "1",
      "urlDivisionTexteVise": "/15/textes/1349.asp#D_Article_50_quater"
    }
  },
  "corps": {
    "dispositif": "<p style=\"line-height: 1.2; text-align: justify;\">I.&#160;&#8211;&#160;Une cantine pour les femmes d&#233;tenues est mise en place. La d&#233;finition des produits devant y figurer est fix&#233;e par la ministre de la Justice en lien avec le secr&#233;tariat d&#8217;&#201;tat charg&#233;e de l&#8217;&#201;galit&#233; entre les femmes et les hommes et le minist&#232;re de la sant&#233;.</p><p style=\"line-height: 1.2; text-align: justify;\">Un kit d&#8217;hygi&#232;ne est red&#233;fini et distribu&#233; aux les femmes d&#233;tenues en fonction des recommandations d&#233;finies en lien avec le secr&#233;tariat d&#8217;&#201;tat charg&#233;e de l&#8217;&#201;galit&#233; entre les femmes et les hommes et le minist&#232;re de la sant&#233;.</p><p style=\"line-height: 1.2; text-align: justify;\">Ces dispositifs sont mis en &#339;uvre dans les conditions pr&#233;vues au II.</p><p style=\"text-align: justify;\">II.&#160;&#8211;&#160;Conform&#233;ment &#224; l&#8217;article&#160;37&#8209;1 de la Constitution et pour une dur&#233;e maximale de trois ans, le ministre de la Justice peut exp&#233;rimenter, dans les d&#233;partements et r&#233;gions volontaires, pour un maximum de deux r&#233;gions et de six d&#233;partements, la mise en place des dispositions du I. Ces exp&#233;rimentations donnent lieu &#224; un rapport permettant d&#8217;appr&#233;cier la n&#233;cessit&#233; d&#8217;adapter ainsi les produits de cantines pour les femmes d&#233;tenues.</p>",
    "exposeSommaire": "<p style=\"line-height: 1.38; text-align: justify;\">Cet amendement vise &#224; am&#233;liorer les conditions d&#8217;incarc&#233;ration des femmes d&#233;tenues en ce qu&#8217;il permettrait l&#8217;exp&#233;rimentation d&#8217;un cantinage adapt&#233; &#224; la population p&#233;nale f&#233;minine, dans le respect d&#8217;ailleurs de la r&#232;gle p&#233;nitentiaire europ&#233;enne (RPE) no 19.7 qui rappelle que des mesures sp&#233;ciales doivent &#234;tre prises afin de r&#233;pondre aux besoins hygi&#233;niques des femmes. L&#8217;avis du 25 janvier 2016 relatif &#224; la situation des femmes priv&#233;es de libert&#233; de la Contr&#244;leure g&#233;n&#233;rale des lieux de privation de libert&#233;, d&#233;crit de fait une situation terrible pour les femmes d&#233;tenues (http://www.cglpl.fr/2016/avis-relatif-a-la-situation-des-femmes-privees-de-liberte/).</p><p style=\"line-height: 1.38; text-align: justify;\">En effet tout comme le rel&#232;vent tant les professionnel p&#233;nitentiaires que les associations, la gamme des produits d&#8217;hygi&#232;ne f&#233;minine (tampons ou serviettes hygi&#233;niques, savon de toilette intime, etc.) et des produits ou accessoires de beaut&#233; (maquillage, teinture pour cheveux, fer &#224; lisser, mat&#233;riel d&#8217;&#233;pilation, etc.) disponibles en cantine est tr&#232;s restreinte.</p><p style=\"line-height: 1.38; text-align: justify;\">Le &#8220;kit d&#8217;hygi&#232;ne&#8221; fourni aux femmes est le m&#234;me que celui distribu&#233; aux hommes &#224; l&#8217;exception de l&#8217;ajout de serviettes hygi&#233;niques.</p><p style=\"line-height: 1.38; text-align: justify;\">Cela conduit &#224; une situation in&#233;galitaire selon laquelle les femmes doivent s&#8217;approvisionner en produits de base (brosse &#224; cheveux, par exemple) par le biais des cantines exceptionnelles et non des cantines classiques, contrairement aux hommes.</p><p style=\"line-height: 1.38; text-align: justify;\">La Contr&#244;leure g&#233;n&#233;rale des lieux de privation rel&#232;ve m&#234;me que des motifs de s&#233;curit&#233; sont trop souvent invoqu&#233;s pour refuser aux femmes d&#233;tenues l&#8217;entr&#233;e en d&#233;tention de produits de beaut&#233; ou d&#8217;hygi&#232;ne via le parloir.</p><p style=\"line-height: 1.38; text-align: justify;\">Le Groupe de la France insoumise consid&#232;re que cette situation n&#8217;est pas acceptable et que le statu quo est de fait discriminatoire.</p>"
  },
  "representations": [
    {
      "nom": "PDF",
      "typeMime": {
        "type": "application",
        "subType": "PDF"
      },
      "statutRepresentation": {
        "verbatim": true,
        "canonique": true,
        "officielle": true,
        "transcription": false,
        "enregistrement": false
      },
      "contenu": {
        "documentURI": "/15/amendements/1349/CION_LOIS/CL180.pdf"
      }
    }
  ],
  "sort": {
    "dateSaisie": "2018-11-09T16:22:58.000+01:00",
    "sortEnSeance": "Rejeté"
  },
  "dateDepot": "2018-10-31T01:00:00.000+01:00",
  "dateDistribution": "2018-11-08T01:00:00.000+01:00",
  "article99": "0",
  "loiReference": {
    "codeLoi": "zzz"
  }
}