{
  "uid": "AMANR5L15SEA717460B0499P0D1N102",
  "identifiant": {
    "legislature": "15",
    "numero": "102",
    "numRect": "0",
    "saisine": {
      "texteLegislatifRef": "PRJLANR5L15B0499",
      "numeroPartiePLF": "0",
      "organeExamen": "PO717460",
      "mentionSecondeDeliberation": "1"
    }
  },
  "numeroLong": "102",
  "etapeTexte": "Nouvelle Lecture",
  "triAmendement": "azpi",
  "cardinaliteAmdtMultiples": "1",
  "etat": "Discuté",
  "signataires": {
    "auteur": {
      "typeAuteur": "Depute",
      "acteurRef": "PA1874",
      "groupePolitiqueRef": "PO730934"
    },
    "cosignatairesRefs": [
      "PA267429",
      "PA642847",
      "PA346218",
      "PA267204",
      "PA722390",
      "PA608826",
      "PA330008",
      "PA609726",
      "PA718850",
      "PA334654",
      "PA721968",
      "PA330684",
      "PA720684",
      "PA330909",
      "PA608416",
      "PA718838",
      "PA1012",
      "PA720386",
      "PA719318",
      "PA1874",
      "PA2492",
      "PA266774",
      "PA608016",
      "PA607090",
      "PA332523"
    ],
    "texteAffichable": "M.&#160;Le Fur,  Mme&#160;Anthoine, M.&#160;Aubert, M.&#160;Bazin, Mme&#160;Val&#233;rie&#160;Boyer, M.&#160;Breton, M.&#160;Brun, M.&#160;Cinieri, M.&#160;Cordier, Mme&#160;Corneloup, Mme&#160;Dalloz, M.&#160;Descoeur, Mme&#160;Duby-Muller, M.&#160;Pierre-Henri&#160;Dumont, M.&#160;Di Filippo, M.&#160;Furst, M.&#160;Hetzel, M.&#160;de la Verpilli&#232;re, Mme&#160;Louwagie, M.&#160;Masson, M.&#160;Quentin, M.&#160;Sermier, M.&#160;Straumann, M.&#160;Vialay et M.&#160;Jean-Pierre&#160;Vigier"
  },
  "pointeurFragmentTexte": {
    "division": {
      "titre": "Article 9",
      "articleDesignationCourte": "ART. 9",
      "type": "ARTICLE",
      "avantAApres": "A",
      "divisionRattachee": "ARTICLE 9",
      "urlDivisionTexteVise": "/15/textes/0499.asp#D_Article_9"
    },
    "alinea": {
      "avantAApres": "Apres",
      "numero": "6"
    }
  },
  "corps": {
    "dispositif": "<p>I.&#160;&#8211;&#160;Apr&#232;s l&#8217;alin&#233;a&#160;15, ins&#233;rer les sept alin&#233;as suivants&#160;:</p><p>&#171;&#160;D <i>bis</i>.&#160;&#8211;&#160;Le 1 du III de l&#8217;article&#160;204 H est ainsi r&#233;dig&#233;&#160;:</p><p>&#171;&#160;1&#176; Le tableau du a est ainsi r&#233;dig&#233;&#160;:</p><p>&#171;&#160;</p><p>Base mensuelle du pr&#233;l&#232;vement<br />Taux proportionnel<br />Inf&#233;rieure ou &#233;gale &#224; 3 758&#160;&#8364;<br />0&#160;%<br />De 3 759&#160;&#8364; &#224; 3 945&#160;&#8364;<br />1&#160;%<br />De 3 946&#160;&#8364; &#224; 4 151&#160;&#8364;<br />2&#160;%<br />De 4 152&#160;&#8364; &#224; 4 607&#160;&#8364;<br />3&#160;%<br />De 4 608&#160;&#8364; &#224; 5 208&#160;&#8364;<br />4&#160;%<br />De 5 209&#160;&#8364; &#224; 5 729&#160;&#8364;<br />5&#160;%<br />De 5 730&#160;&#8364; &#224; 6 366&#160;&#8364;<br />7&#160;%<br />De 6 970&#160;&#8364; &#224; 7 882&#160;&#8364;<br />9&#160;%<br />De 6 367&#160;&#8364; &#224; 6 969&#160;&#8364;<br />11&#160;%<br />De 7 883&#160;&#8364; &#224; 9 069&#160;&#8364;<br />14&#160;%<br />De 9 070&#160;&#8364; &#224; 10 574&#160;&#8364;<br />17&#160;%<br />De 10 575&#160;&#8364; &#224; 13 843&#160;&#8364;<br />20&#160;%<br />De 13 844&#160;&#8364; &#224; 18 455&#160;&#8364;<br />25&#160;%<br />De 18 456&#160;&#8364; &#224; 30 752&#160;&#8364;<br />30&#160;%<br />De 30 753&#160;&#8364; &#224; 138 110&#160;&#8364;<br />36&#160;%<br />Sup&#233;rieure &#224; 138 110&#160;&#8364;<br />43&#160;%<br />&#160;</p><p>&#171;&#160;2&#176; Le tableau du b est ainsi r&#233;dig&#233;&#160;:</p><p>&#171;&#160;</p><p>Base mensuelle du pr&#233;l&#232;vement<br />Taux proportionnel<br />Inf&#233;rieure ou &#233;gale &#224; 4 035&#160;&#8364;<br />0&#160;%<br />De 4 036&#160;&#8364; &#224; 4 336&#160;&#8364;<br />1&#160;%<br />De 4 337&#160;&#8364; &#224; 4 764&#160;&#8364;<br />2&#160;%<br />De 4 765&#160;&#8364; &#224; 5 383&#160;&#8364;<br />3&#160;%<br />De 5 384&#160;&#8364; &#224; 5 770&#160;&#8364;<br />4&#160;%<br />De 5 771&#160;&#8364; &#224; 6 709&#160;&#8364;<br />5&#160;%<br />De 6 710&#160;&#8364; &#224; 7 506&#160;&#8364;<br />7&#160;%<br />De 7 507&#160;&#8364; &#224; 8 518&#160;&#8364;<br />9&#160;%<br />De 8 519&#160;&#8364; &#224; 9 737&#160;&#8364;<br />11&#160;%<br />De 9 738&#160;&#8364; &#224; 11 023&#160;&#8364;<br />14&#160;%<br />De 11 024&#160;&#8364; &#224; 12 598&#160;&#8364;<br />17&#160;%<br />De 12 599&#160;&#8364; &#224; 15 967&#160;&#8364;<br />20&#160;%<br />De 15 968&#160;&#8364; &#224; 21 288&#160;&#8364;<br />25&#160;%<br />De 21 289&#160;&#8364; &#224; 35 471&#160;&#8364;<br />30&#160;%<br />De 35 472&#160;&#8364; &#224; 159 307&#160;&#8364;<br />36&#160;%<br />Sup&#233;rieure &#224; 159 307&#160;&#8364;<br />43&#160;%<br />&#160;</p><p>&#171;&#160;3&#176; Le tableau du c est ainsi r&#233;dig&#233;&#160;:</p><p>&#171;&#160;</p><p>Base mensuelle du pr&#233;l&#232;vement<br />Taux proportionnel<br />Inf&#233;rieure ou &#233;gale &#224; 4 198&#160;&#8364;<br />0&#160;%<br />De 4 199&#160;&#8364; &#224; 4 570&#160;&#8364;<br />1&#160;%<br />De 4 571&#160;&#8364; &#224; 5 208&#160;&#8364;<br />2&#160;%<br />De 5 209&#160;&#8364; &#224; 5 635&#160;&#8364;<br />3&#160;%<br />De 5 636&#160;&#8364; &#224; 6 138&#160;&#8364;<br />4&#160;%<br />De 6 139&#160;&#8364; &#224; 7 152&#160;&#8364;<br />5&#160;%<br />De 7 153&#160;&#8364; &#224; 8 240&#160;&#8364;<br />7&#160;%<br />De 8 241&#160;&#8364; &#224; 9 124&#160;&#8364;<br />9&#160;%<br />De 9 125&#160;&#8364; &#224; 10 293&#160;&#8364;<br />11&#160;%<br />De 10 294&#160;&#8364; &#224; 11 578&#160;&#8364;<br />14&#160;%<br />De 11 579&#160;&#8364; &#224; 13 233&#160;&#8364;<br />17&#160;%<br />De 13 234&#160;&#8364; &#224; 16 633&#160;&#8364;<br />20&#160;%<br />De 16 634&#160;&#8364; &#224; 22 176&#160;&#8364;<br />25&#160;%<br />De 22 177&#160;&#8364; &#224; 36 952&#160;&#8364;<br />30&#160;%<br />De 36 953&#160;&#8364; &#224; 165 957&#160;&#8364;<br />36&#160;%<br />Sup&#233;rieure &#224; 165 957&#160;&#8364;<br />43&#160;%<br />&#187;</p><p>II.&#160;&#8211;&#160;Compl&#233;ter cet article par l'alin&#233;a suivant&#160;:</p><p>&#171;&#160;V.&#160;&#8211;&#160;La perte de recettes pour l&#8217;&#201;tat est compens&#233;e &#224; due concurrence par la cr&#233;ation d&#8217;une taxe additionnelle aux droits mentionn&#233;s aux articles 575 et 575 A du code g&#233;n&#233;ral des imp&#244;ts.&#160;&#187;</p>",
    "exposeSommaire": "<p style=\"text-align: justify;\">Cet amendement vise &#224; corriger la m&#233;canique du taux forfaitaire.</p><p style=\"text-align: justify;\">Il est pr&#233;vu dans le cadre de la r&#233;forme que le contribuable puisse demander l&#8217;application par son employeur d&#8217;un taux neutre, &#171;&#160;forfaitaire&#160;&#187;, au lieu des taux calcul&#233;s par l&#8217;administration et tenant compte de ses revenus.</p><p style=\"text-align: justify;\">Ce m&#233;canisme est notamment pr&#233;vu pour les contribuables qui ne souhaiteraient pas que leur employeur ne d&#233;duise, par le niveau de pr&#233;l&#232;vement, d&#8217;informations relevant de leur vie priv&#233;e (existence d&#8217;autres revenus par exemple).</p><p style=\"text-align: justify;\">Or, le taux forfaitaire pr&#233;vu par le projet du gouvernement est tel que son utilisation sera quasi-syst&#233;matiquement d&#233;favorable aux contribuables&#160;: ce dernier devra avancer &#224; l&#8217;&#201;tat jusqu&#8217;&#224; la r&#233;gularisation, l&#8217;ann&#233;e suivante, une somme non n&#233;gligeable pouvant s&#8217;&#233;lever dans certains cas &#224; un mois de salaire&#160;!</p><p style=\"text-align: justify;\">Autre probl&#232;me&#160;: ce taux forfaitaire est source d&#8217;effets de seuil pouvant conduire &#224; une surimposition pour quelques&#160;euros suppl&#233;mentaires de revenu&#160;!</p><p style=\"text-align: justify;\">Le taux forfaitaire &#233;tant le m&#234;me selon que l&#8217;on est c&#233;libataire, mari&#233; ou avec des enfants, les &#233;carts en d&#233;faveur des contribuables existent dans toutes les situations.</p><p style=\"text-align: justify;\">Pire&#160;: ce m&#233;canisme s&#8217;av&#232;re particuli&#232;rement p&#233;nalisant pour les plus jeunes des contribuables, qu&#8217;ils soient nouveaux entrants sur le march&#233; du travail ou encore rattach&#233;s au foyer fiscal de leurs parents, car dans ces cas, le taux forfaitaire, tel que cela est envisag&#233; dans le m&#233;canisme r&#233;sultant de l&#8217;article&#160;60 de la loi de finances pour 2017.</p><p style=\"text-align: justify;\">Pour cette raison, le bar&#232;me du taux forfaitaire doit &#234;tre revu dans un sens o&#249; il ne sera plus syst&#233;matiquement d&#233;favorable.</p><p style=\"text-align: justify;\">Le pr&#233;sent amendement propose un taux calcul&#233; pour un c&#233;libataire avec trois enfants &#224; charge.</p>"
  },
  "representations": [
    {
      "nom": "PDF",
      "typeMime": {
        "type": "application",
        "subType": "PDF"
      },
      "statutRepresentation": {
        "verbatim": true,
        "canonique": true,
        "officielle": true,
        "transcription": false,
        "enregistrement": false
      },
      "contenu": {
        "documentURI": "/15/amendements/0499/AN/102.pdf"
      }
    }
  ],
  "seanceDiscussion": "RUANR5L15S2018IDS20849",
  "sort": {
    "dateSaisie": "2017-12-19T23:35:45.000+01:00",
    "sortEnSeance": "Tombé"
  },
  "dateDepot": "2017-12-19T01:00:00.000+01:00",
  "dateDistribution": "2017-12-19T01:00:00.000+01:00",
  "article99": "0",
  "loiReference": {}
}