{
  "uid": "AMANR5L15SEA717460BTC1767P0D1N366",
  "identifiant": {
    "legislature": "15",
    "numero": "366",
    "numRect": "0",
    "saisine": {
      "texteLegislatifRef": "PRJLANR5L15BTC1767",
      "numeroPartiePLF": "0",
      "organeExamen": "PO717460",
      "mentionSecondeDeliberation": "0"
    }
  },
  "numeroLong": "366",
  "etapeTexte": "1ère lecture (1ère assemblée saisie)",
  "triAmendement": "doaaaaaaaaaaaaaaaaaaaaaaaaaaaaaaaaaaaaaaaaaaaaaaaaano",
  "cardinaliteAmdtMultiples": "1",
  "etat": "Discuté",
  "signataires": {
    "auteur": {
      "typeAuteur": "Depute",
      "acteurRef": "PA718926",
      "groupePolitiqueRef": "PO730940"
    },
    "cosignatairesRefs": [
      "PA718720",
      "PA721896",
      "PA610667",
      "PA721012",
      "PA722110",
      "PA267306",
      "PA335612",
      "PA718926",
      "PA610654",
      "PA441",
      "PA721118",
      "PA721270",
      "PA689",
      "PA720692",
      "PA720546",
      "PA722202"
    ],
    "texteAffichable": "M.&#160;Dharr&#233;ville,  M.&#160;Bruneel, M.&#160;Nilor, Mme&#160;Bello, M.&#160;Brotherson, Mme&#160;Buffet, M.&#160;Chassaigne, M.&#160;Dufr&#232;gne, Mme&#160;Faucillon, M.&#160;Jumel, Mme&#160;K&#233;clard-Mond&#233;sir, M.&#160;Lecoq, M.&#160;Peu, M.&#160;Fabien&#160;Roussel, M.&#160;Serville et M.&#160;Wulfranc"
  },
  "pointeurFragmentTexte": {
    "division": {
      "titre": "Article 8",
      "articleDesignationCourte": "ART. 8",
      "type": "ARTICLE",
      "avantAApres": "A",
      "divisionRattachee": "ARTICLE 8",
      "urlDivisionTexteVise": "/15/textes/1767.asp#D_Article_8"
    }
  },
  "corps": {
    "dispositif": "<p>Supprimer cet article.</p>",
    "exposeSommaire": "<p style=\"text-align: justify;\">Le pr&#233;sent article pr&#233;voit d&#8217;habiliter le Gouvernement &#224; refondre la carte hospitali&#232;re avec la mise en place des h&#244;pitaux de proximit&#233;. Le recours &#224; des ordonnances t&#233;moigne de la volont&#233; du Gouvernement de sortir du d&#233;bat parlementaire les enjeux essentiels de la r&#233;forme.</p><p style=\"text-align: justify;\">La labellisation des h&#244;pitaux de proximit&#233; laisse entrevoir de nombreuses restructurations hospitali&#232;res par la fermeture de services de chirurgie et de maternit&#233; dans nos territoires.</p><p style=\"text-align: justify;\">C&#8217;est pourquoi nous demandons la suppression de cet article.</p>"
  },
  "representations": [
    {
      "nom": "PDF",
      "typeMime": {
        "type": "application",
        "subType": "PDF"
      },
      "statutRepresentation": {
        "verbatim": true,
        "canonique": true,
        "officielle": true,
        "transcription": false,
        "enregistrement": false
      },
      "contenu": {
        "documentURI": "/15/amendements/1767/AN/366.pdf"
      }
    }
  ],
  "seanceDiscussion": "RUANR5L15S2019IDS21564",
  "sort": {
    "dateSaisie": "2019-03-22T01:11:25.000+01:00",
    "sortEnSeance": "Rejeté"
  },
  "dateDepot": "2019-03-15T01:00:00.000+01:00",
  "dateDistribution": "2019-03-18T01:00:00.000+01:00",
  "article99": "0",
  "loiReference": {}
}