{
  "uid": "AMANR5L15SEA717460B0911P0D1N1690",
  "identifiant": {
    "legislature": "15",
    "numero": "1690",
    "numRect": "1",
    "saisine": {
      "texteLegislatifRef": "PRJLANR5L15B0911",
      "numeroPartiePLF": "0",
      "organeExamen": "PO717460",
      "mentionSecondeDeliberation": "0"
    }
  },
  "numeroLong": "1690 (Rect)",
  "etapeTexte": "1ère lecture (1ère assemblée saisie)",
  "triAmendement": "aehi",
  "cardinaliteAmdtMultiples": "1",
  "etat": "A discuter",
  "signataires": {
    "auteur": {
      "typeAuteur": "Depute",
      "acteurRef": "PA605694",
      "groupePolitiqueRef": "PO723569"
    },
    "cosignatairesRefs": [
      "PA605694"
    ],
    "texteAffichable": "M.&#160;Falorni"
  },
  "pointeurFragmentTexte": {
    "division": {
      "titre": "Article 9",
      "articleDesignationCourte": "APRÈS ART. 9",
      "type": "ARTICLE",
      "avantAApres": "Apres",
      "divisionRattachee": "APRÈS L'ARTICLE 9, insérer l'article suivant:",
      "articleAdditionnel": "1",
      "urlDivisionTexteVise": "/15/textes/0911.asp#D_Article_9"
    }
  },
  "corps": {
    "dispositif": "<p style=\"text-align: justify;\">&#160;Apr&#232;s le premier alin&#233;a de l&#8217;article&#160;48 de la Constitution, il est ins&#233;r&#233; un alin&#233;a ainsi r&#233;dig&#233;&#160;:</p><p style=\"text-align: justify;\">&#171;&#160;Le Premier ministre transmet au d&#233;but de chaque trimestre son programme l&#233;gislatif pour l&#8217;ann&#233;e &#224; venir.&#160;&#187;</p>",
    "exposeSommaire": "<p style=\"text-align: justify;\">Le pr&#233;sent projet de loi a pour objectif de r&#233;duire les pouvoirs du Parlement au profit de l&#8217;ex&#233;cutif. En r&#233;ponse &#224; cela et en vue de pr&#233;server le r&#244;le essentiel du Parlement voire de le renforcer cet amendement vise &#224; clarifier le programme l&#233;gislatif. Cet amendement reprend une des propositions du groupe de travail &#171;&#160;Pour une nouvelle Assembl&#233;e Nationale&#160;&#187; qui vise &#224; contraindre le Gouvernement &#224; mieux organiser le programme l&#233;gislatif qu&#8217;il soumet au Parlement.</p>"
  },
  "representations": [
    {
      "nom": "PDF",
      "typeMime": {
        "type": "application",
        "subType": "PDF"
      },
      "statutRepresentation": {
        "verbatim": true,
        "canonique": true,
        "officielle": true,
        "transcription": false,
        "enregistrement": false
      },
      "contenu": {
        "documentURI": "/15/amendements/0911/AN/1690.pdf"
      }
    }
  ],
  "dateDepot": "2018-07-06T02:00:00.000+02:00",
  "dateDistribution": "2018-07-11T02:00:00.000+02:00",
  "article99": "0",
  "loiReference": {
    "codeLoi": "Constitution",
    "divisionCodeLoi": "48"
  }
}