{
  "uid": "AMANR5L15PO59048B1142P0D1N109",
  "identifiant": {
    "legislature": "15",
    "numero": "109",
    "numRect": "0",
    "saisine": {
      "texteLegislatifRef": "PRJLANR5L15B1142",
      "numeroPartiePLF": "0",
      "organeExamen": "PO59048",
      "mentionSecondeDeliberation": "0"
    }
  },
  "numeroLong": "CF109",
  "etapeTexte": "1ère lecture (2ème assemblée saisie)",
  "triAmendement": "aai",
  "cardinaliteAmdtMultiples": "1",
  "etat": "Discuté",
  "signataires": {
    "auteur": {
      "typeAuteur": "Depute",
      "acteurRef": "PA605518",
      "groupePolitiqueRef": "PO730964"
    },
    "cosignatairesRefs": [
      "PA720996",
      "PA605518"
    ],
    "texteAffichable": "M.&#160;Fran&#231;ois-Michel&#160;Lambert et M.&#160;El Guerrab"
  },
  "pointeurFragmentTexte": {
    "division": {
      "titre": "Article 8",
      "articleDesignationCourte": "APRÈS ART. 8",
      "type": "ARTICLE",
      "avantAApres": "Apres",
      "divisionRattachee": "APRÈS L'ARTICLE 8, insérer l'article suivant:",
      "articleAdditionnel": "1",
      "urlDivisionTexteVise": "/15/textes/1142.asp#D_Article_8"
    }
  },
  "corps": {
    "dispositif": "<p>Au c) du 1) de l&#8217;article 1728 du code g&#233;n&#233;ral des imp&#244;ts, le nombre&#160;: &#171;&#160;80&#160;&#187; est remplac&#233; par le nombre&#160;: &#171;&#160;90&#160;&#187;.</p>",
    "exposeSommaire": "<p style=\"text-align: justify;\">L&#8217;article&#160;1728 du Code G&#233;n&#233;ral des Imp&#244;ts est relatif aux sanctions fiscales applicables en cas de d&#233;faut ou retard de d&#233;claration.</p><p style=\"text-align: justify;\">Cet amendement n&#8217;entend pas modifier le r&#233;gime des sanctions o&#249; un l&#233;ger retard est le fait g&#233;n&#233;rateur de l&#8217;application de la p&#233;nalit&#233; mais plut&#244;t de punir plus s&#233;v&#232;rement les cas de d&#233;couverte d&#8217;une activit&#233; occulte ayant par cons&#233;quent fauss&#233; l&#8217;op&#233;ration d&#8217;assiette ou de liquidation de l&#8217;imp&#244;t.</p><p style=\"text-align: justify;\">Il est donc propos&#233;, par cet amendement de passer de 80&#160;% de p&#233;nalit&#233; en cas de d&#233;couverte d&#8217;une activit&#233; occulte &#224; 90&#160;%.&#160;</p>"
  },
  "representations": [
    {
      "nom": "PDF",
      "typeMime": {
        "type": "application",
        "subType": "PDF"
      },
      "statutRepresentation": {
        "verbatim": true,
        "canonique": true,
        "officielle": true,
        "transcription": false,
        "enregistrement": false
      },
      "contenu": {
        "documentURI": "/15/amendements/1142/CION_FIN/CF109.pdf"
      }
    }
  ],
  "sort": {
    "dateSaisie": "2018-07-25T00:50:08.000+02:00",
    "sortEnSeance": "Non soutenu"
  },
  "dateDepot": "2018-07-20T02:00:00.000+02:00",
  "dateDistribution": "2018-07-23T02:00:00.000+02:00",
  "article99": "0",
  "loiReference": {
    "codeLoi": "impôts",
    "divisionCodeLoi": "1728"
  }
}