{
  "uid": "AMANR5L15SEA717460BTA0216P0D1N318",
  "identifiant": {
    "legislature": "15",
    "numero": "318",
    "numRect": "0",
    "saisine": {
      "texteLegislatifRef": "PRJLANR5L15BTA0216",
      "numeroPartiePLF": "0",
      "organeExamen": "PO717460",
      "mentionSecondeDeliberation": "0"
    }
  },
  "numeroLong": "318",
  "etapeTexte": "Lecture définitive",
  "triAmendement": "kpaaaaaaaaaaaaaaaaaaaaaaaaaaaaaaaaaaaaaaaaaaaaaaaaekkzz",
  "cardinaliteAmdtMultiples": "1",
  "etat": "Discuté",
  "signataires": {
    "auteur": {
      "typeAuteur": "Depute",
      "acteurRef": "PA607619",
      "groupePolitiqueRef": "PO759900"
    },
    "cosignatairesRefs": [
      "PA333421",
      "PA608292",
      "PA719138",
      "PA336175",
      "PA719146",
      "PA331582",
      "PA405480",
      "PA267042",
      "PA607619",
      "PA336439"
    ],
    "texteAffichable": "M.&#160;Molac,  M.&#160;Acquaviva, M.&#160;Castellani, M.&#160;Cl&#233;ment, Mme&#160;Dubi&#233;, M.&#160;Favennec Becot, M.&#160;Pancher, Mme&#160;Pinel, M.&#160;Pupponi et M.&#160;Philippe&#160;Vigier"
  },
  "pointeurFragmentTexte": {
    "division": {
      "titre": "Article 52 A",
      "articleDesignationCourte": "ART. 52 A",
      "type": "ARTICLE",
      "avantAApres": "A",
      "divisionRattachee": "ARTICLE 52 A",
      "urlDivisionTexteVise": "/15/textes/TA0216.asp#D_Article_52_A"
    }
  },
  "corps": {
    "dispositif": "<p style=\"text-align: justify;\">Supprimer cet article.</p>",
    "exposeSommaire": "<p style=\"text-align: justify;\">La r&#233;forme de la justice p&#233;nale des mineurs doit se faire d&#8217;une main tremblante apr&#232;s une large concertation de l&#8217;ensemble des acteurs impliqu&#233;s. Proc&#233;der par d&#233;p&#244;t d&#8217;amendement d&#8217;une demande d&#8217;habilitation de prise d&#8217;ordonnance n&#8217;est pas acceptable, tant pour les justiciables et les professionnels de la justice, que pour le Parlement qui se voit dessaisi de son pouvoir l&#233;gislatif sur une mati&#232;re si sensible. Telles sont les principales raisons &#224; l&#8217;origine de la demande de suppression de cet article.</p>"
  },
  "representations": [
    {
      "nom": "PDF",
      "typeMime": {
        "type": "application",
        "subType": "PDF"
      },
      "statutRepresentation": {
        "verbatim": true,
        "canonique": true,
        "officielle": true,
        "transcription": false,
        "enregistrement": false
      },
      "contenu": {
        "documentURI": "/15/amendements/TA0216/AN/318.pdf"
      }
    }
  ],
  "sort": {
    "dateSaisie": "2019-02-19T00:05:06.000+01:00",
    "sortEnSeance": "Rejeté"
  },
  "dateDepot": "2019-02-18T01:00:00.000+01:00",
  "dateDistribution": "2019-02-18T01:00:00.000+01:00",
  "article99": "0",
  "loiReference": {}
}