{
  "uid": "AMANR5L15PO419865B1393P0D1N55",
  "identifiant": {
    "legislature": "15",
    "numero": "55",
    "numRect": "0",
    "saisine": {
      "texteLegislatifRef": "PIONANR5L15B1393",
      "numeroPartiePLF": "0",
      "organeExamen": "PO419865",
      "mentionSecondeDeliberation": "0"
    }
  },
  "numeroLong": "CD55",
  "etapeTexte": "1ère lecture (2ème assemblée saisie)",
  "triAmendement": "baaaaaaaaaaaaaaaaaaaaaaaaaaaaaaaaaaaaaaaaaaaaaaaaabaztzc",
  "cardinaliteAmdtMultiples": "1",
  "etat": "Discuté",
  "signataires": {
    "auteur": {
      "typeAuteur": "Depute",
      "acteurRef": "PA719194",
      "groupePolitiqueRef": "PO730964"
    },
    "cosignatairesRefs": [
      "PA719194"
    ],
    "texteAffichable": "Mme&#160;Yolaine&#160;de Courson, rapporteure"
  },
  "pointeurFragmentTexte": {
    "division": {
      "titre": "Article 2",
      "articleDesignationCourte": "ART. 2",
      "type": "ARTICLE",
      "avantAApres": "A",
      "divisionRattachee": "ARTICLE 2",
      "urlDivisionTexteVise": "/15/textes/1393.asp#D_Article_2"
    },
    "alinea": {
      "numero": "9"
    }
  },
  "corps": {
    "dispositif": "<p style=\"text-align: justify;\">R&#233;diger ainsi l&#8217;alin&#233;a&#160;9&#160;:</p><p style=\"text-align: justify;\">&#171;&#160;III.&#160;&#8211;&#160;L&#8217;agence a pour mission d&#8217;aider &#224; concevoir et d&#8217;accompagner les projets et les initiatives port&#233;es par l&#8217;&#201;tat, les collectivit&#233;s territoriales, les groupements de collectivit&#233;s territoriales, les r&#233;seaux d&#8217;entreprises et les associations dans le domaine du num&#233;rique.&#160;&#187;</p>",
    "exposeSommaire": "<p style=\"text-align: justify;\">Comme dans le cadre de la premi&#232;re mission qui lui est attribu&#233;e par l&#8217;article&#160;2 de la proposition de loi, la troisi&#232;me mission - la mission &#171;&#160;Num&#233;rique&#160;&#187; - de l&#8217;ANCT doit comporter un r&#244;le d&#8217;inspiration, pour faire &#233;merger des projets et non pas seulement pour soutenir des projets d&#233;j&#224; d&#233;finis.</p><p style=\"text-align: justify;\">Le pr&#233;sent amendement propose, par ailleurs, d&#8217;expliciter l&#8217;expression &#171;&#160;collectivit&#233;s publiques&#160;&#187; figurant dans le texte, et de supprimer la r&#233;f&#233;rence aux particuliers, puisqu&#8217;il s&#8217;agit de transf&#233;rer &#224; l&#8217;ANCT une partie des activit&#233;s de l&#8217;actuelle Agence du num&#233;rique et que celle-ci ne soutient pas d&#8217;initiatives port&#233;es directement par des particuliers.</p>"
  },
  "representations": [
    {
      "nom": "PDF",
      "typeMime": {
        "type": "application",
        "subType": "PDF"
      },
      "statutRepresentation": {
        "verbatim": true,
        "canonique": true,
        "officielle": true,
        "transcription": false,
        "enregistrement": false
      },
      "contenu": {
        "documentURI": "/15/amendements/1393/CION-DVP/CD55.pdf"
      }
    }
  ],
  "sort": {
    "dateSaisie": "2019-02-05T22:10:47.000+01:00",
    "sortEnSeance": "Adopté"
  },
  "dateDepot": "2019-01-29T01:00:00.000+01:00",
  "dateDistribution": "2019-02-05T01:00:00.000+01:00",
  "article99": "0",
  "loiReference": {}
}