{
  "uid": "AMANR5L15SEA717460BTC1974P0D1N1228",
  "identifiant": {
    "legislature": "15",
    "numero": "1228",
    "numRect": "1",
    "saisine": {
      "texteLegislatifRef": "PRJLANR5L15BTC1974",
      "numeroPartiePLF": "0",
      "organeExamen": "PO717460",
      "mentionSecondeDeliberation": "0"
    }
  },
  "numeroLong": "1228 (Rect)",
  "etapeTexte": "1ère lecture (2ème assemblée saisie)",
  "triAmendement": "aoaaaaaaaaaaaaaaaaaaaaaaaaaaaaaaaaaaaaaaaaaaaaaaaaeabb",
  "cardinaliteAmdtMultiples": "1",
  "etat": "Discuté",
  "signataires": {
    "auteur": {
      "typeAuteur": "Depute",
      "acteurRef": "PA718838",
      "groupePolitiqueRef": "PO730934"
    },
    "cosignatairesRefs": [
      "PA720210",
      "PA721506",
      "PA721410",
      "PA605036",
      "PA721816",
      "PA718838",
      "PA346218",
      "PA721046",
      "PA608016",
      "PA609726",
      "PA721286",
      "PA719318",
      "PA340853",
      "PA266793",
      "PA718884",
      "PA720586",
      "PA608416",
      "PA721968",
      "PA267527",
      "PA267429"
    ],
    "texteAffichable": "M.&#160;Brun,  M.&#160;Abad, Mme&#160;Anthoine, M.&#160;Aubert, Mme&#160;Bassire, Mme&#160;Bazin-Malgras, Mme&#160;Beauvais, Mme&#160;Bonnivard, M.&#160;Bony, M.&#160;Boucard, M.&#160;Cinieri, M.&#160;Hetzel, Mme&#160;Kuster, M.&#160;Leclerc, Mme&#160;Louwagie, M.&#160;Masson, M.&#160;Ramadier, M.&#160;Saddier, M.&#160;Vatin et M.&#160;Vialay"
  },
  "pointeurFragmentTexte": {
    "division": {
      "titre": "Article 5",
      "articleDesignationCourte": "ART. 5",
      "type": "ARTICLE",
      "avantAApres": "A",
      "divisionRattachee": "ARTICLE 5",
      "urlDivisionTexteVise": "/15/textes/1974.asp#D_Article_5"
    },
    "alinea": {
      "avantAApres": "Apres",
      "numero": "28"
    }
  },
  "corps": {
    "dispositif": "<p>Apr&#232;s l&#8217;alin&#233;a&#160;28, ins&#233;rer les deux alin&#233;as suivants&#160;:</p><p>&#171;&#160;6&#176;&#160;bis Apr&#232;s l&#8217;article L.&#160;1214&#8209;4, il est ins&#233;r&#233; un article L.&#160;1214&#8209;4-1 ainsi r&#233;dig&#233;&#160;:</p><p>&#171;&#160;Art.&#160;L.&#160;1214&#8209;4-1.&#160;&#8211;&#160;Le plan mobilit&#233; doit &#234;tre soumis pour avis consultatif &#224; au moins une entit&#233; du territoire concern&#233; par celui-ci&#160;&#187;.</p>",
    "exposeSommaire": "<p style=\"text-align: justify;\">Le plan de mobilit&#233; sera le document juridique et strat&#233;gique qui r&#233;gira l&#8217;ensemble des actions &#224; conduire en faveur de la mobilit&#233;. Il doit donc lui aussi prendre en compte le d&#233;veloppement potentiel de nouvelles offres de d&#233;placements et de mobilit&#233;.</p><p style=\"text-align: justify;\">D&#232;s lors, il semble fondamental qu&#8217;il puisse recueillir l&#8217;expertise d&#8217;une entit&#233; qui connait pr&#233;cis&#233;ment les sp&#233;cificit&#233;s du territoire et des enjeux aff&#233;rents comme la r&#233;gion, le d&#233;partement, la communaut&#233; de communes ou le syndicat intercommunal de transport, &#224; l&#8217;image du syndicat &#171;&#160;Tout&#8217;enbus&#160;&#187; qui assure le transport urbain et scolaire sur 11 communes du bassin d&#8217;Aubenas.</p>"
  },
  "representations": [
    {
      "nom": "PDF",
      "typeMime": {
        "type": "application",
        "subType": "PDF"
      },
      "statutRepresentation": {
        "verbatim": true,
        "canonique": true,
        "officielle": true,
        "transcription": false,
        "enregistrement": false
      },
      "contenu": {
        "documentURI": "/15/amendements/1974/AN/1228.pdf"
      }
    }
  ],
  "seanceDiscussion": "RUANR5L15S2019IDS21678",
  "sort": {
    "dateSaisie": "2019-06-05T23:13:56.000+02:00",
    "sortEnSeance": "Rejeté"
  },
  "dateDepot": "2019-05-28T02:00:00.000+02:00",
  "dateDistribution": "2019-06-05T02:00:00.000+02:00",
  "article99": "0",
  "loiReference": {}
}