{
  "uid": "AMANR5L15SEA717460BTC2243P0D1N492",
  "identifiant": {
    "legislature": "15",
    "numero": "492",
    "numRect": "0",
    "saisine": {
      "texteLegislatifRef": "PRJLANR5L15BTC2243",
      "numeroPartiePLF": "0",
      "organeExamen": "PO717460",
      "mentionSecondeDeliberation": "0"
    }
  },
  "numeroLong": "492",
  "etapeTexte": "1ère lecture (1ère assemblée saisie)",
  "triAmendement": "dsaaaaaaaaaaaaaaaaaaaaaaaaaaaaaaaaaaaaaaaaaaaaaaaagnxm",
  "cardinaliteAmdtMultiples": "1",
  "etat": "Discuté",
  "signataires": {
    "auteur": {
      "typeAuteur": "Depute",
      "acteurRef": "PA608416",
      "groupePolitiqueRef": "PO730934"
    },
    "cosignatairesRefs": [
      "PA266776",
      "PA608416"
    ],
    "texteAffichable": "M.&#160;Hetzel et M.&#160;Reiss"
  },
  "pointeurFragmentTexte": {
    "division": {
      "titre": "Article 14",
      "articleDesignationCourte": "ART. 14",
      "type": "ARTICLE",
      "avantAApres": "A",
      "divisionRattachee": "ARTICLE 14",
      "urlDivisionTexteVise": "/15/textes/2243.asp#D_Article_14"
    },
    "alinea": {
      "avantAApres": "A",
      "numero": "11",
      "alineaDesignation": "Alinéa 11"
    }
  },
  "corps": {
    "dispositif": "<p style=\"text-align: justify;\">Substituer &#224; l&#8217;alin&#233;a&#160;11 les quatre alin&#233;as suivants&#160;:</p><p style=\"text-align: justify;\">&#171;&#160;II. &#8211;&#160;Une recherche ne peut &#234;tre men&#233;e qu&#8217;&#224; partir d&#8217;embryons con&#231;us <i>in vitro</i> dans le cadre d&#8217;une assistance m&#233;dicale &#224; la procr&#233;ation et qui ne font plus l&#8217;objet d&#8217;un projet parental. Que l&#8217;embryon, ou les cellules souches qui en sont d&#233;riv&#233;es, proviennent de l&#8217;&#233;tranger ou de France, la recherche ne peut &#234;tre effectu&#233;e qu&#8217;avec le consentement &#233;crit pr&#233;alable du couple, par ailleurs d&#251;ment inform&#233;s des possibilit&#233;s d&#8217;accueil des embryons par un autre couple ou d&#8217;arr&#234;t de leur conservation.</p><p style=\"text-align: justify;\">&#171;&#160;Dans le cas o&#249; le couple ou le membre survivant du couple consent &#224; ce que ses embryons surnum&#233;raires fassent l&#8217;objet de recherches, il est inform&#233; de la nature des recherches projet&#233;es afin de lui permettre de donner un consentement libre et &#233;clair&#233;.</p><p style=\"text-align: justify;\">&#171;&#160;Le consentement &#233;crit et pr&#233;alable du couple dont les embryons sont issus, ou du membre survivant de ce couple, est joint au protocole de recherche.&#160;</p><p style=\"text-align: justify;\">&#171;&#160;&#192; l&#8217;exception des situations mentionn&#233;es au dernier alin&#233;a de l&#8217;article L.&#160;2131&#8209;4 et au troisi&#232;me alin&#233;a de l&#8217;article L.&#160;2141&#8209;3, le consentement doit &#234;tre confirm&#233; &#224; l&#8217;issue d&#8217;un d&#233;lai de r&#233;flexion de trois mois. Le consentement des deux membres du couple ou du membre survivant du couple est r&#233;vocable sans motif tant que les recherches n&#8217;ont pas d&#233;but&#233;.&#160;&#187;</p>",
    "exposeSommaire": "<p style=\"text-align: justify;\">Cet amendement porte sur le consentement libre et &#233;clair&#233; du couple g&#233;niteur &#224; la destruction de leur embryon dans le cadre d&#8217;un protocole de recherche. Cette condition pr&#233;alable &#224; la d&#233;livrance d&#8217;une autorisation de recherche par l&#8217;Agence de la biom&#233;decine est importante en ce qu&#8217;elle participe &#224; la protection, bien que relative, de l&#8217;embryon humain.</p>"
  },
  "representations": [
    {
      "nom": "PDF",
      "typeMime": {
        "type": "application",
        "subType": "PDF"
      },
      "statutRepresentation": {
        "verbatim": true,
        "canonique": true,
        "officielle": true,
        "transcription": false,
        "enregistrement": false
      },
      "contenu": {
        "documentURI": "/15/amendements/2243/AN/492.pdf"
      }
    }
  ],
  "seanceDiscussion": "RUANR5L15S2020IDS21848",
  "sort": {
    "dateSaisie": "2019-10-04T17:51:00.000+02:00",
    "sortEnSeance": "Rejeté"
  },
  "dateDepot": "2019-09-16T02:00:00.000+02:00",
  "dateDistribution": "2019-09-30T02:00:00.000+02:00",
  "article99": "0",
  "loiReference": {}
}