{
  "uid": "AMANR5L15PO59051B0714P0D1N657",
  "identifiant": {
    "legislature": "15",
    "numero": "657",
    "numRect": "0",
    "saisine": {
      "texteLegislatifRef": "PRJLANR5L15B0714",
      "numeroPartiePLF": "0",
      "organeExamen": "PO59051",
      "mentionSecondeDeliberation": "0"
    }
  },
  "numeroLong": "CL657",
  "etapeTexte": "1ère lecture (1ère assemblée saisie)",
  "triAmendement": "bvje",
  "cardinaliteAmdtMultiples": "1",
  "etat": "Discuté",
  "signataires": {
    "auteur": {
      "typeAuteur": "Depute",
      "acteurRef": "PA721202",
      "groupePolitiqueRef": "PO730958"
    },
    "cosignatairesRefs": [
      "PA720430",
      "PA718868",
      "PA2150",
      "PA721960",
      "PA720422",
      "PA720892",
      "PA719676",
      "PA719578",
      "PA721062",
      "PA720286",
      "PA722142",
      "PA721202",
      "PA588884",
      "PA718860",
      "PA721226",
      "PA721210",
      "PA720846"
    ],
    "texteAffichable": "M.&#160;Coquerel,  Mme&#160;Autain, M.&#160;Bernalicis, M.&#160;Corbi&#232;re, Mme&#160;Fiat, M.&#160;Lachaud, M.&#160;Larive, M.&#160;M&#233;lenchon, Mme&#160;Obono, Mme&#160;Panot, M.&#160;Prud&apos;homme, M.&#160;Quatennens, M.&#160;Ratenon, Mme&#160;Ressiguier, Mme&#160;Rubin, M.&#160;Ruffin et Mme&#160;Taurine"
  },
  "pointeurFragmentTexte": {
    "division": {
      "titre": "Article 33",
      "articleDesignationCourte": "APRÈS ART. 33",
      "type": "ARTICLE",
      "avantAApres": "Apres",
      "divisionRattachee": "APRÈS L'ARTICLE 33, insérer l'article suivant:",
      "articleAdditionnel": "1",
      "urlDivisionTexteVise": "/15/textes/0714.asp#D_Article_33"
    }
  },
  "corps": {
    "dispositif": "<p style=\"text-align: justify;\">&#171;&#160;I.&#160;&#8211;&#160;Les articles L.&#160;311&#8209;13 et L.&#160;311&#8209;14 du code de l&#8217;entr&#233;e et du s&#233;jour des &#233;trangers et du droit d&#8217;asile sont abrog&#233;s.</p><p style=\"text-align: justify;\">&#171;&#160;II.&#160;&#8211;&#160;La perte de recettes pour l&#8217;Office fran&#231;ais de l'immigration et de l'int&#233;gration est compens&#233;e &#224; due concurrence par la cr&#233;ation d&#8217;une taxe additionnelle aux droits mentionn&#233;s aux articles 575 et 575 A du code g&#233;n&#233;ral des imp&#244;ts.&#160;&#187;</p>",
    "exposeSommaire": "<p style=\"border: none; padding: 0cm; text-align: justify;\">Les personnes qui r&#233;sident en France, qui ne sont pas ressortissantes de l&#8217;Union europ&#233;ennes, qu&#8217;elles soient en situation r&#233;guli&#232;re et irr&#233;guli&#232;re paient n&#233;cessairement de nombreuses taxes et droits, que ceux-ci soient :</p><p style=\"border: none; padding: 0cm; text-align: justify;\">- indirects (notamment la taxe sur la valeur ajout&#233;e (recettes de 153 milliards d&#8217;euros pr&#233;vues pour 2018), et la taxe int&#233;rieure de consommation sur les produits &#233;nerg&#233;tiques (13 milliards d&#8217;euros pour 2018), qui repr&#233;sentent &#224; eux seules 55% des recettes totales de l&#8217;Etat en 2018, voir page 7 de <a href=\"https://www.performance-publique.budget.gouv.fr/sites/performance_publique/files/farandole/ressources/2018/pap/pdf/VMT1-2018.pdf\">https://www.performance-publique.budget.gouv.fr/sites/performance_publique/files/farandole/ressources/2018/pap/pdf/VMT1-2018.pdf</a>) ;</p><p style=\"border: none; padding: 0cm; text-align: justify;\">- ou directs (imp&#244;t sur le revenu, qui repr&#233;sente 73 milliards d&#8217;euros en 2018, soit 24% des recettes totales de l&#8217;Etat).</p><p style=\"border: none; padding: 0cm; text-align: justify;\">Ainsi, comme toutes les personnes pr&#233;sentes sur le territoire, ces personnes contribuent &#224; &#233;galit&#233; en droit &#224; 74% des recettes totales de l&#8217;Etat.</p><p style=\"border: none; padding: 0cm; text-align: justify;\">Or, leur droit au s&#233;jour est soumis &#224; des taxes et droits de timbre sur les titres de s&#233;jour (article L. 311-13 du CESEDA et article D. 311-18-1 du CESEDA) dont les tarifs sont relativement &#233;lev&#233;s et probl&#233;matiques. Chacun.e. peut constater le montant excessif qui peut en r&#233;sulter en consultant ce recensement fait par le GISTI (<a href=\"https://www.gisti.org/IMG/pdf/tableau_taxes_2.pdf\">https://www.gisti.org/IMG/pdf/tableau_taxes_2.pdf</a>). Par exemple, la d&#233;livrance d&#8217;une premi&#232;re carte pour un titre de s&#233;jour salari&#233; co&#251;tera 269 euros, et son renouvellement (annuel) 269 euros aussi. Le renouvellement d&#8217;un titre de s&#233;jour pour un &#233;tranger malade co&#251;tera 269 euros, etc...</p><p style=\"border: none; padding: 0cm; text-align: justify;\">Nous estimons qu&#8217;eu &#233;gard &#224; la contribution fiscale qui existe d&#8217;ores et d&#233;j&#224; pour ces personnes (voir ci-dessus), il est n&#233;cessaire de supprimer toutes ces taxes et droit de timbre sur les titres de s&#233;jour. Cette perte de recette sur l&#8217;Etat sera compens&#233;e par un gage (en respectant donc l&#8217;article 40 de la Constitution.</p><p style=\"border: none; padding: 0cm; text-align: justify;\">Ces dispositions entreront en vigueur le lendemain de la publication au journal officiel de cette loi (article 1er du code civil) et concernent donc toutes les demandes en cours d&#8217;examen sur lesquelles l&#8217;administration n&#8217;avait pas statu&#233; jusqu&#8217;&#224; cette date, ainsi que les demandes post&#233;rieures. Les dispositions de niveau r&#233;glementaire, eu &#233;gard &#224; l&#8217;&#233;volution de la loi, seront ainsi abrog&#233;es de fait (D.311-18-1 du CESEDA notamment).</p>"
  },
  "representations": [
    {
      "nom": "PDF",
      "typeMime": {
        "type": "application",
        "subType": "PDF"
      },
      "statutRepresentation": {
        "verbatim": true,
        "canonique": true,
        "officielle": true,
        "transcription": false,
        "enregistrement": false
      },
      "contenu": {
        "documentURI": "/15/amendements/0714/CION_LOIS/CL657.pdf"
      }
    }
  ],
  "sort": {
    "dateSaisie": "2018-04-06T20:21:50.000+02:00",
    "sortEnSeance": "Non soutenu"
  },
  "dateDepot": "2018-03-30T02:00:00.000+02:00",
  "dateDistribution": "2018-04-03T02:00:00.000+02:00",
  "article99": "0",
  "loiReference": {
    "codeLoi": "entrée et séjour étrangers",
    "divisionCodeLoi": "L311-13 1"
  }
}