{
  "uid": "AMANR5L15PO59048B0485P0D1N254",
  "identifiant": {
    "legislature": "15",
    "numero": "254",
    "numRect": "0",
    "saisine": {
      "texteLegislatifRef": "PRJLANR5L15B0485",
      "numeroPartiePLF": "0",
      "organeExamen": "PO59048",
      "mentionSecondeDeliberation": "0"
    }
  },
  "numeroLong": "CF254",
  "etapeTexte": "Nouvelle Lecture",
  "triAmendement": "q",
  "cardinaliteAmdtMultiples": "1",
  "etat": "Discuté",
  "signataires": {
    "auteur": {
      "typeAuteur": "Depute",
      "acteurRef": "PA608016",
      "groupePolitiqueRef": "PO730934"
    },
    "cosignatairesRefs": [
      "PA608016"
    ],
    "texteAffichable": "Mme&#160;Louwagie"
  },
  "pointeurFragmentTexte": {
    "division": {
      "titre": "Article 62 bis",
      "articleDesignationCourte": "ART. 62 BIS",
      "type": "ARTICLE",
      "avantAApres": "A",
      "divisionRattachee": "ARTICLE 62 BIS",
      "urlDivisionTexteVise": "/15/textes/0485.asp#D_Article_62_bis"
    },
    "alinea": {
      "numero": "6"
    }
  },
  "corps": {
    "dispositif": "<p>I.&#160;&#8211;&#160;&#192; l'alin&#233;a 6, apr&#232;s les mots&#160;:</p><p>&#171;&#160;adopt&#233;es sur rapport de la commission locale d&#8217;&#233;valuation des transferts&#160;&#187; </p><p>ins&#233;rer les mots&#160;:</p><p>&#171;&#160;au plus tard douze mois suivant le transfert de charges&#160;&#187;.</p><p>II.&#160;&#8211;&#160;Supprimer l'alin&#233;a 7.</p>",
    "exposeSommaire": "<p style=\"text-align: justify;\">L&#8217;article&#160;32 bis du projet de loi de finances pour 2018, dans le cadre de sa premi&#232;re lecture au S&#233;nat, a assoupli le d&#233;lai ajout&#233; &#224; la loi de finances pour 2017 concernant la transmission et l&#8217;adoption du rapport de la CLECT.</p><p style=\"text-align: justify;\">En effet, depuis le 1<sup>er</sup> janvier 2017, des d&#233;lais encadrent tr&#232;s strictement l&#8217;&#233;laboration du rapport par la CLECT (9 mois) ainsi que son adoption (3 mois)&#160;et des r&#232;gles de substitution du pr&#233;fet s&#8217;appliquent en cas de non-respect des d&#233;lais ou de d&#233;saccord.</p><p style=\"text-align: justify;\">De tr&#232;s nombreuses communaut&#233;s ont &#233;t&#233; soumises &#224; ces nouvelles obligations d&#232;s 2017 du fait notamment de la g&#233;n&#233;ralisation de la fiscalit&#233; professionnelle unique impliqu&#233;e par la refonte de la carte intercommunale.</p><p style=\"text-align: justify;\">Ainsi, il a &#233;t&#233; propos&#233; de revenir &#224; une proc&#233;dure plus souple donnant davantage de temps aux territoires pour appr&#233;cier le co&#251;t des transferts et des retours de comp&#233;tences.</p><p style=\"text-align: justify;\">Cependant, afin d&#8217;&#233;viter des situations de blocage lors de l&#8217;&#233;valuation des charges et la d&#233;termination des attributions de compensation, le pr&#233;sent amendement propose de confirmer le d&#233;lai d&#8217;un an pour l&#8217;adoption du rapport de la CLECT, et laisse une marge de man&#339;uvre au pr&#233;fet en cas de d&#233;saccord afin de d&#233;terminer le montant des charges transf&#233;r&#233;es.</p><p style=\"text-align: justify;\">&#160;</p>"
  },
  "representations": [
    {
      "nom": "PDF",
      "typeMime": {
        "type": "application",
        "subType": "PDF"
      },
      "statutRepresentation": {
        "verbatim": true,
        "canonique": true,
        "officielle": true,
        "transcription": false,
        "enregistrement": false
      },
      "contenu": {
        "documentURI": "/15/amendements/0485/CION_FIN/CF254.pdf"
      }
    }
  ],
  "sort": {
    "dateSaisie": "2017-12-14T12:00:19.000+01:00",
    "sortEnSeance": "Tombé"
  },
  "dateDepot": "2017-12-13T01:00:00.000+01:00",
  "dateDistribution": "2017-12-14T01:00:00.000+01:00",
  "article99": "0",
  "loiReference": {}
}