{
  "uid": "AMANR5L15PO420120B0904P0D1N1350",
  "identifiant": {
    "legislature": "15",
    "numero": "1350",
    "numRect": "0",
    "saisine": {
      "texteLegislatifRef": "PRJLANR5L15B0904",
      "numeroPartiePLF": "0",
      "organeExamen": "PO420120",
      "mentionSecondeDeliberation": "0"
    }
  },
  "numeroLong": "AS1350",
  "etapeTexte": "1ère lecture (1ère assemblée saisie)",
  "triAmendement": "kgzzzs",
  "cardinaliteAmdtMultiples": "1",
  "etat": "Irrecevable",
  "signataires": {
    "auteur": {
      "typeAuteur": "Depute",
      "acteurRef": "PA2377",
      "groupePolitiqueRef": "PO730934"
    },
    "cosignatairesRefs": [
      "PA2377"
    ],
    "texteAffichable": "M.&#160;Perrut"
  },
  "pointeurFragmentTexte": {
    "division": {
      "titre": "Article 16",
      "articleDesignationCourte": "ART. 16",
      "type": "ARTICLE",
      "avantAApres": "A",
      "divisionRattachee": "ARTICLE 16",
      "urlDivisionTexteVise": "/15/textes/0904.asp#D_Article_16"
    },
    "alinea": {
      "avantAApres": "Apres",
      "numero": "41"
    }
  },
  "corps": {
    "dispositif": "<p style=\"text-align: justify;\">Apr&#232;s l&#8217;alin&#233;a&#160;41, ins&#233;rer l&#8217;alin&#233;a suivant&#160;:</p><p style=\"text-align: justify;\">&#171;&#160;10&#176;&#160;De renforcer l&#8217;acc&#232;s &#224; la formation professionnelle et &#224; l&#8217;apprentissage des travailleurs mentionn&#233;s &#224; l&#8217;article L.&#160;5213&#8209;1 et de veiller &#224; l&#8217;accessibilit&#233; et au caract&#232;re adapt&#233; des formations.&#160;&#187;</p>",
    "exposeSommaire": "<p style=\"text-align: justify;\">L&#8217;article&#160;16 cr&#233;e un nouvel &#233;tablissement public, compos&#233; de fa&#231;on quadripartite, qui sera charg&#233; de la r&#233;gulation de la formation professionnelle continue et de l&#8217;apprentissage&#160;: France comp&#233;tences.</p><p style=\"text-align: justify;\">Parmi les missions confi&#233;es &#224; France Comp&#233;tences, il est propos&#233;, au-regard des besoins des travailleurs handicap&#233;s dans le domaine et du taux de ch&#244;mage, d&#8217;ajouter une mission&#160;: celle de renforcer l&#8217;acc&#232;s &#224; la formation professionnelle et &#224; l&#8217;apprentissage de ce public, mais aussi de veiller au respect de l&#8217;accessibilit&#233; et du caract&#232;re adapt&#233; des formations propos&#233;es.</p><p style=\"text-align: justify;\">Afin de s&#8217;assurer que cette question soit pleinement incluse dans les missions de France Comp&#233;tences et constitue un sujet de pr&#233;occupation, il est &#233;galement propos&#233; que cet &#233;tablissement public puisse faire des recommandations sur l&#8217;acc&#232;s des personnes handicap&#233;es &#224; la formation professionnelle continue et &#224; l&#8217;apprentissage.</p><p style=\"text-align: justify;\">En outre, il est propos&#233; d&#8217;&#233;largir la composition du conseil d&#8217;administration de cet &#233;tablissement &#224; la soci&#233;t&#233; civile, repr&#233;sent&#233;e par les associations de personnes handicap&#233;es, pr&#233;caires et de ch&#244;meurs. En effet, au-regard de l&#8217;importance de l&#8217;acc&#232;s &#224; l&#8217;information et &#224; la formation pour ces personnes souvent &#233;loign&#233;es de l&#8217;emploi, il semble indispensable de les associer &#224; la gouvernance de cet &#233;tablissement public.</p>"
  },
  "representations": [
    {
      "nom": "PDF",
      "typeMime": {
        "type": "application",
        "subType": "PDF"
      },
      "statutRepresentation": {
        "verbatim": true,
        "canonique": true,
        "officielle": true,
        "transcription": false,
        "enregistrement": false
      },
      "contenu": {
        "documentURI": "/15/amendements/0904/CION-SOC/AS1350.pdf"
      }
    }
  ],
  "dateDepot": "2018-05-26T02:00:00.000+02:00",
  "dateDistribution": "2018-05-29T02:00:00.000+02:00",
  "article99": "0",
  "loiReference": {}
}