{
  "uid": "AMANR5L15SEA717460BTC0902P0D1N2380",
  "identifiant": {
    "legislature": "15",
    "numero": "2380",
    "numRect": "0",
    "saisine": {
      "texteLegislatifRef": "PRJLANR5L15BTC0902",
      "numeroPartiePLF": "0",
      "organeExamen": "PO717460",
      "mentionSecondeDeliberation": "0"
    }
  },
  "numeroLong": "2380",
  "etapeTexte": "1ère lecture (1ère assemblée saisie)",
  "triAmendement": "aqzzxzzzzji",
  "cardinaliteAmdtMultiples": "1",
  "etat": "Discuté",
  "signataires": {
    "auteur": {
      "typeAuteur": "Depute",
      "acteurRef": "PA722390",
      "groupePolitiqueRef": "PO730934"
    },
    "cosignatairesRefs": [
      "PA721968",
      "PA722390"
    ],
    "texteAffichable": "Mme&#160;Corneloup et M.&#160;Vialay"
  },
  "pointeurFragmentTexte": {
    "division": {
      "titre": "Article PREMIER",
      "articleDesignationCourte": "ART. PREMIER",
      "type": "ARTICLE",
      "avantAApres": "A",
      "divisionRattachee": "ARTICLE PREMIER",
      "urlDivisionTexteVise": "/15/textes/0902.asp#D_Article_1er"
    },
    "alinea": {
      "avantAApres": "A",
      "numero": "15",
      "alineaDesignation": "Alinéa 15"
    }
  },
  "corps": {
    "dispositif": "<p style=\"text-align: justify;\">Compl&#233;ter l&#8217;alin&#233;a&#160;15 par les trois phrases suivantes&#160;:</p><p style=\"text-align: justify;\">&#171;&#160;Une fois d&#233;finis, ces indicateurs sont syst&#233;matiquement publi&#233;s par les parties et rendus accessibles au public. &#192; d&#233;faut de publication et apr&#232;s une mise en demeure rest&#233;e infructueuse pendant un d&#233;lai de deux mois, l&#8217;autorit&#233; administrative prend toutes les mesures pour assurer la publication des indicateurs. Un d&#233;cret d&#233;termine l&#8217;autorit&#233; administrative comp&#233;tente ainsi que les modalit&#233;s de la sanction.&#160;&#187;</p>",
    "exposeSommaire": "<p style=\"text-align: justify;\">Dans le cas o&#249; les indicateurs de co&#251;ts de production seraient &#233;labor&#233;s par les interprofessions et publi&#233;s par l&#8217;Observatoire de la formation des prix et des marges, il conviendrait d&#8217;assurer la transparence de ces indicateurs.</p><p style=\"text-align: justify;\">En effet, la publication de ces indicateurs permettrait &#224; tous les acteurs de s&#8217;entendre sans &#233;quivoque sur cette base, lors de la d&#233;finition du prix.</p>"
  },
  "representations": [
    {
      "nom": "PDF",
      "typeMime": {
        "type": "application",
        "subType": "PDF"
      },
      "statutRepresentation": {
        "verbatim": true,
        "canonique": true,
        "officielle": true,
        "transcription": false,
        "enregistrement": false
      },
      "contenu": {
        "documentURI": "/15/amendements/0902/AN/2380.pdf"
      }
    }
  ],
  "seanceDiscussion": "RUANR5L15S2018IDS21049",
  "sort": {
    "dateSaisie": "2018-05-23T20:37:03.000+02:00",
    "sortEnSeance": "Tombé"
  },
  "dateDepot": "2018-05-17T02:00:00.000+02:00",
  "dateDistribution": "2018-05-18T02:00:00.000+02:00",
  "article99": "0",
  "loiReference": {}
}