{
  "uid": "AMANR5L15PO59051B0539P0D1N33",
  "identifiant": {
    "legislature": "15",
    "numero": "33",
    "numRect": "0",
    "saisine": {
      "texteLegislatifRef": "PRJLANR5L15B0539",
      "numeroPartiePLF": "0",
      "organeExamen": "PO59051",
      "mentionSecondeDeliberation": "0"
    }
  },
  "numeroLong": "CL33",
  "etapeTexte": "1ère lecture (1ère assemblée saisie)",
  "triAmendement": "bh",
  "cardinaliteAmdtMultiples": "1",
  "etat": "Discuté",
  "signataires": {
    "auteur": {
      "typeAuteur": "Depute",
      "acteurRef": "PA608695",
      "groupePolitiqueRef": "PO730946"
    },
    "cosignatairesRefs": [
      "PA267233",
      "PA335054",
      "PA333285",
      "PA340357",
      "PA588886",
      "PA1198",
      "PA335532",
      "PA608011",
      "PA332614",
      "PA337483",
      "PA608695",
      "PA607553",
      "PA333818",
      "PA609590",
      "PA1809",
      "PA335999",
      "PA610681",
      "PA609332",
      "PA605069",
      "PA429893",
      "PA405480",
      "PA1008",
      "PA1592",
      "PA608172",
      "PA508",
      "PA342415",
      "PA643145",
      "PA719930",
      "PA340343",
      "PA720988"
    ],
    "texteAffichable": "Mme&#160;Untermaier,  Mme&#160;Karamanli, M.&#160;Pueyo, M.&#160;David&#160;Habib, M.&#160;Saulignac, M.&#160;J&#233;r&#244;me&#160;Lambert, M.&#160;Faure, Mme&#160;Bareigts, Mme&#160;Batho, Mme&#160;Battistel, Mme&#160;Bi&#233;mouret, M.&#160;Bouillon, M.&#160;Jean-Louis&#160;Bricout, M.&#160;Carvounas, M.&#160;Alain&#160;David, Mme&#160;Laurence&#160;Dumont, M.&#160;Garot, M.&#160;Hutin, M.&#160;Juanico, M.&#160;Le Foll, M.&#160;Letchimy, Mme&#160;Manin, Mme&#160;Pau-Langevin, Mme&#160;Pires Beaune, M.&#160;Potier, M.&#160;Pupponi, Mme&#160;Rabault, Mme&#160;Vainqueur-Christophe, M.&#160;Vallaud et Mme&#160;Victory"
  },
  "pointeurFragmentTexte": {
    "division": {
      "titre": "Article 4",
      "articleDesignationCourte": "ART. 4",
      "type": "ARTICLE",
      "avantAApres": "A",
      "divisionRattachee": "ARTICLE 4",
      "urlDivisionTexteVise": "/15/textes/0539.asp#D_Article_4"
    },
    "alinea": {
      "avantAApres": "Apres",
      "numero": "4"
    }
  },
  "corps": {
    "dispositif": "<p style=\"text-align: justify;\">Apr&#232;s l&#8217;alin&#233;a&#160;4, ins&#233;rer l&#8217;alin&#233;a suivant&#160;:</p><p style=\"text-align: justify;\">&#171;&#160;3&#176;&#160;<i>bis</i>&#160;&#192; la derni&#232;re phrase du deuxi&#232;me alin&#233;a de l&#8217;article&#160;3, le mot&#160;: &#171;&#160;plus&#160;&#187; est remplac&#233; par le mot&#160;: &#171;&#160;moins&#160;&#187;&#160;;&#160;&#187;</p>",
    "exposeSommaire": "<p>L'article 3 de la loi du 7 juillet 1977 dispose qu' \"en cas d'&#233;galit&#233; de suffrages, le si&#232;ge est attribu&#233; &#224; la liste dont la moyenne d'&#226;ge est la plus &#233;lev&#233;e.\"</p><p>Cet amendement vise &#224; inverser la logique et &#224; attribuer le si&#232;ge &#224; la liste dont la moyenne d'&#226;ge est le moins &#233;lev&#233;e.</p><p>Certes le b&#233;n&#233;fice donn&#233; &#224; la liste dont la moyenne d'&#226;ge est la plus &#233;lev&#233;e se retrouve dans de nombreux textes, mais cet amendement a vocation &#224; &#234;tre pr&#233;curseur.</p>"
  },
  "representations": [
    {
      "nom": "PDF",
      "typeMime": {
        "type": "application",
        "subType": "PDF"
      },
      "statutRepresentation": {
        "verbatim": true,
        "canonique": true,
        "officielle": true,
        "transcription": false,
        "enregistrement": false
      },
      "contenu": {
        "documentURI": "/15/amendements/0539/CION_LOIS/CL33.pdf"
      }
    }
  ],
  "sort": {
    "dateSaisie": "2018-01-31T11:42:28.000+01:00",
    "sortEnSeance": "Adopté"
  },
  "dateDepot": "2018-01-26T01:00:00.000+01:00",
  "dateDistribution": "2018-01-30T01:00:00.000+01:00",
  "article99": "0",
  "loiReference": {
    "codeLoi": "3.1 id"
  }
}