{
  "uid": "AMANR5L15SEA717460B1297P0D1N733",
  "identifiant": {
    "legislature": "15",
    "numero": "733",
    "numRect": "0",
    "saisine": {
      "texteLegislatifRef": "PRJLANR5L15B1297",
      "numeroPartiePLF": "0",
      "organeExamen": "PO717460",
      "mentionSecondeDeliberation": "0"
    }
  },
  "numeroLong": "733",
  "etapeTexte": "1ère lecture (1ère assemblée saisie)",
  "triAmendement": "bkaaaaaaaaaaaaaaaaaaaaaaaaaaaaaaaaaaaaaaaaaaaaaaaaai",
  "cardinaliteAmdtMultiples": "1",
  "etat": "Irrecevable",
  "signataires": {
    "auteur": {
      "typeAuteur": "Depute",
      "acteurRef": "PA642868",
      "groupePolitiqueRef": "PO744425"
    },
    "cosignatairesRefs": [
      "PA720696",
      "PA421348",
      "PA331567",
      "PA267766",
      "PA695100",
      "PA722030",
      "PA720230",
      "PA642868",
      "PA332228",
      "PA721194",
      "PA642935",
      "PA267585",
      "PA721110",
      "PA719806",
      "PA266788",
      "PA1960",
      "PA267241",
      "PA267355",
      "PA2952",
      "PA721094",
      "PA721486",
      "PA267330",
      "PA267042",
      "PA267780",
      "PA268019",
      "PA712014",
      "PA610775"
    ],
    "texteAffichable": "M.&#160;Christophe,  Mme&#160;Auconie, M.&#160;Becht, M.&#160;Benoit, M.&#160;Bournazel, M.&#160;Guy&#160;Bricout, Mme&#160;de La Raudi&#232;re, M.&#160;Demilly, Mme&#160;Descamps, Mme&#160;Fr&#233;d&#233;rique&#160;Dumas, M.&#160;Dunoyer, M.&#160;Favennec Becot, Mme&#160;Firmin Le Bodo, M.&#160;Gom&#232;s, M.&#160;Meyer&#160;Habib, M.&#160;Herth, M.&#160;Lagarde, M.&#160;Ledoux, M.&#160;Leroy, Mme&#160;Magnier, M.&#160;Morel-&#192;-L&apos;Huissier, M.&#160;Naegelen, Mme&#160;Sanquer, M.&#160;Vercamer, M.&#160;Villiers, M.&#160;Warsmann et M.&#160;Zumkeller"
  },
  "pointeurFragmentTexte": {
    "division": {
      "titre": "Article 13",
      "articleDesignationCourte": "APRÈS ART. 13",
      "type": "ARTICLE",
      "avantAApres": "Apres",
      "divisionRattachee": "APRÈS L'ARTICLE 13, insérer l'article suivant:",
      "articleAdditionnel": "1",
      "urlDivisionTexteVise": "/15/textes/1297.asp#D_Article_13"
    }
  },
  "corps": {
    "dispositif": "<p style=\"text-align: justify;\">&#192; la premi&#232;re phrase du deuxi&#232;me alin&#233;a de l&#8217;article L 151&#8209;1 du code de la s&#233;curit&#233; sociale, est ins&#233;r&#233;e une phrase ainsi r&#233;dig&#233;e&#160;: &#171;&#160;D&#232;s lors qu&#8217;un assur&#233; ou un cotisant est concern&#233; par lesdites d&#233;cisions, il est d&#251;ment et pr&#233;cis&#233;ment inform&#233; des raisons ayant motiv&#233; ce refus.&#160;&#187;</p>",
    "exposeSommaire": "<p style=\"text-align: justify;\">Le but est ici celui de la transparence. Le cotisant a le droit de savoir le motif du refus de l&#8217;autorit&#233; comp&#233;tente de l&#8217;&#201;tat suite &#224; une d&#233;cision prise par une caisse</p>"
  },
  "representations": [
    {
      "nom": "PDF",
      "typeMime": {
        "type": "application",
        "subType": "PDF"
      },
      "statutRepresentation": {
        "verbatim": true,
        "canonique": true,
        "officielle": true,
        "transcription": false,
        "enregistrement": false
      },
      "contenu": {
        "documentURI": "/15/amendements/1297/AN/733.pdf"
      }
    }
  ],
  "dateDepot": "2018-10-18T02:00:00.000+02:00",
  "article99": "0",
  "loiReference": {
    "codeLoi": "c sécurité sociale",
    "divisionCodeLoi": "L151-1"
  }
}