{
  "uid": "AMANR5L15SEA717460BTC0369P0D1N30",
  "identifiant": {
    "legislature": "15",
    "numero": "30",
    "numRect": "0",
    "saisine": {
      "texteLegislatifRef": "PRJLANR5L15BTC0369",
      "numeroPartiePLF": "0",
      "organeExamen": "PO717460",
      "mentionSecondeDeliberation": "0"
    }
  },
  "numeroLong": "30",
  "etapeTexte": "1ère lecture (1ère assemblée saisie)",
  "triAmendement": "aci",
  "cardinaliteAmdtMultiples": "1",
  "etat": "Discuté",
  "signataires": {
    "auteur": {
      "typeAuteur": "Depute",
      "acteurRef": "PA718926",
      "groupePolitiqueRef": "PO730940"
    },
    "cosignatairesRefs": [
      "PA721896",
      "PA610634",
      "PA335612",
      "PA721270",
      "PA721118",
      "PA720546",
      "PA718926",
      "PA610654",
      "PA718720",
      "PA610667",
      "PA441",
      "PA722110",
      "PA722202",
      "PA720692",
      "PA689",
      "PA267306"
    ],
    "texteAffichable": "M.&#160;Dharr&#233;ville,  M.&#160;Azerot, Mme&#160;Bello, M.&#160;Brotherson, M.&#160;Bruneel, Mme&#160;Buffet, M.&#160;Chassaigne, M.&#160;Dufr&#232;gne, Mme&#160;Faucillon, M.&#160;Jumel, M.&#160;Lecoq, M.&#160;Nilor, M.&#160;Peu, M.&#160;Fabien&#160;Roussel, M.&#160;Serville et M.&#160;Wulfranc"
  },
  "pointeurFragmentTexte": {
    "division": {
      "titre": "Article 2",
      "articleDesignationCourte": "ART. 2",
      "type": "ARTICLE",
      "avantAApres": "A",
      "divisionRattachee": "ARTICLE 2",
      "urlDivisionTexteVise": "/15/textes/0369.asp#D_Article_2"
    },
    "alinea": {
      "avantAApres": "Apres",
      "numero": "6"
    }
  },
  "corps": {
    "dispositif": "<p style=\"text-align: justify;\">Apr&#232;s l&#8217;alin&#233;a&#160;6, ins&#233;rer les cinq alin&#233;as suivants&#160;:</p><p style=\"text-align: justify;\">&#171;&#160;2&#176;&#160;<i>bis</i> L&#8217;article L.&#160;2242&#8209;8 est ainsi modifi&#233;&#160;:</p><p style=\"text-align: justify;\">&#171;&#160;<i>a)</i> La premi&#232;re phrase du premier alin&#233;a est compl&#233;t&#233;e par les mots&#160;:</p><p style=\"text-align: justify;\">&#171;&#160;, ou lorsqu&#8217;elles ne produisent pas les informations et indicateurs sur la situation compar&#233;e des femmes et des hommes au sein de l&#8217;entreprise mentionn&#233;s au&#160;1&#176;&#160;bis de l&#8217;article L.&#160;2323&#8209;8.&#160;&#187;&#160;;</p><p style=\"text-align: justify;\">&#171;&#160;<i>b)</i> La premi&#232;re phrase du deuxi&#232;me alin&#233;a est compl&#233;t&#233;e par les mots&#160;:</p><p style=\"text-align: justify;\">&#171;&#160;, ou au cours des p&#233;riodes au titre desquelles l&#8217;entreprise n&#8217;a pas produit les informations et indicateurs sur la situation compar&#233;e des femmes et des hommes mentionn&#233;s au premier alin&#233;a du pr&#233;sent article.&#160;&#187;</p>",
    "exposeSommaire": "<p style=\"text-align: justify;\">Alors qu&#8217;il s&#8217;agit d&#8217;un enjeu essentiel, l&#8217;&#233;galit&#233; professionnelle appara&#238;t comme un angle mort des ordonnances portant r&#233;forme du code du travail.</p><p style=\"text-align: justify;\">Pour y rem&#233;dier, le pr&#233;sent amendement propose de sanctionner sur la base de la p&#233;nalit&#233; existante (1&#160;% de la masse salariale) les entreprises de plus de cinquante salari&#233;s qui ont l&#8217;obligation de n&#233;gocier un accord ou de produire un plan d&#8217;action, mais qui ne produisent pas les informations sur la situation compar&#233;e des femmes et des hommes au sein de l&#8217;entreprise.</p><p style=\"text-align: justify;\">Ces informations, qui ont remplac&#233; le rapport de situation compar&#233;, sont pourtant essentielles pour permettre d&#8217;identifier et de r&#233;sorber les &#233;carts salariaux entre les femmes et les hommes au sein des entreprises.</p>"
  },
  "representations": [
    {
      "nom": "PDF",
      "typeMime": {
        "type": "application",
        "subType": "PDF"
      },
      "statutRepresentation": {
        "verbatim": true,
        "canonique": true,
        "officielle": true,
        "transcription": false,
        "enregistrement": false
      },
      "contenu": {
        "documentURI": "/15/amendements/0369/AN/30.pdf"
      }
    }
  ],
  "seanceDiscussion": "RUANR5L15S2018IDS20775",
  "sort": {
    "dateSaisie": "2017-11-22T00:43:57.000+01:00",
    "sortEnSeance": "Rejeté"
  },
  "dateDepot": "2017-11-16T01:00:00.000+01:00",
  "dateDistribution": "2017-11-20T01:00:00.000+01:00",
  "article99": "0",
  "loiReference": {}
}