{
  "uid": "AMANR5L15SEA717460BTC1396P0D1N430",
  "identifiant": {
    "legislature": "15",
    "numero": "430",
    "numRect": "0",
    "saisine": {
      "texteLegislatifRef": "PRJLANR5L15BTC1396",
      "numeroPartiePLF": "0",
      "organeExamen": "PO717460",
      "mentionSecondeDeliberation": "0"
    }
  },
  "numeroLong": "430",
  "etapeTexte": "1ère lecture (2ème assemblée saisie)",
  "triAmendement": "accaaaaaaaaaaaaaaaaaaaaaaaaaaaaaaaaaaaaaaaaaaaaaaajks",
  "cardinaliteAmdtMultiples": "1",
  "etat": "Discuté",
  "signataires": {
    "auteur": {
      "typeAuteur": "Depute",
      "acteurRef": "PA721296",
      "groupePolitiqueRef": "PO730964"
    },
    "cosignatairesRefs": [
      "PA722126",
      "PA719806",
      "PA721750",
      "PA720342",
      "PA721742",
      "PA720202",
      "PA721656",
      "PA722252",
      "PA719520",
      "PA719496",
      "PA720552",
      "PA722022",
      "PA721296",
      "PA719632",
      "PA719558",
      "PA719318",
      "PA722054",
      "PA719624"
    ],
    "texteAffichable": "M.&#160;Gouffier-Cha,  Mme&#160;Rixain, Mme&#160;Romeiro Dias, Mme&#160;Le Peih, M.&#160;Cabar&#233;, M.&#160;Balanant, Mme&#160;Couillard, Mme&#160;Anthoine, Mme&#160;Hai, Mme&#160;Muschotti, M.&#160;Nogal, M.&#160;Chiche, Mme&#160;Panonacle, Mme&#160;Auconie, Mme&#160;Rauch, Mme&#160;Calvez, Mme&#160;Krimi et Mme&#160;Florennes"
  },
  "pointeurFragmentTexte": {
    "division": {
      "titre": "Article 2",
      "articleDesignationCourte": "ART. 2",
      "type": "ARTICLE",
      "avantAApres": "A",
      "divisionRattachee": "ARTICLE 2",
      "urlDivisionTexteVise": "/15/textes/1396.asp#D_Article_2"
    },
    "alinea": {
      "avantAApres": "A",
      "numero": "3",
      "alineaDesignation": "Alinéa 3"
    }
  },
  "corps": {
    "dispositif": "<p>&#192; l&#8217;alin&#233;a&#160;3, apr&#232;s les mots&#160;:</p><p>&#171;&#160;est possible&#160;&#187;,</p><p>ins&#233;rer les mots&#160;:</p><p>&#171;&#160;et sauf si des violences au sein du couple ou tout autre type de violences ont &#233;t&#233; commises&#160;&#187;.</p>",
    "exposeSommaire": "<p style=\"text-align: justify;\">La m&#233;diation est proscrite en cas de violences au sein du couple par l&#8217;article&#160;373&#8209;2&#8209;10 du code civil pour les affaires familiales concernant l&#8217;exercice de l&#8217;autorit&#233; parentale. En mati&#232;re p&#233;nale, l&#8217;article&#160;41&#8209;1 du code de proc&#233;dure p&#233;nale interdit &#233;galement la m&#233;diation entre l&#8217;auteur des faits et la victime lorsque des violences ont &#233;t&#233; commises par le conjoint ou l&#8217;ancien conjoint de la victime, son partenaire li&#233; par un pacte civil de solidarit&#233; ou son ancien partenaire, son concubin ou son ancien concubin, sauf dans le cas o&#249; la victime en fait express&#233;ment la demande.</p><p style=\"text-align: justify;\">En effet, la m&#233;diation entre deux conjoints ou ex-conjoints n&#8217;est pertinente que si ceux-ci sont v&#233;ritablement &#233;gaux dans leurs relations et leurs &#233;changes. Tous les cas de violences au sein du couple conduisant automatiquement &#224; une situation profond&#233;ment in&#233;galitaire entre les deux &#233;poux, ils doivent &#234;tre rigoureusement exclus des proc&#233;dures de m&#233;diation. En coh&#233;rence avec les articles 373&#8209;2&#8209;10 du code civil et 41&#8209;1 du code de proc&#233;dure p&#233;nale, cet amendement, issu de la recommandation n&#176;&#160;20 du rapport de la D&#233;l&#233;gation aux droits des femmes et &#224; l&#8217;&#233;galit&#233; des chances entre les hommes et les femmes, vise &#224; interdire explicitement le recours &#224; la m&#233;diation judiciaire dans tous les cas de violences et notamment de violences au sein du couple.</p>"
  },
  "representations": [
    {
      "nom": "PDF",
      "typeMime": {
        "type": "application",
        "subType": "PDF"
      },
      "statutRepresentation": {
        "verbatim": true,
        "canonique": true,
        "officielle": true,
        "transcription": false,
        "enregistrement": false
      },
      "contenu": {
        "documentURI": "/15/amendements/1396/AN/430.pdf"
      }
    }
  ],
  "seanceDiscussion": "RUANR5L15S2019IDS21371",
  "sort": {
    "dateSaisie": "2018-11-21T16:52:01.000+01:00",
    "sortEnSeance": "Retiré"
  },
  "dateDepot": "2018-11-14T01:00:00.000+01:00",
  "dateDistribution": "2018-11-19T01:00:00.000+01:00",
  "article99": "0",
  "loiReference": {}
}