{
  "uid": "AMANR5L15SEA717460B2272P2D1N1282",
  "identifiant": {
    "legislature": "15",
    "numero": "1282",
    "numRect": "0",
    "saisine": {
      "texteLegislatifRef": "PRJLANR5L15B2272",
      "numeroPartiePLF": "2",
      "organeExamen": "PO717460",
      "mentionSecondeDeliberation": "1"
    }
  },
  "numeroLong": "II-1282",
  "etapeTexte": "1ère lecture (1ère assemblée saisie)",
  "triAmendement": "deaaaaaaaaaaaaaaaaaaaaaaaaaaaaaaaaaaaaaaaaaaaaaaaabhns",
  "cardinaliteAmdtMultiples": "1",
  "etat": "Discuté",
  "signataires": {
    "auteur": {
      "typeAuteur": "Depute",
      "acteurRef": "PA609520",
      "groupePolitiqueRef": "PO730964"
    },
    "cosignatairesRefs": [
      "PA719456",
      "PA267336",
      "PA720538",
      "PA720242",
      "PA719412",
      "PA720500",
      "PA718802",
      "PA719080",
      "PA718894",
      "PA607595",
      "PA718962",
      "PA721726",
      "PA720054",
      "PA606639",
      "PA719540",
      "PA720414",
      "PA720310",
      "PA718710",
      "PA719092",
      "PA719364",
      "PA720202",
      "PA722194",
      "PA720806",
      "PA719718",
      "PA609520",
      "PA721426",
      "PA720154",
      "PA719194",
      "PA721776",
      "PA719972",
      "PA720170",
      "PA720342",
      "PA719480",
      "PA722366",
      "PA718768"
    ],
    "texteAffichable": "Mme&#160;Pompili,  Mme&#160;Abba, Mme&#160;Tuffnell, M.&#160;Giraud, M.&#160;Gaillard, Mme&#160;M&#246;rch, M.&#160;Arend, M.&#160;Baich&#232;re, Mme&#160;Pascale&#160;Boyer, Mme&#160;Yolaine&#160;de Courson, Mme&#160;De Temmerman, M.&#160;Dombreval, Mme&#160;Dubr&#233;-Chirat, M.&#160;Fugit, Mme&#160;Gayte, Mme&#160;Grandjean, M.&#160;Haury, Mme&#160;Krimi, Mme&#160;Le Feur, Mme&#160;Le Peih, Mme&#160;Maillart-M&#233;haignerie, Mme&#160;Marsaud, Mme&#160;Mauborgne, Mme&#160;O&apos;Petit, M.&#160;Pellois, M.&#160;Perea, M.&#160;Perrot, Mme&#160;Val&#233;rie&#160;Petit, Mme&#160;Provendier, Mme&#160;Riotton, Mme&#160;Sarles, Mme&#160;Toutut-Picard, Mme&#160;Valetta Ardisson, M.&#160;Vignal et M.&#160;Zulesi"
  },
  "pointeurFragmentTexte": {
    "division": {
      "titre": "Article 43",
      "articleDesignationCourte": "ART. 43",
      "type": "ARTICLE",
      "avantAApres": "A",
      "divisionRattachee": "ARTICLE 43",
      "urlDivisionTexteVise": "/15/textes/2272C.asp#D_Article_43"
    },
    "alinea": {
      "numero": "2"
    }
  },
  "corps": {
    "dispositif": "<p style=\"text-align: justify;\">I.&#160;&#8211;&#160;&#192; la vingt-septi&#232;me ligne de la seconde colonne du tableau de l&#8217;alin&#233;a&#160;2, substituer au nombre&#160;:</p><p style=\"text-align: justify;\">&#171;&#160;4&#160;888&#160;&#187;</p><p style=\"text-align: justify;\">le nombre&#160;:</p><p style=\"text-align: justify;\">&#171;&#160;4&#160;880&#160;&#187;.</p><p style=\"text-align: justify;\">II.&#160;&#8211;&#160;En cons&#233;quence, &#224; la vingt-neuvi&#232;me ligne de la m&#234;me colonne du m&#234;me tableau, substituer au nombre&#160;:</p><p style=\"text-align: justify;\">&#171;&#160;5&#160;137&#160;&#187;</p><p style=\"text-align: justify;\">le nombre&#160;:</p><p style=\"text-align: justify;\">&#171;&#160;5&#160;145&#160;&#187;.</p>",
    "exposeSommaire": "<p style=\"text-align: justify;\">Cet amendement vise &#224; transf&#233;rer 8 &#233;quivalents temps plein travaill&#233;s (ETPT) de la Soci&#233;t&#233; du Grand Paris (programme &#171;&#160;Infrastructures et services de transport&#160;&#187;) en faveur des Parcs Nationaux (programme &#171;&#160;Paysages, eau et biodiversit&#233;&#160;&#187;).</p><p style=\"text-align: justify;\">Les parcs nationaux souffrent d&#8217;un manque chronique d&#8217;effectifs qui se fait ressentir au quotidien sur le terrain. Le cas des parcs marins est symptomatique de cette situation.</p><p style=\"text-align: justify;\">Les personnels des parcs nationaux effectuent de nombreuses missions&#160;relatives &#224; la conservation, &#224; la gestion et la restauration du patrimoine naturel, incluant notamment l&#8217;accueil et la sensibilisation du public, le d&#233;veloppement des connaissances et le suivi scientifique des zones prot&#233;g&#233;es, la lutte contre les esp&#232;ces exotiques envahissantes, ainsi que la contribution aux politiques de d&#233;veloppement durable&#8230; Ces missions sont indispensables pour la pr&#233;servation de la biodiversit&#233; et permettent en m&#234;me temps un d&#233;veloppement &#233;conomique des zones concern&#233;es en harmonie avec leur environnement.</p><p style=\"text-align: justify;\">Les parcs nationaux contribuent en effet au d&#233;veloppement local, en donnant aux territoires une forte visibilit&#233; et en participant de mani&#232;re d&#233;cisive &#224; leur attractivit&#233;. Les pr&#233;sidents des parcs nationaux soulignent, dans leur appel du 30 juin 2017, qu&#8217;un&#160;euro investi par leurs &#233;tablissements g&#233;n&#232;re localement jusqu&#8217;&#224; 14&#160;euros de b&#233;n&#233;fices. Les parcs nationaux sont de v&#233;ritables cr&#233;ateurs de richesse dans les territoires.</p><p style=\"text-align: justify;\">Les parcs nationaux ont d&#233;j&#224; grandement contribu&#233; &#224; l&#8217;effort g&#233;n&#233;ral de r&#233;duction des effectifs. Aller plus loin les mettrait en grande difficult&#233; tant dans les missions qu&#8217;ils assurent qu&#8217;au niveau de leurs effectifs d&#233;j&#224; sous tension.</p><p style=\"text-align: justify;\">Or, le projet de loi de finances pour 2020 propose une double perte en ETPT&#160;: aux 3 ETPT inscrits au PLF 2020 en perte pour les Parcs nationaux s&#8217;ajoutent les 5 ETPT qu&#8217;il leur est demand&#233; de fournir au futur parc national des for&#234;ts de Champagne et Bourgogne.</p><p style=\"text-align: justify;\">La cr&#233;ation de ce 11<sup>&#232;me</sup> parc national, tant attendue, est une tr&#232;s bonne chose. Mais elle ne saurait se faire au prix d&#8217;une nouvelle d&#233;gradation des effectifs des parcs nationaux existants. Ce nouveau parc n&#233;cessite sur le terrain des moyens humains d&#233;di&#233;s.</p><p style=\"text-align: justify;\">Alors que l&#8217;urgence climatique et du vivant nous incombe &#224; agir, cr&#233;er un nouveau parc ne peut se faire au d&#233;triment de ceux qui existent.</p><p style=\"text-align: justify;\">D&#8217;o&#249; cet amendement qui propose de ne pas d&#233;grader davantage la situation d&#233;licate dans laquelle se trouvent les parcs nationaux&#160;: d&#8217;une part en ne supprimant pas les 3 ETPT inscrits dans le PLF 2020 et, d&#8217;autre part, en pr&#233;voyant 5 ETPT suppl&#233;mentaires pour les besoins du nouveau parc national des for&#234;ts de Champagne et Bourgogne</p><p style=\"text-align: justify;\">Pour sa part, la Soci&#233;t&#233; du Grand Paris (SGP) a vu ses effectifs consid&#233;rablement augmenter &#224; l&#8217;occasion des derniers exercices budg&#233;taires. Lors du PLF pour 2019 une augmentation de 200 ETPT a &#233;t&#233; vot&#233;e en faveur de la SGP, ce qui revenait &#224; quasiment doubler son plafond de 2018, pour atteindre un niveau de 430 ETPT. Aujourd&#8217;hui, le PLF 2020 propose une nouvelle augmentation de 200 ETP pour la SGP, soit 155 ETPT pour atteindre un total de 585 ETPT.</p><p style=\"text-align: justify;\">Dans ces conditions, s&#8217;il est vrai que la Soci&#233;t&#233; du Grand Paris n&#233;cessite des effectifs suppl&#233;mentaires, 8 ETPT repr&#233;sentent moins de 1,37&#160;% des effectifs de la SGP. Cet effort conc&#233;d&#233; ne devrait pas remettre en cause l&#8217;atteinte de ses objectifs tandis qu&#8217;il constitue une absolue n&#233;cessit&#233; pour les parcs nationaux.</p>"
  },
  "representations": [
    {
      "nom": "PDF",
      "typeMime": {
        "type": "application",
        "subType": "PDF"
      },
      "statutRepresentation": {
        "verbatim": true,
        "canonique": true,
        "officielle": true,
        "transcription": false,
        "enregistrement": false
      },
      "contenu": {
        "documentURI": "/15/amendements/2272C/AN/1282.pdf"
      }
    }
  ],
  "seanceDiscussion": "RUANR5L15S2020IDS21925",
  "sort": {
    "dateSaisie": "2019-11-15T19:53:12.000+01:00",
    "sortEnSeance": "Rejeté"
  },
  "dateDepot": "2019-10-30T01:00:00.000+01:00",
  "dateDistribution": "2019-11-14T01:00:00.000+01:00",
  "article99": "0",
  "loiReference": {}
}