{
  "uid": "AMANR5L15SEA717460BTC1924P0D1N813",
  "identifiant": {
    "legislature": "15",
    "numero": "813",
    "numRect": "0",
    "saisine": {
      "texteLegislatifRef": "PRJLANR5L15BTC1924",
      "numeroPartiePLF": "0",
      "organeExamen": "PO717460",
      "mentionSecondeDeliberation": "0"
    }
  },
  "numeroLong": "813",
  "etapeTexte": "1ère lecture (1ère assemblée saisie)",
  "triAmendement": "dfaaaaaaaaaaaaaaaaaaaaaaaaaaaaaaaaaaaaaaaaaaaaaaaaax",
  "cardinaliteAmdtMultiples": "1",
  "etat": "Discuté",
  "signataires": {
    "auteur": {
      "typeAuteur": "Depute",
      "acteurRef": "PA337483",
      "groupePolitiqueRef": "PO758835"
    },
    "cosignatairesRefs": [
      "PA610681",
      "PA340343",
      "PA429893",
      "PA608695",
      "PA608011",
      "PA608172",
      "PA1592",
      "PA1008",
      "PA609332",
      "PA608741",
      "PA609590",
      "PA508",
      "PA335054",
      "PA1198",
      "PA720988",
      "PA267233",
      "PA719930",
      "PA335532",
      "PA607553",
      "PA333818",
      "PA332614",
      "PA605069",
      "PA333285",
      "PA1809",
      "PA642764",
      "PA342415",
      "PA340357",
      "PA643145",
      "PA337483"
    ],
    "texteAffichable": "M.&#160;Letchimy,  Mme&#160;Bareigts, Mme&#160;Manin, Mme&#160;Vainqueur-Christophe, Mme&#160;Karamanli, M.&#160;Vallaud, Mme&#160;Untermaier, Mme&#160;Pau-Langevin, M.&#160;Saulignac, Mme&#160;Pires Beaune, Mme&#160;Rabault, M.&#160;Aviragnet, Mme&#160;Battistel, Mme&#160;Bi&#233;mouret, M.&#160;Bouillon, M.&#160;Jean-Louis&#160;Bricout, M.&#160;Carvounas, M.&#160;Alain&#160;David, Mme&#160;Laurence&#160;Dumont, M.&#160;Faure, M.&#160;Garot, M.&#160;David&#160;Habib, M.&#160;Hutin, M.&#160;Juanico, M.&#160;J&#233;r&#244;me&#160;Lambert, M.&#160;Potier, M.&#160;Pueyo, Mme&#160;Tolmont et Mme&#160;Victory"
  },
  "pointeurFragmentTexte": {
    "division": {
      "titre": "Article 14",
      "articleDesignationCourte": "ART. 14",
      "type": "ARTICLE",
      "avantAApres": "A",
      "divisionRattachee": "ARTICLE 14",
      "urlDivisionTexteVise": "/15/textes/1924.asp#D_Article_14"
    },
    "alinea": {
      "avantAApres": "Apres",
      "numero": "5"
    }
  },
  "corps": {
    "dispositif": "<p style=\"text-align: justify;\">I.&#160;&#8211;&#160;Apr&#232;s l&#8217;alin&#233;a&#160;5, ins&#233;rer l&#8217;alin&#233;a suivant&#160;: </p><p style=\"text-align: justify;\">&#171;&#160;Dans les collectivit&#233;s relevant de l&#8217;article&#160;72&#8209;3 de la Constitution, ces lignes directrices de gestion sont d&#233;clin&#233;es au sein de chaque territoire. Elles font l&#8217;objet d&#8217;une coordination de niveau pr&#233;fectoral ou &#233;quivalent, transversale aux trois fonctions publiques. Cette coordination inclut un dispositif de priorisation des fonctionnaires en poste dans ces territoires et y poss&#233;dant leur centre d&#8217;int&#233;r&#234;ts mat&#233;riels et moraux, dans la gestion transversale de la mobilit&#233; et du recrutement des agents des services relevant des trois fonctions publiques.&#160;&#187;</p><p style=\"text-align: justify;\">II.&#160;&#8211;&#160;En cons&#233;quence, proc&#233;der &#224; la m&#234;me insertion apr&#232;s les alin&#233;as 22 et 36.</p>",
    "exposeSommaire": "<p style=\"text-align: justify;\">Cet amendement du groupe Socialistes et apparent&#233;s vise &#224; ce que les lignes directrices de gestion soient d&#233;clin&#233;es au sein de chaque collectivit&#233; relevant de l&#8217;article&#160;72&#8209;3 de la Constitution, afin qu&#8217;elles fassent l&#8217;objet d&#8217;une coordination de niveau pr&#233;fectoral ou &#233;quivalent, transversale aux trois fonctions publiques, qui inclut un dispositif de priorisation des fonctionnaires en poste dans ces territoires et y poss&#233;dant leur centre d&#8217;int&#233;r&#234;ts mat&#233;riels et moraux, dans la gestion transversale de la mobilit&#233; et du recrutement des agents des services relevant des trois fonctions publiques.</p><p style=\"text-align: justify;\">Les r&#233;gions et collectivit&#233;s d&#8217;outre-mer subissent des mutations d&#233;mographiques tr&#232;s sp&#233;cifiques, &#224; la fois dans leur rapport &#224; la situation de l&#8217;Hexagone et dans leur rapport les unes avec les autres. Certaines, comme la Martinique et la Guadeloupe, font face &#224; un ph&#233;nom&#232;ne de vieillissement d&#233;mographique, quand d&#8217;autres comme la Guyane, Mayotte ou la R&#233;union sont mises au d&#233;fi de l&#8217;insertion professionnelle d&#8217;une population &#224; l&#8217;inverse tr&#232;s jeune. Dans tous les cas, les difficult&#233;s &#233;conomiques de ces collectivit&#233;s les confrontent depuis plusieurs d&#233;cennies &#224; un processus dramatique de fuite de la jeunesse et, avec elle, des cerveaux et des &#233;nergies sur lesquels pourrait reposer un futur d&#233;veloppement &#233;conomique prenant en compte les d&#233;fis sociaux et environnementaux qui sont les n&#244;tres.</p><p style=\"text-align: justify;\">L&#8217;objet de cet amendement est de veiller, dans ce contexte,&#160; &#224; ce que les lignes directrices de gestion en mati&#232;re de mobilit&#233;, et de promotion et de valorisation des parcours int&#232;grent les probl&#233;matiques propres &#224; chacune des collectivit&#233;s d&#8217;outre-mer.</p><p style=\"text-align: justify;\">Cet amendement propose &#233;galement la mise en place d&#8217;un dispositif, g&#233;r&#233; par le pr&#233;fet ou l&#8217;autorit&#233; d&#233;concentr&#233;e &#233;quivalente, permettant de coordonner au niveau du territoire la mobilit&#233; et les politiques de valorisation des parcours et des comp&#233;tences, entre les diff&#233;rents services et les diff&#233;rentes fonctions publiques. Ce dispositif de coordination permettrait de favoriser les carri&#232;res professionnelles locales, notamment pour les cadres de la fonction publique de l&#8217;&#201;tat, et d&#8217;&#233;viter des aller-retours fr&#233;quents entre l&#8217;outre-mer et la m&#233;tropole. Cet objectif de priorisation du recrutement local de cadres ultramarins n&#233;cessiterait le renforcement de l&#8217;interminist&#233;rialisation de la gestion des effectifs outre-mer et la cr&#233;ation d&#8217;une sorte de CAP territoriale outre-mer, ainsi que l&#8217;avait recommand&#233; le d&#233;put&#233; Patrick Lebreton dans un rapport sur la r&#233;gionalisation de l&#8217;emploi remis au Premier ministre le 4 d&#233;cembre 2013 et dont s&#8217;inspire le pr&#233;sent amendement.</p>"
  },
  "representations": [
    {
      "nom": "PDF",
      "typeMime": {
        "type": "application",
        "subType": "PDF"
      },
      "statutRepresentation": {
        "verbatim": true,
        "canonique": true,
        "officielle": true,
        "transcription": false,
        "enregistrement": false
      },
      "contenu": {
        "documentURI": "/15/amendements/1924/AN/813.pdf"
      }
    }
  ],
  "sort": {
    "dateSaisie": "2019-05-17T11:19:41.000+02:00",
    "sortEnSeance": "Rejeté"
  },
  "dateDepot": "2019-05-09T02:00:00.000+02:00",
  "dateDistribution": "2019-05-13T02:00:00.000+02:00",
  "article99": "0",
  "loiReference": {}
}