{
  "uid": "AMANR5L15PO420120B0904P0D1N976",
  "identifiant": {
    "legislature": "15",
    "numero": "976",
    "numRect": "0",
    "saisine": {
      "texteLegislatifRef": "PRJLANR5L15B0904",
      "numeroPartiePLF": "0",
      "organeExamen": "PO420120",
      "mentionSecondeDeliberation": "0"
    }
  },
  "numeroLong": "AS976",
  "etapeTexte": "1ère lecture (1ère assemblée saisie)",
  "triAmendement": "ohb",
  "cardinaliteAmdtMultiples": "1",
  "etat": "Discuté",
  "signataires": {
    "auteur": {
      "typeAuteur": "Depute",
      "acteurRef": "PA721924",
      "groupePolitiqueRef": "PO730970"
    },
    "cosignatairesRefs": [
      "PA722374",
      "PA721924",
      "PA721992",
      "PA720924",
      "PA720968",
      "PA720326"
    ],
    "texteAffichable": "Mme&#160;de Vaucouleurs,  Mme&#160;Benin, Mme&#160;Elimas, rapporteure M.&#160;Hammouche, Mme&#160;Gallerneau et M.&#160;Isaac-Sibille"
  },
  "pointeurFragmentTexte": {
    "division": {
      "titre": "Article PREMIER",
      "articleDesignationCourte": "ART. PREMIER",
      "type": "ARTICLE",
      "avantAApres": "A",
      "divisionRattachee": "ARTICLE PREMIER",
      "urlDivisionTexteVise": "/15/textes/0904.asp#D_Article_1er"
    },
    "alinea": {
      "avantAApres": "Apres",
      "numero": "45"
    }
  },
  "corps": {
    "dispositif": "<p style=\"text-align: justify;\">Apr&#232;s l&#8217;alin&#233;a&#160;45 ins&#233;rer l&#8217;alin&#233;a suivant&#160;:</p><p style=\"text-align: justify;\">&#171;&#160;Ils font l&#8217;objet d&#8217;une r&#233;&#233;valuation p&#233;riodique index&#233;e sur l&#8217;inflation dans des conditions fix&#233;es par d&#233;cret en Conseil d&#8217;&#201;tat.&#160;&#187;</p>",
    "exposeSommaire": "<p style=\"text-align: justify;\">Afin de coller au plus pr&#232;s &#224; la r&#233;alit&#233; &#233;conomique et de garantir un droit &#224; la formation effectif, il est n&#233;cessaire de r&#233;&#233;valuer p&#233;riodiquement le montant vers&#233; annuellement sur le Compte Personnel de Formation, notamment en tenant compte de l&#8217;inflation.</p>"
  },
  "representations": [
    {
      "nom": "PDF",
      "typeMime": {
        "type": "application",
        "subType": "PDF"
      },
      "statutRepresentation": {
        "verbatim": true,
        "canonique": true,
        "officielle": true,
        "transcription": false,
        "enregistrement": false
      },
      "contenu": {
        "documentURI": "/15/amendements/0904/CION-SOC/AS976.pdf"
      }
    }
  ],
  "sort": {
    "dateSaisie": "2018-05-29T18:34:47.000+02:00",
    "sortEnSeance": "Retiré"
  },
  "dateDepot": "2018-05-25T02:00:00.000+02:00",
  "dateDistribution": "2018-05-26T02:00:00.000+02:00",
  "article99": "0",
  "loiReference": {}
}