{
  "uid": "AMANR5L15SEA717460B2296P0D1N2053",
  "identifiant": {
    "legislature": "15",
    "numero": "2053",
    "numRect": "0",
    "saisine": {
      "texteLegislatifRef": "PRJLANR5L15B2296",
      "numeroPartiePLF": "0",
      "organeExamen": "PO717460",
      "mentionSecondeDeliberation": "1"
    }
  },
  "numeroLong": "2053",
  "etapeTexte": "1ère lecture (1ère assemblée saisie)",
  "triAmendement": "diaaaaaaaaaaaaaaaaaaaaaaaaaaaaaaaaaaaaaaaaaaaaaaaalnx",
  "cardinaliteAmdtMultiples": "1",
  "etat": "Discuté",
  "signataires": {
    "auteur": {
      "typeAuteur": "Depute",
      "acteurRef": "PA720326",
      "groupePolitiqueRef": "PO730970"
    },
    "cosignatairesRefs": [
      "PA720746",
      "PA720720",
      "PA720178",
      "PA719266",
      "PA720764",
      "PA722374",
      "PA720704",
      "PA721996",
      "PA720976",
      "PA719210",
      "PA719504",
      "PA720924",
      "PA718978",
      "PA721608",
      "PA721530",
      "PA721734",
      "PA721836",
      "PA720326",
      "PA719640",
      "PA721418",
      "PA720002",
      "PA720968",
      "PA721984",
      "PA720598",
      "PA720092",
      "PA717151",
      "PA721182",
      "PA721742",
      "PA720334",
      "PA721924",
      "PA722162",
      "PA719942",
      "PA720256",
      "PA719488",
      "PA719558",
      "PA721234",
      "PA719044",
      "PA720162",
      "PA1276",
      "PA719918",
      "PA719874",
      "PA721976",
      "PA720652",
      "PA720728",
      "PA722284",
      "PA720772"
    ],
    "texteAffichable": "M.&#160;Hammouche,  Mme&#160;Elimas, Mme&#160;Benin, Mme&#160;de Vaucouleurs, M.&#160;Isaac-Sibille, M.&#160;Mignola, M.&#160;Balanant, Mme&#160;Bannier, M.&#160;Barrot, M.&#160;Baudu, M.&#160;Berta, M.&#160;Bolo, M.&#160;Bourlanges, M.&#160;Bru, M.&#160;Cubertafon, Mme&#160;de Sarnez, Mme&#160;Deprez-Audebert, M.&#160;Duverg&#233;, Mme&#160;El Ha&#239;ry, Mme&#160;Essayan, M.&#160;Fanget, Mme&#160;Florennes, M.&#160;Fuchs, M.&#160;Garcia, Mme&#160;Jacquier-Laforge, M.&#160;Joncour, M.&#160;Lagleize, M.&#160;Lain&#233;, M.&#160;Laqhila, Mme&#160;Lasserre-David, M.&#160;Latombe, M.&#160;Loiseau, Mme&#160;Luquet, M.&#160;Mathiasin, M.&#160;Mattei, Mme&#160;Mette, M.&#160;Michel-Kleisbauer, M.&#160;Millienne, M.&#160;Pahun, M.&#160;Fr&#233;d&#233;ric&#160;Petit, Mme&#160;Maud&#160;Petit, Mme&#160;Poueyto, M.&#160;Ramos, M.&#160;Turquois, Mme&#160;Vichnievsky et M.&#160;Waserman"
  },
  "pointeurFragmentTexte": {
    "division": {
      "titre": "Article 25",
      "articleDesignationCourte": "ART. 25",
      "type": "ARTICLE",
      "avantAApres": "A",
      "divisionRattachee": "ARTICLE 25",
      "urlDivisionTexteVise": "/15/textes/2296.asp#D_Article_25"
    },
    "alinea": {
      "numero": "45"
    }
  },
  "corps": {
    "dispositif": "<p style=\"break-after: avoid;\">&#192; la premi&#232;re phrase de l&#8217;alin&#233;a&#160;46, apr&#232;s le mot&#160;:</p><p style=\"text-align: justify;\">&#171;&#160;activit&#233;&#160;&#187;,</p><p style=\"text-align: justify; page-break-after: avoid;\">ins&#233;rer les mots&#160;:</p><p style=\"text-align: justify;\">&#171;&#160;hospitali&#232;re et extra-hospitali&#232;re&#160;&#187;.</p><p style=\"text-align: justify; page-break-after: avoid;\">&#160;</p>",
    "exposeSommaire": "<p>Cet amendement vise &#224; pr&#233;ciser que l&#8217;analyse de l&#8217;offre, hospitali&#232;re et extra-hospitali&#232;re, doit &#234;tre prise en compte pour d&#233;terminer le montant de<span  data-cid=\"4\"   data-time=\"1571402390970\">s dotations</span><span  data-cid=\"3\"   data-time=\"1571402390965\"> la dotation</span> populationnelle<span  data-cid=\"17\"   data-time=\"1571402398096\">s et compl&#233;mentaires</span>.<br /><br />La sant&#233; mentale comme tout le syst&#232;me de soins fran&#231;ais est marqu&#233; un fort &#171;&#160;hospitalo-centrisme&#160;&#187; historique alors que le secteur psychiatrique, socle de l&#8217;organisation des soins psychiques, &#233;tait initialement pens&#233; autour des soins extra-hospitaliers afin, notamment, de sortir de la logique asilaire qui l&#8217;avait pr&#233;c&#233;d&#233;.<br /><br />La mission d&#8217;information sur l&#8217;organisation territoriale de la sant&#233; mentale men&#233;e par B. Hammouche, M. Wonner et C. Fiat a conclu &#224; la n&#233;cessit&#233; de revenir &#224; l&#8217;esprit du secteur extra-hospitalier et de renforcer les structures d&#8217;amont et d&#8217;aval extra-hospitali&#232;res. Il convient de s&#8217;assurer dans la r&#233;daction du pr&#233;sent projet de loi que cette dimension extra-hospitali&#232;re soit bien examin&#233;e avant de d&#233;terminer le montant des dotations populationnelles<span  data-cid=\"40\"   data-time=\"1571402405103\"> et compl&#233;mentaires</span>.</p>",
    "cartoucheDelaiDepotDepasse": "Sous réserve de son traitement par les services de l'Assemblée nationale et de sa recevabilité"
  },
  "representations": [
    {
      "nom": "PDF",
      "typeMime": {
        "type": "application",
        "subType": "PDF"
      },
      "statutRepresentation": {
        "verbatim": true,
        "canonique": true,
        "officielle": true,
        "transcription": false,
        "enregistrement": false
      },
      "contenu": {
        "documentURI": "/15/amendements/2296/AN/2053.pdf"
      }
    }
  ],
  "seanceDiscussion": "RUANR5L15S2020IDS21878",
  "sort": {
    "dateSaisie": "2019-10-24T19:16:27.000+02:00",
    "sortEnSeance": "Adopté"
  },
  "dateDepot": "2019-10-18T02:00:00.000+02:00",
  "dateDistribution": "2019-10-24T02:00:00.000+02:00",
  "article99": "0",
  "loiReference": {}
}