{
  "uid": "AMANR5L15SEA717460B0235P2D1N1419",
  "identifiant": {
    "legislature": "15",
    "numero": "1419",
    "numRect": "0",
    "saisine": {
      "texteLegislatifRef": "PRJLANR5L15B0235",
      "numeroPartiePLF": "2",
      "organeExamen": "PO717460",
      "mentionSecondeDeliberation": "0"
    }
  },
  "numeroLong": "II-1419",
  "etapeTexte": "1ère lecture (1ère assemblée saisie)",
  "triAmendement": "ch",
  "cardinaliteAmdtMultiples": "1",
  "etat": "Discuté",
  "signataires": {
    "auteur": {
      "typeAuteur": "Rapporteur",
      "acteurRef": "PA719472",
      "organeRef": "PO59048",
      "groupePolitiqueRef": "PO730964"
    },
    "cosignatairesRefs": [
      "PA719060",
      "PA719472"
    ],
    "texteAffichable": "M.&#160;Cazeneuve, rapporteur sp&#233;cial au nom de la commission des finances et M.&#160;Jerretie"
  },
  "pointeurFragmentTexte": {
    "missionVisee": {
      "idMissionAN": "26",
      "libelleMission": "Relations avec les collectivités territoriales",
      "codeMissionPLF": "B",
      "libelleMissionPLF": "Répartition, par mission et programme, des crédits du budget général"
    },
    "division": {
      "titre": "Article 60",
      "articleDesignationCourte": "ART. 60",
      "type": "ARTICLE",
      "avantAApres": "A",
      "divisionRattachee": "ARTICLE 60",
      "urlDivisionTexteVise": "/15/textes/0235C.asp#D_Article_60"
    },
    "alinea": {
      "avantAApres": "Apres",
      "numero": "3"
    }
  },
  "corps": {
    "dispositif": "<p style=\"text-align: justify;\">Apr&#232;s l&#8217;alin&#233;a&#160;3, ins&#233;rer l&#8217;alin&#233;a suivant&#160;:</p><p style=\"text-align: justify;\">&#171;&#160;1&#176; <i>bis</i> Le second alin&#233;a de l&#8217;article L.&#160;2113&#8209;9&#8209;1 est compl&#233;t&#233; par les mots&#160;: &#171;&#160;sauf si cette extension concerne une ou des communes de moins de 2&#160;000 habitants&#160;&#187;.&#160;&#187;</p>",
    "exposeSommaire": "<p style=\"text-align: justify;\">Les bonifications de dotation globale de fonctionnement (DGF) pour les communes nouvelles restent actuellement applicables &#224; une commune nouvelle &#233;tendue &#224; une ou plusieurs communes, sans que cette extension en prolonge la dur&#233;e d'application.</p><p style=\"text-align: justify;\">Afin de renforcer le soutien au d&#233;veloppement des communes nouvelles, cet amendement permet aux communes nouvelles, en cas d&#8217;extension de leur p&#233;rim&#232;tre, de voir la dur&#233;e d&#8217;application des bonifications prolong&#233;e. L&#8217;extension du p&#233;rim&#232;tre d&#8217;une commune nouvelle serait ainsi consid&#233;r&#233;e comme une nouvelle cr&#233;ation. Afin d'&#233;viter les effets d'aubaine la population totale de la ou les communes qui rejoignent la commune nouvelle initiale est limit&#233;e &#224; 2 000 habitants.</p>"
  },
  "representations": [
    {
      "nom": "PDF",
      "typeMime": {
        "type": "application",
        "subType": "PDF"
      },
      "statutRepresentation": {
        "verbatim": true,
        "canonique": true,
        "officielle": true,
        "transcription": false,
        "enregistrement": false
      },
      "contenu": {
        "documentURI": "/15/amendements/0235C/AN/1419.pdf"
      }
    }
  ],
  "seanceDiscussion": "RUANR5L15S2018IDS20760",
  "sort": {
    "dateSaisie": "2017-11-15T18:22:49.000+01:00",
    "sortEnSeance": "Adopté"
  },
  "dateDepot": "2017-11-10T01:00:00.000+01:00",
  "dateDistribution": "2017-11-13T01:00:00.000+01:00",
  "article99": "0",
  "loiReference": {}
}