{
  "uid": "AMANR5L15SEA717460B0911P0D1N2505",
  "identifiant": {
    "legislature": "15",
    "numero": "2505",
    "numRect": "0",
    "saisine": {
      "texteLegislatifRef": "PRJLANR5L15B0911",
      "numeroPartiePLF": "0",
      "organeExamen": "PO717460",
      "mentionSecondeDeliberation": "0"
    }
  },
  "numeroLong": "2505",
  "etapeTexte": "1ère lecture (1ère assemblée saisie)",
  "triAmendement": "fabvg",
  "cardinaliteAmdtMultiples": "1",
  "amendementParent": "AMANR5L15SEA717460B0911P0D1N346",
  "etat": "A discuter",
  "signataires": {
    "auteur": {
      "typeAuteur": "Depute",
      "acteurRef": "PA608695",
      "groupePolitiqueRef": "PO730946"
    },
    "cosignatairesRefs": [
      "PA405480",
      "PA609590",
      "PA643145",
      "PA335532",
      "PA429893",
      "PA337483",
      "PA1592",
      "PA605069",
      "PA610681",
      "PA332614",
      "PA333818",
      "PA335054",
      "PA609332",
      "PA508",
      "PA608172",
      "PA608011",
      "PA333285",
      "PA1008",
      "PA719930",
      "PA720988",
      "PA642764",
      "PA608695",
      "PA340357",
      "PA342415",
      "PA588886",
      "PA267233",
      "PA340343",
      "PA1198",
      "PA607553",
      "PA1809"
    ],
    "texteAffichable": "Mme&#160;Untermaier,  Mme&#160;Rabault, M.&#160;Faure, M.&#160;Aviragnet, Mme&#160;Bareigts, Mme&#160;Battistel, Mme&#160;Bi&#233;mouret, M.&#160;Bouillon, M.&#160;Jean-Louis&#160;Bricout, M.&#160;Carvounas, M.&#160;Alain&#160;David, Mme&#160;Laurence&#160;Dumont, M.&#160;Garot, M.&#160;David&#160;Habib, M.&#160;Hutin, M.&#160;Juanico, Mme&#160;Karamanli, M.&#160;J&#233;r&#244;me&#160;Lambert, M.&#160;Le Foll, M.&#160;Letchimy, Mme&#160;Manin, Mme&#160;Pau-Langevin, Mme&#160;Pires Beaune, M.&#160;Potier, M.&#160;Pueyo, M.&#160;Pupponi, M.&#160;Saulignac, Mme&#160;Vainqueur-Christophe, M.&#160;Vallaud, Mme&#160;Victory et les membres du groupe Nouvelle Gauche"
  },
  "pointeurFragmentTexte": {
    "division": {
      "titre": "Article 9",
      "articleDesignationCourte": "APRÈS ART. 9",
      "type": "ARTICLE",
      "avantAApres": "Apres",
      "divisionRattachee": "APRÈS L'ARTICLE 9, insérer l'article suivant:",
      "articleAdditionnel": "1",
      "urlDivisionTexteVise": "/15/textes/0911.asp#D_Article_9"
    }
  },
  "corps": {
    "dispositif": "<p style=\"text-align: justify;\">Apr&#232;s le mot&#160;:</p><p style=\"text-align: justify;\">&#171;&#160;publiques&#160;&#187;,</p><p style=\"text-align: justify;\">r&#233;diger ainsi la fin de l&#8217;alin&#233;a 5&#160;:</p><p style=\"text-align: justify;\">&#171;&#160;, de communication de tout document et de contr&#244;le sur pi&#232;ces ou sur place&#160;&#187;.</p>",
    "exposeSommaire": "<p style=\"text-align: justify;\">Toute instance parlementaire charg&#233;e d&#8217;une mission de contr&#244;le ou d&#8217;&#233;valuation doit disposer des pouvoirs de convocation, de communication et de contr&#244;le sur pi&#232;ces et sur place, actuellement r&#233;serv&#233;s &#224; un nombre restreint d&#8217;activit&#233;s de contr&#244;le.</p><p style=\"text-align: justify;\">Il est donc propose d&#8217;introduire dans la Constitution une disposition g&#233;n&#233;ralisant l&#8217;attribution de ces pouvoirs &#224; l&#8217;int&#233;gralit&#233; des instances charg&#233;es au sein de chaque assembl&#233;e d&#8217;exercer des missions de contr&#244;le et d&#8217;&#233;valuation.</p>"
  },
  "representations": [
    {
      "nom": "PDF",
      "typeMime": {
        "type": "application",
        "subType": "PDF"
      },
      "statutRepresentation": {
        "verbatim": true,
        "canonique": true,
        "officielle": true,
        "transcription": false,
        "enregistrement": false
      },
      "contenu": {
        "documentURI": "/15/amendements/0911/AN/2505.pdf"
      }
    }
  ],
  "dateDepot": "2018-07-11T02:00:00.000+02:00",
  "dateDistribution": "2018-07-12T02:00:00.000+02:00",
  "article99": "0",
  "loiReference": {
    "codeLoi": "Constitution",
    "divisionCodeLoi": "51-2"
  }
}