{
  "uid": "AMANR5L15PO419865B1831P0D1N1048",
  "identifiant": {
    "legislature": "15",
    "numero": "1048",
    "numRect": "0",
    "saisine": {
      "texteLegislatifRef": "PRJLANR5L15B1831",
      "numeroPartiePLF": "0",
      "organeExamen": "PO419865",
      "mentionSecondeDeliberation": "0"
    }
  },
  "numeroLong": "CD1048",
  "etapeTexte": "1ère lecture (2ème assemblée saisie)",
  "triAmendement": "faaaaaaaaaaaaaaaaaaaaaaaaaaaaaaaaaaaaaaaaaaaaaaaaasknzf",
  "cardinaliteAmdtMultiples": "1",
  "etat": "Discuté",
  "signataires": {
    "auteur": {
      "typeAuteur": "Depute",
      "acteurRef": "PA333421",
      "groupePolitiqueRef": "PO759900"
    },
    "cosignatairesRefs": [
      "PA333421",
      "PA719286",
      "PA331582",
      "PA267042",
      "PA336175",
      "PA755549",
      "PA719138",
      "PA608292",
      "PA607619",
      "PA719146",
      "PA942",
      "PA605518",
      "PA405480",
      "PA605694",
      "PA720996",
      "PA336439"
    ],
    "texteAffichable": "M.&#160;Pancher,  M.&#160;Colombani, M.&#160;Falorni, M.&#160;Fran&#231;ois-Michel&#160;Lambert, M.&#160;Acquaviva, M.&#160;Brial, M.&#160;Castellani, M.&#160;Cl&#233;ment, M.&#160;Charles&#160;de Courson, Mme&#160;Dubi&#233;, M.&#160;El Guerrab, M.&#160;Favennec Becot, M.&#160;Molac, Mme&#160;Pinel, M.&#160;Pupponi et M.&#160;Philippe&#160;Vigier"
  },
  "pointeurFragmentTexte": {
    "division": {
      "titre": "Article 25 bis",
      "articleDesignationCourte": "ART. 25 BIS",
      "type": "ARTICLE",
      "avantAApres": "A",
      "divisionRattachee": "ARTICLE 25 BIS",
      "urlDivisionTexteVise": "/15/textes/1831.asp#D_Article_25_bis"
    },
    "alinea": {
      "numero": "2"
    }
  },
  "corps": {
    "dispositif": "<p>&#192; l&#8217;alin&#233;a&#160;2, substituer aux deux premi&#232;res occurrences des mots&#160;:</p><p style=\"text-align: justify;\">&#171;&#160;&#224; faibles et tr&#232;s faibles &#233;missions&#160;&#187;</p><p style=\"text-align: justify;\">les mots&#160;:</p><p style=\"text-align: justify;\">&#171;&#160;fonctionnant gr&#226;ce aux carburants GPL, GNV, ED95, super&#233;thanol E85 ou gr&#226;ce aux technologies suivantes, &#233;lectrique &#224; batterie ou &#224; pile &#224; combustible, hybride et hybride rechargeable&#160;&#187;.</p>",
    "exposeSommaire": "<p style=\"text-align: justify;\">Il est &#224; noter qu&#8217;un programme d&#233;nomm&#233; ADVENIR finance d&#8217;ores et d&#233;j&#224;, sous certaines conditions, des infrastructures de recharges pour v&#233;hicule &#233;lectrique ou hybride rechargeable. Naturellement, nous estimons que ces aides financi&#232;res sont b&#233;n&#233;fiques &#224; l&#8217;essor des mobilit&#233;s durables. Pour autant, il est &#224; noter que si la contribution financi&#232;re globale des oblig&#233;s du m&#233;canisme des CEE est li&#233;e &#224; 25&#160;% &#224; la distribution des carburants, seuls 8&#160;% des volumes financiers engendr&#233;s par les CEE sont d&#233;di&#233;s &#224; la mobilit&#233;. Le financement de la mobilit&#233; durable dans le cadre des CEE pourrait donc &#234;tre renforc&#233;.&#160;</p><p style=\"text-align: justify;\">Enfin, il nous semblerait utile de porter dans le cadre de cette proposition une vision plus large des &#233;nergies alternatives en octroyant des CEE en direction de tous les v&#233;hicules fonctionnant avec une technologie ou une &#233;nergie alternative.</p>"
  },
  "representations": [
    {
      "nom": "PDF",
      "typeMime": {
        "type": "application",
        "subType": "PDF"
      },
      "statutRepresentation": {
        "verbatim": true,
        "canonique": true,
        "officielle": true,
        "transcription": false,
        "enregistrement": false
      },
      "contenu": {
        "documentURI": "/15/amendements/1831/CION-DVP/CD1048.pdf"
      }
    }
  ],
  "sort": {
    "dateSaisie": "2019-05-17T22:20:39.000+02:00",
    "sortEnSeance": "Tombé"
  },
  "dateDepot": "2019-05-07T02:00:00.000+02:00",
  "dateDistribution": "2019-05-16T02:00:00.000+02:00",
  "article99": "0",
  "loiReference": {}
}