{
  "uid": "AMANR5L15SEA717460B0911P0D1N274",
  "identifiant": {
    "legislature": "15",
    "numero": "274",
    "numRect": "0",
    "saisine": {
      "texteLegislatifRef": "PRJLANR5L15B0911",
      "numeroPartiePLF": "0",
      "organeExamen": "PO717460",
      "mentionSecondeDeliberation": "0"
    }
  },
  "numeroLong": "274",
  "etapeTexte": "1ère lecture (1ère assemblée saisie)",
  "triAmendement": "abhwtzrwtznyzszto",
  "cardinaliteAmdtMultiples": "1",
  "etat": "A discuter",
  "signataires": {
    "auteur": {
      "typeAuteur": "Depute",
      "acteurRef": "PA330909",
      "groupePolitiqueRef": "PO730934"
    },
    "cosignatairesRefs": [
      "PA266776",
      "PA334843",
      "PA721816",
      "PA1327",
      "PA330909",
      "PA721678",
      "PA334654",
      "PA709315",
      "PA719272",
      "PA718884",
      "PA606712",
      "PA330684",
      "PA719318",
      "PA346218",
      "PA334149",
      "PA267450",
      "PA608416",
      "PA332523",
      "PA267204",
      "PA340853",
      "PA721506",
      "PA748954",
      "PA720386",
      "PA266793"
    ],
    "texteAffichable": "M.&#160;Descoeur,  M.&#160;Leclerc, M.&#160;Bony, Mme&#160;Anthoine, Mme&#160;Bazin-Malgras, Mme&#160;Meunier, M.&#160;Lurton, M.&#160;Masson, M.&#160;Verch&#232;re, M.&#160;Forissier, M.&#160;Fasquelle, Mme&#160;Dalloz, M.&#160;Viala, M.&#160;Straumann, M.&#160;Hetzel, M.&#160;Boucard, M.&#160;Sermier, Mme&#160;Val&#233;rie&#160;Boyer, Mme&#160;Kuster, M.&#160;Reda, M.&#160;Di Filippo, M.&#160;Savignat, M.&#160;Reiss et M.&#160;R&#233;mi&#160;Delatte"
  },
  "pointeurFragmentTexte": {
    "division": {
      "titre": "Article 15",
      "articleDesignationCourte": "APRÈS ART. 15",
      "type": "ARTICLE",
      "avantAApres": "Apres",
      "divisionRattachee": "APRÈS L'ARTICLE 15, insérer l'article suivant:",
      "articleAdditionnel": "1",
      "urlDivisionTexteVise": "/15/textes/0911.asp#D_Article_15"
    }
  },
  "corps": {
    "dispositif": "<p style=\"text-align: justify;\">Au dernier alin&#233;a de l&#8217;article&#160;72&#8209;2 de la Constitution, le mot&#160;: &#171;&#160;favoriser&#160;&#187; est remplac&#233; par le mot&#160;: &#171;&#160;assurer&#160;&#187;.</p>",
    "exposeSommaire": "<p style=\"text-align: justify;\">Cet amendement a pour objectif de r&#233;&#233;quilibrer le territoire et de mieux prendre en compte les &#233;carts de richesse entre collectivit&#233;s territoriales. . Si la notion de p&#233;r&#233;quation existe d&#233;j&#224; dans la Constitution, elle se pr&#233;sente davantage comme un objectif &#224; atteindre, puisqu&#8217;elle n&#8217;a pas de valeur contraignante ou coercitive dans l&#8217;&#233;tat du texte constitutionnel.</p><p style=\"text-align: justify;\">Cet amendement vise donc &#224; renforcer cette notion en modifiant l&#8217;article&#160;72&#8209;2 qui dispose actuellement que &#171;&#160;La loi pr&#233;voit des dispositifs de p&#233;r&#233;quation destin&#233;s &#224; favoriser l&#8217;&#233;galit&#233; entre les collectivit&#233;s territoriales,&#160;&#187; en rempla&#231;ant le terme &#171;&#160;favoriser&#160;&#187; par le mot &#171;&#160;assurer&#160;&#187;.</p>"
  },
  "representations": [
    {
      "nom": "PDF",
      "typeMime": {
        "type": "application",
        "subType": "PDF"
      },
      "statutRepresentation": {
        "verbatim": true,
        "canonique": true,
        "officielle": true,
        "transcription": false,
        "enregistrement": false
      },
      "contenu": {
        "documentURI": "/15/amendements/0911/AN/274.pdf"
      }
    }
  ],
  "dateDepot": "2018-07-03T02:00:00.000+02:00",
  "dateDistribution": "2018-07-13T02:00:00.000+02:00",
  "article99": "0",
  "loiReference": {
    "codeLoi": "Constitution",
    "divisionCodeLoi": "72-2"
  }
}