{
  "uid": "AMANR5L15PO59048B1255P2D1N925",
  "identifiant": {
    "legislature": "15",
    "numero": "925",
    "numRect": "0",
    "saisine": {
      "texteLegislatifRef": "PRJLANR5L15B1255",
      "numeroPartiePLF": "2",
      "organeExamen": "PO59048",
      "mentionSecondeDeliberation": "0"
    }
  },
  "numeroLong": "II-CF925",
  "etapeTexte": "1ère lecture (1ère assemblée saisie)",
  "triAmendement": "jqaaaaaaaaaaaaaaaaaaaaaaaaaaaaaaaaaaaaaaaaaaaaaaaaajh",
  "cardinaliteAmdtMultiples": "1",
  "etat": "Discuté",
  "signataires": {
    "auteur": {
      "typeAuteur": "Depute",
      "acteurRef": "PA720230",
      "groupePolitiqueRef": "PO744425"
    },
    "cosignatairesRefs": [
      "PA267355",
      "PA721110",
      "PA721194",
      "PA610775",
      "PA720230",
      "PA642868",
      "PA712014",
      "PA267330",
      "PA721486",
      "PA1960",
      "PA719806",
      "PA266788",
      "PA267780",
      "PA721094"
    ],
    "texteAffichable": "Mme&#160;Magnier,  Mme&#160;Auconie, M.&#160;Christophe, Mme&#160;Fr&#233;d&#233;rique&#160;Dumas, M.&#160;Dunoyer, Mme&#160;Firmin Le Bodo, M.&#160;Gom&#232;s, M.&#160;Herth, M.&#160;Ledoux, M.&#160;Leroy, M.&#160;Morel-&#192;-L&apos;Huissier, M.&#160;Naegelen, Mme&#160;Sanquer et M.&#160;Zumkeller"
  },
  "pointeurFragmentTexte": {
    "division": {
      "titre": "Article 58",
      "articleDesignationCourte": "APRÈS ART. 58",
      "type": "ARTICLE",
      "avantAApres": "Apres",
      "divisionRattachee": "APRÈS L'ARTICLE 58, insérer l'article suivant:",
      "articleAdditionnel": "1",
      "urlDivisionTexteVise": "/15/textes/1255C.asp#D_Article_58"
    }
  },
  "corps": {
    "dispositif": "<p style=\"text-align: justify;\">I.&#160;&#8211;&#160;Au premier alin&#233;a du I de l&#8217;article&#160;199 <i>sexvicies</i> du code g&#233;n&#233;ral des imp&#244;ts, l&#8217;ann&#233;e&#160;: &#171;&#160;2018&#160;&#187; est remplac&#233;e par l&#8217;ann&#233;e&#160;: &#171;&#160;2021&#160;&#187;.</p><p>II.&#160;&#8211;&#160;La perte de recettes pour l&#8217;&#201;tat est compens&#233;e &#224; due concurrence par la cr&#233;ation d&#8217;une taxe additionnelle aux droits mentionn&#233;s aux articles 575 et 575 A du code g&#233;n&#233;ral des imp&#244;ts.</p>",
    "exposeSommaire": "<p>&#160;</p><p>&#160;</p><p>Dans la conduite de sa Strat&#233;gie Logement, le Gouvernement a exprim&#233; le v&#339;u d&#8217;accro&#238;tre la production de logements pour les jeunes et particuli&#232;rement les &#233;tudiants, qui y consacrent une partie de leur budget jug&#233;e trop importante, du fait de l&#8217;insuffisance de l&#8217;offre de logements pour ce public.</p><p>&#160;</p><p>Dans le m&#234;me temps, le dispositif Censi-Bouvard, recentr&#233; il y a 2 ans sur la production de logements neufs destin&#233;s aux personnes &#226;g&#233;es et aux &#233;tudiants, devrait expirer le 31 d&#233;cembre 2018.</p><p>&#160;</p><p>Parce que certaines dispositions fiscales du PLF constituent un outil d&#8217;accompagnement de la Strat&#233;gie Logement du Gouvernement, il est propos&#233; de r&#233;pondre &#224; l&#8217;objectif affich&#233; de construire, notamment, 60&#160;000 logements pour les &#233;tudiants en prorogeant le dispositif Censi-Bouvard pour permettre de fl&#233;cher l&#8217;&#233;pargne priv&#233;e des particuliers vers ce secteur, parall&#232;lement aux efforts combin&#233;s de l&#8217;Etat, d&#8217;Action Logement et des bailleurs sociaux.</p><p>&#160;</p><p>Tel est l&#8217;objet du pr&#233;sent amendement.</p>"
  },
  "representations": [
    {
      "nom": "PDF",
      "typeMime": {
        "type": "application",
        "subType": "PDF"
      },
      "statutRepresentation": {
        "verbatim": true,
        "canonique": true,
        "officielle": true,
        "transcription": false,
        "enregistrement": false
      },
      "contenu": {
        "documentURI": "/15/amendements/1255C/CION_FIN/CF925.pdf"
      }
    }
  ],
  "sort": {
    "dateSaisie": "2018-11-08T00:49:17.000+01:00",
    "sortEnSeance": "Tombé"
  },
  "dateDepot": "2018-10-31T01:00:00.000+01:00",
  "dateDistribution": "2018-11-06T01:00:00.000+01:00",
  "article99": "0",
  "loiReference": {
    "codeLoi": "impôts",
    "divisionCodeLoi": "199 sexvicies"
  }
}