{
  "uid": "AMANR5L15PO59048B2272P1D1N1464",
  "identifiant": {
    "legislature": "15",
    "numero": "1464",
    "numRect": "0",
    "saisine": {
      "texteLegislatifRef": "PRJLANR5L15B2272",
      "numeroPartiePLF": "1",
      "organeExamen": "PO59048",
      "mentionSecondeDeliberation": "0"
    }
  },
  "numeroLong": "I-CF1464",
  "etapeTexte": "1ère lecture (1ère assemblée saisie)",
  "triAmendement": "daaaaaaaaaaaaaaaaaaaaaaaaaaaaaaaaaaaaaaaaaaaaaaaaaacax",
  "cardinaliteAmdtMultiples": "1",
  "etat": "Discuté",
  "signataires": {
    "auteur": {
      "typeAuteur": "Depute",
      "acteurRef": "PA719700",
      "groupePolitiqueRef": "PO730964"
    },
    "cosignatairesRefs": [
      "PA719700",
      "PA606639"
    ],
    "texteAffichable": "M.&#160;Hupp&#233; et M.&#160;Vignal"
  },
  "pointeurFragmentTexte": {
    "division": {
      "titre": "Article 13",
      "articleDesignationCourte": "APRÈS ART. 13",
      "type": "ARTICLE",
      "avantAApres": "Apres",
      "divisionRattachee": "APRÈS L'ARTICLE 13, insérer l'article suivant:",
      "articleAdditionnel": "1",
      "urlDivisionTexteVise": "/15/textes/2272A.asp#D_Article_13"
    }
  },
  "corps": {
    "dispositif": "<p style=\"text-align: justify;\">I.&#160;&#8211;&#160;Apr&#232;s l&#8217;article&#160;38 du code g&#233;n&#233;ral des imp&#244;ts, il est ins&#233;r&#233; un article&#160;38 A ainsi r&#233;dig&#233;&#160;:</p><p style=\"text-align: justify;\">&#171;&#160;<i> Art 38 A</i>. &#8211; Par d&#233;rogation &#224; l&#8217;article&#160;38 du code g&#233;n&#233;ral des imp&#244;ts, les entreprises individuelles soumises &#224; l&#8217;imp&#244;t sur le revenu ont la possibilit&#233; d&#8217;affecter &#224; un compte d&#8217;attente constitu&#233; au sein d&#8217;un &#233;tablissement bancaire disposant de toutes les accr&#233;ditations n&#233;cessaires, la part des b&#233;n&#233;fices r&#233;alis&#233;s, non distribu&#233;s, et r&#233;investis sous forme de r&#233;serve dans l&#8217;entreprise individuelle.</p><p style=\"text-align: justify;\">Les sommes affect&#233;es &#224; ce compte d&#8217;attente ne seront soumises ni aux pr&#233;l&#232;vements sociaux, ni &#224; l&#8217;imp&#244;t sur le revenu des personnes physiques.</p><p style=\"text-align: justify;\">Cette suspension de taxe prend fin lorsque l&#8217;exploitant d&#233;cide de pr&#233;lever les sommes.</p><p style=\"text-align: justify;\">Ce compte d&#8217;attente doit &#234;tre inscrit aupr&#232;s d&#8217;un &#233;tablissement de cr&#233;dit et son montant doit &#234;tre inscrit &#224; l&#8217;actif du bilan de l&#8217;entreprise. L&#8217;inscription des sommes doit &#234;tre effectu&#233;e dans les six mois de la cl&#244;ture et au plus tard &#224; la date de d&#233;p&#244;t de la d&#233;claration des r&#233;sultats de cet exercice. Les int&#233;r&#234;ts capitalis&#233;s correspondant ne sont pas imposables.</p><p style=\"text-align: justify;\">Le montant des sommes affect&#233;es &#224; ce compte est d&#233;termin&#233; librement par l&#8217;exploitant dans la limite de 13&#160;% du r&#233;sultat fiscal et d&#8217;un plafond de 7000&#160;euros par exercice de douze mois. Ce compte d&#8217;attente ne pourra d&#233;passer un plafond maximum de 35&#160;000&#160;euros, major&#233; le cas &#233;ch&#233;ant des int&#233;r&#234;ts capitalis&#233;s non soumis &#224; l&#8217;imp&#244;t.</p><p style=\"text-align: justify;\">Ces sommes capitalis&#233;es peuvent &#234;tre utilis&#233;es au titre de chaque exercice pour tous les besoins de l&#8217;activit&#233;.</p><p style=\"text-align: justify;\">Les sommes d&#233;duites et leurs int&#233;r&#234;ts capitalis&#233;s non utilis&#233;s sont r&#233;int&#233;gr&#233;es au r&#233;sultat de l&#8217;exercice tous les cinq ans, major&#233;s de l&#8217;int&#233;r&#234;t l&#233;gal en vigueur &#224; la date de cl&#244;ture de l&#8217;exercice au cours duquel les sommes et int&#233;r&#234;ts sont rapport&#233;s au r&#233;sultat.</p><p style=\"text-align: justify;\">La d&#233;duction et les int&#233;r&#234;ts capitalis&#233;s utilis&#233;s pour un usage non conforme &#224; leur objet doivent &#234;tre imm&#233;diatement r&#233;int&#233;gr&#233;s et major&#233;s de l&#8217;int&#233;r&#234;t de retard.&#160;&#187;.</p><p style=\"text-align: justify;\">II. La perte de recettes pour l&#8217;&#201;tat est compens&#233;e &#224; due concurrence par la cr&#233;ation d&#8217;une taxe additionnelle aux droits mentionn&#233;s aux articles 575 et 575A du code g&#233;n&#233;ral des imp&#244;ts.</p>",
    "exposeSommaire": "<p style=\"text-align: justify;\">Les b&#233;n&#233;fices des entreprises artisanales soumises &#224; l&#8217;imp&#244;t sur le revenu sont aujourd&#8217;hui d&#233;termin&#233;s&#160; selon l&#8217;article&#160;38 du code g&#233;n&#233;ral des imp&#244;ts, et sont impos&#233;s en totalit&#233; &#224; l&#8217;IRPP et aux charges sociales, que ces b&#233;n&#233;fices aient &#233;t&#233; appr&#233;hend&#233;s par le chef d&#8217;entreprise ou qu&#8217;ils soient r&#233;investis pour accroitre les fonds propres, permettant par la suite de faire face &#224; des besoins de tr&#233;sorerie, al&#233;as ou investissements n&#233;cessaires &#224; l&#8217;activit&#233;.</p><p style=\"text-align: justify;\">Il ressort de ce dispositif une in&#233;galit&#233; d&#233;loyale face aux entreprises soumises &#224; l&#8217;imp&#244;t sur les soci&#233;t&#233;s qui ne subissent pas les effets de la progressivit&#233; de l&#8217;imp&#244;t sur le revenu sur la totalit&#233; des b&#233;n&#233;fices, et dont l&#8217;assiette de charges sociales est limit&#233;e aux b&#233;n&#233;fices distribu&#233;s.</p><p style=\"text-align: justify;\">La cr&#233;ation d&#8217;un compte d&#8217;attente qui n&#8217;int&#232;grerait pas dans l&#8217;imm&#233;diat le p&#233;rim&#232;tre du r&#233;sultat fiscal de l&#8217;exercice, et sur lequel l&#8217;entrepreneur individuel aurait la possibilit&#233; de provisionner la part du r&#233;sultat affect&#233; aux r&#233;serves dans la limite de 13&#160;% du r&#233;sultat fiscal et 7000&#160;euros par exercice, tout en respectant un plafond de 35&#160;000&#160;euros, b&#233;n&#233;ficierait d&#8217;une suspension de taxes vou&#233;e &#224; disparaitre en cas de pr&#233;l&#232;vement des sommes par l&#8217;exploitant. D&#232;s lors les montants pr&#233;lev&#233;s seraient normalement soumis aux pr&#233;l&#232;vements sociaux et &#224; l&#8217;imp&#244;t sur le revenu, sans p&#233;nalit&#233;s de retard.</p><p style=\"text-align: justify;\">Les sommes capitalis&#233;es ainsi que leurs int&#233;r&#234;ts seront r&#233;int&#233;gr&#233;es au r&#233;sultat de l&#8217;exercice tous les cinq ans.</p>"
  },
  "representations": [
    {
      "nom": "PDF",
      "typeMime": {
        "type": "application",
        "subType": "PDF"
      },
      "statutRepresentation": {
        "verbatim": true,
        "canonique": true,
        "officielle": true,
        "transcription": false,
        "enregistrement": false
      },
      "contenu": {
        "documentURI": "/15/amendements/2272A/CION_FIN/CF1464.pdf"
      }
    }
  ],
  "sort": {
    "dateSaisie": "2019-10-09T22:13:38.000+02:00",
    "sortEnSeance": "Non soutenu"
  },
  "dateDepot": "2019-10-04T02:00:00.000+02:00",
  "dateDistribution": "2019-10-08T02:00:00.000+02:00",
  "article99": "0",
  "loiReference": {
    "codeLoi": "CGI",
    "divisionCodeLoi": "38"
  }
}