{
  "uid": "AMANR5L15SEA717460BTC1173P0D1N150",
  "identifiant": {
    "legislature": "15",
    "numero": "150",
    "numRect": "0",
    "saisine": {
      "texteLegislatifRef": "PRJLANR5L15BTC1173",
      "numeroPartiePLF": "0",
      "organeExamen": "PO717460",
      "mentionSecondeDeliberation": "0"
    }
  },
  "numeroLong": "150",
  "etapeTexte": "Nouvelle Lecture",
  "triAmendement": "e",
  "cardinaliteAmdtMultiples": "1",
  "etat": "Discuté",
  "signataires": {
    "auteur": {
      "typeAuteur": "Depute",
      "acteurRef": "PA720430",
      "groupePolitiqueRef": "PO730958"
    },
    "cosignatairesRefs": [
      "PA720430",
      "PA718868",
      "PA588884",
      "PA721202",
      "PA719578",
      "PA721226",
      "PA718860",
      "PA720892",
      "PA722142",
      "PA720846",
      "PA2150",
      "PA720996",
      "PA719676",
      "PA720422",
      "PA721960",
      "PA721210",
      "PA721062",
      "PA720286"
    ],
    "texteAffichable": "M.&#160;Bernalicis,  Mme&#160;Autain, M.&#160;Coquerel, M.&#160;Corbi&#232;re, Mme&#160;Fiat, M.&#160;Lachaud, M.&#160;Larive, M.&#160;M&#233;lenchon, Mme&#160;Obono, Mme&#160;Panot, M.&#160;Prud&apos;homme, M.&#160;Quatennens, M.&#160;Ratenon, Mme&#160;Ressiguier, Mme&#160;Rubin, M.&#160;Ruffin, Mme&#160;Taurine et M.&#160;El Guerrab"
  },
  "pointeurFragmentTexte": {
    "division": {
      "titre": "Article 18",
      "articleDesignationCourte": "ART. 18",
      "type": "ARTICLE",
      "avantAApres": "A",
      "divisionRattachee": "ARTICLE 18",
      "urlDivisionTexteVise": "/15/textes/1173.asp#D_Article_18"
    }
  },
  "corps": {
    "dispositif": "<p>Supprimer cet article.</p>",
    "exposeSommaire": "<p style=\"text-align: justify;\">Par cet amendement, nous souhaitons garantir le droit au recours et les droits et liberte&#769;s fondamentales des personnes qui ont fait l&#8217;objet d&#8217;une mesure d&#8217;e&#769;loignement ou d&#8217;une interdiction de retour sur le territoire et qui ont poste&#769;rieurement de&#769;pose&#769; une demande d&#8217;asile.</p><p style=\"text-align: justify;\">En effet, cet article pre&#769;voit notamment que celles-ci peuvent e&#770;tre assigne&#769;es a&#768; re&#769;sidence ou place&#769;es en re&#769;tention le temps ne&#769;cessaire a&#768; l&#8217;examen de leur demande d&#8217;asile.</p><p style=\"text-align: justify;\">Nous nous interrogeons sur les motivations profondes de cet article qui vise non moins a&#768; prolonger cette de&#769;gradation des droits et liberte&#769;s des personnes en ce que nous basculons progressivement dans un re&#769;gime policier ou&#768; le pouvoir exe&#769;cutif semble vouloir de&#769;sormais avoir la possibilite&#769; mettre tout le monde en assignation a&#768; re&#769;sidence ou en re&#769;tention...</p><p style=\"text-align: justify;\">En outre, le droit au recours de ces personnes est particulie&#768;rement de&#769;grade&#769; puisque cet article cre&#769;e aussi un nouveau recours spe&#769;cifique qui permet a&#768; l&#8217;e&#769;tranger dont la demande a e&#769;te&#769; rejete&#769;e par l&#8217;OFPRA de ne pas e&#770;tre e&#769;loigne&#769; le temps de faire le recours devant la CNDA. Le tribunal saisi statue en juge unique, ...et en 72 heures.</p>"
  },
  "representations": [
    {
      "nom": "PDF",
      "typeMime": {
        "type": "application",
        "subType": "PDF"
      },
      "statutRepresentation": {
        "verbatim": true,
        "canonique": true,
        "officielle": true,
        "transcription": false,
        "enregistrement": false
      },
      "contenu": {
        "documentURI": "/15/amendements/1173/AN/150.pdf"
      }
    }
  ],
  "seanceDiscussion": "RUANR5L15S2018IDS21205",
  "sort": {
    "dateSaisie": "2018-07-26T21:59:19.000+02:00",
    "sortEnSeance": "Rejeté"
  },
  "dateDepot": "2018-07-20T02:00:00.000+02:00",
  "dateDistribution": "2018-07-23T02:00:00.000+02:00",
  "article99": "0",
  "loiReference": {}
}