{
  "uid": "AMANR5L15PO766718B2187P0D1N909",
  "identifiant": {
    "legislature": "15",
    "numero": "909",
    "numRect": "0",
    "saisine": {
      "texteLegislatifRef": "PRJLANR5L15B2187",
      "numeroPartiePLF": "0",
      "organeExamen": "PO766718",
      "mentionSecondeDeliberation": "0"
    }
  },
  "numeroLong": "909",
  "etapeTexte": "1ère lecture (1ère assemblée saisie)",
  "triAmendement": "apaaaaaaaaaaaaaaaaaaaaaaaaaaaaaaaaaaaaaaaaaaaaaaaazaaaaf",
  "cardinaliteAmdtMultiples": "1",
  "etat": "Discuté",
  "signataires": {
    "auteur": {
      "typeAuteur": "Depute",
      "acteurRef": "PA642847",
      "groupePolitiqueRef": "PO730934"
    },
    "cosignatairesRefs": [
      "PA642847"
    ],
    "texteAffichable": "M.&#160;Bazin"
  },
  "pointeurFragmentTexte": {
    "division": {
      "titre": "Article 4",
      "articleDesignationCourte": "ART. 4",
      "type": "ARTICLE",
      "avantAApres": "A",
      "divisionRattachee": "ARTICLE 4",
      "urlDivisionTexteVise": "/15/textes/2187.asp#D_Article_4"
    },
    "alinea": {
      "avantAApres": "Apres",
      "numero": "34"
    }
  },
  "corps": {
    "dispositif": "<p>Compl&#233;ter cet article par les deux alin&#233;as suivants&#160;:</p><p style=\"text-align: justify;\">&#171;&#160;VI <i>(nouveau)</i>.&#160;Apr&#232;s l&#8217;article&#160;433&#8209;18&#8209;1 du code p&#233;nal, il est ins&#233;r&#233; un article&#160;433&#8209;18&#8209;2&#160;:</p><p style=\"text-align: justify;\">&#171;&#160;<i>Art.&#160;433&#8209;18&#8209;2</i>.&#160;&#8211;&#160;Le fait, pour une des femmes ayant fait une d&#233;claration anticip&#233;e de volont&#233; vis&#233;e &#224; l&#8217;article&#160;342&#8209;10 du code civil ou pour la personne qu&#8217;elles ont charg&#233;e de d&#233;clarer la naissance, de ne pas remettre, lors de la d&#233;claration de naissance vis&#233;e &#224; l&#8217;article&#160;56 du m&#234;me code, cette d&#233;claration anticip&#233;e de volont&#233; &#224; l&#8217;officier d&#8217;&#233;tat civil est puni de six mois d&#8217;emprisonnement et de 3&#160;750&#160;euros d&#8217;amende.&#160;&#187;&#160;&#187;</p>",
    "exposeSommaire": "<p style=\"text-align: justify;\">En l&#8217;&#233;tat de notre droit, le d&#233;faut de d&#233;claration de naissance, vis&#233;e &#224; l&#8217;article 56 du Code civil, est, dans l&#8217;int&#233;r&#234;t de l&#8217;enfant, incrimin&#233;e &#224; l&#8217;article 433-18-1 du Code p&#233;nal dans les termes qui suivent&#160;:</p><p>Le fait, pour une personne ayant assist&#233; &#224; un accouchement, de ne pas faire la d&#233;claration prescrite par l&#8217;article 56 du code civil dans les d&#233;lais fix&#233;s par l&#8217;article 55 du m&#234;me code est puni de six mois d'emprisonnement et de 3 750 euros d'amende.</p><p>&#160;Compte tenu de l&#8217;importance des effets de la d&#233;claration anticip&#233;e de volont&#233;, vis&#233;e &#224; l&#8217;article 342-10 du Code civil, sur l&#8217;&#233;tablissement de la filiation, il convient de s&#8217;assurer que cette d&#233;claration soit remise &#224; l&#8217;officier d&#8217;&#233;tat civil, au jour de la d&#233;claration de naissance.</p>"
  },
  "representations": [
    {
      "nom": "PDF",
      "typeMime": {
        "type": "application",
        "subType": "PDF"
      },
      "statutRepresentation": {
        "verbatim": true,
        "canonique": true,
        "officielle": true,
        "transcription": false,
        "enregistrement": false
      },
      "contenu": {
        "documentURI": "/15/amendements/2187/CSBIOETH/909.pdf"
      }
    }
  ],
  "sort": {
    "dateSaisie": "2019-09-13T00:08:11.000+02:00",
    "sortEnSeance": "Tombé"
  },
  "dateDepot": "2019-09-04T02:00:00.000+02:00",
  "dateDistribution": "2019-09-10T02:00:00.000+02:00",
  "article99": "0",
  "loiReference": {
    "codeLoi": "c pénal",
    "divisionCodeLoi": "433-18-2"
  }
}