{
  "uid": "AMANR5L15SEA717460BTC2243P0D1N53",
  "identifiant": {
    "legislature": "15",
    "numero": "53",
    "numRect": "0",
    "saisine": {
      "texteLegislatifRef": "PRJLANR5L15BTC2243",
      "numeroPartiePLF": "0",
      "organeExamen": "PO717460",
      "mentionSecondeDeliberation": "0"
    }
  },
  "numeroLong": "53",
  "etapeTexte": "1ère lecture (1ère assemblée saisie)",
  "triAmendement": "acaaaaaaaaaaaaaaaaaaaaaaaaaaaaaaaaaaaaaaaaaaaaaaaahjgko",
  "cardinaliteAmdtMultiples": "1",
  "etat": "Discuté",
  "signataires": {
    "auteur": {
      "typeAuteur": "Depute",
      "acteurRef": "PA330008",
      "groupePolitiqueRef": "PO730934"
    },
    "cosignatairesRefs": [
      "PA606098",
      "PA719318",
      "PA330008",
      "PA1012",
      "PA2796",
      "PA721286",
      "PA643134",
      "PA721046",
      "PA346054",
      "PA722390"
    ],
    "texteAffichable": "M.&#160;Breton,  Mme&#160;Corneloup, M.&#160;Ramadier, Mme&#160;Anthoine, M.&#160;Marleix, Mme&#160;Bassire, Mme&#160;Valentin, M.&#160;Teissier, M.&#160;de la Verpilli&#232;re et M.&#160;Emmanuel&#160;Maquet"
  },
  "pointeurFragmentTexte": {
    "division": {
      "titre": "Article PREMIER",
      "articleDesignationCourte": "ART. PREMIER",
      "type": "ARTICLE",
      "avantAApres": "A",
      "divisionRattachee": "ARTICLE PREMIER",
      "urlDivisionTexteVise": "/15/textes/2243.asp#D_Article_1er"
    },
    "alinea": {
      "numero": "46"
    }
  },
  "corps": {
    "dispositif": "<p style=\"text-align: justify;\">&#192;&#160;l&#8217;alin&#233;a&#160;46, apr&#232;s le mot&#160;:</p><p style=\"text-align: justify;\">&#171;&#160;procr&#233;ation&#160;&#187;,</p><p style=\"text-align: justify;\">ins&#233;rer les mots&#160;:</p><p style=\"text-align: justify;\">&#171;&#160;pour raisons m&#233;dicales&#160;&#187;.</p>",
    "exposeSommaire": "<p style=\"text-align: justify;\">Cet article, remet en cause l&#8217;objet m&#234;me de la m&#233;decine&#160;: l&#8217;AMP se transforme en une technique &#224; la demande pour tous, financ&#233;e &#224; 100&#160;% par la s&#233;curit&#233; sociale que les causes soient m&#233;dicales ou pas, transformant les m&#233;decins en prestataires de service.</p><p style=\"text-align: justify;\">Force est d&#8217;ailleurs de constater que de plus en plus d&#8217;affections pouvant avoir des cons&#233;quences graves, comme l&#8217;hypertension art&#233;rielle, ne sont plus prises en charge &#224; 100&#160;% par la S&#233;curit&#233; sociale.&#160;</p><p style=\"text-align: justify;\">Par cons&#233;quent, il est primordial de ne permettre le remboursement &#224; 100&#160;% que pour les AMP r&#233;alis&#233;es pour raisons m&#233;dicales.&#160;</p>"
  },
  "representations": [
    {
      "nom": "PDF",
      "typeMime": {
        "type": "application",
        "subType": "PDF"
      },
      "statutRepresentation": {
        "verbatim": true,
        "canonique": true,
        "officielle": true,
        "transcription": false,
        "enregistrement": false
      },
      "contenu": {
        "documentURI": "/15/amendements/2243/AN/53.pdf"
      }
    }
  ],
  "seanceDiscussion": "RUANR5L15S2019IDS21832",
  "sort": {
    "dateSaisie": "2019-09-27T12:33:28.000+02:00",
    "sortEnSeance": "Rejeté"
  },
  "dateDepot": "2019-09-16T02:00:00.000+02:00",
  "dateDistribution": "2019-09-23T02:00:00.000+02:00",
  "article99": "0",
  "loiReference": {}
}