{
  "uid": "AMANR5L15SEA717460BTC0902P0D1N2556",
  "identifiant": {
    "legislature": "15",
    "numero": "2556",
    "numRect": "0",
    "saisine": {
      "texteLegislatifRef": "PRJLANR5L15BTC0902",
      "numeroPartiePLF": "0",
      "organeExamen": "PO717460",
      "mentionSecondeDeliberation": "0"
    }
  },
  "numeroLong": "2556",
  "etapeTexte": "1ère lecture (1ère assemblée saisie)",
  "triAmendement": "crkzzzzzs",
  "cardinaliteAmdtMultiples": "1",
  "etat": "Discuté",
  "signataires": {
    "auteur": {
      "typeAuteur": "Depute",
      "acteurRef": "PA607619",
      "groupePolitiqueRef": "PO730964"
    },
    "cosignatairesRefs": [
      "PA607619"
    ],
    "texteAffichable": "M.&#160;Molac"
  },
  "pointeurFragmentTexte": {
    "division": {
      "titre": "Article 10",
      "articleDesignationCourte": "ART. 10",
      "type": "ARTICLE",
      "avantAApres": "A",
      "divisionRattachee": "ARTICLE 10",
      "urlDivisionTexteVise": "/15/textes/0902.asp#D_Article_10"
    },
    "alinea": {
      "avantAApres": "A",
      "numero": "7",
      "alineaDesignation": "Alinéa 7"
    }
  },
  "corps": {
    "dispositif": "<p style=\"text-align: justify;\">Compl&#233;ter l'alin&#233;a 7 par les mots&#160;:</p><p style=\"text-align: justify;\">&#171;&#160;, de d&#233;finir, pour toutes les productions agricoles et quelles que soient les conditions de march&#233;, le prix abusivement bas comme le co&#251;t de production moyen d&#233;fini par l&#8217;Observatoire de la formation des prix et des marges int&#233;grant la r&#233;mun&#233;ration du producteur &#233;gale au moins au salaire minimum interprofessionnel de croissance, et de pr&#233;voir, d&#232;s constatation d&#8217;un prix abusivement bas, la possibilit&#233; pour tout organisme syndical, tout producteur ou la direction g&#233;n&#233;rale de la concurrence, de la consommation et de la r&#233;pression des fraudes de se saisir du sujet pour que la situation rentre dans l&#8217;ordre dans un d&#233;lai d&#8217;un mois, avec r&#233;paration du pr&#233;judice.&#160;&#187;</p>",
    "exposeSommaire": "<p style=\"text-align: justify;\">Cet amendement vise &#224; d&#233;finir pr&#233;cis&#233;ment le prix abusivement bas et son dispositif de saisine. Actuellement, le projet de loi renvoie ces &#233;l&#233;ments &#224; une ordonnance ult&#233;rieure et ne donne que peu de garanties quant &#224; son applicabilit&#233;. Les interprofessions et instituts techniques pourront &#234;tre sollicit&#233;s pour la conception de ce co&#251;t de production.</p>"
  },
  "representations": [
    {
      "nom": "PDF",
      "typeMime": {
        "type": "application",
        "subType": "PDF"
      },
      "statutRepresentation": {
        "verbatim": true,
        "canonique": true,
        "officielle": true,
        "transcription": false,
        "enregistrement": false
      },
      "contenu": {
        "documentURI": "/15/amendements/0902/AN/2556.pdf"
      }
    }
  ],
  "seanceDiscussion": "RUANR5L15S2018IDS21055",
  "sort": {
    "dateSaisie": "2018-05-25T15:56:56.000+02:00",
    "sortEnSeance": "Non soutenu"
  },
  "dateDepot": "2018-05-17T02:00:00.000+02:00",
  "dateDistribution": "2018-05-21T02:00:00.000+02:00",
  "article99": "0",
  "loiReference": {}
}