{
  "uid": "AMANR5L15PO419604B1540P0D1N18",
  "identifiant": {
    "legislature": "15",
    "numero": "18",
    "numRect": "0",
    "saisine": {
      "texteLegislatifRef": "PIONANR5L15B1540",
      "numeroPartiePLF": "0",
      "organeExamen": "PO419604",
      "mentionSecondeDeliberation": "0"
    }
  },
  "numeroLong": "AC18",
  "etapeTexte": "1ère lecture (1ère assemblée saisie)",
  "triAmendement": "jaaaaaaaaaaaaaaaaaaaaaaaaaaaaaaaaaaaaaaaaaaaaaaaaas",
  "cardinaliteAmdtMultiples": "1",
  "etat": "Discuté",
  "signataires": {
    "auteur": {
      "typeAuteur": "Depute",
      "acteurRef": "PA720100",
      "groupePolitiqueRef": "PO730934"
    },
    "cosignatairesRefs": [
      "PA721816",
      "PA719946",
      "PA605991",
      "PA345722",
      "PA720630",
      "PA719318",
      "PA719272",
      "PA267324",
      "PA720100",
      "PA718884",
      "PA266776",
      "PA608826",
      "PA721506",
      "PA223837"
    ],
    "texteAffichable": "M.&#160;Pradi&#233;,  Mme&#160;Anthoine, Mme&#160;Bazin-Malgras, M.&#160;Boucard, M.&#160;Brochand, Mme&#160;Duby-Muller, M.&#160;Gaultier, Mme&#160;Genevard, Mme&#160;Kuster, Mme&#160;Le Grip, Mme&#160;Meunier, M.&#160;Minot, M.&#160;Peltier et M.&#160;Reiss"
  },
  "pointeurFragmentTexte": {
    "division": {
      "titre": "Article 6",
      "articleDesignationCourte": "ART. 6",
      "type": "ARTICLE",
      "avantAApres": "A",
      "divisionRattachee": "ARTICLE 6",
      "urlDivisionTexteVise": "/15/textes/1540.asp#D_Article_6"
    }
  },
  "corps": {
    "dispositif": "<p>I.&#160;&#8211;&#160;Compl&#233;ter cet article par les trois alin&#233;as suivants&#160;:</p><p>&#171;&#160;L&#8217;aide mutualis&#233;e ne peut &#234;tre propos&#233;e que si elle garantit l&#8217;int&#233;r&#234;t de chacun des &#233;l&#232;ves concern&#233;s au regard de sa situation personnelle. Elle est conditionn&#233;e &#224; la possibilit&#233; de revenir &#224; une aide individuelle &#224; chaque instant de la scolarit&#233;.</p><p>&#171;&#160;Si la famille et le corps enseignant formulent une demande d&#8217;un retour &#224; une aide individuelle aupr&#232;s de la commission mentionn&#233;e &#224; l&#8217;article L.&#160;146&#8209;9 du code de l&#8217;action sociale et des familles, celle-ci doit examiner la demande dans un d&#233;lai d&#8217;urgence de quinze jours suite &#224; son d&#233;p&#244;t.&#160;&#187;</p><p>II.&#160;&#8211;&#160;En cons&#233;quence, r&#233;diger ainsi l&#8217;alin&#233;a&#160;2&#160;:</p><p>&#171;&#160;2&#176;&#160;Sont ajout&#233;s trois alin&#233;as ainsi r&#233;dig&#233;s&#160;:&#160;&#187;.</p>",
    "exposeSommaire": "<p style=\"text-align: justify;\">Si l&#8217;attribution d&#8217;une aide mutualis&#233;e peut &#234;tre justifi&#233;e dans certaines situations, elle peut cependant s&#8217;av&#233;rer &#234;tre un frein pour des &#233;l&#232;ves et ne doit en aucun cas devenir la r&#232;gle, le plus souvent afin de &#171;&#160;g&#233;rer la p&#233;nurie&#160;&#187;. Cet amendement vise donc &#224; permettre une souplesse dans l&#8217;attribution des aides mutualis&#233;es en pr&#233;voyant qu&#8217;un retour &#224; une aide individuelle est toujours possible pour assurer le bien-&#234;tre de l&#8217;&#233;l&#232;ve, si cela s&#8217;av&#232;re justifi&#233;.</p>"
  },
  "representations": [
    {
      "nom": "PDF",
      "typeMime": {
        "type": "application",
        "subType": "PDF"
      },
      "statutRepresentation": {
        "verbatim": true,
        "canonique": true,
        "officielle": true,
        "transcription": false,
        "enregistrement": false
      },
      "contenu": {
        "documentURI": "/15/amendements/1540/CION-CEDU/AC18.pdf"
      }
    }
  ],
  "sort": {
    "dateSaisie": "2019-01-23T12:01:30.000+01:00",
    "sortEnSeance": "Rejeté"
  },
  "dateDepot": "2019-01-18T01:00:00.000+01:00",
  "dateDistribution": "2019-01-21T01:00:00.000+01:00",
  "article99": "0",
  "loiReference": {}
}