{
  "uid": "AMANR5L15SEA717460BTC1767P0D1N576",
  "identifiant": {
    "legislature": "15",
    "numero": "576",
    "numRect": "0",
    "saisine": {
      "texteLegislatifRef": "PRJLANR5L15BTC1767",
      "numeroPartiePLF": "0",
      "organeExamen": "PO717460",
      "mentionSecondeDeliberation": "0"
    }
  },
  "numeroLong": "576",
  "etapeTexte": "1ère lecture (1ère assemblée saisie)",
  "triAmendement": "hiaaaaaaaaaaaaaaaaaaaaaaaaaaaaaaaaaaaaaaaaaaaaaaaaibh",
  "cardinaliteAmdtMultiples": "1",
  "etat": "Discuté",
  "signataires": {
    "auteur": {
      "typeAuteur": "Depute",
      "acteurRef": "PA606712",
      "groupePolitiqueRef": "PO730934"
    },
    "cosignatairesRefs": [
      "PA709315",
      "PA1874",
      "PA719318",
      "PA267901",
      "PA2377",
      "PA267735",
      "PA266776",
      "PA346218",
      "PA267378",
      "PA719272",
      "PA267204",
      "PA606712",
      "PA330909",
      "PA643134",
      "PA718784",
      "PA330684",
      "PA712015",
      "PA721046",
      "PA608016",
      "PA718884",
      "PA642847",
      "PA718838",
      "PA340853",
      "PA267260",
      "PA721816"
    ],
    "texteAffichable": "M.&#160;Lurton,  M.&#160;Sermier, Mme&#160;Bassire, M.&#160;Brun, M.&#160;Le Fur, M.&#160;Pauget, M.&#160;Perrut, M.&#160;Masson, Mme&#160;Poletti, M.&#160;Boucard, M.&#160;de Ganay, M.&#160;Kamardine, Mme&#160;Meunier, M.&#160;Leclerc, M.&#160;Bazin, Mme&#160;Val&#233;rie&#160;Boyer, M.&#160;Reiss, Mme&#160;Levy, Mme&#160;Louwagie, M.&#160;Descoeur, M.&#160;Dive, Mme&#160;Valentin, Mme&#160;Anthoine, Mme&#160;Bazin-Malgras et M.&#160;Viala"
  },
  "pointeurFragmentTexte": {
    "division": {
      "titre": "Article 12",
      "articleDesignationCourte": "ART. 12",
      "type": "ARTICLE",
      "avantAApres": "A",
      "divisionRattachee": "ARTICLE 12",
      "urlDivisionTexteVise": "/15/textes/1767.asp#D_Article_12"
    },
    "alinea": {
      "avantAApres": "Apres",
      "numero": "15"
    }
  },
  "corps": {
    "dispositif": "<p style=\"text-align: justify;\">Apr&#232;s l&#8217;alin&#233;a&#160;15, ins&#233;rer l&#8217;alin&#233;a suivant&#160;:</p><p style=\"text-align: justify;\">&#171;&#160;7&#176; Ses donn&#233;es de vaccination.&#160;&#187;</p>",
    "exposeSommaire": "<p style=\"text-align: justify;\">Si en g&#233;n&#233;ral les Fran&#231;ais se disent plut&#244;t favorables &#224; la vaccination, ils restent n&#233;anmoins en manque d&#8217;information.</p><p style=\"text-align: justify;\">Le projet de loi vient doter chaque usager d&#8217;un espace num&#233;rique de sant&#233;. Cet espace permettra &#224; chaque usager d&#8217;avoir acc&#232;s &#224; son dossier m&#233;dical partag&#233;, &#224; tous les outils ou services que l&#8217;usager estime utiles, permettant un renforcement de son information.</p><p style=\"text-align: justify;\">Cet espace devrait permettre d&#8217;avoir acc&#232;s &#224; ses donn&#233;es de vaccination, afin de renforcer son information et l&#8217;alerter sur les rappels qu&#8217;il aurait besoin d&#8217;effectuer. Tel est l&#8217;objet de cet amendement.</p>"
  },
  "representations": [
    {
      "nom": "PDF",
      "typeMime": {
        "type": "application",
        "subType": "PDF"
      },
      "statutRepresentation": {
        "verbatim": true,
        "canonique": true,
        "officielle": true,
        "transcription": false,
        "enregistrement": false
      },
      "contenu": {
        "documentURI": "/15/amendements/1767/AN/576.pdf"
      }
    }
  ],
  "seanceDiscussion": "RUANR5L15S2019IDS21566",
  "sort": {
    "dateSaisie": "2019-03-22T20:04:16.000+01:00",
    "sortEnSeance": "Retiré"
  },
  "dateDepot": "2019-03-15T01:00:00.000+01:00",
  "dateDistribution": "2019-03-19T01:00:00.000+01:00",
  "article99": "0",
  "loiReference": {}
}