{
  "uid": "AMANR5L15SEA717460B0235P2D1N49",
  "identifiant": {
    "legislature": "15",
    "numero": "49",
    "numRect": "0",
    "saisine": {
      "texteLegislatifRef": "PRJLANR5L15B0235",
      "numeroPartiePLF": "2",
      "organeExamen": "PO717460",
      "mentionSecondeDeliberation": "1"
    }
  },
  "numeroLong": "II-49",
  "etapeTexte": "1ère lecture (1ère assemblée saisie)",
  "triAmendement": "i",
  "cardinaliteAmdtMultiples": "1",
  "etat": "Discuté",
  "signataires": {
    "auteur": {
      "typeAuteur": "Depute",
      "acteurRef": "PA719608",
      "groupePolitiqueRef": "PO723569"
    },
    "cosignatairesRefs": [
      "PA719608"
    ],
    "texteAffichable": "Mme&#160;M&#233;nard"
  },
  "pointeurFragmentTexte": {
    "division": {
      "titre": "Article 48",
      "articleDesignationCourte": "ART. 48",
      "type": "ARTICLE",
      "avantAApres": "A",
      "divisionRattachee": "ARTICLE 48",
      "urlDivisionTexteVise": "/15/textes/0235C.asp#D_Article_48"
    },
    "alinea": {
      "numero": "1"
    }
  },
  "corps": {
    "dispositif": "<p style=\"text-align: justify;\">I.&#160;&#8211;&#160;R&#233;diger ainsi l&#8217;alin&#233;a&#160;1&#160;:</p><p style=\"text-align: justify;\">&#171;&#160;Les jours de carence entre le secteur priv&#233; et publique sont align&#233;s.&#160;&#187;</p><p style=\"text-align: justify;\">II.&#160;&#8211;&#160;Compl&#233;ter cet article par l&#8217;alin&#233;a suivant&#160;:</p><p style=\"text-align: justify;\">&#171;&#160;III.&#160;&#8211;&#160;La perte de recettes pour les organismes de s&#233;curit&#233; sociale est compens&#233;e &#224; due concurrence par la cr&#233;ation d&#8217;une taxe additionnelle aux droits mentionn&#233;s aux articles 575 et 575 A du code g&#233;n&#233;ral des imp&#244;ts.&#160;&#187;</p>",
    "exposeSommaire": "<p style=\"text-align: justify;\">En se fondant sur le contr&#244;le d&#8217;un &#233;chantillon de 103 collectivit&#233;s, la Cour des comptes, dans un rapport de 2016, a estim&#233; le travail effectif moyen &#224; 1.562 heures par an, avec seulement 20&#160;% des collectivit&#233;s align&#233;es sur la dur&#233;e r&#233;glementaire.</p><p style=\"text-align: justify;\">[1] Pour lutter contre l&#8217;absent&#233;isme scandaleux qui frappe la fonction publique Nicolas Sarkozy, alors pr&#233;sident, avait cr&#233;&#233; en 2012, le jour de carence qui vise &#224; supprimer la paie le premier jour d&#8217;absence pour maladie. Cette mesure avait &#233;t&#233; supprim&#233;e en janvier 2014 par Fran&#231;ois Hollande sous l&#8217;impulsion du ministre de la fonction publique de l&#8217;&#233;poque, Marylise Lebranchu, qui l&#8217;avait jug&#233;e &#171;&#160;injuste, inutile et inefficace&#160;&#187;</p><p style=\"text-align: justify;\">[2]. Il apparait que la suppression des jours de carence n&#8217;a pas eu l&#8217;effet escompt&#233;. Aussi et dans un souci d&#8217;&#233;quit&#233; vis-&#224;-vis des personnes qui travaillent dans le secteur priv&#233;, il convient d&#8217;aligner le jour de carence du secteur public sur celui du secteur priv&#233;. En d&#8217;autres termes &#224; revenir au r&#233;gime de 2012 et pr&#233;coniser la tol&#233;rance z&#233;ro.</p>"
  },
  "representations": [
    {
      "nom": "PDF",
      "typeMime": {
        "type": "application",
        "subType": "PDF"
      },
      "statutRepresentation": {
        "verbatim": true,
        "canonique": true,
        "officielle": true,
        "transcription": false,
        "enregistrement": false
      },
      "contenu": {
        "documentURI": "/15/amendements/0235C/AN/49.pdf"
      }
    }
  ],
  "seanceDiscussion": "RUANR5L15S2018IDS20772",
  "sort": {
    "dateSaisie": "2017-11-20T19:32:20.000+01:00",
    "sortEnSeance": "Non soutenu"
  },
  "dateDepot": "2017-10-24T02:00:00.000+02:00",
  "dateDistribution": "2017-11-16T01:00:00.000+01:00",
  "article99": "0",
  "loiReference": {}
}