{
  "uid": "AMANR5L15PO419865B1831P0D1N2676",
  "identifiant": {
    "legislature": "15",
    "numero": "2676",
    "numRect": "0",
    "saisine": {
      "texteLegislatifRef": "PRJLANR5L15B1831",
      "numeroPartiePLF": "0",
      "organeExamen": "PO419865",
      "mentionSecondeDeliberation": "0"
    }
  },
  "numeroLong": "CD2676",
  "etapeTexte": "1ère lecture (2ème assemblée saisie)",
  "triAmendement": "ajaaaaaaaaaaaaaaaaaaaaaaaaaaaaaaaaaaaaaaaaaaaaaaaaji",
  "cardinaliteAmdtMultiples": "1",
  "etat": "Discuté",
  "signataires": {
    "auteur": {
      "typeAuteur": "Depute",
      "acteurRef": "PA267241",
      "groupePolitiqueRef": "PO744425"
    },
    "cosignatairesRefs": [
      "PA267766",
      "PA719806",
      "PA267241"
    ],
    "texteAffichable": "M.&#160;Demilly,  Mme&#160;Auconie et M.&#160;Guy&#160;Bricout"
  },
  "pointeurFragmentTexte": {
    "division": {
      "titre": "Article 2",
      "articleDesignationCourte": "APRÈS ART. 2",
      "type": "ARTICLE",
      "avantAApres": "Apres",
      "divisionRattachee": "APRÈS L'ARTICLE 2, insérer l'article suivant:",
      "articleAdditionnel": "1",
      "urlDivisionTexteVise": "/15/textes/1831.asp#D_Article_2"
    }
  },
  "corps": {
    "dispositif": "<p>I.&#160;&#8211;&#160;Le code g&#233;n&#233;ral des imp&#244;ts est ainsi modifi&#233;&#160;:</p><p style=\"text-align: justify;\">1&#176;&#160;L&#8217;article&#160;278&#8209;0&#160;<i>bis</i> est compl&#233;t&#233; par un alin&#233;a ainsi r&#233;dig&#233;&#160;:</p><p style=\"text-align: justify;\">&#171;&#160;M.&#160;&#8211;&#160;Les transports publics de voyageurs du quotidien.&#160;&#187;&#160;;</p><p style=\"text-align: justify;\">2&#176;&#160;Le b<i>&#160;<i>quater</i></i> de l&#8217;article&#160;279 est compl&#233;t&#233; par les mots&#160;: &#171;&#160;, &#224; l&#8217;exclusion des transports publics de voyageurs du quotidien qui rel&#232;vent du taux pr&#233;vu &#224; l&#8217;article 278&#8209;0 <i>bis</i>&#160;&#187;&#160;;</p><p style=\"text-align: justify;\">3&#176;&#160;Au dernier alin&#233;a du 2&#176;&#160;du 1 du I de l&#8217;article&#160;297, les mots&#160;: &#171;&#160;et E &#224; H&#160;&#187;, sont remplac&#233;s par les mots&#160;: &#171;&#160;E &#224; H et M&#160;&#187;.</p><p style=\"text-align: justify;\">II.&#160;&#8211;&#160;La perte de recettes r&#233;sultant pour l&#8217;&#201;tat du I est compens&#233;e, &#224; due concurrence, par la cr&#233;ation d&#8217;une taxe additionnelle aux droits pr&#233;vus aux articles 575 et 575&#160;A du code g&#233;n&#233;ral des imp&#244;ts.</p>",
    "exposeSommaire": "<p>Cet amendement vise &#224; appliquer le taux d&#233;volu aux services de premi&#232;re n&#233;cessit&#233; aux transports publics de voyageurs du quotidien, d&#233;finis au sens de l&#8217;article 2 du r&#232;glement 1370/2007 (r&#232;glement OSP), comme &#233;tant &#171; les services de transport de voyageurs d&#8217;int&#233;r&#234;t &#233;conomique g&#233;n&#233;ral offerts au public sans discrimination et en permanence &#187; ce qui correspond, en France, aux services de transport conventionn&#233;s c&#8217;est&#8208;&#224;&#8208;dire les transports publics urbains et r&#233;gionaux, y compris le transport scolaire et le transport sp&#233;cialis&#233; pour les personnes en situation de handicap.&#160;</p><p style=\"text-align: justify;\"><br />Les transports publics du quotidien participent aux objectifs de transition &#233;nerg&#233;tique et ont un r&#244;le social de premier plan. Il appara&#238;t donc important qu&#8217;ils soient d&#233;sormais consid&#233;r&#233;s comme un service de premi&#232;re n&#233;cessit&#233; comme ils le sont chez nos voisins europ&#233;ens : Belgique, Allemagne, Su&#232;de, Norv&#232;ge, Portugal ou Angleterre.</p>"
  },
  "representations": [
    {
      "nom": "PDF",
      "typeMime": {
        "type": "application",
        "subType": "PDF"
      },
      "statutRepresentation": {
        "verbatim": true,
        "canonique": true,
        "officielle": true,
        "transcription": false,
        "enregistrement": false
      },
      "contenu": {
        "documentURI": "/15/amendements/1831/CION-DVP/CD2676.pdf"
      }
    }
  ],
  "sort": {
    "dateSaisie": "2019-05-16T15:59:19.000+02:00",
    "sortEnSeance": "Rejeté"
  },
  "dateDepot": "2019-05-09T02:00:00.000+02:00",
  "dateDistribution": "2019-05-16T02:00:00.000+02:00",
  "article99": "0",
  "loiReference": {
    "codeLoi": "impôts",
    "divisionCodeLoi": "278-0 bis"
  }
}