{
  "uid": "AMANR5L15PO59051B0099P0D1N68",
  "identifiant": {
    "legislature": "15",
    "numero": "68",
    "numRect": "0",
    "saisine": {
      "texteLegislatifRef": "PRJLANR5L15B0099",
      "numeroPartiePLF": "0",
      "organeExamen": "PO59051",
      "mentionSecondeDeliberation": "0"
    }
  },
  "numeroLong": "CL68",
  "etapeTexte": "1ère lecture (2ème assemblée saisie)",
  "triAmendement": "bi",
  "cardinaliteAmdtMultiples": "1",
  "etat": "Discuté",
  "signataires": {
    "auteur": {
      "typeAuteur": "Depute",
      "acteurRef": "PA266797",
      "groupePolitiqueRef": "PO730934"
    },
    "cosignatairesRefs": [
      "PA266797"
    ],
    "texteAffichable": "M.&#160;Gosselin"
  },
  "pointeurFragmentTexte": {
    "division": {
      "titre": "Article 14",
      "articleDesignationCourte": "APRÈS ART. 14",
      "type": "ARTICLE",
      "avantAApres": "Apres",
      "divisionRattachee": "APRÈS L'ARTICLE 14, insérer l'article suivant:",
      "articleAdditionnel": "1",
      "chapitreAdditionnel": "0",
      "urlDivisionTexteVise": "/15/textes/0099.asp#D_Article_14"
    }
  },
  "corps": {
    "dispositif": "<p style=\"text-align: justify;\">I.&#160;&#8211;&#160;Le 1&#176; du I des articles L.O. 489, L.O. 516 et L.O. 544 du code &#233;lectoral est ainsi r&#233;tabli :</p><p style=\"text-align: justify;\">&#171; 1&#176; Les personnes dont le bulletin n&#176; 2 du casier judiciaire comporte une mention de condamnation pour l'une des infractions mentionn&#233;es &#224; l'article L.O. 127-1 ; &#187;.</p><p style=\"text-align: justify;\">II.&#160;&#8211;&#160;Le 1&#176; du I de l'article 195 de la loi organique n&#176; 99-209 du 19 mars 1999 relative &#224; la Nouvelle-Cal&#233;donie est ainsi r&#233;tabli :</p><p style=\"text-align: justify;\">&#171; 1&#176; Les personnes dont le bulletin n&#176; 2 du casier judiciaire comporte une mention de condamnation pour l'une des infractions mentionn&#233;es &#224; l'article L.O. 127-1 du code &#233;lectoral ; &#187;.</p><p style=\"text-align: justify;\">III.&#160;&#8211;&#160;Le 1&#176; du I de l'article 109 de la loi n&#176; 2004-192 du 27 f&#233;vrier 2004 portant statut d'autonomie de la Polyn&#233;sie fran&#231;aise est ainsi r&#233;tabli :</p><p style=\"text-align: justify;\">&#171; 1&#176; Les personnes dont le bulletin n&#176; 2 du casier judiciaire comporte une mention de condamnation pour l'une des infractions mentionn&#233;es &#224; l'article L.O. 127-1 du code &#233;lectoral ; &#187;.</p>",
    "exposeSommaire": "<p>Cet article reprend une proposition de loi <i>visant &#224; instaurer une obligation de casier judiciaire vierge pour les candidats &#224; une &#233;lection</i>, et adopt&#233;e &#224; l&#8217;unanimit&#233; en 1&#232;re lecture par l'Assembl&#233;e nationale le 2 f&#233;vrier 2017.</p><p>&#160;</p><p>Elle pr&#233;voit que l&#8217;ensemble des candidats &#224; une &#233;lection devront pr&#233;senter un casier judiciaire vierge (extrait B2 qui concerne les crimes et d&#233;lits), de la m&#234;me mani&#232;re que tous les candidats &#224; un concours de la fonction publique.</p><p>&#160;</p><p>Cette disposition semble pouvoir concourir &#224; favoriser la confiance dans l&#8217;action politique et les &#233;lus.</p>"
  },
  "representations": [
    {
      "nom": "PDF",
      "typeMime": {
        "type": "application",
        "subType": "PDF"
      },
      "statutRepresentation": {
        "verbatim": true,
        "canonique": true,
        "officielle": true,
        "transcription": false,
        "enregistrement": false
      },
      "contenu": {
        "documentURI": "/15/amendements/0099/CION_LOIS/CL68.pdf"
      }
    }
  ],
  "sort": {
    "dateSaisie": "2017-07-20T02:54:03.000+02:00",
    "sortEnSeance": "Rejeté"
  },
  "dateDepot": "2017-07-17T02:00:00.000+02:00",
  "dateDistribution": "2017-07-19T02:00:00.000+02:00",
  "article99": "0",
  "loiReference": {
    "codeLoi": "électoral",
    "divisionCodeLoi": "LO489"
  }
}