{
  "uid": "AMANR5L15PO419610B0846P0D1N1603",
  "identifiant": {
    "legislature": "15",
    "numero": "1603",
    "numRect": "0",
    "saisine": {
      "texteLegislatifRef": "PRJLANR5L15B0846",
      "numeroPartiePLF": "0",
      "organeExamen": "PO419610",
      "mentionSecondeDeliberation": "0"
    }
  },
  "numeroLong": "CE1603",
  "etapeTexte": "1ère lecture (1ère assemblée saisie)",
  "triAmendement": "iazr",
  "cardinaliteAmdtMultiples": "1",
  "etat": "Discuté",
  "signataires": {
    "auteur": {
      "typeAuteur": "Depute",
      "acteurRef": "PA721718",
      "groupePolitiqueRef": "PO730964"
    },
    "cosignatairesRefs": [
      "PA719890",
      "PA720116",
      "PA719480",
      "PA721024",
      "PA719388",
      "PA606202",
      "PA720268",
      "PA718902",
      "PA720538",
      "PA721718",
      "PA720014",
      "PA719420",
      "PA720402",
      "PA719528",
      "PA721844",
      "PA719440",
      "PA719822",
      "PA719100",
      "PA718768",
      "PA721384",
      "PA718810"
    ],
    "texteAffichable": "Mme&#160;Do,  M.&#160;Sommer, Mme&#160;Thillaye, M.&#160;Portarrieu, Mme&#160;Mireille&#160;Robert, Mme&#160;Brulebois, M.&#160;Damaisin, M.&#160;Paluszkiewicz, Mme&#160;Valetta Ardisson, Mme&#160;Brunet, M.&#160;C&#233;dric&#160;Roussel, M.&#160;Ardouin, Mme&#160;De Temmerman, M.&#160;Cellier, Mme&#160;Piron, Mme&#160;Tiegna, Mme&#160;Genetet, Mme&#160;Le Meur, Mme&#160;Fran&#231;oise&#160;Dumas, M.&#160;Gaillard et Mme&#160;Fontenel-Personne"
  },
  "pointeurFragmentTexte": {
    "division": {
      "titre": "Article 34",
      "articleDesignationCourte": "ART. 34",
      "type": "ARTICLE",
      "avantAApres": "A",
      "divisionRattachee": "ARTICLE 34",
      "urlDivisionTexteVise": "/15/textes/0846.asp#D_Article_34"
    },
    "alinea": {
      "avantAApres": "Apres",
      "numero": "26"
    }
  },
  "corps": {
    "dispositif": "<p style=\"text-align: justify;\">I.&#160;&#8211;&#160;Apr&#232;s l&#8217;alin&#233;a&#160;26, ins&#233;rer l&#8217;alin&#233;a suivant&#160;:</p><p style=\"text-align: justify;\">&#171;&#160;Un nouveau bail mobilit&#233; ne peut pas &#234;tre conclu entre un bailleur et un locataire lorsque qu&#8217;un bail mobilit&#233; a d&#233;j&#224; &#233;t&#233; contract&#233; entre eux dans une m&#234;me zone g&#233;ographique, except&#233; les cas de renouvellement autoris&#233;s par la loi, selon des modalit&#233;s qui seront pr&#233;cis&#233;es par d&#233;cret en conseil d&#8217;&#201;tat&#160;&#187;.</p><p style=\"text-align: justify;\">II.&#160;&#8211;&#160;En cons&#233;quence, &#224; l&#8217;alin&#233;a&#160;27, apr&#232;s le mot&#160;: </p><p style=\"text-align: justify;\">&#171;&#160;meubl&#233;&#160;&#187;, </p><p style=\"text-align: justify;\">ins&#233;rer les mots&#160;: </p><p style=\"text-align: justify;\">&#171;&#160;ou dans une m&#234;me zone g&#233;ographique dans les conditions d&#233;crites &#224; l&#8217;alin&#233;a pr&#233;c&#233;dent&#160;&#187;.</p>",
    "exposeSommaire": "<p style=\"text-align: justify;\">Le bail mobilit&#233; est une r&#233;elle avanc&#233;e qui permettrait de favoriser la mobilit&#233; professionnelle et la formation, &#224; condition toutefois que ce bail ne soit pas d&#233;tourn&#233;. Les parties prenantes contact&#233;es, notamment celles qui d&#233;fendent les int&#233;r&#234;ts des locataires, craignent que des bailleurs peu scrupuleux utilisent le bail mobilit&#233; en lieu et place d&#8217;un bail d&#8217;habitation, ce qui reviendrait &#224; pr&#233;cariser les locataires.</p><p style=\"text-align: justify;\">Pour &#233;viter ces abus et pour que ce bail soit bien accept&#233;, il est n&#233;cessaire d&#8217;anticiper les tentatives de d&#233;tournement.</p><p style=\"text-align: justify;\">L&#8217;un des abus consisterait &#224; &#171;&#160;faire tourner&#160;&#187; les locataires dans plusieurs des appartements qu&#8217;ils poss&#232;dent. Si un bailleur poss&#232;de un immeuble ou plusieurs, ils pourraient accorder des baux mobilit&#233; successivement dans tous ses appartements, au moins officiellement, en lieu et place d&#8217;un bail d&#8217;habitation classique. C&#8217;est pourquoi il faudrait interdire &#224; un bailleur d&#8217;accorder plusieurs baux mobilit&#233;s dans un m&#234;me secteur g&#233;ographique. Il restera au gouvernement de choisir la zone, apr&#232;s concertation, et elle devra pouvoir &#234;tre modifiable par d&#233;cret, car cela d&#233;pendra &#233;videmment des retours de terrain.</p><p style=\"text-align: justify;\">Une telle mesure permettrait non seulement d&#8217;&#233;viter des abus, mais contribuerait &#224; instaurer un climat de confiance envers le dispositif &#171;&#160;bail mobilit&#233;&#160;&#187;. Inscrite dans la loi, elle permettra d&#8217;&#233;viter les abus manifestes.</p><p style=\"text-align: justify;\"><b>Il s&#8217;agit d&#8217;un amendement de repli par rapport &#224; l&#8217;amendement <span class=\"ins cts-1\"  data-cid=\"3\" data-userid=\"2039\" data-username=\"Olivier Dumont\" data-time=\"1525872417914\">CE1602</span><span class=\"del cts-1\"  data-cid=\"2\" data-userid=\"2039\" data-username=\"Olivier Dumont\" data-time=\"1525872417896\">XXXX</span>. Ici, la mesure d&#8217;interdiction ne vise que le bailleur et le locataire, et n&#8217;est pas &#233;tendue aux membres de son m&#233;nage. Cette disposition, qui nous a sembl&#233; proportionn&#233;e et utile, pouvait sembler &#224; certains trop restrictive au regard des libert&#233;s individuelle<span class=\"ins cts-1\"  data-cid=\"9\" data-userid=\"2039\" data-username=\"Olivier Dumont\" data-time=\"1525872503774\">s</span> ou trop difficile &#224; appliquer.</b></p>"
  },
  "representations": [
    {
      "nom": "PDF",
      "typeMime": {
        "type": "application",
        "subType": "PDF"
      },
      "statutRepresentation": {
        "verbatim": true,
        "canonique": true,
        "officielle": true,
        "transcription": false,
        "enregistrement": false
      },
      "contenu": {
        "documentURI": "/15/amendements/0846/CION-ECO/CE1603.pdf"
      }
    }
  ],
  "sort": {
    "dateSaisie": "2018-05-17T21:47:50.000+02:00",
    "sortEnSeance": "Rejeté"
  },
  "dateDepot": "2018-05-09T02:00:00.000+02:00",
  "dateDistribution": "2018-05-15T02:00:00.000+02:00",
  "article99": "0",
  "loiReference": {}
}