{
  "uid": "AMANR5L15SEA717460BTC0857P0D1N529",
  "identifiant": {
    "legislature": "15",
    "numero": "529",
    "numRect": "0",
    "saisine": {
      "texteLegislatifRef": "PRJLANR5L15BTC0857",
      "numeroPartiePLF": "0",
      "organeExamen": "PO717460",
      "mentionSecondeDeliberation": "0"
    }
  },
  "numeroLong": "529",
  "etapeTexte": "1ère lecture (1ère assemblée saisie)",
  "triAmendement": "i",
  "cardinaliteAmdtMultiples": "1",
  "etat": "Irrecevable",
  "signataires": {
    "auteur": {
      "typeAuteur": "Depute",
      "acteurRef": "PA719024",
      "groupePolitiqueRef": "PO730964"
    },
    "cosignatairesRefs": [
      "PA721860",
      "PA719052",
      "PA721726",
      "PA718682",
      "PA719700",
      "PA719790",
      "PA719326",
      "PA721434",
      "PA267673",
      "PA719024",
      "PA718768"
    ],
    "texteAffichable": "M.&#160;Blanchet,  Mme&#160;Valetta Ardisson, Mme&#160;Mauborgne, M.&#160;Folliot, Mme&#160;Lardet, M.&#160;Kervran, Mme&#160;Gipson, M.&#160;Cesarini, M.&#160;Chalumeau, M.&#160;Trompille et M.&#160;Hupp&#233;"
  },
  "pointeurFragmentTexte": {
    "division": {
      "titre": "Article 37",
      "articleDesignationCourte": "ART. 37",
      "type": "ARTICLE",
      "avantAApres": "A",
      "divisionRattachee": "ARTICLE 37",
      "urlDivisionTexteVise": "/15/textes/0857.asp#D_Article_37"
    }
  },
  "corps": {
    "dispositif": "<p>Compl&#233;ter cet article par les trois alin&#233;as suivants&#160;:</p><p>&#171;&#160;3&#176; Apr&#232;s le 3&#176;, il est ins&#233;r&#233; un 4&#176;, ins&#233;rer un ali&#233;na ainsi r&#233;dig&#233;&#160;:</p><p>&#171;&#160;4&#176; L&#8217;&#233;tranger de seize ans r&#233;volus et de moins de vingt-cinq inscrit dans une proc&#233;dure de demande d&#8217;asile pr&#233;vue au titre I<sup>er</sup> du livre VII du code de l&#8217;entr&#233;e et du s&#233;jour des &#233;trangers et du droit d&#8217;asile, &#224; l&#8217;exception de l&#8217;&#233;tranger demandeur d&#8217;asile, plac&#233; en r&#233;tention en application de l&#8217;article L.&#160;551&#8209;1.</p><p>&#171;&#160;II.&#160;&#8211;&#160;La perte de recettes pour l&#8217;&#201;tat est compens&#233;e &#224; due concurrence par la cr&#233;ation d&#8217;une taxe additionnelle aux droits mentionn&#233;s aux articles 575 et 575 A du code g&#233;n&#233;ral des imp&#244;ts.&#160;&#187;.</p>",
    "exposeSommaire": "<p style=\"text-align: justify;\">Cet amendement vise &#224; offrir aux demandeurs d&#8217;asile l&#8217;opportunit&#233; d&#8217;une int&#233;gration dans un projet collectif au service des valeurs r&#233;publicaines : le service civique. Ils prennent place dans la capacit&#233; des places disponibles. La r&#233;ussite de l&#8217;int&#233;gration passe par le contact, le partage, l&#8217;&#233;change et les rencontres. Ainsi, le pr&#233;sent amendement a vocation &#224; renforcer la mixit&#233; sociale et l&#8217;int&#233;gration &#233;conomique, culturelle et linguistique des demandeurs d&#8217;asile dans la communaut&#233; nationale.</p>"
  },
  "representations": [
    {
      "nom": "PDF",
      "typeMime": {
        "type": "application",
        "subType": "PDF"
      },
      "statutRepresentation": {
        "verbatim": true,
        "canonique": true,
        "officielle": true,
        "transcription": false,
        "enregistrement": false
      },
      "contenu": {
        "documentURI": "/15/amendements/0857/AN/529.pdf"
      }
    }
  ],
  "dateDepot": "2018-04-12T02:00:00.000+02:00",
  "article99": "0",
  "loiReference": {}
}