{
  "uid": "AMANR5L15PO419865B2272P1D1N148",
  "identifiant": {
    "legislature": "15",
    "numero": "148",
    "numRect": "0",
    "saisine": {
      "texteLegislatifRef": "PRJLANR5L15B2272",
      "numeroPartiePLF": "1",
      "organeExamen": "PO419865",
      "mentionSecondeDeliberation": "0"
    }
  },
  "numeroLong": "I-CD148",
  "etapeTexte": "1ère lecture (1ère assemblée saisie)",
  "triAmendement": "miaaaaaaaaaaaaaaaaaaaaaaaaaaaaaaaaaaaaaaaaaaaaaaaapafxnss",
  "cardinaliteAmdtMultiples": "1",
  "etat": "Discuté",
  "signataires": {
    "auteur": {
      "typeAuteur": "Depute",
      "acteurRef": "PA720278",
      "groupePolitiqueRef": "PO759900"
    },
    "cosignatairesRefs": [
      "PA333421",
      "PA720278"
    ],
    "texteAffichable": "M.&#160;Orphelin et M.&#160;Pancher"
  },
  "pointeurFragmentTexte": {
    "division": {
      "titre": "Article 33",
      "articleDesignationCourte": "APRÈS ART. 33",
      "type": "ARTICLE",
      "avantAApres": "Apres",
      "divisionRattachee": "APRÈS L'ARTICLE 33, insérer l'article suivant:",
      "articleAdditionnel": "1",
      "urlDivisionTexteVise": "/15/textes/2272A.asp#D_Article_33"
    }
  },
  "corps": {
    "dispositif": "<p style=\"text-align: justify;\">I.&#160;&#8211;&#160;Le chapitre&#160;II&#160;<i>bis</i> du titre&#160;IV de la premi&#232;re partie du livre premier du code g&#233;n&#233;ral des imp&#244;ts est ainsi modifi&#233;&#160;:</p><p style=\"text-align: justify;\">1&#176;&#160;Au&#160;I de l&#8217;article&#160;976, apr&#232;s le mot&#160;: &#171;&#160;for&#234;ts&#160;&#187;, sont ins&#233;r&#233;s les mots&#160;: &#171;&#160;et de foncier non b&#226;ti&#160;&#187;&#160;;</p><p style=\"text-align: justify;\">2&#176;&#160;Au premier alin&#233;a du I de l&#8217;article&#160;979, apr&#232;s le mot&#160;: &#171;&#160;que&#160;&#187; sont ins&#233;r&#233;s les mots&#160;: &#171;&#160;des revenus fonciers ruraux et&#160;&#187;.</p><p style=\"text-align: justify;\">II. &#8211; La perte de recettes pour l&#8217;&#201;tat r&#233;sultant du&#160;I du pr&#233;sent article est compens&#233;e &#224; due concurrence par la cr&#233;ation d&#8217;une taxe additionnelle aux droits pr&#233;vus aux articles 575 et 575 A du code g&#233;n&#233;ral des imp&#244;ts.</p>",
    "exposeSommaire": "<p style=\"text-align: justify;\">Le pr&#233;sent amendement vise &#224; all&#233;ger le taux d&#8217;IFI sur la taxation du foncier non b&#226;ti. La taxation du foncier non b&#226;ti vient s&#8217;ajouter &#224; une faible rentabilit&#233; de ce dernier. </p><p style=\"text-align: justify;\">Cette situation n&#8217;incite pas &#224; l&#8217;acquisition et &#224; la d&#233;tention de ce type de biens et encourage leur artificialisation pour augmenter leur rentabilit&#233;. Cet amendement a donc pour objectif de lutter contre l&#8217;artificialisation. Enfin, les agriculteurs retrait&#233;s &#233;tant souvent propri&#233;taires de terres agricoles, cette taxation r&#233;duit fortement leur revenu net apr&#232;s imp&#244;ts, alors m&#234;me que leurs retraites sont souvent tr&#232;s faibles. </p><p style=\"text-align: justify;\">Cet amendement est donc un signal positif &#224; leur &#233;gard.</p>"
  },
  "representations": [
    {
      "nom": "PDF",
      "typeMime": {
        "type": "application",
        "subType": "PDF"
      },
      "statutRepresentation": {
        "verbatim": true,
        "canonique": true,
        "officielle": true,
        "transcription": false,
        "enregistrement": false
      },
      "contenu": {
        "documentURI": "/15/amendements/2272A/CION-DVP/CD148.pdf"
      }
    }
  ],
  "sort": {
    "dateSaisie": "2019-10-08T01:44:38.000+02:00",
    "sortEnSeance": "Rejeté"
  },
  "dateDepot": "2019-10-03T02:00:00.000+02:00",
  "dateDistribution": "2019-10-06T02:00:00.000+02:00",
  "article99": "0",
  "loiReference": {
    "codeLoi": "CGI",
    "divisionCodeLoi": "976"
  }
}