{
  "uid": "AMANR5L15PO419610B0627P0D1N36",
  "identifiant": {
    "legislature": "15",
    "numero": "36",
    "numRect": "0",
    "saisine": {
      "texteLegislatifRef": "PRJLANR5L15B0627",
      "numeroPartiePLF": "0",
      "organeExamen": "PO419610",
      "mentionSecondeDeliberation": "0"
    }
  },
  "numeroLong": "CE36",
  "etapeTexte": "1ère lecture (1ère assemblée saisie)",
  "triAmendement": "ajjdi",
  "cardinaliteAmdtMultiples": "1",
  "etat": "Discuté",
  "signataires": {
    "auteur": {
      "typeAuteur": "Depute",
      "acteurRef": "PA266793",
      "groupePolitiqueRef": "PO730934"
    },
    "cosignatairesRefs": [
      "PA267260",
      "PA643134",
      "PA1874",
      "PA720100",
      "PA266793",
      "PA605036",
      "PA340853",
      "PA266797",
      "PA346218",
      "PA719318",
      "PA267204"
    ],
    "texteAffichable": "M.&#160;Bony,  M.&#160;Leclerc, M.&#160;Pradi&#233;, Mme&#160;Valentin, M.&#160;Abad, Mme&#160;Poletti, M.&#160;Masson, M.&#160;Sermier, M.&#160;Le Fur, Mme&#160;Anthoine et M.&#160;Gosselin"
  },
  "pointeurFragmentTexte": {
    "division": {
      "titre": "Article 15",
      "articleDesignationCourte": "APRÈS ART. 15",
      "type": "ARTICLE",
      "avantAApres": "Apres",
      "divisionRattachee": "APRÈS L'ARTICLE 15, insérer l'article suivant:",
      "articleAdditionnel": "1",
      "urlDivisionTexteVise": "/15/textes/0627.asp#D_Article_15"
    }
  },
  "corps": {
    "dispositif": "<p style=\"text-align: justify;\">Apr&#232;s le II de l&#8217;article L.&#160;211&#8209;1 du code de l&#8217;environnement, il est ins&#233;r&#233; un II&#160;<i>bis</i> ainsi r&#233;dig&#233;&#160;:</p><p style=\"text-align: justify;\">&#171;&#160;II&#160;<i>bis</i>.&#160;&#8211;&#160;L&#8217;agriculture doit disposer des moyens n&#233;cessaires pour s&#233;curiser l&#8217;acc&#232;s et la mobilisation de la ressource en eau pour garantir une ad&#233;quation entre la disponibilit&#233; de la ressource et les besoins actuels et futurs en eau pour l&#8217;agriculture dans un contexte d&#8217;adaptation au changement climatique, notamment en mati&#232;re de stockage de l&#8217;eau, et ce conform&#233;ment au 5&#176;&#160;<i>bis</i> du&#160;I du pr&#233;sent article. Les sch&#233;mas directeurs d&#8217;am&#233;nagement et de gestion des eaux et les sch&#233;mas d&#8217;am&#233;nagement et de gestion des eaux, quand ils existent, doivent prioriser les mesures visant &#224; prendre en compte les besoins actuels et futurs en eau de l&#8217;agriculture et sa capacit&#233; d&#8217;adaptation au changement climatique, notamment par la mobilisation de la ressource en eau.&#160;&#187;</p>",
    "exposeSommaire": "<p style=\"text-align: justify;\">L&#8217;agriculture doit relever de nombreux d&#233;fis et ce notamment dans un contexte de changement climatique qui a de forts impacts sur les exploitations agricoles (inondations, gel, s&#233;cheresse...). L&#8217;irrigation et le stockage de l&#8217;eau repr&#233;sentent la premi&#232;re assurance r&#233;colte pour l&#8217;agriculture et r&#233;pond aux enjeux de qualit&#233; pour les fili&#232;res &#224; valeur ajout&#233;e. Elle permet notamment de maintenir un tissu dense d&#8217;exploitations agricoles et de s&#233;curiser la production de fourrages pour les ateliers d&#8217;&#233;levage.</p><p style=\"text-align: justify;\">La France dispose de nombreux atouts&#160;: des ressources abondantes- le total des ressources internes en eau de la France s&#8217;&#233;l&#232;ve &#224; 180&#160;milliards de m&#232;tres cubes par an, sur lesquels, l&#8217;agriculture pr&#233;l&#232;ve 3&#160;milliards de m&#232;tres cubes par an, soit seulement 1,7&#160;% de la ressource, une agriculture diversifi&#233;e, une bonne efficience de l&#8217;utilisation de l&#8217;eau en irrigation, avec une &#233;conomie d&#8217;eau de 30&#160;% en 10&#160;ans, un environnement technique et scientifique tr&#232;s performant.</p><p style=\"text-align: justify;\">Ces ressources doivent pouvoir &#234;tre mobilis&#233;es et le stockage de l&#8217;eau repr&#233;sente une solution durable et pragmatique d&#8217;adaptation au changement climatique. Pourtant, malgr&#233; de nombreux rapports parlementaires alertant sur la n&#233;cessit&#233; de d&#233;velopper le stockage de l&#8217;eau, les freins existent toujours.</p><p style=\"text-align: justify;\">La loi sur l&#8217;eau n&#176;&#160;2006&#8209;1772 du 30&#160;d&#233;cembre 2006 reconna&#238;t la cr&#233;ation de ressources en eau comme un des objectifs de la gestion &#233;quilibr&#233;e de l&#8217;eau en prenant en compte les adaptations n&#233;cessaires au changement climatique. Elle pr&#233;cise que la gestion &#233;quilibr&#233;e doit, entre autres, permettre de r&#233;pondre aux exigences de l&#8217;agriculture (article L.&#160;211&#8209;1 du code de l&#8217;environnement).</p><p style=\"text-align: justify;\">R&#233;cemment, dans le cadre de la loi Montagne, a &#233;t&#233; introduit un nouvel objectif li&#233; &#224; la gestion &#233;quilibr&#233;e de la ressource en eau, &#224; savoir &#171;&#160;la promotion d&#8217;une politique active de stockage de l&#8217;eau pour un usage partag&#233; de l&#8217;eau permettant de garantir l&#8217;irrigation , &#233;l&#233;ment essentiel de la s&#233;curit&#233; de la production agricole et du maintien de l&#8217;&#233;tiage des rivi&#232;res, et de subvenir aux besoins des populations locales&#160;&#187;. (article L.&#160;211&#8209;1&#160;I&#160;5&#176;&#160;bis du code de l&#8217;environnement).</p><p style=\"text-align: justify;\">L&#8217;amendement propos&#233; vise &#224; permettre une d&#233;clinaison concr&#232;te de ce nouvel objectif de gestion &#233;quilibr&#233;e de la ressource en eau, au sein des sch&#233;mas directeurs d&#8217;am&#233;nagement et de gestion des eaux et des sch&#233;mas d&#8217;am&#233;nagement et de gestion des eaux, en ajoutant un alin&#233;a sp&#233;cifique &#224; l&#8217;agriculture.</p>"
  },
  "representations": [
    {
      "nom": "PDF",
      "typeMime": {
        "type": "application",
        "subType": "PDF"
      },
      "statutRepresentation": {
        "verbatim": true,
        "canonique": true,
        "officielle": true,
        "transcription": false,
        "enregistrement": false
      },
      "contenu": {
        "documentURI": "/15/amendements/0627/CION-ECO/CE36.pdf"
      }
    }
  ],
  "sort": {
    "dateSaisie": "2018-04-20T18:01:13.000+02:00",
    "sortEnSeance": "Non soutenu"
  },
  "dateDepot": "2018-04-03T02:00:00.000+02:00",
  "dateDistribution": "2018-04-17T02:00:00.000+02:00",
  "article99": "0",
  "loiReference": {
    "codeLoi": "environnement",
    "divisionCodeLoi": "L211-1"
  }
}