{
  "uid": "AMANR5L15PO419610B0846P0D1N2260",
  "identifiant": {
    "legislature": "15",
    "numero": "2260",
    "numRect": "0",
    "saisine": {
      "texteLegislatifRef": "PRJLANR5L15B0846",
      "numeroPartiePLF": "0",
      "organeExamen": "PO419610",
      "mentionSecondeDeliberation": "0"
    }
  },
  "numeroLong": "CE2260",
  "etapeTexte": "1ère lecture (1ère assemblée saisie)",
  "triAmendement": "ar",
  "cardinaliteAmdtMultiples": "1",
  "etat": "Discuté",
  "signataires": {
    "auteur": {
      "typeAuteur": "Depute",
      "acteurRef": "PA405480",
      "groupePolitiqueRef": "PO730946"
    },
    "cosignatairesRefs": [
      "PA429893",
      "PA333285",
      "PA1809",
      "PA643145",
      "PA609590",
      "PA267233",
      "PA1592",
      "PA720988",
      "PA642764",
      "PA342415",
      "PA332614",
      "PA605069",
      "PA1198",
      "PA608172",
      "PA405480",
      "PA588886",
      "PA340343",
      "PA340357",
      "PA719930",
      "PA333818",
      "PA610681",
      "PA335532",
      "PA608695",
      "PA607553",
      "PA335054",
      "PA609332",
      "PA608011",
      "PA1008",
      "PA337483",
      "PA508"
    ],
    "texteAffichable": "M.&#160;Pupponi,  Mme&#160;Bareigts, Mme&#160;Bi&#233;mouret, M.&#160;Carvounas, Mme&#160;Karamanli, Mme&#160;Untermaier, M.&#160;Hutin, M.&#160;Aviragnet, Mme&#160;Battistel, M.&#160;Bouillon, M.&#160;Jean-Louis&#160;Bricout, M.&#160;Alain&#160;David, Mme&#160;Laurence&#160;Dumont, M.&#160;Faure, M.&#160;Garot, M.&#160;David&#160;Habib, M.&#160;Juanico, M.&#160;J&#233;r&#244;me&#160;Lambert, M.&#160;Le Foll, M.&#160;Letchimy, Mme&#160;Manin, Mme&#160;Pau-Langevin, Mme&#160;Pires Beaune, M.&#160;Potier, M.&#160;Pueyo, Mme&#160;Rabault, M.&#160;Saulignac, Mme&#160;Vainqueur-Christophe, M.&#160;Vallaud et Mme&#160;Victory"
  },
  "pointeurFragmentTexte": {
    "division": {
      "titre": "Article 38",
      "articleDesignationCourte": "APRÈS ART. 38",
      "type": "ARTICLE",
      "avantAApres": "Apres",
      "divisionRattachee": "APRÈS L'ARTICLE 38, insérer l'article suivant:",
      "articleAdditionnel": "1",
      "urlDivisionTexteVise": "/15/textes/0846.asp#D_Article_38"
    }
  },
  "corps": {
    "dispositif": "<p style=\"text-align: justify;\">Le code de la construction et de l&#8217;habitation est ainsi modifi&#233;&#160;:</p><p style=\"text-align: justify;\">1&#176;&#160;&#192; la premi&#232;re phrase du premier alin&#233;a de l&#8217;article L.&#160;313&#8209;26&#8209;2, apr&#232;s le mot&#160;: &#171;&#160;annuelles&#160;&#187;, sont ins&#233;r&#233;s les mots&#160;: &#171;&#160;, dont au plus un quart de celles-ci dans les quartiers prioritaires de la politique de la ville,&#160;&#187;&#160;;</p><p style=\"text-align: justify;\">2&#176; &#192; la premi&#232;re phrase du premier alin&#233;a de l&#8217;article L.&#160;313&#8209;35, apr&#232;s le mot&#160;: &#171;&#160;annuelles&#160;&#187;, sont ins&#233;r&#233;s les mots&#160;: &#171;&#160;, dont au plus un quart de celles-ci dans les quartiers prioritaires de la politique de la ville,&#160;&#187;&#160;&#187;.</p>",
    "exposeSommaire": "<p style=\"text-align: justify;\">La loi &#201;galit&#233; et citoyennet&#233; a pr&#233;vu l&#8217;&#233;largissement des obligations d&#8217;Action logement et de la Fonci&#232;re logement de consacrer 25&#160;% de leurs attributions aux salari&#233;s et aux demandeurs d&#8217;emploi prioritaires.</p><p style=\"text-align: justify;\">Il s&#8217;agit d&#8217;une tr&#232;s bonne disposition mais qui, pour &#234;tre pleinement efficace dans une logique de mixit&#233; sociale, n&#233;cessite une adaptation dans les QPV. Il est donc propos&#233;, au sein de cette obligation de 25&#160;% d&#8217;attributions, que pas plus d&#8217;un quart de celles-ci ne puissent &#234;tre r&#233;alis&#233;es en QPV par Action logement et la fonci&#232;re logement.</p>"
  },
  "representations": [
    {
      "nom": "PDF",
      "typeMime": {
        "type": "application",
        "subType": "PDF"
      },
      "statutRepresentation": {
        "verbatim": true,
        "canonique": true,
        "officielle": true,
        "transcription": false,
        "enregistrement": false
      },
      "contenu": {
        "documentURI": "/15/amendements/0846/CION-ECO/CE2260.pdf"
      }
    }
  ],
  "sort": {
    "dateSaisie": "2018-05-18T01:00:43.000+02:00",
    "sortEnSeance": "Rejeté"
  },
  "dateDepot": "2018-05-09T02:00:00.000+02:00",
  "dateDistribution": "2018-05-15T02:00:00.000+02:00",
  "article99": "0",
  "loiReference": {
    "codeLoi": "construction et habitation",
    "divisionCodeLoi": "L313-26-2"
  }
}