{
  "uid": "AMANR5L15PO419865B1831P0D1N2735",
  "identifiant": {
    "legislature": "15",
    "numero": "2735",
    "numRect": "0",
    "saisine": {
      "texteLegislatifRef": "PRJLANR5L15B1831",
      "numeroPartiePLF": "0",
      "organeExamen": "PO419865",
      "mentionSecondeDeliberation": "0"
    }
  },
  "numeroLong": "CD2735",
  "etapeTexte": "1ère lecture (2ème assemblée saisie)",
  "triAmendement": "aeoaaaaaaaaaaaaaaaaaaaaaaaaaaaaaaaaaaaaaaaaaaaaaaahztzzzwc",
  "cardinaliteAmdtMultiples": "1",
  "etat": "Discuté",
  "signataires": {
    "auteur": {
      "typeAuteur": "Depute",
      "acteurRef": "PA719130",
      "groupePolitiqueRef": "PO730964"
    },
    "cosignatairesRefs": [
      "PA719472",
      "PA719404",
      "PA722228",
      "PA709315",
      "PA719130",
      "PA942",
      "PA719480",
      "PA718990"
    ],
    "texteAffichable": "Mme&#160;Michel,  Mme&#160;Blanc, M.&#160;Cazeneuve, M.&#160;Leclabart, M.&#160;Le Gac, M.&#160;Gaillard, M.&#160;Viala et M.&#160;Charles&#160;de Courson"
  },
  "pointeurFragmentTexte": {
    "division": {
      "titre": "Article PREMIER",
      "articleDesignationCourte": "ART. PREMIER",
      "type": "ARTICLE",
      "avantAApres": "A",
      "divisionRattachee": "ARTICLE PREMIER",
      "urlDivisionTexteVise": "/15/textes/1831.asp#D_Article_1er"
    },
    "alinea": {
      "avantAApres": "Apres",
      "numero": "48"
    }
  },
  "corps": {
    "dispositif": "<p style=\"text-align: justify;\">Apr&#232;s l&#8217;alin&#233;a&#160;48, ins&#233;rer l&#8217;alin&#233;a suivant&#160;:</p><p style=\"text-align: justify;\">&#171;&#160;Cette d&#233;l&#233;gation peut, notamment, intervenir &#224; la demande d&#8217;une ou plusieurs autorit&#233;s organisatrices de la mobilit&#233; constatant, notamment, qu&#8217;un besoin de mobilit&#233; d&#233;passant leurs ressorts territoriaux respectifs n&#8217;est pas satisfait.&#160;&#187;</p>",
    "exposeSommaire": "<p style=\"text-align: justify;\">Cet amendement est issu des travaux du groupe de travail de la D&#233;l&#233;gation aux collectivit&#233;s territoriales et &#224; la d&#233;centralisation sur le projet de loi.</p><p style=\"text-align: justify;\">Cette disposition du projet de loi a &#233;t&#233; supprim&#233;e &#224; l&#8217;initiative de la commission des lois au motif qu&#8217;elle affaiblissait le principe g&#233;n&#233;ral de d&#233;l&#233;gation de comp&#233;tences. Elle apparait pourtant n&#233;cessaire pour s&#233;curiser les d&#233;l&#233;gations allant au-del&#224; des limites administratives d&#8217;un EPCI.</p><p style=\"text-align: justify;\">Cette obligation offre aussi des garanties aux R&#233;gions de ne pas d&#233;stabiliser l&#8217;organisation des r&#233;seaux de transports scolaires dans les territoires. La cartographie des autorit&#233;s organisatrices du transport scolaire de premier rang et de deuxi&#232;me rang (par d&#233;l&#233;gation de la r&#233;gion) b&#233;n&#233;ficiera d&#8217;une meilleure lisibilit&#233; &#224; l&#8217;&#233;chelle des futurs bassins de mobilit&#233;.</p>"
  },
  "representations": [
    {
      "nom": "PDF",
      "typeMime": {
        "type": "application",
        "subType": "PDF"
      },
      "statutRepresentation": {
        "verbatim": true,
        "canonique": true,
        "officielle": true,
        "transcription": false,
        "enregistrement": false
      },
      "contenu": {
        "documentURI": "/15/amendements/1831/CION-DVP/CD2735.pdf"
      }
    }
  ],
  "sort": {
    "dateSaisie": "2019-05-15T00:50:28.000+02:00",
    "sortEnSeance": "Retiré"
  },
  "dateDepot": "2019-05-09T02:00:00.000+02:00",
  "dateDistribution": "2019-05-14T02:00:00.000+02:00",
  "article99": "0",
  "loiReference": {}
}