{
  "uid": "AMANR5L15SEA717460BTC1548P0D1N522",
  "identifiant": {
    "legislature": "15",
    "numero": "522",
    "numRect": "0",
    "saisine": {
      "texteLegislatifRef": "PRJLANR5L15BTC1548",
      "numeroPartiePLF": "0",
      "organeExamen": "PO717460",
      "mentionSecondeDeliberation": "0"
    }
  },
  "numeroLong": "522",
  "etapeTexte": "Nouvelle Lecture",
  "triAmendement": "agaaaaaaaaaaaaaaaaaaaaaaaaaaaaaaaaaaaaaaaaaaaaaaaaibzs",
  "cardinaliteAmdtMultiples": "1",
  "etat": "Retiré",
  "signataires": {
    "auteur": {
      "typeAuteur": "Depute",
      "acteurRef": "PA334149",
      "groupePolitiqueRef": "PO730934"
    },
    "cosignatairesRefs": [
      "PA334149"
    ],
    "texteAffichable": "M.&#160;Fasquelle"
  },
  "pointeurFragmentTexte": {
    "division": {
      "titre": "Article 6",
      "articleDesignationCourte": "ART. 6",
      "type": "ARTICLE",
      "avantAApres": "A",
      "divisionRattachee": "ARTICLE 6",
      "urlDivisionTexteVise": "/15/textes/1548.asp#D_Article_6"
    }
  },
  "corps": {
    "dispositif": "<p style=\"text-align: justify;\">Supprimer cet article.</p>",
    "exposeSommaire": "<p style=\"text-align: justify;\">Cet amendement propose de supprimer cet article qui vise, &#224; titre exp&#233;rimental et pour une dur&#233;e de trois ans &#224; compter de l&#8217;entr&#233;e en vigueur du d&#233;cret en Conseil d&#8217;&#201;tat pr&#233;vu pour sa mise en &#339;uvre, &#224; confier aux organismes d&#233;biteurs des prestations familiales la d&#233;livrance de titres ex&#233;cutoires portant exclusivement sur la modification du montant d&#8217;une contribution &#224; l&#8217;entretien et &#224; l&#8217;&#233;ducation des enfants.</p><p style=\"text-align: justify;\">Cet article comporte en effet un certain nombre de risques.</p><p style=\"text-align: justify;\">Tout d&#8217;abord, les organismes d&#233;biteurs des prestations familiales, &#224; savoir les CAF, sont des personnes de droit priv&#233; qui n&#8217;offrent aucune garantie en termes d&#8217;ind&#233;pendance et de respect des droits des parties. Or, le droit&#160;europ&#233;en pr&#233;cise que seule une autorit&#233; ind&#233;pendante peut r&#233;gler des questions relatives aux obligations alimentaires en mati&#232;re familiale. Le juge, ind&#233;pendant et garant de l&#8217;int&#233;r&#234;t sup&#233;rieur de l&#8217;enfant, doit ainsi &#234;tre seule habilit&#233; &#224; fixer le montant de la pension alimentaire.</p><p style=\"text-align: justify;\">Par ailleurs, l&#8217;ind&#233;pendance de la justice judiciaire est exig&#233;e par le premier alin&#233;a de l&#8217;article&#160;64 de la Constitution du 4 octobre 1958 et l&#8217;ind&#233;pendance de la justice administrative par le principe fondamental reconnu par les lois de la R&#233;publique au sein de la loi du 24 mai 187 relative au Conseil d&#8217;&#201;tat. Le Conseil constitutionnel consid&#232;re, au-del&#224;, que les principes d&#8217;ind&#233;pendance et d&#8217;impartialit&#233; qui r&#233;sultent de l&#8217;article&#160;16 de la D&#233;claration de 1789 sont applicables &#224; toutes les juridictions, ce qui comprend les autorit&#233;s administratives ou les organismes priv&#233;s charg&#233;s d&#8217;une mission de service public. Or, lorsque la CAF est amen&#233;e &#224; statuer sur une demande de r&#233;vision de pension alimentaire, elle exerce un pouvoir juridictionnel.</p><p style=\"text-align: justify;\">De plus, la bar&#233;misation des pensions alimentaires pr&#233;vue par le texte risque de conduire &#224; une automatisation de la proc&#233;dure sans prise en compte de la diversit&#233; et de la complexit&#233; des situations personnelles. En pr&#233;sence de revenus complexes (dirigeants de soci&#233;t&#233;, revenus de patrimoine) et de situations disparates (cr&#233;dits, mise &#224; disposition gratuite du logement) la fixation de ce montant peut s&#8217;av&#233;rer compliqu&#233;e et les bar&#232;mes inadapt&#233;s. Surtout, une r&#233;vision du montant de la pension alimentaire n&#8217;est rarement qu&#8217;une question d&#8217;argent et r&#233;sulte souvent d&#8217;un changement de vie pour l&#8217;une ou l&#8217;autre des parties. En supprimant le recours au juge, on prive ainsi les parents d&#8217;un espace de discussion pourtant indispensable.<br />Pour finir, il existe un r&#233;el risque de non-respect du principe de neutralit&#233;. Les CAF ont en effet le pouvoir de distribuer des prestations sociales mais aussi celui de sanctionner les b&#233;n&#233;ficiaires ou encore, dans le cas des pensions alimentaires, de se substituer au d&#233;biteur en cas de non-paiement. Le directeur de la CAF, disposant de l&#8217;ensemble de ces informations sensibles, seraient ainsi &#224; tout &#224; la fois juge et partie, ordonnateur et payeur dans certaines situations.</p><p style=\"text-align: justify;\">Les garanties d&#8217;ind&#233;pendance et d&#8217;impartialit&#233; ne sont donc pas respect&#233;es.</p><p style=\"text-align: justify;\">En accordant, sous couvert d&#8217;une volont&#233; de d&#233;judiciarisation, la possibilit&#233; aux directeurs des Caisses d&#8217;allocations familiales (CAF) de r&#233;viser une pension alimentaire, l&#8217;article&#160;6 du projet de loi autorise qu&#8217;une d&#233;cision de justice soit modifi&#233;e par un organisme de droit priv&#233; sur la base d&#8217;un bar&#232;me et sans garantie d&#8217;assistance du justiciable.</p><p style=\"text-align: justify;\">De plus, cette disposition est contraire aux dispositions du R&#232;glement&#160;Europ&#233;en 4/2009 et au principe d&#8217;impartialit&#233; du juge, le directeur de CAF &#233;tant plac&#233;, de fait, dans la position d&#8217;&#234;tre juge et parti.</p><p style=\"text-align: justify;\">Il convient donc de supprimer l&#8217;article&#160;6.</p>"
  },
  "representations": [
    {
      "nom": "PDF",
      "typeMime": {
        "type": "application",
        "subType": "PDF"
      },
      "statutRepresentation": {
        "verbatim": true,
        "canonique": true,
        "officielle": true,
        "transcription": false,
        "enregistrement": false
      },
      "contenu": {
        "documentURI": "/15/amendements/1548/AN/522.pdf"
      }
    }
  ],
  "dateDepot": "2019-01-10T01:00:00.000+01:00",
  "dateDistribution": "2019-01-15T01:00:00.000+01:00",
  "article99": "0",
  "loiReference": {}
}