{
  "uid": "AMANR5L15SEA717460B2296P0D1N1209",
  "identifiant": {
    "legislature": "15",
    "numero": "1209",
    "numRect": "0",
    "saisine": {
      "texteLegislatifRef": "PRJLANR5L15B2296",
      "numeroPartiePLF": "0",
      "organeExamen": "PO717460",
      "mentionSecondeDeliberation": "0"
    }
  },
  "numeroLong": "1209",
  "etapeTexte": "1ère lecture (1ère assemblée saisie)",
  "triAmendement": "auaaaaaaaaaaaaaaaaaaaaaaaaaaaaaaaaaaaaaaaaaaaaaaaaacknzzi",
  "cardinaliteAmdtMultiples": "1",
  "etat": "Discuté",
  "signataires": {
    "auteur": {
      "typeAuteur": "Depute",
      "acteurRef": "PA719608",
      "groupePolitiqueRef": "PO723569"
    },
    "cosignatairesRefs": [
      "PA719608"
    ],
    "texteAffichable": "Mme&#160;M&#233;nard"
  },
  "pointeurFragmentTexte": {
    "division": {
      "titre": "Article 8",
      "articleDesignationCourte": "APRÈS ART. 8",
      "type": "ARTICLE",
      "avantAApres": "Apres",
      "divisionRattachee": "APRÈS L'ARTICLE 8, insérer l'article suivant:",
      "articleAdditionnel": "1",
      "urlDivisionTexteVise": "/15/textes/2296.asp#D_Article_8"
    }
  },
  "corps": {
    "dispositif": "<p style=\"text-align: justify;\">I.&#160;&#8211;&#160;Le livre VII du code rural et de la p&#234;che maritime est ainsi modifi&#233;&#160;:</p><p style=\"text-align: justify;\">1&#176;&#160;L&#8217;article L.&#160;741&#8209;16&#8209;1 est r&#233;tabli dans la r&#233;daction suivante&#160;:</p><p style=\"text-align: justify;\">&#171;&#160;<i>Art.&#160;741&#8209;16&#8209;1.</i> &#8211; I.&#160;&#8211;&#160;Les caisses de mutualit&#233; sociale agricole se substituent, selon les modalit&#233;s d&#233;finies au II, aux employeurs de travailleurs d&#233;finis aux I et II de l&#8217;article L.&#160;741&#8209;16 pour le paiement de la part patronale des cotisations suivantes, dues pour l&#8217;emploi de ces m&#234;mes salari&#233;s&#160;:</p><p style=\"text-align: justify;\">&#171;&#160;1&#176;&#160;La participation des employeurs au d&#233;veloppement de la formation professionnelle continue, pr&#233;vue &#224; l&#8217;article L.&#160;6331&#8209;1 du code du travail&#160;;</p><p style=\"text-align: justify;\">&#171;&#160;2&#176;&#160;La cotisation de la retraite compl&#233;mentaire obligatoire des salari&#233;s vers&#233;e aux institutions de retraite compl&#233;mentaire mentionn&#233;es &#224; l&#8217;article L.&#160;727&#8209;2 du pr&#233;sent code&#160;;</p><p style=\"text-align: justify;\">&#171;&#160;3&#176;&#160;La cotisation vers&#233;e &#224; l&#8217;Association pour la gestion du fonds de financement, rendue obligatoire, en application des articles L.&#160;911&#8209;3 et L.&#160;911&#8209;4 du code de la s&#233;curit&#233; sociale, par l&#8217;arr&#234;t&#233; du 23 d&#233;cembre 2009 portant extension et &#233;largissement de l&#8217;accord relatif &#224; la prorogation de l&#8217;accord du 13 novembre 2003 conclu le 23 mars 2009 par les organisations signataires de la convention collective du 14 mars 1947 et de l&#8217;accord interprofessionnel de retraite compl&#233;mentaire du 8 d&#233;cembre 1961&#160;;</p><p style=\"text-align: justify;\">&#171;&#160;4&#176;&#160;La cotisation vers&#233;e &#224; l&#8217;Association nationale pour l&#8217;emploi et la formation en agriculture, rendue obligatoire, en application de l&#8217;article L.&#160;2261&#8209;15 du code du travail, par l&#8217;arr&#234;t&#233; du 15 septembre 2006 portant extension d&#8217;un avenant &#224; l&#8217;accord collectif national de travail sur l&#8217;emploi dans les exploitations et entreprises agricoles&#160;;</p><p style=\"text-align: justify;\">&#171;&#160;5&#176;&#160;La cotisation vers&#233;e au conseil des &#233;tudes, recherches et prospectives pour la gestion pr&#233;visionnelle des emplois en agriculture et son d&#233;veloppement, d&#233;nomm&#233; PROVEA, rendue obligatoire, en application de l&#8217;article L.&#160;2261&#8209;15 du code du travail, par l&#8217;arr&#234;t&#233; du 28 octobre 2002 portant extension d&#8217;un accord collectif national de travail sur les saisonniers, sur diverses dispositions sur les contrats &#224; dur&#233;e d&#233;termin&#233;e et sur l&#8217;organisation de la gestion pr&#233;visionnelle de l&#8217;emploi en agriculture&#160;;</p><p style=\"text-align: justify;\">&#171;&#160;6&#176;&#160;La cotisation vers&#233;e &#224; l&#8217;Association pour le financement de la n&#233;gociation collective en agriculture, rendue obligatoire, en application de l&#8217;article L.&#160;2261&#8209;15 du code du travail, par l&#8217;arr&#234;t&#233; du 26 mars 1992 portant extension d&#8217;un accord national relatif &#224; l&#8217;organisation de la n&#233;gociation collective en agriculture&#160;;</p><p style=\"text-align: justify;\">&#171;&#160;7&#176;&#160;La cotisation due au titre du fonctionnement du service de sant&#233; et de s&#233;curit&#233; au travail pr&#233;vue &#224; l&#8217;article L.&#160;717&#8209;2&#8209;1&#160;;</p><p style=\"text-align: justify;\">&#171;&#160;8&#176;&#160;Les cotisations &#224; la charge de l&#8217;employeur dues au titre de l&#8217;assurance ch&#244;mage pr&#233;vues &#224; l&#8217;article L.&#160;5422&#8209;9 du code du travail&#160;;</p><p style=\"text-align: justify;\">&#171;&#160;9&#176;&#160;Les contributions mentionn&#233;es &#224; l&#8217;article L.&#160;834&#8209;1 du code de la s&#233;curit&#233; sociale&#160;;</p><p style=\"text-align: justify;\">&#171;&#160;10&#176;&#160;La contribution mentionn&#233;e au 1&#176;&#160;de l&#8217;article L.&#160;14&#8209;10&#8209;4 du code de l&#8217;action sociale et des familles&#160;;</p><p style=\"text-align: justify;\">&#171;&#160;11&#176;&#160;La part minimum de l&#8217;employeur pr&#233;vue au III de l&#8217;article L.&#160;911&#8209;7 ou au IV de l&#8217;article L.&#160;911&#8209;7&#8209;1 du code de la s&#233;curit&#233; sociale&#160;;</p><p style=\"text-align: justify;\">&#171;&#160;12&#176;&#160;La cotisation pr&#233;vue par l&#8217;article L.&#160;3253&#8209;18 du code du travail.</p><p style=\"text-align: justify;\">&#171;&#160;II.-Cette prise en charge est calcul&#233;e selon les modalit&#233;s et le bar&#232;me d&#233;gressif pr&#233;vus &#224; l&#8217;article L.&#160;741&#8209;16.</p><p style=\"text-align: justify;\">&#171;&#160;Cette prise en charge donne lieu &#224; compensation int&#233;grale par l&#8217;&#201;tat. Elle est cumulable avec le b&#233;n&#233;fice des exon&#233;rations totales ou partielles de cotisations patronales pr&#233;vues aux articles L.&#160;741&#8209;5 et L.&#160;741&#8209;16 du pr&#233;sent code ainsi qu&#8217;avec la d&#233;duction forfaitaire pr&#233;vue &#224; l&#8217;article L.&#160;241&#8209;18 du code de la s&#233;curit&#233; sociale.</p><p style=\"text-align: justify;\">&#171;&#160;III.-Les conditions d&#8217;application du pr&#233;sent article sont fix&#233;es par d&#233;cret.&#160;&#187;</p><p style=\"text-align: justify;\">2&#176;&#160;L&#8217;article L.&#160;751&#8209;18 est r&#233;tabli dans la r&#233;daction suivante&#160;:</p><p style=\"text-align: justify;\">&#171;&#160;<i>Art.&#160;L.&#160;751&#8209;18</i>.&#160;&#8211;&#160;L&#8217;article L.&#160;741&#8209;16 s&#8217;applique aux cotisations dues au titre des accidents du travail et des maladies professionnelles, sans pouvoir exc&#233;der un taux fix&#233; par arr&#234;t&#233; minist&#233;riel, dans la limite du taux applicable &#224; une entreprise o&#249; aucun accident du travail ou aucune maladie professionnelle n&#8217;est jamais survenu.&#160;&#187;</p><p style=\"text-align: justify;\">II.&#160;&#8211;&#160;La perte de recettes pour les organismes de s&#233;curit&#233; sociale est compens&#233;e &#224; due concurrence par la cr&#233;ation d&#8217;une taxe additionnelle aux droits pr&#233;vus aux articles 575 et 575 A du code g&#233;n&#233;ral des imp&#244;ts.</p>",
    "exposeSommaire": "<p>Cet amendement propose de r&#233;tablir l&#8217;exon&#233;ration de charges patronales pour les employeurs agricoles qui emploient des Travailleurs Occasionnels Demandeurs d&#8217;Emploi (TODE).</p><p style=\"text-align: justify;\">Cet all&#232;gement de charges patronales sp&#233;cifique aux salari&#233;s saisonniers agricoles a &#233;t&#233; cr&#233;&#233; pour faire face au dumping social des concurrents&#160;europ&#233;ens, notamment l&#8217;Espagne, l&#8217;Italie ou l&#8217;Allemagne dans les fili&#232;res de la viticulture, de l&#8217;arboriculture, du mara&#238;chage, de l&#8217;horticulture, des p&#233;pini&#232;res viticoles, des semences, de la polyculture et de l&#8217;ostr&#233;iculture. Chaque ann&#233;e, plus de 900&#160;000 contrats sont &#233;ligibles au TODE.</p><p style=\"text-align: justify;\">Ce dispositif pr&#233;voyait un taux d&#8217;exon&#233;ration de charges patronales de 33&#160;% pour les salaires compris entre 1 et 1,25 SMIC, auxquels venait s&#8217;ajouter le Cr&#233;dit imp&#244;t pour la Comp&#233;titivit&#233; et l&#8217;Emploi (CICE) de 6&#160;%, supprimant ainsi la quasi-totalit&#233; des cotisations patronales.</p><p style=\"text-align: justify;\">Supprim&#233;s par l&#8217;article&#160;8 du projet de loi de financement de la s&#233;curit&#233; sociale pour 2019, les deux dispositifs ne sont pas int&#233;gralement compens&#233;s par le nouvel all&#233;gement de charges g&#233;n&#233;rales pr&#233;vu par le Gouvernement, car le taux d&#8217;exon&#233;ration est moins &#233;lev&#233; et la d&#233;gressivit&#233; moins avantageuse.</p><p style=\"text-align: justify;\">Cette perte s&#232;che fait peser d&#8217;importantes menaces &#233;conomiques sur les secteurs agricoles les plus pourvoyeurs de main d&#8217;&#339;uvre et met en danger la p&#233;rennit&#233; des emplois et des productions dans les territoires ruraux, d&#233;j&#224; fragilis&#233;s par la vive concurrence&#160;europ&#233;enne en mati&#232;re de co&#251;t du travail.</p><p style=\"text-align: justify;\">Depuis une dizaine d&#8217;ann&#233;es, les productions de fruits et l&#233;gumes baissent en France face &#224; l&#8217;agressivit&#233; en termes de prix de nos concurrents&#160;europ&#233;ens.</p><p style=\"text-align: justify;\">Le pr&#233;sent amendement vise donc &#224; r&#233;tablir le dispositif TODE et &#224; int&#233;grer les 6&#160;% d&#8217;all&#232;gements suppl&#233;mentaires pr&#233;vus par le CICE.</p><p style=\"text-align: justify;\">La France doit maintenir la comp&#233;titivit&#233; de son agriculture et ne peut pas accepter la lente d&#233;localisation des productions pour des raisons de co&#251;t de la main d&#8217;&#339;uvre.</p>"
  },
  "representations": [
    {
      "nom": "PDF",
      "typeMime": {
        "type": "application",
        "subType": "PDF"
      },
      "statutRepresentation": {
        "verbatim": true,
        "canonique": true,
        "officielle": true,
        "transcription": false,
        "enregistrement": false
      },
      "contenu": {
        "documentURI": "/15/amendements/2296/AN/1209.pdf"
      }
    }
  ],
  "seanceDiscussion": "RUANR5L15S2020IDS21875",
  "sort": {
    "dateSaisie": "2019-10-23T18:41:20.000+02:00",
    "sortEnSeance": "Non soutenu"
  },
  "dateDepot": "2019-10-18T02:00:00.000+02:00",
  "dateDistribution": "2019-10-23T02:00:00.000+02:00",
  "article99": "0",
  "loiReference": {
    "codeLoi": "c rural et pêche maritime",
    "divisionCodeLoi": "L741-16-1"
  }
}