{
  "uid": "AMANR5L15PO419604B1813P0D1N101",
  "identifiant": {
    "legislature": "15",
    "numero": "101",
    "numRect": "0",
    "saisine": {
      "texteLegislatifRef": "PIONANR5L15B1813",
      "numeroPartiePLF": "0",
      "organeExamen": "PO419604",
      "mentionSecondeDeliberation": "0"
    }
  },
  "numeroLong": "AC101",
  "etapeTexte": "1ère lecture (1ère assemblée saisie)",
  "triAmendement": "aoaaaaaaaaaaaaaaaaaaaaaaaaaaaaaaaaaaaaaaaaaaaaaaaagns",
  "cardinaliteAmdtMultiples": "1",
  "etat": "Irrecevable",
  "signataires": {
    "auteur": {
      "typeAuteur": "Depute",
      "acteurRef": "PA718868",
      "groupePolitiqueRef": "PO730958"
    },
    "cosignatairesRefs": [
      "PA722142",
      "PA721226",
      "PA721210",
      "PA720892",
      "PA721960",
      "PA719578",
      "PA720846",
      "PA720422",
      "PA719676",
      "PA588884",
      "PA721062",
      "PA2150",
      "PA720430",
      "PA720286",
      "PA718860",
      "PA718868",
      "PA721202"
    ],
    "texteAffichable": "M.&#160;Larive,  Mme&#160;Autain, M.&#160;Bernalicis, M.&#160;Coquerel, M.&#160;Corbi&#232;re, Mme&#160;Fiat, M.&#160;Lachaud, M.&#160;M&#233;lenchon, Mme&#160;Obono, Mme&#160;Panot, M.&#160;Prud&apos;homme, M.&#160;Quatennens, M.&#160;Ratenon, Mme&#160;Ressiguier, Mme&#160;Rubin, M.&#160;Ruffin et Mme&#160;Taurine"
  },
  "pointeurFragmentTexte": {
    "division": {
      "titre": "Article PREMIER",
      "articleDesignationCourte": "ART. PREMIER",
      "type": "ARTICLE",
      "avantAApres": "A",
      "divisionRattachee": "ARTICLE PREMIER",
      "urlDivisionTexteVise": "/15/textes/1813.asp#D_Article_1er"
    },
    "alinea": {
      "avantAApres": "Apres",
      "numero": "9"
    }
  },
  "corps": {},
  "representations": [
    {
      "nom": "PDF",
      "typeMime": {
        "type": "application",
        "subType": "PDF"
      },
      "statutRepresentation": {
        "verbatim": true,
        "canonique": true,
        "officielle": true,
        "transcription": false,
        "enregistrement": false
      },
      "contenu": {
        "documentURI": "/15/amendements/1813/CION-CEDU/AC101.pdf"
      }
    }
  ],
  "dateDepot": "2019-04-25T02:00:00.000+02:00",
  "dateDistribution": "2019-04-26T02:00:00.000+02:00",
  "article99": "0",
  "loiReference": {}
}