{
  "uid": "AMANR5L15PO420120B1297P0D1N433",
  "identifiant": {
    "legislature": "15",
    "numero": "433",
    "numRect": "0",
    "saisine": {
      "texteLegislatifRef": "PRJLANR5L15B1297",
      "numeroPartiePLF": "0",
      "organeExamen": "PO420120",
      "mentionSecondeDeliberation": "0"
    }
  },
  "numeroLong": "AS433",
  "etapeTexte": "1ère lecture (1ère assemblée saisie)",
  "triAmendement": "auaaaaaaaaaaaaaaaaaaaaaaaaaaaaaaaaaaaaaaaaaaaaaaaat",
  "cardinaliteAmdtMultiples": "1",
  "etat": "Irrecevable",
  "signataires": {
    "auteur": {
      "typeAuteur": "Depute",
      "acteurRef": "PA721062",
      "groupePolitiqueRef": "PO730958"
    },
    "cosignatairesRefs": [
      "PA2150",
      "PA718860",
      "PA719676",
      "PA719578",
      "PA720286",
      "PA720846",
      "PA720422",
      "PA718868",
      "PA720430",
      "PA722142",
      "PA721062",
      "PA721226",
      "PA588884",
      "PA721202",
      "PA720892",
      "PA721210",
      "PA721960"
    ],
    "texteAffichable": "M.&#160;Ratenon,  Mme&#160;Autain, M.&#160;Bernalicis, M.&#160;Coquerel, M.&#160;Corbi&#232;re, Mme&#160;Fiat, M.&#160;Lachaud, M.&#160;Larive, M.&#160;M&#233;lenchon, Mme&#160;Obono, Mme&#160;Panot, M.&#160;Prud&apos;homme, M.&#160;Quatennens, Mme&#160;Ressiguier, Mme&#160;Rubin, M.&#160;Ruffin et Mme&#160;Taurine"
  },
  "pointeurFragmentTexte": {
    "division": {
      "titre": "Article 7",
      "articleDesignationCourte": "APRÈS ART. 7",
      "type": "ARTICLE",
      "avantAApres": "Apres",
      "divisionRattachee": "APRÈS L'ARTICLE 7, insérer l'article suivant:",
      "articleAdditionnel": "1",
      "urlDivisionTexteVise": "/15/textes/1297.asp#D_Article_7"
    }
  },
  "corps": {
    "dispositif": "<p style=\"text-align: justify;\">Le Gouvernement remet au Parlement, dans les six mois &#224; compter de la promulgation de la pr&#233;sente loi, un rapport sur les effets sanitaires du recours aux heures suppl&#233;mentaires.</p>",
    "exposeSommaire": "<p style=\"text-align: justify;\"><br />Le recours aux heures suppl&#233;mentaires incite les employeurs &#224; faire travailler plus longtemps leurs salari&#233;s plut&#244;t qu&#8217;&#224; embaucher. Il a un effet n&#233;gatif en mati&#232;re de cr&#233;ation d&#8217;emplois.<br />Le bilan de l&#8217;exon&#233;ration des heures suppl&#233;mentaires au cours du quinquennat Sarkozy est tr&#232;s mauvais. Selon l&#8217;OFCE, cette mesure a entra&#238;n&#233; la destruction de 30 000 emplois en 5 ans, et avait co&#251;t&#233; pr&#232;s de 3 milliards d&#8217;euros, raisons pour lesquelles cette exon&#233;ration avait &#233;t&#233; supprim&#233;e en 2012.<br />Surtout, le recours aux heures suppl&#233;mentaires favorise l&#8217;allongement de la dur&#233;e de travail alors m&#234;me que plusieurs &#233;tudes m&#233;dicales pointent les effets d&#8217;une journ&#233;e de travail &#224; rallonge sur la sant&#233; des salari&#233;s.<br />Une &#233;tude parue dans la revue m&#233;dicale The Lancet en 2015 et men&#233;e par des chercheurs de l&#8217;universit&#233; Umea en Su&#232;de a montr&#233; que ces journ&#233;es augmentent le risque d&#8217;accident vasculaire c&#233;r&#233;brale (AVC) ou de maladie coronarienne. Une &#233;tude am&#233;ricaine publi&#233;e en 2016 dans le Journal of Occupational and Environmental Medicine a d&#8217;ailleurs montr&#233; que les femmes &#233;taient particuli&#232;rement touch&#233;es&#160;: le risque d&#8217;AVC est tr&#232;s important au-del&#224; de 40 heures de travail hebdomadaires.<br />Les gains marginaux en terme de pouvoir d&#8217;achat ne sauraient faire oublier ces dangers. Les auteurs de cet amendement demandent donc au gouvernement de remettre au Parlement un rapport complet sur les effets sanitaires de l&#8217;incitation au recours aux heures suppl&#233;mentaires.<br />Ils rappellent qu&#8217;ils pensent d&#8217;ailleurs que le partage du temps de travail est b&#233;n&#233;fique en plusieurs points. Qu&#8217;il assure notamment un meilleur respect de la sant&#233; des travailleurs et permet un meilleur acc&#232;s du plus grand nombre &#224; l&#8217;emploi.</p>"
  },
  "representations": [
    {
      "nom": "PDF",
      "typeMime": {
        "type": "application",
        "subType": "PDF"
      },
      "statutRepresentation": {
        "verbatim": true,
        "canonique": true,
        "officielle": true,
        "transcription": false,
        "enregistrement": false
      },
      "contenu": {
        "documentURI": "/15/amendements/1297/CION-SOC/AS433.pdf"
      }
    }
  ],
  "dateDepot": "2018-10-12T02:00:00.000+02:00",
  "article99": "0",
  "loiReference": {
    "codeLoi": "zzz"
  }
}