{
  "uid": "AMANR5L15SEA717460BTC1924P0D1N1120",
  "identifiant": {
    "legislature": "15",
    "numero": "1120",
    "numRect": "0",
    "saisine": {
      "texteLegislatifRef": "PRJLANR5L15BTC1924",
      "numeroPartiePLF": "0",
      "organeExamen": "PO717460",
      "mentionSecondeDeliberation": "0"
    }
  },
  "numeroLong": "1120",
  "etapeTexte": "1ère lecture (1ère assemblée saisie)",
  "triAmendement": "buaaaaaaaaaaaaaaaaaaaaaaaaaaaaaaaaaaaaaaaaaaaaaaaaq",
  "cardinaliteAmdtMultiples": "1",
  "etat": "Discuté",
  "signataires": {
    "auteur": {
      "typeAuteur": "Depute",
      "acteurRef": "PA719850",
      "groupePolitiqueRef": "PO730964"
    },
    "cosignatairesRefs": [
      "PA720814",
      "PA720862",
      "PA720500",
      "PA721398",
      "PA721434",
      "PA719186",
      "PA718802",
      "PA720538",
      "PA720170",
      "PA720622",
      "PA606639",
      "PA722078",
      "PA721916",
      "PA719850",
      "PA722170"
    ],
    "texteAffichable": "Mme&#160;Motin,  M.&#160;Savatier, Mme&#160;Grandjean, Mme&#160;Pouzyreff, M.&#160;Descrozaille, Mme&#160;Val&#233;rie&#160;Petit, M.&#160;Perea, Mme&#160;Beaudouin-Hubiere, M.&#160;Cazenove, Mme&#160;De Temmerman, Mme&#160;Bureau-Bonnard, Mme&#160;Degois, Mme&#160;Lardet, M.&#160;Vignal et Mme&#160;Khattabi"
  },
  "pointeurFragmentTexte": {
    "division": {
      "titre": "Article 8",
      "articleDesignationCourte": "APRÈS ART. 8",
      "type": "ARTICLE",
      "avantAApres": "Apres",
      "divisionRattachee": "APRÈS L'ARTICLE 8, insérer l'article suivant:",
      "articleAdditionnel": "1",
      "urlDivisionTexteVise": "/15/textes/1924.asp#D_Article_8"
    }
  },
  "corps": {
    "dispositif": "<p>I. &#8211; Apr&#232;s l&#8217;article&#160;7 <i>bis</i> de la loi n&#176; 84&#8209;16 du 11 janvier 1984 portant dispositions statutaires relatives &#224; la fonction publique de l&#8217;&#201;tat, dans sa r&#233;daction issue de la pr&#233;sente loi,&#160;il est ins&#233;r&#233; un article&#160;7 <i>ter</i> ainsi r&#233;dig&#233;&#160;:</p><p style=\"text-align: justify;\">&#171;&#160;<i>Art.&#160;7</i> ter&#160;&#8211; Les administrations de l&#8217;&#201;tat et les &#233;tablissements publics de l&#8217;&#201;tat autres que ceux &#224; caract&#232;re industriel et commercial peuvent, au titre de dispositions l&#233;gales destin&#233;es &#224; favoriser le recrutement de certaines cat&#233;gories de personnes sans emploi et afin de faciliter leur retour &#224; l&#8217;emploi et de leur permettre d&#8217;acqu&#233;rir des droits suppl&#233;mentaires en vue de la liquidation de la retraite &#224; taux plein, recruter un agent par un contrat &#224; dur&#233;e d&#233;termin&#233;e lorsque celui-ci satisfait aux conditions suivantes&#160;:</p><p style=\"text-align: justify;\">&#171;&#160;1&#176;&#160;&#202;tre &#226;g&#233; de plus de 57 ans&#160;;</p><p style=\"text-align: justify;\">&#171;&#160;2&#176;&#160;&#202;tre inscrit depuis plus de trois mois comme demandeur d&#8217;emploi ou b&#233;n&#233;ficiant d&#8217;une convention de reclassement personnalis&#233;.</p><p style=\"text-align: justify;\">&#171;&#160;Le contrat &#224; dur&#233;e d&#233;termin&#233;e est conclu pour une dur&#233;e maximale de dix-huit mois et peut &#234;tre renouvel&#233; une fois pour une dur&#233;e d&#233;termin&#233;e qui, ajout&#233;e &#224; la dur&#233;e du contrat initial, ne peut exc&#233;der trente-six mois.&#160;&#187;</p><p style=\"text-align: justify;\">II. &#8211; L&#8217;article&#160;3 de la loi n&#176; 84&#8209;53 du 26 janvier 1984 portant dispositions statutaires relatives &#224; la fonction publique territoriale, dans sa r&#233;daction issue de la pr&#233;sente loi,&#160;est compl&#233;t&#233; par un IV ainsi r&#233;dig&#233;&#160;:</p><p style=\"text-align: justify;\">&#171;&#160;IV.&#160;&#8211;&#160;Les collectivit&#233;s et &#233;tablissements mentionn&#233;s &#224; l&#8217;article&#160;2 peuvent &#233;galement, au titre de dispositions l&#233;gales destin&#233;es &#224; favoriser le recrutement de certaines cat&#233;gories de personnes sans emploi et afin de faciliter leur retour &#224; l&#8217;emploi et de leur permettre d&#8217;acqu&#233;rir des droits suppl&#233;mentaires en vue de la liquidation de la retraite &#224; taux plein, recruter un agent par un contrat &#224; dur&#233;e d&#233;termin&#233;e lorsque celui-ci satisfait aux conditions suivantes&#160;:</p><p style=\"text-align: justify;\">&#171;&#160;1&#176;&#160;&#202;tre &#226;g&#233; de plus de 57 ans&#160;;</p><p style=\"text-align: justify;\">&#171;&#160;2&#176;&#160;&#202;tre inscrit depuis plus de trois mois comme demandeur d&#8217;emploi ou b&#233;n&#233;ficiant d&#8217;une convention de reclassement personnalis&#233;.</p><p style=\"text-align: justify;\">&#171;&#160;Le contrat &#224; dur&#233;e d&#233;termin&#233;e est conclu pour une dur&#233;e maximale de dix-huit mois et peut &#234;tre renouvel&#233; une fois pour une dur&#233;e d&#233;termin&#233;e qui, ajout&#233;e &#224; la dur&#233;e du contrat initial, ne peut exc&#233;der trente-six mois.&#160;&#187;</p><p style=\"text-align: justify;\">III.&#160;&#8211;&#160;Apr&#232;s l&#8217;article&#160;9&#8209;4 de la loi n&#176; 86&#8209;33 du 9 janvier 1986 portant dispositions statutaires relatives &#224; la fonction publique hospitali&#232;re, dans sa r&#233;daction issue de la pr&#233;sente loi,&#160;il est ins&#233;r&#233; un article&#160;9&#8209;5 ainsi r&#233;dig&#233;&#160;:</p><p style=\"text-align: justify;\">&#171;&#160;<i>Art.&#160;9&#8209;5</i>. &#8211; Les &#233;tablissements mentionn&#233;s &#224; l&#8217;article&#160;2 peuvent, au titre de dispositions l&#233;gales destin&#233;es &#224; favoriser le recrutement de certaines cat&#233;gories de personnes sans emploi et afin de faciliter leur retour &#224; l&#8217;emploi et de leur permettre d&#8217;acqu&#233;rir des droits suppl&#233;mentaires en vue de la liquidation de la retraite &#224; taux plein, recruter un agent par un contrat &#224; dur&#233;e d&#233;termin&#233;e lorsque celui-ci satisfait aux conditions suivantes&#160;:</p><p style=\"text-align: justify;\">&#171;&#160;1&#176;&#160;&#202;tre &#226;g&#233; de plus de 57 ans&#160;;</p><p style=\"text-align: justify;\">&#171;&#160;2&#176;&#160;&#202;tre inscrit depuis plus de trois mois comme demandeur d&#8217;emploi ou b&#233;n&#233;ficiant d&#8217;une convention de reclassement personnalis&#233;.</p><p style=\"text-align: justify;\">&#171;&#160;Le contrat &#224; dur&#233;e d&#233;termin&#233;e est conclu pour une dur&#233;e maximale de dix-huit mois et peut &#234;tre renouvel&#233; une fois pour une dur&#233;e d&#233;termin&#233;e qui, ajout&#233;e &#224; la dur&#233;e du contrat initial, ne peut exc&#233;der trente-six mois.&#160;&#187;</p>",
    "exposeSommaire": "<p>Selon la derni&#232;re &#233;tude de l&#8217;Insee (mars 2019) sur le taux d&#8217;emploi des jeunes et des s&#233;niors en 2018, on observe plusieurs tendances&#160;:</p><p style=\"text-align: justify;\">- la participation des seniors au march&#233; du travail ne cesse de cro&#238;tre depuis 2009, cette hausse est imputable aux r&#233;formes des retraites successives et aux restrictions d&#8217;acc&#232;s aux dispositifs de cessation anticip&#233;e d&#8217;activit&#233;. En dix ans, la population active &#226;g&#233;e de 50 &#224; 64 ans a ainsi augment&#233; de pr&#232;s de 1,9 million de personnes, soit une hausse de 10,9 points de leur taux d&#8217;activit&#233; entre 2008 et 2018, dont + 0,9 point en 2018.</p><p style=\"text-align: justify;\">- L&#8217;activit&#233; f&#233;minine continue de progresser elle aussi. Ainsi, au sein des personnes de 25 &#224; 49 ans, le taux d&#8217;activit&#233; des femmes augmente de 0,9 point en 2018 alors que celui des hommes recule l&#233;g&#232;rement (&#8211; 0,3 point). Si les &#233;carts de taux d&#8217;activit&#233; entre hommes et femmes se r&#233;duisent, ils restent encore marqu&#233;s&#160;: en 2018, le taux d&#8217;activit&#233; des femmes de 25 &#224; 49 ans est de 83,5&#160;% quand celui des hommes est de 92,8&#160;%, soit un &#233;cart de 9,3 points. Cet &#233;cart &#233;tait de 12,0 points en 2008 et de 15,8 points en 1998.</p><p style=\"text-align: justify;\">- Parmi les seniors, les &#233;volutions sont cependant contrast&#233;es&#160;: le taux de ch&#244;mage diminue de 0,4 point parmi les 50&#8209;59 ans, mais augmente de 0,6 point pour les 60 ans ou plus.</p><p style=\"text-align: justify;\">- Le ch&#244;mage de longue dur&#233;e concerne 41,5&#160;% des ch&#244;meurs en 2018. Cette part est plus &#233;lev&#233;e chez les seniors et les personnes les moins qualifi&#233;es. Ainsi, en 2018, 57,6&#160;% des ch&#244;meurs de 50 ans ou plus (contre 24,3&#160;% des 15&#8209;24 ans) et 52,4&#160;% des ch&#244;meurs sans dipl&#244;me ou titulaires du brevet des coll&#232;ges (contre 32,0&#160;% des ch&#244;meurs titulaires d&#8217;un dipl&#244;me sup&#233;rieur &#224; Bac+2) sont ch&#244;meurs de longue dur&#233;e.</p><p style=\"text-align: justify;\">Dans ce contexte, et alors que le travail des seniors est un enjeu majeur en mati&#232;re de financement des retraites autant que pour permettre aux seniors d&#8217;acc&#233;der &#224; des retraites &#224; taux plein, il est propos&#233; de transposer le dispositif de CDD senior au secteur public dans les m&#234;mes conditions afin de garantir une &#233;quit&#233; de traitement entre les agents et les salari&#233;s mais aussi favoriser la mobilit&#233; public/priv&#233; pour augmenter les chances d&#8217;emploi des s&#233;niors sur le march&#233; du travail global.</p><p style=\"text-align: justify;\">Ainsi, ce dispositif contribuerait &#224; ouvrir le champs des possibles pour les toutes les cat&#233;gories de travailleurs (ind&#233;pendants, salari&#233;s, lib&#233;raux..) et favoriserait la transmission des savoirs et des comp&#233;tences au sein des organisations.</p>"
  },
  "representations": [
    {
      "nom": "PDF",
      "typeMime": {
        "type": "application",
        "subType": "PDF"
      },
      "statutRepresentation": {
        "verbatim": true,
        "canonique": true,
        "officielle": true,
        "transcription": false,
        "enregistrement": false
      },
      "contenu": {
        "documentURI": "/15/amendements/1924/AN/1120.pdf"
      }
    }
  ],
  "sort": {
    "dateSaisie": "2019-05-16T19:55:27.000+02:00",
    "sortEnSeance": "Retiré"
  },
  "dateDepot": "2019-05-07T02:00:00.000+02:00",
  "dateDistribution": "2019-05-10T02:00:00.000+02:00",
  "article99": "0",
  "loiReference": {}
}