{
  "uid": "AMANR5L15PO757134B1088P0D1N499",
  "identifiant": {
    "legislature": "15",
    "numero": "499",
    "numRect": "0",
    "saisine": {
      "texteLegislatifRef": "PRJLANR5L15B1088",
      "numeroPartiePLF": "0",
      "organeExamen": "PO757134",
      "mentionSecondeDeliberation": "0"
    }
  },
  "numeroLong": "499",
  "etapeTexte": "1ère lecture (1ère assemblée saisie)",
  "triAmendement": "abaaaaaaaaaaaaaaaaaaaaaaaaaaaaaaaaaaaaaaaaaaaaaaaaplkkkkkkkknx",
  "cardinaliteAmdtMultiples": "1",
  "etat": "Discuté",
  "signataires": {
    "auteur": {
      "typeAuteur": "Depute",
      "acteurRef": "PA719790",
      "groupePolitiqueRef": "PO730964"
    },
    "cosignatairesRefs": [
      "PA719790"
    ],
    "texteAffichable": "M.&#160;Chalumeau"
  },
  "pointeurFragmentTexte": {
    "division": {
      "titre": "Article PREMIER",
      "articleDesignationCourte": "ART. PREMIER",
      "type": "ARTICLE",
      "avantAApres": "A",
      "divisionRattachee": "ARTICLE PREMIER",
      "urlDivisionTexteVise": "/15/textes/1088.asp#D_Article_1er"
    },
    "alinea": {
      "numero": "11"
    }
  },
  "corps": {
    "dispositif": "<p>&#192; l&#8217;alin&#233;a&#160;11, apr&#232;s le mot&#160;:</p><p>&#171;&#160;dernier&#160;&#187;,</p><p>ins&#233;rer les mots&#160;:</p><p>&#171;&#160;par les autorit&#233;s et organismes qui en sont destinataires.&#160;&#187;</p>",
    "exposeSommaire": "<p style=\"text-align: justify;\">L&#8217;article&#160;1<sup>er</sup> vise &#224; rendre obligatoires par voie &#233;lectronique les d&#233;clarations des entreprises pour leurs formalit&#233;s de cr&#233;ation, de modification de leur situation et la cessation de leur activit&#233;.</p><p style=\"text-align: justify;\">Cet amendement vise &#224; pr&#233;ciser que les dossiers d&#233;pos&#233;s ne sont r&#233;put&#233;s r&#233;guliers et complets, et par cons&#233;quent conformes juridiquement, qu&#8217;&#224; partir du moment o&#249; l&#8217;ensemble des organismes destinataires (les services fiscaux, les URSSAF, les caisses sociales, les r&#233;pertoires des m&#233;tiers et les registres du commerce et des soci&#233;t&#233;s) ont pu en contr&#244;ler la r&#233;gularit&#233; ou en appr&#233;cier la validit&#233;, conform&#233;ment &#224; leurs missions.</p><p style=\"text-align: justify;\">En effet, l&#8217;accus&#233; de r&#233;ception envoy&#233; par le guichet &#233;lectronique ne doit pas pouvoir &#234;tre consid&#233;r&#233; par le d&#233;clarant comme une validation l&#233;gale avant que tous les organismes n&#8217;aient &#233;t&#233; en mesure de contr&#244;ler le dossier.</p><p style=\"text-align: justify;\">Dans cet objectif, le d&#233;cret mentionn&#233; &#224; l&#8217;alin&#233;a&#160;11 doit int&#233;grer cette pr&#233;cision.</p><p style=\"text-align: justify;\">Il s&#8217;agit ainsi de s&#233;curiser juridiquement les effets du d&#233;p&#244;t par voie &#233;lectronique des formalit&#233;s des entreprises.</p>"
  },
  "representations": [
    {
      "nom": "PDF",
      "typeMime": {
        "type": "application",
        "subType": "PDF"
      },
      "statutRepresentation": {
        "verbatim": true,
        "canonique": true,
        "officielle": true,
        "transcription": false,
        "enregistrement": false
      },
      "contenu": {
        "documentURI": "/15/amendements/1088/CSPACTE/499.pdf"
      }
    }
  ],
  "sort": {
    "dateSaisie": "2018-09-06T16:19:59.000+02:00",
    "sortEnSeance": "Non soutenu"
  },
  "dateDepot": "2018-08-27T02:00:00.000+02:00",
  "dateDistribution": "2018-09-05T02:00:00.000+02:00",
  "article99": "0",
  "loiReference": {}
}