{
  "uid": "AMANR5L15SEA717460BTC1056P0D1N9",
  "identifiant": {
    "legislature": "15",
    "numero": "9",
    "numRect": "0",
    "saisine": {
      "texteLegislatifRef": "PRJLANR5L15BTC1056",
      "numeroPartiePLF": "0",
      "organeExamen": "PO717460",
      "mentionSecondeDeliberation": "1"
    }
  },
  "numeroLong": "9",
  "etapeTexte": "Nouvelle Lecture",
  "triAmendement": "bo",
  "cardinaliteAmdtMultiples": "1",
  "etat": "Discuté",
  "signataires": {
    "auteur": {
      "typeAuteur": "Depute",
      "acteurRef": "PA718884",
      "groupePolitiqueRef": "PO730934"
    },
    "cosignatairesRefs": [
      "PA718884"
    ],
    "texteAffichable": "Mme&#160;Bazin-Malgras"
  },
  "pointeurFragmentTexte": {
    "division": {
      "titre": "Article 33",
      "articleDesignationCourte": "ART. 33",
      "type": "ARTICLE",
      "avantAApres": "A",
      "divisionRattachee": "ARTICLE 33",
      "urlDivisionTexteVise": "/15/textes/1056.asp#D_Article_33"
    },
    "alinea": {
      "numero": "2"
    }
  },
  "corps": {
    "dispositif": "<p style=\"text-align: justify;\">Supprimer l&#8217;alin&#233;a&#160;2.</p>",
    "exposeSommaire": "<p style=\"text-align: justify;\">La pr&#233;servation de notre environnement est un imp&#233;ratif majeur et les normes et proc&#233;dures environnementales dont notre pays peut s&#8217;enorgueillir r&#233;pondent tr&#232;s pr&#233;cis&#233;ment &#224; cette exigence.</p><p style=\"text-align: justify;\">Nous devons &#234;tre fiers de pr&#233;voir dans un certain nombre de cas, des enqu&#234;tes publiques, plus exigeantes par d&#233;finition que les proc&#233;dures de participation du public.</p><p style=\"text-align: justify;\">Or cet article&#160;pr&#233;voit de remplacer cette enqu&#234;te publique par une simple proc&#233;dure de participation du public pour de nombreuses op&#233;rations d&#8217;am&#233;nagements modifiant profond&#233;ment notre environnement.</p><p style=\"text-align: justify;\">Nous sommes en droit de nous inqui&#233;ter tout autant que de nous &#233;tonner. En effet, comment ne pas s&#8217;&#233;tonner d&#8217;une telle disposition lorsque la majorit&#233; souhaite introduire la pr&#233;servation de l&#8217;environnement &#224; l&#8217;article premier de notre Constitution soit au sommet de notre r&#233;glementation.</p><p style=\"text-align: justify;\">Nous sommes en droit de nous &#233;tonner &#233;galement tant cette mesure contredit les d&#233;clarations du Gouvernement et du pr&#233;sident de la R&#233;publique en faveur d&#8217;une telle pr&#233;servation de l&#8217;environnement.</p><p style=\"text-align: justify;\">C&#8217;est ainsi que nous souhaitons voir retirer cette disposition du texte, tel est l&#8217;objet de cet amendement.</p>"
  },
  "representations": [
    {
      "nom": "PDF",
      "typeMime": {
        "type": "application",
        "subType": "PDF"
      },
      "statutRepresentation": {
        "verbatim": true,
        "canonique": true,
        "officielle": true,
        "transcription": false,
        "enregistrement": false
      },
      "contenu": {
        "documentURI": "/15/amendements/1056/AN/9.pdf"
      }
    }
  ],
  "seanceDiscussion": "RUANR5L15S2018IDS21130",
  "sort": {
    "dateSaisie": "2018-06-26T23:46:08.000+02:00",
    "sortEnSeance": "Rejeté"
  },
  "dateDepot": "2018-06-19T02:00:00.000+02:00",
  "dateDistribution": "2018-06-25T02:00:00.000+02:00",
  "article99": "0",
  "loiReference": {}
}