{
  "uid": "AMANR5L15SEA717460BTC1019P0D1N64",
  "identifiant": {
    "legislature": "15",
    "numero": "64",
    "numRect": "0",
    "saisine": {
      "texteLegislatifRef": "PRJLANR5L15BTC1019",
      "numeroPartiePLF": "0",
      "organeExamen": "PO717460",
      "mentionSecondeDeliberation": "1"
    }
  },
  "numeroLong": "64",
  "etapeTexte": "1ère lecture (1ère assemblée saisie)",
  "triAmendement": "dxnzxwzzzzzyki",
  "cardinaliteAmdtMultiples": "1",
  "etat": "Discuté",
  "signataires": {
    "auteur": {
      "typeAuteur": "Depute",
      "acteurRef": "PA719318",
      "groupePolitiqueRef": "PO730934"
    },
    "cosignatairesRefs": [
      "PA267378",
      "PA721286",
      "PA346218",
      "PA718838",
      "PA267450",
      "PA266776",
      "PA608016",
      "PA340853",
      "PA721968",
      "PA720100",
      "PA719318",
      "PA642847",
      "PA721506"
    ],
    "texteAffichable": "Mme&#160;Anthoine,  M.&#160;Leclerc, M.&#160;Pradi&#233;, M.&#160;Masson, Mme&#160;Levy, M.&#160;Ramadier, Mme&#160;Kuster, M.&#160;Vialay, M.&#160;Bazin, M.&#160;R&#233;mi&#160;Delatte, M.&#160;Reiss, M.&#160;Brun et Mme&#160;Louwagie"
  },
  "pointeurFragmentTexte": {
    "division": {
      "titre": "Article 16",
      "articleDesignationCourte": "ART. 16",
      "type": "ARTICLE",
      "avantAApres": "A",
      "divisionRattachee": "ARTICLE 16",
      "urlDivisionTexteVise": "/15/textes/1019.asp#D_Article_16"
    },
    "alinea": {
      "avantAApres": "Apres",
      "numero": "57"
    }
  },
  "corps": {
    "dispositif": "<p style=\"text-align: justify;\">Apr&#232;s l&#8217;alin&#233;a&#160;57, ins&#233;rer l&#8217;alin&#233;a suivant&#160;:</p><p style=\"text-align: justify;\">&#171;&#160;Le poste de pr&#233;sident et les postes de vice-pr&#233;sident du conseil d&#8217;administration sont d&#233;termin&#233;s de mani&#232;re &#233;quilibr&#233;e entre les repr&#233;sentants des coll&#232;ges mentionn&#233;s aux 1&#176; &#224; 4&#176;.&#160;&#187;</p>",
    "exposeSommaire": "<p style=\"text-align: justify;\">Afin que la dimension v&#233;ritablement quadripartite du conseil d&#8217;administration de France comp&#233;tence soit garantie, cet amendement pr&#233;voit qu&#8217;il y aura un &#233;quilibre dans la d&#233;termination du poste de pr&#233;sident et des postes de vice-pr&#233;sident du conseil entre les repr&#233;sentants des coll&#232;ges de l&#8217;&#201;tat, des r&#233;gions, des organisations syndicales de salari&#233;s et des organisations professionnelles d&#8217;employeurs.</p>"
  },
  "representations": [
    {
      "nom": "PDF",
      "typeMime": {
        "type": "application",
        "subType": "PDF"
      },
      "statutRepresentation": {
        "verbatim": true,
        "canonique": true,
        "officielle": true,
        "transcription": false,
        "enregistrement": false
      },
      "contenu": {
        "documentURI": "/15/amendements/1019/AN/64.pdf"
      }
    }
  ],
  "seanceDiscussion": "RUANR5L15S2018IDS21105",
  "sort": {
    "dateSaisie": "2018-06-15T15:53:44.000+02:00",
    "sortEnSeance": "Non soutenu"
  },
  "dateDepot": "2018-06-05T02:00:00.000+02:00",
  "dateDistribution": "2018-06-12T02:00:00.000+02:00",
  "article99": "0",
  "loiReference": {}
}