{
  "uid": "AMANR5L15SEA717460BTC1955P0D1N406",
  "identifiant": {
    "legislature": "15",
    "numero": "406",
    "numRect": "0",
    "saisine": {
      "texteLegislatifRef": "PNREANR5L15BTC1955",
      "numeroPartiePLF": "0",
      "organeExamen": "PO717460",
      "mentionSecondeDeliberation": "0"
    }
  },
  "numeroLong": "406",
  "etapeTexte": "Lecture unique",
  "triAmendement": "aaiaaaaaaaaaaaaaaaaaaaaaaaaaaaaaaaaaaaaaaaaaaaaaaaae",
  "cardinaliteAmdtMultiples": "1",
  "etat": "Discuté",
  "signataires": {
    "auteur": {
      "typeAuteur": "Depute",
      "acteurRef": "PA330008",
      "groupePolitiqueRef": "PO730934"
    },
    "cosignatairesRefs": [
      "PA718838",
      "PA330008",
      "PA1874"
    ],
    "texteAffichable": "M.&#160;Breton,  M.&#160;Le Fur et M.&#160;Brun"
  },
  "pointeurFragmentTexte": {
    "division": {
      "titre": "Article PREMIER",
      "articleDesignationCourte": "AVANT ART. PREMIER",
      "type": "ARTICLE",
      "avantAApres": "Avant",
      "divisionRattachee": "AVANT L'ARTICLE PREMIER, insérer l'article suivant:",
      "articleAdditionnel": "1",
      "urlDivisionTexteVise": "/15/textes/1955.asp#D_Article_1er"
    }
  },
  "corps": {
    "dispositif": "<p style=\"text-align: justify;\">Au d&#233;but du R&#232;glement, il est ajout&#233; un titre&#160;I<sup>er</sup>&#160;A ainsi r&#233;dig&#233;&#160;:</p><p style=\"text-align: justify;\">&#171;&#160;Titre&#160;I<sup>er</sup>&#160;A</p><p style=\"text-align: justify;\">&#171;&#160;Modification du R&#232;glement</p><p style=\"text-align: justify;\">&#171;&#160;<i>Art. 1<sup>er</sup> A.</i> &#8211; Toute modification du R&#232;glement est approuv&#233;e par la majorit&#233; des groupes constitu&#233;s.&#160;&#187;</p>",
    "exposeSommaire": "<p>Une r&#233;forme du R&#232;glement doit &#234;tre consensuelle pour le bon d&#233;roulement des travaux du Parlement.</p>"
  },
  "representations": [
    {
      "nom": "PDF",
      "typeMime": {
        "type": "application",
        "subType": "PDF"
      },
      "statutRepresentation": {
        "verbatim": true,
        "canonique": true,
        "officielle": true,
        "transcription": false,
        "enregistrement": false
      },
      "contenu": {
        "documentURI": "/15/amendements/1955/AN/406.pdf"
      }
    }
  ],
  "sort": {
    "dateSaisie": "2019-05-27T19:33:54.000+02:00",
    "sortEnSeance": "Non soutenu"
  },
  "dateDepot": "2019-05-23T02:00:00.000+02:00",
  "dateDistribution": "2019-05-24T02:00:00.000+02:00",
  "article99": "0",
  "loiReference": {
    "divisionCodeLoi": "1er A"
  }
}