{
  "uid": "AMANR5L15SEA717460BTC1019P0D1N637",
  "identifiant": {
    "legislature": "15",
    "numero": "637",
    "numRect": "0",
    "saisine": {
      "texteLegislatifRef": "PRJLANR5L15BTC1019",
      "numeroPartiePLF": "0",
      "organeExamen": "PO717460",
      "mentionSecondeDeliberation": "0"
    }
  },
  "numeroLong": "637",
  "etapeTexte": "1ère lecture (1ère assemblée saisie)",
  "triAmendement": "ge",
  "cardinaliteAmdtMultiples": "1",
  "etat": "Discuté",
  "signataires": {
    "auteur": {
      "typeAuteur": "Depute",
      "acteurRef": "PA722284",
      "groupePolitiqueRef": "PO730970"
    },
    "cosignatairesRefs": [
      "PA718978",
      "PA719488",
      "PA721742",
      "PA722284",
      "PA719504",
      "PA720002",
      "PA720976"
    ],
    "texteAffichable": "M.&#160;Fuchs,  M.&#160;Berta, M.&#160;Lagleize, Mme&#160;Florennes, M.&#160;Laqhila, M.&#160;Mathiasin et Mme&#160;El Ha&#239;ry"
  },
  "pointeurFragmentTexte": {
    "division": {
      "titre": "Article 14",
      "articleDesignationCourte": "ART. 14",
      "type": "ARTICLE",
      "avantAApres": "A",
      "divisionRattachee": "ARTICLE 14",
      "urlDivisionTexteVise": "/15/textes/1019.asp#D_Article_14"
    },
    "alinea": {
      "numero": "16"
    }
  },
  "corps": {
    "dispositif": "<p style=\"text-align: justify;\">&#192; l'alin&#233;a 16, apr&#232;s la seconde occurrence du mot&#160;:</p><p style=\"text-align: justify;\">&#171;&#160;professionnelle&#160;&#187;,</p><p style=\"text-align: justify;\">ins&#233;rer les mots :</p><p style=\"text-align: justify;\">&#171;&#160;et interprofessionnelle&#160;&#187;.</p>",
    "exposeSommaire": "<p style=\"text-align: justify;\">Le nombre d&#8217;entreprise couvert par des accords de branche ne rassemble pas l&#8217;ensemble des entreprises, et plus particuli&#232;rement les TPE et/ou PME, il est donc du traitement &#233;galitaire des salari&#233;s de ces entreprises qu&#8217;un accord interprofessionnel compl&#233;mentaire puisse ouvrir les m&#234;mes capacit&#233;s que l&#8217;accord d&#8217;entreprise, ou un accord de branche.</p>"
  },
  "representations": [
    {
      "nom": "PDF",
      "typeMime": {
        "type": "application",
        "subType": "PDF"
      },
      "statutRepresentation": {
        "verbatim": true,
        "canonique": true,
        "officielle": true,
        "transcription": false,
        "enregistrement": false
      },
      "contenu": {
        "documentURI": "/15/amendements/1019/AN/637.pdf"
      }
    }
  ],
  "seanceDiscussion": "RUANR5L15S2018IDS21104",
  "sort": {
    "dateSaisie": "2018-06-15T11:12:15.000+02:00",
    "sortEnSeance": "Tombé"
  },
  "dateDepot": "2018-06-06T02:00:00.000+02:00",
  "dateDistribution": "2018-06-11T02:00:00.000+02:00",
  "article99": "0",
  "loiReference": {}
}