{
  "uid": "AMANR5L15SEA717460B0235P1D1N295",
  "identifiant": {
    "legislature": "15",
    "numero": "295",
    "numRect": "0",
    "saisine": {
      "texteLegislatifRef": "PRJLANR5L15B0235",
      "numeroPartiePLF": "1",
      "organeExamen": "PO717460",
      "mentionSecondeDeliberation": "0"
    }
  },
  "numeroLong": "I-295",
  "etapeTexte": "1ère lecture (1ère assemblée saisie)",
  "triAmendement": "abaytvzu",
  "cardinaliteAmdtMultiples": "1",
  "etat": "Discuté",
  "signataires": {
    "auteur": {
      "typeAuteur": "Depute",
      "acteurRef": "PA720386",
      "groupePolitiqueRef": "PO730934"
    },
    "cosignatairesRefs": [
      "PA721286",
      "PA998",
      "PA720386",
      "PA856",
      "PA606712",
      "PA721816"
    ],
    "texteAffichable": "M.&#160;Di Filippo,  M.&#160;Boucard, M.&#160;Lurton, M.&#160;Ramadier, M.&#160;Cherpion et M.&#160;Dassault"
  },
  "pointeurFragmentTexte": {
    "division": {
      "titre": "Article 2",
      "articleDesignationCourte": "APRÈS ART. 2",
      "type": "ARTICLE",
      "avantAApres": "Apres",
      "divisionRattachee": "APRÈS L'ARTICLE 2, insérer l'article suivant:",
      "articleAdditionnel": "1",
      "urlDivisionTexteVise": "/15/textes/0235A.asp#D_Article_2"
    }
  },
  "corps": {
    "dispositif": "<p style=\"text-align: justify;\">I. - Apr&#232;s l&#8217;article&#160;81&#160;<i>ter</i> du code g&#233;n&#233;ral des imp&#244;ts, il est ins&#233;r&#233; un article&#160;81&#160;<i>quater</i> ainsi r&#233;dig&#233;&#160;:</p><p style=\"text-align: justify;\">&#171;&#160;<i>Art.&#160;81&#160;quater</i>.&#160;&#8211;&#160;I.&#160;&#8211;&#160;Sont exon&#233;r&#233;s de l&#8217;imp&#244;t sur le revenu&#160;:</p><p style=\"text-align: justify;\">&#171;&#160;1&#176;&#160;Les salaires vers&#233;s aux salari&#233;s au titre des heures suppl&#233;mentaires de travail d&#233;finies &#224; l&#8217;article L.&#160;3121&#8209;28 du code du travail et, pour les salari&#233;s relevant de conventions de forfait annuel en heures pr&#233;vues &#224; l&#8217;article L.&#160;3121&#8209;56 du m&#234;me code, des heures effectu&#233;es au-del&#224; de 1&#160;607&#160;heures, ainsi que des heures effectu&#233;es en application de l&#8217;avant-dernier alin&#233;a de l&#8217;article L.&#160;3123&#8209;2 dudit code. Sont exon&#233;r&#233;s les salaires vers&#233;s au titre des heures suppl&#233;mentaires mentionn&#233;es &#224; l&#8217;article L.&#160;3121&#8209;41 du code pr&#233;cit&#233;, &#224; l&#8217;exception des heures effectu&#233;es entre&#160;1&#160;607&#160;heures et la dur&#233;e annuelle fix&#233;e par l&#8217;accord lorsqu&#8217;elle lui est inf&#233;rieure.</p><p style=\"text-align: justify;\">&#171;&#160;L&#8217;exon&#233;ration mentionn&#233;e au premier alin&#233;a du pr&#233;sent I est &#233;galement applicable &#224; la majoration de salaire vers&#233;e, dans le cadre des conventions de forfait annuel en jours, en contrepartie de la renonciation par les salari&#233;s, au-del&#224; du plafond de deux cent dix-huit jours mentionn&#233; au 3&#176; du I de l'article L.&#160;3121&#8209;64 du m&#234;me code, &#224; des jours de repos dans les conditions pr&#233;vues &#224; l&#8217;article L.&#160;3121&#8209;59 du m&#234;me code&#160;;</p><p style=\"text-align: justify;\">&#171;&#160;2&#176;&#160;Les salaires vers&#233;s aux salari&#233;s &#224; temps partiel au titre des heures compl&#233;mentaires de travail d&#233;finies au&#160;4&#176; de l&#8217;article L.&#160;3123&#8209;6, aux articles L.&#160;3123&#8209;17 et L.&#160;3123&#8209;18&#160;;</p><p style=\"text-align: justify;\">&#171;&#160;3&#176;&#160;Les salaires vers&#233;s aux salari&#233;s par les particuliers employeurs au titre des heures suppl&#233;mentaires qu&#8217;ils r&#233;alisent&#160;;</p><p style=\"text-align: justify;\">&#171;&#160;4&#176;&#160;Les salaires vers&#233;s aux assistants maternels r&#233;gis par les articles L.&#160;421&#8209;1 et suivants et L.&#160;423&#8209;1 et suivants du code de l&#8217;action sociale et des familles au titre des heures suppl&#233;mentaires qu&#8217;ils accomplissent au-del&#224; d&#8217;une dur&#233;e hebdomadaire de quarante-cinq heures, ainsi que les salaires qui leur sont vers&#233;s au titre des heures compl&#233;mentaires accomplies au sens de la convention collective nationale qui leur est applicable&#160;;</p><p style=\"text-align: justify;\">&#171;&#160;5&#176;&#160;Les &#233;l&#233;ments de r&#233;mun&#233;ration vers&#233;s aux agents publics titulaires ou non titulaires au titre, selon des modalit&#233;s pr&#233;vues par d&#233;cret, des heures suppl&#233;mentaires qu&#8217;ils r&#233;alisent ou du temps de travail additionnel effectif&#160;;</p><p style=\"text-align: justify;\">&#171;&#160;6&#176;&#160;Les salaires vers&#233;s aux autres salari&#233;s dont la dur&#233;e du travail ne rel&#232;ve pas des dispositions du titre&#160;II du livre&#160;I<sup>er</sup> de la troisi&#232;me partie du code du travail ou du chapitre&#160;III du titre&#160;I<sup>er</sup> du livre&#160;VII du code rural et de la p&#234;che maritime au titre, selon des modalit&#233;s pr&#233;vues par d&#233;cret, des heures suppl&#233;mentaires ou compl&#233;mentaires de travail qu&#8217;ils effectuent ou, dans le cadre de conventions de forfait en jours, les salaires vers&#233;s en contrepartie des jours de repos auxquels les salari&#233;s ont renonc&#233; au-del&#224; du plafond de deux cent dix-huit jours.</p><p style=\"text-align: justify;\">&#171;&#160;II.&#160;&#8211;&#160;L&#8217;exon&#233;ration pr&#233;vue au&#160;I s&#8217;applique&#160;:</p><p style=\"text-align: justify;\">&#171;&#160;1&#176;&#160;Aux r&#233;mun&#233;rations mentionn&#233;es aux&#160;1&#176; &#224;&#160;4&#176; et au&#160;6&#176; du&#160;I du pr&#233;sent article et, en ce qui concerne la majoration salariale correspondante, dans la limite&#160;:</p><p style=\"text-align: justify;\">&#171;&#160;<i>a)</i>&#160;Des taux pr&#233;vus par la convention collective ou l&#8217;accord professionnel ou interprofessionnel applicable&#160;;</p><p style=\"text-align: justify;\">&#171;&#160;<i>b)</i>&#160;&#192; d&#233;faut d&#8217;une telle convention ou d&#8217;un tel accord&#160;:</p><p style=\"text-align: justify;\">&#171;&#160;&#8211;&#160;pour les heures suppl&#233;mentaires, des taux de&#160;25&#160;% ou 50&#160;%, selon le cas, pr&#233;vus &#224; l&#8217;article L.&#160;3121&#8209;36 du code du travail&#160;;</p><p style=\"text-align: justify;\">&#171;&#160;&#8211;&#160;pour les heures compl&#233;mentaires, du taux de 25&#160;%&#160;;</p><p style=\"text-align: justify;\">&#171;&#160;&#8211;&#160;pour les heures effectu&#233;es au del&#224; de&#160;1&#160;607&#160;heures dans le cadre de la convention de forfait pr&#233;vue &#224; l&#8217;article L.&#160;3121&#8209;56 du m&#234;me code, du taux de&#160;25&#160;% de la r&#233;mun&#233;ration horaire d&#233;termin&#233;e &#224; partir du rapport entre la r&#233;mun&#233;ration annuelle forfaitaire et le nombre d&#8217;heures de travail pr&#233;vu dans le forfait, les heures au-del&#224; de la dur&#233;e l&#233;gale &#233;tant pond&#233;r&#233;es en fonction des taux de majoration applicables &#224; leur r&#233;mun&#233;ration&#160;;</p><p style=\"text-align: justify;\">&#171;&#160;2&#176;&#160;&#192; la majoration de salaire vers&#233;e dans le cadre des conventions de forfait mentionn&#233;es au second alin&#233;a du&#160;1&#176; et au&#160;6&#176; du&#160;I du pr&#233;sent article, dans la limite de la r&#233;mun&#233;ration journali&#232;re d&#233;termin&#233;e &#224; partir du rapport entre la r&#233;mun&#233;ration annuelle forfaitaire et le nombre de jours de travail pr&#233;vu dans le forfait, major&#233;e de&#160;25&#160;%&#160;;</p><p style=\"text-align: justify;\">&#171;&#160;3&#176;&#160;Aux &#233;l&#233;ments de r&#233;mun&#233;ration mentionn&#233;s au&#160;5&#176; du&#160;I pr&#233;cit&#233; dans la limite des dispositions applicables aux agents concern&#233;s.</p><p style=\"text-align: justify;\">&#171;&#160;III.&#160;&#8211;&#160;Les&#160;I et&#160;II sont applicables sous r&#233;serve du respect par l&#8217;employeur des dispositions l&#233;gales et conventionnelles relatives &#224; la dur&#233;e du travail.</p><p style=\"text-align: justify;\">&#171;&#160;Les&#160;I et&#160;II ne sont pas applicables lorsque les salaires ou &#233;l&#233;ments de r&#233;mun&#233;ration qui y sont mentionn&#233;s se substituent &#224; d&#8217;autres &#233;l&#233;ments de r&#233;mun&#233;ration au sens de l&#8217;article&#160;79 du pr&#233;sent code, &#224; moins qu&#8217;un d&#233;lai de douze mois ne se soit &#233;coul&#233; entre le dernier versement de l&#8217;&#233;l&#233;ment de r&#233;mun&#233;ration en tout ou partie supprim&#233; et le premier versement des salaires ou &#233;l&#233;ments de r&#233;mun&#233;ration pr&#233;cit&#233;s.</p><p style=\"text-align: justify;\">&#171;&#160;De m&#234;me, ils ne sont pas applicables&#160;:</p><p style=\"text-align: justify;\">&#171;&#160;&#8211;&#160;&#224; la r&#233;mun&#233;ration des heures compl&#233;mentaires lorsque ces heures sont accomplies de mani&#232;re r&#233;guli&#232;re au sens de l&#8217;article L.&#160;3123&#8209;13 du code du travail, sauf si elles sont int&#233;gr&#233;es &#224; l&#8217;horaire contractuel de travail pendant une dur&#233;e minimale fix&#233;e par d&#233;cret&#160;;</p><p style=\"text-align: justify;\">&#171;&#160;&#8211;&#160;&#224; la r&#233;mun&#233;ration d&#8217;heures qui n&#8217;auraient pas &#233;t&#233; des heures suppl&#233;mentaires sans abaissement, apr&#232;s le&#160;1<sup>er</sup>&#160;octobre&#160;2012, de la limite haute hebdomadaire mentionn&#233;e &#224; l&#8217;article L.&#160;3122&#8209;4 du m&#234;me code.&#160;&#187;</p><p style=\"text-align: justify;\">II.&#160;&#8211;&#160;Le code de la s&#233;curit&#233; sociale est ainsi modifi&#233;&#160;:</p><p style=\"text-align: justify;\">A.&#160;&#8211;&#160;Apr&#232;s l&#8217;article L.&#160;241&#8209;16, il est ins&#233;r&#233; un article L.&#160;241&#8209;17 ainsi r&#233;dig&#233;&#160;:</p><p style=\"text-align: justify;\">&#171;&#160;<i>Art.&#160;L.&#160;241&#8209;17</i>.&#160;&#8211;&#160;I.&#160;&#8211;&#160;Toute heure suppl&#233;mentaire ou compl&#233;mentaire effectu&#233;e, lorsqu&#8217;elle entre dans le champ d&#8217;application du&#160;I de l&#8217;article&#160;81&#160;<i>quater</i> du code g&#233;n&#233;ral des imp&#244;ts, ouvre droit, dans les conditions et limites fix&#233;es par les dispositions de cet article, &#224; une r&#233;duction de cotisations salariales de s&#233;curit&#233; sociale proportionnelle &#224; sa r&#233;mun&#233;ration, dans la limite des cotisations et contributions d&#8217;origine l&#233;gale ou conventionnelle rendues obligatoires par la loi dont le salari&#233; est redevable au titre de cette heure. Un d&#233;cret d&#233;termine le taux de cette r&#233;duction.</p><p style=\"text-align: justify;\">&#171;&#160;Ces dispositions sont applicables aux heures suppl&#233;mentaires ou compl&#233;mentaires effectu&#233;es par les salari&#233;s relevant des r&#233;gimes sp&#233;ciaux mentionn&#233;s &#224; l&#8217;article L.&#160;711&#8209;1 du pr&#233;sent code dans des conditions fix&#233;es par d&#233;cret, compte tenu du niveau des cotisations dont sont redevables les personnes relevant de ces r&#233;gimes et dans la limite mentionn&#233;e au premier alin&#233;a.</p><p style=\"text-align: justify;\">&#171;&#160;II.&#160;&#8211;&#160;La r&#233;duction de cotisations salariales de s&#233;curit&#233; sociale pr&#233;vue au&#160;I est imput&#233;e sur le montant des cotisations salariales de s&#233;curit&#233; sociale dues pour chaque salari&#233; concern&#233; au titre de l&#8217;ensemble de sa r&#233;mun&#233;ration.</p><p style=\"text-align: justify;\">&#171;&#160;III.&#160;&#8211;&#160;Le cumul de cette r&#233;duction avec l&#8217;application de taux r&#233;duits en mati&#232;re de cotisations salariales, d&#8217;assiettes ou de montants forfaitaires de cotisations ou avec l&#8217;application d&#8217;une autre exon&#233;ration, totale ou partielle, de cotisations salariales de s&#233;curit&#233; sociale ne peut &#234;tre autoris&#233; que dans des conditions fix&#233;es par d&#233;cret. Ce d&#233;cret tient compte du niveau des avantages sociaux octroy&#233;s aux salari&#233;s concern&#233;s.</p><p style=\"text-align: justify;\">&#171;&#160;IV.&#160;&#8211;&#160;Le b&#233;n&#233;fice de la r&#233;duction est subordonn&#233; &#224; la mise &#224; disposition du service des imp&#244;ts comp&#233;tent et des agents charg&#233;s du contr&#244;le mentionn&#233;s &#224; l&#8217;article L.&#160;243&#8209;7 du pr&#233;sent code et &#224; l&#8217;article L.&#160;724&#8209;7 du code rural et de la p&#234;che maritime, par l&#8217;employeur, d&#8217;un document en vue du contr&#244;le des dispositions du pr&#233;sent article dans des conditions fix&#233;es par d&#233;cret. Pour les salaires pour lesquels il est fait usage des dispositifs mentionn&#233;s aux articles L.&#160;133&#8209;8, L.&#160;133&#8209;8&#8209;3 et L.&#160;531&#8209;8 du pr&#233;sent code, les obligations d&#233;claratives compl&#233;mentaires sont pr&#233;vues par d&#233;cret.&#160;&#187;</p><p style=\"text-align: justify;\">B.&#160;&#8211;&#160;L&#8217;article L.&#160;241&#8209;18 est ainsi r&#233;dig&#233;&#160;:</p><p style=\"text-align: justify;\">&#171;&#160;<i>Art.&#160;L.&#160;241&#8209;18</i>.&#160;&#8211;&#160;I.&#160;&#8211;&#160;Toute heure suppl&#233;mentaire effectu&#233;e par les salari&#233;s mentionn&#233;s au&#160;II de l&#8217;article L.&#160;241&#8209;13 du pr&#233;sent code, lorsqu&#8217;elle entre dans le champ d&#8217;application du&#160;I de l&#8217;article&#160;81&#160;<i>quater</i> du code g&#233;n&#233;ral des imp&#244;ts, ouvre droit &#224; une d&#233;duction forfaitaire des cotisations patronales &#224; hauteur d&#8217;un montant fix&#233; par d&#233;cret. Ce montant peut &#234;tre major&#233; dans les entreprises employant au plus vingt salari&#233;s.</p><p style=\"text-align: justify;\">&#171;&#160;II.&#160;&#8211;&#160;Une d&#233;duction forfaitaire &#233;gale &#224; sept fois le montant d&#233;fini au&#160;I est &#233;galement applicable pour chaque jour de repos auquel renonce un salari&#233; dans les conditions pr&#233;vues par le second alin&#233;a du&#160;1&#176; du&#160;I de l&#8217;article&#160;81&#160;<i>quater</i> du m&#234;me code.</p><p style=\"text-align: justify;\">&#171;&#160;III.&#160;&#8211;&#160;Le montant mentionn&#233; aux&#160;I et&#160;II est cumulable avec les autres dispositifs d&#8217;exon&#233;rations de cotisations patronales de s&#233;curit&#233; sociale dans la limite des cotisations patronales de s&#233;curit&#233; sociale, ainsi que des contributions patronales recouvr&#233;es suivant les m&#234;mes r&#232;gles, restant dues par l&#8217;employeur, et, pour le reliquat &#233;ventuel, dans la limite des cotisations salariales de s&#233;curit&#233; sociale pr&#233;compt&#233;es, au titre de l&#8217;ensemble de la r&#233;mun&#233;ration du salari&#233; concern&#233;.</p><p style=\"text-align: justify;\">&#171;&#160;Il est d&#233;duit des sommes devant &#234;tre vers&#233;es par les employeurs aux organismes de recouvrement mentionn&#233;s aux articles L.&#160;213&#8209;1 du pr&#233;sent code et L.&#160;725&#8209;3 du code rural et de la p&#234;che maritime.</p><p style=\"text-align: justify;\">&#171;&#160;Le b&#233;n&#233;fice des d&#233;ductions mentionn&#233;es aux&#160;I et&#160;II est subordonn&#233; au respect des conditions pr&#233;vues au&#160;III de l&#8217;article&#160;81&#160;<i>quater</i> du code g&#233;n&#233;ral des imp&#244;ts.</p><p style=\"text-align: justify;\">&#171;&#160;Le b&#233;n&#233;fice de la majoration mentionn&#233;e au&#160;I est subordonn&#233; au respect des dispositions du r&#232;glement&#160;(CE) n&#176;&#160;1998/2006 de la Commission du&#160;15&#160;d&#233;cembre&#160;2006 concernant l&#8217;application des articles&#160;87 et&#160;88 du trait&#233; aux aides de&#160;minimis.</p><p style=\"text-align: justify;\">&#171;&#160;IV.&#160;&#8211;&#160;Les employeurs b&#233;n&#233;ficiant de la d&#233;duction forfaitaire se conforment aux obligations d&#233;claratives pr&#233;vues par le&#160;IV de l&#8217;article L.&#160;241&#8209;17 du pr&#233;sent code.&#160;&#187;</p><p style=\"text-align: justify;\">III.&#160;&#8211;&#160;Les dispositions du B du II sont applicables aux r&#233;mun&#233;rations per&#231;ues &#224; raison des heures de travail accomplies &#224; compter du&#160;1<sup>er</sup>&#160;janvier&#160;2018, avec effet r&#233;troactif pour les r&#233;mun&#233;rations per&#231;ues d&#232;s le&#160;1<sup>er</sup>&#160;juillet&#160;2017.</p><p style=\"text-align: justify;\">IV.&#160;&#8211;&#160;La perte de recettes pour les organismes de s&#233;curit&#233; sociale est compens&#233;e &#224; due concurrence par la cr&#233;ation d&#8217;une taxe additionnelle aux droits vis&#233;s aux articles&#160;575 et&#160;575&#160;A du code g&#233;n&#233;ral des imp&#244;ts.</p><p style=\"text-align: justify;\">V.&#160;&#8211;&#160;La perte de recettes pour l&#8217;&#201;tat est compens&#233;e &#224; due concurrence par la cr&#233;ation d&#8217;une taxe additionnelle aux droits vis&#233;s aux articles&#160;575 et&#160;575&#160;A du code g&#233;n&#233;ral des imp&#244;ts.</p>",
    "exposeSommaire": "<p style=\"text-align: justify;\">La suppression de la d&#233;fiscalisation des heures suppl&#233;mentaires a entrain&#233; une chute du pouvoir d&#8217;achat pour de nombreux salari&#233;s, et plus particuli&#232;rement pour des salari&#233;s modestes et moyens.</p><p style=\"text-align: justify;\">Elle a constitu&#233; un tr&#232;s mauvais signal vis-&#224;-vis ceux qui travaillent, qui doivent &#234;tre encourag&#233;s et r&#233;compens&#233;s s&#8217;ils souhaitent fournir des efforts suppl&#233;mentaires.</p><p style=\"text-align: justify;\">La d&#233;fiscalisation des heures suppl&#233;mentaires b&#233;n&#233;ficiait aux salari&#233;s comme aux entreprises, en leur permettant, dans le cadre d&#8217;un r&#233;el dialogue social, de s&#8217;affranchir des contraintes des trente-cinq heures. Les salari&#233;s voyaient leurs revenus augmenter, et les entreprises pouvaient s&#8217;organiser avec plus de flexibilit&#233; et s&#8217;adapter ainsi aux p&#233;riodes de crises et aux variations d&#8217;activit&#233;s.</p><p style=\"text-align: justify;\">Il convient donc de r&#233;tablir la d&#233;fiscalisation des heures suppl&#233;mentaires. C&#8217;est le sens du pr&#233;sent amendement.</p>"
  },
  "representations": [
    {
      "nom": "PDF",
      "typeMime": {
        "type": "application",
        "subType": "PDF"
      },
      "statutRepresentation": {
        "verbatim": true,
        "canonique": true,
        "officielle": true,
        "transcription": false,
        "enregistrement": false
      },
      "contenu": {
        "documentURI": "/15/amendements/0235A/AN/295.pdf"
      }
    }
  ],
  "seanceDiscussion": "RUANR5L15S2018IDS20700",
  "sort": {
    "dateSaisie": "2017-10-21T00:51:20.000+02:00",
    "sortEnSeance": "Rejeté"
  },
  "dateDepot": "2017-10-12T02:00:00.000+02:00",
  "dateDistribution": "2017-10-16T02:00:00.000+02:00",
  "article99": "0",
  "loiReference": {}
}