{
  "uid": "AMANR5L15SEA717460BTC0857P0D1N639",
  "identifiant": {
    "legislature": "15",
    "numero": "639",
    "numRect": "0",
    "saisine": {
      "texteLegislatifRef": "PRJLANR5L15BTC0857",
      "numeroPartiePLF": "0",
      "organeExamen": "PO717460",
      "mentionSecondeDeliberation": "0"
    }
  },
  "numeroLong": "639",
  "etapeTexte": "1ère lecture (1ère assemblée saisie)",
  "triAmendement": "bdns",
  "cardinaliteAmdtMultiples": "1",
  "etat": "Discuté",
  "signataires": {
    "auteur": {
      "typeAuteur": "Depute",
      "acteurRef": "PA330240",
      "groupePolitiqueRef": "PO730934"
    },
    "cosignatairesRefs": [
      "PA342935",
      "PA2492",
      "PA606098",
      "PA330240",
      "PA709315",
      "PA266793",
      "PA267527",
      "PA330788",
      "PA334654",
      "PA267200",
      "PA334843",
      "PA267785",
      "PA721506",
      "PA605991",
      "PA2155",
      "PA721286",
      "PA267901",
      "PA340853",
      "PA2792"
    ],
    "texteAffichable": "M.&#160;Ciotti,  M.&#160;Ramadier, M.&#160;Quentin, M.&#160;Kamardine, M.&#160;Saddier, M.&#160;Leclerc, M.&#160;Marleix, M.&#160;Huyghe, M.&#160;Straumann, M.&#160;Larriv&#233;, M.&#160;Viala, M.&#160;Bony, Mme&#160;Kuster, M.&#160;Verch&#232;re, M.&#160;Taugourdeau, M.&#160;Menuel, M.&#160;Reyn&#232;s, Mme&#160;Marianne&#160;Dubois et Mme&#160;Genevard"
  },
  "pointeurFragmentTexte": {
    "division": {
      "titre": "Article 33 bis",
      "articleDesignationCourte": "APRÈS ART. 33 BIS",
      "type": "ARTICLE",
      "avantAApres": "Apres",
      "divisionRattachee": "APRÈS L'ARTICLE 33 BIS, insérer l'article suivant:",
      "articleAdditionnel": "1",
      "urlDivisionTexteVise": "/15/textes/0857.asp#D_Article_33_bis"
    }
  },
  "corps": {
    "dispositif": "<p style=\"text-align: justify;\">&#192; l&#8217;article L.&#160;411&#8209;1 du code de l&#8217;entr&#233;e et du s&#233;jour des &#233;trangers et du droit d&#8217;asile, la premi&#232;re occurrence des mots&#160;: &#171;&#160;dix-huit&#160;&#187;, est remplac&#233;e par les mots&#160;: &#171;&#160;vingt-quatre&#160;&#187;.</p>",
    "exposeSommaire": "<p style=\"text-align: justify;\">Les conditions du regroupement familial doivent &#234;tre durcies . Institu&#233; dans un contexte historique particulier dans les ann&#233;es&#160;1970, le regroupement familial n&#8217;a cess&#233; d&#8217;&#234;tre &#233;tendu depuis cette date par la loi et la jurisprudence. Compte tenu de la situation sociale et &#233;conomique du pays, il est souhaitable de restreindre aujourd&#8217;hui ce droit.</p><p style=\"text-align: justify;\">Le regroupement familial a permis la d&#233;livrance de plus de 23 000 titres de s&#233;jour en 2017.</p><p style=\"text-align: justify;\">Le pr&#233;sent amendement pr&#233;voit qu&#8217;il sera possible de d&#233;poser la demande apr&#232;s&#160;2 ans de r&#233;sidence r&#233;guli&#232;re (au lieu de&#160;18 mois actuellement&#160;&#8211;&#160;12 mois pour les Alg&#233;riens).</p>"
  },
  "representations": [
    {
      "nom": "PDF",
      "typeMime": {
        "type": "application",
        "subType": "PDF"
      },
      "statutRepresentation": {
        "verbatim": true,
        "canonique": true,
        "officielle": true,
        "transcription": false,
        "enregistrement": false
      },
      "contenu": {
        "documentURI": "/15/amendements/0857/AN/639.pdf"
      }
    }
  ],
  "seanceDiscussion": "RUANR5L15S2018IDS21078",
  "sort": {
    "dateSaisie": "2018-04-22T20:00:16.000+02:00",
    "sortEnSeance": "Rejeté"
  },
  "dateDepot": "2018-04-12T02:00:00.000+02:00",
  "dateDistribution": "2018-04-16T02:00:00.000+02:00",
  "article99": "0",
  "loiReference": {
    "codeLoi": "c entrée et séjour étrangers",
    "divisionCodeLoi": "L411-1"
  }
}