{
  "uid": "AMANR5L15SEA717460BTC0164P0D1N256",
  "identifiant": {
    "legislature": "15",
    "numero": "256",
    "numRect": "0",
    "saisine": {
      "texteLegislatifRef": "PRJLANR5L15BTC0164",
      "numeroPartiePLF": "0",
      "organeExamen": "PO717460",
      "mentionSecondeDeliberation": "0"
    }
  },
  "numeroLong": "256",
  "etapeTexte": "1ère lecture (2ème assemblée saisie)",
  "triAmendement": "bbc",
  "cardinaliteAmdtMultiples": "1",
  "etat": "Discuté",
  "signataires": {
    "auteur": {
      "typeAuteur": "Depute",
      "acteurRef": "PA721960",
      "groupePolitiqueRef": "PO730958"
    },
    "cosignatairesRefs": [
      "PA2150",
      "PA721202",
      "PA721210",
      "PA720422",
      "PA721062",
      "PA720846",
      "PA719578",
      "PA722142",
      "PA719676",
      "PA718868",
      "PA721226",
      "PA721960",
      "PA588884",
      "PA720892",
      "PA720430",
      "PA718860",
      "PA720286"
    ],
    "texteAffichable": "Mme&#160;Obono,  Mme&#160;Autain, M.&#160;Bernalicis, M.&#160;Coquerel, M.&#160;Corbi&#232;re, Mme&#160;Fiat, M.&#160;Lachaud, M.&#160;Larive, M.&#160;M&#233;lenchon, Mme&#160;Panot, M.&#160;Prud&apos;homme, M.&#160;Quatennens, M.&#160;Ratenon, Mme&#160;Ressiguier, Mme&#160;Rubin, M.&#160;Ruffin et Mme&#160;Taurine"
  },
  "pointeurFragmentTexte": {
    "division": {
      "titre": "Article 4",
      "articleDesignationCourte": "ART. 4",
      "type": "ARTICLE",
      "avantAApres": "A",
      "divisionRattachee": "ARTICLE 4",
      "urlDivisionTexteVise": "/15/textes/0164.asp#D_Article_4"
    }
  },
  "corps": {
    "dispositif": "<p>Supprimer cet article.</p>",
    "exposeSommaire": "<p style=\"text-align: justify;\">Par ce projet de loi et par cet article, le Gouvernement continue une surench&#232;re s&#233;curitaire qui ne prot&#232;ge pas, mais au contraire affaiblit et fait le jeu des assaillants.</p><p style=\"text-align: justify;\">En effet, l&#8217;utilisation dans une dur&#233;e particuli&#232;rement longue (six prorogations de l&#8217;&#233;tat d&#8217;urgence depuis novembre 2015) des mesures exceptionnelles permises par cet &#233;tat d&#8217;exception, n&#8217;a jusqu&#8217;ici pas fait preuve de son efficacit&#233; dans la lutte contre les actes de terrorisme. Cela a &#233;t&#233; notamment rappel&#233; par le dernier rapport de contr&#244;le parlementaire de l&#8217;&#233;tat d&#8217;urgence du 6 d&#233;cembre 2016.</p><p style=\"text-align: justify;\">Quel int&#233;r&#234;t donc, autre que purement politicien, que d&#8217;inscrire certaines de ces mesures d&#8217;exception dans le droit commun, alors que l&#8217;&#233;tat d&#8217;urgence doit rester par nature un r&#233;gime juridique d&#233;rogatoire, temporaire&#8230; sauf &#224; saper les fondements m&#234;mes de notre &#233;tat de droit&#160;?</p><p style=\"text-align: justify;\">Cette restriction / diminution / limitation permanente de garanties actuellement associ&#233;es &#224; l&#8217;&#233;tat de droit est donc non seulement inefficace, contreproductive, mais profond&#233;ment injustifi&#233;e et dangereuse pour les droits et libert&#233;s fondamentaux. Ce d&#8217;autant plus que l&#8217;utilisation de l&#8217;&#233;tat d&#8217;urgence a &#233;t&#233; d&#233;voy&#233;e, d&#233;tourn&#233;e a de nombreuses reprises depuis 2015, pour viser des militants politiques, &#233;cologistes et syndicaux, tel que l&#8217;avait notamment d&#233;nonc&#233; la Commission nationale consultative des droits de l&#8217;homme.</p><p style=\"text-align: justify;\">Une sortie par le haut, victorieuse de la menace terroriste m&#234;me qui a induit le recours initial &#224; l&#8217;&#233;tat d&#8217;urgence implique non pas de rendre celui-ci permanent, mais au contraire de revenir &#224; une vie d&#233;mocratique normale, particuli&#232;rement soucieuse et protectrice des droits et libert&#233;s garantis par notre Constitution et nos lois r&#233;publicaines.</p><p style=\"text-align: justify;\">C&#8217;est par un renforcement des moyens humains et financiers des forces de l&#8217;ordre et des services de renseignement, dans le cadre de l&#8217;&#233;tat de droit, que nous pourrons contrer efficacement, fermement, et de mani&#232;re p&#233;renne, tous types de menaces.</p><p style=\"text-align: justify;\">Par cet article, le Gouvernement souhaite faire rentrer de force dans le droit commun les &#171;&#160;perquisitions&#160;&#187;, en les renommant &#171;&#160;visites&#160;&#187; et en leur adjoignant des &#171;&#160;retenues&#160;&#187;. Celles-ci sont tout autant particuli&#232;rement attentatoires &#224; la libert&#233; d&#8217;aller et de venir et au droit &#224; la vie priv&#233;e. En outre, la pratique de l&#8217;&#233;tat d&#8217;urgence&#160;&#8211;&#160;et notamment les nombreuses annulations de telles d&#233;cisions par des juges administratifs - a montr&#233; qu&#8217;elles sont prises &#224; l&#8217;&#233;gard de personnes &#224; l&#8217;&#233;gard desquelles il existe par d&#233;finition tr&#232;s peu voire aucun &#233;l&#233;ment autre que des suspicions (les fameuses notes blanches&#8230;). Enfin, ces mesures sont inutiles car le droit existant est d&#8217;ores et d&#233;j&#224; suffisant, &#224; savoir dans le cadre d&#8217;une proc&#233;dure r&#233;pressive, avec l&#8217;intervention d&#8217;un juge.</p><p style=\"text-align: justify;\">Donner &#224; l&#8217;autorit&#233; administrative ces pr&#233;rogatives dans le droit commun, hors situation d&#8217;urgence constitue un basculement vers une soci&#233;t&#233; du soup&#231;on g&#233;n&#233;ralis&#233;.</p>"
  },
  "representations": [
    {
      "nom": "PDF",
      "typeMime": {
        "type": "application",
        "subType": "PDF"
      },
      "statutRepresentation": {
        "verbatim": true,
        "canonique": true,
        "officielle": true,
        "transcription": false,
        "enregistrement": false
      },
      "contenu": {
        "documentURI": "/15/amendements/0164/AN/256.pdf"
      }
    }
  ],
  "seanceDiscussion": "RUANR5L15S2017IDS20672",
  "sort": {
    "dateSaisie": "2017-09-27T15:57:26.000+02:00",
    "sortEnSeance": "Rejeté"
  },
  "dateDepot": "2017-09-21T02:00:00.000+02:00",
  "dateDistribution": "2017-09-22T02:00:00.000+02:00",
  "article99": "0",
  "loiReference": {}
}