{
  "uid": "AMANR5L15PO757134B1088P0D1N2223",
  "identifiant": {
    "legislature": "15",
    "numero": "2223",
    "numRect": "0",
    "saisine": {
      "texteLegislatifRef": "PRJLANR5L15B1088",
      "numeroPartiePLF": "0",
      "organeExamen": "PO757134",
      "mentionSecondeDeliberation": "0"
    }
  },
  "numeroLong": "2223",
  "etapeTexte": "1ère lecture (1ère assemblée saisie)",
  "triAmendement": "agaaaaaaaaaaaaaaaaaaaaaaaaaaaaaaaaaaaaaaaaaaaaaaaajf",
  "cardinaliteAmdtMultiples": "1",
  "etat": "Discuté",
  "signataires": {
    "auteur": {
      "typeAuteur": "Depute",
      "acteurRef": "PA721474",
      "groupePolitiqueRef": "PO730934"
    },
    "cosignatairesRefs": [
      "PA721474"
    ],
    "texteAffichable": "M.&#160;Viry"
  },
  "pointeurFragmentTexte": {
    "division": {
      "titre": "Article 5",
      "articleDesignationCourte": "ART. 5",
      "type": "ARTICLE",
      "avantAApres": "A",
      "divisionRattachee": "ARTICLE 5",
      "urlDivisionTexteVise": "/15/textes/1088.asp#D_Article_5"
    },
    "alinea": {
      "avantAApres": "A",
      "numero": "12",
      "alineaDesignation": "Alinéa 12"
    }
  },
  "corps": {
    "dispositif": "<p style=\"text-align: justify;\">&#192; la premi&#232;re phrase de l&#8217;alin&#233;a&#160;12, supprimer le mot&#160;:</p><p style=\"text-align: justify;\">&#171;&#160;conjointement&#160;&#187;.</p>",
    "exposeSommaire": "<p>La loi de finances pour 2018 a supprim&#233;, &#224; compter du 1er janvier 2018, la taxe fiscale affect&#233;e (TFA) qui alimente le Fonds national de promotion et de communication de l&#8217;artisanat (FNPCA). La TFA provient d&#8217;une majoration de 10 % de la taxe pour frais de chambres de m&#233;tiers (art. 1601 A du CGI) et repr&#233;sente une contribution de 11&#160;&#8364; par an, pour chaque entreprise artisanale.</p><p>La suppression de cette taxe emporte de facto la suppression du FNPCA, dont l&#8217;objet est de contribuer au financement d&#8217;actions de promotion et de communication &#224; caract&#232;re national en faveur de l&#8217;artisanat.</p><p>Or ce dispositif de mutualisation est pleinement voulu par les artisans car il s&#8217;agit du seul moyen pour leurs entreprises d&#8217;acc&#233;der &#224; une communication grand public d&#8217;envergure&#160;: depuis sa cr&#233;ation en 1997, le FNPCA a contribu&#233; &#224; installer durablement, dans l&#8217;esprit du public, une image positive de l&#8217;artisanat et une valorisation essentielle de ses m&#233;tiers. Il a permis de stimuler l&#8217;orientation des jeunes vers l&#8217;apprentissage et l&#8217;emploi dans l&#8217;artisanat. C&#8217;est gr&#226;ce &#224; ce dispositif que l&#8217;Artisanat est aujourd&#8217;hui reconnu par une majorit&#233; des Fran&#231;ais comme &#171;&#160;la Premi&#232;re entreprise de France&#160;&#187;.</p><p>L&#8217;article 5 vise &#224; garantir la continuation du principe de mutualisation, auquel les repr&#233;sentants de l&#8217;artisanat sont attach&#233;s.</p><p>Modifiant la loi n&#176; 96-603 du 5 juillet 1996 relative au d&#233;veloppement et &#224; la promotion du commerce et de l'artisanat, l&#8217;article 5 vise &#224; habiliter les organisations professionnelles d&#8217;employeurs reconnues repr&#233;sentatives au niveau national et interprofessionnel, en application de l&#8217;article L. 2152-6 du code du travail, &#224; conclure un accord pour mettre en &#339;uvre des actions collectives de communication et de promotion &#224; caract&#232;re national en faveur de l&#8217;artisanat et des entreprises artisanales qui sont d&#233;finies &#224; l&#8217;article 19 de la loi n&#176; 96-603 du 5 juillet 1996 pr&#233;cit&#233;e.</p><p>Ce m&#233;canisme de substitution est compatible avec les r&#232;gles du droit europ&#233;en et reposera sur une contribution priv&#233;e, port&#233;e par un organisme priv&#233;.</p><p>Le pr&#233;sent amendement a pour objet de sp&#233;cifier que lesdites organisations doivent faire la preuve de leur repr&#233;sentativit&#233; interprofessionnelle sur le champ de l&#8217;artisanat et que l&#8217;accord est r&#233;put&#233; valide, y compris dans le cas o&#249; une seule organisation professionnelle d&#8217;employeurs int&#233;ress&#233;e par l&#8217;artisanat et reconnue repr&#233;sentative au niveau national et interprofessionnel en serait signataire.</p>"
  },
  "representations": [
    {
      "nom": "PDF",
      "typeMime": {
        "type": "application",
        "subType": "PDF"
      },
      "statutRepresentation": {
        "verbatim": true,
        "canonique": true,
        "officielle": true,
        "transcription": false,
        "enregistrement": false
      },
      "contenu": {
        "documentURI": "/15/amendements/1088/CSPACTE/2223.pdf"
      }
    }
  ],
  "sort": {
    "dateSaisie": "2018-09-06T21:58:52.000+02:00",
    "sortEnSeance": "Non soutenu"
  },
  "dateDepot": "2018-09-03T02:00:00.000+02:00",
  "dateDistribution": "2018-09-05T02:00:00.000+02:00",
  "article99": "0",
  "loiReference": {}
}