{
  "uid": "AMANR5L15PO766718B2187P0D1N88",
  "identifiant": {
    "legislature": "15",
    "numero": "88",
    "numRect": "0",
    "saisine": {
      "texteLegislatifRef": "PRJLANR5L15B2187",
      "numeroPartiePLF": "0",
      "organeExamen": "PO766718",
      "mentionSecondeDeliberation": "0"
    }
  },
  "numeroLong": "88",
  "etapeTexte": "1ère lecture (1ère assemblée saisie)",
  "triAmendement": "dkaaaaaaaaaaaaaaaaaaaaaaaaaaaaaaaaaaaaaaaaaaaaaaaanmubtzzwzzzzzzzzzzzzw",
  "cardinaliteAmdtMultiples": "1",
  "etat": "Discuté",
  "signataires": {
    "auteur": {
      "typeAuteur": "Depute",
      "acteurRef": "PA330008",
      "groupePolitiqueRef": "PO730934"
    },
    "cosignatairesRefs": [
      "PA721286",
      "PA722390",
      "PA330008"
    ],
    "texteAffichable": "M.&#160;Breton,  Mme&#160;Corneloup et M.&#160;Ramadier"
  },
  "pointeurFragmentTexte": {
    "division": {
      "titre": "Article 14",
      "articleDesignationCourte": "ART. 14",
      "type": "ARTICLE",
      "avantAApres": "A",
      "divisionRattachee": "ARTICLE 14",
      "urlDivisionTexteVise": "/15/textes/2187.asp#D_Article_14"
    },
    "alinea": {
      "avantAApres": "Apres",
      "numero": "10"
    }
  },
  "corps": {
    "dispositif": "<p style=\"text-align: justify;\">Apr&#232;s l&#8217;alin&#233;a&#160;10, ins&#233;rer l&#8217;alin&#233;a suivant&#160;: </p><p style=\"text-align: justify;\">&#171;&#160;Aucune recherche sur l&#8217;embryon humain ne peut &#234;tre autoris&#233;e pour l&#8217;ex&#233;cution de travaux de recherche portant sur la mod&#233;lisation des pathologies et sur le criblage des mol&#233;cules.&#160;&#187;</p>",
    "exposeSommaire": "<p style=\"text-align: justify;\">En admettant que l&#8217;on puisse autoriser les recherches sur l&#8217;embryon humain lorsqu&#8217;elles sont &#171;&#160;susceptibles de permettre des progr&#232;s m&#233;dicaux majeurs&#160;&#187; ou &#171;&#160;finalit&#233; m&#233;dicale&#160;&#187;, il faut alors d&#233;finir ce qu&#8217;on entend par le terme &#171;&#160;m&#233;dical&#160;&#187;.</p><p style=\"text-align: justify;\">&#160;Il ne saurait &#234;tre question d&#8217;autoriser la recherche sur embryon humain pour la recherche pharmaceutique et d&#8217;utiliser des cellules embryonnaires dans ce but. Quant aux techniques d&#8217;AMP, leur am&#233;lioration peut r&#233;sulter de la recherche sur les cellules souches animales sans que l&#8217;on ait besoin de recourir aux cellules souches embryonnaires. Il faut donc exclure totalement ces recherches.</p><p style=\"text-align: justify;\">&#160;</p>"
  },
  "representations": [
    {
      "nom": "PDF",
      "typeMime": {
        "type": "application",
        "subType": "PDF"
      },
      "statutRepresentation": {
        "verbatim": true,
        "canonique": true,
        "officielle": true,
        "transcription": false,
        "enregistrement": false
      },
      "contenu": {
        "documentURI": "/15/amendements/2187/CSBIOETH/88.pdf"
      }
    }
  ],
  "sort": {
    "dateSaisie": "2019-09-13T15:45:41.000+02:00",
    "sortEnSeance": "Rejeté"
  },
  "dateDepot": "2019-08-01T02:00:00.000+02:00",
  "dateDistribution": "2019-09-11T02:00:00.000+02:00",
  "article99": "0",
  "loiReference": {}
}