{
  "uid": "AMANR5L15PO59051B1802P0D1N687",
  "identifiant": {
    "legislature": "15",
    "numero": "687",
    "numRect": "0",
    "saisine": {
      "texteLegislatifRef": "PRJLANR5L15B1802",
      "numeroPartiePLF": "0",
      "organeExamen": "PO59051",
      "mentionSecondeDeliberation": "0"
    }
  },
  "numeroLong": "CL687",
  "etapeTexte": "1ère lecture (1ère assemblée saisie)",
  "triAmendement": "aiaaaaaaaaaaaaaaaaaaaaaaaaaaaaaaaaaaaaaaaaaaaaaaaabqbkp",
  "cardinaliteAmdtMultiples": "1",
  "etat": "Discuté",
  "signataires": {
    "auteur": {
      "typeAuteur": "Depute",
      "acteurRef": "PA721296",
      "groupePolitiqueRef": "PO730964"
    },
    "cosignatairesRefs": [
      "PA719994",
      "PA721616",
      "PA720378",
      "PA720370",
      "PA720318",
      "PA721702",
      "PA720154",
      "PA721800",
      "PA721364",
      "PA719692",
      "PA718918",
      "PA606507",
      "PA721296",
      "PA721398",
      "PA721792",
      "PA721880",
      "PA2449",
      "PA721624",
      "PA722292",
      "PA721908",
      "PA722150",
      "PA719302",
      "PA719952",
      "PA720908",
      "PA2828",
      "PA719202",
      "PA719684",
      "PA720454",
      "PA721142",
      "PA643127",
      "PA719616",
      "PA722398",
      "PA719866",
      "PA677483",
      "PA721262",
      "PA721584"
    ],
    "texteAffichable": "M.&#160;Gouffier-Cha,  Mme&#160;Moutchou, Mme&#160;Abadie, Mme&#160;Avia, M.&#160;Boudi&#233;, Mme&#160;Braun-Pivet, Mme&#160;Degois, Mme&#160;Dubost, Mme&#160;Dubr&#233;-Chirat, M.&#160;Eliaou, M.&#160;Euzet, M.&#160;Fauvergue, Mme&#160;Forteza, M.&#160;Gauvain, Mme&#160;Guerel, Mme&#160;Gu&#233;venoux, M.&#160;Houbron, M.&#160;Houli&#233;, Mme&#160;Kamowski, M.&#160;Lioger, Mme&#160;Louis, M.&#160;Matras, M.&#160;Mazars, M.&#160;Mendes, M.&#160;Mis, M.&#160;Paris, M.&#160;Pont, M.&#160;Questel, M.&#160;Rebeyrotte, M.&#160;Rudigoz, M.&#160;Rupin, M.&#160;Terlier, Mme&#160;Thourot, M.&#160;Tourret, M.&#160;Vuilletet, Mme&#160;Zannier et les membres du groupe La R&#233;publique en Marche"
  },
  "pointeurFragmentTexte": {
    "division": {
      "titre": "Article 3",
      "articleDesignationCourte": "ART. 3",
      "type": "ARTICLE",
      "avantAApres": "A",
      "divisionRattachee": "ARTICLE 3",
      "urlDivisionTexteVise": "/15/textes/1802.asp#D_Article_3"
    },
    "alinea": {
      "avantAApres": "Apres",
      "numero": "8"
    }
  },
  "corps": {
    "dispositif": "<p style=\"text-align: justify;\">I.&#160;&#8211;&#160;Apr&#232;s l&#8217;alin&#233;a&#160;8, ins&#233;rer l&#8217;alin&#233;a suivant&#160;:</p><p style=\"text-align: justify;\">&#171;&#160;3&#176;&#160;<i>bis</i>&#160;Aux enjeux et aux politiques d&#8217;&#233;galit&#233; professionnelle et &#224; la lutte contre les discriminations&#160;;&#160;&#187;.</p><p style=\"text-align: justify;\">II.&#160;&#8211;&#160;En cons&#233;quence, proc&#233;der &#224; la m&#234;me insertion apr&#232;s les alin&#233;as 48, 72, 87 et 110.</p><p style=\"text-align: justify;\"><br /><br /></p>",
    "exposeSommaire": "<p style=\"text-align: justify;\">Cet amendement vise &#224; inclure les enjeux relatifs &#224; l'&#233;galit&#233; professionnelle, notamment entre les femmes et les hommes, et &#224; la lutte contre les discriminations dans le champ d'intervention des comit&#233;s sociaux au sein des trois versants de la fonction publique.</p><p>Ces questions sp&#233;cifiques doivent appara&#238;tre explicitement comme &#233;tant l'un des domaines d'attribution de ces instances consultatives, afin de consacrer la prise en compte de ces enjeux dans le dialogue social.</p>"
  },
  "representations": [
    {
      "nom": "PDF",
      "typeMime": {
        "type": "application",
        "subType": "PDF"
      },
      "statutRepresentation": {
        "verbatim": true,
        "canonique": true,
        "officielle": true,
        "transcription": false,
        "enregistrement": false
      },
      "contenu": {
        "documentURI": "/15/amendements/1802/CION_LOIS/CL687.pdf"
      }
    }
  ],
  "sort": {
    "dateSaisie": "2019-05-02T11:44:16.000+02:00",
    "sortEnSeance": "Adopté"
  },
  "dateDepot": "2019-04-29T02:00:00.000+02:00",
  "dateDistribution": "2019-05-01T02:00:00.000+02:00",
  "article99": "0",
  "loiReference": {
    "codeLoi": "2 DC id"
  }
}