{
  "uid": "AMANR5L15PO419865B0627P0D1N265",
  "identifiant": {
    "legislature": "15",
    "numero": "265",
    "numRect": "0",
    "saisine": {
      "texteLegislatifRef": "PRJLANR5L15B0627",
      "numeroPartiePLF": "0",
      "organeExamen": "PO419865",
      "mentionSecondeDeliberation": "0"
    }
  },
  "numeroLong": "CD265",
  "etapeTexte": "1ère lecture (1ère assemblée saisie)",
  "triAmendement": "bawnw",
  "cardinaliteAmdtMultiples": "1",
  "etat": "Discuté",
  "signataires": {
    "auteur": {
      "typeAuteur": "Depute",
      "acteurRef": "PA719412",
      "groupePolitiqueRef": "PO730964"
    },
    "cosignatairesRefs": [
      "PA719922",
      "PA719092",
      "PA721426",
      "PA720054",
      "PA719412",
      "PA718894",
      "PA719080",
      "PA721372",
      "PA721876",
      "PA718802",
      "PA719882",
      "PA719740",
      "PA718728",
      "PA721600",
      "PA718710",
      "PA720944",
      "PA605518",
      "PA720242",
      "PA722366",
      "PA721514",
      "PA609520",
      "PA720038",
      "PA720310",
      "PA720278",
      "PA719632",
      "PA722000",
      "PA720414",
      "PA719890",
      "PA720538",
      "PA606171",
      "PA721860",
      "PA718962",
      "PA719972",
      "PA722336",
      "PA719624",
      "PA722236",
      "PA719194",
      "PA605084",
      "PA722228"
    ],
    "texteAffichable": "Mme&#160;Le Feur,  M.&#160;Orphelin, M.&#160;Zulesi, M.&#160;Djebbari, Mme&#160;Abba, M.&#160;Arend, Mme&#160;Pascale&#160;Boyer, Mme&#160;Brulebois, M.&#160;Buchou, M.&#160;Causse, M.&#160;Cesarini, M.&#160;Colas-Roy, Mme&#160;Couillard, Mme&#160;Yolaine&#160;de Courson, Mme&#160;De Temmerman, M.&#160;Dombreval, M.&#160;Fugit, M.&#160;Haury, Mme&#160;Josso, Mme&#160;Kerbarh, M.&#160;Krabal, M.&#160;Fran&#231;ois-Michel&#160;Lambert, M.&#160;Leclabart, Mme&#160;Marsaud, Mme&#160;Meynier-Millefert, M.&#160;Morenas, Mme&#160;Panonacle, Mme&#160;Park, M.&#160;Perea, M.&#160;Perrot, M.&#160;Pichereau, Mme&#160;Pompili, Mme&#160;Riotton, Mme&#160;Rossi, Mme&#160;Sarles, M.&#160;Thi&#233;baut, Mme&#160;Tuffnell, Mme&#160;Vanceunebrock-Mialon, M.&#160;Ferrand et les membres du groupe La R&#233;publique en Marche"
  },
  "pointeurFragmentTexte": {
    "division": {
      "titre": "Article 11",
      "articleDesignationCourte": "APRÈS ART. 11",
      "type": "ARTICLE",
      "avantAApres": "Apres",
      "divisionRattachee": "APRÈS L'ARTICLE 11, insérer l'article suivant:",
      "articleAdditionnel": "1",
      "urlDivisionTexteVise": "/15/textes/0627.asp#D_Article_11"
    }
  },
  "corps": {
    "dispositif": "<p style=\"text-align: justify;\">&#192; compter de la promulgation de la pr&#233;sente loi, l&#8217;indication de chaque pays d&#8217;origine est obligatoire pour tous les miels originaires de plus d&#8217;un &#201;tat membre ou de plus d&#8217;un pays tiers. Les conditions d&#8217;application du pr&#233;sent article sont pr&#233;cis&#233;es par d&#233;cret.</p>",
    "exposeSommaire": "<p style=\"text-align: justify;\">Le d&#233;cret actuel ne fournit pas une indication exhaustive de l&#8217;origine du miel. En effet l&#8217;obligation actuelle en cas de m&#233;lange de miels provenant de diff&#233;rents pays est l&#8217;indication globale suivante &#171; m&#233;lange de miels originaires/non originaires de l&#8217;Union&#160;europ&#233;enne&#160;&#187;. Cette indication impr&#233;cise ne permet qu&#8217;une lisibilit&#233; limit&#233;e du ou des pays d&#8217;origine(s) et peut tendre &#224; tromper les consommateurs comme stipul&#233; par l&#8217;&#233;tude de Juin 2016 de France Agrimer &#171; Une origine fran&#231;aise d&#233;clar&#233;e tr&#232;s importante pour les consommateurs, mais un d&#233;calage frappant entre la part r&#233;elle des miels fran&#231;ais disponibles sur le march&#233; et la perception des consommateurs qui pensent acheter essentiellement du miel fran&#231;ais (80&#160;% des achats en volume).&#160;&#187;</p>"
  },
  "representations": [
    {
      "nom": "PDF",
      "typeMime": {
        "type": "application",
        "subType": "PDF"
      },
      "statutRepresentation": {
        "verbatim": true,
        "canonique": true,
        "officielle": true,
        "transcription": false,
        "enregistrement": false
      },
      "contenu": {
        "documentURI": "/15/amendements/0627/CION-DVP/CD265.pdf"
      }
    }
  ],
  "sort": {
    "dateSaisie": "2018-03-28T00:43:31.000+02:00",
    "sortEnSeance": "Adopté"
  },
  "dateDepot": "2018-03-23T01:00:00.000+01:00",
  "dateDistribution": "2018-03-26T02:00:00.000+02:00",
  "article99": "0",
  "loiReference": {
    "codeLoi": "xxx"
  }
}