{
  "uid": "AMANR5L15PO419610B1831P0D1N58",
  "identifiant": {
    "legislature": "15",
    "numero": "58",
    "numRect": "0",
    "saisine": {
      "texteLegislatifRef": "PRJLANR5L15B1831",
      "numeroPartiePLF": "0",
      "organeExamen": "PO419610",
      "mentionSecondeDeliberation": "0"
    }
  },
  "numeroLong": "CE58",
  "etapeTexte": "1ère lecture (2ème assemblée saisie)",
  "triAmendement": "aasaaaaaaaaaaaaaaaaaaaaaaaaaaaaaaaaaaaaaaaaaaaaaaabhi",
  "cardinaliteAmdtMultiples": "1",
  "etat": "Discuté",
  "signataires": {
    "auteur": {
      "typeAuteur": "Depute",
      "acteurRef": "PA266808",
      "groupePolitiqueRef": "PO730934"
    },
    "cosignatairesRefs": [
      "PA605036",
      "PA266793",
      "PA767",
      "PA721678",
      "PA340853",
      "PA718884",
      "PA1029",
      "PA267204",
      "PA266808",
      "PA267735",
      "PA267901",
      "PA346218",
      "PA719318",
      "PA712015"
    ],
    "texteAffichable": "M.&#160;Rolland,  M.&#160;Sermier, M.&#160;Cattin, M.&#160;Masson, Mme&#160;Anthoine, Mme&#160;Bazin-Malgras, M.&#160;Leclerc, M.&#160;Bony, M.&#160;de Ganay, M.&#160;Dive, M.&#160;Reda, M.&#160;Abad, M.&#160;Kamardine et M.&#160;Deflesselles"
  },
  "pointeurFragmentTexte": {
    "division": {
      "titre": "RAPPORT ANNEXÉ",
      "articleDesignationCourte": "ART. 1ER A",
      "type": "ANNEXE",
      "avantAApres": "A",
      "divisionRattachee": "ARTICLE 1ER A",
      "urlDivisionTexteVise": "/15/textes/1831.asp#D_RAPPORT_ANNEXE"
    },
    "alinea": {
      "numero": "36"
    }
  },
  "corps": {
    "dispositif": "<p style=\"text-align: justify;\">&#192; l&#8217;alin&#233;a&#160;36, apr&#232;s le mot&#160;:</p><p style=\"text-align: justify;\">&#171;&#160;structurant&#160;&#187;,</p><p style=\"text-align: justify;\">ins&#233;rer les mots&#160;:</p><p style=\"text-align: justify;\">&#171;&#160;, notamment celui des trains d&#8217;&#233;quilibre du territoire et des trains d&#8217;am&#233;nagement du territoire,&#160;&#187;.</p>",
    "exposeSommaire": "<p style=\"text-align: justify;\">Cet amendement vise &#224; modifier le rapport annex&#233; et approuv&#233; par la loi afin d&#8217;y apporter des pr&#233;cisions permettant de&#160;souligner diff&#233;rents aspects importants pour les territoires de montagne. Ainsi&#160;:&#160;</p><p style=\"text-align: justify;\">-&#160;la pr&#233;cision dans l&#8217;alin&#233;a&#160;36 que l&#8217;&#201;tat reprendra une politique d&#8217;investissement dans les TET (trains d&#8217;&#233;quilibre du territoire.. que la r&#233;daction actuelle de l&#8217;alin&#233;a&#160;36 ne mentionne pas express&#233;ment) et les trains d&#8217;am&#233;nagement du territoire&#160;; rappelons que les r&#233;gions seront toutes d&#8217;ici 2020 les autorit&#233;s organisatrices des TET d&#8217;ici le 1<sup>er</sup> janvier 2020&#160;;) s&#8217;agissant des trains d&#8217;am&#233;nagement du territoire (au nombre de deux actuellement&#160;: Paris Brian&#231;on et Paris-Rodez), leur citation &#224; cet endroit du rapport laisse ouverte la possibilit&#233; d&#8217;en mettre en place de nouveaux, pour desservir les Pyr&#233;n&#233;es par exemple.</p>"
  },
  "representations": [
    {
      "nom": "PDF",
      "typeMime": {
        "type": "application",
        "subType": "PDF"
      },
      "statutRepresentation": {
        "verbatim": true,
        "canonique": true,
        "officielle": true,
        "transcription": false,
        "enregistrement": false
      },
      "contenu": {
        "documentURI": "/15/amendements/1831/CION-ECO/CE58.pdf"
      }
    }
  ],
  "sort": {
    "dateSaisie": "2019-05-07T18:00:21.000+02:00",
    "sortEnSeance": "Rejeté"
  },
  "dateDepot": "2019-05-02T02:00:00.000+02:00",
  "dateDistribution": "2019-05-06T02:00:00.000+02:00",
  "article99": "0",
  "loiReference": {}
}