{
  "uid": "AMANR5L15PO59051B1802P0D1N560",
  "identifiant": {
    "legislature": "15",
    "numero": "560",
    "numRect": "0",
    "saisine": {
      "texteLegislatifRef": "PRJLANR5L15B1802",
      "numeroPartiePLF": "0",
      "organeExamen": "PO59051",
      "mentionSecondeDeliberation": "0"
    }
  },
  "numeroLong": "CL560",
  "etapeTexte": "1ère lecture (1ère assemblée saisie)",
  "triAmendement": "alaaaaaaaaaaaaaaaaaaaaaaaaaaaaaaaaaaaaaaaaaaaaaaaabg",
  "cardinaliteAmdtMultiples": "1",
  "etat": "Discuté",
  "signataires": {
    "auteur": {
      "typeAuteur": "Depute",
      "acteurRef": "PA342601",
      "groupePolitiqueRef": "PO744425"
    },
    "cosignatairesRefs": [
      "PA342601"
    ],
    "texteAffichable": "M.&#160;Brindeau"
  },
  "pointeurFragmentTexte": {
    "division": {
      "titre": "Article 4",
      "articleDesignationCourte": "ART. 4",
      "type": "ARTICLE",
      "avantAApres": "A",
      "divisionRattachee": "ARTICLE 4",
      "urlDivisionTexteVise": "/15/textes/1802.asp#D_Article_4"
    }
  },
  "corps": {
    "dispositif": "<p style=\"text-align: justify;\">Supprimer cet article.</p>",
    "exposeSommaire": "<p>Cet amendement vise &#224; supprimer les nouvelles r&#232;gles de mission et de comp&#233;tence des commissions administratives paritaires mises en place par ce projet de loi.</p><p>En effet, la r&#233;organisation propos&#233;e vide en r&#233;alit&#233; les CAP d&#8217;une grande partie de leur substance.</p><p>Or, soustraire &#224; la d&#233;cision des CAP les avancements et promotions individuelles des agents pourra engendrer de nombreuses difficult&#233;s. La CAP et sa d&#233;cision coll&#233;giale est un filtre utile entre l&#8217;autorit&#233; administrative et l&#8217;agent dans la compr&#233;hension de la d&#233;cision prise, particuli&#232;rement lorsqu&#8217;il s&#8217;agit d&#8217;une d&#233;cision n&#233;gative. Enlever ce filtre c&#8217;est prendre le risque de voir augmenter substantiellement les recours gracieux comme contentieux et d&#8217;&#233;tablir ainsi un climat d&#233;l&#233;t&#232;re en lieu et place du dialogue actuellement satisfaisant.</p>"
  },
  "representations": [
    {
      "nom": "PDF",
      "typeMime": {
        "type": "application",
        "subType": "PDF"
      },
      "statutRepresentation": {
        "verbatim": true,
        "canonique": true,
        "officielle": true,
        "transcription": false,
        "enregistrement": false
      },
      "contenu": {
        "documentURI": "/15/amendements/1802/CION_LOIS/CL560.pdf"
      }
    }
  ],
  "sort": {
    "dateSaisie": "2019-05-02T13:00:52.000+02:00",
    "sortEnSeance": "Rejeté"
  },
  "dateDepot": "2019-04-29T02:00:00.000+02:00",
  "dateDistribution": "2019-05-01T02:00:00.000+02:00",
  "article99": "0",
  "loiReference": {}
}