{
  "uid": "AMANR5L15PO419610B1908P0D1N15",
  "identifiant": {
    "legislature": "15",
    "numero": "15",
    "numRect": "0",
    "saisine": {
      "texteLegislatifRef": "PRJLANR5L15B1908",
      "numeroPartiePLF": "0",
      "organeExamen": "PO419610",
      "mentionSecondeDeliberation": "0"
    }
  },
  "numeroLong": "CE15",
  "etapeTexte": "1ère lecture (1ère assemblée saisie)",
  "triAmendement": "asaaaaaaaaaaaaaaaaaaaaaaaaaaaaaaaaaaaaaaaaaaaaaaaae",
  "cardinaliteAmdtMultiples": "1",
  "etat": "Discuté",
  "signataires": {
    "auteur": {
      "typeAuteur": "Rapporteur",
      "acteurRef": "PA719972",
      "organeRef": "PO419865",
      "groupePolitiqueRef": "PO730964"
    },
    "cosignatairesRefs": [
      "PA719972"
    ],
    "texteAffichable": "Mme&#160;Sarles, rapporteure pour avis au nom de la commission du d&#233;veloppement durable et de l&apos;am&#233;nagement du territoire"
  },
  "pointeurFragmentTexte": {
    "division": {
      "titre": "Article 2",
      "articleDesignationCourte": "ART. 2",
      "type": "ARTICLE",
      "avantAApres": "A",
      "divisionRattachee": "ARTICLE 2",
      "urlDivisionTexteVise": "/15/textes/1908.asp#D_Article_2"
    },
    "alinea": {
      "avantAApres": "Apres",
      "numero": "6"
    }
  },
  "corps": {
    "dispositif": "<p>I.&#160;&#8211;&#160;Apr&#232;s l&#8217;alin&#233;a&#160;6, ins&#233;rer les sept alin&#233;as suivants&#160;:</p><p style=\"text-align: justify;\">&#171;&#160;II.&#160;&#8211;&#160;Le Haut Conseil pour le climat rend chaque ann&#233;e un rapport qui porte notamment sur&#160;:</p><p style=\"text-align: justify;\">&#171;&#160;1&#176;&#160;Le respect de la trajectoire de baisse des &#233;missions de gaz &#224; effet de serre au regard des budgets carbone d&#233;finis en application de l&#8217;article L.&#160;222&#8209;1&#160;A du pr&#233;sent code et de la strat&#233;gie bas-carbone mentionn&#233;e &#224; l&#8217;article L.&#160;222&#8209;1&#160;B&#160;;</p><p style=\"text-align: justify;\">&#171;&#160;2&#176;&#160;La mise en &#339;uvre et l&#8217;efficacit&#233; des politiques et mesures d&#233;cid&#233;es par l&#8217;&#201;tat et les collectivit&#233;s territoriales pour r&#233;duire les &#233;missions de gaz &#224; effet de serre, d&#233;velopper les puits de carbone, r&#233;duire l&#8217;empreinte carbone et d&#233;velopper l&#8217;adaptation au changement climatique, y compris les dispositions budg&#233;taires et fiscales&#160;;</p><p style=\"text-align: justify;\">&#171;&#160;3&#176;&#160;L&#8217;impact socio-&#233;conomique et environnemental, y compris pour la biodiversit&#233;, de ces diff&#233;rentes politiques publiques.</p><p style=\"text-align: justify;\">&#171;&#160;Dans ce rapport, le Haut Conseil met en perspective les engagements et les actions de la France par rapport &#224; ceux des autres pays. Il &#233;met des recommandations et propositions pour am&#233;liorer l&#8217;action de la France, les contributions des diff&#233;rents secteurs d&#8217;activit&#233; &#233;conomiques au respect des budgets carbone ainsi que la r&#233;gulation des &#233;missions de gaz &#224; effet de serre li&#233;es aux transports a&#233;ronautique et maritime internationaux.</p><p style=\"text-align: justify;\">&#171;&#160;Ce rapport est remis au Premier ministre et transmis au Parlement et au Conseil &#233;conomique, social et environnemental. &#192; l&#8217;occasion de la transmission de ce rapport, le pr&#233;sident du Haut Conseil pour le climat est auditionn&#233; par les commissions permanentes de l&#8217;Assembl&#233;e nationale et du S&#233;nat charg&#233;es de l&#8217;environnement et de l&#8217;&#233;nergie.</p><p style=\"text-align: justify;\">&#171;&#160;Les suites donn&#233;es par le Gouvernement aux recommandations et propositions de ce rapport sont pr&#233;sent&#233;es au Parlement et au Conseil &#233;conomique, social et environnemental dans les six mois suivant sa remise.&#160;&#187;</p><p style=\"text-align: justify;\">II.&#160;&#8211;&#160;En cons&#233;quence, au d&#233;but de l&#8217;alin&#233;a&#160;5, apr&#232;s la r&#233;f&#233;rence&#160;: &#171;&#160;L.&#160;132&#8209;4&#160;&#187;, ins&#233;rer la mention&#160;: &#171;&#160;I&#160;&#187;.</p>",
    "exposeSommaire": "<p>Le pr&#233;sent amendement vise &#224; d&#233;finir au niveau l&#233;gislatif le rapport annuel du Haut Conseil pour le climat ainsi que les modalit&#233;s de r&#233;ponse &#224; ses recommandations. La mention de la strat&#233;gie nationale bas-carbone&#160;est&#160;pr&#233;cis&#233;e. Ce rapport devrait &#233;mettre des recommandations et propositions pour am&#233;liorer les contributions des diff&#233;rents secteurs d&#8217;activit&#233; &#233;conomiques au respect des budgets carbone ainsi que la r&#233;gulation des &#233;missions de gaz &#224; effet de serre li&#233;es aux transports a&#233;ronautique et maritime internationaux.</p><p style=\"text-align: justify;\">Il est pr&#233;vu que le pr&#233;sident du Haut Conseil soit auditionn&#233; par les commissions permanentes charg&#233;es de l&#8217;environnement et de l&#8217;&#233;nergie de l&#8217;Assembl&#233;e nationale et du S&#233;nat &#224; l&#8217;occasion de la remise du rapport annuel.</p><p style=\"text-align: justify;\">Il est propos&#233; de pr&#233;voir que le Gouvernement r&#233;ponde aux recommandations et propositions du rapport. Les liens du Haut Conseil avec le Parlement ainsi que ses travaux s&#8217;en trouveraient renforc&#233;s.</p>"
  },
  "representations": [
    {
      "nom": "PDF",
      "typeMime": {
        "type": "application",
        "subType": "PDF"
      },
      "statutRepresentation": {
        "verbatim": true,
        "canonique": true,
        "officielle": true,
        "transcription": false,
        "enregistrement": false
      },
      "contenu": {
        "documentURI": "/15/amendements/1908/CION-ECO/CE15.pdf"
      }
    }
  ],
  "sort": {
    "dateSaisie": "2019-06-19T18:52:36.000+02:00",
    "sortEnSeance": "Adopté"
  },
  "dateDepot": "2019-06-05T02:00:00.000+02:00",
  "dateDistribution": "2019-06-18T02:00:00.000+02:00",
  "article99": "0",
  "loiReference": {}
}