{
  "uid": "AMANR5L15SEA717460BTC2401P0D1N826",
  "identifiant": {
    "legislature": "15",
    "numero": "826",
    "numRect": "0",
    "saisine": {
      "texteLegislatifRef": "PRJLANR5L15BTC2401",
      "numeroPartiePLF": "0",
      "organeExamen": "PO717460",
      "mentionSecondeDeliberation": "0"
    }
  },
  "numeroLong": "826",
  "etapeTexte": "1ère lecture (2ème assemblée saisie)",
  "triAmendement": "aioaaaaaaaaaaaaaaaaaaaaaaaaaaaaaaaaaaaaaaaaaaaaaaahy",
  "cardinaliteAmdtMultiples": "1",
  "etat": "Discuté",
  "signataires": {
    "auteur": {
      "typeAuteur": "Depute",
      "acteurRef": "PA606712",
      "groupePolitiqueRef": "PO730934"
    },
    "cosignatairesRefs": [
      "PA267378",
      "PA267901",
      "PA606712"
    ],
    "texteAffichable": "M.&#160;Lurton,  Mme&#160;Levy et M.&#160;Kamardine"
  },
  "pointeurFragmentTexte": {
    "division": {
      "titre": "Article 3",
      "articleDesignationCourte": "ART. 3",
      "type": "ARTICLE",
      "avantAApres": "A",
      "divisionRattachee": "ARTICLE 3",
      "urlDivisionTexteVise": "/15/textes/2401.asp#D_Article_3"
    },
    "alinea": {
      "avantAApres": "Apres",
      "numero": "6"
    }
  },
  "corps": {
    "dispositif": "<p style=\"text-align: justify;\">Compl&#233;ter cet article par l&#8217;alin&#233;a suivant&#160;:</p><p style=\"text-align: justify;\">&#171;&#160;Le maire d&#233;signe, par arr&#234;t&#233;, au sein du conseil municipal, le conseiller repr&#233;sentant la commune au sein de chaque commission de travail mise en place par l&#8217;&#233;tablissement public de coop&#233;ration intercommunale &#224; fiscalit&#233; propre.&#160;&#187;</p>",
    "exposeSommaire": "<p style=\"text-align: justify;\">Actuellement, l&#8217;article 3 du PJL pr&#233;voit d&#8217;une part, le remplacement d&#8217;un membre d&#8217;une commission par un conseiller municipal et, d&#8217;autre part, la possibilit&#233; pour tout conseiller municipal de participer sans droit de vote &#224; des commissions de travail. Ce n&#8217;est cependant pas suffisant : le maire doit pouvoir choisir lui-m&#234;me, librement, le conseiller municipal qui repr&#233;sentera la commune au sein de chacune des commissions de travail de l&#8217;EPCI.</p>"
  },
  "representations": [
    {
      "nom": "PDF",
      "typeMime": {
        "type": "application",
        "subType": "PDF"
      },
      "statutRepresentation": {
        "verbatim": true,
        "canonique": true,
        "officielle": true,
        "transcription": false,
        "enregistrement": false
      },
      "contenu": {
        "documentURI": "/15/amendements/2401/AN/826.pdf"
      }
    }
  ],
  "seanceDiscussion": "RUANR5L15S2020IDS21947",
  "sort": {
    "dateSaisie": "2019-11-18T23:34:51.000+01:00",
    "sortEnSeance": "Non soutenu"
  },
  "dateDepot": "2019-11-14T01:00:00.000+01:00",
  "dateDistribution": "2019-11-17T01:00:00.000+01:00",
  "article99": "0",
  "loiReference": {}
}