{
  "uid": "AMANR5L15SEA717460BTC0105P0D1N167",
  "identifiant": {
    "legislature": "15",
    "numero": "167",
    "numRect": "0",
    "saisine": {
      "texteLegislatifRef": "PRJLANR5L15BTC0105",
      "numeroPartiePLF": "0",
      "organeExamen": "PO717460",
      "mentionSecondeDeliberation": "0"
    }
  },
  "numeroLong": "167",
  "etapeTexte": "1ère lecture (2ème assemblée saisie)",
  "triAmendement": "tdu",
  "cardinaliteAmdtMultiples": "1",
  "etat": "Discuté",
  "signataires": {
    "auteur": {
      "typeAuteur": "Depute",
      "acteurRef": "PA608695",
      "groupePolitiqueRef": "PO730946"
    },
    "cosignatairesRefs": [
      "PA342415",
      "PA333818",
      "PA267233",
      "PA610681",
      "PA332614",
      "PA605069",
      "PA642764",
      "PA719930",
      "PA608695"
    ],
    "texteAffichable": "Mme&#160;Untermaier,  M.&#160;Bouillon, M.&#160;Aviragnet, M.&#160;Jean-Louis&#160;Bricout, M.&#160;Vallaud, M.&#160;Hutin, Mme&#160;Bareigts, M.&#160;Juanico et Mme&#160;Battistel"
  },
  "pointeurFragmentTexte": {
    "division": {
      "titre": "Article 2 A",
      "articleDesignationCourte": "ART. 2 A",
      "type": "ARTICLE",
      "avantAApres": "A",
      "divisionRattachee": "ARTICLE 2 A",
      "urlDivisionTexteVise": "/15/textes/0105.asp#D_Article_2_A"
    }
  },
  "corps": {
    "dispositif": "<p style=\"line-height: normal; text-align: justify;\">R&#233;diger ainsi cet article&#160;:</p><p style=\"line-height: normal; text-align: justify;\">&#171;&#160;L&#8217;article&#160;4 de l&#8217;ordonnance n&#176;&#160;58&#8209;1210 du&#160;13&#160;d&#233;cembre&#160;1958 portant loi organique relative &#224; l&#8217;indemnit&#233; des membres du Parlement est ainsi r&#233;dig&#233;&#160;:</p><p style=\"line-height: normal; text-align: justify;\">&#171;&#160;<i>Art.&#160;4</i>.&#160;&#8211;&#160;L&#8217;indemnit&#233; parlementaire est exclusive de toute autre indemnit&#233; d&#8217;un mandat &#233;lectif exerc&#233; durant le mandat parlementaire.&#160;&#187;</p>",
    "exposeSommaire": "<p style=\"text-align: justify; line-height: 107%;\">Cet amendement supprime la possibilit&#233; de cumul des r&#233;mun&#233;rations li&#233; &#224; l&#8217;exercice d&#8217;un autre mandat &#233;lectif. Le mandat doit &#234;tre exerc&#233; &#224; plein temps et le d&#233;put&#233; doit &#234;tre au service de ses concitoyens.</p>"
  },
  "representations": [
    {
      "nom": "PDF",
      "typeMime": {
        "type": "application",
        "subType": "PDF"
      },
      "statutRepresentation": {
        "verbatim": true,
        "canonique": true,
        "officielle": true,
        "transcription": false,
        "enregistrement": false
      },
      "contenu": {
        "documentURI": "/15/amendements/0105/AN/167.pdf"
      }
    }
  ],
  "seanceDiscussion": "RUANR5L15S2017IDS20663",
  "sort": {
    "dateSaisie": "2017-07-28T22:51:50.000+02:00",
    "sortEnSeance": "Rejeté"
  },
  "dateDepot": "2017-07-21T02:00:00.000+02:00",
  "dateDistribution": "2017-07-24T02:00:00.000+02:00",
  "article99": "0",
  "loiReference": {
    "codeLoi": "ordonnance 58-1210",
    "divisionCodeLoi": "4"
  }
}