{
  "uid": "AMANR5L15SEA717460BTC2243P0D1N1234",
  "identifiant": {
    "legislature": "15",
    "numero": "1234",
    "numRect": "0",
    "saisine": {
      "texteLegislatifRef": "PRJLANR5L15BTC2243",
      "numeroPartiePLF": "0",
      "organeExamen": "PO717460",
      "mentionSecondeDeliberation": "0"
    }
  },
  "numeroLong": "1234",
  "etapeTexte": "1ère lecture (1ère assemblée saisie)",
  "triAmendement": "coaaaaaaaaaaaaaaaaaaaaaaaaaaaaaaaaaaaaaaaaaaaaaaaapo",
  "cardinaliteAmdtMultiples": "1",
  "etat": "Discuté",
  "signataires": {
    "auteur": {
      "typeAuteur": "Depute",
      "acteurRef": "PA642847",
      "groupePolitiqueRef": "PO730934"
    },
    "cosignatairesRefs": [
      "PA642847"
    ],
    "texteAffichable": "M.&#160;Bazin"
  },
  "pointeurFragmentTexte": {
    "division": {
      "titre": "Article 11",
      "articleDesignationCourte": "ART. 11",
      "type": "ARTICLE",
      "avantAApres": "A",
      "divisionRattachee": "ARTICLE 11",
      "urlDivisionTexteVise": "/15/textes/2243.asp#D_Article_11"
    },
    "alinea": {
      "numero": "4"
    }
  },
  "corps": {
    "dispositif": "<p style=\"text-align: justify;\">Compl&#233;ter l&#8217;alin&#233;a&#160;4 par la phrase suivante&#160;:</p><p style=\"text-align: justify;\">&#171;&#160;L&#8217;efficacit&#233; attendue de ce traitement est &#233;valu&#233;e.&#160;&#187;</p>",
    "exposeSommaire": "<p style=\"text-align: justify;\">Il convient de mesurer l&#8217;efficacit&#233; du traitement en fonction des attentes, ce que vous propose cet amendement.</p>"
  },
  "representations": [
    {
      "nom": "PDF",
      "typeMime": {
        "type": "application",
        "subType": "PDF"
      },
      "statutRepresentation": {
        "verbatim": true,
        "canonique": true,
        "officielle": true,
        "transcription": false,
        "enregistrement": false
      },
      "contenu": {
        "documentURI": "/15/amendements/2243/AN/1234.pdf"
      }
    }
  ],
  "seanceDiscussion": "RUANR5L15S2020IDS21848",
  "sort": {
    "dateSaisie": "2019-10-04T15:38:45.000+02:00",
    "sortEnSeance": "Rejeté"
  },
  "dateDepot": "2019-09-18T02:00:00.000+02:00",
  "dateDistribution": "2019-09-25T02:00:00.000+02:00",
  "article99": "0",
  "loiReference": {}
}