{
  "uid": "AMANR5L15SEA717460BTC1918P0D1N26",
  "identifiant": {
    "legislature": "15",
    "numero": "26",
    "numRect": "0",
    "saisine": {
      "texteLegislatifRef": "PRJLANR5L15BTC1918",
      "numeroPartiePLF": "0",
      "organeExamen": "PO717460",
      "mentionSecondeDeliberation": "0"
    }
  },
  "numeroLong": "26",
  "etapeTexte": "1ère lecture (1ère assemblée saisie)",
  "triAmendement": "laaaaaaaaaaaaaaaaaaaaaaaaaaaaaaaaaaaaaaaaaaaaaaaaabi",
  "cardinaliteAmdtMultiples": "1",
  "etat": "Discuté",
  "signataires": {
    "auteur": {
      "typeAuteur": "Depute",
      "acteurRef": "PA330008",
      "groupePolitiqueRef": "PO730934"
    },
    "cosignatairesRefs": [
      "PA1012",
      "PA709315",
      "PA267429",
      "PA267735",
      "PA266776",
      "PA330240",
      "PA642847",
      "PA606098",
      "PA605036",
      "PA608826",
      "PA267289",
      "PA718884",
      "PA1029",
      "PA608416",
      "PA266808",
      "PA643089",
      "PA332523",
      "PA718838",
      "PA267204",
      "PA2377",
      "PA609726",
      "PA330008",
      "PA719318",
      "PA721046",
      "PA346218",
      "PA266797",
      "PA1874",
      "PA721474",
      "PA330684",
      "PA334654"
    ],
    "texteAffichable": "M.&#160;Breton,  M.&#160;Hetzel, M.&#160;Reiss, M.&#160;Straumann, M.&#160;Thi&#233;riot, M.&#160;Cinieri, Mme&#160;Bazin-Malgras, Mme&#160;Anthoine, Mme&#160;Dalloz, M.&#160;Ciotti, M.&#160;Sermier, M.&#160;Aubert, M.&#160;Door, M.&#160;Abad, M.&#160;de la Verpilli&#232;re, M.&#160;Gosselin, M.&#160;Marleix, Mme&#160;Val&#233;rie&#160;Boyer, M.&#160;Masson, Mme&#160;Bassire, M.&#160;Le Fur, M.&#160;Deflesselles, M.&#160;Perrut, Mme&#160;Duby-Muller, M.&#160;de Ganay, M.&#160;Brun, M.&#160;Viry, M.&#160;Bazin, M.&#160;Rolland et M.&#160;Viala"
  },
  "pointeurFragmentTexte": {
    "division": {
      "titre": "Article 7",
      "articleDesignationCourte": "ART. 7",
      "type": "ARTICLE",
      "avantAApres": "A",
      "divisionRattachee": "ARTICLE 7",
      "urlDivisionTexteVise": "/15/textes/1918.asp#D_Article_7"
    },
    "alinea": {
      "avantAApres": "A",
      "numero": "1",
      "alineaDesignation": "Alinéa 1"
    }
  },
  "corps": {
    "dispositif": "<p style=\"text-align: justify;\">Compl&#233;ter cet article par les mots&#160;:</p><p style=\"text-align: justify;\">&#171;&#160;ainsi que la Ville de Paris et l&#8217;association dioc&#233;saine de Paris&#160;&#187;.</p>",
    "exposeSommaire": "<p style=\"text-align: justify;\">Dans un souci de transparence tout au long de cette restauration, il convient d&#8217;associer &#224; la gestion des fonds la Ville de Paris et l&#8217;association dioc&#233;saine de Paris.</p>"
  },
  "representations": [
    {
      "nom": "PDF",
      "typeMime": {
        "type": "application",
        "subType": "PDF"
      },
      "statutRepresentation": {
        "verbatim": true,
        "canonique": true,
        "officielle": true,
        "transcription": false,
        "enregistrement": false
      },
      "contenu": {
        "documentURI": "/15/amendements/1918/AN/26.pdf"
      }
    }
  ],
  "sort": {
    "dateSaisie": "2019-05-10T19:52:11.000+02:00",
    "sortEnSeance": "Rejeté"
  },
  "dateDepot": "2019-05-02T02:00:00.000+02:00",
  "dateDistribution": "2019-05-09T02:00:00.000+02:00",
  "article99": "0",
  "loiReference": {}
}