{
  "uid": "AMANR5L15SEA717460BTC1761P0D1N919",
  "identifiant": {
    "legislature": "15",
    "numero": "919",
    "numRect": "0",
    "saisine": {
      "texteLegislatifRef": "PRJLANR5L15BTC1761",
      "numeroPartiePLF": "0",
      "organeExamen": "PO717460",
      "mentionSecondeDeliberation": "0"
    }
  },
  "numeroLong": "919",
  "etapeTexte": "Nouvelle Lecture",
  "triAmendement": "aakaaaaaiaaaaaaaaaaaaaaaaaaaaaaaaaaaaaaaaaaaaaaaaazzw",
  "cardinaliteAmdtMultiples": "1",
  "etat": "Discuté",
  "signataires": {
    "auteur": {
      "typeAuteur": "Depute",
      "acteurRef": "PA942",
      "groupePolitiqueRef": "PO759900"
    },
    "cosignatairesRefs": [
      "PA333421",
      "PA405480",
      "PA942",
      "PA605694"
    ],
    "texteAffichable": "M.&#160;Charles&#160;de Courson,  M.&#160;Falorni, M.&#160;Pancher et M.&#160;Pupponi"
  },
  "pointeurFragmentTexte": {
    "division": {
      "titre": "Article 50",
      "articleDesignationCourte": "ART. 50",
      "type": "ARTICLE",
      "avantAApres": "A",
      "divisionRattachee": "ARTICLE 50",
      "urlDivisionTexteVise": "/15/textes/1761.asp#D_Article_50"
    },
    "alinea": {
      "numero": "2"
    }
  },
  "corps": {
    "dispositif": "<p style=\"text-align: justify;\">&#192; l&#8217;alin&#233;a&#160;2, apr&#232;s le mot&#160;:</p><p style=\"text-align: justify;\">&#171;&#160;comptes&#160;&#187;,</p><p style=\"text-align: justify;\">ins&#233;rer les mots&#160;:</p><p style=\"text-align: justify;\">&#171;&#160;et la gestion&#160;&#187;.</p>",
    "exposeSommaire": "<p style=\"text-align: justify;\">Cet amendement de pr&#233;cision a pour but de souligner l&#8217;importance de la gestion en plus du contr&#244;le des comptes d&#8217;A&#233;roports de Paris.</p>"
  },
  "representations": [
    {
      "nom": "PDF",
      "typeMime": {
        "type": "application",
        "subType": "PDF"
      },
      "statutRepresentation": {
        "verbatim": true,
        "canonique": true,
        "officielle": true,
        "transcription": false,
        "enregistrement": false
      },
      "contenu": {
        "documentURI": "/15/amendements/1761/AN/919.pdf"
      }
    }
  ],
  "seanceDiscussion": "RUANR5L15S2019IDS21548",
  "sort": {
    "dateSaisie": "2019-03-14T20:02:45.000+01:00",
    "sortEnSeance": "Rejeté"
  },
  "dateDepot": "2019-03-11T01:00:00.000+01:00",
  "dateDistribution": "2019-03-14T01:00:00.000+01:00",
  "article99": "0",
  "loiReference": {}
}