{
  "uid": "AMANR5L15SEA717460BTC0971P0D1N283",
  "identifiant": {
    "legislature": "15",
    "numero": "283",
    "numRect": "0",
    "saisine": {
      "texteLegislatifRef": "PRJLANR5L15BTC0971",
      "numeroPartiePLF": "0",
      "organeExamen": "PO717460",
      "mentionSecondeDeliberation": "0"
    }
  },
  "numeroLong": "283",
  "etapeTexte": "1ère lecture (1ère assemblée saisie)",
  "triAmendement": "mdzo",
  "cardinaliteAmdtMultiples": "1",
  "etat": "Discuté",
  "signataires": {
    "auteur": {
      "typeAuteur": "Depute",
      "acteurRef": "PA267324",
      "groupePolitiqueRef": "PO730934"
    },
    "cosignatairesRefs": [
      "PA267324",
      "PA718784"
    ],
    "texteAffichable": "M.&#160;Gaultier et M.&#160;Pauget"
  },
  "pointeurFragmentTexte": {
    "division": {
      "titre": "Article 51",
      "articleDesignationCourte": "ART. 51",
      "type": "ARTICLE",
      "avantAApres": "A",
      "divisionRattachee": "ARTICLE 51",
      "urlDivisionTexteVise": "/15/textes/0971.asp#D_Article_51"
    },
    "alinea": {
      "avantAApres": "A",
      "numero": "13",
      "alineaDesignation": "Alinéa 13"
    }
  },
  "corps": {
    "dispositif": "<p style=\"text-align: justify;\">&#192; l&#8217;alin&#233;a&#160;13, substituer aux mots&#160;:</p><p style=\"text-align: justify;\">&#171;&#160;de cent-vingt&#160;&#187;</p><p style=\"text-align: justify;\">les mots&#160;:</p><p style=\"text-align: justify;\">&#171;&#160;d&#8217;une limite d&#233;finie par d&#233;lib&#233;ration du conseil municipal, pouvant aller de soixante &#224; cent-vingt&#160;&#187;.</p>",
    "exposeSommaire": "<p style=\"text-align: justify;\">La cr&#233;ation d&#8217;un t&#233;l&#233;service d&#8217;enregistrement des meubl&#233;s de tourisme a offert aux communes connaissant d&#233;j&#224; une forte tension sur le logement, un outil leur permettant de mieux contr&#244;ler et r&#233;guler l&#8217;expansion de ce type de location touristique qui se fait au d&#233;triment de la location traditionnelle. L&#8217;implantation de ce type de meubl&#233;s de tourisme, bien que r&#233;pondant &#224; un ph&#233;nom&#232;ne mondial, est surtout li&#233; &#224; des probl&#233;matiques et des situations locales&#160;: tension du march&#233; immobilier, attrait touristique de la commune, etc.</p><p style=\"text-align: justify;\">Il a &#233;t&#233; constat&#233; de tr&#232;s nombreux cas de fraude o&#249; des propri&#233;taires d&#233;claraient leur bien en r&#233;sidence principale sans y vivre, afin d&#8217;&#233;viter d&#8217;avoir &#224; respecter l&#8217;ensemble des r&#232;gles de changement d&#8217;usage, et notamment de compensation. Cela maintient artificiellement un attrait financier notable de ce type de location, et donc un d&#233;tournement de ces biens immobiliers du march&#233; locatif dit &#171;&#160;&#224; bail&#160;&#187;. Le pr&#233;sent article propose une avanc&#233;e notable pour lutter contre ce ph&#233;nom&#232;ne, en responsabilisant les plateformes sur leur r&#244;le de contr&#244;le de la limite de location d&#8217;une r&#233;sidence principale, aujourd&#8217;hui fix&#233;e uniform&#233;ment &#224; 120 jours.</p><p style=\"text-align: justify;\">Le pr&#233;sent amendement propose de laisser aux mairies ayant d&#233;j&#224; mis en place le t&#233;l&#233;service d&#8217;enregistrement des meubl&#233;s de tourisme une certaine marge de libert&#233; dans la fixation de la limite du nombre de jours de location touristique d&#8217;une r&#233;sidence principale. Cela leur permettra de r&#233;guler leur march&#233; de la location touristique en fonction des enjeux locaux li&#233;s aux tensions sur l&#8217;immobilier, et d&#8217;encourager &#224; la r&#233;gularisation des meubl&#233;s de tourisme. Les seuils propos&#233;s permettent d&#8217;aller de deux mois de location d&#8217;une r&#233;sidence principale &#224; 120 jours, limite au-del&#224; de laquelle une r&#233;sidence ne peut plus &#234;tre qualifi&#233;e de &#171;&#160;principale&#160;&#187; au regard de l&#8217;article 2 de la loi du 6 juillet 1989 tendant &#224; am&#233;liorer les rapports locatifs. Ces seuils sont &#224; mettre en perspective avec les d&#233;clarations de la principale plateforme de location de meubl&#233;s de tourisme qui d&#233;clarait que le nombre moyen de jours de location &#233;tait de 33 jours par an.</p>"
  },
  "representations": [
    {
      "nom": "PDF",
      "typeMime": {
        "type": "application",
        "subType": "PDF"
      },
      "statutRepresentation": {
        "verbatim": true,
        "canonique": true,
        "officielle": true,
        "transcription": false,
        "enregistrement": false
      },
      "contenu": {
        "documentURI": "/15/amendements/0971/AN/283.pdf"
      }
    }
  ],
  "seanceDiscussion": "RUANR5L15S2018IDS21137",
  "sort": {
    "dateSaisie": "2018-06-08T11:46:26.000+02:00",
    "sortEnSeance": "Non soutenu"
  },
  "dateDepot": "2018-05-23T02:00:00.000+02:00",
  "dateDistribution": "2018-05-31T02:00:00.000+02:00",
  "article99": "0",
  "loiReference": {}
}