{
  "uid": "AMANR5L15PO59048B0235P1D1N173",
  "identifiant": {
    "legislature": "15",
    "numero": "173",
    "numRect": "0",
    "saisine": {
      "texteLegislatifRef": "PRJLANR5L15B0235",
      "numeroPartiePLF": "1",
      "organeExamen": "PO59048",
      "mentionSecondeDeliberation": "0"
    }
  },
  "numeroLong": "I-CF173",
  "etapeTexte": "1ère lecture (1ère assemblée saisie)",
  "triAmendement": "k",
  "cardinaliteAmdtMultiples": "1",
  "etat": "Discuté",
  "signataires": {
    "auteur": {
      "typeAuteur": "Depute",
      "acteurRef": "PA331582",
      "groupePolitiqueRef": "PO730952"
    },
    "cosignatairesRefs": [
      "PA331582"
    ],
    "texteAffichable": "M.&#160;Philippe&#160;Vigier"
  },
  "pointeurFragmentTexte": {
    "division": {
      "titre": "Article 15",
      "articleDesignationCourte": "ART. 15",
      "type": "ARTICLE",
      "avantAApres": "A",
      "divisionRattachee": "ARTICLE 15",
      "urlDivisionTexteVise": "/15/textes/0235A.asp#D_Article_15"
    }
  },
  "corps": {
    "dispositif": "<p style=\"text-align: justify;\">R&#233;diger ainsi cet article&#160;:</p><p style=\"text-align: justify;\">Le II de l&#8217;article&#160;62 de la loi n&#176; 2016&#8209;1917 du 29 d&#233;cembre 2016 de finances pour 2017 est ainsi modifi&#233;&#160;:</p><p style=\"text-align: justify;\">&#171;&#160;II.- Le I s&#8217;applique aux acquisitions r&#233;alis&#233;es &#224; compter du 1<sup>er</sup> janvier 2019.&#160;&#187;</p><p style=\"text-align: justify;\">II.&#160;&#8211;&#160;Compl&#233;ter cet article par l&#8217;alin&#233;a suivant&#160;:</p><p style=\"text-align: justify;\">&#171;&#160;II.&#160;&#8211;&#160;La perte de recettes pour l&#8217;&#201;tat est compens&#233;e &#224; due concurrence par la cr&#233;ation d&#8217;une taxe additionnelle aux droits mentionn&#233;s aux articles 575 et 575 A du code g&#233;n&#233;ral des imp&#244;ts.</p>",
    "exposeSommaire": "<p style=\"text-align: justify;\">Le gouvernement &#233;voque des difficult&#233;s de mise en &#339;uvre pour &#233;tendre l&#8217;assiette de la taxe aux transactions infrajournali&#232;res, ce qui justifierait son annulation.</p><p style=\"text-align: justify;\">Cet amendement vise &#224; incorporer les transactions infrajournali&#232;res dans l&#8217;assiette de la Taxe sur les Transactions Financi&#232;res &#224; compter du 1<sup>er</sup> janvier 2019, et non plus du 1er janvier 2018.</p><p style=\"text-align: justify;\">Ce d&#233;lai suppl&#233;mentaire devrait permettre de lever les obstacles techniques &#224; la mise en &#339;uvre de cette mesure, si essentielle pour la moralisation de la finance.</p>"
  },
  "representations": [
    {
      "nom": "PDF",
      "typeMime": {
        "type": "application",
        "subType": "PDF"
      },
      "statutRepresentation": {
        "verbatim": true,
        "canonique": true,
        "officielle": true,
        "transcription": false,
        "enregistrement": false
      },
      "contenu": {
        "documentURI": "/15/amendements/0235A/CION_FIN/CF173.pdf"
      }
    }
  ],
  "sort": {
    "dateSaisie": "2017-10-12T11:24:29.000+02:00",
    "sortEnSeance": "Non soutenu"
  },
  "dateDepot": "2017-10-06T02:00:00.000+02:00",
  "dateDistribution": "2017-10-11T02:00:00.000+02:00",
  "article99": "0",
  "loiReference": {}
}