{
  "uid": "AMANR5L15SEA717460BTC0369P0D1N258",
  "identifiant": {
    "legislature": "15",
    "numero": "258",
    "numRect": "0",
    "saisine": {
      "texteLegislatifRef": "PRJLANR5L15BTC0369",
      "numeroPartiePLF": "0",
      "organeExamen": "PO717460",
      "mentionSecondeDeliberation": "0"
    }
  },
  "numeroLong": "258",
  "etapeTexte": "1ère lecture (1ère assemblée saisie)",
  "triAmendement": "bhs",
  "cardinaliteAmdtMultiples": "1",
  "etat": "Discuté",
  "signataires": {
    "auteur": {
      "typeAuteur": "Depute",
      "acteurRef": "PA719138",
      "groupePolitiqueRef": "PO723569"
    },
    "cosignatairesRefs": [
      "PA719138",
      "PA719286",
      "PA719146"
    ],
    "texteAffichable": "M.&#160;Castellani,  M.&#160;Acquaviva et M.&#160;Colombani"
  },
  "pointeurFragmentTexte": {
    "division": {
      "titre": "Article 6",
      "articleDesignationCourte": "ART. 6",
      "type": "ARTICLE",
      "avantAApres": "A",
      "divisionRattachee": "ARTICLE 6",
      "urlDivisionTexteVise": "/15/textes/0369.asp#D_Article_6"
    },
    "alinea": {
      "avantAApres": "Apres",
      "numero": "2"
    }
  },
  "corps": {
    "dispositif": "<p style=\"text-align: justify;\">Apr&#232;s l&#8217;alin&#233;a&#160;2, ins&#233;rer les deux alin&#233;as suivants&#160;:</p><p style=\"text-align: justify;\">&#171;&#160;1&#176; <i>bis </i>L&#8217;article L.&#160;1222&#8209;10 est compl&#233;t&#233; par un 4&#176; ainsi r&#233;dig&#233;&#160;:</p><p style=\"text-align: justify;\">&#171;&#160;4&#176;&#160;De prendre en charge tous les co&#251;ts d&#233;coulant directement de l&#8217;exercice du t&#233;l&#233;travail, notamment le co&#251;t des mat&#233;riels, logiciels, abonnements, communications et outils ainsi que de la maintenance de ceux-ci&#160;&#187;.&#160;&#187;</p>",
    "exposeSommaire": "<p style=\"text-align: justify;\">Le Gouvernement pr&#233;tend favoriser le recours au t&#233;l&#233;travail toutefois la r&#233;daction propos&#233;e pourrait engendrer des effets inverses.</p><p style=\"text-align: justify;\">En effet, l&#8217;Accord National Interprofessionnel du 19 juillet 2005 sur le t&#233;l&#233;travail ainsi que la &#171;&#160;petite loi&#160;&#187; Poisson du 09 juin 2009 reprise par la suite par notre coll&#232;gue Cherpion pr&#233;voyaient cette obligation pour l&#8217;employeur.</p><p style=\"text-align: justify;\">Le salari&#233;, d&#8217;autant plus isol&#233; car en situation de t&#233;l&#233;travail, ne saurait supporter les frais li&#233;s aux co&#251;ts de son poste de travail.</p><p style=\"text-align: justify;\">Le Gouvernement souhaitant favoriser le t&#233;l&#233;travail ne peut ni contredire les partenaires sociaux, ce qui serait un comble dans le cadre d&#8217;une discussion portant sur le dialogue social, ni m&#234;me le Parlement ayant encadr&#233; le recours &#224; cette pratique.</p>"
  },
  "representations": [
    {
      "nom": "PDF",
      "typeMime": {
        "type": "application",
        "subType": "PDF"
      },
      "statutRepresentation": {
        "verbatim": true,
        "canonique": true,
        "officielle": true,
        "transcription": false,
        "enregistrement": false
      },
      "contenu": {
        "documentURI": "/15/amendements/0369/AN/258.pdf"
      }
    }
  ],
  "seanceDiscussion": "RUANR5L15S2018IDS20778",
  "sort": {
    "dateSaisie": "2017-11-23T12:29:46.000+01:00",
    "sortEnSeance": "Rejeté"
  },
  "dateDepot": "2017-11-17T01:00:00.000+01:00",
  "dateDistribution": "2017-11-20T01:00:00.000+01:00",
  "article99": "0",
  "loiReference": {}
}