{
  "uid": "AMANR5L15PO419865B1393P0D1N198",
  "identifiant": {
    "legislature": "15",
    "numero": "198",
    "numRect": "0",
    "saisine": {
      "texteLegislatifRef": "PIONANR5L15B1393",
      "numeroPartiePLF": "0",
      "organeExamen": "PO419865",
      "mentionSecondeDeliberation": "0"
    }
  },
  "numeroLong": "CD198",
  "etapeTexte": "1ère lecture (2ème assemblée saisie)",
  "triAmendement": "iaaaaaaaaaaaaaaaaaaaaaaaaaaaaaaaaaaaaaaaaaaaaaaaaawj",
  "cardinaliteAmdtMultiples": "1",
  "etat": "Discuté",
  "signataires": {
    "auteur": {
      "typeAuteur": "Depute",
      "acteurRef": "PA719194",
      "groupePolitiqueRef": "PO730964"
    },
    "cosignatairesRefs": [
      "PA719194"
    ],
    "texteAffichable": "Mme&#160;Yolaine&#160;de Courson, rapporteure"
  },
  "pointeurFragmentTexte": {
    "division": {
      "titre": "Article 7",
      "articleDesignationCourte": "ART. 7",
      "type": "ARTICLE",
      "avantAApres": "A",
      "divisionRattachee": "ARTICLE 7",
      "urlDivisionTexteVise": "/15/textes/1393.asp#D_Article_7"
    },
    "alinea": {
      "numero": "7"
    }
  },
  "corps": {
    "dispositif": "<p style=\"text-align: justify;\">&#192; l&#8217;alin&#233;a&#160;7, supprimer les mots&#160;:</p><p>&#171;&#160;des directeurs g&#233;n&#233;raux&#160;&#187;.</p>",
    "exposeSommaire": "<p style=\"text-align: justify;\">Amendement de coordination r&#233;dactionnelle du 5&#176; de l&#8217;article L.&#160;1233&#8209;3 du code g&#233;n&#233;ral des collectivit&#233;s territoriales cr&#233;&#233; par l&#8217;article&#160;7 avec les 1&#176; &#224; 4&#176; de cet article.</p>"
  },
  "representations": [
    {
      "nom": "PDF",
      "typeMime": {
        "type": "application",
        "subType": "PDF"
      },
      "statutRepresentation": {
        "verbatim": true,
        "canonique": true,
        "officielle": true,
        "transcription": false,
        "enregistrement": false
      },
      "contenu": {
        "documentURI": "/15/amendements/1393/CION-DVP/CD198.pdf"
      }
    }
  ],
  "sort": {
    "dateSaisie": "2019-02-06T11:48:16.000+01:00",
    "sortEnSeance": "Tombé"
  },
  "dateDepot": "2019-01-31T01:00:00.000+01:00",
  "dateDistribution": "2019-02-04T01:00:00.000+01:00",
  "article99": "0",
  "loiReference": {}
}