{
  "uid": "AMANR5L15SEA717460BTC1396P0D1N72",
  "identifiant": {
    "legislature": "15",
    "numero": "72",
    "numRect": "0",
    "saisine": {
      "texteLegislatifRef": "PRJLANR5L15BTC1396",
      "numeroPartiePLF": "0",
      "organeExamen": "PO717460",
      "mentionSecondeDeliberation": "0"
    }
  },
  "numeroLong": "72",
  "etapeTexte": "1ère lecture (2ème assemblée saisie)",
  "triAmendement": "aaiaaaaaaaaaaaaaaaaaaaaaaaaaaaaaaaaaaaaaaaaaaaaaaahe",
  "cardinaliteAmdtMultiples": "1",
  "etat": "Discuté",
  "signataires": {
    "auteur": {
      "typeAuteur": "Depute",
      "acteurRef": "PA718884",
      "groupePolitiqueRef": "PO730934"
    },
    "cosignatairesRefs": [
      "PA608016",
      "PA643134",
      "PA718884",
      "PA267450",
      "PA330909",
      "PA267527",
      "PA642847",
      "PA719318",
      "PA748954",
      "PA718838",
      "PA721506",
      "PA267901"
    ],
    "texteAffichable": "Mme&#160;Bazin-Malgras,  Mme&#160;Anthoine, Mme&#160;Valentin, M.&#160;Savignat, M.&#160;Kamardine, Mme&#160;Louwagie, M.&#160;Descoeur, M.&#160;Brun, Mme&#160;Kuster, M.&#160;R&#233;mi&#160;Delatte, M.&#160;Saddier et M.&#160;Bazin"
  },
  "pointeurFragmentTexte": {
    "division": {
      "titre": "Article PREMIER",
      "articleDesignationCourte": "ART. PREMIER",
      "type": "ARTICLE",
      "avantAApres": "A",
      "divisionRattachee": "ARTICLE PREMIER",
      "urlDivisionTexteVise": "/15/textes/1396.asp#D_Article_1er"
    },
    "alinea": {
      "numero": "6"
    }
  },
  "corps": {
    "dispositif": "<p>Supprimer l'alin&#233;a 6.</p>",
    "exposeSommaire": "<p style=\"text-align: justify;\">Le pr&#233;sent amendement supprime la mention selon laquelle la programmation fera l&#8217;objet d&#8217;actualisations d&#8217;ici 2021. En effet, il n&#8217;est nul besoin de le pr&#233;voir puisque la valeur de l&#8217;article&#160;1<sup>er</sup>, purement programmatique, n&#8217;est aucunement contraignante. Les cr&#233;dits et les emplois devront &#234;tre formellement vot&#233;s chaque ann&#233;e par la loi de finances, conform&#233;ment &#224; la jurisprudence du Conseil constitutionnel.</p>"
  },
  "representations": [
    {
      "nom": "PDF",
      "typeMime": {
        "type": "application",
        "subType": "PDF"
      },
      "statutRepresentation": {
        "verbatim": true,
        "canonique": true,
        "officielle": true,
        "transcription": false,
        "enregistrement": false
      },
      "contenu": {
        "documentURI": "/15/amendements/1396/AN/72.pdf"
      }
    }
  ],
  "seanceDiscussion": "RUANR5L15S2019IDS21370",
  "sort": {
    "dateSaisie": "2018-11-20T21:41:13.000+01:00",
    "sortEnSeance": "Rejeté"
  },
  "dateDepot": "2018-11-14T01:00:00.000+01:00",
  "dateDistribution": "2018-11-18T01:00:00.000+01:00",
  "article99": "0",
  "loiReference": {}
}