{
  "uid": "AMANR5L15PO59048B2272P1D1N230",
  "identifiant": {
    "legislature": "15",
    "numero": "230",
    "numRect": "0",
    "saisine": {
      "texteLegislatifRef": "PRJLANR5L15B2272",
      "numeroPartiePLF": "1",
      "organeExamen": "PO59048",
      "mentionSecondeDeliberation": "0"
    }
  },
  "numeroLong": "I-CF230",
  "etapeTexte": "1ère lecture (1ère assemblée saisie)",
  "triAmendement": "jiaaaaaaaaaaaaaaaaaaaaaaaaaaaaaaaaaaaaaaaaaaaaaaaacdds",
  "cardinaliteAmdtMultiples": "1",
  "etat": "Discuté",
  "signataires": {
    "auteur": {
      "typeAuteur": "Depute",
      "acteurRef": "PA330909",
      "groupePolitiqueRef": "PO730934"
    },
    "cosignatairesRefs": [
      "PA767",
      "PA330909",
      "PA334654"
    ],
    "texteAffichable": "M.&#160;Descoeur,  M.&#160;Straumann et M.&#160;Cattin"
  },
  "pointeurFragmentTexte": {
    "division": {
      "titre": "Article 27",
      "articleDesignationCourte": "ART. 27",
      "type": "ARTICLE",
      "avantAApres": "A",
      "divisionRattachee": "ARTICLE 27",
      "urlDivisionTexteVise": "/15/textes/2272A.asp#D_Article_27"
    },
    "alinea": {
      "avantAApres": "A",
      "numero": "8",
      "alineaDesignation": "Alinéa 8"
    }
  },
  "corps": {
    "dispositif": "<p style=\"text-align: justify;\">I.&#160;&#8211;&#160;R&#233;diger ainsi l&#8217;alin&#233;a 8&#160;: </p><p style=\"text-align: justify;\">&#171;&#160;4&#176;&#160;La quatri&#232;me ligne est supprim&#233;e&#160;&#187;.</p><p>II.&#160;&#8211;&#160;R&#233;diger ainsi l&#8217;alin&#233;a 43&#160;:</p><p>&#171;&#160;C.&#160;-&#160;Le III <i>bis</i> est supprim&#233;.&#160;&#187;.</p><p>III.&#160;&#8211;&#160;Compl&#233;ter cet article par le paragraphe suivant&#160;:</p><p>&#171;&#160;La perte de recettes pour l&#8217;&#201;tat est compens&#233;e, &#224; due concurrence, par la cr&#233;ation d&#8217;une taxe additionnelle aux droits pr&#233;vus aux articles 575 et 575&#160;A du code g&#233;n&#233;ral des imp&#244;ts.&#160;&#187;.</p>",
    "exposeSommaire": "<p>Le m&#233;canisme du plafond mordant vise la ponction par l&#8217;&#201;tat des recettes des agences de l&#8217;eau au-del&#224; du montant maximum de pr&#233;l&#232;vement des redevances. Ce principe remet en cause le principe de l&#8217;eau paie l&#8217;eau et permet &#224; l&#8217;&#201;tat d&#8217;op&#233;rer une ponction sur les agences de l&#8217;eau.</p><p>Alors que dans le cadre du 11&#232;me programme, les agences de l&#8217;eau voient leur champ d&#8217;action &#233;tendu notamment &#224; la lutte contre le changement climatique, l&#8217;institution d&#8217;un plafond mordant induira n&#233;cessairement la diminution et l&#8217;arr&#234;t de certaines aides pourtant toujours n&#233;cessaires pour les territoires. Avec le plafond pr&#233;vu actuellement, les agences se verront amput&#233;es de plus d&#8217;1 milliard d&#8217;euros par rapport au 10&#232;me programme. Cet amendement vise donc &#224; supprimer ce plafond pour donner aux agences de l&#8217;eau les moyens de faire face aux d&#233;fis li&#233;s au r&#233;chauffement climatique.</p>"
  },
  "representations": [
    {
      "nom": "PDF",
      "typeMime": {
        "type": "application",
        "subType": "PDF"
      },
      "statutRepresentation": {
        "verbatim": true,
        "canonique": true,
        "officielle": true,
        "transcription": false,
        "enregistrement": false
      },
      "contenu": {
        "documentURI": "/15/amendements/2272A/CION_FIN/CF230.pdf"
      }
    }
  ],
  "sort": {
    "dateSaisie": "2019-10-10T14:41:50.000+02:00",
    "sortEnSeance": "Non soutenu"
  },
  "dateDepot": "2019-10-03T02:00:00.000+02:00",
  "dateDistribution": "2019-10-10T02:00:00.000+02:00",
  "article99": "0",
  "loiReference": {}
}