{
  "uid": "AMANR5L15SEA717460BTC1974P0D1N1667",
  "identifiant": {
    "legislature": "15",
    "numero": "1667",
    "numRect": "0",
    "saisine": {
      "texteLegislatifRef": "PRJLANR5L15BTC1974",
      "numeroPartiePLF": "0",
      "organeExamen": "PO717460",
      "mentionSecondeDeliberation": "0"
    }
  },
  "numeroLong": "1667",
  "etapeTexte": "1ère lecture (2ème assemblée saisie)",
  "triAmendement": "braaaaaaaaaaaaaaaaaaaaaaaaaaaaaaaaaaaaaaaaaaaaaaaadk",
  "cardinaliteAmdtMultiples": "1",
  "etat": "Discuté",
  "signataires": {
    "auteur": {
      "typeAuteur": "Depute",
      "acteurRef": "PA429893",
      "groupePolitiqueRef": "PO758835"
    },
    "cosignatairesRefs": [
      "PA429893"
    ],
    "texteAffichable": "M.&#160;Carvounas"
  },
  "pointeurFragmentTexte": {
    "division": {
      "titre": "Article 18",
      "articleDesignationCourte": "ART. 18",
      "type": "ARTICLE",
      "avantAApres": "A",
      "divisionRattachee": "ARTICLE 18",
      "urlDivisionTexteVise": "/15/textes/1974.asp#D_Article_18"
    },
    "alinea": {
      "avantAApres": "Apres",
      "numero": "10"
    }
  },
  "corps": {
    "dispositif": "<p style=\"text-align: justify;\">Apr&#232;s l&#8217;alin&#233;a&#160;10, ins&#233;rer l&#8217;alin&#233;a suivant&#160;:</p><p style=\"text-align: justify;\">&#171;&#160;8&#176; Le montant de la participation financi&#232;re des op&#233;rateurs &#224; la mise en &#339;uvre de places de stationnement d&#233;di&#233;es aux nouvelles mobilit&#233;s&#160;&#187;.</p>",
    "exposeSommaire": "<p style=\"text-align: justify;\">De nombreuses communes ont jusqu&#8217;ici souffert du vide juridique &#224; propos des mobilit&#233;s douces.&#160;</p><p style=\"text-align: justify;\">Livr&#233;es &#224; elles-m&#234;mes, elles ont &#233;t&#233; contraintes d&#8217;encadrer les nombreuses probl&#233;matiques li&#233;es &#224; l&#8217;appropriation de l&#8217;espace public par des op&#233;rateurs priv&#233;s.&#160;</p><p style=\"text-align: justify;\">Afin de lutter contre le stationnement sauvage, des villes comme Paris ont souhait&#233; mettre en place des zones sp&#233;cifiques d&#233;limit&#233;es par un marquage au sol o&#249; les engins peuvent &#234;tre d&#233;pos&#233;s sans risquer d&#8217;entraver la circulation des pi&#233;tons.&#160;</p><p style=\"text-align: justify;\">Cet enjeu n&#8217;est pas anodin tant l&#8217;offre en nouvelles mobilit&#233;s est pl&#233;thorique, particuli&#232;rement au sein des grandes m&#233;tropoles.&#160;</p><p style=\"text-align: justify;\">Le pr&#233;sent amendement entend ajouter au r&#233;gime d&#8217;autorisation pr&#233;alable une prescription facultative relative &#224; l&#8217;&#233;tablissement d&#8217;une participation financi&#232;re des op&#233;rateurs pour financer la r&#233;alisation de places de stationnement r&#233;serv&#233;es &#224; leurs engins.</p><p style=\"text-align: justify;\">&#160;</p>"
  },
  "representations": [
    {
      "nom": "PDF",
      "typeMime": {
        "type": "application",
        "subType": "PDF"
      },
      "statutRepresentation": {
        "verbatim": true,
        "canonique": true,
        "officielle": true,
        "transcription": false,
        "enregistrement": false
      },
      "contenu": {
        "documentURI": "/15/amendements/1974/AN/1667.pdf"
      }
    }
  ],
  "seanceDiscussion": "RUANR5L15S2019IDS21681",
  "sort": {
    "dateSaisie": "2019-06-07T00:51:49.000+02:00",
    "sortEnSeance": "Tombé"
  },
  "dateDepot": "2019-05-29T02:00:00.000+02:00",
  "dateDistribution": "2019-06-03T02:00:00.000+02:00",
  "article99": "0",
  "loiReference": {}
}