{
  "uid": "AMANR5L15PO419604B0904P0D1N74",
  "identifiant": {
    "legislature": "15",
    "numero": "74",
    "numRect": "0",
    "saisine": {
      "texteLegislatifRef": "PRJLANR5L15B0904",
      "numeroPartiePLF": "0",
      "organeExamen": "PO419604",
      "mentionSecondeDeliberation": "0"
    }
  },
  "numeroLong": "AC74",
  "etapeTexte": "1ère lecture (1ère assemblée saisie)",
  "triAmendement": "vi",
  "cardinaliteAmdtMultiples": "1",
  "etat": "Irrecevable",
  "signataires": {
    "auteur": {
      "typeAuteur": "Depute",
      "acteurRef": "PA719146",
      "groupePolitiqueRef": "PO723569"
    },
    "cosignatairesRefs": [
      "PA719146"
    ],
    "texteAffichable": "M.&#160;Acquaviva"
  },
  "pointeurFragmentTexte": {
    "division": {
      "titre": "Article 10",
      "articleDesignationCourte": "ART. 10",
      "type": "ARTICLE",
      "avantAApres": "A",
      "divisionRattachee": "ARTICLE 10",
      "urlDivisionTexteVise": "/15/textes/0904.asp#D_Article_10"
    },
    "alinea": {
      "avantAApres": "Apres",
      "numero": "23"
    }
  },
  "corps": {
    "dispositif": "<p>Apr&#232;s l&#8217;alin&#233;a 23, ajouter un alin&#233;a ainsi r&#233;dig&#233;&#160;:</p><p>VII. &#8211; Apr&#232;s l&#8217;alin&#233;a 8 de l&#8217;article L. 6311 du code du travail, ajouter un alin&#233;a ainsi r&#233;dig&#233;&#160;:</p><p>Pour l&#8217;exercice de leurs missions pr&#233;vues au cinqui&#232;me alin&#233;a du I et du II, l&#8217;&#201;tat transf&#232;re aux r&#233;gions, &#224; la collectivit&#233; de Corse et aux collectivit&#233;s territoriales de Guyane et de Martinique, les cr&#233;dits qu&#8217;il affecte aux missions locales, aux Carif-Oref et aux structures d&#8217;information des jeunes. Le transfert de ces cr&#233;dits intervient &#224; compter du 1er janvier 2019.</p>",
    "exposeSommaire": "<p>Depuis la loi 5 mars 2014 relative &#224; la formation professionnelle, &#224; l'emploi et &#224; la d&#233;mocratie sociale, compl&#233;t&#233;e par la loi du 27 janvier 2017 relative &#224; l'&#233;galit&#233; et &#224; la citoyennet&#233;, les r&#233;gions coordonnent les actions des organismes partie prenantes du service public r&#233;gional de l'orientation (missions locales, r&#233;seau CARIF-OREF, r&#233;seau information jeunesse, etc.), </p><p>Alors que ce sont les r&#233;gions qui les coordonnent, ces organismes continuent de recevoir financements et directives des diff&#233;rentes minist&#232;res. </p><p>C&#8217;est pourquoi, le pr&#233;sent amendement entend clarifier la confusion en pr&#233;voyant un transfert des cr&#233;dits de l&#8217;&#201;tat affect&#233;s aux missions locales, aux CARIF-OREF et aux structures d&#8217;information des jeunes aux r&#233;gions, &#224; compter du 1er janvier 2019 afin d'assurer une meilleure coordination.</p>"
  },
  "representations": [
    {
      "nom": "PDF",
      "typeMime": {
        "type": "application",
        "subType": "PDF"
      },
      "statutRepresentation": {
        "verbatim": true,
        "canonique": true,
        "officielle": true,
        "transcription": false,
        "enregistrement": false
      },
      "contenu": {
        "documentURI": "/15/amendements/0904/CION-CEDU/AC74.pdf"
      }
    }
  ],
  "dateDepot": "2018-05-18T02:00:00.000+02:00",
  "article99": "0",
  "loiReference": {}
}