{
  "uid": "AMANR5L15PO59048B0235P2D1N218",
  "identifiant": {
    "legislature": "15",
    "numero": "218",
    "numRect": "0",
    "saisine": {
      "texteLegislatifRef": "PRJLANR5L15B0235",
      "numeroPartiePLF": "2",
      "organeExamen": "PO59048",
      "mentionSecondeDeliberation": "0"
    }
  },
  "numeroLong": "II-CF218",
  "etapeTexte": "1ère lecture (1ère assemblée saisie)",
  "triAmendement": "di",
  "cardinaliteAmdtMultiples": "1",
  "etat": "Discuté",
  "signataires": {
    "auteur": {
      "typeAuteur": "Depute",
      "acteurRef": "PA721202",
      "groupePolitiqueRef": "PO730958"
    },
    "cosignatairesRefs": [
      "PA721062",
      "PA720430",
      "PA720422",
      "PA718860",
      "PA2150",
      "PA718868",
      "PA720892",
      "PA719578",
      "PA588884",
      "PA721210",
      "PA721960",
      "PA720286",
      "PA721226",
      "PA719676",
      "PA720846",
      "PA722142",
      "PA721202"
    ],
    "texteAffichable": "M.&#160;Coquerel, rapporteur,  Mme&#160;Taurine, M.&#160;Ruffin, Mme&#160;Rubin, Mme&#160;Ressiguier, M.&#160;Ratenon, M.&#160;Quatennens, M.&#160;Prud&apos;homme, Mme&#160;Panot, Mme&#160;Obono, M.&#160;M&#233;lenchon, M.&#160;Larive, M.&#160;Lachaud, Mme&#160;Fiat, M.&#160;Corbi&#232;re, M.&#160;Bernalicis et Mme&#160;Autain"
  },
  "pointeurFragmentTexte": {
    "missionVisee": {
      "idMissionAN": "13",
      "libelleMission": "Écologie, développement et mobilité durables",
      "codeMissionPLF": "B",
      "libelleMissionPLF": "Répartition, par mission et programme, des crédits du budget général"
    },
    "division": {
      "titre": "Article 54",
      "articleDesignationCourte": "APRÈS ART. 54",
      "type": "ARTICLE",
      "avantAApres": "Apres",
      "divisionRattachee": "APRÈS L'ARTICLE 54, insérer l'article suivant:",
      "articleAdditionnel": "1",
      "urlDivisionTexteVise": "/15/textes/0235C.asp#D_Article_54"
    }
  },
  "corps": {
    "dispositif": "<p style=\"text-align: justify;\">I.&#160;&#8211;&#160;Le Gouvernement remet au Parlement, dans un d&#233;lai de six mois &#224; compter de la promulgation de la pr&#233;sente loi, un rapport d&#8217;information sur le budget des agences de l&#8217;eau et sur les conditions financi&#232;res de la mise en &#339;uvre de leurs missions.</p><p style=\"text-align: justify;\">II.&#160;&#8211;&#160;Ce rapport est r&#233;dig&#233; par un groupe de travail associant des membres du Conseil g&#233;n&#233;ral de l&#8217;environnement et du d&#233;veloppement durable, des membres des conseils d&#8217;administration des six agences de l&#8217;eau ainsi que les syndicats repr&#233;sentatifs du personnel.</p>",
    "exposeSommaire": "<p style=\"text-align: justify;\">Les ressources des six agences de l'eau servent r&#233;guli&#232;rement de variable d'ajustement dans le budget de l'Etat. Cette ann&#233;e, les mesures de rabotage prises par le Gouvernement sont un coup de massue sans pr&#233;c&#233;dent pour ces agences qui verront leurs dotations baisser de 195 millions d&#8217;euros par rapport &#224; l&#8217;ann&#233;e pr&#233;c&#233;dente. Pire, cette ann&#233;e c&#8217;est une double peine qui est inflig&#233;e. En effet, les agences de l&#8217;eau s&#8217;alarment de voir qu&#8217;une part cons&#233;quente de leur budget sera ponctionn&#233;e pour financer l&#8217;Agence Fran&#231;aise de la Biodiversit&#233; (195 millions) ainsi que l&#8217;Office de la Chasse et de la Faune Sauvage (36 millions d&#8217;euros) et les Parcs naturels (65 millions d&#8217;euros).</p><p style=\"text-align: justify;\">Les agences de l&#8217;eau, les syndicats et les associations de protection de l&#8217;environnement d&#233;noncent une saign&#233;e de la politique de l&#8217;eau au nom d&#8217;un objectif de ma&#238;trise des d&#233;penses publiques par un jeu habile de manipulations de lignes budg&#233;taires auquel nous sommes d&#233;sormais habitu&#233;s. Il reste dans une logique court-termiste alors m&#234;me que tous les signaux de qualit&#233; de l&#8217;eau sont au rouge et que les agences de l&#8217;eau se sont d&#233;j&#224; engag&#233;es sur des programmes ambitieux &#233;tal&#233;s sur 6 ans.</p><p style=\"text-align: justify;\">Les six agences de l'eau sont aujourd'hui plac&#233;es sous une contrainte budg&#233;taire telle qu&#8217;elles ne seront plus en capacit&#233; de remplir l&#8217;int&#233;gralit&#233; de leurs missions alors m&#234;me que celles-ci se multiplient pour faire face au r&#233;chauffement climatique et que la France s&#8217;est engag&#233;e dans le cadre de la loi de la reconqu&#234;te de la biodiversit&#233; et sur la directive europ&#233;enne pour atteindre &#171; le bon &#233;tat des eaux &#187;. Nous demandons que soit remis au parlement rapport d&#8217;information sur les ressources des agences de l&#8217;eau.</p>"
  },
  "representations": [
    {
      "nom": "PDF",
      "typeMime": {
        "type": "application",
        "subType": "PDF"
      },
      "statutRepresentation": {
        "verbatim": true,
        "canonique": true,
        "officielle": true,
        "transcription": false,
        "enregistrement": false
      },
      "contenu": {
        "documentURI": "/15/amendements/0235C/CION_TOUTE/CF218.pdf"
      }
    }
  ],
  "sort": {
    "dateSaisie": "2017-11-01T00:47:29.000+01:00",
    "sortEnSeance": "Rejeté"
  },
  "dateDepot": "2017-10-27T02:00:00.000+02:00",
  "dateDistribution": "2017-10-31T01:00:00.000+01:00",
  "article99": "0",
  "loiReference": {
    "codeLoi": "xxrapport"
  }
}