{
  "uid": "AMANR5L15PO59048B0235P2D1N43",
  "identifiant": {
    "legislature": "15",
    "numero": "43",
    "numRect": "0",
    "saisine": {
      "texteLegislatifRef": "PRJLANR5L15B0235",
      "numeroPartiePLF": "2",
      "organeExamen": "PO59048",
      "mentionSecondeDeliberation": "0"
    }
  },
  "numeroLong": "II-CF43",
  "etapeTexte": "1ère lecture (1ère assemblée saisie)",
  "triAmendement": "ahaans",
  "cardinaliteAmdtMultiples": "1",
  "etat": "Discuté",
  "signataires": {
    "auteur": {
      "typeAuteur": "Depute",
      "acteurRef": "PA1874",
      "groupePolitiqueRef": "PO730934"
    },
    "cosignatairesRefs": [
      "PA608416",
      "PA2492",
      "PA330008",
      "PA720684",
      "PA609726",
      "PA267204",
      "PA605036",
      "PA332523",
      "PA721410",
      "PA642847",
      "PA346218",
      "PA718838",
      "PA767",
      "PA720386",
      "PA721968",
      "PA718850",
      "PA334654",
      "PA721474",
      "PA1874",
      "PA267260",
      "PA719318",
      "PA2155",
      "PA721046",
      "PA712015",
      "PA267429",
      "PA721506",
      "PA608826"
    ],
    "texteAffichable": "M.&#160;Le Fur,  M.&#160;Abad, Mme&#160;Anthoine, M.&#160;Aubert, Mme&#160;Bassire, M.&#160;Bazin, Mme&#160;Bonnivard, M.&#160;Breton, M.&#160;Brun, M.&#160;Cattin, M.&#160;Cinieri, M.&#160;Cordier, Mme&#160;Dalloz, M.&#160;Dive, M.&#160;Pierre-Henri&#160;Dumont, Mme&#160;Duby-Muller, M.&#160;Di Filippo, M.&#160;Hetzel, Mme&#160;Kuster, M.&#160;Masson, M.&#160;Menuel, Mme&#160;Poletti, M.&#160;Quentin, M.&#160;Sermier, M.&#160;Straumann, M.&#160;Vialay et M.&#160;Viry"
  },
  "pointeurFragmentTexte": {
    "division": {
      "titre": "Article 39",
      "articleDesignationCourte": "APRÈS ART. 39",
      "type": "ARTICLE",
      "avantAApres": "Apres",
      "divisionRattachee": "APRÈS L'ARTICLE 39, insérer l'article suivant:",
      "articleAdditionnel": "1",
      "urlDivisionTexteVise": "/15/textes/0235C.asp#D_Article_39"
    }
  },
  "corps": {
    "dispositif": "<p style=\"text-align: justify;\">I.&#160;&#8211;&#160;Compl&#233;ter le 1&#176; du C du II de l'article 60&#160;de la loi n&#176; 2016-1917 du 29 d&#233;cembre 2016 de finances pour 2017 par les mots&#160;:</p><p style=\"text-align: justify;\">&#171;&#160;, &#224; l&#8217;exception des indemnit&#233;s correspondant aux cong&#233;s pay&#233;s non pris par le salari&#233;&#160;&#187;.</p><p style=\"text-align: justify;\">II.&#160;&#8211; La perte de recettes pour l&#8217;&#201;tat est compens&#233;e &#224; due concurrence par la cr&#233;ation d&#8217;une taxe additionnelle aux droits mentionn&#233;s aux articles 575 et 575 A du code g&#233;n&#233;ral des imp&#244;ts.&#160;&#187;</p>",
    "exposeSommaire": "<p style=\"text-align: justify;\">Amendement de repli de l&#8217;amendement n&#176; CF-38.</p>"
  },
  "representations": [
    {
      "nom": "PDF",
      "typeMime": {
        "type": "application",
        "subType": "PDF"
      },
      "statutRepresentation": {
        "verbatim": true,
        "canonique": true,
        "officielle": true,
        "transcription": false,
        "enregistrement": false
      },
      "contenu": {
        "documentURI": "/15/amendements/0235C/CION_TOUTE/CF43.pdf"
      }
    }
  ],
  "sort": {
    "sortEnSeance": "Rejeté"
  },
  "dateDepot": "2017-10-18T02:00:00.000+02:00",
  "dateDistribution": "2017-11-09T01:00:00.000+01:00",
  "article99": "0",
  "loiReference": {
    "codeLoi": "Loi 2016-1917",
    "divisionCodeLoi": "60 II C 1"
  }
}