{
  "uid": "AMANR5L15SEA717460B1230P0D1N8",
  "identifiant": {
    "legislature": "15",
    "numero": "8",
    "numRect": "0",
    "saisine": {
      "texteLegislatifRef": "PIONANR5L15B1230",
      "numeroPartiePLF": "0",
      "organeExamen": "PO717460",
      "mentionSecondeDeliberation": "0"
    }
  },
  "numeroLong": "8",
  "etapeTexte": "1ère lecture (1ère assemblée saisie)",
  "triAmendement": "faaaaaaaaaaaaaaaaaaaaaaaaaaaaaaaaaaaaaaaaaaaaaaaaai",
  "cardinaliteAmdtMultiples": "1",
  "etat": "Discuté",
  "signataires": {
    "auteur": {
      "typeAuteur": "Depute",
      "acteurRef": "PA721226",
      "groupePolitiqueRef": "PO730958"
    },
    "cosignatairesRefs": [
      "PA719676",
      "PA721960",
      "PA722142",
      "PA720286",
      "PA721210",
      "PA588884",
      "PA720422",
      "PA718860",
      "PA720892",
      "PA721226",
      "PA718868",
      "PA719578",
      "PA720846",
      "PA2150",
      "PA721062",
      "PA721202",
      "PA720430"
    ],
    "texteAffichable": "Mme&#160;Rubin,  Mme&#160;Autain, M.&#160;Bernalicis, M.&#160;Coquerel, M.&#160;Corbi&#232;re, Mme&#160;Fiat, M.&#160;Lachaud, M.&#160;Larive, M.&#160;M&#233;lenchon, Mme&#160;Obono, Mme&#160;Panot, M.&#160;Prud&apos;homme, M.&#160;Quatennens, M.&#160;Ratenon, Mme&#160;Ressiguier, M.&#160;Ruffin et Mme&#160;Taurine"
  },
  "pointeurFragmentTexte": {
    "division": {
      "titre": "Article 4",
      "articleDesignationCourte": "APRÈS ART. 4",
      "type": "ARTICLE",
      "avantAApres": "Apres",
      "divisionRattachee": "APRÈS L'ARTICLE 4, insérer l'article suivant:",
      "articleAdditionnel": "1",
      "urlDivisionTexteVise": "/15/textes/1230.asp#D_Article_4"
    }
  },
  "corps": {
    "dispositif": "<p style=\"text-align: justify;\">Dans un d&#233;lai de six mois &#224; compter de la promulgation de la pr&#233;sente loi, le Gouvernement remet au Parlement un rapport sur le financement des maisons d&#233;partementales des personnes handicap&#233;es ainsi que sur le budget qui leur est allou&#233; pour remplir leurs missions.</p>",
    "exposeSommaire": "<p style=\"text-align: justify;\">Gonfler les missions des MDPH est facile sur le papier. En r&#233;alit&#233;, les difficult&#233;s financi&#232;res et techniques que celles-ci rencontrent ne leur permettent pas de traiter les dossiers dans des temps ad&#233;quats. Nous consid&#233;rons que mettre ces &#233;tablissements sous pression sans leur donner, r&#233;ellement, les moyens de remplir leurs missions est contre-productif.</p>"
  },
  "representations": [
    {
      "nom": "PDF",
      "typeMime": {
        "type": "application",
        "subType": "PDF"
      },
      "statutRepresentation": {
        "verbatim": true,
        "canonique": true,
        "officielle": true,
        "transcription": false,
        "enregistrement": false
      },
      "contenu": {
        "documentURI": "/15/amendements/1230/AN/8.pdf"
      }
    }
  ],
  "seanceDiscussion": "RUANR5L15S2019IDS21270",
  "sort": {
    "dateSaisie": "2018-10-11T16:40:01.000+02:00",
    "sortEnSeance": "Tombé"
  },
  "dateDepot": "2018-10-04T02:00:00.000+02:00",
  "dateDistribution": "2018-10-09T02:00:00.000+02:00",
  "article99": "0",
  "loiReference": {}
}