{
  "uid": "AMANR5L15SEA717460BTC2124P0D1N1",
  "identifiant": {
    "legislature": "15",
    "numero": "1",
    "numRect": "0",
    "saisine": {
      "texteLegislatifRef": "PRJLANR5L15BTC2124",
      "numeroPartiePLF": "0",
      "organeExamen": "PO717460",
      "mentionSecondeDeliberation": "0"
    }
  },
  "numeroLong": "1",
  "etapeTexte": "1ère lecture (1ère assemblée saisie)",
  "triAmendement": "caaaaaaaaaaaaaaaaaaaaaaaaaaaaaaaaaaaaaaaaaaaaaaaaabo",
  "cardinaliteAmdtMultiples": "1",
  "etat": "Discuté",
  "signataires": {
    "auteur": {
      "typeAuteur": "Depute",
      "acteurRef": "PA720386",
      "groupePolitiqueRef": "PO730934"
    },
    "cosignatairesRefs": [
      "PA720386"
    ],
    "texteAffichable": "M.&#160;Di Filippo"
  },
  "pointeurFragmentTexte": {
    "division": {
      "titre": "Article PREMIER",
      "articleDesignationCourte": "ART. PREMIER",
      "type": "ARTICLE",
      "avantAApres": "A",
      "divisionRattachee": "ARTICLE PREMIER",
      "urlDivisionTexteVise": "/15/textes/2124.asp#D_Article_1er"
    }
  },
  "corps": {
    "dispositif": "<p>Supprimer cet article.</p>",
    "exposeSommaire": "<p>Cet article propose la ratification d&#8217;un accord qui facilite l&#8217;entr&#233;e sur le march&#233; europ&#233;en de produits qui ont &#233;t&#233; &#233;labor&#233;s selon des normes inf&#233;rieures aux standards europ&#233;ens, telle que la viande bovine nourrie aux farines animales et aux antibiotiques utilis&#233;s comme activateurs de croissance ou des denr&#233;es alimentaires produites avec des pesticides interdits dans l&#8217;UE. Les risques sanitaires pour le consommateur sont r&#233;els. Dans le rapport Schubert remis au Gouvernement en septembre 2017, il est rappel&#233; que &#171;&#160;rien n&#8217;est pr&#233;vu dans l&#8217;accord CETA en ce qui concerne&#160;:</p><p style=\"text-align: justify;\">- l&#8217;alimentation des animaux (utilisation de farines animales et de ma&#239;s et soja OGM, r&#233;sidus de pesticides&#8230;),</p><p style=\"text-align: justify;\">- l&#8217;utilisation des m&#233;dicaments v&#233;t&#233;rinaires (notamment des antibiotiques) en &#233;levage,</p><p style=\"text-align: justify;\">- le bien-&#234;tre des animaux (&#233;levage, transport et abattage).&#160;&#187; &#171;&#160;Le CETA laisse la possibilit&#233; au Canada d&#8217;utiliser des facteurs de croissance contenant des antibiotiques, avec toutefois des contraintes de d&#233;lais d&#8217;attente et d&#8217;absence de r&#233;sidus&#160;&#187;. &#171;&#160;L&#8217;UE ne leur impose pas [aux pays tiers] formellement l&#8217;interdiction de l&#8217;usage de substances pour lesquelles aucune LMR n&#8217;a &#233;t&#233; d&#233;finie dans l&#8217;UE, les autres restrictions d&#8217;usage dans l&#8217;UE (LMR et temps d&#8217;attente), et l&#8217;interdiction de l&#8217;usage des antibiotiques comme facteurs de croissance.&#160;&#187;&#160;;</p><p style=\"text-align: justify;\">&#160;&#171;&#160;On ne peut exclure que les impr&#233;cisions du CETA conduisent &#224; l&#8217;arriv&#233;e sur le march&#233; europ&#233;en de produits autoris&#233;s en vertu d&#8217;une r&#233;glementation ne prenant pas en compte le principe de pr&#233;caution.&#160;&#187;</p><p style=\"text-align: justify;\">Nos &#233;leveurs et nos agriculteurs, qui sont quant &#224; eux soumis &#224; des normes extr&#234;mement strictes, peuvent se retrouver en situation de concurrence d&#233;loyale par rapport aux agriculteurs et &#233;leveurs canadiens&#160;: le risque &#233;conomique pour eux est fort, notamment pour ceux qui travaillent dans la fili&#232;re bovine. Le CETA pr&#233;voit un contingent d&#8217;importation de 65 000 tonnes de viande bovine par an. Ceci repr&#233;sente l&#8217;&#233;quivalent du quart des importations actuelles de l&#8217;Union europ&#233;enne en viande bovine. Largement de quoi d&#233;stabiliser totalement un march&#233; d&#233;j&#224; fragile, avec une viande canadienne produite &#224; moindre co&#251;t du fait de normes moins exigeantes. Du fait d&#8217;un temps n&#233;cessaire &#224; l&#8217;adaptation des &#233;levages canadiens pour l&#8217;exportation vers l&#8217;UE (suppression des hormones de croissance dans l&#8217;alimentation des bovins), ces importations de viandes bovines n&#8217;ont pas encore d&#233;marr&#233;. Mais le Canada saura, tr&#232;s vite, remplir ce contingent important qu&#8217;il a si durement n&#233;goci&#233;.</p><p style=\"text-align: justify;\">Du point de vue &#233;conomique &#233;galement, le CETA met nos &#233;leveurs et nos agriculteurs en danger, puisqu&#8217;il pr&#233;voit des importations &#224; droits de douane nuls au profit du Canada, pour les viandes bovines, porcines, mais aussi pour le ma&#239;s ou le bl&#233;.</p><p style=\"text-align: justify;\">Enfin, du point de vue environnemental, comment accepter un accord qui encourage les investissements europ&#233;ens dans tous les secteurs de l&#8217;&#233;conomie canadienne, y compris les plus nocifs pour le climat, &#224; savoir l&#8217;exploitation des sables bitumineux&#160;? Le Canada se f&#233;licite par exemple d&#8217;avoir accru de 63&#160;% ses exportations de combustibles fossiles vers l&#8217;UE pour les douze premiers mois de la mise en application provisoire de l&#8217;accord. Comment accepter aussi que les seuls chapitres du CETA qui ne soient pas contraignants soient ceux qui portent sur l&#8217;environnement et les droits des travailleurs&#160;?</p><p style=\"text-align: justify;\">Cet amendement a donc pour objet de refuser la ratification de l&#8217;accord &#233;conomique et commercial entre l&#8217;Union Europ&#233;enne et le Canada (CETA).</p>"
  },
  "representations": [
    {
      "nom": "PDF",
      "typeMime": {
        "type": "application",
        "subType": "PDF"
      },
      "statutRepresentation": {
        "verbatim": true,
        "canonique": true,
        "officielle": true,
        "transcription": false,
        "enregistrement": false
      },
      "contenu": {
        "documentURI": "/15/amendements/2124/AN/1.pdf"
      }
    }
  ],
  "seanceDiscussion": "RUANR5L15S2019IDS21768",
  "sort": {
    "dateSaisie": "2019-07-18T00:40:57.000+02:00",
    "sortEnSeance": "Rejeté"
  },
  "dateDepot": "2019-07-10T02:00:00.000+02:00",
  "dateDistribution": "2019-07-16T02:00:00.000+02:00",
  "article99": "0",
  "loiReference": {}
}