{
  "uid": "AMANR5L15SEA717460B2272P2D1N721",
  "identifiant": {
    "legislature": "15",
    "numero": "721",
    "numRect": "0",
    "saisine": {
      "texteLegislatifRef": "PRJLANR5L15B2272",
      "numeroPartiePLF": "2",
      "organeExamen": "PO717460",
      "mentionSecondeDeliberation": "0"
    }
  },
  "numeroLong": "II-721",
  "etapeTexte": "1ère lecture (1ère assemblée saisie)",
  "triAmendement": "abtiaaaaaaaaaaaaaaaaaaaaaaaaaaaaaaaaaaaaaaaaaaaaaaamu",
  "cardinaliteAmdtMultiples": "1",
  "etat": "Discuté",
  "signataires": {
    "auteur": {
      "typeAuteur": "Depute",
      "acteurRef": "PA720100",
      "groupePolitiqueRef": "PO730934"
    },
    "cosignatairesRefs": [
      "PA720100"
    ],
    "texteAffichable": "M.&#160;Pradi&#233;"
  },
  "pointeurFragmentTexte": {
    "missionVisee": {
      "idMissionAN": "813",
      "libelleMission": "Enseignement scolaire",
      "codeMissionPLF": "B",
      "libelleMissionPLF": "Répartition, par mission et programme, des crédits du budget général"
    },
    "division": {
      "titre": "ÉTAT B",
      "articleDesignationCourte": "ART. 38",
      "type": "ANNEXE",
      "avantAApres": "A",
      "divisionRattachee": "ARTICLE 38",
      "urlDivisionTexteVise": "/15/textes/2272C.asp#D_ETAT_B"
    }
  },
  "corps": {
    "exposeSommaire": "<p>Pour la premi&#232;re fois depuis la mise en place des personnels charg&#233;s d&#8217;accompagner les &#233;l&#232;ves en situation de handicap (AESH), nous ne disposons pas de d&#233;tails pour distinguer les personnels d&#233;di&#233;s &#224; l&#8217;aide humaine, individuelle ou collective.</p><p>Cette globalisation des cr&#233;dits par rapport aux moyens r&#233;ellement mobilis&#233;s est tout &#224; fait regrettable, d&#8217;autant plus que la g&#233;n&#233;ralisation des aides mutualis&#233;es au d&#233;triment des aides individuelles est constat&#233;e sur le terrain et que le niveau d&#8217;encadrement notamment au sein des ULIS semblent se d&#233;grader.</p><p>En tout &#233;tat de cause, l&#8217;augmentation des cr&#233;dits visibles sur le budget n&#8217;est pas encore &#224; la hauteur du nombre d&#8217;enfant qui n&#233;cessite un accompagnement pour une scolarit&#233; compl&#232;te et non partielle et &#233;pisodique.</p><p>Le pr&#233;sent amendement vise donc &#224; abonder les cr&#233;dits de l&#8217;action 3 &#171;&#160;Inclusion scolaire des &#233;l&#232;ves en situation de handicap&#160;&#187;, du programme 230, &#171;&#160;Vie de l&#8217;&#233;l&#232;ve&#160;&#187; de 40&#160;361 416 Euros destin&#233;s &#224; la formation des AESH charg&#233;s de l&#8217;aide humaine aux &#233;l&#232;ves en situation de handicap. Cette augmentation est compens&#233;e par une diminution des cr&#233;dits de l&#8217;action 8 &#171;Logistique, systeme d'information, immobilier&#187; du programme 214 &#171;&#160;Soutien de la politique de l&#8217;&#233;ducation nationale&#160;&#187;.</p>",
    "dispositifAmdtCredit": {
      "listeProgrammes": [
        {
          "libelle": "Enseignement scolaire public du premier degré",
          "id": "88990",
          "AE": {
            "montantPositif": "0",
            "montantNegatif": "0"
          },
          "CP": {
            "montantPositif": "0",
            "montantNegatif": "0"
          },
          "action": "modification"
        },
        {
          "libelle": "Enseignement scolaire public du second degré",
          "id": "88991",
          "AE": {
            "montantPositif": "0",
            "montantNegatif": "0"
          },
          "CP": {
            "montantPositif": "0",
            "montantNegatif": "0"
          },
          "action": "modification"
        },
        {
          "libelle": "Vie de l'élève",
          "id": "88992",
          "AE": {
            "montantPositif": "40361416",
            "montantNegatif": "0"
          },
          "CP": {
            "montantPositif": "40361416",
            "montantNegatif": "0"
          },
          "action": "modification"
        },
        {
          "libelle": "Enseignement privé du premier et du second degrés",
          "id": "88993",
          "AE": {
            "montantPositif": "0",
            "montantNegatif": "0"
          },
          "CP": {
            "montantPositif": "0",
            "montantNegatif": "0"
          },
          "action": "modification"
        },
        {
          "libelle": "Soutien de la politique de l'éducation nationale",
          "id": "88994",
          "AE": {
            "montantPositif": "0",
            "montantNegatif": "40361416"
          },
          "CP": {
            "montantPositif": "0",
            "montantNegatif": "40361416"
          },
          "action": "modification"
        },
        {
          "libelle": "Enseignement technique agricole",
          "id": "88995",
          "AE": {
            "montantPositif": "0",
            "montantNegatif": "0"
          },
          "CP": {
            "montantPositif": "0",
            "montantNegatif": "0"
          },
          "action": "modification"
        }
      ],
      "totalAE": {
        "montantPositif": "40361416",
        "montantNegatif": "40361416",
        "solde": "0"
      },
      "totalCP": {
        "montantPositif": "40361416",
        "montantNegatif": "40361416",
        "solde": "0"
      }
    }
  },
  "representations": [
    {
      "nom": "PDF",
      "typeMime": {
        "type": "application",
        "subType": "PDF"
      },
      "statutRepresentation": {
        "verbatim": true,
        "canonique": true,
        "officielle": true,
        "transcription": false,
        "enregistrement": false
      },
      "contenu": {
        "documentURI": "/15/amendements/2272C/AN/721.pdf"
      }
    }
  ],
  "seanceDiscussion": "RUANR5L15S2020IDS21894",
  "sort": {
    "dateSaisie": "2019-10-30T01:33:25.000+01:00",
    "sortEnSeance": "Non soutenu"
  },
  "dateDepot": "2019-10-25T02:00:00.000+02:00",
  "dateDistribution": "2019-10-28T01:00:00.000+01:00",
  "article99": "0",
  "loiReference": {}
}