{
  "uid": "AMANR5L15PO59048B1255P2D1N187",
  "identifiant": {
    "legislature": "15",
    "numero": "187",
    "numRect": "0",
    "saisine": {
      "texteLegislatifRef": "PRJLANR5L15B1255",
      "numeroPartiePLF": "2",
      "organeExamen": "PO59048",
      "mentionSecondeDeliberation": "0"
    }
  },
  "numeroLong": "II-CF187",
  "etapeTexte": "1ère lecture (1ère assemblée saisie)",
  "triAmendement": "aqaaaaaaaaaaaaaaaaaaaaaaaaaaaaaaaaaaaaaaaaaaaaaaaai",
  "cardinaliteAmdtMultiples": "1",
  "etat": "Discuté",
  "signataires": {
    "auteur": {
      "typeAuteur": "Depute",
      "acteurRef": "PA608172",
      "groupePolitiqueRef": "PO758835"
    },
    "cosignatairesRefs": [
      "PA608172",
      "PA605069"
    ],
    "texteAffichable": "Mme&#160;Pires Beaune,  M.&#160;Jean-Louis&#160;Bricout et les membres du groupe Socialistes et apparent&#233;s"
  },
  "pointeurFragmentTexte": {
    "missionVisee": {
      "idMissionAN": "397",
      "libelleMission": "Conseil et contrôle de l'État",
      "codeMissionPLF": "B",
      "libelleMissionPLF": "Répartition, par mission et programme, des crédits du budget général"
    },
    "division": {
      "titre": "ÉTAT B",
      "articleDesignationCourte": "ART. 39",
      "type": "ANNEXE",
      "avantAApres": "A",
      "divisionRattachee": "ARTICLE 39",
      "urlDivisionTexteVise": "/15/textes/1255C.asp#D_ETAT_B"
    }
  },
  "corps": {
    "exposeSommaire": "<p style=\"text-align: justify;\">Le groupe Socialistes et apparent&#233;s entend, par cet amendement, augmenter de 6 millions d'euros le budget de la Cour nationale du droit d&#8217;asile afin de permettre la cr&#233;ation de postes au sein de cette juridiction (ce qui correspondrait &#224; environ 100 rapporteurs suppl&#233;mentaires).</p><p style=\"text-align: justify;\">Cette augmentation de moyens apparait d&#8217;autant plus n&#233;cessaire que la r&#233;cente loi relative &#224; l&#8217;asile et l&#8217;immigration a r&#233;duit les d&#233;lais de jugement devant la CNDA, mettant sous pression les personnels charg&#233;s de pr&#233;parer les d&#233;cisions.</p><p style=\"text-align: justify;\">Le droit &#224; un jugement &#233;quitable impose que les dossiers des demandeurs d&#8217;asile soient trait&#233;s s&#233;rieusement, ce que le raccourcissement des d&#233;lais est d&#233;j&#224; venu en partie compromettre. Tel est le sens de cet amendement qui vise &#224; compenser par la cr&#233;ation de postes de &#171;&#160;rapporteurs&#160;&#187; des d&#233;lais qui sont pour ces derniers intenables.</p><p style=\"text-align: justify;\">Aussi cet amendement propose-t-il d&#8217;augmenter de 6 millions d'euros le programme 165 et en particulier l&#8217;action &#171;&#160;Cour nationale du droit d&#8217;asile&#160;&#187; et de baisser corr&#233;lativement le programme 164 et en particulier l&#8217;action &#171;&#160;pilotage et soutien des juridictions financi&#232;res&#160;&#187;.</p>",
    "dispositifAmdtCredit": {
      "listeProgrammes": [
        {
          "libelle": "Conseil d'État et autres juridictions administratives",
          "id": "19885",
          "AE": {
            "montantPositif": "6000000",
            "montantNegatif": "0"
          },
          "CP": {
            "montantPositif": "6000000",
            "montantNegatif": "0"
          },
          "action": "modification"
        },
        {
          "libelle": "Conseil économique, social et environnemental",
          "id": "19886",
          "AE": {
            "montantPositif": "0",
            "montantNegatif": "0"
          },
          "CP": {
            "montantPositif": "0",
            "montantNegatif": "0"
          },
          "action": "modification"
        },
        {
          "libelle": "Cour des comptes et autres juridictions financières",
          "id": "19887",
          "AE": {
            "montantPositif": "0",
            "montantNegatif": "6000000"
          },
          "CP": {
            "montantPositif": "0",
            "montantNegatif": "6000000"
          },
          "action": "modification"
        },
        {
          "libelle": "Haut Conseil des finances publiques",
          "id": "19888",
          "AE": {
            "montantPositif": "0",
            "montantNegatif": "0"
          },
          "CP": {
            "montantPositif": "0",
            "montantNegatif": "0"
          },
          "action": "modification"
        }
      ],
      "totalAE": {
        "montantPositif": "6000000",
        "montantNegatif": "6000000",
        "solde": "0"
      },
      "totalCP": {
        "montantPositif": "6000000",
        "montantNegatif": "6000000",
        "solde": "0"
      }
    }
  },
  "representations": [
    {
      "nom": "PDF",
      "typeMime": {
        "type": "application",
        "subType": "PDF"
      },
      "statutRepresentation": {
        "verbatim": true,
        "canonique": true,
        "officielle": true,
        "transcription": false,
        "enregistrement": false
      },
      "contenu": {
        "documentURI": "/15/amendements/1255C/CION_FIN/CF187.pdf"
      }
    }
  ],
  "sort": {
    "dateSaisie": "2018-10-23T17:27:14.000+02:00",
    "sortEnSeance": "Non soutenu"
  },
  "dateDepot": "2018-10-18T02:00:00.000+02:00",
  "dateDistribution": "2018-10-23T02:00:00.000+02:00",
  "article99": "0",
  "loiReference": {}
}