{
  "uid": "AMANR5L15SEA717460BTC1094P0D1N34",
  "identifiant": {
    "legislature": "15",
    "numero": "34",
    "numRect": "0",
    "saisine": {
      "texteLegislatifRef": "PNREANR5L15BTC1094",
      "numeroPartiePLF": "0",
      "organeExamen": "PO717460",
      "mentionSecondeDeliberation": "0"
    }
  },
  "numeroLong": "34",
  "etapeTexte": "Lecture unique",
  "triAmendement": "rc",
  "cardinaliteAmdtMultiples": "1",
  "amendementParent": "AMANR5L15SEA717460BTC1094P0D1N10",
  "etat": "Discuté",
  "signataires": {
    "auteur": {
      "typeAuteur": "Depute",
      "acteurRef": "PA720780",
      "groupePolitiqueRef": "PO730964"
    },
    "cosignatairesRefs": [
      "PA720780"
    ],
    "texteAffichable": "M.&#160;Sempastous"
  },
  "pointeurFragmentTexte": {
    "division": {
      "titre": "Article unique",
      "articleDesignationCourte": "ART. UNIQUE",
      "type": "ARTICLE",
      "avantAApres": "A",
      "divisionRattachee": "ARTICLE UNIQUE",
      "urlDivisionTexteVise": "/15/textes/1094.asp#D_Article_unique"
    },
    "alinea": {
      "avantAApres": "Apres",
      "numero": "62"
    }
  },
  "corps": {
    "dispositif": "<p style=\"text-align: justify;\">I. &#8211;&#160;R&#233;diger ainsi&#160;l&#8217;alin&#233;a&#160;1&#160;:</p><p style=\"text-align: justify;\">&#171;&#160;Compl&#233;ter l&#8217;alin&#233;a&#160;62 par les mots&#160;:&#160;&#187;</p><p style=\"text-align: justify;\">II. &#8211; En cons&#233;quence, au d&#233;but de l&#8217;alin&#233;a&#160;2, substituer aux mots&#160;:</p><p style=\"text-align: justify;\">&#171;&#160;21 <i>ter</i>. R&#233;affirme que la politique agricole commune a pour mission de&#160;&#187;</p><p style=\"text-align: justify;\">le mot&#160;:</p><p style=\"text-align: justify;\">&#171;&#160;pour&#160;&#187;.</p>",
    "exposeSommaire": "<p style=\"text-align: justify;\">Afin d'&#233;viter la r&#233;p&#233;tition d'une m&#234;me id&#233;e, cet amendement propose de rattacher le dispositif propos&#233; &#224; l'alin&#233;a 62, qui traite du m&#234;me sujet.</p>"
  },
  "representations": [
    {
      "nom": "PDF",
      "typeMime": {
        "type": "application",
        "subType": "PDF"
      },
      "statutRepresentation": {
        "verbatim": true,
        "canonique": true,
        "officielle": true,
        "transcription": false,
        "enregistrement": false
      },
      "contenu": {
        "documentURI": "/15/amendements/1094/AN/34.pdf"
      }
    }
  ],
  "seanceDiscussion": "RUANR5L15S2018IDS21133",
  "sort": {
    "dateSaisie": "2018-06-28T12:41:42.000+02:00",
    "sortEnSeance": "Adopté"
  },
  "dateDepot": "2018-06-26T02:00:00.000+02:00",
  "dateDistribution": "2018-06-26T02:00:00.000+02:00",
  "article99": "0",
  "loiReference": {}
}