{
  "uid": "AMANR5L15PO59051B1503P0D1N337",
  "identifiant": {
    "legislature": "15",
    "numero": "337",
    "numRect": "0",
    "saisine": {
      "texteLegislatifRef": "PRJLANR5L15B1503",
      "numeroPartiePLF": "0",
      "organeExamen": "PO59051",
      "mentionSecondeDeliberation": "0"
    }
  },
  "numeroLong": "CL337",
  "etapeTexte": "Nouvelle Lecture",
  "triAmendement": "lbiaaaaaaaaaaaaaaaaaaaaaaaaaaaaaaaaaaaaaaaaaaaaaaas",
  "cardinaliteAmdtMultiples": "1",
  "etat": "Irrecevable",
  "signataires": {
    "auteur": {
      "typeAuteur": "Depute",
      "acteurRef": "PA266797",
      "groupePolitiqueRef": "PO730934"
    },
    "cosignatairesRefs": [
      "PA719272",
      "PA1874",
      "PA267429",
      "PA267289",
      "PA642847",
      "PA267527",
      "PA608016",
      "PA2492",
      "PA709315",
      "PA346218",
      "PA748954",
      "PA2155",
      "PA718850",
      "PA340853",
      "PA336316",
      "PA267450",
      "PA330008",
      "PA608416",
      "PA719318",
      "PA720644",
      "PA718884",
      "PA721678",
      "PA267735",
      "PA334654",
      "PA720630",
      "PA266797",
      "PA721314",
      "PA330909",
      "PA718838",
      "PA721474",
      "PA721506"
    ],
    "texteAffichable": "M.&#160;Gosselin,  Mme&#160;Meunier, M.&#160;Reda, Mme&#160;Anthoine, Mme&#160;Bazin-Malgras, M.&#160;Quentin, M.&#160;Nury, Mme&#160;Kuster, M.&#160;Minot, M.&#160;Breton, M.&#160;Straumann, M.&#160;Brun, M.&#160;Le Fur, M.&#160;Bouchet, M.&#160;Door, M.&#160;Viala, M.&#160;Schellenberger, M.&#160;Masson, M.&#160;R&#233;mi&#160;Delatte, M.&#160;de Ganay, M.&#160;Saddier, Mme&#160;Louwagie, M.&#160;Menuel, M.&#160;Cordier, M.&#160;Cinieri, M.&#160;Viry, M.&#160;Hetzel, M.&#160;Leclerc, M.&#160;Savignat, M.&#160;Bazin et M.&#160;Descoeur"
  },
  "pointeurFragmentTexte": {
    "division": {
      "titre": "Article 52",
      "articleDesignationCourte": "AVANT ART. 52",
      "type": "ARTICLE",
      "avantAApres": "Avant",
      "divisionRattachee": "AVANT L'ARTICLE 52, insérer l'article suivant:",
      "articleAdditionnel": "1",
      "urlDivisionTexteVise": "/15/textes/1503.asp#D_Article_52"
    }
  },
  "corps": {
    "dispositif": "<p style=\"text-align: justify;\">Le premier alin&#233;a de l&#8217;article 20-5 de l&#8217;ordonnance n&#176; 45-174 du 2 f&#233;vrier 1945 relative &#224; l&#8217;enfance d&#233;linquante est ainsi modifi&#233; :<br />1&#176; &#192; la fin de la premi&#232;re phrase, les mots : &#171; seize &#224; dix-huit ans &#187; sont remplac&#233;s par les mots et la phrase : &#171; treize &#224; dix-huit ans. L&#8217;accord des parents est n&#233;cessaire pour les mineurs &#226;g&#233;s de moins de seize ans. &#187; ;<br />2&#176; &#192; la derni&#232;re phrase, le mot : &#171; seize &#187; est remplac&#233; par le mot : &#171; treize &#187;.</p>",
    "exposeSommaire": "<p style=\"text-align: justify;\">Cet amendement a &#233;t&#233; d&#233;pos&#233; en premi&#232;re lecture par nos coll&#232;gues s&#233;nateurs.<br />Afin de permettre au juge d&#8217;adapter la peine sans recourir &#224; l&#8217;emprisonnement ou &#224; des sanctions &#233;ducatives de moindre port&#233;e, cet amendement pr&#233;voit que la peine consistant en l&#8217;ex&#233;cution de travaux d&#8217;int&#233;r&#234;t g&#233;n&#233;ral, actuellement limit&#233;e aux mineurs de plus de 16 ans, peut &#234;tre prononc&#233;e &#224; partir de l&#8217;&#226;ge de 13 ans. Entre 13 ans et 16 ans, les parents devront donner leur accord pr&#233;alable.</p>",
    "cartoucheDelaiDepotDepasse": "Sous réserve de son traitement par les services de l'Assemblée nationale et de sa recevabilité"
  },
  "representations": [
    {
      "nom": "PDF",
      "typeMime": {
        "type": "application",
        "subType": "PDF"
      },
      "statutRepresentation": {
        "verbatim": true,
        "canonique": true,
        "officielle": true,
        "transcription": false,
        "enregistrement": false
      },
      "contenu": {
        "documentURI": "/15/amendements/1503/CION_LOIS/CL337.pdf"
      }
    }
  ],
  "dateDepot": "2018-12-17T01:00:00.000+01:00",
  "article99": "0",
  "loiReference": {}
}