{
  "uid": "AMANR5L15PO419610B0846P0D1N2342",
  "identifiant": {
    "legislature": "15",
    "numero": "2342",
    "numRect": "0",
    "saisine": {
      "texteLegislatifRef": "PRJLANR5L15B0846",
      "numeroPartiePLF": "0",
      "organeExamen": "PO419610",
      "mentionSecondeDeliberation": "0"
    }
  },
  "numeroLong": "CE2342",
  "etapeTexte": "1ère lecture (1ère assemblée saisie)",
  "triAmendement": "ufni",
  "cardinaliteAmdtMultiples": "1",
  "etat": "Discuté",
  "signataires": {
    "auteur": {
      "typeAuteur": "Depute",
      "acteurRef": "PA405480",
      "groupePolitiqueRef": "PO730946"
    },
    "cosignatairesRefs": [
      "PA608695",
      "PA405480",
      "PA429893",
      "PA508",
      "PA333818",
      "PA610681",
      "PA337483",
      "PA335054"
    ],
    "texteAffichable": "M.&#160;Pupponi,  Mme&#160;Bareigts, Mme&#160;Bi&#233;mouret, M.&#160;Carvounas, Mme&#160;Karamanli, Mme&#160;Untermaier, M.&#160;Letchimy et M.&#160;Hutin"
  },
  "pointeurFragmentTexte": {
    "division": {
      "titre": "Article 20",
      "articleDesignationCourte": "ART. 20",
      "type": "ARTICLE",
      "avantAApres": "A",
      "divisionRattachee": "ARTICLE 20",
      "urlDivisionTexteVise": "/15/textes/0846.asp#D_Article_20"
    },
    "alinea": {
      "avantAApres": "Apres",
      "numero": "7"
    }
  },
  "corps": {
    "dispositif": "<p>Apr&#232;s l&#8217;alin&#233;a&#160;7, ins&#233;rer l&#8217;alin&#233;a suivant&#160;:</p><p>&#171;&#160;II <i>bis&#160;</i>- Le second alin&#233;a de l&#8217;article L.&#160;1414&#8209;4 du code g&#233;n&#233;ral des collectivit&#233;s territoriales est compl&#233;t&#233; par les mots &#171;&#160;ou qui ont &#233;t&#233; pass&#233;s par des offices publics de l&#8217;habitat&#160;&#187;</p><p>&#160;</p>",
    "exposeSommaire": "<p>Imposer aux offices publics de l&#8217;habitat les m&#234;mes modalit&#233;s de gouvernance que leurs collectivit&#233;s de rattachement, notamment en mati&#232;re de passation des march&#233;s et particuli&#232;rement de passation des avenants, alors que leurs r&#232;gles de fonctionnement doivent &#234;tre adapt&#233;es &#224; leur activit&#233; d&#8217;op&#233;rateur &#233;conomique, constitue un frein pour ces organismes &#224; l&#8217;accomplissement de leurs missions et donc &#224; la satisfaction des objectifs de production de logements sociaux fix&#233;s par les pouvoirs publics.</p><p>Cet amendement vise &#224; supprimer la disposition pr&#233;voyant de soumettre pour avis &#224; la commission d&#8217;appel d&#8217;offres, tout projet d&#8217;avenant qui entra&#238;ne une augmentation du montant global du march&#233; initial sup&#233;rieure &#224; 5 %. En effet, les contraintes li&#233;es &#224; l&#8217;organisation de la consultation de la CAO sont incompatibles avec la r&#233;activit&#233; dont un office public de l&#8217;habitat a besoin pour remplir au quotidien ses missions de service public.</p><p>Au surplus, il est &#224; noter que les projets d'avenant aux march&#233;s publics des organismes priv&#233;s Hlm, &#224; savoir, les soci&#233;t&#233;s anonymes Hlm (ESH) et les soci&#233;t&#233;s anonymes coop&#233;ratives Hlm, ainsi que des SEM exer&#231;ant une activit&#233; de construction ou de gestion de logements sociaux, n&#8217;ont pas &#224; &#234;tre soumis pour avis &#224; la commission d'appel d'offres, et cela quels que soient leurs montants. L&#8217;obligation susvis&#233;e constitue une rupture d&#8217;&#233;galit&#233; devant les charges publiques entre les op&#233;rateurs du logement social.</p>"
  },
  "representations": [
    {
      "nom": "PDF",
      "typeMime": {
        "type": "application",
        "subType": "PDF"
      },
      "statutRepresentation": {
        "verbatim": true,
        "canonique": true,
        "officielle": true,
        "transcription": false,
        "enregistrement": false
      },
      "contenu": {
        "documentURI": "/15/amendements/0846/CION-ECO/CE2342.pdf"
      }
    }
  ],
  "sort": {
    "dateSaisie": "2018-05-16T19:50:37.000+02:00",
    "sortEnSeance": "Non soutenu"
  },
  "dateDepot": "2018-05-09T02:00:00.000+02:00",
  "dateDistribution": "2018-05-14T02:00:00.000+02:00",
  "article99": "0",
  "loiReference": {}
}