{
  "uid": "AMANR5L15PO419865B2274P0D1N1494",
  "identifiant": {
    "legislature": "15",
    "numero": "1494",
    "numRect": "0",
    "saisine": {
      "texteLegislatifRef": "PRJLANR5L15B2274",
      "numeroPartiePLF": "0",
      "organeExamen": "PO419865",
      "mentionSecondeDeliberation": "0"
    }
  },
  "numeroLong": "CD1494",
  "etapeTexte": "1ère lecture (2ème assemblée saisie)",
  "triAmendement": "bmaaaaaaaaaaaaaaaaaaaaaaaaaaaaaaaaaaaaaaaaaaaaaaaaw",
  "cardinaliteAmdtMultiples": "1",
  "etat": "En traitement",
  "signataires": {
    "auteur": {
      "typeAuteur": "Depute",
      "acteurRef": "PA721142",
      "groupePolitiqueRef": "PO730964"
    },
    "cosignatairesRefs": [
      "PA721142"
    ],
    "texteAffichable": "Mme&#160;Forteza"
  },
  "pointeurFragmentTexte": {
    "division": {
      "titre": "Article 4 quater D",
      "articleDesignationCourte": "ART. 4 QUATER D",
      "type": "ARTICLE",
      "avantAApres": "A",
      "divisionRattachee": "ARTICLE 4 QUATER D",
      "urlDivisionTexteVise": "/15/textes/2274.asp#D_Article_4_quater_D"
    }
  },
  "corps": {
    "dispositif": "<p style=\"text-align: justify;\">&#160;<br />A l&#8217;article 4 quater D, remplacer les mots &#8220;fabricants de t&#233;l&#233;phones mobiles et de tablettes tactiles sont remplac&#233;s par les mots &#8220;les fabricants d&#8217;&#233;quipements &#233;lectriques et &#233;lectroniques&#8221;.</p>",
    "exposeSommaire": "<p style=\"text-align: justify;\">&#160;<br />Cet amendement a pour objet d&#8217;&#233;largir le dispositif de garantie logicielle pr&#233;vue par l&#8217;article 4 quater D &#224; l&#8217;ensemble des &#233;quipements &#233;lectriques et &#233;lectroniques et non uniquement aux t&#233;l&#233;phones et tablettes. </p><p style=\"text-align: justify;\">Au vue de la vitesse d&#8217;&#233;volution des technologies de t&#233;l&#233;communications portatives et de l&#8217;explosion des objets connect&#233;s, la prise de dispositions sp&#233;cifiques applicables born&#233;e &#224; la t&#233;l&#233;phonie mobile et aux tablettes tactiles n&#8217;est d&#233;j&#224; plus adapt&#233;e aux paysage technologique r&#233;cent. </p><p style=\"text-align: justify;\">Il convient de cr&#233;er un cadre g&#233;n&#233;ral de protection des consommateur face aux cons&#233;quences potentielles des mises &#224; jour contingentes sur tout appareil &#233;lectroniques et &#233;lectriques utilisant un syst&#232;me d'exploitation.</p>",
    "cartoucheDelaiDepotDepasse": "Sous réserve de son traitement par les services de l'Assemblée nationale et de sa recevabilité"
  },
  "representations": [
    {
      "nom": "PDF",
      "typeMime": {
        "type": "application",
        "subType": "PDF"
      },
      "statutRepresentation": {
        "verbatim": true,
        "canonique": true,
        "officielle": true,
        "transcription": false,
        "enregistrement": false
      },
      "contenu": {
        "documentURI": "/15/amendements/2274/CION-DVP/CD1494.pdf"
      }
    }
  ],
  "dateDepot": "2019-11-20T01:00:00.000+01:00",
  "article99": "0",
  "loiReference": {}
}