{
  "uid": "AMANR5L15SEA717460BTC0902P0D1N2702",
  "identifiant": {
    "legislature": "15",
    "numero": "2702",
    "numRect": "1",
    "saisine": {
      "texteLegislatifRef": "PRJLANR5L15BTC0902",
      "numeroPartiePLF": "0",
      "organeExamen": "PO717460",
      "mentionSecondeDeliberation": "0"
    }
  },
  "numeroLong": "2702 (Rect)",
  "etapeTexte": "1ère lecture (1ère assemblée saisie)",
  "triAmendement": "cbtk",
  "cardinaliteAmdtMultiples": "1",
  "amendementParent": "AMANR5L15SEA717460BTC0902P0D1N2653",
  "etat": "Discuté",
  "signataires": {
    "auteur": {
      "typeAuteur": "Depute",
      "acteurRef": "PA942",
      "groupePolitiqueRef": "PO744425"
    },
    "cosignatairesRefs": [
      "PA267042",
      "PA268019",
      "PA331582",
      "PA332228",
      "PA267355",
      "PA720230",
      "PA942",
      "PA335758"
    ],
    "texteAffichable": "M.&#160;Charles&#160;de Courson,  M.&#160;Benoit, M.&#160;Herth, Mme&#160;Magnier, M.&#160;Philippe&#160;Vigier, M.&#160;Riester, M.&#160;Lagarde et M.&#160;Favennec Becot"
  },
  "pointeurFragmentTexte": {
    "division": {
      "titre": "Article 10 ter",
      "articleDesignationCourte": "APRÈS ART. 10 TER",
      "type": "ARTICLE",
      "avantAApres": "Apres",
      "divisionRattachee": "APRÈS L'ARTICLE 10 TER, insérer l'article suivant:",
      "articleAdditionnel": "1",
      "urlDivisionTexteVise": "/15/textes/0902.asp#D_Article_10_ter"
    }
  },
  "corps": {
    "dispositif": "<p style=\"text-align: justify;\">Compl&#233;ter l&#8217;alin&#233;a&#160;7 par la phrase suivante&#160;:</p><p style=\"text-align: justify;\">&#171;&#160;Elle analyse &#233;galement les accords d&#8217;achat group&#233;s de produits alimentaires au regard de l'objectif &#233;nonc&#233; au <i>b</i> du 1 de l&#8217;article&#160;39 du Trait&#233; sur le fonctionnement de l&#8217;Union&#160;europ&#233;enne&#160;&#187;.</p>",
    "exposeSommaire": "<p style=\"text-align: justify;\">Dans le cas des fili&#232;res alimentaires, l&#8217;enjeu est v&#233;ritablement d&#8217;examiner si les objectifs de la PAC sont respect&#233;s et notamment celui d&#8217;assurer un niveau de vie &#233;quitable aux agriculteurs.</p>"
  },
  "representations": [
    {
      "nom": "PDF",
      "typeMime": {
        "type": "application",
        "subType": "PDF"
      },
      "statutRepresentation": {
        "verbatim": true,
        "canonique": true,
        "officielle": true,
        "transcription": false,
        "enregistrement": false
      },
      "contenu": {
        "documentURI": "/15/amendements/0902/AN/2702.pdf"
      }
    }
  ],
  "seanceDiscussion": "RUANR5L15S2018IDS21055",
  "sort": {
    "dateSaisie": "2018-05-25T18:51:14.000+02:00",
    "sortEnSeance": "Rejeté"
  },
  "dateDepot": "2018-05-22T02:00:00.000+02:00",
  "dateDistribution": "2018-05-22T02:00:00.000+02:00",
  "article99": "0",
  "loiReference": {
    "codeLoi": "c commerce",
    "divisionCodeLoi": "L462-10"
  }
}