{
  "uid": "AMANR5L15SEA717460BTC0019P0D1N162",
  "identifiant": {
    "legislature": "15",
    "numero": "162",
    "numRect": "0",
    "saisine": {
      "texteLegislatifRef": "PRJLANR5L15BTC0019",
      "numeroPartiePLF": "0",
      "organeExamen": "PO717460",
      "mentionSecondeDeliberation": "0"
    }
  },
  "numeroLong": "162",
  "etapeTexte": "1ère lecture (1ère assemblée saisie)",
  "triAmendement": "oy",
  "cardinaliteAmdtMultiples": "1",
  "etat": "Discuté",
  "signataires": {
    "auteur": {
      "typeAuteur": "Depute",
      "acteurRef": "PA719578",
      "groupePolitiqueRef": "PO730958"
    },
    "cosignatairesRefs": [
      "PA720430",
      "PA721226",
      "PA721062",
      "PA719578",
      "PA721960",
      "PA720422",
      "PA719676",
      "PA718860",
      "PA722142",
      "PA718868",
      "PA720892",
      "PA721202",
      "PA2150",
      "PA588884",
      "PA720846",
      "PA721210",
      "PA720286"
    ],
    "texteAffichable": "M.&#160;Prud&apos;homme,  Mme&#160;Autain, M.&#160;Bernalicis, M.&#160;Coquerel, M.&#160;Corbi&#232;re, Mme&#160;Fiat, M.&#160;Lachaud, M.&#160;Larive, M.&#160;M&#233;lenchon, Mme&#160;Obono, Mme&#160;Panot, M.&#160;Quatennens, M.&#160;Ratenon, Mme&#160;Ressiguier, Mme&#160;Rubin, M.&#160;Ruffin et Mme&#160;Taurine"
  },
  "pointeurFragmentTexte": {
    "division": {
      "titre": "Article 2",
      "articleDesignationCourte": "ART. 2",
      "type": "ARTICLE",
      "avantAApres": "A",
      "divisionRattachee": "ARTICLE 2",
      "urlDivisionTexteVise": "/15/textes/0019.asp#D_Article_2"
    },
    "alinea": {
      "numero": "8"
    }
  },
  "corps": {
    "dispositif": "<p style=\"text-align: justify;\">Supprimer l&#8217;alin&#233;a&#160;8.</p>",
    "exposeSommaire": "<p style=\"text-align: justify;\">Selon nous, rien ne justifie ni la m&#233;thode, ni l&#8217;empressement du Gouvernement &#224; faire examiner ce projet de loi par le Parlement dans de telles conditions. L&#8217;ampleur des r&#233;formes qui y sont propos&#233;es m&#233;rite un examen serein et exhaustif par le Parlement.</p>"
  },
  "representations": [
    {
      "nom": "PDF",
      "typeMime": {
        "type": "application",
        "subType": "PDF"
      },
      "statutRepresentation": {
        "verbatim": true,
        "canonique": true,
        "officielle": true,
        "transcription": false,
        "enregistrement": false
      },
      "contenu": {
        "documentURI": "/15/amendements/0019/AN/162.pdf"
      }
    }
  ],
  "seanceDiscussion": "RUANR5L15S2017IDS20611",
  "sort": {
    "dateSaisie": "2017-07-11T23:13:39.000+02:00",
    "sortEnSeance": "Rejeté"
  },
  "dateDepot": "2017-07-07T02:00:00.000+02:00",
  "dateDistribution": "2017-07-08T02:00:00.000+02:00",
  "article99": "0",
  "loiReference": {}
}