{
  "uid": "AMANR5L15SEA717460B1255P2D1N1533",
  "identifiant": {
    "legislature": "15",
    "numero": "1533",
    "numRect": "0",
    "saisine": {
      "texteLegislatifRef": "PRJLANR5L15B1255",
      "numeroPartiePLF": "2",
      "organeExamen": "PO717460",
      "mentionSecondeDeliberation": "1"
    }
  },
  "numeroLong": "II-1533",
  "etapeTexte": "1ère lecture (1ère assemblée saisie)",
  "triAmendement": "ibaaaaaaaaaaaaaaaaaaaaaaaaaaaaaaaaaaaaaaaaaaaaaaaahvi",
  "cardinaliteAmdtMultiples": "1",
  "etat": "Discuté",
  "signataires": {
    "auteur": {
      "typeAuteur": "Depute",
      "acteurRef": "PA267336",
      "groupePolitiqueRef": "PO730964"
    },
    "cosignatairesRefs": [
      "PA267336"
    ],
    "texteAffichable": "M.&#160;Giraud"
  },
  "pointeurFragmentTexte": {
    "division": {
      "titre": "Article 62",
      "articleDesignationCourte": "ART. 62",
      "type": "ARTICLE",
      "avantAApres": "A",
      "divisionRattachee": "ARTICLE 62",
      "urlDivisionTexteVise": "/15/textes/1255C.asp#D_Article_62"
    },
    "alinea": {
      "numero": "37"
    }
  },
  "corps": {
    "dispositif": "<p style=\"text-align: justify;\">&#192; l&#8217;alin&#233;a&#160;37, substituer aux mots&#160;:</p><p style=\"text-align: justify;\">&#171;&#160;relevant de&#160;&#187;</p><p style=\"text-align: justify;\">les mots&#160;:</p><p style=\"text-align: justify;\">&#171;&#160;r&#233;gies par&#160;&#187;.</p>",
    "exposeSommaire": "<p>Amendement r&#233;dactionnel.</p>"
  },
  "representations": [
    {
      "nom": "PDF",
      "typeMime": {
        "type": "application",
        "subType": "PDF"
      },
      "statutRepresentation": {
        "verbatim": true,
        "canonique": true,
        "officielle": true,
        "transcription": false,
        "enregistrement": false
      },
      "contenu": {
        "documentURI": "/15/amendements/1255C/AN/1533.pdf"
      }
    }
  ],
  "seanceDiscussion": "RUANR5L15S2019IDS21345",
  "sort": {
    "dateSaisie": "2018-11-16T18:43:47.000+01:00",
    "sortEnSeance": "Adopté"
  },
  "dateDepot": "2018-11-07T01:00:00.000+01:00",
  "dateDistribution": "2018-11-16T01:00:00.000+01:00",
  "article99": "0",
  "loiReference": {}
}