{
  "uid": "AMANR5L15PO766718B2187P0D1N304",
  "identifiant": {
    "legislature": "15",
    "numero": "304",
    "numRect": "0",
    "saisine": {
      "texteLegislatifRef": "PRJLANR5L15B2187",
      "numeroPartiePLF": "0",
      "organeExamen": "PO766718",
      "mentionSecondeDeliberation": "0"
    }
  },
  "numeroLong": "304",
  "etapeTexte": "1ère lecture (1ère assemblée saisie)",
  "triAmendement": "giaaaaaaaaaaaaaaaaaaaaaaaaaaaaaaaaaaaaaaaaaaaaaaaawdg",
  "cardinaliteAmdtMultiples": "1",
  "etat": "Discuté",
  "signataires": {
    "auteur": {
      "typeAuteur": "Depute",
      "acteurRef": "PA608416",
      "groupePolitiqueRef": "PO730934"
    },
    "cosignatairesRefs": [
      "PA608416"
    ],
    "texteAffichable": "M.&#160;Hetzel"
  },
  "pointeurFragmentTexte": {
    "division": {
      "titre": "Article 19",
      "articleDesignationCourte": "ART. 19",
      "type": "ARTICLE",
      "avantAApres": "A",
      "divisionRattachee": "ARTICLE 19",
      "urlDivisionTexteVise": "/15/textes/2187.asp#D_Article_19"
    },
    "alinea": {
      "avantAApres": "Apres",
      "numero": "18"
    }
  },
  "corps": {
    "dispositif": "<p style=\"text-align: justify;\">I.&#160;&#8211;&#160;Compl&#233;ter cet article par l&#8217;alin&#233;a suivant&#160;:</p><p style=\"text-align: justify;\">&#171;&#160;II.&#160;&#8211;&#160;Toute nouvelle technique d&#8217;examen de biologie m&#233;dicale en vue d&#8217;&#233;tablir un diagnostic pr&#233;natal doit faire l&#8217;objet d&#8217;une autorisation l&#233;gislative.&#160;&#187;</p><p style=\"text-align: justify;\">II.&#160;&#8211;&#160;En cons&#233;quence, apr&#232;s la r&#233;f&#233;rence&#160;:</p><p style=\"text-align: justify;\">&#171;&#160;<i>Art.&#160;L&#160;2131&#8209;1&#8209;2</i>&#160;&#187;</p><p style=\"text-align: justify;\">ins&#233;rer la mention&#160;:</p><p style=\"text-align: justify;\">&#171;&#160;I.&#160;&#8211;&#160;&#187;.</p>",
    "exposeSommaire": "<p style=\"text-align: justify;\">Il ne peut &#234;tre laiss&#233; &#224; la seule appr&#233;ciation des seules autorit&#233;s administratives la responsabilit&#233; de mettre en place de nouvelles techniques de diagnostic en population g&#233;n&#233;rale. La repr&#233;sentation nationale, dans le cadre d'un d&#233;bat public, doit y &#234;tre associ&#233;e.</p>"
  },
  "representations": [
    {
      "nom": "PDF",
      "typeMime": {
        "type": "application",
        "subType": "PDF"
      },
      "statutRepresentation": {
        "verbatim": true,
        "canonique": true,
        "officielle": true,
        "transcription": false,
        "enregistrement": false
      },
      "contenu": {
        "documentURI": "/15/amendements/2187/CSBIOETH/304.pdf"
      }
    }
  ],
  "sort": {
    "dateSaisie": "2019-09-13T19:50:14.000+02:00",
    "sortEnSeance": "Rejeté"
  },
  "dateDepot": "2019-08-01T02:00:00.000+02:00",
  "dateDistribution": "2019-09-11T02:00:00.000+02:00",
  "article99": "0",
  "loiReference": {}
}