{
  "uid": "AMANR5L15SEA717460B1255P1D1N124",
  "identifiant": {
    "legislature": "15",
    "numero": "124",
    "numRect": "0",
    "saisine": {
      "texteLegislatifRef": "PRJLANR5L15B1255",
      "numeroPartiePLF": "1",
      "organeExamen": "PO717460",
      "mentionSecondeDeliberation": "0"
    }
  },
  "numeroLong": "I-124",
  "etapeTexte": "1ère lecture (1ère assemblée saisie)",
  "triAmendement": "dsaaaaaaaaaaaaaaaaaaaaaaaaaaaaaaaaaaaaaaaaaaaaaaaaabvzzztznzzzxzxc",
  "cardinaliteAmdtMultiples": "1",
  "etat": "Discuté",
  "signataires": {
    "auteur": {
      "typeAuteur": "Depute",
      "acteurRef": "PA719318",
      "groupePolitiqueRef": "PO730934"
    },
    "cosignatairesRefs": [
      "PA719318"
    ],
    "texteAffichable": "Mme&#160;Anthoine"
  },
  "pointeurFragmentTexte": {
    "division": {
      "titre": "Article 16",
      "articleDesignationCourte": "APRÈS ART. 16",
      "type": "ARTICLE",
      "avantAApres": "Apres",
      "divisionRattachee": "APRÈS L'ARTICLE 16, insérer l'article suivant:",
      "articleAdditionnel": "1",
      "urlDivisionTexteVise": "/15/textes/1255A.asp#D_Article_16"
    }
  },
  "corps": {
    "dispositif": "<p style=\"text-align: justify;\">I.&#160;&#8211;&#160;Apr&#232;s l&#8217;article&#160;971 du code g&#233;n&#233;ral des imp&#244;ts, il est ins&#233;r&#233; un article&#160;971&#160;<i>bis</i> ainsi r&#233;dig&#233;&#160;:</p><p style=\"text-align: justify;\">&#171;&#160;<i>Art.&#160;971</i>&#160;bis.&#160;&#8211;&#160;Sur demande du redevable, les droits aff&#233;rents &#224; l&#8217;ensemble des &#233;l&#233;ments de l&#8217;actif immobilis&#233; affect&#233;s &#224; l&#8217;exercice d&#8217;une activit&#233; professionnelle ou d&#8217;une branche compl&#232;te d&#8217;activit&#233; ou &#224; un fonds de commerce, un fonds artisanal ou une client&#232;le aux plus-values &#224; long terme r&#233;alis&#233;es par une entreprise individuelle, qui font l&#8217;objet d&#8217;une cession &#224; titre on&#233;reux pour laquelle les parties sont convenues d&#8217;un paiement diff&#233;r&#233; ou &#233;chelonn&#233; du prix de cession portant sur une entreprise, sont compris sous d&#233;duction du montant restant &#224; payer en diff&#233;r&#233; ou de fa&#231;on &#233;chelonn&#233;e, dans le patrimoine du preneur.&#160;&#187;</p><p style=\"text-align: justify;\">II. &#8211; La perte de recettes pour l&#8217;&#201;tat est compens&#233;e &#224; due concurrence par la cr&#233;ation d&#8217;une taxe additionnelle aux droits mentionn&#233;s aux articles 575 et 575 A du code g&#233;n&#233;ral des imp&#244;ts.</p>",
    "exposeSommaire": "<p style=\"text-align: justify;\">Le cr&#233;dit vendeur est un pr&#234;t qui est accord&#233; sans interm&#233;diaire entre le vendeur et l&#8217;acheteur d&#8217;un bien&#160;: reprise d&#8217;entreprise, achat d&#8217;un fonds de commerce ou achat de bien immobilier. Le montant, la dur&#233;e et le taux du cr&#233;dit vendeur sont fix&#233;s librement par les parties int&#233;ress&#233;es.</p><p style=\"text-align: justify;\">En g&#233;n&#233;ral, l&#8217;acqu&#233;reur apporte entre 30 et 50&#160;% du montant de la transaction et le vendeur lui accorde un cr&#233;dit pour le reste, l&#8217;&#233;chelonnement se limitant &#224; trois ans.</p><p style=\"text-align: justify;\">N&#233;anmoins, aucune disposition dans la d&#233;termination de l&#8217;assiette de l&#8217;imp&#244;t sur la fortune immobili&#232;re ne tient compte de cette situation transitoire dans la propri&#233;t&#233; du bien pour lequel le cr&#233;dit vendeur a &#233;t&#233; souscrit.</p><p style=\"text-align: justify;\">Cette situation est p&#233;nalisante puisque l&#8217;acheteur se verra imposer sur la totalit&#233; du bien qu&#8217;il cherche &#224; acqu&#233;rir alors qu&#8217;il ne l&#8217;a pas encore compl&#232;tement acquis.</p><p style=\"text-align: justify;\">Cet amendement propose alors de tenir compte du contexte de cr&#233;dit vendeur dans la d&#233;termination de l&#8217;assiette de l&#8217;imp&#244;t sur la fortune immobili&#232;re. Cette disposition a pour but de faciliter les transmission d&#8217;entreprise et donc de soutenir l&#8217;&#233;conomie.</p>"
  },
  "representations": [
    {
      "nom": "PDF",
      "typeMime": {
        "type": "application",
        "subType": "PDF"
      },
      "statutRepresentation": {
        "verbatim": true,
        "canonique": true,
        "officielle": true,
        "transcription": false,
        "enregistrement": false
      },
      "contenu": {
        "documentURI": "/15/amendements/1255A/AN/124.pdf"
      }
    }
  ],
  "seanceDiscussion": "RUANR5L15S2019IDS21282",
  "sort": {
    "dateSaisie": "2018-10-19T19:49:23.000+02:00",
    "sortEnSeance": "Non soutenu"
  },
  "dateDepot": "2018-10-03T02:00:00.000+02:00",
  "dateDistribution": "2018-10-16T02:00:00.000+02:00",
  "article99": "0",
  "loiReference": {
    "codeLoi": "CGI",
    "divisionCodeLoi": "971 bis"
  }
}