{
  "uid": "AMANR5L15PO59048B0235P1D1N633",
  "identifiant": {
    "legislature": "15",
    "numero": "633",
    "numRect": "0",
    "saisine": {
      "texteLegislatifRef": "PRJLANR5L15B0235",
      "numeroPartiePLF": "1",
      "organeExamen": "PO59048",
      "mentionSecondeDeliberation": "0"
    }
  },
  "numeroLong": "I-CF633",
  "etapeTexte": "1ère lecture (1ère assemblée saisie)",
  "triAmendement": "bm",
  "cardinaliteAmdtMultiples": "1",
  "etat": "A discuter",
  "signataires": {
    "auteur": {
      "typeAuteur": "Depute",
      "acteurRef": "PA942",
      "groupePolitiqueRef": "PO730952"
    },
    "cosignatairesRefs": [
      "PA720230",
      "PA942"
    ],
    "texteAffichable": "M.&#160;Charles&#160;de Courson et Mme&#160;Magnier"
  },
  "pointeurFragmentTexte": {
    "division": {
      "titre": "Article 9",
      "articleDesignationCourte": "APRÈS ART. 9",
      "type": "ARTICLE",
      "avantAApres": "Apres",
      "divisionRattachee": "APRÈS L'ARTICLE 9, insérer l'article suivant:",
      "articleAdditionnel": "1",
      "urlDivisionTexteVise": "/15/textes/0235A.asp#D_Article_9"
    }
  },
  "corps": {
    "dispositif": "<p style=\"text-align: justify;\">Au 1&#176; du III de l&#8217;article&#160;266 <i>quindecies</i> du code des douanes, apr&#232;s les mots&#160;: &#171;&#160;et modifiant la directive 2009/28/ CE relative &#224; la promotion de l&#8217;utilisation de l&#8217;&#233;nergie produite &#224; partir de sources renouvelables&#160;&#187;, sont ajout&#233;s les mots&#160;: &#171;&#160;&#224; l&#8217;exclusion de ceux produits &#224; partir d&#8217;huiles acides&#160;&#187;.</p>",
    "exposeSommaire": "<p style=\"text-align: justify;\">L&#8217;objectif de la TGAP est d&#8217;inciter &#224; l&#8217;incorporation de biocarburants &#171;&#160;vertueux&#160;&#187; du point de vue &#233;cologique, agricole, alimentaire et de l&#8217;&#233;conomie locale.</p><p style=\"text-align: justify;\">On a constat&#233; un d&#233;tournement de la TGAP dans la fili&#232;re essence car des biocarburants d&#233;riv&#233;s de l&#8217;huile de palme ont pris, en 2016, une place importante dans les biocarburants incorpor&#233;s dans l&#8217;essence (1&#160;% sur les 7&#160;% de l&#8217;objectif d&#8217;incorporation), en profitant d&#8217;un effet d&#8217;aubaine et sans contr&#244;le possible de leur pr&#233;sence effective dans les essences.</p><p style=\"text-align: justify;\">L&#8217;objectif de cet amendement est de clarifier que les biocarburants produits &#224; partir des huiles acides, en particulier les huiles acides de palme, n&#8217;ont pas leur place dans l&#8217;objectif de 0,6&#160;% dans l&#8217;essence.</p><p style=\"text-align: justify;\">Tel est l&#8217;objet du pr&#233;sent amendement</p>"
  },
  "representations": [
    {
      "nom": "PDF",
      "typeMime": {
        "type": "application",
        "subType": "PDF"
      },
      "statutRepresentation": {
        "verbatim": true,
        "canonique": true,
        "officielle": true,
        "transcription": false,
        "enregistrement": false
      },
      "contenu": {
        "documentURI": "/15/amendements/0235A/CION_FIN/CF633.pdf"
      }
    }
  ],
  "dateDepot": "2017-10-07T02:00:00.000+02:00",
  "dateDistribution": "2017-10-11T02:00:00.000+02:00",
  "article99": "0",
  "loiReference": {
    "codeLoi": "douanes",
    "divisionCodeLoi": "266 quindecies III"
  }
}