{
  "uid": "AMANR5L15PO59051B0714P0D1N607",
  "identifiant": {
    "legislature": "15",
    "numero": "607",
    "numRect": "0",
    "saisine": {
      "texteLegislatifRef": "PRJLANR5L15B0714",
      "numeroPartiePLF": "0",
      "organeExamen": "PO59051",
      "mentionSecondeDeliberation": "0"
    }
  },
  "numeroLong": "CL607",
  "etapeTexte": "1ère lecture (1ère assemblée saisie)",
  "triAmendement": "b",
  "cardinaliteAmdtMultiples": "1",
  "etat": "Discuté",
  "signataires": {
    "auteur": {
      "typeAuteur": "Depute",
      "acteurRef": "PA721896",
      "groupePolitiqueRef": "PO730940"
    },
    "cosignatairesRefs": [
      "PA720546",
      "PA722110",
      "PA720692",
      "PA721896",
      "PA441",
      "PA722202",
      "PA335612",
      "PA718926",
      "PA689",
      "PA721270",
      "PA718720",
      "PA267306"
    ],
    "texteAffichable": "Mme&#160;Faucillon,  M.&#160;Peu, Mme&#160;Bello, M.&#160;Bruneel, Mme&#160;Buffet, M.&#160;Chassaigne, M.&#160;Dharr&#233;ville, M.&#160;Dufr&#232;gne, M.&#160;Jumel, M.&#160;Lecoq, M.&#160;Fabien&#160;Roussel et M.&#160;Wulfranc"
  },
  "pointeurFragmentTexte": {
    "division": {
      "titre": "Article 19",
      "articleDesignationCourte": "ART. 19",
      "type": "ARTICLE",
      "avantAApres": "A",
      "divisionRattachee": "ARTICLE 19",
      "urlDivisionTexteVise": "/15/textes/0714.asp#D_Article_19"
    }
  },
  "corps": {
    "dispositif": "<p>Supprimer cet article.</p>",
    "exposeSommaire": "<p>Le pr&#233;sent amendement a pour objet de supprimer l&#8217;article 19, ce dernier comprenant des dispositions particuli&#232;rement d&#233;favorables aux demandeurs d&#8217;asile. Cet article accro&#238;t les suspicions &#224; l&#8217;&#233;gard des requ&#233;rants du droit d&#8217;asile.</p><p>&#160;- L&#8217;alin&#233;a 5 permet l&#8217;augmentation de la dur&#233;e de la retenue administrative de 16 &#224; 24 heures</p><p>&#160;Instaur&#233;e en 2012, la retenue pour v&#233;rification du droit de circulation et de s&#233;jour a fait suite&#160; aux d&#233;cisions de la Cour de justice de l&#8217;union europ&#233;enne et de la Cour de cassation, qui ont interdit le recours &#224; la garde &#224; vue dans le but de mettre en &#339;uvre la l&#233;gislation relative au s&#233;jour irr&#233;gulier. Or, cet article vient d&#8217;une fa&#231;on d&#233;tourn&#233;e contourner ces d&#233;cisions, par l&#8217;alignement la dur&#233;e de la retenue administrative avec le r&#233;gime de la garde &#224; vue. Une personne pourrait ainsi, aux fins de v&#233;rification de son droit au s&#233;jour, &#234;tre priv&#233;e de libert&#233; pendant vingt-quatre heures alors que, il faut le rappeler, le s&#233;jour irr&#233;gulier n'est pas un d&#233;lit. Cette augmentation parait d&#8217;autant plus injustifi&#233;e que l'administration dispose de toutes sortes de fichiers lui permettant d'appr&#233;cier la situation des personnes. La symbolique de cette mesure demeure extr&#234;mement grave et choquante&#160;: le demandeur d&#8217;asile fera d&#233;sormais figure de personne suspicieuse alors que le s&#233;jour irr&#233;gulier ne constitue nullement un d&#233;lit.</p><p>Par ailleurs, le D&#233;fenseur des droits dans son avis du 15 mars 2018, s&#8217;inqui&#232;te que cette mesure &#171;&#160;en tout point comparable &#224; une garde &#224; vue&#160;&#187; n&#8217;aboutisse qu&#8217;&#224; des cons&#233;quences extr&#234;mement lourdes&#160;: &#171;&#160;la r&#233;tention et l&#8217;&#233;loignement&#160;&#187;.</p><p>&#160;- Les alin&#233;as 6 et 7 autorisent des mesures d&#8217;inspection visuelle et des fouilles des bagages pendant la retenue</p><p>&#160;Cette fouille se fera &#171; avec l&#8217;accord de l&#8217;&#233;tranger ou, &#224; d&#233;faut, apr&#232;s en avoir inform&#233; le procureur de la R&#233;publique&#187; ou, &#171;&#160;&#224; d&#233;faut, apr&#232;s avoir inform&#233; par tout moyen le procureur de la R&#233;publique&#160;&#187;. En r&#233;alit&#233;, les fouilles pourront donc s&#8217;effectuer sans l&#8217;accord de la personne dans la mesure o&#249; le procureur en est inform&#233;. Les droits des demandeurs se trouvent bafou&#233;s.</p><p>&#160;- Les alin&#233;as 8 et 9 permettent la prise d&#8217;empreintes digitales et d&#8217;une photographie</p><p>&#160;Autrefois interdites, ces prises n&#8217;&#233;taient possibles que si cela constituait &#171; l&#8217;unique moyen d&#8217;&#233;tablir la situation de la personne&#187;. Cette condition disparait donnant encore plus de corps &#224; la dimension r&#233;pressive du texte. Par ailleurs, la question de la conformit&#233; au droit de l&#8217;UE sur les donn&#233;es personnelles se pose.</p><p>&#160; - L&#8217;alin&#233;a 10 pr&#233;voit qu&#8217;en cas de refus de souscrire une prise d&#8217;empreintes ou d&#8217;une photographie au cours de la retenue, &#224; l&#8217;amende de 3750 d&#233;j&#224; en vigueur, est assortie la possibilit&#233; de subir une interdiction du territoire fran&#231;ais d&#8217;une dur&#233;e n&#8217;exc&#233;dant pas 3 ans. Cette nouvelle sanction est consid&#233;rable et tout &#224; fait injustifiable&#160;: elle vient accentuer la logique r&#233;pressive d&#8217;un texte auquel il n&#8217;en faisait pas d&#233;faut.</p><p>&#160;</p>"
  },
  "representations": [
    {
      "nom": "PDF",
      "typeMime": {
        "type": "application",
        "subType": "PDF"
      },
      "statutRepresentation": {
        "verbatim": true,
        "canonique": true,
        "officielle": true,
        "transcription": false,
        "enregistrement": false
      },
      "contenu": {
        "documentURI": "/15/amendements/0714/CION_LOIS/CL607.pdf"
      }
    }
  ],
  "sort": {
    "dateSaisie": "2018-04-06T14:38:39.000+02:00",
    "sortEnSeance": "Non soutenu"
  },
  "dateDepot": "2018-03-30T02:00:00.000+02:00",
  "dateDistribution": "2018-04-02T02:00:00.000+02:00",
  "article99": "0",
  "loiReference": {}
}