{
  "uid": "AMANR5L15SEA717460B1490P0D1N1217",
  "identifiant": {
    "legislature": "15",
    "numero": "1217",
    "numRect": "0",
    "saisine": {
      "texteLegislatifRef": "PRJLANR5L15B1490",
      "numeroPartiePLF": "0",
      "organeExamen": "PO717460",
      "mentionSecondeDeliberation": "0"
    }
  },
  "numeroLong": "1217",
  "etapeTexte": "Nouvelle Lecture",
  "triAmendement": "adeaaaaaaaaaaaaaaaaaaaaaaaaaaaaaaaaaaaaaaaaaaaaaaas",
  "cardinaliteAmdtMultiples": "1",
  "etat": "Retiré",
  "signataires": {
    "auteur": {
      "typeAuteur": "Gouvernement"
    },
    "texteAffichable": "le Gouvernement"
  },
  "pointeurFragmentTexte": {
    "division": {
      "titre": "Article 2 sexies",
      "articleDesignationCourte": "ART. 2 SEXIES",
      "type": "ARTICLE",
      "avantAApres": "A",
      "divisionRattachee": "ARTICLE 2 SEXIES",
      "urlDivisionTexteVise": "/15/textes/1490.asp#D_Articles_2_sexies_et_2_septies"
    }
  },
  "corps": {
    "dispositif": "<p>R&#233;tablir cet article dans la r&#233;daction suivante&#160;:</p><p>&#171;&#160;Le huiti&#232;me alin&#233;a du 3&#176; de l&#8217;article 83 du code g&#233;n&#233;ral des imp&#244;ts est ainsi modifi&#233;&#160;:</p><p>&#171;&#160;1&#176; Apr&#232;s le mot&#160;: &#171;&#160;chevaux,&#160;&#187;, sont ins&#233;r&#233;s les mots&#160;: &#171;&#160;du type de motorisation du v&#233;hicule&#160;&#187;&#160;;</p><p>&#171;&#160;2&#176; Il est compl&#233;t&#233; par une phrase ainsi r&#233;dig&#233;e&#160;:</p><p>&#160;&#171;&#160;Le montant admis en d&#233;duction en application du bar&#232;me forfaitaire pr&#233;cit&#233; est major&#233; de 10&#160;% pour les v&#233;hicules d&#8217;une puissance administrative &#233;gale &#224; 3 chevaux ou moins et de 5&#160;% pour ceux d&#8217;une puissance administrative de 4 chevaux. &#187;.&#160;&#187;</p>",
    "exposeSommaire": "<p>Le pr&#233;sent amendement a pour objet de r&#233;tablir la mesure d&#8217;adaptation du bar&#232;me kilom&#233;trique aux v&#233;hicules &#233;lectriques, adopt&#233;e en premi&#232;re lecture &#224; l&#8217;Assembl&#233;e nationale. Il propose en outre d&#8217;accompagner cette mesure par la mise en place d&#8217;un bonus pour les v&#233;hicules dont la puissance administrative est la plus faible, i.e. les v&#233;hicules ayant une moindre empreinte environnementale.</p><p>Le bar&#232;me kilom&#233;trique applicable aux automobiles permet aux salari&#233;s ayant opt&#233; pour une d&#233;duction au montant r&#233;el de leurs frais professionnels, de proc&#233;der &#224; une &#233;valuation forfaitaire du prix de revient de leurs d&#233;placements avec leur v&#233;hicule personnel, en particulier pour leurs trajets domicile travail.</p><p>Il est &#233;galement utilis&#233; comme bar&#232;me de r&#233;f&#233;rence pour l&#8217;exon&#233;ration des allocations forfaitaires allou&#233;es par les employeurs &#224; leurs salari&#233;s pour leurs d&#233;placements professionnels.</p><p>Selon une logique de co&#251;t d&#8217;utilisation, la formule de calcul du bar&#232;me prend en compte la distance parcourue et la puissance administrative du v&#233;hicule.</p><p>En coh&#233;rence avec les engagements de la France en mati&#232;re de transition &#233;cologique, le pr&#233;sent amendement propose, pour l&#8217;application de ce bar&#232;me, la mise en place d&#8217;un bonus pour les v&#233;hicules dont la puissance administrative est la plus faible.</p><p>Ainsi, il est propos&#233; que le montant admis en d&#233;duction en application du bar&#232;me forfaitaire susmentionn&#233; soit major&#233; de 10&#160;% pour les v&#233;hicules d&#8217;une puissance administrative &#233;gale &#224; 3 CV ou moins et de 5&#160;% pour ceux d&#8217;une puissance administrative de 4 CV.</p><p>Cette mesure s&#8217;applique d&#232;s l&#8217;imposition des revenus de l&#8217;ann&#233;e 2018.</p>"
  },
  "representations": [
    {
      "nom": "PDF",
      "typeMime": {
        "type": "application",
        "subType": "PDF"
      },
      "statutRepresentation": {
        "verbatim": true,
        "canonique": true,
        "officielle": true,
        "transcription": false,
        "enregistrement": false
      },
      "contenu": {
        "documentURI": "/15/amendements/1490/AN/1217.pdf"
      }
    }
  ],
  "dateDepot": "2018-12-16T01:00:00.000+01:00",
  "dateDistribution": "2018-12-16T01:00:00.000+01:00",
  "article99": "0",
  "loiReference": {}
}