{
  "uid": "AMANR5L15PO59048B2272P2D1N554",
  "identifiant": {
    "legislature": "15",
    "numero": "554",
    "numRect": "0",
    "saisine": {
      "texteLegislatifRef": "PRJLANR5L15B2272",
      "numeroPartiePLF": "2",
      "organeExamen": "PO59048",
      "mentionSecondeDeliberation": "0"
    }
  },
  "numeroLong": "II-CF554",
  "etapeTexte": "1ère lecture (1ère assemblée saisie)",
  "triAmendement": "bbbiaaaaaaaaaaaaaaaaaaaaaaaaaaaaaaaaaaaaaaaaaaaaaai",
  "cardinaliteAmdtMultiples": "1",
  "etat": "Discuté",
  "signataires": {
    "auteur": {
      "typeAuteur": "Depute",
      "acteurRef": "PA608741",
      "groupePolitiqueRef": "PO758835"
    },
    "cosignatairesRefs": [
      "PA608741",
      "PA608172",
      "PA1592",
      "PA609590",
      "PA605069"
    ],
    "texteAffichable": "Mme&#160;Tolmont,  M.&#160;Jean-Louis&#160;Bricout, M.&#160;David&#160;Habib, Mme&#160;Pires Beaune et Mme&#160;Rabault"
  },
  "pointeurFragmentTexte": {
    "missionVisee": {
      "idMissionAN": "843",
      "libelleMission": "Avances à l'audiovisuel public",
      "codeMissionPLF": "D",
      "libelleMissionPLF": "Répartition, par mission et programme, des crédits des comptes d'affectation spéciale et des comptes de concours financiers"
    },
    "division": {
      "titre": "ÉTAT D",
      "articleDesignationCourte": "ART. 40",
      "type": "ANNEXE",
      "avantAApres": "A",
      "divisionRattachee": "ARTICLE 40",
      "urlDivisionTexteVise": "/15/textes/2272C.asp#D_ETAT_D"
    }
  },
  "corps": {
    "exposeSommaire": "<p style=\"text-align: justify;\">Cet amendement des d&#233;put&#233;s Socialistes et apparent&#233;s vise &#224; abonder les cr&#233;dits b&#233;n&#233;ficiant &#224; France T&#233;l&#233;visions &#224; hauteur de 61 millions d&#8217;euros.</p><p style=\"text-align: justify;\">Alors que France T&#233;l&#233;visions a d&#233;j&#224; vu ses cr&#233;dits chuter de 25 millions d&#8217;euros lors de la pr&#233;c&#233;dente loi de finances, le Gouvernement pr&#233;voit une nouvelle baisse de 61 millions d&#8217;euros dans le pr&#233;sent projet de loi de finances.</p><p style=\"text-align: justify;\">Si cette nouvelle diminution s&#8217;inscrit dans le cadre de la trajectoire budg&#233;taire arbitr&#233;e &#224; l&#8217;&#233;t&#233; 2018 par l&#8217;ex&#233;cutif concernant l&#8217;audiovisuel public, elle entre en totale contradiction avec les priorit&#233;s d&#233;finies par le Gouvernement pour guider ce projet de transformation&#160;: culture et &#233;ducation, proximit&#233;, information et cr&#233;ation fran&#231;aise et europ&#233;enne.</p><p style=\"text-align: justify;\">Sur fond de mouvement des gilets jaunes et de crise de la confiance des citoyens envers les m&#233;dias, comment assurer un renforcement de la valeur ajout&#233;e des contenus et leur utilit&#233; sociale tout en privant France T&#233;l&#233;visions de 160 millions d&#8217;euros &#224; horizon 2022 (par rapport au budget 2018).</p><p style=\"text-align: justify;\">Plus que jamais, le groupe Socialistes et apparent&#233;s estime qu&#8217;il est n&#233;cessaire de soutenir France T&#233;l&#233;visions et c&#8217;est pourquoi nous proposons de maintenir ses cr&#233;dits &#224; hauteur de ceux ouverts en LFI 2019.</p><p style=\"text-align: justify;\">Afin de respecter les exigences de l&#8217;article&#160;40 de la Constitution et de la LOLF, le l&#233;gislateur est contraint de compenser la d&#233;pense par un gage sur un autre programme de la mission concern&#233;e. Ce n&#8217;est &#233;videmment pas notre intention et nous appelons le Gouvernement &#224; lever le gage. Ainsi cet amendement proc&#232;de &#224;&#160;:</p><p style=\"text-align: justify;\">-&#160; Une augmentation de 61&#160;252 300&#160;&#8364; en AE et CP de l&#8217;action 01 &#171;&#160;France T&#233;l&#233;visions&#160;&#187; du programme 841 &#171;&#160;France T&#233;l&#233;visions&#160;&#187; (ceci est l&#8217;objet de notre amendement)</p><p style=\"text-align: justify;\">-&#160; Une diminution de 61&#160;252 300&#160;&#8364; en AE et CP de l&#8217;action 01 &#171;&#160;ARTE France&#160;&#187; du programme 842 &#171;&#160;ARTE France&#160;&#187; (ceci est notre gage)</p>",
    "dispositifAmdtCredit": {
      "listeProgrammes": [
        {
          "libelle": "France Télévisions",
          "id": "68155",
          "AE": {
            "montantPositif": "61252300",
            "montantNegatif": "0"
          },
          "CP": {
            "montantPositif": "61252300",
            "montantNegatif": "0"
          },
          "action": "modification"
        },
        {
          "libelle": "ARTE France",
          "id": "68156",
          "AE": {
            "montantPositif": "0",
            "montantNegatif": "61252300"
          },
          "CP": {
            "montantPositif": "0",
            "montantNegatif": "61252300"
          },
          "action": "modification"
        },
        {
          "libelle": "Radio France",
          "id": "68157",
          "AE": {
            "montantPositif": "0",
            "montantNegatif": "0"
          },
          "CP": {
            "montantPositif": "0",
            "montantNegatif": "0"
          },
          "action": "modification"
        },
        {
          "libelle": "France Médias Monde",
          "id": "68158",
          "AE": {
            "montantPositif": "0",
            "montantNegatif": "0"
          },
          "CP": {
            "montantPositif": "0",
            "montantNegatif": "0"
          },
          "action": "modification"
        },
        {
          "libelle": "Institut national de l'audiovisuel",
          "id": "68159",
          "AE": {
            "montantPositif": "0",
            "montantNegatif": "0"
          },
          "CP": {
            "montantPositif": "0",
            "montantNegatif": "0"
          },
          "action": "modification"
        },
        {
          "libelle": "TV5 Monde",
          "id": "68160",
          "AE": {
            "montantPositif": "0",
            "montantNegatif": "0"
          },
          "CP": {
            "montantPositif": "0",
            "montantNegatif": "0"
          },
          "action": "modification"
        }
      ],
      "totalAE": {
        "montantPositif": "61252300",
        "montantNegatif": "61252300",
        "solde": "0"
      },
      "totalCP": {
        "montantPositif": "61252300",
        "montantNegatif": "61252300",
        "solde": "0"
      }
    }
  },
  "representations": [
    {
      "nom": "PDF",
      "typeMime": {
        "type": "application",
        "subType": "PDF"
      },
      "statutRepresentation": {
        "verbatim": true,
        "canonique": true,
        "officielle": true,
        "transcription": false,
        "enregistrement": false
      },
      "contenu": {
        "documentURI": "/15/amendements/2272C/CION_FIN/CF554.pdf"
      }
    }
  ],
  "sort": {
    "dateSaisie": "2019-10-23T23:06:56.000+02:00",
    "sortEnSeance": "Rejeté"
  },
  "dateDepot": "2019-10-18T02:00:00.000+02:00",
  "dateDistribution": "2019-10-23T02:00:00.000+02:00",
  "article99": "0",
  "loiReference": {}
}