{
  "uid": "AMANR5L15SEA717460BTC1019P0D1N1686",
  "identifiant": {
    "legislature": "15",
    "numero": "1686",
    "numRect": "0",
    "saisine": {
      "texteLegislatifRef": "PRJLANR5L15BTC1019",
      "numeroPartiePLF": "0",
      "organeExamen": "PO717460",
      "mentionSecondeDeliberation": "0"
    }
  },
  "numeroLong": "1686",
  "etapeTexte": "1ère lecture (1ère assemblée saisie)",
  "triAmendement": "qau",
  "cardinaliteAmdtMultiples": "1",
  "etat": "Discuté",
  "signataires": {
    "auteur": {
      "typeAuteur": "Depute",
      "acteurRef": "PA331567",
      "groupePolitiqueRef": "PO744425"
    },
    "cosignatairesRefs": [
      "PA331567",
      "PA721486",
      "PA642868",
      "PA267330",
      "PA721110",
      "PA267585",
      "PA267241",
      "PA332228",
      "PA268019",
      "PA695100",
      "PA266788",
      "PA610775",
      "PA720696",
      "PA1960",
      "PA712014",
      "PA721094",
      "PA331582",
      "PA942",
      "PA719806",
      "PA335758",
      "PA720230",
      "PA267355",
      "PA267042",
      "PA333421",
      "PA267780",
      "PA267766"
    ],
    "texteAffichable": "Mme&#160;de La Raudi&#232;re,  Mme&#160;Auconie, M.&#160;Benoit, M.&#160;Guy&#160;Bricout, M.&#160;Christophe, M.&#160;Charles&#160;de Courson, M.&#160;Demilly, Mme&#160;Descamps, M.&#160;Dunoyer, M.&#160;Favennec Becot, Mme&#160;Firmin Le Bodo, M.&#160;Gom&#232;s, M.&#160;Meyer&#160;Habib, M.&#160;Herth, M.&#160;Lagarde, M.&#160;Ledoux, M.&#160;Leroy, Mme&#160;Magnier, M.&#160;Morel-&#192;-L&apos;Huissier, M.&#160;Naegelen, M.&#160;Pancher, M.&#160;Riester, Mme&#160;Sanquer, M.&#160;Vercamer, M.&#160;Philippe&#160;Vigier et M.&#160;Zumkeller"
  },
  "pointeurFragmentTexte": {
    "division": {
      "titre": "Article PREMIER",
      "articleDesignationCourte": "ART. PREMIER",
      "type": "ARTICLE",
      "avantAApres": "A",
      "divisionRattachee": "ARTICLE PREMIER",
      "urlDivisionTexteVise": "/15/textes/1019.asp#D_Article_1er"
    },
    "alinea": {
      "avantAApres": "Apres",
      "numero": "32"
    }
  },
  "corps": {
    "dispositif": "<p style=\"text-align: justify;\">Apr&#232;s l&#8217;alin&#233;a&#160;32, ins&#233;rer l&#8217;alin&#233;a suivant&#160;:</p><p style=\"text-align: justify;\">&#171;&#160;Une entreprise peut proc&#233;der &#224; l&#8217;embauche d&#8217;un ch&#244;meur de longue dur&#233;e et s&#8217;engager, dans un contrat &#224; dur&#233;e d&#233;termin&#233;e d&#8217;au moins douze mois, ou d&#8217;un contrat &#224; dur&#233;e ind&#233;termin&#233;e, &#224; le former &#224; un poste correspondant &#224; un besoin de l&#8217;entreprise. En contrepartie de cette formation, qui doit faire l&#8217;objet d&#8217;une description d&#233;taill&#233;e dans le contrat de travail, l&#8217;entreprise b&#233;n&#233;ficie d&#8217;une partie ou de la totalit&#233; du compte personnel de formation de ce salari&#233;. Les modalit&#233;s d&#8217;application du pr&#233;sent alin&#233;a sont fix&#233;es par d&#233;cret.&#160;&#187;</p>",
    "exposeSommaire": "<p style=\"text-align: justify;\">D&#8217;apr&#232;s&#160;une &#233;tude de l&#8217;Insee publi&#233;e en 2016, les demandeurs d&#8217;emploi de longue dur&#233;e ont de plus en plus de mal &#224; retrouver un emploi alors que le nombre d&#8217;individus dans cette situation atteint des sommets. Sur les 6 millions de personnes inscrites &#224; P&#244;le emploi, 2,5 millions de personnes sont concern&#233;es par ce ph&#233;nom&#232;ne. Les &#233;conomistes de l&#8217;institut, qui ont &#233;galement &#233;tudi&#233; les p&#233;riodes de transition entre le ch&#244;mage et l&#8217;acc&#232;s &#224; un emploi pour les seniors, ont soulign&#233; de fortes difficult&#233;s pour cette cat&#233;gorie d&#8217;actifs.</p><p style=\"text-align: justify;\">Cet amendement vise &#224; permettre l&#8217;embauche d&#8217;un ch&#244;meur de longue dur&#233;e, par une entreprise qui assurera sa formation. En contrepartie, tout ou partie du montant du compte personnel de formation pourra &#234;tre vers&#233; &#224; l&#8217;entreprise.</p><p style=\"text-align: justify;\">Souvent dans les territoires, les ch&#244;meurs, notamment ceux de longue dur&#233;e qui sont le plus &#233;loign&#233;s de l&#8217;emploi, n&#8217;ont pas acc&#232;s &#224; une formation &#224; proximit&#233; de leur lieu de vie&#160;; et les entreprises sont souvent volontaire pour les former. Cependant, le co&#251;t que repr&#233;sente cette&#160;formation dispens&#233;e en interne par l&#8217;entreprise a un co&#251;t qui est un frein &#224; l&#8217;embauche, d&#8217;o&#249; l&#8217;int&#233;r&#234;t de ce dispositif.</p><p style=\"text-align: justify;\">Le d&#233;tail de la formation devra figurer dans le contrat de travail.</p><p style=\"text-align: justify;\">Un d&#233;cret viendra d&#233;terminer ses modalit&#233;s d&#8217;application.</p>"
  },
  "representations": [
    {
      "nom": "PDF",
      "typeMime": {
        "type": "application",
        "subType": "PDF"
      },
      "statutRepresentation": {
        "verbatim": true,
        "canonique": true,
        "officielle": true,
        "transcription": false,
        "enregistrement": false
      },
      "contenu": {
        "documentURI": "/15/amendements/1019/AN/1686.pdf"
      }
    }
  ],
  "seanceDiscussion": "RUANR5L15S2018IDS21097",
  "sort": {
    "dateSaisie": "2018-06-12T19:01:42.000+02:00",
    "sortEnSeance": "Retiré"
  },
  "dateDepot": "2018-06-07T02:00:00.000+02:00",
  "dateDistribution": "2018-06-09T02:00:00.000+02:00",
  "article99": "0",
  "loiReference": {}
}