{
  "uid": "AMANR5L15PO419865B0155P0D1N88",
  "identifiant": {
    "legislature": "15",
    "numero": "88",
    "numRect": "1",
    "saisine": {
      "texteLegislatifRef": "PRJLANR5L15B0155",
      "numeroPartiePLF": "0",
      "organeExamen": "PO419865",
      "mentionSecondeDeliberation": "0"
    }
  },
  "numeroLong": "CD88 (Rect)",
  "etapeTexte": "1ère lecture (1ère assemblée saisie)",
  "triAmendement": "cido",
  "cardinaliteAmdtMultiples": "1",
  "etat": "Discuté",
  "signataires": {
    "auteur": {
      "typeAuteur": "Depute",
      "acteurRef": "PA720278",
      "groupePolitiqueRef": "PO730964"
    },
    "cosignatairesRefs": [
      "PA722038",
      "PA719520",
      "PA720378",
      "PA719718",
      "PA722236",
      "PA720538",
      "PA721254",
      "PA720054",
      "PA722336",
      "PA719858",
      "PA720780",
      "PA722094",
      "PA719890",
      "PA609520",
      "PA720038",
      "PA718802",
      "PA721718",
      "PA719922",
      "PA719258",
      "PA719652",
      "PA718894",
      "PA605084",
      "PA720310",
      "PA719960",
      "PA719420",
      "PA719080",
      "PA642695",
      "PA721426",
      "PA722312",
      "PA719632",
      "PA722000",
      "PA721514",
      "PA721372",
      "PA607155",
      "PA720278",
      "PA720944",
      "PA719154",
      "PA720590",
      "PA719700",
      "PA719624",
      "PA720414",
      "PA722170",
      "PA719194",
      "PA607193",
      "PA719440",
      "PA606171",
      "PA722228",
      "PA719882",
      "PA719388",
      "PA718728",
      "PA718990",
      "PA719412",
      "PA720242",
      "PA720014",
      "PA721134",
      "PA721852",
      "PA721808",
      "PA721384",
      "PA719660",
      "PA719242",
      "PA605518",
      "PA721600",
      "PA721860",
      "PA720814",
      "PA719372",
      "PA722366",
      "PA720108",
      "PA718710",
      "PA721876",
      "PA719972",
      "PA718962",
      "PA608641",
      "PA718930",
      "PA719338",
      "PA719310",
      "PA721278",
      "PA718876",
      "PA719830"
    ],
    "texteAffichable": "M.&#160;Orphelin,  M.&#160;Djebbari, Mme&#160;Abba, M.&#160;Arend, Mme&#160;Pascale&#160;Boyer, Mme&#160;Brulebois, M.&#160;Buchou, M.&#160;Causse, M.&#160;Cesarini, Mme&#160;Couillard, Mme&#160;Yolaine&#160;de Courson, Mme&#160;De Temmerman, M.&#160;Dombreval, M.&#160;Fugit, M.&#160;Haury, Mme&#160;Josso, Mme&#160;Kerbarh, M.&#160;Krabal, M.&#160;Fran&#231;ois-Michel&#160;Lambert, Mme&#160;Le Feur, M.&#160;Leclabart, Mme&#160;Maillart-M&#233;haignerie, Mme&#160;Marsaud, Mme&#160;Meynier-Millefert, M.&#160;Morenas, Mme&#160;Muller-Quoy, Mme&#160;Panonacle, Mme&#160;Park, M.&#160;Perea, M.&#160;Perrot, M.&#160;Pichereau, Mme&#160;Pompili, Mme&#160;Riotton, Mme&#160;Rossi, Mme&#160;Sarles, M.&#160;Thi&#233;baut, Mme&#160;Vanceunebrock-Mialon, M.&#160;Zulesi, M.&#160;Damien&#160;Adam, M.&#160;Anato, Mme&#160;Beaudouin-Hubiere, M.&#160;Besson-Moreau, Mme&#160;Bessot Ballot, Mme&#160;Blanc, M.&#160;Blein, M.&#160;Bothorel, M.&#160;Cazenove, M.&#160;Cellier, Mme&#160;Crouzet, M.&#160;Daniel, Mme&#160;de Lavergne, M.&#160;Delpon, M.&#160;D&#233;moulin, Mme&#160;Do, Mme&#160;Dubos, Mme&#160;Errante, Mme&#160;Faure-Muntian, Mme&#160;Fontenel-Personne, Mme&#160;Hammerer, Mme&#160;Hennion, M.&#160;Hupp&#233;, M.&#160;Kasbarian, Mme&#160;Le Meur, Mme&#160;Lebec, M.&#160;Lescure, Mme&#160;Limon, M.&#160;Lioger, M.&#160;Martin, Mme&#160;Melchior, M.&#160;Moreau, M.&#160;Nogal, Mme&#160;Oppelt, Mme&#160;Petel, M.&#160;Potterie, M.&#160;Sempastous, M.&#160;Sommer, Mme&#160;Tiegna, M.&#160;Ferrand et les membres du groupe La R&#233;publique en Marche"
  },
  "pointeurFragmentTexte": {
    "division": {
      "titre": "Article PREMIER",
      "articleDesignationCourte": "ART. PREMIER",
      "type": "ARTICLE",
      "avantAApres": "A",
      "divisionRattachee": "ARTICLE PREMIER",
      "urlDivisionTexteVise": "/15/textes/0155.asp#D_Article_1er"
    },
    "alinea": {
      "numero": "8"
    }
  },
  "corps": {
    "dispositif": "<p>&#192; l&#8217;alin&#233;a&#160;8, apr&#232;s la deuxi&#232;me occurrence du mot&#160;: </p><p>&#171;&#160;gaz&#160;&#187;, </p><p>ins&#233;rer les mots&#160;: </p><p>&#171;&#160;situ&#233; dans les veines de charbon pr&#233;alablement exploit&#233;es&#160;&#187;.</p>",
    "exposeSommaire": "<p style=\"text-align: justify;\">La d&#233;finition propos&#233;e du gaz de mine n&#8217;est pas claire sur l&#8217;exclusion ou non du gaz de couche.</p><p style=\"text-align: justify;\">Il est pourtant essentiel de diff&#233;rencier le gaz de mine, qui se trouve dans des veines de charbon pr&#233;alablement exploit&#233;es et dont l&#8217;extraction est n&#233;cessaire pour des raisons de s&#233;curit&#233;, et le gaz de couche, qui se trouve dans des veines non pr&#233;alablement exploit&#233;es.</p><p style=\"text-align: justify;\">Ainsi, cet amendement vise &#224; pr&#233;ciser la d&#233;finition du gaz de mine.</p>"
  },
  "representations": [
    {
      "nom": "PDF",
      "typeMime": {
        "type": "application",
        "subType": "PDF"
      },
      "statutRepresentation": {
        "verbatim": true,
        "canonique": true,
        "officielle": true,
        "transcription": false,
        "enregistrement": false
      },
      "contenu": {
        "documentURI": "/15/amendements/0155/CION-DVP/CD88.pdf"
      }
    }
  ],
  "sort": {
    "dateSaisie": "2017-09-26T19:24:39.000+02:00",
    "sortEnSeance": "Adopté"
  },
  "dateDepot": "2017-09-22T02:00:00.000+02:00",
  "dateDistribution": "2017-09-23T02:00:00.000+02:00",
  "article99": "0",
  "loiReference": {}
}