{
  "uid": "AMANR5L15PO419865B1831P0D1N1080",
  "identifiant": {
    "legislature": "15",
    "numero": "1080",
    "numRect": "0",
    "saisine": {
      "texteLegislatifRef": "PRJLANR5L15B1831",
      "numeroPartiePLF": "0",
      "organeExamen": "PO419865",
      "mentionSecondeDeliberation": "0"
    }
  },
  "numeroLong": "CD1080",
  "etapeTexte": "1ère lecture (2ème assemblée saisie)",
  "triAmendement": "bjoaaaaaaaaaaaaaaaaaaaaaaaaaaaaaaaaaaaaaaaaaaaaaaaoc",
  "cardinaliteAmdtMultiples": "1",
  "etat": "Discuté",
  "signataires": {
    "auteur": {
      "typeAuteur": "Rapporteur",
      "acteurRef": "PA722038",
      "organeRef": "PO419610",
      "groupePolitiqueRef": "PO730964"
    },
    "cosignatairesRefs": [
      "PA722038"
    ],
    "texteAffichable": "M.&#160;Damien&#160;Adam, rapporteur pour avis au nom de la commission des affaires &#233;conomiques"
  },
  "pointeurFragmentTexte": {
    "division": {
      "titre": "Article 13",
      "articleDesignationCourte": "ART. 13",
      "type": "ARTICLE",
      "avantAApres": "A",
      "divisionRattachee": "ARTICLE 13",
      "urlDivisionTexteVise": "/15/textes/1831.asp#D_Article_13"
    },
    "alinea": {
      "numero": "8"
    }
  },
  "corps": {
    "dispositif": "<p style=\"text-align: justify;\">I.&#160;&#8211;&#160;&#192; l&#8217;alin&#233;a&#160;8, apr&#232;s les mots&#160;:</p><p style=\"text-align: justify;\">&#171;&#160;d&#8217;acc&#232;s&#160;&#187;</p><p style=\"text-align: justify;\">ins&#233;rer les mots&#160;:</p><p style=\"text-align: justify;\">&#171;&#160;, sans consentement du conducteur,&#160;&#187;.</p><p style=\"text-align: justify;\">II.&#160;&#8211;&#160;En cons&#233;quence, &#224; l'alin&#233;a 9, proc&#233;der &#224; la m&#234;me insertion.</p>",
    "exposeSommaire": "<p>Cet amendement vise &#224; s&#8217;assurer que l&#8217;acc&#232;s aux donn&#233;es pertinentes des v&#233;hicules connect&#233;s pourra s&#8217;effectuer sans le consentement du conducteur dans le but de d&#233;tecter et de corriger des d&#233;fauts de s&#233;curit&#233;.</p>"
  },
  "representations": [
    {
      "nom": "PDF",
      "typeMime": {
        "type": "application",
        "subType": "PDF"
      },
      "statutRepresentation": {
        "verbatim": true,
        "canonique": true,
        "officielle": true,
        "transcription": false,
        "enregistrement": false
      },
      "contenu": {
        "documentURI": "/15/amendements/1831/CION-DVP/CD1080.pdf"
      }
    }
  ],
  "sort": {
    "dateSaisie": "2019-05-17T00:04:43.000+02:00",
    "sortEnSeance": "Retiré"
  },
  "dateDepot": "2019-05-07T02:00:00.000+02:00",
  "dateDistribution": "2019-05-14T02:00:00.000+02:00",
  "article99": "0",
  "loiReference": {}
}