{
  "uid": "AMANR5L15PO59048B2272P1D1N1550",
  "identifiant": {
    "legislature": "15",
    "numero": "1550",
    "numRect": "0",
    "saisine": {
      "texteLegislatifRef": "PRJLANR5L15B2272",
      "numeroPartiePLF": "1",
      "organeExamen": "PO59048",
      "mentionSecondeDeliberation": "0"
    }
  },
  "numeroLong": "I-CF1550",
  "etapeTexte": "1ère lecture (1ère assemblée saisie)",
  "triAmendement": "biaaaaaaaaaaaaaaaaaaaaaaaaaaaaaaaaaaaaaaaaaaaaaaaabcbe",
  "cardinaliteAmdtMultiples": "1",
  "etat": "Discuté",
  "signataires": {
    "auteur": {
      "typeAuteur": "Depute",
      "acteurRef": "PA267336",
      "groupePolitiqueRef": "PO730964"
    },
    "cosignatairesRefs": [
      "PA267336"
    ],
    "texteAffichable": "M.&#160;Giraud, rapporteur g&#233;n&#233;ral"
  },
  "pointeurFragmentTexte": {
    "division": {
      "titre": "Article 7",
      "articleDesignationCourte": "ART. 7",
      "type": "ARTICLE",
      "avantAApres": "A",
      "divisionRattachee": "ARTICLE 7",
      "urlDivisionTexteVise": "/15/textes/2272A.asp#D_Article_7"
    },
    "alinea": {
      "numero": "9"
    }
  },
  "corps": {
    "dispositif": "<p style=\"text-align: justify;\">Substituer &#224; l&#8217;alin&#233;a&#160;9 les trois alin&#233;as suivants&#160;:</p><p style=\"text-align: justify;\">&#171;&#160;7&#176;&#160;Le&#160;1 de l&#8217;article&#160;207 est ainsi modifi&#233;&#160;:</p><p style=\"text-align: justify;\">&#171;&#160;<i>a)</i>&#160;Au cinqui&#232;me alin&#233;a du 4&#176;&#160;, les mots&#160;: <i>&#171;&#160;</i>et au 6&#176;&#160;<i><i>bis</i></i>&#160;&#187; sont supprim&#233;s&#160;;</p><p style=\"text-align: justify;\">&#171;&#160;<i>b)</i>&#160;Le 6&#176;&#160;<i>bis</i> est abrog&#233;&#160;;&#160;&#187;.</p>",
    "exposeSommaire": "<p>Amendement ajoutant une coordination.</p>"
  },
  "representations": [
    {
      "nom": "PDF",
      "typeMime": {
        "type": "application",
        "subType": "PDF"
      },
      "statutRepresentation": {
        "verbatim": true,
        "canonique": true,
        "officielle": true,
        "transcription": false,
        "enregistrement": false
      },
      "contenu": {
        "documentURI": "/15/amendements/2272A/CION_FIN/CF1550.pdf"
      }
    }
  ],
  "sort": {
    "dateSaisie": "2019-10-09T18:50:38.000+02:00",
    "sortEnSeance": "Adopté"
  },
  "dateDepot": "2019-10-08T02:00:00.000+02:00",
  "dateDistribution": "2019-10-08T02:00:00.000+02:00",
  "article99": "0",
  "loiReference": {}
}