{
  "uid": "AMANR5L15SEA717460B2296P0D1N826",
  "identifiant": {
    "legislature": "15",
    "numero": "826",
    "numRect": "0",
    "saisine": {
      "texteLegislatifRef": "PRJLANR5L15B2296",
      "numeroPartiePLF": "0",
      "organeExamen": "PO717460",
      "mentionSecondeDeliberation": "0"
    }
  },
  "numeroLong": "826",
  "etapeTexte": "1ère lecture (1ère assemblée saisie)",
  "triAmendement": "ocaaaaaaaaaaaaaaaaaaaaaaaaaaaaaaaaaaaaaaaaaaaaaaaabho",
  "cardinaliteAmdtMultiples": "1",
  "etat": "Irrecevable",
  "signataires": {
    "auteur": {
      "typeAuteur": "Depute",
      "acteurRef": "PA267780",
      "groupePolitiqueRef": "PO767217"
    },
    "cosignatairesRefs": [
      "PA2952",
      "PA267330",
      "PA712014",
      "PA267585",
      "PA421348",
      "PA695100",
      "PA332228",
      "PA721174",
      "PA610775",
      "PA267780",
      "PA642868",
      "PA702052",
      "PA721632",
      "PA721486",
      "PA267766",
      "PA721110",
      "PA720230",
      "PA342601",
      "PA722030",
      "PA721094",
      "PA267355",
      "PA266788",
      "PA719806",
      "PA642935"
    ],
    "texteAffichable": "Mme&#160;Firmin Le Bodo,  Mme&#160;Auconie, M.&#160;Becht, M.&#160;Benoit, M.&#160;Bournazel, M.&#160;Guy&#160;Bricout, M.&#160;Brindeau, M.&#160;Christophe, M.&#160;Dunoyer, M.&#160;Gom&#232;s, M.&#160;Meyer&#160;Habib, M.&#160;Herth, M.&#160;Ledoux, Mme&#160;Lemoine, Mme&#160;Magnier, M.&#160;Morel-&#192;-L&apos;Huissier, M.&#160;Naegelen, Mme&#160;Sage, Mme&#160;Sanquer, M.&#160;Son-Forget, M.&#160;Vercamer, M.&#160;Villiers, M.&#160;Warsmann et M.&#160;Zumkeller"
  },
  "pointeurFragmentTexte": {
    "division": {
      "titre": "Article 59",
      "articleDesignationCourte": "APRÈS ART. 59",
      "type": "ARTICLE",
      "avantAApres": "Apres",
      "divisionRattachee": "APRÈS L'ARTICLE 59, insérer l'article suivant:",
      "articleAdditionnel": "1",
      "urlDivisionTexteVise": "/15/textes/2296.asp#D_Article_59"
    }
  },
  "corps": {},
  "representations": [
    {
      "nom": "PDF",
      "typeMime": {
        "type": "application",
        "subType": "PDF"
      },
      "statutRepresentation": {
        "verbatim": true,
        "canonique": true,
        "officielle": true,
        "transcription": false,
        "enregistrement": false
      },
      "contenu": {
        "documentURI": "/15/amendements/2296/AN/826.pdf"
      }
    }
  ],
  "dateDepot": "2019-10-17T02:00:00.000+02:00",
  "dateDistribution": "2019-10-20T02:00:00.000+02:00",
  "article99": "0",
  "loiReference": {
    "codeLoi": "c sécurité sociale",
    "divisionCodeLoi": "L162-22-2"
  }
}