{
  "uid": "AMANR5L15PO59048B2272P2D1N1535",
  "identifiant": {
    "legislature": "15",
    "numero": "1535",
    "numRect": "0",
    "saisine": {
      "texteLegislatifRef": "PRJLANR5L15B2272",
      "numeroPartiePLF": "2",
      "organeExamen": "PO59048",
      "mentionSecondeDeliberation": "0"
    }
  },
  "numeroLong": "II-CF1535",
  "etapeTexte": "1ère lecture (1ère assemblée saisie)",
  "triAmendement": "niaaaaaaaaaaaaaaaaaaaaaaaaaaaaaaaaaaaaaaaaaaaaaaaaabbp",
  "cardinaliteAmdtMultiples": "1",
  "etat": "Irrecevable",
  "signataires": {
    "auteur": {
      "typeAuteur": "Depute",
      "acteurRef": "PA720590",
      "groupePolitiqueRef": "PO730964"
    },
    "cosignatairesRefs": [
      "PA719952",
      "PA719364",
      "PA721522",
      "PA720622",
      "PA720590"
    ],
    "texteAffichable": "M.&#160;Potterie,  Mme&#160;O&apos;Petit, Mme&#160;Bureau-Bonnard, M.&#160;Batut et M.&#160;Mis"
  },
  "pointeurFragmentTexte": {
    "division": {
      "titre": "Article 72",
      "articleDesignationCourte": "APRÈS ART. 72",
      "type": "ARTICLE",
      "avantAApres": "Apres",
      "divisionRattachee": "APRÈS L'ARTICLE 72, insérer l'article suivant:",
      "articleAdditionnel": "1",
      "urlDivisionTexteVise": "/15/textes/2272C.asp#D_Article_72"
    }
  },
  "corps": {},
  "representations": [
    {
      "nom": "PDF",
      "typeMime": {
        "type": "application",
        "subType": "PDF"
      },
      "statutRepresentation": {
        "verbatim": true,
        "canonique": true,
        "officielle": true,
        "transcription": false,
        "enregistrement": false
      },
      "contenu": {
        "documentURI": "/15/amendements/2272C/CION_FIN/CF1535.pdf"
      }
    }
  ],
  "dateDepot": "2019-11-02T01:00:00.000+01:00",
  "dateDistribution": "2019-11-03T01:00:00.000+01:00",
  "article99": "0",
  "loiReference": {
    "codeLoi": "CGI",
    "divisionCodeLoi": "39 decies B"
  }
}