{
  "uid": "AMANR5L15SEA717460BTC1974P0D1N381",
  "identifiant": {
    "legislature": "15",
    "numero": "381",
    "numRect": "0",
    "saisine": {
      "texteLegislatifRef": "PRJLANR5L15BTC1974",
      "numeroPartiePLF": "0",
      "organeExamen": "PO717460",
      "mentionSecondeDeliberation": "0"
    }
  },
  "numeroLong": "381",
  "etapeTexte": "1ère lecture (2ème assemblée saisie)",
  "triAmendement": "adcaaaaaaaaaaaaaaaaaaaaaaaaaaaaaaaaaaaaaaaaaaaaaaaagi",
  "cardinaliteAmdtMultiples": "1",
  "etat": "Discuté",
  "signataires": {
    "auteur": {
      "typeAuteur": "Depute",
      "acteurRef": "PA607155",
      "groupePolitiqueRef": "PO730964"
    },
    "cosignatairesRefs": [
      "PA718990",
      "PA719728",
      "PA720900",
      "PA720222",
      "PA721328",
      "PA720814",
      "PA606639",
      "PA721860",
      "PA718728",
      "PA720038",
      "PA721600",
      "PA334116",
      "PA722008",
      "PA720124",
      "PA720108",
      "PA719448",
      "PA720002",
      "PA720030",
      "PA607155",
      "PA721384",
      "PA720622",
      "PA718744",
      "PA719910",
      "PA718876",
      "PA607193",
      "PA719326",
      "PA721522"
    ],
    "texteAffichable": "M.&#160;Daniel,  M.&#160;Le Bohec, Mme&#160;Oppelt, Mme&#160;Gipson, Mme&#160;Josso, Mme&#160;Brugnera, Mme&#160;Rossi, M.&#160;Cazenove, Mme&#160;Chapelier, Mme&#160;Amadou, Mme&#160;Errante, Mme&#160;El Ha&#239;ry, M.&#160;Belhamiti, Mme&#160;Blanc, Mme&#160;Vanceunebrock-Mialon, M.&#160;Besson-Moreau, Mme&#160;Rilhac, M.&#160;Vignal, Mme&#160;Leguille-Balloy, M.&#160;Girardin, Mme&#160;Bureau-Bonnard, Mme&#160;Bagarry, Mme&#160;Fontenel-Personne, M.&#160;Batut, M.&#160;Cesarini, Mme&#160;Jacqueline&#160;Maquet et M.&#160;Freschi"
  },
  "pointeurFragmentTexte": {
    "division": {
      "titre": "Article PREMIER",
      "articleDesignationCourte": "ART. PREMIER",
      "type": "ARTICLE",
      "avantAApres": "A",
      "divisionRattachee": "ARTICLE PREMIER",
      "urlDivisionTexteVise": "/15/textes/1974.asp#D_Article_1er"
    },
    "alinea": {
      "avantAApres": "Apres",
      "numero": "3"
    }
  },
  "corps": {
    "dispositif": "<p style=\"text-align: justify;\">Apr&#232;s l&#8217;alin&#233;a&#160;3, ins&#233;rer les deux alin&#233;as suivants&#160;:</p><p style=\"text-align: justify;\">&#171;&#160;2&#176;&#160;<i>bis</i> L&#8217;article L.&#160;1111&#8209;1 est compl&#233;t&#233; par un alin&#233;a ainsi r&#233;dig&#233;&#160;:</p><p style=\"text-align: justify;\">&#171;&#160;L&#8217;am&#233;nagement du territoire est la premi&#232;re r&#233;ponse aux besoins de mobilit&#233; et de d&#233;placement.&#160;&#187;&#160;;&#160;&#187;</p>",
    "exposeSommaire": "<p>Alors que la LOM a pour ambition d&#8217;actualiser nos politiques de mobilit&#233;, il nous faut donner un signal clair et ambitieux. C&#8217;est pourquoi cet amendement propose de pr&#233;ciser, dans le code des transports, l&#8217;am&#233;nagement du territoire comme premi&#232;re r&#233;ponse aux besoins de mobilit&#233; et de d&#233;placement.</p><p style=\"text-align: justify;\">La difficult&#233; que rencontrent les concitoyens &#224; se d&#233;placer et avoir acc&#232;s aux leviers de la mobilit&#233; et plus particuli&#232;rement la demande d&#8217;acc&#232;s au t&#233;l&#233;travail, &#224; l&#8217;offre de transport et aux nouvelles technologies du num&#233;rique, traduisent que la premi&#232;re r&#233;ponse aux besoins de d&#233;placement est l&#8217;am&#233;nagement du territoire.</p><p style=\"text-align: justify;\">Par ailleurs, notre premier r&#233;flexe en r&#233;ponse &#224; nos besoins de d&#233;placement a &#233;t&#233; de penser d&#8217;abord &#224; l&#8217;offre de transport c&#8217;est-&#224;-dire d&#8217;aller d&#8217;un point A vers un point B. Or, la r&#233;ponse est aussi d&#8217;aller du point B vers le point A, c&#8217;est-&#224;-dire, par exemple, de rapprocher le travail des travailleurs, de rapprocher les services de la population, etc.</p><p style=\"text-align: justify;\">3 d&#233;placements locaux et 24 km par jour&#160;: c&#8217;est la mobilit&#233; moyenne des fran&#231;ais, avec d&#8217;importantes variations au sein du territoire. Les habitants aux c&#339;urs d&#8217;agglom&#233;rations et ceux qui en sont le plus &#233;loign&#233;s sont les moins mobiles. Ce sont les habitants des territoires p&#233;riurbains et ruraux, qui quantitativement, se d&#233;placent le plus. L&#8217;&#233;talement des agglom&#233;rations et la dispersion de l&#8217;habitat, la distribution &#233;clat&#233;e des activit&#233;s, poussent &#224; un usage massif de la voiture.</p><p style=\"text-align: justify;\">Ainsi, en 2004 selon l&#8217;INSEE, trois salari&#233;s sur quatre travaillent hors de leur commune de r&#233;sidence. Les chiffres atteignent pr&#232;s de 87&#160;% dans les couronnes p&#233;riurbaines et 90&#160;% dans les couronnes des p&#244;les d&#8217;emploi de l&#8217;espace &#224; dominante rurale.</p><p style=\"text-align: justify;\">L&#8217;am&#233;nagement du territoire participe aux grands enjeux de notre soci&#233;t&#233; de demain, &#224; savoir la transition &#233;cologique, la transition &#233;nerg&#233;tique, le d&#233;veloppement &#233;conomique et la dimension sociale correspondant &#224; l&#8217;enjeu humain. Il permet de prendre en compte les donn&#233;es naturelles et les besoins de nos g&#233;n&#233;rations futures.</p><p style=\"text-align: justify;\">La premi&#232;re des r&#233;ponses aux besoins de mobilit&#233; est de ne plus avoir besoin de se d&#233;placer. En cela, la LOM doit proposer une r&#233;ponse claire car la mobilit&#233; est un &#233;l&#233;ment indispensable &#224; tout individu que ce soit pour son projet professionnel et pour son projet de vie.</p>"
  },
  "representations": [
    {
      "nom": "PDF",
      "typeMime": {
        "type": "application",
        "subType": "PDF"
      },
      "statutRepresentation": {
        "verbatim": true,
        "canonique": true,
        "officielle": true,
        "transcription": false,
        "enregistrement": false
      },
      "contenu": {
        "documentURI": "/15/amendements/1974/AN/381.pdf"
      }
    }
  ],
  "seanceDiscussion": "RUANR5L15S2019IDS21674",
  "sort": {
    "dateSaisie": "2019-06-03T23:22:11.000+02:00",
    "sortEnSeance": "Retiré"
  },
  "dateDepot": "2019-05-27T02:00:00.000+02:00",
  "dateDistribution": "2019-06-01T02:00:00.000+02:00",
  "article99": "0",
  "loiReference": {}
}