{
  "uid": "AMANR5L15PO419865B2135P0D1N61",
  "identifiant": {
    "legislature": "15",
    "numero": "61",
    "numRect": "0",
    "saisine": {
      "texteLegislatifRef": "PRJLANR5L15B2135",
      "numeroPartiePLF": "0",
      "organeExamen": "PO419865",
      "mentionSecondeDeliberation": "0"
    }
  },
  "numeroLong": "CD61",
  "etapeTexte": "Nouvelle Lecture",
  "triAmendement": "goaaiaaaaaaaaaaaaaaaaaaaaaaaaaaaaaaaaaaaaaaaaaaaaazzzzzzzzzzzzzzzzzzzzbi",
  "cardinaliteAmdtMultiples": "1",
  "etat": "Discuté",
  "signataires": {
    "auteur": {
      "typeAuteur": "Depute",
      "acteurRef": "PA330909",
      "groupePolitiqueRef": "PO730934"
    },
    "cosignatairesRefs": [
      "PA721314",
      "PA719318",
      "PA266776",
      "PA608416",
      "PA718884",
      "PA642847",
      "PA720210",
      "PA1012",
      "PA606712",
      "PA334654",
      "PA340853",
      "PA266793",
      "PA720586",
      "PA720386",
      "PA267735",
      "PA330909",
      "PA722390",
      "PA709315",
      "PA267527",
      "PA718838",
      "PA607090",
      "PA267260",
      "PA721968",
      "PA643134",
      "PA712015",
      "PA721816",
      "PA267204"
    ],
    "texteAffichable": "M.&#160;Descoeur,  M.&#160;Sermier, M.&#160;Schellenberger, Mme&#160;Bazin-Malgras, Mme&#160;Anthoine, Mme&#160;Poletti, Mme&#160;Beauvais, M.&#160;Lurton, M.&#160;Vialay, M.&#160;Hetzel, M.&#160;Brun, Mme&#160;Corneloup, M.&#160;Straumann, M.&#160;Reiss, Mme&#160;Valentin, M.&#160;Dive, M.&#160;Boucard, M.&#160;Vatin, M.&#160;de la Verpilli&#232;re, M.&#160;de Ganay, M.&#160;Di Filippo, M.&#160;Jean-Pierre&#160;Vigier, M.&#160;Leclerc, M.&#160;Bony, M.&#160;Saddier, M.&#160;Bazin et M.&#160;Viala"
  },
  "pointeurFragmentTexte": {
    "division": {
      "titre": "RAPPORT ANNEXÉ",
      "articleDesignationCourte": "ART. 1ER A",
      "type": "ANNEXE",
      "avantAApres": "A",
      "divisionRattachee": "ARTICLE 1ER A",
      "urlDivisionTexteVise": "/15/textes/2135.asp#D_RAPPORT_ANNEXE"
    },
    "alinea": {
      "avantAApres": "Apres",
      "numero": "40"
    }
  },
  "corps": {
    "dispositif": "<p style=\"text-align: justify;\">Apr&#232;s l&#8217;alin&#233;a&#160;40, ins&#233;rer l&#8217;alin&#233;a suivant&#160;:</p><p style=\"text-align: justify;\">&#171;&#160;L&#8217;AFITF investira 1,5&#160;milliard d&#8217;euros sur dix ans pour une nouvelle g&#233;n&#233;ration de trains Intercit&#233;s de nuit afin de constituer un r&#233;seau de nuit pour des liaisons transversales, radiales et intraeurop&#233;ennes.&#160;&#187;</p>",
    "exposeSommaire": "<p style=\"text-align: justify;\">Les derni&#232;res commandes d&#8217;Intercit&#233;s de nuit datent de 40 ans. Avec la Loi d&#8217;Orientation des Mobilit&#233;s, il est temps d&#8217;inscrire &#224; nouveau dans les priorit&#233;s nationales l&#8217;importance d&#8217;un r&#233;seau de nuit. Celui-ci est devenu depuis d&#8217;autant plus pertinent qu&#8217;il permet de r&#233;pondre aux questions du maillage international de la France dans l&#8217;Europe par une mobilit&#233; bas-carbone et peu &#233;nergivore&#160;; du maillage transversal du territoire pour relier entre elles les r&#233;gions &#233;loign&#233;es&#160;; du d&#233;senclavement des territoires ruraux excentr&#233;s.</p><p style=\"text-align: justify;\">Par ailleurs, la renaissance des Intercit&#233;s de nuit pour lutter contre le changement climatique en Europe est d&#233;j&#224; lanc&#233;e et soutenue par plusieurs pays europ&#233;ens moteurs, dont l&#8217;Autriche et la Su&#232;de. La France gagnera &#224; s&#8217;impliquer elle aussi, sans d&#233;lai, d&#8217;autant plus qu&#8217;elle a une position centrale en Europe de l&#8217;Ouest pour promouvoir cette mobilit&#233;. Le temps long propos&#233; (10 ans) permet dans le m&#234;me temps de r&#233;g&#233;n&#233;rer le r&#233;seau ferr&#233;. L&#8217;investissement de 1,5 Md&#8364; permet d&#8217;acqu&#233;rir 600 voitures neuves et de r&#233;nover 150 voitures Corail.</p><p style=\"text-align: justify;\">L&#8217;Annexe I de la loi pr&#233;voit une augmentation des budgets pour les transports. Une partie de cette augmentation gagnera donc &#224; &#234;tre fl&#233;ch&#233;e pour r&#233;g&#233;n&#233;rer l&#8217;offre Intercit&#233;s de nuit et augmenter son ambition. Tel est l&#8217;objet de cet amendement.</p>"
  },
  "representations": [
    {
      "nom": "PDF",
      "typeMime": {
        "type": "application",
        "subType": "PDF"
      },
      "statutRepresentation": {
        "verbatim": true,
        "canonique": true,
        "officielle": true,
        "transcription": false,
        "enregistrement": false
      },
      "contenu": {
        "documentURI": "/15/amendements/2135/CION-DVP/CD61.pdf"
      }
    }
  ],
  "sort": {
    "dateSaisie": "2019-09-03T22:58:05.000+02:00",
    "sortEnSeance": "Rejeté"
  },
  "dateDepot": "2019-07-17T02:00:00.000+02:00",
  "dateDistribution": "2019-09-02T02:00:00.000+02:00",
  "article99": "0",
  "loiReference": {}
}