{
  "uid": "AMANR5L15PO419865B1831P0D1N491",
  "identifiant": {
    "legislature": "15",
    "numero": "491",
    "numRect": "0",
    "saisine": {
      "texteLegislatifRef": "PRJLANR5L15B1831",
      "numeroPartiePLF": "0",
      "organeExamen": "PO419865",
      "mentionSecondeDeliberation": "0"
    }
  },
  "numeroLong": "CD491",
  "etapeTexte": "1ère lecture (2ème assemblée saisie)",
  "triAmendement": "idsaaaaaaaaaaaaaaaaaaaaaaaaaaaaaaaaaaaaaaaaaaaaaaazzzzzzzzzzzzzzzzzzzzzzzzzzzzzzzzzy",
  "cardinaliteAmdtMultiples": "1",
  "etat": "Discuté",
  "signataires": {
    "auteur": {
      "typeAuteur": "Depute",
      "acteurRef": "PA330909",
      "groupePolitiqueRef": "PO730934"
    },
    "cosignatairesRefs": [
      "PA643134",
      "PA330909",
      "PA267527",
      "PA606712",
      "PA721410",
      "PA718884",
      "PA605036",
      "PA334843",
      "PA332523",
      "PA340853",
      "PA608416",
      "PA346218",
      "PA719318",
      "PA267204",
      "PA266793",
      "PA712015",
      "PA334654"
    ],
    "texteAffichable": "M.&#160;Descoeur,  M.&#160;Sermier, M.&#160;Lurton, M.&#160;Dive, M.&#160;Straumann, M.&#160;Hetzel, M.&#160;Abad, Mme&#160;Bonnivard, Mme&#160;Anthoine, Mme&#160;Bazin-Malgras, M.&#160;Saddier, M.&#160;Verch&#232;re, M.&#160;Masson, Mme&#160;Valentin, M.&#160;Bony, M.&#160;Leclerc et Mme&#160;Dalloz"
  },
  "pointeurFragmentTexte": {
    "division": {
      "titre": "RAPPORT ANNEXÉ",
      "articleDesignationCourte": "ART. 1ER A",
      "type": "ANNEXE",
      "avantAApres": "A",
      "divisionRattachee": "ARTICLE 1ER A",
      "urlDivisionTexteVise": "/15/textes/1831.asp#D_RAPPORT_ANNEXE"
    },
    "alinea": {
      "numero": "59"
    }
  },
  "corps": {
    "dispositif": "<p style=\"text-align: justify;\">Compl&#233;ter l&#8217;alin&#233;a&#160;59 par les mots&#160;:</p><p style=\"text-align: justify;\">&#171;&#160;, d&#233;veloppement des tiers-lieux destin&#233;s &#224; l&#8217;accueil des t&#233;l&#233;travailleurs&#160;&#187;.</p>",
    "exposeSommaire": "<p style=\"text-align: justify;\">Il convient sur ce projet de loi mobilit&#233; d&#8217;inclure la notion de t&#233;l&#233;travail qui constitue une des r&#233;ponses &#224; une meilleure mobilit&#233; ainsi qu&#8217;&#224; la transition &#233;nerg&#233;tique et la lutte contre la pollution, vis&#233;es par le texte.</p><p style=\"text-align: justify;\">Il convient en effet d&#8217;encourager le d&#233;veloppement du t&#233;l&#233;travail, qui repr&#233;sente un mode d&#8217;organisation en pleine croissance qu&#8217;il convient d&#8217;accompagner dans la mesure o&#249;, &#224; la fois, il r&#233;pond aux attentes des salari&#233;s, permet d&#8217;am&#233;liorer la comp&#233;titivit&#233; des entreprises et de r&#233;pondre &#224; des enjeux li&#233;s &#224; la mobilit&#233; et &#224; l&#8217;am&#233;nagement du territoire.</p><p style=\"text-align: justify;\">Parall&#232;lement, le t&#233;l&#233;travail am&#233;liore la qualit&#233; de vie des salari&#233;s en permettant un meilleur &#233;quilibre entre vie familiale et professionnelle, g&#233;n&#232;re des &#233;conomies de carburant, de temps et de frais de transport.&#160; Enfin, le t&#233;l&#233;travail contribue &#224; am&#233;liorer l&#8217;empreinte carbone, &#224; r&#233;duire les difficult&#233;s de circulation aux heures de pointe dans les grandes m&#233;tropoles, &#224; fixer des actifs dans les quartiers, espaces p&#233;ri-urbains ou zones rurales, tout en contribuant &#224; l&#8217;am&#233;nagement du territoire.</p>"
  },
  "representations": [
    {
      "nom": "PDF",
      "typeMime": {
        "type": "application",
        "subType": "PDF"
      },
      "statutRepresentation": {
        "verbatim": true,
        "canonique": true,
        "officielle": true,
        "transcription": false,
        "enregistrement": false
      },
      "contenu": {
        "documentURI": "/15/amendements/1831/CION-DVP/CD491.pdf"
      }
    }
  ],
  "sort": {
    "dateSaisie": "2019-05-21T00:32:58.000+02:00",
    "sortEnSeance": "Rejeté"
  },
  "dateDepot": "2019-05-02T02:00:00.000+02:00",
  "dateDistribution": "2019-05-20T02:00:00.000+02:00",
  "article99": "0",
  "loiReference": {}
}