{
  "uid": "AMANR5L15SEA717460BTC0971P0D1N52",
  "identifiant": {
    "legislature": "15",
    "numero": "52",
    "numRect": "0",
    "saisine": {
      "texteLegislatifRef": "PRJLANR5L15BTC0971",
      "numeroPartiePLF": "0",
      "organeExamen": "PO717460",
      "mentionSecondeDeliberation": "0"
    }
  },
  "numeroLong": "52",
  "etapeTexte": "1ère lecture (1ère assemblée saisie)",
  "triAmendement": "abbvdc",
  "cardinaliteAmdtMultiples": "1",
  "etat": "Discuté",
  "signataires": {
    "auteur": {
      "typeAuteur": "Depute",
      "acteurRef": "PA332523",
      "groupePolitiqueRef": "PO730934"
    },
    "cosignatairesRefs": [
      "PA643103",
      "PA721410",
      "PA606712",
      "PA720684",
      "PA334654",
      "PA721968",
      "PA721678",
      "PA718784",
      "PA608016",
      "PA608416",
      "PA720210",
      "PA332523",
      "PA266793",
      "PA2377",
      "PA330684"
    ],
    "texteAffichable": "Mme&#160;Dalloz,  M.&#160;Straumann, M.&#160;Bony, M.&#160;Pierre-Henri&#160;Dumont, M.&#160;Perrut, Mme&#160;Val&#233;rie&#160;Boyer, Mme&#160;Louwagie, M.&#160;Reda, Mme&#160;Beauvais, M.&#160;Hetzel, Mme&#160;Bonnivard, M.&#160;Lurton, M.&#160;Pauget, M.&#160;Vialay et M.&#160;Ferrara"
  },
  "pointeurFragmentTexte": {
    "division": {
      "titre": "Article 59",
      "articleDesignationCourte": "APRÈS ART. 59",
      "type": "ARTICLE",
      "avantAApres": "Apres",
      "divisionRattachee": "APRÈS L'ARTICLE 59, insérer l'article suivant:",
      "articleAdditionnel": "1",
      "urlDivisionTexteVise": "/15/textes/0971.asp#D_Article_59"
    }
  },
  "corps": {
    "dispositif": "<p style=\"text-align: justify;\">L&#8217;article&#160;14&#8209;2 de la loi n&#176;&#160;65-557 du 10 juillet 1965 fixant le statut de la copropri&#233;t&#233; des immeubles b&#226;tis est ainsi modifi&#233;&#160;:</p><p style=\"text-align: justify;\">1&#176;&#160;La seconde phrase du septi&#232;me alin&#233;a du II est remplac&#233;e par une phrase ainsi r&#233;dig&#233;e&#160;: &#171;&#160;Ce montant ne peut &#234;tre inf&#233;rieur &#224; 50&#160;% de la quote-part de travaux annuels &#224; constituer en fonction du plan pluriannuel de travaux d&#233;fini dans le diagnostic technique global. &#187; ;</p><p style=\"text-align: justify;\">2&#176; Il est compl&#233;t&#233; par un V ainsi r&#233;dig&#233; :</p><p style=\"text-align: justify;\">&#171; V. &#8211; Pour les copropri&#233;t&#233;s de plus de 50 lots principaux, un diagnostic technique global est r&#233;alis&#233; afin de d&#233;finir les travaux susceptibles d&#8217;&#234;tre r&#233;alis&#233;s au cours des dix prochaines ann&#233;es avec une estimation des co&#251;ts. Pour les copropri&#233;t&#233;s de moins de cinquante lots principaux, un diagnostic technique simplifi&#233;, dont le contenu est d&#233;fini par d&#233;cret en Conseil d&#8217;&#201;tat, est r&#233;alis&#233;. Ces diagnostics sont actualis&#233;s tous les dix ans.&#187;</p>",
    "exposeSommaire": "<p style=\"text-align: justify;\">Le principal frein &#224; la r&#233;novation des copropri&#233;t&#233;s est le manque d&#8217;anticipation du financement des travaux. Ainsi, bien souvent, pour des raisons &#233;conomiques, l&#8217;assembl&#233;e g&#233;n&#233;rale refuse ou ajourne la r&#233;alisation de travaux qui peuvent repr&#233;senter des montants importants.</p><p style=\"text-align: justify;\">Cette situation explique le manque d&#8217;entretien des copropri&#233;t&#233;s.</p><p style=\"text-align: justify;\">Pour pallier &#224; cette difficult&#233;, la loi ALUR a pr&#233;vu un fonds travaux avec une cotisation minimale de 5&#160;% du budget pr&#233;visionnel.</p><p style=\"text-align: justify;\">Or, selon l&#8217;ensemble des &#233;tudes, ce taux est largement insuffisant, ne r&#233;pondant pas efficacement &#224; l&#8217;enjeu des r&#233;novations y compris &#233;nerg&#233;tiques des copropri&#233;t&#233;s.</p><p style=\"text-align: justify;\">C&#8217;est pour cela que la loi doit pr&#233;voir l&#8217;instauration progressive d&#8217;un plan d&#8217;amortissement des &#233;quipements et du b&#226;ti de la copropri&#233;t&#233; qui devra &#234;tre d&#233;termin&#233; &#224; partir du Diagnostic Technique Global.</p><p style=\"text-align: justify;\">Tel est l&#8217;objet du pr&#233;sent amendement.</p>"
  },
  "representations": [
    {
      "nom": "PDF",
      "typeMime": {
        "type": "application",
        "subType": "PDF"
      },
      "statutRepresentation": {
        "verbatim": true,
        "canonique": true,
        "officielle": true,
        "transcription": false,
        "enregistrement": false
      },
      "contenu": {
        "documentURI": "/15/amendements/0971/AN/52.pdf"
      }
    }
  ],
  "seanceDiscussion": "RUANR5L15S2018IDS21139",
  "sort": {
    "dateSaisie": "2018-06-09T00:49:39.000+02:00",
    "sortEnSeance": "Non soutenu"
  },
  "dateDepot": "2018-05-23T02:00:00.000+02:00",
  "dateDistribution": "2018-06-01T02:00:00.000+02:00",
  "article99": "0",
  "loiReference": {
    "codeLoi": "loi 65-557",
    "divisionCodeLoi": "14-2"
  }
}