{
  "uid": "AMANR5L15PO419610B1908P0D1N31",
  "identifiant": {
    "legislature": "15",
    "numero": "31",
    "numRect": "0",
    "saisine": {
      "texteLegislatifRef": "PRJLANR5L15B1908",
      "numeroPartiePLF": "0",
      "organeExamen": "PO419610",
      "mentionSecondeDeliberation": "0"
    }
  },
  "numeroLong": "CE31",
  "etapeTexte": "1ère lecture (1ère assemblée saisie)",
  "triAmendement": "biaaaaaaaaaaaaaaaaaaaaaaaaaaaaaaaaaaaaaaaaaaaaaaaadwjy",
  "cardinaliteAmdtMultiples": "1",
  "etat": "Irrecevable",
  "signataires": {
    "auteur": {
      "typeAuteur": "Depute",
      "acteurRef": "PA267527",
      "groupePolitiqueRef": "PO730934"
    },
    "cosignatairesRefs": [
      "PA721474",
      "PA267527",
      "PA267735",
      "PA267204",
      "PA722390",
      "PA2796",
      "PA709315",
      "PA266793",
      "PA266808",
      "PA340853",
      "PA330008",
      "PA334654",
      "PA267429",
      "PA719318",
      "PA721968",
      "PA718838",
      "PA267450",
      "PA608826",
      "PA606712",
      "PA330909",
      "PA718884",
      "PA608016"
    ],
    "texteAffichable": "M.&#160;Saddier,  M.&#160;Cinieri, Mme&#160;Duby-Muller, Mme&#160;Anthoine, Mme&#160;Bazin-Malgras, M.&#160;Sermier, M.&#160;Bony, M.&#160;Lurton, M.&#160;Rolland, M.&#160;Leclerc, M.&#160;Straumann, Mme&#160;Louwagie, M.&#160;de Ganay, M.&#160;R&#233;mi&#160;Delatte, M.&#160;Brun, M.&#160;Descoeur, Mme&#160;Corneloup, M.&#160;Viala, M.&#160;Teissier, M.&#160;Viry, M.&#160;Breton et M.&#160;Vialay"
  },
  "pointeurFragmentTexte": {
    "division": {
      "titre": "Article 3",
      "articleDesignationCourte": "APRÈS ART. 3",
      "type": "ARTICLE",
      "avantAApres": "Apres",
      "divisionRattachee": "APRÈS L'ARTICLE 3, insérer l'article suivant:",
      "articleAdditionnel": "1",
      "urlDivisionTexteVise": "/15/textes/1908.asp#D_Article_3"
    }
  },
  "corps": {},
  "representations": [
    {
      "nom": "PDF",
      "typeMime": {
        "type": "application",
        "subType": "PDF"
      },
      "statutRepresentation": {
        "verbatim": true,
        "canonique": true,
        "officielle": true,
        "transcription": false,
        "enregistrement": false
      },
      "contenu": {
        "documentURI": "/15/amendements/1908/CION-ECO/CE31.pdf"
      }
    }
  ],
  "dateDepot": "2019-06-06T02:00:00.000+02:00",
  "dateDistribution": "2019-06-16T02:00:00.000+02:00",
  "article99": "0",
  "loiReference": {
    "codeLoi": "xhydroélectricité"
  }
}