{
  "uid": "AMANR5L15PO419865B2274P0D1N1442",
  "identifiant": {
    "legislature": "15",
    "numero": "1442",
    "numRect": "0",
    "saisine": {
      "texteLegislatifRef": "PRJLANR5L15B2274",
      "numeroPartiePLF": "0",
      "organeExamen": "PO419865",
      "mentionSecondeDeliberation": "0"
    }
  },
  "numeroLong": "CD1442",
  "etapeTexte": "1ère lecture (2ème assemblée saisie)",
  "triAmendement": "dkaaaaaaaaaaaaaaaaaaaaaaaaaaaaaaaaaaaaaaaaaaaaaaaazi",
  "cardinaliteAmdtMultiples": "1",
  "etat": "En traitement",
  "signataires": {
    "auteur": {
      "typeAuteur": "Depute",
      "acteurRef": "PA605518",
      "groupePolitiqueRef": "PO759900"
    },
    "cosignatairesRefs": [
      "PA331582",
      "PA720996",
      "PA719138",
      "PA721194",
      "PA755549",
      "PA605694",
      "PA267042",
      "PA720278",
      "PA405480",
      "PA720038",
      "PA942",
      "PA333421",
      "PA719146",
      "PA719286",
      "PA607619",
      "PA605518",
      "PA608292",
      "PA336175",
      "PA336439"
    ],
    "texteAffichable": "M.&#160;Fran&#231;ois-Michel&#160;Lambert,  M.&#160;Acquaviva, M.&#160;Brial, M.&#160;Castellani, M.&#160;Cl&#233;ment, M.&#160;Colombani, M.&#160;Charles&#160;de Courson, Mme&#160;Dubi&#233;, Mme&#160;Fr&#233;d&#233;rique&#160;Dumas, M.&#160;El Guerrab, M.&#160;Falorni, M.&#160;Favennec Becot, Mme&#160;Josso, M.&#160;Molac, M.&#160;Orphelin, M.&#160;Pancher, Mme&#160;Pinel, M.&#160;Pupponi et M.&#160;Philippe&#160;Vigier"
  },
  "pointeurFragmentTexte": {
    "division": {
      "titre": "Article 6 bis",
      "articleDesignationCourte": "APRÈS ART. 6 BIS",
      "type": "ARTICLE",
      "avantAApres": "Apres",
      "divisionRattachee": "APRÈS L'ARTICLE 6 BIS, insérer l'article suivant:",
      "articleAdditionnel": "1",
      "urlDivisionTexteVise": "/15/textes/2274.asp#D_Article_6_bis"
    }
  },
  "corps": {
    "dispositif": "<p>I &#8211; A compter du 1er janvier 2021, les biens acquis par les services de l&#8217;E&#769;tat ainsi que par les collectivit&#233;s territoriales et leurs groupements sont issus du r&#233;emploi dans les proportions suivantes : </p><p><br />1&#176; 20 % des t&#233;l&#233;phones ; <br />2&#176; 30 % des pneumatiques apr&#232;s avoir &#233;t&#233; rechap&#233;s ; <br />3&#176; 20 % des biens d&#8217;ameublements. <br /> II &#8211; A compter du 1er janvier 2023, l&#8217;ensemble des biens neufs en plastique acquis par les services de l&#8217;E&#769;tat ainsi que par les collectivit&#233;s territoriales et leurs groupements doivent &#234;tre compos&#233;s de mati&#232;re plastique recycl&#233;e. <br />III - Les biens en plastique pouvant d&#233;roger aux dispositions du pr&#233;c&#233;dent alin&#233;a sont pr&#233;cis&#233;es par un d&#233;cret en Conseil d&#8217;E&#769;tat.&#160;<br />IV - Dans les 6 mois suivant la promulgation de la pr&#233;sente loi, le gouvernement remet au Parlement un rapport &#233;tablissant une strat&#233;gie d&#8217;augmentation des taux mentionn&#233;es dans le I. Le rapport r&#233;pertorie l&#8217;ensemble des biens issus du r&#233;emploi ou int&#233;grant des mati&#232;res recycl&#233;es pouvant &#234;tre acquis par les services de l&#8217;E&#769;tat ainsi que par les collectivit&#233;s territoriales et leurs groupements. Il fixe &#233;galement leur proportion. </p>",
    "exposeSommaire": "<p style=\"text-align: justify;\">L&#8217;article 6 bis a pour objectif de d&#233;velopper le r&#233;emploi et le recyclage par le biais de la commande publique. Pour certaines cat&#233;gories d&#8217;achats, les acheteurs publics devront acqu&#233;rir obligatoirement des biens issus du r&#233;emploi. Le gouvernement devra &#233;galement r&#233;pertorier l&#8217;ensemble des biens issus du r&#233;emploi ou int&#233;grant des matie&#768;res recycl&#233;es pouvant &#234;tre acquis par les acheteurs publics.</p>",
    "cartoucheDelaiDepotDepasse": "Sous réserve de son traitement par les services de l'Assemblée nationale et de sa recevabilité"
  },
  "representations": [
    {
      "nom": "PDF",
      "typeMime": {
        "type": "application",
        "subType": "PDF"
      },
      "statutRepresentation": {
        "verbatim": true,
        "canonique": true,
        "officielle": true,
        "transcription": false,
        "enregistrement": false
      },
      "contenu": {
        "documentURI": "/15/amendements/2274/CION-DVP/CD1442.pdf"
      }
    }
  ],
  "dateDepot": "2019-11-20T01:00:00.000+01:00",
  "article99": "0",
  "loiReference": {}
}