{
  "uid": "AMANR5L15PO420120B0904P0D1N858",
  "identifiant": {
    "legislature": "15",
    "numero": "858",
    "numRect": "0",
    "saisine": {
      "texteLegislatifRef": "PRJLANR5L15B0904",
      "numeroPartiePLF": "0",
      "organeExamen": "PO420120",
      "mentionSecondeDeliberation": "0"
    }
  },
  "numeroLong": "AS858",
  "etapeTexte": "1ère lecture (1ère assemblée saisie)",
  "triAmendement": "hc",
  "cardinaliteAmdtMultiples": "1",
  "etat": "Discuté",
  "signataires": {
    "auteur": {
      "typeAuteur": "Depute",
      "acteurRef": "PA610681",
      "groupePolitiqueRef": "PO730946"
    },
    "cosignatairesRefs": [
      "PA643145",
      "PA1198",
      "PA720988",
      "PA1592",
      "PA332614",
      "PA605069",
      "PA333818",
      "PA588886",
      "PA608695",
      "PA610681",
      "PA1809",
      "PA333285",
      "PA337483",
      "PA607553",
      "PA340357",
      "PA405480",
      "PA608172",
      "PA719930",
      "PA608011",
      "PA340343",
      "PA429893",
      "PA642764",
      "PA609332",
      "PA342415",
      "PA508",
      "PA609590",
      "PA335054",
      "PA335532",
      "PA1008",
      "PA267233"
    ],
    "texteAffichable": "Mme&#160;Bareigts,  M.&#160;Aviragnet, Mme&#160;Bi&#233;mouret, Mme&#160;Manin, Mme&#160;Vainqueur-Christophe, M.&#160;Vallaud, Mme&#160;Victory, Mme&#160;Battistel, M.&#160;Bouillon, M.&#160;Jean-Louis&#160;Bricout, M.&#160;Carvounas, M.&#160;Alain&#160;David, Mme&#160;Laurence&#160;Dumont, M.&#160;Faure, M.&#160;Garot, M.&#160;David&#160;Habib, M.&#160;Hutin, M.&#160;Juanico, Mme&#160;Karamanli, M.&#160;J&#233;r&#244;me&#160;Lambert, M.&#160;Le Foll, M.&#160;Letchimy, Mme&#160;Pau-Langevin, Mme&#160;Pires Beaune, M.&#160;Potier, M.&#160;Pueyo, M.&#160;Pupponi, Mme&#160;Rabault, M.&#160;Saulignac et Mme&#160;Untermaier"
  },
  "pointeurFragmentTexte": {
    "division": {
      "titre": "Article 62",
      "articleDesignationCourte": "APRÈS ART. 62",
      "type": "ARTICLE",
      "avantAApres": "Apres",
      "divisionRattachee": "APRÈS L'ARTICLE 62, insérer l'article suivant:",
      "articleAdditionnel": "1",
      "urlDivisionTexteVise": "/15/textes/0904.asp#D_Article_62"
    }
  },
  "corps": {
    "dispositif": "<p style=\"text-align: justify;\">Le deuxi&#232;me alin&#233;a de l&#8217;article L.&#160;1243&#8209;8 du code du travail est compl&#233;t&#233; par une phrase ainsi r&#233;dig&#233;e&#160;:</p><p style=\"text-align: justify;\">&#171;&#160;Lorsque le contrat de travail est &#224; temps partiel, l&#8217;indemnit&#233; est &#233;gale &#224; 20&#160;% de la r&#233;mun&#233;ration totale brute vers&#233;e au salari&#233;.&#160;&#187;</p>",
    "exposeSommaire": "<p style=\"text-align: justify;\">&#171;&#160;80&#160;% des emplois &#224; temps partiel sont occup&#233;s par des femmes. Ce moindre nombre d&#8217;heures travaill&#233;es explique pour plus d&#8217;un tiers l&#8217;&#233;cart de r&#233;mun&#233;ration entre les femmes et les hommes&#160;&#187;.</p><p style=\"text-align: justify;\">Les salari&#233;s travaillant &#224; temps partiel sont soumis &#224; une pr&#233;carit&#233; plus grande, justifiant une majoration de la prime. Le pr&#233;sent amendement vise donc &#224; augmenter la prime de pr&#233;carit&#233; pour les contrats &#224; dur&#233;e d&#233;termin&#233;e &#224; temps partiel, en la fixant &#224; 20&#160;% de la r&#233;mun&#233;ration totale brute de la personne salari&#233;e, contre 10&#160;% pour les contrats &#224; dur&#233;e d&#233;termin&#233;e &#224; temps plein.</p><p style=\"text-align: justify;\">&#160;</p>"
  },
  "representations": [
    {
      "nom": "PDF",
      "typeMime": {
        "type": "application",
        "subType": "PDF"
      },
      "statutRepresentation": {
        "verbatim": true,
        "canonique": true,
        "officielle": true,
        "transcription": false,
        "enregistrement": false
      },
      "contenu": {
        "documentURI": "/15/amendements/0904/CION-SOC/AS858.pdf"
      }
    }
  ],
  "sort": {
    "dateSaisie": "2018-06-01T01:25:09.000+02:00",
    "sortEnSeance": "Rejeté"
  },
  "dateDepot": "2018-05-25T02:00:00.000+02:00",
  "dateDistribution": "2018-05-29T02:00:00.000+02:00",
  "article99": "0",
  "loiReference": {
    "codeLoi": "travail",
    "divisionCodeLoi": "L1243-8"
  }
}