{
  "uid": "AMANR5L15SEA717460B1255P2D1N1131",
  "identifiant": {
    "legislature": "15",
    "numero": "1131",
    "numRect": "0",
    "saisine": {
      "texteLegislatifRef": "PRJLANR5L15B1255",
      "numeroPartiePLF": "2",
      "organeExamen": "PO717460",
      "mentionSecondeDeliberation": "0"
    }
  },
  "numeroLong": "II-1131",
  "etapeTexte": "1ère lecture (1ère assemblée saisie)",
  "triAmendement": "aoeaaaaaaaaaaaaaaaaaaaaaaaaaaaaaaaaaaaaaaaaaaaaaaab",
  "cardinaliteAmdtMultiples": "1",
  "etat": "Discuté",
  "signataires": {
    "auteur": {
      "typeAuteur": "Depute",
      "acteurRef": "PA720614",
      "groupePolitiqueRef": "PO723569"
    },
    "cosignatairesRefs": [
      "PA720606",
      "PA606212",
      "PA720822",
      "PA720614",
      "PA720468",
      "PA720798"
    ],
    "texteAffichable": "Mme&#160;Le Pen,  M.&#160;Aliot, M.&#160;Bilde, M.&#160;Chenu, M.&#160;Collard et M.&#160;Pajot"
  },
  "pointeurFragmentTexte": {
    "missionVisee": {
      "idMissionAN": "425",
      "libelleMission": "Contrôle de la circulation et du stationnement routiers",
      "codeMissionPLF": "D",
      "libelleMissionPLF": "Répartition, par mission et programme, des crédits des comptes d’affectation spéciale et des comptes de concours financiers"
    },
    "division": {
      "titre": "ÉTAT D",
      "articleDesignationCourte": "ART. 41",
      "type": "ANNEXE",
      "avantAApres": "A",
      "divisionRattachee": "ARTICLE 41",
      "urlDivisionTexteVise": "/15/textes/1255C.asp#D_ETAT_D"
    }
  },
  "corps": {
    "exposeSommaire": "<p style=\"text-align: justify;\">A l'aune des chiffres de la s&#233;curit&#233; routi&#232;re, il apparait clairement que la \"politique du tout radar\" a montr&#233; ses limites et que ces derniers sont devenus non plus un outil de s&#233;curit&#233; routi&#232;re mais bien un moyen de remplir les caisses de l&#8217;&#201;tat.</p><p style=\"text-align: justify;\">Cet amendement propose donc de supprimer la ligne budg&#233;taire d&#233;di&#233;e au d&#233;ploiement de nouveaux dispositifs de contr&#244;le (action 01 du programme 751).</p>",
    "dispositifAmdtCredit": {
      "listeProgrammes": [
        {
          "libelle": "Structures et dispositifs de sécurité routière",
          "id": "40802",
          "AE": {
            "montantPositif": "0",
            "montantNegatif": "78290000"
          },
          "CP": {
            "montantPositif": "0",
            "montantNegatif": "78290000"
          },
          "action": "modification"
        },
        {
          "libelle": "Contrôle et modernisation de la politique de la circulation et du stationnement routiers",
          "id": "40803",
          "AE": {
            "montantPositif": "0",
            "montantNegatif": "0"
          },
          "CP": {
            "montantPositif": "0",
            "montantNegatif": "0"
          },
          "action": "modification"
        },
        {
          "libelle": "Contribution à l'équipement des collectivités territoriales pour l'amélioration des transports en commun, de la sécurité et de la circulation routières",
          "id": "40804",
          "AE": {
            "montantPositif": "0",
            "montantNegatif": "0"
          },
          "CP": {
            "montantPositif": "0",
            "montantNegatif": "0"
          },
          "action": "modification"
        },
        {
          "libelle": "Désendettement de l'État",
          "id": "40805",
          "AE": {
            "montantPositif": "0",
            "montantNegatif": "0"
          },
          "CP": {
            "montantPositif": "0",
            "montantNegatif": "0"
          },
          "action": "modification"
        }
      ],
      "totalAE": {
        "montantPositif": "0",
        "montantNegatif": "78290000",
        "solde": "-78290000"
      },
      "totalCP": {
        "montantPositif": "0",
        "montantNegatif": "78290000",
        "solde": "-78290000"
      }
    }
  },
  "representations": [
    {
      "nom": "PDF",
      "typeMime": {
        "type": "application",
        "subType": "PDF"
      },
      "statutRepresentation": {
        "verbatim": true,
        "canonique": true,
        "officielle": true,
        "transcription": false,
        "enregistrement": false
      },
      "contenu": {
        "documentURI": "/15/amendements/1255C/AN/1131.pdf"
      }
    }
  ],
  "seanceDiscussion": "RUANR5L15S2019IDS21328",
  "sort": {
    "dateSaisie": "2018-11-06T23:35:18.000+01:00",
    "sortEnSeance": "Rejeté"
  },
  "dateDepot": "2018-11-02T01:00:00.000+01:00",
  "dateDistribution": "2018-11-05T01:00:00.000+01:00",
  "article99": "0",
  "loiReference": {}
}