{
  "uid": "AMANR5L15PO59048B1255P2D1N1244",
  "identifiant": {
    "legislature": "15",
    "numero": "1244",
    "numRect": "0",
    "saisine": {
      "texteLegislatifRef": "PRJLANR5L15B1255",
      "numeroPartiePLF": "2",
      "organeExamen": "PO59048",
      "mentionSecondeDeliberation": "0"
    }
  },
  "numeroLong": "II-CF1244",
  "etapeTexte": "1ère lecture (1ère assemblée saisie)",
  "triAmendement": "kaiaaaaaaaaaaaaaaaaaaaaaaaaaaaaaaaaaaaaaaaaaaaaaaabekknw",
  "cardinaliteAmdtMultiples": "1",
  "etat": "Discuté",
  "signataires": {
    "auteur": {
      "typeAuteur": "Depute",
      "acteurRef": "PA721976",
      "groupePolitiqueRef": "PO730970"
    },
    "cosignatairesRefs": [
      "PA721836",
      "PA718978",
      "PA721976",
      "PA720728",
      "PA720002",
      "PA721608"
    ],
    "texteAffichable": "M.&#160;Millienne,  M.&#160;Barrot, M.&#160;Bourlanges, Mme&#160;El Ha&#239;ry, M.&#160;Laqhila et M.&#160;Mattei"
  },
  "pointeurFragmentTexte": {
    "division": {
      "titre": "Article 60",
      "articleDesignationCourte": "ART. 60",
      "type": "ARTICLE",
      "avantAApres": "A",
      "divisionRattachee": "ARTICLE 60",
      "urlDivisionTexteVise": "/15/textes/1255C.asp#D_Article_60"
    },
    "alinea": {
      "avantAApres": "A",
      "numero": "12",
      "alineaDesignation": "Alinéa 12"
    }
  },
  "corps": {
    "dispositif": "<p style=\"text-align: justify;\">I.&#160;&#8211;&#160;Au tableau de l&#8217;alin&#233;a&#160;12&#160;:</p><p style=\"text-align: justify;\">1&#176;&#160;&#192; la derni&#232;re ligne de la deuxi&#232;me colonne, substituer au taux&#160;: </p><p style=\"text-align: justify;\">&#171;&#160;7,7&#160;%&#160;&#187;</p><p style=\"text-align: justify;\">le taux&#160;: </p><p style=\"text-align: justify;\">&#171;&#160;8,3&#160;%&#160;&#187;</p><p style=\"text-align: justify;\">2&#176;&#160;&#192; la derni&#232;re ligne de la derni&#232;re colonne, substituer au taux&#160;:</p><p style=\"text-align: justify;\">&#171;&#160;7,8&#160;%&#160;&#187;</p><p style=\"text-align: justify;\">le taux&#160;:</p><p style=\"text-align: justify;\">&#171;&#160;8,9&#160;%&#160;&#187;.</p><p style=\"text-align: justify;\">II.&#160;&#8211;&#160;R&#233;diger ainsi le tableau de l&#8217;alin&#233;a&#160;16&#160;:</p><table style=\"border-collapse: collapse; height: 152px;\" width=\"825\"><tbody><tr><td style=\"white-space: normal; border: 1px solid #000000; width: 409px;\">Cat&#233;gorie de mati&#232;res premi&#232;res</td><td style=\"white-space: normal; border: 1px solid #000000; width: 409px; text-align: center;\">Seuil au-del&#224; duquel la part de l'&#233;nergie issue de l'ensemble des mati&#232;res premi&#232;res de la cat&#233;gorie n'est pas prise en compte</td></tr><tr><td style=\"white-space: normal; border: 1px solid #000000; width: 409px;\">C&#233;r&#233;ales et autres plantes riches en amidon, sucri&#232;res ou ol&#233;agineuses et autres produits issus des cultures principales des terres agricoles principalement utilis&#233;es &#224; des fins de production d'&#233;nergie autres que les mati&#232;res mentionn&#233;es &#224; l'annexe IX de la directive 2009/28/CE susmentionn&#233;e, sucres non extractibles et amidons r&#233;siduels.</td><td style=\"white-space: normal; border: 1px solid #000000; width: 409px; text-align: center;\">7&#160;%</td></tr><tr><td style=\"white-space: normal; border: 1px solid #000000; width: 409px;\">Sucres non extractibles et amidon r&#233;siduel, pour les quantit&#233;s autres que celles comptabilis&#233;es dans la cat&#233;gorie pr&#233;c&#233;dente.</td><td style=\"white-space: normal; border: 1px solid #000000; width: 409px; text-align: center;\">0,6&#160;% en 2019 et 1,2&#160;% &#224; compter de 2020</td></tr><tr><td style=\"white-space: normal; border: 1px solid #000000; width: 409px;\">Tallol et brai de tallol</td><td style=\"white-space: normal; border: 1px solid #000000; width: 409px; text-align: center;\">0,6&#160;%</td></tr><tr><td style=\"white-space: normal; border: 1px solid #000000; width: 409px;\">Mati&#232;res mentionn&#233;es &#224; la partie B de l'annexe IX de la directive 2009/28/CE susmentionn&#233;e</td><td style=\"white-space: normal; border: 1px solid #000000; width: 409px; text-align: center;\">0,9&#160;%</td></tr></tbody></table><p style=\"text-align: justify;\">III.&#160;&#8211;&#160;La perte de recettes pour l&#8217;&#201;tat est compens&#233;e &#224; due concurrence par la cr&#233;ation d&#8217;une taxe additionnelle aux droits mentionn&#233;s aux articles 575 et 575 A du code g&#233;n&#233;ral des imp&#244;ts.</p>",
    "exposeSommaire": "<p>Depuis plusieurs ann&#233;es, l&#8217;huile de palme est utilis&#233;e de mani&#232;re croissante dans les carburants. Or, l&#8217;extension des plantations de palmiers &#224; huile concourt &#224; la d&#233;forestation dans les pays du Sud.</p><p>L&#8217;article 60 propose de renforcer l&#8217;incitation &#224; l&#8217;incorporation de biocarburants dans les carburants et de l&#8217;inscrire dans la dur&#233;e. Cependant, les augmentations du pourcentage cible dans l&#8217;essence &#224; 7,7% en 2019 et 7,8% en 2020 sont trop faibles au vu de l&#8217;enjeu de d&#233;carbonation des transports et des capacit&#233;s de production de bio&#233;thanol exc&#233;dentaires en France. Cet amendement propose ainsi d&#8217;augmenter le pourcentage cible d&#8217;incorporation d&#8217;&#233;nergie renouvelable dans les essences &#224; 8,3% en 2019 et 8,9% en 2020.</p><p>Un biocarburant issu d&#8217;huile de palme, l&#8217;huile v&#233;g&#233;tale hydrotrait&#233;e (HVO) de type essence, a capt&#233; plus de 15% de la demande de biocarburants 1G dans l&#8217;objectif de 7,5% de la fili&#232;re essence en 2017, et ralenti le d&#233;veloppement des carburants &#224; l&#8217;&#233;thanol.</p><p>La hausse de la demande de biocarburants engendr&#233;e par cette mesure permettrait de freiner les HVO de type essence issus d&#8217;huile de palme. Les objectifs TGAP seraient alors remplis par du bio&#233;thanol, du fait de la croissance des carburants Super&#233;thanol-E85 et SP95-E10.</p><p>Une augmentation de la TGAP est n&#233;cessaire pour continuer &#224; inciter les distributeurs &#224; proposer davantage de Super&#233;thanol-E85 et de SP95-E10 qui sont plus &#233;conomiques pour les automobilistes que les essences SP95 et SP98.</p><p>Pour permettre aux distributeurs de carburants de satisfaire &#224; cette augmentation, il propose aussi de ne plus soumettre au plafond de 7% le bio&#233;thanol issu des r&#233;sidus des industries sucri&#232;res et amidonni&#232;res.&#160;</p><p>En effet, le bio&#233;thanol de r&#233;sidus issus des productions sucri&#232;res et amidonni&#232;res n&#8217;entre pas en concurrence alimentaire et n&#8217;est pas soumis au plafonnement de 7% applicable aux biocarburants de premi&#232;re g&#233;n&#233;ration dans la r&#232;glementation europ&#233;enne.</p><p>Une telle mesure favoriserait la bio&#233;conomie fran&#231;aise bas&#233;e sur des productions agricoles locales, dans une logique d&#8217;&#233;conomie circulaire.</p><p>&#160;</p>"
  },
  "representations": [
    {
      "nom": "PDF",
      "typeMime": {
        "type": "application",
        "subType": "PDF"
      },
      "statutRepresentation": {
        "verbatim": true,
        "canonique": true,
        "officielle": true,
        "transcription": false,
        "enregistrement": false
      },
      "contenu": {
        "documentURI": "/15/amendements/1255C/CION_FIN/CF1244.pdf"
      }
    }
  ],
  "sort": {
    "dateSaisie": "2018-11-08T10:09:33.000+01:00",
    "sortEnSeance": "Retiré"
  },
  "dateDepot": "2018-11-02T01:00:00.000+01:00",
  "dateDistribution": "2018-11-06T01:00:00.000+01:00",
  "article99": "0",
  "loiReference": {}
}