{
  "uid": "AMANR5L15SEA717460BTC1761P0D1N1174",
  "identifiant": {
    "legislature": "15",
    "numero": "1174",
    "numRect": "0",
    "saisine": {
      "texteLegislatifRef": "PRJLANR5L15BTC1761",
      "numeroPartiePLF": "0",
      "organeExamen": "PO717460",
      "mentionSecondeDeliberation": "0"
    }
  },
  "numeroLong": "1174",
  "etapeTexte": "Nouvelle Lecture",
  "triAmendement": "eaoaaaaaaaaaaaaaaaaaaaaaaaaaaaaaaaaaaaaaaaaaaaaaaacb",
  "cardinaliteAmdtMultiples": "1",
  "etat": "Discuté",
  "signataires": {
    "auteur": {
      "typeAuteur": "Depute",
      "acteurRef": "PA719138",
      "groupePolitiqueRef": "PO759900"
    },
    "cosignatairesRefs": [
      "PA336439",
      "PA331582",
      "PA336175",
      "PA720996",
      "PA719286",
      "PA608292",
      "PA719138",
      "PA942",
      "PA267042",
      "PA755549",
      "PA605518",
      "PA719146",
      "PA405480",
      "PA605694",
      "PA607619",
      "PA333421"
    ],
    "texteAffichable": "M.&#160;Castellani,  M.&#160;Acquaviva, M.&#160;Brial, M.&#160;Cl&#233;ment, M.&#160;Colombani, M.&#160;Charles&#160;de Courson, Mme&#160;Dubi&#233;, M.&#160;El Guerrab, M.&#160;Falorni, M.&#160;Favennec Becot, M.&#160;Fran&#231;ois-Michel&#160;Lambert, M.&#160;Molac, M.&#160;Pancher, Mme&#160;Pinel, M.&#160;Pupponi et M.&#160;Philippe&#160;Vigier"
  },
  "pointeurFragmentTexte": {
    "division": {
      "titre": "Article 27",
      "articleDesignationCourte": "ART. 27",
      "type": "ARTICLE",
      "avantAApres": "A",
      "divisionRattachee": "ARTICLE 27",
      "urlDivisionTexteVise": "/15/textes/1761.asp#D_Article_27"
    },
    "alinea": {
      "avantAApres": "Avant",
      "numero": "1",
      "alineaDesignation": "Avant l'alinéa 1"
    }
  },
  "corps": {
    "dispositif": "<p>I.&#160;&#8211;&#160;Avant l&#8217;alin&#233;a&#160;1, ins&#233;rer l&#8217;alin&#233;a suivant&#160;:</p><p style=\"text-align: justify;\">&#171;&#160;IA.&#160;&#8211;&#160;Au 3&#176;&#160;du&#160;II de l&#8217;article L.&#160;221&#8209;31&#160;du code mon&#233;taire et financier, les mots&#160;: &#171;&#160;ou avoir d&#233;tenu cette participation &#224; un moment quelconque au cours des cinq ann&#233;es pr&#233;c&#233;dant l&#8217;acquisition de ces titres dans le cadre du plan&#160;&#187; sont supprim&#233;s.&#160;&#187;</p><p style=\"text-align: justify;\">II.&#160;&#8211;&#160;Compl&#233;<i>t</i>er cet article par l&#8217;alin&#233;a suivant&#160;:</p><p style=\"text-align: justify;\">&#171;&#160;III.&#160;&#8211;&#160;La perte de recettes pour l&#8217;&#201;tat est compens&#233;e &#224; due concurrence par la cr&#233;ation d&#8217;une taxe additionnelle aux droits mentionn&#233;s aux articles 575 et 575 A du code g&#233;n&#233;ral des imp&#244;ts.&#160;&#187;</p>",
    "exposeSommaire": "<p>Amendement de repli.</p><p style=\"text-align: justify;\">Le pr&#233;sent amendement vise &#224; d&#233;velopper le financement des entreprises via le PEA-PME.</p><p style=\"text-align: justify;\">Le PEA permet d&#8217;acqu&#233;rir un portefeuille d&#8217;actions d&#8217;entreprises&#160;europ&#233;ennes tout en b&#233;n&#233;ficiant d&#8217;une exon&#233;ration d&#8217;imp&#244;t sur le revenu au bout de 8 ans. Le plafond des versements est actuellement de 150 000&#160;euros.</p><p style=\"text-align: justify;\">Le PEA-PME a, quant &#224; lui, &#233;t&#233; mis en place en 2014 pour soutenir le financement en fonds propres des PME et des ETI et offrir &#224; tous les fran&#231;ais un outil d&#8217;investisseur, qui leur permette de s&#8217;impliquer dans la vie &#233;conomique et financi&#232;re des entreprises. Il fonctionne comme le PEA mais avec un plafond de versements de 75 000&#160;euros.</p><p style=\"text-align: justify;\">Les r&#233;sultats sont malheureusement d&#233;cevants, le PEA-PME n&#8217;ayant pas suscit&#233; l&#8217;engouement des &#233;pargnants. Alors que l&#8217;objectif affich&#233; &#233;tait de collecter 1 &#224; 2 milliards d&#8217;euros d&#232;s la premi&#232;re ann&#233;e, c&#8217;est au deuxi&#232;me trimestre 2017 que les encours peinent &#224; d&#233;passer 1 milliard d&#8217;euros.</p><p style=\"text-align: justify;\">Plusieurs freins &#224; l&#8217;attrait du PEA-PME pourraient &#234;tre lev&#233;s pour d&#233;velopper cet outil de financement direct dans les entreprises.</p><p style=\"text-align: justify;\">Ainsi, le 3&#176; du II de l&#8217;article L 221&#8209;31 du code mon&#233;taire et financier pr&#233;voit que&#160;: &#171;&#160;Le titulaire du plan d&#8217;&#233;pargne en actions, son conjoint ou partenaire li&#233; par un pacte civil de solidarit&#233; et leurs ascendants et descendants ne doivent pas, pendant la dur&#233;e du plan, d&#233;tenir ensemble, directement ou indirectement, plus de 25&#160;% des droits dans les b&#233;n&#233;fices de soci&#233;t&#233;s dont les titres figurent au plan d&#8217;&#233;pargne en actions ou avoir d&#233;tenu cette participation &#224; un moment quelconque au cours des cinq ann&#233;es pr&#233;c&#233;dant l&#8217;acquisition de ces titres dans le cadre du plan. Le pourcentage des droits d&#233;tenus indirectement par ces personnes, par l&#8217;interm&#233;diaire de soci&#233;t&#233;s ou d&#8217;organismes interpos&#233;s et quel qu&#8217;en soit le nombre, s&#8217;appr&#233;cie en multipliant entre eux les taux de d&#233;tention successifs dans la cha&#238;ne de participations.&#160;&#187;</p><p style=\"text-align: justify;\">L&#8217;article L 221&#8209;32&#8209;3 pr&#233;voit que cette disposition est applicable au plan d&#8217;&#233;pargne en actions destin&#233; au financement des petites et moyennes entreprises et des entreprises de taille interm&#233;diaire.</p><p style=\"text-align: justify;\">Ces dispositions limitent les possibilit&#233;s d&#8217;investissement des entrepreneurs et favorisent l&#8217;investisseur passif, sans raison objective. Non seulement le titulaire du PEA-PME ne doit pas d&#233;tenir, directement ou indirectement, plus de 25&#160;% des droits de la soci&#233;t&#233; dans laquelle il souhaite investir, mais cette interdiction s&#8217;applique s&#8217;il a d&#233;tenu ces droits dans les cinq ann&#233;es pr&#233;c&#233;dentes. Cette interdiction est large puisqu&#8217;elle s&#8217;applique &#233;galement au conjoint, aux ascendants et descendants de l&#8217;entrepreneur.</p><p style=\"text-align: justify;\">A d&#233;faut de supprimer cette interdiction, le pr&#233;sent amendement propose de supprimer la seule interdiction en cas de d&#233;tention de 25&#160;% dans les 5 ann&#233;es pr&#233;c&#233;dant l&#8217;acquisition des titres.</p>"
  },
  "representations": [
    {
      "nom": "PDF",
      "typeMime": {
        "type": "application",
        "subType": "PDF"
      },
      "statutRepresentation": {
        "verbatim": true,
        "canonique": true,
        "officielle": true,
        "transcription": false,
        "enregistrement": false
      },
      "contenu": {
        "documentURI": "/15/amendements/1761/AN/1174.pdf"
      }
    }
  ],
  "seanceDiscussion": "RUANR5L15S2019IDS21553",
  "sort": {
    "dateSaisie": "2019-03-15T23:49:35.000+01:00",
    "sortEnSeance": "Non soutenu"
  },
  "dateDepot": "2019-03-11T01:00:00.000+01:00",
  "dateDistribution": "2019-03-12T01:00:00.000+01:00",
  "article99": "0",
  "loiReference": {}
}