{
  "uid": "AMANR5L15SEA717460BTC1237P0D1N879",
  "identifiant": {
    "legislature": "15",
    "numero": "879",
    "numRect": "0",
    "saisine": {
      "texteLegislatifRef": "PRJLANR5L15BTC1237",
      "numeroPartiePLF": "0",
      "organeExamen": "PO717460",
      "mentionSecondeDeliberation": "0"
    }
  },
  "numeroLong": "879",
  "etapeTexte": "1ère lecture (1ère assemblée saisie)",
  "triAmendement": "amaaaaaaaaaaaaaaaaaaaaaaaaaaaaaaaaaaaaaaaaaaaaaaaaaru",
  "cardinaliteAmdtMultiples": "1",
  "etat": "Discuté",
  "signataires": {
    "auteur": {
      "typeAuteur": "Depute",
      "acteurRef": "PA333421",
      "groupePolitiqueRef": "PO744425"
    },
    "cosignatairesRefs": [
      "PA712014",
      "PA267766",
      "PA333421",
      "PA608292",
      "PA719806",
      "PA266788",
      "PA702052"
    ],
    "texteAffichable": "M.&#160;Pancher,  Mme&#160;Auconie, M.&#160;Ledoux, Mme&#160;Dubi&#233;, M.&#160;Morel-&#192;-L&apos;Huissier, M.&#160;Guy&#160;Bricout et Mme&#160;Sage"
  },
  "pointeurFragmentTexte": {
    "division": {
      "titre": "Article 9",
      "articleDesignationCourte": "APRÈS ART. 9",
      "type": "ARTICLE",
      "avantAApres": "Apres",
      "divisionRattachee": "APRÈS L'ARTICLE 9, insérer l'article suivant:",
      "articleAdditionnel": "1",
      "urlDivisionTexteVise": "/15/textes/1237.asp#D_Article_9"
    }
  },
  "corps": {
    "dispositif": "<p style=\"text-align: justify;\">I.&#160;&#8211;&#160;Le premier alin&#233;a de l&#8217;article L.&#160;612&#8209;1 du code de commerce est ainsi r&#233;dig&#233;&#160;:</p><p style=\"text-align: justify;\">&#171;&#160;Les personnes morales de droit priv&#233; non commer&#231;antes ayant une activit&#233; &#233;conomique dont le montant hors taxes du chiffre d&#8217;affaires ou les ressources d&#233;passent le seuil fix&#233; par d&#233;cret en Conseil d&#8217;&#201;tat, doivent &#233;tablir chaque ann&#233;e un bilan, un compte de r&#233;sultat et une annexe. Les modalit&#233;s d&#8217;&#233;tablissement de ces documents sont pr&#233;cis&#233;es par d&#233;cret.&#160;&#187;</p><p style=\"text-align: justify;\">II.&#160;&#8211;&#160;Le premier alin&#233;a de l&#8217;article&#160;4&#8209;1 de la loi 87&#8209;571 du 23 juillet 1987 sur le d&#233;veloppement du m&#233;c&#233;nat est ainsi r&#233;dig&#233;&#160;:</p><p style=\"text-align: justify;\">&#171;&#160;Tout organisme b&#233;n&#233;ficiaire de dons de personnes physiques ou morales ouvrant droit, au b&#233;n&#233;fice des donateurs, &#224; un avantage fiscal doit assurer, dans des conditions d&#233;termin&#233;es par d&#233;cret en Conseil d&#8217;&#201;tat, la publicit&#233; par tous moyens et la certification de ses comptes annuels au-dessus d&#8217;un montant de dons de 75 000&#160;euros par an.&#160;&#187;</p>",
    "exposeSommaire": "<p style=\"text-align: justify;\">On estime aujourd&#8217;hui &#224; 1,3 million le nombre d&#8217;associations actives en France, employant pr&#232;s de 1,8 millions de salari&#233;s (5&#160;% des salari&#233;s fran&#231;ais) et 16 millions de b&#233;n&#233;voles.</p><p style=\"text-align: justify;\">Compte tenu de l&#8217;importance du secteur associatif dans notre &#233;conomie (70 mld&#160;&#8364; de budget cumul&#233; et 3,5&#160;% du PIB) de son mode de financement (43&#160;% d&#8217;origine publique) et des risques attach&#233;s, l&#8217;intervention d&#8217;un commissaire aux comptes, garantissant la transparence financi&#232;re, doit &#234;tre &#233;tendue.</p><p style=\"text-align: justify;\">La premi&#232;re disposition de cet amendement consiste &#224; abaisser le seuil d&#8217;intervention des commissaires aux comptes d&#232;s l&#8217;octroi de fonds publics de plus de 75&#160;000&#160;&#8364;.</p><p style=\"text-align: justify;\">La deuxi&#232;me disposition s&#8217;attache &#224; rassurer les donateurs pour les associations qui per&#231;oivent plus de 75&#160;000&#160;&#8364; de dons ouvrant droit &#224; avantage fiscal.</p><p style=\"text-align: justify;\">Enfin, les derni&#232;res dispositions conduisent &#224; simplifier, pour les associations ayant une activit&#233; &#233;conomique, le seuil de nomination et le fixer uniquement &#224; partir du total des ressources ou du chiffre d&#8217;affaires.</p>"
  },
  "representations": [
    {
      "nom": "PDF",
      "typeMime": {
        "type": "application",
        "subType": "PDF"
      },
      "statutRepresentation": {
        "verbatim": true,
        "canonique": true,
        "officielle": true,
        "transcription": false,
        "enregistrement": false
      },
      "contenu": {
        "documentURI": "/15/amendements/1237/AN/879.pdf"
      }
    }
  ],
  "seanceDiscussion": "RUANR5L15S2018IDS21251",
  "sort": {
    "dateSaisie": "2018-09-27T18:04:16.000+02:00",
    "sortEnSeance": "Rejeté"
  },
  "dateDepot": "2018-09-20T02:00:00.000+02:00",
  "dateDistribution": "2018-09-24T02:00:00.000+02:00",
  "article99": "0",
  "loiReference": {
    "codeLoi": "loi 87-571",
    "divisionCodeLoi": "4-1"
  }
}