{
  "uid": "AMANR5L15PO420120B2296P0D1N911",
  "identifiant": {
    "legislature": "15",
    "numero": "911",
    "numRect": "0",
    "saisine": {
      "texteLegislatifRef": "PRJLANR5L15B2296",
      "numeroPartiePLF": "0",
      "organeExamen": "PO420120",
      "mentionSecondeDeliberation": "0"
    }
  },
  "numeroLong": "AS911",
  "etapeTexte": "1ère lecture (1ère assemblée saisie)",
  "triAmendement": "ddaaaaaaaaaaaaaaaaaaaaaaaaaaaaaaaaaaaaaaaaaaaaaaaafd",
  "cardinaliteAmdtMultiples": "1",
  "etat": "Discuté",
  "signataires": {
    "auteur": {
      "typeAuteur": "Depute",
      "acteurRef": "PA720326",
      "groupePolitiqueRef": "PO730970"
    },
    "cosignatairesRefs": [
      "PA719918",
      "PA719504",
      "PA719488",
      "PA721742",
      "PA721924",
      "PA719874",
      "PA719044",
      "PA720326",
      "PA720976",
      "PA720704",
      "PA719210",
      "PA719640",
      "PA720728",
      "PA720598",
      "PA721976",
      "PA720002",
      "PA721530",
      "PA720256",
      "PA720746",
      "PA721608",
      "PA1276",
      "PA720924",
      "PA721734",
      "PA719558",
      "PA720968",
      "PA720162",
      "PA722162",
      "PA720764",
      "PA721996",
      "PA721836",
      "PA717151",
      "PA722374",
      "PA721182",
      "PA721418",
      "PA720652",
      "PA720092",
      "PA721984",
      "PA718978",
      "PA720178",
      "PA719942",
      "PA720772",
      "PA722284",
      "PA721234",
      "PA720334",
      "PA720720",
      "PA719266"
    ],
    "texteAffichable": "M.&#160;Hammouche,  Mme&#160;Elimas, Mme&#160;Benin, Mme&#160;de Vaucouleurs, M.&#160;Isaac-Sibille, M.&#160;Mignola, M.&#160;Balanant, Mme&#160;Bannier, M.&#160;Barrot, M.&#160;Baudu, M.&#160;Berta, M.&#160;Bolo, M.&#160;Bourlanges, M.&#160;Bru, M.&#160;Cubertafon, Mme&#160;de Sarnez, Mme&#160;Deprez-Audebert, M.&#160;Duverg&#233;, Mme&#160;El Ha&#239;ry, Mme&#160;Essayan, M.&#160;Fanget, Mme&#160;Florennes, M.&#160;Fuchs, M.&#160;Garcia, Mme&#160;Jacquier-Laforge, M.&#160;Joncour, M.&#160;Lagleize, M.&#160;Lain&#233;, M.&#160;Laqhila, Mme&#160;Lasserre-David, M.&#160;Latombe, M.&#160;Loiseau, Mme&#160;Luquet, M.&#160;Mathiasin, M.&#160;Mattei, Mme&#160;Mette, M.&#160;Michel-Kleisbauer, M.&#160;Millienne, M.&#160;Pahun, M.&#160;Fr&#233;d&#233;ric&#160;Petit, Mme&#160;Maud&#160;Petit, Mme&#160;Poueyto, M.&#160;Ramos, M.&#160;Turquois, Mme&#160;Vichnievsky et M.&#160;Waserman"
  },
  "pointeurFragmentTexte": {
    "division": {
      "titre": "Article 24",
      "articleDesignationCourte": "ART. 24",
      "type": "ARTICLE",
      "avantAApres": "A",
      "divisionRattachee": "ARTICLE 24",
      "urlDivisionTexteVise": "/15/textes/2296.asp#D_Article_24"
    },
    "alinea": {
      "avantAApres": "A",
      "numero": "2",
      "alineaDesignation": "Alinéa 2"
    }
  },
  "corps": {
    "dispositif": "<p style=\"text-align: justify;\">&#192; la deuxi&#232;me phrase de l&#8217;alin&#233;a&#160;2, apr&#232;s le mot&#160;:</p><p style=\"text-align: justify;\">&#171;&#160;sant&#233;&#160;&#187;</p><p style=\"text-align: justify;\">ins&#233;rer les mots&#160;:</p><p style=\"text-align: justify;\">&#171;&#160;de la population&#160;&#187;.</p>",
    "exposeSommaire": "<p>La territorialisation des politiques publiques est certes louable en ce sens qu&#8217;elle implique une politique adapt&#233;e aux sp&#233;cificit&#233;s des espaces identifi&#233;s. Mais elle ne peut se faire sans rapport avec les femmes et les hommes qui peuplent ces territoires et qui sont le c&#339;ur battant de nos politiques publiques.</p>"
  },
  "representations": [
    {
      "nom": "PDF",
      "typeMime": {
        "type": "application",
        "subType": "PDF"
      },
      "statutRepresentation": {
        "verbatim": true,
        "canonique": true,
        "officielle": true,
        "transcription": false,
        "enregistrement": false
      },
      "contenu": {
        "documentURI": "/15/amendements/2296/CION-SOC/AS911.pdf"
      }
    }
  ],
  "sort": {
    "dateSaisie": "2019-10-16T09:44:09.000+02:00",
    "sortEnSeance": "Adopté"
  },
  "dateDepot": "2019-10-11T02:00:00.000+02:00",
  "dateDistribution": "2019-10-15T02:00:00.000+02:00",
  "article99": "0",
  "loiReference": {
    "codeLoi": "2a2"
  }
}