{
  "uid": "AMANR5L15SEA717460BTC1767P0D1N858",
  "identifiant": {
    "legislature": "15",
    "numero": "858",
    "numRect": "0",
    "saisine": {
      "texteLegislatifRef": "PRJLANR5L15BTC1767",
      "numeroPartiePLF": "0",
      "organeExamen": "PO717460",
      "mentionSecondeDeliberation": "0"
    }
  },
  "numeroLong": "858",
  "etapeTexte": "1ère lecture (1ère assemblée saisie)",
  "triAmendement": "joaaaaaaaaaaaaaaaaaaaaaaaaaaaaaaaaaaaaaaaaaaaaaaaaas",
  "cardinaliteAmdtMultiples": "1",
  "etat": "Irrecevable",
  "signataires": {
    "auteur": {
      "typeAuteur": "Depute",
      "acteurRef": "PA609590",
      "groupePolitiqueRef": "PO758835"
    },
    "cosignatairesRefs": [
      "PA1592",
      "PA332614",
      "PA340343",
      "PA340357",
      "PA609590",
      "PA608172",
      "PA720988",
      "PA1809",
      "PA719930",
      "PA608011",
      "PA333818",
      "PA1198",
      "PA607553",
      "PA609332",
      "PA508",
      "PA608695",
      "PA1008",
      "PA333285",
      "PA643145",
      "PA642764",
      "PA267233",
      "PA429893",
      "PA335054",
      "PA335532",
      "PA337483",
      "PA610681",
      "PA342415",
      "PA605069",
      "PA608741"
    ],
    "texteAffichable": "Mme&#160;Rabault,  M.&#160;Aviragnet, Mme&#160;Bareigts, Mme&#160;Bi&#233;mouret, M.&#160;Vallaud, Mme&#160;Battistel, M.&#160;Bouillon, M.&#160;Jean-Louis&#160;Bricout, M.&#160;Carvounas, M.&#160;Alain&#160;David, Mme&#160;Laurence&#160;Dumont, M.&#160;Faure, M.&#160;Garot, M.&#160;David&#160;Habib, M.&#160;Hutin, M.&#160;Juanico, Mme&#160;Karamanli, M.&#160;J&#233;r&#244;me&#160;Lambert, M.&#160;Letchimy, Mme&#160;Manin, Mme&#160;Pau-Langevin, Mme&#160;Pires Beaune, M.&#160;Potier, M.&#160;Pueyo, M.&#160;Saulignac, Mme&#160;Tolmont, Mme&#160;Untermaier, Mme&#160;Vainqueur-Christophe et Mme&#160;Victory"
  },
  "pointeurFragmentTexte": {
    "division": {
      "titre": "Article 16",
      "articleDesignationCourte": "APRÈS ART. 16",
      "type": "ARTICLE",
      "avantAApres": "Apres",
      "divisionRattachee": "APRÈS L'ARTICLE 16, insérer l'article suivant:",
      "articleAdditionnel": "1",
      "urlDivisionTexteVise": "/15/textes/1767.asp#D_Article_16"
    }
  },
  "corps": {
    "dispositif": "<p>Le dernier alin&#233;a de l&#8217;article L162-1-7 du code de la s&#233;curit&#233; sociale est ainsi r&#233;dig&#233;&#160;:</p><p>&#171;&#160;Tout acte ou prestation inscrit fait l'objet d'un examen en vue d'une nouvelle hi&#233;rarchisation tous les cinq ans&#160;&#187;.</p>",
    "exposeSommaire": "<p style=\"text-align: justify;\">La liste des actes et prestations d&#233;finis par l&#8217;article L162&#8209;1&#8209;7 du code de la s&#233;curit&#233; sociale est compos&#233;e de trois nomenclatures&#160;:</p><ul style=\"text-align: justify;\"><li>la classification commune des actes m&#233;dicaux (CCAM) ;</li><li>la nomenclature g&#233;n&#233;rale des actes professionnels (NGAP) ;</li><li>la nomenclature des actes de biologie m&#233;dicale (NABM).</li></ul><p style=\"text-align: justify;\">Ces nomenclatures, qui permettent d&#8217;&#233;tablir les honoraires des actes r&#233;alis&#233;s par les professionnels de sant&#233;, apparaissent aujourd&#8217;hui inadapt&#233;es.</p><p style=\"text-align: justify;\">Aussi, il appara&#238;t n&#233;cessaire de revoir la grille de cotation de ces actes, de fa&#231;on &#224; mieux prendre en compte l&#8217;&#233;volution des pratiques m&#233;dicales.</p><p style=\"text-align: justify;\">Actuellement, seuls les actes ou prestations nouvellement inscrits doivent faire l&#8217;objet d&#8217;un examen en vue d&#8217;une nouvelle hi&#233;rarchisation dans les cinq ans &#224; compter de leur inscription.</p><p style=\"text-align: justify;\">Cet amendement propose d&#8217;&#233;tendre cette obligation afin que la hi&#233;rarchisation de l&#8217;ensemble des actes et prestations soit revue tous les 5 ans.</p>"
  },
  "representations": [
    {
      "nom": "PDF",
      "typeMime": {
        "type": "application",
        "subType": "PDF"
      },
      "statutRepresentation": {
        "verbatim": true,
        "canonique": true,
        "officielle": true,
        "transcription": false,
        "enregistrement": false
      },
      "contenu": {
        "documentURI": "/15/amendements/1767/AN/858.pdf"
      }
    }
  ],
  "dateDepot": "2019-03-15T01:00:00.000+01:00",
  "dateDistribution": "2019-03-18T01:00:00.000+01:00",
  "article99": "0",
  "loiReference": {
    "codeLoi": "c sécurité sociale",
    "divisionCodeLoi": "L162-1-7"
  }
}