{
  "uid": "AMANR5L15PO757134B1088P0D1N967",
  "identifiant": {
    "legislature": "15",
    "numero": "967",
    "numRect": "0",
    "saisine": {
      "texteLegislatifRef": "PRJLANR5L15B1088",
      "numeroPartiePLF": "0",
      "organeExamen": "PO757134",
      "mentionSecondeDeliberation": "0"
    }
  },
  "numeroLong": "967",
  "etapeTexte": "1ère lecture (1ère assemblée saisie)",
  "triAmendement": "jcaaaaaaaaaaaaaaaaaaaaaaaaaaaaaaaaaaaaaaaaaaaaaaaadc",
  "cardinaliteAmdtMultiples": "1",
  "etat": "Discuté",
  "signataires": {
    "auteur": {
      "typeAuteur": "Depute",
      "acteurRef": "PA718674",
      "groupePolitiqueRef": "PO730964"
    },
    "cosignatairesRefs": [
      "PA719092",
      "PA718756",
      "PA721876",
      "PA721792",
      "PA719024",
      "PA722300",
      "PA721844",
      "PA720854",
      "PA722292",
      "PA719972",
      "PA720170",
      "PA720038",
      "PA332614",
      "PA721434",
      "PA718768",
      "PA721784",
      "PA721568",
      "PA721384",
      "PA719480",
      "PA718902",
      "PA721860",
      "PA718674",
      "PA718876",
      "PA720576",
      "PA606639",
      "PA719330",
      "PA719118",
      "PA719952",
      "PA719890",
      "PA721352"
    ],
    "texteAffichable": "Mme&#160;Givernet,  M.&#160;Person, M.&#160;Blanchet, Mme&#160;Brulebois, Mme&#160;Cazarian, Mme&#160;Lardet, M.&#160;Vignal, Mme&#160;Grandjean, M.&#160;Besson-Moreau, Mme&#160;Tuffnell, M.&#160;Cesarini, M.&#160;C&#233;dric&#160;Roussel, Mme&#160;Guerel, Mme&#160;Valetta Ardisson, M.&#160;Rudigoz, Mme&#160;Fontenel-Personne, M.&#160;Morenas, Mme&#160;Khedher, M.&#160;Gaillard, M.&#160;Mis, Mme&#160;Piron, M.&#160;Bois, M.&#160;Test&#233;, Mme&#160;Bono-Vandorme, M.&#160;Cormier-Bouligeon, M.&#160;Gouttefarde, Mme&#160;Josso, Mme&#160;Gomez-Bassac, Mme&#160;Sarles et M.&#160;Juanico"
  },
  "pointeurFragmentTexte": {
    "division": {
      "titre": "Article 51",
      "articleDesignationCourte": "ART. 51",
      "type": "ARTICLE",
      "avantAApres": "A",
      "divisionRattachee": "ARTICLE 51",
      "urlDivisionTexteVise": "/15/textes/1088.asp#D_Article_51"
    },
    "alinea": {
      "numero": "9"
    }
  },
  "corps": {
    "dispositif": "<p style=\"text-align: justify;\">&#192;&#160;l&#8217;alin&#233;a&#160;9, apr&#232;s le mot&#160;:</p><p style=\"text-align: justify;\">&#171;&#160;autorit&#233;&#160;&#187;, </p><p style=\"text-align: justify;\">ins&#233;rer les mots&#160;:</p><p style=\"text-align: justify;\">&#171;&#160;administrative ind&#233;pendante&#160;&#187;.</p>",
    "exposeSommaire": "<p style=\"text-align: justify;\">Le pr&#233;sent amendement vise &#224; pr&#233;ciser que l&#8217;autorit&#233; mentionn&#233;e &#224; l&#8217;article&#160;34 de la loi n&#176; 2010&#8209;476 du 12 mai 2010 relative &#224; l&#8217;ouverture &#224; la concurrence et &#224; la r&#233;gulation du secteur des jeux d&#8217;argent et de hasard en ligne est une autorit&#233; administrative ind&#233;pendante, ce dans un souci de lisibilit&#233; et de compr&#233;hension du champ des ordonnances.</p><p style=\"text-align: justify;\">La r&#233;gulation des jeux en ligne est op&#233;r&#233;e depuis l&#8217;ouverture &#224; la concurrence de ce secteur par une autorit&#233; ind&#233;pendante. Cette ind&#233;pendance a permis une lutte efficace contre les activit&#233;s ill&#233;gales et &#233;tabli un traitement &#233;quitable entre les diff&#233;rents op&#233;rateurs.</p><p style=\"text-align: justify;\">L&#8217;Assembl&#233;e nationale a soulign&#233; dans deux rapports du Comit&#233; d&#8217;&#233;valuation et de contr&#244;le l&#8217;efficacit&#233; de cette institution.</p>"
  },
  "representations": [
    {
      "nom": "PDF",
      "typeMime": {
        "type": "application",
        "subType": "PDF"
      },
      "statutRepresentation": {
        "verbatim": true,
        "canonique": true,
        "officielle": true,
        "transcription": false,
        "enregistrement": false
      },
      "contenu": {
        "documentURI": "/15/amendements/1088/CSPACTE/967.pdf"
      }
    }
  ],
  "sort": {
    "dateSaisie": "2018-09-13T23:21:24.000+02:00",
    "sortEnSeance": "Retiré"
  },
  "dateDepot": "2018-08-31T02:00:00.000+02:00",
  "dateDistribution": "2018-09-11T02:00:00.000+02:00",
  "article99": "0",
  "loiReference": {}
}