{
  "uid": "AMANR5L15SEA717460BTC1974P0D1N1946",
  "identifiant": {
    "legislature": "15",
    "numero": "1946",
    "numRect": "0",
    "saisine": {
      "texteLegislatifRef": "PRJLANR5L15BTC1974",
      "numeroPartiePLF": "0",
      "organeExamen": "PO717460",
      "mentionSecondeDeliberation": "0"
    }
  },
  "numeroLong": "1946",
  "etapeTexte": "1ère lecture (2ème assemblée saisie)",
  "triAmendement": "adcaaaaaaaaaaaaaaaaaaaaaaaaaaaaaaaaaaaaaaaaaaaaaaabsvc",
  "cardinaliteAmdtMultiples": "1",
  "etat": "Discuté",
  "signataires": {
    "auteur": {
      "typeAuteur": "Depute",
      "acteurRef": "PA609245",
      "groupePolitiqueRef": "PO730934"
    },
    "cosignatairesRefs": [
      "PA605036",
      "PA767",
      "PA267318",
      "PA267794",
      "PA721054",
      "PA1630",
      "PA346054",
      "PA643134",
      "PA1695",
      "PA332523",
      "PA340853",
      "PA334654",
      "PA719946",
      "PA722390",
      "PA721070",
      "PA266774",
      "PA720684",
      "PA923",
      "PA721046",
      "PA718838",
      "PA345722",
      "PA718884",
      "PA721474",
      "PA746",
      "PA267735",
      "PA609245",
      "PA721636",
      "PA718780",
      "PA721506",
      "PA748954",
      "PA267289",
      "PA759192",
      "PA2155",
      "PA2492",
      "PA267324",
      "PA330008",
      "PA721286",
      "PA2796",
      "PA609726",
      "PA334149",
      "PA721314",
      "PA267527",
      "PA1029",
      "PA2529",
      "PA606712",
      "PA709315",
      "PA336316",
      "PA267204",
      "PA267200",
      "PA1498",
      "PA608016",
      "PA266776",
      "PA266793",
      "PA330240",
      "PA642847",
      "PA330788",
      "PA608826",
      "PA607090",
      "PA720644",
      "PA643089",
      "PA721410",
      "PA720630",
      "PA1327",
      "PA720210",
      "PA720386",
      "PA605991",
      "PA267378",
      "PA330684",
      "PA342935",
      "PA720586",
      "PA2377",
      "PA267260",
      "PA334843",
      "PA721126",
      "PA2792",
      "PA719318",
      "PA1874",
      "PA643103",
      "PA2086",
      "PA1012",
      "PA2960",
      "PA718850",
      "PA713448",
      "PA721678",
      "PA267450",
      "PA998",
      "PA330909",
      "PA719272",
      "PA718784",
      "PA856",
      "PA606098",
      "PA267429",
      "PA267901",
      "PA267785",
      "PA266808",
      "PA267440",
      "PA720100",
      "PA266797",
      "PA346218",
      "PA712015",
      "PA608416",
      "PA721816",
      "PA223837",
      "PA721968"
    ],
    "texteAffichable": "Mme&#160;Lacroute,  M.&#160;Sermier, M.&#160;Jacob, M.&#160;Abad, Mme&#160;Anthoine, M.&#160;Aubert, Mme&#160;Bassire, M.&#160;Bazin, Mme&#160;Bazin-Malgras, Mme&#160;Beauvais, Mme&#160;Bonnivard, M.&#160;Bony, M.&#160;Boucard, M.&#160;Bouchet, Mme&#160;Val&#233;rie&#160;Boyer, Mme&#160;Brenier, M.&#160;Breton, M.&#160;Brochand, M.&#160;Brun, M.&#160;Carrez, M.&#160;Cattin, M.&#160;Cherpion, M.&#160;Cinieri, M.&#160;Ciotti, M.&#160;Cordier, Mme&#160;Corneloup, M.&#160;Cornut-Gentille, Mme&#160;Dalloz, M.&#160;Dassault, M.&#160;de Ganay, M.&#160;de la Verpilli&#232;re, M.&#160;Deflesselles, M.&#160;R&#233;mi&#160;Delatte, M.&#160;Descoeur, M.&#160;Di Filippo, M.&#160;Diard, M.&#160;Dive, M.&#160;Door, Mme&#160;Marianne&#160;Dubois, Mme&#160;Duby-Muller, M.&#160;Pierre-Henri&#160;Dumont, M.&#160;Fasquelle, M.&#160;Ferrara, M.&#160;Forissier, M.&#160;Furst, M.&#160;Gaultier, Mme&#160;Genevard, M.&#160;Goasguen, M.&#160;Gosselin, M.&#160;Grelier, Mme&#160;Guion-Firmin, M.&#160;Herbillon, M.&#160;Hetzel, M.&#160;Huyghe, M.&#160;Kamardine, Mme&#160;Kuster, M.&#160;Larriv&#233;, M.&#160;Le Fur, Mme&#160;Le Grip, M.&#160;Leclerc, Mme&#160;Levy, M.&#160;Lorion, Mme&#160;Louwagie, M.&#160;Lurton, M.&#160;Emmanuel&#160;Maquet, M.&#160;Marleix, M.&#160;Marlin, M.&#160;Masson, M.&#160;Menuel, Mme&#160;Meunier, M.&#160;Minot, M.&#160;Nury, M.&#160;Parigi, M.&#160;Pauget, M.&#160;Peltier, M.&#160;Perrut, Mme&#160;Poletti, M.&#160;Poudroux, M.&#160;Pradi&#233;, M.&#160;Quentin, M.&#160;Ramadier, Mme&#160;Ramassamy, M.&#160;Reda, M.&#160;Reiss, M.&#160;Reitzer, M.&#160;Reyn&#232;s, M.&#160;Rolland, M.&#160;Saddier, M.&#160;Savignat, M.&#160;Schellenberger, M.&#160;Straumann, Mme&#160;Tabarot, M.&#160;Taugourdeau, M.&#160;Teissier, M.&#160;Thi&#233;riot, Mme&#160;Trastour-Isnart, Mme&#160;Valentin, M.&#160;Vatin, M.&#160;Verch&#232;re, M.&#160;Viala, M.&#160;Vialay, M.&#160;Jean-Pierre&#160;Vigier, M.&#160;Viry et M.&#160;Woerth"
  },
  "pointeurFragmentTexte": {
    "division": {
      "titre": "Article PREMIER",
      "articleDesignationCourte": "ART. PREMIER",
      "type": "ARTICLE",
      "avantAApres": "A",
      "divisionRattachee": "ARTICLE PREMIER",
      "urlDivisionTexteVise": "/15/textes/1974.asp#D_Article_1er"
    },
    "alinea": {
      "avantAApres": "Apres",
      "numero": "17"
    }
  },
  "corps": {
    "dispositif": "<p>Apr&#232;s l&#8217;alin&#233;a&#160;17, ins&#233;rer l&#8217;alin&#233;a suivant&#160;:</p><p style=\"text-align: justify;\">&#171;&#160;La communaut&#233; de communes ou la commune mentionn&#233;e au V du m&#234;me article L.&#160;5210&#8209;1&#8209;1 sur le territoire de laquelle la r&#233;gion est devenue l&#8217;autorit&#233; organisatrice de la mobilit&#233; en application du II du pr&#233;sent article, peut &#233;galement d&#233;lib&#233;rer pour demander &#224; cette derni&#232;re le transfert de la comp&#233;tence d&#8217;organisation de la mobilit&#233;. Le conseil r&#233;gional dispose d&#8217;un d&#233;lai de <span  data-cid=\"11\"   data-time=\"1559142955791\"></span><span  data-cid=\"6\"   data-time=\"1559142953575\">trois</span> mois, &#224; compter de la notification &#224; son pr&#233;sident de la d&#233;lib&#233;ration de l&#8217;organe d&#233;lib&#233;rant ou du conseil municipal, pour se prononcer sur un tel transfert. &#192; d&#233;faut de d&#233;lib&#233;ration du conseil r&#233;gional dans ce d&#233;lai, sa d&#233;cision est r&#233;put&#233;e d&#233;favorable.&#160;&#187;</p>",
    "exposeSommaire": "<p>Le S&#233;nat avait introduit un troisi&#232;me cas de r&#233;versibilit&#233; de la comp&#233;tence transport, permettant aux communaut&#233;s de communes de demander &#224; la r&#233;gion devenue AOM par substitution de r&#233;cup&#233;rer cette comp&#233;tence. Ce dispositif a &#233;t&#233; supprim&#233; lors de l&#8217;examen en commission.</p><p style=\"text-align: justify;\">Pourtant, cette hypoth&#232;se est souhaitable car elle r&#233;pond &#224; la logique de r&#233;partition des comp&#233;tences entre AOM locales et AOM r&#233;gionales. Ce n&#8217;est en effet que par d&#233;faut que la r&#233;gion est devenue AOM locale et il est tout &#224; fait envisageable que les communaut&#233;s de communes qui n&#8217;&#233;taient pas pr&#234;tes &#224; exercer la comp&#233;tence transports au moment du transfert se soient organis&#233;es pour pouvoir le faire ult&#233;rieurement.</p><p style=\"text-align: justify;\">Un tel m&#233;canisme permettrait de rapprocher la gouvernance des transports des r&#233;alit&#233;s du terrain&#160;de garantir une meilleure ad&#233;quation&#160;de l&#8217;offre avec les besoins locaux.</p>"
  },
  "representations": [
    {
      "nom": "PDF",
      "typeMime": {
        "type": "application",
        "subType": "PDF"
      },
      "statutRepresentation": {
        "verbatim": true,
        "canonique": true,
        "officielle": true,
        "transcription": false,
        "enregistrement": false
      },
      "contenu": {
        "documentURI": "/15/amendements/1974/AN/1946.pdf"
      }
    }
  ],
  "seanceDiscussion": "RUANR5L15S2019IDS21674",
  "sort": {
    "dateSaisie": "2019-06-04T00:44:02.000+02:00",
    "sortEnSeance": "Rejeté"
  },
  "dateDepot": "2019-05-29T02:00:00.000+02:00",
  "dateDistribution": "2019-06-03T02:00:00.000+02:00",
  "article99": "0",
  "loiReference": {}
}