{
  "uid": "AMANR5L15PO419610B0627P0D1N1232",
  "identifiant": {
    "legislature": "15",
    "numero": "1232",
    "numRect": "0",
    "saisine": {
      "texteLegislatifRef": "PRJLANR5L15B0627",
      "numeroPartiePLF": "0",
      "organeExamen": "PO419610",
      "mentionSecondeDeliberation": "0"
    }
  },
  "numeroLong": "CE1232",
  "etapeTexte": "1ère lecture (1ère assemblée saisie)",
  "triAmendement": "aazryo",
  "cardinaliteAmdtMultiples": "1",
  "etat": "Discuté",
  "signataires": {
    "auteur": {
      "typeAuteur": "Depute",
      "acteurRef": "PA718768",
      "groupePolitiqueRef": "PO730964"
    },
    "cosignatairesRefs": [
      "PA718682",
      "PA718768"
    ],
    "texteAffichable": "Mme&#160;Valetta Ardisson et M.&#160;Trompille"
  },
  "pointeurFragmentTexte": {
    "division": {
      "titre": "Article 14",
      "articleDesignationCourte": "APRÈS ART. 14",
      "type": "ARTICLE",
      "avantAApres": "Apres",
      "divisionRattachee": "APRÈS L'ARTICLE 14, insérer l'article suivant:",
      "articleAdditionnel": "1",
      "urlDivisionTexteVise": "/15/textes/0627.asp#D_Article_14"
    }
  },
  "corps": {
    "dispositif": "<p style=\"text-align: justify;\">Il est proc&#233;d&#233; &#224; la mise en place d'une zone de 100 m&#232;tres sans traitement de pesticides de synth&#232;se contenant des mati&#232;res actives class&#233;es de 1 &#224; 3 dans la cat&#233;gorie des canc&#233;rog&#232;nes, mutag&#232;nes et reprotoxiques (CMR), ou des perturbateurs endocriniens au sens du sc&#233;nario n&#176;&#160;3 figurant dans l&#8217;&#233;tude d&#8217;impact de l&#8217;Union&#160;europ&#233;enne, a&#768; proximit&#233; de tous les lieux de vie&#160;&#8211;&#160;a&#768; partir des limites de propri&#233;t&#233;&#160;&#8211;&#160;ou des lieux publics.</p>",
    "exposeSommaire": "<p style=\"text-align: justify;\">Le rapport de l&#8217;Institut national de la sant&#233; et de la recherche m&#233;dicale (INSERM) paru en 2013 sur pesticides et sante&#769; atteste de l&#8217;impact des pesticides sur la sante&#769; des utilisateurs mais aussi des riverains de zones cultiv&#233;es.</p><p style=\"text-align: justify;\">En outre, les milliers de t&#233;moignages recueillis par certaines ONG attestent de ces impacts. Il est aussi a&#768; noter que si Sante&#769; publique France a souhait&#233; mener des &#233;tudes sur l&#8217;exposition des riverains, c&#8217;est parce qu&#8217;il y avait la&#768; un sujet de pr&#233;occupation majeure.</p><p style=\"text-align: justify;\">Il ne faut donc pas attendre les r&#233;sultats de ces &#233;tudes en cours pour prendre des mesures de pr&#233;caution qui s&#8217;av&#232;rent n&#233;cessaires et qui sont recommand&#233;es dans le cadre du R&#232;glement pesticides n&#176;&#160;1107/2009 ainsi que par la Directive cadre pour l&#8217;utilisation des pesticides.</p><p style=\"text-align: justify;\">Les mesures prises actuellement sont insuffisantes car elles ne concernent que des &#233;tablissements accueillant un public vuln&#233;rable comme les &#233;coles ou h&#244;pitaux et ne prot&#232;gent pas les jeunes enfants et les femmes enceintes a&#768; leur domicile ou dans d&#8217;autres lieux publics. De plus elles ne renferment que des mesures de limitation de l&#8217;usage des pesticides et pas d&#8217;interdiction.</p>"
  },
  "representations": [
    {
      "nom": "PDF",
      "typeMime": {
        "type": "application",
        "subType": "PDF"
      },
      "statutRepresentation": {
        "verbatim": true,
        "canonique": true,
        "officielle": true,
        "transcription": false,
        "enregistrement": false
      },
      "contenu": {
        "documentURI": "/15/amendements/0627/CION-ECO/CE1232.pdf"
      }
    }
  ],
  "sort": {
    "dateSaisie": "2018-04-20T12:17:02.000+02:00",
    "sortEnSeance": "Non soutenu"
  },
  "dateDepot": "2018-04-13T02:00:00.000+02:00",
  "dateDistribution": "2018-04-17T02:00:00.000+02:00",
  "article99": "0",
  "loiReference": {
    "codeLoi": "zz"
  }
}