{
  "uid": "AMANR5L15PO420120B0586P0D1N5",
  "identifiant": {
    "legislature": "15",
    "numero": "5",
    "numRect": "0",
    "saisine": {
      "texteLegislatifRef": "PIONANR5L15B0586",
      "numeroPartiePLF": "0",
      "organeExamen": "PO420120",
      "mentionSecondeDeliberation": "0"
    }
  },
  "numeroLong": "AS5",
  "etapeTexte": "1ère lecture (1ère assemblée saisie)",
  "triAmendement": "c",
  "cardinaliteAmdtMultiples": "1",
  "etat": "Discuté",
  "signataires": {
    "auteur": {
      "typeAuteur": "Depute",
      "acteurRef": "PA721070",
      "groupePolitiqueRef": "PO730934"
    },
    "cosignatairesRefs": [
      "PA721070"
    ],
    "texteAffichable": "Mme&#160;Ramassamy"
  },
  "pointeurFragmentTexte": {
    "division": {
      "titre": "Article 3",
      "articleDesignationCourte": "ART. 3",
      "type": "ARTICLE",
      "avantAApres": "A",
      "divisionRattachee": "ARTICLE 3",
      "urlDivisionTexteVise": "/15/textes/0586.asp#D_Article_3"
    },
    "alinea": {
      "avantAApres": "A",
      "numero": "6",
      "alineaDesignation": "Alinéa 6"
    }
  },
  "corps": {
    "dispositif": "<p style=\"text-align: justify;\">Supprimer l&#8217;alin&#233;a&#160;6.</p>",
    "exposeSommaire": "<p style=\"text-align: justify;\">Cet amendement vise &#224; supprimer l&#8217;alin&#233;a&#160;6, car le taux de 25&#160;% est, pour l&#8217;heure, suffisant. Le taux de 50&#160;% demand&#233; par cette proposition de loi serait trop &#233;lev&#233; pour les entreprises.</p>"
  },
  "representations": [
    {
      "nom": "PDF",
      "typeMime": {
        "type": "application",
        "subType": "PDF"
      },
      "statutRepresentation": {
        "verbatim": true,
        "canonique": true,
        "officielle": true,
        "transcription": false,
        "enregistrement": false
      },
      "contenu": {
        "documentURI": "/15/amendements/0586/CION-SOC/AS5.pdf"
      }
    }
  ],
  "sort": {
    "dateSaisie": "2018-02-21T11:58:13.000+01:00",
    "sortEnSeance": "Retiré"
  },
  "dateDepot": "2018-02-17T01:00:00.000+01:00",
  "dateDistribution": "2018-02-19T01:00:00.000+01:00",
  "article99": "0",
  "loiReference": {}
}