{
  "uid": "AMANR5L15SEA717460B0235P2D1N1803",
  "identifiant": {
    "legislature": "15",
    "numero": "1803",
    "numRect": "1",
    "saisine": {
      "texteLegislatifRef": "PRJLANR5L15B0235",
      "numeroPartiePLF": "2",
      "organeExamen": "PO717460",
      "mentionSecondeDeliberation": "0"
    }
  },
  "numeroLong": "II-1803 (Rect)",
  "etapeTexte": "1ère lecture (1ère assemblée saisie)",
  "triAmendement": "zo",
  "cardinaliteAmdtMultiples": "1",
  "etat": "Discuté",
  "signataires": {
    "auteur": {
      "typeAuteur": "Depute",
      "acteurRef": "PA267336",
      "groupePolitiqueRef": "PO730964"
    },
    "cosignatairesRefs": [
      "PA719592",
      "PA267336"
    ],
    "texteAffichable": "M.&#160;Giraud et M.&#160;Simian"
  },
  "pointeurFragmentTexte": {
    "division": {
      "titre": "Article 45",
      "articleDesignationCourte": "APRÈS ART. 45",
      "type": "ARTICLE",
      "avantAApres": "Apres",
      "divisionRattachee": "APRÈS L'ARTICLE 45, insérer l'article suivant:",
      "articleAdditionnel": "1",
      "urlDivisionTexteVise": "/15/textes/0235C.asp#D_Article_45"
    }
  },
  "corps": {
    "dispositif": "<p style=\"text-align: justify;\">&#160;Le code g&#233;n&#233;ral des collectivit&#233;s territoriales est ainsi modifi&#233;&#160;:</p><p style=\"text-align: justify;\">1&#176; La neuvi&#232;me ligne du tableau du troisi&#232;me alin&#233;a de l&#8217;article L.&#160;2333&#8209;30 est ainsi modifi&#233;e&#160;:</p><p style=\"text-align: justify;\">&#171;&#160;1&#176;&#160;&#192; la deuxi&#232;me colonne, le nombre&#160;: &#171;&#160;0,20&#160;&#187; est remplac&#233; par les mots&#160;: &#171;&#160;1&#160;% du prix de la nuit&#233;e hors taxes &#160;dans la limite du tarif applicable pour la cat&#233;gorie d&#8217;h&#233;bergement la plus &#233;lev&#233;e&#160;&#187;&#160;;</p><p style=\"text-align: justify;\">&#171;&#160;2&#176;&#160;&#192; la troisi&#232;me colonne, le nombre&#160;: &#171;&#160;0,75&#160;&#187; est remplac&#233; par les mots&#160;: &#171;&#160;5&#160;% du prix de la nuit&#233;e hors taxes dans la limite du tarif applicable pour la cat&#233;gorie d&#8217;h&#233;bergement la plus &#233;lev&#233;e&#160;&#187;.</p><p style=\"text-align: justify;\">2&#176;&#160;La neuvi&#232;me ligne du tableau du troisi&#232;me alin&#233;a de l&#8217;article L.&#160;2333&#8209;41 est ainsi modifi&#233;e&#160;:</p><p style=\"text-align: justify;\">&#171;&#160;1&#176;&#160;&#192; la deuxi&#232;me colonne, le nombre&#160;: &#171;&#160;0,20&#160;&#187; est remplac&#233; par les mots&#160;: &#171;&#160;1&#160;% du prix de la nuit&#233;e hors taxes &#160;dans la limite du tarif applicable pour la cat&#233;gorie d&#8217;h&#233;bergement la plus &#233;lev&#233;e&#160;&#187;&#160;;</p><p style=\"text-align: justify;\">&#171;&#160;2&#176;&#160;&#192; la troisi&#232;me colonne, le nombre&#160;: &#171;&#160;0,75&#160;&#187; est remplac&#233; par les mots&#160;: &#171;&#160;5&#160;% du prix de la nuit&#233;e hors taxes dans la limite du tarif applicable pour la cat&#233;gorie d&#8217;h&#233;bergement la plus &#233;lev&#233;e&#160;&#187;.</p><p style=\"text-align: justify;\">&#160;</p>",
    "exposeSommaire": "<p style=\"text-align: justify;\">Le calcul de la taxe de s&#233;jour, au r&#233;el ou forfaitaire, tel qu&#8217;il existe actuellement est bas&#233; sur le syst&#232;me de classement d&#233;fini par l&#8217;article L311&#8209;6 du code du tourisme. Un prix forfaitaire est appliqu&#233; par nuit&#233;e en fonction du classement de l&#8217;&#233;tablissement d&#8217;h&#233;bergement concern&#233;. Ce classement, facultatif, est une source de notori&#233;t&#233; importante pour les &#233;tablissements h&#244;teliers.</p><p style=\"text-align: justify;\">Or, l&#8217;arriv&#233;e de nouvelles formes d&#8217;h&#233;bergement non commercial, dont la location est pourtant soumise &#224; l&#8217;acquittement de la taxe de s&#233;jour, rend ce mode de calcul caduque. Les propri&#233;taires d&#8217;appartements propos&#233;s &#224; la location comme meubl&#233;s de tourisme ne font que rarement la d&#233;marche de demander la classification de leur bien. Le forfait applicable en mati&#232;re de taxe de s&#233;jour&#160;&#8211;&#160;le plus faible&#160;&#8211;&#160;est alors compl&#232;tement d&#233;corr&#233;l&#233; de la valeur r&#233;elle du bien et de la prestation d&#8217;h&#233;bergement fournie. Cela repr&#233;sente une perte massive de revenus pour les collectivit&#233;s locales, qui voient ainsi leurs revenus issus de la taxe de s&#233;jour fortement baisser. C&#8217;est &#233;galement une source de concurrence fauss&#233;e entre &#233;tablissements d&#8217;h&#233;bergement&#160;: &#224; Bordeaux par exemple, un propri&#233;taire de meubl&#233; de tourisme qui n&#8217;a pas effectu&#233; la d&#233;marche de classement est cens&#233; pr&#233;lever une taxe de s&#233;jour de 0,35&#160;&#8364; par nuit&#233;e, contre 1,10&#160;&#8364; pour un h&#244;tel class&#233; &#171;&#160;trois &#233;toiles&#160;&#187;.</p><p style=\"text-align: justify;\">Le pr&#233;sent amendement instaure une nouvelle formule de calcul de la taxe de s&#233;jour, au r&#233;el ou forfaitaire, pour les meubl&#233;s de tourisme et h&#233;bergements assimil&#233;s non-class&#233;s ou en attente de classement&#160;: Il se base sur un pourcentage du prix de vente de la nuit&#233;e compris entre 1&#160;% et 5&#160;% &#8211; le montant exact devant &#234;tre d&#233;termin&#233; par d&#233;lib&#233;ration du Conseil municipal. Un plafond, correspondant au forfait maximum applicable &#224; un &#233;tablissement class&#233; dans la commune, est pr&#233;vu afin d&#8217;&#233;viter l&#8217;application d&#8217;un montant de taxe de s&#233;jour trop important.</p>"
  },
  "representations": [
    {
      "nom": "PDF",
      "typeMime": {
        "type": "application",
        "subType": "PDF"
      },
      "statutRepresentation": {
        "verbatim": true,
        "canonique": true,
        "officielle": true,
        "transcription": false,
        "enregistrement": false
      },
      "contenu": {
        "documentURI": "/15/amendements/0235C/AN/1803.pdf"
      }
    }
  ],
  "seanceDiscussion": "RUANR5L15S2018IDS20765",
  "sort": {
    "dateSaisie": "2017-11-17T10:12:34.000+01:00",
    "sortEnSeance": "Retiré"
  },
  "dateDepot": "2017-11-13T01:00:00.000+01:00",
  "dateDistribution": "2017-11-15T01:00:00.000+01:00",
  "article99": "0",
  "loiReference": {
    "codeLoi": "travail",
    "divisionCodeLoi": "L2333-30"
  }
}