{
  "uid": "AMANR5L15PO419604B1881P0D1N72",
  "identifiant": {
    "legislature": "15",
    "numero": "72",
    "numRect": "0",
    "saisine": {
      "texteLegislatifRef": "PRJLANR5L15B1881",
      "numeroPartiePLF": "0",
      "organeExamen": "PO419604",
      "mentionSecondeDeliberation": "0"
    }
  },
  "numeroLong": "AC72",
  "etapeTexte": "1ère lecture (1ère assemblée saisie)",
  "triAmendement": "aoaaaaaaaaaaaaaaaaaaaaaaaaaaaaaaaaaaaaaaaaaaaaaaaafm",
  "cardinaliteAmdtMultiples": "1",
  "etat": "Discuté",
  "signataires": {
    "auteur": {
      "typeAuteur": "Depute",
      "acteurRef": "PA330008",
      "groupePolitiqueRef": "PO730934"
    },
    "cosignatairesRefs": [
      "PA330008"
    ],
    "texteAffichable": "M.&#160;Breton"
  },
  "pointeurFragmentTexte": {
    "division": {
      "titre": "Article PREMIER",
      "articleDesignationCourte": "ART. PREMIER",
      "type": "ARTICLE",
      "avantAApres": "A",
      "divisionRattachee": "ARTICLE PREMIER",
      "urlDivisionTexteVise": "/15/textes/1881.asp#D_Article_1er"
    },
    "alinea": {
      "numero": "2"
    }
  },
  "corps": {
    "dispositif": "<p style=\"text-align: justify;\">Supprimer l&#8217;alin&#233;a&#160;2.</p>",
    "exposeSommaire": "<p style=\"text-align: justify;\">La souscription nationale en vue de la restauration de la cath&#233;drale Notre-Dame se suffit &#224; elle-m&#234;me.</p>"
  },
  "representations": [
    {
      "nom": "PDF",
      "typeMime": {
        "type": "application",
        "subType": "PDF"
      },
      "statutRepresentation": {
        "verbatim": true,
        "canonique": true,
        "officielle": true,
        "transcription": false,
        "enregistrement": false
      },
      "contenu": {
        "documentURI": "/15/amendements/1881/CION-CEDU/AC72.pdf"
      }
    }
  ],
  "sort": {
    "dateSaisie": "2019-05-02T11:06:29.000+02:00",
    "sortEnSeance": "Rejeté"
  },
  "dateDepot": "2019-04-26T02:00:00.000+02:00",
  "dateDistribution": "2019-05-02T02:00:00.000+02:00",
  "article99": "0",
  "loiReference": {}
}