{
  "uid": "AMANR5L15SEA717460BTC0971P0D1N2969",
  "identifiant": {
    "legislature": "15",
    "numero": "2969",
    "numRect": "0",
    "saisine": {
      "texteLegislatifRef": "PRJLANR5L15BTC0971",
      "numeroPartiePLF": "0",
      "organeExamen": "PO717460",
      "mentionSecondeDeliberation": "0"
    }
  },
  "numeroLong": "2969",
  "etapeTexte": "1ère lecture (1ère assemblée saisie)",
  "triAmendement": "itvo",
  "cardinaliteAmdtMultiples": "1",
  "etat": "Discuté",
  "signataires": {
    "auteur": {
      "typeAuteur": "Depute",
      "acteurRef": "PA642695",
      "groupePolitiqueRef": "PO730964"
    },
    "cosignatairesRefs": [
      "PA642695",
      "PA721458"
    ],
    "texteAffichable": "M.&#160;Bothorel et M.&#160;Roseren"
  },
  "pointeurFragmentTexte": {
    "division": {
      "titre": "Article 62 ter",
      "articleDesignationCourte": "APRÈS ART. 62 TER",
      "type": "ARTICLE",
      "avantAApres": "Apres",
      "divisionRattachee": "APRÈS L'ARTICLE 62 TER, insérer l'article suivant:",
      "articleAdditionnel": "1",
      "urlDivisionTexteVise": "/15/textes/0971.asp#D_Article_62_ter"
    }
  },
  "corps": {
    "dispositif": "<p style=\"text-align: justify;\">L&#8217;article L.&#160;122&#8209;11 du code de l&#8217;urbanisme est compl&#233;t&#233; par un 4&#176;&#160;ainsi r&#233;dig&#233;&#160;:</p><p style=\"text-align: justify;\">&#171;&#160;4&#176;&#160;Le d&#233;ploiement de r&#233;seaux de communications &#233;lectroniques, ainsi que la construction de leurs locaux et installations techniques. L&#8217;autorisation est d&#233;livr&#233;e par l&#8217;autorit&#233; administrative comp&#233;tente de l&#8217;&#201;tat apr&#232;s avis de l&#8217;Autorit&#233; de r&#233;gulation des communications &#233;lectroniques et des postes.&#160;&#187;</p>",
    "exposeSommaire": "<p style=\"text-align: justify;\">Les d&#233;bats de la loi &#171;&#160;Montagne 2&#160;&#187; ont bien montr&#233; que les habitants des zones de montagne appelaient de leurs voeux la compl&#232;te couverture de leurs lieux de vie, afin de lutter contre la fracture num&#233;rique, et ce le plus rapidement possible. Toutefois, l&#8217;obligation de construire en continuit&#233; de l&#8217;urbanisation restreint la possibilit&#233; d&#8217;implanter des sites mobiles dans les zones rurales et de montagne qui sont caract&#233;ris&#233;es par un habitat dispers&#233; et isol&#233;, et qui sont prot&#233;g&#233;es par la loi.</p><p style=\"text-align: justify;\">Le pr&#233;sent amendement vise &#224; cr&#233;er une d&#233;rogation au principe d&#8217;urbanisme en continuit&#233; qui pr&#233;vaut dans les espaces n&#233;cessaires au maintien et au d&#233;veloppement des activit&#233;s agricoles, pastorales et foresti&#232;res. L&#8217;autorisation de construire sera toujours requise, et sera d&#233;livr&#233;e apr&#232;s avis de l&#8217;ARCEP. C&#8217;est un important facteur de simplification et d&#8217;acc&#233;l&#233;ration des d&#233;ploiements.</p>"
  },
  "representations": [
    {
      "nom": "PDF",
      "typeMime": {
        "type": "application",
        "subType": "PDF"
      },
      "statutRepresentation": {
        "verbatim": true,
        "canonique": true,
        "officielle": true,
        "transcription": false,
        "enregistrement": false
      },
      "contenu": {
        "documentURI": "/15/amendements/0971/AN/2969.pdf"
      }
    }
  ],
  "seanceDiscussion": "RUANR5L15S2018IDS21139",
  "sort": {
    "dateSaisie": "2018-06-09T02:29:44.000+02:00",
    "sortEnSeance": "Retiré"
  },
  "dateDepot": "2018-05-26T02:00:00.000+02:00",
  "dateDistribution": "2018-06-01T02:00:00.000+02:00",
  "article99": "0",
  "loiReference": {
    "codeLoi": "c urbanisme",
    "divisionCodeLoi": "L122-11"
  }
}