{
  "uid": "AMANR5L15SEA717460BTC1177P0D1N280",
  "identifiant": {
    "legislature": "15",
    "numero": "280",
    "numRect": "0",
    "saisine": {
      "texteLegislatifRef": "PRJLANR5L15BTC1177",
      "numeroPartiePLF": "0",
      "organeExamen": "PO717460",
      "mentionSecondeDeliberation": "0"
    }
  },
  "numeroLong": "280",
  "etapeTexte": "Nouvelle Lecture",
  "triAmendement": "kw",
  "cardinaliteAmdtMultiples": "1",
  "etat": "Retiré",
  "signataires": {
    "auteur": {
      "typeAuteur": "Depute",
      "acteurRef": "PA718780",
      "groupePolitiqueRef": "PO730934"
    },
    "cosignatairesRefs": [
      "PA718780"
    ],
    "texteAffichable": "Mme&#160;Trastour-Isnart"
  },
  "pointeurFragmentTexte": {
    "division": {
      "titre": "Article 8",
      "articleDesignationCourte": "ART. 8",
      "type": "ARTICLE",
      "avantAApres": "A",
      "divisionRattachee": "ARTICLE 8",
      "urlDivisionTexteVise": "/15/textes/1177.asp#D_Article_8"
    },
    "alinea": {
      "numero": "51"
    }
  },
  "corps": {
    "dispositif": "<p style=\"text-align: justify;\">Substituer &#224; l&#8217;alin&#233;a&#160;51 les deux alin&#233;as suivants&#160;:</p><p style=\"text-align: justify;\">&#171;&#160;VIII.&#160;&#8211;&#160;L&#8217;article L.&#160;6222&#8209;27 du code du travail est ainsi r&#233;dig&#233;&#160;:</p><p style=\"text-align: justify;\">&#171;&#160;<i>Art. L. 6222-27</i>. &#8211; Sous r&#233;serve de dispositions contractuelles plus favorables, l&#8217;apprenti per&#231;oit un salaire d&#233;termin&#233; en pourcentage du salaire minimum de croissance et dont le montant varie selon que l&#8217;apprenti est mineur ou majeur et de sa progression dans le ou les cycles de formation faisant l&#8217;objet d&#8217;apprentissage, sur la base d&#8217;un bar&#232;me national, commun et unique&#160;&#187;.</p>",
    "exposeSommaire": "<p style=\"text-align: justify;\">Le pr&#233;sent amendement propose que la r&#233;mun&#233;ration de l&#8217;apprenti, d&#8217;une part demeure d&#233;connect&#233;e des grilles de salaires d&#233;partementales mais bas&#233;e sur un bar&#232;me national, commun et unique et d&#8217;autre part soit fix&#233;e en pourcentage du SMIC en fonction du cycle de formation. Pour ce qui est de l&#8217;&#226;ge, il convient de distinguer selon que l&#8217;apprenti est mineur ou majeur.&#160;</p>"
  },
  "representations": [
    {
      "nom": "PDF",
      "typeMime": {
        "type": "application",
        "subType": "PDF"
      },
      "statutRepresentation": {
        "verbatim": true,
        "canonique": true,
        "officielle": true,
        "transcription": false,
        "enregistrement": false
      },
      "contenu": {
        "documentURI": "/15/amendements/1177/AN/280.pdf"
      }
    }
  ],
  "dateDepot": "2018-07-20T02:00:00.000+02:00",
  "dateDistribution": "2018-07-21T02:00:00.000+02:00",
  "article99": "0",
  "loiReference": {}
}