{
  "uid": "AMANR5L15PO59051B1503P0D1N259",
  "identifiant": {
    "legislature": "15",
    "numero": "259",
    "numRect": "0",
    "saisine": {
      "texteLegislatifRef": "PRJLANR5L15B1503",
      "numeroPartiePLF": "0",
      "organeExamen": "PO59051",
      "mentionSecondeDeliberation": "0"
    }
  },
  "numeroLong": "CL259",
  "etapeTexte": "Nouvelle Lecture",
  "triAmendement": "bicaaaaaaaaaaaaaaaaaaaaaaaaaaaaaaaaaaaaaaaaaaaaaaam",
  "cardinaliteAmdtMultiples": "1",
  "etat": "Discuté",
  "signataires": {
    "auteur": {
      "typeAuteur": "Depute",
      "acteurRef": "PA720430",
      "groupePolitiqueRef": "PO730958"
    },
    "cosignatairesRefs": [
      "PA720846",
      "PA719676",
      "PA721210",
      "PA720892",
      "PA721226",
      "PA2150",
      "PA720286",
      "PA720430",
      "PA720422",
      "PA718860",
      "PA721960",
      "PA718868",
      "PA722142",
      "PA588884",
      "PA721202",
      "PA719578",
      "PA721062"
    ],
    "texteAffichable": "M.&#160;Bernalicis,  Mme&#160;Autain, M.&#160;Coquerel, M.&#160;Corbi&#232;re, Mme&#160;Fiat, M.&#160;Lachaud, M.&#160;Larive, M.&#160;M&#233;lenchon, Mme&#160;Obono, Mme&#160;Panot, M.&#160;Prud&apos;homme, M.&#160;Quatennens, M.&#160;Ratenon, Mme&#160;Ressiguier, Mme&#160;Rubin, M.&#160;Ruffin et Mme&#160;Taurine"
  },
  "pointeurFragmentTexte": {
    "division": {
      "titre": "Article 18",
      "articleDesignationCourte": "ART. 18",
      "type": "ARTICLE",
      "avantAApres": "A",
      "divisionRattachee": "ARTICLE 18",
      "urlDivisionTexteVise": "/15/textes/1503.asp#D_Article_18"
    },
    "alinea": {
      "numero": "8"
    }
  },
  "corps": {
    "dispositif": "<p style=\"text-align: justify;\">&#192; l&#8217;alin&#233;a&#160;8, apr&#232;s le&#160;1&#176; du&#160;III, ins&#233;rer les trois alin&#233;as suivants&#160;:</p><p style=\"text-align: justify;\">&#171;&#160;1&#176;&#160;<i>bis</i>&#160;Le m&#234;me alin&#233;a est compl&#233;t&#233; par une phrase ainsi r&#233;dig&#233;e&#160;: &#171;&#160;Ces m&#233;diations familiales, ainsi que celles non ordonn&#233;es par le juge, sont gratuites, dans les conditions d&#233;finies &#224; l&#8217;alin&#233;a suivant.&#160;&#187;&#160;;</p><p style=\"text-align: justify;\">&#171;&#160;1&#176;&#160;<i>ter</i>&#160;Apr&#232;s ledit alin&#233;a, il est ins&#233;r&#233; un alin&#233;a ainsi r&#233;dig&#233;&#160;:</p><p style=\"text-align: justify;\">&#171;&#160;&#171;&#160;En application de l&#8217;article&#160;37&#8209;1 de la Constitution et pour une dur&#233;e maximale de trois ans, le ministre de la justice peut exp&#233;rimenter, dans les d&#233;partements et r&#233;gions volontaires, pour un maximum de deux r&#233;gions et de six d&#233;partements, la mise en place d&#8217;une gratuit&#233; de la m&#233;diation familiale par un service public d&#233;di&#233; &#224; partir des associations de m&#233;diation existantes et selon un processus d&#8217;agr&#233;ment d&#233;fini par d&#233;cret en Conseil d&#8217;&#201;tat. Ces exp&#233;rimentations donnent lieu &#224; un rapport permettant d&#8217;appr&#233;cier l&#8217;urgence et l&#8217;opportunit&#233; de g&#233;n&#233;raliser une telle gratuit&#233; des m&#233;diation familiales par un service public d&#233;di&#233;.&#160;&#187;&#160;;&#160;&#187;.</p>",
    "exposeSommaire": "<p style=\"text-align: justify;\">Par cet amendement d&#8217;appel, nous proposons que les m&#233;diations familiales qui permettent un r&#232;glement plus apais&#233;, conforme &#224; l&#8217;int&#233;r&#234;t sup&#233;rieur de l&#8217;enfant et &#224; la bonne r&#233;solution des conflits familiaux, soient gratuites.</p><p style=\"text-align: justify;\">Dans un esprit constructif, nous proposons ainsi l&#8217;exp&#233;rimentation d&#8217;un tel dispositif, pour une dur&#233;e maximale de 3 ans, et dans les d&#233;partements et r&#233;gions volontaires, ce par l&#8217;interm&#233;diaire d&#8217;un service public de la m&#233;diation m&#233;diation familiale qui serait mis en oeuvre de mani&#232;re ad hoc dans ce cadre.</p><p style=\"text-align: justify;\">Ceci permettra notamment d&#8217;appr&#233;cier l'efficacit&#233; d&#8217;une augmentation de la possibilit&#233; financi&#232;re d&#8217;acc&#233;der &#224; ce type de mesures de justice horizontale, et non verticale comme peut l&#8217;&#234;tre le recours &#224; un juge. Leur caract&#232;re pacificateur sur la r&#233;solution apais&#233;e du litige et dans l&#8217;int&#233;r&#234;t sup&#233;rieur de l&#8217;enfant doit ainsi pouvoir &#234;tre &#233;valu&#233; pour envisager une &#233;ventuelle g&#233;n&#233;ralisation ult&#233;rieure.</p><p style=\"text-align: justify;\">En effet, tel que le rappelle le rapport Juton de 2014 (&#8220;M&#233;diation familiale et contrats de co-parentalit&#233;), la m&#233;diation familiale permet une d&#233;conflictualisation des s&#233;parations et dans la majorit&#233; des cas l&#8217;apaisement du conflit&#8221; http://www.mediation-familiale.org/images/fichiers/mf-presse/rapport_mediation_familiale_et_contrats_de_co-parentalite.pdf).</p>"
  },
  "representations": [
    {
      "nom": "PDF",
      "typeMime": {
        "type": "application",
        "subType": "PDF"
      },
      "statutRepresentation": {
        "verbatim": true,
        "canonique": true,
        "officielle": true,
        "transcription": false,
        "enregistrement": false
      },
      "contenu": {
        "documentURI": "/15/amendements/1503/CION_LOIS/CL259.pdf"
      }
    }
  ],
  "sort": {
    "dateSaisie": "2018-12-19T17:09:15.000+01:00",
    "sortEnSeance": "Rejeté"
  },
  "dateDepot": "2018-12-17T01:00:00.000+01:00",
  "dateDistribution": "2018-12-18T01:00:00.000+01:00",
  "article99": "0",
  "loiReference": {}
}