{
  "uid": "AMANR5L15PO59051B0675P0D1N14",
  "identifiant": {
    "legislature": "15",
    "numero": "14",
    "numRect": "0",
    "saisine": {
      "texteLegislatifRef": "PIONANR5L15B0675",
      "numeroPartiePLF": "0",
      "organeExamen": "PO59051",
      "mentionSecondeDeliberation": "0"
    }
  },
  "numeroLong": "CL14",
  "etapeTexte": "1ère lecture (1ère assemblée saisie)",
  "triAmendement": "xd",
  "cardinaliteAmdtMultiples": "1",
  "etat": "A discuter",
  "signataires": {
    "auteur": {
      "typeAuteur": "Depute",
      "acteurRef": "PA722142",
      "groupePolitiqueRef": "PO730958"
    },
    "cosignatairesRefs": [
      "PA721202",
      "PA719676",
      "PA720892",
      "PA718860",
      "PA721210",
      "PA720846",
      "PA588884",
      "PA720286",
      "PA721960",
      "PA718868",
      "PA719578",
      "PA722142",
      "PA721226",
      "PA2150",
      "PA720422",
      "PA721062",
      "PA720430"
    ],
    "texteAffichable": "M.&#160;Ruffin,  Mme&#160;Autain, M.&#160;Bernalicis, M.&#160;Coquerel, M.&#160;Corbi&#232;re, Mme&#160;Fiat, M.&#160;Lachaud, M.&#160;Larive, M.&#160;M&#233;lenchon, Mme&#160;Obono, Mme&#160;Panot, M.&#160;Prud&apos;homme, M.&#160;Quatennens, M.&#160;Ratenon, Mme&#160;Ressiguier, Mme&#160;Rubin et Mme&#160;Taurine"
  },
  "pointeurFragmentTexte": {
    "division": {
      "titre": "Article PREMIER",
      "articleDesignationCourte": "ART. PREMIER",
      "type": "ARTICLE",
      "avantAApres": "A",
      "divisionRattachee": "ARTICLE PREMIER",
      "urlDivisionTexteVise": "/15/textes/0675.asp#D_Article_1er"
    },
    "alinea": {
      "avantAApres": "A",
      "numero": "34",
      "alineaDesignation": "Alinéa 34"
    }
  },
  "corps": {
    "dispositif": "<p style=\"text-align: justify;\">Compl&#233;ter l&#8217;alin&#233;a&#160;34 par les mots&#160;:</p><p style=\"text-align: justify;\">&#171;&#160;ainsi que pour la lutte contre la fraude et l&#8217;&#233;vasion fiscale&#160;&#187;.</p>",
    "exposeSommaire": "<p style=\"line-height: 1.2; text-align: justify;\">Par cet amendement, nous souhaitons pr&#233;ciser les diff&#233;rents int&#233;r&#234;ts publics l&#233;gitimes pour lesquels la d&#233;rogation au droit des affaires est possible. A cet effet, pour que le texte soit le plus protecteur et pr&#233;cis pour les lanceurs et lanceuses d&#8217;alerte, nous proposons d&#8217;y rajouter explicitement :</p><p style=\"line-height: 1.2; text-align: justify;\">- la lutte contre la fraude et l&#8217;&#233;vasion fiscales.</p><p style=\"text-align: justify;\">&#160;</p><p style=\"text-align: justify;\">En effet, le projet de loi du Gouvernement est particuli&#232;rement flou et limit&#233;, puisqu&#8217;il mentionne seulement : &#171; <i>la protection d&#8217;un int&#233;r&#234;t l&#233;gitime reconnu par le droit de l&#8217;Union ou le droit national, et notamment pour la protection de l&#8217;ordre public, de la s&#233;curit&#233; publique et de la sant&#233; publique.</i> &#187;&#8230;</p><p style=\"text-align: justify;\">La notion d&#8217;ordre public est surtout particuli&#232;rement (et aussi volontairement &#8211; au d&#233;triment de l&#8217;Etat de droit, ainsi que des droits et libert&#233;s des individus -) floue. Les grands professeurs de droit, &#224; l&#8217;instar de Philippe Malaurie, constatant le caract&#232;re g&#233;n&#233;ral et balai de la notion d&#8217;ordre public le d&#233;finissent notamment comme &#171; <i>le bon fonctionnement des institutions indispensables &#224; la collectivit&#233; </i>&#187;. Ce qui concr&#232;tement veut dire tout et n&#8217;importe quoi.</p><p style=\"text-align: justify;\">Pour &#233;viter une incertitude juridique qui pourrait dissuader les lanceurs d&#8217;alertes de bonne foi et surtout l&#233;gitimes quand un int&#233;r&#234;t public est menac&#233;, nous proposons de pr&#233;ciser explicitement que les d&#233;rogations &#224; la protection des affaires concernent &#171; un int&#233;r&#234;t l&#233;gitime &#187; notamment pour :</p><p style=\"line-height: 1.2; text-align: justify;\">- la lutte contre la fraude et l&#8217;&#233;vasion fiscales (qui a &#233;t&#233; reconnue comme un objectif &#224; valeur constitutionnelle, voir DC n&#176; 2015-481 QPC du 17 septembre 2015 du Conseil constitutionnel). Ceci aurait notamment permis aux lanceurs d&#8217;alerte, ex-employ&#233;s du cabinet PWC, Antoine Deltour et Rapha&#235;l Halet, qui avaient d&#233;nonc&#233; l&#8217;aide &#224; l&#8217;&#233;vasion fiscale de multinationales au Luxembourg de ne pas &#234;tre inqui&#233;t&#233;s.</p>"
  },
  "representations": [
    {
      "nom": "PDF",
      "typeMime": {
        "type": "application",
        "subType": "PDF"
      },
      "statutRepresentation": {
        "verbatim": true,
        "canonique": true,
        "officielle": true,
        "transcription": false,
        "enregistrement": false
      },
      "contenu": {
        "documentURI": "/15/amendements/0675/CION_LOIS/CL14.pdf"
      }
    }
  ],
  "dateDepot": "2018-03-16T01:00:00.000+01:00",
  "dateDistribution": "2018-03-19T01:00:00.000+01:00",
  "article99": "0",
  "loiReference": {
    "codeLoi": "2"
  }
}