{
  "uid": "AMANR5L15PO420120B0904P0D1N1240",
  "identifiant": {
    "legislature": "15",
    "numero": "1240",
    "numRect": "0",
    "saisine": {
      "texteLegislatifRef": "PRJLANR5L15B0904",
      "numeroPartiePLF": "0",
      "organeExamen": "PO420120",
      "mentionSecondeDeliberation": "0"
    }
  },
  "numeroLong": "AS1240",
  "etapeTexte": "1ère lecture (1ère assemblée saisie)",
  "triAmendement": "q",
  "cardinaliteAmdtMultiples": "1",
  "etat": "Discuté",
  "signataires": {
    "auteur": {
      "typeAuteur": "Depute",
      "acteurRef": "PA721860",
      "groupePolitiqueRef": "PO730964"
    },
    "cosignatairesRefs": [
      "PA721860"
    ],
    "texteAffichable": "M.&#160;Cesarini"
  },
  "pointeurFragmentTexte": {
    "division": {
      "titre": "Article 18",
      "articleDesignationCourte": "ART. 18",
      "type": "ARTICLE",
      "avantAApres": "A",
      "divisionRattachee": "ARTICLE 18",
      "urlDivisionTexteVise": "/15/textes/0904.asp#D_Article_18"
    },
    "alinea": {
      "avantAApres": "A",
      "numero": "15",
      "alineaDesignation": "Alinéa 15"
    }
  },
  "corps": {
    "dispositif": "<p style=\"text-align: justify;\">R&#233;diger ainsi l&#8217;alin&#233;a&#160;15&#160;:</p><p style=\"text-align: justify;\">&#171;&#160;5&#176; 0,08&#160;% au titre du d&#233;veloppement des formations professionnalisantes mentionn&#233;es &#224; l&#8217;article L.&#160;6133&#8209;3, pour les employeurs de 11 salari&#233;s et plus.&#160;&#187;</p>",
    "exposeSommaire": "<p style=\"text-align: justify;\">L&#8217;article&#160;18 du projet de loi pr&#233;voit d&#8217;assujettir l&#8217;ensemble des employeurs du spectacle &#224; la contribution vers&#233;e au titre des formations professionnalisantes mentionn&#233;es &#224; l&#8217;article L6133&#8209;3 du code du travail. Les entreprises employant 10 salari&#233;s et moins ne pourront fl&#233;cher les sommes vers les &#233;tablissements &#233;ligibles en raison de la modicit&#233; de celle-ci. Afin de se conformer au droit commun, il est propos&#233; de r&#233;server cette contribution aux seules entreprises de 11 salari&#233;s et plus. L&#8217;amendement respecte l&#8217;article&#160;40 de la constitution car il tient simplement la r&#233;partition des contributions (-0,08&#160;% sur une et +0,08&#160;% sur une autre)</p>"
  },
  "representations": [
    {
      "nom": "PDF",
      "typeMime": {
        "type": "application",
        "subType": "PDF"
      },
      "statutRepresentation": {
        "verbatim": true,
        "canonique": true,
        "officielle": true,
        "transcription": false,
        "enregistrement": false
      },
      "contenu": {
        "documentURI": "/15/amendements/0904/CION-SOC/AS1240.pdf"
      }
    }
  ],
  "sort": {
    "dateSaisie": "2018-05-31T17:11:27.000+02:00",
    "sortEnSeance": "Non soutenu"
  },
  "dateDepot": "2018-05-25T02:00:00.000+02:00",
  "dateDistribution": "2018-05-29T02:00:00.000+02:00",
  "article99": "0",
  "loiReference": {}
}