{
  "uid": "AMANR5L15SEA717460B2272P1D1N1616",
  "identifiant": {
    "legislature": "15",
    "numero": "1616",
    "numRect": "0",
    "saisine": {
      "texteLegislatifRef": "PRJLANR5L15B2272",
      "numeroPartiePLF": "1",
      "organeExamen": "PO717460",
      "mentionSecondeDeliberation": "0"
    }
  },
  "numeroLong": "I-1616",
  "etapeTexte": "1ère lecture (1ère assemblée saisie)",
  "triAmendement": "daaaaaaaaaaaaaaaaaaaaaaaaaaaaaaaaaaaaaaaaaaaaaaaaaaboe",
  "cardinaliteAmdtMultiples": "1",
  "etat": "Discuté",
  "signataires": {
    "auteur": {
      "typeAuteur": "Depute",
      "acteurRef": "PA609590",
      "groupePolitiqueRef": "PO758835"
    },
    "cosignatairesRefs": [
      "PA609590"
    ],
    "texteAffichable": "Mme&#160;Rabault"
  },
  "pointeurFragmentTexte": {
    "division": {
      "titre": "Article 13",
      "articleDesignationCourte": "APRÈS ART. 13",
      "type": "ARTICLE",
      "avantAApres": "Apres",
      "divisionRattachee": "APRÈS L'ARTICLE 13, insérer l'article suivant:",
      "articleAdditionnel": "1",
      "urlDivisionTexteVise": "/15/textes/2272A.asp#D_Article_13"
    }
  },
  "corps": {
    "dispositif": "<p style=\"text-align: justify;\">I.&#160;&#8211;&#160;L&#8217;article&#160;39&#160;<i>decies</i>&#160;du code g&#233;n&#233;ral des imp&#244;ts est ainsi modifi&#233;&#160;:</p><p style=\"text-align: justify;\">1&#176;&#160;Le I est ainsi modifi&#233;&#160;:</p><p style=\"text-align: justify;\"><i>a)</i> Au premier alin&#233;a, les mots&#160;: &#171;&#160;15 avril 2015 et jusqu&#8217;au 14 avril 2017&#160;&#187; sont remplac&#233;s par les mots&#160;: &#171;&#160;1<sup>er</sup> janvier 2020 et jusqu&#8217;au 31 d&#233;cembre 2022&#160;&#187;&#160;;</p><p style=\"text-align: justify;\"><i>b)</i> &#192; la deuxi&#232;me phrase du 6&#176;&#160;, la date&#160;: &#171;&#160;14 avril 2017&#160;&#187; est remplac&#233;e par la date&#160;: &#171;&#160;31 d&#233;cembre 2022&#160;&#187;&#160;;</p><p style=\"text-align: justify;\"><i>c)</i> &#192; la derni&#232;re phrase du 7&#176;&#160;, les mots&#160;: &#171;&#160;1<sup>er</sup> janvier 2016 et jusqu&#8217;au 14 avril 2017&#160;&#187; sont remplac&#233;s par les mots&#160;: &#171;&#160;1<sup>er</sup> janvier 2020 et jusqu&#8217;au 31 d&#233;cembre 2022&#160;&#187; et la date&#160;: &#171;&#160;15 avril 2017&#160;&#187; est remplac&#233;e par la date&#160;: &#171;&#160;31 d&#233;cembre 2022&#160;&#187;&#160;;</p><p style=\"text-align: justify;\"><i>d)</i> &#192; la fin de la premi&#232;re phrase du 9&#176;&#160;, les mots&#160;: &#171;&#160;12 avril 2016 et jusqu&#8217;au 14 avril 2017&#160;&#187; sont remplac&#233;s par les mots&#160;: &#171;&#160;1<sup>er</sup> janvier 2020 et jusqu&#8217;au 31 d&#233;cembre 2022&#160;&#187;&#160;;</p><p style=\"text-align: justify;\"><i>e)</i> Au onzi&#232;me alin&#233;a, la date&#160;: &#171;&#160;15 avril 2017&#160;&#187; est remplac&#233;e par la date &#171;&#160;31 d&#233;cembre 2022&#160;&#187;&#160;;</p><p style=\"text-align: justify;\"><i>f)</i> Les deux premi&#232;res phrases du douzi&#232;me alin&#233;a sont remplac&#233;es par une phrase ainsi r&#233;dig&#233;e&#160;: &#171;&#160;&#171;&#160;L&#8217;entreprise qui prend en location un bien neuf mentionn&#233; au premier alin&#233;a du pr&#233;sent article dans les conditions pr&#233;vues au&#160;1 de l&#8217;article L.&#160;313&#8209;7 du code mon&#233;taire et financier en application d&#8217;un contrat de cr&#233;dit-bail ou dans le cadre d&#8217;un contrat de location avec option d&#8217;achat, conclu &#224; compter du 1<sup>er</sup> janvier 2020 et jusqu&#8217;au 30 d&#233;cembre 2022, peut d&#233;duire une somme &#233;gale &#224;&#160;40&#160;% de la valeur d&#8217;origine du bien hors frais financiers, au moment de la signature du contrat.&#160;&#187;</p><p style=\"text-align: justify;\">2&#176;&#160;Au premier alin&#233;a du II, les mots&#160;: &#171;&#160;15 octobre 2015 au 14 avril 2017&#160;&#187; sont remplac&#233;s par les mots&#160;: &#171;&#160;1<sup>er</sup> janvier 2020 et jusqu&#8217;au 30 d&#233;cembre 2022&#160;&#187;.&#160;</p><p style=\"text-align: justify;\">II.&#160;&#8211;&#160;La perte de recettes pour l&#8217;&#201;tat est compens&#233;e &#224; due concurrence par la cr&#233;ation d&#8217;une taxe additionnelle aux droits mentionn&#233;s aux articles 575 et 575 A du code g&#233;n&#233;ral des imp&#244;ts.&#160;</p>",
    "exposeSommaire": "<p style=\"text-align: justify;\">Cet amendement des d&#233;put&#233;s socialistes et apparent&#233;s propose de renouveler le dispositif de suramortissement exceptionnel sur les investissements productifs qui a exist&#233; entre 2015 et 2017 pour 3 ans &#224; compter du 1<sup>er</sup> janvier 2020 et jusqu&#8217;au 31 d&#233;cembre 2022, afin de donner une impulsion &#224; l&#8217;ensemble de l&#8217;investissement productif public et priv&#233; en France.</p><p style=\"text-align: justify;\">Au cours du quinquennat pr&#233;c&#233;dent, un suramortissement exceptionnel de 40&#160;% a &#233;t&#233; mis en place dans le cadre de la loi n&#176;&#160;2015&#8209;990 du 6 ao&#251;t 2015 pour la croissance, l&#8217;activit&#233; et l&#8217;&#233;galit&#233; des chances &#233;conomiques.</p><p style=\"text-align: justify;\">Ce suramortissement permet &#224; une entreprise qui r&#233;alise un investissement productif &#233;ligible (par exemple, un nouvel &#233;quipement industriel), de b&#233;n&#233;ficier d&#8217;un avantage fiscal exceptionnel qui permet de d&#233;duire de son r&#233;sultat imposable&#160;40&#160;% du prix de revient de ce bien.</p><p style=\"text-align: justify;\">Cette mesure, qui a pris fin au 14 avril 2017, s&#8217;est av&#233;r&#233;e pleinement efficace puisque l&#8217;investissement des entreprises a augment&#233; de 15 milliards d&#8217;euros entre 2015 et 2016 et de 29&#160;milliards d&#8217;euros entre 2016 et 2017.</p><p style=\"text-align: justify;\">Le co&#251;t budg&#233;taire est &#233;valu&#233; entre 500 millions d&#8217;euros et 800 millions d&#8217;euros par an.</p>"
  },
  "representations": [
    {
      "nom": "PDF",
      "typeMime": {
        "type": "application",
        "subType": "PDF"
      },
      "statutRepresentation": {
        "verbatim": true,
        "canonique": true,
        "officielle": true,
        "transcription": false,
        "enregistrement": false
      },
      "contenu": {
        "documentURI": "/15/amendements/2272A/AN/1616.pdf"
      }
    }
  ],
  "seanceDiscussion": "RUANR5L15S2020IDS21871",
  "sort": {
    "dateSaisie": "2019-10-18T22:46:05.000+02:00",
    "sortEnSeance": "Rejeté"
  },
  "dateDepot": "2019-10-10T02:00:00.000+02:00",
  "dateDistribution": "2019-10-16T02:00:00.000+02:00",
  "article99": "0",
  "loiReference": {
    "codeLoi": "CGI",
    "divisionCodeLoi": "39 decies"
  }
}