{
  "uid": "AMANR5L15SEA717460BTC1019P0D1N2192",
  "identifiant": {
    "legislature": "15",
    "numero": "2192",
    "numRect": "0",
    "saisine": {
      "texteLegislatifRef": "PRJLANR5L15BTC1019",
      "numeroPartiePLF": "0",
      "organeExamen": "PO717460",
      "mentionSecondeDeliberation": "0"
    }
  },
  "numeroLong": "2192",
  "etapeTexte": "1ère lecture (1ère assemblée saisie)",
  "triAmendement": "hu",
  "cardinaliteAmdtMultiples": "1",
  "etat": "Discuté",
  "signataires": {
    "auteur": {
      "typeAuteur": "Depute",
      "acteurRef": "PA718884",
      "groupePolitiqueRef": "PO730934"
    },
    "cosignatairesRefs": [
      "PA1327",
      "PA718884",
      "PA643134"
    ],
    "texteAffichable": "Mme&#160;Bazin-Malgras,  Mme&#160;Valentin et M.&#160;Forissier"
  },
  "pointeurFragmentTexte": {
    "division": {
      "titre": "Article 10",
      "articleDesignationCourte": "ART. 10",
      "type": "ARTICLE",
      "avantAApres": "A",
      "divisionRattachee": "ARTICLE 10",
      "urlDivisionTexteVise": "/15/textes/1019.asp#D_Article_10"
    },
    "alinea": {
      "numero": "4"
    }
  },
  "corps": {
    "dispositif": "<p style=\"text-align: justify;\">&#192; la premi&#232;re phrase de l'alin&#233;a 4, apr&#232;s le mot : </p><p style=\"text-align: justify;\">&#171;&#160;&#233;tudiants&#160;&#187;,</p><p style=\"text-align: justify;\">ins&#233;rer les mots&#160;:</p><p style=\"text-align: justify;\">&#171;&#160;et des enseignants en charge de l&#8217;orientation&#160;&#187;.</p>",
    "exposeSommaire": "<p style=\"text-align: justify;\">Compte tenu notamment de leurs comp&#233;tences &#233;conomiques et de formation, les r&#233;gions apparaissent les mieux plac&#233;es pour mettre en &#339;uvre de v&#233;ritables politiques d&#8217;orientation et pour les &#233;tablir avec les entreprises, qui, par construction, ont une connaissance fine de l&#8217;exercice des diff&#233;rents m&#233;tiers. Aussi, dans un souci de synergie avec les acteurs &#233;conomiques, le pr&#233;sent amendement pr&#233;voit que la r&#233;gion exerce sa comp&#233;tence d&#8217;organisation des actions d&#8217;information sur les m&#233;tiers et les formations en lien avec les entreprises de son territoire.</p><p style=\"text-align: justify;\">Il pr&#233;cise &#233;galement, dans le silence du projet de loi sur ce point, que la comp&#233;tence pr&#233;cit&#233;e exerc&#233;e en direction des &#233;l&#232;ves et des &#233;tudiants est &#233;galement &#233;tendue aux enseignants en charge de l&#8217;orientation des &#233;l&#232;ves, notamment les professeurs principaux.</p>"
  },
  "representations": [
    {
      "nom": "PDF",
      "typeMime": {
        "type": "application",
        "subType": "PDF"
      },
      "statutRepresentation": {
        "verbatim": true,
        "canonique": true,
        "officielle": true,
        "transcription": false,
        "enregistrement": false
      },
      "contenu": {
        "documentURI": "/15/amendements/1019/AN/2192.pdf"
      }
    }
  ],
  "seanceDiscussion": "RUANR5L15S2018IDS21103",
  "sort": {
    "dateSaisie": "2018-06-14T22:28:12.000+02:00",
    "sortEnSeance": "Non soutenu"
  },
  "dateDepot": "2018-06-05T02:00:00.000+02:00",
  "dateDistribution": "2018-06-11T02:00:00.000+02:00",
  "article99": "0",
  "loiReference": {}
}