{
  "uid": "AMANR5L15SEA717460B2272P2D1N805",
  "identifiant": {
    "legislature": "15",
    "numero": "805",
    "numRect": "0",
    "saisine": {
      "texteLegislatifRef": "PRJLANR5L15B2272",
      "numeroPartiePLF": "2",
      "organeExamen": "PO717460",
      "mentionSecondeDeliberation": "0"
    }
  },
  "numeroLong": "II-805",
  "etapeTexte": "1ère lecture (1ère assemblée saisie)",
  "triAmendement": "bagaaaaaaaaaaaaaaaaaaaaaaaaaaaaaaaaaaaaaaaaaaaaaaac",
  "cardinaliteAmdtMultiples": "1",
  "etat": "Discuté",
  "signataires": {
    "auteur": {
      "typeAuteur": "Depute",
      "acteurRef": "PA609726",
      "groupePolitiqueRef": "PO730934"
    },
    "cosignatairesRefs": [
      "PA609726"
    ],
    "texteAffichable": "M.&#160;Aubert"
  },
  "pointeurFragmentTexte": {
    "missionVisee": {
      "idMissionAN": "840",
      "libelleMission": "Transition énergétique",
      "codeMissionPLF": "D",
      "libelleMissionPLF": "Répartition, par mission et programme, des crédits des comptes d'affectation spéciale et des comptes de concours financiers"
    },
    "division": {
      "titre": "Article 80",
      "articleDesignationCourte": "APRÈS ART. 80",
      "type": "ARTICLE",
      "avantAApres": "Apres",
      "divisionRattachee": "APRÈS L'ARTICLE 80, insérer l'article suivant:",
      "articleAdditionnel": "1",
      "urlDivisionTexteVise": "/15/textes/2272C.asp#D_Article_80"
    }
  },
  "corps": {
    "dispositif": "<p style=\"text-align: justify;\">L&#8217;article L.&#160;121&#8209;6 du code de l&#8217;&#233;nergie est compl&#233;t&#233; par un alin&#233;a ainsi r&#233;dig&#233;&#160;:</p><p style=\"text-align: justify;\">&#171;&#160;Pour les installations de production d&#8217;&#233;lectricit&#233; utilisant l&#8217;&#233;nergie m&#233;canique du vent qui sont implant&#233;es &#224; terre, le ou les sites exploit&#233;s par les candidats retenus ne peuvent b&#233;n&#233;ficier que d&#8217;un seul contrat au titre des articles L.&#160;311&#8209;12, L.&#160;311&#8209;13, L.&#160;311&#8209;13&#8209;1, L.&#160;311&#8209;13&#8209;2, L.&#160;314&#8209;1 et L.&#160;314&#8209;18.&#160;&#187;</p>",
    "exposeSommaire": "<p style=\"text-align: justify;\">Dans un r&#233;cent rapport consacr&#233; au soutien financier apport&#233; par l&#8217;&#201;tat aux &#233;oliennes, le rapporteur propose de limiter &#224; une seule fois la possibilit&#233; pour un producteur &#233;olien terrestre de b&#233;n&#233;ficier d&#8217;un contrat d&#8217;achat garanti de l&#8217;&#233;lectricit&#233; produite.</p><p style=\"text-align: justify;\">Une installation aid&#233;e pendant une dur&#233;e de 15 &#224; 20 ans doit effectivement pouvoir &#234;tre autonome &#224; la fin de ce contrat. Si, comme la profession le soutient, l&#8217;&#233;olien est une &#233;nergie mature et comp&#233;titive, elle ne doit pas b&#233;n&#233;ficier d&#8217;un soutien public &#233;ternel.</p><p style=\"text-align: justify;\">&#192; l&#8217;heure actuelle, une installation arrivant au terme d&#8217;un premier contrat de soutien peut en b&#233;n&#233;ficier, sous certaines conditions, d&#8217;un deuxi&#232;me soutien cons&#233;cutif. En 2018, deux projets &#233;oliens ont d&#233;j&#224; &#233;t&#233; dans ce cas.</p><p style=\"text-align: justify;\">La commission de r&#233;gulation de l&#8217;&#233;nergie consid&#232;re que cette pratique fausse la concurrence et propose que les installations concern&#233;es soient exclues de tout m&#233;canisme de soutien pendant une p&#233;riode de cinq ans suivant la conclusion du premier soutien aid&#233; puis que des appels d&#8217;offres sp&#233;cifiques soient organis&#233;s pour ces installations. Le rapporteur propose d&#8217;aller plus loin et de limiter &#224; une seule fois la possibilit&#233; de b&#233;n&#233;ficier d&#8217;un contrat d&#8217;achat garanti de l&#8217;&#233;lectricit&#233; produite.</p><p style=\"text-align: justify;\">L&#8217;&#233;olien ne doit pas &#234;tre une rente financ&#233;e par de l&#8217;argent public.</p>"
  },
  "representations": [
    {
      "nom": "PDF",
      "typeMime": {
        "type": "application",
        "subType": "PDF"
      },
      "statutRepresentation": {
        "verbatim": true,
        "canonique": true,
        "officielle": true,
        "transcription": false,
        "enregistrement": false
      },
      "contenu": {
        "documentURI": "/15/amendements/2272C/AN/805.pdf"
      }
    }
  ],
  "seanceDiscussion": "RUANR5L15S2020IDS21901",
  "sort": {
    "dateSaisie": "2019-11-05T01:52:19.000+01:00",
    "sortEnSeance": "Rejeté"
  },
  "dateDepot": "2019-10-25T02:00:00.000+02:00",
  "dateDistribution": "2019-10-31T01:00:00.000+01:00",
  "article99": "0",
  "loiReference": {
    "codeLoi": "c énergie",
    "divisionCodeLoi": "L121-6"
  }
}