{
  "uid": "AMANR5L15PO59048B1255P1D1N948",
  "identifiant": {
    "legislature": "15",
    "numero": "948",
    "numRect": "0",
    "saisine": {
      "texteLegislatifRef": "PRJLANR5L15B1255",
      "numeroPartiePLF": "1",
      "organeExamen": "PO59048",
      "mentionSecondeDeliberation": "0"
    }
  },
  "numeroLong": "I-CF948",
  "etapeTexte": "1ère lecture (1ère assemblée saisie)",
  "triAmendement": "asaaaaaaaaaaaaaaaaaaaaaaaaaaaaaaaaaaaaaaaaaaaaaaaanro",
  "cardinaliteAmdtMultiples": "1",
  "etat": "Discuté",
  "signataires": {
    "auteur": {
      "typeAuteur": "Depute",
      "acteurRef": "PA332523",
      "groupePolitiqueRef": "PO730934"
    },
    "cosignatairesRefs": [
      "PA332523"
    ],
    "texteAffichable": "Mme&#160;Dalloz"
  },
  "pointeurFragmentTexte": {
    "division": {
      "titre": "Article 3",
      "articleDesignationCourte": "ART. 3",
      "type": "ARTICLE",
      "avantAApres": "A",
      "divisionRattachee": "ARTICLE 3",
      "urlDivisionTexteVise": "/15/textes/1255A.asp#D_Article_3"
    },
    "alinea": {
      "avantAApres": "Apres",
      "numero": "20"
    }
  },
  "corps": {
    "dispositif": "<p style=\"text-align: justify;\">Compl&#233;ter cet article par l&#8217;alin&#233;a suivant&#160;:</p><p style=\"text-align: justify;\">&#171;&#160;&#192; compter de 2019 et pendant les deux premi&#232;res ann&#233;es de la mise en &#339;uvre du pr&#233;l&#232;vement &#224; la source de l&#8217;imp&#244;t sur le revenu, les entreprises qui emploient moins de 21 salari&#233;s ne sont pas redevables, en cas d&#8217;infraction &#224; l&#8217;obligation d&#8217;effectuer la retenue &#224; la source, des p&#233;nalit&#233;s pr&#233;vues &#224; l&#8217;article&#160;1759&#8209;0-A du code g&#233;n&#233;ral des imp&#244;ts, si la bonne foi est reconnue.&#160;&#187;</p>",
    "exposeSommaire": "<p style=\"text-align: justify;\">A compter du 1<sup>er</sup> janvier 2019, le dispositif de la retenue &#224; la source fera des employeurs les tiers collecteurs, charg&#233;s de pr&#233;lever puis de reverser &#224; l&#8217;administration fiscale les retenues effectu&#233;es sur les r&#233;mun&#233;rations de leurs salari&#233;s pour le paiement de leur imp&#244;t sur le revenu.</p><p style=\"text-align: justify;\">&#160;Dans ce cadre, ils seront passibles de sanctions financi&#232;res dans plusieurs hypoth&#232;ses et notamment en cas de retard ou de d&#233;faut de paiement ou de manquement &#224; leurs obligations d&#233;claratives.</p><p style=\"text-align: justify;\">&#160;Or, il convient de noter que l&#8217;appropriation du pr&#233;l&#232;vement &#224; la source demeure un d&#233;fi pour les plus petites entreprises. Le rapport de l&#8217;Inspection G&#233;n&#233;rale des Finances (IGF) avait d&#8217;ailleurs indiqu&#233; une prise de recul parfois limit&#233;e des entreprises (notamment les TPE/PME) par rapport &#224; cette d&#233;claration qui servira de support au pr&#233;l&#232;vement &#224; la source.</p><p style=\"text-align: justify;\">Le pr&#233;sent amendement vise &#224; appliquer, &#224; la mise en &#339;uvre du pr&#233;l&#232;vement &#224; la source, le principe du droit &#224; l&#8217;erreur, promu notamment en mati&#232;re fiscale par la loi pour un &#201;tat au service d&#8217;une soci&#233;t&#233; de confiance.</p><p style=\"text-align: justify;\">&#160;Il est ainsi propos&#233; qu&#8217;&#224; compter du 1er janvier 2019 et pour l&#8217;ann&#233;e suivante, les chefs d&#8217;entreprise qui emploient moins de 21 salari&#233;s ne soient pas redevables, en cas d&#8217;erreur commise de bonne foi &#224; l&#8217;obligation d&#8217;effectuer la retenue &#224; la source, des p&#233;nalit&#233;s pr&#233;vues &#224; l&#8217;article&#160;1759&#8209;0-A du code g&#233;n&#233;ral des imp&#244;ts.</p><p style=\"text-align: justify;\">&#160;</p>"
  },
  "representations": [
    {
      "nom": "PDF",
      "typeMime": {
        "type": "application",
        "subType": "PDF"
      },
      "statutRepresentation": {
        "verbatim": true,
        "canonique": true,
        "officielle": true,
        "transcription": false,
        "enregistrement": false
      },
      "contenu": {
        "documentURI": "/15/amendements/1255A/CION_FIN/CF948.pdf"
      }
    }
  ],
  "sort": {
    "dateSaisie": "2018-10-09T22:49:18.000+02:00",
    "sortEnSeance": "Rejeté"
  },
  "dateDepot": "2018-10-05T02:00:00.000+02:00",
  "dateDistribution": "2018-10-08T02:00:00.000+02:00",
  "article99": "0",
  "loiReference": {}
}