{
  "uid": "AMANR5L15SEA717460BTC1019P0D1N582",
  "identifiant": {
    "legislature": "15",
    "numero": "582",
    "numRect": "0",
    "saisine": {
      "texteLegislatifRef": "PRJLANR5L15BTC1019",
      "numeroPartiePLF": "0",
      "organeExamen": "PO717460",
      "mentionSecondeDeliberation": "0"
    }
  },
  "numeroLong": "582",
  "etapeTexte": "1ère lecture (1ère assemblée saisie)",
  "triAmendement": "d",
  "cardinaliteAmdtMultiples": "1",
  "etat": "Irrecevable",
  "signataires": {
    "auteur": {
      "typeAuteur": "Depute",
      "acteurRef": "PA332523",
      "groupePolitiqueRef": "PO730934"
    },
    "cosignatairesRefs": [
      "PA266793",
      "PA720100",
      "PA1874",
      "PA608416",
      "PA720684",
      "PA719318",
      "PA718884",
      "PA332523",
      "PA721314",
      "PA721410",
      "PA346218",
      "PA340853",
      "PA266797",
      "PA606712",
      "PA267204",
      "PA346054",
      "PA330684",
      "PA721070"
    ],
    "texteAffichable": "Mme&#160;Dalloz,  Mme&#160;Anthoine, Mme&#160;Bazin-Malgras, Mme&#160;Bonnivard, M.&#160;Bony, M.&#160;Pierre-Henri&#160;Dumont, M.&#160;Leclerc, M.&#160;Pradi&#233;, M.&#160;Hetzel, Mme&#160;Val&#233;rie&#160;Boyer, M.&#160;Le Fur, M.&#160;Emmanuel&#160;Maquet, M.&#160;Gosselin, M.&#160;Sermier, M.&#160;Masson, M.&#160;Schellenberger, M.&#160;Lurton et Mme&#160;Ramassamy"
  },
  "pointeurFragmentTexte": {
    "division": {
      "titre": "Article 11",
      "articleDesignationCourte": "APRÈS ART. 11",
      "type": "ARTICLE",
      "avantAApres": "Apres",
      "divisionRattachee": "APRÈS L'ARTICLE 11, insérer l'article suivant:",
      "articleAdditionnel": "1",
      "urlDivisionTexteVise": "/15/textes/1019.asp#D_Article_11"
    }
  },
  "corps": {
    "dispositif": "<p style=\"text-align: justify;\">Le livre&#160;II de la sixi&#232;me partie du code du travail est compl&#233;t&#233; par un titre VII ainsi r&#233;dig&#233;&#160;:</p><p style=\"text-align: justify;\">&#171;&#160;Titre&#160;VII&#160;: &#201;coles de production&#160;&#187;</p><p style=\"text-align: justify;\">&#171;&#160;<i>Art.&#160;L.&#160;6271.&#160;&#8211;&#160;</i>Les &#233;coles de production sont habilit&#233;es &#224; recevoir des r&#233;gions la subvention compl&#233;mentaire au financement au contrat au titre, notamment, de l&#8217;innovation p&#233;dagogique, ainsi que la dotation dynamique pour financer les investissements et les r&#233;novations au titre du r&#244;le de passerelles que les &#233;coles jouent entre les diff&#233;rentes formations.</p><p style=\"text-align: justify;\">&#171;&#160;<i>Art.&#160;L.&#160;6272.</i>&#160;&#8211;&#160;Un d&#233;cret, pris apr&#232;s avis du Conseil national de l&#8217;emploi, de la formation et de l&#8217;orientation professionnelles mentionn&#233; &#224; l&#8217;article L.&#160;6123&#8209;1 du pr&#233;sent code, &#224; d&#233;faut de France comp&#233;tences, fixe les modalit&#233;s d&#8217;application du pr&#233;sent titre.&#160;&#187;</p><p style=\"text-align: justify;\">&#160;</p>",
    "exposeSommaire": "<p style=\"text-align: justify;\">Les &#233;coles de production sont des &#233;tablissements priv&#233;s d&#8217;enseignement technique &#224; but non lucratif qui forment des jeunes &#224; partir de 15 ans et pr&#233;parent aux dipl&#244;mes et certifications du CAP et Bac Pro avec 93&#160;% de r&#233;ussite. Parmi l&#8217;ensemble des dispositifs actuels de formation professionnelle initiale des jeunes, l&#8217;&#233;cole de production est un outil performant. Il a la capacit&#233; de contribuer efficacement contre le d&#233;crochage scolaire et contre le ch&#244;mage des jeunes, pour l&#8217;insertion professionnelle.</p><p style=\"text-align: justify;\">Plusieurs r&#233;gions assimilent les &#233;coles de production aux CFA en assurant 25&#160;% &#224; 35&#160;% des recettes de fonctionnement et 50&#160;% du financement des investissements. Les r&#233;gions ont su identifier et soutenir le caract&#232;re innovant de la p&#233;dagogie des &#233;coles de production.</p><p style=\"text-align: justify;\">Cet amendement a pour objectif de conforter et s&#233;curiser ces &#233;coles.</p>"
  },
  "representations": [
    {
      "nom": "PDF",
      "typeMime": {
        "type": "application",
        "subType": "PDF"
      },
      "statutRepresentation": {
        "verbatim": true,
        "canonique": true,
        "officielle": true,
        "transcription": false,
        "enregistrement": false
      },
      "contenu": {
        "documentURI": "/15/amendements/1019/AN/582.pdf"
      }
    }
  ],
  "dateDepot": "2018-06-06T02:00:00.000+02:00",
  "article99": "0",
  "loiReference": {
    "codeLoi": "c travail",
    "divisionCodeLoi": "L6271"
  }
}