{
  "uid": "AMANR5L15PO420120B0589P0D1N8",
  "identifiant": {
    "legislature": "15",
    "numero": "8",
    "numRect": "0",
    "saisine": {
      "texteLegislatifRef": "PIONANR5L15B0589",
      "numeroPartiePLF": "0",
      "organeExamen": "PO420120",
      "mentionSecondeDeliberation": "0"
    }
  },
  "numeroLong": "AS8",
  "etapeTexte": "1ère lecture (1ère assemblée saisie)",
  "triAmendement": "jdi",
  "cardinaliteAmdtMultiples": "1",
  "etat": "Discuté",
  "signataires": {
    "auteur": {
      "typeAuteur": "Depute",
      "acteurRef": "PA334654",
      "groupePolitiqueRef": "PO730934"
    },
    "cosignatairesRefs": [
      "PA334654"
    ],
    "texteAffichable": "M.&#160;Straumann"
  },
  "pointeurFragmentTexte": {
    "division": {
      "titre": "Article 3",
      "articleDesignationCourte": "ART. 3",
      "type": "ARTICLE",
      "avantAApres": "A",
      "divisionRattachee": "ARTICLE 3",
      "urlDivisionTexteVise": "/15/textes/0589.asp#D_Article_3"
    }
  },
  "corps": {
    "dispositif": "<p style=\"text-align: justify;\">Supprimer cet article.</p>",
    "exposeSommaire": "<p style=\"text-align: justify;\">Cet article permettant &#224; un salari&#233; de transformer son cong&#233; de proche aidant en activit&#233; &#224; temps partiel sans que l&#8217;accord de l&#8217;employeur soit n&#233;cessaire est trop radical vis-&#224;-vis de l&#8217;entreprise qui ne doit pas, une nouvelle fois, &#234;tre une victime collat&#233;rale de mesures, par ailleurs tout &#224; fait respectables.</p><p style=\"text-align: justify;\">On gagne toujours &#224; ce qu&#8217;il y ait une concertation entre les parties plut&#244;t que d&#8217;imposer des mesures drastiques, d&#8217;autant que le dispositif actuel permet cette concertation qui pourrait, &#233;ventuellement, &#234;tre assouplie, mais pas supprim&#233;e.</p>"
  },
  "representations": [
    {
      "nom": "PDF",
      "typeMime": {
        "type": "application",
        "subType": "PDF"
      },
      "statutRepresentation": {
        "verbatim": true,
        "canonique": true,
        "officielle": true,
        "transcription": false,
        "enregistrement": false
      },
      "contenu": {
        "documentURI": "/15/amendements/0589/CION-SOC/AS8.pdf"
      }
    }
  ],
  "sort": {
    "dateSaisie": "2018-02-21T10:53:31.000+01:00",
    "sortEnSeance": "Non soutenu"
  },
  "dateDepot": "2018-02-15T01:00:00.000+01:00",
  "dateDistribution": "2018-02-19T01:00:00.000+01:00",
  "article99": "0",
  "loiReference": {}
}