{
  "uid": "AMANR5L15PO59048B1255P2D1N526",
  "identifiant": {
    "legislature": "15",
    "numero": "526",
    "numRect": "0",
    "saisine": {
      "texteLegislatifRef": "PRJLANR5L15B1255",
      "numeroPartiePLF": "2",
      "organeExamen": "PO59048",
      "mentionSecondeDeliberation": "0"
    }
  },
  "numeroLong": "II-CF526",
  "etapeTexte": "1ère lecture (1ère assemblée saisie)",
  "triAmendement": "bjiaaaaaaaaaaaaaaaaaaaaaaaaaaaaaaaaaaaaaaaaaaaaaaao",
  "cardinaliteAmdtMultiples": "1",
  "etat": "Discuté",
  "signataires": {
    "auteur": {
      "typeAuteur": "Depute",
      "acteurRef": "PA608172",
      "groupePolitiqueRef": "PO758835"
    },
    "cosignatairesRefs": [
      "PA607553",
      "PA333285",
      "PA1198",
      "PA332614",
      "PA608172",
      "PA608011",
      "PA335054",
      "PA1809",
      "PA335532",
      "PA508",
      "PA1592",
      "PA337483",
      "PA608695",
      "PA342415",
      "PA609332",
      "PA609590",
      "PA605069",
      "PA642764",
      "PA340357",
      "PA720988",
      "PA267233",
      "PA333818",
      "PA340343",
      "PA1008",
      "PA608741",
      "PA643145",
      "PA610681",
      "PA719930",
      "PA429893"
    ],
    "texteAffichable": "Mme&#160;Pires Beaune,  M.&#160;Jean-Louis&#160;Bricout, Mme&#160;Rabault, M.&#160;Juanico, Mme&#160;Manin, Mme&#160;Pau-Langevin, Mme&#160;Tolmont, Mme&#160;Victory, M.&#160;Aviragnet, Mme&#160;Bareigts, Mme&#160;Battistel, Mme&#160;Bi&#233;mouret, M.&#160;Bouillon, M.&#160;Carvounas, M.&#160;Alain&#160;David, Mme&#160;Laurence&#160;Dumont, M.&#160;Faure, M.&#160;Garot, M.&#160;David&#160;Habib, M.&#160;Hutin, Mme&#160;Karamanli, M.&#160;J&#233;r&#244;me&#160;Lambert, M.&#160;Letchimy, M.&#160;Potier, M.&#160;Pueyo, M.&#160;Saulignac, Mme&#160;Untermaier, Mme&#160;Vainqueur-Christophe et M.&#160;Vallaud"
  },
  "pointeurFragmentTexte": {
    "missionVisee": {
      "idMissionAN": "405",
      "libelleMission": "Enseignement scolaire",
      "codeMissionPLF": "B",
      "libelleMissionPLF": "Répartition, par mission et programme, des crédits du budget général"
    },
    "division": {
      "titre": "ÉTAT B",
      "articleDesignationCourte": "ART. 39",
      "type": "ANNEXE",
      "avantAApres": "A",
      "divisionRattachee": "ARTICLE 39",
      "urlDivisionTexteVise": "/15/textes/1255C.asp#D_ETAT_B"
    }
  },
  "corps": {
    "exposeSommaire": "<p style=\"text-align: justify;\">Le groupe Socialistes et apparent&#233;s d&#233;nonce l&#8217;entreprise &#224; laquelle le ministre de l&#8217;&#233;ducation nationale et de la jeunesse se livre depuis dix-huit mois&#160;: la casse de la loi de refondation de l&#8217;&#233;cole et le d&#233;mant&#232;lement m&#233;thodique du Conseil national d&#8217;&#233;valuation du syst&#232;me scolaire. Apr&#232;s avoir jur&#233; qu&#8217;aucun grand bouleversement n&#8217;aurait lieu rue de Grenelle, le Ministre fait tout l&#8217;inverse et d&#233;cide purement et simplement de supprimer une instance d&#8217;&#233;valuation autonome pour lui pr&#233;f&#233;rer une nouvelle instance dont 80&#160;% de ses membres seront nomm&#233;s par lui.&#160;</p><p style=\"text-align: justify;\">Le constat d&#8217;&#233;chec du&#160;Conseil national d&#8217;&#233;valuation du syst&#232;me scolaire n&#8217;est pas partag&#233; par le Parlement. Dans un rapport, vot&#233; &#224; l&#8217;unanimit&#233; du comit&#233; d&#8217;&#233;valuation et de contr&#244;le de notre assembl&#233;e, dont les rapporteurs &#233;taient R&#233;gis Juanico, d&#233;put&#233; apparent&#233; socialiste, et&#160;Marie Tamarelle-Verhaeghe, d&#233;put&#233;e Lrem, on peut lire&#160;: &#171;<i>&#160;Le CNESCO, en d&#233;pit de moyens limit&#233;s (Cf. infra), est donc une instance prometteuse qui, en quatre ans, a r&#233;ussi &#224; mettre en place une m&#233;thode d&#8217;&#233;valuation du syst&#232;me scolaire &#224; la fois originale, scientifique et participative</i>&#160;&#187;.</p><p style=\"text-align: justify;\">Alors pourquoi vouloir &#224; tout prix supprimer cette instance&#160;?&#160;</p><p style=\"text-align: justify;\">Le vrai probl&#232;me r&#233;side plut&#244;t dans le manque de moyens r&#233;els dont elle dispose. C&#8217;est d&#8217;ailleurs ce que rappelle ledit rapport quand il affirme que le Conseil national d&#8217;&#233;valuation du syst&#232;me scolaire ne b&#233;n&#233;ficie pas d&#8217;une reconnaissance budg&#233;taire propre.&#160;</p><p style=\"text-align: justify;\">C&#8217;est pourquoi le groupe Socialistes et apparent&#233;s propose de renforcer ses moyens en abondant &#224; hauteur de 400&#160;000&#160;euros les cr&#233;dits de l&#8217;action n&#176;2 &#171;&#160;&#201;valuation et contr&#244;le&#160;&#187; du programme 214 &#171;&#160;Soutien de la politique de l&#8217;&#233;ducation nationale en r&#233;duisant d&#8217;autant les cr&#233;dits de l&#8217;action n&#176;9&#160;&#187;Fonctionnement des &#233;tablissements&#171;&#160;du programme 139&#160;&#187;Enseignement priv&#233; du premier et second degr&#233;&#171;&#160;.&#160;</p><p style=\"text-align: justify;\">Cet amendement n&#8217;a pas vocation &#224; diminuer les cr&#233;dits de l&#8217;action &#171;&#160;Fonctionnement des &#233;tablissements&#160;&#187; du programme 139 &#171;&#160;Enseignement priv&#233; du premier et second degr&#233;&#160;&#187; mais, pour se conformer&#160;aux r&#232;gles de recevabilit&#233; financi&#232;re des amendements parlementaires, il est n&#233;cessaire de pr&#233;voir la suppression de cr&#233;dits d&#8217;un autre programme de la m&#234;me mission, &#224; due concurrence, seul le Gouvernement pouvant lever ce gage.&#160;</p>",
    "dispositifAmdtCredit": {
      "listeProgrammes": [
        {
          "libelle": "Enseignement scolaire public du premier degré",
          "id": "32000",
          "AE": {
            "montantPositif": "0",
            "montantNegatif": "0"
          },
          "CP": {
            "montantPositif": "0",
            "montantNegatif": "0"
          },
          "action": "modification"
        },
        {
          "libelle": "Enseignement scolaire public du second degré",
          "id": "32001",
          "AE": {
            "montantPositif": "0",
            "montantNegatif": "0"
          },
          "CP": {
            "montantPositif": "0",
            "montantNegatif": "0"
          },
          "action": "modification"
        },
        {
          "libelle": "Vie de l'élève",
          "id": "32002",
          "AE": {
            "montantPositif": "0",
            "montantNegatif": "0"
          },
          "CP": {
            "montantPositif": "0",
            "montantNegatif": "0"
          },
          "action": "modification"
        },
        {
          "libelle": "Enseignement privé du premier et du second degrés",
          "id": "32003",
          "AE": {
            "montantPositif": "0",
            "montantNegatif": "400000"
          },
          "CP": {
            "montantPositif": "0",
            "montantNegatif": "400000"
          },
          "action": "modification"
        },
        {
          "libelle": "Soutien de la politique de l'éducation nationale",
          "id": "32004",
          "AE": {
            "montantPositif": "400000",
            "montantNegatif": "0"
          },
          "CP": {
            "montantPositif": "400000",
            "montantNegatif": "0"
          },
          "action": "modification"
        },
        {
          "libelle": "Enseignement technique agricole",
          "id": "32005",
          "AE": {
            "montantPositif": "0",
            "montantNegatif": "0"
          },
          "CP": {
            "montantPositif": "0",
            "montantNegatif": "0"
          },
          "action": "modification"
        }
      ],
      "totalAE": {
        "montantPositif": "400000",
        "montantNegatif": "400000",
        "solde": "0"
      },
      "totalCP": {
        "montantPositif": "400000",
        "montantNegatif": "400000",
        "solde": "0"
      }
    }
  },
  "representations": [
    {
      "nom": "PDF",
      "typeMime": {
        "type": "application",
        "subType": "PDF"
      },
      "statutRepresentation": {
        "verbatim": true,
        "canonique": true,
        "officielle": true,
        "transcription": false,
        "enregistrement": false
      },
      "contenu": {
        "documentURI": "/15/amendements/1255C/CION_FIN/CF526.pdf"
      }
    }
  ],
  "sort": {
    "dateSaisie": "2018-10-29T19:53:10.000+01:00",
    "sortEnSeance": "Rejeté"
  },
  "dateDepot": "2018-10-24T02:00:00.000+02:00",
  "dateDistribution": "2018-10-29T01:00:00.000+01:00",
  "article99": "0",
  "loiReference": {}
}