{
  "uid": "AMANR5L15SEA717460BTC1019P0D1N942",
  "identifiant": {
    "legislature": "15",
    "numero": "942",
    "numRect": "0",
    "saisine": {
      "texteLegislatifRef": "PRJLANR5L15BTC1019",
      "numeroPartiePLF": "0",
      "organeExamen": "PO717460",
      "mentionSecondeDeliberation": "0"
    }
  },
  "numeroLong": "942",
  "etapeTexte": "1ère lecture (1ère assemblée saisie)",
  "triAmendement": "e",
  "cardinaliteAmdtMultiples": "1",
  "etat": "Discuté",
  "signataires": {
    "auteur": {
      "typeAuteur": "Depute",
      "acteurRef": "PA721218",
      "groupePolitiqueRef": "PO730964"
    },
    "cosignatairesRefs": [
      "PA721218"
    ],
    "texteAffichable": "Mme&#160;Charri&#232;re"
  },
  "pointeurFragmentTexte": {
    "division": {
      "titre": "Article 9",
      "articleDesignationCourte": "APRÈS ART. 9",
      "type": "ARTICLE",
      "avantAApres": "Apres",
      "divisionRattachee": "APRÈS L'ARTICLE 9, insérer l'article suivant:",
      "articleAdditionnel": "1",
      "urlDivisionTexteVise": "/15/textes/1019.asp#D_Article_9"
    }
  },
  "corps": {
    "dispositif": "<p style=\"text-align: justify;\">L&#8217;article&#160;175 de la loi n&#176;&#160;2017&#8209;1837 du 30&#160;d&#233;cembre&#160;2017 de finances pour 2018 est compl&#233;t&#233; par un alin&#233;a ainsi r&#233;dig&#233;&#160;:</p><p style=\"text-align: justify;\">&#171;&#160;Ce rapport &#233;tudie la possibilit&#233; de cr&#233;er un dispositif d&#8217;aide de l&#8217;&#201;tat au b&#233;n&#233;fice des centres de formation d&#8217;apprentis au sein desquels une personne r&#233;sidant dans un quartier prioritaire de la politique de la ville suit une formation par apprentissage, et au b&#233;n&#233;fice des entreprises qui embauchent celle-ci en contrat d&#8217;apprentissage.&#160;&#187;</p>",
    "exposeSommaire": "<p style=\"text-align: justify;\">Cet amendement vise &#224; disposer d&#8217;informations en vue de la cr&#233;ation d&#8217;un dispositif d&#8217; &#171;&#160;apprentis francs&#160;&#187;, consistant en une aide de l&#8217;&#201;tat apport&#233;e aux centres de formation d&#8217;apprentis au sein desquels une personne r&#233;sidant dans un quartier prioritaire de la politique de la ville (QPV) suit une formation par apprentissage et aux entreprises qui embauchent celle-ci en contrat d&#8217;apprentissage. Compl&#233;mentaire du dispositif d&#8217; &#171;&#160;emplois francs&#160;&#187; en cours d&#8217;exp&#233;rimentation, ce dispositif permettrait de soutenir l&#8217;entr&#233;e en apprentissage des jeunes issus des QPV, qui sont confront&#233;s &#224; de fortes difficult&#233;s d&#8217;insertion au march&#233; du travail.</p>"
  },
  "representations": [
    {
      "nom": "PDF",
      "typeMime": {
        "type": "application",
        "subType": "PDF"
      },
      "statutRepresentation": {
        "verbatim": true,
        "canonique": true,
        "officielle": true,
        "transcription": false,
        "enregistrement": false
      },
      "contenu": {
        "documentURI": "/15/amendements/1019/AN/942.pdf"
      }
    }
  ],
  "seanceDiscussion": "RUANR5L15S2018IDS21103",
  "sort": {
    "dateSaisie": "2018-06-14T21:34:19.000+02:00",
    "sortEnSeance": "Adopté"
  },
  "dateDepot": "2018-06-07T02:00:00.000+02:00",
  "dateDistribution": "2018-06-11T02:00:00.000+02:00",
  "article99": "0",
  "loiReference": {
    "codeLoi": "loi 2017-1837",
    "divisionCodeLoi": "175"
  }
}