{
  "uid": "AMANR5L15SEA717460BTC1974P0D1N2006",
  "identifiant": {
    "legislature": "15",
    "numero": "2006",
    "numRect": "0",
    "saisine": {
      "texteLegislatifRef": "PRJLANR5L15BTC1974",
      "numeroPartiePLF": "0",
      "organeExamen": "PO717460",
      "mentionSecondeDeliberation": "0"
    }
  },
  "numeroLong": "2006",
  "etapeTexte": "1ère lecture (2ème assemblée saisie)",
  "triAmendement": "mkaaaaaaaaaaaaaaaaaaaaaaaaaaaaaaaaaaaaaaaaaaaaaaaac",
  "cardinaliteAmdtMultiples": "1",
  "etat": "Discuté",
  "signataires": {
    "auteur": {
      "typeAuteur": "Depute",
      "acteurRef": "PA719578",
      "groupePolitiqueRef": "PO730958"
    },
    "cosignatairesRefs": [
      "PA721062",
      "PA720892",
      "PA720846",
      "PA722142",
      "PA588884",
      "PA718860",
      "PA720286",
      "PA2150",
      "PA721202",
      "PA721960",
      "PA718868",
      "PA719676",
      "PA720422",
      "PA720430",
      "PA721226",
      "PA719578",
      "PA721210"
    ],
    "texteAffichable": "M.&#160;Prud&apos;homme,  Mme&#160;Autain, M.&#160;Bernalicis, M.&#160;Coquerel, M.&#160;Corbi&#232;re, Mme&#160;Fiat, M.&#160;Lachaud, M.&#160;Larive, M.&#160;M&#233;lenchon, Mme&#160;Obono, Mme&#160;Panot, M.&#160;Quatennens, M.&#160;Ratenon, Mme&#160;Ressiguier, Mme&#160;Rubin, M.&#160;Ruffin et Mme&#160;Taurine"
  },
  "pointeurFragmentTexte": {
    "division": {
      "titre": "Article 37 bis C",
      "articleDesignationCourte": "APRÈS ART. 37 BIS C",
      "type": "ARTICLE",
      "avantAApres": "Apres",
      "divisionRattachee": "APRÈS L'ARTICLE 37 BIS C, insérer l'article suivant:",
      "articleAdditionnel": "1",
      "urlDivisionTexteVise": "/15/textes/1974.asp#D_Article_37_bis_C"
    }
  },
  "corps": {
    "dispositif": "<p style=\"text-align: justify;\">Apr&#232;s le deuxi&#232;me alin&#233;a de l&#8217;article L.&#160;222&#8209;5 du code de l&#8217;environnement, il est ins&#233;r&#233; un alin&#233;a ainsi r&#233;dig&#233;&#160;:</p><p style=\"text-align: justify;\">&#171;&#160;Pour les communes littorales, les mesures pr&#233;vues peuvent s&#8217;appliquer dans la zone des 12 miles nautiques.&#160;&#187;</p>",
    "exposeSommaire": "<p style=\"text-align: justify;\">Nous souhaitons &#233;largir l&#8217;application des plans de protection de l&#8217;atmosph&#232;re (PPA) aux 12 milles nautiques. La pollution de l&#8217;air g&#233;n&#233;r&#233;e par le trafic maritime est un sujet majeur. La France Insoumise a r&#233;cemment r&#233;alis&#233; une action en ce sens &#224; Marseille pour d&#233;noncer la pollution des paquebots et les 60 000 morts dus &#224; la pollution maritime de l&#8217;air en Europe. Le transport maritime contribuerait &#224; hauteur de 5 &#224; 10&#160;% &#224; la pollution de l&#8217;air mesur&#233;e en centre-ville de Marseille. 500 navires de croisi&#232;re par an s&#8217;arr&#234;tent &#224; quai &#224; Marseille, la pollution est 12 fois plus &#233;lev&#233;e pr&#232;s de ces navires. Elle intoxique les habitants, notamment ceux des quartiers populaires.</p><p style=\"text-align: justify;\">Les PPA s&#8217;appliquent aux agglom&#233;rations de plus de 250.000 habitants et aux zones dans lesquelles les valeurs limites de qualit&#233; de l&#8217;air ne sont pas respect&#233;es. Mais ces plans se focalisent sur les sources terrestres alors que certaines zones et agglom&#233;rations d&#8217;autres sources, tel que le transport maritime, participe aux d&#233;passements des valeurs limites de qualit&#233; de l&#8217;air.</p><p style=\"text-align: justify;\">Nous reprenons donc une proposition de France Nature Environnement qui propose d&#8217;&#233;largir le p&#233;rim&#232;tre des PPA afin d&#8217;y int&#233;grer les 12 milles nautiques. Ceci donnera la possibilit&#233; de mettre en place des mesures de r&#233;duction des &#233;missions des navires &#224; l&#8217;&#233;chelle du port et des eaux portuaires.</p>"
  },
  "representations": [
    {
      "nom": "PDF",
      "typeMime": {
        "type": "application",
        "subType": "PDF"
      },
      "statutRepresentation": {
        "verbatim": true,
        "canonique": true,
        "officielle": true,
        "transcription": false,
        "enregistrement": false
      },
      "contenu": {
        "documentURI": "/15/amendements/1974/AN/2006.pdf"
      }
    }
  ],
  "seanceDiscussion": "RUANR5L15S2019IDS21702",
  "sort": {
    "dateSaisie": "2019-06-14T19:44:22.000+02:00",
    "sortEnSeance": "Rejeté"
  },
  "dateDepot": "2019-05-29T02:00:00.000+02:00",
  "dateDistribution": "2019-06-07T02:00:00.000+02:00",
  "article99": "0",
  "loiReference": {
    "codeLoi": "c environnement",
    "divisionCodeLoi": "L222-5"
  }
}