{
  "uid": "AMANR5L15SEA717460BTC1767P0D1N566",
  "identifiant": {
    "legislature": "15",
    "numero": "566",
    "numRect": "0",
    "saisine": {
      "texteLegislatifRef": "PRJLANR5L15BTC1767",
      "numeroPartiePLF": "0",
      "organeExamen": "PO717460",
      "mentionSecondeDeliberation": "0"
    }
  },
  "numeroLong": "566",
  "etapeTexte": "1ère lecture (1ère assemblée saisie)",
  "triAmendement": "eeaaaaaaaaaaaaaaaaaaaaaaaaaaaaaaaaaaaaaaaaaaaaaaaadfee",
  "cardinaliteAmdtMultiples": "1",
  "etat": "Discuté",
  "signataires": {
    "auteur": {
      "typeAuteur": "Depute",
      "acteurRef": "PA718838",
      "groupePolitiqueRef": "PO730934"
    },
    "cosignatairesRefs": [
      "PA267378",
      "PA608016",
      "PA642847",
      "PA767",
      "PA334654",
      "PA718780",
      "PA643134",
      "PA720386",
      "PA336316",
      "PA267901",
      "PA718838",
      "PA340853",
      "PA721816",
      "PA709315",
      "PA346054",
      "PA267204",
      "PA332523",
      "PA606712",
      "PA721474",
      "PA718884",
      "PA721046",
      "PA1874",
      "PA719272",
      "PA721678",
      "PA267429",
      "PA718850",
      "PA330909",
      "PA267318",
      "PA721968",
      "PA346218",
      "PA719318",
      "PA722390",
      "PA713448",
      "PA267289"
    ],
    "texteAffichable": "M.&#160;Brun,  Mme&#160;Anthoine, Mme&#160;Bassire, M.&#160;Bazin, Mme&#160;Bazin-Malgras, M.&#160;Boucard, M.&#160;Bouchet, Mme&#160;Brenier, M.&#160;Cattin, M.&#160;Cinieri, M.&#160;Cordier, Mme&#160;Corneloup, Mme&#160;Dalloz, M.&#160;Descoeur, M.&#160;Door, M.&#160;Di Filippo, M.&#160;Grelier, M.&#160;Kamardine, M.&#160;Leclerc, M.&#160;Le Fur, Mme&#160;Levy, Mme&#160;Louwagie, M.&#160;Lurton, M.&#160;Emmanuel&#160;Maquet, M.&#160;Masson, Mme&#160;Meunier, M.&#160;Reda, M.&#160;Sermier, M.&#160;Straumann, Mme&#160;Trastour-Isnart, Mme&#160;Valentin, M.&#160;Viala, M.&#160;Vialay et M.&#160;Viry"
  },
  "pointeurFragmentTexte": {
    "division": {
      "titre": "Article 10",
      "articleDesignationCourte": "ART. 10",
      "type": "ARTICLE",
      "avantAApres": "A",
      "divisionRattachee": "ARTICLE 10",
      "urlDivisionTexteVise": "/15/textes/1767.asp#D_Article_10"
    },
    "alinea": {
      "avantAApres": "Apres",
      "numero": "10"
    }
  },
  "corps": {
    "dispositif": "<p style=\"text-align: justify;\">Apr&#232;s l'alin&#233;a 10, ins&#233;rer l'alin&#233;a suivant&#160;:</p><p style=\"text-align: justify;\">&#171; 4&#176;&#160;Le II de l&#8217;article L.&#160;6132&#8209;3 du code de la sant&#233; publique est compl&#233;t&#233; par un alin&#233;a ainsi r&#233;dig&#233;&#160;:</p><p style=\"text-align: justify;\">&#171;&#160;L&#8217;&#233;tablissement support du groupement hospitalier de territoire peut d&#233;l&#233;guer la gestion des p&#244;les inter-&#233;tablissements &#224; un des &#233;tablissements parties &#224; la convention constitutive par voie d&#8217;avenant. Cette d&#233;l&#233;gation est r&#233;vocable selon des modalit&#233;s pr&#233;vues par la convention constitutive.&#160;&#187;</p>",
    "exposeSommaire": "<p style=\"text-align: justify;\">La loi n&#176;&#160;2016&#8209;41 du 26 janvier 2016 de modernisation de notre syst&#232;me de sant&#233; a cr&#233;&#233; les Groupements Hospitaliers de Territoire (GHT), qui ont pour cons&#233;quence la mise sous tutelle des centres hospitaliers non support. Ces centres hospitaliers s&#8217;inqui&#232;tent d&#8217;une perte d&#8217;autonomie &#233;vidente et des cons&#233;quences de la convergence annonc&#233;e des moyens vers les h&#244;pitaux supports des GHT.</p><p style=\"text-align: justify;\">Or, certains &#233;tablissements parties &#224; un groupement ont la gestion d&#8217;un &#233;quipement lourd et/ou d&#8217;une activit&#233; avec une pr&#233;&#233;minence certaine par rapport aux moyens allou&#233;s &#224; l&#8217;&#233;tablissement support. Ces &#233;tablissements membres du groupement peuvent d&#233;cider de la Constitution d&#8217;un p&#244;le inter-&#233;tablissements g&#233;r&#233; par l&#8217;&#233;tablissement support selon l&#8217;article L.&#160;6132&#8209;3 du code de la sant&#233; publique.</p><p style=\"text-align: justify;\">Cependant, dans la mesure o&#249; les &#233;tablissements sont tous diff&#233;rents et avec des sp&#233;cialit&#233;s bien d&#233;finies l&#8217;int&#233;r&#234;t est la concentration des moyens par p&#244;le vers les centres d&#8217;excellence.</p><p style=\"text-align: justify;\">C&#8217;est pourquoi, l&#8217;objet du pr&#233;sent amendement est de permettre par voie d&#8217;avenant, avec l&#8217;accord express de l&#8217;&#233;tablissement support, de g&#233;rer par d&#233;l&#233;gation un p&#244;le inter-&#233;tablissements afin de recentrer des moyens sur l&#8217;&#233;tablissement qui a depuis longtemps d&#233;velopp&#233; une expertise sur le domaine.</p>"
  },
  "representations": [
    {
      "nom": "PDF",
      "typeMime": {
        "type": "application",
        "subType": "PDF"
      },
      "statutRepresentation": {
        "verbatim": true,
        "canonique": true,
        "officielle": true,
        "transcription": false,
        "enregistrement": false
      },
      "contenu": {
        "documentURI": "/15/amendements/1767/AN/566.pdf"
      }
    }
  ],
  "seanceDiscussion": "RUANR5L15S2019IDS21566",
  "sort": {
    "dateSaisie": "2019-03-22T16:33:39.000+01:00",
    "sortEnSeance": "Rejeté"
  },
  "dateDepot": "2019-03-15T01:00:00.000+01:00",
  "dateDistribution": "2019-03-19T01:00:00.000+01:00",
  "article99": "0",
  "loiReference": {
    "codeLoi": "c santé publique",
    "divisionCodeLoi": "L6132-3"
  }
}