{
  "uid": "AMANR5L15SEA717460B1255P2D1N2210",
  "identifiant": {
    "legislature": "15",
    "numero": "2210",
    "numRect": "0",
    "saisine": {
      "texteLegislatifRef": "PRJLANR5L15B1255",
      "numeroPartiePLF": "2",
      "organeExamen": "PO717460",
      "mentionSecondeDeliberation": "0"
    }
  },
  "numeroLong": "II-2210",
  "etapeTexte": "1ère lecture (1ère assemblée saisie)",
  "triAmendement": "euaaaaaaaaaaaaaaaaaaaaaaaaaaaaaaaaaaaaaaaaaaaaaaaagaakw",
  "cardinaliteAmdtMultiples": "1",
  "etat": "Discuté",
  "signataires": {
    "auteur": {
      "typeAuteur": "Depute",
      "acteurRef": "PA719146",
      "groupePolitiqueRef": "PO759900"
    },
    "cosignatairesRefs": [
      "PA720996",
      "PA719146",
      "PA331582",
      "PA755549",
      "PA719286",
      "PA607619",
      "PA608292",
      "PA605518",
      "PA405480",
      "PA719138"
    ],
    "texteAffichable": "M.&#160;Acquaviva,  M.&#160;Castellani, M.&#160;Colombani, M.&#160;Pupponi, M.&#160;El Guerrab, M.&#160;Philippe&#160;Vigier, M.&#160;Fran&#231;ois-Michel&#160;Lambert, M.&#160;Brial, Mme&#160;Dubi&#233; et M.&#160;Molac"
  },
  "pointeurFragmentTexte": {
    "division": {
      "titre": "Article 55",
      "articleDesignationCourte": "APRÈS ART. 55",
      "type": "ARTICLE",
      "avantAApres": "Apres",
      "divisionRattachee": "APRÈS L'ARTICLE 55, insérer l'article suivant:",
      "articleAdditionnel": "1",
      "urlDivisionTexteVise": "/15/textes/1255C.asp#D_Article_55"
    }
  },
  "corps": {
    "dispositif": "<p style=\"text-align: justify;\">I. &#8211; Au premier alin&#233;a de l&#8217;article&#160;238 <i>bis</i> du code g&#233;n&#233;ral des imp&#244;ts, apr&#232;s le mot&#160;: &#171;&#160;versements,&#160;&#187; sont ins&#233;r&#233;s les mots&#160;: &#171;&#160;n&#8217;exc&#233;dant pas un plafond fix&#233; par d&#233;cret ou&#160;&#187;</p><p style=\"text-align: justify;\">II. &#8211; Le I s&#8217;applique &#224; compter du 1<sup>er</sup> janvier 2020</p><p style=\"text-align: justify;\">III.&#160;&#8211;&#160;La perte de recettes pour l&#8217;&#201;tat est compens&#233;e &#224; due concurrence par la cr&#233;ation d&#8217;une taxe additionnelle aux droits mentionn&#233;s aux articles 575 et 575 A du code g&#233;n&#233;ral des imp&#244;ts.&#160;</p>",
    "exposeSommaire": "<p style=\"text-align: justify;\">Cet amendement a pour objet de stimuler le financement priv&#233; des associations gr&#226;ce au m&#233;c&#233;nat culturel en impliquant davantage les PME ou TPE.</p><p style=\"text-align: justify;\">Cet amendement reprend une recommandation du Haut Conseil &#224; la vie associative (HCVA) dans un rapport interm&#233;diaire adopt&#233; en session pl&#233;ni&#232;re du 21 mars 2013.</p><p style=\"text-align: justify;\">En effet, le rapport constate que le dispositif fiscal actuellement en vigueur au titre du m&#233;c&#233;nat (&#224; savoir une r&#233;duction d&#8217;imp&#244;t &#233;gale &#224; 60&#160;% du montant des versements, effectu&#233;s par les entreprises, pris dans la limite de 5 pour mille de leur chiffre d&#8217;affaires) est davantage adapt&#233; aux grandes entreprises. Le m&#234;me rapport poursuit en expliquant que ce plafond est en revanche un frein pour les TPE et PME car il est rapidement atteint. Compte tenu du fait que la motivation premi&#232;re pour les entreprises &#224; se lancer dans des d&#233;marches de m&#233;c&#233;nat, est avant tout, ce que l&#8217;on peut comprendre, d&#8217;ordre fiscal en plus de participer &#224; la vie de la cit&#233;, il apparait toutefois n&#233;cessaire d&#8217;encourager le m&#233;c&#233;nat des PME par une adaptation de la l&#233;gislation actuelle.</p><p style=\"text-align: justify;\">C&#8217;est pourquoi, le HCVA recommande l&#8217;&#233;tablissement d&#8217;un plafond &#224; d&#233;finir par d&#233;cret d&#8217;application, de 10 000&#160;&#8364; par exemple, pour l&#8217;ensemble des montants vers&#233;s au titre du m&#233;c&#233;nat, au del&#224; desquels s&#8217;appliquerait le plafond actuel de 0,5&#160;%.</p><p style=\"text-align: justify;\">Cette mesure propos&#233;e fait notamment suite &#224; un &#233;change en Commission des Affaires culturelles du 18 avril 2018 avec le d&#233;put&#233; Rapha&#235;l G&#233;rard, co-rapporteurs de la mission flash sur le soutien au patrimoine immobilier prot&#233;g&#233;. Ce d&#233;bat s&#8217;est poursuivi le 9 mai 2018, dans la m&#234;me commission, lors de l&#8217;examen de la proposition de loi relative &#224; l&#8217;engagement associatif, s&#233;ance durant laquelle la rapporteure Sophie Mette et le d&#233;put&#233; Bertrand Sorre ont propos&#233; le renvoi de la mesure en loi de finances.</p><p style=\"text-align: justify;\">Gr&#226;ce &#224; cette disposition qui &#233;tablit une forme de franchise, toute entreprise pourra ainsi verser jusqu&#8217;&#224; 10 000&#160;&#8364; en b&#233;n&#233;ficiant d&#8217;une la d&#233;duction fiscale autoris&#233;e par le l&#8217;article&#160;238 bis du CGI.</p>"
  },
  "representations": [
    {
      "nom": "PDF",
      "typeMime": {
        "type": "application",
        "subType": "PDF"
      },
      "statutRepresentation": {
        "verbatim": true,
        "canonique": true,
        "officielle": true,
        "transcription": false,
        "enregistrement": false
      },
      "contenu": {
        "documentURI": "/15/amendements/1255C/AN/2210.pdf"
      }
    }
  ],
  "seanceDiscussion": "RUANR5L15S2019IDS21343",
  "sort": {
    "dateSaisie": "2018-11-15T23:22:24.000+01:00",
    "sortEnSeance": "Retiré"
  },
  "dateDepot": "2018-11-12T01:00:00.000+01:00",
  "dateDistribution": "2018-11-14T01:00:00.000+01:00",
  "article99": "0",
  "loiReference": {
    "codeLoi": "CGI",
    "divisionCodeLoi": "L238 bis"
  }
}