{
  "uid": "AMANR5L15PO59051B0759P0D1N34",
  "identifiant": {
    "legislature": "15",
    "numero": "34",
    "numRect": "0",
    "saisine": {
      "texteLegislatifRef": "PIONANR5L15B0759",
      "numeroPartiePLF": "0",
      "organeExamen": "PO59051",
      "mentionSecondeDeliberation": "0"
    }
  },
  "numeroLong": "CL34",
  "etapeTexte": "1ère lecture (2ème assemblée saisie)",
  "triAmendement": "ieaaaaaaaaaaaaaaaaaaaaaaaaaaaaaaaaaaaaaaaaaaaaaaaai",
  "cardinaliteAmdtMultiples": "1",
  "etat": "Discuté",
  "signataires": {
    "auteur": {
      "typeAuteur": "Depute",
      "acteurRef": "PA721398",
      "groupePolitiqueRef": "PO730964"
    },
    "cosignatairesRefs": [
      "PA721398"
    ],
    "texteAffichable": "Mme&#160;Degois, rapporteure"
  },
  "pointeurFragmentTexte": {
    "division": {
      "titre": "Article 33 bis",
      "articleDesignationCourte": "ART. 33 BIS",
      "type": "ARTICLE",
      "avantAApres": "A",
      "divisionRattachee": "ARTICLE 33 BIS",
      "urlDivisionTexteVise": "/15/textes/0759.asp#D_Article_33_bis"
    },
    "alinea": {
      "numero": "4"
    }
  },
  "corps": {
    "dispositif": "<p>Supprimer les alin&#233;as&#160;4 et&#160;5.</p>",
    "exposeSommaire": "<p style=\"text-align: justify;\">Cet amendement a pour objet de r&#233;tablir l'obligation de solliciter un rapport aupr&#232;s d'un expert ind&#233;pendant pour d&#233;terminer le prix d'acquisition par une soci&#233;t&#233; de ses propres actions. Ce rapport apporte en effet une garantie suppl&#233;mentaire sur le niveau de prix retenu et compl&#232;te utilement l'information &#224; destination des actionnaires.</p>"
  },
  "representations": [
    {
      "nom": "PDF",
      "typeMime": {
        "type": "application",
        "subType": "PDF"
      },
      "statutRepresentation": {
        "verbatim": true,
        "canonique": true,
        "officielle": true,
        "transcription": false,
        "enregistrement": false
      },
      "contenu": {
        "documentURI": "/15/amendements/0759/CION_LOIS/CL34.pdf"
      }
    }
  ],
  "sort": {
    "dateSaisie": "2019-03-20T11:23:38.000+01:00",
    "sortEnSeance": "Adopté"
  },
  "dateDepot": "2019-03-19T01:00:00.000+01:00",
  "dateDistribution": "2019-03-19T01:00:00.000+01:00",
  "article99": "0",
  "loiReference": {}
}