{
  "uid": "AMANR5L15SEA717460BTC1237P0D1N620",
  "identifiant": {
    "legislature": "15",
    "numero": "620",
    "numRect": "0",
    "saisine": {
      "texteLegislatifRef": "PRJLANR5L15BTC1237",
      "numeroPartiePLF": "0",
      "organeExamen": "PO717460",
      "mentionSecondeDeliberation": "0"
    }
  },
  "numeroLong": "620",
  "etapeTexte": "1ère lecture (1ère assemblée saisie)",
  "triAmendement": "aliaaaaaaaaaaaaaaaaaaaaaaaaaaaaaaaaaaaaaaaaaaaaaaawdx",
  "cardinaliteAmdtMultiples": "1",
  "etat": "Discuté",
  "signataires": {
    "auteur": {
      "typeAuteur": "Depute",
      "acteurRef": "PA721126",
      "groupePolitiqueRef": "PO730934"
    },
    "cosignatairesRefs": [
      "PA721126"
    ],
    "texteAffichable": "Mme&#160;Guion-Firmin"
  },
  "pointeurFragmentTexte": {
    "division": {
      "titre": "Article 9",
      "articleDesignationCourte": "ART. 9",
      "type": "ARTICLE",
      "avantAApres": "A",
      "divisionRattachee": "ARTICLE 9",
      "urlDivisionTexteVise": "/15/textes/1237.asp#D_Article_9"
    },
    "alinea": {
      "avantAApres": "A",
      "numero": "41",
      "alineaDesignation": "Alinéa 41"
    }
  },
  "corps": {
    "dispositif": "<p style=\"text-align: justify;\">&#192; la fin de l&#8217;alin&#233;a&#160;41, substituer &#224; l&#8217;ann&#233;e&#160;:</p><p style=\"text-align: justify;\">&#171;&#160;2019&#160;&#187;</p><p style=\"text-align: justify;\">l&#8217;ann&#233;e&#160;:</p><p style=\"text-align: justify;\">&#171;&#160;2021&#160;&#187;.</p>",
    "exposeSommaire": "<p style=\"text-align: justify;\">L&#8217;article&#160;9 modifie les seuils de certification l&#233;gale des comptes des entreprises &#224; compter du 1<sup>er</sup> janvier 2019&#160;; l&#8217;amendement de repli propose de reporter la mise en &#339;uvre de la mesure &#224; 2021 afin de permettre aux experts comptables d&#8217;avoir plus de temps pour r&#233;organiser leur activit&#233; professionnelle et aux &#233;tudiants de la fili&#232;re leur avenir.</p>"
  },
  "representations": [
    {
      "nom": "PDF",
      "typeMime": {
        "type": "application",
        "subType": "PDF"
      },
      "statutRepresentation": {
        "verbatim": true,
        "canonique": true,
        "officielle": true,
        "transcription": false,
        "enregistrement": false
      },
      "contenu": {
        "documentURI": "/15/amendements/1237/AN/620.pdf"
      }
    }
  ],
  "seanceDiscussion": "RUANR5L15S2018IDS21251",
  "sort": {
    "dateSaisie": "2018-09-27T17:55:19.000+02:00",
    "sortEnSeance": "Rejeté"
  },
  "dateDepot": "2018-09-19T02:00:00.000+02:00",
  "dateDistribution": "2018-09-24T02:00:00.000+02:00",
  "article99": "0",
  "loiReference": {}
}