{
  "uid": "AMANR5L15SEA717460B0235P2D1N1010",
  "identifiant": {
    "legislature": "15",
    "numero": "1010",
    "numRect": "0",
    "saisine": {
      "texteLegislatifRef": "PRJLANR5L15B0235",
      "numeroPartiePLF": "2",
      "organeExamen": "PO717460",
      "mentionSecondeDeliberation": "0"
    }
  },
  "numeroLong": "II-1010",
  "etapeTexte": "1ère lecture (1ère assemblée saisie)",
  "triAmendement": "zzzzzzzzzzzzzzzzs",
  "cardinaliteAmdtMultiples": "1",
  "etat": "Discuté",
  "signataires": {
    "auteur": {
      "typeAuteur": "Depute",
      "acteurRef": "PA642788",
      "groupePolitiqueRef": "PO730964"
    },
    "cosignatairesRefs": [
      "PA642788"
    ],
    "texteAffichable": "M.&#160;V&#233;ran"
  },
  "pointeurFragmentTexte": {
    "division": {
      "titre": "Article 44",
      "articleDesignationCourte": "APRÈS ART. 44",
      "type": "ARTICLE",
      "avantAApres": "Apres",
      "divisionRattachee": "APRÈS L'ARTICLE 44, insérer l'article suivant:",
      "articleAdditionnel": "1",
      "urlDivisionTexteVise": "/15/textes/0235C.asp#D_Article_44"
    }
  },
  "corps": {
    "dispositif": "<p style=\"text-align: justify;\">I.&#160;&#8211;&#160;&#192; la fin du V de l&#8217;article&#160;244&#160;<i>quater</i>&#160;Q du code g&#233;n&#233;ral des imp&#244;ts, l&#8217;ann&#233;e&#160;: &#171;&#160;2017&#160;&#187; est remplac&#233;e par l&#8217;ann&#233;e&#160;: &#171;&#160;2020&#160;&#187;.&#160;</p><p style=\"text-align: justify;\">II.&#160;&#8211;&#160;Le I n&#8217;est applicable qu&#8217;aux sommes venant en d&#233;duction de l&#8217;imp&#244;t d&#251;.</p><p style=\"text-align: justify;\">II.&#160;&#8211;&#160;La perte de recettes pour l&#8217;&#201;tat est compens&#233;e &#224; due concurrence par la cr&#233;ation d&#8217;une taxe additionnelle aux droits mentionn&#233;s aux articles 575 et 575 A du code g&#233;n&#233;ral des imp&#244;ts.</p>",
    "exposeSommaire": "<p style=\"text-align: justify;\">Cet amendement proroge de trois ans le cr&#233;dit d&#8217;imp&#244;t &#171;&#160;ma&#238;tre restaurateur&#160;&#187;.&#160;</p><p style=\"text-align: justify;\">Celui-ci est accord&#233; aux entreprises dont le dirigeant ou un salari&#233; est titulaire du titre de ma&#238;tre restaurateur, et qui engagent certaines d&#233;penses d&#8217;investissement de nature &#224; satisfaire les crit&#232;res du cahier des charges de ma&#238;tre restaurateur (stockage de produits frais, am&#233;lioration de l&#8217;hygi&#232;ne alimentaire, am&#233;lioration de l&#8217;accueil de la client&#232;le, am&#233;nagements permettant d&#8217;accueillir les personnes &#224; mobilit&#233; r&#233;duite, d&#233;penses d&#8217;audit).</p><p style=\"text-align: justify;\">Le taux du cr&#233;dit d&#8217;imp&#244;t est de 50&#160;% des d&#233;penses engag&#233;es, dans la limite de 30&#160;000&#160;euros.</p><p style=\"text-align: justify;\">Il est octroy&#233; l&#8217;ann&#233;e de l&#8217;obtention du titre de ma&#238;tre restaurateur, et les deux suivantes.</p><p style=\"text-align: justify;\">Le titre de ma&#238;tre-restaurateur est accord&#233; pour quatre ans par le pr&#233;fet , sous conditions notamment d&#8217;une qualification professionnelle reconnue et de la garantie d&#8217;une cuisine 100&#160;% faite maison.</p><p style=\"text-align: justify;\">Il est donc un gage de l&#8217;excellence de la la cuisine fran&#231;aise, qui valorise la fabrication artisanale et les circuits courts.&#160;</p><p style=\"text-align: justify;\">En l&#8217;&#233;tat du droit, le cr&#233;dit d&#8217;imp&#244;t ne peut &#234;tre accord&#233; que pour les titres d&#233;livr&#233;s jusqu&#8217;au 31&#160;d&#233;cembre 2017. Il convient donc de proroger ce dispositif utile&#160;; une prorogation pour trois ans permet de donner &#224; nos entreprises la visibilit&#233; n&#233;cessaire &#224; leur d&#233;veloppement.</p><p style=\"text-align: justify;\">Le co&#251;t de ce dispositif est modeste (5&#160;millions d&#8217;euros par an selon les derni&#232;res estimations).</p>"
  },
  "representations": [
    {
      "nom": "PDF",
      "typeMime": {
        "type": "application",
        "subType": "PDF"
      },
      "statutRepresentation": {
        "verbatim": true,
        "canonique": true,
        "officielle": true,
        "transcription": false,
        "enregistrement": false
      },
      "contenu": {
        "documentURI": "/15/amendements/0235C/AN/1010.pdf"
      }
    }
  ],
  "seanceDiscussion": "RUANR5L15S2018IDS20763",
  "sort": {
    "dateSaisie": "2017-11-17T00:55:43.000+01:00",
    "sortEnSeance": "Non soutenu"
  },
  "dateDepot": "2017-11-07T01:00:00.000+01:00",
  "dateDistribution": "2017-11-15T01:00:00.000+01:00",
  "article99": "0",
  "loiReference": {
    "codeLoi": "CGI",
    "divisionCodeLoi": "244 quater Q"
  }
}