{
  "uid": "AMANR5L15PO59048B1255P1D1N668",
  "identifiant": {
    "legislature": "15",
    "numero": "668",
    "numRect": "0",
    "saisine": {
      "texteLegislatifRef": "PRJLANR5L15B1255",
      "numeroPartiePLF": "1",
      "organeExamen": "PO59048",
      "mentionSecondeDeliberation": "0"
    }
  },
  "numeroLong": "I-CF668",
  "etapeTexte": "1ère lecture (1ère assemblée saisie)",
  "triAmendement": "bbiaaaaaaaaaaaaaaaaaaaaaaaaaaaaaaaaaaaaaaaaaaaaaaaeo",
  "cardinaliteAmdtMultiples": "1",
  "etat": "Discuté",
  "signataires": {
    "auteur": {
      "typeAuteur": "Depute",
      "acteurRef": "PA441",
      "groupePolitiqueRef": "PO730940"
    },
    "cosignatairesRefs": [
      "PA721270",
      "PA718926",
      "PA718720",
      "PA721118",
      "PA610654",
      "PA720546",
      "PA722110",
      "PA689",
      "PA610667",
      "PA720692",
      "PA335612",
      "PA441",
      "PA722202",
      "PA721012",
      "PA721896",
      "PA267306"
    ],
    "texteAffichable": "Mme&#160;Bello,  M.&#160;Brotherson, Mme&#160;K&#233;clard-Mond&#233;sir, M.&#160;Nilor, M.&#160;Serville, M.&#160;Bruneel, Mme&#160;Buffet, M.&#160;Chassaigne, M.&#160;Dharr&#233;ville, M.&#160;Dufr&#232;gne, Mme&#160;Faucillon, M.&#160;Jumel, M.&#160;Lecoq, M.&#160;Peu, M.&#160;Fabien&#160;Roussel et M.&#160;Wulfranc"
  },
  "pointeurFragmentTexte": {
    "division": {
      "titre": "Article 5",
      "articleDesignationCourte": "ART. 5",
      "type": "ARTICLE",
      "avantAApres": "A",
      "divisionRattachee": "ARTICLE 5",
      "urlDivisionTexteVise": "/15/textes/1255A.asp#D_Article_5"
    }
  },
  "corps": {
    "dispositif": "<p style=\"text-align: justify;\">Supprimer cet article.</p>",
    "exposeSommaire": "<p style=\"text-align: justify;\">Cette suppression de la TVA NPR ob&#233;it &#224; la m&#234;me logique que la suppression de l&#8217;abattement fiscal pr&#233;vu &#224; l&#8217;article 4&#160;: Faire financer par les Outre-mer eux-m&#234;mes leur d&#233;veloppement.</p><p style=\"text-align: justify;\">Ce sont encore les contribuables des Outre-mer qui devront participer, pour une bonne part, &#224; l&#8217;augmentation du budget de 20 % annonc&#233; par le gouvernement, et se substituer ainsi &#224; l&#8217;&#201;tat dans l&#8217;investissement programm&#233;. Bref, les territoires les plus fragiles doivent autofinancer leur d&#233;veloppement.</p>"
  },
  "representations": [
    {
      "nom": "PDF",
      "typeMime": {
        "type": "application",
        "subType": "PDF"
      },
      "statutRepresentation": {
        "verbatim": true,
        "canonique": true,
        "officielle": true,
        "transcription": false,
        "enregistrement": false
      },
      "contenu": {
        "documentURI": "/15/amendements/1255A/CION_FIN/CF668.pdf"
      }
    }
  ],
  "sort": {
    "dateSaisie": "2018-10-10T00:03:45.000+02:00",
    "sortEnSeance": "Rejeté"
  },
  "dateDepot": "2018-10-05T02:00:00.000+02:00",
  "dateDistribution": "2018-10-08T02:00:00.000+02:00",
  "article99": "0",
  "loiReference": {}
}