{
  "uid": "AMANR5L15SEA717460BTC1761P0D1N505",
  "identifiant": {
    "legislature": "15",
    "numero": "505",
    "numRect": "0",
    "saisine": {
      "texteLegislatifRef": "PRJLANR5L15BTC1761",
      "numeroPartiePLF": "0",
      "organeExamen": "PO717460",
      "mentionSecondeDeliberation": "0"
    }
  },
  "numeroLong": "505",
  "etapeTexte": "Nouvelle Lecture",
  "triAmendement": "aesaaaaaaaaaaaaaaaaaaaaaaaaaaaaaaaaaaaaaaaaaaaaaaadc",
  "cardinaliteAmdtMultiples": "1",
  "etat": "Irrecevable",
  "signataires": {
    "auteur": {
      "typeAuteur": "Depute",
      "acteurRef": "PA709315",
      "groupePolitiqueRef": "PO730934"
    },
    "cosignatairesRefs": [
      "PA718884",
      "PA718784",
      "PA346218",
      "PA719318",
      "PA721506",
      "PA267527",
      "PA267429",
      "PA720644",
      "PA718838",
      "PA267735",
      "PA709315",
      "PA334149",
      "PA718780",
      "PA606712",
      "PA718850",
      "PA330909",
      "PA721410",
      "PA643103",
      "PA1874",
      "PA720684"
    ],
    "texteAffichable": "M.&#160;Viala,  M.&#160;Cordier, M.&#160;Cinieri, Mme&#160;Kuster, M.&#160;Masson, M.&#160;Nury, Mme&#160;Anthoine, Mme&#160;Bazin-Malgras, M.&#160;Pauget, Mme&#160;Bonnivard, M.&#160;Pierre-Henri&#160;Dumont, Mme&#160;Trastour-Isnart, M.&#160;Brun, M.&#160;Le Fur, M.&#160;Lurton, M.&#160;Saddier, M.&#160;Descoeur, M.&#160;Ferrara, M.&#160;Fasquelle et M.&#160;de Ganay"
  },
  "pointeurFragmentTexte": {
    "division": {
      "titre": "Article 6",
      "articleDesignationCourte": "ART. 6",
      "type": "ARTICLE",
      "avantAApres": "A",
      "divisionRattachee": "ARTICLE 6",
      "urlDivisionTexteVise": "/15/textes/1761.asp#D_Article_6"
    },
    "alinea": {
      "numero": "17"
    }
  },
  "corps": {
    "dispositif": "<p style=\"text-align: justify;\">&#192; la fin de l&#8217;alin&#233;a&#160;17, substituer au mot&#160;:</p><p style=\"text-align: justify;\">&#171;&#160;cinquante&#160;&#187;</p><p style=\"text-align: justify;\">le mot&#160;:</p><p style=\"text-align: justify;\">&#171;&#160;cent&#160;&#187;.</p>",
    "exposeSommaire": "<p style=\"text-align: justify;\">Le souhait d&#8217;assouplir les contraintes qui p&#232;sent sur la croissance des entreprises est unanimement exprim&#233; par tout le tissu &#233;conomique fran&#231;ais et r&#233;pond &#224; une attente tr&#232;s forte. Il doit cependant pouvoir b&#233;n&#233;ficier &#224; toutes les strates qui composent le tissu &#233;conomique de notre pays.</p><p style=\"text-align: justify;\">La suppression du seuil de 20 employ&#233;s est un premier &#233;l&#233;ment de r&#233;ponse mais une immense majorit&#233; des PME se situent entre 20 et 50 salari&#233;s,&#160;n&#8217;atteindront jamais le seuil de 250 et sont brid&#233;es dans leur croissance par le seuil de 50 salari&#233;s. Il est donc propos&#233; par cet amendement de faire passer de 50 &#224; 100 le nouveau palier de mani&#232;re &#224; satisfaire l&#8217;attente des quantit&#233;s de PME qui ont besoin de cette marge de progression pour se d&#233;velopper sereinement.</p><p style=\"text-align: justify;\">Cette disposition correspond en outre &#224; la volont&#233; exprim&#233;e de mani&#232;re encore plus vive dans les territoires o&#249; n&#8217;existent quasi exclusivement que des PME et qui ont urgemment besoin d&#8217;un signal fort de la part de l&#8217;&#201;tat et du l&#233;gislateur.</p>"
  },
  "representations": [
    {
      "nom": "PDF",
      "typeMime": {
        "type": "application",
        "subType": "PDF"
      },
      "statutRepresentation": {
        "verbatim": true,
        "canonique": true,
        "officielle": true,
        "transcription": false,
        "enregistrement": false
      },
      "contenu": {
        "documentURI": "/15/amendements/1761/AN/505.pdf"
      }
    }
  ],
  "dateDepot": "2019-03-11T01:00:00.000+01:00",
  "dateDistribution": "2019-03-12T01:00:00.000+01:00",
  "article99": "0",
  "loiReference": {}
}