{
  "uid": "AMANR5L15PO59051B0778P0D1N87",
  "identifiant": {
    "legislature": "15",
    "numero": "87",
    "numRect": "0",
    "saisine": {
      "texteLegislatifRef": "PRJLANR5L15B0778",
      "numeroPartiePLF": "0",
      "organeExamen": "PO59051",
      "mentionSecondeDeliberation": "0"
    }
  },
  "numeroLong": "CL87",
  "etapeTexte": "1ère lecture (1ère assemblée saisie)",
  "triAmendement": "bjo",
  "cardinaliteAmdtMultiples": "1",
  "etat": "Discuté",
  "signataires": {
    "auteur": {
      "typeAuteur": "Depute",
      "acteurRef": "PA718768",
      "groupePolitiqueRef": "PO730964"
    },
    "cosignatairesRefs": [
      "PA718768"
    ],
    "texteAffichable": "Mme&#160;Valetta Ardisson"
  },
  "pointeurFragmentTexte": {
    "division": {
      "titre": "Article 2",
      "articleDesignationCourte": "ART. 2",
      "type": "ARTICLE",
      "avantAApres": "A",
      "divisionRattachee": "ARTICLE 2",
      "urlDivisionTexteVise": "/15/textes/0778.asp#D_Article_2"
    },
    "alinea": {
      "avantAApres": "Avant",
      "numero": "1",
      "alineaDesignation": "Avant l'alinéa 1"
    }
  },
  "corps": {
    "dispositif": "<p>Avant l&#8217;alin&#233;a&#160;1, ins&#233;rer les quatre alin&#233;as suivants&#160;:</p><p>&#171;&#160;I&#160;A.&#160;&#8211;&#160;La seconde phrase de l&#8217;article&#160;222&#8209;22&#8209;1 du code p&#233;nal est ainsi modifi&#233;&#160;:</p><p>&#171;&#160;1&#176;&#160;La seconde occurrence du mot&#160;: &#171;&#160;et&#160;&#187; est remplac&#233;e par le signe&#160;: &#171;&#160;,&#160;&#187;&#160;;</p><p>&#171;&#160;2&#176;&#160;Le mot&#160;: &#171;&#160;exerce&#160;&#187; est remplac&#233; par le mot&#160;: &#171;&#160;a&#160;&#187;&#160;;</p><p>&#171;&#160;3&#176;&#160;Sont ajout&#233;s les mots&#160;: &#171;&#160;et de l&#8217;&#233;tat de vuln&#233;rabilit&#233; de cette derni&#232;re&#160;&#187;.&#160;&#187;</p>",
    "exposeSommaire": "<p>Cette modification vise &#224; am&#233;liorer la reconnaissance du viol et des configurations qu&#8217;il peut recouvrir, afin que d&#8217;autres &#233;l&#233;ments constitutifs de la contrainte soient pr&#233;cis&#233;s dans le Code p&#233;nal:</p><p>- &#160;L&#8217;autorit&#233; de l&#8217;auteur sur la victime : certaines d&#233;cisions consid&#232;rent que la seule existence de la relation d&#8217;autorit&#233; permet de caract&#233;riser la contrainte notamment : pour un principal de coll&#232;ge ; pour un pr&#234;tre ; pour un employeur ; pour un examinateur de baccalaur&#233;at ; pour un psychiatre ; pour un professeur. En rempla&#231;ant propose les termes &#171; exerce sur la victime &#187; par &#171; a sur la victime &#187; cela suppose que l&#8217;&#233;tat d&#8217;autorit&#233; constitue &#224; lui seul une contrainte sans que l&#8217;exercice de cette autorit&#233; soit exig&#233;.</p><p>- &#160;La particuli&#232;re vuln&#233;rabilit&#233; de la victime (infirmit&#233;, d&#233;ficience physique ou psychique, maladie, etc&#8230;) affaiblit sa capacit&#233; de r&#233;sistance, c&#8217;est pourquoi, il est propos&#233; d&#8217;introduire dans la d&#233;finition de la contrainte l&#8217;&#233;tat de vuln&#233;rabilit&#233; de la victime au sens des articles 225-12-1 &#224; 225-15-1 et 223-15-2 du Code p&#233;nal.</p>"
  },
  "representations": [
    {
      "nom": "PDF",
      "typeMime": {
        "type": "application",
        "subType": "PDF"
      },
      "statutRepresentation": {
        "verbatim": true,
        "canonique": true,
        "officielle": true,
        "transcription": false,
        "enregistrement": false
      },
      "contenu": {
        "documentURI": "/15/amendements/0778/CION_LOIS/CL87.pdf"
      }
    }
  ],
  "sort": {
    "dateSaisie": "2018-05-09T18:19:10.000+02:00",
    "sortEnSeance": "Non soutenu"
  },
  "dateDepot": "2018-05-04T02:00:00.000+02:00",
  "dateDistribution": "2018-05-07T02:00:00.000+02:00",
  "article99": "0",
  "loiReference": {
    "codeLoi": "5",
    "divisionCodeLoi": "222-22-1"
  }
}