{
  "uid": "AMANR5L15SEA717460BTC1761P0D1N725",
  "identifiant": {
    "legislature": "15",
    "numero": "725",
    "numRect": "0",
    "saisine": {
      "texteLegislatifRef": "PRJLANR5L15BTC1761",
      "numeroPartiePLF": "0",
      "organeExamen": "PO717460",
      "mentionSecondeDeliberation": "0"
    }
  },
  "numeroLong": "725",
  "etapeTexte": "Nouvelle Lecture",
  "triAmendement": "aocaaaaaaaaaaaaaaaaaaaaaaaaaaaaaaaaaaaaaaaaaaaaaaasdo",
  "cardinaliteAmdtMultiples": "1",
  "etat": "Discuté",
  "signataires": {
    "auteur": {
      "typeAuteur": "Depute",
      "acteurRef": "PA608016",
      "groupePolitiqueRef": "PO730934"
    },
    "cosignatairesRefs": [
      "PA608016",
      "PA642847",
      "PA332523",
      "PA720644",
      "PA267260"
    ],
    "texteAffichable": "Mme&#160;Louwagie,  M.&#160;Bazin, Mme&#160;Poletti, Mme&#160;Dalloz et M.&#160;Nury"
  },
  "pointeurFragmentTexte": {
    "division": {
      "titre": "Article 9",
      "articleDesignationCourte": "ART. 9",
      "type": "ARTICLE",
      "avantAApres": "A",
      "divisionRattachee": "ARTICLE 9",
      "urlDivisionTexteVise": "/15/textes/1761.asp#D_Article_9"
    },
    "alinea": {
      "numero": "45"
    }
  },
  "corps": {
    "dispositif": "<p style=\"text-align: justify;\">I.&#160;&#8211;&#160;&#192; l&#8217;alin&#233;a&#160;45, apr&#232;s la r&#233;f&#233;rence&#160;:</p><p style=\"text-align: justify;\">&#171;&#160;L.&#160;225&#8209;42,&#160;&#187;,</p><p style=\"text-align: justify;\">ins&#233;rer les r&#233;f&#233;rences&#160;:</p><p style=\"text-align: justify;\">&#171;&#160;L.&#160;225&#8209;26, L.&#160;225&#8209;73,&#160;&#187;.</p><p style=\"text-align: justify;\">II.&#160;&#8211;&#160;En cons&#233;quence, au m&#234;me alin&#233;a, apr&#232;s la r&#233;f&#233;rence&#160;:</p><p style=\"text-align: justify;\">&#171;&#160;L.&#160;225&#8209;135,&#160;&#187;,</p><p style=\"text-align: justify;\">ins&#233;rer la r&#233;f&#233;rence&#160;:</p><p style=\"text-align: justify;\">&#171;&#160;L.&#160;225&#8209;204,&#160;&#187;.</p><p style=\"text-align: justify;\">III.&#160;&#8211;&#160;En cons&#233;quence, audit alin&#233;a, apr&#232;s la r&#233;f&#233;rence&#160;:</p><p style=\"text-align: justify;\">&#171;&#160;L.&#160;227&#8209;10,&#160;&#187;,</p><p style=\"text-align: justify;\">ins&#233;rer la r&#233;f&#233;rence&#160;:</p><p style=\"text-align: justify;\">&#171;&#160;L.&#160;228&#8209;92,&#160;&#187;.</p><p style=\"text-align: justify;\">IV.&#160;&#8211;&#160;En cons&#233;quence, compl&#233;ter le m&#234;me alin&#233;a par la r&#233;f&#233;rence&#160;:</p><p style=\"text-align: justify;\">&#171;&#160;et au deuxi&#232;me alin&#233;a de l&#8217;article L.&#160;823&#8209;10&#160;&#187;.</p>",
    "exposeSommaire": "<p style=\"text-align: justify;\">Amendement de coordination concernant les diligences que le commissaire aux comptes n&#8217;est pas tenu d&#8217;effectuer dans le cadre de la mission d&#233;finie &#224; l&#8217;article L.&#160;823&#8209;12&#8209;1 du code de commerce.</p>"
  },
  "representations": [
    {
      "nom": "PDF",
      "typeMime": {
        "type": "application",
        "subType": "PDF"
      },
      "statutRepresentation": {
        "verbatim": true,
        "canonique": true,
        "officielle": true,
        "transcription": false,
        "enregistrement": false
      },
      "contenu": {
        "documentURI": "/15/amendements/1761/AN/725.pdf"
      }
    }
  ],
  "seanceDiscussion": "RUANR5L15S2019IDS21552",
  "sort": {
    "dateSaisie": "2019-03-15T18:46:22.000+01:00",
    "sortEnSeance": "Rejeté"
  },
  "dateDepot": "2019-03-11T01:00:00.000+01:00",
  "dateDistribution": "2019-03-12T01:00:00.000+01:00",
  "article99": "0",
  "loiReference": {}
}