{
  "uid": "AMANR5L15SEA717460B1490P0D1N1204",
  "identifiant": {
    "legislature": "15",
    "numero": "1204",
    "numRect": "0",
    "saisine": {
      "texteLegislatifRef": "PRJLANR5L15B1490",
      "numeroPartiePLF": "0",
      "organeExamen": "PO717460",
      "mentionSecondeDeliberation": "0"
    }
  },
  "numeroLong": "1204",
  "etapeTexte": "Nouvelle Lecture",
  "triAmendement": "aaoaaaaaaaaaaaaaaaaaaaaaaaaaaaaaaaaaaaaaaaaaaaaaaai",
  "cardinaliteAmdtMultiples": "1",
  "etat": "Discuté",
  "signataires": {
    "auteur": {
      "typeAuteur": "Gouvernement"
    },
    "texteAffichable": "le Gouvernement"
  },
  "pointeurFragmentTexte": {
    "division": {
      "titre": "Article 2",
      "articleDesignationCourte": "APRÈS ART. 2",
      "type": "ARTICLE",
      "avantAApres": "Apres",
      "divisionRattachee": "APRÈS L'ARTICLE 2, insérer l'article suivant:",
      "articleAdditionnel": "1",
      "urlDivisionTexteVise": "/15/textes/1490.asp#D_Article_2"
    }
  },
  "corps": {
    "dispositif": "<p style=\"text-align: justify;\">I.&#160;&#8211;&#160;Le 19&#176;&#160;<i>ter</i> de l&#8217;article&#160;81 du code g&#233;n&#233;ral des imp&#244;ts est compl&#233;t&#233; par un <i>c</i> ainsi r&#233;dig&#233;&#160;:</p><p style=\"text-align: justify;\">&#171;&#160;<i>c</i>. En l&#8217;absence de prise en charge pr&#233;vue &#224; l&#8217;article&#160;L.&#160;3261&#8209;2 du code du travail, l&#8217;avantage r&#233;sultant de la prise en charge, par une collectivit&#233; territoriale, par un &#233;tablissement public de coop&#233;ration intercommunale ou par P&#244;le emploi, des frais de carburant ou d&#8217;alimentation de v&#233;hicules &#233;lectriques engag&#233;s par les salari&#233;s pour leurs d&#233;placements entre leur r&#233;sidence habituelle et leur lieu de travail lorsqu&#8217;ils sont situ&#233;s &#224; une distance d&#8217;au moins trente kilom&#232;tres l&#8217;un de l&#8217;autre, ou pour leurs d&#233;placements entre leur r&#233;sidence habituelle et leur lieu de travail en tant que conducteur en covoiturage quelle que soit la distance, dans la limite de 240&#160;&#8364; par an&#160;;&#160;&#187;.</p><p style=\"text-align: justify;\">II.&#160;&#8211;&#160;Le <i>e</i> du 4&#176;&#160;du III de l&#8217;article&#160;L.&#160;136&#8209;1&#8209;1 du code de la s&#233;curit&#233; sociale est compl&#233;t&#233; par les mots&#160;: &#171;&#160;, ainsi que l&#8217;avantage mentionn&#233; au c du 19&#176;&#160;<i>ter</i> de cet article&#160;pr&#233;cit&#233;, dans la limite pr&#233;vue au m&#234;me <i>c</i>&#160;&#187;.</p><p style=\"text-align: justify;\">III.&#160;&#8211;&#160;L&#8217;article&#160;L.&#160;3261&#8209;3&#8209;1 du code du travail est ainsi modifi&#233;&#160;:</p><p style=\"text-align: justify;\">1&#176;&#160;Le premier alin&#233;a est compl&#233;t&#233; par les mots&#160;: &#171;&#160;ou, lorsque les salari&#233;s effectuent ces d&#233;placements en tant que passagers en covoiturage, sous la forme d&#8217;une&#160;&#187;indemnit&#233; forfaitaire covoiturage&#171;&#160;dont les modalit&#233;s sont pr&#233;cis&#233;es par d&#233;cret&#160;&#187;&#160;;</p><p style=\"text-align: justify;\">2&#176;&#160;Au second alin&#233;a, les mots&#160;: &#171;&#160;cette prise en charge&#160;&#187; sont remplac&#233;s par les mots&#160;: &#171;&#160;ces indemnit&#233;s&#160;&#187; et le mot&#160;: &#171;&#160;celle&#160;&#187; est remplac&#233; par les mots&#160;: &#171;&#160;la prise en charge&#160;&#187;.</p>",
    "exposeSommaire": "<p style=\"text-align: justify;\">Le pr&#233;sent amendement a pour objet de r&#233;tablir l&#8217;article&#160;58 ter, adopt&#233; en premi&#232;re lecture par l&#8217;Assembl&#233;e nationale, tout en avan&#231;ant l&#8217;entr&#233;e en vigueur de l&#8217;exon&#233;ration des aides des collectivit&#233;s territoriales d&#232;s l&#8217;imposition des revenus de l&#8217;ann&#233;e 2018 et celle de l&#8217;extension au covoiturage de l&#8217;aide facultative vers&#233;e par l&#8217;employeur &#224; compter de la publication de la pr&#233;sente loi, en lieu et place de l&#8217;entr&#233;e en vigueur au 1<sup>er</sup>&#160;janvier&#160;2020 pr&#233;vue par l&#8217;article adopt&#233; en premi&#232;re lecture.</p><p style=\"text-align: justify;\">Il est rappel&#233; que l&#8217;article&#160;58<i> ter</i> adopt&#233; par l&#8217;Assembl&#233;e nationale vise en premier lieu &#224; limiter les in&#233;galit&#233;s de traitement entre les modes de transport en donnant la possibilit&#233; aux employeurs qui souhaitent accompagner le d&#233;veloppement du covoiturage de rembourser une partie des frais engag&#233;s par leurs salari&#233;s lorsqu&#8217;ils se d&#233;placent en covoiturage, en tant que passagers.</p><p style=\"text-align: justify;\">En effet, la pratique du covoiturage, vertueuse sur les plans social et environnemental, doit &#234;tre encourag&#233;e. Le covoiturage contribue, en outre, &#224; pr&#233;server le pouvoir d&#8217;achat en permettant de partager les frais du d&#233;placement.</p><p style=\"text-align: justify;\">En zones denses, le covoiturage permet de limiter les difficult&#233;s r&#233;currentes et croissantes de congestion routi&#232;re. En zones peu denses, o&#249; le d&#233;veloppement d&#8217;une offre de transport en commun r&#233;guli&#232;re est complexe &#224; mettre en &#339;uvre et o&#249; la voiture reste une solution de mobilit&#233; incontournable, le covoiturage permet d&#8217;apporter des solutions alternatives pertinentes et efficaces. Il permet ainsi d&#8217;optimiser l&#8217;utilisation des v&#233;hicules et des infrastructures qui les supportent et de r&#233;duire l&#8217;empreinte environnementale et sanitaire de l&#8217;automobile, tout en pr&#233;servant le pouvoir d&#8217;achat.</p><p style=\"text-align: justify;\">Cet article ajoute donc le covoiturage en tant que passager dans les moyens de transports des trajets domicile-travail pouvant faire l&#8217;objet d&#8217;un soutien de l&#8217;employeur sans charges sociales ni imp&#244;t sur le revenu, dans la limite de 200&#160;&#8364; par an.</p><p style=\"text-align: justify;\">Il permet d&#8217;anticiper le projet de loi d&#8217;orientation des mobilit&#233;s qui proposera une refonte plus compl&#232;te des dispositifs de soutien aux trajets domicile-travail.</p><p style=\"text-align: justify;\">Par ailleurs, certaines collectivit&#233;s territoriales ont mis en place des aides au transport vers&#233;es aux salari&#233;s qui utilisent leur v&#233;hicule personnel pour leurs d&#233;placements entre leur r&#233;sidence habituelle et leur lieu de travail. Ces aides constituent en principe un compl&#233;ment de r&#233;mun&#233;ration imposable &#224; l&#8217;imp&#244;t sur le revenu et soumis &#224; cotisations et contributions sociales.</p><p style=\"text-align: justify;\">L&#8217;article&#160;58 <i>ter</i> adopt&#233; par l&#8217;Assembl&#233;e nationale pr&#233;voit en cons&#233;quence, d&#8217;exon&#233;rer d&#8217;imp&#244;t sur le revenu et de cotisations et contributions sociales, dans la limite de 240&#160;&#8364; par an (soit 20&#160;&#8364; par mois), les aides vers&#233;es, en l&#8217;absence de prise en charge par l&#8217;employeur des titres d&#8217;abonnements de transports publics, par les collectivit&#233;s territoriales (ou leurs &#233;tablissements publics de coop&#233;ration intercommunale), destin&#233;es &#224; couvrir les frais de carburant ou d&#8217;alimentation de v&#233;hicules &#233;lectriques engag&#233;s par les salari&#233;s pour leurs d&#233;placements avec leur v&#233;hicule personnel entre leur domicile et leur lieu de travail lorsqu&#8217;ils sont situ&#233;s &#224; au moins trente kilom&#232;tres l&#8217;un de l&#8217;autre, ou pour leurs d&#233;placements entre leur r&#233;sidence habituelle et leur lieu de travail en tant que conducteur en covoiturage, quelle que soit la distance parcourue &#224; ce titre.</p><p style=\"text-align: justify;\">Enfin, cet article &#233;tend, dans les m&#234;mes conditions, ces exon&#233;rations &#224; l&#8217;aide &#224; la mobilit&#233; relative aux frais de d&#233;placements vers&#233;e par P&#244;le emploi.</p><p style=\"text-align: justify;\">L&#8217;avancement de l&#8217;entr&#233;e en vigueur g&#233;n&#233;rant un impact sur l&#8217;&#233;quilibre budg&#233;taire 2019, il convient de r&#233;tablir cet article en premi&#232;re partie de la loi de finances.</p>"
  },
  "representations": [
    {
      "nom": "PDF",
      "typeMime": {
        "type": "application",
        "subType": "PDF"
      },
      "statutRepresentation": {
        "verbatim": true,
        "canonique": true,
        "officielle": true,
        "transcription": false,
        "enregistrement": false
      },
      "contenu": {
        "documentURI": "/15/amendements/1490/AN/1204.pdf"
      }
    }
  ],
  "seanceDiscussion": "RUANR5L15S2019IDS21432",
  "sort": {
    "dateSaisie": "2018-12-18T18:57:47.000+01:00",
    "sortEnSeance": "Adopté"
  },
  "dateDepot": "2018-12-15T01:00:00.000+01:00",
  "dateDistribution": "2018-12-17T01:00:00.000+01:00",
  "article99": "1",
  "loiReference": {
    "codeLoi": "CGI",
    "divisionCodeLoi": "81"
  }
}