{
  "uid": "AMANR5L15PO59051B1349P0D1N661",
  "identifiant": {
    "legislature": "15",
    "numero": "661",
    "numRect": "0",
    "saisine": {
      "texteLegislatifRef": "PRJLANR5L15B1349",
      "numeroPartiePLF": "0",
      "organeExamen": "PO59051",
      "mentionSecondeDeliberation": "0"
    }
  },
  "numeroLong": "CL661",
  "etapeTexte": "1ère lecture (2ème assemblée saisie)",
  "triAmendement": "iaoaaaaaaaaaaaaaaaaaaaaaaaaaaaaaaaaaaaaaaaaaaaaaaab",
  "cardinaliteAmdtMultiples": "1",
  "etat": "Discuté",
  "signataires": {
    "auteur": {
      "typeAuteur": "Depute",
      "acteurRef": "PA330240",
      "groupePolitiqueRef": "PO730934"
    },
    "cosignatairesRefs": [
      "PA718780",
      "PA642847",
      "PA721968",
      "PA718884",
      "PA330240",
      "PA767",
      "PA334654",
      "PA720684"
    ],
    "texteAffichable": "M.&#160;Ciotti,  Mme&#160;Bazin-Malgras, M.&#160;Vialay, M.&#160;Straumann, M.&#160;Bazin, M.&#160;Cattin, M.&#160;Pierre-Henri&#160;Dumont et Mme&#160;Trastour-Isnart"
  },
  "pointeurFragmentTexte": {
    "division": {
      "titre": "Article 43",
      "articleDesignationCourte": "AVANT ART. 43",
      "type": "ARTICLE",
      "avantAApres": "Avant",
      "divisionRattachee": "AVANT L'ARTICLE 43, insérer l'article suivant:",
      "articleAdditionnel": "1",
      "urlDivisionTexteVise": "/15/textes/1349.asp#D_Article_43"
    }
  },
  "corps": {
    "dispositif": "<p>Au d&#233;but du premier alin&#233;a de l&#8217;article&#160;712&#8209;1 du code de proc&#233;dure p&#233;nale, est ins&#233;r&#233;e une phrase ainsi r&#233;dig&#233;e&#160;: &#171;&#160;L&#8217;ex&#233;cution des peines est sous la responsabilit&#233; du parquet.&#160;&#187;</p><p>&#160;</p>",
    "exposeSommaire": "<p>Cet amendement vise &#224; placer l&#8217;ex&#233;cution des peines sous la responsabilit&#233; du parquet.</p><p>Cette proposition est l&#8217;une des 50 propositions contenues dans le rapport &#171;&#160;Pour renforcer l&#8217;efficacit&#233; de l&#8217;ex&#233;cution des peines&#160;&#187; que j&#8217;ai remis au Pr&#233;sident de la R&#233;publique, Nicolas Sarkozy, en juin 2011.</p><p>La superposition de multiples intervenants, la d&#233;naturation des fonctions du juge d&#8217;application des peines du juridictionnel vers l&#8217;administratif ont entrain&#233; une baisse d&#8217;efficacit&#233; de notre syst&#232;me p&#233;nal. Ainsi, il convient d&#8217;instituer le parquet en v&#233;ritable pilote de l&#8217;application des peines. Cette nouvelle position lui permettra de mener une v&#233;ritable politique de gestion des peines d&#8217;emprisonnement concernant les condamn&#233;s libres.</p>"
  },
  "representations": [
    {
      "nom": "PDF",
      "typeMime": {
        "type": "application",
        "subType": "PDF"
      },
      "statutRepresentation": {
        "verbatim": true,
        "canonique": true,
        "officielle": true,
        "transcription": false,
        "enregistrement": false
      },
      "contenu": {
        "documentURI": "/15/amendements/1349/CION_LOIS/CL661.pdf"
      }
    }
  ],
  "sort": {
    "dateSaisie": "2018-11-09T11:29:26.000+01:00",
    "sortEnSeance": "Non soutenu"
  },
  "dateDepot": "2018-11-02T01:00:00.000+01:00",
  "dateDistribution": "2018-11-07T01:00:00.000+01:00",
  "article99": "0",
  "loiReference": {
    "codeLoi": "procédure pénale",
    "divisionCodeLoi": "712-1"
  }
}