{
  "uid": "AMANR5L15SEA717460B0269P0D1N330",
  "identifiant": {
    "legislature": "15",
    "numero": "330",
    "numRect": "0",
    "saisine": {
      "texteLegislatifRef": "PRJLANR5L15B0269",
      "numeroPartiePLF": "0",
      "organeExamen": "PO717460",
      "mentionSecondeDeliberation": "0"
    }
  },
  "numeroLong": "330",
  "etapeTexte": "1ère lecture (1ère assemblée saisie)",
  "triAmendement": "cg",
  "cardinaliteAmdtMultiples": "1",
  "etat": "Discuté",
  "signataires": {
    "auteur": {
      "typeAuteur": "Depute",
      "acteurRef": "PA718926",
      "groupePolitiqueRef": "PO730940"
    },
    "cosignatairesRefs": [
      "PA721118",
      "PA441",
      "PA689",
      "PA721896",
      "PA722202",
      "PA610654",
      "PA267306",
      "PA720546",
      "PA610634",
      "PA718926",
      "PA335612",
      "PA720692",
      "PA722110",
      "PA610667",
      "PA718720",
      "PA721270"
    ],
    "texteAffichable": "M.&#160;Dharr&#233;ville,  M.&#160;Azerot, Mme&#160;Bello, M.&#160;Brotherson, M.&#160;Bruneel, Mme&#160;Buffet, M.&#160;Chassaigne, M.&#160;Dufr&#232;gne, Mme&#160;Faucillon, M.&#160;Jumel, M.&#160;Lecoq, M.&#160;Nilor, M.&#160;Peu, M.&#160;Fabien&#160;Roussel, M.&#160;Serville et M.&#160;Wulfranc"
  },
  "pointeurFragmentTexte": {
    "division": {
      "titre": "Article 44",
      "articleDesignationCourte": "APRÈS ART. 44",
      "type": "ARTICLE",
      "avantAApres": "Apres",
      "divisionRattachee": "APRÈS L'ARTICLE 44, insérer l'article suivant:",
      "articleAdditionnel": "1",
      "urlDivisionTexteVise": "/15/textes/0269.asp#D_Article_44"
    }
  },
  "corps": {
    "dispositif": "<p style=\"text-align: justify;\">L&#8217;&#201;tat peut autoriser, &#224; compter du 1<sup>er</sup> janvier 2018, &#224; titre d&#8217;exp&#233;rimentation et pour une dur&#233;e n&#8217;exc&#233;dant pas trois ann&#233;es, la mise en place du tiers payant int&#233;gral pour les &#233;tudiants affili&#233;s au r&#233;gime de s&#233;curit&#233; sociale &#233;tudiante. Cette exp&#233;rimentation est limit&#233;e &#224; la r&#233;gion Bretagne.</p>",
    "exposeSommaire": "<p style=\"text-align: justify;\">Cet amendement vise &#224; am&#233;liorer l&#8217;acc&#232;s aux soins des &#233;tudiants. Selon l&#8217;Observatoire de la Vie Etudiante, 36&#160;% des &#233;tudiants ont renonc&#233; &#224; se soigner au cours des 12 derniers mois, dont 25&#160;% pour des raisons financi&#232;res, et 87&#160;% des &#233;tudiants n&#8217;utilisent pas le service de sant&#233; de leur universit&#233;</p><p style=\"text-align: justify;\">Cette extension du tiers payant aux &#233;tudiants affili&#233;s au r&#233;gime &#233;tudiant de s&#233;curit&#233; sociale est rendue n&#233;cessaire en raison des crit&#232;res inad&#233;quats pour l&#8217;acc&#232;s &#224; l&#8217;aide au paiement d&#8217;une compl&#233;mentaire sant&#233; (ACS).&#160;</p>"
  },
  "representations": [
    {
      "nom": "PDF",
      "typeMime": {
        "type": "application",
        "subType": "PDF"
      },
      "statutRepresentation": {
        "verbatim": true,
        "canonique": true,
        "officielle": true,
        "transcription": false,
        "enregistrement": false
      },
      "contenu": {
        "documentURI": "/15/amendements/0269/AN/330.pdf"
      }
    }
  ],
  "seanceDiscussion": "RUANR5L15S2018IDS20714",
  "sort": {
    "dateSaisie": "2017-10-28T01:49:05.000+02:00",
    "sortEnSeance": "Rejeté"
  },
  "dateDepot": "2017-10-19T02:00:00.000+02:00",
  "dateDistribution": "2017-10-23T02:00:00.000+02:00",
  "article99": "0",
  "loiReference": {}
}