{
  "uid": "AMANR5L15PO59051B1255P2D1N33",
  "identifiant": {
    "legislature": "15",
    "numero": "33",
    "numRect": "0",
    "saisine": {
      "texteLegislatifRef": "PRJLANR5L15B1255",
      "numeroPartiePLF": "2",
      "organeExamen": "PO59051",
      "mentionSecondeDeliberation": "0"
    }
  },
  "numeroLong": "II-CL33",
  "etapeTexte": "1ère lecture (1ère assemblée saisie)",
  "triAmendement": "amaaaaaaaaaaaaaaaaaaaaaaaaaaaaaaaaaaaaaaaaaaaaaaaaei",
  "cardinaliteAmdtMultiples": "1",
  "etat": "Discuté",
  "signataires": {
    "auteur": {
      "typeAuteur": "Depute",
      "acteurRef": "PA719608",
      "groupePolitiqueRef": "PO723569"
    },
    "cosignatairesRefs": [
      "PA719608"
    ],
    "texteAffichable": "Mme&#160;M&#233;nard"
  },
  "pointeurFragmentTexte": {
    "missionVisee": {
      "idMissionAN": "418",
      "libelleMission": "Sécurités",
      "codeMissionPLF": "B",
      "libelleMissionPLF": "Répartition, par mission et programme, des crédits du budget général"
    },
    "division": {
      "titre": "ÉTAT B",
      "articleDesignationCourte": "ART. 39",
      "type": "ANNEXE",
      "avantAApres": "A",
      "divisionRattachee": "ARTICLE 39",
      "urlDivisionTexteVise": "/15/textes/1255C.asp#D_ETAT_B"
    }
  },
  "corps": {
    "exposeSommaire": "<p style=\"text-align: justify;\">Transf&#233;rer 10 000 000&#160;euros du programme 207 (s&#233;curit&#233; et &#233;ducation routi&#232;res), action 02 (d&#233;marches interminist&#233;rielles et communication) vers le programme 176 (police nationale), action 06 (commandement, ressources humaines et logistique)-03 (immobilier)</p><p style=\"text-align: justify;\">Les locaux v&#233;tustes de la police (pour certains envahis de rats, de cafards, de blattes, de fuites d&#8217;eau, de sanitaires insalubres &#8230;) ne permettent pas &#224; la police de travailler dans des conditions de travail dignes. Il convient de mettre un place un dispositif financier important pour r&#233;nover les commissariats.</p>",
    "dispositifAmdtCredit": {
      "listeProgrammes": [
        {
          "libelle": "Police nationale",
          "id": "21747",
          "AE": {
            "montantPositif": "10000000",
            "montantNegatif": "0"
          },
          "CP": {
            "montantPositif": "10000000",
            "montantNegatif": "0"
          },
          "action": "modification"
        },
        {
          "libelle": "Gendarmerie nationale",
          "id": "21748",
          "AE": {
            "montantPositif": "0",
            "montantNegatif": "0"
          },
          "CP": {
            "montantPositif": "0",
            "montantNegatif": "0"
          },
          "action": "modification"
        },
        {
          "libelle": "Sécurité et éducation routières",
          "id": "21749",
          "AE": {
            "montantPositif": "0",
            "montantNegatif": "10000000"
          },
          "CP": {
            "montantPositif": "0",
            "montantNegatif": "10000000"
          },
          "action": "modification"
        },
        {
          "libelle": "Sécurité civile",
          "id": "21750",
          "AE": {
            "montantPositif": "0",
            "montantNegatif": "0"
          },
          "CP": {
            "montantPositif": "0",
            "montantNegatif": "0"
          },
          "action": "modification"
        }
      ],
      "totalAE": {
        "montantPositif": "10000000",
        "montantNegatif": "10000000",
        "solde": "0"
      },
      "totalCP": {
        "montantPositif": "10000000",
        "montantNegatif": "10000000",
        "solde": "0"
      }
    }
  },
  "representations": [
    {
      "nom": "PDF",
      "typeMime": {
        "type": "application",
        "subType": "PDF"
      },
      "statutRepresentation": {
        "verbatim": true,
        "canonique": true,
        "officielle": true,
        "transcription": false,
        "enregistrement": false
      },
      "contenu": {
        "documentURI": "/15/amendements/1255C/CION_LOIS/CL33.pdf"
      }
    }
  ],
  "sort": {
    "dateSaisie": "2018-10-25T16:40:50.000+02:00",
    "sortEnSeance": "Non soutenu"
  },
  "dateDepot": "2018-10-22T02:00:00.000+02:00",
  "dateDistribution": "2018-10-24T02:00:00.000+02:00",
  "article99": "0",
  "loiReference": {
    "codeLoi": "05"
  }
}