{
  "uid": "AMANR5L15SEA717460B0235P1D1N699",
  "identifiant": {
    "legislature": "15",
    "numero": "699",
    "numRect": "0",
    "saisine": {
      "texteLegislatifRef": "PRJLANR5L15B0235",
      "numeroPartiePLF": "1",
      "organeExamen": "PO717460",
      "mentionSecondeDeliberation": "0"
    }
  },
  "numeroLong": "I-699",
  "etapeTexte": "1ère lecture (1ère assemblée saisie)",
  "triAmendement": "abz",
  "cardinaliteAmdtMultiples": "1",
  "etat": "Discuté",
  "signataires": {
    "auteur": {
      "typeAuteur": "Depute",
      "acteurRef": "PA607090",
      "groupePolitiqueRef": "PO730934"
    },
    "cosignatairesRefs": [
      "PA607090"
    ],
    "texteAffichable": "M.&#160;Jean-Pierre&#160;Vigier"
  },
  "pointeurFragmentTexte": {
    "division": {
      "titre": "Article 3",
      "articleDesignationCourte": "ART. 3",
      "type": "ARTICLE",
      "avantAApres": "A",
      "divisionRattachee": "ARTICLE 3",
      "urlDivisionTexteVise": "/15/textes/0235A.asp#D_Article_3"
    }
  },
  "corps": {
    "dispositif": "<p>Supprimer cet article.</p>",
    "exposeSommaire": "<p style=\"text-align: justify;\">Le pr&#233;sent amendement vise &#224; supprimer ce d&#233;gr&#232;vement de la taxe d&#8217;habitation et donc &#224; maintenir le fonctionnement actuel de perception de la taxe d&#8217;habitation par les collectivit&#233;s territoriales.</p><p style=\"text-align: justify;\">Cet abattement de taxe d&#8217;habitation pour une partie des Fran&#231;ais est une mesure trompeuse qui constitue une mise sous tutelle des collectivit&#233;s par l&#8217;&#201;tat. C&#8217;est une v&#233;ritable mesure de recentralisation qui enl&#232;ve une ressource fiscale &#224; l&#8217;&#233;chelon communale&#160;</p><p style=\"text-align: justify;\">Ces collectivit&#233;s vont perdre une ressource dynamique et la compensation par l&#8217;&#201;tat est incertaine dans le temps. L&#8217;&#201;tat ne prendra en charge les d&#233;gr&#232;vements en compensant les pertes pour les collectivit&#233;s, mais seulement dans la limite des taux vot&#233;s en 2017.</p><p style=\"text-align: justify;\">Cela pose un probl&#232;me d&#8217;&#233;quit&#233; puisque dans certaines communes modestes, seule une toute petite minorit&#233; des contribuables payera la taxe d&#8217;habitation. Seule cette petite minorit&#233; encaissera donc une &#233;ventuelle augmentation des taux dans les ann&#233;es &#224; venir. Le probl&#232;me d&#8217;&#233;quit&#233; est d&#8217;autant plus aigu que les effets de seuils seront particuli&#232;rement brutaux.</p><p style=\"text-align: justify;\">Enfin, en substituant le contribuable national au contribuable local, cette mesure d&#233;connectera une partie des Fran&#231;ais du financement de la d&#233;pense locale. En effet, cela conduira &#224; une totale d&#233;responsabilisation des habitants des communes qui b&#233;n&#233;ficieront des infrastructures ou des services de la commune sans contribuer &#224; leur financement ou leur entretien.&#160;</p><p style=\"text-align: justify;\">Le pr&#233;sent amendement propose donc de supprimer cet article.&#160;</p>"
  },
  "representations": [
    {
      "nom": "PDF",
      "typeMime": {
        "type": "application",
        "subType": "PDF"
      },
      "statutRepresentation": {
        "verbatim": true,
        "canonique": true,
        "officielle": true,
        "transcription": false,
        "enregistrement": false
      },
      "contenu": {
        "documentURI": "/15/amendements/0235A/AN/699.pdf"
      }
    }
  ],
  "seanceDiscussion": "RUANR5L15S2018IDS20768",
  "sort": {
    "dateSaisie": "2017-10-21T10:38:29.000+02:00",
    "sortEnSeance": "Non soutenu"
  },
  "dateDepot": "2017-10-13T02:00:00.000+02:00",
  "dateDistribution": "2017-10-16T02:00:00.000+02:00",
  "article99": "0",
  "loiReference": {}
}