{
  "uid": "AMANR5L15SEA717460BTC1662P0D1N54",
  "identifiant": {
    "legislature": "15",
    "numero": "54",
    "numRect": "0",
    "saisine": {
      "texteLegislatifRef": "PIONANR5L15BTC1662",
      "numeroPartiePLF": "0",
      "organeExamen": "PO717460",
      "mentionSecondeDeliberation": "0"
    }
  },
  "numeroLong": "54",
  "etapeTexte": "1ère lecture (2ème assemblée saisie)",
  "triAmendement": "baaaaaaaaaaaaaaaaaaaaaaaaaaaaaaaaaaaaaaaaaaaaaaaaaaazy",
  "cardinaliteAmdtMultiples": "1",
  "etat": "Retiré",
  "signataires": {
    "auteur": {
      "typeAuteur": "Depute",
      "acteurRef": "PA720538",
      "groupePolitiqueRef": "PO730964"
    },
    "cosignatairesRefs": [
      "PA720538"
    ],
    "texteAffichable": "Mme&#160;De Temmerman"
  },
  "pointeurFragmentTexte": {
    "division": {
      "titre": "Article 2",
      "articleDesignationCourte": "ART. 2",
      "type": "ARTICLE",
      "avantAApres": "A",
      "divisionRattachee": "ARTICLE 2",
      "urlDivisionTexteVise": "/15/textes/1662.asp#D_Article_2"
    },
    "alinea": {
      "numero": "2"
    }
  },
  "corps": {
    "dispositif": "<p style=\"text-align: justify;\">&#192; la premi&#232;re phrase de l&#8217;alin&#233;a&#160;2, apr&#232;s le mot&#160;:</p><p style=\"text-align: justify;\">&#171;&#160;soins,&#160;&#187;</p><p style=\"text-align: justify;\">ins&#233;rer les mots&#160;: </p><p style=\"text-align: justify;\">&#171;&#160;&#224; l&#8217;&#233;ducation,&#160;&#187;.</p>",
    "exposeSommaire": "<p style=\"text-align: justify;\">L&#8217;examen en commission de la pr&#233;sente proposition de loi a pr&#233;cis&#233; que les projets soutenus et accompagn&#233;s par l&#8217;Agence Nationale de la Coh&#233;sion des Territoires s&#8217;inscrivaient en faveur de l&#8217;acc&#232;s aux soins et aux transports.</p><p style=\"text-align: justify;\">Un autre service public, tout aussi essentiel, ne fait cependant l&#8217;objet d&#8217;aucune mention dans la proposition de loi. Il s&#8217;agit de l&#8217;&#233;ducation, un secteur toujours autant prioritaire compte tenu du nombre important d&#8217;enfants encore d&#233;scolaris&#233;s en France. Tout comme pour le d&#233;veloppement des services publics de sant&#233; et de transport, le d&#233;veloppement des services publics d&#8217;&#233;ducation s&#8217;inscrit dans une logique de valorisation et de coh&#233;sion territoriale.</p><p style=\"text-align: justify;\">En mentionnant sp&#233;cifiquement dans les missions de l&#8217;Agence, l&#8217;accompagnement des territoires par une accessibilit&#233; renforc&#233;e &#224; l&#8217;&#233;ducation, cela permettra &#224; cette loi de cibler encore plus les territoires en d&#233;crochage &#233;conomique et social. Aujourd&#8217;hui, les enjeux scolaires ne sont pas toujours adapt&#233;s aux probl&#233;matiques rurales et l&#8217;&#233;loignement g&#233;ographique n&#8217;est pas suffisamment int&#233;gr&#233; dans l&#8217;organisation acad&#233;mique locale. Ceci est d&#8217;autant plus dommageable que les fonctions de base des &#233;coles, plac&#233;es aux c&#339;ur d&#8217;une activit&#233; plurielle, pourraient s&#8217;en trouver enrichies.</p><p style=\"text-align: justify;\">Cet amendement propose donc que l&#8217;Agence Nationale de la Coh&#233;sion des Territoires permette aux collectivit&#233;s locales de b&#233;n&#233;ficier d&#8217;une accessibilit&#233; accrue &#224; l&#8217;&#233;ducation, pour in fine fusionner l&#8217;enjeu de coh&#233;sion territoriale &#224; l&#8217;enjeu de coh&#233;sion nationale.</p>"
  },
  "representations": [
    {
      "nom": "PDF",
      "typeMime": {
        "type": "application",
        "subType": "PDF"
      },
      "statutRepresentation": {
        "verbatim": true,
        "canonique": true,
        "officielle": true,
        "transcription": false,
        "enregistrement": false
      },
      "contenu": {
        "documentURI": "/15/amendements/1662/AN/54.pdf"
      }
    }
  ],
  "dateDepot": "2019-02-12T01:00:00.000+01:00",
  "dateDistribution": "2019-03-12T01:00:00.000+01:00",
  "article99": "0",
  "loiReference": {}
}