{
  "uid": "AMANR5L15SEA717460BTC1924P0D1N446",
  "identifiant": {
    "legislature": "15",
    "numero": "446",
    "numRect": "0",
    "saisine": {
      "texteLegislatifRef": "PRJLANR5L15BTC1924",
      "numeroPartiePLF": "0",
      "organeExamen": "PO717460",
      "mentionSecondeDeliberation": "0"
    }
  },
  "numeroLong": "446",
  "etapeTexte": "1ère lecture (1ère assemblée saisie)",
  "triAmendement": "aeaaaaaaaaaaaaaaaaaaaaaaaaaaaaaaaaaaaaaaaaaaaaaaaajmrzy",
  "cardinaliteAmdtMultiples": "1",
  "etat": "Discuté",
  "signataires": {
    "auteur": {
      "typeAuteur": "Depute",
      "acteurRef": "PA719266",
      "groupePolitiqueRef": "PO730970"
    },
    "cosignatairesRefs": [
      "PA719266"
    ],
    "texteAffichable": "M.&#160;Cubertafon"
  },
  "pointeurFragmentTexte": {
    "division": {
      "titre": "Article 3",
      "articleDesignationCourte": "ART. 3",
      "type": "ARTICLE",
      "avantAApres": "A",
      "divisionRattachee": "ARTICLE 3",
      "urlDivisionTexteVise": "/15/textes/1924.asp#D_Article_3"
    },
    "alinea": {
      "numero": "43"
    }
  },
  "corps": {
    "dispositif": "<p>I.&#160;&#8211;&#160;&#192; l&#8217;alin&#233;a&#160;43, substituer aux mots&#160;:</p><p>&#171;&#160;trois cents&#160;&#187;</p><p>les mots&#160;:</p><p>&#171;&#160;cent&#160;cinquante&#160;&#187;.</p><p>II.&#160;&#8211;&#160;En cons&#233;quence, proc&#233;der &#224; la m&#234;me substitution &#224; l&#8217;alin&#233;a&#160;44.</p>",
    "exposeSommaire": "<p>Le pr&#233;sent amendement propose d&#8217;abaisser le seuil de cr&#233;ation d&#8217;une formation sp&#233;cialis&#233;e en mati&#232;re de sant&#233;, de s&#233;curit&#233; et de conditions de travail au sein des comit&#233;s sociaux territoriaux.</p><p style=\"text-align: justify;\">En effet, il r&#233;sulte de la fusion des comit&#233;s techniques et des comit&#233;s d&#8217;hygi&#232;ne de s&#233;curit&#233; et des conditions de travail, la disparition d&#8217;une formation sp&#233;cialis&#233;e en mati&#232;re de s&#233;curit&#233; et de conditions de travail pour les collectivit&#233;s&#160;comptant moins de 300 agents.</p><p style=\"text-align: justify;\">Or, ce seuil de 300 agents s&#8217;av&#232;re particuli&#232;rement discriminant.&#160;Un faible nombre de collectivit&#233;s atteignent effectivement ces effectifs, notamment dans les territoires ruraux.</p><p style=\"text-align: justify;\">Une&#160;instance sp&#233;cialis&#233;e en mati&#232;re de sant&#233;, de s&#233;curit&#233; et de conditions de travail, avec des repr&#233;sentants avertis et form&#233;s, est pourtant la garantie d&#8217;un dialogue social de qualit&#233; en mati&#232;re de sant&#233; et de s&#233;curit&#233; sur le lieu de travail ainsi que d&#8217;une responsabilisation des employeurs.</p><p style=\"text-align: justify;\">Aussi, le pr&#233;sent amendement propose de fixer&#160;ce seuil &#224; cent-cinquante agents.</p>"
  },
  "representations": [
    {
      "nom": "PDF",
      "typeMime": {
        "type": "application",
        "subType": "PDF"
      },
      "statutRepresentation": {
        "verbatim": true,
        "canonique": true,
        "officielle": true,
        "transcription": false,
        "enregistrement": false
      },
      "contenu": {
        "documentURI": "/15/amendements/1924/AN/446.pdf"
      }
    }
  ],
  "sort": {
    "dateSaisie": "2019-05-14T23:42:54.000+02:00",
    "sortEnSeance": "Non soutenu"
  },
  "dateDepot": "2019-05-09T02:00:00.000+02:00",
  "dateDistribution": "2019-05-10T02:00:00.000+02:00",
  "article99": "0",
  "loiReference": {}
}