{
  "uid": "AMANR5L15PO757134B1088P0D1N586",
  "identifiant": {
    "legislature": "15",
    "numero": "586",
    "numRect": "0",
    "saisine": {
      "texteLegislatifRef": "PRJLANR5L15B1088",
      "numeroPartiePLF": "0",
      "organeExamen": "PO757134",
      "mentionSecondeDeliberation": "0"
    }
  },
  "numeroLong": "586",
  "etapeTexte": "1ère lecture (1ère assemblée saisie)",
  "triAmendement": "kbaaaaaaaaaaaaaaaaaaaaaaaaaaaaaaaaaaaaaaaaaaaaaaaaablu",
  "cardinaliteAmdtMultiples": "1",
  "etat": "Discuté",
  "signataires": {
    "auteur": {
      "typeAuteur": "Depute",
      "acteurRef": "PA721816",
      "groupePolitiqueRef": "PO730934"
    },
    "cosignatairesRefs": [
      "PA267735",
      "PA718884",
      "PA719318",
      "PA718784",
      "PA721636",
      "PA720684",
      "PA266808",
      "PA721474",
      "PA340853",
      "PA608016",
      "PA266776",
      "PA721678",
      "PA721314",
      "PA721816",
      "PA266797",
      "PA346218"
    ],
    "texteAffichable": "M.&#160;Boucard,  M.&#160;Reda, M.&#160;Schellenberger, M.&#160;Masson, M.&#160;Parigi, M.&#160;Reiss, M.&#160;Pauget, M.&#160;Gosselin, M.&#160;Pierre-Henri&#160;Dumont, M.&#160;Leclerc, Mme&#160;Louwagie, Mme&#160;Anthoine, Mme&#160;Bazin-Malgras, M.&#160;Viry, M.&#160;de Ganay et M.&#160;Rolland"
  },
  "pointeurFragmentTexte": {
    "division": {
      "titre": "Article 55",
      "articleDesignationCourte": "ART. 55",
      "type": "ARTICLE",
      "avantAApres": "A",
      "divisionRattachee": "ARTICLE 55",
      "urlDivisionTexteVise": "/15/textes/1088.asp#D_Article_55"
    },
    "alinea": {
      "avantAApres": "Apres",
      "numero": "2"
    }
  },
  "corps": {
    "dispositif": "<p style=\"text-align: justify;\">Apr&#232;s l&#8217;alin&#233;a&#160;2, ins&#233;rer les alin&#233;as suivants:</p><p style=\"text-align: justify;\">&#171;&#160;<i>aa)</i>&#160;Apr&#232;s le b du I, il est ins&#233;r&#233; un c ainsi r&#233;dig&#233;&#160;:</p><p style=\"text-align: justify;\">&#171;<i>&#160;c)</i> Activit&#233;s li&#233;es &#224; la s&#233;curit&#233; d&#8217;approvisionnement en mati&#232;res premi&#232;res, au transfert de technologies, de savoir-faire industriel, de composants ou de brevets, aux technologies li&#233;es &#224; l&#8217;intelligence artificielle, au spatial et au stockage de donn&#233;es.&#160;&#187;</p>",
    "exposeSommaire": "<p style=\"text-align: justify;\">Cet amendement vise &#224; &#233;tendre le p&#233;rim&#232;tre des activit&#233;s sujettes au proc&#233;dure d&#8217;autorisation pr&#233;alable afin de mieux prot&#233;ger les secteurs strat&#233;giques de notre pays.</p><p style=\"text-align: justify;\">En effet, ces derni&#232;res ann&#233;es, la France a connu le rachat successif d&#8217;entreprises industrielles par des grands groupes &#233;trangers. Ces situations soul&#232;vent d&#8217;importantes questions sur la capacit&#233; de l&#8217;&#201;tat &#224; d&#233;fendre tant nos savoir-faire industriels que nos int&#233;r&#234;ts strat&#233;giques. Or, ses produits et savoir-faire sont souvent issus d&#8217;efforts publics de recherche et de d&#233;veloppement et d&#8217;une politique nationale de commande publique volontariste.</p><p style=\"text-align: justify;\">Il convient de s&#8217;interroger sur les moyens juridiques, &#233;conomiques et financiers dont dispose l&#8217;&#201;tat mais aussi sur la strat&#233;gie adopt&#233;e pour favoriser le maintien en France de notre patrimoine strat&#233;gique, qu&#8217;il soit industriel ou technologique.</p>"
  },
  "representations": [
    {
      "nom": "PDF",
      "typeMime": {
        "type": "application",
        "subType": "PDF"
      },
      "statutRepresentation": {
        "verbatim": true,
        "canonique": true,
        "officielle": true,
        "transcription": false,
        "enregistrement": false
      },
      "contenu": {
        "documentURI": "/15/amendements/1088/CSPACTE/586.pdf"
      }
    }
  ],
  "sort": {
    "dateSaisie": "2018-09-14T10:03:07.000+02:00",
    "sortEnSeance": "Retiré"
  },
  "dateDepot": "2018-08-29T02:00:00.000+02:00",
  "dateDistribution": "2018-09-11T02:00:00.000+02:00",
  "article99": "0",
  "loiReference": {}
}