{
  "uid": "AMANR5L15SEA717460B1371P0D1N212",
  "identifiant": {
    "legislature": "15",
    "numero": "212",
    "numRect": "0",
    "saisine": {
      "texteLegislatifRef": "PRJLANR5L15B1371",
      "numeroPartiePLF": "0",
      "organeExamen": "PO717460",
      "mentionSecondeDeliberation": "0"
    }
  },
  "numeroLong": "212",
  "etapeTexte": "1ère lecture (1ère assemblée saisie)",
  "triAmendement": "jiaaaaaaaaaaaaaaaaaaaaaaaaaaaaaaaaaaaaaaaaaaaaaaaainpu",
  "cardinaliteAmdtMultiples": "1",
  "etat": "Discuté",
  "signataires": {
    "auteur": {
      "typeAuteur": "Depute",
      "acteurRef": "PA332523",
      "groupePolitiqueRef": "PO730934"
    },
    "cosignatairesRefs": [
      "PA332523"
    ],
    "texteAffichable": "Mme&#160;Dalloz"
  },
  "pointeurFragmentTexte": {
    "division": {
      "titre": "Article 8",
      "articleDesignationCourte": "APRÈS ART. 8",
      "type": "ARTICLE",
      "avantAApres": "Apres",
      "divisionRattachee": "APRÈS L'ARTICLE 8, insérer l'article suivant:",
      "articleAdditionnel": "1",
      "urlDivisionTexteVise": "/15/textes/1371.asp#D_Article_8"
    }
  },
  "corps": {
    "dispositif": "<p style=\"text-align: justify;\">I.&#160;&#8211;&#160;Le premier alin&#233;a de l&#8217;article&#160;238 <i>bis</i> du code g&#233;n&#233;ral des imp&#244;ts est ainsi r&#233;dig&#233;&#160;:&#160;</p><p style=\"text-align: justify;\">&#171;&#160;Les versements effectu&#233;s par les entreprises assujetties &#224; l&#8217;imp&#244;t sur le revenu ou &#224; l&#8217;imp&#244;t sur les soci&#233;t&#233;s, pris dans la limite de 0,5&#160;% du chiffre d&#8217;affaires ou, lorsque cette limite est d&#233;pass&#233;e, 10 000&#160;euros, et sans pouvoir d&#233;passer 30 millions d&#8217;euros, sauf lorsque l&#8217;organisme b&#233;n&#233;ficiaire est l&#8217;un de ceux vis&#233;s au b ci-apr&#232;s, ouvrent droit &#224; une r&#233;duction d&#8217;imp&#244;t de 60&#160;% de leur montant lorsqu&#8217;ils sont effectu&#233;s au profit&#160;:&#160;&#187;</p><p style=\"text-align: justify;\">II.&#160;&#8211;&#160;Le I est applicable &#224; compter du 1<sup>er</sup> janvier 2019.</p><p style=\"text-align: justify;\">III.&#160;&#8211;&#160;La perte de recettes pour l&#8217;&#201;tat est compens&#233;e &#224; due concurrence par la cr&#233;ation d&#8217;une taxe additionnelle aux droits vis&#233;s aux articles 575 et 575 A du code g&#233;n&#233;ral des imp&#244;ts.</p>",
    "exposeSommaire": "<p style=\"text-align: justify;\">Cet amendement vise &#224;&#160;limiter les b&#233;n&#233;ficiaires des dons au-del&#224; de 30 M d&#8217;euros aux organismes list&#233;s au 1-b) du 238bis, qui correspond aux organismes pr&#233;sentant les garanties n&#233;cessaires attendues par les pouvoirs publics.</p>"
  },
  "representations": [
    {
      "nom": "PDF",
      "typeMime": {
        "type": "application",
        "subType": "PDF"
      },
      "statutRepresentation": {
        "verbatim": true,
        "canonique": true,
        "officielle": true,
        "transcription": false,
        "enregistrement": false
      },
      "contenu": {
        "documentURI": "/15/amendements/1371/AN/212.pdf"
      }
    }
  ],
  "seanceDiscussion": "RUANR5L15S2019IDS21366",
  "sort": {
    "dateSaisie": "2018-11-13T01:43:59.000+01:00",
    "sortEnSeance": "Rejeté"
  },
  "dateDepot": "2018-11-09T01:00:00.000+01:00",
  "dateDistribution": "2018-11-12T01:00:00.000+01:00",
  "article99": "0",
  "loiReference": {
    "codeLoi": "CGI",
    "divisionCodeLoi": "238 bis"
  }
}