{
  "uid": "AMANR5L15PO419865B2135P0D1N357",
  "identifiant": {
    "legislature": "15",
    "numero": "357",
    "numRect": "0",
    "saisine": {
      "texteLegislatifRef": "PRJLANR5L15B2135",
      "numeroPartiePLF": "0",
      "organeExamen": "PO419865",
      "mentionSecondeDeliberation": "0"
    }
  },
  "numeroLong": "CD357",
  "etapeTexte": "Nouvelle Lecture",
  "triAmendement": "goaaiaaaaaaaaaaaaaaaaaaaaaaaaaaaaaaaaaaaaaaaaaaaaazzzzzzzzzzzzzzzzx",
  "cardinaliteAmdtMultiples": "1",
  "etat": "Discuté",
  "signataires": {
    "auteur": {
      "typeAuteur": "Depute",
      "acteurRef": "PA720386",
      "groupePolitiqueRef": "PO730934"
    },
    "cosignatairesRefs": [
      "PA721410",
      "PA267735",
      "PA720386",
      "PA721968",
      "PA718780",
      "PA334654",
      "PA2377",
      "PA267204",
      "PA608416",
      "PA642847",
      "PA722390",
      "PA721286",
      "PA330909",
      "PA718884",
      "PA643134",
      "PA605991",
      "PA1874",
      "PA267429",
      "PA720630",
      "PA266793",
      "PA336316",
      "PA718850",
      "PA605036"
    ],
    "texteAffichable": "M.&#160;Di Filippo,  M.&#160;Abad, M.&#160;Bazin, Mme&#160;Bazin-Malgras, Mme&#160;Bonnivard, M.&#160;Bony, M.&#160;Bouchet, M.&#160;Cinieri, M.&#160;Cordier, Mme&#160;Corneloup, M.&#160;de Ganay, M.&#160;Descoeur, Mme&#160;Genevard, M.&#160;Hetzel, M.&#160;Le Fur, M.&#160;Minot, M.&#160;Perrut, M.&#160;Ramadier, M.&#160;Sermier, M.&#160;Straumann, Mme&#160;Trastour-Isnart, Mme&#160;Valentin et M.&#160;Vialay"
  },
  "pointeurFragmentTexte": {
    "division": {
      "titre": "RAPPORT ANNEXÉ",
      "articleDesignationCourte": "ART. 1ER A",
      "type": "ANNEXE",
      "avantAApres": "A",
      "divisionRattachee": "ARTICLE 1ER A",
      "urlDivisionTexteVise": "/15/textes/2135.asp#D_RAPPORT_ANNEXE"
    },
    "alinea": {
      "numero": "38"
    }
  },
  "corps": {
    "dispositif": "<p style=\"text-align: justify;\">Compl&#233;ter l&#8217;alin&#233;a&#160;38 par les mots&#160;:</p><p style=\"text-align: justify;\">&#171;&#160;, prioritairement dans les zones rurales reconnues enclav&#233;es.&#160;&#187;</p>",
    "exposeSommaire": "<p style=\"text-align: justify;\">Les transports publics sont aujourd&#8217;hui la cause d&#8217;in&#233;galit&#233; sur le territoire. Aujourd&#8217;hui, les ruraux n&#8217;ont souvent pas d&#8217;autres alternatives comme moyen de locomotion que leur voiture, tandis que les urbains peuvent jouir d&#8217;un grand nombre de services de transport public.</p><p style=\"text-align: justify;\">Souvent, chaque foyer rural dispose de deux voitures, n&#8217;ayant pas d&#8217;autres choix. Avec la hausse du prix des carburants, cela repr&#233;sente pour de nombreux m&#233;nages un tr&#232;s important budget et en plus de cela, l&#8217; &#201;tat ne leur apporte aucune r&#233;ponse pour am&#233;liorer leurs conditions de transports qui conditionnent leur quotidien. Certaines zones du territoire<span  data-cid=\"2\"   data-time=\"1566916139823\">s</span> et leurs habitants se trouvent ainsi de plus en plus p&#233;nalis&#233;s en raison d&#8217;un manque d&#8217;entretien des r&#233;seaux qui les entourent. </p><p style=\"text-align: justify;\">Il est donc urgent d&#8217;apporter une attention particuli&#232;re et d&#8217;investir prioritairement dans ces zones. Tel est l&#8217;objet du pr&#233;sent amendement.</p>"
  },
  "representations": [
    {
      "nom": "PDF",
      "typeMime": {
        "type": "application",
        "subType": "PDF"
      },
      "statutRepresentation": {
        "verbatim": true,
        "canonique": true,
        "officielle": true,
        "transcription": false,
        "enregistrement": false
      },
      "contenu": {
        "documentURI": "/15/amendements/2135/CION-DVP/CD357.pdf"
      }
    }
  ],
  "sort": {
    "dateSaisie": "2019-09-03T22:41:54.000+02:00",
    "sortEnSeance": "Rejeté"
  },
  "dateDepot": "2019-08-27T02:00:00.000+02:00",
  "dateDistribution": "2019-08-31T02:00:00.000+02:00",
  "article99": "0",
  "loiReference": {}
}