{
  "uid": "AMANR5L15SEA717460BTC0857P0D1N302",
  "identifiant": {
    "legislature": "15",
    "numero": "302",
    "numRect": "0",
    "saisine": {
      "texteLegislatifRef": "PRJLANR5L15BTC0857",
      "numeroPartiePLF": "0",
      "organeExamen": "PO717460",
      "mentionSecondeDeliberation": "0"
    }
  },
  "numeroLong": "302",
  "etapeTexte": "1ère lecture (1ère assemblée saisie)",
  "triAmendement": "hi",
  "cardinaliteAmdtMultiples": "1",
  "etat": "Irrecevable",
  "signataires": {
    "auteur": {
      "typeAuteur": "Depute",
      "acteurRef": "PA335054",
      "groupePolitiqueRef": "PO730946"
    },
    "cosignatairesRefs": [
      "PA267233",
      "PA609590",
      "PA335999",
      "PA1008",
      "PA405480",
      "PA332614",
      "PA608172",
      "PA429893",
      "PA1809",
      "PA608695",
      "PA1592",
      "PA610681",
      "PA608011",
      "PA719930",
      "PA720988",
      "PA1198",
      "PA588886",
      "PA340357",
      "PA609332",
      "PA335532",
      "PA643145",
      "PA605069",
      "PA342415",
      "PA333818",
      "PA335054",
      "PA340343",
      "PA607553",
      "PA508",
      "PA642764",
      "PA333285",
      "PA337483"
    ],
    "texteAffichable": "Mme&#160;Karamanli,  Mme&#160;Laurence&#160;Dumont, M.&#160;Vallaud, Mme&#160;Untermaier, M.&#160;Aviragnet, Mme&#160;Bareigts, Mme&#160;Batho, Mme&#160;Battistel, Mme&#160;Bi&#233;mouret, M.&#160;Bouillon, M.&#160;Jean-Louis&#160;Bricout, M.&#160;Carvounas, M.&#160;Alain&#160;David, M.&#160;Faure, M.&#160;Garot, M.&#160;David&#160;Habib, M.&#160;Hutin, M.&#160;Juanico, M.&#160;J&#233;r&#244;me&#160;Lambert, M.&#160;Le Foll, M.&#160;Letchimy, Mme&#160;Manin, Mme&#160;Pau-Langevin, Mme&#160;Pires Beaune, M.&#160;Potier, M.&#160;Pueyo, M.&#160;Pupponi, Mme&#160;Rabault, M.&#160;Saulignac, Mme&#160;Vainqueur-Christophe, Mme&#160;Victory et les membres du groupe Nouvelle Gauche"
  },
  "pointeurFragmentTexte": {
    "division": {
      "titre": "Article 7",
      "articleDesignationCourte": "ART. 7",
      "type": "ARTICLE",
      "avantAApres": "A",
      "divisionRattachee": "ARTICLE 7",
      "urlDivisionTexteVise": "/15/textes/0857.asp#D_Article_7"
    },
    "alinea": {
      "avantAApres": "A",
      "numero": "7",
      "alineaDesignation": "Alinéa 7"
    }
  },
  "corps": {
    "dispositif": "<p style=\"text-align: justify;\">Apr&#232;s le mot&#160;:</p><p style=\"text-align: justify;\">&#171;&#160;choix&#160;&#187;,</p><p style=\"text-align: justify;\">r&#233;diger ainsi la fin de la troisi&#232;me phrase de l&#8217;alin&#233;a&#160;7&#160;:</p><p style=\"text-align: justify;\">&#171;&#160;ne lui est pas opposable pendant la dur&#233;e d&#8217;examen de sa demande et qu&#8217;il peut demander &#224; &#234;tre entendu dans une autre langue &#224; tout moment devant l&#8217;Office fran&#231;ais des r&#233;fugi&#233;s et apatrides ou la Cour nationale du droit d&#8217;asile.&#160;&#187;</p>",
    "exposeSommaire": "<p style=\"text-align: justify;\">Le libre choix de la langue dans laquelle le demandeur pourra &#234;tre entendu est consubstantiel de l&#8217;effectivit&#233; du droit d&#8217;asile.</p><p style=\"text-align: justify;\">En effet, de cette libert&#233; proc&#232;de la possibilit&#233; de se faire comprendre au mieux, de d&#233;crire son parcours, ses craintes l&#233;gitimes en cas de retour dans le pays d&#8217;origine et plus simplement de d&#233;fendre ses droits.</p><p style=\"text-align: justify;\">A cet &#233;gard, il apparait dans bien des cas que le demandeur se voit imposer une langue qu&#8217;il a d&#233;clar&#233; comprendre lors de son enregistrement en Pr&#233;fecture, alors qu&#8217;il pouvait &#224; ce moment chercher &#224; manifester sa bonne disposition &#224; l&#8217;int&#233;gration.</p><p style=\"text-align: justify;\">C&#8217;est la raison pour laquelle, cet amendement vise &#224; affirmer le droit du demandeur d&#8217;&#234;tre entendu dans la langue de son choix &#224; tout moment durant la proc&#233;dure devant l&#8217;OFPRA ou la CNDA.&#160;</p>"
  },
  "representations": [
    {
      "nom": "PDF",
      "typeMime": {
        "type": "application",
        "subType": "PDF"
      },
      "statutRepresentation": {
        "verbatim": true,
        "canonique": true,
        "officielle": true,
        "transcription": false,
        "enregistrement": false
      },
      "contenu": {
        "documentURI": "/15/amendements/0857/AN/302.pdf"
      }
    }
  ],
  "dateDepot": "2018-04-11T02:00:00.000+02:00",
  "article99": "0",
  "loiReference": {}
}