{
  "uid": "AMANR5L15SEA717460BTC0581P0D1N146",
  "identifiant": {
    "legislature": "15",
    "numero": "146",
    "numRect": "0",
    "saisine": {
      "texteLegislatifRef": "PIONANR5L15BTC0581",
      "numeroPartiePLF": "0",
      "organeExamen": "PO717460",
      "mentionSecondeDeliberation": "0"
    }
  },
  "numeroLong": "146",
  "etapeTexte": "1ère lecture (1ère assemblée saisie)",
  "triAmendement": "alyznwtzrztzvo",
  "cardinaliteAmdtMultiples": "1",
  "etat": "Discuté",
  "signataires": {
    "auteur": {
      "typeAuteur": "Depute",
      "acteurRef": "PA332228",
      "groupePolitiqueRef": "PO744425"
    },
    "cosignatairesRefs": [
      "PA702052",
      "PA335758",
      "PA267585",
      "PA720696",
      "PA610775",
      "PA712014",
      "PA642868",
      "PA695100",
      "PA642935",
      "PA1960",
      "PA267330",
      "PA267241",
      "PA333421",
      "PA721094",
      "PA331567",
      "PA942",
      "PA331582",
      "PA721486",
      "PA719806",
      "PA332228",
      "PA267801",
      "PA721110",
      "PA2952",
      "PA421348",
      "PA267042",
      "PA267766",
      "PA722030",
      "PA267355",
      "PA267780",
      "PA266788",
      "PA268019",
      "PA720230",
      "PA693008"
    ],
    "texteAffichable": "M.&#160;Benoit,  Mme&#160;Auconie, M.&#160;Becht, M.&#160;Bournazel, M.&#160;Guy&#160;Bricout, M.&#160;Christophe, M.&#160;Charles&#160;de Courson, Mme&#160;de La Raudi&#232;re, M.&#160;Demilly, Mme&#160;Descamps, M.&#160;Dunoyer, M.&#160;Favennec Becot, Mme&#160;Firmin Le Bodo, M.&#160;Gom&#232;s, M.&#160;Meyer&#160;Habib, M.&#160;Herth, M.&#160;J&#233;go, M.&#160;Lagarde, M.&#160;Ledoux, M.&#160;Leroy, Mme&#160;Magnier, M.&#160;Morel-&#192;-L&apos;Huissier, M.&#160;Naegelen, M.&#160;Pancher, M.&#160;Polutele, M.&#160;Riester, Mme&#160;Sage, Mme&#160;Sanquer, M.&#160;Vercamer, M.&#160;Philippe&#160;Vigier, M.&#160;Villiers, M.&#160;Warsmann et M.&#160;Zumkeller"
  },
  "pointeurFragmentTexte": {
    "division": {
      "titre": "Article PREMIER",
      "articleDesignationCourte": "ART. PREMIER",
      "type": "ARTICLE",
      "avantAApres": "A",
      "divisionRattachee": "ARTICLE PREMIER",
      "urlDivisionTexteVise": "/15/textes/0581.asp#D_Article_1er"
    },
    "alinea": {
      "numero": "2"
    }
  },
  "corps": {
    "dispositif": "<p>&#192; la premi&#232;re phrase de l&#8217;alin&#233;a&#160;2, apr&#232;s la seconde occurrence du mot&#160;:</p><p>&#171;&#160;communes&#160;&#187;,</p><p>ins&#233;rer les mots&#160;:</p><p>&#171;&#160;ou de la communaut&#233; d&#8217;agglom&#233;ration&#160;&#187;.</p>",
    "exposeSommaire": "<p>Cet amendement vise &#224; &#233;tendre le champ d&#8217;application de la proposition de loi aux communaut&#233;s d&#8217;agglom&#233;rations.</p>"
  },
  "representations": [
    {
      "nom": "PDF",
      "typeMime": {
        "type": "application",
        "subType": "PDF"
      },
      "statutRepresentation": {
        "verbatim": true,
        "canonique": true,
        "officielle": true,
        "transcription": false,
        "enregistrement": false
      },
      "contenu": {
        "documentURI": "/15/amendements/0581/AN/146.pdf"
      }
    }
  ],
  "seanceDiscussion": "RUANR5L15S2018IDS20888",
  "sort": {
    "dateSaisie": "2018-01-31T02:14:11.000+01:00",
    "sortEnSeance": "Rejeté"
  },
  "dateDepot": "2018-01-26T01:00:00.000+01:00",
  "dateDistribution": "2018-01-29T01:00:00.000+01:00",
  "article99": "0",
  "loiReference": {}
}