{
  "uid": "AMANR5L15SEA717460BTC1955P0D1N878",
  "identifiant": {
    "legislature": "15",
    "numero": "878",
    "numRect": "0",
    "saisine": {
      "texteLegislatifRef": "PNREANR5L15BTC1955",
      "numeroPartiePLF": "0",
      "organeExamen": "PO717460",
      "mentionSecondeDeliberation": "1"
    }
  },
  "numeroLong": "878",
  "etapeTexte": "Lecture unique",
  "triAmendement": "miaaaaaaaaaaaaaaaaaaaaaaaaaaaaaaaaaaaaaaaaaaaaaaaak",
  "cardinaliteAmdtMultiples": "1",
  "etat": "Discuté",
  "signataires": {
    "auteur": {
      "typeAuteur": "Depute",
      "acteurRef": "PA720746",
      "groupePolitiqueRef": "PO730970"
    },
    "cosignatairesRefs": [
      "PA720746"
    ],
    "texteAffichable": "M.&#160;Waserman"
  },
  "pointeurFragmentTexte": {
    "division": {
      "titre": "Article 30 quinquies",
      "articleDesignationCourte": "ART. 30 QUINQUIES",
      "type": "ARTICLE",
      "avantAApres": "A",
      "divisionRattachee": "ARTICLE 30 QUINQUIES",
      "urlDivisionTexteVise": "/15/textes/1955.asp#D_Article_30_quinquies"
    },
    "alinea": {
      "avantAApres": "Apres",
      "numero": "2"
    }
  },
  "corps": {
    "dispositif": "<p style=\"text-align: justify;\">Apr&#232;s l&#8217;alin&#233;a&#160;2, ins&#233;rer l&#8217;alin&#233;a suivant&#160;:</p><p style=\"text-align: justify;\">&#171;&#160;1&#176;&#160;<i>bis</i>&#160;&#192; la deuxi&#232;me phrase, la r&#233;f&#233;rence&#160;: &#171;&#160;10&#160;&#187; est remplac&#233;e par la r&#233;f&#233;rence&#160;: &#171;&#160;8&#160;&#187;&#160;;&#160;&#187;.</p>",
    "exposeSommaire": "<p style=\"text-align: justify;\">Amendement de coordination.</p>"
  },
  "representations": [
    {
      "nom": "PDF",
      "typeMime": {
        "type": "application",
        "subType": "PDF"
      },
      "statutRepresentation": {
        "verbatim": true,
        "canonique": true,
        "officielle": true,
        "transcription": false,
        "enregistrement": false
      },
      "contenu": {
        "documentURI": "/15/amendements/1955/AN/878.pdf"
      }
    }
  ],
  "seanceDiscussion": "RUANR5L15S2019IDS21670",
  "sort": {
    "dateSaisie": "2019-05-29T18:48:12.000+02:00",
    "sortEnSeance": "Adopté"
  },
  "dateDepot": "2019-05-24T02:00:00.000+02:00",
  "dateDistribution": "2019-05-29T02:00:00.000+02:00",
  "article99": "0",
  "loiReference": {}
}