{
  "uid": "AMANR5L15PO419610B0627P0D1N680",
  "identifiant": {
    "legislature": "15",
    "numero": "680",
    "numRect": "0",
    "saisine": {
      "texteLegislatifRef": "PRJLANR5L15B0627",
      "numeroPartiePLF": "0",
      "organeExamen": "PO419610",
      "mentionSecondeDeliberation": "0"
    }
  },
  "numeroLong": "CE680",
  "etapeTexte": "1ère lecture (1ère assemblée saisie)",
  "triAmendement": "adx",
  "cardinaliteAmdtMultiples": "1",
  "etat": "Discuté",
  "signataires": {
    "auteur": {
      "typeAuteur": "Depute",
      "acteurRef": "PA718838",
      "groupePolitiqueRef": "PO730934"
    },
    "cosignatairesRefs": [
      "PA1874",
      "PA605036",
      "PA718780",
      "PA267204",
      "PA718838",
      "PA267260",
      "PA607090",
      "PA608416",
      "PA998",
      "PA346218"
    ],
    "texteAffichable": "M.&#160;Brun,  M.&#160;Abad, M.&#160;Dassault, M.&#160;Hetzel, M.&#160;Le Fur, M.&#160;Masson, Mme&#160;Poletti, M.&#160;Sermier, Mme&#160;Trastour-Isnart et M.&#160;Jean-Pierre&#160;Vigier"
  },
  "pointeurFragmentTexte": {
    "division": {
      "titre": "Article 11",
      "articleDesignationCourte": "ART. 11",
      "type": "ARTICLE",
      "avantAApres": "A",
      "divisionRattachee": "ARTICLE 11",
      "urlDivisionTexteVise": "/15/textes/0627.asp#D_Article_11"
    },
    "alinea": {
      "avantAApres": "A",
      "numero": "2",
      "alineaDesignation": "Alinéa 2"
    }
  },
  "corps": {
    "dispositif": "<p style=\"text-align: justify;\">&#192; l&#8217;alin&#233;a&#160;2, apr&#232;s le mot&#160;:</p><p style=\"text-align: justify;\">&#171;&#160;public&#160;&#187;,</p><p style=\"text-align: justify;\">ins&#233;rer les mots&#160;:</p><p style=\"text-align: justify;\">&#171;&#160;et les gestionnaires priv&#233;s des services de restauration scolaire et universitaire ainsi que des services de restauration des &#233;tablissements publics d&#8217;accueil des enfants de moins de six ans, des &#233;tablissements de sant&#233;, des &#233;tablissements sociaux et m&#233;dico-sociaux, et des &#233;tablissements p&#233;nitentiaires&#160;&#187;.</p>",
    "exposeSommaire": "<p style=\"text-align: justify;\">L&#8217;article&#160;11 du pr&#233;sent projet de loi ne concerne que les gestionnaires relevant du droit public. L&#8217;amendement pr&#233;sent&#233; vise &#224; r&#233;int&#233;grer les gestionnaires priv&#233;s de la restauration collective accueillant des publics sensibles&#160;: enfants, personnes malades<span  data-cid=\"2\" data-userid=\"2022\" data-username=\"Fabrice Brun\" data-time=\"1523356738728\">, personnes &#226;g&#233;es, personnes d&#233;pendantes ou handicap&#233;es</span>...</p><p style=\"text-align: justify;\">Cette mesure nouvelle est compl&#233;mentaire de celle qui est d&#233;j&#224; pr&#233;vue par l&#8217;article L.&#160;230&#8209;5 du code rural et de la p&#234;che maritime, et qui tend &#224; am&#233;liorer la qualit&#233; nutritionnelle des repas propos&#233;s dans les services de restauration scolaire et universitaire et ceux des &#233;tablissements de sant&#233;, des &#233;tablissements sociaux et m&#233;dico-sociaux<span  data-cid=\"3\" data-userid=\"2022\" data-username=\"Fabrice Brun\" data-time=\"1523356767198\"> et des &#233;tablissements p&#233;nitentiaires</span>.</p>"
  },
  "representations": [
    {
      "nom": "PDF",
      "typeMime": {
        "type": "application",
        "subType": "PDF"
      },
      "statutRepresentation": {
        "verbatim": true,
        "canonique": true,
        "officielle": true,
        "transcription": false,
        "enregistrement": false
      },
      "contenu": {
        "documentURI": "/15/amendements/0627/CION-ECO/CE680.pdf"
      }
    }
  ],
  "sort": {
    "dateSaisie": "2018-04-19T11:26:39.000+02:00",
    "sortEnSeance": "Tombé"
  },
  "dateDepot": "2018-04-10T02:00:00.000+02:00",
  "dateDistribution": "2018-04-17T02:00:00.000+02:00",
  "article99": "0",
  "loiReference": {}
}