{
  "uid": "AMANR5L15SEA717460BTC1177P0D1N52",
  "identifiant": {
    "legislature": "15",
    "numero": "52",
    "numRect": "0",
    "saisine": {
      "texteLegislatifRef": "PRJLANR5L15BTC1177",
      "numeroPartiePLF": "0",
      "organeExamen": "PO717460",
      "mentionSecondeDeliberation": "0"
    }
  },
  "numeroLong": "52",
  "etapeTexte": "Nouvelle Lecture",
  "triAmendement": "o",
  "cardinaliteAmdtMultiples": "1",
  "etat": "Discuté",
  "signataires": {
    "auteur": {
      "typeAuteur": "Depute",
      "acteurRef": "PA722284",
      "groupePolitiqueRef": "PO730970"
    },
    "cosignatairesRefs": [
      "PA722284"
    ],
    "texteAffichable": "M.&#160;Fuchs"
  },
  "pointeurFragmentTexte": {
    "division": {
      "titre": "Article 17",
      "articleDesignationCourte": "ART. 17",
      "type": "ARTICLE",
      "avantAApres": "A",
      "divisionRattachee": "ARTICLE 17",
      "urlDivisionTexteVise": "/15/textes/1177.asp#D_Article_17"
    },
    "alinea": {
      "numero": "26"
    }
  },
  "corps": {
    "dispositif": "<p style=\"text-align: justify;\">&#192; l&#8217;alin&#233;a&#160;26, supprimer les mots&#160;:</p><p style=\"text-align: justify;\">&#171;&#160;&#224; but non lucratif&#160;&#187;.</p>",
    "exposeSommaire": "<p style=\"text-align: justify;\">Les &#233;tablissements priv&#233;s d&#8217;enseignement sup&#233;rieurs priv&#233;s permettent &#224; des jeunes d&#8217;obtenir des niveaux de qualification et de formation le plus souvent &#233;quivalent &#224; celui de l&#8217;enseignement public. Le caract&#232;re lucratif ou non de l&#8217;organisme en charge de la gestion de ces &#233;tablissements est un facteur discriminant d&#232;s lors qu&#8217;ils r&#233;pondent aux objectifs p&#233;dagogiques et sociaux que fixe le projet de Loi aux formations professionnelles. Il n&#8217;y a pas lieu &#224; les exclure de la perception de la contribution aux formatons professionnelles. Par ailleurs, les r&#233;alit&#233;s &#233;conomiques et sociales soumettent les &#233;tablissements d&#8217;enseignement sup&#233;rieur aux m&#234;mes r&#232;gles de fonctionnement ind&#233;pendant du caract&#232;re lucratif ou non de leur statut.</p><p style=\"text-align: justify;\">Cet amendement enl&#232;ve une forme d&#8217;hypocrisie puisque les entreprises de formations professionnelles cr&#233;er leurs associations et cet amendement limite nos capacit&#233;s de d&#233;veloppement puisqu&#8217;ils nous privent de l&#8217;arriv&#233;e d&#8217;acteurs internationaux sur le march&#233;.</p>"
  },
  "representations": [
    {
      "nom": "PDF",
      "typeMime": {
        "type": "application",
        "subType": "PDF"
      },
      "statutRepresentation": {
        "verbatim": true,
        "canonique": true,
        "officielle": true,
        "transcription": false,
        "enregistrement": false
      },
      "contenu": {
        "documentURI": "/15/amendements/1177/AN/52.pdf"
      }
    }
  ],
  "seanceDiscussion": "RUANR5L15S2018IDS21200",
  "sort": {
    "dateSaisie": "2018-07-25T00:18:46.000+02:00",
    "sortEnSeance": "Rejeté"
  },
  "dateDepot": "2018-07-19T02:00:00.000+02:00",
  "dateDistribution": "2018-07-21T02:00:00.000+02:00",
  "article99": "0",
  "loiReference": {}
}