{
  "uid": "AMANR5L15SEA717460BTC1548P0D1N404",
  "identifiant": {
    "legislature": "15",
    "numero": "404",
    "numRect": "0",
    "saisine": {
      "texteLegislatifRef": "PRJLANR5L15BTC1548",
      "numeroPartiePLF": "0",
      "organeExamen": "PO717460",
      "mentionSecondeDeliberation": "0"
    }
  },
  "numeroLong": "404",
  "etapeTexte": "Nouvelle Lecture",
  "triAmendement": "bccaaaaaaaaaaaaaaaaaaaaaaaaaaaaaaaaaaaaaaaaaaaaaaaii",
  "cardinaliteAmdtMultiples": "1",
  "etat": "Discuté",
  "signataires": {
    "auteur": {
      "typeAuteur": "Depute",
      "acteurRef": "PA721624",
      "groupePolitiqueRef": "PO730964"
    },
    "cosignatairesRefs": [
      "PA721624"
    ],
    "texteAffichable": "Mme&#160;Avia"
  },
  "pointeurFragmentTexte": {
    "division": {
      "titre": "Article 13",
      "articleDesignationCourte": "ART. 13",
      "type": "ARTICLE",
      "avantAApres": "A",
      "divisionRattachee": "ARTICLE 13",
      "urlDivisionTexteVise": "/15/textes/1548.asp#D_Article_13"
    },
    "alinea": {
      "numero": "4"
    }
  },
  "corps": {
    "dispositif": "<p style=\"text-align: justify;\">&#192; la premi&#232;re phrase de l'alin&#233;a 4, substituer &#224; la premi&#232;re occurrence des mots&#160;:</p><p style=\"text-align: justify;\">&#171;&#160;une somme&#160;&#187;</p><p style=\"text-align: justify;\">les mots&#160;:</p><p style=\"text-align: justify;\">&#171;&#160;statuant sur une demande&#160;initiale&#160;&#187;.</p>",
    "exposeSommaire": "<p style=\"text-align: justify;\">Cet amendement pr&#233;cise que le crit&#232;re d&#8217;application de la proc&#233;dure d&#233;mat&#233;rialis&#233;e et sans audience aux oppositions aux ordonnances portant injonction de payer est le montant initialement demand&#233; par le cr&#233;ancier.</p>"
  },
  "representations": [
    {
      "nom": "PDF",
      "typeMime": {
        "type": "application",
        "subType": "PDF"
      },
      "statutRepresentation": {
        "verbatim": true,
        "canonique": true,
        "officielle": true,
        "transcription": false,
        "enregistrement": false
      },
      "contenu": {
        "documentURI": "/15/amendements/1548/AN/404.pdf"
      }
    }
  ],
  "seanceDiscussion": "RUANR5L15S2019IDS21450",
  "sort": {
    "dateSaisie": "2019-01-17T12:18:40.000+01:00",
    "sortEnSeance": "Adopté"
  },
  "dateDepot": "2019-01-10T01:00:00.000+01:00",
  "dateDistribution": "2019-01-17T01:00:00.000+01:00",
  "article99": "0",
  "loiReference": {}
}