{
  "uid": "AMANR5L15SEA717460BTC1548P0D1N657",
  "identifiant": {
    "legislature": "15",
    "numero": "657",
    "numRect": "0",
    "saisine": {
      "texteLegislatifRef": "PRJLANR5L15BTC1548",
      "numeroPartiePLF": "0",
      "organeExamen": "PO717460",
      "mentionSecondeDeliberation": "0"
    }
  },
  "numeroLong": "657",
  "etapeTexte": "Nouvelle Lecture",
  "triAmendement": "ldaaaaaaaaaaaaaaaaaaaaaaaaaaaaaaaaaaaaaaaaaaaaaaaachzzy",
  "cardinaliteAmdtMultiples": "1",
  "etat": "Discuté",
  "signataires": {
    "auteur": {
      "typeAuteur": "Depute",
      "acteurRef": "PA721932",
      "groupePolitiqueRef": "PO723569"
    },
    "cosignatairesRefs": [
      "PA721932"
    ],
    "texteAffichable": "Mme&#160;Lorho"
  },
  "pointeurFragmentTexte": {
    "division": {
      "titre": "Article 53",
      "articleDesignationCourte": "ART. 53",
      "type": "ARTICLE",
      "avantAApres": "A",
      "divisionRattachee": "ARTICLE 53",
      "urlDivisionTexteVise": "/15/textes/1548.asp#D_Article_53"
    }
  },
  "corps": {
    "dispositif": "<p style=\"text-align: justify;\">Supprimer cet article.</p>",
    "exposeSommaire": "<p style=\"text-align: justify;\">La fusion des activit&#233;s des tribunaux d&#8217;instance et des tribunaux de grande instance risque d&#8217;avoir des cons&#233;quences graves pour le fonctionnement de notre syst&#232;me judiciaire. Amalgamer deux entit&#233;s d&#8217;ordre diff&#233;rent, l&#8217;une traitant des litiges du quotidien, la seconde traitant de la juridiction de droit commun, risque d&#8217;alt&#233;rer le bon fonctionnement du syst&#232;me judiciaire. Le gouvernement ne peut en aucun cas aspirer &#224; une telle unification pour les seuls b&#233;n&#233;fices &#233;conomiques qu&#8217;elle serait cens&#233;e engendrer.</p>"
  },
  "representations": [
    {
      "nom": "PDF",
      "typeMime": {
        "type": "application",
        "subType": "PDF"
      },
      "statutRepresentation": {
        "verbatim": true,
        "canonique": true,
        "officielle": true,
        "transcription": false,
        "enregistrement": false
      },
      "contenu": {
        "documentURI": "/15/amendements/1548/AN/657.pdf"
      }
    }
  ],
  "seanceDiscussion": "RUANR5L15S2019IDS21452",
  "sort": {
    "dateSaisie": "2019-01-18T01:33:05.000+01:00",
    "sortEnSeance": "Non soutenu"
  },
  "dateDepot": "2019-01-11T01:00:00.000+01:00",
  "dateDistribution": "2019-01-14T01:00:00.000+01:00",
  "article99": "0",
  "loiReference": {}
}