{
  "uid": "AMANR5L15PO59051B0911P0D1N959",
  "identifiant": {
    "legislature": "15",
    "numero": "959",
    "numRect": "0",
    "saisine": {
      "texteLegislatifRef": "PRJLANR5L15B0911",
      "numeroPartiePLF": "0",
      "organeExamen": "PO59051",
      "mentionSecondeDeliberation": "0"
    }
  },
  "numeroLong": "CL959",
  "etapeTexte": "1ère lecture (1ère assemblée saisie)",
  "triAmendement": "adqji",
  "cardinaliteAmdtMultiples": "1",
  "etat": "Discuté",
  "signataires": {
    "auteur": {
      "typeAuteur": "Depute",
      "acteurRef": "PA267306",
      "groupePolitiqueRef": "PO730940"
    },
    "cosignatairesRefs": [
      "PA721270",
      "PA720692",
      "PA718926",
      "PA718720",
      "PA689",
      "PA441",
      "PA721118",
      "PA610654",
      "PA720546",
      "PA267306",
      "PA722202",
      "PA610667",
      "PA721012",
      "PA721896",
      "PA335612",
      "PA722110"
    ],
    "texteAffichable": "M.&#160;Chassaigne,  M.&#160;Jumel, Mme&#160;Bello, M.&#160;Brotherson, M.&#160;Bruneel, Mme&#160;Buffet, M.&#160;Dharr&#233;ville, M.&#160;Dufr&#232;gne, Mme&#160;Faucillon, Mme&#160;K&#233;clard-Mond&#233;sir, M.&#160;Lecoq, M.&#160;Nilor, M.&#160;Peu, M.&#160;Fabien&#160;Roussel, M.&#160;Serville et M.&#160;Wulfranc"
  },
  "pointeurFragmentTexte": {
    "division": {
      "titre": "Article 9",
      "articleDesignationCourte": "APRÈS ART. 9",
      "type": "ARTICLE",
      "avantAApres": "Apres",
      "divisionRattachee": "APRÈS L'ARTICLE 9, insérer l'article suivant:",
      "articleAdditionnel": "1",
      "urlDivisionTexteVise": "/15/textes/0911.asp#D_Article_9"
    }
  },
  "corps": {
    "dispositif": "<p>Les avant-dernier et dernier alin&#233;as de l&#8217;article 49 de la Constitution sont supprim&#233;s.</p>",
    "exposeSommaire": "<p style=\"text-align: justify;\">Les propositions que nous portons dans le cadre de la r&#233;forme constitutionnelle visent &#224; renforcer les pouvoirs du Parlement et de l&#8217;opposition face &#224; l&#8217;hypertrophie du pouvoir ex&#233;cutif. Mettre fin &#224; ce d&#233;s&#233;quilibre des pouvoirs est indispensable pour corriger le d&#233;ficit d&#233;mocratique du r&#233;gime. Dans cet esprit, nous proposons &#233;galement de renforcer les droits de participation d&#233;mocratique. Enfin, une r&#233;forme de la Constitution ne peut se concevoir sans y inscrire des principes essentiels aujourd&#8217;hui absents de notre Loi fondamentale.</p><p style=\"text-align: justify;\">Les proc&#233;dures de mise en cause de la responsabilit&#233; du Gouvernement devant l&#8217;Assembl&#233;e nationale sont d&#233;finies par l&#8217;article&#160;49 de la Constitution. Cet article conf&#232;re &#224; la Constitution de 1958 l&#8217;un des caract&#232;res fondamentaux du r&#233;gime parlementaire. Il s&#8217;agit cependant d&#8217;un parlementarisme fortement rationalis&#233; visant &#224; assurer, en tout premier lieu, la stabilit&#233; de l&#8217;Ex&#233;cutif. Cet article, qui reprend &#224; son compte des &#233;l&#233;ments du r&#233;gime pr&#233;c&#233;dent, contient toutefois, &#224; son alin&#233;a&#160;3, une disposition sans &#233;quivalent dans les constitutions ant&#233;rieures ou &#233;trang&#232;res, et fournissant une arme sans &#233;gale au Gouvernement. L&#8217;alin&#233;a&#160;3 de cet article permet l&#8217;adoption d&#8217;un texte sans vote.</p><p style=\"text-align: justify;\">Lorsque le Gouvernement engage sa responsabilit&#233; politique sur le vote d&#8217;un texte sur le fondement de&#160;l&#8217;article&#160;49, alin&#233;a&#160;3, de la Constitution, le texte est r&#233;put&#233; adopt&#233;, sauf vote d&#8217;une motion de censure &#224; la majorit&#233; absolue des d&#233;put&#233;s composant l&#8217;Assembl&#233;e nationale.</p><p style=\"text-align: justify;\">Limit&#233;e aux d&#233;buts de la Ve R&#233;publique (18 fois de 1958 &#224; 1981), l&#8217;utilisation de l&#8217;article&#160;49, alin&#233;a&#160;3, s&#8217;est accrue par la suite notamment pour discipliner la majorit&#233; (64 fois de 1981 &#224; 2015). La r&#233;vision constitutionnelle de 2008 a restreint l&#8217;engagement de responsabilit&#233; sur un vote &#224; un texte par session.</p><p style=\"text-align: justify;\">Depuis 2014, l&#8217;article&#160;49, alin&#233;a&#160;3 a &#233;t&#233; utilis&#233; &#224; deux reprises&#160;: en 2015 pour la loi &#171;&#160;Macron&#160;&#187; et en 2016 pour la loi &#171;&#160;El Khomri&#160;&#187;.</p><p style=\"text-align: justify;\">Contrairement &#224; l&#8217;id&#233;e g&#233;n&#233;ralement r&#233;pandue, ce dispositif ne vise pas l&#8217;opposition mais constitue une arme gouvernementale contre sa propre majorit&#233; pour la contraindre &#224; adopter un texte dont elle ne veut pas.</p><p style=\"text-align: justify;\">Cet amendement vise &#224; mettre fin &#224; cette proc&#233;dure anti-d&#233;mocratique. Cette suppression aura l&#8217;avantage d&#8217;inciter le Gouvernement &#224; discuter avec le Parlement d&#8217;&#233;ventuels d&#233;saccords plut&#244;t que d&#8217;avoir recours au &#171;&#160;passage en force&#160;&#187;.</p>"
  },
  "representations": [
    {
      "nom": "PDF",
      "typeMime": {
        "type": "application",
        "subType": "PDF"
      },
      "statutRepresentation": {
        "verbatim": true,
        "canonique": true,
        "officielle": true,
        "transcription": false,
        "enregistrement": false
      },
      "contenu": {
        "documentURI": "/15/amendements/0911/CION_LOIS/CL959.pdf"
      }
    }
  ],
  "sort": {
    "dateSaisie": "2018-06-29T18:07:25.000+02:00",
    "sortEnSeance": "Non soutenu"
  },
  "dateDepot": "2018-06-22T02:00:00.000+02:00",
  "dateDistribution": "2018-06-28T02:00:00.000+02:00",
  "article99": "0",
  "loiReference": {
    "codeLoi": "49",
    "divisionCodeLoi": "3-0"
  }
}