{
  "uid": "AMANR5L15SEA717460BTC0369P0D1N126",
  "identifiant": {
    "legislature": "15",
    "numero": "126",
    "numRect": "0",
    "saisine": {
      "texteLegislatifRef": "PRJLANR5L15BTC0369",
      "numeroPartiePLF": "0",
      "organeExamen": "PO717460",
      "mentionSecondeDeliberation": "0"
    }
  },
  "numeroLong": "126",
  "etapeTexte": "1ère lecture (1ère assemblée saisie)",
  "triAmendement": "n",
  "cardinaliteAmdtMultiples": "1",
  "etat": "Discuté",
  "signataires": {
    "auteur": {
      "typeAuteur": "Depute",
      "acteurRef": "PA719930",
      "groupePolitiqueRef": "PO730946"
    },
    "cosignatairesRefs": [
      "PA608011",
      "PA643145",
      "PA342415",
      "PA337483",
      "PA720988",
      "PA267233",
      "PA608172",
      "PA429893",
      "PA340343",
      "PA335054",
      "PA405480",
      "PA609590",
      "PA335532",
      "PA1592",
      "PA1809",
      "PA1008",
      "PA607553",
      "PA610681",
      "PA332614",
      "PA719930",
      "PA508",
      "PA333285",
      "PA330357",
      "PA609332",
      "PA333818",
      "PA588886",
      "PA1198",
      "PA605069",
      "PA335999",
      "PA608695",
      "PA642764"
    ],
    "texteAffichable": "M.&#160;Vallaud,  M.&#160;Aviragnet, Mme&#160;Bareigts, Mme&#160;Vainqueur-Christophe, Mme&#160;Batho, Mme&#160;Battistel, Mme&#160;Bi&#233;mouret, M.&#160;Bouillon, M.&#160;Jean-Louis&#160;Bricout, M.&#160;Carvounas, M.&#160;Alain&#160;David, Mme&#160;Laurence&#160;Dumont, M.&#160;Dussopt, M.&#160;Faure, M.&#160;Garot, M.&#160;David&#160;Habib, M.&#160;Hutin, M.&#160;Juanico, Mme&#160;Karamanli, M.&#160;J&#233;r&#244;me&#160;Lambert, M.&#160;Le Foll, M.&#160;Letchimy, Mme&#160;Manin, Mme&#160;Pau-Langevin, Mme&#160;Pires Beaune, M.&#160;Potier, M.&#160;Pueyo, M.&#160;Pupponi, Mme&#160;Rabault, M.&#160;Saulignac et Mme&#160;Untermaier"
  },
  "pointeurFragmentTexte": {
    "division": {
      "titre": "Article 3",
      "articleDesignationCourte": "ART. 3",
      "type": "ARTICLE",
      "avantAApres": "A",
      "divisionRattachee": "ARTICLE 3",
      "urlDivisionTexteVise": "/15/textes/0369.asp#D_Article_3"
    }
  },
  "corps": {
    "dispositif": "<p>Supprimer cet article.</p>",
    "exposeSommaire": "<p style=\"text-align: justify;\">Vous venez d&#8217;adopter la premi&#232;re ordonnance qui permettra notamment de contourner les syndicats dans les petites entreprises en renvoyant la n&#233;gociation syndicale &#224; une simple relation sociale, en permettant &#224; l&#8217;employeur de d&#233;cider seul dans les entreprises de moins de 20 salari&#233;s, en privant un tiers des salari&#233;s fran&#231;ais du droit d&#8217;&#234;tre repr&#233;sent&#233; et d&#233;fendu par des syndicats.</p><p style=\"text-align: justify;\">C&#8217;est donc dans ce climat de d&#233;fiance &#224; l&#8217;&#233;gard des syndicats que nous entamons l&#8217;examen de l&#8217;ordonnance sur la place des acteurs du dialogue social et des moyens qui leur sont accord&#233;s.</p><p style=\"text-align: justify;\">Et je dois vous dire que le nombre d&#8217;amendements d&#233;pos&#233;s par notre Groupe sur cette ordonnance, pr&#232;s d&#8217;une vingtaine, t&#233;moigne de l&#8217;inqui&#233;tude que soul&#232;ve votre texte.</p><p style=\"text-align: justify;\">Lors des auditions, tous les syndicats ont rappel&#233; le d&#233;s&#233;quilibre profond de votre texte entre flexibilit&#233; d&#8217;une part et s&#233;curit&#233; d&#8217;autre part. Car vous ne cessez de renvoyer la n&#233;gociation au plus pr&#232;s du terrain en nous demandant de faire confiance et vous vous obstinez &#224; r&#233;duire les pr&#233;rogatives et les droits&#160;accord&#233;s aux repr&#233;sentants des salari&#233;s. Je n&#8217;en citerai que trois exemples.</p><p style=\"text-align: justify;\">D&#8217;abord, la disparition s&#232;che du CHSCT pour lui pr&#233;f&#233;rer la cr&#233;ation d&#8217;une commission sp&#233;cifique &#171;&#160;sant&#233;, s&#233;curit&#233; et conditions de travai&#160;&#187; qui ne sera obligatoire que dans certains cas</p><p style=\"text-align: justify;\">Ensuite,&#160;l&#8217;inqui&#233;tante suppression du droit d&#8217;alerte dans les entreprises de moins de 50 salari&#233;s pour lesquelles vous avez m&#234;me supprim&#233; le droit d&#8217;alert en cas de danger grave et imminent tel que le harc&#232;lement.</p><p style=\"text-align: justify;\">Enfin, la remise en cause incompr&#233;hensible du droit et de l&#8217;acc&#232;s aux expertises qui sont pourtant un outil essentiel &#224; un dialgue social de qualit&#233;.&#160;</p><p style=\"text-align: justify;\">Madame la Ministre, au d&#233;fi de l&#8217;implantation syndicale et de son d&#233;veloppement dans l&#8217;entreprise, vous auriez pu r&#233;pondre&#160;:</p><p style=\"text-align: justify;\">- en d&#233;veloppant les commissions paritaires r&#233;gionales interprofessionnelles que vous pr&#233;f&#233;rez tuer dans l&#8217;&#339;uf,</p><p style=\"text-align: justify;\">- en instaurant le ch&#232;que syndical qui permettrait de renforcer le taux de syndicalisation, partant du principe que les salari&#233;s auront envie d&#8217;adh&#233;rer &#224; un syndicat d&#232;s lors qu&#8217;ils participeront &#224; son financement,</p><p style=\"text-align: justify;\">- ou encore en proposant des mesures de lutte contre les discriminations syndicales.</p><p style=\"text-align: justify;\">Non rien de tout cela.</p><p style=\"text-align: justify;\">Au premier vous r&#233;pondez qu&#8217;elles ne fonctionnent pas alors que l&#8217;encre qui en a dessin&#233; les contours est &#224; peine s&#232;che.</p><p style=\"text-align: justify;\">Au deuxi&#232;me, vous avez renonc&#233; alors que le Pr&#233;sident de la R&#233;publique en avait fait une priorit&#233; dans son programme pr&#233;sidentiel.</p><p style=\"text-align: justify;\">Au troisi&#232;me vous nous renvoyez &#224; un groupe de travail qui a surtout &#233;t&#233; form&#233; pour r&#233;pondre aux m&#233;contentements de tous les syndicats apr&#232;s la publication de vos ordonnances.</p><p style=\"text-align: justify;\">La r&#233;alit&#233; de la pr&#233;sence syndicale dans les entreprises est trop faible. Contrairement &#224; ce que vous affichez vous ne voyez pas le dialogue social comme un facteur d&#8217;am&#233;lioration des conditions de travail et de meilleure comp&#233;titivit&#233; mais vous c&#233;dez &#224; la pression patronale dont certains nous ont dit en audition que la r&#233;forme leur convenait, je cite, &#171;&#160;tant qu&#8217;elle ne faisait pas rentrer les syndicats chez eux&#160;&#187;.</p>"
  },
  "representations": [
    {
      "nom": "PDF",
      "typeMime": {
        "type": "application",
        "subType": "PDF"
      },
      "statutRepresentation": {
        "verbatim": true,
        "canonique": true,
        "officielle": true,
        "transcription": false,
        "enregistrement": false
      },
      "contenu": {
        "documentURI": "/15/amendements/0369/AN/126.pdf"
      }
    }
  ],
  "seanceDiscussion": "RUANR5L15S2018IDS20776",
  "sort": {
    "dateSaisie": "2017-11-22T19:05:35.000+01:00",
    "sortEnSeance": "Rejeté"
  },
  "dateDepot": "2017-11-17T01:00:00.000+01:00",
  "dateDistribution": "2017-11-20T01:00:00.000+01:00",
  "article99": "0",
  "loiReference": {}
}