{
  "uid": "AMANR5L15SEA717460BTC1974P0D1N662",
  "identifiant": {
    "legislature": "15",
    "numero": "662",
    "numRect": "0",
    "saisine": {
      "texteLegislatifRef": "PRJLANR5L15BTC1974",
      "numeroPartiePLF": "0",
      "organeExamen": "PO717460",
      "mentionSecondeDeliberation": "0"
    }
  },
  "numeroLong": "662",
  "etapeTexte": "1ère lecture (2ème assemblée saisie)",
  "triAmendement": "cmaaaaaaaaaaaaaaaaaaaaaaaaaaaaaaaaaaaaaaaaaaaaaaaaian",
  "cardinaliteAmdtMultiples": "1",
  "etat": "Discuté",
  "signataires": {
    "auteur": {
      "typeAuteur": "Depute",
      "acteurRef": "PA718884",
      "groupePolitiqueRef": "PO730934"
    },
    "cosignatairesRefs": [
      "PA267204",
      "PA643134",
      "PA713448",
      "PA709315",
      "PA267901",
      "PA332523",
      "PA267260",
      "PA267289",
      "PA718884",
      "PA1012",
      "PA712015",
      "PA720630"
    ],
    "texteAffichable": "Mme&#160;Bazin-Malgras,  M.&#160;Kamardine, Mme&#160;Valentin, M.&#160;Minot, M.&#160;Dive, M.&#160;Sermier, M.&#160;de la Verpilli&#232;re, M.&#160;Door, M.&#160;Viala, Mme&#160;Brenier, Mme&#160;Poletti et Mme&#160;Dalloz"
  },
  "pointeurFragmentTexte": {
    "division": {
      "titre": "Article 22 bis AB",
      "articleDesignationCourte": "ART. 22 BIS AB",
      "type": "ARTICLE",
      "avantAApres": "A",
      "divisionRattachee": "ARTICLE 22 BIS AB",
      "urlDivisionTexteVise": "/15/textes/1974.asp#D_Article_22_bis_AB"
    }
  },
  "corps": {
    "dispositif": "<p>R&#233;diger ainsi cet article :</p><p>&#192; compter du 1<sup>er</sup> d&#233;cembre 2020, le Gouvernement remet tous les cinq ans au Parlement un rapport sur le vol, le recel et la revente illicite de cycles.&#160;</p><p>Ce rapport pr&#233;sente un bilan de la mise en &#339;uvre du dispositif d&#8217;identification des cycles, identifie les lieux pr&#233;sentant le plus de risques pour les cycles et formule des propositions afin de renforcer la lutte contre le vol, le recel et la vente illicite de cycles.</p>",
    "exposeSommaire": "<p>Afin d&#8217;assurer le suivi de la politique d&#8217;identification et de lutte contre le vol des cycles, le Gouvernement remet un rapport annuel au Parlement &#224; partir du 1<sup>er</sup> d&#233;cembre 2020.</p><p style=\"text-align: justify;\">L&#8217;objet de ce rapport est de pr&#233;senter un bilan de la politique d&#8217;identification, une &#233;valuation de l&#8217;efficacit&#233; de cette politique, en rapport avec le nombre d&#8217;infractions recens&#233;es et les am&#233;liorations &#233;ventuelles &#224; y apporter.</p>"
  },
  "representations": [
    {
      "nom": "PDF",
      "typeMime": {
        "type": "application",
        "subType": "PDF"
      },
      "statutRepresentation": {
        "verbatim": true,
        "canonique": true,
        "officielle": true,
        "transcription": false,
        "enregistrement": false
      },
      "contenu": {
        "documentURI": "/15/amendements/1974/AN/662.pdf"
      }
    }
  ],
  "seanceDiscussion": "RUANR5L15S2019IDS21683",
  "sort": {
    "dateSaisie": "2019-06-07T19:58:40.000+02:00",
    "sortEnSeance": "Retiré"
  },
  "dateDepot": "2019-05-27T02:00:00.000+02:00",
  "dateDistribution": "2019-06-07T02:00:00.000+02:00",
  "article99": "0",
  "loiReference": {}
}