{
  "uid": "AMANR5L15SEA717460BTC1187P0D1N38",
  "identifiant": {
    "legislature": "15",
    "numero": "38",
    "numRect": "0",
    "saisine": {
      "texteLegislatifRef": "PIONANR5L15BTC1187",
      "numeroPartiePLF": "0",
      "organeExamen": "PO717460",
      "mentionSecondeDeliberation": "0"
    }
  },
  "numeroLong": "38",
  "etapeTexte": "1ère lecture (2ème assemblée saisie)",
  "triAmendement": "ar",
  "cardinaliteAmdtMultiples": "1",
  "etat": "Discuté",
  "signataires": {
    "auteur": {
      "typeAuteur": "Depute",
      "acteurRef": "PA721530",
      "groupePolitiqueRef": "PO730970"
    },
    "cosignatairesRefs": [
      "PA721924",
      "PA1276",
      "PA720256",
      "PA719504",
      "PA719918",
      "PA721992",
      "PA720002",
      "PA719488",
      "PA721234",
      "PA720178",
      "PA721530",
      "PA720924"
    ],
    "texteAffichable": "Mme&#160;Luquet,  M.&#160;Berta, Mme&#160;El Ha&#239;ry, Mme&#160;Gallerneau, M.&#160;Garcia, M.&#160;Lain&#233;, M.&#160;Lagleize, Mme&#160;Bannier, Mme&#160;Maud&#160;Petit, M.&#160;Fanget, Mme&#160;de Vaucouleurs et Mme&#160;Elimas"
  },
  "pointeurFragmentTexte": {
    "division": {
      "titre": "Article 2 bis",
      "articleDesignationCourte": "APRÈS ART. 2 BIS",
      "type": "ARTICLE",
      "avantAApres": "Apres",
      "divisionRattachee": "APRÈS L'ARTICLE 2 BIS, insérer l'article suivant:",
      "articleAdditionnel": "1",
      "urlDivisionTexteVise": "/15/textes/1187.asp#D_Article_2_bis"
    }
  },
  "corps": {
    "dispositif": "<p style=\"text-align: justify;\">I.&#160;&#8211;&#160;Apr&#232;s l&#8217;article L.&#160;2241&#8209;2&#8209;1 du code des transports, il est ins&#233;r&#233; un article L.&#160;2241&#8209;2&#8209;2 ainsi r&#233;dig&#233;&#160;:</p><p style=\"text-align: justify;\">&#171;&#160;<i>Art.&#160;L.&#160;2241&#8209;2&#8209;2</i>.&#160;&#8211;&#160;Dans l&#8217;exercice de leurs missions relatives &#224; la police des transports, &#224; la s&#233;curit&#233; et &#224; la lutte contre la fraude, les agents asserment&#233;s mentionn&#233;s au&#160;4&#176; du&#160;I de l&#8217;article L.&#160;2241&#8209;1 du pr&#233;sent code peuvent proc&#233;der en tous lieux, au moyen de cam&#233;ras individuelles, &#224; un enregistrement audiovisuel de leurs interventions lorsque se produit ou est susceptible de se produire un incident de nature &#224; mettre en p&#233;ril leur int&#233;grit&#233; physique, eu &#233;gard aux circonstances de l&#8217;intervention ou au comportement des personnes concern&#233;es.</p><p style=\"text-align: justify;\">&#171;&#160;L&#8217;enregistrement n&#8217;est pas permanent.</p><p style=\"text-align: justify;\">&#171;&#160;Les enregistrements ont pour finalit&#233;s la pr&#233;vention des incidents au cours des interventions des agents asserment&#233;s mentionn&#233;s au&#160;4&#176; du&#160;I de l&#8217;article L.&#160;2241&#8209;1 du pr&#233;sent code, le constat des infractions et la poursuite de leurs auteurs par la collecte de preuves ainsi que la formation et la p&#233;dagogie des agents.</p><p style=\"text-align: justify;\">&#171;&#160;Les cam&#233;ras sont port&#233;es de fa&#231;on apparente. Un signal visuel sp&#233;cifique indique si la cam&#233;ra enregistre. Le d&#233;clenchement de l&#8217;enregistrement fait l&#8217;objet d&#8217;une information des personnes enregistr&#233;es, sauf si les circonstances l&#8217;interdisent. Une information g&#233;n&#233;rale du public sur l&#8217;emploi de ces cam&#233;ras est organis&#233;e par le ministre charg&#233; des transports. Les personnels auxquels les cam&#233;ras individuelles sont fournies ne peuvent avoir acc&#232;s directement aux enregistrements auxquels ils proc&#232;dent.</p><p style=\"text-align: justify;\">&#171;&#160;L&#8217;enregistrement ne peut avoir lieu hors des emprises immobili&#232;res n&#233;cessaires &#224; l&#8217;exploitation des services de transport ou des v&#233;hicules de transport public de personnes qui y sont affect&#233;s.</p><p style=\"text-align: justify;\">&#171;&#160;Les enregistrements audiovisuels, hors le cas o&#249; ils sont utilis&#233;s dans le cadre d&#8217;une proc&#233;dure judiciaire, administrative ou disciplinaire, sont effac&#233;s au bout de six mois.</p><p style=\"text-align: justify;\">&#171;&#160;Les articles L.&#160;252&#8209;1, L.&#160;252&#8209;2, L.&#160;253&#8209;1, L.&#160;253&#8209;2 et L.&#160;253&#8209;5 du code de la s&#233;curit&#233; int&#233;rieure sont applicables.</p><p style=\"text-align: justify;\">&#171;&#160;Les modalit&#233;s d&#8217;application du pr&#233;sent article et d&#8217;utilisation des donn&#233;es collect&#233;es sont pr&#233;cis&#233;es par un d&#233;cret en Conseil d&#8217;&#201;tat pris apr&#232;s avis motiv&#233; et publi&#233; de la Commission nationale de l&#8217;informatique et des libert&#233;s.&#160;&#187;</p><p style=\"text-align: justify;\">II.&#160;&#8211;&#160;Le&#160;I s&#8217;applique pour une dur&#233;e de trois ans &#224; compter de l&#8217;entr&#233;e en vigueur du d&#233;cret mentionn&#233; au dernier alin&#233;a du m&#234;me&#160;I, et au plus tard six mois apr&#232;s la promulgation de la pr&#233;sente loi.</p><p style=\"text-align: justify;\">Au plus tard six mois avant le terme de l&#8217;exp&#233;rimentation, le Gouvernement remet au Parlement un rapport d&#8217;&#233;valuation de sa mise en &#339;uvre, afin d&#8217;&#233;valuer l&#8217;opportunit&#233; du maintien de cette mesure.</p>",
    "exposeSommaire": "<p style=\"text-align: justify;\">Par la loi n&#176; 2016&#8209;339 du 22 mars 2016 relative &#224; la pr&#233;vention et &#224; la lutte contre les incivilit&#233;s, contre les atteintes &#224; la s&#233;curit&#233; publique et contre les actes terroristes dans les transports collectifs de voyageurs, les agents des services internes de s&#233;curit&#233; de la SNCF et de la R&#233;gie autonome des transports parisiens, SUGE et GPSR, se sont vus octroyer le droit, &#224; titre exp&#233;rimental, d&#8217;avoir recours &#224; l&#8217;utilisation de cam&#233;ras pi&#233;tons individuelles lors de leurs interventions.</p><p style=\"text-align: justify;\">La SNCF et la RATP se sont montr&#233;es extr&#234;mement favorables &#224; l&#8217;utilisation de ces cam&#233;ras dans la mesure o&#249; les exp&#233;rimentations ont montr&#233; que leur usage faisait imm&#233;diatement tomber l&#8217;agressivit&#233; des personnes contr&#244;l&#233;es.</p><p style=\"text-align: justify;\">En cons&#233;quence, pour r&#233;pondre &#224; une attente l&#233;gitime des transporteurs et lever un flou juridique, il convient d&#8217;&#233;tendre l&#8217;exp&#233;rimentation des cam&#233;ras pi&#233;tons aux agents asserment&#233;s mentionn&#233;s au 4&#176; du I de l&#8217;article L.&#160;2241&#8209;1 du code des transports, c&#8217;est &#224; dire aux contr&#244;leurs et v&#233;rificateurs de titres de transport de voyageurs, pour lesquels la possibilit&#233; d&#8217;avoir recours &#224; l&#8217;utilisation de cam&#233;ras pi&#233;tons permettra d&#8217;apaiser les relations avec les contrevenants comme cela a &#233;t&#233; constat&#233; pour les services de s&#233;curit&#233; tels que la SUGE ou le GPSR.</p><p style=\"text-align: justify;\">Tel est l&#8217;objet de cet amendement.</p>"
  },
  "representations": [
    {
      "nom": "PDF",
      "typeMime": {
        "type": "application",
        "subType": "PDF"
      },
      "statutRepresentation": {
        "verbatim": true,
        "canonique": true,
        "officielle": true,
        "transcription": false,
        "enregistrement": false
      },
      "contenu": {
        "documentURI": "/15/amendements/1187/AN/38.pdf"
      }
    }
  ],
  "seanceDiscussion": "RUANR5L15S2018IDS21209",
  "sort": {
    "dateSaisie": "2018-07-30T20:41:36.000+02:00",
    "sortEnSeance": "Rejeté"
  },
  "dateDepot": "2018-07-26T02:00:00.000+02:00",
  "dateDistribution": "2018-07-27T02:00:00.000+02:00",
  "article99": "0",
  "loiReference": {
    "codeLoi": "c transports",
    "divisionCodeLoi": "L2241-2-2"
  }
}