{
  "uid": "AMANR5L15PO420120B1168P0D1N3",
  "identifiant": {
    "legislature": "15",
    "numero": "3",
    "numRect": "0",
    "saisine": {
      "texteLegislatifRef": "PRJLANR5L15B1168",
      "numeroPartiePLF": "0",
      "organeExamen": "PO420120",
      "mentionSecondeDeliberation": "0"
    }
  },
  "numeroLong": "AS3",
  "etapeTexte": "Nouvelle Lecture",
  "triAmendement": "o",
  "cardinaliteAmdtMultiples": "1",
  "etat": "Discuté",
  "signataires": {
    "auteur": {
      "typeAuteur": "Depute",
      "acteurRef": "PA606712",
      "groupePolitiqueRef": "PO730934"
    },
    "cosignatairesRefs": [
      "PA606712"
    ],
    "texteAffichable": "M.&#160;Lurton"
  },
  "pointeurFragmentTexte": {
    "division": {
      "titre": "Article 13",
      "articleDesignationCourte": "ART. 13",
      "type": "ARTICLE",
      "avantAApres": "A",
      "divisionRattachee": "ARTICLE 13",
      "urlDivisionTexteVise": "/15/textes/1168.asp#D_Article_13"
    },
    "alinea": {
      "numero": "22"
    }
  },
  "corps": {
    "dispositif": "<p style=\"text-align: justify;\">R&#233;diger ainsi l&#8217;alin&#233;a&#160;22&#160;:</p><p style=\"text-align: justify;\">&#171;&#160;<i>d)</i>&#160;Les articles L.&#160;6324&#8209;1 &#224; L.&#160;6324&#8209;10 s&#8217;appliquent dans les seules branches dans lesquelles un accord de branche &#233;tendu pr&#233;voit leur maintien. Cet accord de branche &#233;tendu fixe les formations qualifiantes mentionn&#233;es au m&#234;me article L6314&#8209;1 et les modalit&#233;s de financement de ce dispositif.&#160;&#187;&#160;&#187;</p>",
    "exposeSommaire": "<p style=\"text-align: justify;\">(Amendement de repli)</p><p style=\"text-align: justify;\">Le pr&#233;sent amendement propose qu&#8217;un accord de branche &#233;tendu puisse pr&#233;voir le maintien du dispositif aff&#233;rent aux p&#233;riodes de professionnalisation, sous certaines conditions.</p><p style=\"text-align: justify;\">A titre d&#8217;exemple, la branche de l&#8217;hospitalisation priv&#233;e - sanitaire et m&#233;dico-sociale - est fortement pourvoyeuse de professions r&#233;glement&#233;es, titulaires de dipl&#244;mes d&#8217;&#201;tat. Ces formations sont longues et co&#251;teuses.</p><p style=\"text-align: justify;\">pr&#233;voir explicitement dans la loi que certaines branches puissent n&#233;gocier, par un accord de branche &#233;tendu, le maintien des p&#233;riodes de professionnalisation, garantie le financement des formations dipl&#244;mantes dispens&#233;es dans ces secteurs.</p><p style=\"text-align: justify;\">il s&#8217;agit, par cet amendement, d&#8217;assouplir le dispositif initialement pr&#233;vu en s&#8217;adaptant aux caract&#233;ristiques et aux besoins propres &#224; chaque branche, en mati&#232;re de priorit&#233;s de formations qualifiantes.</p>"
  },
  "representations": [
    {
      "nom": "PDF",
      "typeMime": {
        "type": "application",
        "subType": "PDF"
      },
      "statutRepresentation": {
        "verbatim": true,
        "canonique": true,
        "officielle": true,
        "transcription": false,
        "enregistrement": false
      },
      "contenu": {
        "documentURI": "/15/amendements/1168/CION-SOC/AS3.pdf"
      }
    }
  ],
  "sort": {
    "dateSaisie": "2018-07-18T15:28:19.000+02:00",
    "sortEnSeance": "Rejeté"
  },
  "dateDepot": "2018-07-17T02:00:00.000+02:00",
  "dateDistribution": "2018-07-18T02:00:00.000+02:00",
  "article99": "0",
  "loiReference": {}
}