{
  "uid": "AMANR5L15SEA717460BTA0216P0D1N96",
  "identifiant": {
    "legislature": "15",
    "numero": "96",
    "numRect": "0",
    "saisine": {
      "texteLegislatifRef": "PRJLANR5L15BTA0216",
      "numeroPartiePLF": "0",
      "organeExamen": "PO717460",
      "mentionSecondeDeliberation": "0"
    }
  },
  "numeroLong": "96",
  "etapeTexte": "Lecture définitive",
  "triAmendement": "ldaaaaaaaaaaaaaaaaaaaaaaaaaaaaaaaaaaaaaaaaaaaaaaaaiabkkkzzs",
  "cardinaliteAmdtMultiples": "1",
  "etat": "Discuté",
  "signataires": {
    "auteur": {
      "typeAuteur": "Depute",
      "acteurRef": "PA718780",
      "groupePolitiqueRef": "PO730934"
    },
    "cosignatairesRefs": [
      "PA718780"
    ],
    "texteAffichable": "Mme&#160;Trastour-Isnart"
  },
  "pointeurFragmentTexte": {
    "division": {
      "titre": "Article 53",
      "articleDesignationCourte": "ART. 53",
      "type": "ARTICLE",
      "avantAApres": "A",
      "divisionRattachee": "ARTICLE 53",
      "urlDivisionTexteVise": "/15/textes/TA0216.asp#D_Article_53"
    },
    "alinea": {
      "numero": "29"
    }
  },
  "corps": {
    "dispositif": "<p>Alin&#233;as 29 &#224; 36</p><p>Supprimer ces alin&#233;as.</p>",
    "exposeSommaire": "<p>L&#8217;article 53 instaure notamment un dispositif de sp&#233;cialisation d&#8217;un tribunal de grande instance par d&#233;partement dans certaines mati&#232;res civiles et p&#233;nales.</p><p>Cette mesure va vider de leur substance des juridictions de proximit&#233; et, de ce fait, &#233;loigner certains justiciables de la justice.</p><p>M&#234;me si le Gouvernement ne pr&#233;voit pas &#224; l&#8217;heure actuelle de supprimer des tribunaux, cette mesure risque d&#8217;engendrer, &#224; terme, des suppressions.</p><p>C&#8217;est pourquoi, le pr&#233;sent amendement propose la suppression de cette mesure.</p>"
  },
  "representations": [
    {
      "nom": "PDF",
      "typeMime": {
        "type": "application",
        "subType": "PDF"
      },
      "statutRepresentation": {
        "verbatim": true,
        "canonique": true,
        "officielle": true,
        "transcription": false,
        "enregistrement": false
      },
      "contenu": {
        "documentURI": "/15/amendements/TA0216/AN/96.pdf"
      }
    }
  ],
  "sort": {
    "dateSaisie": "2019-02-19T00:42:52.000+01:00",
    "sortEnSeance": "Rejeté"
  },
  "dateDepot": "2019-02-14T01:00:00.000+01:00",
  "dateDistribution": "2019-02-18T01:00:00.000+01:00",
  "article99": "0",
  "loiReference": {}
}