{
  "uid": "AMANR5L15PO59051B2357P0D1N1073",
  "identifiant": {
    "legislature": "15",
    "numero": "1073",
    "numRect": "0",
    "saisine": {
      "texteLegislatifRef": "PRJLANR5L15B2357",
      "numeroPartiePLF": "0",
      "organeExamen": "PO59051",
      "mentionSecondeDeliberation": "0"
    }
  },
  "numeroLong": "CL1073",
  "etapeTexte": "1ère lecture (2ème assemblée saisie)",
  "triAmendement": "aaoaaaaaaaaaaaaaaaaaaaaaaaaaaaaaaaaaaaaaaaaaaaaaaaaab",
  "cardinaliteAmdtMultiples": "1",
  "etat": "Discuté",
  "signataires": {
    "auteur": {
      "typeAuteur": "Depute",
      "acteurRef": "PA722150",
      "groupePolitiqueRef": "PO730964"
    },
    "cosignatairesRefs": [
      "PA721584",
      "PA718918",
      "PA721262",
      "PA721624",
      "PA2449",
      "PA721568",
      "PA719202",
      "PA721616",
      "PA721800",
      "PA721296",
      "PA720154",
      "PA720370",
      "PA720454",
      "PA719866",
      "PA2828",
      "PA722292",
      "PA721142",
      "PA719952",
      "PA722398",
      "PA720108",
      "PA720908",
      "PA719994",
      "PA721792",
      "PA606507",
      "PA721158",
      "PA719302",
      "PA722150",
      "PA720318",
      "PA721364",
      "PA719616",
      "PA677483",
      "PA721908",
      "PA721880",
      "PA721702",
      "PA719692",
      "PA719748",
      "PA719684"
    ],
    "texteAffichable": "M.&#160;Houli&#233;,  M.&#160;Vuilletet, Mme&#160;Abadie, M.&#160;Anglade, Mme&#160;Avia, M.&#160;Boudi&#233;, Mme&#160;Braun-Pivet, Mme&#160;Chalas, Mme&#160;Dubost, Mme&#160;Dubr&#233;-Chirat, M.&#160;Eliaou, M.&#160;Euzet, M.&#160;Fauvergue, Mme&#160;Forteza, M.&#160;Gauvain, M.&#160;Gouffier-Cha, Mme&#160;Guerel, Mme&#160;Gu&#233;venoux, M.&#160;Houbron, Mme&#160;Kamowski, Mme&#160;Louis, M.&#160;Matras, M.&#160;Mazars, M.&#160;Mendes, M.&#160;Mis, Mme&#160;Moutchou, Mme&#160;Oppelt, M.&#160;Paris, M.&#160;Person, M.&#160;Pont, M.&#160;Rebeyrotte, M.&#160;Rudigoz, M.&#160;Rupin, M.&#160;Terlier, Mme&#160;Thourot, M.&#160;Tourret et Mme&#160;Zannier"
  },
  "pointeurFragmentTexte": {
    "division": {
      "titre": "Article PREMIER",
      "articleDesignationCourte": "ART. PREMIER",
      "type": "ARTICLE",
      "avantAApres": "A",
      "divisionRattachee": "ARTICLE PREMIER",
      "urlDivisionTexteVise": "/15/textes/2357.asp#D_Article_1er"
    },
    "alinea": {
      "numero": "1"
    }
  },
  "corps": {
    "dispositif": "<p style=\"text-align: justify;\">Substituer aux alin&#233;as&#160;1 &#224;&#160;17 les dix alin&#233;as suivants&#160;:</p><p style=\"text-align: justify;\">I.&#160;&#8211;&#160;La section&#160;3 du chapitre&#160;I<sup>er</sup> du titre&#160;I<sup>er</sup> du livre&#160;II de la cinqui&#232;me partie du code g&#233;n&#233;ral des collectivit&#233;s territoriales est compl&#233;t&#233;e par une sous-section&#160;3 ainsi r&#233;dig&#233;e&#160;:&#160;</p><p style=\"text-align: justify;\">&#171;&#160;Sous-section&#160;3</p><p style=\"text-align: justify;\">&#171;&#160;Relations des maires avec les &#233;tablissements publics de coop&#233;ration intercommunale &#224; fiscalit&#233; propre</p><p style=\"text-align: justify;\">&#171;&#160;<i>Art.&#160;L.&#160;5211&#8209;11&#8209;1</i>.&#160;&#8211;&#160;I.&#160;&#8211;&#160;Apr&#232;s chaque renouvellement g&#233;n&#233;ral des conseils municipaux ou une op&#233;ration pr&#233;vue par l&#8217;article&#160;L.&#160;5211&#8209;41&#8209;3, le pr&#233;sident de l&#8217;&#233;tablissement public de coop&#233;ration intercommunale inscrit &#224; l&#8217;ordre du jour de l&#8217;organe d&#233;lib&#233;rant un d&#233;bat et une d&#233;lib&#233;ration sur l&#8217;&#233;laboration d&#8217;un pacte de gouvernance entre les communes et l&#8217;&#233;tablissement public de coop&#233;ration intercommunale dont elles sont membres. Si l&#8217;organe d&#233;lib&#233;rant d&#233;cide l&#8217;&#233;laboration d&#8217;un pacte, il l&#8217;adopte dans les neuf&#160;mois qui suivent le renouvellement g&#233;n&#233;ral.&#160;</p><p style=\"text-align: justify;\">&#171;&#160;II.&#160;&#8211;&#160;Le pacte peut pr&#233;voir les conditions dans lesquelles sont mises en &#339;uvre les dispositions de l&#8217;article&#160;L.&#160;5211&#8209;57.&#160;</p><p style=\"text-align: justify;\">&#171;&#160;Le pacte peut pr&#233;voir la cr&#233;ation de commissions sp&#233;cialis&#233;es associant les maires et d&#233;termine leur organisation, leur fonctionnement et leurs missions. Il fixe, le cas &#233;ch&#233;ant, les modalit&#233;s de fonctionnement des commissions pr&#233;vues &#224; l&#8217;article&#160;L.&#160;5211&#8209;40&#8209;1.&#160;</p><p style=\"text-align: justify;\">&#171;&#160;Le pacte peut pr&#233;voir la cr&#233;ation de conf&#233;rences territoriales des maires selon des p&#233;rim&#232;tres g&#233;ographiques et des p&#233;rim&#232;tres de comp&#233;tences qu&#8217;il d&#233;termine. Les conf&#233;rences territoriales des maires peuvent &#234;tre consult&#233;es lors de l&#8217;&#233;laboration et de la mise en &#339;uvre de politiques de l&#8217;&#233;tablissement public de coop&#233;ration intercommunale &#224; fiscalit&#233; propre. Les modalit&#233;s de fonctionnement des conf&#233;rences territoriales des maires sont d&#233;termin&#233;es par le r&#232;glement int&#233;rieur de l&#8217;organe d&#233;lib&#233;rant de l&#8217;&#233;tablissement public de coop&#233;ration intercommunale &#224; fiscalit&#233; propre.&#160;</p><p style=\"text-align: justify;\">&#171;&#160;Le pacte peut pr&#233;voir les conditions dans lesquelles le pr&#233;sident de l&#8217;&#233;tablissement public de coop&#233;ration intercommunale &#224; fiscalit&#233; propre pourra d&#233;l&#233;guer au maire l&#8217;engagement de certaines d&#233;penses d&#8217;entretien courant d&#8217;infrastructures ou de b&#226;timents communautaires. Dans ce cas, le pacte fixe &#233;galement les conditions dans lesquelles le maire dispose d&#8217;une autorit&#233; fonctionnelle sur les services de l&#8217;&#233;tablissement public de coop&#233;ration intercommunale &#224; fiscalit&#233; propre, dans le cadre d&#8217;une convention de mise &#224; disposition de services.&#160;</p><p style=\"text-align: justify;\">&#171;&#160;Dans les communaut&#233;s de communes et les communaut&#233;s d&#8217;agglom&#233;ration, le pacte peut pr&#233;voir la possibilit&#233;, par conventions de mise &#224; disposition approuv&#233;es par d&#233;lib&#233;rations concordantes du conseil municipal et de l&#8217;organe d&#233;lib&#233;rant de l&#8217;&#233;tablissement public, de placer, dans le ressort territorial d&#8217;une commune membre et pour l&#8217;exercice des comp&#233;tences pr&#233;vues au&#160;3&#176;&#160;et au&#160;4&#176;&#160;du&#160;II de l&#8217;article&#160;L.&#160;5214&#8209;16 et au&#160;1&#176;&#160;et&#160;5&#176;&#160;du&#160;II de l&#8217;article&#160;L.&#160;5216&#8209;5, des services de l&#8217;&#233;tablissement public de coop&#233;ration intercommunale sous l&#8217;autorit&#233; fonctionnelle du maire.&#160;</p><p style=\"text-align: justify;\">&#171;&#160;III. &#8722; Le pacte peut &#234;tre modifi&#233; par l&#8217;organe d&#233;lib&#233;rant de l&#8217;&#233;tablissement public de coop&#233;ration intercommunale, selon la m&#234;me proc&#233;dure que pour son adoption.&#160;&#187;</p>",
    "exposeSommaire": "<p style=\"text-align: justify;\">Le pr&#233;sent amendement r&#233;tablit l&#8217;&#233;criture initiale de l&#8217;article 1er du projet de loi.</p><p style=\"text-align: justify;\">En effet, cette r&#233;daction vise &#224; garantir une articulation harmonieuse entre l&#8217;&#233;tablissement public de coop&#233;ration intercommunale (EPCI) &#224; fiscalit&#233; propre et ses communes membres.</p><p style=\"text-align: justify;\">L&#8217;EPCI a ainsi l&#8217;obligation de d&#233;battre et de se prononcer sur son souhait d&#8217;avoir recours ou non &#224; la signature d&#8217;un pacte de gouvernance. D&#232;s lors que l'organe d&#233;lib&#233;rant a choisi de recourir au pacte, celui-ci doit &#234;tre adopt&#233; dans les neuf mois suivant le renouvellement g&#233;n&#233;ral des conseils municipaux. Le contenu du pacte est &#233;galement pr&#233;cis&#233;.</p>"
  },
  "representations": [
    {
      "nom": "PDF",
      "typeMime": {
        "type": "application",
        "subType": "PDF"
      },
      "statutRepresentation": {
        "verbatim": true,
        "canonique": true,
        "officielle": true,
        "transcription": false,
        "enregistrement": false
      },
      "contenu": {
        "documentURI": "/15/amendements/2357/CION_LOIS/CL1073.pdf"
      }
    }
  ],
  "sort": {
    "dateSaisie": "2019-11-06T10:13:50.000+01:00",
    "sortEnSeance": "Adopté"
  },
  "dateDepot": "2019-11-02T01:00:00.000+01:00",
  "dateDistribution": "2019-11-05T01:00:00.000+01:00",
  "article99": "0",
  "loiReference": {}
}