{
  "uid": "AMANR5L15SEA717460B0269P0D1N169",
  "identifiant": {
    "legislature": "15",
    "numero": "169",
    "numRect": "1",
    "saisine": {
      "texteLegislatifRef": "PRJLANR5L15B0269",
      "numeroPartiePLF": "0",
      "organeExamen": "PO717460",
      "mentionSecondeDeliberation": "0"
    }
  },
  "numeroLong": "169 (Rect)",
  "etapeTexte": "1ère lecture (1ère assemblée saisie)",
  "triAmendement": "q",
  "cardinaliteAmdtMultiples": "1",
  "etat": "Discuté",
  "signataires": {
    "auteur": {
      "typeAuteur": "Depute",
      "acteurRef": "PA267289",
      "groupePolitiqueRef": "PO730934"
    },
    "cosignatairesRefs": [
      "PA267289",
      "PA721474",
      "PA608016",
      "PA2377",
      "PA606712",
      "PA856"
    ],
    "texteAffichable": "M.&#160;Door,  M.&#160;Viry, M.&#160;Perrut, M.&#160;Lurton, M.&#160;Cherpion et Mme&#160;Louwagie"
  },
  "pointeurFragmentTexte": {
    "division": {
      "titre": "Article 39",
      "articleDesignationCourte": "APRÈS ART. 39",
      "type": "ARTICLE",
      "avantAApres": "Apres",
      "divisionRattachee": "APRÈS L'ARTICLE 39, insérer l'article suivant:",
      "articleAdditionnel": "1",
      "urlDivisionTexteVise": "/15/textes/0269.asp#D_Article_39"
    }
  },
  "corps": {
    "dispositif": "<p style=\"text-align: justify;\">Le cinqui&#232;me alin&#233;a de l&#8217;article L.&#160;162&#8209;30&#8209;2 du code de la s&#233;curit&#233; sociale est compl&#233;t&#233; par une phrase ainsi r&#233;dig&#233;e&#160;:</p><p style=\"text-align: justify;\">&#171;&#160;Le contrat ne contient aucun indicateur qui d&#233;pend de la seule prescription m&#233;dicale.&#160;&#187;</p>",
    "exposeSommaire": "<p style=\"text-align: justify;\">Le respect de la libert&#233; d&#8217;exercice et de l&#8217;ind&#233;pendance professionnelle et morale des m&#233;decins est assur&#233;, notamment, par la libert&#233; de prescription.</p><p style=\"text-align: justify;\">L&#8217;article L.&#160;162&#8209;2 du code de la s&#233;curit&#233; sociale consacre ainsi, dans l&#8217;int&#233;r&#234;t des assur&#233;s sociaux et de la sant&#233; publique, le principe fondamental de la libert&#233; de prescription qui va de pair avec l&#8217;ind&#233;pendance professionnelle et la responsabilit&#233; du m&#233;decin.</p><p style=\"text-align: justify;\">Ce principe se voit remis en cause par certaines stipulations du CAQES qui font peser une obligation - assortie de sanctions -, de r&#233;gulation voire de contr&#244;le des prescriptions des m&#233;decins par les &#233;tablissements de sant&#233;, alors m&#234;me que ces derniers ne sont pas habilit&#233;s par les textes &#224; le faire.&#160;</p><p style=\"text-align: justify;\">Il est &#224; rappeler que le code de d&#233;ontologie m&#233;dicale conf&#232;re au m&#233;decin une autonomie quant &#224; sa prescription.&#160;</p><p style=\"text-align: justify;\">Par ailleurs, l&#8217;article L.&#160;162&#8209;2&#8209;1 du code de la s&#233;curit&#233; sociale pr&#233;voit que &#171;&#160;les m&#233;decins sont tenus, dans tous leurs actes et prescriptions, d&#8217;observer, dans le cadre de la l&#233;gislation et de la r&#233;glementation en vigueur, la plus stricte &#233;conomie compatible avec la qualit&#233;, la s&#233;curit&#233; et l&#8217;efficacit&#233; des soins.&#160;&#187;</p><p style=\"text-align: justify;\">Le dispositif contractuel du CAQES introduit donc une confusion dans les responsabilit&#233;s, dans la mesure o&#249; il sanctionne les &#233;tablissements de sant&#233; sur des &#233;l&#233;ments relevant des actes et prescriptions m&#233;dicales laiss&#233;s &#224; la libre appr&#233;ciation des m&#233;decins.&#160;</p><p style=\"text-align: justify;\">Une telle confusion va donc &#224; l&#8217;encontre de l&#8217;objectif recherch&#233; par le CAQES, &#224; savoir la qualit&#233; et la pertinence.</p><p style=\"text-align: justify;\">Il s&#8217;agit d&#8217;une incoh&#233;rence majeure dans le contr&#244;le des d&#233;penses de l&#8217;assurance maladie, qu&#8217;il convient de corriger.</p>"
  },
  "representations": [
    {
      "nom": "PDF",
      "typeMime": {
        "type": "application",
        "subType": "PDF"
      },
      "statutRepresentation": {
        "verbatim": true,
        "canonique": true,
        "officielle": true,
        "transcription": false,
        "enregistrement": false
      },
      "contenu": {
        "documentURI": "/15/amendements/0269/AN/169.pdf"
      }
    }
  ],
  "seanceDiscussion": "RUANR5L15S2018IDS20714",
  "sort": {
    "dateSaisie": "2017-10-27T23:19:25.000+02:00",
    "sortEnSeance": "Rejeté"
  },
  "dateDepot": "2017-10-19T02:00:00.000+02:00",
  "dateDistribution": "2017-10-23T02:00:00.000+02:00",
  "article99": "0",
  "loiReference": {}
}