{
  "uid": "AMANR5L15SEA717460B2272P2D1N1450",
  "identifiant": {
    "legislature": "15",
    "numero": "1450",
    "numRect": "0",
    "saisine": {
      "texteLegislatifRef": "PRJLANR5L15B2272",
      "numeroPartiePLF": "2",
      "organeExamen": "PO717460",
      "mentionSecondeDeliberation": "0"
    }
  },
  "numeroLong": "II-1450",
  "etapeTexte": "1ère lecture (1ère assemblée saisie)",
  "triAmendement": "ecaacaaaaaaaaaaaaaaaaaaaaaaaaaaaaaaaaaaaaaaaaaaaaazzzzx",
  "cardinaliteAmdtMultiples": "1",
  "etat": "Discuté",
  "signataires": {
    "auteur": {
      "typeAuteur": "Depute",
      "acteurRef": "PA718720",
      "groupePolitiqueRef": "PO730940"
    },
    "cosignatairesRefs": [
      "PA721270",
      "PA720692",
      "PA610654",
      "PA721012",
      "PA722202",
      "PA721896",
      "PA720546",
      "PA267306",
      "PA610667",
      "PA689",
      "PA335612",
      "PA722110",
      "PA718720",
      "PA721118",
      "PA718926",
      "PA441"
    ],
    "texteAffichable": "M.&#160;Dufr&#232;gne,  M.&#160;Fabien&#160;Roussel, Mme&#160;Bello, M.&#160;Brotherson, M.&#160;Bruneel, Mme&#160;Buffet, M.&#160;Chassaigne, M.&#160;Dharr&#233;ville, Mme&#160;Faucillon, M.&#160;Jumel, Mme&#160;K&#233;clard-Mond&#233;sir, M.&#160;Lecoq, M.&#160;Nilor, M.&#160;Peu, M.&#160;Serville et M.&#160;Wulfranc"
  },
  "pointeurFragmentTexte": {
    "division": {
      "titre": "Article 62",
      "articleDesignationCourte": "APRÈS ART. 62",
      "type": "ARTICLE",
      "avantAApres": "Apres",
      "divisionRattachee": "APRÈS L'ARTICLE 62, insérer l'article suivant:",
      "articleAdditionnel": "1",
      "urlDivisionTexteVise": "/15/textes/2272C.asp#D_Article_62"
    }
  },
  "corps": {
    "dispositif": "<p>I.&#160;&#8211;&#160;Le chapitre I<sup>er</sup> du titre II <i>bis</i> de la deuxi&#232;me partie du livre I<sup>er</sup> du code g&#233;n&#233;ral des imp&#244;ts est compl&#233;t&#233; par un VIII ainsi r&#233;dig&#233;&#160;:</p><p style=\"text-align: justify;\">&#171;&#160;VIII.&#160;&#8211;&#160;Taxes per&#231;ues pour le financement des infrastructures de transport</p><p style=\"text-align: justify;\">&#171;&#160;<i>Art.&#160;1599</i>&#160;quinquies&#160;D.&#160;&#8211;&#160;I.&#160;&#8211;&#160;&#192; compter du 1<sup>er</sup> janvier 2020, il est institu&#233;, au profit de l&#8217;Agence de financement des infrastructures de transport de France, une taxe annuelle sur les surfaces de stationnement annex&#233;es &#224; des locaux commerciaux exer&#231;ant une activit&#233; de commerce de d&#233;tail sur une surface de vente de plus de 2&#160;500 m&#232;tres carr&#233;s.</p><p style=\"text-align: justify;\">&#171;&#160;II.&#160;&#8211;&#160;Sont soumises &#224; la taxe les personnes priv&#233;es et publiques propri&#233;taires de surfaces de stationnement ou titulaires d&#8217;un droit r&#233;el portant sur celles-ci.</p><p style=\"text-align: justify;\">&#171;&#160;La taxe est acquitt&#233;e par le propri&#233;taire, l&#8217;usufruitier, le preneur &#224; bail &#224; construction, l&#8217;emphyt&#233;ote ou le titulaire d&#8217;une autorisation d&#8217;occupation temporaire du domaine public constitutive d&#8217;un droit r&#233;el qui dispose, au 1<sup>er</sup> janvier de l&#8217;ann&#233;e d&#8217;imposition, d&#8217;une surface taxable.</p><p style=\"text-align: justify;\">&#171;&#160;III.&#160;&#8211;&#160;Le montant de la taxe est de 40&#160;euros le m&#232;tre carr&#233;.</p><p style=\"text-align: justify;\">&#171;&#160;IV.&#160;&#8211;&#160;Ces tarifs sont actualis&#233;s au 1<sup>er</sup> janvier de chaque ann&#233;e en fonction du dernier indice du co&#251;t de la construction publi&#233; par l&#8217;Institut national de la statistique et des &#233;tudes &#233;conomiques. Les valeurs sont arrondies, s&#8217;il y a lieu, au centime d&#8217;euro sup&#233;rieur.</p><p style=\"text-align: justify;\">&#171;&#160;V.&#160;&#8211;&#160;Les redevables d&#233;posent une d&#233;claration selon les modalit&#233;s pr&#233;vues au VII de l&#8217;article&#160;231&#160;<i>ter</i>.</p><p style=\"text-align: justify;\">&#171;&#160;VI.&#160;&#8211;&#160;Le contr&#244;le, le recouvrement, le contentieux, les garanties et les sanctions relatifs &#224; la taxe sont r&#233;gis par les r&#232;gles applicables en mati&#232;re de taxe sur les salaires.&#160;&#187;</p><p style=\"text-align: justify;\">II.&#160;&#8211;&#160;Le I entre en vigueur &#224; compter du 1<sup>er</sup> janvier 2021.</p>",
    "exposeSommaire": "<p>Les hypermarch&#233;s d&#233;tiennent en France une part de march&#233; unique en Europe. Avec leurs 1,6 million de places de parkings, ils g&#233;n&#232;rent de tr&#232;s nombreux d&#233;placements automobiles, qui constituent une nuisance environnementale, et concurrencent les commerces de centre-ville et de centre-bourg. Pour corriger ces exc&#232;s et privil&#233;gier les autres formes de commerces alimentaires, supermarch&#233;s, sup&#233;rettes et commerces sp&#233;cialis&#233;s, et participer &#224; la revitalisation des villes et villages dans le pays, pour limiter &#233;galement l&#8217;artificialisation des sols en incitant &#224; un urbanisme moins consommateur d&#8217;espaces, il est n&#233;cessaire de prendre des mesures &#233;nergiques, d&#8217;autant que les besoins d&#8217;investissements en mati&#232;re de mobilit&#233; sont tr&#232;s importants. Il est n&#233;cessaire d&#8217;investir ainsi beaucoup plus dans le r&#233;seau ferr&#233;, les transports publics routiers et les am&#233;nagements cyclables. En 2015, a &#233;t&#233; cr&#233;&#233;e dans la seule r&#233;gion Ile-de-France, une taxe additionnelle annuelle sur les surfaces de stationnement annex&#233;es aux locaux &#224; usage de bureaux, aux locaux commerciaux et aux locaux de stockage, en vue de financer les d&#233;penses d&#8217;investissement de la R&#233;gion &#206;le-de-France en faveur des transports en commun. Cette taxe vertueuse du point de vue &#233;cologique concerne les surfaces de stationnements des hypermarch&#233;s et centres commerciaux offrant plus de 2&#160;500 m&#178; de surface de vente. Les auteurs de l&#8217;amendement proposent ici de l&#8217;&#233;tendre &#224; l&#8217;ensemble du territoire.</p>"
  },
  "representations": [
    {
      "nom": "PDF",
      "typeMime": {
        "type": "application",
        "subType": "PDF"
      },
      "statutRepresentation": {
        "verbatim": true,
        "canonique": true,
        "officielle": true,
        "transcription": false,
        "enregistrement": false
      },
      "contenu": {
        "documentURI": "/15/amendements/2272C/AN/1450.pdf"
      }
    }
  ],
  "seanceDiscussion": "RUANR5L15S2020IDS21922",
  "sort": {
    "dateSaisie": "2019-11-14T15:39:37.000+01:00",
    "sortEnSeance": "Rejeté"
  },
  "dateDepot": "2019-10-31T01:00:00.000+01:00",
  "dateDistribution": "2019-11-13T01:00:00.000+01:00",
  "article99": "0",
  "loiReference": {
    "codeLoi": "CGI",
    "divisionCodeLoi": "1599 quinquies D"
  }
}