{
  "uid": "AMANR5L15PO59051B0778P0D1N126",
  "identifiant": {
    "legislature": "15",
    "numero": "126",
    "numRect": "0",
    "saisine": {
      "texteLegislatifRef": "PRJLANR5L15B0778",
      "numeroPartiePLF": "0",
      "organeExamen": "PO59051",
      "mentionSecondeDeliberation": "0"
    }
  },
  "numeroLong": "CL126",
  "etapeTexte": "1ère lecture (1ère assemblée saisie)",
  "triAmendement": "gsdo",
  "cardinaliteAmdtMultiples": "1",
  "etat": "Discuté",
  "signataires": {
    "auteur": {
      "typeAuteur": "Depute",
      "acteurRef": "PA721960",
      "groupePolitiqueRef": "PO730958"
    },
    "cosignatairesRefs": [
      "PA722142",
      "PA2150",
      "PA720892",
      "PA720430",
      "PA721210",
      "PA720286",
      "PA588884",
      "PA721062",
      "PA720846",
      "PA721960",
      "PA721226",
      "PA718860",
      "PA719676",
      "PA719578",
      "PA721202",
      "PA718868",
      "PA720422"
    ],
    "texteAffichable": "Mme&#160;Obono,  Mme&#160;Autain, M.&#160;Bernalicis, M.&#160;Coquerel, M.&#160;Corbi&#232;re, Mme&#160;Fiat, M.&#160;Lachaud, M.&#160;Larive, M.&#160;M&#233;lenchon, Mme&#160;Panot, M.&#160;Prud&apos;homme, M.&#160;Quatennens, M.&#160;Ratenon, Mme&#160;Ressiguier, Mme&#160;Rubin, M.&#160;Ruffin et Mme&#160;Taurine"
  },
  "pointeurFragmentTexte": {
    "division": {
      "titre": "Article 4",
      "articleDesignationCourte": "ART. 4",
      "type": "ARTICLE",
      "avantAApres": "A",
      "divisionRattachee": "ARTICLE 4",
      "urlDivisionTexteVise": "/15/textes/0778.asp#D_Article_4"
    },
    "alinea": {
      "avantAApres": "A",
      "numero": "3",
      "alineaDesignation": "Alinéa 3"
    }
  },
  "corps": {
    "dispositif": "<p style=\"text-align: justify;\">&#192; l&#8217;alin&#233;a&#160;3, apr&#232;s la seconde occurrence du mot&#160;:</p><p style=\"text-align: justify;\">&#171;&#160;sexiste&#160;&#187;,</p><p style=\"text-align: justify;\">ins&#233;rer les mots&#160;:</p><p style=\"text-align: justify;\">&#171;&#160;ou relatif &#224; l&#8217;orientation sexuelle ou &#224; l&#8217;identit&#233; de genre&#160;&#187;.</p>",
    "exposeSommaire": "<p>Par cet amendement, le Groupe de la France insoumise propose de compl&#233;ter le pr&#233;sent article afin de prendre en compte toutes les formes de discriminations et de violences faites aux personnes en fonction de leur orientation sexuelle ou de l&#8217;identit&#233; de genre.</p><p><br />Bien que le seul angle p&#233;nal ne soit pas en soi suffisant, nous consid&#233;rons comme le ou la d&#233;fenseur&#183;se des droits (voir notamment son guide de mai 2017 : https://www.defenseurdesdroits.fr/sites/default/files/atoms/files/agir_contre_les_discriminations_liees_a_lorientation_sexuelle_et_a_lidentite_de_genre_dans_lemploi_0.pdf) qu&#8217;il faut mettre en &#339;uvre des actions concr&#232;tes et p&#233;rennes pour identifier et pr&#233;venir les LGBTphobies.</p>"
  },
  "representations": [
    {
      "nom": "PDF",
      "typeMime": {
        "type": "application",
        "subType": "PDF"
      },
      "statutRepresentation": {
        "verbatim": true,
        "canonique": true,
        "officielle": true,
        "transcription": false,
        "enregistrement": false
      },
      "contenu": {
        "documentURI": "/15/amendements/0778/CION_LOIS/CL126.pdf"
      }
    }
  ],
  "sort": {
    "dateSaisie": "2018-05-09T22:11:10.000+02:00",
    "sortEnSeance": "Tombé"
  },
  "dateDepot": "2018-05-04T02:00:00.000+02:00",
  "dateDistribution": "2018-05-07T02:00:00.000+02:00",
  "article99": "0",
  "loiReference": {
    "codeLoi": "7.5"
  }
}