{
  "uid": "AMANR5L15SEA717460B1255P1D1N50",
  "identifiant": {
    "legislature": "15",
    "numero": "50",
    "numRect": "0",
    "saisine": {
      "texteLegislatifRef": "PRJLANR5L15B1255",
      "numeroPartiePLF": "1",
      "organeExamen": "PO717460",
      "mentionSecondeDeliberation": "0"
    }
  },
  "numeroLong": "I-50",
  "etapeTexte": "1ère lecture (1ère assemblée saisie)",
  "triAmendement": "dsaaaaaaaaaaaaaaaaaaaaaaaaaaaaaaaaaaaaaaaaaaaaaaaac",
  "cardinaliteAmdtMultiples": "1",
  "etat": "Irrecevable",
  "signataires": {
    "auteur": {
      "typeAuteur": "Depute",
      "acteurRef": "PA607090",
      "groupePolitiqueRef": "PO730934"
    },
    "cosignatairesRefs": [
      "PA1874",
      "PA346218",
      "PA607090",
      "PA721506",
      "PA721968",
      "PA719318",
      "PA767",
      "PA605036",
      "PA718884",
      "PA721474",
      "PA332523",
      "PA267735",
      "PA330909",
      "PA721678",
      "PA267260",
      "PA267204",
      "PA608416",
      "PA718838"
    ],
    "texteAffichable": "M.&#160;Jean-Pierre&#160;Vigier,  Mme&#160;Anthoine, Mme&#160;Bazin-Malgras, M.&#160;Sermier, M.&#160;Brun, M.&#160;Cattin, M.&#160;Le Fur, M.&#160;Descoeur, Mme&#160;Kuster, M.&#160;Vialay, Mme&#160;Dalloz, M.&#160;Masson, M.&#160;Hetzel, M.&#160;Viry, M.&#160;Abad, Mme&#160;Poletti, M.&#160;Reda et M.&#160;de Ganay"
  },
  "pointeurFragmentTexte": {
    "division": {
      "titre": "Article 16",
      "articleDesignationCourte": "APRÈS ART. 16",
      "type": "ARTICLE",
      "avantAApres": "Apres",
      "divisionRattachee": "APRÈS L'ARTICLE 16, insérer l'article suivant:",
      "articleAdditionnel": "1",
      "urlDivisionTexteVise": "/15/textes/1255A.asp#D_Article_16"
    }
  },
  "corps": {
    "dispositif": "<p style=\"text-align: justify;\">I.&#160;&#8211;&#160;Le I de l&#8217;article&#160;1840 G <i>ter</i> du code g&#233;n&#233;ral des imp&#244;ts est compl&#233;t&#233; par un alin&#233;a ainsi r&#233;dig&#233;&#160;:</p><p style=\"text-align: justify;\">&#171;&#160;Par d&#233;rogation au premier alin&#233;a du pr&#233;sent&#160;I, en cas de d&#233;faut de production d&#8217;une partie des justifications permettant de b&#233;n&#233;ficier des exon&#233;rations pr&#233;vues aux articles 787&#160;B et 787&#160;C ou de production de justifications incompl&#232;tes ou erron&#233;es dans le d&#233;lai mentionn&#233; au m&#234;me alin&#233;a, l&#8217;administration met en demeure le ou les b&#233;n&#233;ficiaires de produire les justifications manquantes ou de corriger les justifications incompl&#232;tes ou erron&#233;es dans un nouveau d&#233;lai d&#8217;un mois suivant la r&#233;ception de la mise en demeure. &#192; d&#233;faut de production de ces justifications compl&#233;mentaires dans ce dernier d&#233;lai, les droits, &#233;ventuellement major&#233;s de l&#8217;int&#233;r&#234;t de retard pr&#233;vu &#224; l&#8217;article&#160;1727, sont acquitt&#233;s dans le mois qui suit l&#8217;expiration de ce dernier d&#233;lai.&#160;&#187;</p><p style=\"text-align: justify;\"><span  data-cid=\"3\" data-userid=\"347\" data-username=\"Jean-Pierre Vigier\" data-time=\"1538553436844\">II.&#160;&#8211;&#160;La perte de recettes pour l&#8217;&#201;tat est compens&#233;e &#224; due concurrence par la cr&#233;ation d&#8217;une taxe additionnelle aux droits mentionn&#233;s aux articles 575 et 575 A du code g&#233;n&#233;ral des imp&#244;ts.&#160;&#187;.</span></p>",
    "exposeSommaire": "<p style=\"text-align: justify;\">Les exon&#233;rations ou r&#233;ductions de droits d&#8217;enregistrement sont subordonn&#233;es au respect de r&#232;gles de fond et d&#8217;obligations d&#233;claratives.</p><p style=\"text-align: justify;\">Selon le I de l&#8217;article&#160;1840 G <i>ter</i>, lorsqu&#8217;une exon&#233;ration ou une r&#233;duction de droits d&#8217;enregistrement a &#233;t&#233; obtenue en contrepartie du respect d&#8217;un engagement ou de la production d&#8217;une justification, le non-respect de l&#8217;engagement ou le d&#233;faut de production de la justification entra&#238;ne l&#8217;obligation de payer les droits dont la mutation a &#233;t&#233; exon&#233;r&#233;e, major&#233;s de l&#8217;int&#233;r&#234;t de retard.</p><p style=\"text-align: justify;\">S&#8217;il est l&#233;gitime que les conditions de fond soient respect&#233;es pour b&#233;n&#233;ficier des avantages fiscaux concern&#233;s, il est excessif que le d&#233;faut de production d&#8217;une pi&#232;ce justificative entra&#238;ne, sans mise en demeure pr&#233;alable, la remise en cause pure et simple d&#8217;une exon&#233;ration ou d&#8217;une r&#233;duction de droits d&#8217;enregistrement.</p><p style=\"text-align: justify;\">Cette remise en cause est particuli&#232;rement inadapt&#233;e lorsque les obligations d&#233;claratives pr&#233;vues dans le cadre du dispositif &#171;&#160;DUTREIL&#160;&#187; aux articles 294&#160;<i>bis</i> &#224; 294&#160;<i>quater</i> de l&#8217;annexe&#160;II au CGI sont lourdes et contraignantes et s&#8217;&#233;chelonnent sur plusieurs ann&#233;es.</p><p style=\"text-align: justify;\">Le pr&#233;sent amendement vise donc &#224; rem&#233;dier &#224; cette situation en pr&#233;voyant que le d&#233;faut de production d&#8217;une pi&#232;ce justificative ne remettra pas en cause le b&#233;n&#233;fice d&#8217;un r&#233;gime de faveur &#171;&#160;Dutreil&#160;&#187; si le contribuable la produit dans le d&#233;lai d&#8217;un mois &#224; compter de la r&#233;ception d&#8217;une mise en demeure de l&#8217;Administration fiscale.</p><p style=\"text-align: justify;\">Par ailleurs, cet amendement s&#8217;inscrit parfaitement dans la d&#233;marche entreprise par les pouvoirs publics de simplifier les obligations d&#233;claratives et l&#8217;environnement r&#233;glementaire et fiscal des entreprises. Cette proposition s&#8217;inscrit &#233;galement dans le prolongement de la mesure 113 du Rapport &#171;&#160;MANDON&#160;&#187; de juillet 2013 visant &#224; substituer les obligations d&#233;claratives par des obligations de transmission &#224; premi&#232;re demande.</p>"
  },
  "representations": [
    {
      "nom": "PDF",
      "typeMime": {
        "type": "application",
        "subType": "PDF"
      },
      "statutRepresentation": {
        "verbatim": true,
        "canonique": true,
        "officielle": true,
        "transcription": false,
        "enregistrement": false
      },
      "contenu": {
        "documentURI": "/15/amendements/1255A/AN/50.pdf"
      }
    }
  ],
  "dateDepot": "2018-10-02T02:00:00.000+02:00",
  "article99": "0",
  "loiReference": {
    "codeLoi": "CGI",
    "divisionCodeLoi": "1840 G ter"
  }
}