{
  "uid": "AMANR5L15SEA717460B2272P2D1N3076",
  "identifiant": {
    "legislature": "15",
    "numero": "3076",
    "numRect": "0",
    "saisine": {
      "texteLegislatifRef": "PRJLANR5L15B2272",
      "numeroPartiePLF": "2",
      "organeExamen": "PO717460",
      "mentionSecondeDeliberation": "1"
    }
  },
  "numeroLong": "II-3076",
  "etapeTexte": "1ère lecture (1ère assemblée saisie)",
  "triAmendement": "emaaaaaaaaaaaaaaaaaaaaaaaaaaaaaaaaaaaaaaaaaaaaaaaazzzzzzzzzzzzzzzzzzzzzzy",
  "cardinaliteAmdtMultiples": "1",
  "etat": "Discuté",
  "signataires": {
    "auteur": {
      "typeAuteur": "Gouvernement"
    },
    "texteAffichable": "le Gouvernement"
  },
  "pointeurFragmentTexte": {
    "division": {
      "titre": "Article 48",
      "articleDesignationCourte": "APRÈS ART. 48",
      "type": "ARTICLE",
      "avantAApres": "Apres",
      "divisionRattachee": "APRÈS L'ARTICLE 48, insérer l'article suivant:",
      "articleAdditionnel": "1",
      "urlDivisionTexteVise": "/15/textes/2272C.asp#D_Article_48"
    }
  },
  "corps": {
    "dispositif": "<p>L&#8217;organisme d&#233;sign&#233; comme fournisseur officiel des services de chronom&#233;trage et de pointage pour les Jeux olympiques et paralympiques de Paris 2024 n&#8217;est pas redevable des impositions mentionn&#233;es aux a, b et d du 1&#176;&#160;du I de l&#8217;article&#160;1655 <i>septies</i> du code g&#233;n&#233;ral des imp&#244;ts au titre des r&#233;mun&#233;rations per&#231;ues du comit&#233; d&#8217;organisation des Jeux olympiques et paralympiques en contrepartie des services de chronom&#233;trage et de pointage fournis dans le cadre de ces comp&#233;titions.</p>",
    "exposeSommaire": "<p>L&#8217;article&#160;1655 <i>septies</i> du code g&#233;n&#233;ral des imp&#244;ts (CGI) pr&#233;voit que les organismes charg&#233;s de l&#8217;organisation d&#8217;une comp&#233;tition sportive internationale en France et, le cas &#233;ch&#233;ant, leurs filiales b&#233;n&#233;ficient d&#8217;un r&#233;gime sp&#233;cifique caract&#233;ris&#233; par l&#8217;exon&#233;ration d&#8217;un certain nombre d&#8217;impositions.</p><p style=\"text-align: justify;\">Afin de respecter les engagements de la France ayant permis l&#8217;organisation des Jeux olympiques et paralympiques &#224; Paris en 2024, il est propos&#233; d&#8217;&#233;tendre cette exon&#233;ration aux r&#233;mun&#233;rations per&#231;ues du Comit&#233; d&#8217;organisation des Jeux olympiques et paralympiques de Paris 2024 par le chronom&#233;treur officiel de cet &#233;v&#233;nement.</p>",
    "cartoucheDelaiDepotDepasse": "Sous réserve de son traitement par les services de l'Assemblée nationale et de sa recevabilité"
  },
  "representations": [
    {
      "nom": "PDF",
      "typeMime": {
        "type": "application",
        "subType": "PDF"
      },
      "statutRepresentation": {
        "verbatim": true,
        "canonique": true,
        "officielle": true,
        "transcription": false,
        "enregistrement": false
      },
      "contenu": {
        "documentURI": "/15/amendements/2272C/AN/3076.pdf"
      }
    }
  ],
  "seanceDiscussion": "RUANR5L15S2020IDS21924",
  "sort": {
    "dateSaisie": "2019-11-15T10:29:00.000+01:00",
    "sortEnSeance": "Adopté"
  },
  "dateDepot": "2019-11-13T01:00:00.000+01:00",
  "dateDistribution": "2019-11-15T01:00:00.000+01:00",
  "article99": "1",
  "loiReference": {}
}