{
  "uid": "AMANR5L15SEA717460B1255P2D1N537",
  "identifiant": {
    "legislature": "15",
    "numero": "537",
    "numRect": "0",
    "saisine": {
      "texteLegislatifRef": "PRJLANR5L15B1255",
      "numeroPartiePLF": "2",
      "organeExamen": "PO717460",
      "mentionSecondeDeliberation": "0"
    }
  },
  "numeroLong": "II-537",
  "etapeTexte": "1ère lecture (1ère assemblée saisie)",
  "triAmendement": "abuaaaaaaaaaaaaaaaaaaaaaaaaaaaaaaaaaaaaaaaaaaaaaaato",
  "cardinaliteAmdtMultiples": "1",
  "etat": "Discuté",
  "signataires": {
    "auteur": {
      "typeAuteur": "Depute",
      "acteurRef": "PA720454",
      "groupePolitiqueRef": "PO730964"
    },
    "cosignatairesRefs": [
      "PA720454"
    ],
    "texteAffichable": "M.&#160;Houbron"
  },
  "pointeurFragmentTexte": {
    "missionVisee": {
      "idMissionAN": "409",
      "libelleMission": "Justice",
      "codeMissionPLF": "B",
      "libelleMissionPLF": "Répartition, par mission et programme, des crédits du budget général"
    },
    "division": {
      "titre": "ÉTAT B",
      "articleDesignationCourte": "ART. 39",
      "type": "ANNEXE",
      "avantAApres": "A",
      "divisionRattachee": "ARTICLE 39",
      "urlDivisionTexteVise": "/15/textes/1255C.asp#D_ETAT_B"
    }
  },
  "corps": {
    "exposeSommaire": "<p style=\"text-align: justify;\">Cet amendement a pour objet de tirer les cons&#233;quences budg&#233;taires du passage de l&#8217;aide juridictionnelle &#224; l&#8217;aide juridictionnelle de plein droit (sans condition de ressources) pour les victimes de violences conjugales.</p><p style=\"text-align: justify;\">&#192; cet effet il pr&#233;voit de diminuer de 10 millions d&#8217;euros les cr&#233;dits inscrits pour les projets informatiques du minist&#232;re, qui ne seront vraisemblablement pas consomm&#233;s dans leur totalit&#233;, au sein de l&#8217;action 9 du programme &#171;&#160;Conduite et pilotage de la politique de la justice&#160;&#187; et d&#8217;augmenter de 10 millions d&#8217;euros les cr&#233;dits pr&#233;vus au titre de l&#8217;aide juridictionnelle au sein de l&#8217;action 1 du programme Acc&#232;s au droit et &#224; la justice.</p>",
    "dispositifAmdtCredit": {
      "listeProgrammes": [
        {
          "libelle": "Justice judiciaire",
          "id": "32645",
          "AE": {
            "montantPositif": "0",
            "montantNegatif": "0"
          },
          "CP": {
            "montantPositif": "0",
            "montantNegatif": "0"
          },
          "action": "modification"
        },
        {
          "libelle": "Administration pénitentiaire",
          "id": "32646",
          "AE": {
            "montantPositif": "0",
            "montantNegatif": "0"
          },
          "CP": {
            "montantPositif": "0",
            "montantNegatif": "0"
          },
          "action": "modification"
        },
        {
          "libelle": "Protection judiciaire de la jeunesse",
          "id": "32647",
          "AE": {
            "montantPositif": "0",
            "montantNegatif": "0"
          },
          "CP": {
            "montantPositif": "0",
            "montantNegatif": "0"
          },
          "action": "modification"
        },
        {
          "libelle": "Accès au droit et à la justice",
          "id": "32648",
          "AE": {
            "montantPositif": "10000000",
            "montantNegatif": "0"
          },
          "CP": {
            "montantPositif": "10000000",
            "montantNegatif": "0"
          },
          "action": "modification"
        },
        {
          "libelle": "Conduite et pilotage de la politique de la justice",
          "id": "32649",
          "AE": {
            "montantPositif": "0",
            "montantNegatif": "10000000"
          },
          "CP": {
            "montantPositif": "0",
            "montantNegatif": "10000000"
          },
          "action": "modification"
        },
        {
          "libelle": "Conseil supérieur de la magistrature",
          "id": "32650",
          "AE": {
            "montantPositif": "0",
            "montantNegatif": "0"
          },
          "CP": {
            "montantPositif": "0",
            "montantNegatif": "0"
          },
          "action": "modification"
        }
      ],
      "totalAE": {
        "montantPositif": "10000000",
        "montantNegatif": "10000000",
        "solde": "0"
      },
      "totalCP": {
        "montantPositif": "10000000",
        "montantNegatif": "10000000",
        "solde": "0"
      }
    }
  },
  "representations": [
    {
      "nom": "PDF",
      "typeMime": {
        "type": "application",
        "subType": "PDF"
      },
      "statutRepresentation": {
        "verbatim": true,
        "canonique": true,
        "officielle": true,
        "transcription": false,
        "enregistrement": false
      },
      "contenu": {
        "documentURI": "/15/amendements/1255C/AN/537.pdf"
      }
    }
  ],
  "seanceDiscussion": "RUANR5L15S2019IDS21320",
  "sort": {
    "dateSaisie": "2018-10-31T18:14:58.000+01:00",
    "sortEnSeance": "Retiré"
  },
  "dateDepot": "2018-10-26T02:00:00.000+02:00",
  "dateDistribution": "2018-10-29T01:00:00.000+01:00",
  "article99": "0",
  "loiReference": {}
}