{
  "uid": "AMANR5L15SEA717460B1490P0D1N1171",
  "identifiant": {
    "legislature": "15",
    "numero": "1171",
    "numRect": "0",
    "saisine": {
      "texteLegislatifRef": "PRJLANR5L15B1490",
      "numeroPartiePLF": "0",
      "organeExamen": "PO717460",
      "mentionSecondeDeliberation": "0"
    }
  },
  "numeroLong": "1171",
  "etapeTexte": "Nouvelle Lecture",
  "triAmendement": "atiaaaaaaaaaaaaaaaaaaaaaaaaaaaaaaaaaaaaaaaaaaaaaaals",
  "cardinaliteAmdtMultiples": "1",
  "etat": "Irrecevable",
  "signataires": {
    "auteur": {
      "typeAuteur": "Depute",
      "acteurRef": "PA720728",
      "groupePolitiqueRef": "PO730970"
    },
    "cosignatairesRefs": [
      "PA720728",
      "PA718978"
    ],
    "texteAffichable": "M.&#160;Mattei et M.&#160;Laqhila"
  },
  "pointeurFragmentTexte": {
    "division": {
      "titre": "Article 11",
      "articleDesignationCourte": "ART. 11",
      "type": "ARTICLE",
      "avantAApres": "A",
      "divisionRattachee": "ARTICLE 11",
      "urlDivisionTexteVise": "/15/textes/1490.asp#D_Article_11"
    },
    "alinea": {
      "avantAApres": "Apres",
      "numero": "9"
    }
  },
  "corps": {
    "dispositif": "<p>I. - Apr&#232;s le 9&#232;me alin&#233;a, il est ins&#233;r&#233; un alin&#233;a ainsi r&#233;dig&#233;&#160;:</p><p>\"R&#233;diger ainsi le 6&#232;me alin&#233;a du 3&#176; de l'article 83 du code g&#233;n&#233;ral des imp&#244;ts:<br />\"Les frais de d&#233;placement&#160; entre le domicile et le lieu de travail sont admis, sur justificatifs, au titre des frais professionnels r&#233;els.\"\"</p><p><br />II.&#160;&#8211;&#160;Compl&#233;ter cet article par l'alin&#233;a suivant&#160;:<br />&#171;&#160;II.&#160;&#8211;&#160;La perte de recettes pour l&#8217;&#201;tat est compens&#233;e &#224; due concurrence par la cr&#233;ation d&#8217;une taxe additionnelle aux droits mentionn&#233;s aux articles 575 et 575 A du code g&#233;n&#233;ral des imp&#244;ts.<br /><br /></p>",
    "exposeSommaire": "<p>Cet amendement vise &#224; permettre la prise en charge des frais kilom&#233;triques sur toute la distance du trajet domicile-travail en supprimant la limite actuelle fix&#233;e &#224; 40 kilom&#232;tres</p>"
  },
  "representations": [
    {
      "nom": "PDF",
      "typeMime": {
        "type": "application",
        "subType": "PDF"
      },
      "statutRepresentation": {
        "verbatim": true,
        "canonique": true,
        "officielle": true,
        "transcription": false,
        "enregistrement": false
      },
      "contenu": {
        "documentURI": "/15/amendements/1490/AN/1171.pdf"
      }
    }
  ],
  "dateDepot": "2018-12-15T01:00:00.000+01:00",
  "dateDistribution": "2018-12-16T01:00:00.000+01:00",
  "article99": "0",
  "loiReference": {}
}