{
  "uid": "AMANR5L15SEA717460B2272P2D1N2932",
  "identifiant": {
    "legislature": "15",
    "numero": "2932",
    "numRect": "0",
    "saisine": {
      "texteLegislatifRef": "PRJLANR5L15B2272",
      "numeroPartiePLF": "2",
      "organeExamen": "PO717460",
      "mentionSecondeDeliberation": "1"
    }
  },
  "numeroLong": "II-2932",
  "etapeTexte": "1ère lecture (1ère assemblée saisie)",
  "triAmendement": "fcaaaaaaaaaaaaaaaaaaaaaaaaaaaaaaaaaaaaaaaaaaaaaaaaabr",
  "cardinaliteAmdtMultiples": "1",
  "etat": "Discuté",
  "signataires": {
    "auteur": {
      "typeAuteur": "Depute",
      "acteurRef": "PA719778",
      "groupePolitiqueRef": "PO730964"
    },
    "cosignatairesRefs": [
      "PA719778"
    ],
    "texteAffichable": "M.&#160;Jolivet"
  },
  "pointeurFragmentTexte": {
    "division": {
      "titre": "Article 50",
      "articleDesignationCourte": "APRÈS ART. 50",
      "type": "ARTICLE",
      "avantAApres": "Apres",
      "divisionRattachee": "APRÈS L'ARTICLE 50, insérer l'article suivant:",
      "articleAdditionnel": "1",
      "urlDivisionTexteVise": "/15/textes/2272C.asp#D_Article_50"
    }
  },
  "corps": {
    "dispositif": "<p style=\"text-align: justify;\">I.&#160;&#8211;&#160;Le <i>a</i> du 2&#176;&#160;du I de l&#8217;article&#160;83 de la loi n&#176;&#160;2017&#8209;1837 du 30 d&#233;cembre 2017 de finances pour 2018 est ainsi r&#233;dig&#233;&#160;:</p><p style=\"text-align: justify;\">&#171;&#160;<i>a)</i> Apr&#232;s le deuxi&#232;me alin&#233;a, sont ins&#233;r&#233;s trois alin&#233;as ainsi r&#233;dig&#233;s&#160;:</p><p style=\"text-align: justify;\">&#171;&#160;Lorsque le logement est neuf, les pr&#234;ts sont octroy&#233;s sous condition de localisation de ce logement dans les communes class&#233;es dans une zone g&#233;ographique se caract&#233;risant par un d&#233;s&#233;quilibre important entre l&#8217;offre et la demande de logements entra&#238;nant des difficult&#233;s d&#8217;acc&#232;s au logement dans le parc r&#233;sidentiel existant et dans des communes dont le territoire est couvert par un contrat de redynamisation de site de d&#233;fense. Toutefois cette condition de localisation n&#8217;est pas applicable&#160;:</p><p style=\"text-align: justify;\">&#171;&#160;- aux logements ayant donn&#233; lieu &#224; un contrat r&#233;gi par la loi n&#176;&#160;84&#8209;595 du 12 juillet 1984 d&#233;finissant la location-accession &#224; la propri&#233;t&#233; immobili&#232;re sign&#233; avant le 1<sup>er</sup>&#160;janvier 2020&#160;;</p><p style=\"text-align: justify;\">&#171;&#160;- aux biens immobiliers b&#226;tis acquis en vue de leur premi&#232;re occupation apr&#232;s la r&#233;alisation de travaux concourant &#224; la production ou &#224; la livraison d&#8217;un immeuble neuf au sens du 2&#176;&#160;du 2 du I du l&#8217;article&#160;257 du code g&#233;n&#233;ral des imp&#244;ts&#160;;&#160;&#187;.</p><p style=\"text-align: justify;\">II.&#160;&#8211;&#160;Le V de l&#8217;article L.&#160;31&#8209;10&#8209;3 du code de la construction et de l&#8217;habitation est compl&#233;t&#233; par une phrase ainsi r&#233;dig&#233;e&#160;: &#171;&#160;Les travaux doivent permettre l&#8217;atteinte d&#8217;un niveau de performance &#233;nerg&#233;tique globale minimale du logement fix&#233; par d&#233;cret.&#160;&#187;.</p><p style=\"text-align: justify;\">III.&#160;&#8211;&#160;Le II s&#8217;applique aux offres de pr&#234;t &#233;mises &#224; compter du 1<sup>er</sup> janvier 2020.</p><p>IV.&#160;&#8211;&#160;Le I n&#8217;est applicable qu&#8217;aux sommes venant en d&#233;duction de l&#8217;imp&#244;t d&#251;.</p><p style=\"text-align: justify;\">V.&#160;&#8211;&#160;La perte de recettes pour l&#8217;&#201;tat est compens&#233;e &#224; due concurrence par la cr&#233;ation d&#8217;une taxe additionnelle aux droits mentionn&#233;s aux articles 575 et 575 A du code g&#233;n&#233;ral des imp&#244;ts.</p>",
    "exposeSommaire": "<p>Le pr&#234;t &#224; taux z&#233;ro (PTZ) est un dispositif fiscal permettant aux banques d&#8217;octroyer des pr&#234;ts sans int&#233;r&#234;ts sous plafond de ressources &#224; des m&#233;nages primo-acc&#233;dants afin de soutenir l&#8217;acquisition de leur r&#233;sidence principale. Il peut ainsi financer l&#8217;achat d&#8217;un logement neuf ou ancien sous condition de travaux.</p><p style=\"text-align: justify;\">La loi de finances pour 2018 a recentr&#233; le PTZ en zones B2 et C sur l&#8217;acquisition de logements anciens. Les op&#233;rations de d&#233;molition-reconstruction et de remise &#224; l&#8217;&#233;tat neuf de biens tr&#232;s d&#233;grad&#233;s ne seront ainsi plus &#233;ligibles au PTZ &#224; compter du 1<sup>er</sup> janvier 2020 dans ces deux zones.</p><p style=\"text-align: justify;\">Par d&#233;rogation, le pr&#233;sent amendement propose de maintenir l&#8217;&#233;ligibilit&#233; au PTZ en zone B2 et C des op&#233;rations dites &#171;&#160;neuves&#160;&#187; au sens de la TVA . Cette disposition concourt &#224; l&#8217;objectif d&#8217;orienter les primo-acc&#233;dants dans ces zones vers la r&#233;habilitation de logements.</p><p style=\"text-align: justify;\">Par ailleurs, conform&#233;ment &#224; la volont&#233; du Gouvernement d&#8217;acc&#233;l&#233;rer la r&#233;novation &#233;nerg&#233;tique des logements, cet amendement conditionne l&#8217;octroi du pr&#234;t &#224; taux z&#233;ro pour l&#8217;achat d&#8217;un logement ancien &#224; la r&#233;alisation de travaux permettant d&#8217;atteindre un niveau de performance &#233;nerg&#233;tique minimale.</p>"
  },
  "representations": [
    {
      "nom": "PDF",
      "typeMime": {
        "type": "application",
        "subType": "PDF"
      },
      "statutRepresentation": {
        "verbatim": true,
        "canonique": true,
        "officielle": true,
        "transcription": false,
        "enregistrement": false
      },
      "contenu": {
        "documentURI": "/15/amendements/2272C/AN/2932.pdf"
      }
    }
  ],
  "seanceDiscussion": "RUANR5L15S2020IDS21925",
  "sort": {
    "dateSaisie": "2019-11-15T16:27:44.000+01:00",
    "sortEnSeance": "Tombé"
  },
  "dateDepot": "2019-11-09T01:00:00.000+01:00",
  "dateDistribution": "2019-11-14T01:00:00.000+01:00",
  "article99": "0",
  "loiReference": {
    "codeLoi": "loi 2017-1837",
    "divisionCodeLoi": "83"
  }
}