{
  "uid": "AMANR5L15PO420120B1168P0D1N85",
  "identifiant": {
    "legislature": "15",
    "numero": "85",
    "numRect": "0",
    "saisine": {
      "texteLegislatifRef": "PRJLANR5L15B1168",
      "numeroPartiePLF": "0",
      "organeExamen": "PO420120",
      "mentionSecondeDeliberation": "0"
    }
  },
  "numeroLong": "AS85",
  "etapeTexte": "Nouvelle Lecture",
  "triAmendement": "q",
  "cardinaliteAmdtMultiples": "1",
  "etat": "Irrecevable",
  "signataires": {
    "auteur": {
      "typeAuteur": "Depute",
      "acteurRef": "PA720924",
      "groupePolitiqueRef": "PO730970"
    },
    "cosignatairesRefs": [
      "PA720968",
      "PA722374",
      "PA720924",
      "PA721992",
      "PA721924",
      "PA720326"
    ],
    "texteAffichable": "Mme&#160;Elimas, rapporteure,  Mme&#160;Benin, Mme&#160;de Vaucouleurs, Mme&#160;Gallerneau, M.&#160;Hammouche et M.&#160;Isaac-Sibille"
  },
  "pointeurFragmentTexte": {
    "division": {
      "titre": "Article 26",
      "articleDesignationCourte": "ART. 26",
      "type": "ARTICLE",
      "avantAApres": "A",
      "divisionRattachee": "ARTICLE 26",
      "urlDivisionTexteVise": "/15/textes/1168.asp#D_Article_26"
    },
    "alinea": {
      "avantAApres": "Apres",
      "numero": "9"
    }
  },
  "corps": {
    "dispositif": "<p style=\"text-align: justify;\">Apr&#232;s l&#8217;alin&#233;a&#160;9, ajouter l&#8217;alin&#233;a suivant&#160;:</p><p style=\"text-align: justify;\">&#171;&#160;2&#176;&#160;Est r&#233;put&#233;e comme involontaire la privation d&#8217;emploi r&#233;sultant du refus de renouvellement, &#224; l&#8217;initiative de l&#8217;employ&#233; ou de l&#8217;employeur, d&#8217;un contrat &#224; dur&#233;e d&#233;termin&#233;e de droit public ou de droit priv&#233; arriv&#233; &#224; son terme.&#160;&#187;</p>",
    "exposeSommaire": "<p>Aujourd&#8217;hui, un salari&#233; en CDD de droit priv&#233; en fin de contrat se voit attribuer l&#8217;ARE (assurance ch&#244;mage) et ce m&#234;me en cas de refus du renouvellement du contrat. En effet, P&#244;le Emploi ne se trouve pas en mesure de v&#233;rifier les motifs du non renouvellement du contrat.</p><p>L&#8217;objet du pr&#233;sent amendement vient donc aligner la situation des contractuels de la fonction publique en CDD (donc de droit public) avec ceux du priv&#233; dans un souci d&#8217;&#233;galit&#233;.</p><p>En estimant comme r&#233;put&#233;e involontaire la privation d&#8217;emploi &#224; la suite d&#8217;un CDD, le contractuel de la fonction publique ne souhaitant pas renouveler son contrat a acc&#232;s &#224; l&#8217;ARE et voit ses droits align&#233;s sur les contractuels du priv&#233;.</p><p>Ainsi, s&#8217;il le d&#233;sir, un contractuel de la fonction publique peut, gr&#226;ce &#224; ces nouvelles dispositions, suivre une formation ou se r&#233;orienter, le tout dans l&#8217;esprit du projet de loi qui vise la libert&#233; du choix de l&#8217;avenir professionnel des fran&#231;ais.</p>"
  },
  "representations": [
    {
      "nom": "PDF",
      "typeMime": {
        "type": "application",
        "subType": "PDF"
      },
      "statutRepresentation": {
        "verbatim": true,
        "canonique": true,
        "officielle": true,
        "transcription": false,
        "enregistrement": false
      },
      "contenu": {
        "documentURI": "/15/amendements/1168/CION-SOC/AS85.pdf"
      }
    }
  ],
  "dateDepot": "2018-07-17T02:00:00.000+02:00",
  "article99": "0",
  "loiReference": {}
}