{
  "uid": "AMANR5L15PO419865B2274P0D1N1207",
  "identifiant": {
    "legislature": "15",
    "numero": "1207",
    "numRect": "0",
    "saisine": {
      "texteLegislatifRef": "PRJLANR5L15B2274",
      "numeroPartiePLF": "0",
      "organeExamen": "PO419865",
      "mentionSecondeDeliberation": "0"
    }
  },
  "numeroLong": "CD1207",
  "etapeTexte": "1ère lecture (2ème assemblée saisie)",
  "triAmendement": "deaaaaaaaaaaaaaaaaaaaaaaaaaaaaaaaaaaaaaaaaaaaaaaaaw",
  "cardinaliteAmdtMultiples": "1",
  "etat": "En traitement",
  "signataires": {
    "auteur": {
      "typeAuteur": "Depute",
      "acteurRef": "PA719578",
      "groupePolitiqueRef": "PO730958"
    },
    "cosignatairesRefs": [
      "PA588884",
      "PA720846",
      "PA719676",
      "PA720430",
      "PA721062",
      "PA720422",
      "PA721202",
      "PA720892",
      "PA721960",
      "PA721226",
      "PA2150",
      "PA719578",
      "PA721210",
      "PA722142",
      "PA718860",
      "PA720286",
      "PA718868"
    ],
    "texteAffichable": "M.&#160;Prud&apos;homme,  Mme&#160;Autain, M.&#160;Bernalicis, M.&#160;Coquerel, M.&#160;Corbi&#232;re, Mme&#160;Fiat, M.&#160;Lachaud, M.&#160;Larive, M.&#160;M&#233;lenchon, Mme&#160;Obono, Mme&#160;Panot, M.&#160;Quatennens, M.&#160;Ratenon, Mme&#160;Ressiguier, Mme&#160;Rubin, M.&#160;Ruffin et Mme&#160;Taurine"
  },
  "pointeurFragmentTexte": {
    "division": {
      "titre": "Article 6",
      "articleDesignationCourte": "ART. 6",
      "type": "ARTICLE",
      "avantAApres": "A",
      "divisionRattachee": "ARTICLE 6",
      "urlDivisionTexteVise": "/15/textes/2274.asp#D_Article_6"
    },
    "alinea": {
      "avantAApres": "Apres",
      "numero": "13"
    }
  },
  "corps": {
    "dispositif": "<p>Compl&#233;ter l&#8217;article 6 par les alin&#233;as suivants :&#160;</p><p>Le VI de l&#8217;article 14 de la loi n&#176; 2015-992 du 17 ao&#251;t 2015 relative &#224; la transition &#233;nerg&#233;tique pour la croissance verte est compl&#233;t&#233; par les mots et une phrase ainsi r&#233;dig&#233;s : &#171; , notamment dans le cadre de la commande publique o&#249; ces mat&#233;riaux doivent &#234;tre syst&#233;matiquement privil&#233;gi&#233;s. Par ailleurs, les fili&#232;res de formation aux m&#233;tiers du b&#226;timent int&#232;grent une sensibilisation sur les enjeux environnementaux de l&#8217;utilisation de mat&#233;riaux biosourc&#233;s. &#187;<br />&#160;</p><p>L&#8217;article L. 752-2 du code de l&#8217;&#233;ducation est ainsi modifi&#233; :</p><p>1&#176; &#192; la seconde phrase du premier alin&#233;a, apr&#232;s les mots : &#171; Elles veillent au respect &#187;, sont ins&#233;r&#233;s les mots : &#171; de l&#8217;environnement et de la pr&#233;servation des ressources naturelles &#187; ;</p><p>2&#176; Il est ajout&#233; un alin&#233;a ainsi r&#233;dig&#233; :</p><p>&#171; &#8230;&#176; Enseignent &#224; leur &#233;l&#232;ves l&#8217;&#233;coception et leur apprennent &#224; privil&#233;gier les mat&#233;riaux durables, naturels, biosourc&#233;s et/ou recyclables et &#224; favoriser au maximum les &#233;conomies d&#8217;&#233;nergie. &#187;</p>",
    "exposeSommaire": "<p>Nous consid&#233;rons que les leviers de la commande publique et de la formation sont les leviers les plus importants pour transformer le secteur du BTP &#224; la hauteur du d&#233;fi pos&#233; par l&#8217;urgence &#233;cologique et climatique.&#160;</p><p>Le I. de cet amendement vise &#224; renforcer l&#8217;usage de mat&#233;riaux biosourc&#233;s dans la commande publique. Il s&#8217;agit &#233;galement de pr&#233;ciser les enjeux de sensibilisation &#224; l&#8217;usage de ces mat&#233;riaux biosourc&#233;s dans les fili&#232;res de formation des m&#233;tiers du b&#226;timent.&#160;&#160;</p><p>&#160;Le II. de cet amendement vise &#224; encourager la formation de nouvelles g&#233;n&#233;rations d&#8217;architectes en leur apprenant des pratiques novatrices et durables li&#233;es notamment &#224; l&#8217;usage de mat&#233;riaux biosourc&#233;s.</p>",
    "cartoucheDelaiDepotDepasse": "Sous réserve de son traitement par les services de l'Assemblée nationale et de sa recevabilité"
  },
  "representations": [
    {
      "nom": "PDF",
      "typeMime": {
        "type": "application",
        "subType": "PDF"
      },
      "statutRepresentation": {
        "verbatim": true,
        "canonique": true,
        "officielle": true,
        "transcription": false,
        "enregistrement": false
      },
      "contenu": {
        "documentURI": "/15/amendements/2274/CION-DVP/CD1207.pdf"
      }
    }
  ],
  "dateDepot": "2019-11-20T01:00:00.000+01:00",
  "article99": "0",
  "loiReference": {}
}