{
  "uid": "AMANR5L15PO419610B2274P0D1N67",
  "identifiant": {
    "legislature": "15",
    "numero": "67",
    "numRect": "0",
    "saisine": {
      "texteLegislatifRef": "PRJLANR5L15B2274",
      "numeroPartiePLF": "0",
      "organeExamen": "PO419610",
      "mentionSecondeDeliberation": "0"
    }
  },
  "numeroLong": "CE67",
  "etapeTexte": "1ère lecture (2ème assemblée saisie)",
  "triAmendement": "icaaaaaaaaaaaaaaaaaaaaaaaaaaaaaaaaaaaaaaaaaaaaaaaafdc",
  "cardinaliteAmdtMultiples": "1",
  "etat": "Discuté",
  "signataires": {
    "auteur": {
      "typeAuteur": "Depute",
      "acteurRef": "PA607090",
      "groupePolitiqueRef": "PO730934"
    },
    "cosignatairesRefs": [
      "PA266808",
      "PA267204",
      "PA346218",
      "PA267429",
      "PA607090",
      "PA719318",
      "PA722390",
      "PA334654"
    ],
    "texteAffichable": "M.&#160;Jean-Pierre&#160;Vigier,  Mme&#160;Anthoine, M.&#160;Cinieri, M.&#160;Masson, M.&#160;Rolland, M.&#160;Sermier, M.&#160;Straumann et Mme&#160;Corneloup"
  },
  "pointeurFragmentTexte": {
    "division": {
      "titre": "Article 9",
      "articleDesignationCourte": "ART. 9",
      "type": "ARTICLE",
      "avantAApres": "A",
      "divisionRattachee": "ARTICLE 9",
      "urlDivisionTexteVise": "/15/textes/2274.asp#D_Article_9"
    },
    "alinea": {
      "numero": "12"
    }
  },
  "corps": {
    "dispositif": "<p style=\"text-align: justify;\">Compl&#233;ter l&#8217;alin&#233;a&#160;12 par la phrase suivante&#160;:</p><p style=\"text-align: justify;\">&#171;&#160;L&#8217;&#233;co-contribution due &#224; leur &#233;co-organisme par ces producteurs prend en compte l&#8217;ensemble des produits hors foyer qu&#8217;ils mettent sur le march&#233;.&#160;&#187;</p>",
    "exposeSommaire": "<p style=\"text-align: justify;\">La collecte s&#233;lective en hors foyer est une priorit&#233; pour am&#233;liorer les performances du recyclage des emballages m&#233;nagers. En effet, aujourd&#8217;hui et &#224; titre d&#8217;exemple, 99&#160;% des bouteilles en plastiques sont collect&#233;es alors que 57&#160;% d&#8217;entre elles sont recycl&#233;es. Le delta est en majorit&#233; d&#251; &#224; une absence de collecte s&#233;lective en hors foyer (rues, a&#233;roport, gares, parcs&#8230;) o&#249; les gisements sont directement envoy&#233;s en incin&#233;ration ou en stockage.</p><p style=\"text-align: justify;\">Le programme pr&#233;vu par le projet de loi est une premi&#232;re &#233;tape auquel il convient d&#8217;assortir les moyens n&#233;cessaires pour y parvenir. Le pr&#233;sent amendement pr&#233;voit donc la red&#233;finition de l&#8217;assiette du budget de l&#8217;&#233;co-organisme d&#233;di&#233; aux emballages m&#233;nagers de mani&#232;re &#224; ce qu&#8217;elle int&#232;gre la totalit&#233; des produits hors foyers ainsi que le retour au principe de 100&#160;% de couverture des co&#251;ts nets du tri, aujourd&#8217;hui fix&#233; par la loi Grenelle I &#224; 80&#160;%.</p><p style=\"text-align: justify;\">L&#8217;&#233;co-organisme se voit ainsi dot&#233; des moyens financiers n&#233;cessaires &#224; la mise en place d&#8217;un plan ambitieux de collecte s&#233;lective en hors foyer &#224; m&#234;me de r&#233;pondre aux objectifs europ&#233;ens et aux objectifs nationaux, notamment la division par deux du stockage des d&#233;chets d&#8217;ici 2025 et 100&#160;% des plastiques recycl&#233;s en 2025.</p>"
  },
  "representations": [
    {
      "nom": "PDF",
      "typeMime": {
        "type": "application",
        "subType": "PDF"
      },
      "statutRepresentation": {
        "verbatim": true,
        "canonique": true,
        "officielle": true,
        "transcription": false,
        "enregistrement": false
      },
      "contenu": {
        "documentURI": "/15/amendements/2274/CION-ECO/CE67.pdf"
      }
    }
  ],
  "sort": {
    "dateSaisie": "2019-11-20T00:02:32.000+01:00",
    "sortEnSeance": "Rejeté"
  },
  "dateDepot": "2019-11-12T01:00:00.000+01:00",
  "dateDistribution": "2019-11-19T01:00:00.000+01:00",
  "article99": "0",
  "loiReference": {}
}