{
  "uid": "AMANR5L15SEA717460BTC1939P0D1N148",
  "identifiant": {
    "legislature": "15",
    "numero": "148",
    "numRect": "0",
    "saisine": {
      "texteLegislatifRef": "PIONANR5L15BTC1939",
      "numeroPartiePLF": "0",
      "organeExamen": "PO717460",
      "mentionSecondeDeliberation": "0"
    }
  },
  "numeroLong": "148",
  "etapeTexte": "Nouvelle Lecture",
  "triAmendement": "bcaaaaaaaaaaaaaaaaaaaaaaaaaaaaaaaaaaaaaaaaaaaaaaaahrz",
  "cardinaliteAmdtMultiples": "1",
  "etat": "Discuté",
  "signataires": {
    "auteur": {
      "typeAuteur": "Depute",
      "acteurRef": "PA266776",
      "groupePolitiqueRef": "PO730934"
    },
    "cosignatairesRefs": [
      "PA266776"
    ],
    "texteAffichable": "M.&#160;Reiss"
  },
  "pointeurFragmentTexte": {
    "division": {
      "titre": "Article 2",
      "articleDesignationCourte": "ART. 2",
      "type": "ARTICLE",
      "avantAApres": "A",
      "divisionRattachee": "ARTICLE 2",
      "urlDivisionTexteVise": "/15/textes/1939.asp#D_Article_2"
    },
    "alinea": {
      "numero": "2"
    }
  },
  "corps": {
    "dispositif": "<p>Compl&#233;ter l&#8217;article&#160;2 par l&#8217;alin&#233;a suivant&#160;:</p><p style=\"text-align: justify;\">&#171;&#160;Une communaut&#233; urbaine ou une m&#233;tropole peut mobiliser l&#8217;Agence nationale de la coh&#233;sion des territoires &#224; la condition que le projet concerne un projet &#224; une &#233;chelle sup&#233;rieur &#224; son propre p&#233;rim&#232;tre.&#160;&#187;</p>",
    "exposeSommaire": "<p>L&#8217;ANTC &#233;tant destin&#233;e a accompagner les collectivit&#233;s faiblement dot&#233;es en ing&#233;nierie, les communaut&#233;s urbaines et m&#233;tropoles ne pourront mobiliser les ressources de l&#8217;ANTC qu&#8217;&#224; l&#8217;occasion d&#8217;un projet supra-territorial ou supra-m&#233;tropolitain.</p>"
  },
  "representations": [
    {
      "nom": "PDF",
      "typeMime": {
        "type": "application",
        "subType": "PDF"
      },
      "statutRepresentation": {
        "verbatim": true,
        "canonique": true,
        "officielle": true,
        "transcription": false,
        "enregistrement": false
      },
      "contenu": {
        "documentURI": "/15/amendements/1939/AN/148.pdf"
      }
    }
  ],
  "sort": {
    "dateSaisie": "2019-05-15T19:42:18.000+02:00",
    "sortEnSeance": "Rejeté"
  },
  "dateDepot": "2019-05-11T02:00:00.000+02:00",
  "dateDistribution": "2019-05-13T02:00:00.000+02:00",
  "article99": "0",
  "loiReference": {}
}