{
  "uid": "AMANR5L15SEA717460B2272P1D1N3",
  "identifiant": {
    "legislature": "15",
    "numero": "3",
    "numRect": "0",
    "saisine": {
      "texteLegislatifRef": "PRJLANR5L15B2272",
      "numeroPartiePLF": "1",
      "organeExamen": "PO717460",
      "mentionSecondeDeliberation": "0"
    }
  },
  "numeroLong": "I-3",
  "etapeTexte": "1ère lecture (1ère assemblée saisie)",
  "triAmendement": "aoaaaaaaaaaaaaaaaaaaaaaaaaaaaaaaaaaaaaaaaaaaaaaaaabc",
  "cardinaliteAmdtMultiples": "1",
  "etat": "Discuté",
  "signataires": {
    "auteur": {
      "typeAuteur": "Depute",
      "acteurRef": "PA1874",
      "groupePolitiqueRef": "PO730934"
    },
    "cosignatairesRefs": [
      "PA267378",
      "PA605036",
      "PA334654",
      "PA721678",
      "PA718784",
      "PA721286",
      "PA606712",
      "PA721968",
      "PA2155",
      "PA718884",
      "PA330684",
      "PA719318",
      "PA709315",
      "PA334843",
      "PA267324",
      "PA332523",
      "PA1874",
      "PA722390",
      "PA643103",
      "PA721046",
      "PA266793",
      "PA2796",
      "PA718838",
      "PA2377",
      "PA998",
      "PA266776",
      "PA334149",
      "PA346218",
      "PA267429",
      "PA608416",
      "PA2492",
      "PA267260",
      "PA720684"
    ],
    "texteAffichable": "M.&#160;Le Fur,  M.&#160;Abad, Mme&#160;Anthoine, Mme&#160;Bassire, Mme&#160;Bazin-Malgras, M.&#160;Bony, Mme&#160;Val&#233;rie&#160;Boyer, M.&#160;Brun, M.&#160;Cinieri, Mme&#160;Corneloup, Mme&#160;Dalloz, M.&#160;Dassault, M.&#160;Pierre-Henri&#160;Dumont, M.&#160;Fasquelle, M.&#160;Ferrara, M.&#160;Gaultier, M.&#160;Hetzel, Mme&#160;Levy, M.&#160;Lurton, M.&#160;Masson, M.&#160;Menuel, M.&#160;Pauget, M.&#160;Perrut, Mme&#160;Poletti, M.&#160;Quentin, M.&#160;Ramadier, M.&#160;Reda, M.&#160;Reiss, M.&#160;Straumann, M.&#160;Teissier, M.&#160;Verch&#232;re, M.&#160;Viala et M.&#160;Vialay"
  },
  "pointeurFragmentTexte": {
    "division": {
      "titre": "Article 2",
      "articleDesignationCourte": "APRÈS ART. 2",
      "type": "ARTICLE",
      "avantAApres": "Apres",
      "divisionRattachee": "APRÈS L'ARTICLE 2, insérer l'article suivant:",
      "articleAdditionnel": "1",
      "urlDivisionTexteVise": "/15/textes/2272A.asp#D_Article_2"
    }
  },
  "corps": {
    "dispositif": "<p style=\"text-align: justify;\">I.&#160;&#8211;&#160;L&#8217;article&#160;157 du code g&#233;n&#233;ral des imp&#244;ts est compl&#233;t&#233; par un 24&#176;&#160;ainsi r&#233;dig&#233;&#160;:</p><p style=\"text-align: justify;\">&#171;&#160;24&#176;&#160;Les dons en nature r&#233;alis&#233;s par les professionnels ayant une activit&#233; agricole, telle que d&#233;finie &#224; l&#8217;article L.&#160;311&#8209;1 du code rural et de la p&#234;che maritime.&#160;&#187;</p><p style=\"text-align: justify;\">II.&#160;&#8211;&#160;La perte de recettes pour l&#8217;&#201;tat est compens&#233;e &#224; due concurrence par la cr&#233;ation d&#8217;une taxe additionnelle aux droits mentionn&#233;s aux articles&#160;575 et 575&#160;A du code g&#233;n&#233;ral des imp&#244;ts.</p>",
    "exposeSommaire": "<p style=\"text-align: justify;\">Lors de la campagne 2013&#8209;2014, l&#8217;association cr&#233;&#233;e par Coluche en 1985 a d&#233;pass&#233; pour la premi&#232;re fois le million de personnes inscrites dans ses centres, et servi 130 millions de repas.</p><p style=\"text-align: justify;\">Les associations qui concourent &#224; permettre &#224; nombre de nos concitoyens de pouvoir s&#8217;alimenter sont confront&#233;es &#224; un afflux de personnes qui demandent une aide.</p><p style=\"text-align: justify;\">Dans le cadre de la loi de finances pour 2014, l&#8217;exon&#233;ration fiscale dont b&#233;n&#233;ficient les professionnels qui effectuent des dons a &#233;t&#233; &#233;tendue aux dons des producteurs laitiers.</p><p style=\"text-align: justify;\">Cette mesure a permis de r&#233;colter deux millions de litres de lait pour les associations.</p><p style=\"text-align: justify;\">Selon le Pr&#233;sident des &#171;&#160;Restos du c&#339;ur&#160;&#187;&#160;: &#171;&#160;Viande, &#339;ufs, l&#233;gumes, c&#233;r&#233;ales, il faut que toutes les fili&#232;res puissent b&#233;n&#233;ficier d&#8217;un dispositif fiscal incitatif&#160;&#187;, au regard de la situation.</p><p style=\"text-align: justify;\">C&#8217;est pourquoi, le pr&#233;sent amendement, vise &#224; &#233;tendre aux dons en nature r&#233;alis&#233;s par les professionnels de l&#8217;agriculture le b&#233;n&#233;fice de la &#171;&#160;loi Coluche&#160;&#187;.</p><p style=\"text-align: justify;\">&#160;</p>"
  },
  "representations": [
    {
      "nom": "PDF",
      "typeMime": {
        "type": "application",
        "subType": "PDF"
      },
      "statutRepresentation": {
        "verbatim": true,
        "canonique": true,
        "officielle": true,
        "transcription": false,
        "enregistrement": false
      },
      "contenu": {
        "documentURI": "/15/amendements/2272A/AN/3.pdf"
      }
    }
  ],
  "seanceDiscussion": "RUANR5L15S2020IDS21865",
  "sort": {
    "dateSaisie": "2019-10-16T22:39:41.000+02:00",
    "sortEnSeance": "Rejeté"
  },
  "dateDepot": "2019-10-02T02:00:00.000+02:00",
  "dateDistribution": "2019-10-14T02:00:00.000+02:00",
  "article99": "0",
  "loiReference": {
    "codeLoi": "CGI",
    "divisionCodeLoi": "157"
  }
}