{
  "uid": "AMANR5L15PO59051B2357P0D1N850",
  "identifiant": {
    "legislature": "15",
    "numero": "850",
    "numRect": "0",
    "saisine": {
      "texteLegislatifRef": "PRJLANR5L15B2357",
      "numeroPartiePLF": "0",
      "organeExamen": "PO59051",
      "mentionSecondeDeliberation": "0"
    }
  },
  "numeroLong": "CL850",
  "etapeTexte": "1ère lecture (2ème assemblée saisie)",
  "triAmendement": "koaaaaaaaaaaaaaaaaaaaaaaaaaaaaaaaaaaaaaaaaaaaaaaaae",
  "cardinaliteAmdtMultiples": "1",
  "etat": "Irrecevable",
  "signataires": {
    "auteur": {
      "typeAuteur": "Depute",
      "acteurRef": "PA720644",
      "groupePolitiqueRef": "PO730934"
    },
    "cosignatairesRefs": [
      "PA605036",
      "PA722390",
      "PA267204",
      "PA720644",
      "PA266808",
      "PA608016",
      "PA721678"
    ],
    "texteAffichable": "M.&#160;Nury,  M.&#160;Abad, Mme&#160;Corneloup, Mme&#160;Louwagie, M.&#160;Reda, M.&#160;Rolland et M.&#160;Sermier"
  },
  "pointeurFragmentTexte": {
    "division": {
      "titre": "Article 23 bis",
      "articleDesignationCourte": "ART. 23 BIS",
      "type": "ARTICLE",
      "avantAApres": "A",
      "divisionRattachee": "ARTICLE 23 BIS",
      "urlDivisionTexteVise": "/15/textes/2357.asp#D_Article_23_bis"
    },
    "alinea": {
      "numero": "7"
    }
  },
  "corps": {},
  "representations": [
    {
      "nom": "PDF",
      "typeMime": {
        "type": "application",
        "subType": "PDF"
      },
      "statutRepresentation": {
        "verbatim": true,
        "canonique": true,
        "officielle": true,
        "transcription": false,
        "enregistrement": false
      },
      "contenu": {
        "documentURI": "/15/amendements/2357/CION_LOIS/CL850.pdf"
      }
    }
  ],
  "dateDepot": "2019-11-02T01:00:00.000+01:00",
  "dateDistribution": "2019-11-06T01:00:00.000+01:00",
  "article99": "0",
  "loiReference": {}
}