{
  "uid": "AMANR5L15SEA717460BTC0575P0D1N726",
  "identifiant": {
    "legislature": "15",
    "numero": "726",
    "numRect": "0",
    "saisine": {
      "texteLegislatifRef": "PRJLANR5L15BTC0575",
      "numeroPartiePLF": "0",
      "organeExamen": "PO717460",
      "mentionSecondeDeliberation": "0"
    }
  },
  "numeroLong": "726",
  "etapeTexte": "1ère lecture (1ère assemblée saisie)",
  "triAmendement": "dti",
  "cardinaliteAmdtMultiples": "1",
  "etat": "Retiré",
  "signataires": {
    "auteur": {
      "typeAuteur": "Depute",
      "acteurRef": "PA721498",
      "groupePolitiqueRef": "PO730964"
    },
    "cosignatairesRefs": [
      "PA721498"
    ],
    "texteAffichable": "M.&#160;Guerini"
  },
  "pointeurFragmentTexte": {
    "division": {
      "titre": "Article 2",
      "articleDesignationCourte": "ART. 2",
      "type": "ARTICLE",
      "avantAApres": "A",
      "divisionRattachee": "ARTICLE 2",
      "urlDivisionTexteVise": "/15/textes/0575.asp#D_Article_2"
    },
    "alinea": {
      "avantAApres": "Apres",
      "numero": "13"
    }
  },
  "corps": {
    "dispositif": "<p style=\"text-align: justify;\">Apr&#232;s l&#8217;alin&#233;a&#160;13, ins&#233;rer l&#8217;alin&#233;a suivant&#160;:</p><p style=\"text-align: justify;\">&#171;&#160;L&#8217;erreur de forme constat&#233;e par l&#8217;administration, si elle n&#8217;a pas port&#233; atteinte au respect de la loi, ne donne lieu &#224; aucune sanction p&#233;cuniaire et n&#8217;entre pas dans le champ d&#8217;application du droit &#224; r&#233;gularisation en cas d&#8217;erreur tel que d&#233;fini au pr&#233;sent article. Cette erreur, apr&#232;s avoir &#233;t&#233; notifi&#233;e par l&#8217;administration, doit n&#233;anmoins &#234;tre rectifi&#233;e par la personne en cause dans les meilleurs d&#233;lais.&#160;&#187;</p>",
    "exposeSommaire": "<p style=\"text-align: justify;\">R&#233;dactionnel.</p><p style=\"text-align: justify;\">Cet amendement reprend l&#8217;alin&#233;a&#160;7, supprim&#233; par un amendement pr&#233;c&#233;dent, afin de le placer &#224; la fin de l&#8217;article L.&#160;123&#8209;1.</p>"
  },
  "representations": [
    {
      "nom": "PDF",
      "typeMime": {
        "type": "application",
        "subType": "PDF"
      },
      "statutRepresentation": {
        "verbatim": true,
        "canonique": true,
        "officielle": true,
        "transcription": false,
        "enregistrement": false
      },
      "contenu": {
        "documentURI": "/15/amendements/0575/AN/726.pdf"
      }
    }
  ],
  "dateDepot": "2018-01-19T01:00:00.000+01:00",
  "dateDistribution": "2018-01-22T01:00:00.000+01:00",
  "article99": "0",
  "loiReference": {}
}