{
  "uid": "AMANR5L15SEA717460BTC2401P0D1N1292",
  "identifiant": {
    "legislature": "15",
    "numero": "1292",
    "numRect": "0",
    "saisine": {
      "texteLegislatifRef": "PRJLANR5L15BTC2401",
      "numeroPartiePLF": "0",
      "organeExamen": "PO717460",
      "mentionSecondeDeliberation": "0"
    }
  },
  "numeroLong": "1292",
  "etapeTexte": "1ère lecture (2ème assemblée saisie)",
  "triAmendement": "ckaaaaaaaaaaaaaaaaaaaaaaaaaaaaaaaaaaaaaaaaaaaaaaaaac",
  "cardinaliteAmdtMultiples": "1",
  "etat": "Discuté",
  "signataires": {
    "auteur": {
      "typeAuteur": "Depute",
      "acteurRef": "PA606098",
      "groupePolitiqueRef": "PO730934"
    },
    "cosignatairesRefs": [
      "PA606098"
    ],
    "texteAffichable": "M.&#160;Marleix"
  },
  "pointeurFragmentTexte": {
    "division": {
      "titre": "Article 11 bis C",
      "articleDesignationCourte": "ART. 11 BIS C",
      "type": "ARTICLE",
      "avantAApres": "A",
      "divisionRattachee": "ARTICLE 11 BIS C",
      "urlDivisionTexteVise": "/15/textes/2401.asp#D_Article_11_bis_C"
    }
  },
  "corps": {
    "dispositif": "<p style=\"text-align: justify;\">R&#233;tablir cet article dans la r&#233;daction suivante&#160;:</p><p style=\"text-align: justify;\">&#171;&#160;La section 5 du chapitre I<sup>er</sup> du titre IV du livre I<sup>er</sup> du code &#233;lectoral est compl&#233;t&#233; par un article L.&#160;247&#8209;1 ainsi r&#233;dig&#233;&#160;:</p><p style=\"text-align: justify;\">&#171;&#160;<i>Art.&#160;L.&#160;247&#8209;1</i>. &#8211; Lors du d&#233;p&#244;t des candidatures, les candidats ou les d&#233;l&#233;gu&#233;s de liste sont inform&#233;s qu&#8217;ils sont susceptibles de se voir attribuer une nuance politique aux fins d&#8217;analyse des r&#233;sultats &#233;lectoraux par le minist&#232;re de l&#8217;Int&#233;rieur. Ils peuvent demander &#224; conna&#238;tre cette nuance et la faire rectifier. En aucun cas, cette nuance ne peut &#234;tre rendue publique de fa&#231;on individuelle.&#160;&#187;&#160;</p>",
    "exposeSommaire": "<p style=\"text-align: justify;\">Le rattachement des candidatures &#224; des sensibilit&#233;s politiques est utilis&#233; par le minist&#232;re de l&#8217;Int&#233;rieur, charg&#233; de l&#8217;organisation des &#233;lections depuis la III eme R&#233;publique pour permettre une analyse consolid&#233;e &#224; l&#8217;&#233;chelle du pays ou d&#8217;un territoire, et permettre aux chercheurs en sciences-politiques d&#8217;analyser ces r&#233;sultats sur la longue p&#233;riode.</p><p style=\"text-align: justify;\">Cette pratique, qui n&#8217;a jamais &#233;t&#233; codifi&#233;e dans le code &#233;lectoral suscite r&#233;guli&#232;rement des pol&#233;miques, des &#233;lus contestant r&#233;guli&#232;rement la nuance qui leur a &#233;t&#233; attribu&#233;e, a fortiori lorsqu&#8217;elle est publi&#233;e dans la presse locale.</p><p style=\"text-align: justify;\">Il est propos&#233; de donner &#224; cette pratique un cadre l&#233;gal qui permettrait de conserver l&#8217;objectif tout en pr&#233;servant un droit de rectification par les candidats.</p>"
  },
  "representations": [
    {
      "nom": "PDF",
      "typeMime": {
        "type": "application",
        "subType": "PDF"
      },
      "statutRepresentation": {
        "verbatim": true,
        "canonique": true,
        "officielle": true,
        "transcription": false,
        "enregistrement": false
      },
      "contenu": {
        "documentURI": "/15/amendements/2401/AN/1292.pdf"
      }
    }
  ],
  "seanceDiscussion": "RUANR5L15S2020IDS21951",
  "sort": {
    "dateSaisie": "2019-11-21T00:08:17.000+01:00",
    "sortEnSeance": "Rejeté"
  },
  "dateDepot": "2019-11-14T01:00:00.000+01:00",
  "dateDistribution": "2019-11-19T01:00:00.000+01:00",
  "article99": "0",
  "loiReference": {}
}