{
  "uid": "AMANR5L15SEA717460B0235P2D1N433",
  "identifiant": {
    "legislature": "15",
    "numero": "433",
    "numRect": "1",
    "saisine": {
      "texteLegislatifRef": "PRJLANR5L15B0235",
      "numeroPartiePLF": "2",
      "organeExamen": "PO717460",
      "mentionSecondeDeliberation": "0"
    }
  },
  "numeroLong": "II-433 (Rect)",
  "etapeTexte": "1ère lecture (1ère assemblée saisie)",
  "triAmendement": "cs",
  "cardinaliteAmdtMultiples": "1",
  "etat": "Discuté",
  "signataires": {
    "auteur": {
      "typeAuteur": "Gouvernement"
    },
    "texteAffichable": "le Gouvernement"
  },
  "pointeurFragmentTexte": {
    "missionVisee": {
      "idMissionAN": "4",
      "libelleMission": "Agriculture, alimentation, forêt et affaires rurales",
      "codeMissionPLF": "B",
      "libelleMissionPLF": "Répartition, par mission et programme, des crédits du budget général"
    },
    "division": {
      "titre": "Article 49",
      "articleDesignationCourte": "APRÈS ART. 49",
      "type": "ARTICLE",
      "avantAApres": "Apres",
      "divisionRattachee": "APRÈS L'ARTICLE 49, insérer l'article suivant:",
      "articleAdditionnel": "1",
      "urlDivisionTexteVise": "/15/textes/0235C.asp#D_Article_49"
    }
  },
  "corps": {
    "dispositif": "<p style=\"text-align: justify;\">L&#8217;article&#160;1604 du code g&#233;n&#233;ral des imp&#244;ts est compl&#233;t&#233; par un IV ainsi r&#233;dig&#233;&#160;:&#160;</p><p style=\"text-align: justify;\">&#171;&#160;IV.&#160;&#8211; Le produit de la taxe per&#231;ue sur tous les immeubles class&#233;s au cadastre en nature de bois et for&#234;ts , d&#233;duction faite des cotisations pr&#233;vues aux articles L.&#160;251&#8209;1 et L.&#160;321&#8209;13 du code forestier et de la contribution pr&#233;vue au V de l&#8217;article&#160;47 de la loi n&#176;&#160;2013&#8209;1278 du 29&#160;d&#233;cembre 2013 de finances pour 2014, est vers&#233; par les chambres d&#233;partementales d&#8217;agriculture au Fonds national de solidarit&#233; et de p&#233;r&#233;quation. Les sommes ainsi vers&#233;es sont affect&#233;es aux actions des programmes r&#233;gionaux &#171;&#160;Valorisation du bois et territoire&#160;&#187; des services communs &#171;&#160;Valorisation du bois et territoire&#160;&#187; des chambres r&#233;gionales d&#8217;agriculture.&#160;&#187;</p>",
    "exposeSommaire": "<p style=\"text-align: justify;\">Afin d&#8217;assurer le financement des actions des programmes r&#233;gionaux &#171;&#160;Valorisation du bois et territoire&#160;&#187; des services communs &#171;&#160;Valorisation du bois et territoire&#160;&#187; des chambres r&#233;gionales d&#8217;agriculture&#160;&#187;, le pr&#233;sent amendement vise &#224; affecter au Fonds national de solidarit&#233; et de p&#233;r&#233;quation le produit de la part foresti&#232;re de la taxe per&#231;ue sur tous les immeubles class&#233;s au cadastre en nature de bois et for&#234;ts , dite &#171;&#160;centimes forestiers&#160;&#187;.</p><p style=\"text-align: justify;\">Cette affectation permettra de renforcer le fl&#233;chage au b&#233;n&#233;fice du d&#233;veloppement forestier de la part dite &#171;&#160;centimes forestiers&#160;&#187; de la taxe pour frais de chambre d&#8217;agriculture pr&#233;vue &#224; l&#8217;article&#160;1604 du code g&#233;n&#233;ral des imp&#244;ts, qui repr&#233;sente environ 6&#160;% de cette taxe soit 19 M&#8364; par an.</p>"
  },
  "representations": [
    {
      "nom": "PDF",
      "typeMime": {
        "type": "application",
        "subType": "PDF"
      },
      "statutRepresentation": {
        "verbatim": true,
        "canonique": true,
        "officielle": true,
        "transcription": false,
        "enregistrement": false
      },
      "contenu": {
        "documentURI": "/15/amendements/0235C/AN/433.pdf"
      }
    }
  ],
  "seanceDiscussion": "RUANR5L15S2018IDS20731",
  "sort": {
    "dateSaisie": "2017-11-02T12:14:33.000+01:00",
    "sortEnSeance": "Adopté"
  },
  "dateDepot": "2017-10-30T01:00:00.000+01:00",
  "dateDistribution": "2017-10-31T01:00:00.000+01:00",
  "article99": "1",
  "loiReference": {}
}