{
  "uid": "AMANR5L15SEA717460B1255P2D1N271",
  "identifiant": {
    "legislature": "15",
    "numero": "271",
    "numRect": "0",
    "saisine": {
      "texteLegislatifRef": "PRJLANR5L15B1255",
      "numeroPartiePLF": "2",
      "organeExamen": "PO717460",
      "mentionSecondeDeliberation": "0"
    }
  },
  "numeroLong": "II-271",
  "etapeTexte": "1ère lecture (1ère assemblée saisie)",
  "triAmendement": "abuaaaaaaaaaaaaaaaaaaaaaaaaaaaaaaaaaaaaaaaaaaaaaaatk",
  "cardinaliteAmdtMultiples": "1",
  "etat": "Discuté",
  "signataires": {
    "auteur": {
      "typeAuteur": "Depute",
      "acteurRef": "PA608695",
      "groupePolitiqueRef": "PO758835"
    },
    "cosignatairesRefs": [
      "PA610681",
      "PA608741",
      "PA608011",
      "PA337483",
      "PA609332",
      "PA335054",
      "PA607553",
      "PA719930",
      "PA333818",
      "PA608172",
      "PA643145",
      "PA608695",
      "PA1592",
      "PA340357",
      "PA508",
      "PA333285",
      "PA1198",
      "PA335532",
      "PA332614",
      "PA609590",
      "PA1008",
      "PA642764",
      "PA340343",
      "PA1809",
      "PA605069",
      "PA429893",
      "PA342415",
      "PA267233",
      "PA720988"
    ],
    "texteAffichable": "Mme&#160;Untermaier,  Mme&#160;Karamanli, M.&#160;David&#160;Habib, M.&#160;Saulignac, M.&#160;Aviragnet, Mme&#160;Bareigts, Mme&#160;Battistel, Mme&#160;Bi&#233;mouret, M.&#160;Bouillon, M.&#160;Jean-Louis&#160;Bricout, M.&#160;Carvounas, M.&#160;Alain&#160;David, Mme&#160;Laurence&#160;Dumont, M.&#160;Faure, M.&#160;Garot, M.&#160;Hutin, M.&#160;Juanico, M.&#160;J&#233;r&#244;me&#160;Lambert, M.&#160;Letchimy, Mme&#160;Manin, Mme&#160;Pau-Langevin, Mme&#160;Pires Beaune, M.&#160;Potier, M.&#160;Pueyo, Mme&#160;Rabault, Mme&#160;Tolmont, Mme&#160;Vainqueur-Christophe, M.&#160;Vallaud, Mme&#160;Victory et les membres du groupe Socialistes et apparent&#233;s"
  },
  "pointeurFragmentTexte": {
    "missionVisee": {
      "idMissionAN": "409",
      "libelleMission": "Justice",
      "codeMissionPLF": "B",
      "libelleMissionPLF": "Répartition, par mission et programme, des crédits du budget général"
    },
    "division": {
      "titre": "ÉTAT B",
      "articleDesignationCourte": "ART. 39",
      "type": "ANNEXE",
      "avantAApres": "A",
      "divisionRattachee": "ARTICLE 39",
      "urlDivisionTexteVise": "/15/textes/1255C.asp#D_ETAT_B"
    }
  },
  "corps": {
    "exposeSommaire": "<p style=\"text-align: justify;\">Le groupe &#171;&#160;socialistes et apparent&#233;s&#160;&#187; souhaite, par cet amendement, augmenter les cr&#233;dits affect&#233;s &#224; la protection judiciaire de la jeunesse dans le cadre du Projet de loi de finances 2019. En effet, alors que le Gouvernement met en valeur une augmentation du budget de + 3&#160;%, on peut s&#8217;interroger sur le caract&#232;re adapt&#233; et suffisant de cette augmentation compte tenu de la &#171;&#160;constante augmentation&#160;&#187; des poursuites des mineurs devant le juge des enfants et devant le juge d&#8217;instruction qui est le &#171;&#160;signe d&#8217;une &#233;volution vers des actes plus grave commis par les mineurs&#160;&#187; (p.44 du &#171;&#160;bleu budg&#233;taire&#160;&#187;). En effet, d&#232;s lors que ces actes sont plus nombreux et plus graves, l&#8217;accompagnement des mineurs doit &#234;tre renforc&#233; en proportion. En ce domaine, la cr&#233;ation de 20 centres &#233;ducatifs ferm&#233;s suppl&#233;mentaires ne peut suffire &#224; une politique ambitieuse de protection de la jeunesse. Les parcours individualis&#233;s de r&#233;insertion ne sont une solution que si le taux d&#8217;encadrement de ces jeunes est suffisant pour permettre un traitement individualis&#233; par des professionnels d&#8217;&#233;ducation, d&#8217;enseignement, d&#8217;orientation, notamment. L&#8217;augmentation de 51 ETPT pour le programme 182 apparait d&#233;risoire &#224; cet &#233;gard.</p><p style=\"text-align: justify;\">Aussi cet amendement propose t-il la cr&#233;ation de 100 ETPT suppl&#233;mentaires pour un montant de 10 000 000&#160;&#8364; au profit du programme &#171;&#160;Protection judiciaire de la jeunesse&#160;&#187; et de l&#8217;action formation. Corr&#233;lativement, il est propos&#233; de r&#233;duire du m&#234;me montant le programme &#171;&#160;conduite et pilotage de la politique de la justice&#160;&#187; et de son action &#171;&#160;gestion de l&#8217;administration centrale&#160;&#187;.</p>",
    "dispositifAmdtCredit": {
      "listeProgrammes": [
        {
          "libelle": "Justice judiciaire",
          "id": "28153",
          "AE": {
            "montantPositif": "0",
            "montantNegatif": "0"
          },
          "CP": {
            "montantPositif": "0",
            "montantNegatif": "0"
          },
          "action": "modification"
        },
        {
          "libelle": "Administration pénitentiaire",
          "id": "28154",
          "AE": {
            "montantPositif": "0",
            "montantNegatif": "0"
          },
          "CP": {
            "montantPositif": "0",
            "montantNegatif": "0"
          },
          "action": "modification"
        },
        {
          "libelle": "Protection judiciaire de la jeunesse",
          "id": "28155",
          "AE": {
            "montantPositif": "10000000",
            "montantNegatif": "0"
          },
          "CP": {
            "montantPositif": "10000000",
            "montantNegatif": "0"
          },
          "action": "modification"
        },
        {
          "libelle": "Accès au droit et à la justice",
          "id": "28156",
          "AE": {
            "montantPositif": "0",
            "montantNegatif": "0"
          },
          "CP": {
            "montantPositif": "0",
            "montantNegatif": "0"
          },
          "action": "modification"
        },
        {
          "libelle": "Conduite et pilotage de la politique de la justice",
          "id": "28157",
          "AE": {
            "montantPositif": "0",
            "montantNegatif": "10000000"
          },
          "CP": {
            "montantPositif": "0",
            "montantNegatif": "10000000"
          },
          "action": "modification"
        },
        {
          "libelle": "Conseil supérieur de la magistrature",
          "id": "28158",
          "AE": {
            "montantPositif": "0",
            "montantNegatif": "0"
          },
          "CP": {
            "montantPositif": "0",
            "montantNegatif": "0"
          },
          "action": "modification"
        }
      ],
      "totalAE": {
        "montantPositif": "10000000",
        "montantNegatif": "10000000",
        "solde": "0"
      },
      "totalCP": {
        "montantPositif": "10000000",
        "montantNegatif": "10000000",
        "solde": "0"
      }
    }
  },
  "representations": [
    {
      "nom": "PDF",
      "typeMime": {
        "type": "application",
        "subType": "PDF"
      },
      "statutRepresentation": {
        "verbatim": true,
        "canonique": true,
        "officielle": true,
        "transcription": false,
        "enregistrement": false
      },
      "contenu": {
        "documentURI": "/15/amendements/1255C/AN/271.pdf"
      }
    }
  ],
  "seanceDiscussion": "RUANR5L15S2019IDS21320",
  "sort": {
    "dateSaisie": "2018-10-31T18:07:21.000+01:00",
    "sortEnSeance": "Rejeté"
  },
  "dateDepot": "2018-10-25T02:00:00.000+02:00",
  "dateDistribution": "2018-10-29T01:00:00.000+01:00",
  "article99": "0",
  "loiReference": {}
}