{
  "uid": "AMANR5L15PO419865B0911P0D1N29",
  "identifiant": {
    "legislature": "15",
    "numero": "29",
    "numRect": "0",
    "saisine": {
      "texteLegislatifRef": "PRJLANR5L15B0911",
      "numeroPartiePLF": "0",
      "organeExamen": "PO419865",
      "mentionSecondeDeliberation": "0"
    }
  },
  "numeroLong": "CD29",
  "etapeTexte": "1ère lecture (1ère assemblée saisie)",
  "triAmendement": "bxmn",
  "cardinaliteAmdtMultiples": "1",
  "etat": "Discuté",
  "signataires": {
    "auteur": {
      "typeAuteur": "Depute",
      "acteurRef": "PA721860",
      "groupePolitiqueRef": "PO730964"
    },
    "cosignatairesRefs": [
      "PA721860"
    ],
    "texteAffichable": "M.&#160;Cesarini"
  },
  "pointeurFragmentTexte": {
    "division": {
      "titre": "Article 2",
      "articleDesignationCourte": "ART. 2",
      "type": "ARTICLE",
      "avantAApres": "A",
      "divisionRattachee": "ARTICLE 2",
      "urlDivisionTexteVise": "/15/textes/0911.asp#D_Article_2"
    },
    "alinea": {
      "numero": "1"
    }
  },
  "corps": {
    "dispositif": "<p style=\"text-align: justify;\">&#192; la fin de l&#8217;alin&#233;a, substituer aux mots&#160;:</p><p style=\"text-align: justify;\">&#171;&#160;et de l&#8217;action contre les changements climatiques&#160;&#187;</p><p style=\"text-align: justify;\">les mots&#160;:</p><p style=\"text-align: justify;\">&#171;&#160;, de l&#8217;action contre les changements climatiques, de la pr&#233;servation de la diversit&#233; biologique et de l&#8217;&#233;ducation au respect de l&#8217;environnement et au d&#233;veloppement durable&#160;&#187;.</p>",
    "exposeSommaire": "<p style=\"text-align: justify;\">La lutte contre les changements climatiques, la pr&#233;servation de la biodiversit&#233; et l&#8217;&#233;ducation au respect de l&#8217;environnement et au d&#233;veloppement durable sont li&#233;es.&#160;</p><p style=\"text-align: justify;\">Cela montre un engagement fort de notre nation face aux enjeux qui nous attendent.</p>"
  },
  "representations": [
    {
      "nom": "PDF",
      "typeMime": {
        "type": "application",
        "subType": "PDF"
      },
      "statutRepresentation": {
        "verbatim": true,
        "canonique": true,
        "officielle": true,
        "transcription": false,
        "enregistrement": false
      },
      "contenu": {
        "documentURI": "/15/amendements/0911/CION-DVP/CD29.pdf"
      }
    }
  ],
  "sort": {
    "dateSaisie": "2018-06-12T20:33:00.000+02:00",
    "sortEnSeance": "Tombé"
  },
  "dateDepot": "2018-06-07T02:00:00.000+02:00",
  "dateDistribution": "2018-06-11T02:00:00.000+02:00",
  "article99": "0",
  "loiReference": {}
}