{
  "uid": "AMANR5L15SEA717460BTC1974P0D1N3511",
  "identifiant": {
    "legislature": "15",
    "numero": "3511",
    "numRect": "0",
    "saisine": {
      "texteLegislatifRef": "PRJLANR5L15BTC1974",
      "numeroPartiePLF": "0",
      "organeExamen": "PO717460",
      "mentionSecondeDeliberation": "0"
    }
  },
  "numeroLong": "3511",
  "etapeTexte": "1ère lecture (2ème assemblée saisie)",
  "triAmendement": "elaaaaaaaaaaaaaaaaaaaaaaaaaaaaaaaaaaaaaaaaaaaaaaaaodtf",
  "cardinaliteAmdtMultiples": "1",
  "etat": "Irrecevable",
  "signataires": {
    "auteur": {
      "typeAuteur": "Depute",
      "acteurRef": "PA719464",
      "groupePolitiqueRef": "PO723569"
    },
    "cosignatairesRefs": [
      "PA719464"
    ],
    "texteAffichable": "M.&#160;Nadot"
  },
  "pointeurFragmentTexte": {
    "division": {
      "titre": "Article 26",
      "articleDesignationCourte": "ART. 26",
      "type": "ARTICLE",
      "avantAApres": "A",
      "divisionRattachee": "ARTICLE 26",
      "urlDivisionTexteVise": "/15/textes/1974.asp#D_Article_26"
    },
    "alinea": {
      "numero": "3"
    }
  },
  "corps": {},
  "representations": [
    {
      "nom": "PDF",
      "typeMime": {
        "type": "application",
        "subType": "PDF"
      },
      "statutRepresentation": {
        "verbatim": true,
        "canonique": true,
        "officielle": true,
        "transcription": false,
        "enregistrement": false
      },
      "contenu": {
        "documentURI": "/15/amendements/1974/AN/3511.pdf"
      }
    }
  ],
  "dateDepot": "2019-05-29T02:00:00.000+02:00",
  "dateDistribution": "2019-05-31T02:00:00.000+02:00",
  "article99": "0",
  "loiReference": {}
}