{
  "uid": "AMANR5L15SEA717460BTC0971P0D1N431",
  "identifiant": {
    "legislature": "15",
    "numero": "431",
    "numRect": "0",
    "saisine": {
      "texteLegislatifRef": "PRJLANR5L15BTC0971",
      "numeroPartiePLF": "0",
      "organeExamen": "PO717460",
      "mentionSecondeDeliberation": "0"
    }
  },
  "numeroLong": "431",
  "etapeTexte": "1ère lecture (1ère assemblée saisie)",
  "triAmendement": "ce",
  "cardinaliteAmdtMultiples": "1",
  "etat": "Discuté",
  "signataires": {
    "auteur": {
      "typeAuteur": "Depute",
      "acteurRef": "PA720996",
      "groupePolitiqueRef": "PO723569"
    },
    "cosignatairesRefs": [
      "PA719146",
      "PA333421",
      "PA720996",
      "PA719138",
      "PA719286"
    ],
    "texteAffichable": "M.&#160;El Guerrab,  M.&#160;Pancher, M.&#160;Acquaviva, M.&#160;Castellani et M.&#160;Colombani"
  },
  "pointeurFragmentTexte": {
    "division": {
      "titre": "Article 18",
      "articleDesignationCourte": "ART. 18",
      "type": "ARTICLE",
      "avantAApres": "A",
      "divisionRattachee": "ARTICLE 18",
      "urlDivisionTexteVise": "/15/textes/0971.asp#D_Article_18"
    }
  },
  "corps": {
    "dispositif": "<p>Supprimer cet article.</p>",
    "exposeSommaire": "<p style=\"text-align: justify;\">Le projet de loi pr&#233;voit de modifier les r&#232;gles en mati&#232;re d&#8217;accessibilit&#233; aux personnes handicap&#233;es des b&#226;timents d&#8217;habitation collectifs afin de substituer, en partie, &#224; l&#8217;obligation de produire des logements accessibles une obligation de produire des &#171;&#160;logements &#233;volutifs&#160;&#187;.</p><p style=\"text-align: justify;\">Pourtant, plusieurs organisations repr&#233;sentatives des personnes en situation de handicap et de lutte contre l&#8217;exclusion, ainsi que le conseil national consultatif des personnes handicap&#233;es, ont exprim&#233;, en vain, leur totale incompr&#233;hension sur ce dispositif.</p><p style=\"text-align: justify;\">De plus, ces dispositions sont en incoh&#233;rence totale avec les autres politiques publiques engag&#233;es par le gouvernement (transformation de l&#8217;offre de services des personnes en situation de handicap, d&#233;veloppement de l&#8217;habitat inclusif, de l&#8217;hospitalisation &#224; domicile et en ambulatoire, &#8230;) ainsi qu&#8217;avec le vieillissement de la population. Le projet de loi pr&#233;voit en effet de r&#233;duire &#224; 10&#160;% le nombre des logements neufs accessibles, au lieu de 100&#160;% aujourd&#8217;hui, ce qui constitue une grave r&#233;gression sociale.</p><p style=\"text-align: justify;\">Il condamnerait alors les personnes en situation de handicap et &#226;g&#233;es &#224; ne plus pouvoir acc&#233;der qu&#8217;&#224; un peu plus de 2 000 logements neufs chaque ann&#233;e. L&#8217;introduction de ce quota de logements est en outre discriminatoire et en contradiction avec le droit des personnes &#224; choisir librement leur lieu de vie (article&#160;19 de la Convention de l&#8217;ONU relative au droit des personnes handicap&#233;es, pourtant ratifi&#233;e par la France en 2010).<br /> C&#8217;est donc un amendement de suppression qui est propos&#233;.</p>"
  },
  "representations": [
    {
      "nom": "PDF",
      "typeMime": {
        "type": "application",
        "subType": "PDF"
      },
      "statutRepresentation": {
        "verbatim": true,
        "canonique": true,
        "officielle": true,
        "transcription": false,
        "enregistrement": false
      },
      "contenu": {
        "documentURI": "/15/amendements/0971/AN/431.pdf"
      }
    }
  ],
  "seanceDiscussion": "RUANR5L15S2018IDS21082",
  "sort": {
    "dateSaisie": "2018-06-01T18:40:15.000+02:00",
    "sortEnSeance": "Non soutenu"
  },
  "dateDepot": "2018-05-23T02:00:00.000+02:00",
  "dateDistribution": "2018-05-29T02:00:00.000+02:00",
  "article99": "0",
  "loiReference": {}
}