{
  "uid": "AMANR5L15SEA717460BTC1918P0D1N81",
  "identifiant": {
    "legislature": "15",
    "numero": "81",
    "numRect": "0",
    "saisine": {
      "texteLegislatifRef": "PRJLANR5L15BTC1918",
      "numeroPartiePLF": "0",
      "organeExamen": "PO717460",
      "mentionSecondeDeliberation": "0"
    }
  },
  "numeroLong": "81",
  "etapeTexte": "1ère lecture (1ère assemblée saisie)",
  "triAmendement": "caaaaaaaaaaaaaaaaaaaaaaaaaaaaaaaaaaaaaaaaaaaaaaaaarbe",
  "cardinaliteAmdtMultiples": "1",
  "etat": "Discuté",
  "signataires": {
    "auteur": {
      "typeAuteur": "Depute",
      "acteurRef": "PA340853",
      "groupePolitiqueRef": "PO730934"
    },
    "cosignatairesRefs": [
      "PA340853",
      "PA266793",
      "PA721286",
      "PA606712",
      "PA266808",
      "PA718884",
      "PA722390",
      "PA608016",
      "PA642847",
      "PA719318"
    ],
    "texteAffichable": "M.&#160;Leclerc,  M.&#160;Bony, Mme&#160;Anthoine, Mme&#160;Bazin-Malgras, M.&#160;Lurton, M.&#160;Ramadier, M.&#160;Bazin, Mme&#160;Corneloup, M.&#160;Rolland et Mme&#160;Louwagie"
  },
  "pointeurFragmentTexte": {
    "division": {
      "titre": "Article 3",
      "articleDesignationCourte": "ART. 3",
      "type": "ARTICLE",
      "avantAApres": "A",
      "divisionRattachee": "ARTICLE 3",
      "urlDivisionTexteVise": "/15/textes/1918.asp#D_Article_3"
    },
    "alinea": {
      "avantAApres": "Apres",
      "numero": "1"
    }
  },
  "corps": {
    "dispositif": "<p style=\"text-align: justify;\">Compl&#233;ter cet article par la phrase suivante&#160;: </p><p style=\"text-align: justify;\">&#171;&#160;Ces sommes sont plac&#233;es sur un compte sp&#233;cifique r&#233;mun&#233;r&#233;, avant leur utilisation pour r&#233;gler les frais de reconstruction. Les int&#233;r&#234;ts produits viennent augmenter les sommes collect&#233;es, qui sont utilis&#233;es globalement dans les conditions mentionn&#233;es &#224; l&#8217;article&#160;2 de la pr&#233;sente loi&#160;&#187;</p>",
    "exposeSommaire": "<p style=\"text-align: justify;\">Consid&#233;rant que les d&#233;lais de reconstruction seront beaucoup plus longs que ceux du versement des dons, cet amendement vise &#224; assurer les donateurs que les produits financiers g&#233;n&#233;r&#233;s par ce diff&#233;rentiel de temps seront bien allou&#233;s &#224; la cause ayant g&#233;n&#233;r&#233; le versement.</p>"
  },
  "representations": [
    {
      "nom": "PDF",
      "typeMime": {
        "type": "application",
        "subType": "PDF"
      },
      "statutRepresentation": {
        "verbatim": true,
        "canonique": true,
        "officielle": true,
        "transcription": false,
        "enregistrement": false
      },
      "contenu": {
        "documentURI": "/15/amendements/1918/AN/81.pdf"
      }
    }
  ],
  "sort": {
    "dateSaisie": "2019-05-10T18:13:27.000+02:00",
    "sortEnSeance": "Rejeté"
  },
  "dateDepot": "2019-05-06T02:00:00.000+02:00",
  "dateDistribution": "2019-05-09T02:00:00.000+02:00",
  "article99": "0",
  "loiReference": {}
}