{
  "uid": "AMANR5L15PO420120B1681P0D1N1164",
  "identifiant": {
    "legislature": "15",
    "numero": "1164",
    "numRect": "0",
    "saisine": {
      "texteLegislatifRef": "PRJLANR5L15B1681",
      "numeroPartiePLF": "0",
      "organeExamen": "PO420120",
      "mentionSecondeDeliberation": "0"
    }
  },
  "numeroLong": "AS1164",
  "etapeTexte": "1ère lecture (1ère assemblée saisie)",
  "triAmendement": "jbaaaaaaaaaaaaaaaaaaaaaaaaaaaaaaaaaaaaaaaaaaaaaaaaazu",
  "cardinaliteAmdtMultiples": "1",
  "etat": "Discuté",
  "signataires": {
    "auteur": {
      "typeAuteur": "Depute",
      "acteurRef": "PA718926",
      "groupePolitiqueRef": "PO730940"
    },
    "cosignatairesRefs": [
      "PA610667",
      "PA721270",
      "PA721896",
      "PA689",
      "PA720692",
      "PA441",
      "PA720546",
      "PA335612",
      "PA722110",
      "PA267306",
      "PA610654",
      "PA721118",
      "PA722202",
      "PA721012",
      "PA718720",
      "PA718926"
    ],
    "texteAffichable": "M.&#160;Dharr&#233;ville,  M.&#160;Bruneel, M.&#160;Nilor, Mme&#160;Bello, M.&#160;Brotherson, Mme&#160;Buffet, M.&#160;Chassaigne, M.&#160;Dufr&#232;gne, Mme&#160;Faucillon, M.&#160;Jumel, Mme&#160;K&#233;clard-Mond&#233;sir, M.&#160;Lecoq, M.&#160;Peu, M.&#160;Fabien&#160;Roussel, M.&#160;Serville et M.&#160;Wulfranc"
  },
  "pointeurFragmentTexte": {
    "division": {
      "titre": "Article 18",
      "articleDesignationCourte": "APRÈS ART. 18",
      "type": "ARTICLE",
      "avantAApres": "Apres",
      "divisionRattachee": "APRÈS L'ARTICLE 18, insérer l'article suivant:",
      "articleAdditionnel": "1",
      "urlDivisionTexteVise": "/15/textes/1681.asp#D_Article_18"
    }
  },
  "corps": {
    "dispositif": "<p style=\"text-align: justify;\">Dans les six mois &#224; compter de la promulgation de la pr&#233;sente loi, le Gouvernement remet au Parlement un rapport sur l&#8217;opportunit&#233; de cr&#233;er un groupement d&#8217;int&#233;r&#234;t public regroupant l&#8217;Agence nationale de s&#233;curit&#233; du m&#233;dicament et des produits de sant&#233;, la Haute autorit&#233; de sant&#233; et le Comit&#233; &#233;conomique des produits de sant&#233;.</p>",
    "exposeSommaire": "<p style=\"text-align: justify;\">La pr&#233;sente demande de rapport vise &#224; &#233;tudier la possibilit&#233; de cr&#233;er un p&#244;le public du m&#233;dicament. Les r&#233;cents scandales sanitaires (Levothyrox, D&#233;pakine) comme les p&#233;nuries de m&#233;dicaments montrent un besoin de r&#233;gulation publique face au poids &#233;conomique de l&#8217;industrie pharmaceutique. Un P&#244;le public du m&#233;dicament dot&#233; de moyens suffisants permettrait de r&#233;&#233;quilibrer de fa&#231;on ind&#233;pendante la recherche clinique et pharmaceutique sur les enjeux de sant&#233; publique. Il permettrait &#233;galement de s&#233;curiser la chaine de fabrication et d&#8217;approvisionnement des m&#233;dicaments.</p><p style=\"text-align: justify;\">Tel est l&#8217;objet de cet amendement.</p>"
  },
  "representations": [
    {
      "nom": "PDF",
      "typeMime": {
        "type": "application",
        "subType": "PDF"
      },
      "statutRepresentation": {
        "verbatim": true,
        "canonique": true,
        "officielle": true,
        "transcription": false,
        "enregistrement": false
      },
      "contenu": {
        "documentURI": "/15/amendements/1681/CION-SOC/AS1164.pdf"
      }
    }
  ],
  "sort": {
    "dateSaisie": "2019-03-14T14:43:52.000+01:00",
    "sortEnSeance": "Retiré"
  },
  "dateDepot": "2019-03-08T01:00:00.000+01:00",
  "dateDistribution": "2019-03-12T01:00:00.000+01:00",
  "article99": "0",
  "loiReference": {
    "codeLoi": "zzzz"
  }
}