{
  "uid": "AMANR5L15SEA717460BTC0857P0D1N741",
  "identifiant": {
    "legislature": "15",
    "numero": "741",
    "numRect": "0",
    "saisine": {
      "texteLegislatifRef": "PRJLANR5L15BTC0857",
      "numeroPartiePLF": "0",
      "organeExamen": "PO717460",
      "mentionSecondeDeliberation": "0"
    }
  },
  "numeroLong": "741",
  "etapeTexte": "1ère lecture (1ère assemblée saisie)",
  "triAmendement": "kbdw",
  "cardinaliteAmdtMultiples": "1",
  "etat": "Discuté",
  "signataires": {
    "auteur": {
      "typeAuteur": "Depute",
      "acteurRef": "PA719138",
      "groupePolitiqueRef": "PO723569"
    },
    "cosignatairesRefs": [
      "PA719146",
      "PA719286",
      "PA719138"
    ],
    "texteAffichable": "M.&#160;Castellani,  M.&#160;Acquaviva et M.&#160;Colombani"
  },
  "pointeurFragmentTexte": {
    "division": {
      "titre": "Article 18",
      "articleDesignationCourte": "APRÈS ART. 18",
      "type": "ARTICLE",
      "avantAApres": "Apres",
      "divisionRattachee": "APRÈS L'ARTICLE 18, insérer l'article suivant:",
      "articleAdditionnel": "1",
      "urlDivisionTexteVise": "/15/textes/0857.asp#D_Article_18"
    }
  },
  "corps": {
    "dispositif": "<p>Les subventions aux &#201;tats aid&#233;s par la France qui n&#8217;accepteraient pas d&#8217;accueillir leurs ressortissants d&#233;bout&#233;s, une fois les voies de recours &#233;puis&#233;es, sont gel&#233;es.</p>",
    "exposeSommaire": "<p style=\"text-align: justify;\">En 2016, il y a eu 58 227 d&#233;bout&#233;s de la demande d&#8217;asile (source minist&#232;re de l&#8217;int&#233;rieur). La pratique des reconduites est insuffisamment effective et insuffisamment efficiente, mais pour que cette pratique s&#8217;am&#233;liore, cela passe par un accord avec les pays d&#8217;origine (proc&#233;dure de r&#233;admission). Or, plusieurs consulats, pour des motifs politiques, refusent de d&#233;livrer le laisser-passer indispensable.</p><p style=\"text-align: justify;\">L&#8217;objet de cet amendement est de geler les subventions aux &#201;tats aid&#233;s par la France qui n&#8217;accepteraient pas d&#8217;accueillir leurs ressortissants d&#233;bout&#233;s.</p><p style=\"text-align: justify;\">Une prise de conscience de chacun des &#201;tats concern&#233;s par les enjeux migratoires est une condition n&#233;cessaire &#224; la stabilit&#233; du monde et &#224; un accompagnement digne des personnes.</p>"
  },
  "representations": [
    {
      "nom": "PDF",
      "typeMime": {
        "type": "application",
        "subType": "PDF"
      },
      "statutRepresentation": {
        "verbatim": true,
        "canonique": true,
        "officielle": true,
        "transcription": false,
        "enregistrement": false
      },
      "contenu": {
        "documentURI": "/15/amendements/0857/AN/741.pdf"
      }
    }
  ],
  "seanceDiscussion": "RUANR5L15S2018IDS21077",
  "sort": {
    "dateSaisie": "2018-04-21T21:40:22.000+02:00",
    "sortEnSeance": "Non soutenu"
  },
  "dateDepot": "2018-04-12T02:00:00.000+02:00",
  "dateDistribution": "2018-04-16T02:00:00.000+02:00",
  "article99": "0",
  "loiReference": {}
}