{
  "uid": "AMANR5L15SEA717460BTC1396P0D1N1631",
  "identifiant": {
    "legislature": "15",
    "numero": "1631",
    "numRect": "0",
    "saisine": {
      "texteLegislatifRef": "PRJLANR5L15BTC1396",
      "numeroPartiePLF": "0",
      "organeExamen": "PO717460",
      "mentionSecondeDeliberation": "0"
    }
  },
  "numeroLong": "1631",
  "etapeTexte": "1ère lecture (2ème assemblée saisie)",
  "triAmendement": "ktaaaabaaaaaaaaaaaaaaaaaaaaaaaaaaaaaaaaaaaaaaaaaaazzzzzzzzzzzzzzzzzzzzzzzzzzzzzzzzzzzzzzzzzzzzzzzzzzzs",
  "cardinaliteAmdtMultiples": "1",
  "etat": "Discuté",
  "signataires": {
    "auteur": {
      "typeAuteur": "Depute",
      "acteurRef": "PA334654",
      "groupePolitiqueRef": "PO730934"
    },
    "cosignatairesRefs": [
      "PA334654",
      "PA767"
    ],
    "texteAffichable": "M.&#160;Straumann et M.&#160;Cattin"
  },
  "pointeurFragmentTexte": {
    "division": {
      "titre": "Article 53",
      "articleDesignationCourte": "ART. 53",
      "type": "ARTICLE",
      "avantAApres": "A",
      "divisionRattachee": "ARTICLE 53",
      "urlDivisionTexteVise": "/15/textes/1396.asp#D_Article_53"
    },
    "alinea": {
      "numero": "55"
    }
  },
  "corps": {
    "dispositif": "<p style=\"text-align: justify;\">R&#233;diger ainsi l&#8217;alin&#233;a&#160;55&#160;:</p><p style=\"text-align: justify;\">&#171;&#160;<i>Art.&#160;L.&#160;213&#8209;4&#8209;1&#160;&#8211;&#160;</i>Au sein des chambres d&#233;tach&#233;es, telles que d&#233;finies &#224; l&#8217;article L.&#160;212&#8209;8, un ou plusieurs juges exercent les fonctions de juge des contentieux de la protection.&#160;&#187;</p>",
    "exposeSommaire": "<p style=\"text-align: justify;\">Le projet de loi op&#232;re une transformation des tribunaux d&#8217;instance en chambres d&#233;tach&#233;es aupr&#232;s du tribunal de grande instance. Les tribunaux d&#8217;instance traitent des litiges de la vie quotidienne. Les magistrats y si&#233;geant sont sp&#233;cialistes de ce type de contentieux. Par exemple, suivant la lettre du Code de la consommation, les juges peuvent soulever d&#8217;office des dispositions propres au r&#232;glement du litige quand bien m&#234;me les parties ne s&#8217;en seraient pas pr&#233;valu. Les justiciables ignorant bien souvent l&#8217;ensemble de leurs droits, cette mesure protectrice, permettait de r&#233;tablir l&#8217;&#233;quilibre entre les parties. Cette mesure pourrait ainsi aller de pair avec une moindre qualit&#233; de la justice rendue sur des sujets d&#8217;importance tels que les baux d&#8217;habitation, les saisies-r&#233;mun&#233;ration, ainsi que l&#8217;ensemble des litiges relatifs au droit de la consommation.</p><p style=\"text-align: justify;\">Un rapport d&#8217;information d&#8217;avril 2017 du S&#233;nat intitul&#233; &#171;&#160;5 ans pour sauver la justice&#160;&#187; rappelait qu&#8217;&#171;&#160;en mati&#232;re de litiges de la vie courante, le justiciable attend un traitement de proximit&#233;, avec une institution judiciaire plus simple d&#8217;acc&#232;s, en premi&#232;re instance, sans quoi saisir le juge devient une d&#233;marche trop complexe et dissuasive&#160;&#187;. Et le rapport d&#8217;ajouter qu&#8217;il &#233;tait &#171;&#160;n&#233;cessaire de rendre la justice plus proche et plus accessible&#160;&#187;.</p><p style=\"text-align: justify;\">Afin de suivre la lettre du rapport cit&#233;, le pr&#233;sent amendement propose de r&#233;tablir les dispositions permettant de garantir que les magistrats seront nomm&#233;s soit au sein des chambres d&#233;tach&#233;es, soit au sein des tribunaux judiciaires, ce qui permet de garantir une justice sp&#233;cialis&#233;e. Par ailleurs, le pr&#233;sent amendement propose d&#8217;encadrer tout projet de modification de l&#8217;organisation judiciaire, de r&#233;tablir la comp&#233;tence du juge des contentieux de proximit&#233; pour les litiges inf&#233;rieurs &#224; 10 000&#160;euros, et de s&#8217;assurer que ceux-ci exerceront aux sein des chambres d&#233;tach&#233;es, afin de garantir que les magistrats sp&#233;cialis&#233;s seront &#233;galement accessibles aux justiciables d&#8217;un point de vue g&#233;ographique.</p>"
  },
  "representations": [
    {
      "nom": "PDF",
      "typeMime": {
        "type": "application",
        "subType": "PDF"
      },
      "statutRepresentation": {
        "verbatim": true,
        "canonique": true,
        "officielle": true,
        "transcription": false,
        "enregistrement": false
      },
      "contenu": {
        "documentURI": "/15/amendements/1396/AN/1631.pdf"
      }
    }
  ],
  "seanceDiscussion": "RUANR5L15S2019IDS21405",
  "sort": {
    "dateSaisie": "2018-12-05T23:46:42.000+01:00",
    "sortEnSeance": "Non soutenu"
  },
  "dateDepot": "2018-11-14T01:00:00.000+01:00",
  "dateDistribution": "2018-12-04T01:00:00.000+01:00",
  "article99": "0",
  "loiReference": {}
}