{
  "uid": "AMANR5L15PO419865B0627P0D1N403",
  "identifiant": {
    "legislature": "15",
    "numero": "403",
    "numRect": "0",
    "saisine": {
      "texteLegislatifRef": "PRJLANR5L15B0627",
      "numeroPartiePLF": "0",
      "organeExamen": "PO419865",
      "mentionSecondeDeliberation": "0"
    }
  },
  "numeroLong": "CD403",
  "etapeTexte": "1ère lecture (1ère assemblée saisie)",
  "triAmendement": "bdku",
  "cardinaliteAmdtMultiples": "1",
  "etat": "Discuté",
  "signataires": {
    "auteur": {
      "typeAuteur": "Depute",
      "acteurRef": "PA267233",
      "groupePolitiqueRef": "PO730946"
    },
    "cosignatairesRefs": [
      "PA267233"
    ],
    "texteAffichable": "M.&#160;Bouillon"
  },
  "pointeurFragmentTexte": {
    "division": {
      "titre": "Article 13",
      "articleDesignationCourte": "APRÈS ART. 13",
      "type": "ARTICLE",
      "avantAApres": "Apres",
      "divisionRattachee": "APRÈS L'ARTICLE 13, insérer l'article suivant:",
      "articleAdditionnel": "1",
      "urlDivisionTexteVise": "/15/textes/0627.asp#D_Article_13"
    }
  },
  "corps": {
    "dispositif": "<p style=\"text-align: justify;\">La deuxi&#232;me phrase du premier alin&#233;a de l&#8217;article L.&#160;811&#8209;1 du code rural et de la p&#234;che maritime est compl&#233;t&#233;e par les mots&#160;: &#171;&#160;ainsi qu&#8217;au bien-&#234;tre animal&#160;&#187;.</p>",
    "exposeSommaire": "<p style=\"text-align: justify;\">Le bien-&#234;tre animal est aujourd&#8217;hui une pr&#233;occupation soci&#233;tale majeure. Son respect tant l&#8217;abattage que durant toute la vie de l&#8217;animal est une n&#233;cessit&#233; absolue aujourd&#8217;hui pour une grande partie des consommateurs.</p><p style=\"text-align: justify;\">Afin de r&#233;pondre &#224; cette nouvelle demande, l&#8217;enseignement et le formation professionnelle a un r&#244;le crucial &#224; jouer. Les agriculteurs doivent &#234;tre encore mieux form&#233;s aux pratiques respectant la sensibilit&#233; des animaux mais aussi &#224; la compr&#233;hension de la demande soci&#233;tale. Cela permettra d&#8217;&#233;viter une incompr&#233;hension entre la soci&#233;t&#233; et les &#233;leveurs, et de renouer un dialogue constructif.</p>"
  },
  "representations": [
    {
      "nom": "PDF",
      "typeMime": {
        "type": "application",
        "subType": "PDF"
      },
      "statutRepresentation": {
        "verbatim": true,
        "canonique": true,
        "officielle": true,
        "transcription": false,
        "enregistrement": false
      },
      "contenu": {
        "documentURI": "/15/amendements/0627/CION-DVP/CD403.pdf"
      }
    }
  ],
  "sort": {
    "dateSaisie": "2018-03-29T11:15:39.000+02:00",
    "sortEnSeance": "Non soutenu"
  },
  "dateDepot": "2018-03-23T01:00:00.000+01:00",
  "dateDistribution": "2018-03-26T02:00:00.000+02:00",
  "article99": "0",
  "loiReference": {
    "codeLoi": "rural et pêche maritime",
    "divisionCodeLoi": "811-1"
  }
}