{
  "uid": "AMANR5L15SEA717460B1255P1D1N2555",
  "identifiant": {
    "legislature": "15",
    "numero": "2555",
    "numRect": "0",
    "saisine": {
      "texteLegislatifRef": "PRJLANR5L15B1255",
      "numeroPartiePLF": "1",
      "organeExamen": "PO717460",
      "mentionSecondeDeliberation": "0"
    }
  },
  "numeroLong": "I-2555",
  "etapeTexte": "1ère lecture (1ère assemblée saisie)",
  "triAmendement": "efaaaaaaaaaaaaaaaaaaaaaaaaaaaaaaaaaaaaaaaaaaaaaaaaaaclzzzzzzzzzhzzzzzqyznvznvh",
  "cardinaliteAmdtMultiples": "1",
  "etat": "Discuté",
  "signataires": {
    "auteur": {
      "typeAuteur": "Depute",
      "acteurRef": "PA1838",
      "groupePolitiqueRef": "PO723569"
    },
    "cosignatairesRefs": [
      "PA1838"
    ],
    "texteAffichable": "M.&#160;Lassalle"
  },
  "pointeurFragmentTexte": {
    "division": {
      "titre": "Article 18",
      "articleDesignationCourte": "APRÈS ART. 18",
      "type": "ARTICLE",
      "avantAApres": "Apres",
      "divisionRattachee": "APRÈS L'ARTICLE 18, insérer l'article suivant:",
      "articleAdditionnel": "1",
      "urlDivisionTexteVise": "/15/textes/1255A.asp#D_Article_18"
    }
  },
  "corps": {
    "dispositif": "<p style=\"text-align: justify;\">I.&#160;&#8211;&#160;Le premier alin&#233;a de l&#8217;article&#160;238&#160;<i>bis</i>&#160;du code g&#233;n&#233;ral des imp&#244;ts est ainsi r&#233;dig&#233;&#160;:</p><p style=\"text-align: justify;\">&#171;&#160;1. Les versements effectu&#233;s par les entreprises assujetties &#224; l&#8217;imp&#244;t sur le revenu ou &#224; l&#8217;imp&#244;t sur les soci&#233;t&#233;s, pris dans la limite de 0,5&#160;% du chiffre d&#8217;affaires ou, lorsque ce montant est plus &#233;lev&#233;, 10 000&#160;euros et sans pouvoir d&#233;passer 10 millions d&#8217;euros, ouvrent droit &#224; une r&#233;duction d&#8217;imp&#244;t de 60&#160;% de leur montant lorsqu&#8217;ils sont op&#233;r&#233;s au profit&#160;:&#160;&#187;</p><p style=\"text-align: justify;\">II.&#160;&#8211;&#160;La perte de recettes pour l&#8217;&#201;tat est compens&#233;e &#224; due concurrence par la cr&#233;ation d&#8217;une taxe additionnelle aux droits mentionn&#233;s aux articles 575 et 575 A du code g&#233;n&#233;ral des imp&#244;ts.</p>",
    "exposeSommaire": "<p style=\"text-align: justify;\">Cet amendement vise &#224; am&#233;liorer le dispositif de la r&#233;duction d&#8217;imp&#244;t au titre du m&#233;c&#233;nat pr&#233;vu par l&#8217;article&#160;238 bis du code g&#233;n&#233;ral des imp&#244;ts.</p><p style=\"text-align: justify;\">Actuellement, les versements op&#233;r&#233;s par des entreprises &#224; des structures d&#8217;int&#233;r&#234;t g&#233;n&#233;ral ou d&#8217;utilit&#233; publique ouvrent droit &#224; une r&#233;duction d&#8217;imp&#244;t de 60&#160;% dans la limite de 5 pour mille du chiffre d&#8217;affaires.</p><p style=\"text-align: justify;\">Cette limite emporte deux effets&#160;:</p><p style=\"text-align: justify;\">- pour les petites entreprises dont le chiffre d&#8217;affaires est mod&#233;r&#233;, elle restreint leur capacit&#233; &#224; op&#233;rer des versements au titre du m&#233;c&#233;nat&#160;;</p><p style=\"text-align: justify;\">- pour les grandes entreprises dont le chiffre d&#8217;affaires est au contraire tr&#232;s &#233;lev&#233;, elle permet de b&#233;n&#233;ficier du dispositif de mani&#232;re excessive.</p><p style=\"text-align: justify;\">Cet amendement vise donc &#224; instaurer un montant plancher de 10 000&#160;euros de versements alternatif &#224; celui de 0,5&#160;% lorsque ce montant est plus &#233;lev&#233;.</p>"
  },
  "representations": [
    {
      "nom": "PDF",
      "typeMime": {
        "type": "application",
        "subType": "PDF"
      },
      "statutRepresentation": {
        "verbatim": true,
        "canonique": true,
        "officielle": true,
        "transcription": false,
        "enregistrement": false
      },
      "contenu": {
        "documentURI": "/15/amendements/1255A/AN/2555.pdf"
      }
    }
  ],
  "seanceDiscussion": "RUANR5L15S2019IDS21283",
  "sort": {
    "dateSaisie": "2018-10-20T00:53:45.000+02:00",
    "sortEnSeance": "Non soutenu"
  },
  "dateDepot": "2018-10-15T02:00:00.000+02:00",
  "dateDistribution": "2018-10-16T02:00:00.000+02:00",
  "article99": "0",
  "loiReference": {
    "codeLoi": "CGI",
    "divisionCodeLoi": "238 bis"
  }
}