{
  "uid": "AMANR5L15PO59048B2272P1D1N584",
  "identifiant": {
    "legislature": "15",
    "numero": "584",
    "numRect": "0",
    "saisine": {
      "texteLegislatifRef": "PRJLANR5L15B2272",
      "numeroPartiePLF": "1",
      "organeExamen": "PO59048",
      "mentionSecondeDeliberation": "0"
    }
  },
  "numeroLong": "I-CF584",
  "etapeTexte": "1ère lecture (1ère assemblée saisie)",
  "triAmendement": "baaaaaaaaaaaaaaaaaaaaaaaaaaaaaaaaaaaaaaaaaaaaaaaaano",
  "cardinaliteAmdtMultiples": "1",
  "etat": "Retiré",
  "signataires": {
    "auteur": {
      "typeAuteur": "Depute",
      "acteurRef": "PA720278",
      "groupePolitiqueRef": "PO759900"
    },
    "cosignatairesRefs": [
      "PA333421",
      "PA720278",
      "PA335999"
    ],
    "texteAffichable": "M.&#160;Orphelin,  M.&#160;Pancher et Mme&#160;Batho"
  },
  "pointeurFragmentTexte": {
    "division": {
      "titre": "Article 4",
      "articleDesignationCourte": "ART. 4",
      "type": "ARTICLE",
      "avantAApres": "A",
      "divisionRattachee": "ARTICLE 4",
      "urlDivisionTexteVise": "/15/textes/2272A.asp#D_Article_4"
    },
    "alinea": {
      "avantAApres": "Apres",
      "numero": "54"
    }
  },
  "corps": {
    "dispositif": "<p style=\"text-align: justify;\">I. Apr&#232;s l&#8217;alin&#233;a 54, ins&#233;rer l&#8217;alin&#233;a suivant :<br />&#171; 5 quater.&#160; Pour les m&#233;nages dont les revenus, appr&#233;ci&#233;s dans les conditions des IV des articles 1391 B ter et 1417, sont sup&#233;rieurs ou &#233;gaux &#224; 27 706 &#8364; pour la premi&#232;re part de quotient familial, major&#233;e de 8 209 &#8364; pour chacune des deux demi-parts suivantes et de 6 157 &#8364; pour chaque demi-part suppl&#233;mentaire &#224; compter de la troisi&#232;me, les travaux mentionn&#233;s au 1, pay&#233;s &#224; partir du 1er janvier 2020, ouvrent droit &#224; un cr&#233;dit d&#8217;imp&#244;t lorsque leur mise en oeuvre permet d&#8217;obtenir une consommation &#233;nerg&#233;tique apr&#232;s travaux n&#8217;exc&#233;dant pas le seuil de 90 kilowattheures par m&#232;tre carr&#233; et par an d&#8217;&#233;nergie primaire selon la m&#233;thode du diagnostic de performance &#233;nerg&#233;tique des b&#226;timents &#224; usage d&#8217;habitation. &#187;</p><p>II. Le I n&#8217;est applicable qu&#8217;aux sommes venant en d&#233;duction de l&#8217;imp&#244;t d&#251;.</p><p>III. La perte de recettes pour l&#8217;&#201;tat cons&#233;quente du I. et du II. est compens&#233;e &#224; due concurrence par la cr&#233;ation d&#8217;une taxe additionnelle aux droits mentionn&#233;s aux articles 575 et 575 A du code g&#233;n&#233;ral des imp&#244;ts.</p>",
    "exposeSommaire": "<p>Cet amendement vise &#224; attirer l&#8217;attention sur les risques de l&#8217;exclusion<span class=\"del cts-1\"  data-cid=\"2\"   data-time=\"1570189702813\"> des m&#233;nages</span> des m&#233;nages les plus ais&#233;s du nouveau dispositif d&#8217;aide &#224; la r&#233;novation &#233;nerg&#233;tique. En effet, les d&#233;ciles 9 et 10 repr&#233;sentent aujourd&#8217;hui pr&#232;s de 50 % des projets aid&#233;s par le CITE. Exclure compl&#232;tement les m&#233;nages ais&#233;s de la future prime risque de ralentir tr&#232;s fortement la r&#233;novation &#233;nerg&#233;tique des logements. En recentrage vers les travaux les plus efficaces serait plus pertinent. Fixer un maximum de consommation &#233;nerg&#233;tique apr&#232;s les travaux est une solution pour s&#8217;assurer de l&#8217;efficacit&#233; de la r&#233;novation. Le seuil de 90 kilowattheures par m&#232;tre carr&#233; et par an d&#8217;&#233;nergie primaire correspond &#224; l&#8217;atteinte d&#8217;une classe A ou B selon la m&#233;thode du diagnostic de performance &#233;nerg&#233;tique des b&#226;timents &#224; usage d&#8217;habitation.</p>"
  },
  "representations": [
    {
      "nom": "PDF",
      "typeMime": {
        "type": "application",
        "subType": "PDF"
      },
      "statutRepresentation": {
        "verbatim": true,
        "canonique": true,
        "officielle": true,
        "transcription": false,
        "enregistrement": false
      },
      "contenu": {
        "documentURI": "/15/amendements/2272A/CION_FIN/CF584.pdf"
      }
    }
  ],
  "dateDepot": "2019-10-04T02:00:00.000+02:00",
  "dateDistribution": "2019-10-04T02:00:00.000+02:00",
  "article99": "0",
  "loiReference": {}
}