{
  "uid": "AMANR5L15SEA717460BTC0971P0D1N656",
  "identifiant": {
    "legislature": "15",
    "numero": "656",
    "numRect": "0",
    "saisine": {
      "texteLegislatifRef": "PRJLANR5L15BTC0971",
      "numeroPartiePLF": "0",
      "organeExamen": "PO717460",
      "mentionSecondeDeliberation": "0"
    }
  },
  "numeroLong": "656",
  "etapeTexte": "1ère lecture (1ère assemblée saisie)",
  "triAmendement": "apw",
  "cardinaliteAmdtMultiples": "1",
  "etat": "Discuté",
  "signataires": {
    "auteur": {
      "typeAuteur": "Depute",
      "acteurRef": "PA721678",
      "groupePolitiqueRef": "PO730934"
    },
    "cosignatairesRefs": [
      "PA1012",
      "PA608016",
      "PA346054",
      "PA330684",
      "PA721678",
      "PA721968",
      "PA718784",
      "PA346218",
      "PA267794",
      "PA643103",
      "PA721286",
      "PA605036",
      "PA720210"
    ],
    "texteAffichable": "M.&#160;Reda,  Mme&#160;Val&#233;rie&#160;Boyer, M.&#160;Abad, M.&#160;Masson, M.&#160;Emmanuel&#160;Maquet, Mme&#160;Louwagie, Mme&#160;Beauvais, M.&#160;Pauget, M.&#160;de la Verpilli&#232;re, Mme&#160;Tabarot, M.&#160;Ramadier, M.&#160;Ferrara et M.&#160;Vialay"
  },
  "pointeurFragmentTexte": {
    "division": {
      "titre": "Article 37",
      "articleDesignationCourte": "APRÈS ART. 37",
      "type": "ARTICLE",
      "avantAApres": "Apres",
      "divisionRattachee": "APRÈS L'ARTICLE 37, insérer l'article suivant:",
      "articleAdditionnel": "1",
      "urlDivisionTexteVise": "/15/textes/0971.asp#D_Article_37"
    }
  },
  "corps": {
    "dispositif": "<p style=\"text-align: justify;\">Au vingti&#232;me alin&#233;a de l&#8217;article L.&#160;441&#8209;1 du code de la construction et de l&#8217;habitation, le taux&#160;: &#171;&#160;25&#160;%&#160;&#187; est remplac&#233; par le taux&#160;: &#171;&#160;15&#160;%&#160;&#187;.</p>",
    "exposeSommaire": "<p style=\"text-align: justify;\">Cet amendement propose d&#8217;abaisser &#224; 15&#160;%, au lieu de 25&#160;% actuellement, les attributions r&#233;alis&#233;es hors des quartiers prioritaires de la politique de la ville (QPV) aux publics prioritaires au sens de l&#8217;article&#160;441&#8209;1 du Code de la Construction et de l&#8217;Habitation.&#160;</p>"
  },
  "representations": [
    {
      "nom": "PDF",
      "typeMime": {
        "type": "application",
        "subType": "PDF"
      },
      "statutRepresentation": {
        "verbatim": true,
        "canonique": true,
        "officielle": true,
        "transcription": false,
        "enregistrement": false
      },
      "contenu": {
        "documentURI": "/15/amendements/0971/AN/656.pdf"
      }
    }
  ],
  "seanceDiscussion": "RUANR5L15S2018IDS21085",
  "sort": {
    "dateSaisie": "2018-06-04T23:32:09.000+02:00",
    "sortEnSeance": "Rejeté"
  },
  "dateDepot": "2018-05-24T02:00:00.000+02:00",
  "dateDistribution": "2018-05-31T02:00:00.000+02:00",
  "article99": "0",
  "loiReference": {
    "codeLoi": "c construction et habitation",
    "divisionCodeLoi": "L441-1"
  }
}