{
  "uid": "AMANR5L15PO757134B1088P0D1N551",
  "identifiant": {
    "legislature": "15",
    "numero": "551",
    "numRect": "0",
    "saisine": {
      "texteLegislatifRef": "PRJLANR5L15B1088",
      "numeroPartiePLF": "0",
      "organeExamen": "PO757134",
      "mentionSecondeDeliberation": "0"
    }
  },
  "numeroLong": "551",
  "etapeTexte": "1ère lecture (1ère assemblée saisie)",
  "triAmendement": "aeaaaaaaaaaaaaaaaaaaaaaaaaaaaaaaaaaaaaaaaaaaaaaaaabekkkkkknzzu",
  "cardinaliteAmdtMultiples": "1",
  "etat": "Discuté",
  "signataires": {
    "auteur": {
      "typeAuteur": "Depute",
      "acteurRef": "PA718784",
      "groupePolitiqueRef": "PO730934"
    },
    "cosignatairesRefs": [
      "PA718784"
    ],
    "texteAffichable": "M.&#160;Pauget"
  },
  "pointeurFragmentTexte": {
    "division": {
      "titre": "Article 4",
      "articleDesignationCourte": "ART. 4",
      "type": "ARTICLE",
      "avantAApres": "A",
      "divisionRattachee": "ARTICLE 4",
      "urlDivisionTexteVise": "/15/textes/1088.asp#D_Article_4"
    }
  },
  "corps": {
    "dispositif": "<p style=\"text-align: justify;\">Supprimer cet article.</p>",
    "exposeSommaire": "<p>L&#8217;alin&#233;a 1 de l&#8217;article 4 du projet de loi supprime l&#8217;obligation pour un futur chef d&#8217;entreprise artisanale de suivre l&#8217;obligation de suivre le stage de pr&#233;paration &#224; l&#8217;installation ( SPI ) d&#8217;une dur&#233;e de trente heures avant de s&#8217;immatriculer au r&#233;pertoire des m&#233;tiers qui est un outil reconnu dont il dispose.</p><p>Or, il est essentiel que les projets port&#233;s par les cr&#233;ateurs d&#8217;entreprise artisanale de se former en amont ce cette cr&#233;ation afin d&#8217;acqu&#233;rir les comp&#233;tences n&#233;cessaires pour d&#233;marrer leur activit&#233; et de p&#233;renniser les projets entrepreneuriaux.</p><p>L&#8217;article 2 de la loi 82-1091 du 23 d&#233;cembre 1982 relative &#224; la formation professionnelle des artisans encadre cette obligation.</p><p>Le pr&#233;sent amendement a pour objet la suppression l&#8217;article 4 du projet de loi.</p><p>Un d&#233;cret pris en Conseil d&#8217;Etat sera &#224; m&#234;me de fixer les conditions d&#8217;application de l&#8217;article 2 de la loi 82-1091 du 23 d&#233;cembre 1982 et de porter modification du d&#233;cret n&#176; 83-517&#160; du 24 juin 1983,&#160; l&#8217;adaptant aux n&#233;cessit&#233;s entrepreneuriales actuelles.</p><p>&#160;</p><p>&#160;</p>"
  },
  "representations": [
    {
      "nom": "PDF",
      "typeMime": {
        "type": "application",
        "subType": "PDF"
      },
      "statutRepresentation": {
        "verbatim": true,
        "canonique": true,
        "officielle": true,
        "transcription": false,
        "enregistrement": false
      },
      "contenu": {
        "documentURI": "/15/amendements/1088/CSPACTE/551.pdf"
      }
    }
  ],
  "sort": {
    "dateSaisie": "2018-09-06T18:27:35.000+02:00",
    "sortEnSeance": "Non soutenu"
  },
  "dateDepot": "2018-08-29T02:00:00.000+02:00",
  "dateDistribution": "2018-09-05T02:00:00.000+02:00",
  "article99": "0",
  "loiReference": {}
}