{
  "uid": "AMANR5L15PO59051B1349P0D1N409",
  "identifiant": {
    "legislature": "15",
    "numero": "409",
    "numRect": "0",
    "saisine": {
      "texteLegislatifRef": "PRJLANR5L15B1349",
      "numeroPartiePLF": "0",
      "organeExamen": "PO59051",
      "mentionSecondeDeliberation": "0"
    }
  },
  "numeroLong": "CL409",
  "etapeTexte": "1ère lecture (2ème assemblée saisie)",
  "triAmendement": "gaaaaaaaaaaaaaaaaaaaaaaaaaaaaaaaaaaaaaaaaaaaaaaaaao",
  "cardinaliteAmdtMultiples": "1",
  "etat": "Discuté",
  "signataires": {
    "auteur": {
      "typeAuteur": "Depute",
      "acteurRef": "PA608695",
      "groupePolitiqueRef": "PO758835"
    },
    "cosignatairesRefs": [
      "PA1592",
      "PA340343",
      "PA608695",
      "PA335054"
    ],
    "texteAffichable": "Mme&#160;Untermaier,  Mme&#160;Karamanli, M.&#160;David&#160;Habib, M.&#160;Saulignac et les membres du groupe Socialistes et apparent&#233;s"
  },
  "pointeurFragmentTexte": {
    "division": {
      "titre": "Article 42",
      "articleDesignationCourte": "ART. 42",
      "type": "ARTICLE",
      "avantAApres": "A",
      "divisionRattachee": "ARTICLE 42",
      "urlDivisionTexteVise": "/15/textes/1349.asp#D_Article_42"
    },
    "alinea": {
      "avantAApres": "A",
      "numero": "36",
      "alineaDesignation": "Alinéa 36"
    }
  },
  "corps": {
    "dispositif": "<p style=\"text-align: justify;\">Compl&#233;ter l&#8217;alin&#233;a&#160;36 par la phrase suivante&#160;:</p><p style=\"text-align: justify;\">&#171;&#160;L&#8217;ensemble des acteurs judiciaires est associ&#233; &#224; cette &#233;valuation.&#160;&#187;</p>",
    "exposeSommaire": "<p>La mise en place exp&#233;rimentale du tribunal criminel d&#233;partemental n&#8217;a pas fait l&#8217;objet d&#8217;une v&#233;ritable concertation avec les diff&#233;rents acteurs. Il convient donc que l&#8217;ensemble des acteurs judiciaires puissent &#234;tre associ&#233;s &#224; l&#8217;&#233;valuation de cette exp&#233;rimentation.</p>"
  },
  "representations": [
    {
      "nom": "PDF",
      "typeMime": {
        "type": "application",
        "subType": "PDF"
      },
      "statutRepresentation": {
        "verbatim": true,
        "canonique": true,
        "officielle": true,
        "transcription": false,
        "enregistrement": false
      },
      "contenu": {
        "documentURI": "/15/amendements/1349/CION_LOIS/CL409.pdf"
      }
    }
  ],
  "sort": {
    "dateSaisie": "2018-11-09T10:52:47.000+01:00",
    "sortEnSeance": "Adopté"
  },
  "dateDepot": "2018-10-31T01:00:00.000+01:00",
  "dateDistribution": "2018-11-07T01:00:00.000+01:00",
  "article99": "0",
  "loiReference": {
    "codeLoi": "2"
  }
}