{
  "uid": "AMANR5L15SEA717460BTC1924P0D1N1047",
  "identifiant": {
    "legislature": "15",
    "numero": "1047",
    "numRect": "0",
    "saisine": {
      "texteLegislatifRef": "PRJLANR5L15BTC1924",
      "numeroPartiePLF": "0",
      "organeExamen": "PO717460",
      "mentionSecondeDeliberation": "0"
    }
  },
  "numeroLong": "1047",
  "etapeTexte": "1ère lecture (1ère assemblée saisie)",
  "triAmendement": "eeaaaaaaaaaaaaaaaaaaaaaaaaaaaaaaaaaaaaaaaaaaaaaaaaabddzzo",
  "cardinaliteAmdtMultiples": "1",
  "etat": "Discuté",
  "signataires": {
    "auteur": {
      "typeAuteur": "Depute",
      "acteurRef": "PA607619",
      "groupePolitiqueRef": "PO759900"
    },
    "cosignatairesRefs": [
      "PA719146",
      "PA267042",
      "PA405480",
      "PA605694",
      "PA331582",
      "PA336439",
      "PA719138",
      "PA719286",
      "PA605518",
      "PA608292",
      "PA720996",
      "PA336175",
      "PA607619",
      "PA755549",
      "PA333421"
    ],
    "texteAffichable": "M.&#160;Molac,  M.&#160;Acquaviva, M.&#160;Brial, M.&#160;Castellani, M.&#160;Cl&#233;ment, M.&#160;Colombani, Mme&#160;Dubi&#233;, M.&#160;El Guerrab, M.&#160;Falorni, M.&#160;Favennec Becot, M.&#160;Fran&#231;ois-Michel&#160;Lambert, M.&#160;Pancher, Mme&#160;Pinel, M.&#160;Pupponi et M.&#160;Philippe&#160;Vigier"
  },
  "pointeurFragmentTexte": {
    "division": {
      "titre": "Article 16 bis",
      "articleDesignationCourte": "ART. 16 BIS",
      "type": "ARTICLE",
      "avantAApres": "A",
      "divisionRattachee": "ARTICLE 16 BIS",
      "urlDivisionTexteVise": "/15/textes/1924.asp#D_Article_16_bis"
    },
    "alinea": {
      "avantAApres": "A",
      "numero": "2",
      "alineaDesignation": "Alinéa 2"
    }
  },
  "corps": {
    "dispositif": "<p style=\"text-align: justify;\">I. &#8211; Supprimer l&#8217;alin&#233;a&#160;2.</p><p style=\"text-align: justify;\">II. &#8211; En cons&#233;quence, substituer aux alin&#233;as 3 &#224; 10 les dix alin&#233;as suivants&#160;:</p><p style=\"text-align: justify;\">&#171;&#160;2&#176; Le II de l&#8217;article&#160;19 est ainsi r&#233;dig&#233;&#160;:</p><p style=\"text-align: justify;\">&#171;&#160;II.&#160;&#8211;&#160;Le pr&#233;sident de la Haute Autorit&#233; est nomm&#233; par d&#233;cret du pr&#233;sident de la R&#233;publique.</p><p style=\"text-align: justify;\">&#171;&#160;Outre son pr&#233;sident, la Haute Autorit&#233; comprend&#160;:</p><p style=\"text-align: justify;\">&#171;&#160;1&#176; Deux conseillers d&#8217;&#201;tat, dont au moins un en activit&#233;, &#233;lus par l&#8217;assembl&#233;e g&#233;n&#233;rale du Conseil d&#8217;&#201;tat&#160;;</p><p style=\"text-align: justify;\">&#171;&#160;2&#176; Deux conseillers &#224; la Cour de cassation, dont au moins un en activit&#233;, &#233;lus par l&#8217;ensemble des magistrats du si&#232;ge hors hi&#233;rarchie de la cour&#160;;</p><p style=\"text-align: justify;\">&#171;&#160;3&#176; Deux conseillers-ma&#238;tres &#224; la Cour des comptes, dont au moins un en activit&#233;, &#233;lus par la chambre du conseil&#160;;</p><p style=\"text-align: justify;\">&#171;&#160;4&#176; Trois personnalit&#233;s qualifi&#233;es pour leur exp&#233;rience du monde universitaire, ayant exerc&#233; au sein d&#8217;une entreprise priv&#233;e ou reconnue pour leur implication dans des associations de lutte contre la corruption, n&#8217;ayant pas exerc&#233; de fonctions de membre du Gouvernement, de mandat parlementaire ou de fonctions &#233;num&#233;r&#233;es au I de l&#8217;article&#160;11 depuis au moins trois ans, nomm&#233;es par le Pr&#233;sident de l&#8217;Assembl&#233;e nationale, apr&#232;s avis conformes de la commission permanente de l&#8217;Assembl&#233;e nationale charg&#233;e des lois constitutionnelles, rendus &#224; la majorit&#233; des trois cinqui&#232;mes des suffrages exprim&#233;s&#160;;</p><p style=\"text-align: justify;\">&#171;&#160;5&#176; Trois personnalit&#233;s qualifi&#233;es pour leur exp&#233;rience de l&#8217;administration centrale de l&#8217;&#201;tat, des collectivit&#233;s territoriales, de la sant&#233; publique ou de la recherche, n&#8217;ayant pas exerc&#233; de fonctions de membre du Gouvernement, de mandat parlementaire ou de fonctions &#233;num&#233;r&#233;es au I de l&#8217;article&#160;11 depuis au moins trois ans, nomm&#233;es par le Pr&#233;sident du S&#233;nat, apr&#232;s avis conformes de la commission permanente du S&#233;nat charg&#233;e des lois constitutionnelles, rendus &#224; la majorit&#233; des trois cinqui&#232;mes des suffrages exprim&#233;s.</p><p style=\"text-align: justify;\">&#171;&#160;L&#8217;&#233;cart entre le nombre de femmes et d&#8217;hommes parmi l&#8217;ensemble des membres ne peut &#234;tre sup&#233;rieur &#224; un.</p><p style=\"text-align: justify;\">&#171;&#160;Lorsque la Haute Autorit&#233; &#233;met un avis en application des 3&#176; &#224; 5&#176; du II de l&#8217;article&#160;25 <i>octies</i> de la loi n&#176; 83&#8209;634 du 13&#160;juillet 1983 portant droit et obligations des fonctionnaires, le r&#233;f&#233;rent d&#233;ontologue de l&#8217;administration dont rel&#232;ve l&#8217;int&#233;ress&#233; peut assister aux s&#233;ances de la Haute Autorit&#233;, sans voix d&#233;lib&#233;rative.&#160;&#187;</p>",
    "exposeSommaire": "<p style=\"text-align: justify;\">Cet amendement diff&#232;re du pr&#233;c&#233;dent amendement sur&#160;la composition de la Haute Autorit&#233; pour la transparence de la vie publique (HATVP) en ce qu&#8217;il propose de pr&#233;ciser que la sixi&#232;me personnalit&#233; qualifi&#233;e nomm&#233;e &#224; la future autorit&#233; par le Parlement soit reconnue pour son exp&#233;rience au sein d&#8217;une association de lutte contre la corruption. Cette pr&#233;cision permet ainsi de faire davantage entrer la soci&#233;t&#233; civile dans la HATVP et fait ainsi correspondre les six personnalit&#233;s qualifi&#233;es &#224; six secteurs bien d&#233;finis.</p><p style=\"text-align: justify;\">Par ailleurs, il vient pr&#233;ciser la r&#233;partition des nominations par les pr&#233;sidents des deux chambres parlementaires,&#160;pour exlcure&#160;les possibilit&#233;s de doublons, c&#8217;est-&#224;-dire la nomination d&#8217;une personnalit&#233; d&#8217;un m&#234;me secteur par les deux pr&#233;sidents.</p><p style=\"text-align: justify;\">Ainsi, il reviendrait au Pr&#233;sident de l&#8217;Assembl&#233;e nationale de nommer les trois personnalit&#233;s qualifi&#233;es pour leur exp&#233;rience du monde universitaire, ayant exerc&#233; au sein d&#8217;une entreprise priv&#233;e ou reconnue pour son implication dans des associations de lutte contre la corruption.</p><p style=\"text-align: justify;\">Il reviendra au S&#233;nat de nommer quant &#224; lui les trois personnalit&#233;s qualifi&#233;es pour leur exp&#233;rience de l&#8217;administration centrale de l&#8217;&#201;tat, des collectivit&#233;s territoriales et de la sant&#233; publique ou de la recherche.</p>"
  },
  "representations": [
    {
      "nom": "PDF",
      "typeMime": {
        "type": "application",
        "subType": "PDF"
      },
      "statutRepresentation": {
        "verbatim": true,
        "canonique": true,
        "officielle": true,
        "transcription": false,
        "enregistrement": false
      },
      "contenu": {
        "documentURI": "/15/amendements/1924/AN/1047.pdf"
      }
    }
  ],
  "sort": {
    "dateSaisie": "2019-05-17T18:00:04.000+02:00",
    "sortEnSeance": "Non soutenu"
  },
  "dateDepot": "2019-05-09T02:00:00.000+02:00",
  "dateDistribution": "2019-05-15T02:00:00.000+02:00",
  "article99": "0",
  "loiReference": {}
}