{
  "uid": "AMANR5L15SEA717460BTC1955P0D1N303",
  "identifiant": {
    "legislature": "15",
    "numero": "303",
    "numRect": "0",
    "saisine": {
      "texteLegislatifRef": "PNREANR5L15BTC1955",
      "numeroPartiePLF": "0",
      "organeExamen": "PO717460",
      "mentionSecondeDeliberation": "0"
    }
  },
  "numeroLong": "303",
  "etapeTexte": "Lecture unique",
  "triAmendement": "alaaaaaaaaaaaaaaaaaaaaaaaaaaaaaaaaaaaaaaaaaaaaaaaag",
  "cardinaliteAmdtMultiples": "1",
  "etat": "Discuté",
  "signataires": {
    "auteur": {
      "typeAuteur": "Depute",
      "acteurRef": "PA608416",
      "groupePolitiqueRef": "PO730934"
    },
    "cosignatairesRefs": [
      "PA1874",
      "PA266776",
      "PA608416"
    ],
    "texteAffichable": "M.&#160;Hetzel,  M.&#160;Reiss et M.&#160;Le Fur"
  },
  "pointeurFragmentTexte": {
    "division": {
      "titre": "Article 4",
      "articleDesignationCourte": "APRÈS ART. 4",
      "type": "ARTICLE",
      "avantAApres": "Apres",
      "divisionRattachee": "APRÈS L'ARTICLE 4, insérer l'article suivant:",
      "articleAdditionnel": "1",
      "urlDivisionTexteVise": "/15/textes/1955.asp#D_Article_4"
    }
  },
  "corps": {
    "dispositif": "<p>L&#8217;article&#160;36 du R&#232;glement est ainsi modifi&#233;&#160;:</p><p style=\"text-align: justify;\">1&#176;&#160;Le sixi&#232;me alin&#233;a est compl&#233;t&#233; par les mots&#160;: &#171;&#160;droit commercial&#160;;&#160;&#187;</p><p style=\"text-align: justify;\">2&#176;&#160;Au dix-huiti&#232;me alin&#233;a, le mot&#160;: &#171;&#160;,&#160;commercial&#160;&#187; est supprim&#233;.</p>",
    "exposeSommaire": "<p style=\"text-align: justify;\">L&#8217;alin&#233;a&#160;18 de l&#8217;article&#160;36 du R&#232;glement d&#233;finit le p&#233;rim&#232;tre des comp&#233;tences de la commission des Lois.</p><p style=\"text-align: justify;\">Il parait plus coh&#233;rent d&#8217;int&#233;grer le droit commercial dans le champ de la commission des Affaires &#233;conomiques qui couvre d&#233;j&#224; le commerce int&#233;rieur et ext&#233;rieur.</p>"
  },
  "representations": [
    {
      "nom": "PDF",
      "typeMime": {
        "type": "application",
        "subType": "PDF"
      },
      "statutRepresentation": {
        "verbatim": true,
        "canonique": true,
        "officielle": true,
        "transcription": false,
        "enregistrement": false
      },
      "contenu": {
        "documentURI": "/15/amendements/1955/AN/303.pdf"
      }
    }
  ],
  "seanceDiscussion": "RUANR5L15S2019IDS21667",
  "sort": {
    "dateSaisie": "2019-05-28T00:32:53.000+02:00",
    "sortEnSeance": "Non soutenu"
  },
  "dateDepot": "2019-05-23T02:00:00.000+02:00",
  "dateDistribution": "2019-05-27T02:00:00.000+02:00",
  "article99": "0",
  "loiReference": {
    "divisionCodeLoi": "36"
  }
}