{
  "uid": "AMANR5L15SEA717460BTC1974P0D1N3068",
  "identifiant": {
    "legislature": "15",
    "numero": "3068",
    "numRect": "0",
    "saisine": {
      "texteLegislatifRef": "PRJLANR5L15BTC1974",
      "numeroPartiePLF": "0",
      "organeExamen": "PO717460",
      "mentionSecondeDeliberation": "0"
    }
  },
  "numeroLong": "3068",
  "etapeTexte": "1ère lecture (2ème assemblée saisie)",
  "triAmendement": "hiaaaoaaaaaaaaaaaaaaaaaaaaaaaaaaaaaaaaaaaaaaaaaaaahzzzzzzzzzzzzc",
  "cardinaliteAmdtMultiples": "1",
  "etat": "Discuté",
  "signataires": {
    "auteur": {
      "typeAuteur": "Depute",
      "acteurRef": "PA718954",
      "groupePolitiqueRef": "PO730964"
    },
    "cosignatairesRefs": [
      "PA720622",
      "PA719186",
      "PA719550",
      "PA720154",
      "PA720538",
      "PA721792",
      "PA606639",
      "PA718954",
      "PA606202",
      "PA718728",
      "PA722194"
    ],
    "texteAffichable": "M.&#160;Ahamada,  Mme&#160;De Temmerman, Mme&#160;Tanguy, Mme&#160;Guerel, Mme&#160;Bureau-Bonnard, Mme&#160;Fran&#231;oise&#160;Dumas, Mme&#160;Khattabi, M.&#160;Vignal, Mme&#160;Vanceunebrock-Mialon, Mme&#160;Provendier et Mme&#160;Dubr&#233;-Chirat"
  },
  "pointeurFragmentTexte": {
    "division": {
      "titre": "RAPPORT ANNEXÉ",
      "articleDesignationCourte": "ART. 1ER A",
      "type": "ANNEXE",
      "avantAApres": "A",
      "divisionRattachee": "ARTICLE 1ER A",
      "urlDivisionTexteVise": "/15/textes/1974.asp#D_RAPPORT_ANNEXE"
    },
    "alinea": {
      "avantAApres": "A",
      "numero": "22",
      "alineaDesignation": "Alinéa 22"
    }
  },
  "corps": {
    "dispositif": "<p style=\"text-align: justify;\">I.&#160;&#8211;&#160;&#192; l&#8217;alin&#233;a&#160;22, apr&#232;s le mot&#160;:</p><p style=\"text-align: justify;\">&#171;&#160;moyennes&#160;&#187;,</p><p style=\"text-align: justify;\">ins&#233;rer les mots&#160;:</p><p style=\"text-align: justify;\">&#171;&#160;, des quartiers prioritaires de la politique de la ville&#160;&#187;&#160;;</p><p style=\"text-align: justify;\">II.&#160;&#8211;&#160;En cons&#233;quence, &#224; l&#8217;alin&#233;a&#160;50, apr&#232;s le mot&#160;:</p><p style=\"text-align: justify;\">&#171;&#160;moyennes&#160;&#187;,</p><p style=\"text-align: justify;\">ins&#233;rer les mots&#160;:</p><p style=\"text-align: justify;\">&#171;&#160;, des quartiers prioritaires de la politique de la ville&#160;&#187;&#160;;</p><p style=\"text-align: justify;\">III.&#160;&#8211;&#160;Apr&#232;s l&#8217;alin&#233;a&#160;54, ins&#233;rer l&#8217;alin&#233;a suivant&#160;:</p><p style=\"text-align: justify;\">&#171;&#160;Un effort particulier est &#233;galement effectu&#233; en faveur du d&#233;senclavement des quartiers prioritaires de la politique de la ville, notamment en am&#233;liorant la qualit&#233; de leur desserte par les r&#233;seaux routier et ferroviaire.&#160;&#187;</p>",
    "exposeSommaire": "<p style=\"text-align: justify;\">Amendement de coh&#233;rence.</p><p style=\"text-align: justify;\">En effet, le pr&#233;sent projet de loi, ainsi que son rapport annex&#233;, fixent un objectif de d&#233;senclavement des quartiers prioritaires de la politique de la ville (QPV). Ainsi l&#8217;article&#160;1<sup>er</sup>&#160;A vise &#224; r&#233;duire les in&#233;galit&#233;s territoriales, en renfor&#231;ant notamment l&#8217;accessibilit&#233; et la mobilit&#233; des QPV.</p><p style=\"text-align: justify;\">Cependant, parmi les programmes d&#8217;investissement prioritaires, la priorit&#233; n&#176; 3 pr&#233;voit d&#8217; &#171;&#160;acc&#233;l&#233;rer le d&#233;senclavement routier des villes moyennes et des territoires ruraux&#160;&#187;, sans mentionner les QPV.</p><p style=\"text-align: justify;\">Il convient donc de pr&#233;voir explicitement que les QPV font partie de cette priorit&#233; d&#233;di&#233;e &#224; l&#8217;acc&#233;l&#233;ration du d&#233;senclavement routier, au m&#234;me titre que les villes moyennes et les territoires ruraux.</p><p style=\"text-align: justify;\">En cons&#233;quence, le pr&#233;sent amendement pr&#233;voit qu&#8217;un effort particulier est effectu&#233; en direction des QPV, afin notamment de garantir une desserte routi&#232;re et ferroviaire de qualit&#233; de ces territoires.</p>"
  },
  "representations": [
    {
      "nom": "PDF",
      "typeMime": {
        "type": "application",
        "subType": "PDF"
      },
      "statutRepresentation": {
        "verbatim": true,
        "canonique": true,
        "officielle": true,
        "transcription": false,
        "enregistrement": false
      },
      "contenu": {
        "documentURI": "/15/amendements/1974/AN/3068.pdf"
      }
    }
  ],
  "seanceDiscussion": "RUANR5L15S2019IDS21699",
  "sort": {
    "dateSaisie": "2019-06-13T17:29:46.000+02:00",
    "sortEnSeance": "Non soutenu"
  },
  "dateDepot": "2019-05-29T02:00:00.000+02:00",
  "dateDistribution": "2019-06-05T02:00:00.000+02:00",
  "article99": "0",
  "loiReference": {}
}