{
  "uid": "AMANR5L15PO419865B1831P0D1N982",
  "identifiant": {
    "legislature": "15",
    "numero": "982",
    "numRect": "0",
    "saisine": {
      "texteLegislatifRef": "PRJLANR5L15B1831",
      "numeroPartiePLF": "0",
      "organeExamen": "PO419865",
      "mentionSecondeDeliberation": "0"
    }
  },
  "numeroLong": "CD982",
  "etapeTexte": "1ère lecture (2ème assemblée saisie)",
  "triAmendement": "axaaaaaaaaaaaaaaaaaaaaaaaaaaaaaaaaaaaaaaaaaaaaaaaais",
  "cardinaliteAmdtMultiples": "1",
  "etat": "Irrecevable",
  "signataires": {
    "auteur": {
      "typeAuteur": "Depute",
      "acteurRef": "PA333421",
      "groupePolitiqueRef": "PO759900"
    },
    "cosignatairesRefs": [
      "PA336175",
      "PA719138",
      "PA405480",
      "PA336439",
      "PA608292",
      "PA720996",
      "PA267042",
      "PA942",
      "PA605518",
      "PA333421",
      "PA331582",
      "PA755549",
      "PA607619",
      "PA719146",
      "PA605694",
      "PA719286"
    ],
    "texteAffichable": "M.&#160;Pancher,  M.&#160;Colombani, M.&#160;Falorni, M.&#160;Fran&#231;ois-Michel&#160;Lambert, M.&#160;Acquaviva, M.&#160;Brial, M.&#160;Castellani, M.&#160;Cl&#233;ment, M.&#160;Charles&#160;de Courson, Mme&#160;Dubi&#233;, M.&#160;El Guerrab, M.&#160;Favennec Becot, M.&#160;Molac, Mme&#160;Pinel, M.&#160;Pupponi et M.&#160;Philippe&#160;Vigier"
  },
  "pointeurFragmentTexte": {
    "division": {
      "titre": "Article 7",
      "articleDesignationCourte": "ART. 7",
      "type": "ARTICLE",
      "avantAApres": "A",
      "divisionRattachee": "ARTICLE 7",
      "urlDivisionTexteVise": "/15/textes/1831.asp#D_Article_7"
    },
    "alinea": {
      "numero": "7"
    }
  },
  "corps": {},
  "representations": [
    {
      "nom": "PDF",
      "typeMime": {
        "type": "application",
        "subType": "PDF"
      },
      "statutRepresentation": {
        "verbatim": true,
        "canonique": true,
        "officielle": true,
        "transcription": false,
        "enregistrement": false
      },
      "contenu": {
        "documentURI": "/15/amendements/1831/CION-DVP/CD982.pdf"
      }
    }
  ],
  "dateDepot": "2019-05-07T02:00:00.000+02:00",
  "dateDistribution": "2019-05-13T02:00:00.000+02:00",
  "article99": "0",
  "loiReference": {}
}