{
  "uid": "AMANR5L15PO59048B0235P1D1N194",
  "identifiant": {
    "legislature": "15",
    "numero": "194",
    "numRect": "0",
    "saisine": {
      "texteLegislatifRef": "PRJLANR5L15B0235",
      "numeroPartiePLF": "1",
      "organeExamen": "PO59048",
      "mentionSecondeDeliberation": "0"
    }
  },
  "numeroLong": "I-CF194",
  "etapeTexte": "1ère lecture (1ère assemblée saisie)",
  "triAmendement": "ds",
  "cardinaliteAmdtMultiples": "1",
  "etat": "Discuté",
  "signataires": {
    "auteur": {
      "typeAuteur": "Depute",
      "acteurRef": "PA332523",
      "groupePolitiqueRef": "PO730934"
    },
    "cosignatairesRefs": [
      "PA332523"
    ],
    "texteAffichable": "Mme&#160;Dalloz"
  },
  "pointeurFragmentTexte": {
    "division": {
      "titre": "Article liminaire",
      "articleDesignationCourte": "ART. LIMINAIRE",
      "type": "ARTICLE",
      "avantAApres": "A",
      "divisionRattachee": "ARTICLE LIMINAIRE",
      "urlDivisionTexteVise": "/15/textes/0235A.asp#D_Article_liminaire"
    },
    "alinea": {
      "numero": "2"
    }
  },
  "corps": {
    "dispositif": "<p style=\"text-align: justify;\">&#192; la deuxi&#232;me ligne de la derni&#232;re colonne du tableau de l&#8217;alin&#233;a&#160;2, substituer au nombre&#160;:</p><p style=\"text-align: justify;\">&#171;&#160;-2,1&#160;&#187; </p><p style=\"text-align: justify;\">le nombre&#160;:</p><p style=\"text-align: justify;\">&#171;&#160;-1,7&#160;&#187;.</p>",
    "exposeSommaire": "<p style=\"text-align: justify;\">Cet amendement tend &#224; r&#233;pondre aux pr&#233;conisations&#160;europ&#233;ennes de r&#233;duction du d&#233;ficit structurel de 0,5 point de PIB par an . Compte tenu du contexte &#233;conomique actuel, l&#8217;effort de r&#233;duction de 0,1 point propos&#233; est insuffisant.</p>"
  },
  "representations": [
    {
      "nom": "PDF",
      "typeMime": {
        "type": "application",
        "subType": "PDF"
      },
      "statutRepresentation": {
        "verbatim": true,
        "canonique": true,
        "officielle": true,
        "transcription": false,
        "enregistrement": false
      },
      "contenu": {
        "documentURI": "/15/amendements/0235A/CION_FIN/CF194.pdf"
      }
    }
  ],
  "sort": {
    "dateSaisie": "2017-10-10T21:56:56.000+02:00",
    "sortEnSeance": "Rejeté"
  },
  "dateDepot": "2017-10-06T02:00:00.000+02:00",
  "dateDistribution": "2017-10-10T02:00:00.000+02:00",
  "article99": "0",
  "loiReference": {}
}