{
  "uid": "AMANR5L15SEA717460B2272P1D1N1420",
  "identifiant": {
    "legislature": "15",
    "numero": "1420",
    "numRect": "0",
    "saisine": {
      "texteLegislatifRef": "PRJLANR5L15B2272",
      "numeroPartiePLF": "1",
      "organeExamen": "PO717460",
      "mentionSecondeDeliberation": "0"
    }
  },
  "numeroLong": "I-1420",
  "etapeTexte": "1ère lecture (1ère assemblée saisie)",
  "triAmendement": "baaaaaaaaaaaaaaaaaaaaaaaaaaaaaaaaaaaaaaaaaaaaaaaaaajeenzzw",
  "cardinaliteAmdtMultiples": "1",
  "etat": "Discuté",
  "signataires": {
    "auteur": {
      "typeAuteur": "Depute",
      "acteurRef": "PA342415",
      "groupePolitiqueRef": "PO758835"
    },
    "cosignatairesRefs": [
      "PA333818",
      "PA340343",
      "PA643145",
      "PA608741",
      "PA1008",
      "PA429893",
      "PA508",
      "PA610681",
      "PA335532",
      "PA719930",
      "PA1198",
      "PA609332",
      "PA337483",
      "PA1592",
      "PA608011",
      "PA720988",
      "PA608695",
      "PA335054",
      "PA605069",
      "PA332614",
      "PA608172",
      "PA642764",
      "PA342415",
      "PA609590",
      "PA1809",
      "PA340357",
      "PA267233",
      "PA607553",
      "PA333285"
    ],
    "texteAffichable": "Mme&#160;Battistel,  Mme&#160;Pires Beaune, M.&#160;Jean-Louis&#160;Bricout, M.&#160;David&#160;Habib, Mme&#160;Rabault, M.&#160;Aviragnet, Mme&#160;Bareigts, Mme&#160;Bi&#233;mouret, M.&#160;Bouillon, M.&#160;Carvounas, M.&#160;Alain&#160;David, Mme&#160;Laurence&#160;Dumont, M.&#160;Faure, M.&#160;Garot, M.&#160;Hutin, M.&#160;Juanico, Mme&#160;Karamanli, M.&#160;J&#233;r&#244;me&#160;Lambert, M.&#160;Letchimy, Mme&#160;Manin, Mme&#160;Pau-Langevin, M.&#160;Potier, M.&#160;Pueyo, M.&#160;Saulignac, Mme&#160;Tolmont, Mme&#160;Untermaier, Mme&#160;Vainqueur-Christophe, M.&#160;Vallaud, Mme&#160;Victory et les membres du groupe Socialistes et apparent&#233;s"
  },
  "pointeurFragmentTexte": {
    "division": {
      "titre": "Article 4",
      "articleDesignationCourte": "ART. 4",
      "type": "ARTICLE",
      "avantAApres": "A",
      "divisionRattachee": "ARTICLE 4",
      "urlDivisionTexteVise": "/15/textes/2272A.asp#D_Article_4"
    },
    "alinea": {
      "avantAApres": "Apres",
      "numero": "30"
    }
  },
  "corps": {
    "dispositif": "<p style=\"text-align: justify;\">I.&#160;&#8211;&#160;Apr&#232;s l&#8217;alin&#233;a&#160;30, ins&#233;rer l&#8217;alin&#233;a suivant&#160;:</p><p style=\"text-align: justify;\">&#171;&#160;<i>o)</i> Aux d&#233;penses, pay&#233;es entre le 1<sup>er</sup> janvier 2020 et le 31 d&#233;cembre 2020, permettant la r&#233;novation globale du logement, c&#8217;est-&#224;-dire permettant une r&#233;duction de la consommation &#233;nerg&#233;tique primaire d&#8217;au moins 40&#160;%. Pour une m&#234;me d&#233;pense, le contribuable qui b&#233;n&#233;ficie du cr&#233;dit d&#8217;imp&#244;t pour l&#8217;aide &#224; la r&#233;novation globale mentionn&#233;e &#224; l&#8217;alin&#233;a pr&#233;c&#233;dent ne peut pas b&#233;n&#233;ficier des autres aides pr&#233;vues au pr&#233;sent article.&#160;&#187;</p><p style=\"text-align: justify;\">II.&#160;&#8211;&#160;En cons&#233;quence, compl&#233;ter le tableau de l&#8217;alin&#233;a&#160;47 par la ligne suivante&#160;:</p><p style=\"text-align: justify;\">&#171;&#160;</p><table style=\"width: 598.033px; border-collapse: collapse;\"><tbody><tr><td style=\"width: 310px; border: 1pt solid windowtext; padding: 0cm 5.4pt;\"><p>R&#233;novation globale mentionn&#233;e au o du 1</p></td><td style=\"width: 255.033px; border-color: windowtext windowtext windowtext currentcolor; border-style: solid solid solid none; border-width:1pt 1pt 1pt 0pt; border-image: none 100% / 1 / 0 stretch; padding: 0cm 5.4pt;\"><p>100&#160;&#8364;/ m2</p></td></tr></tbody></table><p style=\"text-align: justify;\">&#160;&#187;</p><p style=\"text-align: justify;\">III.&#160;&#8211;En cons&#233;quence, proc&#233;der au m&#234;me compl&#233;ment au tableau de l&#8217;alin&#233;a&#160;51.</p><p style=\"text-align: justify;\">IV.&#160;&#8211;&#160;Compl&#233;ter cet article par les trois alin&#233;as suivants&#160;:</p><p style=\"text-align: justify;\">&#171;&#160;IV.&#160;&#8211;&#160;Les I et II sont restreints au cr&#233;dit d&#8217;imp&#244;t pr&#233;vu &#224; l&#8217;article&#160;200 <i>quater</i> du code g&#233;n&#233;ral des imp&#244;ts, sans incidence sur la d&#233;finition de la prime mentionn&#233;e au II de l&#8217;article&#160;4 de la loi n&#176;&#160;du&#160; de finances pour 2020.</p><p style=\"text-align: justify;\">&#171;&#160;V.&#160;&#8211;&#160;Les I et II ne sont applicables qu&#8217;aux sommes venant en d&#233;duction de l&#8217;imp&#244;t d&#251;.</p><p style=\"text-align: justify;\">&#171;&#160;VI.&#160;&#8211;&#160;La perte de recettes pour l&#8217;&#201;tat est compens&#233;e &#224; due concurrence par la cr&#233;ation d&#8217;une taxe additionnelle aux droits vis&#233;s aux articles 575 et 575 A du code g&#233;n&#233;ral des imp&#244;ts.&#160;&#187;</p>",
    "exposeSommaire": "<p>Cet amendement du groupe Socialistes et apparent&#233;s vise &#224; cr&#233;er une aide &#224; la r&#233;novation &#233;nerg&#233;tique globale de 100&#160;&#8364;/ m2, tel que le Gouvernement l&#8217;envisageait initialement. Ces r&#233;novations sont les plus efficaces du point de vue climatique.</p>"
  },
  "representations": [
    {
      "nom": "PDF",
      "typeMime": {
        "type": "application",
        "subType": "PDF"
      },
      "statutRepresentation": {
        "verbatim": true,
        "canonique": true,
        "officielle": true,
        "transcription": false,
        "enregistrement": false
      },
      "contenu": {
        "documentURI": "/15/amendements/2272A/AN/1420.pdf"
      }
    }
  ],
  "seanceDiscussion": "RUANR5L15S2020IDS21867",
  "sort": {
    "dateSaisie": "2019-10-17T19:13:53.000+02:00",
    "sortEnSeance": "Tombé"
  },
  "dateDepot": "2019-10-10T02:00:00.000+02:00",
  "dateDistribution": "2019-10-17T02:00:00.000+02:00",
  "article99": "0",
  "loiReference": {}
}