{
  "uid": "AMANR5L15PO420120B1297P0D1N164",
  "identifiant": {
    "legislature": "15",
    "numero": "164",
    "numRect": "0",
    "saisine": {
      "texteLegislatifRef": "PRJLANR5L15B1297",
      "numeroPartiePLF": "0",
      "organeExamen": "PO420120",
      "mentionSecondeDeliberation": "0"
    }
  },
  "numeroLong": "AS164",
  "etapeTexte": "1ère lecture (1ère assemblée saisie)",
  "triAmendement": "lcaaaaaaaaaaaaaaaaaaaaaaaaaaaaaaaaaaaaaaaaaaaaaaaag",
  "cardinaliteAmdtMultiples": "1",
  "etat": "Irrecevable",
  "signataires": {
    "auteur": {
      "typeAuteur": "Depute",
      "acteurRef": "PA721474",
      "groupePolitiqueRef": "PO730934"
    },
    "cosignatairesRefs": [
      "PA606712",
      "PA721286",
      "PA267378",
      "PA721474",
      "PA267318",
      "PA267289",
      "PA856"
    ],
    "texteAffichable": "M.&#160;Viry,  M.&#160;Cherpion, M.&#160;Door, Mme&#160;Levy, M.&#160;Lurton, M.&#160;Grelier et M.&#160;Ramadier"
  },
  "pointeurFragmentTexte": {
    "division": {
      "titre": "Article 48",
      "articleDesignationCourte": "APRÈS ART. 48",
      "type": "ARTICLE",
      "avantAApres": "Apres",
      "divisionRattachee": "APRÈS L'ARTICLE 48, insérer l'article suivant:",
      "articleAdditionnel": "1",
      "urlDivisionTexteVise": "/15/textes/1297.asp#D_Article_48"
    }
  },
  "corps": {
    "dispositif": "<p>A l&#8217;article L 323-6 du code de la s&#233;curit&#233; sociale :</p><p>* le 4&#176; est remplac&#233; par la phrase &#171; 4&#176;. De s&#8217;abstenir de toute activit&#233; professionnelle donnant lieu &#224; des revenus d&#8217;activit&#233; ou r&#233;mun&#233;ration &#187;</p><p>* le dernier alin&#233;a de l&#8217;article L323-6 est remplac&#233; par la phrase &#171; En cas de non-respect du 4&#176;, il peut &#234;tre prononc&#233; une sanction financi&#232;re pr&#233;vues &#224; l&#8217;article ( L.114-17-. &#187;</p><p>&#160;</p><p>Le 3&#176; de l&#8217;article L 324-1 du code de la s&#233;curit&#233; sociale est remplac&#233; par &#171; 3&#176; De s&#8217;abstenir de toute activit&#233; professionnelle donnant lieu &#224; des revenus d&#8217;activit&#233; ou r&#233;mun&#233;ration &#187;</p>",
    "exposeSommaire": "<p>La notion d&#8217;activit&#233; autoris&#233;e ou non autoris&#233;e lors des arr&#234;ts de travail n&#8217;est pas juridiquement d&#233;finie, il peut donc s&#8217;agir d&#8217;activit&#233;s de loisirs, sportives, politiques ou sociales voire familiales.</p><p>&#160;</p><p>Dans un arr&#234;t du 15 juin 2017, sur la base des dispositions pr&#233;vues &#224; l&#8217;article L323-6 du Code de la S&#233;curit&#233; sociale, la Cour de cassation a pr&#233;cis&#233; qu&#8217;un salari&#233; b&#233;n&#233;ficiant d&#8217;un arr&#234;t de travail pour une maladie ou un accident ne peut exercer aucune activit&#233; qui ne soit pas express&#233;ment autoris&#233;e par le m&#233;decin traitant. En l&#8217;esp&#232;ce, la Cour a valid&#233; l&#8217;obligation faite &#224; un salari&#233; de restituer les indemnit&#233;s journali&#232;res per&#231;ues pour un arr&#234;t de travail car celui-ci s&#8217;&#233;tait rendu &#224; quelques r&#233;unions de conseil municipal et d&#8217;associations pendant la p&#233;riode d&#8217;arr&#234;t, au sein des horaires de sorties autoris&#233;es.</p><p>&#160;</p><p>Or, dans les faits, de nombreux m&#233;decins encouragent, des personnes &#224; avoir des activit&#233;s pendant leur arr&#234;t de travail, notamment quand il s&#8217;agit d&#8217;arr&#234;ts li&#233;s &#224; une affection psychique ou mentale, ou &#224; une maladie chronique, pour lesquelles une activit&#233; en dehors de l&#8217;activit&#233; professionnelle peut s&#8217;av&#233;rer b&#233;n&#233;fique &#224; l&#8217;am&#233;lioration de l&#8217;&#233;tat de sant&#233; et susceptible d&#8217;acc&#233;l&#233;rer la reprise d&#8217;activit&#233; professionnelle.</p><p>&#160;</p><p>C&#8217;est pourquoi, cet amendement vise &#224; pr&#233;ciser la notion d&#8217;activit&#233; en cas d&#8217;indemnit&#233; journali&#232;re et faciliter le maintien d&#8217;activit&#233; en dehors de l&#8217;activit&#233; professionnelle, telle que par exemple la repr&#233;sentation des usagers du syst&#232;me de sant&#233;.</p>"
  },
  "representations": [
    {
      "nom": "PDF",
      "typeMime": {
        "type": "application",
        "subType": "PDF"
      },
      "statutRepresentation": {
        "verbatim": true,
        "canonique": true,
        "officielle": true,
        "transcription": false,
        "enregistrement": false
      },
      "contenu": {
        "documentURI": "/15/amendements/1297/CION-SOC/AS164.pdf"
      }
    }
  ],
  "dateDepot": "2018-10-12T02:00:00.000+02:00",
  "article99": "0",
  "loiReference": {
    "codeLoi": "sécurité sociale"
  }
}