{
  "uid": "AMANR5L15SEA717460BTC1548P0D1N503",
  "identifiant": {
    "legislature": "15",
    "numero": "503",
    "numRect": "0",
    "saisine": {
      "texteLegislatifRef": "PRJLANR5L15BTC1548",
      "numeroPartiePLF": "0",
      "organeExamen": "PO717460",
      "mentionSecondeDeliberation": "0"
    }
  },
  "numeroLong": "503",
  "etapeTexte": "Nouvelle Lecture",
  "triAmendement": "euaaaaaaaaaaaaaaaaaaaaaaaaaaaaaaaaaaaaaaaaaaaaaaaaak",
  "cardinaliteAmdtMultiples": "1",
  "etat": "Discuté",
  "signataires": {
    "auteur": {
      "typeAuteur": "Depute",
      "acteurRef": "PA721270",
      "groupePolitiqueRef": "PO730940"
    },
    "cosignatairesRefs": [
      "PA721270",
      "PA610667",
      "PA718926",
      "PA720692",
      "PA610654",
      "PA720546",
      "PA721012",
      "PA335612",
      "PA722202",
      "PA721896",
      "PA689",
      "PA718720",
      "PA722110",
      "PA267306",
      "PA721118",
      "PA441"
    ],
    "texteAffichable": "M.&#160;Peu,  M.&#160;Jumel, Mme&#160;Faucillon, Mme&#160;Bello, M.&#160;Brotherson, M.&#160;Bruneel, Mme&#160;Buffet, M.&#160;Chassaigne, M.&#160;Dharr&#233;ville, M.&#160;Dufr&#232;gne, Mme&#160;K&#233;clard-Mond&#233;sir, M.&#160;Lecoq, M.&#160;Nilor, M.&#160;Fabien&#160;Roussel, M.&#160;Serville et M.&#160;Wulfranc"
  },
  "pointeurFragmentTexte": {
    "division": {
      "titre": "Article 40",
      "articleDesignationCourte": "ART. 40",
      "type": "ARTICLE",
      "avantAApres": "A",
      "divisionRattachee": "ARTICLE 40",
      "urlDivisionTexteVise": "/15/textes/1548.asp#D_Article_40"
    }
  },
  "corps": {
    "dispositif": "<p style=\"text-align: justify;\">Supprimer cet article.</p>",
    "exposeSommaire": "<p style=\"text-align: justify;\">L&#8217;article&#160;40 du projet de loi &#233;tend la comp&#233;tence du juge unique en fixant &#224; 5 ans la peine maximale pouvant &#234;tre prononc&#233;e, en listant exhaustivement les d&#233;lits concern&#233;s et en &#233;tendant cette comp&#233;tence &#224; divers d&#233;lits. Cet article &#233;tend &#233;galement la proc&#233;dure de l&#8217;ordonnance p&#233;nale &#224; un grand nombre de d&#233;lits.</p><p style=\"text-align: justify;\">La coll&#233;gialit&#233; participe assur&#233;ment &#224; la qualit&#233; de la justice, elle contribue &#224; son principe d&#8217;impartialit&#233;. La d&#233;lib&#233;ration collective favorise la r&#233;flexion et constitue une protection contre les erreurs et les errements individuels. Ainsi que le souligne le Syndicat de la Magistrature, aucun professionnel ne peut soutenir qu&#8217;une personne est mieux jug&#233;e par un juge unique que par une formation coll&#233;giale, et aucun justiciable ne peut pr&#233;f&#233;rer &#234;tre jug&#233; par un magistrat seul plut&#244;t que par une coll&#233;gialit&#233;. Or, il est &#224; craindre que sa disparition amorc&#233;e par ce dispositif traduise une tendance plus globale, puisque chaque r&#233;forme semble apporter sa petite pierre &#224; l&#8217;&#233;difice au nom de la simplification des proc&#233;dures.</p><p style=\"text-align: justify;\">Les d&#233;put&#233;s communistes s&#8217;inqui&#232;tent de ce mouvement et de ses cons&#233;quences &#233;ventuelles &#224; long terme, puisque, comme le rappelait d&#233;j&#224; Montesquieu dans l&#8217;Esprit des lois&#160;: &#171;&#160;Le magistrat unique (&#8230;) ne peut avoir lieu que dans un Gouvernement despotique.&#160;&#187;</p>"
  },
  "representations": [
    {
      "nom": "PDF",
      "typeMime": {
        "type": "application",
        "subType": "PDF"
      },
      "statutRepresentation": {
        "verbatim": true,
        "canonique": true,
        "officielle": true,
        "transcription": false,
        "enregistrement": false
      },
      "contenu": {
        "documentURI": "/15/amendements/1548/AN/503.pdf"
      }
    }
  ],
  "seanceDiscussion": "RUANR5L15S2019IDS21452",
  "sort": {
    "dateSaisie": "2019-01-17T21:31:59.000+01:00",
    "sortEnSeance": "Rejeté"
  },
  "dateDepot": "2019-01-10T01:00:00.000+01:00",
  "dateDistribution": "2019-01-14T01:00:00.000+01:00",
  "article99": "0",
  "loiReference": {}
}