{
  "uid": "AMANR5L15PO419610B0627P0D1N582",
  "identifiant": {
    "legislature": "15",
    "numero": "582",
    "numRect": "0",
    "saisine": {
      "texteLegislatifRef": "PRJLANR5L15B0627",
      "numeroPartiePLF": "0",
      "organeExamen": "PO419610",
      "mentionSecondeDeliberation": "0"
    }
  },
  "numeroLong": "CE582",
  "etapeTexte": "1ère lecture (1ère assemblée saisie)",
  "triAmendement": "ibddi",
  "cardinaliteAmdtMultiples": "1",
  "etat": "Discuté",
  "signataires": {
    "auteur": {
      "typeAuteur": "Depute",
      "acteurRef": "PA334149",
      "groupePolitiqueRef": "PO730934"
    },
    "cosignatairesRefs": [
      "PA346218",
      "PA330684",
      "PA720644",
      "PA608416",
      "PA720684",
      "PA334149"
    ],
    "texteAffichable": "M.&#160;Fasquelle,  Mme&#160;Val&#233;rie&#160;Boyer, M.&#160;Pierre-Henri&#160;Dumont, M.&#160;Masson, M.&#160;Hetzel et M.&#160;Nury"
  },
  "pointeurFragmentTexte": {
    "division": {
      "titre": "Article 4",
      "articleDesignationCourte": "ART. 4",
      "type": "ARTICLE",
      "avantAApres": "A",
      "divisionRattachee": "ARTICLE 4",
      "urlDivisionTexteVise": "/15/textes/0627.asp#D_Article_4"
    },
    "alinea": {
      "avantAApres": "Apres",
      "numero": "6"
    }
  },
  "corps": {
    "dispositif": "<p>Apr&#232;s l&#8217;alin&#233;a&#160;6, ins&#233;rer les quatre alin&#233;as suivants&#160;:</p><p>&#171;&#160;5&#176; Avant le dernier alin&#233;a, sont ins&#233;r&#233;s trois alin&#233;as ainsi r&#233;dig&#233;s&#160;:</p><p>&#171;&#160;Il peut confier la r&#233;solution des litiges, dans des conditions d&#233;finies par d&#233;cret&#160;:&#160;</p><p>&#171;&#160;a)&#160;aux m&#233;diateurs pr&#233;sents dans les entreprises intervenant dans la cha&#238;ne d&#8217;approvisionnement alimentaire&#160;;</p><p>&#171;&#160;b)&#160;au m&#233;diateur de la coop&#233;ration agricole mentionn&#233; &#224; l&#8217;article L.&#160;528&#8209;1.&#160;&#187;</p>",
    "exposeSommaire": "<p style=\"text-align: justify;\">Il est propos&#233; de pr&#233;voir que le m&#233;diateur des relations commerciales agricoles puisse confier la r&#233;solution de litiges aux diff&#233;rents m&#233;diateurs intervenant dans les relations commerciales de produits agricoles et alimentaires, &#224; savoir les m&#233;diateurs d&#233;l&#233;gu&#233;s pr&#233;sents dans les entreprises (enseignes de la grande distribution, transformateurs priv&#233;s et coop&#233;ratifs), - le m&#233;diateur de la coop&#233;ration agricole. Un d&#233;cret pr&#233;cisera les modalit&#233;s selon lesquelles les diff&#233;rents m&#233;diateurs devront rendre syst&#233;matiquement compte de leur action aupr&#232;s du M&#233;diateur des Relations Commerciales Agricoles. En effet, &#224; ce jour il y a un manque de visibilit&#233; sur l&#8217;action de chacun concernant les relations commerciales de produits agricoles et alimentaires.</p>"
  },
  "representations": [
    {
      "nom": "PDF",
      "typeMime": {
        "type": "application",
        "subType": "PDF"
      },
      "statutRepresentation": {
        "verbatim": true,
        "canonique": true,
        "officielle": true,
        "transcription": false,
        "enregistrement": false
      },
      "contenu": {
        "documentURI": "/15/amendements/0627/CION-ECO/CE582.pdf"
      }
    }
  ],
  "sort": {
    "dateSaisie": "2018-04-18T10:30:24.000+02:00",
    "sortEnSeance": "Non soutenu"
  },
  "dateDepot": "2018-04-09T02:00:00.000+02:00",
  "dateDistribution": "2018-04-16T02:00:00.000+02:00",
  "article99": "0",
  "loiReference": {}
}