{
  "uid": "AMANR5L15SEA717460B2272P2D1N720",
  "identifiant": {
    "legislature": "15",
    "numero": "720",
    "numRect": "0",
    "saisine": {
      "texteLegislatifRef": "PRJLANR5L15B2272",
      "numeroPartiePLF": "2",
      "organeExamen": "PO717460",
      "mentionSecondeDeliberation": "0"
    }
  },
  "numeroLong": "II-720",
  "etapeTexte": "1ère lecture (1ère assemblée saisie)",
  "triAmendement": "abtiaaaaaaaaaaaaaaaaaaaaaaaaaaaaaaaaaaaaaaaaaaaaaaamx",
  "cardinaliteAmdtMultiples": "1",
  "etat": "Discuté",
  "signataires": {
    "auteur": {
      "typeAuteur": "Depute",
      "acteurRef": "PA720100",
      "groupePolitiqueRef": "PO730934"
    },
    "cosignatairesRefs": [
      "PA720100"
    ],
    "texteAffichable": "M.&#160;Pradi&#233;"
  },
  "pointeurFragmentTexte": {
    "missionVisee": {
      "idMissionAN": "813",
      "libelleMission": "Enseignement scolaire",
      "codeMissionPLF": "B",
      "libelleMissionPLF": "Répartition, par mission et programme, des crédits du budget général"
    },
    "division": {
      "titre": "ÉTAT B",
      "articleDesignationCourte": "ART. 38",
      "type": "ANNEXE",
      "avantAApres": "A",
      "divisionRattachee": "ARTICLE 38",
      "urlDivisionTexteVise": "/15/textes/2272C.asp#D_ETAT_B"
    }
  },
  "corps": {
    "exposeSommaire": "<p style=\"text-align: justify;\">Le Gouvernement proc&#232;de &#224; une hausse du nombre d&#8217;emplois d&#8217;AESH (+5% entre 2019 et 2020) mais les cr&#233;dits allou&#233;s &#224; leur formation ne sont toujours pas &#224; la hauteur compar&#233; au budget qui &#233;tait pr&#233;vu &#224; cet effet en 2018. Un choix illogique et irresponsable lorsqu&#8217;on sait que le nombre de personnels charg&#233;s d&#8217;accompagner les &#233;l&#232;ves en situation de handicap n&#8217;a fait qu&#8217;augmenter ces derni&#232;res ann&#233;es (+12% entre 2018 et 2020).&#160;</p><p>D&#232;s lors, il convient a minima de r&#233;tablir le montant allou&#233; &#224; la formation des AESH charg&#233;s de l'aide humaine aux &#233;l&#232;ves en situation de handicap par rapport &#224; l&#8217;augmentation des AESH depuis 2018.</p><p>L'augmentation du nombre d'accompagnants est une bonne chose, il serait dommage qu'elle se fasse au d&#233;triment&#160;de la qualit&#233; de l'accompagnement des &#233;l&#232;ves.&#160;&#160;</p><p>Le pr&#233;sent amendement vise donc &#224; abonder les cr&#233;dits de l&#8217;action 3 &#171;&#160;Inclusion scolaire des &#233;l&#232;ves en situation de handicap&#160;&#187;, du programme 230, &#171;&#160;Vie de l&#8217;&#233;l&#232;ve&#160;&#187; de 14 460 320 Euros destin&#233;s &#224; la formation des AESH charg&#233;s de l&#8217;aide humaine aux &#233;l&#232;ves en situation de handicap. Cette augmentation est compens&#233;e par une diminution des cr&#233;dits de l&#8217;action 2 &#171;Evaluation et controle&#187; du programme 214 &#171;&#160;Soutien de la politique de l&#8217;&#233;ducation nationale&#160;&#187;.</p>",
    "dispositifAmdtCredit": {
      "listeProgrammes": [
        {
          "libelle": "Enseignement scolaire public du premier degré",
          "id": "88978",
          "AE": {
            "montantPositif": "0",
            "montantNegatif": "0"
          },
          "CP": {
            "montantPositif": "0",
            "montantNegatif": "0"
          },
          "action": "modification"
        },
        {
          "libelle": "Enseignement scolaire public du second degré",
          "id": "88979",
          "AE": {
            "montantPositif": "0",
            "montantNegatif": "0"
          },
          "CP": {
            "montantPositif": "0",
            "montantNegatif": "0"
          },
          "action": "modification"
        },
        {
          "libelle": "Vie de l'élève",
          "id": "88980",
          "AE": {
            "montantPositif": "14460320",
            "montantNegatif": "0"
          },
          "CP": {
            "montantPositif": "14460320",
            "montantNegatif": "0"
          },
          "action": "modification"
        },
        {
          "libelle": "Enseignement privé du premier et du second degrés",
          "id": "88981",
          "AE": {
            "montantPositif": "0",
            "montantNegatif": "0"
          },
          "CP": {
            "montantPositif": "0",
            "montantNegatif": "0"
          },
          "action": "modification"
        },
        {
          "libelle": "Soutien de la politique de l'éducation nationale",
          "id": "88982",
          "AE": {
            "montantPositif": "0",
            "montantNegatif": "14460320"
          },
          "CP": {
            "montantPositif": "0",
            "montantNegatif": "14460320"
          },
          "action": "modification"
        },
        {
          "libelle": "Enseignement technique agricole",
          "id": "88983",
          "AE": {
            "montantPositif": "0",
            "montantNegatif": "0"
          },
          "CP": {
            "montantPositif": "0",
            "montantNegatif": "0"
          },
          "action": "modification"
        }
      ],
      "totalAE": {
        "montantPositif": "14460320",
        "montantNegatif": "14460320",
        "solde": "0"
      },
      "totalCP": {
        "montantPositif": "14460320",
        "montantNegatif": "14460320",
        "solde": "0"
      }
    }
  },
  "representations": [
    {
      "nom": "PDF",
      "typeMime": {
        "type": "application",
        "subType": "PDF"
      },
      "statutRepresentation": {
        "verbatim": true,
        "canonique": true,
        "officielle": true,
        "transcription": false,
        "enregistrement": false
      },
      "contenu": {
        "documentURI": "/15/amendements/2272C/AN/720.pdf"
      }
    }
  ],
  "seanceDiscussion": "RUANR5L15S2020IDS21894",
  "sort": {
    "dateSaisie": "2019-10-30T01:34:42.000+01:00",
    "sortEnSeance": "Non soutenu"
  },
  "dateDepot": "2019-10-25T02:00:00.000+02:00",
  "dateDistribution": "2019-10-28T01:00:00.000+01:00",
  "article99": "0",
  "loiReference": {}
}