{
  "uid": "AMANR5L15SEA717460B1255P2D1N2516",
  "identifiant": {
    "legislature": "15",
    "numero": "2516",
    "numRect": "0",
    "saisine": {
      "texteLegislatifRef": "PRJLANR5L15B1255",
      "numeroPartiePLF": "2",
      "organeExamen": "PO717460",
      "mentionSecondeDeliberation": "0"
    }
  },
  "numeroLong": "II-2516",
  "etapeTexte": "1ère lecture (1ère assemblée saisie)",
  "triAmendement": "euaaaaaaaaaaaaaaaaaaaaaaaaaaaaaaaaaaaaaaaaaaaaaaaagako",
  "cardinaliteAmdtMultiples": "1",
  "etat": "Discuté",
  "signataires": {
    "auteur": {
      "typeAuteur": "Gouvernement"
    },
    "texteAffichable": "le Gouvernement"
  },
  "pointeurFragmentTexte": {
    "division": {
      "titre": "Article 55",
      "articleDesignationCourte": "APRÈS ART. 55",
      "type": "ARTICLE",
      "avantAApres": "Apres",
      "divisionRattachee": "APRÈS L'ARTICLE 55, insérer l'article suivant:",
      "articleAdditionnel": "1",
      "urlDivisionTexteVise": "/15/textes/1255C.asp#D_Article_55"
    }
  },
  "corps": {
    "dispositif": "<p style=\"text-align: justify;\">I. &#8211; L&#8217;article&#160;244 <i>quater</i> B du code g&#233;n&#233;ral des imp&#244;ts est ainsi modifi&#233;&#160;:</p><p style=\"text-align: justify;\">1&#176; Le premier alin&#233;a du I est ainsi modifi&#233;&#160;:</p><p style=\"text-align: justify;\"><i>b)</i> Les troisi&#232;me et derni&#232;re phrases sont compl&#233;t&#233;es par les mots&#160;: &#171;&#160;ou sur le territoire de la collectivit&#233; de Corse&#160;&#187;&#160;;</p><p style=\"text-align: justify;\"><i>a)</i> &#192; la troisi&#232;me phrase, les mots&#160;:&#160;&#171;&#160;&#224; compter du 1<sup>er</sup> janvier 2015&#160;&#187; sont supprim&#233;s&#160;;</p><p style=\"text-align: justify;\"><i>c)</i> &#192; la derni&#232;re phrase, les mots&#160;: &#171;&#160;, &#224; compter du 1<sup>er</sup> janvier 2015,&#160;&#187; sont supprim&#233;s&#160;;</p><p style=\"text-align: justify;\">2&#176; Apr&#232;s le mot&#160;: &#171;&#160;pr&#233;cit&#233;&#160;&#187;, la fin du 3 du II <i>bis</i> est supprim&#233;e.</p><p style=\"text-align: justify;\">II. &#8211; Le I s&#8217;applique aux d&#233;penses engag&#233;es au titre des exercices clos &#224; compter du 31 d&#233;cembre 2019.</p><p style=\"text-align: justify;\">III. &#8211; Le I entre en vigueur &#224; une date fix&#233;e par d&#233;cret, qui ne peut &#234;tre post&#233;rieure de plus de six mois &#224; la date de r&#233;ception par le Gouvernement de la r&#233;ponse de la Commission&#160;europ&#233;enne permettant de consid&#233;rer le dispositif l&#233;gislatif lui ayant &#233;t&#233; notifi&#233; comme conforme au droit de l&#8217;Union&#160;europ&#233;enne en mati&#232;re d&#8217;aides d&#8217;&#201;tat.</p>",
    "exposeSommaire": "<p style=\"text-align: justify;\">Cet amendement a pour objet de porter les taux du cr&#233;dit d&#8217;imp&#244;t recherche (CIR) et du cr&#233;dit d&#8217;imp&#244;t innovation (CII) &#224; respectivement 50&#160;% et 40&#160;% pour les d&#233;penses &#233;ligibles expos&#233;es dans des exploitations situ&#233;es sur le territoire de la collectivit&#233; de Corse.</p><p style=\"text-align: justify;\">L&#8217;entr&#233;e en vigueur de ces dispositions est conditionn&#233;e &#224; l&#8217;obtention d&#8217;une r&#233;ponse favorable de la Commission&#160;europ&#233;enne quant &#224; leur conformit&#233; au droit de l&#8217;Union&#160;europ&#233;enne en mati&#232;re d&#8217;aides d&#8217;&#201;tat.</p><p style=\"text-align: justify;\">Le d&#233;veloppement de l&#8217;activit&#233; d&#8217;innovation et de recherche d&#233;veloppement (R&amp;amp;D) constitue en effet un enjeu &#233;conomique majeur pour la comp&#233;titivit&#233; des entreprises et leur capacit&#233; &#224; se d&#233;velopper sur des march&#233;s ext&#233;rieurs.</p><p style=\"text-align: justify;\">D&#8217;apr&#232;s&#160;Eurostat, les entreprises corses consacrent moins de moyens que les autres r&#233;gions fran&#231;aises y compris les d&#233;partements et r&#233;gions d&#8217;Outre-mer (DROM) &#224; la recherche et d&#233;veloppement (R&amp;amp;D). Les d&#233;penses de R&amp;amp;D repr&#233;sentent ainsi seulement 0,3&#160;% du PIB corse contre 2,3&#160;% pour la France enti&#232;re. Dans les DROM qui b&#233;n&#233;ficient d&#233;j&#224; d&#8217;un taux de CIR de 50&#160;% et d&#8217;un taux de CII de 40&#160;%, les d&#233;penses de R&amp;amp;D repr&#233;sentent 0,7&#160;% de leur PIB.</p><p style=\"text-align: justify;\">La majoration des taux du CIR et du CII constitue ainsi une mesure incitative forte pour les entreprises &#224; augmenter leurs d&#233;penses de R&amp;amp;D et d&#8217;innovation en Corse.</p><p style=\"text-align: justify;\">&#160;</p><p style=\"text-align: justify;\">&#160;</p>",
    "cartoucheDelaiDepotDepasse": "Sous réserve de son traitement par les services de l'Assemblée nationale et de sa recevabilité"
  },
  "representations": [
    {
      "nom": "PDF",
      "typeMime": {
        "type": "application",
        "subType": "PDF"
      },
      "statutRepresentation": {
        "verbatim": true,
        "canonique": true,
        "officielle": true,
        "transcription": false,
        "enregistrement": false
      },
      "contenu": {
        "documentURI": "/15/amendements/1255C/AN/2516.pdf"
      }
    }
  ],
  "seanceDiscussion": "RUANR5L15S2019IDS21343",
  "sort": {
    "dateSaisie": "2018-11-15T23:36:42.000+01:00",
    "sortEnSeance": "Adopté"
  },
  "dateDepot": "2018-11-13T01:00:00.000+01:00",
  "dateDistribution": "2018-11-15T01:00:00.000+01:00",
  "article99": "1",
  "loiReference": {
    "codeLoi": "CGI",
    "divisionCodeLoi": "244 quater B"
  }
}