{
  "uid": "AMANR5L15SEA717460BTC1629P0D1N961",
  "identifiant": {
    "legislature": "15",
    "numero": "961",
    "numRect": "0",
    "saisine": {
      "texteLegislatifRef": "PRJLANR5L15BTC1629",
      "numeroPartiePLF": "0",
      "organeExamen": "PO717460",
      "mentionSecondeDeliberation": "0"
    }
  },
  "numeroLong": "961",
  "etapeTexte": "1ère lecture (1ère assemblée saisie)",
  "triAmendement": "bdaaaaaaaaaaaaaaaaaaaaaaaaaaaaaaaaaaaaaaaaaaaaaaaajkznyx",
  "cardinaliteAmdtMultiples": "1",
  "etat": "Discuté",
  "signataires": {
    "auteur": {
      "typeAuteur": "Depute",
      "acteurRef": "PA609245",
      "groupePolitiqueRef": "PO730934"
    },
    "cosignatairesRefs": [
      "PA643089",
      "PA605036",
      "PA609245",
      "PA718780",
      "PA2155",
      "PA267735"
    ],
    "texteAffichable": "Mme&#160;Lacroute,  M.&#160;Abad, M.&#160;de Ganay, M.&#160;Menuel, M.&#160;Thi&#233;riot et Mme&#160;Trastour-Isnart"
  },
  "pointeurFragmentTexte": {
    "division": {
      "titre": "Article 5",
      "articleDesignationCourte": "ART. 5",
      "type": "ARTICLE",
      "avantAApres": "A",
      "divisionRattachee": "ARTICLE 5",
      "urlDivisionTexteVise": "/15/textes/1629.asp#D_Article_5"
    },
    "alinea": {
      "numero": "4"
    }
  },
  "corps": {
    "dispositif": "<p style=\"text-align: justify;\">Compl&#233;ter la deuxi&#232;me phrase de l&#8217;alin&#233;a&#160;4 par les mots&#160;:</p><p style=\"text-align: justify;\">&#171;&#160;en tenant compte des m&#233;thodes p&#233;dagogiques des parents et des besoins de l&#8217;enfant&#160;&#187; .</p>",
    "exposeSommaire": "<p style=\"text-align: justify;\">Les articles r&#233;glementaires D131&#8209;12, R131&#8209;13 et R 131&#8209;14 sont rendus caduques par le pr&#233;sent projet de loi.</p><p style=\"text-align: justify;\">L&#8217;exigence de socle et de cycles est pass&#233;e au niveau l&#233;gislatif, mais pas les pr&#233;c&#233;dentes mentions de libert&#233; p&#233;dagogique ni d&#8217;adaptation &#224; l&#8217;enfant&#160;:</p><p style=\"text-align: justify;\">D131&#8209;12&#160;: &#8220;La progression retenue doit &#234;tre compatible avec l&#8217;&#226;ge de l&#8217;enfant et son &#233;tat de sant&#233;, tout en tenant compte des choix &#233;ducatifs effectu&#233;s et de l&#8217;organisation p&#233;dagogique&#8221;<br />R131&#8209;13&#160;: &#8220;Le contr&#244;le (...) est fait au regard des objectifs (...) en tenant compte des m&#233;thodes p&#233;dagogiques retenues (...) par les personnes responsables des enfants qui re&#231;oivent l&#8217;instruction dans la famille.&#8221;<br />R131&#8209;14&#160;: &#8220;Les personnes responsables de l&#8217;enfant pr&#233;cisent notamment &#224; cette occasion la d&#233;marche et les m&#233;thodes p&#233;dagogiques qu&#8217;elles mettent en oeuvre. &#8220;</p><p style=\"text-align: justify;\">Le projet de loi fixant le contenu des connaissances au niveau l&#233;gislatif, la prise en compte de la libert&#233; p&#233;dagogique - et donc la possibilit&#233; de progression h&#233;t&#233;rog&#232;ne dans chaque domaine du socle comme en p&#233;dagogie Montessori par exemple - doit appara&#238;tre &#233;galement au niveau l&#233;gislatif.</p><p style=\"text-align: justify;\">Les parents ont &#233;galement besoin de pouvoir mettre en oeuvre une p&#233;dagogie adapt&#233;e &#224; l&#8217;enfant, sans n&#233;cessiter un certificat m&#233;dical&#160;:</p><p style=\"text-align: justify;\">L&#8217;enfant peut ne pas avoir une intelligence &#8220;scolaire&#8221; mais une des autres intelligences multiples, il peut &#234;tre anxieux face aux apprentissages scolaires dans le cadre d&#8217;une pr&#233;c&#233;dente phobie scolaire (cas tr&#232;s souvent repr&#233;sent&#233; dans les familles hors &#233;cole), ou encore il peut progresser plus lentement que la moyenne dans le seul cadre de son rythme propre (y compris &#224; 2 ans et demi), sans avoir sp&#233;cialement de trouble invalidant.</p><p style=\"text-align: justify;\">Il est demand&#233; que soit r&#233;tablis la libert&#233; p&#233;dagogique, indispensable dans le cadre de la libert&#233; d&#8217;enseignement ind&#233;pendant, et l&#8217;adaptation &#224; l&#8217;enfant, hors handicap ou trouble de sant&#233;.</p>"
  },
  "representations": [
    {
      "nom": "PDF",
      "typeMime": {
        "type": "application",
        "subType": "PDF"
      },
      "statutRepresentation": {
        "verbatim": true,
        "canonique": true,
        "officielle": true,
        "transcription": false,
        "enregistrement": false
      },
      "contenu": {
        "documentURI": "/15/amendements/1629/AN/961.pdf"
      }
    }
  ],
  "seanceDiscussion": "RUANR5L15S2019IDS21504",
  "sort": {
    "dateSaisie": "2019-02-14T17:55:55.000+01:00",
    "sortEnSeance": "Non soutenu"
  },
  "dateDepot": "2019-02-07T01:00:00.000+01:00",
  "dateDistribution": "2019-02-11T01:00:00.000+01:00",
  "article99": "0",
  "loiReference": {}
}