{
  "uid": "AMANR5L15SEA717460BTC1396P0D1N335",
  "identifiant": {
    "legislature": "15",
    "numero": "335",
    "numRect": "0",
    "saisine": {
      "texteLegislatifRef": "PRJLANR5L15BTC1396",
      "numeroPartiePLF": "0",
      "organeExamen": "PO717460",
      "mentionSecondeDeliberation": "0"
    }
  },
  "numeroLong": "335",
  "etapeTexte": "1ère lecture (2ème assemblée saisie)",
  "triAmendement": "laiaaaaaaaaaaaaaaaaaaaaaaaaaaaaaaaaaaaaaaaaaaaaaaau",
  "cardinaliteAmdtMultiples": "1",
  "etat": "Discuté",
  "signataires": {
    "auteur": {
      "typeAuteur": "Depute",
      "acteurRef": "PA429893",
      "groupePolitiqueRef": "PO758835"
    },
    "cosignatairesRefs": [
      "PA610681",
      "PA429893",
      "PA720988",
      "PA1008",
      "PA267233"
    ],
    "texteAffichable": "M.&#160;Carvounas,  Mme&#160;Bareigts, M.&#160;Bouillon, M.&#160;Alain&#160;David et Mme&#160;Manin"
  },
  "pointeurFragmentTexte": {
    "division": {
      "titre": "Article 51",
      "articleDesignationCourte": "APRÈS ART. 51",
      "type": "ARTICLE",
      "avantAApres": "Apres",
      "divisionRattachee": "APRÈS L'ARTICLE 51, insérer l'article suivant:",
      "articleAdditionnel": "1",
      "urlDivisionTexteVise": "/15/textes/1396.asp#D_Article_51"
    }
  },
  "corps": {
    "dispositif": "<p style=\"text-align: justify;\">Pour l&#8217;application du pr&#233;sent chapitre, le nombre total de places de d&#233;tention par d&#233;partement, tous &#233;tablissements confondus, ne saurait exc&#233;der de plus de 10&#160;% le taux national moyen de places en d&#233;tention par habitant.</p>",
    "exposeSommaire": "<p style=\"text-align: justify;\">Avec 70 714 d&#233;tenus sur le territoire national,pour moins de 60 000 places, la France doit fournir un effort sans pr&#233;c&#233;dant en faveur de la construction de nouveau &#233;tablissements p&#233;nitentiaires.</p><p style=\"text-align: justify;\">Afin de garantir les &#233;quilibres territoriaux et pour ne pas aggraver la situation des territoires qui connaissent d&#233;j&#224; de graves difficult&#233;s &#233;conomiques et sociales, le pr&#233;sent amendement propose de r&#233;partir cet effort sur l&#8217;ensemble du territoire national.</p><p style=\"text-align: justify;\">En effet, selon la carte des &#233;tablissements p&#233;nitentiaires d&#233;voil&#233;e le 19 octobre dernier par le gouvernement, l&#8217;Est francilien concentrerait &#224; lui seul trois des quatre maisons d&#8217;arr&#234;t pr&#233;vues dans le projet du Gouvernement, soit 2000 places sur les 2600 pr&#233;vues par le projet.</p><p style=\"text-align: justify;\">Pour le d&#233;partement du Val-de-Marne, la cr&#233;ation pr&#233;vue d&#8217;une maison d&#8217;arr&#234;t &#224; Noiseau, et d&#8217;une structure d&#8217;accompagnement de sortie ( SAS) &#224; Limeil-Brevannes feraient passer le nombre de places en d&#233;tention de 2600 ( situation de l&#8217;actuelle maison d&#8217;arr&#234;t de Fresnes) &#224; 3500.</p><p style=\"text-align: justify;\">La population du Val-de-Marne &#233;tant d&#8217;1,387 million d&#8217;habitants, le taux de places par habitant deviendrait le plus &#233;lev&#233; de France avec 0.25&#160;% de place pour un habitant soit deux fois et demi le taux moyen national (0.9&#160;% sur l&#8217;ensemble du territoire).</p><p style=\"text-align: justify;\">Un tel d&#233;s&#233;quilibre est v&#233;cu par la population comme par les &#233;lus locaux comme une injustice territoriale majeure.</p>"
  },
  "representations": [
    {
      "nom": "PDF",
      "typeMime": {
        "type": "application",
        "subType": "PDF"
      },
      "statutRepresentation": {
        "verbatim": true,
        "canonique": true,
        "officielle": true,
        "transcription": false,
        "enregistrement": false
      },
      "contenu": {
        "documentURI": "/15/amendements/1396/AN/335.pdf"
      }
    }
  ],
  "seanceDiscussion": "RUANR5L15S2019IDS21418",
  "sort": {
    "dateSaisie": "2018-12-11T19:52:36.000+01:00",
    "sortEnSeance": "Rejeté"
  },
  "dateDepot": "2018-11-14T01:00:00.000+01:00",
  "dateDistribution": "2018-11-22T01:00:00.000+01:00",
  "article99": "0",
  "loiReference": {}
}