{
  "uid": "AMANR5L15SEA717460B0235P1D1N1089",
  "identifiant": {
    "legislature": "15",
    "numero": "1089",
    "numRect": "0",
    "saisine": {
      "texteLegislatifRef": "PRJLANR5L15B0235",
      "numeroPartiePLF": "1",
      "organeExamen": "PO717460",
      "mentionSecondeDeliberation": "0"
    }
  },
  "numeroLong": "I-1089",
  "etapeTexte": "1ère lecture (1ère assemblée saisie)",
  "triAmendement": "vdw",
  "cardinaliteAmdtMultiples": "1",
  "etat": "Discuté",
  "signataires": {
    "auteur": {
      "typeAuteur": "Depute",
      "acteurRef": "PA607553",
      "groupePolitiqueRef": "PO730946"
    },
    "cosignatairesRefs": [
      "PA330357",
      "PA429893",
      "PA610681",
      "PA333285",
      "PA642764",
      "PA342415",
      "PA335999",
      "PA609332",
      "PA607553",
      "PA719930",
      "PA508",
      "PA720988",
      "PA605069"
    ],
    "texteAffichable": "M.&#160;Potier,  M.&#160;Faure, M.&#160;Aviragnet, Mme&#160;Bareigts, Mme&#160;Batho, Mme&#160;Battistel, Mme&#160;Bi&#233;mouret, M.&#160;Jean-Louis&#160;Bricout, M.&#160;Carvounas, M.&#160;Dussopt, Mme&#160;Manin, M.&#160;Vallaud et M.&#160;Garot"
  },
  "pointeurFragmentTexte": {
    "division": {
      "titre": "Article 19",
      "articleDesignationCourte": "ART. 19",
      "type": "ARTICLE",
      "avantAApres": "A",
      "divisionRattachee": "ARTICLE 19",
      "urlDivisionTexteVise": "/15/textes/0235A.asp#D_Article_19"
    },
    "alinea": {
      "numero": "38"
    }
  },
  "corps": {
    "dispositif": "<p style=\"text-align: justify;\">Supprimer l&#8217;alin&#233;a&#160;38.</p>",
    "exposeSommaire": "<p style=\"text-align: justify;\">Amendement de coh&#233;rence avec l&#8217;amendement n&#176; 1087 visant &#224; affecter 100&#160;% de la taxe sur les transactions financi&#232;res (TTF) &#224; l&#8217;aide publique au d&#233;veloppement (APD).</p><p style=\"text-align: justify;\">L&#8217;alin&#233;a dont le pr&#233;sent amendement propose la suppression visait &#224; retirer &#224; l&#8217;Agence Fran&#231;aise de D&#233;veloppement (AFD) la possibilit&#233; d&#8217;&#234;tre r&#233;cipiendaire de la taxe sur les transactions financi&#232;res. Or pour affecter 100&#160;% de la TTF &#224; l&#8217;aide publique au d&#233;veloppement, l&#8217;amendement n&#176; 1087 vise &#224; allouer 50&#160;% des recettes de la TTF &#224; l&#8217;AFD, en sus des 50&#160;% d&#233;j&#224; affect&#233;s au Fonds de Solidarit&#233; pour le D&#233;veloppement.</p>"
  },
  "representations": [
    {
      "nom": "PDF",
      "typeMime": {
        "type": "application",
        "subType": "PDF"
      },
      "statutRepresentation": {
        "verbatim": true,
        "canonique": true,
        "officielle": true,
        "transcription": false,
        "enregistrement": false
      },
      "contenu": {
        "documentURI": "/15/amendements/0235A/AN/1089.pdf"
      }
    }
  ],
  "seanceDiscussion": "RUANR5L15S2018IDS20770",
  "sort": {
    "dateSaisie": "2017-10-22T01:29:50.000+02:00",
    "sortEnSeance": "Tombé"
  },
  "dateDepot": "2017-10-13T02:00:00.000+02:00",
  "dateDistribution": "2017-10-17T02:00:00.000+02:00",
  "article99": "0",
  "loiReference": {}
}