{
  "uid": "AMANR5L15SEA717460BTC0971P0D1N496",
  "identifiant": {
    "legislature": "15",
    "numero": "496",
    "numRect": "0",
    "saisine": {
      "texteLegislatifRef": "PRJLANR5L15BTC0971",
      "numeroPartiePLF": "0",
      "organeExamen": "PO717460",
      "mentionSecondeDeliberation": "0"
    }
  },
  "numeroLong": "496",
  "etapeTexte": "1ère lecture (1ère assemblée saisie)",
  "triAmendement": "awk",
  "cardinaliteAmdtMultiples": "1",
  "etat": "Discuté",
  "signataires": {
    "auteur": {
      "typeAuteur": "Depute",
      "acteurRef": "PA608641",
      "groupePolitiqueRef": "PO730964"
    },
    "cosignatairesRefs": [
      "PA608641"
    ],
    "texteAffichable": "M.&#160;Blein"
  },
  "pointeurFragmentTexte": {
    "division": {
      "titre": "Article 51",
      "articleDesignationCourte": "APRÈS ART. 51",
      "type": "ARTICLE",
      "avantAApres": "Apres",
      "divisionRattachee": "APRÈS L'ARTICLE 51, insérer l'article suivant:",
      "articleAdditionnel": "1",
      "urlDivisionTexteVise": "/15/textes/0971.asp#D_Article_51"
    }
  },
  "corps": {
    "dispositif": "<p style=\"text-align: justify;\">La section 4 du chapitre I<sup>er</sup> du titre III du livre VI du code de la construction et de l&#8217;habitation est compl&#233;t&#233; par un article L.&#160;631&#8209;12&#8209;1 ainsi r&#233;dig&#233;&#160;:</p><p style=\"text-align: justify;\">&#171;&#160;<i>Art.&#160;L.&#160;631&#8209;12&#8209;1</i>.&#160;&#8211;&#160;Par d&#233;rogation aux articles L.&#160;631&#8209;7 et L.&#160;631&#8209;12, le gestionnaire d&#8217;une r&#233;sidence universitaire qui n&#8217;est pas totalement occup&#233;e apr&#232;s le 31 d&#233;cembre de chaque ann&#233;e est autoris&#233; &#224; louer des locaux inoccup&#233;s &#224; une client&#232;le de passage pour un court ou moyen s&#233;jour et qui n&#8217;y &#233;lit pas domicile.</p><p style=\"text-align: justify;\">&#171;&#160;Lorsque les logements lou&#233;s au titre du premier alin&#233;a sont lib&#233;r&#233;s, il sont prioritairement propos&#233;s aux personnes mentionn&#233;es au premier alin&#233;a de l&#8217;article L.&#160;631&#8209;12.</p><p style=\"text-align: justify;\">&#171;&#160;Entre le 1<sup>er</sup> octobre et le 31 d&#233;cembre, le taux d&#8217;occupation par les personnes vis&#233;es &#224; l&#8217;article L.&#160;631&#8209;12 ne peut &#234;tre inf&#233;rieur &#224; 70&#160;%&#160;&#187;.</p>",
    "exposeSommaire": "<p style=\"text-align: justify;\">L&#8217;objectif assign&#233; au gouvernement de cr&#233;er 60.000 logements &#233;tudiants suppl&#233;mentaires ne pourra &#234;tre atteint que si l&#8217;exploitation des r&#233;sidences &#233;tudiantes est &#233;conomiquement viable.</p><p style=\"text-align: justify;\">Mais la vacance des logements &#233;tudiants durant les p&#233;riodes interm&#233;diaires risque de compromettre la viabilit&#233; m&#234;me de l&#8217;exploitation et partant, l&#8217;existence m&#234;me de logements &#171;&#160;r&#233;serv&#233;s&#160;&#187; &#224; un public &#233;tudiant.</p><p style=\"text-align: justify;\">L&#8217;&#233;quilibre &#233;conomique de ces residences passe n&#233;cessairement par des mesures destin&#233;es &#224; rem&#233;dier au taux de vacance des logements, dont la possibilit&#233; de recourir librement &#224; la location saisonni&#232;re.</p><p style=\"text-align: justify;\">Or, la p&#233;nurie de logements dans les villes et la prolif&#233;ration de meubl&#233;s touristiques propos&#233;s &#224; la location principalement via internet ont incit&#233; les pouvoirs publics &#224; encadrer strictement les locations de meubl&#233;s &#224; une client&#232;le de passage qui effectue de courts s&#233;jours.</p><p style=\"text-align: justify;\">L&#8217;article L.&#160;631&#8209;7 du Code de la construction et de l&#8217;habitation subordonne ainsi le changement d&#8217;usage des locaux d&#8217;habitation &#224; une autorisation administrative d&#232;s lors qu&#8217;ils sont situ&#233;s dans une commune de plus de 200.000 habitants ou dans une commune ayant choisi de mettre en place une police de l&#8217;usage.</p><p style=\"text-align: justify;\">La loi du 7 octobre 2016 pour une R&#233;publique num&#233;rique a par ailleurs introduit un nouveau dispositif destin&#233; &#224; permettre aux autorit&#233;s de contr&#244;ler que la location de meubl&#233;s de tourisme respecte la police de l&#8217;usage</p><p style=\"text-align: justify;\">L&#8217;application stricte de cette r&#233;glementation &#224; l&#8217;endroit des r&#233;sidences universitaires s&#8217;av&#233;rerait particuli&#232;rement probl&#233;matique et se montrerait m&#234;me contreproductive.</p><p style=\"text-align: justify;\">De plus, les dispositifs existants sont difficilement praticables pour les gestionnaires de r&#233;sidences &#233;tudiantes qui sont, de facto, confront&#233;s &#224; des l&#233;gislations contradictoires.<br />Cette ins&#233;curit&#233; juridique &#224; laquelle sont confront&#233;s les gestionnaires de r&#233;sidences &#233;tudiantes est un frein &#224; leur d&#233;veloppement et &#224; la cr&#233;ation de logements d&#233;di&#233;s aux &#233;tudiants.</p><p style=\"text-align: justify;\"><br />L&#8217;objectif poursuivi par cet amendement est donc de formaliser un r&#233;gime d&#233;rogatoire &#224; l&#8217;endroit des r&#233;sidences universitaires afin que celles-ci puissent pratiquer des locations saisonni&#232;res dans les locaux laiss&#233;s vacants par les &#233;tudiants sans avoir &#224; solliciter une autorisation de changement d&#8217;usage ni obtenir un num&#233;ro d&#8217;enregistrement destin&#233; &#224; figurer sur les annonces de locations en ligne.</p>"
  },
  "representations": [
    {
      "nom": "PDF",
      "typeMime": {
        "type": "application",
        "subType": "PDF"
      },
      "statutRepresentation": {
        "verbatim": true,
        "canonique": true,
        "officielle": true,
        "transcription": false,
        "enregistrement": false
      },
      "contenu": {
        "documentURI": "/15/amendements/0971/AN/496.pdf"
      }
    }
  ],
  "seanceDiscussion": "RUANR5L15S2018IDS21137",
  "sort": {
    "dateSaisie": "2018-06-08T12:12:45.000+02:00",
    "sortEnSeance": "Non soutenu"
  },
  "dateDepot": "2018-05-24T02:00:00.000+02:00",
  "dateDistribution": "2018-05-31T02:00:00.000+02:00",
  "article99": "0",
  "loiReference": {
    "codeLoi": "c construction et habitation",
    "divisionCodeLoi": "L631-12-1"
  }
}