{
  "uid": "AMANR5L15PO420120B2296P0D1N832",
  "identifiant": {
    "legislature": "15",
    "numero": "832",
    "numRect": "0",
    "saisine": {
      "texteLegislatifRef": "PRJLANR5L15B2296",
      "numeroPartiePLF": "0",
      "organeExamen": "PO420120",
      "mentionSecondeDeliberation": "0"
    }
  },
  "numeroLong": "AS832",
  "etapeTexte": "1ère lecture (1ère assemblée saisie)",
  "triAmendement": "ibiaaaaaaaaaaaaaaaaaaaaaaaaaaaaaaaaaaaaaaaaaaaaaaaajp",
  "cardinaliteAmdtMultiples": "1",
  "etat": "Discuté",
  "signataires": {
    "auteur": {
      "typeAuteur": "Depute",
      "acteurRef": "PA642764",
      "groupePolitiqueRef": "PO758835"
    },
    "cosignatairesRefs": [
      "PA719930",
      "PA335054",
      "PA1592",
      "PA608695",
      "PA609332",
      "PA605069",
      "PA340357",
      "PA337483",
      "PA608741",
      "PA1198",
      "PA429893",
      "PA332614",
      "PA267233",
      "PA610681",
      "PA720988",
      "PA342415",
      "PA333285",
      "PA642764",
      "PA608011",
      "PA333818",
      "PA1008",
      "PA335532",
      "PA607553",
      "PA508",
      "PA609590",
      "PA340343",
      "PA643145",
      "PA1809",
      "PA608172"
    ],
    "texteAffichable": "M.&#160;Aviragnet,  Mme&#160;Bareigts, Mme&#160;Bi&#233;mouret, Mme&#160;Vainqueur-Christophe, M.&#160;Vallaud, Mme&#160;Rabault, Mme&#160;Battistel, M.&#160;Bouillon, M.&#160;Jean-Louis&#160;Bricout, M.&#160;Carvounas, M.&#160;Alain&#160;David, Mme&#160;Laurence&#160;Dumont, M.&#160;Faure, M.&#160;Garot, M.&#160;David&#160;Habib, M.&#160;Hutin, M.&#160;Juanico, Mme&#160;Karamanli, M.&#160;J&#233;r&#244;me&#160;Lambert, M.&#160;Letchimy, Mme&#160;Manin, Mme&#160;Pau-Langevin, Mme&#160;Pires Beaune, M.&#160;Potier, M.&#160;Pueyo, M.&#160;Saulignac, Mme&#160;Tolmont, Mme&#160;Untermaier et Mme&#160;Victory"
  },
  "pointeurFragmentTexte": {
    "division": {
      "titre": "Article 39",
      "articleDesignationCourte": "APRÈS ART. 39",
      "type": "ARTICLE",
      "avantAApres": "Apres",
      "divisionRattachee": "APRÈS L'ARTICLE 39, insérer l'article suivant:",
      "articleAdditionnel": "1",
      "urlDivisionTexteVise": "/15/textes/2296.asp#D_Article_39"
    }
  },
  "corps": {
    "dispositif": "<p style=\"text-align: justify;\">Le titre II du livre III de la sixi&#232;me partie du code de la sant&#233; publique est ainsi modifi&#233;&#160;:</p><p style=\"text-align: justify;\">1&#176;&#160;L&#8217;article L.&#160;6323&#8209;1 est compl&#233;t&#233; par trois alin&#233;as ainsi r&#233;dig&#233;s&#160;:</p><p style=\"text-align: justify;\">&#171;&#160;Sans pr&#233;judice de l&#8217;article L.&#160;161&#8209;36&#8209;3 du code de la s&#233;curit&#233; sociale, les professionnels de sant&#233; exer&#231;ant dans les centres de sant&#233; appliquent le tiers payant aux b&#233;n&#233;ficiaires de l&#8217;assurance maladie sur la part des d&#233;penses prise en charge par l&#8217;assurance maladie obligatoire.</p><p style=\"text-align: justify;\">&#171;&#160;Les conditions dans lesquelles est appliqu&#233; le tiers payant sur la part des d&#233;penses couvertes par leur organisme d&#8217;assurance maladie compl&#233;mentaire sont fix&#233;es par convention entre la maison de sant&#233; et les repr&#233;sentants des organismes compl&#233;mentaire d&#8217;assurance maladie. Cette convention pr&#233;cise notamment le d&#233;lai maximal de paiement, les conditions dans lesquelles le paiement peut &#234;tre garanti au professionnel s&#8217;il est amen&#233; exceptionnellement &#224; pratiquer le tiers payant au vu d&#8217;autres justificatifs de droits ainsi que les p&#233;nalit&#233;s applicables en cas de non-respect du d&#233;lai.</p><p style=\"text-align: justify;\">&#171;&#160;Un d&#233;cret en Conseil d&#8217;&#201;tat fixe les modalit&#233;s d&#8217;application du pr&#233;sent article.&#160;&#187;&#160;;</p><p style=\"text-align: justify;\">2&#176;&#160;Avant le dernier alin&#233;a de l&#8217;article L.&#160;6323&#8209;3, sont ins&#233;r&#233;s trois alin&#233;as ainsi r&#233;dig&#233;s&#160;:</p><p style=\"text-align: justify;\">&#171;&#160;Sans pr&#233;judice de l&#8217;article L.&#160;161&#8209;36&#8209;3 du code de la s&#233;curit&#233; sociale, les professionnels de sant&#233; exer&#231;ant dans les maisons de sant&#233; appliquent le tiers payant aux b&#233;n&#233;ficiaires de l&#8217;assurance maladie sur la part des d&#233;penses prise en charge par l&#8217;assurance maladie obligatoire.</p><p style=\"text-align: justify;\">&#171;&#160;Les conditions dans lesquelles est appliqu&#233; le tiers payant sur la part des d&#233;penses couvertes par leur organisme d&#8217;assurance maladie compl&#233;mentaire sont fix&#233;es par convention entre la maison de sant&#233; et les repr&#233;sentants des organismes compl&#233;mentaire d&#8217;assurance maladie. Cette convention pr&#233;cise notamment le d&#233;lai maximal de paiement, les conditions dans lesquelles le paiement peut &#234;tre garanti au professionnel s&#8217;il est amen&#233; exceptionnellement &#224; pratiquer le tiers payant au vu d&#8217;autres justificatifs de droits ainsi que les p&#233;nalit&#233;s applicables en cas de non-respect du d&#233;lai.</p><p style=\"text-align: justify;\">&#171;&#160;Un d&#233;cret en Conseil d&#8217;&#201;tat fixe les modalit&#233;s d&#8217;application du pr&#233;sent article.&#160;&#187;</p>",
    "exposeSommaire": "<p style=\"text-align: justify;\">Cet amendement du groupe socialiste vise &#224; rendre obligatoire le tiers payant dans les maisons de sant&#233; et dans les centres de sant&#233;.</p><p style=\"text-align: justify;\">Concernant l&#8217;acc&#232;s &#224; des soins de qualit&#233;, des transformations majeures ont &#233;t&#233; mises en place lors du pr&#233;c&#233;dent quinquennat&#160;: le tiers-payant g&#233;n&#233;ralis&#233; d&#8217;abord, qui se pratique dans la plupart des syst&#232;mes de sant&#233;&#160;europ&#233;ens&#160;; mais aussi l&#8217;obligation pour les employeurs de fournir une compl&#233;mentaire sant&#233; &#224; tous leurs employ&#233;s, qui a b&#233;n&#233;fici&#233; &#224; plus d&#8217;un million de salari&#233;s du secteur priv&#233; qui n&#8217;&#233;taient pas couverts&#160;; la mise en place de la protection universelle maladie, qui permet une prise en charge des frais de sant&#233; sans rupture de droits en cas de changement de situation professionnelle ou familiale.&#160;</p><p style=\"text-align: justify;\"><br />Ainsi, le groupe socialiste propose, dans cette logique d&#8217;&#233;largissement de l&#8217;acc&#232;s aux soins, de garantir la mise en &#339;uvre, par l&#8217;&#201;tat du tiers payant, dans les maisons de sant&#233;, et dans les centres de sant&#233;.</p><p style=\"text-align: justify;\"><br />Le tiers payant est un levier majeur pour faire &#233;voluer l&#8217;offre de sant&#233; et faire progresser la justice sociale.</p>"
  },
  "representations": [
    {
      "nom": "PDF",
      "typeMime": {
        "type": "application",
        "subType": "PDF"
      },
      "statutRepresentation": {
        "verbatim": true,
        "canonique": true,
        "officielle": true,
        "transcription": false,
        "enregistrement": false
      },
      "contenu": {
        "documentURI": "/15/amendements/2296/CION-SOC/AS832.pdf"
      }
    }
  ],
  "sort": {
    "dateSaisie": "2019-10-16T17:55:29.000+02:00",
    "sortEnSeance": "Retiré"
  },
  "dateDepot": "2019-10-11T02:00:00.000+02:00",
  "dateDistribution": "2019-10-15T02:00:00.000+02:00",
  "article99": "0",
  "loiReference": {
    "codeLoi": "c santé publique",
    "divisionCodeLoi": "L6323-1"
  }
}