{
  "uid": "AMANR5L15PO59048B1831P0D1N117",
  "identifiant": {
    "legislature": "15",
    "numero": "117",
    "numRect": "0",
    "saisine": {
      "texteLegislatifRef": "PRJLANR5L15B1831",
      "numeroPartiePLF": "0",
      "organeExamen": "PO59048",
      "mentionSecondeDeliberation": "0"
    }
  },
  "numeroLong": "CF117",
  "etapeTexte": "1ère lecture (2ème assemblée saisie)",
  "triAmendement": "gsaaaaaaaaaaaaaaaaaaaaaaaaaaaaaaaaaaaaaaaaaaaaaaaak",
  "cardinaliteAmdtMultiples": "1",
  "etat": "Irrecevable",
  "signataires": {
    "auteur": {
      "typeAuteur": "Depute",
      "acteurRef": "PA608016",
      "groupePolitiqueRef": "PO730934"
    },
    "cosignatairesRefs": [
      "PA267735",
      "PA642847",
      "PA718884",
      "PA1012",
      "PA340853",
      "PA1029",
      "PA2377",
      "PA330684",
      "PA608016",
      "PA721968",
      "PA719318",
      "PA720644",
      "PA267901"
    ],
    "texteAffichable": "Mme&#160;Louwagie,  M.&#160;Leclerc, Mme&#160;Val&#233;rie&#160;Boyer, M.&#160;de la Verpilli&#232;re, M.&#160;de Ganay, M.&#160;Nury, M.&#160;Kamardine, M.&#160;Bazin, M.&#160;Vialay, M.&#160;Deflesselles, M.&#160;Perrut, Mme&#160;Anthoine et Mme&#160;Bazin-Malgras"
  },
  "pointeurFragmentTexte": {
    "division": {
      "titre": "Article 27",
      "articleDesignationCourte": "APRÈS ART. 27",
      "type": "ARTICLE",
      "avantAApres": "Apres",
      "divisionRattachee": "APRÈS L'ARTICLE 27, insérer l'article suivant:",
      "articleAdditionnel": "1",
      "urlDivisionTexteVise": "/15/textes/1831.asp#D_Article_27"
    }
  },
  "corps": {},
  "representations": [
    {
      "nom": "PDF",
      "typeMime": {
        "type": "application",
        "subType": "PDF"
      },
      "statutRepresentation": {
        "verbatim": true,
        "canonique": true,
        "officielle": true,
        "transcription": false,
        "enregistrement": false
      },
      "contenu": {
        "documentURI": "/15/amendements/1831/CION_FIN/CF117.pdf"
      }
    }
  ],
  "dateDepot": "2019-05-03T02:00:00.000+02:00",
  "dateDistribution": "2019-05-03T02:00:00.000+02:00",
  "article99": "0",
  "loiReference": {
    "codeLoi": "transports",
    "divisionCodeLoi": "L 3114 2 1"
  }
}