{
  "uid": "AMANR5L15PO419865B2135P0D1N609",
  "identifiant": {
    "legislature": "15",
    "numero": "609",
    "numRect": "0",
    "saisine": {
      "texteLegislatifRef": "PRJLANR5L15B2135",
      "numeroPartiePLF": "0",
      "organeExamen": "PO419865",
      "mentionSecondeDeliberation": "0"
    }
  },
  "numeroLong": "CD609",
  "etapeTexte": "Nouvelle Lecture",
  "triAmendement": "ihaaaaaaaaaaaaaaaaaaaaaaaaaaaaaaaaaaaaaaaaaaaaaaaac",
  "cardinaliteAmdtMultiples": "1",
  "etat": "Discuté",
  "signataires": {
    "auteur": {
      "typeAuteur": "Depute",
      "acteurRef": "PA720944",
      "groupePolitiqueRef": "PO730964"
    },
    "cosignatairesRefs": [
      "PA720944"
    ],
    "texteAffichable": "Mme&#160;Park, rapporteure"
  },
  "pointeurFragmentTexte": {
    "division": {
      "titre": "Article 31 quater",
      "articleDesignationCourte": "ART. 31 QUATER",
      "type": "ARTICLE",
      "avantAApres": "A",
      "divisionRattachee": "ARTICLE 31 QUATER",
      "urlDivisionTexteVise": "/15/textes/2135.asp#D_Article_31_quater"
    },
    "alinea": {
      "numero": "3"
    }
  },
  "corps": {
    "dispositif": "<p style=\"text-align: justify;\">&#192; l&#8217;alin&#233;a&#160;3, supprimer les mots&#160;:</p><p style=\"text-align: justify;\">&#171;&#160;charg&#233;s du contr&#244;le&#160;&#187;.</p>",
    "exposeSommaire": "<p style=\"text-align: justify;\">Amendement r&#233;dactionnel.</p>"
  },
  "representations": [
    {
      "nom": "PDF",
      "typeMime": {
        "type": "application",
        "subType": "PDF"
      },
      "statutRepresentation": {
        "verbatim": true,
        "canonique": true,
        "officielle": true,
        "transcription": false,
        "enregistrement": false
      },
      "contenu": {
        "documentURI": "/15/amendements/2135/CION-DVP/CD609.pdf"
      }
    }
  ],
  "sort": {
    "dateSaisie": "2019-09-04T00:40:23.000+02:00",
    "sortEnSeance": "Adopté"
  },
  "dateDepot": "2019-08-29T02:00:00.000+02:00",
  "dateDistribution": "2019-08-31T02:00:00.000+02:00",
  "article99": "0",
  "loiReference": {}
}