{
  "uid": "AMANR5L15SEA717460B0363P0D1N47",
  "identifiant": {
    "legislature": "15",
    "numero": "47",
    "numRect": "0",
    "saisine": {
      "texteLegislatifRef": "PRJLANR5L15B0363",
      "numeroPartiePLF": "0",
      "organeExamen": "PO717460",
      "mentionSecondeDeliberation": "0"
    }
  },
  "numeroLong": "47",
  "etapeTexte": "1ère lecture (1ère assemblée saisie)",
  "triAmendement": "bb",
  "cardinaliteAmdtMultiples": "1",
  "etat": "Discuté",
  "signataires": {
    "auteur": {
      "typeAuteur": "Depute",
      "acteurRef": "PA267336",
      "groupePolitiqueRef": "PO730964"
    },
    "cosignatairesRefs": [
      "PA267336"
    ],
    "texteAffichable": "M.&#160;Giraud"
  },
  "pointeurFragmentTexte": {
    "division": {
      "titre": "Article PREMIER",
      "articleDesignationCourte": "ART. PREMIER",
      "type": "ARTICLE",
      "avantAApres": "A",
      "divisionRattachee": "ARTICLE PREMIER",
      "urlDivisionTexteVise": "/15/textes/0363.asp#D_Article_1er"
    },
    "alinea": {
      "avantAApres": "Apres",
      "numero": "2"
    }
  },
  "corps": {
    "dispositif": "<p style=\"text-align: justify;\">I.&#160;&#8211;&#160;Apr&#232;s l&#8217;alin&#233;a&#160;2, ins&#233;rer les deux alin&#233;as suivants&#160;:</p><p style=\"text-align: justify;\">&#171;&#160;Pour les redevables dont le chiffre d&#8217;affaires est sup&#233;rieur &#224; un milliard d&#8217;euros et inf&#233;rieur &#224; 1,1 milliard d&#8217;euros, le taux de la contribution exceptionnelle est multipli&#233; par le rapport entre, au num&#233;rateur, la diff&#233;rence entre le chiffre d&#8217;affaires du redevable et un milliard d&#8217;euros et, au d&#233;nominateur, 100 millions d&#8217;euros.</p><p style=\"text-align: justify;\">&#171;&#160;Le taux de la contribution exceptionnelle est exprim&#233; avec deux d&#233;cimales apr&#232;s la virgule. Le deuxi&#232;me chiffre apr&#232;s la virgule est augment&#233; d&#8217;une unit&#233; si le chiffre suivant est &#233;gal ou sup&#233;rieur &#224;&#160;5.&#160;&#187;</p><p style=\"text-align: justify;\">II.&#160;&#8211;&#160;En cons&#233;quence, apr&#232;s l&#8217;alin&#233;a&#160;4, ins&#233;rer les deux alin&#233;as suivants&#160;:</p><p style=\"text-align: justify;\">&#171;&#160;Pour les redevables dont le chiffre d&#8217;affaires est &#233;gal ou sup&#233;rieur &#224; 3 milliards d&#8217;euros et inf&#233;rieur &#224; 3,1 milliards d&#8217;euros, le taux de la contribution additionnelle est multipli&#233; par le rapport entre, au num&#233;rateur, la diff&#233;rence entre le chiffre d&#8217;affaires du redevable et 3 milliards d&#8217;euros et, au d&#233;nominateur, 100 millions d&#8217;euros.</p><p style=\"text-align: justify;\">&#171;&#160;Le taux de la contribution additionnelle est exprim&#233; avec deux d&#233;cimales apr&#232;s la virgule, le deuxi&#232;me chiffre apr&#232;s la virgule est augment&#233; d&#8217;une unit&#233; si le chiffre suivant est &#233;gal ou sup&#233;rieur &#224;&#160;5.&#160;&#187;</p>",
    "exposeSommaire": "<p style=\"text-align: justify;\">Comme toute imposition dont l&#8217;assujettissement d&#233;pend du niveau de chiffre d&#8217;affaires, les deux contributions propos&#233;es entra&#238;neront d&#8217;in&#233;vitables effets de seuil. Toutefois, il semble opportun de limiter autant que possible ces derniers, qui pourraient se r&#233;v&#233;ler importants, en pr&#233;voyant un m&#233;canisme de lissage.</p><p style=\"text-align: justify;\">C&#8217;est ce &#224; quoi proc&#232;de le pr&#233;sent amendement, qui propose d&#8217;att&#233;nuer le taux de chacune des deux contributions pour les entreprises dont le chiffre d&#8217;affaires est compris entre 1 et 1,1&#160;milliard d&#8217;euros pour la premi&#232;re contribution, et entre 3 et 3,1&#160;milliards d&#8217;euros pour la seconde.</p><p style=\"text-align: justify;\">La perte de recettes qu&#8217;il entra&#238;nerait est &#233;valu&#233;e &#224; un peu plus de 70 millions d&#8217;euros, &#224; mettre en rapport avec le produit attendu des contributions, estim&#233; &#224; 5,4&#160;milliards d&#8217;euros.</p>"
  },
  "representations": [
    {
      "nom": "PDF",
      "typeMime": {
        "type": "application",
        "subType": "PDF"
      },
      "statutRepresentation": {
        "verbatim": true,
        "canonique": true,
        "officielle": true,
        "transcription": false,
        "enregistrement": false
      },
      "contenu": {
        "documentURI": "/15/amendements/0363/AN/47.pdf"
      }
    }
  ],
  "seanceDiscussion": "RUANR5L15S2018IDS20771",
  "sort": {
    "dateSaisie": "2017-11-06T19:48:27.000+01:00",
    "sortEnSeance": "Adopté"
  },
  "dateDepot": "2017-11-06T01:00:00.000+01:00",
  "dateDistribution": "2017-11-06T01:00:00.000+01:00",
  "article99": "0",
  "loiReference": {}
}