{
  "uid": "AMANR5L15SEA717460B0911P0D1N357",
  "identifiant": {
    "legislature": "15",
    "numero": "357",
    "numRect": "0",
    "saisine": {
      "texteLegislatifRef": "PRJLANR5L15B0911",
      "numeroPartiePLF": "0",
      "organeExamen": "PO717460",
      "mentionSecondeDeliberation": "0"
    }
  },
  "numeroLong": "357",
  "etapeTexte": "1ère lecture (1ère assemblée saisie)",
  "triAmendement": "adznvzhi",
  "cardinaliteAmdtMultiples": "1",
  "etat": "A discuter",
  "signataires": {
    "auteur": {
      "typeAuteur": "Depute",
      "acteurRef": "PA268019",
      "groupePolitiqueRef": "PO744425"
    },
    "cosignatairesRefs": [
      "PA719806",
      "PA267780",
      "PA267766",
      "PA267585",
      "PA642935",
      "PA720696",
      "PA642868",
      "PA942",
      "PA702052",
      "PA721110",
      "PA721486",
      "PA722030",
      "PA267042",
      "PA331582",
      "PA712014",
      "PA268019",
      "PA332228",
      "PA695100",
      "PA333421",
      "PA720230",
      "PA610775",
      "PA266788",
      "PA267241",
      "PA267355",
      "PA721094",
      "PA1960",
      "PA335758",
      "PA267330"
    ],
    "texteAffichable": "M.&#160;Lagarde,  M.&#160;Riester, Mme&#160;Auconie, M.&#160;Becht, M.&#160;Benoit, M.&#160;Bournazel, M.&#160;Guy&#160;Bricout, M.&#160;Christophe, M.&#160;Charles&#160;de Courson, M.&#160;Demilly, Mme&#160;Descamps, M.&#160;Dunoyer, M.&#160;Favennec Becot, Mme&#160;Firmin Le Bodo, M.&#160;Gom&#232;s, M.&#160;Meyer&#160;Habib, M.&#160;Herth, M.&#160;Ledoux, M.&#160;Leroy, Mme&#160;Magnier, M.&#160;Morel-&#192;-L&apos;Huissier, M.&#160;Naegelen, M.&#160;Pancher, Mme&#160;Sage, Mme&#160;Sanquer, M.&#160;Vercamer, M.&#160;Philippe&#160;Vigier et M.&#160;Zumkeller"
  },
  "pointeurFragmentTexte": {
    "division": {
      "titre": "Article 2",
      "articleDesignationCourte": "APRÈS ART. 2",
      "type": "ARTICLE",
      "avantAApres": "Apres",
      "divisionRattachee": "APRÈS L'ARTICLE 2, insérer l'article suivant:",
      "articleAdditionnel": "1",
      "urlDivisionTexteVise": "/15/textes/0911.asp#D_Article_2"
    }
  },
  "corps": {
    "dispositif": "<p style=\"text-align: justify;\">L&#8217;article&#160;35 de la Constitution est compl&#233;t&#233; par un alin&#233;a ainsi r&#233;dig&#233;&#160;:</p><p style=\"text-align: justify;\">&#171;&#160;En cas d&#8217;intervention prolong&#233;e, le Gouvernement pr&#233;sente tous les six mois l&#8217;&#233;tat de l&#8217;intervention aux commissions permanentes de l&#8217;Assembl&#233;e nationale et du S&#233;nat charg&#233;es de la d&#233;fense et des forces arm&#233;es.&#160;&#187;</p>",
    "exposeSommaire": "<p style=\"text-align: justify;\">Cet amendement vise &#224; pr&#233;voir, qu&#8217;en cas d&#8217;intervention prolong&#233;e, le Gouvernement pr&#233;sente tous les six mois l&#8217;&#233;tat de l&#8217;intervention aux commissions permanentes charg&#233;es de la d&#233;fense et des forces arm&#233;es. Cette pr&#233;sentation pourrait naturellement se faire &#224; huis clos.</p>"
  },
  "representations": [
    {
      "nom": "PDF",
      "typeMime": {
        "type": "application",
        "subType": "PDF"
      },
      "statutRepresentation": {
        "verbatim": true,
        "canonique": true,
        "officielle": true,
        "transcription": false,
        "enregistrement": false
      },
      "contenu": {
        "documentURI": "/15/amendements/0911/AN/357.pdf"
      }
    }
  ],
  "dateDepot": "2018-07-04T02:00:00.000+02:00",
  "dateDistribution": "2018-07-10T02:00:00.000+02:00",
  "article99": "0",
  "loiReference": {
    "codeLoi": "Constitution",
    "divisionCodeLoi": "35"
  }
}