{
  "uid": "AMANR5L15SEA717460BTC1237P0D1N1695",
  "identifiant": {
    "legislature": "15",
    "numero": "1695",
    "numRect": "0",
    "saisine": {
      "texteLegislatifRef": "PRJLANR5L15BTC1237",
      "numeroPartiePLF": "0",
      "organeExamen": "PO717460",
      "mentionSecondeDeliberation": "1"
    }
  },
  "numeroLong": "1695",
  "etapeTexte": "1ère lecture (1ère assemblée saisie)",
  "triAmendement": "loaaaaaaaaaaaaaaaaaaaaaaaaaaaaaaaaaaaaaaaaaaaaaaaam",
  "cardinaliteAmdtMultiples": "1",
  "etat": "Discuté",
  "signataires": {
    "auteur": {
      "typeAuteur": "Depute",
      "acteurRef": "PA720606",
      "groupePolitiqueRef": "PO723569"
    },
    "cosignatairesRefs": [
      "PA720606",
      "PA720798",
      "PA720468",
      "PA720822",
      "PA720614",
      "PA606212"
    ],
    "texteAffichable": "M.&#160;Pajot,  M.&#160;Aliot, M.&#160;Bilde, M.&#160;Chenu, M.&#160;Collard et Mme&#160;Le Pen"
  },
  "pointeurFragmentTexte": {
    "division": {
      "titre": "Article 60",
      "articleDesignationCourte": "ART. 60",
      "type": "ARTICLE",
      "avantAApres": "A",
      "divisionRattachee": "ARTICLE 60",
      "urlDivisionTexteVise": "/15/textes/1237.asp#D_Article_60"
    },
    "alinea": {
      "numero": "10"
    }
  },
  "corps": {
    "dispositif": "<p style=\"text-align: justify;\">I.&#160;&#8211;&#160;&#192; la derni&#232;re phrase de l&#8217;alin&#233;a&#160;10, substituer au mot&#160;:</p><p style=\"text-align: justify;\">&#171;&#160;deux&#160;&#187;</p><p style=\"text-align: justify;\">le mot&#160;:</p><p style=\"text-align: justify;\">&#171;&#160;cinq&#160;&#187;.</p><p style=\"text-align: justify;\">II.&#160;&#8211;&#160;En cons&#233;quence, compl&#233;ter le m&#234;me alin&#233;a par la phrase suivante&#160;:</p><p style=\"text-align: justify;\">&#171;&#160;Si un rabais a &#233;t&#233; consenti par l&#8217;entreprise, les titres acquis ne peuvent &#234;tre c&#233;d&#233;s avant deux ans, ni avant paiement int&#233;gral&#160;&#187;.</p>",
    "exposeSommaire": "<p style=\"text-align: justify;\">L&#8217;objet du pr&#233;sent amendement est d&#8217;encadrer davantage les rabais qui peuvent &#234;tre op&#233;r&#233;s par l&#8217;&#201;tat ou l&#8217;entreprise en fixant un d&#233;lai minimum de conservation des titres avant cession.</p>"
  },
  "representations": [
    {
      "nom": "PDF",
      "typeMime": {
        "type": "application",
        "subType": "PDF"
      },
      "statutRepresentation": {
        "verbatim": true,
        "canonique": true,
        "officielle": true,
        "transcription": false,
        "enregistrement": false
      },
      "contenu": {
        "documentURI": "/15/amendements/1237/AN/1695.pdf"
      }
    }
  ],
  "seanceDiscussion": "RUANR5L15S2019IDS21263",
  "sort": {
    "dateSaisie": "2018-10-05T00:37:20.000+02:00",
    "sortEnSeance": "Non soutenu"
  },
  "dateDepot": "2018-09-21T02:00:00.000+02:00",
  "dateDistribution": "2018-09-26T02:00:00.000+02:00",
  "article99": "0",
  "loiReference": {}
}