{
  "uid": "AMANR5L15SEA717460B0384P0D1N373",
  "identifiant": {
    "legislature": "15",
    "numero": "373",
    "numRect": "0",
    "saisine": {
      "texteLegislatifRef": "PRJLANR5L15B0384",
      "numeroPartiePLF": "0",
      "organeExamen": "PO717460",
      "mentionSecondeDeliberation": "0"
    }
  },
  "numeroLong": "373",
  "etapeTexte": "1ère lecture (1ère assemblée saisie)",
  "triAmendement": "b",
  "cardinaliteAmdtMultiples": "1",
  "etat": "Discuté",
  "signataires": {
    "auteur": {
      "typeAuteur": "Depute",
      "acteurRef": "PA642695",
      "groupePolitiqueRef": "PO730964"
    },
    "cosignatairesRefs": [
      "PA642695",
      "PA719632"
    ],
    "texteAffichable": "M.&#160;Bothorel et Mme&#160;Panonacle"
  },
  "pointeurFragmentTexte": {
    "division": {
      "titre": "Article 32",
      "articleDesignationCourte": "ART. 32",
      "type": "ARTICLE",
      "avantAApres": "A",
      "divisionRattachee": "ARTICLE 32",
      "urlDivisionTexteVise": "/15/textes/0384.asp#D_Article_32"
    },
    "alinea": {
      "avantAApres": "Apres",
      "numero": "1"
    }
  },
  "corps": {
    "dispositif": "<p style=\"text-align: justify;\">I.&#160;&#8211;&#160;Apr&#232;s l&#8217;alin&#233;a&#160;1, ins&#233;rer les trois alin&#233;as suivants&#160;:</p><p style=\"text-align: justify;\">&#171;&#160;A <i>bis</i>&#160;&#8211;&#160;Au 2&#176; de l&#8217;article L. 524&#8209;3&#160;:</p><p style=\"text-align: justify;\">&#171;&#160;1&#176;&#160;Apr&#232;s le mot&#160;: &#171;&#160;agricoles&#160;&#187;, il est ins&#233;r&#233; le mot&#160;: &#171;&#160;, aquacoles&#160;&#187;&#160;;</p><p style=\"text-align: justify;\">&#171;&#160;2&#176; L&#8217;article est compl&#233;t&#233; par les mots&#160;: &#171;&#160;ou pour les travaux n&#233;cessaires pour garantir la s&#233;curit&#233; de navigation dans le domaine public maritime et dans les eaux int&#233;rieures, ainsi que pour les op&#233;rations relevant d&#8217;un permis exclusif de recherches d&#233;livr&#233; en application du code minier&#160;&#187;.&#160;&#187;</p><p style=\"text-align: justify;\">II.&#160;&#8211;&#160;Compl&#233;ter cet article par l&#8217;alin&#233;a suivant&#160;:</p><p style=\"text-align: justify;\">&#171;&#160;III.&#160;&#8211;&#160;La perte de recettes pour l&#8217;&#201;tat est compens&#233;e &#224; due concurrence par la cr&#233;ation d&#8217;une taxe additionnelle aux droits mentionn&#233;s aux articles 575 et 575 A du code g&#233;n&#233;ral des imp&#244;ts.&#160;&#187;.</p>",
    "exposeSommaire": "<p style=\"text-align: justify;\">Pour &#233;viter toute forme d&#8217;interpr&#233;tation du texte qui puisse conclure &#224; l&#8217;application de la redevance d&#8217;arch&#233;ologie pr&#233;ventive (RAP) sur les sols accueillant des productions conchylicoles, le terme &#171;&#160;aquacoles&#160;&#187; est ajout&#233; derri&#232;re le terme &#171;&#160;agricoles&#160;&#187; afin d&#8217;exempter ces derniers du paiement de la RAP, sur les m&#234;mes fondements et motivation de l&#8217;exemption des travaux agricoles.</p><p style=\"text-align: justify;\">En outre, les ports sont amen&#233;s &#224; mettre en &#339;uvre des travaux de dragage (extraction) puis de clapage (immersion) dans le domaine public maritime pour garantir la s&#233;curit&#233; de navigation des navires en entr&#233;e et en sortie de leurs eaux int&#233;rieures. Ces travaux ont notamment pour but de cr&#233;er et entretenir des chenaux de navigation &#224; la profondeur suffisante pour permettre le passage de grandes embarcations militaires et commerciales et sont donc mis en place au service de l&#8217;int&#233;r&#234;t g&#233;n&#233;ral et de l&#8217;utilit&#233; publique. Cette activit&#233; est d&#8217;ailleurs une pr&#233;rogative r&#233;galienne, que l&#8217;&#201;tat transf&#232;re aux ports par convention. Etendre la RAP aux activit&#233;s de dragage des ports n&#8217;appara&#238;t &#224; ce titre pas pertinent, et ce d&#8217;autant plus qu&#8217;il s&#8217;agit d&#8217;une activit&#233; historique, exerc&#233;e de mani&#232;re r&#233;p&#233;t&#233;e (dragage d&#8217;approfondissement ou de maintenance) sur les m&#234;mes espaces sous-marins depuis plusieurs si&#232;cles.</p><p style=\"text-align: justify;\">Enfin le pr&#233;sent texte soumet &#233;galement express&#233;ment &#224; l&#8217;arch&#233;ologie pr&#233;ventive, les travaux d&#8217;extraction de mat&#233;riaux (cf. article L.&#160;524&#8209;7, III.-), dont l&#8217;emprise est &#233;tendue par des permis exclusifs de recherche (PER). Compte tenu que les PER ont pour objectif de rechercher des substances min&#233;rales en mer et pas une exploitation industrielle de la ressource, l&#8217;application de la RAP &#224; ce stade des investigations n&#8217;est donc pas justifi&#233;e (et non soutenable &#233;conomiquement compte-tenu des surfaces concern&#233;es). Il est &#233;galement important de pr&#233;ciser que les PER n&#8217;occasionnent de pr&#233;l&#232;vement de mat&#233;riaux que de mani&#232;re marginale, aux seules fins de caract&#233;riser la ressource.</p>"
  },
  "representations": [
    {
      "nom": "PDF",
      "typeMime": {
        "type": "application",
        "subType": "PDF"
      },
      "statutRepresentation": {
        "verbatim": true,
        "canonique": true,
        "officielle": true,
        "transcription": false,
        "enregistrement": false
      },
      "contenu": {
        "documentURI": "/15/amendements/0384/AN/373.pdf"
      }
    }
  ],
  "seanceDiscussion": "RUANR5L15S2018IDS20824",
  "sort": {
    "dateSaisie": "2017-12-08T16:10:18.000+01:00",
    "sortEnSeance": "Non soutenu"
  },
  "dateDepot": "2017-11-30T01:00:00.000+01:00",
  "dateDistribution": "2017-12-04T01:00:00.000+01:00",
  "article99": "0",
  "loiReference": {}
}