{
  "uid": "AMANR5L15PO419610B0846P0D1N887",
  "identifiant": {
    "legislature": "15",
    "numero": "887",
    "numRect": "0",
    "saisine": {
      "texteLegislatifRef": "PRJLANR5L15B0846",
      "numeroPartiePLF": "0",
      "organeExamen": "PO419610",
      "mentionSecondeDeliberation": "0"
    }
  },
  "numeroLong": "CE887",
  "etapeTexte": "1ère lecture (1ère assemblée saisie)",
  "triAmendement": "bfkkw",
  "cardinaliteAmdtMultiples": "1",
  "etat": "Discuté",
  "signataires": {
    "auteur": {
      "typeAuteur": "Depute",
      "acteurRef": "PA642847",
      "groupePolitiqueRef": "PO730934"
    },
    "cosignatairesRefs": [
      "PA642847"
    ],
    "texteAffichable": "M.&#160;Bazin"
  },
  "pointeurFragmentTexte": {
    "division": {
      "titre": "Article PREMIER",
      "articleDesignationCourte": "ART. PREMIER",
      "type": "ARTICLE",
      "avantAApres": "A",
      "divisionRattachee": "ARTICLE PREMIER",
      "urlDivisionTexteVise": "/15/textes/0846.asp#D_Article_1er"
    },
    "alinea": {
      "avantAApres": "Apres",
      "numero": "7"
    }
  },
  "corps": {
    "dispositif": "<p style=\"text-align: justify;\">Apr&#232;s l&#8217;alin&#233;a&#160;7, ins&#233;rer l&#8217;alin&#233;a suivant&#160;:</p><p style=\"text-align: justify;\">&#171;&#160;&#8211; la commune&#160;;&#160;&#187;.</p>",
    "exposeSommaire": "<p style=\"text-align: justify;\">La cr&#233;ation d&#8217;un nouveau contrat de projet partenarial d&#8217;am&#233;nagement destin&#233; &#224; r&#233;pondre au niveau local &#224; des objectifs ambitieux de production de logements, notamment en zone tendue, en d&#233;finissant des engagements r&#233;ciproques en faveur de la r&#233;alisation d&#8217;op&#233;rations d&#8217;am&#233;nagement complexes ou d&#8217;une certaine ampleur n&#8217;est pertinent et ne trouvera une efficacit&#233; qu&#8217;&#224; la seule condition que l&#8217;ensemble des collectivit&#233;s comp&#233;tentes en mati&#232;re d&#8217;am&#233;nagement au sens de l&#8217;article L.&#160;300&#8209;1 code de l&#8217;urbanisme puissent &#234;tre en mesure conclure le contrat.</p><p style=\"text-align: justify;\">A cet &#233;gard, les communes ne peuvent &#234;tre consid&#233;r&#233;es comme des partenaires institutionnels et financiers de second rang d&#232;s lors qu&#8217;elles disposent de comp&#233;tence structurantes en mati&#232;re d&#8217;am&#233;nagement des &#233;quipements publics relatifs &#224; ces comp&#233;tences (voirie, am&#233;nagement des espaces publics, circulation pi&#233;tonne, &#233;quipements scolaires, culturels et sportifs, etc.) qui participent &#224; la conception de la ville et, tr&#232;s souvent, du foncier mobilisable.</p><p style=\"text-align: justify;\">Seuls des engagements partag&#233;s et co-construits entre les communes, leurs groupements et l&#8217;&#201;tat permettront de mettre en &#339;uvre durablement des op&#233;rations d&#8217;am&#233;nagements ambitieuses au service de projets de territoire et de leurs habitants.</p><p style=\"text-align: justify;\">Pour ces raisons, il serait contreproductif et ce, de mani&#232;re in&#233;dite en droit de l&#8217;am&#233;nagement, d&#8217;&#233;carter les communes de l&#8217;acc&#232;s &#224; un outil contractuel potentiellement d&#233;rogatoire au droit commun de l&#8217;urbanisme et potentiellement plus performant&#160;en mati&#232;re de politique publique (via les grandes op&#233;rations d&#8217;urbanisme - GOU) relevant pourtant de l&#8217;exercice de leurs comp&#233;tences et de leur ma&#238;trise fonci&#232;re.</p><p style=\"text-align: justify;\">C&#8217;est pourquoi, cet amendement vise d&#8217;une part &#224; r&#233;int&#233;grer les communes comme b&#233;n&#233;ficiaires de premier rang d&#8217;un contrat de projet partenarial d&#8217;am&#233;nagement, au m&#234;me titre que leurs groupements.</p><p style=\"text-align: justify;\">D&#8217;autre part, cet amendement vise &#224; rectifier, dans le texte, le champ d&#8217;application de ce nouvel outil d&#8217;am&#233;nagement d&#233;rogatoire au droit commun de l&#8217;urbanisme, au regard de sa d&#233;finition telle que pr&#233;cis&#233;e dans l&#8217;expos&#233; des motifs, soit la &#171;&#160;la r&#233;alisation d&#8217;op&#233;rations d&#8217;am&#233;nagement complexes ou d&#8217;une certaine ampleur&#160;&#187; qui &#171;&#160;vise &#224; d&#233;finir un projet de territoire comprenant des objectifs de production de logements&#160;&#187;.</p><p style=\"text-align: justify;\">Enfin, &#224; l&#8217;instar du r&#233;gime juridique pr&#233;vu s&#8217;agissant des &#171;&#160;op&#233;rations de revitalisation de territoire&#160;&#187; cr&#233;&#233;es par l&#8217;article&#160;54 du projet de loi, cet amendement vise &#224; replacer dans le dispositif des contrats de PPA, l&#8217;ensemble des dispositions relatives aux grandes op&#233;rations d&#8217;urbanisme relevant d&#8217;engagements contractuels opposables &#224; l&#8217;ensemble des signataires et non de d&#233;cisions administratives unilat&#233;rales.</p><p style=\"text-align: justify;\">Ainsi, il a pour objet de pr&#233;ciser le contenu du contrat de projet partenarial d&#8217;am&#233;nagement afin de permettre &#224; l&#8217;ensemble des parties contractantes concern&#233;es, d&#8217;identifier d&#8217;ores et d&#233;j&#224;, en amont de la phase op&#233;rationnelle, les caract&#233;ristiques, les dimensions, la dur&#233;e, le calendrier, et le plan de financement d&#8217;une op&#233;ration d&#8217;am&#233;nagement susceptible de relever de la qualification de grandes op&#233;ration d&#8217;urbanisme pr&#233;vues par l&#8217;article L.&#160;312&#8209;3.</p>"
  },
  "representations": [
    {
      "nom": "PDF",
      "typeMime": {
        "type": "application",
        "subType": "PDF"
      },
      "statutRepresentation": {
        "verbatim": true,
        "canonique": true,
        "officielle": true,
        "transcription": false,
        "enregistrement": false
      },
      "contenu": {
        "documentURI": "/15/amendements/0846/CION-ECO/CE887.pdf"
      }
    }
  ],
  "sort": {
    "dateSaisie": "2018-05-15T19:30:40.000+02:00",
    "sortEnSeance": "Rejeté"
  },
  "dateDepot": "2018-05-07T02:00:00.000+02:00",
  "dateDistribution": "2018-05-14T02:00:00.000+02:00",
  "article99": "0",
  "loiReference": {}
}