{
  "uid": "AMANR5L15SEA717460BTC1939P0D1N48",
  "identifiant": {
    "legislature": "15",
    "numero": "48",
    "numRect": "0",
    "saisine": {
      "texteLegislatifRef": "PIONANR5L15BTC1939",
      "numeroPartiePLF": "0",
      "organeExamen": "PO717460",
      "mentionSecondeDeliberation": "0"
    }
  },
  "numeroLong": "48",
  "etapeTexte": "Nouvelle Lecture",
  "triAmendement": "bcaaaaaaaaaaaaaaaaaaaaaaaaaaaaaaaaaaaaaaaaaaaaaaaafs",
  "cardinaliteAmdtMultiples": "1",
  "etat": "Discuté",
  "signataires": {
    "auteur": {
      "typeAuteur": "Depute",
      "acteurRef": "PA721410",
      "groupePolitiqueRef": "PO730934"
    },
    "cosignatairesRefs": [
      "PA330008",
      "PA334654",
      "PA721410"
    ],
    "texteAffichable": "Mme&#160;Bonnivard,  M.&#160;Straumann et M.&#160;Breton"
  },
  "pointeurFragmentTexte": {
    "division": {
      "titre": "Article 2",
      "articleDesignationCourte": "ART. 2",
      "type": "ARTICLE",
      "avantAApres": "A",
      "divisionRattachee": "ARTICLE 2",
      "urlDivisionTexteVise": "/15/textes/1939.asp#D_Article_2"
    },
    "alinea": {
      "numero": "2"
    }
  },
  "corps": {
    "dispositif": "<p>&#192; la deuxi&#232;me phrase de l&#8217;alin&#233;a&#160;2, apr&#232;s le mot&#160;:</p><p style=\"text-align: justify;\">&#171;&#160;projets&#160;&#187;,</p><p style=\"text-align: justify;\">ins&#233;rer les mots&#160;:</p><p style=\"text-align: justify;\">&#171;&#160;, dont ceux du secteur associatif en lien avec la politique de la ville,&#160;&#187;.</p>",
    "exposeSommaire": "<p style=\"text-align: justify;\">L&#8217;objet de cet amendement est d&#8217;inclure &#233;galement les porteurs de projet du secteur associatif en lien avec la politique de la ville. Ils sont des acteurs indispensables de la coh&#233;sion des territoires et ont besoin notamment d&#8217;&#234;tre assist&#233;s dans le montage de leurs demandes de subvention.</p>"
  },
  "representations": [
    {
      "nom": "PDF",
      "typeMime": {
        "type": "application",
        "subType": "PDF"
      },
      "statutRepresentation": {
        "verbatim": true,
        "canonique": true,
        "officielle": true,
        "transcription": false,
        "enregistrement": false
      },
      "contenu": {
        "documentURI": "/15/amendements/1939/AN/48.pdf"
      }
    }
  ],
  "sort": {
    "dateSaisie": "2019-05-15T19:32:48.000+02:00",
    "sortEnSeance": "Non soutenu"
  },
  "dateDepot": "2019-05-09T02:00:00.000+02:00",
  "dateDistribution": "2019-05-13T02:00:00.000+02:00",
  "article99": "0",
  "loiReference": {}
}