{
  "uid": "AMANR5L15SEA717460B1297P0D1N1025",
  "identifiant": {
    "legislature": "15",
    "numero": "1025",
    "numRect": "0",
    "saisine": {
      "texteLegislatifRef": "PRJLANR5L15B1297",
      "numeroPartiePLF": "0",
      "organeExamen": "PO717460",
      "mentionSecondeDeliberation": "0"
    }
  },
  "numeroLong": "1025",
  "etapeTexte": "1ère lecture (1ère assemblée saisie)",
  "triAmendement": "epaaaaaaaaaaaaaaaaaaaaaaaaaaaaaaaaaaaaaaaaaaaaaaaaarbaac",
  "cardinaliteAmdtMultiples": "1",
  "etat": "Irrecevable",
  "signataires": {
    "auteur": {
      "typeAuteur": "Depute",
      "acteurRef": "PA267780",
      "groupePolitiqueRef": "PO744425"
    },
    "cosignatairesRefs": [
      "PA721194",
      "PA721486",
      "PA267585",
      "PA267330",
      "PA2952",
      "PA267355",
      "PA720696",
      "PA610775",
      "PA267241",
      "PA720230",
      "PA421348",
      "PA1960",
      "PA719806",
      "PA721094",
      "PA695100",
      "PA722030",
      "PA702052",
      "PA267766",
      "PA712014",
      "PA642868",
      "PA268019",
      "PA721110",
      "PA266788",
      "PA331567",
      "PA642935",
      "PA335758",
      "PA267780",
      "PA332228"
    ],
    "texteAffichable": "Mme&#160;Firmin Le Bodo,  Mme&#160;Auconie, M.&#160;Becht, M.&#160;Benoit, M.&#160;Bournazel, M.&#160;Guy&#160;Bricout, M.&#160;Christophe, Mme&#160;de La Raudi&#232;re, M.&#160;Demilly, Mme&#160;Descamps, Mme&#160;Fr&#233;d&#233;rique&#160;Dumas, M.&#160;Dunoyer, M.&#160;Gom&#232;s, M.&#160;Meyer&#160;Habib, M.&#160;Herth, M.&#160;Lagarde, M.&#160;Ledoux, M.&#160;Leroy, Mme&#160;Magnier, M.&#160;Morel-&#192;-L&apos;Huissier, M.&#160;Naegelen, M.&#160;Riester, Mme&#160;Sage, Mme&#160;Sanquer, M.&#160;Vercamer, M.&#160;Villiers, M.&#160;Warsmann et M.&#160;Zumkeller"
  },
  "pointeurFragmentTexte": {
    "division": {
      "titre": "Article 29",
      "articleDesignationCourte": "APRÈS ART. 29",
      "type": "ARTICLE",
      "avantAApres": "Apres",
      "divisionRattachee": "APRÈS L'ARTICLE 29, insérer l'article suivant:",
      "articleAdditionnel": "1",
      "urlDivisionTexteVise": "/15/textes/1297.asp#D_Article_29"
    }
  },
  "corps": {
    "dispositif": "<p style=\"text-align: justify;\">La section IV du chapitre II du titre VI du livre I<sup>er</sup> de la partie l&#233;gislative du code de la s&#233;curit&#233; sociale est compl&#233;t&#233;e par un article L.&#160;162&#8209;19&#8209;2 ainsi r&#233;dig&#233;&#160;:</p><p style=\"text-align: justify;\">&#171;&#160;<i>Art.&#160;L.&#160;162&#8209;19&#8209;2</i>.&#160;&#8211;&#160;Les tarifs et majorations d&#233;termin&#233;s en application des articles L.&#160;162&#8209;5,&#160; L.&#160;162&#8209;14&#8209;1 et L.&#160;162&#8209;17 du pr&#233;sent code sont applicables &#224; l&#8217;activit&#233; de consultation et actes externes des &#233;tablissements de sant&#233;, pr&#233;vus &#224; l&#8217;article &#224; L.&#160;162&#8209;26 du m&#234;me code.&#160;&#187;</p>",
    "exposeSommaire": "<p style=\"text-align: justify;\">Cette proposition l&#233;gislative vise &#224; &#233;tablir une &#233;galit&#233; de traitement entre la ville et l&#8217;h&#244;pital en ce qui concerne le financement des actes et consultations externes.</p><p style=\"text-align: justify;\">Imput&#233;s sur les enveloppes de d&#233;penses hospitali&#232;res, les actes et consultations externes (ACE) sont r&#233;alis&#233;s par les praticiens exer&#231;ant dans les &#233;tablissements de sant&#233; contribuant ainsi &#224; densifier l&#8217;offre de soins. Ils repr&#233;sentent 4 milliards de d&#233;penses rembours&#233;es par l&#8217;assurance maladie en 2016.</p><p style=\"text-align: justify;\">L&#8217;activit&#233; externe n&#8217;est pas le c&#339;ur de m&#233;tier de l&#8217;h&#244;pital public. Pourtant, cette activit&#233; s&#8217;accroit de plus en plus, l&#8217;h&#244;pital agissant en subsidiarit&#233; d&#8217;une carence de l&#8217;offre de ville.</p><p style=\"text-align: justify;\">Cette activit&#233; diversifi&#233;e (consultations sp&#233;cialistes, consultations g&#233;n&#233;ralistes, actes de biologie etc.) est de m&#234;me nature que celle r&#233;alis&#233;e par les praticiens lib&#233;raux en cabinet de ville. Elle ne concerne que les h&#244;pitaux publics et les &#233;tablissements de sant&#233; priv&#233;s d&#8217;int&#233;r&#234;t collectif, puisque dans les &#233;tablissements de sant&#233; priv&#233;s lucratifs, l&#8217;activit&#233; externe rel&#232;ve du champ lib&#233;ral.</p><p style=\"text-align: justify;\">Les tarifs de ces actes et consultations externes &#224; l&#8217;h&#244;pital sont d&#233;termin&#233;s de fa&#231;on exog&#232;ne par les conventions liant l&#8217;assurance maladie aux professionnels de sant&#233; lib&#233;raux. Cependant, actuellement, les majorations tarifaires issues de ces conventions ne sont pas applicables en l&#8217;&#233;tat aux &#233;tablissements de sant&#233;. Un dispositif r&#233;glementaire limite nominativement les majorations transposables &#224; l&#8217;activit&#233; d&#8217;ACE des &#233;tablissements de sant&#233;.</p><p style=\"text-align: justify;\">Cette asym&#233;trie de traitement entre la ville et l&#8217;h&#244;pital entraine une d&#233;valorisation de cette activit&#233; &#224; l&#8217;h&#244;pital, largement sous r&#233;mun&#233;r&#233;e selon un r&#233;cent rapport de l&#8217;IGAS[1]. Les consultations externes &#224; l&#8217;h&#244;pital jouent un r&#244;le important en termes d&#8217;acc&#232;s aux soins et sont compl&#233;mentaires &#224; l&#8217;activit&#233; lib&#233;rale sur certains pans de l&#8217;activit&#233;. A l&#8217;heure o&#249; le financement au parcours est un &#233;l&#233;ment constitutif de la strat&#233;gie nationale de sant&#233;, les &#233;tablissements de sant&#233; sollicitent un financement &#233;quitable de leur activit&#233; d&#8217;actes et de consultations externes, par rapport &#224; la ville. Une application comparable des majorations, en ville et &#224; l&#8217;h&#244;pital est ainsi souhait&#233;e.</p><p style=\"text-align: justify;\"><br /> <br />[1] Rapport &#171;&#160;Evaluation de la tarification des soins hospitaliers et des actes m&#233;dicaux&#160;&#187; (TOME 1) &#233;tabli par &#201;tabli par Pierre-Louis BRAS, Jean-Luc VIEILLERIBIERE Membres de l&#8217;Inspection g&#233;n&#233;rale des affaires sociales Pierre LESTEVEN, conseiller g&#233;n&#233;ral des &#233;tablissements de sant&#233;, mars 2012.</p>"
  },
  "representations": [
    {
      "nom": "PDF",
      "typeMime": {
        "type": "application",
        "subType": "PDF"
      },
      "statutRepresentation": {
        "verbatim": true,
        "canonique": true,
        "officielle": true,
        "transcription": false,
        "enregistrement": false
      },
      "contenu": {
        "documentURI": "/15/amendements/1297/AN/1025.pdf"
      }
    }
  ],
  "dateDepot": "2018-10-19T02:00:00.000+02:00",
  "article99": "0",
  "loiReference": {
    "codeLoi": "c sécurité sociale",
    "divisionCodeLoi": "L162-19-2"
  }
}