{
  "uid": "AMANR5L15SEA717460B0911P0D1N2071",
  "identifiant": {
    "legislature": "15",
    "numero": "2071",
    "numRect": "0",
    "saisine": {
      "texteLegislatifRef": "PRJLANR5L15B0911",
      "numeroPartiePLF": "0",
      "organeExamen": "PO717460",
      "mentionSecondeDeliberation": "0"
    }
  },
  "numeroLong": "2071",
  "etapeTexte": "1ère lecture (1ère assemblée saisie)",
  "triAmendement": "adxvszzs",
  "cardinaliteAmdtMultiples": "1",
  "etat": "Discuté",
  "signataires": {
    "auteur": {
      "typeAuteur": "Depute",
      "acteurRef": "PA606098",
      "groupePolitiqueRef": "PO730934"
    },
    "cosignatairesRefs": [
      "PA606098"
    ],
    "texteAffichable": "M.&#160;Marleix"
  },
  "pointeurFragmentTexte": {
    "division": {
      "titre": "Article 2",
      "articleDesignationCourte": "APRÈS ART. 2",
      "type": "ARTICLE",
      "avantAApres": "Apres",
      "divisionRattachee": "APRÈS L'ARTICLE 2, insérer l'article suivant:",
      "articleAdditionnel": "1",
      "urlDivisionTexteVise": "/15/textes/0911.asp#D_Article_2"
    }
  },
  "corps": {
    "dispositif": "<p style=\"text-align: justify;\">Le dix-neuvi&#232;me alin&#233;a de l&#8217;article&#160;34 de la Constitution est compl&#233;t&#233; par une phrase ainsi r&#233;dig&#233;e&#160;: &#171;&#160;Elles ne peuvent &#234;tre adopt&#233;es en d&#233;ficit de fonctionnement.&#160;&#187;</p>",
    "exposeSommaire": "<p style=\"text-align: justify;\">Cet amendement pr&#233;voit d&#8217;inscrire dans la Constitution une &#171;&#160;r&#232;gle d&#8217;or&#160;&#187; budg&#233;taire.</p>"
  },
  "representations": [
    {
      "nom": "PDF",
      "typeMime": {
        "type": "application",
        "subType": "PDF"
      },
      "statutRepresentation": {
        "verbatim": true,
        "canonique": true,
        "officielle": true,
        "transcription": false,
        "enregistrement": false
      },
      "contenu": {
        "documentURI": "/15/amendements/0911/AN/2071.pdf"
      }
    }
  ],
  "seanceDiscussion": "RUANR5L15S2018IDS21175",
  "sort": {
    "dateSaisie": "2018-07-20T00:39:04.000+02:00",
    "sortEnSeance": "Non soutenu"
  },
  "dateDepot": "2018-07-06T02:00:00.000+02:00",
  "dateDistribution": "2018-07-10T02:00:00.000+02:00",
  "article99": "0",
  "loiReference": {
    "codeLoi": "Constitution",
    "divisionCodeLoi": "34"
  }
}