{
  "uid": "AMANR5L15SEA717460BTC0575P0D1N288",
  "identifiant": {
    "legislature": "15",
    "numero": "288",
    "numRect": "0",
    "saisine": {
      "texteLegislatifRef": "PRJLANR5L15BTC0575",
      "numeroPartiePLF": "0",
      "organeExamen": "PO717460",
      "mentionSecondeDeliberation": "0"
    }
  },
  "numeroLong": "288",
  "etapeTexte": "1ère lecture (1ère assemblée saisie)",
  "triAmendement": "ifu",
  "cardinaliteAmdtMultiples": "1",
  "etat": "Discuté",
  "signataires": {
    "auteur": {
      "typeAuteur": "Depute",
      "acteurRef": "PA333421",
      "groupePolitiqueRef": "PO744425"
    },
    "cosignatairesRefs": [
      "PA267355",
      "PA719806",
      "PA642868",
      "PA267330",
      "PA331582",
      "PA267766",
      "PA702052",
      "PA695100",
      "PA267780",
      "PA333421",
      "PA693008",
      "PA942",
      "PA722030",
      "PA642935"
    ],
    "texteAffichable": "M.&#160;Pancher,  M.&#160;Guy&#160;Bricout, Mme&#160;Auconie, Mme&#160;Firmin Le Bodo, M.&#160;Philippe&#160;Vigier, M.&#160;Bournazel, M.&#160;Zumkeller, M.&#160;Herth, M.&#160;Charles&#160;de Courson, M.&#160;Polutele, M.&#160;Meyer&#160;Habib, M.&#160;Christophe, M.&#160;Becht et Mme&#160;Sage"
  },
  "pointeurFragmentTexte": {
    "division": {
      "titre": "Article 34",
      "articleDesignationCourte": "APRÈS ART. 34",
      "type": "ARTICLE",
      "avantAApres": "Apres",
      "divisionRattachee": "APRÈS L'ARTICLE 34, insérer l'article suivant:",
      "articleAdditionnel": "1",
      "urlDivisionTexteVise": "/15/textes/0575.asp#D_Article_34"
    }
  },
  "corps": {
    "dispositif": "<p>Le chapitre Ier du titre Ier du livre V du code de l&#8217;&#233;nergie est ainsi modifi&#233;&#160;:</p><p>1&#176;&#160;L&#8217;article L.&#160;511&#8209;2 est ainsi modifi&#233;&#160;:</p><p>a)&#160;Les mots&#160;: &#171;&#160;de l&#8217;article L.&#160;214&#8209;1&#160;&#187; sont remplac&#233;s par les mots &#171;&#160;du 1&#176; de l&#8217;article L.&#160;181&#8209;1 ou des articles L.&#160;214&#8209;1 et suivants&#160;&#187;&#160;;</p><p>b)&#160;Les mots&#160;: &#171;&#160;accessoirement de l&#8217;&#233;lectricit&#233; sont autoris&#233;s en application des articles L.&#160;214&#8209;1 &#224; L.&#160;214&#8209;11 du code de l&#8217;environnement et&#160;&#187; sont remplac&#233;s par les mots&#160;: &#171;&#160;de l&#8217;&#233;lectricit&#233; accessoirement &#224; une activit&#233; principale r&#233;guli&#232;rement autoris&#233;e&#160;&#187;&#160;;</p><p>c)&#160;Il est compl&#233;t&#233; par les mots&#160;: &#171;&#160;et de la proc&#233;dure d&#8217;autorisation relevant du code de l&#8217;environnement&#160;&#187;.</p><p>2&#176;&#160;L&#8217;article L.&#160;511&#8209;3 est ainsi modifi&#233;&#160;:</p><p>a)&#160;Apr&#232;s le mot&#160;: &#171;&#160;application&#160;&#187;, sont ins&#233;r&#233;s les mots&#160;: &#171;&#160;du 1&#176; de l&#8217;article L.&#160;181&#8209;1 ou&#160;&#187;&#160;;</p><p>b)&#160;Apr&#232;s le mot&#160;: &#171;&#160;livre&#160;&#187;, sont ins&#233;r&#233;s les mots&#160;: &#171;&#160;et du code de l&#8217;environnement&#160;&#187;&#160;;</p><p>c)&#160;Il est compl&#233;t&#233; par une phrase ainsi r&#233;dig&#233;e&#160;: &#171;&#160;Leur construction puis leur mise en exploitation sont port&#233;es, avant leur mise en &#339;uvre, &#224; la connaissance du pr&#233;fet avec tous les &#233;l&#233;ments d&#8217;appr&#233;ciation&#160;&#187;.</p>",
    "exposeSommaire": "<p style=\"text-align: justify;\">Cet amendement vise &#224; dispenser d&#8217;autorisation les installations hydro&#233;lectriques &#171;&#160;accessoires&#160;&#187;.</p>"
  },
  "representations": [
    {
      "nom": "PDF",
      "typeMime": {
        "type": "application",
        "subType": "PDF"
      },
      "statutRepresentation": {
        "verbatim": true,
        "canonique": true,
        "officielle": true,
        "transcription": false,
        "enregistrement": false
      },
      "contenu": {
        "documentURI": "/15/amendements/0575/AN/288.pdf"
      }
    }
  ],
  "seanceDiscussion": "RUANR5L15S2018IDS20868",
  "sort": {
    "dateSaisie": "2018-01-25T17:31:20.000+01:00",
    "sortEnSeance": "Non soutenu"
  },
  "dateDepot": "2018-01-19T01:00:00.000+01:00",
  "dateDistribution": "2018-01-23T01:00:00.000+01:00",
  "article99": "0",
  "loiReference": {}
}