{
  "uid": "AMANR5L15SEA717460BTC1548P0D1N141",
  "identifiant": {
    "legislature": "15",
    "numero": "141",
    "numRect": "0",
    "saisine": {
      "texteLegislatifRef": "PRJLANR5L15BTC1548",
      "numeroPartiePLF": "0",
      "organeExamen": "PO717460",
      "mentionSecondeDeliberation": "0"
    }
  },
  "numeroLong": "141",
  "etapeTexte": "Nouvelle Lecture",
  "triAmendement": "bdaaaaaaaaaaaaaaaaaaaaaaaaaaaaaaaaaaaaaaaaaaaaaaaacs",
  "cardinaliteAmdtMultiples": "1",
  "etat": "Discuté",
  "signataires": {
    "auteur": {
      "typeAuteur": "Depute",
      "acteurRef": "PA721410",
      "groupePolitiqueRef": "PO730934"
    },
    "cosignatairesRefs": [
      "PA643134",
      "PA267260",
      "PA267901",
      "PA609245",
      "PA721410",
      "PA1029"
    ],
    "texteAffichable": "Mme&#160;Bonnivard,  M.&#160;Kamardine, Mme&#160;Valentin, Mme&#160;Lacroute, M.&#160;Deflesselles et Mme&#160;Poletti"
  },
  "pointeurFragmentTexte": {
    "division": {
      "titre": "Article 14",
      "articleDesignationCourte": "ART. 14",
      "type": "ARTICLE",
      "avantAApres": "A",
      "divisionRattachee": "ARTICLE 14",
      "urlDivisionTexteVise": "/15/textes/1548.asp#D_Article_14"
    }
  },
  "corps": {
    "dispositif": "<p style=\"text-align: justify;\">Supprimer cet article.</p>",
    "exposeSommaire": "<p style=\"text-align: justify;\">L&#8217;article&#160;14 propose un traitement d&#233;mat&#233;rialis&#233; des requ&#234;tes en injonction de payer par un Tribunal de grande instance &#224; comp&#233;tence nationale sp&#233;cialement d&#233;sign&#233;.</p><p style=\"text-align: justify;\">Ce type de contentieux particuli&#232;rement complexe et &#224; la dimension humaine centrale (en raison du caract&#232;re souvent pr&#233;caire de la situation des personnes concern&#233;es) n&#233;cessite un traitement attentif et de proximit&#233;, aujourd&#8217;hui parfaitement rempli par les tribunaux d&#8217;instance, et ne saurait faire l&#8217;objet d&#8217;un traitement automatis&#233; et d&#233;mat&#233;rialis&#233; sans porter gravement atteinte &#224; un &#233;gal acc&#232;s &#224; la justice pour tous et sur l&#8217;ensemble du territoire national.</p><p style=\"text-align: justify;\">D&#8217;une mani&#232;re g&#233;n&#233;rale, l&#8217;&#233;loignement du justiciable de son juge naturel va n&#233;cessairement transf&#233;rer l&#8217;accueil du citoyen aux collectivit&#233;s territoriales, qui devront prendre en charge les cons&#233;quences de la fracture num&#233;rique.</p><p style=\"text-align: justify;\">C&#8217;est pourquoi il convient de supprimer l&#8217;article&#160;14 du pr&#233;sent projet.</p><p style=\"text-align: justify;\">&#160;</p>"
  },
  "representations": [
    {
      "nom": "PDF",
      "typeMime": {
        "type": "application",
        "subType": "PDF"
      },
      "statutRepresentation": {
        "verbatim": true,
        "canonique": true,
        "officielle": true,
        "transcription": false,
        "enregistrement": false
      },
      "contenu": {
        "documentURI": "/15/amendements/1548/AN/141.pdf"
      }
    }
  ],
  "seanceDiscussion": "RUANR5L15S2019IDS21450",
  "sort": {
    "dateSaisie": "2019-01-17T12:19:19.000+01:00",
    "sortEnSeance": "Non soutenu"
  },
  "dateDepot": "2019-01-08T01:00:00.000+01:00",
  "dateDistribution": "2019-01-14T01:00:00.000+01:00",
  "article99": "0",
  "loiReference": {}
}