{
  "uid": "AMANR5L15SEA717460BTC1629P0D1N930",
  "identifiant": {
    "legislature": "15",
    "numero": "930",
    "numRect": "0",
    "saisine": {
      "texteLegislatifRef": "PRJLANR5L15BTC1629",
      "numeroPartiePLF": "0",
      "organeExamen": "PO717460",
      "mentionSecondeDeliberation": "0"
    }
  },
  "numeroLong": "930",
  "etapeTexte": "1ère lecture (1ère assemblée saisie)",
  "triAmendement": "cbaaaaaaaaaaaaaaaaaaaaaaaaaaaaaaaaaaaaaaaaaaaaaaaaaoo",
  "cardinaliteAmdtMultiples": "1",
  "etat": "Discuté",
  "signataires": {
    "auteur": {
      "typeAuteur": "Depute",
      "acteurRef": "PA719138",
      "groupePolitiqueRef": "PO759900"
    },
    "cosignatairesRefs": [
      "PA607619",
      "PA719146",
      "PA405480",
      "PA719286",
      "PA719138"
    ],
    "texteAffichable": "M.&#160;Castellani,  M.&#160;Acquaviva, M.&#160;Colombani, M.&#160;Molac et M.&#160;Pupponi"
  },
  "pointeurFragmentTexte": {
    "division": {
      "titre": "Article 6",
      "articleDesignationCourte": "APRÈS ART. 6",
      "type": "ARTICLE",
      "avantAApres": "Apres",
      "divisionRattachee": "APRÈS L'ARTICLE 6, insérer l'article suivant:",
      "articleAdditionnel": "1",
      "urlDivisionTexteVise": "/15/textes/1629.asp#D_Article_6"
    }
  },
  "corps": {
    "dispositif": "<p style=\"text-align: justify;\">L&#8217;article L.&#160;212&#8209;8 du code de l&#8217;&#233;ducation est compl&#233;t&#233; par un alin&#233;a ainsi r&#233;dig&#233;&#160;:</p><p style=\"text-align: justify;\">&#171;&#160;Les trois premiers alin&#233;as du pr&#233;sent article s&#8217;appliquent lorsqu&#8217;un enfant dont les parents souhaitent la scolarisation en langue r&#233;gionale ne peut trouver dans sa commune de r&#233;sidence une telle facult&#233; alors que celle-ci est disponible dans d&#8217;autres communes.&#160;&#187;</p>",
    "exposeSommaire": "<p style=\"text-align: justify;\">La reconnaissance constitutionnelle des langues r&#233;gionales &#224; l&#8217;initiative des auteurs du pr&#233;sent amendement, op&#233;r&#233;e par la r&#233;cente r&#233;vision constitutionnelle du 23 juillet 2008, implique que leur soit donn&#233; un cadre l&#233;gislatif et que soient cr&#233;&#233;s les outils juridiques n&#233;cessaires &#224; leur sauvegarde.</p><p style=\"text-align: justify;\">Par l&#8217;article&#160;75&#8209;1, le Constituant a reconnu que la sauvegarde des langues r&#233;gionales n&#8217;&#233;tait pas seulement l&#8217;affaire de leurs locuteurs, mais concerne la collectivit&#233; nationale dans son ensemble car ces langues constituent un patrimoine commun &#224; l&#8217;ensemble de la France.</p><p style=\"text-align: justify;\">Avec cette avanc&#233;e constitutionnelle notre Nation a enfin reconnu que l&#8217;unit&#233; n&#8217;est pas l&#8217;uniformit&#233;, que l&#8217;&#233;galit&#233; est non pas la confusion, mais la possibilit&#233; pour chacun d&#8217;&#234;tre soi-m&#234;me. Pour bon nombre de nos concitoyens, les langues r&#233;gionales signifient quelque chose d&#8217;important, m&#234;me pour ceux qui ne les ma&#238;trisent pas totalement, ou qui ne sont pas des locuteurs habituels.</p><p style=\"text-align: justify;\">Il n&#8217;existe actuellement aucun cadre l&#233;gislatif consistant sur l&#8217;usage des langues r&#233;gionales.</p><p style=\"text-align: justify;\">Ainsi, le code de l&#8217;&#233;ducation comporte seulement une facult&#233; pour les autorit&#233;s acad&#233;miques d&#8217;inclure les langues r&#233;gionales dans l&#8217;enseignement, les modalit&#233;s de cette inclusion &#233;tant laiss&#233;es &#224; son appr&#233;ciation et pr&#233;cis&#233;es par de simples circulaires.</p><p style=\"text-align: justify;\">Par ailleurs, la loi du 4 ao&#251;t 1994 sur l&#8217;emploi de la langue fran&#231;aise a &#233;t&#233; interpr&#233;t&#233;e par le Conseil d&#8217;&#201;tat dans le sens d&#8217;une restriction de l&#8217;utilisation de la m&#233;thode immersive.</p><p style=\"text-align: justify;\">Il arrive m&#234;me que, dans le cadre du service public de l&#8217;enseignement, les langues r&#233;gionales de France soient moins bien trait&#233;es que les langues &#233;trang&#232;res.</p><p style=\"text-align: justify;\">C&#8217;est pourquoi, il convient de d&#233;terminer le r&#233;gime de l&#8217;enseignement des langues r&#233;gionales et pr&#233;ciser les r&#232;gles de protection et de promotion de l&#8217;enseignement de ces langues dans les secteurs de l&#8217;enseignement primaire, secondaire et sup&#233;rieur.</p><p style=\"text-align: justify;\">Le pr&#233;sent amendement vise, dans cette perspective &#224; faciliter la scolarisation en langue r&#233;gionale pour les enfants qui ne peuvent b&#233;n&#233;ficier d&#8217;un tel enseignement dans leurs communes de r&#233;sidence.</p>"
  },
  "representations": [
    {
      "nom": "PDF",
      "typeMime": {
        "type": "application",
        "subType": "PDF"
      },
      "statutRepresentation": {
        "verbatim": true,
        "canonique": true,
        "officielle": true,
        "transcription": false,
        "enregistrement": false
      },
      "contenu": {
        "documentURI": "/15/amendements/1629/AN/930.pdf"
      }
    }
  ],
  "seanceDiscussion": "RUANR5L15S2019IDS21506",
  "sort": {
    "dateSaisie": "2019-02-15T11:12:42.000+01:00",
    "sortEnSeance": "Rejeté"
  },
  "dateDepot": "2019-02-07T01:00:00.000+01:00",
  "dateDistribution": "2019-02-11T01:00:00.000+01:00",
  "article99": "0",
  "loiReference": {
    "codeLoi": "c éducation",
    "divisionCodeLoi": "L212-8"
  }
}