{
  "uid": "AMANR5L15PO420120B0904P0D1N1299",
  "identifiant": {
    "legislature": "15",
    "numero": "1299",
    "numRect": "0",
    "saisine": {
      "texteLegislatifRef": "PRJLANR5L15B0904",
      "numeroPartiePLF": "0",
      "organeExamen": "PO420120",
      "mentionSecondeDeliberation": "0"
    }
  },
  "numeroLong": "AS1299",
  "etapeTexte": "1ère lecture (1ère assemblée saisie)",
  "triAmendement": "pyci",
  "cardinaliteAmdtMultiples": "1",
  "etat": "Retiré",
  "signataires": {
    "auteur": {
      "typeAuteur": "Depute",
      "acteurRef": "PA719570",
      "groupePolitiqueRef": "PO730964"
    },
    "cosignatairesRefs": [
      "PA719570"
    ],
    "texteAffichable": "Mme&#160;Fabre, rapporteure"
  },
  "pointeurFragmentTexte": {
    "division": {
      "titre": "Article PREMIER",
      "articleDesignationCourte": "ART. PREMIER",
      "type": "ARTICLE",
      "avantAApres": "A",
      "divisionRattachee": "ARTICLE PREMIER",
      "urlDivisionTexteVise": "/15/textes/0904.asp#D_Article_1er"
    },
    "alinea": {
      "avantAApres": "A",
      "numero": "95",
      "alineaDesignation": "Alinéa 95"
    }
  },
  "corps": {
    "dispositif": "<p style=\"text-align: justify;\">&#192; la fin de l&#8217;alin&#233;a&#160;95, substituer aux mots&#160;:</p><p style=\"text-align: justify;\">&#171;&#160;inscrits sur son compte.&#160;&#187;</p><p style=\"text-align: justify;\">les mots&#160;:</p><p style=\"text-align: justify;\">&#171;&#160;qui y sont inscrits.&#160;&#187;</p>",
    "exposeSommaire": "<p style=\"text-align: justify;\">Amendement r&#233;dactionnel.</p>"
  },
  "representations": [
    {
      "nom": "PDF",
      "typeMime": {
        "type": "application",
        "subType": "PDF"
      },
      "statutRepresentation": {
        "verbatim": true,
        "canonique": true,
        "officielle": true,
        "transcription": false,
        "enregistrement": false
      },
      "contenu": {
        "documentURI": "/15/amendements/0904/CION-SOC/AS1299.pdf"
      }
    }
  ],
  "dateDepot": "2018-05-26T02:00:00.000+02:00",
  "dateDistribution": "2018-05-26T02:00:00.000+02:00",
  "article99": "0",
  "loiReference": {}
}