{
  "uid": "AMANR5L15SEA717460BTC0417P0D1N36",
  "identifiant": {
    "legislature": "15",
    "numero": "36",
    "numRect": "0",
    "saisine": {
      "texteLegislatifRef": "PRJLANR5L15BTC0417",
      "numeroPartiePLF": "0",
      "organeExamen": "PO717460",
      "mentionSecondeDeliberation": "0"
    }
  },
  "numeroLong": "36",
  "etapeTexte": "Nouvelle Lecture",
  "triAmendement": "y",
  "cardinaliteAmdtMultiples": "1",
  "etat": "Discuté",
  "signataires": {
    "auteur": {
      "typeAuteur": "Depute",
      "acteurRef": "PA719310",
      "groupePolitiqueRef": "PO730964"
    },
    "cosignatairesRefs": [
      "PA719310"
    ],
    "texteAffichable": "Mme&#160;de Lavergne"
  },
  "pointeurFragmentTexte": {
    "division": {
      "titre": "Article 4",
      "articleDesignationCourte": "ART. 4",
      "type": "ARTICLE",
      "avantAApres": "A",
      "divisionRattachee": "ARTICLE 4",
      "urlDivisionTexteVise": "/15/textes/0417.asp#D_Article_4"
    },
    "alinea": {
      "avantAApres": "Apres",
      "numero": "62"
    }
  },
  "corps": {
    "dispositif": "<p style=\"text-align: justify;\">Apr&#232;s l&#8217;alin&#233;a&#160;62, ins&#233;rer l&#8217;alin&#233;a suivant&#160;:</p><p style=\"text-align: justify;\">&#171;&#160;Pour les tarifs d&#8217;utilisation des r&#233;seaux de transport de gaz, ces co&#251;ts comprennent &#233;galement une partie des co&#251;ts de raccordement &#224; ces r&#233;seaux des installations de production de biogaz. Le niveau de prise en charge, arr&#234;t&#233; par l&#8217;autorit&#233; administrative, apr&#232;s avis de la Commission de r&#233;gulation de l&#8217;&#233;nergie, ne peut exc&#233;der 40&#160;% du co&#251;t du raccordement.&#160;&#187;</p>",
    "exposeSommaire": "<p style=\"text-align: justify;\">Le pr&#233;sent amendement permet aux tarifs de transport de gaz de couvrir une partie des co&#251;ts de raccordement des producteurs de biogaz aux r&#233;seaux de transport afin de rem&#233;dier &#224; l&#8217;asym&#233;trie actuelle entre les porteurs de projet selon qu&#8217;ils peuvent se raccorder aux r&#233;seaux de transport ou de distribution. Cette prise en charge partielle du co&#251;t de raccordement par le tarif, appel&#233;e &#171;&#160;r&#233;faction tarifaire &#187;, est en effet pour l&#8217;instant uniquement r&#233;serv&#233;e aux producteurs de biogaz raccord&#233;s aux r&#233;seaux de distribution de gaz naturel desservant plus de 100&#160;000 consommateurs (dispositions introduites par la loi&#160;n&#176;&#160;2017-227&#160;du 24 f&#233;vrier 2017).</p><p style=\"text-align: justify;\">La prise en charge du co&#251;t du raccordement est plafonn&#233;e &#224; 40 % de son co&#251;t total. Le taux applicable sera d&#233;fini par arr&#234;t&#233;. Cette disposition n&#8217;impactera que de mani&#232;re tr&#232;s n&#233;gligeable les tarifs d&#8217;utilisation des r&#233;seaux de transport de gaz naturel et permettra d&#8217;inciter au d&#233;veloppement des installations de biom&#233;thane, et ainsi de contribuer aux objectifs de d&#233;veloppement du biogaz fix&#233;s par le d&#233;cret relatif &#224; la programmation pluriannuelle de l&#8217;&#233;nergie : 1,7 TWh d&#8217;injection de biom&#233;thane dans le r&#233;seau de gaz en 2018 et 8 TWh en 2023.</p>"
  },
  "representations": [
    {
      "nom": "PDF",
      "typeMime": {
        "type": "application",
        "subType": "PDF"
      },
      "statutRepresentation": {
        "verbatim": true,
        "canonique": true,
        "officielle": true,
        "transcription": false,
        "enregistrement": false
      },
      "contenu": {
        "documentURI": "/15/amendements/0417/AN/36.pdf"
      }
    }
  ],
  "seanceDiscussion": "RUANR5L15S2018IDS20843",
  "sort": {
    "dateSaisie": "2017-12-01T11:51:11.000+01:00",
    "sortEnSeance": "Adopté"
  },
  "dateDepot": "2017-11-25T01:00:00.000+01:00",
  "dateDistribution": "2017-11-28T01:00:00.000+01:00",
  "article99": "0",
  "loiReference": {}
}