{
  "uid": "AMANR5L15PO59051B0840P0D1N61",
  "identifiant": {
    "legislature": "15",
    "numero": "61",
    "numRect": "0",
    "saisine": {
      "texteLegislatifRef": "PIONANR5L15B0840",
      "numeroPartiePLF": "0",
      "organeExamen": "PO59051",
      "mentionSecondeDeliberation": "0"
    }
  },
  "numeroLong": "CL61",
  "etapeTexte": "1ère lecture (1ère assemblée saisie)",
  "triAmendement": "i",
  "cardinaliteAmdtMultiples": "1",
  "etat": "Discuté",
  "signataires": {
    "auteur": {
      "typeAuteur": "Depute",
      "acteurRef": "PA720746",
      "groupePolitiqueRef": "PO730970"
    },
    "cosignatairesRefs": [
      "PA720746"
    ],
    "texteAffichable": "M.&#160;Waserman, rapporteur"
  },
  "pointeurFragmentTexte": {
    "division": {
      "titre": "Article 21",
      "articleDesignationCourte": "ART. 21",
      "type": "ARTICLE",
      "avantAApres": "A",
      "divisionRattachee": "ARTICLE 21",
      "urlDivisionTexteVise": "/15/textes/0840.asp#D_Article_21"
    },
    "alinea": {
      "avantAApres": "A",
      "numero": "1",
      "alineaDesignation": "Alinéa 1"
    }
  },
  "corps": {
    "dispositif": "<p style=\"text-align: justify;\">Substituer aux alin&#233;as&#160;1 &#224;&#160;5 les quatre alin&#233;as suivants&#160;:</p><p style=\"text-align: justify;\">&#171;&#160;La section&#160;1 du chapitre&#160;4 du titre&#160;I<sup>er</sup> du livre&#160;I<sup>er</sup> du code de la s&#233;curit&#233; sociale est ainsi r&#233;dig&#233;e&#160;:</p><p style=\"text-align: justify;\">&#171;&#160;Section&#160;1</p><p style=\"text-align: justify;\">&#171;&#160;<i>Haut conseil du financement de la protection sociale</i></p><p style=\"text-align: justify;\">&#171;&#160;<i>Art.&#160;L.&#160;114&#8209;1&#160;A</i>.&#160;&#8211;&#160;I.&#160;&#8211;&#160;Le Haut conseil du financement de la protection sociale comprend parmi ses membres deux d&#233;put&#233;s et deux s&#233;nateurs.&#160;&#187;</p>",
    "exposeSommaire": "<p>Amendement de pr&#233;cision. Il est notamment propos&#233; de supprimer la mention de la tutelle minist&#233;rielle.</p>"
  },
  "representations": [
    {
      "nom": "PDF",
      "typeMime": {
        "type": "application",
        "subType": "PDF"
      },
      "statutRepresentation": {
        "verbatim": true,
        "canonique": true,
        "officielle": true,
        "transcription": false,
        "enregistrement": false
      },
      "contenu": {
        "documentURI": "/15/amendements/0840/CION_LOIS/CL61.pdf"
      }
    }
  ],
  "sort": {
    "dateSaisie": "2018-05-10T00:13:55.000+02:00",
    "sortEnSeance": "Adopté"
  },
  "dateDepot": "2018-05-08T02:00:00.000+02:00",
  "dateDistribution": "2018-05-08T02:00:00.000+02:00",
  "article99": "0",
  "loiReference": {}
}