{
  "uid": "AMANR5L15PO59048B2272P2D1N1238",
  "identifiant": {
    "legislature": "15",
    "numero": "1238",
    "numRect": "0",
    "saisine": {
      "texteLegislatifRef": "PRJLANR5L15B2272",
      "numeroPartiePLF": "2",
      "organeExamen": "PO59048",
      "mentionSecondeDeliberation": "0"
    }
  },
  "numeroLong": "II-CF1238",
  "etapeTexte": "1ère lecture (1ère assemblée saisie)",
  "triAmendement": "jdaaaaaaaaaaaaaaaaaaaaaaaaaaaaaaaaaaaaaaaaaaaaaaaabu",
  "cardinaliteAmdtMultiples": "1",
  "etat": "Discuté",
  "signataires": {
    "auteur": {
      "typeAuteur": "Depute",
      "acteurRef": "PA720002",
      "groupePolitiqueRef": "PO730970"
    },
    "cosignatairesRefs": [
      "PA720002"
    ],
    "texteAffichable": "Mme&#160;El Ha&#239;ry"
  },
  "pointeurFragmentTexte": {
    "division": {
      "titre": "Article 60",
      "articleDesignationCourte": "APRÈS ART. 60",
      "type": "ARTICLE",
      "avantAApres": "Apres",
      "divisionRattachee": "APRÈS L'ARTICLE 60, insérer l'article suivant:",
      "articleAdditionnel": "1",
      "urlDivisionTexteVise": "/15/textes/2272C.asp#D_Article_60"
    }
  },
  "corps": {
    "dispositif": "<p style=\"text-align: justify;\">Le Gouvernement remet au Parlement un rapport avant le 1<sup>er</sup> janvier 2021 sur les effets de la r&#233;duction du taux de TVA dont profite aujourd&#8217;hui le milieu de la restauration, notamment terme d&#8217;emplois.</p>",
    "exposeSommaire": "<p style=\"text-align: justify;\">Cet amendement vise &#224; supprimer le taux de TVA r&#233;duite dont profite aujourd&#8217;hui le milieu de la restauration. Mise en place il y a dix ans, en 2009, cette mesure visait &#224; soutenir l&#8217;emploi dans ce secteur. Cette baisse de TVA devait &#234;tre contrebalanc&#233;e par une r&#233;percutions de celle-ci sur au moins sept produits et par la cr&#233;ation de 40.000 emplois sur deux ans.</p><p style=\"text-align: justify;\">Or, puisque cette mesure pr&#233;sente un co&#251;t &#233;lev&#233; pour les finances de l&#8217;&#201;tat, il convient de r&#233;aliser un bilan des effets de cette r&#233;duction de taux, notamment en mati&#232;re de cr&#233;ation d&#8217;emplois.</p>"
  },
  "representations": [
    {
      "nom": "PDF",
      "typeMime": {
        "type": "application",
        "subType": "PDF"
      },
      "statutRepresentation": {
        "verbatim": true,
        "canonique": true,
        "officielle": true,
        "transcription": false,
        "enregistrement": false
      },
      "contenu": {
        "documentURI": "/15/amendements/2272C/CION_FIN/CF1238.pdf"
      }
    }
  ],
  "sort": {
    "dateSaisie": "2019-11-06T23:10:21.000+01:00",
    "sortEnSeance": "Non soutenu"
  },
  "dateDepot": "2019-10-31T01:00:00.000+01:00",
  "dateDistribution": "2019-11-06T01:00:00.000+01:00",
  "article99": "0",
  "loiReference": {
    "codeLoi": "zz rapport"
  }
}