{
  "uid": "AMANR5L15PO420120B1328P0D1N15",
  "identifiant": {
    "legislature": "15",
    "numero": "15",
    "numRect": "0",
    "saisine": {
      "texteLegislatifRef": "PIONANR5L15B1328",
      "numeroPartiePLF": "0",
      "organeExamen": "PO420120",
      "mentionSecondeDeliberation": "0"
    }
  },
  "numeroLong": "AS15",
  "etapeTexte": "1ère lecture (1ère assemblée saisie)",
  "triAmendement": "faaaaaaaaaaaaaaaaaaaaaaaaaaaaaaaaaaaaaaaaaaaaaaaaai",
  "cardinaliteAmdtMultiples": "1",
  "etat": "Discuté",
  "signataires": {
    "auteur": {
      "typeAuteur": "Depute",
      "acteurRef": "PA642764",
      "groupePolitiqueRef": "PO758835"
    },
    "cosignatairesRefs": [
      "PA642764",
      "PA719930",
      "PA508",
      "PA610681",
      "PA643145"
    ],
    "texteAffichable": "M.&#160;Aviragnet,  Mme&#160;Bareigts, Mme&#160;Bi&#233;mouret, Mme&#160;Vainqueur-Christophe et M.&#160;Vallaud"
  },
  "pointeurFragmentTexte": {
    "division": {
      "titre": "Article 3",
      "articleDesignationCourte": "APRÈS ART. 3",
      "type": "ARTICLE",
      "avantAApres": "Apres",
      "divisionRattachee": "APRÈS L'ARTICLE 3, insérer l'article suivant:",
      "articleAdditionnel": "1",
      "urlDivisionTexteVise": "/15/textes/1328.asp#D_Article_3"
    }
  },
  "corps": {
    "dispositif": "<p style=\"text-align: justify;\">I.&#160;&#8211;&#160;Dans un d&#233;lai de six mois &#224; compter de la promulgation de la pr&#233;sente loi, le Gouvernement remet au Parlement un rapport dressant un bilan exhaustif des d&#233;penses sociales relatives &#224; l'allocation journali&#232;re de pr&#233;sence parentale (AJPP).</p><p style=\"text-align: justify;\">II.&#160;&#8211;&#160;Le rapport &#233;value le taux de recours &#224; l'AJPP.</p><p style=\"text-align: justify;\">III.&#160;&#8211;&#160;Le rapport s'attache &#224; pr&#233;senter diff&#233;rentes pistes d'am&#233;lioration de cette prestation sociale d&#233;di&#233;e.</p>",
    "exposeSommaire": "<p style=\"text-align: justify;\">Le groupe socialiste et apparent&#233;s propose cette demande de rapport qui vise &#224; &#233;tablir un &#233;tat des lieux de l&#8217;allocation journali&#232;re de pr&#233;sence parentale.</p><p style=\"text-align: justify;\">En effet, il ressort des auditons men&#233;es par la rapporteure que les derni&#232;res &#233;tudes en la mati&#232;re datent de 2003. Or, il convient d&#8217;actualiser ces &#233;tudes afin d&#8217;avoir une compr&#233;hension plus fine de cette prestation sociale.</p><p style=\"text-align: justify;\">Cette allocation est attribu&#233;e aux parents ou &#224; toute personne qui assume la charge d&#8217;un enfant atteint d&#8217;une maladie, d&#8217;un handicap ou victime d&#8217;un accident d&#8217;une particuli&#232;re gravit&#233;, rendant indispensable une pr&#233;sence soutenue aupr&#232;s de l&#8217;enfant et des soins contraignants.</p><p style=\"text-align: justify;\">Il apparait que le recours &#224; cette allocation pourrait &#234;tre am&#233;lior&#233; quantitativement et qualitativement. N&#233;anmoins, une analyse exhaustive de cette AJPP semble n&#233;cessaire &#224; la repr&#233;sentation nationale pour pouvoir l&#233;gif&#233;rer sereinement.</p>"
  },
  "representations": [
    {
      "nom": "PDF",
      "typeMime": {
        "type": "application",
        "subType": "PDF"
      },
      "statutRepresentation": {
        "verbatim": true,
        "canonique": true,
        "officielle": true,
        "transcription": false,
        "enregistrement": false
      },
      "contenu": {
        "documentURI": "/15/amendements/1328/CION-SOC/AS15.pdf"
      }
    }
  ],
  "sort": {
    "dateSaisie": "2018-11-21T11:27:10.000+01:00",
    "sortEnSeance": "Rejeté"
  },
  "dateDepot": "2018-11-16T01:00:00.000+01:00",
  "dateDistribution": "2018-11-20T01:00:00.000+01:00",
  "article99": "0",
  "loiReference": {
    "codeLoi": "zzz"
  }
}