{
  "uid": "AMANR5L15SEA717460B2296P0D1N382",
  "identifiant": {
    "legislature": "15",
    "numero": "382",
    "numRect": "0",
    "saisine": {
      "texteLegislatifRef": "PRJLANR5L15B2296",
      "numeroPartiePLF": "0",
      "organeExamen": "PO717460",
      "mentionSecondeDeliberation": "0"
    }
  },
  "numeroLong": "382",
  "etapeTexte": "1ère lecture (1ère assemblée saisie)",
  "triAmendement": "jaaaaaaaaaaaaaaaaaaaaaaaaaaaaaaaaaaaaaaaaaaaaaaaaac",
  "cardinaliteAmdtMultiples": "1",
  "etat": "Irrecevable",
  "signataires": {
    "auteur": {
      "typeAuteur": "Depute",
      "acteurRef": "PA642868",
      "groupePolitiqueRef": "PO767217"
    },
    "cosignatairesRefs": [
      "PA267330",
      "PA267780",
      "PA720230",
      "PA267241",
      "PA712014",
      "PA267355",
      "PA642868",
      "PA721632",
      "PA721110",
      "PA721486",
      "PA342601",
      "PA331567",
      "PA267585"
    ],
    "texteAffichable": "M.&#160;Christophe,  M.&#160;Brindeau, Mme&#160;de La Raudi&#232;re, M.&#160;Demilly, Mme&#160;Firmin Le Bodo, M.&#160;Herth, M.&#160;Ledoux, Mme&#160;Lemoine, Mme&#160;Magnier, M.&#160;Naegelen, Mme&#160;Sanquer, M.&#160;Vercamer et M.&#160;Zumkeller"
  },
  "pointeurFragmentTexte": {
    "division": {
      "titre": "Article 43",
      "articleDesignationCourte": "APRÈS ART. 43",
      "type": "ARTICLE",
      "avantAApres": "Apres",
      "divisionRattachee": "APRÈS L'ARTICLE 43, insérer l'article suivant:",
      "articleAdditionnel": "1",
      "urlDivisionTexteVise": "/15/textes/2296.asp#D_Article_43"
    }
  },
  "corps": {},
  "representations": [
    {
      "nom": "PDF",
      "typeMime": {
        "type": "application",
        "subType": "PDF"
      },
      "statutRepresentation": {
        "verbatim": true,
        "canonique": true,
        "officielle": true,
        "transcription": false,
        "enregistrement": false
      },
      "contenu": {
        "documentURI": "/15/amendements/2296/AN/382.pdf"
      }
    }
  ],
  "dateDepot": "2019-10-16T02:00:00.000+02:00",
  "dateDistribution": "2019-10-21T02:00:00.000+02:00",
  "article99": "0",
  "loiReference": {
    "codeLoi": "c santé publique",
    "divisionCodeLoi": "L1123-7"
  }
}