{
  "uid": "AMANR5L15SEA717460BTC1767P0D1N1631",
  "identifiant": {
    "legislature": "15",
    "numero": "1631",
    "numRect": "0",
    "saisine": {
      "texteLegislatifRef": "PRJLANR5L15BTC1767",
      "numeroPartiePLF": "0",
      "organeExamen": "PO717460",
      "mentionSecondeDeliberation": "0"
    }
  },
  "numeroLong": "1631",
  "etapeTexte": "1ère lecture (1ère assemblée saisie)",
  "triAmendement": "doaaaaaaaaaaaaaaaaaaaaaaaaaaaaaaaaaaaaaaaaaaaaaaaabbdoyokko",
  "cardinaliteAmdtMultiples": "1",
  "etat": "Discuté",
  "signataires": {
    "auteur": {
      "typeAuteur": "Depute",
      "acteurRef": "PA718926",
      "groupePolitiqueRef": "PO730940"
    },
    "cosignatairesRefs": [
      "PA720546",
      "PA441",
      "PA722110",
      "PA718720",
      "PA721270",
      "PA610654",
      "PA610667",
      "PA689",
      "PA720692",
      "PA267306",
      "PA721896",
      "PA722202",
      "PA718926",
      "PA721118",
      "PA721012",
      "PA335612"
    ],
    "texteAffichable": "M.&#160;Dharr&#233;ville,  M.&#160;Bruneel, M.&#160;Jumel, Mme&#160;Bello, M.&#160;Brotherson, Mme&#160;Buffet, M.&#160;Chassaigne, M.&#160;Dufr&#232;gne, Mme&#160;Faucillon, Mme&#160;K&#233;clard-Mond&#233;sir, M.&#160;Lecoq, M.&#160;Nilor, M.&#160;Peu, M.&#160;Fabien&#160;Roussel, M.&#160;Serville et M.&#160;Wulfranc"
  },
  "pointeurFragmentTexte": {
    "division": {
      "titre": "Article 8",
      "articleDesignationCourte": "ART. 8",
      "type": "ARTICLE",
      "avantAApres": "A",
      "divisionRattachee": "ARTICLE 8",
      "urlDivisionTexteVise": "/15/textes/1767.asp#D_Article_8"
    },
    "alinea": {
      "avantAApres": "A",
      "numero": "7",
      "alineaDesignation": "Alinéa 7"
    }
  },
  "corps": {
    "dispositif": "<p style=\"text-align: justify;\">I.&#160;&#8211;&#160;&#192; la seconde phrase de l&#8217;alin&#233;a&#160;7, apr&#232;s le mot&#160;:</p><p style=\"text-align: justify;\">&#171;&#160;m&#233;decine&#160;&#187;,</p><p style=\"text-align: justify;\">ins&#233;rer les mots&#160;:</p><p style=\"text-align: justify;\">&#171;&#160;, de chirurgie et d&#8217;obst&#233;trique&#160;&#187;.</p><p style=\"text-align: justify;\">II.&#160;&#8211;&#160;En cons&#233;quence, &#224; la fin de la m&#234;me phrase, supprimer les mots&#160;:</p><p style=\"text-align: justify;\">&#171;&#160;n&#8217;exercent pas d&#8217;activit&#233; de chirurgie ni d&#8217;obst&#233;trique&#160;&#187;.</p>",
    "exposeSommaire": "<p style=\"text-align: justify;\">L&#8217;h&#244;pital de proximit&#233; ne peut pas &#234;tre le reflet d&#8217;un syst&#232;me de sant&#233; &#224; deux vitesses. Il doit &#234;tre au service d&#8217;un meilleur maillage territorial du service public hospitalier comme d&#8217;une am&#233;lioration de l&#8217;acc&#232;s aux soins.</p><p style=\"text-align: justify;\">C&#8217;est pourquoi nous proposons &#224; travers cet amendement que les h&#244;pitaux de proximit&#233; soient d&#233;finis comme des &#233;tablissements assurant les activit&#233;s suivantes&#160;: &#160;m&#233;decine, chirurgie, unit&#233; obst&#233;trique, soins de suite et de structures pour les personnes &#226;g&#233;es.</p><p style=\"text-align: justify;\">Ils seraient en lien avec la m&#233;decine de ville, un r&#233;seau de centres de sant&#233;&#160;et la psychiatrie de secteur.</p>"
  },
  "representations": [
    {
      "nom": "PDF",
      "typeMime": {
        "type": "application",
        "subType": "PDF"
      },
      "statutRepresentation": {
        "verbatim": true,
        "canonique": true,
        "officielle": true,
        "transcription": false,
        "enregistrement": false
      },
      "contenu": {
        "documentURI": "/15/amendements/1767/AN/1631.pdf"
      }
    }
  ],
  "seanceDiscussion": "RUANR5L15S2019IDS21565",
  "sort": {
    "dateSaisie": "2019-03-22T10:54:09.000+01:00",
    "sortEnSeance": "Rejeté"
  },
  "dateDepot": "2019-03-15T01:00:00.000+01:00",
  "dateDistribution": "2019-03-19T01:00:00.000+01:00",
  "article99": "0",
  "loiReference": {}
}