{
  "uid": "AMANR5L15SEA717460BTC0581P0D1N10",
  "identifiant": {
    "legislature": "15",
    "numero": "10",
    "numRect": "0",
    "saisine": {
      "texteLegislatifRef": "PIONANR5L15BTC0581",
      "numeroPartiePLF": "0",
      "organeExamen": "PO717460",
      "mentionSecondeDeliberation": "0"
    }
  },
  "numeroLong": "10",
  "etapeTexte": "1ère lecture (1ère assemblée saisie)",
  "triAmendement": "alu",
  "cardinaliteAmdtMultiples": "1",
  "etat": "Discuté",
  "signataires": {
    "auteur": {
      "typeAuteur": "Depute",
      "acteurRef": "PA642847",
      "groupePolitiqueRef": "PO730934"
    },
    "cosignatairesRefs": [
      "PA332523",
      "PA267450",
      "PA608016",
      "PA712015",
      "PA334843",
      "PA2377",
      "PA266793",
      "PA718784",
      "PA721046",
      "PA719318",
      "PA720386",
      "PA609245",
      "PA609726",
      "PA718838",
      "PA719946",
      "PA642847",
      "PA2086",
      "PA1874",
      "PA267794",
      "PA721314",
      "PA1327",
      "PA605991",
      "PA719272",
      "PA340853",
      "PA2492"
    ],
    "texteAffichable": "M.&#160;Bazin,  Mme&#160;Anthoine, M.&#160;Aubert, Mme&#160;Bassire, M.&#160;Bony, M.&#160;Brun, Mme&#160;Dalloz, M.&#160;R&#233;mi&#160;Delatte, M.&#160;Di Filippo, M.&#160;Dive, M.&#160;Forissier, Mme&#160;Genevard, M.&#160;Leclerc, Mme&#160;Lacroute, M.&#160;Le Fur, Mme&#160;Louwagie, M.&#160;Marlin, Mme&#160;Meunier, M.&#160;Pauget, M.&#160;Peltier, M.&#160;Perrut, M.&#160;Quentin, M.&#160;Schellenberger, Mme&#160;Tabarot et M.&#160;Verch&#232;re"
  },
  "pointeurFragmentTexte": {
    "division": {
      "titre": "Article PREMIER",
      "articleDesignationCourte": "ART. PREMIER",
      "type": "ARTICLE",
      "avantAApres": "A",
      "divisionRattachee": "ARTICLE PREMIER",
      "urlDivisionTexteVise": "/15/textes/0581.asp#D_Article_1er"
    },
    "alinea": {
      "numero": "1"
    }
  },
  "corps": {
    "dispositif": "<p style=\"text-align: justify;\">R&#233;diger ainsi l&#8217;alin&#233;a&#160;1&#160;:</p><p style=\"text-align: justify;\">&#171;&#160;Les communes membres d&#8217;une communaut&#233; de communes qui n&#8217;exerce pas, &#224; titre optionnel ou facultatif, les comp&#233;tences relatives &#224; l&#8217;eau ou &#224; l&#8217;assainissement, peuvent s&#8217;opposer au transfert obligatoire de ces deux comp&#233;tences, ou de l&#8217;une d&#8217;entre elles, &#224; la communaut&#233; de communes, r&#233;sultant du&#160;IV de l&#8217;article&#160;64 de la loi n&#176;&#160;2015&#8209;991 du&#160;7&#160;ao&#251;t&#160;2015 portant nouvelle organisation territoriale de la R&#233;publique.&#160;&#187;</p>",
    "exposeSommaire": "<p style=\"text-align: justify;\">La loi NOTRe du 7 ao&#251;t 2015 a transform&#233; les comp&#233;tences &#171;&#160;eau&#160;&#187; et &#171;&#160;assainissement&#160;&#187; des communaut&#233;s de communes et communaut&#233;s d&#8217;agglom&#233;ration, jusqu&#8217;alors optionnelles, en une comp&#233;tence obligatoire, &#224; compter du 1<sup>er</sup> janvier 2020.</p><p style=\"text-align: justify;\">Cette disposition a &#233;t&#233; vivement critiqu&#233;e et plusieurs amendements ou propositions de loi ont d&#233;j&#224; &#233;t&#233; discut&#233;s afin de redonner un caract&#232;re optionnel &#224; ce transfert de comp&#233;tence.</p><p style=\"text-align: justify;\">La commune est un &#233;chelon central de la d&#233;mocratie locale. Elle doit pouvoir g&#233;rer elle-m&#234;me ses propres comp&#233;tences.</p><p style=\"text-align: justify;\">Il convient de permettre &#224; chaque territoire de choisir en fonction de sa sp&#233;cificit&#233; g&#233;ographique et de pr&#233;server la libert&#233; des collectivit&#233;s de d&#233;terminer l&#8217;&#233;chelon administratif le plus adapt&#233; dans l&#8217;int&#233;r&#234;t des citoyens.</p><p style=\"text-align: justify;\">C&#8217;est pourquoi cet amendement vous propose de laisser &#224; chaque commune la possibilit&#233; de refuser ce transfert.</p>"
  },
  "representations": [
    {
      "nom": "PDF",
      "typeMime": {
        "type": "application",
        "subType": "PDF"
      },
      "statutRepresentation": {
        "verbatim": true,
        "canonique": true,
        "officielle": true,
        "transcription": false,
        "enregistrement": false
      },
      "contenu": {
        "documentURI": "/15/amendements/0581/AN/10.pdf"
      }
    }
  ],
  "seanceDiscussion": "RUANR5L15S2018IDS20888",
  "sort": {
    "dateSaisie": "2018-01-31T01:07:18.000+01:00",
    "sortEnSeance": "Rejeté"
  },
  "dateDepot": "2018-01-25T01:00:00.000+01:00",
  "dateDistribution": "2018-01-29T01:00:00.000+01:00",
  "article99": "0",
  "loiReference": {}
}