{
  "uid": "AMANR5L15SEA717460BTC2243P0D1N36",
  "identifiant": {
    "legislature": "15",
    "numero": "36",
    "numRect": "0",
    "saisine": {
      "texteLegislatifRef": "PRJLANR5L15BTC2243",
      "numeroPartiePLF": "0",
      "organeExamen": "PO717460",
      "mentionSecondeDeliberation": "0"
    }
  },
  "numeroLong": "36",
  "etapeTexte": "1ère lecture (1ère assemblée saisie)",
  "triAmendement": "acaaaaaaaaaaaaaaaaaaaaaaaaaaaaaaaaaaaaaaaaaaaaaaaahbxnw",
  "cardinaliteAmdtMultiples": "1",
  "etat": "Discuté",
  "signataires": {
    "auteur": {
      "typeAuteur": "Depute",
      "acteurRef": "PA330008",
      "groupePolitiqueRef": "PO730934"
    },
    "cosignatairesRefs": [
      "PA643134",
      "PA2796",
      "PA606098",
      "PA721286",
      "PA721046",
      "PA1012",
      "PA719318",
      "PA330008",
      "PA722390"
    ],
    "texteAffichable": "M.&#160;Breton,  Mme&#160;Corneloup, M.&#160;Ramadier, Mme&#160;Anthoine, M.&#160;Marleix, Mme&#160;Bassire, Mme&#160;Valentin, M.&#160;Teissier et M.&#160;de la Verpilli&#232;re"
  },
  "pointeurFragmentTexte": {
    "division": {
      "titre": "Article PREMIER",
      "articleDesignationCourte": "ART. PREMIER",
      "type": "ARTICLE",
      "avantAApres": "A",
      "divisionRattachee": "ARTICLE PREMIER",
      "urlDivisionTexteVise": "/15/textes/2243.asp#D_Article_1er"
    },
    "alinea": {
      "numero": "26"
    }
  },
  "corps": {
    "dispositif": "<p>&#192; la premi&#232;re phrase de l&#8217;alin&#233;a&#160;26, apr&#232;s le mot&#160;:</p><p style=\"text-align: justify;\">&#171;&#160;con&#231;us&#160;&#187;,</p><p style=\"text-align: justify;\">ins&#233;rer les mots&#160;:</p><p style=\"text-align: justify;\">&#171;&#160;avec les gam&#232;tes de l&#8217;un au moins des membres d&#8217;un couple&#160;&#187;.</p>",
    "exposeSommaire": "<p style=\"text-align: justify;\">La loi de bio&#233;thique de 1994 exige que l&#8217;un au moins des membres du couple fournisse ses gam&#232;tes pour concevoir l&#8217;embryon humain qui sera implant&#233; dans l&#8217;ut&#233;rus de la femme, dans l&#8217;int&#233;r&#234;t de l&#8217;enfant. Cette pratique de l&#8217;AMP avec don de gam&#232;tes, tr&#232;s minoritaire (5&#160;% des enfants n&#233;s par AMP) suscite la qu&#234;te de ses origines de la part de certains enfants, ce qui a d&#233;cid&#233; le l&#233;gislateur &#224; lever l&#8217;anonymat. Un double don complexifie encore plus cette qu&#234;te.</p><p style=\"text-align: justify;\">Il est donc primordial que, dans le cadre de toute PMA, l&#8217;embryon&#160;humain reste con&#231;u avec les gam&#232;tes de l&#8217;un au moins des membres du couple.</p><p style=\"text-align: justify;\">Tel est le sens de cet amendement.</p>"
  },
  "representations": [
    {
      "nom": "PDF",
      "typeMime": {
        "type": "application",
        "subType": "PDF"
      },
      "statutRepresentation": {
        "verbatim": true,
        "canonique": true,
        "officielle": true,
        "transcription": false,
        "enregistrement": false
      },
      "contenu": {
        "documentURI": "/15/amendements/2243/AN/36.pdf"
      }
    }
  ],
  "seanceDiscussion": "RUANR5L15S2019IDS21831",
  "sort": {
    "dateSaisie": "2019-09-26T23:56:37.000+02:00",
    "sortEnSeance": "Rejeté"
  },
  "dateDepot": "2019-09-16T02:00:00.000+02:00",
  "dateDistribution": "2019-09-24T02:00:00.000+02:00",
  "article99": "0",
  "loiReference": {}
}