{
  "uid": "AMANR5L15PO419604B1255P2D1N63",
  "identifiant": {
    "legislature": "15",
    "numero": "63",
    "numRect": "0",
    "saisine": {
      "texteLegislatifRef": "PRJLANR5L15B1255",
      "numeroPartiePLF": "2",
      "organeExamen": "PO419604",
      "mentionSecondeDeliberation": "0"
    }
  },
  "numeroLong": "II-AC63",
  "etapeTexte": "1ère lecture (1ère assemblée saisie)",
  "triAmendement": "afaaaaaaaaaaaaaaaaaaaaaaaaaaaaaaaaaaaaaaaaaaaaaaaazzo",
  "cardinaliteAmdtMultiples": "1",
  "etat": "Retiré",
  "signataires": {
    "auteur": {
      "typeAuteur": "Depute",
      "acteurRef": "PA721960",
      "groupePolitiqueRef": "PO730958"
    },
    "cosignatairesRefs": [
      "PA720846",
      "PA721960",
      "PA721226",
      "PA721210",
      "PA722142",
      "PA2150",
      "PA720422",
      "PA721062",
      "PA720892",
      "PA719676",
      "PA719578",
      "PA718860",
      "PA588884",
      "PA721202",
      "PA720286",
      "PA718868",
      "PA720430"
    ],
    "texteAffichable": "Mme&#160;Obono,  Mme&#160;Autain, M.&#160;Bernalicis, M.&#160;Coquerel, M.&#160;Corbi&#232;re, Mme&#160;Fiat, M.&#160;Lachaud, M.&#160;Larive, M.&#160;M&#233;lenchon, Mme&#160;Panot, M.&#160;Prud&apos;homme, M.&#160;Quatennens, M.&#160;Ratenon, Mme&#160;Ressiguier, Mme&#160;Rubin, M.&#160;Ruffin et Mme&#160;Taurine"
  },
  "pointeurFragmentTexte": {
    "missionVisee": {
      "idMissionAN": "405",
      "libelleMission": "Enseignement scolaire",
      "codeMissionPLF": "B",
      "libelleMissionPLF": "Répartition, par mission et programme, des crédits du budget général"
    },
    "division": {
      "titre": "ÉTAT B",
      "articleDesignationCourte": "ART. 39",
      "type": "ANNEXE",
      "avantAApres": "A",
      "divisionRattachee": "ARTICLE 39",
      "urlDivisionTexteVise": "/15/textes/1255C.asp#D_ETAT_B"
    }
  },
  "corps": {
    "exposeSommaire": "<p style=\"text-align: justify;\">La litt&#233;rature est parsem&#233;e de diff&#233;rentes&#160;langues fran&#231;aises, de patois, de n&#233;ologismes, de cr&#233;ations, qui sont autant de facteurs qui font vivre une langue, et l&#8217;inscrivent dans un temps et dans l&#8217;espace.&#160;</p><p style=\"text-align: justify;\">Trop souvent dans l&#8217;enseignement du Fran&#231;ais &#224; l&#8217;&#233;cole, l&#8217;on enseigne une langue classique, qui s&#8217;&#233;rige comme seul v&#233;ritable moyen de communication, comme unique langue l&#233;gitime. Nous pensons que, s&#8217;il est fondamental que les &#233;l&#232;ves soient capables de faire un emploi appropri&#233; de la langue en fonction du contexte dans lequel ils et elles se situent, il n&#8217;en reste pas moins que la hi&#233;rarchisation des diff&#233;rentes langues employ&#233;es porte pr&#233;judice &#224; la reconnaissance par toutes et tous de sa facult&#233; &#224; contribuer &#224; l&#8217;&#233;volution de la langue. Aucune phrase, aucun mot, ne peut &#234;tre consid&#233;r&#233; comme ill&#233;gitime.&#160;</p><p style=\"text-align: justify;\">C&#8217;est pourquoi, et afin de nous assurer de la recevabilit&#233; financi&#232;re de cet amendement, nous abondons l&#8217;action 01 d&#8217;un nouveau programme intitul&#233; &#171;&#160;promotion du multilinguisme social&#160;&#187;, et que nous diminuons &#224;&#160;due concurrence l&#8217;action 01 du programme 141, &#224; hauteur d&#8217;un million d&#8217;euros.&#160;</p>",
    "dispositifAmdtCredit": {
      "listeProgrammes": [
        {
          "libelle": "Enseignement scolaire public du premier degré",
          "id": "40307",
          "AE": {
            "montantPositif": "0",
            "montantNegatif": "0"
          },
          "CP": {
            "montantPositif": "0",
            "montantNegatif": "0"
          },
          "action": "modification"
        },
        {
          "libelle": "Enseignement scolaire public du second degré",
          "id": "40308",
          "AE": {
            "montantPositif": "0",
            "montantNegatif": "1000000"
          },
          "CP": {
            "montantPositif": "0",
            "montantNegatif": "1000000"
          },
          "action": "modification"
        },
        {
          "libelle": "Vie de l'élève",
          "id": "40309",
          "AE": {
            "montantPositif": "0",
            "montantNegatif": "0"
          },
          "CP": {
            "montantPositif": "0",
            "montantNegatif": "0"
          },
          "action": "modification"
        },
        {
          "libelle": "Enseignement privé du premier et du second degrés",
          "id": "40310",
          "AE": {
            "montantPositif": "0",
            "montantNegatif": "0"
          },
          "CP": {
            "montantPositif": "0",
            "montantNegatif": "0"
          },
          "action": "modification"
        },
        {
          "libelle": "Soutien de la politique de l'éducation nationale",
          "id": "40311",
          "AE": {
            "montantPositif": "0",
            "montantNegatif": "0"
          },
          "CP": {
            "montantPositif": "0",
            "montantNegatif": "0"
          },
          "action": "modification"
        },
        {
          "libelle": "Enseignement technique agricole",
          "id": "40312",
          "AE": {
            "montantPositif": "0",
            "montantNegatif": "0"
          },
          "CP": {
            "montantPositif": "0",
            "montantNegatif": "0"
          },
          "action": "modification"
        },
        {
          "libelle": "Promotion du multilinguisme social",
          "id": "40313",
          "AE": {
            "montantPositif": "1000000",
            "montantNegatif": "0"
          },
          "CP": {
            "montantPositif": "1000000",
            "montantNegatif": "0"
          },
          "action": "creation"
        }
      ],
      "totalAE": {
        "montantPositif": "1000000",
        "montantNegatif": "1000000",
        "solde": "0"
      },
      "totalCP": {
        "montantPositif": "1000000",
        "montantNegatif": "1000000",
        "solde": "0"
      }
    }
  },
  "representations": [
    {
      "nom": "PDF",
      "typeMime": {
        "type": "application",
        "subType": "PDF"
      },
      "statutRepresentation": {
        "verbatim": true,
        "canonique": true,
        "officielle": true,
        "transcription": false,
        "enregistrement": false
      },
      "contenu": {
        "documentURI": "/15/amendements/1255C/CION-CEDU/AC63.pdf"
      }
    }
  ],
  "dateDepot": "2018-10-31T01:00:00.000+01:00",
  "dateDistribution": "2018-11-05T01:00:00.000+01:00",
  "article99": "0",
  "loiReference": {}
}