{
  "uid": "AMANR5L15PO744107B0424P0D1N744",
  "identifiant": {
    "legislature": "15",
    "numero": "744",
    "numRect": "0",
    "saisine": {
      "texteLegislatifRef": "PRJLANR5L15B0424",
      "numeroPartiePLF": "0",
      "organeExamen": "PO744107",
      "mentionSecondeDeliberation": "0"
    }
  },
  "numeroLong": "744",
  "etapeTexte": "1ère lecture (1ère assemblée saisie)",
  "triAmendement": "ki",
  "cardinaliteAmdtMultiples": "1",
  "etat": "Discuté",
  "signataires": {
    "auteur": {
      "typeAuteur": "Depute",
      "acteurRef": "PA721498",
      "groupePolitiqueRef": "PO730964"
    },
    "cosignatairesRefs": [
      "PA721498"
    ],
    "texteAffichable": "M.&#160;Guerini, rapporteur"
  },
  "pointeurFragmentTexte": {
    "division": {
      "titre": "Article 40",
      "articleDesignationCourte": "ART. 40",
      "type": "ARTICLE",
      "avantAApres": "A",
      "divisionRattachee": "ARTICLE 40",
      "urlDivisionTexteVise": "/15/textes/0424.asp#D_Article_40"
    },
    "alinea": {
      "numero": "7"
    }
  },
  "corps": {
    "dispositif": "<p style=\"text-align: justify;\">&#192; l&#8217;alin&#233;a&#160;7, apr&#232;s le mot&#160;: </p><p style=\"text-align: justify;\">&#171;&#160;exp&#233;rimentation&#160;&#187;, </p><p style=\"text-align: justify;\">ins&#233;rer les mots&#160;: </p><p style=\"text-align: justify;\">&#171;&#160;pr&#233;vue &#224; l&#8217;article&#160;21 de la pr&#233;sente loi&#160;&#187;.</p>",
    "exposeSommaire": "<p>Amendement r&#233;dactionnel.</p>"
  },
  "representations": [
    {
      "nom": "PDF",
      "typeMime": {
        "type": "application",
        "subType": "PDF"
      },
      "statutRepresentation": {
        "verbatim": true,
        "canonique": true,
        "officielle": true,
        "transcription": false,
        "enregistrement": false
      },
      "contenu": {
        "documentURI": "/15/amendements/0424/CSCONF/744.pdf"
      }
    }
  ],
  "sort": {
    "dateSaisie": "2018-01-17T23:27:04.000+01:00",
    "sortEnSeance": "Adopté"
  },
  "dateDepot": "2018-01-11T01:00:00.000+01:00",
  "dateDistribution": "2018-01-16T01:00:00.000+01:00",
  "article99": "0",
  "loiReference": {}
}