{
  "uid": "AMANR5L15PO419865B1831P0D1N57",
  "identifiant": {
    "legislature": "15",
    "numero": "57",
    "numRect": "0",
    "saisine": {
      "texteLegislatifRef": "PRJLANR5L15B1831",
      "numeroPartiePLF": "0",
      "organeExamen": "PO419865",
      "mentionSecondeDeliberation": "0"
    }
  },
  "numeroLong": "CD57",
  "etapeTexte": "1ère lecture (2ème assemblée saisie)",
  "triAmendement": "jbaaaaaaaaaaaaaaaaaaaaaaaaaaaaaaaaaaaaaaaaaaaaaaaah",
  "cardinaliteAmdtMultiples": "1",
  "etat": "Discuté",
  "signataires": {
    "auteur": {
      "typeAuteur": "Depute",
      "acteurRef": "PA721968",
      "groupePolitiqueRef": "PO730934"
    },
    "cosignatairesRefs": [
      "PA709315",
      "PA721054",
      "PA722390",
      "PA608016",
      "PA267450",
      "PA721968",
      "PA643089",
      "PA267901",
      "PA605036",
      "PA721678",
      "PA267260",
      "PA267429",
      "PA719318",
      "PA334654",
      "PA267204",
      "PA346218",
      "PA340853",
      "PA720630",
      "PA718780",
      "PA718884",
      "PA2086",
      "PA606712"
    ],
    "texteAffichable": "M.&#160;Vialay,  M.&#160;Thi&#233;riot, M.&#160;Cinieri, Mme&#160;Bazin-Malgras, Mme&#160;Anthoine, M.&#160;Leclerc, M.&#160;Marlin, M.&#160;Lurton, M.&#160;Straumann, M.&#160;Sermier, M.&#160;Masson, M.&#160;Viala, Mme&#160;Trastour-Isnart, Mme&#160;Corneloup, Mme&#160;Louwagie, Mme&#160;Poletti, M.&#160;Reda, M.&#160;Lorion, M.&#160;R&#233;mi&#160;Delatte, M.&#160;Kamardine, M.&#160;Minot et M.&#160;Abad"
  },
  "pointeurFragmentTexte": {
    "division": {
      "titre": "Article 32 ter",
      "articleDesignationCourte": "ART. 32 TER",
      "type": "ARTICLE",
      "avantAApres": "A",
      "divisionRattachee": "ARTICLE 32 TER",
      "urlDivisionTexteVise": "/15/textes/1831.asp#D_Article_32_ter"
    },
    "alinea": {
      "avantAApres": "Apres",
      "numero": "7"
    }
  },
  "corps": {
    "dispositif": "<p style=\"text-align: justify;\">I.&#160;&#8211;&#160;Apr&#232;s l&#8217;alin&#233;a&#160;7, ins&#233;rer l&#8217;alin&#233;a suivant&#160;:</p><p style=\"text-align: justify;\">&#171;&#160;Les modalit&#233;s d&#8217;application du pr&#233;sent article et l&#8217;utilisation des donn&#233;es collect&#233;es sont pr&#233;cis&#233;es par un d&#233;cret en Conseil d&#8217;&#201;tat, pris apr&#232;s avis de la Commission nationale de l&#8217;informatique et des libert&#233;s.&#160;&#187;</p><p style=\"text-align: justify;\">II.&#160;&#8211;&#160;Compl&#233;ter cet article par l&#8217;alin&#233;a suivant&#160;:</p><p style=\"text-align: justify;\">&#171;&#160;L&#8217; exp&#233;rimentation pr&#233;vue au I s&#8217;applique pour une dur&#233;e de trois ans &#224; compter de l&#8217;entr&#233;e en vigueur du d&#233;cret mentionn&#233; au dernier alin&#233;a dudit I, et au plus tard six mois apr&#232;s la date de promulgation de la pr&#233;sente loi.&#160;&#187;</p>",
    "exposeSommaire": "<p style=\"text-align: justify;\">Cet amendement vise &#224; allonger la dur&#233;e de l&#8217;exp&#233;rimentation qui permet aux agents de s&#233;curit&#233; de la SNCF et de la RATP d&#8217;&#234;tre dot&#233;s de cam&#233;ras individuelles afin de s&#233;curiser leurs interventions.</p><p style=\"text-align: justify;\">En outre, il vise &#224; faire en sorte qu&#8217;un d&#233;cret pr&#233;cise les modalit&#233;s du pr&#233;sent article et d&#8217;utilisation des donn&#233;es collect&#233;es, et ce apr&#232;s avis de la Commission nationale de l&#8217;informatique et des libert&#233;s.</p>"
  },
  "representations": [
    {
      "nom": "PDF",
      "typeMime": {
        "type": "application",
        "subType": "PDF"
      },
      "statutRepresentation": {
        "verbatim": true,
        "canonique": true,
        "officielle": true,
        "transcription": false,
        "enregistrement": false
      },
      "contenu": {
        "documentURI": "/15/amendements/1831/CION-DVP/CD57.pdf"
      }
    }
  ],
  "sort": {
    "dateSaisie": "2019-05-22T16:53:21.000+02:00",
    "sortEnSeance": "Retiré"
  },
  "dateDepot": "2019-04-16T02:00:00.000+02:00",
  "dateDistribution": "2019-05-19T02:00:00.000+02:00",
  "article99": "0",
  "loiReference": {}
}