{
  "uid": "AMANR5L15PO59051B1785P0D1N119",
  "identifiant": {
    "legislature": "15",
    "numero": "119",
    "numRect": "0",
    "saisine": {
      "texteLegislatifRef": "PIONANR5L15B1785",
      "numeroPartiePLF": "0",
      "organeExamen": "PO59051",
      "mentionSecondeDeliberation": "0"
    }
  },
  "numeroLong": "CL119",
  "etapeTexte": "1ère lecture (1ère assemblée saisie)",
  "triAmendement": "jaaaaaaaaaaaaaaaaaaaaaaaaaaaaaaaaaaaaaaaaaaaaaaaaab",
  "cardinaliteAmdtMultiples": "1",
  "etat": "Discuté",
  "signataires": {
    "auteur": {
      "typeAuteur": "Depute",
      "acteurRef": "PA721624",
      "groupePolitiqueRef": "PO730964"
    },
    "cosignatairesRefs": [
      "PA721624"
    ],
    "texteAffichable": "Mme&#160;Avia, rapporteure"
  },
  "pointeurFragmentTexte": {
    "division": {
      "titre": "Article 5",
      "articleDesignationCourte": "APRÈS ART. 5",
      "type": "ARTICLE",
      "avantAApres": "Apres",
      "divisionRattachee": "APRÈS L'ARTICLE 5, insérer la division et l'intitulé suivants:",
      "chapitreAdditionnel": "1",
      "urlDivisionTexteVise": "/15/textes/1785.asp#D_Article_5"
    }
  },
  "corps": {
    "dispositif": "<p style=\"text-align: justify;\">&#171;&#160;Chapitre&#160;IV</p><p style=\"text-align: justify;\">&#171;&#160;Am&#233;lioration de la lutte contre la diffusion de contenus haineux en ligne&#160;&#187;.</p>",
    "exposeSommaire": "<p>Dans le prolongement de pr&#233;c&#233;dents amendements qui proposaient de r&#233;organiser la proposition de loi en cinq chapitres, le pr&#233;sent amendement ins&#232;re un quatri&#232;me chapitre consacr&#233; &#224; la lutte contre la duplication des contenus haineux en ligne (&#171;&#160;sites miroirs&#160;&#187;).</p>"
  },
  "representations": [
    {
      "nom": "PDF",
      "typeMime": {
        "type": "application",
        "subType": "PDF"
      },
      "statutRepresentation": {
        "verbatim": true,
        "canonique": true,
        "officielle": true,
        "transcription": false,
        "enregistrement": false
      },
      "contenu": {
        "documentURI": "/15/amendements/1785/CION_LOIS/CL119.pdf"
      }
    }
  ],
  "sort": {
    "dateSaisie": "2019-06-19T18:36:50.000+02:00",
    "sortEnSeance": "Adopté"
  },
  "dateDepot": "2019-06-13T02:00:00.000+02:00",
  "dateDistribution": "2019-06-13T02:00:00.000+02:00",
  "article99": "0",
  "loiReference": {
    "codeLoi": "0-chap"
  }
}