{
  "uid": "AMANR5L15PO757134B1673P0D1N478",
  "identifiant": {
    "legislature": "15",
    "numero": "478",
    "numRect": "0",
    "saisine": {
      "texteLegislatifRef": "PRJLANR5L15B1673",
      "numeroPartiePLF": "0",
      "organeExamen": "PO757134",
      "mentionSecondeDeliberation": "0"
    }
  },
  "numeroLong": "478",
  "etapeTexte": "Nouvelle Lecture",
  "triAmendement": "laaaaaaaaaaaaaaaaaaaaaaaaaaaaaaaaaaaaaaaaaaaaaaaaak",
  "cardinaliteAmdtMultiples": "1",
  "etat": "Discuté",
  "signataires": {
    "auteur": {
      "typeAuteur": "Depute",
      "acteurRef": "PA719684",
      "groupePolitiqueRef": "PO730964"
    },
    "cosignatairesRefs": [
      "PA721134",
      "PA719684"
    ],
    "texteAffichable": "Mme&#160;Dubost, rapporteure th&#233;matique et M.&#160;Lescure, rapporteur"
  },
  "pointeurFragmentTexte": {
    "division": {
      "titre": "Article 57 bis D",
      "articleDesignationCourte": "ART. 57 BIS D",
      "type": "ARTICLE",
      "avantAApres": "A",
      "divisionRattachee": "ARTICLE 57 BIS D",
      "urlDivisionTexteVise": "/15/textes/1673.asp#D_Articles_57_bis_D_et_57_bis"
    }
  },
  "corps": {
    "dispositif": "<p style=\"text-align: justify;\">R&#233;tablir cet article dans la r&#233;daction suivante&#160;:</p><p style=\"text-align: justify;\">&#171;&#160;L&#8217;article L.&#160;3332&#8209;7 du code du travail est compl&#233;t&#233; par une phrase ainsi r&#233;dig&#233;e&#160;:</p><p style=\"text-align: justify;\">&#171;&#160;Il pr&#233;voit des conditions de mise en &#339;uvre d&#8217;une aide &#224; la d&#233;cision pour les b&#233;n&#233;ficiaires.&#160;&#187;</p>",
    "exposeSommaire": "<p style=\"text-align: justify;\">Cet amendement vise &#224; r&#233;tablir l&#8217;article&#160;57 <i>bis</i> D tel qu&#8217;adopt&#233; en s&#233;ance publique &#224; l&#8217;Assembl&#233;e nationale, dans une r&#233;daction am&#233;lior&#233;e.</p><p style=\"text-align: justify;\">Cet article pr&#233;voit en effet un renforcement de l&#8217;accompagnement des salari&#233;s b&#233;n&#233;ficiaires d&#8217;un plan d&#8217;&#233;pargne d&#8217;entreprise (PEE) dans leurs d&#233;cisions de placement. Dans ce but, il modifie l&#8217;article L.&#160;3332&#8209;7 du code du travail afin de garantir l&#8217;inscription dans le r&#232;glement du PEE d&#8217;une aide &#224; la d&#233;cision personnalis&#233;e apport&#233;e aux b&#233;n&#233;ficiaires.</p><p style=\"text-align: justify;\">Le S&#233;nat a jug&#233; ces dispositions satisfaites par l&#8217;article&#160;58 du pr&#233;sent projet de loi, pr&#233;voyant la transmission d&#8217;un bilan de situation annuel aux b&#233;n&#233;ficiaires d&#8217;un PEE. Si ce document participe de l&#8217;aide &#224; la d&#233;cision des &#233;pargnants, il ne constitue pas &#224; lui seul une aide personnalis&#233;e, pouvant &#234;tre apport&#233;e par la soci&#233;t&#233; de gestion du PEE ou par des organismes internes &#224; l&#8217;entreprise.</p>"
  },
  "representations": [
    {
      "nom": "PDF",
      "typeMime": {
        "type": "application",
        "subType": "PDF"
      },
      "statutRepresentation": {
        "verbatim": true,
        "canonique": true,
        "officielle": true,
        "transcription": false,
        "enregistrement": false
      },
      "contenu": {
        "documentURI": "/15/amendements/1673/CSPACTE/478.pdf"
      }
    }
  ],
  "sort": {
    "dateSaisie": "2019-03-07T15:15:15.000+01:00",
    "sortEnSeance": "Adopté"
  },
  "dateDepot": "2019-02-28T01:00:00.000+01:00",
  "dateDistribution": "2019-03-06T01:00:00.000+01:00",
  "article99": "0",
  "loiReference": {}
}