{
  "uid": "AMANR5L15PO59051B1349P0D1N813",
  "identifiant": {
    "legislature": "15",
    "numero": "813",
    "numRect": "0",
    "saisine": {
      "texteLegislatifRef": "PRJLANR5L15B1349",
      "numeroPartiePLF": "0",
      "organeExamen": "PO59051",
      "mentionSecondeDeliberation": "0"
    }
  },
  "numeroLong": "CL813",
  "etapeTexte": "1ère lecture (2ème assemblée saisie)",
  "triAmendement": "ibaaaaaaaaaaaaaaaaaaaaaaaaaaaaaaaaaaaaaaaaaaaaaaaaio",
  "cardinaliteAmdtMultiples": "1",
  "etat": "Discuté",
  "signataires": {
    "auteur": {
      "typeAuteur": "Depute",
      "acteurRef": "PA719202",
      "groupePolitiqueRef": "PO730964"
    },
    "cosignatairesRefs": [
      "PA719202"
    ],
    "texteAffichable": "M.&#160;Paris, rapporteur"
  },
  "pointeurFragmentTexte": {
    "division": {
      "titre": "Article 43",
      "articleDesignationCourte": "ART. 43",
      "type": "ARTICLE",
      "avantAApres": "A",
      "divisionRattachee": "ARTICLE 43",
      "urlDivisionTexteVise": "/15/textes/1349.asp#D_Article_43"
    },
    "alinea": {
      "avantAApres": "A",
      "numero": "20",
      "alineaDesignation": "Alinéa 20"
    }
  },
  "corps": {
    "dispositif": "<p style=\"text-align: justify;\">Supprimer l&#8217;alin&#233;a&#160;20.</p>",
    "exposeSommaire": "<p style=\"text-align: justify;\">Le pr&#233;sent amendement supprime la disposition, adopt&#233;e par le S&#233;nat, pr&#233;voyant que la peine de travail d&#8217;int&#233;r&#234;t g&#233;n&#233;ral puisse &#234;tre prononc&#233;e non pas seulement &#224; la place de l&#8217;emprisonnement, mais &#233;galement en plus de l&#8217;emprisonnement, ce qui constituerait une aggravation tr&#232;s importante de la r&#233;pression, facteur d&#8217;augmentation des courtes peines.</p>"
  },
  "representations": [
    {
      "nom": "PDF",
      "typeMime": {
        "type": "application",
        "subType": "PDF"
      },
      "statutRepresentation": {
        "verbatim": true,
        "canonique": true,
        "officielle": true,
        "transcription": false,
        "enregistrement": false
      },
      "contenu": {
        "documentURI": "/15/amendements/1349/CION_LOIS/CL813.pdf"
      }
    }
  ],
  "sort": {
    "dateSaisie": "2018-11-09T11:59:43.000+01:00",
    "sortEnSeance": "Adopté"
  },
  "dateDepot": "2018-11-06T01:00:00.000+01:00",
  "dateDistribution": "2018-11-07T01:00:00.000+01:00",
  "article99": "0",
  "loiReference": {
    "codeLoi": "1.1id"
  }
}