{
  "uid": "AMANR5L15SEA717460B2272P1D1N1042",
  "identifiant": {
    "legislature": "15",
    "numero": "1042",
    "numRect": "0",
    "saisine": {
      "texteLegislatifRef": "PRJLANR5L15B2272",
      "numeroPartiePLF": "1",
      "organeExamen": "PO717460",
      "mentionSecondeDeliberation": "0"
    }
  },
  "numeroLong": "I-1042",
  "etapeTexte": "1ère lecture (1ère assemblée saisie)",
  "triAmendement": "daaaaaaaaaaaaaaaaaaaaaaaaaaaaaaaaaaaaaaaaaaaaaaaaaetpkku",
  "cardinaliteAmdtMultiples": "1",
  "etat": "Discuté",
  "signataires": {
    "auteur": {
      "typeAuteur": "Depute",
      "acteurRef": "PA717379",
      "groupePolitiqueRef": "PO730964"
    },
    "cosignatairesRefs": [
      "PA717379",
      "PA720932",
      "PA718876"
    ],
    "texteAffichable": "M.&#160;Maillard,  M.&#160;Da Silva et M.&#160;Besson-Moreau"
  },
  "pointeurFragmentTexte": {
    "division": {
      "titre": "Article 13",
      "articleDesignationCourte": "APRÈS ART. 13",
      "type": "ARTICLE",
      "avantAApres": "Apres",
      "divisionRattachee": "APRÈS L'ARTICLE 13, insérer l'article suivant:",
      "articleAdditionnel": "1",
      "urlDivisionTexteVise": "/15/textes/2272A.asp#D_Article_13"
    }
  },
  "corps": {
    "dispositif": "<p>I.&#160;&#8211;&#160;Le code g&#233;n&#233;ral des imp&#244;ts est ainsi modifi&#233;&#160;:</p><p style=\"text-align: justify;\">1&#176;&#160;L&#8217;intitul&#233; du VII du chapitre II du titre II de la troisi&#232;me partie est ainsi r&#233;dig&#233;&#160;:</p><p style=\"text-align: justify;\">&#171;&#160;Entrepreneur individuel &#224; responsabilit&#233; limit&#233;e et entrepreneur individuel&#160;&#187;&#160;;</p><p style=\"text-align: justify;\">2&#176;&#160;L&#8217;article&#160;1655 <i>sexies</i> est compl&#233;t&#233; par un alin&#233;a ainsi r&#233;dig&#233;&#160;:</p><p style=\"text-align: justify;\">&#171;&#160;3. L&#8217;option mentionn&#233;e au 1 est &#233;tendue &#224; l&#8217;entrepreneur individuel.&#160;&#187;</p><p style=\"text-align: justify;\">II.&#160;&#8211;&#160;La perte de recettes pour l&#8217;&#201;tat est compens&#233;e &#224; due concurrence par la cr&#233;ation d&#8217;une taxe additionnelle aux droits mentionn&#233;s aux articles 575 et 575 A du code g&#233;n&#233;ral des imp&#244;ts.</p>",
    "exposeSommaire": "<p>Le pr&#233;sent amendement vise &#224; cr&#233;er une latitude de choix pour tous les entrepreneurs exer&#231;ant en nom propre et dont la majorit&#233; sont assujettis &#224; l&#8217;imp&#244;t sur le revenu&#160;: celle de pouvoir, &#224; l&#8217;instar de ce qui existe pour les EIRL, opter pour l&#8217;imp&#244;t sur les soci&#233;t&#233;s s&#8217;ils le jugent favorable, et ce aussi bien en cours d&#8217;activit&#233; que lors de la cr&#233;ation de leur activit&#233;.</p><p style=\"text-align: justify;\">En effet, en l&#8217;&#233;tat de la l&#233;gislation actuelle, un entrepreneur assujetti &#224; l&#8217;imp&#244;t sur le revenu doit l&#8217;acquitter sur l&#8217;int&#233;gralit&#233; du b&#233;n&#233;fice, y compris la part qu&#8217;il d&#233;cide de r&#233;investir dans l&#8217;entreprise et qu&#8217;il ne per&#231;oit donc pas en tant que r&#233;mun&#233;ration.</p><p style=\"text-align: justify;\">Il serait &#233;quitable de distinguer la r&#233;mun&#233;ration de l&#8217;exploitant du b&#233;n&#233;fice de l&#8217;entreprise. Opter pour l&#8217;imp&#244;t sur les soci&#233;t&#233;s le permet.</p><p style=\"text-align: justify;\">Rappelons que depuis une s&#233;rie de r&#233;formes intervenues au cours des derni&#232;res d&#233;cennies, l&#8217;assujettissement &#224; l&#8217;IS n&#8217;est plus tributaire de l&#8217;exercice de l&#8217;activit&#233; dans le cadre d&#8217;une association ou sous une forme juridique d&#233;termin&#233;e. Cette possibilit&#233; d&#8217;option est ouverte aux EIRL et aux EURL. De leur c&#244;t&#233;, les SASU (soci&#233;t&#233;s par actions simplifi&#233;es &#224; associ&#233; unique), qui comme leur nom l&#8217;indique ne comptent qu&#8217;un seul associ&#233;, sont soumises de plein droit &#224; l&#8217;IS.</p><p style=\"text-align: justify;\">La possibilit&#233; d&#8217;option pour l&#8217;IS deviendrait ainsi totalement ind&#233;pendante de la forme juridique choisie lors de la cr&#233;ation de l&#8217;entreprise. Elle s&#8217;inscrirait en lien avec l&#8217;article&#160;50 de la loi n&#176;&#160;2018&#8209;1317 du 28 d&#233;cembre 2018 de finances pour 2019 qui permet aux soci&#233;t&#233;s et groupements vis&#233;s au 1 de l&#8217;article&#160;239 du code g&#233;n&#233;ral des imp&#244;ts (CGI), de m&#234;me qu&#8217;aux EIRL de&#160;renoncer &#224; leur assujettissement &#224; l&#8217;imp&#244;t sur les soci&#233;t&#233;s jusqu&#8217;au cinqui&#232;me exercice suivant celui au titre duquel l&#8217;option a &#233;t&#233; exerc&#233;e.</p><p style=\"text-align: justify;\">Par ailleurs, l&#8217;assujettissement &#224; l&#8217;IS n&#8217;est aucunement incompatible avec la conservation du statut social de travailleur ind&#233;pendant par l&#8217;exploitant.</p>"
  },
  "representations": [
    {
      "nom": "PDF",
      "typeMime": {
        "type": "application",
        "subType": "PDF"
      },
      "statutRepresentation": {
        "verbatim": true,
        "canonique": true,
        "officielle": true,
        "transcription": false,
        "enregistrement": false
      },
      "contenu": {
        "documentURI": "/15/amendements/2272A/AN/1042.pdf"
      }
    }
  ],
  "seanceDiscussion": "RUANR5L15S2020IDS21871",
  "sort": {
    "dateSaisie": "2019-10-19T00:59:16.000+02:00",
    "sortEnSeance": "Non soutenu"
  },
  "dateDepot": "2019-10-09T02:00:00.000+02:00",
  "dateDistribution": "2019-10-17T02:00:00.000+02:00",
  "article99": "0",
  "loiReference": {
    "codeLoi": "CGI",
    "divisionCodeLoi": "1655 sexies"
  }
}