{
  "uid": "AMANR5L15PO419865B0911P0D1N50",
  "identifiant": {
    "legislature": "15",
    "numero": "50",
    "numRect": "0",
    "saisine": {
      "texteLegislatifRef": "PRJLANR5L15B0911",
      "numeroPartiePLF": "0",
      "organeExamen": "PO419865",
      "mentionSecondeDeliberation": "0"
    }
  },
  "numeroLong": "CD50",
  "etapeTexte": "1ère lecture (1ère assemblée saisie)",
  "triAmendement": "bxkzi",
  "cardinaliteAmdtMultiples": "1",
  "etat": "Discuté",
  "signataires": {
    "auteur": {
      "typeAuteur": "Depute",
      "acteurRef": "PA718710",
      "groupePolitiqueRef": "PO730964"
    },
    "cosignatairesRefs": [
      "PA718710"
    ],
    "texteAffichable": "Mme&#160;Pascale&#160;Boyer"
  },
  "pointeurFragmentTexte": {
    "division": {
      "titre": "Article 2",
      "articleDesignationCourte": "ART. 2",
      "type": "ARTICLE",
      "avantAApres": "A",
      "divisionRattachee": "ARTICLE 2",
      "urlDivisionTexteVise": "/15/textes/0911.asp#D_Article_2"
    }
  },
  "corps": {
    "dispositif": "<p>Supprimer cet article.</p>",
    "exposeSommaire": "<p style=\"text-align: justify;\">Amendement de cons&#233;quence du CD74 qui vise symboliquement &#224; inscrire le respect de l&#8217;environnement au 1<sup>er</sup> article de la Constitution parmi les grands principe de la R&#233;publique.</p>"
  },
  "representations": [
    {
      "nom": "PDF",
      "typeMime": {
        "type": "application",
        "subType": "PDF"
      },
      "statutRepresentation": {
        "verbatim": true,
        "canonique": true,
        "officielle": true,
        "transcription": false,
        "enregistrement": false
      },
      "contenu": {
        "documentURI": "/15/amendements/0911/CION-DVP/CD50.pdf"
      }
    }
  ],
  "sort": {
    "dateSaisie": "2018-06-12T20:32:39.000+02:00",
    "sortEnSeance": "Adopté"
  },
  "dateDepot": "2018-06-08T02:00:00.000+02:00",
  "dateDistribution": "2018-06-11T02:00:00.000+02:00",
  "article99": "0",
  "loiReference": {}
}