{
  "uid": "AMANR5L15PO59051B0778P0D1N20",
  "identifiant": {
    "legislature": "15",
    "numero": "20",
    "numRect": "0",
    "saisine": {
      "texteLegislatifRef": "PRJLANR5L15B0778",
      "numeroPartiePLF": "0",
      "organeExamen": "PO59051",
      "mentionSecondeDeliberation": "0"
    }
  },
  "numeroLong": "CL20",
  "etapeTexte": "1ère lecture (1ère assemblée saisie)",
  "triAmendement": "bidi",
  "cardinaliteAmdtMultiples": "1",
  "etat": "Discuté",
  "signataires": {
    "auteur": {
      "typeAuteur": "Depute",
      "acteurRef": "PA719806",
      "groupePolitiqueRef": "PO744425"
    },
    "cosignatairesRefs": [
      "PA722030",
      "PA267355",
      "PA712014",
      "PA1960",
      "PA702052",
      "PA266788",
      "PA267241",
      "PA719806",
      "PA942",
      "PA268019",
      "PA267766",
      "PA331582",
      "PA720696"
    ],
    "texteAffichable": "Mme&#160;Auconie,  M.&#160;Guy&#160;Bricout, Mme&#160;Descamps, M.&#160;Herth, M.&#160;Lagarde, M.&#160;Ledoux, M.&#160;Leroy, M.&#160;Morel-&#192;-L&apos;Huissier, Mme&#160;Sage, M.&#160;Philippe&#160;Vigier, M.&#160;Demilly, M.&#160;Charles&#160;de Courson et M.&#160;Bournazel"
  },
  "pointeurFragmentTexte": {
    "division": {
      "titre": "Article 2",
      "articleDesignationCourte": "ART. 2",
      "type": "ARTICLE",
      "avantAApres": "A",
      "divisionRattachee": "ARTICLE 2",
      "urlDivisionTexteVise": "/15/textes/0778.asp#D_Article_2"
    },
    "alinea": {
      "avantAApres": "A",
      "numero": "1",
      "alineaDesignation": "Alinéa 1"
    }
  },
  "corps": {
    "dispositif": "<p>Substituer aux alin&#233;as 1 &#224; 4 les six alin&#233;as suivants&#160;: </p><p>&#171;&#160;I.&#160;&#8211;&#160;Apr&#232;s le premier alin&#233;a de l&#8217;article&#160;222&#8209;22 du code p&#233;nal, il est ins&#233;r&#233; un alin&#233;a ainsi r&#233;dig&#233;&#160;: </p><p>&#171;&#160;&#171;&#160;Le fait, par un majeur, de commettre une atteinte sexuelle sur la personne d&#8217;un mineur de treize ans, est &#233;galement une agression sexuelle.&#160;&#187;&#160;</p><p>&#171;&#160;I&#160;<i>bis</i>.&#160;&#8211;&#160;L&#8217;article&#160;222&#8209;23 du m&#234;me code est compl&#233;t&#233; par un alin&#233;a ainsi r&#233;dig&#233;&#160;: </p><p>&#171;&#160;&#171;&#160;Le fait par un majeur, d&#8217;exercer tout acte de p&#233;n&#233;tration sexuelle sur la personne d&#8217;un mineur de treize est &#233;galement un viol.&#160;&#187;. </p><p>&#171;&#160;II.&#160;&#8211;&#160;L&#8217;article&#160;222&#8209;27 du m&#234;me code est ainsi r&#233;dig&#233;&#160;: </p><p>&#171;&#160;&#171;&#160;<i>Art.&#160;222&#8209;27</i>.&#160;&#8211;&#160;Les agressions sexuelles autres que le viol et l&#8217;infraction d&#233;finie au deuxi&#232;me alin&#233;a de l&#8217;article&#160;222&#8209;22, sont punies de cinq ans d&#8217;emprisonnement et de 75&#160;000&#160;euros d&#8217;amende.&#160;&#187;&#160;&#187;</p>",
    "exposeSommaire": "<p><br />Cet amendement a pour objectif de reconnaitre que tout p&#233;n&#233;tration sexuelle d&#8217;un adulte sur un enfant de moins de 13 ans est un viol sans qu&#8217;il soit n&#233;cessaire de rapporter la preuve que cet acte a &#233;t&#233; commis par violence, contrainte, menace ou surprise. <br />&#160;<br />Il a &#233;galement pour objectif de reconnaitre que toute atteinte sexuelle d&#8217;un adulte sur un enfant de 13 ans est une agression sexuelle sans qu&#8217;il soit n&#233;cessaire de rapporter la preuve que cet acte a &#233;t&#233; commis par violence, contrainte, menace ou surprise. <br />&#160;<br />Il est indispensable de poser une limite d&#8217;&#226;ge au-dessous&#160;delaquelle&#160;un mineur ne peut avoir consenti &#224; un acte de p&#233;n&#233;tration sexuelle ou &#224; un acte sexuel sans p&#233;n&#233;tration, de quelque nature que ce soit, commis sur sa personne par un majeur. &#160;En de&#231;&#224; de cet &#226;ge, il ne peut pas y avoir d&#233;bat, l&#8217;enfant de moins de 13 ans ne peut consentir, sa maturit&#233; affective et cognitive&#160;l&#8217;en emp&#234;che. <br />&#160;<br />&#160;</p>"
  },
  "representations": [
    {
      "nom": "PDF",
      "typeMime": {
        "type": "application",
        "subType": "PDF"
      },
      "statutRepresentation": {
        "verbatim": true,
        "canonique": true,
        "officielle": true,
        "transcription": false,
        "enregistrement": false
      },
      "contenu": {
        "documentURI": "/15/amendements/0778/CION_LOIS/CL20.pdf"
      }
    }
  ],
  "sort": {
    "dateSaisie": "2018-05-09T12:56:37.000+02:00",
    "sortEnSeance": "Rejeté"
  },
  "dateDepot": "2018-05-02T02:00:00.000+02:00",
  "dateDistribution": "2018-05-07T02:00:00.000+02:00",
  "article99": "0",
  "loiReference": {}
}