{
  "uid": "AMANR5L15SEA717460BTC1237P0D1N218",
  "identifiant": {
    "legislature": "15",
    "numero": "218",
    "numRect": "0",
    "saisine": {
      "texteLegislatifRef": "PRJLANR5L15BTC1237",
      "numeroPartiePLF": "0",
      "organeExamen": "PO717460",
      "mentionSecondeDeliberation": "0"
    }
  },
  "numeroLong": "218",
  "etapeTexte": "1ère lecture (1ère assemblée saisie)",
  "triAmendement": "gkaaaaaaaaaaaaaaaaaaaaaaaaaaaaaaaaaaaaaaaaaaaaaaaackw",
  "cardinaliteAmdtMultiples": "1",
  "etat": "Discuté",
  "signataires": {
    "auteur": {
      "typeAuteur": "Depute",
      "acteurRef": "PA330909",
      "groupePolitiqueRef": "PO730934"
    },
    "cosignatairesRefs": [
      "PA334654",
      "PA719272",
      "PA605036",
      "PA721474",
      "PA718884",
      "PA267527",
      "PA721314",
      "PA267735",
      "PA720210",
      "PA330909",
      "PA721968",
      "PA719318",
      "PA720586",
      "PA1874",
      "PA266797"
    ],
    "texteAffichable": "M.&#160;Descoeur,  Mme&#160;Beauvais, M.&#160;Straumann, M.&#160;Saddier, M.&#160;Schellenberger, M.&#160;Vialay, M.&#160;Gosselin, Mme&#160;Meunier, M.&#160;de Ganay, Mme&#160;Bazin-Malgras, Mme&#160;Anthoine, M.&#160;Viry, M.&#160;Le Fur, M.&#160;Abad et M.&#160;Vatin"
  },
  "pointeurFragmentTexte": {
    "division": {
      "titre": "Article 42",
      "articleDesignationCourte": "ART. 42",
      "type": "ARTICLE",
      "avantAApres": "A",
      "divisionRattachee": "ARTICLE 42",
      "urlDivisionTexteVise": "/15/textes/1237.asp#D_Article_42"
    }
  },
  "corps": {
    "dispositif": "<p>Supprimer cet article.</p>",
    "exposeSommaire": "<p style=\"text-align: justify;\">Cet article cr&#233;e un droit d&#8217;opposition aux brevets d&#8217;invention d&#233;livr&#233;s par l&#8217;Institut national de la propri&#233;t&#233; industrielle, ouverts aux tiers, et dont les modalit&#233;s seront pr&#233;cis&#233;es par ordonnance. Ce droit permettra &#224; toute personne de demander &#224; l&#8217;INPI, dans un certain d&#233;lai, la r&#233;vocation d&#8217;un brevet d&#233;livr&#233;.</p><p style=\"text-align: justify;\">Or, une telle disposition l&#233;gislative fragiliserait fortement le syst&#232;me de brevet fran&#231;ais d&#232;s lors qu&#8217;un risque d&#8217;opposition syst&#233;matique et sans filtre serait th&#233;oriquement envisageable.</p><p style=\"text-align: justify;\">En effet, m&#234;me si le renforcement de la s&#233;curit&#233; et de la protection des brevets fran&#231;ais est une n&#233;cessit&#233; pour les PME et inciterait &#224; un plus grand nombre de d&#233;p&#244;ts en France, ce nouveau droit d&#8217;opposition n&#233;cessiterait de nouveaux recrutements pour faire face aux nouvelles modalit&#233;s d&#8217;examen approfondi du brevet et ne manquerait pas d&#8217;engendrer pour les d&#233;posants de nouveaux co&#251;ts administratifs (taxes de d&#233;p&#244;ts, d&#8217;enregistrement, d&#8217;examen &#224; l&#8217;INPI). Source d&#8217;incertitudes juridiques cette nouvelle proc&#233;dure g&#233;n&#233;rerait &#233;galement des co&#251;ts importants pour les PME (recours &#224; des conseils sp&#233;cialis&#233;s pour appr&#233;hender et maitriser les nouvelles proc&#233;dures).</p><p style=\"text-align: justify;\">Aussi, un tel dispositif constituerait un frein potentiel &#224; la dynamique de recherche et &#224; la valorisation des innovations fran&#231;aises d&#232;s lors que les nouveaux co&#251;ts induits par cette proc&#233;dure d&#8217;opposition d&#233;courageraient les entreprises fran&#231;aises de prot&#233;ger leurs innovations sur leur propre march&#233; domestique. Cela nuirait par ailleurs &#224; l&#8217;attractivit&#233; du syst&#232;me de brevet fran&#231;ais &#224; ce jour simple d&#8217;obtention, &#224; un co&#251;t raisonnable et dont le taux d&#8217;invalidation par la juridiction judiciaire n&#8217;est pas nettement sup&#233;rieur &#224; celui d&#8217;un brevet&#160;europ&#233;en. Celui-ci fait pourtant au pr&#233;alable d&#233;j&#224; l&#8217;objet d&#8217;un examen approfondi et d&#8217;une &#233;ventuelle proc&#233;dure d&#8217;opposition. De nombreuses entreprises ne voudront pas multiplier les co&#251;ts qui risquent d&#8217;augmenter sensiblement avec ces nouvelles proc&#233;dures cr&#233;&#233;es en France et pr&#233;f&#232;reront d&#233;poser directement un brevet&#160;europ&#233;en.</p><p style=\"text-align: justify;\">De plus, l&#8217;absence de pr&#233;cision de la n&#233;cessit&#233; de motiver l&#8217;int&#233;r&#234;t &#224; agir conduirait certaines entreprises &#224; user et abuser de ce syst&#232;me d&#8217;opposition, qui porterait pr&#233;judice aux entreprises les plus vuln&#233;rables.</p><p style=\"text-align: justify;\">Par ailleurs, un droit d&#8217;opposition judiciaire existe d&#233;j&#224; en France.</p><p style=\"text-align: justify;\">Pour toutes ces raisons, il convient de supprimer ce droit d&#8217;opposition.</p>"
  },
  "representations": [
    {
      "nom": "PDF",
      "typeMime": {
        "type": "application",
        "subType": "PDF"
      },
      "statutRepresentation": {
        "verbatim": true,
        "canonique": true,
        "officielle": true,
        "transcription": false,
        "enregistrement": false
      },
      "contenu": {
        "documentURI": "/15/amendements/1237/AN/218.pdf"
      }
    }
  ],
  "seanceDiscussion": "RUANR5L15S2019IDS21258",
  "sort": {
    "dateSaisie": "2018-10-03T00:05:57.000+02:00",
    "sortEnSeance": "Rejeté"
  },
  "dateDepot": "2018-09-19T02:00:00.000+02:00",
  "dateDistribution": "2018-09-25T02:00:00.000+02:00",
  "article99": "0",
  "loiReference": {}
}