{
  "uid": "AMANR5L15SEA717460B2272P1D1N1972",
  "identifiant": {
    "legislature": "15",
    "numero": "1972",
    "numRect": "0",
    "saisine": {
      "texteLegislatifRef": "PRJLANR5L15B2272",
      "numeroPartiePLF": "1",
      "organeExamen": "PO717460",
      "mentionSecondeDeliberation": "0"
    }
  },
  "numeroLong": "I-1972",
  "etapeTexte": "1ère lecture (1ère assemblée saisie)",
  "triAmendement": "baaaaaaaaaaaaaaaaaaaaaaaaaaaaaaaaaaaaaaaaaaaaaaaaaagozzukkkkzzzzzzi",
  "cardinaliteAmdtMultiples": "1",
  "etat": "Discuté",
  "signataires": {
    "auteur": {
      "typeAuteur": "Depute",
      "acteurRef": "PA720230",
      "groupePolitiqueRef": "PO767217"
    },
    "cosignatairesRefs": [
      "PA642935",
      "PA721486",
      "PA267355",
      "PA267780",
      "PA331567",
      "PA342601",
      "PA720230",
      "PA702052",
      "PA268019",
      "PA712014",
      "PA721632",
      "PA721110"
    ],
    "texteAffichable": "Mme&#160;Magnier,  M.&#160;Becht, M.&#160;Brindeau, Mme&#160;de La Raudi&#232;re, Mme&#160;Firmin Le Bodo, M.&#160;Herth, M.&#160;Lagarde, M.&#160;Ledoux, Mme&#160;Lemoine, M.&#160;Naegelen, Mme&#160;Sage et Mme&#160;Sanquer"
  },
  "pointeurFragmentTexte": {
    "division": {
      "titre": "Article 4",
      "articleDesignationCourte": "ART. 4",
      "type": "ARTICLE",
      "avantAApres": "A",
      "divisionRattachee": "ARTICLE 4",
      "urlDivisionTexteVise": "/15/textes/2272A.asp#D_Article_4"
    },
    "alinea": {
      "numero": "7"
    }
  },
  "corps": {
    "dispositif": "<p style=\"text-align: justify;\">I.&#160;&#8211;&#160;R&#233;diger ainsi l&#8217;alin&#233;a&#160;7&#160;:</p><p style=\"text-align: justify;\">&#171;&#160;<i>ii)</i>&#160;Apr&#232;s la premi&#232;re occurrence du mot&#160;: &#171;&#160;&#233;nergie&#160;&#187;, la fin du 1&#176;&#160;est supprim&#233;e&#160;;&#160;&#187;</p><p style=\"text-align: justify;\">II.&#160;&#8211;&#160;En cons&#233;quence, compl&#233;ter le tableau de l&#8217;alin&#233;a&#160;47 par les deux lignes suivantes&#160;:</p><p style=\"text-align: justify;\">&#171;&#160;</p><table style=\"border-collapse: collapse; height: 30px; width: 670.067px;\"><tbody><tr><td style=\"white-space: normal; border: 1px solid #000000; width: 265px;\">Chaudi&#232;res &#224; tr&#232;s haute performance &#233;nerg&#233;tique, &#224; l&#8217;exception de celles utilisant le fioul comme source d&#8217;&#233;nergie</td><td style=\"white-space: normal; border: 1px solid #000000; width: 188px;\">600&#160;&#8364;</td></tr></tbody></table><p style=\"text-align: justify;\">&#160;&#187;</p><p style=\"text-align: justify;\">III.&#160;&#8211;&#160;En cons&#233;quence, compl&#233;ter le tableau de l&#8217;alin&#233;a&#160;51 par les deux lignes suivantes&#160;:</p><p style=\"text-align: justify;\">&#171;&#160;</p><table style=\"border-collapse: collapse; height: 40px; width: 679.733px;\"><tbody><tr><td style=\"white-space: normal; border: 1px solid #000000; width: 276px;\">Chaudi&#232;res &#224; tr&#232;s haute performance &#233;nerg&#233;tique, &#224; l&#8217;exception de celles utilisant le fioul comme source d&#8217;&#233;nergie</td><td style=\"white-space: normal; border: 1px solid #000000; width: 187px;\">600&#160;&#8364;</td></tr></tbody></table><p style=\"text-align: justify;\">&#160;&#187;</p><p style=\"text-align: justify;\">IV.&#160;&#8211;&#160;Compl&#233;ter cet article par les trois alin&#233;as suivants&#160;:</p><p>&#171;&#160;IV.&#160;&#8211;&#160;Le I est restreint au cr&#233;dit d&#8217;imp&#244;t pr&#233;vu &#224; l&#8217;article&#160;200 quater du code g&#233;n&#233;ral des imp&#244;ts, sans incidence sur la d&#233;finition de la prime mentionn&#233;e au II de l&#8217;article&#160;4 de la pr&#233;sente loi de finances de 2020.</p><p>&#171;&#160;V.&#160;&#8211;&#160;Le I n&#8217;est applicable qu&#8217;aux sommes venant en d&#233;duction de l&#8217;imp&#244;t d&#251;.</p><p>&#171;&#160;VI.&#160;&#8211;&#160;La perte de recettes r&#233;sultant pour l&#8217;&#201;tat du I est compens&#233;e &#224; due concurrence par la cr&#233;ation d&#8217;une taxe additionnelle aux droits mentionn&#233;s aux articles 575 et 575 A du code g&#233;n&#233;ral des imp&#244;ts.&#160;&#187;</p>",
    "exposeSommaire": "<p>Le projet de loi de Finances 2020 supprime le CITE, pour les m&#233;nages interm&#233;diaires, concernant les chaudi&#232;res gaz &#224; tr&#232;s haute performance &#233;nerg&#233;tique (THPE).</p><p style=\"text-align: justify;\">On rappellera qu&#8217;il s&#8217;agit de m&#233;nages disposant d&#8217;un revenu fiscal de r&#233;f&#233;rence compris entre 18&#160;960&#160;&#8364; et 27&#160;706&#160;&#8364; pour une personne seule, hors Ile de France.</p><p style=\"text-align: justify;\">Or, il est objectivement d&#233;montr&#233; que ces &#233;quipements ont vocation &#224; remplacer le parc des chaudi&#232;res fioul et gaz existant, en contribuant &#224; la diminution des consommations &#233;nerg&#233;tiques et des &#233;missions de gaz &#224; effet de serre.</p><p style=\"text-align: justify;\">Une suppression brutale du CITE sur les chaudi&#232;res gaz &#224; tr&#232;s haute performance &#233;nerg&#233;tique n&#8217;est pas concevable aujourd&#8217;hui.</p><p style=\"text-align: justify;\">Dans le projet de r&#233;forme du CITE, l&#8217;aide pour les m&#233;nages interm&#233;diaires s&#8217;&#233;l&#232;verait, coup de pouce chauffage compris, &#224; 600&#160;&#8364;, pour un &#233;quipement dont l&#8217;administration &#233;value les co&#251;ts de travaux ( fourniture et pose ) &#224; plus de 4&#160;800&#160;&#8364;.</p><p style=\"text-align: justify;\">Le reste &#224; charge repr&#233;sente un montant important pour que les m&#233;nages puissent engager massivement de tels travaux.</p><p style=\"text-align: justify;\">En l&#8217;&#233;tat actuel des solutions techniques, le remplacement des anciennes chaudi&#232;res gaz et fioul par les seuls &#233;quipements EnR (&#233;quipements fonctionnant aux &#233;nergies renouvelables) n&#8217;est pas envisageable dans l&#8217;imm&#233;diat pour des raisons techniques et financi&#232;res.</p><p style=\"text-align: justify;\">Pour les m&#233;nages qui souhaiteraient remplacer ces &#233;quipements obsol&#232;tes, les chaudi&#232;res gaz THPE constituent donc un moyen transitoire qu&#8217;il convient de continuer &#224; soutenir, notamment dans les r&#233;gions les plus froides.</p><p style=\"text-align: justify;\">&#192; titre d&#8217;information, le co&#251;t d&#8217;une installation de chaudi&#232;res gaz THPE s&#8217;&#233;l&#232;ve &#224; 4&#160;800&#160;&#8364; TTC, &#224; comparer &#224; celui de chaudi&#232;res EnR [bois et pompe &#224; chaleur (PAC)], allant de 12&#160;000&#160;&#8364; &#224; 18&#160;000&#160;&#8364; TTC.</p><p style=\"text-align: justify;\">Pour ce faire, le Gouvernement doit accompagner, dans cette phase transitoire, les m&#233;nages aux revenus interm&#233;diaires, qui sont aussi des publics expos&#233;s &#224; la pr&#233;carit&#233; &#233;nerg&#233;tique.</p><p style=\"text-align: justify;\">Le CITE pour ces chaudi&#232;res THPE serait n&#233;anmoins plafonn&#233; &#224; 600&#160;euros pour ces m&#233;nages aux revenus interm&#233;diaires.</p>"
  },
  "representations": [
    {
      "nom": "PDF",
      "typeMime": {
        "type": "application",
        "subType": "PDF"
      },
      "statutRepresentation": {
        "verbatim": true,
        "canonique": true,
        "officielle": true,
        "transcription": false,
        "enregistrement": false
      },
      "contenu": {
        "documentURI": "/15/amendements/2272A/AN/1972.pdf"
      }
    }
  ],
  "seanceDiscussion": "RUANR5L15S2020IDS21867",
  "sort": {
    "dateSaisie": "2019-10-17T18:48:54.000+02:00",
    "sortEnSeance": "Rejeté"
  },
  "dateDepot": "2019-10-10T02:00:00.000+02:00",
  "dateDistribution": "2019-10-16T02:00:00.000+02:00",
  "article99": "0",
  "loiReference": {}
}