{
  "uid": "AMANR5L15SEA717460BTC2243P0D1N1446",
  "identifiant": {
    "legislature": "15",
    "numero": "1446",
    "numRect": "0",
    "saisine": {
      "texteLegislatifRef": "PRJLANR5L15BTC2243",
      "numeroPartiePLF": "0",
      "organeExamen": "PO717460",
      "mentionSecondeDeliberation": "0"
    }
  },
  "numeroLong": "1446",
  "etapeTexte": "1ère lecture (1ère assemblée saisie)",
  "triAmendement": "acaaaaaaaaaaaaaaaaaaaaaaaaaaaaaaaaaaaaaaaaaaaaaaaagrki",
  "cardinaliteAmdtMultiples": "1",
  "etat": "Discuté",
  "signataires": {
    "auteur": {
      "typeAuteur": "Depute",
      "acteurRef": "PA719608",
      "groupePolitiqueRef": "PO723569"
    },
    "cosignatairesRefs": [
      "PA720568",
      "PA719608"
    ],
    "texteAffichable": "Mme&#160;M&#233;nard et Mme&#160;Thill"
  },
  "pointeurFragmentTexte": {
    "division": {
      "titre": "Article PREMIER",
      "articleDesignationCourte": "ART. PREMIER",
      "type": "ARTICLE",
      "avantAApres": "A",
      "divisionRattachee": "ARTICLE PREMIER",
      "urlDivisionTexteVise": "/15/textes/2243.asp#D_Article_1er"
    },
    "alinea": {
      "numero": "13"
    }
  },
  "corps": {
    "dispositif": "<p style=\"text-align: justify;\">Supprimer les alin&#233;as 13 &#224; 23.</p>",
    "exposeSommaire": "<p style=\"text-align: justify;\">Il s&#8217;agit d&#8217;un amendement d&#8217;appel pour r&#233;fl&#233;chir sur la question de la libre disposition ou non des embryons.</p><p style=\"text-align: justify;\">Il pose aussi la question de la destin&#233;e propre de l&#8217;embryon. Est-il consid&#233;r&#233; comme un enfant &#224; na&#238;tre seulement lorsqu&#8217;il fait l&#8217;objet d&#8217;un projet parental&#160;?</p><p style=\"text-align: justify;\">En d&#8217;autres termes, l&#8217;embryon se justifie-t-il par lui-m&#234;me&#160;? A-t-il une existence propre&#160;? Ou est-il soumis &#224; la projection que l&#8217;on fait sur lui, c&#8217;est-&#224;-dire &#224; un projet parental&#160;?</p><p style=\"text-align: justify;\">Pour les embryons qui ne sont pas choisis pour &#234;tre &#171;&#160;accueillis&#160;&#187;, leur destin&#233;e serait-elle alors uniquement d&#8217;&#234;tre d&#233;truits ou de faire l&#8217;objet de recherche&#160;?</p><p style=\"text-align: justify;\">On voit bien le danger que comporte un raisonnement en fonction de l&#8217;intention que l&#8217;on projette sur un embryon. Et l&#8217;on voit bien le malaise que ces questions induisent.</p><p style=\"text-align: justify;\">Il convient donc de faire preuve de prudence.</p>"
  },
  "representations": [
    {
      "nom": "PDF",
      "typeMime": {
        "type": "application",
        "subType": "PDF"
      },
      "statutRepresentation": {
        "verbatim": true,
        "canonique": true,
        "officielle": true,
        "transcription": false,
        "enregistrement": false
      },
      "contenu": {
        "documentURI": "/15/amendements/2243/AN/1446.pdf"
      }
    }
  ],
  "seanceDiscussion": "RUANR5L15S2019IDS21830",
  "sort": {
    "dateSaisie": "2019-09-26T19:29:13.000+02:00",
    "sortEnSeance": "Tombé"
  },
  "dateDepot": "2019-09-19T02:00:00.000+02:00",
  "dateDistribution": "2019-09-23T02:00:00.000+02:00",
  "article99": "0",
  "loiReference": {}
}