{
  "uid": "AMANR5L15PO59048B0235P1D1N472",
  "identifiant": {
    "legislature": "15",
    "numero": "472",
    "numRect": "0",
    "saisine": {
      "texteLegislatifRef": "PRJLANR5L15B0235",
      "numeroPartiePLF": "1",
      "organeExamen": "PO59048",
      "mentionSecondeDeliberation": "0"
    }
  },
  "numeroLong": "I-CF472",
  "etapeTexte": "1ère lecture (1ère assemblée saisie)",
  "triAmendement": "mbho",
  "cardinaliteAmdtMultiples": "1",
  "etat": "Discuté",
  "signataires": {
    "auteur": {
      "typeAuteur": "Depute",
      "acteurRef": "PA719676",
      "groupePolitiqueRef": "PO730958"
    },
    "cosignatairesRefs": [
      "PA718860",
      "PA718868",
      "PA720422",
      "PA719676",
      "PA721202",
      "PA721960",
      "PA721226",
      "PA721062",
      "PA720846",
      "PA720892",
      "PA719578",
      "PA722142",
      "PA720286",
      "PA721210",
      "PA588884",
      "PA720430",
      "PA2150"
    ],
    "texteAffichable": "Mme&#160;Ressiguier,  Mme&#160;Autain, M.&#160;Bernalicis, M.&#160;Coquerel, M.&#160;Corbi&#232;re, Mme&#160;Fiat, M.&#160;Lachaud, M.&#160;Larive, M.&#160;M&#233;lenchon, Mme&#160;Obono, Mme&#160;Panot, M.&#160;Prud&apos;homme, M.&#160;Quatennens, M.&#160;Ratenon, Mme&#160;Rubin, M.&#160;Ruffin et Mme&#160;Taurine"
  },
  "pointeurFragmentTexte": {
    "division": {
      "titre": "Article 16",
      "articleDesignationCourte": "ART. 16",
      "type": "ARTICLE",
      "avantAApres": "A",
      "divisionRattachee": "ARTICLE 16",
      "urlDivisionTexteVise": "/15/textes/0235A.asp#D_Article_16"
    },
    "alinea": {
      "numero": "3"
    }
  },
  "corps": {
    "dispositif": "<p>Supprimer les alin&#233;as 3, 4 et 5.</p>",
    "exposeSommaire": "<p style=\"text-align: justify;\">&#160;</p><p style=\"text-align: justify;\">Selon le c du 1&#176; du III de l&#8217;article&#160;149 de la loi n&#176;2016&#8209;201, les r&#233;gions per&#231;oivent 450 millions de fonds de soutien en mati&#232;re de d&#233;veloppement &#233;conomique, r&#233;partis selon les crit&#232;res d&#233;finis par le 1 du I du m&#234;me article. La modification pr&#233;vue par les alin&#233;a (3) &#224; (5) de l&#8217;article&#160;16 du PLF2018 vise &#224; supprimer purement et simplement le fonds de soutien aux r&#233;gions.&#160;</p><p style=\"text-align: justify;\">La non int&#233;gration dans la base de TVA transf&#233;r&#233;e aux r&#233;gions de 450 millions d&#8217;euros correspondant au fonds de soutien &#224; destination des r&#233;gions cr&#233;&#233; en 2017, contrevient &#224; l&#8217;accord entre les repr&#233;sentants des r&#233;gions et le pr&#233;c&#233;dent Gouvernement, valid&#233; par le Parlement &#224; l&#8217;article&#160;149 de la loi de finances pour 2017. Elle diminue substantiellement les ressources dont b&#233;n&#233;ficient les r&#233;gions alors que celles-ci exercent d&#233;sormais, en vertu de la loi NOTRe, une comp&#233;tence exclusive en mati&#232;re &#233;conomique.</p>"
  },
  "representations": [
    {
      "nom": "PDF",
      "typeMime": {
        "type": "application",
        "subType": "PDF"
      },
      "statutRepresentation": {
        "verbatim": true,
        "canonique": true,
        "officielle": true,
        "transcription": false,
        "enregistrement": false
      },
      "contenu": {
        "documentURI": "/15/amendements/0235A/CION_FIN/CF472.pdf"
      }
    }
  ],
  "sort": {
    "dateSaisie": "2017-10-12T11:59:34.000+02:00",
    "sortEnSeance": "Non soutenu"
  },
  "dateDepot": "2017-10-06T02:00:00.000+02:00",
  "dateDistribution": "2017-10-11T02:00:00.000+02:00",
  "article99": "0",
  "loiReference": {}
}