{
  "uid": "AMANR5L15PO59048B2272P2D1N786",
  "identifiant": {
    "legislature": "15",
    "numero": "786",
    "numRect": "0",
    "saisine": {
      "texteLegislatifRef": "PRJLANR5L15B2272",
      "numeroPartiePLF": "2",
      "organeExamen": "PO59048",
      "mentionSecondeDeliberation": "0"
    }
  },
  "numeroLong": "II-CF786",
  "etapeTexte": "1ère lecture (1ère assemblée saisie)",
  "triAmendement": "bdoaaaaaaaaaaaaaaaaaaaaaaaaaaaaaaaaaaaaaaaaaaaaaaaawekns",
  "cardinaliteAmdtMultiples": "1",
  "etat": "Discuté",
  "signataires": {
    "auteur": {
      "typeAuteur": "Depute",
      "acteurRef": "PA746",
      "groupePolitiqueRef": "PO730934"
    },
    "cosignatairesRefs": [
      "PA746"
    ],
    "texteAffichable": "M.&#160;Carrez"
  },
  "pointeurFragmentTexte": {
    "missionVisee": {
      "idMissionAN": "823",
      "libelleMission": "Relations avec les collectivités territoriales",
      "codeMissionPLF": "B",
      "libelleMissionPLF": "Répartition, par mission et programme, des crédits du budget général"
    },
    "division": {
      "titre": "Article 78",
      "articleDesignationCourte": "APRÈS ART. 78",
      "type": "ARTICLE",
      "avantAApres": "Apres",
      "divisionRattachee": "APRÈS L'ARTICLE 78, insérer l'article suivant:",
      "articleAdditionnel": "1",
      "urlDivisionTexteVise": "/15/textes/2272C.asp#D_Article_78"
    }
  },
  "corps": {
    "dispositif": "<p style=\"text-align: justify;\">Au cinqui&#232;me alin&#233;a du I du XV de l&#8217;article&#160;59 de la loi n&#176;&#160;2015&#8209;991 du 7 ao&#251;t 2015 portant sur une nouvelle organisation territoriale de la R&#233;publique, le taux&#160;: &#171;&#160;10&#160;%&#160;&#187; est remplac&#233; par le taux&#160;: &#171;&#160;0&#160;%&#160;&#187;.</p>",
    "exposeSommaire": "<p style=\"text-align: justify;\">Il est propos&#233; que la DSIT vers&#233;e par la MGP aux EPT &#224; partir d&#8217;une fraction de l&#8217;&#233;volution de cvae positive annuelle per&#231;ue par la MGP puisse &#233;voluer dans une fourchette de 0 &#224; 50&#160;% et cela pour la seule ann&#233;e 2020. Le remplacement du taux de 10&#160;% par le taux de 0&#160;% est justifi&#233; par la prolongation en 2020 de la compensation de la dotation d&#8217;intercommunalit&#233; au sein des dotations d&#8217;&#233;quilibre vers&#233;es par la MGP aux EPT&#160;;</p>"
  },
  "representations": [
    {
      "nom": "PDF",
      "typeMime": {
        "type": "application",
        "subType": "PDF"
      },
      "statutRepresentation": {
        "verbatim": true,
        "canonique": true,
        "officielle": true,
        "transcription": false,
        "enregistrement": false
      },
      "contenu": {
        "documentURI": "/15/amendements/2272C/CION_FIN/CF786.pdf"
      }
    }
  ],
  "sort": {
    "dateSaisie": "2019-10-24T11:43:46.000+02:00",
    "sortEnSeance": "Non soutenu"
  },
  "dateDepot": "2019-10-21T02:00:00.000+02:00",
  "dateDistribution": "2019-10-24T02:00:00.000+02:00",
  "article99": "0",
  "loiReference": {
    "codeLoi": "xx loi 2015-991",
    "divisionCodeLoi": "59"
  }
}