{
  "uid": "AMANR5L15SEA717460B2296P0D1N1784",
  "identifiant": {
    "legislature": "15",
    "numero": "1784",
    "numRect": "0",
    "saisine": {
      "texteLegislatifRef": "PRJLANR5L15B2296",
      "numeroPartiePLF": "0",
      "organeExamen": "PO717460",
      "mentionSecondeDeliberation": "0"
    }
  },
  "numeroLong": "1784",
  "etapeTexte": "1ère lecture (1ère assemblée saisie)",
  "triAmendement": "bdaaaaaaaaaaaaaaaaaaaaaaaaaaaaaaaaaaaaaaaaaaaaaaaadn",
  "cardinaliteAmdtMultiples": "1",
  "etat": "Discuté",
  "signataires": {
    "auteur": {
      "typeAuteur": "Depute",
      "acteurRef": "PA642788",
      "groupePolitiqueRef": "PO730964"
    },
    "cosignatairesRefs": [
      "PA642788"
    ],
    "texteAffichable": "M.&#160;V&#233;ran"
  },
  "pointeurFragmentTexte": {
    "division": {
      "titre": "Article 12",
      "articleDesignationCourte": "ART. 12",
      "type": "ARTICLE",
      "avantAApres": "A",
      "divisionRattachee": "ARTICLE 12",
      "urlDivisionTexteVise": "/15/textes/2296.asp#D_Article_12"
    },
    "alinea": {
      "numero": "16"
    }
  },
  "corps": {
    "dispositif": "<p style=\"text-align: justify;\">&#192; l&#8217;alin&#233;a&#160;16, substituer aux mots&#160;:</p><p style=\"text-align: justify;\">&#171;&#160;organismes prestataires d&#233;finis au 3&#176;&#160;de&#160;&#187;</p><p style=\"text-align: justify;\">les mots&#160;:</p><p style=\"text-align: justify;\">&#171;&#160;entreprises ou associations mentionn&#233;es &#224;&#160;&#187;.</p>",
    "exposeSommaire": "<p style=\"text-align: justify;\">R&#233;dactionnel</p>",
    "cartoucheDelaiDepotDepasse": "Sous réserve de son traitement par les services de l'Assemblée nationale et de sa recevabilité"
  },
  "representations": [
    {
      "nom": "PDF",
      "typeMime": {
        "type": "application",
        "subType": "PDF"
      },
      "statutRepresentation": {
        "verbatim": true,
        "canonique": true,
        "officielle": true,
        "transcription": false,
        "enregistrement": false
      },
      "contenu": {
        "documentURI": "/15/amendements/2296/AN/1784.pdf"
      }
    }
  ],
  "seanceDiscussion": "RUANR5L15S2020IDS21877",
  "sort": {
    "dateSaisie": "2019-10-24T12:09:24.000+02:00",
    "sortEnSeance": "Adopté"
  },
  "dateDepot": "2019-10-18T02:00:00.000+02:00",
  "dateDistribution": "2019-10-24T02:00:00.000+02:00",
  "article99": "0",
  "loiReference": {}
}