{
  "uid": "AMANR5L15SEA717460BTC0902P0D1N386",
  "identifiant": {
    "legislature": "15",
    "numero": "386",
    "numRect": "0",
    "saisine": {
      "texteLegislatifRef": "PRJLANR5L15BTC0902",
      "numeroPartiePLF": "0",
      "organeExamen": "PO717460",
      "mentionSecondeDeliberation": "0"
    }
  },
  "numeroLong": "386",
  "etapeTexte": "1ère lecture (1ère assemblée saisie)",
  "triAmendement": "abfzs",
  "cardinaliteAmdtMultiples": "1",
  "etat": "Discuté",
  "signataires": {
    "auteur": {
      "typeAuteur": "Depute",
      "acteurRef": "PA605518",
      "groupePolitiqueRef": "PO730964"
    },
    "cosignatairesRefs": [
      "PA605518",
      "PA720996"
    ],
    "texteAffichable": "M.&#160;Fran&#231;ois-Michel&#160;Lambert et M.&#160;El Guerrab"
  },
  "pointeurFragmentTexte": {
    "division": {
      "titre": "Article 11 octies",
      "articleDesignationCourte": "APRÈS ART. 11 OCTIES",
      "type": "ARTICLE",
      "avantAApres": "Apres",
      "divisionRattachee": "APRÈS L'ARTICLE 11 OCTIES, insérer l'article suivant:",
      "articleAdditionnel": "1",
      "urlDivisionTexteVise": "/15/textes/0902.asp#D_Article_11_octies"
    }
  },
  "corps": {
    "dispositif": "<p style=\"text-align: justify;\">Apr&#232;s le premier alin&#233;a de l&#8217;article L.&#160;230&#8209;2 du code rural et de la p&#234;che maritime, il est ins&#233;r&#233; un alin&#233;a ainsi r&#233;dig&#233;&#160;:</p><p style=\"text-align: justify;\">&#171;&#160;Sans pr&#233;judice du R&#232;glement d&#8217;ex&#233;cution (UE) n&#176;&#160;2017/949 de la Commission du 2&#160;juin&#160;2017 portant modalit&#233;s d&#8217;application du r&#232;glement (CE) n&#176;&#160;1760/2000 du Parlement&#160;europ&#233;en et du Conseil en ce qui concerne la configuration du code d&#8217;identification des bovins et modifiant le r&#232;glement (CE) n&#176;&#160;911/2004 de la Commission, l&#8217;&#201;tat garantit pour l&#8217;ensemble des consommateurs la transparence de l&#8217;origine sur tous les produits bruts et transform&#233;s dans tous les circuits d&#8217;achats au 1<sup>er</sup> janvier 2020. Un arr&#234;t&#233; du ministre charg&#233; des questions agroalimentaires en d&#233;termine les modalit&#233;s.&#160;&#187;</p>",
    "exposeSommaire": "<p style=\"text-align: justify;\">Les R&#232;glements de l&#8217;Union&#160;Europ&#233;enne pr&#233;voient d&#233;j&#224; des conditions strictes de tra&#231;abilit&#233; des bovins. L&#8217;amendement ainsi r&#233;dig&#233; entend g&#233;n&#233;raliser &#224; l&#8217;&#233;gard de l&#8217;ensemble des produits alimentaires vendus dans le commerce cette obligation de transparence et de tra&#231;abilit&#233; de l&#8217;origine du produit comme d&#233;j&#224; sugg&#233;r&#233; &#224; l&#8217;occasion des d&#233;bats lors des &#201;tats G&#233;n&#233;raux de l&#8217;Alimentation.</p>"
  },
  "representations": [
    {
      "nom": "PDF",
      "typeMime": {
        "type": "application",
        "subType": "PDF"
      },
      "statutRepresentation": {
        "verbatim": true,
        "canonique": true,
        "officielle": true,
        "transcription": false,
        "enregistrement": false
      },
      "contenu": {
        "documentURI": "/15/amendements/0902/AN/386.pdf"
      }
    }
  ],
  "seanceDiscussion": "RUANR5L15S2018IDS21108",
  "sort": {
    "dateSaisie": "2018-05-26T19:22:37.000+02:00",
    "sortEnSeance": "Non soutenu"
  },
  "dateDepot": "2018-05-11T02:00:00.000+02:00",
  "dateDistribution": "2018-05-22T02:00:00.000+02:00",
  "article99": "0",
  "loiReference": {
    "codeLoi": "c rural et pêche maritime",
    "divisionCodeLoi": "L230-2"
  }
}