{
  "uid": "AMANR5L15SEA717460B0911P0D1N1638",
  "identifiant": {
    "legislature": "15",
    "numero": "1638",
    "numRect": "0",
    "saisine": {
      "texteLegislatifRef": "PRJLANR5L15B0911",
      "numeroPartiePLF": "0",
      "organeExamen": "PO717460",
      "mentionSecondeDeliberation": "0"
    }
  },
  "numeroLong": "1638",
  "etapeTexte": "1ère lecture (1ère assemblée saisie)",
  "triAmendement": "oazo",
  "cardinaliteAmdtMultiples": "1",
  "etat": "A discuter",
  "signataires": {
    "auteur": {
      "typeAuteur": "Depute",
      "acteurRef": "PA719778",
      "groupePolitiqueRef": "PO730964"
    },
    "cosignatairesRefs": [
      "PA719326",
      "PA720414",
      "PA718876",
      "PA721434",
      "PA719550",
      "PA721776",
      "PA721726",
      "PA719092",
      "PA607619",
      "PA719464",
      "PA718802",
      "PA722320",
      "PA719790",
      "PA722078",
      "PA720622",
      "PA722008",
      "PA719778",
      "PA721876",
      "PA720402",
      "PA720074",
      "PA720538",
      "PA721398"
    ],
    "texteAffichable": "M.&#160;Jolivet,  M.&#160;Baich&#232;re, M.&#160;Lejeune, M.&#160;Morenas, Mme&#160;Tuffnell, M.&#160;Chalumeau, Mme&#160;Janvier, M.&#160;Savatier, M.&#160;Besson-Moreau, Mme&#160;Mauborgne, Mme&#160;Degois, Mme&#160;Gipson, M.&#160;Nadot, M.&#160;Paluszkiewicz, M.&#160;Perrot, M.&#160;Perea, Mme&#160;Leguille-Balloy, M.&#160;Molac, Mme&#160;Tanguy, Mme&#160;Lardet, Mme&#160;Bureau-Bonnard et Mme&#160;De Temmerman"
  },
  "pointeurFragmentTexte": {
    "division": {
      "titre": "Article 7",
      "articleDesignationCourte": "ART. 7",
      "type": "ARTICLE",
      "avantAApres": "A",
      "divisionRattachee": "ARTICLE 7",
      "urlDivisionTexteVise": "/15/textes/0911.asp#D_Article_7"
    },
    "alinea": {
      "numero": "3"
    }
  },
  "corps": {
    "dispositif": "<p style=\"text-align: justify;\">Supprimer les alin&#233;as 3 et 4.</p>",
    "exposeSommaire": "<p style=\"text-align: justify;\">Amendement de coordination avec l&#8217;amendement pr&#233;sent&#233; &#224; l&#8217;article&#160;2 visant &#224; cr&#233;er la cat&#233;gorie des lois de financement des collectivit&#233;s territoriales, et avec celui, pr&#233;sent&#233; apr&#232;s l&#8217;article&#160;7, visant &#224; d&#233;finir la proc&#233;dure d&#8217;examen de ces lois (dans un nouvel article&#160;47&#8209;1&#8209;1) et &#224; permettre l&#8217;examen conjoint, en tout ou partie, non seulement du projet de loi de finances et du projet de loi de financement de la s&#233;curit&#233; sociale (comme le pr&#233;voient les alin&#233;as ici supprim&#233;s) mais aussi des projets de loi de financement des collectivit&#233;s territoriales.</p>"
  },
  "representations": [
    {
      "nom": "PDF",
      "typeMime": {
        "type": "application",
        "subType": "PDF"
      },
      "statutRepresentation": {
        "verbatim": true,
        "canonique": true,
        "officielle": true,
        "transcription": false,
        "enregistrement": false
      },
      "contenu": {
        "documentURI": "/15/amendements/0911/AN/1638.pdf"
      }
    }
  ],
  "dateDepot": "2018-07-06T02:00:00.000+02:00",
  "dateDistribution": "2018-07-10T02:00:00.000+02:00",
  "article99": "0",
  "loiReference": {}
}