{
  "uid": "AMANR5L15PO419865B1831P0D1N722",
  "identifiant": {
    "legislature": "15",
    "numero": "722",
    "numRect": "0",
    "saisine": {
      "texteLegislatifRef": "PRJLANR5L15B1831",
      "numeroPartiePLF": "0",
      "organeExamen": "PO419865",
      "mentionSecondeDeliberation": "0"
    }
  },
  "numeroLong": "CD722",
  "etapeTexte": "1ère lecture (2ème assemblée saisie)",
  "triAmendement": "idvaaaaaaaaaaaaaaaaaaaaaaaaaaaaaaaaaaaaaaaaaaaaaaazzzzzzzzzo",
  "cardinaliteAmdtMultiples": "1",
  "etat": "Irrecevable",
  "signataires": {
    "auteur": {
      "typeAuteur": "Depute",
      "acteurRef": "PA720996",
      "groupePolitiqueRef": "PO759900"
    },
    "cosignatairesRefs": [
      "PA605518",
      "PA331582",
      "PA607619",
      "PA333421",
      "PA720996"
    ],
    "texteAffichable": "M.&#160;El Guerrab,  M.&#160;Fran&#231;ois-Michel&#160;Lambert, M.&#160;Philippe&#160;Vigier, M.&#160;Molac et M.&#160;Pancher"
  },
  "pointeurFragmentTexte": {
    "division": {
      "titre": "Article 1er B",
      "articleDesignationCourte": "APRÈS ART. 1ER B",
      "type": "ARTICLE",
      "avantAApres": "Apres",
      "divisionRattachee": "APRÈS L'ARTICLE 1ER B, insérer l'article suivant:",
      "articleAdditionnel": "1",
      "urlDivisionTexteVise": "/15/textes/1831.asp#D_Article_1er_B"
    }
  },
  "corps": {
    "dispositif": "<p style=\"text-align: justify;\">L&#8217;article&#160;302 <i>bis</i> K du code g&#233;n&#233;ral des imp&#244;ts est compl&#233;t&#233; par un VIII ainsi r&#233;dig&#233;&#160;:</p><p style=\"text-align: justify;\">&#171;&#160;VIII.&#160;&#8211;&#160;1.&#160;Les montants mentionn&#233;s aux deuxi&#232;me et troisi&#232;me alin&#233;as du II font l&#8217;objet d&#8217;une contribution additionnelle, d&#233;nomm&#233;e &#8220;contribution aide au co-d&#233;veloppement durable&#8221;, vers&#233;e au budget de l&#8217;Agence fran&#231;aise de d&#233;veloppement.</p><p style=\"text-align: justify;\">&#171;&#160;Le montant de cette contribution, per&#231;ue en fonction de la destination finale du passager, est fix&#233; &#224;&#160;:</p><p style=\"text-align: justify;\">&#171;&#160;a)&#160;5&#160;&#8364; pour chaque passager embarqu&#233; &#224; destination de la France, d&#8217;un autre &#201;tat membre de l&#8217;Union europ&#233;enne, d&#8217;un autre &#201;tat partie &#224; l&#8217;accord sur l&#8217;Espace &#233;conomique europ&#233;en ou de la Conf&#233;d&#233;ration suisse&#160;;</p><p style=\"text-align: justify;\">&#171;&#160;b)&#160;20&#160;&#8364;, pour chaque passager embarqu&#233; &#224; destination d&#8217;un autre &#201;tat.</p><p style=\"text-align: justify;\">&#171;&#160;Ces tarifs sont port&#233;s, respectivement, &#224; 10 et 40&#160;&#8364; lorsque le passager peut b&#233;n&#233;ficier sans suppl&#233;ment de prix &#224; bord de services auxquels l&#8217;ensemble des passagers ne peut acc&#233;der gratuitement.</p><p style=\"text-align: justify;\">&#171;&#160;Ces tarifs sont int&#233;gralement r&#233;percut&#233;s sur chaque billet d&#8217;avion, dans le respect des cat&#233;gories mentionn&#233;es aux troisi&#232;me &#224; cinqui&#232;me alin&#233;as du pr&#233;sent VIII.</p><p style=\"text-align: justify;\">&#171;&#160;L&#8217;intitul&#233; et le montant de cette contribution sont port&#233;s &#224; l&#8217;attention du passager et de l&#8217;acqu&#233;reur du billet d&#8217;avion, en &#233;vidence, &#224; la fois en amont de l&#8217;achat et sur le titre de transport.&#160;&#187;</p><p style=\"text-align: justify;\">&#171;&#160;2.&#160;La contribution aide au co-d&#233;veloppement durable est contr&#244;l&#233;e dans les conditions pr&#233;vues au&#160;IV et suivant les d&#233;lais de prescription du droit de reprise pr&#233;vus &#224; l&#8217;article L.&#160;176 du livre des proc&#233;dures fiscales en mati&#232;re de taxes sur le chiffre d&#8217;affaires.</p><p style=\"text-align: justify;\">&#171;&#160;3.&#160;La contribution aide au co-d&#233;veloppement durable est recouvr&#233;e dans les conditions fix&#233;es au&#160;V. Elle est revers&#233;e mensuellement &#224; l&#8217;Agence de financement des infrastructures de transport de France.</p><p style=\"text-align: justify;\">&#171;&#160;4.&#160;La contribution aide au co-d&#233;veloppement durable est due pour les billets achet&#233;s &#224; compter du 1<sup>er</sup> janvier 2020.&#160;&#187;</p>",
    "exposeSommaire": "<p>Par le biais de cet amendement, il s&#8217;agit de diversifier et renforcer sensiblement les sources de financement de l&#8217;aide au co-d&#233;veloppement, compris dans une acception durable. Fond&#233;e sur la consommation de k&#233;ros&#232;ne, l&#8217;un des carburants les plus polluants qui soient, cette contribution sera &#224; l&#8217;origine de recettes nouvelles qui permettront d&#8217;aider les pays en voie de d&#233;veloppement &#224; opter non pas pour l&#8217;industrialisation &#224; outrance, dont on sait les effets particuli&#232;rement nocifs sur l&#8217;environnement, mais pour la croissance verte.</p><p style=\"text-align: justify;\">L&#8217;objectif est donc de susciter du &#171;&#160;co-d&#233;veloppement durable&#160;&#187;. Il s&#8217;agit l&#224; d&#8217;un imp&#233;ratif notamment illustr&#233; par le ph&#233;nom&#232;ne croissant de &#171;&#160;migration environnementale&#160;&#187;. Nous assistons &#224; la multiplication de catastrophes li&#233;es au d&#233;r&#232;glement climatique, qui augmentent en fr&#233;quence et en intensit&#233;. Inondations, temp&#234;tes, glissements de terrain mais aussi s&#233;cheresses, temp&#233;ratures extr&#234;mes, feux de for&#234;ts et d&#233;gradations des &#233;cosyst&#232;mes&#160;: l&#8217;on pourrait sans peine allonger la liste. Ces trag&#233;dies sont le r&#233;sultat de l&#8217;absence de v&#233;ritables politiques pr&#233;ventives &#224; l&#8217;&#233;chelle r&#233;gionale et internationale. Elles soul&#232;vent, d&#8217;ailleurs, la question de la reconnaissance des &#171;&#160;r&#233;fugi&#233;s environnementaux&#160;&#187;.</p><p style=\"text-align: justify;\">Ces catastrophes aux co&#251;ts gigantesques menacent directement la s&#233;curit&#233; alimentaire et hydrique de millions d&#8217;individus. Elles renforcent les p&#233;rils pesant sur la r&#233;partition des ressources naturelles et sur la stabilit&#233; des territoires, alors que la d&#233;mographie mondiale en pleine croissance pose des d&#233;fis en mati&#232;re d&#8217;alimentation, d&#8217;&#233;ducation et d&#8217;emploi. Ces catastrophes qui affectent les plus vuln&#233;rables condamnent le d&#233;veloppement de certaines zones du monde, font le lit des in&#233;galit&#233;s et pr&#233;parent nos crises futures.</p><p style=\"text-align: justify;\">Chaque ann&#233;e, en moyenne, 26,4 millions de personnes sont contraintes de quitter leur habitation pour de tels motifs&#160;; plus de 40 millions de personnes ont d&#251; se d&#233;placer l&#8217;an pass&#233;, soit 4 fois plus que les populations touch&#233;es par les conflits arm&#233;s. &#192; l&#8217;horizon 2050, 250 millions de personnes devraient quitter leurs territoires d&#8217;origine &#224; cause du r&#233;chauffement climatique.</p><p style=\"text-align: justify;\">&#192; l&#8217;&#233;chelle de la M&#233;diterran&#233;e, la hausse de temp&#233;rature a d&#233;j&#224; atteint 1,3 degr&#233; l&#8217;an dernier, ce qui est proche de la limite basse de 1,5 degr&#233;, fix&#233;e par l&#8217;Accord de Paris. Dans cette r&#233;gion, et en Afrique Sub-saharienne, ce sont des &#238;les et villages qui disparaissent &#224; cause de la mont&#233;e des eaux. Les r&#233;coltes sont d&#233;cim&#233;es &#224; cause de retards de pluies, d&#8217;inondations et de la d&#233;gradation des sols. Les petits p&#234;cheurs et agriculteurs n&#8217;ont d&#8217;autre solution que d&#8217;abandonner leurs activit&#233;s, pour rejoindre les bidonvilles des zones urbaines.</p><p style=\"text-align: justify;\">Il est urgent d&#8217;agir d&#232;s &#224; pr&#233;sent, en adoptant une approche globale des questions li&#233;es au d&#233;veloppement durable, et cela aux niveaux national, r&#233;gional et international. Cette contribution au &#171;&#160;co-d&#233;veloppement durable&#160;&#187; constituerait une premi&#232;re &#233;tape.</p>"
  },
  "representations": [
    {
      "nom": "PDF",
      "typeMime": {
        "type": "application",
        "subType": "PDF"
      },
      "statutRepresentation": {
        "verbatim": true,
        "canonique": true,
        "officielle": true,
        "transcription": false,
        "enregistrement": false
      },
      "contenu": {
        "documentURI": "/15/amendements/1831/CION-DVP/CD722.pdf"
      }
    }
  ],
  "dateDepot": "2019-05-03T02:00:00.000+02:00",
  "dateDistribution": "2019-05-10T02:00:00.000+02:00",
  "article99": "0",
  "loiReference": {
    "codeLoi": "impôts",
    "divisionCodeLoi": "302 bis K"
  }
}