{
  "uid": "AMANR5L15SEA717460B0988P0D1N2",
  "identifiant": {
    "legislature": "15",
    "numero": "2",
    "numRect": "0",
    "saisine": {
      "texteLegislatifRef": "PNREANR5L15B0988",
      "numeroPartiePLF": "0",
      "organeExamen": "PO717460",
      "mentionSecondeDeliberation": "0"
    }
  },
  "numeroLong": "2",
  "etapeTexte": "Lecture unique",
  "triAmendement": "c",
  "cardinaliteAmdtMultiples": "1",
  "etat": "Discuté",
  "signataires": {
    "auteur": {
      "typeAuteur": "Depute",
      "acteurRef": "PA720430",
      "groupePolitiqueRef": "PO730958"
    },
    "cosignatairesRefs": [
      "PA720892",
      "PA721960",
      "PA721226",
      "PA721062",
      "PA719578",
      "PA719676",
      "PA722142",
      "PA720430",
      "PA721210",
      "PA720422",
      "PA720846",
      "PA720286",
      "PA721202",
      "PA718868",
      "PA2150",
      "PA718860",
      "PA588884"
    ],
    "texteAffichable": "M.&#160;Bernalicis,  Mme&#160;Autain, M.&#160;Coquerel, M.&#160;Corbi&#232;re, Mme&#160;Fiat, M.&#160;Lachaud, M.&#160;Larive, M.&#160;M&#233;lenchon, Mme&#160;Obono, Mme&#160;Panot, M.&#160;Prud&apos;homme, M.&#160;Quatennens, M.&#160;Ratenon, Mme&#160;Ressiguier, Mme&#160;Rubin, M.&#160;Ruffin et Mme&#160;Taurine"
  },
  "pointeurFragmentTexte": {
    "division": {
      "titre": "Article unique",
      "articleDesignationCourte": "ART. UNIQUE",
      "type": "ARTICLE",
      "avantAApres": "A",
      "divisionRattachee": "ARTICLE UNIQUE",
      "urlDivisionTexteVise": "/15/textes/0988.asp#D_Article_unique"
    }
  },
  "corps": {
    "dispositif": "<p style=\"line-height: 1.38; text-align: justify;\">R&#233;diger ainsi cet article&#160;:</p><p style=\"line-height: 1.38; text-align: justify;\">&#171;&#160;En application des articles&#160;137 et suivants du R&#232;glement de l&#8217;Assembl&#233;e nationale, il est cr&#233;&#233; une commission d&#8217;enqu&#234;te de trente membres charg&#233;e d&#8217;examiner les conditions d&#8217;usage et de commandement des forces de l&#8217;ordre lors des &#233;v&#233;nements survenus en marge de la manifestation parisienne du 1<sup>er</sup> mai 2018.</p><p style=\"text-align: justify;\">&#171;&#160;La commission fait notamment &#233;tat avec pr&#233;cision de la gestion du commandement des forces de s&#233;curit&#233; en amont et pendant la journ&#233;e, et de la responsabilit&#233; de chaque &#233;chelon de la cha&#238;ne de commandement.</p><p style=\"text-align: justify;\">&#171;&#160;La commission dresse fid&#232;lement l&#8217;historique des informations transmises entre chaque &#233;chelon de responsabilit&#233; et s&#8217;attache &#224; identifier ses cons&#233;quences sur le d&#233;roulement de la manifestation.&#160;&#187;</p>",
    "exposeSommaire": "<p style=\"text-align: justify;\">Par cet amendement, nous proposons de modifier le champ d&#8217;enqu&#234;te propos&#233; par cette PPR pour le centrer sur&#160;tendant les conditions d&#8217;usage et de commandement des forces de l&#8217;ordre lors des &#233;v&#233;nements survenus en marge de la manifestation parisienne du 1<sup>er</sup> mai 2018.</p>"
  },
  "representations": [
    {
      "nom": "PDF",
      "typeMime": {
        "type": "application",
        "subType": "PDF"
      },
      "statutRepresentation": {
        "verbatim": true,
        "canonique": true,
        "officielle": true,
        "transcription": false,
        "enregistrement": false
      },
      "contenu": {
        "documentURI": "/15/amendements/0988/AN/2.pdf"
      }
    }
  ],
  "seanceDiscussion": "RUANR5L15S2018IDS21124",
  "sort": {
    "dateSaisie": "2018-06-21T16:03:42.000+02:00",
    "sortEnSeance": "Tombé"
  },
  "dateDepot": "2018-06-18T02:00:00.000+02:00",
  "dateDistribution": "2018-06-19T02:00:00.000+02:00",
  "article99": "0",
  "loiReference": {}
}