{
  "uid": "AMANR5L15SEA717460B0911P0D1N2280",
  "identifiant": {
    "legislature": "15",
    "numero": "2280",
    "numRect": "0",
    "saisine": {
      "texteLegislatifRef": "PRJLANR5L15B0911",
      "numeroPartiePLF": "0",
      "organeExamen": "PO717460",
      "mentionSecondeDeliberation": "0"
    }
  },
  "numeroLong": "2280",
  "etapeTexte": "1ère lecture (1ère assemblée saisie)",
  "triAmendement": "akto",
  "cardinaliteAmdtMultiples": "1",
  "etat": "A discuter",
  "signataires": {
    "auteur": {
      "typeAuteur": "Depute",
      "acteurRef": "PA722202",
      "groupePolitiqueRef": "PO730940"
    },
    "cosignatairesRefs": [
      "PA718926",
      "PA721896",
      "PA610667",
      "PA335612",
      "PA720692",
      "PA720546",
      "PA610654",
      "PA721118",
      "PA441",
      "PA718720",
      "PA721012",
      "PA722110",
      "PA721270",
      "PA689",
      "PA267306",
      "PA722202"
    ],
    "texteAffichable": "M.&#160;Jumel,  M.&#160;Chassaigne, Mme&#160;Bello, M.&#160;Brotherson, M.&#160;Bruneel, Mme&#160;Buffet, M.&#160;Dharr&#233;ville, M.&#160;Dufr&#232;gne, Mme&#160;Faucillon, Mme&#160;K&#233;clard-Mond&#233;sir, M.&#160;Lecoq, M.&#160;Nilor, M.&#160;Peu, M.&#160;Fabien&#160;Roussel, M.&#160;Serville et M.&#160;Wulfranc"
  },
  "pointeurFragmentTexte": {
    "division": {
      "titre": "Article 2",
      "articleDesignationCourte": "APRÈS ART. 2",
      "type": "ARTICLE",
      "avantAApres": "Apres",
      "divisionRattachee": "APRÈS L'ARTICLE 2, insérer l'article suivant:",
      "articleAdditionnel": "1",
      "urlDivisionTexteVise": "/15/textes/0911.asp#D_Article_2"
    }
  },
  "corps": {
    "dispositif": "<p style=\"text-align: justify;\">L&#8217;article&#160;38 de la Constitution est abrog&#233;.</p>",
    "exposeSommaire": "<p style=\"text-align: justify;\">Les propositions que nous portons dans le cadre de la r&#233;forme constitutionnelle visent &#224; renforcer les pouvoirs du Parlement et de l&#8217;opposition face &#224; l&#8217;hypertrophie du pouvoir ex&#233;cutif. Mettre fin &#224; ce d&#233;s&#233;quilibre des pouvoirs est indispensable pour corriger le d&#233;ficit d&#233;mocratique du r&#233;gime. Dans cet esprit, nous proposons &#233;galement de renforcer les droits de participation d&#233;mocratique. Enfin, une r&#233;forme de la Constitution ne peut se concevoir sans y inscrire des principes essentiels aujourd&#8217;hui absents de notre Loi fondamentale.</p><p style=\"text-align: justify;\">Dans ce cadre, les auteurs de cet amendement abrogent le r&#233;gime des ordonnances qui permet de dessaisir le Parlement d&#8217;importantes pr&#233;rogatives.</p>"
  },
  "representations": [
    {
      "nom": "PDF",
      "typeMime": {
        "type": "application",
        "subType": "PDF"
      },
      "statutRepresentation": {
        "verbatim": true,
        "canonique": true,
        "officielle": true,
        "transcription": false,
        "enregistrement": false
      },
      "contenu": {
        "documentURI": "/15/amendements/0911/AN/2280.pdf"
      }
    }
  ],
  "dateDepot": "2018-07-06T02:00:00.000+02:00",
  "dateDistribution": "2018-07-10T02:00:00.000+02:00",
  "article99": "0",
  "loiReference": {
    "codeLoi": "Constitution",
    "divisionCodeLoi": "38"
  }
}