{
  "uid": "AMANR5L15SEA717460BTC2401P0D1N1",
  "identifiant": {
    "legislature": "15",
    "numero": "1",
    "numRect": "0",
    "saisine": {
      "texteLegislatifRef": "PRJLANR5L15BTC2401",
      "numeroPartiePLF": "0",
      "organeExamen": "PO717460",
      "mentionSecondeDeliberation": "0"
    }
  },
  "numeroLong": "1",
  "etapeTexte": "1ère lecture (2ème assemblée saisie)",
  "triAmendement": "tpacaaaaaaaaaaaaaaaaaaaaaaaaaaaaaaaaaaaaaaaaaaaaaazzzzzzzzzzzzzzzzzy",
  "cardinaliteAmdtMultiples": "1",
  "etat": "A discuter",
  "signataires": {
    "auteur": {
      "typeAuteur": "Depute",
      "acteurRef": "PA334768",
      "groupePolitiqueRef": "PO730964"
    },
    "cosignatairesRefs": [
      "PA720298",
      "PA722134",
      "PA334768",
      "PA719540",
      "PA607595",
      "PA606639",
      "PA721328",
      "PA721344",
      "PA642724",
      "PA608641",
      "PA722344"
    ],
    "texteAffichable": "M.&#160;Touraine,  Mme&#160;Brugnera, M.&#160;Julien-Laferri&#232;re, M.&#160;Blein, M.&#160;Bonnell, M.&#160;Barbier, Mme&#160;Cariou, M.&#160;Fi&#233;vet, M.&#160;Pellois, Mme&#160;Toutut-Picard et M.&#160;Vignal"
  },
  "pointeurFragmentTexte": {
    "division": {
      "titre": "Article 7",
      "articleDesignationCourte": "ART. 7",
      "type": "ARTICLE",
      "avantAApres": "A",
      "divisionRattachee": "ARTICLE 7",
      "urlDivisionTexteVise": "/15/textes/2401.asp#D_Article_7"
    },
    "alinea": {
      "avantAApres": "A",
      "numero": "4",
      "alineaDesignation": "Alinéa 4"
    }
  },
  "corps": {
    "dispositif": "<p style=\"text-align: justify;\">Supprimer les alin&#233;as 4 &#224; 7.</p>",
    "exposeSommaire": "<p style=\"text-align: justify;\">Selon le pr&#233;sent projet de loi, dans le cadre d&#8217;une proc&#233;dure de r&#233;vision du PLU, le dossier d&#8217;arr&#234;t de projet est transmis pour avis aux communes, apr&#232;s avoir &#233;t&#233; d&#233;lib&#233;r&#233; par le conseil de l&#8217;EPCI ou de la collectivit&#233; comp&#233;tente. Celles-ci disposent de trois mois pour &#233;mettre un avis. Dans le cadre d&#8217;un avis n&#233;gatif d&#8217;une seule commune, le dossier d&#8217;arr&#234;t de projet du PLU doit &#234;tre de nouveau d&#233;lib&#233;r&#233; &#224; la majorit&#233; des 2/3 des suffrages exprim&#233;s.&#160;</p><p style=\"text-align: justify;\">Cette situation constituerait un frein au d&#233;veloppement des PLU intercommunaux, en particulier dans les cas o&#249; la majorit&#233; des 2/3 pourrait &#234;tre difficile &#224; obtenir, ce qui reviendrait &#224; bloquer compl&#232;tement la situation.&#160;Aussi, cet amendement propose de supprimer cette disposition.&#160;</p><p style=\"text-align: justify;\">D&#8217;une part, les communes sont d&#233;j&#224; impliqu&#233;es en amont de l&#8217;arr&#234;t de projet, &#224; l&#8217;occasion de la collaboration obligatoire dont les modalit&#233;s font l&#8217;objet d&#8217;une conf&#233;rence intercommunale des maires et d&#8217;une d&#233;lib&#233;ration de l&#8217;&#233;tablissement intercommunal. De plus, le PADD est d&#233;battu avant l&#8217;arr&#234;t du projet dans chacun des conseils municipaux. D&#8217;autre part, la jurisprudence incertaine sur les avis des communes &#233;mettant des avis favorables avec r&#233;serves ferait porter un risque lourd sur la proc&#233;dure, si la requalification en avis d&#233;favorable&#160;<i>a posteriori</i> de l&#8217;approbation &#233;tait d&#233;cid&#233;e par le juge administratif.&#160;</p>"
  },
  "representations": [
    {
      "nom": "PDF",
      "typeMime": {
        "type": "application",
        "subType": "PDF"
      },
      "statutRepresentation": {
        "verbatim": true,
        "canonique": true,
        "officielle": true,
        "transcription": false,
        "enregistrement": false
      },
      "contenu": {
        "documentURI": "/15/amendements/2401/AN/1.pdf"
      }
    }
  ],
  "dateDepot": "2019-11-11T01:00:00.000+01:00",
  "dateDistribution": "2019-11-18T01:00:00.000+01:00",
  "article99": "0",
  "loiReference": {}
}