{
  "uid": "AMANR5L15SEA717460B1297P0D1N730",
  "identifiant": {
    "legislature": "15",
    "numero": "730",
    "numRect": "0",
    "saisine": {
      "texteLegislatifRef": "PRJLANR5L15B1297",
      "numeroPartiePLF": "0",
      "organeExamen": "PO717460",
      "mentionSecondeDeliberation": "0"
    }
  },
  "numeroLong": "730",
  "etapeTexte": "1ère lecture (1ère assemblée saisie)",
  "triAmendement": "bkaaaaaaaaaaaaaaaaaaaaaaaaaaaaaaaaaaaaaaaaaaaaaaaabi",
  "cardinaliteAmdtMultiples": "1",
  "etat": "Irrecevable",
  "signataires": {
    "auteur": {
      "typeAuteur": "Depute",
      "acteurRef": "PA642868",
      "groupePolitiqueRef": "PO744425"
    },
    "cosignatairesRefs": [
      "PA267355",
      "PA720696",
      "PA267780",
      "PA421348",
      "PA720230",
      "PA266788",
      "PA1960",
      "PA267330",
      "PA721110",
      "PA721486",
      "PA712014",
      "PA2952",
      "PA267042",
      "PA695100",
      "PA268019",
      "PA610775",
      "PA721194",
      "PA331567",
      "PA267585",
      "PA719806",
      "PA722030",
      "PA642868",
      "PA267766",
      "PA267241",
      "PA332228",
      "PA721094",
      "PA642935"
    ],
    "texteAffichable": "M.&#160;Christophe,  Mme&#160;Auconie, M.&#160;Becht, M.&#160;Benoit, M.&#160;Bournazel, M.&#160;Guy&#160;Bricout, Mme&#160;de La Raudi&#232;re, M.&#160;Demilly, Mme&#160;Descamps, Mme&#160;Fr&#233;d&#233;rique&#160;Dumas, M.&#160;Dunoyer, M.&#160;Favennec Becot, Mme&#160;Firmin Le Bodo, M.&#160;Gom&#232;s, M.&#160;Meyer&#160;Habib, M.&#160;Herth, M.&#160;Lagarde, M.&#160;Ledoux, M.&#160;Leroy, Mme&#160;Magnier, M.&#160;Morel-&#192;-L&apos;Huissier, M.&#160;Naegelen, Mme&#160;Sanquer, M.&#160;Vercamer, M.&#160;Villiers, M.&#160;Warsmann et M.&#160;Zumkeller"
  },
  "pointeurFragmentTexte": {
    "division": {
      "titre": "Article 13",
      "articleDesignationCourte": "APRÈS ART. 13",
      "type": "ARTICLE",
      "avantAApres": "Apres",
      "divisionRattachee": "APRÈS L'ARTICLE 13, insérer l'article suivant:",
      "articleAdditionnel": "1",
      "urlDivisionTexteVise": "/15/textes/1297.asp#D_Article_13"
    }
  },
  "corps": {
    "dispositif": "<p style=\"text-align: justify;\">Apr&#232;s l&#8217;article L.&#160;243&#8209;7&#8209;1 A du code de la s&#233;curit&#233; sociale, il est ins&#233;r&#233; un article L.&#160;243&#8209;7&#8209;1 B ainsi r&#233;dig&#233;&#160;: </p><p style=\"text-align: justify;\">&#171;&#160;<i>Art.&#160;L.&#160;243&#8209;7&#8209;1 B</i>.&#160;&#8211;&#160;En cas de litige portant sur des cotisations de s&#233;curit&#233; sociale, des majorations de retard, ou encore sur la contribution sociale g&#233;n&#233;ralis&#233;e, le cotisant est invit&#233; &#224; se faire entendre, s&#8217;il en &#233;met le souhait, devant la commission des recours, suivant des modalit&#233;s fix&#233;es par d&#233;cret.</p><p style=\"text-align: justify;\">&#171;&#160;Les membres de la commission des recours suivent une formation initiale &#224; l&#8217;exercice de leurs fonctions et une formation continue, prise en charge par les organismes de s&#233;curit&#233; sociale suivant des modalit&#233;s fix&#233;es par d&#233;cret.</p><p style=\"text-align: justify;\">&#171;&#160;En cas de litige portant sur des cotisations de s&#233;curit&#233; sociale, des majorations de retard, ou encore sur la contribution sociale g&#233;n&#233;ralis&#233;e, la commission des recours a la facult&#233; de faire appel, afin de l&#8217;&#233;clairer dans ses d&#233;cisions, &#224; des personnes ext&#233;rieures choisies pour leurs comp&#233;tences dans le domaine concern&#233; et suivant des modalit&#233;s fix&#233;es par d&#233;cret.</p><p style=\"text-align: justify;\">&#171;&#160;En cas de saisine de la commission des recours, le cours des majorations de retard est suspendu jusqu&#8217;au moment o&#249; ladite commission a statu&#233; sur la r&#233;clamation du cotisant.</p><p style=\"text-align: justify;\">&#171;&#160;La contestation de la mise en demeure, pr&#233;vue &#224; l&#8217;article L.&#160;244&#8209;2 du pr&#233;sent code dans le cadre du contentieux g&#233;n&#233;ral de la s&#233;curit&#233; sociale, suspend toute proc&#233;dure en recouvrement des cotisations.&#160;&#187;</p>",
    "exposeSommaire": "<p style=\"text-align: justify;\">La Commission de recours amiable constitue la premi&#232;re &#233;tape obligatoire du contentieux g&#233;n&#233;ral de la s&#233;curit&#233; sociale (V. CSS, art R 142&#8209;1). Comme l&#8217;a consid&#233;r&#233; le rapport Fouquet, &#171;&#160;les commissions de recours amiables constituent un &#233;l&#233;ment essentiel du dispositif des pr&#233;l&#232;vements obligatoires sociaux et les entreprises&#160;&#187; (cotisations sociales&#160;: stabiliser la norme, s&#233;curiser les relations avec les URSSAF et pr&#233;venir les abus. Rapport d&#8217;Olivier Fouquet. Juillet 2008. p.37).</p><p style=\"text-align: justify;\">L&#8217;appr&#233;ciation port&#233;e sur ces commissions est diff&#233;rente suivant le type d&#8217;organismes concern&#233; (CPAM - CARSAT - CAF). En effet, dans ces derni&#232;res entit&#233;s, les commissions de recours amiable jouent un r&#244;le social et humain qu&#8217;il ne faudrait pas sous-estimer. En revanche, le r&#244;le de ces commissions semble beaucoup plus contest&#233; d&#232;s lors qu&#8217;une contestation appara&#238;t sur le fond d&#8217;un dossier et qu&#8217;un enjeu financier est en cause. Le rapport Fouquet pr&#233;cit&#233; le relevait en notant que &#171;&#160;la proc&#233;dure suivie est imparfaite et respecte peu les exigences du contradictoire&#160;&#187; (rapport pr&#233;cit&#233; p.37). On notera, en effet, que la proc&#233;dure est uniquement &#233;crite et qu&#8217;il sera statu&#233; sur le dossier en l&#8217;absence du cotisant (contrairement &#224; ce qui existe en mati&#232;re fiscale o&#249; le contribuable est convoqu&#233; (V. liv. proc. fisc, art R 60&#8209;1 pour la Commission d&#233;partementale des imp&#244;ts directs et des taxes sur le chiffre d&#8217;affaires - liv. proc. fisc, art R 59 B-1 pour la Commission d&#233;partementale de conciliation).</p><p style=\"text-align: justify;\">On comprend, dans ces conditions, que la doctrine ait &#233;mis des propos parfois s&#233;v&#232;res sur cette institution. Ainsi, pour H.G. Bascou, &#171;&#160;le l&#233;gislateur devrait abandonner cette phase qui n&#8217;a, comme seul int&#233;r&#234;t, de permettre aux URSSAF, compte tenu de la lenteur des d&#233;cisions, de demander aux cotisants, en cas de r&#233;sultats d&#233;favorables, de plus importantes majorations de retard&#160;&#187; (Droit et Patrimoine. Avril 1999, n&#176; 70, p 33 s). De m&#234;me, pour le conseiller &#224; la Cour de Cassation, J.&#160;Favard, &#171;&#160;la Commission de recours amiable a &#233;t&#233; cr&#233;&#233;e dans le but d&#8217;&#233;viter les contentieux. Pour cela, elle doit trancher les situations qui se pr&#233;sentent &#224; elle de mani&#232;re impartiale. Si elle ne remplit pas cette condition, elle ne pourra qu&#8217;&#234;tre abandonn&#233;e&#160;&#187; (V. Contr&#244;le URSSAF&#160;: vers une charte du cotisant v&#233;rifi&#233;. colloque. Ass. Nat. 10 mars 1999, p 14).</p><p style=\"text-align: justify;\">Les propositions sont les suivantes&#160;:</p><p style=\"text-align: justify;\">- Le terme &#171;&#160;amiable&#160;&#187; est inadapt&#233;. En effet, la d&#233;finition du dictionnaire Larousse pour ce terme est&#160;: qui a lieu par voie de conciliation, par opposition &#224; la voie contentieuse&#160;; qui est fait de gr&#233; &#224; gr&#233;, directement avec la personne concern&#233;e. Or, justement, nous sommes ici dans une voie contentieuse, sans que le cotisant ne soit pr&#233;sent lorsque son dossier est &#233;tudi&#233;. Nous proposons donc les termes plus neutres de &#171;&#160;commission des recours&#160;&#187;</p><p style=\"text-align: justify;\">- Il parait indispensable que le cotisant, non seulement, puisse pr&#233;senter des observations, mais qu&#8217;il puisse s&#8217;exprimer, s&#8217;il le souhaite.</p><p style=\"text-align: justify;\">- Il semble n&#233;cessaire d&#8217;introduire au sein de ces commissions, des personnes qualifi&#233;es eu &#233;gard &#224; leur connaissance de la mati&#232;re (experts comptables, avocats sp&#233;cialis&#233;s en droit de la s&#233;curit&#233; sociale, responsables sociaux d&#8217;entreprise&#8230;). Cela permettrait d&#8217;&#233;viter un v&#233;ritable dialogue au sein de ces entit&#233;s</p><p style=\"text-align: justify;\">- Il est souhaitable que, durant cette phase, le cours des majorations de retard cesse de courir. En effet, il ne para&#238;t pas logique, qu&#8217;un organisme de recouvrement, puisse pratiquement profiter de son propre retard &#224; statuer.</p><p style=\"text-align: justify;\">- Enfin, il serait souhaitable de mettre fin &#224; un imbroglio juridique en mati&#232;re de recouvrement des cotisations. En effet, une URSSAF, dans le but d&#8217;acc&#233;l&#233;rer la proc&#233;dure, est-elle en droit de d&#233;cerner une contrainte (contentieux du recouvrement) en cas de saisine pr&#233;alable de la Commission de recours amiable par le d&#233;biteur (contentieux g&#233;n&#233;ral)&#160;? La r&#233;ponse paraissait n&#233;gative. Toutefois, faute de texte, la Cour de cassation a d&#233;cid&#233; l&#8217;inverse (Cass. soc. 31 mai 2001 pourvoi n&#176; 99&#8209;14622&#160;&#8211;&#160;Cass civ 2&#176; 3 avril 2014. pourvoi n&#176; 13&#8209;15136), obligeant ainsi le d&#233;biteur &#224; mener deux actions de front. Il convient donc de mettre fin &#224; cette &#233;tranget&#233;&#8230;</p>"
  },
  "representations": [
    {
      "nom": "PDF",
      "typeMime": {
        "type": "application",
        "subType": "PDF"
      },
      "statutRepresentation": {
        "verbatim": true,
        "canonique": true,
        "officielle": true,
        "transcription": false,
        "enregistrement": false
      },
      "contenu": {
        "documentURI": "/15/amendements/1297/AN/730.pdf"
      }
    }
  ],
  "dateDepot": "2018-10-18T02:00:00.000+02:00",
  "article99": "0",
  "loiReference": {
    "codeLoi": "c sécurité sociale",
    "divisionCodeLoi": "L243-7-1 B"
  }
}