{
  "uid": "AMANR5L15PO419865B1831P0D1N623",
  "identifiant": {
    "legislature": "15",
    "numero": "623",
    "numRect": "0",
    "saisine": {
      "texteLegislatifRef": "PRJLANR5L15B1831",
      "numeroPartiePLF": "0",
      "organeExamen": "PO419865",
      "mentionSecondeDeliberation": "0"
    }
  },
  "numeroLong": "CD623",
  "etapeTexte": "1ère lecture (2ème assemblée saisie)",
  "triAmendement": "goaaaaaaaaaaaaaaaaaaaaaaaaaaaaaaaaaaaaaaaaaaaaaaaadoe",
  "cardinaliteAmdtMultiples": "1",
  "etat": "Discuté",
  "signataires": {
    "auteur": {
      "typeAuteur": "Depute",
      "acteurRef": "PA721426",
      "groupePolitiqueRef": "PO730964"
    },
    "cosignatairesRefs": [
      "PA719822",
      "PA606639",
      "PA718728",
      "PA721398",
      "PA720814",
      "PA719972",
      "PA721844",
      "PA722336",
      "PA720854",
      "PA720538",
      "PA722178",
      "PA605963",
      "PA721458",
      "PA721426",
      "PA719080",
      "PA720414"
    ],
    "texteAffichable": "Mme&#160;Riotton,  Mme&#160;Vanceunebrock-Mialon, M.&#160;Roseren, M.&#160;Maire, Mme&#160;Marsaud, Mme&#160;De Temmerman, M.&#160;Test&#233;, M.&#160;Cazenove, Mme&#160;Degois, M.&#160;Perrot, M.&#160;Alauzet, Mme&#160;Piron, Mme&#160;Thillaye, M.&#160;Vignal, M.&#160;Thi&#233;baut et Mme&#160;Sarles"
  },
  "pointeurFragmentTexte": {
    "division": {
      "titre": "Article 27",
      "articleDesignationCourte": "ART. 27",
      "type": "ARTICLE",
      "avantAApres": "A",
      "divisionRattachee": "ARTICLE 27",
      "urlDivisionTexteVise": "/15/textes/1831.asp#D_Article_27"
    },
    "alinea": {
      "numero": "2"
    }
  },
  "corps": {
    "dispositif": "<p style=\"text-align: justify;\">Compl&#233;ter la seconde phrase de l&#8217;alin&#233;a&#160;2 par les mots&#160;:</p><p style=\"text-align: justify;\">&#171;&#160;et &#224; abaisser le taux de concentration de polluants atmosph&#233;riques auxquels sont expos&#233;s certains &#233;tablissements recevant du public dont la liste est fix&#233;e par d&#233;cret en Conseil d&#8217;&#201;tat.&#160;&#187;</p><p style=\"text-align: justify;\">&#160;</p><p style=\"text-align: justify;\">&#160;</p><p style=\"text-align: justify;\">&#160;</p>",
    "exposeSommaire": "<p style=\"text-align: justify;\">La loi n&#176;&#160;2010&#8209;788 du 12&#160;juillet 2010 portant engagement national pour l&#8217;environnement (Grenelle 2) a d&#233;j&#224; rendu obligatoire la surveillance de la qualit&#233; de l&#8217;air int&#233;rieur dans certains &#233;tablissements recevant un public (ERP) sensible (cr&#232;ches, &#233;coles, halte-garderie...). </p><p style=\"text-align: justify;\">Le pr&#233;sent amendement permet d&#8217;assurer que le plan d&#8217;action relatif &#224; la qualit&#233; de l&#8217;air pr&#233;vu &#224; l&#8217;article&#160;27, contribue en particulier &#224; r&#233;duire les pollutions auxquels ces &#233;tablissements particuli&#232;rement sensibles et prioritaires sont expos&#233;s.</p>"
  },
  "representations": [
    {
      "nom": "PDF",
      "typeMime": {
        "type": "application",
        "subType": "PDF"
      },
      "statutRepresentation": {
        "verbatim": true,
        "canonique": true,
        "officielle": true,
        "transcription": false,
        "enregistrement": false
      },
      "contenu": {
        "documentURI": "/15/amendements/1831/CION-DVP/CD623.pdf"
      }
    }
  ],
  "sort": {
    "dateSaisie": "2019-05-18T01:21:34.000+02:00",
    "sortEnSeance": "Non soutenu"
  },
  "dateDepot": "2019-05-03T02:00:00.000+02:00",
  "dateDistribution": "2019-05-16T02:00:00.000+02:00",
  "article99": "0",
  "loiReference": {
    "codeLoi": "5"
  }
}