{
  "uid": "AMANR5L15PO59051B2357P0D1N350",
  "identifiant": {
    "legislature": "15",
    "numero": "350",
    "numRect": "0",
    "saisine": {
      "texteLegislatifRef": "PRJLANR5L15B2357",
      "numeroPartiePLF": "0",
      "organeExamen": "PO59051",
      "mentionSecondeDeliberation": "0"
    }
  },
  "numeroLong": "CL350",
  "etapeTexte": "1ère lecture (2ème assemblée saisie)",
  "triAmendement": "raaaaaaaaaaaaaaaaaaaaaaaaaaaaaaaaaaaaaaaaaaaaaaaaaaq",
  "cardinaliteAmdtMultiples": "1",
  "etat": "Discuté",
  "signataires": {
    "auteur": {
      "typeAuteur": "Depute",
      "acteurRef": "PA607395",
      "groupePolitiqueRef": "PO730964"
    },
    "cosignatairesRefs": [
      "PA720190",
      "PA720552",
      "PA607395"
    ],
    "texteAffichable": "M.&#160;Travert,  Mme&#160;Rauch et M.&#160;Sorre"
  },
  "pointeurFragmentTexte": {
    "division": {
      "titre": "Article 31",
      "articleDesignationCourte": "APRÈS ART. 31",
      "type": "ARTICLE",
      "avantAApres": "Apres",
      "divisionRattachee": "APRÈS L'ARTICLE 31, insérer l'article suivant:",
      "articleAdditionnel": "1",
      "urlDivisionTexteVise": "/15/textes/2357.asp#D_Article_31"
    }
  },
  "corps": {
    "dispositif": "<p style=\"text-align: justify;\">&#171;&#160;Apr&#232;s l&#8217;article L.&#160;2123&#8209;12&#8209;1 du code g&#233;n&#233;ral des collectivit&#233;s territoriales, il est ins&#233;r&#233; un article L.&#160;2123&#8209;12&#8209;2 ainsi r&#233;dig&#233;&#160;:</p><p style=\"text-align: justify;\">&#171;&#160;&#171;&#160;<i>Art.&#160;L.&#160;2123&#8209;12&#8209;2</i>.&#160;&#8211;&#160;Dans les communes de&#160;3&#160;500&#160;habitants et plus, une formation est obligatoirement organis&#233;e au cours de la premi&#232;re ann&#233;e de mandat pour le maire et les adjoints sur l&#8217;exercice de leurs attributions attach&#233;es &#224; leur qualit&#233; d&#8217;officier de police judiciaire.&#160;&#187;&#160;&#187;</p>",
    "exposeSommaire": "<p style=\"text-align: justify;\">L&#8217;objet de cet amendement est de pr&#233;voir une formation &#224; l&#8217;exercice des pr&#233;rogatives d&#8217;officier de police judiciaire pour les maires et les adjoints.</p>"
  },
  "representations": [
    {
      "nom": "PDF",
      "typeMime": {
        "type": "application",
        "subType": "PDF"
      },
      "statutRepresentation": {
        "verbatim": true,
        "canonique": true,
        "officielle": true,
        "transcription": false,
        "enregistrement": false
      },
      "contenu": {
        "documentURI": "/15/amendements/2357/CION_LOIS/CL350.pdf"
      }
    }
  ],
  "sort": {
    "dateSaisie": "2019-11-07T19:45:17.000+01:00",
    "sortEnSeance": "Non soutenu"
  },
  "dateDepot": "2019-10-31T01:00:00.000+01:00",
  "dateDistribution": "2019-11-05T01:00:00.000+01:00",
  "article99": "0",
  "loiReference": {
    "codeLoi": "CGCT",
    "divisionCodeLoi": "L2123-12-2 dc"
  }
}