{
  "uid": "AMANR5L15PO766718B2187P0D1N674",
  "identifiant": {
    "legislature": "15",
    "numero": "674",
    "numRect": "0",
    "saisine": {
      "texteLegislatifRef": "PRJLANR5L15B2187",
      "numeroPartiePLF": "0",
      "organeExamen": "PO766718",
      "mentionSecondeDeliberation": "0"
    }
  },
  "numeroLong": "674",
  "etapeTexte": "1ère lecture (1ère assemblée saisie)",
  "triAmendement": "afaaaaaaaaaaaaaaaaaaaaaaaaaaaaaaaaaaaaaaaaaaaaaaaazitdho",
  "cardinaliteAmdtMultiples": "1",
  "etat": "Discuté",
  "signataires": {
    "auteur": {
      "typeAuteur": "Depute",
      "acteurRef": "PA642847",
      "groupePolitiqueRef": "PO730934"
    },
    "cosignatairesRefs": [
      "PA642847"
    ],
    "texteAffichable": "M.&#160;Bazin"
  },
  "pointeurFragmentTexte": {
    "division": {
      "titre": "Article 2",
      "articleDesignationCourte": "ART. 2",
      "type": "ARTICLE",
      "avantAApres": "A",
      "divisionRattachee": "ARTICLE 2",
      "urlDivisionTexteVise": "/15/textes/2187.asp#D_Article_2"
    },
    "alinea": {
      "avantAApres": "A",
      "numero": "8",
      "alineaDesignation": "Alinéa 8"
    }
  },
  "corps": {
    "dispositif": "<p style=\"text-align: justify;\">Compl&#233;ter l&#8217;alin&#233;a 8 par la phrase suivante&#160;: </p><p style=\"text-align: justify;\">&#171;&#160;Le don est gratuit.&#160;&#187;</p>",
    "exposeSommaire": "<p>Bien que cela soit d&#233;j&#224; pr&#233;cis&#233; dans la loi, il convient de l&#8217;indiquer &#224; cet article du code.</p><p>En effet, devant la p&#233;nurie pr&#233;visible de gam&#232;tes et l&#8217;augmentation de la demande li&#233;e &#224; l&#8217;extension de la PMA, il convient d&#8217;&#233;viter les pressions et les d&#233;rives qui pourraient voir le jour&#160;: passe-droits, r&#233;mun&#233;rations&#8230;</p>"
  },
  "representations": [
    {
      "nom": "PDF",
      "typeMime": {
        "type": "application",
        "subType": "PDF"
      },
      "statutRepresentation": {
        "verbatim": true,
        "canonique": true,
        "officielle": true,
        "transcription": false,
        "enregistrement": false
      },
      "contenu": {
        "documentURI": "/15/amendements/2187/CSBIOETH/674.pdf"
      }
    }
  ],
  "sort": {
    "dateSaisie": "2019-09-12T00:31:33.000+02:00",
    "sortEnSeance": "Rejeté"
  },
  "dateDepot": "2019-09-03T02:00:00.000+02:00",
  "dateDistribution": "2019-09-09T02:00:00.000+02:00",
  "article99": "0",
  "loiReference": {}
}