{
  "uid": "AMANR5L15SEA717460BTC1924P0D1N543",
  "identifiant": {
    "legislature": "15",
    "numero": "543",
    "numRect": "0",
    "saisine": {
      "texteLegislatifRef": "PRJLANR5L15BTC1924",
      "numeroPartiePLF": "0",
      "organeExamen": "PO717460",
      "mentionSecondeDeliberation": "0"
    }
  },
  "numeroLong": "543",
  "etapeTexte": "1ère lecture (1ère assemblée saisie)",
  "triAmendement": "maaaaaaaaaaaaaaaaaaaaaaaaaaaaaaaaaaaaaaaaaaaaaaaaasffti",
  "cardinaliteAmdtMultiples": "1",
  "etat": "Discuté",
  "signataires": {
    "auteur": {
      "typeAuteur": "Depute",
      "acteurRef": "PA719930",
      "groupePolitiqueRef": "PO758835"
    },
    "cosignatairesRefs": [
      "PA643145",
      "PA340343",
      "PA335532",
      "PA508",
      "PA605069",
      "PA333818",
      "PA340357",
      "PA607553",
      "PA429893",
      "PA333285",
      "PA608172",
      "PA342415",
      "PA608741",
      "PA335054",
      "PA609332",
      "PA1809",
      "PA720988",
      "PA610681",
      "PA1008",
      "PA1592",
      "PA642764",
      "PA608695",
      "PA267233",
      "PA1198",
      "PA337483",
      "PA608011",
      "PA332614",
      "PA719930",
      "PA609590"
    ],
    "texteAffichable": "M.&#160;Vallaud,  Mme&#160;Karamanli, Mme&#160;Untermaier, Mme&#160;Pau-Langevin, M.&#160;Saulignac, Mme&#160;Pires Beaune, Mme&#160;Rabault, M.&#160;Aviragnet, Mme&#160;Bareigts, Mme&#160;Battistel, Mme&#160;Bi&#233;mouret, M.&#160;Bouillon, M.&#160;Jean-Louis&#160;Bricout, M.&#160;Carvounas, M.&#160;Alain&#160;David, Mme&#160;Laurence&#160;Dumont, M.&#160;Faure, M.&#160;Garot, M.&#160;David&#160;Habib, M.&#160;Hutin, M.&#160;Juanico, M.&#160;J&#233;r&#244;me&#160;Lambert, M.&#160;Letchimy, Mme&#160;Manin, M.&#160;Potier, M.&#160;Pueyo, Mme&#160;Tolmont, Mme&#160;Vainqueur-Christophe et Mme&#160;Victory"
  },
  "pointeurFragmentTexte": {
    "division": {
      "titre": "Article 29",
      "articleDesignationCourte": "ART. 29",
      "type": "ARTICLE",
      "avantAApres": "A",
      "divisionRattachee": "ARTICLE 29",
      "urlDivisionTexteVise": "/15/textes/1924.asp#D_Article_29"
    },
    "alinea": {
      "numero": "15"
    }
  },
  "corps": {
    "dispositif": "<p>&#192; l&#8217;alin&#233;a&#160;15, substituer aux mots&#160;:</p><p style=\"text-align: justify;\">&#171;&#160;ne peut exc&#233;der&#160;&#187;</p><p style=\"text-align: justify;\">les mots&#160;:</p><p style=\"text-align: justify;\">&#171;&#160;repr&#233;sente au minimum&#160;&#187;.</p>",
    "exposeSommaire": "<p>Cet amendement de repli du groupe Socialistes et apparent&#233;s vise &#224; ce que l&#8217;absence d&#8217;&#233;laboration du plan d&#8217;action en faveur de l&#8217;&#233;galit&#233; professionnelle soit sanctionn&#233;e par une p&#233;nalit&#233; dont le montant repr&#233;sente au minimum 1&#160;% de la&#160;r&#233;mun&#233;ration brute annuelle globale de l&#8217;ensemble des personnels.</p><p style=\"text-align: justify;\">Dans sa r&#233;daction actuelle, l&#8217;article&#160;29 pr&#233;voit une p&#233;nalit&#233; dont le montant ne peut exc&#233;der 1&#160;% de cette r&#233;mun&#233;ration.</p>"
  },
  "representations": [
    {
      "nom": "PDF",
      "typeMime": {
        "type": "application",
        "subType": "PDF"
      },
      "statutRepresentation": {
        "verbatim": true,
        "canonique": true,
        "officielle": true,
        "transcription": false,
        "enregistrement": false
      },
      "contenu": {
        "documentURI": "/15/amendements/1924/AN/543.pdf"
      }
    }
  ],
  "sort": {
    "dateSaisie": "2019-05-21T19:23:52.000+02:00",
    "sortEnSeance": "Rejeté"
  },
  "dateDepot": "2019-05-09T02:00:00.000+02:00",
  "dateDistribution": "2019-05-13T02:00:00.000+02:00",
  "article99": "0",
  "loiReference": {}
}