{
  "uid": "AMANR5L15SEA717460BTC1461P0D1N67",
  "identifiant": {
    "legislature": "15",
    "numero": "67",
    "numRect": "0",
    "saisine": {
      "texteLegislatifRef": "PRJLANR5L15BTC1461",
      "numeroPartiePLF": "0",
      "organeExamen": "PO717460",
      "mentionSecondeDeliberation": "0"
    }
  },
  "numeroLong": "67",
  "etapeTexte": "1ère lecture (2ème assemblée saisie)",
  "triAmendement": "daaaaaaaaaaaaaaaaaaaaaaaaaaaaaaaaaaaaaaaaaaaaaaaaawk",
  "cardinaliteAmdtMultiples": "1",
  "amendementParent": "AMANR5L15SEA717460BTC1461P0D1N12",
  "etat": "Discuté",
  "signataires": {
    "auteur": {
      "typeAuteur": "Depute",
      "acteurRef": "PA1012",
      "groupePolitiqueRef": "PO730934"
    },
    "cosignatairesRefs": [
      "PA1012"
    ],
    "texteAffichable": "M.&#160;de la Verpilli&#232;re"
  },
  "pointeurFragmentTexte": {
    "division": {
      "titre": "Article 2",
      "articleDesignationCourte": "ART. 2",
      "type": "ARTICLE",
      "avantAApres": "A",
      "divisionRattachee": "ARTICLE 2",
      "urlDivisionTexteVise": "/15/textes/1461.asp#D_Article_2"
    },
    "alinea": {
      "numero": "9"
    }
  },
  "corps": {
    "dispositif": "<p>Compl&#233;ter l&#8217;alin&#233;a&#160;2 par les mots&#160;:</p><p>&#171;&#160;et de gestion des flux migratoires&#160;&#187;.</p>",
    "exposeSommaire": "<p style=\"text-align: justify;\">Il s&#8217;agit par cet amendement d&#8217;int&#233;grer la notion de flux migratoire dans les int&#233;r&#234;ts de la France.</p><p style=\"text-align: justify;\">La question de la fronti&#232;re entre la France et le Royaume-Uni est source de r&#233;guli&#232;res tensions entre les deux pays. Les populations locales qui bordent cette fronti&#232;re sont particuli&#232;rement concern&#233;es par cette question. Il est &#224; craindre que le retrait du Royaume-Uni de l&#8217;Union&#160;europ&#233;enne renforce ces difficult&#233;s, m&#234;me si elles sont d&#233;j&#224; en partie r&#233;gies par un accord bilat&#233;ral entre les deux pays.</p><p style=\"text-align: justify;\">Par cet amendement, les d&#233;put&#233;s les R&#233;publicains souhaitent indiquer clairement que la gestion des flux migratoires fait partie des int&#233;r&#234;ts que la France doit d&#233;fendre dans le cadre de ces n&#233;gociations futures avec le Royaume-Uni.</p><p style=\"text-align: justify;\">Les d&#233;put&#233;s LR consid&#232;rent qu&#8217;on ne peut se satisfaire de l&#8217;accord de Sandhurst qui voit le Royaume-Uni payer la France afin qu&#8217;elle &#171;&#160;garde&#160;&#187; ses migrants. Cette d&#233;cision provoque un goulot d&#8217;&#233;tranglement dans les r&#233;gions Hauts-de-France et Normandie, une hausse des travers&#233;es sauvages, des contr&#244;les dits &#171;&#160;positifs&#160;&#187; aux migrants qui explosent.</p><p style=\"text-align: justify;\">Il faut atteindre l&#8217;objectif suivant&#160;: les migrants doivent pouvoir demander l&#8217;asile au Royaume-Uni m&#234;me quand il ne sont pas sur le territoire britannique.</p><p style=\"text-align: justify;\">&#160;</p>"
  },
  "representations": [
    {
      "nom": "PDF",
      "typeMime": {
        "type": "application",
        "subType": "PDF"
      },
      "statutRepresentation": {
        "verbatim": true,
        "canonique": true,
        "officielle": true,
        "transcription": false,
        "enregistrement": false
      },
      "contenu": {
        "documentURI": "/15/amendements/1461/AN/67.pdf"
      }
    }
  ],
  "seanceDiscussion": "RUANR5L15S2019IDS21418",
  "sort": {
    "dateSaisie": "2018-12-11T00:05:53.000+01:00",
    "sortEnSeance": "Rejeté"
  },
  "dateDepot": "2018-12-08T01:00:00.000+01:00",
  "dateDistribution": "2018-12-10T01:00:00.000+01:00",
  "article99": "0",
  "loiReference": {}
}