{
  "uid": "AMANR5L15PO59048B0235P1D1N424",
  "identifiant": {
    "legislature": "15",
    "numero": "424",
    "numRect": "0",
    "saisine": {
      "texteLegislatifRef": "PRJLANR5L15B0235",
      "numeroPartiePLF": "1",
      "organeExamen": "PO59048",
      "mentionSecondeDeliberation": "0"
    }
  },
  "numeroLong": "I-CF424",
  "etapeTexte": "1ère lecture (1ère assemblée saisie)",
  "triAmendement": "ed",
  "cardinaliteAmdtMultiples": "1",
  "etat": "A discuter",
  "signataires": {
    "auteur": {
      "typeAuteur": "Depute",
      "acteurRef": "PA609726",
      "groupePolitiqueRef": "PO730934"
    },
    "cosignatairesRefs": [
      "PA609726"
    ],
    "texteAffichable": "M.&#160;Aubert"
  },
  "pointeurFragmentTexte": {
    "division": {
      "titre": "Article 8",
      "articleDesignationCourte": "ART. 8",
      "type": "ARTICLE",
      "avantAApres": "A",
      "divisionRattachee": "ARTICLE 8",
      "urlDivisionTexteVise": "/15/textes/0235A.asp#D_Article_8"
    },
    "alinea": {
      "avantAApres": "Apres",
      "numero": "5"
    }
  },
  "corps": {
    "dispositif": "<p style=\"text-align: justify;\">I.&#160;&#8211;&#160;Apr&#232;s l&#8217;alin&#233;a&#160;5, ins&#233;rer les 2 alin&#233;as suivants&#160;:</p><p style=\"text-align: justify;\">&#171;&#160;c) Il est ajout&#233; un 5&#176; ainsi r&#233;dig&#233;&#160;:</p><p style=\"text-align: justify;\">&#171;&#160;5&#176; L&#8217;acquisition d&#8217;appareils de chauffage intelligents fonctionnant par calculs informatiques en ligne tels que des chaudi&#232;res ou radiateurs num&#233;riques connect&#233;s &#224; internet et utilisant des microprocesseurs comme source de chaleur.&#160;&#187;</p><p style=\"text-align: justify;\">II.&#160;&#8211;&#160;Compl&#233;ter cet article par les 2 alin&#233;as suivants&#160;:</p><p style=\"text-align: justify;\">&#171;&#160;II.&#160;&#8211;&#160;Le I n&#8217;est applicable qu&#8217;aux sommes venant en d&#233;duction de l&#8217;imp&#244;t d&#251;.</p><p style=\"text-align: justify;\">&#171;&#160;III.&#160;&#8211;&#160;La perte de recettes pour l&#8217;&#201;tat est compens&#233;e &#224; due concurrence par la cr&#233;ation d&#8217;une taxe additionnelle aux droits vis&#233;s aux articles 575 et 575 A du code g&#233;n&#233;ral des imp&#244;ts.&#160;&#187;</p>",
    "exposeSommaire": "<p>Cet amendement a pour objet de faire entrer dans l&#8217;assiette du cr&#233;dit d&#8217;imp&#244;t sur la transition &#233;nerg&#233;tique (CITE) de nouvelles technologies de chauffage durable telles que celles du chauffage intelligent dont des microprocesseurs informatiques sont la source.<br /><br />Compte tenu des enjeux de la transition &#233;nerg&#233;tique, l&#8217;installation de ce type de chauffage et de radiateurs num&#233;riques connect&#233;s utilisant des microprocesseurs comme source de chaleur, lesquelles permettent de diff&#233;rer le lieu de production de chaleur g&#233;n&#233;r&#233; par des calculs informatiques vers les b&#226;timents ou logements &#224; chauffer, pourrait &#234;tre encourag&#233;e d&#232;s lors que les d&#233;penses de travaux entrent dans le champ du CITE.<br /><br />Quelques entreprises ou start-up d&#233;veloppent et proposent effectivement cette solution de chauffage durable. Reli&#233;s &#224; internet, ces appareils &#233;quip&#233;s de microprocesseurs r&#233;alisent, lorsque leur utilisateur le demande, des calculs pour le compte de divers organismes tiers dont les calculs sont externalis&#233;s. La puissance de chaleur r&#233;sultant de ces calculs profite ainsi aux occupants des lieux &#233;quip&#233;s de radiateurs num&#233;riques plut&#244;t que de g&#233;n&#233;rer une chaleur dans un Datacenter en engendrant de surcro&#238;t une surconsommation li&#233;e &#224; la n&#233;cessaire ventilation ou alimentation de m&#233;canismes de refroidissements.<br /><br />La &#171; chaleur fatale &#187; g&#233;n&#233;r&#233;e par les calculs dans un centre de donn&#233;es, d&#8217;ordinaire consid&#233;r&#233;e comme un d&#233;chet, est ainsi recycl&#233;e et mise &#224; profit pour les besoins en chauffage. La France compte plus de 300 Data centers dont la consommation repr&#233;sente selon EDF 9 % de l&#8217;&#233;lectricit&#233; consomm&#233;e en France, soit pr&#232;s de 40TWh. Selon RTE, cela correspond &#224; une d&#233;pense &#233;nerg&#233;tique quasiment &#233;quivalente &#224; la totalit&#233; de la consommation des m&#233;nages chauff&#233;s par radiateurs &#233;lectriques (45TWh).<br /><br />Dans le m&#234;me temps, 14% des m&#233;nages fran&#231;ais sont en situation de pr&#233;carit&#233; &#233;nerg&#233;tique, c&#8217;est &#224; dire qu&#8217;ils d&#233;pensent plus de 10% de leurs revenus pour se chauffer. Les causes de la pr&#233;carit&#233; &#233;nerg&#233;tiques sont permanentes voire en croissance (prix de l&#8217;&#233;nergie) et les acteurs de terrain per&#231;oivent en continu son accroissement. Selon l&#8217;ADEME, 77 % des Centres Communaux d&#8217;Actions Sociales (CCAS) constatent une augmentation des sollicitations relatives &#224; l&#8217;&#233;nergie depuis trois ans.<br /><br />Ces appareils de chauffage intelligents sont donc une solution &#233;cologique, relevant de l&#8217;&#233;conomie circulaire, mais qui n&#8217;entrent pas dans les cadres juridiques actuels : ce sont ni des radiateurs, ni des chaudi&#232;res &#224; hautes performances, ni des datacenters.<br /><br />A noter que ces appareils de chauffage intelligents permettent &#233;galement de nombreux services connexes : l&#8217;acc&#232;s internet WiFi, r&#233;duisant la fracture &#233;nerg&#233;tique, des outils de domotique permettant le maintien &#224; domicile, l&#8217;analyse des flux &#233;nerg&#233;tique ou encore l&#8217;analyse de la qualit&#233; de l&#8217;air int&#233;rieur. Ils offrent &#233;galement une capacit&#233; de calculs informatiques haute performance peu on&#233;reux, facteur de comp&#233;titivit&#233; de la France tant sur le march&#233; du num&#233;rique que d&#8217;innovations et de R&amp;amp;D.<br /><br />Ces appareils sont aujourd&#8217;hui utilis&#233;s dans quelques b&#226;timents institutionnels ou r&#233;sidentiels &#233;quip&#233;s du tr&#232;s haut d&#233;bit. Citons en exemples des logements sociaux appartenant &#224; la RIVP sur le site de Ballard &#224; Pari, ou encore Gironde Habitat &#224; Bordeaux. Les habitants de ces logements ne paient plus de facture &#233;lectrique de chauffage. L&#8217;acquisition de ces &#233;quipements a &#233;t&#233; encourag&#233;e par l&#8217;ADEME pour le bailleur mais les particuliers ne connaissent encore aucune mesure incitative pour y recourir.<br /><br />En ajoutant au 1 b) de l&#8217;article 200 quater du Code g&#233;n&#233;ral des imp&#244;ts &#171; L&#8217;acquisition d&#8217;appareils de chauffage intelligents &#187;, les contribuables fran&#231;ais pourront b&#233;n&#233;ficier du CITE en concourant &#224; la transition &#233;nerg&#233;tique par le recours &#224; ces radiateurs connect&#233;s.</p>"
  },
  "representations": [
    {
      "nom": "PDF",
      "typeMime": {
        "type": "application",
        "subType": "PDF"
      },
      "statutRepresentation": {
        "verbatim": true,
        "canonique": true,
        "officielle": true,
        "transcription": false,
        "enregistrement": false
      },
      "contenu": {
        "documentURI": "/15/amendements/0235A/CION_FIN/CF424.pdf"
      }
    }
  ],
  "dateDepot": "2017-10-06T02:00:00.000+02:00",
  "dateDistribution": "2017-10-11T02:00:00.000+02:00",
  "article99": "0",
  "loiReference": {}
}