{
  "uid": "AMANR5L15PO419604B1813P0D1N22",
  "identifiant": {
    "legislature": "15",
    "numero": "22",
    "numRect": "0",
    "saisine": {
      "texteLegislatifRef": "PIONANR5L15B1813",
      "numeroPartiePLF": "0",
      "organeExamen": "PO419604",
      "mentionSecondeDeliberation": "0"
    }
  },
  "numeroLong": "AC22",
  "etapeTexte": "1ère lecture (1ère assemblée saisie)",
  "triAmendement": "aoaaaaaaaaaaaaaaaaaaaaaaaaaaaaaaaaaaaaaaaaaaaaaaaaafbdz",
  "cardinaliteAmdtMultiples": "1",
  "etat": "Discuté",
  "signataires": {
    "auteur": {
      "typeAuteur": "Depute",
      "acteurRef": "PA721506",
      "groupePolitiqueRef": "PO730934"
    },
    "cosignatairesRefs": [
      "PA721506"
    ],
    "texteAffichable": "Mme&#160;Kuster"
  },
  "pointeurFragmentTexte": {
    "division": {
      "titre": "Article PREMIER",
      "articleDesignationCourte": "ART. PREMIER",
      "type": "ARTICLE",
      "avantAApres": "A",
      "divisionRattachee": "ARTICLE PREMIER",
      "urlDivisionTexteVise": "/15/textes/1813.asp#D_Article_1er"
    },
    "alinea": {
      "numero": "2"
    }
  },
  "corps": {
    "dispositif": "<p style=\"text-align: justify;\">&#192; l&#8217;alin&#233;a&#160;2, apr&#232;s le mot&#160;:</p><p style=\"text-align: justify;\">&#171;&#160;enregistr&#233;e&#160;&#187;</p><p style=\"text-align: justify;\">ins&#233;rer les mots&#160;:</p><p style=\"text-align: justify;\">&#171;&#160;et des vari&#233;t&#233;s&#160;&#187;</p>",
    "exposeSommaire": "<p style=\"text-align: justify;\">Cet amendement vise &#224; inclure l&#8217;ensemble des esth&#233;tiques que couvre actuellement le Centre national des vari&#233;t&#233;s et du jazz dans le p&#233;rim&#232;tre du futur Centre national de la musique (CNM). L&#8217;appellation du &#171;&#160;CNM&#160;&#187;, restreinte en l&#8217;&#233;tat &#224; la musique, tendrait &#224; exclure des pans entiers du spectacle vivant (humour, cabaret, com&#233;die musicale), et conduirait &#224; la cr&#233;ation d&#8217;une instance au champ de comp&#233;tences plus &#233;troit que les 3 organismes auxquels elle se substitue. Ce n&#8217;est &#233;videmment pas l&#8217;objet de la pr&#233;sente proposition de loi.</p>"
  },
  "representations": [
    {
      "nom": "PDF",
      "typeMime": {
        "type": "application",
        "subType": "PDF"
      },
      "statutRepresentation": {
        "verbatim": true,
        "canonique": true,
        "officielle": true,
        "transcription": false,
        "enregistrement": false
      },
      "contenu": {
        "documentURI": "/15/amendements/1813/CION-CEDU/AC22.pdf"
      }
    }
  ],
  "sort": {
    "dateSaisie": "2019-04-29T17:26:31.000+02:00",
    "sortEnSeance": "Tombé"
  },
  "dateDepot": "2019-04-17T02:00:00.000+02:00",
  "dateDistribution": "2019-04-29T02:00:00.000+02:00",
  "article99": "0",
  "loiReference": {}
}