{
  "uid": "AMANR5L15PO419610B1908P0D1N279",
  "identifiant": {
    "legislature": "15",
    "numero": "279",
    "numRect": "0",
    "saisine": {
      "texteLegislatifRef": "PRJLANR5L15B1908",
      "numeroPartiePLF": "0",
      "organeExamen": "PO419610",
      "mentionSecondeDeliberation": "0"
    }
  },
  "numeroLong": "CE279",
  "etapeTexte": "1ère lecture (1ère assemblée saisie)",
  "triAmendement": "biaaaaaaaaaaaaaaaaaaaaaaaaaaaaaaaaaaaaaaaaaaaaaaaaadzwzy",
  "cardinaliteAmdtMultiples": "1",
  "etat": "Discuté",
  "signataires": {
    "auteur": {
      "typeAuteur": "Depute",
      "acteurRef": "PA605518",
      "groupePolitiqueRef": "PO759900"
    },
    "cosignatairesRefs": [
      "PA405480",
      "PA333421",
      "PA605518",
      "PA608292",
      "PA719286",
      "PA607619",
      "PA605694",
      "PA336175",
      "PA720996",
      "PA721194",
      "PA719138",
      "PA719146"
    ],
    "texteAffichable": "M.&#160;Fran&#231;ois-Michel&#160;Lambert,  M.&#160;Acquaviva, M.&#160;Castellani, M.&#160;Colombani, Mme&#160;Dubi&#233;, Mme&#160;Fr&#233;d&#233;rique&#160;Dumas, M.&#160;El Guerrab, M.&#160;Falorni, M.&#160;Molac, M.&#160;Pancher, Mme&#160;Pinel et M.&#160;Pupponi"
  },
  "pointeurFragmentTexte": {
    "division": {
      "titre": "Article 3",
      "articleDesignationCourte": "APRÈS ART. 3",
      "type": "ARTICLE",
      "avantAApres": "Apres",
      "divisionRattachee": "APRÈS L'ARTICLE 3, insérer l'article suivant:",
      "articleAdditionnel": "1",
      "urlDivisionTexteVise": "/15/textes/1908.asp#D_Article_3"
    }
  },
  "corps": {
    "dispositif": "<p style=\"text-align: justify;\">La sous-section&#160;2 de la section&#160;1 du chapitre&#160;IV du titre&#160;II du livre&#160;II de la consommation est compl&#233;t&#233;e par un article L.&#160;224&#8209;6 ainsi r&#233;dig&#233;&#160;:</p><p style=\"text-align: justify;\">&#171;&#160;<i>Art.&#160;L.&#160;224&#8209;6</i>.&#160;&#8211;&#160;Le contrat de fourniture d&#8217;&#233;lectricit&#233; ou de gaz naturel pr&#233;voit une clause permettant de recueillir le consentement des consommateurs sur la transmission de leurs donn&#233;es de consommation aux collectivit&#233;s territoriales comp&#233;tentes en mati&#232;re d&#8217;&#233;nergie, notamment pour l&#8217;&#233;laboration et la mise en oeuvre des plans climat-air-&#233;nergie territoriaux et pour la lutte contre la pr&#233;carit&#233; &#233;nerg&#233;tique. Il informe les consommateurs sur les conditions de transmission par les gestionnaires de r&#233;seau de distribution d&#8217;&#233;nergie et de traitement de ces donn&#233;es, le cas &#233;ch&#233;ant.</p><p style=\"text-align: justify;\">&#171;&#160;Un d&#233;cret pr&#233;cise la fr&#233;quence de transmission, les finalit&#233;s de traitement, la dur&#233;e de conservation et les modalit&#233;s techniques de mise &#224; disposition par les gestionnaires de r&#233;seaux de distribution d&#8217;&#233;nergie.&#160;&#187;.</p>",
    "exposeSommaire": "<p style=\"text-align: justify;\">L&#8217;article&#160;179 de la loi de transition &#233;nerg&#233;tique a permis l&#8217;acc&#232;s &#224; de nombreuses donn&#233;es de r&#233;seau, dont les donn&#233;es de consommation. La protection des donn&#233;es personnelles limite cependant l&#8217;acc&#232;s aux donn&#233;es de consommation en dessous de 11 points de livraison.</p><p style=\"text-align: justify;\">Certaines missions des collectivit&#233;s n&#233;cessitent pourtant d&#8217;acc&#233;der &#224; des donn&#233;es &#224; la maille du consommateur final, notamment pour rep&#233;rer plus efficacement les m&#233;nages en situation de pr&#233;carit&#233; &#233;nerg&#233;tique. La lutte contre la pr&#233;carit&#233; &#233;nerg&#233;tique est en effet une priorit&#233; &#224; la fois pour le climat et pour le pouvoir d&#8217;achat des 5,6 millions de Fran&#231;ais qui ont des difficult&#233;s pour payer leur facture &#233;nerg&#233;tique.</p><p style=\"text-align: justify;\">La premi&#232;re &#233;tape pour accompagner ces m&#233;nages est de les identifier pour leur proposer des solutions d&#8217;accompagnement, ce qui n&#8217;est pas toujours possible avec les donn&#233;es disponibles.</p><p style=\"text-align: justify;\">Cet amendement vise donc &#224; permettre le recueil du consentement des consommateurs pour la transmission de ce type de donn&#233;es &#224; des fins de politiques publiques locales et d&#8217;en informer les consommateurs.</p>"
  },
  "representations": [
    {
      "nom": "PDF",
      "typeMime": {
        "type": "application",
        "subType": "PDF"
      },
      "statutRepresentation": {
        "verbatim": true,
        "canonique": true,
        "officielle": true,
        "transcription": false,
        "enregistrement": false
      },
      "contenu": {
        "documentURI": "/15/amendements/1908/CION-ECO/CE279.pdf"
      }
    }
  ],
  "sort": {
    "dateSaisie": "2019-06-20T09:59:07.000+02:00",
    "sortEnSeance": "Retiré"
  },
  "dateDepot": "2019-06-14T02:00:00.000+02:00",
  "dateDistribution": "2019-06-18T02:00:00.000+02:00",
  "article99": "0",
  "loiReference": {
    "codeLoi": "consommation",
    "divisionCodeLoi": "L224-6"
  }
}