{
  "uid": "AMANR5L15SEA717460B1255P1D1N197",
  "identifiant": {
    "legislature": "15",
    "numero": "197",
    "numRect": "0",
    "saisine": {
      "texteLegislatifRef": "PRJLANR5L15B1255",
      "numeroPartiePLF": "1",
      "organeExamen": "PO717460",
      "mentionSecondeDeliberation": "0"
    }
  },
  "numeroLong": "I-197",
  "etapeTexte": "1ère lecture (1ère assemblée saisie)",
  "triAmendement": "giaaaaaaaaaaaaaaaaaaaaaaaaaaaaaaaaaaaaaaaaaaaaaaaadivu",
  "cardinaliteAmdtMultiples": "1",
  "etat": "Discuté",
  "signataires": {
    "auteur": {
      "typeAuteur": "Depute",
      "acteurRef": "PA607090",
      "groupePolitiqueRef": "PO730934"
    },
    "cosignatairesRefs": [
      "PA721506",
      "PA721968",
      "PA721474",
      "PA607090",
      "PA719318",
      "PA608416",
      "PA718884",
      "PA1874",
      "PA267260",
      "PA767",
      "PA718838",
      "PA721678",
      "PA267735",
      "PA346218"
    ],
    "texteAffichable": "M.&#160;Jean-Pierre&#160;Vigier,  Mme&#160;Anthoine, Mme&#160;Bazin-Malgras, M.&#160;Brun, M.&#160;Cattin, M.&#160;Le Fur, Mme&#160;Kuster, M.&#160;Vialay, M.&#160;Masson, M.&#160;Hetzel, M.&#160;Viry, Mme&#160;Poletti, M.&#160;Reda et M.&#160;de Ganay"
  },
  "pointeurFragmentTexte": {
    "division": {
      "titre": "Article 22",
      "articleDesignationCourte": "APRÈS ART. 22",
      "type": "ARTICLE",
      "avantAApres": "Apres",
      "divisionRattachee": "APRÈS L'ARTICLE 22, insérer l'article suivant:",
      "articleAdditionnel": "1",
      "urlDivisionTexteVise": "/15/textes/1255A.asp#D_Article_22"
    }
  },
  "corps": {
    "dispositif": "<p style=\"text-align: justify;\">I.&#160;&#8211;&#160;Le code g&#233;n&#233;ral des imp&#244;ts est ainsi modifi&#233;&#160;:</p><p style=\"text-align: justify;\">1&#176;&#160;Le A de l&#8217;article&#160;278&#8209;0 <i>bis</i> est compl&#233;t&#233; par un 4&#176; ainsi r&#233;dig&#233;&#160;:</p><p style=\"text-align: justify;\">&#171;&#160;4&#176; Les produits suivants lorsqu&#8217;ils pr&#233;sentent un taux d&#8217;humidit&#233; inf&#233;rieur &#224; 20&#160;%&#160;:</p><p style=\"text-align: justify;\">&#171;&#160;<i>a)</i> Le bois de chauffage&#160;;</p><p style=\"text-align: justify;\">&#171;&#160;<i>b)</i> Les produits de la sylviculture agglom&#233;r&#233;s destin&#233;s au chauffage&#160;;</p><p style=\"text-align: justify;\">&#171;&#160;<i>c)</i> Les d&#233;chets de bois destin&#233;s au chauffage.</p><p style=\"text-align: justify;\">&#171;&#160;Un arr&#234;t&#233; conjoint des ministres charg&#233;s de l&#8217;&#233;nergie et de la for&#234;t fixe la liste des certifications, labels et marques de qualit&#233; qui garantissent le taux d&#8217;humidit&#233; mentionn&#233; au premier alin&#233;a du pr&#233;sent 4&#176;.&#160;&#187;&#160;;</p><p style=\"text-align: justify;\">2&#176;&#160;Les <i>a, b </i>et<i> c</i> du 3&#176;<i>bis</i> de l&#8217;article&#160;278 <i>bis</i> sont abrog&#233;s&#160;;</p><p style=\"text-align: justify;\">3&#176;&#160;Au deuxi&#232;me alin&#233;a du 2&#176; du I de l&#8217;article&#160;297, la r&#233;f&#233;rence&#160;:&#160;&#171;&#160;et 3&#176;&#160;&#187; est remplac&#233;e par les r&#233;f&#233;rences&#160;:&#160;&#171;&#160;, 3&#176; et 4&#176;&#160;&#187;&#160;;</p><p style=\"text-align: justify;\">II.&#160;&#8211;&#160;Les dispositions des 1&#176; et 3&#176; du I s&#8217;appliquent aux op&#233;rations pour lesquelles la taxe sur la valeur ajout&#233;e est exigible &#224; compter du 1<sup>er</sup> janvier 2019.</p><p style=\"text-align: justify;\">III.&#160;&#8211;&#160;La perte de recettes pour l&#8217;&#201;tat est compens&#233;e &#224; due concurrence par la hausse de la composante carbone int&#233;gr&#233;e aux tarifs des taxes int&#233;rieures sur la consommation des produits &#233;nerg&#233;tiques inscrites au tableau B du 1 de l&#8217;article&#160;265 du code des douanes.</p>",
    "exposeSommaire": "<p style=\"text-align: justify;\">Le pr&#233;sent amendement propose d&#8217;appliquer le taux de TVA de 5,5&#160;% au bois &#233;nergie de qualit&#233; qui pr&#233;sente un taux d&#8217;humidit&#233; inf&#233;rieur &#224; 20&#160;%.</p><p style=\"text-align: justify;\">Le chauffage au bois est une &#233;nergie renouvelable &#224; faible co&#251;t, qui repr&#233;sente pour de nombreux m&#233;nages fran&#231;ais une opportunit&#233; de r&#233;duire leur facture &#233;nerg&#233;tique. En 2016, les simulations r&#233;alis&#233;es par le SER estimaient &#224; 7,8 millions le nombre de m&#233;nages &#233;quip&#233;s d&#8217;appareils de chauffage au bois. L&#8217;objectif poursuivi pour 2020 fix&#233; &#224; 9 millions de m&#233;nages &#233;quip&#233;s semble difficilement atteignable.</p><p style=\"text-align: justify;\">Pour 60 millions de m&#179; de bois de chauffage consomm&#233;s en 2015, seuls 10 millions de m&#179;, soit 15&#160;%, ont &#233;t&#233; vendus par des professionnels de la fili&#232;re, les 85&#160;% restant &#233;tant achet&#233;s de fa&#231;on informelle.</p><p style=\"text-align: justify;\">Or, de nombreux constats effectu&#233;s sur le terrain attestent que le bois commercialis&#233; de mani&#232;re informelle ne r&#233;pond pas aux exigences de qualit&#233; minimales qui permettent d&#8217;utiliser ce combustible de fa&#231;on optimale dans un appareil de chauffage au bois. A l&#8217;inverse, les professionnels satisfont aux exigences de certification ou de qualit&#233;, telles que &#171;&#160;NF Biocombustibles solides&#160;&#187;, &#171;&#160;France Bois B&#251;che&#160;&#187; ou &#171;&#160;ONF Energie bois&#160;&#187; (environ 250 entreprises).</p><p style=\"text-align: justify;\"><span  data-cid=\"3\" data-userid=\"347\" data-username=\"Jean-Pierre Vigier\" data-time=\"1538659600322\">Les &#233;volutions des appareils de chauffage au bois n&#233;cessitent un combustible bois de tr&#232;s haute qualit&#233; (taux d&#8217;humidit&#233; inf&#233;rieur &#224; 20&#160;%), alors qu&#8217;un combustible trop humide nuit au bon fonctionnement de l&#8217;appareil et accentue la formation de particules fines. La profession du chauffage au bois domestique ainsi que les pouvoirs publics (Minist&#232;re de la Transition Ecologique et Solidaire, ADEME, associations de surveillance de qualit&#233; de l&#8217;air) d&#233;veloppent des outils et assurent une communication et une p&#233;dagogie aupr&#232;s des consommateurs afin de les inviter &#224; privil&#233;gier un bois de chauffage de qualit&#233;. Opter pour le taux de TVA de 5,5&#160;% est un outil suppl&#233;mentaire pour y parvenir.</span></p>"
  },
  "representations": [
    {
      "nom": "PDF",
      "typeMime": {
        "type": "application",
        "subType": "PDF"
      },
      "statutRepresentation": {
        "verbatim": true,
        "canonique": true,
        "officielle": true,
        "transcription": false,
        "enregistrement": false
      },
      "contenu": {
        "documentURI": "/15/amendements/1255A/AN/197.pdf"
      }
    }
  ],
  "seanceDiscussion": "RUANR5L15S2019IDS21283",
  "sort": {
    "dateSaisie": "2018-10-20T01:47:12.000+02:00",
    "sortEnSeance": "Non soutenu"
  },
  "dateDepot": "2018-10-04T02:00:00.000+02:00",
  "dateDistribution": "2018-10-16T02:00:00.000+02:00",
  "article99": "0",
  "loiReference": {
    "codeLoi": "CGI",
    "divisionCodeLoi": "278-0 bis"
  }
}