{
  "uid": "AMANR5L15PO59051B0099P0D1N31",
  "identifiant": {
    "legislature": "15",
    "numero": "31",
    "numRect": "0",
    "saisine": {
      "texteLegislatifRef": "PRJLANR5L15B0099",
      "numeroPartiePLF": "0",
      "organeExamen": "PO59051",
      "mentionSecondeDeliberation": "0"
    }
  },
  "numeroLong": "CL31",
  "etapeTexte": "1ère lecture (2ème assemblée saisie)",
  "triAmendement": "bs",
  "cardinaliteAmdtMultiples": "1",
  "etat": "Discuté",
  "signataires": {
    "auteur": {
      "typeAuteur": "Depute",
      "acteurRef": "PA721960",
      "groupePolitiqueRef": "PO730958"
    },
    "cosignatairesRefs": [
      "PA722142",
      "PA719676",
      "PA721202",
      "PA718868",
      "PA720846",
      "PA721210",
      "PA721226",
      "PA720422",
      "PA720286",
      "PA720892",
      "PA721960",
      "PA588884",
      "PA720430",
      "PA721062",
      "PA719578",
      "PA2150",
      "PA718860"
    ],
    "texteAffichable": "Mme&#160;Obono,  Mme&#160;Autain, M.&#160;Bernalicis, M.&#160;Coquerel, M.&#160;Corbi&#232;re, Mme&#160;Fiat, M.&#160;Lachaud, M.&#160;Larive, M.&#160;M&#233;lenchon, Mme&#160;Panot, M.&#160;Prud&apos;homme, M.&#160;Quatennens, M.&#160;Ratenon, Mme&#160;Ressiguier, Mme&#160;Rubin, M.&#160;Ruffin et Mme&#160;Taurine"
  },
  "pointeurFragmentTexte": {
    "division": {
      "titre": "pour la régulation de la vie publique,",
      "articleDesignationCourte": "TITRE",
      "type": "TITRE",
      "avantAApres": "A",
      "divisionRattachee": "TITRE",
      "urlDivisionTexteVise": "/15/textes/0099.asp#D_pour_la_regulation_de_la_vie_publique"
    }
  },
  "corps": {
    "dispositif": "<p style=\"text-align: justify;\">Au titre du projet, substituer aux mots&#160;:</p><p style=\"text-align: justify;\">&#171; pour la r&#233;gulation de la vie publique&#160;&#187;,</p><p style=\"text-align: justify;\">les mots&#160;:</p><p style=\"text-align: justify;\">&#171; de vertu r&#233;publicaine &#187;.</p>",
    "exposeSommaire": "<p>&#160;</p><p>Plut&#244;t que de stigmatiser les &#233;lus de la Nation et de les montrer du doigt en parlant de &#171;&#160;moraliser&#160;&#187; ou de &#171;&#160;r&#233;guler&#160;&#187;, nous souhaitons au contraire que les dispositions de ce texte de loi enracinent et exaltent la vertu r&#233;publicaine, condition et ferment d&#8217;une vraie d&#233;mocratie. Cette loi a pour vocation de pr&#233;venir et de r&#233;primer tant les corrompus que les corrupteurs.</p><p>&#160;</p><p>&#160;</p>"
  },
  "representations": [
    {
      "nom": "PDF",
      "typeMime": {
        "type": "application",
        "subType": "PDF"
      },
      "statutRepresentation": {
        "verbatim": true,
        "canonique": true,
        "officielle": true,
        "transcription": false,
        "enregistrement": false
      },
      "contenu": {
        "documentURI": "/15/amendements/0099/CION_LOIS/CL31.pdf"
      }
    }
  ],
  "sort": {
    "dateSaisie": "2017-07-20T03:11:13.000+02:00",
    "sortEnSeance": "Tombé"
  },
  "dateDepot": "2017-07-17T02:00:00.000+02:00",
  "dateDistribution": "2017-07-19T02:00:00.000+02:00",
  "article99": "0",
  "loiReference": {
    "codeLoi": "2"
  }
}