{
  "uid": "AMANR5L15SEA717460BTC2062P0D1N125",
  "identifiant": {
    "legislature": "15",
    "numero": "125",
    "numRect": "0",
    "saisine": {
      "texteLegislatifRef": "PIONANR5L15BTC2062",
      "numeroPartiePLF": "0",
      "organeExamen": "PO717460",
      "mentionSecondeDeliberation": "0"
    }
  },
  "numeroLong": "125",
  "etapeTexte": "1ère lecture (1ère assemblée saisie)",
  "triAmendement": "iiaaaaaaaaaaaaaaaaaaaaaaaaaaaaaaaaaaaaaaaaaaaaaaaaaai",
  "cardinaliteAmdtMultiples": "1",
  "etat": "Retiré",
  "signataires": {
    "auteur": {
      "typeAuteur": "Depute",
      "acteurRef": "PA719558",
      "groupePolitiqueRef": "PO730970"
    },
    "cosignatairesRefs": [
      "PA719558"
    ],
    "texteAffichable": "M.&#160;Balanant"
  },
  "pointeurFragmentTexte": {
    "division": {
      "titre": "Article 6",
      "articleDesignationCourte": "APRÈS ART. 6",
      "type": "ARTICLE",
      "avantAApres": "Apres",
      "divisionRattachee": "APRÈS L'ARTICLE 6, insérer l'article suivant:",
      "articleAdditionnel": "1",
      "urlDivisionTexteVise": "/15/textes/2062.asp#D_Article_6"
    }
  },
  "corps": {
    "cartoucheDelaiDepotDepasse": "Sous réserve de son traitement par les services de l'Assemblée nationale et de sa recevabilité"
  },
  "representations": [
    {
      "nom": "PDF",
      "typeMime": {
        "type": "application",
        "subType": "PDF"
      },
      "statutRepresentation": {
        "verbatim": true,
        "canonique": true,
        "officielle": true,
        "transcription": false,
        "enregistrement": false
      },
      "contenu": {
        "documentURI": "/15/amendements/2062/AN/125.pdf"
      }
    }
  ],
  "dateDepot": "2019-06-28T02:00:00.000+02:00",
  "article99": "0",
  "loiReference": {
    "codeLoi": "c éducation",
    "divisionCodeLoi": "L121-1"
  }
}