{
  "uid": "AMANR5L15PO59051B0911P0D1N933",
  "identifiant": {
    "legislature": "15",
    "numero": "933",
    "numRect": "0",
    "saisine": {
      "texteLegislatifRef": "PRJLANR5L15B0911",
      "numeroPartiePLF": "0",
      "organeExamen": "PO59051",
      "mentionSecondeDeliberation": "0"
    }
  },
  "numeroLong": "CL933",
  "etapeTexte": "1ère lecture (1ère assemblée saisie)",
  "triAmendement": "abm",
  "cardinaliteAmdtMultiples": "1",
  "etat": "Discuté",
  "signataires": {
    "auteur": {
      "typeAuteur": "Depute",
      "acteurRef": "PA267306",
      "groupePolitiqueRef": "PO730940"
    },
    "cosignatairesRefs": [
      "PA721012",
      "PA721118",
      "PA610654",
      "PA718926",
      "PA721896",
      "PA267306",
      "PA722202",
      "PA720546",
      "PA335612",
      "PA441",
      "PA720692",
      "PA722110",
      "PA689",
      "PA721270",
      "PA610667",
      "PA718720"
    ],
    "texteAffichable": "M.&#160;Chassaigne,  M.&#160;Jumel, Mme&#160;Bello, M.&#160;Brotherson, M.&#160;Bruneel, Mme&#160;Buffet, M.&#160;Dharr&#233;ville, M.&#160;Dufr&#232;gne, Mme&#160;Faucillon, Mme&#160;K&#233;clard-Mond&#233;sir, M.&#160;Lecoq, M.&#160;Nilor, M.&#160;Peu, M.&#160;Fabien&#160;Roussel, M.&#160;Serville et M.&#160;Wulfranc"
  },
  "pointeurFragmentTexte": {
    "division": {
      "titre": "Article 2",
      "articleDesignationCourte": "APRÈS ART. 2",
      "type": "ARTICLE",
      "avantAApres": "Apres",
      "divisionRattachee": "APRÈS L'ARTICLE 2, insérer l'article suivant:",
      "articleAdditionnel": "1",
      "urlDivisionTexteVise": "/15/textes/0911.asp#D_Article_2"
    }
  },
  "corps": {
    "dispositif": "<p style=\"text-align: justify;\">L&#8217;article&#160;35 de la Constitution est ainsi r&#233;dig&#233;&#160;:</p><p style=\"text-align: justify;\">&#171;&#160;<i>Art.&#160;35</i>.&#160;&#8211;&#160;Toute intervention des forces arm&#233;es &#224; l&#8217;ext&#233;rieur du territoire de la R&#233;publique est autoris&#233;e par le Parlement, au besoin apr&#232;s convocation d&#8217;une session extraordinaire.</p><p style=\"text-align: justify;\">&#171;&#160;Les accords de d&#233;fense et les engagements d&#8217;assistance militaire souscrits par la France sont transmis pour information au Parlement.&#160;&#187;</p>",
    "exposeSommaire": "<p style=\"text-align: justify;\">Les propositions que nous portons dans le cadre de la r&#233;forme constitutionnelle visent &#224; renforcer les pouvoirs du Parlement et de l&#8217;opposition face &#224; l&#8217;hypertrophie du pouvoir ex&#233;cutif. Mettre fin &#224; ce d&#233;s&#233;quilibre des pouvoirs est indispensable pour corriger le d&#233;ficit d&#233;mocratique du r&#233;gime. Dans cet esprit, nous proposons &#233;galement de renforcer les droits de participation d&#233;mocratique. Enfin, une r&#233;forme de la Constitution ne peut se concevoir sans y inscrire des principes essentiels aujourd&#8217;hui absents de notre Loi fondamentale.</p><p style=\"text-align: justify;\">Cet amendement vise &#224; renforcer sensiblement le contr&#244;le du Parlement sur les op&#233;rations ext&#233;rieures.</p><p style=\"text-align: justify;\">Le droit d&#8217;information du Parlement sur les interventions des forces arm&#233;es fran&#231;aises &#224; l&#8217;&#233;tranger et son autorisation pour la prolongation d&#8217;une intervention lorsque sa dur&#233;e exc&#232;de quatre mois ne constituent pas un dispositif suffisant pour permettre au Parlement d&#8217;exercer un contr&#244;le effectif.</p><p style=\"text-align: justify;\">Or, l&#8217;envoi de troupes &#224; l&#8217;&#233;tranger est une d&#233;cision qui peut avoir de graves cons&#233;quences pour la vie des personnels engag&#233;s, mais aussi pour la s&#233;curit&#233; des Fran&#231;ais et, plus largement, pour la place et l&#8217;influence de la France dans le monde. Il est l&#233;gitime, dans une d&#233;mocratie, que, le Parlement, en tant que repr&#233;sentant de la Nation, autorise ce type d&#8217;intervention et soit inform&#233; des accords de d&#233;fense et engagements d&#8217;assistance militaire souscrits par la France.</p>"
  },
  "representations": [
    {
      "nom": "PDF",
      "typeMime": {
        "type": "application",
        "subType": "PDF"
      },
      "statutRepresentation": {
        "verbatim": true,
        "canonique": true,
        "officielle": true,
        "transcription": false,
        "enregistrement": false
      },
      "contenu": {
        "documentURI": "/15/amendements/0911/CION_LOIS/CL933.pdf"
      }
    }
  ],
  "sort": {
    "dateSaisie": "2018-06-28T23:18:00.000+02:00",
    "sortEnSeance": "Rejeté"
  },
  "dateDepot": "2018-06-22T02:00:00.000+02:00",
  "dateDistribution": "2018-06-25T02:00:00.000+02:00",
  "article99": "0",
  "loiReference": {
    "codeLoi": "35",
    "divisionCodeLoi": "0"
  }
}