{
  "uid": "AMANR5L15PO59048B2272P2D1N823",
  "identifiant": {
    "legislature": "15",
    "numero": "823",
    "numRect": "0",
    "saisine": {
      "texteLegislatifRef": "PRJLANR5L15B2272",
      "numeroPartiePLF": "2",
      "organeExamen": "PO59048",
      "mentionSecondeDeliberation": "0"
    }
  },
  "numeroLong": "II-CF823",
  "etapeTexte": "1ère lecture (1ère assemblée saisie)",
  "triAmendement": "fcaaaaaaaaaaaaaaaaaaaaaaaaaaaaaaaaaaaaaaaaaaaaaaaaaaesnzzzzzzzww",
  "cardinaliteAmdtMultiples": "1",
  "etat": "Discuté",
  "signataires": {
    "auteur": {
      "typeAuteur": "Depute",
      "acteurRef": "PA405480",
      "groupePolitiqueRef": "PO759900"
    },
    "cosignatairesRefs": [
      "PA608292",
      "PA336439",
      "PA719286",
      "PA720278",
      "PA605518",
      "PA755549",
      "PA942",
      "PA267042",
      "PA719146",
      "PA331582",
      "PA720996",
      "PA605694",
      "PA607619",
      "PA405480",
      "PA336175",
      "PA721194",
      "PA720038",
      "PA333421",
      "PA719138"
    ],
    "texteAffichable": "M.&#160;Pupponi,  M.&#160;Acquaviva, M.&#160;Brial, M.&#160;Castellani, M.&#160;Cl&#233;ment, M.&#160;Colombani, M.&#160;Charles&#160;de Courson, Mme&#160;Dubi&#233;, Mme&#160;Fr&#233;d&#233;rique&#160;Dumas, M.&#160;El Guerrab, M.&#160;Falorni, M.&#160;Favennec Becot, Mme&#160;Josso, M.&#160;Fran&#231;ois-Michel&#160;Lambert, M.&#160;Molac, M.&#160;Orphelin, M.&#160;Pancher, Mme&#160;Pinel et M.&#160;Philippe&#160;Vigier"
  },
  "pointeurFragmentTexte": {
    "division": {
      "titre": "Article 50",
      "articleDesignationCourte": "APRÈS ART. 50",
      "type": "ARTICLE",
      "avantAApres": "Apres",
      "divisionRattachee": "APRÈS L'ARTICLE 50, insérer l'article suivant:",
      "articleAdditionnel": "1",
      "urlDivisionTexteVise": "/15/textes/2272C.asp#D_Article_50"
    }
  },
  "corps": {
    "dispositif": "<p style=\"text-align: justify;\">I.&#160;&#8211;&#160;Le <i>a</i> du 2&#176;&#160;du I de l&#8217;article&#160;83 de la loi 2017&#8209;1837 du 30 d&#233;cembre 2017 de finances pour 2018 est compl&#233;t&#233; par une phrase ainsi r&#233;dig&#233;e&#160;: &#171;&#160;Toutefois cette condition de localisation n&#8217;est pas applicable aux logements ayant donn&#233; lieu &#224; un contrat r&#233;gi par la loi n&#176;&#160;84&#8209;595 du 12 juillet 1984 d&#233;finissant la location-accession &#224; la propri&#233;t&#233; immobili&#232;re.&#160;&#187;</p><p style=\"text-align: justify;\">II.&#160;&#8211;&#160;Les dispositions ci-dessus ne sont applicables qu&#8217;aux sommes venant en d&#233;duction de l&#8217;imp&#244;t d&#251;.</p><p style=\"text-align: justify;\">III.&#160;&#8211;&#160;La perte de recettes pour l&#8217;&#201;tat est compens&#233;e &#224; due concurrence par la cr&#233;ation d&#8217;une taxe additionnelle aux droits vis&#233;s aux articles 575 et 575 A du code g&#233;n&#233;ral des imp&#244;ts.</p>",
    "exposeSommaire": "<p>Cet amendement a pour objet d&#8217;exclure la condition de localisation, pour le financement par un PTZ, des op&#233;rations de location-accession PSLA.</p><p style=\"text-align: justify;\">Les op&#233;rations de location-accession financ&#233;es avec un PSLA sont des op&#233;rations d&#8217;accession pr&#233;c&#233;d&#233;es par une p&#233;riode d&#8217;occupation du logement, par le locataire-acc&#233;dant, pr&#233;alablement au transfert de propri&#233;t&#233;.</p><p style=\"text-align: justify;\">Par cons&#233;quent, des op&#233;rations pour lesquelles le contrat de location-accession avait &#233;t&#233; sign&#233; pourront donner lieu &#224; une lev&#233;e d&#8216;option apr&#232;s le 1<sup>er</sup> janvier 2020.</p><p style=\"text-align: justify;\">Or ces projets d&#8217;accession seront remis en cause faute de financement lorsqu&#8217;ils concernent des logements situ&#233;s en zone B2 et C.</p><p style=\"text-align: justify;\">Les locataires-acc&#233;dants qui se sont d&#233;j&#224; engag&#233;s doivent pouvoir financer avec un PTZ leur projet d&#8217;accession &#224; la propri&#233;t&#233; et avoir toute visibilit&#233; sur leur financement.</p><p style=\"text-align: justify;\">Ces op&#233;rations, r&#233;alis&#233;es &#224; la demande des &#233;lus locaux sont encadr&#233;es par l&#8217;&#201;tat qui les agr&#233;e et s&#8217;assure de leur pertinence.</p><p style=\"text-align: justify;\">En outre, d&#232;s pr&#233;sent, la suppression &#224; venir du PTZ sur ces territoires se fait d&#233;j&#224; ressentir, le lancement de nouvelles op&#233;rations &#233;tant exclu compte tenu de l&#8217;absence de financement pour les m&#233;nages lorsqu&#8217;ils devront lever l&#8217;option, c&#8217;est-&#224;-dire apr&#232;s le 1<sup>er</sup> janvier 2020.</p><p style=\"text-align: justify;\">Cet amendement a pour objet de maintenir le PTZ pour les logements, situ&#233;s en zone B2 et C, ayant donn&#233; lieu &#224; un contrat de location-accession PSLA et dont la lev&#233;e d&#8217;option interviendra apr&#232;s le 31 d&#233;cembre 2019.</p><p style=\"text-align: justify;\">Sur tout le territoire, les locataires-acc&#233;dants pourront ainsi financer l&#8217;acquisition de leur logement avec un PTZ jusqu&#8217;au 31 d&#233;cembre 2021.</p><p style=\"text-align: justify;\">&#160;</p>"
  },
  "representations": [
    {
      "nom": "PDF",
      "typeMime": {
        "type": "application",
        "subType": "PDF"
      },
      "statutRepresentation": {
        "verbatim": true,
        "canonique": true,
        "officielle": true,
        "transcription": false,
        "enregistrement": false
      },
      "contenu": {
        "documentURI": "/15/amendements/2272C/CION_FIN/CF823.pdf"
      }
    }
  ],
  "sort": {
    "dateSaisie": "2019-11-06T17:19:20.000+01:00",
    "sortEnSeance": "Rejeté"
  },
  "dateDepot": "2019-10-21T02:00:00.000+02:00",
  "dateDistribution": "2019-11-06T01:00:00.000+01:00",
  "article99": "0",
  "loiReference": {
    "codeLoi": "xx loi 2017-1837",
    "divisionCodeLoi": "83 I 2 a"
  }
}