{
  "uid": "AMANR5L15SEA717460BTC0575P0D1N778",
  "identifiant": {
    "legislature": "15",
    "numero": "778",
    "numRect": "0",
    "saisine": {
      "texteLegislatifRef": "PRJLANR5L15BTC0575",
      "numeroPartiePLF": "0",
      "organeExamen": "PO717460",
      "mentionSecondeDeliberation": "0"
    }
  },
  "numeroLong": "778",
  "etapeTexte": "1ère lecture (1ère assemblée saisie)",
  "triAmendement": "l",
  "cardinaliteAmdtMultiples": "1",
  "etat": "Discuté",
  "signataires": {
    "auteur": {
      "typeAuteur": "Depute",
      "acteurRef": "PA267585",
      "groupePolitiqueRef": "PO744425"
    },
    "cosignatairesRefs": [
      "PA331582",
      "PA267766",
      "PA267585",
      "PA942",
      "PA721486",
      "PA721110",
      "PA333421",
      "PA267241",
      "PA268019",
      "PA1960",
      "PA642868",
      "PA331567",
      "PA712014"
    ],
    "texteAffichable": "M.&#160;Vercamer,  M.&#160;Guy&#160;Bricout, M.&#160;Christophe, M.&#160;Charles&#160;de Courson, Mme&#160;de La Raudi&#232;re, M.&#160;Demilly, M.&#160;Lagarde, M.&#160;Ledoux, M.&#160;Leroy, M.&#160;Naegelen, M.&#160;Pancher, Mme&#160;Sanquer et M.&#160;Philippe&#160;Vigier"
  },
  "pointeurFragmentTexte": {
    "division": {
      "titre": "Article 2",
      "articleDesignationCourte": "ART. 2",
      "type": "ARTICLE",
      "avantAApres": "A",
      "divisionRattachee": "ARTICLE 2",
      "urlDivisionTexteVise": "/15/textes/0575.asp#D_Article_2"
    },
    "alinea": {
      "avantAApres": "Apres",
      "numero": "28"
    }
  },
  "corps": {
    "dispositif": "<p style=\"text-align: justify;\">Compl&#233;ter cet article par l&#8217;alin&#233;a suivant&#160;:</p><p style=\"text-align: justify;\">&#171;&#160;III. &#8211; Le Gouvernement remet au&#160;Parlement, dans les six mois suivant la promulgation de la pr&#233;sente loi, un&#160;rapport&#160;relatif &#224; l&#8217;exp&#233;rimentation de l&#8217;application de p&#233;nalit&#233;s &#224; l&#8217;&#201;tat lorsque celui-ci a commis une erreur.&#160;&#187;</p>",
    "exposeSommaire": "<p style=\"text-align: justify;\">Lorsque l&#8217;administration m&#233;connait une r&#232;gle &#224; laquelle elle est soumise, si cette m&#233;connaissance cause un pr&#233;judice aux administr&#233;s, celle-ci peut faire l&#8217;objet d&#8217;une sanction. Cette r&#233;ciprocit&#233; des sanctions permettrait d&#8217;&#233;tablir davantage d&#8217;&#233;quit&#233; entre les administr&#233;s et l&#8217;administration.</p>"
  },
  "representations": [
    {
      "nom": "PDF",
      "typeMime": {
        "type": "application",
        "subType": "PDF"
      },
      "statutRepresentation": {
        "verbatim": true,
        "canonique": true,
        "officielle": true,
        "transcription": false,
        "enregistrement": false
      },
      "contenu": {
        "documentURI": "/15/amendements/0575/AN/778.pdf"
      }
    }
  ],
  "seanceDiscussion": "RUANR5L15S2018IDS20874",
  "sort": {
    "dateSaisie": "2018-01-24T00:22:01.000+01:00",
    "sortEnSeance": "Rejeté"
  },
  "dateDepot": "2018-01-19T01:00:00.000+01:00",
  "dateDistribution": "2018-01-22T01:00:00.000+01:00",
  "article99": "0",
  "loiReference": {}
}