{
  "uid": "AMANR5L15SEA717460B0235P2D1N1019",
  "identifiant": {
    "legislature": "15",
    "numero": "1019",
    "numRect": "0",
    "saisine": {
      "texteLegislatifRef": "PRJLANR5L15B0235",
      "numeroPartiePLF": "2",
      "organeExamen": "PO717460",
      "mentionSecondeDeliberation": "0"
    }
  },
  "numeroLong": "II-1019",
  "etapeTexte": "1ère lecture (1ère assemblée saisie)",
  "triAmendement": "s",
  "cardinaliteAmdtMultiples": "1",
  "etat": "Irrecevable",
  "signataires": {
    "auteur": {
      "typeAuteur": "Depute",
      "acteurRef": "PA721226",
      "groupePolitiqueRef": "PO730958"
    },
    "cosignatairesRefs": [
      "PA2150",
      "PA721960",
      "PA721202",
      "PA718860",
      "PA720422",
      "PA720892",
      "PA721226",
      "PA588884",
      "PA720286",
      "PA722142",
      "PA718868",
      "PA719676",
      "PA719578",
      "PA721062",
      "PA720430",
      "PA721210",
      "PA720846"
    ],
    "texteAffichable": "Mme&#160;Rubin,  Mme&#160;Autain, M.&#160;Bernalicis, M.&#160;Coquerel, M.&#160;Corbi&#232;re, Mme&#160;Fiat, M.&#160;Lachaud, M.&#160;Larive, M.&#160;M&#233;lenchon, Mme&#160;Obono, Mme&#160;Panot, M.&#160;Prud&apos;homme, M.&#160;Quatennens, M.&#160;Ratenon, Mme&#160;Ressiguier, M.&#160;Ruffin et Mme&#160;Taurine"
  },
  "pointeurFragmentTexte": {
    "missionVisee": {
      "idMissionAN": "16",
      "libelleMission": "Enseignement scolaire",
      "codeMissionPLF": "B",
      "libelleMissionPLF": "Répartition, par mission et programme, des crédits du budget général"
    },
    "division": {
      "titre": "Article 55",
      "articleDesignationCourte": "APRÈS ART. 55",
      "type": "ARTICLE",
      "avantAApres": "Apres",
      "divisionRattachee": "APRÈS L'ARTICLE 55, insérer l'article suivant:",
      "articleAdditionnel": "1",
      "urlDivisionTexteVise": "/15/textes/0235C.asp#D_Article_55"
    }
  },
  "corps": {
    "dispositif": "<p style=\"text-align: justify;\">I.&#160;&#8211;&#160;Le Gouvernement remet au Parlement, dans un d&#233;lai de douze mois &#224; compter de la promulgation de la pr&#233;sente loi, un rapport d&#8217;information sur la mise en place dans toutes les cantines scolaires de la gratuit&#233; et d&#8217;une alimentation biologique en circuits courts.</p><p style=\"text-align: justify;\">II.&#160;&#8211;&#160;Le rapport &#233;value notamment le poids &#233;conomique et financier que repr&#233;senterait la mise en place, dans toutes les cantines scolaires de l&#8217;&#233;cole publique du primaire et du secondaire, de la gratuit&#233; et d&#8217;une alimentation biologique en circuits courts. Le rapport s&#8217;int&#233;resse &#233;galement aux effets sur la sant&#233; des utilisateurs de ces cantines.</p>",
    "exposeSommaire": "<p style=\"text-align: justify;\">Cet amendement vise &#224; demander un rapport sur la mise en place d&#8217;une cantine gratuite, biologique, en circuits courts, dans tous les &#233;tablissements scolaires publics du premier et second degr&#233;.</p><p style=\"text-align: justify;\">En 2015, pour 6 millions d&#8217;&#233;l&#232;ves mangeant &#224; la cantine, premiers et seconds degr&#233;s confondus, seulement 3,2&#160;% des produits propos&#233;s &#233;taient biologiques.</p><p style=\"text-align: justify;\">De nombreuses communes sont parvenues &#224; instaurer ce mode de fonctionnement sans surco&#251;t.</p><p style=\"text-align: justify;\">Cette mesure permettra d&#8217;encourager les fili&#232;res agroalimentaires biologiques et paysannes, de favoriser la diversification et la qualit&#233; alimentaire, de valoriser les produits du terroir, de&#160;cr&#233;er des emplois en zone rurale, de r&#233;duire les transports de produits et ainsi de minimiser l&#8217;impact &#233;cologique.</p><p style=\"text-align: justify;\">Pour toutes ces raisons, nous demandons un rapport, qui devra &#233;valuer notamment le poids &#233;conomique et financier que repr&#233;senterait la mise en place, dans toutes les cantines scolaires de l&#8217;&#233;cole publique du primaire et du secondaire, de la gratuit&#233; et d&#8217;une alimentation biologique en circuits courts. Le rapport s&#8217;int&#233;ressera &#233;galement aux effets sur la sant&#233; des utilisateurs de ces cantines.</p>"
  },
  "representations": [
    {
      "nom": "PDF",
      "typeMime": {
        "type": "application",
        "subType": "PDF"
      },
      "statutRepresentation": {
        "verbatim": true,
        "canonique": true,
        "officielle": true,
        "transcription": false,
        "enregistrement": false
      },
      "contenu": {
        "documentURI": "/15/amendements/0235C/AN/1019.pdf"
      }
    }
  ],
  "dateDepot": "2017-11-07T01:00:00.000+01:00",
  "article99": "0",
  "loiReference": {}
}