{
  "uid": "AMANR5L15SEA717460BTC1177P0D1N266",
  "identifiant": {
    "legislature": "15",
    "numero": "266",
    "numRect": "0",
    "saisine": {
      "texteLegislatifRef": "PRJLANR5L15BTC1177",
      "numeroPartiePLF": "0",
      "organeExamen": "PO717460",
      "mentionSecondeDeliberation": "0"
    }
  },
  "numeroLong": "266",
  "etapeTexte": "Nouvelle Lecture",
  "triAmendement": "bei",
  "cardinaliteAmdtMultiples": "1",
  "etat": "Discuté",
  "signataires": {
    "auteur": {
      "typeAuteur": "Depute",
      "acteurRef": "PA267429",
      "groupePolitiqueRef": "PO730934"
    },
    "cosignatairesRefs": [
      "PA267429"
    ],
    "texteAffichable": "M.&#160;Cinieri"
  },
  "pointeurFragmentTexte": {
    "division": {
      "titre": "Article 4",
      "articleDesignationCourte": "ART. 4",
      "type": "ARTICLE",
      "avantAApres": "A",
      "divisionRattachee": "ARTICLE 4",
      "urlDivisionTexteVise": "/15/textes/1177.asp#D_Article_4"
    },
    "alinea": {
      "numero": "28"
    }
  },
  "corps": {
    "dispositif": "<p style=\"text-align: justify;\">R&#233;diger ainsi l&#8217;alin&#233;a&#160;28&#160;:</p><p style=\"text-align: justify;\">&#171;&#160;<i>Art.&#160;L.&#160;6313&#8209;5</i>.&#160;&#8211;&#160;Les actions permettant aux travailleurs de faire valider les acquis de leur exp&#233;rience ont pour objet l&#8217;acquisition d&#8217;un dipl&#244;me, d&#8217;un titre &#224; finalit&#233; professionnelle ou d&#8217;un certificat de qualification figurant sur une liste &#233;tablie par la commission paritaire nationale de l&#8217;emploi d&#8217;une branche professionnelle ou enregistr&#233;s dans le r&#233;pertoire national des certifications professionnelles mentionn&#233; &#224; l&#8217;article L.&#160;335&#8209;6 du code de l&#8217;&#233;ducation.&#160;&#187;</p>",
    "exposeSommaire": "<p style=\"text-align: justify;\">Cet amendement propose de renvoyer &#224; la r&#233;daction initiale de l&#8217;article L.&#160;6313&#8209;11, en r&#233;int&#233;grant les dipl&#244;mes et les contrats de qualification, comme point d&#8217;aboutissement d&#8217;une validation des acquis de l&#8217;exp&#233;rience.</p>"
  },
  "representations": [
    {
      "nom": "PDF",
      "typeMime": {
        "type": "application",
        "subType": "PDF"
      },
      "statutRepresentation": {
        "verbatim": true,
        "canonique": true,
        "officielle": true,
        "transcription": false,
        "enregistrement": false
      },
      "contenu": {
        "documentURI": "/15/amendements/1177/AN/266.pdf"
      }
    }
  ],
  "seanceDiscussion": "RUANR5L15S2018IDS21198",
  "sort": {
    "dateSaisie": "2018-07-24T00:24:21.000+02:00",
    "sortEnSeance": "Rejeté"
  },
  "dateDepot": "2018-07-20T02:00:00.000+02:00",
  "dateDistribution": "2018-07-21T02:00:00.000+02:00",
  "article99": "0",
  "loiReference": {}
}