{
  "uid": "AMANR5L15SEA717460BTC0902P0D1N771",
  "identifiant": {
    "legislature": "15",
    "numero": "771",
    "numRect": "0",
    "saisine": {
      "texteLegislatifRef": "PRJLANR5L15BTC0902",
      "numeroPartiePLF": "0",
      "organeExamen": "PO717460",
      "mentionSecondeDeliberation": "0"
    }
  },
  "numeroLong": "771",
  "etapeTexte": "1ère lecture (1ère assemblée saisie)",
  "triAmendement": "cwvx",
  "cardinaliteAmdtMultiples": "1",
  "etat": "Discuté",
  "signataires": {
    "auteur": {
      "typeAuteur": "Depute",
      "acteurRef": "PA718838",
      "groupePolitiqueRef": "PO730934"
    },
    "cosignatairesRefs": [
      "PA721968",
      "PA767",
      "PA718838",
      "PA722390",
      "PA718850"
    ],
    "texteAffichable": "M.&#160;Brun,  M.&#160;Cattin, M.&#160;Cordier, Mme&#160;Corneloup et M.&#160;Vialay"
  },
  "pointeurFragmentTexte": {
    "division": {
      "titre": "Article PREMIER",
      "articleDesignationCourte": "ART. PREMIER",
      "type": "ARTICLE",
      "avantAApres": "A",
      "divisionRattachee": "ARTICLE PREMIER",
      "urlDivisionTexteVise": "/15/textes/0902.asp#D_Article_1er"
    },
    "alinea": {
      "avantAApres": "A",
      "numero": "47",
      "alineaDesignation": "Alinéa 47"
    }
  },
  "corps": {
    "dispositif": "<p style=\"text-align: justify;\">R&#233;diger ainsi l'alin&#233;a&#160;47&#160;:</p><p style=\"text-align: justify;\">&#171;&#160;III.&#160;&#8211;&#160;Sous r&#233;serve du respect des dispositions du R&#232;glement n&#176; 1234/2007 du Conseil du 22 octobre 2007 portant organisation commune des march&#233;s dans le secteur agricole et dispositions sp&#233;cifiques en ce qui concerne certains produits de ce secteur unique concernant le secteur du sucre, le I n'est pas applicable aux contrats pass&#233;s avec les entreprises sucri&#232;res par les producteurs de betterave ou de canne &#224; sucre.&#160;&#187;</p>",
    "exposeSommaire": "<p style=\"text-align: justify;\">Le r&#232;glement OCM (article&#160;125, annexe X) contient des mesures sp&#233;cifiques portant sur les conditions d&#8217;achats des betteraves. Toutefois, en mati&#232;re de contrats de vente de betteraves, le droit national s&#8217;est toujours appliqu&#233; sous r&#233;serve des r&#232;glements&#160;europ&#233;ens. Ainsi, l&#8217;exclusion des betteraviers et canniers du b&#233;n&#233;fice des nouvelles dispositions relatives aux contrats de vente de produits agricoles au motif que seul le droit communautaire s&#8217;appliquerait, n&#8217;est pas conforme &#224; la jurisprudence de la Cour de Justice - comp&#233;tente pour interpr&#233;ter le droit de l&#8217;UE selon l&#8217;article&#160;267 du trait&#233;- selon laquelle &#171;&#160;si l&#8217;organisation commune des march&#233;s pr&#233;voit des r&#232;gles g&#233;n&#233;rales relatives &#224; la vente et l&#8217;achat des betteraves, il en ressort cependant clairement que les accords et contrats vis&#233;s continuent, sous r&#233;serve du respect desdites r&#232;gles g&#233;n&#233;rales, d&#8217;&#234;tre r&#233;gis par le droit national des contrats sous lequel ils sont conclus&#160;&#187; (attendu n&#176;8 de l&#8217;arr&#234;t du 16 janvier 1979, affaire n&#176; 151/78).</p><p style=\"text-align: justify;\">Le r&#232;glement OCM permet de pr&#233;ciser et compl&#233;ter le contrat par des dispositions qui ne peuvent lui &#234;tre contraires (Annexe X, Point X)&#160;; il n&#8217;indique pas quelle partie envoie la proposition de contrat &#224; l&#8217;autre, et pr&#233;voit l&#8217;ajustement du prix comme convenu au pr&#233;alable par les parties (Point II.2.)&#160;: il n&#8217;y a donc pas de contradiction avec le projet de loi.</p><p style=\"text-align: justify;\">Il suffit donc de rappeler que le droit national s&#8217;applique sous r&#233;serve du respect des dispositions du r&#232;glement OCM. Cela permettra ainsi &#224; la fili&#232;re betterave sucre de b&#233;n&#233;ficier des avanc&#233;es de la loi pour continuer &#224; renforcer sa contractualisation sans risque pour le l&#233;gislateur d&#8217;&#234;tre confront&#233; &#224; une incompatibilit&#233; avec le droit&#160;europ&#233;en.</p>"
  },
  "representations": [
    {
      "nom": "PDF",
      "typeMime": {
        "type": "application",
        "subType": "PDF"
      },
      "statutRepresentation": {
        "verbatim": true,
        "canonique": true,
        "officielle": true,
        "transcription": false,
        "enregistrement": false
      },
      "contenu": {
        "documentURI": "/15/amendements/0902/AN/771.pdf"
      }
    }
  ],
  "seanceDiscussion": "RUANR5L15S2018IDS21050",
  "sort": {
    "dateSaisie": "2018-05-24T01:03:52.000+02:00",
    "sortEnSeance": "Rejeté"
  },
  "dateDepot": "2018-05-15T02:00:00.000+02:00",
  "dateDistribution": "2018-05-18T02:00:00.000+02:00",
  "article99": "0",
  "loiReference": {}
}