{
  "uid": "AMANR5L15SEA717460BTC0164P0D1N43",
  "identifiant": {
    "legislature": "15",
    "numero": "43",
    "numRect": "0",
    "saisine": {
      "texteLegislatifRef": "PRJLANR5L15BTC0164",
      "numeroPartiePLF": "0",
      "organeExamen": "PO717460",
      "mentionSecondeDeliberation": "0"
    }
  },
  "numeroLong": "43",
  "etapeTexte": "1ère lecture (2ème assemblée saisie)",
  "triAmendement": "aews",
  "cardinaliteAmdtMultiples": "1",
  "etat": "Discuté",
  "signataires": {
    "auteur": {
      "typeAuteur": "Depute",
      "acteurRef": "PA267785",
      "groupePolitiqueRef": "PO730934"
    },
    "cosignatairesRefs": [
      "PA606098",
      "PA267204",
      "PA608826",
      "PA718784",
      "PA267794",
      "PA342935",
      "PA1874",
      "PA267318",
      "PA720100",
      "PA721506",
      "PA340853",
      "PA719318",
      "PA608416",
      "PA720644",
      "PA267324",
      "PA2155",
      "PA267289",
      "PA605036",
      "PA767",
      "PA721286",
      "PA266797",
      "PA605991",
      "PA345722",
      "PA223837",
      "PA266776",
      "PA718780",
      "PA330240",
      "PA267527",
      "PA721968",
      "PA1012",
      "PA346218",
      "PA608016",
      "PA606712",
      "PA709315",
      "PA267785",
      "PA607090",
      "PA267429",
      "PA2796",
      "PA721678",
      "PA267260",
      "PA720210",
      "PA346054",
      "PA719946",
      "PA334843",
      "PA721314",
      "PA642847",
      "PA720386",
      "PA718884",
      "PA718838",
      "PA718850",
      "PA721816",
      "PA266808",
      "PA267200",
      "PA721636"
    ],
    "texteAffichable": "M.&#160;Larriv&#233;,  M.&#160;Ciotti, M.&#160;Huyghe, M.&#160;Masson, M.&#160;Viala, M.&#160;Marleix, M.&#160;Schellenberger, M.&#160;Gosselin, M.&#160;Sermier, M.&#160;Bazin, M.&#160;Cinieri, M.&#160;Cordier, Mme&#160;Louwagie, M.&#160;Brun, M.&#160;Ramadier, M.&#160;Abad, M.&#160;Di Filippo, Mme&#160;Duby-Muller, M.&#160;Grelier, M.&#160;Menuel, M.&#160;Reda, Mme&#160;Bazin-Malgras, M.&#160;Lurton, Mme&#160;Beauvais, Mme&#160;Poletti, M.&#160;Reiss, M.&#160;Leclerc, M.&#160;Vialay, Mme&#160;Trastour-Isnart, M.&#160;Pauget, Mme&#160;Anthoine, M.&#160;Teissier, M.&#160;de la Verpilli&#232;re, M.&#160;Le Fur, M.&#160;Verch&#232;re, M.&#160;Peltier, M.&#160;Gaultier, Mme&#160;Genevard, M.&#160;Hetzel, M.&#160;Boucard, M.&#160;Brochand, M.&#160;Saddier, M.&#160;Nury, M.&#160;Pradi&#233;, Mme&#160;Kuster, M.&#160;Door, Mme&#160;Marianne&#160;Dubois, M.&#160;Emmanuel&#160;Maquet, M.&#160;Parigi, M.&#160;Rolland, Mme&#160;Tabarot, Mme&#160;Le Grip, M.&#160;Cattin et M.&#160;Jean-Pierre&#160;Vigier"
  },
  "pointeurFragmentTexte": {
    "division": {
      "titre": "Article 3",
      "articleDesignationCourte": "ART. 3",
      "type": "ARTICLE",
      "avantAApres": "A",
      "divisionRattachee": "ARTICLE 3",
      "urlDivisionTexteVise": "/15/textes/0164.asp#D_Article_3"
    }
  },
  "corps": {
    "dispositif": "<p style=\"text-align: justify;\">R&#233;diger ainsi cet article&#160;:</p><p style=\"text-align: justify;\">&#171;&#160;Le titre II du livre II du code de la s&#233;curit&#233; int&#233;rieure est compl&#233;t&#233; par un chapitre VIII ainsi r&#233;dig&#233;&#160;:</p><p style=\"text-align: justify;\">&#171;&#160;Chapitre VIII</p><p style=\"text-align: justify;\">&#171;&#160;Assignation &#224; r&#233;sidence aux fins de pr&#233;venir des actes de terrorisme</p><p style=\"text-align: justify;\">&#171;&#160;Art.&#160;L.&#160;228&#8209;1.&#160;&#8211;&#160;Le ministre de l&#8217;int&#233;rieur peut prononcer l&#8217;assignation &#224; r&#233;sidence, dans le lieu qu&#8217;il fixe, de toute personne &#224; l&#8217;&#233;gard de laquelle il existe des raisons s&#233;rieuses de penser que son comportement constitue une menace pour la s&#233;curit&#233; et l&#8217;ordre publics. Le ministre de l&#8217;int&#233;rieur peut la faire conduire sur le lieu de l&#8217;assignation &#224; r&#233;sidence par les services de police ou les unit&#233;s de gendarmerie.</p><p style=\"text-align: justify;\">&#171;&#160;La personne mentionn&#233;e au premier alin&#233;a du pr&#233;sent article peut &#233;galement &#234;tre astreinte &#224; demeurer dans le lieu d&#8217;habitation d&#233;termin&#233; par le ministre de l&#8217;int&#233;rieur, pendant la plage horaire qu&#8217;il fixe, dans la limite de douze heures par vingt-quatre heures.</p><p style=\"text-align: justify;\">&#171;&#160;L&#8217;assignation &#224; r&#233;sidence permet &#224; ceux qui en sont l&#8217;objet de r&#233;sider dans une agglom&#233;ration ou &#224; proximit&#233; imm&#233;diate d&#8217;une agglom&#233;ration. Elle tient compte de leur vie familiale et professionnelle.</p><p style=\"text-align: justify;\">&#171;&#160;En aucun cas, l&#8217;assignation &#224; r&#233;sidence ne pourra avoir pour effet la cr&#233;ation de camps o&#249; seraient d&#233;tenues les personnes mentionn&#233;es au premier alin&#233;a.</p><p style=\"text-align: justify;\">&#171;&#160;L&#8217;autorit&#233; administrative prend toutes dispositions pour assurer la subsistance des personnes astreintes &#224; r&#233;sidence, ainsi que celle de leur famille.</p><p style=\"text-align: justify;\">&#171;&#160;Le ministre de l&#8217;int&#233;rieur peut prescrire &#224; la personne assign&#233;e &#224; r&#233;sidence&#160;:</p><p style=\"text-align: justify;\">&#171;&#160;1&#176;&#160;L&#8217;obligation de se pr&#233;senter p&#233;riodiquement aux services de police ou aux unit&#233;s de gendarmerie, selon une fr&#233;quence qu&#8217;il d&#233;termine dans la limite de trois pr&#233;sentations par jour, en pr&#233;cisant si cette obligation s&#8217;applique y compris les dimanches et jours f&#233;ri&#233;s ou ch&#244;m&#233;s&#160;;</p><p style=\"text-align: justify;\">&#171;&#160;2&#176;&#160;La remise &#224; ces services de son passeport ou de tout document justificatif de son identit&#233;. Il lui est d&#233;livr&#233; en &#233;change un r&#233;c&#233;piss&#233;, valant justification de son identit&#233; en application de l&#8217;article&#160;1<sup>er</sup> de la loi n&#176;&#160;2012&#8209;410 du 27 mars 2012 relative &#224; la protection de l&#8217;identit&#233;, sur lequel sont mentionn&#233;es la date de retenue et les modalit&#233;s de restitution du document retenu.</p><p style=\"text-align: justify;\">&#171;&#160;La personne astreinte &#224; r&#233;sider dans le lieu qui lui est fix&#233; en application du premier alin&#233;a du pr&#233;sent article peut se voir interdire par le ministre de l&#8217;int&#233;rieur de se trouver en relation, directement ou indirectement, avec certaines personnes, nomm&#233;ment d&#233;sign&#233;es, dont il existe des raisons s&#233;rieuses de penser que leur comportement constitue une menace pour la s&#233;curit&#233; et l&#8217;ordre publics. Cette interdiction est lev&#233;e d&#232;s qu&#8217;elle n&#8217;est plus n&#233;cessaire.</p><p style=\"text-align: justify;\">&#171;&#160;Le procureur de la R&#233;publique comp&#233;tent est inform&#233; sans d&#233;lai de toute mesure d&#8217;assignation &#224; r&#233;sidence, des modifications qui y sont apport&#233;es et de son abrogation.</p><p style=\"text-align: justify;\">&#171;&#160;Le ministre de l&#8217;int&#233;rieur peut d&#233;l&#233;guer au pr&#233;fet territorialement comp&#233;tent le soin de modifier le lieu et la plage horaire de l&#8217;astreinte &#224; demeurer dans un lieu d&#8217;habitation d&#233;termin&#233;, dans les limites fix&#233;es au deuxi&#232;me alin&#233;a, ainsi que les horaires, la fr&#233;quence et le lieu de l&#8217;obligation de pr&#233;sentation p&#233;riodique aux services de police ou aux unit&#233;s de gendarmerie, dans les limites fix&#233;es au 1&#176;.</p><p style=\"text-align: justify;\">&#171;&#160;Une m&#234;me personne ne peut &#234;tre assign&#233;e &#224; r&#233;sidence pour une dur&#233;e totale &#233;quivalant &#224; plus de douze mois.</p><p style=\"text-align: justify;\">&#171;&#160;Le ministre de l&#8217;int&#233;rieur peut toutefois prolonger une assignation &#224; r&#233;sidence au-del&#224; de la dur&#233;e mentionn&#233;e &#224; l&#8217;alin&#233;a pr&#233;c&#233;dent. La prolongation ne peut exc&#233;der une dur&#233;e de trois mois. L&#8217;autorit&#233; administrative peut, &#224; tout moment, mettre fin &#224; l&#8217;assignation &#224; r&#233;sidence ou diminuer les obligations qui en d&#233;coulent en application des dispositions du pr&#233;sent article.</p><p style=\"text-align: justify;\">&#171;&#160;La demande mentionn&#233;e &#224; l&#8217;avant-dernier alin&#233;a peut &#234;tre renouvel&#233;e dans les m&#234;mes conditions.</p><p style=\"text-align: justify;\">&#171;&#160;Les dispositions du pr&#233;sent article sont applicables jusqu&#8217;au&#160;1er&#160;novembre&#160;2018.&#160;&#187;</p>",
    "exposeSommaire": "<p style=\"text-align: justify;\">Le pr&#233;sent amendement propose de proroger le r&#233;gime de l&#8217;assignation &#224; r&#233;sidence pr&#233;vu par l&#8217;&#233;tat d&#8217;urgence actuellement en vigueur.</p>"
  },
  "representations": [
    {
      "nom": "PDF",
      "typeMime": {
        "type": "application",
        "subType": "PDF"
      },
      "statutRepresentation": {
        "verbatim": true,
        "canonique": true,
        "officielle": true,
        "transcription": false,
        "enregistrement": false
      },
      "contenu": {
        "documentURI": "/15/amendements/0164/AN/43.pdf"
      }
    }
  ],
  "seanceDiscussion": "RUANR5L15S2017IDS20671",
  "sort": {
    "dateSaisie": "2017-09-26T22:27:32.000+02:00",
    "sortEnSeance": "Rejeté"
  },
  "dateDepot": "2017-09-19T02:00:00.000+02:00",
  "dateDistribution": "2017-09-22T02:00:00.000+02:00",
  "article99": "0",
  "loiReference": {}
}