{
  "uid": "AMANR5L15PO419610B1284P0D1N11",
  "identifiant": {
    "legislature": "15",
    "numero": "11",
    "numRect": "0",
    "saisine": {
      "texteLegislatifRef": "PIONANR5L15B1284",
      "numeroPartiePLF": "0",
      "organeExamen": "PO419610",
      "mentionSecondeDeliberation": "0"
    }
  },
  "numeroLong": "CE11",
  "etapeTexte": "1ère lecture (1ère assemblée saisie)",
  "triAmendement": "qaaaaaaaaaaaaaaaaaaaaaaaaaaaaaaaaaaaaaaaaaaaaaaaaaw",
  "cardinaliteAmdtMultiples": "1",
  "etat": "Discuté",
  "signataires": {
    "auteur": {
      "typeAuteur": "Depute",
      "acteurRef": "PA722142",
      "groupePolitiqueRef": "PO730958"
    },
    "cosignatairesRefs": [
      "PA720422",
      "PA722142",
      "PA721226",
      "PA719676",
      "PA720892",
      "PA720846",
      "PA588884",
      "PA719578",
      "PA720286",
      "PA718868",
      "PA2150",
      "PA721210",
      "PA721202",
      "PA721062",
      "PA720430",
      "PA721960",
      "PA718860"
    ],
    "texteAffichable": "M.&#160;Ruffin,  Mme&#160;Autain, M.&#160;Bernalicis, M.&#160;Coquerel, M.&#160;Corbi&#232;re, Mme&#160;Fiat, M.&#160;Lachaud, M.&#160;Larive, M.&#160;M&#233;lenchon, Mme&#160;Obono, Mme&#160;Panot, M.&#160;Prud&apos;homme, M.&#160;Quatennens, M.&#160;Ratenon, Mme&#160;Ressiguier, Mme&#160;Rubin et Mme&#160;Taurine"
  },
  "pointeurFragmentTexte": {
    "division": {
      "titre": "Article 6",
      "articleDesignationCourte": "APRÈS ART. 6",
      "type": "ARTICLE",
      "avantAApres": "Apres",
      "divisionRattachee": "APRÈS L'ARTICLE 6, insérer l'article suivant:",
      "articleAdditionnel": "1",
      "urlDivisionTexteVise": "/15/textes/1284.asp#D_Article_6"
    }
  },
  "corps": {
    "dispositif": "<p style=\"text-align: justify;\">Les services de relation client t&#233;l&#233;phonique et les conseillers client&#232;les li&#233;s &#224; des contrats conclus en France doivent &#234;tre situ&#233;s en France.</p>",
    "exposeSommaire": "<p style=\"text-align: justify;\">Par cet amendement nous souhaitons stopper les d&#233;localisations et engager une relocalisation des plateformes t&#233;l&#233;phonique en France. Pour cela nous proposons que les services de relation client t&#233;l&#233;phonique li&#233;s &#224; des contrats conclus en France aient l&#8217;obligation d&#8217;&#234;tre situ&#233;s en France.<br />En effet, ces derni&#232;res ann&#233;es nous avons connus un grand nombre de d&#233;localisation de plateformes t&#233;l&#233;phoniques de relation client &#224; l&#8217;&#233;tranger. Il n&#8217;y a pas de raisons valables pour ces activit&#233;s ne soient pas en France. Des salari&#233;s fran&#231;ais ont toutes les qualifications et les comp&#233;tences n&#233;cessaires pour r&#233;pondre aux besoins des clients. La seule explication &#224; ces d&#233;localisations est le dumping social que cela permet aux multinationales d&#8217;augmenter leurs profits. <br />De plus, ces postes sont souvent occup&#233;s dans des pays en d&#233;veloppement par des personnes qualifi&#233;s qui pourrait &#234;tre bien plus utiles dans d&#8217;autres emplois.</p>"
  },
  "representations": [
    {
      "nom": "PDF",
      "typeMime": {
        "type": "application",
        "subType": "PDF"
      },
      "statutRepresentation": {
        "verbatim": true,
        "canonique": true,
        "officielle": true,
        "transcription": false,
        "enregistrement": false
      },
      "contenu": {
        "documentURI": "/15/amendements/1284/CION-ECO/CE11.pdf"
      }
    }
  ],
  "sort": {
    "dateSaisie": "2018-11-28T11:49:54.000+01:00",
    "sortEnSeance": "Rejeté"
  },
  "dateDepot": "2018-11-23T01:00:00.000+01:00",
  "dateDistribution": "2018-11-27T01:00:00.000+01:00",
  "article99": "0",
  "loiReference": {
    "codeLoi": "xdisposition"
  }
}