{
  "uid": "AMANR5L15PO419865B0011P0D1N2",
  "identifiant": {
    "legislature": "15",
    "numero": "2",
    "numRect": "0",
    "saisine": {
      "texteLegislatifRef": "PRJLANR5L15B0011",
      "numeroPartiePLF": "0",
      "organeExamen": "PO419865",
      "mentionSecondeDeliberation": "0"
    }
  },
  "numeroLong": "CD2",
  "etapeTexte": "1ère lecture (1ère assemblée saisie)",
  "triAmendement": "i",
  "cardinaliteAmdtMultiples": "1",
  "etat": "Discuté",
  "signataires": {
    "auteur": {
      "typeAuteur": "Depute",
      "acteurRef": "PA267204",
      "groupePolitiqueRef": "PO730934"
    },
    "cosignatairesRefs": [
      "PA267204",
      "PA267527",
      "PA718838",
      "PA721046",
      "PA720210"
    ],
    "texteAffichable": "M.&#160;Sermier,  Mme&#160;Beauvais, M.&#160;Saddier, Mme&#160;Bassire et M.&#160;Brun"
  },
  "pointeurFragmentTexte": {
    "division": {
      "titre": "ratifiant les ordonnances n° 20161058 du 3 août 2016 relative à la modification des règles applicables à l’évaluation environnementale des projets, plans et programmes et n° 20161060 du 3 août 2016 portant réforme des procédures destinées à assurer l’information et la participation du public à l’élaboration de certaines décisions susceptibles d’avoir une incidence sur l’environnement,",
      "articleDesignationCourte": "TITRE",
      "type": "TITRE",
      "avantAApres": "A",
      "divisionRattachee": "TITRE",
      "urlDivisionTexteVise": "/15/textes/0011.asp#D_ratifiant_les_ordonnances_n_20161058_d"
    }
  },
  "corps": {
    "dispositif": "<p>Au titre du projet, substituer aux mots&#160;: </p><p>&#171;&#160;une incidence&#160;&#187;, </p><p>les mots&#160;: </p><p>&#171;&#160;des impacts significatifs&#160;&#187;.</p>",
    "exposeSommaire": "<p style=\"text-align: justify;\">En &#233;tendant le crit&#232;re d&#8217;incidence des projets sur l&#8217;environnement : le crit&#232;re de &#171; l&#8217;incidence directe et significative &#187; est abandonn&#233; : il suffira d&#233;sormais que la d&#233;cision ait &#171; une incidence &#187; sur l&#8217;environnement pour qu&#8217;elle soit soumise au principe de participation du public. Ce concept est trop flou et ouvre la voie &#224; une multitude de recours.</p><p style=\"text-align: justify;\">Pour un souci de coh&#233;rence avec l&#8217;amendement que nous avons d&#233;pos&#233; apr&#232;s l&#8217;article unique et de pr&#233;cision juridique nous proposons donc de remplacer les termes &#171;&#160;incidence&#160;&#187; par &#171;&#160;impacts significatifs&#160;&#187;.</p>"
  },
  "representations": [
    {
      "nom": "PDF",
      "typeMime": {
        "type": "application",
        "subType": "PDF"
      },
      "statutRepresentation": {
        "verbatim": true,
        "canonique": true,
        "officielle": true,
        "transcription": false,
        "enregistrement": false
      },
      "contenu": {
        "documentURI": "/15/amendements/0011/CION-DVP/CD2.pdf"
      }
    }
  ],
  "sort": {
    "dateSaisie": "2017-07-11T17:01:16.000+02:00",
    "sortEnSeance": "Rejeté"
  },
  "dateDepot": "2017-07-07T02:00:00.000+02:00",
  "dateDistribution": "2017-07-07T02:00:00.000+02:00",
  "article99": "0",
  "loiReference": {}
}