{
  "uid": "AMANR5L15SEA717460BTC0369P0D1N335",
  "identifiant": {
    "legislature": "15",
    "numero": "335",
    "numRect": "0",
    "saisine": {
      "texteLegislatifRef": "PRJLANR5L15BTC0369",
      "numeroPartiePLF": "0",
      "organeExamen": "PO717460",
      "mentionSecondeDeliberation": "0"
    }
  },
  "numeroLong": "335",
  "etapeTexte": "1ère lecture (1ère assemblée saisie)",
  "triAmendement": "acn",
  "cardinaliteAmdtMultiples": "1",
  "etat": "Discuté",
  "signataires": {
    "auteur": {
      "typeAuteur": "Depute",
      "acteurRef": "PA718926",
      "groupePolitiqueRef": "PO730940"
    },
    "cosignatairesRefs": [
      "PA689",
      "PA721118",
      "PA720546",
      "PA610654",
      "PA441",
      "PA610667",
      "PA610634",
      "PA267306",
      "PA721270",
      "PA718720",
      "PA721896",
      "PA722202",
      "PA722110",
      "PA718926",
      "PA720692",
      "PA335612"
    ],
    "texteAffichable": "M.&#160;Dharr&#233;ville,  M.&#160;Azerot, Mme&#160;Bello, M.&#160;Brotherson, M.&#160;Bruneel, Mme&#160;Buffet, M.&#160;Chassaigne, M.&#160;Dufr&#232;gne, Mme&#160;Faucillon, M.&#160;Jumel, M.&#160;Lecoq, M.&#160;Nilor, M.&#160;Peu, M.&#160;Fabien&#160;Roussel, M.&#160;Serville et M.&#160;Wulfranc"
  },
  "pointeurFragmentTexte": {
    "division": {
      "titre": "Article 2",
      "articleDesignationCourte": "ART. 2",
      "type": "ARTICLE",
      "avantAApres": "A",
      "divisionRattachee": "ARTICLE 2",
      "urlDivisionTexteVise": "/15/textes/0369.asp#D_Article_2"
    },
    "alinea": {
      "avantAApres": "Apres",
      "numero": "9"
    }
  },
  "corps": {
    "dispositif": "<p style=\"text-align: justify;\">Apr&#232;s l&#8217;alin&#233;a&#160;9, ins&#233;rer l&#8217;alin&#233;a suivant&#160;:</p><p style=\"text-align: justify;\">&#171;&#160;3&#176; <i>bis</i> &#192; la fin du dernier alin&#233;a de l&#8217;article L.&#160;2253&#8209;1, les mots&#160;: &#171;&#160;, sauf lorsque la convention d&#8217;entreprise assure des garanties au moins &#233;quivalentes&#160;&#187; sont supprim&#233;s&#160;;&#160;&#187;.</p>",
    "exposeSommaire": "<p style=\"text-align: justify;\">Amendement de repli.</p><p style=\"text-align: justify;\">Le nouvel article L.&#160;2253&#8209;1 du code du travail fixe les 13 domaines pour lesquels l&#8217;accord de branche prime sur l&#8217;accord d&#8217;entreprise. Il s&#8217;agit toutefois d&#8217;une primaut&#233; relative puisque quelques lignes plus loin, il est indiqu&#233; que l&#8217;accord d&#8217;entreprise peut d&#233;roger &#224; l&#8217;accord de branche s&#8217;il &#171;&#160;assure des garanties au moins &#233;quivalentes&#160;&#187;.</p><p style=\"text-align: justify;\">Cette expression laisse entendre que l&#8217;adoption par accord d&#8217;entreprise de stipulations moins favorables ou diff&#233;rentes de celles de l&#8217;accord de branche serait possible &#224; partir du moment o&#249; elle serait compens&#233;e par l&#8217;octroi d&#8217;autres garanties.</p><p style=\"text-align: justify;\">Loi de renforcer le r&#244;le de la branche, une telle disposition d&#233;montre une fois de plus que le principe de faveur est remise en cause dans le pr&#233;sent projet de loi.</p><p style=\"text-align: justify;\">C&#8217;est pourquoi nous proposons de la supprimer.</p>"
  },
  "representations": [
    {
      "nom": "PDF",
      "typeMime": {
        "type": "application",
        "subType": "PDF"
      },
      "statutRepresentation": {
        "verbatim": true,
        "canonique": true,
        "officielle": true,
        "transcription": false,
        "enregistrement": false
      },
      "contenu": {
        "documentURI": "/15/amendements/0369/AN/335.pdf"
      }
    }
  ],
  "seanceDiscussion": "RUANR5L15S2018IDS20783",
  "sort": {
    "dateSaisie": "2018-01-10T11:14:34.000+01:00",
    "sortEnSeance": "Rejeté"
  },
  "dateDepot": "2017-11-17T01:00:00.000+01:00",
  "dateDistribution": "2017-11-20T01:00:00.000+01:00",
  "article99": "0",
  "loiReference": {}
}