{
  "uid": "AMANR5L15SEA717460BTC0774P0D1N7",
  "identifiant": {
    "legislature": "15",
    "numero": "7",
    "numRect": "0",
    "saisine": {
      "texteLegislatifRef": "PIONANR5L15BTC0774",
      "numeroPartiePLF": "0",
      "organeExamen": "PO717460",
      "mentionSecondeDeliberation": "0"
    }
  },
  "numeroLong": "7",
  "etapeTexte": "1ère lecture (2ème assemblée saisie)",
  "triAmendement": "j",
  "cardinaliteAmdtMultiples": "1",
  "etat": "Discuté",
  "signataires": {
    "auteur": {
      "typeAuteur": "Depute",
      "acteurRef": "PA721932",
      "groupePolitiqueRef": "PO723569"
    },
    "cosignatairesRefs": [
      "PA721932"
    ],
    "texteAffichable": "Mme&#160;Lorho"
  },
  "pointeurFragmentTexte": {
    "division": {
      "titre": "Article PREMIER",
      "articleDesignationCourte": "ART. PREMIER",
      "type": "ARTICLE",
      "avantAApres": "A",
      "divisionRattachee": "ARTICLE PREMIER",
      "urlDivisionTexteVise": "/15/textes/0774.asp#D_Article_1er"
    },
    "alinea": {
      "avantAApres": "A",
      "numero": "9",
      "alineaDesignation": "Alinéa 9"
    }
  },
  "corps": {
    "dispositif": "<p style=\"text-align: justify;\">R&#233;diger ainsi l&#8217;alin&#233;a&#160;9&#160;: </p><p style=\"text-align: justify;\">&#171;&#160;4&#176; Si une d&#233;monstration contradictoire permet de prouver que l&#8217;&#233;tablissement n&#8217;a pas de caract&#232;re scolaire ou technique.&#160;&#187;</p>",
    "exposeSommaire": "<p style=\"text-align: justify;\">Il convient d'&#233;tablir un crit&#232;re pr&#233;cis plus pr&#233;cis qu'une analyse superficielle du projet pour fermer un &#233;tablissement scolaire. Aussi, notre formulation exigerait une d&#233;marche constructive si une autorit&#233; cherchait &#224; refuser l'ouverture de l'&#233;tablissement.</p>"
  },
  "representations": [
    {
      "nom": "PDF",
      "typeMime": {
        "type": "application",
        "subType": "PDF"
      },
      "statutRepresentation": {
        "verbatim": true,
        "canonique": true,
        "officielle": true,
        "transcription": false,
        "enregistrement": false
      },
      "contenu": {
        "documentURI": "/15/amendements/0774/AN/7.pdf"
      }
    }
  ],
  "seanceDiscussion": "RUANR5L15S2018IDS20968",
  "sort": {
    "dateSaisie": "2018-03-29T09:52:46.000+02:00",
    "sortEnSeance": "Non soutenu"
  },
  "dateDepot": "2018-03-22T01:00:00.000+01:00",
  "dateDistribution": "2018-03-26T02:00:00.000+02:00",
  "article99": "0",
  "loiReference": {}
}