{
  "uid": "AMANR5L15PO59048B2272P2D1N1271",
  "identifiant": {
    "legislature": "15",
    "numero": "1271",
    "numRect": "0",
    "saisine": {
      "texteLegislatifRef": "PRJLANR5L15B2272",
      "numeroPartiePLF": "2",
      "organeExamen": "PO59048",
      "mentionSecondeDeliberation": "0"
    }
  },
  "numeroLong": "II-CF1271",
  "etapeTexte": "1ère lecture (1ère assemblée saisie)",
  "triAmendement": "elaaaaaaaaaaaaaaaaaaaaaaaaaaaaaaaaaaaaaaaaaaaaaaaaacki",
  "cardinaliteAmdtMultiples": "1",
  "etat": "Irrecevable",
  "signataires": {
    "auteur": {
      "typeAuteur": "Depute",
      "acteurRef": "PA719592",
      "groupePolitiqueRef": "PO730964"
    },
    "cosignatairesRefs": [
      "PA719512",
      "PA720814",
      "PA719592",
      "PA719364"
    ],
    "texteAffichable": "M.&#160;Simian,  Mme&#160;Vignon, Mme&#160;O&apos;Petit et M.&#160;Cazenove"
  },
  "pointeurFragmentTexte": {
    "division": {
      "titre": "Article 48",
      "articleDesignationCourte": "APRÈS ART. 48",
      "type": "ARTICLE",
      "avantAApres": "Apres",
      "divisionRattachee": "APRÈS L'ARTICLE 48, insérer l'article suivant:",
      "articleAdditionnel": "1",
      "urlDivisionTexteVise": "/15/textes/2272C.asp#D_Article_48"
    }
  },
  "corps": {},
  "representations": [
    {
      "nom": "PDF",
      "typeMime": {
        "type": "application",
        "subType": "PDF"
      },
      "statutRepresentation": {
        "verbatim": true,
        "canonique": true,
        "officielle": true,
        "transcription": false,
        "enregistrement": false
      },
      "contenu": {
        "documentURI": "/15/amendements/2272C/CION_FIN/CF1271.pdf"
      }
    }
  ],
  "dateDepot": "2019-10-31T01:00:00.000+01:00",
  "dateDistribution": "2019-11-03T01:00:00.000+01:00",
  "article99": "0",
  "loiReference": {
    "codeLoi": "CGCT",
    "divisionCodeLoi": "L 1424-35"
  }
}