{
  "uid": "AMANR5L15PO757134B1673P0D1N549",
  "identifiant": {
    "legislature": "15",
    "numero": "549",
    "numRect": "0",
    "saisine": {
      "texteLegislatifRef": "PRJLANR5L15B1673",
      "numeroPartiePLF": "0",
      "organeExamen": "PO757134",
      "mentionSecondeDeliberation": "0"
    }
  },
  "numeroLong": "549",
  "etapeTexte": "Nouvelle Lecture",
  "triAmendement": "okoaaaaaaaaaaaaaaaaaaaaaaaaaaaaaaaaaaaaaaaaaaaaaaacpe",
  "cardinaliteAmdtMultiples": "1",
  "etat": "Discuté",
  "signataires": {
    "auteur": {
      "typeAuteur": "Depute",
      "acteurRef": "PA719558",
      "groupePolitiqueRef": "PO730970"
    },
    "cosignatairesRefs": [
      "PA719640",
      "PA721916",
      "PA719558",
      "PA720002"
    ],
    "texteAffichable": "M.&#160;Balanant,  Mme&#160;El Ha&#239;ry, Mme&#160;Pouzyreff et Mme&#160;Mette"
  },
  "pointeurFragmentTexte": {
    "division": {
      "titre": "Article 62 ter",
      "articleDesignationCourte": "ART. 62 TER",
      "type": "ARTICLE",
      "avantAApres": "A",
      "divisionRattachee": "ARTICLE 62 TER",
      "urlDivisionTexteVise": "/15/textes/1673.asp#D_Article_62_ter"
    },
    "alinea": {
      "numero": "4"
    }
  },
  "corps": {
    "dispositif": "<p>Substituer &#224; l&#8217;alin&#233;a&#160;4 les neuf alin&#233;as suivants&#160;:</p><p style=\"text-align: justify;\">&#171;&#160;Ce rapport mentionne en troisi&#232;me lieu le niveau de r&#233;mun&#233;ration de chaque mandataire social ainsi que les donn&#233;es suivantes, pour le territoire fran&#231;ais&#160;:</p><p style=\"text-align: justify;\">&#171;&#160;1&#176;&#160;La r&#233;mun&#233;ration moyenne des salari&#233;s de la soci&#233;t&#233; sur une base &#233;quivalent temps plein&#160;;</p><p style=\"text-align: justify;\">&#171;&#160;2&#176;&#160;La r&#233;mun&#233;ration du premier quartile des salari&#233;s de la soci&#233;t&#233; sur une base &#233;quivalent temps plein&#160;;</p><p style=\"text-align: justify;\">&#171;&#160;3&#176;&#160;La r&#233;mun&#233;ration m&#233;diane des salari&#233;s de la soci&#233;t&#233; sur une base &#233;quivalent temps plein&#160;;</p><p style=\"text-align: justify;\">&#171;&#160;4&#176;&#160;La r&#233;mun&#233;ration du troisi&#232;me quartile des salari&#233;s de la soci&#233;t&#233; sur une base &#233;quivalent temps plein&#160;;</p><p style=\"text-align: justify;\">&#171;&#160;5&#176;&#160;Le ratio entre la r&#233;mun&#233;ration moyenne des salari&#233;s autres que les mandataires sociaux et la r&#233;mun&#233;ration du dirigeant&#160;et son &#233;volution au cours des cinq exercices les plus r&#233;cents au moins&#160;;</p><p style=\"text-align: justify;\">&#171;&#160;6&#176;&#160;Le ratio entre la r&#233;mun&#233;ration m&#233;diane des salari&#233;s autres que les mandataires sociaux et la r&#233;mun&#233;ration du dirigeant et son &#233;volution au cours des cinq exercices les plus r&#233;cents au moins&#160;;</p><p style=\"text-align: justify;\">&#171;&#160;7&#176;&#160;Un document explicatif d&#233;taillant l&#8217;&#233;volution de ces donn&#233;es.</p><p style=\"text-align: justify;\">&#171;&#160;Ces informations sont pr&#233;sent&#233;es ensemble d&#8217;une mani&#232;re qui permette la comparaison.&#160;&#187;</p>",
    "exposeSommaire": "<p style=\"text-align: justify;\">Cet amendement vise, en substance, &#224; affiner les donn&#233;es relatives aux &#233;carts salariaux dont les rapports mentionn&#233;s au dernier alin&#233;a de l&#8217;article L.&#160;225&#8209;37 du code de commerce doivent faire &#233;tat. Les &#233;carts salariaux devraient ainsi &#234;tre d&#233;taill&#233;s par quartiles, en prenant pour base les salari&#233;s employ&#233;s sur le territoire national.</p><p style=\"text-align: justify;\">En effet, la publication des &#233;carts salariaux par quartile serait plus illustrative que celle de la comparaison de la r&#233;mun&#233;ration de chaque mandataire social et de la r&#233;mun&#233;ration m&#233;diane ou moyenne des autres salari&#233;s.</p><p style=\"text-align: justify;\">Une exigence similaire de publication des &#233;carts salariaux par quartiles a &#233;t&#233; adopt&#233;e &#224; l&#8217;unanimit&#233; au Royaume-Uni et a re&#231;u le soutien d&#8217;organisations patronales et d&#8217;investisseurs. Comme l&#8217;a point&#233; l&#8217;&#233;tude d&#8217;impact r&#233;alis&#233;e au Royaume-Uni, le co&#251;t de cette mesure pour les entreprises est extr&#234;mement faible. La comp&#233;titivit&#233; internationale des entreprises fran&#231;aises ne serait donc aucunement alt&#233;r&#233;e par l&#8217;adoption d&#8217;une mesure.</p><p style=\"text-align: justify;\">De plus, le pr&#233;sent amendement donne l&#8217;occasion &#224; l&#8217;entreprise de justifier les &#233;volutions des &#233;carts par la pr&#233;sentation d&#8217;&#233;l&#233;ments non contenus dans le rapport. Par exemple, un accroissement de l&#8217;&#233;cart d&#8217;une ann&#233;e sur l&#8217;autre est ainsi susceptible d&#8217;&#234;tre expliqu&#233; du fait d&#8217;un recrutement massif de cadres.</p><p style=\"text-align: justify;\">Enfin, disposer des informations les plus pr&#233;cises possible dans le domaine des &#233;carts salariaux aux sein des soci&#233;t&#233;s cot&#233;es pourrait nous permettre de b&#226;tir des politiques plus justes et &#233;quitables. Cela est crucial puisqu&#8217;il s&#8217;agit d&#8217;une demande largement formul&#233;e par nos concitoyens, notamment lors des d&#233;bats locaux qui donneront lieu aux restitutions du grand d&#233;bat national.</p>"
  },
  "representations": [
    {
      "nom": "PDF",
      "typeMime": {
        "type": "application",
        "subType": "PDF"
      },
      "statutRepresentation": {
        "verbatim": true,
        "canonique": true,
        "officielle": true,
        "transcription": false,
        "enregistrement": false
      },
      "contenu": {
        "documentURI": "/15/amendements/1673/CSPACTE/549.pdf"
      }
    }
  ],
  "sort": {
    "dateSaisie": "2019-03-07T16:30:17.000+01:00",
    "sortEnSeance": "Rejeté"
  },
  "dateDepot": "2019-03-01T01:00:00.000+01:00",
  "dateDistribution": "2019-03-06T01:00:00.000+01:00",
  "article99": "0",
  "loiReference": {}
}