{
  "uid": "AMANR5L15PO420120B1681P0D1N960",
  "identifiant": {
    "legislature": "15",
    "numero": "960",
    "numRect": "0",
    "saisine": {
      "texteLegislatifRef": "PRJLANR5L15B1681",
      "numeroPartiePLF": "0",
      "organeExamen": "PO420120",
      "mentionSecondeDeliberation": "0"
    }
  },
  "numeroLong": "AS960",
  "etapeTexte": "1ère lecture (1ère assemblée saisie)",
  "triAmendement": "bpaaaaaaaaaaaaaaaaaaaaaaaaaaaaaaaaaaaaaaaaaaaaaaaaaazztzy",
  "cardinaliteAmdtMultiples": "1",
  "etat": "Irrecevable",
  "signataires": {
    "auteur": {
      "typeAuteur": "Depute",
      "acteurRef": "PA642764",
      "groupePolitiqueRef": "PO758835"
    },
    "cosignatairesRefs": [
      "PA508",
      "PA719930",
      "PA335532",
      "PA608172",
      "PA605069",
      "PA333818",
      "PA1008",
      "PA1592",
      "PA333285",
      "PA642764",
      "PA332614",
      "PA607553",
      "PA643145",
      "PA335054",
      "PA608695",
      "PA340343",
      "PA609332",
      "PA340357",
      "PA337483",
      "PA1198",
      "PA1809",
      "PA610681",
      "PA429893",
      "PA609590",
      "PA608011",
      "PA267233",
      "PA720988",
      "PA608741",
      "PA342415"
    ],
    "texteAffichable": "M.&#160;Aviragnet,  Mme&#160;Bareigts, Mme&#160;Bi&#233;mouret, M.&#160;Vallaud, Mme&#160;Rabault, Mme&#160;Battistel, M.&#160;Bouillon, M.&#160;Jean-Louis&#160;Bricout, M.&#160;Carvounas, M.&#160;Alain&#160;David, Mme&#160;Laurence&#160;Dumont, M.&#160;Faure, M.&#160;Garot, M.&#160;David&#160;Habib, M.&#160;Hutin, M.&#160;Juanico, Mme&#160;Karamanli, M.&#160;J&#233;r&#244;me&#160;Lambert, M.&#160;Letchimy, Mme&#160;Manin, Mme&#160;Pau-Langevin, Mme&#160;Pires Beaune, M.&#160;Potier, M.&#160;Pueyo, M.&#160;Saulignac, Mme&#160;Tolmont, Mme&#160;Untermaier, Mme&#160;Vainqueur-Christophe et Mme&#160;Victory"
  },
  "pointeurFragmentTexte": {
    "division": {
      "titre": "Article 7",
      "articleDesignationCourte": "APRÈS ART. 7",
      "type": "ARTICLE",
      "avantAApres": "Apres",
      "divisionRattachee": "APRÈS L'ARTICLE 7, insérer l'article suivant:",
      "articleAdditionnel": "1",
      "urlDivisionTexteVise": "/15/textes/1681.asp#D_Article_7"
    }
  },
  "corps": {
    "dispositif": "<p style=\"text-align: justify;\">Apr&#232;s la premi&#232;re occurrence du mot&#160;: &#171;&#160;maladie&#160;&#187;, la fin du quatri&#232;me alin&#233;a du I de l&#8217;article L.&#160;162&#8209;17&#8209;1 du code de la s&#233;curit&#233; sociale est ainsi r&#233;dig&#233;e&#160;: &#171;&#160;, un repr&#233;sentant de l&#8217;Union nationale des organismes d&#8217;assurance maladie compl&#233;mentaire, deux d&#233;put&#233;s et deux s&#233;nateurs.&#160;&#187;</p>",
    "exposeSommaire": "<p style=\"text-align: justify;\">Cet amendement du groupe socialiste, propose d&#8217;int&#233;grer deux d&#233;put&#233;s et deux s&#233;nateurs au sein du comit&#233; &#233;conomique des produits de sant&#233; (CEPS).</p><p style=\"text-align: justify;\">Le CEPS est l&#8217;organisme interminist&#233;riel plac&#233; sous l&#8217;autorit&#233; conjointe des ministres charg&#233;s de la sant&#233;, de la s&#233;curit&#233; sociale et de l&#8217;&#233;conomie, est principalement charg&#233; par la loi de fixer les prix des m&#233;dicaments et les tarifs des dispositifs m&#233;dicaux &#224; usage individuel pris en charge par l&#8217;assurance maladie obligatoire.</p><p style=\"text-align: justify;\">Il serait utile pour notre d&#233;mocratie que les repr&#233;sentants du peuple puissent participer aux s&#233;ances du CEPS. Cela encouragerait la transparence au sein de notre syst&#232;me de sant&#233; et en particulier lorsqu&#8217;il s&#8217;agit de la fixation du prix des m&#233;dicaments.</p><p style=\"text-align: justify;\">Il s&#8217;agit d&#8217;un imp&#233;ratif social et politique pour notre pays.</p>"
  },
  "representations": [
    {
      "nom": "PDF",
      "typeMime": {
        "type": "application",
        "subType": "PDF"
      },
      "statutRepresentation": {
        "verbatim": true,
        "canonique": true,
        "officielle": true,
        "transcription": false,
        "enregistrement": false
      },
      "contenu": {
        "documentURI": "/15/amendements/1681/CION-SOC/AS960.pdf"
      }
    }
  ],
  "dateDepot": "2019-03-08T01:00:00.000+01:00",
  "dateDistribution": "2019-03-09T01:00:00.000+01:00",
  "article99": "0",
  "loiReference": {
    "codeLoi": "sécurité sociale",
    "divisionCodeLoi": "L162-17-3"
  }
}