{
  "uid": "AMANR5L15SEA717460BTC0575P0D1N78",
  "identifiant": {
    "legislature": "15",
    "numero": "78",
    "numRect": "0",
    "saisine": {
      "texteLegislatifRef": "PRJLANR5L15BTC0575",
      "numeroPartiePLF": "0",
      "organeExamen": "PO717460",
      "mentionSecondeDeliberation": "0"
    }
  },
  "numeroLong": "78",
  "etapeTexte": "1ère lecture (1ère assemblée saisie)",
  "triAmendement": "bi",
  "cardinaliteAmdtMultiples": "1",
  "etat": "Discuté",
  "signataires": {
    "auteur": {
      "typeAuteur": "Depute",
      "acteurRef": "PA712015",
      "groupePolitiqueRef": "PO730934"
    },
    "cosignatairesRefs": [
      "PA2155",
      "PA2377",
      "PA330909",
      "PA718850",
      "PA712015",
      "PA642847",
      "PA720210",
      "PA709315",
      "PA720644",
      "PA719272",
      "PA1874",
      "PA2086",
      "PA334654",
      "PA721286",
      "PA346054",
      "PA721678",
      "PA722390",
      "PA608416",
      "PA718884",
      "PA718838",
      "PA609726",
      "PA607090",
      "PA346218",
      "PA608016",
      "PA267429",
      "PA719946"
    ],
    "texteAffichable": "M.&#160;Dive,  M.&#160;Viala, M.&#160;Straumann, M.&#160;Bazin, Mme&#160;Bazin-Malgras, M.&#160;Ramadier, M.&#160;Hetzel, M.&#160;Cinieri, M.&#160;Cordier, Mme&#160;Corneloup, M.&#160;Descoeur, M.&#160;Menuel, M.&#160;Peltier, M.&#160;Marlin, M.&#160;Aubert, M.&#160;Nury, Mme&#160;Beauvais, M.&#160;Masson, M.&#160;Brun, M.&#160;Le Fur, M.&#160;Jean-Pierre&#160;Vigier, Mme&#160;Louwagie, M.&#160;Reda, Mme&#160;Meunier, M.&#160;Perrut et M.&#160;Emmanuel&#160;Maquet"
  },
  "pointeurFragmentTexte": {
    "division": {
      "titre": "Article 2",
      "articleDesignationCourte": "ART. 2",
      "type": "ARTICLE",
      "avantAApres": "A",
      "divisionRattachee": "ARTICLE 2",
      "urlDivisionTexteVise": "/15/textes/0575.asp#D_Article_2"
    },
    "alinea": {
      "numero": "8"
    }
  },
  "corps": {
    "dispositif": "<p style=\"text-align: justify;\">Compl&#233;ter l&#8217;alin&#233;a&#160;8&#160;par la phrase suivante&#160;:</p><p style=\"text-align: justify;\">&#171;&#160;Une personne ayant d&#233;j&#224; fait l&#8217;objet de cette proc&#233;dure ne peut &#234;tre sanctionn&#233;e pour la m&#234;me m&#233;connaissance d&#8217;une r&#232;gle applicable &#224; sa situation si les circonstances de droit ont &#233;volu&#233; depuis sa derni&#232;re r&#233;gularisation.&#160;&#187;</p>",
    "exposeSommaire": "<p style=\"text-align: justify;\">Dans l&#8217;&#233;tude d&#8217;impact annex&#233; au projet de loi pour un &#201;tat au service d&#8217;une soci&#233;t&#233; de confiance, il est expliqu&#233; pour le pr&#233;sent article, dans son point 3.1 &#201;conomie du dispositif, que &#171;&#160;le &#171;&#160;droit &#224; l&#8217;erreur&#160;&#187; s&#8217;appliquera en cas de premi&#232;re m&#233;connaissance involontaire d&#8217;une r&#232;gle applicable &#224; la situation d&#8217;une personne [&#8230;] La pr&#233;somption de bonne foi cessera de jouer en cas de renouvellement d&#8217;une erreur dans l&#8217;application d&#8217;une M&#202;ME REGLE&#160;&#187;, c&#8217;est-&#224;-dire &#224; droit constant, sans changement de circonstance dans la r&#232;gle.</p><p style=\"text-align: justify;\">Pour lever toute ambigu&#239;t&#233;, il est propos&#233; cet amendement afin de clarifier cet &#233;tat de fait, en indiquant que le droit &#224; l&#8217;erreur prend en compte les &#233;volutions du droit, sur le m&#234;me principe que celui d&#233;fini dans les alin&#233;as 15 et 16 du pr&#233;sent article, en ce qu&#8217;il s&#8217;agit du droit d&#8217;opposer les conclusions formelles d&#8217;un contr&#244;le &#224; l&#8217;administration&#160;: &#171;&#160;les conclusions expresses cessent d&#8217;&#234;tre opposables en cas de changement de circonstance de droit ou de fait post&#233;rieures de nature &#224; affecter leur validit&#233;.</p>"
  },
  "representations": [
    {
      "nom": "PDF",
      "typeMime": {
        "type": "application",
        "subType": "PDF"
      },
      "statutRepresentation": {
        "verbatim": true,
        "canonique": true,
        "officielle": true,
        "transcription": false,
        "enregistrement": false
      },
      "contenu": {
        "documentURI": "/15/amendements/0575/AN/78.pdf"
      }
    }
  ],
  "seanceDiscussion": "RUANR5L15S2018IDS20874",
  "sort": {
    "dateSaisie": "2018-01-23T22:35:32.000+01:00",
    "sortEnSeance": "Rejeté"
  },
  "dateDepot": "2018-01-18T01:00:00.000+01:00",
  "dateDistribution": "2018-01-22T01:00:00.000+01:00",
  "article99": "0",
  "loiReference": {}
}