{
  "uid": "AMANR5L15SEA717460BTC1924P0D1N263",
  "identifiant": {
    "legislature": "15",
    "numero": "263",
    "numRect": "0",
    "saisine": {
      "texteLegislatifRef": "PRJLANR5L15BTC1924",
      "numeroPartiePLF": "0",
      "organeExamen": "PO717460",
      "mentionSecondeDeliberation": "0"
    }
  },
  "numeroLong": "263",
  "etapeTexte": "1ère lecture (1ère assemblée saisie)",
  "triAmendement": "ksaaaaaaaaaaaaaaaaaaaaaaaaaaaaaaaaaaaaaaaaaaaaaaaatl",
  "cardinaliteAmdtMultiples": "1",
  "etat": "Discuté",
  "signataires": {
    "auteur": {
      "typeAuteur": "Depute",
      "acteurRef": "PA719850",
      "groupePolitiqueRef": "PO730964"
    },
    "cosignatairesRefs": [
      "PA719850",
      "PA718802"
    ],
    "texteAffichable": "Mme&#160;Motin et M.&#160;Perea"
  },
  "pointeurFragmentTexte": {
    "division": {
      "titre": "Article 27",
      "articleDesignationCourte": "ART. 27",
      "type": "ARTICLE",
      "avantAApres": "A",
      "divisionRattachee": "ARTICLE 27",
      "urlDivisionTexteVise": "/15/textes/1924.asp#D_Article_27"
    },
    "alinea": {
      "avantAApres": "Apres",
      "numero": "14"
    }
  },
  "corps": {
    "dispositif": "<p>I.&#160;&#8211;&#160;Apr&#232;s l&#8217;alin&#233;a&#160;14, ins&#233;rer l&#8217;alin&#233;a suivant&#160;:</p><p style=\"text-align: justify;\">&#171;&#160;La rupture &#224; l&#8217;initiative de l&#8217;organisme ou l&#8217;entreprise d&#8217;accueil du contrat de travail ou, &#224; l&#8217;issue de la p&#233;riode de mise &#224; disposition, la non proposition d&#8217;une offre d&#8217;emploi au fonctionnaire par l&#8217;organisme d&#8217;accueil&#160;donne lieu &#224; un remboursement compl&#233;mentaire &#224; celui mentionn&#233; &#224; l&#8217;alin&#233;a pr&#233;c&#233;dent. La somme du remboursement partiel mentionn&#233; &#224; l&#8217;alin&#233;a pr&#233;c&#233;dent et du remboursement compl&#233;mentaire ne peut &#234;tre inf&#233;rieur &#224; 85&#160;% de la r&#233;mun&#233;ration vers&#233;e par l&#8217;employeur public au fonctionnaire en disponibilit&#233; sur la p&#233;riode.&#160;&#187;</p><p style=\"text-align: justify;\">II.&#160;&#8211;&#160;En cons&#233;quence, apr&#232;s l&#8217;alin&#233;a&#160;29, ins&#233;rer l&#8217;alin&#233;a suivant&#160;:</p><p style=\"text-align: justify;\">&#171;&#160;La rupture &#224; l&#8217;initiative de l&#8217;organisme ou l&#8217;entreprise d&#8217;accueil du contrat de travail ou, &#224; l&#8217;issue de la p&#233;riode de mise &#224; disposition, la non proposition d&#8217;une offre d&#8217;emploi au fonctionnaire par l&#8217;organisme d&#8217;accueil&#160;donne lieu &#224; un remboursement compl&#233;mentaire &#224; celui mentionn&#233; &#224; l&#8217;alin&#233;a pr&#233;c&#233;dent. La somme du remboursement partiel mentionn&#233; &#224; l&#8217;alin&#233;a pr&#233;c&#233;dent et du remboursement compl&#233;mentaire ne peut &#234;tre inf&#233;rieur &#224; 85&#160;% de la r&#233;mun&#233;ration vers&#233;e par l&#8217;employeur public au fonctionnaire en disponibilit&#233; sur la p&#233;riode.&#160;&#187;</p>",
    "exposeSommaire": "<p>En cas de restructuration, l&#8217;article&#160;27 pr&#233;voit la possibilit&#233; de mise &#224; disposition par l&#8217;&#201;tat, ses &#233;tablissements publics ou les &#233;tablissements de la fonction publique hospitali&#232;re d&#8217;un agent aupr&#232;s d&#8217;un organisme ou d&#8217;une entreprise exer&#231;ant du secteur priv&#233; pendant une dur&#233;e maximale d&#8217;un an.</p><p style=\"text-align: justify;\">Cette mise &#224; disposition donne lieu &#224; un remboursement partiel de la r&#233;mun&#233;ration par l&#8217;organisme d&#8217;accueil. Les modalit&#233;s de ce remboursement ne sont pas pr&#233;cis&#233;es dans la loi et doivent &#234;tre d&#233;finies par d&#233;cret.</p><p style=\"text-align: justify;\">Si le dispositif offre une possibilit&#233; particuli&#232;rement int&#233;ressante pour les fonctionnaires qui se trouvent confront&#233;s &#224; une restructuration, sa r&#233;daction actuelle pr&#233;sente un r&#233;el risque d&#8217;effet d&#8217;aubaine pour les entreprises du priv&#233;. En effet, les entreprises ont tout int&#233;r&#234;t &#224; accueillir ces fonctionnaires mis &#224; disposition pour lesquels elles ne s&#8217;acquitteront que de r&#233;mun&#233;rations partielles et dont le recrutement n&#8217;a rien de syst&#233;matique. Ainsi, des entreprises pourraient choisir d&#8217;accueillir les fonctionnaires pendant l&#8217;ann&#233;e de mise &#224; disposition puis de les renvoyer &#224; l&#8217;issue de cette p&#233;riode, lorsque les avantages en mati&#232;re de r&#233;mun&#233;ration ne pourront &#234;tre prolong&#233;s.</p><p style=\"text-align: justify;\">Afin d&#8217;&#233;viter ces effets d&#8217;aubaine et de s&#233;curiser le dispositif pour les employeurs publics, il est propos&#233;&#160;:</p><p style=\"text-align: justify;\">&#183;&#160; De garantir un remboursement minimal de 50&#160;% de la r&#233;mun&#233;ration lors de la mise &#224; disposition&#160;;</p><p style=\"text-align: justify;\">&#183;&#160; De contraindre les entreprises qui renverraient le fonctionnaire &#224; l&#8217;issue du contrat &#224; s&#8217;acquitter - en tout - d&#8217;au moins 85&#160;% de la r&#233;mun&#233;ration sur la p&#233;riode.</p><p style=\"text-align: justify;\">Le pr&#233;sent amendement permet qu&#8217;en cas de rupture du contrat &#224; l&#8217;initiative de l&#8217;organisme d&#8217;accueil ou de non proposition d&#8217;un contrat de travail &#224; l&#8217;issue de la p&#233;riode de disponibilit&#233; l&#8217;organisme d&#8217;accueil rembourse,&#160;&#224; minima et en prenant en compte la r&#233;mun&#233;ration d&#233;j&#224; vers&#233;e sur la p&#233;riode,&#160;85&#160;% du montant de la r&#233;mun&#233;ration totale du fonctionnaire sur la p&#233;riode d&#8217;accueil.</p>"
  },
  "representations": [
    {
      "nom": "PDF",
      "typeMime": {
        "type": "application",
        "subType": "PDF"
      },
      "statutRepresentation": {
        "verbatim": true,
        "canonique": true,
        "officielle": true,
        "transcription": false,
        "enregistrement": false
      },
      "contenu": {
        "documentURI": "/15/amendements/1924/AN/263.pdf"
      }
    }
  ],
  "sort": {
    "dateSaisie": "2019-05-20T23:57:31.000+02:00",
    "sortEnSeance": "Retiré"
  },
  "dateDepot": "2019-05-07T02:00:00.000+02:00",
  "dateDistribution": "2019-05-13T02:00:00.000+02:00",
  "article99": "0",
  "loiReference": {}
}