{
  "uid": "AMANR5L15SEA717460BTC0902P0D1N2583",
  "identifiant": {
    "legislature": "15",
    "numero": "2583",
    "numRect": "0",
    "saisine": {
      "texteLegislatifRef": "PRJLANR5L15BTC0902",
      "numeroPartiePLF": "0",
      "organeExamen": "PO717460",
      "mentionSecondeDeliberation": "0"
    }
  },
  "numeroLong": "2583",
  "etapeTexte": "1ère lecture (1ère assemblée saisie)",
  "triAmendement": "bzzzi",
  "cardinaliteAmdtMultiples": "1",
  "etat": "Discuté",
  "signataires": {
    "auteur": {
      "typeAuteur": "Depute",
      "acteurRef": "PA719080",
      "groupePolitiqueRef": "PO730964"
    },
    "cosignatairesRefs": [
      "PA719080"
    ],
    "texteAffichable": "Mme&#160;Marsaud"
  },
  "pointeurFragmentTexte": {
    "division": {
      "titre": "Article 5",
      "articleDesignationCourte": "APRÈS ART. 5",
      "type": "ARTICLE",
      "avantAApres": "Apres",
      "divisionRattachee": "APRÈS L'ARTICLE 5, insérer l'article suivant:",
      "articleAdditionnel": "1",
      "urlDivisionTexteVise": "/15/textes/0902.asp#D_Article_5"
    }
  },
  "corps": {
    "dispositif": "<p style=\"text-align: justify;\">L&#8217;article L.&#160;632&#8209;3 du code rural et de la p&#234;che maritime est compl&#233;t&#233; par six alin&#233;as ainsi r&#233;dig&#233;s&#160;:</p><p style=\"text-align: justify;\">&#171;&#160;Lorsque ces accords pr&#233;voient des d&#233;lais d&#233;rogatoires en application du 4&#176; de l&#8217;article L.&#160;443&#8209;1 du code de commerce, ces d&#233;lais ne doivent pas constituer un abus manifeste &#224; l&#8217;&#233;gard du cr&#233;ancier. Pour d&#233;terminer si les d&#233;lais d&#233;rogatoires pr&#233;vus dans un accord interprofessionnel dont l&#8217;extension lui est demand&#233;e constituent un abus manifeste &#224; l&#8217;&#233;gard du cr&#233;ancier, l&#8217;autorit&#233; administrative prend en consid&#233;ration tous les &#233;l&#233;ments d&#8217;appr&#233;ciation pertinents, et notamment&#160;: </p><p style=\"text-align: justify;\">&#171;&#160;<i>a)</i> l&#8217;existence &#233;ventuelle d&#8217;un &#233;cart manifeste par rapport aux bonnes pratiques et usages commerciaux, contraire &#224; la bonne foi et &#224; un usage loyal&#160;;</p><p style=\"text-align: justify;\">&#171;&#160;<i>b)</i> les sp&#233;cificit&#233;s du secteur et du produit concern&#233;s&#160;;</p><p style=\"text-align: justify;\">&#171;&#160;<i>c)</i> le cas &#233;ch&#233;ant, la pr&#233;sence de circonstances locales particuli&#232;res&#160;;</p><p style=\"text-align: justify;\">&#171;&#160;<i>d)</i> toute autre raison objective justifiant la d&#233;rogation.</p><p style=\"text-align: justify;\">&#171;&#160;Lorsqu&#8217;une organisation interprofessionnelle reconnue sollicite l&#8217;extension d&#8217;un accord interprofessionnel ou d&#8217;une d&#233;cision interprofessionnelle pr&#233;voyant des d&#233;lais d&#233;rogatoires de paiement, ces d&#233;lais sont pr&#233;sum&#233;s ne pas constituer un abus manifeste &#224; l&#8217;&#233;gard du cr&#233;ancier s&#8217;ils r&#233;sultent d&#8217;une d&#233;cision adopt&#233;e &#224; l&#8217;unanimit&#233; des familles professionnelles qui la composent.&#160;&#187;</p>",
    "exposeSommaire": "<p style=\"text-align: justify;\">L&#8217;article L.&#160;443&#8209;1 du code de commerce pr&#233;voit que les d&#233;lais sont plafonn&#233;s &#224; 45 jours fin de mois ou 60 jours &#224; compter de la date d&#8217;&#233;mission de la facture.</p><p style=\"text-align: justify;\">Cet article permet aussi de d&#233;roger &#224; ces d&#233;lais, par accord interprofessionnel. Ainsi, des d&#233;lais de paiement plus courts ou plus longs peuvent &#234;tre n&#233;goci&#233;s au sein de chaque interprofession. Le recours &#224; ce r&#233;gime d&#233;rogatoire, en viticulture, est largement pratiqu&#233; pour convenir de d&#233;lais de paiement plus longs.</p><p style=\"text-align: justify;\">En cas de non-respect des d&#233;lais de paiement&#160;interprofessionnels, une amende administrative de 75&#160;000&#160;euros est pr&#233;vue pour les personnes physiques, et 2 millions d&#8217;euros pour les personnes morales. Le montant peut &#234;tre doubl&#233; en cas de r&#233;cidive dans les deux ans suivants.</p><p style=\"text-align: justify;\">Dans le cadre de la proc&#233;dure d&#8217;extension des accords interprofessionnels, l&#8217;autorit&#233; administrative v&#233;rifie que les d&#233;lais de paiement pr&#233;vus ne sont pas manifestement abusifs.</p><p style=\"text-align: justify;\">Il est important que soit pr&#233;cis&#233; dans la loi, ce qu&#8217;est un d&#233;lai de paiement non manifestement abusif.</p><p style=\"text-align: justify;\">L&#8217;amendement propose&#160;:</p><p style=\"text-align: justify;\">- que les d&#233;lais de paiement interprofessionnels soient pr&#233;sum&#233;s non abusifs, s&#8217;ils sont adopt&#233;s &#224; l&#8217;unanimit&#233; des deux familles professionnelles.</p><p style=\"text-align: justify;\">- que le caract&#232;re manifestement abusif des d&#233;lais de paiement soit appr&#233;ci&#233; par l&#8217;administration au regard d&#8217;&#233;l&#233;ments pertinents, notamment les crit&#232;res suivants&#160;:</p><p style=\"text-align: justify;\">&#160;</p><p style=\"text-align: justify;\">o L&#8217;existence &#233;ventuelle d&#8217;un &#233;cart manifeste par rapport aux bonne pratiques et usages commerciaux, contraire &#224; la bonne foi et &#224; un usage loyal&#160;;</p><p style=\"text-align: justify;\">o Les sp&#233;cificit&#233;s du secteur et du produit concern&#233;&#160;;</p><p style=\"text-align: justify;\">o Le cas &#233;ch&#233;ant, la pr&#233;sence de circonstances locales particuli&#232;res et</p><p style=\"text-align: justify;\">o Toute autre raison objective justifiant la d&#233;rogation&#160;;</p>"
  },
  "representations": [
    {
      "nom": "PDF",
      "typeMime": {
        "type": "application",
        "subType": "PDF"
      },
      "statutRepresentation": {
        "verbatim": true,
        "canonique": true,
        "officielle": true,
        "transcription": false,
        "enregistrement": false
      },
      "contenu": {
        "documentURI": "/15/amendements/0902/AN/2583.pdf"
      }
    }
  ],
  "seanceDiscussion": "RUANR5L15S2018IDS21053",
  "sort": {
    "dateSaisie": "2018-05-24T21:55:53.000+02:00",
    "sortEnSeance": "Rejeté"
  },
  "dateDepot": "2018-05-17T02:00:00.000+02:00",
  "dateDistribution": "2018-05-21T02:00:00.000+02:00",
  "article99": "0",
  "loiReference": {}
}