{
  "uid": "AMANR5L15PO59051B1882P0D1N236",
  "identifiant": {
    "legislature": "15",
    "numero": "236",
    "numRect": "0",
    "saisine": {
      "texteLegislatifRef": "PNREANR5L15B1882",
      "numeroPartiePLF": "0",
      "organeExamen": "PO59051",
      "mentionSecondeDeliberation": "0"
    }
  },
  "numeroLong": "CL236",
  "etapeTexte": "Lecture unique",
  "triAmendement": "jsaaaaaaaaaaaaaaaaaaaaaaaaaaaaaaaaaaaaaaaaaaaaaaaads",
  "cardinaliteAmdtMultiples": "1",
  "etat": "Discuté",
  "signataires": {
    "auteur": {
      "typeAuteur": "Depute",
      "acteurRef": "PA721270",
      "groupePolitiqueRef": "PO730940"
    },
    "cosignatairesRefs": [
      "PA718720",
      "PA441",
      "PA721012",
      "PA610667",
      "PA689",
      "PA335612",
      "PA722110",
      "PA610654",
      "PA721118",
      "PA720692",
      "PA720546",
      "PA718926",
      "PA722202",
      "PA267306",
      "PA721896",
      "PA721270"
    ],
    "texteAffichable": "M.&#160;Peu,  M.&#160;Chassaigne, M.&#160;Jumel, M.&#160;Dharr&#233;ville, Mme&#160;Bello, M.&#160;Brotherson, M.&#160;Bruneel, Mme&#160;Buffet, M.&#160;Dufr&#232;gne, Mme&#160;Faucillon, Mme&#160;K&#233;clard-Mond&#233;sir, M.&#160;Lecoq, M.&#160;Nilor, M.&#160;Fabien&#160;Roussel, M.&#160;Serville et M.&#160;Wulfranc"
  },
  "pointeurFragmentTexte": {
    "division": {
      "titre": "Article 27",
      "articleDesignationCourte": "ART. 27",
      "type": "ARTICLE",
      "avantAApres": "A",
      "divisionRattachee": "ARTICLE 27",
      "urlDivisionTexteVise": "/15/textes/1882.asp#D_Article_27"
    }
  },
  "corps": {
    "dispositif": "<p style=\"text-align: justify;\">Supprimer cet article.</p>",
    "exposeSommaire": "<p style=\"text-align: justify;\">Cet article qui vise &#224; emp&#234;cher les membres d&#8217;un groupe de d&#233;fendre un amendement (m&#234;me s&#8217;il est identique &#224; ceux d&#8217;autres membres de son groupe) est, non seulement, inacceptable mais il est aussi manifestement inconstitutionnel.</p>"
  },
  "representations": [
    {
      "nom": "PDF",
      "typeMime": {
        "type": "application",
        "subType": "PDF"
      },
      "statutRepresentation": {
        "verbatim": true,
        "canonique": true,
        "officielle": true,
        "transcription": false,
        "enregistrement": false
      },
      "contenu": {
        "documentURI": "/15/amendements/1882/CION_LOIS/CL236.pdf"
      }
    }
  ],
  "sort": {
    "dateSaisie": "2019-05-15T23:52:21.000+02:00",
    "sortEnSeance": "Rejeté"
  },
  "dateDepot": "2019-05-10T02:00:00.000+02:00",
  "dateDistribution": "2019-05-14T02:00:00.000+02:00",
  "article99": "0",
  "loiReference": {}
}