{
  "uid": "AMANR5L15PO419610B0846P0D1N1681",
  "identifiant": {
    "legislature": "15",
    "numero": "1681",
    "numRect": "0",
    "saisine": {
      "texteLegislatifRef": "PRJLANR5L15B0846",
      "numeroPartiePLF": "0",
      "organeExamen": "PO419610",
      "mentionSecondeDeliberation": "0"
    }
  },
  "numeroLong": "CE1681",
  "etapeTexte": "1ère lecture (1ère assemblée saisie)",
  "triAmendement": "jwxi",
  "cardinaliteAmdtMultiples": "1",
  "etat": "Discuté",
  "signataires": {
    "auteur": {
      "typeAuteur": "Depute",
      "acteurRef": "PA719660",
      "groupePolitiqueRef": "PO730964"
    },
    "cosignatairesRefs": [
      "PA719660"
    ],
    "texteAffichable": "Mme&#160;Dubos, rapporteure"
  },
  "pointeurFragmentTexte": {
    "division": {
      "titre": "Article 29",
      "articleDesignationCourte": "ART. 29",
      "type": "ARTICLE",
      "avantAApres": "A",
      "divisionRattachee": "ARTICLE 29",
      "urlDivisionTexteVise": "/15/textes/0846.asp#D_Article_29"
    },
    "alinea": {
      "avantAApres": "A",
      "numero": "20",
      "alineaDesignation": "Alinéa 20"
    }
  },
  "corps": {
    "dispositif": "<p>I.&#160;&#8211;&#160;&#192; l&#8217;alin&#233;a&#160;20, la deuxi&#232;me phrase est compl&#233;t&#233;e par les mots&#160;:</p><p>&#171;&#160;ainsi que les collectivit&#233;s publiques qui ont accord&#233; un financement ou leur garantie aux emprunts contract&#233;s pour la construction, l&#8217;acquisition ou l&#8217;am&#233;lioration des logements concern&#233;s.&#160;&#187;.</p><p>II.&#160;&#8211;&#160;En cons&#233;quence, apr&#232;s le mot&#160;: &#171;&#160;m&#233;tropole&#160;&#187;&#160;&#187;, supprimer la fin de l&#8217;alin&#233;a&#160;22.</p>",
    "exposeSommaire": "<p>Cet amendement vise &#224; maintenir la consultation de toutes les collectivit&#233;s publiques ayant accord&#233; un financement ou une garantie pour la construction d&#8217;un logement social avant l&#8217;autorisation pr&#233;fectorale de mise en vente de ce logement, lorsque celui-ci n&#8217;est pas mentionn&#233; dans le programme de vente de la convention d&#8217;utilit&#233; sociale (CUS) de l&#8217;organisme.</p><p>Cet avis est maintenu par l&#8217;article&#160;28 dans le cadre de l&#8217;&#233;laboration du plan de mise en vente de la CUS. Il appara&#238;t donc coh&#233;rent de le maintenir aussi dans le cadre des autorisations hors CUS.</p><p>Cet avis permettra notamment aux d&#233;partements et aux EPCI d&#233;l&#233;gataires des aides &#224; la pierre d&#8217;&#233;mettre leur avis.</p>"
  },
  "representations": [
    {
      "nom": "PDF",
      "typeMime": {
        "type": "application",
        "subType": "PDF"
      },
      "statutRepresentation": {
        "verbatim": true,
        "canonique": true,
        "officielle": true,
        "transcription": false,
        "enregistrement": false
      },
      "contenu": {
        "documentURI": "/15/amendements/0846/CION-ECO/CE1681.pdf"
      }
    }
  ],
  "sort": {
    "dateSaisie": "2018-05-17T16:42:44.000+02:00",
    "sortEnSeance": "Adopté"
  },
  "dateDepot": "2018-05-09T02:00:00.000+02:00",
  "dateDistribution": "2018-05-15T02:00:00.000+02:00",
  "article99": "0",
  "loiReference": {}
}