{
  "uid": "AMANR5L15PO419865B1831P0D1N1824",
  "identifiant": {
    "legislature": "15",
    "numero": "1824",
    "numRect": "0",
    "saisine": {
      "texteLegislatifRef": "PRJLANR5L15B1831",
      "numeroPartiePLF": "0",
      "organeExamen": "PO419865",
      "mentionSecondeDeliberation": "0"
    }
  },
  "numeroLong": "CD1824",
  "etapeTexte": "1ère lecture (2ème assemblée saisie)",
  "triAmendement": "idoaaaaaaaaaaaaaaaaaaaaaaaaaaaaaaaaaaaaaaaaaaaaaaazzzzzzzzzzzzzzzzzzzzzzzzzzzzzzzzzzzzzzzzzzzzzzzzzzzzo",
  "cardinaliteAmdtMultiples": "1",
  "etat": "Discuté",
  "signataires": {
    "auteur": {
      "typeAuteur": "Rapporteur",
      "acteurRef": "PA720520",
      "organeRef": "PO59048",
      "groupePolitiqueRef": "PO730964"
    },
    "cosignatairesRefs": [
      "PA720520",
      "PA267336"
    ],
    "texteAffichable": "Mme&#160;Cattelot, rapporteure pour avis au nom de la commission des finances et M.&#160;Giraud"
  },
  "pointeurFragmentTexte": {
    "division": {
      "titre": "Article 1er A",
      "articleDesignationCourte": "ART. 1ER A",
      "type": "ARTICLE",
      "avantAApres": "A",
      "divisionRattachee": "ARTICLE 1ER A",
      "urlDivisionTexteVise": "/15/textes/1831.asp#D_Article_1er_A"
    },
    "alinea": {
      "avantAApres": "Apres",
      "numero": "13"
    }
  },
  "corps": {
    "dispositif": "<p>Apr&#232;s l&#8217;alin&#233;a&#160;13, ins&#233;rer l&#8217;alin&#233;a suivant&#160;:</p><p style=\"text-align: justify;\">&#171;&#160;Lorsque l&#8217;&#201;tat ou l&#8217;un de ses &#233;tablissements publics retient comme mode de r&#233;alisation le march&#233; de partenariat, le contrat de concession ou tout autre mode de r&#233;alisation supposant un pr&#233;financement de la part du titulaire, pour la r&#233;alisation d&#8217;une op&#233;ration d&#8217;investissement d&#8217;un montant sup&#233;rieur &#224; 10 millions d&#8217;euros hors taxes ou d&#8217;un projet d&#8217;investissement dont la valeur totale sur la dur&#233;e est sup&#233;rieure &#224; 20 millions d&#8217;euros hors taxes, ayant pour objet l&#8217;am&#233;lioration des mobilit&#233;s ou de r&#233;pondre &#224; un besoin en mati&#232;re de mobilit&#233;s, il ne peut effectuer d&#8217;acceptation de cession de cr&#233;ance en application des articles L.&#160;313&#8209;29 ou L.&#160;313&#8209;29&#8209;1 du code mon&#233;taire et financier que sur d&#233;cision motiv&#233;e de l&#8217;&#201;tat ou de l'&#233;tablissement public concern&#233;.&#160;&#187;</p>",
    "exposeSommaire": "<p>Le principe europ&#233;en de consolidation budg&#233;taire de certaines cr&#233;ances assimilables &#224; une dette pour l&#8217;&#201;tat et ses &#233;tablissements publics &#224; circonscrire correctement, en march&#233; de partenariat ou en concession - dans le domaine des mobilit&#233;s - le recours &#224; l&#8217;acceptation desdites cessions de cr&#233;ance afin de faciliter dans ces contrats la d&#233;consolidation budg&#233;taire pour les march&#233;s de l&#8217;&#201;tat, conform&#233;ment aux r&#232;gles applicables en vertu du droit europ&#233;en.</p><p style=\"text-align: justify;\">Il convient en particulier d'encadrer le recours aux cessions Dailly notifi&#233;es-accept&#233;es, Eurostat se r&#233;f&#233;rant &#224; la notion &#171;&#160;d&#8217;affacturage sans recours&#160;&#187; dans ses crit&#232;res d&#8217;analyse.</p><p style=\"text-align: justify;\">En effet, il faut distinguer :</p><p style=\"text-align: justify;\">-&#160; la simple cession d&#8217;une cr&#233;ance sur une collectivit&#233; publique par remise d&#8217;un bordereau selon les formalit&#233;s pr&#233;vues aux articles L. 313&#8209;23 &#224; L. 313&#8209;27 du code mon&#233;taire et financier (dite cession Dailly) qui op&#232;re le transfert de propri&#233;t&#233; de la cr&#233;ance opposable aux tiers &#224; la date du bordereau&#160;;</p><p style=\"text-align: justify;\">-&#160; la notification de la cession qui, lorsqu&#8217;elle est effectu&#233;e dans les formes pr&#233;vues aux articles L.&#160;313&#8209;28 et R. 313&#8209;17&#8209;1 du code mon&#233;taire et financier, oblige la collectivit&#233; &#224; payer entre les mains de l&#8217;&#233;tablissement cessionnaire&#160;;</p><p style=\"text-align: justify;\">-&#160; et enfin l&#8217;acceptation de la cession effectu&#233;e en application des articles L. 313&#8209;29 ou L. 313&#8209;29&#8209;1 du code mon&#233;taire et financier qui cr&#233;e pour la collectivit&#233; une obligation autonome et inconditionnelle de payer la cr&#233;ance c&#233;d&#233;e.</p><p style=\"text-align: justify;\">Restreindre la facult&#233; de recourir &#224; des cessions Dailly &#171;&#160;notifi&#233;es-accept&#233;es&#160;&#187; peut donc &#234;tre utile afin d&#8217;&#233;viter que certains projets de financement innovant des infrastructures ne se voient automatiquement, et &#224; tort, requalifi&#233;s en d&#233;penses des administrations publiques.</p><p style=\"text-align: justify;\">Cet amendement vise donc &#224; ce que le recours &#224; ces cessions Dailly ne soit possible que sur d&#233;cision motiv&#233;e de la personne publique concern&#233;e.</p>"
  },
  "representations": [
    {
      "nom": "PDF",
      "typeMime": {
        "type": "application",
        "subType": "PDF"
      },
      "statutRepresentation": {
        "verbatim": true,
        "canonique": true,
        "officielle": true,
        "transcription": false,
        "enregistrement": false
      },
      "contenu": {
        "documentURI": "/15/amendements/1831/CION-DVP/CD1824.pdf"
      }
    }
  ],
  "sort": {
    "dateSaisie": "2019-05-20T22:07:47.000+02:00",
    "sortEnSeance": "Rejeté"
  },
  "dateDepot": "2019-05-09T02:00:00.000+02:00",
  "dateDistribution": "2019-05-20T02:00:00.000+02:00",
  "article99": "0",
  "loiReference": {}
}