{
  "uid": "AMANR5L15PO419865B2274P0D1N1299",
  "identifiant": {
    "legislature": "15",
    "numero": "1299",
    "numRect": "0",
    "saisine": {
      "texteLegislatifRef": "PRJLANR5L15B2274",
      "numeroPartiePLF": "0",
      "organeExamen": "PO419865",
      "mentionSecondeDeliberation": "0"
    }
  },
  "numeroLong": "CD1299",
  "etapeTexte": "1ère lecture (2ème assemblée saisie)",
  "triAmendement": "ejaaaaaaaaaaaaaaaaaaaaaaaaaaaaaaaaaaaaaaaaaaaaaaaazzzzu",
  "cardinaliteAmdtMultiples": "1",
  "etat": "En traitement",
  "signataires": {
    "auteur": {
      "typeAuteur": "Depute",
      "acteurRef": "PA718884",
      "groupePolitiqueRef": "PO730934"
    },
    "cosignatairesRefs": [
      "PA718884",
      "PA719318"
    ],
    "texteAffichable": "Mme&#160;Bazin-Malgras et Mme&#160;Anthoine"
  },
  "pointeurFragmentTexte": {
    "division": {
      "titre": "Article 8",
      "articleDesignationCourte": "ART. 8",
      "type": "ARTICLE",
      "avantAApres": "A",
      "divisionRattachee": "ARTICLE 8",
      "urlDivisionTexteVise": "/15/textes/2274.asp#D_Article_8"
    }
  },
  "corps": {
    "dispositif": "<p>Apr&#232;s les mots&#160;: &#171;&#160;Les signal&#233;tiques et marquages pouvant induire une confusion sur la r&#232;gle de tri ou d&#8217;apport du d&#233;chet issu du produit sont affect&#233;s d&#8217;une p&#233;nalit&#233; qui ne peut &#234;tre inf&#233;rieure au montant de la contribution financi&#232;re n&#233;cessaire &#224; la gestion des d&#233;chets&#160;&#187;</p><p>Compl&#233;ter cette phrase par les mots : &#171;&#160;, &#224; l&#8217;exclusion des signal&#233;tiques et marquages pr&#233;sents sur les vins des vins et eaux-de-vie de vin. &#187;</p>",
    "exposeSommaire": "<p>Avec ce projet de loi, le Gouvernement entend marquer l&#8217;acc&#233;l&#233;ration du changement des mod&#232;les de production et de consommation afin de limiter les d&#233;chets et pr&#233;server les ressources naturelles, la biodiversit&#233; et le climat.</p><p>Dans cette logique, il est pr&#233;vu que les signal&#233;tiques et marquages pouvant induire une confusion sur la r&#232;gle de tri seraient affect&#233;s d&#8217;une p&#233;nalit&#233; qui ne pourra &#234;tre inf&#233;rieure &#224; la contribution financi&#232;re n&#233;cessaire &#224; la gestion des d&#233;chets</p><p>Les entreprises viti-vinicoles utilisatrices du logo &#171;&#160;Point Vert&#160;&#187; expriment des inqui&#233;tudes concernant les surco&#251;ts de production entra&#238;n&#233;s par cette mesure. En effet, le Point Vert a &#233;t&#233; cr&#233;&#233; il y a plus de 20 ans dans le cadre de la Responsabilit&#233; Elargie du Producteur. En France, la pr&#233;sence du Point Vert sur les emballages n&#8217;est plus obligatoire depuis janvier 2017. Il est d&#8217;application volontaire et symbolise la contribution au dispositif de tri et de recyclage. Cependant, en 2019, il reste obligatoire dans certains pays.</p><p>Le vin traverse les fronti&#232;res et la fili&#232;re vin s&#8217;est organis&#233; au niveau international pour ne pas avoir &#224; trop modifier les &#233;tiquetages en fonction des march&#233;s. Or, s&#8217;agissant des logos li&#233;s au tri, ils ne sont pas harmonis&#233;s. Les petits op&#233;rateurs n&#8217;ont d&#8217;autres choix que de les cumuler sur une m&#234;me &#233;tiquette.</p><p>Le risque de sanction aura donc pour cons&#233;quence :</p><p>i.&#160;&#160;&#160;&#160;&#160;&#160; D&#8217;engendrer des co&#251;ts &#233;conomiques importants pour les entreprises tr&#232;s fortement exportatrices, en obligeant &#224; diff&#233;rencier encore davantage les &#233;tiquetages en fonction du pays de destination (un m&#234;me vin ayant d&#233;j&#224; en moyenne 13 &#233;tiquettes diff&#233;rentes) et en rench&#233;rissant en cons&#233;quence la gestion des stocks des vins. Ces co&#251;ts directs et indirects ont pu &#234;tre &#233;valu&#233;s &#224; quelques milliers d&#8217;euros en moyenne &#224; plus de 50 000 euros pour une PME qui devra adapter en moyenne plus d&#8217;un millier de r&#233;f&#233;rences d&#8217;&#233;tiquettes diff&#233;rentes (voir jusqu&#8217;&#224; 150 000 &#8364; pour des entreprises plus importantes qui utilisent 3 000 r&#233;f&#233;rences diff&#233;rentes)</p><p>ii.&#160;&#160;&#160;&#160;&#160; De constituer une entrave technique aux &#233;changes, incompatible avec le principe de libre circulation des marchandises r&#233;gissant le march&#233; unique europ&#233;en et &#224; celles du commerce. La cons&#233;quence in&#233;vitable sera le cloisonnement des march&#233;s et le ralentissement du commerce mondial.</p><p>La France a perdu en 30 ans la moiti&#233; de ses parts de march&#233;. Pr&#233;server notre croissance et notre comp&#233;titivit&#233; est donc essentiel pour le maintien du tissu &#233;conomique national et la pr&#233;servation des 550 000 emplois directs qui y sont li&#233;s.</p><p>Compte-tenu des &#233;l&#233;ments pr&#233;cit&#233;s, il est propos&#233; d&#8217;exclure de la p&#233;nalit&#233; pr&#233;vue les vins et eaux-de-vie de vin qui all&#232;guent du Point Vert afin de ne pas p&#233;naliser les entreprises qui exportent.</p><p>Tel est l&#8217;objet du pr&#233;sent amendement.</p>",
    "cartoucheDelaiDepotDepasse": "Sous réserve de son traitement par les services de l'Assemblée nationale et de sa recevabilité"
  },
  "representations": [
    {
      "nom": "PDF",
      "typeMime": {
        "type": "application",
        "subType": "PDF"
      },
      "statutRepresentation": {
        "verbatim": true,
        "canonique": true,
        "officielle": true,
        "transcription": false,
        "enregistrement": false
      },
      "contenu": {
        "documentURI": "/15/amendements/2274/CION-DVP/CD1299.pdf"
      }
    }
  ],
  "dateDepot": "2019-11-20T01:00:00.000+01:00",
  "article99": "0",
  "loiReference": {}
}