{
  "uid": "AMANR5L15PO419610B0627P0D1N359",
  "identifiant": {
    "legislature": "15",
    "numero": "359",
    "numRect": "0",
    "saisine": {
      "texteLegislatifRef": "PRJLANR5L15B0627",
      "numeroPartiePLF": "0",
      "organeExamen": "PO419610",
      "mentionSecondeDeliberation": "0"
    }
  },
  "numeroLong": "CE359",
  "etapeTexte": "1ère lecture (1ère assemblée saisie)",
  "triAmendement": "aazrzr",
  "cardinaliteAmdtMultiples": "1",
  "etat": "Discuté",
  "signataires": {
    "auteur": {
      "typeAuteur": "Depute",
      "acteurRef": "PA2792",
      "groupePolitiqueRef": "PO730934"
    },
    "cosignatairesRefs": [
      "PA2792"
    ],
    "texteAffichable": "M.&#160;Taugourdeau"
  },
  "pointeurFragmentTexte": {
    "division": {
      "titre": "Article 14",
      "articleDesignationCourte": "APRÈS ART. 14",
      "type": "ARTICLE",
      "avantAApres": "Apres",
      "divisionRattachee": "APRÈS L'ARTICLE 14, insérer l'article suivant:",
      "articleAdditionnel": "1",
      "urlDivisionTexteVise": "/15/textes/0627.asp#D_Article_14"
    }
  },
  "corps": {
    "dispositif": "<p style=\"text-align: justify;\">Une exp&#233;rimentation de l&#8217;utilisation des a&#233;ronefs t&#233;l&#233;pilot&#233;s pour la pulv&#233;risation a&#233;rienne de produits phytopharmaceutiques sera men&#233;e sur des surfaces agricoles plant&#233;es en vigne et pr&#233;sentant une pente , pour une p&#233;riode maximale de trois ans, en d&#233;rogation aux dispositions du premier alin&#233;a de l&#8217;article L.&#160;253&#8209;8 du code rural et de la p&#234;che maritime. Ces exp&#233;rimentations, qui feront l&#8217;objet d&#8217;une &#233;valuation par l&#8217;Agence nationale de s&#233;curit&#233; sanitaire de l&#8217;alimentation, de l&#8217;environnement et du travail, viseront &#224; d&#233;terminer les b&#233;n&#233;fices li&#233;s &#224; l&#8217;utilisation de drones pour l&#8217;application de produits phytopharmaceutiques en mati&#232;re de r&#233;duction des risques pour la sant&#233; et l&#8217;environnement.</p><p style=\"text-align: justify;\">&#160;</p>",
    "exposeSommaire": "<p style=\"text-align: justify;\">La directive 2009/128/CE d&#233;finit &#224; son article&#160;3 paragraphes 5 la pulv&#233;risation a&#233;rienne comme toute application de p<span class=\"ins cts-1\"  data-cid=\"5\" data-userid=\"86\" data-username=\"Jean-Charles Taugourdeau\" data-time=\"1523626922290\">roduits phytosanitaires </span><span class=\"del cts-1\"  data-cid=\"4\" data-userid=\"86\" data-username=\"Jean-Charles Taugourdeau\" data-time=\"1523626922283\">esticides</span> par a&#233;ronef, en visant explicitement l&#8217;avion et l&#8217;h&#233;licopt&#232;re.</p><p style=\"text-align: justify;\">L&#8217;article L.&#160;253&#8209;8 du code rural et de la p&#234;che maritime interdit la pulv&#233;risation a&#233;rienne. Cette mesure est li&#233;e &#224; la probl&#233;matique de la d&#233;rive associ&#233;e &#224; l&#8217;&#233;pandage par h&#233;licopt&#232;re ou avion, impliquant des risques pour la sant&#233; et pour l&#8217;environnement. Cette interdiction concerne tous les a&#233;ronefs d&#233;finis par l&#8217;article L6100&#8209;1 du code des transports, comme tout objet capable de s&#8217;&#233;lever ou de circuler dans les airs, interdisant donc la pulv&#233;risation a&#233;rienne par drone.</p><p style=\"text-align: justify;\">L&#8217;interdiction de la pulv&#233;risation a&#233;rienne est probl&#233;matique dans certains territoires (vignobles en forte pente, bananeraies, rizi&#232;res, parcelles agricoles peu accessibles, etc.), au regard notamment du risque &#233;lev&#233; pour les op&#233;rateurs en cas de traitement par voie terrestre. Il y a d&#8217;une part un risque physique d&#8217;accident li&#233; &#224; la pente, avec d&#8217;ailleurs plusieurs accidents, dont deux mortels, recens&#233;s en viticulture (retournement de chenillard). Il y a d&#8217;autre part un risque chimique, li&#233; &#224; l&#8217;exposition aux produits. Enfin, les traitements terrestres peuvent &#234;tre rendus impossibles en raison d&#8217;une portance des sols insuffisante (sols inond&#233;s ou satur&#233;s d&#8217;eau des rizi&#232;res).</p><p style=\"text-align: justify;\">Les avantages de l&#8217;utilisation des a&#233;ronefs t&#233;l&#233;pilot&#233;s en &#233;pandage sont a priori nombreux&#160;: exposition de l&#8217;applicateur tr&#232;s limit&#233;e, r&#233;duction de la d&#233;rive gr&#226;ce &#224; des jets plaqu&#233;s au sol, abaissement de la dose de produit utilis&#233;e (jusqu&#8217;&#224; quatre fois moindre par rapport &#224; une application au sol), vols pr&#233;cis et &#224; faible hauteur (environ 1,5 m), possibilit&#233; de traiter des parcelles petites et/ou accident&#233;es, facilit&#233; d&#8217;emploi, bruit tr&#232;s r&#233;duit, avanc&#233;es technologiques importantes (sur l&#8217;autonomie notamment).</p><p style=\"text-align: justify;\">Il appara&#238;t ainsi n&#233;cessaire d&#8217;introduire la possibilit&#233; d&#8217;une exp&#233;rimentation de l&#8217;utilisation des a&#233;ronefs t&#233;l&#233;pilot&#233;s en pulv&#233;risation, afin d&#8217;&#233;tablir si ce mode d&#8217;application pourrait apporter les b&#233;n&#233;fices attendus dans les conditions requises de s&#233;curit&#233; pour la sant&#233; et l&#8217;environnement.</p>"
  },
  "representations": [
    {
      "nom": "PDF",
      "typeMime": {
        "type": "application",
        "subType": "PDF"
      },
      "statutRepresentation": {
        "verbatim": true,
        "canonique": true,
        "officielle": true,
        "transcription": false,
        "enregistrement": false
      },
      "contenu": {
        "documentURI": "/15/amendements/0627/CION-ECO/CE359.pdf"
      }
    }
  ],
  "sort": {
    "dateSaisie": "2018-04-20T12:28:09.000+02:00",
    "sortEnSeance": "Non soutenu"
  },
  "dateDepot": "2018-04-05T02:00:00.000+02:00",
  "dateDistribution": "2018-04-17T02:00:00.000+02:00",
  "article99": "0",
  "loiReference": {
    "codeLoi": "zexpérimentation"
  }
}