{
  "uid": "AMANR5L15SEA717460B1490P0D1N901",
  "identifiant": {
    "legislature": "15",
    "numero": "901",
    "numRect": "0",
    "saisine": {
      "texteLegislatifRef": "PRJLANR5L15B1490",
      "numeroPartiePLF": "0",
      "organeExamen": "PO717460",
      "mentionSecondeDeliberation": "0"
    }
  },
  "numeroLong": "901",
  "etapeTexte": "Nouvelle Lecture",
  "triAmendement": "easaaaaaaaaaaaaaaaaaaaaaaaaaaaaaaaaaaaaaaaaaaaaaaai",
  "cardinaliteAmdtMultiples": "1",
  "etat": "Retiré",
  "signataires": {
    "auteur": {
      "typeAuteur": "Rapporteur",
      "acteurRef": "PA267336",
      "organeRef": "PO59048",
      "groupePolitiqueRef": "PO730964"
    },
    "cosignatairesRefs": [
      "PA267336"
    ],
    "texteAffichable": "M.&#160;Giraud, rapporteur g&#233;n&#233;ral au nom de la commission des finances"
  },
  "pointeurFragmentTexte": {
    "division": {
      "titre": "Article 39",
      "articleDesignationCourte": "ART. 39",
      "type": "ARTICLE",
      "avantAApres": "A",
      "divisionRattachee": "ARTICLE 39",
      "urlDivisionTexteVise": "/15/textes/1490.asp#D_Article_39"
    },
    "alinea": {
      "numero": "1"
    }
  },
  "corps": {
    "dispositif": "<p style=\"text-align: justify;\">Substituer au montant&#160;:</p><p style=\"text-align: justify;\">&#171;&#160;422 434&#160;567&#160;591&#160;&#8364;&#160;&#187;</p><p style=\"text-align: justify;\">le montant&#160;:</p><p style=\"text-align: justify;\">&#171;&#160;479&#160;071&#160;319&#160;384&#160;&#8364;&#160;&#187;</p><p style=\"text-align: justify;\">et au montant&#160;:</p><p style=\"text-align: justify;\">&#171;&#160;409 220&#160;613&#160;722&#160;&#8364;&#160;&#187;</p><p style=\"text-align: justify;\">le montant&#160;:</p><p style=\"text-align: justify;\">&#171;&#160;464&#160;548&#160;889&#160;903&#160;&#8364;&#160;&#187;.</p>",
    "exposeSommaire": "<p style=\"text-align: justify;\">Le pr&#233;sent amendement vise &#224; r&#233;tablir le texte adopt&#233; par l&#8217;Assembl&#233;e nationale en premi&#232;re lecture.</p><p style=\"text-align: justify;\">N&#233;anmoins, l&#8217;amendement revient sur les ouvertures de 115&#160;millions d&#8217;euros en AE et 100&#160;millions d&#8217;euros en CP sur la mission <i>&#201;cologie, d&#233;veloppement et mobilit&#233;s durables</i>, adopt&#233;es en seconde d&#233;lib&#233;ration &#224; l&#8217;Assembl&#233;e nationale, afin de compenser la hausse de fiscalit&#233; sur le carburant. Celles-ci n&#8217;ont en effet plus lieu d&#8217;&#234;tre, compte tenu de l&#8217;annulation de la hausse de la fiscalit&#233; sur le carburant en 2019.</p><p style=\"text-align: justify;\">Au-del&#224; des amendements pr&#233;sent&#233;s par le Gouvernement et adopt&#233;s par le S&#233;nat, le Rapporteur g&#233;n&#233;ral propose &#233;galement de retenir les amendements adopt&#233;s par le S&#233;nat relatifs aux suppl&#233;tifs de statut civil de droit commun sur la mission <i>Anciens combattants, m&#233;moire et liens avec la Nation</i> et &#224; l&#8217;indemnisation des propri&#233;taires de biens immeubles rendus inhabitables par l&#8217;&#233;rosion c&#244;ti&#232;re sur la mission <i>&#201;cologie, d&#233;veloppement et mobilit&#233;s durables</i>.</p>"
  },
  "representations": [
    {
      "nom": "PDF",
      "typeMime": {
        "type": "application",
        "subType": "PDF"
      },
      "statutRepresentation": {
        "verbatim": true,
        "canonique": true,
        "officielle": true,
        "transcription": false,
        "enregistrement": false
      },
      "contenu": {
        "documentURI": "/15/amendements/1490/AN/901.pdf"
      }
    }
  ],
  "dateDepot": "2018-12-14T01:00:00.000+01:00",
  "dateDistribution": "2018-12-15T01:00:00.000+01:00",
  "article99": "0",
  "loiReference": {}
}