{
  "uid": "AMANR5L15PO420120B1297P0D1N287",
  "identifiant": {
    "legislature": "15",
    "numero": "287",
    "numRect": "0",
    "saisine": {
      "texteLegislatifRef": "PRJLANR5L15B1297",
      "numeroPartiePLF": "0",
      "organeExamen": "PO420120",
      "mentionSecondeDeliberation": "0"
    }
  },
  "numeroLong": "AS287",
  "etapeTexte": "1ère lecture (1ère assemblée saisie)",
  "triAmendement": "btaaaaaaaaaaaaaaaaaaaaaaaaaaaaaaaaaaaaaaaaaaaaaaaaar",
  "cardinaliteAmdtMultiples": "1",
  "etat": "Irrecevable",
  "signataires": {
    "auteur": {
      "typeAuteur": "Depute",
      "acteurRef": "PA267289",
      "groupePolitiqueRef": "PO730934"
    },
    "cosignatairesRefs": [
      "PA721070",
      "PA643134",
      "PA267289",
      "PA2377",
      "PA606712",
      "PA721126",
      "PA713448",
      "PA721474",
      "PA722390",
      "PA856"
    ],
    "texteAffichable": "M.&#160;Door,  Mme&#160;Brenier, M.&#160;Cherpion, Mme&#160;Corneloup, Mme&#160;Guion-Firmin, M.&#160;Lurton, M.&#160;Perrut, Mme&#160;Ramassamy, Mme&#160;Valentin et M.&#160;Viry"
  },
  "pointeurFragmentTexte": {
    "division": {
      "titre": "Article 16",
      "articleDesignationCourte": "APRÈS ART. 16",
      "type": "ARTICLE",
      "avantAApres": "Apres",
      "divisionRattachee": "APRÈS L'ARTICLE 16, insérer l'article suivant:",
      "articleAdditionnel": "1",
      "urlDivisionTexteVise": "/15/textes/1297.asp#D_Article_16"
    }
  },
  "corps": {
    "dispositif": "<p style=\"text-align: justify;\">Apr&#232;s l&#8217;article L.&#160;161&#8209;22&#8209;1 A du code de la s&#233;curit&#233; sociale, il est ins&#233;r&#233; un article L.&#160;161&#8209;22&#8209;1&#160;B ainsi r&#233;dig&#233;&#160;:</p><p style=\"text-align: justify;\">&#171;&#160;<i>Art.&#160;L.&#160;161&#8209;22&#8209;1&#160;B</i>.&#160;&#8211;&#160;L&#8217;article L.&#160;161&#8209;22 ne fait pas obstacle &#224; l&#8217;exercice par un m&#233;decin retrait&#233; d&#8217;une activit&#233; de remplacement dans une zone d&#233;finie sous-dense par l&#8217;agence r&#233;gionale de sant&#233; pour une dur&#233;e cumul&#233;e n&#8217;exc&#233;dant pas vingt-quatre mois. Les revenus per&#231;us par le m&#233;decin retrait&#233; au titre de son activit&#233; de remplacement sont exon&#233;r&#233;s de la totalit&#233; des cotisations sociales et de retraite d&#232;s lors qu&#8217;ils n&#8217;exc&#232;dent pas 90 000&#160;euros annuels.&#160;&#187;</p>",
    "exposeSommaire": "<p>Avec 20% de la population fran&#231;aise qui vit dans un d&#233;sert m&#233;dical, le diagnostic des difficult&#233;s de la d&#233;mographie m&#233;dicale est connu de tous, et l&#8217;attractivit&#233; de la m&#233;decine lib&#233;rale est en berne. Or, la sant&#233; de nos concitoyens ne saurait &#234;tre brad&#233;e pour des raisons comptables.</p><p>C&#8217;est pourquoi cet amendement octroie une exon&#233;ration fiscale aux m&#233;decins retrait&#233;s en doublant quasiment le plafond actuel. Cette exon&#233;ration est limit&#233;e &#224; une p&#233;riode cumul&#233;e de 24 mois. Il s&#8217;agit d&#8217;une mesure de bon sens, au co&#251;t limit&#233;, qui ne r&#233;soudra certes pas le probl&#232;me des d&#233;serts m&#233;dicaux mais permettra d&#8217;apporter une premi&#232;re r&#233;ponse d&#8217;urgence &#224; la d&#233;tresse qui frappe nos territoires.</p><p>Ce dispositif instaure une forme de compagnonnage entre un m&#233;decin &#224; la retraite et un jeune m&#233;decin, install&#233; ou &#224; la recherche d&#8217;une installation en exercice lib&#233;ral, afin de r&#233;pondre &#224; un double objectif, fond&#233; autour de la transmission du savoir entre un professionnel exp&#233;riment&#233; et un jeune professionnel et sur l&#8217;int&#233;r&#234;t pour les patients d&#8217;avoir une prise en charge continue et suivie entre le m&#233;decin et son successeur.</p><p>1.&#160;&#160;&#160;&#160;&#160; D&#8217;une part cela permettra de donner au jeune m&#233;decin la certitude d&#8217;&#234;tre remplac&#233; lors de ses cong&#233;s ou de ses absences par ce m&#233;decin retrait&#233;.</p><p>2.&#160;&#160;&#160;&#160;&#160; D&#8217;autre part, c&#8217;est la garantie d&#8217;un accompagnement du jeune m&#233;decin tant pour l&#8217;exercice m&#233;dical que pour la gestion de son cabinet, les &#233;tudiants regrettant ne pas avoir de cours de management et de gestion au cours de leurs &#233;tudes.</p>"
  },
  "representations": [
    {
      "nom": "PDF",
      "typeMime": {
        "type": "application",
        "subType": "PDF"
      },
      "statutRepresentation": {
        "verbatim": true,
        "canonique": true,
        "officielle": true,
        "transcription": false,
        "enregistrement": false
      },
      "contenu": {
        "documentURI": "/15/amendements/1297/CION-SOC/AS287.pdf"
      }
    }
  ],
  "dateDepot": "2018-10-12T02:00:00.000+02:00",
  "article99": "0",
  "loiReference": {
    "codeLoi": "sécurité sociale",
    "divisionCodeLoi": "L161-22-1A"
  }
}