{
  "uid": "AMANR5L15PO766718B2187P0D1N1338",
  "identifiant": {
    "legislature": "15",
    "numero": "1338",
    "numRect": "0",
    "saisine": {
      "texteLegislatifRef": "PRJLANR5L15B2187",
      "numeroPartiePLF": "0",
      "organeExamen": "PO766718",
      "mentionSecondeDeliberation": "0"
    }
  },
  "numeroLong": "1338",
  "etapeTexte": "1ère lecture (1ère assemblée saisie)",
  "triAmendement": "lcaaaaaaaaaaaaaaaaaaaaaaaaaaaaaaaaaaaaaaaaaaaaaaaam",
  "cardinaliteAmdtMultiples": "1",
  "etat": "Discuté",
  "signataires": {
    "auteur": {
      "typeAuteur": "Depute",
      "acteurRef": "PA719608",
      "groupePolitiqueRef": "PO723569"
    },
    "cosignatairesRefs": [
      "PA719608"
    ],
    "texteAffichable": "Mme&#160;M&#233;nard"
  },
  "pointeurFragmentTexte": {
    "division": {
      "titre": "Article 29",
      "articleDesignationCourte": "ART. 29",
      "type": "ARTICLE",
      "avantAApres": "A",
      "divisionRattachee": "ARTICLE 29",
      "urlDivisionTexteVise": "/15/textes/2187.asp#D_Article_29"
    },
    "alinea": {
      "numero": "15"
    }
  },
  "corps": {
    "dispositif": "<p style=\"text-align: justify;\">I.&#160;&#8211;&#160;&#192; la fin de l&#8217;alin&#233;a&#160;15, supprimer les mots&#160;:</p><p style=\"text-align: justify;\">&#171;&#160;renouvelable une fois&#160;&#187;.</p><p style=\"text-align: justify;\">II.&#160;&#8211;&#160;En cons&#233;quence, &#224; l&#8217;alin&#233;a&#160;19, supprimer les mots&#160;:</p><p style=\"text-align: justify;\">&#171;&#160;par moiti&#233; de l&#8217;instance&#160;&#187;.</p>",
    "exposeSommaire": "<p style=\"text-align: justify;\">Le pr&#233;sident et les membres du comit&#233; consultatif national d&#8217;&#233;thique pour les sciences de la vie et de la sant&#233;&#160;sont choisis pour leur capacit&#233; &#224; &#233;clairer la France en bio&#233;thique. Il n&#8217;y a pas de raison qu&#8217;ils ne puissent exercer leur mission que six ans maximum. Il faut privil&#233;gier la continuit&#233; &#224; la rupture.</p>"
  },
  "representations": [
    {
      "nom": "PDF",
      "typeMime": {
        "type": "application",
        "subType": "PDF"
      },
      "statutRepresentation": {
        "verbatim": true,
        "canonique": true,
        "officielle": true,
        "transcription": false,
        "enregistrement": false
      },
      "contenu": {
        "documentURI": "/15/amendements/2187/CSBIOETH/1338.pdf"
      }
    }
  ],
  "sort": {
    "dateSaisie": "2019-09-14T01:19:10.000+02:00",
    "sortEnSeance": "Non soutenu"
  },
  "dateDepot": "2019-09-05T02:00:00.000+02:00",
  "dateDistribution": "2019-09-10T02:00:00.000+02:00",
  "article99": "0",
  "loiReference": {}
}