{
  "uid": "AMANR5L15SEA717460BTC1212P0D1N166",
  "identifiant": {
    "legislature": "15",
    "numero": "166",
    "numRect": "0",
    "saisine": {
      "texteLegislatifRef": "PRJLANR5L15BTC1212",
      "numeroPartiePLF": "0",
      "organeExamen": "PO717460",
      "mentionSecondeDeliberation": "0"
    }
  },
  "numeroLong": "166",
  "etapeTexte": "1ère lecture (2ème assemblée saisie)",
  "triAmendement": "raaaaaaaaaaaaaaaaaaaaaaaaaaaaaaaaaaaaaaaaaaaaaaaaaawn",
  "cardinaliteAmdtMultiples": "1",
  "etat": "Discuté",
  "signataires": {
    "auteur": {
      "typeAuteur": "Depute",
      "acteurRef": "PA718720",
      "groupePolitiqueRef": "PO730940"
    },
    "cosignatairesRefs": [
      "PA689",
      "PA720546",
      "PA721270",
      "PA721012",
      "PA335612",
      "PA718720",
      "PA722110",
      "PA441",
      "PA267306",
      "PA720692",
      "PA721896",
      "PA718926",
      "PA610654",
      "PA722202",
      "PA610667",
      "PA721118"
    ],
    "texteAffichable": "M.&#160;Dufr&#232;gne,  M.&#160;Fabien&#160;Roussel, Mme&#160;Bello, M.&#160;Brotherson, M.&#160;Bruneel, Mme&#160;Buffet, M.&#160;Chassaigne, M.&#160;Dharr&#233;ville, Mme&#160;Faucillon, M.&#160;Jumel, Mme&#160;K&#233;clard-Mond&#233;sir, M.&#160;Lecoq, M.&#160;Nilor, M.&#160;Peu, M.&#160;Serville et M.&#160;Wulfranc"
  },
  "pointeurFragmentTexte": {
    "division": {
      "titre": "Article 13",
      "articleDesignationCourte": "ART. 13",
      "type": "ARTICLE",
      "avantAApres": "A",
      "divisionRattachee": "ARTICLE 13",
      "urlDivisionTexteVise": "/15/textes/1212.asp#D_Article_13"
    },
    "alinea": {
      "numero": "5"
    }
  },
  "corps": {
    "dispositif": "<p style=\"text-align: justify;\">&#192; la fin de l&#8217;alin&#233;a&#160;5, substituer au montant&#160;:</p><p style=\"text-align: justify;\">&#171;&#160;100 000&#160;&#8364;&#160;&#187;</p><p style=\"text-align: justify;\">le montant&#160;:</p><p style=\"text-align: justify;\">&#171;&#160;80 000&#160;&#8364;&#160;&#187;.</p>",
    "exposeSommaire": "<p style=\"text-align: justify;\">L&#8217;examen du projet de loi &#171;&#160;lutte contre la fraude&#160;&#187; en commission des finances a permis d&#8217;int&#233;grer une partie des pr&#233;conisations de la mission d&#8217;information sur les proc&#233;dures de poursuites des infractions fiscales, pr&#233;sid&#233;e par M. Eric Diard et, ayant pour rapporteure, Mme Emilie Cariou, au sujet du &#171;&#160;verrou de Bercy&#160;&#187;.</p><p style=\"text-align: justify;\">En l&#8217;&#233;tat, toutefois, l&#8217;automaticit&#233; de la transmission du dossier de fraude par l&#8217;administration au procureur n&#8217;est garantie que lorsque le dossier remplit une double condition&#160;: il doit se voir appliquer des majorations importantes (100&#160;%, 80&#160;% et 40&#160;% dans certains cas) et les droits concern&#233;s doivent &#234;tre sup&#233;rieurs &#224; 100 000&#160;euros.</p><p style=\"text-align: justify;\">Cette double condition semble particuli&#232;rement restrictive et n&#8217;appara&#238;t pas pleinement ad&#233;quate pour garantir la transmission au procureur de l&#8217;ensemble des dossiers de fraude d&#8217;une certaine gravit&#233;.</p><p style=\"text-align: justify;\">En cons&#233;quence, les auteurs de l&#8217;amendement propose de fixer le seuil &#224; 80 000&#160;euros.</p>"
  },
  "representations": [
    {
      "nom": "PDF",
      "typeMime": {
        "type": "application",
        "subType": "PDF"
      },
      "statutRepresentation": {
        "verbatim": true,
        "canonique": true,
        "officielle": true,
        "transcription": false,
        "enregistrement": false
      },
      "contenu": {
        "documentURI": "/15/amendements/1212/AN/166.pdf"
      }
    }
  ],
  "seanceDiscussion": "RUANR5L15S2018IDS21242",
  "sort": {
    "dateSaisie": "2018-09-19T17:25:13.000+02:00",
    "sortEnSeance": "Rejeté"
  },
  "dateDepot": "2018-09-13T02:00:00.000+02:00",
  "dateDistribution": "2018-09-17T02:00:00.000+02:00",
  "article99": "0",
  "loiReference": {}
}