{
  "uid": "AMANR5L15SEA717460BTC1173P0D1N238",
  "identifiant": {
    "legislature": "15",
    "numero": "238",
    "numRect": "0",
    "saisine": {
      "texteLegislatifRef": "PRJLANR5L15BTC1173",
      "numeroPartiePLF": "0",
      "organeExamen": "PO717460",
      "mentionSecondeDeliberation": "0"
    }
  },
  "numeroLong": "238",
  "etapeTexte": "Nouvelle Lecture",
  "triAmendement": "i",
  "cardinaliteAmdtMultiples": "1",
  "etat": "Discuté",
  "signataires": {
    "auteur": {
      "typeAuteur": "Depute",
      "acteurRef": "PA721896",
      "groupePolitiqueRef": "PO730940"
    },
    "cosignatairesRefs": [
      "PA720692",
      "PA267306",
      "PA689",
      "PA720546",
      "PA722110",
      "PA718926",
      "PA335612",
      "PA722202",
      "PA721896",
      "PA721270",
      "PA718720"
    ],
    "texteAffichable": "Mme&#160;Faucillon,  M.&#160;Peu, M.&#160;Bruneel, Mme&#160;Buffet, M.&#160;Chassaigne, M.&#160;Jumel, M.&#160;Dharr&#233;ville, M.&#160;Dufr&#232;gne, M.&#160;Lecoq, M.&#160;Fabien&#160;Roussel et M.&#160;Wulfranc"
  },
  "pointeurFragmentTexte": {
    "division": {
      "titre": "Article 33",
      "articleDesignationCourte": "ART. 33",
      "type": "ARTICLE",
      "avantAApres": "A",
      "divisionRattachee": "ARTICLE 33",
      "urlDivisionTexteVise": "/15/textes/1173.asp#D_Article_33"
    },
    "alinea": {
      "numero": "3"
    }
  },
  "corps": {
    "dispositif": "<p style=\"text-align: justify;\">Substituer &#224; l&#8217;alin&#233;a&#160;3 les cinq alin&#233;as suivants&#160;:</p><p style=\"text-align: justify;\">&#171;&#160;2&#176;&#160;L&#8217;article L.&#160;431&#8209;2 est ainsi r&#233;dig&#233;&#160;:</p><p style=\"text-align: justify;\">&#171;&#160;<i>Art.&#160;L.&#160;431&#8209;2.&#160;&#8211;&#160;</i>En cas de dissolution du mariage ne r&#233;sultant pas du d&#233;c&#232;s de l&#8217;un des conjoints, le titre de s&#233;jour qui a &#233;t&#233; remis au conjoint d&#8217;un &#233;tranger peut faire l&#8217;objet d&#8217;un refus de renouvellement sauf si le divorce est prononc&#233; aux torts du conjoint du titulaire de la carte ou que la dissolution du mariage r&#233;sulte d&#8217;une r&#233;pudiation prononc&#233;e en violation de l&#8217;ordre public fran&#231;ais.</p><p style=\"text-align: justify;\">&#171;&#160;Lorsque la dissolution du mariage est ant&#233;rieure &#224; la demande de titre, l&#8217;autorit&#233; administrative peut refuser de l&#8217;accorder sauf si le divorce est prononc&#233; aux torts du conjoint du titulaire de la carte ou que la dissolution du mariage r&#233;sulte d&#8217;une r&#233;pudiation prononc&#233;e en violation de l&#8217;ordre public fran&#231;ais.</p><p style=\"text-align: justify;\">&#171;&#160;Par d&#233;rogation aux deux premiers alin&#233;as, lorsque l&#8217;&#233;tranger subit ou a subi des violences conjugales ou familiales, l&#8217;autorit&#233; administrative accorde le renouvellement de la carte de s&#233;jour. En cas de violences commises apr&#232;s l&#8217;arriv&#233;e en France du conjoint mais avant la premi&#232;re d&#233;livrance de la carte de s&#233;jour temporaire ou la validation par l&#8217;organisme comp&#233;tent du visa valant titre de s&#233;jour, le conjoint se voit d&#233;livrer, sauf si sa pr&#233;sence constitue une menace pour l&#8217;ordre public, une carte de s&#233;jour portant la mention &#171;&#160;vie priv&#233;e et familiale&#160;&#187;.</p><p style=\"text-align: justify;\">&#171;&#160;Si un ou plusieurs enfants sont n&#233;s de cette union, le repr&#233;sentant de l'&#201;tat dans le d&#233;partement accorde le renouvellement de la carte de s&#233;jour.&#160;&#187;</p>",
    "exposeSommaire": "<p style=\"text-align: justify;\">Cet amendement propose de mettre fin &#224; la possibilit&#233; de retirer un titre de s&#233;jour en cas de rupture de la vie commune. Seul le non-renouvellement pourra &#234;tre d&#233;cid&#233; et ce ne sera pas le cas lorsque le<br />divorce sera prononc&#233; aux torts du conjoint du titulaire du titre ou en cas de r&#233;pudiation.</p><p style=\"text-align: justify;\">Les cosignataires proposent d&#8217;&#233;tendre &#233;galement les cas de violences aux violences familiales afin de renforcer la protection aux femmes &#233;trang&#232;res. Dans ces situations, les titres de s&#233;jour seraient<br />renouvel&#233;s automatiquement.</p><p style=\"text-align: justify;\">L&#8217;objet de cet amendement est de favoriser l&#8217;autonomie et l&#8217;ind&#233;pendance des femmes &#233;trang&#232;res.</p>"
  },
  "representations": [
    {
      "nom": "PDF",
      "typeMime": {
        "type": "application",
        "subType": "PDF"
      },
      "statutRepresentation": {
        "verbatim": true,
        "canonique": true,
        "officielle": true,
        "transcription": false,
        "enregistrement": false
      },
      "contenu": {
        "documentURI": "/15/amendements/1173/AN/238.pdf"
      }
    }
  ],
  "seanceDiscussion": "RUANR5L15S2018IDS21205",
  "sort": {
    "dateSaisie": "2018-07-27T00:34:15.000+02:00",
    "sortEnSeance": "Rejeté"
  },
  "dateDepot": "2018-07-20T02:00:00.000+02:00",
  "dateDistribution": "2018-07-24T02:00:00.000+02:00",
  "article99": "0",
  "loiReference": {}
}