{
  "uid": "AMANR5L15PO59048B1490P0D1N558",
  "identifiant": {
    "legislature": "15",
    "numero": "558",
    "numRect": "0",
    "saisine": {
      "texteLegislatifRef": "PRJLANR5L15B1490",
      "numeroPartiePLF": "0",
      "organeExamen": "PO59048",
      "mentionSecondeDeliberation": "0"
    }
  },
  "numeroLong": "CF558",
  "etapeTexte": "Nouvelle Lecture",
  "triAmendement": "aioaaaaaaaaaaaaaaaaaaaaaaaaaaaaaaaaaaaaaaaaaaaaaaaiu",
  "cardinaliteAmdtMultiples": "1",
  "etat": "Discuté",
  "signataires": {
    "auteur": {
      "typeAuteur": "Depute",
      "acteurRef": "PA643145",
      "groupePolitiqueRef": "PO758835"
    },
    "cosignatairesRefs": [
      "PA1198",
      "PA508",
      "PA429893",
      "PA608741",
      "PA643145",
      "PA609332",
      "PA642764",
      "PA342415",
      "PA1008",
      "PA340343",
      "PA332614",
      "PA608172",
      "PA610681",
      "PA333285",
      "PA335054",
      "PA267233",
      "PA609590",
      "PA720988",
      "PA608011",
      "PA608695",
      "PA607553",
      "PA340357",
      "PA337483",
      "PA605069",
      "PA1592",
      "PA333818",
      "PA1809",
      "PA719930",
      "PA335532"
    ],
    "texteAffichable": "Mme&#160;Vainqueur-Christophe,  Mme&#160;Bareigts, M.&#160;Letchimy, Mme&#160;Manin, Mme&#160;Rabault, M.&#160;Jean-Louis&#160;Bricout, Mme&#160;Pires Beaune, M.&#160;Aviragnet, Mme&#160;Battistel, Mme&#160;Bi&#233;mouret, M.&#160;Bouillon, M.&#160;Carvounas, M.&#160;Alain&#160;David, Mme&#160;Laurence&#160;Dumont, M.&#160;Faure, M.&#160;Garot, M.&#160;David&#160;Habib, M.&#160;Hutin, M.&#160;Juanico, Mme&#160;Karamanli, M.&#160;J&#233;r&#244;me&#160;Lambert, Mme&#160;Pau-Langevin, M.&#160;Potier, M.&#160;Pueyo, M.&#160;Saulignac, Mme&#160;Tolmont, Mme&#160;Untermaier, M.&#160;Vallaud et Mme&#160;Victory"
  },
  "pointeurFragmentTexte": {
    "division": {
      "titre": "Article 4",
      "articleDesignationCourte": "ART. 4",
      "type": "ARTICLE",
      "avantAApres": "A",
      "divisionRattachee": "ARTICLE 4",
      "urlDivisionTexteVise": "/15/textes/1490.asp#D_Article_4"
    }
  },
  "corps": {
    "dispositif": "<p>Supprimer cet article.</p>",
    "exposeSommaire": "<p>Cet amendement port&#233; par le groupe Socialistes et apparent&#233;s supprime la baisse du plafonnement de la r&#233;duction d&#8217;imp&#244;t sur le revenu dans les d&#233;partements et r&#233;gions d&#8217;outre-mer (DROM)</p><p>Le gouvernement,&#160;par cet article et l&#8217;article&#160;5, proc&#232;de &#224; des mesures d&#8217;&#233;conomies afin de financer une partie des nouveaux dispositifs &#233;conomiques pr&#233;vues dans les DROM. Aucune &#233;tude d&#8217;impact s&#233;rieuse n&#8217;ayant &#233;t&#233; fournie &#224; ce jour, il ne para&#238;t pas pertinent de supprimer des dispositifs b&#233;n&#233;ficiant aux habitants et aux entreprises ultramarins pour financer des rattrapages d&#8217;infrastructures et de conditions de vie dans ces territoires. Ce plan de rattrapage devrait &#234;tre financ&#233; par la solidarit&#233; nationale.</p><p>D&#8217;apr&#232;s l&#8217;&#233;tude d&#8217;impact transmise par le Gouvernement, on apprend que&#160;:</p><ul><li>50&#160;000 foyers fiscaux subiront une hausse d&#8217;imp&#244;t d&#8217;en moyenne 1 534 euros. Ceci repr&#233;sente une recette suppl&#233;mentaire pour l&#8217;&#201;tat de 76,7 millions &#8364; (= 50000* 1534&#8364;) ;</li><li>287&#160;000 foyers fiscaux ne seraient pas impact&#233;s par la modification pr&#233;vue &#224; l&#8217;article 4.</li></ul><p>Cette m&#234;me &#233;tude d&#8217;impact fait appara&#238;tre des recettes bien sup&#233;rieures &#224; celles attendues sur la base du montant moyen d&#8217;imp&#244;t &#224; payer et du nombre de foyers fiscaux concern&#233;s. Ainsi, pour 2019, les recettes suppl&#233;mentaire attendues seraient de 23 millions&#160;euros, puis de 117 millions d&#8217;euros en 2020, et enfin de 70 millions d&#8217;euros en 2021.</p><p>En 2017, l&#8217;imp&#244;t sur le revenu a constitu&#233; une recette de 838 millions d&#8217;euros. Cet article&#160;4 repr&#233;sente donc une augmentation de pr&#232;s de 10&#160;% de l&#8217;imp&#244;t sur le revenu dans les DOM (exactement 8,35&#160;%).</p><p>De plus, on peut s&#8217;interroger sur l&#8217;utilisation par le gouvernement du surplus de recettes fiscales obtenu avec cet article. En effet, selon les annexes du PLF 2019, cette somme ne b&#233;n&#233;ficierait qu&#8217;&#224; hauteur de 23 millions d&#8217;euros aux grands plans de convergence que nous appelons de nos v&#339;ux et pr&#233;vus par la loi n&#176; 2017&#8209;256 du 28 f&#233;vrier 2017 de programmation relative &#224; l&#8217;&#233;galit&#233; r&#233;elle outre-mer et portant autres dispositions en mati&#232;re sociale et &#233;conomique. Nous sommes bien loin du milliard d&#8217;euros promis par le candidat Emmanuel Macron dans une interview donn&#233;e le 19 avril 2017 &#224; Actu Nouvelle-Cal&#233;donie &#171;&#160;pour financer sp&#233;cifiquement des plans de rattrapage et de d&#233;veloppement&#160;&#187;.</p><p>Pour l&#8217;ensemble de ces raisons, le groupe Socialistes et apparent&#233;s propose de supprimer cette mesure aujourd&#8217;hui injustifi&#233;e. Il note toutefois que le S&#233;nat a obtenu une premi&#232;re avanc&#233;e, par le biais d'un amendement du s&#233;nateur socialiste Victorin Lurel, qui lisse sur deux ans la mise en &#339;uvre de cet article.</p>"
  },
  "representations": [
    {
      "nom": "PDF",
      "typeMime": {
        "type": "application",
        "subType": "PDF"
      },
      "statutRepresentation": {
        "verbatim": true,
        "canonique": true,
        "officielle": true,
        "transcription": false,
        "enregistrement": false
      },
      "contenu": {
        "documentURI": "/15/amendements/1490/CION_FIN/CF558.pdf"
      }
    }
  ],
  "sort": {
    "dateSaisie": "2018-12-14T10:00:31.000+01:00",
    "sortEnSeance": "Rejeté"
  },
  "dateDepot": "2018-12-13T01:00:00.000+01:00",
  "dateDistribution": "2018-12-14T01:00:00.000+01:00",
  "article99": "0",
  "loiReference": {}
}