{
  "uid": "AMANR5L15PO59051B1503P0D1N481",
  "identifiant": {
    "legislature": "15",
    "numero": "481",
    "numRect": "0",
    "saisine": {
      "texteLegislatifRef": "PRJLANR5L15B1503",
      "numeroPartiePLF": "0",
      "organeExamen": "PO59051",
      "mentionSecondeDeliberation": "0"
    }
  },
  "numeroLong": "CL481",
  "etapeTexte": "Nouvelle Lecture",
  "triAmendement": "kjiaaaaaaaaaaaaaaaaaaaaaaaaaaaaaaaaaaaaaaaaaaaaaaah",
  "cardinaliteAmdtMultiples": "1",
  "etat": "Discuté",
  "signataires": {
    "auteur": {
      "typeAuteur": "Depute",
      "acteurRef": "PA719202",
      "groupePolitiqueRef": "PO730964"
    },
    "cosignatairesRefs": [
      "PA719202"
    ],
    "texteAffichable": "M.&#160;Paris, rapporteur"
  },
  "pointeurFragmentTexte": {
    "division": {
      "titre": "Article 51",
      "articleDesignationCourte": "ART. 51",
      "type": "ARTICLE",
      "avantAApres": "A",
      "divisionRattachee": "ARTICLE 51",
      "urlDivisionTexteVise": "/15/textes/1503.asp#D_Article_51"
    },
    "alinea": {
      "numero": "3"
    }
  },
  "corps": {
    "dispositif": "<p>&#192; l&#8217;alin&#233;a&#160;3, substituer au mot&#160;:</p><p>&#171;&#160;de&#160;&#187;</p><p>le mot&#160;:</p><p>&#171;&#160;&#224;&#160;&#187;.</p>",
    "exposeSommaire": "<p style=\"text-align: justify;\">Amendement r&#233;dactionnel.</p>"
  },
  "representations": [
    {
      "nom": "PDF",
      "typeMime": {
        "type": "application",
        "subType": "PDF"
      },
      "statutRepresentation": {
        "verbatim": true,
        "canonique": true,
        "officielle": true,
        "transcription": false,
        "enregistrement": false
      },
      "contenu": {
        "documentURI": "/15/amendements/1503/CION_LOIS/CL481.pdf"
      }
    }
  ],
  "sort": {
    "dateSaisie": "2018-12-19T22:08:57.000+01:00",
    "sortEnSeance": "Adopté"
  },
  "dateDepot": "2018-12-18T01:00:00.000+01:00",
  "dateDistribution": "2018-12-18T01:00:00.000+01:00",
  "article99": "0",
  "loiReference": {}
}