{
  "uid": "AMANR5L15PO59051B1882P0D1N19",
  "identifiant": {
    "legislature": "15",
    "numero": "19",
    "numRect": "0",
    "saisine": {
      "texteLegislatifRef": "PNREANR5L15B1882",
      "numeroPartiePLF": "0",
      "organeExamen": "PO59051",
      "mentionSecondeDeliberation": "0"
    }
  },
  "numeroLong": "CL19",
  "etapeTexte": "Lecture unique",
  "triAmendement": "niaaaaaaaaaaaaaaaaaaaaaaaaaaaaaaaaaaaaaaaaaaaaaaaae",
  "cardinaliteAmdtMultiples": "1",
  "etat": "Discuté",
  "signataires": {
    "auteur": {
      "typeAuteur": "Depute",
      "acteurRef": "PA268019",
      "groupePolitiqueRef": "PO744425"
    },
    "cosignatairesRefs": [
      "PA267330",
      "PA721110",
      "PA712014",
      "PA722030",
      "PA721632",
      "PA342601",
      "PA642868",
      "PA721094",
      "PA267780",
      "PA695100",
      "PA268019",
      "PA267241",
      "PA267355",
      "PA642935",
      "PA610775",
      "PA267585",
      "PA721194",
      "PA721174",
      "PA331567",
      "PA332228",
      "PA721486",
      "PA267766",
      "PA720696",
      "PA719806",
      "PA266788"
    ],
    "texteAffichable": "M.&#160;Lagarde,  M.&#160;Zumkeller, Mme&#160;Auconie, M.&#160;Becht, M.&#160;Benoit, M.&#160;Bournazel, M.&#160;Guy&#160;Bricout, M.&#160;Brindeau, M.&#160;Christophe, Mme&#160;de La Raudi&#232;re, M.&#160;Demilly, Mme&#160;Descamps, Mme&#160;Fr&#233;d&#233;rique&#160;Dumas, M.&#160;Dunoyer, Mme&#160;Firmin Le Bodo, M.&#160;Gom&#232;s, M.&#160;Meyer&#160;Habib, M.&#160;Herth, M.&#160;Ledoux, Mme&#160;Lemoine, M.&#160;Morel-&#192;-L&apos;Huissier, M.&#160;Naegelen, Mme&#160;Sanquer, M.&#160;Son-Forget et M.&#160;Vercamer"
  },
  "pointeurFragmentTexte": {
    "division": {
      "titre": "Article 32",
      "articleDesignationCourte": "APRÈS ART. 32",
      "type": "ARTICLE",
      "avantAApres": "Apres",
      "divisionRattachee": "APRÈS L'ARTICLE 32, insérer l'article suivant:",
      "articleAdditionnel": "1",
      "urlDivisionTexteVise": "/15/textes/1882.asp#D_Article_32"
    }
  },
  "corps": {
    "dispositif": "<p style=\"text-align: justify;\">Le titre&#160;III du R&#232;glement est ainsi modifi&#233;&#160;:</p><p style=\"text-align: justify;\">1&#176;&#160;&#192; la premi&#232;re phrase du deuxi&#232;me alin&#233;a de l&#8217;article&#160;141, la premi&#232;re occurrence du mot&#160;: &#171;&#160;une&#160;&#187; est remplac&#233;e par le mot&#160;: &#171;&#160;trois&#160;&#187;&#160;;</p><p style=\"text-align: justify;\">2&#176;&#160;&#192; la premi&#232;re phrase du premier alin&#233;a de l&#8217;article&#160;142, le mot&#160;: &#171;&#160;trente&#160;&#187; est remplac&#233; par le mot&#160;: &#171;&#160;quinze&#160;&#187;&#160;;</p><p style=\"text-align: justify;\">3&#176;&#160;&#192; la premi&#232;re phrase du cinqui&#232;me alin&#233;a de l&#8217;article&#160;145, la premi&#232;re occurrence du mot&#160;: &#171;&#160;une&#160;&#187; est remplac&#233; par le mot&#160;: &#171;&#160;trois&#160;&#187;.</p>",
    "exposeSommaire": "<p style=\"text-align: justify;\">La \"fluidification\" des discussions doit s'accompagner d'un r&#233;el renforcement des droits de l'opposition et des pouvoirs d'&#233;valuation et de contr&#244;le.</p><p>Les derni&#232;res r&#233;formes du R&#232;glement et r&#233;visions constitutionnelles ont tent&#233; p&#233;niblement de d&#233;velopper ces pouvoirs. L'un des leviers serait l'augmentation du nombre de commissions d'enqu&#234;te &#224; l'initiative des groupes d'opposition. Les commissions d'enqu&#234;te (qui devraient plut&#244;t s'appeler \"commissions d'&#233;valuation\") sont l'outil le plus pertinent en termes de contr&#244;le, car elles offrent de r&#233;elles possibilit&#233;s au Parlement (pouvoirs d'enqu&#234;te du rapporteur notamment).</p><p>C'est pourquoi le pr&#233;sent amendement augmente le nombre de commissions d'enqu&#234;te (ou de missions d'information) que les groupes minoritaires et d'opposition peuvent demander au titre de leur \"droit de tirage\", en les portant de une &#224; trois par session, et en r&#233;duisant en parall&#232;le le nombre maximal de membres (de 30 &#224; 15).</p>"
  },
  "representations": [
    {
      "nom": "PDF",
      "typeMime": {
        "type": "application",
        "subType": "PDF"
      },
      "statutRepresentation": {
        "verbatim": true,
        "canonique": true,
        "officielle": true,
        "transcription": false,
        "enregistrement": false
      },
      "contenu": {
        "documentURI": "/15/amendements/1882/CION_LOIS/CL19.pdf"
      }
    }
  ],
  "sort": {
    "dateSaisie": "2019-05-22T09:38:33.000+02:00",
    "sortEnSeance": "Non soutenu"
  },
  "dateDepot": "2019-05-07T02:00:00.000+02:00",
  "dateDistribution": "2019-05-15T02:00:00.000+02:00",
  "article99": "0",
  "loiReference": {
    "codeLoi": "141",
    "divisionCodeLoi": "1 dc"
  }
}