{
  "uid": "AMANR5L15SEA717460B1255P1D1N853",
  "identifiant": {
    "legislature": "15",
    "numero": "853",
    "numRect": "0",
    "saisine": {
      "texteLegislatifRef": "PRJLANR5L15B1255",
      "numeroPartiePLF": "1",
      "organeExamen": "PO717460",
      "mentionSecondeDeliberation": "1"
    }
  },
  "numeroLong": "I-853",
  "etapeTexte": "1ère lecture (1ère assemblée saisie)",
  "triAmendement": "kaaaaaaaaaaaaaaaaaaaaaaaaaaaaaaaaaaaaaaaaaaaaaaaaaobvy",
  "cardinaliteAmdtMultiples": "1",
  "etat": "Discuté",
  "signataires": {
    "auteur": {
      "typeAuteur": "Depute",
      "acteurRef": "PA330008",
      "groupePolitiqueRef": "PO730934"
    },
    "cosignatairesRefs": [
      "PA330008"
    ],
    "texteAffichable": "M.&#160;Breton"
  },
  "pointeurFragmentTexte": {
    "division": {
      "titre": "Article 29",
      "articleDesignationCourte": "ART. 29",
      "type": "ARTICLE",
      "avantAApres": "A",
      "divisionRattachee": "ARTICLE 29",
      "urlDivisionTexteVise": "/15/textes/1255A.asp#D_Article_29"
    },
    "alinea": {
      "numero": "68"
    }
  },
  "corps": {
    "dispositif": "<p style=\"text-align: justify;\">&#192; l&#8217;alin&#233;a&#160;68, substituer &#224; l&#8217;ann&#233;e&#160;:</p><p style=\"text-align: justify;\">&#171;&#160;2019&#160;&#187; </p><p style=\"text-align: justify;\">l&#8217;ann&#233;e&#160;:</p><p style=\"text-align: justify;\">&#171;&#160;2020&#160;&#187;.</p>",
    "exposeSommaire": "<p>Les ressources fiscales des CCI ont &#233;t&#233; amput&#233;es de 46% entre 2012 et 2018.</p><p>La nouvelle ponction pr&#233;vue par cet article est insoutenable pour l'&#233;quilibre des CCI</p><p>Il s'agit d'un amendement de repli pour repousser la mesure &#224; 2020.</p>"
  },
  "representations": [
    {
      "nom": "PDF",
      "typeMime": {
        "type": "application",
        "subType": "PDF"
      },
      "statutRepresentation": {
        "verbatim": true,
        "canonique": true,
        "officielle": true,
        "transcription": false,
        "enregistrement": false
      },
      "contenu": {
        "documentURI": "/15/amendements/1255A/AN/853.pdf"
      }
    }
  ],
  "seanceDiscussion": "RUANR5L15S2019IDS21285",
  "sort": {
    "dateSaisie": "2018-10-23T03:15:33.000+02:00",
    "sortEnSeance": "Non soutenu"
  },
  "dateDepot": "2018-10-10T02:00:00.000+02:00",
  "dateDistribution": "2018-10-17T02:00:00.000+02:00",
  "article99": "0",
  "loiReference": {}
}