{
  "uid": "AMANR5L15PO59051B1802P0D1N561",
  "identifiant": {
    "legislature": "15",
    "numero": "561",
    "numRect": "0",
    "saisine": {
      "texteLegislatifRef": "PRJLANR5L15B1802",
      "numeroPartiePLF": "0",
      "organeExamen": "PO59051",
      "mentionSecondeDeliberation": "0"
    }
  },
  "numeroLong": "CL561",
  "etapeTexte": "1ère lecture (1ère assemblée saisie)",
  "triAmendement": "apaaaaaaaaaaaaaaaaaaaaaaaaaaaaaaaaaaaaaaaaaaaaaaaakhy",
  "cardinaliteAmdtMultiples": "1",
  "etat": "Discuté",
  "signataires": {
    "auteur": {
      "typeAuteur": "Depute",
      "acteurRef": "PA342601",
      "groupePolitiqueRef": "PO744425"
    },
    "cosignatairesRefs": [
      "PA342601"
    ],
    "texteAffichable": "M.&#160;Brindeau"
  },
  "pointeurFragmentTexte": {
    "division": {
      "titre": "Article 5",
      "articleDesignationCourte": "ART. 5",
      "type": "ARTICLE",
      "avantAApres": "A",
      "divisionRattachee": "ARTICLE 5",
      "urlDivisionTexteVise": "/15/textes/1802.asp#D_Article_5"
    }
  },
  "corps": {
    "dispositif": "<p style=\"text-align: justify;\">Supprimer cet article.</p>",
    "exposeSommaire": "<p style=\"text-align: justify;\">Cet amendement vise &#224; supprimer l&#8217;article 5 du projet de loi qui vise &#224; habiliter le gouvernement &#224; modifier, par ordonnances, les dispositions relatives aux n&#233;gociations et aux accords dans la Fonction publique.</p><p>S&#8217;agissant de mesures touchant aux fondements du dialogue social il n&#8217;apparait opportun de l&#233;gif&#233;rer par ordonnances. Le Parlement ne peut &#234;tre exclu concernant un sujet aussi important.</p><p>&#160;</p>"
  },
  "representations": [
    {
      "nom": "PDF",
      "typeMime": {
        "type": "application",
        "subType": "PDF"
      },
      "statutRepresentation": {
        "verbatim": true,
        "canonique": true,
        "officielle": true,
        "transcription": false,
        "enregistrement": false
      },
      "contenu": {
        "documentURI": "/15/amendements/1802/CION_LOIS/CL561.pdf"
      }
    }
  ],
  "sort": {
    "dateSaisie": "2019-05-02T15:37:49.000+02:00",
    "sortEnSeance": "Rejeté"
  },
  "dateDepot": "2019-04-29T02:00:00.000+02:00",
  "dateDistribution": "2019-05-01T02:00:00.000+02:00",
  "article99": "0",
  "loiReference": {}
}