{
  "uid": "AMANR5L15SEA717460B1255P2D1N14",
  "identifiant": {
    "legislature": "15",
    "numero": "14",
    "numRect": "0",
    "saisine": {
      "texteLegislatifRef": "PRJLANR5L15B1255",
      "numeroPartiePLF": "2",
      "organeExamen": "PO717460",
      "mentionSecondeDeliberation": "0"
    }
  },
  "numeroLong": "II-14",
  "etapeTexte": "1ère lecture (1ère assemblée saisie)",
  "triAmendement": "fbaaaaaaaaaaaaaaaaaaaaaaaaaaaaaaaaaaaaaaaaaaaaaaaad",
  "cardinaliteAmdtMultiples": "1",
  "etat": "Discuté",
  "signataires": {
    "auteur": {
      "typeAuteur": "Depute",
      "acteurRef": "PA1874",
      "groupePolitiqueRef": "PO730934"
    },
    "cosignatairesRefs": [
      "PA267901",
      "PA721506",
      "PA334654",
      "PA266793",
      "PA720210",
      "PA718850",
      "PA721474",
      "PA267527",
      "PA267429",
      "PA608016",
      "PA721054",
      "PA721410",
      "PA1874",
      "PA719318",
      "PA605036",
      "PA266776",
      "PA336316",
      "PA2492",
      "PA1012",
      "PA718884",
      "PA2377",
      "PA609245",
      "PA642847",
      "PA709315",
      "PA340853",
      "PA718838",
      "PA608416"
    ],
    "texteAffichable": "M.&#160;Le Fur,  M.&#160;Abad, Mme&#160;Anthoine, M.&#160;Bazin, Mme&#160;Bazin-Malgras, Mme&#160;Beauvais, Mme&#160;Bonnivard, M.&#160;Bony, M.&#160;Bouchet, M.&#160;Brun, M.&#160;Cinieri, M.&#160;Cordier, M.&#160;de la Verpilli&#232;re, M.&#160;Hetzel, M.&#160;Kamardine, Mme&#160;Kuster, Mme&#160;Lacroute, M.&#160;Leclerc, Mme&#160;Louwagie, M.&#160;Lorion, M.&#160;Perrut, M.&#160;Quentin, M.&#160;Reiss, M.&#160;Saddier, M.&#160;Straumann, M.&#160;Viala et M.&#160;Viry"
  },
  "pointeurFragmentTexte": {
    "division": {
      "titre": "Article 56",
      "articleDesignationCourte": "ART. 56",
      "type": "ARTICLE",
      "avantAApres": "A",
      "divisionRattachee": "ARTICLE 56",
      "urlDivisionTexteVise": "/15/textes/1255C.asp#D_Article_56"
    },
    "alinea": {
      "numero": "9"
    }
  },
  "corps": {
    "dispositif": "<p style=\"text-align: justify;\">I.&#160;&#8211;&#160;Apr&#232;s le mot&#160;:</p><p style=\"text-align: justify;\">&#171;&#160;alin&#233;a&#160;&#187;,</p><p style=\"text-align: justify;\">r&#233;diger ainsi la fin de l&#8217;alin&#233;a&#160;9&#160;:</p><p style=\"text-align: justify;\">&#171;&#160;d&#232;s lors que leur niveau d&#8217;automatisation pr&#233;sente un caract&#232;re exceptionnel.&#160;&#187;</p><p style=\"text-align: justify;\">II.&#160;&#8211;&#160;En cons&#233;quence, apr&#232;s le m&#234;me alin&#233;a, ins&#233;rer l&#8217;alin&#233;a suivant&#160;:</p><p style=\"text-align: justify;\">&#171;&#160;Concernant les b&#226;timents et terrains servant &#224; l&#8217;exercice d&#8217;une activit&#233; de prestation de services, il n&#8217;est pas tenu compte, dans l&#8217;appr&#233;ciation de leur caract&#232;re &#233;ventuellement industriel, de l&#8217;outillage et de l&#8217;&#233;quipement strictement n&#233;cessaire &#224; la poursuite de l&#8217;activit&#233;. Jusqu&#8217;au 1<sup>er</sup> janvier 2020, l&#8217;administration sursoit &#224; statuer sur le cas des b&#226;timents ayant une activit&#233; de prestations de services.&#160;&#187;</p><p style=\"text-align: justify;\">III.&#160;&#8211;&#160;En cons&#233;quence, r&#233;diger ainsi l&#8217;alin&#233;a&#160;28&#160;:</p><p style=\"text-align: justify;\">&#171;&#160;II.&#160;&#8211;&#160;A.&#160;&#8211;&#160;Le I de l&#8217;article&#160;1500 du code g&#233;n&#233;ral des imp&#244;ts dans sa r&#233;daction issue de la pr&#233;sente loi entre en vigueur le 1<sup>er</sup> janvier 2020.&#160;&#187;</p><p style=\"text-align: justify;\">IV.&#160;&#8211;&#160;Compl&#233;ter cet article par l&#8217;alin&#233;a suivant&#160;:</p><p style=\"text-align: justify;\">&#171;&#160;IV.&#160;&#8211;&#160;La perte de recettes pour les collectivit&#233;s territoriales est compens&#233;e &#224; due concurrence par la majoration de la dotation globale de fonctionnement et, corr&#233;lativement pour l&#8217;&#201;tat, par la cr&#233;ation d&#8217;une taxe additionnelle aux droits mentionn&#233;s aux articles 575 et 575 A du code g&#233;n&#233;ral des imp&#244;ts.&#160;&#187;</p>",
    "exposeSommaire": "<p style=\"text-align: justify;\">Le pr&#233;sent amendement vise &#224; tirer les cons&#233;quences, concernant les activit&#233;s de prestations de services, des travaux engag&#233;s dans le prolongement de l&#8217;adoption de l&#8217;article&#160;103 de la loi de finances pour 2018 afin de s&#233;curiser la qualification d&#8217;&#233;tablissement industriel (article&#160;1499 CGI).</p><p style=\"text-align: justify;\">A cette fin, il propose, en I., de limiter l&#8217;application de la m&#233;thode industrielle aux seuls b&#226;timents et terrains affect&#233;s &#224; une activit&#233; de transformation ainsi qu&#8217;&#224; ceux affect&#233;s une activit&#233; de prestations de services d&#232;s lors que cette activit&#233; est r&#233;alis&#233;e dans des conditions d&#8217;automatisation exceptionnellement importantes.</p><p style=\"text-align: justify;\">Il s&#8217;agit de r&#233;gler d&#233;finitivement la difficult&#233; r&#233;sultant de l&#8217;application de cette m&#233;thode aux b&#226;timents de stockage (dont les silos agricoles) et logistiques, tout en pr&#233;servant la capacit&#233; des services de Bercy &#224; l&#8217;appliquer &#224; ceux de ces b&#226;timents qui, &#224; l&#8217;instar des certains entrep&#244;ts d&#8217;Amazon ou des plateformes de stockage p&#233;trolier, sont tr&#232;s lourdement automatis&#233;s.</p><p style=\"text-align: justify;\">Cet amendement constitue une alternative &#224; la d&#233;finition de la notion d&#8217;&#233;tablissement industriel par un ratio caract&#233;risant la pr&#233;pond&#233;rance de l&#8217;outillage et de l&#8217;&#233;quipement industriel, approche sur laquelle s&#8217;est pench&#233; le rapport au Parlement r&#233;sultant de l&#8217;article&#160;103 de la loi de finances pour 2018.&#160;</p><p style=\"text-align: justify;\">Par ailleurs, afin de r&#233;pondre &#224; l&#8217;imp&#233;ratif de s&#233;curit&#233; juridique ayant motiv&#233; l&#8217;adoption de l&#8217;article&#160;103 susmentionn&#233;, le II. vient pr&#233;ciser la notion d&#8217;outillage et d&#8217;&#233;quipement industriel pour en exclure, dans le cas des activit&#233;s de prestation de services, ceux sans lesquels l&#8217;activit&#233; du site objet du contr&#244;le ne pourrait se poursuivre. Ce faisant, il clarifie les conditions dans lesquelles est appr&#233;ci&#233;e la qualit&#233; &#233;ventuellement industrielle de ce site.</p><p style=\"text-align: justify;\">A titre d&#8217;exemple, un silo agricole stockant du ma&#239;s n&#233;cessite l&#8217;utilisation d&#8217;un s&#233;choir int&#233;gr&#233; aux installations afin de les conserver dans un &#233;tat de commercialisation ult&#233;rieure. A ce titre, le s&#233;chage doit &#234;tre consid&#233;r&#233; comme strictement n&#233;cessaire &#224; l&#8217;activit&#233; du silo agricole et en cons&#233;quence, exclu de l&#8217;analyse du caract&#232;re industriel ou non du site.</p><p style=\"text-align: justify;\">De m&#234;me, l&#8217;outillage et l&#8217;&#233;quipement dont l&#8217;acquisition r&#233;sulte d&#8217;obligations l&#233;gales et/ou r&#232;glementaires serait &#233;galement, pour les m&#234;mes motifs, exclus (ceux r&#233;pondant, par exemple, &#224; des imp&#233;ratifs de s&#233;curit&#233; sanitaire ou de sant&#233; au travail).</p><p style=\"text-align: justify;\">Enfin, il est propos&#233;, afin de laisser &#224; l&#8217;administration le temps d&#8217;ajuster sa doctrine en cons&#233;quence, de renvoyer au 1<sup>er</sup> janvier 2020 l&#8217;entr&#233;e en vigueur du pr&#233;sent amendement.</p><p style=\"text-align: justify;\">Par ailleurs, toujours dans un souci de s&#233;curit&#233; juridique et pour tenir compte de cette entr&#233;e en vigueur d&#233;cal&#233;e, l&#8217;administration est invit&#233;e &#224; sursoir &#224; statuer, jusqu&#8217;au 1er janvier 2020, sur le cas des b&#226;timents ayant une activit&#233; de prestations de services.</p>"
  },
  "representations": [
    {
      "nom": "PDF",
      "typeMime": {
        "type": "application",
        "subType": "PDF"
      },
      "statutRepresentation": {
        "verbatim": true,
        "canonique": true,
        "officielle": true,
        "transcription": false,
        "enregistrement": false
      },
      "contenu": {
        "documentURI": "/15/amendements/1255C/AN/14.pdf"
      }
    }
  ],
  "seanceDiscussion": "RUANR5L15S2019IDS21343",
  "sort": {
    "dateSaisie": "2018-11-16T00:32:56.000+01:00",
    "sortEnSeance": "Rejeté"
  },
  "dateDepot": "2018-10-17T02:00:00.000+02:00",
  "dateDistribution": "2018-11-14T01:00:00.000+01:00",
  "article99": "0",
  "loiReference": {}
}