{
  "uid": "AMANR5L15PO419865B1831P0D1N1758",
  "identifiant": {
    "legislature": "15",
    "numero": "1758",
    "numRect": "0",
    "saisine": {
      "texteLegislatifRef": "PRJLANR5L15B1831",
      "numeroPartiePLF": "0",
      "organeExamen": "PO419865",
      "mentionSecondeDeliberation": "0"
    }
  },
  "numeroLong": "CD1758",
  "etapeTexte": "1ère lecture (2ème assemblée saisie)",
  "triAmendement": "boaaaaaaaaaaaaaaaaaaaaaaaaaaaaaaaaaaaaaaaaaaaaaaaarno",
  "cardinaliteAmdtMultiples": "1",
  "etat": "Irrecevable",
  "signataires": {
    "auteur": {
      "typeAuteur": "Depute",
      "acteurRef": "PA267585",
      "groupePolitiqueRef": "PO744425"
    },
    "cosignatairesRefs": [
      "PA642868",
      "PA421348",
      "PA267330",
      "PA642935",
      "PA721094",
      "PA268019",
      "PA702052",
      "PA721486",
      "PA267585",
      "PA267766",
      "PA267355",
      "PA720230",
      "PA712014",
      "PA267241",
      "PA267780",
      "PA721174",
      "PA722030",
      "PA719806",
      "PA2952",
      "PA331567",
      "PA342601",
      "PA332228",
      "PA721194",
      "PA610775",
      "PA720696",
      "PA695100",
      "PA266788",
      "PA721632",
      "PA721110"
    ],
    "texteAffichable": "M.&#160;Vercamer,  Mme&#160;Auconie, M.&#160;Becht, M.&#160;Benoit, M.&#160;Bournazel, M.&#160;Guy&#160;Bricout, M.&#160;Brindeau, M.&#160;Christophe, Mme&#160;de La Raudi&#232;re, M.&#160;Demilly, Mme&#160;Descamps, Mme&#160;Fr&#233;d&#233;rique&#160;Dumas, M.&#160;Dunoyer, Mme&#160;Firmin Le Bodo, M.&#160;Gom&#232;s, M.&#160;Meyer&#160;Habib, M.&#160;Herth, M.&#160;Lagarde, M.&#160;Ledoux, Mme&#160;Lemoine, Mme&#160;Magnier, M.&#160;Morel-&#192;-L&apos;Huissier, M.&#160;Naegelen, Mme&#160;Sage, Mme&#160;Sanquer, M.&#160;Son-Forget, M.&#160;Villiers, M.&#160;Warsmann et M.&#160;Zumkeller"
  },
  "pointeurFragmentTexte": {
    "division": {
      "titre": "Article 14",
      "articleDesignationCourte": "ART. 14",
      "type": "ARTICLE",
      "avantAApres": "A",
      "divisionRattachee": "ARTICLE 14",
      "urlDivisionTexteVise": "/15/textes/1831.asp#D_Article_14"
    },
    "alinea": {
      "numero": "1"
    }
  },
  "corps": {},
  "representations": [
    {
      "nom": "PDF",
      "typeMime": {
        "type": "application",
        "subType": "PDF"
      },
      "statutRepresentation": {
        "verbatim": true,
        "canonique": true,
        "officielle": true,
        "transcription": false,
        "enregistrement": false
      },
      "contenu": {
        "documentURI": "/15/amendements/1831/CION-DVP/CD1758.pdf"
      }
    }
  ],
  "dateDepot": "2019-05-09T02:00:00.000+02:00",
  "dateDistribution": "2019-05-12T02:00:00.000+02:00",
  "article99": "0",
  "loiReference": {}
}