{
  "uid": "AMANR5L15SEA717460B0235P1D1N1160",
  "identifiant": {
    "legislature": "15",
    "numero": "1160",
    "numRect": "0",
    "saisine": {
      "texteLegislatifRef": "PRJLANR5L15B0235",
      "numeroPartiePLF": "1",
      "organeExamen": "PO717460",
      "mentionSecondeDeliberation": "0"
    }
  },
  "numeroLong": "I-1160",
  "etapeTexte": "1ère lecture (1ère assemblée saisie)",
  "triAmendement": "zzzi",
  "cardinaliteAmdtMultiples": "1",
  "etat": "Discuté",
  "signataires": {
    "auteur": {
      "typeAuteur": "Depute",
      "acteurRef": "PA721670",
      "groupePolitiqueRef": "PO730964"
    },
    "cosignatairesRefs": [
      "PA721670"
    ],
    "texteAffichable": "Mme&#160;de Montchalin et les membres du groupe La R&#233;publique en Marche"
  },
  "pointeurFragmentTexte": {
    "division": {
      "titre": "Article 11",
      "articleDesignationCourte": "APRÈS ART. 11",
      "type": "ARTICLE",
      "avantAApres": "Apres",
      "divisionRattachee": "APRÈS L'ARTICLE 11, insérer l'article suivant:",
      "articleAdditionnel": "1",
      "urlDivisionTexteVise": "/15/textes/0235A.asp#D_Article_11"
    }
  },
  "corps": {
    "dispositif": "<p style=\"text-align: justify;\">I.&#160;&#8211;&#160;Au deuxi&#232;me alin&#233;a du 2&#176; du II de l&#8217;article&#160;150 U du code g&#233;n&#233;ral des imp&#244;ts, le montant&#160;: &#171;&#160;150&#160;000&#160;euros&#160;&#187; est remplac&#233; par le montant&#160;: &#171;&#160;250&#160;000&#160;euros&#160;&#187;.</p><p style=\"text-align: justify;\">II.&#160;&#8211;&#160;La perte de recettes pour l&#8217;&#201;tat est compens&#233;e &#224; due concurrence par la cr&#233;ation d&#8217;une taxe additionnelle aux droits mentionn&#233;s aux articles 575 et 575 A du code g&#233;n&#233;ral des imp&#244;ts.</p>",
    "exposeSommaire": "<p style=\"text-align: justify;\">Le pr&#233;sent amendement a pour objet de relever de 150 000 &#224; 250 000&#160;euros l&#8217;exon&#233;ration partielle de plus-values immobili&#232;res dont b&#233;n&#233;ficient les redevables non-r&#233;sidents fiscaux, install&#233;s dans un autre &#201;tat membre de l&#8217;Union&#160;europ&#233;enne, lorsqu&#8217;ils c&#232;dent un bien immobilier situ&#233; en France dans les cinq ann&#233;es suivant leur expatriation.</p><p style=\"text-align: justify;\">Ce dispositif, qui pr&#233;voyait initialement une exon&#233;ration totale, a &#233;t&#233; plafonn&#233; &#224; 150 000&#160;euros par l&#8217;article&#160;28 de la loi n&#176; 2013&#8209;1278 du 29 d&#233;cembre 2013 de finances pour 2014.</p><p style=\"text-align: justify;\">Ce plafond est aujourd&#8217;hui jug&#233; trop bas par de nombreux contribuables expatri&#233;s, compte tenu par ailleurs de l&#8217;application des pr&#233;l&#232;vements sociaux au taux de 15,5&#160;% &#224; ces ventes &#224; compter de 2012. Compte tenu de l&#8217;augmentation de la CSG par ailleurs pr&#233;vue par le PLFSS 2018, les pr&#233;l&#232;vements sociaux s&#8217;appliqueront au taux global de 17,2&#160;% &#224; compter du 1<sup>er</sup> janvier 2018.</p><p style=\"text-align: justify;\">Compte tenu, par ailleurs, de l&#8217;arr&#234;t de la CJUE du 26 f&#233;vrier 2015 &#171;&#160;De Ruyter&#160;&#187; qui a largement remis en cause la l&#233;gitimit&#233; de ces pr&#233;l&#232;vements aupr&#232;s de la communaut&#233; des expatri&#233;s, il semble important de revaloriser le plafond de l&#8217;exon&#233;ration afin de ne pas freiner la mobilit&#233; professionnelle internationale des Fran&#231;ais.</p>"
  },
  "representations": [
    {
      "nom": "PDF",
      "typeMime": {
        "type": "application",
        "subType": "PDF"
      },
      "statutRepresentation": {
        "verbatim": true,
        "canonique": true,
        "officielle": true,
        "transcription": false,
        "enregistrement": false
      },
      "contenu": {
        "documentURI": "/15/amendements/0235A/AN/1160.pdf"
      }
    }
  ],
  "seanceDiscussion": "RUANR5L15S2018IDS20698",
  "sort": {
    "dateSaisie": "2017-10-20T09:56:25.000+02:00",
    "sortEnSeance": "Retiré"
  },
  "dateDepot": "2017-10-13T02:00:00.000+02:00",
  "dateDistribution": "2017-10-17T02:00:00.000+02:00",
  "article99": "0",
  "loiReference": {
    "codeLoi": "CGI",
    "divisionCodeLoi": "150 U"
  }
}