{
  "uid": "AMANR5L15PO419604B1481P0D1N599",
  "identifiant": {
    "legislature": "15",
    "numero": "599",
    "numRect": "0",
    "saisine": {
      "texteLegislatifRef": "PRJLANR5L15B1481",
      "numeroPartiePLF": "0",
      "organeExamen": "PO419604",
      "mentionSecondeDeliberation": "0"
    }
  },
  "numeroLong": "AC599",
  "etapeTexte": "1ère lecture (1ère assemblée saisie)",
  "triAmendement": "joaaaaaaaaaaaaaaaaaaaaaaaaaaaaaaaaaaaaaaaaaaaaaaaai",
  "cardinaliteAmdtMultiples": "1",
  "etat": "Discuté",
  "signataires": {
    "auteur": {
      "typeAuteur": "Depute",
      "acteurRef": "PA719170",
      "groupePolitiqueRef": "PO730964"
    },
    "cosignatairesRefs": [
      "PA719170"
    ],
    "texteAffichable": "Mme&#160;Charvier, rapporteure"
  },
  "pointeurFragmentTexte": {
    "division": {
      "titre": "Article 20",
      "articleDesignationCourte": "ART. 20",
      "type": "ARTICLE",
      "avantAApres": "A",
      "divisionRattachee": "ARTICLE 20",
      "urlDivisionTexteVise": "/15/textes/1481.asp#D_Article_20"
    },
    "alinea": {
      "numero": "4"
    }
  },
  "corps": {
    "dispositif": "<p style=\"text-align: justify;\">I.&#160;&#8211;&#192; la premi&#232;re phrase de l&#8217;alin&#233;a&#160;4, substituer au mot&#160;:</p><p style=\"text-align: justify;\">&#171;&#160;seront&#160;&#187;</p><p style=\"text-align: justify;\">le mot&#160;:</p><p style=\"text-align: justify;\">&#171;&#160;sont&#160;&#187;.&#160;</p><p style=\"text-align: justify;\">II.&#160;&#8211; En cons&#233;quence, &#224; la derni&#232;re phrase de l&#8217;alin&#233;a&#160;4, substituer au mot&#160;:</p><p style=\"text-align: justify;\">&#171;&#160;donneront&#160;&#187;</p><p style=\"text-align: justify;\">le mot&#160;:</p><p style=\"text-align: justify;\">&#171;&#160;donnent&#160;&#187;.</p><p style=\"text-align: justify;\">II.&#160;&#8211;&#160;En cons&#233;quence, &#224; l&#8217;alin&#233;a&#160;5, substituer au mot&#160;:</p><p style=\"text-align: justify;\">&#171;&#160;seront&#160;&#187;</p><p style=\"text-align: justify;\">le mot&#160;:</p><p style=\"text-align: justify;\">&#171;&#160;sont&#160;&#187;.</p>",
    "exposeSommaire": "<p style=\"text-align: justify;\">Amendement r&#233;dactionnel.</p>"
  },
  "representations": [
    {
      "nom": "PDF",
      "typeMime": {
        "type": "application",
        "subType": "PDF"
      },
      "statutRepresentation": {
        "verbatim": true,
        "canonique": true,
        "officielle": true,
        "transcription": false,
        "enregistrement": false
      },
      "contenu": {
        "documentURI": "/15/amendements/1481/CION-CEDU/AC599.pdf"
      }
    }
  ],
  "sort": {
    "dateSaisie": "2019-01-31T10:25:01.000+01:00",
    "sortEnSeance": "Adopté"
  },
  "dateDepot": "2019-01-29T01:00:00.000+01:00",
  "dateDistribution": "2019-01-29T01:00:00.000+01:00",
  "article99": "0",
  "loiReference": {}
}