{
  "uid": "AMANR5L15PO419610B1908P0D1N303",
  "identifiant": {
    "legislature": "15",
    "numero": "303",
    "numRect": "0",
    "saisine": {
      "texteLegislatifRef": "PRJLANR5L15B1908",
      "numeroPartiePLF": "0",
      "organeExamen": "PO419610",
      "mentionSecondeDeliberation": "0"
    }
  },
  "numeroLong": "CE303",
  "etapeTexte": "1ère lecture (1ère assemblée saisie)",
  "triAmendement": "aiaaaaaaaaaaaaaaaaaaaaaaaaaaaaaaaaaaaaaaaaaaaaaaaadew",
  "cardinaliteAmdtMultiples": "1",
  "etat": "Discuté",
  "signataires": {
    "auteur": {
      "typeAuteur": "Depute",
      "acteurRef": "PA719592",
      "groupePolitiqueRef": "PO730964"
    },
    "cosignatairesRefs": [
      "PA719100",
      "PA720074",
      "PA719592",
      "PA720870",
      "PA719952",
      "PA721166",
      "PA721434",
      "PA721514",
      "PA718990"
    ],
    "texteAffichable": "M.&#160;Simian,  M.&#160;Mis, Mme&#160;Lardet, Mme&#160;Cazebonne, Mme&#160;Blanc, Mme&#160;Kerbarh, M.&#160;Mbaye, M.&#160;Ardouin et Mme&#160;Janvier"
  },
  "pointeurFragmentTexte": {
    "division": {
      "titre": "Article PREMIER",
      "articleDesignationCourte": "ART. PREMIER",
      "type": "ARTICLE",
      "avantAApres": "A",
      "divisionRattachee": "ARTICLE PREMIER",
      "urlDivisionTexteVise": "/15/textes/1908.asp#D_Article_1er"
    },
    "alinea": {
      "avantAApres": "Apres",
      "numero": "4"
    }
  },
  "corps": {
    "dispositif": "<p style=\"text-align: justify;\">Compl&#233;ter cet article par les deux alin&#233;as suivants&#160;:</p><p style=\"text-align: justify;\">&#171;&#160;4&#176;&#160;Il est ajout&#233; un&#160;10&#176; ainsi r&#233;dig&#233;&#160;:</p><p style=\"text-align: justify;\">&#171;&#160;10&#176;&#160;De porter la part de l&#8217;hydrog&#232;ne bas carbone et de l&#8217;hydrog&#232;ne renouvelable &#224; 30&#160;% de la consommation totale d&#8217;hydrog&#232;ne &#224; horizon&#160;2030.&#160;&#187;</p>",
    "exposeSommaire": "<p style=\"text-align: justify;\">Le plan hydrog&#232;ne de 2018 comporte un objectif de d&#233;veloppement de l&#8217;hydrog&#232;ne bas carbone&#160;: &#171;&#160;L&#8217;objectif de production d&#8217;hydrog&#232;ne bas carbone dans les usages de l&#8217;hydrog&#232;ne industriel qui guidera l&#8217;action du Gouvernement sera&#160;: - 10&#160;% en 2023 - 20 &#224; 40&#160;% en 2028.&#160;&#187;. </p><p style=\"text-align: justify;\">Par ailleurs, &#224; l&#8217;horizon 2030, ce m&#234;me plan ambitionne de faire de l&#8217;hydrog&#232;ne un v&#233;ritable vecteur &#233;nerg&#233;tique au-del&#224; de son usage uniquement industriel actuellement. Il promeut le d&#233;veloppement de l&#8217;&#233;lectrolyse pour soutenir le d&#233;veloppement d&#8217;une mobilit&#233; hydrog&#232;ne bas carbone&#160;; il pr&#233;voit &#233;galement l&#8217;injection d&#8217;hydrog&#232;ne dans les r&#233;seaux comme levier de flexibilit&#233; et de stockage facilitant l&#8217;int&#233;gration des &#233;nergies renouvelables &#233;lectriques intermittentes dans le mix &#233;nerg&#233;tique. </p><p style=\"text-align: justify;\">La proposition vise donc &#224; inscrire dans le code de l&#8217;&#233;nergie un objectif de d&#233;veloppement de l&#8217;hydrog&#232;ne bas carbone et renouvelable non seulement industriel mais &#233;galement comme &#233;nergie &#224; horizon 2030. L&#8217;ambition de 30&#160;% est mesur&#233;e au regard de l&#8217;objectif de 20 &#224; 40&#160;% sur la consommation industrielle en 2028 et des perspectives de d&#233;veloppement de l&#8217;hydrog&#232;ne bas carbone dans les autres secteurs, en particulier le transport. Cet objectif reste d&#8217;ailleurs inf&#233;rieur aux projections r&#233;alis&#233;es dans le cadre du plan de d&#233;ploiement de l&#8217;hydrog&#232;ne pour la transition &#233;nerg&#233;tique qui pr&#233;voit environ 450&#160;000 tonnes d&#8217;hydrog&#232;ne bas carbone et renouvelable &#224; horizon 2028.</p>"
  },
  "representations": [
    {
      "nom": "PDF",
      "typeMime": {
        "type": "application",
        "subType": "PDF"
      },
      "statutRepresentation": {
        "verbatim": true,
        "canonique": true,
        "officielle": true,
        "transcription": false,
        "enregistrement": false
      },
      "contenu": {
        "documentURI": "/15/amendements/1908/CION-ECO/CE303.pdf"
      }
    }
  ],
  "sort": {
    "dateSaisie": "2019-06-19T00:20:07.000+02:00",
    "sortEnSeance": "Non soutenu"
  },
  "dateDepot": "2019-06-14T02:00:00.000+02:00",
  "dateDistribution": "2019-06-18T02:00:00.000+02:00",
  "article99": "0",
  "loiReference": {
    "codeLoi": "10",
    "divisionCodeLoi": "xhydrogène"
  }
}