{
  "uid": "AMANR5L15SEA717460B2296P0D1N1722",
  "identifiant": {
    "legislature": "15",
    "numero": "1722",
    "numRect": "0",
    "saisine": {
      "texteLegislatifRef": "PRJLANR5L15B2296",
      "numeroPartiePLF": "0",
      "organeExamen": "PO717460",
      "mentionSecondeDeliberation": "1"
    }
  },
  "numeroLong": "1722",
  "etapeTexte": "1ère lecture (1ère assemblée saisie)",
  "triAmendement": "ieaaaaaaaaaaaaaaaaaaaaaaaaaaaaaaaaaaaaaaaaaaaaaaaaaoe",
  "cardinaliteAmdtMultiples": "1",
  "etat": "Discuté",
  "signataires": {
    "auteur": {
      "typeAuteur": "Depute",
      "acteurRef": "PA720924",
      "groupePolitiqueRef": "PO730970"
    },
    "cosignatairesRefs": [
      "PA720002",
      "PA720178",
      "PA720728",
      "PA719488",
      "PA722162",
      "PA717151",
      "PA720652",
      "PA721742",
      "PA721996",
      "PA719918",
      "PA720162",
      "PA720598",
      "PA719210",
      "PA721530",
      "PA719942",
      "PA719640",
      "PA721836",
      "PA720092",
      "PA721234",
      "PA721984",
      "PA721418",
      "PA720924",
      "PA720334",
      "PA718978",
      "PA721734",
      "PA721182",
      "PA720704",
      "PA722374",
      "PA1276",
      "PA720256",
      "PA720968",
      "PA720720",
      "PA722284",
      "PA719044",
      "PA719266",
      "PA720746",
      "PA720976",
      "PA719874",
      "PA721976",
      "PA721608",
      "PA720764",
      "PA719504",
      "PA719558",
      "PA720772",
      "PA720326",
      "PA721924"
    ],
    "texteAffichable": "Mme&#160;Elimas,  Mme&#160;Benin, Mme&#160;de Vaucouleurs, M.&#160;Hammouche, M.&#160;Isaac-Sibille, M.&#160;Mignola, M.&#160;Balanant, Mme&#160;Bannier, M.&#160;Barrot, M.&#160;Baudu, M.&#160;Berta, M.&#160;Bolo, M.&#160;Bourlanges, M.&#160;Bru, M.&#160;Cubertafon, Mme&#160;de Sarnez, Mme&#160;Deprez-Audebert, M.&#160;Duverg&#233;, Mme&#160;El Ha&#239;ry, Mme&#160;Essayan, M.&#160;Fanget, Mme&#160;Florennes, M.&#160;Fuchs, M.&#160;Garcia, Mme&#160;Jacquier-Laforge, M.&#160;Joncour, M.&#160;Lagleize, M.&#160;Lain&#233;, M.&#160;Laqhila, Mme&#160;Lasserre-David, M.&#160;Latombe, M.&#160;Loiseau, Mme&#160;Luquet, M.&#160;Mathiasin, M.&#160;Mattei, Mme&#160;Mette, M.&#160;Michel-Kleisbauer, M.&#160;Millienne, M.&#160;Pahun, M.&#160;Fr&#233;d&#233;ric&#160;Petit, Mme&#160;Maud&#160;Petit, Mme&#160;Poueyto, M.&#160;Ramos, M.&#160;Turquois, Mme&#160;Vichnievsky et M.&#160;Waserman"
  },
  "pointeurFragmentTexte": {
    "division": {
      "titre": "Article 40",
      "articleDesignationCourte": "ART. 40",
      "type": "ARTICLE",
      "avantAApres": "A",
      "divisionRattachee": "ARTICLE 40",
      "urlDivisionTexteVise": "/15/textes/2296.asp#D_Article_40"
    },
    "alinea": {
      "avantAApres": "Apres",
      "numero": "8"
    }
  },
  "corps": {
    "dispositif": "<p>Compl&#233;ter cet article par les trois alin&#233;as suivants&#160;:</p><p style=\"text-align: justify;\">&#171;&#160;II.&#160;&#8211;L&#8217;&#201;tat peut autoriser, pour une dur&#233;e de trois ans et &#224; titre exp&#233;rimental, la mise en place,&#160;d&#8217;un dispositif sp&#233;cifique &#224; destination des enfants atteints de cancer p&#233;diatrique.</p><p style=\"text-align: justify;\">&#171;&#160;III.&#160;&#8211;&#160;Un d&#233;cret pr&#233;cise les modalit&#233;s de mise en &#339;uvre et d&#8217;&#233;valuation de ces exp&#233;rimentations, notamment quant au suivi des patients et au financement des consultations.</p><p style=\"text-align: justify;\">&#171;&#160;IV.&#160;&#8211;&#160;Un rapport d&#8217;&#233;valuation est r&#233;alis&#233; par le Gouvernement au terme de l&#8217;exp&#233;rimentation et transmis au Parlement.&#160;&#187;</p>",
    "exposeSommaire": "<p>La mise en place d&#8217;un parcours de soin global apr&#232;s le traitement d&#8217;un cancer est une avanc&#233;e majeure, qui permettra de mieux accompagner les patients dans leur gu&#233;rison, et d&#8217;am&#233;liorer leur qualit&#233; de vie apr&#232;s la maladie.</p><p style=\"text-align: justify;\">Toutefois, les cancers p&#233;diatriques pr&#233;sentent des sp&#233;cificit&#233;s par rapport aux cancers de l&#8217;adulte, lorsque l&#8217;on sait qu&#8217;un tiers des cancers p&#233;diatriques n&#8217;existe pas chez les adultes et, inversement, plus de 80&#160;% des cancers de l&#8217;adulte n&#8217;existent pas en p&#233;diatrie. Des mesures sp&#233;cifiques doivent donc &#234;tre mises en place pour les enfants.</p><p style=\"text-align: justify;\">C&#8217;est pourquoi cet amendement propose la mise en place d&#8217;une exp&#233;rimentation permettant que le parcours de soin global apr&#232;s le traitement d&#8217;un cancer comporte &#233;galement un volet sp&#233;cifique s&#8217;adressant aux enfants ainsi qu&#8217;aux adultes ayant souffert d&#8217;un cancer dans leur enfance.</p>"
  },
  "representations": [
    {
      "nom": "PDF",
      "typeMime": {
        "type": "application",
        "subType": "PDF"
      },
      "statutRepresentation": {
        "verbatim": true,
        "canonique": true,
        "officielle": true,
        "transcription": false,
        "enregistrement": false
      },
      "contenu": {
        "documentURI": "/15/amendements/2296/AN/1722.pdf"
      }
    }
  ],
  "seanceDiscussion": "RUANR5L15S2020IDS21881",
  "sort": {
    "dateSaisie": "2019-10-25T15:21:04.000+02:00",
    "sortEnSeance": "Rejeté"
  },
  "dateDepot": "2019-10-18T02:00:00.000+02:00",
  "dateDistribution": "2019-10-23T02:00:00.000+02:00",
  "article99": "0",
  "loiReference": {}
}