{
  "uid": "AMANR5L15SEA717460B0485P0D1N302",
  "identifiant": {
    "legislature": "15",
    "numero": "302",
    "numRect": "0",
    "saisine": {
      "texteLegislatifRef": "PRJLANR5L15B0485",
      "numeroPartiePLF": "0",
      "organeExamen": "PO717460",
      "mentionSecondeDeliberation": "1"
    }
  },
  "numeroLong": "302",
  "etapeTexte": "Nouvelle Lecture",
  "triAmendement": "i",
  "cardinaliteAmdtMultiples": "1",
  "etat": "Discuté",
  "signataires": {
    "auteur": {
      "typeAuteur": "Gouvernement"
    },
    "texteAffichable": "le Gouvernement"
  },
  "pointeurFragmentTexte": {
    "missionVisee": {
      "idMissionAN": "215",
      "libelleMission": "Solidarité, insertion et égalité des chances",
      "codeMissionPLF": "B",
      "libelleMissionPLF": "Répartition, par mission et programme, des crédits du budget général"
    },
    "division": {
      "titre": "Article 63",
      "articleDesignationCourte": "ART. 63",
      "type": "ARTICLE",
      "avantAApres": "A",
      "divisionRattachee": "ARTICLE 63",
      "urlDivisionTexteVise": "/15/textes/0485.asp#D_Article_63"
    }
  },
  "corps": {
    "dispositif": "<p style=\"text-align: justify;\">R&#233;tablir cet article dans la r&#233;daction suivante&#160;:</p><p style=\"text-align: justify;\">&#171;&#160;I.&#160;&#8211;&#160;L&#8217;article L.&#160;842&#8209;8 du code de la s&#233;curit&#233; sociale est ainsi r&#233;dig&#233;&#160;:</p><p style=\"text-align: justify;\">&#171;&#160;<i>Art.&#160;L.&#160;842&#8209;8</i>.&#160;&#8211;&#160;Pour l&#8217;application de l&#8217;article L.&#160;842&#8209;3, l&#8217;allocation mentionn&#233;e aux articles L.&#160;821&#8209;1 et L.&#160;821&#8209;2 est prise en compte en tant que revenu professionnel sous r&#233;serve que les revenus professionnels mensuels du travailleur handicap&#233;, hors prise en compte de cette allocation, atteignent un montant fix&#233; par d&#233;cret.&#160;&#187;</p><p style=\"text-align: justify;\">&#171;&#160;II.&#160;&#8211;&#160;Pour l&#8217;application &#224; Mayotte de l&#8217;article L.&#160;842&#8209;8 du m&#234;me code, la r&#233;f&#233;rence &#224; l&#8217;allocation mentionn&#233;e aux articles L.&#160;821&#8209;1 et L.&#160;821&#8209;2 de ce code est remplac&#233;e par la r&#233;f&#233;rence &#224; l&#8217;allocation mentionn&#233;e &#224; l&#8217;article&#160;35 de l&#8217;ordonnance n&#176; 2002&#8209;411 du 27 mars 2002 relative &#224; la protection sanitaire et sociale &#224; Mayotte.</p><p style=\"text-align: justify;\">&#171;&#160;III.&#160;&#8211;&#160;Le A du V de l&#8217;article&#160;99 de la loi n&#176; 2016&#8209;1088 relative au travail, &#224; la modernisation du dialogue social et &#224; la s&#233;curisation des parcours professionnels est abrog&#233;.</p><p style=\"text-align: justify;\">&#171;&#160;IV.&#160;&#8211;&#160;Le pr&#233;sent article entre en vigueur le 1<sup>er</sup> janvier 2018.&#160;&#187;.</p>",
    "exposeSommaire": "<p style=\"text-align: justify;\">Le pr&#233;sent amendement tend &#224; r&#233;tablir les dispositions relatives &#224; la r&#233;forme des modalit&#233;s de calcul de la prime d&#8217;activit&#233; telles qu&#8217;elles ont &#233;t&#233; adopt&#233;es par l&#8217;Assembl&#233;e nationale en premi&#232;re lecture du projet de loi de finances pour 2018.</p><p style=\"text-align: justify;\">La mesure vise &#224; mettre fin, &#224; compter du 1<sup>er</sup> janvier 2018, &#224; la prise en compte, en tant que revenus professionnels pour le calcul de la prime d&#8217;activit&#233; des pensions, des rentes d&#8217;invalidit&#233; et des rentes accident du travail et maladie professionnelle (AT-MP). Alors que ce dispositif n&#8217;a &#233;t&#233; utilis&#233; que par un nombre limit&#233; de b&#233;n&#233;ficiaires, son maintien ne semble pas se justifier, d&#232;s lors que les revenus concern&#233;s ne sont pas directement li&#233;s &#224; la reprise ou &#224; l&#8217;exercice d&#8217;une activit&#233;. L&#8217;allocation aux adultes handicap&#233;s (AAH) &#8211; dont le montant d&#233;pend du niveau des ressources professionnelles des b&#233;n&#233;ficiaires&#160;&#8211;&#160;reste, quant &#224; elle, prise en compte comme revenu professionnel dans le calcul de la prime d&#8217;activit&#233;.</p><p style=\"text-align: justify;\">La pr&#233;sente mesure s&#8217;inscrit dans le cadre de l&#8217;action du Gouvernement en faveur du pouvoir d&#8217;achat, qui se traduit notamment par une revalorisation des dispositifs d&#8217;incitation au travail tels que la prime d&#8217;activit&#233;, dont le montant sera accru de 80&#160;&#8364; entre 2018 et 2021.</p>"
  },
  "representations": [
    {
      "nom": "PDF",
      "typeMime": {
        "type": "application",
        "subType": "PDF"
      },
      "statutRepresentation": {
        "verbatim": true,
        "canonique": true,
        "officielle": true,
        "transcription": false,
        "enregistrement": false
      },
      "contenu": {
        "documentURI": "/15/amendements/0485/AN/302.pdf"
      }
    }
  ],
  "seanceDiscussion": "RUANR5L15S2018IDS20842",
  "sort": {
    "dateSaisie": "2017-12-16T01:06:26.000+01:00",
    "sortEnSeance": "Adopté"
  },
  "dateDepot": "2017-12-13T01:00:00.000+01:00",
  "dateDistribution": "2017-12-14T01:00:00.000+01:00",
  "article99": "0",
  "loiReference": {}
}