{
  "uid": "AMANR5L15SEA717460B0911P0D1N2217",
  "identifiant": {
    "legislature": "15",
    "numero": "2217",
    "numRect": "0",
    "saisine": {
      "texteLegislatifRef": "PRJLANR5L15B0911",
      "numeroPartiePLF": "0",
      "organeExamen": "PO717460",
      "mentionSecondeDeliberation": "0"
    }
  },
  "numeroLong": "2217",
  "etapeTexte": "1ère lecture (1ère assemblée saisie)",
  "triAmendement": "ab",
  "cardinaliteAmdtMultiples": "1",
  "etat": "A discuter",
  "signataires": {
    "auteur": {
      "typeAuteur": "Depute",
      "acteurRef": "PA720846",
      "groupePolitiqueRef": "PO730958"
    },
    "cosignatairesRefs": [
      "PA722142",
      "PA720430",
      "PA721960",
      "PA719578",
      "PA719676",
      "PA720422",
      "PA588884",
      "PA720286",
      "PA720846",
      "PA721210",
      "PA720892",
      "PA721062",
      "PA718860",
      "PA721226",
      "PA721202",
      "PA2150",
      "PA718868"
    ],
    "texteAffichable": "M.&#160;Lachaud,  Mme&#160;Autain, M.&#160;Bernalicis, M.&#160;Coquerel, M.&#160;Corbi&#232;re, Mme&#160;Fiat, M.&#160;Larive, M.&#160;M&#233;lenchon, Mme&#160;Obono, Mme&#160;Panot, M.&#160;Prud&apos;homme, M.&#160;Quatennens, M.&#160;Ratenon, Mme&#160;Ressiguier, Mme&#160;Rubin, M.&#160;Ruffin et Mme&#160;Taurine"
  },
  "pointeurFragmentTexte": {
    "division": {
      "titre": "Article 7",
      "articleDesignationCourte": "APRÈS ART. 7",
      "type": "ARTICLE",
      "avantAApres": "Apres",
      "divisionRattachee": "APRÈS L'ARTICLE 7, insérer l'article suivant:",
      "articleAdditionnel": "1",
      "urlDivisionTexteVise": "/15/textes/0911.asp#D_Article_7"
    }
  },
  "corps": {
    "dispositif": "<p style=\"line-height: 1.2; padding: 0pt 0pt 0pt 5pt; text-align: justify;\">L'article 47-1 de la Constitution est compl&#233;t&#233; par un alin&#233;a ainsi r&#233;dig&#233;&#160;:</p><p style=\"line-height: 1.2; padding: 0pt 0pt 0pt 5pt; text-align: justify;\">&#171;&#160;Le syst&#232;me de retraite est par r&#233;partition, et il s&#8217;accompagne de prestations de solidarit&#233; nationale comme les pensions de r&#233;version. Toute r&#233;vision de l&#8217;acc&#232;s &#224; une pension de r&#233;version ou du montant de celle-ci ne peut avoir pour effet d&#8217;augmenter les in&#233;galit&#233;s de revenus et de patrimoine entre les six premiers et les quatre derniers d&#233;ciles de la population, ainsi qu&#8217;entre le premier et le dernier d&#233;cile de celle-ci&#160;&#187;.</p>",
    "exposeSommaire": "<p style=\"line-height: 1.2; text-align: justify;\">Par cet amendement, nous proposons d&#8217;encadrer la possibilit&#233; de r&#233;viser l&#8217;acc&#232;s et le niveau des pensions de r&#233;version.</p><p style=\"text-align: justify;\">Notre amendement propose donc d&#8217;instaurer deux cliquets pour &#233;viter qu&#8217;une r&#233;vision des pensions de r&#233;version accroissent les in&#233;galit&#233;s au sein de la population. &#192; savoir, toute r&#233;forme ne peut augmenter les in&#233;galit&#233;s :</p><p style=\"line-height: 1.2; text-align: justify;\">- entre les 40% des fran&#231;ais les plus et ais&#233;s et les 60% les moins ais&#233;s (ce qui permet de prot&#233;ger les classes populaires et classes moyennes) &#160;</p><p style=\"line-height: 1.2; text-align: justify;\">- entre les 10% les plus riches et les 10% les plus pauvres (ce qui permet de prot&#233;ger les personnes les plus en situation de pauvret&#233;).</p><p style=\"text-align: justify;\">Le syst&#232;me actuel nous semble en effet menac&#233; par le projet de r&#233;forme des retraites, dont le Haut Commissaire a annonc&#233; qu&#8217;il porterait aussi sur ces pensions.</p><p style=\"text-align: justify;\">D&#8217;une fa&#231;on g&#233;n&#233;rale, les pistes donn&#233;es par le Gouvernement et l&#8217;objectif d&#8217;harmonisation des r&#233;gimes menace les pensions de r&#233;version, qui sont pourtant une garantie sociale dont b&#233;n&#233;ficient en majorit&#233; des femmes et pas de fa&#231;on n&#233;gligeable pour les concern&#233;e. Selon le sc&#233;nario d&#8217;harmonisation choisi, il pourrait y avoir des perdants : le calcul des pensions de r&#233;version n&#8217;est pas le m&#234;me selon les r&#233;gimes, et nous doutons que le gouvernement envisage une harmonisation vers le haut.</p><p style=\"text-align: justify;\">Pour cette raison, nous souhaitons proposer &#224; la repr&#233;sentation nationale, pour rassurer les Fran&#231;ais face &#224; l&#8217;&#233;ventualit&#233; d&#8217;un recul de leurs droits, que les r&#233;visions de l&#8217;acc&#232;s &#224; une pension de r&#233;version ou du montant de ces pensions ne pourront donner lieu &#224; aucune augmentation d&#8217;in&#233;galit&#233;s sociales.</p><p style=\"text-align: justify;\">C&#8217;est une garantie n&#233;cessaire pour mettre sur de bons rails la r&#233;forme des retraites qui se pr&#233;parent, et s&#8217;assurer que sous couvert d&#8217;unification elle ne conduise &#224; tirer vers le bas les droits sociaux de nombre de nos concitoyens.</p>"
  },
  "representations": [
    {
      "nom": "PDF",
      "typeMime": {
        "type": "application",
        "subType": "PDF"
      },
      "statutRepresentation": {
        "verbatim": true,
        "canonique": true,
        "officielle": true,
        "transcription": false,
        "enregistrement": false
      },
      "contenu": {
        "documentURI": "/15/amendements/0911/AN/2217.pdf"
      }
    }
  ],
  "dateDepot": "2018-07-06T02:00:00.000+02:00",
  "dateDistribution": "2018-07-10T02:00:00.000+02:00",
  "article99": "0",
  "loiReference": {}
}