{
  "uid": "AMANR5L15PO419604B1978P0D1N30",
  "identifiant": {
    "legislature": "15",
    "numero": "30",
    "numRect": "0",
    "saisine": {
      "texteLegislatifRef": "PRJLANR5L15B1978",
      "numeroPartiePLF": "0",
      "organeExamen": "PO419604",
      "mentionSecondeDeliberation": "0"
    }
  },
  "numeroLong": "AC30",
  "etapeTexte": "1ère lecture (2ème assemblée saisie)",
  "triAmendement": "aoaaaaaaaaaaaaaaaaaaaaaaaaaaaaaaaaaaaaaaaaaaaaaaaagu",
  "cardinaliteAmdtMultiples": "1",
  "etat": "Discuté",
  "signataires": {
    "auteur": {
      "typeAuteur": "Depute",
      "acteurRef": "PA720178",
      "groupePolitiqueRef": "PO730970"
    },
    "cosignatairesRefs": [
      "PA720178"
    ],
    "texteAffichable": "M.&#160;Garcia, rapporteur"
  },
  "pointeurFragmentTexte": {
    "division": {
      "titre": "Article PREMIER",
      "articleDesignationCourte": "ART. PREMIER",
      "type": "ARTICLE",
      "avantAApres": "A",
      "divisionRattachee": "ARTICLE PREMIER",
      "urlDivisionTexteVise": "/15/textes/1978.asp#D_Article_1er"
    },
    "alinea": {
      "numero": "40"
    }
  },
  "corps": {
    "dispositif": "<p style=\"text-align: justify;\">Compl&#233;ter l&#8217;intitul&#233; de l&#8217;alin&#233;a&#160;40 par les mots&#160;: </p><p style=\"text-align: justify;\">&#171;&#160;de distribution de la presse&#160;&#187;.</p>",
    "exposeSommaire": "<p style=\"text-align: justify;\">Amendement d&#8217;harmonisation r&#233;dactionnelle.</p>"
  },
  "representations": [
    {
      "nom": "PDF",
      "typeMime": {
        "type": "application",
        "subType": "PDF"
      },
      "statutRepresentation": {
        "verbatim": true,
        "canonique": true,
        "officielle": true,
        "transcription": false,
        "enregistrement": false
      },
      "contenu": {
        "documentURI": "/15/amendements/1978/CION-CEDU/AC30.pdf"
      }
    }
  ],
  "sort": {
    "dateSaisie": "2019-07-15T17:06:19.000+02:00",
    "sortEnSeance": "Adopté"
  },
  "dateDepot": "2019-07-10T02:00:00.000+02:00",
  "dateDistribution": "2019-07-12T02:00:00.000+02:00",
  "article99": "0",
  "loiReference": {}
}