{
  "uid": "AMANR5L15PO757134B1088P0D1N69",
  "identifiant": {
    "legislature": "15",
    "numero": "69",
    "numRect": "0",
    "saisine": {
      "texteLegislatifRef": "PRJLANR5L15B1088",
      "numeroPartiePLF": "0",
      "organeExamen": "PO757134",
      "mentionSecondeDeliberation": "0"
    }
  },
  "numeroLong": "69",
  "etapeTexte": "1ère lecture (1ère assemblée saisie)",
  "triAmendement": "ajaaaaaaaaaaaaaaaaaaaaaaaaaaaaaaaaaaaaaaaaaaaaaaaae",
  "cardinaliteAmdtMultiples": "1",
  "etat": "Irrecevable",
  "signataires": {
    "auteur": {
      "typeAuteur": "Depute",
      "acteurRef": "PA340853",
      "groupePolitiqueRef": "PO730934"
    },
    "cosignatairesRefs": [
      "PA334654",
      "PA266793",
      "PA721968",
      "PA718784",
      "PA608016",
      "PA266808",
      "PA266797",
      "PA267260",
      "PA721314",
      "PA609245",
      "PA340853",
      "PA346218",
      "PA267429",
      "PA605036",
      "PA767",
      "PA721506"
    ],
    "texteAffichable": "M.&#160;Leclerc,  M.&#160;Bony, M.&#160;Straumann, M.&#160;Cinieri, Mme&#160;Louwagie, Mme&#160;Kuster, Mme&#160;Poletti, M.&#160;Cattin, M.&#160;Masson, M.&#160;Schellenberger, M.&#160;Vialay, M.&#160;Pauget, M.&#160;Abad, M.&#160;Gosselin, Mme&#160;Lacroute et M.&#160;Rolland"
  },
  "pointeurFragmentTexte": {
    "division": {
      "titre": "Article 6",
      "articleDesignationCourte": "ART. 6",
      "type": "ARTICLE",
      "avantAApres": "A",
      "divisionRattachee": "ARTICLE 6",
      "urlDivisionTexteVise": "/15/textes/1088.asp#D_Article_6"
    },
    "alinea": {
      "numero": "9"
    }
  },
  "corps": {
    "dispositif": "<p style=\"text-align: justify;\">&#192; l&#8217;alin&#233;a&#160;9, supprimer les mots : </p><p style=\"text-align: justify;\">&#171;&#160;atteint ou&#160;&#187;.</p>",
    "exposeSommaire": "<p style=\"text-align: justify;\">Le pr&#233;sent amendement propose de ne faire basculer une entreprise dans la tranche sup&#233;rieure que lorsque le seuil est effectivement d&#233;pass&#233;. Ainsi, une entreprise dont l&#8217;effectif serait juste au niveau du seuil resterait dans la tranche inf&#233;rieure.</p>"
  },
  "representations": [
    {
      "nom": "PDF",
      "typeMime": {
        "type": "application",
        "subType": "PDF"
      },
      "statutRepresentation": {
        "verbatim": true,
        "canonique": true,
        "officielle": true,
        "transcription": false,
        "enregistrement": false
      },
      "contenu": {
        "documentURI": "/15/amendements/1088/CSPACTE/69.pdf"
      }
    }
  ],
  "dateDepot": "2018-07-27T02:00:00.000+02:00",
  "article99": "0",
  "loiReference": {}
}