{
  "uid": "AMANR5L15SEA717460B0363P0D1N40",
  "identifiant": {
    "legislature": "15",
    "numero": "40",
    "numRect": "0",
    "saisine": {
      "texteLegislatifRef": "PRJLANR5L15B0363",
      "numeroPartiePLF": "0",
      "organeExamen": "PO717460",
      "mentionSecondeDeliberation": "0"
    }
  },
  "numeroLong": "40",
  "etapeTexte": "1ère lecture (1ère assemblée saisie)",
  "triAmendement": "abi",
  "cardinaliteAmdtMultiples": "1",
  "etat": "Discuté",
  "signataires": {
    "auteur": {
      "typeAuteur": "Depute",
      "acteurRef": "PA720230",
      "groupePolitiqueRef": "PO730952"
    },
    "cosignatairesRefs": [
      "PA712014",
      "PA942",
      "PA331582",
      "PA720230"
    ],
    "texteAffichable": "Mme&#160;Magnier,  M.&#160;Charles&#160;de Courson, M.&#160;Philippe&#160;Vigier et M.&#160;Ledoux"
  },
  "pointeurFragmentTexte": {
    "division": {
      "titre": "Article PREMIER",
      "articleDesignationCourte": "ART. PREMIER",
      "type": "ARTICLE",
      "avantAApres": "A",
      "divisionRattachee": "ARTICLE PREMIER",
      "urlDivisionTexteVise": "/15/textes/0363.asp#D_Article_1er"
    },
    "alinea": {
      "avantAApres": "Avant",
      "numero": "1",
      "alineaDesignation": "Avant l'alinéa 1"
    }
  },
  "corps": {
    "dispositif": "<p style=\"text-align: justify;\">I.&#160;&#8211;&#160;Avant l&#8217;alin&#233;a&#160;1, ins&#233;rer les deux alin&#233;as suivants&#160;:</p><p style=\"text-align: justify;\">&#171;&#160;I&#160;A.&#160;&#8211;&#160;Les redevables de l&#8217;imp&#244;t sur les soci&#233;t&#233;s pr&#233;vu &#224; l&#8217;article&#160;205 du code g&#233;n&#233;ral des imp&#244;ts r&#233;alisant un chiffre d&#8217;affaires sup&#233;rieur &#224; 300 millions d&#8217;euros sont assujettis &#224; une contribution exceptionnelle &#233;gale &#224; une fraction de cet imp&#244;t calcul&#233; sur leurs r&#233;sultats imposables, aux taux mentionn&#233;s &#224; l&#8217;article&#160;219 du m&#234;me code des exercices clos &#224; compter du 31 d&#233;cembre 2017 et jusqu&#8217;au 30 d&#233;cembre 2018.</p><p style=\"text-align: justify;\">&#171;&#160;Cette contribution exceptionnelle est &#233;gale &#224; 5&#160;% de l&#8217;imp&#244;t sur les soci&#233;t&#233;s d&#251;, d&#233;termin&#233; avant imputation des r&#233;ductions et cr&#233;dits d&#8217;imp&#244;ts et des cr&#233;ances fiscales de toute nature.&#160;&#187;</p>",
    "exposeSommaire": "<p style=\"text-align: justify;\">Le pr&#233;sent amendement propose l&#8217;instauration d&#8217;une nouvelle tranche &#224; la contribution exceptionnelle sur l&#8217;imp&#244;t sur les soci&#233;t&#233;s pr&#233;vue pour 2017, avec pour objectif de faire &#233;voluer les taux des 2 tranches sup&#233;rieurs, de fa&#231;on &#224; diminuer la pression port&#233; par les 320 entreprises vis&#233;es par le dispositif initial. Malheureusement en l&#8217;&#233;tat actuel des informations dont nous disposons, il nous &#233;tait impossible de calculer l&#8217;ajustement de taux, suite &#224; la cr&#233;ation de la nouvelle tranche, pour que le rendement de la surtaxe d&#8217;IS reste &#233;gal &#224; celui du dispositif initialement pr&#233;vu.</p><p style=\"text-align: justify;\">Nous demandons donc au Gouvernement et &#224; la Direction G&#233;n&#233;ral du Tr&#233;sor, de compl&#233;ter cette proposition avec les donn&#233;es qui se trouvent en leur possession afin de p&#233;renniser le rendement de la contribution exceptionnelle sur l&#8217;imp&#244;t sur les soci&#233;t&#233;s et par l&#224; m&#234;me de diminuer l&#8217;intensit&#233; de l&#8217;effort reposant sur les 320 entreprises initialement vis&#233;es par le dispositif.</p>"
  },
  "representations": [
    {
      "nom": "PDF",
      "typeMime": {
        "type": "application",
        "subType": "PDF"
      },
      "statutRepresentation": {
        "verbatim": true,
        "canonique": true,
        "officielle": true,
        "transcription": false,
        "enregistrement": false
      },
      "contenu": {
        "documentURI": "/15/amendements/0363/AN/40.pdf"
      }
    }
  ],
  "seanceDiscussion": "RUANR5L15S2018IDS20771",
  "sort": {
    "dateSaisie": "2017-11-06T19:35:19.000+01:00",
    "sortEnSeance": "Rejeté"
  },
  "dateDepot": "2017-11-06T01:00:00.000+01:00",
  "dateDistribution": "2017-11-06T01:00:00.000+01:00",
  "article99": "0",
  "loiReference": {}
}