{
  "uid": "AMANR5L15SEA717460BTC0259P0D1N70",
  "identifiant": {
    "legislature": "15",
    "numero": "70",
    "numRect": "0",
    "saisine": {
      "texteLegislatifRef": "PNREANR5L15BTC0259",
      "numeroPartiePLF": "0",
      "organeExamen": "PO717460",
      "mentionSecondeDeliberation": "0"
    }
  },
  "numeroLong": "70",
  "etapeTexte": "Lecture unique",
  "triAmendement": "cw",
  "cardinaliteAmdtMultiples": "1",
  "etat": "A discuter",
  "signataires": {
    "auteur": {
      "typeAuteur": "Depute",
      "acteurRef": "PA719286",
      "groupePolitiqueRef": "PO723569"
    },
    "cosignatairesRefs": [
      "PA719286",
      "PA719146",
      "PA1838",
      "PA719138"
    ],
    "texteAffichable": "M.&#160;Colombani,  M.&#160;Castellani, M.&#160;Acquaviva et M.&#160;Lassalle"
  },
  "pointeurFragmentTexte": {
    "division": {
      "titre": "Article unique",
      "articleDesignationCourte": "APRÈS ART. UNIQUE",
      "type": "ARTICLE",
      "avantAApres": "Apres",
      "divisionRattachee": "APRÈS L'ARTICLE UNIQUE, insérer l'article suivant:",
      "articleAdditionnel": "1",
      "urlDivisionTexteVise": "/15/textes/0259.asp#D_Article_unique"
    }
  },
  "corps": {
    "dispositif": "<p style=\"text-align: justify;\">Apr&#232;s le quatri&#232;me alin&#233;a de l&#8217;article&#160;65 du R&#232;glement, il est ins&#233;r&#233; un 4&#176; ainsi r&#233;dig&#233;&#160;:</p><p style=\"text-align: justify;\">&#171;&#160;4&#176; Sur demande &#233;crite &#233;manant d&#8217;au-moins trois d&#233;put&#233;s non-inscrits lorsqu&#8217;ils sont &#233;lus dans une m&#234;me r&#233;gion et que le nombre de demandeurs est au moins &#233;gal &#224; la moiti&#233; du nombre de d&#233;put&#233;s &#233;lus dans cette r&#233;gion&#160;&#187;.</p>",
    "exposeSommaire": "<p style=\"text-align: justify;\">La demande de scrutin public vise &#224; assurer &#224; la publicit&#233; des votes et la transparence du scrutin.</p><p style=\"text-align: justify;\">Il n&#8217;est pas concevable que les &#171;&#160;non-inscrits&#160;&#187; soient &#233;cart&#233;s de ce droit. En assurant un seuil minimal de 3 d&#233;put&#233;s &#233;lu dans une m&#234;me r&#233;gion et repr&#233;sentant au moins la moiti&#233; des d&#233;put&#233;s qui y sont &#233;lus, le pr&#233;sent amendement permet, lorsqu&#8217;un territoire en particulier est concern&#233; par un dispositif l&#233;gislatif, de manifester clairement la position de la repr&#233;sentation nationale sur un sujet ayant une forte sensibilit&#233; au niveau local.</p>"
  },
  "representations": [
    {
      "nom": "PDF",
      "typeMime": {
        "type": "application",
        "subType": "PDF"
      },
      "statutRepresentation": {
        "verbatim": true,
        "canonique": true,
        "officielle": true,
        "transcription": false,
        "enregistrement": false
      },
      "contenu": {
        "documentURI": "/15/amendements/0259/AN/70.pdf"
      }
    }
  ],
  "dateDepot": "2017-10-06T02:00:00.000+02:00",
  "dateDistribution": "2017-10-09T02:00:00.000+02:00",
  "article99": "0",
  "loiReference": {
    "codeLoi": "R 65"
  }
}