{
  "uid": "AMANR5L15PO757134B1088P0D1N2055",
  "identifiant": {
    "legislature": "15",
    "numero": "2055",
    "numRect": "0",
    "saisine": {
      "texteLegislatifRef": "PRJLANR5L15B1088",
      "numeroPartiePLF": "0",
      "organeExamen": "PO757134",
      "mentionSecondeDeliberation": "0"
    }
  },
  "numeroLong": "2055",
  "etapeTexte": "1ère lecture (1ère assemblée saisie)",
  "triAmendement": "abaaaaaaaaaaaaaaaaaaaaaaaaaaaaaaaaaaaaaaaaaaaaaaaaplac",
  "cardinaliteAmdtMultiples": "1",
  "etat": "Discuté",
  "signataires": {
    "auteur": {
      "typeAuteur": "Depute",
      "acteurRef": "PA720960",
      "groupePolitiqueRef": "PO730964"
    },
    "cosignatairesRefs": [
      "PA605518",
      "PA721110",
      "PA721644",
      "PA718728",
      "PA721012",
      "PA267901",
      "PA720960"
    ],
    "texteAffichable": "M.&#160;Serva,  Mme&#160;K&#233;clard-Mond&#233;sir, M.&#160;Kokouendo, Mme&#160;Sanquer, Mme&#160;Vanceunebrock-Mialon, M.&#160;Kamardine et M.&#160;Fran&#231;ois-Michel&#160;Lambert"
  },
  "pointeurFragmentTexte": {
    "division": {
      "titre": "Article PREMIER",
      "articleDesignationCourte": "ART. PREMIER",
      "type": "ARTICLE",
      "avantAApres": "A",
      "divisionRattachee": "ARTICLE PREMIER",
      "urlDivisionTexteVise": "/15/textes/1088.asp#D_Article_1er"
    },
    "alinea": {
      "avantAApres": "Apres",
      "numero": "10"
    }
  },
  "corps": {
    "dispositif": "<p style=\"text-align: justify;\">I. &#8211; Apr&#232;s l&#8217;alin&#233;a&#160;10, ins&#233;rer l&#8217;alin&#233;a suivant&#160;:</p><p style=\"text-align: justify;\">&#171;&#160;Parall&#232;lement &#224; la mise en place de la proc&#233;dure d&#233;mat&#233;rialis&#233;e de d&#233;p&#244;t &#233;lectronique aupr&#232;s d&#8217;un organisme unique pr&#233;vu au second alin&#233;a du pr&#233;sent article, et &#224; titre de d&#233;rogation, les entreprises des collectivit&#233;s r&#233;gies par l&#8217;article&#160;73 de la Constitution, Saint-Martin et Saint-Pierre-et-Miquelon peuvent continuer &#224; instruire leurs dossiers au sein de centres de formalit&#233; des entreprises physiques pendant une dur&#233;e ne pouvant exc&#233;der cinq ans &#224; compter de l&#8217;adoption de cette loi.&#160;&#187;</p><p style=\"text-align: justify;\">II.&#160;&#8211;&#160;Compl&#233;ter cet article par l&#8217;alin&#233;a suivant&#160;:</p><p style=\"text-align: justify;\">&#171;&#160;IX.&#160;&#8211;&#160;La perte de recettes pour l&#8217;&#201;tat est compens&#233;e &#224; due concurrence par la cr&#233;ation d&#8217;une taxe additionnelle aux droits mentionn&#233;s aux articles 575 et 575 A du code g&#233;n&#233;ral des imp&#244;ts.&#160;&#187;.</p>",
    "exposeSommaire": "<p>La fracture num&#233;rique en outre-mer est beaucoup plus profonde que dans l&#8217;hexagone, notamment dans les d&#233;partements de la Guyane et de Mayotte.</p><p>L&#8217;article premier de ce projet de loi risque de l&#8217;alourdir encore en &#233;loignant un peu plus les personnes qui ne ma&#238;trisent pas les outils num&#233;riques des possibilit&#233;s de cr&#233;ation d&#8217;entreprise. L&#8217;effet contre-intuitif de la r&#233;forme, serait finalement d&#8217;&#233;liminer de la comp&#233;tition &#233;conomique ceux qui ne poss&#232;dent pas les rudiments de l&#8217;informatique et a fortiori les leviers du num&#233;rique.</p><p>&#160;Cet amendement vise donc &#224; ouvrir une option &#224; la disposition des ultra-marins en leur permettant de b&#233;n&#233;ficier &#224; la fois d&#8217;un service en ligne et d&#8217;un service physique.</p><p>&#160;</p>"
  },
  "representations": [
    {
      "nom": "PDF",
      "typeMime": {
        "type": "application",
        "subType": "PDF"
      },
      "statutRepresentation": {
        "verbatim": true,
        "canonique": true,
        "officielle": true,
        "transcription": false,
        "enregistrement": false
      },
      "contenu": {
        "documentURI": "/15/amendements/1088/CSPACTE/2055.pdf"
      }
    }
  ],
  "sort": {
    "dateSaisie": "2018-09-06T16:12:40.000+02:00",
    "sortEnSeance": "Non soutenu"
  },
  "dateDepot": "2018-09-03T02:00:00.000+02:00",
  "dateDistribution": "2018-09-05T02:00:00.000+02:00",
  "article99": "0",
  "loiReference": {}
}