{
  "uid": "AMANR5L15PO757134B1088P0D1N1992",
  "identifiant": {
    "legislature": "15",
    "numero": "1992",
    "numRect": "0",
    "saisine": {
      "texteLegislatifRef": "PRJLANR5L15B1088",
      "numeroPartiePLF": "0",
      "organeExamen": "PO757134",
      "mentionSecondeDeliberation": "0"
    }
  },
  "numeroLong": "1992",
  "etapeTexte": "1ère lecture (1ère assemblée saisie)",
  "triAmendement": "kkiaaaaaaaaaaaaaaaaaaaaaaaaaaaaaaaaaaaaaaaaaaaaaaaazzzzzzzs",
  "cardinaliteAmdtMultiples": "1",
  "etat": "Discuté",
  "signataires": {
    "auteur": {
      "typeAuteur": "Depute",
      "acteurRef": "PA720728",
      "groupePolitiqueRef": "PO730970"
    },
    "cosignatairesRefs": [
      "PA719874",
      "PA720162",
      "PA720728",
      "PA718978",
      "PA720746"
    ],
    "texteAffichable": "M.&#160;Mattei,  M.&#160;Bolo, Mme&#160;Jacquier-Laforge, M.&#160;Laqhila et M.&#160;Waserman"
  },
  "pointeurFragmentTexte": {
    "division": {
      "titre": "Article 41",
      "articleDesignationCourte": "ART. 41",
      "type": "ARTICLE",
      "avantAApres": "A",
      "divisionRattachee": "ARTICLE 41",
      "urlDivisionTexteVise": "/15/textes/1088.asp#D_Article_41"
    },
    "alinea": {
      "numero": "17"
    }
  },
  "corps": {
    "dispositif": "<p style=\"text-align: justify;\">Compl&#233;ter l&#8217;alin&#233;a&#160;17 par deux phrases ainsi r&#233;dig&#233;es&#160;:</p><p style=\"text-align: justify;\">&#171;&#160;Dans ce cas, il verse &#224; l&#8217;universit&#233; dont il rel&#232;ve, les cinq premi&#232;res ann&#233;es, une contribution annuelle &#233;gale &#224; 5&#160;% des b&#233;n&#233;fices d&#233;gag&#233;s par la soci&#233;t&#233;. Les modalit&#233;s d&#8217;application du pr&#233;sent article seront fix&#233;es par d&#233;cret en Conseil d&#8217;&#201;tat.&#160;&#187;</p><p style=\"text-align: justify;\"><br /><br /></p>",
    "exposeSommaire": "<p style=\"text-align: justify;\">Cet amendement vise &#224; accro&#238;tre l&#8217;effet lib&#233;rateur pour l&#8217;&#233;conomie que constitue le d&#233;veloppement de projets innovants par les chercheurs et scientifiques. Il propose donc de permettre &#224; ces derniers d&#8217;&#234;tre associ&#233;s ou dirigeants d&#8217;une entreprise cr&#233;&#233;e pour d&#233;velopper leurs inventions, et de reverser une partie du b&#233;n&#233;fice &#224; l&#8217;Universit&#233; &#224; laquelle ils sont rattach&#233;s, ce qui constituerait un financement innovant de la recherche fran&#231;aise.</p>"
  },
  "representations": [
    {
      "nom": "PDF",
      "typeMime": {
        "type": "application",
        "subType": "PDF"
      },
      "statutRepresentation": {
        "verbatim": true,
        "canonique": true,
        "officielle": true,
        "transcription": false,
        "enregistrement": false
      },
      "contenu": {
        "documentURI": "/15/amendements/1088/CSPACTE/1992.pdf"
      }
    }
  ],
  "sort": {
    "dateSaisie": "2018-09-14T15:24:22.000+02:00",
    "sortEnSeance": "Retiré"
  },
  "dateDepot": "2018-09-03T02:00:00.000+02:00",
  "dateDistribution": "2018-09-11T02:00:00.000+02:00",
  "article99": "0",
  "loiReference": {}
}