{
  "uid": "AMANR5L15SEA717460BTC2208P0D1N91",
  "identifiant": {
    "legislature": "15",
    "numero": "91",
    "numRect": "0",
    "saisine": {
      "texteLegislatifRef": "PIONANR5L15BTC2208",
      "numeroPartiePLF": "0",
      "organeExamen": "PO717460",
      "mentionSecondeDeliberation": "0"
    }
  },
  "numeroLong": "91",
  "etapeTexte": "1ère lecture (2ème assemblée saisie)",
  "triAmendement": "haaaaaaaaaaaaaaaaaaaaaaaaaaaaaaaaaaaaaaaaaaaaaaaaab",
  "cardinaliteAmdtMultiples": "1",
  "etat": "Irrecevable",
  "signataires": {
    "auteur": {
      "typeAuteur": "Depute",
      "acteurRef": "PA335999",
      "groupePolitiqueRef": "PO723569"
    },
    "cosignatairesRefs": [
      "PA335999"
    ],
    "texteAffichable": "Mme&#160;Batho"
  },
  "pointeurFragmentTexte": {
    "division": {
      "titre": "Article 4 bis A",
      "articleDesignationCourte": "ART. 4 BIS A",
      "type": "ARTICLE",
      "avantAApres": "A",
      "divisionRattachee": "ARTICLE 4 BIS A",
      "urlDivisionTexteVise": "/15/textes/2208.asp#D_Article_4_bis_A"
    },
    "alinea": {
      "numero": "4"
    }
  },
  "corps": {},
  "representations": [
    {
      "nom": "PDF",
      "typeMime": {
        "type": "application",
        "subType": "PDF"
      },
      "statutRepresentation": {
        "verbatim": true,
        "canonique": true,
        "officielle": true,
        "transcription": false,
        "enregistrement": false
      },
      "contenu": {
        "documentURI": "/15/amendements/2208/AN/91.pdf"
      }
    }
  ],
  "dateDepot": "2019-09-13T02:00:00.000+02:00",
  "dateDistribution": "2019-09-17T02:00:00.000+02:00",
  "article99": "0",
  "loiReference": {
    "codeLoi": "c  électoral",
    "divisionCodeLoi": "L157"
  }
}