{
  "uid": "AMANR5L15SEA717460BTC1237P0D1N1661",
  "identifiant": {
    "legislature": "15",
    "numero": "1661",
    "numRect": "0",
    "saisine": {
      "texteLegislatifRef": "PRJLANR5L15BTC1237",
      "numeroPartiePLF": "0",
      "organeExamen": "PO717460",
      "mentionSecondeDeliberation": "0"
    }
  },
  "numeroLong": "1661",
  "etapeTexte": "1ère lecture (1ère assemblée saisie)",
  "triAmendement": "caaaaaaaaaaaaaaaaaaaaaaaaaaaaaaaaaaaaaaaaaaaaaaaaachns",
  "cardinaliteAmdtMultiples": "1",
  "etat": "Discuté",
  "signataires": {
    "auteur": {
      "typeAuteur": "Depute",
      "acteurRef": "PA720386",
      "groupePolitiqueRef": "PO730934"
    },
    "cosignatairesRefs": [
      "PA266797",
      "PA721968",
      "PA267527",
      "PA721506",
      "PA718780",
      "PA642847",
      "PA719318",
      "PA266776",
      "PA718884",
      "PA346054",
      "PA718850",
      "PA721474",
      "PA267429",
      "PA712015",
      "PA266808",
      "PA718838",
      "PA720386",
      "PA346218",
      "PA720684",
      "PA1874"
    ],
    "texteAffichable": "M.&#160;Di Filippo,  Mme&#160;Anthoine, M.&#160;Bazin, Mme&#160;Bazin-Malgras, M.&#160;Brun, M.&#160;Cinieri, M.&#160;Cordier, M.&#160;Dive, M.&#160;Pierre-Henri&#160;Dumont, M.&#160;Gosselin, Mme&#160;Kuster, M.&#160;Le Fur, M.&#160;Emmanuel&#160;Maquet, M.&#160;Masson, M.&#160;Reiss, M.&#160;Saddier, Mme&#160;Trastour-Isnart, M.&#160;Vialay, M.&#160;Viry et M.&#160;Rolland"
  },
  "pointeurFragmentTexte": {
    "division": {
      "titre": "Article 19 septies",
      "articleDesignationCourte": "APRÈS ART. 19 SEPTIES",
      "type": "ARTICLE",
      "avantAApres": "Apres",
      "divisionRattachee": "APRÈS L'ARTICLE 19 SEPTIES, insérer l'article suivant:",
      "articleAdditionnel": "1",
      "urlDivisionTexteVise": "/15/textes/1237.asp#D_Article_19_septies"
    }
  },
  "corps": {
    "dispositif": "<p style=\"text-align: justify;\">Le quatri&#232;me alin&#233;a de l&#8217;article L.&#160;581&#8209;19 du code de l&#8217;environnement est compl&#233;t&#233; par les mots&#160;: &#171;&#160;, les activit&#233;s de restauration et d&#8217;h&#244;tellerie et les commerces alimentaires&#160;&#187;.</p>",
    "exposeSommaire": "<p style=\"text-align: justify;\">Les pr&#233;-enseignes d&#233;rogatoires (panneaux de signalisation aux abords des agglom&#233;rations) &#233;taient un moyen efficace de faire venir de la client&#232;le dans les &#233;tablissements ruraux qui y avaient recours, en leur permettant une visibilit&#233; certaine aupr&#232;s des usagers de la route. Cependant, depuis le 13 juillet 2015, dans le cadre de la loi Grenelle 2, ces enseignes sont interdites hors des agglom&#233;rations et dans les communes de moins de 10 000 habitants. La signalisation d&#8217;information locale (SIL) pr&#233;vue en remplacement est totalement inadapt&#233;e &#224; sa fonction&#160;: son mauvais positionnement, son manque d&#8217;information sur l&#8217;&#233;tablissement, ses petits caract&#232;res et ses couleurs monotones la rende peu lisible et peu attractive. De ce fait, les &#233;ventuels clients n&#8217;arrivent plus &#224; trouver les &#233;tablissements et ne s&#8217;arr&#234;tent plus dans les villages. Ainsi d&#233;pourvus de visibilit&#233;, les restaurants et h&#244;tels ruraux payent le prix fort, notamment ceux situ&#233;s hors des centres bourgs. Cela conduit &#224; une perte de chiffre d&#8217;affaires colossale allant jusqu&#8217;&#224; 25&#160;% selon l&#8217;Union des m&#233;tiers et des industries de l&#8217;h&#244;tellerie (UMIH) et la F&#233;d&#233;ration internationale des logis (FIL). L&#8217;interdiction des pr&#233;-enseignes est une mesure contre-productive qui va &#224; l&#8217;encontre de toutes les politiques de revitalisation des zones les plus fragilis&#233;es de notre pays. La suppression de ces enseignes p&#233;nalise fortement 60&#160;% des h&#244;teliers-restaurateurs ind&#233;pendants et &#224; exerce une discrimination commerciale au d&#233;triment des commerces ruraux. Pour alerter le Gouvernement sur les difficult&#233;s de l&#8217;&#233;conomie rurale et pour l&#8217;encourager &#224; soutenir les commerces de proximit&#233; et leur permettre d&#8217;&#234;tre visibles et accessibles, l&#8217;UMIH, la FIL et l&#8217;Association des maires ruraux de France ont d&#233;ploy&#233; une campagne &#171;&#160;S&#8217;afficher, c&#8217;est exister&#160;&#187;. L&#8217;objet de cet amendement est de demander qu&#8217;une suite favorable soit apport&#233;e aux demandes de ces commerces, h&#244;tels et restaurants ruraux qui comptent sur les pr&#233;-enseignes pour assurer leur survie.</p>"
  },
  "representations": [
    {
      "nom": "PDF",
      "typeMime": {
        "type": "application",
        "subType": "PDF"
      },
      "statutRepresentation": {
        "verbatim": true,
        "canonique": true,
        "officielle": true,
        "transcription": false,
        "enregistrement": false
      },
      "contenu": {
        "documentURI": "/15/amendements/1237/AN/1661.pdf"
      }
    }
  ],
  "seanceDiscussion": "RUANR5L15S2018IDS21254",
  "sort": {
    "dateSaisie": "2018-09-28T16:17:10.000+02:00",
    "sortEnSeance": "Non soutenu"
  },
  "dateDepot": "2018-09-21T02:00:00.000+02:00",
  "dateDistribution": "2018-09-24T02:00:00.000+02:00",
  "article99": "0",
  "loiReference": {
    "codeLoi": "c environnement",
    "divisionCodeLoi": "L581-19"
  }
}