{
  "uid": "AMANR5L15SEA717460BTC2401P0D1N1298",
  "identifiant": {
    "legislature": "15",
    "numero": "1298",
    "numRect": "0",
    "saisine": {
      "texteLegislatifRef": "PRJLANR5L15BTC2401",
      "numeroPartiePLF": "0",
      "organeExamen": "PO717460",
      "mentionSecondeDeliberation": "0"
    }
  },
  "numeroLong": "1298",
  "etapeTexte": "1ère lecture (2ème assemblée saisie)",
  "triAmendement": "csaaaaaaaaaaaaaaaaaaaaaaaaaaaaaaaaaaaaaaaaaaaaaaaab",
  "cardinaliteAmdtMultiples": "1",
  "etat": "Retiré",
  "signataires": {
    "auteur": {
      "typeAuteur": "Depute",
      "acteurRef": "PA722398",
      "groupePolitiqueRef": "PO730964"
    },
    "cosignatairesRefs": [
      "PA722398"
    ],
    "texteAffichable": "M.&#160;Rebeyrotte"
  },
  "pointeurFragmentTexte": {
    "division": {
      "titre": "Article 11 ter",
      "articleDesignationCourte": "APRÈS ART. 11 TER",
      "type": "ARTICLE",
      "avantAApres": "Apres",
      "divisionRattachee": "APRÈS L'ARTICLE 11 TER, insérer l'article suivant:",
      "articleAdditionnel": "1",
      "urlDivisionTexteVise": "/15/textes/2401.asp#D_Article_11_ter"
    }
  },
  "corps": {},
  "representations": [
    {
      "nom": "PDF",
      "typeMime": {
        "type": "application",
        "subType": "PDF"
      },
      "statutRepresentation": {
        "verbatim": true,
        "canonique": true,
        "officielle": true,
        "transcription": false,
        "enregistrement": false
      },
      "contenu": {
        "documentURI": "/15/amendements/2401/AN/1298.pdf"
      }
    }
  ],
  "dateDepot": "2019-11-14T01:00:00.000+01:00",
  "dateDistribution": "2019-11-15T01:00:00.000+01:00",
  "article99": "0",
  "loiReference": {
    "codeLoi": "CGCT",
    "divisionCodeLoi": "1609 nonies C"
  }
}