{
  "uid": "AMANR5L15PO420120B1681P0D1N744",
  "identifiant": {
    "legislature": "15",
    "numero": "744",
    "numRect": "0",
    "saisine": {
      "texteLegislatifRef": "PRJLANR5L15B1681",
      "numeroPartiePLF": "0",
      "organeExamen": "PO420120",
      "mentionSecondeDeliberation": "0"
    }
  },
  "numeroLong": "AS744",
  "etapeTexte": "1ère lecture (1ère assemblée saisie)",
  "triAmendement": "bpaaaaaaaaaaaaaaaaaaaaaaaaaaaaaaaaaaaaaaaaaaaaaaaaaaadhvs",
  "cardinaliteAmdtMultiples": "1",
  "etat": "Discuté",
  "signataires": {
    "auteur": {
      "typeAuteur": "Depute",
      "acteurRef": "PA331582",
      "groupePolitiqueRef": "PO759900"
    },
    "cosignatairesRefs": [
      "PA608292",
      "PA331582"
    ],
    "texteAffichable": "M.&#160;Philippe&#160;Vigier et Mme&#160;Dubi&#233;"
  },
  "pointeurFragmentTexte": {
    "division": {
      "titre": "Article 7",
      "articleDesignationCourte": "APRÈS ART. 7",
      "type": "ARTICLE",
      "avantAApres": "Apres",
      "divisionRattachee": "APRÈS L'ARTICLE 7, insérer l'article suivant:",
      "articleAdditionnel": "1",
      "urlDivisionTexteVise": "/15/textes/1681.asp#D_Article_7"
    }
  },
  "corps": {
    "dispositif": "<p style=\"text-align: justify;\">Au dernier alin&#233;a de l&#8217;article L.&#160;4161&#8209;1 du code de la sant&#233; publique, apr&#232;s le mot&#160;: &#171;&#160;m&#233;dicale&#160;&#187;, sont ins&#233;r&#233;s les mots&#160;: &#171;&#160;ainsi que pour certains actes d&#8217;anatomie et cytologie pathologique dans les conditions d&#233;termin&#233;es par un d&#233;cret pris en Conseil d&#8217;&#201;tat.&#160;&#187;</p>",
    "exposeSommaire": "<p style=\"text-align: justify;\">A l&#8217;heure actuelle, et conform&#233;ment &#224; l&#8217;article L.&#160;6211&#8209;1 du Code de la sant&#233; publique, les pr&#233;l&#232;vements d&#8217;anatomo-cytopathologie, bien que cot&#233;s &#224; la nomenclature des actes de biologie m&#233;dicale (NABM), restent de la comp&#233;tence des m&#233;decins. Cependant, si les biologistes m&#233;dicaux pharmaciens sont form&#233;s et r&#233;alisent quotidiennement des pr&#233;l&#232;vements vaginaux en vue d&#8217;examens cytologiques, bact&#233;riologiques ou virologiques, ils sont contraints de renvoyer les patientes vers des m&#233;decins pour la r&#233;alisation de frottis cervico-vaginaux &#224; des fins de d&#233;pistage du cancer du col de l&#8217;ut&#233;rus.</p><p style=\"text-align: justify;\">&#160;</p><p style=\"text-align: justify;\">Permettre aux biologistes m&#233;dicaux pharmaciens d&#8217;effectuer ce type de pr&#233;l&#232;vement faciliterait l&#8217;acc&#232;s au d&#233;pistage du cancer du col de l&#8217;ut&#233;rus.</p><p style=\"text-align: justify;\"><br /> &#160;</p>"
  },
  "representations": [
    {
      "nom": "PDF",
      "typeMime": {
        "type": "application",
        "subType": "PDF"
      },
      "statutRepresentation": {
        "verbatim": true,
        "canonique": true,
        "officielle": true,
        "transcription": false,
        "enregistrement": false
      },
      "contenu": {
        "documentURI": "/15/amendements/1681/CION-SOC/AS744.pdf"
      }
    }
  ],
  "sort": {
    "dateSaisie": "2019-03-13T17:15:03.000+01:00",
    "sortEnSeance": "Rejeté"
  },
  "dateDepot": "2019-03-08T01:00:00.000+01:00",
  "dateDistribution": "2019-03-12T01:00:00.000+01:00",
  "article99": "0",
  "loiReference": {
    "codeLoi": "santé publique",
    "divisionCodeLoi": "L4161-1"
  }
}