{
  "uid": "AMANR5L15PO757134B1673P0D1N1032",
  "identifiant": {
    "legislature": "15",
    "numero": "1032",
    "numRect": "0",
    "saisine": {
      "texteLegislatifRef": "PRJLANR5L15B1673",
      "numeroPartiePLF": "0",
      "organeExamen": "PO757134",
      "mentionSecondeDeliberation": "0"
    }
  },
  "numeroLong": "1032",
  "etapeTexte": "Nouvelle Lecture",
  "triAmendement": "beoaaaaaaaaaaaaaaaaaaaaaaaaaaaaaaaaaaaaaaaaaaaaaaaqhi",
  "cardinaliteAmdtMultiples": "1",
  "etat": "Discuté",
  "signataires": {
    "auteur": {
      "typeAuteur": "Depute",
      "acteurRef": "PA720162",
      "groupePolitiqueRef": "PO730970"
    },
    "cosignatairesRefs": [
      "PA719504",
      "PA721182",
      "PA717151",
      "PA720334",
      "PA720704",
      "PA719558",
      "PA719874",
      "PA720924",
      "PA721984",
      "PA720720",
      "PA722284",
      "PA722162",
      "PA719942",
      "PA721234",
      "PA720772",
      "PA721992",
      "PA719266",
      "PA719640",
      "PA720598",
      "PA720002",
      "PA721418",
      "PA721976",
      "PA719210",
      "PA720652",
      "PA719044",
      "PA721924",
      "PA720764",
      "PA718978",
      "PA720092",
      "PA720256",
      "PA720178",
      "PA720746",
      "PA720728",
      "PA720976",
      "PA721608",
      "PA719488",
      "PA719918",
      "PA720326",
      "PA721734",
      "PA720162",
      "PA722374",
      "PA721530",
      "PA720968",
      "PA1276",
      "PA721742"
    ],
    "texteAffichable": "M.&#160;Bolo,  M.&#160;Mattei, Mme&#160;Jacquier-Laforge, M.&#160;Laqhila, M.&#160;Waserman, M.&#160;Balanant, Mme&#160;Bannier, M.&#160;Baudu, Mme&#160;Benin, M.&#160;Berta, M.&#160;Bourlanges, M.&#160;Bru, M.&#160;Cubertafon, Mme&#160;de Sarnez, Mme&#160;de Vaucouleurs, Mme&#160;Deprez-Audebert, M.&#160;Duverg&#233;, Mme&#160;El Ha&#239;ry, Mme&#160;Elimas, Mme&#160;Essayan, M.&#160;Fanget, Mme&#160;Florennes, M.&#160;Fuchs, Mme&#160;Gallerneau, M.&#160;Garcia, M.&#160;Hammouche, M.&#160;Isaac-Sibille, M.&#160;Joncour, M.&#160;Lagleize, M.&#160;Lain&#233;, Mme&#160;Lasserre-David, M.&#160;Latombe, Mme&#160;Luquet, M.&#160;Mathiasin, Mme&#160;Mette, M.&#160;Michel-Kleisbauer, M.&#160;Mignola, M.&#160;Millienne, M.&#160;Pahun, M.&#160;Fr&#233;d&#233;ric&#160;Petit, Mme&#160;Maud&#160;Petit, Mme&#160;Poueyto, M.&#160;Ramos, M.&#160;Turquois et Mme&#160;Vichnievsky"
  },
  "pointeurFragmentTexte": {
    "division": {
      "titre": "Article 13",
      "articleDesignationCourte": "ART. 13",
      "type": "ARTICLE",
      "avantAApres": "A",
      "divisionRattachee": "ARTICLE 13",
      "urlDivisionTexteVise": "/15/textes/1673.asp#D_Article_13"
    },
    "alinea": {
      "numero": "73"
    }
  },
  "corps": {
    "dispositif": "<p>Au d&#233;but de la seconde phrase de l'alin&#233;a 73, substituer aux mots&#160;: </p><p>&#171;&#160;La convention collective nationale en fixe&#160;&#187;,</p><p>les mots&#160;: </p><p>&#171;&#160;Les conventions et accords mentionn&#233;s &#224; l&#8217;article L.&#160;711&#8209;16 du code de commerce en fixent&#160;&#187;.</p>",
    "exposeSommaire": "<p style=\"text-align: justify;\">Cet amendement vise &#224; ajuster les modifications apport&#233;es aux dispositions concernant les conventions et accords collectifs qui seront applicables aux personnels des chambres de commerce et d&#8217;industrie (CCI). Cela permettra de garantir la possibilit&#233; d&#8217;adaptations au niveau r&#233;gional par les CCI de r&#233;gion.&#160;</p>"
  },
  "representations": [
    {
      "nom": "PDF",
      "typeMime": {
        "type": "application",
        "subType": "PDF"
      },
      "statutRepresentation": {
        "verbatim": true,
        "canonique": true,
        "officielle": true,
        "transcription": false,
        "enregistrement": false
      },
      "contenu": {
        "documentURI": "/15/amendements/1673/CSPACTE/1032.pdf"
      }
    }
  ],
  "sort": {
    "dateSaisie": "2019-03-06T12:21:50.000+01:00",
    "sortEnSeance": "Adopté"
  },
  "dateDepot": "2019-03-02T01:00:00.000+01:00",
  "dateDistribution": "2019-03-05T01:00:00.000+01:00",
  "article99": "0",
  "loiReference": {}
}