{
  "uid": "AMANR5L15PO419865B0627P0D1N263",
  "identifiant": {
    "legislature": "15",
    "numero": "263",
    "numRect": "0",
    "saisine": {
      "texteLegislatifRef": "PRJLANR5L15B0627",
      "numeroPartiePLF": "0",
      "organeExamen": "PO419865",
      "mentionSecondeDeliberation": "0"
    }
  },
  "numeroLong": "CD263",
  "etapeTexte": "1ère lecture (1ère assemblée saisie)",
  "triAmendement": "bezw",
  "cardinaliteAmdtMultiples": "1",
  "etat": "Discuté",
  "signataires": {
    "auteur": {
      "typeAuteur": "Depute",
      "acteurRef": "PA719412",
      "groupePolitiqueRef": "PO730964"
    },
    "cosignatairesRefs": [
      "PA720242",
      "PA720054",
      "PA720538",
      "PA719624",
      "PA719740",
      "PA719922",
      "PA722366",
      "PA720038",
      "PA719882",
      "PA718802",
      "PA719080",
      "PA721600",
      "PA606171",
      "PA722228",
      "PA721514",
      "PA722336",
      "PA609520",
      "PA719412",
      "PA721876",
      "PA718962",
      "PA721426",
      "PA719632",
      "PA720310",
      "PA719092",
      "PA718728",
      "PA719890",
      "PA719194",
      "PA721372",
      "PA720944",
      "PA719972",
      "PA720414",
      "PA722000",
      "PA605518",
      "PA721860",
      "PA718710",
      "PA718894",
      "PA722236",
      "PA605084"
    ],
    "texteAffichable": "Mme&#160;Le Feur,  M.&#160;Djebbari, Mme&#160;Abba, M.&#160;Arend, Mme&#160;Pascale&#160;Boyer, Mme&#160;Brulebois, M.&#160;Buchou, M.&#160;Causse, M.&#160;Cesarini, M.&#160;Colas-Roy, Mme&#160;Couillard, Mme&#160;Yolaine&#160;de Courson, Mme&#160;De Temmerman, M.&#160;Dombreval, M.&#160;Fugit, M.&#160;Haury, Mme&#160;Josso, Mme&#160;Kerbarh, M.&#160;Krabal, M.&#160;Fran&#231;ois-Michel&#160;Lambert, M.&#160;Leclabart, Mme&#160;Marsaud, Mme&#160;Meynier-Millefert, M.&#160;Morenas, Mme&#160;Panonacle, Mme&#160;Park, M.&#160;Perea, M.&#160;Perrot, M.&#160;Pichereau, Mme&#160;Pompili, Mme&#160;Riotton, Mme&#160;Rossi, Mme&#160;Sarles, M.&#160;Thi&#233;baut, Mme&#160;Tuffnell, Mme&#160;Vanceunebrock-Mialon, M.&#160;Zulesi, M.&#160;Ferrand et les membres du groupe La R&#233;publique en Marche"
  },
  "pointeurFragmentTexte": {
    "division": {
      "titre": "Article 15",
      "articleDesignationCourte": "ART. 15",
      "type": "ARTICLE",
      "avantAApres": "A",
      "divisionRattachee": "ARTICLE 15",
      "urlDivisionTexteVise": "/15/textes/0627.asp#D_Article_15"
    },
    "alinea": {
      "avantAApres": "A",
      "numero": "10",
      "alineaDesignation": "Alinéa 10"
    }
  },
  "corps": {
    "dispositif": "<p style=\"text-align: justify;\">Compl&#233;ter l&#8217;alin&#233;a&#160;10 par les mots&#160;:</p><p style=\"text-align: justify;\">&#171;&#160;et d&#8217;approvisionnement durable&#160;&#187;.</p>",
    "exposeSommaire": "<p style=\"text-align: justify;\">Le pr&#233;sent amendement vise &#224; &#233;tendre l&#8217;obligation de diagnostic impos&#233;e par l&#8217;article 15 pour chaque structure de restauration collective &#224; une obligation de diagnostic d&#8217;approvisionnement durable.</p><p style=\"text-align: justify;\">Cette extension permettra de s&#8217;assurer que chaque op&#233;rateur de restauration collective fera un diagnostic approvisionnement durable. L&#8217;objectif est de lier la lutte contre le gaspillage alimentaire et l&#8217;approvisionnement durable, ce qui a du sens puisque l&#8217;&#233;conomie de r&#233;alis&#233;e par repas gr&#226;ce &#224; la r&#233;duction du gaspillage alimentaire (de l&#8217;ordre de 10 &#224; 15 centimes par repas) permet d&#8217;am&#233;liorer la qualit&#233; des produits acquis.</p><p style=\"text-align: justify;\">Par la mise en place de cette obligation, chaque op&#233;rateur de restauration collective est ainsi invit&#233; &#224; r&#233;fl&#233;chir &#224; la question de l&#8217;approvisionnement durable et &#224; la lier avec celle de la lutte contre le gaspillage alimentaire.</p>"
  },
  "representations": [
    {
      "nom": "PDF",
      "typeMime": {
        "type": "application",
        "subType": "PDF"
      },
      "statutRepresentation": {
        "verbatim": true,
        "canonique": true,
        "officielle": true,
        "transcription": false,
        "enregistrement": false
      },
      "contenu": {
        "documentURI": "/15/amendements/0627/CION-DVP/CD263.pdf"
      }
    }
  ],
  "sort": {
    "dateSaisie": "2018-03-29T12:45:50.000+02:00",
    "sortEnSeance": "Adopté"
  },
  "dateDepot": "2018-03-23T01:00:00.000+01:00",
  "dateDistribution": "2018-03-26T02:00:00.000+02:00",
  "article99": "0",
  "loiReference": {}
}