{
  "uid": "AMANR5L15SEA717460BTC2243P0D1N1177",
  "identifiant": {
    "legislature": "15",
    "numero": "1177",
    "numRect": "0",
    "saisine": {
      "texteLegislatifRef": "PRJLANR5L15BTC2243",
      "numeroPartiePLF": "0",
      "organeExamen": "PO717460",
      "mentionSecondeDeliberation": "0"
    }
  },
  "numeroLong": "1177",
  "etapeTexte": "1ère lecture (1ère assemblée saisie)",
  "triAmendement": "dsaaaaaaaaaaaaaaaaaaaaaaaaaaaaaaaaaaaaaaaaaaaaaaaagtdhi",
  "cardinaliteAmdtMultiples": "1",
  "etat": "Discuté",
  "signataires": {
    "auteur": {
      "typeAuteur": "Depute",
      "acteurRef": "PA1874",
      "groupePolitiqueRef": "PO730934"
    },
    "cosignatairesRefs": [
      "PA2492",
      "PA608016",
      "PA1874",
      "PA609726",
      "PA709315",
      "PA330684"
    ],
    "texteAffichable": "M.&#160;Le Fur,  Mme&#160;Val&#233;rie&#160;Boyer, Mme&#160;Louwagie, M.&#160;Quentin, M.&#160;Viala et M.&#160;Aubert"
  },
  "pointeurFragmentTexte": {
    "division": {
      "titre": "Article 14",
      "articleDesignationCourte": "ART. 14",
      "type": "ARTICLE",
      "avantAApres": "A",
      "divisionRattachee": "ARTICLE 14",
      "urlDivisionTexteVise": "/15/textes/2243.asp#D_Article_14"
    },
    "alinea": {
      "avantAApres": "A",
      "numero": "11",
      "alineaDesignation": "Alinéa 11"
    }
  },
  "corps": {
    "dispositif": "<p style=\"text-align: justify;\">Compl&#233;ter l&#8217;alin&#233;a&#160;11 par la phrase suivante&#160;:</p><p style=\"text-align: justify;\">&#171;&#160;Dans le cas o&#249; les deux membres du couple ou le membre survivant consentent &#224; ce que leurs embryons humains surnum&#233;raires fassent l&#8217;objet de recherches, ils sont inform&#233;s de la nature des recherches projet&#233;es afin de leur permettre de donner un consentement libre et &#233;clair&#233;.&#160;&#187;</p>",
    "exposeSommaire": "<p style=\"text-align: justify;\">Alors que la m&#233;decine ne cesse de progresser dans la qualit&#233; de l&#8217;information donn&#233;e au patient, et que dans tous les domaines on s&#8217;assure que le consentement donn&#233; soit toujours &#171;&#160;libre et &#233;clair&#233;&#160;&#187;, afin de respecter la libert&#233; de chacun dans ce qu&#8217;elle a de plus pr&#233;cieux, voil&#224; l&#8217;objet de cet amendement.</p>"
  },
  "representations": [
    {
      "nom": "PDF",
      "typeMime": {
        "type": "application",
        "subType": "PDF"
      },
      "statutRepresentation": {
        "verbatim": true,
        "canonique": true,
        "officielle": true,
        "transcription": false,
        "enregistrement": false
      },
      "contenu": {
        "documentURI": "/15/amendements/2243/AN/1177.pdf"
      }
    }
  ],
  "seanceDiscussion": "RUANR5L15S2020IDS21848",
  "sort": {
    "dateSaisie": "2019-10-04T17:52:42.000+02:00",
    "sortEnSeance": "Non soutenu"
  },
  "dateDepot": "2019-09-18T02:00:00.000+02:00",
  "dateDistribution": "2019-09-30T02:00:00.000+02:00",
  "article99": "0",
  "loiReference": {}
}