{
  "uid": "AMANR5L15SEA717460BTC1396P0D1N1428",
  "identifiant": {
    "legislature": "15",
    "numero": "1428",
    "numRect": "0",
    "saisine": {
      "texteLegislatifRef": "PRJLANR5L15BTC1396",
      "numeroPartiePLF": "0",
      "organeExamen": "PO717460",
      "mentionSecondeDeliberation": "0"
    }
  },
  "numeroLong": "1428",
  "etapeTexte": "1ère lecture (2ème assemblée saisie)",
  "triAmendement": "gaaaaaaaaaaaaaaaaaaaaaaaaaaaaaaaaaaaaaaaaaaaaaaaaaephi",
  "cardinaliteAmdtMultiples": "1",
  "etat": "Discuté",
  "signataires": {
    "auteur": {
      "typeAuteur": "Depute",
      "acteurRef": "PA677483",
      "groupePolitiqueRef": "PO730964"
    },
    "cosignatairesRefs": [
      "PA677483"
    ],
    "texteAffichable": "M.&#160;Mazars"
  },
  "pointeurFragmentTexte": {
    "division": {
      "titre": "Article 42",
      "articleDesignationCourte": "ART. 42",
      "type": "ARTICLE",
      "avantAApres": "A",
      "divisionRattachee": "ARTICLE 42",
      "urlDivisionTexteVise": "/15/textes/1396.asp#D_Article_42"
    },
    "alinea": {
      "numero": "38"
    }
  },
  "corps": {
    "dispositif": "<p style=\"text-align: justify;\">Compl&#233;ter l&#8217;alin&#233;a&#160;38 par la phrase suivante&#160;:</p><p style=\"text-align: justify;\">&#171;&#160;Cette &#233;valuation est &#233;tendue, sur le fondement du principe de bonne administration de la justice, aux modalit&#233;s d&#8217;acc&#232;s &#224; l&#8217;instruction et aux cons&#233;quences de celle-ci, tant pour les victimes et les mis en cause, qu&#8217;en mati&#232;re de gestion des personnels, d&#8217;activit&#233; des juges d&#8217;instruction des p&#244;les d&#8217;instruction seuls comp&#233;tents sur le ressort de tribunaux de grande instance sans pole de l&#8217;instruction.&#160;&#187;</p>",
    "exposeSommaire": "<p style=\"text-align: justify;\">Le projet de loi institue une Cour criminelle d&#233;partementale charg&#233;e de juger, en 1<sup>er</sup> ressort les personnes majeures accus&#233;es d&#8217;un crime puni de 15 ans ou 20 ans de r&#233;clusion criminelle, lorsqu&#8217;il n&#8217;est pas commis en &#233;tat de r&#233;cidive l&#233;gale.</p><p style=\"text-align: justify;\">L&#8217;article&#160;52&#8209;1 du code de la proc&#233;dure p&#233;nale fixe actuellement les conditions dans lesquelles les juges d&#8217;instruction composant un p&#244;le d&#8217;instruction sont comp&#233;tents pour connaitre des informations en mati&#232;re de crime. Il &#233;nonce &#233;galement que la liste des tribunaux dans lesquels existe un p&#244;le de l&#8217;instruction et la comp&#233;tence territoriale des juges d&#8217;instruction qui le composent sont d&#233;termin&#233;es par d&#233;cret et que cette comp&#233;tence peut recouvrir le ressort de plusieurs tribunaux de grande instance.</p><p style=\"text-align: justify;\">Il existe actuellement des tribunaux de grande instance sans pole de l&#8217;instruction.</p><p style=\"text-align: justify;\">L&#8217;&#233;valuation propos&#233;e sur l&#8217;institution de la Cour criminelle d&#233;partementale ne peut pas occulter les cons&#233;quences du maintien d&#8217;une instruction des dossiers dans des p&#244;les d&#8217;instruction tr&#232;s &#233;loign&#233;s du si&#232;ge du TGI comp&#233;tent pour statuer et d&#233;pourvu lui-m&#234;me de p&#244;le d&#8217;instruction&#160;: temps de l&#8217;instruction, accessibilit&#233; des victimes, charge des p&#244;les d&#8217;instruction, &#8230; L&#8217;objectif de rendre une Justice plus proche, efficace et rapide pourrait se trouver priv&#233; de tous aspects positifs sans rapprochement-d&#233;volution de l&#8217;instruction au plus pr&#232;s de la juridiction comp&#233;tente pour statuer.</p>",
    "cartoucheDelaiDepotDepasse": "Sous réserve de son traitement par les services de l'Assemblée nationale et de sa recevabilité"
  },
  "representations": [
    {
      "nom": "PDF",
      "typeMime": {
        "type": "application",
        "subType": "PDF"
      },
      "statutRepresentation": {
        "verbatim": true,
        "canonique": true,
        "officielle": true,
        "transcription": false,
        "enregistrement": false
      },
      "contenu": {
        "documentURI": "/15/amendements/1396/AN/1428.pdf"
      }
    }
  ],
  "seanceDiscussion": "RUANR5L15S2019IDS21378",
  "sort": {
    "dateSaisie": "2018-11-24T02:05:07.000+01:00",
    "sortEnSeance": "Adopté"
  },
  "dateDepot": "2018-11-15T01:00:00.000+01:00",
  "dateDistribution": "2018-11-24T01:00:00.000+01:00",
  "article99": "0",
  "loiReference": {}
}