{
  "uid": "AMANR5L15SEA717460B1297P0D1N999",
  "identifiant": {
    "legislature": "15",
    "numero": "999",
    "numRect": "0",
    "saisine": {
      "texteLegislatifRef": "PRJLANR5L15B1297",
      "numeroPartiePLF": "0",
      "organeExamen": "PO717460",
      "mentionSecondeDeliberation": "0"
    }
  },
  "numeroLong": "999",
  "etapeTexte": "1ère lecture (1ère assemblée saisie)",
  "triAmendement": "eeaaaaaaaaaaaaaaaaaaaaaaaaaaaaaaaaaaaaaaaaaaaaaaaabkabkw",
  "cardinaliteAmdtMultiples": "1",
  "etat": "Discuté",
  "signataires": {
    "auteur": {
      "typeAuteur": "Depute",
      "acteurRef": "PA267780",
      "groupePolitiqueRef": "PO744425"
    },
    "cosignatairesRefs": [
      "PA642868",
      "PA268019",
      "PA720230",
      "PA331567",
      "PA267766",
      "PA267585",
      "PA1960",
      "PA267780",
      "PA719806",
      "PA642935"
    ],
    "texteAffichable": "Mme&#160;Firmin Le Bodo,  Mme&#160;Auconie, M.&#160;Becht, M.&#160;Guy&#160;Bricout, M.&#160;Christophe, Mme&#160;de La Raudi&#232;re, M.&#160;Lagarde, M.&#160;Leroy, Mme&#160;Magnier et M.&#160;Vercamer"
  },
  "pointeurFragmentTexte": {
    "division": {
      "titre": "Article 27",
      "articleDesignationCourte": "ART. 27",
      "type": "ARTICLE",
      "avantAApres": "A",
      "divisionRattachee": "ARTICLE 27",
      "urlDivisionTexteVise": "/15/textes/1297.asp#D_Article_27"
    },
    "alinea": {
      "avantAApres": "Apres",
      "numero": "7"
    }
  },
  "corps": {
    "dispositif": "<p style=\"text-align: justify;\">I.&#160;&#8211;&#160;Apr&#232;s l&#8217;alin&#233;a&#160;7, ins&#233;rer l&#8217;alin&#233;a suivant&#160;:</p><p style=\"text-align: justify;\">&#171;&#160;Le directeur g&#233;n&#233;ral de l&#8217;agence prononce la p&#233;nalit&#233; apr&#232;s avis d&#8217;une commission compos&#233;e &#224; parit&#233; de repr&#233;sentants de l&#8217;agence et de repr&#233;sentants des f&#233;d&#233;rations hospitali&#232;res repr&#233;sentatives publiques ou priv&#233;es. La motivation de la p&#233;nalit&#233; indique, le cas &#233;ch&#233;ant, les raisons pour lesquelles le directeur g&#233;n&#233;ral n&#8217;a pas suivi l&#8217;avis de la commission.&#160;&#187;</p><p style=\"text-align: justify;\">II.&#160;&#8211;&#160;En cons&#233;quence, apr&#232;s l&#8217;alin&#233;a&#160;12, ins&#233;rer l&#8217;alin&#233;a suivant&#160;:</p><p style=\"text-align: justify;\">&#171;&#160;Cet arr&#234;t&#233; est publi&#233; avant le 31 d&#233;cembre de l&#8217;ann&#233;e pr&#233;c&#233;dant l&#8217;ann&#233;e civile consid&#233;r&#233;e.&#160;&#187;</p>",
    "exposeSommaire": "<p style=\"text-align: justify;\">L&#8217;article&#160;27 du PLFSS tend au d&#233;veloppement du financement par la qualit&#233;. Dans ce cadre, il pr&#233;voit la possibilit&#233; pour les directeurs g&#233;n&#233;raux d&#8217;ARS, &#224; compter de 2020, de sanctionner les &#233;tablissements &#171;&#160;dont les r&#233;sultats n&#8217;atteignent pas pendant trois ann&#233;es cons&#233;cutives un seuil minimum pour certains des crit&#232;res li&#233;s &#224; la qualit&#233; et de la s&#233;curit&#233; des soins&#160;&#187;.</p><p style=\"text-align: justify;\">Deux ajouts &#224; cet article sont propos&#233;s.</p><p style=\"text-align: justify;\">Le premier consiste &#224; &#233;tablir un parall&#232;le avec les pr&#233;rogatives des directeurs g&#233;n&#233;raux d&#8217;ARS en mati&#232;re de sanctions T2A (art.&#160;L.&#160;162&#8209;22&#8209;13 du CSS). Ces derni&#232;res ne peuvent, en effet, &#234;tre valablement notifi&#233;es qu&#8217;apr&#232;s avis d&#8217;une commission r&#233;gionale de contr&#244;le. Il est propos&#233; un dispositif &#233;quivalent pour les futures p&#233;nalit&#233;s pour non-respect des crit&#232;res de qualit&#233;.</p><p style=\"text-align: justify;\">Le second tend &#224; &#233;lever au niveau l&#233;gislatif une disposition figurant &#224; l&#8217;article R. 162&#8209;36&#8209;2 du Code de la s&#233;curit&#233; sociale. Car, si les autorit&#233;s minist&#233;rielles comp&#233;tentes ont, en vertu de cet article, jusqu&#8217;au 31 d&#233;cembre de l&#8217;ann&#233;e pr&#233;c&#233;dant l&#8217;ann&#233;e civile consid&#233;r&#233;e pour prendre leur arr&#234;t&#233; conjoint, il s&#8217;av&#232;re qu&#8217;en pratique cet arr&#234;t&#233; est effectivement pris un an trop tard, en d&#233;cembre de l&#8217;ann&#233;e consid&#233;r&#233;e&#8230; Cet &#233;tat de fait n&#8217;est pas digne des ambitions qui sont celles du PLFSS en mati&#232;re de financement par la qualit&#233;&#160;; raison pour laquelle l&#8217;exigence de c&#233;l&#233;rit&#233; dans la publication des arr&#234;t&#233;s minist&#233;riels en cause, qui conditionnent la bonne application du dispositif, doit &#234;tre port&#233;e au niveau l&#233;gislatif.&#160;</p>"
  },
  "representations": [
    {
      "nom": "PDF",
      "typeMime": {
        "type": "application",
        "subType": "PDF"
      },
      "statutRepresentation": {
        "verbatim": true,
        "canonique": true,
        "officielle": true,
        "transcription": false,
        "enregistrement": false
      },
      "contenu": {
        "documentURI": "/15/amendements/1297/AN/999.pdf"
      }
    }
  ],
  "seanceDiscussion": "RUANR5L15S2019IDS21293",
  "sort": {
    "dateSaisie": "2018-10-26T12:26:39.000+02:00",
    "sortEnSeance": "Rejeté"
  },
  "dateDepot": "2018-10-19T02:00:00.000+02:00",
  "dateDistribution": "2018-10-22T02:00:00.000+02:00",
  "article99": "0",
  "loiReference": {}
}