{
  "uid": "AMANR5L15SEA717460BTC0495P0D1N37",
  "identifiant": {
    "legislature": "15",
    "numero": "37",
    "numRect": "0",
    "saisine": {
      "texteLegislatifRef": "PRJLANR5L15BTC0495",
      "numeroPartiePLF": "0",
      "organeExamen": "PO717460",
      "mentionSecondeDeliberation": "0"
    }
  },
  "numeroLong": "37",
  "etapeTexte": "Nouvelle Lecture",
  "triAmendement": "g",
  "cardinaliteAmdtMultiples": "1",
  "etat": "Discuté",
  "signataires": {
    "auteur": {
      "typeAuteur": "Gouvernement"
    },
    "texteAffichable": "le Gouvernement"
  },
  "pointeurFragmentTexte": {
    "division": {
      "titre": "Article 2",
      "articleDesignationCourte": "ART. 2",
      "type": "ARTICLE",
      "avantAApres": "A",
      "divisionRattachee": "ARTICLE 2",
      "urlDivisionTexteVise": "/15/textes/0495.asp#D_Article_2"
    },
    "alinea": {
      "numero": "3"
    }
  },
  "corps": {
    "dispositif": "<p style=\"text-align: justify;\">R&#233;diger ainsi le tableau de l&#8217;alin&#233;a 3 :</p><p style=\"text-align: justify;\">&#171;</p><table style=\"border-collapse: collapse;\"><tbody><tr><td style=\"width: 191px; border-width:0pt 0pt 1pt; border-style: none none inset; border-color: currentcolor; -moz-border-top-colors: none; -moz-border-right-colors: none; -moz-border-bottom-colors: none; -moz-border-left-colors: none; padding: 0cm;\"><p>&#160;</p></td><td style=\"width: 161px; border-width:0pt 0pt 1pt; border-style: none none inset; border-color: currentcolor; -moz-border-top-colors: none; -moz-border-right-colors: none; -moz-border-bottom-colors: none; -moz-border-left-colors: none; padding: 0cm;\" colspan=\"3\">&#160;</td><td style=\"width: 49px; border-width:0pt 0pt 1pt; border-style: none none inset; border-color: currentcolor; -moz-border-top-colors: none; -moz-border-right-colors: none; -moz-border-bottom-colors: none; -moz-border-left-colors: none; padding: 0cm;\">&#160;</td><td style=\"width: 51px; border-width:0pt 0pt 1pt; border-style: none none inset; border-color: currentcolor; -moz-border-top-colors: none; -moz-border-right-colors: none; -moz-border-bottom-colors: none; -moz-border-left-colors: none; padding: 0cm;\" colspan=\"2\">&#160;</td><td style=\"width: 51px; border-width:0pt 0pt 1pt; border-style: none none inset; border-color: currentcolor; -moz-border-top-colors: none; -moz-border-right-colors: none; -moz-border-bottom-colors: none; -moz-border-left-colors: none; padding: 0cm;\" colspan=\"2\">&#160;</td><td style=\"width: 49px; border-width:0pt 0pt 1pt; border-style: none none inset; border-color: currentcolor; -moz-border-top-colors: none; -moz-border-right-colors: none; -moz-border-bottom-colors: none; -moz-border-left-colors: none; padding: 0cm;\">&#160;</td><td style=\"width: 78px; border-width:0pt 0pt 1pt; border-style: none none inset; border-color: currentcolor; -moz-border-top-colors: none; -moz-border-right-colors: none; -moz-border-bottom-colors: none; -moz-border-left-colors: none; padding: 0cm;\" colspan=\"2\"><p style=\"text-align: center;\">(En %)</p></td></tr><tr><td style=\"width: 191px; padding: 0cm;\"><p style=\"text-align: center;\">&#160;</p></td><td style=\"width: 71px; padding: 0cm;\"><p style=\"text-align: center;\"><b>2017</b></p></td><td style=\"width: 71px; padding: 0cm;\"><p style=\"text-align: center;\"><b>2018</b></p></td><td style=\"width: 76px; padding: 0cm;\" colspan=\"3\"><p style=\"text-align: center;\"><b>2019</b></p></td><td style=\"width: 74px; padding: 0cm;\" colspan=\"2\"><p style=\"text-align: center;\"><b>2020</b></p></td><td style=\"width: 76px; padding: 0cm;\" colspan=\"3\"><p style=\"text-align: center;\"><b>2021</b></p></td><td style=\"width: 71px; padding: 0cm;\"><p style=\"text-align: center;\"><b>2022</b></p></td></tr><tr><td style=\"width: 191px; padding: 0cm;\"><p>Solde structurel</p></td><td style=\"width: 71px; padding: 0cm;\"><p style=\"text-align: center;\">-2,2</p></td><td style=\"width: 71px; padding: 0cm;\"><p style=\"text-align: center;\">-2,1</p></td><td style=\"width: 76px; padding: 0cm;\" colspan=\"3\"><p style=\"text-align: center;\">-1,9</p></td><td style=\"width: 74px; padding: 0cm;\" colspan=\"2\"><p style=\"text-align: center;\">-1,6</p></td><td style=\"width: 76px; padding: 0cm;\" colspan=\"3\"><p style=\"text-align: center;\">-1,2</p></td><td style=\"width: 71px; padding: 0cm;\"><p style=\"text-align: center;\">-0,8</p></td></tr><tr><td style=\"width: 191px; padding: 0cm;\"><p>Ajustement structurel</p></td><td style=\"width: 71px; padding: 0cm;\"><p style=\"text-align: center;\">0,3</p></td><td style=\"width: 71px; padding: 0cm;\"><p style=\"text-align: center;\">0,1</p></td><td style=\"width: 76px; padding: 0cm;\" colspan=\"3\"><p style=\"text-align: center;\">0,3</p></td><td style=\"width: 74px; padding: 0cm;\" colspan=\"2\"><p style=\"text-align: center;\">0,3</p></td><td style=\"width: 76px; padding: 0cm;\" colspan=\"3\"><p style=\"text-align: center;\">0,4</p></td><td style=\"width: 71px; padding: 0cm;\"><p style=\"text-align: center;\">0,4</p></td></tr><tr><td style=\"width: 189px;\">&#160;</td><td style=\"width: 69px;\">&#160;</td><td style=\"width: 69px;\">&#160;</td><td style=\"width: 17px;\">&#160;</td><td style=\"width: 47px;\">&#160;</td><td style=\"width: 6px;\">&#160;</td><td style=\"width: 41px;\">&#160;</td><td style=\"width: 29px;\">&#160;</td><td style=\"width: 18px;\">&#160;</td><td style=\"width: 47px;\">&#160;</td><td style=\"width: 5px;\">&#160;</td><td style=\"width: 69px;\">&#160;</td></tr></tbody></table><p style=\"text-align: justify;\">&#160;</p><p style=\"text-align: justify;\">&#187;</p>",
    "exposeSommaire": "<p style=\"text-align: justify;\">Le pr&#233;sent amendement vise &#224; actualiser les trajectoires de l&#8217;article 2 pour prendre en compte l&#8217;ensemble des informations nouvelles disponibles et en particulier les votes intervenus sur le projet de loi de finances pour 2018 et le projet de loi de financement de la s&#233;curit&#233; sociale pour 2018 et sur les projets de loi de finances rectificative pour 2017.</p>"
  },
  "representations": [
    {
      "nom": "PDF",
      "typeMime": {
        "type": "application",
        "subType": "PDF"
      },
      "statutRepresentation": {
        "verbatim": true,
        "canonique": true,
        "officielle": true,
        "transcription": false,
        "enregistrement": false
      },
      "contenu": {
        "documentURI": "/15/amendements/0495/AN/37.pdf"
      }
    }
  ],
  "seanceDiscussion": "RUANR5L15S2018IDS20842",
  "sort": {
    "dateSaisie": "2017-12-16T01:33:32.000+01:00",
    "sortEnSeance": "Adopté"
  },
  "dateDepot": "2017-12-15T01:00:00.000+01:00",
  "dateDistribution": "2017-12-15T01:00:00.000+01:00",
  "article99": "1",
  "loiReference": {}
}