{
  "uid": "AMANR5L15PO419610B0846P0D1N2239",
  "identifiant": {
    "legislature": "15",
    "numero": "2239",
    "numRect": "0",
    "saisine": {
      "texteLegislatifRef": "PRJLANR5L15B0846",
      "numeroPartiePLF": "0",
      "organeExamen": "PO419610",
      "mentionSecondeDeliberation": "0"
    }
  },
  "numeroLong": "CE2239",
  "etapeTexte": "1ère lecture (1ère assemblée saisie)",
  "triAmendement": "dn",
  "cardinaliteAmdtMultiples": "1",
  "etat": "Discuté",
  "signataires": {
    "auteur": {
      "typeAuteur": "Depute",
      "acteurRef": "PA405480",
      "groupePolitiqueRef": "PO730946"
    },
    "cosignatairesRefs": [
      "PA1198",
      "PA429893",
      "PA337483",
      "PA609332",
      "PA508",
      "PA340343",
      "PA342415",
      "PA332614",
      "PA588886",
      "PA267233",
      "PA405480",
      "PA643145",
      "PA642764",
      "PA340357",
      "PA605069",
      "PA333818",
      "PA608011",
      "PA720988",
      "PA608695",
      "PA335054",
      "PA1809",
      "PA1592",
      "PA608172",
      "PA333285",
      "PA335532",
      "PA719930",
      "PA609590",
      "PA607553",
      "PA1008",
      "PA610681"
    ],
    "texteAffichable": "M.&#160;Pupponi,  Mme&#160;Bareigts, Mme&#160;Bi&#233;mouret, M.&#160;Carvounas, Mme&#160;Karamanli, Mme&#160;Untermaier, M.&#160;Hutin, M.&#160;Aviragnet, Mme&#160;Battistel, M.&#160;Bouillon, M.&#160;Jean-Louis&#160;Bricout, M.&#160;Alain&#160;David, Mme&#160;Laurence&#160;Dumont, M.&#160;Faure, M.&#160;Garot, M.&#160;David&#160;Habib, M.&#160;Juanico, M.&#160;J&#233;r&#244;me&#160;Lambert, M.&#160;Le Foll, M.&#160;Letchimy, Mme&#160;Manin, Mme&#160;Pau-Langevin, Mme&#160;Pires Beaune, M.&#160;Potier, M.&#160;Pueyo, Mme&#160;Rabault, M.&#160;Saulignac, Mme&#160;Vainqueur-Christophe, M.&#160;Vallaud et Mme&#160;Victory"
  },
  "pointeurFragmentTexte": {
    "division": {
      "titre": "Article 6",
      "articleDesignationCourte": "ART. 6",
      "type": "ARTICLE",
      "avantAApres": "A",
      "divisionRattachee": "ARTICLE 6",
      "urlDivisionTexteVise": "/15/textes/0846.asp#D_Article_6"
    },
    "alinea": {
      "avantAApres": "Apres",
      "numero": "6"
    }
  },
  "corps": {
    "dispositif": "<p style=\"text-align: justify;\">Apr&#232;s l&#8217;alin&#233;a&#160;6, ins&#233;rer l&#8217;alin&#233;a suivant&#160;:</p><p style=\"text-align: justify;\">&#171;&#160;c)&#160;Compl&#233;ter cet alin&#233;a par la phrase suivante&#160;: &#171;&#160;Le montant de la d&#233;cote ne peut d&#233;passer, par m&#232;tre carr&#233; de surface utile de logements sociaux, le co&#251;t de la construction neuve de logements sociaux sur le territoire de la commune concern&#233;e dans des conditions pr&#233;cis&#233;es par d&#233;cret pris en Conseil d&#8217;&#201;tat.&#160;&#187;</p>",
    "exposeSommaire": "<p style=\"text-align: justify;\">Dans son r&#233;f&#233;r&#233; en date du 26 octobre 2017, la Cour des comptes a soulign&#233; que dans certains territoires o&#249; le co&#251;t du foncier &#233;tait particuli&#232;rement &#233;lev&#233;, le montant de la d&#233;cote accord&#233; &#224; certains projets avait eu pour effet de faire supporter &#224; celle-ci l&#8217;essentiel de l&#8217;effort financier de l&#8217;op&#233;ration, sans que l&#8217;acqu&#233;reur o&#249; le bailleur ne soit appel&#233; &#224; mobiliser de fonds propres ou tr&#232;s peu. Ainsi, la production de 284 logements sociaux rue de Mouza&#239;a &#224; Paris a mobilis&#233; 0&#160;% de fonds propres pour une d&#233;cote de 67600&#160;&#8364; par logement. Dans une autre op&#233;ration, situ&#233;e rue de Lille &#233;galement &#224; Paris, la somme de la d&#233;cote accord&#233;e et d&#8217;autres aides de l&#8217;&#201;tat a eu pour effet que le montant de l&#8217;aide par m&#232;tre carr&#233; de logement social &#233;tait sup&#233;rieur de 26&#160;% au co&#251;t au m&#232;tre carr&#233; de construction d&#8217;un logement social neuf &#224; Paris.</p><p style=\"text-align: justify;\">Le pr&#233;sent amendement propose donc de plafonner le montant de la d&#233;cote de mani&#232;re &#224; ce qu&#8217;une telle situation ne puisse se reproduire.</p>"
  },
  "representations": [
    {
      "nom": "PDF",
      "typeMime": {
        "type": "application",
        "subType": "PDF"
      },
      "statutRepresentation": {
        "verbatim": true,
        "canonique": true,
        "officielle": true,
        "transcription": false,
        "enregistrement": false
      },
      "contenu": {
        "documentURI": "/15/amendements/0846/CION-ECO/CE2239.pdf"
      }
    }
  ],
  "sort": {
    "dateSaisie": "2018-05-16T00:04:10.000+02:00",
    "sortEnSeance": "Rejeté"
  },
  "dateDepot": "2018-05-09T02:00:00.000+02:00",
  "dateDistribution": "2018-05-14T02:00:00.000+02:00",
  "article99": "0",
  "loiReference": {}
}