{
  "uid": "AMANR5L15PO419610B0846P0D1N147",
  "identifiant": {
    "legislature": "15",
    "numero": "147",
    "numRect": "0",
    "saisine": {
      "texteLegislatifRef": "PRJLANR5L15B0846",
      "numeroPartiePLF": "0",
      "organeExamen": "PO419610",
      "mentionSecondeDeliberation": "0"
    }
  },
  "numeroLong": "CE147",
  "etapeTexte": "1ère lecture (1ère assemblée saisie)",
  "triAmendement": "jd",
  "cardinaliteAmdtMultiples": "1",
  "etat": "Discuté",
  "signataires": {
    "auteur": {
      "typeAuteur": "Depute",
      "acteurRef": "PA721286",
      "groupePolitiqueRef": "PO730934"
    },
    "cosignatairesRefs": [
      "PA267429",
      "PA608016",
      "PA721636",
      "PA267527",
      "PA721286",
      "PA718850",
      "PA608416",
      "PA267735",
      "PA721678",
      "PA267378"
    ],
    "texteAffichable": "M.&#160;Ramadier,  M.&#160;Cordier, M.&#160;Cinieri, M.&#160;Hetzel, M.&#160;Reda, M.&#160;de Ganay, M.&#160;Saddier, Mme&#160;Levy, M.&#160;Parigi et Mme&#160;Louwagie"
  },
  "pointeurFragmentTexte": {
    "division": {
      "titre": "Article 35",
      "articleDesignationCourte": "ART. 35",
      "type": "ARTICLE",
      "avantAApres": "A",
      "divisionRattachee": "ARTICLE 35",
      "urlDivisionTexteVise": "/15/textes/0846.asp#D_Article_35"
    },
    "alinea": {
      "avantAApres": "A",
      "numero": "22",
      "alineaDesignation": "Alinéa 22"
    }
  },
  "corps": {
    "dispositif": "<p style=\"text-align: justify;\">&#192; la premi&#232;re phrase de l&#8217;alin&#233;a&#160;22, substituer au mot&#160;:</p><p style=\"text-align: justify;\">&#171;&#160;six&#160;&#187;,</p><p style=\"text-align: justify;\">le mot&#160;:</p><p style=\"text-align: justify;\">&#171;&#160;deux&#160;&#187;.</p>",
    "exposeSommaire": "<p style=\"text-align: justify;\">Il serait plus pertinent que l&#8217;examen des conditions d&#8217;occupation du logement par le bailleur soit r&#233;alis&#233; tous les deux ans, p&#233;riodicit&#233; &#224; laquelle est r&#233;alis&#233;e l&#8217;enqu&#234;te OPS ( Occupation du Parc social) qui renseigne sur la situation socio-&#233;conomique des m&#233;nages locataires du parc social.</p>"
  },
  "representations": [
    {
      "nom": "PDF",
      "typeMime": {
        "type": "application",
        "subType": "PDF"
      },
      "statutRepresentation": {
        "verbatim": true,
        "canonique": true,
        "officielle": true,
        "transcription": false,
        "enregistrement": false
      },
      "contenu": {
        "documentURI": "/15/amendements/0846/CION-ECO/CE147.pdf"
      }
    }
  ],
  "sort": {
    "dateSaisie": "2018-05-17T23:19:33.000+02:00",
    "sortEnSeance": "Rejeté"
  },
  "dateDepot": "2018-04-30T02:00:00.000+02:00",
  "dateDistribution": "2018-05-15T02:00:00.000+02:00",
  "article99": "0",
  "loiReference": {}
}