{
  "uid": "AMANR5L15SEA717460BTC1924P0D1N1118",
  "identifiant": {
    "legislature": "15",
    "numero": "1118",
    "numRect": "0",
    "saisine": {
      "texteLegislatifRef": "PRJLANR5L15BTC1924",
      "numeroPartiePLF": "0",
      "organeExamen": "PO717460",
      "mentionSecondeDeliberation": "0"
    }
  },
  "numeroLong": "1118",
  "etapeTexte": "1ère lecture (1ère assemblée saisie)",
  "triAmendement": "aeaaaaaaaaaaaaaaaaaaaaaaaaaaaaaaaaaaaaaaaaaaaaaaaaise",
  "cardinaliteAmdtMultiples": "1",
  "etat": "Discuté",
  "signataires": {
    "auteur": {
      "typeAuteur": "Gouvernement"
    },
    "texteAffichable": "le Gouvernement"
  },
  "pointeurFragmentTexte": {
    "division": {
      "titre": "Article 3",
      "articleDesignationCourte": "ART. 3",
      "type": "ARTICLE",
      "avantAApres": "A",
      "divisionRattachee": "ARTICLE 3",
      "urlDivisionTexteVise": "/15/textes/1924.asp#D_Article_3"
    },
    "alinea": {
      "avantAApres": "Apres",
      "numero": "24"
    }
  },
  "corps": {
    "dispositif": "<p style=\"text-align: justify;\">Apr&#232;s l&#8217;alin&#233;a&#160;24, ins&#233;rer les quatre alin&#233;as suivants&#160;:</p><p style=\"text-align: justify;\">&#171;&#160;<i>Art.&#160;15 </i>ter.&#160;&#8211;&#160;Par d&#233;rogation &#224; l&#8217;article&#160;9 <i>bis</i> de la loi n&#176;83&#8209;634 du 83&#8209;634 du 13 juillet 1983 portant droits et obligations des fonctionnaires&#160;et &#224; l&#8217;article&#160;15 <i>bis</i> de la pr&#233;sente loi, pour la d&#233;signation des repr&#233;sentants du personnel si&#233;geant aux comit&#233;s sociaux d&#8217;administration du minist&#232;re de la justice&#160;:</p><p style=\"text-align: justify;\">&#171;&#160;<i>a)</i>&#160;Sont &#233;lecteurs les agents publics et les magistrats de l&#8217;ordre judiciaire&#160;;</p><p style=\"text-align: justify;\">&#171;&#160;<i>b)</i>&#160;Sont &#233;ligibles, outre les organisations syndicales mentionn&#233;es &#224; l&#8217;article&#160;9 <i>bis</i> de la loi n&#176;&#160;83&#8209;634 du 13 juillet 1983 pr&#233;cit&#233;e, les organisations syndicales mentionn&#233;es &#224; l&#8217;article&#160;10&#8209;1 de l&#8217;ordonnance n&#176;&#160;58&#8209;1270 du 22 d&#233;cembre 1958 portant loi organique relative au statut de la magistrature.</p><p style=\"text-align: justify;\">&#171;&#160;Un d&#233;cret en Conseil d&#8217;&#201;tat pr&#233;voit les conditions d&#8217;application du pr&#233;sent article.&#160;&#187;</p>",
    "exposeSommaire": "<p style=\"text-align: justify;\">Le projet de loi de transformation de la fonction publique pr&#233;voit, dans son article&#160;3, la cr&#233;ation d&#8217;une&#160; instance unique pour d&#233;battre des sujets d&#8217;int&#233;r&#234;t collectif, le comit&#233; social d&#8217;administration, issu de la fusion du comit&#233; technique et du comit&#233; d&#8217;hygi&#232;ne, de s&#233;curit&#233; et des conditions de travail.</p><p style=\"text-align: justify;\">Toutefois, les magistrats, acteurs essentiels du service public de la justice et de l&#8217;encadrement sup&#233;rieur du minist&#232;re, ne peuvent participer aux d&#233;bats du comit&#233; social portant sur la politique de ressources humaines du minist&#232;re, d&#232;s lors qu&#8217;ils ne sont ni &#233;lecteurs ni &#233;ligibles aux &#233;lections professionnelles de la fonction publique.</p><p style=\"text-align: justify;\">Cet amendement a pour objet de donner aux magistrats judiciaires toute leur place dans le dialogue social du minist&#232;re de la justice, en leur permettant d&#8217;&#234;tre &#233;lecteurs et &#233;ligibles, comme les agents publics, aux comit&#233;s sociaux d&#8217;administration du minist&#232;re.</p>"
  },
  "representations": [
    {
      "nom": "PDF",
      "typeMime": {
        "type": "application",
        "subType": "PDF"
      },
      "statutRepresentation": {
        "verbatim": true,
        "canonique": true,
        "officielle": true,
        "transcription": false,
        "enregistrement": false
      },
      "contenu": {
        "documentURI": "/15/amendements/1924/AN/1118.pdf"
      }
    }
  ],
  "sort": {
    "dateSaisie": "2019-05-14T23:34:35.000+02:00",
    "sortEnSeance": "Adopté"
  },
  "dateDepot": "2019-05-09T02:00:00.000+02:00",
  "dateDistribution": "2019-05-14T02:00:00.000+02:00",
  "article99": "0",
  "loiReference": {}
}