{
  "uid": "AMANR5L15SEA717460BTC1173P0D1N314",
  "identifiant": {
    "legislature": "15",
    "numero": "314",
    "numRect": "0",
    "saisine": {
      "texteLegislatifRef": "PRJLANR5L15BTC1173",
      "numeroPartiePLF": "0",
      "organeExamen": "PO717460",
      "mentionSecondeDeliberation": "0"
    }
  },
  "numeroLong": "314",
  "etapeTexte": "Nouvelle Lecture",
  "triAmendement": "gsu",
  "cardinaliteAmdtMultiples": "1",
  "etat": "Discuté",
  "signataires": {
    "auteur": {
      "typeAuteur": "Depute",
      "acteurRef": "PA335054",
      "groupePolitiqueRef": "PO730946"
    },
    "cosignatairesRefs": [
      "PA335054",
      "PA340357",
      "PA608741",
      "PA337483",
      "PA605069",
      "PA333818",
      "PA643145",
      "PA1198",
      "PA340343",
      "PA267233",
      "PA642764",
      "PA608011",
      "PA332614",
      "PA720988",
      "PA405480",
      "PA609590",
      "PA342415",
      "PA607553",
      "PA608695",
      "PA719930",
      "PA1809",
      "PA610681",
      "PA1592",
      "PA429893",
      "PA609332",
      "PA333285",
      "PA335532",
      "PA608172",
      "PA1008",
      "PA508"
    ],
    "texteAffichable": "Mme&#160;Karamanli,  M.&#160;Aviragnet, Mme&#160;Bareigts, Mme&#160;Battistel, Mme&#160;Bi&#233;mouret, M.&#160;Bouillon, M.&#160;Jean-Louis&#160;Bricout, M.&#160;Carvounas, M.&#160;Alain&#160;David, Mme&#160;Laurence&#160;Dumont, M.&#160;Faure, M.&#160;Garot, M.&#160;David&#160;Habib, M.&#160;Hutin, M.&#160;Juanico, M.&#160;J&#233;r&#244;me&#160;Lambert, M.&#160;Letchimy, Mme&#160;Manin, Mme&#160;Pau-Langevin, Mme&#160;Pires Beaune, M.&#160;Potier, M.&#160;Pueyo, M.&#160;Pupponi, Mme&#160;Rabault, M.&#160;Saulignac, Mme&#160;Tolmont, Mme&#160;Untermaier, Mme&#160;Vainqueur-Christophe, M.&#160;Vallaud et Mme&#160;Victory"
  },
  "pointeurFragmentTexte": {
    "division": {
      "titre": "Article 5",
      "articleDesignationCourte": "ART. 5",
      "type": "ARTICLE",
      "avantAApres": "A",
      "divisionRattachee": "ARTICLE 5",
      "urlDivisionTexteVise": "/15/textes/1173.asp#D_Article_5"
    },
    "alinea": {
      "avantAApres": "Apres",
      "numero": "6"
    }
  },
  "corps": {
    "dispositif": "<p style=\"text-align: justify;\">Apr&#232;s l&#8217;alin&#233;a&#160;6, ins&#233;rer l&#8217;alin&#233;a suivant&#160;:</p><p style=\"text-align: justify;\"><i>&#171;&#160;a)&#160;</i>bis Le m&#234;me 3&#176; est compl&#233;t&#233; par les mots&#160;: &#171;&#160;,&#160;&#224; la condition que l&#8217;autorit&#233; administrative justifie l&#8217;enregistrement de la demande d&#8217;asile dans un d&#233;lai de trois &#224; dix jours suivant la demande de rendez-vous par une plateforme d&#8217;accueil des demandeurs d&#8217;asile.&#160;&#187;&#160;;&#160;&#157;&#187;</p>",
    "exposeSommaire": "<p style=\"text-align: justify;\">Afin d&#8217;&#233;viter que l&#8217;application de cette disposition conduisent &#224; p&#233;naliser les demandeurs d&#8217;asile du fait de l&#8217;incurie d&#8217;une administration d&#233;bord&#233;e faute de moyen, cet amendement vise &#224; conditionner l&#8217;application de la proc&#233;dure acc&#233;l&#233;r&#233;e et &#224; n&#8217;en faire application que si l&#8217;administration a re&#231;u le demandeur dans le d&#233;lai r&#233;glementaire de 3 &#224; 10 jours.</p>"
  },
  "representations": [
    {
      "nom": "PDF",
      "typeMime": {
        "type": "application",
        "subType": "PDF"
      },
      "statutRepresentation": {
        "verbatim": true,
        "canonique": true,
        "officielle": true,
        "transcription": false,
        "enregistrement": false
      },
      "contenu": {
        "documentURI": "/15/amendements/1173/AN/314.pdf"
      }
    }
  ],
  "seanceDiscussion": "RUANR5L15S2018IDS21203",
  "sort": {
    "dateSaisie": "2018-07-26T09:56:35.000+02:00",
    "sortEnSeance": "Rejeté"
  },
  "dateDepot": "2018-07-20T02:00:00.000+02:00",
  "dateDistribution": "2018-07-23T02:00:00.000+02:00",
  "article99": "0",
  "loiReference": {}
}