{
  "uid": "AMANR5L15SEA717460BTC0971P0D1N2421",
  "identifiant": {
    "legislature": "15",
    "numero": "2421",
    "numRect": "0",
    "saisine": {
      "texteLegislatifRef": "PRJLANR5L15BTC0971",
      "numeroPartiePLF": "0",
      "organeExamen": "PO717460",
      "mentionSecondeDeliberation": "0"
    }
  },
  "numeroLong": "2421",
  "etapeTexte": "1ère lecture (1ère assemblée saisie)",
  "triAmendement": "z",
  "cardinaliteAmdtMultiples": "1",
  "etat": "Irrecevable",
  "signataires": {
    "auteur": {
      "typeAuteur": "Depute",
      "acteurRef": "PA610654",
      "groupePolitiqueRef": "PO730940"
    },
    "cosignatairesRefs": [
      "PA721012",
      "PA720692",
      "PA720546",
      "PA718926",
      "PA267306",
      "PA610667",
      "PA610654",
      "PA441",
      "PA722202",
      "PA721118",
      "PA721896",
      "PA335612",
      "PA718720",
      "PA721270",
      "PA722110",
      "PA689",
      "PA720976"
    ],
    "texteAffichable": "M.&#160;Nilor,  Mme&#160;Bello, M.&#160;Brotherson, M.&#160;Bruneel, Mme&#160;Buffet, M.&#160;Chassaigne, M.&#160;Dharr&#233;ville, M.&#160;Dufr&#232;gne, Mme&#160;Faucillon, M.&#160;Jumel, Mme&#160;K&#233;clard-Mond&#233;sir, M.&#160;Lecoq, M.&#160;Peu, M.&#160;Fabien&#160;Roussel, M.&#160;Serville, M.&#160;Wulfranc et M.&#160;Mathiasin"
  },
  "pointeurFragmentTexte": {
    "division": {
      "titre": "Article 55 sexies",
      "articleDesignationCourte": "APRÈS ART. 55 SEXIES",
      "type": "ARTICLE",
      "avantAApres": "Apres",
      "divisionRattachee": "APRÈS L'ARTICLE 55 SEXIES, insérer l'article suivant:",
      "articleAdditionnel": "1",
      "urlDivisionTexteVise": "/15/textes/0971.asp#D_Article_55_sexies"
    }
  },
  "corps": {
    "dispositif": "<p style=\"text-align: justify;\">Au plus tard le 1<sup>er</sup> janvier 2020, le Gouvernement garantit la mise en place de moyens adapt&#233;s, notamment dans les zones non interconnect&#233;es, pour l&#8217;acc&#232;s &#224; l&#8217;&#233;nergie&#160;des sites isol&#233;s.</p>",
    "exposeSommaire": "<p style=\"text-align: justify;\">Il s&#8217;agit de permettre aux autorit&#233;s organisatrices de la distribution de l&#8217;&#233;nergie et autres autorit&#233;s de mutualiser les moyens afin de permettre l&#8217;acc&#232;s &#224; l&#8217;&#233;nergie&#160;des habitants des&#160;sites isol&#233;s.</p><p style=\"text-align: justify;\">S&#8217;agissant des zones non interconnect&#233;es de l&#8217;hexagone ou des outremers, il convient de rem&#233;dier au fait que en plein XXI<sup>e</sup> si&#232;cle, de nombreux habitants n&#8217;ont pas acc&#232;s &#224; l&#8217;&#233;lectricit&#233;.</p><p style=\"text-align: justify;\">Pour parvenir &#224; r&#233;duire la&#160;&#171;&#160;fracture num&#233;rique&#160;&#187;, il est indispensable au pr&#233;alable de mettre fin &#224; la &#171;&#160;fracture &#233;lectrique&#160;&#187;.</p><p style=\"text-align: justify;\">Cette situation pr&#233;judiciable est source de nuisances et d&#8217;ins&#233;curit&#233;.</p><p style=\"text-align: justify;\">En Martinique, pr&#232;s de 8000 logements sont concern&#233;s. Sans &#233;lectricit&#233;, les conditions d&#8217;apprentissage et d&#8217;&#233;tude des enfants vivant dans ces logements sont &#171;&#160;indignes&#160;&#187; et constituent une entorse grave au principe d&#8217;&#233;galit&#233; des chances.</p>"
  },
  "representations": [
    {
      "nom": "PDF",
      "typeMime": {
        "type": "application",
        "subType": "PDF"
      },
      "statutRepresentation": {
        "verbatim": true,
        "canonique": true,
        "officielle": true,
        "transcription": false,
        "enregistrement": false
      },
      "contenu": {
        "documentURI": "/15/amendements/0971/AN/2421.pdf"
      }
    }
  ],
  "dateDepot": "2018-05-26T02:00:00.000+02:00",
  "article99": "0",
  "loiReference": {}
}