{
  "uid": "AMANR5L15SEA717460B2272P2D1N2921",
  "identifiant": {
    "legislature": "15",
    "numero": "2921",
    "numRect": "0",
    "saisine": {
      "texteLegislatifRef": "PRJLANR5L15B2272",
      "numeroPartiePLF": "2",
      "organeExamen": "PO717460",
      "mentionSecondeDeliberation": "0"
    }
  },
  "numeroLong": "II-2921",
  "etapeTexte": "1ère lecture (1ère assemblée saisie)",
  "triAmendement": "niaaaaaaaaaaaaaaaaaaaaaaaaaaaaaaaaaaaaaaaaaaaaaaaajkn",
  "cardinaliteAmdtMultiples": "1",
  "etat": "Irrecevable",
  "signataires": {
    "auteur": {
      "typeAuteur": "Depute",
      "acteurRef": "PA643145",
      "groupePolitiqueRef": "PO758835"
    },
    "cosignatairesRefs": [
      "PA610681",
      "PA643145"
    ],
    "texteAffichable": "Mme&#160;Vainqueur-Christophe et Mme&#160;Bareigts"
  },
  "pointeurFragmentTexte": {
    "division": {
      "titre": "Article 72",
      "articleDesignationCourte": "APRÈS ART. 72",
      "type": "ARTICLE",
      "avantAApres": "Apres",
      "divisionRattachee": "APRÈS L'ARTICLE 72, insérer l'article suivant:",
      "articleAdditionnel": "1",
      "urlDivisionTexteVise": "/15/textes/2272C.asp#D_Article_72"
    }
  },
  "corps": {},
  "representations": [
    {
      "nom": "PDF",
      "typeMime": {
        "type": "application",
        "subType": "PDF"
      },
      "statutRepresentation": {
        "verbatim": true,
        "canonique": true,
        "officielle": true,
        "transcription": false,
        "enregistrement": false
      },
      "contenu": {
        "documentURI": "/15/amendements/2272C/AN/2921.pdf"
      }
    }
  ],
  "dateDepot": "2019-11-08T01:00:00.000+01:00",
  "dateDistribution": "2019-11-13T01:00:00.000+01:00",
  "article99": "0",
  "loiReference": {
    "codeLoi": "CGI",
    "divisionCodeLoi": "44 quaterdecies"
  }
}