{
  "uid": "AMANR5L15SEA717460B2272P2D1N350",
  "identifiant": {
    "legislature": "15",
    "numero": "350",
    "numRect": "0",
    "saisine": {
      "texteLegislatifRef": "PRJLANR5L15B2272",
      "numeroPartiePLF": "2",
      "organeExamen": "PO717460",
      "mentionSecondeDeliberation": "0"
    }
  },
  "numeroLong": "II-350",
  "etapeTexte": "1ère lecture (1ère assemblée saisie)",
  "triAmendement": "bloaaaaaaaaaaaaaaaaaaaaaaaaaaaaaaaaaaaaaaaaaaaaaaabi",
  "cardinaliteAmdtMultiples": "1",
  "etat": "Discuté",
  "signataires": {
    "auteur": {
      "typeAuteur": "Depute",
      "acteurRef": "PA608172",
      "groupePolitiqueRef": "PO758835"
    },
    "cosignatairesRefs": [
      "PA267233",
      "PA333818",
      "PA1809",
      "PA1198",
      "PA335054",
      "PA608172",
      "PA332614",
      "PA333285",
      "PA605069",
      "PA1008",
      "PA608695",
      "PA609332",
      "PA335532",
      "PA340357",
      "PA608011",
      "PA609590",
      "PA607553",
      "PA610681",
      "PA340343",
      "PA720988",
      "PA1592",
      "PA508",
      "PA719930",
      "PA429893",
      "PA337483",
      "PA643145",
      "PA642764",
      "PA342415",
      "PA608741"
    ],
    "texteAffichable": "Mme&#160;Pires Beaune,  M.&#160;Jean-Louis&#160;Bricout, Mme&#160;Rabault, M.&#160;Aviragnet, Mme&#160;Bareigts, Mme&#160;Battistel, Mme&#160;Bi&#233;mouret, M.&#160;Bouillon, M.&#160;Carvounas, M.&#160;Alain&#160;David, Mme&#160;Laurence&#160;Dumont, M.&#160;Faure, M.&#160;Garot, M.&#160;David&#160;Habib, M.&#160;Hutin, M.&#160;Juanico, Mme&#160;Karamanli, M.&#160;J&#233;r&#244;me&#160;Lambert, M.&#160;Letchimy, Mme&#160;Manin, Mme&#160;Pau-Langevin, M.&#160;Potier, M.&#160;Pueyo, M.&#160;Saulignac, Mme&#160;Tolmont, Mme&#160;Untermaier, Mme&#160;Vainqueur-Christophe, M.&#160;Vallaud, Mme&#160;Victory et les membres du groupe Socialistes et apparent&#233;s"
  },
  "pointeurFragmentTexte": {
    "missionVisee": {
      "idMissionAN": "820",
      "libelleMission": "Pouvoirs publics",
      "codeMissionPLF": "B",
      "libelleMissionPLF": "Répartition, par mission et programme, des crédits du budget général"
    },
    "division": {
      "titre": "ÉTAT B",
      "articleDesignationCourte": "ART. 38",
      "type": "ANNEXE",
      "avantAApres": "A",
      "divisionRattachee": "ARTICLE 38",
      "urlDivisionTexteVise": "/15/textes/2272C.asp#D_ETAT_B"
    }
  },
  "corps": {
    "exposeSommaire": "<p>Le Groupe &#171;&#160;Socialistes et apparent&#233;&#160;&#187; propose, &#224; travers cet amendement, de transf&#233;rer 6 millions d&#8217;euros de l'action 01 du programme &#171;&#160;Pr&#233;sidence de la R&#233;publique&#160;&#187; vers les actions 01 du programmede l' &#171;&#160;Assembl&#233;e nationale&#160;&#187; (3 millions) et 01 du programme &#171;&#160;S&#233;nat&#160;&#187; (3 millions).</p><p>En effet, depuis le d&#233;but du quinquennat de M.Macron le budget de l&#8217;Elys&#233;e augmente tr&#232;s sensiblement sans que les justifications apparaissent tr&#232;s clairement.</p><p>Aussi cet amendement propose t-il de r&#233;duire ce budget afin de financer les missions d&#8217;&#233;valuation des politiques publiques qui sont de la comp&#233;tence des assembl&#233;es parlementaires. A cet &#233;gard, le budget allou&#233; &#224; l&#8217;instance qui est le bras arm&#233; de l&#8217;Assembl&#233;e en mati&#232;re d&#8217;&#233;valuation m&#233;riterait d&#8217;&#234;tre pr&#233;cis&#233; afin de le comparer &#224; celui d&#8217;autres institutions comparables &#224; l&#8217;&#233;tranger. Si le CEC n&#8217;a pas &#224; rougir de la qualit&#233; de ses travaux, sa mission est suffisamment essentielle pour que ses cr&#233;dits augmentent sensiblement. Aujourd&#8217;hui, ils d&#233;passeraient tout juste les 100 000&#160;euros.</p>",
    "dispositifAmdtCredit": {
      "listeProgrammes": [
        {
          "libelle": "Présidence de la République",
          "id": "98333",
          "AE": {
            "montantPositif": "0",
            "montantNegatif": "6000000"
          },
          "CP": {
            "montantPositif": "0",
            "montantNegatif": "6000000"
          },
          "action": "modification"
        },
        {
          "libelle": "Assemblée nationale",
          "id": "98334",
          "AE": {
            "montantPositif": "3000000",
            "montantNegatif": "0"
          },
          "CP": {
            "montantPositif": "0",
            "montantNegatif": "0"
          },
          "action": "modification"
        },
        {
          "libelle": "Sénat",
          "id": "98335",
          "AE": {
            "montantPositif": "3000000",
            "montantNegatif": "0"
          },
          "CP": {
            "montantPositif": "0",
            "montantNegatif": "0"
          },
          "action": "modification"
        },
        {
          "libelle": "La Chaîne parlementaire",
          "id": "98336",
          "AE": {
            "montantPositif": "0",
            "montantNegatif": "0"
          },
          "CP": {
            "montantPositif": "0",
            "montantNegatif": "0"
          },
          "action": "modification"
        },
        {
          "libelle": "Indemnités des représentants français au Parlement européen",
          "id": "98337",
          "AE": {
            "montantPositif": "0",
            "montantNegatif": "0"
          },
          "CP": {
            "montantPositif": "0",
            "montantNegatif": "0"
          },
          "action": "modification"
        },
        {
          "libelle": "Conseil constitutionnel",
          "id": "98338",
          "AE": {
            "montantPositif": "0",
            "montantNegatif": "0"
          },
          "CP": {
            "montantPositif": "0",
            "montantNegatif": "0"
          },
          "action": "modification"
        },
        {
          "libelle": "Haute Cour",
          "id": "98339",
          "AE": {
            "montantPositif": "0",
            "montantNegatif": "0"
          },
          "CP": {
            "montantPositif": "0",
            "montantNegatif": "0"
          },
          "action": "modification"
        },
        {
          "libelle": "Cour de justice de la République",
          "id": "98340",
          "AE": {
            "montantPositif": "0",
            "montantNegatif": "0"
          },
          "CP": {
            "montantPositif": "0",
            "montantNegatif": "0"
          },
          "action": "modification"
        }
      ],
      "totalAE": {
        "montantPositif": "6000000",
        "montantNegatif": "6000000",
        "solde": "0"
      },
      "totalCP": {
        "montantPositif": "0",
        "montantNegatif": "6000000",
        "solde": "-6000000"
      }
    }
  },
  "representations": [
    {
      "nom": "PDF",
      "typeMime": {
        "type": "application",
        "subType": "PDF"
      },
      "statutRepresentation": {
        "verbatim": true,
        "canonique": true,
        "officielle": true,
        "transcription": false,
        "enregistrement": false
      },
      "contenu": {
        "documentURI": "/15/amendements/2272C/AN/350.pdf"
      }
    }
  ],
  "seanceDiscussion": "RUANR5L15S2020IDS21935",
  "sort": {
    "dateSaisie": "2019-11-12T23:24:01.000+01:00",
    "sortEnSeance": "Rejeté"
  },
  "dateDepot": "2019-10-24T02:00:00.000+02:00",
  "dateDistribution": "2019-11-08T01:00:00.000+01:00",
  "article99": "0",
  "loiReference": {}
}