{
  "uid": "AMANR5L15PO419865B1831P0D1N2848",
  "identifiant": {
    "legislature": "15",
    "numero": "2848",
    "numRect": "0",
    "saisine": {
      "texteLegislatifRef": "PRJLANR5L15B1831",
      "numeroPartiePLF": "0",
      "organeExamen": "PO419865",
      "mentionSecondeDeliberation": "0"
    }
  },
  "numeroLong": "CD2848",
  "etapeTexte": "1ère lecture (2ème assemblée saisie)",
  "triAmendement": "edaaaaaaaaaaaaaaaaaaaaaaaaaaaaaaaaaaaaaaaaaaaaaaaaaawni",
  "cardinaliteAmdtMultiples": "1",
  "etat": "Discuté",
  "signataires": {
    "auteur": {
      "typeAuteur": "Depute",
      "acteurRef": "PA718962",
      "groupePolitiqueRef": "PO730964"
    },
    "cosignatairesRefs": [
      "PA718710",
      "PA719922",
      "PA722228",
      "PA720054",
      "PA605084",
      "PA719740",
      "PA720038",
      "PA721600",
      "PA722336",
      "PA721372",
      "PA719972",
      "PA718962",
      "PA718802",
      "PA719632",
      "PA721514",
      "PA719080",
      "PA721426",
      "PA722236",
      "PA719412",
      "PA719882",
      "PA720538",
      "PA722000",
      "PA720310",
      "PA719092",
      "PA719194",
      "PA721860",
      "PA609520",
      "PA718954",
      "PA719890",
      "PA721876",
      "PA718894",
      "PA720414",
      "PA719718",
      "PA720806"
    ],
    "texteAffichable": "M.&#160;Zulesi,  M.&#160;Ahamada, M.&#160;Pichereau, M.&#160;Colas-Roy, M.&#160;Arend, Mme&#160;Pascale&#160;Boyer, Mme&#160;Brulebois, M.&#160;Buchou, M.&#160;Causse, M.&#160;Cesarini, Mme&#160;Yolaine&#160;de Courson, Mme&#160;De Temmerman, M.&#160;Djebbari, M.&#160;Dombreval, Mme&#160;Gayte, M.&#160;Haury, Mme&#160;Josso, Mme&#160;Kerbarh, M.&#160;Krabal, Mme&#160;Le Feur, M.&#160;Leclabart, Mme&#160;Maillart-M&#233;haignerie, Mme&#160;Marsaud, Mme&#160;Meynier-Millefert, M.&#160;Morenas, Mme&#160;Panonacle, M.&#160;Perea, M.&#160;Perrot, Mme&#160;Pompili, Mme&#160;Riotton, Mme&#160;Rossi, Mme&#160;Sarles, M.&#160;Thi&#233;baut, Mme&#160;Tuffnell et les membres du groupe La R&#233;publique en Marche"
  },
  "pointeurFragmentTexte": {
    "division": {
      "titre": "Article 23",
      "articleDesignationCourte": "ART. 23",
      "type": "ARTICLE",
      "avantAApres": "A",
      "divisionRattachee": "ARTICLE 23",
      "urlDivisionTexteVise": "/15/textes/1831.asp#D_Article_23"
    },
    "alinea": {
      "avantAApres": "Apres",
      "numero": "5"
    }
  },
  "corps": {
    "dispositif": "<p style=\"text-align: justify;\">Apr&#232;s l&#8217;alin&#233;a&#160;5, ins&#233;rer l&#8217;alin&#233;a suivant&#160;:</p><p style=\"text-align: justify;\">&#171;&#160;Ces dispositions s&#8217;appliquent &#233;galement aux gestionnaires des voies fluviales et des ports, et aux personnes agissant pour le compte de ces gestionnaires, pour l&#8217;approvisionnement &#233;lectrique des bateaux, engins flottants et &#233;tablissements flottants au sens de l&#8217;article L.&#160;4000&#8209;3 du code des transports, ainsi que des navires au sens de l&#8217;article L.&#160;5000&#8209;2 du code des transports.&#160;&#187;</p>",
    "exposeSommaire": "<p style=\"text-align: justify;\">Les ports, qu&#8217;ils soient de plaisance ou de commerce, et notamment les Grands Ports Maritimes, re&#231;oivent dans leurs infrastructures des navires qui la plupart du temps fonctionnent au diesel (MDO - Marine Diesel Oil). Dans quelques cas rares, ils fonctionnent au fuel lourd (HFO - Hight Fuel Oil) mais ils sont alors &#233;quip&#233;s de &#171; scrubbers &#187; qui nettoient les fum&#233;es des oxydes de soufre, ou bien ils fonctionnement au GNL (Gaz Naturel Liqu&#233;fi&#233;) qui est un carburant qui rejette beaucoup moins de polluants (SOx, NOx, particules) mais qui reste une &#233;nergie fossile qui g&#233;n&#232;re du dioxyde de carbone (CO2).</p><p style=\"text-align: justify;\">Afin de favoriser la transition &#233;cologique et de r&#233;duire les gaz &#224; effet de serre &#233;mis par le transport maritime, la solution la plus favorable dans les ports est la mise &#224; disposition d&#8217;alimentations &#233;lectriques, de sorte que les navires en escale puissent couper leurs moteurs thermiques (groupe &#233;lectrog&#232;nes fonctionnant &#224; partir d&#8217;&#233;nergies fossiles) pendant la dur&#233;e de leur s&#233;jour &#224; quai. En fonction de sa taille, un navire en stationnement peut repr&#233;senter l&#8217;&#233;quivalent de plusieurs milliers de voitures ; par exemple, les navires assurant la desserte de la Corse &#224; partir de Marseille, quand ils sont &#224; quai, consomment autant de diesel que 3000 voitures faisant l&#8217;aller-retour entre Aix-en-Provence et Marseille, soit 64 km.</p><p style=\"text-align: justify;\">Le pr&#233;sent article pr&#233;voit donc de clarifier le statut juridique des op&#233;rateurs d&#8217;infrastructures de recharge de v&#233;hicules &#233;lectriques, en pr&#233;cisant que cette activit&#233; ne constitue pas une fourniture d&#8217;&#233;lectricit&#233;, mais une prestation de service. En outre, le pr&#233;sent article permet de r&#233;duire fortement les co&#251;ts de raccordement des infrastructures de recharge &#233;lectrique au r&#233;seau d&#8217;&#233;lectricit&#233;, en relevant le plafond de prise en charge de ces co&#251;ts par le tarif d&#8217;utilisation des r&#233;seaux publics d&#8217;&#233;lectricit&#233; (TURPE) de 40 % &#224; 75 %.</p><p style=\"text-align: justify;\">La fourniture d'&#233;lectricit&#233; &#224; quai est un levier tr&#232;s important pour permettre la transition &#233;nerg&#233;tique du secteur fluvial et du secteur maritime et de contribuer ainsi &#224; l&#8217;atteinte des objectifs du Plan climat. Le pr&#233;sent amendement propose de clarifier l&#8217;articulation entre prestation de service de recharge et de fourniture d'&#233;nergie, pour ce qui concerne l'alimentation &#233;lectrique &#224; quai des bateaux, engins flottants, &#233;tablissements flottants et navires.</p>"
  },
  "representations": [
    {
      "nom": "PDF",
      "typeMime": {
        "type": "application",
        "subType": "PDF"
      },
      "statutRepresentation": {
        "verbatim": true,
        "canonique": true,
        "officielle": true,
        "transcription": false,
        "enregistrement": false
      },
      "contenu": {
        "documentURI": "/15/amendements/1831/CION-DVP/CD2848.pdf"
      }
    }
  ],
  "sort": {
    "dateSaisie": "2019-05-17T19:01:17.000+02:00",
    "sortEnSeance": "Retiré"
  },
  "dateDepot": "2019-05-10T02:00:00.000+02:00",
  "dateDistribution": "2019-05-16T02:00:00.000+02:00",
  "article99": "0",
  "loiReference": {}
}