{
  "uid": "AMANR5L15SEA717460BTC1019P0D1N2089",
  "identifiant": {
    "legislature": "15",
    "numero": "2089",
    "numRect": "0",
    "saisine": {
      "texteLegislatifRef": "PRJLANR5L15BTC1019",
      "numeroPartiePLF": "0",
      "organeExamen": "PO717460",
      "mentionSecondeDeliberation": "0"
    }
  },
  "numeroLong": "2089",
  "etapeTexte": "1ère lecture (1ère assemblée saisie)",
  "triAmendement": "ess",
  "cardinaliteAmdtMultiples": "1",
  "etat": "Discuté",
  "signataires": {
    "auteur": {
      "typeAuteur": "Depute",
      "acteurRef": "PA717379",
      "groupePolitiqueRef": "PO730964"
    },
    "cosignatairesRefs": [
      "PA722126",
      "PA721710",
      "PA719186",
      "PA720074",
      "PA718706",
      "PA721246",
      "PA720480",
      "PA606171",
      "PA721336",
      "PA722086",
      "PA608083",
      "PA718810",
      "PA722022",
      "PA719540",
      "PA720046",
      "PA722062",
      "PA334768",
      "PA719980",
      "PA720362",
      "PA720170",
      "PA719756",
      "PA719842",
      "PA720916",
      "PA722102",
      "PA719814",
      "PA331835",
      "PA720932",
      "PA720738",
      "PA722268",
      "PA642788",
      "PA720512",
      "PA719072",
      "PA719350",
      "PA718744",
      "PA719512",
      "PA717379",
      "PA720900",
      "PA718694",
      "PA718910",
      "PA720500"
    ],
    "texteAffichable": "M.&#160;Maillard,  Mme&#160;Rilhac, Mme&#160;Colboc, M.&#160;Pietraszewski, Mme&#160;Bagarry, M.&#160;Belhaddad, M.&#160;Borowczyk, Mme&#160;Bourguignon, Mme&#160;Brocard, M.&#160;Chiche, Mme&#160;Cloarec, M.&#160;Da Silva, M.&#160;Marc&#160;Delatte, Mme&#160;Dufeu Schubert, Mme&#160;Fontaine-Domeizel, Mme&#160;Gaillot, Mme&#160;Grandjean, Mme&#160;Granjus, Mme&#160;Iborra, Mme&#160;Janvier, Mme&#160;Khattabi, M.&#160;Laabid, Mme&#160;Lazaar, Mme&#160;Lecocq, M.&#160;Mesnier, M.&#160;Michels, Mme&#160;Val&#233;rie&#160;Petit, Mme&#160;Peyron, Mme&#160;Pitollat, Mme&#160;Mireille&#160;Robert, Mme&#160;Romeiro Dias, Mme&#160;Tamarelle-Verhaeghe, M.&#160;Taquet, M.&#160;Touraine, Mme&#160;Toutut-Picard, M.&#160;V&#233;ran, Mme&#160;Vidal, Mme&#160;Vignon, Mme&#160;Wonner, M.&#160;Ferrand et les membres du groupe La R&#233;publique en Marche"
  },
  "pointeurFragmentTexte": {
    "division": {
      "titre": "Article 11",
      "articleDesignationCourte": "ART. 11",
      "type": "ARTICLE",
      "avantAApres": "A",
      "divisionRattachee": "ARTICLE 11",
      "urlDivisionTexteVise": "/15/textes/1019.asp#D_Article_11"
    },
    "alinea": {
      "avantAApres": "A",
      "numero": "36",
      "alineaDesignation": "Alinéa 36"
    }
  },
  "corps": {
    "dispositif": "<p style=\"text-align: justify;\">Apr&#232;s la premi&#232;re occurrence du&#160;mot&#160;:</p><p style=\"text-align: justify;\">&#171;&#160;mobilit&#233;&#160;&#187;,</p><p style=\"text-align: justify;\">r&#233;diger ainsi la fin de l'alin&#233;a&#160;36&#160;:</p><p style=\"text-align: justify;\">&#171; nationale et internationale des apprentis, en nommant un personnel d&#233;di&#233;, pouvant &#234;tre un r&#233;f&#233;rent mobilit&#233; mobilisant, au niveau national, les ressources locales et au niveau international,les programmes de l&#8217;Union&#160;europ&#233;enne, et en mentionnant, le cas &#233;ch&#233;ant, dans le contenu de la formation, la p&#233;riode de mobilit&#233;&#160;;&#160;&#187;</p>",
    "exposeSommaire": "<p style=\"text-align: justify;\">Cet amendement vise &#224; encouragerla mobilit&#233; nationale et internationale des apprentis.La mobilit&#233; recouvre plusieurs perspectives diff&#233;rentes, la mobilit&#233; sur le territoire national et la mobilit&#233; &#224; l&#8217;international, plus pr&#233;cis&#233;ment gr&#226;ce au dispositif Erasmus Pro. Un des freins identifi&#233;s, parmi les obstacles non-financiers, pouvant faire obstacle au d&#233;veloppement des formations par apprentissage, concerne la difficult&#233; pour les &#233;l&#232;ves &#224; pouvoir trouver des modes d&#8217;h&#233;bergement qui soient &#224; la fois proches de leur lieu de formation et du p&#244;le &#233;conomique identifi&#233;.</p><p style=\"text-align: justify;\">Il est donc souhaitable qu&#8217;une personne puisse travailler, notamment avec la r&#233;gion, &#224; &#233;tablir une carte des diff&#233;rentes possibilit&#233;s offertes sur le territoire proche (chambre chez l&#8217;habitant, foyer des jeunes travailleurs, logements &#233;tudiants, etc.). Ce r&#233;f&#233;rent doit &#233;galement pouvoir &#339;uvrer, en cas de p&#233;nurie, &#224; des projets de cr&#233;ations d&#8217;internats. Ce r&#233;f&#233;rent, qui pourra dans un premier temps &#234;tre mutualis&#233; entre plusieurs &#233;tablissements, pourra &#233;galement concernant le volet international, trouver une entreprise &#224; l&#8217;&#233;tranger pouvant accueillir le jeune, organiser des jumelages, l&#8217;aider dans la r&#233;solution de l&#8217;ensemble des probl&#232;mes administratifs que cela va poser et n&#233;cessitant un accompagnement. Il ouvrira de nouvelles possibilit&#233;s de mobilit&#233; internationale aux &#233;l&#232;ves des territoires ultramarins, notamment dans leurs zones g&#233;ographiques. Il est donc souhaitable que dans chaque centre de formation des apprentis (CFA) o&#249; cela sera possible, ou &#224; travers la mise en place d&#8217;un r&#233;f&#233;rent mutualis&#233; par plusieurs CFA, une personne puisse &#234;tre identifi&#233;e, tant par les jeunes, que par la communaut&#233; &#233;ducative et les acteurs concern&#233;s.</p>"
  },
  "representations": [
    {
      "nom": "PDF",
      "typeMime": {
        "type": "application",
        "subType": "PDF"
      },
      "statutRepresentation": {
        "verbatim": true,
        "canonique": true,
        "officielle": true,
        "transcription": false,
        "enregistrement": false
      },
      "contenu": {
        "documentURI": "/15/amendements/1019/AN/2089.pdf"
      }
    }
  ],
  "seanceDiscussion": "RUANR5L15S2018IDS21103",
  "sort": {
    "dateSaisie": "2018-06-15T00:22:31.000+02:00",
    "sortEnSeance": "Adopté"
  },
  "dateDepot": "2018-06-07T02:00:00.000+02:00",
  "dateDistribution": "2018-06-11T02:00:00.000+02:00",
  "article99": "0",
  "loiReference": {}
}