{
  "uid": "AMANR5L15PO420120B1297P0D1N557",
  "identifiant": {
    "legislature": "15",
    "numero": "557",
    "numRect": "0",
    "saisine": {
      "texteLegislatifRef": "PRJLANR5L15B1297",
      "numeroPartiePLF": "0",
      "organeExamen": "PO420120",
      "mentionSecondeDeliberation": "0"
    }
  },
  "numeroLong": "AS557",
  "etapeTexte": "1ère lecture (1ère assemblée saisie)",
  "triAmendement": "duaaaaaaaaaaaaaaaaaaaaaaaaaaaaaaaaaaaaaaaaaaaaaaaai",
  "cardinaliteAmdtMultiples": "1",
  "etat": "Discuté",
  "signataires": {
    "auteur": {
      "typeAuteur": "Depute",
      "acteurRef": "PA642764",
      "groupePolitiqueRef": "PO758835"
    },
    "cosignatairesRefs": [
      "PA609590",
      "PA332614",
      "PA333285",
      "PA340357",
      "PA642764",
      "PA720988",
      "PA405480",
      "PA643145",
      "PA333818",
      "PA335054",
      "PA1008",
      "PA605069",
      "PA608695",
      "PA609332",
      "PA342415",
      "PA608011",
      "PA337483",
      "PA340343",
      "PA267233",
      "PA1809",
      "PA508",
      "PA719930",
      "PA335532",
      "PA1592",
      "PA429893",
      "PA610681",
      "PA1198",
      "PA607553",
      "PA608741",
      "PA608172"
    ],
    "texteAffichable": "M.&#160;Aviragnet,  Mme&#160;Bareigts, Mme&#160;Battistel, Mme&#160;Bi&#233;mouret, M.&#160;Bouillon, M.&#160;Jean-Louis&#160;Bricout, M.&#160;Carvounas, M.&#160;Alain&#160;David, Mme&#160;Laurence&#160;Dumont, M.&#160;Faure, M.&#160;Garot, M.&#160;David&#160;Habib, M.&#160;Hutin, M.&#160;Juanico, Mme&#160;Karamanli, M.&#160;J&#233;r&#244;me&#160;Lambert, M.&#160;Letchimy, Mme&#160;Manin, Mme&#160;Pau-Langevin, Mme&#160;Pires Beaune, M.&#160;Potier, M.&#160;Pueyo, M.&#160;Pupponi, Mme&#160;Rabault, M.&#160;Saulignac, Mme&#160;Tolmont, Mme&#160;Untermaier, Mme&#160;Vainqueur-Christophe, M.&#160;Vallaud et Mme&#160;Victory"
  },
  "pointeurFragmentTexte": {
    "division": {
      "titre": "Article 26",
      "articleDesignationCourte": "ART. 26",
      "type": "ARTICLE",
      "avantAApres": "A",
      "divisionRattachee": "ARTICLE 26",
      "urlDivisionTexteVise": "/15/textes/1297.asp#D_Article_26"
    }
  },
  "corps": {
    "dispositif": "<p>Supprimer cet article.</p>",
    "exposeSommaire": "<p>Cet article organise la trajectoire pluriannuelle des r&#233;gimes obligatoires de base pour les quatre ann&#233;es &#224; venir (2018-2022).</p><p>Or cette trajectoire pluriannuelle des r&#233;gimes obligatoires de base pr&#233;voit notamment une <b>participation de la s&#233;curit&#233; sociale &#224; la prise en charge du renforcement des all&#233;gements g&#233;n&#233;raux</b> comme pr&#233;conis&#233; dans le rapport Charpy-Dubertret sur les relations financi&#232;res entre l&#8217;&#201;tat et la s&#233;curit&#233; sociale et qui vise &#224; transf&#233;rer les exc&#233;dents de la S&#233;curit&#233; sociale dans les caisses de l&#8217;&#201;tat.</p><p>Le groupe socialiste s'oppose &#224; cette confiscation par l&#8217;&#201;tat des exc&#233;dents du budget de la S&#233;curit&#233; sociale. Nous sommes au contraire favorables &#224; l'autonomie financi&#232;re de la S&#233;curit&#233; sociale, c'est la raison pour laquelle nous proposons de supprimer cet article.</p>"
  },
  "representations": [
    {
      "nom": "PDF",
      "typeMime": {
        "type": "application",
        "subType": "PDF"
      },
      "statutRepresentation": {
        "verbatim": true,
        "canonique": true,
        "officielle": true,
        "transcription": false,
        "enregistrement": false
      },
      "contenu": {
        "documentURI": "/15/amendements/1297/CION-SOC/AS557.pdf"
      }
    }
  ],
  "sort": {
    "dateSaisie": "2018-10-16T22:41:42.000+02:00",
    "sortEnSeance": "Rejeté"
  },
  "dateDepot": "2018-10-12T02:00:00.000+02:00",
  "dateDistribution": "2018-10-15T02:00:00.000+02:00",
  "article99": "0",
  "loiReference": {}
}