{
  "uid": "AMANR5L15SEA717460BTC1955P0D1N556",
  "identifiant": {
    "legislature": "15",
    "numero": "556",
    "numRect": "0",
    "saisine": {
      "texteLegislatifRef": "PNREANR5L15BTC1955",
      "numeroPartiePLF": "0",
      "organeExamen": "PO717460",
      "mentionSecondeDeliberation": "0"
    }
  },
  "numeroLong": "556",
  "etapeTexte": "Lecture unique",
  "triAmendement": "bboaaaaaaaaaaaaaaaaaaaaaaaaaaaaaaaaaaaaaaaaaaaaaaaeazi",
  "cardinaliteAmdtMultiples": "1",
  "etat": "Discuté",
  "signataires": {
    "auteur": {
      "typeAuteur": "Depute",
      "acteurRef": "PA709315",
      "groupePolitiqueRef": "PO730934"
    },
    "cosignatairesRefs": [
      "PA709315"
    ],
    "texteAffichable": "M.&#160;Viala"
  },
  "pointeurFragmentTexte": {
    "division": {
      "titre": "Article 8",
      "articleDesignationCourte": "ART. 8",
      "type": "ARTICLE",
      "avantAApres": "A",
      "divisionRattachee": "ARTICLE 8",
      "urlDivisionTexteVise": "/15/textes/1955.asp#D_Article_8"
    }
  },
  "corps": {
    "dispositif": "<p style=\"text-align: justify;\">Supprimer cet article.</p>",
    "exposeSommaire": "<p style=\"text-align: justify;\">M&#234;me si nous pouvons partager le souhait de fluidifier et de moderniser le d&#233;roulement des travaux de l&#8217;Assembl&#233;e nationale, la r&#233;duction telle que pr&#233;vue par le Gouvernement du temps de parole en discussion g&#233;n&#233;rale pose plusieurs probl&#232;mes pour le bon d&#233;roulement de nos travaux.</p><p style=\"text-align: justify;\">Tout d&#8217;abord, son amputation aussi drastique porte atteinte &#224; la capacit&#233; des parlementaires &#224; travers leurs groupes d&#8217;exprimer de mani&#232;re &#233;labor&#233;e un point de vue &#233;tay&#233; sur les enjeux politiques li&#233;s au texte en d&#233;bat. Certains textes mettent en lumi&#232;re des enjeux politiques capitaux, il est indispensable que ceux-ci soient discut&#233;s.</p><p style=\"text-align: justify;\">Limiter &#224; 5 minutes par groupe le temps d&#8217;expression en discussion g&#233;n&#233;rale prive de la possibilit&#233; pour les groupes d&#8217;avoir plusieurs orateurs qui expriment des approches nuanc&#233;es sur le texte.</p><p style=\"text-align: justify;\">Il est aujourd&#8217;hui inenvisageable que la repr&#233;sentativit&#233; des groupes dans l&#8217;H&#233;micycle ne se refl&#232;te pas dans les temps de parole attribu&#233;s dans la discussion g&#233;n&#233;rale.</p>"
  },
  "representations": [
    {
      "nom": "PDF",
      "typeMime": {
        "type": "application",
        "subType": "PDF"
      },
      "statutRepresentation": {
        "verbatim": true,
        "canonique": true,
        "officielle": true,
        "transcription": false,
        "enregistrement": false
      },
      "contenu": {
        "documentURI": "/15/amendements/1955/AN/556.pdf"
      }
    }
  ],
  "seanceDiscussion": "RUANR5L15S2019IDS21669",
  "sort": {
    "dateSaisie": "2019-05-28T21:57:09.000+02:00",
    "sortEnSeance": "Rejeté"
  },
  "dateDepot": "2019-05-23T02:00:00.000+02:00",
  "dateDistribution": "2019-05-27T02:00:00.000+02:00",
  "article99": "0",
  "loiReference": {}
}