{
  "uid": "AMANR5L15SEA717460BTC1175P0D1N345",
  "identifiant": {
    "legislature": "15",
    "numero": "345",
    "numRect": "0",
    "saisine": {
      "texteLegislatifRef": "PRJLANR5L15BTC1175",
      "numeroPartiePLF": "0",
      "organeExamen": "PO717460",
      "mentionSecondeDeliberation": "0"
    }
  },
  "numeroLong": "345",
  "etapeTexte": "Nouvelle Lecture",
  "triAmendement": "aeiaaaaaaaaaaaaaaaaaaaaaaaaaaaaaaaaaaaaaaaaaaaaaaasedzzzz",
  "cardinaliteAmdtMultiples": "1",
  "etat": "Discuté",
  "signataires": {
    "auteur": {
      "typeAuteur": "Depute",
      "acteurRef": "PA719318",
      "groupePolitiqueRef": "PO730934"
    },
    "cosignatairesRefs": [
      "PA719318"
    ],
    "texteAffichable": "Mme&#160;Anthoine"
  },
  "pointeurFragmentTexte": {
    "division": {
      "titre": "Article 4",
      "articleDesignationCourte": "ART. 4",
      "type": "ARTICLE",
      "avantAApres": "A",
      "divisionRattachee": "ARTICLE 4",
      "urlDivisionTexteVise": "/15/textes/1175.asp#D_Article_4"
    },
    "alinea": {
      "numero": "16"
    }
  },
  "corps": {
    "dispositif": "<p style=\"text-align: justify;\">Compl&#233;ter l&#8217;alin&#233;a&#160;16 par les mots&#160;:</p><p style=\"text-align: justify;\">&#171;&#160;sur la base des recommandations du m&#233;diateur des relations commerciales agricoles&#160;&#187;.</p>",
    "exposeSommaire": "<p style=\"text-align: justify;\">Le texte ne pr&#233;voit aucun recours en cas d&#8217;&#233;chec de la m&#233;diation sur les questions contractuelles (accord-cadre, contrat individuel, clause de ren&#233;gociation). Or, face au caract&#232;re p&#233;rissable des produits concern&#233;s par les contrats conclus par les producteurs agricoles, l&#8217;atelier 7 des &#201;tats G&#233;n&#233;raux de l&#8217;Alimentation avait conclu sur la n&#233;cessit&#233; de mettre en place un commission arbitrale, refus&#233;e par le gouvernement malgr&#233; le consensus des acteurs. Pour rappel, l&#8217;atelier 7 mentionnait l&#8217;int&#233;r&#234;t d&#8217;un &#171; dispositif d&#8217;arbitrage ayant le pouvoir d&#8217;imposer rapidement une d&#233;cision&#160;&#187;. Le cadre doit &#234;tre fortement dissuasif au regard du d&#233;s&#233;quilibre dans la cha&#238;ne d&#8217;approvisionnement, en pr&#233;voyant une proc&#233;dure en cas d&#8217;&#233;chec de la m&#233;diation qui soit rapide et efficace.<br />Si ce sont les parties seulement qui ont la capacit&#233; de saisir le juge en r&#233;f&#233;r&#233;, il est indispensable que les recommandations de m&#233;diateur des relations commerciales agricoles soient communiqu&#233;es et utilis&#233;es par le juge. Ainsi le juge pourra prendre une d&#233;cision en se basant sur les conclusions du m&#233;diateur sans pour autant rouvrir tout le dossier, ce qui sera un gain de temps consid&#233;rable pour la partie saisissante.</p>"
  },
  "representations": [
    {
      "nom": "PDF",
      "typeMime": {
        "type": "application",
        "subType": "PDF"
      },
      "statutRepresentation": {
        "verbatim": true,
        "canonique": true,
        "officielle": true,
        "transcription": false,
        "enregistrement": false
      },
      "contenu": {
        "documentURI": "/15/amendements/1175/AN/345.pdf"
      }
    }
  ],
  "seanceDiscussion": "RUANR5L15S2018IDS21233",
  "sort": {
    "dateSaisie": "2018-09-13T19:38:43.000+02:00",
    "sortEnSeance": "Non soutenu"
  },
  "dateDepot": "2018-09-04T02:00:00.000+02:00",
  "dateDistribution": "2018-09-10T02:00:00.000+02:00",
  "article99": "0",
  "loiReference": {}
}