{
  "uid": "AMANR5L15PO59051B0846P0D1N37",
  "identifiant": {
    "legislature": "15",
    "numero": "37",
    "numRect": "0",
    "saisine": {
      "texteLegislatifRef": "PRJLANR5L15B0846",
      "numeroPartiePLF": "0",
      "organeExamen": "PO59051",
      "mentionSecondeDeliberation": "0"
    }
  },
  "numeroLong": "CL37",
  "etapeTexte": "1ère lecture (1ère assemblée saisie)",
  "triAmendement": "o",
  "cardinaliteAmdtMultiples": "1",
  "etat": "Discuté",
  "signataires": {
    "auteur": {
      "typeAuteur": "Depute",
      "acteurRef": "PA720430",
      "groupePolitiqueRef": "PO730958"
    },
    "cosignatairesRefs": [
      "PA719676",
      "PA720422",
      "PA720430",
      "PA721226",
      "PA721210",
      "PA718860",
      "PA588884",
      "PA720846",
      "PA720892",
      "PA722142",
      "PA720286",
      "PA718868",
      "PA721202",
      "PA721062",
      "PA719578",
      "PA2150",
      "PA721960"
    ],
    "texteAffichable": "M.&#160;Bernalicis,  Mme&#160;Autain, M.&#160;Coquerel, M.&#160;Corbi&#232;re, Mme&#160;Fiat, M.&#160;Lachaud, M.&#160;Larive, M.&#160;M&#233;lenchon, Mme&#160;Obono, Mme&#160;Panot, M.&#160;Prud&apos;homme, M.&#160;Quatennens, M.&#160;Ratenon, Mme&#160;Ressiguier, Mme&#160;Rubin, M.&#160;Ruffin et Mme&#160;Taurine"
  },
  "pointeurFragmentTexte": {
    "division": {
      "titre": "Article 54",
      "articleDesignationCourte": "ART. 54",
      "type": "ARTICLE",
      "avantAApres": "A",
      "divisionRattachee": "ARTICLE 54",
      "urlDivisionTexteVise": "/15/textes/0846.asp#D_Article_54"
    },
    "alinea": {
      "avantAApres": "A",
      "numero": "24",
      "alineaDesignation": "Alinéa 24"
    }
  },
  "corps": {
    "dispositif": "<p>I.&#160;&#8211;&#160;&#192; la premi&#232;re phrase de l&#8217;alin&#233;a&#160;24, substituer aux mots&#160;:</p><p>&#171;&#160;peut suspendre&#160;&#187;</p><p>le mot&#160;:</p><p>&#171;&#160;suspend&#160;&#187;.</p><p>II.&#160;&#8211;&#160;En cons&#233;quence, &#224; la m&#234;me premi&#232;re phrase de l&#8217;alin&#233;a&#160;24, substituer aux mots&#160;:</p><p>&#171;&#160;1&#176; et au&#160;4&#176;&#160;&#187;</p><p>les mots&#160;:</p><p>&#171;&#160;1&#176;, 2&#176;, 4&#176; et&#160;5&#176;&#160;&#187;.</p>",
    "exposeSommaire": "<p>Nous reconnaissons l&#8217;avanc&#233;e que constitue, pour le pr&#233;fet, la possibilit&#233; de limiter la cr&#233;ation, en p&#233;riph&#233;rie, de centres commerciaux d&#8217;une surface sup&#233;rieure &#224; 1 000 m&#232;tres carr&#233;s. Mais nous voudrions aller plus loin. Au regard de l&#8217;urgence &#233;cologique, il est indispensable de limiter la cr&#233;ation et l&#8217;extension de nouveaux centres commerciaux en p&#233;riph&#233;rie d&#8217;une surface sup&#233;rieure &#224; 1000 m&#232;tres carr&#233;s. Cet amendement entend renforcer les pr&#233;rogatives du repr&#233;sentant de l&#8217;&#201;tat &#224; ce sujet.</p>"
  },
  "representations": [
    {
      "nom": "PDF",
      "typeMime": {
        "type": "application",
        "subType": "PDF"
      },
      "statutRepresentation": {
        "verbatim": true,
        "canonique": true,
        "officielle": true,
        "transcription": false,
        "enregistrement": false
      },
      "contenu": {
        "documentURI": "/15/amendements/0846/CION_LOIS/CL37.pdf"
      }
    }
  ],
  "sort": {
    "dateSaisie": "2018-05-15T11:23:21.000+02:00",
    "sortEnSeance": "Non soutenu"
  },
  "dateDepot": "2018-05-09T02:00:00.000+02:00",
  "dateDistribution": "2018-05-11T02:00:00.000+02:00",
  "article99": "0",
  "loiReference": {
    "codeLoi": "1"
  }
}