{
  "uid": "AMANR5L15SEA717460BTC1019P0D1N1067",
  "identifiant": {
    "legislature": "15",
    "numero": "1067",
    "numRect": "0",
    "saisine": {
      "texteLegislatifRef": "PRJLANR5L15BTC1019",
      "numeroPartiePLF": "0",
      "organeExamen": "PO717460",
      "mentionSecondeDeliberation": "1"
    }
  },
  "numeroLong": "1067",
  "etapeTexte": "1ère lecture (1ère assemblée saisie)",
  "triAmendement": "ghy",
  "cardinaliteAmdtMultiples": "1",
  "etat": "Discuté",
  "signataires": {
    "auteur": {
      "typeAuteur": "Depute",
      "acteurRef": "PA605036",
      "groupePolitiqueRef": "PO730934"
    },
    "cosignatairesRefs": [
      "PA718884",
      "PA643134",
      "PA721046",
      "PA718838",
      "PA267450",
      "PA721968",
      "PA719318",
      "PA642847",
      "PA266793",
      "PA767",
      "PA2377",
      "PA718784",
      "PA608016",
      "PA607090",
      "PA2792",
      "PA267378",
      "PA267429",
      "PA720100",
      "PA346218",
      "PA608416",
      "PA605036",
      "PA720684",
      "PA1874",
      "PA267735",
      "PA721678",
      "PA720630",
      "PA340853",
      "PA718850"
    ],
    "texteAffichable": "M.&#160;Abad,  M.&#160;Le Fur, M.&#160;Brun, M.&#160;Cattin, M.&#160;Pradi&#233;, M.&#160;R&#233;mi&#160;Delatte, M.&#160;Pauget, M.&#160;Perrut, Mme&#160;Levy, M.&#160;Hetzel, M.&#160;Masson, M.&#160;Jean-Pierre&#160;Vigier, M.&#160;Leclerc, M.&#160;Cordier, M.&#160;Cinieri, M.&#160;Bony, M.&#160;Reda, M.&#160;de Ganay, M.&#160;Pierre-Henri&#160;Dumont, M.&#160;Vialay, Mme&#160;Louwagie, Mme&#160;Bazin-Malgras, Mme&#160;Anthoine, M.&#160;Minot, Mme&#160;Valentin, Mme&#160;Bassire, M.&#160;Taugourdeau et M.&#160;Bazin"
  },
  "pointeurFragmentTexte": {
    "division": {
      "titre": "Article 15",
      "articleDesignationCourte": "ART. 15",
      "type": "ARTICLE",
      "avantAApres": "A",
      "divisionRattachee": "ARTICLE 15",
      "urlDivisionTexteVise": "/15/textes/1019.asp#D_Article_15"
    },
    "alinea": {
      "numero": "77"
    }
  },
  "corps": {
    "dispositif": "<p>I.&#160;&#8211;&#160;&#192; la derni&#232;re phrase de l&#8217;alin&#233;a&#160;77, substituer &#224; la premi&#232;re occurrence du mot&#160;:</p><p>&#171;&#160;mai&#160;&#187;</p><p>le mot&#160;:</p><p>&#171;&#160;mars&#160;&#187;.</p><p>II.&#160;&#8211; En cons&#233;quence, &#224; la m&#234;me phrase, substituer &#224; la seconde occurrence du mot&#160;:</p><p>&#171;&#160;mai&#160;&#187;</p><p>le mot&#160;:</p><p>&#171;&#160;mars&#160;&#187;.</p>",
    "exposeSommaire": "<p style=\"text-align: justify;\">Le projet de loi pr&#233;voit que la R&#233;gion &#233;tablit un rapport annuel sur la gestion de l&#8217;apprentissage pour 2018 et 2019.</p><p style=\"text-align: justify;\">Celui-ci doit &#234;tre remis en mai de l&#8217;ann&#233;e n+1. Or, les op&#233;rateurs de comp&#233;tences qui sont fortement int&#233;ress&#233;s par les &#233;l&#233;ments transmis doivent pouvoir avoir les informations plus t&#244;t dans l&#8217;ann&#233;e pour adapter leurs propres analyses. Aussi, il conviendrait d&#8217;avancer la date de remise du rapport &#224; mars.</p><p style=\"text-align: justify;\">Cet amendement vise &#224; la r&#233;duction des d&#233;lais de publication par les r&#233;gions des rapports sur la gestion de l&#8217;apprentissage</p>"
  },
  "representations": [
    {
      "nom": "PDF",
      "typeMime": {
        "type": "application",
        "subType": "PDF"
      },
      "statutRepresentation": {
        "verbatim": true,
        "canonique": true,
        "officielle": true,
        "transcription": false,
        "enregistrement": false
      },
      "contenu": {
        "documentURI": "/15/amendements/1019/AN/1067.pdf"
      }
    }
  ],
  "seanceDiscussion": "RUANR5L15S2018IDS21104",
  "sort": {
    "dateSaisie": "2018-06-15T12:46:45.000+02:00",
    "sortEnSeance": "Rejeté"
  },
  "dateDepot": "2018-06-07T02:00:00.000+02:00",
  "dateDistribution": "2018-06-12T02:00:00.000+02:00",
  "article99": "0",
  "loiReference": {}
}