{
  "uid": "AMANR5L15SEA717460BTC1600P0D1N92",
  "identifiant": {
    "legislature": "15",
    "numero": "92",
    "numRect": "1",
    "saisine": {
      "texteLegislatifRef": "PIONANR5L15BTC1600",
      "numeroPartiePLF": "0",
      "organeExamen": "PO717460",
      "mentionSecondeDeliberation": "0"
    }
  },
  "numeroLong": "92 (Rect)",
  "etapeTexte": "1ère lecture (2ème assemblée saisie)",
  "triAmendement": "bcaaaaaaaaaaaaaaaaaaaaaaaaaaaaaaaaaaaaaaaaaaaaaaaabr",
  "cardinaliteAmdtMultiples": "1",
  "etat": "Discuté",
  "signataires": {
    "auteur": {
      "typeAuteur": "Depute",
      "acteurRef": "PA721960",
      "groupePolitiqueRef": "PO730958"
    },
    "cosignatairesRefs": [
      "PA721960",
      "PA720846",
      "PA719578",
      "PA721062",
      "PA720892",
      "PA718860",
      "PA720430",
      "PA721210",
      "PA721202",
      "PA720286",
      "PA718868",
      "PA2150",
      "PA719676",
      "PA588884",
      "PA722142",
      "PA721226",
      "PA720422"
    ],
    "texteAffichable": "Mme&#160;Obono,  Mme&#160;Autain, M.&#160;Bernalicis, M.&#160;Coquerel, M.&#160;Corbi&#232;re, Mme&#160;Fiat, M.&#160;Lachaud, M.&#160;Larive, M.&#160;M&#233;lenchon, Mme&#160;Panot, M.&#160;Prud&apos;homme, M.&#160;Quatennens, M.&#160;Ratenon, Mme&#160;Ressiguier, Mme&#160;Rubin, M.&#160;Ruffin et Mme&#160;Taurine"
  },
  "pointeurFragmentTexte": {
    "division": {
      "titre": "Article PREMIER",
      "articleDesignationCourte": "APRÈS ART. PREMIER",
      "type": "ARTICLE",
      "avantAApres": "Apres",
      "divisionRattachee": "APRÈS L'ARTICLE PREMIER, insérer l'article suivant:",
      "articleAdditionnel": "1",
      "urlDivisionTexteVise": "/15/textes/1600.asp#D_Article_1er"
    }
  },
  "corps": {
    "dispositif": "<p>L&#8217;article L. 211&#8209;4 du code de la s&#233;curit&#233; int&#233;rieure est ainsi modifi&#233;&#160;:</p><p style=\"text-align: justify;\">1&#176; Apr&#232;s le mot&#160;: &#171;&#160;public&#160;&#187;, la fin du premier alin&#233;a est ainsi r&#233;dig&#233;e&#160;:</p><p style=\"text-align: justify;\">&#171;&#160;elle saisit le juge des libert&#233;s qui peut prononcer son interdiction. Cette saisine s&#8217;effectue soit au maximum trois jours francs avant le d&#233;but de la manifestation concern&#233;e lorsque celle-ci a &#233;t&#233; d&#233;clar&#233;e plus de quatre jours francs avant sa date de tenue, soit au maximum deux jours francs lorsque celle-ci a &#233;t&#233; d&#233;clar&#233;e trois jours francs avant sa date de tenue. En cas d&#8217;urgence absolue et d&#8217;&#233;l&#233;ment nouveau &#233;tablissant un risque r&#233;el et s&#233;rieux de troubles graves &#224; l&#8217;ordre public, l&#8217;autorit&#233; investie du pouvoir de police peut toutefois saisir le juge des libert&#233;s et de la d&#233;tention qui a obligation de statuer avant le d&#233;but de la manifestation concern&#233;e.&#160;&#187;&#160;;</p><p style=\"text-align: justify;\">2&#176; Le deuxi&#232;me alin&#233;a est ainsi modifi&#233;&#160;:&#160;</p><p style=\"text-align: justify;\"><i>a) </i>&#192; la premi&#232;re phrase, les mots&#160;: &#171;&#160;dans les vingt-quatre heures&#160;&#187;, sont remplac&#233;s par le mot&#160;: &#171;&#160;imm&#233;diatement&#160;&#187;&#160;;</p><p style=\"text-align: justify;\"><i>b)</i> &#192; la seconde phrase, apr&#232;s le mot&#160;: &#171;&#160;&#233;ch&#233;ant&#160;&#187;, sont ins&#233;r&#233;s les mots&#160;: &#171;&#160;dans les vingt-quatre heures suivant la r&#233;ception de la d&#233;claration de manifestation concern&#233;e,&#160;&#187;.</p>",
    "exposeSommaire": "<p style=\"line-height: 1.2;\">Par cet amendement d&#8217;appel, nous proposons une avanc&#233;e pour la libert&#233; fondamentale de manifester, &#224; savoir modifier le r&#233;gime actuel des interdictions de manifester, pour les manifestations d&#233;clar&#233;es sur la voie publique. Nous sommes le cas &#233;ch&#233;ant ouvert &#224; toute exp&#233;rimentation de ce dispositif.</p><p style=\"text-align: justify;\">Eu &#233;gard au caract&#232;re fondamental et constitutionnel de la libert&#233; de manifester, nous estimons que l&#8217;interdiction d&#8217;une manifestation ne doit pas relever de la seule d&#233;cision du pr&#233;fet (par ailleurs soumis &#224; l&#8217;autorit&#233; directe du ministre de l&#8217;Int&#233;rieur) ou du maire, mais de l&#8217;autorit&#233; judiciaire (le juge des libert&#233;s de la d&#233;tention) sur saisine du pr&#233;fet ou du maire.</p><p style=\"text-align: justify;\">En l&#8217;&#233;tat actuel du droit, le pr&#233;fet (ou le maire) peut interdire &#224; tout moment une manifestation avant qu&#8217;elle ne se tienne (article L 211-4 du code de la s&#233;curit&#233; int&#233;rieure), que cela soit 6 heures avant, 2 heures avant ou quelques minutes avant, d&#233;lais potentiellement particuli&#232;rement courts, ce qui emp&#234;che le droit au recours effectif contre une telle d&#233;cision par les organisateurs.trices de la manifestation ou les manifestant.e.s.</p><p style=\"text-align: justify;\">En nous inspirant des autres r&#233;gimes de police administrative relatifs aux autres libert&#233;s fondamentales, (libert&#233; d&#8217;association, libert&#233; de r&#233;union, notamment), nous proposons donc le m&#233;canisme suivant :</p><p style=\"line-height: 1.2; text-align: justify;\">- S&#8217;il estime que la manifestation (d&#233;clar&#233;e a minima 3 jours avant selon l&#8217;article L 211-1 du code de la s&#233;curit&#233; int&#233;rieure) projet&#233;e est de nature &#224; troubler l'ordre public, le maire ou le pr&#233;fet doit saisir au moins 48 heures avant le d&#233;but d&#233;clar&#233; de la manifestation le juge des libert&#233;s et de la d&#233;tention du tribunal de grande instance concert&#233; (afin que celui-ci ait le temps suffisant pour statuer), qui lui seul peut interdir la manifestation ;</p><p style=\"line-height: 1.2; text-align: justify;\">- Pour que ce d&#233;lai de 48 heures ne fasse pas obstacle &#224; toute urgence, en cas d&#8217;&#233;l&#233;ment nouveau et d&#8217;urgence absolue, le maire ou le pr&#233;fet peuvent saisir le juge &#224; tout moment le juge pour lui soumettre &#224; nouveau une demande d&#8217;interdiction, et celui-ci a obligation de statuer avant le d&#233;but de la manifestation concern&#233;e.</p><p style=\"line-height: 1.2; text-align: justify;\">En d&#233;tail :</p><p style=\"line-height: 1.2; text-align: justify;\">Tous ces avanc&#233;es permettent de mieux garantir la libert&#233; de manifester (l&#8217;interdiction relevant de l&#8217;autorit&#233; judiciaire) avant le d&#233;but de la manifestation elle-m&#234;me, sachant qu&#8217;une fois que celle-ci se tient, en cas de trouble &#224; l&#8217;ordre public, la force publique dispose des moyens de garantir la dispersion de la manifestation, dans les conditions pr&#233;vues &#224; l&#8217;article L 211-9 du code de la s&#233;curit&#233; int&#233;rieure (sommations &#224; se disperser, notamment).</p><p style=\"line-height: 1.2; text-align: justify;\">En outre, contrairement au r&#233;gime actuel, qui pr&#233;voit que le juge administratif est comp&#233;tent pour statuer sur une interdiction de manifester (r&#233;f&#233;r&#233; libert&#233;), eu &#233;gard &#224; l&#8217;importance de cette libert&#233; fondamentale qu&#8217;est la libert&#233; de manifester, nous proposons que ce soit l&#8217;autorit&#233; judiciaire (&#8220;gardienne de la libert&#233; individuelle&#8221; selon l&#8217;article 66 de la Constitution, en l&#8217;esp&#232;ce le juge des libert&#233;s et de la d&#233;tention) qui puisse prononcer ou non une telle interdiction.</p>"
  },
  "representations": [
    {
      "nom": "PDF",
      "typeMime": {
        "type": "application",
        "subType": "PDF"
      },
      "statutRepresentation": {
        "verbatim": true,
        "canonique": true,
        "officielle": true,
        "transcription": false,
        "enregistrement": false
      },
      "contenu": {
        "documentURI": "/15/amendements/1600/AN/92.pdf"
      }
    }
  ],
  "seanceDiscussion": "RUANR5L15S2019IDS21469",
  "sort": {
    "dateSaisie": "2019-01-30T18:04:00.000+01:00",
    "sortEnSeance": "Rejeté"
  },
  "dateDepot": "2019-01-24T01:00:00.000+01:00",
  "dateDistribution": "2019-01-29T01:00:00.000+01:00",
  "article99": "0",
  "loiReference": {
    "codeLoi": "c sécurité intérieure",
    "divisionCodeLoi": "L211-4"
  }
}