{
  "uid": "AMANR5L15PO59051B1882P0D1N179",
  "identifiant": {
    "legislature": "15",
    "numero": "179",
    "numRect": "0",
    "saisine": {
      "texteLegislatifRef": "PNREANR5L15B1882",
      "numeroPartiePLF": "0",
      "organeExamen": "PO59051",
      "mentionSecondeDeliberation": "0"
    }
  },
  "numeroLong": "CL179",
  "etapeTexte": "Lecture unique",
  "triAmendement": "bfaaaaaaaaaaaaaaaaaaaaaaaaaaaaaaaaaaaaaaaaaaaaaaaacczu",
  "cardinaliteAmdtMultiples": "1",
  "etat": "Discuté",
  "signataires": {
    "auteur": {
      "typeAuteur": "Depute",
      "acteurRef": "PA720256",
      "groupePolitiqueRef": "PO730970"
    },
    "cosignatairesRefs": [
      "PA720256"
    ],
    "texteAffichable": "Mme&#160;Bannier"
  },
  "pointeurFragmentTexte": {
    "division": {
      "titre": "Article 8",
      "articleDesignationCourte": "ART. 8",
      "type": "ARTICLE",
      "avantAApres": "A",
      "divisionRattachee": "ARTICLE 8",
      "urlDivisionTexteVise": "/15/textes/1882.asp#D_Article_8"
    },
    "alinea": {
      "numero": "3"
    }
  },
  "corps": {
    "dispositif": "<p style=\"text-align: justify;\">&#192; l&#8217;alin&#233;a&#160;3, apr&#232;s le mot&#160;:</p><p style=\"text-align: justify;\">&#171;&#160;minutes&#160;&#187;,</p><p style=\"text-align: justify;\">ins&#233;rer le mot&#160;:</p><p style=\"text-align: justify;\">&#171;&#160;maximum&#160;&#187;.<br /><br /></p>",
    "exposeSommaire": "<p>Dans l'optique de rendre les d&#233;bats plus efficients, l'ajout du mot\" maximum\" devrait inciter les orateurs &#224; &#234;tre plus concis et &#224; avoir une prise de parole qui n'exc&#232;de pas les 5 minutes, temps parfois outrepass&#233;. Il s'agit d'&#234;tre plus incisif pour permettre un d&#233;bat parlementaire plus dynamique et ais&#233; &#224; suivre.</p>"
  },
  "representations": [
    {
      "nom": "PDF",
      "typeMime": {
        "type": "application",
        "subType": "PDF"
      },
      "statutRepresentation": {
        "verbatim": true,
        "canonique": true,
        "officielle": true,
        "transcription": false,
        "enregistrement": false
      },
      "contenu": {
        "documentURI": "/15/amendements/1882/CION_LOIS/CL179.pdf"
      }
    }
  ],
  "sort": {
    "dateSaisie": "2019-05-15T17:58:41.000+02:00",
    "sortEnSeance": "Non soutenu"
  },
  "dateDepot": "2019-05-10T02:00:00.000+02:00",
  "dateDistribution": "2019-05-14T02:00:00.000+02:00",
  "article99": "0",
  "loiReference": {
    "codeLoi": "4",
    "divisionCodeLoi": "dc1"
  }
}