{
  "uid": "AMANR5L15SEA717460BTC1237P0D1N446",
  "identifiant": {
    "legislature": "15",
    "numero": "446",
    "numRect": "0",
    "saisine": {
      "texteLegislatifRef": "PRJLANR5L15BTC1237",
      "numeroPartiePLF": "0",
      "organeExamen": "PO717460",
      "mentionSecondeDeliberation": "0"
    }
  },
  "numeroLong": "446",
  "etapeTexte": "1ère lecture (1ère assemblée saisie)",
  "triAmendement": "amaaaaaaaaaaaaaaaaaaaaaaaaaaaaaaaaaaaaaaaaaaaaaaaapes",
  "cardinaliteAmdtMultiples": "1",
  "etat": "Discuté",
  "signataires": {
    "auteur": {
      "typeAuteur": "Depute",
      "acteurRef": "PA608016",
      "groupePolitiqueRef": "PO730934"
    },
    "cosignatairesRefs": [
      "PA709315",
      "PA720644",
      "PA608016",
      "PA267901",
      "PA721968",
      "PA720210",
      "PA1012",
      "PA267260",
      "PA266797",
      "PA721678",
      "PA719318",
      "PA2492",
      "PA2377"
    ],
    "texteAffichable": "Mme&#160;Louwagie,  Mme&#160;Anthoine, M.&#160;Kamardine, M.&#160;Viala, M.&#160;de la Verpilli&#232;re, M.&#160;Perrut, M.&#160;Nury, M.&#160;Quentin, M.&#160;Vialay, M.&#160;Reda, Mme&#160;Beauvais, M.&#160;Gosselin et Mme&#160;Poletti"
  },
  "pointeurFragmentTexte": {
    "division": {
      "titre": "Article 9",
      "articleDesignationCourte": "APRÈS ART. 9",
      "type": "ARTICLE",
      "avantAApres": "Apres",
      "divisionRattachee": "APRÈS L'ARTICLE 9, insérer l'article suivant:",
      "articleAdditionnel": "1",
      "urlDivisionTexteVise": "/15/textes/1237.asp#D_Article_9"
    }
  },
  "corps": {
    "dispositif": "<p style=\"text-align: justify;\">La section 1 du chapitre VIII du titre IV du livre V du code mon&#233;taire et financier est compl&#233;t&#233;e par un article L.&#160;548&#8209;3&#8209;1 ainsi r&#233;dig&#233;&#160;:</p><p>&#171;&#160;<i>Art.&#160;L.&#160;548&#8209;3&#8209;1</i>.&#160;&#8211;&#160;Les b&#233;n&#233;ficiaires de financements participatifs qui l&#232;vent des fonds sous forme de pr&#234;ts ou d&#8217;investissements dont le montant d&#233;passe un seuil d&#233;fini par d&#233;cret nomment un commissaire aux comptes charg&#233; du contr&#244;le l&#233;gal.</p><p>&#160;</p><p style=\"text-align: justify;\">&#171;&#160;Le commissaire aux comptes nomm&#233; atteste, au moins tous les ans, que les fonds per&#231;us ont &#233;t&#233; utilis&#233;s conform&#233;ment &#224; l&#8217;objet pr&#233;sent&#233; dans le projet de financement participatif.&#160;&#187;</p>",
    "exposeSommaire": "<p style=\"text-align: justify;\">Le Ministre de l&#8217;Economie et des Finances et la Garde des Sceaux, Ministre de la Justice, ont confi&#233; &#224; un Comit&#233; d&#8217;experts, dont le Pr&#233;sident de l&#8217;Autorit&#233; des Normes comptables assure la pr&#233;sidence, Patrick de Cambourg, le soin de d&#233;terminer des mesures d&#8217;accompagnement pour la profession de commissaire aux comptes (ou contr&#244;leur l&#233;gal des comptes selon la terminologie&#160;europ&#233;enne), dans le cadre du projet de rel&#232;vement des seuils de soumission des soci&#233;t&#233;s commerciales &#224; la certification des comptes &#224; 8 millions d&#8217;euros de chiffre d&#8217;affaires, 4 millions d&#8217;euros de bilan et 50 salari&#233;s. Ce rel&#232;vement de seuils s&#8217;inscrit dans le cadre des mesures du Plan d&#8217;Action pour la Croissance et la Transformation des Entreprises (PACTE) qui visent &#224; all&#233;ger les charges pesant sur les entreprises et notamment les petites et moyennes entreprises (PME).</p><p style=\"text-align: justify;\">Conform&#233;ment &#224; la lettre de mission, le Comit&#233; s&#8217;est attach&#233; &#224; identifier les missions nouvelles susceptibles d&#8217;&#234;tre confi&#233;es aux commissaires aux comptes en veillant notamment &#224; ne pas alourdir les obligations l&#233;gales pesant sur les petites et moyennes entreprises. Il s&#8217;est &#233;galement attach&#233; &#224; identifier les mesures visant, d&#8217;une part, &#224; favoriser le d&#233;veloppement de l&#8217;expertise comptable et, d&#8217;autre part, &#224; enrichir les missions d&#8217;appui et de conseil aux entreprises ne disposant pas d&#8217;un commissaire aux comptes, notamment dans les petites structures.</p><p style=\"text-align: justify;\">A l&#8217;issue de ses travaux, le Comit&#233; a formul&#233; 38 propositions con&#231;ues dans un esprit de coh&#233;rence et de dynamique globales et organis&#233; autour de trois objectifs&#160;:</p><p style=\"text-align: justify;\">&#215; Promouvoir dans le cadre des seuils harmonis&#233;s un nouveau dispositif de contr&#244;le l&#233;gal adapt&#233; aux petites comme aux moyennes entreprises&#160;;</p><p style=\"text-align: justify;\">&#215; Amplifier le r&#244;le du contr&#244;leur l&#233;gal au service de l&#8217;int&#233;r&#234;t g&#233;n&#233;ral et du d&#233;veloppement &#233;conomique et social&#160;;</p><p style=\"text-align: justify;\">&#215; Placer les professions du chiffre dans une dynamique d&#8217;unit&#233; et de contribution &#233;largie.&#160;</p><p style=\"text-align: justify;\">Les plateformes de financement participatif mettent en relation l&#8217;initiateur d&#8217;un projet et des financeurs potentiels.</p><p style=\"text-align: justify;\">D&#232;s lors que ces financements prennent la forme de pr&#234;ts ou d&#8217;investissements, il y a lieu de s&#8217;assurer que le b&#233;n&#233;ficiaire des financements sera en mesure de rembourser la dette ou de r&#233;mun&#233;rer l&#8217;investisseur. Cet objectif est en partie atteint par la surveillance de la sant&#233; financi&#232;re du b&#233;n&#233;ficiaire &#224; travers la certification des comptes et le cas &#233;ch&#233;ant la mise en &#339;uvre de la proc&#233;dure d&#8217;alerte.</p><p style=\"text-align: justify;\">Le d&#233;veloppement des activit&#233;s de financement participatif repose sur l&#8217;assurance que les fonds pr&#234;t&#233;s ou investis sont utilis&#233;s conform&#233;ment &#224; l&#8217;objectif pour lequel les fonds ont &#233;t&#233; appel&#233;s. A cet effet, le commissaire aux comptes du b&#233;n&#233;ficiaire met en &#339;uvre des contr&#244;les sp&#233;cifiques sur l&#8217;utilisation des fonds re&#231;us dans le cadre de l&#8217;op&#233;ration de financement participatif, c&#8217;est ce que pr&#233;conise cet amendement.</p>"
  },
  "representations": [
    {
      "nom": "PDF",
      "typeMime": {
        "type": "application",
        "subType": "PDF"
      },
      "statutRepresentation": {
        "verbatim": true,
        "canonique": true,
        "officielle": true,
        "transcription": false,
        "enregistrement": false
      },
      "contenu": {
        "documentURI": "/15/amendements/1237/AN/446.pdf"
      }
    }
  ],
  "seanceDiscussion": "RUANR5L15S2018IDS21251",
  "sort": {
    "dateSaisie": "2018-09-27T18:33:19.000+02:00",
    "sortEnSeance": "Non soutenu"
  },
  "dateDepot": "2018-09-19T02:00:00.000+02:00",
  "dateDistribution": "2018-09-24T02:00:00.000+02:00",
  "article99": "0",
  "loiReference": {
    "codeLoi": "c monétaire et financier",
    "divisionCodeLoi": "L548-3-1"
  }
}