{
  "uid": "AMANR5L15SEA717460BTC0765P0D1N360",
  "identifiant": {
    "legislature": "15",
    "numero": "360",
    "numRect": "0",
    "saisine": {
      "texteLegislatifRef": "PRJLANR5L15BTC0765",
      "numeroPartiePLF": "0",
      "organeExamen": "PO717460",
      "mentionSecondeDeliberation": "0"
    }
  },
  "numeroLong": "360",
  "etapeTexte": "1ère lecture (1ère assemblée saisie)",
  "triAmendement": "zzzzzzzzzzzzzzzzzzo",
  "cardinaliteAmdtMultiples": "1",
  "etat": "Discuté",
  "signataires": {
    "auteur": {
      "typeAuteur": "Depute",
      "acteurRef": "PA335612",
      "groupePolitiqueRef": "PO730940"
    },
    "cosignatairesRefs": [
      "PA689",
      "PA718720",
      "PA721270",
      "PA610634",
      "PA610654",
      "PA722110",
      "PA722202",
      "PA441",
      "PA721118",
      "PA267306",
      "PA718926",
      "PA610667",
      "PA720692",
      "PA335612",
      "PA720546",
      "PA721896"
    ],
    "texteAffichable": "M.&#160;Lecoq,  Mme&#160;Buffet, M.&#160;Azerot, Mme&#160;Bello, M.&#160;Brotherson, M.&#160;Bruneel, M.&#160;Chassaigne, M.&#160;Dharr&#233;ville, M.&#160;Dufr&#232;gne, Mme&#160;Faucillon, M.&#160;Jumel, M.&#160;Nilor, M.&#160;Peu, M.&#160;Fabien&#160;Roussel, M.&#160;Serville et M.&#160;Wulfranc"
  },
  "pointeurFragmentTexte": {
    "division": {
      "titre": "RAPPORT ANNEXÉ",
      "articleDesignationCourte": "ART. 2",
      "type": "ANNEXE",
      "avantAApres": "A",
      "divisionRattachee": "ARTICLE 2",
      "urlDivisionTexteVise": "/15/textes/0765.asp#D_RAPPORT_ANNEXE"
    },
    "alinea": {
      "avantAApres": "A",
      "numero": "82",
      "alineaDesignation": "Alinéa 82"
    }
  },
  "corps": {
    "dispositif": "<p style=\"text-align: justify;\">Supprimer l&#8217;alin&#233;a&#160;82.</p>",
    "exposeSommaire": "<p style=\"text-align: justify;\">Cet alin&#233;a porte sur la modernisation des deux composantes de la dissuasion et n&#8217;est pas utile dans la mesure o&#249; le groupe GDR consid&#232;re que l&#8217;on ne doit pas r&#233;pondre &#224;&#160;&#171;&#160;l&#8217;&#233;volution du contexte strat&#233;gique et &#224; l&#8217;&#233;mergence de nouvelles menaces&#160;&#187;&#160;par l&#8217;armement nucl&#233;aire mais par la diplomatie et, &#233;ventuellement, par&#160;l&#8217;armement conventionnel.</p>"
  },
  "representations": [
    {
      "nom": "PDF",
      "typeMime": {
        "type": "application",
        "subType": "PDF"
      },
      "statutRepresentation": {
        "verbatim": true,
        "canonique": true,
        "officielle": true,
        "transcription": false,
        "enregistrement": false
      },
      "contenu": {
        "documentURI": "/15/amendements/0765/AN/360.pdf"
      }
    }
  ],
  "seanceDiscussion": "RUANR5L15S2018IDS20953",
  "sort": {
    "dateSaisie": "2018-03-21T19:05:27.000+01:00",
    "sortEnSeance": "Rejeté"
  },
  "dateDepot": "2018-03-17T01:00:00.000+01:00",
  "dateDistribution": "2018-03-19T01:00:00.000+01:00",
  "article99": "0",
  "loiReference": {}
}