{
  "uid": "AMANR5L15PO59048B2272P2D1N402",
  "identifiant": {
    "legislature": "15",
    "numero": "402",
    "numRect": "0",
    "saisine": {
      "texteLegislatifRef": "PRJLANR5L15B2272",
      "numeroPartiePLF": "2",
      "organeExamen": "PO59048",
      "mentionSecondeDeliberation": "0"
    }
  },
  "numeroLong": "II-CF402",
  "etapeTexte": "1ère lecture (1ère assemblée saisie)",
  "triAmendement": "ariaaaaaaaaaaaaaaaaaaaaaaaaaaaaaaaaaaaaaaaaaaaaaaazzww",
  "cardinaliteAmdtMultiples": "1",
  "etat": "Discuté",
  "signataires": {
    "auteur": {
      "typeAuteur": "Depute",
      "acteurRef": "PA720492",
      "groupePolitiqueRef": "PO730964"
    },
    "cosignatairesRefs": [
      "PA607595",
      "PA720492"
    ],
    "texteAffichable": "Mme&#160;Osson, rapporteure et M.&#160;Pellois"
  },
  "pointeurFragmentTexte": {
    "missionVisee": {
      "idMissionAN": "813",
      "libelleMission": "Enseignement scolaire",
      "codeMissionPLF": "B",
      "libelleMissionPLF": "Répartition, par mission et programme, des crédits du budget général"
    },
    "division": {
      "titre": "ÉTAT B",
      "articleDesignationCourte": "ART. 38",
      "type": "ANNEXE",
      "avantAApres": "A",
      "divisionRattachee": "ARTICLE 38",
      "urlDivisionTexteVise": "/15/textes/2272C.asp#D_ETAT_B"
    }
  },
  "corps": {
    "exposeSommaire": "<p style=\"text-align: justify;\">Cet amendement vise &#224; revaloriser les r&#233;mun&#233;rations des agents de cat&#233;gorie 3 de l&#8217;enseignement technique agricole priv&#233; sous contrat.</p><p style=\"text-align: justify;\">Sans affaiblir l&#8217;attractivit&#233; du concours, il permet de financer la mise en &#339;uvre du plan de revalorisation des conditions d&#8217;emploi de ces agents, qui a &#233;t&#233; d&#233;fini et concert&#233; avec les organisations syndicales, notamment le plan de requalification (1 million d&#8217;euros par an sur trois ans), la revalorisation des grilles indiciaires (rebasage 1 million d&#8217;euros par an) et les besoins en heures suppl&#233;mentaires de remplacement li&#233;s au parcours de formation de ces agents (130 000&#160;euros en 2020).</p><p style=\"text-align: justify;\">Il est financ&#233; par le fl&#233;chage de 2,13 millions d&#8217;euros de cr&#233;dits depuis le fonds de soutien au d&#233;veloppement des activit&#233;s p&#233;riscolaires (Action 6 &#171;&#160;Actions &#233;ducatives compl&#233;mentaires aux enseignements&#160;&#187; du programme 230 &#171;&#160;Vie de l&#8217;&#233;l&#232;ve&#160;&#187;), sous-consomm&#233; &#224; hauteur de 22,6&#160;% des cr&#233;dits initialement pr&#233;vus en 2018.</p><p style=\"text-align: justify;\">Ainsi, cet amendement proc&#232;de &#224;&#160;:</p><p style=\"text-align: justify;\">- une baisse de 2,13 millions d&#8217;euros en autorisations d&#8217;engagement et cr&#233;dits de paiement de l&#8217;action 6 &#171;&#160;Actions &#233;ducatives compl&#233;mentaires aux enseignements&#160;&#187; du programme 230&#160;;</p><p style=\"text-align: justify;\">- une augmentation de 2,13 millions d&#8217;euros en autorisations d&#8217;engagement et cr&#233;dits de paiement de l&#8217;action 2 &#171;&#160;Mise en &#339;uvre des enseignements dans les &#233;tablissements priv&#233;s&#160;&#187; du programme 143.</p>",
    "dispositifAmdtCredit": {
      "listeProgrammes": [
        {
          "libelle": "Enseignement scolaire public du premier degré",
          "id": "71761",
          "AE": {
            "montantPositif": "0",
            "montantNegatif": "0"
          },
          "CP": {
            "montantPositif": "0",
            "montantNegatif": "0"
          },
          "action": "modification"
        },
        {
          "libelle": "Enseignement scolaire public du second degré",
          "id": "71762",
          "AE": {
            "montantPositif": "0",
            "montantNegatif": "0"
          },
          "CP": {
            "montantPositif": "0",
            "montantNegatif": "0"
          },
          "action": "modification"
        },
        {
          "libelle": "Vie de l'élève",
          "id": "71763",
          "AE": {
            "montantPositif": "0",
            "montantNegatif": "2130000"
          },
          "CP": {
            "montantPositif": "0",
            "montantNegatif": "2130000"
          },
          "action": "modification"
        },
        {
          "libelle": "Enseignement privé du premier et du second degrés",
          "id": "71764",
          "AE": {
            "montantPositif": "0",
            "montantNegatif": "0"
          },
          "CP": {
            "montantPositif": "0",
            "montantNegatif": "0"
          },
          "action": "modification"
        },
        {
          "libelle": "Soutien de la politique de l'éducation nationale",
          "id": "71765",
          "AE": {
            "montantPositif": "0",
            "montantNegatif": "0"
          },
          "CP": {
            "montantPositif": "0",
            "montantNegatif": "0"
          },
          "action": "modification"
        },
        {
          "libelle": "Enseignement technique agricole",
          "id": "71766",
          "AE": {
            "montantPositif": "2130000",
            "montantNegatif": "0"
          },
          "CP": {
            "montantPositif": "2130000",
            "montantNegatif": "0"
          },
          "action": "modification"
        }
      ],
      "totalAE": {
        "montantPositif": "2130000",
        "montantNegatif": "2130000",
        "solde": "0"
      },
      "totalCP": {
        "montantPositif": "2130000",
        "montantNegatif": "2130000",
        "solde": "0"
      }
    }
  },
  "representations": [
    {
      "nom": "PDF",
      "typeMime": {
        "type": "application",
        "subType": "PDF"
      },
      "statutRepresentation": {
        "verbatim": true,
        "canonique": true,
        "officielle": true,
        "transcription": false,
        "enregistrement": false
      },
      "contenu": {
        "documentURI": "/15/amendements/2272C/CION_FIN/CF402.pdf"
      }
    }
  ],
  "sort": {
    "dateSaisie": "2019-10-22T22:49:33.000+02:00",
    "sortEnSeance": "Adopté"
  },
  "dateDepot": "2019-10-18T02:00:00.000+02:00",
  "dateDistribution": "2019-10-22T02:00:00.000+02:00",
  "article99": "0",
  "loiReference": {}
}