{
  "uid": "AMANR5L15SEA717460B2272P1D1N673",
  "identifiant": {
    "legislature": "15",
    "numero": "673",
    "numRect": "0",
    "saisine": {
      "texteLegislatifRef": "PRJLANR5L15B2272",
      "numeroPartiePLF": "1",
      "organeExamen": "PO717460",
      "mentionSecondeDeliberation": "0"
    }
  },
  "numeroLong": "I-673",
  "etapeTexte": "1ère lecture (1ère assemblée saisie)",
  "triAmendement": "daaaaaaaaaaaaaaaaaaaaaaaaaaaaaaaaaaaaaaaaaaaaaaaaaabpoky",
  "cardinaliteAmdtMultiples": "1",
  "etat": "Discuté",
  "signataires": {
    "auteur": {
      "typeAuteur": "Depute",
      "acteurRef": "PA332523",
      "groupePolitiqueRef": "PO730934"
    },
    "cosignatairesRefs": [
      "PA267204",
      "PA332523",
      "PA606098",
      "PA1327",
      "PA718850",
      "PA712015",
      "PA720684",
      "PA643134"
    ],
    "texteAffichable": "Mme&#160;Dalloz,  Mme&#160;Valentin, M.&#160;Pierre-Henri&#160;Dumont, M.&#160;Sermier, M.&#160;Dive, M.&#160;Cordier, M.&#160;Marleix et M.&#160;Forissier"
  },
  "pointeurFragmentTexte": {
    "division": {
      "titre": "Article 13",
      "articleDesignationCourte": "APRÈS ART. 13",
      "type": "ARTICLE",
      "avantAApres": "Apres",
      "divisionRattachee": "APRÈS L'ARTICLE 13, insérer l'article suivant:",
      "articleAdditionnel": "1",
      "urlDivisionTexteVise": "/15/textes/2272A.asp#D_Article_13"
    }
  },
  "corps": {
    "dispositif": "<p>I.&#160;&#8211;&#160;La premi&#232;re sous-section de la section II du chapitre premier du titre premier de la premi&#232;re partie du code g&#233;n&#233;ral des imp&#244;ts est ainsi modifi&#233;&#160;:</p><p style=\"text-align: justify;\">1&#176;&#160;&#192; la deuxi&#232;me phrase du cinqui&#232;me alin&#233;a de l&#8217;article&#160;42 <i>septies</i>, apr&#232;s la r&#233;f&#233;rence&#160;: &#171;&#160;article&#160;151 <i>octies</i>&#160;&#187;, sont ins&#233;r&#233;s les mots&#160;: &#171;&#160;, au I de l&#8217;article&#160;151 <i>septies</i> A&#160;&#187;&#160;;</p><p style=\"text-align: justify;\">2&#176;&#160;Le IV est ainsi r&#233;dig&#233;&#160;:</p><p style=\"text-align: justify;\"><i>a)</i>&#160;Le III de l&#8217;article&#160;73 est compl&#233;t&#233; par un alin&#233;a ainsi r&#233;dig&#233;&#160;:</p><p style=\"text-align: justify;\">&#171;&#160;La fusion d&#8217;une soci&#233;t&#233; vis&#233;e au I de l&#8217;article&#160;151 <i>octies</i> A du code g&#233;n&#233;ral des imp&#244;ts dans les conditions pr&#233;vues au m&#234;me I, qui a pratiqu&#233; la d&#233;duction pour &#233;pargne de pr&#233;caution au titre d&#8217;un exercice pr&#233;c&#233;dant celui de la fusion n&#8217;est pas consid&#233;r&#233;e, pour l&#8217;application des I et II, comme une cessation d&#8217;activit&#233; si la soci&#233;t&#233; b&#233;n&#233;ficiaire de la fusion remplit les conditions pr&#233;vues aux m&#234;mes I et II et utilise les sommes d&#233;duites par la soci&#233;t&#233; au cours des dix exercices qui suivent celui au titre duquel la d&#233;duction correspondante a &#233;t&#233; pratiqu&#233;e dans les conditions et limites d&#233;finies auxdits I et II.&#160;&#187;&#160;;</p><p style=\"text-align: justify;\"><i>b)</i>&#160;Le 3 de l&#8217;article&#160;75&#8209;0 A est compl&#233;t&#233; par un alin&#233;a ainsi r&#233;dig&#233;&#160;:</p><p style=\"text-align: justify;\">&#171;&#160;La fusion d&#8217;une soci&#233;t&#233; mentionn&#233;e au I de l&#8217;article&#160;151 <i>octies</i> A du code g&#233;n&#233;ral des imp&#244;ts dans les conditions pr&#233;vues au m&#234;me I n&#8217;est pas consid&#233;r&#233;e, pour l&#8217;application du premier alin&#233;a, comme une cessation d&#8217;activit&#233; si la soci&#233;t&#233; b&#233;n&#233;ficiaire de la fusion s&#8217;engage &#224; poursuivre l&#8217;application des dispositions pr&#233;vues au 1, dans les m&#234;mes conditions et selon les m&#234;mes modalit&#233;s, pour la fraction du revenu mentionn&#233; au 2 restant &#224; imposer.&#160;&#187;&#160;;</p><p style=\"text-align: justify;\"><i>c)</i>&#160;L&#8217;article&#160;75&#8209;0 B est compl&#233;t&#233; par un alin&#233;a ainsi r&#233;dig&#233;&#160;:</p><p style=\"text-align: justify;\">&#171;&#160;Pour l&#8217;application du sixi&#232;me alin&#233;a, la fusion de soci&#233;t&#233;s, dans les conditions mentionn&#233;es au I de l&#8217;article&#160;151 <i>octies</i> A, ne constitue pas une cession ou une cessation de l&#8217;exploitation. Toutefois, les associ&#233;s de la soci&#233;t&#233; absorb&#233;e peuvent renoncer, selon les modalit&#233;s pr&#233;vues au deuxi&#232;me alin&#233;a, au b&#233;n&#233;fice du mode d&#8217;&#233;valuation du b&#233;n&#233;fice agricole pr&#233;vu au premier alin&#233;a au titre de l&#8217;ann&#233;e au cours de laquelle la fusion est r&#233;alis&#233;e.&#160;&#187;&#160;;</p><p style=\"text-align: justify;\">3&#176;&#160;Le VIII est ainsi modifi&#233;&#160;:</p><p style=\"text-align: justify;\"><i>a)</i>&#160;Au deuxi&#232;me alin&#233;a du a du I de l&#8217;article&#160;151 <i>octies</i>, les mots &#171;&#160;&#224; une soci&#233;t&#233; civile professionnelle&#160;&#187; sont remplac&#233;s par les mots &#171;&#160;&#224; une soci&#233;t&#233; vis&#233;e au I de l&#8217;article&#160;151 <i>octies</i> A&#160;&#187;.</p><p style=\"text-align: justify;\"><i>b)</i>&#160;L&#8217;article&#160;151 <i>octies</i> A est ainsi modifi&#233;&#160;:</p><p style=\"text-align: justify;\"><i>i)</i>&#160;Au premier alin&#233;a du I, apr&#232;s la premi&#232;re occurrence du mot&#160;: &#171;&#160;soci&#233;t&#233;&#160;&#187; sont ins&#233;r&#233;s les mots&#160;: &#171;&#160;&#224; objet agricole ou d&#8217;une soci&#233;t&#233;&#160;&#187; et la r&#233;f&#233;rence&#160;: &#171;&#160;de l&#8217;article&#160;8 <i>ter</i>&#160;&#187; est remplac&#233;e par les r&#233;f&#233;rences&#160;: &#171;&#160;des articles 8 ou 8 <i>ter</i>&#160;&#187;&#160;;</p><p style=\"text-align: justify;\"><i>ii)</i>&#160;Au premier alin&#233;a du II, les mots&#160;: &#171;&#160;civile&#160;professionnelle absorb&#233;e ou scind&#233;e&#160;&#187; sont remplac&#233;s par les mots&#160;: &#171;&#160;absorb&#233;e ou scind&#233;e vis&#233;e au I&#160;&#187;.</p><p style=\"text-align: justify;\">III.&#160;&#8211;&#160;Les pertes de recettes r&#233;sultant pour l&#8217;&#201;tat des I et II, sont compens&#233;es par la cr&#233;ation d&#8217;une taxe additionnelle aux droits pr&#233;vus aux articles 575 et 575 A du code g&#233;n&#233;ral des imp&#244;ts.</p>",
    "exposeSommaire": "<p>L&#8217;article&#160;75 du Code g&#233;n&#233;ral des imp&#244;ts a &#233;t&#233; instaur&#233; afin de favoriser le d&#233;veloppement de la pluriactivit&#233; en simplifiant les obligations d&#233;claratives des exploitants agricoles. Cet article &#233;vite aux exploitants se livrant &#224; des activit&#233;s tax&#233;es dans les c&#233;dules des b&#233;n&#233;fices industriels et commerciaux ou des b&#233;n&#233;fices non commerciaux, de tenir une comptabilit&#233; propre &#224; ces activit&#233;s, en plus de la comptabilit&#233; li&#233;e &#224; leur activit&#233; agricole.</p><p style=\"text-align: justify;\">Toutefois, et en toute logique, le b&#233;n&#233;fice de dispositifs purement agricoles tels que les d&#233;ductions pour investissements ou pour al&#233;as, ou encore l&#8217;abattement Jeunes Agriculteurs ne peut avoir pour base de calcul un r&#233;sultat compos&#233; non exclusivement de recettes issues d&#8217;une activit&#233; agricole. La m&#234;me logique s&#8217;applique pour l&#8217;imputation des d&#233;ficits. Un retraitement du r&#233;sultat global de l&#8217;exploitation s&#8217;impose donc en comptabilit&#233;, en extournant du r&#233;sultat global de l&#8217;exploitant l&#8217;ensemble des produits et charges aff&#233;rents aux activit&#233;s accessoires.</p><p style=\"text-align: justify;\">Mais cette distinction est en pratique fastidieuse, sinon impossible sauf &#224; mesurer l&#8217;ensemble des charges et usures de chaque mat&#233;riel dues &#224; l&#8217;exercice d&#8217;une activit&#233; accessoire.</p><p style=\"text-align: justify;\">Consciente de cette difficult&#233;, l&#8217;Administration a entendu simplifier la d&#233;termination du r&#233;sultat issu exclusivement d&#8217;activit&#233;s agricoles en n&#8217;extournant du r&#233;sultat global seulement les produits et charges directement rattachables aux activit&#233;s accessoires.&#160;</p><p style=\"text-align: justify;\">Ces r&#232;gles de simplification ne sont toutefois pas suffisantes, puisque cela suppose encore la tenue d&#8217;une comptabilit&#233; propre aux activit&#233;s accessoires, ce qui va &#224; l&#8217;encontre de la volont&#233; de simplification voulue par le l&#233;gislateur lors de l&#8217;adoption de l&#8217;article&#160;75 du Code g&#233;n&#233;ral des Imp&#244;ts et en r&#233;duit consid&#233;rablement la port&#233;e.</p><p style=\"text-align: justify;\">Le pr&#233;sent amendement propose donc, &#224; titre de r&#232;gle pratique, d&#8217;appliquer au r&#233;sultat de l&#8217;exploitant, qu&#8217;il s&#8217;agisse d&#8217;un b&#233;n&#233;fice ou d&#8217;un d&#233;ficit, le rapport entre les produits des activit&#233;s accessoires relevant de la cat&#233;gorie des b&#233;n&#233;fices industriels et commerciaux et de celle des b&#233;n&#233;fices non commerciaux r&#233;alis&#233;s au titre de l&#8217;exercice sur les produits totaux r&#233;alis&#233;s au titre du m&#234;me exercice. Puis d&#8217;exclure la fraction de b&#233;n&#233;fice ainsi d&#233;termin&#233;e des dispositifs propres aux b&#233;n&#233;fices agricoles ou d&#8217;imputer la fraction de d&#233;ficit ainsi &#233;tablie selon les r&#232;gles de droit commun applicables aux b&#233;n&#233;fices industriels et commerciaux et aux b&#233;n&#233;fices non commerciaux.</p><p style=\"text-align: justify;\">Ce rapport, ais&#233; &#224; d&#233;terminer par l&#8217;exploitant, apportera la simplicit&#233; n&#233;cessaire &#224; la mise en &#339;uvre de l&#8217;article&#160;75 du CGI.</p><p style=\"text-align: justify;\">&#160;</p><p style=\"text-align: justify;\">&#160;</p>"
  },
  "representations": [
    {
      "nom": "PDF",
      "typeMime": {
        "type": "application",
        "subType": "PDF"
      },
      "statutRepresentation": {
        "verbatim": true,
        "canonique": true,
        "officielle": true,
        "transcription": false,
        "enregistrement": false
      },
      "contenu": {
        "documentURI": "/15/amendements/2272A/AN/673.pdf"
      }
    }
  ],
  "seanceDiscussion": "RUANR5L15S2020IDS21871",
  "sort": {
    "dateSaisie": "2019-10-18T22:49:22.000+02:00",
    "sortEnSeance": "Rejeté"
  },
  "dateDepot": "2019-10-09T02:00:00.000+02:00",
  "dateDistribution": "2019-10-17T02:00:00.000+02:00",
  "article99": "0",
  "loiReference": {
    "codeLoi": "CGI"
  }
}