{
  "uid": "AMANR5L15PO419610B1908P0D1N610",
  "identifiant": {
    "legislature": "15",
    "numero": "610",
    "numRect": "0",
    "saisine": {
      "texteLegislatifRef": "PRJLANR5L15B1908",
      "numeroPartiePLF": "0",
      "organeExamen": "PO419610",
      "mentionSecondeDeliberation": "0"
    }
  },
  "numeroLong": "CE610",
  "etapeTexte": "1ère lecture (1ère assemblée saisie)",
  "triAmendement": "biaaaaaaaaaaaaaaaaaaaaaaaaaaaaaaaaaaaaaaaaaaaaaaaaadzwo",
  "cardinaliteAmdtMultiples": "1",
  "etat": "Discuté",
  "signataires": {
    "auteur": {
      "typeAuteur": "Depute",
      "acteurRef": "PA405480",
      "groupePolitiqueRef": "PO759900"
    },
    "cosignatairesRefs": [
      "PA405480"
    ],
    "texteAffichable": "M.&#160;Pupponi"
  },
  "pointeurFragmentTexte": {
    "division": {
      "titre": "Article 3",
      "articleDesignationCourte": "APRÈS ART. 3",
      "type": "ARTICLE",
      "avantAApres": "Apres",
      "divisionRattachee": "APRÈS L'ARTICLE 3, insérer l'article suivant:",
      "articleAdditionnel": "1",
      "urlDivisionTexteVise": "/15/textes/1908.asp#D_Article_3"
    }
  },
  "corps": {
    "dispositif": "<p>&#192; partir de 2021, les usines de production d&#8217;&#233;lectricit&#233; ne sont plus autoris&#233;es &#224; utiliser du fioul lourd.</p>",
    "exposeSommaire": "<p style=\"text-align: justify;\">En coh&#233;rence avec les objectifs de d&#233;veloppement durable, l&#8217;utilisation du fioul lourd doit &#234;tre interdite.</p>"
  },
  "representations": [
    {
      "nom": "PDF",
      "typeMime": {
        "type": "application",
        "subType": "PDF"
      },
      "statutRepresentation": {
        "verbatim": true,
        "canonique": true,
        "officielle": true,
        "transcription": false,
        "enregistrement": false
      },
      "contenu": {
        "documentURI": "/15/amendements/1908/CION-ECO/CE610.pdf"
      }
    }
  ],
  "sort": {
    "dateSaisie": "2019-06-20T00:59:53.000+02:00",
    "sortEnSeance": "Rejeté"
  },
  "dateDepot": "2019-06-14T02:00:00.000+02:00",
  "dateDistribution": "2019-06-18T02:00:00.000+02:00",
  "article99": "0",
  "loiReference": {
    "codeLoi": "xfioul lourd"
  }
}