{
  "uid": "AMANR5L15PO59051B1349P0D1N514",
  "identifiant": {
    "legislature": "15",
    "numero": "514",
    "numRect": "0",
    "saisine": {
      "texteLegislatifRef": "PRJLANR5L15B1349",
      "numeroPartiePLF": "0",
      "organeExamen": "PO59051",
      "mentionSecondeDeliberation": "0"
    }
  },
  "numeroLong": "CL514",
  "etapeTexte": "1ère lecture (2ème assemblée saisie)",
  "triAmendement": "keiaaaaaaaaaaaaaaaaaaaaaaaaaaaaaaaaaaaaaaaaaaaaaaac",
  "cardinaliteAmdtMultiples": "1",
  "etat": "Discuté",
  "signataires": {
    "auteur": {
      "typeAuteur": "Depute",
      "acteurRef": "PA721932",
      "groupePolitiqueRef": "PO723569"
    },
    "cosignatairesRefs": [
      "PA721932"
    ],
    "texteAffichable": "Mme&#160;Lorho"
  },
  "pointeurFragmentTexte": {
    "division": {
      "titre": "Article 50 ter",
      "articleDesignationCourte": "ART. 50 TER",
      "type": "ARTICLE",
      "avantAApres": "A",
      "divisionRattachee": "ARTICLE 50 TER",
      "urlDivisionTexteVise": "/15/textes/1349.asp#D_Article_50_ter"
    }
  },
  "corps": {
    "dispositif": "<p style=\"text-align: justify;\">Supprimer cet article.</p>",
    "exposeSommaire": "<p style=\"text-align: justify;\">La sollicitude du gouvernement pour ceux qui ont viol&#233; les r&#232;gles de la Cit&#233; est &#233;tonnante ; alors que des personnes souffrant d'un manque de mobilit&#233; ne disposent pas de tels &#233;gards, les d&#233;tenus pourront donc exercer leur droit de vote aux Europ&#233;ennes. \" Il essentiel que les personnes d&#233;tenues, souvent marginales et exclues, puissent mettre elles-m&#234;mes un bulletin dans l&#8217;urne\", soulignait le Pr&#233;sident de la R&#233;publique. Les personnes d&#233;tenues se sont marginalis&#233;es de mani&#232;re volontaire ; leur permettre l'exercice du droit de vote aux Europ&#233;ennes constitue une n&#233;gation de l'autorit&#233; de l&#8217;&#201;tat. Par ailleurs, il existe un risque de fraude non n&#233;gligeable : les d&#233;tenus qui b&#233;n&#233;ficient encore de l'exercice du droit de vote du fait de leur domiciliation en France, pourraient &#224; la fois voter &#224; domicile et dans les prisons o&#249; seront install&#233;es les urnes.</p>"
  },
  "representations": [
    {
      "nom": "PDF",
      "typeMime": {
        "type": "application",
        "subType": "PDF"
      },
      "statutRepresentation": {
        "verbatim": true,
        "canonique": true,
        "officielle": true,
        "transcription": false,
        "enregistrement": false
      },
      "contenu": {
        "documentURI": "/15/amendements/1349/CION_LOIS/CL514.pdf"
      }
    }
  ],
  "sort": {
    "dateSaisie": "2018-11-09T16:12:55.000+01:00",
    "sortEnSeance": "Non soutenu"
  },
  "dateDepot": "2018-11-02T01:00:00.000+01:00",
  "dateDistribution": "2018-11-08T01:00:00.000+01:00",
  "article99": "0",
  "loiReference": {}
}