{
  "uid": "AMANR5L15SEA717460B1907P0D1N7",
  "identifiant": {
    "legislature": "15",
    "numero": "7",
    "numRect": "0",
    "saisine": {
      "texteLegislatifRef": "PIONANR5L15B1907",
      "numeroPartiePLF": "0",
      "organeExamen": "PO717460",
      "mentionSecondeDeliberation": "0"
    }
  },
  "numeroLong": "7",
  "etapeTexte": "1ère lecture (1ère assemblée saisie)",
  "triAmendement": "kaaaaaaaaaaaaaaaaaaaaaaaaaaaaaaaaaaaaaaaaaaaaaaaaak",
  "cardinaliteAmdtMultiples": "1",
  "etat": "Discuté",
  "signataires": {
    "auteur": {
      "typeAuteur": "Depute",
      "acteurRef": "PA720278",
      "groupePolitiqueRef": "PO723569"
    },
    "cosignatairesRefs": [
      "PA720278",
      "PA720214",
      "PA702052"
    ],
    "texteAffichable": "M.&#160;Orphelin,  Mme&#160;Kuric et Mme&#160;Sage"
  },
  "pointeurFragmentTexte": {
    "division": {
      "titre": "Article 13",
      "articleDesignationCourte": "ART. 13",
      "type": "ARTICLE",
      "avantAApres": "A",
      "divisionRattachee": "ARTICLE 13",
      "urlDivisionTexteVise": "/15/textes/1907.asp#D_Article_13"
    },
    "alinea": {
      "numero": "5"
    }
  },
  "corps": {
    "dispositif": "<p style=\"text-align: justify;\">&#192; l&#8217;alin&#233;a&#160;5, apr&#232;s le mot&#160;:</p><p style=\"text-align: justify;\">&#171;&#160;naturels&#160;&#187;,</p><p style=\"text-align: justify;\">ins&#233;rer les mots&#160;:</p><p style=\"text-align: justify;\">&#171;&#160;et de la biodiversit&#233; marine et terrestre&#160;&#187;.</p>",
    "exposeSommaire": "<p style=\"text-align: justify;\">Cet amendement vise &#224; permettre une meilleure protection de la biodiversit&#233; pr&#233;sente &#224; Mayotte.</p><p style=\"text-align: justify;\">Mayotte est un tr&#233;sor de biodiversit&#233;, tant marine que terrestre. Elle est&#160;l&#8217;un des 34 &#171;&#160;points chauds&#160;&#187; de la biodiversit&#233; mondiale, c&#8217;est-&#224;-dire les zones recens&#233;es comme poss&#233;dant une grande richesse de biodiversit&#233; particuli&#232;rement menac&#233;e par l&#8217;activit&#233; humaine.</p><p style=\"text-align: justify;\">Les espaces terrestres de Mayotte sont peu prot&#233;g&#233;s par rapport aux autres territoires ultramarins. Une ambition politique est n&#233;cessaire pour assurer leur protection &#224; la hauteur de la richesse &#233;cologique de ce territoire.</p>"
  },
  "representations": [
    {
      "nom": "PDF",
      "typeMime": {
        "type": "application",
        "subType": "PDF"
      },
      "statutRepresentation": {
        "verbatim": true,
        "canonique": true,
        "officielle": true,
        "transcription": false,
        "enregistrement": false
      },
      "contenu": {
        "documentURI": "/15/amendements/1907/AN/7.pdf"
      }
    }
  ],
  "seanceDiscussion": "RUANR5L15S2019IDS21720",
  "sort": {
    "dateSaisie": "2019-06-21T00:11:06.000+02:00",
    "sortEnSeance": "Rejeté"
  },
  "dateDepot": "2019-06-14T02:00:00.000+02:00",
  "dateDistribution": "2019-06-19T02:00:00.000+02:00",
  "article99": "0",
  "loiReference": {}
}