{
  "uid": "AMANR5L15PO59051B2357P0D1N983",
  "identifiant": {
    "legislature": "15",
    "numero": "983",
    "numRect": "0",
    "saisine": {
      "texteLegislatifRef": "PRJLANR5L15B2357",
      "numeroPartiePLF": "0",
      "organeExamen": "PO59051",
      "mentionSecondeDeliberation": "0"
    }
  },
  "numeroLong": "CL983",
  "etapeTexte": "1ère lecture (2ème assemblée saisie)",
  "triAmendement": "aeiaaaaaaaaaaaaaaaaaaaaaaaaaaaaaaaaaaaaaaaaaaaaaaaco",
  "cardinaliteAmdtMultiples": "1",
  "etat": "Discuté",
  "signataires": {
    "auteur": {
      "typeAuteur": "Depute",
      "acteurRef": "PA267200",
      "groupePolitiqueRef": "PO730934"
    },
    "cosignatairesRefs": [
      "PA722390",
      "PA642847",
      "PA267204",
      "PA267200",
      "PA721678",
      "PA266808"
    ],
    "texteAffichable": "M.&#160;Huyghe,  M.&#160;Bazin, Mme&#160;Corneloup, M.&#160;Reda, M.&#160;Rolland et M.&#160;Sermier"
  },
  "pointeurFragmentTexte": {
    "division": {
      "titre": "Article 2",
      "articleDesignationCourte": "ART. 2",
      "type": "ARTICLE",
      "avantAApres": "A",
      "divisionRattachee": "ARTICLE 2",
      "urlDivisionTexteVise": "/15/textes/2357.asp#D_Article_2"
    },
    "alinea": {
      "numero": "3"
    }
  },
  "corps": {
    "dispositif": "<p style=\"text-align: justify;\">Supprimer les alin&#233;as&#160;3 et 4.</p>",
    "exposeSommaire": "<p style=\"text-align: justify;\">La gestion des communes, notamment rurales, exigent des &#233;lus qu'ils sacrifient leur temps et leur &#233;nergie pour une mission bien souvent b&#233;n&#233;vole ou quasiment b&#233;n&#233;vole. Dans bien des cas, les &#233;lus choisissent de se r&#233;partir entre eux la charge de travail pour cette raison. Dans ces conditions, le maire peut souhaiter ne pas &#234;tre conseiller communautaire, et inversement. Cette disposition met &#224; mal cette relative flexibilit&#233;, contraignant le maire &#224; endosser de mani&#232;re automatique la fonction de conseiller communautaire. Elle ouvre &#233;galement la voie &#224; des d&#233;missions opportunes permettant de la contourner, complexifiant une situation tout en pr&#233;tendant la simplifier. D&#232;s lors que ce texte renforce le conseil des maires, il peut appara&#238;tre utile de laisser aux &#233;lus la libert&#233; de se r&#233;partir la charge de travail s'ils le souhaitent.</p>"
  },
  "representations": [
    {
      "nom": "PDF",
      "typeMime": {
        "type": "application",
        "subType": "PDF"
      },
      "statutRepresentation": {
        "verbatim": true,
        "canonique": true,
        "officielle": true,
        "transcription": false,
        "enregistrement": false
      },
      "contenu": {
        "documentURI": "/15/amendements/2357/CION_LOIS/CL983.pdf"
      }
    }
  ],
  "sort": {
    "dateSaisie": "2019-11-06T10:50:26.000+01:00",
    "sortEnSeance": "Rejeté"
  },
  "dateDepot": "2019-11-02T01:00:00.000+01:00",
  "dateDistribution": "2019-11-05T01:00:00.000+01:00",
  "article99": "0",
  "loiReference": {}
}