{
  "uid": "AMANR5L15SEA717460BTC1767P0D1N1650",
  "identifiant": {
    "legislature": "15",
    "numero": "1650",
    "numRect": "0",
    "saisine": {
      "texteLegislatifRef": "PRJLANR5L15BTC1767",
      "numeroPartiePLF": "0",
      "organeExamen": "PO717460",
      "mentionSecondeDeliberation": "0"
    }
  },
  "numeroLong": "1650",
  "etapeTexte": "1ère lecture (1ère assemblée saisie)",
  "triAmendement": "adiaaaaaaaaaaaaaaaaaaaaaaaaaaaaaaaaaaaaaaaaaaaaaaaawju",
  "cardinaliteAmdtMultiples": "1",
  "etat": "Discuté",
  "signataires": {
    "auteur": {
      "typeAuteur": "Depute",
      "acteurRef": "PA642764",
      "groupePolitiqueRef": "PO758835"
    },
    "cosignatairesRefs": [
      "PA608172",
      "PA608741",
      "PA333818",
      "PA610681",
      "PA719930",
      "PA335054",
      "PA340357",
      "PA608695",
      "PA1008",
      "PA333285",
      "PA335532",
      "PA643145",
      "PA720988",
      "PA1592",
      "PA267233",
      "PA607553",
      "PA342415",
      "PA609332",
      "PA605069",
      "PA340343",
      "PA642764",
      "PA332614",
      "PA429893",
      "PA609590",
      "PA508",
      "PA337483",
      "PA1198",
      "PA608011",
      "PA1809"
    ],
    "texteAffichable": "M.&#160;Aviragnet,  Mme&#160;Bareigts, Mme&#160;Bi&#233;mouret, M.&#160;Vallaud, Mme&#160;Rabault, Mme&#160;Battistel, M.&#160;Bouillon, M.&#160;Jean-Louis&#160;Bricout, M.&#160;Carvounas, M.&#160;Alain&#160;David, Mme&#160;Laurence&#160;Dumont, M.&#160;Faure, M.&#160;Garot, M.&#160;David&#160;Habib, M.&#160;Hutin, M.&#160;Juanico, Mme&#160;Karamanli, M.&#160;J&#233;r&#244;me&#160;Lambert, M.&#160;Letchimy, Mme&#160;Manin, Mme&#160;Pau-Langevin, Mme&#160;Pires Beaune, M.&#160;Potier, M.&#160;Pueyo, M.&#160;Saulignac, Mme&#160;Tolmont, Mme&#160;Untermaier, Mme&#160;Vainqueur-Christophe et Mme&#160;Victory"
  },
  "pointeurFragmentTexte": {
    "division": {
      "titre": "Article 2",
      "articleDesignationCourte": "ART. 2",
      "type": "ARTICLE",
      "avantAApres": "A",
      "divisionRattachee": "ARTICLE 2",
      "urlDivisionTexteVise": "/15/textes/1767.asp#D_Article_2"
    },
    "alinea": {
      "avantAApres": "Apres",
      "numero": "12"
    }
  },
  "corps": {
    "dispositif": "<p style=\"text-align: justify;\">Apr&#232;s l&#8217;alin&#233;a&#160;12, ins&#233;rer l&#8217;alin&#233;a suivant&#160;:</p><p style=\"text-align: justify;\">&#171;&#160;7&#176; Les modalit&#233;s de formation th&#233;orique des internes en m&#233;decine g&#233;n&#233;rale &#224; la pratique du tiers payant.&#160;&#187;</p>",
    "exposeSommaire": "<p style=\"text-align: justify;\">Cet amendement du groupe socialiste propose de former les &#233;tudiants en m&#233;decine &#224; la pratique du tiers payant comme un outils de facilitation de l&#8217;acc&#232;s au soin.</p><p style=\"text-align: justify;\">Le groupe socialiste d&#233;fend de longue date le tiers payant g&#233;n&#233;ralis&#233;, une mesure qui a d&#8217;ailleurs re&#231;u le soutien en 2012 d&#8217;un certain Benjamin Griveaux ou Gabriel Attal.</p><p style=\"text-align: justify;\">Le tiers payant est un levier majeur pour faire &#233;voluer l&#8217;offre de sant&#233; et faire progresser la justice sociale.</p><p style=\"text-align: justify;\">En termes de justice sociale, tout d&#8217;abord, on sait que l&#8217;avance des frais au cabinet peut constituer un frein pour certains assur&#233;s. Le renoncement aux soins concerne une proportion croissante d&#8217;assur&#233;s (autour du tiers de nos concitoyens sont concern&#233;s). Le tiers payant permet de r&#233;tablir l&#8217;acc&#232;s de chacun aux soins dont il a besoin. L&#224; o&#249; l&#8217;introduction de la CMU-C a permis d&#8217;avoir un effet correctif sur l&#8217;acc&#232;s aux soins des plus d&#233;favoris&#233;s, la g&#233;n&#233;ralisation du tiers payant permettra d&#8217;inscrire dans le droit commun un gain d&#8217;&#233;quit&#233; substantiel pour chacun.</p><p style=\"text-align: justify;\">Le tiers payant est aussi un levier de changement pour l&#8217;ensemble du syst&#232;me de sant&#233;. Comme l&#8217;a soulign&#233; l&#8217;IGAS dans son rapport sur la g&#233;n&#233;ralisation du tiers payant, l&#8217;enjeu est aussi un enjeu de simplification et de lisibilit&#233; pour les assur&#233;s. G&#233;n&#233;ralis&#233; notamment pour les pharmacies, les laboratoires de biologie, les b&#233;n&#233;ficiaires de la CMU-C en m&#233;decine de ville, pratiqu&#233; d&#233;j&#224; pour 30&#160;% des actes, le tiers payant est d&#233;j&#224; une r&#233;alit&#233; pour les assur&#233;s, mais sans lisibilit&#233;. Alors qu&#8217;aujourd&#8217;hui seul l&#8217;h&#244;pital permet au patient d&#8217;&#233;viter &#224; coup s&#251;r l&#8217;avance de frais, la mesure contribue &#224; renforcer l&#8217;accessibilit&#233; de l&#8217;offre ambulatoire que la strat&#233;gie nationale de sant&#233; entend favoriser.</p><p style=\"text-align: justify;\">C&#8217;est pourquoi, le groupe socialiste propose que dans la formation des m&#233;decins g&#233;n&#233;ralistes soient pr&#233;vus des cours sur la question de l&#8217;acc&#232;s aux soins, des refus de soins et la pratique du tiers payant comme outil d&#8217;acc&#232;s &#224; la sant&#233; pour tous.</p>"
  },
  "representations": [
    {
      "nom": "PDF",
      "typeMime": {
        "type": "application",
        "subType": "PDF"
      },
      "statutRepresentation": {
        "verbatim": true,
        "canonique": true,
        "officielle": true,
        "transcription": false,
        "enregistrement": false
      },
      "contenu": {
        "documentURI": "/15/amendements/1767/AN/1650.pdf"
      }
    }
  ],
  "seanceDiscussion": "RUANR5L15S2019IDS21559",
  "sort": {
    "dateSaisie": "2019-03-19T19:55:45.000+01:00",
    "sortEnSeance": "Retiré"
  },
  "dateDepot": "2019-03-15T01:00:00.000+01:00",
  "dateDistribution": "2019-03-16T01:00:00.000+01:00",
  "article99": "0",
  "loiReference": {}
}