{
  "uid": "AMANR5L15SEA717460B1255P1D1N1330",
  "identifiant": {
    "legislature": "15",
    "numero": "1330",
    "numRect": "0",
    "saisine": {
      "texteLegislatifRef": "PRJLANR5L15B1255",
      "numeroPartiePLF": "1",
      "organeExamen": "PO717460",
      "mentionSecondeDeliberation": "0"
    }
  },
  "numeroLong": "I-1330",
  "etapeTexte": "1ère lecture (1ère assemblée saisie)",
  "triAmendement": "csaaaaaaaaaaaaaaaaaaaaaaaaaaaaaaaaaaaaaaaaaaaaaaaaaw",
  "cardinaliteAmdtMultiples": "1",
  "etat": "Discuté",
  "signataires": {
    "auteur": {
      "typeAuteur": "Depute",
      "acteurRef": "PA334149",
      "groupePolitiqueRef": "PO730934"
    },
    "cosignatairesRefs": [
      "PA720630",
      "PA721286",
      "PA722390",
      "PA334149",
      "PA267901",
      "PA346054",
      "PA267289",
      "PA720684"
    ],
    "texteAffichable": "M.&#160;Fasquelle,  M.&#160;Pierre-Henri&#160;Dumont, M.&#160;Kamardine, M.&#160;Ramadier, M.&#160;Door, M.&#160;Minot, M.&#160;Emmanuel&#160;Maquet et Mme&#160;Corneloup"
  },
  "pointeurFragmentTexte": {
    "division": {
      "titre": "Article 13",
      "articleDesignationCourte": "ART. 13",
      "type": "ARTICLE",
      "avantAApres": "A",
      "divisionRattachee": "ARTICLE 13",
      "urlDivisionTexteVise": "/15/textes/1255A.asp#D_Article_13"
    },
    "alinea": {
      "numero": "42"
    }
  },
  "corps": {
    "dispositif": "<p style=\"text-align: justify;\">I.&#160;&#8211;&#160;Supprimer les alin&#233;as 42 &#224; 50.</p><p style=\"text-align: justify;\">II.&#160;&#8211;&#160;Compl&#233;ter cet article par l'alin&#233;a suivant&#160;:</p><p style=\"text-align: justify;\">&#171;&#160;III.&#160;&#8211;&#160;La perte de recettes pour l&#8217;&#201;tat r&#233;sultant de la pr&#233;sente disposition est compens&#233;e &#224; due concurrence par la cr&#233;ation d&#8217;une taxe additionnelle aux droits pr&#233;vus aux articles 575 et 575 A du code g&#233;n&#233;ral des imp&#244;ts.</p>",
    "exposeSommaire": "<p>La re&#769;forme de la de&#769;ductibilite&#769; des charges financie&#768;res est une re&#769;forme d&#8217;ampleur : elle vise a&#768; introduire une limitation ge&#769;ne&#769;rale en fonction d&#8217;un revenu ajuste&#769; (EBITDA). Cette limitation se substituerait au \"rabot\" ge&#769;ne&#769;ral, limitant la de&#769;ductibilite&#769; des charges financie&#768;res nettes a&#768; 75 %. D&#8217;autres mesures delimitation des charges financie&#768;res existantes seraient refondues (notamment les re&#768;gles actuelles de sous-capitalisation).</p><p>Les acteurs e&#769;conomiques ont adapte&#769; la structure de leur financement et calibre&#769; leurs ope&#769;rations en fonction des re&#768;gles actuelles. Le texte propose&#769; va induire un changement en profondeur de ces re&#768;gles.</p><p>Or, si le dispositif propose&#769; transpose la directive dite ATAD* par l&#8217;introduction d&#8217;une limitation ge&#769;ne&#769;ralede de&#769;ductibilite&#769; des charges financie&#768;res, il va toutefois bien au-dela&#768; en durcissant certaines re&#768;gles ou en limitant certaines souplesses : le dispositif franc&#807;ais sera finalement bien plus strict que chez nos principaux partenaires (ex. Allemagne).</p><p>Ceci est particulie&#768;rement le cas avec la nouvelle re&#768;gle de sous-capitalisation propose&#769;e, extre&#770;mement pe&#769;nalisante pour les entreprises car (i) elle limite trop se&#769;ve&#768;rement le seuil de de&#769;ductibilite&#769; autorise&#769; (quipasse respectivement de 3 M&#8364; ou 30 % de l&#8217;EBITDA a&#768; 1 M&#8364; ou 10 % de l&#8217;EBITDA), (ii) elle ne comporteaucune re&#768;gle de sauvegarde permettant a&#768; l&#8217;entreprise de de&#769;montrer qu&#8217;elle n&#8217;est pas sous-capitalise&#769;eet (iii) elle affecte la de&#769;ductibilite&#769; de l&#8217;ensemble des charges financie&#768;res et non plus seulement cellesrelatives a&#768; des socie&#769;te&#769;s lie&#769;es.</p><p>De plus, les entreprises franc&#807;aises vont se trouver en situation de sous-capitalisation fiscale bien plussouvent qu&#8217;aujourd&#8217;hui en raison d&#8217;un ratio unique fonde&#769; sur le rapport entre les fonds propres et les dettes, alors me&#770;me que leur structure de financement n&#8217;a pas fondamentalement change&#769;. Ceci va particulie&#768;rement affecter les PME, ETI et jeunes entreprises en croissance compte-tenu du seuil de unmillion d&#8217;euros. Or, les pre&#770;ts intra-groupe constituent une source de financement tre&#768;s importante pour ces entreprises qui, souvent, ne peuvent avoir acce&#768;s a&#768; d&#8217;autres financements. Il semble donc incohe&#769;rent de restreindre cette source de financement par des re&#768;gles de sous-capitalisation.</p><p>Enfin, il s&#8217;agit de ne pas aggraver la situation des entreprises franc&#807;aises en termes de compe&#769;titivite&#769; par rapport a&#768; leurs principales concurrentes : rappelons que les entreprises allemandes ne sont pas soumises a&#768; des re&#768;gles de sous-capitalisation mais uniquement a&#768; la limite ge&#769;ne&#769;rale. Il est e&#769;galement impe&#769;ratif de maintenir l&#8217;attractivite&#769; du territoire franc&#807;ais.</p><p>Il convient donc de supprimer les mesures de sous-capitalisation.</p><p>* Directive (UE) 2016/1164 du Conseil du 12 juillet 2016 e&#769;tablissant des re&#768;gles pour lutter contre les pratiques d'e&#769;vasion fiscale qui ont une incidence directe sur le fonctionnement du marche&#769; inte&#769;rieur.</p>"
  },
  "representations": [
    {
      "nom": "PDF",
      "typeMime": {
        "type": "application",
        "subType": "PDF"
      },
      "statutRepresentation": {
        "verbatim": true,
        "canonique": true,
        "officielle": true,
        "transcription": false,
        "enregistrement": false
      },
      "contenu": {
        "documentURI": "/15/amendements/1255A/AN/1330.pdf"
      }
    }
  ],
  "seanceDiscussion": "RUANR5L15S2019IDS21282",
  "sort": {
    "dateSaisie": "2018-10-19T15:10:45.000+02:00",
    "sortEnSeance": "Rejeté"
  },
  "dateDepot": "2018-10-11T02:00:00.000+02:00",
  "dateDistribution": "2018-10-15T02:00:00.000+02:00",
  "article99": "0",
  "loiReference": {}
}