{
  "uid": "AMANR5L15PO59048B1297P0D1N41",
  "identifiant": {
    "legislature": "15",
    "numero": "41",
    "numRect": "0",
    "saisine": {
      "texteLegislatifRef": "PRJLANR5L15B1297",
      "numeroPartiePLF": "0",
      "organeExamen": "PO59048",
      "mentionSecondeDeliberation": "0"
    }
  },
  "numeroLong": "CF41",
  "etapeTexte": "1ère lecture (1ère assemblée saisie)",
  "triAmendement": "piaaaaaaaaaaaaaaaaaaaaaaaaaaaaaaaaaaaaaaaaaaaaaaaai",
  "cardinaliteAmdtMultiples": "1",
  "etat": "Irrecevable",
  "signataires": {
    "auteur": {
      "typeAuteur": "Depute",
      "acteurRef": "PA609590",
      "groupePolitiqueRef": "PO758835"
    },
    "cosignatairesRefs": [
      "PA342415",
      "PA340357",
      "PA608695",
      "PA607553",
      "PA340343",
      "PA609590",
      "PA332614",
      "PA337483",
      "PA267233",
      "PA608741",
      "PA608011",
      "PA610681",
      "PA1592",
      "PA1809",
      "PA1008",
      "PA508",
      "PA335054",
      "PA719930",
      "PA335532",
      "PA1198",
      "PA643145",
      "PA642764",
      "PA605069",
      "PA609332",
      "PA333818",
      "PA608172",
      "PA720988",
      "PA405480",
      "PA429893",
      "PA333285"
    ],
    "texteAffichable": "Mme&#160;Rabault,  M.&#160;Jean-Louis&#160;Bricout, Mme&#160;Pires Beaune, M.&#160;Pupponi, M.&#160;Aviragnet, Mme&#160;Bareigts, Mme&#160;Battistel, Mme&#160;Bi&#233;mouret, M.&#160;Bouillon, M.&#160;Carvounas, M.&#160;Alain&#160;David, Mme&#160;Laurence&#160;Dumont, M.&#160;Faure, M.&#160;Garot, M.&#160;David&#160;Habib, M.&#160;Hutin, M.&#160;Juanico, Mme&#160;Karamanli, M.&#160;J&#233;r&#244;me&#160;Lambert, M.&#160;Letchimy, Mme&#160;Manin, Mme&#160;Pau-Langevin, M.&#160;Potier, M.&#160;Pueyo, M.&#160;Saulignac, Mme&#160;Tolmont, Mme&#160;Untermaier, Mme&#160;Vainqueur-Christophe, M.&#160;Vallaud et Mme&#160;Victory"
  },
  "pointeurFragmentTexte": {
    "division": {
      "titre": "Article 58",
      "articleDesignationCourte": "APRÈS ART. 58",
      "type": "ARTICLE",
      "avantAApres": "Apres",
      "divisionRattachee": "APRÈS L'ARTICLE 58, insérer l'article suivant:",
      "articleAdditionnel": "1",
      "urlDivisionTexteVise": "/15/textes/1297.asp#D_Article_58"
    }
  },
  "corps": {
    "dispositif": "<p>Une commission pr&#233;sid&#233;e par un magistrat de la Cour des comptes, publie le 1er janvier de chaque ann&#233;e, un rapport permettant de mesurer annuellement le taux de non-recours aux minimas sociaux. Ce rapport pr&#233;sente de mani&#232;re pr&#233;cise et d&#233;taill&#233;e une &#233;valuation du co&#251;t &#233;conomique du non-recours aux minimas sociaux.</p>",
    "exposeSommaire": "<p>Cet amendement est issu du rapport parlementaire de Gis&#232;le Bi&#233;mouret et de Jean-Louis Costes relatif &#224; l&#8217;&#233;valuation des politiques publiques en faveur de l&#8217;acc&#232;s aux droits sociaux.</p><p>Il vise &#224; instaurer une mesure annuelle des taux de non-recours aux minimas sociaux.</p><p>Cet amendement cr&#233;e une commission pr&#233;sid&#233;e par un magistrat de la Cour des comptes, charg&#233;e de r&#233;diger et publier ce rapport le 1er janvier de chaque ann&#233;e.</p><p>L&#8217;Observatoire des non-recours aux droits et services (ODENORE) a dress&#233; la typologie du ph&#233;nom&#232;ne de non-recours aux minimas sociaux mais aujourd&#8217;hui nous sommes dans l&#8217;incapacit&#233; de chiffrer ce taux de non-recours. Or, afin de lutter contre ce fl&#233;au il est incontournable de disposer d&#8217;une information pr&#233;cise et d&#233;taill&#233;e sur le sujet.</p><p>Une prestation sociale est accessible si elle trouve son public, si la fraction de la population qu&#8217;elle est destin&#233;e &#224; aider la re&#231;oit. Sinon, son &#171;&#160;service social rendu&#160;&#187; est faible et son utilit&#233; aussi. La persistance d&#8217;un taux de non-recours &#233;lev&#233; &#224; une prestation doit inciter les pouvoirs publics &#224; r&#233;examiner la fa&#231;on m&#234;me dont elle a &#233;t&#233; con&#231;ue, et &#224; s&#8217;interroger sur sa pertinence. S&#8217;agissant des minima sociaux, l&#8217;enjeu est de taille puisqu&#8217;ils figurent parmi les principaux outils de la lutte contre la pauvret&#233; et l&#8217;exclusion.</p><p>Par cet amendement nous proposons de sortir de l&#8217;omerta et d&#8217;analyser pr&#233;cis&#233;ment le ph&#233;nom&#232;ne du non-recours aux minimas sociaux.</p>"
  },
  "representations": [
    {
      "nom": "PDF",
      "typeMime": {
        "type": "application",
        "subType": "PDF"
      },
      "statutRepresentation": {
        "verbatim": true,
        "canonique": true,
        "officielle": true,
        "transcription": false,
        "enregistrement": false
      },
      "contenu": {
        "documentURI": "/15/amendements/1297/CION_FIN/CF41.pdf"
      }
    }
  ],
  "dateDepot": "2018-10-12T02:00:00.000+02:00",
  "article99": "0",
  "loiReference": {}
}