{
  "uid": "AMANR5L15PO766718B2187P0D1N706",
  "identifiant": {
    "legislature": "15",
    "numero": "706",
    "numRect": "0",
    "saisine": {
      "texteLegislatifRef": "PRJLANR5L15B2187",
      "numeroPartiePLF": "0",
      "organeExamen": "PO766718",
      "mentionSecondeDeliberation": "0"
    }
  },
  "numeroLong": "706",
  "etapeTexte": "1ère lecture (1ère assemblée saisie)",
  "triAmendement": "dkaaaaaaaaaaaaaaaaaaaaaaaaaaaaaaaaaaaaaaaaaaaaaaaamhzzw",
  "cardinaliteAmdtMultiples": "1",
  "etat": "Discuté",
  "signataires": {
    "auteur": {
      "typeAuteur": "Depute",
      "acteurRef": "PA642847",
      "groupePolitiqueRef": "PO730934"
    },
    "cosignatairesRefs": [
      "PA642847"
    ],
    "texteAffichable": "M.&#160;Bazin"
  },
  "pointeurFragmentTexte": {
    "division": {
      "titre": "Article 14",
      "articleDesignationCourte": "ART. 14",
      "type": "ARTICLE",
      "avantAApres": "A",
      "divisionRattachee": "ARTICLE 14",
      "urlDivisionTexteVise": "/15/textes/2187.asp#D_Article_14"
    },
    "alinea": {
      "avantAApres": "A",
      "numero": "2",
      "alineaDesignation": "Alinéa 2"
    }
  },
  "corps": {
    "dispositif": "<p style=\"text-align: justify;\">&#192; la fin de la premi&#232;re phrase de l&#8217;alin&#233;a&#160;2, supprimer les mots&#160;: </p><p style=\"text-align: justify;\">&#171;&#160;ou la femme non mari&#233;e&#160;&#187;.</p>",
    "exposeSommaire": "<p style=\"text-align: justify;\">Ce projet de loi pr&#233;voit d&#8217;&#233;tendre l&#8217;AMP aux femmes c&#233;libataires.</p><p style=\"text-align: justify;\">Toutes les &#233;tudes tendent &#224; montrer que les familles monoparentales sont plus pr&#233;caires financi&#232;rement.</p><p style=\"text-align: justify;\">Face &#224; ce constat et &#224; l&#8217;augmentation constante de ces familles monoparentales, le Gouvernement r&#233;fl&#233;chit &#224; de nouvelles mesures en plus des dispositifs existants notamment dans le plan pauvret&#233;.</p><p style=\"text-align: justify;\">Il para&#238;t alors contradictoire de pr&#233;voir par ce projet de loi d&#8217;&#233;largir la procr&#233;ation aux femmes c&#233;libataires alors que le gouvernent prend des dispositions pour venir en aide aux familles monoparentales pour r&#233;duire leur fragilit&#233;.</p><p style=\"text-align: justify;\">&#160;</p>"
  },
  "representations": [
    {
      "nom": "PDF",
      "typeMime": {
        "type": "application",
        "subType": "PDF"
      },
      "statutRepresentation": {
        "verbatim": true,
        "canonique": true,
        "officielle": true,
        "transcription": false,
        "enregistrement": false
      },
      "contenu": {
        "documentURI": "/15/amendements/2187/CSBIOETH/706.pdf"
      }
    }
  ],
  "sort": {
    "dateSaisie": "2019-09-13T15:22:38.000+02:00",
    "sortEnSeance": "Rejeté"
  },
  "dateDepot": "2019-09-04T02:00:00.000+02:00",
  "dateDistribution": "2019-09-12T02:00:00.000+02:00",
  "article99": "0",
  "loiReference": {}
}