{
  "uid": "AMANR5L15SEA717460BTC2063P0D1N48",
  "identifiant": {
    "legislature": "15",
    "numero": "48",
    "numRect": "0",
    "saisine": {
      "texteLegislatifRef": "PRJLANR5L15BTC2063",
      "numeroPartiePLF": "0",
      "organeExamen": "PO717460",
      "mentionSecondeDeliberation": "0"
    }
  },
  "numeroLong": "48",
  "etapeTexte": "1ère lecture (1ère assemblée saisie)",
  "triAmendement": "abiaaaaaaaaaaaaaaaaaaaaaaaaaaaaaaaaaaaaaaaaaaaaaaae",
  "cardinaliteAmdtMultiples": "1",
  "etat": "Discuté",
  "signataires": {
    "auteur": {
      "typeAuteur": "Depute",
      "acteurRef": "PA342415",
      "groupePolitiqueRef": "PO758835"
    },
    "cosignatairesRefs": [
      "PA508",
      "PA267233",
      "PA342415",
      "PA337483",
      "PA607553",
      "PA333285"
    ],
    "texteAffichable": "Mme&#160;Battistel,  M.&#160;Garot, M.&#160;Potier, M.&#160;Bouillon, Mme&#160;Bi&#233;mouret, M.&#160;Letchimy et les membres du groupe Socialistes et apparent&#233;s"
  },
  "pointeurFragmentTexte": {
    "division": {
      "titre": "Article PREMIER",
      "articleDesignationCourte": "ART. PREMIER",
      "type": "ARTICLE",
      "avantAApres": "A",
      "divisionRattachee": "ARTICLE PREMIER",
      "urlDivisionTexteVise": "/15/textes/2063.asp#D_Article_1er"
    },
    "alinea": {
      "avantAApres": "Apres",
      "numero": "7"
    }
  },
  "corps": {
    "dispositif": "<p style=\"text-align: justify;\">Apr&#232;s l&#8217;alin&#233;a&#160;7, ins&#233;rer l&#8217;alin&#233;a suivant&#160;:</p><p style=\"text-align: justify;\">&#171;&#160;3&#176;<i>bis</i>&#160;Au 7&#176;, l&#8217;ann&#233;e&#160;: &#171;&#160;2050&#160;&#187; est remplac&#233;e par l&#8217;ann&#233;e&#160;: &#171;&#160;2040&#160;&#187;&#160;;&#160;&#187;</p>",
    "exposeSommaire": "<p>La politique &#233;nerg&#233;tique nationale a notamment pour objectif&#160;: &#171;&#160;De disposer d&#8217;un parc immobilier dont l&#8217;ensemble des b&#226;timents sont r&#233;nov&#233;s en fonction des normes &#171;&#160;b&#226;timent basse consommation&#160;&#187; ou assimil&#233;es, &#224; l&#8217;horizon 2040, en menant une politique de r&#233;novation thermique des logements concernant majoritairement les m&#233;nages aux revenus modestes&#160;&#187;.</p><p style=\"text-align: justify;\">Or, cet objectif temporel appara&#238;t bien trop peu ambitieux au regard des autres objectifs de r&#233;duction d&#8217;&#233;missions de gaz &#224; effet de serre et de consommation &#233;nerg&#233;tique primaire des &#233;nergies fossiles. En effet, la performance &#233;nerg&#233;tique des b&#226;timents et en particulier des logements est un levier majeur de r&#233;duction du besoin &#233;nerg&#233;tique. Son incidence est &#233;galement forte sur l&#8217;objectif de r&#233;duction de la part du nucl&#233;aire dans le mix &#233;nerg&#233;tique fran&#231;ais alors que la France a historiquement fait le choix de favoriser le chauffage des logements par l&#8217;&#233;lectricit&#233; (34&#160;% des logements en 2014 contre 5&#160;% en Allemagne). Il s&#8217;agit par ailleurs d&#8217;un mode de chauffage particuli&#232;rement peu efficace, compar&#233; au gaz notamment. En p&#233;riode de chauffe, le chauffage repr&#233;sente 29&#160;% de la consommation nationale d&#8217;&#233;lectricit&#233; soit 20GW, une consommation qui peut atteindre les 40 GW en p&#233;riode de grand froid.</p><p style=\"text-align: justify;\">Le pr&#233;sent amendement des d&#233;put&#233;s socialistes et apparent&#233;s vise donc &#224; ramener cet objectif de transition &#233;nerg&#233;tique du parc de logements de 2050 &#224; 2040, un objectif qui demeure raisonnable au regard des technologies existantes et du savoir-faire d&#233;velopp&#233; par les entreprises fran&#231;aises, notamment dans le cadre des programmes de r&#233;novation urbaine.</p>"
  },
  "representations": [
    {
      "nom": "PDF",
      "typeMime": {
        "type": "application",
        "subType": "PDF"
      },
      "statutRepresentation": {
        "verbatim": true,
        "canonique": true,
        "officielle": true,
        "transcription": false,
        "enregistrement": false
      },
      "contenu": {
        "documentURI": "/15/amendements/2063/AN/48.pdf"
      }
    }
  ],
  "seanceDiscussion": "RUANR5L15S2019IDS21735",
  "sort": {
    "dateSaisie": "2019-06-27T11:39:21.000+02:00",
    "sortEnSeance": "Retiré"
  },
  "dateDepot": "2019-06-20T02:00:00.000+02:00",
  "dateDistribution": "2019-06-26T02:00:00.000+02:00",
  "article99": "0",
  "loiReference": {}
}