{
  "uid": "AMANR5L15SEA717460BTC1396P0D1N1423",
  "identifiant": {
    "legislature": "15",
    "numero": "1423",
    "numRect": "0",
    "saisine": {
      "texteLegislatifRef": "PRJLANR5L15BTC1396",
      "numeroPartiePLF": "0",
      "organeExamen": "PO717460",
      "mentionSecondeDeliberation": "0"
    }
  },
  "numeroLong": "1423",
  "etapeTexte": "1ère lecture (2ème assemblée saisie)",
  "triAmendement": "aocaaaaaaaaaaaaaaaaaaaaaaaaaaaaaaaaaaaaaaaaaaaaaaai",
  "cardinaliteAmdtMultiples": "1",
  "etat": "Discuté",
  "signataires": {
    "auteur": {
      "typeAuteur": "Depute",
      "acteurRef": "PA721624",
      "groupePolitiqueRef": "PO730964"
    },
    "cosignatairesRefs": [
      "PA721624"
    ],
    "texteAffichable": "Mme&#160;Avia"
  },
  "pointeurFragmentTexte": {
    "division": {
      "titre": "Article 9",
      "articleDesignationCourte": "ART. 9",
      "type": "ARTICLE",
      "avantAApres": "A",
      "divisionRattachee": "ARTICLE 9",
      "urlDivisionTexteVise": "/15/textes/1396.asp#D_Article_9"
    },
    "alinea": {
      "numero": "4"
    }
  },
  "corps": {
    "dispositif": "<p style=\"text-align: justify;\">&#192; l&#8217;alin&#233;a&#160;4, substituer aux mots&#160;:</p><p style=\"text-align: justify;\">&#171;&#160;de grande instance (tribunal judiciaire)&#160;&#187;</p><p style=\"text-align: justify;\">le mot&#160;:</p><p style=\"text-align: justify;\">&#171;&#160;judiciaire&#160;&#187;.</p>",
    "exposeSommaire": "<p style=\"text-align: justify;\">Amendement de coordination avec la cr&#233;ation du tribunal judiciaire par le pr&#233;sent projet de loi.</p>"
  },
  "representations": [
    {
      "nom": "PDF",
      "typeMime": {
        "type": "application",
        "subType": "PDF"
      },
      "statutRepresentation": {
        "verbatim": true,
        "canonique": true,
        "officielle": true,
        "transcription": false,
        "enregistrement": false
      },
      "contenu": {
        "documentURI": "/15/amendements/1396/AN/1423.pdf"
      }
    }
  ],
  "seanceDiscussion": "RUANR5L15S2019IDS21373",
  "sort": {
    "dateSaisie": "2018-11-22T12:31:48.000+01:00",
    "sortEnSeance": "Adopté"
  },
  "dateDepot": "2018-11-15T01:00:00.000+01:00",
  "dateDistribution": "2018-11-21T01:00:00.000+01:00",
  "article99": "0",
  "loiReference": {}
}