{
  "uid": "AMANR5L15PO744107B0806P0D1N99",
  "identifiant": {
    "legislature": "15",
    "numero": "99",
    "numRect": "0",
    "saisine": {
      "texteLegislatifRef": "PRJLANR5L15B0806",
      "numeroPartiePLF": "0",
      "organeExamen": "PO744107",
      "mentionSecondeDeliberation": "0"
    }
  },
  "numeroLong": "99",
  "etapeTexte": "Nouvelle Lecture",
  "triAmendement": "i",
  "cardinaliteAmdtMultiples": "1",
  "etat": "Discuté",
  "signataires": {
    "auteur": {
      "typeAuteur": "Gouvernement"
    },
    "texteAffichable": "le Gouvernement"
  },
  "pointeurFragmentTexte": {
    "division": {
      "titre": "Article 26 bis",
      "articleDesignationCourte": "ART. 26 BIS",
      "type": "ARTICLE",
      "avantAApres": "A",
      "divisionRattachee": "ARTICLE 26 BIS",
      "urlDivisionTexteVise": "/15/textes/0806.asp#D_Article_26_bis"
    }
  },
  "corps": {
    "dispositif": "<p style=\"text-align: justify;\">R&#233;tablir cet article dans la r&#233;daction suivante&#160;:</p><p style=\"text-align: justify;\">&#171;&#160;Dans les conditions pr&#233;vues &#224; l&#8217;article&#160;38 de la Constitution, le Gouvernement est autoris&#233; &#224; prendre par ordonnances, dans un d&#233;lai de dix-huit mois &#224; compter de la publication de la pr&#233;sente loi, toute mesure relevant du domaine de la loi, afin de faciliter l&#8217;implantation, le d&#233;veloppement et le maintien de modes d&#8217;accueil de la petite enfance&#160;:</p><p style=\"text-align: justify;\">&#171;&#160;1&#176;&#160;En simplifiant et en assurant une meilleure coh&#233;rence des l&#233;gislations applicables aux modes d&#8217;accueil de la petite enfance, au regard de leurs sp&#233;cificit&#233;s respectives&#160;;</p><p style=\"text-align: justify;\">&#171;&#160;2&#176;&#160;En pr&#233;voyant les conditions dans lesquelles ces l&#233;gislations peuvent donner lieu &#224; des d&#233;rogations, justifi&#233;es par la sp&#233;cificit&#233; des situations et des enjeux locaux, d&#232;s lors que des garanties &#233;quivalentes sont apport&#233;es en termes de qualit&#233; d&#8217;accueil, notamment le nombre et la qualification des adultes encadrant les enfants, et de respect de l&#8217;int&#233;r&#234;t de l&#8217;enfant&#160;;</p><p style=\"text-align: justify;\">&#171;&#160;3&#176;&#160;En permettant &#224; l&#8217;une des autorit&#233;s comp&#233;tentes en la mati&#232;re, dont les organismes d&#233;biteurs des prestations familiales, de prendre, au nom de chacune ou de certaines d&#8217;entre elles et apr&#232;s leur accord, tout ou partie des actes n&#233;cessaires &#224; l&#8217;implantation, au d&#233;veloppement et au maintien de modes d&#8217;accueil de la petite enfance ainsi qu&#8217;&#224; leur financement, en vue notamment de&#160;:</p><p style=\"text-align: justify;\">&#171;&#160;<i>a)</i>&#160;Proposer un guichet administratif unique facilitant les d&#233;marches des porteurs de projets de modes d&#8217;accueil de la petite enfance &#224; chaque &#233;tape de leur activit&#233;&#160;;</p><p style=\"text-align: justify;\">&#171;&#160;<i>b)</i>&#160;Favoriser la coh&#233;rence des actes pris par les autorit&#233;s comp&#233;tentes en la mati&#232;re, au regard notamment des diagnostics, des sch&#233;mas, des plans d&#8217;action et plus g&#233;n&#233;ralement de toutes d&#233;marches locales de coordination dans le champ des modes d&#8217;accueil de la petite enfance.</p><p style=\"text-align: justify;\">&#171;&#160;Pour l&#8217;application des&#160;1&#176; et&#160;2&#176;, les ordonnances peuvent pr&#233;voir le recours &#224; des exp&#233;rimentations d&#8217;une dur&#233;e ne pouvant &#234;tre inf&#233;rieure &#224; deux ans ni sup&#233;rieure &#224; cinq ans, donnant lieu &#224; un rapport d&#8217;&#233;valuation remis par le Gouvernement au Parlement avant leur terme.</p><p style=\"text-align: justify;\">&#171;&#160;Pour l&#8217;application du&#160;3&#176;, il est recouru &#224; une exp&#233;rimentation, sur la base du volontariat des autorit&#233;s comp&#233;tentes de chaque territoire impliqu&#233;, dont la dur&#233;e maximale ne peut &#234;tre inf&#233;rieure &#224; deux ans ni sup&#233;rieure &#224; cinq ans, donnant lieu &#224; un rapport d&#8217;&#233;valuation remis par le Gouvernement au Parlement avant son terme.</p><p style=\"text-align: justify;\">&#171;&#160;Un projet de loi de ratification est d&#233;pos&#233; devant le Parlement dans un d&#233;lai de trois mois &#224; compter de la publication de l&#8217;ordonnance.&#160;&#187;</p>",
    "exposeSommaire": "<p style=\"text-align: justify;\">En 2014, la capacit&#233; th&#233;orique d&#8217;accueil des enfants de moins de 3 ans par des modes d&#8217;accueil formels &#233;tait de 1&#160;359&#160;900 soit 56,1 places pour 100 enfants de moins de 3 ans en France enti&#232;re, hors Mayotte. Les modes d&#8217;accueil formels prennent plusieurs formes&#160;:</p><p style=\"text-align: justify;\">-&#160;l&#8217;accueil dit individuel&#160;: au domicile du professionnel (assistants maternels, 990&#160;000 places d&#8217;accueil dont 803&#160;300 pour les enfants de moins de 3&#160;ans) ou des parents (gardes &#224; domicile, 41&#160;400 enfants concern&#233;s), ou dans un tiers lieu (maisons d&#8217;assistants maternels, 12 000 enfants accueillis)&#160;;</p><p style=\"text-align: justify;\">-&#160;l&#8217;accueil dit collectif&#160;: &#233;tablissements d&#8217;accueil du jeune enfant (EAJE, 420&#160;000 places), principalement financ&#233;s par une prestation de service de la branche Famille (cr&#232;ches collectives/parentales/ familiales /halte-garderie), ou par la prestation d&#8217;accueil des jeunes enfants&#160;PAJE&#160;(micro-cr&#232;ches), auxquels il convient d&#8217;ajouter la pr&#233;-scolarisation pr&#233;coce (&#233;cole maternelle d&#232;s 2&#160;ans, 96 000 places).</p><p style=\"text-align: justify;\">Si les cr&#232;ches municipales repr&#233;sentent 60&#160;% du stock de places d&#8217;accueil collectif, il peut &#234;tre soulign&#233; que la majorit&#233; des modes d&#8217;accueil sont port&#233;s par des acteurs priv&#233;s (assistants maternels qui repr&#233;sentent les 2/3 de l&#8217;offre d&#8217;accueil du jeune enfant, cr&#232;ches associatives, entreprises de cr&#232;ches).</p><p style=\"text-align: justify;\">Cette diversit&#233; de mod&#232;les, qui r&#233;sulte de l&#8217;histoire particuli&#232;re des modes d&#8217;accueil en France, est une richesse.</p><p style=\"text-align: justify;\">Toutefois, une collectivit&#233; locale, une association ou une entreprise qui g&#232;re un mode d&#8217;accueil de la petite enfance ou qui souhaite en cr&#233;er un (cr&#232;ches collectives, parentales, familiales,&#8230;) , un assistant maternel ou une personne qui souhaite le devenir doivent appliquer des normes &#224; la fois nombreuses et relevant de diff&#233;rents codes&#160;: action sociale et des familles, construction et habitation, rural et p&#234;che maritime, sant&#233; publique, travail, urbanisme&#8230;. Ces personnes &#233;prouvent ainsi de grandes difficult&#233;s &#224; appliquer de mani&#232;re coh&#233;rente des textes qui poursuivent des objectifs diff&#233;rents ou qui ne sont pas toujours adapt&#233;s au contexte local.</p><p style=\"text-align: justify;\">Aussi, il est propos&#233; de pr&#233;voir par ordonnance une mise en coh&#233;rence des textes applicables, des simplifications voire des d&#233;rogations afin de r&#233;duire les frictions entre les normes ou avec le contexte local, et ce faisant de faciliter la mise en &#339;uvre de la r&#233;glementation pour l&#8217;ensemble des parties prenantes en mati&#232;re d&#8217;accueil de la petite enfance.</p><p style=\"text-align: justify;\">Il sera veill&#233;&#160;:</p><p style=\"text-align: justify;\">-&#160;&#224; ce que soit maintenu un haut niveau de qualit&#233; concernant les conditions d&#8217;accueil des jeunes enfants, comprenant, outre le nombre et la qualification des adultes encadrant les enfants, de nombreuses composantes telles que les am&#233;nagements des locaux dans lesquels les enfants sont accueillis, la pertinence du projet d&#8217;accueil, l&#8217;individualisation de l&#8217;accueil r&#233;serv&#233; &#224; chaque enfant et &#224; chaque famille, la qualit&#233; de la relation tiss&#233;e entre les parents et les professionnels, l&#8217;inscription du mode d&#8217;accueil dans la dynamique territoriale, &#8230;&#160;; &#224; cette fin, les mesures prises par ordonnances s&#8217;inscriront dans le cadre d&#233;fini par la Charte nationale pour l&#8217;accueil du jeune enfant adopt&#233;e par le minist&#232;re charg&#233; de la famille au printemps 2017&#160;;</p><p style=\"text-align: justify;\">-&#160;&#224; ce que soit favoris&#233; l&#8217;exercice du libre choix des parents quant au mode d&#8217;accueil de leur enfant&#160;;</p><p style=\"text-align: justify;\">-&#160;&#224; ce que les mesures prises par ordonnances&#160;:</p><p style=\"text-align: justify;\">&#183;&#160;b&#233;n&#233;ficient prioritairement aux territoires sous-dot&#233;s en termes de modes d&#8217;accueil de la petite enfance&#160;;</p><p style=\"text-align: justify;\">&#183;&#160;respectent l&#8217;&#233;quit&#233; entre les diff&#233;rents territoires.</p><p style=\"text-align: justify;\">Des exp&#233;rimentations seront possibles.</p><p style=\"text-align: justify;\">Au-del&#224; de la question de l&#8217;application des normes, les collectivit&#233;s locales, les associations ou les entreprises qui g&#232;rent un mode d&#8217;accueil du jeune enfant ou qui souhaitent en cr&#233;er un, les assistants maternels et les personnes qui aimeraient le devenir doivent accomplir des d&#233;marches aupr&#232;s de plusieurs administrations dont principalement la commune au titre de la construction, de l&#8217;urbanisme, de l&#8217;accessibilit&#233; et de la s&#233;curit&#233; incendie, le pr&#233;fet pour la pr&#233;paration et la fourniture de repas aux enfants, le pr&#233;sident du conseil d&#233;partemental au titre de la protection maternelle et infantile et la caisse d&#8217;allocations familiales ou de mutualit&#233; sociale agricole pour le financement.</p><p style=\"text-align: justify;\">Si la mise en place de d&#233;marches de coordination locales ont dans les derni&#232;res ann&#233;es permis d&#8217;avancer sur la voie d&#8217;un diagnostic partag&#233; par l&#8217;ensemble des parties prenantes, cet enchev&#234;trement des formalit&#233;s administratives rend complexe la cr&#233;ation, le d&#233;veloppement et le maintien des modes d&#8217;accueil et ralentit la mise en &#339;uvre des projets voire peut d&#233;courager les porteurs de projets bien implant&#233;s.</p><p style=\"text-align: justify;\">Il est donc propos&#233; d&#8217;exp&#233;rimenter la mise en place d&#8217;un guichet administratif unique pour, d&#8217;une part, faciliter les d&#233;marches administratives des porteurs de projet et, d&#8217;autre part, garantir que les actes pris par les diff&#233;rentes autorit&#233;s comp&#233;tentes en mati&#232;re d&#8217;accueil de la petite enfance sont en coh&#233;rence avec le diagnostic partag&#233; &#233;tabli dans le cadre des d&#233;marches locales de coordination.</p><p style=\"text-align: justify;\">L&#8217;autorit&#233; qui portera le guichet unique sollicitera &#224; la place du porteur de projet l&#8217;accord des autorit&#233;s partenaires du guichet unique. Cette exp&#233;rimentation a pour objectif d&#8217;acc&#233;l&#233;rer les d&#233;lais de cr&#233;ation de places d&#8217;accueil mais aussi de favoriser le maintien des places existantes, et r&#233;pondrait &#224; une demande &#233;mise de longue date par les porteurs de projets en vue d&#8217;une simplification des formalit&#233;s d&#8217;ouverture et d&#8217;un meilleur accompagnement.</p><p style=\"text-align: justify;\">La mise en place du guichet unique reposera sur le volontariat des autorit&#233;s concern&#233;es&#160;; il n&#8217;est pas envisag&#233; de permettre &#224; une autorit&#233; comp&#233;tente en mati&#232;re de petite enfance de d&#233;cider unilat&#233;ralement de prendre au nom des autres autorit&#233;s comp&#233;tentes les actes n&#233;cessaires &#224; l&#8217;implantation, au d&#233;veloppement et au maintien des modes d&#8217;accueil de la petite enfance, ainsi qu&#8217;&#224; leur financement. En tout &#233;tat de cause, les d&#233;cisions devront &#234;tre prises apr&#232;s accord explicite des autorit&#233;s concern&#233;es, ceci afin de garantir la qualit&#233; des r&#233;ponses apport&#233;es aux porteurs de projet compte tenu du champ de comp&#233;tences bien sp&#233;cifique de chacune des autorit&#233;s concern&#233;es.</p><p style=\"text-align: justify;\">&#192; noter enfin s&#8217;agissant des financements&#160;:</p><p style=\"text-align: justify;\">-&#160;que sont incluses dans le champ les d&#233;cisions de financements accord&#233;s aux modes d&#8217;accueil par les organismes d&#233;biteurs des prestations familiales, dont il est pr&#233;cis&#233; que tant leur principe que leur montant seront arr&#234;t&#233;s par un acte pris avec l&#8217;accord de l&#8217;organisme d&#233;biteur des prestations familiales concern&#233;&#160;;</p><p style=\"text-align: justify;\">-&#160;qu&#8217;est exclu du champ le compl&#233;ment mode de garde de la prestation d&#8217;accueil du jeune enfant, dans la mesure o&#249; il s&#8217;agit d&#8217;une prestation l&#233;gale vers&#233;e aux familles recourant &#224; certains modes d&#8217;accueil (assistant maternel, garde &#224; domicile, certaines micro cr&#232;ches), et non &#224; ces modes d&#8217;accueil eux-m&#234;mes.</p>"
  },
  "representations": [
    {
      "nom": "PDF",
      "typeMime": {
        "type": "application",
        "subType": "PDF"
      },
      "statutRepresentation": {
        "verbatim": true,
        "canonique": true,
        "officielle": true,
        "transcription": false,
        "enregistrement": false
      },
      "contenu": {
        "documentURI": "/15/amendements/0806/CSCONF/99.pdf"
      }
    }
  ],
  "sort": {
    "dateSaisie": "2018-06-12T22:54:33.000+02:00",
    "sortEnSeance": "Adopté"
  },
  "dateDepot": "2018-06-07T02:00:00.000+02:00",
  "dateDistribution": "2018-06-11T02:00:00.000+02:00",
  "article99": "0",
  "loiReference": {}
}