{
  "uid": "AMANR5L15SEA717460B2296P0D1N1357",
  "identifiant": {
    "legislature": "15",
    "numero": "1357",
    "numRect": "0",
    "saisine": {
      "texteLegislatifRef": "PRJLANR5L15B2296",
      "numeroPartiePLF": "0",
      "organeExamen": "PO717460",
      "mentionSecondeDeliberation": "1"
    }
  },
  "numeroLong": "1357",
  "etapeTexte": "1ère lecture (1ère assemblée saisie)",
  "triAmendement": "ebaaaaaaaaaaaaaaaaaaaaaaaaaaaaaaaaaaaaaaaaaaaaaaaas",
  "cardinaliteAmdtMultiples": "1",
  "etat": "Discuté",
  "signataires": {
    "auteur": {
      "typeAuteur": "Depute",
      "acteurRef": "PA718926",
      "groupePolitiqueRef": "PO730940"
    },
    "cosignatairesRefs": [
      "PA689",
      "PA722110",
      "PA335612",
      "PA722202",
      "PA267306",
      "PA721118",
      "PA441",
      "PA720692",
      "PA721270",
      "PA610654",
      "PA718926",
      "PA721012",
      "PA721896",
      "PA720546",
      "PA718720",
      "PA610667"
    ],
    "texteAffichable": "M.&#160;Dharr&#233;ville,  M.&#160;Bruneel, Mme&#160;Bello, M.&#160;Brotherson, Mme&#160;Buffet, M.&#160;Chassaigne, M.&#160;Dufr&#232;gne, Mme&#160;Faucillon, M.&#160;Jumel, Mme&#160;K&#233;clard-Mond&#233;sir, M.&#160;Lecoq, M.&#160;Nilor, M.&#160;Peu, M.&#160;Fabien&#160;Roussel, M.&#160;Serville et M.&#160;Wulfranc"
  },
  "pointeurFragmentTexte": {
    "division": {
      "titre": "Article 28",
      "articleDesignationCourte": "APRÈS ART. 28",
      "type": "ARTICLE",
      "avantAApres": "Apres",
      "divisionRattachee": "APRÈS L'ARTICLE 28, insérer l'article suivant:",
      "articleAdditionnel": "1",
      "urlDivisionTexteVise": "/15/textes/2296.asp#D_Article_28"
    }
  },
  "corps": {
    "dispositif": "<p style=\"text-align: justify;\">Dans un d&#233;lai de six mois &#224; compter de la publication de la pr&#233;sente loi, le Gouvernement remet au Parlement un rapport sur le montant consolid&#233; de l&#8217;ensemble des d&#233;penses d&#8217;assurance maladie r&#233;sultant du remboursement des dispositifs m&#233;dicaux, ventil&#233; selon les diff&#233;rentes modalit&#233;s de remboursement.</p>",
    "exposeSommaire": "<p style=\"text-align: justify;\">Cet amendement reprend la proposition n&#176;&#160;23 du rapport d&#8217;information de mars 2019 relatif aux dispositions m&#233;dicaux &#224; l&#8217;initiative des d&#233;put&#233;s Julien Borowczyk et Pierre Dharr&#233;ville.</p><p style=\"text-align: justify;\">Comme l&#8217;indique les travaux de la mission, il r&#233;sulte d&#8217;un rapport IGAS-IGF que les d&#233;penses de dispositifs m&#233;dicaux ont augment&#233; de 5,3&#160;% par an en moyenne entre la p&#233;riode 2009 et 2013n, tout en &#233;tant concentr&#233;s sur certaines pathologies (orthop&#233;die, cardiologie).</p><p style=\"text-align: justify;\">Toutefois, la diversit&#233; des modalit&#233;s de prise en charge des dispositifs m&#233;dicaux par l&#8217;assurance maladie (liste en sus, liste intra-GHS) ne permet pas de disposer d&#8217;une vision consolid&#233;e de la d&#233;pense publique aff&#233;rente. Les annexes au PLFSS se contente d&#8217;indiquer le volume d&#8217;&#233;conomies attendues sur les dispositifs m&#233;dicaux pour l&#8217;ann&#233;e &#224; venir.</p><p style=\"text-align: justify;\">Faute de pouvoir modifier par amendement la structure des annexes de la LFSS, le pr&#233;sent amendement demande un rapport afin de b&#233;n&#233;ficier d&#8217;une &#233;valuation consolid&#233;e de l&#8217;ensemble des d&#233;penses d&#8217;assurance maladie r&#233;sultant du remboursement des dispositifs m&#233;dicaux, ventil&#233; selon les diff&#233;rentes modalit&#233;s de remboursement.</p>",
    "cartoucheDelaiDepotDepasse": "Sous réserve de son traitement par les services de l'Assemblée nationale et de sa recevabilité"
  },
  "representations": [
    {
      "nom": "PDF",
      "typeMime": {
        "type": "application",
        "subType": "PDF"
      },
      "statutRepresentation": {
        "verbatim": true,
        "canonique": true,
        "officielle": true,
        "transcription": false,
        "enregistrement": false
      },
      "contenu": {
        "documentURI": "/15/amendements/2296/AN/1357.pdf"
      }
    }
  ],
  "seanceDiscussion": "RUANR5L15S2020IDS21879",
  "sort": {
    "dateSaisie": "2019-10-24T23:42:28.000+02:00",
    "sortEnSeance": "Adopté"
  },
  "dateDepot": "2019-10-18T02:00:00.000+02:00",
  "dateDistribution": "2019-10-24T02:00:00.000+02:00",
  "article99": "0",
  "loiReference": {}
}