{
  "uid": "AMANR5L15SEA717460BTC1396P0D1N712",
  "identifiant": {
    "legislature": "15",
    "numero": "712",
    "numRect": "0",
    "saisine": {
      "texteLegislatifRef": "PRJLANR5L15BTC1396",
      "numeroPartiePLF": "0",
      "organeExamen": "PO717460",
      "mentionSecondeDeliberation": "0"
    }
  },
  "numeroLong": "712",
  "etapeTexte": "1ère lecture (2ème assemblée saisie)",
  "triAmendement": "aecaaaaaaaaaaaaaaaaaaaaaaaaaaaaaaaaaaaaaaaaaaaaaaabbru",
  "cardinaliteAmdtMultiples": "1",
  "etat": "Discuté",
  "signataires": {
    "auteur": {
      "typeAuteur": "Depute",
      "acteurRef": "PA2377",
      "groupePolitiqueRef": "PO730934"
    },
    "cosignatairesRefs": [
      "PA2377"
    ],
    "texteAffichable": "M.&#160;Perrut"
  },
  "pointeurFragmentTexte": {
    "division": {
      "titre": "Article 4",
      "articleDesignationCourte": "APRÈS ART. 4",
      "type": "ARTICLE",
      "avantAApres": "Apres",
      "divisionRattachee": "APRÈS L'ARTICLE 4, insérer l'article suivant:",
      "articleAdditionnel": "1",
      "urlDivisionTexteVise": "/15/textes/1396.asp#D_Article_4"
    }
  },
  "corps": {
    "dispositif": "<p style=\"text-align: justify;\">I. &#8211; Les deux derniers alin&#233;as l&#8217;article&#160;1374 du code civil sont supprim&#233;s.</p><p style=\"text-align: justify;\">II. &#8211; Au 4&#176;&#160;<i>bis</i> de l&#8217;article L.&#160;111&#8209;3 du code des proc&#233;dures civiles d&#8217;ex&#233;cution, les mots&#160;: &#171;&#160;,&#160;d&#233;pos&#233;s au rang des minutes d&#8217;un notaire&#160;&#187; sont supprim&#233;s.</p>",
    "exposeSommaire": "<p style=\"text-align: justify;\">Poursuivant un objectif d&#8217;&#233;conomie, cet amendement modifie l&#8217;article&#160;229&#8209;1 du code civil afin de conf&#233;rer la force ex&#233;cutoire &#224; la convention prenant la forme d&#8217;un acte sous signature priv&#233;e contresign&#233;e par avocats, par laquelle les &#233;poux consentent mutuellement &#224; leur divorce.</p><p style=\"text-align: justify;\">L&#8217;acte sous signature priv&#233;e contresign&#233; par l&#8217;avocat de chacune des parties comporte par nature les garanties n&#233;cessaires&#160;: les avocats ont par hypoth&#232;se v&#233;rifi&#233; la conformit&#233; de l&#8217;accord &#224; l&#8217;ordre public, la r&#233;alit&#233; du consentement des parties et auront veill&#233; &#224; la sauvegarde des int&#233;r&#234;ts de la partie qu&#8217;ils assistent.</p><p style=\"text-align: justify;\">Il s&#8217;agit &#224; la fois d&#8217;une mesure de simplification pour les &#233;poux qui divorcent et d&#8217;une mesure d&#8217;&#233;conomie pour ces derniers qui n&#8217;auront plus &#224; acquitter les 50&#160;&#8364; r&#233;mun&#233;rant le d&#233;p&#244;t de l&#8217;acte par le notaire au rang de ses minutes.</p><p style=\"text-align: justify;\">En cons&#233;quence, le 4 bis de l&#8217;article L111&#8209;3 du Code des proc&#233;dures civiles d&#8217;ex&#233;cution est modifi&#233;, afin de supprimer la mention du d&#233;p&#244;t de la convention au rang des minutes d&#8217;un notaire.</p>"
  },
  "representations": [
    {
      "nom": "PDF",
      "typeMime": {
        "type": "application",
        "subType": "PDF"
      },
      "statutRepresentation": {
        "verbatim": true,
        "canonique": true,
        "officielle": true,
        "transcription": false,
        "enregistrement": false
      },
      "contenu": {
        "documentURI": "/15/amendements/1396/AN/712.pdf"
      }
    }
  ],
  "seanceDiscussion": "RUANR5L15S2019IDS21372",
  "sort": {
    "dateSaisie": "2018-11-21T22:30:13.000+01:00",
    "sortEnSeance": "Non soutenu"
  },
  "dateDepot": "2018-11-15T01:00:00.000+01:00",
  "dateDistribution": "2018-11-18T01:00:00.000+01:00",
  "article99": "0",
  "loiReference": {
    "codeLoi": "c civil",
    "divisionCodeLoi": "1374"
  }
}