{
  "uid": "AMANR5L15SEA717460BTC2039P0D1N344",
  "identifiant": {
    "legislature": "15",
    "numero": "344",
    "numRect": "0",
    "saisine": {
      "texteLegislatifRef": "PRJLANR5L15BTC2039",
      "numeroPartiePLF": "0",
      "organeExamen": "PO717460",
      "mentionSecondeDeliberation": "0"
    }
  },
  "numeroLong": "344",
  "etapeTexte": "1ère lecture (2ème assemblée saisie)",
  "triAmendement": "raaaaaaaaaaaaaaaaaaaaaaaaaaaaaaaaaaaaaaaaaaaaaaaaal",
  "cardinaliteAmdtMultiples": "1",
  "amendementParent": "AMANR5L15SEA717460BTC2039P0D1N61",
  "etat": "Discuté",
  "signataires": {
    "auteur": {
      "typeAuteur": "Depute",
      "acteurRef": "PA642847",
      "groupePolitiqueRef": "PO730934"
    },
    "cosignatairesRefs": [
      "PA642847"
    ],
    "texteAffichable": "M.&#160;Bazin"
  },
  "pointeurFragmentTexte": {
    "division": {
      "titre": "Article 10",
      "articleDesignationCourte": "ART. 10",
      "type": "ARTICLE",
      "avantAApres": "A",
      "divisionRattachee": "ARTICLE 10",
      "urlDivisionTexteVise": "/15/textes/2039.asp#D_Article_10"
    },
    "alinea": {
      "numero": "2"
    }
  },
  "corps": {
    "dispositif": "<p style=\"text-align: justify;\">Compl&#233;ter l&#8217;alin&#233;a&#160;2 par les mots&#160;: </p><p style=\"text-align: justify;\">&#171;&#160;et des d&#233;partements limitrophes&#160;&#187;.</p>",
    "exposeSommaire": "<p style=\"text-align: justify;\">Ce sous-amendement vient ajouter que les d&#233;partements limitrophes de la Collectivit&#233; europ&#233;enne d&#8217;Alsace attendent aussi la mise en &#339;uvre d&#8217;une redevance et il convient donc de pr&#233;ciser, pour eux aussi, la r&#233;daction de l&#8217;habilitation du Gouvernement &#224; prendre des mesures par ordonnance afin de permettre explicitement l&#8217;instauration d&#8217;une contribution sp&#233;cifique pour les v&#233;hicules de plus de 3,5 tonnes qui empruntent les axes sur leur territoire.</p>"
  },
  "representations": [
    {
      "nom": "PDF",
      "typeMime": {
        "type": "application",
        "subType": "PDF"
      },
      "statutRepresentation": {
        "verbatim": true,
        "canonique": true,
        "officielle": true,
        "transcription": false,
        "enregistrement": false
      },
      "contenu": {
        "documentURI": "/15/amendements/2039/AN/344.pdf"
      }
    }
  ],
  "seanceDiscussion": "RUANR5L15S2019IDS21732",
  "sort": {
    "dateSaisie": "2019-06-26T00:45:04.000+02:00",
    "sortEnSeance": "Non soutenu"
  },
  "dateDepot": "2019-06-25T02:00:00.000+02:00",
  "dateDistribution": "2019-06-25T02:00:00.000+02:00",
  "article99": "0",
  "loiReference": {}
}