{
  "uid": "AMANR5L15SEA717460B2272P1D1N2979",
  "identifiant": {
    "legislature": "15",
    "numero": "2979",
    "numRect": "0",
    "saisine": {
      "texteLegislatifRef": "PRJLANR5L15B2272",
      "numeroPartiePLF": "1",
      "organeExamen": "PO717460",
      "mentionSecondeDeliberation": "0"
    }
  },
  "numeroLong": "I-2979",
  "etapeTexte": "1ère lecture (1ère assemblée saisie)",
  "triAmendement": "bfaaaaaaaaaaaaaaaaaaaaaaaaaaaaaaaaaaaaaaaaaaaaaaaaebk",
  "cardinaliteAmdtMultiples": "1",
  "etat": "Discuté",
  "signataires": {
    "auteur": {
      "typeAuteur": "Gouvernement"
    },
    "texteAffichable": "le Gouvernement"
  },
  "pointeurFragmentTexte": {
    "division": {
      "titre": "Article 6",
      "articleDesignationCourte": "APRÈS ART. 6",
      "type": "ARTICLE",
      "avantAApres": "Apres",
      "divisionRattachee": "APRÈS L'ARTICLE 6, insérer l'article suivant:",
      "articleAdditionnel": "1",
      "urlDivisionTexteVise": "/15/textes/2272A.asp#D_Article_6"
    }
  },
  "corps": {
    "dispositif": "<p style=\"text-align: justify;\">Le deuxi&#232;me alin&#233;a de l&#8217;article&#160;302 <i>bis</i> ZL du code g&#233;n&#233;ral des imp&#244;ts est ainsi modifi&#233;&#160;:</p><p style=\"text-align: justify;\">1&#176;&#160;La r&#233;f&#233;rence&#160;: &#171;&#160;, 302 <i>bis</i> ZH&#160;&#187; est supprim&#233;e&#160;;</p><p style=\"text-align: justify;\">2&#176;&#160;Apr&#232;s la premi&#232;re phrase, est ins&#233;r&#233;e une phrase ainsi r&#233;dig&#233;e&#160;:</p><p style=\"text-align: justify;\">&#171;&#160;L&#8217;exigibilit&#233; du pr&#233;l&#232;vement mentionn&#233; &#224; l&#8217;article&#160;302 <i>bis</i> ZH est constitu&#233;e par la r&#233;alisation du ou des &#233;v&#233;nements sur lesquels repose le jeu.&#160;&#187;.</p>",
    "exposeSommaire": "<p style=\"text-align: justify;\">L&#8217;article 138 de la loi relative &#224; la croissance et la transformation des entreprises a modifi&#233; l&#8217;assiette de divers pr&#233;l&#232;vements sur les jeux de lotterie et les paris sportifs. A compter du 1er janvier 2020, ces pr&#233;l&#232;vements ne seront plus assis sur les mises, mais sur le produit brut des jeux. L&#8217;exigibilit&#233; des pr&#233;l&#232;vements ne sera plus constitu&#233;e par l&#8217;encaissement des mises, mais par la r&#233;alisation du ou des &#233;venements sur lesquels repose le jeu.</p><p>Cet amendement a pour objet de proc&#233;der &#224; la m&#234;me modification de l&#8217;exigibilit&#233; pour le pr&#233;l&#232;vement sur les paris sportifs vis&#233; &#224; l&#8217;article 302 bis ZH du code g&#233;n&#233;ral des imp&#244;ts.</p>",
    "cartoucheDelaiDepotDepasse": "Sous réserve de son traitement par les services de l'Assemblée nationale et de sa recevabilité"
  },
  "representations": [
    {
      "nom": "PDF",
      "typeMime": {
        "type": "application",
        "subType": "PDF"
      },
      "statutRepresentation": {
        "verbatim": true,
        "canonique": true,
        "officielle": true,
        "transcription": false,
        "enregistrement": false
      },
      "contenu": {
        "documentURI": "/15/amendements/2272A/AN/2979.pdf"
      }
    }
  ],
  "seanceDiscussion": "RUANR5L15S2020IDS21870",
  "sort": {
    "dateSaisie": "2019-10-18T17:37:19.000+02:00",
    "sortEnSeance": "Adopté"
  },
  "dateDepot": "2019-10-13T02:00:00.000+02:00",
  "dateDistribution": "2019-10-18T02:00:00.000+02:00",
  "article99": "1",
  "loiReference": {}
}