{
  "uid": "AMANR5L15SEA717460BTC1924P0D1N33",
  "identifiant": {
    "legislature": "15",
    "numero": "33",
    "numRect": "0",
    "saisine": {
      "texteLegislatifRef": "PRJLANR5L15BTC1924",
      "numeroPartiePLF": "0",
      "organeExamen": "PO717460",
      "mentionSecondeDeliberation": "1"
    }
  },
  "numeroLong": "33",
  "etapeTexte": "1ère lecture (1ère assemblée saisie)",
  "triAmendement": "qaaaaaaaaaaaaaaaaaaaaaaaaaaaaaaaaaaaaaaaaaaaaaaaaak",
  "cardinaliteAmdtMultiples": "1",
  "etat": "Discuté",
  "signataires": {
    "auteur": {
      "typeAuteur": "Depute",
      "acteurRef": "PA721678",
      "groupePolitiqueRef": "PO730934"
    },
    "cosignatairesRefs": [
      "PA605036",
      "PA709315",
      "PA721314",
      "PA334654",
      "PA720684",
      "PA267450",
      "PA2155",
      "PA721968",
      "PA713448",
      "PA346218",
      "PA721046",
      "PA267735",
      "PA719318",
      "PA266793",
      "PA721678",
      "PA712015",
      "PA718884",
      "PA606712",
      "PA334843",
      "PA1012",
      "PA267429"
    ],
    "texteAffichable": "M.&#160;Reda,  M.&#160;Dive, M.&#160;Lurton, Mme&#160;Anthoine, Mme&#160;Bazin-Malgras, M.&#160;Schellenberger, M.&#160;Viala, M.&#160;Cinieri, M.&#160;Straumann, M.&#160;de la Verpilli&#232;re, M.&#160;Masson, M.&#160;Abad, M.&#160;Verch&#232;re, Mme&#160;Brenier, Mme&#160;Bassire, M.&#160;Menuel, M.&#160;de Ganay, M.&#160;Vialay, M.&#160;Bony, M.&#160;R&#233;mi&#160;Delatte et M.&#160;Pierre-Henri&#160;Dumont"
  },
  "pointeurFragmentTexte": {
    "division": {
      "titre": "de transformation de la fonction publique.",
      "articleDesignationCourte": "TITRE",
      "type": "TITRE",
      "avantAApres": "A",
      "divisionRattachee": "TITRE",
      "urlDivisionTexteVise": "/15/textes/1924.asp#D_de_transformation_de_la_fonction_publi"
    }
  },
  "corps": {
    "dispositif": "<p>Substituer aux mots&#160;:</p><p style=\"text-align: justify;\">&#171;&#160;de transformation de&#160;&#187;</p><p style=\"text-align: justify;\">les mots&#160;:</p><p style=\"text-align: justify;\">&#171;&#160;tendant &#224; moderniser&#160;&#187;.</p>",
    "exposeSommaire": "<p>Le projet de loi pr&#233;voit un recours important aux ordonnances. Les dispositifs concernant des domaines essentiels, tels que la n&#233;gociation collective ou la formation, ne sont pas encore connus.</p><p style=\"text-align: justify;\">Avec un nombre important d&#8217;habilitations &#224; l&#233;gif&#233;rer par ordonnances, il n&#8217;est pas possible de savoir s&#8217;il s&#8217;agira de &#171;&#160;transformer&#160;&#187; la fonction publique ou, plus modestement, de la &#171;&#160;moderniser&#160;&#187;.</p><p style=\"text-align: justify;\">Dans le doute, il est plus prudent de parler de &#171;&#160;modernisation&#160;de la fonction publique pour qualifier ce projet de loi.</p>"
  },
  "representations": [
    {
      "nom": "PDF",
      "typeMime": {
        "type": "application",
        "subType": "PDF"
      },
      "statutRepresentation": {
        "verbatim": true,
        "canonique": true,
        "officielle": true,
        "transcription": false,
        "enregistrement": false
      },
      "contenu": {
        "documentURI": "/15/amendements/1924/AN/33.pdf"
      }
    }
  ],
  "sort": {
    "dateSaisie": "2019-05-22T00:48:05.000+02:00",
    "sortEnSeance": "Rejeté"
  },
  "dateDepot": "2019-05-07T02:00:00.000+02:00",
  "dateDistribution": "2019-05-13T02:00:00.000+02:00",
  "article99": "0",
  "loiReference": {}
}