{
  "uid": "AMANR5L15SEA717460BTC1924P0D1N12",
  "identifiant": {
    "legislature": "15",
    "numero": "12",
    "numRect": "0",
    "saisine": {
      "texteLegislatifRef": "PRJLANR5L15BTC1924",
      "numeroPartiePLF": "0",
      "organeExamen": "PO717460",
      "mentionSecondeDeliberation": "0"
    }
  },
  "numeroLong": "12",
  "etapeTexte": "1ère lecture (1ère assemblée saisie)",
  "triAmendement": "caaaaaaaaaaaaaaaaaaaaaaaaaaaaaaaaaaaaaaaaaaaaaaaaaf",
  "cardinaliteAmdtMultiples": "1",
  "etat": "Discuté",
  "signataires": {
    "auteur": {
      "typeAuteur": "Depute",
      "acteurRef": "PA712015",
      "groupePolitiqueRef": "PO730934"
    },
    "cosignatairesRefs": [
      "PA334843",
      "PA643134",
      "PA719272",
      "PA346218",
      "PA266776",
      "PA722390",
      "PA713448",
      "PA267289",
      "PA267260",
      "PA605036",
      "PA336316",
      "PA608016",
      "PA332523",
      "PA718884",
      "PA719318",
      "PA720684",
      "PA721678",
      "PA1012",
      "PA721968",
      "PA712015",
      "PA267735",
      "PA606712"
    ],
    "texteAffichable": "M.&#160;Dive,  Mme&#160;Bazin-Malgras, Mme&#160;Anthoine, M.&#160;Masson, M.&#160;Door, M.&#160;Bouchet, Mme&#160;Louwagie, M.&#160;Lurton, M.&#160;Vialay, M.&#160;de la Verpilli&#232;re, Mme&#160;Corneloup, M.&#160;Pierre-Henri&#160;Dumont, Mme&#160;Dalloz, M.&#160;Abad, M.&#160;de Ganay, Mme&#160;Meunier, M.&#160;Verch&#232;re, Mme&#160;Poletti, M.&#160;Reiss, M.&#160;Reda, Mme&#160;Valentin et Mme&#160;Brenier"
  },
  "pointeurFragmentTexte": {
    "division": {
      "titre": "Article 9",
      "articleDesignationCourte": "ART. 9",
      "type": "ARTICLE",
      "avantAApres": "A",
      "divisionRattachee": "ARTICLE 9",
      "urlDivisionTexteVise": "/15/textes/1924.asp#D_Article_9"
    },
    "alinea": {
      "numero": "17"
    }
  },
  "corps": {
    "dispositif": "<p style=\"text-align: justify;\">I.&#160;&#8211;&#160;&#192; la premi&#232;re phrase de l&#8217;alin&#233;a&#160;17, substituer au mot&#160;:</p><p style=\"text-align: justify;\">&#171;&#160;trois&#160;&#187;</p><p style=\"text-align: justify;\">le mot&#160;:</p><p style=\"text-align: justify;\">&#171;&#160;deux&#160;&#187;.</p><p style=\"text-align: justify;\">II.&#160;&#8211;&#160;En cons&#233;quence, &#224; la seconde phrase du m&#234;me alin&#233;a, substituer au mot&#160;:</p><p style=\"text-align: justify;\">&#171;&#160;six&#160;&#187;</p><p style=\"text-align: justify;\">le mot&#160;:</p><p style=\"text-align: justify;\">&#171;&#160;quatre&#160;&#187;.</p><p style=\"text-align: justify;\">III.&#160;&#8211;&#160;En cons&#233;quence, proc&#233;der &#224; la m&#234;me substitution &#224; l&#8217;alin&#233;a&#160;18 et &#224; la premi&#232;re phrase de l&#8217;alin&#233;a&#160;19.</p>",
    "exposeSommaire": "<p style=\"text-align: justify;\">Cet amendement vise &#224; ne pas rebuter les contractuels non-fonctionnaires &#224; qui on propose au d&#233;but un contrat &#224; dur&#233;e d&#233;termin&#233; et qui peuvent se retrouver dans la situation de devoir attendre six ans, avant d&#8217;esp&#233;rer un contrat &#224; dur&#233;e ind&#233;termin&#233;.</p>"
  },
  "representations": [
    {
      "nom": "PDF",
      "typeMime": {
        "type": "application",
        "subType": "PDF"
      },
      "statutRepresentation": {
        "verbatim": true,
        "canonique": true,
        "officielle": true,
        "transcription": false,
        "enregistrement": false
      },
      "contenu": {
        "documentURI": "/15/amendements/1924/AN/12.pdf"
      }
    }
  ],
  "sort": {
    "dateSaisie": "2019-05-16T22:19:36.000+02:00",
    "sortEnSeance": "Non soutenu"
  },
  "dateDepot": "2019-05-07T02:00:00.000+02:00",
  "dateDistribution": "2019-05-10T02:00:00.000+02:00",
  "article99": "0",
  "loiReference": {}
}