{
  "uid": "AMANR5L15PO59051B1802P0D1N202",
  "identifiant": {
    "legislature": "15",
    "numero": "202",
    "numRect": "0",
    "saisine": {
      "texteLegislatifRef": "PRJLANR5L15B1802",
      "numeroPartiePLF": "0",
      "organeExamen": "PO59051",
      "mentionSecondeDeliberation": "0"
    }
  },
  "numeroLong": "CL202",
  "etapeTexte": "1ère lecture (1ère assemblée saisie)",
  "triAmendement": "alaaaaaaaaaaaaaaaaaaaaaaaaaaaaaaaaaaaaaaaaaaaaaaaam",
  "cardinaliteAmdtMultiples": "1",
  "etat": "Discuté",
  "signataires": {
    "auteur": {
      "typeAuteur": "Depute",
      "acteurRef": "PA346218",
      "groupePolitiqueRef": "PO730934"
    },
    "cosignatairesRefs": [
      "PA346218",
      "PA709315",
      "PA719272",
      "PA721314",
      "PA330684",
      "PA720684",
      "PA608416",
      "PA267378",
      "PA267429",
      "PA266776",
      "PA718884",
      "PA605036",
      "PA719318"
    ],
    "texteAffichable": "M.&#160;Masson,  M.&#160;Abad, Mme&#160;Anthoine, Mme&#160;Bazin-Malgras, Mme&#160;Val&#233;rie&#160;Boyer, M.&#160;Cinieri, M.&#160;Pierre-Henri&#160;Dumont, M.&#160;Hetzel, Mme&#160;Levy, M.&#160;Schellenberger, M.&#160;Viala, Mme&#160;Meunier et M.&#160;Reiss"
  },
  "pointeurFragmentTexte": {
    "division": {
      "titre": "Article 4",
      "articleDesignationCourte": "ART. 4",
      "type": "ARTICLE",
      "avantAApres": "A",
      "divisionRattachee": "ARTICLE 4",
      "urlDivisionTexteVise": "/15/textes/1802.asp#D_Article_4"
    },
    "alinea": {
      "numero": "19"
    }
  },
  "corps": {
    "dispositif": "<p style=\"text-align: justify;\">Apr&#232;s le mot&#160;:</p><p style=\"text-align: justify;\">&#171;&#160;articles&#160;&#187;,</p><p style=\"text-align: justify;\">r&#233;diger ainsi la fin de l&#8217;alin&#233;a&#160;19&#160;: </p><p style=\"text-align: justify;\">&#171;&#160;&#171;&#160;39, 60, 72, 76, 78, 80, 89, 93 et 96.&#160;&#187;&#160;&#187;</p>",
    "exposeSommaire": "<p style=\"text-align: justify;\">Afin que les d&#233;cisions individuelles li&#233;es aux promotions internes, aux avancements de grades et au tableau annuel d'avancements dans la fonction publique territoriale soient soumises &#224; l'avis des commissions administratives paritaires, l'adjonction des articles 39, 78 et 80 de la loi n&#176;84-53 du 26 janvier 1984 portant dispositions statutaires relatives &#224; la fonction publique territoriale est n&#233;cessaire. De plus, le retrait de l'article 46 de cette m&#234;me loi &#233;vite l'examen des nominations par les commissions administratives paritaires qui serait une contrainte au pouvoir de nomination aux emplois par l'autorit&#233; territoriale et &#224; la libre administration des collectivit&#233;s territoriales puisque la mention de cet article permettrait aux commissions administratives paritaires d'&#233;valuer les recrutements par voie de concours et par voie d'emplois r&#233;serv&#233;s.</p>"
  },
  "representations": [
    {
      "nom": "PDF",
      "typeMime": {
        "type": "application",
        "subType": "PDF"
      },
      "statutRepresentation": {
        "verbatim": true,
        "canonique": true,
        "officielle": true,
        "transcription": false,
        "enregistrement": false
      },
      "contenu": {
        "documentURI": "/15/amendements/1802/CION_LOIS/CL202.pdf"
      }
    }
  ],
  "sort": {
    "dateSaisie": "2019-05-02T15:10:41.000+02:00",
    "sortEnSeance": "Rejeté"
  },
  "dateDepot": "2019-04-26T02:00:00.000+02:00",
  "dateDistribution": "2019-05-01T02:00:00.000+02:00",
  "article99": "0",
  "loiReference": {
    "codeLoi": "1"
  }
}