{
  "uid": "AMANR5L15SEA717460B0269P0D1N903",
  "identifiant": {
    "legislature": "15",
    "numero": "903",
    "numRect": "0",
    "saisine": {
      "texteLegislatifRef": "PRJLANR5L15B0269",
      "numeroPartiePLF": "0",
      "organeExamen": "PO717460",
      "mentionSecondeDeliberation": "0"
    }
  },
  "numeroLong": "903",
  "etapeTexte": "1ère lecture (1ère assemblée saisie)",
  "triAmendement": "auc",
  "cardinaliteAmdtMultiples": "1",
  "etat": "Irrecevable",
  "signataires": {
    "auteur": {
      "typeAuteur": "Depute",
      "acteurRef": "PA719930",
      "groupePolitiqueRef": "PO730946"
    },
    "cosignatairesRefs": [
      "PA719930",
      "PA642764",
      "PA610681",
      "PA643145"
    ],
    "texteAffichable": "M.&#160;Vallaud,  M.&#160;Aviragnet, Mme&#160;Bareigts, Mme&#160;Vainqueur-Christophe et les membres du groupe Nouvelle Gauche"
  },
  "pointeurFragmentTexte": {
    "division": {
      "titre": "Article 44",
      "articleDesignationCourte": "APRÈS ART. 44",
      "type": "ARTICLE",
      "avantAApres": "Apres",
      "divisionRattachee": "APRÈS L'ARTICLE 44, insérer l'article suivant:",
      "articleAdditionnel": "1",
      "urlDivisionTexteVise": "/15/textes/0269.asp#D_Article_44"
    }
  },
  "corps": {
    "dispositif": "<p style=\"text-align: justify;\">I.&#160;&#8211;&#160;Apr&#232;s l&#8217;article L.&#160;160&#8209;14 du code de la s&#233;curit&#233; sociale, il est ins&#233;r&#233; un article L.&#160;160&#8209;14 <i>bis</i> ainsi r&#233;dig&#233;&#160;:</p><p style=\"text-align: justify;\">&#171;&#160;<i>Art. L.&#160;160&#8209;14 bis.-</i> Les participations de l&#8217;assur&#233; mentionn&#233;es &#224; l&#8217;article L.&#160;160&#8209;13 sont supprim&#233;es lorsqu&#8217;au cours d&#8217;une p&#233;riode de trois mois la d&#233;pense demeurant &#224; la charge de l&#8217;int&#233;ress&#233; d&#233;passe un certain montant.</p><p style=\"text-align: justify;\">&#171;&#160;Ce montant est d&#233;fini par d&#233;cret en Conseil d&#8217;&#201;tat, pris apr&#232;s avis de l&#8217;Union nationale des caisses d&#8217;assurance maladie et de l&#8217;Union nationale des organismes d&#8217;assurance maladie compl&#233;mentaire.&#160;&#187;</p><p style=\"text-align: justify;\">II.&#160;&#8211;&#160;La perte de recettes pour les organismes de s&#233;curit&#233; sociale est compens&#233;e &#224; due concurrence par la cr&#233;ation d&#8217;une taxe additionnelle aux droits vis&#233;s aux articles 575 et 575 A du code g&#233;n&#233;ral des imp&#244;ts.</p>",
    "exposeSommaire": "<p style=\"text-align: justify;\">Depuis plusieurs ann&#233;es, les &#233;tudes tendent &#224; montrer qu&#8217;une part d&#233;croissante des Fran&#231;ais voit dans la protection sociale un &#233;l&#233;ment de solution face &#224; la crise. La persistance de restes &#224; charge &#233;lev&#233;s est l&#8217;une des explications cl&#233;s de cette perte de confiance et le signal d&#8217;une remise en cause de notre mod&#232;le d&#8217;excellence.</p><p style=\"text-align: justify;\">Nous pensons que tout va bien alors que ce n&#8217;est pas le cas. Les restes &#224; charge laiss&#233;s par les r&#233;gimes obligatoires de s&#233;curit&#233; sociale sont certes plus faibles en moyenne dans notre pays que dans la plupart des autres pays&#160;europ&#233;ens. Mais ces moyennes favorables recouvrent une forte dispersion et des r&#233;alit&#233;s sociales et personnelles parfois extr&#234;mement critiques. C&#8217;est le cas des patients non &#233;ligibles &#224; la CMUC (par exemple les b&#233;n&#233;ficiaires de l&#8217;ASS ou de l&#8217;AAH) qui font face &#224; un &#233;pisode de soins de longue dur&#233;e &#224; l&#8217;h&#244;pital, lequel peut mettre litt&#233;ralement &#224; terre leur budget. Il reste en effet des &#171;&#160;trous dans la raquette&#160;&#187; des r&#233;gimes obligatoires de l&#8217;assurance maladie que les organismes compl&#233;mentaires ne viennent pas combler&#160;: un &#233;pisode hospitalier de longue dur&#233;e pour des actes peu co&#251;teux, une prise en charge en psychiatrie de plus de 10 jours notamment.</p><p style=\"text-align: justify;\">On sait rarement que les restes &#224; charge apr&#232;s intervention des r&#233;gimes obligatoires sont aujourd&#8217;hui d&#8217;autant plus &#233;lev&#233;s que les m&#233;nages sont d&#233;favoris&#233;s. Ils atteignent 600&#160;&#8364; par an pour les m&#233;nages les plus modestes, contre 500&#160;&#8364; par an pour les m&#233;nages les plus fortun&#233;s.</p><p style=\"text-align: justify;\">Ce ph&#233;nom&#232;ne de redistribution invers&#233;e s&#8217;amplifie si l&#8217;on tient compte des diff&#233;rences dans l&#8217;acc&#232;s aux compl&#233;mentaires sant&#233;. La DREES a r&#233;alis&#233; en 2013 une estimation du taux d&#8217;effort des m&#233;nages apr&#232;s intervention des compl&#233;mentaires. Son travail montre que le taux d&#8217;effort des m&#233;nages (reste &#224; charge et primes d&#8217;assurance rapport&#233; au revenu) est divis&#233; par 2,5 pour les m&#233;nages les plus fortun&#233;s par diff&#233;rence avec les plus modestes&#160;: les seconds consacrent 5&#160;% de leurs revenus &#224; l&#8217;effort de sant&#233; contre 2&#160;% pour les premiers.</p><p style=\"text-align: justify;\">Ces constats trop peu assum&#233;s rendent insupportables aujourd&#8217;hui la hausse du forfait journalier hospitalier, une mesure cibl&#233;e de fait sur les plus vuln&#233;rables, les plus malades et les plus modestes.</p><p style=\"text-align: justify;\">Le pr&#233;sent amendement vise &#224; r&#233;former les modalit&#233;s de participation de l&#8217;assur&#233; dans un souci de justice sociale.</p><p style=\"text-align: justify;\">Le nouveau dispositif envisag&#233; sous le nom &#171;&#160;Couverture sanitaire plafond&#160;&#187; consiste &#224; substituer &#224; l&#8217;actuel syst&#232;me des affections longue dur&#233;e (prise en charge &#224; 100&#160;% pour les soins li&#233;s &#224; 30 pathologies chroniques) un dispositif universel de prise en charge &#224; 100&#160;% lorsque la d&#233;pense de sant&#233; support&#233;e par l&#8217;assur&#233; d&#233;passe un seuil d&#8217;effort. Ce seuil peut &#234;tre fix&#233; en valeur absolue ou en pourcentage du revenu. Dans leur rapport de 2007, R Briet et B Fragonard ont estim&#233; qu&#8217;un seuil &#224; 4,7&#160;% du revenu disponible des m&#233;nages &#233;tait de nature &#224; assurer une r&#233;forme &#224; co&#251;t nul. En valeur absolue, une r&#233;forme sans &#233;conomies implique de fixer le plafond &#224; 260&#160;&#8364; &#224; l&#8217;h&#244;pital et 540&#160;euros en ville, soit un plafond cumul&#233; (ville/h&#244;pital) de 800&#160;&#8364; par an.</p><p style=\"text-align: justify;\">Cette &#171;&#160;Couverture sanitaire plafond&#160;&#187; pr&#233;sente plusieurs int&#233;r&#234;ts.</p><p style=\"text-align: justify;\">Pour les assur&#233;s qui ne b&#233;n&#233;ficient pas du r&#233;gime des ALD et qui n&#8217;ont pas de compl&#233;mentaires sant&#233;,&#160;le dispositif offre un filet de protection sociale suppl&#233;mentaire. Il permet de corriger certains cas, certes rares mais graves, dans lesquels un &#233;pisode de soins met &#224; terre le budget d&#8217;un m&#233;nage. Ces &#171;&#160;trous dans la raquette&#160;&#187; de l&#8217;assurance maladie sont connus&#160;: un &#233;pisode hospitalier de longue dur&#233;e pour des actes peu co&#251;teux, une prise en charge en psychiatrie de plus de 10 jours notamment. Ils sont support&#233;s principalement par les m&#233;nages b&#233;n&#233;ficiaires de l&#8217;ASS, de l&#8217;AAH., que leurs revenus placent juste au-dessus du seuil de la CMU.</p><p style=\"text-align: justify;\">Pour tous les m&#233;nages, le dispositif permet une clarification bienvenue du march&#233; des compl&#233;mentaires sant&#233; et une baisse de leurs prix. Le recours &#224; la compl&#233;mentaire est aujourd&#8217;hui principalement dict&#233; par la peur du risque catastrophe, qui repr&#233;sente pourtant une tr&#232;s faible part de la couverture du risque par les compl&#233;mentaires (centr&#233; sur les d&#233;passements, l&#8217;optique et le dentaire). Une assurance contre ce risque catastrophe permet aux m&#233;nages de r&#233;aliser un arbitrage plus serein et plus rationnel dans le recours aux compl&#233;mentaires.</p><p style=\"text-align: justify;\">Le dispositif permet une simplification, devenue indispensable, des m&#233;canismes de reste &#224; charge. C&#8217;est particuli&#232;rement le cas &#224; l&#8217;h&#244;pital o&#249; l&#8217;articulation entre ticket mod&#233;rateur et forfait journalier est devenue incompr&#233;hensible et peut avoir des cons&#233;quences tr&#232;s lourdes pour les m&#233;nages.</p><p style=\"text-align: justify;\">Sans anticiper sur une &#233;ventuelle r&#233;forme d&#8217;envergure du dispositif des affections de longue dur&#233;e, le pr&#233;sent amendement permettra de faire na&#238;tre un dispositif nouveau protecteur des personnes les plus modestes et les plus malades.</p>"
  },
  "representations": [
    {
      "nom": "PDF",
      "typeMime": {
        "type": "application",
        "subType": "PDF"
      },
      "statutRepresentation": {
        "verbatim": true,
        "canonique": true,
        "officielle": true,
        "transcription": false,
        "enregistrement": false
      },
      "contenu": {
        "documentURI": "/15/amendements/0269/AN/903.pdf"
      }
    }
  ],
  "dateDepot": "2017-10-20T02:00:00.000+02:00",
  "article99": "0",
  "loiReference": {
    "codeLoi": "c sécurité sociale",
    "divisionCodeLoi": "L160-14 bis"
  }
}