{
  "uid": "AMANR5L15SEA717460BTC0971P0D1N2703",
  "identifiant": {
    "legislature": "15",
    "numero": "2703",
    "numRect": "0",
    "saisine": {
      "texteLegislatifRef": "PRJLANR5L15BTC0971",
      "numeroPartiePLF": "0",
      "organeExamen": "PO717460",
      "mentionSecondeDeliberation": "0"
    }
  },
  "numeroLong": "2703",
  "etapeTexte": "1ère lecture (1ère assemblée saisie)",
  "triAmendement": "bacl",
  "cardinaliteAmdtMultiples": "1",
  "etat": "Discuté",
  "signataires": {
    "auteur": {
      "typeAuteur": "Depute",
      "acteurRef": "PA405480",
      "groupePolitiqueRef": "PO730946"
    },
    "cosignatairesRefs": [
      "PA608695",
      "PA720988",
      "PA333818",
      "PA340357",
      "PA1008",
      "PA607553",
      "PA643145",
      "PA508",
      "PA332614",
      "PA267233",
      "PA609332",
      "PA609590",
      "PA342415",
      "PA405480",
      "PA337483",
      "PA588886",
      "PA719930",
      "PA605069",
      "PA335054",
      "PA333285",
      "PA340343",
      "PA608172",
      "PA608011",
      "PA642764",
      "PA1592",
      "PA610681",
      "PA1198",
      "PA429893",
      "PA1809",
      "PA335532"
    ],
    "texteAffichable": "M.&#160;Pupponi,  Mme&#160;Bareigts, Mme&#160;Bi&#233;mouret, M.&#160;Carvounas, Mme&#160;Karamanli, Mme&#160;Untermaier, M.&#160;Hutin, M.&#160;Letchimy, M.&#160;Aviragnet, Mme&#160;Battistel, M.&#160;Bouillon, M.&#160;Jean-Louis&#160;Bricout, M.&#160;Alain&#160;David, Mme&#160;Laurence&#160;Dumont, M.&#160;Faure, M.&#160;Garot, M.&#160;David&#160;Habib, M.&#160;Juanico, M.&#160;J&#233;r&#244;me&#160;Lambert, M.&#160;Le Foll, Mme&#160;Manin, Mme&#160;Pau-Langevin, Mme&#160;Pires Beaune, M.&#160;Potier, M.&#160;Pueyo, Mme&#160;Rabault, M.&#160;Saulignac, Mme&#160;Vainqueur-Christophe, M.&#160;Vallaud et Mme&#160;Victory"
  },
  "pointeurFragmentTexte": {
    "division": {
      "titre": "Article 34",
      "articleDesignationCourte": "ART. 34",
      "type": "ARTICLE",
      "avantAApres": "A",
      "divisionRattachee": "ARTICLE 34",
      "urlDivisionTexteVise": "/15/textes/0971.asp#D_Article_34"
    },
    "alinea": {
      "avantAApres": "A",
      "numero": "20",
      "alineaDesignation": "Alinéa 20"
    }
  },
  "corps": {
    "dispositif": "<p style=\"text-align: justify;\">Compl&#233;ter l&#8217;alin&#233;a&#160;20 par les mots&#160;:</p><p style=\"text-align: justify;\">&#171;&#160;, ainsi que l&#8217;adresse de la r&#233;sidence principale conserv&#233;e par le preneur.&#160;&#187;</p>",
    "exposeSommaire": "<p style=\"text-align: justify;\">Il s&#8217;agit aussi de rendre claire l&#8217;interpr&#233;tation de cet article&#160;25&#8209;13, et de le rendre conforme &#224; la lecture faite par le Conseil d&#8217;&#201;tat dans son avis.</p>"
  },
  "representations": [
    {
      "nom": "PDF",
      "typeMime": {
        "type": "application",
        "subType": "PDF"
      },
      "statutRepresentation": {
        "verbatim": true,
        "canonique": true,
        "officielle": true,
        "transcription": false,
        "enregistrement": false
      },
      "contenu": {
        "documentURI": "/15/amendements/0971/AN/2703.pdf"
      }
    }
  ],
  "seanceDiscussion": "RUANR5L15S2018IDS21128",
  "sort": {
    "dateSaisie": "2018-06-03T23:19:38.000+02:00",
    "sortEnSeance": "Rejeté"
  },
  "dateDepot": "2018-05-26T02:00:00.000+02:00",
  "dateDistribution": "2018-05-30T02:00:00.000+02:00",
  "article99": "0",
  "loiReference": {}
}