{
  "uid": "AMANR5L15PO420120B0904P0D1N1042",
  "identifiant": {
    "legislature": "15",
    "numero": "1042",
    "numRect": "0",
    "saisine": {
      "texteLegislatifRef": "PRJLANR5L15B0904",
      "numeroPartiePLF": "0",
      "organeExamen": "PO420120",
      "mentionSecondeDeliberation": "0"
    }
  },
  "numeroLong": "AS1042",
  "etapeTexte": "1ère lecture (1ère assemblée saisie)",
  "triAmendement": "hli",
  "cardinaliteAmdtMultiples": "1",
  "etat": "Discuté",
  "signataires": {
    "auteur": {
      "typeAuteur": "Depute",
      "acteurRef": "PA721434",
      "groupePolitiqueRef": "PO730964"
    },
    "cosignatairesRefs": [
      "PA719540",
      "PA719790",
      "PA721450",
      "PA721434"
    ],
    "texteAffichable": "Mme&#160;Lardet,  Mme&#160;Lenne, Mme&#160;Toutut-Picard et M.&#160;Chalumeau"
  },
  "pointeurFragmentTexte": {
    "division": {
      "titre": "Article 3",
      "articleDesignationCourte": "ART. 3",
      "type": "ARTICLE",
      "avantAApres": "A",
      "divisionRattachee": "ARTICLE 3",
      "urlDivisionTexteVise": "/15/textes/0904.asp#D_Article_3"
    },
    "alinea": {
      "avantAApres": "Apres",
      "numero": "7"
    }
  },
  "corps": {
    "dispositif": "<p style=\"text-align: justify;\">Apr&#232;s l&#8217;alin&#233;a&#160;7, ins&#233;rer l&#8217;alin&#233;a suivant&#160;:</p><p style=\"text-align: justify;\">&#171;&#160;Les op&#233;rateurs financ&#233;s par l&#8217;organisme mentionn&#233; &#224; l&#8217;article L.&#160;6123&#8209;5 ne doivent avoir aucun lien capitalistique ou juridique avec les organismes de formation ou de qualification vers lesquels ils orienteront les salari&#233;s&#160;qu&#8217;ils accompagnent dans le cadre du conseil en &#233;volution professionnelle.&#160;&#187;</p>",
    "exposeSommaire": "<p style=\"text-align: justify;\">Cet amendement a pour but d&#8217;&#233;viter tout conflit d&#8217;int&#233;r&#234;t en pr&#233;cisant par la loi l&#8217;ind&#233;pendance, tant juridique que capitalistique que devront avoir les op&#233;rateurs prochainement d&#233;sign&#233;s par France Comp&#233;tence (L.&#160;6123&#8209;5) pour assurer le CEP aux c&#244;t&#233;s des autres institutions et organismes d&#233;finis par la loi.</p>"
  },
  "representations": [
    {
      "nom": "PDF",
      "typeMime": {
        "type": "application",
        "subType": "PDF"
      },
      "statutRepresentation": {
        "verbatim": true,
        "canonique": true,
        "officielle": true,
        "transcription": false,
        "enregistrement": false
      },
      "contenu": {
        "documentURI": "/15/amendements/0904/CION-SOC/AS1042.pdf"
      }
    }
  ],
  "sort": {
    "dateSaisie": "2018-05-30T00:11:45.000+02:00",
    "sortEnSeance": "Retiré"
  },
  "dateDepot": "2018-05-25T02:00:00.000+02:00",
  "dateDistribution": "2018-05-26T02:00:00.000+02:00",
  "article99": "0",
  "loiReference": {}
}