{
  "uid": "AMANR5L15SEA717460BTC2401P0D1N676",
  "identifiant": {
    "legislature": "15",
    "numero": "676",
    "numRect": "0",
    "saisine": {
      "texteLegislatifRef": "PRJLANR5L15BTC2401",
      "numeroPartiePLF": "0",
      "organeExamen": "PO717460",
      "mentionSecondeDeliberation": "0"
    }
  },
  "numeroLong": "676",
  "etapeTexte": "1ère lecture (2ème assemblée saisie)",
  "triAmendement": "aaoaaaaaaaaaaaaaaaaaaaaaaaaaaaaaaaaaaaaaaaaaaaaaaaab",
  "cardinaliteAmdtMultiples": "1",
  "etat": "Discuté",
  "signataires": {
    "auteur": {
      "typeAuteur": "Depute",
      "acteurRef": "PA719608",
      "groupePolitiqueRef": "PO723569"
    },
    "cosignatairesRefs": [
      "PA719608",
      "PA721932"
    ],
    "texteAffichable": "Mme&#160;M&#233;nard et Mme&#160;Lorho"
  },
  "pointeurFragmentTexte": {
    "division": {
      "titre": "Article PREMIER",
      "articleDesignationCourte": "ART. PREMIER",
      "type": "ARTICLE",
      "avantAApres": "A",
      "divisionRattachee": "ARTICLE PREMIER",
      "urlDivisionTexteVise": "/15/textes/2401.asp#D_Article_1er"
    },
    "alinea": {
      "avantAApres": "Avant",
      "numero": "1",
      "alineaDesignation": "Avant l'alinéa 1"
    }
  },
  "corps": {
    "dispositif": "<p>Avant l&#8217;alin&#233;a&#160;1, ins&#233;rer les deux alin&#233;as suivants&#160;:</p><p style=\"text-align: justify;\">&#171;&#160;I A.&#160;&#8211;&#160;L'article L.&#160;5211&#8209;9 du code g&#233;n&#233;ral des collectivit&#233;s territoriales est compl&#233;t&#233; par un alin&#233;a ainsi r&#233;dig&#233;&#160;:</p><p style=\"text-align: justify;\">&#171;&#160;Ne peut &#234;tre candidat &#224; la pr&#233;sidence d&#8217;un &#233;tablissement public de coop&#233;ration intercommunale &#224; fiscalit&#233; propre un conseiller communautaire battu lors du scrutin municipal pr&#233;c&#233;dant ladite &#233;lection&#160;&#187;.</p>",
    "exposeSommaire": "<p>Il n'est pas souhaitable que des conseillers municipaux battus aux municipales et donc dans l'opposition, puissent se pr&#233;senter &#224; la pr&#233;sidence d'un &#233;tablissement public de coop&#233;ration intercommunale.</p>"
  },
  "representations": [
    {
      "nom": "PDF",
      "typeMime": {
        "type": "application",
        "subType": "PDF"
      },
      "statutRepresentation": {
        "verbatim": true,
        "canonique": true,
        "officielle": true,
        "transcription": false,
        "enregistrement": false
      },
      "contenu": {
        "documentURI": "/15/amendements/2401/AN/676.pdf"
      }
    }
  ],
  "seanceDiscussion": "RUANR5L15S2020IDS21946",
  "sort": {
    "dateSaisie": "2019-11-18T18:23:19.000+01:00",
    "sortEnSeance": "Rejeté"
  },
  "dateDepot": "2019-11-14T01:00:00.000+01:00",
  "dateDistribution": "2019-11-17T01:00:00.000+01:00",
  "article99": "0",
  "loiReference": {}
}