{
  "uid": "AMANR5L15SEA717460BTC0990P0D1N129",
  "identifiant": {
    "legislature": "15",
    "numero": "129",
    "numRect": "0",
    "saisine": {
      "texteLegislatifRef": "PIONANR5L15BTC0990",
      "numeroPartiePLF": "0",
      "organeExamen": "PO717460",
      "mentionSecondeDeliberation": "0"
    }
  },
  "numeroLong": "129",
  "etapeTexte": "1ère lecture (1ère assemblée saisie)",
  "triAmendement": "gli",
  "cardinaliteAmdtMultiples": "1",
  "etat": "Discuté",
  "signataires": {
    "auteur": {
      "typeAuteur": "Depute",
      "acteurRef": "PA721226",
      "groupePolitiqueRef": "PO730958"
    },
    "cosignatairesRefs": [
      "PA722142",
      "PA718860",
      "PA588884",
      "PA720422",
      "PA720892",
      "PA721062",
      "PA719578",
      "PA721210",
      "PA720286",
      "PA721226",
      "PA721960",
      "PA721202",
      "PA720846",
      "PA719676",
      "PA718868",
      "PA2150",
      "PA720430"
    ],
    "texteAffichable": "Mme&#160;Rubin,  Mme&#160;Autain, M.&#160;Bernalicis, M.&#160;Coquerel, M.&#160;Corbi&#232;re, Mme&#160;Fiat, M.&#160;Lachaud, M.&#160;Larive, M.&#160;M&#233;lenchon, Mme&#160;Obono, Mme&#160;Panot, M.&#160;Prud&apos;homme, M.&#160;Quatennens, M.&#160;Ratenon, Mme&#160;Ressiguier, M.&#160;Ruffin et Mme&#160;Taurine"
  },
  "pointeurFragmentTexte": {
    "division": {
      "titre": "Article 9 septies",
      "articleDesignationCourte": "APRÈS ART. 9 SEPTIES",
      "type": "ARTICLE",
      "avantAApres": "Apres",
      "divisionRattachee": "APRÈS L'ARTICLE 9 SEPTIES, insérer la division et l'intitulé suivants:",
      "chapitreAdditionnel": "1",
      "urlDivisionTexteVise": "/15/textes/0990.asp#D_Article_9_septies"
    }
  },
  "corps": {
    "dispositif": "<p style=\"text-align: justify;\">Titre XX : De nouveaux droits pour les journalistes afin de lutter efficacement contre les fausses informations</p><p style=\"text-align: justify;\">Article XX</p><p style=\"text-align: justify;\">Au d&#233;but du chapitre III du titre I<sup>er</sup> du livre I<sup>er</sup> de la septi&#232;me partie du code du travail, il est ajout&#233; un article L.&#160;7113&#160;A ainsi r&#233;dig&#233;&#160;:</p><p style=\"text-align: justify;\">&#171;&#160;<i>Art.&#160;L.&#160;7113&#8209;1 A</i>. &#8211; I. &#8211; L&#8217;&#233;cart entre la r&#233;mun&#233;ration annuelle la plus haute et la r&#233;mun&#233;ration annuelle la plus basse d&#8217;une entreprise de presse, en incluant la communication au public en ligne, la communication audiovisuelle ou une ou plusieurs agences de presse, au sens de l&#8217;article&#160;2 de la loi du 29&#160;juillet 1881 sur la libert&#233; de la presse, ne peut d&#233;passer un coefficient de&#160;1 &#224; 20. Un d&#233;cret en Conseil d&#8217;&#201;tat fixe les conditions d&#8217;application du pr&#233;sent&#160;I, notamment les modalit&#233;s de prise en compte des journalistes pigistes.</p><p style=\"text-align: justify;\">II.&#160;&#8211;&#160;Les r&#233;mun&#233;rations mentionn&#233;es au I comprennent les salaires et assimil&#233;s, indemnit&#233;s, primes et gratification.</p><p style=\"text-align: justify;\">III.&#160;&#8211;&#160;Les entreprises et agences de presse mentionn&#233;es au I dont le coefficient entre la r&#233;mun&#233;ration annuelle la plus haute et la r&#233;mun&#233;ration annuelle la plus basse exc&#232;de le coefficient mentionn&#233; au m&#234;me&#160;I disposent d&#8217;un d&#233;lai de douze mois &#224; compter de la promulgation de la pr&#233;sente loi pour s&#8217;y conformer.&#160;&#187;</p>",
    "exposeSommaire": "<p style=\"text-align: justify;\">Par cet amendement, nous proposons de soutenir la qualit&#233; et le pluralisme du travail journalistique, en luttant contre la pr&#233;carit&#233; &#233;conomique et sociale de la profession de journaliste, ce en luttant contre les in&#233;galit&#233;s salariales au sein des m&#233;dias (presse, radio, t&#233;l&#233;vision, etc) en limitant l&#8217;&#233;cart entre les r&#233;mun&#233;rations de 1 &#224; 20.</p><p style=\"text-align: justify;\">Cet amendement s&#8217;inscrit dans la lign&#233;e de celui qui avait &#233;t&#233; d&#233;pos&#233; sur la loi de &#171;&#160;moralisation de la vie publique&#160;&#187; (http&#160;://www.assemblee-nationale.fr/15/amendements/0106/AN/195.asp) et qui concernait toutes les entreprises de mani&#232;re g&#233;n&#233;rale (en conformit&#233; avec notre programme l&#8217;Avenir en Commun https&#160;://laec.fr/section/29/instaurer-un-salaire-maximum-autorise-pour-les-dirigeants-d-entreprise).</p><p style=\"text-align: justify;\">En effet, si de nombreux organismes concern&#233;s (entreprises de presse, de communication au public en ligne, de communication audiovisuelle, agences de presse) peuvent ne pas conna&#238;tre des diff&#233;rences de r&#233;mun&#233;rations aussi importantes (selon le dernier rapport d&#8217;OXFAM il &#233;tait question d&#8217;une in&#233;galit&#233; de plus de 119 fois la moyenne des salari&#233;s pour les entreprises du CAC 40 en 2016 https&#160;://reporterre.net/Une-inegalite-toujours-plus-grande-au-sein-des-grandes-entreprises-selon-Oxfam), des diff&#233;rences de r&#233;mun&#233;ration interpellent, au sein des entreprise de presse, de communication au public en ligne, de communication audiovisuelle ou une ou plusieurs agences de presse, au sens de l&#8217;article&#160;2 de la loi du 29 juillet 1881 sur la libert&#233; de la presse.</p><p style=\"text-align: justify;\">La notion de r&#233;mun&#233;ration implique n&#233;cessairement les salaires et assimil&#233;s, indemnit&#233;s, primes et gratification. En effet, beaucoup d&#8217;in&#233;galit&#233;s salariales peuvent intervenir par l&#8217;octroi de primes pour des montants excessifs, et doivent donc n&#233;cessairement &#234;tre prises en compte.</p><p style=\"text-align: justify;\">Certains salaires semblent incompr&#233;hensibles&#160;: 230&#160;000&#160;euros annuels pour Laurent Delahousse, pr&#233;sentateur de journaux t&#233;l&#233;vis&#233;s &#224; France 2 (http&#160;://www.programme.tv/news/actu/174079-decouvrez-le-salaire-impressionnant-de-laurent-delahousse-sur-france-televisions/).</p><p style=\"text-align: justify;\">De m&#234;me, le journal Le Point &#233;voquait en 2017 de 15&#160;000 &#224; 45&#160;000&#160;euros par mois pour la pr&#233;sentation de journaux t&#233;l&#233;vis&#233;s (http&#160;://www.lepoint.fr/medias/salaire-des-stars-de-la-tele-le-grand-deballage-04&#8209;01&#8209;2017&#8209;2094464_260.php). En l&#8217;absence de transparence, difficile de savoir s&#8217;il s&#8217;agit par ailleurs des seuls salaires ou des salaires auxquels sont adjoints des primes et autres gratifications.</p><p style=\"text-align: justify;\">Ainsi, mettre en place une limitation des r&#233;mun&#233;rations au sein de ces m&#234;mes entreprises (entreprises de presse, de communication au public en ligne, de communication audiovisuelle ou une ou plusieurs agences de presse) permettra de lutter contre les in&#233;galit&#233;s salariales et la situation pr&#233;caire que peuvent subir ind&#251;ment de nombreux et nombreuses journalistes.</p>"
  },
  "representations": [
    {
      "nom": "PDF",
      "typeMime": {
        "type": "application",
        "subType": "PDF"
      },
      "statutRepresentation": {
        "verbatim": true,
        "canonique": true,
        "officielle": true,
        "transcription": false,
        "enregistrement": false
      },
      "contenu": {
        "documentURI": "/15/amendements/0990/AN/129.pdf"
      }
    }
  ],
  "seanceDiscussion": "RUANR5L15S2018IDS21152",
  "sort": {
    "dateSaisie": "2018-07-04T00:01:36.000+02:00",
    "sortEnSeance": "Rejeté"
  },
  "dateDepot": "2018-06-04T02:00:00.000+02:00",
  "dateDistribution": "2018-06-06T02:00:00.000+02:00",
  "article99": "0",
  "loiReference": {}
}