{
  "uid": "AMANR5L15PO59048B1255P1D1N730",
  "identifiant": {
    "legislature": "15",
    "numero": "730",
    "numRect": "0",
    "saisine": {
      "texteLegislatifRef": "PRJLANR5L15B1255",
      "numeroPartiePLF": "1",
      "organeExamen": "PO59048",
      "mentionSecondeDeliberation": "0"
    }
  },
  "numeroLong": "I-CF730",
  "etapeTexte": "1ère lecture (1ère assemblée saisie)",
  "triAmendement": "efaaaaaaaaaaaaaaaaaaaaaaaaaaaaaaaaaaaaaaaaaaaaaaaafzt",
  "cardinaliteAmdtMultiples": "1",
  "etat": "Discuté",
  "signataires": {
    "auteur": {
      "typeAuteur": "Depute",
      "acteurRef": "PA607595",
      "groupePolitiqueRef": "PO730964"
    },
    "cosignatairesRefs": [
      "PA720298",
      "PA719412",
      "PA607155",
      "PA721542",
      "PA607595"
    ],
    "texteAffichable": "M.&#160;Pellois,  Mme&#160;Verdier-Jouclas, Mme&#160;Cariou, Mme&#160;Le Feur et M.&#160;Daniel"
  },
  "pointeurFragmentTexte": {
    "division": {
      "titre": "Article 18",
      "articleDesignationCourte": "APRÈS ART. 18",
      "type": "ARTICLE",
      "avantAApres": "Apres",
      "divisionRattachee": "APRÈS L'ARTICLE 18, insérer l'article suivant:",
      "articleAdditionnel": "1",
      "urlDivisionTexteVise": "/15/textes/1255A.asp#D_Article_18"
    }
  },
  "corps": {
    "dispositif": "<p>I.&#160;&#8211;&#160;L&#8217;article 72 B bis du code g&#233;n&#233;ral des imp&#244;ts est ainsi r&#233;tabli&#160;:</p><p>&#171;&#160;Art. 72&#160;B&#160;bis.&#160;&#8211;&#160;I. Les exploitants agricoles soumis au r&#233;gime r&#233;el normal d&#8217;imposition peuvent, sur option, comptabiliser leurs stocks de produits ou d&#8217;animaux jusqu&#8217;&#224; la vente de ces biens &#224; la valeur d&#233;termin&#233;e &#224; la cl&#244;ture de l'exercice pr&#233;c&#233;dant celui au titre duquel l&#8217;option est exerc&#233;e.</p><p>&#171;&#160;II. L&#8217;option pr&#233;vue au I est formul&#233;e au plus tard dans le d&#233;lai de d&#233;claration des r&#233;sultats du premier exercice auquel elle s&#8217;applique. Elle est valable pour l&#8217;ann&#233;e au titre de laquelle elle est exerc&#233;e et pour les quatre ann&#233;es suivantes. Elle est reconduite tacitement par p&#233;riode de cinq ans, sauf renonciation adress&#233;e au service des imp&#244;ts dans le d&#233;lai de d&#233;p&#244;t de d&#233;claration des r&#233;sultats du dernier exercice de chaque p&#233;riode d&#8217;option.</p><p>&#171;&#160;Cette option est exclusive de l&#8217;option pr&#233;vue aux articles 75-0 A et 75-0 B.</p><p>&#171;&#160;III. Le b&#233;n&#233;fice du I est subordonn&#233; au respect du r&#232;glement (UE) n&#176; 1408/2013 de la Commission du 18 d&#233;cembre 2013 relatif &#224; l'application des articles 107 et 108 du trait&#233; sur le fonctionnement de l'Union europ&#233;enne aux aides de&#160;minimis dans le secteur de l'agriculture.&#160;&#187;.</p><p>II.&#160;-&#160;Le I s&#8217;applique aux exercices ouverts &#224; compter du 1er janvier 2019.</p><p>III.&#8211;La perte de recettes pour l&#8217;&#201;tat est compens&#233;e &#224; due concurrence par la cr&#233;ation d&#8217;une taxe additionnelle aux droits mentionn&#233;s aux articles 575 et 575 A du code g&#233;n&#233;ral des imp&#244;ts.</p>",
    "exposeSommaire": "<p style=\"margin: 6.0pt 0cm 6.0pt 0cm;\">Le pr&#233;sent amendement propose de r&#233;tablir un dispositif optionnel de blocage de la valeur des stocks &#224; rotation lente.</p><p style=\"margin: 6.0pt 0cm 6.0pt 0cm;\">Pour tenir compte des al&#233;as -notamment climatiques- auxquels sont confront&#233;s les exploitants agricoles, la loi fiscale pr&#233;voit des m&#233;canismes optionnels qui ont pour objet de r&#233;partir l&#8217;assiette imposable d&#8217;une ann&#233;e sur plusieurs exercices afin de limiter les effets de la progressivit&#233; de l&#8217;imp&#244;t sur le revenu&#160;:</p><p style=\"margin: 6.0pt 0cm 6.0pt 0cm;\">- le r&#233;gime de la moyenne triennale permet de d&#233;terminer le r&#233;sultat imposable au titre d&#8217;une ann&#233;e en retenant la moyenne des b&#233;n&#233;fices de l&#8217;ann&#233;e d&#8217;imposition et des deux ann&#233;es pr&#233;c&#233;dentes (article 75-0 B du code g&#233;n&#233;ral des imp&#244;ts - CGI).</p><p style=\"margin: 6.0pt 0cm 6.0pt 0cm;\">- lorsqu&#8217;un b&#233;n&#233;fice exc&#233;dant 25&#160;000 &#8364; repr&#233;sente plus d&#8217;une fois et demie la moyenne des r&#233;sultats des trois exercices pr&#233;c&#233;dents, la fraction exc&#233;dentaire est consid&#233;r&#233;e comme un revenu exceptionnel qui peut &#234;tre &#233;tal&#233;e, par part &#233;gales, sur sept exercices (article 75-0 A du CGI).</p><p style=\"margin: 6.0pt 0cm 6.0pt 0cm;\">Or, les entreprises industrielles, commerciales, artisanales et agricoles relevant d&#8217;un r&#233;gime r&#233;el d&#8217;imposition doivent proc&#233;der &#224; une &#233;valuation de leurs stocks &#224; la cl&#244;ture de chaque exercice, les droits comptable et fiscal prescrivant aux entreprises une valorisation annuelle de leur actif circulant, qui constitue un &#233;l&#233;ment de leur patrimoine. Les exploitants agricoles soumis &#224; un r&#233;gime r&#233;el d&#8217;imposition peuvent, pour &#233;valuer leurs stocks, retenir le cours du jour et lui appliquer une d&#233;cote qui correspond au b&#233;n&#233;fice brut de leur future vente.</p><p style=\"margin: 6.0pt 0cm 6.0pt 0cm;\">Pour autant, le patrimoine de certaines exploitations agricoles se caract&#233;rise par des stocks au cycle parfois tr&#232;s long, comme les bovins, les p&#233;pini&#232;res, les vins ou les spiritueux dont la r&#233;vision annuelle du prix de revient peut conduire &#224; des variations de stocks augmentant significativement le r&#233;sultat imposable, sans pour autant pouvoir b&#233;n&#233;ficier du r&#233;gime d&#8217;&#233;talement et de lissage des revenus agricoles exceptionnels pr&#233;vu par l&#8217;article 75-0 A du CGI.</p><p style=\"margin: 6.0pt 0cm 6.0pt 0cm;\">Par ailleurs, les exploitants disposant de stocks &#224; rotation lente sont particuli&#232;rement affect&#233;s par la suppression de la d&#233;duction pour investissement (DPI), pr&#233;vue dans le pr&#233;sent projet de loi, dans la mesure o&#249; elle est principalement destin&#233;e &#224; l&#8217;acquisition et &#224; la production de stocks de produits ou d&#8217;animaux dont le cycle de rotation est sup&#233;rieur &#224; un an.</p><p style=\"margin: 6.0pt 0cm 6.0pt 0cm;\">Ils pourront certes b&#233;n&#233;ficier de la nouvelle d&#233;duction pour &#233;pargne de pr&#233;caution, qui permet d&#8217;affecter une quote-part de l&#8217;&#233;pargne aux co&#251;ts d&#8217;acquisition et de production de ces stocks, mais, pour r&#233;pondre plus sp&#233;cifiquement aux difficult&#233;s li&#233;es &#224; la valorisation des stocks &#224; rotation lente, il est &#233;galement propos&#233; de mettre en place un dispositif <i>ad hoc</i> de blocage de la valeur des stocks. En pratique, la mesure ne produit d&#8217;effet qu&#8217;&#224; l&#8217;&#233;gard de stocks dont le cycle de rotation est au moins &#233;gal &#224; deux ans et permet, pour les exercices suivant celui du blocage, de ne pas prendre en compte dans la valorisation des stocks les charges de production.</p><p style=\"margin: 6.0pt 0cm 6.0pt 0cm;\">Ce m&#233;canisme sera optionnel. L&#8217;option sera exclusive de celle pr&#233;vue pour les b&#233;n&#233;fices des r&#233;gimes de la moyenne triennale et du revenu exceptionnel, pr&#233;vus aux articles 75-0 A et<br /> 75-0&#160;B du CGI, qui permette d&#233;j&#224; de lisser les revenus agricoles.</p><p style=\"margin: 6.0pt 0cm 6.0pt 0cm;\">Enfin, cette mesure est plac&#233;e sous le r&#232;glement relatif aux aides <i>de minimis </i>dans le secteur agricole.</p>"
  },
  "representations": [
    {
      "nom": "PDF",
      "typeMime": {
        "type": "application",
        "subType": "PDF"
      },
      "statutRepresentation": {
        "verbatim": true,
        "canonique": true,
        "officielle": true,
        "transcription": false,
        "enregistrement": false
      },
      "contenu": {
        "documentURI": "/15/amendements/1255A/CION_FIN/CF730.pdf"
      }
    }
  ],
  "sort": {
    "dateSaisie": "2018-10-10T23:34:24.000+02:00",
    "sortEnSeance": "Adopté"
  },
  "dateDepot": "2018-10-05T02:00:00.000+02:00",
  "dateDistribution": "2018-10-09T02:00:00.000+02:00",
  "article99": "0",
  "loiReference": {
    "codeLoi": "impôts",
    "divisionCodeLoi": "72 B bis"
  }
}