{
  "uid": "AMANR5L15PO419610B2274P0D1N104",
  "identifiant": {
    "legislature": "15",
    "numero": "104",
    "numRect": "0",
    "saisine": {
      "texteLegislatifRef": "PRJLANR5L15B2274",
      "numeroPartiePLF": "0",
      "organeExamen": "PO419610",
      "mentionSecondeDeliberation": "0"
    }
  },
  "numeroLong": "CE104",
  "etapeTexte": "1ère lecture (2ème assemblée saisie)",
  "triAmendement": "ipaaaaaaaaaaaaaaaaaaaaaaaaaaaaaaaaaaaaaaaaaaaaaaaae",
  "cardinaliteAmdtMultiples": "1",
  "etat": "Discuté",
  "signataires": {
    "auteur": {
      "typeAuteur": "Depute",
      "acteurRef": "PA267429",
      "groupePolitiqueRef": "PO730934"
    },
    "cosignatairesRefs": [
      "PA267429"
    ],
    "texteAffichable": "M.&#160;Cinieri"
  },
  "pointeurFragmentTexte": {
    "division": {
      "titre": "Article 10",
      "articleDesignationCourte": "ART. 10",
      "type": "ARTICLE",
      "avantAApres": "A",
      "divisionRattachee": "ARTICLE 10",
      "urlDivisionTexteVise": "/15/textes/2274.asp#D_Article_10"
    },
    "alinea": {
      "numero": "10"
    }
  },
  "corps": {
    "dispositif": "<p style=\"text-align: justify;\">&#192; la premi&#232;re phrase de l&#8217;alin&#233;a&#160;10, substituer &#224; l&#8217;ann&#233;e&#160;:</p><p style=\"text-align: justify;\">&#171;&#160;2021&#160;&#187;,</p><p style=\"text-align: justify;\">l&#8217;ann&#233;e&#160;:</p><p style=\"text-align: justify;\">&#171;&#160;2025&#160;&#187;.</p>",
    "exposeSommaire": "<p style=\"text-align: justify;\">Cet amendement vise &#224; laisser plus de temps aux industriels pour assurer une transition sans que des emplois soient menac&#233;s.</p>"
  },
  "representations": [
    {
      "nom": "PDF",
      "typeMime": {
        "type": "application",
        "subType": "PDF"
      },
      "statutRepresentation": {
        "verbatim": true,
        "canonique": true,
        "officielle": true,
        "transcription": false,
        "enregistrement": false
      },
      "contenu": {
        "documentURI": "/15/amendements/2274/CION-ECO/CE104.pdf"
      }
    }
  ],
  "sort": {
    "dateSaisie": "2019-11-20T00:14:43.000+01:00",
    "sortEnSeance": "Rejeté"
  },
  "dateDepot": "2019-11-14T01:00:00.000+01:00",
  "dateDistribution": "2019-11-19T01:00:00.000+01:00",
  "article99": "0",
  "loiReference": {}
}