{
  "uid": "AMANR5L15SEA717460B0235P2D1N363",
  "identifiant": {
    "legislature": "15",
    "numero": "363",
    "numRect": "0",
    "saisine": {
      "texteLegislatifRef": "PRJLANR5L15B0235",
      "numeroPartiePLF": "2",
      "organeExamen": "PO717460",
      "mentionSecondeDeliberation": "0"
    }
  },
  "numeroLong": "II-363",
  "etapeTexte": "1ère lecture (1ère assemblée saisie)",
  "triAmendement": "bhpw",
  "cardinaliteAmdtMultiples": "1",
  "etat": "Discuté",
  "signataires": {
    "auteur": {
      "typeAuteur": "Depute",
      "acteurRef": "PA405480",
      "groupePolitiqueRef": "PO730946"
    },
    "cosignatairesRefs": [
      "PA608172",
      "PA719930",
      "PA342415",
      "PA1809",
      "PA405480",
      "PA1008",
      "PA340343",
      "PA333818",
      "PA605069",
      "PA330357",
      "PA609332",
      "PA335054",
      "PA610681",
      "PA642764",
      "PA337483",
      "PA720988",
      "PA508",
      "PA643145",
      "PA588886",
      "PA608695",
      "PA608011",
      "PA1592",
      "PA609590",
      "PA335532",
      "PA335999",
      "PA429893",
      "PA267233",
      "PA1198",
      "PA333285",
      "PA332614",
      "PA607553"
    ],
    "texteAffichable": "M.&#160;Pupponi,  Mme&#160;Rabault, Mme&#160;Pires Beaune, M.&#160;Jean-Louis&#160;Bricout, M.&#160;Aviragnet, Mme&#160;Bareigts, Mme&#160;Batho, Mme&#160;Battistel, Mme&#160;Bi&#233;mouret, M.&#160;Bouillon, M.&#160;Carvounas, M.&#160;Alain&#160;David, Mme&#160;Laurence&#160;Dumont, M.&#160;Dussopt, M.&#160;Faure, M.&#160;Garot, M.&#160;David&#160;Habib, M.&#160;Hutin, M.&#160;Juanico, Mme&#160;Karamanli, M.&#160;J&#233;r&#244;me&#160;Lambert, M.&#160;Le Foll, M.&#160;Letchimy, Mme&#160;Manin, Mme&#160;Pau-Langevin, M.&#160;Potier, M.&#160;Pueyo, M.&#160;Saulignac, Mme&#160;Untermaier, Mme&#160;Vainqueur-Christophe et M.&#160;Vallaud"
  },
  "pointeurFragmentTexte": {
    "missionVisee": {
      "idMissionAN": "7",
      "libelleMission": "Cohésion des territoires",
      "codeMissionPLF": "B",
      "libelleMissionPLF": "Répartition, par mission et programme, des crédits du budget général"
    },
    "division": {
      "titre": "Article 52",
      "articleDesignationCourte": "APRÈS ART. 52",
      "type": "ARTICLE",
      "avantAApres": "Apres",
      "divisionRattachee": "APRÈS L'ARTICLE 52, insérer l'article suivant:",
      "articleAdditionnel": "1",
      "urlDivisionTexteVise": "/15/textes/0235C.asp#D_Article_52"
    }
  },
  "corps": {
    "dispositif": "<p style=\"text-align: justify;\">&#192; la fin du premier alin&#233;a de l&#8217;article&#160;9&#8209;2 de la loi n&#176; 2003&#8209;710 du 1<sup>er</sup> ao&#251;t 2003 d&#8217;orientation et de programmation pour la ville et la r&#233;novation urbaine, le montant&#160;: &#171;&#160;6&#160;milliards d&#8217;euros&#160;&#187; est remplac&#233; par les mots&#160;: &#171;&#160;10 milliards d&#8217;euros, dont 1 milliard d&#8217;euros provient de subventions de l&#8217;&#201;tat&#160;&#187;.</p>",
    "exposeSommaire": "<p style=\"text-align: justify;\">Le pr&#233;sent amendement vise &#224; traduire l&#8217;engagement du Pr&#233;sident de la R&#233;publique de porter l&#8217;enveloppe du Nouveau programme national de renouvellement urbain (NPNRU) &#224; 10 milliards d&#8217;euros. Cet engagement a &#233;t&#233; r&#233;affirm&#233; par le gouvernement devant la repr&#233;sentation nationale et confirm&#233; dans les documents budg&#233;taires se rapportant &#224; la mission &#171;&#160;Coh&#233;sion des territoires&#160;&#187;.</p><p style=\"text-align: justify;\">Il s&#8217;agit d&#8217;une excellente mesure qui permettra d&#8217;assurer un financement de l&#8217;ANRU au niveau des besoins des projets pr&#233;vus dans le programme, &#224; condition que les cr&#233;dits budg&#233;taires n&#233;cessaires soient bien inscrits au sein du programme 147. Seuls 15M&#8364; de cr&#233;dits sont &#224; ce stade pr&#233;vus au PLF 2018 pour l&#8217;ANRU.</p>"
  },
  "representations": [
    {
      "nom": "PDF",
      "typeMime": {
        "type": "application",
        "subType": "PDF"
      },
      "statutRepresentation": {
        "verbatim": true,
        "canonique": true,
        "officielle": true,
        "transcription": false,
        "enregistrement": false
      },
      "contenu": {
        "documentURI": "/15/amendements/0235C/AN/363.pdf"
      }
    }
  ],
  "seanceDiscussion": "RUANR5L15S2018IDS20733",
  "sort": {
    "dateSaisie": "2017-11-03T11:21:35.000+01:00",
    "sortEnSeance": "Adopté"
  },
  "dateDepot": "2017-10-27T02:00:00.000+02:00",
  "dateDistribution": "2017-10-31T01:00:00.000+01:00",
  "article99": "0",
  "loiReference": {}
}