{
  "uid": "AMANR5L15PO59048B1255P1D1N1391",
  "identifiant": {
    "legislature": "15",
    "numero": "1391",
    "numRect": "0",
    "saisine": {
      "texteLegislatifRef": "PRJLANR5L15B1255",
      "numeroPartiePLF": "1",
      "organeExamen": "PO59048",
      "mentionSecondeDeliberation": "0"
    }
  },
  "numeroLong": "I-CF1391",
  "etapeTexte": "1ère lecture (1ère assemblée saisie)",
  "triAmendement": "bgaaaaaaaaaaaaaaaaaaaaaaaaaaaaaaaaaaaaaaaaaaaaaaaarw",
  "cardinaliteAmdtMultiples": "1",
  "etat": "Discuté",
  "signataires": {
    "auteur": {
      "typeAuteur": "Depute",
      "acteurRef": "PA722398",
      "groupePolitiqueRef": "PO730964"
    },
    "cosignatairesRefs": [
      "PA722398"
    ],
    "texteAffichable": "M.&#160;Rebeyrotte"
  },
  "pointeurFragmentTexte": {
    "division": {
      "titre": "Article 7",
      "articleDesignationCourte": "ART. 7",
      "type": "ARTICLE",
      "avantAApres": "A",
      "divisionRattachee": "ARTICLE 7",
      "urlDivisionTexteVise": "/15/textes/1255A.asp#D_Article_7"
    },
    "alinea": {
      "numero": "14"
    }
  },
  "corps": {
    "dispositif": "<p style=\"text-align: justify;\">I. &#8211; A l&#8217;alin&#233;a&#160;14, remplacer les mots &#171;&#160;au titre des trois premi&#232;res ann&#233;es au cours desquelles est mise en &#339;uvre la part incitative mentionn&#233;e au I de l&#8217;article&#160;1522 bis.&#160;&#187; par les mots&#160;: &#171;&#160;lorsque est mise en &#339;uvre la part incitative mentionn&#233;e au I de l&#8217;article&#160;1522 bis.&#160;&#187;</p><p style=\"text-align: justify;\">II. La perte de recettes pour l&#8217;&#201;tat est compens&#233;e, &#224; due concurrence, par la cr&#233;ation d&#8217;une taxe additionnelle aux droits pr&#233;vus aux articles 575 et 575 A du code g&#233;n&#233;ral des imp&#244;ts.</p>",
    "exposeSommaire": "<p style=\"text-align: justify;\">Le gouvernement, suite &#224; la Feuille de route &#233;conomie circulaire, entend r&#233;duire les frais de gestion de la taxe d&#8217;enl&#232;vement des ordures m&#233;nag&#232;res de 8&#160;% &#224; 3&#160;% en cas de mise en place de la tarification incitative et cela durant les trois premi&#232;res ann&#233;es.</p><p style=\"text-align: justify;\">Cette limitation dans le temps r&#233;duit consid&#233;rablement son caract&#232;re incitatif, alors que l&#8217;objectif est bien d&#8217;amener plus de collectivit&#233;s &#224; adopter ce mode de tarification contribuant &#224; la r&#233;duction des d&#233;chets, (aujourd&#8217;hui seulement 10 collectivit&#233;s sont en TEOMI).</p><p style=\"text-align: justify;\">Aussi, le pr&#233;sent amendement propose de supprimer la r&#233;f&#233;rence &#224; la limite d&#8217;application dans le temps de cette r&#233;duction des frais, qui pour rappel sont &#224; 3&#160;% pour les autres taxes (notamment taxe fonci&#232;re sur les propri&#233;t&#233;s b&#226;ties).</p>"
  },
  "representations": [
    {
      "nom": "PDF",
      "typeMime": {
        "type": "application",
        "subType": "PDF"
      },
      "statutRepresentation": {
        "verbatim": true,
        "canonique": true,
        "officielle": true,
        "transcription": false,
        "enregistrement": false
      },
      "contenu": {
        "documentURI": "/15/amendements/1255A/CION_FIN/CF1391.pdf"
      }
    }
  ],
  "sort": {
    "dateSaisie": "2018-10-10T09:27:06.000+02:00",
    "sortEnSeance": "Non soutenu"
  },
  "dateDepot": "2018-10-05T02:00:00.000+02:00",
  "dateDistribution": "2018-10-08T02:00:00.000+02:00",
  "article99": "0",
  "loiReference": {}
}