{
  "uid": "AMANR5L15PO766718B2187P0D1N2151",
  "identifiant": {
    "legislature": "15",
    "numero": "2151",
    "numRect": "0",
    "saisine": {
      "texteLegislatifRef": "PRJLANR5L15B2187",
      "numeroPartiePLF": "0",
      "organeExamen": "PO766718",
      "mentionSecondeDeliberation": "0"
    }
  },
  "numeroLong": "2151",
  "etapeTexte": "1ère lecture (1ère assemblée saisie)",
  "triAmendement": "bkaaaaaaaaaaaaaaaaaaaaaaaaaaaaaaaaaaaaaaaaaaaaaaaabo",
  "cardinaliteAmdtMultiples": "1",
  "etat": "Retiré",
  "signataires": {
    "auteur": {
      "typeAuteur": "Depute",
      "acteurRef": "PA340343",
      "groupePolitiqueRef": "PO758835"
    },
    "cosignatairesRefs": [
      "PA340343"
    ],
    "texteAffichable": "M.&#160;Saulignac, rapporteur"
  },
  "pointeurFragmentTexte": {
    "division": {
      "titre": "Article 8",
      "articleDesignationCourte": "ART. 8",
      "type": "ARTICLE",
      "avantAApres": "A",
      "divisionRattachee": "ARTICLE 8",
      "urlDivisionTexteVise": "/15/textes/2187.asp#D_Article_8"
    },
    "alinea": {
      "numero": "2"
    }
  },
  "corps": {
    "dispositif": "<p style=\"text-align: justify;\">&#192; l&#8217;alin&#233;a&#160;2, apr&#232;s la derni&#232;re occurrence du mot&#160;:</p><p style=\"text-align: justify;\">&#171;&#160;personne&#160;&#187;</p><p style=\"text-align: justify;\">ins&#233;rer le mot&#160;:</p><p style=\"text-align: justify;\">&#171;&#160;d&#233;c&#233;d&#233;e&#160;&#187;.</p>",
    "exposeSommaire": "<p>Amendement r&#233;dactionnel.</p>"
  },
  "representations": [
    {
      "nom": "PDF",
      "typeMime": {
        "type": "application",
        "subType": "PDF"
      },
      "statutRepresentation": {
        "verbatim": true,
        "canonique": true,
        "officielle": true,
        "transcription": false,
        "enregistrement": false
      },
      "contenu": {
        "documentURI": "/15/amendements/2187/CSBIOETH/2151.pdf"
      }
    }
  ],
  "dateDepot": "2019-09-08T02:00:00.000+02:00",
  "dateDistribution": "2019-09-10T02:00:00.000+02:00",
  "article99": "0",
  "loiReference": {}
}