{
  "uid": "AMANR5L15SEA717460BTC1974P0D1N1119",
  "identifiant": {
    "legislature": "15",
    "numero": "1119",
    "numRect": "0",
    "saisine": {
      "texteLegislatifRef": "PRJLANR5L15BTC1974",
      "numeroPartiePLF": "0",
      "organeExamen": "PO717460",
      "mentionSecondeDeliberation": "0"
    }
  },
  "numeroLong": "1119",
  "etapeTexte": "1ère lecture (2ème assemblée saisie)",
  "triAmendement": "hiaaaoaaaaaaaaaaaaaaaaaaaaaaaaaaaaaaaaaaaaaaaaaaaahzzzzzzzzzzzzzzzzzzzzzzzzzzzzzzzzzzzzzzzzzzzzzzzzzzzzzzzzzzzzzzzzzzzzzzzzzzzzzzzzzzzzzzzzzzyw",
  "cardinaliteAmdtMultiples": "1",
  "etat": "Discuté",
  "signataires": {
    "auteur": {
      "typeAuteur": "Depute",
      "acteurRef": "PA719952",
      "groupePolitiqueRef": "PO730964"
    },
    "cosignatairesRefs": [
      "PA719952",
      "PA722000",
      "PA720790"
    ],
    "texteAffichable": "M.&#160;Mis,  M.&#160;Grau et M.&#160;Buchou"
  },
  "pointeurFragmentTexte": {
    "division": {
      "titre": "RAPPORT ANNEXÉ",
      "articleDesignationCourte": "ART. 1ER A",
      "type": "ANNEXE",
      "avantAApres": "A",
      "divisionRattachee": "ARTICLE 1ER A",
      "urlDivisionTexteVise": "/15/textes/1974.asp#D_RAPPORT_ANNEXE"
    },
    "alinea": {
      "avantAApres": "A",
      "numero": "80",
      "alineaDesignation": "Alinéa 80"
    }
  },
  "corps": {
    "dispositif": "<p>&#192; la premi&#232;re phrase de l&#8217;alin&#233;a&#160;80, apr&#232;s le nombre&#160;:</p><p style=\"text-align: justify;\">&#171;&#160;2,&#160;&#187;,</p><p style=\"text-align: justify;\">ins&#233;rer les mots&#160;:</p><p style=\"text-align: justify;\">&#171;&#160;en rempla&#231;ant les am&#233;nagements alternatifs &#224; l&#8217;A45 mentionn&#233;s au tableau 6 du rapport du Conseil d'orientation des infrastructures du 1<sup>er</sup> f&#233;vrier 2018 par la r&#233;alisation de l&#8217;autoroute A45 entre Saint-Etienne et Lyon,&#160;&#187;.</p>",
    "exposeSommaire": "<p>L&#8217;objectif de cet amendement est d&#8217;&#233;tablir une liaison autorouti&#232;re entre Saint-Etienne et Lyon, projet d&#233;clar&#233; d&#8217;utilit&#233; publique par d&#233;cret du 16 juillet 2008 et qui n&#8217;a jamais &#233;t&#233; remis en cause depuis trente ans.</p><p style=\"text-align: justify;\">L&#8217;int&#233;r&#234;t du projet a &#233;t&#233; reconnu par le comit&#233; interminist&#233;riel d&#8217;am&#233;nagement et de d&#233;veloppement du territoire (CIADT) d&#232;s 2003 et encore tr&#232;s r&#233;cemment par l&#8217;autorit&#233; de r&#233;gulation des activit&#233;s ferroviaires et routi&#232;res (ARAFER) en 2016 et par le Conseil d&#8217;&#201;tat en juin 2017.</p><p style=\"text-align: justify;\">L&#8217;A45 est un &#233;quipement structurant n&#233;cessaire non seulement pour le d&#233;veloppement de l&#8217;&#233;conomie de la m&#233;tropole st&#233;phanoise et des d&#233;partements de la Loire et de la Haute Loire mais aussi pour l&#8217;&#233;conomie nationale car il constitue le dernier tron&#231;on indispensable &#224; l&#8217;axe strat&#233;gique Lyon-Toulouse.</p><p style=\"text-align: justify;\">Cet amendement vise par cons&#233;quent &#224; mentionner explicitement le projet A45 entre Saint-&#201;tienne et Lyon, dont le contrat de concession est pr&#234;t, parmi les grands projets d&#8217;infrastructures rentrant dans le champ de la programmation des investissements pr&#233;vus &#224; l&#8217;article&#160;44.</p>"
  },
  "representations": [
    {
      "nom": "PDF",
      "typeMime": {
        "type": "application",
        "subType": "PDF"
      },
      "statutRepresentation": {
        "verbatim": true,
        "canonique": true,
        "officielle": true,
        "transcription": false,
        "enregistrement": false
      },
      "contenu": {
        "documentURI": "/15/amendements/1974/AN/1119.pdf"
      }
    }
  ],
  "seanceDiscussion": "RUANR5L15S2019IDS21700",
  "sort": {
    "dateSaisie": "2019-06-13T22:56:31.000+02:00",
    "sortEnSeance": "Retiré"
  },
  "dateDepot": "2019-05-28T02:00:00.000+02:00",
  "dateDistribution": "2019-06-05T02:00:00.000+02:00",
  "article99": "0",
  "loiReference": {}
}