{
  "uid": "AMANR5L15PO419610B0155P0D1N26",
  "identifiant": {
    "legislature": "15",
    "numero": "26",
    "numRect": "0",
    "saisine": {
      "texteLegislatifRef": "PRJLANR5L15B0155",
      "numeroPartiePLF": "0",
      "organeExamen": "PO419610",
      "mentionSecondeDeliberation": "0"
    }
  },
  "numeroLong": "CE26",
  "etapeTexte": "1ère lecture (1ère assemblée saisie)",
  "triAmendement": "hzzzo",
  "cardinaliteAmdtMultiples": "1",
  "etat": "Discuté",
  "signataires": {
    "auteur": {
      "typeAuteur": "Depute",
      "acteurRef": "PA342415",
      "groupePolitiqueRef": "PO730946"
    },
    "cosignatairesRefs": [
      "PA342415"
    ],
    "texteAffichable": "Mme&#160;Battistel"
  },
  "pointeurFragmentTexte": {
    "division": {
      "titre": "Article 4",
      "articleDesignationCourte": "ART. 4",
      "type": "ARTICLE",
      "avantAApres": "A",
      "divisionRattachee": "ARTICLE 4",
      "urlDivisionTexteVise": "/15/textes/0155.asp#D_Article_4"
    },
    "alinea": {
      "avantAApres": "Apres",
      "numero": "7"
    }
  },
  "corps": {
    "dispositif": "<p style=\"text-align: justify;\">Apr&#232;s l&#8217;alin&#233;a&#160;7, ins&#233;rer le paragraphe suivant&#160;:</p><p style=\"text-align: justify;\">&#171;&#160;I&#160;<i>bis</i>.&#160;&#8211;&#160;Les capacit&#233;s de stockage souterrain de gaz naturel consid&#233;r&#233;es comme n&#233;cessaires &#224; la s&#233;curit&#233; d&#8217;approvisionnement en gaz et au bon fonctionnement du r&#233;seau gazier, mentionn&#233;es au troisi&#232;me alin&#233;a du I du pr&#233;sent article, sont pr&#233;vues par la programmation pluriannuelle de l&#8217;&#233;nergie mentionn&#233;e &#224; l&#8217;article L.&#160;141&#8209;1 du code de l&#8217;&#233;nergie avec un d&#233;lai d&#8217;application de 5 ans.</p><p style=\"text-align: justify;\">&#171;&#160;Elles correspondent, pour la premi&#232;re p&#233;riode de la premi&#232;re programmation pluriannuelle de l&#8217;&#233;nergie, aux capacit&#233;s vis&#233;es &#224; l&#8217;article&#160;9 du d&#233;cret n&#176; 2016&#8209;1442 du 27&#160;octobre&#160;2016.</p><p style=\"text-align: justify;\">&#171;&#160;Les r&#232;gles d&#233;finies par l&#8217;ordonnance pr&#233;vue au I du pr&#233;sent article et applicables aux infrastructures de stockage de gaz retenues lors de la premi&#232;re p&#233;riode de la premi&#232;re programmation pluriannuelle de l&#8217;&#233;nergie s&#8217;appliquent &#224; ces m&#234;mes installations jusqu&#8217;&#224; la fin de la deuxi&#232;me p&#233;riode de cette premi&#232;re programmation pluriannuelle de l&#8217;&#233;nergie.&#160;&#187;</p>",
    "exposeSommaire": "<p style=\"text-align: justify;\">L&#8217;article&#160;4 autorise le Gouvernement &#224; l&#233;gif&#233;rer par ordonnance pour prendre des dispositions concernant la s&#233;curit&#233; d&#8217;approvisionnement en gaz naturel des consommateurs fran&#231;ais, et en particulier la mise en place d&#8217;une r&#233;gulation des infrastructures de stockages souterrains de gaz permettant de mieux garantir la disponibilit&#233; du gaz en hiver, tout en ma&#238;trisant le co&#251;t de cette s&#233;curit&#233; pour les consommateurs.</p><p style=\"text-align: justify;\">Les capacit&#233;s de stockage souterrain de gaz naturel consid&#233;r&#233;es comme n&#233;cessaires &#224; la s&#233;curit&#233; d&#8217;approvisionnement en gaz et au bon fonctionnement du r&#233;seau gazier sont fix&#233;es par la Programmation Pluriannuelle de l&#8217;Energie (PPE), pr&#233;vue par l&#8217;article L.&#160;141&#8209;1 du code de l&#8217;&#233;nergie.</p><p style=\"text-align: justify;\">La premi&#232;re PPE a &#233;t&#233; &#233;tablie fin 2016 pour une premi&#232;re p&#233;riode de 2 ans avec la liste de l&#8217;ensemble des infrastructures de stockage de gaz en France. Le parc de stockage a en effet &#233;t&#233; construit comme un ensemble int&#233;gr&#233; au bon fonctionnement du march&#233; gazier, au b&#233;n&#233;fice des consommateurs finals. Ce choix historique a notamment permis de diminuer les investissements dans les infrastructures d&#8217;importation et d&#8217;assurer efficacement la continuit&#233; de fourniture de gaz des consommateurs lors des pointes de froid hivernale.</p><p style=\"text-align: justify;\">L&#8217;article L.&#160;141&#8209;3 du code de l&#8217;&#233;nergie pr&#233;voit la prochaine r&#233;vision de la PPE pour la fin d&#8217;ann&#233;e 2018. Si, comme cela est pr&#233;vu par les pouvoirs publics, la r&#233;forme r&#233;gulant le stockage intervient en d&#233;but d&#8217;ann&#233;e 2018, quelques mois seulement s&#233;pareront donc la mise en place de cette r&#233;forme, de la r&#233;vision de cette programmation.</p><p style=\"text-align: justify;\">Il appara&#238;t donc n&#233;cessaire que la loi assure une visibilit&#233; sur le p&#233;rim&#232;tre du parc de stockage r&#233;gul&#233; pour une premi&#232;re p&#233;riode plus longue que ces quelques mois, avant de se recaler sur les rythmes quinquennaux des PPE. Il en va de la pr&#233;servation des emplois et des actifs de stockage, qui n&#233;cessitent une gestion sur le long terme et qui ont &#233;t&#233; d&#233;velopp&#233;s au service de la s&#233;curit&#233; nationale d&#8217;approvisionnement en &#233;nergie.</p><p style=\"text-align: justify;\">Par ailleurs, en cas de r&#233;duction du parc de stockage par une future PPE un d&#233;lai de 5 ans est n&#233;cessaire pour prendre en compte les impacts majeurs d&#8217;un tel ajustement sur l&#8217;outil industriel (fermeture de sites, transfert des personnels).</p>"
  },
  "representations": [
    {
      "nom": "PDF",
      "typeMime": {
        "type": "application",
        "subType": "PDF"
      },
      "statutRepresentation": {
        "verbatim": true,
        "canonique": true,
        "officielle": true,
        "transcription": false,
        "enregistrement": false
      },
      "contenu": {
        "documentURI": "/15/amendements/0155/CION-ECO/CE26.pdf"
      }
    }
  ],
  "sort": {
    "dateSaisie": "2017-09-25T17:28:29.000+02:00",
    "sortEnSeance": "Retiré"
  },
  "dateDepot": "2017-09-21T02:00:00.000+02:00",
  "dateDistribution": "2017-09-23T02:00:00.000+02:00",
  "article99": "0",
  "loiReference": {}
}