{
  "uid": "AMANR5L15SEA717460B1297P0D1N1096",
  "identifiant": {
    "legislature": "15",
    "numero": "1096",
    "numRect": "0",
    "saisine": {
      "texteLegislatifRef": "PRJLANR5L15B1297",
      "numeroPartiePLF": "0",
      "organeExamen": "PO717460",
      "mentionSecondeDeliberation": "0"
    }
  },
  "numeroLong": "1096",
  "etapeTexte": "1ère lecture (1ère assemblée saisie)",
  "triAmendement": "klaaaaaaaaaaaaaaaaaaaaaaaaaaaaaaaaaaaaaaaaaaaaaaaaieu",
  "cardinaliteAmdtMultiples": "1",
  "etat": "Discuté",
  "signataires": {
    "auteur": {
      "typeAuteur": "Depute",
      "acteurRef": "PA720924",
      "groupePolitiqueRef": "PO730970"
    },
    "cosignatairesRefs": [
      "PA720002",
      "PA720652",
      "PA717151",
      "PA721984",
      "PA719640",
      "PA721924",
      "PA721608",
      "PA719504",
      "PA719488",
      "PA722374",
      "PA721836",
      "PA721742",
      "PA720764",
      "PA720178",
      "PA721734",
      "PA721234",
      "PA721976",
      "PA721530",
      "PA718978",
      "PA720968",
      "PA720704",
      "PA720772",
      "PA720092",
      "PA720334",
      "PA721182",
      "PA720162",
      "PA720746",
      "PA719558",
      "PA722284",
      "PA721418",
      "PA719266",
      "PA719044",
      "PA720256",
      "PA720924",
      "PA722162",
      "PA720720",
      "PA720976",
      "PA719918",
      "PA720728",
      "PA719874",
      "PA720326",
      "PA721992",
      "PA720598",
      "PA719210",
      "PA1276"
    ],
    "texteAffichable": "Mme&#160;Elimas,  Mme&#160;Benin, Mme&#160;de Vaucouleurs, M.&#160;Hammouche, M.&#160;Isaac-Sibille, M.&#160;Mignola, M.&#160;Balanant, Mme&#160;Bannier, M.&#160;Barrot, M.&#160;Berta, M.&#160;Bolo, M.&#160;Bourlanges, M.&#160;Bru, M.&#160;Cubertafon, Mme&#160;de Sarnez, Mme&#160;Deprez-Audebert, M.&#160;Duverg&#233;, Mme&#160;El Ha&#239;ry, Mme&#160;Essayan, M.&#160;Fanget, Mme&#160;Florennes, M.&#160;Fuchs, Mme&#160;Gallerneau, M.&#160;Garcia, Mme&#160;Jacquier-Laforge, M.&#160;Joncour, M.&#160;Lagleize, M.&#160;Lain&#233;, M.&#160;Laqhila, Mme&#160;Lasserre-David, M.&#160;Latombe, Mme&#160;Luquet, M.&#160;Mathiasin, M.&#160;Mattei, Mme&#160;Mette, M.&#160;Michel-Kleisbauer, M.&#160;Millienne, M.&#160;Pahun, M.&#160;Fr&#233;d&#233;ric&#160;Petit, Mme&#160;Maud&#160;Petit, Mme&#160;Poueyto, M.&#160;Ramos, M.&#160;Turquois, Mme&#160;Vichnievsky et M.&#160;Waserman"
  },
  "pointeurFragmentTexte": {
    "division": {
      "titre": "Article 46",
      "articleDesignationCourte": "APRÈS ART. 46",
      "type": "ARTICLE",
      "avantAApres": "Apres",
      "divisionRattachee": "APRÈS L'ARTICLE 46, insérer l'article suivant:",
      "articleAdditionnel": "1",
      "urlDivisionTexteVise": "/15/textes/1297.asp#D_Article_46"
    }
  },
  "corps": {
    "dispositif": "<p style=\"text-align: justify;\">Le deuxi&#232;me alin&#233;a de l&#8217;article L.&#160;531&#8209;2 du code de la s&#233;curit&#233; sociale est compl&#233;t&#233; par une phrase ainsi r&#233;dig&#233;e&#160;: &#171;&#160;La moiti&#233; du montant de cette prime est vers&#233;e, au plus tard, deux mois avant la naissance de l&#8217;enfant.&#160;&#187;</p>",
    "exposeSommaire": "<p style=\"text-align: justify;\">Cet amendement de repli vise &#224; ce que la moiti&#233; du montant de la prime &#224; la naissance soit vers&#233;e avant la naissance de l&#8217;enfant. Il s&#8217;agit d&#8217;une solution alternative au versement int&#233;gral de cette prime en amont de la naissance.&#160;</p><p style=\"text-align: justify;\">Le d&#233;cret&#160;n&#176; 2014&#8209;1714 du 30 d&#233;cembre 2014 dispose que la prime doit &#234;tre vers&#233;e aux familles avant la fin du dernier jour du second mois civil suivant la naissance ou la justification de la fin de la grossesse. Toutefois, cette disposition appara&#238;t totalement incoh&#233;rente vis-&#224;-vis des investissements financiers effectu&#233;s par les familles pour pr&#233;parer l&#8217;arriv&#233;e de l&#8217;enfant, plusieurs mois &#224; l&#8217;avance.&#160;</p><p style=\"text-align: justify;\">La pr&#233;paration d&#8217;une naissance doit s&#8217;effectuer dans une totale s&#233;r&#233;nit&#233; mat&#233;rielle notamment pour les familles les plus modestes (qui sont les premi&#232;res impact&#233;es par le versement diff&#233;r&#233; de cette prime).&#160;</p><p style=\"text-align: justify;\">Ainsi, dans la perspective de b&#226;tir une politique familiale juste et coh&#233;rente, cet amendement trouve un v&#233;ritable compromis entre les arguments budg&#233;taires oppos&#233;s par le Gouvernement et les attentes de nos concitoyens.&#160;</p>"
  },
  "representations": [
    {
      "nom": "PDF",
      "typeMime": {
        "type": "application",
        "subType": "PDF"
      },
      "statutRepresentation": {
        "verbatim": true,
        "canonique": true,
        "officielle": true,
        "transcription": false,
        "enregistrement": false
      },
      "contenu": {
        "documentURI": "/15/amendements/1297/AN/1096.pdf"
      }
    }
  ],
  "seanceDiscussion": "RUANR5L15S2019IDS21295",
  "sort": {
    "dateSaisie": "2018-10-27T01:36:24.000+02:00",
    "sortEnSeance": "Rejeté"
  },
  "dateDepot": "2018-10-19T02:00:00.000+02:00",
  "dateDistribution": "2018-10-23T02:00:00.000+02:00",
  "article99": "0",
  "loiReference": {
    "codeLoi": "c sécurité sociale",
    "divisionCodeLoi": "L531-2"
  }
}