{
  "uid": "AMANR5L15SEA717460BTC0902P0D1N699",
  "identifiant": {
    "legislature": "15",
    "numero": "699",
    "numRect": "0",
    "saisine": {
      "texteLegislatifRef": "PRJLANR5L15BTC0902",
      "numeroPartiePLF": "0",
      "organeExamen": "PO717460",
      "mentionSecondeDeliberation": "0"
    }
  },
  "numeroLong": "699",
  "etapeTexte": "1ère lecture (1ère assemblée saisie)",
  "triAmendement": "bbi",
  "cardinaliteAmdtMultiples": "1",
  "etat": "Discuté",
  "signataires": {
    "auteur": {
      "typeAuteur": "Depute",
      "acteurRef": "PA718876",
      "groupePolitiqueRef": "PO730964"
    },
    "cosignatairesRefs": [
      "PA718876"
    ],
    "texteAffichable": "M.&#160;Besson-Moreau"
  },
  "pointeurFragmentTexte": {
    "division": {
      "titre": "Article 5 quater",
      "articleDesignationCourte": "ART. 5 QUATER",
      "type": "ARTICLE",
      "avantAApres": "A",
      "divisionRattachee": "ARTICLE 5 QUATER",
      "urlDivisionTexteVise": "/15/textes/0902.asp#D_Article_5_quater"
    },
    "alinea": {
      "avantAApres": "A",
      "numero": "4",
      "alineaDesignation": "Alinéa 4"
    }
  },
  "corps": {
    "dispositif": "<p style=\"text-align: justify;\">&#192; l&#8217;alin&#233;a&#160;4, substituer aux mots&#160;:</p><p style=\"text-align: justify;\">&#171;&#160;veille &#224; &#233;laborer et &#224; diffuser&#160;&#187;</p><p style=\"text-align: justify;\">les mots&#160;:</p><p style=\"text-align: justify;\">&#171;&#160;&#233;labore et diffuse&#160;&#187;.</p>",
    "exposeSommaire": "<p style=\"text-align: justify;\">Les indicateurs utilis&#233;s dans les contrats doivent &#234;tre neutres et indiscutables. Pour cela, il est essentiel qu&#8217;ils proviennent des organisations interprofessionnelles, lieu d&#8217;&#233;change et de consensus entre les diff&#233;rents maillons des fili&#232;res. Cet article pr&#233;voit qu&#8217;&#224; d&#233;faut d&#8217;indicateurs rendus disponibles par les interprofessions, l&#8217;Observatoire des prix et des marges &#233;labore et diffuse des indicateurs.&#160;</p><p style=\"text-align: justify;\">Le pr&#233;sent amendement vise &#224; &#234;tre plus contraignant sur le r&#244;le de l&#8217;observatoire.</p>"
  },
  "representations": [
    {
      "nom": "PDF",
      "typeMime": {
        "type": "application",
        "subType": "PDF"
      },
      "statutRepresentation": {
        "verbatim": true,
        "canonique": true,
        "officielle": true,
        "transcription": false,
        "enregistrement": false
      },
      "contenu": {
        "documentURI": "/15/amendements/0902/AN/699.pdf"
      }
    }
  ],
  "seanceDiscussion": "RUANR5L15S2018IDS21053",
  "sort": {
    "dateSaisie": "2018-05-24T22:42:37.000+02:00",
    "sortEnSeance": "Tombé"
  },
  "dateDepot": "2018-05-15T02:00:00.000+02:00",
  "dateDistribution": "2018-05-21T02:00:00.000+02:00",
  "article99": "0",
  "loiReference": {}
}