{
  "uid": "AMANR5L15SEA717460B0269P0D1N713",
  "identifiant": {
    "legislature": "15",
    "numero": "713",
    "numRect": "0",
    "saisine": {
      "texteLegislatifRef": "PRJLANR5L15B0269",
      "numeroPartiePLF": "0",
      "organeExamen": "PO717460",
      "mentionSecondeDeliberation": "0"
    }
  },
  "numeroLong": "713",
  "etapeTexte": "1ère lecture (1ère assemblée saisie)",
  "triAmendement": "i",
  "cardinaliteAmdtMultiples": "1",
  "etat": "Discuté",
  "signataires": {
    "auteur": {
      "typeAuteur": "Depute",
      "acteurRef": "PA719072",
      "groupePolitiqueRef": "PO730964"
    },
    "cosignatairesRefs": [
      "PA722086",
      "PA331835",
      "PA722022",
      "PA719570",
      "PA718910",
      "PA718706",
      "PA719072",
      "PA718744",
      "PA719350",
      "PA722062",
      "PA719512",
      "PA721336",
      "PA722126",
      "PA719186",
      "PA719842",
      "PA718694",
      "PA720046",
      "PA720738",
      "PA722268",
      "PA722102",
      "PA720500",
      "PA720916",
      "PA720952",
      "PA718810",
      "PA717379",
      "PA720074",
      "PA606171",
      "PA720932",
      "PA719980",
      "PA334768",
      "PA720170",
      "PA720512",
      "PA720362",
      "PA721246",
      "PA719540",
      "PA721710",
      "PA720480",
      "PA719756"
    ],
    "texteAffichable": "M.&#160;Mesnier,  M.&#160;Borowczyk, M.&#160;Tach&#233;, Mme&#160;Bagarry, M.&#160;Belhaddad, Mme&#160;Brocard, M.&#160;Chiche, Mme&#160;Cloarec, M.&#160;Da Silva, M.&#160;Marc&#160;Delatte, Mme&#160;Dufeu Schubert, Mme&#160;Fabre, Mme&#160;Fontaine-Domeizel, Mme&#160;Gaillot, Mme&#160;Grandjean, Mme&#160;Granjus, Mme&#160;Iborra, Mme&#160;Janvier, Mme&#160;Khattabi, M.&#160;Laabid, Mme&#160;Lazaar, Mme&#160;Lecocq, M.&#160;Maillard, M.&#160;Michels, Mme&#160;Val&#233;rie&#160;Petit, Mme&#160;Peyron, M.&#160;Pietraszewski, Mme&#160;Pitollat, Mme&#160;Mireille&#160;Robert, Mme&#160;Romeiro Dias, Mme&#160;Tamarelle-Verhaeghe, M.&#160;Taquet, M.&#160;Touraine, Mme&#160;Toutut-Picard, Mme&#160;Vidal, Mme&#160;Vignon, Mme&#160;Wonner, M.&#160;Ferrand et les membres du groupe La R&#233;publique en Marche"
  },
  "pointeurFragmentTexte": {
    "division": {
      "titre": "Article 32",
      "articleDesignationCourte": "APRÈS ART. 32",
      "type": "ARTICLE",
      "avantAApres": "Apres",
      "divisionRattachee": "APRÈS L'ARTICLE 32, insérer l'article suivant:",
      "articleAdditionnel": "1",
      "urlDivisionTexteVise": "/15/textes/0269.asp#D_Article_32"
    }
  },
  "corps": {
    "dispositif": "<p style=\"text-align: justify;\">I.&#160;&#8211;&#160;Les articles L.&#160;376&#8209;1 et L.&#160;454&#8209;1 du code de la s&#233;curit&#233; sociale sont compl&#233;t&#233;s par un alin&#233;a ainsi r&#233;dig&#233;&#160;:</p><p style=\"text-align: justify;\">&#171;&#160;Pour l&#8217;ex&#233;cution des recours subrogatoires pr&#233;vus au pr&#233;sent article, les cr&#233;ances d&#233;tenues par l&#8217;organisme qui a vers&#233; les prestations sont c&#233;d&#233;es d&#233;finitivement &#224; l&#8217;organisme charg&#233; de cette mission en application des dispositions du 3&#176; de l&#8217;article L.&#160;221&#8209;3&#8209;1.&#160;&#187;</p><p style=\"text-align: justify;\">II.&#160;&#8211;&#160;La gestion et le versement des prestations mentionn&#233;es aux articles L.&#160;437&#8209;1, L.&#160;413&#8209;6, L.&#160;413&#8209;10 et L.&#160;413&#8209;11&#8209;2 du code de la s&#233;curit&#233; sociale ainsi qu&#8217;&#224; l&#8217;article L.&#160;753&#8209;1 du code rural et de la p&#234;che maritime peuvent, hormis celles &#224; la charge de l&#8217;&#201;tat employeur, &#234;tre d&#233;l&#233;gu&#233;s &#224; l&#8217;organisme d&#233;sign&#233; par voie de convention par la caisse mentionn&#233;e &#224; l&#8217;article L.&#160;221&#8209;1 du code de la s&#233;curit&#233; sociale ou par la caisse mentionn&#233;e &#224; l&#8217;article L.&#160;723&#8209;11 du code rural et de la p&#234;che maritime, chacune en ce qui la concerne&#160;&#187;.</p>",
    "exposeSommaire": "<p style=\"text-align: justify;\">Au sein des branches maladie et accidents du travail et maladies professionnelles du r&#233;gime g&#233;n&#233;ral, l&#8217;activit&#233; de recours contre tiers est confi&#233;e &#224; certaines caisses &#171;&#160;pivots&#160;&#187; qui en assurent la gestion mutualis&#233;e pour le compte du r&#233;seau. Des p&#244;les r&#233;gionaux ont ainsi &#233;t&#233; d&#233;sign&#233;s et g&#232;rent pour d&#8217;autres caisses cette activit&#233;.</p><p style=\"text-align: justify;\">Afin de simplifier les proc&#233;dures et de rendre plus efficiente la gestion de ces recours, il est n&#233;cessaire que les caisses &#171;&#160;pivots&#160;&#187; qui effectuent les op&#233;rations de r&#233;cup&#233;ration des sommes vers&#233;es par d&#8217;autres caisses puissent en conserver le produit, sans avoir &#224; proc&#233;der ensuite au remboursement des sommes en cause aux caisses qui les ont initialement vers&#233;es.</p><p style=\"text-align: justify;\">La mesure consiste donc &#224; &#233;tablir une cession des cr&#233;ances au titre des recours contre tiers de la caisse qui a vers&#233; les prestations &#224; la caisse gestionnaire de ces recours.</p><p style=\"text-align: justify;\">Par ailleurs, la mesure vise &#224; tirer les cons&#233;quences de la suppression, &#224; compter du 1<sup>er</sup> janvier 2018, du Fonds commun des accidents du travail (FCAT) en vertu de l&#8217;article&#160;34 de la loi de financement de la s&#233;curit&#233; sociale pour 2017, en pr&#233;cisant les organismes qui versent les prestations couvertes par ce fonds.</p>"
  },
  "representations": [
    {
      "nom": "PDF",
      "typeMime": {
        "type": "application",
        "subType": "PDF"
      },
      "statutRepresentation": {
        "verbatim": true,
        "canonique": true,
        "officielle": true,
        "transcription": false,
        "enregistrement": false
      },
      "contenu": {
        "documentURI": "/15/amendements/0269/AN/713.pdf"
      }
    }
  ],
  "seanceDiscussion": "RUANR5L15S2018IDS20714",
  "sort": {
    "dateSaisie": "2017-10-27T17:19:45.000+02:00",
    "sortEnSeance": "Adopté"
  },
  "dateDepot": "2017-10-20T02:00:00.000+02:00",
  "dateDistribution": "2017-10-23T02:00:00.000+02:00",
  "article99": "0",
  "loiReference": {}
}