{
  "uid": "AMANR5L15PO59051B0911P0D1N532",
  "identifiant": {
    "legislature": "15",
    "numero": "532",
    "numRect": "0",
    "saisine": {
      "texteLegislatifRef": "PRJLANR5L15B0911",
      "numeroPartiePLF": "0",
      "organeExamen": "PO59051",
      "mentionSecondeDeliberation": "0"
    }
  },
  "numeroLong": "CL532",
  "etapeTexte": "1ère lecture (1ère assemblée saisie)",
  "triAmendement": "dwoo",
  "cardinaliteAmdtMultiples": "1",
  "etat": "Discuté",
  "signataires": {
    "auteur": {
      "typeAuteur": "Depute",
      "acteurRef": "PA942",
      "groupePolitiqueRef": "PO744425"
    },
    "cosignatairesRefs": [
      "PA267780",
      "PA610775",
      "PA695100",
      "PA721486",
      "PA720696",
      "PA719806",
      "PA268019",
      "PA333421",
      "PA1960",
      "PA721094",
      "PA942",
      "PA712014",
      "PA722030",
      "PA332228",
      "PA267042",
      "PA267585",
      "PA721110",
      "PA267766",
      "PA266788",
      "PA642868",
      "PA267241",
      "PA267355",
      "PA331567",
      "PA720230",
      "PA642935",
      "PA702052",
      "PA267330"
    ],
    "texteAffichable": "M.&#160;Charles&#160;de Courson,  M.&#160;Lagarde, Mme&#160;Auconie, M.&#160;Becht, M.&#160;Benoit, M.&#160;Bournazel, M.&#160;Guy&#160;Bricout, M.&#160;Christophe, Mme&#160;de La Raudi&#232;re, M.&#160;Demilly, Mme&#160;Descamps, M.&#160;Dunoyer, M.&#160;Favennec Becot, Mme&#160;Firmin Le Bodo, M.&#160;Gom&#232;s, M.&#160;Meyer&#160;Habib, M.&#160;Herth, M.&#160;Ledoux, M.&#160;Leroy, Mme&#160;Magnier, M.&#160;Morel-&#192;-L&apos;Huissier, M.&#160;Naegelen, M.&#160;Pancher, Mme&#160;Sage, Mme&#160;Sanquer, M.&#160;Vercamer et M.&#160;Zumkeller"
  },
  "pointeurFragmentTexte": {
    "division": {
      "titre": "Article 2",
      "articleDesignationCourte": "ART. 2",
      "type": "ARTICLE",
      "avantAApres": "A",
      "divisionRattachee": "ARTICLE 2",
      "urlDivisionTexteVise": "/15/textes/0911.asp#D_Article_2"
    },
    "alinea": {
      "avantAApres": "Avant",
      "numero": "1",
      "alineaDesignation": "Avant l'alinéa 1"
    }
  },
  "corps": {
    "dispositif": "<p style=\"text-align: justify;\">I.&#160;&#8211;&#160;Avant l&#8217;alin&#233;a&#160;1, ins&#233;rer les deux alin&#233;as suivants&#160;:</p><p style=\"text-align: justify;\">&#171;&#160;L&#8217;article&#160;34 de la Constitution est ainsi modifi&#233;&#160;:</p><p style=\"text-align: justify;\">&#171;&#160;1&#176;&#160;Au cinqui&#232;me alin&#233;a, apr&#232;s le mot&#160;: &#171;&#160;natures&#160;&#187;, sont ins&#233;r&#233;s les mots&#160;: &#171;&#160;qui ne disposent que pour l&#8217;avenir sauf en cas d&#8217;un motif d&#8217;int&#233;r&#234;t g&#233;n&#233;ral suffisant&#160;&#187;.</p><p style=\"text-align: justify;\">II.&#160;&#8211;&#160;En cons&#233;quence, r&#233;diger ainsi le d&#233;but de l&#8217;alin&#233;a&#160;1&#160;:</p><p style=\"text-align: justify;\">&#171;&#160;2&#176;&#160;Au quinzi&#232;me alin&#233;a, apr&#232;s...&#160;(<i>le reste sans changement</i>).&#160;&#187;</p>",
    "exposeSommaire": "<p style=\"text-align: justify;\">Face &#224; l&#8217;incertitude du droit fiscal, notamment en mati&#232;re de produits d&#8217;&#233;pargne, il convient de prot&#233;ger, au nom du respect du droit de propri&#233;t&#233;, les &#233;pargnants en donnant la possibilit&#233; au Parlement de lier un r&#233;gime fiscal sp&#233;cifique &#224; un produit d&#8217;&#233;pargne pour toute la dur&#233;e de sa vie.En effet l&#8217;article&#160;17 de la D&#233;claration des droits de l&#8217;Homme et du citoyen de 1789 consacre le droit de propri&#233;t&#233; comme un &#233;l&#233;ment fondamental de la R&#233;publique fran&#231;aise. Or les diff&#233;rentes dispositions fiscales r&#233;troactive successives ab&#238;ment ce droit de propri&#233;t&#233;, nuisent &#224; l&#8217;attractivit&#233; de la France et engendrent une instabilit&#233; juridique n&#233;faste pour nos concitoyens et nos entreprises.</p><p style=\"text-align: justify;\">Pour toutes ces raisons, il convient de faire &#233;voluer le droit pour favoriser des relations plus transparentes et plus confiantes entre le contribuable, l&#8217;&#233;pargnant, l&#8217;entreprise et l&#8217;&#201;tat, &#224; l&#8217;exemple de la pratique et des r&#232;gles observ&#233;es chez certains de nos voisins&#160;europ&#233;ens.</p><p style=\"text-align: justify;\">Cet amendement se conforme aux d&#233;cisions du Conseil constitutionnel n&#176;95&#8209;369 DC du 28 d&#233;cembre 1995 et n&#176;98&#8209;404 DC du 18 d&#233;cembre 1998. Une loi organique pourrait venir pr&#233;ciser cette disposition.</p>"
  },
  "representations": [
    {
      "nom": "PDF",
      "typeMime": {
        "type": "application",
        "subType": "PDF"
      },
      "statutRepresentation": {
        "verbatim": true,
        "canonique": true,
        "officielle": true,
        "transcription": false,
        "enregistrement": false
      },
      "contenu": {
        "documentURI": "/15/amendements/0911/CION_LOIS/CL532.pdf"
      }
    }
  ],
  "sort": {
    "dateSaisie": "2018-06-28T23:05:51.000+02:00",
    "sortEnSeance": "Tombé"
  },
  "dateDepot": "2018-06-21T02:00:00.000+02:00",
  "dateDistribution": "2018-06-25T02:00:00.000+02:00",
  "article99": "0",
  "loiReference": {
    "codeLoi": "05-2",
    "divisionCodeLoi": "id"
  }
}