{
  "uid": "AMANR5L15SEA717460B1255P2D1N918",
  "identifiant": {
    "legislature": "15",
    "numero": "918",
    "numRect": "0",
    "saisine": {
      "texteLegislatifRef": "PRJLANR5L15B1255",
      "numeroPartiePLF": "2",
      "organeExamen": "PO717460",
      "mentionSecondeDeliberation": "1"
    }
  },
  "numeroLong": "II-918",
  "etapeTexte": "1ère lecture (1ère assemblée saisie)",
  "triAmendement": "hcaaaaaaaaaaaaaaaaaaaaaaaaaaaaaaaaaaaaaaaaaaaaaaaafzs",
  "cardinaliteAmdtMultiples": "1",
  "etat": "Discuté",
  "signataires": {
    "auteur": {
      "typeAuteur": "Depute",
      "acteurRef": "PA712015",
      "groupePolitiqueRef": "PO730934"
    },
    "cosignatairesRefs": [
      "PA267429",
      "PA643089",
      "PA721968",
      "PA712015"
    ],
    "texteAffichable": "M.&#160;Dive,  M.&#160;Cinieri, M.&#160;Thi&#233;riot et M.&#160;Vialay"
  },
  "pointeurFragmentTexte": {
    "division": {
      "titre": "Article 60",
      "articleDesignationCourte": "ART. 60",
      "type": "ARTICLE",
      "avantAApres": "A",
      "divisionRattachee": "ARTICLE 60",
      "urlDivisionTexteVise": "/15/textes/1255C.asp#D_Article_60"
    },
    "alinea": {
      "avantAApres": "A",
      "numero": "4",
      "alineaDesignation": "Alinéa 4"
    }
  },
  "corps": {
    "dispositif": "<p style=\"text-align: justify;\">I.&#160;&#8211;&#160;Compl&#233;ter l&#8217;alin&#233;a&#160;4 par la phrase suivante&#160;:</p><p style=\"text-align: justify;\">&#171;&#160;Le Super&#233;thanol-E85 identifi&#233; par l&#8217;indice 55 du m&#234;me tableau et le carburant &#233;thanol pour moteurs d&#233;di&#233;s &#224; allumage par compression identifi&#233; par l&#8217;indice 56 du m&#234;me tableau sont pris en compte comme des essences&#160;;&#160;&#187;.</p><p style=\"text-align: justify;\">II.&#160;&#8211;&#160;En cons&#233;quence, supprimer l&#8217;alin&#233;a&#160;6.</p><p style=\"text-align: justify;\">III.&#160;&#8211;&#160;Compl&#233;ter cet article par l&#8217;alin&#233;a suivant&#160;:</p><p style=\"text-align: justify;\">&#171;&#160;III.&#160;&#8211;&#160;La perte de recettes pour l&#8217;&#201;tat est compens&#233;e &#224; due concurrence par la cr&#233;ation d&#8217;une taxe additionnelle aux droits mentionn&#233;s aux articles 575 et 575 A du code g&#233;n&#233;ral des imp&#244;ts.&#160;&#187;.</p>",
    "exposeSommaire": "<p style=\"text-align: justify;\">Le Super&#233;thanol-E85 et le carburant &#233;thanol pour moteurs d&#233;di&#233;s &#224; allumage par compression ne sont des essences ni par leur composition ni au sens de la classification douani&#232;re. Cet amendement vise toutefois &#224; les prendre en compte comme tels dans la Taxe incitative &#224; l&#8217;incorporation de biocarburants.</p>"
  },
  "representations": [
    {
      "nom": "PDF",
      "typeMime": {
        "type": "application",
        "subType": "PDF"
      },
      "statutRepresentation": {
        "verbatim": true,
        "canonique": true,
        "officielle": true,
        "transcription": false,
        "enregistrement": false
      },
      "contenu": {
        "documentURI": "/15/amendements/1255C/AN/918.pdf"
      }
    }
  ],
  "seanceDiscussion": "RUANR5L15S2019IDS21345",
  "sort": {
    "dateSaisie": "2018-11-16T16:48:22.000+01:00",
    "sortEnSeance": "Non soutenu"
  },
  "dateDepot": "2018-10-31T01:00:00.000+01:00",
  "dateDistribution": "2018-11-14T01:00:00.000+01:00",
  "article99": "0",
  "loiReference": {}
}