{
  "uid": "AMANR5L15PO420120B1681P0D1N1492",
  "identifiant": {
    "legislature": "15",
    "numero": "1492",
    "numRect": "0",
    "saisine": {
      "texteLegislatifRef": "PRJLANR5L15B1681",
      "numeroPartiePLF": "0",
      "organeExamen": "PO420120",
      "mentionSecondeDeliberation": "0"
    }
  },
  "numeroLong": "AS1492",
  "etapeTexte": "1ère lecture (1ère assemblée saisie)",
  "triAmendement": "boaaaaaaaaaaaaaaaaaaaaaaaaaaaaaaaaaaaaaaaaaaaaaaaafz",
  "cardinaliteAmdtMultiples": "1",
  "etat": "Discuté",
  "signataires": {
    "auteur": {
      "typeAuteur": "Depute",
      "acteurRef": "PA642764",
      "groupePolitiqueRef": "PO758835"
    },
    "cosignatairesRefs": [
      "PA332614",
      "PA267233",
      "PA1592",
      "PA642764",
      "PA333818",
      "PA335532",
      "PA508",
      "PA340357",
      "PA1008",
      "PA605069",
      "PA610681",
      "PA608172",
      "PA608741",
      "PA609590",
      "PA643145",
      "PA720988",
      "PA429893",
      "PA1809",
      "PA337483",
      "PA607553",
      "PA333285",
      "PA340343",
      "PA719930",
      "PA1198",
      "PA608011",
      "PA609332",
      "PA342415",
      "PA335054",
      "PA608695"
    ],
    "texteAffichable": "M.&#160;Aviragnet,  Mme&#160;Bareigts, Mme&#160;Bi&#233;mouret, M.&#160;Vallaud, Mme&#160;Rabault, Mme&#160;Battistel, M.&#160;Bouillon, M.&#160;Jean-Louis&#160;Bricout, M.&#160;Carvounas, M.&#160;Alain&#160;David, Mme&#160;Laurence&#160;Dumont, M.&#160;Faure, M.&#160;Garot, M.&#160;David&#160;Habib, M.&#160;Hutin, M.&#160;Juanico, Mme&#160;Karamanli, M.&#160;J&#233;r&#244;me&#160;Lambert, M.&#160;Letchimy, Mme&#160;Manin, Mme&#160;Pau-Langevin, Mme&#160;Pires Beaune, M.&#160;Potier, M.&#160;Pueyo, M.&#160;Saulignac, Mme&#160;Tolmont, Mme&#160;Untermaier, Mme&#160;Vainqueur-Christophe et Mme&#160;Victory"
  },
  "pointeurFragmentTexte": {
    "division": {
      "titre": "Article 7",
      "articleDesignationCourte": "ART. 7",
      "type": "ARTICLE",
      "avantAApres": "A",
      "divisionRattachee": "ARTICLE 7",
      "urlDivisionTexteVise": "/15/textes/1681.asp#D_Article_7"
    },
    "alinea": {
      "numero": "8"
    }
  },
  "corps": {
    "dispositif": "<p style=\"text-align: justify;\">A l&#8217;alin&#233;a&#160;8, apr&#232;s les mots&#160;:</p><p style=\"text-align: justify;\">&#171;&#160;l&#8217;&#233;laboration&#160;&#187;</p><p style=\"text-align: justify;\">ins&#233;rer les mots&#160;:</p><p style=\"text-align: justify;\">&#171;&#160;, la mise en &#339;uvre et l&#8217;&#233;valuation&#160;&#187;.</p>",
    "exposeSommaire": "<p style=\"text-align: justify;\">Cet amendement du groupe socialiste, dont France Assos Sant&#233; est &#224; l'origine, propose de renforcer la place des usagers dans la pr&#233;paration du projet territorial de sant&#233;, inciter &#224; sa mise en &#339;uvre, et introduire des repr&#233;sentants des usagers dans les CPTS.</p><p>Le pr&#233;sent amendement vise &#224; pr&#233;ciser le r&#244;le des associations et des instances de d&#233;mocratie sanitaire dans le PTS, donner plus de poids au DGARS pour susciter ce type de projets sur les territoires fragiles, et introduit une temporalit&#233; au PTS, n&#233;cessaire &#224; la mise en mode projet de tous ces acteurs.</p><p style=\"text-align: justify;\">Enfin, le pr&#233;sent amendement introduit dans la loi la participation de repr&#233;sentants d&#8217;usagers aux CPTS.</p>"
  },
  "representations": [
    {
      "nom": "PDF",
      "typeMime": {
        "type": "application",
        "subType": "PDF"
      },
      "statutRepresentation": {
        "verbatim": true,
        "canonique": true,
        "officielle": true,
        "transcription": false,
        "enregistrement": false
      },
      "contenu": {
        "documentURI": "/15/amendements/1681/CION-SOC/AS1492.pdf"
      }
    }
  ],
  "sort": {
    "dateSaisie": "2019-03-13T11:13:34.000+01:00",
    "sortEnSeance": "Adopté"
  },
  "dateDepot": "2019-03-09T01:00:00.000+01:00",
  "dateDistribution": "2019-03-12T01:00:00.000+01:00",
  "article99": "0",
  "loiReference": {}
}