{
  "uid": "AMANR5L15SEA717460B2272P2D1N1942",
  "identifiant": {
    "legislature": "15",
    "numero": "1942",
    "numRect": "0",
    "saisine": {
      "texteLegislatifRef": "PRJLANR5L15B2272",
      "numeroPartiePLF": "2",
      "organeExamen": "PO717460",
      "mentionSecondeDeliberation": "0"
    }
  },
  "numeroLong": "II-1942",
  "etapeTexte": "1ère lecture (1ère assemblée saisie)",
  "triAmendement": "eeaaaaaaaaaaaaaaaaaaaaaaaaaaaaaaaaaaaaaaaaaaaaaaaaln",
  "cardinaliteAmdtMultiples": "1",
  "etat": "Discuté",
  "signataires": {
    "auteur": {
      "typeAuteur": "Depute",
      "acteurRef": "PA608172",
      "groupePolitiqueRef": "PO758835"
    },
    "cosignatairesRefs": [
      "PA609332",
      "PA1592",
      "PA643145",
      "PA267233",
      "PA332614",
      "PA642764",
      "PA610681",
      "PA335532",
      "PA333285",
      "PA607553",
      "PA340357",
      "PA720988",
      "PA342415",
      "PA340343",
      "PA608172",
      "PA608011",
      "PA333818",
      "PA719930",
      "PA337483",
      "PA429893",
      "PA508",
      "PA609590",
      "PA608695",
      "PA605069",
      "PA1198",
      "PA335054",
      "PA608741",
      "PA1008",
      "PA1809"
    ],
    "texteAffichable": "Mme&#160;Pires Beaune,  M.&#160;Jean-Louis&#160;Bricout, M.&#160;David&#160;Habib, Mme&#160;Rabault, M.&#160;Aviragnet, Mme&#160;Bareigts, Mme&#160;Battistel, Mme&#160;Bi&#233;mouret, M.&#160;Bouillon, M.&#160;Carvounas, M.&#160;Alain&#160;David, Mme&#160;Laurence&#160;Dumont, M.&#160;Faure, M.&#160;Garot, M.&#160;Hutin, M.&#160;Juanico, Mme&#160;Karamanli, M.&#160;J&#233;r&#244;me&#160;Lambert, M.&#160;Letchimy, Mme&#160;Manin, Mme&#160;Pau-Langevin, M.&#160;Potier, M.&#160;Pueyo, M.&#160;Saulignac, Mme&#160;Tolmont, Mme&#160;Untermaier, Mme&#160;Vainqueur-Christophe, M.&#160;Vallaud, Mme&#160;Victory et les membres du groupe Socialistes et apparent&#233;s"
  },
  "pointeurFragmentTexte": {
    "division": {
      "titre": "Article 47",
      "articleDesignationCourte": "ART. 47",
      "type": "ARTICLE",
      "avantAApres": "A",
      "divisionRattachee": "ARTICLE 47",
      "urlDivisionTexteVise": "/15/textes/2272C.asp#D_Article_47"
    },
    "alinea": {
      "avantAApres": "Apres",
      "numero": "43"
    }
  },
  "corps": {
    "dispositif": "<p style=\"text-align: justify;\">Compl&#233;ter cet article par l&#8217;alin&#233;a suivant&#160;:</p><p style=\"text-align: justify;\">&#171;&#160;V.&#160;&#8211;&#160;Le Gouvernement remet au Parlement, avant le 1<sup>er</sup> septembre 2022, un rapport &#233;valuant le co&#251;t de ce dispositif d&#8217;exon&#233;ration fiscale pour les collectivit&#233;s territoriales et les &#233;tablissements publics de coop&#233;ration intercommunale &#224; fiscalit&#233; propre concern&#233;s ainsi que l&#8217;efficacit&#233; de ce dispositif au regard des objectifs fix&#233;s. Ce rapport porte &#233;galement sur d&#8217;&#233;ventuelles &#233;volutions, notamment sur l&#8217;opportunit&#233; de revoir les crit&#232;res retenus en mati&#232;re d&#8217;&#233;ligibilit&#233; des entreprises et de classement&#160;en zone de revitalisation des commerces en milieu rural des communes.&#160;&#187;</p>",
    "exposeSommaire": "<p>Cet amendement du groupe Socialistes et apparent&#233;s vise &#224; demander au Gouvernement de remettre&#160;au Parlement, avant le 1<sup>er</sup> septembre 2022, un rapport&#160;:</p><p>&#8211;&#160;&#233;valuant le co&#251;t du dispositif d'exon&#233;ration d'imp&#244;ts locaux cr&#233;&#233; par l'article&#160;47 ;</p><p>&#8211;&#160;proposant d'&#233;ventuelles &#233;volutions, notamment sur l&#8217;opportunit&#233; de revoir les crit&#232;res retenus en mati&#232;re d&#8217;&#233;ligibilit&#233; des entreprises et de classement en zone de revitalisation des commerces en milieu rural des communes.</p><p style=\"text-align: justify;\">L&#8217;article&#160;47 cr&#233;e un nouveau dispositif d&#8217;exon&#233;ration d&#8217;imp&#244;ts locaux, les zones de revitalisation des commerces en milieu rural (ZRCMR), jusqu&#8217;au 31 d&#233;cembre 2023.</p><p>Seront class&#233;es en ZRCMR les communes qui, au 1<sup>er</sup>janvier 2020, satisfont aux conditions cumulatives suivantes&#160;:</p><p>&#8211;&#160;Population municipale inf&#233;rieure &#224; 3&#160;500 habitants&#160;;</p><p>&#8211;&#160;Ne pas appartenir &#224; une aire urbaine de plus de 10&#160;000 emplois&#160;;</p><p>&#8211;&#160;Nombre d&#8217;&#233;tablissements exer&#231;ant une activit&#233; commerciale inf&#233;rieur ou &#233;gal &#224; 10.</p><p style=\"text-align: justify;\">Sur les territoires class&#233;s en ZRCMR, les communes et les EPCI &#224; fiscalit&#233; propre pourront exon&#233;rer partiellement ou totalement de cotisation fonci&#232;re des entreprises (CFE), de cotisation sur la valeur ajout&#233;e des entreprises (CVAE) et de taxe fonci&#232;re sur les propri&#233;t&#233;s b&#226;ties (TFPB) les petites activit&#233;s commerciales, dont les artisans enregistr&#233;s au registre du commerce et des soci&#233;t&#233;s.&#160;Ces activit&#233;s commerciales se limiteront aux entreprises de moins de 11 salari&#233;s r&#233;alisant un chiffre d&#8217;affaires annuel de moins de 2 millions d&#8217;euros.&#160;Ce dispositif sera ouvert aux entreprises nouvelles comme aux entreprises existantes et sera ouvert aux franchises commerciales.</p><p style=\"text-align: justify;\">Cet amendement &#171;&#160;demande de rapport&#160;&#187; prend mod&#232;le sur la demande de rapport de l&#8217;article&#160;17 de la loi&#160;du 28 d&#233;cembre 2017 de finances rectificative pour 2017, issue de l&#8217;adoption d&#8217;un amendement alors port&#233;e par les d&#233;put&#233;s Socialistes et apparent&#233;s, relatif au dispositif d&#8217;exon&#233;ration d&#8217;imp&#244;ts locaux &#171;&#160;bassins urbains &#224; dynamiser&#160;&#187;.</p>"
  },
  "representations": [
    {
      "nom": "PDF",
      "typeMime": {
        "type": "application",
        "subType": "PDF"
      },
      "statutRepresentation": {
        "verbatim": true,
        "canonique": true,
        "officielle": true,
        "transcription": false,
        "enregistrement": false
      },
      "contenu": {
        "documentURI": "/15/amendements/2272C/AN/1942.pdf"
      }
    }
  ],
  "seanceDiscussion": "RUANR5L15S2020IDS21922",
  "sort": {
    "dateSaisie": "2019-11-14T19:01:06.000+01:00",
    "sortEnSeance": "Rejeté"
  },
  "dateDepot": "2019-11-06T01:00:00.000+01:00",
  "dateDistribution": "2019-11-12T01:00:00.000+01:00",
  "article99": "0",
  "loiReference": {}
}