{
  "uid": "AMANR5L15SEA717460BTC0902P0D1N1095",
  "identifiant": {
    "legislature": "15",
    "numero": "1095",
    "numRect": "0",
    "saisine": {
      "texteLegislatifRef": "PRJLANR5L15BTC0902",
      "numeroPartiePLF": "0",
      "organeExamen": "PO717460",
      "mentionSecondeDeliberation": "0"
    }
  },
  "numeroLong": "1095",
  "etapeTexte": "1ère lecture (1ère assemblée saisie)",
  "triAmendement": "cis",
  "cardinaliteAmdtMultiples": "1",
  "etat": "Discuté",
  "signataires": {
    "auteur": {
      "typeAuteur": "Depute",
      "acteurRef": "PA334149",
      "groupePolitiqueRef": "PO730934"
    },
    "cosignatairesRefs": [
      "PA722390",
      "PA346054",
      "PA709315",
      "PA721968",
      "PA608416",
      "PA642847",
      "PA266776",
      "PA336316",
      "PA334149"
    ],
    "texteAffichable": "M.&#160;Fasquelle,  M.&#160;Vialay, M.&#160;Hetzel, Mme&#160;Corneloup, M.&#160;Reiss, M.&#160;Emmanuel&#160;Maquet, M.&#160;Bazin, M.&#160;Bouchet et M.&#160;Viala"
  },
  "pointeurFragmentTexte": {
    "division": {
      "titre": "Article 10",
      "articleDesignationCourte": "ART. 10",
      "type": "ARTICLE",
      "avantAApres": "A",
      "divisionRattachee": "ARTICLE 10",
      "urlDivisionTexteVise": "/15/textes/0902.asp#D_Article_10"
    },
    "alinea": {
      "avantAApres": "A",
      "numero": "4",
      "alineaDesignation": "Alinéa 4"
    }
  },
  "corps": {
    "dispositif": "<p>Supprimer l&#8217;alin&#233;a&#160;4.</p>",
    "exposeSommaire": "<p style=\"text-align: justify;\">Le sujet des conventions conclues entre les fournisseurs et les distributeurs sur les prestations de services et entre les fournisseurs et les grossistes d&#233;passe largement le champ du projet de loi car il concerne toutes les relations commerciales.</p><p style=\"text-align: justify;\">Ce sujet, au c&#339;ur de la loi LME doit pouvoir &#234;tre d&#233;battu dans le cadre d&#8217;un projet ou d&#8217;une proposition de loi et non par ordonnance.</p>"
  },
  "representations": [
    {
      "nom": "PDF",
      "typeMime": {
        "type": "application",
        "subType": "PDF"
      },
      "statutRepresentation": {
        "verbatim": true,
        "canonique": true,
        "officielle": true,
        "transcription": false,
        "enregistrement": false
      },
      "contenu": {
        "documentURI": "/15/amendements/0902/AN/1095.pdf"
      }
    }
  ],
  "seanceDiscussion": "RUANR5L15S2018IDS21055",
  "sort": {
    "dateSaisie": "2018-05-25T15:43:01.000+02:00",
    "sortEnSeance": "Non soutenu"
  },
  "dateDepot": "2018-05-16T02:00:00.000+02:00",
  "dateDistribution": "2018-05-21T02:00:00.000+02:00",
  "article99": "0",
  "loiReference": {}
}