{
  "uid": "AMANR5L15SEA717460BTC0938P0D1N221",
  "identifiant": {
    "legislature": "15",
    "numero": "221",
    "numRect": "0",
    "saisine": {
      "texteLegislatifRef": "PRJLANR5L15BTC0938",
      "numeroPartiePLF": "0",
      "organeExamen": "PO717460",
      "mentionSecondeDeliberation": "0"
    }
  },
  "numeroLong": "221",
  "etapeTexte": "1ère lecture (1ère assemblée saisie)",
  "triAmendement": "gy",
  "cardinaliteAmdtMultiples": "1",
  "etat": "Discuté",
  "signataires": {
    "auteur": {
      "typeAuteur": "Depute",
      "acteurRef": "PA267200",
      "groupePolitiqueRef": "PO730934"
    },
    "cosignatairesRefs": [
      "PA2086",
      "PA330909",
      "PA267200",
      "PA712015",
      "PA336316",
      "PA266793",
      "PA608826",
      "PA223837",
      "PA267527",
      "PA266776",
      "PA340853",
      "PA721968",
      "PA709315",
      "PA267735",
      "PA608016",
      "PA1012",
      "PA720210",
      "PA721678",
      "PA608416"
    ],
    "texteAffichable": "M.&#160;Huyghe,  M.&#160;Bony, M.&#160;Bouchet, M.&#160;Brochand, M.&#160;de Ganay, M.&#160;de la Verpilli&#232;re, M.&#160;Descoeur, M.&#160;Dive, Mme&#160;Duby-Muller, M.&#160;Hetzel, M.&#160;Leclerc, Mme&#160;Louwagie, M.&#160;Marlin, M.&#160;Reda, M.&#160;Reiss, M.&#160;Saddier, M.&#160;Viala, M.&#160;Vialay et Mme&#160;Beauvais"
  },
  "pointeurFragmentTexte": {
    "division": {
      "titre": "Article PREMIER",
      "articleDesignationCourte": "ART. PREMIER",
      "type": "ARTICLE",
      "avantAApres": "A",
      "divisionRattachee": "ARTICLE PREMIER",
      "urlDivisionTexteVise": "/15/textes/0938.asp#D_Article_1er"
    },
    "alinea": {
      "avantAApres": "A",
      "numero": "4",
      "alineaDesignation": "Alinéa 4"
    }
  },
  "corps": {
    "dispositif": "<p>Apr&#232;s le mot :</p><p>&#171; mineurs, &#187;</p><p>r&#233;diger ainsi la fin de l&#8217;alin&#233;a 4 :</p><p>&#171; est imprescriptible. &#187;</p>",
    "exposeSommaire": "<p style=\"text-align: justify;\">Le pr&#233;sent projet de loi met en lumi&#232;re le ph&#233;nom&#232;ne d&#8217;amn&#233;sie traumatique, qui conduit certaines victimes &#224; occulter inconsciemment les faits dont elles auraient pu &#234;tre victimes dans leur enfance. Ces victimes r&#233;alisent parfois &#224; un &#226;ge avanc&#233; qu&#8217;elles ont subi des actes de viol ou d&#8217;atteinte sexuelle, bien souvent au-del&#224; du d&#233;lai de prescription.</p><p style=\"text-align: justify;\">D&#232;s lors que ce ph&#233;nom&#232;ne a &#233;t&#233; identifi&#233;, il est donc propos&#233; de rendre les actes p&#233;dophiles imprescriptibles, afin de ne laisser aucune victime seule avec son traumatisme et d&#233;munie face &#224; l&#8217;absence de r&#233;ponse de la justice.</p>"
  },
  "representations": [
    {
      "nom": "PDF",
      "typeMime": {
        "type": "application",
        "subType": "PDF"
      },
      "statutRepresentation": {
        "verbatim": true,
        "canonique": true,
        "officielle": true,
        "transcription": false,
        "enregistrement": false
      },
      "contenu": {
        "documentURI": "/15/amendements/0938/AN/221.pdf"
      }
    }
  ],
  "seanceDiscussion": "RUANR5L15S2018IDS21030",
  "sort": {
    "dateSaisie": "2018-05-15T17:12:50.000+02:00",
    "sortEnSeance": "Rejeté"
  },
  "dateDepot": "2018-05-11T02:00:00.000+02:00",
  "dateDistribution": "2018-05-14T02:00:00.000+02:00",
  "article99": "0",
  "loiReference": {}
}