{
  "uid": "AMANR5L15PO757134B1673P0D1N735",
  "identifiant": {
    "legislature": "15",
    "numero": "735",
    "numRect": "0",
    "saisine": {
      "texteLegislatifRef": "PRJLANR5L15B1673",
      "numeroPartiePLF": "0",
      "organeExamen": "PO757134",
      "mentionSecondeDeliberation": "0"
    }
  },
  "numeroLong": "735",
  "etapeTexte": "Nouvelle Lecture",
  "triAmendement": "jgaaaaaaaaaaaaaaaaaaaaaaaaaaaaaaaaaaaaaaaaaaaaaaaakc",
  "cardinaliteAmdtMultiples": "1",
  "etat": "Irrecevable",
  "signataires": {
    "auteur": {
      "typeAuteur": "Depute",
      "acteurRef": "PA718838",
      "groupePolitiqueRef": "PO730934"
    },
    "cosignatairesRefs": [
      "PA718838"
    ],
    "texteAffichable": "M.&#160;Brun"
  },
  "pointeurFragmentTexte": {
    "division": {
      "titre": "Article 51 bis A",
      "articleDesignationCourte": "ART. 51 BIS A",
      "type": "ARTICLE",
      "avantAApres": "A",
      "divisionRattachee": "ARTICLE 51 BIS A",
      "urlDivisionTexteVise": "/15/textes/1673.asp#D_Article_51_bis_A"
    },
    "alinea": {
      "avantAApres": "Apres",
      "numero": "67"
    }
  },
  "corps": {
    "dispositif": "<p>Apr&#232;s l&#8217;alin&#233;a&#160;67, ins&#233;rer les deux alin&#233;as suivants&#160;:</p><p style=\"text-align: justify;\">&#171;&#160;VIII.&#160;&#8211;&#160;Apr&#232;s le premier alin&#233;a de l&#8217;article&#160;5 de la loi n&#176;&#160;2010-476 du 12 mai 2010 relative &#224; l&#8217;ouverture &#224; la concurrence et &#224; la r&#233;gulation du secteur des jeux d&#8217;argent et de hasard en ligne, il est ins&#233;r&#233; un alin&#233;a ainsi r&#233;dig&#233;&#160;:</p><p style=\"text-align: justify;\">&#171;&#160;La vente &#224; des mineurs de jeux d&#8217;argent et de hasard est punie de 11&#160;500&#160;&#8364; d&#8217;amende. L&#8217;offre de ces jeux &#224; titre gratuit &#224; des mineurs, dans les lieux de vente de jeux d&#8217;argent et de hasard et tous commerces ou lieux publics, est punie de la m&#234;me peine.&#160;&#187;</p>",
    "exposeSommaire": "<p style=\"text-align: justify;\">Tout comme la loi prot&#232;ge les mineurs des produits addictifs, la pr&#233;vention des conduites &#224; risque telle l&#8217;addiction au jeu doit aussi se faire par la mise en &#339;uvre d&#8217;une politique volontariste et coh&#233;rente.</p><p style=\"text-align: justify;\">Aujourd&#8217;hui, la vente ou l&#8217;offre de jeux d&#8217;argent ou de hasard aux mineurs est compl&#232;tement interdite et ceux qui enfreignent la loi sont soumis &#224; amende, voire &#224; une fermeture de leur &#233;tablissement et &#224; une interdiction d&#8217;exercer, &#224; l&#8217;exception des revendeurs de la Fran&#231;aise des jeux pour lesquels l&#8217;interdiction existe mais n&#8217;est nullement suivie d&#8217;amende ou d&#8217;une quelconque sanction l&#233;gale ou administrative. En l&#8217;esp&#232;ce, c&#8217;est la Fran&#231;aise des jeux elle-m&#234;me qui effectue les contr&#244;les et la sanction peut consister en la perte d&#8217;un &#171;&#160;bonus jeu responsable&#160;&#187; qui n&#8217;est nullement syst&#233;matique. Quant au retrait possible de l&#8217;agr&#233;ment, celui-ci n&#8217;arrive que dans des cas tr&#232;s exceptionnels.</p><p style=\"text-align: justify;\">Le pr&#233;sent amendement propose de punir la vente ou l&#8217;offre &#224; un mineur de jeu d&#8217;argent et de hasard d&#8217;une amende de m&#234;me teneur que la vente de produits addictifs, qui peut monter jusqu&#8217;&#224; 11&#160;500 &#8364; pour la protection des mineurs.</p>"
  },
  "representations": [
    {
      "nom": "PDF",
      "typeMime": {
        "type": "application",
        "subType": "PDF"
      },
      "statutRepresentation": {
        "verbatim": true,
        "canonique": true,
        "officielle": true,
        "transcription": false,
        "enregistrement": false
      },
      "contenu": {
        "documentURI": "/15/amendements/1673/CSPACTE/735.pdf"
      }
    }
  ],
  "dateDepot": "2019-03-01T01:00:00.000+01:00",
  "dateDistribution": "2019-03-06T01:00:00.000+01:00",
  "article99": "0",
  "loiReference": {}
}