{
  "uid": "AMANR5L15PO59051B0714P0D1N402",
  "identifiant": {
    "legislature": "15",
    "numero": "402",
    "numRect": "0",
    "saisine": {
      "texteLegislatifRef": "PRJLANR5L15B0714",
      "numeroPartiePLF": "0",
      "organeExamen": "PO59051",
      "mentionSecondeDeliberation": "0"
    }
  },
  "numeroLong": "CL402",
  "etapeTexte": "1ère lecture (1ère assemblée saisie)",
  "triAmendement": "bq",
  "cardinaliteAmdtMultiples": "1",
  "etat": "Discuté",
  "signataires": {
    "auteur": {
      "typeAuteur": "Depute",
      "acteurRef": "PA719448",
      "groupePolitiqueRef": "PO730964"
    },
    "cosignatairesRefs": [
      "PA719806",
      "PA721296",
      "PA721384",
      "PA722252",
      "PA721742",
      "PA719558",
      "PA718860",
      "PA719624",
      "PA722054",
      "PA719448"
    ],
    "texteAffichable": "Mme&#160;Chapelier,  Mme&#160;Hai, Mme&#160;Rixain, M.&#160;Gouffier-Cha, Mme&#160;Auconie, M.&#160;Balanant, Mme&#160;Taurine, Mme&#160;Florennes, Mme&#160;Fontenel-Personne et Mme&#160;Couillard"
  },
  "pointeurFragmentTexte": {
    "division": {
      "titre": "Article 9",
      "articleDesignationCourte": "APRÈS ART. 9",
      "type": "ARTICLE",
      "avantAApres": "Apres",
      "divisionRattachee": "APRÈS L'ARTICLE 9, insérer l'article suivant:",
      "articleAdditionnel": "1",
      "urlDivisionTexteVise": "/15/textes/0714.asp#D_Article_9"
    }
  },
  "corps": {
    "dispositif": "<p style=\"text-align: justify;\">&#171;&#160;Le Gouvernement peut autoriser, &#224; titre exp&#233;rimental et pour une dur&#233;e de deux ans, la mise en place d&#8217;un dispositif d&#8217;accueil de demandeurs d&#8217;asile par des particuliers. Un d&#233;cret fixe les conditions de mise en &#339;uvre du pr&#233;sent dispositif.&#160;&#187;</p>",
    "exposeSommaire": "<p style=\"text-align: justify;\">Cet amendement, issu de la recommandation n&#176;&#160;3 de la D&#233;l&#233;gation aux droits des femmes, a pour objet de pr&#233;voir la mise en &#339;uvre, &#224; titre exp&#233;rimental, d&#8217;un dispositif d&#8217;accueil de demandeurs d&#8217;asile par des particuliers, comme cela est d&#233;j&#224; le cas dans d&#8217;autres pays, comme le Canada. Ce dispositif permettrait de mieux impliquer la soci&#233;t&#233; civile dans l&#8217;accueil et l&#8217;accompagnement des demandeurs d&#8217;asile et des r&#233;fugi&#233;s. En outre, cela permettrait de donner un cadre l&#233;gal aux initiatives locales qui existent d&#233;j&#224;.&#160;</p><p style=\"text-align: justify;\">&#160;Ce dispositif serait soumis &#224; une triple condition :</p><p style=\"text-align: justify;\">&#8211;&#160;que la vuln&#233;rabilit&#233; des demandeurs ne demande aucune prise en charge par des professionnels. Seraient par exemple exclues les victimes de violence ;</p><p style=\"text-align: justify;\">&#8211;&#160;que les demandeurs d&#8217;asile b&#233;n&#233;ficient d&#8217;un accompagnement d&#8217;une qualit&#233; identique &#224; celui qui leur aurait &#233;t&#233; propos&#233; dans un CADA. Une convention pourrait &#234;tre &#233;tablie &#224; ce sujet entre le particulier accueillant, l&#8217;OFII et une association agr&#233;&#233;e ou une structure &#224; m&#234;me de dispenser cet accompagnement ;</p><p style=\"text-align: justify;\">&#8211;&#160;que le particulier accueillant b&#233;n&#233;ficie d&#8217;un suivi et d&#8217;une formation &#224; l&#8217;accueil et &#224; l&#8217;accompagnement.</p><p style=\"text-align: justify;\">L&#8217;Office fran&#231;ais de l&#8217;immigration et de l&#8217;int&#233;gration (OFII) serait l&#8217;organisme centralisateur et r&#233;gulateur de cette exp&#233;rimentation qui reposerait sur la base du volontariat ; les particuliers accueillants ne percevraient aucune r&#233;mun&#233;ration &#224; ce titre.</p>"
  },
  "representations": [
    {
      "nom": "PDF",
      "typeMime": {
        "type": "application",
        "subType": "PDF"
      },
      "statutRepresentation": {
        "verbatim": true,
        "canonique": true,
        "officielle": true,
        "transcription": false,
        "enregistrement": false
      },
      "contenu": {
        "documentURI": "/15/amendements/0714/CION_LOIS/CL402.pdf"
      }
    }
  ],
  "sort": {
    "dateSaisie": "2018-04-05T12:29:36.000+02:00",
    "sortEnSeance": "Rejeté"
  },
  "dateDepot": "2018-03-30T02:00:00.000+02:00",
  "dateDistribution": "2018-04-02T02:00:00.000+02:00",
  "article99": "0",
  "loiReference": {
    "codeLoi": "zzz"
  }
}