{
  "uid": "AMANR5L15SEA717460BTC0592P0D1N145",
  "identifiant": {
    "legislature": "15",
    "numero": "145",
    "numRect": "0",
    "saisine": {
      "texteLegislatifRef": "PRJLANR5L15BTC0592",
      "numeroPartiePLF": "0",
      "organeExamen": "PO717460",
      "mentionSecondeDeliberation": "0"
    }
  },
  "numeroLong": "145",
  "etapeTexte": "1ère lecture (1ère assemblée saisie)",
  "triAmendement": "ds",
  "cardinaliteAmdtMultiples": "1",
  "etat": "Discuté",
  "signataires": {
    "auteur": {
      "typeAuteur": "Depute",
      "acteurRef": "PA719138",
      "groupePolitiqueRef": "PO723569"
    },
    "cosignatairesRefs": [
      "PA719138",
      "PA719146",
      "PA719286"
    ],
    "texteAffichable": "M.&#160;Castellani,  M.&#160;Acquaviva et M.&#160;Colombani"
  },
  "pointeurFragmentTexte": {
    "division": {
      "titre": "Article 19",
      "articleDesignationCourte": "ART. 19",
      "type": "ARTICLE",
      "avantAApres": "A",
      "divisionRattachee": "ARTICLE 19",
      "urlDivisionTexteVise": "/15/textes/0592.asp#D_Article_19"
    },
    "alinea": {
      "numero": "44"
    }
  },
  "corps": {
    "dispositif": "<p style=\"text-align: justify;\">&#192; l&#8217;alin&#233;a&#160;44, apr&#232;s le mot&#160;:</p><p style=\"text-align: justify;\">&#171;&#160;modifi&#233;s&#160;&#187;,</p><p style=\"text-align: justify;\">ins&#233;rer le mot&#160;:</p><p style=\"text-align: justify;\">&#171;&#160;, transmis&#160;&#187;.</p>",
    "exposeSommaire": "<p>Amendement de coordination</p>"
  },
  "representations": [
    {
      "nom": "PDF",
      "typeMime": {
        "type": "application",
        "subType": "PDF"
      },
      "statutRepresentation": {
        "verbatim": true,
        "canonique": true,
        "officielle": true,
        "transcription": false,
        "enregistrement": false
      },
      "contenu": {
        "documentURI": "/15/amendements/0592/AN/145.pdf"
      }
    }
  ],
  "seanceDiscussion": "RUANR5L15S2018IDS20900",
  "sort": {
    "dateSaisie": "2018-02-08T00:02:30.000+01:00",
    "sortEnSeance": "Non soutenu"
  },
  "dateDepot": "2018-02-02T01:00:00.000+01:00",
  "dateDistribution": "2018-02-05T01:00:00.000+01:00",
  "article99": "0",
  "loiReference": {}
}