{
  "uid": "AMANR5L15PO59051B1802P0D1N577",
  "identifiant": {
    "legislature": "15",
    "numero": "577",
    "numRect": "0",
    "saisine": {
      "texteLegislatifRef": "PRJLANR5L15B1802",
      "numeroPartiePLF": "0",
      "organeExamen": "PO59051",
      "mentionSecondeDeliberation": "0"
    }
  },
  "numeroLong": "CL577",
  "etapeTexte": "1ère lecture (1ère assemblée saisie)",
  "triAmendement": "bdaaaaaaaaaaaaaaaaaaaaaaaaaaaaaaaaaaaaaaaaaaaaaaaaaz",
  "cardinaliteAmdtMultiples": "1",
  "etat": "Discuté",
  "signataires": {
    "auteur": {
      "typeAuteur": "Depute",
      "acteurRef": "PA721932",
      "groupePolitiqueRef": "PO723569"
    },
    "cosignatairesRefs": [
      "PA721932"
    ],
    "texteAffichable": "Mme&#160;Lorho"
  },
  "pointeurFragmentTexte": {
    "division": {
      "titre": "Article 7",
      "articleDesignationCourte": "ART. 7",
      "type": "ARTICLE",
      "avantAApres": "A",
      "divisionRattachee": "ARTICLE 7",
      "urlDivisionTexteVise": "/15/textes/1802.asp#D_Article_7"
    },
    "alinea": {
      "numero": "8"
    }
  },
  "corps": {
    "dispositif": "<p style=\"text-align: justify;\">&#192; l&#8217;alin&#233;a&#160;8, supprimer les mots&#160;:</p><p style=\"text-align: justify;\">&#171;&#160;les modalit&#233;s de s&#233;lection permettant de garantir l&#8217;&#233;gal acc&#232;s aux emplois publics ainsi que&#160;&#187;.</p>",
    "exposeSommaire": "<p>Rappeler la garantie de l'&#233;gal acc&#232;s &#224; l'emploi public sonne comme une redondance. Ce principe est garanti constitutionnellement par l'article 6 de la D&#233;claration des Droits de l'Homme et du Citoyen du 1789. les modalit&#233;s d'une proc&#233;dure permettant l'application trouveraient une meilleur place au sein d'une loi organique que dans un d&#233;cret du Conseil d'&#233;tat.</p>"
  },
  "representations": [
    {
      "nom": "PDF",
      "typeMime": {
        "type": "application",
        "subType": "PDF"
      },
      "statutRepresentation": {
        "verbatim": true,
        "canonique": true,
        "officielle": true,
        "transcription": false,
        "enregistrement": false
      },
      "contenu": {
        "documentURI": "/15/amendements/1802/CION_LOIS/CL577.pdf"
      }
    }
  ],
  "sort": {
    "dateSaisie": "2019-05-02T17:38:41.000+02:00",
    "sortEnSeance": "Non soutenu"
  },
  "dateDepot": "2019-04-29T02:00:00.000+02:00",
  "dateDistribution": "2019-05-01T02:00:00.000+02:00",
  "article99": "0",
  "loiReference": {
    "codeLoi": "1.2"
  }
}