{
  "uid": "AMANR5L15PO419610B0627P0D1N1372",
  "identifiant": {
    "legislature": "15",
    "numero": "1372",
    "numRect": "0",
    "saisine": {
      "texteLegislatifRef": "PRJLANR5L15B0627",
      "numeroPartiePLF": "0",
      "organeExamen": "PO419610",
      "mentionSecondeDeliberation": "0"
    }
  },
  "numeroLong": "CE1372",
  "etapeTexte": "1ère lecture (1ère assemblée saisie)",
  "triAmendement": "avvig",
  "cardinaliteAmdtMultiples": "1",
  "etat": "Discuté",
  "signataires": {
    "auteur": {
      "typeAuteur": "Depute",
      "acteurRef": "PA720892",
      "groupePolitiqueRef": "PO730958"
    },
    "cosignatairesRefs": [
      "PA721226",
      "PA721202",
      "PA722142",
      "PA719578",
      "PA720422",
      "PA588884",
      "PA721062",
      "PA718860",
      "PA720892",
      "PA720430",
      "PA718868",
      "PA2150",
      "PA719676",
      "PA721960",
      "PA720286",
      "PA721210",
      "PA720846"
    ],
    "texteAffichable": "Mme&#160;Panot,  Mme&#160;Autain, M.&#160;Bernalicis, M.&#160;Coquerel, M.&#160;Corbi&#232;re, Mme&#160;Fiat, M.&#160;Lachaud, M.&#160;Larive, M.&#160;M&#233;lenchon, Mme&#160;Obono, M.&#160;Prud&apos;homme, M.&#160;Quatennens, M.&#160;Ratenon, Mme&#160;Ressiguier, Mme&#160;Rubin, M.&#160;Ruffin et Mme&#160;Taurine"
  },
  "pointeurFragmentTexte": {
    "division": {
      "titre": "Article 15",
      "articleDesignationCourte": "APRÈS ART. 15",
      "type": "ARTICLE",
      "avantAApres": "Apres",
      "divisionRattachee": "APRÈS L'ARTICLE 15, insérer l'article suivant:",
      "articleAdditionnel": "1",
      "urlDivisionTexteVise": "/15/textes/0627.asp#D_Article_15"
    }
  },
  "corps": {
    "dispositif": "<p style=\"text-align: justify;\">Dans un d&#233;lai de 18 mois &#224; compter de la publication de la pr&#233;sente loi, l&#8217;Agence nationale de la s&#233;curit&#233; sanitaire de l&#8217;alimentation, de l&#8217;environnement et du travail remet au gouvernement un rapport formulant des recommandations sur la reclassification des taux de TVA en fonction de l&#8217;int&#233;r&#234;t nutritionnel, sanitaire et environnemental des produits.</p>",
    "exposeSommaire": "<p style=\"text-align: justify;\">La notion de taxation diff&#233;renci&#233;e selon la nature des aliments existe en France depuis l&#8217;introduction de la TVA. A cette &#233;poque, la taxation &#224; taux r&#233;duit avait &#233;t&#233; accord&#233;e aux aliments de consommation courante, du fait de l&#8217;importance du budget alimentaire dans les m&#233;nages. A l&#8217;inverse, quelques aliments consid&#233;r&#233;s comme des produits de luxe, &#233;taient tax&#233;s au taux plein. Mais ce distinguo n&#8217;est plus suffisant &#224; la fois du fait de l&#8217;am&#233;lioration du niveau de vie et de la banalisation de certains produits pr&#233;c&#233;demment consid&#233;r&#233;s comme luxueux. En revanche, une autre probl&#233;matique est apparue depuis&#160;: celle de la surconsommation d&#8217;aliments transform&#233;s tr&#232;s gras ou tr&#232;s sucr&#233;s qui se sont progressivement substitu&#233;s &#224; une alimentation plus saine. Ces &#233;volutions de consommation induisent des d&#233;s&#233;quilibres nutritionnels majeurs, leur impact sur la sant&#233; publique &#233;tant consid&#233;rable&#160;: 18&#160;% des enfants fran&#231;ais sont actuellement ob&#232;ses ou en surpoids, ce qui est particuli&#232;rement &#233;lev&#233; pour cette classe d&#8217;&#226;ge. Quant aux adultes fran&#231;ais, ils sont 49&#160;% &#224; &#234;tre soit ob&#232;ses, soit en surpoids.</p><p style=\"text-align: justify;\">Dans ce contexte d&#8217;une progression des habitudes alimentaires n&#233;fastes pour la sant&#233;, et de mani&#232;re plus g&#233;n&#233;rale, dans l&#8217;objectif de mettre en place une r&#233;elle fiscalit&#233; environnementale, cet amendement, propos&#233; par l&#8217;UFC - Que choisir&#160;?, vise &#224; demander un rapport pourtant sur une reclassification des taux de TVA non seulement en fonction de l&#8217;int&#233;r&#234;t nutritionnel des produits alimentaires, mais aussi en fonction des int&#233;r&#234;ts sanitaire et environnemental des produits de consommation courante.</p>"
  },
  "representations": [
    {
      "nom": "PDF",
      "typeMime": {
        "type": "application",
        "subType": "PDF"
      },
      "statutRepresentation": {
        "verbatim": true,
        "canonique": true,
        "officielle": true,
        "transcription": false,
        "enregistrement": false
      },
      "contenu": {
        "documentURI": "/15/amendements/0627/CION-ECO/CE1372.pdf"
      }
    }
  ],
  "sort": {
    "dateSaisie": "2018-04-20T18:46:22.000+02:00",
    "sortEnSeance": "Non soutenu"
  },
  "dateDepot": "2018-04-13T02:00:00.000+02:00",
  "dateDistribution": "2018-04-17T02:00:00.000+02:00",
  "article99": "0",
  "loiReference": {
    "codeLoi": "zzrapport"
  }
}