{
  "uid": "AMANR5L15SEA717460BTC2401P0D1N1567",
  "identifiant": {
    "legislature": "15",
    "numero": "1567",
    "numRect": "0",
    "saisine": {
      "texteLegislatifRef": "PRJLANR5L15BTC2401",
      "numeroPartiePLF": "0",
      "organeExamen": "PO717460",
      "mentionSecondeDeliberation": "0"
    }
  },
  "numeroLong": "1567",
  "etapeTexte": "1ère lecture (2ème assemblée saisie)",
  "triAmendement": "tpacaaaaaaaaaaaaaaaaaaaaaaaaaaaaaaaaaaaaaaaaaaaaaazzzzzzzzzzzzzzzzzzzzzzzzzzzzzz",
  "cardinaliteAmdtMultiples": "1",
  "etat": "A discuter",
  "signataires": {
    "auteur": {
      "typeAuteur": "Depute",
      "acteurRef": "PA719608",
      "groupePolitiqueRef": "PO723569"
    },
    "cosignatairesRefs": [
      "PA719608"
    ],
    "texteAffichable": "Mme&#160;M&#233;nard"
  },
  "pointeurFragmentTexte": {
    "division": {
      "titre": "Article 7",
      "articleDesignationCourte": "ART. 7",
      "type": "ARTICLE",
      "avantAApres": "A",
      "divisionRattachee": "ARTICLE 7",
      "urlDivisionTexteVise": "/15/textes/2401.asp#D_Article_7"
    },
    "alinea": {
      "avantAApres": "Apres",
      "numero": "21"
    }
  },
  "corps": {
    "dispositif": "<p>Compl&#233;ter cet article par&#160;les quatre alin&#233;as suivants&#160;:</p><p style=\"text-align: justify;\">&#171;&#160;II.&#160;&#8211;&#160;Le&#160;1&#176;&#160;du&#160;II de l&#8217;article L.&#160;751&#8209;2 du code de commerce est ainsi modifi&#233;&#160;:</p><p style=\"text-align: justify;\">&#171;&#160;1&#176;&#160;Au premier alin&#233;a, le mot&#160;:&#160;&#171;&#160;sept&#160;&#187;, est remplac&#233; par le mot&#160;: &#171;&#160;huit&#160;&#187;.</p><p style=\"text-align: justify;\">&#171;&#160;2&#176;&#160;Apr&#232;s le&#160;<i>g</i>, il est ins&#233;r&#233; un&#160;<i>h</i>&#160;ainsi r&#233;dig&#233;&#160;:</p><p style=\"text-align: justify;\">&#171;&#160;<i>h)</i>&#160;Le maire de la commune la plus peupl&#233;e de la zone de chalandise.&#160;&#187;</p>",
    "exposeSommaire": "<p>Il s&#8217;agit de redonner aux &#233;lus locaux les moyens de contr&#244;ler r&#233;ellement l&#8217;extension des zones commerciales proches de leurs villes pour s&#8217;assurer que celles-ci ne viennent pas porter pr&#233;judice au d&#233;veloppement des commerces dans les centres-villes.</p>"
  },
  "representations": [
    {
      "nom": "PDF",
      "typeMime": {
        "type": "application",
        "subType": "PDF"
      },
      "statutRepresentation": {
        "verbatim": true,
        "canonique": true,
        "officielle": true,
        "transcription": false,
        "enregistrement": false
      },
      "contenu": {
        "documentURI": "/15/amendements/2401/AN/1567.pdf"
      }
    }
  ],
  "dateDepot": "2019-11-14T01:00:00.000+01:00",
  "dateDistribution": "2019-11-18T01:00:00.000+01:00",
  "article99": "0",
  "loiReference": {}
}