{
  "uid": "AMANR5L15PO59046B0659P0D1N277",
  "identifiant": {
    "legislature": "15",
    "numero": "277",
    "numRect": "0",
    "saisine": {
      "texteLegislatifRef": "PRJLANR5L15B0659",
      "numeroPartiePLF": "0",
      "organeExamen": "PO59046",
      "mentionSecondeDeliberation": "0"
    }
  },
  "numeroLong": "DN277",
  "etapeTexte": "1ère lecture (1ère assemblée saisie)",
  "triAmendement": "hji",
  "cardinaliteAmdtMultiples": "1",
  "etat": "Discuté",
  "signataires": {
    "auteur": {
      "typeAuteur": "Depute",
      "acteurRef": "PA642935",
      "groupePolitiqueRef": "PO744425"
    },
    "cosignatairesRefs": [
      "PA720696",
      "PA642868",
      "PA266788",
      "PA1960",
      "PA712014",
      "PA267042",
      "PA642935",
      "PA267780",
      "PA331582",
      "PA267241",
      "PA719806",
      "PA267355",
      "PA268019"
    ],
    "texteAffichable": "M.&#160;Becht,  M.&#160;Favennec Becot, M.&#160;Morel-&#192;-L&apos;Huissier, Mme&#160;Descamps, Mme&#160;Firmin Le Bodo, M.&#160;Christophe, M.&#160;Ledoux, M.&#160;Leroy, Mme&#160;Auconie, M.&#160;Demilly, M.&#160;Lagarde, M.&#160;Philippe&#160;Vigier et M.&#160;Herth"
  },
  "pointeurFragmentTexte": {
    "division": {
      "titre": "RAPPORT ANNEXÉ",
      "articleDesignationCourte": "ART. 2",
      "type": "ANNEXE",
      "avantAApres": "A",
      "divisionRattachee": "ARTICLE 2",
      "urlDivisionTexteVise": "/15/textes/0659.asp#D_RAPPORT_ANNEXe"
    },
    "alinea": {
      "avantAApres": "A",
      "numero": "410",
      "alineaDesignation": "Alinéa 410"
    }
  },
  "corps": {
    "dispositif": "<p style=\"text-align: justify;\">A la premi&#232;re phrase de l'alin&#233;a&#160;410, substituer les mots&#160;: &#171;&#160;ou de plusieurs porte-avions disponibles&#160;&#187;, aux mots&#160;: &#171;&#160;porte-avions disponible&#160;&#187;.</p>",
    "exposeSommaire": "<p>La projection de capacit&#233;s a&#233;ronavales est en enjeu de souverainet&#233; pour la France non seulement en ce qui concerne son r&#244;le dans les op&#233;rations ext&#233;rieures mais &#233;galement dans la s&#233;curisation de ses territoires ultra-marins, de ses zones &#233;conomiques exclusives, des c&#226;bles sous-marins par lesquelles transite l&#8217;information mondiale et des routes commerciales. Or la disponibilit&#233; d&#8217;un unique groupe a&#233;ronaval r&#233;duit de facto la permanence de cette capacit&#233; de projection. La LPM doit donc laisser ouverte la possibilit&#233; pour la France de se doter de plusieurs porte-avions afin de disposer en permanence d&#8217;un groupe op&#233;rationnel. La LPM n&#8217;autorisant que les &#233;tudes, celles-ci &#233;tant de co&#251;t identique quel que soit le nombre de porte-avions in fine construits, cette modification est sans incidence budg&#233;taire.</p>"
  },
  "representations": [
    {
      "nom": "PDF",
      "typeMime": {
        "type": "application",
        "subType": "PDF"
      },
      "statutRepresentation": {
        "verbatim": true,
        "canonique": true,
        "officielle": true,
        "transcription": false,
        "enregistrement": false
      },
      "contenu": {
        "documentURI": "/15/amendements/0659/CION_DEF/DN277.pdf"
      }
    }
  ],
  "sort": {
    "dateSaisie": "2018-03-14T01:20:53.000+01:00",
    "sortEnSeance": "Retiré"
  },
  "dateDepot": "2018-03-09T01:00:00.000+01:00",
  "dateDistribution": "2018-03-12T01:00:00.000+01:00",
  "article99": "0",
  "loiReference": {}
}