{
  "uid": "AMANR5L15SEA717460BTC0971P0D1N1290",
  "identifiant": {
    "legislature": "15",
    "numero": "1290",
    "numRect": "0",
    "saisine": {
      "texteLegislatifRef": "PRJLANR5L15BTC0971",
      "numeroPartiePLF": "0",
      "organeExamen": "PO717460",
      "mentionSecondeDeliberation": "0"
    }
  },
  "numeroLong": "1290",
  "etapeTexte": "1ère lecture (1ère assemblée saisie)",
  "triAmendement": "aai",
  "cardinaliteAmdtMultiples": "1",
  "etat": "Discuté",
  "signataires": {
    "auteur": {
      "typeAuteur": "Depute",
      "acteurRef": "PA268019",
      "groupePolitiqueRef": "PO744425"
    },
    "cosignatairesRefs": [
      "PA942",
      "PA267585",
      "PA2952",
      "PA719806",
      "PA267355",
      "PA331582",
      "PA695100",
      "PA331567",
      "PA267330",
      "PA642868",
      "PA721110",
      "PA1960",
      "PA721094",
      "PA333421",
      "PA421348",
      "PA720230",
      "PA610775",
      "PA712014",
      "PA267042",
      "PA266788",
      "PA267780",
      "PA267241",
      "PA722030",
      "PA268019",
      "PA702052",
      "PA335758",
      "PA332228"
    ],
    "texteAffichable": "M.&#160;Lagarde,  M.&#160;Benoit, Mme&#160;Auconie, M.&#160;Bournazel, M.&#160;Christophe, M.&#160;Charles&#160;de Courson, Mme&#160;de La Raudi&#232;re, M.&#160;Demilly, M.&#160;Dunoyer, M.&#160;Favennec Becot, Mme&#160;Firmin Le Bodo, M.&#160;Gom&#232;s, M.&#160;Meyer&#160;Habib, M.&#160;Herth, M.&#160;Ledoux, M.&#160;Leroy, Mme&#160;Magnier, M.&#160;Morel-&#192;-L&apos;Huissier, M.&#160;Pancher, M.&#160;Riester, Mme&#160;Sage, Mme&#160;Sanquer, M.&#160;Vercamer, M.&#160;Philippe&#160;Vigier, M.&#160;Villiers, M.&#160;Warsmann et M.&#160;Zumkeller"
  },
  "pointeurFragmentTexte": {
    "division": {
      "titre": "Article 33",
      "articleDesignationCourte": "APRÈS ART. 33",
      "type": "ARTICLE",
      "avantAApres": "Apres",
      "divisionRattachee": "APRÈS L'ARTICLE 33, insérer l'article suivant:",
      "articleAdditionnel": "1",
      "urlDivisionTexteVise": "/15/textes/0971.asp#D_Article_33"
    }
  },
  "corps": {
    "dispositif": "<p style=\"text-align: justify;\">Le premier alin&#233;a de l&#8217;article L.&#160;126&#8209;3 du code de la construction et de l&#8217;habitation est remplac&#233; par cinq alin&#233;as ainsi r&#233;dig&#233;s&#160;:</p><p style=\"text-align: justify;\">&#171;&#160;Le fait d&#8217;occuper en r&#233;union les espaces communs, les parkings souterrains ou les toits des immeubles collectifs d&#8217;habitation en emp&#234;chant d&#233;lib&#233;r&#233;ment l&#8217;acc&#232;s ou la libre circulation des personnes ou le bon fonctionnement des dispositifs de s&#233;curit&#233; et de s&#251;ret&#233; est puni de l&#8217;amende pr&#233;vue pour les contraventions de la deuxi&#232;me classe.</p><p style=\"text-align: justify;\">&#171;&#160;Le montant de l&#8217;amende est doubl&#233; si l&#8217;auteur de l&#8217;infraction ne r&#233;side pas dans l&#8217;immeuble.</p><p style=\"text-align: justify;\">&#171;&#160;Le montant de l&#8217;amende est doubl&#233; lorsque l&#8217;infraction est commise la nuit.</p><p style=\"text-align: justify;\">&#171;&#160;L&#8217;amende mentionn&#233;e au premier alin&#233;a est pr&#233;lev&#233;e &#233;galement sur la quotit&#233; saisissable&#160;des r&#233;mun&#233;rations et de la fraction insaisissable.</p><p style=\"text-align: justify;\">&#171;&#160;Elle peut faire l&#8217;objet d&#8217;une demande de paiement &#233;chelonn&#233; aupr&#232;s des services du Tr&#233;sor public.&#160;&#187;</p>",
    "exposeSommaire": "<p style=\"text-align: justify;\">En l&#8217;&#233;tat actuel, l&#8217;article L.&#160;126&#8209;3 du code de la construction et de l&#8217;habitation dispose que&#160;: &#171;&#160;Le fait d&#8217;occuper en r&#233;union les espaces communs ou les toits des immeubles collectifs d&#8217;habitation en emp&#234;chant d&#233;lib&#233;r&#233;ment l&#8217;acc&#232;s ou la libre circulation des personnes ou le bon fonctionnement des dispositifs de s&#233;curit&#233; et de s&#251;ret&#233; est puni de deux mois d&#8217;emprisonnement et de 3 750&#160;&#8364; d&#8217;amende.&#160;&#187;</p><p style=\"text-align: justify;\">&#201;videmment, l&#8217;article L.&#160;126&#8209;3 n&#8217;a pas atteint ses objectifs.</p><p style=\"text-align: justify;\">Pourtant, les regroupements dans les halls d&#8217;immeubles constituent toujours un v&#233;ritable fl&#233;au pour les r&#233;sidents&#8230;</p><p style=\"text-align: justify;\">Le pr&#233;sent amendement vise donc &#224; punir les contrevenants d&#8217;une amende pr&#233;vue pour les contraventions de deuxi&#232;me classe.</p><p style=\"text-align: justify;\">Cette amende est doubl&#233;e si l&#8217;auteur de l&#8217;infraction ne r&#233;side pas dans l&#8217;immeuble. Celle-ci est &#233;galement doubl&#233;e si l&#8217;infraction est commise la nuit.</p><p style=\"text-align: justify;\">Il est pr&#233;cis&#233; afin de maintenir l&#8217;effet dissuasif de cette amende que cette derni&#232;re sera pr&#233;lev&#233;e sur les revenus du contrevenant y compris sur la quotit&#233; dite insaisissable d&#233;finie par le l&#233;gislateur. Sinon, on aboutit &#224; une situation de non-droit ou peu importe ce que fera le contrevenant dans cette situation puisqu&#8217;il ne paiera jamais ses contraventions laissant ainsi s&#8217;installer un sentiment d&#8217;injustice.</p><p style=\"text-align: justify;\">Que des cr&#233;anciers traditionnels ne puissent recouvrer leur cr&#233;ance sur la fraction insaisissable est tout &#224; fait justifi&#233;&#160;; que l&#8217;&#201;tat ne le puisse pas dans le cas d&#8217;infractions n&#8217;est absolument pas normal.</p>"
  },
  "representations": [
    {
      "nom": "PDF",
      "typeMime": {
        "type": "application",
        "subType": "PDF"
      },
      "statutRepresentation": {
        "verbatim": true,
        "canonique": true,
        "officielle": true,
        "transcription": false,
        "enregistrement": false
      },
      "contenu": {
        "documentURI": "/15/amendements/0971/AN/1290.pdf"
      }
    }
  ],
  "seanceDiscussion": "RUANR5L15S2018IDS21127",
  "sort": {
    "dateSaisie": "2018-06-03T19:34:43.000+02:00",
    "sortEnSeance": "Rejeté"
  },
  "dateDepot": "2018-05-25T02:00:00.000+02:00",
  "dateDistribution": "2018-05-30T02:00:00.000+02:00",
  "article99": "0",
  "loiReference": {
    "codeLoi": "c construction et habitation",
    "divisionCodeLoi": "L126-3"
  }
}