{
  "uid": "AMANR5L15PO420120B0269P0D1N103",
  "identifiant": {
    "legislature": "15",
    "numero": "103",
    "numRect": "0",
    "saisine": {
      "texteLegislatifRef": "PRJLANR5L15B0269",
      "numeroPartiePLF": "0",
      "organeExamen": "PO420120",
      "mentionSecondeDeliberation": "0"
    }
  },
  "numeroLong": "AS103",
  "etapeTexte": "1ère lecture (1ère assemblée saisie)",
  "triAmendement": "q",
  "cardinaliteAmdtMultiples": "1",
  "etat": "Irrecevable",
  "signataires": {
    "auteur": {
      "typeAuteur": "Depute",
      "acteurRef": "PA267289",
      "groupePolitiqueRef": "PO730934"
    },
    "cosignatairesRefs": [
      "PA721474",
      "PA856",
      "PA267289",
      "PA606712",
      "PA2377"
    ],
    "texteAffichable": "M.&#160;Door,  M.&#160;Viry, M.&#160;Perrut, M.&#160;Lurton et M.&#160;Cherpion"
  },
  "pointeurFragmentTexte": {
    "division": {
      "titre": "Article 35",
      "articleDesignationCourte": "APRÈS ART. 35",
      "type": "ARTICLE",
      "avantAApres": "Apres",
      "divisionRattachee": "APRÈS L'ARTICLE 35, insérer l'article suivant:",
      "articleAdditionnel": "1",
      "urlDivisionTexteVise": "/15/textes/0269.asp#D_Article_35"
    }
  },
  "corps": {
    "dispositif": "<p style=\"text-align: justify;\">Le parcours de soins (ou de sant&#233;) est un dispositif formalis&#233; qui repr&#233;sente l&#8217;ensemble des soins dispens&#233;s pour un &#233;tat de sant&#233; donn&#233;, pendant un laps de temps donn&#233;,&#160;en&#160;coordination&#160;avec&#160;l&#8217;ensemble des acteurs (m&#233;decine de ville,&#160;sanitaire et m&#233;dico-social)&#160;sur&#160;un territoire donn&#233;. Ce parcours&#160;d&#233;bute&#160;par la m&#233;decine de ville et se construit&#160;sur la base du libre choix du patient. Au niveau territorial, cette construction prend en compte l&#8217;ensemble des acteurs et&#160;de l&#8217;offre de soins existante (dont URPS, CPTS, sanitaire, m&#233;dicosocial). Elle ne se limite donc pas aux Groupements Hospitaliers de Territoire.</p><p style=\"text-align: justify;\">Ce dispositif a pour&#160;objectifs&#160;principaux l&#8217;efficience, l&#8217;optimisation de la qualit&#233; et de la s&#233;curit&#233; de la prise en charge du patient, et le respect de son droit &#224; l&#8217;information. Il vise &#224; garantir une r&#233;cup&#233;ration optimale&#160;du patient. Ce parcours int&#232;gre les activit&#233;s de pr&#233;vention et d&#8217;&#233;ducation &#224; la sant&#233;, l&#8217;&#233;ducation th&#233;rapeutique, la coordination des acteurs, l&#8217;accompagnement du patient aux soins et sa r&#233;habilitation.</p><p style=\"text-align: justify;\">La structuration de l&#8217;&#233;pisode de soins (&#233;pisode/phase d&#8217;une maladie aigu&#235;) ou du parcours de soins (pathologie chronique) est centr&#233;e sur le patient. Elle est modul&#233;e selon qu&#8217;il s&#8217;agisse d&#8217;une&#160;pathologie&#160;aigu&#235;&#160;ou chronique, afin d&#8217;apporter une r&#233;ponse&#160;personnalis&#233;e et adapt&#233;e&#160;aux besoins du patient.</p>",
    "exposeSommaire": "<p style=\"text-align: justify;\">Une d&#233;finition du parcours de soins (ou de sant&#233;) rigoureuse et &#233;tay&#233;e est un pr&#233;alable indispensable &#224; la mise en &#339;uvre d&#8217;exp&#233;rimentations de qualit&#233;.</p><p style=\"text-align: justify;\">Cette d&#233;finition propos&#233;e dans cet amendement s&#8217;inscrit pleinement dans l&#8217;esprit de la Strat&#233;gie Nationale de Sant&#233; impuls&#233;e par Agn&#232;s Buzyn, visant &#224; promouvoir la qualit&#233; des pratiques et l&#8217;innovation organisationnelle.</p>"
  },
  "representations": [
    {
      "nom": "PDF",
      "typeMime": {
        "type": "application",
        "subType": "PDF"
      },
      "statutRepresentation": {
        "verbatim": true,
        "canonique": true,
        "officielle": true,
        "transcription": false,
        "enregistrement": false
      },
      "contenu": {
        "documentURI": "/15/amendements/0269/CION-SOC/AS103.pdf"
      }
    }
  ],
  "dateDepot": "2017-10-13T02:00:00.000+02:00",
  "article99": "0",
  "loiReference": {}
}