{
  "uid": "AMANR5L15PO420120B2296P0D1N1",
  "identifiant": {
    "legislature": "15",
    "numero": "1",
    "numRect": "0",
    "saisine": {
      "texteLegislatifRef": "PRJLANR5L15B2296",
      "numeroPartiePLF": "0",
      "organeExamen": "PO420120",
      "mentionSecondeDeliberation": "0"
    }
  },
  "numeroLong": "AS1",
  "etapeTexte": "1ère lecture (1ère assemblée saisie)",
  "triAmendement": "apaaaaaaaaaaaaaaaaaaaaaaaaaaaaaaaaaaaaaaaaaaaaaaaai",
  "cardinaliteAmdtMultiples": "1",
  "etat": "Discuté",
  "signataires": {
    "auteur": {
      "typeAuteur": "Depute",
      "acteurRef": "PA717379",
      "groupePolitiqueRef": "PO730964"
    },
    "cosignatairesRefs": [
      "PA720932",
      "PA717379",
      "PA718876"
    ],
    "texteAffichable": "M.&#160;Maillard,  M.&#160;Da Silva et M.&#160;Besson-Moreau"
  },
  "pointeurFragmentTexte": {
    "division": {
      "titre": "Article 7",
      "articleDesignationCourte": "ART. 7",
      "type": "ARTICLE",
      "avantAApres": "A",
      "divisionRattachee": "ARTICLE 7",
      "urlDivisionTexteVise": "/15/textes/2296.asp#D_Article_7"
    },
    "alinea": {
      "avantAApres": "Apres",
      "numero": "13"
    }
  },
  "corps": {
    "dispositif": "<p style=\"text-align: justify;\">&#160;</p><p style=\"text-align: justify;\">I.&#160;&#8211;&#160;Apr&#232;s l&#8217;alin&#233;a&#160;13, ins&#233;rer l&#8217;alin&#233;a suivant&#160;:</p><p style=\"text-align: justify;\">&#171;&#160;V <i><i>bis</i>&#160;</i>&#8211;&#160;Pour les entreprises de moins de 11 salari&#233;s, l&#8217;employeur est autoris&#233; &#224; attribuer une fois par an, &#224; l&#8217;ensemble des salari&#233;s qu&#8217;il emploie, la prime exceptionnelle de pouvoir d&#8217;achat, dans les conditions pr&#233;vues au V.&#160;&#187;</p><p style=\"text-align: justify;\">II.&#160;&#8211;&#160;En cons&#233;quence, compl&#233;ter cet article par les deux alin&#233;as suivants&#160;:</p><p style=\"text-align: justify;\">&#171;&#160;II.&#160;&#8211;&#160;La perte de recettes pour l&#8217;&#201;tat est compens&#233;e &#224; due concurrence par la cr&#233;ation d&#8217;une taxe additionnelle aux droits mentionn&#233;s aux articles 575 et 575 A du code g&#233;n&#233;ral des imp&#244;ts.</p><p style=\"text-align: justify;\">&#171;&#160;III.&#160;&#8211;&#160;La perte de recettes pour les organismes de s&#233;curit&#233; sociale est compens&#233;e &#224; due concurrence par la majoration des droits mentionn&#233;s aux articles 575 et 575 A du code g&#233;n&#233;ral des imp&#244;ts.&#160;&#187;.</p>",
    "exposeSommaire": "<p style=\"text-align: justify;\">La mise en place d&#8217;un accord d&#8217;int&#233;ressement dans les entreprises de moins de 11 salari&#233;s se heurte &#224; de nombreux obstacles d&#8217;ordre technique et financier.</p><p style=\"text-align: justify;\">C&#8217;est pourquoi, cet amendement vise &#224; ne pas conditionner, pour les employeurs de moins de 11 salari&#233;s le versement de la prime exceptionnelle de pouvoir d&#8217;achat &#224; la mise en place d&#8217;un accord d&#8217;int&#233;ressement.</p><p style=\"text-align: justify;\">Autrement dit et afin que les salari&#233;s des entreprises employant moins de 11 salari&#233;s ne soient pas &#233;cart&#233;s de la mesure du Gouvernement, le pr&#233;sent amendement propose de cr&#233;er la possibilit&#233; pour l&#8217;employeur d&#8217;accorder la prime exceptionnelle, d&#8217;un montant laiss&#233; &#224; l&#8217;appr&#233;ciation du chef d&#8217;entreprise et exon&#233;r&#233;e dans la limite de 1000&#160;euros par b&#233;n&#233;ficiaire, d&#8217;imp&#244;t sur le revenu et de toute cotisation et contribution sociale.</p><p style=\"text-align: justify;\">La condition de mise en place d&#8217;un accord d&#8217;int&#233;ressement doit &#234;tre limit&#233;e aux entreprises de 11 salari&#233;s et plus.</p>"
  },
  "representations": [
    {
      "nom": "PDF",
      "typeMime": {
        "type": "application",
        "subType": "PDF"
      },
      "statutRepresentation": {
        "verbatim": true,
        "canonique": true,
        "officielle": true,
        "transcription": false,
        "enregistrement": false
      },
      "contenu": {
        "documentURI": "/15/amendements/2296/CION-SOC/AS1.pdf"
      }
    }
  ],
  "sort": {
    "dateSaisie": "2019-10-15T21:49:05.000+02:00",
    "sortEnSeance": "Retiré"
  },
  "dateDepot": "2019-10-10T02:00:00.000+02:00",
  "dateDistribution": "2019-10-15T02:00:00.000+02:00",
  "article99": "0",
  "loiReference": {}
}