{
  "uid": "AMANR5L15SEA717460BTC1175P0D1N907",
  "identifiant": {
    "legislature": "15",
    "numero": "907",
    "numRect": "0",
    "saisine": {
      "texteLegislatifRef": "PRJLANR5L15BTC1175",
      "numeroPartiePLF": "0",
      "organeExamen": "PO717460",
      "mentionSecondeDeliberation": "0"
    }
  },
  "numeroLong": "907",
  "etapeTexte": "Nouvelle Lecture",
  "triAmendement": "lkaaaaaaaaaaaaaaaaaaaaaaaaaaaaaaaaaaaaaaaaaaaaaaaar",
  "cardinaliteAmdtMultiples": "1",
  "etat": "Discuté",
  "signataires": {
    "auteur": {
      "typeAuteur": "Depute",
      "acteurRef": "PA335999",
      "groupePolitiqueRef": "PO723569"
    },
    "cosignatairesRefs": [
      "PA335999"
    ],
    "texteAffichable": "Mme&#160;Batho"
  },
  "pointeurFragmentTexte": {
    "division": {
      "titre": "Article 14 ter",
      "articleDesignationCourte": "ART. 14 TER",
      "type": "ARTICLE",
      "avantAApres": "A",
      "divisionRattachee": "ARTICLE 14 TER",
      "urlDivisionTexteVise": "/15/textes/1175.asp#D_Article_14_ter"
    },
    "alinea": {
      "numero": "1"
    }
  },
  "corps": {
    "dispositif": "<p>&#192; la seconde phrase, supprimer les mots : </p><p>&#171; dans l&#8217;&#233;tat dans lequel elles sont consomm&#233;es &#187;.</p>",
    "exposeSommaire": "<p style=\"text-align: justify;\">L&#8217;article&#160;14 <i>ter</i> adopt&#233; en premi&#232;re lecture par l&#8217;Assembl&#233;e nationale visait &#224; simplifier drastiquement l&#8217;autorisation de l&#8217;usage des PNPP lorsqu&#8217;il s&#8217;agit de pr&#233;parations r&#233;alis&#233;es &#224; partir des parties consommables de plantes utilis&#233;es en alimentation humaine ou animale. Il convient par le pr&#233;sent amendement de revenir &#224; cette r&#233;daction sans ajouter une mention source de difficult&#233;s d&#8217;interpr&#233;tation et qui aboutirait &#224; supprimer ladite disposition l&#233;gislative de sa port&#233;e.</p>"
  },
  "representations": [
    {
      "nom": "PDF",
      "typeMime": {
        "type": "application",
        "subType": "PDF"
      },
      "statutRepresentation": {
        "verbatim": true,
        "canonique": true,
        "officielle": true,
        "transcription": false,
        "enregistrement": false
      },
      "contenu": {
        "documentURI": "/15/amendements/1175/AN/907.pdf"
      }
    }
  ],
  "seanceDiscussion": "RUANR5L15S2018IDS21237",
  "sort": {
    "dateSaisie": "2018-09-14T23:22:25.000+02:00",
    "sortEnSeance": "Rejeté"
  },
  "dateDepot": "2018-09-08T02:00:00.000+02:00",
  "dateDistribution": "2018-09-11T02:00:00.000+02:00",
  "article99": "0",
  "loiReference": {}
}