{
  "uid": "AMANR5L15SEA717460BTC0765P0D1N143",
  "identifiant": {
    "legislature": "15",
    "numero": "143",
    "numRect": "0",
    "saisine": {
      "texteLegislatifRef": "PRJLANR5L15BTC0765",
      "numeroPartiePLF": "0",
      "organeExamen": "PO717460",
      "mentionSecondeDeliberation": "0"
    }
  },
  "numeroLong": "143",
  "etapeTexte": "1ère lecture (1ère assemblée saisie)",
  "triAmendement": "bc",
  "cardinaliteAmdtMultiples": "1",
  "etat": "Discuté",
  "signataires": {
    "auteur": {
      "typeAuteur": "Rapporteur",
      "acteurRef": "PA719480",
      "organeRef": "PO59048",
      "groupePolitiqueRef": "PO730964"
    },
    "cosignatairesRefs": [
      "PA719480"
    ],
    "texteAffichable": "M.&#160;Gaillard, rapporteur pour avis au nom de la commission des finances"
  },
  "pointeurFragmentTexte": {
    "division": {
      "titre": "Article 6",
      "articleDesignationCourte": "ART. 6",
      "type": "ARTICLE",
      "avantAApres": "A",
      "divisionRattachee": "ARTICLE 6",
      "urlDivisionTexteVise": "/15/textes/0765.asp#D_Article_6"
    },
    "alinea": {
      "avantAApres": "A",
      "numero": "1",
      "alineaDesignation": "Alinéa 1"
    }
  },
  "corps": {
    "dispositif": "<p style=\"text-align: justify;\">I.&#160;&#8211;&#160;&#192; la premi&#232;re phrase, substituer aux mots&#160;:</p><p style=\"text-align: justify;\">&#171;&#160;l&#8217;une sera mise en &#339;uvre&#160;&#187;</p><p style=\"text-align: justify;\">les mots&#160;:</p><p style=\"text-align: justify;\">&#171;&#160;la premi&#232;re sera pr&#233;sent&#233;e au Parlement&#160;&#187;.</p><p style=\"text-align: justify;\">II.&#160;&#8211;&#160;En cons&#233;quence, r&#233;diger ainsi le d&#233;but de la deuxi&#232;me phrase&#160;:</p><p>&#171;&#160;Celle-ci aura ... <i>(le reste sans changement)</i>&#160;&#187;.</p>",
    "exposeSommaire": "<p style=\"text-align: justify;\">Cet amendement a pour objet de clarifier la r&#233;daction du pr&#233;sent article.</p>"
  },
  "representations": [
    {
      "nom": "PDF",
      "typeMime": {
        "type": "application",
        "subType": "PDF"
      },
      "statutRepresentation": {
        "verbatim": true,
        "canonique": true,
        "officielle": true,
        "transcription": false,
        "enregistrement": false
      },
      "contenu": {
        "documentURI": "/15/amendements/0765/AN/143.pdf"
      }
    }
  ],
  "seanceDiscussion": "RUANR5L15S2018IDS20956",
  "sort": {
    "dateSaisie": "2018-03-22T16:47:04.000+01:00",
    "sortEnSeance": "Rejeté"
  },
  "dateDepot": "2018-03-16T01:00:00.000+01:00",
  "dateDistribution": "2018-03-19T01:00:00.000+01:00",
  "article99": "0",
  "loiReference": {}
}