{
  "uid": "AMANR5L15SEA717460BTC2401P0D1N1617",
  "identifiant": {
    "legislature": "15",
    "numero": "1617",
    "numRect": "0",
    "saisine": {
      "texteLegislatifRef": "PRJLANR5L15BTC2401",
      "numeroPartiePLF": "0",
      "organeExamen": "PO717460",
      "mentionSecondeDeliberation": "0"
    }
  },
  "numeroLong": "1617",
  "etapeTexte": "1ère lecture (2ème assemblée saisie)",
  "triAmendement": "aioaaaaaaaaaaaaaaaaaaaaaaaaaaaaaaaaaaaaaaaaaaaaaaahzp",
  "cardinaliteAmdtMultiples": "1",
  "amendementParent": "AMANR5L15SEA717460BTC2401P0D1N1257",
  "etat": "Retiré",
  "signataires": {
    "auteur": {
      "typeAuteur": "Depute",
      "acteurRef": "PA677483",
      "groupePolitiqueRef": "PO730964"
    },
    "cosignatairesRefs": [
      "PA677483",
      "PA721584",
      "PA721542"
    ],
    "texteAffichable": "M.&#160;Mazars,  M.&#160;Terlier et Mme&#160;Verdier-Jouclas"
  },
  "pointeurFragmentTexte": {
    "division": {
      "titre": "Article 3",
      "articleDesignationCourte": "ART. 3",
      "type": "ARTICLE",
      "avantAApres": "A",
      "divisionRattachee": "ARTICLE 3",
      "urlDivisionTexteVise": "/15/textes/2401.asp#D_Article_3"
    },
    "alinea": {
      "avantAApres": "Apres",
      "numero": "6"
    }
  },
  "corps": {},
  "representations": [
    {
      "nom": "PDF",
      "typeMime": {
        "type": "application",
        "subType": "PDF"
      },
      "statutRepresentation": {
        "verbatim": true,
        "canonique": true,
        "officielle": true,
        "transcription": false,
        "enregistrement": false
      },
      "contenu": {
        "documentURI": "/15/amendements/2401/AN/1617.pdf"
      }
    }
  ],
  "dateDepot": "2019-11-18T01:00:00.000+01:00",
  "dateDistribution": "2019-11-18T01:00:00.000+01:00",
  "article99": "0",
  "loiReference": {}
}