{
  "uid": "AMANR5L15PO419865B2274P0D1N960",
  "identifiant": {
    "legislature": "15",
    "numero": "960",
    "numRect": "0",
    "saisine": {
      "texteLegislatifRef": "PRJLANR5L15B2274",
      "numeroPartiePLF": "0",
      "organeExamen": "PO419865",
      "mentionSecondeDeliberation": "0"
    }
  },
  "numeroLong": "CD960",
  "etapeTexte": "1ère lecture (2ème assemblée saisie)",
  "triAmendement": "aiaaaaaaaaaaaaaaaaaaaaaaaaaaaaaaaaaaaaaaaaaaaaaaaabo",
  "cardinaliteAmdtMultiples": "1",
  "etat": "En traitement",
  "signataires": {
    "auteur": {
      "typeAuteur": "Depute",
      "acteurRef": "PA720334",
      "groupePolitiqueRef": "PO730970"
    },
    "cosignatairesRefs": [
      "PA721976",
      "PA720764",
      "PA720334"
    ],
    "texteAffichable": "M.&#160;Pahun,  M.&#160;Millienne et Mme&#160;Lasserre"
  },
  "pointeurFragmentTexte": {
    "division": {
      "titre": "Article 1er AE",
      "articleDesignationCourte": "APRÈS ART. 1ER AE",
      "type": "ARTICLE",
      "avantAApres": "Apres",
      "divisionRattachee": "APRÈS L'ARTICLE 1ER AE, insérer l'article suivant:",
      "articleAdditionnel": "1",
      "urlDivisionTexteVise": "/15/textes/2274.asp#D_Article_1er_AE"
    }
  },
  "corps": {
    "dispositif": "<p style=\"text-align: justify;\">Apr&#232;s le premier alin&#233;a de l&#8217;article L.&#160;101&#8209;2 du code de l&#8217;urbanisme, il est ins&#233;r&#233; un 1&#176;&#160;A ainsi r&#233;dig&#233;&#160;: </p><p style=\"text-align: justify;\">&#171;&#160;1&#176;&#160;A&#160;Z&#233;ro artificialisation nette en 2030&#160;;&#160;&#187;.</p>",
    "exposeSommaire": "<p style=\"text-align: justify;\">Le pr&#233;sent amendement vise &#224; ajouter l&#8217;objectif de &#171;&#160;z&#233;ro artificialisation nette&#160;&#187; aux objectifs poursuivis par les collectivit&#233;s publiques en mati&#232;re d&#8217;urbanisme. Il reprend en cela l&#8217;objectif &#233;nonc&#233; dans le Plan Biodiversit&#233; pr&#233;sent&#233; en juillet 2018.</p><p style=\"text-align: justify;\">L&#8217;usage responsable des sols est une composante essentielle de l&#8217;&#233;conomie circulaire puisque celle-ci repose sur une consommation plus sobre des ressources naturelles (art. L110&#8209;1-1 du code de l&#8217;environnement).</p><p style=\"text-align: justify;\">Il est urgent de conforter l&#8217;objectif de &#171;&#160;z&#233;ro artificialisation nette&#160;&#187; car si rien n&#8217;est fait ceux sont 280 000 hectares d&#8217;espaces naturels suppl&#233;mentaires qui seront artificialis&#233;s d&#8217;ici 2030 (France Strat&#233;gie, 2019). L&#8217;atteinte de cet objectif en 2030 est possible selon cette m&#234;me &#233;tude. Elle n&#233;cessitera des mesures certes ambitieuses mais n&#233;cessaires.</p>",
    "cartoucheDelaiDepotDepasse": "Sous réserve de son traitement par les services de l'Assemblée nationale et de sa recevabilité"
  },
  "representations": [
    {
      "nom": "PDF",
      "typeMime": {
        "type": "application",
        "subType": "PDF"
      },
      "statutRepresentation": {
        "verbatim": true,
        "canonique": true,
        "officielle": true,
        "transcription": false,
        "enregistrement": false
      },
      "contenu": {
        "documentURI": "/15/amendements/2274/CION-DVP/CD960.pdf"
      }
    }
  ],
  "dateDepot": "2019-11-20T01:00:00.000+01:00",
  "article99": "0",
  "loiReference": {
    "codeLoi": "c urbanisme",
    "divisionCodeLoi": "L101-2"
  }
}