{
  "uid": "AMANR5L15SEA717460BTC0164P0D1N218",
  "identifiant": {
    "legislature": "15",
    "numero": "218",
    "numRect": "0",
    "saisine": {
      "texteLegislatifRef": "PRJLANR5L15BTC0164",
      "numeroPartiePLF": "0",
      "organeExamen": "PO717460",
      "mentionSecondeDeliberation": "0"
    }
  },
  "numeroLong": "218",
  "etapeTexte": "1ère lecture (2ème assemblée saisie)",
  "triAmendement": "fkl",
  "cardinaliteAmdtMultiples": "1",
  "etat": "Discuté",
  "signataires": {
    "auteur": {
      "typeAuteur": "Depute",
      "acteurRef": "PA330240",
      "groupePolitiqueRef": "PO730934"
    },
    "cosignatairesRefs": [
      "PA642847",
      "PA606098",
      "PA2086",
      "PA721678",
      "PA605036",
      "PA2492",
      "PA721286",
      "PA720684",
      "PA330240",
      "PA267429",
      "PA334654",
      "PA721314",
      "PA223837",
      "PA346218",
      "PA334843",
      "PA643134",
      "PA721968",
      "PA267527",
      "PA2155",
      "PA718780",
      "PA267785",
      "PA718784",
      "PA721636",
      "PA267794",
      "PA346054",
      "PA267260",
      "PA998",
      "PA712015",
      "PA718838",
      "PA267318",
      "PA718884",
      "PA608826"
    ],
    "texteAffichable": "M.&#160;Ciotti,  M.&#160;Larriv&#233;, M.&#160;Marleix, M.&#160;Abad, M.&#160;Bazin, M.&#160;Masson, M.&#160;Verch&#232;re, M.&#160;Grelier, M.&#160;Ramadier, M.&#160;Brochand, M.&#160;Straumann, M.&#160;Cinieri, Mme&#160;Duby-Muller, Mme&#160;Poletti, M.&#160;Pierre-Henri&#160;Dumont, M.&#160;Brun, M.&#160;Saddier, M.&#160;Dive, M.&#160;Quentin, M.&#160;Menuel, Mme&#160;Trastour-Isnart, M.&#160;Pauget, M.&#160;Schellenberger, Mme&#160;Valentin, M.&#160;Reda, M.&#160;Marlin, Mme&#160;Bazin-Malgras, M.&#160;Dassault, M.&#160;Vialay, M.&#160;Emmanuel&#160;Maquet, M.&#160;Parigi et Mme&#160;Tabarot"
  },
  "pointeurFragmentTexte": {
    "division": {
      "titre": "Article 7 bis",
      "articleDesignationCourte": "APRÈS ART. 7 BIS",
      "type": "ARTICLE",
      "avantAApres": "Apres",
      "divisionRattachee": "APRÈS L'ARTICLE 7 BIS, insérer l'article suivant:",
      "articleAdditionnel": "1",
      "urlDivisionTexteVise": "/15/textes/0164.asp#D_Article_7_bis"
    }
  },
  "corps": {
    "dispositif": "<p style=\"text-align: justify;\">Le titre&#160;II du livre&#160;II du code de la s&#233;curit&#233; int&#233;rieure est compl&#233;t&#233; par un chapitre&#160;X ainsi r&#233;dig&#233;&#160;:</p><p style=\"text-align: justify;\">&#171;&#160;CHAPITRE IV</p><p style=\"text-align: justify;\">&#171;&#160;Interdiction d&#8217;entr&#233;e sur le territoire</p><p style=\"text-align: justify;\">&#171;&#160;<i>Art.&#160;L.&#160;22-10-1</i>.&#160;&#8211;&#160;Lorsqu&#8217;il existe des raisons s&#233;rieuses de penser qu&#8217;un individu binational s&#8217;est rendu sur un th&#233;&#226;tre d&#8217;op&#233;rations de groupements terroristes dans des conditions susceptibles de le conduire &#224; porter atteinte &#224; la s&#233;curit&#233; publique lors de son retour sur le territoire fran&#231;ais il peut faire l&#8217;objet d&#8217;une interdiction d&#8217;entr&#233;e sur le territoire.</p><p style=\"text-align: justify;\">&#171;&#160;L&#8217;interdiction d&#8217;entr&#233;e sur le territoire est prononc&#233;e par le ministre de l&#8217;int&#233;rieur pour une dur&#233;e maximale de six mois &#224; compter de sa notification. La d&#233;cision est &#233;crite et motiv&#233;e. Le ministre de l&#8217;int&#233;rieur ou son repr&#233;sentant met la personne concern&#233;e en mesure de lui pr&#233;senter ses observations dans un d&#233;lai maximal de huit jours apr&#232;s la notification de la d&#233;cision. Cette personne peut se faire assister par un conseil ou repr&#233;senter par un mandataire de son choix.</p><p style=\"text-align: justify;\">&#171;&#160;Lorsque les conditions en sont r&#233;unies, l&#8217;interdiction d&#8217;entr&#233;e sur le territoire peut &#234;tre renouvel&#233;e par d&#233;cision expresse et motiv&#233;e. Elle est lev&#233;e aussit&#244;t que ces conditions ne sont plus satisfaites.</p><p style=\"text-align: justify;\">&#171;&#160;La personne qui fait l&#8217;objet d&#8217;une interdiction d&#8217;entr&#233;e sur le territoire peut, dans le d&#233;lai de deux mois suivant la notification de la d&#233;cision et suivant la notification de chaque renouvellement, demander au tribunal administratif l&#8217;annulation de cette d&#233;cision. Le tribunal administratif statue dans un d&#233;lai de quatre mois &#224; compter de sa saisine. Ces recours s&#8217;exercent sans pr&#233;judice des proc&#233;dures ouvertes aux articles L.&#160;521&#8209;1 et L.&#160;521&#8209;2 du code de justice administrative.</p><p style=\"text-align: justify;\">&#171;&#160;L&#8217;interdiction d&#8217;entr&#233;e sur le territoire emporte d&#232;s son prononc&#233; et &#224; titre conservatoire l&#8217;invalidation du passeport et de la carte nationale d&#8217;identit&#233; de la personne concern&#233;e ou, le cas &#233;ch&#233;ant, fait obstacle &#224; la d&#233;livrance d&#8217;un tel document. L&#8217;autorit&#233; administrative informe la personne concern&#233;e par tout moyen.</p><p style=\"text-align: justify;\">&#171;&#160;D&#232;s notification de l&#8217;interdiction d&#8217;entr&#233;e sur le territoire, et au plus tard dans les vingt-quatre heures &#224; compter de celle-ci, la personne concern&#233;e est tenue de restituer son passeport et sa carte nationale d&#8217;identit&#233;.</p><p style=\"text-align: justify;\">&#171;&#160;Un r&#233;c&#233;piss&#233; valant justification de son identit&#233; est remis &#224; la personne concern&#233;e en &#233;change de la restitution de son passeport et de sa carte nationale d&#8217;identit&#233; ou, &#224; sa demande, en lieu et place de la d&#233;livrance d&#8217;un tel document.</p><p style=\"text-align: justify;\">&#171;&#160;Le fait de quitter ou de tenter d&#8217;entrer sur le territoire fran&#231;ais en violation d&#8217;une interdiction d&#8217;entr&#233;e sur le territoire prise en application du pr&#233;sent article est puni de trois ans d&#8217;emprisonnement et de 45&#160;000&#160;&#8364; d&#8217;amende.</p><p style=\"text-align: justify;\">&#171;&#160;Le fait, pour toute personne s&#8217;&#233;tant vu notifier une d&#233;cision d&#8217;interdiction d&#8217;entr&#233;e sur le territoire, de se soustraire &#224; l&#8217;obligation de restitution de son passeport et de sa carte nationale d&#8217;identit&#233; est puni de deux ans d&#8217;emprisonnement et de 4&#160;500&#160;&#8364; d&#8217;amende.</p><p style=\"text-align: justify;\">&#171;&#160;Un d&#233;cret en Conseil d&#8217;&#201;tat pr&#233;cise les modalit&#233;s de mise en &#339;uvre du pr&#233;sent article.&#160;&#187;</p>",
    "exposeSommaire": "<p style=\"text-align: justify;\">Le pr&#233;sent amendement vise, sur le mod&#232;le du &#171;&#160;passport ban&#160;&#187; mis en place par le Royaume&#8211;Uni, &#224; interdire l&#8217;entr&#233;e sur le territoire d&#8217;un individu bi-national&#160;lorsqu&#8217;il existe des raisons s&#233;rieuses de penser qu&#8217;il s&#8217;est rendu sur un th&#233;&#226;tre d&#8217;op&#233;rations de groupements terroristes dans des conditions susceptibles de le conduire &#224; porter atteinte &#224; la s&#233;curit&#233; publique lors de son retour sur le territoire fran&#231;ais.</p><p style=\"text-align: justify;\">Cette mesure administrative ne le rend pas apatride s&#8217;il est Fran&#231;ais puisqu&#8217;il ne s&#8217;agit en aucun cas d&#8217;une d&#233;ch&#233;ance de nationalit&#233;. Elle restreint sa libert&#233; d&#8217;aller et venir afin de pr&#233;server la s&#233;curit&#233; publique.</p>"
  },
  "representations": [
    {
      "nom": "PDF",
      "typeMime": {
        "type": "application",
        "subType": "PDF"
      },
      "statutRepresentation": {
        "verbatim": true,
        "canonique": true,
        "officielle": true,
        "transcription": false,
        "enregistrement": false
      },
      "contenu": {
        "documentURI": "/15/amendements/0164/AN/218.pdf"
      }
    }
  ],
  "seanceDiscussion": "RUANR5L15S2017IDS20675",
  "sort": {
    "dateSaisie": "2017-09-28T15:14:54.000+02:00",
    "sortEnSeance": "Rejeté"
  },
  "dateDepot": "2017-09-21T02:00:00.000+02:00",
  "dateDistribution": "2017-09-25T02:00:00.000+02:00",
  "article99": "0",
  "loiReference": {
    "codeLoi": "c sécurité intérieure",
    "divisionCodeLoi": "L2210"
  }
}