{
  "uid": "AMANR5L15PO420120B0237P0D1N88",
  "identifiant": {
    "legislature": "15",
    "numero": "88",
    "numRect": "0",
    "saisine": {
      "texteLegislatifRef": "PRJLANR5L15B0237",
      "numeroPartiePLF": "0",
      "organeExamen": "PO420120",
      "mentionSecondeDeliberation": "0"
    }
  },
  "numeroLong": "AS88",
  "etapeTexte": "1ère lecture (1ère assemblée saisie)",
  "triAmendement": "galr",
  "cardinaliteAmdtMultiples": "1",
  "etat": "Discuté",
  "signataires": {
    "auteur": {
      "typeAuteur": "Depute",
      "acteurRef": "PA719930",
      "groupePolitiqueRef": "PO730946"
    },
    "cosignatairesRefs": [
      "PA608172",
      "PA508",
      "PA335532",
      "PA643145",
      "PA342415",
      "PA333818",
      "PA335999",
      "PA335054",
      "PA588886",
      "PA609332",
      "PA332614",
      "PA330357",
      "PA1198",
      "PA610681",
      "PA405480",
      "PA607553",
      "PA1008",
      "PA608695",
      "PA1592",
      "PA719930",
      "PA337483",
      "PA333285",
      "PA720988",
      "PA609590",
      "PA605069",
      "PA429893",
      "PA267233",
      "PA642764",
      "PA608011",
      "PA1809",
      "PA340343"
    ],
    "texteAffichable": "M.&#160;Vallaud,  M.&#160;Aviragnet, Mme&#160;Bareigts, Mme&#160;Vainqueur-Christophe, Mme&#160;Batho, Mme&#160;Battistel, Mme&#160;Bi&#233;mouret, M.&#160;Bouillon, M.&#160;Jean-Louis&#160;Bricout, M.&#160;Carvounas, M.&#160;Alain&#160;David, Mme&#160;Laurence&#160;Dumont, M.&#160;Dussopt, M.&#160;Faure, M.&#160;Garot, M.&#160;David&#160;Habib, M.&#160;Hutin, M.&#160;Juanico, Mme&#160;Karamanli, M.&#160;J&#233;r&#244;me&#160;Lambert, M.&#160;Le Foll, M.&#160;Letchimy, Mme&#160;Manin, Mme&#160;Pau-Langevin, Mme&#160;Pires Beaune, M.&#160;Potier, M.&#160;Pueyo, M.&#160;Pupponi, Mme&#160;Rabault, M.&#160;Saulignac et Mme&#160;Untermaier"
  },
  "pointeurFragmentTexte": {
    "division": {
      "titre": "Article unique",
      "articleDesignationCourte": "APRÈS ART. UNIQUE",
      "type": "ARTICLE",
      "avantAApres": "Apres",
      "divisionRattachee": "APRÈS L'ARTICLE UNIQUE, insérer l'article suivant:",
      "articleAdditionnel": "1",
      "urlDivisionTexteVise": "/15/textes/0237.asp#D_Article_unique"
    }
  },
  "corps": {
    "dispositif": "<p style=\"text-align: justify;\">&#192; l&#8217;article L.&#160;1225&#8209;71&#160;du code du travail, dans sa r&#233;daction r&#233;sultant de l&#8217;article&#160;3 de l&#8217;ordonnance&#160;n&#176;&#160;2017&#8209;1387 du 22&#160;septembre&#160;2017 relative &#224; la pr&#233;visibilit&#233; et la s&#233;curisation des relations de travail, apr&#232;s le mot&#160;: &#171;&#160;indemnit&#233;&#160;&#187;, sont ins&#233;r&#233;s les mots&#160;: &#171;&#160;,qui ne peut &#234;tre inf&#233;rieure aux salaires des douze derniers mois de salaire,&#160;&#187;.</p>",
    "exposeSommaire": "<p>Par cet amendement il s'agit d'alourdir les sanctions applicables aux employeurs qui ne respectent pas leurs obligations&#160;relatives &#224; la protection de la grossesse et de la maternit&#233;.&#160;</p>"
  },
  "representations": [
    {
      "nom": "PDF",
      "typeMime": {
        "type": "application",
        "subType": "PDF"
      },
      "statutRepresentation": {
        "verbatim": true,
        "canonique": true,
        "officielle": true,
        "transcription": false,
        "enregistrement": false
      },
      "contenu": {
        "documentURI": "/15/amendements/0237/CION-SOC/AS88.pdf"
      }
    }
  ],
  "sort": {
    "dateSaisie": "2017-11-08T19:50:02.000+01:00",
    "sortEnSeance": "Rejeté"
  },
  "dateDepot": "2017-11-03T01:00:00.000+01:00",
  "dateDistribution": "2017-11-07T01:00:00.000+01:00",
  "article99": "0",
  "loiReference": {
    "codeLoi": "87.3",
    "divisionCodeLoi": "18"
  }
}