{
  "uid": "AMANR5L15PO59051B1802P0D1N167",
  "identifiant": {
    "legislature": "15",
    "numero": "167",
    "numRect": "0",
    "saisine": {
      "texteLegislatifRef": "PRJLANR5L15B1802",
      "numeroPartiePLF": "0",
      "organeExamen": "PO59051",
      "mentionSecondeDeliberation": "0"
    }
  },
  "numeroLong": "CL167",
  "etapeTexte": "1ère lecture (1ère assemblée saisie)",
  "triAmendement": "acaaaaaaaaaaaaaaaaaaaaaaaaaaaaaaaaaaaaaaaaaaaaaaaai",
  "cardinaliteAmdtMultiples": "1",
  "etat": "Discuté",
  "signataires": {
    "auteur": {
      "typeAuteur": "Depute",
      "acteurRef": "PA721270",
      "groupePolitiqueRef": "PO730940"
    },
    "cosignatairesRefs": [
      "PA721270",
      "PA718926",
      "PA441",
      "PA721012",
      "PA722110",
      "PA720546",
      "PA721118",
      "PA689",
      "PA335612",
      "PA722202",
      "PA720692",
      "PA718720",
      "PA267306",
      "PA721896",
      "PA610654",
      "PA610667"
    ],
    "texteAffichable": "M.&#160;Peu,  Mme&#160;Buffet, Mme&#160;Bello, M.&#160;Brotherson, M.&#160;Bruneel, M.&#160;Chassaigne, M.&#160;Dharr&#233;ville, M.&#160;Dufr&#232;gne, Mme&#160;Faucillon, M.&#160;Jumel, Mme&#160;K&#233;clard-Mond&#233;sir, M.&#160;Lecoq, M.&#160;Nilor, M.&#160;Fabien&#160;Roussel, M.&#160;Serville et M.&#160;Wulfranc"
  },
  "pointeurFragmentTexte": {
    "division": {
      "titre": "Article PREMIER",
      "articleDesignationCourte": "APRÈS ART. PREMIER",
      "type": "ARTICLE",
      "avantAApres": "Apres",
      "divisionRattachee": "APRÈS L'ARTICLE PREMIER, insérer l'article suivant:",
      "articleAdditionnel": "1",
      "urlDivisionTexteVise": "/15/textes/1802.asp#D_Article_1er"
    }
  },
  "corps": {
    "dispositif": "<p style=\"text-align: justify;\">I.&#160;&#8211;&#160;Le deuxi&#232;me alin&#233;a de l&#8217;article&#160;9 <i>ter</i> de la loi n&#176;&#160;83&#8209;634 du 13 juillet 1983 portant droits et obligations des fonctionnaires est compl&#233;t&#233; par une phrase ainsi r&#233;dig&#233;e&#160;:</p><p style=\"text-align: justify;\">&#171;&#160;Lorsque le Conseil commun de la fonction publique est consult&#233; sur des projets de loi ou d&#8217;ordonnance, les proc&#232;s-verbaux de la s&#233;ance sont annex&#233;s &#224; l&#8217;expos&#233; des motifs transmis au Parlement.&#160;&#187;</p><p style=\"text-align: justify;\">II.&#160;&#8211;&#160;Le premier alin&#233;a de l&#8217;article&#160;13 de la loi n&#176; 84&#8209;16 du 11 janvier 1984 portant dispositions statutaires relatives &#224; la fonction publique de l&#8217;&#201;tat est compl&#233;t&#233; par une phrase ainsi r&#233;dig&#233;e&#160;:</p><p style=\"text-align: justify;\">&#171;&#160;Lorsque le Conseil sup&#233;rieur de la fonction publique de l&#8217;&#201;tat est consult&#233; sur des projets de loi ou d&#8217;ordonnance, les proc&#232;s-verbaux de la s&#233;ance sont annex&#233;s &#224; l&#8217;expos&#233; des motifs transmis au Parlement.&#160;&#187;</p><p style=\"text-align: justify;\">III.&#160;&#8211;&#160;Le premier alin&#233;a de l&#8217;article&#160;9 de la loi n&#176; 84&#8209;53 du 26 janvier 1984 portant dispositions statutaires relatives &#224; la fonction publique territoriale est compl&#233;t&#233; par une phrase ainsi r&#233;dig&#233;e&#160;:</p><p style=\"text-align: justify;\">&#171;&#160;Lorsque le Conseil sup&#233;rieur de la fonction publique territoriale est consult&#233; sur des projets de loi ou d&#8217;ordonnance, les proc&#232;s-verbaux de la s&#233;ance sont annex&#233;s &#224; l&#8217;expos&#233; des motifs transmis au Parlement.&#160;&#187;</p><p style=\"text-align: justify;\">IV.&#160;&#8211;&#160;Le premier alin&#233;a de l&#8217;article&#160;12 de la loi n&#176; 86&#8209;33 du 9 janvier 1986 portant dispositions statutaires relatives &#224; la fonction publique hospitali&#232;re est compl&#233;t&#233; par une phrase ainsi r&#233;dig&#233;e&#160;:</p><p style=\"text-align: justify;\">&#171;&#160;Lorsque le Conseil sup&#233;rieur de la fonction publique hospitali&#232;re est consult&#233; sur des projets de loi ou d&#8217;ordonnance, les proc&#232;s-verbaux de la s&#233;ance sont annex&#233;s &#224; l&#8217;expos&#233; des motifs transmis au Parlement.&#160;&#187;</p>",
    "exposeSommaire": "<p>Cette amendement s&#8217;inspire de l&#8217;exemple allemand, o&#249; le l&#233;gislateur a pr&#233;vu que les propositions et avis des f&#233;d&#233;rations syndicales &#233;mis au moment de la pr&#233;paration des lois, d&#233;crets et r&#232;glements concernant les fonctionnaires, devaient &#234;tre ajout&#233;s en annexe de l&#8217;expos&#233; des motifs afin que le l&#233;gislateur puisse en prendre connaissance.</p><p>Les d&#233;put&#233;s communistes consid&#232;rent cette mesure utile pour les parlementaires qui seront mieux au fait des analyses et autres propositions des organisations syndicales concernant la fonction publique.</p>"
  },
  "representations": [
    {
      "nom": "PDF",
      "typeMime": {
        "type": "application",
        "subType": "PDF"
      },
      "statutRepresentation": {
        "verbatim": true,
        "canonique": true,
        "officielle": true,
        "transcription": false,
        "enregistrement": false
      },
      "contenu": {
        "documentURI": "/15/amendements/1802/CION_LOIS/CL167.pdf"
      }
    }
  ],
  "sort": {
    "dateSaisie": "2019-05-02T11:02:31.000+02:00",
    "sortEnSeance": "Rejeté"
  },
  "dateDepot": "2019-04-25T02:00:00.000+02:00",
  "dateDistribution": "2019-05-01T02:00:00.000+02:00",
  "article99": "0",
  "loiReference": {
    "codeLoi": "z1983-634",
    "divisionCodeLoi": "9 ter"
  }
}