{
  "uid": "AMANR5L15SEA717460BTC1237P0D1N2596",
  "identifiant": {
    "legislature": "15",
    "numero": "2596",
    "numRect": "0",
    "saisine": {
      "texteLegislatifRef": "PRJLANR5L15BTC1237",
      "numeroPartiePLF": "0",
      "organeExamen": "PO717460",
      "mentionSecondeDeliberation": "0"
    }
  },
  "numeroLong": "2596",
  "etapeTexte": "1ère lecture (1ère assemblée saisie)",
  "triAmendement": "bpaaaaaaaaaaaaaaaaaaaaaaaaaaaaaaaaaaaaaaaaaaaaaaaagu",
  "cardinaliteAmdtMultiples": "1",
  "etat": "Discuté",
  "signataires": {
    "auteur": {
      "typeAuteur": "Depute",
      "acteurRef": "PA721398",
      "groupePolitiqueRef": "PO730964"
    },
    "cosignatairesRefs": [
      "PA719024",
      "PA721398",
      "PA719790",
      "PA720108"
    ],
    "texteAffichable": "Mme&#160;Degois,  Mme&#160;Oppelt, M.&#160;Blanchet et M.&#160;Chalumeau"
  },
  "pointeurFragmentTexte": {
    "division": {
      "titre": "Article 19 ter",
      "articleDesignationCourte": "APRÈS ART. 19 TER",
      "type": "ARTICLE",
      "avantAApres": "Apres",
      "divisionRattachee": "APRÈS L'ARTICLE 19 TER, insérer l'article suivant:",
      "articleAdditionnel": "1",
      "urlDivisionTexteVise": "/15/textes/1237.asp#D_Article_19_ter"
    }
  },
  "corps": {
    "dispositif": "<p style=\"text-align: justify;\">La cinqui&#232;me phrase du douzi&#232;me alin&#233;a du I de l&#8217;article L.&#160;441&#8209;6 du code de commerce est ainsi r&#233;dig&#233;e&#160;: &#171;&#160;Les p&#233;nalit&#233;s de retard ainsi que l&#8217;indemnit&#233; forfaitaire pour frais de recouvrement sont exigibles sans qu&#8217;un rappel soit n&#233;cessaire et doivent faire l&#8217;objet d&#8217;une facturation &#224; compter du jour suivant la date de r&#232;glement figurant sur la facture&#160;&#187;.</p>",
    "exposeSommaire": "<p style=\"text-align: justify;\">Cet amendement vise &#224; rendre syst&#233;matique l&#8217;application de l&#8217;indemnit&#233; forfaitaire pour frais de recouvrement ainsi que les p&#233;nalit&#233;s de retard d&#232;s lors que la date de r&#232;glement des factures est d&#233;pass&#233;e afin de lutter contre les retards de paiements. Les derni&#232;res mesures prises ont permis le renforcement des moyens allou&#233;s &#224; la DGCCRF. A ce titre, en 2017, 230 proc&#233;dures d&#8217;amendes administratives ont ainsi &#233;t&#233; lanc&#233;es repr&#233;sentant pr&#232;s de 14,7 millions d&#8217;euros d&#8217;amendes.</p><p style=\"text-align: justify;\">L&#8217;application des frais de p&#233;nalit&#233; et de recouvrement n&#8217;est cependant pas suffisamment effective dans les entreprises. En effet, en raison d&#8217;enjeux commerciaux, il est compliqu&#233; pour une entreprise, en l&#8217;&#233;tat actuel du droit et de l&#8217;environnement concurrentiel difficile, de facturer ces frais &#224; ses clients. Aussi, il est propos&#233; que cette facturation des frais li&#233;s aux retards de paiement soit g&#233;n&#233;ralis&#233;e afin que toutes les entreprises appliquent les dispositions l&#233;gislatives visant &#224; faire respecter les d&#233;lais l&#233;gaux de paiement. L&#8217;objectif est de permettre aux entreprises de relancer par elles-m&#234;mes les soci&#233;t&#233;s d&#233;bitrices avec pour effet direct une diminution du nombre de retards de paiements et du nombre de dossiers &#224; traiter par la DGCCRF.</p>"
  },
  "representations": [
    {
      "nom": "PDF",
      "typeMime": {
        "type": "application",
        "subType": "PDF"
      },
      "statutRepresentation": {
        "verbatim": true,
        "canonique": true,
        "officielle": true,
        "transcription": false,
        "enregistrement": false
      },
      "contenu": {
        "documentURI": "/15/amendements/1237/AN/2596.pdf"
      }
    }
  ],
  "seanceDiscussion": "RUANR5L15S2018IDS21254",
  "sort": {
    "dateSaisie": "2018-09-28T15:08:41.000+02:00",
    "sortEnSeance": "Non soutenu"
  },
  "dateDepot": "2018-09-21T02:00:00.000+02:00",
  "dateDistribution": "2018-09-24T02:00:00.000+02:00",
  "article99": "0",
  "loiReference": {
    "codeLoi": "c commerce",
    "divisionCodeLoi": "L441-6"
  }
}