{
  "uid": "AMANR5L15SEA717460B2272P1D1N1063",
  "identifiant": {
    "legislature": "15",
    "numero": "1063",
    "numRect": "0",
    "saisine": {
      "texteLegislatifRef": "PRJLANR5L15B2272",
      "numeroPartiePLF": "1",
      "organeExamen": "PO717460",
      "mentionSecondeDeliberation": "0"
    }
  },
  "numeroLong": "I-1063",
  "etapeTexte": "1ère lecture (1ère assemblée saisie)",
  "triAmendement": "baaaaaaaaaaaaaaaaaaaaaaaaaaaaaaaaaaaaaaaaaaaaaaaaaarsau",
  "cardinaliteAmdtMultiples": "1",
  "etat": "Discuté",
  "signataires": {
    "auteur": {
      "typeAuteur": "Depute",
      "acteurRef": "PA720684",
      "groupePolitiqueRef": "PO730934"
    },
    "cosignatairesRefs": [
      "PA721816",
      "PA332523",
      "PA722390",
      "PA330684",
      "PA721678",
      "PA606098",
      "PA334149",
      "PA643103",
      "PA720684",
      "PA267260",
      "PA719272",
      "PA267429",
      "PA267204",
      "PA346218",
      "PA718850"
    ],
    "texteAffichable": "M.&#160;Pierre-Henri&#160;Dumont,  M.&#160;Reda, M.&#160;Boucard, Mme&#160;Corneloup, M.&#160;Sermier, Mme&#160;Meunier, M.&#160;Masson, Mme&#160;Poletti, M.&#160;Cordier, M.&#160;Cinieri, Mme&#160;Dalloz, M.&#160;Marleix, Mme&#160;Val&#233;rie&#160;Boyer, M.&#160;Ferrara et M.&#160;Fasquelle"
  },
  "pointeurFragmentTexte": {
    "division": {
      "titre": "Article 4",
      "articleDesignationCourte": "ART. 4",
      "type": "ARTICLE",
      "avantAApres": "A",
      "divisionRattachee": "ARTICLE 4",
      "urlDivisionTexteVise": "/15/textes/2272A.asp#D_Article_4"
    },
    "alinea": {
      "numero": "34"
    }
  },
  "corps": {
    "dispositif": "<p>I.&#160;&#8211;&#160;Compl&#233;ter l&#8217;alin&#233;a&#160;34 par les mots&#160;:</p><p style=\"text-align: justify;\">&#171;&#160;au moins &#233;gaux aux seuils suivants&#160;&#187;.</p><p style=\"text-align: justify;\">II.&#160;&#8211;&#160;En cons&#233;quence, supprimer l&#8217;alin&#233;a&#160;35.</p><p style=\"text-align: justify;\">III.&#160;&#8211;&#160;En cons&#233;quence, substituer aux alin&#233;as 37 &#224; 43 les deux alin&#233;as suivants&#160;:</p><p style=\"text-align: justify;\">&#171;&#160;Pour l&#8217;application du pr&#233;sent <i>a</i>, sont retenus les revenus de l&#8217;avant-derni&#232;re ann&#233;e pr&#233;c&#233;dant celle du paiement de la d&#233;pense ou, lorsque ces derniers sont inf&#233;rieurs &#224; ces seuils, les revenus de la derni&#232;re ann&#233;e pr&#233;c&#233;dant celle du paiement.</p><p style=\"text-align: justify;\">&#171;&#160;<i>b</i>. Dans les collectivit&#233;s r&#233;gies par l&#8217;article&#160;73 de la Constitution, les d&#233;penses mentionn&#233;es au 1, pay&#233;es &#224; compter du 1<sup>er</sup> janvier 2020, ouvrent droit au cr&#233;dit d&#8217;imp&#244;t lorsque les revenus du&#160; m&#233;nage, appr&#233;ci&#233;s dans les conditions du IV des articles 1391 B <i>ter</i> et 1417, sont au moins &#233;gaux &#224; un seuil d&#233;fini par d&#233;cret au titre de l&#8217;avant-derni&#232;re ann&#233;e pr&#233;c&#233;dant celle du paiement de la d&#233;pense.&#160;&#187;</p><p style=\"text-align: justify;\">IV.&#160;&#8211;&#160;En cons&#233;quence, substituer aux deux derni&#232;res phrases de l&#8217;alin&#233;a&#160;78 la phrase suivante&#160;:</p><p style=\"text-align: justify;\">&#171;&#160;Les caract&#233;ristiques et conditions d&#8217;octroi de cette prime sont d&#233;finies par d&#233;cret.&#160;&#187;</p><p style=\"text-align: justify;\">V.&#160;&#8211;&#160;Compl&#233;ter cet article par l&#8217;alin&#233;a suivant&#160;:</p><p style=\"text-align: justify;\">&#171;&#160;IV.&#160;&#8211;&#160;La perte de recettes pour l&#8217;&#201;tat r&#233;sultant du I est compens&#233;e &#224; due concurrence par la cr&#233;ation d&#8217;une taxe additionnelle aux droits pr&#233;vus aux articles 575 et 575 A du code g&#233;n&#233;ral des imp&#244;ts.</p><p>&#171;&#160;V.&#160;&#8211;&#160;Le I n&#8217;est applicable qu&#8217;aux sommes venant en d&#233;duction de l&#8217;imp&#244;t d&#251;.&#160;&#187;</p>",
    "exposeSommaire": "<p>L&#8217;article&#160;4 proroge pour un an le CITE (Cr&#233;dit d&#8217;Imp&#244;t pour la Transition Energ&#233;tique) en instaurant des conditions de revenus.</p><p style=\"text-align: justify;\">Le CITE arrivant &#224; &#233;ch&#233;ance au 31 d&#233;cembre 2019, il sera r&#233;parti comme suit&#160;:</p><p style=\"text-align: justify;\">-les m&#233;nages modestes b&#233;n&#233;ficieront d&#232;s le 1<sup>er</sup> janvier 2020, du remplacement du CITE par l&#8217;ANAH,</p><p style=\"text-align: justify;\">-les autres contribuables b&#233;n&#233;ficieront encore pour 2020 du CITE &#224; l&#8217;exception de ceux relevant des 9 et 10 &#232;me d&#233;ciles de revenus.</p><p style=\"text-align: justify;\">Pour information, le huiti&#232;me d&#233;cile correspond &#224; un revenu moyen de 2340&#160;euros par mois, le 9 &#232;me d&#233;cile &#224; 2800&#160;euros par mois et le dixi&#232;me d&#233;cile &#224; 4&#160;760&#160;euros euros par mois.</p><p style=\"text-align: justify;\">Or, le 9&#232;me d&#233;cile a un revenu moyen de 2800&#160;euros par mois. Il s&#8217;agit d&#8217;une classe moyenne, non d&#8217;une classe ais&#233;e. Les 9 &#232;me et 10 &#232;me d&#233;ciles repr&#233;sentent 20&#160;% de la population, alors m&#234;me que ces m&#233;nages repr&#233;sentaient en 2017 pr&#232;s de 50&#160;% du montant total du cr&#233;dit d&#8217;imp&#244;t.</p><p style=\"text-align: justify;\">Cet amendement a pour objet de conserver le b&#233;n&#233;fice du cr&#233;dit d&#8217;imp&#244;t pour la transition &#233;nerg&#233;tique (CITE) pour l&#8217;ann&#233;e 2020 pour l&#8217;ensemble des m&#233;nages, sans en exclure ceux dont les revenus seraient les plus &#233;lev&#233;s, en dissociant les conditions d&#8217;octroi de la prime de celles r&#233;gissant le CITE afin d&#8217;&#233;viter une charge pour les finances publiques au sens de l&#8217;article&#160;40.</p>"
  },
  "representations": [
    {
      "nom": "PDF",
      "typeMime": {
        "type": "application",
        "subType": "PDF"
      },
      "statutRepresentation": {
        "verbatim": true,
        "canonique": true,
        "officielle": true,
        "transcription": false,
        "enregistrement": false
      },
      "contenu": {
        "documentURI": "/15/amendements/2272A/AN/1063.pdf"
      }
    }
  ],
  "seanceDiscussion": "RUANR5L15S2020IDS21867",
  "sort": {
    "dateSaisie": "2019-10-17T19:25:29.000+02:00",
    "sortEnSeance": "Rejeté"
  },
  "dateDepot": "2019-10-09T02:00:00.000+02:00",
  "dateDistribution": "2019-10-15T02:00:00.000+02:00",
  "article99": "0",
  "loiReference": {}
}