{
  "uid": "AMANR5L15SEA717460BTC2243P0D1N521",
  "identifiant": {
    "legislature": "15",
    "numero": "521",
    "numRect": "0",
    "saisine": {
      "texteLegislatifRef": "PRJLANR5L15BTC2243",
      "numeroPartiePLF": "0",
      "organeExamen": "PO717460",
      "mentionSecondeDeliberation": "0"
    }
  },
  "numeroLong": "521",
  "etapeTexte": "1ère lecture (1ère assemblée saisie)",
  "triAmendement": "ebaaaaaaaaaaaaaaaaaaaaaaaaaaaaaaaaaaaaaaaaaaaaaaaahbdi",
  "cardinaliteAmdtMultiples": "1",
  "etat": "Discuté",
  "signataires": {
    "auteur": {
      "typeAuteur": "Depute",
      "acteurRef": "PA608416",
      "groupePolitiqueRef": "PO730934"
    },
    "cosignatairesRefs": [
      "PA266776",
      "PA608416"
    ],
    "texteAffichable": "M.&#160;Hetzel et M.&#160;Reiss"
  },
  "pointeurFragmentTexte": {
    "division": {
      "titre": "Article 15",
      "articleDesignationCourte": "ART. 15",
      "type": "ARTICLE",
      "avantAApres": "A",
      "divisionRattachee": "ARTICLE 15",
      "urlDivisionTexteVise": "/15/textes/2243.asp#D_Article_15"
    },
    "alinea": {
      "numero": "4"
    }
  },
  "corps": {
    "dispositif": "<p style=\"text-align: justify;\">I.&#160;&#8211;&#160;Apr&#232;s le mot&#160;:</p><p style=\"text-align: justify;\">&#171;&#160;extra&#8209;embryonnaires&#160;&#187;</p><p style=\"text-align: justify;\">r&#233;diger ainsi la fin de l&#8217;alin&#233;a&#160;4&#160;:</p><p style=\"text-align: justify;\">&#171;&#160;ne peuvent &#234;tre entrepris sans autorisation de l&#8217;Agence de la biom&#233;decine. Ces protocoles ne peuvent &#234;tre autoris&#233;s que si&#160;:&#160;&#187;.</p><p style=\"text-align: justify;\">II.&#160;&#8211;&#160;En cons&#233;quence, apr&#232;s le m&#234;me alin&#233;a&#160;4, ins&#233;rer les deux alin&#233;as suivants&#160;:</p><p style=\"text-align: justify;\">&#171;&#160;1&#176;&#160;La pertinence scientifique de la recherche est &#233;tablie&#160;;</p><p style=\"text-align: justify;\">&#171;&#160;2&#176;&#160;La recherche, fondamentale ou appliqu&#233;e, s&#8217;inscrit dans une finalit&#233; m&#233;dicale.&#160;&#187;</p>",
    "exposeSommaire": "<p style=\"text-align: justify;\">L&#8217;alin&#233;a&#160;4 revient &#224; autoriser la cr&#233;ation sans condition, &#224; partir de cellules souches pluripotentes induites, de gam&#232;tes artificiels (cellules d&#233;riv&#233;es &#224; partir d&#8217;une cellule de peau par exemple).</p><p style=\"text-align: justify;\">Apr&#232;s avoir cr&#233;&#233; des gam&#232;tes artificiels, les chercheurs seront tent&#233;s de les fusionner et de cr&#233;er des embryons &#224; partir de ces cellules artificielles. Ils cr&#233;eront des embryons pour la recherche en violation de l&#8217;alin&#233;a&#160;1<sup>er</sup> de l&#8217;article L 2151&#8209;2 du code de la sant&#233; publique et de l&#8217;article&#160;18 de la Convention d&#8217;Oviedo.</p>"
  },
  "representations": [
    {
      "nom": "PDF",
      "typeMime": {
        "type": "application",
        "subType": "PDF"
      },
      "statutRepresentation": {
        "verbatim": true,
        "canonique": true,
        "officielle": true,
        "transcription": false,
        "enregistrement": false
      },
      "contenu": {
        "documentURI": "/15/amendements/2243/AN/521.pdf"
      }
    }
  ],
  "seanceDiscussion": "RUANR5L15S2020IDS21848",
  "sort": {
    "dateSaisie": "2019-10-04T19:42:22.000+02:00",
    "sortEnSeance": "Rejeté"
  },
  "dateDepot": "2019-09-16T02:00:00.000+02:00",
  "dateDistribution": "2019-09-26T02:00:00.000+02:00",
  "article99": "0",
  "loiReference": {}
}