{
  "uid": "AMANR5L15SEA717460B2296P0D1N1565",
  "identifiant": {
    "legislature": "15",
    "numero": "1565",
    "numRect": "0",
    "saisine": {
      "texteLegislatifRef": "PRJLANR5L15B2296",
      "numeroPartiePLF": "0",
      "organeExamen": "PO717460",
      "mentionSecondeDeliberation": "0"
    }
  },
  "numeroLong": "1565",
  "etapeTexte": "1ère lecture (1ère assemblée saisie)",
  "triAmendement": "goaaaaaaaaaaaaaaaaaaaaaaaaaaaaaaaaaaaaaaaaaaaaaaaaaje",
  "cardinaliteAmdtMultiples": "1",
  "etat": "Irrecevable",
  "signataires": {
    "auteur": {
      "typeAuteur": "Depute",
      "acteurRef": "PA720586",
      "groupePolitiqueRef": "PO730934"
    },
    "cosignatairesRefs": [
      "PA720586"
    ],
    "texteAffichable": "M.&#160;Vatin"
  },
  "pointeurFragmentTexte": {
    "division": {
      "titre": "Article 36",
      "articleDesignationCourte": "APRÈS ART. 36",
      "type": "ARTICLE",
      "avantAApres": "Apres",
      "divisionRattachee": "APRÈS L'ARTICLE 36, insérer l'article suivant:",
      "articleAdditionnel": "1",
      "urlDivisionTexteVise": "/15/textes/2296.asp#D_Article_36"
    }
  },
  "corps": {},
  "representations": [
    {
      "nom": "PDF",
      "typeMime": {
        "type": "application",
        "subType": "PDF"
      },
      "statutRepresentation": {
        "verbatim": true,
        "canonique": true,
        "officielle": true,
        "transcription": false,
        "enregistrement": false
      },
      "contenu": {
        "documentURI": "/15/amendements/2296/AN/1565.pdf"
      }
    }
  ],
  "dateDepot": "2019-10-18T02:00:00.000+02:00",
  "dateDistribution": "2019-10-21T02:00:00.000+02:00",
  "article99": "0",
  "loiReference": {
    "codeLoi": "CGI",
    "divisionCodeLoi": "81 quater"
  }
}