{
  "uid": "AMANR5L15PO59048B2272P1D1N144",
  "identifiant": {
    "legislature": "15",
    "numero": "144",
    "numRect": "0",
    "saisine": {
      "texteLegislatifRef": "PRJLANR5L15B2272",
      "numeroPartiePLF": "1",
      "organeExamen": "PO59048",
      "mentionSecondeDeliberation": "0"
    }
  },
  "numeroLong": "I-CF144",
  "etapeTexte": "1ère lecture (1ère assemblée saisie)",
  "triAmendement": "dsaaaaaaaaaaaaaaaaaaaaaaaaaaaaaaaaaaaaaaaaaaaaaaaakono",
  "cardinaliteAmdtMultiples": "1",
  "etat": "Discuté",
  "signataires": {
    "auteur": {
      "typeAuteur": "Depute",
      "acteurRef": "PA721410",
      "groupePolitiqueRef": "PO730934"
    },
    "cosignatairesRefs": [
      "PA340853",
      "PA721410",
      "PA336316",
      "PA722390",
      "PA267260",
      "PA721054",
      "PA267429",
      "PA719318",
      "PA642847",
      "PA266793",
      "PA718884",
      "PA266797"
    ],
    "texteAffichable": "Mme&#160;Bonnivard,  M.&#160;Bony, M.&#160;Leclerc, Mme&#160;Corneloup, M.&#160;Cinieri, M.&#160;Bazin, M.&#160;Bouchet, Mme&#160;Anthoine, Mme&#160;Bazin-Malgras, M.&#160;Lorion, M.&#160;Gosselin et Mme&#160;Poletti"
  },
  "pointeurFragmentTexte": {
    "division": {
      "titre": "Article 16",
      "articleDesignationCourte": "ART. 16",
      "type": "ARTICLE",
      "avantAApres": "A",
      "divisionRattachee": "ARTICLE 16",
      "urlDivisionTexteVise": "/15/textes/2272A.asp#D_Article_16"
    },
    "alinea": {
      "avantAApres": "A",
      "numero": "21",
      "alineaDesignation": "Alinéa 21"
    }
  },
  "corps": {
    "dispositif": "<p style=\"text-align: justify;\">I.&#160;-&#160;&#192; l&#8217;alin&#233;a&#160;21, apr&#232;s les mots&#160;:</p><p style=\"text-align: justify;\">&#171;&#160;265 <i>octies</i> A&#160;&#187;, </p><p style=\"text-align: justify;\">ins&#233;rer les mots&#160;:</p><p style=\"text-align: justify;\">&#171;&#160;,&#160;265 <i>octies</i> AA&#160;&#187;.</p><p style=\"text-align: justify;\">II.&#160;-&#160;Apr&#232;s l&#8217;alin&#233;a&#160;22, ins&#233;rer l&#8217;alin&#233;a suivant&#160;:</p><p style=\"text-align: justify;\">&#171;&#160;<i>&#160;Art.&#160;265&#160;</i>octies<i>&#160;AA.&#160;&#8211;&#160;</i>Le tarif de la taxe int&#233;rieure de consommation applicable au gazole utilis&#233; comme carburant dans des op&#233;rations qui concourent aux missions d&#233;finies aux articles L.&#160;2212&#8209;1, L.&#160;2212&#8209;2 et L.&#160;3221&#8209;4 du code g&#233;n&#233;ral des collectivit&#233;s territoriales dans les massifs mentionn&#233;s &#224; l&#8217;article&#160;5 de la loi n&#176;&#160;85&#8209;30 du 9 janvier 1985 relative au d&#233;veloppement et &#224; la protection de la montagne est fix&#233; &#224; 18,82&#160;euros par hectolitre.&#160;&#187;</p>",
    "exposeSommaire": "<p style=\"text-align: justify;\">Le pr&#233;sent amendement a pour objet de faire b&#233;n&#233;ficier d&#8217;un r&#233;gime fiscal adapt&#233; le gazole non routier utilis&#233; pour certains usages tr&#232;s sp&#233;cifiques relevant du service public et des missions de s&#233;curit&#233; pour la gestion de la neige en montagne (d&#233;neigement des routes et damage des pistes).</p><p style=\"text-align: justify;\">L&#8217;exploitation des routes et des services publics en montagne est en effet rendue plus complexe qu&#8217;en plaine par la pr&#233;sence de neige en p&#233;riode hivernale. Les surco&#251;ts se traduisent notamment par l&#8217;utilisation de carburant n&#233;cessaire aux engins qui g&#232;rent et d&#233;placent la neige pour le bon fonctionnement des missions d&#8217;int&#233;r&#234;t g&#233;n&#233;ral et de service public qui se d&#233;roulent sous le pouvoir de police du Maire ou sous la responsabilit&#233; des d&#233;partements.</p><p style=\"text-align: justify;\">L&#8217;ensemble des &#171;&#160;usages neige&#160;&#187; sont ainsi vis&#233;s, y compris ceux qui participent aux missions de s&#233;curit&#233; et de secours dans les zones de montagne telles que celles d&#233;crites &#224; l&#8217;article&#160;21 de la loi n&#176;&#160;2016&#8209;1888 du 28 d&#233;cembre 2016 de modernisation, de d&#233;veloppement et de protection des territoires de montagne.</p><p style=\"text-align: justify;\">La trajectoire pr&#233;vue par le projet de loi pour les tarifs r&#233;duits de taxe int&#233;rieure de consommation sur les produits &#233;nerg&#233;tiques (TICPE) repr&#233;senterait une augmentation de plus de 40 centimes d&#8217;euros par hectolitre d&#8217;ici au 1<sup>er</sup> janvier 2022, soit de plus de 200&#160;% et cr&#233;erait une charge nouvelle pour les collectivit&#233;s de montagne, dont les finances sont d&#233;j&#224; fortement contraintes. Par ailleurs, au regard des conditions climatiques et topographiques en montagne, il n&#8217;existe, &#224; ce jour, pas de technologie de substitution g&#233;n&#233;ralisable.</p><p style=\"text-align: justify;\">Le Gouvernement ayant choisi de pr&#233;voir des r&#233;gimes fiscaux sp&#233;cifiques pour certains secteurs, en raison de leur forte exposition &#224; la concurrence internationale (transport ferroviaire, transport fluvial, manutention portuaire dans les grands ports maritimes et industries extractives), il est donc propos&#233; de retenir la m&#234;me logique pour le secteur du tourisme de montagne.</p>"
  },
  "representations": [
    {
      "nom": "PDF",
      "typeMime": {
        "type": "application",
        "subType": "PDF"
      },
      "statutRepresentation": {
        "verbatim": true,
        "canonique": true,
        "officielle": true,
        "transcription": false,
        "enregistrement": false
      },
      "contenu": {
        "documentURI": "/15/amendements/2272A/CION_FIN/CF144.pdf"
      }
    }
  ],
  "sort": {
    "dateSaisie": "2019-10-10T10:09:15.000+02:00",
    "sortEnSeance": "Tombé"
  },
  "dateDepot": "2019-10-03T02:00:00.000+02:00",
  "dateDistribution": "2019-10-09T02:00:00.000+02:00",
  "article99": "0",
  "loiReference": {}
}