{
  "uid": "AMANR5L15SEA717460B0911P0D1N1465",
  "identifiant": {
    "legislature": "15",
    "numero": "1465",
    "numRect": "0",
    "saisine": {
      "texteLegislatifRef": "PRJLANR5L15B0911",
      "numeroPartiePLF": "0",
      "organeExamen": "PO717460",
      "mentionSecondeDeliberation": "0"
    }
  },
  "numeroLong": "1465",
  "etapeTexte": "1ère lecture (1ère assemblée saisie)",
  "triAmendement": "ilx",
  "cardinaliteAmdtMultiples": "1",
  "etat": "A discuter",
  "signataires": {
    "auteur": {
      "typeAuteur": "Depute",
      "acteurRef": "PA608695",
      "groupePolitiqueRef": "PO730946"
    },
    "cosignatairesRefs": [
      "PA429893",
      "PA508",
      "PA1008",
      "PA719930",
      "PA609332",
      "PA1809",
      "PA608011",
      "PA608172",
      "PA340357",
      "PA267233",
      "PA608695",
      "PA1198",
      "PA609590",
      "PA607553",
      "PA333285",
      "PA332614",
      "PA337483",
      "PA340343",
      "PA333818",
      "PA335532",
      "PA342415",
      "PA405480",
      "PA643145",
      "PA1592",
      "PA605069",
      "PA335054",
      "PA588886",
      "PA642764",
      "PA720988",
      "PA610681"
    ],
    "texteAffichable": "Mme&#160;Untermaier,  Mme&#160;Rabault, M.&#160;Faure, M.&#160;Aviragnet, Mme&#160;Bareigts, Mme&#160;Battistel, Mme&#160;Bi&#233;mouret, M.&#160;Bouillon, M.&#160;Jean-Louis&#160;Bricout, M.&#160;Carvounas, M.&#160;Alain&#160;David, Mme&#160;Laurence&#160;Dumont, M.&#160;Garot, M.&#160;David&#160;Habib, M.&#160;Hutin, M.&#160;Juanico, Mme&#160;Karamanli, M.&#160;J&#233;r&#244;me&#160;Lambert, M.&#160;Le Foll, M.&#160;Letchimy, Mme&#160;Manin, Mme&#160;Pau-Langevin, Mme&#160;Pires Beaune, M.&#160;Potier, M.&#160;Pueyo, M.&#160;Pupponi, M.&#160;Saulignac, Mme&#160;Vainqueur-Christophe, M.&#160;Vallaud, Mme&#160;Victory et les membres du groupe Nouvelle Gauche"
  },
  "pointeurFragmentTexte": {
    "division": {
      "titre": "Article 8",
      "articleDesignationCourte": "ART. 8",
      "type": "ARTICLE",
      "avantAApres": "A",
      "divisionRattachee": "ARTICLE 8",
      "urlDivisionTexteVise": "/15/textes/0911.asp#D_Article_8"
    }
  },
  "corps": {
    "dispositif": "<p style=\"text-align: justify;\">R&#233;diger ainsi cet article&#160;:</p><p style=\"text-align: justify;\">&#171;&#160;Le d&#233;but du deuxi&#232;me alin&#233;a de l&#8217;article&#160;48 de la Constitution est ainsi r&#233;dig&#233;&#160;: </p><p style=\"text-align: justify;\">&#171;&#160;Une semaine de s&#233;ance sur trois est r&#233;serv&#233;e par... (<i>le reste sans changement</i>).&#160;&#187;</p>",
    "exposeSommaire": "<p style=\"text-align: justify;\">r&#233;Cet amendement vise &#224; r&#233;organiser l&#8217;ordre du jour des assembl&#233;es en trois tiers&#160;:</p><p style=\"text-align: justify;\">Une semaine serait r&#233;serv&#233;e au Gouvernement, une semaine serait r&#233;serv&#233;e &#224; la majorit&#233; et une semaine reviendrait aux groupes minoritaires et d&#8217;opposition.</p><p style=\"text-align: justify;\">Cette proposition n&#8217;a rien de d&#233;raisonnable puisqu&#8217;elle maintient la maitrise des 2/3 de l&#8217;ordre du jour au Gouvernement et &#224; la majorit&#233; qui le soutient. Au demeurant, sont maintenues les priorit&#233;s d&#8217;inscription pour les lois de finances et de financement de la s&#233;curit&#233; sociale etc...</p><p style=\"text-align: justify;\">Enfin, un tel dispositif permettrait mettre un terme &#224; la concentration des travaux d&#8217;&#233;valuation sur une semaine consacr&#233;e. Les s&#233;ances consacr&#233;es &#224; l&#8217;&#233;valuation auraient davantage de port&#233;e si elles &#233;taient r&#233;parties dans le cadre des semaines parlementaires &#171;&#160;ordinaires&#160;&#187; en laissant au Gouvernement et aux groupes parlementaires le soin de d&#233;cider du sujet et du moment propice aux s&#233;ances d&#8217;&#233;valuation.</p>"
  },
  "representations": [
    {
      "nom": "PDF",
      "typeMime": {
        "type": "application",
        "subType": "PDF"
      },
      "statutRepresentation": {
        "verbatim": true,
        "canonique": true,
        "officielle": true,
        "transcription": false,
        "enregistrement": false
      },
      "contenu": {
        "documentURI": "/15/amendements/0911/AN/1465.pdf"
      }
    }
  ],
  "dateDepot": "2018-07-05T02:00:00.000+02:00",
  "dateDistribution": "2018-07-10T02:00:00.000+02:00",
  "article99": "0",
  "loiReference": {}
}