{
  "uid": "AMANR5L15SEA717460BTC2243P0D1N2285",
  "identifiant": {
    "legislature": "15",
    "numero": "2285",
    "numRect": "0",
    "saisine": {
      "texteLegislatifRef": "PRJLANR5L15BTC2243",
      "numeroPartiePLF": "0",
      "organeExamen": "PO717460",
      "mentionSecondeDeliberation": "0"
    }
  },
  "numeroLong": "2285",
  "etapeTexte": "1ère lecture (1ère assemblée saisie)",
  "triAmendement": "acaaaaaaaaaaaaaaaaaaaaaaaaaaaaaaaaaaaaaaaaaaaaaaaagfp",
  "cardinaliteAmdtMultiples": "1",
  "etat": "Discuté",
  "signataires": {
    "auteur": {
      "typeAuteur": "Depute",
      "acteurRef": "PA588884",
      "groupePolitiqueRef": "PO730958"
    },
    "cosignatairesRefs": [
      "PA721226",
      "PA720286",
      "PA720892",
      "PA720430",
      "PA718860",
      "PA719578",
      "PA2150",
      "PA720846",
      "PA722142",
      "PA720422",
      "PA588884",
      "PA721202",
      "PA719676",
      "PA721960",
      "PA718868",
      "PA721062",
      "PA721210"
    ],
    "texteAffichable": "Mme&#160;Autain,  M.&#160;Bernalicis, M.&#160;Coquerel, M.&#160;Corbi&#232;re, Mme&#160;Fiat, M.&#160;Lachaud, M.&#160;Larive, M.&#160;M&#233;lenchon, Mme&#160;Obono, Mme&#160;Panot, M.&#160;Prud&apos;homme, M.&#160;Quatennens, M.&#160;Ratenon, Mme&#160;Ressiguier, Mme&#160;Rubin, M.&#160;Ruffin et Mme&#160;Taurine"
  },
  "pointeurFragmentTexte": {
    "division": {
      "titre": "Article PREMIER",
      "articleDesignationCourte": "ART. PREMIER",
      "type": "ARTICLE",
      "avantAApres": "A",
      "divisionRattachee": "ARTICLE PREMIER",
      "urlDivisionTexteVise": "/15/textes/2243.asp#D_Article_1er"
    },
    "alinea": {
      "avantAApres": "Apres",
      "numero": "10"
    }
  },
  "corps": {
    "dispositif": "<p style=\"text-align: justify;\">Apr&#232;s l&#8217;alin&#233;a&#160;10, ins&#233;rer l'alin&#233;a suivant&#160;:</p><p style=\"text-align: justify;\">&#171;&#160;L&#8217;aide m&#233;dicale &#224; la procr&#233;ation s&#8217;adapte &#224; toutes les situations. Lorsqu&#8217;elle n&#8217;est pas n&#233;cessaire, aucune stimulation hormonale n&#8217;est propos&#233;e.&#160;&#187;</p>",
    "exposeSommaire": "<p style=\"text-align: justify;\">Actuellement les stimulations hormonales sont fr&#233;quentes dans les protocoles de PMA, y compris lorsque l&#8217;infertilit&#233; n&#8217;est pas ovarienne, ce qui est g&#233;n&#233;ralement le cas dans les couples de femmes, puisqu&#8217;on est face &#224; une infertilit&#233; du couple, pas des femmes du couple.</p><p style=\"text-align: justify;\">Le pr&#233;sent amendement concerne les femmes ayant recours &#224; une ins&#233;mination artificielle, (que ce soit avec le sperme du conjoint ou d&#8217;un donneur) et vise &#224; leur donner l&#8217;assurance de pouvoir choisir le degr&#233; de m&#233;dicalisation du processus dans lequel elles s&#8217;engagent.</p><p style=\"text-align: justify;\">A l&#8217;heure actuelle, les protocoles d&#8217;ins&#233;mination impliquent le plus souvent un traitement hormonal pour la femme, pr&#233;alablement &#224; l&#8217;ins&#233;mination proprement dite, et ce dans le but de stimuler les ovaires pour obtenir plus d&#8217;ovocytes que dans un cycle ovarien classique.</p><p style=\"text-align: justify;\">L&#8217;objectif est donc de maximiser les chances pour le couple de concevoir un enfant et si &#231;a peut &#234;tre tout &#224; fait salutaire, &#231;a n&#8217;est pas pour autant syst&#233;matiquement n&#233;cessaire.</p><p style=\"text-align: justify;\">On peut se poser la question de l&#8217;utilit&#233; d&#8217;une stimulation ovarienne pour une personne qui ovule de fa&#231;on non pathologique, voire au dessus de la moyenne. En effet, l&#8217;infertilit&#233; peut &#234;tre li&#233;e exclusivement &#224; l&#8217;homme sans pour autant que ce protocole soit r&#233;vis&#233;. Elle peut &#233;galement toucher la femme sans que cela ne concerne son ovulation. C&#8217;est d&#8217;autant plus le cas pour les couples de lesbiennes qui n&#8217;ont pas &#224; priori individuellement de probl&#232;me de fertilit&#233;.</p><p style=\"text-align: justify;\">Les traitements hormonaux ne sont pas anodins, leur administration quotidienne par voie intramusculaire est douloureuse et les effets secondaires sont nombreux et redout&#233;s par les patientes.</p><p style=\"text-align: justify;\">&#160;Nous proposons donc, en raison du principe de consentement libre et &#233;clair&#233; de la patiente, que les femmes aient la possibilit&#233; de ne pas consentir &#224; cette &#233;tape du protocole quand elle n&#8217;est pas dict&#233;e par une n&#233;cessit&#233; m&#233;dicale, et ce, sans que cela ne perturbe ou n&#8217;entrave leur prise en charge par le corps m&#233;dical.</p><p style=\"text-align: justify;\"><i>Cet amendement est issu d&#8217;une proposition du Planning familial.&#160;</i></p><p style=\"text-align: justify;\">&#160;</p>"
  },
  "representations": [
    {
      "nom": "PDF",
      "typeMime": {
        "type": "application",
        "subType": "PDF"
      },
      "statutRepresentation": {
        "verbatim": true,
        "canonique": true,
        "officielle": true,
        "transcription": false,
        "enregistrement": false
      },
      "contenu": {
        "documentURI": "/15/amendements/2243/AN/2285.pdf"
      }
    }
  ],
  "seanceDiscussion": "RUANR5L15S2019IDS21830",
  "sort": {
    "dateSaisie": "2019-09-26T19:34:50.000+02:00",
    "sortEnSeance": "Rejeté"
  },
  "dateDepot": "2019-09-20T02:00:00.000+02:00",
  "dateDistribution": "2019-09-23T02:00:00.000+02:00",
  "article99": "0",
  "loiReference": {}
}