{
  "uid": "AMANR5L15SEA717460BTC1924P0D1N816",
  "identifiant": {
    "legislature": "15",
    "numero": "816",
    "numRect": "0",
    "saisine": {
      "texteLegislatifRef": "PRJLANR5L15BTC1924",
      "numeroPartiePLF": "0",
      "organeExamen": "PO717460",
      "mentionSecondeDeliberation": "1"
    }
  },
  "numeroLong": "816",
  "etapeTexte": "1ère lecture (1ère assemblée saisie)",
  "triAmendement": "okaaaaaaaaaaaaaaaaaaaaaaaaaaaaaaaaaaaaaaaaaaaaaaaaarno",
  "cardinaliteAmdtMultiples": "1",
  "etat": "Discuté",
  "signataires": {
    "auteur": {
      "typeAuteur": "Depute",
      "acteurRef": "PA610681",
      "groupePolitiqueRef": "PO758835"
    },
    "cosignatairesRefs": [
      "PA609590",
      "PA340357",
      "PA333818",
      "PA1198",
      "PA642764",
      "PA643145",
      "PA267233",
      "PA335054",
      "PA605069",
      "PA1008",
      "PA333285",
      "PA332614",
      "PA335532",
      "PA610681",
      "PA720988",
      "PA1592",
      "PA608695",
      "PA1809",
      "PA607553",
      "PA342415",
      "PA609332",
      "PA337483",
      "PA429893",
      "PA340343",
      "PA508",
      "PA719930",
      "PA608011",
      "PA608741",
      "PA608172"
    ],
    "texteAffichable": "Mme&#160;Bareigts,  Mme&#160;Vainqueur-Christophe, M.&#160;Letchimy, Mme&#160;Manin, Mme&#160;Karamanli, M.&#160;Vallaud, Mme&#160;Untermaier, Mme&#160;Pau-Langevin, M.&#160;Saulignac, Mme&#160;Pires Beaune, Mme&#160;Rabault, M.&#160;Aviragnet, Mme&#160;Battistel, Mme&#160;Bi&#233;mouret, M.&#160;Bouillon, M.&#160;Jean-Louis&#160;Bricout, M.&#160;Carvounas, M.&#160;Alain&#160;David, Mme&#160;Laurence&#160;Dumont, M.&#160;Faure, M.&#160;Garot, M.&#160;David&#160;Habib, M.&#160;Hutin, M.&#160;Juanico, M.&#160;J&#233;r&#244;me&#160;Lambert, M.&#160;Potier, M.&#160;Pueyo, Mme&#160;Tolmont et Mme&#160;Victory"
  },
  "pointeurFragmentTexte": {
    "division": {
      "titre": "Article 33",
      "articleDesignationCourte": "APRÈS ART. 33",
      "type": "ARTICLE",
      "avantAApres": "Apres",
      "divisionRattachee": "APRÈS L'ARTICLE 33, insérer l'article suivant:",
      "articleAdditionnel": "1",
      "urlDivisionTexteVise": "/15/textes/1924.asp#D_Article_33"
    }
  },
  "corps": {
    "dispositif": "<p style=\"text-align: justify;\">L&#8217;article&#160;19 de la loi n&#176; 84&#8209;16 du 11 janvier 1984 portant dispositions statutaires relatives &#224; la fonction publique de l&#8217;&#201;tat est compl&#233;t&#233; par un alin&#233;a ainsi r&#233;dig&#233;&#160;:</p><p style=\"text-align: justify;\">&#171;&#160;&#192; titre d&#8217;exp&#233;rimentation, et pour une dur&#233;e de cinq ans, l&#8217;organisation des concours pour les cat&#233;gorie B et C et l&#8217;affectation des fonctionnaires laur&#233;ats est g&#233;r&#233;e au niveau des zones g&#233;ographiques correspondantes aux plates-formes r&#233;gionales d&#8217;appui interminist&#233;riel &#224; la gestion des ressources humaines dans les d&#233;partements d&#8217;outre-mer.&#160;&#187;</p>",
    "exposeSommaire": "<p style=\"text-align: justify;\">Cet amendement du groupe Socialistes et apparent&#233;s vise &#224; exp&#233;rimenter pour une dur&#233;e de 5 ans la gestion de l&#8217;organisation des concours pour les cat&#233;gorie B et C et l&#8217;affectation des fonctionnaires laur&#233;ats au niveau des zones g&#233;ographiques correspondantes aux plates-formes r&#233;gionales d&#8217;appui interminist&#233;riel &#224; la gestion des ressources humaines dans les d&#233;partements d&#8217;outre-mer.</p><p style=\"text-align: justify;\">L&#8217;organisation de concours locaux interminist&#233;riels pour les administrations d&#233;concentr&#233;es de l&#8217;&#201;tat n&#8217;ayant pas la logistique de l&#8217;organisation d&#8217;un concours localement est d&#233;j&#224; possible. Cependant, l&#8217;affectation des fonctionnaires reste nationale. Or l&#8217;organisation locale de ces concours permettrait d&#8217;&#233;viter des situations mat&#233;rielles douloureuses. Ainsi des agents dont la vie familiale est profond&#233;ment enracin&#233;e dans leur r&#233;gion peuvent &#234;tre affect&#233;s &#224; plusieurs milliers de kilom&#232;tres alors que des postes peuvent &#234;tre disponibles dans leur zone de r&#233;sidence.</p><p style=\"text-align: justify;\">Cette affectation r&#233;gionale existe d&#233;j&#224; pour le concours de professeur des &#233;coles de l&#8217;&#201;ducation nationale.</p><p style=\"text-align: justify;\">De plus, un recrutement local, est une chance au regard de la connaissance fine des enjeux, du contexte linguistique, culturel et socio-&#233;conomique que ces futurs agents pourraient apporter au c&#339;ur de nos territoires. Cela serait &#233;galement un outil efficace dans la stabilisation des agents.</p>"
  },
  "representations": [
    {
      "nom": "PDF",
      "typeMime": {
        "type": "application",
        "subType": "PDF"
      },
      "statutRepresentation": {
        "verbatim": true,
        "canonique": true,
        "officielle": true,
        "transcription": false,
        "enregistrement": false
      },
      "contenu": {
        "documentURI": "/15/amendements/1924/AN/816.pdf"
      }
    }
  ],
  "sort": {
    "dateSaisie": "2019-05-21T22:05:40.000+02:00",
    "sortEnSeance": "Rejeté"
  },
  "dateDepot": "2019-05-09T02:00:00.000+02:00",
  "dateDistribution": "2019-05-13T02:00:00.000+02:00",
  "article99": "0",
  "loiReference": {
    "codeLoi": "loi 84-16",
    "divisionCodeLoi": "19"
  }
}