{
  "uid": "AMANR5L15SEA717460BTC2401P0D1N1552",
  "identifiant": {
    "legislature": "15",
    "numero": "1552",
    "numRect": "0",
    "saisine": {
      "texteLegislatifRef": "PRJLANR5L15BTC2401",
      "numeroPartiePLF": "0",
      "organeExamen": "PO717460",
      "mentionSecondeDeliberation": "0"
    }
  },
  "numeroLong": "1552",
  "etapeTexte": "1ère lecture (2ème assemblée saisie)",
  "triAmendement": "jaiaaaaaaaaaaaaaaaaaaaaaaaaaaaaaaaaaaaaaaaaaaaaaaau",
  "cardinaliteAmdtMultiples": "1",
  "etat": "A discuter",
  "signataires": {
    "auteur": {
      "typeAuteur": "Depute",
      "acteurRef": "PA719960",
      "groupePolitiqueRef": "PO730964"
    },
    "cosignatairesRefs": [
      "PA721336",
      "PA719960",
      "PA721398",
      "PA721776"
    ],
    "texteAffichable": "Mme&#160;Faure-Muntian,  M.&#160;Baich&#232;re, Mme&#160;Brocard et Mme&#160;Degois"
  },
  "pointeurFragmentTexte": {
    "division": {
      "titre": "Article 19 bis",
      "articleDesignationCourte": "APRÈS ART. 19 BIS",
      "type": "ARTICLE",
      "avantAApres": "Apres",
      "divisionRattachee": "APRÈS L'ARTICLE 19 BIS, insérer l'article suivant:",
      "articleAdditionnel": "1",
      "urlDivisionTexteVise": "/15/textes/2401.asp#D_Article_19_bis"
    }
  },
  "corps": {
    "dispositif": "<p style=\"text-align: justify;\">Dans le cadre de l&#8217;exercice de leurs comp&#233;tences, les collectivit&#233;s territoriales veillent &#224; la s&#233;curit&#233; de leurs r&#233;seaux et de leurs syst&#232;mes d&#8217;information dans le respect des r&#232;gles applicables aux mesures de protection face aux risques cyber.&#160;</p><p style=\"text-align: justify;\">&#192; cet effet, les communes peuvent d&#233;l&#233;guer &#224; leur &#233;tablissement public de coop&#233;ration intercommunale, la mise en &#339;uvre de mesures de protection des r&#233;seaux et syst&#232;mes d&#8217;information.</p><p style=\"text-align: justify;\">La commune ou, lorsque l&#8217;exercice de cette mission lui a &#233;t&#233; d&#233;l&#233;gu&#233;e, l&#8217;&#233;tablissement public de coop&#233;ration intercommunale, nomme un responsable de la s&#233;curit&#233; des syst&#232;mes d&#8217;information charg&#233; de mettre en &#339;uvre une politique garantissant la confidentialit&#233; et l&#8217;int&#233;grit&#233; des r&#233;seaux et syst&#232;mes d&#8217;information. Le responsable de la s&#233;curit&#233; des syst&#232;mes d&#8217;information doit notamment mettre en place une politique de sensibilisation et de formation aupr&#232;s de l&#8217;ensemble des &#233;lus et du personnel, la s&#233;curit&#233; des syst&#232;mes d&#8217;information reposant tant sur la vigilance personnelle que sur l&#8217;organisation, les choix et les mesures techniques.</p>",
    "exposeSommaire": "<p style=\"text-align: justify;\">Le r&#233;f&#233;rentiel g&#233;n&#233;ral de s&#233;curit&#233; (RGS) ainsi que la directive (UE) 2016/1148 du Parlement europ&#233;en et du conseil du 6 juillet 2016 concernant des mesures destin&#233;es &#224; assurer un niveau &#233;lev&#233; commun de s&#233;curit&#233; des r&#233;seaux et des syst&#232;mes d&#8217;information dans l&#8217;Union dit directive &#171;&#160;NIS&#160;&#187; imposent aux autorit&#233;s administratives de garantir la s&#233;curit&#233; de leurs syst&#232;mes d&#8217;information.</p><p style=\"text-align: justify;\">Ce cadre normatif qui s&#8217;impose &#233;galement aux collectivit&#233;s fixe un certain nombre d&#8217;obligations techniques et organisationnelles. Cependant, de nombreuses collectivit&#233;s &#233;prouvent des difficult&#233;s &#224; garantir la s&#233;curit&#233; de leurs syst&#232;mes d&#8217;information.</p><p style=\"text-align: justify;\">Rappelant cette obligation, le pr&#233;sent amendement propose de permettre aux communes de d&#233;l&#233;guer &#224; leur &#233;tablissement public de coop&#233;ration intercommunale la mise en &#339;uvre de mesures de protection contre les risques cyber. Dans un second temps, il propose de rendre obligatoire la nomination d&#8217;un responsable SSI charg&#233; de veiller &#224; la s&#233;curit&#233; et &#224; la mise en &#339;uvre de mesure de protection du r&#233;seau. Par ailleurs, le RSSI doit &#234;tre l&#8217;acteur de la sensibilisation et de la formation des agents et &#233;lus de la collectivit&#233;.</p><p style=\"text-align: justify;\">Enfin, il impose ainsi &#224; la personne publique en charge de la protection des syst&#232;mes d&#8217;information de nommer un responsable de la s&#233;curit&#233; des syst&#232;mes d&#8217;information qui doit pouvoir veiller &#224; la mise en &#339;uvre de ces mesures de protection.</p>"
  },
  "representations": [
    {
      "nom": "PDF",
      "typeMime": {
        "type": "application",
        "subType": "PDF"
      },
      "statutRepresentation": {
        "verbatim": true,
        "canonique": true,
        "officielle": true,
        "transcription": false,
        "enregistrement": false
      },
      "contenu": {
        "documentURI": "/15/amendements/2401/AN/1552.pdf"
      }
    }
  ],
  "dateDepot": "2019-11-14T01:00:00.000+01:00",
  "dateDistribution": "2019-11-18T01:00:00.000+01:00",
  "article99": "0",
  "loiReference": {}
}