{
  "uid": "AMANR5L15PO744107B0424P0D1N849",
  "identifiant": {
    "legislature": "15",
    "numero": "849",
    "numRect": "0",
    "saisine": {
      "texteLegislatifRef": "PRJLANR5L15B0424",
      "numeroPartiePLF": "0",
      "organeExamen": "PO744107",
      "mentionSecondeDeliberation": "0"
    }
  },
  "numeroLong": "849",
  "etapeTexte": "1ère lecture (1ère assemblée saisie)",
  "triAmendement": "bo",
  "cardinaliteAmdtMultiples": "1",
  "etat": "Discuté",
  "signataires": {
    "auteur": {
      "typeAuteur": "Depute",
      "acteurRef": "PA342415",
      "groupePolitiqueRef": "PO730946"
    },
    "cosignatairesRefs": [
      "PA267233",
      "PA342415"
    ],
    "texteAffichable": "Mme&#160;Battistel et M.&#160;Bouillon"
  },
  "pointeurFragmentTexte": {
    "division": {
      "titre": "Article 34",
      "articleDesignationCourte": "APRÈS ART. 34",
      "type": "ARTICLE",
      "avantAApres": "Apres",
      "divisionRattachee": "APRÈS L'ARTICLE 34, insérer l'article suivant:",
      "articleAdditionnel": "1",
      "urlDivisionTexteVise": "/15/textes/0424.asp#D_Article_34"
    }
  },
  "corps": {
    "dispositif": "<p style=\"text-align: justify;\">L&#8217;article L.&#160;181&#8209;11 du code de l&#8217;environnement est compl&#233;t&#233; par une phrase ainsi r&#233;dig&#233;e&#160;:</p><p style=\"text-align: justify;\">&#171;&#160;Le silence gard&#233; par le pr&#233;fet &#224; l&#8217;issue des d&#233;lais pr&#233;vus par l&#8217;article R.&#160;181&#8209;41 pour statuer sur la demande d&#8217;autorisation environnementale des installations de production d&#8217;&#233;nergie renouvelable vaut d&#233;cision implicite d&#8217;acceptation&#160;&#187;.</p>",
    "exposeSommaire": "<p style=\"text-align: justify;\">Toute la proc&#233;dure d&#8217;autorisation environnementale, issue de l&#8217;ordonnance n&#176; 2017&#8209;80 du 26/01/2017 et de ses deux d&#233;crets d&#8217;application n&#176; 2017&#8209;81 et -82 de la m&#234;me date, s&#8217;inscrit dans le cadre d&#8217;un processus d&#8217;examen de la demande, de consultations diverses, d&#8217;enqu&#234;te publique, puis de d&#233;cision qui donne lieu du d&#233;but &#224; la fin &#224; de multiples &#233;changes entre le p&#233;titionnaire et le service instructeur de la demande d&#8217;autorisation.</p><p style=\"text-align: justify;\">Il est paradoxal, dans ces conditions, de conclure, comme le fait actuellement l&#8217;article R181&#8209;42 du code de l&#8217;environnement, que le silence de l&#8217;autorit&#233; administrative comp&#233;tente gard&#233; pendant deux mois au terme de la toute derni&#232;re phase de la proc&#233;dure vaut rejet plut&#244;t qu&#8217;acceptation de la demande.</p><p style=\"text-align: justify;\">C&#8217;est d&#8217;autant plus paradoxal que le traitement administratif de cette demande est susceptible de s&#8217;inscrire dans le cadre d&#8217;un certificat de projet (articles L181&#8209;6 et R181&#8209;4 et suivants du code de l&#8217;environnement) qui fixe le calendrier dans lequel doit se d&#233;rouler l&#8217;instruction de la demande d&#8217;autorisation et doit intervenir la d&#233;livrance de cette autorisation.</p><p style=\"text-align: justify;\">S&#8217;agissant des autorisations d&#8217;installations de production d&#8217;&#233;nergie renouvelables, cet amendement a donc pour objet de rem&#233;dier &#224; ce paradoxe, en renversant le principe dans la loi elle-m&#234;me.</p>"
  },
  "representations": [
    {
      "nom": "PDF",
      "typeMime": {
        "type": "application",
        "subType": "PDF"
      },
      "statutRepresentation": {
        "verbatim": true,
        "canonique": true,
        "officielle": true,
        "transcription": false,
        "enregistrement": false
      },
      "contenu": {
        "documentURI": "/15/amendements/0424/CSCONF/849.pdf"
      }
    }
  ],
  "sort": {
    "dateSaisie": "2018-01-17T21:31:34.000+01:00",
    "sortEnSeance": "Rejeté"
  },
  "dateDepot": "2018-01-11T01:00:00.000+01:00",
  "dateDistribution": "2018-01-15T01:00:00.000+01:00",
  "article99": "0",
  "loiReference": {
    "codeLoi": "environnement",
    "divisionCodeLoi": "181-11"
  }
}