{
  "uid": "AMANR5L15SEA717460BTC1838P0D1N94",
  "identifiant": {
    "legislature": "15",
    "numero": "94",
    "numRect": "0",
    "saisine": {
      "texteLegislatifRef": "PRJLANR5L15BTC1838",
      "numeroPartiePLF": "0",
      "organeExamen": "PO717460",
      "mentionSecondeDeliberation": "0"
    }
  },
  "numeroLong": "94",
  "etapeTexte": "1ère lecture (1ère assemblée saisie)",
  "triAmendement": "biaaaaaaaaaaaaaaaaaaaaaaaaaaaaaaaaaaaaaaaaaaaaaaaainhhdo",
  "cardinaliteAmdtMultiples": "1",
  "etat": "Discuté",
  "signataires": {
    "auteur": {
      "typeAuteur": "Depute",
      "acteurRef": "PA642695",
      "groupePolitiqueRef": "PO730964"
    },
    "cosignatairesRefs": [
      "PA721458",
      "PA720022",
      "PA722022",
      "PA719890",
      "PA721142",
      "PA719798",
      "PA722358",
      "PA719910",
      "PA720054",
      "PA642695",
      "PA719822"
    ],
    "texteAffichable": "M.&#160;Bothorel,  M.&#160;Roseren, M.&#160;Lauzzana, M.&#160;Haury, M.&#160;Belhamiti, M.&#160;Gassilloud, Mme&#160;Forteza, Mme&#160;Romeiro Dias, Mme&#160;Brulebois, M.&#160;Labaronne et Mme&#160;Thillaye"
  },
  "pointeurFragmentTexte": {
    "division": {
      "titre": "Article PREMIER",
      "articleDesignationCourte": "ART. PREMIER",
      "type": "ARTICLE",
      "avantAApres": "A",
      "divisionRattachee": "ARTICLE PREMIER",
      "urlDivisionTexteVise": "/15/textes/1838.asp#D_Article_1er"
    },
    "alinea": {
      "avantAApres": "Apres",
      "numero": "26"
    }
  },
  "corps": {
    "dispositif": "<p style=\"text-align: justify;\">Apr&#232;s l&#8217;alin&#233;a&#160;26, ins&#233;rer les deux alin&#233;as suivants&#160;:</p><p style=\"text-align: justify;\">&#171;&#160;3&#176; Les encaissements vers&#233;s en contrepartie de la fourniture d&#8217;un service taxable d&#233;fini au 1&#176;&#160;du II de l&#8217;article&#160;299 s&#8217;entendent de l&#8217;ensemble des sommes vers&#233;es par les utilisateurs de cette interface, &#224; l&#8217;exception de celles vers&#233;es en contrepartie de biens ou de services dont l&#8217;achat n&#8217;est pas indispensable &#224; l&#8217;utilisation de l&#8217;interface et n&#8217;en permet pas une utilisation dans de meilleures conditions&#160;;</p><p style=\"text-align: justify;\">&#171;&#160;4&#176; Les encaissements vers&#233;s en contrepartie de la fourniture d&#8217;un service taxable d&#233;fini au 2&#176;&#160;du II de l&#8217;article&#160;299 s&#8217;entendent de l&#8217;ensemble des sommes vers&#233;es par les annonceurs, ou leurs mandataires, en contrepartie de la r&#233;alisation effective du placement des messages publicitaires ou permettant de r&#233;aliser un tel placement dans de meilleures conditions.&#160;&#187;.</p>",
    "exposeSommaire": "<p style=\"text-align: justify;\">Le pr&#233;sent amendement a pour objet de pr&#233;ciser les sommes incluses dans l&#8217;assiette de la taxe compte tenu de la diversit&#233; des mod&#232;les &#233;conomiques ainsi que de l&#8217;existence de services connexes pouvant &#234;tre commercialis&#233;s par les personnes redevables de la taxe.</p><p style=\"text-align: justify;\">S&#8217;agissant des services de mise &#224; disposition d&#8217;une interface num&#233;rique, l&#8217;exploitant de l&#8217;interface est susceptible de proposer une grande diversit&#233; de services &#224; diff&#233;rentes cat&#233;gories d&#8217;utilisateurs. Pour les places de march&#233;, il peut s&#8217;agir par exemple de services de logistique aupr&#232;s des vendeurs ou d&#8217;offres multiservices aupr&#232;s des acheteurs permettant &#224; la fois un meilleur acc&#232;s &#224; la plateforme (r&#233;ductions de prix, d&#233;lais de livraison r&#233;duits) ou le b&#233;n&#233;fice d&#8217;autres prestations (vid&#233;o &#224; la demande, stockage de donn&#233;es num&#233;riques). Ces prestations peuvent soit constituer des prestations distinctes des services taxables, commercialis&#233;es de mani&#232;re ind&#233;pendante, soit constituer des prestations qui, sur le plan &#233;conomique, sont &#233;troitement li&#233;es &#224; la mise &#224; disposition de la plateforme.</p><p style=\"text-align: justify;\">Par ailleurs, le mod&#232;le &#233;conomique des services taxables repose sur le subventionnement crois&#233; de prestations (march&#233;s multi-faces), qui, pour nombre d&#8217;entre elles, participent directement au mod&#232;le &#233;conomique de la plateforme.</p><p style=\"text-align: justify;\">D&#232;s lors, le pr&#233;sent amendement pr&#233;cise que l&#8217;ensemble des sommes vers&#233;es par les utilisateurs de l&#8217;interface seront prises en compte dans la d&#233;termination de l&#8217;assiette taxable, sauf les sommes r&#233;mun&#233;rant des prestations bien identifi&#233;es qui r&#233;pondent &#224; un besoin sp&#233;cifique des utilisateurs, distinct de la prestation de mise &#224; disposition de la plateforme.</p><p style=\"text-align: justify;\">La distinction retenue est inspir&#233;e de la jurisprudence europ&#233;enne relative aux op&#233;rations complexes en mati&#232;re de TVA. Ne seront pas regard&#233;es comme une composante accessoire &#224; la prestation principale de mise &#224; disposition de l&#8217;interface les prestations connexes qui ne sont ni indispensables pour acc&#233;der &#224; l&#8217;interface, ni le moyen d&#8217;en b&#233;n&#233;ficier dans de meilleures conditions. Tel pourra notamment &#234;tre le cas des prestations logistiques commercialis&#233;es s&#233;par&#233;ment par la place de march&#233; et auxquelles les vendeurs peuvent librement choisir de ne pas recourir sans supporter de majoration du prix qui leur est appliqu&#233; pour l&#8217;acc&#232;s &#224; la place de march&#233;.</p><p style=\"text-align: justify;\">Une approche analogue est adopt&#233;e pour les services de publicit&#233; cibl&#233;e.</p>"
  },
  "representations": [
    {
      "nom": "PDF",
      "typeMime": {
        "type": "application",
        "subType": "PDF"
      },
      "statutRepresentation": {
        "verbatim": true,
        "canonique": true,
        "officielle": true,
        "transcription": false,
        "enregistrement": false
      },
      "contenu": {
        "documentURI": "/15/amendements/1838/AN/94.pdf"
      }
    }
  ],
  "seanceDiscussion": "RUANR5L15S2019IDS21598",
  "sort": {
    "dateSaisie": "2019-04-08T22:29:31.000+02:00",
    "sortEnSeance": "Adopté"
  },
  "dateDepot": "2019-04-05T02:00:00.000+02:00",
  "dateDistribution": "2019-04-08T02:00:00.000+02:00",
  "article99": "0",
  "loiReference": {}
}