{
  "uid": "AMANR5L15SEA717460BTC0019P0D1N355",
  "identifiant": {
    "legislature": "15",
    "numero": "355",
    "numRect": "1",
    "saisine": {
      "texteLegislatifRef": "PRJLANR5L15BTC0019",
      "numeroPartiePLF": "0",
      "organeExamen": "PO717460",
      "mentionSecondeDeliberation": "0"
    }
  },
  "numeroLong": "355 (Rect)",
  "etapeTexte": "1ère lecture (1ère assemblée saisie)",
  "triAmendement": "gzo",
  "cardinaliteAmdtMultiples": "1",
  "etat": "Discuté",
  "signataires": {
    "auteur": {
      "typeAuteur": "Depute",
      "acteurRef": "PA718926",
      "groupePolitiqueRef": "PO730940"
    },
    "cosignatairesRefs": [
      "PA721896",
      "PA718926",
      "PA689",
      "PA718720",
      "PA722202",
      "PA720692",
      "PA610654",
      "PA610667",
      "PA335612",
      "PA720546",
      "PA441",
      "PA610634",
      "PA721118",
      "PA722110",
      "PA267306",
      "PA721270"
    ],
    "texteAffichable": "M.&#160;Dharr&#233;ville,  M.&#160;Azerot, Mme&#160;Bello, M.&#160;Brotherson, M.&#160;Bruneel, Mme&#160;Buffet, M.&#160;Chassaigne, M.&#160;Dufr&#232;gne, Mme&#160;Faucillon, M.&#160;Jumel, M.&#160;Lecoq, M.&#160;Nilor, M.&#160;Peu, M.&#160;Fabien&#160;Roussel, M.&#160;Serville et M.&#160;Wulfranc"
  },
  "pointeurFragmentTexte": {
    "division": {
      "titre": "Article 2",
      "articleDesignationCourte": "ART. 2",
      "type": "ARTICLE",
      "avantAApres": "A",
      "divisionRattachee": "ARTICLE 2",
      "urlDivisionTexteVise": "/15/textes/0019.asp#D_Article_2"
    },
    "alinea": {
      "numero": "2"
    }
  },
  "corps": {
    "dispositif": "<p style=\"text-align: justify;\">Compl&#233;ter l&#8217;alin&#233;a&#160;2 par la phrase suivante&#160;:</p><p style=\"text-align: justify;\">&#171;&#160;. Le p&#233;rim&#232;tre de mise en place de cette instance est celui de l&#8217;&#233;tablissement dans le sens d&#8217;une collectivit&#233; de salari&#233;s dot&#233;es d&#8217;int&#233;r&#234;ts communs et sp&#233;cifiques, qui exercent soit des activit&#233;s similaires soit des activit&#233;s compl&#233;mentaires, la pr&#233;sence ou non de repr&#233;sentants du ou des employeurs des salari&#233;s &#233;tant indiff&#233;rente&#160;;&#160;&#187;.</p>",
    "exposeSommaire": "<p style=\"text-align: justify;\">Nous proposons avec cet amendement de d&#233;finir le p&#233;rim&#232;tre de mise en place de la nouvelle instance repr&#233;sentative du personnel, de fa&#231;on &#224; &#233;viter la disparition des &#233;lus de proximit&#233; au profit d&#8217;une IRP centralis&#233;e. La nouvelle d&#233;finition de l&#8217;&#233;tablissement propos&#233;e permettrait une mise en place de l&#8217;instance unique au plus proche des salari&#233;s.</p>"
  },
  "representations": [
    {
      "nom": "PDF",
      "typeMime": {
        "type": "application",
        "subType": "PDF"
      },
      "statutRepresentation": {
        "verbatim": true,
        "canonique": true,
        "officielle": true,
        "transcription": false,
        "enregistrement": false
      },
      "contenu": {
        "documentURI": "/15/amendements/0019/AN/355.pdf"
      }
    }
  ],
  "seanceDiscussion": "RUANR5L15S2017IDS20610",
  "sort": {
    "dateSaisie": "2017-07-11T19:32:08.000+02:00",
    "sortEnSeance": "Rejeté"
  },
  "dateDepot": "2017-07-07T02:00:00.000+02:00",
  "dateDistribution": "2017-07-08T02:00:00.000+02:00",
  "article99": "0",
  "loiReference": {}
}