{
  "uid": "AMANR5L15PO419604B1481P0D1N16",
  "identifiant": {
    "legislature": "15",
    "numero": "16",
    "numRect": "0",
    "saisine": {
      "texteLegislatifRef": "PRJLANR5L15B1481",
      "numeroPartiePLF": "0",
      "organeExamen": "PO419604",
      "mentionSecondeDeliberation": "0"
    }
  },
  "numeroLong": "AC16",
  "etapeTexte": "1ère lecture (1ère assemblée saisie)",
  "triAmendement": "beaaaaaaaaaaaaaaaaaaaaaaaaaaaaaaaaaaaaaaaaaaaaaaaaay",
  "cardinaliteAmdtMultiples": "1",
  "etat": "Discuté",
  "signataires": {
    "auteur": {
      "typeAuteur": "Depute",
      "acteurRef": "PA608416",
      "groupePolitiqueRef": "PO730934"
    },
    "cosignatairesRefs": [
      "PA266776",
      "PA608416",
      "PA719318",
      "PA345722",
      "PA718884",
      "PA719272"
    ],
    "texteAffichable": "M.&#160;Hetzel,  Mme&#160;Bazin-Malgras, Mme&#160;Anthoine, M.&#160;Reiss, Mme&#160;Meunier et Mme&#160;Le Grip"
  },
  "pointeurFragmentTexte": {
    "division": {
      "titre": "Article 5",
      "articleDesignationCourte": "APRÈS ART. 5",
      "type": "ARTICLE",
      "avantAApres": "Apres",
      "divisionRattachee": "APRÈS L'ARTICLE 5, insérer l'article suivant:",
      "articleAdditionnel": "1",
      "urlDivisionTexteVise": "/15/textes/1481.asp#D_Article_5"
    }
  },
  "corps": {
    "dispositif": "<p>Compl&#233;ter le premier alin&#233;a de l&#8217;article&#160;122&#8209;1&#8209;1 du code de l&#8217;&#233;ducation par deux phrases ainsi r&#233;dig&#233;es&#160;:</p><p style=\"text-align: justify;\">&#171;&#160;Les &#233;l&#232;ves handicap&#233;s peuvent recevoir des aides et b&#233;n&#233;ficier de dispositifs adapt&#233;s pour l&#8217;acquisition, &#224; leur rythme, de ce socle commun. Ces aides et dispositifs sont indiqu&#233;s dans le projet personnalis&#233; de scolarisation des &#233;l&#232;ves handicap&#233;s.&#160;&#187;.</p>",
    "exposeSommaire": "<p>Cette modification est n&#233;cessaire afin de tenir compte des difficult&#233;s particuli&#232;res d&#8217;apprentissage des &#233;l&#232;ves handicap&#233;s mentaux qui peuvent mettre plus de temps &#224; ma&#238;triser ce socle commun, et pour qui, il est n&#233;cessaire de faire des adaptations de programme et de p&#233;dagogie. Il ne peut pas &#234;tre demand&#233; aux &#233;l&#232;ves handicap&#233;s de ma&#238;triser ce socle commun &#224; la m&#234;me allure que les autres et de la m&#234;me fa&#231;on. La ma&#238;trise de ce socle commun ne doit pas non plus &#234;tre une condition &#224; la continuit&#233; de leur scolarisation en &#233;tablissement scolaire ordinaire.</p>"
  },
  "representations": [
    {
      "nom": "PDF",
      "typeMime": {
        "type": "application",
        "subType": "PDF"
      },
      "statutRepresentation": {
        "verbatim": true,
        "canonique": true,
        "officielle": true,
        "transcription": false,
        "enregistrement": false
      },
      "contenu": {
        "documentURI": "/15/amendements/1481/CION-CEDU/AC16.pdf"
      }
    }
  ],
  "sort": {
    "dateSaisie": "2019-01-30T11:27:23.000+01:00",
    "sortEnSeance": "Rejeté"
  },
  "dateDepot": "2019-01-21T01:00:00.000+01:00",
  "dateDistribution": "2019-01-29T01:00:00.000+01:00",
  "article99": "0",
  "loiReference": {
    "codeLoi": "éducation",
    "divisionCodeLoi": "L122"
  }
}