{
  "uid": "AMANR5L15SEA717460BTC0902P0D1N2245",
  "identifiant": {
    "legislature": "15",
    "numero": "2245",
    "numRect": "0",
    "saisine": {
      "texteLegislatifRef": "PRJLANR5L15BTC0902",
      "numeroPartiePLF": "0",
      "organeExamen": "PO717460",
      "mentionSecondeDeliberation": "0"
    }
  },
  "numeroLong": "2245",
  "etapeTexte": "1ère lecture (1ère assemblée saisie)",
  "triAmendement": "ai",
  "cardinaliteAmdtMultiples": "1",
  "etat": "Discuté",
  "signataires": {
    "auteur": {
      "typeAuteur": "Gouvernement"
    },
    "texteAffichable": "le Gouvernement"
  },
  "pointeurFragmentTexte": {
    "division": {
      "titre": "Article 11 septies",
      "articleDesignationCourte": "ART. 11 SEPTIES",
      "type": "ARTICLE",
      "avantAApres": "A",
      "divisionRattachee": "ARTICLE 11 SEPTIES",
      "urlDivisionTexteVise": "/15/textes/0902.asp#D_Article_11_septies"
    }
  },
  "corps": {
    "dispositif": "<p>Supprimer cet article.</p>",
    "exposeSommaire": "<p style=\"text-align: justify;\">Les mentions obligatoires&#160;qui doivent figurer sur les supports de vente &#224; distance de denr&#233;es alimentaires (site internet, catalogue, etc.) sont harmonis&#233;es au niveau communautaire (r&#232;glement INCO 1169/2011). L&#8217;article&#160;14 de ce r&#232;glement pr&#233;voit d&#233;j&#224; le report sur le support de vente &#224; distance des mentions obligatoires figurant sur les denr&#233;es alimentaires.</p><p style=\"text-align: justify;\">Par ailleurs, la mesure n&#8217;apporte pas les justifications n&#233;cessaires pour rendre obligatoire, au niveau national, l&#8217;indication de mentions compl&#233;mentaires pr&#233;vues par la r&#233;glementation UE.</p><p style=\"text-align: justify;\">Pour ces diff&#233;rents motifs, il est propos&#233; de supprimer cet article.</p>"
  },
  "representations": [
    {
      "nom": "PDF",
      "typeMime": {
        "type": "application",
        "subType": "PDF"
      },
      "statutRepresentation": {
        "verbatim": true,
        "canonique": true,
        "officielle": true,
        "transcription": false,
        "enregistrement": false
      },
      "contenu": {
        "documentURI": "/15/amendements/0902/AN/2245.pdf"
      }
    }
  ],
  "seanceDiscussion": "RUANR5L15S2018IDS21108",
  "sort": {
    "dateSaisie": "2018-05-26T18:50:35.000+02:00",
    "sortEnSeance": "Rejeté"
  },
  "dateDepot": "2018-05-17T02:00:00.000+02:00",
  "dateDistribution": "2018-05-22T02:00:00.000+02:00",
  "article99": "0",
  "loiReference": {}
}