{
  "uid": "AMANR5L15PO59048B2272P2D1N114",
  "identifiant": {
    "legislature": "15",
    "numero": "114",
    "numRect": "0",
    "saisine": {
      "texteLegislatifRef": "PRJLANR5L15B2272",
      "numeroPartiePLF": "2",
      "organeExamen": "PO59048",
      "mentionSecondeDeliberation": "0"
    }
  },
  "numeroLong": "II-CF114",
  "etapeTexte": "1ère lecture (1ère assemblée saisie)",
  "triAmendement": "aniaaaaaaaaaaaaaaaaaaaaaaaaaaaaaaaaaaaaaaaaaaaaaaaws",
  "cardinaliteAmdtMultiples": "1",
  "etat": "Discuté",
  "signataires": {
    "auteur": {
      "typeAuteur": "Depute",
      "acteurRef": "PA718838",
      "groupePolitiqueRef": "PO730934"
    },
    "cosignatairesRefs": [
      "PA718838"
    ],
    "texteAffichable": "M.&#160;Brun"
  },
  "pointeurFragmentTexte": {
    "missionVisee": {
      "idMissionAN": "811",
      "libelleMission": "Économie",
      "codeMissionPLF": "B",
      "libelleMissionPLF": "Répartition, par mission et programme, des crédits du budget général"
    },
    "division": {
      "titre": "ÉTAT B",
      "articleDesignationCourte": "ART. 38",
      "type": "ANNEXE",
      "avantAApres": "A",
      "divisionRattachee": "ARTICLE 38",
      "urlDivisionTexteVise": "/15/textes/2272C.asp#D_ETAT_B"
    }
  },
  "corps": {
    "exposeSommaire": "<p style=\"text-align: justify;\">Le programme 343 porte une partie de la participation de l&#8217;&#201;tat au financement du plan France Tr&#232;s haut d&#233;bit.</p><p style=\"text-align: justify;\">Lors de la pr&#233;sentation de ce plan, en 2013, l&#8217;&#201;tat s&#8217;&#233;tait engag&#233; &#224; mettre en place des moyens financiers substantiels et p&#233;rennes pour acc&#233;l&#233;rer les projets des collectivit&#233;s territoriales en mati&#232;re de couverture num&#233;rique du territoire (pr&#234;ts de long terme aux collectivit&#233;s territoriales pour financer &#224; long terme leurs projets de d&#233;ploiements du tr&#232;s haut d&#233;bit&#160;; des subventions aux r&#233;seaux d&#8217;initiative publique). Il s&#8217;&#233;tait notamment engag&#233; &#224; aider tout particuli&#232;rement les territoires o&#249; le poids de ces investissements est le plus lourd, particuli&#232;rement les territoires les plus ruraux dans le cadre du Fonds national pour la soci&#233;t&#233; num&#233;rique (FSN).</p><p style=\"text-align: justify;\">Toutefois, sur le terrain, il appara&#238;t que le reste &#224; charge demeure important pour les communaut&#233;s de communes f&#233;d&#233;r&#233;es au sein de syndicats charg&#233;s de d&#233;ployer la fibre optique, comme c&#8217;est le cas au sein d&#8217;Ard&#232;che Dr&#244;me Num&#233;rique.</p><p style=\"text-align: justify;\">Alors que dans les grandes m&#233;tropoles et aires urbaines agglom&#233;r&#233;es denses, et par cons&#233;quent rentables, ce sont les op&#233;rateurs qui supportent le co&#251;t du d&#233;ploiement des infrastructures num&#233;riques, sans aucun co&#251;t restant &#224; charge des grandes villes et des m&#233;tropoles, cr&#233;ant ainsi une in&#233;galit&#233; territoriale suppl&#233;mentaire.</p><p style=\"text-align: justify;\">Afin de r&#233;tablir l&#8217;&#233;quit&#233; de financement et d&#8217;acc&#232;s au service num&#233;rique universel, le pr&#233;sent amendement vise &#224; proc&#233;der au transfert de millions d&#8217;euros de l&#8217;action 01 &#171;&#160;Infrastructures statistiques&#160;&#187; du programme 220 &#171;&#160;Statistiques et &#233;tudes &#233;conomiques&#160;&#187; vers l&#8217;action 01 &#171;&#160;r&#233;seau d&#8217;initiative publique&#160;&#187; du programme n&#176;&#160;343 &#171;&#160;Plan France Tr&#232;s haut D&#233;bit&#160;&#187;, afin d&#8217;alimenter le Fonds national pour la soci&#233;t&#233; num&#233;rique et financer des actions sp&#233;cifiques de soutiens aux intercommunalit&#233;s et syndicats intercommunaux dans leurs projets de d&#233;ploiements de r&#233;seaux.</p>",
    "dispositifAmdtCredit": {
      "listeProgrammes": [
        {
          "libelle": "Développement des entreprises et régulations",
          "id": "68376",
          "AE": {
            "montantPositif": "0",
            "montantNegatif": "0"
          },
          "CP": {
            "montantPositif": "0",
            "montantNegatif": "0"
          },
          "action": "modification"
        },
        {
          "libelle": "Plan France Très haut débit",
          "id": "68377",
          "AE": {
            "montantPositif": "10000000",
            "montantNegatif": "0"
          },
          "CP": {
            "montantPositif": "10000000",
            "montantNegatif": "0"
          },
          "action": "modification"
        },
        {
          "libelle": "Statistiques et études économiques",
          "id": "68378",
          "AE": {
            "montantPositif": "0",
            "montantNegatif": "10000000"
          },
          "CP": {
            "montantPositif": "0",
            "montantNegatif": "10000000"
          },
          "action": "modification"
        },
        {
          "libelle": "Stratégie économique et fiscale",
          "id": "68379",
          "AE": {
            "montantPositif": "0",
            "montantNegatif": "0"
          },
          "CP": {
            "montantPositif": "0",
            "montantNegatif": "0"
          },
          "action": "modification"
        }
      ],
      "totalAE": {
        "montantPositif": "10000000",
        "montantNegatif": "10000000",
        "solde": "0"
      },
      "totalCP": {
        "montantPositif": "10000000",
        "montantNegatif": "10000000",
        "solde": "0"
      }
    }
  },
  "representations": [
    {
      "nom": "PDF",
      "typeMime": {
        "type": "application",
        "subType": "PDF"
      },
      "statutRepresentation": {
        "verbatim": true,
        "canonique": true,
        "officielle": true,
        "transcription": false,
        "enregistrement": false
      },
      "contenu": {
        "documentURI": "/15/amendements/2272C/CION_FIN/CF114.pdf"
      }
    }
  ],
  "sort": {
    "dateSaisie": "2019-10-23T16:06:50.000+02:00",
    "sortEnSeance": "Rejeté"
  },
  "dateDepot": "2019-10-15T02:00:00.000+02:00",
  "dateDistribution": "2019-10-23T02:00:00.000+02:00",
  "article99": "0",
  "loiReference": {}
}