{
  "uid": "AMANR5L15SEA717460BTC0581P0D1N66",
  "identifiant": {
    "legislature": "15",
    "numero": "66",
    "numRect": "0",
    "saisine": {
      "texteLegislatifRef": "PIONANR5L15BTC0581",
      "numeroPartiePLF": "0",
      "organeExamen": "PO717460",
      "mentionSecondeDeliberation": "0"
    }
  },
  "numeroLong": "66",
  "etapeTexte": "1ère lecture (1ère assemblée saisie)",
  "triAmendement": "bo",
  "cardinaliteAmdtMultiples": "1",
  "etat": "Discuté",
  "signataires": {
    "auteur": {
      "typeAuteur": "Depute",
      "acteurRef": "PA720644",
      "groupePolitiqueRef": "PO730934"
    },
    "cosignatairesRefs": [
      "PA721070",
      "PA2377",
      "PA721314",
      "PA720644",
      "PA267204",
      "PA721474",
      "PA1874",
      "PA643134",
      "PA767",
      "PA719318",
      "PA642847",
      "PA267324",
      "PA609245"
    ],
    "texteAffichable": "M.&#160;Nury,  Mme&#160;Anthoine, M.&#160;Cattin, M.&#160;Bazin, M.&#160;Gaultier, Mme&#160;Lacroute, M.&#160;Le Fur, M.&#160;Perrut, Mme&#160;Ramassamy, M.&#160;Schellenberger, M.&#160;Sermier, Mme&#160;Valentin et M.&#160;Viry"
  },
  "pointeurFragmentTexte": {
    "division": {
      "titre": "Article 3",
      "articleDesignationCourte": "APRÈS ART. 3",
      "type": "ARTICLE",
      "avantAApres": "Apres",
      "divisionRattachee": "APRÈS L'ARTICLE 3, insérer l'article suivant:",
      "articleAdditionnel": "1",
      "urlDivisionTexteVise": "/15/textes/0581.asp#D_Article_3"
    }
  },
  "corps": {
    "dispositif": "<p style=\"text-align: justify;\">Le I de l&#8217;article L.&#160;2224&#8209;12&#8209;4 du code g&#233;n&#233;ral des collectivit&#233;s territoriales est compl&#233;t&#233; par deux alin&#233;as ainsi r&#233;dig&#233;s&#160;:</p><p style=\"text-align: justify;\">&#171;&#160;Les &#233;tablissements publics de coop&#233;ration intercommunale assurant le service de distribution d&#8217;eau potable et d&#8217;assainissement collectif selon des modalit&#233;s diff&#233;rentes sur le territoire en raison de l&#8217;existence de r&#233;seaux distincts peuvent appliquer des tarifs diff&#233;renci&#233;s afin de prendre en compte le co&#251;t r&#233;el du service eau et assainissement.</p><p style=\"text-align: justify;\">&#171;&#160;Afin d&#8217;&#233;tablir le co&#251;t effectif du service de distribution d&#8217;eau ou d&#8217;assainissement collectif, les &#233;tablissements publics de coop&#233;ration intercommunale peuvent ouvrir autant de budgets annexes que de r&#233;seaux distincts en service.&#160;&#187;</p>",
    "exposeSommaire": "<p style=\"text-align: justify;\">Les EPCI ayant pris la comp&#233;tence eau et assainissement ant&#233;rieurement exerc&#233;e par les communes h&#233;ritent de situations tr&#232;s contrast&#233;es. L&#8217;&#233;tat d&#8217;entretien des infrastructures, leur co&#251;t de fonctionnement et les conditions d&#8217;exploitation pouvant &#234;tre g&#233;r&#233;s en r&#233;gie ou en d&#233;l&#233;gation de service public sont autant d&#8217;&#233;l&#233;ments qui am&#232;nent &#224; une d&#233;finition tr&#232;s variable du prix des services de distribution de l&#8217;eau potable et d&#8217;assainissement collectif. Afin d&#8217;&#233;viter des &#233;volutions brutales du prix de ces services, il est n&#233;cessaire de donner aux EPCI les moyens comptables de b&#226;tir une politique d&#8217;harmonisation progressive des prix des services de distribution d&#8217;eau potable et d&#8217;assainissement collectif. Cet amendement propose donc de permettre aux EPCI exer&#231;ant la comp&#233;tence eau et assainissement de d&#233;finir des tarifs diff&#233;renci&#233;s et d&#8217;ouvrir des budgets annexes pour chaque unit&#233; de production d&#8217;eau et d&#8217;assainissement collectif pr&#233;c&#233;demment g&#233;r&#233;e par les communes membres de l&#8217;EPCI ou par un syndicat ad hoc dissout.</p>"
  },
  "representations": [
    {
      "nom": "PDF",
      "typeMime": {
        "type": "application",
        "subType": "PDF"
      },
      "statutRepresentation": {
        "verbatim": true,
        "canonique": true,
        "officielle": true,
        "transcription": false,
        "enregistrement": false
      },
      "contenu": {
        "documentURI": "/15/amendements/0581/AN/66.pdf"
      }
    }
  ],
  "seanceDiscussion": "RUANR5L15S2018IDS20888",
  "sort": {
    "dateSaisie": "2018-01-31T03:03:11.000+01:00",
    "sortEnSeance": "Rejeté"
  },
  "dateDepot": "2018-01-25T01:00:00.000+01:00",
  "dateDistribution": "2018-01-29T01:00:00.000+01:00",
  "article99": "0",
  "loiReference": {
    "codeLoi": "CGCT",
    "divisionCodeLoi": "L2224-12-4"
  }
}