{
  "uid": "AMANR5L15PO419865B1255P1D1N103",
  "identifiant": {
    "legislature": "15",
    "numero": "103",
    "numRect": "0",
    "saisine": {
      "texteLegislatifRef": "PRJLANR5L15B1255",
      "numeroPartiePLF": "1",
      "organeExamen": "PO419865",
      "mentionSecondeDeliberation": "0"
    }
  },
  "numeroLong": "I-CD103",
  "etapeTexte": "1ère lecture (1ère assemblée saisie)",
  "triAmendement": "blaaaaaaaaaaaaaaaaaaaaaaaaaaaaaaaaaaaaaaaaaaaaaaaaetb",
  "cardinaliteAmdtMultiples": "1",
  "etat": "Discuté",
  "signataires": {
    "auteur": {
      "typeAuteur": "Depute",
      "acteurRef": "PA718802",
      "groupePolitiqueRef": "PO730964"
    },
    "cosignatairesRefs": [
      "PA609520",
      "PA719412",
      "PA718802"
    ],
    "texteAffichable": "M.&#160;Perea,  Mme&#160;Pompili et Mme&#160;Le Feur"
  },
  "pointeurFragmentTexte": {
    "division": {
      "titre": "Article 8",
      "articleDesignationCourte": "APRÈS ART. 8",
      "type": "ARTICLE",
      "avantAApres": "Apres",
      "divisionRattachee": "APRÈS L'ARTICLE 8, insérer l'article suivant:",
      "articleAdditionnel": "1",
      "urlDivisionTexteVise": "/15/textes/1255A.asp#D_Article_8"
    }
  },
  "corps": {
    "dispositif": "<p style=\"text-align: justify;\">Le chapitre III du titre I<sup>er</sup> de la premi&#232;re partie du livre I<sup>er</sup> du code g&#233;n&#233;ral des imp&#244;ts est compl&#233;t&#233; par une section XXIII ainsi r&#233;dig&#233;e&#160;:</p><p style=\"text-align: justify;\">&#171;&#160;Section XXIII&#160;:&#160;Contribution sur les gobelets jetables</p><p style=\"text-align: justify;\">&#171;&#160;<i>Art.&#160;235</i>&#160;ter&#160;<i>ZG</i>.&#160;&#8211;&#160;Il est institu&#233; &#224; compter du 1<sup>er</sup> janvier 2020 une&#160;contribution d&#233;nomm&#233;e &#171;&#160;contribution sur les gobelets jetables&#160;&#187;, exigible le 1<sup>er</sup> janvier de chaque ann&#233;e, due par les&#160;personnes morales vendant aux consommateurs des boissons &#224; emporter, de 25 centimes d&#8217;euro par boisson. La&#160;contribution est due pour chaque boisson vendue dans un gobelet jetable. Son co&#251;t est r&#233;percut&#233; sur le consommateur auquel une communication appropri&#233;e en explique la vis&#233;e&#160;: l&#8217;inciter &#224; se munir de son propre r&#233;cipient lors de l&#8217;achat d&#8217;une boisson &#224; emporter, de mani&#232;re &#224; &#233;viter la production de d&#233;chets non recycl&#233;s li&#233;e &#224; l&#8217;utilisation d&#8217;un gobelet jetable.&#160;&#187;</p>",
    "exposeSommaire": "<p>La majorit&#233; des consommateurs pense que les gobelets en carton utilis&#233;s lors de l&#8217;achat d&#8217;un caf&#233; (ou autre boisson) &#224; emporter sont recycl&#233;s. Or il n&#8217;en est rien&#160;: la plupart de ces gobelets ne sont recyclables que dans des conditions sp&#233;cifiques, et ne sont en r&#233;alit&#233; pas recycl&#233;s en raison du film plastique dont ils sont recouverts pour assurer leur &#233;tanch&#233;it&#233;. Dans les cas o&#249; ce film plastique peut &#234;tre s&#233;par&#233; de la partie en carton, cette derni&#232;re est souill&#233;e par le contenu et n&#8217;est plus recyclable&#8230; De plus ces gobelets sont accompagn&#233;s d&#8217;un couvercle qui lui est syst&#233;matiquement en plastique.</p><p>La consommation de caf&#233; &#224; emporter se d&#233;veloppe fortement&#160;: il faut accompagner ce d&#233;veloppement de mesures assurant qu&#8217;il ne soit pas synonyme d&#8217;une augmentation simultan&#233;e des d&#233;chets non recyclables produits en France, alors m&#234;me que nous cherchons &#224; faire diminuer drastiquement le nombre de ces d&#233;chets.</p><p>Par ailleurs, quand bien m&#234;me ces gobelets seraient recyclables, leur production puis leur recyclage sont consommateurs d&#8217;une &#233;nergie que nous ne pouvons plus nous permettre de d&#233;penser &#224; la l&#233;g&#232;re, dans le contexte de rar&#233;faction des ressources et de changement climatique qui est le n&#244;tre.</p><p>Dans divers pays, comme par exemple aux Etats-Unis ou en Argentine, il est courant de se d&#233;placer avec sa tasse ou son thermos pour &#233;viter la consommation de gobelets jetables.</p><p>Au Royaume-Uni, une taxe de 25 pence sur les gobelets jetables est &#224; l&#8217;&#233;tude par le Parlement, &#224; la suite d&#8217;un rapport de la Commission environnement (Environmental Audit Committee)&#160;: voir https://social.shorthand.com/CommonsEAC/3gPQsrQOuEn/the-government-should-introduce-a-25p-latte-levy-on-disposable-coffee-cups&#160;et https://publications.parliament.uk/pa/cm201719/cmselect/cmenvaud/657/657.pdf. L&#8217;objectif est d&#8217;inciter les consommateurs &#224; apporter leur propre tasse ou thermos, leur caf&#233; leur revenant ainsi moins cher. Ce projet de taxe est appel&#233; &#171;&#160;latte levy&#160;&#187; et a fait l&#8217;objet de communications enthousiastes dans la presse britannique. Il fait suite &#224; une p&#233;tition suivie elle-m&#234;me d&#8217;une initiative de grandes marques telles Starbucks ou Pr&#234;t-&#224;-Manger qui proposent une r&#233;duction aux consommateurs qui viennent acheter une boisson &#224; emporter avec leur propre tasse. L&#8217;initiative a &#233;t&#233; salu&#233;e mais il a &#233;t&#233; d&#233;montr&#233; que la r&#233;duction propos&#233;e &#233;tait insuffisamment incitative, et qu&#8217;une taxe &#233;tait pr&#233;f&#233;rable pour faire r&#233;ellement &#233;voluer les comportements.</p><p>Il est propos&#233; de s&#8217;inspirer de cette initiative de notre voisin europ&#233;en pour instaurer en France une &#171;&#160;contribution caf&#233;&#160;&#187; qui incitera les consommateurs &#224; changer leurs pratiques, et contribuera au financement de l&#8217;am&#233;lioration des infrastructures de recyclage situ&#233;es dans l&#8217;espace public, utilis&#233;es par les consommateurs pour jeter les gobelets et autres vaisselle et sacs jetables li&#233;s &#224; la consommation d&#8217;alimentation &#224; emporter.<br />Cette contribution devrait &#234;tre incitative sans avoir d'incidence n&#233;faste pour les personnes les moins ais&#233;es, qui ne sont pas celles qui consomment le plus souvent ce type de caf&#233;s &#224; emporter.</p>"
  },
  "representations": [
    {
      "nom": "PDF",
      "typeMime": {
        "type": "application",
        "subType": "PDF"
      },
      "statutRepresentation": {
        "verbatim": true,
        "canonique": true,
        "officielle": true,
        "transcription": false,
        "enregistrement": false
      },
      "contenu": {
        "documentURI": "/15/amendements/1255A/CION-DVP/CD103.pdf"
      }
    }
  ],
  "sort": {
    "dateSaisie": "2018-10-03T12:26:42.000+02:00",
    "sortEnSeance": "Retiré"
  },
  "dateDepot": "2018-09-28T02:00:00.000+02:00",
  "dateDistribution": "2018-10-02T02:00:00.000+02:00",
  "article99": "0",
  "loiReference": {
    "codeLoi": "impôts",
    "divisionCodeLoi": "235 quater"
  }
}