{
  "uid": "AMANR5L15PO59051B0809P0D1N36",
  "identifiant": {
    "legislature": "15",
    "numero": "36",
    "numRect": "0",
    "saisine": {
      "texteLegislatifRef": "PRJLANR5L15B0809",
      "numeroPartiePLF": "0",
      "organeExamen": "PO59051",
      "mentionSecondeDeliberation": "0"
    }
  },
  "numeroLong": "CL36",
  "etapeTexte": "Nouvelle Lecture",
  "triAmendement": "w",
  "cardinaliteAmdtMultiples": "1",
  "etat": "Discuté",
  "signataires": {
    "auteur": {
      "typeAuteur": "Depute",
      "acteurRef": "PA721142",
      "groupePolitiqueRef": "PO730964"
    },
    "cosignatairesRefs": [
      "PA721142"
    ],
    "texteAffichable": "Mme&#160;Forteza, rapporteure"
  },
  "pointeurFragmentTexte": {
    "division": {
      "titre": "Article 19",
      "articleDesignationCourte": "ART. 19",
      "type": "ARTICLE",
      "avantAApres": "A",
      "divisionRattachee": "ARTICLE 19",
      "urlDivisionTexteVise": "/15/textes/0809.asp#D_Article_19"
    },
    "alinea": {
      "numero": "108"
    }
  },
  "corps": {
    "dispositif": "<p style=\"text-align: justify;\">&#192; l&#8217;alin&#233;a&#160;108, substituer au mot&#160;:</p><p style=\"text-align: justify;\">&#171;&#160;conform&#233;ment&#160;&#187;,</p><p style=\"text-align: justify;\">les mots&#160;:</p><p style=\"text-align: justify;\">&#171;&#160;par d&#233;rogation&#160;&#187;.</p>",
    "exposeSommaire": "<p>Amendement r&#233;dactionnel.</p>"
  },
  "representations": [
    {
      "nom": "PDF",
      "typeMime": {
        "type": "application",
        "subType": "PDF"
      },
      "statutRepresentation": {
        "verbatim": true,
        "canonique": true,
        "officielle": true,
        "transcription": false,
        "enregistrement": false
      },
      "contenu": {
        "documentURI": "/15/amendements/0809/CION_LOIS/CL36.pdf"
      }
    }
  ],
  "sort": {
    "dateSaisie": "2018-04-10T19:23:21.000+02:00",
    "sortEnSeance": "Adopté"
  },
  "dateDepot": "2018-04-09T02:00:00.000+02:00",
  "dateDistribution": "2018-04-10T02:00:00.000+02:00",
  "article99": "0",
  "loiReference": {
    "codeLoi": "2"
  }
}