{
  "uid": "AMANR5L15PO419865B2135P0D1N651",
  "identifiant": {
    "legislature": "15",
    "numero": "651",
    "numRect": "0",
    "saisine": {
      "texteLegislatifRef": "PRJLANR5L15B2135",
      "numeroPartiePLF": "0",
      "organeExamen": "PO419865",
      "mentionSecondeDeliberation": "0"
    }
  },
  "numeroLong": "CD651",
  "etapeTexte": "Nouvelle Lecture",
  "triAmendement": "adiaaaaaaaaaaaaaaaaaaaaaaaaaaaaaaaaaaaaaaaaaaaaaaaakak",
  "cardinaliteAmdtMultiples": "1",
  "etat": "Discuté",
  "signataires": {
    "auteur": {
      "typeAuteur": "Depute",
      "acteurRef": "PA266808",
      "groupePolitiqueRef": "PO730934"
    },
    "cosignatairesRefs": [
      "PA340853",
      "PA718884",
      "PA722390",
      "PA721968",
      "PA267429",
      "PA718850",
      "PA719318",
      "PA712015",
      "PA720586",
      "PA266808",
      "PA267204",
      "PA266793",
      "PA2377",
      "PA721678",
      "PA718784",
      "PA767"
    ],
    "texteAffichable": "M.&#160;Rolland,  M.&#160;Pauget, M.&#160;Cattin, M.&#160;Cinieri, M.&#160;Sermier, Mme&#160;Corneloup, M.&#160;Dive, M.&#160;Leclerc, M.&#160;Bony, M.&#160;Vialay, M.&#160;Reda, M.&#160;Perrut, M.&#160;Cordier, Mme&#160;Bazin-Malgras, Mme&#160;Anthoine et M.&#160;Vatin"
  },
  "pointeurFragmentTexte": {
    "division": {
      "titre": "Article PREMIER",
      "articleDesignationCourte": "ART. PREMIER",
      "type": "ARTICLE",
      "avantAApres": "A",
      "divisionRattachee": "ARTICLE PREMIER",
      "urlDivisionTexteVise": "/15/textes/2135.asp#D_Article_1er"
    },
    "alinea": {
      "avantAApres": "A",
      "numero": "5",
      "alineaDesignation": "Alinéa 5"
    }
  },
  "corps": {
    "dispositif": "<p style=\"text-align: justify;\">&#192; l&#8217;alin&#233;a&#160;5, apr&#232;s le mot&#160;:</p><p style=\"text-align: justify;\">&#171;&#160;transfrontaliers,&#160;&#187;,</p><p style=\"text-align: justify;\">ins&#233;rer les mots&#160;:</p><p style=\"text-align: justify;\">&#171;&#160;des cartes scolaires,&#160;&#187;.</p>",
    "exposeSommaire": "<p style=\"text-align: justify;\">Les enjeux li&#233;s &#224; la carte scolaire doivent &#233;galement &#234;tre pris en compte dans la programmation des infrastructures. Ce sont des d&#233;placements v&#233;cus quotidiennement par des dizaines de milliers d&#8217;&#233;l&#232;ves.&#160;</p>"
  },
  "representations": [
    {
      "nom": "PDF",
      "typeMime": {
        "type": "application",
        "subType": "PDF"
      },
      "statutRepresentation": {
        "verbatim": true,
        "canonique": true,
        "officielle": true,
        "transcription": false,
        "enregistrement": false
      },
      "contenu": {
        "documentURI": "/15/amendements/2135/CION-DVP/CD651.pdf"
      }
    }
  ],
  "sort": {
    "dateSaisie": "2019-09-02T17:10:12.000+02:00",
    "sortEnSeance": "Retiré"
  },
  "dateDepot": "2019-08-29T02:00:00.000+02:00",
  "dateDistribution": "2019-08-31T02:00:00.000+02:00",
  "article99": "0",
  "loiReference": {}
}