{
  "uid": "AMANR5L15SEA717460BTC1767P0D1N1713",
  "identifiant": {
    "legislature": "15",
    "numero": "1713",
    "numRect": "0",
    "saisine": {
      "texteLegislatifRef": "PRJLANR5L15BTC1767",
      "numeroPartiePLF": "0",
      "organeExamen": "PO717460",
      "mentionSecondeDeliberation": "0"
    }
  },
  "numeroLong": "1713",
  "etapeTexte": "1ère lecture (1ère assemblée saisie)",
  "triAmendement": "bwaaaaaaaaaaaaaaaaaaaaaaaaaaaaaaaaaaaaaaaaaaaaaaaazzzzzzzzzzzzzzy",
  "cardinaliteAmdtMultiples": "1",
  "etat": "Irrecevable",
  "signataires": {
    "auteur": {
      "typeAuteur": "Depute",
      "acteurRef": "PA643134",
      "groupePolitiqueRef": "PO730934"
    },
    "cosignatairesRefs": [
      "PA608016",
      "PA643134",
      "PA719272",
      "PA718780",
      "PA340853",
      "PA267378",
      "PA267735",
      "PA332523",
      "PA719318",
      "PA267204",
      "PA718884",
      "PA720684",
      "PA267260",
      "PA722390",
      "PA605036",
      "PA346218"
    ],
    "texteAffichable": "Mme&#160;Valentin,  M.&#160;Abad, Mme&#160;Anthoine, Mme&#160;Bazin-Malgras, M.&#160;Pierre-Henri&#160;Dumont, Mme&#160;Corneloup, M.&#160;Sermier, M.&#160;Leclerc, Mme&#160;Meunier, Mme&#160;Levy, M.&#160;Masson, Mme&#160;Poletti, Mme&#160;Dalloz, Mme&#160;Louwagie, M.&#160;de Ganay et Mme&#160;Trastour-Isnart"
  },
  "pointeurFragmentTexte": {
    "division": {
      "titre": "Article 7",
      "articleDesignationCourte": "APRÈS ART. 7",
      "type": "ARTICLE",
      "avantAApres": "Apres",
      "divisionRattachee": "APRÈS L'ARTICLE 7, insérer l'article suivant:",
      "articleAdditionnel": "1",
      "urlDivisionTexteVise": "/15/textes/1767.asp#D_Article_7"
    }
  },
  "corps": {
    "dispositif": "<p>&#192; la fin de l&#8217;exp&#233;rimentation des maisons de naissance en novembre 2020, ces derni&#232;res seront g&#233;n&#233;ralis&#233;es sur l&#8217;ensemble du territoire fran&#231;ais.</p>",
    "exposeSommaire": "<p>Avec les h&#244;pitaux de proximit&#233;, les maternit&#233;s vont &#234;tre de plus en plus &#233;loign&#233;es des zones d&#233;j&#224; sous-dot&#233;es dans ce domaine. Les maisons de naissance ne vont certes pas r&#233;soudre les difficult&#233;s territoriales rencontr&#233;es dans les zones rurales, puisqu&#8217;elles doivent obligatoirement se situer &#224; proximit&#233; d&#8217;un &#233;tablissement de sant&#233;. Cependant, elles permettront de d&#233;gager des places dans les maternit&#233;s, puisque toute femme ayant une grossesse &#224; bas risque pourront faire le choix d&#8217;y accoucher si elles le souhaitent.</p>"
  },
  "representations": [
    {
      "nom": "PDF",
      "typeMime": {
        "type": "application",
        "subType": "PDF"
      },
      "statutRepresentation": {
        "verbatim": true,
        "canonique": true,
        "officielle": true,
        "transcription": false,
        "enregistrement": false
      },
      "contenu": {
        "documentURI": "/15/amendements/1767/AN/1713.pdf"
      }
    }
  ],
  "dateDepot": "2019-03-15T01:00:00.000+01:00",
  "dateDistribution": "2019-03-18T01:00:00.000+01:00",
  "article99": "0",
  "loiReference": {}
}