{
  "uid": "AMANR5L15SEA717460B1255P2D1N1132",
  "identifiant": {
    "legislature": "15",
    "numero": "1132",
    "numRect": "0",
    "saisine": {
      "texteLegislatifRef": "PRJLANR5L15B1255",
      "numeroPartiePLF": "2",
      "organeExamen": "PO717460",
      "mentionSecondeDeliberation": "0"
    }
  },
  "numeroLong": "II-1132",
  "etapeTexte": "1ère lecture (1ère assemblée saisie)",
  "triAmendement": "anoaaaaaaaaaaaaaaaaaaaaaaaaaaaaaaaaaaaaaaaaaaaaaaaof",
  "cardinaliteAmdtMultiples": "1",
  "etat": "Discuté",
  "signataires": {
    "auteur": {
      "typeAuteur": "Depute",
      "acteurRef": "PA722228",
      "groupePolitiqueRef": "PO730964"
    },
    "cosignatairesRefs": [
      "PA722228",
      "PA720222"
    ],
    "texteAffichable": "M.&#160;Leclabart et M.&#160;Girardin"
  },
  "pointeurFragmentTexte": {
    "missionVisee": {
      "idMissionAN": "418",
      "libelleMission": "Sécurités",
      "codeMissionPLF": "B",
      "libelleMissionPLF": "Répartition, par mission et programme, des crédits du budget général"
    },
    "division": {
      "titre": "Article 81",
      "articleDesignationCourte": "APRÈS ART. 81",
      "type": "ARTICLE",
      "avantAApres": "Apres",
      "divisionRattachee": "APRÈS L'ARTICLE 81, insérer l'article suivant:",
      "articleAdditionnel": "1",
      "urlDivisionTexteVise": "/15/textes/1255C.asp#D_Article_81"
    }
  },
  "corps": {
    "dispositif": "<p style=\"text-align: justify;\">Le Gouvernement remet au Parlement, dans un d&#233;lai de six mois &#224; compter de la promulgation de la pr&#233;sente loi, un rapport dressant le bilan de la mise en &#339;uvre de l&#8217;instruction minist&#233;rielle du 15 mai 2018 relative &#224; l&#8217;indemnisation des services d&#8217;ordre. Il &#233;value notamment&#160;son impact sur l&#8217;&#233;volution des co&#251;ts de s&#233;curit&#233; &#224; la charge des organisateurs de spectacles vivants, de vari&#233;t&#233;s et de musiques actuelles, ses effets &#233;conomiques et budg&#233;taires sur la fili&#232;re, ainsi que l&#8217;opportunit&#233; de p&#233;renniser et, le cas &#233;ch&#233;ant, d&#8217;augmenter&#160;la dotation du&#160;fonds d&#8217;urgence pour le spectacle vivant, voire d&#8217;abroger l&#8217;instruction minist&#233;rielle du 15 mai 2018.</p>",
    "exposeSommaire": "<p style=\"text-align: justify;\">Le secteur des f&#234;tes et spectacles historiques demeure profond&#233;ment marqu&#233; par les attentats qui ont endeuill&#233; la France &#224; partir de 2015 et ce malgr&#233; une reprise r&#233;cente de la fr&#233;quentation. Les mesures de s&#251;ret&#233; progressivement mises en place ont boulevers&#233; l&#8217;environnement dans lequel op&#232;rent les structures artistiques et culturelles et ont consid&#233;rablement accru leurs co&#251;ts de fonctionnement. La s&#233;curit&#233; des lieux et manifestations culturelles constitue en effet un axe important de la politique gouvernementale &#224; l&#8217;&#233;gard des op&#233;rateurs et des acteurs du secteur, avec pour objectif de restaurer la confiance du public.</p><p style=\"text-align: justify;\">Dans ce contexte, une instruction minist&#233;rielle du 15 mai 2018 est venue clarifier la doctrine d&#8217;indemnisation des services d&#8217;ordre mis &#224; la disposition des organisateurs de spectacles par la puissance publique. Le texte proc&#232;de &#224; une distinction entre les missions de service d&#8217;ordre qui rel&#232;vent des obligations normales de la puissance publique et le &#171;&#160;p&#233;rim&#232;tre missionel&#160;&#187;, &#224; savoir les missions effectu&#233;es au profit de l&#8217;organisateur et qui doivent, &#224; ce titre, faire l&#8217;objet d&#8217;un remboursement des frais engag&#233;s par l&#8217;&#201;tat.</p><p style=\"text-align: justify;\">Malgr&#233; le caract&#232;re g&#233;n&#233;rique de la d&#233;finition du p&#233;rim&#232;tre missionnel et le souci attach&#233; &#224; la concertation entre organisateurs et forces de s&#233;curit&#233; int&#233;rieure qui devaient permettre une adaptation pragmatique du dispositif et une pr&#233;visibilit&#233; de la facturation, de nombreux festivals ont vu leurs d&#233;penses de s&#233;curit&#233; augmenter consid&#233;rablement.</p><p style=\"text-align: justify;\">Cette situation concerne aussi bien les festivals les plus importants que les plus modestes. A titre d&#8217;exemple, le budget s&#233;curit&#233; d&#8217;un des plus importants festivals fran&#231;ais, &#171;&#160;les Vieilles Charrues&#160;&#187;, a augment&#233; de 300&#160;000&#160;euros depuis les attentats, tandis que &#171;&#160;la Route du Rock&#160;&#187;, festival bas&#233; &#224; Saint-Malo, alloue 50&#160;000&#160;euros par an de plus &#224; son budget s&#233;curit&#233;. Dans certains cas, l&#8217;augmentation de la charge financi&#232;re d&#233;passe les 800&#160;%, &#224; l&#8217;instar du festival des &#171;&#160;Eurock&#233;ennes&#160;&#187; dont le co&#251;t de prise en charge du service d&#8217;ordre est pass&#233; de 30&#160;000&#160;euros en 2017 &#224; 254&#160;000&#160;euros en 2018.</p><p style=\"text-align: justify;\">De fa&#231;on transitoire, le fonds d&#8217;urgence pour le spectacle vivant a &#233;t&#233; mis en place pour garantir la viabilit&#233; &#233;conomique de petits festivals ind&#233;pendants, pourtant essentiels &#224; la libert&#233; de cr&#233;ation, quand les grands festivals sont davantage outill&#233;s pour absorber les surco&#251;ts li&#233;s aux mesures de s&#233;curit&#233;. Ce fonds arrive d&#8217;ailleurs &#224; expiration fin 2018.</p><p style=\"text-align: justify;\">De nombreux organisateurs sont tr&#232;s inquiets quant &#224; l&#8217;avenir de leur activit&#233; car contraints de r&#233;orienter leurs d&#233;penses au d&#233;triment du fond m&#234;me de leur manifestation alors qu&#8217;ils r&#233;pugnent &#224; augmenter les participations financi&#232;res des familles. Les premi&#232;res victimes sont bien les prestataires de ces manifestations&#160;: artistes et techniciens professionnels ou amateurs qui sont les partenaires naturels mais dont certains cachets ou indemnisations ne sont plus supportables par les budgets eux-m&#234;mes amput&#233;s de plusieurs subventions publiques et la question de savoir s&#8217;il faut poursuivre l&#8217;accompagnement des &#233;tablissements du spectacle vivant face aux contraintes de s&#233;curit&#233; au-del&#224; de 2018 reste pos&#233;e.</p><p style=\"text-align: justify;\">&#160;</p><p style=\"text-align: justify;\">C&#8217;est pourquoi le pr&#233;sent amendement demande au Gouvernement l&#8217;&#233;tablissement d&#8217;un rapport visant &#224; mesurer finement l&#8217;impact de l&#8217;instruction minist&#233;rielle du 15 mai 2018 sur l&#8217;&#233;volution des co&#251;ts de s&#233;curit&#233; &#224; la charge des organisateurs de f&#234;tes et spectacles historiques et &#224; &#233;valuer l&#8217;opportunit&#233; d&#8217;abroger l&#8217;instruction minist&#233;rielle du 15 mai 2018.</p><p style=\"text-align: justify;\">Ce rapport tiendra compte des aspects financiers mais aussi du r&#244;le d&#8217;animateurs du territoire que sont ces manifestations et les b&#233;n&#233;voles qui les organisent.</p><p style=\"text-align: justify;\">&#160;</p><p style=\"text-align: justify;\">&#160;</p><p style=\"text-align: justify;\">&#160;</p>"
  },
  "representations": [
    {
      "nom": "PDF",
      "typeMime": {
        "type": "application",
        "subType": "PDF"
      },
      "statutRepresentation": {
        "verbatim": true,
        "canonique": true,
        "officielle": true,
        "transcription": false,
        "enregistrement": false
      },
      "contenu": {
        "documentURI": "/15/amendements/1255C/AN/1132.pdf"
      }
    }
  ],
  "seanceDiscussion": "RUANR5L15S2019IDS21328",
  "sort": {
    "dateSaisie": "2018-11-06T23:28:31.000+01:00",
    "sortEnSeance": "Retiré"
  },
  "dateDepot": "2018-11-02T01:00:00.000+01:00",
  "dateDistribution": "2018-11-05T01:00:00.000+01:00",
  "article99": "0",
  "loiReference": {}
}