{
  "uid": "AMANR5L15SEA717460BTC1237P0D1N2138",
  "identifiant": {
    "legislature": "15",
    "numero": "2138",
    "numRect": "0",
    "saisine": {
      "texteLegislatifRef": "PRJLANR5L15BTC1237",
      "numeroPartiePLF": "0",
      "organeExamen": "PO717460",
      "mentionSecondeDeliberation": "0"
    }
  },
  "numeroLong": "2138",
  "etapeTexte": "1ère lecture (1ère assemblée saisie)",
  "triAmendement": "koaaaaaaaaaaaaaaaaaaaaaaaaaaaaaaaaaaaaaaaaaaaaaaaaafg",
  "cardinaliteAmdtMultiples": "1",
  "etat": "Irrecevable",
  "signataires": {
    "auteur": {
      "typeAuteur": "Depute",
      "acteurRef": "PA719242",
      "groupePolitiqueRef": "PO730964"
    },
    "cosignatairesRefs": [
      "PA719242"
    ],
    "texteAffichable": "M.&#160;Moreau"
  },
  "pointeurFragmentTexte": {
    "division": {
      "titre": "Article 57",
      "articleDesignationCourte": "APRÈS ART. 57",
      "type": "ARTICLE",
      "avantAApres": "Apres",
      "divisionRattachee": "APRÈS L'ARTICLE 57, insérer l'article suivant:",
      "articleAdditionnel": "1",
      "urlDivisionTexteVise": "/15/textes/1237.asp#D_Article_57"
    }
  },
  "corps": {
    "dispositif": "<p style=\"text-align: justify;\">Au d&#233;but du chapitre Ier du titre Ier du livre III de la troisi&#232;me partie du code du travail, il est ajout&#233; un article L.&#160;3311&#8209;1 A ainsi r&#233;dig&#233;&#160;:</p><p style=\"text-align: justify;\">&#171;&#160;Art.&#160;L.&#160;3311&#8209;1 A.&#160;&#8211;&#160;Les chefs d&#8217;entreprise employant moins de 21 salari&#233;s, sont habilit&#233;s &#224; accorder &#224; leurs salari&#233;s, chaque ann&#233;e et dans la limite d&#8217;un plafond fix&#233; par d&#233;cret, une prime non assujettie aux cotisations de s&#233;curit&#233; sociale, de contribution sociale g&#233;n&#233;ralis&#233;e et de contribution &#224; la r&#233;duction de la dette sociale.&#160;&#187;</p>",
    "exposeSommaire": "<p style=\"text-align: justify;\">Pour les dirigeants de tr&#232;s petite entreprise, un accord d&#8217;int&#233;ressement reste un projet compliqu&#233; &#224; mettre en place. Afin de donner &#224; chaque salari&#233;, quelle que soit la taille de l&#8217;entreprise dans laquelle il travaille, la possibilit&#233; de se voir associ&#233; &#224; la croissance de l&#8217;entreprise, le pr&#233;sent amendement propose la cr&#233;ation d&#8217;un dispositif adapt&#233; aux plus petites entreprises, dans lequel un dirigeant peut accorder une prime non assujettie aux cotisations de s&#233;curit&#233; sociales, de CSG et de CRDS.</p>"
  },
  "representations": [
    {
      "nom": "PDF",
      "typeMime": {
        "type": "application",
        "subType": "PDF"
      },
      "statutRepresentation": {
        "verbatim": true,
        "canonique": true,
        "officielle": true,
        "transcription": false,
        "enregistrement": false
      },
      "contenu": {
        "documentURI": "/15/amendements/1237/AN/2138.pdf"
      }
    }
  ],
  "dateDepot": "2018-09-21T02:00:00.000+02:00",
  "article99": "0",
  "loiReference": {
    "codeLoi": "c travail",
    "divisionCodeLoi": "L3311-0"
  }
}