{
  "uid": "AMANR5L15PO419604B0391P0D1N40",
  "identifiant": {
    "legislature": "15",
    "numero": "40",
    "numRect": "0",
    "saisine": {
      "texteLegislatifRef": "PRJLANR5L15B0391",
      "numeroPartiePLF": "0",
      "organeExamen": "PO419604",
      "mentionSecondeDeliberation": "0"
    }
  },
  "numeroLong": "AC40",
  "etapeTexte": "1ère lecture (1ère assemblée saisie)",
  "triAmendement": "mq",
  "cardinaliteAmdtMultiples": "1",
  "etat": "Discuté",
  "signataires": {
    "auteur": {
      "typeAuteur": "Depute",
      "acteurRef": "PA605991",
      "groupePolitiqueRef": "PO730934"
    },
    "cosignatairesRefs": [
      "PA330684",
      "PA643134",
      "PA267260",
      "PA607090",
      "PA712015",
      "PA642847",
      "PA609245",
      "PA718838",
      "PA267429",
      "PA720684",
      "PA605991",
      "PA266797",
      "PA718850",
      "PA345722",
      "PA608416",
      "PA718884",
      "PA267735",
      "PA2377",
      "PA608826",
      "PA346218",
      "PA721506"
    ],
    "texteAffichable": "Mme&#160;Genevard,  Mme&#160;Le Grip, M.&#160;Hetzel, M.&#160;Cordier, M.&#160;Cinieri, Mme&#160;Duby-Muller, Mme&#160;Poletti, Mme&#160;Kuster, M.&#160;Bazin, Mme&#160;Val&#233;rie&#160;Boyer, M.&#160;Pierre-Henri&#160;Dumont, Mme&#160;Bazin-Malgras, M.&#160;Perrut, Mme&#160;Valentin, M.&#160;Dive, M.&#160;Jean-Pierre&#160;Vigier, M.&#160;Brun, M.&#160;Gosselin, M.&#160;Masson, M.&#160;de Ganay et Mme&#160;Lacroute"
  },
  "pointeurFragmentTexte": {
    "division": {
      "titre": "Article 2",
      "articleDesignationCourte": "APRÈS ART. 2",
      "type": "ARTICLE",
      "avantAApres": "Apres",
      "divisionRattachee": "APRÈS L'ARTICLE 2, insérer l'article suivant:",
      "articleAdditionnel": "1",
      "urlDivisionTexteVise": "/15/textes/0391.asp#D_Article_2"
    }
  },
  "corps": {
    "dispositif": "<p style=\"text-align: justify;\">Dans un d&#233;lai d&#8217;un an &#224; compter de la publication de la pr&#233;sente loi, le Gouvernement remet au Parlement un rapport permettant d&#8217;&#233;valuer les effets de la prochaine r&#233;forme du baccalaur&#233;at sur les attendus d&#233;finis pour chaque formation et pr&#233;vus &#224; l&#8217;article&#160;premier de la pr&#233;sente loi.</p>",
    "exposeSommaire": "<p style=\"text-align: justify;\">Dans le cadre de son projet de loi relatif &#224; l&#8217;orientation et &#224; la r&#233;ussite des &#233;tudiants, le Gouvernement pr&#233;voit la d&#233;finition d&#8217;attendus pour chaque formation, qui seront d&#233;finis par chaque &#233;tablissement au sein d&#8217;un cadre national. En parall&#232;le, le Gouvernement a annonc&#233; une r&#233;forme du baccalaur&#233;at pour 2021.</p><p style=\"text-align: justify;\">Il semble logique que les attendus des formations de l&#8217;enseignement sup&#233;rieur soient d&#233;finis sur la base des connaissances acquises pendant le cycle secondaire qui se concr&#233;tise lui-m&#234;me par l&#8217;obtention du baccalaur&#233;at.</p><p style=\"text-align: justify;\">Or, les annonces faites par le Ministre de l&#8217;&#233;ducation nationale sur la r&#233;forme de ce dipl&#244;me laissent entrevoir que des mati&#232;res formant un tronc commun seront pass&#233;es par l&#8217;ensemble des candidats sous forme d&#8217;examen final, que d&#8217;autres mati&#232;res seront &#233;valu&#233;es en contr&#244;le continu et qu&#8217;enfin, les &#233;l&#232;ves pourront d&#233;cider de passer certaines options &#171;&#160;&#224; la carte&#160;&#187;.</p><p style=\"text-align: justify;\">Cette nouvelle formule impactera forc&#233;ment les attendus de l&#8217;enseignement sup&#233;rieur. En effet, du fait de la personnalisation de l&#8217;examen, les attendus nationaux pourraient se retrouver en d&#233;calage avec les comp&#233;tences effectives de chaque bachelier. Cela provoquerait in&#233;vitablement un probl&#232;me d&#8217;ad&#233;quation entre les comp&#233;tences des candidats et l&#8217;offre de formation.</p><p style=\"text-align: justify;\">Il est n&#233;cessaire que le Gouvernement informe le Parlement.</p>"
  },
  "representations": [
    {
      "nom": "PDF",
      "typeMime": {
        "type": "application",
        "subType": "PDF"
      },
      "statutRepresentation": {
        "verbatim": true,
        "canonique": true,
        "officielle": true,
        "transcription": false,
        "enregistrement": false
      },
      "contenu": {
        "documentURI": "/15/amendements/0391/CION-CEDU/AC40.pdf"
      }
    }
  ],
  "sort": {
    "dateSaisie": "2017-12-05T21:57:04.000+01:00",
    "sortEnSeance": "Rejeté"
  },
  "dateDepot": "2017-12-01T01:00:00.000+01:00",
  "dateDistribution": "2017-12-04T01:00:00.000+01:00",
  "article99": "0",
  "loiReference": {}
}