{
  "uid": "AMANR5L15SEA717460BTC1396P0D1N495",
  "identifiant": {
    "legislature": "15",
    "numero": "495",
    "numRect": "0",
    "saisine": {
      "texteLegislatifRef": "PRJLANR5L15BTC1396",
      "numeroPartiePLF": "0",
      "organeExamen": "PO717460",
      "mentionSecondeDeliberation": "0"
    }
  },
  "numeroLong": "495",
  "etapeTexte": "1ère lecture (2ème assemblée saisie)",
  "triAmendement": "csaaaaaaaaaaaaaaaaaaaaaaaaaaaaaaaaaaaaaaaaaaaaaaaai",
  "cardinaliteAmdtMultiples": "1",
  "etat": "Irrecevable",
  "signataires": {
    "auteur": {
      "typeAuteur": "Depute",
      "acteurRef": "PA330240",
      "groupePolitiqueRef": "PO730934"
    },
    "cosignatairesRefs": [
      "PA334843",
      "PA336316",
      "PA267527",
      "PA608416",
      "PA643089",
      "PA608016",
      "PA642847",
      "PA605036",
      "PA718884",
      "PA605991",
      "PA998",
      "PA2155",
      "PA330684",
      "PA346218",
      "PA346054",
      "PA606098",
      "PA721636",
      "PA720684",
      "PA334654",
      "PA2796",
      "PA267735",
      "PA721314",
      "PA718850",
      "PA267901",
      "PA267378",
      "PA267429",
      "PA718784",
      "PA330240",
      "PA722390",
      "PA718780"
    ],
    "texteAffichable": "M.&#160;Ciotti,  M.&#160;Straumann, Mme&#160;Louwagie, M.&#160;Menuel, M.&#160;Cinieri, M.&#160;Masson, Mme&#160;Levy, M.&#160;Cordier, M.&#160;Schellenberger, M.&#160;de Ganay, M.&#160;Pierre-Henri&#160;Dumont, M.&#160;Parigi, M.&#160;Bouchet, Mme&#160;Val&#233;rie&#160;Boyer, M.&#160;Abad, M.&#160;Thi&#233;riot, Mme&#160;Trastour-Isnart, M.&#160;Emmanuel&#160;Maquet, Mme&#160;Corneloup, M.&#160;Hetzel, Mme&#160;Bazin-Malgras, M.&#160;Teissier, M.&#160;Pauget, M.&#160;Kamardine, M.&#160;Saddier, M.&#160;Marleix, Mme&#160;Genevard, M.&#160;Verch&#232;re, M.&#160;Dassault et M.&#160;Bazin"
  },
  "pointeurFragmentTexte": {
    "division": {
      "titre": "Article 26 bis",
      "articleDesignationCourte": "APRÈS ART. 26 BIS",
      "type": "ARTICLE",
      "avantAApres": "Apres",
      "divisionRattachee": "APRÈS L'ARTICLE 26 BIS, insérer l'article suivant:",
      "articleAdditionnel": "1",
      "urlDivisionTexteVise": "/15/textes/1396.asp#D_Article_26_bis"
    }
  },
  "corps": {
    "dispositif": "<p style=\"text-align: justify;\">Au deuxi&#232;me alin&#233;a de l&#8217;article&#160;433&#8209;5 du code p&#233;nal, apr&#232;s le mot&#160;: &#171;&#160;publique&#160;&#187;, sont ins&#233;r&#233;s les mots&#160;: &#171;&#160;ou &#224; un sapeur&#8209;pompier professionnel ou volontaire&#160;&#187;.</p>",
    "exposeSommaire": "<p style=\"text-align: justify;\">En application de l&#8217;article&#160;433&#8209;5 du code p&#233;nal, lorsqu&#8217;il est adress&#233; &#224; une personne d&#233;positaire de l&#8217;autorit&#233; publique (pr&#233;fet, maire, agent de la force publique, surveillant p&#233;nitentiaire, huissier de justice...), l&#8217;outrage est puni d&#8217;un an d&#8217;emprisonnement et de 15 000&#160;euros d&#8217;amende. Lorsqu&#8217;il s&#8217;adresse &#224; un sapeurs&#8209;pompiers professionnels ou volontaires, l&#8217;outrage est puni de 7 500&#160;euros d&#8217;amende.</p><p style=\"text-align: justify;\">Cette diff&#233;rence de traitement ne se justifie pas. Aussi, le pr&#233;sent amendement propose de renforcer les peines applicables au d&#233;lit d&#8217;outrage adress&#233; &#224; un sapeur pompier.</p>"
  },
  "representations": [
    {
      "nom": "PDF",
      "typeMime": {
        "type": "application",
        "subType": "PDF"
      },
      "statutRepresentation": {
        "verbatim": true,
        "canonique": true,
        "officielle": true,
        "transcription": false,
        "enregistrement": false
      },
      "contenu": {
        "documentURI": "/15/amendements/1396/AN/495.pdf"
      }
    }
  ],
  "dateDepot": "2018-11-14T01:00:00.000+01:00",
  "dateDistribution": "2018-11-17T01:00:00.000+01:00",
  "article99": "0",
  "loiReference": {
    "codeLoi": "c pénal",
    "divisionCodeLoi": "433-5"
  }
}