{
  "uid": "AMANR5L15PO59051B0911P0D1N1079",
  "identifiant": {
    "legislature": "15",
    "numero": "1079",
    "numRect": "0",
    "saisine": {
      "texteLegislatifRef": "PRJLANR5L15B0911",
      "numeroPartiePLF": "0",
      "organeExamen": "PO59051",
      "mentionSecondeDeliberation": "0"
    }
  },
  "numeroLong": "CL1079",
  "etapeTexte": "1ère lecture (1ère assemblée saisie)",
  "triAmendement": "ei",
  "cardinaliteAmdtMultiples": "1",
  "etat": "Discuté",
  "signataires": {
    "auteur": {
      "typeAuteur": "Depute",
      "acteurRef": "PA719138",
      "groupePolitiqueRef": "PO723569"
    },
    "cosignatairesRefs": [
      "PA1838",
      "PA719138"
    ],
    "texteAffichable": "M.&#160;Castellani et M.&#160;Lassalle"
  },
  "pointeurFragmentTexte": {
    "division": {
      "titre": "Article 2",
      "articleDesignationCourte": "ART. 2",
      "type": "ARTICLE",
      "avantAApres": "A",
      "divisionRattachee": "ARTICLE 2",
      "urlDivisionTexteVise": "/15/textes/0911.asp#D_Article_2"
    },
    "alinea": {
      "avantAApres": "Avant",
      "numero": "1",
      "alineaDesignation": "Avant l'alinéa 1"
    }
  },
  "corps": {
    "dispositif": "<p style=\"text-align: justify;\">I.&#160;&#8211;&#160;Avant l&#8217;alin&#233;a&#160;1, ins&#233;rer les deux alin&#233;as suivants&#160;:</p><p style=\"text-align: justify;\">&#171;&#160;L&#8217;article&#160;34 de la Constitution est ainsi modifi&#233;&#160;:</p><p style=\"text-align: justify;\">&#171;&#160;1&#176;&#160;Au treizi&#232;me alin&#233;a, apr&#232;s le mot&#160;: &#171;&#160;territoriales&#160;&#187;, sont ins&#233;r&#233;s les mots&#160;: &#171;&#160;, de leur autonomie&#160;&#187;&#160;;&#160;&#187;.</p><p style=\"text-align: justify;\">II.&#160;&#8211;&#160;En cons&#233;quence, r&#233;diger ainsi le d&#233;but de l&#8217;alin&#233;a&#160;1&#160;:</p><p style=\"text-align: justify;\">&#171;&#160;2&#176;&#160;Au quinzi&#232;me alin&#233;a, apr&#232;s... (<i>le reste sans changement</i>).&#160;&#187;</p>",
    "exposeSommaire": "<p style=\"text-align: justify;\">Un mouvement de d&#233;centralisation a d&#233;j&#224; &#233;t&#233; entam&#233; en France depuis maintenant plus de 30 ans. Il est souhaitable pour les populations des territoires de voir leur situation &#233;voluer vers davantage d&#8217;autonomie.</p><p style=\"text-align: justify;\">Il s&#8217;agit aussi d&#8217;un amendement de coh&#233;rence au vu des autres propositions formul&#233;es notamment d&#8217;inclure l&#8217;autonomie et le principe de subsidiarit&#233; &#224; l&#8217;article&#160;1<sup>er</sup>.</p>"
  },
  "representations": [
    {
      "nom": "PDF",
      "typeMime": {
        "type": "application",
        "subType": "PDF"
      },
      "statutRepresentation": {
        "verbatim": true,
        "canonique": true,
        "officielle": true,
        "transcription": false,
        "enregistrement": false
      },
      "contenu": {
        "documentURI": "/15/amendements/0911/CION_LOIS/CL1079.pdf"
      }
    }
  ],
  "sort": {
    "dateSaisie": "2018-06-28T23:05:51.000+02:00",
    "sortEnSeance": "Tombé"
  },
  "dateDepot": "2018-06-22T02:00:00.000+02:00",
  "dateDistribution": "2018-06-25T02:00:00.000+02:00",
  "article99": "0",
  "loiReference": {
    "codeLoi": "13-1"
  }
}