{
  "uid": "AMANR5L15SEA717460BTC1955P0D1N703",
  "identifiant": {
    "legislature": "15",
    "numero": "703",
    "numRect": "0",
    "saisine": {
      "texteLegislatifRef": "PNREANR5L15BTC1955",
      "numeroPartiePLF": "0",
      "organeExamen": "PO717460",
      "mentionSecondeDeliberation": "1"
    }
  },
  "numeroLong": "703",
  "etapeTexte": "Lecture unique",
  "triAmendement": "jeaaaaaaaaaaaaaaaaaaaaaaaaaaaaaaaaaaaaaaaaaaaaaaaaai",
  "cardinaliteAmdtMultiples": "1",
  "etat": "Discuté",
  "signataires": {
    "auteur": {
      "typeAuteur": "Depute",
      "acteurRef": "PA608416",
      "groupePolitiqueRef": "PO730934"
    },
    "cosignatairesRefs": [
      "PA1874",
      "PA330008",
      "PA266776",
      "PA718838",
      "PA608416"
    ],
    "texteAffichable": "M.&#160;Hetzel,  M.&#160;Breton, M.&#160;Le Fur, M.&#160;Brun et M.&#160;Reiss"
  },
  "pointeurFragmentTexte": {
    "division": {
      "titre": "Article 27",
      "articleDesignationCourte": "APRÈS ART. 27",
      "type": "ARTICLE",
      "avantAApres": "Apres",
      "divisionRattachee": "APRÈS L'ARTICLE 27, insérer l'article suivant:",
      "articleAdditionnel": "1",
      "urlDivisionTexteVise": "/15/textes/1955.asp#D_Article_27"
    }
  },
  "corps": {
    "dispositif": "<p style=\"text-align: justify;\">L&#8217;article&#160;101 du R&#232;glement est abrog&#233;.</p>",
    "exposeSommaire": "<p style=\"text-align: justify;\">Cet amendement propose de supprimer la deuxi&#232;me d&#233;lib&#233;ration, qui permet au Gouvernement de faire supprimer, en fin de discussion, l&#8217;ensemble des dispositions adopt&#233;es par les parlementaires qui ne lui conviennent pas.</p>"
  },
  "representations": [
    {
      "nom": "PDF",
      "typeMime": {
        "type": "application",
        "subType": "PDF"
      },
      "statutRepresentation": {
        "verbatim": true,
        "canonique": true,
        "officielle": true,
        "transcription": false,
        "enregistrement": false
      },
      "contenu": {
        "documentURI": "/15/amendements/1955/AN/703.pdf"
      }
    }
  ],
  "seanceDiscussion": "RUANR5L15S2019IDS21670",
  "sort": {
    "dateSaisie": "2019-05-29T18:37:40.000+02:00",
    "sortEnSeance": "Non soutenu"
  },
  "dateDepot": "2019-05-24T02:00:00.000+02:00",
  "dateDistribution": "2019-05-27T02:00:00.000+02:00",
  "article99": "0",
  "loiReference": {
    "divisionCodeLoi": "101"
  }
}