{
  "uid": "AMANR5L15PO419610B0846P0D1N1074",
  "identifiant": {
    "legislature": "15",
    "numero": "1074",
    "numRect": "0",
    "saisine": {
      "texteLegislatifRef": "PRJLANR5L15B0846",
      "numeroPartiePLF": "0",
      "organeExamen": "PO419610",
      "mentionSecondeDeliberation": "0"
    }
  },
  "numeroLong": "CE1074",
  "etapeTexte": "1ère lecture (1ère assemblée saisie)",
  "triAmendement": "ajbeddhs",
  "cardinaliteAmdtMultiples": "1",
  "etat": "Discuté",
  "signataires": {
    "auteur": {
      "typeAuteur": "Depute",
      "acteurRef": "PA709315",
      "groupePolitiqueRef": "PO730934"
    },
    "cosignatairesRefs": [
      "PA718884",
      "PA712015",
      "PA609726",
      "PA642847",
      "PA709315"
    ],
    "texteAffichable": "M.&#160;Viala,  M.&#160;Aubert, M.&#160;Bazin, Mme&#160;Bazin-Malgras et M.&#160;Dive"
  },
  "pointeurFragmentTexte": {
    "division": {
      "titre": "Article 28",
      "articleDesignationCourte": "ART. 28",
      "type": "ARTICLE",
      "avantAApres": "A",
      "divisionRattachee": "ARTICLE 28",
      "urlDivisionTexteVise": "/15/textes/0846.asp#D_Article_28"
    },
    "alinea": {
      "avantAApres": "A",
      "numero": "15",
      "alineaDesignation": "Alinéa 15"
    }
  },
  "corps": {
    "dispositif": "<p style=\"text-align: justify;\">Au d&#233;but de l&#8217;alin&#233;a&#160;15, apr&#232;s la r&#233;f&#233;rence&#160;:</p><p style=\"text-align: justify;\">&#171;&#160;2&#176;&#160;<i>bis</i>&#160;&#187;,</p><p style=\"text-align: justify;\">ins&#233;rer les mots suivants&#160;:</p><p style=\"text-align: justify;\">&#171;&#160;En cas de carence av&#233;r&#233;e du secteur priv&#233;,&#160;&#187;.</p><p style=\"text-align: justify;\">&#160;</p>",
    "exposeSommaire": "<p style=\"text-align: justify;\">Il faut autoriser la cr&#233;ation de filiales qu&#8217;en cas de carence av&#233;r&#233;e du le secteur priv&#233;. Cette limitation concernerait les filiales cr&#233;&#233;es pour&#160;:</p><p style=\"text-align: justify;\">- construire, acqu&#233;rir, vendre ou donner en location des &#233;quipements locaux d&#8217;int&#233;r&#234;t g&#233;n&#233;ral ou des locaux &#224; usage commercial ou professionnel, g&#233;rer des immeubles abritant des &#233;quipements locaux d&#8217;int&#233;r&#234;t g&#233;n&#233;ral et des locaux &#224; usage commercial ou professionnel&#160;;</p><p style=\"text-align: justify;\">- pour r&#233;aliser pour le compte des collectivit&#233;s territoriales ou leurs groupements des &#233;tudes d&#8217;ing&#233;nierie urbaine.</p><p style=\"text-align: justify;\">Cette possibilit&#233; ne peut &#234;tre ouverte &#224; un nouvel op&#233;rateur que si le secteur priv&#233; n&#8217;est pas pr&#233;sent, afin de ne pas d&#233;structurer et fragiliser un secteur d&#233;j&#224; soumis &#224; une importante concurrence.</p>"
  },
  "representations": [
    {
      "nom": "PDF",
      "typeMime": {
        "type": "application",
        "subType": "PDF"
      },
      "statutRepresentation": {
        "verbatim": true,
        "canonique": true,
        "officielle": true,
        "transcription": false,
        "enregistrement": false
      },
      "contenu": {
        "documentURI": "/15/amendements/0846/CION-ECO/CE1074.pdf"
      }
    }
  ],
  "sort": {
    "dateSaisie": "2018-05-17T11:40:19.000+02:00",
    "sortEnSeance": "Rejeté"
  },
  "dateDepot": "2018-05-08T02:00:00.000+02:00",
  "dateDistribution": "2018-05-14T02:00:00.000+02:00",
  "article99": "0",
  "loiReference": {}
}