{
  "uid": "AMANR5L15SEA717460BTC1175P0D1N972",
  "identifiant": {
    "legislature": "15",
    "numero": "972",
    "numRect": "0",
    "saisine": {
      "texteLegislatifRef": "PRJLANR5L15BTC1175",
      "numeroPartiePLF": "0",
      "organeExamen": "PO717460",
      "mentionSecondeDeliberation": "0"
    }
  },
  "numeroLong": "972",
  "etapeTexte": "Nouvelle Lecture",
  "triAmendement": "dlaaaaaaaaaaaaaaaaaaaaaaaaaaaaaaaaaaaaaaaaaaaaaaaaans",
  "cardinaliteAmdtMultiples": "1",
  "etat": "Discuté",
  "signataires": {
    "auteur": {
      "typeAuteur": "Depute",
      "acteurRef": "PA719608",
      "groupePolitiqueRef": "PO723569"
    },
    "cosignatairesRefs": [
      "PA719608"
    ],
    "texteAffichable": "Mme&#160;M&#233;nard"
  },
  "pointeurFragmentTexte": {
    "division": {
      "titre": "Article 11 ter",
      "articleDesignationCourte": "ART. 11 TER",
      "type": "ARTICLE",
      "avantAApres": "A",
      "divisionRattachee": "ARTICLE 11 TER",
      "urlDivisionTexteVise": "/15/textes/1175.asp#D_Article_11_ter"
    },
    "alinea": {
      "avantAApres": "Apres",
      "numero": "2"
    }
  },
  "corps": {
    "dispositif": "<p style=\"text-align: justify;\">Compl&#233;ter l&#8217;alin&#233;a&#160;3 par les mots&#160;:</p><p>&#171;&#160;ainsi que des couverts&#160;&#187;.</p>",
    "exposeSommaire": "<p style=\"text-align: justify;\">La France a fait le choix, depuis plusieurs ann&#233;es, de mener une politique en faveur de la transition &#233;cologique avec, notamment, la loi de transition &#233;nerg&#233;tique pour la croissance verte de 2015. L&#8217;aspiration &#224; r&#233;duire fortement, &#224; l&#8217;horizon 2025, nos d&#233;chets m&#233;nagers, &#224; recycler &#224; 100&#160;% le plastique et r&#233;duire les &#233;missions de gaz &#224; effet de serre n&#233;cessite de poursuivre sur le chemin vertueux de la lutte contre la prolif&#233;ration des d&#233;chets.</p><p style=\"text-align: justify;\">Tel est l&#8217;objet de cet amendement.</p>"
  },
  "representations": [
    {
      "nom": "PDF",
      "typeMime": {
        "type": "application",
        "subType": "PDF"
      },
      "statutRepresentation": {
        "verbatim": true,
        "canonique": true,
        "officielle": true,
        "transcription": false,
        "enregistrement": false
      },
      "contenu": {
        "documentURI": "/15/amendements/1175/AN/972.pdf"
      }
    }
  ],
  "seanceDiscussion": "RUANR5L15S2018IDS21236",
  "sort": {
    "dateSaisie": "2018-09-14T15:17:55.000+02:00",
    "sortEnSeance": "Tombé"
  },
  "dateDepot": "2018-09-06T02:00:00.000+02:00",
  "dateDistribution": "2018-09-10T02:00:00.000+02:00",
  "article99": "0",
  "loiReference": {}
}