{
  "uid": "AMANR5L15PO59048B2272P2D1N1172",
  "identifiant": {
    "legislature": "15",
    "numero": "1172",
    "numRect": "0",
    "saisine": {
      "texteLegislatifRef": "PRJLANR5L15B2272",
      "numeroPartiePLF": "2",
      "organeExamen": "PO59048",
      "mentionSecondeDeliberation": "0"
    }
  },
  "numeroLong": "II-CF1172",
  "etapeTexte": "1ère lecture (1ère assemblée saisie)",
  "triAmendement": "elaaaaaaaaaaaaaaaaaaaaaaaaaaaaaaaaaaaaaaaaaaaaaaaaarbh",
  "cardinaliteAmdtMultiples": "1",
  "etat": "Discuté",
  "signataires": {
    "auteur": {
      "typeAuteur": "Depute",
      "acteurRef": "PA721836",
      "groupePolitiqueRef": "PO730970"
    },
    "cosignatairesRefs": [
      "PA719266",
      "PA719942",
      "PA721976",
      "PA719488",
      "PA718978",
      "PA719640",
      "PA1276",
      "PA720334",
      "PA719504",
      "PA721418",
      "PA717151",
      "PA720256",
      "PA719558",
      "PA719044",
      "PA720162",
      "PA719874",
      "PA720002",
      "PA719918",
      "PA719210",
      "PA720652",
      "PA721984",
      "PA720598",
      "PA720764",
      "PA721742",
      "PA721234",
      "PA720326",
      "PA720968",
      "PA722374",
      "PA722284",
      "PA720976",
      "PA720092",
      "PA721924",
      "PA721734",
      "PA721836",
      "PA720746",
      "PA720720",
      "PA720178",
      "PA721996",
      "PA720728",
      "PA720704",
      "PA721608",
      "PA720924",
      "PA721530",
      "PA722162",
      "PA721182",
      "PA720772"
    ],
    "texteAffichable": "M.&#160;Barrot,  M.&#160;Duverg&#233;, Mme&#160;El Ha&#239;ry, M.&#160;Laqhila, M.&#160;Mattei, M.&#160;Balanant, Mme&#160;Bannier, M.&#160;Baudu, Mme&#160;Benin, M.&#160;Berta, M.&#160;Bolo, M.&#160;Bourlanges, M.&#160;Bru, M.&#160;Cubertafon, Mme&#160;de Sarnez, Mme&#160;de Vaucouleurs, Mme&#160;Deprez-Audebert, Mme&#160;Elimas, Mme&#160;Essayan, M.&#160;Fanget, Mme&#160;Florennes, M.&#160;Fuchs, M.&#160;Garcia, M.&#160;Hammouche, M.&#160;Isaac-Sibille, Mme&#160;Jacquier-Laforge, M.&#160;Joncour, M.&#160;Lagleize, M.&#160;Lain&#233;, Mme&#160;Lasserre-David, M.&#160;Latombe, M.&#160;Loiseau, Mme&#160;Luquet, M.&#160;Mathiasin, Mme&#160;Mette, M.&#160;Michel-Kleisbauer, M.&#160;Mignola, M.&#160;Millienne, M.&#160;Pahun, M.&#160;Fr&#233;d&#233;ric&#160;Petit, Mme&#160;Maud&#160;Petit, Mme&#160;Poueyto, M.&#160;Ramos, M.&#160;Turquois, Mme&#160;Vichnievsky et M.&#160;Waserman"
  },
  "pointeurFragmentTexte": {
    "division": {
      "titre": "Article 48",
      "articleDesignationCourte": "APRÈS ART. 48",
      "type": "ARTICLE",
      "avantAApres": "Apres",
      "divisionRattachee": "APRÈS L'ARTICLE 48, insérer l'article suivant:",
      "articleAdditionnel": "1",
      "urlDivisionTexteVise": "/15/textes/2272C.asp#D_Article_48"
    }
  },
  "corps": {
    "dispositif": "<p>I.&#160;&#8211;&#160;Apr&#232;s le 1&#176;&#160;du II de l&#8217;article&#160;1408 du code g&#233;n&#233;ral des imp&#244;ts, est ins&#233;r&#233; un alin&#233;a ainsi r&#233;dig&#233;&#160;:</p><p style=\"text-align: justify;\">&#171;&#160;1&#176;&#160;<i>bis</i> Les &#233;tablissements et services sanitaires, sociaux et m&#233;dicaux-sociaux g&#233;r&#233;s par des organismes priv&#233;s &#224; but non lucratifs&#160;;&#160;&#187;.</p><p style=\"text-align: justify;\">II.&#160;&#8211;&#160;L&#8217;article&#160;1414 D du m&#234;me code g&#233;n&#233;ral des imp&#244;ts est abrog&#233;.</p><p style=\"text-align: justify;\">III.&#160;&#8211;&#160;La perte de recettes pour les collectivit&#233;s territoriales est compens&#233;e &#224; due concurrence par la majoration de la dotation globale de fonctionnement et, corr&#233;lativement pour l&#8217;&#201;tat, par la cr&#233;ation d&#8217;une taxe additionnelle aux droits mentionn&#233;s aux articles 575 et 575 A du code g&#233;n&#233;ral des imp&#244;ts.</p>",
    "exposeSommaire": "<p>Cet amendement vise &#224; exon&#233;rer les organismes gestionnaires priv&#233;s non lucratifs et leurs &#233;tablissements et services sanitaires, sociaux et m&#233;dico-sociaux qui sont expos&#233;s aujourd&#8217;hui &#224; la taxe d&#8217;habitation ou au risque d&#8217;assujettissement &#224; cette taxe. Il n&#8217;y a aucune raison pour que perdure cette rupture d&#8217;&#233;galit&#233; &#8211; ou ce risque- car cela impacte alors tout autant par exemple les r&#233;sidents des &#233;tablissements d&#8217;h&#233;bergement pour personnes &#226;g&#233;es et des structures pour personnes handicap&#233;es de statut priv&#233; non lucratif, que les organismes gestionnaires pour leurs locaux d&#8217;exercice de leurs missions de service public et d&#8217;int&#233;r&#234;t g&#233;n&#233;ral.</p><p style=\"text-align: justify;\">Il n&#8217;existe aucun motif valable pour qu&#8217;un gestionnaire priv&#233; non lucratif et l&#8217;usager accueilli soient directement ou indirectement assujettis -au titre de la taxe d&#8217;habitation- &#224; des charges fiscales sup&#233;rieures &#224; celle d&#8217;&#233;tablissements publics assumant les m&#234;mes missions et contraintes, et recevant les m&#234;mes financements &#224; services rendus comparables.</p><p style=\"text-align: justify;\">Le maintien de l&#8217;assujettissement &#224; la taxe d&#8217;habitation des &#233;tablissements d&#8217;assistance priv&#233;s non lucratifs g&#233;n&#232;re une rupture d&#8217;&#233;galit&#233; devant la loi et les charges publiques.</p>"
  },
  "representations": [
    {
      "nom": "PDF",
      "typeMime": {
        "type": "application",
        "subType": "PDF"
      },
      "statutRepresentation": {
        "verbatim": true,
        "canonique": true,
        "officielle": true,
        "transcription": false,
        "enregistrement": false
      },
      "contenu": {
        "documentURI": "/15/amendements/2272C/CION_FIN/CF1172.pdf"
      }
    }
  ],
  "sort": {
    "dateSaisie": "2019-11-06T11:58:59.000+01:00",
    "sortEnSeance": "Retiré"
  },
  "dateDepot": "2019-10-30T01:00:00.000+01:00",
  "dateDistribution": "2019-11-06T01:00:00.000+01:00",
  "article99": "0",
  "loiReference": {
    "codeLoi": "CGI",
    "divisionCodeLoi": "1408 1 bis"
  }
}