{
  "uid": "AMANR5L15SEA717460B0788P0D1N12",
  "identifiant": {
    "legislature": "15",
    "numero": "12",
    "numRect": "0",
    "saisine": {
      "texteLegislatifRef": "PIONANR5L15B0788",
      "numeroPartiePLF": "0",
      "organeExamen": "PO717460",
      "mentionSecondeDeliberation": "0"
    }
  },
  "numeroLong": "12",
  "etapeTexte": "1ère lecture (1ère assemblée saisie)",
  "triAmendement": "paaaaaaaaaaaaaaaaaaaaaaaaaaaaaaaaaaaaaaaaaaaaaaaaai",
  "cardinaliteAmdtMultiples": "1",
  "etat": "A discuter",
  "signataires": {
    "auteur": {
      "typeAuteur": "Depute",
      "acteurRef": "PA721118",
      "groupePolitiqueRef": "PO730940"
    },
    "cosignatairesRefs": [
      "PA721118"
    ],
    "texteAffichable": "M.&#160;Brotherson"
  },
  "pointeurFragmentTexte": {
    "division": {
      "titre": "visant à renforcer l’intégrité des mandats électifs et  de la représentation nationale,",
      "articleDesignationCourte": "TITRE",
      "type": "TITRE",
      "avantAApres": "A",
      "divisionRattachee": "TITRE",
      "urlDivisionTexteVise": "/15/textes/0788.asp#D_visant_a_renforcer_lintegrite_des_mand"
    }
  },
  "corps": {
    "dispositif": "<p style=\"text-align: justify;\">Apr&#232;s le mot&#160;:</p><p style=\"text-align: justify;\">&#171;&#160;renforcer&#160;&#187;,</p><p style=\"text-align: justify;\">r&#233;diger ainsi la fin du titre&#160;:</p><p style=\"text-align: justify;\">&#171;&#160;l&#8217;exigence d&#8217;int&#233;grit&#233; des titulaires de fonctions gouvernementales ou de mandats &#233;lectifs publics&#160;&#187;.</p>",
    "exposeSommaire": "<p style=\"text-align: justify;\">Conform&#233;ment &#224; la recommandation formul&#233;e par le Conseil d&#8217;&#201;tat, le pr&#233;sent amendement met en ad&#233;quation l&#8217;intitul&#233; de la proposition de loi avec son contenu.</p>",
    "cartoucheDelaiDepotDepasse": "Sous réserve de son traitement par les services de l'Assemblée nationale et de sa recevabilité"
  },
  "representations": [
    {
      "nom": "PDF",
      "typeMime": {
        "type": "application",
        "subType": "PDF"
      },
      "statutRepresentation": {
        "verbatim": true,
        "canonique": true,
        "officielle": true,
        "transcription": false,
        "enregistrement": false
      },
      "contenu": {
        "documentURI": "/15/amendements/0788/AN/12.pdf"
      }
    }
  ],
  "dateDepot": "2019-02-28T01:00:00.000+01:00",
  "dateDistribution": "2019-03-04T01:00:00.000+01:00",
  "article99": "0",
  "loiReference": {}
}