{
  "uid": "AMANR5L15SEA717460BTC0857P0D1N816",
  "identifiant": {
    "legislature": "15",
    "numero": "816",
    "numRect": "0",
    "saisine": {
      "texteLegislatifRef": "PRJLANR5L15BTC0857",
      "numeroPartiePLF": "0",
      "organeExamen": "PO717460",
      "mentionSecondeDeliberation": "0"
    }
  },
  "numeroLong": "816",
  "etapeTexte": "1ère lecture (1ère assemblée saisie)",
  "triAmendement": "stdwwu",
  "cardinaliteAmdtMultiples": "1",
  "etat": "Discuté",
  "signataires": {
    "auteur": {
      "typeAuteur": "Depute",
      "acteurRef": "PA721896",
      "groupePolitiqueRef": "PO730940"
    },
    "cosignatairesRefs": [
      "PA721270",
      "PA720546",
      "PA610667",
      "PA722110",
      "PA610654",
      "PA267306",
      "PA718720",
      "PA689",
      "PA720692",
      "PA718926",
      "PA335612",
      "PA610634",
      "PA721118",
      "PA721896",
      "PA722202",
      "PA441"
    ],
    "texteAffichable": "Mme&#160;Faucillon,  M.&#160;Peu, Mme&#160;Bello, M.&#160;Bruneel, Mme&#160;Buffet, M.&#160;Chassaigne, M.&#160;Dharr&#233;ville, M.&#160;Dufr&#232;gne, M.&#160;Jumel, M.&#160;Lecoq, M.&#160;Fabien&#160;Roussel, M.&#160;Wulfranc, M.&#160;Azerot, M.&#160;Brotherson, M.&#160;Nilor et M.&#160;Serville"
  },
  "pointeurFragmentTexte": {
    "division": {
      "titre": "Article 5",
      "articleDesignationCourte": "ART. 5",
      "type": "ARTICLE",
      "avantAApres": "A",
      "divisionRattachee": "ARTICLE 5",
      "urlDivisionTexteVise": "/15/textes/0857.asp#D_Article_5"
    },
    "alinea": {
      "avantAApres": "A",
      "numero": "5",
      "alineaDesignation": "Alinéa 5"
    }
  },
  "corps": {
    "dispositif": "<p style=\"text-align: justify;\">I.&#160;&#8211;&#160;&#192; la fin de l&#8217;aline&#769;a&#160;5, substituer aux mots&#160;:</p><p style=\"text-align: justify;\">&#171;&#160;tout moyen&#160;&#187;,</p><p style=\"text-align: justify;\">les mots&#160;:</p><p style=\"text-align: justify;\">&#171;&#160;lettre recommande&#769;e avec accuse&#769; de re&#769;ception&#160;&#187;.</p><p style=\"text-align: justify;\">II.&#160;&#8211;&#160;En conse&#769;quence, proce&#769;der a&#768; la me&#770;me substitution aux aline&#769;as&#160;9 et 10, &#224; la premi&#232;re phrase de l&#8217;alin&#233;a&#160;16 et aux alin&#233;as&#160;18 et&#160;19.</p>",
    "exposeSommaire": "<p style=\"text-align: justify;\">Amendement de repli.</p><p style=\"text-align: justify;\">Sous couvert de simplification administrative, l&#8217;aline&#769;a 5 du projet de loi autorise l&#8217;OFPRA a&#768; adresser la convocation a&#768; l&#8217;entretien individuel &#171;&#160;par tout moyen&#160;&#187;. Il s&#8217;agit ainsi de permettre la notification de la convocation &#224; l&#8217;entretien individuel et des d&#233;cisions de l&#8217;OFPRA par voie d&#233;mat&#233;rialis&#233;e (message t&#233;l&#233;phonique, courriel).</p><p style=\"text-align: justify;\">Or, au regard de la situation particulie&#768;re de vulne&#769;rabilite&#769; des demandeurs d&#8217;asile et de leurs conditions de vie souvent pr&#233;caires, cet aline&#769;a n&#8217;apporte pas de garanties suffisantes. En effet, la notification par tout moyen ne permet pas le contr&#244;le de l&#8217;envoi et de la bonne re&#769;ception de la convocation ou des d&#233;cisions par les int&#233;ress&#233;s. Aucune disposition ne garantit que la d&#233;cision ne soit pas oppos&#233;e lorsqu&#8217;il n&#8217;est pas certain que le demandeur a pu en prendre personnellement connaissance.</p><p style=\"text-align: justify;\">En outre, ce mode d&#8217;envoi de la convocation ne respecte pas le principe de confidentialite&#769;, que le Conseil constitutionnel a e&#769;rige&#769; au rang de &#171;&#160;garantie essentielle du droit d&#8217;asile, principe de valeur constitutionnel qui implique notamment que les demandeurs d&#8217;asile be&#769;ne&#769;ficient d&#8217;une protection particulie&#768;re&#160;&#187; (de&#769;cision n&#176; 2003&#8209;485 DC du 4 de&#769;cembre 2003 &#167; 43)</p><p style=\"text-align: justify;\">Dans son avis sur le projet de loi, le Conseil d&#8217;&#201;tat rappelle que &#171;&#160;[l]e plus grand soin devra toutefois e&#770;tre apporte&#769; au choix des moyens techniques de sorte qu&#8217;une notification par voie de&#769;mate&#769;rialise&#769;e ne puisse e&#770;tre oppose&#769;e que dans la mesure ou&#768; il est de&#769;montre&#769; qu&#8217;elle a e&#769;te&#769; ope&#769;re&#769;e personnellement et qu&#8217;il est possible de garder une trace tant des ope&#769;rations de notification que, le cas e&#769;che&#769;ant, de la prise de connaissance par l&#8217;inte&#769;resse&#769;. A de&#769;faut, la combinaison d&#8217;un de&#769;lai tre&#768;s bref avec des modalite&#769;s incertaines de notification pourrait e&#770;tre regarde&#769;e comme portant atteinte au caracte&#768;re e&#769;quitable de la proce&#769;dure.&#160;&#187;</p><p style=\"text-align: justify;\">En conse&#769;quence, le pre&#769;sent amendement de repli pr&#233;voit d&#8217;envoyer syste&#769;matiquement la convocation et les d&#233;cisions de l&#8217;OFPRA par lettre recommande&#769;e avec accuse&#769; de re&#769;ception.</p>"
  },
  "representations": [
    {
      "nom": "PDF",
      "typeMime": {
        "type": "application",
        "subType": "PDF"
      },
      "statutRepresentation": {
        "verbatim": true,
        "canonique": true,
        "officielle": true,
        "transcription": false,
        "enregistrement": false
      },
      "contenu": {
        "documentURI": "/15/amendements/0857/AN/816.pdf"
      }
    }
  ],
  "seanceDiscussion": "RUANR5L15S2018IDS21016",
  "sort": {
    "dateSaisie": "2018-04-19T21:56:40.000+02:00",
    "sortEnSeance": "Rejeté"
  },
  "dateDepot": "2018-04-12T02:00:00.000+02:00",
  "dateDistribution": "2018-04-13T02:00:00.000+02:00",
  "article99": "0",
  "loiReference": {}
}