{
  "uid": "AMANR5L15SEA717460BTC1187P0D1N5",
  "identifiant": {
    "legislature": "15",
    "numero": "5",
    "numRect": "0",
    "saisine": {
      "texteLegislatifRef": "PIONANR5L15BTC1187",
      "numeroPartiePLF": "0",
      "organeExamen": "PO717460",
      "mentionSecondeDeliberation": "0"
    }
  },
  "numeroLong": "5",
  "etapeTexte": "1ère lecture (2ème assemblée saisie)",
  "triAmendement": "ac",
  "cardinaliteAmdtMultiples": "1",
  "etat": "Discuté",
  "signataires": {
    "auteur": {
      "typeAuteur": "Depute",
      "acteurRef": "PA721960",
      "groupePolitiqueRef": "PO730958"
    },
    "cosignatairesRefs": [
      "PA722142",
      "PA721210",
      "PA2150",
      "PA720846",
      "PA720430",
      "PA721226",
      "PA720422",
      "PA721202",
      "PA718860",
      "PA719578",
      "PA588884",
      "PA719676",
      "PA720286",
      "PA720892",
      "PA721062",
      "PA721960",
      "PA718868"
    ],
    "texteAffichable": "Mme&#160;Obono,  Mme&#160;Autain, M.&#160;Bernalicis, M.&#160;Coquerel, M.&#160;Corbi&#232;re, Mme&#160;Fiat, M.&#160;Lachaud, M.&#160;Larive, M.&#160;M&#233;lenchon, Mme&#160;Panot, M.&#160;Prud&apos;homme, M.&#160;Quatennens, M.&#160;Ratenon, Mme&#160;Ressiguier, Mme&#160;Rubin, M.&#160;Ruffin et Mme&#160;Taurine"
  },
  "pointeurFragmentTexte": {
    "division": {
      "titre": "Article 2",
      "articleDesignationCourte": "APRÈS ART. 2",
      "type": "ARTICLE",
      "avantAApres": "Apres",
      "divisionRattachee": "APRÈS L'ARTICLE 2, insérer l'article suivant:",
      "articleAdditionnel": "1",
      "urlDivisionTexteVise": "/15/textes/1187.asp#D_Article_2"
    }
  },
  "corps": {
    "dispositif": "<p style=\"text-align: justify;\">L&#8217;article L.&#160;241&#8209;1 du code de la s&#233;curit&#233; int&#233;rieure est ainsi modifi&#233;&#160;:</p><p style=\"text-align: justify;\">1&#176;&#160;Le deuxi&#232;me alin&#233;a est compl&#233;t&#233; par trois phrases ainsi r&#233;dig&#233;es&#160;: &#171;&#160;Toutefois, &#224; titre exp&#233;rimental, pour une dur&#233;e maximale d&#8217;un an, pour les services de police et de gendarmerie dot&#233;s de cam&#233;ras individuelles, l&#8217;enregistrement peut &#234;tre mis en &#339;uvre de mani&#232;re permanente, pour chaque intervention au titre des missions mentionn&#233;es au premier alin&#233;a, dans les communes, dans la limite de trois d&#233;partements fix&#233;s par arr&#234;t&#233;, qui en formulent la demande aupr&#232;s de l&#8217;autorit&#233; administrative comp&#233;tente. Un d&#233;cret en Conseil d&#8217;&#201;tat pr&#233;cise les conditions d&#8217;application du pr&#233;sent article. Cette exp&#233;rimentation fait l&#8217;objet d&#8217;un bilan transmis au Parlement &#233;valuant l&#8217;opportunit&#233; d&#8217;une g&#233;n&#233;ralisation de ce dispositif.&#160;&#187;&#160;;</p><p style=\"text-align: justify;\">2&#176;&#160;Apr&#232;s le deuxi&#232;me alin&#233;a, sont ins&#233;r&#233;s trois alin&#233;as ainsi r&#233;dig&#233;s&#160;:</p><p style=\"text-align: justify;\">&#171;&#160;Pour l&#8217;application de la deuxi&#232;me phrase de l&#8217;alin&#233;a pr&#233;c&#233;dent, sont consid&#233;r&#233;s comme une soustraction de preuve au titre de l&#8217;article&#160;434&#8209;4 du code de proc&#233;dure p&#233;nale&#160;:</p><p style=\"text-align: justify;\">&#171;&#160;&#8211;&#160;le fait de ne pas avoir d&#233;clench&#233;, si celui-ci est manuel, l&#8217;enregistrement de la cam&#233;ra individuelle alors que celui-ci &#233;tait techniquement possible&#160;;</p><p style=\"text-align: justify;\">&#171;&#160;&#8211;&#160;le fait de ne pas avoir proc&#233;d&#233; &#224; l&#8217;enregistrement de par l&#8217;indisponibilit&#233; ou le caract&#232;re d&#233;fectueux d&#8217;une cam&#233;ra individuelle, sans que des dues diligences pour garantir la disponibilit&#233; ou la r&#233;partition du mat&#233;riel utilis&#233; aient &#233;t&#233; pr&#233;alablement effectu&#233;es.&#160;&#187;</p>",
    "exposeSommaire": "<p style=\"text-align: justify;\">Par cet amendement, nous proposons d&#8217;exp&#233;rimenter que les services de police et de gendarmerie qui utilisent des cam&#233;ras-pi&#233;tons (au titre de l&#8217;article L.&#160;241&#8209;1 du code de la s&#233;curit&#233; int&#233;rieure) doivent enregistrer de mani&#232;re permanente, &#224; chaque intervention (mentionn&#233;es au 1<sup>er</sup> alin&#233;a de cet article, &#224; savoir pr&#233;vention des atteintes &#224; l&#8217;ordre public, protection de la s&#233;curit&#233; des personnes et des biens, missions de police judiciaire).</p><p style=\"text-align: justify;\">Ceci a notamment pour but de garantir de pallier une faille importante du dispositif actuel, &#224; savoir que le d&#233;but de l&#8217;enregistrement n&#8217;est pas automatique, mais d&#233;cid&#233; par une personne, et ainsi induire une s&#233;lection possible de ce qu&#8217;il est souhaitable de filmer et ce qu&#8217;il est souhaitable de ne pas filmer. De m&#234;me, l&#8217;enregistrement permanent pourra pr&#233;munir contre tout oubli.</p><p style=\"text-align: justify;\">En outre, afin d&#8217;&#233;viter des oublis inopportuns d&#8217;enregistrement (que ceux-ci soient a priori, oublis pr&#233;judiciables au bon d&#233;roulement des interventions et qui constituent une diminution des garanties pour les agents intervenant de m&#234;me que pour les administr&#233;.e.s concern&#233;s par l&#8217;intervention), il est propos&#233; de consid&#233;rer que l&#8217;absence de d&#233;clenchement d&#8217;enregistrement, que celui-ci soit manuel (sur action volontaire d&#8217;un agent) ou automatique (d&#232;s le port du mat&#233;riel), puisse &#234;tre consid&#233;r&#233; p&#233;nalement comment de la &#171;&#160;soustraction de preuves&#160;&#187; au sens de l&#8217;article&#160;434&#8209;4 du code p&#233;nal. De m&#234;me, afin d&#8217;&#233;viter que des enregistrement ne soient pas effectu&#233;s sous des motifs potentiellement fallacieux d&#8217;indisponibilit&#233; du mat&#233;riel (trop peu de cam&#233;ras disponibles de par l&#8217;absence d&#8217;organisation pr&#233;alable), ou de d&#233;fectuosit&#233; de celui-ci (n&#233;cessit&#233; de proc&#233;der &#224; une r&#233;paration), l&#8217;absence de due diligences emporterait une m&#234;me qualification de &#171;&#160;soustraction de preuves&#160;&#187;. Il est &#224; noter que ce n&#8217;est bien &#233;videmment que dans le cadre d&#8217;une proc&#233;dure p&#233;nale en cours (c&#8217;est-&#224;-dire quand un crime ou un d&#233;lit a &#233;t&#233; commis, qu&#8217;une enqu&#234;te est en cours et que l&#8217;enregistrement se r&#233;v&#232;lerait indispensable), que ces dispositions auraient une effectivit&#233;, et que leur application serait donc protectrice tout en concernant une minorit&#233; de situations.</p><p style=\"text-align: justify;\">Cette exp&#233;rimentation, qui reste limit&#233;e dans son champ d&#8217;application dans l&#8217;espace (une ou plusieurs communes volontaire), et dans le temps (une dur&#233;e maximale d&#8217;un an).</p>"
  },
  "representations": [
    {
      "nom": "PDF",
      "typeMime": {
        "type": "application",
        "subType": "PDF"
      },
      "statutRepresentation": {
        "verbatim": true,
        "canonique": true,
        "officielle": true,
        "transcription": false,
        "enregistrement": false
      },
      "contenu": {
        "documentURI": "/15/amendements/1187/AN/5.pdf"
      }
    }
  ],
  "seanceDiscussion": "RUANR5L15S2018IDS21209",
  "sort": {
    "dateSaisie": "2018-07-30T20:06:03.000+02:00",
    "sortEnSeance": "Rejeté"
  },
  "dateDepot": "2018-07-24T02:00:00.000+02:00",
  "dateDistribution": "2018-07-27T02:00:00.000+02:00",
  "article99": "0",
  "loiReference": {
    "codeLoi": "c sécurité intérieure",
    "divisionCodeLoi": "L241-1"
  }
}