{
  "uid": "AMANR5L15SEA717460BTC0857P0D1N403",
  "identifiant": {
    "legislature": "15",
    "numero": "403",
    "numRect": "0",
    "saisine": {
      "texteLegislatifRef": "PRJLANR5L15BTC0857",
      "numeroPartiePLF": "0",
      "organeExamen": "PO717460",
      "mentionSecondeDeliberation": "0"
    }
  },
  "numeroLong": "403",
  "etapeTexte": "1ère lecture (1ère assemblée saisie)",
  "triAmendement": "ahbw",
  "cardinaliteAmdtMultiples": "1",
  "etat": "Discuté",
  "signataires": {
    "auteur": {
      "typeAuteur": "Depute",
      "acteurRef": "PA330684",
      "groupePolitiqueRef": "PO730934"
    },
    "cosignatairesRefs": [
      "PA720684",
      "PA330684",
      "PA267260",
      "PA334843",
      "PA719318",
      "PA334654",
      "PA720210",
      "PA1874",
      "PA266776",
      "PA2796",
      "PA608416",
      "PA721506",
      "PA721678",
      "PA719272"
    ],
    "texteAffichable": "Mme&#160;Val&#233;rie&#160;Boyer,  Mme&#160;Poletti, Mme&#160;Beauvais, M.&#160;Verch&#232;re, M.&#160;Reiss, M.&#160;Reda, M.&#160;Hetzel, M.&#160;Straumann, Mme&#160;Anthoine, M.&#160;Le Fur, Mme&#160;Kuster, M.&#160;Pierre-Henri&#160;Dumont, M.&#160;Teissier et Mme&#160;Meunier"
  },
  "pointeurFragmentTexte": {
    "division": {
      "titre": "Article 33 bis",
      "articleDesignationCourte": "APRÈS ART. 33 BIS",
      "type": "ARTICLE",
      "avantAApres": "Apres",
      "divisionRattachee": "APRÈS L'ARTICLE 33 BIS, insérer l'article suivant:",
      "articleAdditionnel": "1",
      "urlDivisionTexteVise": "/15/textes/0857.asp#D_Article_33_bis"
    }
  },
  "corps": {
    "dispositif": "<p style=\"text-align: justify;\">Le premier alin&#233;a de l&#8217;article L.&#160;313&#8209;5 du code de l&#8217;entr&#233;e et du s&#233;jour des &#233;trangers et du droit d&#8217;asile est compl&#233;t&#233; par les mots&#160;: &#171;&#160;ainsi qu&#8217;&#224; l&#8217;&#233;tranger inscrit au fichier de traitement des signalements pour la pr&#233;vention de la radicalisation &#224; caract&#232;re terroriste&#160;&#187;.</p>",
    "exposeSommaire": "<p style=\"text-align: justify;\">L&#8217;&#233;tranger titulaire d&#8217;une carte de s&#233;jour temporaire ou d&#8217;une carte de s&#233;jour pluriannuelle doit &#234;tre en mesure de justifier qu&#8217;il continue de remplir les conditions requises pour la d&#233;livrance de cette carte. L&#8217;autorit&#233; administrative peut proc&#233;der aux v&#233;rifications utiles pour s&#8217;assurer du maintien du droit au s&#233;jour de l&#8217;int&#233;ress&#233; et, &#224; cette fin, convoquer celui-ci &#224; un ou plusieurs entretiens.</p><p style=\"text-align: justify;\">Si l&#8217;&#233;tranger cesse de remplir l&#8217;une des conditions exig&#233;es pour la d&#233;livrance de la carte de s&#233;jour dont il est titulaire, fait obstacle aux contr&#244;les ou ne d&#233;f&#232;re pas aux convocations, la carte de s&#233;jour peut lui &#234;tre retir&#233;e ou son renouvellement refus&#233; par une d&#233;cision motiv&#233;e.</p><p style=\"text-align: justify;\">Il s&#8217;agit ici&#160;d&#8217;&#233;tendre la possibilit&#233; de retirer la carte de s&#233;jour aux &#233;trangers inscrits au Fichier de traitement des signal&#233;s pour la pr&#233;vention et la radicalisation &#224; caract&#232;re terroriste.</p>"
  },
  "representations": [
    {
      "nom": "PDF",
      "typeMime": {
        "type": "application",
        "subType": "PDF"
      },
      "statutRepresentation": {
        "verbatim": true,
        "canonique": true,
        "officielle": true,
        "transcription": false,
        "enregistrement": false
      },
      "contenu": {
        "documentURI": "/15/amendements/0857/AN/403.pdf"
      }
    }
  ],
  "seanceDiscussion": "RUANR5L15S2018IDS21078",
  "sort": {
    "dateSaisie": "2018-04-22T19:22:35.000+02:00",
    "sortEnSeance": "Rejeté"
  },
  "dateDepot": "2018-04-11T02:00:00.000+02:00",
  "dateDistribution": "2018-04-16T02:00:00.000+02:00",
  "article99": "0",
  "loiReference": {
    "codeLoi": "c entrée et séjour étrangers",
    "divisionCodeLoi": "L313-5"
  }
}