{
  "uid": "AMANR5L15SEA717460BTC1019P0D1N441",
  "identifiant": {
    "legislature": "15",
    "numero": "441",
    "numRect": "0",
    "saisine": {
      "texteLegislatifRef": "PRJLANR5L15BTC1019",
      "numeroPartiePLF": "0",
      "organeExamen": "PO717460",
      "mentionSecondeDeliberation": "1"
    }
  },
  "numeroLong": "441",
  "etapeTexte": "1ère lecture (1ère assemblée saisie)",
  "triAmendement": "cdd",
  "cardinaliteAmdtMultiples": "1",
  "etat": "Discuté",
  "signataires": {
    "auteur": {
      "typeAuteur": "Depute",
      "acteurRef": "PA721474",
      "groupePolitiqueRef": "PO730934"
    },
    "cosignatairesRefs": [
      "PA709315",
      "PA719318",
      "PA330909",
      "PA721816",
      "PA608016",
      "PA267324",
      "PA720210",
      "PA267450",
      "PA767",
      "PA346054",
      "PA334149",
      "PA266776",
      "PA609245",
      "PA340853",
      "PA2792",
      "PA721046",
      "PA267378",
      "PA720386",
      "PA608416",
      "PA266793",
      "PA267289",
      "PA856",
      "PA606712",
      "PA718884",
      "PA266774",
      "PA718784",
      "PA718838",
      "PA345722",
      "PA346218",
      "PA2155",
      "PA721474",
      "PA2377",
      "PA1874",
      "PA267204",
      "PA334654",
      "PA923"
    ],
    "texteAffichable": "M.&#160;Viry,  M.&#160;Cherpion, Mme&#160;Anthoine, Mme&#160;Bassire, Mme&#160;Bazin-Malgras, Mme&#160;Beauvais, M.&#160;Bony, M.&#160;Boucard, M.&#160;Brun, M.&#160;Cattin, M.&#160;Cornut-Gentille, M.&#160;R&#233;mi&#160;Delatte, M.&#160;Descoeur, M.&#160;Di Filippo, M.&#160;Door, M.&#160;Fasquelle, M.&#160;Furst, M.&#160;Gaultier, M.&#160;Hetzel, Mme&#160;Lacroute, M.&#160;Le Fur, Mme&#160;Le Grip, M.&#160;Leclerc, Mme&#160;Levy, M.&#160;Lurton, M.&#160;Emmanuel&#160;Maquet, M.&#160;Masson, M.&#160;Menuel, M.&#160;Pauget, M.&#160;Perrut, M.&#160;Reiss, M.&#160;Sermier, M.&#160;Straumann, M.&#160;Taugourdeau, Mme&#160;Louwagie et M.&#160;Viala"
  },
  "pointeurFragmentTexte": {
    "division": {
      "titre": "Article 66",
      "articleDesignationCourte": "APRÈS ART. 66",
      "type": "ARTICLE",
      "avantAApres": "Apres",
      "divisionRattachee": "APRÈS L'ARTICLE 66, insérer l'article suivant:",
      "articleAdditionnel": "1",
      "urlDivisionTexteVise": "/15/textes/1019.asp#D_Article_66"
    }
  },
  "corps": {
    "dispositif": "<p style=\"text-align: justify;\">Le chapitre II du titre V du livre II de la premi&#232;re partie du code du travail est ainsi modifi&#233;&#160;:</p><p style=\"text-align: justify;\">1&#176;&#160;Apr&#232;s le premier alin&#233;a de l&#8217;article L.&#160;1252&#8209;2, sont ins&#233;r&#233;s deux alin&#233;as ainsi r&#233;dig&#233;s&#160;:</p><p style=\"text-align: justify;\">&#171;&#160;Est un entrepreneur de travail &#224; temps partag&#233; aux fins d&#8217;employabilit&#233;, toute personne physique ou morale dont l&#8217;activit&#233; exclusive, nonobstant les dispositions de l&#8217;article L.&#160;8241&#8209;1, est de mettre &#224; disposition d&#8217;entreprises utilisatrices du personnel qui, au moment de la signature du contrat de travail &#224; temps partag&#233; aux fins d&#8217;employabilit&#233;, est demandeur d&#8217;emploi au sens de l&#8217;article L.&#160;5411&#8209;1, ou rencontre des difficult&#233;s d&#8217;acc&#232;s &#224; un contrat &#224; dur&#233;e ind&#233;termin&#233;e, en raison d&#8217;un handicap au sens de l&#8217;article L.&#160;5212&#8209;13, de l&#8217;absence ou de la faiblesse de ses qualifications ou de ses comp&#233;tences, ou de son &#226;ge.&#160;Cette mise &#224; disposition n&#8217;est pas opposable &#224; l&#8217;activit&#233; normale et permanente de l&#8217;entreprise.</p><p style=\"text-align: justify;\">&#171;&#160;Dans les conditions et modalit&#233;s pr&#233;vues &#224; l&#8217;article L.&#160;1252&#8209;6&#8209;1, le salari&#233; b&#233;n&#233;ficie de formations dites certifiantes et de formations qualifiantes.&#160;&#187;&#160;</p><p style=\"text-align: justify;\">2&#176;&#160;L&#8217;article L.&#160;1252&#8209;4 est compl&#233;t&#233; par deux alin&#233;as ainsi r&#233;dig&#233;s&#160;:</p><p style=\"text-align: justify;\">&#171;&#160;Le contrat de travail &#224; temps partag&#233; aux fins d&#8217;employabilit&#233; est un contrat &#224; dur&#233;e ind&#233;termin&#233;e.&#160;</p><p style=\"text-align: justify;\">&#171;&#160;Lorsqu&#8217;il est recouru au travail &#224; temps partag&#233; aux fins d&#8217;employabilit&#233;, dans les conditions pr&#233;vues aux deuxi&#232;me et troisi&#232;me alin&#233;as de l&#8217;article L.&#160;1252&#8209;2, le dernier salaire horaire de base est garanti au salari&#233; pendant les p&#233;riodes dites d&#8217;intermissions.&#160;&#187;</p><p style=\"text-align: justify;\">3&#176;&#160;Apr&#232;s l&#8217;article L.&#160;1252&#8209;6, il est ins&#233;r&#233; un article L.&#160;1252&#8209;6&#8209;1 ainsi r&#233;dig&#233;&#160;:</p><p style=\"text-align: justify;\">&#171;&#160;<i>Art.&#160;L.&#160;1252-6-1</i>.&#160;&#8211;&#160;Lorsqu&#8217;il est recouru au travail &#224; temps partag&#233; aux fins d&#8217;employabilit&#233;, l&#8217;entreprise de travail &#224; temps partag&#233; assure, avant la mise &#224; disposition du salari&#233;, durant les p&#233;riodes dites d&#8217;intermissions et tout au long de l&#8217;ex&#233;cution de son contrat, des actions de d&#233;veloppement des comp&#233;tences conform&#233;ment aux articles L.&#160;6321&#8209;6 et suivants.</p><p style=\"text-align: justify;\">&#171;&#160;Sans pr&#233;judice des dispositions de l&#8217;article L.&#160;6323&#8209;14, l&#8217;employeur abonde le compte personnel de formation &#224; hauteur de 500&#160;euros suppl&#233;mentaires par salari&#233; &#224; temps complet et par ann&#233;e de pr&#233;sence. L&#8217;abondement est calcul&#233;, lorsque le salari&#233; n&#8217;a pas effectu&#233; une dur&#233;e de travail &#224; temps complet sur l&#8217;ensemble de l&#8217;ann&#233;e, &#224; due proportion du temps de travail effectu&#233;. L&#8217;employeur s&#8217;assure de l&#8217;effectivit&#233; de la formation.&#160;&#187;</p>",
    "exposeSommaire": "<p style=\"text-align: justify;\">Le projet de loi engage une transformation profonde du syst&#232;me de formation professionnelle initiale et continue permettant &#224; la fois de s&#233;curiser les parcours professionnels des individus et d&#8217;inciter les entreprises &#224; investir dans le champ des comp&#233;tences, v&#233;ritable levier pour la croissance. Le travail &#224; temps partag&#233; aux fins d&#8217;employabilit&#233;, d&#233;velopp&#233; et enrichi par une exp&#233;rimentation sur le terrain, partage cette philosophie dans la mesure o&#249; il place l&#8217;employabilit&#233; par la formation continue au c&#339;ur de l&#8217;&#233;mancipation professionnelle des individus. Il r&#233;affirme notamment le mod&#232;le de l&#8217;entreprise socialement responsable en s&#233;curisant les parcours professionnels d&#8217;individus initialement &#233;loign&#233;s du march&#233; de l&#8217;emploi.</p><p style=\"text-align: justify;\">Cet amendement compl&#232;te l&#8217;organisation du travail &#224; temps partag&#233;, issu de la loi du 2 ao&#251;t 2005, par un dispositif visant l&#8217;employabilit&#233; du salari&#233;. Il ne remplace pas le cadre juridique existant mais le compl&#232;te afin de proposer une alternative visant les individus ayant des difficult&#233;s &#224; trouver un Contrat &#224; Dur&#233;e Ind&#233;termin&#233;e. Il pr&#233;cise les publics concern&#233;s et la dur&#233;e maximale de mise &#224; disposition, tout en instaurant des obligations nouvelles pour les entrepreneurs de travail &#224; temps partag&#233; aux fins d&#8217;employabilit&#233; (ETTPI).</p><p style=\"text-align: justify;\">Le I. pr&#233;cise les caract&#233;ristiques socioprofessionnelles des individus pouvant &#234;tre mis &#224; disposition par les ETTPI, ces derniers devant &#234;tre inscrits sur les listes de demandeurs d&#8217;emploi &#224; P&#244;le emploi. Ils pr&#233;sentent initialement une faible employabilit&#233; en raison d&#8217;un handicap ou de l&#8217;inad&#233;quation de leurs comp&#233;tences avec le march&#233; du travail. La d&#233;marche vise &#224; encourager l&#8217;entreprise utilisatrice &#224; proposer au terme de la mise &#224; disposition un contrat de travail &#224; dur&#233;e ind&#233;termin&#233;e au salari&#233; de ETTPI.</p><p style=\"text-align: justify;\">La d&#233;nomination &#171;&#160;r&#233;put&#233; &#224;&#160;&#187; utilis&#233;e par le l&#233;gislateur laisse subsister un doute sur la nature juridique du contrat conclu par le salari&#233; avec l&#8217;ETTPI. Le II. affirme sans r&#233;serve que le contrat de travail d&#8217;un salari&#233; &#224; temps partag&#233;, quelle que soit sa finalit&#233;, est un contrat &#224; dur&#233;e ind&#233;termin&#233;e. Il pr&#233;cise par ailleurs que pendant les p&#233;riodes d&#8217;intermission, l&#8217;ETTPI verse le m&#234;me salaire que le salari&#233; percevait lors de sa pr&#233;c&#233;dente mission et qu&#8217;il b&#233;n&#233;ficie d&#8217;actions de formation pendant cette p&#233;riode.</p><p style=\"text-align: justify;\">Le III. consacre l&#8217;int&#233;r&#234;t du dispositif, &#224; savoir la formation du salari&#233; mis &#224; disposition par un ETTPI tout au long de l&#8217;ex&#233;cution de son contrat&#160;: avant l&#8217;embauche par une entreprise utilisatrice afin de l&#8217;y pr&#233;parer, pendant les missions et les intermissions. Il dispose &#233;galement que ces salari&#233;s b&#233;n&#233;ficieront d&#8217;un doublement de l&#8217;abondement de leur Compte personnel de formation (CPF).</p>"
  },
  "representations": [
    {
      "nom": "PDF",
      "typeMime": {
        "type": "application",
        "subType": "PDF"
      },
      "statutRepresentation": {
        "verbatim": true,
        "canonique": true,
        "officielle": true,
        "transcription": false,
        "enregistrement": false
      },
      "contenu": {
        "documentURI": "/15/amendements/1019/AN/441.pdf"
      }
    }
  ],
  "seanceDiscussion": "RUANR5L15S2018IDS21106",
  "sort": {
    "dateSaisie": "2018-06-16T03:43:56.000+02:00",
    "sortEnSeance": "Retiré"
  },
  "dateDepot": "2018-06-06T02:00:00.000+02:00",
  "dateDistribution": "2018-06-13T02:00:00.000+02:00",
  "article99": "0",
  "loiReference": {
    "codeLoi": "c travail",
    "divisionCodeLoi": "L1252-2"
  }
}