{
  "uid": "AMANR5L15PO59048B2272P1D1N737",
  "identifiant": {
    "legislature": "15",
    "numero": "737",
    "numRect": "0",
    "saisine": {
      "texteLegislatifRef": "PRJLANR5L15B2272",
      "numeroPartiePLF": "1",
      "organeExamen": "PO59048",
      "mentionSecondeDeliberation": "0"
    }
  },
  "numeroLong": "I-CF737",
  "etapeTexte": "1ère lecture (1ère assemblée saisie)",
  "triAmendement": "daaaaaaaaaaaaaaaaaaaaaaaaaaaaaaaaaaaaaaaaaaaaaaaaabvddhzo",
  "cardinaliteAmdtMultiples": "1",
  "etat": "Discuté",
  "signataires": {
    "auteur": {
      "typeAuteur": "Depute",
      "acteurRef": "PA719890",
      "groupePolitiqueRef": "PO730964"
    },
    "cosignatairesRefs": [
      "PA719890"
    ],
    "texteAffichable": "Mme&#160;Brulebois"
  },
  "pointeurFragmentTexte": {
    "division": {
      "titre": "Article 13",
      "articleDesignationCourte": "APRÈS ART. 13",
      "type": "ARTICLE",
      "avantAApres": "Apres",
      "divisionRattachee": "APRÈS L'ARTICLE 13, insérer l'article suivant:",
      "articleAdditionnel": "1",
      "urlDivisionTexteVise": "/15/textes/2272A.asp#D_Article_13"
    }
  },
  "corps": {
    "dispositif": "<p style=\"text-align: justify;\">I.&#160;&#8211;&#160;Apr&#232;s le premier alin&#233;a de l&#8217;article&#160;244 <i>quater</i> L du code g&#233;n&#233;ral des imp&#244;ts, il est ins&#233;r&#233; un alin&#233;a ainsi r&#233;dig&#233;&#160;:</p><p style=\"text-align: justify;\">&#171;&#160;I <i>bis</i>. Les entreprises agricoles qui obtiennent la certification de troisi&#232;me niveau, permettant l&#8217;utilisation de la mention &#171;&#160;exploitation de haute valeur environnementale&#160;&#187;, conform&#233;ment aux articles L.&#160;611&#8209;6 et D.617&#8209;4 du code rural et de la p&#234;che maritime, avant le 31 d&#233;cembre 2025, b&#233;n&#233;ficient d&#8217;un cr&#233;dit d&#8217;imp&#244;t au titre de l&#8217;ann&#233;e d&#8217;obtention de ladite certification.&#160;&#187;.</p><p style=\"text-align: justify;\">II.&#160;&#8211;&#160;Le deuxi&#232;me alin&#233;a du m&#234;me article est compl&#233;t&#233; par les mots&#160;: &#171;&#160;et le montant du cr&#233;dit d&#8217;imp&#244;t mentionn&#233; au I <i>bis</i> s&#8217;&#233;l&#232;ve &#224; 3 500&#160;&#8364;.&#160;&#187;.</p><p style=\"text-align: justify;\">III.&#160;&#8211;&#160;Au IV du m&#234;me article, les mots&#160;: &#171;&#160;du cr&#233;dit d&#8217;imp&#244;t mentionn&#233; au I&#160;&#187; sont remplac&#233;s par les mots&#160;: &#171;&#160;des cr&#233;dits d&#8217;imp&#244;t mentionn&#233;s au I et au I <i>bis</i>&#160;&#187;.</p><p style=\"text-align: justify;\">IV.&#160;&#8211;&#160;Les pertes de recettes r&#233;sultant du I et du II sont compens&#233;es par la cr&#233;ation d&#8217;une taxe additionnelle aux droits vis&#233;s aux articles 575 et 575 A du code g&#233;n&#233;ral des imp&#244;ts.</p><p style=\"text-align: justify;\">V.&#160;&#8211;&#160;Le I n&#8217;est applicable qu&#8217;aux sommes venant en d&#233;duction de l&#8217;imp&#244;t d&#251;.</p>",
    "exposeSommaire": "<p style=\"text-align: justify;\">Un dispositif incitatif permettrait d&#8217;acc&#233;l&#233;rer l&#8217;engagement des viticulteurs dans la viticulture durable.</p><p>Cette d&#233;marche volontaire est aujourd&#8217;hui frein&#233;e par le fait qu&#8217;elle implique de nouveaux investissements, une hausse des co&#251;ts de production, une baisse de la production et des contraintes administratives suppl&#233;mentaires. Le co&#251;t de la certification par un organisme agr&#233;&#233;, ind&#233;pendant de la taille de l&#8217;entreprise, est particuli&#232;rement lourd pour les petites exploitations.</p><p>Afin de compenser ces handicaps et d&#8217;accompagner les exploitants dans leur d&#233;marche en faveur de l&#8217;environnement et de la biodiversit&#233;, il est propos&#233; d'att&#233;nuer le co&#251;t administratif de la certification environnementale en octroyant aux exploitants un cr&#233;dit d'imp&#244;t &#233;gal &#224; celui de l&#8217;engagement en agriculture biologique. Il est important de ne pas opposer les diff&#233;rentes d&#233;marches.</p><p>Ce cr&#233;dit d'imp&#244;t b&#233;n&#233;ficierait &#224; la certification environnementale de niveau 3 (Haute Valeur Environnementale) vis&#233;e &#224; l&#8217;article D. 617-4 du code rural, dans le but d'inciter le plus grand nombre d'exploitants &#224; s'engager dans cette d&#233;marche HVE.&#160;</p><p>Cet all&#233;gement fiscal pourrait &#234;tre limit&#233; dans sa dur&#233;e &#8211; jusqu&#8217;au 31 d&#233;cembre 2025 &#8211; pour en marquer le caract&#232;re incitatif, tout en en limitant le risque budg&#233;taire et cela seulement pour la premi&#232;re ann&#233;e marquant l&#8217;engagement dans cette d&#233;marche.&#160;</p><p>&#192; l'instar du cr&#233;dit d'imp&#244;t en faveur de l'agriculture biologique, ce cr&#233;dit d'imp&#244;t devrait s'inscrire dans le respect de la r&#233;glementation europ&#233;enne relatives aux aides de minimis dans le secteur de l'agriculture.</p>"
  },
  "representations": [
    {
      "nom": "PDF",
      "typeMime": {
        "type": "application",
        "subType": "PDF"
      },
      "statutRepresentation": {
        "verbatim": true,
        "canonique": true,
        "officielle": true,
        "transcription": false,
        "enregistrement": false
      },
      "contenu": {
        "documentURI": "/15/amendements/2272A/CION_FIN/CF737.pdf"
      }
    }
  ],
  "sort": {
    "dateSaisie": "2019-10-09T23:29:47.000+02:00",
    "sortEnSeance": "Non soutenu"
  },
  "dateDepot": "2019-10-04T02:00:00.000+02:00",
  "dateDistribution": "2019-10-08T02:00:00.000+02:00",
  "article99": "0",
  "loiReference": {
    "codeLoi": "CGI",
    "divisionCodeLoi": "244 quater L"
  }
}