{
  "uid": "AMANR5L15PO419865B1255P1D1N144",
  "identifiant": {
    "legislature": "15",
    "numero": "144",
    "numRect": "0",
    "saisine": {
      "texteLegislatifRef": "PRJLANR5L15B1255",
      "numeroPartiePLF": "1",
      "organeExamen": "PO419865",
      "mentionSecondeDeliberation": "0"
    }
  },
  "numeroLong": "I-CD144",
  "etapeTexte": "1ère lecture (1ère assemblée saisie)",
  "triAmendement": "ekaaaaaaaaaaaaaaaaaaaaaaaaaaaaaaaaaaaaaaaaaaaaaaaack",
  "cardinaliteAmdtMultiples": "1",
  "etat": "Discuté",
  "signataires": {
    "auteur": {
      "typeAuteur": "Depute",
      "acteurRef": "PA721600",
      "groupePolitiqueRef": "PO730964"
    },
    "cosignatairesRefs": [
      "PA721600"
    ],
    "texteAffichable": "Mme&#160;Rossi, rapporteure"
  },
  "pointeurFragmentTexte": {
    "division": {
      "titre": "Article 19",
      "articleDesignationCourte": "ART. 19",
      "type": "ARTICLE",
      "avantAApres": "A",
      "divisionRattachee": "ARTICLE 19",
      "urlDivisionTexteVise": "/15/textes/1255A.asp#D_Article_19"
    },
    "alinea": {
      "avantAApres": "Apres",
      "numero": "23"
    }
  },
  "corps": {
    "dispositif": "<p style=\"text-align: justify;\">Apr&#232;s l&#8217;alin&#233;a&#160;23, ins&#233;rer les cinq alin&#233;as suivants&#160;:</p><p style=\"text-align: justify;\">&#171;&#160;B <i>bis</i>.&#160;&#8211;&#160;Le 1 de l&#8217;article&#160;265 <i>bis</i> est ainsi modifi&#233;&#160;:</p><p style=\"text-align: justify;\">&#171;&#160;1&#176; Le <i>c</i> est ainsi modifi&#233;&#160;:</p><p style=\"text-align: justify;\"><i>&#171;&#160;a</i>) &#192; la premi&#232;re phrase, les mots&#160;: &#171;&#160;de transport de personnes,&#160;&#187; sont supprim&#233;s&#160;;</p><p style=\"text-align: justify;\"><i>&#171;&#160;b)</i> La seconde phrase est compl&#233;t&#233;e par les mots&#160;: &#171;&#160;, quel qu&#8217;en soit l&#8217;usage&#160;&#187;&#160;;</p><p style=\"text-align: justify;\">&#171;&#160;2&#176; Au <i>e</i>, apr&#232;s le mot&#160;: &#171;&#160;marchandises&#160;&#187;, sont ins&#233;r&#233;s les mots&#160;: &#171;&#160;et le transport public de passagers&#160;&#187;.&#160;&#187;</p>",
    "exposeSommaire": "<p style=\"text-align: justify;\">Le transport de passagers et de marchandises est exon&#233;r&#233; de TICPE pour ce qui concerne le transport maritime. Cette exon&#233;ration concerne aussi bien les compagnies priv&#233;es que le transport public, mais exclut les bateaux de plaisance.</p><p style=\"text-align: justify;\">S&#8217;agissant du transport fluvial, seul est exon&#233;r&#233; le transport de marchandises, et non pas le transport de passagers. Afin de ne pas p&#233;naliser le transport public de passagers, notamment par rapport au transport ferroviaire de passagers, cet amendement exon&#232;re cette activit&#233; des droits de TICPE.</p><p style=\"text-align: justify;\">Par ailleurs, cette perte de recettes est compens&#233;e gr&#226;ce &#224; la suppression de l&#8217;exon&#233;ration de TICPE pour le transport maritime de passagers par des compagnies priv&#233;es et notamment pour les paquebots de croisi&#232;re. Pour rappel ces paquebots &#233;mettent autant de particules fines qu&#8217;un million de voitures. Une enqu&#234;te britannique a par ailleurs d&#233;montr&#233; que le volume de particules fines sur le pont de ce type bateau pouvait s&#8217;&#233;lever &#224; 84 000 par cm&#179;. Cette suppression ne concernera pas le transport maritime public de passagers.</p>"
  },
  "representations": [
    {
      "nom": "PDF",
      "typeMime": {
        "type": "application",
        "subType": "PDF"
      },
      "statutRepresentation": {
        "verbatim": true,
        "canonique": true,
        "officielle": true,
        "transcription": false,
        "enregistrement": false
      },
      "contenu": {
        "documentURI": "/15/amendements/1255A/CION-DVP/CD144.pdf"
      }
    }
  ],
  "sort": {
    "dateSaisie": "2018-10-03T12:48:07.000+02:00",
    "sortEnSeance": "Adopté"
  },
  "dateDepot": "2018-10-02T02:00:00.000+02:00",
  "dateDistribution": "2018-10-02T02:00:00.000+02:00",
  "article99": "0",
  "loiReference": {}
}