{
  "uid": "AMANR5L15SEA717460BTC2039P0D1N262",
  "identifiant": {
    "legislature": "15",
    "numero": "262",
    "numRect": "0",
    "saisine": {
      "texteLegislatifRef": "PRJLANR5L15BTC2039",
      "numeroPartiePLF": "0",
      "organeExamen": "PO717460",
      "mentionSecondeDeliberation": "0"
    }
  },
  "numeroLong": "262",
  "etapeTexte": "1ère lecture (2ème assemblée saisie)",
  "triAmendement": "uaaaaaaaaaaaaaaaaaaaaaaaaaaaaaaaaaaaaaaaaaaaaaaaaad",
  "cardinaliteAmdtMultiples": "1",
  "etat": "Discuté",
  "signataires": {
    "auteur": {
      "typeAuteur": "Depute",
      "acteurRef": "PA722284",
      "groupePolitiqueRef": "PO730970"
    },
    "cosignatairesRefs": [
      "PA722284"
    ],
    "texteAffichable": "M.&#160;Fuchs"
  },
  "pointeurFragmentTexte": {
    "division": {
      "titre": "Article 11",
      "articleDesignationCourte": "APRÈS ART. 11",
      "type": "ARTICLE",
      "avantAApres": "Apres",
      "divisionRattachee": "APRÈS L'ARTICLE 11, insérer l'article suivant:",
      "articleAdditionnel": "1",
      "urlDivisionTexteVise": "/15/textes/2039.asp#D_Article_11"
    }
  },
  "corps": {
    "dispositif": "<p style=\"text-align: justify;\">&#192; titre exp&#233;rimental, pour une dur&#233;e de cinq ans, la Collectivit&#233; europ&#233;enne d&#8217;Alsace autorise, apr&#232;s avis favorable du repr&#233;sentant de l&#8217;&#201;tat dans le d&#233;partement, des adaptations ou d&#233;rogations dans le cadre de la reconstruction d&#8217;un b&#226;timent public sinistr&#233;&#160;:</p><p style=\"text-align: justify;\">&#171;&#160;1&#176;&#160;Aux r&#232;gles en mati&#232;re d&#8217;urbanisme, d&#8217;environnement, de construction et de pr&#233;servation du patrimoine, en particulier en ce qui concerne la mise en conformit&#233; des documents de planification, la d&#233;livrance des autorisations de travaux et de construction, les modalit&#233;s de la participation du public &#224; l&#8217;&#233;laboration des d&#233;cisions et de l&#8217;&#233;valuation environnementale, ainsi que l&#8217;arch&#233;ologie pr&#233;ventive&#160;;</p><p style=\"text-align: justify;\">&#171;&#160;2&#176;&#160;Aux r&#232;gles en mati&#232;re de commande publique, de domanialit&#233; publique, de voirie et de transport.&#160;&#187;</p>",
    "exposeSommaire": "<p style=\"text-align: justify;\">L&#8217;article L.&#160;111&#8209;3 du code de l&#8217;urbanisme pr&#233;voit que &#171;&#160;la reconstruction &#224; l&#8217;identique d&#8217;un b&#226;timent d&#233;truit par un sinistre est autoris&#233;e nonobstant toute disposition d&#8217;urbanisme contraire, sauf si la carte communale ou le plan local d&#8217;urbanisme en dispose autrement, d&#232;s lors qu&#8217;il a &#233;t&#233; r&#233;guli&#232;rement &#233;difi&#233;&#160;&#187;. Pour autant, cette disposition n&#8217;introduit pas une exception au r&#233;gime g&#233;n&#233;ral du champ d&#8217;application du permis de construire et les travaux de reconstruction doivent faire l&#8217;objet d&#8217;une autorisation d&#8217;urbanisme. Il r&#233;sulte des dispositions pr&#233;cit&#233;es que la reconstruction &#224; l&#8217;identique d&#8217;un b&#226;timent d&#233;truit par un sinistre, et qui avait fait l&#8217;objet d&#8217;un permis de construire ou a &#233;t&#233; &#233;difi&#233; avant l&#8217;institution du permis de construire, doit toujours &#234;tre autoris&#233;e, sauf si la carte communale ou le plan local d&#8217;urbanisme l&#8217;interdit explicitement.</p><p style=\"text-align: justify;\">Cette disposition retarde la reconstruction de b&#226;timents publics sinistr&#233;s qui sont pourtant essentiels aux communes, comme les gymnases par exemple, &#224; la suite de catastrophes naturelles (chutes d&#8217;arbres, inondations, incendies etc.). Dans l&#8217;optique d&#8217;une reconstruction plus rapide, permettant de rendre aux populations concern&#233;es les &#233;quipements d&#233;truits, le pr&#233;sent amendement vise &#224; autoriser pour une p&#233;riode exp&#233;rimentale de 5 ans des d&#233;rogations aux r&#232;gles en vigueur.</p><p style=\"text-align: justify;\">Ces d&#233;rogations devraient permettre une reconstruction plus rapide et garantir leur acc&#232;s aux citoyens et faciliter la t&#226;che des maires pour lancer les op&#233;rations de reconstructions.</p>"
  },
  "representations": [
    {
      "nom": "PDF",
      "typeMime": {
        "type": "application",
        "subType": "PDF"
      },
      "statutRepresentation": {
        "verbatim": true,
        "canonique": true,
        "officielle": true,
        "transcription": false,
        "enregistrement": false
      },
      "contenu": {
        "documentURI": "/15/amendements/2039/AN/262.pdf"
      }
    }
  ],
  "seanceDiscussion": "RUANR5L15S2019IDS21732",
  "sort": {
    "dateSaisie": "2019-06-26T00:56:57.000+02:00",
    "sortEnSeance": "Retiré"
  },
  "dateDepot": "2019-06-20T02:00:00.000+02:00",
  "dateDistribution": "2019-06-21T02:00:00.000+02:00",
  "article99": "0",
  "loiReference": {}
}