{
  "uid": "AMANR5L15PO419865B2274P0D1N112",
  "identifiant": {
    "legislature": "15",
    "numero": "112",
    "numRect": "0",
    "saisine": {
      "texteLegislatifRef": "PRJLANR5L15B2274",
      "numeroPartiePLF": "0",
      "organeExamen": "PO419865",
      "mentionSecondeDeliberation": "0"
    }
  },
  "numeroLong": "CD112",
  "etapeTexte": "1ère lecture (2ème assemblée saisie)",
  "triAmendement": "daiaaaaaaaaaaaaaaaaaaaaaaaaaaaaaaaaaaaaaaaaaaaaaaas",
  "cardinaliteAmdtMultiples": "1",
  "etat": "En traitement",
  "signataires": {
    "auteur": {
      "typeAuteur": "Depute",
      "acteurRef": "PA719668",
      "groupePolitiqueRef": "PO730964"
    },
    "cosignatairesRefs": [
      "PA721542",
      "PA718756",
      "PA722300",
      "PA718802",
      "PA720622",
      "PA719668",
      "PA719822",
      "PA718710",
      "PA718728",
      "PA720268",
      "PA720116",
      "PA721600",
      "PA721718",
      "PA722260",
      "PA719528"
    ],
    "texteAffichable": "Mme&#160;Mirall&#232;s,  Mme&#160;Khedher, M.&#160;Portarrieu, Mme&#160;Verdier-Jouclas, M.&#160;Perea, Mme&#160;Bono-Vandorme, Mme&#160;Bureau-Bonnard, M.&#160;Damaisin, Mme&#160;Rossi, Mme&#160;Pascale&#160;Boyer, Mme&#160;Thillaye, Mme&#160;Vanceunebrock-Mialon, M.&#160;Villani, Mme&#160;Do et Mme&#160;Brunet"
  },
  "pointeurFragmentTexte": {
    "division": {
      "titre": "Article 5 bis D",
      "articleDesignationCourte": "APRÈS ART. 5 BIS D",
      "type": "ARTICLE",
      "avantAApres": "Apres",
      "divisionRattachee": "APRÈS L'ARTICLE 5 BIS D, insérer l'article suivant:",
      "articleAdditionnel": "1",
      "urlDivisionTexteVise": "/15/textes/2274.asp#D_Article_5_bis_D"
    }
  },
  "corps": {
    "dispositif": "<p style=\"text-align: justify;\">L&#8217;article L.&#160;541&#8209;15&#8209;9 du code de l&#8217;environnement, dans sa r&#233;daction r&#233;sultant de la pr&#233;sente loi, est compl&#233;t&#233; par un IV ainsi r&#233;dig&#233;&#160;:</p><p style=\"text-align: justify;\">&#171;&#160;IV.&#160;&#8211;&#160;Sauf demande contraire du client, l&#8217;impression syst&#233;matique des tickets de carte bancaire est interdite en France au plus tard le 1<sup>er</sup> janvier 2022.&#160;Les modalit&#233;s d&#8217;application de cette interdiction sont fix&#233;es par d&#233;cret.&#160;&#187;</p>",
    "exposeSommaire": "<p style=\"text-align: justify;\">La France s&#8217;est depuis longtemps, et plus fortement encore au cours des derni&#232;res ann&#233;es, distingu&#233;e par le choix de politiques environnementales ambitieuses et innovantes. Ce r&#244;le et cette place n&#8217;ont fait que s&#8217;accro&#238;tre avec la signature le 22 avril 2016 des accords de Paris dont les &#201;tats-Unis ont malheureusement choisi de se retirer.&#160;</p><p style=\"text-align: justify;\">C&#8217;est dans cette d&#233;marche qu&#8217;a &#233;t&#233; adopt&#233;e en 2015 la loi de transition &#233;nerg&#233;tique pour la croissance verte laquelle est venue offrir un cadre juridique, attendu depuis des ann&#233;es, aux fins notamment de parvenir &#224; la r&#233;duction substantielle de nos d&#233;chets m&#233;nagers &#224; horizon 2020.&#160;</p><p style=\"text-align: justify;\">C&#8217;est ainsi que la fin de la distribution des sacs plastiques en caisse et la limitation de la mise &#224; disposition de gobelets, verres et assiettes jetables en mati&#232;re plastique &#224; compter du 1<sup>er</sup> janvier 2020 vont permettre d&#8217;endiguer durablement les impacts environnementaux qu&#8217;occasionnaient pr&#233;c&#233;demment ces d&#233;chets.&#160;</p><p style=\"text-align: justify;\">Avec une part &#224; peu pr&#232;s constante de 518 kilogrammes de d&#233;chets municipaux par habitant, la France n&#8217;a cess&#233; d&#8217;accroitre au cours des dix derni&#232;res ann&#233;es le taux de recyclage de ses d&#233;chets lequel avoisine d&#233;sormais les 50&#160;%.&#160;</p><p style=\"text-align: justify;\">Il appartient toutefois de souligner que la France accuse un retard certain en la mati&#232;re au niveau europ&#233;en en comparaison de pays comme l&#8217;Allemagne, l&#8217;Autriche, la Slov&#233;nie ou la Belgique qui se sont inscrits depuis de nombreuses ann&#233;es dans des politiques d&#8217;&#233;conomie de ressources et de r&#233;utilisation des d&#233;chets.&#160;</p><p style=\"text-align: justify;\">Parce que notre plan&#232;te ne peut plus &#234;tre l&#8217;otage de production irraisonn&#233;e quelle qu&#8217;en soit la nature, il revient &#224; chacun d&#8217;entre nous, &#224; commencer par le l&#233;gislateur, de veiller scrupuleusement &#224; l&#8217;emploi superf&#233;tatoire de ressources.&#160;</p><p style=\"text-align: justify;\">Il en est notamment ainsi des tickets de carte bancaire, non vis&#233;s par les dispositions de l&#8217;article L 514&#8209;10&#8209;5 du Code de l&#8217;environnement, dont l&#8217;impact environnemental fort n&#8217;est malheureusement plus &#224; d&#233;montrer.</p>",
    "cartoucheDelaiDepotDepasse": "Sous réserve de son traitement par les services de l'Assemblée nationale et de sa recevabilité"
  },
  "representations": [
    {
      "nom": "PDF",
      "typeMime": {
        "type": "application",
        "subType": "PDF"
      },
      "statutRepresentation": {
        "verbatim": true,
        "canonique": true,
        "officielle": true,
        "transcription": false,
        "enregistrement": false
      },
      "contenu": {
        "documentURI": "/15/amendements/2274/CION-DVP/CD112.pdf"
      }
    }
  ],
  "dateDepot": "2019-11-14T01:00:00.000+01:00",
  "article99": "0",
  "loiReference": {
    "codeLoi": "c environnement",
    "divisionCodeLoi": "L541-15-9"
  }
}