{
  "uid": "AMANR5L15PO419610B0627P0D1N179",
  "identifiant": {
    "legislature": "15",
    "numero": "179",
    "numRect": "0",
    "saisine": {
      "texteLegislatifRef": "PRJLANR5L15B0627",
      "numeroPartiePLF": "0",
      "organeExamen": "PO419610",
      "mentionSecondeDeliberation": "0"
    }
  },
  "numeroLong": "CE179",
  "etapeTexte": "1ère lecture (1ère assemblée saisie)",
  "triAmendement": "bee",
  "cardinaliteAmdtMultiples": "1",
  "etat": "Discuté",
  "signataires": {
    "auteur": {
      "typeAuteur": "Depute",
      "acteurRef": "PA605518",
      "groupePolitiqueRef": "PO730964"
    },
    "cosignatairesRefs": [
      "PA607619",
      "PA721946",
      "PA605518"
    ],
    "texteAffichable": "M.&#160;Fran&#231;ois-Michel&#160;Lambert,  M.&#160;Molac et M.&#160;Marilossian"
  },
  "pointeurFragmentTexte": {
    "division": {
      "titre": "Article 17",
      "articleDesignationCourte": "APRÈS ART. 17",
      "type": "ARTICLE",
      "avantAApres": "Apres",
      "divisionRattachee": "APRÈS L'ARTICLE 17, insérer l'article suivant:",
      "articleAdditionnel": "1",
      "urlDivisionTexteVise": "/15/textes/0627.asp#D_Article_17"
    }
  },
  "corps": {
    "dispositif": "<p>I.&#160;&#8211;&#160;L&#8217;article&#160;1619 du code g&#233;n&#233;ral des imp&#244;ts est abroge&#769;.</p><p>II.&#160;&#8211;&#160;&#192; la premi&#232;re phrase du premier alin&#233;a du II de l&#8217;article&#160;1613&#160;<i>ter</i> du code g&#233;n&#233;ral des imp&#244;ts, le montant&#160;: &#171;&#160;7,53&#160;&#187; est remplac&#233; par le montant&#160;: &#171;&#160;21,47&#160;&#187;.</p><p>III.&#160;&#8211;&#160;La perte de recettes pour l&#8217;&#201;tat r&#233;sultant du I est compens&#233;e par l&#8217;augmentation, pr&#233;vue au II du pr&#233;sent article, du montant de la contribution mentionn&#233;e a&#768; l&#8217;article&#160;1613&#160;<i>ter</i> du code g&#233;n&#233;ral des imp&#244;ts.</p><p>IV.&#160;&#8211;&#160;Le pr&#233;sent article entre en vigueur le 1<sup>er</sup> janvier 2019.</p>",
    "exposeSommaire": "<p style=\"text-align: justify;\">Cet amendement vise a&#768; supprimer la taxe sur les c&#233;r&#233;ales, conform&#233;ment a&#768; la proposition n&#176; 3 de la mission d&#8217;information sur la taxation des produits agroalimentaires, dont le rapport a e&#769;te&#769; approuve&#769; par la commission des finances de l&#8217;Assembl&#233;e nationale le 22 juin 2016.</p><p style=\"text-align: justify;\">En effet, cette taxe p&#232;se inutilement sur ces productions agricoles, tout en se caract&#233;risant par des modalit&#233;s de liquidation dat&#233;es (crit&#232;res de r&#233;faction en fonction du taux d&#8217;humidit&#233;&#769; et des impuret&#233;s, par exemple) et par un rendement faible.</p><p style=\"text-align: justify;\">La modernisation et la simplification de notre fiscalit&#233;&#769; agroalimentaire implique donc la suppression de cette taxe inefficace.&#160;Afin de compenser la perte de recettes, nous proposons comme l&#8217;indique le rapport nomme&#769; ci-dessus, l&#8217;augmentation de la contribution sur les boissons sucr&#233;es. Poursuivant ainsi un objectif de sante&#769; publique, cette augmentation de la contribution permet le d&#233;gagement de recette fiscale stabilisant l&#8217;&#233;quilibre budg&#233;taire.</p>"
  },
  "representations": [
    {
      "nom": "PDF",
      "typeMime": {
        "type": "application",
        "subType": "PDF"
      },
      "statutRepresentation": {
        "verbatim": true,
        "canonique": true,
        "officielle": true,
        "transcription": false,
        "enregistrement": false
      },
      "contenu": {
        "documentURI": "/15/amendements/0627/CION-ECO/CE179.pdf"
      }
    }
  ],
  "sort": {
    "dateSaisie": "2018-04-20T19:19:10.000+02:00",
    "sortEnSeance": "Non soutenu"
  },
  "dateDepot": "2018-04-03T02:00:00.000+02:00",
  "dateDistribution": "2018-04-17T02:00:00.000+02:00",
  "article99": "0",
  "loiReference": {
    "codeLoi": "impôts",
    "divisionCodeLoi": "1619"
  }
}