{
  "uid": "AMANR5L15PO59051B1083P0D1N16",
  "identifiant": {
    "legislature": "15",
    "numero": "16",
    "numRect": "0",
    "saisine": {
      "texteLegislatifRef": "PIONANR5L15B1083",
      "numeroPartiePLF": "0",
      "organeExamen": "PO59051",
      "mentionSecondeDeliberation": "0"
    }
  },
  "numeroLong": "CL16",
  "etapeTexte": "1ère lecture (2ème assemblée saisie)",
  "triAmendement": "b",
  "cardinaliteAmdtMultiples": "1",
  "etat": "Discuté",
  "signataires": {
    "auteur": {
      "typeAuteur": "Depute",
      "acteurRef": "PA330240",
      "groupePolitiqueRef": "PO730934"
    },
    "cosignatairesRefs": [
      "PA607090",
      "PA719272",
      "PA267785",
      "PA267527",
      "PA720684",
      "PA334654",
      "PA721314",
      "PA330684",
      "PA718850",
      "PA334843",
      "PA267735",
      "PA608016",
      "PA721968",
      "PA718780",
      "PA720386",
      "PA330788",
      "PA608416",
      "PA330240"
    ],
    "texteAffichable": "M.&#160;Ciotti,  M.&#160;Reyn&#232;s, Mme&#160;Trastour-Isnart, M.&#160;Jean-Pierre&#160;Vigier, Mme&#160;Meunier, M.&#160;Cordier, M.&#160;de Ganay, M.&#160;Pierre-Henri&#160;Dumont, M.&#160;Hetzel, M.&#160;Larriv&#233;, Mme&#160;Val&#233;rie&#160;Boyer, M.&#160;Straumann, Mme&#160;Louwagie, M.&#160;Schellenberger, M.&#160;Di Filippo, M.&#160;Vialay, M.&#160;Verch&#232;re et M.&#160;Saddier"
  },
  "pointeurFragmentTexte": {
    "division": {
      "titre": "Article PREMIER",
      "articleDesignationCourte": "ART. PREMIER",
      "type": "ARTICLE",
      "avantAApres": "A",
      "divisionRattachee": "ARTICLE PREMIER",
      "urlDivisionTexteVise": "/15/textes/1083.asp#D_Article_1er"
    },
    "alinea": {
      "numero": "1"
    }
  },
  "corps": {
    "dispositif": "<p style=\"text-align: justify;\">&#192; l&#8217;alin&#233;a&#160;1, apr&#232;s le mot&#160;:</p><p style=\"text-align: justify;\">&#171;&#160;physique&#160;&#187;,</p><p style=\"text-align: justify;\">ins&#233;rer les mots&#160;:</p><p style=\"text-align: justify;\">&#171;&#160;ou celle d&#8217;un tiers&#160;&#187;.</p>",
    "exposeSommaire": "<p>L'article 1er pr&#233;voit que les sapeurs&#8209;pompiers peuvent proc&#233;der, au moyen de cam&#233;ras individuelles, &#224; un enregistrement audiovisuel de leurs interventions lorsque se produit ou est susceptible de se produire un incident de nature &#224; mettre en p&#233;ril leur int&#233;grit&#233; physique.</p><p>Le pr&#233;sent amendement propose d'&#233;tendre le champ du dispositif en pr&#233;voyant que l'enregistrement peut &#233;galement avoir lieu lorsque l'int&#233;grit&#233; physique d'un tiers est en p&#233;ril.</p>"
  },
  "representations": [
    {
      "nom": "PDF",
      "typeMime": {
        "type": "application",
        "subType": "PDF"
      },
      "statutRepresentation": {
        "verbatim": true,
        "canonique": true,
        "officielle": true,
        "transcription": false,
        "enregistrement": false
      },
      "contenu": {
        "documentURI": "/15/amendements/1083/CION_LOIS/CL16.pdf"
      }
    }
  ],
  "sort": {
    "dateSaisie": "2018-07-24T11:58:52.000+02:00",
    "sortEnSeance": "Non soutenu"
  },
  "dateDepot": "2018-07-19T02:00:00.000+02:00",
  "dateDistribution": "2018-07-20T02:00:00.000+02:00",
  "article99": "0",
  "loiReference": {
    "codeLoi": "1"
  }
}