{
  "uid": "AMANR5L15PO419865B1393P0D1N241",
  "identifiant": {
    "legislature": "15",
    "numero": "241",
    "numRect": "0",
    "saisine": {
      "texteLegislatifRef": "PIONANR5L15B1393",
      "numeroPartiePLF": "0",
      "organeExamen": "PO419865",
      "mentionSecondeDeliberation": "0"
    }
  },
  "numeroLong": "CD241",
  "etapeTexte": "1ère lecture (2ème assemblée saisie)",
  "triAmendement": "diaaaaaaaaaaaaaaaaaaaaaaaaaaaaaaaaaaaaaaaaaaaaaaaaoiyrvx",
  "cardinaliteAmdtMultiples": "1",
  "etat": "Discuté",
  "signataires": {
    "auteur": {
      "typeAuteur": "Depute",
      "acteurRef": "PA342415",
      "groupePolitiqueRef": "PO758835"
    },
    "cosignatairesRefs": [
      "PA1008",
      "PA608172",
      "PA342415",
      "PA608741",
      "PA610681",
      "PA719930",
      "PA1198",
      "PA333818",
      "PA267233",
      "PA608695",
      "PA720988",
      "PA335532",
      "PA332614",
      "PA643145",
      "PA340357",
      "PA1592",
      "PA429893",
      "PA508",
      "PA335054",
      "PA333285",
      "PA340343",
      "PA337483",
      "PA609590",
      "PA605069",
      "PA607553",
      "PA608011",
      "PA1809",
      "PA642764",
      "PA609332"
    ],
    "texteAffichable": "Mme&#160;Battistel,  Mme&#160;Pires Beaune, M.&#160;Garot, M.&#160;Bouillon, M.&#160;Aviragnet, Mme&#160;Bareigts, Mme&#160;Bi&#233;mouret, M.&#160;Jean-Louis&#160;Bricout, M.&#160;Carvounas, M.&#160;Alain&#160;David, Mme&#160;Laurence&#160;Dumont, M.&#160;Faure, M.&#160;David&#160;Habib, M.&#160;Hutin, M.&#160;Juanico, Mme&#160;Karamanli, M.&#160;J&#233;r&#244;me&#160;Lambert, M.&#160;Letchimy, Mme&#160;Manin, Mme&#160;Pau-Langevin, M.&#160;Potier, M.&#160;Pueyo, Mme&#160;Rabault, M.&#160;Saulignac, Mme&#160;Tolmont, Mme&#160;Untermaier, Mme&#160;Vainqueur-Christophe, M.&#160;Vallaud et Mme&#160;Victory"
  },
  "pointeurFragmentTexte": {
    "division": {
      "titre": "Article 5",
      "articleDesignationCourte": "ART. 5",
      "type": "ARTICLE",
      "avantAApres": "A",
      "divisionRattachee": "ARTICLE 5",
      "urlDivisionTexteVise": "/15/textes/1393.asp#D_Article_5"
    },
    "alinea": {
      "avantAApres": "A",
      "numero": "5",
      "alineaDesignation": "Alinéa 5"
    }
  },
  "corps": {
    "dispositif": "<p style=\"text-align: justify;\">&#192; la premi&#232;re phrase de l&#8217;alin&#233;a&#160;5, apr&#232;s le mot&#160;:</p><p style=\"text-align: justify;\">&#171;&#160;groupements&#160;&#187;,</p><p style=\"text-align: justify;\">ins&#233;rer les mots&#160;:</p><p style=\"text-align: justify;\">&#171;&#160;situ&#233;s dans le d&#233;partement, les d&#233;put&#233;s et s&#233;nateurs &#233;lus dans le d&#233;partement&#160;&#187;.</p>",
    "exposeSommaire": "<p style=\"text-align: justify;\">Cet amendement des d&#233;put&#233;s socialistes et apparent&#233;s vise &#224; permettre aux parlementaires &#233;lus dans le d&#233;partement de participer aux r&#233;unions des comit&#233;s de coh&#233;sion territoriale d&#233;partementaux. Cette pr&#233;sence leur donnera notamment acc&#232;s &#224; une information r&#233;guli&#232;re sur les demandes adress&#233;es au pr&#233;fet de d&#233;partement et sur les projets soutenus.</p>"
  },
  "representations": [
    {
      "nom": "PDF",
      "typeMime": {
        "type": "application",
        "subType": "PDF"
      },
      "statutRepresentation": {
        "verbatim": true,
        "canonique": true,
        "officielle": true,
        "transcription": false,
        "enregistrement": false
      },
      "contenu": {
        "documentURI": "/15/amendements/1393/CION-DVP/CD241.pdf"
      }
    }
  ],
  "sort": {
    "dateSaisie": "2019-02-06T10:18:29.000+01:00",
    "sortEnSeance": "Tombé"
  },
  "dateDepot": "2019-01-31T01:00:00.000+01:00",
  "dateDistribution": "2019-02-04T01:00:00.000+01:00",
  "article99": "0",
  "loiReference": {
    "codeLoi": "1"
  }
}