{
  "uid": "AMANR5L15PO419610B0627P0D1N2137",
  "identifiant": {
    "legislature": "15",
    "numero": "2137",
    "numRect": "0",
    "saisine": {
      "texteLegislatifRef": "PRJLANR5L15B0627",
      "numeroPartiePLF": "0",
      "organeExamen": "PO419610",
      "mentionSecondeDeliberation": "0"
    }
  },
  "numeroLong": "CE2137",
  "etapeTexte": "1ère lecture (1ère assemblée saisie)",
  "triAmendement": "abm",
  "cardinaliteAmdtMultiples": "1",
  "amendementParent": "AMANR5L15PO419610B0627P0D1N2091",
  "etat": "Discuté",
  "signataires": {
    "auteur": {
      "typeAuteur": "Depute",
      "acteurRef": "PA720162",
      "groupePolitiqueRef": "PO730970"
    },
    "cosignatairesRefs": [
      "PA720976",
      "PA720162",
      "PA719938",
      "PA722162",
      "PA720092",
      "PA719504",
      "PA720598"
    ],
    "texteAffichable": "M.&#160;Bolo,  M.&#160;Turquois, M.&#160;Ramos, Mme&#160;Deprez-Audebert, M.&#160;Lagleize, M.&#160;Mathiasin et M.&#160;Fesneau"
  },
  "pointeurFragmentTexte": {
    "division": {
      "titre": "Article 11",
      "articleDesignationCourte": "ART. 11",
      "type": "ARTICLE",
      "avantAApres": "A",
      "divisionRattachee": "ARTICLE 11",
      "urlDivisionTexteVise": "/15/textes/0627.asp#D_Article_11"
    }
  },
  "corps": {
    "dispositif": "<p>R&#233;diger ainsi l'alin&#233;a 13:&#160;</p><p>\"- Le pourcentage des &#233;l&#233;ments d&#8217;un repas devant &#234;tre compos&#233;<span class=\"del cts-1\"  data-cid=\"2\" data-userid=\"2003\" data-username=\"Kevin Thuillier\" data-time=\"1524074379197\">s</span> de produits mentionn&#233;s au I. Ce pourcentage ne saurait &#234;tre sup&#233;rieur &#224; 50% pour les produits provenant de l&#8217;agriculture biologique et les produits issus de l'approvisionnement en&#160;circuits courts et &#224; 20% pour les produits provenant d&#8217;exploitations en conversion.\"</p>",
    "exposeSommaire": "<p>Ce sous-amendement vise &#224; rendre effective l&#8217;int&#233;gration de produits issus de l&#8217;agriculture biologique ou en conversion dans les repas scolaires; dans le respect d&#8217;un double objectif de soutien &#233;conomique &#224; la fili&#232;re de l&#8217;agriculture biologique et de diversification de la qualit&#233; des repas. Il substitue &#224; cette fin la notion &#171; d&#8217;&#233;l&#233;ments &#187; d&#8217;un repas &#224; celle de &#171; valeur totale &#187; des repas.</p><p>La r&#233;daction initiale vise en effet la valeur totale des repas sans pr&#233;ciser la d&#233;finition exacte de cette valeur ; notamment si son assiette &#233;tait celle de la valeur totale de chaque repas ou de la valeur totale annuelle de ceux-ci. Plus encore, cette situation serait &#224; m&#234;me de produire une constitution de repas respectant les obligations l&#233;gales du seul fait de l&#8217;achat de quelques &#233;l&#233;ments on&#233;reux en contradiction avec l&#8217;esprit initial.</p><p>Une hypoth&#232;se de r&#233;daction qui viserait un pourcentage de repas serait quant &#224; elle tr&#232;s difficile &#224; mettre en &#339;uvre en ce qu&#8217;elle suppose des repas enti&#232;rement compos&#233;s de produits issus de l&#8217;agriculture biologique ou en conversion.</p><p>Partant de ce constat, reste la possibilit&#233; de viser un pourcentage d&#8217;&#233;l&#233;ments d&#8217;un repas. Cette solution a pour avantage de multiplier l&#8217;occurrence des produits issus de l&#8217;agriculture biologique ou en conversion &#224; chaque repas tout en proposant un syst&#232;me souple pour les collectivit&#233;s ; adapt&#233; aux particularismes &#233;conomiques et culturels locaux et respectueux de leur libre administration.</p><p>Ce sous-amendement vise par ailleurs &#224; int&#233;grer aux obligations d&#8217;int&#233;gration aux repas scolaires la notion de produits issus de &#171; circuits courts &#187; en vue de soutenir un partage de la valeur ajout&#233;e plus favorable &#224; l&#8217;exploitant agricole par la r&#233;duction des interm&#233;diaires</p>"
  },
  "representations": [
    {
      "nom": "PDF",
      "typeMime": {
        "type": "application",
        "subType": "PDF"
      },
      "statutRepresentation": {
        "verbatim": true,
        "canonique": true,
        "officielle": true,
        "transcription": false,
        "enregistrement": false
      },
      "contenu": {
        "documentURI": "/15/amendements/0627/CION-ECO/CE2137.pdf"
      }
    }
  ],
  "sort": {
    "dateSaisie": "2018-04-19T11:05:40.000+02:00",
    "sortEnSeance": "Rejeté"
  },
  "dateDepot": "2018-04-18T02:00:00.000+02:00",
  "dateDistribution": "2018-04-18T02:00:00.000+02:00",
  "article99": "0",
  "loiReference": {}
}