{
  "uid": "AMANR5L15SEA717460BTC2243P0D1N1566",
  "identifiant": {
    "legislature": "15",
    "numero": "1566",
    "numRect": "0",
    "saisine": {
      "texteLegislatifRef": "PRJLANR5L15BTC2243",
      "numeroPartiePLF": "0",
      "organeExamen": "PO717460",
      "mentionSecondeDeliberation": "0"
    }
  },
  "numeroLong": "1566",
  "etapeTexte": "1ère lecture (1ère assemblée saisie)",
  "triAmendement": "acaaaaaaaaaaaaaaaaaaaaaaaaaaaaaaaaaaaaaaaaaaaaaaaahchd",
  "cardinaliteAmdtMultiples": "1",
  "etat": "Discuté",
  "signataires": {
    "auteur": {
      "typeAuteur": "Depute",
      "acteurRef": "PA720568",
      "groupePolitiqueRef": "PO723569"
    },
    "cosignatairesRefs": [
      "PA720664",
      "PA721046",
      "PA720568",
      "PA1838"
    ],
    "texteAffichable": "Mme&#160;Thill,  M.&#160;Lassalle, M.&#160;Evrard et Mme&#160;Bassire"
  },
  "pointeurFragmentTexte": {
    "division": {
      "titre": "Article PREMIER",
      "articleDesignationCourte": "ART. PREMIER",
      "type": "ARTICLE",
      "avantAApres": "A",
      "divisionRattachee": "ARTICLE PREMIER",
      "urlDivisionTexteVise": "/15/textes/2243.asp#D_Article_1er"
    },
    "alinea": {
      "numero": "30"
    }
  },
  "corps": {
    "dispositif": "<p style=\"text-align: justify;\">Apr&#232;s le mot&#160;:</p><p style=\"text-align: justify;\">&#171;&#160;d&#233;bouter&#160;&#187;,</p><p style=\"text-align: justify;\">r&#233;diger ainsi la fin de la seconde phrase de l&#8217;alin&#233;a&#160;30&#160;:</p><p style=\"text-align: justify;\">&#171;&#160;les personnes &#233;ligibles &#224; l&#8217;assistance m&#233;dicale &#224; la procr&#233;ation selon les nouvelles modalit&#233;s.&#160;&#187;</p>",
    "exposeSommaire": "<p style=\"text-align: justify;\">En l&#8217;absence de pr&#233;cision du dernier terme mentionn&#233; &#171;&#160;identit&#233; de genre&#160;&#187; qui, ainsi r&#233;dig&#233; n&#8217;a aucun sens juridique, il conviendrait de pr&#233;ciser l&#8217;&#233;tat civil &#233;ligible.</p><p style=\"text-align: justify;\">Il est pr&#233;f&#233;rable de ne pas cat&#233;goriser davantage toutes les personnes &#233;ligibles &#224; la PMA.&#160;</p><p style=\"text-align: justify;\">En effet, c&#8217;est pour un corps social que le l&#233;gislateur doit l&#233;gif&#233;rer, &#224; d&#233;faut, il ouvre la porte aux diff&#233;rents communautarismes.</p>"
  },
  "representations": [
    {
      "nom": "PDF",
      "typeMime": {
        "type": "application",
        "subType": "PDF"
      },
      "statutRepresentation": {
        "verbatim": true,
        "canonique": true,
        "officielle": true,
        "transcription": false,
        "enregistrement": false
      },
      "contenu": {
        "documentURI": "/15/amendements/2243/AN/1566.pdf"
      }
    }
  ],
  "seanceDiscussion": "RUANR5L15S2019IDS21832",
  "sort": {
    "dateSaisie": "2019-09-27T09:57:10.000+02:00",
    "sortEnSeance": "Retiré"
  },
  "dateDepot": "2019-09-19T02:00:00.000+02:00",
  "dateDistribution": "2019-09-23T02:00:00.000+02:00",
  "article99": "0",
  "loiReference": {}
}