{
  "uid": "AMANR5L15PO419865B1831P0D1N1696",
  "identifiant": {
    "legislature": "15",
    "numero": "1696",
    "numRect": "0",
    "saisine": {
      "texteLegislatifRef": "PRJLANR5L15B1831",
      "numeroPartiePLF": "0",
      "organeExamen": "PO419865",
      "mentionSecondeDeliberation": "0"
    }
  },
  "numeroLong": "CD1696",
  "etapeTexte": "1ère lecture (2ème assemblée saisie)",
  "triAmendement": "araaaaaaaaaaaaaaaaaaaaaaaaaaaaaaaaaaaaaaaaaaaaaaaaeibbds",
  "cardinaliteAmdtMultiples": "1",
  "etat": "Discuté",
  "signataires": {
    "auteur": {
      "typeAuteur": "Depute",
      "acteurRef": "PA721054",
      "groupePolitiqueRef": "PO730934"
    },
    "cosignatairesRefs": [
      "PA721054"
    ],
    "texteAffichable": "M.&#160;Lorion"
  },
  "pointeurFragmentTexte": {
    "division": {
      "titre": "Article 5",
      "articleDesignationCourte": "ART. 5",
      "type": "ARTICLE",
      "avantAApres": "A",
      "divisionRattachee": "ARTICLE 5",
      "urlDivisionTexteVise": "/15/textes/1831.asp#D_Article_5"
    },
    "alinea": {
      "numero": "5"
    }
  },
  "corps": {
    "dispositif": "<p style=\"text-align: justify;\">1&#176; L&#8217;alin&#233;a 5 est compl&#233;t&#233; par la phrase : </p><p style=\"text-align: justify;\">&#171; Il participe &#224; la diminution des &#233;missions de gaz &#224; effet de serre li&#233;es au secteur des transports dans le territoire, selon une trajectoire coh&#233;rente avec les engagements climatiques de la France &#187;.</p><p style=\"text-align: justify;\">2&#176; En cons&#233;quence, les alin&#233;as 11 et 12 sont supprim&#233;s.<br /><br /></p>",
    "exposeSommaire": "<p>Le pr&#233;sent amendement propose de mieux mettre en &#233;vidence l&#8217;objectif donn&#233; aux plans de mobilit&#233; de participer &#224; la diminution des &#233;missions de gaz &#224; effet de serre, en en faisant &#233;tat d&#232;s l&#8217;article L. 1214&#8208;1 du code des transports.<br />De cette mani&#232;re, la participation &#224; cette diminution devient un principe g&#233;n&#233;ral des plans de mobilit&#233;, que l&#8217;ensemble des objectifs cibl&#233;s &#224; l&#8217;article L. 1214&#8208;2 doivent permettre d&#8217;atteindre.</p>"
  },
  "representations": [
    {
      "nom": "PDF",
      "typeMime": {
        "type": "application",
        "subType": "PDF"
      },
      "statutRepresentation": {
        "verbatim": true,
        "canonique": true,
        "officielle": true,
        "transcription": false,
        "enregistrement": false
      },
      "contenu": {
        "documentURI": "/15/amendements/1831/CION-DVP/CD1696.pdf"
      }
    }
  ],
  "sort": {
    "dateSaisie": "2019-05-16T16:15:02.000+02:00",
    "sortEnSeance": "Non soutenu"
  },
  "dateDepot": "2019-05-09T02:00:00.000+02:00",
  "dateDistribution": "2019-05-14T02:00:00.000+02:00",
  "article99": "0",
  "loiReference": {}
}