{
  "uid": "AMANR5L15PO59048B1490P0D1N618",
  "identifiant": {
    "legislature": "15",
    "numero": "618",
    "numRect": "0",
    "saisine": {
      "texteLegislatifRef": "PRJLANR5L15B1490",
      "numeroPartiePLF": "0",
      "organeExamen": "PO59048",
      "mentionSecondeDeliberation": "0"
    }
  },
  "numeroLong": "CF618",
  "etapeTexte": "Nouvelle Lecture",
  "triAmendement": "bikaaaaaaaaaaaaaaaaaaaaaaaaaaaaaaaaaaaaaaaaaaaaaaam",
  "cardinaliteAmdtMultiples": "1",
  "etat": "Retiré",
  "signataires": {
    "auteur": {
      "typeAuteur": "Depute",
      "acteurRef": "PA608172",
      "groupePolitiqueRef": "PO758835"
    },
    "cosignatairesRefs": [
      "PA1008",
      "PA335532",
      "PA610681",
      "PA340343",
      "PA333285",
      "PA1809",
      "PA609590",
      "PA332614",
      "PA608011",
      "PA608695",
      "PA643145",
      "PA608741",
      "PA609332",
      "PA508",
      "PA333818",
      "PA608172",
      "PA607553",
      "PA342415",
      "PA642764",
      "PA1592",
      "PA340357",
      "PA335054",
      "PA605069",
      "PA719930",
      "PA429893",
      "PA267233",
      "PA720988",
      "PA337483",
      "PA1198"
    ],
    "texteAffichable": "Mme&#160;Pires Beaune,  M.&#160;Jean-Louis&#160;Bricout, Mme&#160;Rabault, M.&#160;Aviragnet, Mme&#160;Bareigts, Mme&#160;Battistel, Mme&#160;Bi&#233;mouret, M.&#160;Bouillon, M.&#160;Carvounas, M.&#160;Alain&#160;David, Mme&#160;Laurence&#160;Dumont, M.&#160;Faure, M.&#160;Garot, M.&#160;David&#160;Habib, M.&#160;Hutin, M.&#160;Juanico, Mme&#160;Karamanli, M.&#160;J&#233;r&#244;me&#160;Lambert, M.&#160;Letchimy, Mme&#160;Manin, Mme&#160;Pau-Langevin, M.&#160;Potier, M.&#160;Pueyo, M.&#160;Saulignac, Mme&#160;Tolmont, Mme&#160;Untermaier, Mme&#160;Vainqueur-Christophe, M.&#160;Vallaud et Mme&#160;Victory"
  },
  "pointeurFragmentTexte": {
    "division": {
      "titre": "Article 17 quater",
      "articleDesignationCourte": "ART. 17 QUATER",
      "type": "ARTICLE",
      "avantAApres": "A",
      "divisionRattachee": "ARTICLE 17 QUATER",
      "urlDivisionTexteVise": "/15/textes/1490.asp#D_Article_17_quater"
    }
  },
  "corps": {
    "dispositif": "<p>Supprimer cet article.</p>",
    "exposeSommaire": "<p>Cet amendement du groupe Socialistes et apparent&#233;s vise &#224; supprimer l'article 17 quater, ins&#233;r&#233; au S&#233;nat, qui inclut le spectacle sportif dans le champ du r&#233;gime fiscal du m&#233;c&#233;nat.</p><p>Les d&#233;put&#233;s socialistes et apparent&#233;s ne sont pas n&#233;cessairement oppos&#233;s &#224; ce dispositif, mais ils consid&#232;rent qu'il est pr&#233;matur&#233; de modifier ce r&#233;gime fiscal alors que la Cour des comptes vient de publier un rapport sur le m&#233;c&#233;nat et qu'aucun groupe de travail parlementaire n'a encore rendu de conclusions sur ce sujet.</p>"
  },
  "representations": [
    {
      "nom": "PDF",
      "typeMime": {
        "type": "application",
        "subType": "PDF"
      },
      "statutRepresentation": {
        "verbatim": true,
        "canonique": true,
        "officielle": true,
        "transcription": false,
        "enregistrement": false
      },
      "contenu": {
        "documentURI": "/15/amendements/1490/CION_FIN/CF618.pdf"
      }
    }
  ],
  "dateDepot": "2018-12-13T01:00:00.000+01:00",
  "dateDistribution": "2018-12-14T01:00:00.000+01:00",
  "article99": "0",
  "loiReference": {}
}