{
  "uid": "AMANR5L15SEA717460BTC1974P0D1N983",
  "identifiant": {
    "legislature": "15",
    "numero": "983",
    "numRect": "0",
    "saisine": {
      "texteLegislatifRef": "PRJLANR5L15BTC1974",
      "numeroPartiePLF": "0",
      "organeExamen": "PO717460",
      "mentionSecondeDeliberation": "0"
    }
  },
  "numeroLong": "983",
  "etapeTexte": "1ère lecture (2ème assemblée saisie)",
  "triAmendement": "hiaaaoaaaaaaaaaaaaaaaaaaaaaaaaaaaaaaaaaaaaaaaaaaaahzzzzzzzzzzzzzzzzzzzzzzzzzzzzzzzzzzzzzyw",
  "cardinaliteAmdtMultiples": "1",
  "etat": "Discuté",
  "signataires": {
    "auteur": {
      "typeAuteur": "Depute",
      "acteurRef": "PA722000",
      "groupePolitiqueRef": "PO730964"
    },
    "cosignatairesRefs": [
      "PA722000",
      "PA720520",
      "PA718710",
      "PA720190",
      "PA607155",
      "PA720854",
      "PA722134",
      "PA721600",
      "PA722008",
      "PA718768",
      "PA720538",
      "PA719230",
      "PA722336",
      "PA720054",
      "PA606639",
      "PA718910"
    ],
    "texteAffichable": "M.&#160;Buchou,  M.&#160;Sorre, Mme&#160;Pascale&#160;Boyer, M.&#160;Test&#233;, M.&#160;Vignal, Mme&#160;Leguille-Balloy, M.&#160;Fi&#233;vet, Mme&#160;Rossi, M.&#160;Haury, Mme&#160;Pitollat, Mme&#160;De Temmerman, M.&#160;Kerlogot, Mme&#160;Valetta Ardisson, M.&#160;Daniel, M.&#160;Thi&#233;baut et Mme&#160;Cattelot"
  },
  "pointeurFragmentTexte": {
    "division": {
      "titre": "RAPPORT ANNEXÉ",
      "articleDesignationCourte": "ART. 1ER A",
      "type": "ANNEXE",
      "avantAApres": "A",
      "divisionRattachee": "ARTICLE 1ER A",
      "urlDivisionTexteVise": "/15/textes/1974.asp#D_RAPPORT_ANNEXE"
    },
    "alinea": {
      "avantAApres": "Apres",
      "numero": "39"
    }
  },
  "corps": {
    "dispositif": "<p style=\"text-align: justify;\">Apr&#232;s l&#8217;alin&#233;a&#160;39, ins&#233;rer l&#8217;alin&#233;a suivant&#160;:</p><p style=\"text-align: justify;\">&#171;&#160;L&#8217;&#201;tat finance une exp&#233;rimentation d&#8217;une ou plusieurs lignes de trains de nuit avec une haute qualit&#233; de service de bout en bout, jusqu&#8217;en gare, incluant un effort de promotion, des horaires optimis&#233;s, un service douches et une vari&#233;t&#233; de conforts pour tous, avec des si&#232;ges inclinables, des couchettes et une offre premium de type voiture-lit.&#160;&#187;</p>",
    "exposeSommaire": "<p style=\"text-align: justify;\">Actuellement la qualit&#233; de service est insuffisante sur les trains de nuit. Si l&#8217;on y met les moyens, la fr&#233;quentation sera au rendez-vous car il existe une demande croissante en France et en Europe pour des mobilit&#233;s longue distance peu &#233;nergivores. Il faut une qualit&#233; globale, m&#234;me en gare. Aujourd&#8217;hui de nombreuses gares, dont le terminus Paris-Austerlitz, n&#8217;offrent plus de douche, quand ailleurs en Europe il y a des douches m&#234;me dans les trains. Sur les deux lignes maintenues, les horaires sont d&#233;grad&#233;s, avec par exemple une arriv&#233;e trop t&#244;t &#224; Toulouse et trop tard &#224; Perpignan.</p><p style=\"text-align: justify;\">Les trains de nuit &#224; l&#8217;&#233;tranger disposent souvent d&#8217;au moins 4 niveaux de confort. En France le service SNCF risque de perdre les si&#232;ges inclinables qui sont pourtant appr&#233;ci&#233;s pour les &#171;&#160;petits prix&#160;&#187;. L&#8217;offre premium est aussi d&#233;sesp&#233;r&#233;ment absente, alors qu&#8217;elle permettrait de faire monter la classe affaire dans le train.</p><p style=\"text-align: justify;\">La France prend du retard pour cette mobilit&#233; pourtant cl&#233; pour l&#8217;am&#233;nagement du territoire et pour le climat. Une exp&#233;rimentation &#224; haut niveau de service est n&#233;cessaire pour &#233;valuer le potentiel r&#233;el de cette mobilit&#233; innovante.</p><p style=\"text-align: justify;\">L&#8217;Annexe I de la loi pr&#233;voit une augmentation des budgets pour les transports. Une partie de cette augmentation gagnera donc &#224; &#234;tre fl&#233;ch&#233;e pour financer cette exp&#233;rimentation.</p>"
  },
  "representations": [
    {
      "nom": "PDF",
      "typeMime": {
        "type": "application",
        "subType": "PDF"
      },
      "statutRepresentation": {
        "verbatim": true,
        "canonique": true,
        "officielle": true,
        "transcription": false,
        "enregistrement": false
      },
      "contenu": {
        "documentURI": "/15/amendements/1974/AN/983.pdf"
      }
    }
  ],
  "seanceDiscussion": "RUANR5L15S2019IDS21699",
  "sort": {
    "dateSaisie": "2019-06-13T19:11:23.000+02:00",
    "sortEnSeance": "Rejeté"
  },
  "dateDepot": "2019-05-28T02:00:00.000+02:00",
  "dateDistribution": "2019-06-05T02:00:00.000+02:00",
  "article99": "0",
  "loiReference": {}
}