{
  "uid": "AMANR5L15SEA717460B1255P1D1N1458",
  "identifiant": {
    "legislature": "15",
    "numero": "1458",
    "numRect": "0",
    "saisine": {
      "texteLegislatifRef": "PRJLANR5L15B1255",
      "numeroPartiePLF": "1",
      "organeExamen": "PO717460",
      "mentionSecondeDeliberation": "0"
    }
  },
  "numeroLong": "I-1458",
  "etapeTexte": "1ère lecture (1ère assemblée saisie)",
  "triAmendement": "asiaaaaaaaaaaaaaaaaaaaaaaaaaaaaaaaaaaaaaaaaaaaaaaazzzzzzzzzzzzw",
  "cardinaliteAmdtMultiples": "1",
  "etat": "Discuté",
  "signataires": {
    "auteur": {
      "typeAuteur": "Depute",
      "acteurRef": "PA608292",
      "groupePolitiqueRef": "PO723569"
    },
    "cosignatairesRefs": [
      "PA608292",
      "PA336175"
    ],
    "texteAffichable": "Mme&#160;Dubi&#233; et Mme&#160;Pinel"
  },
  "pointeurFragmentTexte": {
    "division": {
      "titre": "Article 19",
      "articleDesignationCourte": "ART. 19",
      "type": "ARTICLE",
      "avantAApres": "A",
      "divisionRattachee": "ARTICLE 19",
      "urlDivisionTexteVise": "/15/textes/1255A.asp#D_Article_19"
    },
    "alinea": {
      "numero": "3"
    }
  },
  "corps": {
    "dispositif": "<p style=\"text-align: justify;\">Supprimer les alin&#233;as&#160;3 et 4.</p>",
    "exposeSommaire": "<p style=\"text-align: justify;\">Cet amendement vise &#224; maintenir les tarifs r&#233;duits de taxe int&#233;rieure de consommation sur les produits &#233;nerg&#233;tiques (TICPE) dont b&#233;n&#233;ficie notamment le gazole non routier (GNR) utilis&#233; pour le nivellement de la neige et le d&#233;neigement des routes.</p><p style=\"text-align: justify;\">L&#8217;article&#160;19 du projet de loi de finances pour 2019 pr&#233;voit en effet la suppression de ces tarifs r&#233;duits, ce qui impactera lourdement le budget des collectivit&#233;s affect&#233; &#224; l&#8217;achat de carburant, au premier desquelles figurent les d&#233;partements, pour assurer le d&#233;neigement des routes, et celui des entreprises publiques et priv&#233;es qui assurent le damage des domaines skiables.</p><p style=\"text-align: justify;\">L&#8217;amendement propose que les tracteurs de type agricole ou forestier comme tout v&#233;hicule &#224; moteur, &#224; roues ou &#224; chenilles, ayant au moins deux essieux, utilis&#233;s par des collectivit&#233;s territoriales pour des usages autres qu&#8217;agricoles ou forestiers, notamment le d&#233;neigement, continuent &#224; b&#233;n&#233;ficier du taux r&#233;duit pour le GNR.</p><p style=\"text-align: justify;\">Sinon, si le taux r&#233;duit n&#8217;&#233;tait plus appliqu&#233; pour le d&#233;neigement des routes, cela conduirait &#224; une hausse du co&#251;t du carburant, par exemple pour le d&#233;partement des Hautes-Pyr&#233;n&#233;es, de pr&#232;s de 60&#160;%. Cette augmentation constituerait une ponction suppl&#233;mentaire sur le budget des d&#233;partements d&#233;j&#224; lourdement ob&#233;r&#233; par une r&#233;duction continue de leurs ressources et une augmentation de leurs charges non compens&#233;es.</p><p style=\"text-align: justify;\">Par ailleurs, pour le damage, si le taux r&#233;duit n&#8217;est plus appliqu&#233;, cela conduirait &#224; une augmentation du co&#251;t du carburant de 40 centimes d&#8217;euro par litre. Le taux de taxe support&#233; par les carburants passerait alors de 50&#160;% &#224; 70&#160;%. Cet effet brutal se cumulerait avec la hausse d&#233;j&#224; programm&#233;e par la loi de finances pour 2018 pour les carburants de 5 centimes par litre chaque ann&#233;e pour le gazole.</p><p style=\"text-align: justify;\">L&#8217;effet cumul&#233; des deux augmentations pr&#233;cit&#233;es (au total 50 centimes d&#8217;euros par litre d&#8217;ici le 1<sup>er</sup> janvier 2020) repr&#233;senterait pour le damage 1&#160;% du chiffre d&#8217;affaires, soit 20&#160;% de la marge des entreprises de la branche en moyenne, ce qui menacerait l&#8217;&#233;conomie touristique des stations de montagne.</p>"
  },
  "representations": [
    {
      "nom": "PDF",
      "typeMime": {
        "type": "application",
        "subType": "PDF"
      },
      "statutRepresentation": {
        "verbatim": true,
        "canonique": true,
        "officielle": true,
        "transcription": false,
        "enregistrement": false
      },
      "contenu": {
        "documentURI": "/15/amendements/1255A/AN/1458.pdf"
      }
    }
  ],
  "seanceDiscussion": "RUANR5L15S2019IDS21276",
  "sort": {
    "dateSaisie": "2018-10-18T00:06:17.000+02:00",
    "sortEnSeance": "Rejeté"
  },
  "dateDepot": "2018-10-11T02:00:00.000+02:00",
  "dateDistribution": "2018-10-15T02:00:00.000+02:00",
  "article99": "0",
  "loiReference": {}
}