{
  "uid": "AMANR5L15PO419865B0846P0D1N101",
  "identifiant": {
    "legislature": "15",
    "numero": "101",
    "numRect": "0",
    "saisine": {
      "texteLegislatifRef": "PRJLANR5L15B0846",
      "numeroPartiePLF": "0",
      "organeExamen": "PO419865",
      "mentionSecondeDeliberation": "0"
    }
  },
  "numeroLong": "CD101",
  "etapeTexte": "1ère lecture (1ère assemblée saisie)",
  "triAmendement": "dp",
  "cardinaliteAmdtMultiples": "1",
  "etat": "Discuté",
  "signataires": {
    "auteur": {
      "typeAuteur": "Depute",
      "acteurRef": "PA720652",
      "groupePolitiqueRef": "PO730970"
    },
    "cosignatairesRefs": [
      "PA720334",
      "PA720652",
      "PA721976",
      "PA610733",
      "PA720764",
      "PA721530"
    ],
    "texteAffichable": "M.&#160;Duverg&#233;,  M.&#160;Millienne, M.&#160;Pahun, Mme&#160;Lasserre-David, Mme&#160;Luquet et M.&#160;Thierry&#160;Robert"
  },
  "pointeurFragmentTexte": {
    "division": {
      "titre": "Article 54",
      "articleDesignationCourte": "ART. 54",
      "type": "ARTICLE",
      "avantAApres": "A",
      "divisionRattachee": "ARTICLE 54",
      "urlDivisionTexteVise": "/15/textes/0846.asp#D_Article_54"
    },
    "alinea": {
      "avantAApres": "A",
      "numero": "4",
      "alineaDesignation": "Alinéa 4"
    }
  },
  "corps": {
    "dispositif": "<p style=\"text-align: justify;\">&#192; l&#8217;alin&#233;a&#160;4, substituer aux deux occurrences du mot&#160;:</p><p style=\"text-align: justify;\">&#171;&#160;commerces&#160;&#187; </p><p style=\"text-align: justify;\">les mots&#160;:</p><p style=\"text-align: justify;\">&#171;&#160;locaux commerciaux et artisanaux&#160;&#187;.</p>",
    "exposeSommaire": "<p style=\"text-align: justify;\">La diversit&#233; de ses activit&#233;s place l&#8217;artisanat au carrefour entre &#233;conomie productive et r&#233;sidentielle et donc au c&#339;ur des enjeux de la revitalisation des centres-villes. En effet, il permet de les faire vivre en fournissant emplois et services essentiels au maintien des populations. Le secteur de l&#8217;artisanat est d&#8217;ailleurs vis&#233; dans cet article.</p><p style=\"text-align: justify;\">Par cons&#233;quent, et de mani&#232;re coh&#233;rente, les op&#233;rations de revitalisation des territoires devront assurer la disponibilit&#233; et la desserte en centre-ville de locaux artisanaux adapt&#233;s aux diff&#233;rents types d&#8217;activit&#233;s.</p>"
  },
  "representations": [
    {
      "nom": "PDF",
      "typeMime": {
        "type": "application",
        "subType": "PDF"
      },
      "statutRepresentation": {
        "verbatim": true,
        "canonique": true,
        "officielle": true,
        "transcription": false,
        "enregistrement": false
      },
      "contenu": {
        "documentURI": "/15/amendements/0846/CION-DVP/CD101.pdf"
      }
    }
  ],
  "sort": {
    "dateSaisie": "2018-04-17T22:58:42.000+02:00",
    "sortEnSeance": "Adopté"
  },
  "dateDepot": "2018-04-13T02:00:00.000+02:00",
  "dateDistribution": "2018-04-14T02:00:00.000+02:00",
  "article99": "0",
  "loiReference": {}
}