{
  "uid": "AMANR5L15PO419610B0627P0D1N272",
  "identifiant": {
    "legislature": "15",
    "numero": "272",
    "numRect": "0",
    "saisine": {
      "texteLegislatifRef": "PRJLANR5L15B0627",
      "numeroPartiePLF": "0",
      "organeExamen": "PO419610",
      "mentionSecondeDeliberation": "0"
    }
  },
  "numeroLong": "CE272",
  "etapeTexte": "1ère lecture (1ère assemblée saisie)",
  "triAmendement": "i",
  "cardinaliteAmdtMultiples": "1",
  "etat": "Discuté",
  "signataires": {
    "auteur": {
      "typeAuteur": "Rapporteur",
      "acteurRef": "PA719718",
      "organeRef": "PO419865",
      "groupePolitiqueRef": "PO730964"
    },
    "cosignatairesRefs": [
      "PA719718",
      "PA718894"
    ],
    "texteAffichable": "Mme&#160;Maillart-M&#233;haignerie, rapporteure pour avis au nom de la commission du d&#233;veloppement durable et de l&apos;am&#233;nagement du territoire et M.&#160;Dombreval"
  },
  "pointeurFragmentTexte": {
    "division": {
      "titre": "Article 14",
      "articleDesignationCourte": "AVANT ART. 14",
      "type": "ARTICLE",
      "avantAApres": "Avant",
      "divisionRattachee": "AVANT L'ARTICLE 14, insérer l'article suivant:",
      "articleAdditionnel": "1",
      "urlDivisionTexteVise": "/15/textes/0627.asp#D_Article_14"
    }
  },
  "corps": {
    "dispositif": "<p style=\"text-align: justify;\">Chapitre III.</p><p style=\"text-align: justify;\">Renforcement des exigences pour une alimentation durable.</p>",
    "exposeSommaire": "<p style=\"text-align: justify;\">Amendement r&#233;dactionnel visant &#224; d&#233;cliner le contenu du titre II qui comporte des dispositions tr&#232;s h&#233;t&#233;roclites et ainsi doter le texte d&#8217;une architecture ordonnant bien les th&#232;mes vis&#233;s successivement par les diff&#233;rents articles, de fa&#231;on &#224; offrir des rep&#232;res et davantage d&#8217;ancrage et de lisibilit&#233; aux dispositions actuelles et &#224; celles qui y seront &#233;ventuellement ajout&#233;es.</p>"
  },
  "representations": [
    {
      "nom": "PDF",
      "typeMime": {
        "type": "application",
        "subType": "PDF"
      },
      "statutRepresentation": {
        "verbatim": true,
        "canonique": true,
        "officielle": true,
        "transcription": false,
        "enregistrement": false
      },
      "contenu": {
        "documentURI": "/15/amendements/0627/CION-ECO/CE272.pdf"
      }
    }
  ],
  "sort": {
    "dateSaisie": "2018-04-20T11:23:26.000+02:00",
    "sortEnSeance": "Adopté"
  },
  "dateDepot": "2018-04-04T02:00:00.000+02:00",
  "dateDistribution": "2018-04-17T02:00:00.000+02:00",
  "article99": "0",
  "loiReference": {
    "codeLoi": "ztitre"
  }
}