{
  "uid": "AMANR5L15PO766718B2187P0D1N561",
  "identifiant": {
    "legislature": "15",
    "numero": "561",
    "numRect": "0",
    "saisine": {
      "texteLegislatifRef": "PRJLANR5L15B2187",
      "numeroPartiePLF": "0",
      "organeExamen": "PO766718",
      "mentionSecondeDeliberation": "0"
    }
  },
  "numeroLong": "561",
  "etapeTexte": "1ère lecture (1ère assemblée saisie)",
  "triAmendement": "agaaaaaaaaaaaaaaaaaaaaaaaaaaaaaaaaaaaaaaaaaaaaaaaaad",
  "cardinaliteAmdtMultiples": "1",
  "etat": "Discuté",
  "signataires": {
    "auteur": {
      "typeAuteur": "Depute",
      "acteurRef": "PA605991",
      "groupePolitiqueRef": "PO730934"
    },
    "cosignatairesRefs": [
      "PA767",
      "PA605991",
      "PA721410",
      "PA608416",
      "PA721286",
      "PA267429",
      "PA266776",
      "PA722390",
      "PA642847",
      "PA719318",
      "PA1012",
      "PA345722",
      "PA709315",
      "PA334654"
    ],
    "texteAffichable": "Mme&#160;Genevard,  M.&#160;Straumann, Mme&#160;Corneloup, M.&#160;Bazin, M.&#160;Cattin, Mme&#160;Anthoine, M.&#160;Reiss, M.&#160;de la Verpilli&#232;re, M.&#160;Ramadier, Mme&#160;Bonnivard, M.&#160;Hetzel, M.&#160;Cinieri, M.&#160;Viala et Mme&#160;Le Grip"
  },
  "pointeurFragmentTexte": {
    "division": {
      "titre": "Article 2",
      "articleDesignationCourte": "APRÈS ART. 2",
      "type": "ARTICLE",
      "avantAApres": "Apres",
      "divisionRattachee": "APRÈS L'ARTICLE 2, insérer l'article suivant:",
      "articleAdditionnel": "1",
      "urlDivisionTexteVise": "/15/textes/2187.asp#D_Article_2"
    }
  },
  "corps": {
    "dispositif": "<p style=\"text-align: justify;\">I.&#160;&#8211;&#160;Le livre II de la premi&#232;re partie du code de la sant&#233; publique est ainsi modifi&#233;&#160;:</p><p style=\"text-align: justify;\">1&#176;&#160;Le premier alin&#233;a de l&#8217;article L.&#160;1244&#8209;7 du code de la sant&#233; publique est compl&#233;t&#233; par une phrase ainsi r&#233;dig&#233;e&#160;: &#171;&#160;Le fait de favoriser, par quelque moyen que ce soit, le couple ayant d&#233;sign&#233; une personne ayant volontairement accept&#233; de proc&#233;der &#224; un tel don en faveur d&#8217;un couple tiers anonyme est &#233;galement interdit.&#160;&#187;&#160;;</p><p style=\"text-align: justify;\">2&#176;&#160;L&#8217;article L.&#160;1273&#8209;6 est compl&#233;t&#233; par un alin&#233;a ainsi r&#233;dig&#233;&#160;:</p><p style=\"text-align: justify;\">&#171;&#160;Le fait de favoriser, par quelque moyen que ce soit, le couple ayant d&#233;sign&#233; une personne ayant volontairement accept&#233; de proc&#233;der &#224; un tel don en faveur d&#8217;un couple tiers anonyme en violation de l&#8217;article L.&#160;1244&#8209;7 du code de la sant&#233; publique est puni des peines pr&#233;vues au premier alin&#233;a du pr&#233;sent article.&#160;&#187;</p><p style=\"text-align: justify;\">II.&#160;&#8211;&#160;L&#8217;article&#160;511&#8209;13 du code p&#233;nal est compl&#233;t&#233; par un alin&#233;a ainsi r&#233;dig&#233;&#160;:</p><p style=\"text-align: justify;\">&#171;&#160;Le fait de favoriser, par quelque moyen que ce soit, le couple ayant d&#233;sign&#233; une personne ayant volontairement accept&#233; de proc&#233;der &#224; un tel don en faveur d&#8217;un couple tiers anonyme en violation de l&#8217;article L.&#160;1244&#8209;7 du code de la sant&#233; publique est puni des peines pr&#233;vues au premier alin&#233;a du pr&#233;sent article.&#160;&#187;</p><p style=\"text-align: justify;\">&#160;</p>",
    "exposeSommaire": "<p style=\"text-align: justify;\">Les CECOS font face &#224; une situation de p&#233;nurie de gam&#232;tes. Selon l&#8217;&#233;tude d&#8217;impact annex&#233;e au pr&#233;sent projet de loi, &#171;&#160;L&#8217;activit&#233; de don d&#8217;ovocytes augmente r&#233;guli&#232;rement en France mais reste insuffisante pour r&#233;pondre &#224; la demande et satisfaire la liste des couples inscrits en attente&#160;&#187;[1]. Pour rem&#233;dier &#224; cette p&#233;nurie, certains CECOS ont notamment adopt&#233; la technique consistant &#224; ce que, lorsqu&#8217;un couple demandeur parvient &#224; recruter une donneuse, il se voit proposer un d&#233;lai d&#8217;attente r&#233;duit[2]. Il ne s&#8217;agit pas d&#8217;une hypoth&#232;se de don dirig&#233; puisque les ovocytes collect&#233;s gr&#226;ce &#224; son recrutement ne lui sont pas attribu&#233;s. Cependant, la r&#233;duction du d&#233;lai d&#8217;attente constitue &#224; l&#8217;&#233;vidence une r&#233;tribution de ses efforts et l&#8217;on peut l&#233;gitimement s&#8217;interroger sur le moyen utilis&#233; pour convaincre la donneuse de se pr&#234;ter &#224; la collecte. Il serait difficile d&#8217;affirmer que ce type d&#8217;op&#233;ration ne s&#8217;accompagne pas du versement d&#8217;une somme d&#8217;argent. Or, si l&#8217;article&#160;511&#8209;13 du Code p&#233;nal r&#233;prime actuellement le fait de conditionner le b&#233;n&#233;fice d&#8217;une assistance m&#233;dicale &#224; la procr&#233;ation &#224; la d&#233;signation d&#8217;une personne acceptant de donner ses gam&#232;tes, le texte ne semble pas pouvoir s&#8217;appliquer lorsqu&#8217;il ne s&#8217;agit pas de &#171;&#160;conditionner&#160;&#187;, mais de &#171;&#160;favoriser&#160;&#187;. Le pr&#233;sent amendement comble cette lacune en ajoutant un alin&#233;a visant pr&#233;cis&#233;ment cette situation &#224; l&#8217;article&#160;511&#8209;13 du Code p&#233;nal et en le r&#233;it&#233;rant aux articles L.&#160;1244&#8209;7 et L.&#160;1273&#8209;6 du Code de la sant&#233; publique.</p><p style=\"text-align: justify;\"><u><b>Une enqu&#234;te r&#233;alis&#233;e par l&#8217;IGAS r&#233;v&#233;l&#233;e lors des d&#233;bats de 2011, attestait que, dans de nombreux cas, pour remonter dans la liste d&#8217;attente d&#8217;un don de gam&#232;tes, le couple candidat &#224; l&#8217;AMP &#233;tait invit&#233; &#224; d&#233;signer une donneuse d&#8217;ovocytes. Actuellement le code p&#233;nal interdit de &#171;&#160;conditionner&#160;&#187; l&#8217;acc&#232;s &#224; l&#8217;AMP &#224; un tel don. Tel qu&#8217;il est &#233;crit, le texte (art.&#160;511&#8209;13 du Code p&#233;nal, art.&#160;L.&#160;1273&#8209;6 du Code de la sant&#233; publique&#160;&#187;) ne permet pas de sanctionner le fait de &#171;&#160;favoriser&#160;&#187; le couple. L&#8217;amendement permet de combler cette lacune.</b></u><br />&#160;</p><p style=\"text-align: justify;\"><br /> <br />[1] Etude d&#8217;impact, p. 28.<br />[2] Rapport de l&#8217;IGAS, 2011 cit&#233; &#224; l&#8217;assembl&#233;e nationale par J. Fraysse, 1<sup>&#232;re</sup> s&#233;ance 25 mai 2011, JOAN CR, 26 mai, p. 3457.</p>"
  },
  "representations": [
    {
      "nom": "PDF",
      "typeMime": {
        "type": "application",
        "subType": "PDF"
      },
      "statutRepresentation": {
        "verbatim": true,
        "canonique": true,
        "officielle": true,
        "transcription": false,
        "enregistrement": false
      },
      "contenu": {
        "documentURI": "/15/amendements/2187/CSBIOETH/561.pdf"
      }
    }
  ],
  "sort": {
    "dateSaisie": "2019-09-12T10:20:16.000+02:00",
    "sortEnSeance": "Rejeté"
  },
  "dateDepot": "2019-09-03T02:00:00.000+02:00",
  "dateDistribution": "2019-09-10T02:00:00.000+02:00",
  "article99": "0",
  "loiReference": {
    "codeLoi": "c santé publique",
    "divisionCodeLoi": "L1244-7"
  }
}