{
  "uid": "AMANR5L15PO766718B2187P0D1N1169",
  "identifiant": {
    "legislature": "15",
    "numero": "1169",
    "numRect": "0",
    "saisine": {
      "texteLegislatifRef": "PRJLANR5L15B2187",
      "numeroPartiePLF": "0",
      "organeExamen": "PO766718",
      "mentionSecondeDeliberation": "0"
    }
  },
  "numeroLong": "1169",
  "etapeTexte": "1ère lecture (1ère assemblée saisie)",
  "triAmendement": "akaaaaaaaaaaaaaaaaaaaaaaaaaaaaaaaaaaaaaaaaaaaaaaaawtkt",
  "cardinaliteAmdtMultiples": "1",
  "etat": "Discuté",
  "signataires": {
    "auteur": {
      "typeAuteur": "Depute",
      "acteurRef": "PA721776",
      "groupePolitiqueRef": "PO730964"
    },
    "cosignatairesRefs": [
      "PA721776"
    ],
    "texteAffichable": "M.&#160;Baich&#232;re"
  },
  "pointeurFragmentTexte": {
    "division": {
      "titre": "Article 3",
      "articleDesignationCourte": "ART. 3",
      "type": "ARTICLE",
      "avantAApres": "A",
      "divisionRattachee": "ARTICLE 3",
      "urlDivisionTexteVise": "/15/textes/2187.asp#D_Article_3"
    },
    "alinea": {
      "numero": "51"
    }
  },
  "corps": {
    "dispositif": "<p style=\"text-align: justify;\">&#192; la fin de l&#8217;alin&#233;a&#160;51, substituer aux mots&#160;:</p><p style=\"text-align: justify;\">&#171;&#160;femme non mari&#233;e&#160;&#187; </p><p style=\"text-align: justify;\">les mots&#160;:</p><p style=\"text-align: justify;\">&#171;&#160;la personne en capacit&#233; de porter un enfant&#160;&#187;.</p><p style=\"text-align: justify;\">&#160;</p>",
    "exposeSommaire": "<p>Conform&#233;ment &#224; l&#8217;avis &#233;mis par la Commission Nationale Consultative des droits de l&#8217;homme, l&#8217;AMP devrait donc &#234;tre ouverte &#224; toute personne en capacit&#233; de porter un enfant (ce qui exclut toute GPA). Tel est l&#8217;objet du pr&#233;sent amendement.</p><p>En effet, certaines personnes peuvent &#234;tre en capacit&#233; de porter un enfant sans pour autant &#234;tre reconnues &#224; l&#8217;&#233;tat civil comme de sexe f&#233;minin. C&#8217;est notamment le cas de certaines personnes intersexes ou transidentitaires. Ces personnes peuvent avoir besoin de recourir &#224; la procr&#233;ation m&#233;dicalement assist&#233;e, soit &#224; cause de troubles de la fertilit&#233;, soit parce qu&#8217;elles sont c&#233;libataires ou en couple de m&#234;me sexe. L&#8217;absence d&#8217;interdiction au niveau l&#233;gislatif permettra &#224; ces personnes de faire une demande de prise en charge dans les centres agr&#233;&#233;s. Il reviendra &#224; ces derniers de proc&#233;der &#224; l&#8217;&#233;valuation de la demande.</p>"
  },
  "representations": [
    {
      "nom": "PDF",
      "typeMime": {
        "type": "application",
        "subType": "PDF"
      },
      "statutRepresentation": {
        "verbatim": true,
        "canonique": true,
        "officielle": true,
        "transcription": false,
        "enregistrement": false
      },
      "contenu": {
        "documentURI": "/15/amendements/2187/CSBIOETH/1169.pdf"
      }
    }
  ],
  "sort": {
    "dateSaisie": "2019-09-12T18:16:01.000+02:00",
    "sortEnSeance": "Rejeté"
  },
  "dateDepot": "2019-09-05T02:00:00.000+02:00",
  "dateDistribution": "2019-09-09T02:00:00.000+02:00",
  "article99": "0",
  "loiReference": {}
}