{
  "uid": "AMANR5L15SEA717460B1297P0D1N903",
  "identifiant": {
    "legislature": "15",
    "numero": "903",
    "numRect": "0",
    "saisine": {
      "texteLegislatifRef": "PRJLANR5L15B1297",
      "numeroPartiePLF": "0",
      "organeExamen": "PO717460",
      "mentionSecondeDeliberation": "0"
    }
  },
  "numeroLong": "903",
  "etapeTexte": "1ère lecture (1ère assemblée saisie)",
  "triAmendement": "foaaaaaaaaaaaaaaaaaaaaaaaaaaaaaaaaaaaaaaaaaaaaaaaaw",
  "cardinaliteAmdtMultiples": "1",
  "etat": "Discuté",
  "signataires": {
    "auteur": {
      "typeAuteur": "Depute",
      "acteurRef": "PA642788",
      "groupePolitiqueRef": "PO730964"
    },
    "cosignatairesRefs": [
      "PA642788"
    ],
    "texteAffichable": "M.&#160;V&#233;ran"
  },
  "pointeurFragmentTexte": {
    "division": {
      "titre": "Article 32",
      "articleDesignationCourte": "ART. 32",
      "type": "ARTICLE",
      "avantAApres": "A",
      "divisionRattachee": "ARTICLE 32",
      "urlDivisionTexteVise": "/15/textes/1297.asp#D_Article_32"
    },
    "alinea": {
      "numero": "26"
    }
  },
  "corps": {
    "dispositif": "<p style=\"text-align: justify;\">&#192; l&#8217;alin&#233;a&#160;26, substituer aux mots&#160;:</p><p style=\"text-align: justify;\">&#171;&#160;pour le&#160;&#187;</p><p style=\"text-align: justify;\">les mots&#160;:</p><p style=\"text-align: justify;\">&#171;&#160;aupr&#232;s du&#160;&#187;.</p>",
    "exposeSommaire": "<p>R&#233;dactionnel.</p>"
  },
  "representations": [
    {
      "nom": "PDF",
      "typeMime": {
        "type": "application",
        "subType": "PDF"
      },
      "statutRepresentation": {
        "verbatim": true,
        "canonique": true,
        "officielle": true,
        "transcription": false,
        "enregistrement": false
      },
      "contenu": {
        "documentURI": "/15/amendements/1297/AN/903.pdf"
      }
    }
  ],
  "seanceDiscussion": "RUANR5L15S2019IDS21294",
  "sort": {
    "dateSaisie": "2018-10-26T18:23:53.000+02:00",
    "sortEnSeance": "Adopté"
  },
  "dateDepot": "2018-10-19T02:00:00.000+02:00",
  "dateDistribution": "2018-10-22T02:00:00.000+02:00",
  "article99": "0",
  "loiReference": {}
}