{
  "uid": "AMANR5L15PO419865B1831P0D1N2670",
  "identifiant": {
    "legislature": "15",
    "numero": "2670",
    "numRect": "0",
    "saisine": {
      "texteLegislatifRef": "PRJLANR5L15B1831",
      "numeroPartiePLF": "0",
      "organeExamen": "PO419865",
      "mentionSecondeDeliberation": "0"
    }
  },
  "numeroLong": "CD2670",
  "etapeTexte": "1ère lecture (2ème assemblée saisie)",
  "triAmendement": "aoiaaaaaaaaaaaaaaaaaaaaaaaaaaaaaaaaaaaaaaaaaaaaaaakjvw",
  "cardinaliteAmdtMultiples": "1",
  "etat": "Irrecevable",
  "signataires": {
    "auteur": {
      "typeAuteur": "Depute",
      "acteurRef": "PA721530",
      "groupePolitiqueRef": "PO730970"
    },
    "cosignatairesRefs": [
      "PA721992",
      "PA720652",
      "PA721530",
      "PA720334",
      "PA721976",
      "PA720764"
    ],
    "texteAffichable": "Mme&#160;Luquet,  M.&#160;Duverg&#233;, Mme&#160;Lasserre-David, M.&#160;Millienne, rapporteur M.&#160;Pahun et Mme&#160;Gallerneau"
  },
  "pointeurFragmentTexte": {
    "division": {
      "titre": "Article 4",
      "articleDesignationCourte": "ART. 4",
      "type": "ARTICLE",
      "avantAApres": "A",
      "divisionRattachee": "ARTICLE 4",
      "urlDivisionTexteVise": "/15/textes/1831.asp#D_Article_4"
    },
    "alinea": {
      "avantAApres": "Apres",
      "numero": "15"
    }
  },
  "corps": {},
  "representations": [
    {
      "nom": "PDF",
      "typeMime": {
        "type": "application",
        "subType": "PDF"
      },
      "statutRepresentation": {
        "verbatim": true,
        "canonique": true,
        "officielle": true,
        "transcription": false,
        "enregistrement": false
      },
      "contenu": {
        "documentURI": "/15/amendements/1831/CION-DVP/CD2670.pdf"
      }
    }
  ],
  "dateDepot": "2019-05-09T02:00:00.000+02:00",
  "dateDistribution": "2019-05-11T02:00:00.000+02:00",
  "article99": "0",
  "loiReference": {}
}