{
  "uid": "AMANR5L15PO419865B1402P0D1N154",
  "identifiant": {
    "legislature": "15",
    "numero": "154",
    "numRect": "0",
    "saisine": {
      "texteLegislatifRef": "PRJLANR5L15B1402",
      "numeroPartiePLF": "0",
      "organeExamen": "PO419865",
      "mentionSecondeDeliberation": "0"
    }
  },
  "numeroLong": "CD154",
  "etapeTexte": "1ère lecture (1ère assemblée saisie)",
  "triAmendement": "aiaaaaaaaaaaaaaaaaaaaaaaaaaaaaaaaaaaaaaaaaaaaaaaaabnti",
  "cardinaliteAmdtMultiples": "1",
  "etat": "Discuté",
  "signataires": {
    "auteur": {
      "typeAuteur": "Depute",
      "acteurRef": "PA719972",
      "groupePolitiqueRef": "PO730964"
    },
    "cosignatairesRefs": [
      "PA719972"
    ],
    "texteAffichable": "Mme&#160;Sarles"
  },
  "pointeurFragmentTexte": {
    "division": {
      "titre": "Article PREMIER",
      "articleDesignationCourte": "ART. PREMIER",
      "type": "ARTICLE",
      "avantAApres": "A",
      "divisionRattachee": "ARTICLE PREMIER",
      "urlDivisionTexteVise": "/15/textes/1402.asp#D_Article_1er"
    },
    "alinea": {
      "avantAApres": "Apres",
      "numero": "10"
    }
  },
  "corps": {
    "dispositif": "<p style=\"text-align: justify;\">Apr&#232;s l&#8217;alin&#233;a&#160;10, ins&#233;rer l&#8217;alin&#233;a suivant&#160;:</p><p style=\"text-align: justify;\">&#171;&#160;<i>a)</i>&#160;Contribution &#224; la lutte contre la biopiraterie et suivi du dispositif d&#8217;acc&#232;s aux ressources g&#233;n&#233;tiques et de partage juste et &#233;quitable des avantages d&#233;coulant de leur utilisation&#160;;&#160;&#187;.</p>",
    "exposeSommaire": "<p style=\"text-align: justify;\">La biopiraterie est le fait de s&#8217;accaparer des savoirs traditionnels sur la biodiversit&#233; ou de privatiser des savoirs sur le vivant, notamment par le biais de brevets.</p><p style=\"text-align: justify;\">Pour prot&#233;ger les peuples et la biodiversit&#233; de ces pratiques, la convention sur la diversit&#233; biologique et le protocole de Nagoya ont &#233;t&#233; adopt&#233;s par les nations unies respectivement en 1992 et 2010. Ils posent le principe dit Acc&#232;s et Partage des Avantages (APA)&#160;: les acteurs souhaitant acc&#233;der aux ressources g&#233;n&#233;tiques d&#8217;un &#201;tat doivent demander l&#8217;autorisation et, en cas de savoirs traditionnels associ&#233;s, le consentement des communaut&#233;s concern&#233;es doit &#234;tre obtenu et un partage des b&#233;n&#233;fices mis en place.</p><p style=\"text-align: justify;\">Loi pour la reconqu&#234;te de la biodiversit&#233;, de la nature et des paysages de 2016 a permis &#224; la France de mettre en pratique la pr&#233;servation de ces droits fondamentaux au travers de l&#8217;Agence Fran&#231;aise pour la Biodiversit&#233;.</p><p style=\"text-align: justify;\">Le pr&#233;sent amendement a pour objet de maintenir cette mission au sein du nouvel &#233;tablissement, cr&#233;&#233; par fusion entre l&#8217;AFB et l&#8217;ONCFS et ainsi continuer &#224; honorer ses engagements internationaux.</p>"
  },
  "representations": [
    {
      "nom": "PDF",
      "typeMime": {
        "type": "application",
        "subType": "PDF"
      },
      "statutRepresentation": {
        "verbatim": true,
        "canonique": true,
        "officielle": true,
        "transcription": false,
        "enregistrement": false
      },
      "contenu": {
        "documentURI": "/15/amendements/1402/CION-DVP/CD154.pdf"
      }
    }
  ],
  "sort": {
    "dateSaisie": "2018-12-04T23:55:30.000+01:00",
    "sortEnSeance": "Adopté"
  },
  "dateDepot": "2018-11-30T01:00:00.000+01:00",
  "dateDistribution": "2018-12-04T01:00:00.000+01:00",
  "article99": "0",
  "loiReference": {}
}