{
  "uid": "AMANR5L15SEA717460BTC2063P0D1N81",
  "identifiant": {
    "legislature": "15",
    "numero": "81",
    "numRect": "0",
    "saisine": {
      "texteLegislatifRef": "PRJLANR5L15BTC2063",
      "numeroPartiePLF": "0",
      "organeExamen": "PO717460",
      "mentionSecondeDeliberation": "0"
    }
  },
  "numeroLong": "81",
  "etapeTexte": "1ère lecture (1ère assemblée saisie)",
  "triAmendement": "alaaaaaaaaaaaaaaaaaaaaaaaaaaaaaaaaaaaaaaaaaaaaaaaah",
  "cardinaliteAmdtMultiples": "1",
  "etat": "Irrecevable",
  "signataires": {
    "auteur": {
      "typeAuteur": "Depute",
      "acteurRef": "PA642868",
      "groupePolitiqueRef": "PO765636"
    },
    "cosignatairesRefs": [
      "PA719806",
      "PA610775",
      "PA722030",
      "PA721632",
      "PA712014",
      "PA342601",
      "PA720696",
      "PA721174",
      "PA642868",
      "PA267766",
      "PA695100",
      "PA267585",
      "PA267780",
      "PA720230",
      "PA332228",
      "PA266788",
      "PA642935",
      "PA331567",
      "PA267241",
      "PA421348",
      "PA267355",
      "PA721110",
      "PA721094",
      "PA2952",
      "PA702052",
      "PA267330",
      "PA268019",
      "PA721486"
    ],
    "texteAffichable": "M.&#160;Christophe,  Mme&#160;Auconie, M.&#160;Becht, M.&#160;Benoit, M.&#160;Bournazel, M.&#160;Guy&#160;Bricout, M.&#160;Brindeau, Mme&#160;de La Raudi&#232;re, M.&#160;Demilly, Mme&#160;Descamps, M.&#160;Dunoyer, Mme&#160;Firmin Le Bodo, M.&#160;Gom&#232;s, M.&#160;Meyer&#160;Habib, M.&#160;Herth, M.&#160;Lagarde, M.&#160;Ledoux, Mme&#160;Lemoine, Mme&#160;Magnier, M.&#160;Morel-&#192;-L&apos;Huissier, M.&#160;Naegelen, Mme&#160;Sage, Mme&#160;Sanquer, M.&#160;Son-Forget, M.&#160;Vercamer, M.&#160;Villiers, M.&#160;Warsmann et M.&#160;Zumkeller"
  },
  "pointeurFragmentTexte": {
    "division": {
      "titre": "Article 1er quater",
      "articleDesignationCourte": "APRÈS ART. 1ER QUATER",
      "type": "ARTICLE",
      "avantAApres": "Apres",
      "divisionRattachee": "APRÈS L'ARTICLE 1ER QUATER, insérer l'article suivant:",
      "articleAdditionnel": "1",
      "urlDivisionTexteVise": "/15/textes/2063.asp#D_Article_1er_quater"
    }
  },
  "corps": {},
  "representations": [
    {
      "nom": "PDF",
      "typeMime": {
        "type": "application",
        "subType": "PDF"
      },
      "statutRepresentation": {
        "verbatim": true,
        "canonique": true,
        "officielle": true,
        "transcription": false,
        "enregistrement": false
      },
      "contenu": {
        "documentURI": "/15/amendements/2063/AN/81.pdf"
      }
    }
  ],
  "dateDepot": "2019-06-21T02:00:00.000+02:00",
  "dateDistribution": "2019-06-24T02:00:00.000+02:00",
  "article99": "0",
  "loiReference": {
    "codeLoi": "c environnement",
    "divisionCodeLoi": "L125-31"
  }
}