{
  "uid": "AMANR5L15PO419604B1616P0D1N6",
  "identifiant": {
    "legislature": "15",
    "numero": "6",
    "numRect": "0",
    "saisine": {
      "texteLegislatifRef": "PIONANR5L15B1616",
      "numeroPartiePLF": "0",
      "organeExamen": "PO419604",
      "mentionSecondeDeliberation": "0"
    }
  },
  "numeroLong": "AC6",
  "etapeTexte": "1ère lecture (2ème assemblée saisie)",
  "triAmendement": "ooaaaaaaaaaaaaaaaaaaaaaaaaaaaaaaaaaaaaaaaaaaaaaaaaab",
  "cardinaliteAmdtMultiples": "1",
  "etat": "Irrecevable",
  "signataires": {
    "auteur": {
      "typeAuteur": "Depute",
      "acteurRef": "PA719676",
      "groupePolitiqueRef": "PO730958"
    },
    "cosignatairesRefs": [
      "PA718860",
      "PA720430",
      "PA720422",
      "PA720286",
      "PA719676",
      "PA721960",
      "PA721210",
      "PA721202",
      "PA719578",
      "PA720846",
      "PA721062",
      "PA588884",
      "PA721226",
      "PA720892",
      "PA2150",
      "PA718868",
      "PA722142"
    ],
    "texteAffichable": "Mme&#160;Ressiguier,  Mme&#160;Autain, M.&#160;Bernalicis, M.&#160;Coquerel, M.&#160;Corbi&#232;re, Mme&#160;Fiat, M.&#160;Lachaud, M.&#160;Larive, M.&#160;M&#233;lenchon, Mme&#160;Obono, Mme&#160;Panot, M.&#160;Prud&apos;homme, M.&#160;Quatennens, M.&#160;Ratenon, Mme&#160;Rubin, M.&#160;Ruffin et Mme&#160;Taurine"
  },
  "pointeurFragmentTexte": {
    "division": {
      "titre": "Article 3 decies",
      "articleDesignationCourte": "APRÈS ART. 3 DECIES",
      "type": "ARTICLE",
      "avantAApres": "Apres",
      "divisionRattachee": "APRÈS L'ARTICLE 3 DECIES, insérer l'article suivant:",
      "articleAdditionnel": "1",
      "urlDivisionTexteVise": "/15/textes/1616.asp#D_Article_3_decies"
    }
  },
  "corps": {},
  "representations": [
    {
      "nom": "PDF",
      "typeMime": {
        "type": "application",
        "subType": "PDF"
      },
      "statutRepresentation": {
        "verbatim": true,
        "canonique": true,
        "officielle": true,
        "transcription": false,
        "enregistrement": false
      },
      "contenu": {
        "documentURI": "/15/amendements/1616/CION-CEDU/AC6.pdf"
      }
    }
  ],
  "dateDepot": "2019-04-25T02:00:00.000+02:00",
  "dateDistribution": "2019-04-29T02:00:00.000+02:00",
  "article99": "0",
  "loiReference": {
    "codeLoi": "consommation",
    "divisionCodeLoi": "L111-7"
  }
}