{
  "uid": "AMANR5L15PO59046B0659P0D1N432",
  "identifiant": {
    "legislature": "15",
    "numero": "432",
    "numRect": "0",
    "saisine": {
      "texteLegislatifRef": "PRJLANR5L15B0659",
      "numeroPartiePLF": "0",
      "organeExamen": "PO59046",
      "mentionSecondeDeliberation": "0"
    }
  },
  "numeroLong": "DN432",
  "etapeTexte": "1ère lecture (1ère assemblée saisie)",
  "triAmendement": "xw",
  "cardinaliteAmdtMultiples": "1",
  "etat": "Discuté",
  "signataires": {
    "auteur": {
      "typeAuteur": "Depute",
      "acteurRef": "PA672",
      "groupePolitiqueRef": "PO730964"
    },
    "cosignatairesRefs": [
      "PA672"
    ],
    "texteAffichable": "M.&#160;Bridey, rapporteur"
  },
  "pointeurFragmentTexte": {
    "division": {
      "titre": "Article 19",
      "articleDesignationCourte": "ART. 19",
      "type": "ARTICLE",
      "avantAApres": "A",
      "divisionRattachee": "ARTICLE 19",
      "urlDivisionTexteVise": "/15/textes/0659.asp#D_Article_19"
    },
    "alinea": {
      "avantAApres": "A",
      "numero": "15",
      "alineaDesignation": "Alinéa 15"
    }
  },
  "corps": {
    "dispositif": "<p>A l'alin&#233;a 15, apr&#232;s le mot : \"pr&#233;vention\", ins&#233;rer les mots : \"et &#224; la caract&#233;risation\".</p>",
    "exposeSommaire": "<p>Amendement de coh&#233;rence avec les dispositions pr&#233;vues &#224; l'alin&#233;a 14.</p>"
  },
  "representations": [
    {
      "nom": "PDF",
      "typeMime": {
        "type": "application",
        "subType": "PDF"
      },
      "statutRepresentation": {
        "verbatim": true,
        "canonique": true,
        "officielle": true,
        "transcription": false,
        "enregistrement": false
      },
      "contenu": {
        "documentURI": "/15/amendements/0659/CION_DEF/DN432.pdf"
      }
    }
  ],
  "sort": {
    "dateSaisie": "2018-03-14T13:28:35.000+01:00",
    "sortEnSeance": "Adopté"
  },
  "dateDepot": "2018-03-12T01:00:00.000+01:00",
  "dateDistribution": "2018-03-12T01:00:00.000+01:00",
  "article99": "0",
  "loiReference": {}
}