{
  "uid": "AMANR5L15SEA717460BTC1177P0D1N283",
  "identifiant": {
    "legislature": "15",
    "numero": "283",
    "numRect": "0",
    "saisine": {
      "texteLegislatifRef": "PRJLANR5L15BTC1177",
      "numeroPartiePLF": "0",
      "organeExamen": "PO717460",
      "mentionSecondeDeliberation": "0"
    }
  },
  "numeroLong": "283",
  "etapeTexte": "Nouvelle Lecture",
  "triAmendement": "j",
  "cardinaliteAmdtMultiples": "1",
  "etat": "Discuté",
  "signataires": {
    "auteur": {
      "typeAuteur": "Depute",
      "acteurRef": "PA721924",
      "groupePolitiqueRef": "PO730970"
    },
    "cosignatairesRefs": [
      "PA719558",
      "PA721742",
      "PA721530",
      "PA719874",
      "PA720772",
      "PA720652",
      "PA719918",
      "PA720598",
      "PA1276",
      "PA719488",
      "PA721924",
      "PA722374",
      "PA719044",
      "PA719504",
      "PA720326",
      "PA720092",
      "PA719266",
      "PA720334",
      "PA720178",
      "PA720728",
      "PA717151",
      "PA720746",
      "PA721608",
      "PA722162",
      "PA719210",
      "PA720976",
      "PA721976",
      "PA721836",
      "PA721984",
      "PA722284",
      "PA720720",
      "PA719938",
      "PA721734",
      "PA721234",
      "PA720764",
      "PA721418",
      "PA720002",
      "PA718978",
      "PA721992",
      "PA720162",
      "PA720256",
      "PA721182",
      "PA720704",
      "PA720924",
      "PA719640",
      "PA720968"
    ],
    "texteAffichable": "Mme&#160;de Vaucouleurs,  M.&#160;Balanant, Mme&#160;Bannier, M.&#160;Barrot, Mme&#160;Benin, M.&#160;Berta, M.&#160;Bolo, M.&#160;Bourlanges, M.&#160;Bru, M.&#160;Cubertafon, Mme&#160;de Sarnez, Mme&#160;Deprez-Audebert, M.&#160;Duverg&#233;, Mme&#160;El Ha&#239;ry, Mme&#160;Elimas, Mme&#160;Essayan, M.&#160;Fanget, M.&#160;Fesneau, Mme&#160;Florennes, M.&#160;Fuchs, Mme&#160;Gallerneau, M.&#160;Garcia, M.&#160;Hammouche, M.&#160;Isaac-Sibille, Mme&#160;Jacquier-Laforge, M.&#160;Joncour, M.&#160;Lagleize, M.&#160;Lain&#233;, M.&#160;Laqhila, Mme&#160;Lasserre-David, M.&#160;Latombe, Mme&#160;Luquet, M.&#160;Mathiasin, M.&#160;Mattei, Mme&#160;Mette, M.&#160;Michel-Kleisbauer, M.&#160;Mignola, M.&#160;Millienne, M.&#160;Pahun, M.&#160;Fr&#233;d&#233;ric&#160;Petit, Mme&#160;Maud&#160;Petit, Mme&#160;Poueyto, M.&#160;Ramos, M.&#160;Turquois, Mme&#160;Vichnievsky et M.&#160;Waserman"
  },
  "pointeurFragmentTexte": {
    "division": {
      "titre": "Article 9",
      "articleDesignationCourte": "ART. 9",
      "type": "ARTICLE",
      "avantAApres": "A",
      "divisionRattachee": "ARTICLE 9",
      "urlDivisionTexteVise": "/15/textes/1177.asp#D_Article_9"
    },
    "alinea": {
      "numero": "11"
    }
  },
  "corps": {
    "dispositif": "<p style=\"text-align: justify;\">Compl&#233;ter l&#8217;alin&#233;a&#160;11 par la phrase suivante&#160;:</p><p style=\"text-align: justify;\">&#171;&#160;Le centre de formation d&#8217;apprentis ou l&#8217;apprenti peut saisir le m&#233;diateur mentionn&#233; &#224; l&#8217;article L.&#160;6222&#8209;39, et pour les apprentis du secteur public non industriel et commercial, le service d&#233;sign&#233; comme &#233;tant charg&#233; de la m&#233;diation.&#160;&#187;</p>",
    "exposeSommaire": "<p style=\"text-align: justify;\">Le pr&#233;sent amendement a pour objectif d&#8217;&#233;tendre les missions des m&#233;diateurs de l&#8217;apprentissage qui sont &#233;tablies &#224; l&#8217;article&#160;9 en pr&#233;voyant l&#8217;intervention du m&#233;diateur en cas d&#8217;exclusion de l&#8217;apprenti par le centre de formation, notamment dans le cas des centres de formation ne relevant pas de l&#8217;&#233;ducation nationale. Cette saisine est non obligatoire mais peut permettre de r&#233;soudre certaines exclusions conflictuelles.</p>"
  },
  "representations": [
    {
      "nom": "PDF",
      "typeMime": {
        "type": "application",
        "subType": "PDF"
      },
      "statutRepresentation": {
        "verbatim": true,
        "canonique": true,
        "officielle": true,
        "transcription": false,
        "enregistrement": false
      },
      "contenu": {
        "documentURI": "/15/amendements/1177/AN/283.pdf"
      }
    }
  ],
  "seanceDiscussion": "RUANR5L15S2018IDS21199",
  "sort": {
    "dateSaisie": "2018-07-24T18:47:08.000+02:00",
    "sortEnSeance": "Adopté"
  },
  "dateDepot": "2018-07-20T02:00:00.000+02:00",
  "dateDistribution": "2018-07-21T02:00:00.000+02:00",
  "article99": "0",
  "loiReference": {}
}