{
  "uid": "AMANR5L15PO420120B2272P2D1N49",
  "identifiant": {
    "legislature": "15",
    "numero": "49",
    "numRect": "0",
    "saisine": {
      "texteLegislatifRef": "PRJLANR5L15B2272",
      "numeroPartiePLF": "2",
      "organeExamen": "PO420120",
      "mentionSecondeDeliberation": "0"
    }
  },
  "numeroLong": "II-AS49",
  "etapeTexte": "1ère lecture (1ère assemblée saisie)",
  "triAmendement": "abioaaaaaaaaaaaaaaaaaaaaaaaaaaaaaaaaaaaaaaaaaaaaaav",
  "cardinaliteAmdtMultiples": "1",
  "etat": "Discuté",
  "signataires": {
    "auteur": {
      "typeAuteur": "Depute",
      "acteurRef": "PA643175",
      "groupePolitiqueRef": "PO730964"
    },
    "cosignatairesRefs": [
      "PA643175"
    ],
    "texteAffichable": "Mme&#160;Dupont"
  },
  "pointeurFragmentTexte": {
    "missionVisee": {
      "idMissionAN": "827",
      "libelleMission": "Solidarité, insertion et égalité des chances",
      "codeMissionPLF": "B",
      "libelleMissionPLF": "Répartition, par mission et programme, des crédits du budget général"
    },
    "division": {
      "titre": "ÉTAT B",
      "articleDesignationCourte": "ART. 38",
      "type": "ANNEXE",
      "avantAApres": "A",
      "divisionRattachee": "ARTICLE 38",
      "urlDivisionTexteVise": "/15/textes/2272C.asp#D_ETAT_B"
    }
  },
  "corps": {
    "exposeSommaire": "<p style=\"text-align: justify;\">Cet amendement vise &#224; r&#233;tablir le niveau du budget du programme 137 &#201;galit&#233; entre les femmes et les hommes &#224; son niveau de 2019. Le Gouvernement s&#8217;est engag&#233; &#224; sanctuariser les cr&#233;dits de ce programme sur la dur&#233;e du quinquennat. La baisse de 25 750&#160;euros observ&#233;e dans le cadre du projet de loi de finances pour 2020 est issue d&#8217;un transfert de cr&#233;dits, &#224; destination du programme 354 Administration territoriale de l&#8217;&#201;tat, qui vise &#224; mutualiser les moyens de fonctionnement courant des directions r&#233;gionales aux droits des femmes (DRDFE) au sein des pr&#233;fectures.</p><p style=\"text-align: justify;\">Le Gouvernement s&#8217;est engag&#233; &#224; r&#233;tablir les 25 750&#160;euros dans le budget du programme 137 par voie d&#8217;amendement au cours de la discussion budg&#233;taire. Votre rapporteure sp&#233;ciale estime que ce symbole est important. En cons&#233;quence, cet amendement d&#8217;appel vise &#224; souligner la n&#233;cessit&#233; de revenir sur la mesure de p&#233;rim&#232;tre ayant affect&#233; le programme 137.</p><p style=\"text-align: justify;\">Les 25 750&#160;euros en autorisations d&#8217;engagement et cr&#233;dits de paiement sont gag&#233;s sur l&#8217;action 10 Fonctionnement des services du programme 124 Conduite et soutien des politiques sanitaires, sociales, du sport, de la jeunesse et de la vie associative.</p>",
    "dispositifAmdtCredit": {
      "listeProgrammes": [
        {
          "libelle": "Inclusion sociale et protection des personnes",
          "id": "91383",
          "AE": {
            "montantPositif": "0",
            "montantNegatif": "0"
          },
          "CP": {
            "montantPositif": "0",
            "montantNegatif": "0"
          },
          "action": "modification"
        },
        {
          "libelle": "Handicap et dépendance",
          "id": "91384",
          "AE": {
            "montantPositif": "0",
            "montantNegatif": "0"
          },
          "CP": {
            "montantPositif": "0",
            "montantNegatif": "0"
          },
          "action": "modification"
        },
        {
          "libelle": "Égalité entre les femmes et les hommes",
          "id": "91385",
          "AE": {
            "montantPositif": "25750",
            "montantNegatif": "0"
          },
          "CP": {
            "montantPositif": "25750",
            "montantNegatif": "0"
          },
          "action": "modification"
        },
        {
          "libelle": "Conduite et soutien des politiques sanitaires, sociales, du sport, de la jeunesse et de la vie associative",
          "id": "91386",
          "AE": {
            "montantPositif": "0",
            "montantNegatif": "25750"
          },
          "CP": {
            "montantPositif": "0",
            "montantNegatif": "25750"
          },
          "action": "modification"
        }
      ],
      "totalAE": {
        "montantPositif": "25750",
        "montantNegatif": "25750",
        "solde": "0"
      },
      "totalCP": {
        "montantPositif": "25750",
        "montantNegatif": "25750",
        "solde": "0"
      }
    }
  },
  "representations": [
    {
      "nom": "PDF",
      "typeMime": {
        "type": "application",
        "subType": "PDF"
      },
      "statutRepresentation": {
        "verbatim": true,
        "canonique": true,
        "officielle": true,
        "transcription": false,
        "enregistrement": false
      },
      "contenu": {
        "documentURI": "/15/amendements/2272C/CION-SOC/AS49.pdf"
      }
    }
  ],
  "sort": {
    "dateSaisie": "2019-10-30T20:24:12.000+01:00",
    "sortEnSeance": "Adopté"
  },
  "dateDepot": "2019-10-25T02:00:00.000+02:00",
  "dateDistribution": "2019-10-28T01:00:00.000+01:00",
  "article99": "0",
  "loiReference": {}
}