{
  "uid": "AMANR5L15PO420120B2296P0D1N692",
  "identifiant": {
    "legislature": "15",
    "numero": "692",
    "numRect": "0",
    "saisine": {
      "texteLegislatifRef": "PRJLANR5L15B2296",
      "numeroPartiePLF": "0",
      "organeExamen": "PO420120",
      "mentionSecondeDeliberation": "0"
    }
  },
  "numeroLong": "AS692",
  "etapeTexte": "1ère lecture (1ère assemblée saisie)",
  "triAmendement": "giaaaaaaaaaaaaaaaaaaaaaaaaaaaaaaaaaaaaaaaaaaaaaaaahjzx",
  "cardinaliteAmdtMultiples": "1",
  "etat": "Irrecevable",
  "signataires": {
    "auteur": {
      "typeAuteur": "Depute",
      "acteurRef": "PA267318",
      "groupePolitiqueRef": "PO730934"
    },
    "cosignatairesRefs": [
      "PA267318"
    ],
    "texteAffichable": "M.&#160;Grelier"
  },
  "pointeurFragmentTexte": {
    "division": {
      "titre": "Article 36",
      "articleDesignationCourte": "ART. 36",
      "type": "ARTICLE",
      "avantAApres": "A",
      "divisionRattachee": "ARTICLE 36",
      "urlDivisionTexteVise": "/15/textes/2296.asp#D_Article_36"
    },
    "alinea": {
      "avantAApres": "Apres",
      "numero": "6"
    }
  },
  "corps": {},
  "representations": [
    {
      "nom": "PDF",
      "typeMime": {
        "type": "application",
        "subType": "PDF"
      },
      "statutRepresentation": {
        "verbatim": true,
        "canonique": true,
        "officielle": true,
        "transcription": false,
        "enregistrement": false
      },
      "contenu": {
        "documentURI": "/15/amendements/2296/CION-SOC/AS692.pdf"
      }
    }
  ],
  "dateDepot": "2019-10-11T02:00:00.000+02:00",
  "dateDistribution": "2019-10-12T02:00:00.000+02:00",
  "article99": "0",
  "loiReference": {}
}