{
  "uid": "AMANR5L15PO59051B0490P0D1N83",
  "identifiant": {
    "legislature": "15",
    "numero": "83",
    "numRect": "0",
    "saisine": {
      "texteLegislatifRef": "PRJLANR5L15B0490",
      "numeroPartiePLF": "0",
      "organeExamen": "PO59051",
      "mentionSecondeDeliberation": "0"
    }
  },
  "numeroLong": "CL83",
  "etapeTexte": "1ère lecture (1ère assemblée saisie)",
  "triAmendement": "yi",
  "cardinaliteAmdtMultiples": "1",
  "etat": "Retiré",
  "signataires": {
    "auteur": {
      "typeAuteur": "Depute",
      "acteurRef": "PA345722",
      "groupePolitiqueRef": "PO730934"
    },
    "cosignatairesRefs": [
      "PA345722"
    ],
    "texteAffichable": "Mme&#160;Le Grip"
  },
  "pointeurFragmentTexte": {
    "division": {
      "titre": "Article 6",
      "articleDesignationCourte": "ART. 6",
      "type": "ARTICLE",
      "avantAApres": "A",
      "divisionRattachee": "ARTICLE 6",
      "urlDivisionTexteVise": "/15/textes/0490.asp#D_Article_6"
    },
    "alinea": {
      "numero": "32"
    }
  },
  "corps": {
    "dispositif": "<p>Apr&#232;s le mot&#160;:</p><p>&#171;&#160;loi&#160;&#187;,</p><p>supprimer la fin de l&#8217;alin&#233;a&#160;32.</p>",
    "exposeSommaire": "<p>Si l&#8217;injonction est une mesure pr&#233;vue par le r&#232;glement (UE) 2016/679, l&#8217;astreinte n&#8217;est pas pr&#233;vue.</p><p>&#160;</p><p>Sa suppression est donc demand&#233;e. (Voir &#233;galement dans le m&#234;me sens l&#8217;amendement K)</p>"
  },
  "representations": [
    {
      "nom": "PDF",
      "typeMime": {
        "type": "application",
        "subType": "PDF"
      },
      "statutRepresentation": {
        "verbatim": true,
        "canonique": true,
        "officielle": true,
        "transcription": false,
        "enregistrement": false
      },
      "contenu": {
        "documentURI": "/15/amendements/0490/CION_LOIS/CL83.pdf"
      }
    }
  ],
  "dateDepot": "2018-01-19T01:00:00.000+01:00",
  "dateDistribution": "2018-01-22T01:00:00.000+01:00",
  "article99": "0",
  "loiReference": {
    "codeLoi": "1"
  }
}