{
  "uid": "AMANR5L15PO766718B2187P0D1N1279",
  "identifiant": {
    "legislature": "15",
    "numero": "1279",
    "numRect": "0",
    "saisine": {
      "texteLegislatifRef": "PRJLANR5L15B2187",
      "numeroPartiePLF": "0",
      "organeExamen": "PO766718",
      "mentionSecondeDeliberation": "0"
    }
  },
  "numeroLong": "1279",
  "etapeTexte": "1ère lecture (1ère assemblée saisie)",
  "triAmendement": "bbaaaaaaaaaaaaaaaaaaaaaaaaaaaaaaaaaaaaaaaaaaaaaaaadbb",
  "cardinaliteAmdtMultiples": "1",
  "etat": "Discuté",
  "signataires": {
    "auteur": {
      "typeAuteur": "Depute",
      "acteurRef": "PA719608",
      "groupePolitiqueRef": "PO723569"
    },
    "cosignatairesRefs": [
      "PA719608"
    ],
    "texteAffichable": "Mme&#160;M&#233;nard"
  },
  "pointeurFragmentTexte": {
    "division": {
      "titre": "Article 5",
      "articleDesignationCourte": "APRÈS ART. 5",
      "type": "ARTICLE",
      "avantAApres": "Apres",
      "divisionRattachee": "APRÈS L'ARTICLE 5, insérer l'article suivant:",
      "articleAdditionnel": "1",
      "urlDivisionTexteVise": "/15/textes/2187.asp#D_Article_5"
    }
  },
  "corps": {
    "dispositif": "<p style=\"text-align: justify;\">Au d&#233;but du chapitre I<sup>er</sup> du titre III du livre II de la premi&#232;re partie du code de la sant&#233; publique, il est ins&#233;r&#233; un article L.&#160;1231&#8209;1&#160;A ainsi r&#233;dig&#233; </p><p style=\"text-align: justify;\">&#171;&#160;<i>Art.&#160;L.&#160;1231&#8209;1</i>&#160;A.&#160;&#8211;&#160;Des coordinateurs de pr&#233;l&#232;vements sont nomm&#233;s dans toutes les cliniques et h&#244;pitaux pour qu&#8217;ils se tiennent au courant de l&#8217;existence de donneurs potentiels et qu&#8217;ils dialoguent avec les familles et ces donneurs, avant et apr&#232;s leur d&#233;c&#232;s.&#160;&#187;</p>",
    "exposeSommaire": "<p style=\"text-align: justify;\">Il s&#8217;agit ici de nommer des personnes qui accompagnent les patients et les familles pour qu&#8217;elles se sentent accompagn&#233;es et qu&#8217;elles puissent prendre toutes les d&#233;cisions m&#233;dicales en connaissance de cause.</p>"
  },
  "representations": [
    {
      "nom": "PDF",
      "typeMime": {
        "type": "application",
        "subType": "PDF"
      },
      "statutRepresentation": {
        "verbatim": true,
        "canonique": true,
        "officielle": true,
        "transcription": false,
        "enregistrement": false
      },
      "contenu": {
        "documentURI": "/15/amendements/2187/CSBIOETH/1279.pdf"
      }
    }
  ],
  "sort": {
    "dateSaisie": "2019-09-13T01:48:28.000+02:00",
    "sortEnSeance": "Rejeté"
  },
  "dateDepot": "2019-09-05T02:00:00.000+02:00",
  "dateDistribution": "2019-09-11T02:00:00.000+02:00",
  "article99": "0",
  "loiReference": {
    "codeLoi": "c santé publique",
    "divisionCodeLoi": "L1231-1"
  }
}