{
  "uid": "AMANR5L15PO757134B1673P0D1N954",
  "identifiant": {
    "legislature": "15",
    "numero": "954",
    "numRect": "0",
    "saisine": {
      "texteLegislatifRef": "PRJLANR5L15B1673",
      "numeroPartiePLF": "0",
      "organeExamen": "PO757134",
      "mentionSecondeDeliberation": "0"
    }
  },
  "numeroLong": "954",
  "etapeTexte": "Nouvelle Lecture",
  "triAmendement": "saaaaaaaaaaaaaaaaaaaaaaaaaaaaaaaaaaaaaaaaaaaaaaaaaaoi",
  "cardinaliteAmdtMultiples": "1",
  "etat": "Discuté",
  "signataires": {
    "auteur": {
      "typeAuteur": "Depute",
      "acteurRef": "PA719684",
      "groupePolitiqueRef": "PO730964"
    },
    "cosignatairesRefs": [
      "PA721134",
      "PA719684"
    ],
    "texteAffichable": "Mme&#160;Dubost, rapporteure th&#233;matique et M.&#160;Lescure, rapporteur"
  },
  "pointeurFragmentTexte": {
    "division": {
      "titre": "Article 71",
      "articleDesignationCourte": "ART. 71",
      "type": "ARTICLE",
      "avantAApres": "A",
      "divisionRattachee": "ARTICLE 71",
      "urlDivisionTexteVise": "/15/textes/1673.asp#D_Article_71"
    },
    "alinea": {
      "numero": "1"
    }
  },
  "corps": {
    "dispositif": "<p>Supprimer le a du 1&#176; du C du VII de l&#8217;alin&#233;a&#160;1.</p>",
    "exposeSommaire": "<p>Cet amendement vise &#224; supprimer une incoh&#233;rence r&#233;dactionnelle entre les dispositions de l&#8217;article&#160;71 et celles du nouvel article&#160;69 <i>ter</i>, qui pr&#233;voient le d&#233;sassujettissement des syndics immobiliers en mati&#232;re de lutte contre le blanchiment de capitaux et le financement du terrorisme.</p>"
  },
  "representations": [
    {
      "nom": "PDF",
      "typeMime": {
        "type": "application",
        "subType": "PDF"
      },
      "statutRepresentation": {
        "verbatim": true,
        "canonique": true,
        "officielle": true,
        "transcription": false,
        "enregistrement": false
      },
      "contenu": {
        "documentURI": "/15/amendements/1673/CSPACTE/954.pdf"
      }
    }
  ],
  "sort": {
    "dateSaisie": "2019-03-07T17:00:01.000+01:00",
    "sortEnSeance": "Adopté"
  },
  "dateDepot": "2019-03-01T01:00:00.000+01:00",
  "dateDistribution": "2019-03-06T01:00:00.000+01:00",
  "article99": "0",
  "loiReference": {
    "codeLoi": "s31"
  }
}