{
  "uid": "AMANR5L15PO419604B1881P0D1N108",
  "identifiant": {
    "legislature": "15",
    "numero": "108",
    "numRect": "0",
    "saisine": {
      "texteLegislatifRef": "PRJLANR5L15B1881",
      "numeroPartiePLF": "0",
      "organeExamen": "PO419604",
      "mentionSecondeDeliberation": "0"
    }
  },
  "numeroLong": "AC108",
  "etapeTexte": "1ère lecture (1ère assemblée saisie)",
  "triAmendement": "aoaaaaaaaaaaaaaaaaaaaaaaaaaaaaaaaaaaaaaaaaaaaaaaaaf",
  "cardinaliteAmdtMultiples": "1",
  "etat": "Discuté",
  "signataires": {
    "auteur": {
      "typeAuteur": "Depute",
      "acteurRef": "PA719640",
      "groupePolitiqueRef": "PO730970"
    },
    "cosignatairesRefs": [
      "PA719640"
    ],
    "texteAffichable": "Mme&#160;Mette"
  },
  "pointeurFragmentTexte": {
    "division": {
      "titre": "Article PREMIER",
      "articleDesignationCourte": "ART. PREMIER",
      "type": "ARTICLE",
      "avantAApres": "A",
      "divisionRattachee": "ARTICLE PREMIER",
      "urlDivisionTexteVise": "/15/textes/1881.asp#D_Article_1er"
    },
    "alinea": {
      "numero": "1"
    }
  },
  "corps": {
    "dispositif": "<p style=\"text-align: justify;\">&#192; l&#8217;alin&#233;a&#160;1, substituer aux mots&#160;:</p><p style=\"text-align: justify;\">&#171;&#160;et la conservation&#160;&#187;</p><p style=\"text-align: justify;\">les mots&#160;:</p><p style=\"text-align: justify;\">&#171;&#160;, la conservation et l&#8217;entretien&#160;&#187;.</p><p style=\"text-align: justify;\">&#160;</p>",
    "exposeSommaire": "<p style=\"text-align: justify;\">Cet amendement a pour objet d&#8217;apporter une r&#233;ponse &#224; l&#8217;une des causes&#160;qui a conduit &#224; cet &#233;v&#233;nement tragique&#160;: l&#8217;entretient de notre patrimoine.</p><p style=\"text-align: justify;\">Il faut imp&#233;rativement mieux entretenir notre patrimoine pour ne pas avoir &#224; le restaurer.&#160;</p><p style=\"text-align: justify;\">De plus cet amendement permettra de justifier l&#8217;utilisation des fonds issus de la souscription nationale en int&#233;gralit&#233; pour Notre-Dame, une fois que la restauration et la conservation de celle-ci seront assur&#233;es.</p>"
  },
  "representations": [
    {
      "nom": "PDF",
      "typeMime": {
        "type": "application",
        "subType": "PDF"
      },
      "statutRepresentation": {
        "verbatim": true,
        "canonique": true,
        "officielle": true,
        "transcription": false,
        "enregistrement": false
      },
      "contenu": {
        "documentURI": "/15/amendements/1881/CION-CEDU/AC108.pdf"
      }
    }
  ],
  "sort": {
    "dateSaisie": "2019-05-02T11:04:11.000+02:00",
    "sortEnSeance": "Tombé"
  },
  "dateDepot": "2019-04-27T02:00:00.000+02:00",
  "dateDistribution": "2019-05-02T02:00:00.000+02:00",
  "article99": "0",
  "loiReference": {}
}