{
  "uid": "AMANR5L15PO420120B1681P0D1N710",
  "identifiant": {
    "legislature": "15",
    "numero": "710",
    "numRect": "0",
    "saisine": {
      "texteLegislatifRef": "PRJLANR5L15B1681",
      "numeroPartiePLF": "0",
      "organeExamen": "PO420120",
      "mentionSecondeDeliberation": "0"
    }
  },
  "numeroLong": "AS710",
  "etapeTexte": "1ère lecture (1ère assemblée saisie)",
  "triAmendement": "auaaaaaaaaaaaaaaaaaaaaaaaaaaaaaaaaaaaaaaaaaaaaaaaaanzu",
  "cardinaliteAmdtMultiples": "1",
  "etat": "Discuté",
  "signataires": {
    "auteur": {
      "typeAuteur": "Depute",
      "acteurRef": "PA331582",
      "groupePolitiqueRef": "PO759900"
    },
    "cosignatairesRefs": [
      "PA331582",
      "PA608292"
    ],
    "texteAffichable": "M.&#160;Philippe&#160;Vigier et Mme&#160;Dubi&#233;"
  },
  "pointeurFragmentTexte": {
    "division": {
      "titre": "Article 4",
      "articleDesignationCourte": "ART. 4",
      "type": "ARTICLE",
      "avantAApres": "A",
      "divisionRattachee": "ARTICLE 4",
      "urlDivisionTexteVise": "/15/textes/1681.asp#D_Article_4"
    },
    "alinea": {
      "avantAApres": "Apres",
      "numero": "18"
    }
  },
  "corps": {
    "dispositif": "<p>Apr&#232;s l&#8217;alin&#233;a&#160;18, ins&#233;rer l&#8217;alin&#233;a suivant&#160;:</p><p style=\"text-align: justify;\">&#171;&#160;<i>c)&#160;(nouveau)</i>&#160;Apr&#232;s la premi&#232;re phrase, il est ins&#233;r&#233; une phrase ainsi r&#233;dig&#233;e&#160;: &#171;&#160;Ces lieux d&#8217;exercice sont &#233;galement situ&#233;s dans des &#233;tablissements et services sociaux et m&#233;dico-sociaux d&#233;finis au I du L.&#160;312&#8209;1 du code de l&#8217;action sociale et des familles.&#160;&#187;&#160;;&#160;&#187;.</p>",
    "exposeSommaire": "<p style=\"text-align: justify;\">&#160;Les contrats d&#8217;engagement de service public ont pour objet d&#8217;inciter les futurs m&#233;decins &#224; s&#8217;installer dans des zones en sous-densit&#233; m&#233;dicale. Or, m&#234;me dans des zones qui ne sont pas consid&#233;r&#233;es comme des zones sous-dot&#233;es en offre de soins, les &#233;tablissements et services sociaux et m&#233;dico-sociaux peinent &#224; recruter des m&#233;decins.</p><p>&#160;Les &#233;tablissements et services sociaux et m&#233;dico-sociaux accompagnent des personnes souvent &#233;loign&#233;es du syst&#232;me de sant&#233; (personnes en situation de handicap, personnes &#226;g&#233;es et personnes en situation de pr&#233;carit&#233;), dont les difficult&#233;s d&#8217;acc&#232;s aux soins ont &#233;t&#233; soulign&#233;es par diff&#233;rents rapports.</p><p>&#160;L&#8217;objet de cet amendement est d&#8217;&#233;tendre aux &#233;tablissements et services sociaux et m&#233;dico-sociaux la liste nationale des lieux d&#8217;exercice, parmi lesquels les signataires d&#8217;un contrat d&#8217;engagement de service public choisissent leur futur lieu d&#8217;exercice. Cette liste est fix&#233;e selon les conditions pr&#233;vues par voie r&#233;glementaire, par le centre national de gestion sur propositions des Agences r&#233;gionales de sant&#233;.</p>"
  },
  "representations": [
    {
      "nom": "PDF",
      "typeMime": {
        "type": "application",
        "subType": "PDF"
      },
      "statutRepresentation": {
        "verbatim": true,
        "canonique": true,
        "officielle": true,
        "transcription": false,
        "enregistrement": false
      },
      "contenu": {
        "documentURI": "/15/amendements/1681/CION-SOC/AS710.pdf"
      }
    }
  ],
  "sort": {
    "dateSaisie": "2019-03-12T22:37:08.000+01:00",
    "sortEnSeance": "Rejeté"
  },
  "dateDepot": "2019-03-08T01:00:00.000+01:00",
  "dateDistribution": "2019-03-12T01:00:00.000+01:00",
  "article99": "0",
  "loiReference": {}
}