{
  "uid": "AMANR5L15SEA717460BTC1662P0D1N169",
  "identifiant": {
    "legislature": "15",
    "numero": "169",
    "numRect": "0",
    "saisine": {
      "texteLegislatifRef": "PIONANR5L15BTC1662",
      "numeroPartiePLF": "0",
      "organeExamen": "PO717460",
      "mentionSecondeDeliberation": "0"
    }
  },
  "numeroLong": "169",
  "etapeTexte": "1ère lecture (2ème assemblée saisie)",
  "triAmendement": "aiaaaaaaaaaaaaaaaaaaaaaaaaaaaaaaaaaaaaaaaaaaaaaaaajns",
  "cardinaliteAmdtMultiples": "1",
  "etat": "Discuté",
  "signataires": {
    "auteur": {
      "typeAuteur": "Depute",
      "acteurRef": "PA721474",
      "groupePolitiqueRef": "PO730934"
    },
    "cosignatairesRefs": [
      "PA266776",
      "PA718780",
      "PA267735",
      "PA721070",
      "PA721816",
      "PA643134",
      "PA721286",
      "PA720684",
      "PA2155",
      "PA721474",
      "PA334654",
      "PA346218",
      "PA267260",
      "PA266793"
    ],
    "texteAffichable": "M.&#160;Viry,  M.&#160;Bony, M.&#160;Boucard, M.&#160;de Ganay, M.&#160;Pierre-Henri&#160;Dumont, M.&#160;Masson, M.&#160;Menuel, Mme&#160;Poletti, M.&#160;Ramadier, Mme&#160;Ramassamy, M.&#160;Reiss, M.&#160;Straumann, Mme&#160;Trastour-Isnart et Mme&#160;Valentin"
  },
  "pointeurFragmentTexte": {
    "division": {
      "titre": "Article PREMIER",
      "articleDesignationCourte": "ART. PREMIER",
      "type": "ARTICLE",
      "avantAApres": "A",
      "divisionRattachee": "ARTICLE PREMIER",
      "urlDivisionTexteVise": "/15/textes/1662.asp#D_Article_1er"
    },
    "alinea": {
      "numero": "7"
    }
  },
  "corps": {
    "dispositif": "<p>Compl&#233;ter l&#8217;alin&#233;a&#160;7 par les mots&#160;:</p><p style=\"text-align: justify;\">&#171;&#160;et s&#8217;appuie sur une organisation d&#233;concentr&#233;e au niveau r&#233;gional&#160;&#187;.</p>",
    "exposeSommaire": "<p style=\"text-align: justify;\">L&#8217;exercice des missions de cette agence ne peut se concevoir que de fa&#231;on d&#233;concentr&#233;e et aux niveaux r&#233;gional et d&#233;partemental. C&#8217;est en effet &#224; ce niveau que sont d&#233;finis et mis en &#339;uvre un certain nombre de politiques et dispositifs en faveur de l&#8217;am&#233;nagement du territoire et de la coh&#233;sion territoriale (volet territorial des contrats de plan &#201;tat-r&#233;gion, programmes r&#233;gionaux pour les fonds europ&#233;ens, sch&#233;ma r&#233;gional de d&#233;veloppement durable et d&#8217;&#233;galit&#233; des territoires, sch&#233;ma r&#233;gional de d&#233;veloppement &#233;conomique, d&#8217;innovation et d&#8217;internationalisation&#8230;).</p>"
  },
  "representations": [
    {
      "nom": "PDF",
      "typeMime": {
        "type": "application",
        "subType": "PDF"
      },
      "statutRepresentation": {
        "verbatim": true,
        "canonique": true,
        "officielle": true,
        "transcription": false,
        "enregistrement": false
      },
      "contenu": {
        "documentURI": "/15/amendements/1662/AN/169.pdf"
      }
    }
  ],
  "seanceDiscussion": "RUANR5L15S2019IDS21543",
  "sort": {
    "dateSaisie": "2019-03-11T23:22:02.000+01:00",
    "sortEnSeance": "Rejeté"
  },
  "dateDepot": "2019-02-26T01:00:00.000+01:00",
  "dateDistribution": "2019-03-08T01:00:00.000+01:00",
  "article99": "0",
  "loiReference": {}
}