{
  "uid": "AMANR5L15PO419610B0155P0D1N6",
  "identifiant": {
    "legislature": "15",
    "numero": "6",
    "numRect": "0",
    "saisine": {
      "texteLegislatifRef": "PRJLANR5L15B0155",
      "numeroPartiePLF": "0",
      "organeExamen": "PO419610",
      "mentionSecondeDeliberation": "0"
    }
  },
  "numeroLong": "CE6",
  "etapeTexte": "1ère lecture (1ère assemblée saisie)",
  "triAmendement": "hzzzzzzzw",
  "cardinaliteAmdtMultiples": "1",
  "etat": "Discuté",
  "signataires": {
    "auteur": {
      "typeAuteur": "Depute",
      "acteurRef": "PA718860",
      "groupePolitiqueRef": "PO730958"
    },
    "cosignatairesRefs": [
      "PA719578",
      "PA721226",
      "PA720430",
      "PA722142",
      "PA2150",
      "PA721202",
      "PA718860",
      "PA720286",
      "PA721210",
      "PA588884",
      "PA719676",
      "PA721960",
      "PA720892",
      "PA720422",
      "PA720846",
      "PA721062",
      "PA718868"
    ],
    "texteAffichable": "Mme&#160;Taurine,  Mme&#160;Autain, M.&#160;Ruffin, Mme&#160;Rubin, M.&#160;Ratenon, Mme&#160;Ressiguier, M.&#160;Quatennens, M.&#160;Prud&apos;homme, Mme&#160;Obono, Mme&#160;Panot, M.&#160;Larive, M.&#160;M&#233;lenchon, M.&#160;Lachaud, Mme&#160;Fiat, M.&#160;Coquerel, M.&#160;Corbi&#232;re et M.&#160;Bernalicis"
  },
  "pointeurFragmentTexte": {
    "division": {
      "titre": "Article 4",
      "articleDesignationCourte": "ART. 4",
      "type": "ARTICLE",
      "avantAApres": "A",
      "divisionRattachee": "ARTICLE 4",
      "urlDivisionTexteVise": "/15/textes/0155.asp#D_Article_4"
    },
    "alinea": {
      "numero": "7"
    }
  },
  "corps": {
    "dispositif": "<p style=\"text-align: justify;\">&#192; l&#8217;alin&#233;a&#160;7, supprimer les mots&#160;: &#171;&#160;ainsi qu&#8217;en modifiant les tarifs d&#8217;utilisation des r&#233;seaux de transport et de distribution de gaz naturel applicables aux sites fortement consommateurs.&#160;&#187;</p>",
    "exposeSommaire": "<p style=\"text-align: justify;\">Par cet amendement nous supprimons la possibilit&#233; pour le gouvernement de baisser les tarifs des plus gros consommateurs comme il indique vouloir le faire dans son &#233;tude d&#8217;impact. Cette volont&#233; n&#8217;y est pas justifi&#233;e et par cons&#233;quent nous nous y opposons. Dans la perspective de la transition &#233;cologique, ces sites fortement consommateurs de gaz naturel doivent &#234;tre amen&#233;s &#224; r&#233;duire leur consommation et non &#224; l&#8217;augmenter comme cette mesure pourraient les y encourager. De plus, cette mesure pourrait conduire &#224; un transfert de charge vers d&#8217;autres consommateurs, les particuliers par exemple, comme l&#8217;indique l&#8217;&#233;tude d&#8217;impact.</p>"
  },
  "representations": [
    {
      "nom": "PDF",
      "typeMime": {
        "type": "application",
        "subType": "PDF"
      },
      "statutRepresentation": {
        "verbatim": true,
        "canonique": true,
        "officielle": true,
        "transcription": false,
        "enregistrement": false
      },
      "contenu": {
        "documentURI": "/15/amendements/0155/CION-ECO/CE6.pdf"
      }
    }
  ],
  "sort": {
    "dateSaisie": "2017-09-25T17:37:47.000+02:00",
    "sortEnSeance": "Rejeté"
  },
  "dateDepot": "2017-09-21T02:00:00.000+02:00",
  "dateDistribution": "2017-09-23T02:00:00.000+02:00",
  "article99": "0",
  "loiReference": {}
}