{
  "uid": "AMANR5L15PO419865B1831P0D1N3211",
  "identifiant": {
    "legislature": "15",
    "numero": "3211",
    "numRect": "0",
    "saisine": {
      "texteLegislatifRef": "PRJLANR5L15B1831",
      "numeroPartiePLF": "0",
      "organeExamen": "PO419865",
      "mentionSecondeDeliberation": "0"
    }
  },
  "numeroLong": "CD3211",
  "etapeTexte": "1ère lecture (2ème assemblée saisie)",
  "triAmendement": "aoiaaaaaaaaaaaaaaaaaaaaaaaaaaaaaaaaaaaaaaaaaaaaaaakmq",
  "cardinaliteAmdtMultiples": "1",
  "amendementParent": "AMANR5L15PO419865B1831P0D1N840",
  "etat": "Discuté",
  "signataires": {
    "auteur": {
      "typeAuteur": "Depute",
      "acteurRef": "PA721372",
      "groupePolitiqueRef": "PO730964"
    },
    "cosignatairesRefs": [
      "PA721600",
      "PA719194",
      "PA722228",
      "PA718962",
      "PA722336",
      "PA718894",
      "PA720054",
      "PA719718",
      "PA719412",
      "PA721860",
      "PA719972",
      "PA720038",
      "PA721876",
      "PA609520",
      "PA719080",
      "PA719922",
      "PA719882",
      "PA721372",
      "PA718802",
      "PA719092",
      "PA718710",
      "PA720806",
      "PA721426",
      "PA719632",
      "PA722000",
      "PA720310",
      "PA721514",
      "PA720538",
      "PA719740",
      "PA605084",
      "PA722236",
      "PA719890",
      "PA720414"
    ],
    "texteAffichable": "M.&#160;Pichereau,  M.&#160;Zulesi, M.&#160;Colas-Roy, M.&#160;Arend, Mme&#160;Pascale&#160;Boyer, Mme&#160;Brulebois, M.&#160;Buchou, M.&#160;Causse, M.&#160;Cesarini, Mme&#160;Yolaine&#160;de Courson, Mme&#160;De Temmerman, M.&#160;Djebbari, M.&#160;Dombreval, Mme&#160;Gayte, M.&#160;Haury, Mme&#160;Josso, Mme&#160;Kerbarh, M.&#160;Krabal, Mme&#160;Le Feur, M.&#160;Leclabart, Mme&#160;Maillart-M&#233;haignerie, Mme&#160;Marsaud, Mme&#160;Meynier-Millefert, M.&#160;Morenas, Mme&#160;Panonacle, M.&#160;Perea, M.&#160;Perrot, Mme&#160;Pompili, Mme&#160;Riotton, Mme&#160;Rossi, Mme&#160;Sarles, M.&#160;Thi&#233;baut, Mme&#160;Tuffnell et les membres du groupe La R&#233;publique en Marche"
  },
  "pointeurFragmentTexte": {
    "division": {
      "titre": "Article 4",
      "articleDesignationCourte": "ART. 4",
      "type": "ARTICLE",
      "avantAApres": "A",
      "divisionRattachee": "ARTICLE 4",
      "urlDivisionTexteVise": "/15/textes/1831.asp#D_Article_4"
    },
    "alinea": {
      "numero": "16"
    }
  },
  "corps": {
    "dispositif": "<p style=\"text-align: justify;\">Apr&#232;s le mot&#160;:</p><p style=\"text-align: justify;\">&#171;&#160;mi-parcours&#160;&#187;,</p><p style=\"text-align: justify;\">r&#233;diger ainsi la fin du deuxi&#232;me alin&#233;a&#160;:</p><p style=\"text-align: justify;\">&#171;&#160;et d&#8217;un bilan annuel, pr&#233;sent&#233;s aux comit&#233;s des partenaires mentionn&#233;s &#224; l&#8217;article L.&#160;1231&#8209;5&#160;&#187;.</p>",
    "exposeSommaire": "<p style=\"text-align: justify;\">Si nous partageons l&#8217;objectif de ces amendements, nous proposons de conserver le bilan annuel, pr&#233;sent&#233; aux comit&#233;s des partenaires, pr&#233;vu initialement dans le projet de loi.</p>"
  },
  "representations": [
    {
      "nom": "PDF",
      "typeMime": {
        "type": "application",
        "subType": "PDF"
      },
      "statutRepresentation": {
        "verbatim": true,
        "canonique": true,
        "officielle": true,
        "transcription": false,
        "enregistrement": false
      },
      "contenu": {
        "documentURI": "/15/amendements/1831/CION-DVP/CD3211.pdf"
      }
    }
  ],
  "sort": {
    "dateSaisie": "2019-05-16T12:16:05.000+02:00",
    "sortEnSeance": "Adopté"
  },
  "dateDepot": "2019-05-15T02:00:00.000+02:00",
  "dateDistribution": "2019-05-15T02:00:00.000+02:00",
  "article99": "0",
  "loiReference": {}
}