{
  "uid": "AMANR5L15SEA717460BTC1761P0D1N350",
  "identifiant": {
    "legislature": "15",
    "numero": "350",
    "numRect": "0",
    "saisine": {
      "texteLegislatifRef": "PRJLANR5L15BTC1761",
      "numeroPartiePLF": "0",
      "organeExamen": "PO717460",
      "mentionSecondeDeliberation": "0"
    }
  },
  "numeroLong": "350",
  "etapeTexte": "Nouvelle Lecture",
  "triAmendement": "ibcaaaaaaaaaaaaaaaaaaaaaaaaaaaaaaaaaaaaaaaaaaaaaaak",
  "cardinaliteAmdtMultiples": "1",
  "etat": "Discuté",
  "signataires": {
    "auteur": {
      "typeAuteur": "Depute",
      "acteurRef": "PA721270",
      "groupePolitiqueRef": "PO730940"
    },
    "cosignatairesRefs": [
      "PA610667",
      "PA720692",
      "PA721012",
      "PA721270",
      "PA335612",
      "PA689",
      "PA718926",
      "PA722110",
      "PA718720",
      "PA722202",
      "PA441",
      "PA610654",
      "PA721118",
      "PA720546",
      "PA267306",
      "PA721896"
    ],
    "texteAffichable": "M.&#160;Peu,  M.&#160;Dharr&#233;ville, M.&#160;Jumel, Mme&#160;Bello, M.&#160;Brotherson, M.&#160;Bruneel, Mme&#160;Buffet, M.&#160;Chassaigne, M.&#160;Dufr&#232;gne, Mme&#160;Faucillon, Mme&#160;K&#233;clard-Mond&#233;sir, M.&#160;Lecoq, M.&#160;Nilor, M.&#160;Fabien&#160;Roussel, M.&#160;Serville et M.&#160;Wulfranc"
  },
  "pointeurFragmentTexte": {
    "division": {
      "titre": "Article 41",
      "articleDesignationCourte": "ART. 41",
      "type": "ARTICLE",
      "avantAApres": "A",
      "divisionRattachee": "ARTICLE 41",
      "urlDivisionTexteVise": "/15/textes/1761.asp#D_Article_41"
    },
    "alinea": {
      "numero": "9"
    }
  },
  "corps": {
    "dispositif": "<p>I.&#160;&#8211;&#160;&#192; l&#8217;alin&#233;a&#160;9, substituer aux mots&#160;:</p><p style=\"text-align: justify;\">&#171;&#160;est tenue inform&#233;e&#160;&#187;</p><p style=\"text-align: justify;\">les mots&#160;:</p><p style=\"text-align: justify;\">&#171;&#160;ainsi que la commission mentionn&#233;e &#224; l&#8217;article&#160;25<i>&#160;<i>octies</i></i> de la loi&#160;n&#176;&#160;83&#8209;634 du 13&#160;d&#233;cembre 1983 portant droits et obligations des fonctionnaires sont tenues inform&#233;es&#160;&#187;.</p><p style=\"text-align: justify;\">II.&#160;&#8211;&#160;En cons&#233;quence, compl&#233;ter l&#8217;alin&#233;a&#160;15 par la phrase suivante&#160;:</p><p style=\"text-align: justify;\">&#171;&#160;Le contrat est transmis pour avis &#224; la commission mentionn&#233;e &#224; l&#8217;article&#160;25<i>&#160;<i>octies</i></i> de la loi&#160;n&#176;&#160;83&#8209;634 du 13&#160;d&#233;cembre 1983 portant droits et obligations des fonctionnaires.&#160;&#187;</p><p style=\"text-align: justify;\">III.&#160;&#8211;&#160;En cons&#233;quence, supprimer l&#8217;alin&#233;a&#160;23.</p><p style=\"text-align: justify;\">IV.&#160;&#8211;&#160;En cons&#233;quence, supprimer l&#8217;alin&#233;a&#160;32.</p><p style=\"text-align: justify;\">V.&#160;&#8211;&#160; En cons&#233;quence, &#224; l&#8217;alin&#233;a&#160;36, apr&#232;s le mot&#160;:</p><p style=\"text-align: justify;\">&#171;&#160;fonctionnaire&#160;&#187;,</p><p style=\"text-align: justify;\">ins&#233;rer les mots&#160;:</p><p style=\"text-align: justify;\">&#171;&#160;, apr&#232;s avis de la commission mentionn&#233;e &#224; l&#8217;article&#160;25&#160;<i>octies</i> de la loi&#160;n&#176;&#160;83&#8209;634 du 13&#160;d&#233;cembre 1983 portant droits et obligations des fonctionnaires,&#160;&#187;.</p><p style=\"text-align: justify;\">VI.&#160;&#8211;&#160;En cons&#233;quence, supprimer l&#8217;alin&#233;a&#160;42.</p><p style=\"text-align: justify;\">VII.&#160;&#8211;&#160;En cons&#233;quence, &#224; la seconde phrase de l&#8217;alin&#233;a&#160;44, apr&#232;s le mot&#160;:</p><p style=\"text-align: justify;\">&#171;&#160;autorit&#233;&#160;&#187;,</p><p style=\"text-align: justify;\">ins&#233;rer les mots&#160;:</p><p style=\"text-align: justify;\">&#171;&#160;ainsi que la commission mentionn&#233;e &#224; l&#8217;article&#160;25<i>&#160;<i>octies</i></i> de la loi&#160;n&#176;&#160;83&#8209;634 du 13&#160;d&#233;cembre 1983 portant droits et obligations des fonctionnaires&#160;&#187;.</p><p style=\"text-align: justify;\">VIII.&#160;&#8211;&#160;En cons&#233;quence, supprimer l&#8217;alin&#233;a&#160;45.</p>",
    "exposeSommaire": "<p style=\"text-align: justify;\">Amendement de repli.</p><p style=\"text-align: justify;\">Il s&#8217;agit par cet amendement de r&#233;tablir la commission de d&#233;ontologie des fonctionnaires dans le processus de mise en d&#233;tachement des chercheurs dans le cadre de la cr&#233;ation d&#8217;entreprise ou de prise de participation ou de concours dans une entreprise existante. Alors que le Gouvernement entend rappeler aux fonctionnaires d&#8217;&#201;tat leur devoir de r&#233;serve et de d&#233;vouement au service public, l&#8217;article&#160;41 v&#233;hicule le message inverse.</p>"
  },
  "representations": [
    {
      "nom": "PDF",
      "typeMime": {
        "type": "application",
        "subType": "PDF"
      },
      "statutRepresentation": {
        "verbatim": true,
        "canonique": true,
        "officielle": true,
        "transcription": false,
        "enregistrement": false
      },
      "contenu": {
        "documentURI": "/15/amendements/1761/AN/350.pdf"
      }
    }
  ],
  "seanceDiscussion": "RUANR5L15S2019IDS21553",
  "sort": {
    "dateSaisie": "2019-03-16T00:32:15.000+01:00",
    "sortEnSeance": "Rejeté"
  },
  "dateDepot": "2019-03-09T01:00:00.000+01:00",
  "dateDistribution": "2019-03-12T01:00:00.000+01:00",
  "article99": "0",
  "loiReference": {}
}