{
  "uid": "AMANR5L15SEA717460B1490P0D1N1049",
  "identifiant": {
    "legislature": "15",
    "numero": "1049",
    "numRect": "0",
    "saisine": {
      "texteLegislatifRef": "PRJLANR5L15B1490",
      "numeroPartiePLF": "0",
      "organeExamen": "PO717460",
      "mentionSecondeDeliberation": "0"
    }
  },
  "numeroLong": "1049",
  "etapeTexte": "Nouvelle Lecture",
  "triAmendement": "ebuaaaaaaaaaaaaaaaaaaaaaaaaaaaaaaaaaaaaaaaaaaaaaaau",
  "cardinaliteAmdtMultiples": "1",
  "etat": "Discuté",
  "signataires": {
    "auteur": {
      "typeAuteur": "Depute",
      "acteurRef": "PA721226",
      "groupePolitiqueRef": "PO730958"
    },
    "cosignatairesRefs": [
      "PA722142",
      "PA721210",
      "PA720846",
      "PA2150",
      "PA721202",
      "PA720892",
      "PA719676",
      "PA588884",
      "PA718860",
      "PA720286",
      "PA720422",
      "PA721960",
      "PA720430",
      "PA721062",
      "PA719578",
      "PA721226",
      "PA718868"
    ],
    "texteAffichable": "Mme&#160;Rubin,  Mme&#160;Autain, M.&#160;Bernalicis, M.&#160;Coquerel, M.&#160;Corbi&#232;re, Mme&#160;Fiat, M.&#160;Lachaud, M.&#160;Larive, M.&#160;M&#233;lenchon, Mme&#160;Obono, Mme&#160;Panot, M.&#160;Prud&apos;homme, M.&#160;Quatennens, M.&#160;Ratenon, Mme&#160;Ressiguier, M.&#160;Ruffin et Mme&#160;Taurine"
  },
  "pointeurFragmentTexte": {
    "missionVisee": {
      "idMissionAN": "737",
      "libelleMission": "Participations financières de l'État",
      "codeMissionPLF": "D",
      "libelleMissionPLF": "Répartition, par mission et programme, des crédits des comptes d’affectation spéciale et des comptes de concours financiers"
    },
    "division": {
      "titre": "ÉTAT D",
      "articleDesignationCourte": "ART. 41",
      "type": "ANNEXE",
      "avantAApres": "A",
      "divisionRattachee": "ARTICLE 41",
      "urlDivisionTexteVise": "/15/textes/1490.asp#D_Etat_D"
    }
  },
  "corps": {
    "exposeSommaire": "<p style=\"text-align: justify;\">Cet amendement vise &#224; transf&#233;rer des cr&#233;dits de l&#8217;action 1 du programme &#171;&#160;D&#233;sendettement de l&#8217;&#201;tat et d&#8217;&#233;tablissements publics de l&#8217;&#201;tat&#160;&#187; vers l&#8217;action 1 &#171;&#160;Augmentations de capital, dotations en fonds propres, avances d&#8217;actionnaire et pr&#234;ts assimil&#233;s&#160;&#187; du programme &#171;&#160;Op&#233;rations en capital int&#233;ressant les participations financi&#232;res de l&#8217;&#201;tat&#160;&#187;. Le montant de ce transfert s&#8217;&#233;l&#232;ve &#224; un milliard d&#8217;euros.</p><p style=\"text-align: justify;\">L&#8217;&#201;tat ne d&#233;tient plus que 24,1&#160;% du capital d&#8217;Engie et, du fait du projet de loi PACTE, il pourrait m&#234;me se d&#233;sengager totalement de cette entreprise. Or, l&#8217;&#233;nergie est un secteur strat&#233;gique qui doit &#234;tre g&#233;r&#233; par la puissance publique. Avec une privatisation totale, les tarifs pourraient augmenter et les investissements dans le renouvelable pourraient diminuer, pour faire augmenter les profits de court terme. Nous observons d&#233;j&#224; cette logique au travers des hausses records des prix du gaz qui vont atteindre +5,4&#160;% au 1<sup>er</sup> novembre, un mois apr&#232;s la hausse de +3&#160;% du 1<sup>er</sup> octobre, soit une hausse totale de 16,4&#160;% cette ann&#233;e&#160;! Pourtant, c&#8217;est bien d&#8217;une vision &#233;tatique de long terme dont le secteur &#233;nerg&#233;tique a besoin&#160;! Notons &#224; ce titre que notre programme L&#8217;avenir en commun proposait de cr&#233;er un p&#244;le public &#233;nerg&#233;tique pour contr&#244;ler les prix et les investissements.</p><p style=\"text-align: justify;\">Nous pensons donc au contraire que l&#8217;&#201;tat devrait r&#233;investir le secteur de l&#8217;&#233;nergie, en rachetant des parts d&#8217;Engie. C&#8217;est ce que nous proposons dans cet amendement.</p>",
    "dispositifAmdtCredit": {
      "listeProgrammes": [
        {
          "libelle": "Opérations en capital intéressant les participations financières de l'État",
          "id": "57490",
          "AE": {
            "montantPositif": "999999999",
            "montantNegatif": "0"
          },
          "CP": {
            "montantPositif": "999999999",
            "montantNegatif": "0"
          },
          "action": "modification"
        },
        {
          "libelle": "Désendettement de l'État et d'établissements publics de l'État",
          "id": "57491",
          "AE": {
            "montantPositif": "0",
            "montantNegatif": "999999999"
          },
          "CP": {
            "montantPositif": "0",
            "montantNegatif": "999999999"
          },
          "action": "modification"
        }
      ],
      "totalAE": {
        "montantPositif": "999999999",
        "montantNegatif": "999999999",
        "solde": "0"
      },
      "totalCP": {
        "montantPositif": "999999999",
        "montantNegatif": "999999999",
        "solde": "0"
      }
    }
  },
  "representations": [
    {
      "nom": "PDF",
      "typeMime": {
        "type": "application",
        "subType": "PDF"
      },
      "statutRepresentation": {
        "verbatim": true,
        "canonique": true,
        "officielle": true,
        "transcription": false,
        "enregistrement": false
      },
      "contenu": {
        "documentURI": "/15/amendements/1490/AN/1049.pdf"
      }
    }
  ],
  "seanceDiscussion": "RUANR5L15S2019IDS21433",
  "sort": {
    "dateSaisie": "2018-12-19T02:52:02.000+01:00",
    "sortEnSeance": "Rejeté"
  },
  "dateDepot": "2018-12-14T01:00:00.000+01:00",
  "dateDistribution": "2018-12-17T01:00:00.000+01:00",
  "article99": "0",
  "loiReference": {}
}