{
  "uid": "AMANR5L15PO419610B0627P0D1N1370",
  "identifiant": {
    "legislature": "15",
    "numero": "1370",
    "numRect": "0",
    "saisine": {
      "texteLegislatifRef": "PRJLANR5L15B0627",
      "numeroPartiePLF": "0",
      "organeExamen": "PO419610",
      "mentionSecondeDeliberation": "0"
    }
  },
  "numeroLong": "CE1370",
  "etapeTexte": "1ère lecture (1ère assemblée saisie)",
  "triAmendement": "aabwc",
  "cardinaliteAmdtMultiples": "1",
  "etat": "Discuté",
  "signataires": {
    "auteur": {
      "typeAuteur": "Depute",
      "acteurRef": "PA722142",
      "groupePolitiqueRef": "PO730958"
    },
    "cosignatairesRefs": [
      "PA721210",
      "PA719578",
      "PA720422",
      "PA720286",
      "PA2150",
      "PA720846",
      "PA722142",
      "PA721960",
      "PA719676",
      "PA718868",
      "PA588884",
      "PA721062",
      "PA718860",
      "PA720430",
      "PA721202",
      "PA720892",
      "PA721226"
    ],
    "texteAffichable": "M.&#160;Ruffin,  Mme&#160;Autain, M.&#160;Bernalicis, M.&#160;Coquerel, M.&#160;Corbi&#232;re, Mme&#160;Fiat, M.&#160;Lachaud, M.&#160;Larive, M.&#160;M&#233;lenchon, Mme&#160;Obono, Mme&#160;Panot, M.&#160;Prud&apos;homme, M.&#160;Quatennens, M.&#160;Ratenon, Mme&#160;Ressiguier, Mme&#160;Rubin et Mme&#160;Taurine"
  },
  "pointeurFragmentTexte": {
    "division": {
      "titre": "Article 11",
      "articleDesignationCourte": "APRÈS ART. 11",
      "type": "ARTICLE",
      "avantAApres": "Apres",
      "divisionRattachee": "APRÈS L'ARTICLE 11, insérer l'article suivant:",
      "articleAdditionnel": "1",
      "urlDivisionTexteVise": "/15/textes/0627.asp#D_Article_11"
    }
  },
  "corps": {
    "dispositif": "<p style=\"text-align: justify;\">Apr&#232;s le premier alin&#233;a de l&#8217;article L.&#160;811&#8209;5 du code rural et de la p&#234;che maritime, il est ins&#233;r&#233; un alin&#233;a ainsi r&#233;dig&#233;&#160;:</p><p style=\"text-align: justify;\">&#171;&#160;D&#8217;ici 2020, les s&#233;quences p&#233;dagogiques dispens&#233;es dans les exploitations d&#8216;application situ&#233;es sur les domaines des &#233;tablissements de l&#8217;enseignement agricole, devront comporter au moins 50&#160;% d&#8217;apprentissage des m&#233;thodes relatives &#224; l&#8217;agriculture biologique et l&#8217;agro&#233;cologie. Pour cela, les exploitations des lyc&#233;es agricoles publics devront r&#233;server la moiti&#233; de leur surface et de leurs &#233;quipements p&#233;dagogiques &#224; des pratiques sans intrants chimiques ni pesticides. Ces m&#234;mes exploitations d&#8217;application devront r&#233;duire leur usage de produits phytosanitaires et d&#8217;intrants chimiques de 50&#160;% d&#8217;ici 2020 sur les surfaces qui resteraient exploit&#233;es sur un autre mode.&#160;&#187;</p>",
    "exposeSommaire": "<p style=\"text-align: justify;\">Selon l&#8217;article L800&#8209;1 du code rural et de la p&#234;che maritime, les &#233;tablissements ou organismes d&#8217;enseignement, de formation professionnelle, de d&#233;veloppement agricole et de recherche , agronomique et v&#233;t&#233;rinaire &#171;&#160;assurent l&#8217;acquisition et la diffusion de connaissances et de comp&#233;tences permettant de r&#233;pondre aux enjeux de performance &#233;conomique, sociale, environnementale et sanitaire des activit&#233;s de production, de transformation et de services li&#233;es &#224; l&#8217;agriculture, &#224; l&#8217;alimentation, aux territoires ou &#224; la sylviculture, notamment par l&#8217;agro-&#233;cologie et par le mod&#232;le coop&#233;ratif et d&#8217;&#233;conomie sociale et solidaire.&#160;&#187;</p><p style=\"text-align: justify;\">&#202;tre en accord avec les pr&#233;conisations du pr&#233;sent article impliquerait de rendre obligatoire l&#8217;enseignement des m&#233;thodes relatives &#224; l&#8217;agriculture biologique et &#224; l&#8217;agro&#233;cologie dans ces &#233;tablissements. Ces exploitations d&#8217;application pourraient ainsi devenir des &#233;tablissements pilotes de la formation des futures g&#233;n&#233;rations, en donnant l&#8217;exemple de la voie &#224; suivre pour une agriculture et alimentation r&#233;ellement saines et durables.</p>"
  },
  "representations": [
    {
      "nom": "PDF",
      "typeMime": {
        "type": "application",
        "subType": "PDF"
      },
      "statutRepresentation": {
        "verbatim": true,
        "canonique": true,
        "officielle": true,
        "transcription": false,
        "enregistrement": false
      },
      "contenu": {
        "documentURI": "/15/amendements/0627/CION-ECO/CE1370.pdf"
      }
    }
  ],
  "sort": {
    "dateSaisie": "2018-04-19T19:10:15.000+02:00",
    "sortEnSeance": "Rejeté"
  },
  "dateDepot": "2018-04-13T02:00:00.000+02:00",
  "dateDistribution": "2018-04-17T02:00:00.000+02:00",
  "article99": "0",
  "loiReference": {
    "codeLoi": "rural et pêche maritime",
    "divisionCodeLoi": "L811-5"
  }
}