{
  "uid": "AMANR5L15SEA717460BTA0216P0D1N65",
  "identifiant": {
    "legislature": "15",
    "numero": "65",
    "numRect": "0",
    "saisine": {
      "texteLegislatifRef": "PRJLANR5L15BTA0216",
      "numeroPartiePLF": "0",
      "organeExamen": "PO717460",
      "mentionSecondeDeliberation": "0"
    }
  },
  "numeroLong": "65",
  "etapeTexte": "Lecture définitive",
  "triAmendement": "ldaaaaaaaaaaaaaaaaaaaaaaaaaaaaaaaaaaaaaaaaaaaaaaaaiaapxzpkw",
  "cardinaliteAmdtMultiples": "1",
  "etat": "Discuté",
  "signataires": {
    "auteur": {
      "typeAuteur": "Depute",
      "acteurRef": "PA721960",
      "groupePolitiqueRef": "PO730958"
    },
    "cosignatairesRefs": [
      "PA721226",
      "PA720892",
      "PA719578",
      "PA720846",
      "PA718868",
      "PA722142",
      "PA718860",
      "PA719676",
      "PA720430",
      "PA721202",
      "PA721960",
      "PA588884",
      "PA721062",
      "PA721210",
      "PA2150",
      "PA720422",
      "PA720286"
    ],
    "texteAffichable": "Mme&#160;Obono,  Mme&#160;Autain, M.&#160;Bernalicis, M.&#160;Coquerel, M.&#160;Corbi&#232;re, Mme&#160;Fiat, M.&#160;Lachaud, M.&#160;Larive, M.&#160;M&#233;lenchon, Mme&#160;Panot, M.&#160;Prud&apos;homme, M.&#160;Quatennens, M.&#160;Ratenon, Mme&#160;Ressiguier, Mme&#160;Rubin, M.&#160;Ruffin et Mme&#160;Taurine"
  },
  "pointeurFragmentTexte": {
    "division": {
      "titre": "Article 53",
      "articleDesignationCourte": "ART. 53",
      "type": "ARTICLE",
      "avantAApres": "A",
      "divisionRattachee": "ARTICLE 53",
      "urlDivisionTexteVise": "/15/textes/TA0216.asp#D_Article_53"
    },
    "alinea": {
      "numero": "16"
    }
  },
  "corps": {
    "dispositif": "<p>Alin&#233;a 16</p><p>R&#233;tablir le 5&#176; bis dans la r&#233;daction suivante&#160;:</p><p>5&#176; bis Le chapitre IV du titre II du livre I<sup>er</sup> est compl&#233;t&#233; par un article L. 124-1 ainsi r&#233;dig&#233; :</p><p>&#171; <i>Art. L. 124-1</i>. - Tout projet de cr&#233;ation ou de suppression et tout projet de modification du si&#232;ge ou du ressort d&#8217;un tribunal de premi&#232;re instance ou d&#8217;une chambre d&#233;tach&#233;e donnent lieu &#224; une &#233;valuation, au vu des observations pr&#233;sent&#233;es par le premier pr&#233;sident de la cour d&#8217;appel et le procureur g&#233;n&#233;ral pr&#232;s cette cour ainsi que par le conseil d&#233;partemental, dont il est rendu compte dans un rapport public.</p><p>&#171; La m&#234;me proc&#233;dure est applicable aux tribunaux pour enfants ainsi qu&#8217;aux juridictions mentionn&#233;es &#224; l&#8217;article L. 261-1.</p><p>&#171; Un d&#233;cret en Conseil d&#8217;&#201;tat fixe les modalit&#233;s d&#8217;application du pr&#233;sent article, notamment les crit&#232;res sur la base desquels la cr&#233;ation ou la suppression ou la modification du si&#232;ge ou du ressort d&#8217;une juridiction ou d&#8217;une chambre d&#233;tach&#233;e doit &#234;tre justifi&#233;e. &#187; ;</p>",
    "exposeSommaire": "<p style=\"text-align: justify;\">De par les contraintes induites par la proc&#233;dure parlementaire en lecture d&#233;finitive (Article 45 de la Constitution), le Groupe LFI ne peut d&#233;poser ses propres amendements et ne peut donc reprendre que ceux adopt&#233;s par le S&#233;nat en nouvelle lecture. Nous reprenons ici l&#8217;amendement <span><a href=\"http://www.senat.fr/amendements/commissions/2018-2019/269/Amdt_COM-224.html\">http://www.senat.fr/amendements/commissions/2018-2019/269/Amdt_COM-224.html</a></span> dont voici l&#8217;expos&#233; des motifs&#160;:</p><p style=\"text-align: justify;\">&#171; Le pr&#233;sent amendement vise &#224; r&#233;tablir le texte adopt&#233; par le S&#233;nat en premi&#232;re lecture concernant la mise en place d&#8217;un m&#233;canisme d&#8217;encadrement de toute modification de la carte judiciaire, associant les chefs de cour et les &#233;lus d&#233;partementaux.&#187;</p>"
  },
  "representations": [
    {
      "nom": "PDF",
      "typeMime": {
        "type": "application",
        "subType": "PDF"
      },
      "statutRepresentation": {
        "verbatim": true,
        "canonique": true,
        "officielle": true,
        "transcription": false,
        "enregistrement": false
      },
      "contenu": {
        "documentURI": "/15/amendements/TA0216/AN/65.pdf"
      }
    }
  ],
  "sort": {
    "dateSaisie": "2019-02-19T00:28:06.000+01:00",
    "sortEnSeance": "Non soutenu"
  },
  "dateDepot": "2019-02-14T01:00:00.000+01:00",
  "dateDistribution": "2019-02-18T01:00:00.000+01:00",
  "article99": "0",
  "loiReference": {}
}