{
  "uid": "AMANR5L15SEA717460BTC1955P0D1N285",
  "identifiant": {
    "legislature": "15",
    "numero": "285",
    "numRect": "0",
    "saisine": {
      "texteLegislatifRef": "PNREANR5L15BTC1955",
      "numeroPartiePLF": "0",
      "organeExamen": "PO717460",
      "mentionSecondeDeliberation": "0"
    }
  },
  "numeroLong": "285",
  "etapeTexte": "Lecture unique",
  "triAmendement": "jaaaaaaaaaaaaaaaaaaaaaaaaaaaaaaaaaaaaaaaaaaaaaaaaax",
  "cardinaliteAmdtMultiples": "1",
  "etat": "Irrecevable",
  "signataires": {
    "auteur": {
      "typeAuteur": "Depute",
      "acteurRef": "PA722374",
      "groupePolitiqueRef": "PO730970"
    },
    "cosignatairesRefs": [
      "PA722374",
      "PA719874",
      "PA721924",
      "PA720968"
    ],
    "texteAffichable": "M.&#160;Isaac-Sibille,  Mme&#160;Jacquier-Laforge, Mme&#160;Benin et Mme&#160;de Vaucouleurs"
  },
  "pointeurFragmentTexte": {
    "division": {
      "titre": "Article 26",
      "articleDesignationCourte": "APRÈS ART. 26",
      "type": "ARTICLE",
      "avantAApres": "Apres",
      "divisionRattachee": "APRÈS L'ARTICLE 26, insérer l'article suivant:",
      "articleAdditionnel": "1",
      "urlDivisionTexteVise": "/15/textes/1955.asp#D_Article_26"
    }
  },
  "corps": {},
  "representations": [
    {
      "nom": "PDF",
      "typeMime": {
        "type": "application",
        "subType": "PDF"
      },
      "statutRepresentation": {
        "verbatim": true,
        "canonique": true,
        "officielle": true,
        "transcription": false,
        "enregistrement": false
      },
      "contenu": {
        "documentURI": "/15/amendements/1955/AN/285.pdf"
      }
    }
  ],
  "dateDepot": "2019-05-23T02:00:00.000+02:00",
  "dateDistribution": "2019-05-24T02:00:00.000+02:00",
  "article99": "0",
  "loiReference": {
    "divisionCodeLoi": "26-1"
  }
}