{
  "uid": "AMANR5L15SEA717460BTC0105P0D1N73",
  "identifiant": {
    "legislature": "15",
    "numero": "73",
    "numRect": "0",
    "saisine": {
      "texteLegislatifRef": "PRJLANR5L15BTC0105",
      "numeroPartiePLF": "0",
      "organeExamen": "PO717460",
      "mentionSecondeDeliberation": "0"
    }
  },
  "numeroLong": "73",
  "etapeTexte": "1ère lecture (2ème assemblée saisie)",
  "triAmendement": "f",
  "cardinaliteAmdtMultiples": "1",
  "etat": "Discuté",
  "signataires": {
    "auteur": {
      "typeAuteur": "Depute",
      "acteurRef": "PA709315",
      "groupePolitiqueRef": "PO730934"
    },
    "cosignatairesRefs": [
      "PA720210",
      "PA605036",
      "PA709315",
      "PA712015",
      "PA267735",
      "PA2492",
      "PA718884"
    ],
    "texteAffichable": "M.&#160;Viala,  M.&#160;Dive, Mme&#160;Bazin-Malgras, Mme&#160;Beauvais, M.&#160;Abad, M.&#160;Quentin et M.&#160;de Ganay"
  },
  "pointeurFragmentTexte": {
    "division": {
      "titre": "Article 12",
      "articleDesignationCourte": "ART. 12",
      "type": "ARTICLE",
      "avantAApres": "A",
      "divisionRattachee": "ARTICLE 12",
      "urlDivisionTexteVise": "/15/textes/0105.asp#D_Article_12"
    },
    "alinea": {
      "numero": "5"
    }
  },
  "corps": {
    "dispositif": "<p style=\"text-align: justify;\">&#192; l&#8217;alin&#233;a&#160;5, substituer aux mots&#160;:</p><p style=\"text-align: justify;\">&#171;&#160;d&#233;put&#233; ou s&#233;nateur&#160;&#187;,</p><p style=\"text-align: justify;\">le mot&#160;:</p><p style=\"text-align: justify;\">&#171;&#160;&#233;lu&#160;&#187;.</p>",
    "exposeSommaire": "<p style=\"text-align: justify;\">De la m&#234;me mani&#232;re que tout d&#233;put&#233; et s&#233;nateur, quelles que soient ses responsabilit&#233;s au sein des Chambres, devra se soumettre &#224; ces obligations une fois le texte vot&#233;, tout &#233;lu devra &#233;galement s&#8217;y soumettre, quel que soit son niveau de responsabilit&#233; au sein de la collectivit&#233; qu&#8217;il repr&#233;sente.</p>"
  },
  "representations": [
    {
      "nom": "PDF",
      "typeMime": {
        "type": "application",
        "subType": "PDF"
      },
      "statutRepresentation": {
        "verbatim": true,
        "canonique": true,
        "officielle": true,
        "transcription": false,
        "enregistrement": false
      },
      "contenu": {
        "documentURI": "/15/amendements/0105/AN/73.pdf"
      }
    }
  ],
  "seanceDiscussion": "RUANR5L15S2017IDS20663",
  "sort": {
    "dateSaisie": "2017-07-29T02:03:27.000+02:00",
    "sortEnSeance": "Rejeté"
  },
  "dateDepot": "2017-07-21T02:00:00.000+02:00",
  "dateDistribution": "2017-07-25T02:00:00.000+02:00",
  "article99": "0",
  "loiReference": {}
}