{
  "uid": "AMANR5L15PO59048B0235P1D1N18",
  "identifiant": {
    "legislature": "15",
    "numero": "18",
    "numRect": "0",
    "saisine": {
      "texteLegislatifRef": "PRJLANR5L15B0235",
      "numeroPartiePLF": "1",
      "organeExamen": "PO59048",
      "mentionSecondeDeliberation": "0"
    }
  },
  "numeroLong": "I-CF18",
  "etapeTexte": "1ère lecture (1ère assemblée saisie)",
  "triAmendement": "ii",
  "cardinaliteAmdtMultiples": "1",
  "etat": "Discuté",
  "signataires": {
    "auteur": {
      "typeAuteur": "Depute",
      "acteurRef": "PA1874",
      "groupePolitiqueRef": "PO730934"
    },
    "cosignatairesRefs": [
      "PA1874"
    ],
    "texteAffichable": "M.&#160;Le Fur"
  },
  "pointeurFragmentTexte": {
    "division": {
      "titre": "Article 24",
      "articleDesignationCourte": "ART. 24",
      "type": "ARTICLE",
      "avantAApres": "A",
      "divisionRattachee": "ARTICLE 24",
      "urlDivisionTexteVise": "/15/textes/0235A.asp#D_Article_24"
    }
  },
  "corps": {
    "dispositif": "<p style=\"text-align: justify;\">Supprimer cet article.</p>",
    "exposeSommaire": "<p style=\"text-align: justify;\">Le projet de loi de finances pour 2018 promeut un nouvel &#233;quilibre du bonus/malus, en abaissant le seuil du malus et en durcissant les conditions d&#8217;obtention du bonus.</p><p style=\"text-align: justify;\">De fa&#231;on g&#233;n&#233;rale, il semblerait l&#233;gitime que ce syst&#232;me, con&#231;u pour &#234;tre &#224; l&#8217;&#233;quilibre puisse le rester, de fa&#231;on &#224; utiliser l&#8217;exc&#233;dentaire d&#233;gag&#233; au financement d&#8217;aides plus cons&#233;quentes pour l&#8217;acquisition de v&#233;hicules peu &#233;metteurs. Ainsi, en 2016, la balance du syst&#232;me de bonus/malus &#233;cologique &#233;tait cr&#233;ditrice de 30 millions d&#8217;euros. </p><p style=\"text-align: justify;\">Comme le sugg&#233;rait notre coll&#232;gue Delphine Batho dans son rapport parlementaire de 2016, professionnels comme automobilistes ont besoin de visibilit&#233;&#160;: aussi, le syst&#232;me doit &#234;tre p&#233;renne dans le temps afin de montrer sa port&#233;e et &#233;viter les effets d&#8217;annonce et d&#8217;aubaine, nuisibles pour le commerce.</p><p style=\"text-align: justify;\">On constate par ailleurs que tr&#232;s souvent, un v&#233;hicule dont la facturation intervient en fin d&#8217;ann&#233;e mais dont la livraison est effectu&#233;e l&#8217;ann&#233;e suivante, ne b&#233;n&#233;ficie pas du seuil de malus correspondant &#224; la date de facturation du v&#233;hicule. L&#8217;acheteur est alors contraint de s&#8217;acquitter d&#8217;un taux de malus sup&#233;rieur.</p><p style=\"text-align: justify;\">D&#8217;autre part, l&#8217;abaissement du seuil du malus d&#232;s 2018 &#8211; dont la ressource, si elle &#233;tait pleinement achemin&#233;e vers son objectif premier donnerait de la coh&#233;rence au dispositif &#8211; donne le sentiment que l&#8217;Etat cherche &#224; cr&#233;er une nouvelle taxe sur l&#8217;automobile dont la principale incidence sera probablement de grever la vente des v&#233;hicules haut-de-gamme. D&#8217;un syst&#232;me &#224; ambition &#233;cologique, nous avons d&#233;riv&#233; vers un nouvel imp&#244;t d&#233;guis&#233; alors que l&#8217;automobiliste est d&#233;j&#224; le premier contributeur fiscal de France avec 65 milliards de taxes et imp&#244;ts pay&#233;s en 2016. </p><p style=\"text-align: justify;\">Enfin, il est dommageable que les v&#233;hicules hybrides et les v&#233;los &#224; assistance &#233;lectrique (VAE) ne b&#233;n&#233;ficient plus de cette prime&#160;; celle-ci avait pourtant fait ses preuves &#8211; 250 000 unit&#233;s de VAE vendues en 2016 &#8211; et repr&#233;sentait un premier jalon vers l&#8217;&#233;lectrique en concernant les v&#233;hicules hybrides.</p><p style=\"text-align: justify;\">C'est pourquoi, le pr&#233;sent amendement vise &#224; supprimer l'article 24 du pr&#233;sent projet.</p>"
  },
  "representations": [
    {
      "nom": "PDF",
      "typeMime": {
        "type": "application",
        "subType": "PDF"
      },
      "statutRepresentation": {
        "verbatim": true,
        "canonique": true,
        "officielle": true,
        "transcription": false,
        "enregistrement": false
      },
      "contenu": {
        "documentURI": "/15/amendements/0235A/CION_FIN/CF18.pdf"
      }
    }
  ],
  "sort": {
    "dateSaisie": "2017-10-12T13:51:51.000+02:00",
    "sortEnSeance": "Non soutenu"
  },
  "dateDepot": "2017-10-04T02:00:00.000+02:00",
  "dateDistribution": "2017-10-11T02:00:00.000+02:00",
  "article99": "0",
  "loiReference": {}
}