{
  "uid": "AMANR5L15PO766718B2187P0D1N1485",
  "identifiant": {
    "legislature": "15",
    "numero": "1485",
    "numRect": "0",
    "saisine": {
      "texteLegislatifRef": "PRJLANR5L15B2187",
      "numeroPartiePLF": "0",
      "organeExamen": "PO766718",
      "mentionSecondeDeliberation": "0"
    }
  },
  "numeroLong": "1485",
  "etapeTexte": "1ère lecture (1ère assemblée saisie)",
  "triAmendement": "dkaaaaaaaaaaaaaaaaaaaaaaaaaaaaaaaaaaaaaaaaaaaaaaaazzuwkvyw",
  "cardinaliteAmdtMultiples": "1",
  "etat": "Discuté",
  "signataires": {
    "auteur": {
      "typeAuteur": "Depute",
      "acteurRef": "PA720586",
      "groupePolitiqueRef": "PO730934"
    },
    "cosignatairesRefs": [
      "PA720586"
    ],
    "texteAffichable": "M.&#160;Vatin"
  },
  "pointeurFragmentTexte": {
    "division": {
      "titre": "Article 14",
      "articleDesignationCourte": "ART. 14",
      "type": "ARTICLE",
      "avantAApres": "A",
      "divisionRattachee": "ARTICLE 14",
      "urlDivisionTexteVise": "/15/textes/2187.asp#D_Article_14"
    },
    "alinea": {
      "avantAApres": "A",
      "numero": "11",
      "alineaDesignation": "Alinéa 11"
    }
  },
  "corps": {
    "dispositif": "<p style=\"text-align: justify;\">Compl&#233;ter l&#8217;alin&#233;a&#160;11 par la phrase suivante&#160;: </p><p style=\"text-align: justify;\">&#171;&#160;Aucune autorisation ne peut &#234;tre donn&#233;e si l&#8217;un des deux membres du couple ne donne pas son consentement expr&#232;s.&#160;&#187;</p>",
    "exposeSommaire": "<p style=\"text-align: justify;\">Cet amendement a pour but de prot&#233;ger la libert&#233; de choix des individus au sein du couple, et d&#8217;&#233;viter qu&#8217;un membre du couple puisse s&#8217;exprimer &#224; la place de l&#8217;autre si, par exemple, il est absent ou ind&#233;cis.</p><p style=\"text-align: justify;\">&#160;</p>"
  },
  "representations": [
    {
      "nom": "PDF",
      "typeMime": {
        "type": "application",
        "subType": "PDF"
      },
      "statutRepresentation": {
        "verbatim": true,
        "canonique": true,
        "officielle": true,
        "transcription": false,
        "enregistrement": false
      },
      "contenu": {
        "documentURI": "/15/amendements/2187/CSBIOETH/1485.pdf"
      }
    }
  ],
  "sort": {
    "dateSaisie": "2019-09-13T15:48:02.000+02:00",
    "sortEnSeance": "Non soutenu"
  },
  "dateDepot": "2019-09-05T02:00:00.000+02:00",
  "dateDistribution": "2019-09-12T02:00:00.000+02:00",
  "article99": "0",
  "loiReference": {}
}