{
  "uid": "AMANR5L15SEA717460B0235P1D1N1026",
  "identifiant": {
    "legislature": "15",
    "numero": "1026",
    "numRect": "0",
    "saisine": {
      "texteLegislatifRef": "PRJLANR5L15B0235",
      "numeroPartiePLF": "1",
      "organeExamen": "PO717460",
      "mentionSecondeDeliberation": "0"
    }
  },
  "numeroLong": "I-1026",
  "etapeTexte": "1ère lecture (1ère assemblée saisie)",
  "triAmendement": "zzzzzzzzzzzzzzzzzzzzzzzzzzzo",
  "cardinaliteAmdtMultiples": "1",
  "etat": "Irrecevable",
  "signataires": {
    "auteur": {
      "typeAuteur": "Depute",
      "acteurRef": "PA609590",
      "groupePolitiqueRef": "PO730946"
    },
    "cosignatairesRefs": [
      "PA508",
      "PA342415",
      "PA340343",
      "PA1809",
      "PA608011",
      "PA643145",
      "PA588886",
      "PA335999",
      "PA608695",
      "PA267233",
      "PA720988",
      "PA335054",
      "PA332614",
      "PA335532",
      "PA609332",
      "PA719930",
      "PA607553",
      "PA608172",
      "PA330357",
      "PA1008",
      "PA1198",
      "PA337483",
      "PA429893",
      "PA610681",
      "PA642764",
      "PA333285",
      "PA333818",
      "PA609590",
      "PA1592",
      "PA405480",
      "PA605069"
    ],
    "texteAffichable": "Mme&#160;Rabault,  M.&#160;Jean-Louis&#160;Bricout, Mme&#160;Pires Beaune, M.&#160;Pupponi, M.&#160;Faure, M.&#160;Aviragnet, Mme&#160;Bareigts, Mme&#160;Batho, Mme&#160;Battistel, Mme&#160;Bi&#233;mouret, M.&#160;Bouillon, M.&#160;Carvounas, M.&#160;Alain&#160;David, Mme&#160;Laurence&#160;Dumont, M.&#160;Dussopt, M.&#160;Garot, M.&#160;David&#160;Habib, M.&#160;Hutin, M.&#160;Juanico, Mme&#160;Karamanli, M.&#160;J&#233;r&#244;me&#160;Lambert, M.&#160;Le Foll, M.&#160;Letchimy, Mme&#160;Manin, Mme&#160;Pau-Langevin, M.&#160;Potier, M.&#160;Pueyo, M.&#160;Saulignac, Mme&#160;Untermaier, Mme&#160;Vainqueur-Christophe et M.&#160;Vallaud"
  },
  "pointeurFragmentTexte": {
    "division": {
      "titre": "Article 10",
      "articleDesignationCourte": "APRÈS ART. 10",
      "type": "ARTICLE",
      "avantAApres": "Apres",
      "divisionRattachee": "APRÈS L'ARTICLE 10, insérer l'article suivant:",
      "articleAdditionnel": "1",
      "urlDivisionTexteVise": "/15/textes/0235A.asp#D_Article_10"
    }
  },
  "corps": {
    "dispositif": "<p style=\"text-align: justify;\">&#171;&#160;I.&#160;&#8211;&#160;Apr&#232;s l&#8217;article&#160;1499 du code g&#233;n&#233;ral des imp&#244;ts, il est ins&#233;r&#233; un article&#160;1499&#8209;00 A ainsi r&#233;dig&#233;&#160;:</p><p style=\"text-align: justify;\">&#171;&#160;<i>Art.&#160;1499&#8209;00 A</i>.&#160;&#8211; Les dispositions de l&#8217;article&#160;1499 ne s&#8217;appliquent pas &#224; la d&#233;termination de la valeur locative des biens imposables au titre de la cotisation fonci&#232;re des entreprises relevant du secteur d&#233;fini &#224; l&#8217;article&#160;19 de la loi n&#176; 96&#8209;603 du 5 juillet 1996 relative au d&#233;veloppement et &#224; la promotion du commerce et de l&#8217;artisanat.&#160;&#187;</p><p style=\"text-align: justify;\">&#171;&#160;II.&#160;&#8211;&#160;La perte de recettes pour les collectivit&#233;s territoriales r&#233;sultant du I est compens&#233;e &#224; due concurrence par la majoration de la dotation globale de fonctionnement et, corr&#233;lativement pour l&#8217;&#201;tat, par la cr&#233;ation d&#8217;une taxe additionnelle aux droits mentionn&#233;s aux articles 575 et 575 A du code g&#233;n&#233;ral des imp&#244;ts.&#160;&#187;</p>",
    "exposeSommaire": "<p style=\"text-align: justify;\">L&#8217;article&#160;1499 du code g&#233;n&#233;ral des imp&#244;ts d&#233;finit le r&#233;gime applicable aux immobilisations industrielles en mati&#232;re de taxe fonci&#232;re. Faute de d&#233;finition l&#233;gale de la notion d&#8217;immobilisation industrielle, l&#8217;administration fiscale en fait une interpr&#233;tation extensible, et al&#233;atoire, l&#8217;autorisant &#224; soumettre &#224; ce r&#233;gime tout &#233;tablissement &#171;&#160;o&#249; le r&#244;le de l&#8217;outillage et de la force motrice est pr&#233;pond&#233;rant&#160;&#187;.</p><p style=\"text-align: justify;\">S&#8217;appuyant sur le flou de cette notion, de nombreuses entreprises artisanales utilisant des installations techniques, mat&#233;riels et machines dans le cadre de leur activit&#233; se sont ainsi vues requalifi&#233;es en &#233;tablissement industriel.</p><p style=\"text-align: justify;\">Cette interpr&#233;tation extensive de l&#8217;administration fiscale est pr&#233;judiciable &#224; ces entreprises artisanales et peut avoir des cons&#233;quences financi&#232;res importantes.</p><p style=\"text-align: justify;\">Le pr&#233;sent amendement permet donc de pr&#233;server les entreprises artisanales de ce risque de requalification en immobilisations industrielles, en excluant du champ d&#8217;application de l&#8217;article&#160;1499 CGI les entreprises d&#233;finies par l&#8217;article&#160;19 de la loi n&#176;96&#8209;603 du 5 juillet 1996.</p>"
  },
  "representations": [
    {
      "nom": "PDF",
      "typeMime": {
        "type": "application",
        "subType": "PDF"
      },
      "statutRepresentation": {
        "verbatim": true,
        "canonique": true,
        "officielle": true,
        "transcription": false,
        "enregistrement": false
      },
      "contenu": {
        "documentURI": "/15/amendements/0235A/AN/1026.pdf"
      }
    }
  ],
  "dateDepot": "2017-10-13T02:00:00.000+02:00",
  "article99": "0",
  "loiReference": {
    "codeLoi": "CGI",
    "divisionCodeLoi": "1499"
  }
}