{
  "uid": "AMANR5L15PO419865B2135P0D1N360",
  "identifiant": {
    "legislature": "15",
    "numero": "360",
    "numRect": "0",
    "saisine": {
      "texteLegislatifRef": "PRJLANR5L15B2135",
      "numeroPartiePLF": "0",
      "organeExamen": "PO419865",
      "mentionSecondeDeliberation": "0"
    }
  },
  "numeroLong": "CD360",
  "etapeTexte": "Nouvelle Lecture",
  "triAmendement": "goaaiaaaaaaaaaaaaaaaaaaaaaaaaaaaaaaaaaaaaaaaaaaaaazzzzzzzzzzzzzzzzzzzzzzzzzzzzzzzzzzzzo",
  "cardinaliteAmdtMultiples": "1",
  "etat": "Discuté",
  "signataires": {
    "auteur": {
      "typeAuteur": "Depute",
      "acteurRef": "PA720386",
      "groupePolitiqueRef": "PO730934"
    },
    "cosignatairesRefs": [
      "PA721410",
      "PA605036",
      "PA605991",
      "PA336316",
      "PA718780",
      "PA1874",
      "PA720630",
      "PA721286",
      "PA718850",
      "PA267429",
      "PA720386",
      "PA2377"
    ],
    "texteAffichable": "M.&#160;Di Filippo,  M.&#160;Abad, Mme&#160;Bonnivard, M.&#160;Bouchet, M.&#160;Cinieri, M.&#160;Cordier, Mme&#160;Genevard, M.&#160;Le Fur, M.&#160;Minot, M.&#160;Perrut, M.&#160;Ramadier et Mme&#160;Trastour-Isnart"
  },
  "pointeurFragmentTexte": {
    "division": {
      "titre": "RAPPORT ANNEXÉ",
      "articleDesignationCourte": "ART. 1ER A",
      "type": "ANNEXE",
      "avantAApres": "A",
      "divisionRattachee": "ARTICLE 1ER A",
      "urlDivisionTexteVise": "/15/textes/2135.asp#D_RAPPORT_ANNEXE"
    },
    "alinea": {
      "avantAApres": "Apres",
      "numero": "55"
    }
  },
  "corps": {
    "dispositif": "<p>Apr&#232;s l&#8217;alin&#233;a&#160;55, ins&#233;rer l&#8217;alin&#233;a suivant&#160;:</p><p style=\"text-align: justify;\">&#171;&#160;Dans les d&#233;partements m&#233;tropolitains &#233;loign&#233;s de la capitale qui cumulent des handicaps d&#8217;enclavement, en particulier ceux dont les chefs-lieux sont &#233;loign&#233;s de plus de 45 minutes d&#8217;une autoroute, qui ne comptent pas ou peu de routes &#224; deux fois deux voies et se trouvent de ce fait lourdement p&#233;nalis&#233;s par la r&#233;duction de vitesse &#224; 80km/h, qui ne sont pas desservis par des lignes ferroviaires &#224; grande vitesse et qui sont &#233;loign&#233;s de leurs capitales r&#233;gionales, des sch&#233;mas de d&#233;senclavement seront &#233;labor&#233;s en lien avec les collectivit&#233;s locales afin de moderniser les infrastructures routi&#232;res, maintenir et d&#233;velopper des services ferroviaires op&#233;rationnels et assurer des dessertes a&#233;riennes. La liste des d&#233;partements concern&#233;s sera d&#233;finie par d&#233;cret.&#160;&#187;</p>",
    "exposeSommaire": "<p style=\"text-align: justify;\">Certaines r&#233;gions se retrouvent aujourd&#8217;hui loin de tout, presque laiss&#233;es &#224; l&#8217;abandon. En effet, certains territoires se trouvent &#224; plus de 12 heures aller-retour de Paris par la route et &#224; 14 heures aller-retour par le train et sont tout aussi &#233;loign&#233;s de leur capitale r&#233;gionale. Cet enclavement s&#8217;est profond&#233;ment aggrav&#233; en trente ans avec la suppression des trains directs, des trains de nuit et l&#8217;absence de travaux importants sur les liaisons routi&#232;res depuis 15 ans.</p><p style=\"text-align: justify;\">Pour les territoires qui ne comptent pas d&#8217;autoroute, pas de voie rapide ni de deux fois deux voies et qui ont vu encore r&#233;cemment leurs temps de parcours consid&#233;rablement augmenter avec la r&#233;duction de vitesse &#224; 80 km/h, il est fondamental que le projet de loi pr&#233;voit un effort particulier et adresse un signe fort. Cet enclavement a des effets n&#233;fastes sur le d&#233;veloppement notamment &#233;conomique de certaines de ces r&#233;gions.</p><p style=\"text-align: justify;\">Aussi, il est propos&#233; &#224; travers cet amendement d&#8217;instaurer des sch&#233;mas de d&#233;senclavement qui seraient &#233;labor&#233;s en lien avec les collectivit&#233;s locales afin de d&#233;finir un programme de modernisation des infrastructures routi&#232;res et d&#8217;assurer le maintien et le d&#233;veloppement des services ferroviaires op&#233;rationnels.</p>"
  },
  "representations": [
    {
      "nom": "PDF",
      "typeMime": {
        "type": "application",
        "subType": "PDF"
      },
      "statutRepresentation": {
        "verbatim": true,
        "canonique": true,
        "officielle": true,
        "transcription": false,
        "enregistrement": false
      },
      "contenu": {
        "documentURI": "/15/amendements/2135/CION-DVP/CD360.pdf"
      }
    }
  ],
  "sort": {
    "dateSaisie": "2019-09-03T23:29:09.000+02:00",
    "sortEnSeance": "Non soutenu"
  },
  "dateDepot": "2019-08-27T02:00:00.000+02:00",
  "dateDistribution": "2019-08-31T02:00:00.000+02:00",
  "article99": "0",
  "loiReference": {}
}