{
  "uid": "AMANR5L15SEA717460B1297P0D1N1521",
  "identifiant": {
    "legislature": "15",
    "numero": "1521",
    "numRect": "0",
    "saisine": {
      "texteLegislatifRef": "PRJLANR5L15B1297",
      "numeroPartiePLF": "0",
      "organeExamen": "PO717460",
      "mentionSecondeDeliberation": "0"
    }
  },
  "numeroLong": "1521",
  "etapeTexte": "1ère lecture (1ère assemblée saisie)",
  "triAmendement": "epaaaaaaaaaaaaaaaaaaaaaaaaaaaaaaaaaaaaaaaaaaaaaaaaatejvi",
  "cardinaliteAmdtMultiples": "1",
  "etat": "Irrecevable",
  "signataires": {
    "auteur": {
      "typeAuteur": "Depute",
      "acteurRef": "PA719350",
      "groupePolitiqueRef": "PO730964"
    },
    "cosignatairesRefs": [
      "PA719350"
    ],
    "texteAffichable": "Mme&#160;Tamarelle-Verhaeghe"
  },
  "pointeurFragmentTexte": {
    "division": {
      "titre": "Article 29",
      "articleDesignationCourte": "APRÈS ART. 29",
      "type": "ARTICLE",
      "avantAApres": "Apres",
      "divisionRattachee": "APRÈS L'ARTICLE 29, insérer l'article suivant:",
      "articleAdditionnel": "1",
      "urlDivisionTexteVise": "/15/textes/1297.asp#D_Article_29"
    }
  },
  "corps": {
    "dispositif": "<p style=\"text-align: justify;\">Le second alin&#233;a du IV de l&#8217;article L.&#160;162 31 1 du code de la s&#233;curit&#233; sociale est compl&#233;t&#233; par une phrase ainsi r&#233;dig&#233;e&#160;: &#171;&#160;10&#160;% au minimum du montant du fonds pour l&#8217;innovation du syst&#232;me de sant&#233; sont consacr&#233;s au financement d&#8217;exp&#233;rimentations, telles que r&#233;gies par le pr&#233;sent article, ax&#233;es prioritairement sur la pr&#233;vention. Les crit&#232;res d&#8217;&#233;ligibilit&#233; sont pr&#233;cis&#233;s par d&#233;cret&#160;&#187;.</p>",
    "exposeSommaire": "<p style=\"text-align: justify;\">Le pr&#233;sent amendement vise &#224; sanctuariser au minimum 10&#160;% du budget du fonds pour l&#8217;innovation du syst&#232;me de sant&#233; (FISS), dont le montant annuel est fix&#233; par arr&#234;t&#233; des ministres charg&#233;s de la s&#233;curit&#233; sociale et de la sant&#233;, au financement d&#8217;innovations telles que d&#233;crites par l&#8217;article&#160;51 de la LFSS 2018, qui agissent en faveur de la pr&#233;vention et de la promotion de la sant&#233;.</p><p style=\"text-align: justify;\">Le Gouvernement, &#224; de nombreuses reprises, a rappel&#233; son attachement &#224; promouvoir un syst&#232;me de sant&#233; fond&#233; sur le pr&#233;ventif. A ce titre, le plan &#171;&#160;Ma sant&#233; 2022&#160;&#187;, la Strat&#233;gie nationale de sant&#233; pour 2018&#8209;2022 ou encore la publication en mars 2018 du Plan national de sant&#233; publique, portent des mesures phares pour d&#233;cliner op&#233;rationnellement cette volont&#233; d&#8217;&#339;uvrer en faveur de la pr&#233;vention.</p><p style=\"text-align: justify;\">Par ailleurs, les innovations organisationnelles et tarifaires port&#233;es par l&#8217;article&#160;51 de la LFSS 2018 constituent &#233;galement un levier important pour mobiliser et inciter les professionnels de sant&#233; &#224; la mise en &#339;uvre d&#8217;actions de pr&#233;vention innovantes.</p><p style=\"text-align: justify;\">Mais si cet article&#160;51 pr&#233;sente une avanc&#233;e majeure, il existe un risque non n&#233;gligeable de voir les financements d&#233;di&#233;s &#224; la mise en &#339;uvre des exp&#233;rimentations telles que d&#233;crites par cet article, se diriger presque exclusivement vers les soins et non la pr&#233;vention.</p><p style=\"text-align: justify;\">Ainsi, le pr&#233;sent amendement souhaite consacrer une part substantielle du montant fonds pour l&#8217;innovation du syst&#232;me de sant&#233; aux financements des innovations relevant du champ de l&#8217;article&#160;51 de la LFSS 2018 &#224; des actions de pr&#233;vention et de promotion de la sant&#233;.</p>"
  },
  "representations": [
    {
      "nom": "PDF",
      "typeMime": {
        "type": "application",
        "subType": "PDF"
      },
      "statutRepresentation": {
        "verbatim": true,
        "canonique": true,
        "officielle": true,
        "transcription": false,
        "enregistrement": false
      },
      "contenu": {
        "documentURI": "/15/amendements/1297/AN/1521.pdf"
      }
    }
  ],
  "dateDepot": "2018-10-19T02:00:00.000+02:00",
  "article99": "0",
  "loiReference": {
    "codeLoi": "c sécurité sociale",
    "divisionCodeLoi": "L162-31-1"
  }
}