{
  "uid": "AMANR5L15SEA717460BTC0857P0D1N379",
  "identifiant": {
    "legislature": "15",
    "numero": "379",
    "numRect": "0",
    "saisine": {
      "texteLegislatifRef": "PRJLANR5L15BTC0857",
      "numeroPartiePLF": "0",
      "organeExamen": "PO717460",
      "mentionSecondeDeliberation": "0"
    }
  },
  "numeroLong": "379",
  "etapeTexte": "1ère lecture (1ère assemblée saisie)",
  "triAmendement": "aeb",
  "cardinaliteAmdtMultiples": "1",
  "etat": "Discuté",
  "signataires": {
    "auteur": {
      "typeAuteur": "Depute",
      "acteurRef": "PA267785",
      "groupePolitiqueRef": "PO730934"
    },
    "cosignatairesRefs": [
      "PA267901",
      "PA267785",
      "PA330684",
      "PA267378",
      "PA1874",
      "PA336316",
      "PA721314",
      "PA718884",
      "PA721286",
      "PA719318",
      "PA608416",
      "PA719946",
      "PA267735",
      "PA345722",
      "PA606098",
      "PA609726",
      "PA267200",
      "PA720684",
      "PA721636",
      "PA267260",
      "PA721678",
      "PA330240",
      "PA721506"
    ],
    "texteAffichable": "M.&#160;Larriv&#233;,  M.&#160;Ciotti, Mme&#160;Le Grip, Mme&#160;Val&#233;rie&#160;Boyer, M.&#160;Marleix, M.&#160;Pierre-Henri&#160;Dumont, M.&#160;Parigi, M.&#160;Peltier, M.&#160;de Ganay, M.&#160;Ramadier, Mme&#160;Poletti, Mme&#160;Kuster, M.&#160;Huyghe, M.&#160;Schellenberger, M.&#160;Reda, M.&#160;Aubert, Mme&#160;Bazin-Malgras, Mme&#160;Levy, Mme&#160;Anthoine, M.&#160;Bouchet, M.&#160;Kamardine, M.&#160;Hetzel et M.&#160;Le Fur"
  },
  "pointeurFragmentTexte": {
    "division": {
      "titre": "Article 33 bis",
      "articleDesignationCourte": "APRÈS ART. 33 BIS",
      "type": "ARTICLE",
      "avantAApres": "Apres",
      "divisionRattachee": "APRÈS L'ARTICLE 33 BIS, insérer l'article suivant:",
      "articleAdditionnel": "1",
      "urlDivisionTexteVise": "/15/textes/0857.asp#D_Article_33_bis"
    }
  },
  "corps": {
    "dispositif": "<p style=\"text-align: justify;\">Au dernier alin&#233;a de l&#8217;article&#160;21&#8209;27 du code civil, les r&#233;f&#233;rences&#160;: &#171;&#160;21&#8209;7, 21&#8209;11,&#160;&#187; sont supprim&#233;es.</p>",
    "exposeSommaire": "<p style=\"text-align: justify;\">Cet amendement&#160;exclut les d&#233;linquants, condamn&#233;s &#224; une peine d&#8217;au moins six mois de prison, du b&#233;n&#233;fice du droit du sol.</p>"
  },
  "representations": [
    {
      "nom": "PDF",
      "typeMime": {
        "type": "application",
        "subType": "PDF"
      },
      "statutRepresentation": {
        "verbatim": true,
        "canonique": true,
        "officielle": true,
        "transcription": false,
        "enregistrement": false
      },
      "contenu": {
        "documentURI": "/15/amendements/0857/AN/379.pdf"
      }
    }
  ],
  "seanceDiscussion": "RUANR5L15S2018IDS21078",
  "sort": {
    "dateSaisie": "2018-04-22T18:50:37.000+02:00",
    "sortEnSeance": "Rejeté"
  },
  "dateDepot": "2018-04-11T02:00:00.000+02:00",
  "dateDistribution": "2018-04-16T02:00:00.000+02:00",
  "article99": "0",
  "loiReference": {
    "codeLoi": "c civil",
    "divisionCodeLoi": "21-27"
  }
}