{
  "uid": "AMANR5L15PO757134B1088P0D1N2190",
  "identifiant": {
    "legislature": "15",
    "numero": "2190",
    "numRect": "0",
    "saisine": {
      "texteLegislatifRef": "PRJLANR5L15B1088",
      "numeroPartiePLF": "0",
      "organeExamen": "PO757134",
      "mentionSecondeDeliberation": "0"
    }
  },
  "numeroLong": "2190",
  "etapeTexte": "1ère lecture (1ère assemblée saisie)",
  "triAmendement": "maaaaaaaaaaaaaaaaaaaaaaaaaaaaaaaaaaaaaaaaaaaaaaaaabianw",
  "cardinaliteAmdtMultiples": "1",
  "etat": "Discuté",
  "signataires": {
    "auteur": {
      "typeAuteur": "Depute",
      "acteurRef": "PA607553",
      "groupePolitiqueRef": "PO758835"
    },
    "cosignatairesRefs": [
      "PA608741",
      "PA405480",
      "PA719930",
      "PA342415",
      "PA1592",
      "PA1198",
      "PA720988",
      "PA605069",
      "PA609332",
      "PA333285",
      "PA609590",
      "PA608695",
      "PA267233",
      "PA335054",
      "PA508",
      "PA333818",
      "PA1809",
      "PA340357",
      "PA610681",
      "PA332614",
      "PA429893",
      "PA1008",
      "PA608011",
      "PA340343",
      "PA643145",
      "PA642764",
      "PA335532",
      "PA607553",
      "PA608172",
      "PA337483"
    ],
    "texteAffichable": "M.&#160;Potier,  Mme&#160;Battistel, M.&#160;Juanico, M.&#160;Vallaud, Mme&#160;Rabault, M.&#160;Aviragnet, Mme&#160;Bareigts, Mme&#160;Bi&#233;mouret, M.&#160;Bouillon, M.&#160;Jean-Louis&#160;Bricout, M.&#160;Carvounas, M.&#160;Alain&#160;David, Mme&#160;Laurence&#160;Dumont, M.&#160;Faure, M.&#160;Garot, M.&#160;David&#160;Habib, M.&#160;Hutin, Mme&#160;Karamanli, M.&#160;J&#233;r&#244;me&#160;Lambert, M.&#160;Letchimy, Mme&#160;Manin, Mme&#160;Pau-Langevin, Mme&#160;Pires Beaune, M.&#160;Pueyo, M.&#160;Pupponi, M.&#160;Saulignac, Mme&#160;Tolmont, Mme&#160;Untermaier, Mme&#160;Vainqueur-Christophe et Mme&#160;Victory"
  },
  "pointeurFragmentTexte": {
    "division": {
      "titre": "Article 62",
      "articleDesignationCourte": "APRÈS ART. 62",
      "type": "ARTICLE",
      "avantAApres": "Apres",
      "divisionRattachee": "APRÈS L'ARTICLE 62, insérer l'article suivant:",
      "articleAdditionnel": "1",
      "urlDivisionTexteVise": "/15/textes/1088.asp#D_Article_62"
    }
  },
  "corps": {
    "dispositif": "<p style=\"text-align: justify;\">L&#8217;article L.&#160;225&#8209;38 du code du commerce est compl&#233;t&#233; par deux alin&#233;as ainsi r&#233;dig&#233;s&#160;:</p><p style=\"text-align: justify;\">&#171;&#160;La r&#233;mun&#233;ration du pr&#233;sident du conseil d&#8217;administration et du directeur g&#233;n&#233;ral est &#233;galement soumise &#224; autorisation pr&#233;alable du conseil d&#8217;administration.</p><p style=\"text-align: justify;\">&#171;&#160;L&#8217;augmentation substantielle de la r&#233;mun&#233;ration du Pr&#233;sident du Conseil d&#8217;administration doit faire l&#8217;objet, au pr&#233;alable, d&#8217;un avis conforme du comit&#233; d&#8217;entreprise et de l&#8217;assembl&#233;e g&#233;n&#233;rale des actionnaires&#160;&#187;.</p>",
    "exposeSommaire": "<p style=\"text-align: justify;\">Afin d&#8217;aider le conseil d&#8217;administration &#224; assumer ses choix, cet amendement pr&#233;voit un contr&#244;le collectif de la r&#233;mun&#233;ration du pr&#233;sident du conseil d&#8217;administration gr&#226;ce &#224; une autorisation pr&#233;alable de celui-ci, cette r&#233;mun&#233;ration &#233;tant soumise &#224; la proc&#233;dure de contr&#244;le des conventions r&#232;glement&#233;es. Il pr&#233;voit &#233;galement un avis conforme du comit&#233; d&#8217;entreprise et de l&#8217;assembl&#233;e g&#233;n&#233;rale des actionnaires sur les augmentations substantielles des r&#233;mun&#233;rations des pr&#233;sidents de conseil d&#8217;administration.</p><p style=\"text-align: justify;\">Cette proposition est issue de la proposition de loi visant &#224; r&#233;former le statut des dirigeants de soci&#233;t&#233;s et &#224; encadrer leurs r&#233;mun&#233;rations de Nicole Bricq et des s&#233;nateurs socialistes.</p>"
  },
  "representations": [
    {
      "nom": "PDF",
      "typeMime": {
        "type": "application",
        "subType": "PDF"
      },
      "statutRepresentation": {
        "verbatim": true,
        "canonique": true,
        "officielle": true,
        "transcription": false,
        "enregistrement": false
      },
      "contenu": {
        "documentURI": "/15/amendements/1088/CSPACTE/2190.pdf"
      }
    }
  ],
  "sort": {
    "dateSaisie": "2018-09-14T23:10:02.000+02:00",
    "sortEnSeance": "Rejeté"
  },
  "dateDepot": "2018-09-03T02:00:00.000+02:00",
  "dateDistribution": "2018-09-12T02:00:00.000+02:00",
  "article99": "0",
  "loiReference": {
    "codeLoi": "commerce",
    "divisionCodeLoi": "L225-38"
  }
}