{
  "uid": "AMANR5L15SEA717460BTC0857P0D1N728",
  "identifiant": {
    "legislature": "15",
    "numero": "728",
    "numRect": "0",
    "saisine": {
      "texteLegislatifRef": "PRJLANR5L15BTC0857",
      "numeroPartiePLF": "0",
      "organeExamen": "PO717460",
      "mentionSecondeDeliberation": "0"
    }
  },
  "numeroLong": "728",
  "etapeTexte": "1ère lecture (1ère assemblée saisie)",
  "triAmendement": "bio",
  "cardinaliteAmdtMultiples": "1",
  "etat": "Retiré",
  "signataires": {
    "auteur": {
      "typeAuteur": "Depute",
      "acteurRef": "PA720362",
      "groupePolitiqueRef": "PO730964"
    },
    "cosignatairesRefs": [
      "PA720222",
      "PA720552",
      "PA719464",
      "PA720362",
      "PA722118"
    ],
    "texteAffichable": "M.&#160;Belhaddad,  M.&#160;Nadot, Mme&#160;Rauch, Mme&#160;Sylla et M.&#160;Girardin"
  },
  "pointeurFragmentTexte": {
    "division": {
      "titre": "Article 33 bis",
      "articleDesignationCourte": "APRÈS ART. 33 BIS",
      "type": "ARTICLE",
      "avantAApres": "Apres",
      "divisionRattachee": "APRÈS L'ARTICLE 33 BIS, insérer l'article suivant:",
      "articleAdditionnel": "1",
      "urlDivisionTexteVise": "/15/textes/0857.asp#D_Article_33_bis"
    }
  },
  "corps": {
    "dispositif": "<p style=\"text-align: justify;\">I.&#160;&#8211;&#160;L&#8217;article&#160;200&#160;<i>quater</i>&#160;C du code g&#233;n&#233;ral des imp&#244;ts est ainsi r&#233;tabli&#160;:</p><p style=\"text-align: justify;\">&#171;&#160;<i>Art.&#160;200&#160;</i>quater<i>&#160;C</i>.&#160;&#8211;&#160;Les contribuables domicili&#233;s en France au sens de l&#8217;article&#160;4&#160;B peuvent b&#233;n&#233;ficier d&#8217;un cr&#233;dit d&#8217;imp&#244;t &#233;gal &#224;&#160;5&#160;euros par nuit&#233;e pour l&#8217;h&#233;bergement de personnes &#233;trang&#232;res r&#233;fugi&#233;es ayant demand&#233; l&#8217;octroi d&#8217;un titre de s&#233;jour, dans la limite d&#8217;un plafond fix&#233; &#224;&#160;1&#160;800&#160;euros par personne h&#233;berg&#233;e. Ce cr&#233;dit d&#8217;imp&#244;t vient en r&#233;duction de l&#8217;imp&#244;t sur le revenu d&#251; au titre de l&#8217;ann&#233;e au cours de laquelle l&#8217;h&#233;bergement est effectivement r&#233;alis&#233;, apr&#232;s imputation des r&#233;ductions d&#8217;imp&#244;t mentionn&#233;es aux articles&#160;199&#160;<i>quater</i>&#160;B &#224;&#160;200&#160;<i>bis</i>, des cr&#233;dits d&#8217;imp&#244;t et des pr&#233;l&#232;vements ou retenues non lib&#233;ratoires. Si le cr&#233;dit d&#8217;imp&#244;t exc&#232;de l&#8217;imp&#244;t d&#251;, l&#8217;exc&#233;dent est restitu&#233;.</p><p style=\"text-align: justify;\">&#171;&#160;L&#8217;h&#233;bergement doit &#234;tre r&#233;alis&#233; dans le cadre d&#8217;un contrat avec une association agr&#233;&#233;e dans le cadre de l&#8217;appel &#224; projet de la d&#233;l&#233;gation interminist&#233;rielle &#224; l&#8217;h&#233;bergement et &#224; l&#8217;acc&#232;s au logement en lien avec la direction g&#233;n&#233;rale de la coh&#233;sion sociale pour promouvoir les initiatives d&#8217;h&#233;bergement des r&#233;fugi&#233;s chez les particuliers.</p><p style=\"text-align: justify;\">&#171;&#160;Un d&#233;cret en Conseil d&#8217;&#201;tat d&#233;finit les conditions du contrat.&#160;&#187;</p><p style=\"text-align: justify;\">II.&#160;&#8211;&#160;La perte de recette pour l&#8217;&#201;tat est compens&#233;e &#224; due concurrence par la cr&#233;ation d&#8217;une taxe additionnelle aux droits vis&#233;s aux articles 575 et 575 A du pr&#233;sent code.</p>",
    "exposeSommaire": "<p style=\"text-align: justify;\">En septembre 2016, un appel &#224; projet a &#233;t&#233; lanc&#233; pour favoriser l&#8217;h&#233;bergement de r&#233;fugi&#233;s en familles d&#8217;accueil. Les retours d&#8217;exp&#233;rience ont montr&#233; que m&#234;me si cette forme d&#8217;h&#233;bergement reste fragile par manque souvent d&#8217;encadrement, il joue un r&#244;le d&#8217;acc&#233;l&#233;rateur d&#8217;int&#233;gration et facilite l&#8217;apprentissage du fran&#231;ais.</p><p style=\"text-align: justify;\">Ce dispositif s&#8217;essouffle aujourd&#8217;hui, aussi une incitation financi&#232;re comme un cr&#233;dit d&#8217;imp&#244;t pourra le relancer.</p>"
  },
  "representations": [
    {
      "nom": "PDF",
      "typeMime": {
        "type": "application",
        "subType": "PDF"
      },
      "statutRepresentation": {
        "verbatim": true,
        "canonique": true,
        "officielle": true,
        "transcription": false,
        "enregistrement": false
      },
      "contenu": {
        "documentURI": "/15/amendements/0857/AN/728.pdf"
      }
    }
  ],
  "dateDepot": "2018-04-12T02:00:00.000+02:00",
  "dateDistribution": "2018-04-16T02:00:00.000+02:00",
  "article99": "0",
  "loiReference": {
    "codeLoi": "CGI",
    "divisionCodeLoi": "200 quater C"
  }
}