{
  "uid": "AMANR5L15SEA717460BTC2206P0D1N491",
  "identifiant": {
    "legislature": "15",
    "numero": "491",
    "numRect": "0",
    "saisine": {
      "texteLegislatifRef": "PRJLANR5L15BTC2206",
      "numeroPartiePLF": "0",
      "organeExamen": "PO717460",
      "mentionSecondeDeliberation": "0"
    }
  },
  "numeroLong": "491",
  "etapeTexte": "Nouvelle Lecture",
  "triAmendement": "heacaaaaaaaaaaaaaaaaaaaaaaaaaaaaaaaaaaaaaaaaaaaaaazzzzzzzzzzzzzzu",
  "cardinaliteAmdtMultiples": "1",
  "etat": "Irrecevable",
  "signataires": {
    "auteur": {
      "typeAuteur": "Depute",
      "acteurRef": "PA720892",
      "groupePolitiqueRef": "PO730958"
    },
    "cosignatairesRefs": [
      "PA719676",
      "PA720286",
      "PA718860",
      "PA721226",
      "PA721062",
      "PA720846",
      "PA720892",
      "PA719578",
      "PA588884",
      "PA721210",
      "PA720422",
      "PA720430",
      "PA718868",
      "PA721202",
      "PA721960",
      "PA722142",
      "PA2150"
    ],
    "texteAffichable": "Mme&#160;Panot,  Mme&#160;Autain, M.&#160;Bernalicis, M.&#160;Coquerel, M.&#160;Corbi&#232;re, Mme&#160;Fiat, M.&#160;Lachaud, M.&#160;Larive, M.&#160;M&#233;lenchon, Mme&#160;Obono, M.&#160;Prud&apos;homme, M.&#160;Quatennens, M.&#160;Ratenon, Mme&#160;Ressiguier, Mme&#160;Rubin, M.&#160;Ruffin et Mme&#160;Taurine"
  },
  "pointeurFragmentTexte": {
    "division": {
      "titre": "Article 1er C",
      "articleDesignationCourte": "ART. 1ER C",
      "type": "ARTICLE",
      "avantAApres": "A",
      "divisionRattachee": "ARTICLE 1ER C",
      "urlDivisionTexteVise": "/15/textes/2206.asp#D_Article_1er_C"
    },
    "alinea": {
      "avantAApres": "Apres",
      "numero": "6"
    }
  },
  "corps": {},
  "representations": [
    {
      "nom": "PDF",
      "typeMime": {
        "type": "application",
        "subType": "PDF"
      },
      "statutRepresentation": {
        "verbatim": true,
        "canonique": true,
        "officielle": true,
        "transcription": false,
        "enregistrement": false
      },
      "contenu": {
        "documentURI": "/15/amendements/2206/AN/491.pdf"
      }
    }
  ],
  "dateDepot": "2019-09-06T02:00:00.000+02:00",
  "dateDistribution": "2019-09-09T02:00:00.000+02:00",
  "article99": "0",
  "loiReference": {}
}