{
  "uid": "AMANR5L15PO420120B2296P0D1N77",
  "identifiant": {
    "legislature": "15",
    "numero": "77",
    "numRect": "0",
    "saisine": {
      "texteLegislatifRef": "PRJLANR5L15B2296",
      "numeroPartiePLF": "0",
      "organeExamen": "PO420120",
      "mentionSecondeDeliberation": "0"
    }
  },
  "numeroLong": "AS77",
  "etapeTexte": "1ère lecture (1ère assemblée saisie)",
  "triAmendement": "euaaaaaaaaaaaaaaaaaaaaaaaaaaaaaaaaaaaaaaaaaaaaaaaacbdi",
  "cardinaliteAmdtMultiples": "1",
  "etat": "Irrecevable",
  "signataires": {
    "auteur": {
      "typeAuteur": "Depute",
      "acteurRef": "PA718884",
      "groupePolitiqueRef": "PO730934"
    },
    "cosignatairesRefs": [
      "PA718884"
    ],
    "texteAffichable": "Mme&#160;Bazin-Malgras"
  },
  "pointeurFragmentTexte": {
    "division": {
      "titre": "Article 32",
      "articleDesignationCourte": "APRÈS ART. 32",
      "type": "ARTICLE",
      "avantAApres": "Apres",
      "divisionRattachee": "APRÈS L'ARTICLE 32, insérer l'article suivant:",
      "articleAdditionnel": "1",
      "urlDivisionTexteVise": "/15/textes/2296.asp#D_Article_32"
    }
  },
  "corps": {},
  "representations": [
    {
      "nom": "PDF",
      "typeMime": {
        "type": "application",
        "subType": "PDF"
      },
      "statutRepresentation": {
        "verbatim": true,
        "canonique": true,
        "officielle": true,
        "transcription": false,
        "enregistrement": false
      },
      "contenu": {
        "documentURI": "/15/amendements/2296/CION-SOC/AS77.pdf"
      }
    }
  ],
  "dateDepot": "2019-10-10T02:00:00.000+02:00",
  "dateDistribution": "2019-10-12T02:00:00.000+02:00",
  "article99": "0",
  "loiReference": {
    "codeLoi": "c sécurité sociale",
    "divisionCodeLoi": "L861-2"
  }
}