{
  "uid": "AMANR5L15PO59048B1947P0D1N2",
  "identifiant": {
    "legislature": "15",
    "numero": "2",
    "numRect": "0",
    "saisine": {
      "texteLegislatifRef": "PRJLANR5L15B1947",
      "numeroPartiePLF": "0",
      "organeExamen": "PO59048",
      "mentionSecondeDeliberation": "0"
    }
  },
  "numeroLong": "CF2",
  "etapeTexte": "1ère lecture (1ère assemblée saisie)",
  "triAmendement": "saaaaaaaaaaaaaaaaaaaaaaaaaaaaaaaaaaaaaaaaaaaaaaaaac",
  "cardinaliteAmdtMultiples": "1",
  "etat": "Discuté",
  "signataires": {
    "auteur": {
      "typeAuteur": "Depute",
      "acteurRef": "PA719138",
      "groupePolitiqueRef": "PO759900"
    },
    "cosignatairesRefs": [
      "PA405480",
      "PA720996",
      "PA942",
      "PA331582",
      "PA336175",
      "PA719138"
    ],
    "texteAffichable": "M.&#160;Castellani,  M.&#160;Charles&#160;de Courson, M.&#160;El Guerrab, Mme&#160;Pinel, M.&#160;Philippe&#160;Vigier et M.&#160;Pupponi"
  },
  "pointeurFragmentTexte": {
    "division": {
      "titre": "Article 7",
      "articleDesignationCourte": "APRÈS ART. 7",
      "type": "ARTICLE",
      "avantAApres": "Apres",
      "divisionRattachee": "APRÈS L'ARTICLE 7, insérer l'article suivant:",
      "articleAdditionnel": "1",
      "urlDivisionTexteVise": "/15/textes/1947.asp#D_Article_7"
    }
  },
  "corps": {
    "dispositif": "<p>L&#8217;avis du Conseil d&#8217;&#201;tat relatif aux d&#233;crets d&#8217;avance est communiqu&#233; aux commissions de l&#8217;Assembl&#233;e nationale et du S&#233;nat charg&#233;es des finances.</p>",
    "exposeSommaire": "<p>L&#8217;article 13 de la loi organique n&#176;2001-692 du 1 ao&#251;t 2001 relative aux lois de finances pr&#233;voit que &#171;&#160;en cas d&#8217;urgence, des d&#233;crets d&#8217;avance pris sur avis du Conseil d&#8217;&#201;tat et apr&#232;s avis des commissions de l&#8217;Assembl&#233;e Nationale et S&#233;nat charg&#233;es des finances peuvent ouvrir des cr&#233;dits suppl&#233;mentaires sans affecter l&#8217;&#233;quilibre budg&#233;taire d&#233;fini par la derni&#232;re loi de finances.&#160;&#187;</p><p style=\"text-align: justify;\">Afin d&#8217;am&#233;liorer l&#8217;information de la Repr&#233;sentation nationale, et de lui permettre de mieux remplir sa fonction de contr&#244;le de l&#8217;action du Gouvernement, le pr&#233;sent amendement propose que les avis du Conseil d&#8217;&#201;tat relatifs aux d&#233;crets d&#8217;avance soient communiqu&#233;s aux commissions de l&#8217;Assembl&#233;e nationale et du S&#233;nat charg&#233;es des finances et publi&#233;s.</p><p style=\"text-align: justify;\">L&#8217;avis du Conseil d&#8217;&#201;tat est donn&#233; sur la base de l&#8217;avis des commissions des finances des deux assembl&#233;es qui doivent le rendre dans un d&#233;lai d&#8217;une semaine, pr&#233;cis&#233;ment pour que le Conseil d&#8217;&#201;tat puisse &#234;tre saisi, et ce n&#8217;est qu&#8217;ensuite que le Gouvernement prend le d&#233;cret. Il y a donc une dissym&#233;trie dans la proc&#233;dure, entre un avis de la commission des finances qui va &#234;tre communiqu&#233; au Conseil d&#8217;&#201;tat et un avis du Conseil d&#8217;&#201;tat qui restera confidentiel et dont n&#8217;auront pas connaissance les commissions des finances.</p>"
  },
  "representations": [
    {
      "nom": "PDF",
      "typeMime": {
        "type": "application",
        "subType": "PDF"
      },
      "statutRepresentation": {
        "verbatim": true,
        "canonique": true,
        "officielle": true,
        "transcription": false,
        "enregistrement": false
      },
      "contenu": {
        "documentURI": "/15/amendements/1947/CION_FIN/CF2.pdf"
      }
    }
  ],
  "sort": {
    "dateSaisie": "2019-06-05T10:02:19.000+02:00",
    "sortEnSeance": "Rejeté"
  },
  "dateDepot": "2019-05-29T02:00:00.000+02:00",
  "dateDistribution": "2019-06-04T02:00:00.000+02:00",
  "article99": "0",
  "loiReference": {}
}