{
  "uid": "AMANR5L15SEA717460B2296P0D1N803",
  "identifiant": {
    "legislature": "15",
    "numero": "803",
    "numRect": "0",
    "saisine": {
      "texteLegislatifRef": "PRJLANR5L15B2296",
      "numeroPartiePLF": "0",
      "organeExamen": "PO717460",
      "mentionSecondeDeliberation": "1"
    }
  },
  "numeroLong": "803",
  "etapeTexte": "1ère lecture (1ère assemblée saisie)",
  "triAmendement": "bqaaaaaaaaaaaaaaaaaaaaaaaaaaaaaaaaaaaaaaaaaaaaaaaahvjx",
  "cardinaliteAmdtMultiples": "1",
  "etat": "Discuté",
  "signataires": {
    "auteur": {
      "typeAuteur": "Depute",
      "acteurRef": "PA721286",
      "groupePolitiqueRef": "PO730934"
    },
    "cosignatairesRefs": [
      "PA721046",
      "PA267450",
      "PA718780",
      "PA606098",
      "PA721678",
      "PA334654",
      "PA720100",
      "PA721816",
      "PA721286"
    ],
    "texteAffichable": "M.&#160;Ramadier,  M.&#160;Marleix, M.&#160;Reda, Mme&#160;Trastour-Isnart, M.&#160;Boucard, M.&#160;Straumann, M.&#160;R&#233;mi&#160;Delatte, M.&#160;Pradi&#233; et Mme&#160;Bassire"
  },
  "pointeurFragmentTexte": {
    "division": {
      "titre": "Article 17",
      "articleDesignationCourte": "ART. 17",
      "type": "ARTICLE",
      "avantAApres": "A",
      "divisionRattachee": "ARTICLE 17",
      "urlDivisionTexteVise": "/15/textes/2296.asp#D_Article_17"
    },
    "alinea": {
      "numero": "55"
    }
  },
  "corps": {
    "dispositif": "<p>Compl&#233;ter l&#8217;alin&#233;a&#160;55 par la phrase suivante&#160;:</p><p style=\"text-align: justify;\">&#171;&#160;Les modalit&#233;s d&#8217;attribution de l&#8217;enveloppe de 50 millions d&#8217;euros susvis&#233;e sont pr&#233;cis&#233;es par d&#233;cret d'application.&#160;&#187;</p>",
    "exposeSommaire": "<p style=\"text-align: justify;\">La tarification et le financement des SAAD ne r&#233;pondent pas &#224; l&#8217;enjeu d&#233;mographique actuel et au fait que les personnes souhaitent majoritairement rester &#224; leur domicile.</p><p style=\"text-align: justify;\">Dans ce contexte, le d&#233;cret n&#176;&#160;2019&#8209;457 du 15 mai 2019, pr&#233;vu &#224; l&#8217;article&#160;26 de la LFSS 2019, est venu poser les bases d&#8217;une pr&#233;figuration d&#8217;un nouveau mod&#232;le de financement des SAAD.</p><p style=\"text-align: justify;\">Si celui-ci visait &#224; fixer les crit&#232;res de s&#233;lection pour l&#8217;attribution de l&#8217;enveloppe de 50 millions pour l&#8217;ann&#233;e 2019 octroy&#233;e par la CNSA[1], il conserve &#233;galement les m&#234;mes principes de financement et de tarification qui existent et ne pr&#233;figure de ce fait aucune r&#233;forme d&#8217;ampleur.</p><p style=\"text-align: justify;\">En effet, celui-ci impose aux SAAD de conclure un contrat pluriannuel d&#8217;objectifs et de moyens (CPOM) et op&#232;re une diff&#233;rence d&#8217;attribution des cr&#233;dits entre les SAAD habilit&#233;s et les SAAD non habilit&#233;s, ce qui institue une in&#233;galit&#233; de reste &#224; charge entre les b&#233;n&#233;ficiaires.</p><p style=\"text-align: justify;\">C&#8217;est pourquoi, plusieurs f&#233;d&#233;rations du secteur m&#233;dico-social ont engag&#233; un recours contentieux contre ce texte r&#233;glementaire.</p><p style=\"text-align: justify;\">Le pr&#233;sent amendement vise ainsi &#224; faire pr&#233;ciser par d&#233;cret de nouvelles modalit&#233;s d&#8217;attribution de l&#8217;enveloppe de 50 millions allou&#233;e au secteur du Domicile pour l&#8217;ann&#233;e 2020, prises en concertation avec les acteurs du secteur m&#233;dico-social.</p><p style=\"text-align: justify;\">&#160;</p>"
  },
  "representations": [
    {
      "nom": "PDF",
      "typeMime": {
        "type": "application",
        "subType": "PDF"
      },
      "statutRepresentation": {
        "verbatim": true,
        "canonique": true,
        "officielle": true,
        "transcription": false,
        "enregistrement": false
      },
      "contenu": {
        "documentURI": "/15/amendements/2296/AN/803.pdf"
      }
    }
  ],
  "seanceDiscussion": "RUANR5L15S2020IDS21878",
  "sort": {
    "dateSaisie": "2019-10-24T16:26:17.000+02:00",
    "sortEnSeance": "Rejeté"
  },
  "dateDepot": "2019-10-17T02:00:00.000+02:00",
  "dateDistribution": "2019-10-21T02:00:00.000+02:00",
  "article99": "0",
  "loiReference": {}
}