{
  "uid": "AMANR5L15SEA717460BTC1939P0D1N66",
  "identifiant": {
    "legislature": "15",
    "numero": "66",
    "numRect": "0",
    "saisine": {
      "texteLegislatifRef": "PIONANR5L15BTC1939",
      "numeroPartiePLF": "0",
      "organeExamen": "PO717460",
      "mentionSecondeDeliberation": "0"
    }
  },
  "numeroLong": "66",
  "etapeTexte": "Nouvelle Lecture",
  "triAmendement": "bcaaaaaaaaaaaaaaaaaaaaaaaaaaaaaaaaaaaaaaaaaaaaaaaal",
  "cardinaliteAmdtMultiples": "1",
  "etat": "Discuté",
  "signataires": {
    "auteur": {
      "typeAuteur": "Depute",
      "acteurRef": "PA267766",
      "groupePolitiqueRef": "PO744425"
    },
    "cosignatairesRefs": [
      "PA719806",
      "PA267241",
      "PA712014",
      "PA2952",
      "PA268019",
      "PA267766",
      "PA421348",
      "PA721486",
      "PA720230",
      "PA332228",
      "PA642868",
      "PA610775",
      "PA721094",
      "PA331567",
      "PA695100",
      "PA266788",
      "PA342601",
      "PA267355"
    ],
    "texteAffichable": "M.&#160;Guy&#160;Bricout,  Mme&#160;Auconie, M.&#160;Benoit, M.&#160;Brindeau, M.&#160;Christophe, Mme&#160;de La Raudi&#232;re, M.&#160;Demilly, M.&#160;Dunoyer, M.&#160;Gom&#232;s, M.&#160;Meyer&#160;Habib, M.&#160;Herth, M.&#160;Lagarde, M.&#160;Ledoux, Mme&#160;Magnier, M.&#160;Morel-&#192;-L&apos;Huissier, M.&#160;Naegelen, M.&#160;Villiers et M.&#160;Warsmann"
  },
  "pointeurFragmentTexte": {
    "division": {
      "titre": "Article 2",
      "articleDesignationCourte": "ART. 2",
      "type": "ARTICLE",
      "avantAApres": "A",
      "divisionRattachee": "ARTICLE 2",
      "urlDivisionTexteVise": "/15/textes/1939.asp#D_Article_2"
    },
    "alinea": {
      "numero": "21"
    }
  },
  "corps": {
    "dispositif": "<p style=\"text-align: justify;\">Compl&#233;ter l&#8217;alin&#233;a&#160;21 par la phrase suivante&#160;:</p><p style=\"text-align: justify;\">&#171;&#160;Il pr&#233;sente notamment des propositions de simplification en mati&#232;re de normes et de r&#233;glementations applicables aux collectivit&#233;s territoriales.&#160;&#187;</p>",
    "exposeSommaire": "<p style=\"text-align: justify;\"><br />Au vu des missions de la future agence nationale de la coh&#233;sion des territoires, il convient de pr&#233;ciser dans la loi que le rapport annuel rendant compte de l&#8217;ex&#233;cution des missions de l&#8217;Agence pr&#233;sente des propositions de simplification des normes en vue d&#8217;aboutir &#224; un contrat unique de la coh&#233;sion territoriale, comme pr&#233;vu dans le rapport du Pr&#233;fet pr&#233;figurateur.</p>"
  },
  "representations": [
    {
      "nom": "PDF",
      "typeMime": {
        "type": "application",
        "subType": "PDF"
      },
      "statutRepresentation": {
        "verbatim": true,
        "canonique": true,
        "officielle": true,
        "transcription": false,
        "enregistrement": false
      },
      "contenu": {
        "documentURI": "/15/amendements/1939/AN/66.pdf"
      }
    }
  ],
  "sort": {
    "dateSaisie": "2019-05-15T19:55:26.000+02:00",
    "sortEnSeance": "Rejeté"
  },
  "dateDepot": "2019-05-10T02:00:00.000+02:00",
  "dateDistribution": "2019-05-15T02:00:00.000+02:00",
  "article99": "0",
  "loiReference": {}
}