{
  "uid": "AMANR5L15PO59051B1300P0D1N44",
  "identifiant": {
    "legislature": "15",
    "numero": "44",
    "numRect": "1",
    "saisine": {
      "texteLegislatifRef": "PNREANR5L15B1300",
      "numeroPartiePLF": "0",
      "organeExamen": "PO59051",
      "mentionSecondeDeliberation": "0"
    }
  },
  "numeroLong": "CL44 (Rect)",
  "etapeTexte": "Lecture unique",
  "triAmendement": "eaaaaaaaaaaaaaaaaaaaaaaaaaaaaaaaaaaaaaaaaaaaaaaaaaap",
  "cardinaliteAmdtMultiples": "1",
  "etat": "Discuté",
  "signataires": {
    "auteur": {
      "typeAuteur": "Depute",
      "acteurRef": "PA719684",
      "groupePolitiqueRef": "PO730964"
    },
    "cosignatairesRefs": [
      "PA719684",
      "PA720772"
    ],
    "texteAffichable": "Mme&#160;Dubost, rapporteure et M.&#160;Bru, rapporteur"
  },
  "pointeurFragmentTexte": {
    "division": {
      "titre": "Article unique",
      "articleDesignationCourte": "ART. UNIQUE",
      "type": "ARTICLE",
      "avantAApres": "A",
      "divisionRattachee": "ARTICLE UNIQUE",
      "urlDivisionTexteVise": "/15/textes/1300.asp#D_Article_unique"
    },
    "alinea": {
      "avantAApres": "Apres",
      "numero": "3"
    }
  },
  "corps": {
    "dispositif": "<p style=\"text-align: justify;\">Apr&#232;s l&#8217;alin&#233;a&#160;3, ins&#233;rer l&#8217;alin&#233;a suivant&#160;:</p><p style=\"text-align: justify;\">&#171;&#160;Vu les articles&#160;258, 259 et 260 du trait&#233; sur le fonctionnement de l&#8217;Union europ&#233;enne (TFUE),&#160;&#187;.</p>",
    "exposeSommaire": "<p>Il est propos&#233; de compl&#233;ter les visas de la proposition de r&#233;solution, afin de se r&#233;f&#233;rer explicitement &#224; la proc&#233;dure d'infraction (article 258 du TFUE) et &#224; la possibilit&#233; pour chaque Etat membre de se substituer &#224; la Commission europ&#233;enne pour saisir la CJUE (article 259), qui constituent des instruments puissants pouvant &#234;tre mobilis&#233;s afin de pr&#233;venir les menaces de violation et les violations de l'Etat de droit.</p>"
  },
  "representations": [
    {
      "nom": "PDF",
      "typeMime": {
        "type": "application",
        "subType": "PDF"
      },
      "statutRepresentation": {
        "verbatim": true,
        "canonique": true,
        "officielle": true,
        "transcription": false,
        "enregistrement": false
      },
      "contenu": {
        "documentURI": "/15/amendements/1300/CION_LOIS/CL44.pdf"
      }
    }
  ],
  "sort": {
    "dateSaisie": "2018-10-24T11:25:35.000+02:00",
    "sortEnSeance": "Adopté"
  },
  "dateDepot": "2018-10-23T02:00:00.000+02:00",
  "dateDistribution": "2018-10-23T02:00:00.000+02:00",
  "article99": "0",
  "loiReference": {}
}