{
  "uid": "AMANR5L15PO59048B2272P2D1N1513",
  "identifiant": {
    "legislature": "15",
    "numero": "1513",
    "numRect": "0",
    "saisine": {
      "texteLegislatifRef": "PRJLANR5L15B2272",
      "numeroPartiePLF": "2",
      "organeExamen": "PO59048",
      "mentionSecondeDeliberation": "0"
    }
  },
  "numeroLong": "II-CF1513",
  "etapeTexte": "1ère lecture (1ère assemblée saisie)",
  "triAmendement": "jfaaaaaaaaaaaaaaaaaaaaaaaaaaaaaaaaaaaaaaaaaaaaaaaaj",
  "cardinaliteAmdtMultiples": "1",
  "etat": "Discuté",
  "signataires": {
    "auteur": {
      "typeAuteur": "Depute",
      "acteurRef": "PA720298",
      "groupePolitiqueRef": "PO730964"
    },
    "cosignatairesRefs": [
      "PA721542",
      "PA722382",
      "PA722078",
      "PA719250",
      "PA721764",
      "PA718954",
      "PA719592",
      "PA720492",
      "PA719472",
      "PA721466",
      "PA719480",
      "PA720590",
      "PA721150",
      "PA719798",
      "PA720878",
      "PA720298",
      "PA607595",
      "PA719850",
      "PA760658",
      "PA643175",
      "PA720268",
      "PA720520",
      "PA720960",
      "PA718736",
      "PA719006",
      "PA721458",
      "PA607193",
      "PA720790",
      "PA722244",
      "PA722054",
      "PA719060",
      "PA720022",
      "PA719710",
      "PA720402",
      "PA606675",
      "PA719778",
      "PA720500"
    ],
    "texteAffichable": "Mme&#160;Cariou,  M.&#160;Ahamada, M.&#160;Andr&#233;, Mme&#160;Cattelot, M.&#160;Cazeneuve, M.&#160;Chassaing, M.&#160;Chouat, M.&#160;Damaisin, Mme&#160;Dominique&#160;David, M.&#160;Dirx, Mme&#160;Dupont, Mme&#160;Errante, M.&#160;Gaillard, M.&#160;Grau, Mme&#160;Gregoire, Mme&#160;Hai, M.&#160;Holroyd, M.&#160;Jerretie, M.&#160;Jolivet, M.&#160;Labaronne, M.&#160;Lauzzana, M.&#160;Le Vigoureux, Mme&#160;Magne, Mme&#160;Motin, Mme&#160;Osson, M.&#160;Paluszkiewicz, M.&#160;Pellois, Mme&#160;Val&#233;rie&#160;Petit, Mme&#160;Peyrol, M.&#160;Potterie, M.&#160;Roseren, M.&#160;Saint-Martin, M.&#160;Savatier, M.&#160;Serva, M.&#160;Simian, Mme&#160;Verdier-Jouclas, M.&#160;Le Gendre et les membres du groupe La R&#233;publique en Marche"
  },
  "pointeurFragmentTexte": {
    "division": {
      "titre": "Article 61",
      "articleDesignationCourte": "ART. 61",
      "type": "ARTICLE",
      "avantAApres": "A",
      "divisionRattachee": "ARTICLE 61",
      "urlDivisionTexteVise": "/15/textes/2272C.asp#D_Article_61"
    },
    "alinea": {
      "avantAApres": "A",
      "numero": "2",
      "alineaDesignation": "Alinéa 2"
    }
  },
  "corps": {
    "dispositif": "<p>I.&#160;&#8211;&#160;Supprimer l&#8217;alin&#233;a&#160;4.</p><p style=\"text-align: justify;\">II.&#160;&#8211;&#160;En cons&#233;quence, apr&#232;s l&#8217;alin&#233;a&#160;7, ins&#233;rer l&#8217;alin&#233;a suivant&#160;:</p><p style=\"text-align: justify;\">&#171;&#160;<i>c)</i> Les taxes pr&#233;vues au chapitre V du titre I<sup>er</sup> du livre I<sup>er</sup> du code du cin&#233;ma et de l&#8217;image anim&#233;e&#160;;&#160;&#187;.</p>",
    "exposeSommaire": "<p>Le pr&#233;sent amendement a pour objet de diff&#233;rer au 1<sup>er</sup> janvier 2022, le transfert du recouvrement des taxes affect&#233;es au Centre national du cin&#233;ma et de l&#8217;image anim&#233;e (CNC) - &#224; savoir la taxe sur le prix des entr&#233;es aux s&#233;ances organis&#233;es par les exploitants d&#8217;&#233;tablissements de spectacles cin&#233;matographiques, la taxe sur les &#233;diteurs et distributeurs de services de t&#233;l&#233;vision et les cotisations professionnelles - aux services de la direction g&#233;n&#233;rale des finances publiques (DGFiP).</p><p style=\"text-align: justify;\">Ce report est rendu n&#233;cessaire pour finaliser les modalit&#233;s techniques de ce transfert, notamment les d&#233;veloppements informatiques pour l&#8217;adaptation des applications de recouvrement.</p><p style=\"text-align: justify;\">S&#8217;agissant plus particuli&#232;rement de la taxe sur le prix des entr&#233;es aux salles de cin&#233;ma, son versement est &#233;troitement corr&#233;l&#233; aux soutiens vers&#233;s par le CNC aux exploitants de salles. En effet, des applications informatiques sp&#233;cialement d&#233;di&#233;es calculent automatiquement le montant d&#8217;aides auxquelles peuvent pr&#233;tendre les exploitants en fonction du montant de taxe qu&#8217;ils ont acquitt&#233;.</p><p style=\"text-align: justify;\">Ainsi, une p&#233;riode d&#8217;adaptation est n&#233;cessaire pour mettre en place un nouvel outil d&#8217;&#233;change automatique et instantan&#233; d&#8217;informations entre le CNC et la DGFiP.</p>"
  },
  "representations": [
    {
      "nom": "PDF",
      "typeMime": {
        "type": "application",
        "subType": "PDF"
      },
      "statutRepresentation": {
        "verbatim": true,
        "canonique": true,
        "officielle": true,
        "transcription": false,
        "enregistrement": false
      },
      "contenu": {
        "documentURI": "/15/amendements/2272C/CION_FIN/CF1513.pdf"
      }
    }
  ],
  "sort": {
    "dateSaisie": "2019-11-06T23:12:46.000+01:00",
    "sortEnSeance": "Adopté"
  },
  "dateDepot": "2019-11-02T01:00:00.000+01:00",
  "dateDistribution": "2019-11-06T01:00:00.000+01:00",
  "article99": "0",
  "loiReference": {}
}