{
  "uid": "AMANR5L15SEA717460B1255P1D1N2382",
  "identifiant": {
    "legislature": "15",
    "numero": "2382",
    "numRect": "0",
    "saisine": {
      "texteLegislatifRef": "PRJLANR5L15B1255",
      "numeroPartiePLF": "1",
      "organeExamen": "PO717460",
      "mentionSecondeDeliberation": "0"
    }
  },
  "numeroLong": "I-2382",
  "etapeTexte": "1ère lecture (1ère assemblée saisie)",
  "triAmendement": "dbaaaaaaaaaaaaaaaaaaaaaaaaaaaaaaaaaaaaaaaaaaaaaaaabf",
  "cardinaliteAmdtMultiples": "1",
  "etat": "Discuté",
  "signataires": {
    "auteur": {
      "typeAuteur": "Rapporteur",
      "acteurRef": "PA267336",
      "organeRef": "PO59048",
      "groupePolitiqueRef": "PO730964"
    },
    "cosignatairesRefs": [
      "PA720222",
      "PA719700",
      "PA719218",
      "PA721750",
      "PA719230",
      "PA608416",
      "PA721710",
      "PA719616",
      "PA719388",
      "PA722320",
      "PA720960",
      "PA721624",
      "PA718884",
      "PA721458",
      "PA718850",
      "PA721876",
      "PA718744",
      "PA721328",
      "PA721174",
      "PA720014",
      "PA721344",
      "PA722118",
      "PA719154",
      "PA720446",
      "PA721764",
      "PA343493",
      "PA332747",
      "PA334654",
      "PA720202",
      "PA718838",
      "PA722190",
      "PA720862",
      "PA720512",
      "PA719162",
      "PA719842",
      "PA720146",
      "PA721296",
      "PA330909",
      "PA642847",
      "PA720210",
      "PA719480",
      "PA267673",
      "PA719660",
      "PA719052",
      "PA721808",
      "PA721514",
      "PA721466",
      "PA718756",
      "PA720806",
      "PA721384",
      "PA721522",
      "PA722062",
      "PA720414",
      "PA721564",
      "PA720908",
      "PA330684",
      "PA721166",
      "PA721600",
      "PA643134",
      "PA720454",
      "PA702054",
      "PA719440",
      "PA722038",
      "PA719814",
      "PA719520",
      "PA719728",
      "PA606675",
      "PA721616",
      "PA719684",
      "PA608083",
      "PA332523",
      "PA720402",
      "PA720944",
      "PA720310",
      "PA718876",
      "PA722336",
      "PA720622",
      "PA719108",
      "PA719118",
      "PA607619",
      "PA721718",
      "PA719994",
      "PA721852",
      "PA722054",
      "PA718736",
      "PA720214",
      "PA1012",
      "PA720854",
      "PA721434",
      "PA721498",
      "PA720298",
      "PA721410",
      "PA334768",
      "PA722252",
      "PA605036",
      "PA719882",
      "PA724827",
      "PA719960",
      "PA720170",
      "PA719080",
      "PA720814",
      "PA720952",
      "PA720568",
      "PA719456",
      "PA721336",
      "PA722000",
      "PA722312",
      "PA720030",
      "PA719364",
      "PA719858",
      "PA718710",
      "PA642695",
      "PA722244",
      "PA719404",
      "PA642724",
      "PA722268",
      "PA719668",
      "PA607155",
      "PA720046",
      "PA721506",
      "PA722366",
      "PA721352",
      "PA719170",
      "PA719778",
      "PA642788",
      "PA721584",
      "PA719130",
      "PA719326",
      "PA720378",
      "PA719866",
      "PA721792",
      "PA720900",
      "PA719740",
      "PA722078",
      "PA721218",
      "PA719412",
      "PA720492",
      "PA719100",
      "PA722398",
      "PA719512",
      "PA720066",
      "PA721702",
      "PA722022",
      "PA719770",
      "PA719830",
      "PA677483",
      "PA720830",
      "PA608641",
      "PA720342",
      "PA720754",
      "PA672",
      "PA719060",
      "PA719822",
      "PA717379",
      "PA720394",
      "PA334116",
      "PA719194",
      "PA722300",
      "PA719330",
      "PA722228",
      "PA719258",
      "PA718810",
      "PA719464",
      "PA718694",
      "PA718728",
      "PA607193",
      "PA722086",
      "PA643127",
      "PA722260",
      "PA720560",
      "PA606202",
      "PA721024",
      "PA643205",
      "PA719202",
      "PA720870",
      "PA719570",
      "PA722170",
      "PA607595",
      "PA719624",
      "PA719024",
      "PA719338",
      "PA722008",
      "PA1874",
      "PA719072",
      "PA720916",
      "PA346876",
      "PA718990",
      "PA719600",
      "PA719756",
      "PA720480",
      "PA2828",
      "PA720242",
      "PA267260",
      "PA722094",
      "PA720576",
      "PA721398",
      "PA720230",
      "PA719372",
      "PA721004",
      "PA2449",
      "PA720354",
      "PA719652",
      "PA605084",
      "PA721916",
      "PA720370",
      "PA719448",
      "PA721474",
      "PA719922",
      "PA719952",
      "PA608016",
      "PA721568",
      "PA340853",
      "PA721364",
      "PA720644",
      "PA720038",
      "PA719632",
      "PA720198",
      "PA718802",
      "PA722150",
      "PA718674",
      "PA719972",
      "PA719092",
      "PA721670",
      "PA605963",
      "PA720552",
      "PA721644",
      "PA720438",
      "PA720538",
      "PA722134",
      "PA722046",
      "PA720362",
      "PA721246",
      "PA722070",
      "PA719006",
      "PA719528",
      "PA721426",
      "PA719980",
      "PA721372",
      "PA606171",
      "PA720054",
      "PA721678",
      "PA605518",
      "PA721158",
      "PA609726",
      "PA720022",
      "PA942",
      "PA718954",
      "PA719540",
      "PA720790",
      "PA720124",
      "PA721968",
      "PA721800",
      "PA722126",
      "PA719550",
      "PA719186",
      "PA331835",
      "PA720138",
      "PA720738",
      "PA719294",
      "PA712014",
      "PA721542",
      "PA718962",
      "PA719032",
      "PA720116",
      "PA722236",
      "PA719890",
      "PA719798",
      "PA721836",
      "PA721860",
      "PA720932",
      "PA267429",
      "PA267336",
      "PA721888",
      "PA719790",
      "PA720278",
      "PA721450",
      "PA721776",
      "PA721726",
      "PA720268",
      "PA721036",
      "PA719592",
      "PA722382",
      "PA720878",
      "PA720500",
      "PA720154",
      "PA719310",
      "PA720190",
      "PA718930",
      "PA721880",
      "PA720108",
      "PA719250",
      "PA718944",
      "PA722358",
      "PA718894",
      "PA720590",
      "PA719748",
      "PA606507",
      "PA719850",
      "PA606639",
      "PA719692",
      "PA719420",
      "PA721946",
      "PA720780",
      "PA720520",
      "PA719302",
      "PA331582",
      "PA718682",
      "PA718918",
      "PA719496",
      "PA719350",
      "PA718910",
      "PA721150",
      "PA722102",
      "PA720318",
      "PA721690",
      "PA718902",
      "PA721278",
      "PA722292",
      "PA722344",
      "PA719318",
      "PA718768",
      "PA721656",
      "PA721824",
      "PA718794",
      "PA609520",
      "PA336316",
      "PA721262",
      "PA719472",
      "PA719396",
      "PA719242",
      "PA719718",
      "PA721908",
      "PA718706",
      "PA721142",
      "PA643175",
      "PA719710",
      "PA720074",
      "PA721784",
      "PA709315",
      "PA721844",
      "PA722178",
      "PA721134",
      "PA721956"
    ],
    "texteAffichable": "M.&#160;Giraud, rapporteur g&#233;n&#233;ral au nom de la commission des finances,  Mme&#160;de Montchalin, M.&#160;Bothorel, M.&#160;Ahamada, M.&#160;Alauzet, Mme&#160;Cariou, Mme&#160;Cattelot, M.&#160;Cazeneuve, M.&#160;Chassaing, M.&#160;Damaisin, Mme&#160;Dominique&#160;David, M.&#160;Dirx, Mme&#160;Dupont, Mme&#160;Errante, M.&#160;Gaillard, Mme&#160;Goulet, M.&#160;Grau, Mme&#160;Gregoire, M.&#160;Guerini, Mme&#160;Hai, M.&#160;Holroyd, M.&#160;Jerretie, M.&#160;Jolivet, M.&#160;Labaronne, M.&#160;Lauzzana, M.&#160;Le Vigoureux, Mme&#160;Magne, Mme&#160;Motin, Mme&#160;Osson, M.&#160;Paluszkiewicz, M.&#160;Pellois, M.&#160;Person, Mme&#160;Val&#233;rie&#160;Petit, Mme&#160;Peyrol, M.&#160;Roseren, M.&#160;Saint-Martin, M.&#160;Savatier, M.&#160;Serva, M.&#160;Simian, Mme&#160;Verdier-Jouclas, Mme&#160;Abadie, Mme&#160;Abba, M.&#160;Damien&#160;Adam, M.&#160;L&#233;na&#239;ck&#160;Adam, Mme&#160;Ali, Mme&#160;Amadou, M.&#160;Anato, M.&#160;Andr&#233;, M.&#160;Anglade, M.&#160;Ardouin, M.&#160;Arend, M.&#160;Attal, Mme&#160;Avia, M.&#160;Bachelier, Mme&#160;Bagarry, M.&#160;Baich&#232;re, M.&#160;Barbier, M.&#160;Batut, Mme&#160;Beaudouin-Hubiere, M.&#160;Belhaddad, Mme&#160;Berg&#233;, M.&#160;Berville, M.&#160;Besson-Moreau, Mme&#160;Bessot Ballot, Mme&#160;Blanc, M.&#160;Blanchet, M.&#160;Blein, M.&#160;Bois, M.&#160;Bonnell, Mme&#160;Bono-Vandorme, M.&#160;Borowczyk, M.&#160;Boudi&#233;, Mme&#160;Bourguignon, M.&#160;Bouyx, Mme&#160;Pascale&#160;Boyer, Mme&#160;Braun-Pivet, M.&#160;Bridey, Mme&#160;Brocard, Mme&#160;Brugnera, Mme&#160;Brulebois, Mme&#160;Brunet, M.&#160;Buchou, Mme&#160;Bureau-Bonnard, M.&#160;Cabar&#233;, Mme&#160;Calvez, M.&#160;Causse, Mme&#160;Cazarian, Mme&#160;Cazebonne, M.&#160;Cazenove, M.&#160;Cellier, M.&#160;Cesarini, Mme&#160;Chalas, M.&#160;Chalumeau, Mme&#160;Chapelier, Mme&#160;Charri&#232;re, Mme&#160;Charvier, M.&#160;Chiche, M.&#160;Claireaux, Mme&#160;Clapot, Mme&#160;Cloarec, M.&#160;Colas-Roy, Mme&#160;Colboc, M.&#160;Cormier-Bouligeon, Mme&#160;Couillard, Mme&#160;Crouzet, M.&#160;Da Silva, M.&#160;Daniel, Mme&#160;Yolaine&#160;de Courson, Mme&#160;de Lavergne, M.&#160;de Rugy, Mme&#160;De Temmerman, Mme&#160;Degois, M.&#160;Marc&#160;Delatte, M.&#160;Delpon, M.&#160;Descrozaille, M.&#160;Di Pompeo, M.&#160;Djebbari, Mme&#160;Do, M.&#160;Dombreval, Mme&#160;Jacqueline&#160;Dubois, Mme&#160;Dubos, Mme&#160;Dubost, Mme&#160;Dubr&#233;-Chirat, Mme&#160;Dufeu Schubert, Mme&#160;Fran&#231;oise&#160;Dumas, M.&#160;D&#233;moulin, M.&#160;Eliaou, M.&#160;Euzet, Mme&#160;Fabre, Mme&#160;Fajgeles, Mme&#160;Faure-Muntian, M.&#160;Fauvergue, M.&#160;Ferrand, M.&#160;Fi&#233;vet, M.&#160;Folliot, Mme&#160;Fontaine-Domeizel, Mme&#160;Fontenel-Personne, Mme&#160;Forteza, M.&#160;Freschi, M.&#160;Fugit, Mme&#160;Gaillot, M.&#160;Galbadon, M.&#160;Gassilloud, M.&#160;Gauvain, Mme&#160;Gayte, Mme&#160;Genetet, Mme&#160;Gipson, M.&#160;Girardin, Mme&#160;Givernet, Mme&#160;Gomez-Bassac, M.&#160;Gouffier-Cha, M.&#160;Gouttefarde, Mme&#160;Grandjean, Mme&#160;Granjus, Mme&#160;Guerel, Mme&#160;Gu&#233;venoux, M.&#160;G&#233;rard, Mme&#160;Hammerer, M.&#160;Haury, Mme&#160;Hennion, M.&#160;Henriet, M.&#160;Houbron, M.&#160;Houli&#233;, M.&#160;Hupp&#233;, Mme&#160;H&#233;rin, Mme&#160;Iborra, M.&#160;Jacques, Mme&#160;Janvier, Mme&#160;Josso, M.&#160;Julien-Laferriere, Mme&#160;Kamowski, M.&#160;Kasbarian, Mme&#160;Kerbarh, M.&#160;Kerlogot, M.&#160;Kervran, Mme&#160;Khattabi, Mme&#160;Khedher, M.&#160;Kokouendo, M.&#160;Krabal, Mme&#160;Krimi, Mme&#160;Kuric, M.&#160;Laabid, Mme&#160;Lakrafi, M.&#160;Fran&#231;ois-Michel&#160;Lambert, Mme&#160;Lang, Mme&#160;Lardet, M.&#160;Larsonneur, Mme&#160;Lazaar, M.&#160;Le Bohec, Mme&#160;Le Feur, M.&#160;Le Gac, Mme&#160;Le Meur, Mme&#160;Le Peih, Mme&#160;Lebec, M.&#160;Leclabart, Mme&#160;Lecocq, Mme&#160;Leguille-Balloy, M.&#160;Lejeune, Mme&#160;Lenne, M.&#160;Lescure, Mme&#160;Limon, M.&#160;Lioger, Mme&#160;Liso, Mme&#160;Louis, M.&#160;Maillard, Mme&#160;Maillart-M&#233;haignerie, M.&#160;Maire, Mme&#160;Jacqueline&#160;Maquet, M.&#160;Marilossian, Mme&#160;Marsaud, M.&#160;Martin, M.&#160;Mass&#233;glia, M.&#160;Matras, Mme&#160;Mauborgne, M.&#160;Mazars, M.&#160;Mbaye, Mme&#160;Melchior, M.&#160;Mendes, M.&#160;Mesnier, Mme&#160;Meynier-Millefert, Mme&#160;Michel, M.&#160;Michels, Mme&#160;Mirall&#232;s, M.&#160;Mis, M.&#160;Molac, M.&#160;Moreau, M.&#160;Morenas, Mme&#160;Moutchou, Mme&#160;Muschotti, Mme&#160;M&#246;rch, M.&#160;Nadot, M.&#160;Nogal, Mme&#160;O, Mme&#160;O&apos;Petit, Mme&#160;Oppelt, M.&#160;Orphelin, Mme&#160;Panonacle, M.&#160;Paris, Mme&#160;Park, M.&#160;Perea, M.&#160;Perrot, Mme&#160;Petel, Mme&#160;Peyron, M.&#160;Pichereau, M.&#160;Pietraszewski, Mme&#160;Piron, Mme&#160;Pitollat, Mme&#160;Pompili, M.&#160;Pont, M.&#160;Portarrieu, M.&#160;Potterie, M.&#160;Poulliat, Mme&#160;Pouzyreff, M.&#160;Questel, Mme&#160;Racon-Bouzon, M.&#160;Raphan, Mme&#160;Rauch, M.&#160;Rebeyrotte, M.&#160;Renson, Mme&#160;Rilhac, Mme&#160;Riotton, Mme&#160;Rist, Mme&#160;Rixain, Mme&#160;Robert, Mme&#160;Romeiro Dias, Mme&#160;Rossi, M.&#160;Rouillard, M.&#160;C&#233;dric&#160;Roussel, M.&#160;Rudigoz, M.&#160;Rupin, Mme&#160;Saint-Paul, Mme&#160;Sarles, M.&#160;Sempastous, M.&#160;Sol&#232;re, M.&#160;Sommer, M.&#160;Son-Forget, M.&#160;Sorre, M.&#160;Studer, Mme&#160;Sylla, M.&#160;Tach&#233;, Mme&#160;Tamarelle-Verhaeghe, M.&#160;Tan, Mme&#160;Tanguy, M.&#160;Taquet, M.&#160;Terlier, M.&#160;Test&#233;, Mme&#160;Thill, Mme&#160;Thillaye, M.&#160;Thi&#233;baut, Mme&#160;Thomas, Mme&#160;Thourot, Mme&#160;Tiegna, M.&#160;Touraine, M.&#160;Tourret, Mme&#160;Toutut-Picard, Mme&#160;Trisse, M.&#160;Trompille, Mme&#160;Tuffnell, Mme&#160;Valetta Ardisson, Mme&#160;Vanceunebrock-Mialon, Mme&#160;Vidal, M.&#160;Vignal, Mme&#160;Vignon, M.&#160;Villani, M.&#160;Vuilletet, M.&#160;V&#233;ran, Mme&#160;Wonner, Mme&#160;Zannier, M.&#160;Zulesi, M.&#160;Le Gendre, Mme&#160;Louwagie, M.&#160;Nury, M.&#160;Hetzel, M.&#160;Bouchet, M.&#160;Straumann, M.&#160;Cinieri, Mme&#160;Beauvais, M.&#160;Bazin, Mme&#160;Val&#233;rie&#160;Boyer, M.&#160;Aubert, M.&#160;Leclerc, Mme&#160;Kuster, Mme&#160;Bonnivard, Mme&#160;Valentin, M.&#160;Reda, M.&#160;Le Fur, Mme&#160;Anthoine, Mme&#160;Bazin-Malgras, M.&#160;Cordier, M.&#160;Vialay, Mme&#160;Poletti, M.&#160;de la Verpilli&#232;re, M.&#160;Descoeur, M.&#160;Brun, M.&#160;Viry, Mme&#160;Dalloz, M.&#160;Viala, M.&#160;Abad, M.&#160;Barrot, M.&#160;Charles&#160;de Courson, M.&#160;Philippe&#160;Vigier, Mme&#160;Magnier et M.&#160;Ledoux"
  },
  "pointeurFragmentTexte": {
    "division": {
      "titre": "Article 14",
      "articleDesignationCourte": "ART. 14",
      "type": "ARTICLE",
      "avantAApres": "A",
      "divisionRattachee": "ARTICLE 14",
      "urlDivisionTexteVise": "/15/textes/1255A.asp#D_Article_14"
    },
    "alinea": {
      "numero": "46"
    }
  },
  "corps": {
    "dispositif": "<p style=\"text-align: justify;\">I.&#160;&#8211;&#160;&#192; la fin de l&#8217;alin&#233;a&#160;46, supprimer les mots&#160;:</p><p style=\"text-align: justify;\">&#171;&#160;n&#8217;ayant pas d&#233;j&#224; g&#233;n&#233;r&#233; de revenus avant le 1<sup>er</sup> janvier 2019&#160;&#187;.</p><p style=\"text-align: justify;\">II.&#160;&#8211;&#160;Compl&#233;ter cet article par l'alin&#233;a suivant&#160;:</p><p style=\"text-align: justify;\">&#171;&#160;IV.&#160;&#8211;&#160;La perte de recettes pour l&#8217;&#201;tat est compens&#233;e &#224; due concurrence par la cr&#233;ation d&#8217;une taxe additionnelle aux droits pr&#233;vus aux articles 575 et 575 A du code g&#233;n&#233;ral des imp&#244;ts.&#160;&#187;</p>",
    "exposeSommaire": "<p style=\"text-align: justify;\">L&#8217;&#233;volution du r&#233;gime fran&#231;ais des brevets est rendue n&#233;cessaire par l&#8217;action 5&#160;BEPS de l&#8217;OCDE et par l&#8217;Union&#160;europ&#233;enne afin d&#8217;assurer que le lieu o&#249; l&#8217;avantage est consenti est bien le lieu o&#249; la recherche a &#233;t&#233; effectu&#233;e.</p><p style=\"text-align: justify;\">Les modifications propos&#233;es ne doivent toutefois pas faire perdre tout int&#233;r&#234;t &#224; notre r&#233;gime alors que l&#8217;innovation est plus que jamais un moteur de la croissance et que d&#8217;autres pays, notamment les &#201;tats- Unis, adoptent des r&#233;gimes tr&#232;s attractifs. La France ne doit pas perdre ses talents et sa comp&#233;titivit&#233; sur le plan international.</p><p style=\"text-align: justify;\">Si l&#8217;inclusion des logiciels dans le r&#233;gime de faveur est une mesure bienvenue sur le principe, elle est en r&#233;alit&#233; d&#8217;int&#233;r&#234;t consid&#233;rablement r&#233;duit car limit&#233;e aux seuls logiciels qui n&#8217;ont pas g&#233;n&#233;r&#233; de revenus avant le 1<sup>er</sup> janvier 2019.</p><p style=\"text-align: justify;\">Or, en pratique, une grande majorit&#233; des logiciels fait l&#8217;objet d&#8217;&#233;volutions constantes au travers notamment de l&#8217;ajout de fonctionnalit&#233;s nouvelles et donne lieu &#224; de nouvelles versions ou des mises &#224; jour chaque ann&#233;e voire plusieurs fois par an. L&#8217;adoption de ces nouvelles versions ou mises &#224; jour n&#8217;est pas imm&#233;diate et &#233;volue progressivement sur une p&#233;riode de plusieurs ann&#233;es. En cons&#233;quence, le texte actuel ne permettrait de rendre &#233;ligible au nouveau dispositif qu&#8217;un tr&#232;s faible revenu (voire nul) les premi&#232;res ann&#233;es.</p><p style=\"text-align: justify;\">Il est crucial de d&#233;fendre la place des groupes fran&#231;ais en mati&#232;re de recherche et de soutenir le secteur des logiciels. Il convient donc d&#8217;&#233;largir le r&#233;gime de faveur aux logiciels existants.&#160;</p><p style=\"text-align: justify;\">Cet amendement vise donc &#224; &#233;tendre le dispositif du r&#233;gime d&#8217;imposition des produits de cession ou concession de brevets aux logiciels existants.&#160;</p>"
  },
  "representations": [
    {
      "nom": "PDF",
      "typeMime": {
        "type": "application",
        "subType": "PDF"
      },
      "statutRepresentation": {
        "verbatim": true,
        "canonique": true,
        "officielle": true,
        "transcription": false,
        "enregistrement": false
      },
      "contenu": {
        "documentURI": "/15/amendements/1255A/AN/2382.pdf"
      }
    }
  ],
  "seanceDiscussion": "RUANR5L15S2019IDS21282",
  "sort": {
    "dateSaisie": "2018-10-19T16:06:29.000+02:00",
    "sortEnSeance": "Adopté"
  },
  "dateDepot": "2018-10-11T02:00:00.000+02:00",
  "dateDistribution": "2018-10-15T02:00:00.000+02:00",
  "article99": "0",
  "loiReference": {}
}