{
  "uid": "AMANR5L15PO59051B0714P0D1N906",
  "identifiant": {
    "legislature": "15",
    "numero": "906",
    "numRect": "1",
    "saisine": {
      "texteLegislatifRef": "PRJLANR5L15B0714",
      "numeroPartiePLF": "0",
      "organeExamen": "PO59051",
      "mentionSecondeDeliberation": "0"
    }
  },
  "numeroLong": "CL906 (Rect)",
  "etapeTexte": "1ère lecture (1ère assemblée saisie)",
  "triAmendement": "bc",
  "cardinaliteAmdtMultiples": "1",
  "etat": "Discuté",
  "signataires": {
    "auteur": {
      "typeAuteur": "Depute",
      "acteurRef": "PA721564",
      "groupePolitiqueRef": "PO730964"
    },
    "cosignatairesRefs": [
      "PA721564"
    ],
    "texteAffichable": "Mme&#160;Fajgeles, rapporteure"
  },
  "pointeurFragmentTexte": {
    "division": {
      "titre": "Article 17",
      "articleDesignationCourte": "APRÈS ART. 17",
      "type": "ARTICLE",
      "avantAApres": "Apres",
      "divisionRattachee": "APRÈS L'ARTICLE 17, insérer l'article suivant:",
      "articleAdditionnel": "1",
      "urlDivisionTexteVise": "/15/textes/0714.asp#D_Article_17"
    }
  },
  "corps": {
    "dispositif": "<p style=\"text-align: justify;\">&#171;&#160;&#192; la premi&#232;re phrase du troisi&#232;me alin&#233;a du II de l&#8217;article L.&#160;561&#8209;2 du code de l&#8217;entr&#233;e et du s&#233;jour des &#233;trangers et du droit d&#8217;asile, le mot&#160;: &#171;&#160;cent quarante-quatre&#160;&#187; est remplac&#233; par le mot&#160;: &#171;&#160;quatre-vingt-seize&#160;&#187;.&#160;&#187;</p>",
    "exposeSommaire": "<p style=\"text-align: justify;\">Le pr&#233;sent amendement a pour objet de revenir sur les dispositions de la loi du 20 mars 2018 que l'Assembl&#233;e nationale avait &#233;t&#233; contrainte d'accepter dans sa n&#233;gociation avec le S&#233;nat pour permettre une adoption conforme, plus rapide, du contenu initial du texte. Si la promulgation dans la plus grande diligence des dispositions de cette loi &#233;tait n&#233;cessaire &#224; l'int&#233;r&#234;t g&#233;n&#233;ral, il a toujours &#233;t&#233; clair que certains ajouts effectu&#233;s par le S&#233;nat &#224; cette occasion n'avaient pas vocation &#224; perdurer dans le droit positif.</p><p style=\"text-align: justify;\">Cette position avait &#233;t&#233; affirm&#233;e clairement en s&#233;ance publique alors et accept&#233;e par le Gouvernement.</p>"
  },
  "representations": [
    {
      "nom": "PDF",
      "typeMime": {
        "type": "application",
        "subType": "PDF"
      },
      "statutRepresentation": {
        "verbatim": true,
        "canonique": true,
        "officielle": true,
        "transcription": false,
        "enregistrement": false
      },
      "contenu": {
        "documentURI": "/15/amendements/0714/CION_LOIS/CL906.pdf"
      }
    }
  ],
  "sort": {
    "dateSaisie": "2018-04-06T14:25:27.000+02:00",
    "sortEnSeance": "Adopté"
  },
  "dateDepot": "2018-04-03T02:00:00.000+02:00",
  "dateDistribution": "2018-04-03T02:00:00.000+02:00",
  "article99": "0",
  "loiReference": {
    "codeLoi": "entrée et séjour étrangers",
    "divisionCodeLoi": "L561-2 id"
  }
}