{
  "uid": "AMANR5L15PO766718B2187P0D1N1925",
  "identifiant": {
    "legislature": "15",
    "numero": "1925",
    "numRect": "0",
    "saisine": {
      "texteLegislatifRef": "PRJLANR5L15B2187",
      "numeroPartiePLF": "0",
      "organeExamen": "PO766718",
      "mentionSecondeDeliberation": "0"
    }
  },
  "numeroLong": "1925",
  "etapeTexte": "1ère lecture (1ère assemblée saisie)",
  "triAmendement": "acaaaaaaaaaaaaaaaaaaaaaaaaaaaaaaaaaaaaaaaaaaaaaaaataabhs",
  "cardinaliteAmdtMultiples": "1",
  "etat": "Discuté",
  "signataires": {
    "auteur": {
      "typeAuteur": "Depute",
      "acteurRef": "PA718706",
      "groupePolitiqueRef": "PO730964"
    },
    "cosignatairesRefs": [
      "PA718728",
      "PA606639",
      "PA718794",
      "PA720538",
      "PA718744",
      "PA719092",
      "PA718910",
      "PA718706"
    ],
    "texteAffichable": "Mme&#160;Fontaine-Domeizel,  Mme&#160;Tuffnell, M.&#160;Vignal, Mme&#160;Pitollat, Mme&#160;Vanceunebrock-Mialon, Mme&#160;De Temmerman, Mme&#160;Bagarry et Mme&#160;H&#233;rin"
  },
  "pointeurFragmentTexte": {
    "division": {
      "titre": "Article PREMIER",
      "articleDesignationCourte": "ART. PREMIER",
      "type": "ARTICLE",
      "avantAApres": "A",
      "divisionRattachee": "ARTICLE PREMIER",
      "urlDivisionTexteVise": "/15/textes/2187.asp#D_Article_1er"
    },
    "alinea": {
      "numero": "5"
    }
  },
  "corps": {
    "dispositif": "<p style=\"text-align: justify;\">&#192; l&#8217;alin&#233;a&#160;5, supprimer les mots&#160;:</p><p style=\"text-align: justify;\">&#171;&#160;, le d&#233;p&#244;t d&#8217;une demande en divorce, la signature d&#8217;une convention de divorce par consentement mutuel selon les modalit&#233;s de l&#8217;article&#160;229&#8209;1 du code civil ou la cessation de la communaut&#233; de vie,&#160;&#187;.</p>",
    "exposeSommaire": "<p style=\"text-align: justify;\">Cet amendement a pour objet de supprimer la disposition pr&#233;vue dans le pr&#233;sent projet de loi consistant &#224; interdire l&#8217;acc&#232;s &#224; l&#8217;assistance m&#233;dicale &#224; la procr&#233;ation pour les couples en instance de divorce ou de cessation de la communaut&#233; de vie.</p><p style=\"text-align: justify;\">La disposition amend&#233;e est paradoxale puisqu&#8217;il est pr&#233;vu qu&#8217;une femme non mari&#233;e peut avoir acc&#232;s &#224; l&#8217;assistance m&#233;dicale &#224; la procr&#233;ation, mais non une femme qui divorce ou qui se s&#233;pare.</p><p style=\"text-align: justify;\">Si en pratique les &#233;poux qui divorcent ou les concubins qui se s&#233;parent sont d&#8217;accord pour proc&#233;der &#224; une assistance m&#233;dicale &#224; la procr&#233;ation avec un projet parental, une telle interdiction n&#8217;est alors pas justifi&#233;e.</p>"
  },
  "representations": [
    {
      "nom": "PDF",
      "typeMime": {
        "type": "application",
        "subType": "PDF"
      },
      "statutRepresentation": {
        "verbatim": true,
        "canonique": true,
        "officielle": true,
        "transcription": false,
        "enregistrement": false
      },
      "contenu": {
        "documentURI": "/15/amendements/2187/CSBIOETH/1925.pdf"
      }
    }
  ],
  "sort": {
    "dateSaisie": "2019-09-11T11:27:24.000+02:00",
    "sortEnSeance": "Non soutenu"
  },
  "dateDepot": "2019-09-05T02:00:00.000+02:00",
  "dateDistribution": "2019-09-09T02:00:00.000+02:00",
  "article99": "0",
  "loiReference": {}
}