{
  "uid": "AMANR5L15PO419865B1393P0D1N164",
  "identifiant": {
    "legislature": "15",
    "numero": "164",
    "numRect": "0",
    "saisine": {
      "texteLegislatifRef": "PIONANR5L15B1393",
      "numeroPartiePLF": "0",
      "organeExamen": "PO419865",
      "mentionSecondeDeliberation": "0"
    }
  },
  "numeroLong": "CD164",
  "etapeTexte": "1ère lecture (2ème assemblée saisie)",
  "triAmendement": "biaaaaaaaaaaaaaaaaaaaaaaaaaaaaaaaaaaaaaaaaaaaaaaaabh",
  "cardinaliteAmdtMultiples": "1",
  "etat": "Discuté",
  "signataires": {
    "auteur": {
      "typeAuteur": "Depute",
      "acteurRef": "PA330909",
      "groupePolitiqueRef": "PO730934"
    },
    "cosignatairesRefs": [
      "PA346054",
      "PA266793",
      "PA720210",
      "PA605036",
      "PA718838",
      "PA346218",
      "PA267204",
      "PA267527",
      "PA719318",
      "PA856",
      "PA642847",
      "PA340853",
      "PA709315",
      "PA720644",
      "PA718884",
      "PA266776",
      "PA266797",
      "PA330909",
      "PA266808"
    ],
    "texteAffichable": "M.&#160;Descoeur,  M.&#160;Nury, M.&#160;Sermier, M.&#160;Reiss, Mme&#160;Anthoine, Mme&#160;Bazin-Malgras, M.&#160;Leclerc, M.&#160;Saddier, M.&#160;Cherpion, M.&#160;Bony, M.&#160;Brun, M.&#160;Bazin, M.&#160;Emmanuel&#160;Maquet, M.&#160;Gosselin, M.&#160;Masson, M.&#160;Viala, M.&#160;Rolland, Mme&#160;Beauvais et M.&#160;Abad"
  },
  "pointeurFragmentTexte": {
    "division": {
      "titre": "Article 3",
      "articleDesignationCourte": "ART. 3",
      "type": "ARTICLE",
      "avantAApres": "A",
      "divisionRattachee": "ARTICLE 3",
      "urlDivisionTexteVise": "/15/textes/1393.asp#D_Article_3"
    },
    "alinea": {
      "numero": "5"
    }
  },
  "corps": {
    "dispositif": "<p style=\"text-align: justify;\">&#192; l&#8217;alin&#233;a&#160;5, substituer aux mots&#160;:</p><p style=\"text-align: justify;\">&#171;&#160;en nombre &#233;gal&#160;&#187;,</p><p style=\"text-align: justify;\">les mots&#160;:</p><p style=\"text-align: justify;\">&#171;&#160;au plus quarante membres r&#233;partis en nombre &#233;gal entre&#160;&#187;.</p>",
    "exposeSommaire": "<p style=\"text-align: justify;\">Il convient par cet amendement de limiter le nombre de membres du conseil d&#8217;administration de la nouvelle structure.</p>"
  },
  "representations": [
    {
      "nom": "PDF",
      "typeMime": {
        "type": "application",
        "subType": "PDF"
      },
      "statutRepresentation": {
        "verbatim": true,
        "canonique": true,
        "officielle": true,
        "transcription": false,
        "enregistrement": false
      },
      "contenu": {
        "documentURI": "/15/amendements/1393/CION-DVP/CD164.pdf"
      }
    }
  ],
  "sort": {
    "dateSaisie": "2019-02-05T23:47:09.000+01:00",
    "sortEnSeance": "Tombé"
  },
  "dateDepot": "2019-01-31T01:00:00.000+01:00",
  "dateDistribution": "2019-02-04T01:00:00.000+01:00",
  "article99": "0",
  "loiReference": {}
}