{
  "uid": "AMANR5L15SEA717460BTC0819P0D1N51",
  "identifiant": {
    "legislature": "15",
    "numero": "51",
    "numRect": "0",
    "saisine": {
      "texteLegislatifRef": "PIONANR5L15BTC0819",
      "numeroPartiePLF": "0",
      "organeExamen": "PO717460",
      "mentionSecondeDeliberation": "0"
    }
  },
  "numeroLong": "51",
  "etapeTexte": "1ère lecture (2ème assemblée saisie)",
  "triAmendement": "ozzzzzk",
  "cardinaliteAmdtMultiples": "1",
  "etat": "Discuté",
  "signataires": {
    "auteur": {
      "typeAuteur": "Depute",
      "acteurRef": "PA267200",
      "groupePolitiqueRef": "PO730934"
    },
    "cosignatairesRefs": [
      "PA330240",
      "PA767",
      "PA267260",
      "PA2086",
      "PA856",
      "PA721474",
      "PA330684",
      "PA609726",
      "PA607090",
      "PA608416",
      "PA719318",
      "PA267200",
      "PA2492",
      "PA642847",
      "PA719272",
      "PA334654",
      "PA721968"
    ],
    "texteAffichable": "M.&#160;Huyghe,  M.&#160;Aubert, M.&#160;Bazin, Mme&#160;Val&#233;rie&#160;Boyer, M.&#160;Cattin, M.&#160;Cherpion, M.&#160;Ciotti, M.&#160;Hetzel, M.&#160;Marlin, Mme&#160;Meunier, Mme&#160;Poletti, M.&#160;Quentin, M.&#160;Straumann, M.&#160;Vialay, M.&#160;Jean-Pierre&#160;Vigier, Mme&#160;Anthoine et M.&#160;Viry"
  },
  "pointeurFragmentTexte": {
    "division": {
      "titre": "Article 5",
      "articleDesignationCourte": "ART. 5",
      "type": "ARTICLE",
      "avantAApres": "A",
      "divisionRattachee": "ARTICLE 5",
      "urlDivisionTexteVise": "/15/textes/0819.asp#D_Article_5"
    }
  },
  "corps": {
    "dispositif": "<p style=\"text-align: justify;\">R&#233;tablir cet article dans la r&#233;daction suivante&#160;:</p><p style=\"text-align: justify;\">&#171;&#160;Au cinqui&#232;me alin&#233;a du II de l&#8217;article&#160;9 de la loi n&#176;&#160;2000&#8209;614 du 5 juillet 2000 relative &#224; l&#8217;accueil et &#224; l&#8217;habitat des gens du voyage, les mots&#160;:&#160;&#171;&#160;peut proc&#233;der&#160;&#187;&#160;sont remplac&#233;s par le mot&#160;:&#160;&#171;&#160;proc&#232;de&#160;&#187;&#160;.&#160;&#187;</p>",
    "exposeSommaire": "<p style=\"text-align: justify;\">Cet amendement pourra conduire le pr&#233;fet &#224; faire syst&#233;matiquement &#233;vacuer les lieux, d&#232;s lors que la mise en demeure n&#8217;a pas &#233;t&#233; suivie d&#8217;effet.</p><p style=\"text-align: justify;\">Il convient de faire respecter le droit de propri&#233;t&#233; de mani&#232;re automatique.</p>"
  },
  "representations": [
    {
      "nom": "PDF",
      "typeMime": {
        "type": "application",
        "subType": "PDF"
      },
      "statutRepresentation": {
        "verbatim": true,
        "canonique": true,
        "officielle": true,
        "transcription": false,
        "enregistrement": false
      },
      "contenu": {
        "documentURI": "/15/amendements/0819/AN/51.pdf"
      }
    }
  ],
  "seanceDiscussion": "RUANR5L15S2018IDS20988",
  "sort": {
    "dateSaisie": "2018-04-06T00:57:29.000+02:00",
    "sortEnSeance": "Rejeté"
  },
  "dateDepot": "2018-03-31T02:00:00.000+02:00",
  "dateDistribution": "2018-04-03T02:00:00.000+02:00",
  "article99": "0",
  "loiReference": {}
}