{
  "uid": "AMANR5L15PO419865B1831P0D1N1309",
  "identifiant": {
    "legislature": "15",
    "numero": "1309",
    "numRect": "0",
    "saisine": {
      "texteLegislatifRef": "PRJLANR5L15B1831",
      "numeroPartiePLF": "0",
      "organeExamen": "PO419865",
      "mentionSecondeDeliberation": "0"
    }
  },
  "numeroLong": "CD1309",
  "etapeTexte": "1ère lecture (2ème assemblée saisie)",
  "triAmendement": "etaaaaaaaaaaaaaaaaaaaaaaaaaaaaaaaaaaaaaaaaaaaaaaaae",
  "cardinaliteAmdtMultiples": "1",
  "etat": "Discuté",
  "signataires": {
    "auteur": {
      "typeAuteur": "Depute",
      "acteurRef": "PA333421",
      "groupePolitiqueRef": "PO759900"
    },
    "cosignatairesRefs": [
      "PA331582",
      "PA719286",
      "PA719138",
      "PA333421",
      "PA405480",
      "PA605694",
      "PA720996",
      "PA607619",
      "PA605518",
      "PA719146"
    ],
    "texteAffichable": "M.&#160;Pancher,  M.&#160;Acquaviva, M.&#160;Castellani, M.&#160;Colombani, M.&#160;El Guerrab, M.&#160;Falorni, M.&#160;Fran&#231;ois-Michel&#160;Lambert, M.&#160;Molac, M.&#160;Pupponi et M.&#160;Philippe&#160;Vigier"
  },
  "pointeurFragmentTexte": {
    "division": {
      "titre": "Article 25 bis A",
      "articleDesignationCourte": "ART. 25 BIS A",
      "type": "ARTICLE",
      "avantAApres": "A",
      "divisionRattachee": "ARTICLE 25 BIS A",
      "urlDivisionTexteVise": "/15/textes/1831.asp#D_Article_25_bis_A"
    },
    "alinea": {
      "avantAApres": "A",
      "numero": "2",
      "alineaDesignation": "Alinéa 2"
    }
  },
  "corps": {
    "dispositif": "<p style=\"text-align: justify;\">A l&#8217;alin&#233;a&#160;2, substituer au mot&#160;:</p><p style=\"text-align: justify;\">&#171;&#160;cadre&#160;&#187; </p><p style=\"text-align: justify;\">le mot&#160;:</p><p style=\"text-align: justify;\">&#171;&#160;sch&#233;ma&#160;&#187;.</p>",
    "exposeSommaire": "<p style=\"text-align: justify;\">Le terme &#171;&#160;sch&#233;ma&#160;&#187; semble plus appropri&#233; que le terme &#171;&#160;action&#160;&#187;.</p>"
  },
  "representations": [
    {
      "nom": "PDF",
      "typeMime": {
        "type": "application",
        "subType": "PDF"
      },
      "statutRepresentation": {
        "verbatim": true,
        "canonique": true,
        "officielle": true,
        "transcription": false,
        "enregistrement": false
      },
      "contenu": {
        "documentURI": "/15/amendements/1831/CION-DVP/CD1309.pdf"
      }
    }
  ],
  "sort": {
    "dateSaisie": "2019-05-17T22:11:59.000+02:00",
    "sortEnSeance": "Tombé"
  },
  "dateDepot": "2019-05-08T02:00:00.000+02:00",
  "dateDistribution": "2019-05-16T02:00:00.000+02:00",
  "article99": "0",
  "loiReference": {
    "codeLoi": "2"
  }
}