{
  "uid": "AMANR5L15PO420120B1681P0D1N1616",
  "identifiant": {
    "legislature": "15",
    "numero": "1616",
    "numRect": "0",
    "saisine": {
      "texteLegislatifRef": "PRJLANR5L15B1681",
      "numeroPartiePLF": "0",
      "organeExamen": "PO420120",
      "mentionSecondeDeliberation": "0"
    }
  },
  "numeroLong": "AS1616",
  "etapeTexte": "1ère lecture (1ère assemblée saisie)",
  "triAmendement": "boaaaaaaaaaaaaaaaaaaaaaaaaaaaaaaaaaaaaaaaaaaaaaaaasthf",
  "cardinaliteAmdtMultiples": "1",
  "etat": "Discuté",
  "signataires": {
    "auteur": {
      "typeAuteur": "Depute",
      "acteurRef": "PA719072",
      "groupePolitiqueRef": "PO730964"
    },
    "cosignatairesRefs": [
      "PA719072"
    ],
    "texteAffichable": "M.&#160;Mesnier, rapporteur"
  },
  "pointeurFragmentTexte": {
    "division": {
      "titre": "Article 7",
      "articleDesignationCourte": "ART. 7",
      "type": "ARTICLE",
      "avantAApres": "A",
      "divisionRattachee": "ARTICLE 7",
      "urlDivisionTexteVise": "/15/textes/1681.asp#D_Article_7"
    },
    "alinea": {
      "avantAApres": "Apres",
      "numero": "14"
    }
  },
  "corps": {
    "dispositif": "<p style=\"text-align: justify;\">Apr&#232;s l&#8217;alin&#233;a&#160;14, ins&#233;rer l&#8217;alin&#233;a suivant&#160;:</p><p style=\"text-align: justify;\">&#171;&#160;<i>c)&#160;(nouveau)&#160;</i>Le dernier alin&#233;a est supprim&#233;.&#160;&#187;</p>",
    "exposeSommaire": "<p>Le dernier alin&#233;a de l'article relatif aux CPTS pr&#233;voit actuellement que \"&#224; d&#233;faut d'initiative des professionnels, l'agence r&#233;gionale de sant&#233; prend, en concertation avec les unions r&#233;gionales des professionnels de sant&#233; et les repr&#233;sentants des centres de sant&#233;, les initiatives n&#233;cessaires &#224; la constitution de communaut&#233;s professionnelles territoriales de sant&#233;\".</p><p style=\"text-align: justify;\">Pour moi, cela va &#224; l'encontre de la philosophie m&#234;me des CPTS, que nous voulons souples, peu contraignantes et &#224; la main des professionnels de sant&#233;.</p>"
  },
  "representations": [
    {
      "nom": "PDF",
      "typeMime": {
        "type": "application",
        "subType": "PDF"
      },
      "statutRepresentation": {
        "verbatim": true,
        "canonique": true,
        "officielle": true,
        "transcription": false,
        "enregistrement": false
      },
      "contenu": {
        "documentURI": "/15/amendements/1681/CION-SOC/AS1616.pdf"
      }
    }
  ],
  "sort": {
    "dateSaisie": "2019-03-13T13:00:33.000+01:00",
    "sortEnSeance": "Adopté"
  },
  "dateDepot": "2019-03-11T01:00:00.000+01:00",
  "dateDistribution": "2019-03-12T01:00:00.000+01:00",
  "article99": "0",
  "loiReference": {}
}