{
  "uid": "AMANR5L15SEA717460BTC1767P0D1N318",
  "identifiant": {
    "legislature": "15",
    "numero": "318",
    "numRect": "0",
    "saisine": {
      "texteLegislatifRef": "PRJLANR5L15BTC1767",
      "numeroPartiePLF": "0",
      "organeExamen": "PO717460",
      "mentionSecondeDeliberation": "0"
    }
  },
  "numeroLong": "318",
  "etapeTexte": "1ère lecture (1ère assemblée saisie)",
  "triAmendement": "agaaaaaaaaaaaaaaaaaaaaaaaaaaaaaaaaaaaaaaaaaaaaaaaafixho",
  "cardinaliteAmdtMultiples": "1",
  "etat": "Discuté",
  "signataires": {
    "auteur": {
      "typeAuteur": "Depute",
      "acteurRef": "PA713448",
      "groupePolitiqueRef": "PO730934"
    },
    "cosignatairesRefs": [
      "PA346218",
      "PA718780",
      "PA713448",
      "PA718838",
      "PA718884",
      "PA608016",
      "PA719318",
      "PA721968",
      "PA721678",
      "PA1874",
      "PA712015",
      "PA720684",
      "PA718784",
      "PA340853",
      "PA606712",
      "PA721070",
      "PA267735",
      "PA709315"
    ],
    "texteAffichable": "Mme&#160;Brenier,  Mme&#160;Anthoine, Mme&#160;Bazin-Malgras, M.&#160;Reda, M.&#160;Pierre-Henri&#160;Dumont, M.&#160;Masson, M.&#160;Le Fur, M.&#160;Brun, M.&#160;Viala, Mme&#160;Louwagie, M.&#160;Pauget, Mme&#160;Ramassamy, M.&#160;Lurton, M.&#160;Leclerc, M.&#160;de Ganay, M.&#160;Dive, Mme&#160;Trastour-Isnart et M.&#160;Vialay"
  },
  "pointeurFragmentTexte": {
    "division": {
      "titre": "Article 3",
      "articleDesignationCourte": "ART. 3",
      "type": "ARTICLE",
      "avantAApres": "A",
      "divisionRattachee": "ARTICLE 3",
      "urlDivisionTexteVise": "/15/textes/1767.asp#D_Article_3"
    }
  },
  "corps": {
    "dispositif": "<p style=\"text-align: justify;\">Apr&#232;s l&#8217;alin&#233;a&#160;2, ins&#233;rer les deux alin&#233;as suivants&#160;:</p><p style=\"text-align: justify;\">&#171;&#160;La comp&#233;tence de la certification des professions m&#233;dicales est attribu&#233;e &#224; la Haute autorit&#233; de sant&#233;. Le p&#233;rim&#232;tre des comp&#233;tences de celle-ci est &#233;largi &#224; la proc&#233;dure de certification de la profession de m&#233;decin, notamment par la d&#233;finition d&#8217;&#233;ch&#233;ances, de comp&#233;tences et de connaissances &#224; valider, apr&#232;s concertation avec les diff&#233;rentes institutions et ordres r&#233;f&#233;rents.</p><p style=\"text-align: justify;\">&#171;&#160;Les modalit&#233;s de l&#8217;attribution de cette comp&#233;tence sont &#233;tablies par d&#233;cret en Conseil d&#8217;&#201;tat&#160;;&#160;&#187;.</p>",
    "exposeSommaire": "<p>Depuis le 1<sup>er</sup> avril 2018, le p&#233;rim&#232;tre de la Haute autorit&#233; de sant&#233; s&#8217;est &#233;largi aux champs social et m&#233;dico-social, avec l&#8217;int&#233;gration de l&#8217;Agence nationale de l&#8217;&#233;valuation et de la qualit&#233; des &#233;tablissements et services sociaux et m&#233;dico-sociaux (Anesm). La HAS envisage ainsi la sant&#233; dans sa globalit&#233;. C&#8217;est pourquoi il serait logique d&#8217;attribuer &#224; cette autorit&#233; publique ind&#233;pendante la certification des m&#233;decins. Comme elle le fait d&#233;j&#224; pour les &#233;tablissements de sant&#233; et les professions consid&#233;r&#233;es &#224; risque,&#160;la HAS&#160;pourrait&#160;mettre en place une proc&#233;dure&#160;afin de certifier connaissances et comp&#233;tences des m&#233;decins.</p><p style=\"text-align: justify;\">Bien &#233;videmment, cela ne pourra se faire sans en discuter avec les ordres, dont les professions seront concern&#233;es, mais aussi avec le Minist&#232;re de la sant&#233;, dont d&#233;pendra cette API.</p>"
  },
  "representations": [
    {
      "nom": "PDF",
      "typeMime": {
        "type": "application",
        "subType": "PDF"
      },
      "statutRepresentation": {
        "verbatim": true,
        "canonique": true,
        "officielle": true,
        "transcription": false,
        "enregistrement": false
      },
      "contenu": {
        "documentURI": "/15/amendements/1767/AN/318.pdf"
      }
    }
  ],
  "seanceDiscussion": "RUANR5L15S2019IDS21560",
  "sort": {
    "dateSaisie": "2019-03-20T00:35:31.000+01:00",
    "sortEnSeance": "Rejeté"
  },
  "dateDepot": "2019-03-15T01:00:00.000+01:00",
  "dateDistribution": "2019-03-17T01:00:00.000+01:00",
  "article99": "0",
  "loiReference": {}
}