{
  "uid": "AMANR5L15PO419865B0627P0D1N336",
  "identifiant": {
    "legislature": "15",
    "numero": "336",
    "numRect": "0",
    "saisine": {
      "texteLegislatifRef": "PRJLANR5L15B0627",
      "numeroPartiePLF": "0",
      "organeExamen": "PO419865",
      "mentionSecondeDeliberation": "0"
    }
  },
  "numeroLong": "CD336",
  "etapeTexte": "1ère lecture (1ère assemblée saisie)",
  "triAmendement": "bccev",
  "cardinaliteAmdtMultiples": "1",
  "etat": "Discuté",
  "signataires": {
    "auteur": {
      "typeAuteur": "Depute",
      "acteurRef": "PA722142",
      "groupePolitiqueRef": "PO730958"
    },
    "cosignatairesRefs": [
      "PA721226",
      "PA721202",
      "PA719578",
      "PA720422",
      "PA721210",
      "PA721960",
      "PA719676",
      "PA588884",
      "PA720430",
      "PA2150",
      "PA720846",
      "PA720892",
      "PA721062",
      "PA720286",
      "PA718868",
      "PA718860",
      "PA722142"
    ],
    "texteAffichable": "M.&#160;Ruffin,  Mme&#160;Autain, M.&#160;Bernalicis, M.&#160;Coquerel, M.&#160;Prud&apos;homme, M.&#160;Corbi&#232;re, Mme&#160;Fiat, M.&#160;Lachaud, M.&#160;Larive, M.&#160;M&#233;lenchon, Mme&#160;Obono, Mme&#160;Panot, M.&#160;Quatennens, M.&#160;Ratenon, Mme&#160;Ressiguier, Mme&#160;Rubin et Mme&#160;Taurine"
  },
  "pointeurFragmentTexte": {
    "division": {
      "titre": "Article 11",
      "articleDesignationCourte": "APRÈS ART. 11",
      "type": "ARTICLE",
      "avantAApres": "Apres",
      "divisionRattachee": "APRÈS L'ARTICLE 11, insérer l'article suivant:",
      "articleAdditionnel": "1",
      "urlDivisionTexteVise": "/15/textes/0627.asp#D_Article_11"
    }
  },
  "corps": {
    "dispositif": "<p style=\"text-align: justify;\">Au 1&#176; du I de l&#8217;article L.&#160;1 du code rural et de la p&#234;che maritime, apr&#232;s le mot&#160;: &#171;&#160;diversifi&#233;e&#160;&#187;, sont ins&#233;r&#233;s les mots &#171;&#160;et &#233;quilibrant prot&#233;ines d&#8217;origine animale et v&#233;g&#233;tale,&#160;&#187;.&#160;</p>",
    "exposeSommaire": "<p style=\"text-align: justify;\">La consommation globale de prot&#233;ines animales est en constante augmentation. L&#8217;agriculture mondiale ne pourra pas satisfaire l&#8217;ensemble des besoins des populations &#224; la hauteur de l&#8217;actuelle consommation des pays d&#233;velopp&#233;s sans provoquer de nombreux probl&#232;mes environnementaux, climatiques et de sant&#233; publique. De plus, les activit&#233;s agricoles et alimentaires repr&#233;sentent 36&#160;% des &#233;missions de gaz &#224; effet de serre (GES) fran&#231;aises. Dans la ration moyenne d&#8217;un Fran&#231;ais, les prot&#233;ines animales repr&#233;sentent 67&#160;% des GES &#233;mis.</p><p style=\"text-align: justify;\">Le CNRS constate dans une r&#233;cente &#233;tude la disparition d&#8217;un tiers des oiseaux en 15 ans. En cause&#160;: la fin des jach&#232;res impos&#233;es par la PAC, l&#8217;agriculture intensive en monoculture et la g&#233;n&#233;ralisation des n&#233;onicotino&#239;des qui ont particip&#233; amplement de l&#8217;effondrement des populations d&#8217;insectes (80&#160;% disparus en 30 ans). 35&#160;% du bl&#233;&#160;europ&#233;en est destin&#233; &#224; l&#8217;alimentation animale. Plus largement, les animaux sont les premiers consommateurs de c&#233;r&#233;ales en France. Ainsi, en termes de surface, l&#8217;alimentation animale mobilise en France 14 millions d&#8217;hectares de cultures fourrag&#232;res et 4 millions de c&#233;r&#233;ales, ol&#233;agineux, prot&#233;agineux, repr&#233;sentant respectivement 50&#160;% et 14&#160;% des surfaces agricoles fran&#231;aises. Il faut 7 Kg de c&#233;r&#233;ales pour produire 1 Kg de b&#339;uf et 2 Kg pour produire 1 Kg de poulet.</p><p style=\"text-align: justify;\">Il faut rendre la transition des &#233;levages fran&#231;ais et l&#8217;am&#233;lioration du bien-&#234;tre animal &#233;conomiquement viables. Et faire disparaitre les pratiques qui font du tort tant sur le plan environnemental qu&#8217;&#233;conomique. Il est donc n&#233;cessaire de diminuer sensiblement notre consommation de prot&#233;ines animales par habitant. Il ne s&#8217;agit pas de ne pas en consommer, mais de consommer &#171;&#160;Moins et Mieux&#160;&#187;. C&#8217;est pourquoi cet amendement, &#224; l&#8217;initiative de France Nature Environnement, vise &#224; inclure un objectif de r&#233;&#233;quilibrage des prot&#233;ines animales et v&#233;g&#233;tales dans les objectifs de la politique nationale de l&#8217;alimentation.</p>"
  },
  "representations": [
    {
      "nom": "PDF",
      "typeMime": {
        "type": "application",
        "subType": "PDF"
      },
      "statutRepresentation": {
        "verbatim": true,
        "canonique": true,
        "officielle": true,
        "transcription": false,
        "enregistrement": false
      },
      "contenu": {
        "documentURI": "/15/amendements/0627/CION-DVP/CD336.pdf"
      }
    }
  ],
  "sort": {
    "dateSaisie": "2018-03-28T17:40:59.000+02:00",
    "sortEnSeance": "Non soutenu"
  },
  "dateDepot": "2018-03-23T01:00:00.000+01:00",
  "dateDistribution": "2018-03-26T02:00:00.000+02:00",
  "article99": "0",
  "loiReference": {
    "codeLoi": "rural et pêche maritime",
    "divisionCodeLoi": "1"
  }
}