{
  "uid": "AMANR5L15SEA717460B1255P1D1N1200",
  "identifiant": {
    "legislature": "15",
    "numero": "1200",
    "numRect": "0",
    "saisine": {
      "texteLegislatifRef": "PRJLANR5L15B1255",
      "numeroPartiePLF": "1",
      "organeExamen": "PO717460",
      "mentionSecondeDeliberation": "0"
    }
  },
  "numeroLong": "I-1200",
  "etapeTexte": "1ère lecture (1ère assemblée saisie)",
  "triAmendement": "dsaaaaaaaaaaaaaaaaaaaaaaaaaaaaaaaaaaaaaaaaaaaaaaaaabvzzztznzzzxzxhzzzzz",
  "cardinaliteAmdtMultiples": "1",
  "etat": "Discuté",
  "signataires": {
    "auteur": {
      "typeAuteur": "Depute",
      "acteurRef": "PA332523",
      "groupePolitiqueRef": "PO730934"
    },
    "cosignatairesRefs": [
      "PA332523",
      "PA721070"
    ],
    "texteAffichable": "Mme&#160;Dalloz et Mme&#160;Ramassamy"
  },
  "pointeurFragmentTexte": {
    "division": {
      "titre": "Article 16",
      "articleDesignationCourte": "APRÈS ART. 16",
      "type": "ARTICLE",
      "avantAApres": "Apres",
      "divisionRattachee": "APRÈS L'ARTICLE 16, insérer l'article suivant:",
      "articleAdditionnel": "1",
      "urlDivisionTexteVise": "/15/textes/1255A.asp#D_Article_16"
    }
  },
  "corps": {
    "dispositif": "<p style=\"text-align: justify;\">I.&#160;&#8211;&#160;L&#8217;article&#160;976 du code g&#233;n&#233;ral des imp&#244;ts est ainsi modifi&#233;&#160;:</p><p style=\"text-align: justify;\">1&#176;&#160;Apr&#232;s le mot&#160;: &#171;&#160;condition&#160;&#187;, la fin du premier alin&#233;a du III est ainsi r&#233;dig&#233;e&#160;: &#171;&#160;que la dur&#233;e du bail soit au minimum de dix-huit ans.&#160;&#187;&#160;;</p><p style=\"text-align: justify;\">2&#176;&#160;Le second alin&#233;a du m&#234;me III est supprim&#233;&#160;;</p><p style=\"text-align: justify;\">3&#176;&#160;Apr&#232;s la premi&#232;re occurrence du mot&#160;: &#171;&#160;que&#160;&#187;, la fin du premier alin&#233;a du IV est ainsi r&#233;dig&#233;e&#160;: &#171;&#160;les baux consentis par le groupement r&#233;pondent aux conditions pr&#233;vues au III.&#160;&#187;&#160;;</p><p style=\"text-align: justify;\">4&#176;&#160;Le second alin&#233;a du m&#234;me IV est supprim&#233;&#160;;</p><p style=\"text-align: justify;\">5&#176;&#160;Le V est abrog&#233;.</p><p style=\"text-align: justify;\">II.&#160;&#8211;&#160;Les pertes de recettes r&#233;sultant du I sont compens&#233;es par la cr&#233;ation d&#8217;une taxe additionnelle aux droits vis&#233;s aux articles 575 et 575 A du code g&#233;n&#233;ral des imp&#244;ts.</p>",
    "exposeSommaire": "<p style=\"text-align: justify;\">&#160;L&#8217;imp&#244;t sur la fortune immobili&#232;re, recentr&#233;, comme son nom l&#8217;indique, sur les biens immobiliers, p&#233;nalise les propri&#233;taires de biens ruraux n&#8217;exploitant pas eux-m&#234;mes.</p><p style=\"text-align: justify;\">L&#8217;exon&#233;ration partielle des biens ruraux lou&#233;s &#224; long terme ne constitue plus une r&#233;ponse suffisante d&#232;s lors qu&#8217;elle d&#233;bouche sur une imposition partielle, alors que le patrimoine mobilier est d&#233;sormais exon&#233;r&#233; totalement.</p><p style=\"text-align: justify;\">Au regard du revenu locatif g&#233;n&#233;ralement faible de tels biens, l&#8217;addition des pr&#233;l&#232;vements fiscaux, &#224; savoir la taxe fonci&#232;re, l&#8217;imp&#244;t sur le revenu, les pr&#233;l&#232;vements sociaux et l&#8217;imp&#244;t sur la fortune, m&#234;me avec les exon&#233;rations partielles actuellement en vigueur, an&#233;antit toute rentabilit&#233; et dissuade les propri&#233;taires de tels biens de les conserver, les incitant &#224; vendre.</p><p style=\"text-align: justify;\">La mise en vente du foncier exploit&#233; en location peut gravement d&#233;stabiliser les exploitations familiales. L&#8217;achat par l&#8217;exploitant, lorsqu&#8217;il est possible, absorbe une grande partie voire la totalit&#233; des capacit&#233;s financi&#232;res de l&#8217;entreprise et ob&#232;re son d&#233;veloppement futur. L&#8217;achat par d&#8217;autres op&#233;rateurs, aux capacit&#233;s financi&#232;res plus d&#233;velopp&#233;es, menace la p&#233;rennit&#233; des petites exploitations.</p><p style=\"text-align: justify;\">Il est essentiel d&#8217;inciter les propri&#233;taires fonciers &#224; conserver leurs biens immobiliers, principalement lorsque ces biens sont durablement affect&#233;s &#224; des exploitations agricoles et viticoles.</p><p style=\"text-align: justify;\">C&#8217;est l&#8217;objet du pr&#233;sent amendement, qui vise &#224; accorder une exon&#233;ration totale d&#8217;imp&#244;t sur la fortune aux propri&#233;taires qui affectent durablement leurs terres &#224; des exploitations agricoles, par un bail &#224; long terme d&#8217;au moins 18 ans.</p>"
  },
  "representations": [
    {
      "nom": "PDF",
      "typeMime": {
        "type": "application",
        "subType": "PDF"
      },
      "statutRepresentation": {
        "verbatim": true,
        "canonique": true,
        "officielle": true,
        "transcription": false,
        "enregistrement": false
      },
      "contenu": {
        "documentURI": "/15/amendements/1255A/AN/1200.pdf"
      }
    }
  ],
  "seanceDiscussion": "RUANR5L15S2019IDS21282",
  "sort": {
    "dateSaisie": "2018-10-19T19:57:45.000+02:00",
    "sortEnSeance": "Rejeté"
  },
  "dateDepot": "2018-10-11T02:00:00.000+02:00",
  "dateDistribution": "2018-10-16T02:00:00.000+02:00",
  "article99": "0",
  "loiReference": {
    "codeLoi": "CGI",
    "divisionCodeLoi": "976"
  }
}