{
  "uid": "AMANR5L15SEA717460B2272P1D1N1308",
  "identifiant": {
    "legislature": "15",
    "numero": "1308",
    "numRect": "0",
    "saisine": {
      "texteLegislatifRef": "PRJLANR5L15B2272",
      "numeroPartiePLF": "1",
      "organeExamen": "PO717460",
      "mentionSecondeDeliberation": "0"
    }
  },
  "numeroLong": "I-1308",
  "etapeTexte": "1ère lecture (1ère assemblée saisie)",
  "triAmendement": "bmaaaaaaaaaaaaaaaaaaaaaaaaaaaaaaaaaaaaaaaaaaaaaaaabdx",
  "cardinaliteAmdtMultiples": "1",
  "etat": "Discuté",
  "signataires": {
    "auteur": {
      "typeAuteur": "Depute",
      "acteurRef": "PA722312",
      "groupePolitiqueRef": "PO730964"
    },
    "cosignatairesRefs": [
      "PA719480",
      "PA721946",
      "PA720414",
      "PA720074",
      "PA721808",
      "PA722312",
      "PA719364",
      "PA719822",
      "PA720014",
      "PA719230",
      "PA718744",
      "PA606639",
      "PA719994",
      "PA721150",
      "PA718990",
      "PA721434",
      "PA719154",
      "PA720590",
      "PA717167",
      "PA719850",
      "PA718930",
      "PA721600",
      "PA719338"
    ],
    "texteAffichable": "Mme&#160;Bessot Ballot,  Mme&#160;Motin, M.&#160;Marilossian, Mme&#160;Petel, Mme&#160;O&apos;Petit, M.&#160;Holroyd, M.&#160;Potterie, Mme&#160;Thillaye, Mme&#160;Melchior, Mme&#160;Lardet, Mme&#160;Kamowski, Mme&#160;Rossi, M.&#160;Perrot, M.&#160;Gaillard, M.&#160;Kerlogot, M.&#160;Vignal, Mme&#160;Crouzet, M.&#160;Martin, Mme&#160;Blanc, Mme&#160;Tiegna, M.&#160;Mahjoubi, Mme&#160;Janvier et Mme&#160;Bagarry"
  },
  "pointeurFragmentTexte": {
    "division": {
      "titre": "Article 8",
      "articleDesignationCourte": "APRÈS ART. 8",
      "type": "ARTICLE",
      "avantAApres": "Apres",
      "divisionRattachee": "APRÈS L'ARTICLE 8, insérer l'article suivant:",
      "articleAdditionnel": "1",
      "urlDivisionTexteVise": "/15/textes/2272A.asp#D_Article_8"
    }
  },
  "corps": {
    "dispositif": "<p>Le 1&#176;&#160;du A de l&#8217;article&#160;278&#8209;0 <i>bis</i> du code g&#233;n&#233;ral des imp&#244;ts est compl&#233;t&#233; par deux alin&#233;as ainsi r&#233;dig&#233;s&#160;:</p><p style=\"text-align: justify;\">&#171;&#160;Les produits destin&#233;s &#224; l&#8217;alimentation humaine mentionn&#233;s au A du pr&#233;sent article, d&#232;s lors qu&#8217;ils sont portionnables et peuvent &#234;tre vendus et achet&#233;s sous forme d&#8217;une bouch&#233;e en portion individuelle, sont soumis au taux normal de la taxe sur la valeur ajout&#233;e fix&#233;e au pr&#233;sent article.</p><p style=\"text-align: justify;\">&#171;&#160;Les modalit&#233;s d&#8217;application de cette mesure sont fix&#233;es par d&#233;cret en Conseil d&#8217;&#201;tat.&#160;&#187;</p>",
    "exposeSommaire": "<p>L&#8217;article&#160;278&#8209;0 <i>bis</i> du Code G&#233;n&#233;ral des Imp&#244;ts (CGI) pr&#233;voit que la TVA est per&#231;ue au taux r&#233;duit de 5,5&#160;% sur les produits destin&#233;s &#224; l&#8217;alimentation humaine, &#224; l&#8217;exception des produits de confiseries et des produits de confiserie et des chocolats, except&#233;s le chocolat de m&#233;nage au lait, les bonbons de chocolat, les f&#232;ves de cacao et le beurre de cacao.</p><p style=\"text-align: justify;\">En premier lieu, avec un objectif de simplification d&#8217;une r&#232;gle fiscale, cet amendement vise &#224; harmoniser le taux de TVA appliqu&#233; aux produits alimentaires achet&#233;s et vendus en portion individuelle, sans exception et sans distinction de &#171;&#160;taille&#160;&#187; des produits, comme actuellement indiqu&#233; par le Bulletin Officiel des Finances Publiques-Imp&#244;ts (BOFIP).</p><p style=\"text-align: justify;\">En effet, le BOFIP indique par exemple pour les chocolats qu&#8217;un taux r&#233;duit de 5,5&#160;% est applicable aux produits de chocolat relevant de la cat&#233;gorie &#171;&#160;bonbon de chocolat&#160;&#187; d&#233;finis comme les &#171;&#160;produits de la taille d&#8217;une bouch&#233;e&#160;&#187;.</p><p style=\"text-align: justify;\">Par ailleurs, le BOFIP apporte une pr&#233;cision quant &#224; la notion de bouch&#233;e, indiquant qu&#8217;&#171;&#160;&#224; titre de r&#232;gle pratique, sont consid&#233;r&#233;s comme des produits de la taille d&#8217;une bouch&#233;e les produits dont la dimension maximale n&#8217;exc&#232;de pas cinq centim&#232;tres et dont la masse n&#8217;exc&#232;de pas vingt grammes.&#160;&#187;</p><p style=\"text-align: justify;\">Aussi, d&#232;s lors qu&#8217;ils constituent une &#171;&#160;bouch&#233;e&#160;&#187; et peuvent &#234;tre vendus en portion individuelle, ces produits sont actuellement soumis &#224; un taux r&#233;duit de 5,5&#160;%. Il convient donc d&#8217;appliquer le taux normal de 20&#160;%.</p><p style=\"text-align: justify;\">Par cons&#233;quent, cet amendement vise &#233;galement &#224; r&#233;pondre aux objectifs du Gouvernement en mati&#232;re de transition &#233;cologique. En effet, &#224; l&#8217;heure des discussions autour du Projet de loi Economie circulaire, et afin de limiter les effets n&#233;fastes du suremballage, le pr&#233;sent amendement rejoint le principe du &#171;&#160;pollueur-payeur&#160;&#187;, afin de limiter la vente et la consommation de portions individuelles des produits alimentaires portionnables, dont les emballages sont majoritairement compos&#233;s de plastiques et d&#8217;aluminium et donc, particuli&#232;rement polluants.</p>"
  },
  "representations": [
    {
      "nom": "PDF",
      "typeMime": {
        "type": "application",
        "subType": "PDF"
      },
      "statutRepresentation": {
        "verbatim": true,
        "canonique": true,
        "officielle": true,
        "transcription": false,
        "enregistrement": false
      },
      "contenu": {
        "documentURI": "/15/amendements/2272A/AN/1308.pdf"
      }
    }
  ],
  "seanceDiscussion": "RUANR5L15S2020IDS21870",
  "sort": {
    "dateSaisie": "2019-10-18T19:52:58.000+02:00",
    "sortEnSeance": "Rejeté"
  },
  "dateDepot": "2019-10-10T02:00:00.000+02:00",
  "dateDistribution": "2019-10-17T02:00:00.000+02:00",
  "article99": "0",
  "loiReference": {
    "codeLoi": "CGI",
    "divisionCodeLoi": "278-0 bis"
  }
}