{
  "uid": "AMANR5L15SEA717460BTC1482P0D1N244",
  "identifiant": {
    "legislature": "15",
    "numero": "244",
    "numRect": "0",
    "saisine": {
      "texteLegislatifRef": "PRJLANR5L15BTC1482",
      "numeroPartiePLF": "0",
      "organeExamen": "PO717460",
      "mentionSecondeDeliberation": "0"
    }
  },
  "numeroLong": "244",
  "etapeTexte": "1ère lecture (1ère assemblée saisie)",
  "triAmendement": "aiaaaaaaaaaaaaaaaaaaaaaaaaaaaaaaaaaaaaaaaaaaaaaaaabru",
  "cardinaliteAmdtMultiples": "1",
  "etat": "Discuté",
  "signataires": {
    "auteur": {
      "typeAuteur": "Depute",
      "acteurRef": "PA1874",
      "groupePolitiqueRef": "PO730934"
    },
    "cosignatairesRefs": [
      "PA1874"
    ],
    "texteAffichable": "M.&#160;Le Fur"
  },
  "pointeurFragmentTexte": {
    "division": {
      "titre": "Article PREMIER",
      "articleDesignationCourte": "ART. PREMIER",
      "type": "ARTICLE",
      "avantAApres": "A",
      "divisionRattachee": "ARTICLE PREMIER",
      "urlDivisionTexteVise": "/15/textes/1482.asp#D_Article_1er"
    },
    "alinea": {
      "numero": "7"
    }
  },
  "corps": {
    "dispositif": "<p style=\"text-align: justify;\">Compl&#233;ter l&#8217;alin&#233;a&#160;7 par la phrase suivante&#160;:</p><p style=\"text-align: justify;\">&#171;&#160;Il est charg&#233; de coordonner la lutte contre les choucas.&#160;&#187;</p>",
    "exposeSommaire": "<p style=\"text-align: justify;\">Les Choucas des tours, oiseaux gr&#233;gaires tr&#232;s pr&#233;sents qui vivent en colonie, cr&#233;ent de nombreuses nuisances (sonores, salissures,) sur les &#233;difices publics, dans les bourgs et &#224; la campagne, mais ravagent &#233;galement les cultures, et provoquent m&#234;me parfois des incendies dans les chemin&#233;es.</p><p style=\"text-align: justify;\">Apr&#232;s un d&#233;clin jusqu&#8217;aux ann&#233;es 2000, la population de Choucas s&#8217;est remise &#224; croitre et pr&#233;sente m&#234;me en Bretagne un taux de reproduction sup&#233;rieur &#224; la moyenne nationale. Ainsi d&#8217;apr&#232;s un article de l&#8217;Atlas des oiseaux, pour un couple, le taux de f&#233;condit&#233; &#233;tait de 2,9 jeunes choucas dans le Finist&#232;re, en 2010.</p><p style=\"text-align: justify;\">Alors que sa cousine, la corneille est consid&#233;r&#233;e comme nuisible et peut donc &#234;tre tir&#233;e, le choucas est depuis 1989 une esp&#232;ce prot&#233;g&#233;e au titres article L.&#160;411&#8209;1, L.&#160;411- et L.&#160;427&#8209;1 du code de l&#8217;environnement et ne peut &#234;tre tir&#233;e que dans le cadre de pr&#233;l&#232;vements autoris&#233;s par arr&#234;t&#233;s pr&#233;fectoraux au titre de l&#8217;article L.&#160;427&#8209;8 du m&#234;me code.</p><p style=\"text-align: justify;\">Dans les d&#233;partements du Finist&#232;re et des C&#244;tes d&#8217;Armor des arr&#234;t&#233;s pr&#233;fectoraux ont bien &#233;t&#233; pris, mais ont fix&#233;s des quotas de pr&#233;l&#232;vements inadapt&#233;s et plafonn&#233;s.</p><p style=\"text-align: justify;\">Si le d&#233;classement du Chouca des tours n&#8217;est pas &#224; l&#8217;ordre du jour, l&#8217;augmentation des quotas de pr&#233;l&#232;vement est une demande r&#233;currente des populations des territoires affect&#233;s par cet oiseau, qu&#8217;ils soient agriculteurs ou simples riverains.</p><p style=\"text-align: justify;\">C&#8217;est pourquoi, le pr&#233;sent amendement vise &#224; pr&#233;ciser que dans le cadre d ela lutte contre les esp&#232;ces invasives l&#8217;office est charg&#233; de coordonner la lutte contre les choucas.</p>"
  },
  "representations": [
    {
      "nom": "PDF",
      "typeMime": {
        "type": "application",
        "subType": "PDF"
      },
      "statutRepresentation": {
        "verbatim": true,
        "canonique": true,
        "officielle": true,
        "transcription": false,
        "enregistrement": false
      },
      "contenu": {
        "documentURI": "/15/amendements/1482/AN/244.pdf"
      }
    }
  ],
  "seanceDiscussion": "RUANR5L15S2019IDS21460",
  "sort": {
    "dateSaisie": "2019-01-23T23:19:16.000+01:00",
    "sortEnSeance": "Non soutenu"
  },
  "dateDepot": "2018-12-13T01:00:00.000+01:00",
  "dateDistribution": "2019-01-17T01:00:00.000+01:00",
  "article99": "0",
  "loiReference": {}
}