{
  "uid": "AMANR5L15SEA717460BTC0259P0D1N76",
  "identifiant": {
    "legislature": "15",
    "numero": "76",
    "numRect": "0",
    "saisine": {
      "texteLegislatifRef": "PNREANR5L15BTC0259",
      "numeroPartiePLF": "0",
      "organeExamen": "PO717460",
      "mentionSecondeDeliberation": "0"
    }
  },
  "numeroLong": "76",
  "etapeTexte": "Lecture unique",
  "triAmendement": "ywl",
  "cardinaliteAmdtMultiples": "1",
  "etat": "Retiré",
  "signataires": {
    "auteur": {
      "typeAuteur": "Depute",
      "acteurRef": "PA720100",
      "groupePolitiqueRef": "PO730934"
    },
    "cosignatairesRefs": [
      "PA346054",
      "PA267440",
      "PA720100",
      "PA2086",
      "PA642847"
    ],
    "texteAffichable": "M.&#160;Pradi&#233;,  M.&#160;Marlin, M.&#160;Emmanuel&#160;Maquet, M.&#160;Bazin et M.&#160;Diard"
  },
  "pointeurFragmentTexte": {
    "division": {
      "titre": "Article unique",
      "articleDesignationCourte": "APRÈS ART. UNIQUE",
      "type": "ARTICLE",
      "avantAApres": "Apres",
      "divisionRattachee": "APRÈS L'ARTICLE UNIQUE, insérer l'article suivant:",
      "articleAdditionnel": "1",
      "urlDivisionTexteVise": "/15/textes/0259.asp#D_Article_unique"
    }
  },
  "corps": {
    "dispositif": "<p style=\"text-align: justify;\">Apr&#232;s l'article 160 du R&#232;glement, il est ins&#233;r&#233; un article 160-1 ainsi r&#233;dig&#233; :</p><p style=\"text-align: justify;\">&#171;&#160;<i>Art. 160-1&#160;&#8211;&#160;</i>Il n&#8217;est plus attribu&#233; aux membres de l&#8217;Assembl&#233;e nationale de facilit&#233;s d&#8217;un v&#233;hicule avec chauffeur personnellement affect&#233; &#224; un d&#233;put&#233;, au titre de ses fonctions ou missions au sein de l&#8217;Assembl&#233;e. Seul le Pr&#233;sident de l&#8217;Assembl&#233;e nationale peut en b&#233;n&#233;ficier. &#187;</p>",
    "exposeSommaire": "<p style=\"text-align: justify;\">Les d&#233;penses de l&#8217;Assembl&#233;e Nationale ne doivent laisser place &#224; aucun avantage qui ne serait pas strictement n&#233;cessaire &#224; l&#8217;exercice de la stricte mission parlementaire, et aucune autre. Les Vice-pr&#233;sidents, Questeurs, Pr&#233;sidents de Commission et autres d&#233;put&#233;s charg&#233;s d&#8217;une mission sp&#233;cifiques assurent ces missions principalement au sein des locaux de l&#8217;Assembl&#233;e nationale. Un service de transport est par ailleurs assur&#233; par l&#8217;Assembl&#233;e, tout comme des taxis ou transports en commun parisiens peuvent &#234;tre utilis&#233;s sans difficult&#233;s. Aussi, l&#8217;attribution d&#8217;un v&#233;hicule avec chauffeur r&#233;serv&#233; ne se justifie pas. Le pr&#233;sent amendement sous forme d&#8217;article additionnel vise &#224; &#233;purer l&#8217;Assembl&#233;e Nationale de cette usage tout droit issu du &#171; vieux Monde&#187;.</p>"
  },
  "representations": [
    {
      "nom": "PDF",
      "typeMime": {
        "type": "application",
        "subType": "PDF"
      },
      "statutRepresentation": {
        "verbatim": true,
        "canonique": true,
        "officielle": true,
        "transcription": false,
        "enregistrement": false
      },
      "contenu": {
        "documentURI": "/15/amendements/0259/AN/76.pdf"
      }
    }
  ],
  "dateDepot": "2017-10-06T02:00:00.000+02:00",
  "dateDistribution": "2017-10-10T02:00:00.000+02:00",
  "article99": "0",
  "loiReference": {}
}