{
  "uid": "AMANR5L15SEA717460BTC0019P0D1N385",
  "identifiant": {
    "legislature": "15",
    "numero": "385",
    "numRect": "0",
    "saisine": {
      "texteLegislatifRef": "PRJLANR5L15BTC0019",
      "numeroPartiePLF": "0",
      "organeExamen": "PO717460",
      "mentionSecondeDeliberation": "0"
    }
  },
  "numeroLong": "385",
  "etapeTexte": "1ère lecture (1ère assemblée saisie)",
  "triAmendement": "i",
  "cardinaliteAmdtMultiples": "1",
  "etat": "Discuté",
  "signataires": {
    "auteur": {
      "typeAuteur": "Depute",
      "acteurRef": "PA718926",
      "groupePolitiqueRef": "PO730940"
    },
    "cosignatairesRefs": [
      "PA721270",
      "PA718926",
      "PA441",
      "PA267306",
      "PA722202",
      "PA689",
      "PA335612",
      "PA718720",
      "PA720692",
      "PA721118",
      "PA722110",
      "PA721896",
      "PA720546",
      "PA610667",
      "PA610654",
      "PA610634"
    ],
    "texteAffichable": "M.&#160;Dharr&#233;ville,  M.&#160;Azerot, Mme&#160;Bello, M.&#160;Brotherson, M.&#160;Bruneel, Mme&#160;Buffet, M.&#160;Chassaigne, M.&#160;Dufr&#232;gne, Mme&#160;Faucillon, M.&#160;Jumel, M.&#160;Lecoq, M.&#160;Nilor, M.&#160;Peu, M.&#160;Fabien&#160;Roussel, M.&#160;Serville et M.&#160;Wulfranc"
  },
  "pointeurFragmentTexte": {
    "division": {
      "titre": "Article 7",
      "articleDesignationCourte": "APRÈS ART. 7",
      "type": "ARTICLE",
      "avantAApres": "Apres",
      "divisionRattachee": "APRÈS L'ARTICLE 7, insérer l'article suivant:",
      "articleAdditionnel": "1",
      "urlDivisionTexteVise": "/15/textes/0019.asp#D_Article_7"
    }
  },
  "corps": {
    "dispositif": "<p style=\"text-align: justify;\">L&#8217;article L.&#160;3132&#8209;26 du code du travail est ainsi modifi&#233;&#160;:</p><p style=\"text-align: justify;\">1&#176;&#160;&#192; la deuxi&#232;me phrase du premier alin&#233;a, le mot&#160;: &#171;&#160;douze&#160;&#187; est remplac&#233; par le mot&#160;: &#171;&#160;cinq&#160;&#187;&#160;;</p><p style=\"text-align: justify;\">2&#176;&#160;Les deuxi&#232;me et troisi&#232;me alin&#233;as sont supprim&#233;s. &#187;</p>",
    "exposeSommaire": "<p style=\"text-align: justify;\">Le pr&#233;sent amendement vise &#224; r&#233;duire de douze &#224; cinq le nombre de dimanche o&#249; le repos peut &#234;tre supprim&#233; dans les &#233;tablissements de commerce de d&#233;tail.</p><p style=\"text-align: justify;\">&#160;</p><p style=\"text-align: justify;\">&#160;</p><p style=\"text-align: justify;\">&#160;</p>"
  },
  "representations": [
    {
      "nom": "PDF",
      "typeMime": {
        "type": "application",
        "subType": "PDF"
      },
      "statutRepresentation": {
        "verbatim": true,
        "canonique": true,
        "officielle": true,
        "transcription": false,
        "enregistrement": false
      },
      "contenu": {
        "documentURI": "/15/amendements/0019/AN/385.pdf"
      }
    }
  ],
  "seanceDiscussion": "RUANR5L15S2017IDS20615",
  "sort": {
    "dateSaisie": "2017-07-13T20:01:32.000+02:00",
    "sortEnSeance": "Rejeté"
  },
  "dateDepot": "2017-07-07T02:00:00.000+02:00",
  "dateDistribution": "2017-07-10T02:00:00.000+02:00",
  "article99": "0",
  "loiReference": {
    "codeLoi": "c travail",
    "divisionCodeLoi": "L3132-26"
  }
}