{
  "uid": "AMANR5L15PO419865B2135P0D1N156",
  "identifiant": {
    "legislature": "15",
    "numero": "156",
    "numRect": "0",
    "saisine": {
      "texteLegislatifRef": "PRJLANR5L15B2135",
      "numeroPartiePLF": "0",
      "organeExamen": "PO419865",
      "mentionSecondeDeliberation": "0"
    }
  },
  "numeroLong": "CD156",
  "etapeTexte": "Nouvelle Lecture",
  "triAmendement": "rkaaaaaaaaaaaaaaaaaaaaaaaaaaaaaaaaaaaaaaaaaaaaaaaai",
  "cardinaliteAmdtMultiples": "1",
  "etat": "Discuté",
  "signataires": {
    "auteur": {
      "typeAuteur": "Depute",
      "acteurRef": "PA720944",
      "groupePolitiqueRef": "PO730964"
    },
    "cosignatairesRefs": [
      "PA720944"
    ],
    "texteAffichable": "Mme&#160;Park, rapporteure"
  },
  "pointeurFragmentTexte": {
    "division": {
      "titre": "Article 51",
      "articleDesignationCourte": "ART. 51",
      "type": "ARTICLE",
      "avantAApres": "A",
      "divisionRattachee": "ARTICLE 51",
      "urlDivisionTexteVise": "/15/textes/2135.asp#D_Article_51"
    },
    "alinea": {
      "numero": "4"
    }
  },
  "corps": {
    "dispositif": "<p style=\"text-align: justify;\">&#192; l&#8217;alin&#233;a&#160;4, apr&#232;s la seconde occurrence du mot&#160;:</p><p style=\"text-align: justify;\">&#171;&#160;et&#160;&#187;,</p><p style=\"text-align: justify;\">ins&#233;rer le mot&#160;:</p><p style=\"text-align: justify;\">&#171;&#160;les&#160;&#187;.</p>",
    "exposeSommaire": "<p>Pr&#233;cision r&#233;dactionnelle.</p>"
  },
  "representations": [
    {
      "nom": "PDF",
      "typeMime": {
        "type": "application",
        "subType": "PDF"
      },
      "statutRepresentation": {
        "verbatim": true,
        "canonique": true,
        "officielle": true,
        "transcription": false,
        "enregistrement": false
      },
      "contenu": {
        "documentURI": "/15/amendements/2135/CION-DVP/CD156.pdf"
      }
    }
  ],
  "sort": {
    "dateSaisie": "2019-09-04T01:16:31.000+02:00",
    "sortEnSeance": "Adopté"
  },
  "dateDepot": "2019-07-23T02:00:00.000+02:00",
  "dateDistribution": "2019-08-31T02:00:00.000+02:00",
  "article99": "0",
  "loiReference": {}
}