{
  "uid": "AMANR5L15PO59048B1490P0D1N31",
  "identifiant": {
    "legislature": "15",
    "numero": "31",
    "numRect": "0",
    "saisine": {
      "texteLegislatifRef": "PRJLANR5L15B1490",
      "numeroPartiePLF": "0",
      "organeExamen": "PO59048",
      "mentionSecondeDeliberation": "0"
    }
  },
  "numeroLong": "CF31",
  "etapeTexte": "Nouvelle Lecture",
  "triAmendement": "caiaaaaaaaaaaaaaaaaaaaaaaaaaaaaaaaaaaaaaaaaaaaaaaag",
  "cardinaliteAmdtMultiples": "1",
  "etat": "Discuté",
  "signataires": {
    "auteur": {
      "typeAuteur": "Depute",
      "acteurRef": "PA942",
      "groupePolitiqueRef": "PO759900"
    },
    "cosignatairesRefs": [
      "PA331582",
      "PA267042",
      "PA605518",
      "PA605694",
      "PA405480",
      "PA333421",
      "PA719146",
      "PA719138",
      "PA720996",
      "PA719286",
      "PA336175",
      "PA942",
      "PA608292",
      "PA336439",
      "PA755549",
      "PA607619"
    ],
    "texteAffichable": "M.&#160;Charles&#160;de Courson,  M.&#160;Acquaviva, M.&#160;Brial, M.&#160;Castellani, M.&#160;Cl&#233;ment, M.&#160;Colombani, Mme&#160;Dubi&#233;, M.&#160;El Guerrab, M.&#160;Falorni, M.&#160;Favennec Becot, M.&#160;Fran&#231;ois-Michel&#160;Lambert, M.&#160;Molac, M.&#160;Pancher, Mme&#160;Pinel, M.&#160;Pupponi et M.&#160;Philippe&#160;Vigier"
  },
  "pointeurFragmentTexte": {
    "division": {
      "titre": "Article 19 bis A",
      "articleDesignationCourte": "ART. 19 BIS A",
      "type": "ARTICLE",
      "avantAApres": "A",
      "divisionRattachee": "ARTICLE 19 BIS A",
      "urlDivisionTexteVise": "/15/textes/1490.asp#D_Article_19_bis_A"
    },
    "alinea": {
      "avantAApres": "A",
      "numero": "1",
      "alineaDesignation": "Alinéa 1"
    }
  },
  "corps": {
    "dispositif": "<p style=\"text-align: justify;\">I. - Modifier ainsi l&#8217;article&#160;19 <i>bis</i> A&#160;:</p><p style=\"text-align: justify;\">1&#176;) Le I est ainsi modifi&#233;&#160;:</p><p style=\"text-align: justify;\">a) Compl&#233;ter l&#8217;alin&#233;a par la phrase &#171;&#160;et apr&#232;s les mots &#171;&#160;tableau B du 1 de l&#8217;article&#160;265&#160;&#187; sont ajout&#233;s les mots &#171;&#160;et au carburant repris &#224; l&#8217;indice d&#8217;identification 57 du m&#234;me tableau&#160;&#187;&#160;&#187;&#160;;</p><p style=\"text-align: justify;\">b) Ajouter deux nouveaux alin&#233;as ainsi r&#233;dig&#233;s&#160;:</p><p style=\"text-align: justify;\">&#171;&#160;Au troisi&#232;me alin&#233;a de l&#8217;article&#160;265 sexies du code des douanes, r&#233;diger ainsi le d&#233;but du texte&#160;: &#171;&#160;Pour le gazole repris aux indices d&#8217;identification 22 et 22 bis et le supercarburant repris &#224; l&#8217;indice d&#8217;identification 11 du tableau susmentionn&#233;&#160;&#187;&#160;&#187;.</p><p style=\"text-align: justify;\">&#171;&#160;Apr&#232;s le troisi&#232;me alin&#233;a de l&#8217;article&#160;265 sexies du code des douanes, ins&#233;rer un alin&#233;a ainsi r&#233;dig&#233;&#160;: &#171;&#160;Pour le carburant repris &#224; l&#8217;indice d&#8217;identification 57 du tableau susmentionn&#233;, ce remboursement est calcul&#233; en appliquant au volume de carburant acquis dans chaque r&#233;gion ou dans la collectivit&#233; de Corse la diff&#233;rence entre le taux de la taxe int&#233;rieure de consommation applicable &#224; ce carburant et 6,50&#160;euros par hectolitre&#160;&#187;&#160;&#187;.</p><p style=\"text-align: justify;\">2&#176;) Le II est ainsi modifi&#233;&#160;:</p><p style=\"text-align: justify;\">a) Compl&#233;ter l&#8217;alin&#233;a par la phrase &#171;&#160;et apr&#232;s les mots &#171;&#160;tableau B du 1 de l&#8217;article&#160;265&#160;&#187; sont ajout&#233;s les mots &#171;&#160;et sur le carburant repris &#224; l&#8217;indice d&#8217;identification 57 du m&#234;me tableau&#160;&#187;&#160;&#187;&#160;;</p><p style=\"text-align: justify;\">b) Ajouter trois nouveaux alin&#233;as ainsi r&#233;dig&#233;s&#160;:</p><p style=\"text-align: justify;\">&#171;&#160;Au septi&#232;me alin&#233;a de l&#8217;article&#160;265 septies du code des douanes, remplacer les mots &#171;&#160;de gazole utilis&#233; comme carburant&#160;&#187; par les mots &#171;&#160;de carburant utilis&#233;&#160;&#187;, et ins&#233;rer apr&#232;s les mots &#171;&#160;43,19&#160;euros par&#160;hectolitre&#160;&#187; les mots &#171;&#160;pour le gazole identifi&#233; aux indices 22 et 22 bis du tableau susmentionn&#233;&#160;ou 9,50&#160;euros par hectolitre pour le carburant identifi&#233; &#224; l&#8217;indice 57 du tableau susmentionn&#233;&#160;&#187;&#160;&#187;.</p><p style=\"text-align: justify;\">&#171;&#160;Au huiti&#232;me alin&#233;a de l&#8217;article&#160;265 septies du code des douanes, remplacer les mots &#171;&#160;de gazole utilis&#233; comme carburant&#160;&#187; par les mots &#171;&#160;de carburant utilis&#233;&#160;&#187;, et les mots &#171;&#160;les volumes de gazole&#160;&#187; par les mots &#171;&#160;les volumes de carburant&#160;&#187;&#160;&#187;.</p><p style=\"text-align: justify;\">&#171;&#160;Au neuvi&#232;me alin&#233;a de l&#8217;article&#160;265 septies, remplacer les mots &#171;&#160;du gazole&#160;&#187; par les mots &#171;&#160;du carburant&#160;&#187;, et les mots &#171;&#160;ce gazole a &#233;t&#233; utilis&#233; comme carburant&#160;&#187; par les mots &#171;&#160;ce carburant a &#233;t&#233; utilis&#233;&#160;&#187;&#160;&#187;.</p><p style=\"text-align: justify;\">3&#176;) Le III est ainsi modifi&#233;&#160;:</p><p style=\"text-align: justify;\">a) Compl&#233;ter l&#8217;alin&#233;a par la phrase &#171;&#160;et apr&#232;s les mots &#171;&#160;tableau B du 1 de l&#8217;article&#160;265&#160;&#187; sont ajout&#233;s les mots &#171;&#160;et sur le carburant repris &#224; l&#8217;indice d&#8217;identification 57 du m&#234;me tableau&#160;&#187;&#160;&#187;&#160;;</p><p style=\"text-align: justify;\">b) Ajouter quatre nouveaux alin&#233;as ainsi r&#233;dig&#233;s&#160;:</p><p style=\"text-align: justify;\">&#171;&#160;Au deuxi&#232;me alin&#233;a de l&#8217;article&#160;265 octies du code des douanes, remplacer les mots &#171;&#160;le gazole&#160;&#187; par les mots &#171;&#160;le carburant&#160;&#187;&#160;&#187;.</p><p style=\"text-align: justify;\">&#171;&#160;Au quatri&#232;me alin&#233;a de l&#8217;article&#160;265 octies du code des douanes, remplacer les mots &#171;&#160;de gazole utilis&#233; comme carburant&#160;&#187; par les mots &#171;&#160;de carburant utilis&#233;&#160;&#187;, et ins&#233;rer apr&#232;s les mots &#171;&#160;39,19&#160;euros par hectolitre&#160;&#187; les mots &#171;&#160;pour le gazole identifi&#233; aux indices 22 et 22 bis du tableau susmentionn&#233;&#160;ou 8,80&#160;euros par hectolitre pour le carburant identifi&#233; &#224; l&#8217;indice 57 du tableau susmentionn&#233;&#160;&#187;&#160;&#187;.</p><p style=\"text-align: justify;\">&#171;&#160;Au cinqui&#232;me alin&#233;a de l&#8217;article&#160;265 octies du code des douanes, remplacer les mots &#171;&#160;de gazole utilis&#233; comme carburant&#160;&#187; par les mots &#171;&#160;de carburant utilis&#233;&#160;&#187;, et les mots &#171;&#160;les volumes de gazole&#160;&#187; par les mots &#171;&#160;les volumes de carburant&#160;&#187;&#160;&#187;.</p><p style=\"text-align: justify;\">&#171;&#160;Au septi&#232;me alin&#233;a de l&#8217;article&#160;265 octies, remplacer les mots &#171;&#160;du gazole&#160;&#187; par les mots &#171;&#160;du carburant&#160;&#187;, et les mots &#171;&#160;ce gazole a &#233;t&#233; utilis&#233; comme carburant&#160;&#187; par les mots &#171;&#160;ce carburant a &#233;t&#233; utilis&#233;&#160;&#187;&#160;&#187;.</p><p style=\"text-align: justify;\">II. - La perte de recettes pour l&#8217;&#201;tat est compens&#233;e &#224; due concurrence par la cr&#233;ation d&#8217;une taxe additionnelle aux droits mentionn&#233;s aux articles 575 et 575 A du code g&#233;n&#233;ral des imp&#244;ts.</p>",
    "exposeSommaire": "<p>L&#8217;article 19 bis A (nouveau), dans sa version transmise par le S&#233;nat, a &#233;tendu le remboursement forfaitaire de la taxe int&#233;rieure de consommation sur les produits &#233;nerg&#233;tiques (TICPE) au carburant B10 de l&#8217;indice 22 bis.</p><p>L&#8217;amendement vise &#224; &#233;tendre, en l&#8217;adaptant,&#160;ce dispositif au carburant B100 (indice 57).</p><p>Autoris&#233; depuis mars 2018, le B100 est un carburant contenant jusqu&#8217;&#224; 100 % de carburant renouvelable produit &#224; partir de colza. Destin&#233; uniquement aux flottes captives, il constitue une alternative enti&#232;rement substituable au gazole et une r&#233;ponse imm&#233;diate aux efforts de transition &#233;cologique du secteur des transports routiers. Le B100 pr&#233;sente enfin un bilan &#233;nerg&#233;tique positif puisqu&#8217;il restitue 3,7 fois plus d&#8217;&#233;nergie qu&#8217;il n&#8217;en n&#233;cessite pour &#234;tre produit.</p><p>Dans ce contexte, l&#8217;amendement est coh&#233;rent avec la strat&#233;gie gouvernementale pour les raisons suivantes.</p><p>En premier lieu, le d&#233;veloppement du B100 participera pleinement &#224; la transition &#233;nerg&#233;tique puisqu&#8217;il comporte une proportion accrue de biocarburants, et qu&#8217;il contribuera ainsi &#224; la d&#233;carbonation d'un secteur des transports qui restera encore largement d&#233;pendant des &#233;nergies fossiles sur les quinze prochaines ann&#233;es.</p><p>En deuxi&#232;me lieu, la mesure vise &#224; mettre en place une fiscalit&#233; incitative pour soutenir cette transition &#233;nerg&#233;tique, et n&#8217;a donc pas vocation &#224; cr&#233;er de nouvelles exon&#233;rations et niches fiscales.</p><p>En troisi&#232;me lieu, l&#8217;amendement permettra d&#8217;accompagner les professionnels de la route dans la transition &#233;nerg&#233;tique.</p><p>Enfin, l&#8217;amendement participera &#224; l&#8217;ambition affich&#233;e d&#8217;une fiscalit&#233; lisible, coh&#233;rente et non-discriminatoire puisqu&#8217;il s&#8217;agit d&#8217;une simple mesure de coh&#233;rence qui vise &#224; tirer les cons&#233;quences de la cr&#233;ation du B100.</p><p>En revanche, une r&#233;gionalisation du B100 ne para&#238;t pas justifi&#233;e dans la mesure o&#249;&#160;l'ED-95 (l&#8217;&#233;quivalent essence du B100) n'est pas &#233;ligible &#224; ce dispositif. Le principe d'&#233;galit&#233; de traitement devant s'appliquer, il n&#8217;y a donc pas lieu de modifier les articles 265 A bis et 265 A ter du code des douanes.</p>"
  },
  "representations": [
    {
      "nom": "PDF",
      "typeMime": {
        "type": "application",
        "subType": "PDF"
      },
      "statutRepresentation": {
        "verbatim": true,
        "canonique": true,
        "officielle": true,
        "transcription": false,
        "enregistrement": false
      },
      "contenu": {
        "documentURI": "/15/amendements/1490/CION_FIN/CF31.pdf"
      }
    }
  ],
  "sort": {
    "dateSaisie": "2018-12-14T11:48:27.000+01:00",
    "sortEnSeance": "Tombé"
  },
  "dateDepot": "2018-12-13T01:00:00.000+01:00",
  "dateDistribution": "2018-12-14T01:00:00.000+01:00",
  "article99": "0",
  "loiReference": {}
}