{
  "uid": "AMANR5L15SEA717460B0911P0D1N2315",
  "identifiant": {
    "legislature": "15",
    "numero": "2315",
    "numRect": "0",
    "saisine": {
      "texteLegislatifRef": "PRJLANR5L15B0911",
      "numeroPartiePLF": "0",
      "organeExamen": "PO717460",
      "mentionSecondeDeliberation": "0"
    }
  },
  "numeroLong": "2315",
  "etapeTexte": "1ère lecture (1ère assemblée saisie)",
  "triAmendement": "aabttthyymzvzzzru",
  "cardinaliteAmdtMultiples": "1",
  "etat": "Discuté",
  "signataires": {
    "auteur": {
      "typeAuteur": "Depute",
      "acteurRef": "PA718926",
      "groupePolitiqueRef": "PO730940"
    },
    "cosignatairesRefs": [
      "PA718926",
      "PA721012",
      "PA610654",
      "PA721118",
      "PA722110",
      "PA720692",
      "PA718720",
      "PA689"
    ],
    "texteAffichable": "M.&#160;Dharr&#233;ville,  M.&#160;Brotherson, Mme&#160;Buffet, M.&#160;Dufr&#232;gne, Mme&#160;K&#233;clard-Mond&#233;sir, M.&#160;Nilor, M.&#160;Fabien&#160;Roussel et M.&#160;Wulfranc"
  },
  "pointeurFragmentTexte": {
    "division": {
      "titre": "Article 2",
      "articleDesignationCourte": "APRÈS ART. 2",
      "type": "ARTICLE",
      "avantAApres": "Apres",
      "divisionRattachee": "APRÈS L'ARTICLE 2, insérer l'article suivant:",
      "articleAdditionnel": "1",
      "urlDivisionTexteVise": "/15/textes/0911.asp#D_Article_2"
    }
  },
  "corps": {
    "dispositif": "<p>Apr&#232;s le dix-septi&#232;me alin&#233;a de l&#8217;article&#160;34 de la Constitution, il est ins&#233;r&#233; un alin&#233;a ainsi r&#233;dig&#233;&#160;:</p><p>&#171;&#160;&#8211;&#160;des droits n&#233;cessaires &#224; l&#8217;exercice de la citoyennet&#233; dans l&#8217;entreprise.&#160;&#187;.</p>",
    "exposeSommaire": "<p style=\"text-align: justify;\">Les propositions que nous portons dans le cadre de la r&#233;forme constitutionnelle visent &#224; renforcer les pouvoirs du Parlement et de l&#8217;opposition face &#224; l&#8217;hypertrophie du pouvoir ex&#233;cutif. Mettre fin &#224; ce d&#233;s&#233;quilibre des pouvoirs est indispensable pour corriger le d&#233;ficit d&#233;mocratique du r&#233;gime. Dans cet esprit, nous proposons &#233;galement de renforcer les droits de participation d&#233;mocratique. Enfin, une r&#233;forme de la Constitution ne peut se concevoir sans y inscrire des principes essentiels aujourd&#8217;hui absents de notre Loi fondamentale.</p><p style=\"text-align: justify;\">Dans ce cadre, cet amendement vise, dans le prolongement des droits sociaux garantis par le Pr&#233;ambule de 1946, &#224; introduire dans la Constitution la n&#233;cessit&#233; pour le l&#233;gislateur de d&#233;finir les principes fondamentaux relatifs &#224; l&#8217;exercice de la citoyennet&#233; dans l&#8217;entreprise.</p><p style=\"text-align: justify;\">En effet, aujourd&#8217;hui, le constat est bien souvent celui d&#8217;un manque de vitalit&#233; d&#233;mocratique au sein des entreprises. Ces derni&#232;res reposent bien souvent sur un fonctionnement vertical dans lequel le pouvoir est in&#233;galement exerc&#233; et r&#233;parti. Il est au contraire n&#233;cessaire de redonner des pouvoirs d&#8217;intervention aux salari&#233;s et &#224; leurs repr&#233;sentants.</p>"
  },
  "representations": [
    {
      "nom": "PDF",
      "typeMime": {
        "type": "application",
        "subType": "PDF"
      },
      "statutRepresentation": {
        "verbatim": true,
        "canonique": true,
        "officielle": true,
        "transcription": false,
        "enregistrement": false
      },
      "contenu": {
        "documentURI": "/15/amendements/0911/AN/2315.pdf"
      }
    }
  ],
  "seanceDiscussion": "RUANR5L15S2018IDS21175",
  "sort": {
    "dateSaisie": "2018-07-19T22:48:30.000+02:00",
    "sortEnSeance": "Rejeté"
  },
  "dateDepot": "2018-07-06T02:00:00.000+02:00",
  "dateDistribution": "2018-07-10T02:00:00.000+02:00",
  "article99": "0",
  "loiReference": {
    "codeLoi": "Constitution",
    "divisionCodeLoi": "34"
  }
}