{
  "uid": "AMANR5L15PO59051B0778P0D1N215",
  "identifiant": {
    "legislature": "15",
    "numero": "215",
    "numRect": "0",
    "saisine": {
      "texteLegislatifRef": "PRJLANR5L15B0778",
      "numeroPartiePLF": "0",
      "organeExamen": "PO59051",
      "mentionSecondeDeliberation": "0"
    }
  },
  "numeroLong": "CL215",
  "etapeTexte": "1ère lecture (1ère assemblée saisie)",
  "triAmendement": "dwlaz",
  "cardinaliteAmdtMultiples": "1",
  "etat": "Discuté",
  "signataires": {
    "auteur": {
      "typeAuteur": "Depute",
      "acteurRef": "PA267440",
      "groupePolitiqueRef": "PO730934"
    },
    "cosignatairesRefs": [
      "PA267440"
    ],
    "texteAffichable": "M.&#160;Diard"
  },
  "pointeurFragmentTexte": {
    "division": {
      "titre": "Article 2",
      "articleDesignationCourte": "ART. 2",
      "type": "ARTICLE",
      "avantAApres": "A",
      "divisionRattachee": "ARTICLE 2",
      "urlDivisionTexteVise": "/15/textes/0778.asp#D_Article_2"
    },
    "alinea": {
      "avantAApres": "Apres",
      "numero": "2"
    }
  },
  "corps": {
    "dispositif": "<p style=\"text-align: justify;\">I.&#160;&#8211;&#160;Apr&#232;s l&#8217;alin&#233;a&#160;2, ins&#233;rer l&#8217;alin&#233;a suivant&#160;:</p><p style=\"text-align: justify;\">&#171;&#160;Lorsque les faits sont commis par une personne majeure sur la personne d&#8217;un mineur de treize ans, la contrainte morale ou la surprise r&#233;sultent de l&#8217;abus de l&#8217;ignorance de la victime ne disposant pas de la maturit&#233; ou du discernement n&#233;cessaire pour consentir &#224; ces actes.&#160;&#187;</p><p style=\"text-align: justify;\">II.&#160;&#8211;&#160;En cons&#233;quence, &#224; l&#8217;alin&#233;a&#160;1, substituer aux mots&#160;:</p><p style=\"text-align: justify;\">&#171;&#160;un alin&#233;a ainsi r&#233;dig&#233;&#160;&#187;</p><p style=\"text-align: justify;\">les mots&#160;:</p><p style=\"text-align: justify;\">&#171;&#160;deux alin&#233;as ainsi r&#233;dig&#233;s&#160;&#187;.</p>",
    "exposeSommaire": "<p>Amendement de repli n&#176;2.</p><p>Cet amendement consiste &#224; instaurer une pr&#233;somption (r&#233;fragable) d'abus d'ignorance de la victime mineure de treize ans en cas de relation sexuelle lorsque la personne en cause est majeure. En effet, la majorit&#233; sexuelle &#233;tant &#233;tablie &#224; quinze ans, le principe est que les personnes mineures de quinze ans n'ont pas la maturit&#233; ou le discernement n&#233;cessaires pour consentir &#224; des actes de nature sexuelles, et ne l'ont que par exception. Par extension, les personnes mineures de treize ans sont encore plus vuln&#233;rables et &#224; prot&#233;ger par la loi &#224; l'encontre des pr&#233;dateurs sexuels qui utilisent le flou qui entoure les notions de discernement et de maturit&#233; pour parvenir &#224; leurs fins.</p><p>Il convient alors d'inverser la charge de la preuve et de demander &#224; ce qu'il soit &#233;tabli &#224; ce que la personne mineure de quinze ans &#233;tait bien dot&#233;e de cette maturit&#233; ou du discernement n&#233;cessaire pour consentir &#224; ces actes avec une personne majeure.</p>"
  },
  "representations": [
    {
      "nom": "PDF",
      "typeMime": {
        "type": "application",
        "subType": "PDF"
      },
      "statutRepresentation": {
        "verbatim": true,
        "canonique": true,
        "officielle": true,
        "transcription": false,
        "enregistrement": false
      },
      "contenu": {
        "documentURI": "/15/amendements/0778/CION_LOIS/CL215.pdf"
      }
    }
  ],
  "sort": {
    "dateSaisie": "2018-05-09T19:01:20.000+02:00",
    "sortEnSeance": "Non soutenu"
  },
  "dateDepot": "2018-05-06T02:00:00.000+02:00",
  "dateDistribution": "2018-05-07T02:00:00.000+02:00",
  "article99": "0",
  "loiReference": {
    "codeLoi": "1.3"
  }
}