{
  "uid": "AMANR5L15PO420120B0391P0D1N15",
  "identifiant": {
    "legislature": "15",
    "numero": "15",
    "numRect": "0",
    "saisine": {
      "texteLegislatifRef": "PRJLANR5L15B0391",
      "numeroPartiePLF": "0",
      "organeExamen": "PO420120",
      "mentionSecondeDeliberation": "0"
    }
  },
  "numeroLong": "AS15",
  "etapeTexte": "1ère lecture (1ère assemblée saisie)",
  "triAmendement": "k",
  "cardinaliteAmdtMultiples": "1",
  "etat": "Discuté",
  "signataires": {
    "auteur": {
      "typeAuteur": "Depute",
      "acteurRef": "PA718926",
      "groupePolitiqueRef": "PO730940"
    },
    "cosignatairesRefs": [
      "PA718926"
    ],
    "texteAffichable": "M.&#160;Dharr&#233;ville"
  },
  "pointeurFragmentTexte": {
    "division": {
      "titre": "Article 3",
      "articleDesignationCourte": "APRÈS ART. 3",
      "type": "ARTICLE",
      "avantAApres": "Apres",
      "divisionRattachee": "APRÈS L'ARTICLE 3, insérer l'article suivant:",
      "articleAdditionnel": "1",
      "urlDivisionTexteVise": "/15/textes/0391.asp#D_Article_3"
    }
  },
  "corps": {
    "dispositif": "<p style=\"text-align: justify;\">Dans un d&#233;lai de six mois &#224; compter de la publication de la pr&#233;sente loi, le Gouvernement remet au Parlement un rapport sur l&#8217;acc&#232;s aux soins des &#233;tudiants. Ce rapport porte notamment sur la couverture sant&#233; compl&#233;mentaire des &#233;tudiants et les moyens &#224; mettre en &#339;uvre pour l&#8217;am&#233;liorer.</p>",
    "exposeSommaire": "<p style=\"text-align: justify;\">Un tiers des &#233;tudiants renonce &#224; des soins, le plus souvent pour des raisons financi&#232;res. En outre, l&#8217;absence de couverture compl&#233;mentaire concernerait entre 1 &#233;tudiant sur 5 (19&#160;% et 18&#160;% respectivement selon la LMDE et EmeVia) et 1 &#233;tudiant sur 10 (9&#160;% selon l&#8217;enqu&#234;te 2017 de l&#8217;Observatoire de la vie &#233;tudiante). Ces chiffres doivent &#234;tre mis en comparaison avec le taux de couverture de la population g&#233;n&#233;rale qui atteint 94&#160;%.</p><p style=\"text-align: justify;\">Alors que le pr&#233;sent projet de loi entend rattacher les &#233;tudiants au r&#233;gime g&#233;n&#233;ral de s&#233;curit&#233; sociale afin d&#8217;am&#233;liorer leur couverture maladie obligatoire, il convient &#233;galement de r&#233;fl&#233;chir aux moyens d&#8217;am&#233;liorer la couverture maladie compl&#233;mentaire.</p><p style=\"text-align: justify;\">Certaines collectivit&#233;s territoriales ont mis en place des des ch&#232;ques sant&#233; locaux pour aider les jeunes de leur territoire &#224; acc&#233;der &#224; une compl&#233;mentaire sant&#233;. Ces dispositifs m&#233;riteraient de faire l&#8217;objet d&#8217;une &#233;valuation d&#233;di&#233;e pour en mesurer l&#8217;impact en termes de sant&#233; publique et de r&#233;duction des in&#233;galit&#233;s sociales de sant&#233;.&#160;</p><p style=\"text-align: justify;\">D&#8217;autres propositions int&#233;ressantes sont dans le d&#233;bat&#160;: la cr&#233;ation d&#8217;un ch&#232;que national sant&#233;, l&#8217;extension de l&#8217;aide &#224; la compl&#233;mentaire sant&#233; (ACS), ou encore l&#8217;&#233;largissement de la CMU-C aux jeunes. En l&#8217;&#233;tat, ces deux derniers dispositifs b&#233;n&#233;ficient tr&#232;s peu aux &#233;tudiants car ils sont conditionn&#233;s &#224; des niveaux de ressources.</p><p style=\"text-align: justify;\">La pr&#233;sente demande de rapport vise donc &#224; dresser l&#8217;&#233;tat des lieux des dispositifs existants, d&#8217;en &#233;valuer la pertinence en termes d&#8217;acc&#232;s aux soins pour les &#233;tudiants, et de formuler des recommandations pour am&#233;liorer leur couverture sant&#233;.</p>"
  },
  "representations": [
    {
      "nom": "PDF",
      "typeMime": {
        "type": "application",
        "subType": "PDF"
      },
      "statutRepresentation": {
        "verbatim": true,
        "canonique": true,
        "officielle": true,
        "transcription": false,
        "enregistrement": false
      },
      "contenu": {
        "documentURI": "/15/amendements/0391/CION-SOC/AS15.pdf"
      }
    }
  ],
  "sort": {
    "dateSaisie": "2017-12-05T09:49:41.000+01:00",
    "sortEnSeance": "Rejeté"
  },
  "dateDepot": "2017-12-01T01:00:00.000+01:00",
  "dateDistribution": "2017-12-04T01:00:00.000+01:00",
  "article99": "0",
  "loiReference": {
    "codeLoi": "zzz"
  }
}