{
  "uid": "AMANR5L15SEA717460B0911P0D1N1257",
  "identifiant": {
    "legislature": "15",
    "numero": "1257",
    "numRect": "0",
    "saisine": {
      "texteLegislatifRef": "PRJLANR5L15B0911",
      "numeroPartiePLF": "0",
      "organeExamen": "PO717460",
      "mentionSecondeDeliberation": "0"
    }
  },
  "numeroLong": "1257",
  "etapeTexte": "1ère lecture (1ère assemblée saisie)",
  "triAmendement": "aayzxxs",
  "cardinaliteAmdtMultiples": "1",
  "etat": "Discuté",
  "signataires": {
    "auteur": {
      "typeAuteur": "Depute",
      "acteurRef": "PA719146",
      "groupePolitiqueRef": "PO723569"
    },
    "cosignatairesRefs": [
      "PA610654",
      "PA721118",
      "PA719146",
      "PA720996"
    ],
    "texteAffichable": "M.&#160;Acquaviva,  M.&#160;Nilor, M.&#160;Brotherson et M.&#160;El Guerrab"
  },
  "pointeurFragmentTexte": {
    "division": {
      "titre": "Article PREMIER",
      "articleDesignationCourte": "AVANT ART. PREMIER",
      "type": "ARTICLE",
      "avantAApres": "Avant",
      "divisionRattachee": "AVANT L'ARTICLE PREMIER, insérer l'article suivant:",
      "articleAdditionnel": "1",
      "urlDivisionTexteVise": "/15/textes/0911.asp#D_Article_1er"
    }
  },
  "corps": {
    "dispositif": "<p style=\"text-align: justify;\">Au second alin&#233;a du Pr&#233;ambule de la Constitution, apr&#232;s le mot&#160;: &#171;&#160;territoires&#160;&#187;, sont ins&#233;r&#233;s les mots&#160;: &#171;&#160;insulaires et&#160;&#187;.</p>",
    "exposeSommaire": "<p style=\"text-align: justify;\">Cet amendement propose de modifier le pr&#233;ambule de la Constitution en ins&#233;rant tous les territoires insulaires dans la possibilit&#233; de s&#8217;administrer librement s&#8217;ils en expriment la volont&#233;. Dans le fil historique des id&#233;es des Lumi&#232;res et de la R&#233;volution fran&#231;aise, l&#8217;id&#233;al de libert&#233; ne doit pas exclure les territoires qui ont une histoire et une g&#233;ographie particuli&#232;re et qui manifestent d&#233;mocratiquement la volont&#233; ferme et assum&#233;e d&#8217;acc&#233;der &#224; la libre d&#233;termination de leur destin.</p><p style=\"text-align: justify;\">En effet l&#8217;insularit&#233; est un &#233;l&#233;ment objectif insurmontable qui est presque toujours logiquement associ&#233;, dans les d&#233;mocraties, &#224; la n&#233;cessit&#233; de disposer d&#8217;une autonomie, y compris si l&#8217;&#201;tat est unitaire, car il est l&#233;gitime en droit de traiter diff&#233;remment des situations diff&#233;rentes. L&#8217;&#233;l&#233;ment insulaire est ainsi clairement le facteur explicatif de certains statuts d&#8217;autonomie dans constitutions des &#201;tats unitaires&#160;europ&#233;ens. Par exemple la Constitution portugaise, dot&#233; d&#8217;une organisation unitaire sur la partie ib&#233;rique et continentale de son territoire, dispose &#224; son article&#160;225&#8209;1 que &#171;&#160;Le r&#233;gime politique et administratif propre aux archipels des A&#231;ores et de Mad&#232;re est fond&#233; sur les caract&#233;ristiques g&#233;ographiques, &#233;conomiques, sociales et culturelles de ces r&#233;gions et sur les imm&#233;moriales aspirations &#224; l&#8217;autonomie des populations insulaires&#160;&#187;.</p>"
  },
  "representations": [
    {
      "nom": "PDF",
      "typeMime": {
        "type": "application",
        "subType": "PDF"
      },
      "statutRepresentation": {
        "verbatim": true,
        "canonique": true,
        "officielle": true,
        "transcription": false,
        "enregistrement": false
      },
      "contenu": {
        "documentURI": "/15/amendements/0911/AN/1257.pdf"
      }
    }
  ],
  "seanceDiscussion": "RUANR5L15S2018IDS21160",
  "sort": {
    "dateSaisie": "2018-07-11T18:38:21.000+02:00",
    "sortEnSeance": "Rejeté"
  },
  "dateDepot": "2018-07-05T02:00:00.000+02:00",
  "dateDistribution": "2018-07-07T02:00:00.000+02:00",
  "article99": "0",
  "loiReference": {
    "codeLoi": "Constitution",
    "divisionCodeLoi": "Préambule"
  }
}