{
  "uid": "AMANR5L15PO420120B1168P0D1N315",
  "identifiant": {
    "legislature": "15",
    "numero": "315",
    "numRect": "0",
    "saisine": {
      "texteLegislatifRef": "PRJLANR5L15B1168",
      "numeroPartiePLF": "0",
      "organeExamen": "PO420120",
      "mentionSecondeDeliberation": "0"
    }
  },
  "numeroLong": "AS315",
  "etapeTexte": "Nouvelle Lecture",
  "triAmendement": "li",
  "cardinaliteAmdtMultiples": "1",
  "etat": "Discuté",
  "signataires": {
    "auteur": {
      "typeAuteur": "Depute",
      "acteurRef": "PA720924",
      "groupePolitiqueRef": "PO730970"
    },
    "cosignatairesRefs": [
      "PA720924"
    ],
    "texteAffichable": "Mme&#160;Elimas, rapporteure"
  },
  "pointeurFragmentTexte": {
    "division": {
      "titre": "Article 40",
      "articleDesignationCourte": "ART. 40",
      "type": "ARTICLE",
      "avantAApres": "A",
      "divisionRattachee": "ARTICLE 40",
      "urlDivisionTexteVise": "/15/textes/1168.asp#D_Article_40"
    },
    "alinea": {
      "numero": "12"
    }
  },
  "corps": {
    "dispositif": "<p style=\"text-align: justify;\">Supprimer les deux derni&#232;res phrase de l&#8217;alin&#233;a&#160;12.</p>",
    "exposeSommaire": "<p style=\"text-align: justify;\">R&#233;tablissement de la r&#233;daction issue des travaux de l&#8217;Assembl&#233;e nationale.</p>"
  },
  "representations": [
    {
      "nom": "PDF",
      "typeMime": {
        "type": "application",
        "subType": "PDF"
      },
      "statutRepresentation": {
        "verbatim": true,
        "canonique": true,
        "officielle": true,
        "transcription": false,
        "enregistrement": false
      },
      "contenu": {
        "documentURI": "/15/amendements/1168/CION-SOC/AS315.pdf"
      }
    }
  ],
  "sort": {
    "dateSaisie": "2018-07-18T18:14:56.000+02:00",
    "sortEnSeance": "Adopté"
  },
  "dateDepot": "2018-07-17T02:00:00.000+02:00",
  "dateDistribution": "2018-07-18T02:00:00.000+02:00",
  "article99": "0",
  "loiReference": {}
}