{
  "uid": "AMANR5L15SEA717460BTC1019P0D1N336",
  "identifiant": {
    "legislature": "15",
    "numero": "336",
    "numRect": "0",
    "saisine": {
      "texteLegislatifRef": "PRJLANR5L15BTC1019",
      "numeroPartiePLF": "0",
      "organeExamen": "PO717460",
      "mentionSecondeDeliberation": "0"
    }
  },
  "numeroLong": "336",
  "etapeTexte": "1ère lecture (1ère assemblée saisie)",
  "triAmendement": "c",
  "cardinaliteAmdtMultiples": "1",
  "etat": "Irrecevable",
  "signataires": {
    "auteur": {
      "typeAuteur": "Depute",
      "acteurRef": "PA719318",
      "groupePolitiqueRef": "PO730934"
    },
    "cosignatairesRefs": [
      "PA720100",
      "PA605036",
      "PA267378",
      "PA721286",
      "PA642847",
      "PA266776",
      "PA340853",
      "PA266808",
      "PA721968",
      "PA718884",
      "PA346218",
      "PA721506",
      "PA608016",
      "PA718838",
      "PA721046",
      "PA267450",
      "PA719318"
    ],
    "texteAffichable": "Mme&#160;Anthoine,  Mme&#160;Bazin-Malgras, M.&#160;Leclerc, M.&#160;Pradi&#233;, M.&#160;Masson, Mme&#160;Levy, M.&#160;Ramadier, M.&#160;Rolland, Mme&#160;Kuster, M.&#160;Vialay, M.&#160;Abad, M.&#160;Bazin, M.&#160;R&#233;mi&#160;Delatte, M.&#160;Reiss, M.&#160;Brun, Mme&#160;Louwagie et Mme&#160;Bassire"
  },
  "pointeurFragmentTexte": {
    "division": {
      "titre": "Article 2",
      "articleDesignationCourte": "ART. 2",
      "type": "ARTICLE",
      "avantAApres": "A",
      "divisionRattachee": "ARTICLE 2",
      "urlDivisionTexteVise": "/15/textes/1019.asp#D_Article_2"
    },
    "alinea": {
      "avantAApres": "Apres",
      "numero": "8"
    }
  },
  "corps": {
    "dispositif": "<p style=\"text-align: justify;\">Apr&#232;s l&#8217;alin&#233;a&#160;8, ins&#233;rer les deux alin&#233;as suivants&#160;:</p><p style=\"text-align: justify;\">a bis) &#171;&#160;Le dixi&#232;me alin&#233;a est ainsi r&#233;dig&#233;&#160;:</p><p style=\"text-align: justify;\">&#171;&#160;<i>b)</i> Le b&#233;n&#233;vole participe &#224; l&#8217;action de l&#8217;association, dans des conditions, notamment de dur&#233;e, fix&#233;es par d&#233;cret.&#160;&#187;&#160;&#187;.</p>",
    "exposeSommaire": "<p style=\"text-align: justify;\">Le compte d&#8217;engagement citoyen r&#233;cemment mis en place m&#233;rite d&#8217;&#234;tre am&#233;nag&#233; dans deux directions.</p><p style=\"text-align: justify;\">D&#8217;une part, ce dispositif n&#8217;est r&#233;serv&#233; qu&#8217;aux b&#233;n&#233;voles qui si&#232;gent dans l&#8217;organe d&#8217;administration ou de direction de l&#8217;association ou participent &#224; l&#8217;encadrement d&#8217;autres b&#233;n&#233;voles. Il est donc propos&#233; de le modifier afin qu&#8217;il puisse b&#233;n&#233;ficier &#224; tous les b&#233;n&#233;voles, en respectant notamment les conditions de dur&#233;e.</p><p style=\"text-align: justify;\">D&#8217;autre part, afin de renforcer le b&#233;n&#233;volat des personnes handicap&#233;es ou en arr&#234;t de travail, ce qui peut permettre de favoriser le lien avec une activit&#233; et d&#8217;&#233;viter un &#233;loignement trop important de l&#8217;emploi, il est propos&#233; une majoration du plafond.</p>"
  },
  "representations": [
    {
      "nom": "PDF",
      "typeMime": {
        "type": "application",
        "subType": "PDF"
      },
      "statutRepresentation": {
        "verbatim": true,
        "canonique": true,
        "officielle": true,
        "transcription": false,
        "enregistrement": false
      },
      "contenu": {
        "documentURI": "/15/amendements/1019/AN/336.pdf"
      }
    }
  ],
  "dateDepot": "2018-06-05T02:00:00.000+02:00",
  "article99": "0",
  "loiReference": {}
}