{
  "uid": "AMANR5L15PO59048B1255P1D1N1422",
  "identifiant": {
    "legislature": "15",
    "numero": "1422",
    "numRect": "0",
    "saisine": {
      "texteLegislatifRef": "PRJLANR5L15B1255",
      "numeroPartiePLF": "1",
      "organeExamen": "PO59048",
      "mentionSecondeDeliberation": "0"
    }
  },
  "numeroLong": "I-CF1422",
  "etapeTexte": "1ère lecture (1ère assemblée saisie)",
  "triAmendement": "aiaaaaaaaaaaaaaaaaaaaaaaaaaaaaaaaaaaaaaaaaaaaaaaaabl",
  "cardinaliteAmdtMultiples": "1",
  "etat": "Discuté",
  "signataires": {
    "auteur": {
      "typeAuteur": "Depute",
      "acteurRef": "PA942",
      "groupePolitiqueRef": "PO744425"
    },
    "cosignatairesRefs": [
      "PA942",
      "PA331582",
      "PA720230",
      "PA712014"
    ],
    "texteAffichable": "M.&#160;Charles&#160;de Courson,  Mme&#160;Magnier, M.&#160;Philippe&#160;Vigier et M.&#160;Ledoux"
  },
  "pointeurFragmentTexte": {
    "division": {
      "titre": "Article PREMIER",
      "articleDesignationCourte": "ART. PREMIER",
      "type": "ARTICLE",
      "avantAApres": "A",
      "divisionRattachee": "ARTICLE PREMIER",
      "urlDivisionTexteVise": "/15/textes/1255A.asp#D_Article_1er"
    },
    "alinea": {
      "avantAApres": "Apres",
      "numero": "5"
    }
  },
  "corps": {
    "dispositif": "<p>Compl&#233;ter cet article par l&#8217;alin&#233;a suivant&#160;:</p><p>&#171;&#160;III.&#160;&#8211;&#160;Le montant annuel des d&#233;penses fiscales ne peut exc&#233;der 88,2 milliards d&#8217;euros en 2019.&#160;&#187;.</p>",
    "exposeSommaire": "<p style=\"text-align: justify;\">Cet amendement vise &#224; diminuer de 10 milliards les d&#233;penses fiscales.</p><p style=\"text-align: justify;\">Sans effort d&#8217;&#233;conomies suppl&#233;mentaires, leur montant devrait en effet s&#8217;&#233;lever &#224; 98,2 milliards d&#8217;euros en 2019.</p>"
  },
  "representations": [
    {
      "nom": "PDF",
      "typeMime": {
        "type": "application",
        "subType": "PDF"
      },
      "statutRepresentation": {
        "verbatim": true,
        "canonique": true,
        "officielle": true,
        "transcription": false,
        "enregistrement": false
      },
      "contenu": {
        "documentURI": "/15/amendements/1255A/CION_FIN/CF1422.pdf"
      }
    }
  ],
  "sort": {
    "dateSaisie": "2018-10-11T23:37:09.000+02:00",
    "sortEnSeance": "Retiré"
  },
  "dateDepot": "2018-10-05T02:00:00.000+02:00",
  "dateDistribution": "2018-10-08T02:00:00.000+02:00",
  "article99": "0",
  "loiReference": {
    "codeLoi": "commerce"
  }
}