{
  "uid": "AMANR5L15PO420120B1297P0D1N588",
  "identifiant": {
    "legislature": "15",
    "numero": "588",
    "numRect": "0",
    "saisine": {
      "texteLegislatifRef": "PRJLANR5L15B1297",
      "numeroPartiePLF": "0",
      "organeExamen": "PO420120",
      "mentionSecondeDeliberation": "0"
    }
  },
  "numeroLong": "AS588",
  "etapeTexte": "1ère lecture (1ère assemblée saisie)",
  "triAmendement": "bdaaaaaaaaaaaaaaaaaaaaaaaaaaaaaaaaaaaaaaaaaaaaaaaal",
  "cardinaliteAmdtMultiples": "1",
  "etat": "Discuté",
  "signataires": {
    "auteur": {
      "typeAuteur": "Depute",
      "acteurRef": "PA342415",
      "groupePolitiqueRef": "PO758835"
    },
    "cosignatairesRefs": [
      "PA605069",
      "PA342415",
      "PA1008"
    ],
    "texteAffichable": "Mme&#160;Battistel,  M.&#160;Jean-Louis&#160;Bricout et M.&#160;Alain&#160;David"
  },
  "pointeurFragmentTexte": {
    "division": {
      "titre": "Article 10",
      "articleDesignationCourte": "APRÈS ART. 10",
      "type": "ARTICLE",
      "avantAApres": "Apres",
      "divisionRattachee": "APRÈS L'ARTICLE 10, insérer l'article suivant:",
      "articleAdditionnel": "1",
      "urlDivisionTexteVise": "/15/textes/1297.asp#D_Article_10"
    }
  },
  "corps": {
    "dispositif": "<p style=\"text-align: justify;\">I.&#160;&#8211;&#160;L&#8217;avant-derni&#232;re phrase de l&#8217;avant-dernier alin&#233;a de l&#8217;article L.&#160;642&#8209;1 du code de la s&#233;curit&#233; sociale est supprim&#233;e.</p><p style=\"text-align: justify;\">II.&#160;&#8211;&#160;La perte de recettes pour les organismes de s&#233;curit&#233; sociale est compens&#233;e &#224; due concurrence par la majoration des droits mentionn&#233;s aux articles 575 et 575 A du code g&#233;n&#233;ral des imp&#244;ts.</p>",
    "exposeSommaire": "<p>Cet amendement a pour objectif d&#8217;enrayer la situation d&#8217;iniquit&#233; dans laquelle se trouvent les professionnels lib&#233;raux pluriactifs et de revenir sur le principe de la cotisation forfaitaire minimale pour appliquer une cotisation proportionnelle au premier euro.</p><p>En effet, depuis l&#8217;entr&#233;e en vigueur de la loi de financement de la s&#233;curit&#233; sociale de 2016, ces professionnels, et particuli&#232;rement ceux exer&#231;ant une activit&#233; saisonni&#232;re, ont subi une augmentation tr&#232;s significative de leur cotisation d&#8217;assurance vieillesse alors m&#234;me que nombre d&#8217;entre eux ne d&#233;gagent que peu de b&#233;n&#233;fice sur leur activit&#233; temporaire.</p><p>A titre d&#8217;exemple, on peut citer le secteur du tourisme de montagne particuli&#232;rement touch&#233; par cette mesure, et plus sp&#233;cifiquement les moniteurs de ski. En effet, ceux-ci doivent obligatoirement &#234;tre affili&#233;s &#224; la Caisse interprofessionnelles de pr&#233;voyance et d&#8217;assurance vieillesse (CIPAV), qu&#8217;ils exercent cette activit&#233; &#224; plein temps ou juste quelques mois dans l&#8217;ann&#233;e. Pour les moniteurs de ski qui n&#8217;exercent cette activit&#233; qu&#8217;&#224; titre saisonnier, cette cotisation repr&#233;sente un co&#251;t non n&#233;gligeable, alors m&#234;me qu&#8217;ils cotisent d&#233;j&#224; par ailleurs &#224; un autre r&#233;gime de retraite, dans le cadre de leur activit&#233; professionnelle principale. De fait, le co&#251;t de cette double affiliation n&#8217;est pas sans cons&#233;quence sur le vivier de moniteurs de ski potentiellement int&#233;ress&#233;s, certains n&#8217;ayant pas les moyens financiers de supporter cette d&#233;pense et pr&#233;f&#233;rant d&#232;s lors se restreindre &#224; leur activit&#233; professionnelle principale et ne pas exercer leur monitorat. Pourtant, le renfort de ces moniteurs de ski saisonniers est indispensable, d&#8217;une part pour absorber les flux touristiques certains mois de<br />l&#8217;ann&#233;e, et d&#8217;autre part pour la souplesse d&#8217;emploi temporaire qu&#8217;ils offrent, utiles quand la demande baisse puisqu&#8217;ils peuvent reprendre leur activit&#233; principale.</p>"
  },
  "representations": [
    {
      "nom": "PDF",
      "typeMime": {
        "type": "application",
        "subType": "PDF"
      },
      "statutRepresentation": {
        "verbatim": true,
        "canonique": true,
        "officielle": true,
        "transcription": false,
        "enregistrement": false
      },
      "contenu": {
        "documentURI": "/15/amendements/1297/CION-SOC/AS588.pdf"
      }
    }
  ],
  "sort": {
    "dateSaisie": "2018-10-16T19:06:06.000+02:00",
    "sortEnSeance": "Rejeté"
  },
  "dateDepot": "2018-10-12T02:00:00.000+02:00",
  "dateDistribution": "2018-10-15T02:00:00.000+02:00",
  "article99": "0",
  "loiReference": {
    "codeLoi": "sécurité sociale",
    "divisionCodeLoi": "L642-1"
  }
}