{
  "uid": "AMANR5L15SEA717460BTC1019P0D1N1429",
  "identifiant": {
    "legislature": "15",
    "numero": "1429",
    "numRect": "0",
    "saisine": {
      "texteLegislatifRef": "PRJLANR5L15BTC1019",
      "numeroPartiePLF": "0",
      "organeExamen": "PO717460",
      "mentionSecondeDeliberation": "0"
    }
  },
  "numeroLong": "1429",
  "etapeTexte": "1ère lecture (1ère assemblée saisie)",
  "triAmendement": "kdzx",
  "cardinaliteAmdtMultiples": "1",
  "etat": "Discuté",
  "signataires": {
    "auteur": {
      "typeAuteur": "Depute",
      "acteurRef": "PA713448",
      "groupePolitiqueRef": "PO730934"
    },
    "cosignatairesRefs": [
      "PA713448"
    ],
    "texteAffichable": "Mme&#160;Brenier"
  },
  "pointeurFragmentTexte": {
    "division": {
      "titre": "Article 10",
      "articleDesignationCourte": "ART. 10",
      "type": "ARTICLE",
      "avantAApres": "A",
      "divisionRattachee": "ARTICLE 10",
      "urlDivisionTexteVise": "/15/textes/1019.asp#D_Article_10"
    },
    "alinea": {
      "numero": "5"
    }
  },
  "corps": {
    "dispositif": "<p style=\"text-align: justify;\">Supprimer l&#8217;alin&#233;a&#160;5.</p>",
    "exposeSommaire": "<p style=\"text-align: justify;\">Amendement de coh&#233;rence avec la r&#233;introduction, &#224; l&#8217;article&#160;3 du projet de loi, du conseil en &#233;volution professionnelle au sein du service public r&#233;gional de l&#8217;orientation.</p>"
  },
  "representations": [
    {
      "nom": "PDF",
      "typeMime": {
        "type": "application",
        "subType": "PDF"
      },
      "statutRepresentation": {
        "verbatim": true,
        "canonique": true,
        "officielle": true,
        "transcription": false,
        "enregistrement": false
      },
      "contenu": {
        "documentURI": "/15/amendements/1019/AN/1429.pdf"
      }
    }
  ],
  "seanceDiscussion": "RUANR5L15S2018IDS21103",
  "sort": {
    "dateSaisie": "2018-06-14T22:33:42.000+02:00",
    "sortEnSeance": "Non soutenu"
  },
  "dateDepot": "2018-06-07T02:00:00.000+02:00",
  "dateDistribution": "2018-06-11T02:00:00.000+02:00",
  "article99": "0",
  "loiReference": {}
}