{
  "uid": "AMANR5L15PO766718B2187P0D1N1145",
  "identifiant": {
    "legislature": "15",
    "numero": "1145",
    "numRect": "0",
    "saisine": {
      "texteLegislatifRef": "PRJLANR5L15B2187",
      "numeroPartiePLF": "0",
      "organeExamen": "PO766718",
      "mentionSecondeDeliberation": "0"
    }
  },
  "numeroLong": "1145",
  "etapeTexte": "1ère lecture (1ère assemblée saisie)",
  "triAmendement": "acaaaaaaaaaaaaaaaaaaaaaaaaaaaaaaaaaaaaaaaaaaaaaaaaxsaw",
  "cardinaliteAmdtMultiples": "1",
  "etat": "Discuté",
  "signataires": {
    "auteur": {
      "typeAuteur": "Depute",
      "acteurRef": "PA720644",
      "groupePolitiqueRef": "PO730934"
    },
    "cosignatairesRefs": [
      "PA2377",
      "PA767",
      "PA709315",
      "PA720644",
      "PA719318"
    ],
    "texteAffichable": "M.&#160;Nury,  Mme&#160;Anthoine, M.&#160;Cattin, M.&#160;Perrut et M.&#160;Viala"
  },
  "pointeurFragmentTexte": {
    "division": {
      "titre": "Article PREMIER",
      "articleDesignationCourte": "ART. PREMIER",
      "type": "ARTICLE",
      "avantAApres": "A",
      "divisionRattachee": "ARTICLE PREMIER",
      "urlDivisionTexteVise": "/15/textes/2187.asp#D_Article_1er"
    },
    "alinea": {
      "avantAApres": "A",
      "numero": "10",
      "alineaDesignation": "Alinéa 10"
    }
  },
  "corps": {
    "dispositif": "<p style=\"text-align: justify;\">&#192; l&#8217;alin&#233;a&#160;10, supprimer les mots&#160;:</p><p style=\"text-align: justify;\">&#171;&#160;ou une femme non mari&#233;e&#160;&#187;.</p>",
    "exposeSommaire": "<p style=\"text-align: justify;\">Cet amendement vise &#224; supprimer toutes les parties du textes qui ouvrent la possibilit&#233; aux couples de femmes ou aux femmes seules d&#8217;avoir recours &#224; la procr&#233;ation m&#233;dicalement assist&#233;e.<br />&#160;<br />Ces mesures reviennent &#224; consacrer a priori la naissance d&#8217;enfants sans p&#232;res &#224; une &#233;poque o&#249; les p&#232;res investissent davantage la paternit&#233; que les soci&#233;t&#233;s ant&#233;rieures. Elles risqueraient de troubler ce progr&#232;s social en &#233;dictant une loi dans laquelle les p&#232;res deviennent facultatifs.<br />De m&#234;me, existe un risque de r&#233;introduire un fort clivage entre les hommes et les femmes en prenant le parti d&#8217;un sexisme renvers&#233;.<br />&#160;<br />Ce texte prive non seulement l&#8217;enfant d&#8217;une figure paternelle n&#233;cessaire &#224; son bon d&#233;veloppement mais il le prive &#233;galement d&#8217;une partie de ses origines biologiques. Choses dont l&#8217;enfant a ind&#233;niablement besoin pour son &#233;panouissement.<br />&#160;<br />Concernant l&#8217;ouverture de la procr&#233;ation m&#233;dicalement assist&#233;e aux femmes seules, le risque majeur est celui de l&#8217;ins&#233;curit&#233; qui en r&#233;sulte pour l&#8217;enfant. Le CCNE indiquait en 2017&#160;: &#171;&#160;Alors que la soci&#233;t&#233; consid&#232;re que l&#8217;absence de p&#232;re est un pr&#233;judice qu&#8217;elle tente, dans certaines circonstances, de pallier, au moins financi&#232;rement, et alors que l&#8217;on s&#8217;inqui&#232;te de l&#8217;augmentation du nombre de familles monoparentales, il para&#238;t paradoxal d&#8217;institutionnaliser, d&#8217;organiser en toute connaissance de cause des naissances sans p&#232;re.&#160;&#187;.<br />L&#8217;exp&#233;rience montre qu&#8217;une personne a beaucoup plus de mal &#224; &#233;duquer ses enfants lorsqu&#8217;elle est seule, en raison des al&#233;as de la vie, du ch&#244;mage.<br />&#160;<br />L&#8217;ouverture de cette proc&#233;dure fait courir un risque suppl&#233;mentaire et injustifi&#233; &#224; l&#8217;enfant. C&#8217;est pourquoi cet amendement pr&#233;voit de la supprimer.</p>"
  },
  "representations": [
    {
      "nom": "PDF",
      "typeMime": {
        "type": "application",
        "subType": "PDF"
      },
      "statutRepresentation": {
        "verbatim": true,
        "canonique": true,
        "officielle": true,
        "transcription": false,
        "enregistrement": false
      },
      "contenu": {
        "documentURI": "/15/amendements/2187/CSBIOETH/1145.pdf"
      }
    }
  ],
  "sort": {
    "dateSaisie": "2019-09-11T15:58:05.000+02:00",
    "sortEnSeance": "Rejeté"
  },
  "dateDepot": "2019-09-05T02:00:00.000+02:00",
  "dateDistribution": "2019-09-09T02:00:00.000+02:00",
  "article99": "0",
  "loiReference": {}
}