{
  "uid": "AMANR5L15SEA717460BTC1237P0D1N789",
  "identifiant": {
    "legislature": "15",
    "numero": "789",
    "numRect": "0",
    "saisine": {
      "texteLegislatifRef": "PRJLANR5L15BTC1237",
      "numeroPartiePLF": "0",
      "organeExamen": "PO717460",
      "mentionSecondeDeliberation": "1"
    }
  },
  "numeroLong": "789",
  "etapeTexte": "1ère lecture (1ère assemblée saisie)",
  "triAmendement": "taaaaaaaaaaaaaaaaaaaaaaaaaaaaaaaaaaaaaaaaaaaaaaaaage",
  "cardinaliteAmdtMultiples": "1",
  "etat": "Discuté",
  "signataires": {
    "auteur": {
      "typeAuteur": "Depute",
      "acteurRef": "PA721286",
      "groupePolitiqueRef": "PO730934"
    },
    "cosignatairesRefs": [
      "PA605991",
      "PA1874",
      "PA721070",
      "PA718884",
      "PA642847",
      "PA709315",
      "PA718838",
      "PA346054",
      "PA718850",
      "PA721046",
      "PA718784",
      "PA720210",
      "PA721286",
      "PA721054",
      "PA608416",
      "PA721506",
      "PA720630",
      "PA334149",
      "PA643134",
      "PA605036",
      "PA346218",
      "PA643089",
      "PA267204",
      "PA608016",
      "PA767"
    ],
    "texteAffichable": "M.&#160;Ramadier,  Mme&#160;Genevard, M.&#160;Bazin, M.&#160;Le Fur, M.&#160;Thi&#233;riot, M.&#160;Lorion, M.&#160;Hetzel, Mme&#160;Louwagie, M.&#160;Sermier, M.&#160;Brun, Mme&#160;Valentin, M.&#160;Masson, M.&#160;Viala, Mme&#160;Bassire, M.&#160;Emmanuel&#160;Maquet, Mme&#160;Ramassamy, Mme&#160;Bazin-Malgras, M.&#160;Cattin, M.&#160;Cordier, Mme&#160;Kuster, M.&#160;Pauget, M.&#160;Minot, Mme&#160;Beauvais, M.&#160;Abad et M.&#160;Fasquelle"
  },
  "pointeurFragmentTexte": {
    "division": {
      "titre": "Article 73",
      "articleDesignationCourte": "APRÈS ART. 73",
      "type": "ARTICLE",
      "avantAApres": "Apres",
      "divisionRattachee": "APRÈS L'ARTICLE 73, insérer l'article suivant:",
      "articleAdditionnel": "1",
      "urlDivisionTexteVise": "/15/textes/1237.asp#D_Article_73"
    }
  },
  "corps": {
    "dispositif": "<p style=\"text-align: justify;\">Le Gouvernement remet au Parlement, dans un d&#233;lai de douze mois &#224; compter de la promulgation de la pr&#233;sente loi, un rapport d&#8217;&#233;valuation faisant le bilan de l'application de la loi n&#176;&#160;2006-340 du 23 mars 2006 relative &#224; l'&#233;galit&#233; salariale entre les femmes et les hommes.</p><p style=\"text-align: justify;\">Ce rapport dresse le bilan de la mise en &#339;uvre du dispositif pr&#233;vu &#224; l'article L.&#160;1225-44 du code du travail, pr&#233;voyant qu'en l'absence d'accord collectif de branche ou d'entreprise d&#233;terminant des garanties d'&#233;volution de la r&#233;mun&#233;ration des salari&#233;s, pendant le cong&#233; d'adoption et &#224; la suite de ce cong&#233;, au moins aussi favorables que celles mentionn&#233;es dans le pr&#233;sent article, cette r&#233;mun&#233;ration soit major&#233;e, &#224; la suite de ce cong&#233;, des augmentations g&#233;n&#233;rales ainsi que de la moyenne des augmentations individuelles per&#231;ues pendant la dur&#233;e de ce cong&#233; par les salari&#233;s relevant de la m&#234;me cat&#233;gorie professionnelle ou, &#224; d&#233;faut, de la moyenne des augmentations individuelles dans l'entreprise.</p>",
    "exposeSommaire": "<p style=\"text-align: justify;\">Le cong&#233; de maternit&#233; (ou le cong&#233; d&#8217;adoption) se traduit souvent par un point de rupture dans le d&#233;roulement de la carri&#232;re des femmes en termes d&#8217;&#233;volution professionnelle, et notamment d&#8217;&#233;volutions salariales. Afin de rem&#233;dier &#224; cette situation, une garantie de &#171;&#160;rattrapage salarial&#160;&#187; est pr&#233;vue au profit des salari&#233;(e)s en cong&#233; de maternit&#233; (ou d&#8217;adoption), selon des r&#232;gles diff&#233;rentes selon qu&#8217;il existe, ou non, un accord collectif pr&#233;voyant de telles garanties.</p><p style=\"text-align: justify;\">Or, nous ne disposons pas aujourd&#8217;hui d&#8217;&#233;l&#233;ments statistiques clairs permettant d&#8217;&#233;valuer la pertinence et les effets de ce dispositif issu de la loi du 23 mars 2006. <br /><br />Cet amendement propose d&#8217;y rem&#233;dier en proposant au Gouvernement de remettre un rapport au Parlement &#233;valuant et l&#8217;effet et le degr&#233; d&#8217;application de cette loi, et ce afin que les femmes d&#233;sireuses d&#8217;avoir un enfant ne se sentent p&#233;nalis&#233;es sur le plan professionnel. Il en va de leur &#233;panouissement personnel et du soutien que notre soci&#233;t&#233; entend continuer d&#8217;apporter aux familles.</p>"
  },
  "representations": [
    {
      "nom": "PDF",
      "typeMime": {
        "type": "application",
        "subType": "PDF"
      },
      "statutRepresentation": {
        "verbatim": true,
        "canonique": true,
        "officielle": true,
        "transcription": false,
        "enregistrement": false
      },
      "contenu": {
        "documentURI": "/15/amendements/1237/AN/789.pdf"
      }
    }
  ],
  "seanceDiscussion": "RUANR5L15S2019IDS21349",
  "sort": {
    "dateSaisie": "2018-10-05T18:33:11.000+02:00",
    "sortEnSeance": "Non soutenu"
  },
  "dateDepot": "2018-09-19T02:00:00.000+02:00",
  "dateDistribution": "2018-09-27T02:00:00.000+02:00",
  "article99": "0",
  "loiReference": {}
}