{
  "uid": "AMANR5L15SEA717460BTC2401P0D1N1269",
  "identifiant": {
    "legislature": "15",
    "numero": "1269",
    "numRect": "0",
    "saisine": {
      "texteLegislatifRef": "PRJLANR5L15BTC2401",
      "numeroPartiePLF": "0",
      "organeExamen": "PO717460",
      "mentionSecondeDeliberation": "0"
    }
  },
  "numeroLong": "1269",
  "etapeTexte": "1ère lecture (2ème assemblée saisie)",
  "triAmendement": "aaoaaaaaaaaaaaaaaaaaaaaaaaaaaaaaaaaaaaaaaaaaaaaaaadjoc",
  "cardinaliteAmdtMultiples": "1",
  "etat": "Discuté",
  "signataires": {
    "auteur": {
      "typeAuteur": "Depute",
      "acteurRef": "PA719942",
      "groupePolitiqueRef": "PO730970"
    },
    "cosignatairesRefs": [
      "PA720326",
      "PA720178",
      "PA719266",
      "PA721984",
      "PA721234",
      "PA722284",
      "PA721996",
      "PA1276",
      "PA720720",
      "PA719918",
      "PA721742",
      "PA721418",
      "PA719504",
      "PA722162",
      "PA722374",
      "PA721836",
      "PA720704",
      "PA720968",
      "PA721976",
      "PA720772",
      "PA721182",
      "PA720976",
      "PA719874",
      "PA719942",
      "PA721530",
      "PA721924",
      "PA720334",
      "PA719558",
      "PA720746",
      "PA719640",
      "PA720764",
      "PA718978",
      "PA719044",
      "PA720002",
      "PA719210",
      "PA720092",
      "PA721608",
      "PA720652",
      "PA720728",
      "PA717151",
      "PA719488",
      "PA720598",
      "PA720256",
      "PA720924",
      "PA721734",
      "PA720162"
    ],
    "texteAffichable": "M.&#160;Baudu,  M.&#160;Bru, M.&#160;Balanant, Mme&#160;Florennes, Mme&#160;Jacquier-Laforge, M.&#160;Latombe, Mme&#160;Vichnievsky, Mme&#160;Bannier, M.&#160;Barrot, Mme&#160;Benin, M.&#160;Berta, M.&#160;Bolo, M.&#160;Bourlanges, M.&#160;Cubertafon, Mme&#160;de Sarnez, Mme&#160;de Vaucouleurs, Mme&#160;Deprez-Audebert, M.&#160;Duverg&#233;, Mme&#160;El Ha&#239;ry, Mme&#160;Elimas, Mme&#160;Essayan, M.&#160;Fanget, M.&#160;Fuchs, M.&#160;Garcia, M.&#160;Hammouche, M.&#160;Isaac-Sibille, M.&#160;Joncour, M.&#160;Lagleize, M.&#160;Lain&#233;, M.&#160;Laqhila, Mme&#160;Lasserre, M.&#160;Loiseau, Mme&#160;Luquet, M.&#160;Mathiasin, M.&#160;Mattei, Mme&#160;Mette, M.&#160;Michel-Kleisbauer, M.&#160;Mignola, M.&#160;Millienne, M.&#160;Pahun, M.&#160;Fr&#233;d&#233;ric&#160;Petit, Mme&#160;Maud&#160;Petit, Mme&#160;Poueyto, M.&#160;Ramos, M.&#160;Turquois et M.&#160;Waserman"
  },
  "pointeurFragmentTexte": {
    "division": {
      "titre": "Article PREMIER",
      "articleDesignationCourte": "ART. PREMIER",
      "type": "ARTICLE",
      "avantAApres": "A",
      "divisionRattachee": "ARTICLE PREMIER",
      "urlDivisionTexteVise": "/15/textes/2401.asp#D_Article_1er"
    },
    "alinea": {
      "avantAApres": "Apres",
      "numero": "9"
    }
  },
  "corps": {
    "dispositif": "<p style=\"text-align: justify;\">Apr&#232;s l&#8217;alin&#233;a&#160;9, ins&#233;rer l&#8217;alin&#233;a suivant&#160;:</p><p style=\"text-align: justify;\">&#171;&#160;Le pacte peut d&#233;finir les conditions dans lesquelles l&#8217;&#233;tablissement public de coop&#233;ration intercommunale &#224; fiscalit&#233; propre peut, par convention, d&#233;l&#233;guer l&#8217;exercice de tout ou partie d&#8217;une comp&#233;tence relevant de ses attributions &#224; une ou plusieurs de ses communes membres. La convention r&#233;pond aux m&#234;mes exigences que celles pr&#233;vues &#224; l&#8217;article L.&#160;1111&#8209;8&#160;;&#160;&#187;</p>",
    "exposeSommaire": "<p style=\"text-align: justify;\">L&#8217;article L1111&#8209;8 du Code G&#233;n&#233;ral des Collectivit&#233;s Territoriales permet aujourd&#8217;hui &#224; une collectivit&#233; territoriale de d&#233;l&#233;guer une comp&#233;tence dont elle est attributaire, soit &#224; une collectivit&#233; territoriale d&#8217;une autre cat&#233;gorie, soit &#224; un EPCI.</p><p style=\"text-align: justify;\">En outre, en vertu de l&#8217;article L5210&#8209;4 du m&#234;me code, les d&#233;l&#233;gations de tout ou partie d&#8217;une comp&#233;tence sont &#233;galement possible d&#8217;une R&#233;gion ou d&#8217;un D&#233;partement vers un EPCI d&#232;s lors que les statuts l&#8217;autorisent.</p><p style=\"text-align: justify;\">Le pr&#233;sent amendement vise &#224; rendre possible ce type de d&#233;l&#233;gation pour un EPCI en direction de l&#8217;une ou plusieurs de ses communes membres, pour tout ou partie de ses comp&#233;tences.</p><p style=\"text-align: justify;\">Cette souplesse d&#8217;organisation ne porte pas atteinte &#224; la coh&#233;rence du projet intercommunal puisque l&#8217;EPCI reste attributaire de la comp&#233;tence sur l&#8217;ensemble de son territoire&#160;; elle conserve donc la d&#233;finition du projet politique et fixe les objectifs associ&#233;s.</p><p style=\"text-align: justify;\">N&#233;anmoins, le syst&#232;me de d&#233;l&#233;gation permet, pour une comp&#233;tence donn&#233;e, de prendre en compte des sp&#233;cificit&#233;s territoriales susceptibles de justifier l&#8217;exercice concret de la comp&#233;tence par l&#8217;une ou plusieurs de ses communes, dans le cadre s&#233;curisant d&#8217;une convention.</p><p style=\"text-align: justify;\">Il s&#8217;agit donc d&#8217;une mesure de diff&#233;renciation dans la mise en &#339;uvre de comp&#233;tences communautaires doublement s&#233;curis&#233;e par l&#8217;&#233;laboration obligatoire d&#8217;une convention au sens de l&#8217;article L1111&#8209;8 et par le cadre du pacte de gouvernance qui permettra de d&#233;battre de l&#8217;opportunit&#233; de telles d&#233;l&#233;gations.</p>"
  },
  "representations": [
    {
      "nom": "PDF",
      "typeMime": {
        "type": "application",
        "subType": "PDF"
      },
      "statutRepresentation": {
        "verbatim": true,
        "canonique": true,
        "officielle": true,
        "transcription": false,
        "enregistrement": false
      },
      "contenu": {
        "documentURI": "/15/amendements/2401/AN/1269.pdf"
      }
    }
  ],
  "seanceDiscussion": "RUANR5L15S2020IDS21946",
  "sort": {
    "dateSaisie": "2019-11-18T19:50:25.000+01:00",
    "sortEnSeance": "Rejeté"
  },
  "dateDepot": "2019-11-14T01:00:00.000+01:00",
  "dateDistribution": "2019-11-17T01:00:00.000+01:00",
  "article99": "0",
  "loiReference": {}
}