{
  "uid": "AMANR5L15PO420120B1681P0D1N646",
  "identifiant": {
    "legislature": "15",
    "numero": "646",
    "numRect": "0",
    "saisine": {
      "texteLegislatifRef": "PRJLANR5L15B1681",
      "numeroPartiePLF": "0",
      "organeExamen": "PO420120",
      "mentionSecondeDeliberation": "0"
    }
  },
  "numeroLong": "AS646",
  "etapeTexte": "1ère lecture (1ère assemblée saisie)",
  "triAmendement": "adaaaaaaaaaaaaaaaaaaaaaaaaaaaaaaaaaaaaaaaaaaaaaaaakkkkzwo",
  "cardinaliteAmdtMultiples": "1",
  "etat": "Discuté",
  "signataires": {
    "auteur": {
      "typeAuteur": "Depute",
      "acteurRef": "PA720968",
      "groupePolitiqueRef": "PO730970"
    },
    "cosignatairesRefs": [
      "PA719558",
      "PA721734",
      "PA720968",
      "PA719488",
      "PA721976",
      "PA720772",
      "PA720746",
      "PA720728",
      "PA720976",
      "PA720256",
      "PA720162",
      "PA720326",
      "PA721182",
      "PA720334",
      "PA719044",
      "PA721742",
      "PA720598",
      "PA719504",
      "PA719874",
      "PA720178",
      "PA721992",
      "PA719942",
      "PA720652",
      "PA721924",
      "PA719266",
      "PA720764",
      "PA720704",
      "PA718978",
      "PA719210",
      "PA719640",
      "PA720002",
      "PA721530",
      "PA721234",
      "PA721418",
      "PA722374",
      "PA1276",
      "PA722284",
      "PA720092",
      "PA719918",
      "PA720924",
      "PA721608",
      "PA721984",
      "PA720720",
      "PA717151",
      "PA722162",
      "PA721836"
    ],
    "texteAffichable": "Mme&#160;Benin,  M.&#160;Isaac-Sibille, Mme&#160;de Vaucouleurs, Mme&#160;Elimas, M.&#160;Hammouche, M.&#160;Mignola, M.&#160;Balanant, Mme&#160;Bannier, M.&#160;Barrot, M.&#160;Baudu, M.&#160;Berta, M.&#160;Bolo, M.&#160;Bourlanges, M.&#160;Bru, M.&#160;Cubertafon, Mme&#160;de Sarnez, Mme&#160;Deprez-Audebert, M.&#160;Duverg&#233;, Mme&#160;El Ha&#239;ry, Mme&#160;Essayan, M.&#160;Fanget, Mme&#160;Florennes, M.&#160;Fuchs, Mme&#160;Gallerneau, M.&#160;Garcia, Mme&#160;Jacquier-Laforge, M.&#160;Joncour, M.&#160;Lagleize, M.&#160;Lain&#233;, M.&#160;Laqhila, Mme&#160;Lasserre-David, M.&#160;Latombe, Mme&#160;Luquet, M.&#160;Mathiasin, M.&#160;Mattei, Mme&#160;Mette, M.&#160;Michel-Kleisbauer, M.&#160;Millienne, M.&#160;Pahun, M.&#160;Fr&#233;d&#233;ric&#160;Petit, Mme&#160;Maud&#160;Petit, Mme&#160;Poueyto, M.&#160;Ramos, M.&#160;Turquois, Mme&#160;Vichnievsky et M.&#160;Waserman"
  },
  "pointeurFragmentTexte": {
    "division": {
      "titre": "Article PREMIER",
      "articleDesignationCourte": "ART. PREMIER",
      "type": "ARTICLE",
      "avantAApres": "A",
      "divisionRattachee": "ARTICLE PREMIER",
      "urlDivisionTexteVise": "/15/textes/1681.asp#D_Article_1er"
    },
    "alinea": {
      "avantAApres": "A",
      "numero": "3",
      "alineaDesignation": "Alinéa 3"
    }
  },
  "corps": {
    "dispositif": "<p style=\"text-align: justify;\">&#192; la derni&#232;re phrase de l&#8217;alin&#233;a&#160;3, apr&#232;s le mot&#160;:</p><p style=\"text-align: justify;\">&#171;&#160;soins&#160;&#187;, </p><p style=\"text-align: justify;\">ins&#233;rer les mots&#160;:</p><p style=\"text-align: justify;\">&#171;&#160;notamment dans les territoires p&#233;riurbains, ruraux et ultramarins,&#160;&#187;.</p>",
    "exposeSommaire": "<p style=\"text-align: justify;\">Cet amendement vise &#224; r&#233;affirmer la n&#233;cessit&#233; de tenir compte des in&#233;galit&#233;s d&#8217;acc&#232;s aux soins dans les territoires isol&#233;s, que sont les zones rurales, certaines zones urbaines p&#233;riph&#233;riques, ainsi que les territoires d&#8217;outre-mer.&#160; Ces espaces - qui souffrent au demeurant de probl&#232;mes d&#8217;acc&#232;s aux services publics ainsi que de difficult&#233;s li&#233;es &#224; l&#8217;embauche locale et &#224; l&#8217;activit&#233; &#233;conomique - sont souvent ceux qui sont les plus marqu&#233;s par les probl&#232;mes de sant&#233; publique et de couverture sanitaire.&#160;</p><p style=\"text-align: justify;\">A titre d&#8217;exemple, les outre-mer sont davantage caract&#233;ris&#233;es par les maladies chroniques, la mortalit&#233; infantile, et une esp&#233;rance de vie inf&#233;rieure &#224; celle de la France hexagonale. Elles souffrent par ailleurs d&#8217;une faible couverture en professionnels et en &#233;tablissements de sant&#233;, r&#233;sultant&#160;notamment de carences organisationnelles et d&#8217;infrastructures.&#160;</p><p style=\"text-align: justify;\">Il est donc essentiel que l&#8217;&#201;tat tienne compte des&#160;sp&#233;cificit&#233;s et des probl&#232;mes rencontr&#233;s par ces territoires dans la fixation des objectifs pluriannuels de capacit&#233; d&#8217;accueil des formations aux m&#233;tiers de la sant&#233;.&#160;</p>"
  },
  "representations": [
    {
      "nom": "PDF",
      "typeMime": {
        "type": "application",
        "subType": "PDF"
      },
      "statutRepresentation": {
        "verbatim": true,
        "canonique": true,
        "officielle": true,
        "transcription": false,
        "enregistrement": false
      },
      "contenu": {
        "documentURI": "/15/amendements/1681/CION-SOC/AS646.pdf"
      }
    }
  ],
  "sort": {
    "dateSaisie": "2019-03-12T17:20:02.000+01:00",
    "sortEnSeance": "Adopté"
  },
  "dateDepot": "2019-03-08T01:00:00.000+01:00",
  "dateDistribution": "2019-03-12T01:00:00.000+01:00",
  "article99": "0",
  "loiReference": {}
}