{
  "uid": "AMANR5L15PO419865B1402P0D1N73",
  "identifiant": {
    "legislature": "15",
    "numero": "73",
    "numRect": "0",
    "saisine": {
      "texteLegislatifRef": "PRJLANR5L15B1402",
      "numeroPartiePLF": "0",
      "organeExamen": "PO419865",
      "mentionSecondeDeliberation": "0"
    }
  },
  "numeroLong": "CD73",
  "etapeTexte": "1ère lecture (1ère assemblée saisie)",
  "triAmendement": "aiaaaaaaaaaaaaaaaaaaaaaaaaaaaaaaaaaaaaaaaaaaaaaaaabzzwi",
  "cardinaliteAmdtMultiples": "1",
  "etat": "Discuté",
  "signataires": {
    "auteur": {
      "typeAuteur": "Depute",
      "acteurRef": "PA333285",
      "groupePolitiqueRef": "PO758835"
    },
    "cosignatairesRefs": [
      "PA333285",
      "PA643145",
      "PA267233"
    ],
    "texteAffichable": "M.&#160;Garot,  M.&#160;Bouillon et Mme&#160;Vainqueur-Christophe"
  },
  "pointeurFragmentTexte": {
    "division": {
      "titre": "Article PREMIER",
      "articleDesignationCourte": "ART. PREMIER",
      "type": "ARTICLE",
      "avantAApres": "A",
      "divisionRattachee": "ARTICLE PREMIER",
      "urlDivisionTexteVise": "/15/textes/1402.asp#D_Article_1er"
    },
    "alinea": {
      "avantAApres": "Apres",
      "numero": "10"
    }
  },
  "corps": {
    "dispositif": "<p style=\"text-align: justify;\">Apr&#232;s l&#8217;alin&#233;a&#160;10, ins&#233;rer l&#8217;alin&#233;a suivant&#160;:</p><p style=\"text-align: justify;\">&#171;&#160;4&#176;&#160;<i>bis</i> Soutien financier aux projets en faveur de la biodiversit&#233; ;&#160;&#187;.</p>",
    "exposeSommaire": "<p style=\"text-align: justify;\">Parmi les missions de l&#8217;actuelle Agence Fran&#231;aise pour la Biodiversit&#233; figure le soutien financier aux projets en faveur de la biodiversit&#233; (recherche, r&#233;duction des pesticides, etc).</p><p style=\"text-align: justify;\">Cet amendement vise donc &#224; faire figurer cette mission parmi les missions du nouvel &#233;tablissement AFB-ONCFS.</p><p style=\"text-align: justify;\">Cet amendement fait suite &#224; l&#8217;audition par la Commission du D&#233;veloppement durable et de l&#8217;Am&#233;nagement du territoire, des associations de protection de la nature.</p>"
  },
  "representations": [
    {
      "nom": "PDF",
      "typeMime": {
        "type": "application",
        "subType": "PDF"
      },
      "statutRepresentation": {
        "verbatim": true,
        "canonique": true,
        "officielle": true,
        "transcription": false,
        "enregistrement": false
      },
      "contenu": {
        "documentURI": "/15/amendements/1402/CION-DVP/CD73.pdf"
      }
    }
  ],
  "sort": {
    "dateSaisie": "2018-12-05T00:01:39.000+01:00",
    "sortEnSeance": "Non soutenu"
  },
  "dateDepot": "2018-11-29T01:00:00.000+01:00",
  "dateDistribution": "2018-12-04T01:00:00.000+01:00",
  "article99": "0",
  "loiReference": {}
}