{
  "uid": "AMANR5L15PO59048B0384P0D1N111",
  "identifiant": {
    "legislature": "15",
    "numero": "111",
    "numRect": "0",
    "saisine": {
      "texteLegislatifRef": "PRJLANR5L15B0384",
      "numeroPartiePLF": "0",
      "organeExamen": "PO59048",
      "mentionSecondeDeliberation": "0"
    }
  },
  "numeroLong": "CF111",
  "etapeTexte": "1ère lecture (1ère assemblée saisie)",
  "triAmendement": "n",
  "cardinaliteAmdtMultiples": "1",
  "etat": "Retiré",
  "signataires": {
    "auteur": {
      "typeAuteur": "Depute",
      "acteurRef": "PA267901",
      "groupePolitiqueRef": "PO730934"
    },
    "cosignatairesRefs": [
      "PA721046",
      "PA610681",
      "PA610733",
      "PA721054",
      "PA693008",
      "PA724827",
      "PA721070",
      "PA720960",
      "PA267901"
    ],
    "texteAffichable": "M.&#160;Kamardine,  M.&#160;Serva, Mme&#160;Ali, Mme&#160;Bareigts, Mme&#160;Bassire, M.&#160;Lorion, M.&#160;Polutele, Mme&#160;Ramassamy et M.&#160;Thierry&#160;Robert"
  },
  "pointeurFragmentTexte": {
    "division": {
      "titre": "Article 23",
      "articleDesignationCourte": "APRÈS ART. 23",
      "type": "ARTICLE",
      "avantAApres": "Apres",
      "divisionRattachee": "APRÈS L'ARTICLE 23, insérer l'article suivant:",
      "articleAdditionnel": "1",
      "urlDivisionTexteVise": "/15/textes/0384.asp#D_Article_23"
    }
  },
  "corps": {
    "dispositif": "<p style=\"text-align: justify;\">I.&#160;&#8211;&#160;Le Gouvernement remet au Parlement, dans un d&#233;lai de six mois &#224; compter de la promulgation de la pr&#233;sente loi, un rapport d&#8217;information sur les transferts financiers et ressources mobilisables pour les collectivit&#233;s territoriales du d&#233;partement de Mayotte.</p><p style=\"text-align: justify;\">II.&#160;&#8211;&#160;Ce rapport &#233;value les compensations financi&#232;res actuelles au regard des comp&#233;tences transf&#233;r&#233;es et des d&#233;penses r&#233;elles des collectivit&#233;s. Il &#233;value &#233;galement les transferts qui devront &#234;tre effectu&#233;s dans le cadre de l&#8217;&#233;volution vers l&#8217;identit&#233; l&#233;gislative pour les ann&#233;es 2018 &#224; 2020. Enfin, il &#233;value les dispositifs financiers mobilisables pour le d&#233;veloppement d&#8217;une politique du logement social et d&#8217;une politique de la formation professionnelle &#224; Mayotte.</p>",
    "exposeSommaire": "<p style=\"text-align: justify;\">Cet amendement vise &#224; &#233;tablir un rapport d&#8217;information sur les transferts financiers vers les collectivit&#233;s territoriales du d&#233;partement de Mayotte&#160;: transferts au regard des comp&#233;tences transf&#233;r&#233;es, transferts au regard de la poursuite du processus de transfert de comp&#233;tences dans le cadre de la d&#233;partementalisation et de la r&#233;gionalisation, ressources mobilisables afin de d&#233;ployer la politique du logement social et d&#233;velopper la politique de formation professionnelle.</p><p style=\"text-align: justify;\">Mayotte doit faire face &#224; d&#8217;importants enjeux&#160;: la marche vers l&#8217;identit&#233; l&#233;gislative et la mise en place de politique de rattrapage dans de nombreux domaines (am&#233;nagements, &#233;quipements, infrastructures, r&#233;seaux, urbanisme, politique &#233;ducative, politique sociale, politique de formation professionnelle, politique du logement...). Le pilotage des politiques conduites par les communes et le conseil d&#233;partemental est rendu particuli&#232;rement complexe par la concomitance des diff&#233;rents besoins et de l&#8217;&#233;volution r&#233;glementaire. Cette complexit&#233; est renforc&#233;e par une croissance d&#233;mographique importante et en progression (+11&#160;% ces 3 derni&#232;res ann&#233;es) li&#233;e &#224; une immigration clandestine massive qui perturbe le formatage des politiques sectorielles locales.</p><p style=\"text-align: justify;\">La situation tendue des finances des collectivit&#233;s territoriales face aux besoins d&#8217;investissements est amplifi&#233;e par les incertitudes quant aux dotations et transferts de l&#8217;&#201;tat concernant la poursuite de l&#8217;int&#233;gration au droit commun et &#224; son phasage dans le temps. Une clarification globale et d&#233;taill&#233;e quant &#224; l&#8217;&#233;volution des transferts pour les comp&#233;tences actuellement transf&#233;r&#233;es et pour les comp&#233;tences &#224; venir est devenue n&#233;cessaire. Elle permettrait d&#8217;&#233;tablir une planification financi&#232;re favorable au d&#233;ploiement coh&#233;rent des politiques publiques locales.</p><p style=\"text-align: justify;\">Pour ce qui a trait au logement, 28&#160;% des logements n&#8217;ont pas l&#8217;eau courante et 54&#160;% n&#8217;ont pas de sanitaires &#224; l&#8217;int&#233;rieur du logement. L&#8217;assainissement concerne moins de 10&#160;% des habitations. 84&#160;% de la population vit sous le seuil de pauvret&#233; mon&#233;taire. Or les logements sociaux repr&#233;sentent moins de 1&#160;% des logements du territoire de Mayotte. Mayotte est-elle ainsi le d&#233;partement fran&#231;ais le plus d&#233;ficient en terme d&#8217;offre de logements sociaux, tout en &#233;tant le d&#233;partement dans lequel la proportion des m&#233;nages &#233;ligibles aux dispositifs du logement social est la plus importante. Le d&#233;veloppement de la construction d&#8217;habitations sociales est une n&#233;cessit&#233; patente. Les modalit&#233;s de son financement sont donc &#224; &#233;tudier rapidement.</p><p style=\"text-align: justify;\">Pour ce qui concerne la formation professionnelle, 40&#160;% de la population active est sans emploi, 33&#160;% des mahorais n&#8217;ont jamais &#233;t&#233; scolaris&#233;s et 73&#160;% n&#8217;ont aucun dipl&#244;me ou formation qualifiante. Aussi, le d&#233;veloppement d&#8217;une politique de formation professionnelle ambitieuse est une n&#233;cessit&#233; urgente, &#224; la fois pour permettre une int&#233;gration professionnelle et sociale des mahorais et pour le d&#233;veloppement &#233;conomique de l&#8217;&#238;le. Les modalit&#233;s et l&#8217;ampleur de son financement sont &#224; &#233;tablir.</p>"
  },
  "representations": [
    {
      "nom": "PDF",
      "typeMime": {
        "type": "application",
        "subType": "PDF"
      },
      "statutRepresentation": {
        "verbatim": true,
        "canonique": true,
        "officielle": true,
        "transcription": false,
        "enregistrement": false
      },
      "contenu": {
        "documentURI": "/15/amendements/0384/CION_FIN/CF111.pdf"
      }
    }
  ],
  "dateDepot": "2017-11-22T01:00:00.000+01:00",
  "dateDistribution": "2017-11-28T01:00:00.000+01:00",
  "article99": "0",
  "loiReference": {
    "codeLoi": "z rapport"
  }
}