{
  "uid": "AMANR5L15PO59051B1503P0D1N473",
  "identifiant": {
    "legislature": "15",
    "numero": "473",
    "numRect": "0",
    "saisine": {
      "texteLegislatifRef": "PRJLANR5L15B1503",
      "numeroPartiePLF": "0",
      "organeExamen": "PO59051",
      "mentionSecondeDeliberation": "0"
    }
  },
  "numeroLong": "CL473",
  "etapeTexte": "Nouvelle Lecture",
  "triAmendement": "dbaaaaaaaaaaaaaaaaaaaaaaaaaaaaaaaaaaaaaaaaaaaaaaaai",
  "cardinaliteAmdtMultiples": "1",
  "etat": "Discuté",
  "signataires": {
    "auteur": {
      "typeAuteur": "Depute",
      "acteurRef": "PA719202",
      "groupePolitiqueRef": "PO730964"
    },
    "cosignatairesRefs": [
      "PA719202"
    ],
    "texteAffichable": "M.&#160;Paris, rapporteur"
  },
  "pointeurFragmentTexte": {
    "division": {
      "titre": "Article 29",
      "articleDesignationCourte": "ART. 29",
      "type": "ARTICLE",
      "avantAApres": "A",
      "divisionRattachee": "ARTICLE 29",
      "urlDivisionTexteVise": "/15/textes/1503.asp#D_Article_29"
    },
    "alinea": {
      "numero": "71"
    }
  },
  "corps": {
    "dispositif": "<p style=\"text-align: justify;\">&#192; l&#8217;alin&#233;a&#160;71, supprimer la r&#233;f&#233;rence&#160;:</p><p style=\"text-align: justify;\">&#171;&#160;L.&#160;5421&#8209;3,&#160;&#187;.</p>",
    "exposeSommaire": "<p>Correction d'une erreur de r&#233;f&#233;rence.</p>"
  },
  "representations": [
    {
      "nom": "PDF",
      "typeMime": {
        "type": "application",
        "subType": "PDF"
      },
      "statutRepresentation": {
        "verbatim": true,
        "canonique": true,
        "officielle": true,
        "transcription": false,
        "enregistrement": false
      },
      "contenu": {
        "documentURI": "/15/amendements/1503/CION_LOIS/CL473.pdf"
      }
    }
  ],
  "sort": {
    "dateSaisie": "2018-12-19T17:58:37.000+01:00",
    "sortEnSeance": "Adopté"
  },
  "dateDepot": "2018-12-18T01:00:00.000+01:00",
  "dateDistribution": "2018-12-18T01:00:00.000+01:00",
  "article99": "0",
  "loiReference": {}
}