{
  "uid": "AMANR5L15PO419610B2274P0D1N244",
  "identifiant": {
    "legislature": "15",
    "numero": "244",
    "numRect": "0",
    "saisine": {
      "texteLegislatifRef": "PRJLANR5L15B2274",
      "numeroPartiePLF": "0",
      "organeExamen": "PO419610",
      "mentionSecondeDeliberation": "0"
    }
  },
  "numeroLong": "CE244",
  "etapeTexte": "1ère lecture (2ème assemblée saisie)",
  "triAmendement": "aaekaaaaaaaaaaaaaaaaaaaaaaaaaaaaaaaaaaaaaaaaaaaaaazzzzzzzzzzzzzzu",
  "cardinaliteAmdtMultiples": "1",
  "etat": "Discuté",
  "signataires": {
    "auteur": {
      "typeAuteur": "Depute",
      "acteurRef": "PA721530",
      "groupePolitiqueRef": "PO730970"
    },
    "cosignatairesRefs": [
      "PA719918",
      "PA720598",
      "PA720746",
      "PA720728",
      "PA720704",
      "PA722374",
      "PA720162",
      "PA721984",
      "PA721976",
      "PA720968",
      "PA721734",
      "PA720092",
      "PA719640",
      "PA722162",
      "PA720652",
      "PA720326",
      "PA721924",
      "PA718978",
      "PA719504",
      "PA721608",
      "PA721182",
      "PA721996",
      "PA721234",
      "PA720334",
      "PA720772",
      "PA721418",
      "PA722284",
      "PA719488",
      "PA719210",
      "PA720256",
      "PA719942",
      "PA721836",
      "PA719558",
      "PA720976",
      "PA719044",
      "PA1276",
      "PA720924",
      "PA719874",
      "PA721742",
      "PA717151",
      "PA720720",
      "PA720002",
      "PA720764",
      "PA719266",
      "PA721530",
      "PA720178"
    ],
    "texteAffichable": "Mme&#160;Luquet,  Mme&#160;Deprez-Audebert, M.&#160;Bolo, M.&#160;Lagleize, M.&#160;Mathiasin, M.&#160;Ramos, M.&#160;Turquois, M.&#160;Balanant, Mme&#160;Bannier, M.&#160;Barrot, M.&#160;Baudu, Mme&#160;Benin, M.&#160;Berta, M.&#160;Bourlanges, M.&#160;Bru, M.&#160;Cubertafon, Mme&#160;de Sarnez, Mme&#160;de Vaucouleurs, M.&#160;Duverg&#233;, Mme&#160;El Ha&#239;ry, Mme&#160;Elimas, Mme&#160;Essayan, M.&#160;Fanget, Mme&#160;Florennes, M.&#160;Fuchs, M.&#160;Garcia, M.&#160;Hammouche, M.&#160;Isaac-Sibille, Mme&#160;Jacquier-Laforge, M.&#160;Joncour, M.&#160;Lain&#233;, M.&#160;Laqhila, Mme&#160;Lasserre, M.&#160;Latombe, M.&#160;Loiseau, M.&#160;Mattei, Mme&#160;Mette, M.&#160;Michel-Kleisbauer, M.&#160;Mignola, M.&#160;Millienne, M.&#160;Pahun, M.&#160;Fr&#233;d&#233;ric&#160;Petit, Mme&#160;Maud&#160;Petit, Mme&#160;Poueyto, Mme&#160;Vichnievsky et M.&#160;Waserman"
  },
  "pointeurFragmentTexte": {
    "division": {
      "titre": "Article 4 quater D",
      "articleDesignationCourte": "ART. 4 QUATER D",
      "type": "ARTICLE",
      "avantAApres": "A",
      "divisionRattachee": "ARTICLE 4 QUATER D",
      "urlDivisionTexteVise": "/15/textes/2274.asp#D_Article_4_quater_D"
    },
    "alinea": {
      "avantAApres": "Apres",
      "numero": "6"
    }
  },
  "corps": {
    "dispositif": "<p>Compl&#233;ter cet article par l&#8217;alin&#233;a suivant&#160;:</p><p style=\"text-align: justify;\">&#171;&#160;Le montant de l&#8217;amende peut &#234;tre port&#233;, de mani&#232;re proportionn&#233;e aux avantages tir&#233;s du d&#233;lit, &#224; 5&#160;% du chiffre d&#8217;affaires moyen annuel, calcul&#233; sur les trois derniers chiffres d&#8217;affaires annuels connus &#224; la date des faits.&#160;&#187;</p>",
    "exposeSommaire": "<p style=\"text-align: justify;\">Afin d'&#234;tre en ad&#233;quation avec ce qui existe d&#233;j&#224; aujourd'hui dans le code de la consommation &#224; l'article L454-6 pour sanctionner l'obsolescence programm&#233;e, il convient de compl&#233;ter la sanction pr&#233;vue &#224; l'article 4 quater D du pr&#233;sent texte par une amende en pourcentage du chiffre d'affaire.</p><p style=\"text-align: justify;\">Tel est l'objet de cet amendement.</p>"
  },
  "representations": [
    {
      "nom": "PDF",
      "typeMime": {
        "type": "application",
        "subType": "PDF"
      },
      "statutRepresentation": {
        "verbatim": true,
        "canonique": true,
        "officielle": true,
        "transcription": false,
        "enregistrement": false
      },
      "contenu": {
        "documentURI": "/15/amendements/2274/CION-ECO/CE244.pdf"
      }
    }
  ],
  "sort": {
    "dateSaisie": "2019-11-19T20:01:42.000+01:00",
    "sortEnSeance": "Retiré"
  },
  "dateDepot": "2019-11-15T01:00:00.000+01:00",
  "dateDistribution": "2019-11-18T01:00:00.000+01:00",
  "article99": "0",
  "loiReference": {}
}