{
  "uid": "AMANR5L15PO59051B2357P0D1N956",
  "identifiant": {
    "legislature": "15",
    "numero": "956",
    "numRect": "0",
    "saisine": {
      "texteLegislatifRef": "PRJLANR5L15B2357",
      "numeroPartiePLF": "0",
      "organeExamen": "PO59051",
      "mentionSecondeDeliberation": "0"
    }
  },
  "numeroLong": "CL956",
  "etapeTexte": "1ère lecture (2ème assemblée saisie)",
  "triAmendement": "beaaaaaaaaaaaaaaaaaaaaaaaaaaaaaaaaaaaaaaaaaaaaaaaak",
  "cardinaliteAmdtMultiples": "1",
  "etat": "Irrecevable",
  "signataires": {
    "auteur": {
      "typeAuteur": "Depute",
      "acteurRef": "PA719286",
      "groupePolitiqueRef": "PO759900"
    },
    "cosignatairesRefs": [
      "PA720278",
      "PA719286",
      "PA607619",
      "PA267042",
      "PA605518",
      "PA942",
      "PA608292",
      "PA336175",
      "PA336439",
      "PA719138",
      "PA605694",
      "PA405480",
      "PA721194",
      "PA719146",
      "PA331582",
      "PA755549",
      "PA720038",
      "PA333421",
      "PA720996"
    ],
    "texteAffichable": "M.&#160;Colombani,  M.&#160;Acquaviva, M.&#160;Brial, M.&#160;Castellani, M.&#160;Cl&#233;ment, M.&#160;Charles&#160;de Courson, Mme&#160;Dubi&#233;, Mme&#160;Fr&#233;d&#233;rique&#160;Dumas, M.&#160;El Guerrab, M.&#160;Falorni, M.&#160;Favennec Becot, Mme&#160;Josso, M.&#160;Fran&#231;ois-Michel&#160;Lambert, M.&#160;Molac, M.&#160;Orphelin, M.&#160;Pancher, Mme&#160;Pinel, M.&#160;Pupponi et M.&#160;Philippe&#160;Vigier"
  },
  "pointeurFragmentTexte": {
    "division": {
      "titre": "Article 7",
      "articleDesignationCourte": "APRÈS ART. 7",
      "type": "ARTICLE",
      "avantAApres": "Apres",
      "divisionRattachee": "APRÈS L'ARTICLE 7, insérer l'article suivant:",
      "articleAdditionnel": "1",
      "urlDivisionTexteVise": "/15/textes/2357.asp#D_Article_7"
    }
  },
  "corps": {},
  "representations": [
    {
      "nom": "PDF",
      "typeMime": {
        "type": "application",
        "subType": "PDF"
      },
      "statutRepresentation": {
        "verbatim": true,
        "canonique": true,
        "officielle": true,
        "transcription": false,
        "enregistrement": false
      },
      "contenu": {
        "documentURI": "/15/amendements/2357/CION_LOIS/CL956.pdf"
      }
    }
  ],
  "dateDepot": "2019-11-02T01:00:00.000+01:00",
  "dateDistribution": "2019-11-02T01:00:00.000+01:00",
  "article99": "0",
  "loiReference": {
    "codeLoi": "CGCT",
    "divisionCodeLoi": "L4424-26-2"
  }
}