{
  "uid": "AMANR5L15SEA717460B2296P0D1N172",
  "identifiant": {
    "legislature": "15",
    "numero": "172",
    "numRect": "0",
    "saisine": {
      "texteLegislatifRef": "PRJLANR5L15B2296",
      "numeroPartiePLF": "0",
      "organeExamen": "PO717460",
      "mentionSecondeDeliberation": "0"
    }
  },
  "numeroLong": "172",
  "etapeTexte": "1ère lecture (1ère assemblée saisie)",
  "triAmendement": "auaaaaaaaaaaaaaaaaaaaaaaaaaaaaaaaaaaaaaaaaaaaaaaaaew",
  "cardinaliteAmdtMultiples": "1",
  "etat": "Discuté",
  "signataires": {
    "auteur": {
      "typeAuteur": "Depute",
      "acteurRef": "PA267766",
      "groupePolitiqueRef": "PO767217"
    },
    "cosignatairesRefs": [
      "PA267766",
      "PA267241",
      "PA721486",
      "PA267330",
      "PA719806"
    ],
    "texteAffichable": "M.&#160;Guy&#160;Bricout,  Mme&#160;Auconie, M.&#160;Demilly, M.&#160;Naegelen et M.&#160;Zumkeller"
  },
  "pointeurFragmentTexte": {
    "division": {
      "titre": "Article 8",
      "articleDesignationCourte": "APRÈS ART. 8",
      "type": "ARTICLE",
      "avantAApres": "Apres",
      "divisionRattachee": "APRÈS L'ARTICLE 8, insérer l'article suivant:",
      "articleAdditionnel": "1",
      "urlDivisionTexteVise": "/15/textes/2296.asp#D_Article_8"
    }
  },
  "corps": {
    "dispositif": "<p>I.&#160;&#8211;&#160;L&#8217;article L.&#160;646&#8209;3 du code de la s&#233;curit&#233; sociale est abrog&#233;.</p><p style=\"text-align: justify;\">II.&#160;&#8211;&#160;La perte des recettes pour les organismes de s&#233;curit&#233; sociale est compens&#233;e &#224; due concurrence par la majoration des droits mentionn&#233;s aux articles 575 et 575A du code g&#233;n&#233;ral des imp&#244;ts.</p>",
    "exposeSommaire": "<p style=\"text-align: justify;\">La loi de financement de la s&#233;curit&#233; sociale pour 2016, dans son article&#160;52, a harmonis&#233; le taux des cotisations maladie, maternit&#233; et d&#233;c&#232;s des professionnels ind&#233;pendants, ramenant le taux de cotisations des professionnels de sant&#233; lib&#233;raux affili&#233;s au r&#233;gime des praticiens et auxiliaires m&#233;dicaux conventionn&#233;s (PAMC), alors de 9,81&#160;%, &#224; hauteur du taux appliqu&#233; au RSI, soit 6,5&#160;%.</p><p style=\"text-align: justify;\">Ce m&#234;me article&#160;52 de la LFFS 2016 a &#233;galement introduit une taxe additionnelle de 3,25&#160;% applicable aux revenus tir&#233;s d&#8217;une activit&#233; non conventionn&#233;e ou des d&#233;passements d&#8217;honoraires pour les seuls professionnels de sant&#233; affili&#233;s au r&#233;gime PAMC (article L646&#8209;3 du code de s&#233;curit&#233; sociale).</p><p style=\"text-align: justify;\">Cette taxe additionnelle constitue une v&#233;ritable iniquit&#233; entre les professionnels de sant&#233; lib&#233;raux affili&#233;s au r&#233;gime PAMC et les professionnels de sant&#233; lib&#233;raux affili&#233;s au RSI qui en sont exon&#233;r&#233;s.</p><p style=\"text-align: justify;\">La suppression de cette taxe additionnelle vise &#224; mettre un terme &#224; cette discrimination entre professionnels de sant&#233; lib&#233;raux selon leur r&#233;gime d&#8217;affiliation et r&#233;pond &#224; la politique gouvernementale d&#8217;harmonisation des cotisations sur les revenus d&#8217;activit&#233;.</p>"
  },
  "representations": [
    {
      "nom": "PDF",
      "typeMime": {
        "type": "application",
        "subType": "PDF"
      },
      "statutRepresentation": {
        "verbatim": true,
        "canonique": true,
        "officielle": true,
        "transcription": false,
        "enregistrement": false
      },
      "contenu": {
        "documentURI": "/15/amendements/2296/AN/172.pdf"
      }
    }
  ],
  "seanceDiscussion": "RUANR5L15S2020IDS21876",
  "sort": {
    "dateSaisie": "2019-10-23T23:02:44.000+02:00",
    "sortEnSeance": "Rejeté"
  },
  "dateDepot": "2019-10-16T02:00:00.000+02:00",
  "dateDistribution": "2019-10-21T02:00:00.000+02:00",
  "article99": "0",
  "loiReference": {
    "codeLoi": "c sécurité sociale",
    "divisionCodeLoi": "L646-3"
  }
}