{
  "uid": "AMANR5L15SEA717460B2272P2D1N272",
  "identifiant": {
    "legislature": "15",
    "numero": "272",
    "numRect": "0",
    "saisine": {
      "texteLegislatifRef": "PRJLANR5L15B2272",
      "numeroPartiePLF": "2",
      "organeExamen": "PO717460",
      "mentionSecondeDeliberation": "0"
    }
  },
  "numeroLong": "II-272",
  "etapeTexte": "1ère lecture (1ère assemblée saisie)",
  "triAmendement": "bfeaaaaaaaaaaaaaaaaaaaaaaaaaaaaaaaaaaaaaaaaaaaaaaacm",
  "cardinaliteAmdtMultiples": "1",
  "etat": "Discuté",
  "signataires": {
    "auteur": {
      "typeAuteur": "Depute",
      "acteurRef": "PA608292",
      "groupePolitiqueRef": "PO759900"
    },
    "cosignatairesRefs": [
      "PA336175",
      "PA719138",
      "PA331582",
      "PA605694",
      "PA607619",
      "PA719146",
      "PA719286",
      "PA267042",
      "PA333421",
      "PA721194",
      "PA720996",
      "PA608292",
      "PA405480",
      "PA720038",
      "PA605518",
      "PA336439"
    ],
    "texteAffichable": "Mme&#160;Dubi&#233;,  M.&#160;Castellani, M.&#160;Pupponi, M.&#160;Philippe&#160;Vigier, M.&#160;Acquaviva, M.&#160;Cl&#233;ment, M.&#160;Colombani, Mme&#160;Fr&#233;d&#233;rique&#160;Dumas, M.&#160;El Guerrab, M.&#160;Falorni, M.&#160;Favennec Becot, Mme&#160;Josso, M.&#160;Fran&#231;ois-Michel&#160;Lambert, M.&#160;Molac, M.&#160;Pancher et Mme&#160;Pinel"
  },
  "pointeurFragmentTexte": {
    "missionVisee": {
      "idMissionAN": "823",
      "libelleMission": "Relations avec les collectivités territoriales",
      "codeMissionPLF": "B",
      "libelleMissionPLF": "Répartition, par mission et programme, des crédits du budget général"
    },
    "division": {
      "titre": "Article 78",
      "articleDesignationCourte": "ART. 78",
      "type": "ARTICLE",
      "avantAApres": "A",
      "divisionRattachee": "ARTICLE 78",
      "urlDivisionTexteVise": "/15/textes/2272C.asp#D_Article_78"
    },
    "alinea": {
      "avantAApres": "Apres",
      "numero": "30"
    }
  },
  "corps": {
    "dispositif": "<p>Apr&#232;s l&#8217;alin&#233;a&#160;30, ins&#233;rer l&#8217;alin&#233;a suivant&#160;:</p><p style=\"text-align: justify;\">&#171;&#160;1&#176;&#160;A&#160;&#192; la premi&#232;re phrase du deuxi&#232;me alin&#233;a de l&#8217;article L.&#160;2334&#8209;2, la premi&#232;re occurrence des mots&#160;: &#171;&#160;d&#8217;un habitant&#160;&#187; est remplac&#233;e par les mots&#160;: &#171;&#160;de deux habitants&#160;&#187;&#160;;&#160;&#187;</p>",
    "exposeSommaire": "<p style=\"text-align: justify;\">Cet amendement vise &#224; majorer de 1 &#224; 2 le nombre d&#8217;habitants par r&#233;sidence secondaire prise en compte pour le calcul de la DGF.</p><p style=\"text-align: justify;\">La population prise en compte pour le calcul de la DGF r&#233;sulte des recensements g&#233;n&#233;raux ou compl&#233;mentaires, major&#233;e d&#8217;un habitant par r&#233;sidence secondaire. Cette majoration ne prend pas suffisamment en compte d&#8217;une part, la diversit&#233; des modes d&#8217;h&#233;bergement dans les communes touristiques et, d&#8217;autre part, l&#8217;augmentation du nombre de r&#233;sidences secondaires ces derni&#232;res ann&#233;es.</p><p style=\"text-align: justify;\">Une &#233;tude de la direction g&#233;n&#233;rale des collectivit&#233;s territoriales (DGCL), publi&#233;e en janvier 2017, souligne que les d&#233;penses de fonctionnement par habitant sont en moyenne plus &#233;lev&#233;es pour les communes touristiques. Leurs d&#233;penses d&#8217;entretien sont plus importantes que dans les autres communes, la population utilisant moins intens&#233;ment les services de la collectivit&#233;. Parmi les communes touristiques, les communes de montagne ont des d&#233;penses par habitant tr&#232;s sup&#233;rieures, notamment dans les stations de sports d&#8217;hiver.</p>"
  },
  "representations": [
    {
      "nom": "PDF",
      "typeMime": {
        "type": "application",
        "subType": "PDF"
      },
      "statutRepresentation": {
        "verbatim": true,
        "canonique": true,
        "officielle": true,
        "transcription": false,
        "enregistrement": false
      },
      "contenu": {
        "documentURI": "/15/amendements/2272C/AN/272.pdf"
      }
    }
  ],
  "seanceDiscussion": "RUANR5L15S2020IDS21910",
  "sort": {
    "dateSaisie": "2019-11-08T10:42:05.000+01:00",
    "sortEnSeance": "Rejeté"
  },
  "dateDepot": "2019-10-24T02:00:00.000+02:00",
  "dateDistribution": "2019-11-07T01:00:00.000+01:00",
  "article99": "0",
  "loiReference": {}
}