{
  "uid": "AMANR5L15SEA717460B0911P0D1N2012",
  "identifiant": {
    "legislature": "15",
    "numero": "2012",
    "numRect": "0",
    "saisine": {
      "texteLegislatifRef": "PRJLANR5L15B0911",
      "numeroPartiePLF": "0",
      "organeExamen": "PO717460",
      "mentionSecondeDeliberation": "0"
    }
  },
  "numeroLong": "2012",
  "etapeTexte": "1ère lecture (1ère assemblée saisie)",
  "triAmendement": "dgxu",
  "cardinaliteAmdtMultiples": "1",
  "etat": "A discuter",
  "signataires": {
    "auteur": {
      "typeAuteur": "Depute",
      "acteurRef": "PA719822",
      "groupePolitiqueRef": "PO730964"
    },
    "cosignatairesRefs": [
      "PA720370",
      "PA720394",
      "PA721352",
      "PA720074",
      "PA721142",
      "PA718902",
      "PA719170",
      "PA720310",
      "PA721278",
      "PA719882",
      "PA721776",
      "PA718876",
      "PA722300",
      "PA720738",
      "PA719814",
      "PA719194",
      "PA721398",
      "PA718810",
      "PA642695",
      "PA721792",
      "PA724827",
      "PA720402",
      "PA721916",
      "PA2449",
      "PA718802",
      "PA719060",
      "PA719790",
      "PA721764",
      "PA719822",
      "PA721726",
      "PA722008",
      "PA719044",
      "PA720916",
      "PA606202",
      "PA722094",
      "PA721372",
      "PA719798",
      "PA721784",
      "PA722178",
      "PA721608",
      "PA721644",
      "PA719684",
      "PA720146",
      "PA721166",
      "PA719550",
      "PA605518",
      "PA720342",
      "PA718756",
      "PA719740",
      "PA718944",
      "PA720772",
      "PA721150",
      "PA720002",
      "PA722228",
      "PA721158",
      "PA720170",
      "PA720598",
      "PA607155",
      "PA721876",
      "PA722320",
      "PA719592",
      "PA720560"
    ],
    "texteAffichable": "Mme&#160;Thillaye,  M.&#160;Bourlanges, M.&#160;Mendes, M.&#160;Anglade, Mme&#160;Tanguy, M.&#160;Anato, Mme&#160;Bono-Vandorme, M.&#160;Bothorel, M.&#160;Bru, Mme&#160;Charvier, Mme&#160;Yolaine&#160;de Courson, Mme&#160;Degois, Mme&#160;Deprez-Audebert, Mme&#160;Dubost, Mme&#160;Fran&#231;oise&#160;Dumas, Mme&#160;Gomez-Bassac, Mme&#160;Grandjean, Mme&#160;Hennion, M.&#160;Holroyd, Mme&#160;Janvier, M.&#160;Jerretie, Mme&#160;Le Peih, M.&#160;Leclabart, M.&#160;Michels, M.&#160;Paluszkiewicz, M.&#160;Pichereau, M.&#160;Pont, M.&#160;Simian, Mme&#160;Ali, M.&#160;Arend, M.&#160;Baich&#232;re, M.&#160;Besson-Moreau, Mme&#160;Cazarian, Mme&#160;Cazebonne, M.&#160;Chalumeau, M.&#160;Colas-Roy, Mme&#160;Colboc, M.&#160;Daniel, Mme&#160;El Ha&#239;ry, Mme&#160;Essayan, Mme&#160;Forteza, Mme&#160;Goulet, Mme&#160;Gregoire, Mme&#160;Guerel, Mme&#160;Khedher, M.&#160;Kokouendo, M.&#160;Labaronne, M.&#160;Fran&#231;ois-Michel&#160;Lambert, Mme&#160;Lazaar, Mme&#160;Leguille-Balloy, M.&#160;Lejeune, M.&#160;Maire, Mme&#160;Mauborgne, M.&#160;Mass&#233;glia, Mme&#160;Meynier-Millefert, M.&#160;Morenas, M.&#160;Perea, Mme&#160;Pouzyreff, Mme&#160;Racon-Bouzon, Mme&#160;Robert, M.&#160;C&#233;dric&#160;Roussel et Mme&#160;Trisse"
  },
  "pointeurFragmentTexte": {
    "division": {
      "titre": "Article 17",
      "articleDesignationCourte": "APRÈS ART. 17",
      "type": "ARTICLE",
      "avantAApres": "Apres",
      "divisionRattachee": "APRÈS L'ARTICLE 17, insérer l'article suivant:",
      "articleAdditionnel": "1",
      "urlDivisionTexteVise": "/15/textes/0911.asp#D_Article_17"
    }
  },
  "corps": {
    "dispositif": "<p style=\"text-align: justify;\">Apr&#232;s le deuxi&#232;me alin&#233;a de l&#8217;article&#160;88&#8209;4 de la Constitution, il est ins&#233;r&#233; un alin&#233;a ainsi r&#233;dig&#233;&#160;:</p><p style=\"text-align: justify;\">&#171;&#160;Le Gouvernement informe l&#8217;Assembl&#233;e nationale et le S&#233;nat de ses positions au Conseil de l&#8217;Union&#160;europ&#233;enne sur les projets ou propositions mentionn&#233;s au premier alin&#233;a. Il informe chaque assembl&#233;e de la prise en compte des r&#233;solutions&#160;europ&#233;ennes qu&#8217;elle a adopt&#233;es. Les modalit&#233;s d&#8217;application du pr&#233;sent alin&#233;a sont fix&#233;es par une loi organique.&#160;&#187;</p>",
    "exposeSommaire": "<p style=\"text-align: justify;\">Cet amendement vise &#224; renvoyer &#224; une loi organique le soin de d&#233;finir les modalit&#233;s d&#8217;information incombant au Gouvernement pour permettre aux deux assembl&#233;es d&#8217;exercer leur mission de veille l&#233;gislative&#160;europ&#233;enne pr&#233;vue par la Constitution.</p>"
  },
  "representations": [
    {
      "nom": "PDF",
      "typeMime": {
        "type": "application",
        "subType": "PDF"
      },
      "statutRepresentation": {
        "verbatim": true,
        "canonique": true,
        "officielle": true,
        "transcription": false,
        "enregistrement": false
      },
      "contenu": {
        "documentURI": "/15/amendements/0911/AN/2012.pdf"
      }
    }
  ],
  "dateDepot": "2018-07-06T02:00:00.000+02:00",
  "dateDistribution": "2018-07-13T02:00:00.000+02:00",
  "article99": "0",
  "loiReference": {
    "codeLoi": "Constitution",
    "divisionCodeLoi": "88-4"
  }
}