{
  "uid": "AMANR5L15PO59051B1106P0D1N316",
  "identifiant": {
    "legislature": "15",
    "numero": "316",
    "numRect": "0",
    "saisine": {
      "texteLegislatifRef": "PRJLANR5L15B1106",
      "numeroPartiePLF": "0",
      "organeExamen": "PO59051",
      "mentionSecondeDeliberation": "0"
    }
  },
  "numeroLong": "CL316",
  "etapeTexte": "Nouvelle Lecture",
  "triAmendement": "v",
  "cardinaliteAmdtMultiples": "1",
  "etat": "Discuté",
  "signataires": {
    "auteur": {
      "typeAuteur": "Depute",
      "acteurRef": "PA721564",
      "groupePolitiqueRef": "PO730964"
    },
    "cosignatairesRefs": [
      "PA721564"
    ],
    "texteAffichable": "Mme&#160;Fajgeles, rapporteure"
  },
  "pointeurFragmentTexte": {
    "division": {
      "titre": "Article 12",
      "articleDesignationCourte": "ART. 12",
      "type": "ARTICLE",
      "avantAApres": "A",
      "divisionRattachee": "ARTICLE 12",
      "urlDivisionTexteVise": "/15/textes/1106.asp#D_Article_12"
    },
    "alinea": {
      "numero": "12"
    }
  },
  "corps": {
    "dispositif": "<p>&#192; l'alin&#233;a 12, substituer aux mots&#160;:</p><p>&#171;&#160;cent quarante&#8209;quatre heures&#160;&#187;</p><p>les mots&#160;:</p><p>&#171;&#160;huit jours&#160;&#187;.</p>",
    "exposeSommaire": "<p style=\"text-align: justify;\">Le IV de l'article 12 r&#233;sulte d'un amendement du Gouvernement adopt&#233; par le S&#233;nat pour parer aux effets de la d&#233;cision du Conseil constitutionnel n&#176;&#160;2018-709&#160;QPC du 1<sup>er</sup> juin 2018. Le Conseil a consid&#233;r&#233; qu'en enserrant dans un d&#233;lai maximal de cinq jours le temps global imparti &#224; l'&#233;tranger d&#233;tenu pour former son recours et au juge pour statuer, les dispositions actuellement en vigueur n'op&#232;rent pas une conciliation &#233;quilibr&#233;e entre le droit au recours juridictionnel effectif et l'objectif d'&#233;viter le placement de l'&#233;tranger en r&#233;tention administrative &#224; l'issue de la d&#233;tention.</p><p style=\"text-align: justify;\">La r&#233;daction issue du S&#233;nat pr&#233;voit que le juge statue dans les 144&#160;heures, soit six jours, &#224; compter de l'information du tribunal par l&#8217;administration de la possible lev&#233;e d'&#233;crou.</p><p style=\"text-align: justify;\">Le pr&#233;sent amendement, afin de garantir au mieux le droit &#224; un recours effectif et de laisser toute latitude au juge pour se prononcer, porte ce d&#233;lai &#224; huit jours.</p>"
  },
  "representations": [
    {
      "nom": "PDF",
      "typeMime": {
        "type": "application",
        "subType": "PDF"
      },
      "statutRepresentation": {
        "verbatim": true,
        "canonique": true,
        "officielle": true,
        "transcription": false,
        "enregistrement": false
      },
      "contenu": {
        "documentURI": "/15/amendements/1106/CION_LOIS/CL316.pdf"
      }
    }
  ],
  "sort": {
    "dateSaisie": "2018-07-11T13:03:00.000+02:00",
    "sortEnSeance": "Adopté"
  },
  "dateDepot": "2018-07-10T02:00:00.000+02:00",
  "dateDistribution": "2018-07-10T02:00:00.000+02:00",
  "article99": "0",
  "loiReference": {}
}