{
  "uid": "AMANR5L15PO419865B2135P0D1N611",
  "identifiant": {
    "legislature": "15",
    "numero": "611",
    "numRect": "0",
    "saisine": {
      "texteLegislatifRef": "PRJLANR5L15B2135",
      "numeroPartiePLF": "0",
      "organeExamen": "PO419865",
      "mentionSecondeDeliberation": "0"
    }
  },
  "numeroLong": "CD611",
  "etapeTexte": "Nouvelle Lecture",
  "triAmendement": "iwaaaaaaaaaaaaaaaaaaaaaaaaaaaaaaaaaaaaaaaaaaaaaaaak",
  "cardinaliteAmdtMultiples": "1",
  "etat": "Discuté",
  "signataires": {
    "auteur": {
      "typeAuteur": "Depute",
      "acteurRef": "PA720944",
      "groupePolitiqueRef": "PO730964"
    },
    "cosignatairesRefs": [
      "PA720944"
    ],
    "texteAffichable": "Mme&#160;Park, rapporteure"
  },
  "pointeurFragmentTexte": {
    "division": {
      "titre": "Article 32 ter",
      "articleDesignationCourte": "ART. 32 TER",
      "type": "ARTICLE",
      "avantAApres": "A",
      "divisionRattachee": "ARTICLE 32 TER",
      "urlDivisionTexteVise": "/15/textes/2135.asp#D_Article_32_ter"
    },
    "alinea": {
      "numero": "8"
    }
  },
  "corps": {
    "dispositif": "<p style=\"text-align: justify;\">&#192; l&#8217;alin&#233;a&#160;8, substituer &#224; la date&#160;:</p><p style=\"text-align: justify;\">&#171;&#160;1<sup>er</sup> janvier 2020&#160;&#187;,</p><p style=\"text-align: justify;\">la date&#160;:</p><p style=\"text-align: justify;\">&#171;&#160;1<sup>er</sup> juillet 2020&#160;&#187;.</p>",
    "exposeSommaire": "<p style=\"text-align: justify;\">Le pr&#233;sent amendement d&#233;cale de six mois l&#8217;entr&#233;e en vigueur du dispositif.</p>"
  },
  "representations": [
    {
      "nom": "PDF",
      "typeMime": {
        "type": "application",
        "subType": "PDF"
      },
      "statutRepresentation": {
        "verbatim": true,
        "canonique": true,
        "officielle": true,
        "transcription": false,
        "enregistrement": false
      },
      "contenu": {
        "documentURI": "/15/amendements/2135/CION-DVP/CD611.pdf"
      }
    }
  ],
  "sort": {
    "dateSaisie": "2019-09-04T00:43:55.000+02:00",
    "sortEnSeance": "Adopté"
  },
  "dateDepot": "2019-08-29T02:00:00.000+02:00",
  "dateDistribution": "2019-08-31T02:00:00.000+02:00",
  "article99": "0",
  "loiReference": {}
}