{
  "uid": "AMANR5L15SEA717460BTC1237P0D1N2929",
  "identifiant": {
    "legislature": "15",
    "numero": "2929",
    "numRect": "0",
    "saisine": {
      "texteLegislatifRef": "PRJLANR5L15BTC1237",
      "numeroPartiePLF": "0",
      "organeExamen": "PO717460",
      "mentionSecondeDeliberation": "1"
    }
  },
  "numeroLong": "2929",
  "etapeTexte": "1ère lecture (1ère assemblée saisie)",
  "triAmendement": "suaaaaaaaaaaaaaaaaaaaaaaaaaaaaaaaaaaaaaaaaaaaaaaaae",
  "cardinaliteAmdtMultiples": "1",
  "etat": "Discuté",
  "signataires": {
    "auteur": {
      "typeAuteur": "Rapporteur",
      "acteurRef": "PA719684",
      "organeRef": "PO757134",
      "groupePolitiqueRef": "PO730964"
    },
    "cosignatairesRefs": [
      "PA719684"
    ],
    "texteAffichable": "Mme&#160;Dubost, rapporteure au nom de la commission sp&#233;ciale charg&#233;e d&apos;examiner le projet de loi relatif &#224; la croissance et la transformation des entreprises"
  },
  "pointeurFragmentTexte": {
    "division": {
      "titre": "Article 73",
      "articleDesignationCourte": "ART. 73",
      "type": "ARTICLE",
      "avantAApres": "A",
      "divisionRattachee": "ARTICLE 73",
      "urlDivisionTexteVise": "/15/textes/1237.asp#D_Article_73"
    },
    "alinea": {
      "avantAApres": "Apres",
      "numero": "14"
    }
  },
  "corps": {
    "dispositif": "<p style=\"text-align: justify;\">I.&#160;&#8211;&#160;Apr&#232;s l&#8217;alin&#233;a&#160;14 ins&#233;rer les deux alin&#233;as suivants&#160;:</p><p style=\"text-align: justify;\"><i>aa</i>) Le <i>a</i> est compl&#233;t&#233; par un alin&#233;a ainsi r&#233;dig&#233;&#160;:</p><p style=\"text-align: justify;\">&#171;&#160;Les articles L.&#160;611&#8209;5 et L.&#160;611&#8209;6 sont applicables dans leur r&#233;daction r&#233;sultant de la loi n&#176;&#160;&#160;&#160;&#160;&#160;&#160;du&#160;&#160;&#160;&#160;&#160;&#160;relative &#224; la croissance et la transformation des entreprises&#160;;&#160;&#187;</p><p style=\"text-align: justify;\">II.&#160;&#8211;&#160;En cons&#233;quence, &#224; l&#8217;alin&#233;a&#160;16, apr&#232;s le mot&#160;:</p><p style=\"text-align: justify;\">&#171;&#160;articles&#160;&#187;,</p><p style=\"text-align: justify;\">ins&#233;rer la r&#233;f&#233;rence&#160;:</p><p style=\"text-align: justify;\">&#171;&#160;L.&#160;620&#8209;1,&#160;&#187;.</p><p style=\"text-align: justify;\">III.&#160;&#8211;&#160;En cons&#233;quence, au m&#234;me alin&#233;a, apr&#232;s la r&#233;f&#233;rence&#160;:</p><p style=\"text-align: justify;\">&#171;&#160;L.&#160;622&#8209;24&#160;&#187;,</p><p style=\"text-align: justify;\">ins&#233;rer la r&#233;f&#233;rence&#160;:</p><p style=\"text-align: justify;\">&#171;&#160;, L.&#160;626&#8209;12&#160;&#187;</p><p style=\"text-align: justify;\">IV.&#160;&#8211;&#160;En cons&#233;quence, &#224; l&#8217;alin&#233;a&#160;18, apr&#232;s le mot&#160;:</p><p style=\"text-align: justify;\">&#171;&#160;articles&#160;&#187;,</p><p style=\"text-align: justify;\">ins&#233;rer la r&#233;f&#233;rence&#160;:</p><p style=\"text-align: justify;\">&#171;&#160;L.&#160;631&#8209;2,&#160;&#187;.</p><p style=\"text-align: justify;\">V.&#160;&#8211;&#160;En cons&#233;quence, compl&#233;ter l&#8217;alin&#233;a&#160;21, par les mots&#160;:</p><p style=\"text-align: justify;\">&#171;&#160;, &#224; l&#8217;exclusion de l&#8217;article L.&#160;640&#8209;2 qui est applicable dans sa r&#233;daction r&#233;sultant de la loi n&#176;&#160;&#160;&#160;&#160;&#160;&#160;du&#160;&#160;&#160;&#160;&#160;&#160;relative &#224; la croissance et la transformation des entreprises&#160;;&#160;&#187;.</p><p style=\"text-align: justify;\">VI.&#160;&#8211;&#160;En cons&#233;quence, &#224; l&#8217;alin&#233;a&#160;22, substituer aux mots&#160;:</p><p style=\"text-align: justify;\">&#171;&#160;qui est applicable dans sa&#160;&#187;</p><p style=\"text-align: justify;\">les mots&#160;:</p><p style=\"text-align: justify;\">&#171;&#160;et de l&#8217;article L.&#160;641&#8209;11 qui sont applicables dans leur&#160;&#187;.</p>",
    "exposeSommaire": "<p style=\"text-align: justify;\">Cet amendement &#233;tend aux &#238;les Wallis-et-Futuna les dispositions des articles 19 <i>quater</i> et 19&#160;<i>quinquies</i> du pr&#233;sent projet modifiant le livre VI du code de commerce.</p>"
  },
  "representations": [
    {
      "nom": "PDF",
      "typeMime": {
        "type": "application",
        "subType": "PDF"
      },
      "statutRepresentation": {
        "verbatim": true,
        "canonique": true,
        "officielle": true,
        "transcription": false,
        "enregistrement": false
      },
      "contenu": {
        "documentURI": "/15/amendements/1237/AN/2929.pdf"
      }
    }
  ],
  "seanceDiscussion": "RUANR5L15S2019IDS21349",
  "sort": {
    "dateSaisie": "2018-10-05T18:03:45.000+02:00",
    "sortEnSeance": "Adopté"
  },
  "dateDepot": "2018-10-04T02:00:00.000+02:00",
  "dateDistribution": "2018-10-04T02:00:00.000+02:00",
  "article99": "1",
  "loiReference": {}
}