{
  "uid": "AMANR5L15SEA717460B1490P0D1N390",
  "identifiant": {
    "legislature": "15",
    "numero": "390",
    "numRect": "0",
    "saisine": {
      "texteLegislatifRef": "PRJLANR5L15B1490",
      "numeroPartiePLF": "0",
      "organeExamen": "PO717460",
      "mentionSecondeDeliberation": "1"
    }
  },
  "numeroLong": "390",
  "etapeTexte": "Nouvelle Lecture",
  "triAmendement": "oboaaaaaaaaaaaaaaaaaaaaaaaaaaaaaaaaaaaaaaaaaaaaaaacl",
  "cardinaliteAmdtMultiples": "1",
  "etat": "Discuté",
  "signataires": {
    "auteur": {
      "typeAuteur": "Depute",
      "acteurRef": "PA330909",
      "groupePolitiqueRef": "PO730934"
    },
    "cosignatairesRefs": [
      "PA330909",
      "PA605036",
      "PA721474",
      "PA709315",
      "PA266793",
      "PA267260",
      "PA721070",
      "PA346054",
      "PA767"
    ],
    "texteAffichable": "M.&#160;Descoeur,  M.&#160;Cattin, M.&#160;Abad, Mme&#160;Poletti, M.&#160;Bony, M.&#160;Viala, M.&#160;Viry, M.&#160;Emmanuel&#160;Maquet et Mme&#160;Ramassamy"
  },
  "pointeurFragmentTexte": {
    "missionVisee": {
      "idMissionAN": "702",
      "libelleMission": "Cohésion des territoires",
      "codeMissionPLF": "B",
      "libelleMissionPLF": "Répartition, par mission et programme, des crédits du budget général"
    },
    "division": {
      "titre": "Article 74 bis",
      "articleDesignationCourte": "ART. 74 BIS",
      "type": "ARTICLE",
      "avantAApres": "A",
      "divisionRattachee": "ARTICLE 74 BIS",
      "urlDivisionTexteVise": "/15/textes/1490.asp#D_Article_74_bis"
    },
    "alinea": {
      "numero": "9"
    }
  },
  "corps": {
    "dispositif": "<p style=\"text-align: justify;\">Compl&#233;ter l&#8217;alin&#233;a&#160;9 par les mots&#160;:</p><p style=\"text-align: justify;\">&#171;&#160;lorsque l&#8217;op&#233;ration de travaux de r&#233;habilitation a fait l&#8217;objet d&#8217;une autorisation de la commune d&#233;livr&#233;e dans des conditions d&#233;finies par d&#233;cret.&#160;&#187;</p>",
    "exposeSommaire": "<p style=\"text-align: justify;\">Le pr&#233;sent amendement est un amendement de repli de la mesure adopt&#233;e au S&#233;nat conduisant au r&#233;haussement de 300.000&#160;&#8364; &#224; 400.000&#160;&#8364; du plafond des co&#251;ts pris en compte pour le calcul de la r&#233;duction d&#8217;imp&#244;t du nouveau dispositif &#171;&#160;Denormandie&#160;&#187;.</p><p style=\"text-align: justify;\">La disposition qu&#8217;il pr&#233;voit permettra d&#8217;encadrer ce nouveau plafond en le r&#233;servant aux seules op&#233;rations de r&#233;habilitation de logements autoris&#233;es par les collectivit&#233;s &#224; qui elles auront &#233;t&#233; pr&#233;sent&#233;es.</p><p style=\"text-align: justify;\">En l&#8217;esp&#232;ce, il s&#8217;agira de favoriser au sein de projets de r&#233;habilitation d&#8217;immeubles la production non plus exclusivement de studios/T2 mais d&#8217;appartements de taille diverse y compris de logements familiaux de type T3 et T4 conform&#233;ment aux attentes de nos communes de voir revenir s&#8217;installer des familles dans leur centre ville.</p><p style=\"text-align: justify;\">Les conditions de cette autorisation seront d&#233;finies dans le d&#233;cret pr&#233;cisant la nature des travaux d&#8217;am&#233;lioration &#233;ligibles au nouveau dispositif.</p>"
  },
  "representations": [
    {
      "nom": "PDF",
      "typeMime": {
        "type": "application",
        "subType": "PDF"
      },
      "statutRepresentation": {
        "verbatim": true,
        "canonique": true,
        "officielle": true,
        "transcription": false,
        "enregistrement": false
      },
      "contenu": {
        "documentURI": "/15/amendements/1490/AN/390.pdf"
      }
    }
  ],
  "seanceDiscussion": "RUANR5L15S2019IDS21433",
  "sort": {
    "dateSaisie": "2018-12-19T04:35:51.000+01:00",
    "sortEnSeance": "Tombé"
  },
  "dateDepot": "2018-12-14T01:00:00.000+01:00",
  "dateDistribution": "2018-12-17T01:00:00.000+01:00",
  "article99": "0",
  "loiReference": {}
}