{
  "uid": "AMANR5L15PO420120B0904P0D1N350",
  "identifiant": {
    "legislature": "15",
    "numero": "350",
    "numRect": "0",
    "saisine": {
      "texteLegislatifRef": "PRJLANR5L15B0904",
      "numeroPartiePLF": "0",
      "organeExamen": "PO420120",
      "mentionSecondeDeliberation": "0"
    }
  },
  "numeroLong": "AS350",
  "etapeTexte": "1ère lecture (1ère assemblée saisie)",
  "triAmendement": "bolzri",
  "cardinaliteAmdtMultiples": "1",
  "etat": "Discuté",
  "signataires": {
    "auteur": {
      "typeAuteur": "Depute",
      "acteurRef": "PA267233",
      "groupePolitiqueRef": "PO730946"
    },
    "cosignatairesRefs": [
      "PA267233"
    ],
    "texteAffichable": "M.&#160;Bouillon"
  },
  "pointeurFragmentTexte": {
    "division": {
      "titre": "Article 17",
      "articleDesignationCourte": "ART. 17",
      "type": "ARTICLE",
      "avantAApres": "A",
      "divisionRattachee": "ARTICLE 17",
      "urlDivisionTexteVise": "/15/textes/0904.asp#D_Article_17"
    },
    "alinea": {
      "avantAApres": "Apres",
      "numero": "42"
    }
  },
  "corps": {
    "dispositif": "<p style=\"text-align: justify;\">Apr&#232;s l&#8217;alin&#233;a&#160;42, ins&#233;rer l&#8217;alin&#233;a suivant&#160;:</p><p style=\"text-align: justify;\">&#171;<i>&#160;e)</i> Le financement des formations obligatoires et d&#233;finies r&#233;glementairement ou par accord de branche &#233;tendu&#160;;&#160;&#187;.</p>",
    "exposeSommaire": "<p style=\"text-align: justify;\">De nombreux secteurs d&#8217;activit&#233;s sont r&#233;glement&#233;s par des formations professionnelles obligatoires tant pour l&#8217;acc&#232;s aux m&#233;tiers que le maintien dans l&#8217;emploi des salari&#233;s.</p><p style=\"text-align: justify;\">Le dispositif actuel de financement de la formation professionnelle permet aujourd&#8217;hui &#224; toutes les entreprises, quelque soit leur nombre de salari&#233;s, d&#8217;affecter les fonds de la formation professionnelle au financement de ces formations impos&#233;es par la r&#233;glementation principalement pour des raisons de s&#233;curit&#233; des biens et des personnes.</p><p style=\"text-align: justify;\">Le nouveau dispositif, pr&#233;vu &#224; l&#8217;article&#160;17 du projet de loi, conduit, pour les entreprises de plus de 50 salari&#233;s, &#224; exclure ces formations du champ d&#8217;&#233;ligibilit&#233; du financement des formations professionnelles.</p><p style=\"text-align: justify;\">Elles devront &#234;tre financ&#233;es en totalit&#233; par ces entreprises en plus de leur contribution unique &#224; la formation professionnelle et &#224; l&#8217;apprentissage.</p><p style=\"text-align: justify;\">Afin de limiter les effets de seuil entre les entreprises selon leur effectif et de pr&#233;server l&#8217;objectif de s&#233;curit&#233; des biens et des personnes vis&#233; par les formations r&#233;glement&#233;es, il convient que la contribution unique &#224; la formation professionnelle et &#224; l&#8217;apprentissage soit &#233;galement affect&#233;e au financement des formations professionnelles obligatoires.</p>"
  },
  "representations": [
    {
      "nom": "PDF",
      "typeMime": {
        "type": "application",
        "subType": "PDF"
      },
      "statutRepresentation": {
        "verbatim": true,
        "canonique": true,
        "officielle": true,
        "transcription": false,
        "enregistrement": false
      },
      "contenu": {
        "documentURI": "/15/amendements/0904/CION-SOC/AS350.pdf"
      }
    }
  ],
  "sort": {
    "dateSaisie": "2018-05-31T17:07:07.000+02:00",
    "sortEnSeance": "Tombé"
  },
  "dateDepot": "2018-05-24T02:00:00.000+02:00",
  "dateDistribution": "2018-05-29T02:00:00.000+02:00",
  "article99": "0",
  "loiReference": {}
}