{
  "uid": "AMANR5L15SEA717460BTC1237P0D1N1807",
  "identifiant": {
    "legislature": "15",
    "numero": "1807",
    "numRect": "0",
    "saisine": {
      "texteLegislatifRef": "PRJLANR5L15BTC1237",
      "numeroPartiePLF": "0",
      "organeExamen": "PO717460",
      "mentionSecondeDeliberation": "1"
    }
  },
  "numeroLong": "1807",
  "etapeTexte": "1ère lecture (1ère assemblée saisie)",
  "triAmendement": "obiaaaaaaaaaaaaaaaaaaaaaaaaaaaaaaaaaaaaaaaaaaaaaaauw",
  "cardinaliteAmdtMultiples": "1",
  "etat": "Discuté",
  "signataires": {
    "auteur": {
      "typeAuteur": "Depute",
      "acteurRef": "PA721498",
      "groupePolitiqueRef": "PO730964"
    },
    "cosignatairesRefs": [
      "PA721498"
    ],
    "texteAffichable": "M.&#160;Guerini"
  },
  "pointeurFragmentTexte": {
    "division": {
      "titre": "Article 61 octies",
      "articleDesignationCourte": "ART. 61 OCTIES",
      "type": "ARTICLE",
      "avantAApres": "A",
      "divisionRattachee": "ARTICLE 61 OCTIES",
      "urlDivisionTexteVise": "/15/textes/1237.asp#D_Article_61_octies"
    },
    "alinea": {
      "avantAApres": "Apres",
      "numero": "17"
    }
  },
  "corps": {
    "dispositif": "<p style=\"text-align: justify;\">Apr&#232;s l&#8217;alin&#233;a&#160;17, ins&#233;rer l&#8217;alin&#233;a suivant&#160;:&#160;</p><p style=\"text-align: justify;\">&#171;&#160;Les dispositions des articles 913 et 920 du code civil ne sont pas applicables aux lib&#233;ralit&#233;s consenties &#224; un fonds de p&#233;rennit&#233; &#233;conomique et qui portent sur des titres de capital ou parts d&#8217;une soci&#233;t&#233; apport&#233;s lors de la constitution du fonds, quel que soit le nombre d&#8217;enfants laiss&#233;s par le disposant &#224; son d&#233;c&#232;s.&#160;&#187;</p>",
    "exposeSommaire": "<p style=\"text-align: justify;\">A l&#8217;heure o&#249; l&#8217;on souhaite d&#233;velopper un mod&#232;le de capitalisme plus responsable, la fondation actionnaire repr&#233;sente une solution pertinente. Adopt&#233;e par plusieurs milliers d&#8217;entreprise en Su&#232;de, au Danemark ou en Allemagne, le mod&#232;le reste embryonnaire en France avec moins d&#8217;une demi-douzaine d&#8217;entreprises concern&#233;es.</p><p style=\"text-align: justify;\">Parmi les freins &#224; son d&#233;veloppement point&#233; par un rapport de l&#8217;Inspection des Finances d&#8217;avril 2017 figure les modalit&#233;s de calcul de la r&#233;serve h&#233;r&#233;ditaire[1]. Le rapport souligne la n&#233;cessit&#233; d&#8217;assouplir les r&#232;gles actuelles qui peuvent emp&#234;cher la transmission, &#224; moins que les h&#233;ritiers renoncent &#224; une partie de leurs droits.&#160;</p><p style=\"text-align: justify;\">De mani&#232;re &#224; favoriser la cr&#233;ation des [fonds de p&#233;rennit&#233; &#233;conomique], le pr&#233;sent amendement propose de ne pas soumettre l&#8217;apport des titres ou des parts sociales lors de la constitution aux r&#232;gles de la r&#233;serve h&#233;r&#233;ditaire et de d&#233;roger aux possibilit&#233;s offertes aux h&#233;ritiers d&#8217;exercer leur action en r&#233;duction.&#160;</p><p style=\"text-align: justify;\"><br />[1] Alexandre Jevakhoff, David Cavaillol, IGF, &#171;&#160;Le r&#244;le &#233;conomique des fondations&#160;&#187;, Avril 2017</p>"
  },
  "representations": [
    {
      "nom": "PDF",
      "typeMime": {
        "type": "application",
        "subType": "PDF"
      },
      "statutRepresentation": {
        "verbatim": true,
        "canonique": true,
        "officielle": true,
        "transcription": false,
        "enregistrement": false
      },
      "contenu": {
        "documentURI": "/15/amendements/1237/AN/1807.pdf"
      }
    }
  ],
  "seanceDiscussion": "RUANR5L15S2019IDS21349",
  "sort": {
    "dateSaisie": "2018-10-05T11:27:53.000+02:00",
    "sortEnSeance": "Retiré"
  },
  "dateDepot": "2018-09-21T02:00:00.000+02:00",
  "dateDistribution": "2018-09-26T02:00:00.000+02:00",
  "article99": "0",
  "loiReference": {}
}