{
  "uid": "AMANR5L15SEA717460BTC1767P0D1N1061",
  "identifiant": {
    "legislature": "15",
    "numero": "1061",
    "numRect": "0",
    "saisine": {
      "texteLegislatifRef": "PRJLANR5L15BTC1767",
      "numeroPartiePLF": "0",
      "organeExamen": "PO717460",
      "mentionSecondeDeliberation": "0"
    }
  },
  "numeroLong": "1061",
  "etapeTexte": "1ère lecture (1ère assemblée saisie)",
  "triAmendement": "baiaaaaaaaaaaaaaaaaaaaaaaaaaaaaaaaaaaaaaaaaaaaaaaabiyzz",
  "cardinaliteAmdtMultiples": "1",
  "etat": "Discuté",
  "signataires": {
    "auteur": {
      "typeAuteur": "Depute",
      "acteurRef": "PA719592",
      "groupePolitiqueRef": "PO730964"
    },
    "cosignatairesRefs": [
      "PA720814",
      "PA719100",
      "PA719092",
      "PA721876",
      "PA719890",
      "PA721398",
      "PA720222",
      "PA609520",
      "PA718876",
      "PA721450",
      "PA720932",
      "PA721800",
      "PA720342",
      "PA720074",
      "PA719592",
      "PA720030",
      "PA606639",
      "PA719230",
      "PA267336",
      "PA719480",
      "PA719778",
      "PA720790",
      "PA607155",
      "PA722366",
      "PA719294",
      "PA719952",
      "PA721434",
      "PA720054"
    ],
    "texteAffichable": "M.&#160;Simian,  Mme&#160;Lardet, Mme&#160;Pompili, M.&#160;Gaillard, M.&#160;Giraud, M.&#160;Jolivet, Mme&#160;Brulebois, M.&#160;Matras, M.&#160;Besson-Moreau, Mme&#160;Tuffnell, M.&#160;Ardouin, M.&#160;Morenas, Mme&#160;Le Peih, Mme&#160;Lenne, M.&#160;Haury, M.&#160;Da Silva, M.&#160;Fugit, M.&#160;Vignal, M.&#160;Kerlogot, Mme&#160;Clapot, M.&#160;Daniel, Mme&#160;Degois, M.&#160;Cazenove, Mme&#160;Janvier, M.&#160;Freschi, M.&#160;Grau, M.&#160;Girardin et M.&#160;Mis"
  },
  "pointeurFragmentTexte": {
    "division": {
      "titre": "Article 5 bis",
      "articleDesignationCourte": "APRÈS ART. 5 BIS",
      "type": "ARTICLE",
      "avantAApres": "Apres",
      "divisionRattachee": "APRÈS L'ARTICLE 5 BIS, insérer l'article suivant:",
      "articleAdditionnel": "1",
      "urlDivisionTexteVise": "/15/textes/1767.asp#D_Article_5_bis"
    }
  },
  "corps": {
    "dispositif": "<p style=\"text-align: justify;\">I.&#160;&#8211;&#160;&#192; titre exp&#233;rimental, pour une dur&#233;e de trois ans dans les r&#233;gions se portant volontaires, dans un d&#233;lai de six&#160;mois &#224; compter de la d&#233;livrance de leur dipl&#244;me d&#8217;&#201;tat de docteur de m&#233;decine, les m&#233;decins d&#233;sireux d&#8217;exercer leurs fonctions &#224; titre lib&#233;ral en font la d&#233;claration aupr&#232;s de l&#8217;agence r&#233;gionale de sant&#233; de la r&#233;gion dans laquelle ils souhaitent &#233;tablir sa r&#233;sidence professionnelle. Ils sont tenus de s&#8217;installer pour une dur&#233;e d&#8217;au moins trois&#160;ans dans une zone caract&#233;ris&#233;e par une offre de soins insuffisante ou des difficult&#233;s dans l&#8217;acc&#232;s aux soins, d&#233;finie en application de l&#8217;article&#160;L.&#160;1434&#8209;4.</p><p style=\"text-align: justify;\">Le fait, pour le m&#233;decin, de se soustraire aux obligations pr&#233;vues par le pr&#233;sent article entra&#238;ne l&#8217;application d&#8217;une amende dont le montant est &#233;gal au produit du nombre entier de mois restant &#224; courir jusqu&#8217;&#224; l&#8217;extinction de ces obligations et d&#8217;une amende mensuelle de base, dont le montant est fix&#233; &#224; 1&#160;000&#160;euros. Le recouvrement et le contentieux de cette amende sont r&#233;gis par les dispositions applicables aux taxes sur le chiffre d&#8217;affaires.&#160;&#187;</p><p style=\"text-align: justify;\">II.&#160;&#8211;&#160;Au plus tard six mois avant la fin de l&#8217;exp&#233;rimentation, le Gouvernement remet au Parlement un bilan de cette exp&#233;rimentation, qui porte notamment sur l&#8217;opportunit&#233; de la g&#233;n&#233;ralisation du dispositif.</p>",
    "exposeSommaire": "<p style=\"text-align: justify;\">Amendement de repli. Le pr&#233;sent amendement pr&#233;voit &#224; titre exp&#233;rimental - pour une dur&#233;e de trois ans dans les r&#233;gions volontaires - que tout m&#233;decin nouvellement dipl&#244;m&#233; doit, &#224; l&#8217;issue de sa formation, et pour une dur&#233;e minimum de trois&#160;ans, s&#8217;installer dans une zone g&#233;ographique souffrant d&#8217;un nombre insuffisant de m&#233;decins pour r&#233;pondre aux besoins de la population en termes d&#8217;acc&#232;s aux soins.</p><p style=\"text-align: justify;\">L&#8217;objet d&#8217;un tel amendement est de lutter contre la d&#233;sertification m&#233;dicale et contre la difficult&#233; d&#8217;acc&#232;s aux soins dans les zones peu denses et les territoires ruraux. Si les dispositifs existants ont constitu&#233; de premi&#232;res &#233;tapes, le rapport de la Cour des Comptes publi&#233; en&#160;2017 a d&#233;montr&#233; que ces nombreux dispositifs incitatifs mis en place par l&#8217;assurance maladie et l&#8217;&#201;tat n&#8217;ont pas permis de lutter efficacement contre les disparit&#233;s territoriales, qui continuent de s&#8217;aggraver.</p><p style=\"text-align: justify;\">Afin de rem&#233;dier &#224; une telle situation, et de compl&#233;<i>ter</i> les dispositifs d&#8217;incitation existants &#224; l&#8217;installation dans les zones sous-dot&#233;es, il est donc propos&#233; de diriger les jeunes m&#233;decins lib&#233;raux vers ces territoires.</p>"
  },
  "representations": [
    {
      "nom": "PDF",
      "typeMime": {
        "type": "application",
        "subType": "PDF"
      },
      "statutRepresentation": {
        "verbatim": true,
        "canonique": true,
        "officielle": true,
        "transcription": false,
        "enregistrement": false
      },
      "contenu": {
        "documentURI": "/15/amendements/1767/AN/1061.pdf"
      }
    }
  ],
  "seanceDiscussion": "RUANR5L15S2019IDS21568",
  "sort": {
    "dateSaisie": "2019-03-21T00:33:08.000+01:00",
    "sortEnSeance": "Non soutenu"
  },
  "dateDepot": "2019-03-15T01:00:00.000+01:00",
  "dateDistribution": "2019-03-18T01:00:00.000+01:00",
  "article99": "0",
  "loiReference": {}
}