{
  "uid": "AMANR5L15PO419604B0383P0D1N60",
  "identifiant": {
    "legislature": "15",
    "numero": "60",
    "numRect": "0",
    "saisine": {
      "texteLegislatifRef": "PRJLANR5L15B0383",
      "numeroPartiePLF": "0",
      "organeExamen": "PO419604",
      "mentionSecondeDeliberation": "0"
    }
  },
  "numeroLong": "AC60",
  "etapeTexte": "1ère lecture (1ère assemblée saisie)",
  "triAmendement": "q",
  "cardinaliteAmdtMultiples": "1",
  "etat": "Discuté",
  "signataires": {
    "auteur": {
      "typeAuteur": "Depute",
      "acteurRef": "PA718868",
      "groupePolitiqueRef": "PO730958"
    },
    "cosignatairesRefs": [
      "PA721210",
      "PA720422",
      "PA718868",
      "PA721202",
      "PA720286",
      "PA722142",
      "PA720430",
      "PA2150",
      "PA588884",
      "PA719578",
      "PA721226",
      "PA721960",
      "PA720846",
      "PA720892",
      "PA721062",
      "PA719676"
    ],
    "texteAffichable": "M.&#160;Larive,  Mme&#160;Autain, M.&#160;Bernalicis, M.&#160;Coquerel, M.&#160;Corbi&#232;re, Mme&#160;Fiat, M.&#160;Lachaud, M.&#160;M&#233;lenchon, Mme&#160;Obono, Mme&#160;Panot, M.&#160;Prud&apos;homme, M.&#160;Quatennens, M.&#160;Ratenon, Mme&#160;Ressiguier, Mme&#160;Rubin et M.&#160;Ruffin"
  },
  "pointeurFragmentTexte": {
    "division": {
      "titre": "Article 12",
      "articleDesignationCourte": "ART. 12",
      "type": "ARTICLE",
      "avantAApres": "A",
      "divisionRattachee": "ARTICLE 12",
      "urlDivisionTexteVise": "/15/textes/0383.asp#D_Article_12"
    },
    "alinea": {
      "avantAApres": "Apres",
      "numero": "1"
    }
  },
  "corps": {
    "dispositif": "<p style=\"text-align: justify;\">Apr&#232;s l&#8217;alin&#233;a&#160;1, ins&#233;rer l&#8217;alin&#233;a suivant&#160;:</p><p style=\"text-align: justify;\">&#171;&#160;I&#160;<i>bis&#160;(nouveau)</i>.&#160;&#8211;&#160;Ces organismes veillent &#224; ce que ces logements &#224; usage locatif, au del&#224; de leur p&#233;riode d&#8217;usage temporaire pr&#233;vue au I, b&#233;n&#233;ficient principalement aux imp&#233;trants au droit au logement, notamment les requ&#233;rants au droit au logement opposable instaur&#233; par la loi n&#176; 2007&#8209;293 du 5 mars 2007 r&#233;formant la protection de l&#8217;enfance.&#160;&#187;</p>",
    "exposeSommaire": "<p style=\"text-align: justify;\">Ces jeux seront l&#8217;occasion r&#234;v&#233;e pour les entreprises de la construction et du BTP de r&#233;aliser des profits incommensurables, de l&#8217;ordre de 1 &#224; 1,8 milliards d&#8217;euros selon les pr&#233;visions du Centre de droit et d&#8217;&#233;conomie du sport (CDES) de Limoges. Les propri&#233;taires verront &#233;galement une bonne occasion d&#8217;augmenter leurs tarifs. Lors des JO de 2012 &#224; Londres, certains loyers ont &#233;t&#233; multipli&#233;s par cinq, &#224; proximit&#233; du village olympique.</p><p style=\"text-align: justify;\">Le d&#233;partement de la Seine-Saint-Denis, o&#249; est pr&#233;vu l&#8217;implantation d&#8217;un village olympique, est le d&#233;partement o&#249; 30&#160;% de la population vit sous le seuil de pauvret&#233;, c&#8217;est-&#224;-dire avec moins de 961&#160;euros par mois. Le gouvernement envisage de transformer le b&#226;ti des jeux en &#233;co-quartiers apr&#232;s la manifestation. Nous refusons que les investissements r&#233;alis&#233;s &#224; l&#8217;occasion de ces jeux participe de la gentrification alors m&#234;me que des milliers de m&#233;nages pr&#233;caires sont en attente d&#8217;un logement. 57 000 m&#233;nages reconnus comme prioritaires sont toujours en attente d&#8217;une proposition de logement depuis un &#224; sept ans, dont 45.000 en Ile-de-France. Enfin, 520 000 situations d&#8217;urgences absolues restent sans r&#233;ponse. Et c&#8217;est sans parler des 4 millions de personnes mal log&#233;es alors m&#234;me que seuls 700 000 dossiers de recours DALO ont &#233;t&#233; d&#233;pos&#233;s. C&#8217;est donc le sens de cet amendement que de vouloir garantir l&#8217;attribution de ces logements prioritairement aux requ&#233;rants au droit au logement opposable &#224; l&#8217;issue de la manifestation.</p>"
  },
  "representations": [
    {
      "nom": "PDF",
      "typeMime": {
        "type": "application",
        "subType": "PDF"
      },
      "statutRepresentation": {
        "verbatim": true,
        "canonique": true,
        "officielle": true,
        "transcription": false,
        "enregistrement": false
      },
      "contenu": {
        "documentURI": "/15/amendements/0383/CION-CEDU/AC60.pdf"
      }
    }
  ],
  "sort": {
    "dateSaisie": "2017-12-12T10:26:26.000+01:00",
    "sortEnSeance": "Rejeté"
  },
  "dateDepot": "2017-12-07T01:00:00.000+01:00",
  "dateDistribution": "2017-12-08T01:00:00.000+01:00",
  "article99": "0",
  "loiReference": {}
}