{
  "uid": "AMANR5L15SEA717460BTC2063P0D1N624",
  "identifiant": {
    "legislature": "15",
    "numero": "624",
    "numRect": "0",
    "saisine": {
      "texteLegislatifRef": "PRJLANR5L15BTC2063",
      "numeroPartiePLF": "0",
      "organeExamen": "PO717460",
      "mentionSecondeDeliberation": "0"
    }
  },
  "numeroLong": "624",
  "etapeTexte": "1ère lecture (1ère assemblée saisie)",
  "triAmendement": "esaaaaaaaaaaaaaaaaaaaaaaaaaaaaaaaaaaaaaaaaaaaaaaaaac",
  "cardinaliteAmdtMultiples": "1",
  "etat": "Irrecevable",
  "signataires": {
    "auteur": {
      "typeAuteur": "Depute",
      "acteurRef": "PA719980",
      "groupePolitiqueRef": "PO730964"
    },
    "cosignatairesRefs": [
      "PA719980"
    ],
    "texteAffichable": "M.&#160;Borowczyk"
  },
  "pointeurFragmentTexte": {
    "division": {
      "titre": "Article 3 duodecies",
      "articleDesignationCourte": "APRÈS ART. 3 DUODECIES",
      "type": "ARTICLE",
      "avantAApres": "Apres",
      "divisionRattachee": "APRÈS L'ARTICLE 3 DUODECIES, insérer l'article suivant:",
      "articleAdditionnel": "1",
      "urlDivisionTexteVise": "/15/textes/2063.asp#D_Article_3_duodecies"
    }
  },
  "corps": {},
  "representations": [
    {
      "nom": "PDF",
      "typeMime": {
        "type": "application",
        "subType": "PDF"
      },
      "statutRepresentation": {
        "verbatim": true,
        "canonique": true,
        "officielle": true,
        "transcription": false,
        "enregistrement": false
      },
      "contenu": {
        "documentURI": "/15/amendements/2063/AN/624.pdf"
      }
    }
  ],
  "dateDepot": "2019-06-22T02:00:00.000+02:00",
  "dateDistribution": "2019-06-24T02:00:00.000+02:00",
  "article99": "0",
  "loiReference": {
    "codeLoi": "c environnement",
    "divisionCodeLoi": "L214-17"
  }
}