{
  "uid": "AMANR5L15PO419610B0846P0D1N1131",
  "identifiant": {
    "legislature": "15",
    "numero": "1131",
    "numRect": "0",
    "saisine": {
      "texteLegislatifRef": "PRJLANR5L15B0846",
      "numeroPartiePLF": "0",
      "organeExamen": "PO419610",
      "mentionSecondeDeliberation": "0"
    }
  },
  "numeroLong": "CE1131",
  "etapeTexte": "1ère lecture (1ère assemblée saisie)",
  "triAmendement": "fi",
  "cardinaliteAmdtMultiples": "1",
  "etat": "Discuté",
  "signataires": {
    "auteur": {
      "typeAuteur": "Depute",
      "acteurRef": "PA720378",
      "groupePolitiqueRef": "PO730964"
    },
    "cosignatairesRefs": [
      "PA720378"
    ],
    "texteAffichable": "M.&#160;Lioger, rapporteur"
  },
  "pointeurFragmentTexte": {
    "division": {
      "titre": "Article 15",
      "articleDesignationCourte": "ART. 15",
      "type": "ARTICLE",
      "avantAApres": "A",
      "divisionRattachee": "ARTICLE 15",
      "urlDivisionTexteVise": "/15/textes/0846.asp#D_Article_15"
    },
    "alinea": {
      "avantAApres": "A",
      "numero": "5",
      "alineaDesignation": "Alinéa 5"
    }
  },
  "corps": {
    "dispositif": "<p>&#192; l&#8217;alin&#233;a&#160;5, apr&#232;s la deuxi&#232;me occurrence du mot &#171;&#160;pr&#233;vue&#160;&#187;, ins&#233;rer les mots&#160;:</p><p>&#171;&#160;&#224; l&#8217;article L.&#160;341&#8209;10 du m&#234;me code&#160;&#187;.</p>",
    "exposeSommaire": "<p>Amendement de pr&#233;cision juridique.</p>"
  },
  "representations": [
    {
      "nom": "PDF",
      "typeMime": {
        "type": "application",
        "subType": "PDF"
      },
      "statutRepresentation": {
        "verbatim": true,
        "canonique": true,
        "officielle": true,
        "transcription": false,
        "enregistrement": false
      },
      "contenu": {
        "documentURI": "/15/amendements/0846/CION-ECO/CE1131.pdf"
      }
    }
  ],
  "sort": {
    "dateSaisie": "2018-05-16T17:03:05.000+02:00",
    "sortEnSeance": "Retiré"
  },
  "dateDepot": "2018-05-09T02:00:00.000+02:00",
  "dateDistribution": "2018-05-15T02:00:00.000+02:00",
  "article99": "0",
  "loiReference": {}
}