{
  "uid": "AMANR5L15SEA717460BTC0902P0D1N2552",
  "identifiant": {
    "legislature": "15",
    "numero": "2552",
    "numRect": "0",
    "saisine": {
      "texteLegislatifRef": "PRJLANR5L15BTC0902",
      "numeroPartiePLF": "0",
      "organeExamen": "PO717460",
      "mentionSecondeDeliberation": "0"
    }
  },
  "numeroLong": "2552",
  "etapeTexte": "1ère lecture (1ère assemblée saisie)",
  "triAmendement": "e",
  "cardinaliteAmdtMultiples": "1",
  "etat": "Irrecevable",
  "signataires": {
    "auteur": {
      "typeAuteur": "Depute",
      "acteurRef": "PA607619",
      "groupePolitiqueRef": "PO730964"
    },
    "cosignatairesRefs": [
      "PA607619"
    ],
    "texteAffichable": "M.&#160;Molac"
  },
  "pointeurFragmentTexte": {
    "division": {
      "titre": "Article 11 duovicies",
      "articleDesignationCourte": "APRÈS ART. 11 DUOVICIES",
      "type": "ARTICLE",
      "avantAApres": "Apres",
      "divisionRattachee": "APRÈS L'ARTICLE 11 DUOVICIES, insérer l'article suivant:",
      "articleAdditionnel": "1",
      "urlDivisionTexteVise": "/15/textes/0902.asp#D_Article_11_duovicies"
    }
  },
  "corps": {
    "dispositif": "<p style=\"text-align: justify;\">L&#8217;article L.&#160;111&#8209;2&#8209;2 du code rural et de la p&#234;che maritime est compl&#233;t&#233; par un II ainsi r&#233;dig&#233;&#160;:</p><p style=\"text-align: justify;\">&#171;&#160;II. &#8211;&#160;&#192; titre exp&#233;rimental et dans le cadre d&#8217;une convention, pendant une dur&#233;e de trois ans &#224; compter de la promulgation de la loi n&#176;... du ... pour l&#8217;&#233;quilibre des relations commerciales dans le secteur agricole et alimentaire et une alimentation saine et durable, l&#8217;&#201;tat peut confier aux r&#233;gions qui en font la demande au repr&#233;sentant de l&#8217;&#201;tat dans la r&#233;gion l&#8217;&#233;laboration, la mise en &#339;uvre et le suivi d&#8217;un ou plusieurs projets alimentaires territoriaux sur leur territoire pour une alimentation saine, durable, responsable et &#233;quitable. Les r&#233;gions sont inform&#233;es, le cas &#233;ch&#233;ant, des projets alimentaires territoriaux men&#233;s au sein de leur territoire et en assurent la coordination.</p><p style=\"text-align: justify;\">&#171;&#160;L&#8217;exp&#233;rimentation mentionn&#233;e &#224; l&#8217;alin&#233;a pr&#233;c&#233;dent fait l&#8217;objet d&#8217;une &#233;valuation dont les r&#233;sultats sont pr&#233;sent&#233;s au Parlement.&#160;&#187;</p>",
    "exposeSommaire": "<p style=\"text-align: justify;\">Le pr&#233;sent amendement adopt&#233; en Commission du d&#233;veloppement durable vise &#224; confier aux r&#233;gions qui le souhaitent un r&#244;le de chef de file dans la d&#233;finition des projets alimentaires territoriaux. Cette comp&#233;tence s&#8217;av&#232;re n&#233;cessaire pour r&#233;pondre aux attentes des administr&#233;s de relocalisation de la consommation alimentaire. Les r&#233;gions ayant la comp&#233;tence &#233;conomique et agricole, elles pourraient &#233;galement coordonner la politique alimentaire avec les autres collectivit&#233;s concern&#233;es et soutenir &#224; ce titre le financement et l&#8217;ing&#233;nierie des Projets Alimentaires Territoriaux.</p>"
  },
  "representations": [
    {
      "nom": "PDF",
      "typeMime": {
        "type": "application",
        "subType": "PDF"
      },
      "statutRepresentation": {
        "verbatim": true,
        "canonique": true,
        "officielle": true,
        "transcription": false,
        "enregistrement": false
      },
      "contenu": {
        "documentURI": "/15/amendements/0902/AN/2552.pdf"
      }
    }
  ],
  "dateDepot": "2018-05-17T02:00:00.000+02:00",
  "article99": "0",
  "loiReference": {
    "codeLoi": "c rural et pêche maritime",
    "divisionCodeLoi": "L111-2-2"
  }
}