{
  "uid": "AMANR5L15PO419865B2135P0D1N402",
  "identifiant": {
    "legislature": "15",
    "numero": "402",
    "numRect": "0",
    "saisine": {
      "texteLegislatifRef": "PRJLANR5L15B2135",
      "numeroPartiePLF": "0",
      "organeExamen": "PO419865",
      "mentionSecondeDeliberation": "0"
    }
  },
  "numeroLong": "CD402",
  "etapeTexte": "Nouvelle Lecture",
  "triAmendement": "bkiaaaaaaaaaaaaaaaaaaaaaaaaaaaaaaaaaaaaaaaaaaaaaaad",
  "cardinaliteAmdtMultiples": "1",
  "etat": "Discuté",
  "signataires": {
    "auteur": {
      "typeAuteur": "Depute",
      "acteurRef": "PA267233",
      "groupePolitiqueRef": "PO758835"
    },
    "cosignatairesRefs": [
      "PA267233"
    ],
    "texteAffichable": "M.&#160;Bouillon"
  },
  "pointeurFragmentTexte": {
    "division": {
      "titre": "Article 16",
      "articleDesignationCourte": "ART. 16",
      "type": "ARTICLE",
      "avantAApres": "A",
      "divisionRattachee": "ARTICLE 16",
      "urlDivisionTexteVise": "/15/textes/2135.asp#D_Article_16"
    },
    "alinea": {
      "numero": "2"
    }
  },
  "corps": {
    "dispositif": "<p style=\"text-align: justify;\">&#192; l&#8217;alin&#233;a&#160;2, apr&#232;s le mot&#160;:</p><p style=\"text-align: justify;\">&#171;&#160;commun&#160;&#187;,</p><p style=\"text-align: justify;\">ins&#233;rer les mots&#160;:</p><p style=\"text-align: justify;\">&#171;&#160;, aux v&#233;hicules automobiles b&#233;n&#233;ficiant d&#8217;un label &#171;&#160;auto-partage&#160;&#187;&#160;&#187;.</p>",
    "exposeSommaire": "<p style=\"text-align: justify;\">Le d&#233;veloppement des usages partag&#233;s des v&#233;hicules suppose de mettre en place des incitations et, notamment, des facilit&#233;s de circulation. Il appara&#238;t donc n&#233;cessaire, dans un souci d&#8217;&#233;quit&#233; et de coh&#233;rence par rapport &#224; l&#8217;objectif recherch&#233; (encourager l&#8217;usage partag&#233; des v&#233;hicules), d&#8217;accorder &#224; l&#8217;autopartage les m&#234;mes avantages que ceux donn&#233;s aux covoitureurs.</p><p style=\"text-align: justify;\">La labellisation des v&#233;hicules est assortie d&#8217;une vignette et permettra de r&#233;unir les plaques d&#8217;immatriculation &#224; des fins de contr&#244;le.</p>"
  },
  "representations": [
    {
      "nom": "PDF",
      "typeMime": {
        "type": "application",
        "subType": "PDF"
      },
      "statutRepresentation": {
        "verbatim": true,
        "canonique": true,
        "officielle": true,
        "transcription": false,
        "enregistrement": false
      },
      "contenu": {
        "documentURI": "/15/amendements/2135/CION-DVP/CD402.pdf"
      }
    }
  ],
  "sort": {
    "dateSaisie": "2019-09-02T23:48:34.000+02:00",
    "sortEnSeance": "Rejeté"
  },
  "dateDepot": "2019-08-27T02:00:00.000+02:00",
  "dateDistribution": "2019-08-31T02:00:00.000+02:00",
  "article99": "0",
  "loiReference": {}
}