{
  "uid": "AMANR5L15PO419865B1831P0D1N483",
  "identifiant": {
    "legislature": "15",
    "numero": "483",
    "numRect": "0",
    "saisine": {
      "texteLegislatifRef": "PRJLANR5L15B1831",
      "numeroPartiePLF": "0",
      "organeExamen": "PO419865",
      "mentionSecondeDeliberation": "0"
    }
  },
  "numeroLong": "CD483",
  "etapeTexte": "1ère lecture (2ème assemblée saisie)",
  "triAmendement": "idoaaaaaaaaaaaaaaaaaaaaaaaaaaaaaaaaaaaaaaaaaaaaaaazzzzzzzzzzzzzzzzzy",
  "cardinaliteAmdtMultiples": "1",
  "etat": "Discuté",
  "signataires": {
    "auteur": {
      "typeAuteur": "Depute",
      "acteurRef": "PA330909",
      "groupePolitiqueRef": "PO730934"
    },
    "cosignatairesRefs": [
      "PA332523",
      "PA266793",
      "PA330909",
      "PA643134",
      "PA334843",
      "PA712015"
    ],
    "texteAffichable": "M.&#160;Descoeur,  M.&#160;Dive, M.&#160;Verch&#232;re, Mme&#160;Valentin, M.&#160;Bony et Mme&#160;Dalloz"
  },
  "pointeurFragmentTexte": {
    "division": {
      "titre": "Article 1er A",
      "articleDesignationCourte": "ART. 1ER A",
      "type": "ARTICLE",
      "avantAApres": "A",
      "divisionRattachee": "ARTICLE 1ER A",
      "urlDivisionTexteVise": "/15/textes/1831.asp#D_Article_1er_A"
    },
    "alinea": {
      "numero": "6"
    }
  },
  "corps": {
    "dispositif": "<p style=\"text-align: justify;\">Compl&#233;ter l&#8217;alin&#233;a&#160;6 par les mots&#160;:</p><p style=\"text-align: justify;\">&#171;&#160;et ferroviaire&#160;&#187;.</p>",
    "exposeSommaire": "<p style=\"text-align: justify;\">Le fret ferroviaire pr&#233;sente une alternative tr&#232;s efficace au transport routier de marchandises, aussi bien sur les aspects d&#8217;accidentologie et de congestion que sur les aspects environnementaux.</p><p style=\"text-align: justify;\">Une politique ambitieuse pour redonner &#224; ce mode la place qu&#8217;il occupait au milieu du XX&#232;me si&#232;cle est une n&#233;cessit&#233; absolue pour r&#233;duire l&#8217;impact environnemental du transport de marchandises. C&#8217;est ce qui est demand&#233; &#224; travers cet amendement.</p>"
  },
  "representations": [
    {
      "nom": "PDF",
      "typeMime": {
        "type": "application",
        "subType": "PDF"
      },
      "statutRepresentation": {
        "verbatim": true,
        "canonique": true,
        "officielle": true,
        "transcription": false,
        "enregistrement": false
      },
      "contenu": {
        "documentURI": "/15/amendements/1831/CION-DVP/CD483.pdf"
      }
    }
  ],
  "sort": {
    "dateSaisie": "2019-05-20T19:51:07.000+02:00",
    "sortEnSeance": "Tombé"
  },
  "dateDepot": "2019-05-02T02:00:00.000+02:00",
  "dateDistribution": "2019-05-20T02:00:00.000+02:00",
  "article99": "0",
  "loiReference": {}
}