{
  "uid": "AMANR5L15SEA717460B0911P0D1N1408",
  "identifiant": {
    "legislature": "15",
    "numero": "1408",
    "numRect": "0",
    "saisine": {
      "texteLegislatifRef": "PRJLANR5L15B0911",
      "numeroPartiePLF": "0",
      "organeExamen": "PO717460",
      "mentionSecondeDeliberation": "0"
    }
  },
  "numeroLong": "1408",
  "etapeTexte": "1ère lecture (1ère assemblée saisie)",
  "triAmendement": "abzzhzzvzvzdzy",
  "cardinaliteAmdtMultiples": "1",
  "etat": "Discuté",
  "signataires": {
    "auteur": {
      "typeAuteur": "Depute",
      "acteurRef": "PA643145",
      "groupePolitiqueRef": "PO730946"
    },
    "cosignatairesRefs": [
      "PA335054",
      "PA719930",
      "PA405480",
      "PA333285",
      "PA1809",
      "PA335532",
      "PA340357",
      "PA342415",
      "PA608011",
      "PA429893",
      "PA608172",
      "PA333818",
      "PA340343",
      "PA608695",
      "PA605069",
      "PA609332",
      "PA607553",
      "PA610681",
      "PA1008",
      "PA332614",
      "PA643145",
      "PA1198",
      "PA642764",
      "PA267233",
      "PA609590",
      "PA1592",
      "PA337483",
      "PA588886",
      "PA720988",
      "PA508"
    ],
    "texteAffichable": "Mme&#160;Vainqueur-Christophe,  Mme&#160;Untermaier, Mme&#160;Rabault, M.&#160;Faure, M.&#160;Aviragnet, Mme&#160;Bareigts, Mme&#160;Battistel, Mme&#160;Bi&#233;mouret, M.&#160;Bouillon, M.&#160;Jean-Louis&#160;Bricout, M.&#160;Carvounas, M.&#160;Alain&#160;David, Mme&#160;Laurence&#160;Dumont, M.&#160;Garot, M.&#160;David&#160;Habib, M.&#160;Hutin, M.&#160;Juanico, Mme&#160;Karamanli, M.&#160;J&#233;r&#244;me&#160;Lambert, M.&#160;Le Foll, M.&#160;Letchimy, Mme&#160;Manin, Mme&#160;Pau-Langevin, Mme&#160;Pires Beaune, M.&#160;Potier, M.&#160;Pueyo, M.&#160;Pupponi, M.&#160;Saulignac, M.&#160;Vallaud, Mme&#160;Victory et les membres du groupe Nouvelle Gauche"
  },
  "pointeurFragmentTexte": {
    "division": {
      "titre": "Article PREMIER",
      "articleDesignationCourte": "AVANT ART. PREMIER",
      "type": "ARTICLE",
      "avantAApres": "Avant",
      "divisionRattachee": "AVANT L'ARTICLE PREMIER, insérer l'article suivant:",
      "articleAdditionnel": "1",
      "urlDivisionTexteVise": "/15/textes/0911.asp#D_Article_1er"
    }
  },
  "corps": {
    "dispositif": "<p style=\"text-align: justify;\">&#192; la deuxi&#232;me phrase du premier alin&#233;a de l&#8217;article&#160;1<sup>er</sup> de la Constitution, les mots&#160;: &#171;&#160;,&#160;de race&#160;&#187; sont supprim&#233;s.</p>",
    "exposeSommaire": "<p style=\"text-align: justify;\">La Constitution fran&#231;aise reconna&#238;t l&#8217;usage d&#8217;un terme dont l&#8217;application &#224; l&#8217;esp&#232;ce humaine est, non seulement fausse mais surtout choquante et dangereuse.</p><p style=\"text-align: justify;\">Utilis&#233; pour signifier la diff&#233;rence entre les groupes humains, ce terme s&#8217;attache &#224; des caract&#232;res apparents, le plus souvent visibles. En tout &#233;tat, le concept biologique de &#171;&#160;race&#160;&#187; n&#8217;est pas op&#233;rant pour l&#8217;esp&#232;ce humaine comme le reconna&#238;t l&#8217;ensemble des scientifiques. Terme polys&#233;mique et&#160;ondoyant, il s&#8217;av&#232;re dangereux politiquement et juridiquement par son ind&#233;termination et par son r&#244;le de support id&#233;ologique. Par la classification et la hi&#233;rarchisation qu&#8217;il induit, l&#8217;utilisation de ce terme, philosophiquement, historiquement et politiquement, permet de pr&#233;senter un ordre des valeurs justifiant, soi-disant scientifiquement, l&#8217;inacceptable.</p><p style=\"text-align: justify;\">Supprimer le support qu&#8217;est le mot ne supprime &#233;videmment pas le discours mais la l&#233;gitimit&#233; qu&#8217;il pourrait puiser dans la loi fondamentale. En effet, lorsque la Constitution interdit &#224; la loi d&#8217;&#233;tablir une distinction selon &#171;&#160;la race&#160;&#187;, elle l&#233;gitime paradoxalement et donc en creux l&#8217;opinion selon laquelle il existe des&#160;races humaines distinctes.</p><p style=\"text-align: justify;\">Le jugement de valeur &#224; partir des diff&#233;rences constat&#233;es qu&#8217;entra&#238;ne le terme &#171;&#160;race&#160;&#187; conduit invariablement au m&#234;me refus de l&#8217;autre alors que, tout au contraire, il convient d&#8217;accepter l&#8217;alt&#233;rit&#233; et la diff&#233;rence. Seule l&#8217;acceptation de celle-ci doit permettre de maintenir la diversit&#233; et la richesse de l&#8217;humanit&#233;.</p><p style=\"text-align: justify;\">C&#8217;est la raison pour laquelle, il vous est propos&#233; de supprimer le terme &#171;&#160;race&#160;&#187; de notre Constitution.</p><p style=\"text-align: justify;\">&#160;</p>"
  },
  "representations": [
    {
      "nom": "PDF",
      "typeMime": {
        "type": "application",
        "subType": "PDF"
      },
      "statutRepresentation": {
        "verbatim": true,
        "canonique": true,
        "officielle": true,
        "transcription": false,
        "enregistrement": false
      },
      "contenu": {
        "documentURI": "/15/amendements/0911/AN/1408.pdf"
      }
    }
  ],
  "seanceDiscussion": "RUANR5L15S2018IDS21163",
  "sort": {
    "dateSaisie": "2018-07-12T18:14:07.000+02:00",
    "sortEnSeance": "Tombé"
  },
  "dateDepot": "2018-07-05T02:00:00.000+02:00",
  "dateDistribution": "2018-07-08T02:00:00.000+02:00",
  "article99": "0",
  "loiReference": {
    "codeLoi": "Constitution",
    "divisionCodeLoi": "1"
  }
}