{
  "uid": "AMANR5L15PO59051B0936P0D1N10",
  "identifiant": {
    "legislature": "15",
    "numero": "10",
    "numRect": "0",
    "saisine": {
      "texteLegislatifRef": "PIONANR5L15B0936",
      "numeroPartiePLF": "0",
      "organeExamen": "PO59051",
      "mentionSecondeDeliberation": "0"
    }
  },
  "numeroLong": "CL10",
  "etapeTexte": "1ère lecture (1ère assemblée saisie)",
  "triAmendement": "b",
  "cardinaliteAmdtMultiples": "1",
  "etat": "Discuté",
  "signataires": {
    "auteur": {
      "typeAuteur": "Depute",
      "acteurRef": "PA330909",
      "groupePolitiqueRef": "PO730934"
    },
    "cosignatairesRefs": [
      "PA330909"
    ],
    "texteAffichable": "M.&#160;Descoeur"
  },
  "pointeurFragmentTexte": {
    "division": {
      "titre": "Article PREMIER",
      "articleDesignationCourte": "ART. PREMIER",
      "type": "ARTICLE",
      "avantAApres": "A",
      "divisionRattachee": "ARTICLE PREMIER",
      "urlDivisionTexteVise": "/15/textes/0936.asp#D_Article_1er"
    }
  },
  "corps": {
    "dispositif": "<p style=\"text-align: justify;\">R&#233;diger ainsi cet article&#160;:</p><p style=\"text-align: justify;\">&#171;&#160;Apr&#232;s le mot&#160;: &#171;&#160;motiv&#233;,&#160;&#187;, la fin de l&#8217;article L.&#160;2213&#8209;1&#8209;1 du code g&#233;n&#233;ral des collectivit&#233;s territoriales est ainsi r&#233;dig&#233;e&#160;: &#171;&#160;eu &#233;gard &#224; une n&#233;cessit&#233; de s&#233;curit&#233;, de circulation routi&#232;re et de mobilit&#233;, fixer pour tout ou partie des voies de l&#8217;agglom&#233;ration ouvertes &#224; la circulation publique une vitesse maximale autoris&#233;e dans le strict respect du code de la route, et dans la limite de 70&#160;km/h.&#160;&#187;&#160;&#187;</p>",
    "exposeSommaire": "<p style=\"text-align: justify;\">Cet amendement a pour objet de s&#8217;assurer de la coh&#233;rence de l&#8217;article 1<sup>er</sup> avec le droit existant, en inscrivant dans la partie l&#233;gislative du code des collectivit&#233;s territoriales le pouvoir d'adaptation de la vitesse dont dispose le maire.</p><p style=\"text-align: justify;\">Ce pouvoir d'adaptation devra s'effectuer dans le cadre des vitesses maximales autoris&#233;es en agglom&#233;ration : 50 km/h, et 70 km/h sur certaines portions de route adapt&#233;es, selon l'article R. 413-3 du code de la route.</p><p style=\"text-align: justify;\">Cette limite de 70 km/h est, par la m&#234;me occasion, inscrite dans la loi.</p>"
  },
  "representations": [
    {
      "nom": "PDF",
      "typeMime": {
        "type": "application",
        "subType": "PDF"
      },
      "statutRepresentation": {
        "verbatim": true,
        "canonique": true,
        "officielle": true,
        "transcription": false,
        "enregistrement": false
      },
      "contenu": {
        "documentURI": "/15/amendements/0936/CION_LOIS/CL10.pdf"
      }
    }
  ],
  "sort": {
    "dateSaisie": "2018-06-13T10:55:34.000+02:00",
    "sortEnSeance": "Rejeté"
  },
  "dateDepot": "2018-06-12T02:00:00.000+02:00",
  "dateDistribution": "2018-06-12T02:00:00.000+02:00",
  "article99": "0",
  "loiReference": {}
}