{
  "uid": "AMANR5L15SEA717460B2272P1D1N2932",
  "identifiant": {
    "legislature": "15",
    "numero": "2932",
    "numRect": "0",
    "saisine": {
      "texteLegislatifRef": "PRJLANR5L15B2272",
      "numeroPartiePLF": "1",
      "organeExamen": "PO717460",
      "mentionSecondeDeliberation": "0"
    }
  },
  "numeroLong": "I-2932",
  "etapeTexte": "1ère lecture (1ère assemblée saisie)",
  "triAmendement": "jccaaaaaaaaaaaaaaaaaaaaaaaaaaaaaaaaaaaaaaaaaaaaaaazzzzzzzzzzzzzzzzzzzzzzzzzzzzzzzzzzzzzzzzzzwjx",
  "cardinaliteAmdtMultiples": "1",
  "etat": "Discuté",
  "signataires": {
    "auteur": {
      "typeAuteur": "Rapporteur",
      "acteurRef": "PA267336",
      "organeRef": "PO59048",
      "groupePolitiqueRef": "PO730964"
    },
    "cosignatairesRefs": [
      "PA718838",
      "PA267336"
    ],
    "texteAffichable": "M.&#160;Giraud, rapporteur g&#233;n&#233;ral au nom de la commission des finances et M.&#160;Brun"
  },
  "pointeurFragmentTexte": {
    "division": {
      "titre": "Article 27",
      "articleDesignationCourte": "ART. 27",
      "type": "ARTICLE",
      "avantAApres": "A",
      "divisionRattachee": "ARTICLE 27",
      "urlDivisionTexteVise": "/15/textes/2272A.asp#D_Article_27"
    },
    "alinea": {
      "avantAApres": "A",
      "numero": "21",
      "alineaDesignation": "Alinéa 21"
    }
  },
  "corps": {
    "dispositif": "<p style=\"text-align: justify;\">I.&#160;&#8211;&#160;Supprimer l&#8217;alin&#233;a&#160;21.</p><p style=\"text-align: justify;\">II.&#160;&#8211;&#160;En cons&#233;quence, supprimer les alin&#233;as 46 &#224; 53.</p>",
    "exposeSommaire": "<p style=\"text-align: justify;\">L&#8217;agriculture fran&#231;aise doit poursuivre sa transformation. Le d&#233;fi climatique, les attentes soci&#233;tales, la concurrence internationale&#160;; tout l&#8217;exhorte &#224; entreprendre une mutation in&#233;dite, tout en veillant &#224; l&#8217;ind&#233;pendance alimentaire si strat&#233;gique de notre pays.&#160;</p><p style=\"text-align: justify;\">8&#160;000 salari&#233;s des chambres d&#8217;agriculture travaillent chaque jour, en France, &#224; l&#8217;accompagnement des professionnels confront&#233;s &#224; un d&#233;fi sans pr&#233;c&#233;dent. R&#233;duction des intrants, transmission de la moiti&#233; des exploitations dans les 15 ans, structuration des fili&#232;res d&#8217;approvisionnement local&#8230; Les exigences du Gouvernement sont immenses et ce sont des techniciens aguerris dont l&#8217;agriculture a besoin pour rendre possibles ces &#233;volutions dont la mise en &#339;uvre ne peut &#234;tre report&#233;e &#224; plus tard.&#160;</p><p style=\"text-align: justify;\">C&#8217;est pourtant ce moment que choisit le Gouvernement pour op&#233;rer une coupe budg&#233;taire sans pr&#233;c&#233;dent, portant ainsi gravement atteinte au monde agricole mais aussi forestier. Une d&#233;cision inutile, inop&#233;rante et incoh&#233;rente.&#160;</p><p style=\"text-align: justify;\">Dans le cadre de la pr&#233;paration du budget de l&#8217;&#201;tat pour 2020, le Gouvernement a annonc&#233; une baisse de 15&#160;% de la Taxe additionnelle &#224; la Taxe sur le foncier non b&#226;ti (TA-TFNB). Le produit de cette taxe assure aujourd&#8217;hui 292 millions d&#8217;euros aux chambres d&#8217;agriculture, soit pr&#232;s de la moiti&#233; de leur budget. Le Gouvernement justifie ce geste fiscal par le pouvoir d&#8217;achat suppl&#233;mentaire qu&#8217;il va permettre de d&#233;gager pour les agriculteurs. En r&#233;alit&#233;, cet imp&#244;t repr&#233;sente 0,52&#160;% des charges globales d&#8217;une exploitation agricole, ce qui se traduirait concr&#232;tement par une baisse moyenne et surtout d&#233;risoire de 50&#160;&#8364; de charges annuelles.&#160;</p><p style=\"text-align: justify;\">Mais la v&#233;ritable erreur politique est ailleurs. L&#8217;assiette de la TA-TFNB ne repose qu&#8217;en partie sur les terres agricoles (53,5&#160;%) et les for&#234;ts (6,4&#160;%). Le reste (40&#160;%) est principalement &#224; la charge de propri&#233;taires fonciers, sans lien avec l&#8217;agriculture ou la for&#234;t. Autrement dit, le Gouvernement touche ici &#224; un dispositif de solidarit&#233; fiscale, puisque des propri&#233;taires de terres inexploit&#233;es contribuent &#224; l&#8217;&#233;conomie agricole. De fa&#231;on incompr&#233;hensible, le Gouvernement veut revenir sur ce m&#233;canisme vertueux qui ne met pas &#224; contribution le seul exploitant mais le d&#233;tenteur de la ressource fonci&#232;re et accessoirement, le citoyen.&#160;</p><p style=\"text-align: justify;\">C&#8217;est ainsi que cette d&#233;cision, aux effets insignifiants, priverait les agriculteurs des services dont ils ont besoin. La Cour des comptes ne le dit pas autrement&#160;: &#171;&#160;une variation en plus ou en moins de cet imp&#244;t est sans effet significatif sur les revenus des exploitants agricoles alors qu&#8217;elle a un impact fort sur l&#8217;&#233;quilibre financier des chambres d&#8217;agriculture&#160;&#187;.</p><p style=\"text-align: justify;\">&#160;Quelle est donc la r&#233;elle volont&#233; de l&#8217;&#201;tat dans l&#8217;accompagnement de la transition de notre mod&#232;le agricole&#160;? Quelle est la coh&#233;rence de cette d&#233;cision qui cr&#233;&#233; un foss&#233; entre nos ambitions collectives et les moyens accord&#233;s pour les mettre en &#339;uvre&#160;? N&#8217;est-il pas temps, au contraire de cette mesure, de r&#233;fl&#233;chir &#224; un mod&#232;le fiscal porteur de sens et de justice qui servirait un enjeu de soci&#233;t&#233; majeur&#160;?&#160;</p><p style=\"text-align: justify;\">C&#8217;est pourquoi, le pr&#233;sent amendement vise &#224; supprimer l&#8217;alin&#233;a&#160;25 du pr&#233;sent article.&#160;</p>"
  },
  "representations": [
    {
      "nom": "PDF",
      "typeMime": {
        "type": "application",
        "subType": "PDF"
      },
      "statutRepresentation": {
        "verbatim": true,
        "canonique": true,
        "officielle": true,
        "transcription": false,
        "enregistrement": false
      },
      "contenu": {
        "documentURI": "/15/amendements/2272A/AN/2932.pdf"
      }
    }
  ],
  "seanceDiscussion": "RUANR5L15S2020IDS21886",
  "sort": {
    "dateSaisie": "2019-10-21T23:53:19.000+02:00",
    "sortEnSeance": "Retiré"
  },
  "dateDepot": "2019-10-10T02:00:00.000+02:00",
  "dateDistribution": "2019-10-21T02:00:00.000+02:00",
  "article99": "0",
  "loiReference": {}
}