{
  "uid": "AMANR5L15SEA717460BTC0857P0D1N463",
  "identifiant": {
    "legislature": "15",
    "numero": "463",
    "numRect": "0",
    "saisine": {
      "texteLegislatifRef": "PRJLANR5L15BTC0857",
      "numeroPartiePLF": "0",
      "organeExamen": "PO717460",
      "mentionSecondeDeliberation": "0"
    }
  },
  "numeroLong": "463",
  "etapeTexte": "1ère lecture (1ère assemblée saisie)",
  "triAmendement": "ado",
  "cardinaliteAmdtMultiples": "1",
  "etat": "Discuté",
  "signataires": {
    "auteur": {
      "typeAuteur": "Depute",
      "acteurRef": "PA719318",
      "groupePolitiqueRef": "PO730934"
    },
    "cosignatairesRefs": [
      "PA719318"
    ],
    "texteAffichable": "Mme&#160;Anthoine"
  },
  "pointeurFragmentTexte": {
    "division": {
      "titre": "Article 6",
      "articleDesignationCourte": "ART. 6",
      "type": "ARTICLE",
      "avantAApres": "A",
      "divisionRattachee": "ARTICLE 6",
      "urlDivisionTexteVise": "/15/textes/0857.asp#D_Article_6"
    },
    "alinea": {
      "avantAApres": "A",
      "numero": "2",
      "alineaDesignation": "Alinéa 2"
    }
  },
  "corps": {
    "dispositif": "<p style=\"text-align: justify;\">Substituer aux alin&#233;as 2 &#224; 4 les deux alin&#233;as suivants&#160;:</p><p style=\"text-align: justify;\">&#171;&#160;1&#176; L&#8217;article L.&#160;731&#8209;2 est ainsi r&#233;dig&#233;&#160;:</p><p style=\"text-align: justify;\">&#171;&#160;Aucun recours ne peut &#234;tre form&#233; contre une d&#233;cision de rejet d&#8217;une demande d&#8217;asile venant de l&#8217;Office fran&#231;ais de protection des r&#233;fugi&#233;s et apatrides. La d&#233;cision de rejet d&#8217;une demande d&#8217;asile de l'Office vaut obligation de quitter le territoire fran&#231;ais.&#160;&#187;</p>",
    "exposeSommaire": "<p style=\"text-align: justify;\">Cette d&#233;cision a pour but de faire obstacle au d&#233;p&#244;t, post&#233;rieurement, d&#8217;une autre demande de titre, et de d&#233;sengorger les guichets de demande d&#8217;asile.</p>"
  },
  "representations": [
    {
      "nom": "PDF",
      "typeMime": {
        "type": "application",
        "subType": "PDF"
      },
      "statutRepresentation": {
        "verbatim": true,
        "canonique": true,
        "officielle": true,
        "transcription": false,
        "enregistrement": false
      },
      "contenu": {
        "documentURI": "/15/amendements/0857/AN/463.pdf"
      }
    }
  ],
  "seanceDiscussion": "RUANR5L15S2018IDS21016",
  "sort": {
    "dateSaisie": "2018-04-20T00:30:15.000+02:00",
    "sortEnSeance": "Retiré"
  },
  "dateDepot": "2018-04-12T02:00:00.000+02:00",
  "dateDistribution": "2018-04-13T02:00:00.000+02:00",
  "article99": "0",
  "loiReference": {}
}