{
  "uid": "AMANR5L15PO59046B0659P0D1N496",
  "identifiant": {
    "legislature": "15",
    "numero": "496",
    "numRect": "0",
    "saisine": {
      "texteLegislatifRef": "PRJLANR5L15B0659",
      "numeroPartiePLF": "0",
      "organeExamen": "PO59046",
      "mentionSecondeDeliberation": "0"
    }
  },
  "numeroLong": "DN496",
  "etapeTexte": "1ère lecture (1ère assemblée saisie)",
  "triAmendement": "bv",
  "cardinaliteAmdtMultiples": "1",
  "etat": "Discuté",
  "signataires": {
    "auteur": {
      "typeAuteur": "Depute",
      "acteurRef": "PA672",
      "groupePolitiqueRef": "PO730964"
    },
    "cosignatairesRefs": [
      "PA672"
    ],
    "texteAffichable": "M.&#160;Bridey, rapporteur"
  },
  "pointeurFragmentTexte": {
    "division": {
      "titre": "Article 29",
      "articleDesignationCourte": "ART. 29",
      "type": "ARTICLE",
      "avantAApres": "A",
      "divisionRattachee": "ARTICLE 29",
      "urlDivisionTexteVise": "/15/textes/0659.asp#D_Article_29"
    },
    "alinea": {
      "avantAApres": "A",
      "numero": "8",
      "alineaDesignation": "Alinéa 8"
    }
  },
  "corps": {
    "dispositif": "<p>A l&#8217;alin&#233;a&#160;8, supprimer les mots&#160;: &#171;&#160;ou leurs repr&#233;sentants&#160;&#187;.</p><p>&#160;</p><p>&#160;</p>",
    "exposeSommaire": "<p style=\"text-align: justify;\">Amendement de coh&#233;rence.</p>"
  },
  "representations": [
    {
      "nom": "PDF",
      "typeMime": {
        "type": "application",
        "subType": "PDF"
      },
      "statutRepresentation": {
        "verbatim": true,
        "canonique": true,
        "officielle": true,
        "transcription": false,
        "enregistrement": false
      },
      "contenu": {
        "documentURI": "/15/amendements/0659/CION_DEF/DN496.pdf"
      }
    }
  ],
  "sort": {
    "dateSaisie": "2018-03-14T13:56:56.000+01:00",
    "sortEnSeance": "Adopté"
  },
  "dateDepot": "2018-03-12T01:00:00.000+01:00",
  "dateDistribution": "2018-03-12T01:00:00.000+01:00",
  "article99": "0",
  "loiReference": {}
}