{
  "uid": "AMANR5L15SEA717460B0235P1D1N698",
  "identifiant": {
    "legislature": "15",
    "numero": "698",
    "numRect": "0",
    "saisine": {
      "texteLegislatifRef": "PRJLANR5L15B0235",
      "numeroPartiePLF": "1",
      "organeExamen": "PO717460",
      "mentionSecondeDeliberation": "0"
    }
  },
  "numeroLong": "I-698",
  "etapeTexte": "1ère lecture (1ère assemblée saisie)",
  "triAmendement": "zzi",
  "cardinaliteAmdtMultiples": "1",
  "etat": "Discuté",
  "signataires": {
    "auteur": {
      "typeAuteur": "Depute",
      "acteurRef": "PA712014",
      "groupePolitiqueRef": "PO730952"
    },
    "cosignatairesRefs": [
      "PA721094",
      "PA610775",
      "PA267780",
      "PA712014",
      "PA1960"
    ],
    "texteAffichable": "M.&#160;Ledoux,  M.&#160;Gom&#232;s, M.&#160;Dunoyer, M.&#160;Leroy et Mme&#160;Firmin Le Bodo"
  },
  "pointeurFragmentTexte": {
    "division": {
      "titre": "Article 15",
      "articleDesignationCourte": "ART. 15",
      "type": "ARTICLE",
      "avantAApres": "A",
      "divisionRattachee": "ARTICLE 15",
      "urlDivisionTexteVise": "/15/textes/0235A.asp#D_Article_15"
    }
  },
  "corps": {
    "dispositif": "<p style=\"text-align: justify;\">Supprimer cet article.</p>",
    "exposeSommaire": "<p style=\"text-align: justify;\">Cette disposition avait &#233;t&#233; vot&#233;e et int&#233;gr&#233;e dans le PLF 2017 et un d&#233;lai d&#8217;un an avait &#233;t&#233; laiss&#233; pour la mettre en &#339;uvre.</p><p style=\"text-align: justify;\">Les transactions intra-journali&#232;res (dites &#171;&#160;intra-day&#160;&#187;), sont les transactions intervenant avant le transfert de propri&#233;t&#233; &#224; l&#8217;acqu&#233;reur, c&#8217;est-&#224;-dire d&#233;nou&#233;es au cours d&#8217;une seule et m&#234;me journ&#233;e.&#160;Ces derni&#232;res incluent notamment les transactions &#224; haute fr&#233;quence qui consistent &#224; transmettre automatiquement et &#224; tr&#232;s grande vitesse des ordres sur les march&#233;s financiers gr&#226;ce &#224; des programmes informatiques complexes. Les transactions &#224; haute fr&#233;quence repr&#233;sentent, selon l&#8217;Autorit&#233;&#160;europ&#233;en des march&#233;s financiers (ESMA), entre 21 et 45&#160;% des volumes de transactions r&#233;alis&#233;es sur les actions de la bourse de Paris[1].</p><p style=\"text-align: justify;\">Cet amendement vise &#224; atteindre deux objectifs&#160;:</p><p style=\"text-align: justify;\">&#183; D&#8217;une part d&#233;gager des recettes fiscales suppl&#233;mentaires, notamment en vue d&#8217;augmenter les financements pour la solidarit&#233; internationale, la sant&#233; mondiale et la lutte contre le changement climatique.</p><p style=\"text-align: justify;\">&#183; D&#8217;autre part combler les br&#232;ches de l&#8217;actuelle taxe fran&#231;aise sur les transactions financi&#232;res qui ne lutte pas efficacement contre la sp&#233;culation en excluant les transactions intra-journali&#232;res et transactions &#224; haute fr&#233;quence.</p><p style=\"text-align: justify;\">Ce premier objectif est conforme aux engagements pris par le Pr&#233;sident de la R&#233;publique sur l&#8217;affectation de la taxe sur les transactions financi&#232;res et sur sa volont&#233; d&#8217;atteindre 0,55&#160;% du RNB allou&#233;e &#224; l&#8217;aide publique au d&#233;veloppement d&#8217;ici 2022.</p><p style=\"text-align: justify;\">Enfin, la taxation des transactions intra-journali&#232;res au niveau fran&#231;ais s&#8217;inscrit dans la dynamique des n&#233;gociations&#160;europ&#233;ennes. En effet, la directive propos&#233;e par la Commission&#160;europ&#233;enne pr&#233;conise cette m&#234;me mesure et les dix &#201;tats membres associ&#233;s &#224; la coop&#233;ration renforc&#233;e visant &#224; instaurer une taxe&#160;europ&#233;enne sur les transactions financi&#232;res, dont la France, ont d&#233;cid&#233; le 12 septembre 2017 de soutenir cette proposition.</p>"
  },
  "representations": [
    {
      "nom": "PDF",
      "typeMime": {
        "type": "application",
        "subType": "PDF"
      },
      "statutRepresentation": {
        "verbatim": true,
        "canonique": true,
        "officielle": true,
        "transcription": false,
        "enregistrement": false
      },
      "contenu": {
        "documentURI": "/15/amendements/0235A/AN/698.pdf"
      }
    }
  ],
  "seanceDiscussion": "RUANR5L15S2018IDS20700",
  "sort": {
    "dateSaisie": "2017-10-20T22:21:02.000+02:00",
    "sortEnSeance": "Non soutenu"
  },
  "dateDepot": "2017-10-13T02:00:00.000+02:00",
  "dateDistribution": "2017-10-17T02:00:00.000+02:00",
  "article99": "0",
  "loiReference": {}
}