{
  "uid": "AMANR5L15PO420120B0904P0D1N145",
  "identifiant": {
    "legislature": "15",
    "numero": "145",
    "numRect": "0",
    "saisine": {
      "texteLegislatifRef": "PRJLANR5L15B0904",
      "numeroPartiePLF": "0",
      "organeExamen": "PO420120",
      "mentionSecondeDeliberation": "0"
    }
  },
  "numeroLong": "AS145",
  "etapeTexte": "1ère lecture (1ère assemblée saisie)",
  "triAmendement": "wbddo",
  "cardinaliteAmdtMultiples": "1",
  "etat": "Irrecevable",
  "signataires": {
    "auteur": {
      "typeAuteur": "Depute",
      "acteurRef": "PA643134",
      "groupePolitiqueRef": "PO730934"
    },
    "cosignatairesRefs": [
      "PA643134"
    ],
    "texteAffichable": "Mme&#160;Valentin"
  },
  "pointeurFragmentTexte": {
    "division": {
      "titre": "Article 10",
      "articleDesignationCourte": "ART. 10",
      "type": "ARTICLE",
      "avantAApres": "A",
      "divisionRattachee": "ARTICLE 10",
      "urlDivisionTexteVise": "/15/textes/0904.asp#D_Article_10"
    },
    "alinea": {
      "avantAApres": "A",
      "numero": "15",
      "alineaDesignation": "Alinéa 15"
    }
  },
  "corps": {
    "dispositif": "<p style=\"text-align: justify;\">&#192; l&#8217;alin&#233;a&#160;15, apr&#232;s la premi&#232;re occurrence du mot&#160;: </p><p style=\"text-align: justify;\">&#171;&#160;territoriales&#160;&#187;,</p><p style=\"text-align: justify;\">ins&#233;rer les mots&#160;:</p><p style=\"text-align: justify;\">&#171;&#160;ou de diminuer leurs ressources&#160;&#187;.</p>",
    "exposeSommaire": "<p>Le projet de loi pr&#233;voit la suppression de la taxe d&#8217;apprentissage dont 51 % du produit est actuellement per&#231;u par les r&#233;gions et &#224; laquelle se substitueront deux nouvelles contributions qui seront acquitt&#233;es par les entreprises au profit des branches professionnelles et de France comp&#233;tences pour le financement de l&#8217;apprentissage.</p><p>&#160;</p><p>La suppression de la taxe d&#8217;apprentissage pose probl&#232;me du fait de l&#8217;historique de la d&#233;termination de son assiette. En effet, allou&#233;e aux r&#233;gions en 2015, l&#8217;assiette de la taxe d&#8217;apprentissage comprenait notamment, &#224; l&#8217;origine, l&#8217;ex contribution au d&#233;veloppement de l&#8217;apprentissage (CDA), elle-m&#234;me issue de la dotation g&#233;n&#233;rale de d&#233;centralisation apprentissage (DGD). Or, 44 % de cette DGD apprentissage &#233;tait compos&#233;e de compensations financi&#232;res li&#233;es &#224; la formation professionnelle.</p><p>&#160;</p><p>Il conviendra donc que cette part de la DGD, provisoirement &#233;valu&#233;e &#224; 337 M&#8364;, fasse l&#8217;objet d&#8217;une compensation financi&#232;re aux r&#233;gions concomitamment &#224; la suppression de la taxe d&#8217;apprentissage.</p><p>&#160;</p><p>Tel est l&#8217;objet du pr&#233;sent amendement.</p>"
  },
  "representations": [
    {
      "nom": "PDF",
      "typeMime": {
        "type": "application",
        "subType": "PDF"
      },
      "statutRepresentation": {
        "verbatim": true,
        "canonique": true,
        "officielle": true,
        "transcription": false,
        "enregistrement": false
      },
      "contenu": {
        "documentURI": "/15/amendements/0904/CION-SOC/AS145.pdf"
      }
    }
  ],
  "dateDepot": "2018-05-23T02:00:00.000+02:00",
  "article99": "0",
  "loiReference": {}
}