{
  "uid": "AMANR5L15SEA717460BTC1212P0D1N291",
  "identifiant": {
    "legislature": "15",
    "numero": "291",
    "numRect": "0",
    "saisine": {
      "texteLegislatifRef": "PRJLANR5L15BTC1212",
      "numeroPartiePLF": "0",
      "organeExamen": "PO717460",
      "mentionSecondeDeliberation": "0"
    }
  },
  "numeroLong": "291",
  "etapeTexte": "1ère lecture (2ème assemblée saisie)",
  "triAmendement": "bjaaaaaaaaaaaaaaaaaaaaaaaaaaaaaaaaaaaaaaaaaaaaaaaab",
  "cardinaliteAmdtMultiples": "1",
  "etat": "Discuté",
  "signataires": {
    "auteur": {
      "typeAuteur": "Depute",
      "acteurRef": "PA718926",
      "groupePolitiqueRef": "PO730940"
    },
    "cosignatairesRefs": [
      "PA721270",
      "PA720692",
      "PA441",
      "PA718720",
      "PA722110",
      "PA610667",
      "PA721012",
      "PA718926",
      "PA720546",
      "PA335612",
      "PA689",
      "PA267306",
      "PA722202",
      "PA610654",
      "PA721118",
      "PA721896"
    ],
    "texteAffichable": "M.&#160;Dharr&#233;ville,  M.&#160;Dufr&#232;gne, M.&#160;Fabien&#160;Roussel, M.&#160;Bruneel, Mme&#160;Bello, M.&#160;Brotherson, Mme&#160;Buffet, M.&#160;Chassaigne, Mme&#160;Faucillon, M.&#160;Jumel, Mme&#160;K&#233;clard-Mond&#233;sir, M.&#160;Lecoq, M.&#160;Nilor, M.&#160;Peu, M.&#160;Serville et M.&#160;Wulfranc"
  },
  "pointeurFragmentTexte": {
    "division": {
      "titre": "Article 3",
      "articleDesignationCourte": "APRÈS ART. 3",
      "type": "ARTICLE",
      "avantAApres": "Apres",
      "divisionRattachee": "APRÈS L'ARTICLE 3, insérer l'article suivant:",
      "articleAdditionnel": "1",
      "urlDivisionTexteVise": "/15/textes/1212.asp#D_Article_3"
    }
  },
  "corps": {
    "dispositif": "<p>Apr&#232;s le 4&#176; de l&#8217;article L.&#160;114&#8209;12 du code de la s&#233;curit&#233; sociale, il est ins&#233;r&#233; un 5&#176; ainsi r&#233;dig&#233;&#160;:</p><p>&#171;&#160;5&#176; Permettent de d&#233;tecter les cas de non-recours aux droits sociaux.&#160;&#187;</p>",
    "exposeSommaire": "<p style=\"text-align: justify;\">Cet amendement vise &#224; mobiliser les outils de lutte contre la fraude au service de la diminution du non-recours aux droits sociaux, notamment gr&#226;ce au r&#233;pertoire national commun de la protection sociale.</p><p style=\"text-align: justify;\">Si de nombreux outils (&#233;changes d'informations entre administration, data mining, renforcement des sanctions contre les allocataires) ont &#233;t&#233; mis en place pour d&#233;tecter et sanctionner la fraude sociale, peu a &#233;t&#233; fait pour lutter contre le non-recours aux droits alors que 30 % des b&#233;n&#233;ficiaires potentiels du RSA ne le demandent pas.</p>"
  },
  "representations": [
    {
      "nom": "PDF",
      "typeMime": {
        "type": "application",
        "subType": "PDF"
      },
      "statutRepresentation": {
        "verbatim": true,
        "canonique": true,
        "officielle": true,
        "transcription": false,
        "enregistrement": false
      },
      "contenu": {
        "documentURI": "/15/amendements/1212/AN/291.pdf"
      }
    }
  ],
  "seanceDiscussion": "RUANR5L15S2018IDS21238",
  "sort": {
    "dateSaisie": "2018-09-17T19:58:35.000+02:00",
    "sortEnSeance": "Rejeté"
  },
  "dateDepot": "2018-09-13T02:00:00.000+02:00",
  "dateDistribution": "2018-09-14T02:00:00.000+02:00",
  "article99": "0",
  "loiReference": {
    "codeLoi": "c sécurité sociale",
    "divisionCodeLoi": "L114-12"
  }
}