{
  "uid": "AMANR5L15SEA717460B0485P0D1N541",
  "identifiant": {
    "legislature": "15",
    "numero": "541",
    "numRect": "0",
    "saisine": {
      "texteLegislatifRef": "PRJLANR5L15B0485",
      "numeroPartiePLF": "0",
      "organeExamen": "PO717460",
      "mentionSecondeDeliberation": "1"
    }
  },
  "numeroLong": "541",
  "etapeTexte": "Nouvelle Lecture",
  "triAmendement": "hzx",
  "cardinaliteAmdtMultiples": "1",
  "etat": "Retiré",
  "signataires": {
    "auteur": {
      "typeAuteur": "Gouvernement"
    },
    "texteAffichable": "le Gouvernement"
  },
  "pointeurFragmentTexte": {
    "division": {
      "titre": "Article 45 ter A",
      "articleDesignationCourte": "ART. 45 TER A",
      "type": "ARTICLE",
      "avantAApres": "A",
      "divisionRattachee": "ARTICLE 45 TER A",
      "urlDivisionTexteVise": "/15/textes/0485.asp#D_Article_45_ter_A"
    }
  },
  "corps": {
    "dispositif": "<p style=\"margin: 0cm 0cm 10pt; text-align: justify;\">Substituer aux alin&#233;as 2 &#224; 11 les neuf alin&#233;as suivants :</p><p style=\"margin: 12pt 27.35pt 6pt 0cm; text-align: justify; line-height: normal;\">1&#176;&#160;A l&#8217;article&#160;L.&#160;2123&#8209;23, la derni&#232;re ligne du tableau du deuxi&#232;me alin&#233;a est ainsi r&#233;dig&#233;e&#160;:</p><p style=\"margin: 12pt 27.35pt 6pt; text-align: justify; line-height: normal;\">&#171;&#160;</p><table style=\"margin: auto auto auto 27.25pt; border: currentColor; border-collapse: collapse;\" width=\"0\"><tbody><tr><td style=\"padding: 0cm; border: 1pt solid windowtext; width: 136.05pt; background-color: transparent;\" width=\"181\"><p style=\"margin: 0cm 0cm 0pt; line-height: normal;\">100 000 et plus&#160;</p></td><td style=\"border-width:1pt 1pt 1pt 0pt; border-style: solid solid solid none; border-color: windowtext windowtext windowtext #000000; padding: 0cm; width: 215.45pt; background-color: transparent;\" width=\"287\"><p style=\"margin: 0cm 0cm 0pt; line-height: normal;\">203</p></td></tr></tbody></table><p style=\"margin: 0cm 0cm 10pt; text-align: justify;\">&#160;&#160;&#187;</p><p style=\"margin: 0cm 0cm 10pt; text-align: justify;\">2&#176; Au premier alin&#233;a de l&#8217;article L. 3123-17, les mots : &#171; major&#233; de 45 % &#187; sont remplac&#233;s par les mots : &#171; major&#233; de 103 % &#187; ;</p><p style=\"margin: 0cm 0cm 10pt; text-align: justify;\">3&#176; Au premier alin&#233;a de l&#8217;article L. 3632-4, les mots&#160;: &#171; major&#233; de 45 % &#187; sont remplac&#233;s par les mots : &#171; major&#233; de 103 % &#187; ;</p><p style=\"margin: 0cm 0cm 10pt; text-align: justify;\">4&#176; Au premier alin&#233;a de l&#8217;article L. 5211-12, les mots &#171;&#160;d&#8217;une m&#233;tropole&#160;&#187; sont supprim&#233;s ;</p><p style=\"margin: 0cm 0cm 10pt; text-align: justify;\">5&#176; Le m&#234;me alin&#233;a est compl&#233;t&#233; par la phrase suivante&#160;: &#171;&#160;Pour le pr&#233;sident du conseil d&#8217;une m&#233;tropole, d&#8217;une communaut&#233; urbaine de plus de 100&#160;000 habitants et d&#8217;une communaut&#233; d&#8217;agglom&#233;ration de plus de 100&#160;000 habitants, ces indemnit&#233;s maximales sont d&#233;termin&#233;es&#160; en appliquant au terme de r&#233;f&#233;rence mentionn&#233; &#224; l&#8217;article L. 5211-12 le taux de 203 %.&#160;&#187; ;</p><p style=\"margin: 0cm 0cm 10pt; text-align: justify;\">6&#176; Au premier alin&#233;a de l&#8217;article L. 7125-20, les mots&#160;: &#171;&#160;le taux de 145 %&#160;&#187; sont remplac&#233;s par les mots&#160;: &#171;&#160;le taux de 203 %&#160;&#187; ;</p><p style=\"margin: 0cm 0cm 10pt; text-align: justify;\">7&#176; Au premier alin&#233;a de l&#8217;article L. 7227-20, les mots&#160;: &#171;&#160;le taux de 145 %&#160;&#187; sont remplac&#233;s par les mots&#160;: &#171;&#160;le taux de 203 %&#160;&#187; ;</p><p style=\"margin: 0cm 0cm 10pt; text-align: justify;\">8&#176; Au premier alin&#233;a de l&#8217;article L. 7227-21, les mots&#160;: &#171;&#160;le taux de 145 %&#160;&#187; sont remplac&#233;s par les mots&#160;: &#171;&#160;le taux de 203 %&#160;&#187; ;</p>",
    "exposeSommaire": "<p>Le pr&#233;sent amendement a pour objet d&#8217;int&#233;grer la nouvelle indemnit&#233; de suj&#233;tion cr&#233;&#233;e par l&#8217;article 45 ter A dans l&#8217;indemnit&#233; de fonction des pr&#233;sidents d&#8217;ex&#233;cutifs concern&#233;s. Ceci permet de s&#8217;appuyer sur une indemnit&#233; existante, dont le r&#233;gime juridique, social et fiscal est bien d&#233;fini. Le niveau de l&#8217;augmentation reste identique, une majoration de 40 % se traduisant par le remplacement de la r&#233;f&#233;rence &#224; 145% par celle &#224; 203% de l&#8217;indice brut terminal de la fonction publique.</p><p>Par ailleurs, sont ajout&#233;es par coh&#233;rence les m&#233;tropoles, la m&#233;tropole de Lyon, les collectivit&#233;s de Guyane et de Martinique. La mesure est &#233;tendue aux maires des communes de plus de 100&#160;000 habitants au lieu de 500&#160;000 dans la r&#233;daction actuelle de l&#8217;article 45 ter A, ainsi qu&#8217;aux pr&#233;sidents des communaut&#233;s urbaines et communaut&#233;s d&#8217;agglom&#233;ration de plus de 100&#160;000 habitants.</p><p>Enfin, la mise sous enveloppe de la nouvelle indemnit&#233; est supprim&#233;e.</p><p>&#160;</p>"
  },
  "representations": [
    {
      "nom": "PDF",
      "typeMime": {
        "type": "application",
        "subType": "PDF"
      },
      "statutRepresentation": {
        "verbatim": true,
        "canonique": true,
        "officielle": true,
        "transcription": false,
        "enregistrement": false
      },
      "contenu": {
        "documentURI": "/15/amendements/0485/AN/541.pdf"
      }
    }
  ],
  "dateDepot": "2017-12-15T01:00:00.000+01:00",
  "dateDistribution": "2017-12-15T01:00:00.000+01:00",
  "article99": "1",
  "loiReference": {}
}