{
  "uid": "AMANR5L15PO420120B0387P0D1N39",
  "identifiant": {
    "legislature": "15",
    "numero": "39",
    "numRect": "0",
    "saisine": {
      "texteLegislatifRef": "PRJLANR5L15B0387",
      "numeroPartiePLF": "0",
      "organeExamen": "PO420120",
      "mentionSecondeDeliberation": "0"
    }
  },
  "numeroLong": "AS39",
  "etapeTexte": "Nouvelle Lecture",
  "triAmendement": "ax",
  "cardinaliteAmdtMultiples": "1",
  "etat": "Discuté",
  "signataires": {
    "auteur": {
      "typeAuteur": "Depute",
      "acteurRef": "PA267289",
      "groupePolitiqueRef": "PO730934"
    },
    "cosignatairesRefs": [
      "PA2377",
      "PA267289",
      "PA856",
      "PA606712",
      "PA721474"
    ],
    "texteAffichable": "M.&#160;Door,  M.&#160;Viry, M.&#160;Perrut, M.&#160;Lurton et M.&#160;Cherpion"
  },
  "pointeurFragmentTexte": {
    "division": {
      "titre": "Article 13 bis",
      "articleDesignationCourte": "ART. 13 BIS",
      "type": "ARTICLE",
      "avantAApres": "A",
      "divisionRattachee": "ARTICLE 13 BIS",
      "urlDivisionTexteVise": "/15/textes/0387.asp#D_Article_13_bis"
    }
  },
  "corps": {
    "dispositif": "<p style=\"text-align: justify;\">R&#233;diger ainsi cet article&#160;:</p><p style=\"text-align: justify;\">&#171;&#160;I.&#160;&#8211;&#160;Le 0 A de la section IV du chapitre II du titre III de la deuxi&#232;me partie du livre Ier du code g&#233;n&#233;ral des imp&#244;ts est ainsi modifi&#233;&#160;:</p><p style=\"text-align: justify;\">&#171;&#160;1&#176; L&#8217;article&#160;1613 ter est ainsi modifi&#233;&#160;:</p><p style=\"text-align: justify;\">&#171;&#160;<i>a)</i> Apr&#232;s le mot&#160;: &#171;&#160;croissance&#160;&#187;, la fin du dernier alin&#233;a du I est ainsi r&#233;dig&#233;e&#160;: &#171;&#160;et les produits de nutrition ent&#233;rale pour les personnes malades.&#160;&#187;&#160;;</p><p style=\"text-align: justify;\">&#171;&#160;<i>b)</i> Le II est ainsi r&#233;dig&#233;&#160;:</p><p style=\"text-align: justify;\">&#171;&#160;II.&#160;&#8211;&#160;Le tarif de la contribution mentionn&#233;e au I est le suivant&#160;:</p><table style=\"border-collapse: collapse; height: 264px;\" width=\"338\"><tbody><tr><td style=\"white-space: normal; border: 1px solid #000000; width: 165.5px; text-align: center;\"><br />Quantit&#233; de sucre<br />(en kg de sucres ajout&#233;s par hl de boisson)</td><td style=\"white-space: normal; border: 1px solid #000000; width: 165.5px; text-align: center;\"><br />Tarif applicable<br />(en&#160;euros par hl de boisson)</td></tr><tr><td style=\"white-space: normal; border: 1px solid #000000; width: 165.5px; text-align: center;\">Inf&#233;rieure ou &#233;gale &#224; 1</td><td style=\"white-space: normal; border: 1px solid #000000; width: 165.5px; text-align: center;\">3</td></tr><tr><td style=\"white-space: normal; border: 1px solid #000000; width: 165.5px; text-align: center;\">Entre 2 et 5</td><td style=\"white-space: normal; border: 1px solid #000000; width: 165.5px; text-align: center;\">0,5 par kilogramme dans cette tranche</td></tr><tr><td style=\"white-space: normal; border: 1px solid #000000; width: 165.5px; text-align: center;\">Entre 5 et 8</td><td style=\"white-space: normal; border: 1px solid #000000; width: 165.5px; text-align: center;\">1,0 par kilogramme dans cette tranche</td></tr><tr><td style=\"white-space: normal; border: 1px solid #000000; width: 165.5px; text-align: center;\">Sup&#233;rieure ou &#233;gale &#224; 8</td><td style=\"white-space: normal; border: 1px solid #000000; width: 165.5px; text-align: center;\">1,5 par kilogramme dans cette tranche</td></tr></tbody></table><p style=\"text-align: justify;\"><br />&#171;&#160;Pour le calcul de la quantit&#233; en kilogrammes de sucres ajout&#233;s, celle-ci est arrondie &#224; l&#8217;entier hors d&#233;cimales.</p><p style=\"text-align: justify;\">&#171;&#160;Les tarifs sont relev&#233;s au 1<sup>er</sup> janvier de chaque ann&#233;e, &#224; compter du 1<sup>er</sup> janvier 2019, dans une proportion &#233;gale au taux de croissance de l&#8217;indice des prix &#224; la consommation hors tabac de l&#8217;avant-derni&#232;re ann&#233;e. Ces montants sont exprim&#233;s avec deux chiffres apr&#232;s la virgule, le deuxi&#232;me chiffre &#233;tant augment&#233; d&#8217;une unit&#233; si le chiffre suivant est &#233;gal ou sup&#233;rieur &#224; cinq. Ils sont constat&#233;s par arr&#234;t&#233; du ministre charg&#233; du budget, publi&#233; au Journal officiel.</p><p style=\"text-align: justify;\">&#171;&#160;<i>c)</i> Le V est compl&#233;t&#233; par l&#8217;alin&#233;a suivant&#160;:</p><p style=\"text-align: justify;\">&#171;&#160;Les redevables de la contribution tiennent &#224; disposition de l&#8217;administration des douanes tout document permettant d&#8217;identifier les quantit&#233;s de sucres ajout&#233;s &#224; chaque produit. En l&#8217;absence de justificatif probant, il est fait application du tarif maximal mentionn&#233; au II &#224; la totalit&#233; de la quantit&#233; de sucres contenus dans le produit.&#160;&#187;</p><p style=\"text-align: justify;\">&#171;&#160;d) Il est ins&#233;r&#233; un VII ainsi r&#233;dig&#233;&#160;:</p><p style=\"text-align: justify;\">&#171;&#160;VII.&#160;&#8211;&#160;Les modalit&#233;s d&#8217;application des dispositions qui pr&#233;c&#232;dent seront, en tant que de besoin, fix&#233;es par d&#233;cret.&#160;&#187;.</p><p style=\"text-align: justify;\">&#171;&#160;2&#176; L&#8217;article&#160;1613 <i>quater</i> est ainsi modifi&#233;&#160;:</p><p style=\"text-align: justify;\">&#171;&#160;<i>a)</i> &#192; la fin du 2&#176; du I, les mots&#160;: &#171;&#160;et ne contenant pas de sucres ajout&#233;s&#160;&#187; sont supprim&#233;s&#160;;</p><p style=\"text-align: justify;\">&#171;&#160;<i>b)</i> &#192; la premi&#232;re phrase du premier alin&#233;a du II, le montant&#160;: &#171;&#160;7,53&#160;&#8364;&#160;&#187; est remplac&#233; par le montant&#160;: &#171;&#160;3,0&#160;&#8364;&#160;&#187;.</p><p style=\"text-align: justify;\">&#171;&#160;II. &#8211; Le I entre en vigueur le 1<sup>er</sup> juillet 2018.&#160;&#187;</p>",
    "exposeSommaire": "<p style=\"text-align: justify;\">Cet amendement vise &#224; faire respecter l&#8217;engagement parlementaire et gouvernemental quant &#224; la contribution sur les boissons sucr&#233;es, selon lequel &#171;&#160;la taxe vot&#233;e par les d&#233;put&#233;s a pour objet, non pas de rapporter des recettes suppl&#233;mentaires &#224; l&#8217;&#201;tat, mais d&#8217;inciter les industriels &#224; r&#233;duire leur taux de sucre&#160;&#187;, ainsi que le rappelait Mme la Ministre de la Sant&#233; au S&#233;nat en s&#233;ance publique.</p><p style=\"text-align: justify;\">Il a &#233;t&#233; r&#233;p&#233;t&#233; que l&#8217;objectif n&#8217;est pas de &#171;&#160;gagner de l&#8217;argent&#160;&#187;, mais d&#8217;inciter les industriels &#224; r&#233;duire consid&#233;rablement la teneur en sucre de leurs produits, dans une r&#233;elle vis&#233;e de sant&#233; publique.</p><p style=\"text-align: justify;\">Les entreprises du secteur sont engag&#233;es depuis de nombreuses ann&#233;es &#224; r&#233;duire la teneur en sucre des produits et vont poursuivre leurs efforts en ce sens.</p><p style=\"text-align: justify;\">C&#8217;est pourquoi l&#8217;amendement propose une hausse de 14&#160;% des recettes en 2018 par rapport &#224; la taxe en vigueur, ce qui devrait avoir pour r&#233;sultat de maintenir le niveau actuel des recettes, si les industriels jouent le jeu de la diminution du taux de sucre dans leurs boissons.</p>"
  },
  "representations": [
    {
      "nom": "PDF",
      "typeMime": {
        "type": "application",
        "subType": "PDF"
      },
      "statutRepresentation": {
        "verbatim": true,
        "canonique": true,
        "officielle": true,
        "transcription": false,
        "enregistrement": false
      },
      "contenu": {
        "documentURI": "/15/amendements/0387/CION-SOC/AS39.pdf"
      }
    }
  ],
  "sort": {
    "dateSaisie": "2017-11-27T15:11:25.000+01:00",
    "sortEnSeance": "Retiré"
  },
  "dateDepot": "2017-11-23T01:00:00.000+01:00",
  "dateDistribution": "2017-11-24T01:00:00.000+01:00",
  "article99": "0",
  "loiReference": {}
}