{
  "uid": "AMANR5L15SEA717460B0485P0D1N61",
  "identifiant": {
    "legislature": "15",
    "numero": "61",
    "numRect": "0",
    "saisine": {
      "texteLegislatifRef": "PRJLANR5L15B0485",
      "numeroPartiePLF": "0",
      "organeExamen": "PO717460",
      "mentionSecondeDeliberation": "1"
    }
  },
  "numeroLong": "61",
  "etapeTexte": "Nouvelle Lecture",
  "triAmendement": "i",
  "cardinaliteAmdtMultiples": "1",
  "etat": "Discuté",
  "signataires": {
    "auteur": {
      "typeAuteur": "Depute",
      "acteurRef": "PA720728",
      "groupePolitiqueRef": "PO730970"
    },
    "cosignatairesRefs": [
      "PA720720",
      "PA720728"
    ],
    "texteAffichable": "M.&#160;Mattei et Mme&#160;Poueyto"
  },
  "pointeurFragmentTexte": {
    "division": {
      "titre": "Article 40",
      "articleDesignationCourte": "ART. 40",
      "type": "ARTICLE",
      "avantAApres": "A",
      "divisionRattachee": "ARTICLE 40",
      "urlDivisionTexteVise": "/15/textes/0485.asp#D_Article_40"
    },
    "alinea": {
      "numero": "8"
    }
  },
  "corps": {
    "dispositif": "<p style=\"text-align: justify;\">I.&#160;&#8211;&#160;Compl&#233;ter la premi&#232;re phrase de l&#8217;alin&#233;a&#160;8 par les mots&#160;:</p><p style=\"text-align: justify;\">&#171;&#160;ou dans les communes situ&#233;es en zone B2 dans des agglom&#233;rations comportant un quartier inscrit au titre des deux cents quartiers prioritaires du nouveau programme national pour la r&#233;novation urbaine.&#160;&#187;</p><p style=\"text-align: justify;\">II.&#160;&#8211;&#160;Compl&#233;ter cet article par les deux alin&#233;as suivants&#160;:</p><p style=\"text-align: justify;\">&#171;&#160;VI.&#160;&#8211;&#160;La perte de recettes pour l&#8217;&#201;tat est compens&#233;e &#224; due concurrence par la cr&#233;ation d&#8217;une taxe additionnelle aux droits mentionn&#233;s aux articles 575 et 575 A du code g&#233;n&#233;ral des imp&#244;ts.</p><p style=\"text-align: justify;\">&#171;&#160;VII.&#160;&#8211;&#160;Le 1&#176; du A I n&#8217;est applicable qu&#8217;aux sommes venant en d&#233;duction de l&#8217;imp&#244;t d&#251;.&#160;&#187;</p>",
    "exposeSommaire": "<p style=\"text-align: justify;\">Cet amendement vise, dans un souci de maintien de la mixit&#233; sociale, &#224; pr&#233;server les mesures d&#8217;aide &#224; l&#8217;accession &#224; la premi&#232;re propri&#233;t&#233; pour les m&#233;nages modestes vivant dans les quartiers en r&#233;novation urbaine ou aux abords de ceux-ci.</p>"
  },
  "representations": [
    {
      "nom": "PDF",
      "typeMime": {
        "type": "application",
        "subType": "PDF"
      },
      "statutRepresentation": {
        "verbatim": true,
        "canonique": true,
        "officielle": true,
        "transcription": false,
        "enregistrement": false
      },
      "contenu": {
        "documentURI": "/15/amendements/0485/AN/61.pdf"
      }
    }
  ],
  "seanceDiscussion": "RUANR5L15S2018IDS20842",
  "sort": {
    "dateSaisie": "2017-12-15T22:21:20.000+01:00",
    "sortEnSeance": "Rejeté"
  },
  "dateDepot": "2017-12-13T01:00:00.000+01:00",
  "dateDistribution": "2017-12-14T01:00:00.000+01:00",
  "article99": "0",
  "loiReference": {}
}