{
  "uid": "AMANR5L15SEA717460BTC1177P0D1N335",
  "identifiant": {
    "legislature": "15",
    "numero": "335",
    "numRect": "0",
    "saisine": {
      "texteLegislatifRef": "PRJLANR5L15BTC1177",
      "numeroPartiePLF": "0",
      "organeExamen": "PO717460",
      "mentionSecondeDeliberation": "0"
    }
  },
  "numeroLong": "335",
  "etapeTexte": "Nouvelle Lecture",
  "triAmendement": "i",
  "cardinaliteAmdtMultiples": "1",
  "etat": "Discuté",
  "signataires": {
    "auteur": {
      "typeAuteur": "Depute",
      "acteurRef": "PA720692",
      "groupePolitiqueRef": "PO730940"
    },
    "cosignatairesRefs": [
      "PA718926",
      "PA721270",
      "PA720692",
      "PA720546",
      "PA721012",
      "PA722202",
      "PA721118",
      "PA610667",
      "PA718720",
      "PA689",
      "PA441",
      "PA335612",
      "PA722110",
      "PA721896",
      "PA610654",
      "PA267306"
    ],
    "texteAffichable": "M.&#160;Fabien&#160;Roussel,  M.&#160;Dharr&#233;ville, Mme&#160;Buffet, Mme&#160;Bello, M.&#160;Brotherson, M.&#160;Bruneel, M.&#160;Chassaigne, M.&#160;Dufr&#232;gne, Mme&#160;Faucillon, M.&#160;Jumel, Mme&#160;K&#233;clard-Mond&#233;sir, M.&#160;Lecoq, M.&#160;Nilor, M.&#160;Peu, M.&#160;Serville et M.&#160;Wulfranc"
  },
  "pointeurFragmentTexte": {
    "division": {
      "titre": "Article 25 bis B",
      "articleDesignationCourte": "ART. 25 BIS B",
      "type": "ARTICLE",
      "avantAApres": "A",
      "divisionRattachee": "ARTICLE 25 BIS B",
      "urlDivisionTexteVise": "/15/textes/1177.asp#D_Article_25_bis_B"
    }
  },
  "corps": {
    "dispositif": "<p style=\"text-align: justify;\">R&#233;tablir l&#8217;article&#160;25 <i>bis</i> B dans la r&#233;daction suivante&#160;:</p><p style=\"text-align: justify;\">&#171;&#160;L&#8217;article&#160;L.&#160;211&#8209;4 du code du sport est compl&#233;t&#233; par un alin&#233;a ainsi r&#233;dig&#233;&#160;:</p><p style=\"text-align: justify;\">&#171;&#160;Ils b&#233;n&#233;ficient, de droit, du r&#233;gime de financement des centres de formation des apprentis d&#233;finis par le code du travail. Ind&#233;pendamment du dipl&#244;me pr&#233;par&#233;, les &#233;l&#232;ves de ces centres disposent du statut d&#8217;apprentis.&#160;&#187;</p>",
    "exposeSommaire": "<p style=\"text-align: justify;\">Cet amendement vise &#224; rendre &#233;ligibles les centres de formation sportif au statut de CFA. Il s&#8217;inscrit dans un double objectif de renforcement de la protection des jeunes joueurs et de d&#233;veloppement de la formation d&#233;livr&#233;e par les clubs professionnels. Cette reconnaissance statutaire, assurera pour les jeunes sportifs un cadre protecteur et structurant alliant formation scolaire initiale et professionnelle.</p><p style=\"text-align: justify;\">Cette proposition, attendue par les acteurs du sport, permettra de r&#233;duire le d&#233;crochage scolaire et de favoriser, le cas &#233;ch&#233;ant, la r&#233;orientation des &#233;l&#232;ves en cours de formation ou leur reconversion que ce soit dans le champs sportif ou non &#224; l&#8217;issue de leur carri&#232;re.</p>"
  },
  "representations": [
    {
      "nom": "PDF",
      "typeMime": {
        "type": "application",
        "subType": "PDF"
      },
      "statutRepresentation": {
        "verbatim": true,
        "canonique": true,
        "officielle": true,
        "transcription": false,
        "enregistrement": false
      },
      "contenu": {
        "documentURI": "/15/amendements/1177/AN/335.pdf"
      }
    }
  ],
  "seanceDiscussion": "RUANR5L15S2018IDS21200",
  "sort": {
    "dateSaisie": "2018-07-25T00:59:17.000+02:00",
    "sortEnSeance": "Rejeté"
  },
  "dateDepot": "2018-07-20T02:00:00.000+02:00",
  "dateDistribution": "2018-07-21T02:00:00.000+02:00",
  "article99": "0",
  "loiReference": {}
}