{
  "uid": "AMANR5L15SEA717460B1255P2D1N358",
  "identifiant": {
    "legislature": "15",
    "numero": "358",
    "numRect": "0",
    "saisine": {
      "texteLegislatifRef": "PRJLANR5L15B1255",
      "numeroPartiePLF": "2",
      "organeExamen": "PO717460",
      "mentionSecondeDeliberation": "0"
    }
  },
  "numeroLong": "II-358",
  "etapeTexte": "1ère lecture (1ère assemblée saisie)",
  "triAmendement": "bahiaaaaaaaaaaaaaaaaaaaaaaaaaaaaaaaaaaaaaaaaaaaaaaji",
  "cardinaliteAmdtMultiples": "1",
  "etat": "Irrecevable",
  "signataires": {
    "auteur": {
      "typeAuteur": "Depute",
      "acteurRef": "PA608016",
      "groupePolitiqueRef": "PO730934"
    },
    "cosignatairesRefs": [
      "PA709315",
      "PA267429",
      "PA330684",
      "PA721046",
      "PA718884",
      "PA643134",
      "PA267901",
      "PA608016",
      "PA718850",
      "PA340853",
      "PA721474",
      "PA609245",
      "PA267260",
      "PA330909",
      "PA721636"
    ],
    "texteAffichable": "Mme&#160;Louwagie,  M.&#160;Leclerc, Mme&#160;Val&#233;rie&#160;Boyer, M.&#160;Cordier, M.&#160;Cinieri, M.&#160;Descoeur, M.&#160;Viala, Mme&#160;Valentin, Mme&#160;Bassire, M.&#160;Parigi, Mme&#160;Poletti, M.&#160;Kamardine, Mme&#160;Lacroute, Mme&#160;Bazin-Malgras et M.&#160;Viry"
  },
  "pointeurFragmentTexte": {
    "missionVisee": {
      "idMissionAN": "415",
      "libelleMission": "Relations avec les collectivités territoriales",
      "codeMissionPLF": "B",
      "libelleMissionPLF": "Répartition, par mission et programme, des crédits du budget général"
    },
    "division": {
      "titre": "Article 81",
      "articleDesignationCourte": "APRÈS ART. 81",
      "type": "ARTICLE",
      "avantAApres": "Apres",
      "divisionRattachee": "APRÈS L'ARTICLE 81, insérer l'article suivant:",
      "articleAdditionnel": "1",
      "urlDivisionTexteVise": "/15/textes/1255C.asp#D_Article_81"
    }
  },
  "corps": {
    "dispositif": "<p style=\"text-align: justify;\">Apr&#232;s la premi&#232;re phrase du troisi&#232;me alin&#233;a du V de l&#8217;article&#160;29 de la loi n&#176; 2018&#8209;32 du 22 janvier 2018 de programmation des finances publiques pour les ann&#233;es 2018 &#224; 2022, ins&#233;rer deux phrases ainsi r&#233;dig&#233;es&#160;: &#171;&#160;Le niveau des d&#233;penses r&#233;elles de fonctionnement consid&#233;r&#233; pour l&#8217;application du deuxi&#232;me alin&#233;a du pr&#233;sent V est r&#233;duit de l&#8217;augmentation des subventions et participations re&#231;ues contribuant au financement de ces d&#233;penses. Un d&#233;cret en Conseil d&#8217;&#201;tat pr&#233;cise la liste des d&#233;penses et des recettes de fonctionnement concern&#233;es.&#160;&#187;</p>",
    "exposeSommaire": "<p style=\"text-align: justify;\">Le dispositif relatif &#224; la contractualisation financi&#232;re figurant dans la loi de programmation des finances publiques pour les ann&#233;es 2018 &#224; 2022 pr&#233;voit une limitation de l&#8217;&#233;volution des d&#233;penses de fonctionnement. Mais le m&#233;canisme tel qu&#8217;il figure dans la loi peut aboutir ne pas pouvoir utiliser de nouvelles subventions ou participations re&#231;ues contribuant &#224; la r&#233;alisation de ces d&#233;penses.</p><p style=\"text-align: justify;\">Comme l&#8217;a d&#233;montr&#233; la Cour des comptes dans son dernier rapport annuel th&#233;matique sur la gestion des collectivit&#233;s, il existe bel et bien un &#171;&#160;risque de d&#233;couragement des actions publiques cofinanc&#233;es&#160;&#187; d&#232;s lors que &#171;&#160;les interventions publiques qui b&#233;n&#233;ficient de cofinancements propres sont trait&#233;es comme l&#8217;ensemble des charges de fonctionnement&#160;&#187;. Il en va ainsi par exemple de nouveaux m&#233;c&#233;nats qui viendraient &#224; &#234;tre conclus, ou encore d&#8217;aides que l&#8217;&#201;tat souhaiterait apporter pour contribuer &#224; de nouvelles d&#233;penses souhait&#233;es par les l&#233;gislateurs.</p><p style=\"text-align: justify;\">De plus, potentiellement, sans le correctif propos&#233; par le pr&#233;sent amendement, les sommes apport&#233;es par des tiers (subventions, m&#233;c&#233;nat, sponsoring, &#8230;), si elles &#233;taient d&#233;pens&#233;es, seraient, toutes choses &#233;gales par ailleurs, reprises l&#8217;ann&#233;e suivante &#224; hauteur de 75&#160;% pour les collectivit&#233;s signataires et &#224; hauteur de 100&#160;% pour les autres. Cela est g&#233;n&#233;rateur d&#8217;in&#233;galit&#233; de traitement d&#232;s lors que pour les collectivit&#233;s non soumises &#224; la contractualisation, par contre, ces sommes pourraient &#234;tre d&#233;pens&#233;es sans qu&#8217;elles puissent &#234;tre reprises.</p><p style=\"text-align: justify;\">Cet amendement propose donc de d&#233;compter de l&#8217;&#233;volution des d&#233;penses soumises &#224; plafonnement, l&#8217;augmentation, entre deux exercices budg&#233;taires concern&#233;s par la contractualisation, des recettes issues de tiers (&#201;tat, collectivit&#233;s, fonds&#160;europ&#233;ens, entreprises, &#8230;) souhaitant contribuer aux actions des collectivit&#233;s locales.</p>"
  },
  "representations": [
    {
      "nom": "PDF",
      "typeMime": {
        "type": "application",
        "subType": "PDF"
      },
      "statutRepresentation": {
        "verbatim": true,
        "canonique": true,
        "officielle": true,
        "transcription": false,
        "enregistrement": false
      },
      "contenu": {
        "documentURI": "/15/amendements/1255C/AN/358.pdf"
      }
    }
  ],
  "dateDepot": "2018-10-26T02:00:00.000+02:00",
  "article99": "0",
  "loiReference": {
    "codeLoi": "loi 2018-32",
    "divisionCodeLoi": "29"
  }
}