{
  "uid": "AMANR5L15SEA717460B0499P0D1N155",
  "identifiant": {
    "legislature": "15",
    "numero": "155",
    "numRect": "0",
    "saisine": {
      "texteLegislatifRef": "PRJLANR5L15B0499",
      "numeroPartiePLF": "0",
      "organeExamen": "PO717460",
      "mentionSecondeDeliberation": "1"
    }
  },
  "numeroLong": "155",
  "etapeTexte": "Nouvelle Lecture",
  "triAmendement": "aztzzzzx",
  "cardinaliteAmdtMultiples": "1",
  "etat": "Discuté",
  "signataires": {
    "auteur": {
      "typeAuteur": "Depute",
      "acteurRef": "PA1874",
      "groupePolitiqueRef": "PO730934"
    },
    "cosignatairesRefs": [
      "PA346218",
      "PA267204",
      "PA609726",
      "PA720386",
      "PA718850",
      "PA330008",
      "PA720684",
      "PA608016",
      "PA266774",
      "PA721968",
      "PA719318",
      "PA267429",
      "PA608826",
      "PA1874",
      "PA642847",
      "PA334654",
      "PA330909",
      "PA2492",
      "PA608416",
      "PA332523",
      "PA607090",
      "PA1012",
      "PA330684",
      "PA722390"
    ],
    "texteAffichable": "M.&#160;Le Fur,  Mme&#160;Anthoine, M.&#160;Aubert, M.&#160;Bazin, Mme&#160;Val&#233;rie&#160;Boyer, M.&#160;Breton, M.&#160;Cinieri, M.&#160;Cordier, Mme&#160;Corneloup, Mme&#160;Dalloz, M.&#160;Descoeur, Mme&#160;Duby-Muller, M.&#160;Pierre-Henri&#160;Dumont, M.&#160;Di Filippo, M.&#160;Furst, M.&#160;Hetzel, M.&#160;de la Verpilli&#232;re, Mme&#160;Louwagie, M.&#160;Masson, M.&#160;Quentin, M.&#160;Sermier, M.&#160;Straumann, M.&#160;Vialay et M.&#160;Jean-Pierre&#160;Vigier"
  },
  "pointeurFragmentTexte": {
    "division": {
      "titre": "Article 9",
      "articleDesignationCourte": "ART. 9",
      "type": "ARTICLE",
      "avantAApres": "A",
      "divisionRattachee": "ARTICLE 9",
      "urlDivisionTexteVise": "/15/textes/0499.asp#D_Article_9"
    },
    "alinea": {
      "avantAApres": "Apres",
      "numero": "24"
    }
  },
  "corps": {
    "dispositif": "<p style=\"text-align: justify;\">I.&#160;&#8211;&#160;Apr&#232;s l&#8217;alin&#233;a&#160;26, ins&#233;rer l&#8217;alin&#233;a suivant&#160;:</p><p style=\"text-align: justify;\">&#171;&#160;3&#176; bis.&#160;&#8211;&#160;Au premier alin&#233;a de l&#8217;article&#160;1665&#160;bis du m&#234;me code, dans sa r&#233;daction issue de la loi n&#176; 2016&#8209;1917 du 29 d&#233;cembre 2016 pr&#233;cit&#233;e, apr&#232;s la r&#233;f&#233;rence&#160;: &#171;&#160;199&#160;sexdecies&#160;&#187;, est ins&#233;r&#233;e la r&#233;f&#233;rence&#160;: &#171;&#160;,&#160;200&#160;quaterdecies&#160;&#187;&#160;;&#160;&#187;.</p><p style=\"text-align: justify;\">II.&#160;&#8211;&#160;Compl&#233;ter cet article par l&#8217;alin&#233;a suivant&#160;:</p><p style=\"text-align: justify;\">&#171;&#160;IV.&#160;&#8211;&#160;La perte de recettes pour l&#8217;&#201;tat est compens&#233;e, &#224; due concurrence, par la cr&#233;ation d&#8217;une taxe additionnelle aux droits sur les tabacs mentionn&#233;e aux articles 575 et 575 A du code g&#233;n&#233;ral des imp&#244;ts.&#160;&#187;</p>",
    "exposeSommaire": "<p style=\"text-align: justify;\">Le pr&#233;sent amendement vise &#224; &#233;largir le dispositif pr&#233;vu par l&#8217;article&#160;1665 bis du code g&#233;n&#233;ral des imp&#244;ts au cr&#233;dit d&#8217;imp&#244;t au titre des int&#233;r&#234;ts d&#8217;emprunt support&#233;s pour l&#8217;acquisition ou la construction de l&#8217;habitation principale.</p>"
  },
  "representations": [
    {
      "nom": "PDF",
      "typeMime": {
        "type": "application",
        "subType": "PDF"
      },
      "statutRepresentation": {
        "verbatim": true,
        "canonique": true,
        "officielle": true,
        "transcription": false,
        "enregistrement": false
      },
      "contenu": {
        "documentURI": "/15/amendements/0499/AN/155.pdf"
      }
    }
  ],
  "seanceDiscussion": "RUANR5L15S2018IDS20849",
  "sort": {
    "dateSaisie": "2017-12-19T23:35:46.000+01:00",
    "sortEnSeance": "Tombé"
  },
  "dateDepot": "2017-12-19T01:00:00.000+01:00",
  "dateDistribution": "2017-12-19T01:00:00.000+01:00",
  "article99": "0",
  "loiReference": {}
}