{
  "uid": "AMANR5L15SEA717460BTC0909P0D1N4",
  "identifiant": {
    "legislature": "15",
    "numero": "4",
    "numRect": "0",
    "saisine": {
      "texteLegislatifRef": "PIONANR5L15BTC0909",
      "numeroPartiePLF": "0",
      "organeExamen": "PO717460",
      "mentionSecondeDeliberation": "0"
    }
  },
  "numeroLong": "4",
  "etapeTexte": "1ère lecture (1ère assemblée saisie)",
  "triAmendement": "o",
  "cardinaliteAmdtMultiples": "1",
  "etat": "Discuté",
  "signataires": {
    "auteur": {
      "typeAuteur": "Depute",
      "acteurRef": "PA721226",
      "groupePolitiqueRef": "PO730958"
    },
    "cosignatairesRefs": [
      "PA720430",
      "PA720286",
      "PA720422",
      "PA718860",
      "PA720892",
      "PA721062",
      "PA719578",
      "PA720846",
      "PA719676",
      "PA721202",
      "PA721210",
      "PA2150",
      "PA722142",
      "PA718868",
      "PA721226",
      "PA588884",
      "PA721960"
    ],
    "texteAffichable": "Mme&#160;Rubin,  Mme&#160;Autain, M.&#160;Bernalicis, M.&#160;Coquerel, M.&#160;Corbi&#232;re, Mme&#160;Fiat, M.&#160;Lachaud, M.&#160;Larive, M.&#160;M&#233;lenchon, Mme&#160;Obono, Mme&#160;Panot, M.&#160;Prud&apos;homme, M.&#160;Quatennens, M.&#160;Ratenon, Mme&#160;Ressiguier, M.&#160;Ruffin et Mme&#160;Taurine"
  },
  "pointeurFragmentTexte": {
    "division": {
      "titre": "Article PREMIER",
      "articleDesignationCourte": "APRÈS ART. PREMIER",
      "type": "ARTICLE",
      "avantAApres": "Apres",
      "divisionRattachee": "APRÈS L'ARTICLE PREMIER, insérer l'article suivant:",
      "articleAdditionnel": "1",
      "urlDivisionTexteVise": "/15/textes/0909.asp#D_Article_1er"
    }
  },
  "corps": {
    "dispositif": "<p style=\"text-align: justify;\">Dans un d&#233;lai d&#8217;un an &#224; compter de la promulgation de la pr&#233;sente loi, le Gouvernement remet au Parlement un rapport sur l&#8217;&#233;tat de l&#8217;engagement associatif en France.</p><p style=\"text-align: justify;\">Ce rapport interroge la pertinence de permettre aux salari&#233;s de se consacrer, sur leur temps professionnel, &#224; une activit&#233; b&#233;n&#233;vole de leur choix, via l&#8217;attribution d&#8217;un cr&#233;dit-temps b&#233;n&#233;vole &#224; tout salari&#233;.</p><p style=\"text-align: justify;\">Il envisage aussi de permettre aux personnes b&#233;n&#233;voles d&#8217;obtenir des points de retraite, ainsi qu&#8217;une couverture m&#233;dicale convenable et en lien avec leurs activit&#233;s au sein de l&#8217;association.</p>",
    "exposeSommaire": "<p style=\"text-align: justify;\">Si la loi &#233;galit&#233; et Citoyennet&#233; a permis la mise en place d&#8217;un nouveau droit de &#8220;d&#233;charge&#8221; &#224; destination de certains b&#233;n&#233;voles (Art.&#160;L.&#160;3142&#8209;54&#8209;1 du code du travail), cette disposition doit &#234;tre augment&#233;e &#224; l&#8217;ensemble des b&#233;n&#233;voles, afin de favoriser leur activit&#233;s.</p><p style=\"text-align: justify;\">De m&#234;me, dans un rapport remis au pr&#233;c&#233;dent gouvernement par notre Assembl&#233;e le 15 avril 2015, intitul&#233; &#8220;Lib&#233;rer l&#8217;engagement des Fran&#231;ais et refonder le lien civique&#8221;, il &#233;tait pr&#233;conis&#233; de valoriser l&#8217;engagement par l&#8217;attribution de points de retraite. Nous serions favorables &#224; ce que cette perspective soit &#233;tudi&#233;e, non seulement &#224; l&#8217;aune des d&#233;penses publiques, mais surtout sur son influence pour l&#8217;engagement des b&#233;n&#233;voles et la protection des personnes vuln&#233;rables.</p>"
  },
  "representations": [
    {
      "nom": "PDF",
      "typeMime": {
        "type": "application",
        "subType": "PDF"
      },
      "statutRepresentation": {
        "verbatim": true,
        "canonique": true,
        "officielle": true,
        "transcription": false,
        "enregistrement": false
      },
      "contenu": {
        "documentURI": "/15/amendements/0909/AN/4.pdf"
      }
    }
  ],
  "seanceDiscussion": "RUANR5L15S2018IDS21034",
  "sort": {
    "dateSaisie": "2018-05-17T11:44:57.000+02:00",
    "sortEnSeance": "Rejeté"
  },
  "dateDepot": "2018-05-13T02:00:00.000+02:00",
  "dateDistribution": "2018-05-16T02:00:00.000+02:00",
  "article99": "0",
  "loiReference": {}
}