{
  "uid": "AMANR5L15SEA717460BTC1767P0D1N954",
  "identifiant": {
    "legislature": "15",
    "numero": "954",
    "numRect": "0",
    "saisine": {
      "texteLegislatifRef": "PRJLANR5L15BTC1767",
      "numeroPartiePLF": "0",
      "organeExamen": "PO717460",
      "mentionSecondeDeliberation": "0"
    }
  },
  "numeroLong": "954",
  "etapeTexte": "1ère lecture (1ère assemblée saisie)",
  "triAmendement": "ebaaaaaaaaaaaaaaaaaaaaaaaaaaaaaaaaaaaaaaaaaaaaaaaazs",
  "cardinaliteAmdtMultiples": "1",
  "etat": "Discuté",
  "signataires": {
    "auteur": {
      "typeAuteur": "Depute",
      "acteurRef": "PA719286",
      "groupePolitiqueRef": "PO759900"
    },
    "cosignatairesRefs": [
      "PA608292",
      "PA605694",
      "PA755549",
      "PA719286",
      "PA719146",
      "PA719138",
      "PA267042",
      "PA405480",
      "PA331582",
      "PA336175",
      "PA607619",
      "PA336439",
      "PA720996",
      "PA605518",
      "PA333421"
    ],
    "texteAffichable": "M.&#160;Colombani,  M.&#160;Acquaviva, M.&#160;Castellani, Mme&#160;Dubi&#233;, M.&#160;Brial, M.&#160;Cl&#233;ment, M.&#160;El Guerrab, M.&#160;Falorni, M.&#160;Favennec Becot, M.&#160;Fran&#231;ois-Michel&#160;Lambert, M.&#160;Molac, M.&#160;Pancher, Mme&#160;Pinel, M.&#160;Pupponi et M.&#160;Philippe&#160;Vigier"
  },
  "pointeurFragmentTexte": {
    "division": {
      "titre": "Article 9",
      "articleDesignationCourte": "APRÈS ART. 9",
      "type": "ARTICLE",
      "avantAApres": "Apres",
      "divisionRattachee": "APRÈS L'ARTICLE 9, insérer l'article suivant:",
      "articleAdditionnel": "1",
      "urlDivisionTexteVise": "/15/textes/1767.asp#D_Article_9"
    }
  },
  "corps": {
    "dispositif": "<p>Avant le 1<sup>er</sup> mars 2022, il est cr&#233;&#233; un Centre hospitalier r&#233;gional universitaire en Corse dans les conditions mentionn&#233;es &#224; l&#8217;article L.&#160;6141&#8209;2 du code de la sant&#233; publique.</p><p style=\"text-align: justify;\">Les modalit&#233;s d&#8217;application du pr&#233;sent article sont d&#233;termin&#233;es par d&#233;cret, pris apr&#232;s avis de l&#8217;Assembl&#233;e de Corse.</p>",
    "exposeSommaire": "<p>Cet amendement vise &#224; proc&#233;der &#224; la mise en place d&#8217;un CHU en Corse, seule r&#233;gion &#224; ne pas en &#234;tre dot&#233;, sous le pilotage de la puissance publique et afin de conduire les divers acteurs concern&#233;s &#224; la conclusion d&#8217;un consensus.</p>"
  },
  "representations": [
    {
      "nom": "PDF",
      "typeMime": {
        "type": "application",
        "subType": "PDF"
      },
      "statutRepresentation": {
        "verbatim": true,
        "canonique": true,
        "officielle": true,
        "transcription": false,
        "enregistrement": false
      },
      "contenu": {
        "documentURI": "/15/amendements/1767/AN/954.pdf"
      }
    }
  ],
  "seanceDiscussion": "RUANR5L15S2019IDS21565",
  "sort": {
    "dateSaisie": "2019-03-22T12:43:27.000+01:00",
    "sortEnSeance": "Rejeté"
  },
  "dateDepot": "2019-03-15T01:00:00.000+01:00",
  "dateDistribution": "2019-03-19T01:00:00.000+01:00",
  "article99": "0",
  "loiReference": {}
}