{
  "uid": "AMANR5L15PO59051B1503P0D1N307",
  "identifiant": {
    "legislature": "15",
    "numero": "307",
    "numRect": "0",
    "saisine": {
      "texteLegislatifRef": "PRJLANR5L15B1503",
      "numeroPartiePLF": "0",
      "organeExamen": "PO59051",
      "mentionSecondeDeliberation": "0"
    }
  },
  "numeroLong": "CL307",
  "etapeTexte": "Nouvelle Lecture",
  "triAmendement": "euaaaaaaaaaaaaaaaaaaaaaaaaaaaaaaaaaaaaaaaaaaaaaaaak",
  "cardinaliteAmdtMultiples": "1",
  "etat": "Discuté",
  "signataires": {
    "auteur": {
      "typeAuteur": "Depute",
      "acteurRef": "PA721678",
      "groupePolitiqueRef": "PO730934"
    },
    "cosignatairesRefs": [
      "PA718884",
      "PA713448",
      "PA718784",
      "PA718838",
      "PA721070",
      "PA1874",
      "PA721286",
      "PA720630",
      "PA267378",
      "PA721474",
      "PA2492",
      "PA266797",
      "PA719318",
      "PA721678",
      "PA346054",
      "PA643089"
    ],
    "texteAffichable": "M.&#160;Reda,  M.&#160;Quentin, Mme&#160;Bazin-Malgras, M.&#160;Thi&#233;riot, M.&#160;Le Fur, M.&#160;Emmanuel&#160;Maquet, Mme&#160;Brenier, Mme&#160;Ramassamy, M.&#160;Brun, M.&#160;Gosselin, Mme&#160;Anthoine, Mme&#160;Levy, M.&#160;Ramadier, M.&#160;Pauget, M.&#160;Minot et M.&#160;Viry"
  },
  "pointeurFragmentTexte": {
    "division": {
      "titre": "Article 39",
      "articleDesignationCourte": "ART. 39",
      "type": "ARTICLE",
      "avantAApres": "A",
      "divisionRattachee": "ARTICLE 39",
      "urlDivisionTexteVise": "/15/textes/1503.asp#D_Article_39"
    },
    "alinea": {
      "numero": "10"
    }
  },
  "corps": {
    "dispositif": "<p style=\"text-align: justify;\">Substituer aux alin&#233;as&#160;10 &#224; 17 l&#8217;alin&#233;a suivant&#160;:</p><p style=\"text-align: justify;\">&#171;&#160;<i>Art.&#160;397&#8209;1&#8209;1</i>.&#160;&#8211;&#160;S&#8217;il existe contre la personne des charges suffisantes pour la faire comparaitre devant le tribunal correctionnel, mais que l&#8217;affaire n&#8217;est pas en &#233;tat d&#8217;&#234;tre jug&#233;e selon la proc&#233;dure de comparution imm&#233;diate parce que n&#8217;ont pas encore &#233;t&#233; obtenus les r&#233;sultats d&#8217;un examen psychiatrique et/ou psychologique, le procureur de la R&#233;publique peut poursuivre le pr&#233;venu devant le tribunal correctionnel selon la proc&#233;dure de comparution &#224; d&#233;lai diff&#233;r&#233; conform&#233;ment aux dispositions du pr&#233;sent article.&#160;&#187;</p>",
    "exposeSommaire": "<p>&#160;</p><p>Le pr&#233;sent amendement vise &#224; la r&#233;tablir dans le cas o&#249; une expertise psychiatrique est demand&#233;e.</p><p>En effet dans le cas d&#8217;une personne souffrant potentiellement de troubles psychiatriques, le jugement ne peut &#234;tre fait qu&#8217;&#224; la lumi&#232;re d&#8217;une expertise faite par un professionnel.</p>"
  },
  "representations": [
    {
      "nom": "PDF",
      "typeMime": {
        "type": "application",
        "subType": "PDF"
      },
      "statutRepresentation": {
        "verbatim": true,
        "canonique": true,
        "officielle": true,
        "transcription": false,
        "enregistrement": false
      },
      "contenu": {
        "documentURI": "/15/amendements/1503/CION_LOIS/CL307.pdf"
      }
    }
  ],
  "sort": {
    "dateSaisie": "2018-12-19T19:04:51.000+01:00",
    "sortEnSeance": "Rejeté"
  },
  "dateDepot": "2018-12-17T01:00:00.000+01:00",
  "dateDistribution": "2018-12-18T01:00:00.000+01:00",
  "article99": "0",
  "loiReference": {}
}