{
  "uid": "AMANR5L15PO59048B1255P2D1N592",
  "identifiant": {
    "legislature": "15",
    "numero": "592",
    "numRect": "0",
    "saisine": {
      "texteLegislatifRef": "PRJLANR5L15B1255",
      "numeroPartiePLF": "2",
      "organeExamen": "PO59048",
      "mentionSecondeDeliberation": "0"
    }
  },
  "numeroLong": "II-CF592",
  "etapeTexte": "1ère lecture (1ère assemblée saisie)",
  "triAmendement": "anoaaaaaaaaaaaaaaaaaaaaaaaaaaaaaaaaaaaaaaaaaaaaaaazx",
  "cardinaliteAmdtMultiples": "1",
  "etat": "Irrecevable",
  "signataires": {
    "auteur": {
      "typeAuteur": "Depute",
      "acteurRef": "PA642847",
      "groupePolitiqueRef": "PO730934"
    },
    "cosignatairesRefs": [
      "PA642847"
    ],
    "texteAffichable": "M.&#160;Bazin"
  },
  "pointeurFragmentTexte": {
    "missionVisee": {
      "idMissionAN": "396",
      "libelleMission": "Cohésion des territoires",
      "codeMissionPLF": "B",
      "libelleMissionPLF": "Répartition, par mission et programme, des crédits du budget général"
    },
    "division": {
      "titre": "Article 71",
      "articleDesignationCourte": "APRÈS ART. 71",
      "type": "ARTICLE",
      "avantAApres": "Apres",
      "divisionRattachee": "APRÈS L'ARTICLE 71, insérer l'article suivant:",
      "articleAdditionnel": "1",
      "urlDivisionTexteVise": "/15/textes/1255C.asp#D_Article_71"
    }
  },
  "corps": {
    "dispositif": "<p>Apr&#232;s l&#8217;article 71, ins&#233;rer un article additionnel ainsi r&#233;dig&#233;&#160;:</p><p>&#160;</p><p>I.&#160;&#8211; Le premier alin&#233;a de l&#8217;article L.&#160;441&#8209;9 du code de la construction et de l&#8217;habitation est remplac&#233; par trois alin&#233;as ainsi r&#233;dig&#233;s&#160;:</p><p>&#160;</p><p>&#171;&#160;Sous r&#233;serve d&#8217;accord pr&#233;alable du locataire, les services fiscaux comp&#233;tents transmettent &#224; l&#8217;organisme d&#8217;habitations &#224; loyer mod&#233;r&#233; le revenu fiscal de r&#233;f&#233;rence ainsi que le num&#233;ro d&#8217;immatriculation au r&#233;pertoire national d&#8217;identification des personnes physiques de chaque occupant majeur afin de calculer l&#8217;importance du d&#233;passement &#233;ventuel du plafond de ressources et d&#233;terminer si le locataire est redevable du suppl&#233;ment de loyer.</p><p>&#160;</p><p>&#171;&#160;Le locataire n&#8217;ayant pas autoris&#233; la transmission des informations mentionn&#233;es &#224; l&#8217;alin&#233;a pr&#233;c&#233;dent doit transmettre son avis d&#8217;imposition ou de non-imposition &#224; l&#8217;imp&#244;t sur le revenu et des renseignements concernant l&#8217;ensemble des personnes vivant au foyer &#224; l&#8217;organisme d&#8217;habitations &#224; loyer mod&#233;r&#233; dans un d&#233;lais d&#8217;un mois.</p><p>&#160;</p><p>&#171;&#160;Cette disposition ne s&#8217;applique pas aux locataires b&#233;n&#233;ficiant de l&#8217;aide personnalis&#233;e au logement mentionn&#233;e &#224; l&#8217;article L.&#160;351&#8209;1, ni aux locataires b&#233;n&#233;ficiant de l&#8217;allocation de logement pr&#233;vue &#224; l&#8217;article L.&#160;542&#8209;1 du code de la s&#233;curit&#233; sociale ou de l&#8217;allocation de logement pr&#233;vue &#224; l&#8217;article L.&#160;831&#8209;1 du m&#234;me code.</p><p>&#160;</p><p>II.&#160;&#8211;&#160;Le VII de la section II du chapitre III du titre II de la premi&#232;re partie du livre des proc&#233;dures fiscales est compl&#233;t&#233; par un 11&#176;&#160;ainsi r&#233;dig&#233;&#160;:</p><p>&#160;</p><p>&#171;&#160;11&#176;&#160;Organismes d&#8217;habitations &#224; loyer mod&#233;r&#233;</p><p>&#171;&#160;L.&#160;166&#160;G.&#160;&#8211;&#160;Pour la r&#233;alisation des enqu&#234;tes pr&#233;vues aux articles L.&#160;441&#8209;9 et L.&#160;442&#8209;5 du code de la construction et de l&#8217;habitation, l&#8217;administration fiscale communique aux organismes de logement social les donn&#233;es automatis&#233;es &#224; caract&#232;re personnel n&#233;cessaires &#224; la d&#233;termination du revenu de chaque occupant majeur des logements qu&#8217;ils d&#233;tiennent.&#160;&#187;</p>",
    "exposeSommaire": "<p>L&#8217;article L441&#8209;9 du code de la construction et de l&#8217;habitation met &#224; la charge des organismes de logement social la r&#233;alisation d&#8217;une enqu&#234;te annuelle portant sur les ressources des locataires afin de calculer l&#8217;importance du d&#233;passement &#233;ventuel du plafond de ressources et de d&#233;terminer si le locataire est redevable du suppl&#233;ment de loyer.</p><p>L&#8217;article L442&#8209;5 du m&#234;me code charge les organismes de proc&#233;der tous les deux ans &#224; une enqu&#234;te aupr&#232;s de leurs locataires afin communiquer les renseignements statistiques n&#233;cessaires &#224; l&#8217;&#233;tablissement d&#8217;un rapport au Parlement.</p><p>&#160;</p><p>La base de ces deux enqu&#234;tes est la communication de l&#8217;avis d&#8217;imposition ou de non-imposition &#224; l&#8217;imp&#244;t sur le revenu, que le bailleur doit recueillir aupr&#232;s des locataires.</p><p>&#160;</p><p>La r&#233;alisation de ces enqu&#234;tes repr&#233;sente pour les organismes de logement social une charge tr&#232;s importante en mati&#232;re de moyens humains et financiers, tant pour recueillir et traiter ces avis d&#8217;imposition ou de non-imposition. Il est souvent tr&#232;s difficile d&#8217;obtenir ses informations de la part des locataires. A titre d&#8217;exemple, l&#8217;OPAC38, en Is&#232;re qui assure le suivi de 26&#160;000 locataires HLM estime le co&#251;t de r&#233;cup&#233;ration des informations fiscales de 50&#160;&#8364; par locataire, soit 1,3 millions d&#8217;euros tous les deux ans et une moyenne annuelle de 975&#160;000&#160;&#8364; de co&#251;t (en &#233;quivalent temps/salaire) pour r&#233;cup&#233;rer des informations disponibles aupr&#232;s du fisc.</p><p>&#160;</p><p>Par ailleurs la non-transmission, ou la transmission d&#8217;informations incompl&#232;tes, par les locataires est passible de sanctions financi&#232;res qui se traduisent souvent par de l&#8217;impay&#233;, entra&#238;nant un risque locatif et un co&#251;t de gestion suppl&#233;mentaire pour les organismes.</p><p>&#160;</p><p>Dans ces conditions, la transmission directe par voie &#233;lectronique des donn&#233;es automatis&#233;es d&#233;tenues par l&#8217;administration fiscale aux organismes de logement social pour l&#8217;&#233;tablissement du SLS et du rapport au Parlement constituerait une mesure de simplification, limiterait la charge de la collecte des informations par les bailleurs sociaux, et r&#233;duirait le risque d&#8217;erreur.</p><p>&#160;</p><p>Il pourrait &#234;tre propos&#233; au locataire, &#224; son entr&#233;e dans le logement HLM, de signer une autorisation permettant aux services fiscaux comp&#233;tents de transmettre directement les informations n&#233;cessaires aux organismes d&#8217;habitations &#224; loyer mod&#233;r&#233;.</p><p>&#160;</p><p>Le pr&#233;sent amendement modifie l&#8217;article L441&#8209;9 du code de la construction et de l&#8217;habitation et introduit dans le Livre des Proc&#233;dures Fiscales une d&#233;rogation au secret professionnel permettant &#224; l&#8217;administration fiscale de transmettre les donn&#233;es n&#233;cessaires aux organismes charg&#233;s des enqu&#234;tes SLS et OPS.</p><p><br /> &#160;</p>"
  },
  "representations": [
    {
      "nom": "PDF",
      "typeMime": {
        "type": "application",
        "subType": "PDF"
      },
      "statutRepresentation": {
        "verbatim": true,
        "canonique": true,
        "officielle": true,
        "transcription": false,
        "enregistrement": false
      },
      "contenu": {
        "documentURI": "/15/amendements/1255C/CION_FIN/CF592.pdf"
      }
    }
  ],
  "dateDepot": "2018-10-25T02:00:00.000+02:00",
  "article99": "0",
  "loiReference": {}
}