{
  "uid": "AMANR5L15PO419610B0675P0D1N38",
  "identifiant": {
    "legislature": "15",
    "numero": "38",
    "numRect": "0",
    "saisine": {
      "texteLegislatifRef": "PIONANR5L15B0675",
      "numeroPartiePLF": "0",
      "organeExamen": "PO419610",
      "mentionSecondeDeliberation": "0"
    }
  },
  "numeroLong": "CE38",
  "etapeTexte": "1ère lecture (1ère assemblée saisie)",
  "triAmendement": "nv",
  "cardinaliteAmdtMultiples": "1",
  "etat": "Discuté",
  "signataires": {
    "auteur": {
      "typeAuteur": "Depute",
      "acteurRef": "PA722142",
      "groupePolitiqueRef": "PO730958"
    },
    "cosignatairesRefs": [
      "PA719676",
      "PA720846",
      "PA718868",
      "PA588884",
      "PA718860",
      "PA721062",
      "PA720892",
      "PA721960",
      "PA720422",
      "PA719578",
      "PA720430",
      "PA721226",
      "PA720286",
      "PA2150",
      "PA721202",
      "PA722142",
      "PA721210"
    ],
    "texteAffichable": "M.&#160;Ruffin,  Mme&#160;Autain, M.&#160;Bernalicis, M.&#160;Coquerel, M.&#160;Corbi&#232;re, Mme&#160;Fiat, M.&#160;Lachaud, M.&#160;Larive, M.&#160;M&#233;lenchon, Mme&#160;Obono, Mme&#160;Panot, M.&#160;Prud&apos;homme, M.&#160;Quatennens, M.&#160;Ratenon, Mme&#160;Ressiguier, Mme&#160;Rubin et Mme&#160;Taurine"
  },
  "pointeurFragmentTexte": {
    "division": {
      "titre": "Article PREMIER",
      "articleDesignationCourte": "ART. PREMIER",
      "type": "ARTICLE",
      "avantAApres": "A",
      "divisionRattachee": "ARTICLE PREMIER",
      "urlDivisionTexteVise": "/15/textes/0675.asp#D_Article_1er"
    },
    "alinea": {
      "avantAApres": "A",
      "numero": "40",
      "alineaDesignation": "Alinéa 40"
    }
  },
  "corps": {
    "dispositif": "<p style=\"text-align: justify;\">Apr&#232;s l&#8217;alin&#233;a&#160;40, ins&#233;rer l&#8217;alin&#233;a suivant&#160;:</p><p style=\"text-align: justify;\">&#171;&#160;Pour l&#8217;application du pr&#233;sent article, les charges de la preuve, notamment relatives &#224; la bonne foi, &#224; l&#8217;exercice de la libert&#233; d&#8217;expression, de communication, de la libert&#233; de la presse, et la protection d&#8217;un int&#233;r&#234;t l&#233;gitime, reposent sur le plaignant.&#160;&#187;</p>",
    "exposeSommaire": "<p style=\"text-align: justify;\">Par cet amendement nous proposons que la charge de la preuve concernant la bonne foi, l&#8217;exercice de la libert&#233; d&#8217;expression et de communication, de la libert&#233; de la presse, et la protection d&#8217;un int&#233;r&#234;t l&#233;gitime du lanceur d&#8217;alerte repose sur le plaignant.</p><p style=\"text-align: justify;\">Premi&#232;rement, nous consid&#233;rons que quelqu&#8217;un qui prend le risque de d&#233;noncer sans but lucratif des actes r&#233;pr&#233;hensibles, contraires &#224; l&#8217;int&#233;r&#234;t g&#233;n&#233;ral doit b&#233;n&#233;ficier d&#8217;une pr&#233;somption de bonne foi. Les cons&#233;quences sur sa vie personnelle et professionnelle seront d&#233;sastreuses comme le montrent les nombreux cas de lanceurs d&#8217;alerte licenci&#233;s, poursuivis en justice, peinant &#224; retrouver un emploi jusqu&#8217;&#224; parfois se retrouver au RSA.</p><p style=\"text-align: justify;\">Deuxi&#232;mement, le rapport de force est particuli&#232;rement d&#233;s&#233;quilibr&#233; entre une entreprise disposant de services juridiques internes, recourant aussi &#224; des cabinets d&#8217;avocat externe et une personne physique dont les moyens sont limit&#233;s et pour laquelle les frais d&#8217;avocat sont consid&#233;rables par rapport &#224; leurs revenus souvent limit&#233;s aux allocations ch&#244;mages.</p><p style=\"text-align: justify;\">D&#232;s lors qu&#8217;ils n&#8217;a aucun int&#233;r&#234;t p&#233;cuniaire &#224; lancer l&#8217;alerte, la charge de la preuve doit reposer sur le plaignant. Le lanceur d&#8217;alerte doit b&#233;n&#233;ficier de la pr&#233;somption d&#8217;innocence.</p>"
  },
  "representations": [
    {
      "nom": "PDF",
      "typeMime": {
        "type": "application",
        "subType": "PDF"
      },
      "statutRepresentation": {
        "verbatim": true,
        "canonique": true,
        "officielle": true,
        "transcription": false,
        "enregistrement": false
      },
      "contenu": {
        "documentURI": "/15/amendements/0675/CION-ECO/CE38.pdf"
      }
    }
  ],
  "sort": {
    "dateSaisie": "2018-03-20T19:20:25.000+01:00",
    "sortEnSeance": "Rejeté"
  },
  "dateDepot": "2018-03-16T01:00:00.000+01:00",
  "dateDistribution": "2018-03-19T01:00:00.000+01:00",
  "article99": "0",
  "loiReference": {}
}