{
  "uid": "AMANR5L15SEA717460B2296P0D1N1938",
  "identifiant": {
    "legislature": "15",
    "numero": "1938",
    "numRect": "0",
    "saisine": {
      "texteLegislatifRef": "PRJLANR5L15B2296",
      "numeroPartiePLF": "0",
      "organeExamen": "PO717460",
      "mentionSecondeDeliberation": "0"
    }
  },
  "numeroLong": "1938",
  "etapeTexte": "1ère lecture (1ère assemblée saisie)",
  "triAmendement": "jbaaaaaaaaaaaaaaaaaaaaaaaaaaaaaaaaaaaaaaaaaaaaaaaab",
  "cardinaliteAmdtMultiples": "1",
  "etat": "Irrecevable",
  "signataires": {
    "auteur": {
      "typeAuteur": "Depute",
      "acteurRef": "PA719890",
      "groupePolitiqueRef": "PO730964"
    },
    "cosignatairesRefs": [
      "PA719890"
    ],
    "texteAffichable": "Mme&#160;Brulebois"
  },
  "pointeurFragmentTexte": {
    "division": {
      "titre": "Article 44",
      "articleDesignationCourte": "ART. 44",
      "type": "ARTICLE",
      "avantAApres": "A",
      "divisionRattachee": "ARTICLE 44",
      "urlDivisionTexteVise": "/15/textes/2296.asp#D_Article_44"
    },
    "alinea": {
      "numero": "1"
    }
  },
  "corps": {},
  "representations": [
    {
      "nom": "PDF",
      "typeMime": {
        "type": "application",
        "subType": "PDF"
      },
      "statutRepresentation": {
        "verbatim": true,
        "canonique": true,
        "officielle": true,
        "transcription": false,
        "enregistrement": false
      },
      "contenu": {
        "documentURI": "/15/amendements/2296/AN/1938.pdf"
      }
    }
  ],
  "dateDepot": "2019-10-18T02:00:00.000+02:00",
  "dateDistribution": "2019-10-19T02:00:00.000+02:00",
  "article99": "0",
  "loiReference": {}
}