{
  "uid": "AMANR5L15PO59048B0485P0D1N218",
  "identifiant": {
    "legislature": "15",
    "numero": "218",
    "numRect": "0",
    "saisine": {
      "texteLegislatifRef": "PRJLANR5L15B0485",
      "numeroPartiePLF": "0",
      "organeExamen": "PO59048",
      "mentionSecondeDeliberation": "0"
    }
  },
  "numeroLong": "CF218",
  "etapeTexte": "Nouvelle Lecture",
  "triAmendement": "i",
  "cardinaliteAmdtMultiples": "1",
  "etat": "Discuté",
  "signataires": {
    "auteur": {
      "typeAuteur": "Depute",
      "acteurRef": "PA267336",
      "groupePolitiqueRef": "PO730964"
    },
    "cosignatairesRefs": [
      "PA267336"
    ],
    "texteAffichable": "M.&#160;Giraud, rapporteur g&#233;n&#233;ral"
  },
  "pointeurFragmentTexte": {
    "division": {
      "titre": "Article 9 bis A",
      "articleDesignationCourte": "ART. 9 BIS A",
      "type": "ARTICLE",
      "avantAApres": "A",
      "divisionRattachee": "ARTICLE 9 BIS A",
      "urlDivisionTexteVise": "/15/textes/0485.asp#D_Article_9_bis_A"
    }
  },
  "corps": {
    "dispositif": "<p style=\"text-align: justify;\">Supprimer cet article.</p>",
    "exposeSommaire": "<p style=\"text-align: justify;\">L&#8217;article&#160;9 bis A pr&#233;voit le versement d&#8217;une fraction de taxe int&#233;rieure de consommation sur les produits &#233;nerg&#233;tiques (TICPE) aux collectivit&#233;s en charge de l&#8217;&#233;laboration et de la mise en &#339;uvre des plans climat-air-&#233;nergie territoriaux (PCAET) et des sch&#233;mas r&#233;gionaux d&#8217;am&#233;nagement, de d&#233;veloppement durable et d&#8217;&#233;galit&#233; des territoires (SRADDET) .</p><p style=\"text-align: justify;\">Le pr&#233;sent amendement propose de supprimer cet article.</p>"
  },
  "representations": [
    {
      "nom": "PDF",
      "typeMime": {
        "type": "application",
        "subType": "PDF"
      },
      "statutRepresentation": {
        "verbatim": true,
        "canonique": true,
        "officielle": true,
        "transcription": false,
        "enregistrement": false
      },
      "contenu": {
        "documentURI": "/15/amendements/0485/CION_FIN/CF218.pdf"
      }
    }
  ],
  "sort": {
    "dateSaisie": "2017-12-14T09:33:40.000+01:00",
    "sortEnSeance": "Adopté"
  },
  "dateDepot": "2017-12-13T01:00:00.000+01:00",
  "dateDistribution": "2017-12-14T01:00:00.000+01:00",
  "article99": "0",
  "loiReference": {}
}