{
  "uid": "AMANR5L15SEA717460BTC1597P0D1N85",
  "identifiant": {
    "legislature": "15",
    "numero": "85",
    "numRect": "0",
    "saisine": {
      "texteLegislatifRef": "PIONANR5L15BTC1597",
      "numeroPartiePLF": "0",
      "organeExamen": "PO717460",
      "mentionSecondeDeliberation": "0"
    }
  },
  "numeroLong": "85",
  "etapeTexte": "1ère lecture (2ème assemblée saisie)",
  "triAmendement": "aoaaaaaaaaaaaaaaaaaaaaaaaaaaaaaaaaaaaaaaaaaaaaaaaaadjs",
  "cardinaliteAmdtMultiples": "1",
  "amendementParent": "AMANR5L15SEA717460BTC1597P0D1N45",
  "etat": "A discuter",
  "signataires": {
    "auteur": {
      "typeAuteur": "Gouvernement"
    },
    "texteAffichable": "le Gouvernement"
  },
  "pointeurFragmentTexte": {
    "division": {
      "titre": "Article PREMIER",
      "articleDesignationCourte": "ART. PREMIER",
      "type": "ARTICLE",
      "avantAApres": "A",
      "divisionRattachee": "ARTICLE PREMIER",
      "urlDivisionTexteVise": "/15/textes/1597.asp#D_Article_1er"
    }
  },
  "corps": {
    "dispositif": "<p>R&#233;diger ainsi l&#8217;alin&#233;a&#160;5&#160;:</p><p style=\"text-align: justify;\">&#171;&#160;3&#176;&#160;Les enfants atteints d&#8217;une pathologie li&#233;e &#224; leur exposition pr&#233;natale du fait de l&#8217;exposition professionnelle de l&#8217;un ou l&#8217;autre de leurs parents &#224; des produits phytopharmaceutiques ayant fait l&#8217;objet d&#8217;une autorisation de mise sur le march&#233; par l&#8217;autorit&#233; administrative sur le territoire de la R&#233;publique fran&#231;aise&#160;&#187;.</p>",
    "exposeSommaire": "<p>Le pr&#233;sent amendement vise &#224; pr&#233;ciser, en coh&#233;rence avec l&#8217;article&#160;3 relatif aux comp&#233;tences du fonds d&#8217;indemnisation, le p&#233;rim&#232;tre des victimes dites &#171;&#160;professionnelles&#160;&#187; (1&#176;).</p><p style=\"text-align: justify;\">Sont ainsi vis&#233;s les salari&#233;s du r&#233;gime g&#233;n&#233;ral de s&#233;curit&#233; sociale, ainsi que les salari&#233;s et non-salari&#233;s du r&#233;gime agricole, dont les demandes de reconnaissance de maladie professionnelle li&#233;e aux produits phytosanitaires sont centralis&#233;es et g&#233;r&#233;es par le fonds d&#8217;indemnisation, selon les r&#232;gles de droit commun de leurs r&#233;gimes accidents du travail&#160;&#8211;&#160;maladies professionnelles (AT-MP) respectifs.</p><p style=\"text-align: justify;\">L&#8217;amendement proc&#232;de par ailleurs &#224; une am&#233;lioration r&#233;dactionnelle de l&#8217;alin&#233;a en d&#233;signant les expositions pr&#233;natales li&#233;es &#224; l&#8217;exposition professionnelle de l&#8217;un des parents &#224; des fins de clarification (2&#176;).</p><p style=\"text-align: justify;\">Enfin, il supprime la r&#233;f&#233;rence aux anciens assur&#233;s des r&#233;gimes agricoles et b&#233;n&#233;ficiaires d&#8217;une pension de retraite agricole dans l&#8217;arr&#234;t&#233; d&#233;finissant la liste des pathologies (3&#176;), ces personnes relevant d&#8217;une proc&#233;dure AT-MP de droit commun (avec une reconnaissance de maladie professionnelle &#233;tablie sur le fondement des tableaux ou par la voie compl&#233;mentaire). La liste ne porte donc que sur les expositions pr&#233;natales, de mani&#232;re &#224; pr&#233;ciser le champ des pathologies donnant lieu &#224; l&#8217;instruction du dossier par la commission ind&#233;pendante mentionn&#233;e &#224; l&#8217;article&#160;2 et, le cas &#233;ch&#233;ant, &#224; la r&#233;paration forfaitaire pr&#233;vue par l&#8217;article&#160;1.</p>"
  },
  "representations": [
    {
      "nom": "PDF",
      "typeMime": {
        "type": "application",
        "subType": "PDF"
      },
      "statutRepresentation": {
        "verbatim": true,
        "canonique": true,
        "officielle": true,
        "transcription": false,
        "enregistrement": false
      },
      "contenu": {
        "documentURI": "/15/amendements/1597/AN/85.pdf"
      }
    }
  ],
  "dateDepot": "2019-01-30T01:00:00.000+01:00",
  "dateDistribution": "2019-01-31T01:00:00.000+01:00",
  "article99": "0",
  "loiReference": {}
}