{
  "uid": "AMANR5L15PO419610B0627P0D1N1696",
  "identifiant": {
    "legislature": "15",
    "numero": "1696",
    "numRect": "0",
    "saisine": {
      "texteLegislatifRef": "PRJLANR5L15B0627",
      "numeroPartiePLF": "0",
      "organeExamen": "PO419610",
      "mentionSecondeDeliberation": "0"
    }
  },
  "numeroLong": "CE1696",
  "etapeTexte": "1ère lecture (1ère assemblée saisie)",
  "triAmendement": "hwzzzzi",
  "cardinaliteAmdtMultiples": "1",
  "etat": "Discuté",
  "signataires": {
    "auteur": {
      "typeAuteur": "Depute",
      "acteurRef": "PA607619",
      "groupePolitiqueRef": "PO730964"
    },
    "cosignatairesRefs": [
      "PA607619",
      "PA607595"
    ],
    "texteAffichable": "M.&#160;Molac et M.&#160;Pellois"
  },
  "pointeurFragmentTexte": {
    "division": {
      "titre": "Article PREMIER",
      "articleDesignationCourte": "ART. PREMIER",
      "type": "ARTICLE",
      "avantAApres": "A",
      "divisionRattachee": "ARTICLE PREMIER",
      "urlDivisionTexteVise": "/15/textes/0627.asp#D_Article_1er"
    },
    "alinea": {
      "numero": "27"
    }
  },
  "corps": {
    "dispositif": "<p style=\"text-align: justify;\">A l&#8217;alin&#233;a&#160;27, supprimer les mots&#160;: </p><p style=\"text-align: justify;\">&#171;&#160;qu&#8217;il a lui-m&#234;me acquis aupr&#232;s d&#8217;un producteur&#160;&#187;.</p>",
    "exposeSommaire": "<p style=\"text-align: justify;\">Cet amendement rectifie la r&#233;daction impr&#233;cise de cet article relatif aux contrats de vente faisant d&#233;sormais r&#233;f&#233;rence aux nouveaux indicateurs et permet de pr&#233;ciser que ces derniers circuleront en toute transparence d&#8217;un bout &#224; l&#8217;autre de la chaine des contrats.</p>"
  },
  "representations": [
    {
      "nom": "PDF",
      "typeMime": {
        "type": "application",
        "subType": "PDF"
      },
      "statutRepresentation": {
        "verbatim": true,
        "canonique": true,
        "officielle": true,
        "transcription": false,
        "enregistrement": false
      },
      "contenu": {
        "documentURI": "/15/amendements/0627/CION-ECO/CE1696.pdf"
      }
    }
  ],
  "sort": {
    "dateSaisie": "2018-04-17T22:49:16.000+02:00",
    "sortEnSeance": "Adopté"
  },
  "dateDepot": "2018-04-13T02:00:00.000+02:00",
  "dateDistribution": "2018-04-16T02:00:00.000+02:00",
  "article99": "0",
  "loiReference": {}
}