{
  "uid": "AMANR5L15SEA717460B2272P2D1N2196",
  "identifiant": {
    "legislature": "15",
    "numero": "2196",
    "numRect": "1",
    "saisine": {
      "texteLegislatifRef": "PRJLANR5L15B2272",
      "numeroPartiePLF": "2",
      "organeExamen": "PO717460",
      "mentionSecondeDeliberation": "0"
    }
  },
  "numeroLong": "II-2196 (Rect)",
  "etapeTexte": "1ère lecture (1ère assemblée saisie)",
  "triAmendement": "beeaaaaaaaaaaaaaaaaaaaaaaaaaaaaaaaaaaaaaaaaaaaaaaaae",
  "cardinaliteAmdtMultiples": "1",
  "etat": "Discuté",
  "signataires": {
    "auteur": {
      "typeAuteur": "Gouvernement"
    },
    "texteAffichable": "le Gouvernement"
  },
  "pointeurFragmentTexte": {
    "missionVisee": {
      "idMissionAN": "827",
      "libelleMission": "Solidarité, insertion et égalité des chances",
      "codeMissionPLF": "B",
      "libelleMissionPLF": "Répartition, par mission et programme, des crédits du budget général"
    },
    "division": {
      "titre": "ÉTAT B",
      "articleDesignationCourte": "ART. 38",
      "type": "ANNEXE",
      "avantAApres": "A",
      "divisionRattachee": "ARTICLE 38",
      "urlDivisionTexteVise": "/15/textes/2272C.asp#D_ETAT_B"
    }
  },
  "corps": {
    "exposeSommaire": "<p style=\"text-align: justify;\">Le pr&#233;sent amendement a pour objet d&#8217;inscrire au sein du programme 304 &#171;&#160;Inclusion sociale et protection des personnes&#160;&#187; 30&#160;M&#8364; qui seront consacr&#233;s &#224; la mise en &#339;uvre des mesures de la strat&#233;gie de pr&#233;vention et de protection de l&#8217;enfance annonc&#233;e le 14 octobre 2019 par le Secr&#233;taire d&#8217;Etat aupr&#232;s de la ministre des Solidarit&#233;s et de la Sant&#233;. S&#8217;y ajouteront 20 M&#8364; par red&#233;ploiement au sein de ce programme.</p><p style=\"text-align: justify;\">Ce montant doit notamment permettre d&#8217;engager une contractualisation avec les conseils d&#233;partementaux autour d&#8217;objectifs partag&#233;s dans le champ de la pr&#233;vention et de la protection de l&#8217;enfance.</p><p style=\"text-align: justify;\">Reposant sur un &#233;tat des lieux local des besoins et des dispositifs d&#8217;accompagnement existants, cette contractualisation reposera sur 4 engagements assortis d&#8217;objectifs pr&#233;cis et d&#8217;indicateurs de r&#233;sultats&#160;:</p><p style=\"text-align: justify;\">-&#160; Agir le plus pr&#233;cocement possible pour r&#233;pondre aux besoins des enfants et de leurs familles, en r&#233;pondant de mani&#232;re r&#233;active aux besoins de relayage des parents&#160;;</p><p style=\"text-align: justify;\">-&#160; S&#233;curiser les parcours des enfants prot&#233;g&#233;s et pr&#233;venir les ruptures, en favorisant l&#8217;innovation et la diversification des interventions aupr&#232;s de l&#8217;enfant prot&#233;g&#233;&#160;;</p><p style=\"text-align: justify;\">-&#160; Donner aux enfants les moyens d&#8217;agir et garantir leurs droits, en renfor&#231;ant la participation des enfants aux d&#233;cisions qui les concernent et en fluidifiant notamment l&#8217;accompagnement scolaire des enfants prot&#233;g&#233;s&#160;;</p><p style=\"text-align: justify;\">-&#160;&#160; Pr&#233;parer l&#8217;avenir en amont des 18 ans, pour faciliter l&#8217;acc&#232;s au logement et aux droits des jeunes sortants de l&#8217;aide sociale &#224; l&#8217;enfance.</p><p style=\"text-align: justify;\">Cette contractualisation sera compl&#233;t&#233;e d&#8217;une refonte de la gouvernance nationale sur la protection de l&#8217;enfance, pour mieux structurer le pilotage de la politique publique.</p>",
    "dispositifAmdtCredit": {
      "listeProgrammes": [
        {
          "libelle": "Inclusion sociale et protection des personnes",
          "id": "103265",
          "AE": {
            "montantPositif": "30000000",
            "montantNegatif": "0"
          },
          "CP": {
            "montantPositif": "30000000",
            "montantNegatif": "0"
          },
          "action": "modification"
        },
        {
          "libelle": "Handicap et dépendance",
          "id": "103266",
          "AE": {
            "montantPositif": "0",
            "montantNegatif": "0"
          },
          "CP": {
            "montantPositif": "0",
            "montantNegatif": "0"
          },
          "action": "modification"
        },
        {
          "libelle": "Égalité entre les femmes et les hommes",
          "id": "103267",
          "AE": {
            "montantPositif": "0",
            "montantNegatif": "0"
          },
          "CP": {
            "montantPositif": "0",
            "montantNegatif": "0"
          },
          "action": "modification"
        },
        {
          "libelle": "Conduite et soutien des politiques sanitaires, sociales, du sport, de la jeunesse et de la vie associative",
          "id": "103268",
          "AE": {
            "montantPositif": "0",
            "montantNegatif": "0"
          },
          "CP": {
            "montantPositif": "0",
            "montantNegatif": "0"
          },
          "action": "modification"
        }
      ],
      "totalAE": {
        "montantPositif": "30000000",
        "montantNegatif": "0",
        "solde": "30000000"
      },
      "totalCP": {
        "montantPositif": "30000000",
        "montantNegatif": "0",
        "solde": "30000000"
      }
    }
  },
  "representations": [
    {
      "nom": "PDF",
      "typeMime": {
        "type": "application",
        "subType": "PDF"
      },
      "statutRepresentation": {
        "verbatim": true,
        "canonique": true,
        "officielle": true,
        "transcription": false,
        "enregistrement": false
      },
      "contenu": {
        "documentURI": "/15/amendements/2272C/AN/2196.pdf"
      }
    }
  ],
  "seanceDiscussion": "RUANR5L15S2020IDS21908",
  "sort": {
    "dateSaisie": "2019-11-07T17:32:31.000+01:00",
    "sortEnSeance": "Adopté"
  },
  "dateDepot": "2019-11-07T01:00:00.000+01:00",
  "dateDistribution": "2019-11-07T01:00:00.000+01:00",
  "article99": "1",
  "loiReference": {}
}