{
  "uid": "AMANR5L15PO419610B0846P0D1N1028",
  "identifiant": {
    "legislature": "15",
    "numero": "1028",
    "numRect": "0",
    "saisine": {
      "texteLegislatifRef": "PRJLANR5L15B0846",
      "numeroPartiePLF": "0",
      "organeExamen": "PO419610",
      "mentionSecondeDeliberation": "0"
    }
  },
  "numeroLong": "CE1028",
  "etapeTexte": "1ère lecture (1ère assemblée saisie)",
  "triAmendement": "ak",
  "cardinaliteAmdtMultiples": "1",
  "etat": "Discuté",
  "signataires": {
    "auteur": {
      "typeAuteur": "Depute",
      "acteurRef": "PA720378",
      "groupePolitiqueRef": "PO730964"
    },
    "cosignatairesRefs": [
      "PA720378"
    ],
    "texteAffichable": "M.&#160;Lioger, rapporteur"
  },
  "pointeurFragmentTexte": {
    "division": {
      "titre": "Article 57",
      "articleDesignationCourte": "ART. 57",
      "type": "ARTICLE",
      "avantAApres": "A",
      "divisionRattachee": "ARTICLE 57",
      "urlDivisionTexteVise": "/15/textes/0846.asp#D_Article_57"
    },
    "alinea": {
      "avantAApres": "A",
      "numero": "13",
      "alineaDesignation": "Alinéa 13"
    }
  },
  "corps": {
    "dispositif": "<p style=\"text-align: justify;\">&#192; l&#8217;alin&#233;a&#160;13, substituer aux mots&#160;:</p><p style=\"text-align: justify;\">&#171;&#160;l&#8217;arr&#234;t&#233; mentionn&#233; &#224; l&#8217;article L.&#160;129&#8209;1&#160;&#187;</p><p style=\"text-align: justify;\">les mots&#160;:</p><p style=\"text-align: justify;\">&#171;&#160;cet arr&#234;t&#233;&#160;&#187;.</p>",
    "exposeSommaire": "<p style=\"text-align: justify;\">Amendement r&#233;dactionnel.</p>"
  },
  "representations": [
    {
      "nom": "PDF",
      "typeMime": {
        "type": "application",
        "subType": "PDF"
      },
      "statutRepresentation": {
        "verbatim": true,
        "canonique": true,
        "officielle": true,
        "transcription": false,
        "enregistrement": false
      },
      "contenu": {
        "documentURI": "/15/amendements/0846/CION-ECO/CE1028.pdf"
      }
    }
  ],
  "sort": {
    "dateSaisie": "2018-05-18T23:54:41.000+02:00",
    "sortEnSeance": "Adopté"
  },
  "dateDepot": "2018-05-08T02:00:00.000+02:00",
  "dateDistribution": "2018-05-15T02:00:00.000+02:00",
  "article99": "0",
  "loiReference": {}
}