{
  "uid": "AMANR5L15SEA717460BTC1237P0D1N2224",
  "identifiant": {
    "legislature": "15",
    "numero": "2224",
    "numRect": "0",
    "saisine": {
      "texteLegislatifRef": "PRJLANR5L15BTC1237",
      "numeroPartiePLF": "0",
      "organeExamen": "PO717460",
      "mentionSecondeDeliberation": "1"
    }
  },
  "numeroLong": "2224",
  "etapeTexte": "1ère lecture (1ère assemblée saisie)",
  "triAmendement": "koaaaaaaaaaaaaaaaaaaaaaaaaaaaaaaaaaaaaaaaaaaaaaaaaaazs",
  "cardinaliteAmdtMultiples": "1",
  "etat": "Discuté",
  "signataires": {
    "auteur": {
      "typeAuteur": "Depute",
      "acteurRef": "PA718978",
      "groupePolitiqueRef": "PO730970"
    },
    "cosignatairesRefs": [
      "PA721418",
      "PA720092",
      "PA719488",
      "PA721608",
      "PA719918",
      "PA720162",
      "PA721742",
      "PA720720",
      "PA721530",
      "PA720256",
      "PA719504",
      "PA720598",
      "PA721976",
      "PA720002",
      "PA720772",
      "PA720178",
      "PA720652",
      "PA720764",
      "PA721924",
      "PA721234",
      "PA720968",
      "PA719558",
      "PA719044",
      "PA721992",
      "PA722284",
      "PA719266",
      "PA720976",
      "PA722374",
      "PA719210",
      "PA719874",
      "PA720334",
      "PA722162",
      "PA721182",
      "PA721734",
      "PA720326",
      "PA718978",
      "PA720704",
      "PA720746",
      "PA720728",
      "PA1276",
      "PA720924",
      "PA717151",
      "PA719640",
      "PA721984",
      "PA719938"
    ],
    "texteAffichable": "M.&#160;Laqhila,  M.&#160;Bolo, M.&#160;Mattei, Mme&#160;Jacquier-Laforge, M.&#160;Waserman, Mme&#160;Vichnievsky, M.&#160;Balanant, Mme&#160;Bannier, Mme&#160;Benin, M.&#160;Berta, M.&#160;Bourlanges, M.&#160;Bru, M.&#160;Cubertafon, Mme&#160;de Sarnez, Mme&#160;de Vaucouleurs, Mme&#160;Deprez-Audebert, M.&#160;Duverg&#233;, Mme&#160;El Ha&#239;ry, Mme&#160;Elimas, Mme&#160;Essayan, M.&#160;Fanget, M.&#160;Fesneau, Mme&#160;Florennes, M.&#160;Fuchs, Mme&#160;Gallerneau, M.&#160;Garcia, M.&#160;Hammouche, M.&#160;Isaac-Sibille, M.&#160;Joncour, M.&#160;Lagleize, M.&#160;Lain&#233;, Mme&#160;Lasserre-David, M.&#160;Latombe, Mme&#160;Luquet, M.&#160;Mathiasin, Mme&#160;Mette, M.&#160;Michel-Kleisbauer, M.&#160;Mignola, M.&#160;Millienne, M.&#160;Pahun, M.&#160;Fr&#233;d&#233;ric&#160;Petit, Mme&#160;Maud&#160;Petit, Mme&#160;Poueyto, M.&#160;Ramos et M.&#160;Turquois"
  },
  "pointeurFragmentTexte": {
    "division": {
      "titre": "Article 57",
      "articleDesignationCourte": "APRÈS ART. 57",
      "type": "ARTICLE",
      "avantAApres": "Apres",
      "divisionRattachee": "APRÈS L'ARTICLE 57, insérer l'article suivant:",
      "articleAdditionnel": "1",
      "urlDivisionTexteVise": "/15/textes/1237.asp#D_Article_57"
    }
  },
  "corps": {
    "dispositif": "<p style=\"text-align: justify;\">Le chapitre IV du titre IV du livre II du code de l&#8217;action sociale et des familles est compl&#233;t&#233; par un article L.&#160;244&#8209;2 ainsi r&#233;dig&#233;&#160;:</p><p style=\"text-align: justify;\">&#171;&#160;<i>Art.&#160;L.&#160;244&#8209;2.&#160;&#8211;&#160;</i>Les charges li&#233;es &#224; l&#8217;aide &#224; domicile et l&#8217;accueil des personnes handicap&#233;es peuvent &#234;tre prises en compte pour le d&#233;blocage de l&#8217;&#233;pargne salariale.</p><p style=\"text-align: justify;\">&#171;&#160;Les modalit&#233;s d&#8217;application du pr&#233;sent article sont d&#233;termin&#233;es par d&#233;cret en Conseil d&#8217;&#201;tat.&#160;&#187;</p>",
    "exposeSommaire": "<p style=\"text-align: justify;\">Le ph&#233;nom&#232;ne de d&#233;pendance progresse fortement et nombre de familles se retrouvent de plus en plus confront&#233;es &#224; la d&#233;pendance d&#8217;un parent.</p><p style=\"text-align: justify;\">Le co&#251;t tr&#232;s &#233;lev&#233; d&#8217;h&#233;bergement dans des &#233;tablissements sp&#233;cialis&#233;s emp&#234;che, de facto, l&#8217;accessibilit&#233; de ces &#233;tablissements aux faibles revenus.</p><p style=\"text-align: justify;\">En outre, de plus en plus de Fran&#231;ais r&#233;clament un maintien &#224; domicile, ce qui requiert des investissements significatifs (de l&#8217;ascendant chez lui avec une surveillance ou chez ses descendants).</p><p style=\"text-align: justify;\">Le pr&#233;sent amendement entend ainsi permettre au salari&#233;, gr&#226;ce au d&#233;blocage de l&#8217;&#233;pargne salariale, de couvrir tout ou partie des frais engendr&#233;s par la pr&#233;sence et la prise en charge d&#8217;un parent d&#233;pendant.</p>"
  },
  "representations": [
    {
      "nom": "PDF",
      "typeMime": {
        "type": "application",
        "subType": "PDF"
      },
      "statutRepresentation": {
        "verbatim": true,
        "canonique": true,
        "officielle": true,
        "transcription": false,
        "enregistrement": false
      },
      "contenu": {
        "documentURI": "/15/amendements/1237/AN/2224.pdf"
      }
    }
  ],
  "seanceDiscussion": "RUANR5L15S2019IDS21263",
  "sort": {
    "dateSaisie": "2018-10-04T22:49:48.000+02:00",
    "sortEnSeance": "Retiré"
  },
  "dateDepot": "2018-09-21T02:00:00.000+02:00",
  "dateDistribution": "2018-09-26T02:00:00.000+02:00",
  "article99": "0",
  "loiReference": {
    "codeLoi": "c action sociale et familles",
    "divisionCodeLoi": "L244-2"
  }
}