{
  "uid": "AMANR5L15SEA717460BTC2401P0D1N1397",
  "identifiant": {
    "legislature": "15",
    "numero": "1397",
    "numRect": "0",
    "saisine": {
      "texteLegislatifRef": "PRJLANR5L15BTC2401",
      "numeroPartiePLF": "0",
      "organeExamen": "PO717460",
      "mentionSecondeDeliberation": "0"
    }
  },
  "numeroLong": "1397",
  "etapeTexte": "1ère lecture (2ème assemblée saisie)",
  "triAmendement": "jfaaaaaaaaaaaaaaaaaaaaaaaaaaaaaaaaaaaaaaaaaaaaaaaati",
  "cardinaliteAmdtMultiples": "1",
  "etat": "A discuter",
  "signataires": {
    "auteur": {
      "typeAuteur": "Depute",
      "acteurRef": "PA609590",
      "groupePolitiqueRef": "PO758835"
    },
    "cosignatairesRefs": [
      "PA429893",
      "PA332614",
      "PA643145",
      "PA335532",
      "PA607553",
      "PA608741",
      "PA333285",
      "PA335054",
      "PA605069",
      "PA267233",
      "PA1809",
      "PA337483",
      "PA340343",
      "PA608011",
      "PA610681",
      "PA340357",
      "PA609590",
      "PA609332",
      "PA608172",
      "PA342415",
      "PA642764",
      "PA1198",
      "PA720988",
      "PA1008",
      "PA608695",
      "PA719930",
      "PA333818",
      "PA508",
      "PA1592"
    ],
    "texteAffichable": "Mme&#160;Rabault,  Mme&#160;Untermaier, Mme&#160;Pires Beaune, Mme&#160;Battistel, Mme&#160;Karamanli, M.&#160;Saulignac, M.&#160;Potier, M.&#160;Carvounas, M.&#160;Aviragnet, Mme&#160;Bareigts, Mme&#160;Bi&#233;mouret, M.&#160;Bouillon, M.&#160;Jean-Louis&#160;Bricout, M.&#160;Alain&#160;David, Mme&#160;Laurence&#160;Dumont, M.&#160;Faure, M.&#160;Garot, M.&#160;David&#160;Habib, M.&#160;Hutin, M.&#160;Juanico, M.&#160;J&#233;r&#244;me&#160;Lambert, M.&#160;Letchimy, Mme&#160;Manin, Mme&#160;Pau-Langevin, M.&#160;Pueyo, Mme&#160;Tolmont, Mme&#160;Vainqueur-Christophe, M.&#160;Vallaud, Mme&#160;Victory et les membres du groupe Socialistes et apparent&#233;s"
  },
  "pointeurFragmentTexte": {
    "division": {
      "titre": "Article 20",
      "articleDesignationCourte": "APRÈS ART. 20",
      "type": "ARTICLE",
      "avantAApres": "Apres",
      "divisionRattachee": "APRÈS L'ARTICLE 20, insérer l'article suivant:",
      "articleAdditionnel": "1",
      "urlDivisionTexteVise": "/15/textes/2401.asp#D_Article_20"
    }
  },
  "corps": {
    "dispositif": "<p style=\"text-align: justify;\">Lorsqu&#8217;une commune, apr&#232;s avoir sollicit&#233; plusieurs administrations de l&#8217;&#201;tat, fait face une interpr&#233;tation diff&#233;rente d&#8217;une disposition l&#233;gislative ou r&#232;glementaire de la part de celles-ci, l&#8217;interpr&#233;tation la plus favorable &#224; la commune s&#8217;applique.</p>",
    "exposeSommaire": "<p style=\"text-align: justify;\">Selon les d&#233;partements, il peut arriver que les services de l&#8217;&#201;tat aient une interpr&#233;tation de la loi ou de la r&#232;glementation diff&#233;rente, comme cela a par exemple pu &#234;tre le cas de la note de renseignement d&#8217;urbanisme (NRU).</p><p style=\"text-align: justify;\">Nous proposons de consid&#233;rer que lorsqu&#8217;une commune sollicite plusieurs administrations de l&#8217;&#201;tat pour obtenir l&#8217;interpr&#233;tation d&#8217;une disposition et que l&#8217;avis de ces administrations diverge, l&#8217;interpr&#233;tation la plus favorable &#224; la commune s&#8217;applique.</p>"
  },
  "representations": [
    {
      "nom": "PDF",
      "typeMime": {
        "type": "application",
        "subType": "PDF"
      },
      "statutRepresentation": {
        "verbatim": true,
        "canonique": true,
        "officielle": true,
        "transcription": false,
        "enregistrement": false
      },
      "contenu": {
        "documentURI": "/15/amendements/2401/AN/1397.pdf"
      }
    }
  ],
  "dateDepot": "2019-11-14T01:00:00.000+01:00",
  "dateDistribution": "2019-11-15T01:00:00.000+01:00",
  "article99": "0",
  "loiReference": {}
}