{
  "uid": "AMANR5L15SEA717460B0485P0D1N318",
  "identifiant": {
    "legislature": "15",
    "numero": "318",
    "numRect": "0",
    "saisine": {
      "texteLegislatifRef": "PRJLANR5L15B0485",
      "numeroPartiePLF": "0",
      "organeExamen": "PO717460",
      "mentionSecondeDeliberation": "1"
    }
  },
  "numeroLong": "318",
  "etapeTexte": "Nouvelle Lecture",
  "triAmendement": "xap",
  "cardinaliteAmdtMultiples": "1",
  "etat": "Discuté",
  "signataires": {
    "auteur": {
      "typeAuteur": "Gouvernement"
    },
    "texteAffichable": "le Gouvernement"
  },
  "pointeurFragmentTexte": {
    "missionVisee": {
      "idMissionAN": "215",
      "libelleMission": "Solidarité, insertion et égalité des chances",
      "codeMissionPLF": "B",
      "libelleMissionPLF": "Répartition, par mission et programme, des crédits du budget général"
    },
    "division": {
      "titre": "ÉTAT B",
      "articleDesignationCourte": "ART. 29",
      "type": "ANNEXE",
      "avantAApres": "A",
      "divisionRattachee": "ARTICLE 29",
      "urlDivisionTexteVise": "/15/textes/0485.asp#D_ETAT_B"
    }
  },
  "corps": {
    "exposeSommaire": "<p style=\"text-align: justify;\">1/ Cet amendement proc&#232;de au r&#233;tablissement des cr&#233;dits de la mission &#171;&#160;Solidarit&#233;, insertion et &#233;galit&#233; des chances&#160;&#187; vot&#233;s en premi&#232;re lecture &#224; l&#8217;Assembl&#233;e nationale. Ce changement se d&#233;compose en&#160;:</p><p style=\"text-align: justify;\">-&#160;une minoration de 23&#160;924&#160;852&#160;&#8364; en autorisations d&#8217;engagement et de 23&#160;924&#160;852&#160;&#8364; en cr&#233;dits de paiement du programme &#171;&#160;Inclusion sociale et protection des personnes&#160;&#187;&#160;;</p><p style=\"text-align: justify;\">-&#160;une minoration de 1&#160;765&#160;568&#160;&#8364; en autorisations d&#8217;engagement et de 1&#160;765&#160;568&#160;&#8364; en cr&#233;dits de paiement du programme &#171;&#160;Handicap et d&#233;pendance&#160;&#187;&#160;;</p><p style=\"text-align: justify;\">-&#160;une minoration de 2&#160;745&#160;900&#160;&#8364; en autorisations d&#8217;engagement et de 2&#160;745&#160;900&#160;&#8364; en cr&#233;dits de paiement du programme &#171;&#160;&#201;galit&#233; entre les femmes et les hommes&#160;&#187;&#160;;</p><p style=\"text-align: justify;\">-&#160;une majoration de 28&#160;436&#160;320&#160;&#8364; en autorisations d&#8217;engagement et de 28&#160;436&#160;320&#160;&#8364; en cr&#233;dits de paiement du programme &#171;&#160;Conduite et soutien des politiques sanitaires, sociales, du sport, de la jeunesse et de la vie associative&#160;&#187;&#160;;</p><p style=\"text-align: justify;\">2/ Cet amendement vise &#224; poursuivre la prise en compte des d&#233;cisions annonc&#233;es lors du rendez-vous salarial du 16 octobre concernant le d&#233;calage de 12 mois des revalorisations pr&#233;vues dans le cadre du protocole &#171;&#160;Parcours professionnels, carri&#232;res et r&#233;mun&#233;rations&#160;&#187; (PPCR). A la suite des amendements pr&#233;sent&#233;s en premi&#232;re lecture &#224; l&#8217;Assembl&#233;e nationale, il s&#8217;agit de tirer les cons&#233;quences de ce d&#233;calage sur les d&#233;penses de contribution au CAS &#171;&#160;Pensions&#160;&#187;, dont les montants par mission n&#8217;avaient pu &#234;tre arr&#234;t&#233;s avec pr&#233;cision pr&#233;c&#233;demment. Cette modification &#233;tant accompagn&#233;e d&#8217;une r&#233;vision sym&#233;trique des recettes du CAS &#171;&#160;Pensions&#160;&#187;, elle est neutre sur le solde.</p><p style=\"text-align: justify;\">Ainsi, le pr&#233;sent amendement proc&#232;de &#224; une minoration de 1&#160;380&#160;000&#160;&#8364; des cr&#233;dits de titre 2 de contribution au compte d&#8217;affectation sp&#233;ciale &#171;&#160;Pensions&#160;&#187; de la mission correspondant &#224; la moindre d&#233;pense du fait du d&#233;calage du calendrier de mise en &#339;uvre du protocole PPCR.</p><p style=\"text-align: justify;\">La minoration sur la mission, de 1&#160;380&#160;000&#160;&#8364; en autorisations d&#8217;engagement et en cr&#233;dits de paiement, concerne le programme &#171;&#160;Conduite et soutien des politiques sanitaires, sociales, du sport, de la jeunesse et de la vie associative&#160;&#187;.</p><p style=\"text-align: justify;\">L&#8217;ensemble des cr&#233;dits concerne les contributions au compte d&#8217;affectation sp&#233;ciale &#171;&#160;Pensions&#160;&#187;.</p><p style=\"text-align: justify;\">3/ Cet amendement technique proc&#232;de &#224; une reventilation entre programmes de la minoration des cr&#233;dits de la mission &#171;&#160;Solidarit&#233;, insertion et &#233;galit&#233; des chances&#160;&#187; &#224; laquelle il a &#233;t&#233; proc&#233;d&#233; en seconde d&#233;lib&#233;ration lors de la premi&#232;re lecture par l&#8217;Assembl&#233;e nationale du projet de loi de finances. Cet ajustement se d&#233;compose de la fa&#231;on suivante&#160;:</p><p style=\"text-align: justify;\">-&#160;majoration de 850&#160;839&#160;&#8364; des autorisations d&#8217;engagement et de 850&#160;839&#160;&#8364; des cr&#233;dits de paiement du programme &#171;&#160;Conduite et soutien des politiques sanitaires, sociales, du sport, de la jeunesse et de la vie associative&#160;&#187;&#160;;</p><p style=\"text-align: justify;\">une majoration de 91&#160;854&#160;&#8364; en autorisations d&#8217;engagement et de 91&#160;854&#160;&#8364; en cr&#233;dits de paiement sur le programme &#171;&#160;&#201;galit&#233; entre les femmes et les hommes&#160;&#187;&#160;;</p><p style=\"text-align: justify;\">4/ Cet amendement proc&#232;de &#224; un rebasage technique de la dotation d&#233;di&#233;e &#224; la prime d&#8217;activit&#233; et financ&#233;e par la mission &#171;&#160;Solidarit&#233;, insertion et &#233;galit&#233; des chances&#160;&#187;.</p><p style=\"text-align: justify;\">Cr&#233;&#233;e au 1<sup>er</sup> janvier 2016 par la fusion du RSA activit&#233; et de la prime pour l&#8217;emploi et budg&#233;t&#233;e sur le programme 304 &#171;&#160;Inclusion sociale et protection des personnes vuln&#233;rables&#160;&#187;, la prime d&#8217;activit&#233; vise &#224; encourager le retour &#224; l&#8217;emploi en levant les freins mon&#233;taires &#224; la reprise d&#8217;activit&#233;. Au plan budg&#233;taire, elle constitue une d&#233;pense de guichet fortement sensible &#224; la conjoncture &#233;conomique et dont la pr&#233;vision doit &#234;tre appr&#233;ci&#233;e avec pr&#233;caution compte tenu du faible recul historique.</p><p style=\"text-align: justify;\">Dans un contexte de reprise de la croissance &#233;conomique et d&#8217;acc&#233;l&#233;ration du rythme de cr&#233;ations d&#8217;emplois dans le secteur marchand, le nombre d&#8217;allocataires de la prime d&#8217;activit&#233; a fortement cr&#251; depuis le d&#233;but de l&#8217;ann&#233;e 2017.</p><p style=\"text-align: justify;\">Aussi, il convient de majorer de 240&#160;000&#160;000&#160;&#8364; les autorisations d&#8217;engagement et de 240&#160;000&#160;000&#160;&#8364; les cr&#233;dits de paiement du programme &#171;&#160;Inclusion sociale et protection des personnes&#160;&#187; de la mission &#171;&#160;Solidarit&#233;, insertion et &#233;galit&#233; des chances&#160;&#187;.</p>",
    "dispositifAmdtCredit": {
      "listeProgrammes": [
        {
          "libelle": "Inclusion sociale et protection des personnes",
          "id": "16128",
          "AE": {
            "montantPositif": "216075148",
            "montantNegatif": "0"
          },
          "CP": {
            "montantPositif": "216075148",
            "montantNegatif": "0"
          },
          "action": "modification"
        },
        {
          "libelle": "Handicap et dépendance",
          "id": "16129",
          "AE": {
            "montantPositif": "0",
            "montantNegatif": "1765568"
          },
          "CP": {
            "montantPositif": "0",
            "montantNegatif": "1765568"
          },
          "action": "modification"
        },
        {
          "libelle": "Égalité entre les femmes et les hommes",
          "id": "16130",
          "AE": {
            "montantPositif": "0",
            "montantNegatif": "2654046"
          },
          "CP": {
            "montantPositif": "0",
            "montantNegatif": "2654046"
          },
          "action": "modification"
        },
        {
          "libelle": "Conduite et soutien des politiques sanitaires, sociales, du sport, de la jeunesse et de la vie associative",
          "id": "16131",
          "AE": {
            "montantPositif": "29287159",
            "montantNegatif": "1380000"
          },
          "CP": {
            "montantPositif": "29287159",
            "montantNegatif": "1380000"
          },
          "action": "modification",
          "lignesCredits": [
            {
              "id": "925",
              "libelle": "Dont titre 2",
              "AE": {
                "montantPositif": "0",
                "montantNegatif": "1380000"
              },
              "CP": {
                "montantPositif": "0",
                "montantNegatif": "1380000"
              }
            }
          ]
        }
      ],
      "totalAE": {
        "montantPositif": "245362307",
        "montantNegatif": "5799614",
        "solde": "239562693"
      },
      "totalCP": {
        "montantPositif": "245362307",
        "montantNegatif": "5799614",
        "solde": "239562693"
      }
    }
  },
  "representations": [
    {
      "nom": "PDF",
      "typeMime": {
        "type": "application",
        "subType": "PDF"
      },
      "statutRepresentation": {
        "verbatim": true,
        "canonique": true,
        "officielle": true,
        "transcription": false,
        "enregistrement": false
      },
      "contenu": {
        "documentURI": "/15/amendements/0485/AN/318.pdf"
      }
    }
  ],
  "seanceDiscussion": "RUANR5L15S2018IDS20842",
  "sort": {
    "dateSaisie": "2017-12-15T21:46:50.000+01:00",
    "sortEnSeance": "Adopté"
  },
  "dateDepot": "2017-12-13T01:00:00.000+01:00",
  "dateDistribution": "2017-12-14T01:00:00.000+01:00",
  "article99": "0",
  "loiReference": {}
}