{
  "uid": "AMANR5L15PO420120B0904P0D1N225",
  "identifiant": {
    "legislature": "15",
    "numero": "225",
    "numRect": "0",
    "saisine": {
      "texteLegislatifRef": "PRJLANR5L15B0904",
      "numeroPartiePLF": "0",
      "organeExamen": "PO420120",
      "mentionSecondeDeliberation": "0"
    }
  },
  "numeroLong": "AS225",
  "etapeTexte": "1ère lecture (1ère assemblée saisie)",
  "triAmendement": "on",
  "cardinaliteAmdtMultiples": "1",
  "etat": "Discuté",
  "signataires": {
    "auteur": {
      "typeAuteur": "Depute",
      "acteurRef": "PA856",
      "groupePolitiqueRef": "PO730934"
    },
    "cosignatairesRefs": [
      "PA720210",
      "PA267378",
      "PA267289",
      "PA856",
      "PA721816",
      "PA642847",
      "PA267450",
      "PA267324",
      "PA721474",
      "PA266776",
      "PA998",
      "PA2155",
      "PA1012",
      "PA266797",
      "PA267260",
      "PA2377",
      "PA721286"
    ],
    "texteAffichable": "M.&#160;Cherpion,  M.&#160;Viry, M.&#160;Bazin, Mme&#160;Beauvais, M.&#160;Boucard, M.&#160;Dassault, M.&#160;de la Verpilli&#232;re, M.&#160;R&#233;mi&#160;Delatte, M.&#160;Door, M.&#160;Gaultier, M.&#160;Gosselin, Mme&#160;Levy, M.&#160;Menuel, M.&#160;Perrut, Mme&#160;Poletti, M.&#160;Ramadier et M.&#160;Reiss"
  },
  "pointeurFragmentTexte": {
    "division": {
      "titre": "Article 15",
      "articleDesignationCourte": "ART. 15",
      "type": "ARTICLE",
      "avantAApres": "A",
      "divisionRattachee": "ARTICLE 15",
      "urlDivisionTexteVise": "/15/textes/0904.asp#D_Article_15"
    },
    "alinea": {
      "avantAApres": "A",
      "numero": "12",
      "alineaDesignation": "Alinéa 12"
    }
  },
  "corps": {
    "dispositif": "<p style=\"text-align: justify;\">Apr&#232;s le mot&#160;:</p><p style=\"text-align: justify;\">&#171;&#160;emploi&#160;&#187;,</p><p style=\"text-align: justify;\">r&#233;diger ainsi la fin de l&#8217;alin&#233;a&#160;12&#160;:</p><p style=\"text-align: justify;\">&#171;&#160;, lorsqu&#8217;il proc&#232;de ou contribue &#224; l&#8217;achat de formations individuelles, le fait dans le cadre d&#8217;une convention conclue avec la r&#233;gion, qui en pr&#233;cise l&#8217;objet et les modalit&#233;s.&#160;&#187;</p>",
    "exposeSommaire": "<p style=\"text-align: justify;\">La politique d&#8217;achat de formation souffre actuellement d&#8217;une incoh&#233;rence. D&#8217;un c&#244;t&#233;, P&#244;le emploi ach&#232;te les formations individuelles, de l&#8217;autre la r&#233;gion ach&#232;te les formations collectives, alors m&#234;me que p&#244;le emploi peut intervenir sur ces formations dans le cadre d&#8217;une convention. Il est important de redonner de la coh&#233;rence au syst&#232;me, en donnant toute la politique d&#8217;achat &#224; la r&#233;gion, qui peut continuer &#224; passer des conventions avec p&#244;le emploi.</p>"
  },
  "representations": [
    {
      "nom": "PDF",
      "typeMime": {
        "type": "application",
        "subType": "PDF"
      },
      "statutRepresentation": {
        "verbatim": true,
        "canonique": true,
        "officielle": true,
        "transcription": false,
        "enregistrement": false
      },
      "contenu": {
        "documentURI": "/15/amendements/0904/CION-SOC/AS225.pdf"
      }
    }
  ],
  "sort": {
    "dateSaisie": "2018-05-31T11:05:04.000+02:00",
    "sortEnSeance": "Rejeté"
  },
  "dateDepot": "2018-05-24T02:00:00.000+02:00",
  "dateDistribution": "2018-05-29T02:00:00.000+02:00",
  "article99": "0",
  "loiReference": {}
}