{
  "uid": "AMANR5L15PO420120B2296P0D1N210",
  "identifiant": {
    "legislature": "15",
    "numero": "210",
    "numRect": "0",
    "saisine": {
      "texteLegislatifRef": "PRJLANR5L15B2296",
      "numeroPartiePLF": "0",
      "organeExamen": "PO420120",
      "mentionSecondeDeliberation": "0"
    }
  },
  "numeroLong": "AS210",
  "etapeTexte": "1ère lecture (1ère assemblée saisie)",
  "triAmendement": "djaaaaaaaaaaaaaaaaaaaaaaaaaaaaaaaaaaaaaaaaaaaaaaaabi",
  "cardinaliteAmdtMultiples": "1",
  "etat": "Irrecevable",
  "signataires": {
    "auteur": {
      "typeAuteur": "Depute",
      "acteurRef": "PA721070",
      "groupePolitiqueRef": "PO730934"
    },
    "cosignatairesRefs": [
      "PA718884",
      "PA346218",
      "PA721070",
      "PA721968",
      "PA608016",
      "PA719318"
    ],
    "texteAffichable": "Mme&#160;Ramassamy,  Mme&#160;Anthoine, Mme&#160;Bazin-Malgras, M.&#160;Masson, Mme&#160;Louwagie et M.&#160;Vialay"
  },
  "pointeurFragmentTexte": {
    "division": {
      "titre": "Article 25",
      "articleDesignationCourte": "APRÈS ART. 25",
      "type": "ARTICLE",
      "avantAApres": "Apres",
      "divisionRattachee": "APRÈS L'ARTICLE 25, insérer l'article suivant:",
      "articleAdditionnel": "1",
      "urlDivisionTexteVise": "/15/textes/2296.asp#D_Article_25"
    }
  },
  "corps": {},
  "representations": [
    {
      "nom": "PDF",
      "typeMime": {
        "type": "application",
        "subType": "PDF"
      },
      "statutRepresentation": {
        "verbatim": true,
        "canonique": true,
        "officielle": true,
        "transcription": false,
        "enregistrement": false
      },
      "contenu": {
        "documentURI": "/15/amendements/2296/CION-SOC/AS210.pdf"
      }
    }
  ],
  "dateDepot": "2019-10-10T02:00:00.000+02:00",
  "dateDistribution": "2019-10-12T02:00:00.000+02:00",
  "article99": "0",
  "loiReference": {
    "codeLoi": "c sécurité sociale",
    "divisionCodeLoi": "L174-1-1"
  }
}