{
  "uid": "AMANR5L15SEA717460BTC0495P0D1N5",
  "identifiant": {
    "legislature": "15",
    "numero": "5",
    "numRect": "0",
    "saisine": {
      "texteLegislatifRef": "PRJLANR5L15BTC0495",
      "numeroPartiePLF": "0",
      "organeExamen": "PO717460",
      "mentionSecondeDeliberation": "0"
    }
  },
  "numeroLong": "5",
  "etapeTexte": "Nouvelle Lecture",
  "triAmendement": "ak",
  "cardinaliteAmdtMultiples": "1",
  "etat": "Discuté",
  "signataires": {
    "auteur": {
      "typeAuteur": "Depute",
      "acteurRef": "PA720692",
      "groupePolitiqueRef": "PO730940"
    },
    "cosignatairesRefs": [
      "PA441",
      "PA721118",
      "PA720546",
      "PA610667",
      "PA722110",
      "PA718720",
      "PA718926",
      "PA335612",
      "PA610654",
      "PA722202",
      "PA721270",
      "PA689",
      "PA267306",
      "PA720692",
      "PA610634",
      "PA721896"
    ],
    "texteAffichable": "M.&#160;Fabien&#160;Roussel,  M.&#160;Dufr&#232;gne, M.&#160;Dharr&#233;ville, M.&#160;Azerot, Mme&#160;Bello, M.&#160;Brotherson, M.&#160;Bruneel, Mme&#160;Buffet, M.&#160;Chassaigne, Mme&#160;Faucillon, M.&#160;Jumel, M.&#160;Lecoq, M.&#160;Nilor, M.&#160;Peu, M.&#160;Serville et M.&#160;Wulfranc"
  },
  "pointeurFragmentTexte": {
    "division": {
      "titre": "Article 10",
      "articleDesignationCourte": "ART. 10",
      "type": "ARTICLE",
      "avantAApres": "A",
      "divisionRattachee": "ARTICLE 10",
      "urlDivisionTexteVise": "/15/textes/0495.asp#D_Article_10"
    }
  },
  "corps": {
    "dispositif": "<p>Supprimer cet article.</p>",
    "exposeSommaire": "<p style=\"text-align: justify;\">Cet article sanctuarise la politique d&#8217;aust&#233;rit&#233; qu&#8217;entend mener la nouvelle majorit&#233; au d&#233;triment des collectivit&#233;s territoriales. Il convient d&#8217;en supprimer les dispositions nocives.</p>"
  },
  "representations": [
    {
      "nom": "PDF",
      "typeMime": {
        "type": "application",
        "subType": "PDF"
      },
      "statutRepresentation": {
        "verbatim": true,
        "canonique": true,
        "officielle": true,
        "transcription": false,
        "enregistrement": false
      },
      "contenu": {
        "documentURI": "/15/amendements/0495/AN/5.pdf"
      }
    }
  ],
  "seanceDiscussion": "RUANR5L15S2018IDS20842",
  "sort": {
    "dateSaisie": "2017-12-16T01:47:05.000+01:00",
    "sortEnSeance": "Rejeté"
  },
  "dateDepot": "2017-12-14T01:00:00.000+01:00",
  "dateDistribution": "2017-12-15T01:00:00.000+01:00",
  "article99": "0",
  "loiReference": {}
}