{
  "uid": "AMANR5L15PO420120B0387P0D1N136",
  "identifiant": {
    "legislature": "15",
    "numero": "136",
    "numRect": "0",
    "saisine": {
      "texteLegislatifRef": "PRJLANR5L15B0387",
      "numeroPartiePLF": "0",
      "organeExamen": "PO420120",
      "mentionSecondeDeliberation": "0"
    }
  },
  "numeroLong": "AS136",
  "etapeTexte": "Nouvelle Lecture",
  "triAmendement": "bi",
  "cardinaliteAmdtMultiples": "1",
  "etat": "Retiré",
  "signataires": {
    "auteur": {
      "typeAuteur": "Gouvernement"
    },
    "texteAffichable": "le Gouvernement"
  },
  "pointeurFragmentTexte": {
    "division": {
      "titre": "Article 11",
      "articleDesignationCourte": "ART. 11",
      "type": "ARTICLE",
      "avantAApres": "A",
      "divisionRattachee": "ARTICLE 11",
      "urlDivisionTexteVise": "/15/textes/0387.asp#D_Article_11"
    },
    "alinea": {
      "numero": "93"
    }
  },
  "corps": {
    "dispositif": "<p style=\"text-align: justify;\">I.&#160;&#8211;&#160;&#192; la fin de la derni&#232;re phrase de l&#8217;alin&#233;a&#160;93, substituer aux mots&#160;:</p><p style=\"text-align: justify;\">&#171;&#160;ces organisations&#160;&#187;</p><p style=\"text-align: justify;\">les mots&#160;:</p><p style=\"text-align: justify;\">&#171;&#160;chacune de ces organisations. Ce nombre doit repr&#233;senter au moins 8&#160;% de l&#8217;ensemble des travailleurs ind&#233;pendants adh&#233;rant aux organisations satisfaisant aux crit&#232;res mentionn&#233;s aux 1&#176; &#224; 4&#176; du I de l&#8217;article L.&#160;2151&#8209;1 du code du travail et ayant d&#233;clar&#233; leur candidature en application du pr&#233;sent article.&#160;&#187;</p><p style=\"text-align: justify;\">II.&#160;&#8211;&#160;En cons&#233;quence, &#224; l&#8217;alin&#233;a&#160;96, supprimer les mots&#160;:</p><p style=\"text-align: justify;\">&#171;&#160;le seuil minimal d&#8217;audience requis pour &#233;tablir, au sens des pr&#233;sentes dispositions, le caract&#232;re repr&#233;sentatif des organisations qui de d&#233;clarent candidates et&#160;&#187;.</p><p style=\"text-align: justify;\">III.&#160;&#8211;&#160;En cons&#233;quence &#224; l&#8217;alin&#233;a&#160;344, remplacer les mots&#160;:</p><p style=\"text-align: justify;\">&#171;&#160;de l&#8217;appr&#233;ciation g&#233;n&#233;rale des crit&#232;res mentionn&#233;s &#224; l&#8217;article L.&#160;612&#8209;6 dudit code&#160;&#187;</p><p style=\"text-align: justify;\">par les mots&#160;:</p><p style=\"text-align: justify;\">&#171;&#160;des crit&#232;res mentionn&#233;s au premier alin&#233;a de l&#8217;article L.&#160;612&#8209;6 dudit code. Par d&#233;rogation aux dispositions mentionn&#233;es au deuxi&#232;me alin&#233;a du m&#234;me article et &#224; titre transitoire, le crit&#232;re d&#8217;audience&#160;mentionn&#233; au m&#234;me article est appr&#233;ci&#233; en fonction des &#233;l&#233;ments disponibles, relatifs &#224; leurs diff&#233;rents adh&#233;rents, communiqu&#233;s par ces organisations&#160;&#187;.</p>",
    "exposeSommaire": "<p style=\"text-align: justify;\">Cet amendement inscrit directement dans la loi, comme cela est le cas dans le code du travail s&#8217;agissant de la repr&#233;sentativit&#233; des organisations patronales, le seuil d&#8217;audience requis pour &#233;tablir le caract&#232;re repr&#233;sentatif des organisations qui seront amen&#233;es &#224; d&#233;signer des membres au sein du conseil de la protection sociale des travailleurs ind&#233;pendants. Le m&#234;me seuil (8&#160;% du nombre d&#8217;adh&#233;rents des organisations candidates) est &#233;galement repris.</p><p style=\"text-align: justify;\">Pour la d&#233;signation qui interviendra en 2018 et afin de ne pas contraindre les organisations candidates &#224; des formalit&#233;s qu&#8217;elles pourraient avoir du mal &#224; remplir dans les d&#233;lais fix&#233;s, il sera tenu compte par l&#8217;administration des diff&#233;rents &#233;l&#233;ments disponibles relatifs &#224; leurs adh&#233;rents produits par ces organisations.</p>"
  },
  "representations": [
    {
      "nom": "PDF",
      "typeMime": {
        "type": "application",
        "subType": "PDF"
      },
      "statutRepresentation": {
        "verbatim": true,
        "canonique": true,
        "officielle": true,
        "transcription": false,
        "enregistrement": false
      },
      "contenu": {
        "documentURI": "/15/amendements/0387/CION-SOC/AS136.pdf"
      }
    }
  ],
  "dateDepot": "2017-11-24T01:00:00.000+01:00",
  "dateDistribution": "2017-11-24T01:00:00.000+01:00",
  "article99": "0",
  "loiReference": {}
}