{
  "uid": "AMANR5L15PO419610B0846P0D1N2316",
  "identifiant": {
    "legislature": "15",
    "numero": "2316",
    "numRect": "0",
    "saisine": {
      "texteLegislatifRef": "PRJLANR5L15B0846",
      "numeroPartiePLF": "0",
      "organeExamen": "PO419610",
      "mentionSecondeDeliberation": "0"
    }
  },
  "numeroLong": "CE2316",
  "etapeTexte": "1ère lecture (1ère assemblée saisie)",
  "triAmendement": "af",
  "cardinaliteAmdtMultiples": "1",
  "etat": "Discuté",
  "signataires": {
    "auteur": {
      "typeAuteur": "Depute",
      "acteurRef": "PA405480",
      "groupePolitiqueRef": "PO730946"
    },
    "cosignatairesRefs": [
      "PA335054",
      "PA429893",
      "PA405480",
      "PA608695",
      "PA508",
      "PA610681",
      "PA333818"
    ],
    "texteAffichable": "M.&#160;Pupponi,  Mme&#160;Bareigts, Mme&#160;Bi&#233;mouret, M.&#160;Carvounas, Mme&#160;Karamanli, Mme&#160;Untermaier et M.&#160;Hutin"
  },
  "pointeurFragmentTexte": {
    "division": {
      "titre": "Article 35",
      "articleDesignationCourte": "ART. 35",
      "type": "ARTICLE",
      "avantAApres": "A",
      "divisionRattachee": "ARTICLE 35",
      "urlDivisionTexteVise": "/15/textes/0846.asp#D_Article_35"
    },
    "alinea": {
      "avantAApres": "Avant",
      "numero": "1",
      "alineaDesignation": "Avant l'alinéa 1"
    }
  },
  "corps": {
    "dispositif": "<p style=\"text-align: justify;\">Avant l&#8217;alin&#233;a&#160;1, ins&#233;rer les huit alin&#233;as suivants&#160;:</p><p style=\"text-align: justify;\">&#171;&#160;I&#160;A.&#160;&#8211;&#160;L&#8217;article L.&#160;441&#8209;1&#8209;1 du code de la construction et de l&#8217;habitation est ainsi modifi&#233;&#160;:</p><p style=\"text-align: justify;\">&#171;&#160;<i>a)</i> Le troisi&#232;me alin&#233;a est compl&#233;t&#233; par les mots&#160;: &#171;&#160;et les mesures prises par chaque organisme et les organismes titulaires de droits de r&#233;servation pour le d&#233;veloppement de partenariats avec des associations et organismes agr&#233;&#233;s pour leur accompagnement, ainsi qu&#8217;avec la personne morale mentionn&#233;e &#224; l&#8217;article L.&#160;345&#8209;2&#8209;4 du code de l&#8217;action sociale et des familles. Ces mesures favorisent notamment l&#8217;acc&#232;s rapide au logement des personnes mentionn&#233;es &#224; l&#8217;article L.&#160;345&#8209;2&#8209;2 et &#224; l&#8217;article L.&#160;345&#8209;1 du m&#234;me code&#160;;&#160;&#187;&#160;;</p><p style=\"text-align: justify;\">&#171;&#160;<i>b)</i> &#192; l&#8217;alin&#233;a&#160;4, apr&#232;s le mot&#160;: &#171;&#160;les&#160;&#187;, est ins&#233;r&#233; le mot&#160;: &#171;&#160;autres&#160;&#187;.</p><p style=\"text-align: justify;\">&#171;&#160;I B.&#160;&#8211;&#160;L&#8217;article L.&#160;441&#8209;1&#8209;2 du m&#234;me code est ainsi modifi&#233;&#160;:</p><p style=\"text-align: justify;\">&#171;&#160;<i>a)</i> Le deuxi&#232;me alin&#233;a est compl&#233;t&#233; par les mots&#160;: &#171;&#160;et les mesures prises par chaque organisme et les organismes titulaires de droits de r&#233;servation pour le d&#233;veloppement de partenariats avec des associations et organismes agr&#233;&#233;s pour leur accompagnement, ainsi qu&#8217;avec la personne morale mentionn&#233;e &#224; l&#8217;article L.&#160;345&#8209;2&#8209;4 du code de l&#8217;action sociale et des familles. Ces mesures favorisent notamment l&#8217;acc&#232;s rapide au logement des personnes mentionn&#233;es &#224; l&#8217;article L.&#160;345&#8209;2&#8209;2 et &#224; l&#8217;article L.&#160;345&#8209;1 du m&#234;me code&#160;;&#160;&#187;&#160;;</p><p style=\"text-align: justify;\">&#171;&#160;<i>b)</i> &#192; l&#8217;alin&#233;a&#160;3, apr&#232;s le mot&#160;: &#171;&#160;les&#160;&#187;, est ins&#233;r&#233; le mot&#160;: &#171;&#160;autres&#160;&#187;.</p><p style=\"text-align: justify;\">&#171;&#160;I&#160;C.&#160;&#8211;&#160;Apr&#232;s le 2&#176; de l&#8217;article L.&#160;441&#8209;1&#8209;6 du m&#234;me code, il est ins&#233;r&#233; un alin&#233;a ainsi r&#233;dig&#233;&#160;:</p><p style=\"text-align: justify;\">&#171;&#160;2&#176; <i>bis</i> Pour chaque bailleur social et chacun des autres signataires de la convention, les engagements annuels pour le d&#233;veloppement de partenariats avec des associations et organismes agr&#233;&#233;s pour l&#8217;accompagnement des personnes mentionn&#233;s &#224; l&#8217;alin&#233;a pr&#233;c&#233;dent,&#160;ainsi qu&#8217;avec la personne morale mentionn&#233;e &#224; l&#8217;article L.&#160;345&#8209;2&#8209;4 du code de l&#8217;action sociale et des familles. Ces mesures favorisent notamment l&#8217;acc&#232;s rapide au logement des personnes mentionn&#233;es &#224; l&#8217;article L.&#160;345&#8209;2&#8209;2 et &#224; l&#8217;article L.&#160;345&#8209;1 du m&#234;me code&#160;;&#160;&#187;.&#160;&#187;</p>",
    "exposeSommaire": "<p style=\"text-align: justify;\">Parmi les quatre millions de personnes mal-log&#233;es que compte le pays, 141&#160;500 personnes sont sans domicile personnel, dont un tiers de familles avec enfants. Selon l&#8217;INSEE, ce chiffre a bondi de 50&#160;% en l&#8217;espace de seulement dix ans. Contraintes de vivre dans la rue, dans des bidonvilles, des habitats de fortune ou des structures d&#8217;h&#233;bergement temporaires, elles ont fait les frais d&#8217;une politique qui a trop souvent privil&#233;gi&#233; les r&#233;ponses de court terme sur une r&#233;forme structurelle de la politique d&#8217;acc&#232;s au logement. Le Plan quinquennal &#171;&#160;Logement d&#8217;abord&#160;&#187; lanc&#233; par le gouvernement en 2017 vise au contraire &#224; faciliter l&#8217;acc&#232;s rapide au logement des personnes sans domicile, tout en leur proposant un accompagnement adapt&#233; lorsque leur situation sociale ou leur &#233;tat de sant&#233; le n&#233;cessite.</p><p style=\"text-align: justify;\">La r&#233;ussite de cette ambition n&#233;cessite la mobilisation de l&#8217;ensemble des acteurs territoriaux de l&#8217;habitat. Elle doit en particulier s&#8217;appuyer sur une politique intercommunale d&#8217;attribution volontariste, qui coordonne l&#8217;acc&#232;s au logement et les mesures d&#8217;accompagnement des m&#233;nages en difficult&#233;.</p><p style=\"text-align: justify;\">Afin de d&#233;multiplier les innovations sociales relevant du &#171;&#160;Logement d&#8217;abord&#160;&#187;, le pr&#233;sent amendement propose de d&#233;finir dans les accords collectifs intercommunaux et d&#233;partementaux, ainsi que dans la convention intercommunale d&#8217;attribution, une strat&#233;gie partenariale entre les bailleurs sociaux, les r&#233;servataires de logements sociaux et les structures sociales du territoire pour accompagner les personnes sans-abri ou sortant d&#8217;h&#233;bergement dans l&#8217;acc&#232;s et le maintien au logement.</p>"
  },
  "representations": [
    {
      "nom": "PDF",
      "typeMime": {
        "type": "application",
        "subType": "PDF"
      },
      "statutRepresentation": {
        "verbatim": true,
        "canonique": true,
        "officielle": true,
        "transcription": false,
        "enregistrement": false
      },
      "contenu": {
        "documentURI": "/15/amendements/0846/CION-ECO/CE2316.pdf"
      }
    }
  ],
  "sort": {
    "dateSaisie": "2018-05-17T22:59:21.000+02:00",
    "sortEnSeance": "Rejeté"
  },
  "dateDepot": "2018-05-09T02:00:00.000+02:00",
  "dateDistribution": "2018-05-15T02:00:00.000+02:00",
  "article99": "0",
  "loiReference": {
    "codeLoi": "construction et habitation",
    "divisionCodeLoi": "L441-1-1"
  }
}