{
  "uid": "AMANR5L15SEA717460BTC1175P0D1N173",
  "identifiant": {
    "legislature": "15",
    "numero": "173",
    "numRect": "0",
    "saisine": {
      "texteLegislatifRef": "PRJLANR5L15BTC1175",
      "numeroPartiePLF": "0",
      "organeExamen": "PO717460",
      "mentionSecondeDeliberation": "0"
    }
  },
  "numeroLong": "173",
  "etapeTexte": "Nouvelle Lecture",
  "triAmendement": "asaaaaaaaaaaaaaaaaaaaaaaaaaaaaaaaaaaaaaaaaaaaaaaaaazs",
  "cardinaliteAmdtMultiples": "1",
  "etat": "Discuté",
  "signataires": {
    "auteur": {
      "typeAuteur": "Depute",
      "acteurRef": "PA267766",
      "groupePolitiqueRef": "PO744425"
    },
    "cosignatairesRefs": [
      "PA267766"
    ],
    "texteAffichable": "M.&#160;Guy&#160;Bricout"
  },
  "pointeurFragmentTexte": {
    "division": {
      "titre": "Article 5 quinquies",
      "articleDesignationCourte": "ART. 5 QUINQUIES",
      "type": "ARTICLE",
      "avantAApres": "A",
      "divisionRattachee": "ARTICLE 5 QUINQUIES",
      "urlDivisionTexteVise": "/15/textes/1175.asp#D_Article_5_quinquies"
    },
    "alinea": {
      "numero": "3"
    }
  },
  "corps": {
    "dispositif": "<p style=\"text-align: justify;\">&#192; la premi&#232;re phrase de l&#8217;alin&#233;a&#160;3, substituer aux mots&#160;:</p><p style=\"text-align: justify;\">&#171;&#160;peut adresser&#160;&#187;</p><p style=\"text-align: justify;\">le mot&#160;:</p><p style=\"text-align: justify;\">&#171;&#160;adresse&#160;&#187;.</p>",
    "exposeSommaire": "<p style=\"text-align: justify;\">Cet amendement vise &#224; rendre plus ferme la proc&#233;dure de sanction en cas de non-respect de l&#8217;obligation de d&#233;p&#244;t de ses comptes par une entreprise du maillon industriel ou du secteur du commerce en stipulant que l&#8217;injonction adress&#233;e par le juge n&#8217;est pas facultative.</p>"
  },
  "representations": [
    {
      "nom": "PDF",
      "typeMime": {
        "type": "application",
        "subType": "PDF"
      },
      "statutRepresentation": {
        "verbatim": true,
        "canonique": true,
        "officielle": true,
        "transcription": false,
        "enregistrement": false
      },
      "contenu": {
        "documentURI": "/15/amendements/1175/AN/173.pdf"
      }
    }
  ],
  "seanceDiscussion": "RUANR5L15S2018IDS21233",
  "sort": {
    "dateSaisie": "2018-09-13T21:40:49.000+02:00",
    "sortEnSeance": "Non soutenu"
  },
  "dateDepot": "2018-08-01T02:00:00.000+02:00",
  "dateDistribution": "2018-09-10T02:00:00.000+02:00",
  "article99": "0",
  "loiReference": {}
}