{
  "uid": "AMANR5L15PO419610B2274P0D1N298",
  "identifiant": {
    "legislature": "15",
    "numero": "298",
    "numRect": "0",
    "saisine": {
      "texteLegislatifRef": "PRJLANR5L15B2274",
      "numeroPartiePLF": "0",
      "organeExamen": "PO419610",
      "mentionSecondeDeliberation": "0"
    }
  },
  "numeroLong": "CE298",
  "etapeTexte": "1ère lecture (2ème assemblée saisie)",
  "triAmendement": "alaaaaaaaaaaaaaaaaaaaaaaaaaaaaaaaaaaaaaaaaaaaaaaaaac",
  "cardinaliteAmdtMultiples": "1",
  "etat": "Discuté",
  "signataires": {
    "auteur": {
      "typeAuteur": "Depute",
      "acteurRef": "PA720814",
      "groupePolitiqueRef": "PO730964"
    },
    "cosignatairesRefs": [
      "PA718710",
      "PA719230",
      "PA720202",
      "PA719456",
      "PA720814",
      "PA702054",
      "PA720170"
    ],
    "texteAffichable": "M.&#160;Cazenove,  Mme&#160;Grandjean, M.&#160;Claireaux, M.&#160;Kerlogot, Mme&#160;Pascale&#160;Boyer, Mme&#160;M&#246;rch et Mme&#160;Krimi"
  },
  "pointeurFragmentTexte": {
    "division": {
      "titre": "Article PREMIER",
      "articleDesignationCourte": "ART. PREMIER",
      "type": "ARTICLE",
      "avantAApres": "A",
      "divisionRattachee": "ARTICLE PREMIER",
      "urlDivisionTexteVise": "/15/textes/2274.asp#D_Article_1er"
    },
    "alinea": {
      "numero": "2"
    }
  },
  "corps": {
    "dispositif": "<p style=\"text-align: justify;\">&#192; la premi&#232;re phrase de l&#8217;alin&#233;a&#160;2, substituer aux mots&#160;:</p><p style=\"text-align: justify;\">&#171;&#160;, par voie de marquage, d&#8217;&#233;tiquetage, d&#8217;affichage ou tout autre proc&#233;d&#233; appropri&#233;&#160;&#187;,</p><p style=\"text-align: justify;\">les mots&#160;:</p><p style=\"text-align: justify;\">&#171;&#160;prioritairement par voie d&#233;mat&#233;rialis&#233;e ou tout autre proc&#233;d&#233; appropri&#233;, par voie de marquage, d&#8217;&#233;tiquetage ou d&#8217;affichage,&#160;&#187;.</p>",
    "exposeSommaire": "<p style=\"text-align: justify;\">Cet amendement vise &#224; inciter les producteurs et importateurs de produits g&#233;n&#233;rateurs de d&#233;chets &#224; privil&#233;gier un mode de communication d&#233;mat&#233;rialis&#233; sur les qualit&#233;s et caract&#233;ristiques environnementales de leurs produits.</p><p style=\"text-align: justify;\">Les informations seraient prioritairement accessibles via un QR code ou dans le code barre du produit plut&#244;t que sur des supports de communication &#171;&#160;physique&#160;&#187; afin d&#8217;optimiser la port&#233;e &#233;cologique de cette mesure.</p>"
  },
  "representations": [
    {
      "nom": "PDF",
      "typeMime": {
        "type": "application",
        "subType": "PDF"
      },
      "statutRepresentation": {
        "verbatim": true,
        "canonique": true,
        "officielle": true,
        "transcription": false,
        "enregistrement": false
      },
      "contenu": {
        "documentURI": "/15/amendements/2274/CION-ECO/CE298.pdf"
      }
    }
  ],
  "sort": {
    "dateSaisie": "2019-11-19T21:49:09.000+01:00",
    "sortEnSeance": "Rejeté"
  },
  "dateDepot": "2019-11-15T01:00:00.000+01:00",
  "dateDistribution": "2019-11-18T01:00:00.000+01:00",
  "article99": "0",
  "loiReference": {}
}