{
  "uid": "AMANR5L15PO59051B1350P0D1N4",
  "identifiant": {
    "legislature": "15",
    "numero": "4",
    "numRect": "0",
    "saisine": {
      "texteLegislatifRef": "PRJLANR5L15B1350",
      "numeroPartiePLF": "0",
      "organeExamen": "PO59051",
      "mentionSecondeDeliberation": "0"
    }
  },
  "numeroLong": "CL4",
  "etapeTexte": "1ère lecture (2ème assemblée saisie)",
  "triAmendement": "beaaaaaaaaaaaaaaaaaaaaaaaaaaaaaaaaaaaaaaaaaaaaaaaaq",
  "cardinaliteAmdtMultiples": "1",
  "etat": "Discuté",
  "signataires": {
    "auteur": {
      "typeAuteur": "Depute",
      "acteurRef": "PA720430",
      "groupePolitiqueRef": "PO730958"
    },
    "cosignatairesRefs": [
      "PA721062",
      "PA718868",
      "PA720846",
      "PA718860",
      "PA721226",
      "PA721202",
      "PA720422",
      "PA720430",
      "PA719578",
      "PA2150",
      "PA721960",
      "PA719676",
      "PA722142",
      "PA588884",
      "PA720892",
      "PA720286",
      "PA721210"
    ],
    "texteAffichable": "M.&#160;Bernalicis,  Mme&#160;Autain, M.&#160;Coquerel, M.&#160;Corbi&#232;re, Mme&#160;Fiat, M.&#160;Lachaud, M.&#160;Larive, M.&#160;M&#233;lenchon, Mme&#160;Obono, Mme&#160;Panot, M.&#160;Prud&apos;homme, M.&#160;Quatennens, M.&#160;Ratenon, Mme&#160;Ressiguier, Mme&#160;Rubin, M.&#160;Ruffin et Mme&#160;Taurine"
  },
  "pointeurFragmentTexte": {
    "division": {
      "titre": "Article 1er bis",
      "articleDesignationCourte": "APRÈS ART. 1ER BIS",
      "type": "ARTICLE",
      "avantAApres": "Apres",
      "divisionRattachee": "APRÈS L'ARTICLE 1ER BIS, insérer l'article suivant:",
      "articleAdditionnel": "1",
      "urlDivisionTexteVise": "/15/textes/1350.asp#D_Article_1er_bis"
    }
  },
  "corps": {
    "dispositif": "<p style=\"line-height: 1.2; text-align: justify;\">I.&#160;&#8211;&#160;Apr&#232;s le 5&#176; du II de l&#8217;article&#160;10&#8209;2 de l&#8217;ordonnance n&#176; 58&#8209;1270 du 22 d&#233;cembre 1958 portant loi organique relative au statut de la magistrature, il est ins&#233;r&#233; un 6&#176; ainsi r&#233;dig&#233;&#160;:</p><p style=\"line-height: 1.2; text-align: justify;\">&#171;&#160;6&#176; Un justiciable et une justiciable tir&#233;s au sort sur le r&#244;le de l&#8217;imp&#244;t sur le revenu et des pr&#233;l&#232;vements sociaux mentionn&#233; &#224; l&#8217;article L252 A du livre des proc&#233;dures fiscales.&#160;&#187;</p><p style=\"line-height: 1.2; text-align: justify;\">II.&#160;&#8211;&#160;Apr&#232;s l&#8217;article&#160;10&#8209;2, il est ins&#233;r&#233; un article&#160;10&#8209;3 ainsi r&#233;dig&#233;&#160;:</p><p style=\"line-height: 1.2; text-align: justify;\">&#171;&#160;<i>Art.&#160;10&#8209;3</i>.&#160;&#8211;&#160;Ne peuvent &#234;tre d&#233;sign&#233;s au titre du 6&#176; du II de l&#8217;article&#160;10&#8209;2 les justiciables exercant les fonctions &#233;num&#233;r&#233;es ci-apr&#232;s&#160;:</p><p style=\"line-height: 1.2; text-align: justify;\">&#171;&#160;1&#176; Membre du Gouvernement, du Parlement, du Conseil constitutionnel, du Conseil sup&#233;rieur de la magistrature et du Conseil &#233;conomique, social et environnemental&#160;;</p><p style=\"line-height: 1.2; text-align: justify;\">&#171;&#160;2&#176; Membre du Conseil d&#8217;&#201;tat ou de la Cour des comptes, magistrat de l&#8217;ordre judiciaire, membre des tribunaux administratifs, magistrat des tribunaux de commerce, assesseur des tribunaux paritaires de baux ruraux et conseiller prud&#8217;homme&#160;;&#160;&#187;</p><p style=\"line-height: 1.2; text-align: justify;\">3&#176; Secr&#233;taire g&#233;n&#233;ral du Gouvernement ou d&#8217;un minist&#232;re, directeur de minist&#232;re, membre du corps pr&#233;fectoral&#160;;</p><p style=\"line-height: 1.2; text-align: justify;\">4&#176; Fonctionnaire des services de police ou de l&#8217;administration p&#233;nitentiaire et militaire de la gendarmerie, en activit&#233; de service.&#8221;&#8221;</p>",
    "exposeSommaire": "<p style=\"line-height: 1.38; text-align: justify;\">Par cet amendement, ce afin de garantir que l&#8217;institution judiciaire rende bien la justice &#8220;au nom du peuple fran&#231;ais&#8221;, nous proposons que le coll&#232;ge de d&#233;ontologie de l&#8217;ordre judiciaire pr&#233;vu par l&#8217;ordonnance organique de 1958, compos&#233; actuellement de 5 membres magistrats, soit &#233;largi &#224; deux membres suppl&#233;mentaires, un justiciable et une justiciable.</p><p style=\"text-align: justify;\">Etant donn&#233; la composition actuelle du Conseil de d&#233;ontologie (voir ci-dessous), restreinte &#224; des magistrats, l&#8217;apport intellectuel et le regard de deux justiciables ne pourra que renforcer la l&#233;gitimit&#233; d&#8217;une telle instance, et le fait que la justice est rendue : &#8220;au nom du peuple fran&#231;ais&#8221;.</p><p style=\"text-align: justify;\">De m&#234;me qu&#8217;en mati&#232;re de justice p&#233;nale, des citoyens sont tir&#233;.e.s au sort pour exercer les fonctions de jur&#233;s d&#8217;assises, de jur&#233;s populaires, nous proposons d&#8217;ouvrir la composition du coll&#232;ge de d&#233;ontologie de l&#8217;ordre judiciaire &#224; un justiciable et &#224; une justiciable. Pour ce faire, et eu &#233;gard au r&#244;le du Conseil de d&#233;ontologie qui exerce un r&#244;le consultatif et non des pr&#233;rogatives de souverainet&#233; nationale, nous proposons que ces deux justiciables soient tir&#233;s au sort.</p><p style=\"line-height: 1.38; text-align: justify;\">Si le Conseil de d&#233;ontologie est garant de la d&#233;ontologie des magistrats de l&#8217;ordre judiciaire, il faut noter qu&#8217;il a un r&#244;le bien diff&#233;rent <span class=\"ins cts-2\"  data-cid=\"6\" data-userid=\"1761\" data-username=\"Cl&#233;mence Guett&#233;\" data-time=\"1541239218679\">d</span><span class=\"del cts-2\"  data-cid=\"5\" data-userid=\"1761\" data-username=\"Cl&#233;mence Guett&#233;\" data-time=\"1541239218445\">a</span>u Conseil sup&#233;rieur de la magistrature (mati&#232;re disciplinaire et nominations). En effet selon l&#8217;article 10-2 de l&#8217;ordonnance organique de 1958, il a pour fonctions de : &#8220;1&#176; <i>De rendre des avis sur toute question d&#233;ontologique concernant personnellement un magistrat, sur saisine de celui-ci ou de l'un de ses chefs hi&#233;rarchiques ; 2&#176; D'examiner les d&#233;clarations d'int&#233;r&#234;ts qui lui sont transmises (...)</i>.&#8221;</p><p style=\"line-height: 1.38; text-align: justify;\">En outre, nous pr&#233;voyons des incompatibilit&#233; calqu&#233;es sur les jur&#233;s populaires d&#8217;assises pr&#233;vus par l&#8217;article 257 du code de proc&#233;dure p&#233;nale (membres du Gouvernement, etc<span class=\"ins cts-2\"  data-cid=\"7\" data-userid=\"1761\" data-username=\"Cl&#233;mence Guett&#233;\" data-time=\"1541239232542\">.</span>).</p><p style=\"line-height: 1.38; text-align: justify;\">&#160;</p><p style=\"line-height: 1.38; text-align: justify;\">En d&#233;tail</p><p style=\"line-height: 1.38; text-align: justify;\">&#160;</p><p style=\"line-height: 1.38; text-align: justify;\">Le Conseil de d&#233;ontologie est actuellement compos&#233; de <span class=\"ins cts-1\"  data-cid=\"25\" data-userid=\"1826\" data-username=\"Arnaud Iss\" data-time=\"1541181643899\">quatre</span><span class=\"del cts-1\"  data-cid=\"22\" data-userid=\"1826\" data-username=\"Arnaud Iss\" data-time=\"1541181643034\">q</span>magistrats<span class=\"ins cts-1\"  data-cid=\"31\" data-userid=\"1826\" data-username=\"Arnaud Iss\" data-time=\"1541181646971\"> et d'un universitaire</span> (article 10-2 de l&#8217;ordonnance organique de 1958), &#224; savoir &#160;:</p><p style=\"line-height: 1.38; text-align: justify;\">1) Un magistrat ancien membre du Conseil sup&#233;rieur de la magistrature,</p><p style=\"line-height: 1.38; text-align: justify;\">2) alternativement un magistrat du si&#232;ge de la Cour de cassation &#233;lu par l'assembl&#233;e des magistrats du si&#232;ge ou d'un magistrat du parquet &#233;lu par l'assembl&#233;e des magistrats du parquet,</p><p style=\"line-height: 1.38; text-align: justify;\">3) alternativement un premier pr&#233;sident de cour d'appel, &#233;lu par l'assembl&#233;e des premiers pr&#233;sidents de cour d'appel ou un procureur g&#233;n&#233;ral pr&#232;s une cour d'appel &#233;lu par l'assembl&#233;e des procureurs g&#233;n&#233;raux pr&#232;s les cours d'appel,</p><p style=\"line-height: 1.38; text-align: justify;\">4) une personnalit&#233; ext&#233;rieure d&#233;sign&#233;e par le vice-pr&#233;sident du Conseil d'Etat parmi les membres du Conseil d&#8217;Etat ou par le premier pr&#233;sident de la Cour des comptes parmi les membres de la Cour des comptes<span class=\"ins cts-1\"  data-cid=\"3\" data-userid=\"1826\" data-username=\"Arnaud Iss\" data-time=\"1541181613310\"> ;&#160;</span></p><p style=\"line-height: 1.38; text-align: justify;\"><span class=\"del cts-1\"  data-cid=\"2\" data-userid=\"1826\" data-username=\"Arnaud Iss\" data-time=\"1541181613141\"><span class=\"ins cts-1\"  data-cid=\"13\" data-userid=\"1826\" data-username=\"Arnaud Iss\" data-time=\"1541181636943\">5&#176; D'un universitaire nomm&#233; par le Pr&#233;sident de la R&#233;publique sur proposition, alternativement, du premier pr&#233;sident de la Cour de cassation et du procureur g&#233;n&#233;ral pr&#232;s ladite cour.</span>.</span></p>"
  },
  "representations": [
    {
      "nom": "PDF",
      "typeMime": {
        "type": "application",
        "subType": "PDF"
      },
      "statutRepresentation": {
        "verbatim": true,
        "canonique": true,
        "officielle": true,
        "transcription": false,
        "enregistrement": false
      },
      "contenu": {
        "documentURI": "/15/amendements/1350/CION_LOIS/CL4.pdf"
      }
    }
  ],
  "sort": {
    "dateSaisie": "2018-11-09T18:24:28.000+01:00",
    "sortEnSeance": "Rejeté"
  },
  "dateDepot": "2018-10-29T01:00:00.000+01:00",
  "dateDistribution": "2018-11-08T01:00:00.000+01:00",
  "article99": "0",
  "loiReference": {
    "codeLoi": "zz58-1270",
    "divisionCodeLoi": "10-2"
  }
}