{
  "uid": "AMANR5L15PO419610B1908P0D1N548",
  "identifiant": {
    "legislature": "15",
    "numero": "548",
    "numRect": "0",
    "saisine": {
      "texteLegislatifRef": "PRJLANR5L15B1908",
      "numeroPartiePLF": "0",
      "organeExamen": "PO419610",
      "mentionSecondeDeliberation": "0"
    }
  },
  "numeroLong": "CE548",
  "etapeTexte": "1ère lecture (1ère assemblée saisie)",
  "triAmendement": "daaaaaaaaaaaaaaaaaaaaaaaaaaaaaaaaaaaaaaaaaaaaaaaaac",
  "cardinaliteAmdtMultiples": "1",
  "etat": "Retiré",
  "signataires": {
    "auteur": {
      "typeAuteur": "Depute",
      "acteurRef": "PA721398",
      "groupePolitiqueRef": "PO730964"
    },
    "cosignatairesRefs": [
      "PA719480",
      "PA720622",
      "PA721434",
      "PA721726",
      "PA721398",
      "PA720814",
      "PA718682",
      "PA722194"
    ],
    "texteAffichable": "Mme&#160;Degois,  M.&#160;Trompille, Mme&#160;Mauborgne, Mme&#160;Provendier, Mme&#160;Bureau-Bonnard, M.&#160;Gaillard, Mme&#160;Lardet et M.&#160;Cazenove"
  },
  "pointeurFragmentTexte": {
    "division": {
      "titre": "Article 5",
      "articleDesignationCourte": "ART. 5",
      "type": "ARTICLE",
      "avantAApres": "A",
      "divisionRattachee": "ARTICLE 5",
      "urlDivisionTexteVise": "/15/textes/1908.asp#D_Article_5"
    },
    "alinea": {
      "avantAApres": "Avant",
      "numero": "1",
      "alineaDesignation": "Avant l'alinéa 1"
    }
  },
  "corps": {
    "dispositif": "<p style=\"text-align: justify;\">Avant l&#8217;alin&#233;a&#160;1, ins&#233;rer l&#8217;alin&#233;a suivant&#160;:</p><p style=\"text-align: justify;\">&#171;&#160;I&#160;A.&#160;&#8211;&#160;&#192; l&#8217;article L.&#160;222&#8209;1 du code de l&#8217;&#233;nergie, apr&#232;s le mot&#160;: &#171;&#160;manquements&#160;&#187;, sont ins&#233;r&#233;s les mots&#160;: &#171;&#160;d&#8217;un demandeur de certificats d&#8217;&#233;conomies d&#8217;&#233;nergie&#160;&#187;.</p>",
    "exposeSommaire": "<p style=\"text-align: justify;\">Cet amendement vise &#224; responsabiliser le demandeur de certificats d&#8217;&#233;conomie d&#8217;&#233;nergie (CEE) et donc d&#8217;am&#233;liorer la qualit&#233; des CEE d&#233;pos&#233;s.<br />Actuellement, les sanctions peuvent &#234;tre appliqu&#233;es conjointement aux demandeurs et aux oblig&#233;s faisant peser un risque sur les acteurs.</p><p style=\"text-align: justify;\">L&#8217;application des sanctions, li&#233;es aux manquements relevant des demandes de CEE, limit&#233;e aux seuls demandeurs de CEE, et non aux oblig&#233;s qui ach&#232;tent des CEE d&#233;j&#224; d&#233;livr&#233;s de bonne foi, permettrait de traiter le vide juridique relatif &#224; la question de la responsabilit&#233; du dernier d&#233;tenteur d&#8217;un CEE. Cette responsabilisation permettrait &#233;galement de faciliter et fluidifier les flux sur le march&#233; des CEE en raison de la diminution des contraintes pesant sur les demandeurs et les oblig&#233;s des CEE.<br />Au total, la r&#233;duction des risques associ&#233;s aux CEE support&#233;s par les acteurs oblig&#233;s permettrait de r&#233;duire les co&#251;ts qui sont in fine r&#233;percut&#233;s sur les consommateurs finaux.</p>"
  },
  "representations": [
    {
      "nom": "PDF",
      "typeMime": {
        "type": "application",
        "subType": "PDF"
      },
      "statutRepresentation": {
        "verbatim": true,
        "canonique": true,
        "officielle": true,
        "transcription": false,
        "enregistrement": false
      },
      "contenu": {
        "documentURI": "/15/amendements/1908/CION-ECO/CE548.pdf"
      }
    }
  ],
  "dateDepot": "2019-06-14T02:00:00.000+02:00",
  "dateDistribution": "2019-06-19T02:00:00.000+02:00",
  "article99": "0",
  "loiReference": {}
}