{
  "uid": "AMANR5L15SEA717460B1297P0D1N539",
  "identifiant": {
    "legislature": "15",
    "numero": "539",
    "numRect": "0",
    "saisine": {
      "texteLegislatifRef": "PRJLANR5L15B1297",
      "numeroPartiePLF": "0",
      "organeExamen": "PO717460",
      "mentionSecondeDeliberation": "0"
    }
  },
  "numeroLong": "539",
  "etapeTexte": "1ère lecture (1ère assemblée saisie)",
  "triAmendement": "klaaaaaaaaaaaaaaaaaaaaaaaaaaaaaaaaaaaaaaaaaaaaaaaaiewro",
  "cardinaliteAmdtMultiples": "1",
  "etat": "Discuté",
  "signataires": {
    "auteur": {
      "typeAuteur": "Depute",
      "acteurRef": "PA718884",
      "groupePolitiqueRef": "PO730934"
    },
    "cosignatairesRefs": [
      "PA718884"
    ],
    "texteAffichable": "Mme&#160;Bazin-Malgras"
  },
  "pointeurFragmentTexte": {
    "division": {
      "titre": "Article 46",
      "articleDesignationCourte": "APRÈS ART. 46",
      "type": "ARTICLE",
      "avantAApres": "Apres",
      "divisionRattachee": "APRÈS L'ARTICLE 46, insérer l'article suivant:",
      "articleAdditionnel": "1",
      "urlDivisionTexteVise": "/15/textes/1297.asp#D_Article_46"
    }
  },
  "corps": {
    "dispositif": "<p style=\"text-align: justify;\">Dans les six mois suivant la promulgation de la loi, le Gouvernement remet un rapport au Parlement qui &#233;value les cons&#233;quences des mesures adopt&#233;es entre 2012 et 2018 sur la politique familiale.</p><p style=\"text-align: justify;\">Ce rapport porte notamment&#160;sur le quotient familial, les allocations familiales, le cong&#233; parental, la prime de naissance, l&#8217;allocation de base de la prestation d'accueil du jeune enfant et les modes de garde.</p>",
    "exposeSommaire": "<p style=\"text-align: justify;\">Depuis 2012, un grand nombre de mesures ont &#233;t&#233; adopt&#233;es au d&#233;triment des familles&#160;:</p><p style=\"text-align: justify;\">- Baisse r&#233;p&#233;t&#233;e du quotient familial</p><p style=\"text-align: justify;\">- Modulation des allocations familiales</p><p style=\"text-align: justify;\">- Cong&#233; parental partag&#233; limitant la dur&#233;e maximale pour 1 parent &#224; 2 ans au lieu de 3</p><p style=\"text-align: justify;\">-Prime de naissance vers&#233;e apr&#232;s la naissance et non avant</p><p style=\"text-align: justify;\">-Promesses non tenues en termes de modes de garde</p><p style=\"text-align: justify;\">- Conditions plus drastiques et baisse des montants pour l&#8217;allocation de base de la PAJE ainsi que pour le compl&#233;ment modes de garde.</p><p style=\"text-align: justify;\">&#160;Or force est de constater que le nombre de naissances en France m&#233;tropolitaine a baiss&#233; depuis 6 ans. Ainsi, selon les statistiques de l&#8217;Insee Premi&#232;re parues en ao&#251;t 2018 185.000 enfants de moins sont n&#233;s au cours de ces 6 derni&#232;res ann&#233;es (2012&#8209;2018).</p><p style=\"text-align: justify;\">&#160;Aussi, toutes les dispositions adopt&#233;es doivent &#234;tre &#233;valu&#233;es afin d&#8217;en mesurer la port&#233;e sur la politique familiale.</p><p style=\"text-align: justify;\">&#160;Tel est l&#8217;objet de cet amendement</p>"
  },
  "representations": [
    {
      "nom": "PDF",
      "typeMime": {
        "type": "application",
        "subType": "PDF"
      },
      "statutRepresentation": {
        "verbatim": true,
        "canonique": true,
        "officielle": true,
        "transcription": false,
        "enregistrement": false
      },
      "contenu": {
        "documentURI": "/15/amendements/1297/AN/539.pdf"
      }
    }
  ],
  "seanceDiscussion": "RUANR5L15S2019IDS21295",
  "sort": {
    "dateSaisie": "2018-10-27T01:39:05.000+02:00",
    "sortEnSeance": "Non soutenu"
  },
  "dateDepot": "2018-10-18T02:00:00.000+02:00",
  "dateDistribution": "2018-10-23T02:00:00.000+02:00",
  "article99": "0",
  "loiReference": {}
}