{
  "uid": "AMANR5L15PO419865B1831P0D1N2581",
  "identifiant": {
    "legislature": "15",
    "numero": "2581",
    "numRect": "0",
    "saisine": {
      "texteLegislatifRef": "PRJLANR5L15B1831",
      "numeroPartiePLF": "0",
      "organeExamen": "PO419865",
      "mentionSecondeDeliberation": "0"
    }
  },
  "numeroLong": "CD2581",
  "etapeTexte": "1ère lecture (2ème assemblée saisie)",
  "triAmendement": "aeoaaaaaaaaaaaaaaaaaaaaaaaaaaaaaaaaaaaaaaaaaaaaaaahshy",
  "cardinaliteAmdtMultiples": "1",
  "etat": "Discuté",
  "signataires": {
    "auteur": {
      "typeAuteur": "Depute",
      "acteurRef": "PA721530",
      "groupePolitiqueRef": "PO730970"
    },
    "cosignatairesRefs": [
      "PA721530",
      "PA720764",
      "PA721992",
      "PA720652",
      "PA720334"
    ],
    "texteAffichable": "Mme&#160;Luquet,  M.&#160;Duverg&#233;, Mme&#160;Lasserre-David, M.&#160;Pahun et Mme&#160;Gallerneau"
  },
  "pointeurFragmentTexte": {
    "division": {
      "titre": "Article PREMIER",
      "articleDesignationCourte": "ART. PREMIER",
      "type": "ARTICLE",
      "avantAApres": "A",
      "divisionRattachee": "ARTICLE PREMIER",
      "urlDivisionTexteVise": "/15/textes/1831.asp#D_Article_1er"
    },
    "alinea": {
      "avantAApres": "Apres",
      "numero": "19"
    }
  },
  "corps": {
    "dispositif": "<p style=\"text-align: justify;\">Apr&#232;s l&#8217;alin&#233;a&#160;19, ins&#233;rer l&#8217;alin&#233;a suivant&#160;:</p><p style=\"text-align: justify;\">&#171;&#160;Lorsqu&#8217;une autorit&#233; organisatrice de la mobilit&#233; mentionn&#233;e au I du pr&#233;sent article n&#8217;organise pas de services de transport scolaire, la r&#233;gion est comp&#233;tente pour assurer ces services sur le ressort territorial de l&#8217;autorit&#233; organisatrice concern&#233;e.&#160;&#187;</p>",
    "exposeSommaire": "<p style=\"text-align: justify;\">Du fait du caract&#232;re s&#233;cable de la comp&#233;tence d&#8217;organisation de la mobilit&#233; institu&#233; par le projet de loi, les autorit&#233;s organisatrices de la mobilit&#233; auront la libert&#233; de ne choisir d&#8217;exercer que certaines missions.</p><p style=\"text-align: justify;\">Or, si l&#8217;une de ces autorit&#233;s organisatrices de la mobilit&#233; choisit de ne pas exercer la comp&#233;tence d&#8217;organisation du transport scolaire, le projet de loi n&#8217;attribue clairement cette charge &#224; aucune collectivit&#233;.</p><p style=\"text-align: justify;\">Il convient donc, pour ne pas risquer une rupture du transport scolaire sur le ressort territorial de cette autorit&#233; organisatrice de la mobilit&#233;, de transf&#233;rer obligatoirement cette comp&#233;tence &#224; la r&#233;gion qui restera comp&#233;tente pour organiser les services de transport scolaire &#224; l&#8217;int&#233;rieur du ressort territorial de l&#8217;EPCI concern&#233;.</p><p style=\"text-align: justify;\">Tel est l&#8217;objet de cet amendement.</p>"
  },
  "representations": [
    {
      "nom": "PDF",
      "typeMime": {
        "type": "application",
        "subType": "PDF"
      },
      "statutRepresentation": {
        "verbatim": true,
        "canonique": true,
        "officielle": true,
        "transcription": false,
        "enregistrement": false
      },
      "contenu": {
        "documentURI": "/15/amendements/1831/CION-DVP/CD2581.pdf"
      }
    }
  ],
  "sort": {
    "dateSaisie": "2019-05-14T23:37:14.000+02:00",
    "sortEnSeance": "Retiré"
  },
  "dateDepot": "2019-05-09T02:00:00.000+02:00",
  "dateDistribution": "2019-05-14T02:00:00.000+02:00",
  "article99": "0",
  "loiReference": {
    "codeLoi": "3"
  }
}