{
  "uid": "AMANR5L15PO59048B1255P1D1N302",
  "identifiant": {
    "legislature": "15",
    "numero": "302",
    "numRect": "0",
    "saisine": {
      "texteLegislatifRef": "PRJLANR5L15B1255",
      "numeroPartiePLF": "1",
      "organeExamen": "PO59048",
      "mentionSecondeDeliberation": "0"
    }
  },
  "numeroLong": "I-CF302",
  "etapeTexte": "1ère lecture (1ère assemblée saisie)",
  "triAmendement": "bkaaaaaaaaaaaaaaaaaaaaaaaaaaaaaaaaaaaaaaaaaaaaaaaax",
  "cardinaliteAmdtMultiples": "1",
  "etat": "Irrecevable",
  "signataires": {
    "auteur": {
      "typeAuteur": "Depute",
      "acteurRef": "PA608016",
      "groupePolitiqueRef": "PO730934"
    },
    "cosignatairesRefs": [
      "PA709315",
      "PA605036",
      "PA721474",
      "PA642847",
      "PA267429",
      "PA334654",
      "PA721968",
      "PA720644",
      "PA1874",
      "PA267260",
      "PA721678",
      "PA721506",
      "PA721410",
      "PA336316",
      "PA330909",
      "PA643134",
      "PA718850",
      "PA609726",
      "PA718884",
      "PA608016",
      "PA719318",
      "PA720210",
      "PA1012",
      "PA332523",
      "PA608416",
      "PA330684",
      "PA340853",
      "PA718838"
    ],
    "texteAffichable": "Mme&#160;Louwagie,  M.&#160;Nury, M.&#160;Hetzel, M.&#160;Bouchet, M.&#160;Straumann, M.&#160;Cinieri, Mme&#160;Beauvais, M.&#160;Bazin, Mme&#160;Val&#233;rie&#160;Boyer, M.&#160;Aubert, M.&#160;Leclerc, Mme&#160;Kuster, Mme&#160;Bonnivard, Mme&#160;Valentin, M.&#160;Reda, M.&#160;Le Fur, Mme&#160;Anthoine, Mme&#160;Bazin-Malgras, M.&#160;Cordier, M.&#160;Vialay, Mme&#160;Poletti, M.&#160;de la Verpilli&#232;re, M.&#160;Descoeur, M.&#160;Brun, M.&#160;Viry, Mme&#160;Dalloz, M.&#160;Viala et M.&#160;Abad"
  },
  "pointeurFragmentTexte": {
    "division": {
      "titre": "Article 8",
      "articleDesignationCourte": "ART. 8",
      "type": "ARTICLE",
      "avantAApres": "A",
      "divisionRattachee": "ARTICLE 8",
      "urlDivisionTexteVise": "/15/textes/1255A.asp#D_Article_8"
    }
  },
  "corps": {
    "dispositif": "<p>Modifier ainsi l&#8217;article 8 du projet de loi de finances pour 2019 :</p><p>&#160;</p><p>I.Supprimer les colonnes 5, 6, 7, 8 et 9 du tableau de l&#8217;alin&#233;a 31</p><p>II.Supprimer les colonnes 5, 6, 7, 8 et 9 du tableau de l&#8217;alin&#233;a 34</p>",
    "exposeSommaire": "<p>Dans le cadre de la feuille de route &#233;conomie circulaire, le gouvernement propose une augmentation injuste et inefficace de la TGAP. Bien que la volont&#233; de mettre un signal prix sur l&#8217;&#233;limination des d&#233;chets pour favoriser le recyclage soit positive, cette r&#233;forme passe &#224; c&#244;t&#233; de son objet et entra&#238;nera simplement une hausse des taxes pay&#233;es par les collectivit&#233;s pour la gestion des d&#233;chets (qui repr&#233;sentent 25% du co&#251;t du service public). En effet, avec cette r&#233;forme, les recettes de la TGAP passeront de 450 M &#8364; annuels &#224; un niveau compris entre 800 M&#8364; (si les objectifs de r&#233;duction de l&#8217;&#233;limination des d&#233;chets sont atteints) et 1,4 milliard d&#8217;ici 2025.</p><p>Les conditions ne sont pas aujourd&#8217;hui r&#233;unies pour permettre de r&#233;duire l&#8217;&#233;limination des d&#233;chets &#224; un niveau suffisamment bas pour &#233;viter que cette r&#233;forme n'entra&#238;ne une forte hausse des taxes sur les collectivit&#233;s :</p><p>de nombreux d&#233;chets des entreprises sont g&#233;r&#233;s par le service public, car l&#8217;&#201;tat ne fait pas respecter &#224; ces derni&#232;res leurs obligations de collectes s&#233;lectives (tri 5 flux, d&#233;chets du BTP, gros producteurs de biod&#233;chets) ;<br />1/3 des d&#233;chets m&#233;nagers n&#8217;est pas recyclable aujourd&#8217;hui, les collectivit&#233;s, contraintes d&#8217;&#233;liminer ces d&#233;chets, sont tax&#233;es pour cela alors que le signal fiscal devrait s&#8217;appliquer en amont sur les produits non recyclables ;<br />la r&#233;forme propos&#233;e ne pr&#233;voit aucun volet incitatif pour encourager les collectivit&#233;s qui font des efforts pour r&#233;duire les d&#233;chets r&#233;siduels;<br />les recettes de la TGAP sont vers&#233;es au budget de l&#8217;&#201;tat, et ne contribuent que tr&#232;s faiblement &#224; financer l&#8217;&#233;conomie circulaire ;<br />la plupart des mesures de la Feuille de route &#233;conomie circulaire (nouvelles fili&#232;res de recyclage, renforcement des fili&#232;res existantes&#8230;) sont encore en discussion, et l&#8217;on ne conna&#238;t donc pas la quantit&#233; de d&#233;chets qu&#8217;elle permettront de d&#233;tourner de l&#8217;&#233;limination. Pourtant, le gouvernement souhaite acter l&#8217;augmentation de la TGAP d&#232;s maintenant.<br />&#160;</p><p>Dans ces conditions, la hausse de la TGAP entra&#238;nera une forte hausse du co&#251;t du service public de gestion des d&#233;chets qui se r&#233;percutera m&#233;caniquement sur la taxe ou la redevance d&#8217;enl&#232;vement des ordures m&#233;nag&#232;res pay&#233;e par le contribuable.</p><p>&#160;</p><p>Cet amendement de bon sens vise donc &#224; pr&#233;voir la trajectoire de la TGAP pour les deux ans &#224; venir, afin de pouvoir mener une r&#233;flexion sur les premiers effets de la Feuille de toute &#233;conomie circulaire et donc in fine d&#8217;ajuster la trajectoire de la TGAP. C&#8217;est en respectant cette logique que le caract&#232;re incitatif de la TGAP sera maintenu.</p>"
  },
  "representations": [
    {
      "nom": "PDF",
      "typeMime": {
        "type": "application",
        "subType": "PDF"
      },
      "statutRepresentation": {
        "verbatim": true,
        "canonique": true,
        "officielle": true,
        "transcription": false,
        "enregistrement": false
      },
      "contenu": {
        "documentURI": "/15/amendements/1255A/CION_FIN/CF302.pdf"
      }
    }
  ],
  "dateDepot": "2018-10-04T02:00:00.000+02:00",
  "article99": "0",
  "loiReference": {}
}