{
  "uid": "AMANR5L15SEA717460BTC1974P0D1N1828",
  "identifiant": {
    "legislature": "15",
    "numero": "1828",
    "numRect": "0",
    "saisine": {
      "texteLegislatifRef": "PRJLANR5L15BTC1974",
      "numeroPartiePLF": "0",
      "organeExamen": "PO717460",
      "mentionSecondeDeliberation": "0"
    }
  },
  "numeroLong": "1828",
  "etapeTexte": "1ère lecture (2ème assemblée saisie)",
  "triAmendement": "adcaaaaaaaaaaaaaaaaaaaaaaaaaaaaaaaaaaaaaaaaaaaaaaabwp",
  "cardinaliteAmdtMultiples": "1",
  "etat": "Discuté",
  "signataires": {
    "auteur": {
      "typeAuteur": "Depute",
      "acteurRef": "PA722336",
      "groupePolitiqueRef": "PO730964"
    },
    "cosignatairesRefs": [
      "PA722336",
      "PA720754"
    ],
    "texteAffichable": "M.&#160;Thi&#233;baut et M.&#160;Studer"
  },
  "pointeurFragmentTexte": {
    "division": {
      "titre": "Article PREMIER",
      "articleDesignationCourte": "ART. PREMIER",
      "type": "ARTICLE",
      "avantAApres": "A",
      "divisionRattachee": "ARTICLE PREMIER",
      "urlDivisionTexteVise": "/15/textes/1974.asp#D_Article_1er"
    },
    "alinea": {
      "avantAApres": "Apres",
      "numero": "47"
    }
  },
  "corps": {
    "dispositif": "<p style=\"text-align: justify;\">I.&#160;&#8211;&#160;Apr&#232;s l&#8217;alin&#233;a&#160;47, ins&#233;rer l&#8217;alin&#233;a suivant&#160;:</p><p style=\"text-align: justify;\">&#171;&#160;Dans le cas o&#249; un groupement europ&#233;en de coop&#233;ration territoriale a &#233;t&#233; cr&#233;&#233; sur le ressort territorial de la r&#233;gion, la r&#233;gion peut d&#233;l&#233;guer, par convention, &#224; ce groupement tout ou partie d&#8217;un service ou plusieurs services mentionn&#233;s aux articles L.&#160;1231&#8209;1&#8209;1 et L.&#160;1231&#8209;3 du pr&#233;sent code.&#160;&#187;</p><p style=\"text-align: justify;\">II.&#160;&#8211;&#160;Compl&#233;ter cet article par l&#8217;alin&#233;a suivant&#160;:</p><p style=\"text-align: justify;\">&#171;&#160;VI.&#160;&#8211;&#160;La perte de recettes pour l&#8217;&#201;tat est compens&#233;e &#224; due concurrence par la cr&#233;ation d&#8217;une taxe additionnelle aux droits mentionn&#233;s aux articles 575 et 575 A du code g&#233;n&#233;ral des imp&#244;ts.&#160;&#187;</p>",
    "exposeSommaire": "<p style=\"text-align: justify;\">La mobilit&#233; est au c&#339;ur du fonctionnement des territoires transfrontaliers avec des d&#233;placements quotidiens qui participent &#224; la construction de ces bassins de vie.</p><p style=\"text-align: justify;\">Afin de permettre le d&#233;veloppement au plus pr&#232;s des territoires y compris dans les zones transfrontali&#232;res des solutions adapt&#233;es et r&#233;pondant aux besoins des populations qui y vivent, il est essentiel de permettre aux r&#233;gions, autorit&#233;s organisatrices de la mobilit&#233; r&#233;gionale de d&#233;l&#233;guer un ou plusieurs services de mobilit&#233; &#224; un groupement europ&#233;ens de coop&#233;ration territoriale (GECT) lorsque celui-ci se trouve sur son ressort territorial.</p><p style=\"text-align: justify;\">&#192; titre d&#8217;exemple, cette facult&#233; ouvrirait ainsi la possibilit&#233; &#224; un Eurodistrict de se voir d&#233;l&#233;guer par la r&#233;gion la mise en oeuvre d&#8217;une ligne de bus r&#233;guli&#232;re assurant des transports transfrontaliers en<br /> coop&#233;ration avec la r&#233;gion limitrophe d&#8217;un &#233;tat voisin.</p>"
  },
  "representations": [
    {
      "nom": "PDF",
      "typeMime": {
        "type": "application",
        "subType": "PDF"
      },
      "statutRepresentation": {
        "verbatim": true,
        "canonique": true,
        "officielle": true,
        "transcription": false,
        "enregistrement": false
      },
      "contenu": {
        "documentURI": "/15/amendements/1974/AN/1828.pdf"
      }
    }
  ],
  "seanceDiscussion": "RUANR5L15S2019IDS21675",
  "sort": {
    "dateSaisie": "2019-06-04T18:04:10.000+02:00",
    "sortEnSeance": "Adopté"
  },
  "dateDepot": "2019-05-29T02:00:00.000+02:00",
  "dateDistribution": "2019-06-03T02:00:00.000+02:00",
  "article99": "0",
  "loiReference": {}
}