{
  "uid": "AMANR5L15PO419610B0627P0D1N1352",
  "identifiant": {
    "legislature": "15",
    "numero": "1352",
    "numRect": "0",
    "saisine": {
      "texteLegislatifRef": "PRJLANR5L15B0627",
      "numeroPartiePLF": "0",
      "organeExamen": "PO419610",
      "mentionSecondeDeliberation": "0"
    }
  },
  "numeroLong": "CE1352",
  "etapeTexte": "1ère lecture (1ère assemblée saisie)",
  "triAmendement": "aueu",
  "cardinaliteAmdtMultiples": "1",
  "etat": "Discuté",
  "signataires": {
    "auteur": {
      "typeAuteur": "Depute",
      "acteurRef": "PA722142",
      "groupePolitiqueRef": "PO730958"
    },
    "cosignatairesRefs": [
      "PA720422",
      "PA719676",
      "PA720846",
      "PA721226",
      "PA721062",
      "PA588884",
      "PA718868",
      "PA718860",
      "PA2150",
      "PA721960",
      "PA720430",
      "PA722142",
      "PA720286",
      "PA721202",
      "PA719578",
      "PA721210",
      "PA720892"
    ],
    "texteAffichable": "M.&#160;Ruffin,  Mme&#160;Autain, M.&#160;Bernalicis, M.&#160;Coquerel, M.&#160;Corbi&#232;re, Mme&#160;Fiat, M.&#160;Lachaud, M.&#160;Larive, M.&#160;M&#233;lenchon, Mme&#160;Obono, Mme&#160;Panot, M.&#160;Prud&apos;homme, M.&#160;Quatennens, M.&#160;Ratenon, Mme&#160;Ressiguier, Mme&#160;Rubin et Mme&#160;Taurine"
  },
  "pointeurFragmentTexte": {
    "division": {
      "titre": "Article PREMIER",
      "articleDesignationCourte": "ART. PREMIER",
      "type": "ARTICLE",
      "avantAApres": "A",
      "divisionRattachee": "ARTICLE PREMIER",
      "urlDivisionTexteVise": "/15/textes/0627.asp#D_Article_1er"
    },
    "alinea": {
      "avantAApres": "A",
      "numero": "4",
      "alineaDesignation": "Alinéa 4"
    }
  },
  "corps": {
    "dispositif": "<p style=\"text-align: justify;\">&#192; l&#8217;alin&#233;a&#160;4, substituer au mot&#160;:</p><p style=\"text-align: justify;\">&#171;&#160;livr&#233;s&#160;&#187;</p><p style=\"text-align: justify;\">le mot&#160;:</p><p style=\"text-align: justify;\">&#171;&#160;distribu&#233;s&#160;&#187;.</p>",
    "exposeSommaire": "<p style=\"text-align: justify;\">Nous proposons aussi de remplacer &#8220;livr&#233;s sur le territoire fran&#231;ais&#8221; par &#8220;distribu&#233;s sur le territoire fran&#231;ais&#8221; pour que la loi s&#8217;applique aussi aux produits alimentaires qui seraient livr&#233;s &#224; l&#8217;&#233;tranger avant d&#8217;&#234;tre vendus en France. Nous pensons notamment &#224; Leclerc dont la centrale d&#8217;achat Eurelec trading est bas&#233;e &#224; Bruxelles. Nous voulons &#233;viter que cela lui permette d&#8217;&#233;viter l&#8217;application de la loi fran&#231;aise comme semble le craindre la DGCCRF qui a perquisitionn&#233; le si&#232;ge de Leclerc en fin f&#233;vrier 2018 notamment pour effectuer des v&#233;rification &#224; ce sujet.</p>"
  },
  "representations": [
    {
      "nom": "PDF",
      "typeMime": {
        "type": "application",
        "subType": "PDF"
      },
      "statutRepresentation": {
        "verbatim": true,
        "canonique": true,
        "officielle": true,
        "transcription": false,
        "enregistrement": false
      },
      "contenu": {
        "documentURI": "/15/amendements/0627/CION-ECO/CE1352.pdf"
      }
    }
  ],
  "sort": {
    "dateSaisie": "2018-04-17T17:44:59.000+02:00",
    "sortEnSeance": "Rejeté"
  },
  "dateDepot": "2018-04-13T02:00:00.000+02:00",
  "dateDistribution": "2018-04-16T02:00:00.000+02:00",
  "article99": "0",
  "loiReference": {}
}