{
  "uid": "AMANR5L15SEA717460BTC2142P0D1N75",
  "identifiant": {
    "legislature": "15",
    "numero": "75",
    "numRect": "1",
    "saisine": {
      "texteLegislatifRef": "PRJLANR5L15BTC2142",
      "numeroPartiePLF": "0",
      "organeExamen": "PO717460",
      "mentionSecondeDeliberation": "0"
    }
  },
  "numeroLong": "75 (Rect)",
  "etapeTexte": "1ère lecture (2ème assemblée saisie)",
  "triAmendement": "jaaaaaaaaaaaaaaaaaaaaaaaaaaaaaaaaaaaaaaaaaaaaaaaaag",
  "cardinaliteAmdtMultiples": "1",
  "etat": "Discuté",
  "signataires": {
    "auteur": {
      "typeAuteur": "Depute",
      "acteurRef": "PA720178",
      "groupePolitiqueRef": "PO730970"
    },
    "cosignatairesRefs": [
      "PA720178"
    ],
    "texteAffichable": "M.&#160;Garcia"
  },
  "pointeurFragmentTexte": {
    "division": {
      "titre": "Article 5 bis",
      "articleDesignationCourte": "APRÈS ART. 5 BIS",
      "type": "ARTICLE",
      "avantAApres": "Apres",
      "divisionRattachee": "APRÈS L'ARTICLE 5 BIS, insérer l'article suivant:",
      "articleAdditionnel": "1",
      "urlDivisionTexteVise": "/15/textes/2142.asp#D_Article_5_bis"
    }
  },
  "corps": {
    "dispositif": "<p>L'annexe &#224; la loi n&#176;&#160;2017&#8209;55 du 20 janvier 2017 portant statut g&#233;n&#233;ral des autorit&#233;s administratives ind&#233;pendantes et des autorit&#233;s publiques ind&#233;pendantes est ainsi modifi&#233;e :</p><p style=\"text-align: justify;\">1&#176; &#192; la fin du 3, les mots&#160;: &#171;&#160;et des postes&#160;&#187; sont remplac&#233;s par les mots&#160;: &#171;&#160;, des postes et de la distribution de la presse&#160;&#187;;</p><p style=\"text-align: justify;\">2&#176; Le 5 est supprim&#233;.</p>",
    "exposeSommaire": "<p style=\"text-align: justify;\">Amendement de coordination.</p>"
  },
  "representations": [
    {
      "nom": "PDF",
      "typeMime": {
        "type": "application",
        "subType": "PDF"
      },
      "statutRepresentation": {
        "verbatim": true,
        "canonique": true,
        "officielle": true,
        "transcription": false,
        "enregistrement": false
      },
      "contenu": {
        "documentURI": "/15/amendements/2142/AN/75.pdf"
      }
    }
  ],
  "seanceDiscussion": "RUANR5L15S2019IDS21785",
  "sort": {
    "dateSaisie": "2019-07-24T00:02:32.000+02:00",
    "sortEnSeance": "Adopté"
  },
  "dateDepot": "2019-07-19T02:00:00.000+02:00",
  "dateDistribution": "2019-07-23T02:00:00.000+02:00",
  "article99": "0",
  "loiReference": {
    "codeLoi": "loi 2017-55",
    "divisionCodeLoi": "3"
  }
}