{
  "uid": "AMANR5L15PO419865B2274P0D1N853",
  "identifiant": {
    "legislature": "15",
    "numero": "853",
    "numRect": "0",
    "saisine": {
      "texteLegislatifRef": "PRJLANR5L15B2274",
      "numeroPartiePLF": "0",
      "organeExamen": "PO419865",
      "mentionSecondeDeliberation": "0"
    }
  },
  "numeroLong": "CD853",
  "etapeTexte": "1ère lecture (2ème assemblée saisie)",
  "triAmendement": "cdaaaaaaaaaaaaaaaaaaaaaaaaaaaaaaaaaaaaaaaaaaaaaaaazx",
  "cardinaliteAmdtMultiples": "1",
  "etat": "En traitement",
  "signataires": {
    "auteur": {
      "typeAuteur": "Depute",
      "acteurRef": "PA333285",
      "groupePolitiqueRef": "PO758835"
    },
    "cosignatairesRefs": [
      "PA1008",
      "PA608741",
      "PA610681",
      "PA337483",
      "PA340343",
      "PA609332",
      "PA643145",
      "PA1198",
      "PA607553",
      "PA332614",
      "PA1809",
      "PA340357",
      "PA608695",
      "PA719930",
      "PA1592",
      "PA609590",
      "PA335054",
      "PA333285",
      "PA608172",
      "PA342415",
      "PA720988",
      "PA267233",
      "PA608011",
      "PA642764",
      "PA508",
      "PA335532",
      "PA605069",
      "PA333818",
      "PA429893"
    ],
    "texteAffichable": "M.&#160;Garot,  M.&#160;Bouillon, Mme&#160;Bareigts, M.&#160;Potier, Mme&#160;Battistel, M.&#160;Faure, M.&#160;Aviragnet, Mme&#160;Bi&#233;mouret, M.&#160;Jean-Louis&#160;Bricout, M.&#160;Carvounas, M.&#160;Alain&#160;David, Mme&#160;Laurence&#160;Dumont, M.&#160;David&#160;Habib, M.&#160;Hutin, M.&#160;Juanico, Mme&#160;Karamanli, M.&#160;J&#233;r&#244;me&#160;Lambert, M.&#160;Letchimy, Mme&#160;Manin, Mme&#160;Pau-Langevin, Mme&#160;Pires Beaune, M.&#160;Pueyo, Mme&#160;Rabault, M.&#160;Saulignac, Mme&#160;Tolmont, Mme&#160;Untermaier, Mme&#160;Vainqueur-Christophe, M.&#160;Vallaud, Mme&#160;Victory et les membres du groupe Socialistes et apparent&#233;s"
  },
  "pointeurFragmentTexte": {
    "division": {
      "titre": "Article 5",
      "articleDesignationCourte": "APRÈS ART. 5",
      "type": "ARTICLE",
      "avantAApres": "Apres",
      "divisionRattachee": "APRÈS L'ARTICLE 5, insérer l'article suivant:",
      "articleAdditionnel": "1",
      "urlDivisionTexteVise": "/15/textes/2274.asp#D_Article_5"
    }
  },
  "corps": {
    "dispositif": "<p>Apr&#232;s l'article 5,</p><p>ins&#233;rer un article additionnel ainsi r&#233;dig&#233; :</p><p>&#171; Le III de l&#8217;article 271 du code g&#233;n&#233;ral des imp&#244;ts est compl&#233;t&#233; par un c ainsi r&#233;dig&#233;&#160;:</p><p>&#171;&#160;c)&#160;Lorsque sont d&#233;truites de mani&#232;re volontaire des marchandises n&#8217;ayant fait l&#8217;objet ni d&#8217;un don ni d&#8217;une valorisation dans les conditions fix&#233;es &#224; l&#8217;article 5 de la pr&#233;sente loi ou &#224; l'article 1 de la loi n&#176;&#160;2016 138 du 11 f&#233;vrier 2016 relative &#224; la lutte contre le gaspillage alimentaire.&#160;&#187;</p>",
    "exposeSommaire": "<p>Cet amendement du groupe Socialistes et apparent&#233;s vise &#224; supprimer la dispense de r&#233;gularisation de la TVA pour l'ensemble des marchandises d&#233;truites volontairement.</p><p>Le m&#233;canisme actuellement en vigueur autorise que, dans certains cas particuliers, la TVA d&#233;duite, en amont, d&#8217;op&#233;rations commerciales en vue de la vente des marchandises ne fasse pas l&#8217;objet d&#8217;une &#171;&#160;r&#233;cup&#233;ration&#160;&#187; lorsque la vente n&#8217;a pas lieu, en aval. Cette r&#233;gularisation, qui est le principe, n&#8217;est en effet pas exig&#233;e lorsque les biens en stock sont d&#233;truits (soit accidentellement, soit volontairement), ce qui constitue de fait un avantage fiscal incitant &#224; la destruction de produits.</p><p>Cet amendement cible le cas d&#8217;une destruction volontaire de marchandises invendues qui ne sont ni recycl&#233;es, ni donn&#233;es, ni valoris&#233;es d'une quelconque mani&#232;re mani&#232;re. Dans ce cas de figure, le droit &#224; non-r&#233;gularisation de la TVA d&#233;duite devrait &#234;tre supprim&#233;.</p><p>Il s'agit de lutter, &#224; travers l'outil fiscal, contre la destruction massive d'invendus par des entreprises comme Amazon (qui aurait d&#233;truit l'ann&#233;e derni&#232;re 3 millions d'invendus neufs rien qu'en France). Malgr&#233; l'interdiction de destruction inscrite dans cette loi, il n'est en effet pas inenvisageable que certaines entreprises continuent &#224; incin&#233;rer leurs invendus car elles auraient un avantage fiscal &#224; continuer ce type de pratiques.</p>",
    "cartoucheDelaiDepotDepasse": "Sous réserve de son traitement par les services de l'Assemblée nationale et de sa recevabilité"
  },
  "representations": [
    {
      "nom": "PDF",
      "typeMime": {
        "type": "application",
        "subType": "PDF"
      },
      "statutRepresentation": {
        "verbatim": true,
        "canonique": true,
        "officielle": true,
        "transcription": false,
        "enregistrement": false
      },
      "contenu": {
        "documentURI": "/15/amendements/2274/CION-DVP/CD853.pdf"
      }
    }
  ],
  "dateDepot": "2019-11-20T01:00:00.000+01:00",
  "article99": "0",
  "loiReference": {}
}