{
  "uid": "AMANR5L15SEA717460B1255P2D1N867",
  "identifiant": {
    "legislature": "15",
    "numero": "867",
    "numRect": "0",
    "saisine": {
      "texteLegislatifRef": "PRJLANR5L15B1255",
      "numeroPartiePLF": "2",
      "organeExamen": "PO717460",
      "mentionSecondeDeliberation": "0"
    }
  },
  "numeroLong": "II-867",
  "etapeTexte": "1ère lecture (1ère assemblée saisie)",
  "triAmendement": "bahcaaaaaaaaaaaaaaaaaaaaaaaaaaaaaaaaaaaaaaaaaaaaaabo",
  "cardinaliteAmdtMultiples": "1",
  "etat": "Discuté",
  "signataires": {
    "auteur": {
      "typeAuteur": "Depute",
      "acteurRef": "PA405480",
      "groupePolitiqueRef": "PO759900"
    },
    "cosignatairesRefs": [
      "PA719146",
      "PA719138",
      "PA336175",
      "PA405480"
    ],
    "texteAffichable": "M.&#160;Pupponi,  M.&#160;Castellani, M.&#160;Acquaviva et Mme&#160;Pinel"
  },
  "pointeurFragmentTexte": {
    "missionVisee": {
      "idMissionAN": "415",
      "libelleMission": "Relations avec les collectivités territoriales",
      "codeMissionPLF": "B",
      "libelleMissionPLF": "Répartition, par mission et programme, des crédits du budget général"
    },
    "division": {
      "titre": "Article 81",
      "articleDesignationCourte": "ART. 81",
      "type": "ARTICLE",
      "avantAApres": "A",
      "divisionRattachee": "ARTICLE 81",
      "urlDivisionTexteVise": "/15/textes/1255C.asp#D_Article_81"
    }
  },
  "corps": {
    "dispositif": "<p style=\"text-align: justify;\">R&#233;diger ainsi cet article&#160;:</p><p style=\"text-align: justify;\">&#171;&#160;Les articles L.&#160;2334&#8209;40 et L.&#160;2334&#8209;41 du code g&#233;n&#233;ral des collectivit&#233;s territoriales sont ainsi r&#233;dig&#233;s&#160;:</p><p style=\"text-align: justify;\">&#171;&#160;<i>Art.&#160;L.&#160;2334&#8209;40</i>.&#160;&#8211;&#160;Il est institu&#233; une dotation budg&#233;taire intitul&#233;e dotation politique de la ville.</p><p style=\"text-align: justify;\">&#171;&#160;I.&#160;&#8211;&#160;Sont &#233;ligibles &#224; la dotation politique de la ville&#160;:</p><p style=\"text-align: justify;\">&#171;&#160;A.&#160;&#8211;&#160;Les communes des d&#233;partements d&#8217;outre-mer et des collectivit&#233;s territoriales de Martinique et de Guyane dans les conditions d&#233;finies &#224; l&#8217;article L.&#160;2334&#8209;41&#160;;</p><p style=\"text-align: justify;\">&#171;&#160;B.&#160;&#8211;&#160;Les cent cinquante premi&#232;res communes de m&#233;tropole class&#233;es en fonction d&#8217;un indice synth&#233;tique de ressources et de charges et qui remplissent les trois conditions suivantes&#160;:</p><p style=\"text-align: justify;\">&#171;&#160;1&#176; La commune est &#233;ligible &#224; la dotation de solidarit&#233; urbaine et de coh&#233;sion sociale pr&#233;vue &#224; l&#8217;article L.&#160;2334&#8209;15 et &#233;tait class&#233;e, l&#8217;ann&#233;e pr&#233;c&#233;dente, parmi les deux cent cinquante premi&#232;res communes class&#233;es en application du&#160;1&#176; de l&#8217;article L.&#160;2334&#8209;16 ou les trente premi&#232;res communes class&#233;es en application du 2&#176; du m&#234;me article&#160;;</p><p style=\"text-align: justify;\">&#171;&#160;2&#176; La commune pr&#233;sente une proportion de population situ&#233;e en quartiers prioritaires de la politique de la ville ou en zone franche urbaine &#233;gale ou sup&#233;rieure &#224; 35&#160;% de la population totale de la commune au sens du premier alin&#233;a de l&#8217;article L.&#160;2334&#8209;2&#160;;</p><p style=\"text-align: justify;\">&#171;&#160;3&#176; La commune est cit&#233;e dans la liste des quartiers qui pr&#233;sentent les dysfonctionnements urbains les plus importants prise en application du II de l&#8217;article&#160;9&#8209;1 de la loi n&#176;&#160;2003&#8209;710 du&#160;1<sup>er</sup>&#160;ao&#251;t 2003 d&#8217;orientation et de programmation pour la ville et la r&#233;novation urbaine o&#249; il existe sur le territoire communal au moins une convention pluriannuelle conclue avec l&#8217;Agence nationale pour la r&#233;novation urbaine, telle que vis&#233;e &#224; l&#8217;article&#160;10 de la m&#234;me loi.</p><p style=\"text-align: justify;\">&#171;&#160;II.&#160;&#8211;&#160;L&#8217;indice synth&#233;tique de ressources et de charges mentionn&#233; au B du I est fonction&#160;:</p><p style=\"text-align: justify;\">&#171;&#160;<i>a)</i> Du rapport entre le potentiel financier moyen par habitant des communes de m&#233;tropole et le potentiel financier de la commune&#160;;</p><p style=\"text-align: justify;\">&#171;&#160;<i>b)</i> Du rapport entre le revenu moyen par habitant des communes de m&#233;tropole et le revenu par habitant de la commune&#160;;</p><p style=\"text-align: justify;\">&#171;&#160;<i>c)</i> Du rapport entre la proportion moyenne de b&#233;n&#233;ficiaires d&#8217;aides au logement dans le nombre total des logements en m&#233;tropole et de la proportion de b&#233;n&#233;ficiaires d&#8217;aides au logement dans le nombre total des logements de la commune&#160;;</p><p style=\"text-align: justify;\">&#171;&#160;<i>d)</i> Du rapport entre l&#8217;effort fiscal moyen des communes de m&#233;tropole et l&#8217;effort fiscal de la commune.</p><p style=\"text-align: justify;\">&#171;&#160;Le revenu pris en compte est le dernier revenu fiscal de r&#233;f&#233;rence connu. La population prise en compte est celle issue du dernier recensement de population.</p><p style=\"text-align: justify;\">&#171;&#160;L&#8217;indice synth&#233;tique de ressources et de charges est obtenu par addition des rapports d&#233;finis aux <i>a</i>, <i>b</i>, <i>c</i> et <i>d</i> en pond&#233;rant le premier par&#160;15&#160;%, le deuxi&#232;me par&#160;35&#160;%, le troisi&#232;me par&#160;35&#160;% et le quatri&#232;me par&#160;15&#160;%.</p><p style=\"text-align: justify;\">&#171;&#160;III.&#160;&#8211;&#160;L&#8217;attribution revenant &#224; chaque commune mentionn&#233;e au B du I est calcul&#233;e en fonction du produit de sa population par son indice synth&#233;tique d&#233;fini au II, apr&#232;s r&#233;partition de la quote-part pr&#233;vue &#224; l&#8217;article L.&#160;2334&#8209;41.</p><p style=\"text-align: justify;\">&#171;&#160;IV.&#160;&#8211;&#160;Lorsqu&#8217;une commune cesse d&#8217;&#234;tre &#233;ligible &#224; la dotation en 2018, elle per&#231;oit un montant &#233;gal &#224; 90&#160;% de l&#8217;attribution per&#231;ue au tire de l&#8217;exercice pr&#233;c&#233;dent et diminuant ensuite d&#8217;un dixi&#232;me chaque ann&#233;e. Les sommes n&#233;cessaires sont pr&#233;lev&#233;es sur le montant de la dotation avant application du III.</p><p style=\"text-align: justify;\">&#171;&#160;Pour l&#8217;application du pr&#233;sent article, sauf mention contraire, les donn&#233;es sont appr&#233;ci&#233;es au 1<sup>er</sup>&#160;janvier de l&#8217;ann&#233;e pr&#233;c&#233;dant celle au titre de laquelle est r&#233;partie la dotation politique de la ville et la population &#224; prendre en compte est celle d&#233;finie &#224; l&#8217;article L.&#160;2334&#8209;2.</p><p style=\"text-align: justify;\">&#171;&#160;V.&#160;&#8211;&#160;Lorsque la comp&#233;tence en mati&#232;re de politique de la ville a &#233;t&#233; transf&#233;r&#233;e par une commune &#233;ligible &#224; un &#233;tablissement public de coop&#233;ration intercommunale, &#224; un &#233;tablissement public territorial de la M&#233;tropole du Grand Paris ou &#224; un territoire de la M&#233;tropole d&#8217;Aix-Marseille-Provence, celui-ci peut b&#233;n&#233;ficier, dans des conditions fix&#233;es par d&#233;cret et apr&#232;s d&#233;lib&#233;ration concordante des organes d&#233;lib&#233;rants de la commune et de l&#8217;&#233;tablissement public territorial de coop&#233;ration intercommunale, de l&#8217;&#233;tablissement public territorial de la M&#233;tropole du Grand Paris ou du territoire de la M&#233;tropole d&#8217;Aix-Marseille-Provence concern&#233;s, de la dotation politique de la ville pour le compte de cette commune.</p><p style=\"text-align: justify;\">&#171;&#160;VI.&#160;&#8211;&#160;Les modalit&#233;s d&#8217;application du pr&#233;sent article sont fix&#233;es par d&#233;cret en Conseil d&#8217;&#201;tat.</p><p style=\"text-align: justify;\">&#171;&#160;<i>Art.&#160;L.&#160;2334-41</i>.&#160;&#8211;&#160;Les communes des d&#233;partements d&#8217;outre-mer per&#231;oivent une quote-part de la dotation politique de la ville pr&#233;vue &#224; l&#8217;article L.&#160;2334&#8209;40. Cette quote-part est calcul&#233;e en appliquant au montant total de la dotation politique de la ville le rapport, major&#233; de 33&#160;%, existant, d&#8217;apr&#232;s le dernier recensement, entre la population totale des communes des d&#233;partements d&#8217;outre-mer et la population totale des communes des d&#233;partements de m&#233;tropole et d&#8217;outre-mer.</p><p style=\"text-align: justify;\">&#171;&#160;Ce crit&#232;re est appr&#233;ci&#233; en fonction des donn&#233;es connues au 1er janvier de l&#8217;ann&#233;e pr&#233;c&#233;dant la r&#233;partition.</p><p style=\"text-align: justify;\">&#171;&#160;Sont &#233;ligibles &#224; cette quote-part les communes des d&#233;partements d&#8217;outre-mer de plus de 5 000 habitants sur le territoire desquelles il existe au moins une convention pluriannuelle conclue avec l&#8217;Agence nationale pour la r&#233;novation urbaine, telle que vis&#233;e &#224; l&#8217;article&#160;10 de la loi n&#176;&#160;2003&#8209;710 du 1er&#160;ao&#251;t 2003 d&#8217;orientation et de programmation pour la ville et la r&#233;novation urbaine, au&#160;1<sup>er</sup>&#160;janvier de l&#8217;ann&#233;e pr&#233;c&#233;dant la r&#233;partition. Sont &#233;galement &#233;ligibles les communes des d&#233;partements d&#8217;outre-mer et des collectivit&#233;s territoriales de Martinique et de Guyane cit&#233;es dans la liste des quartiers qui pr&#233;sentent les dysfonctionnements urbains les plus importants prise en application du II de l&#8217;article&#160;9&#8209;1 de la m&#234;me loi.</p><p style=\"text-align: justify;\">&#171;&#160;La quote-part est r&#233;partie entre les communes &#233;ligibles en faisant application des II, III et IV de l&#8217;article L.&#160;2334&#8209;40.&#160;&#187;</p>",
    "exposeSommaire": "<p style=\"text-align: justify;\">La dotation politique de la ville, anciennement Dotation de d&#233;veloppement urbain, a &#233;t&#233; pens&#233;e dans la loi de de programmation pour la ville et la coh&#233;sion urbaine pour accompagner les d&#233;penses pr&#233;vues par les collectivit&#233;s territoriales pour l&#8217;exercice de la comp&#233;tence politique de la ville et en particulier pour les projets pr&#233;vus dans les contrats de ville. Malgr&#233; une plus grande flexibilit&#233; donn&#233;e &#224; cette dotation depuis 2015, les contraintes li&#233;es au fonctionnement de la dotation alourdissent sensiblement la gestion de ces cr&#233;dits. La r&#233;partition par enveloppe d&#233;partementale tend &#233;galement &#224; cr&#233;er des in&#233;galit&#233;s entre territoires selon la personnalit&#233; des pr&#233;fets charg&#233;s de r&#233;partir les enveloppes. Ainsi, alors qu&#8217;en 2018 ce sont 150M&#8364; qui ont &#233;t&#233; pr&#233;vus pour cette dotation, seule la moiti&#233; de ces cr&#233;dits a effectivement &#233;t&#233; attribu&#233;e aux communes &#233;ligibles. Cette situation n&#8217;est pas acceptable au regard des engagements pris et de l&#8217;objet de cette dotation.</p><p style=\"text-align: justify;\">Afin de d&#233;passer les contraintes inh&#233;rentes &#224; la DPV et de lui donner enfin le caract&#232;re d&#8217;une dotation soutenant les communes pauvres de la politique de la ville, il est propos&#233; de transformer celle-ci en dotation budg&#233;taire libre, attribu&#233;e selon les m&#234;mes crit&#232;res d&#8217;&#233;ligibilit&#233; mais en fonction d&#8217;un indice synth&#233;tique de ressources et de charges, sur le mod&#232;le de la DSU et non plus selon un syst&#232;me d&#8217;enveloppe d&#233;partementale &#224; la discr&#233;tion des Pr&#233;fets. S&#8217;agissant du crit&#232;re d&#8217;&#233;ligibilit&#233; fixant un seuil minimal de population en QPV ou en ZFU, afin d&#8217;&#233;viter les effets d&#8217;aubaine, celui-ci est relev&#233; &#224; 35&#160;% contre 19&#160;% aujourd&#8217;hui.</p><p style=\"text-align: justify;\">Il faut redonner de l&#8217;oxyg&#232;ne et de la flexibilit&#233; aux communes de la Politique de la ville afin qu&#8217;elle puissent s&#8217;attaquer au cumul de handicaps qui les caract&#233;rise. C&#8217;est le sens de l&#8217;appel formul&#233; par les &#233;lus et associations r&#233;unis dans le cadre de l&#8217;appel de Grigny notamment et le sens du pr&#233;sent amendement.</p>"
  },
  "representations": [
    {
      "nom": "PDF",
      "typeMime": {
        "type": "application",
        "subType": "PDF"
      },
      "statutRepresentation": {
        "verbatim": true,
        "canonique": true,
        "officielle": true,
        "transcription": false,
        "enregistrement": false
      },
      "contenu": {
        "documentURI": "/15/amendements/1255C/AN/867.pdf"
      }
    }
  ],
  "seanceDiscussion": "RUANR5L15S2019IDS21333",
  "sort": {
    "dateSaisie": "2018-11-09T01:40:29.000+01:00",
    "sortEnSeance": "Rejeté"
  },
  "dateDepot": "2018-10-31T01:00:00.000+01:00",
  "dateDistribution": "2018-11-06T01:00:00.000+01:00",
  "article99": "0",
  "loiReference": {}
}