{
  "uid": "AMANR5L15PO59048B0235P2D1N717",
  "identifiant": {
    "legislature": "15",
    "numero": "717",
    "numRect": "0",
    "saisine": {
      "texteLegislatifRef": "PRJLANR5L15B0235",
      "numeroPartiePLF": "2",
      "organeExamen": "PO59048",
      "mentionSecondeDeliberation": "0"
    }
  },
  "numeroLong": "II-CF717",
  "etapeTexte": "1ère lecture (1ère assemblée saisie)",
  "triAmendement": "aagbi",
  "cardinaliteAmdtMultiples": "1",
  "etat": "Discuté",
  "signataires": {
    "auteur": {
      "typeAuteur": "Depute",
      "acteurRef": "PA266788",
      "groupePolitiqueRef": "PO730952"
    },
    "cosignatairesRefs": [
      "PA266788"
    ],
    "texteAffichable": "M.&#160;Morel-&#192;-L&apos;Huissier"
  },
  "pointeurFragmentTexte": {
    "division": {
      "titre": "Article 44",
      "articleDesignationCourte": "APRÈS ART. 44",
      "type": "ARTICLE",
      "avantAApres": "Apres",
      "divisionRattachee": "APRÈS L'ARTICLE 44, insérer l'article suivant:",
      "articleAdditionnel": "1",
      "urlDivisionTexteVise": "/15/textes/0235C.asp#D_Article_44"
    }
  },
  "corps": {
    "dispositif": "<p style=\"text-align: justify;\">I.&#160;&#8211;&#160;Dans les d&#233;partements de moins de&#160;100&#160;000&#160;habitants et situ&#233;s en zone de montagne, les zones de revitalisation rurale comprennent les communes incluses dans un arrondissement ou un canton caract&#233;ris&#233; par une tr&#232;s faible densit&#233; de population ou par une faible densit&#233; de population et satisfaisant &#224; l&#8217;un des trois crit&#232;res socio-&#233;conomiques suivants&#160;:</p><p style=\"text-align: justify;\">1&#176; Un d&#233;clin de la population constat&#233; sur l&#8217;ensemble de l&#8217;arrondissement ou du canton ou dans une majorit&#233; de leurs communes dont le chef-lieu&#160;;</p><p style=\"text-align: justify;\">2&#176; Un d&#233;clin de la population active&#160;;</p><p style=\"text-align: justify;\">3&#176; Une forte proportion d&#8217;emplois agricoles.</p><p style=\"text-align: justify;\">II.&#160;&#8211;&#160;La perte de recettes pour l&#8217;&#201;tat est compens&#233;e &#224; due concurrence par la cr&#233;ation d&#8217;une taxe additionnelle aux droits mentionn&#233;s aux articles&#160;575 et&#160;575&#160;A du code g&#233;n&#233;ral des imp&#244;ts.</p><p style=\"text-align: justify;\">III.&#160;&#8211;&#160;La perte de recettes pour les organismes de s&#233;curit&#233; sociale est compens&#233;e &#224; due concurrence par la majoration des droits mentionn&#233;s aux articles&#160;575 et&#160;575&#160;A du code g&#233;n&#233;ral des imp&#244;ts.</p><p>IV.&#160;&#8211;&#160;La perte de recettes pour les collectivit&#233;s territoriales est compens&#233;e &#224; due concurrence par la majoration de la dotation globale de fonctionnement et, corr&#233;lativement pour l&#8217;&#201;tat, par la cr&#233;ation d&#8217;une taxe additionnelle aux droits mentionn&#233;s aux articles 575 et 575 A du code g&#233;n&#233;ral des imp&#244;ts.</p>",
    "exposeSommaire": "<p>EXPOS&#201; SOMMAIRE</p><p>La loi de finances rectificatives pour 2015 n&#176; 2015 1786 du 29 d&#233;cembre 2015, et plus particuli&#232;rement son article 45, a modifi&#233; les crit&#232;res d&#8217;&#233;ligibilit&#233; des communes au dispositif ZRR.</p><p>Sont d&#233;sormais pris en compte des crit&#232;res &#224; l&#8217;&#233;chelon intercommunal ce qui entraine le classement ou non de l&#8217;ensemble des communes de l&#8217;EPCI concern&#233;. D&#232;s lors, certaines communes tr&#232;s rurales, appartenant &#224; des grands EPCI, &#160;se retrouvent exclues dudit dispositif alors m&#234;me qu&#8217;elles auraient toute la l&#233;gitimit&#233; pour b&#233;n&#233;ficier de l&#8217;arsenal juridique, social et fiscal li&#233; aux ZRR. L&#8217;impact de cette loi est d&#8217;autant plus important pour les d&#233;partement situ&#233;s en zone de montagne et de moins de 100 000 habitants dans la mesure o&#249; ces derni&#232;res cumulent des difficult&#233;s suppl&#233;mentaires en mati&#232;re d&#8217;attractivit&#233; &#233;conomique au regard de leur sp&#233;cificit&#233; g&#233;ographique.&#160;</p><p>Il a donc &#233;t&#233; cr&#233;&#233; une distorsion entre communes rurales de montagne qu&#8217;il convient de corriger. C&#8217;est l&#8217;objet du pr&#233;sent amendement qui vise &#224; r&#233;tablir les anciens crit&#232;res d&#8217;&#233;ligibilit&#233; aux ZRR pour les communes rurales situ&#233;es en zone de montagne.</p>"
  },
  "representations": [
    {
      "nom": "PDF",
      "typeMime": {
        "type": "application",
        "subType": "PDF"
      },
      "statutRepresentation": {
        "verbatim": true,
        "canonique": true,
        "officielle": true,
        "transcription": false,
        "enregistrement": false
      },
      "contenu": {
        "documentURI": "/15/amendements/0235C/CION_TOUTE/CF717.pdf"
      }
    }
  ],
  "sort": {
    "sortEnSeance": "Non soutenu"
  },
  "dateDepot": "2017-11-06T01:00:00.000+01:00",
  "dateDistribution": "2017-11-09T01:00:00.000+01:00",
  "article99": "0",
  "loiReference": {
    "codeLoi": "impôts",
    "divisionCodeLoi": "44 octies A"
  }
}