{
  "uid": "AMANR5L15PO420120B2416P0D1N174",
  "identifiant": {
    "legislature": "15",
    "numero": "174",
    "numRect": "0",
    "saisine": {
      "texteLegislatifRef": "PRJLANR5L15B2416",
      "numeroPartiePLF": "0",
      "organeExamen": "PO420120",
      "mentionSecondeDeliberation": "0"
    }
  },
  "numeroLong": "AS174",
  "etapeTexte": "Nouvelle Lecture",
  "triAmendement": "kgaaaaaaaaaaaaaaaaaaaaaaaaaaaaaaaaaaaaaaaaaaaaaaaafi",
  "cardinaliteAmdtMultiples": "1",
  "etat": "Irrecevable",
  "signataires": {
    "auteur": {
      "typeAuteur": "Depute",
      "acteurRef": "PA607553",
      "groupePolitiqueRef": "PO758835"
    },
    "cosignatairesRefs": [
      "PA610681",
      "PA720988",
      "PA643145",
      "PA642764",
      "PA508",
      "PA607553",
      "PA719930",
      "PA337483"
    ],
    "texteAffichable": "M.&#160;Potier,  Mme&#160;Vainqueur-Christophe, M.&#160;Letchimy, Mme&#160;Manin, M.&#160;Aviragnet, Mme&#160;Bi&#233;mouret, M.&#160;Vallaud, Mme&#160;Bareigts et les membres du groupe Socialistes et apparent&#233;s"
  },
  "pointeurFragmentTexte": {
    "division": {
      "titre": "Article 46",
      "articleDesignationCourte": "ART. 46",
      "type": "ARTICLE",
      "avantAApres": "A",
      "divisionRattachee": "ARTICLE 46",
      "urlDivisionTexteVise": "/15/textes/2416.asp#D_Article_46"
    },
    "alinea": {
      "avantAApres": "Apres",
      "numero": "12"
    }
  },
  "corps": {},
  "representations": [
    {
      "nom": "PDF",
      "typeMime": {
        "type": "application",
        "subType": "PDF"
      },
      "statutRepresentation": {
        "verbatim": true,
        "canonique": true,
        "officielle": true,
        "transcription": false,
        "enregistrement": false
      },
      "contenu": {
        "documentURI": "/15/amendements/2416/CION-SOC/AS174.pdf"
      }
    }
  ],
  "dateDepot": "2019-11-20T01:00:00.000+01:00",
  "dateDistribution": "2019-11-20T01:00:00.000+01:00",
  "article99": "0",
  "loiReference": {}
}