{
  "uid": "AMANR5L15PO59051B1802P0D1N706",
  "identifiant": {
    "legislature": "15",
    "numero": "706",
    "numRect": "0",
    "saisine": {
      "texteLegislatifRef": "PRJLANR5L15B1802",
      "numeroPartiePLF": "0",
      "organeExamen": "PO59051",
      "mentionSecondeDeliberation": "0"
    }
  },
  "numeroLong": "CL706",
  "etapeTexte": "1ère lecture (1ère assemblée saisie)",
  "triAmendement": "aiaaaaaaaaaaaaaaaaaaaaaaaaaaaaaaaaaaaaaaaaaaaaaaaauati",
  "cardinaliteAmdtMultiples": "1",
  "etat": "Discuté",
  "signataires": {
    "auteur": {
      "typeAuteur": "Depute",
      "acteurRef": "PA719748",
      "groupePolitiqueRef": "PO730964"
    },
    "cosignatairesRefs": [
      "PA719748"
    ],
    "texteAffichable": "Mme&#160;Chalas, rapporteure"
  },
  "pointeurFragmentTexte": {
    "division": {
      "titre": "Article 3",
      "articleDesignationCourte": "ART. 3",
      "type": "ARTICLE",
      "avantAApres": "A",
      "divisionRattachee": "ARTICLE 3",
      "urlDivisionTexteVise": "/15/textes/1802.asp#D_Article_3"
    },
    "alinea": {
      "avantAApres": "Apres",
      "numero": "139"
    }
  },
  "corps": {
    "dispositif": "<p style=\"text-align: justify;\">Compl&#233;ter cet article par les neuf alin&#233;as suivants&#160;:</p><p style=\"text-align: justify;\">&#171;&#160;VII.&#160;&#8211;&#160;Au&#160;1&#176; de l&#8217;article&#160;9<i>&#160;<i>ter</i> </i>de la loi n&#176;&#160;83&#8209;634 du&#160;13&#160;juillet&#160;1983 portant droits et obligations des fonctionnaires, le mot&#160;: &#171;&#160;techniques&#160;&#187; est remplac&#233; par les mots&#160;: &#171;&#160;sociaux d&#8217;administration&#160;&#187;.</p><p style=\"text-align: justify;\">&#171;&#160;VIII.&#160;&#8211;&#160;&#192; l&#8217;article&#160;51 de la loi n&#176;&#160;2012&#8209;347 du&#160;12 mars&#160;2012 relative &#224; l&#8217;acc&#232;s &#224; l&#8217;emploi titulaire et &#224; l&#8217;am&#233;lioration des conditions d&#8217;emploi des agents contractuels dans la fonction publique, &#224; la lutte contre les discriminations et portant diverses dispositions relatives &#224; la fonction publique, le mot&#160;: &#171;&#160;techniques&#160;&#187; est remplac&#233; par les mots&#160;: &#171;&#160;sociaux d&#8217;administration&#160;&#187;.</p><p style=\"text-align: justify;\">&#171;&#160;IX.&#160;&#8211;&#160;&#192; la premi&#232;re phrase du premier alin&#233;a de l&#8217;article L.&#160;951&#8209;1&#8209;1 du code de l&#8217;&#233;ducation, le mot&#160;: &#171;&#160;technique&#160;&#187; est remplac&#233; par les mots&#160;: &#171;&#160;social d&#8217;administration&#160;&#187;.</p><p style=\"text-align: justify;\">&#171;&#160;X.&#160;&#8211;&#160;Au premier alin&#233;a de l&#8217;article L.&#160;313&#8209;6 du code rural, les mots&#160;: &#171;&#160;techniques et des comit&#233;s d&#8217;hygi&#232;ne, de s&#233;curit&#233; et des conditions de travail&#160;&#187; sont remplac&#233;s par les mots&#160;: &#171;&#160;sociaux d&#8217;administration&#160;&#187;.</p><p style=\"text-align: justify;\">&#171;&#160;XI.&#160;&#8211;&#160;Le second alin&#233;a de l&#8217;article L.&#160;2221&#8209;3 du code des transports est ainsi modifi&#233;&#160;:</p><p style=\"text-align: justify;\">&#171;&#160;1&#176; Le mot&#160;: &#171;&#160;technique&#160;&#187; est remplac&#233; par les mots&#160;: &#171;&#160;social d&#8217;administration&#160;&#187;&#160;;</p><p style=\"text-align: justify;\">&#171;&#160;2&#176; Apr&#232;s l&#8217;ann&#233;e&#160;: &#171;&#160;1984&#160;&#187;, la fin est supprim&#233;e.</p><p style=\"text-align: justify;\">&#171;&#160;XII.&#160;&#8211;&#160;La premi&#232;re phrase du cinqui&#232;me alin&#233;a du&#160;1 de l&#8217;article&#160;29&#8209;1 de la loi n&#176;&#160;90&#8209;568 du&#160;2&#160;juillet&#160;1990 relative &#224; l&#8217;organisation du service public de la poste et &#224; France T&#233;l&#233;com est supprim&#233;e.</p><p style=\"text-align: justify;\">&#171;&#160;XIII.&#160;&#8211;&#160;Le quatri&#232;me alin&#233;a de l&#8217;article L.&#160;232&#8209;3 du code de justice administrative est supprim&#233;.&#160;&#187;</p>",
    "exposeSommaire": "<p>Amendement de coordination.</p>"
  },
  "representations": [
    {
      "nom": "PDF",
      "typeMime": {
        "type": "application",
        "subType": "PDF"
      },
      "statutRepresentation": {
        "verbatim": true,
        "canonique": true,
        "officielle": true,
        "transcription": false,
        "enregistrement": false
      },
      "contenu": {
        "documentURI": "/15/amendements/1802/CION_LOIS/CL706.pdf"
      }
    }
  ],
  "sort": {
    "dateSaisie": "2019-05-02T12:38:04.000+02:00",
    "sortEnSeance": "Adopté"
  },
  "dateDepot": "2019-04-29T02:00:00.000+02:00",
  "dateDistribution": "2019-05-01T02:00:00.000+02:00",
  "article99": "0",
  "loiReference": {
    "codeLoi": "z1983-634",
    "divisionCodeLoi": "9 ter"
  }
}