{
  "uid": "AMANR5L15PO59048B2272P1D1N1108",
  "identifiant": {
    "legislature": "15",
    "numero": "1108",
    "numRect": "0",
    "saisine": {
      "texteLegislatifRef": "PRJLANR5L15B2272",
      "numeroPartiePLF": "1",
      "organeExamen": "PO59048",
      "mentionSecondeDeliberation": "0"
    }
  },
  "numeroLong": "I-CF1108",
  "etapeTexte": "1ère lecture (1ère assemblée saisie)",
  "triAmendement": "baaaaaaaaaaaaaaaaaaaaaaaaaaaaaaaaaaaaaaaaaaaaaaaaaem",
  "cardinaliteAmdtMultiples": "1",
  "etat": "Irrecevable",
  "signataires": {
    "auteur": {
      "typeAuteur": "Depute",
      "acteurRef": "PA718720",
      "groupePolitiqueRef": "PO730940"
    },
    "cosignatairesRefs": [
      "PA722202",
      "PA610667",
      "PA722110",
      "PA441",
      "PA267306",
      "PA720546",
      "PA721012",
      "PA718926",
      "PA721118",
      "PA610654",
      "PA721270",
      "PA335612",
      "PA689",
      "PA721896",
      "PA718720",
      "PA720692"
    ],
    "texteAffichable": "M.&#160;Dufr&#232;gne,  M.&#160;Fabien&#160;Roussel, Mme&#160;Bello, M.&#160;Brotherson, M.&#160;Bruneel, Mme&#160;Buffet, M.&#160;Chassaigne, M.&#160;Dharr&#233;ville, Mme&#160;Faucillon, M.&#160;Jumel, Mme&#160;K&#233;clard-Mond&#233;sir, M.&#160;Lecoq, M.&#160;Nilor, M.&#160;Peu, M.&#160;Serville et M.&#160;Wulfranc"
  },
  "pointeurFragmentTexte": {
    "division": {
      "titre": "Article 4",
      "articleDesignationCourte": "ART. 4",
      "type": "ARTICLE",
      "avantAApres": "A",
      "divisionRattachee": "ARTICLE 4",
      "urlDivisionTexteVise": "/15/textes/2272A.asp#D_Article_4"
    },
    "alinea": {
      "numero": "30"
    }
  },
  "corps": {},
  "representations": [
    {
      "nom": "PDF",
      "typeMime": {
        "type": "application",
        "subType": "PDF"
      },
      "statutRepresentation": {
        "verbatim": true,
        "canonique": true,
        "officielle": true,
        "transcription": false,
        "enregistrement": false
      },
      "contenu": {
        "documentURI": "/15/amendements/2272A/CION_FIN/CF1108.pdf"
      }
    }
  ],
  "dateDepot": "2019-10-04T02:00:00.000+02:00",
  "dateDistribution": "2019-10-04T02:00:00.000+02:00",
  "article99": "0",
  "loiReference": {}
}