{
  "uid": "AMANR5L15PO59048B0378P0D1N24",
  "identifiant": {
    "legislature": "15",
    "numero": "24",
    "numRect": "0",
    "saisine": {
      "texteLegislatifRef": "PRJLANR5L15B0378",
      "numeroPartiePLF": "0",
      "organeExamen": "PO59048",
      "mentionSecondeDeliberation": "0"
    }
  },
  "numeroLong": "CF24",
  "etapeTexte": "Nouvelle Lecture",
  "triAmendement": "i",
  "cardinaliteAmdtMultiples": "1",
  "etat": "Discuté",
  "signataires": {
    "auteur": {
      "typeAuteur": "Depute",
      "acteurRef": "PA609590",
      "groupePolitiqueRef": "PO730946"
    },
    "cosignatairesRefs": [
      "PA340343",
      "PA608172",
      "PA1592",
      "PA335999",
      "PA335054",
      "PA642764",
      "PA608695",
      "PA337483",
      "PA607553",
      "PA1198",
      "PA333285",
      "PA405480",
      "PA267233",
      "PA1008",
      "PA342415",
      "PA610681",
      "PA1809",
      "PA332614",
      "PA333818",
      "PA429893",
      "PA719930",
      "PA605069",
      "PA608011",
      "PA609332",
      "PA609590",
      "PA588886",
      "PA643145",
      "PA335532",
      "PA720988",
      "PA508"
    ],
    "texteAffichable": "Mme&#160;Rabault,  M.&#160;Jean-Louis&#160;Bricout, Mme&#160;Pires Beaune, M.&#160;Pupponi, M.&#160;Faure, M.&#160;Aviragnet, Mme&#160;Bareigts, Mme&#160;Batho, Mme&#160;Battistel, Mme&#160;Bi&#233;mouret, M.&#160;Bouillon, M.&#160;Carvounas, M.&#160;Alain&#160;David, Mme&#160;Laurence&#160;Dumont, M.&#160;Garot, M.&#160;David&#160;Habib, M.&#160;Hutin, M.&#160;Juanico, Mme&#160;Karamanli, M.&#160;J&#233;r&#244;me&#160;Lambert, M.&#160;Le Foll, M.&#160;Letchimy, Mme&#160;Manin, Mme&#160;Pau-Langevin, M.&#160;Potier, M.&#160;Pueyo, M.&#160;Saulignac, Mme&#160;Untermaier, Mme&#160;Vainqueur-Christophe et M.&#160;Vallaud"
  },
  "pointeurFragmentTexte": {
    "division": {
      "titre": "Article 8 bis",
      "articleDesignationCourte": "ART. 8 BIS",
      "type": "ARTICLE",
      "avantAApres": "A",
      "divisionRattachee": "ARTICLE 8 BIS",
      "urlDivisionTexteVise": "/15/textes/0378.asp#D_Article_8_bis"
    }
  },
  "corps": {
    "dispositif": "<p>Supprimer cet article.</p>",
    "exposeSommaire": "<p style=\"text-align: justify;\">L&#8217;article&#160;8<i> bis</i>, ins&#233;r&#233; au S&#233;nat, dispose que l&#8217;incidence, en 2022, des sch&#233;mas d&#8217;emplois ex&#233;cut&#233;s de 2018 &#224; 2022 pour l&#8217;&#201;tat et ses op&#233;rateurs&#160;doit &#234;tre&#160;inf&#233;rieure ou &#233;gale &#224; -&#160;50&#160;000&#160;emplois exprim&#233;s en &#233;quivalents temps plein travaill&#233;.</p><p style=\"text-align: justify;\">Le groupe Nouvelle Gauche s&#8217;oppose &#224; cette vision purement comptable qui rappelle les sombres heures de la RGPP et souhaite donc la suppression de cet article.</p>"
  },
  "representations": [
    {
      "nom": "PDF",
      "typeMime": {
        "type": "application",
        "subType": "PDF"
      },
      "statutRepresentation": {
        "verbatim": true,
        "canonique": true,
        "officielle": true,
        "transcription": false,
        "enregistrement": false
      },
      "contenu": {
        "documentURI": "/15/amendements/0378/CION_FIN/CF24.pdf"
      }
    }
  ],
  "sort": {
    "dateSaisie": "2017-12-14T09:11:33.000+01:00",
    "sortEnSeance": "Rejeté"
  },
  "dateDepot": "2017-12-13T01:00:00.000+01:00",
  "dateDistribution": "2017-12-14T01:00:00.000+01:00",
  "article99": "0",
  "loiReference": {}
}