{
  "uid": "AMANR5L15SEA717460BTC2027P0D1N5",
  "identifiant": {
    "legislature": "15",
    "numero": "5",
    "numRect": "0",
    "saisine": {
      "texteLegislatifRef": "PIONANR5L15BTC2027",
      "numeroPartiePLF": "0",
      "organeExamen": "PO717460",
      "mentionSecondeDeliberation": "0"
    }
  },
  "numeroLong": "5",
  "etapeTexte": "1ère lecture (2ème assemblée saisie)",
  "triAmendement": "daaaaaaaaaaaaaaaaaaaaaaaaaaaaaaaaaaaaaaaaaaaaaaaaavg",
  "cardinaliteAmdtMultiples": "1",
  "etat": "A discuter",
  "signataires": {
    "auteur": {
      "typeAuteur": "Depute",
      "acteurRef": "PA405480",
      "groupePolitiqueRef": "PO759900"
    },
    "cosignatairesRefs": [
      "PA719146",
      "PA336439",
      "PA942",
      "PA605518",
      "PA719138",
      "PA331582",
      "PA607619",
      "PA720038",
      "PA605694",
      "PA267042",
      "PA719286",
      "PA755549",
      "PA333421",
      "PA721194",
      "PA720996",
      "PA405480",
      "PA608292"
    ],
    "texteAffichable": "M.&#160;Pupponi,  M.&#160;Acquaviva, M.&#160;Brial, M.&#160;Castellani, M.&#160;Cl&#233;ment, M.&#160;Colombani, M.&#160;Charles&#160;de Courson, Mme&#160;Dubi&#233;, Mme&#160;Fr&#233;d&#233;rique&#160;Dumas, M.&#160;El Guerrab, M.&#160;Falorni, M.&#160;Favennec Becot, Mme&#160;Josso, M.&#160;Fran&#231;ois-Michel&#160;Lambert, M.&#160;Molac, M.&#160;Pancher et M.&#160;Philippe&#160;Vigier"
  },
  "pointeurFragmentTexte": {
    "division": {
      "titre": "Article 2",
      "articleDesignationCourte": "ART. 2",
      "type": "ARTICLE",
      "avantAApres": "A",
      "divisionRattachee": "ARTICLE 2",
      "urlDivisionTexteVise": "/15/textes/2027.asp#D_Article_2"
    },
    "alinea": {
      "numero": "7"
    }
  },
  "corps": {
    "dispositif": "<p style=\"text-align: justify;\">&#192; la seconde phrase de l&#8217;alin&#233;a&#160;7, apr&#232;s le mot&#160;:</p><p style=\"text-align: justify;\">&#171;&#160;locataire&#160;&#187;,</p><p style=\"text-align: justify;\">ins&#233;rer les mots&#160;:</p><p style=\"text-align: justify;\">&#171;&#160;ou l&#8217;un de ses enfants mineurs sous sa responsabilit&#233; l&#233;gale&#160;&#187;.</p>",
    "exposeSommaire": "<p style=\"text-align: justify;\">Le trafic de stup&#233;fiants constitue, avec les d&#233;gradations et les incivilit&#233;s, l&#8217;une des causes majeures des probl&#232;mes de troubles de voisinage et d&#8217;atteinte &#224; la jouissance paisible que subissent les locataires.</p><p style=\"text-align: justify;\">Afin d&#8217;&#233;viter que les bailleurs soient d&#233;munis pour agir &#224; l&#8217;encontre de ces fauteurs de troubles, le contrat de bail doit pouvoir &#234;tre r&#233;sili&#233; de plein droit &#224; la demande du bailleur lorsque le locataire ou l&#8217;un de ses enfants mineurs sous sa responsabilit&#233; l&#233;gale aura &#233;t&#233; d&#233;finitivement condamn&#233; pour une de ces infractions commises post&#233;rieurement &#224; la conclusion du contrat de bail.</p><p style=\"text-align: justify;\">Le pr&#233;sent amendement vise donc &#224; r&#233;tablir l&#8217;article&#160;2 dans sa r&#233;daction issue des travaux du S&#233;nat, laquelle reprenait les termes de l&#8217;article&#160;121 de la loi ELAN.</p>",
    "cartoucheDelaiDepotDepasse": "Sous réserve de son traitement par les services de l'Assemblée nationale et de sa recevabilité"
  },
  "representations": [
    {
      "nom": "PDF",
      "typeMime": {
        "type": "application",
        "subType": "PDF"
      },
      "statutRepresentation": {
        "verbatim": true,
        "canonique": true,
        "officielle": true,
        "transcription": false,
        "enregistrement": false
      },
      "contenu": {
        "documentURI": "/15/amendements/2027/AN/5.pdf"
      }
    }
  ],
  "dateDepot": "2019-06-17T02:00:00.000+02:00",
  "dateDistribution": "2019-06-19T02:00:00.000+02:00",
  "article99": "0",
  "loiReference": {}
}