{
  "uid": "AMANR5L15SEA717460B2272P1D1N783",
  "identifiant": {
    "legislature": "15",
    "numero": "783",
    "numRect": "0",
    "saisine": {
      "texteLegislatifRef": "PRJLANR5L15B2272",
      "numeroPartiePLF": "1",
      "organeExamen": "PO717460",
      "mentionSecondeDeliberation": "0"
    }
  },
  "numeroLong": "I-783",
  "etapeTexte": "1ère lecture (1ère assemblée saisie)",
  "triAmendement": "gaaaaaaaaaaaaaaaaaaaaaaaaaaaaaaaaaaaaaaaaaaaaaaaaabbdzzzzzo",
  "cardinaliteAmdtMultiples": "1",
  "etat": "Discuté",
  "signataires": {
    "auteur": {
      "typeAuteur": "Depute",
      "acteurRef": "PA719890",
      "groupePolitiqueRef": "PO730964"
    },
    "cosignatairesRefs": [
      "PA719890"
    ],
    "texteAffichable": "Mme&#160;Brulebois"
  },
  "pointeurFragmentTexte": {
    "division": {
      "titre": "Article 21",
      "articleDesignationCourte": "ART. 21",
      "type": "ARTICLE",
      "avantAApres": "A",
      "divisionRattachee": "ARTICLE 21",
      "urlDivisionTexteVise": "/15/textes/2272A.asp#D_Article_21"
    },
    "alinea": {
      "numero": "2"
    }
  },
  "corps": {
    "dispositif": "<p>I.&#160;&#8211;&#160;&#192; l&#8217;alin&#233;a&#160;2, substituer au nombre&#160;:</p><p style=\"text-align: justify;\">&#171;&#160;26 801 527 462&#160;&#187;</p><p style=\"text-align: justify;\">le nombre&#160;: &#160;</p><p style=\"text-align: justify;\">&#171;&#160;26 802 027 462&#160;&#187;.</p><p style=\"text-align: justify;\">II.&#160;&#8211;&#160;Compl&#233;ter cet article par l&#8217;alin&#233;a suivant&#160;:</p><p style=\"text-align: justify;\">&#171;&#160;VI. &#8211; La perte &#233;ventuelle de ressources recettes pour l&#8217;&#201;tat est compens&#233;e &#224; due concurrence par la cr&#233;ation d&#8217;une taxe additionnelle aux droits vis&#233;s aux articles 575 et 575 A du code g&#233;n&#233;ral des imp&#244;ts.&#160;&#187;</p>",
    "exposeSommaire": "<p>Les sch&#233;mas d&#233;partementaux d&#8217;accueil des gens du voyage pr&#233;sid&#233;s par les pr&#233;fets et les pr&#233;sidents de conseils d&#233;partementaux organisent l&#8217;accueil des personnes non s&#233;dentaires dans les d&#233;partements. &#160;</p><p style=\"text-align: justify;\">Des aires de grand passage et des aires officielles d&#8217;accueil y sont identifi&#233;es. &#160;</p><p style=\"text-align: justify;\">Mais le sch&#233;ma n&#8217;est pas toujours mis en &#339;uvre car ces espaces n&#8217;existent pas toujours dans les communes qui sont dans l&#8217;obligation d&#8217;en cr&#233;er. &#160;</p><p style=\"text-align: justify;\">Par cons&#233;quent les gens du voyage s&#8217;installent dans les communes o&#249; ils ont des conditions d&#8217;accueil favorables&#160;: stades ou places en proximit&#233; des commerces avec acc&#232;s &#224; l&#8217;eau et l&#8217;&#233;lectricit&#233;. Ces communes parfois petites et avec de faibles ressources doivent supporter seules les frais li&#233;s &#224; cet accueil.</p><p style=\"text-align: justify;\">Ce fonds permettrait de faire supporter &#224; la solidarit&#233; nationale les d&#233;penses li&#233;es &#224; un accueil digne des gens du voyage.</p>"
  },
  "representations": [
    {
      "nom": "PDF",
      "typeMime": {
        "type": "application",
        "subType": "PDF"
      },
      "statutRepresentation": {
        "verbatim": true,
        "canonique": true,
        "officielle": true,
        "transcription": false,
        "enregistrement": false
      },
      "contenu": {
        "documentURI": "/15/amendements/2272A/AN/783.pdf"
      }
    }
  ],
  "seanceDiscussion": "RUANR5L15S2020IDS21871",
  "sort": {
    "dateSaisie": "2019-10-19T01:52:52.000+02:00",
    "sortEnSeance": "Non soutenu"
  },
  "dateDepot": "2019-10-09T02:00:00.000+02:00",
  "dateDistribution": "2019-10-19T02:00:00.000+02:00",
  "article99": "0",
  "loiReference": {}
}