{
  "uid": "AMANR5L15SEA717460BTC2243P0D1N1220",
  "identifiant": {
    "legislature": "15",
    "numero": "1220",
    "numRect": "0",
    "saisine": {
      "texteLegislatifRef": "PRJLANR5L15BTC2243",
      "numeroPartiePLF": "0",
      "organeExamen": "PO717460",
      "mentionSecondeDeliberation": "0"
    }
  },
  "numeroLong": "1220",
  "etapeTexte": "1ère lecture (1ère assemblée saisie)",
  "triAmendement": "auaaaaaaaaaaaaaaaaaaaaaaaaaaaaaaaaaaaaaaaaaaaaaaaahv",
  "cardinaliteAmdtMultiples": "1",
  "etat": "Discuté",
  "signataires": {
    "auteur": {
      "typeAuteur": "Depute",
      "acteurRef": "PA642847",
      "groupePolitiqueRef": "PO730934"
    },
    "cosignatairesRefs": [
      "PA642847"
    ],
    "texteAffichable": "M.&#160;Bazin"
  },
  "pointeurFragmentTexte": {
    "division": {
      "titre": "Article 4",
      "articleDesignationCourte": "ART. 4",
      "type": "ARTICLE",
      "avantAApres": "A",
      "divisionRattachee": "ARTICLE 4",
      "urlDivisionTexteVise": "/15/textes/2243.asp#D_Article_4"
    },
    "alinea": {
      "avantAApres": "Apres",
      "numero": "21"
    }
  },
  "corps": {
    "dispositif": "<p style=\"text-align: justify;\">Apr&#232;s l&#8217;alin&#233;a&#160;21, ins&#233;rer l&#8217;alin&#233;a suivant&#160;:</p><p style=\"text-align: justify;\">&#171;&#160;Une &#233;valuation des cons&#233;quences pour les enfants n&#233;s par la procr&#233;ation m&#233;dicalement assist&#233;e dans des couples de femmes est faite &#224; partir de l&#8217;exp&#233;rience des pays o&#249; cette proc&#233;dure est l&#233;galis&#233;e.&#160;&#187;</p>",
    "exposeSommaire": "<p style=\"text-align: justify;\">Comme le souligne le CCNE, nous ne b&#233;n&#233;ficions d&#8217;aucune &#233;tude s&#233;rieuse en France sur les cons&#233;quences pour les enfants issus d&#8217;une PMA au sein d&#8217;un couple de femmes.</p><p style=\"text-align: justify;\">Cela permettrait de v&#233;rifier que c&#8217;est un &#171;&#160;avantage&#160;&#187; comme le pr&#233;tend le rapporteur.</p>"
  },
  "representations": [
    {
      "nom": "PDF",
      "typeMime": {
        "type": "application",
        "subType": "PDF"
      },
      "statutRepresentation": {
        "verbatim": true,
        "canonique": true,
        "officielle": true,
        "transcription": false,
        "enregistrement": false
      },
      "contenu": {
        "documentURI": "/15/amendements/2243/AN/1220.pdf"
      }
    }
  ],
  "seanceDiscussion": "RUANR5L15S2020IDS21845",
  "sort": {
    "dateSaisie": "2019-10-03T19:22:09.000+02:00",
    "sortEnSeance": "Rejeté"
  },
  "dateDepot": "2019-09-18T02:00:00.000+02:00",
  "dateDistribution": "2019-09-25T02:00:00.000+02:00",
  "article99": "0",
  "loiReference": {}
}