{
  "uid": "AMANR5L15SEA717460BTC2062P0D1N18",
  "identifiant": {
    "legislature": "15",
    "numero": "18",
    "numRect": "0",
    "saisine": {
      "texteLegislatifRef": "PIONANR5L15BTC2062",
      "numeroPartiePLF": "0",
      "organeExamen": "PO717460",
      "mentionSecondeDeliberation": "0"
    }
  },
  "numeroLong": "18",
  "etapeTexte": "1ère lecture (1ère assemblée saisie)",
  "triAmendement": "acaaaaaaaaaaaaaaaaaaaaaaaaaaaaaaaaaaaaaaaaaaaaaaaai",
  "cardinaliteAmdtMultiples": "1",
  "etat": "Discuté",
  "signataires": {
    "auteur": {
      "typeAuteur": "Depute",
      "acteurRef": "PA721932",
      "groupePolitiqueRef": "PO723569"
    },
    "cosignatairesRefs": [
      "PA721932"
    ],
    "texteAffichable": "Mme&#160;Lorho"
  },
  "pointeurFragmentTexte": {
    "division": {
      "titre": "Chapitre Ier",
      "articleDesignationCourte": "AVANT ART. PREMIER",
      "type": "CHAPITRE",
      "avantAApres": "A",
      "divisionRattachee": "AVANT  L'ARTICLE PREMIER",
      "urlDivisionTexteVise": "/15/textes/2062.asp#D_Chapitre_Ier_2"
    }
  },
  "corps": {
    "dispositif": "<p style=\"text-align: justify;\">&#192; l&#8217;intitul&#233; du chapitre I<sup>er</sup>, substituer au mot&#160;:</p><p style=\"text-align: justify;\">&#171;&#160;haineux&#160;&#187;</p><p style=\"text-align: justify;\">les mots&#160;:</p><p style=\"text-align: justify;\">&#171;&#160;ne r&#233;pondant pas aux standards de communaut&#233;s&#160;&#187;.</p>",
    "exposeSommaire": "<p>La haine n&#8217;a pas de d&#233;finition juridique. C&#8217;est une notion morale subjective qu&#8217;il ne nous appartient pas de d&#233;finir.&#160;</p><p style=\"text-align: justify;\">Il s&#8217;agit d&#8217;un amendement de coh&#233;rence, visant &#224; faire &#233;cho &#224; la nouvelle r&#233;daction propos&#233;e pour le titre.</p>"
  },
  "representations": [
    {
      "nom": "PDF",
      "typeMime": {
        "type": "application",
        "subType": "PDF"
      },
      "statutRepresentation": {
        "verbatim": true,
        "canonique": true,
        "officielle": true,
        "transcription": false,
        "enregistrement": false
      },
      "contenu": {
        "documentURI": "/15/amendements/2062/AN/18.pdf"
      }
    }
  ],
  "seanceDiscussion": "RUANR5L15S2019IDS21748",
  "sort": {
    "dateSaisie": "2019-07-03T18:32:54.000+02:00",
    "sortEnSeance": "Non soutenu"
  },
  "dateDepot": "2019-06-26T02:00:00.000+02:00",
  "dateDistribution": "2019-07-02T02:00:00.000+02:00",
  "article99": "0",
  "loiReference": {}
}