{
  "uid": "AMANR5L15SEA717460B1371P0D1N54",
  "identifiant": {
    "legislature": "15",
    "numero": "54",
    "numRect": "0",
    "saisine": {
      "texteLegislatifRef": "PRJLANR5L15B1371",
      "numeroPartiePLF": "0",
      "organeExamen": "PO717460",
      "mentionSecondeDeliberation": "0"
    }
  },
  "numeroLong": "54",
  "etapeTexte": "1ère lecture (1ère assemblée saisie)",
  "triAmendement": "jiaaaaaaaaaaaaaaaaaaaaaaaaaaaaaaaaaaaaaaaaaaaaaaaaiati",
  "cardinaliteAmdtMultiples": "1",
  "etat": "Discuté",
  "signataires": {
    "auteur": {
      "typeAuteur": "Depute",
      "acteurRef": "PA330909",
      "groupePolitiqueRef": "PO730934"
    },
    "cosignatairesRefs": [
      "PA722390",
      "PA605036",
      "PA340853",
      "PA266793",
      "PA267204",
      "PA720586",
      "PA709315",
      "PA721474",
      "PA720210",
      "PA346218",
      "PA718884",
      "PA721046",
      "PA267429",
      "PA719318",
      "PA330909",
      "PA642847",
      "PA267527",
      "PA332523",
      "PA609245"
    ],
    "texteAffichable": "M.&#160;Descoeur,  M.&#160;Bony, M.&#160;Sermier, M.&#160;Leclerc, Mme&#160;Bazin-Malgras, Mme&#160;Anthoine, M.&#160;Saddier, Mme&#160;Corneloup, M.&#160;Cinieri, M.&#160;Vatin, M.&#160;Masson, Mme&#160;Bassire, Mme&#160;Lacroute, M.&#160;Abad, M.&#160;Viala, M.&#160;Viry, M.&#160;Bazin, Mme&#160;Dalloz et Mme&#160;Beauvais"
  },
  "pointeurFragmentTexte": {
    "division": {
      "titre": "Article 8",
      "articleDesignationCourte": "APRÈS ART. 8",
      "type": "ARTICLE",
      "avantAApres": "Apres",
      "divisionRattachee": "APRÈS L'ARTICLE 8, insérer l'article suivant:",
      "articleAdditionnel": "1",
      "urlDivisionTexteVise": "/15/textes/1371.asp#D_Article_8"
    }
  },
  "corps": {
    "dispositif": "<p style=\"text-align: justify;\">I.&#160;&#8211;&#160;Apr&#232;s le mot&#160;: &#171;&#160;&#233;nerg&#233;tique&#160;&#187;, la fin du premier alin&#233;a du 1&#176; du <i>b</i> du 1 de l&#8217;article&#160;200 <i>quater</i> du code g&#233;n&#233;ral des imp&#244;ts est supprim&#233;e.</p><p>II.&#160;&#8211;&#160;Le I n&#8217;est applicable qu&#8217;aux sommes venant en d&#233;duction de l&#8217;imp&#244;t d&#251;.</p><p>III.&#160;&#8211;&#160;Le&#160;I est applicable &#224; compter du 1er janvier 2019.</p><p style=\"text-align: justify;\">IV.&#160;&#8211;&#160;La perte de recettes pour l&#8217;&#201;tat est compens&#233;e &#224; due concurrence par la cr&#233;ation d&#8217;une taxe additionnelle aux droits mentionn&#233;s aux article&#160;575 et 575 A du code g&#233;n&#233;ral des imp&#244;ts.</p>",
    "exposeSommaire": "<p style=\"text-align: justify;\">Alors que la transition &#233;nerg&#233;tique est une priorit&#233;, il convient de r&#233;introduire du champ d&#8217;application du cr&#233;dit d&#8217;imp&#244;t pour la transition &#233;nerg&#233;tique (CITE) les chaudi&#232;res &#224; haute performance &#233;nerg&#233;tique utilisant du fioul.</p>"
  },
  "representations": [
    {
      "nom": "PDF",
      "typeMime": {
        "type": "application",
        "subType": "PDF"
      },
      "statutRepresentation": {
        "verbatim": true,
        "canonique": true,
        "officielle": true,
        "transcription": false,
        "enregistrement": false
      },
      "contenu": {
        "documentURI": "/15/amendements/1371/AN/54.pdf"
      }
    }
  ],
  "seanceDiscussion": "RUANR5L15S2019IDS21366",
  "sort": {
    "dateSaisie": "2018-11-13T01:19:47.000+01:00",
    "sortEnSeance": "Rejeté"
  },
  "dateDepot": "2018-11-08T01:00:00.000+01:00",
  "dateDistribution": "2018-11-12T01:00:00.000+01:00",
  "article99": "0",
  "loiReference": {
    "codeLoi": "CGI",
    "divisionCodeLoi": "200 quater"
  }
}