{
  "uid": "AMANR5L15PO59048B1255P1D1N517",
  "identifiant": {
    "legislature": "15",
    "numero": "517",
    "numRect": "0",
    "saisine": {
      "texteLegislatifRef": "PRJLANR5L15B1255",
      "numeroPartiePLF": "1",
      "organeExamen": "PO59048",
      "mentionSecondeDeliberation": "0"
    }
  },
  "numeroLong": "I-CF517",
  "etapeTexte": "1ère lecture (1ère assemblée saisie)",
  "triAmendement": "ebaaaaaaaaaaaaaaaaaaaaaaaaaaaaaaaaaaaaaaaaaaaaaaaaai",
  "cardinaliteAmdtMultiples": "1",
  "etat": "Irrecevable",
  "signataires": {
    "auteur": {
      "typeAuteur": "Depute",
      "acteurRef": "PA1327",
      "groupePolitiqueRef": "PO730934"
    },
    "cosignatairesRefs": [
      "PA608016",
      "PA721410",
      "PA608416",
      "PA1874",
      "PA1327",
      "PA332523"
    ],
    "texteAffichable": "M.&#160;Forissier,  Mme&#160;Bonnivard, M.&#160;Hetzel, Mme&#160;Louwagie, M.&#160;Le Fur et Mme&#160;Dalloz"
  },
  "pointeurFragmentTexte": {
    "division": {
      "titre": "Article 17",
      "articleDesignationCourte": "APRÈS ART. 17",
      "type": "ARTICLE",
      "avantAApres": "Apres",
      "divisionRattachee": "APRÈS L'ARTICLE 17, insérer l'article suivant:",
      "articleAdditionnel": "1",
      "urlDivisionTexteVise": "/15/textes/1255A.asp#D_Article_17"
    }
  },
  "corps": {
    "dispositif": "<p>L&#8217;article L341&#8209;34&#8209;1 du code de la consommation est compl&#233;t&#233; par les mots&#160;: &#171;&#160;, ainsi que de toute clause qui maintiendrait cette condition lors de la souscription, par l&#8217;emprunteur, d&#8217;une nouvelle op&#233;ration de financement de cr&#233;dit immobilier dans un autre &#233;tablissement pr&#234;teur.&#160;&#187;.</p><p>&#160;</p>",
    "exposeSommaire": "<p>L&#8217;Ordonnance n&#176;2017&#8209;1090 du 1er juin 2017 offre la possibilit&#233;, pour les &#233;tablissements de cr&#233;dit pr&#234;teurs, d&#8217;imposer au client particulier, en contrepartie d&#8217;un avantage sur le taux d&#8217;un cr&#233;dit immobilier, la domiciliation des revenus de ce m&#234;me client au sein de l&#8217;&#233;tablissement. Et ce pour une dur&#233;e pouvant aller jusqu&#8217;&#224; 10 ans.</p><p>Cette ordonnance, qui limite pour le tiers des Fran&#231;ais d&#233;tenteurs d&#8217;un cr&#233;dit immobilier, la mobilit&#233; bancaire, pose &#233;galement un probl&#232;me majeur pour tous ceux qui souhaiteraient, alors qu&#8217;ils ont d&#233;j&#224; un cr&#233;dit immobilier, b&#233;n&#233;ficier d&#8217;un second cr&#233;dit pour acheter une r&#233;sidence secondaire ou pour r&#233;aliser un investissement locatif.</p><p>Si ces clients sont soumis &#224; une obligation de domiciliation de revenus pour leur premier cr&#233;dit immobilier, ceux-ci ne pourront pas, dans le cadre de la recherche de leur second cr&#233;dit, faire jouer la concurrence. Impossible en effet de domicilier leurs revenus dans deux banques &#224; la fois.</p><p>De ce fait, la libert&#233; de choix et la concurrence risquent d&#8217;&#234;tre an&#233;anties pour une part importante du march&#233; du cr&#233;dit immobilier, la premi&#232;re banque pouvant imposer ses conditions au client cherchant un second cr&#233;dit immobilier.</p><p>Cet amendement a ainsi pour objectif de r&#233;tablir la concurrence entre les banques en annulant la condition de domiciliation dans les cas o&#249; le client souscrirait un second cr&#233;dit immobilier dans un autre &#233;tablissement pr&#233;teur. Cet amendement permet ainsi de dynamiser le march&#233; du cr&#233;dit immobilier et indirectement de soutenir le march&#233; immobilier &#224; l&#8217;heure o&#249; les mises en chantier diminuent.</p>"
  },
  "representations": [
    {
      "nom": "PDF",
      "typeMime": {
        "type": "application",
        "subType": "PDF"
      },
      "statutRepresentation": {
        "verbatim": true,
        "canonique": true,
        "officielle": true,
        "transcription": false,
        "enregistrement": false
      },
      "contenu": {
        "documentURI": "/15/amendements/1255A/CION_FIN/CF517.pdf"
      }
    }
  ],
  "dateDepot": "2018-10-04T02:00:00.000+02:00",
  "article99": "0",
  "loiReference": {
    "codeLoi": "consommation",
    "divisionCodeLoi": "L 341-34-1"
  }
}