{
  "uid": "AMANR5L15SEA717460BTC2243P0D1N2012",
  "identifiant": {
    "legislature": "15",
    "numero": "2012",
    "numRect": "0",
    "saisine": {
      "texteLegislatifRef": "PRJLANR5L15BTC2243",
      "numeroPartiePLF": "0",
      "organeExamen": "PO717460",
      "mentionSecondeDeliberation": "0"
    }
  },
  "numeroLong": "2012",
  "etapeTexte": "1ère lecture (1ère assemblée saisie)",
  "triAmendement": "ceaaaaaaaaaaaaaaaaaaaaaaaaaaaaaaaaaaaaaaaaaaaaaaaaax",
  "cardinaliteAmdtMultiples": "1",
  "etat": "Discuté",
  "signataires": {
    "auteur": {
      "typeAuteur": "Depute",
      "acteurRef": "PA722284",
      "groupePolitiqueRef": "PO730970"
    },
    "cosignatairesRefs": [
      "PA721924",
      "PA722284",
      "PA719640"
    ],
    "texteAffichable": "M.&#160;Fuchs,  Mme&#160;Mette et Mme&#160;de Vaucouleurs"
  },
  "pointeurFragmentTexte": {
    "division": {
      "titre": "Article 10",
      "articleDesignationCourte": "ART. 10",
      "type": "ARTICLE",
      "avantAApres": "A",
      "divisionRattachee": "ARTICLE 10",
      "urlDivisionTexteVise": "/15/textes/2243.asp#D_Article_10"
    },
    "alinea": {
      "numero": "2"
    }
  },
  "corps": {
    "dispositif": "<p>I.&#160;&#8211;&#160;Compl&#233;ter la premi&#232;re phrase de l&#8217;alin&#233;a&#160;2, par les mots&#160;:</p><p style=\"text-align: justify;\">&#171;&#160;ou de recherche de ses origines personnelles.&#160;&#187;</p><p style=\"text-align: justify;\">II.&#160;&#8211;&#160;En cons&#233;quence, apr&#232;s l&#8217;alin&#233;a&#160;2, ins&#233;rer l&#8217;alin&#233;a suivant&#160;:</p><p style=\"text-align: justify;\">&#171;&#160;Dans le cas de l&#8217;examen de caract&#233;ristiques g&#233;n&#233;tiques &#224; des fins de recherche de ses origines personnelles, les tests g&#233;n&#233;tiques ne donnent aucune indication sur le statut m&#233;dical du patient, pr&#233;sent ou &#224; venir.&#160;&#187;</p><p style=\"text-align: justify;\">III.&#160;&#8211;&#160;En cons&#233;quence, compl&#233;ter l&#8217;alin&#233;a&#160;5, par les mots&#160;:</p><p style=\"text-align: justify;\">&#171;&#160;ou de recherche de ses origines personnelles.&#160;&#187;</p><p style=\"text-align: justify;\">IV.&#160;&#8211;&#160;En cons&#233;quence, apr&#232;s l&#8217;alin&#233;a&#160;7, ins&#233;rer l&#8217;alin&#233;a suivant&#160;:&#160;</p><p style=\"text-align: justify;\">&#171;&#160;5&#176;&#160;De la possibilit&#233; de retrouver par le biais de cet examen des membres de sa parent&#232;le ayant effectu&#233; le m&#234;me type d&#8217;examen.&#160;&#187;&#160;</p>",
    "exposeSommaire": "<p style=\"text-align: justify;\">Les tests ADN dits r&#233;cr&#233;atifs pour connaitre ses origines sont de plus en plus souvent utilis&#233;s, par exemple par les enfants n&#233;s d&#8217;un don de gam&#232;tes ou n&#233;s sous X. Cela est une n&#233;cessit&#233; pour eux&#160;: pour conna&#238;tre leurs origines mais aussi pour la construction de leur vie familiale. Le pr&#233;sent projet de loi envisage de donner acc&#232;s &#224; certaines donn&#233;es non identifiantes et identifiantes aux enfants n&#233;s de dons de gam&#232;tes des couples de femmes ou de femmes non mari&#233;es. Mais cela n&#8217;inclut pas les personnes n&#233;es avant la mise en application de ce texte, encore moins les enfants issus de dons de gam&#232;tes de couples h&#233;t&#233;rosexuels ou les enfants n&#233;s sous X.</p><p style=\"text-align: justify;\">&#192; ce jour, bien que ces tests soient interdits par la loi fran&#231;aise, les sanctions ne sont pas ou peu appliqu&#233;es, ce qui peut remettre en cause ce principe d&#8217;interdiction. Cependant, du fait de cette interdiction, la pratique de ces tests ADN est aux mains de soci&#233;t&#233;s priv&#233;es &#233;trang&#232;res avec une marchandisation des donn&#233;es, en dehors du cadre instaurer par le RGPD et particuli&#232;rement son article&#160;9. Cela questionne &#224; la fois notre souverainet&#233; et nos principes &#233;thiques. Par exemple, la soci&#233;t&#233; isra&#233;lienne MyHeritage, leader sur le march&#233;, a glan&#233; en trois ans 3 millions de tests ou r&#233;sultats ADN. Les &#233;chantillons ADN r&#233;colt&#233;s sont stock&#233;s dans leurs laboratoires aux &#201;tats-Unis. Les donn&#233;es collect&#233;es sont conserv&#233;es, &#224; part demande expr&#232;s de l&#8217;utilisateur, donnant &#224; la soci&#233;t&#233; &#171;&#160;le droit de recevoir, utiliser, modifier, afficher et cr&#233;er des travaux d&#233;riv&#233;s&#160;&#187; &#224; partir de ces donn&#233;es pour l&#8217;&#233;laboration de ses services. Par ailleurs, la soci&#233;t&#233; se d&#233;douane de toute responsabilit&#233;, y compris en cas d&#8217;erreur ou d&#8217;omission.</p><p style=\"text-align: justify;\">Nous proposons de faire &#233;voluer la loi en ouvrant l&#8217;examen des caract&#233;ristiques g&#233;n&#233;tiques aux fins de recherche de ses origines personnelles. Ceci vise &#224; donner au l&#233;gislateur et aux pouvoirs publics la possibilit&#233; d&#8217;encadrer une pratique qui se d&#233;veloppe en dehors du cadre juridique et m&#233;dical actuel. De plus, cela aura pour vertu la Constitution de bases de donn&#233;es et la conservation sur le sol fran&#231;ais ou europ&#233;en d&#8217;informations personnelles et sensibles.</p>"
  },
  "representations": [
    {
      "nom": "PDF",
      "typeMime": {
        "type": "application",
        "subType": "PDF"
      },
      "statutRepresentation": {
        "verbatim": true,
        "canonique": true,
        "officielle": true,
        "transcription": false,
        "enregistrement": false
      },
      "contenu": {
        "documentURI": "/15/amendements/2243/AN/2012.pdf"
      }
    }
  ],
  "seanceDiscussion": "RUANR5L15S2020IDS21847",
  "sort": {
    "dateSaisie": "2019-10-04T12:34:30.000+02:00",
    "sortEnSeance": "Rejeté"
  },
  "dateDepot": "2019-09-20T02:00:00.000+02:00",
  "dateDistribution": "2019-10-01T02:00:00.000+02:00",
  "article99": "0",
  "loiReference": {}
}