{
  "uid": "AMANR5L15SEA717460BTC2063P0D1N293",
  "identifiant": {
    "legislature": "15",
    "numero": "293",
    "numRect": "0",
    "saisine": {
      "texteLegislatifRef": "PRJLANR5L15BTC2063",
      "numeroPartiePLF": "0",
      "organeExamen": "PO717460",
      "mentionSecondeDeliberation": "0"
    }
  },
  "numeroLong": "293",
  "etapeTexte": "1ère lecture (1ère assemblée saisie)",
  "triAmendement": "soaaaaaaaaaaaaaaaaaaaaaaaaaaaaaaaaaaaaaaaaaaaaaaaaudwo",
  "cardinaliteAmdtMultiples": "1",
  "etat": "Discuté",
  "signataires": {
    "auteur": {
      "typeAuteur": "Depute",
      "acteurRef": "PA607553",
      "groupePolitiqueRef": "PO758835"
    },
    "cosignatairesRefs": [
      "PA333285",
      "PA337483",
      "PA342415",
      "PA607553",
      "PA267233"
    ],
    "texteAffichable": "M.&#160;Potier,  Mme&#160;Battistel, M.&#160;Bouillon, M.&#160;Garot, M.&#160;Letchimy et les membres du groupe Socialistes et apparent&#233;s"
  },
  "pointeurFragmentTexte": {
    "division": {
      "titre": "Article 12",
      "articleDesignationCourte": "APRÈS ART. 12",
      "type": "ARTICLE",
      "avantAApres": "Apres",
      "divisionRattachee": "APRÈS L'ARTICLE 12, insérer l'article suivant:",
      "articleAdditionnel": "1",
      "urlDivisionTexteVise": "/15/textes/2063.asp#D_Article_12"
    }
  },
  "corps": {
    "dispositif": "<p style=\"text-align: justify;\">Dans un d&#233;lai d&#8217;un an &#224; compter de la promulgation de la pr&#233;sente loi, le Gouvernement remet un rapport au Parlement &#233;valuant l&#8217;opportunit&#233; et les modalit&#233;s d&#8217;une bonification de la valeur des certificats d&#8217;&#233;conomies d&#8217;&#233;nergie lorsqu&#8217;ils financent des travaux de transition &#233;nerg&#233;tique des logements dont la consommation &#233;nerg&#233;tique est sup&#233;rieure &#224; 330 kilowattheures d&#8217;&#233;nergie primaire par m&#232;tre carr&#233; et par an.</p>",
    "exposeSommaire": "<p style=\"text-align: justify;\">Le pr&#233;sent amendement des d&#233;put&#233;s socialistes et apparent&#233;s demande au Gouvernement de remettre un rapport au Parlement &#233;valuant l&#8217;opportunit&#233; et les modalit&#233;s d&#8217;une survalorisation des CEE en faveur des travaux r&#233;alis&#233;s sur les logements class&#233;s F et G. En effet, alors que le r&#233;sidentiel repr&#233;sente la principale source de consommation d&#8217;&#233;nergie primaire et que cette consommation est essentiellement port&#233;e par les passoires &#233;nerg&#233;tiques, il appara&#238;t essentiel de concentrer tous les moyens disponibles sur la r&#233;sorption de cet habitat. D&#232;s lors, il appara&#238;t int&#233;ressant de cr&#233;er une incitation compl&#233;mentaire pour les oblig&#233;s &#224; financer des travaux sur ces logements en priorit&#233;.</p>"
  },
  "representations": [
    {
      "nom": "PDF",
      "typeMime": {
        "type": "application",
        "subType": "PDF"
      },
      "statutRepresentation": {
        "verbatim": true,
        "canonique": true,
        "officielle": true,
        "transcription": false,
        "enregistrement": false
      },
      "contenu": {
        "documentURI": "/15/amendements/2063/AN/293.pdf"
      }
    }
  ],
  "seanceDiscussion": "RUANR5L15S2019IDS21739",
  "sort": {
    "dateSaisie": "2019-06-28T19:41:25.000+02:00",
    "sortEnSeance": "Rejeté"
  },
  "dateDepot": "2019-06-21T02:00:00.000+02:00",
  "dateDistribution": "2019-06-27T02:00:00.000+02:00",
  "article99": "0",
  "loiReference": {}
}