{
  "uid": "AMANR5L15SEA717460B2272P1D1N1299",
  "identifiant": {
    "legislature": "15",
    "numero": "1299",
    "numRect": "0",
    "saisine": {
      "texteLegislatifRef": "PRJLANR5L15B2272",
      "numeroPartiePLF": "1",
      "organeExamen": "PO717460",
      "mentionSecondeDeliberation": "0"
    }
  },
  "numeroLong": "I-1299",
  "etapeTexte": "1ère lecture (1ère assemblée saisie)",
  "triAmendement": "aicaaaaaaaaaaaaaaaaaaaaaaaaaaaaaaaaaaaaaaaaaaaaaaazzzzx",
  "cardinaliteAmdtMultiples": "1",
  "etat": "Discuté",
  "signataires": {
    "auteur": {
      "typeAuteur": "Depute",
      "acteurRef": "PA721474",
      "groupePolitiqueRef": "PO730934"
    },
    "cosignatairesRefs": [
      "PA721474",
      "PA720586",
      "PA267289",
      "PA856"
    ],
    "texteAffichable": "M.&#160;Viry,  M.&#160;Cherpion, M.&#160;Door et M.&#160;Vatin"
  },
  "pointeurFragmentTexte": {
    "division": {
      "titre": "Article 16",
      "articleDesignationCourte": "ART. 16",
      "type": "ARTICLE",
      "avantAApres": "A",
      "divisionRattachee": "ARTICLE 16",
      "urlDivisionTexteVise": "/15/textes/2272A.asp#D_Article_16"
    }
  },
  "corps": {
    "dispositif": "<p>Supprimer cet article.</p>",
    "exposeSommaire": "<p style=\"text-align: justify;\">Le gazole non routier (GNR) est un carburant utilis&#233; en France pour les engins mobiles non routiers, notamment dans les secteurs agricoles, forestiers, fluviaux ou des travaux publics. Il est depuis 2011 obligatoire pour tous les engins mobiles non routiers, plus particuli&#232;rement dans le secteur du B&#226;timent et des Travaux Publics (BTP).</p><p style=\"text-align: justify;\">Lors des d&#233;bats budg&#233;taires pour 2019, le Gouvernement avait d&#233;j&#224; envisag&#233; d&#8217;aligner sur la fiscalit&#233; du gazole des particuliers la fiscalit&#233; du gazole non routier utilis&#233; par les professionnels de l&#8217;agroalimentaire et du BTP. A la suite du mouvement des &#171;&#160;gilets jaunes&#160;&#187; et des fortes inqui&#233;tudes exprim&#233;es par les professionnels du secteur, il avait d&#233;cid&#233; en d&#233;cembre 2018 de suspendre cette suppression l&#8217;avantage fiscal sur le GNR et de mettre en &#339;uvre un moratoire sur la hausse de la fiscalit&#233; des carburants.</p><p style=\"text-align: justify;\">Le Gouvernement avait, &#224; cette &#233;poque, indiqu&#233; que cet alignement ne s&#8217;appliquerait pas &#171;&#160;avant d&#8217;&#234;tre d&#233;battu par toutes les parties prenantes&#160;&#187; le Gouvernement et les professionnels devant se laisser davantage de temps pour &#171;&#160;identifier et mettre en &#339;uvre des mesures d&#8217;accompagnement justes et efficaces&#160;&#187;.</p><p style=\"text-align: justify;\">Or l&#8217;article&#160;16 du projet de loi de finances vise &#224; supprimer progressivement le tarif r&#233;duit de TICPE sur les carburants sous conditions d&#8217;emploi.</p><p style=\"text-align: justify;\">Cette mesure va se traduire pour le BTP - qui doit d&#233;j&#224; faire face &#224; la suppression du pr&#234;t &#224; taux z&#233;ro en milieu rural et &#224; la r&#233;duction du p&#233;rim&#232;tre du Cr&#233;dit d&#8217;imp&#244;t pour la transition &#233;nerg&#233;tique - par une ponction fiscale suppl&#233;mentaire de 1,3 milliards d&#8217;euros.</p><p style=\"text-align: justify;\">Alors que ce secteur &#224; forte intensit&#233; de main d&#8217;&#339;uvre contribue &#224; l&#8217;am&#233;lioration des chiffres du ch&#244;mage, cette mesure risque fortement de casser une dynamique pourtant porteuse pour nos territoires et nos concitoyens.</p><p style=\"text-align: justify;\">C&#8217;est pourquoi le pr&#233;sent amendement vise &#224; supprimer l&#8217;article&#160;16.</p>"
  },
  "representations": [
    {
      "nom": "PDF",
      "typeMime": {
        "type": "application",
        "subType": "PDF"
      },
      "statutRepresentation": {
        "verbatim": true,
        "canonique": true,
        "officielle": true,
        "transcription": false,
        "enregistrement": false
      },
      "contenu": {
        "documentURI": "/15/amendements/2272A/AN/1299.pdf"
      }
    }
  ],
  "seanceDiscussion": "RUANR5L15S2020IDS21861",
  "sort": {
    "dateSaisie": "2019-10-14T23:47:57.000+02:00",
    "sortEnSeance": "Non soutenu"
  },
  "dateDepot": "2019-10-10T02:00:00.000+02:00",
  "dateDistribution": "2019-10-14T02:00:00.000+02:00",
  "article99": "0",
  "loiReference": {}
}