{
  "uid": "AMANR5L15PO59048B0384P0D1N245",
  "identifiant": {
    "legislature": "15",
    "numero": "245",
    "numRect": "0",
    "saisine": {
      "texteLegislatifRef": "PRJLANR5L15B0384",
      "numeroPartiePLF": "0",
      "organeExamen": "PO59048",
      "mentionSecondeDeliberation": "0"
    }
  },
  "numeroLong": "CF245",
  "etapeTexte": "1ère lecture (1ère assemblée saisie)",
  "triAmendement": "eji",
  "cardinaliteAmdtMultiples": "1",
  "etat": "Discuté",
  "signataires": {
    "auteur": {
      "typeAuteur": "Depute",
      "acteurRef": "PA405480",
      "groupePolitiqueRef": "PO730946"
    },
    "cosignatairesRefs": [
      "PA342415",
      "PA610681",
      "PA332614",
      "PA429893",
      "PA608695",
      "PA609590",
      "PA267233",
      "PA405480",
      "PA719930"
    ],
    "texteAffichable": "M.&#160;Pupponi,  Mme&#160;Rabault, Mme&#160;Bareigts, M.&#160;Carvounas, M.&#160;Juanico, M.&#160;Vallaud, Mme&#160;Battistel, M.&#160;Bouillon et Mme&#160;Untermaier"
  },
  "pointeurFragmentTexte": {
    "division": {
      "titre": "Article 28",
      "articleDesignationCourte": "APRÈS ART. 28",
      "type": "ARTICLE",
      "avantAApres": "Apres",
      "divisionRattachee": "APRÈS L'ARTICLE 28, insérer l'article suivant:",
      "articleAdditionnel": "1",
      "urlDivisionTexteVise": "/15/textes/0384.asp#D_Article_28"
    }
  },
  "corps": {
    "dispositif": "<p style=\"text-align: justify;\">I.&#160;&#8211;&#160;Au 13 du I de l&#8217;article&#160;278 <i>sexies</i> du code g&#233;n&#233;ral des imp&#244;ts, les mots&#160;: &#171;&#160;ainsi que les cessions, pr&#233;vues &#224; l&#8217;article&#160;&#187; sont remplac&#233;s par les mots&#160;: &#171;&#160;, les redevances per&#231;ues par l&#8217;organisme de foncier solidaire au titre du bail r&#233;el solidaire, ainsi que les cessions, pr&#233;vues aux articles L.&#160;255&#8209;2 et&#160;&#187;.</p><p style=\"text-align: justify;\">II.&#160;&#8211;&#160;Le I entre en vigueur &#224; compter du 1<sup>er</sup> janvier 2018.</p><p style=\"text-align: justify;\">III.&#160;&#8211;&#160;La perte de recettes pour l&#8217;&#201;tat est compens&#233;e &#224; due concurrence par la cr&#233;ation d&#8217;une taxe additionnelle aux droits mentionn&#233;s aux articles 575 et 575 A du code g&#233;n&#233;ral des imp&#244;ts.</p>",
    "exposeSommaire": "<p style=\"text-align: justify;\">La loi de finances rectificative pour 2016 a soumis les op&#233;rations d&#8217;accession sociale &#224; la propri&#233;t&#233; r&#233;alis&#233;es dans le cadre du bail r&#233;el solidaire (BRS) au taux r&#233;duit de TVA de 5,5&#160;%. On rappelle que ce m&#233;canisme, cr&#233;&#233; en 2016, vise &#224; favoriser des op&#233;rations d&#8217;accession tr&#232;s sociale en instituant une dissociation de la propri&#233;t&#233; du foncier et du b&#226;ti.</p><p style=\"text-align: justify;\">Le 13 du I de l&#8217;article&#160;278 sexies du CGI, tel que vot&#233; en 2016, pr&#233;voit l&#8217;application du taux de 5,5&#160;% selon diff&#233;rentes modalit&#233;s en fonction du montage de ces op&#233;rations, plusieurs sch&#233;mas &#233;tant possibles.</p><p style=\"text-align: justify;\">Toutefois, il s&#8217;av&#232;re que la r&#233;daction du texte, &#233;labor&#233;e avant que ce nouveau dispositif ne devienne op&#233;rationnel, n&#8217;a pas correctement appr&#233;hend&#233; tous les sch&#233;mas et, dans certains cas, des probl&#232;mes de &#171;&#160;frottements fiscaux&#160;&#187; peuvent conduire &#224; supprimer, in fine, le b&#233;n&#233;fice du taux r&#233;duit.</p><p style=\"text-align: justify;\">Le pr&#233;sent amendement a pour objectif de rem&#233;dier &#224; ces frottements dans 2 situations&#160;:</p><p style=\"text-align: justify;\">- Un organisme de foncier solidaire (OFS) acquiert un immeuble b&#226;ti et conclut directement un bail r&#233;el solidaire avec un m&#233;nage. Le texte adopt&#233; en 2016 permet &#224; l&#8217;OFS d&#8217;acqu&#233;rir les logements au taux de 5,5&#160;% mais il omet de pr&#233;ciser qu&#8217;il pourra ensuite revendre aux m&#233;nages les droits sur le b&#226;ti &#224; ce m&#234;me taux</p><p style=\"text-align: justify;\">Un OFS acquiert un terrain. Le texte adopt&#233; en 2016 lui permet d&#8217;acheter ce terrain au taux r&#233;duit. Toutefois, si ce terrain n&#233;cessite des travaux d&#8217;am&#233;nagement importants, l&#8217;OFS supportera une TVA &#224; 20&#160;% sur ces travaux qu&#8217;il r&#233;percutera ensuite sur les m&#233;nages via la redevance per&#231;ue au titre de la mise &#224; disposition du terrain. Pour &#233;viter ce &#171;&#160;frottement&#160;&#187;, il faut permettre &#224; l&#8217;OFS d&#8217;opter &#224; la TVA &#224; taux r&#233;duit sur ces redevances. Cette option est d&#8217;ores et d&#233;j&#224; possible en application du 5&#176; de l&#8217;article&#160;260 mais la loi doit pr&#233;ciser que, en cas d&#8217;option, c&#8217;est bien le taux r&#233;duit qui s&#8217;appliquera et non le taux normal.</p>"
  },
  "representations": [
    {
      "nom": "PDF",
      "typeMime": {
        "type": "application",
        "subType": "PDF"
      },
      "statutRepresentation": {
        "verbatim": true,
        "canonique": true,
        "officielle": true,
        "transcription": false,
        "enregistrement": false
      },
      "contenu": {
        "documentURI": "/15/amendements/0384/CION_FIN/CF245.pdf"
      }
    }
  ],
  "sort": {
    "dateSaisie": "2017-11-29T18:56:38.000+01:00",
    "sortEnSeance": "Rejeté"
  },
  "dateDepot": "2017-11-25T01:00:00.000+01:00",
  "dateDistribution": "2017-11-28T01:00:00.000+01:00",
  "article99": "0",
  "loiReference": {
    "codeLoi": "impôts",
    "divisionCodeLoi": "278 sexies"
  }
}