{
  "uid": "AMANR5L15SEA717460BTC0971P0D1N803",
  "identifiant": {
    "legislature": "15",
    "numero": "803",
    "numRect": "0",
    "saisine": {
      "texteLegislatifRef": "PRJLANR5L15BTC0971",
      "numeroPartiePLF": "0",
      "organeExamen": "PO717460",
      "mentionSecondeDeliberation": "0"
    }
  },
  "numeroLong": "803",
  "etapeTexte": "1ère lecture (1ère assemblée saisie)",
  "triAmendement": "jwo",
  "cardinaliteAmdtMultiples": "1",
  "etat": "Discuté",
  "signataires": {
    "auteur": {
      "typeAuteur": "Depute",
      "acteurRef": "PA721678",
      "groupePolitiqueRef": "PO730934"
    },
    "cosignatairesRefs": [
      "PA334654",
      "PA721636",
      "PA267794",
      "PA712015",
      "PA767",
      "PA345722",
      "PA721474",
      "PA608016",
      "PA1695",
      "PA2377",
      "PA2796",
      "PA719318",
      "PA721678",
      "PA721506",
      "PA346218",
      "PA330684",
      "PA719272",
      "PA605036",
      "PA340853",
      "PA342935",
      "PA722390",
      "PA607090",
      "PA643103",
      "PA720630",
      "PA2492",
      "PA330240",
      "PA1874",
      "PA608826",
      "PA608416",
      "PA334149",
      "PA605991",
      "PA330788",
      "PA346054",
      "PA721314",
      "PA267378",
      "PA720100",
      "PA923",
      "PA267200",
      "PA718850",
      "PA606712",
      "PA332523",
      "PA266808",
      "PA721410",
      "PA718780",
      "PA718884",
      "PA267289",
      "PA267429",
      "PA267260",
      "PA609726",
      "PA721046",
      "PA856",
      "PA720586",
      "PA1498",
      "PA2792",
      "PA330909",
      "PA2086",
      "PA267450",
      "PA1029",
      "PA720210",
      "PA223837",
      "PA606098",
      "PA334843",
      "PA267318",
      "PA609245",
      "PA2960",
      "PA1327",
      "PA267440",
      "PA720644",
      "PA266774",
      "PA718784",
      "PA2155",
      "PA266793",
      "PA721054",
      "PA746",
      "PA713448",
      "PA336316",
      "PA267324",
      "PA267527",
      "PA266797",
      "PA267204",
      "PA2529",
      "PA718838",
      "PA721070",
      "PA720684",
      "PA643134",
      "PA330008",
      "PA748954",
      "PA721126",
      "PA267901",
      "PA1630",
      "PA1012",
      "PA720386",
      "PA721286",
      "PA642847",
      "PA721816",
      "PA709315",
      "PA998",
      "PA721968",
      "PA719946",
      "PA267785",
      "PA267735",
      "PA266776"
    ],
    "texteAffichable": "M.&#160;Reda,  M.&#160;Jacob, M.&#160;Bazin, M.&#160;Saddier, M.&#160;Abad, Mme&#160;Anthoine, M.&#160;Aubert, Mme&#160;Bassire, Mme&#160;Bazin-Malgras, Mme&#160;Beauvais, Mme&#160;Bonnivard, M.&#160;Bony, M.&#160;Boucard, M.&#160;Bouchet, Mme&#160;Val&#233;rie&#160;Boyer, Mme&#160;Brenier, M.&#160;Breton, M.&#160;Brochand, M.&#160;Brun, M.&#160;Carrez, M.&#160;Cattin, M.&#160;Cherpion, M.&#160;Cinieri, M.&#160;Ciotti, M.&#160;Cordier, Mme&#160;Corneloup, M.&#160;Cornut-Gentille, Mme&#160;Dalloz, M.&#160;Dassault, M.&#160;de Ganay, M.&#160;de la Verpilli&#232;re, M.&#160;Deflesselles, M.&#160;R&#233;mi&#160;Delatte, M.&#160;Descoeur, M.&#160;Di Filippo, M.&#160;Diard, M.&#160;Dive, M.&#160;Door, Mme&#160;Marianne&#160;Dubois, Mme&#160;Duby-Muller, M.&#160;Pierre-Henri&#160;Dumont, M.&#160;Fasquelle, M.&#160;Ferrara, M.&#160;Forissier, M.&#160;Furst, M.&#160;Gaultier, Mme&#160;Genevard, M.&#160;Goasguen, M.&#160;Gosselin, M.&#160;Grelier, Mme&#160;Guion-Firmin, M.&#160;Herbillon, M.&#160;Hetzel, M.&#160;Huyghe, M.&#160;Kamardine, Mme&#160;Kuster, Mme&#160;Lacroute, M.&#160;Larriv&#233;, M.&#160;Le Fur, Mme&#160;Le Grip, M.&#160;Leclerc, Mme&#160;Levy, M.&#160;Lorion, Mme&#160;Louwagie, M.&#160;Lurton, M.&#160;Emmanuel&#160;Maquet, M.&#160;Marleix, M.&#160;Marlin, M.&#160;Masson, M.&#160;Menuel, Mme&#160;Meunier, M.&#160;Minot, M.&#160;Nury, M.&#160;Parigi, M.&#160;Pauget, M.&#160;Peltier, M.&#160;Perrut, Mme&#160;Poletti, M.&#160;Pradi&#233;, M.&#160;Quentin, M.&#160;Ramadier, Mme&#160;Ramassamy, M.&#160;Reiss, M.&#160;Reitzer, M.&#160;Reyn&#232;s, M.&#160;Rolland, M.&#160;Savignat, M.&#160;Schellenberger, M.&#160;Sermier, M.&#160;Straumann, Mme&#160;Tabarot, M.&#160;Taugourdeau, M.&#160;Teissier, Mme&#160;Trastour-Isnart, Mme&#160;Valentin, M.&#160;Vatin, M.&#160;Verch&#232;re, M.&#160;Viala, M.&#160;Vialay, M.&#160;Jean-Pierre&#160;Vigier, M.&#160;Viry et M.&#160;Woerth"
  },
  "pointeurFragmentTexte": {
    "division": {
      "titre": "Article 56 quinquies",
      "articleDesignationCourte": "APRÈS ART. 56 QUINQUIES",
      "type": "ARTICLE",
      "avantAApres": "Apres",
      "divisionRattachee": "APRÈS L'ARTICLE 56 QUINQUIES, insérer l'article suivant:",
      "articleAdditionnel": "1",
      "urlDivisionTexteVise": "/15/textes/0971.asp#D_Article_56_quinquies"
    }
  },
  "corps": {
    "dispositif": "<p style=\"text-align: justify;\">Le code p&#233;nal est ainsi modifi&#233;&#160;:</p><p style=\"text-align: justify;\">1&#176; Apr&#232;s l&#8217;article&#160;225&#8209;14&#8209;2 du code p&#233;nal, il est ins&#233;r&#233; un article&#160;225&#8209;14&#8209;3 ainsi r&#233;dig&#233;&#160;:</p><p style=\"text-align: justify;\">&#171;&#160;<i>Art.&#160;225&#8209;14&#8209;3.&#160;&#8211;&#160;</i>Est qualifi&#233; de marchand de sommeil quiconque abuse soit directement, soit par un interm&#233;diaire de la situation de vuln&#233;rabilit&#233; ou de l&#8217;&#233;tat de d&#233;pendance, apparents ou connus, dans lesquels se trouve une personne en vendant, louant ou mettant &#224; disposition, dans l&#8217;intention de r&#233;aliser un profit anormal, un bien meuble, une partie de celui-ci, un bien immeuble, une chambre ou un autre espace d&#8217;h&#233;bergement dans les conditions mentionn&#233;es &#224; l&#8217;article&#160;225&#8209;14. Cet abus est puni de sept ans d&#8217;emprisonnement et 200&#160;000&#160;&#8364; d&#8217;amende.</p><p style=\"text-align: justify;\">&#171;&#160;Les personnes physiques ou morales d&#233;clar&#233;es coupables de l&#8217;infraction pr&#233;vue au premier alin&#233;a du pr&#233;sent article encourent &#233;galement la peine compl&#233;mentaire de confiscation pr&#233;vue &#224; l&#8217;article&#160;131&#8209;21.&#160;&#187;&#160;;</p><p style=\"text-align: justify;\">2&#176; Apr&#232;s l&#8217;article&#160;225&#8209;19 du code p&#233;nal, il est ins&#233;r&#233; un article&#160;225&#8209;19&#8209;1 ainsi r&#233;dig&#233;&#160;:</p><p style=\"text-align: justify;\">&#171;&#160;<i>Art.&#160;225&#8209;19&#8209;1.&#160;-&#160;</i>En cas de r&#233;cidive, les personnes qualifi&#233;es de marchands de sommeil en application de l&#8217;article&#160;225&#8209;14&#8209;3 et d&#233;clar&#233;es coupables des infractions pr&#233;vues aux articles 225&#8209;13 &#224; 225&#8209;14&#8209;2 ont l&#8217;interdiction syst&#233;matique d&#8217;acheter pour une dur&#233;e de dix ans soit &#224; titre personnel, soit en tant qu&#8217;associ&#233; ou mandataire social de la soci&#233;t&#233; civile immobili&#232;re ou en nom collectif se portant acqu&#233;reur, soit sous forme de parts immobili&#232;res, un bien immobilier &#224; usage d&#8217;habitation &#224; d&#8217;autres fins que son occupation &#224; titre personnel ou un fonds de commerce d&#8217;un &#233;tablissement recevant du public &#224; usage total ou partiel d&#8217;h&#233;bergement.&#160;&#187;</p>",
    "exposeSommaire": "<p style=\"text-align: justify;\">Cet amendement propose de rendre syst&#233;matique l&#8217;interdiction pour les marchands de sommeil en situation de r&#233;cidive d&#8217;acheter un bien immobilier &#224; titre personnel, en tant que g&#233;rant d&#8217;une SCI ou de toutes autres mani&#232;res, pendant une dur&#233;e de 10 ans, &#224; d&#8217;autres fins que pour son occupation &#224; titre personnel.</p><p style=\"text-align: justify;\">&#160;</p>"
  },
  "representations": [
    {
      "nom": "PDF",
      "typeMime": {
        "type": "application",
        "subType": "PDF"
      },
      "statutRepresentation": {
        "verbatim": true,
        "canonique": true,
        "officielle": true,
        "transcription": false,
        "enregistrement": false
      },
      "contenu": {
        "documentURI": "/15/amendements/0971/AN/803.pdf"
      }
    }
  ],
  "seanceDiscussion": "RUANR5L15S2018IDS21139",
  "sort": {
    "dateSaisie": "2018-06-08T22:24:55.000+02:00",
    "sortEnSeance": "Rejeté"
  },
  "dateDepot": "2018-05-24T02:00:00.000+02:00",
  "dateDistribution": "2018-06-01T02:00:00.000+02:00",
  "article99": "0",
  "loiReference": {
    "codeLoi": "c pénal",
    "divisionCodeLoi": "225-19-1"
  }
}