{
  "uid": "AMANR5L15PO59048B2272P2D1N425",
  "identifiant": {
    "legislature": "15",
    "numero": "425",
    "numRect": "0",
    "saisine": {
      "texteLegislatifRef": "PRJLANR5L15B2272",
      "numeroPartiePLF": "2",
      "organeExamen": "PO59048",
      "mentionSecondeDeliberation": "0"
    }
  },
  "numeroLong": "II-CF425",
  "etapeTexte": "1ère lecture (1ère assemblée saisie)",
  "triAmendement": "bbfaaaaaaaaaaaaaaaaaaaaaaaaaaaaaaaaaaaaaaaaaaaaaaaw",
  "cardinaliteAmdtMultiples": "1",
  "etat": "Discuté",
  "signataires": {
    "auteur": {
      "typeAuteur": "Depute",
      "acteurRef": "PA721094",
      "groupePolitiqueRef": "PO767217"
    },
    "cosignatairesRefs": [
      "PA610775",
      "PA721094"
    ],
    "texteAffichable": "M.&#160;Dunoyer et M.&#160;Gom&#232;s"
  },
  "pointeurFragmentTexte": {
    "missionVisee": {
      "idMissionAN": "819",
      "libelleMission": "Outre-mer",
      "codeMissionPLF": "B",
      "libelleMissionPLF": "Répartition, par mission et programme, des crédits du budget général"
    },
    "division": {
      "titre": "ÉTAT B",
      "articleDesignationCourte": "ART. 38",
      "type": "ANNEXE",
      "avantAApres": "A",
      "divisionRattachee": "ARTICLE 38",
      "urlDivisionTexteVise": "/15/textes/2272C.asp#D_ETAT_B"
    }
  },
  "corps": {
    "exposeSommaire": "<p style=\"text-align: justify;\">Le pr&#233;sent amendement propose le transfert de cr&#233;dits de 2,8 millions d&#8217;euros, de l&#8217;action 1 &#171;&#160;soutien aux entreprises&#160;&#187; du programme 138 &#171;&#160;Emploi outre-mer&#160;&#187; vers l&#8217;action 3 &#171;&#160;continuit&#233; territoriale&#160;&#187; du programme 123 &#171;&#160;conditions de vie outre-mer&#160;&#187;, afin de financer l&#8217;extension de l&#8217;aide &#224; la continuit&#233; territoriale pour les liaisons inter-iles de l&#8217;archipel, ainsi que pour les liaisons r&#233;gionales, notamment celles entre la Nouvelle Cal&#233;donie et Wallis et Futuna.</p><p style=\"text-align: justify;\">En effet, la loi ouvre la possibilit&#233; d&#8217;&#233;tendre le b&#233;n&#233;fice de l&#8217;aide &#224; la continuit&#233; territoriale, pour le liaisons internes, en raison des particularit&#233;s g&#233;ographiques qui participent &#224; l&#8217;enclavement de territoires. Cette possibilit&#233;, ouverte pour la Guyane, doit pouvoir &#234;tre &#233;tendue pour les liaisons entre les iles de l&#8217;archipel cal&#233;donien, comme en b&#233;n&#233;ficie d&#8217;ailleurs le territoire de Wallis et Futuna.</p><p style=\"text-align: justify;\">L&#8217;aide &#224; la continuit&#233; territoriale doit &#233;galement pouvoir &#234;tre &#233;tendue aux relations entre l&#8217;archipel et les collectivit&#233;s du Pacifique avec qui elle entretient des &#233;changes nombreux, comme les iles Wallis et Futuna, mais aussi l&#8217;Australie.</p><p style=\"text-align: justify;\">&#160;De que la liaison entre&#160;Saint-Pierre et Halifax (Canada) b&#233;n&#233;ficie d&#8217;un financement public au titre de la continuit&#233; territoriale, il semble indispensable d&#8217;ouvrir, par l&#8217;abondement de cr&#233;dits,&#160;la voie &#224; une prise en charge au titre de l&#8217;aide &#224; la continuit&#233; territoriale pour les liaisons r&#233;gionales de proximit&#233;.</p>",
    "dispositifAmdtCredit": {
      "listeProgrammes": [
        {
          "libelle": "Emploi outre-mer",
          "id": "76568",
          "AE": {
            "montantPositif": "0",
            "montantNegatif": "2800000"
          },
          "CP": {
            "montantPositif": "0",
            "montantNegatif": "2800000"
          },
          "action": "modification"
        },
        {
          "libelle": "Conditions de vie outre-mer",
          "id": "76569",
          "AE": {
            "montantPositif": "2800000",
            "montantNegatif": "0"
          },
          "CP": {
            "montantPositif": "2800000",
            "montantNegatif": "0"
          },
          "action": "modification"
        }
      ],
      "totalAE": {
        "montantPositif": "2800000",
        "montantNegatif": "2800000",
        "solde": "0"
      },
      "totalCP": {
        "montantPositif": "2800000",
        "montantNegatif": "2800000",
        "solde": "0"
      }
    }
  },
  "representations": [
    {
      "nom": "PDF",
      "typeMime": {
        "type": "application",
        "subType": "PDF"
      },
      "statutRepresentation": {
        "verbatim": true,
        "canonique": true,
        "officielle": true,
        "transcription": false,
        "enregistrement": false
      },
      "contenu": {
        "documentURI": "/15/amendements/2272C/CION_FIN/CF425.pdf"
      }
    }
  ],
  "sort": {
    "dateSaisie": "2019-10-24T15:17:32.000+02:00",
    "sortEnSeance": "Non soutenu"
  },
  "dateDepot": "2019-10-18T02:00:00.000+02:00",
  "dateDistribution": "2019-10-24T02:00:00.000+02:00",
  "article99": "0",
  "loiReference": {}
}