{
  "uid": "AMANR5L15PO59046B0659P0D1N268",
  "identifiant": {
    "legislature": "15",
    "numero": "268",
    "numRect": "0",
    "saisine": {
      "texteLegislatifRef": "PRJLANR5L15B0659",
      "numeroPartiePLF": "0",
      "organeExamen": "PO59046",
      "mentionSecondeDeliberation": "0"
    }
  },
  "numeroLong": "DN268",
  "etapeTexte": "1ère lecture (1ère assemblée saisie)",
  "triAmendement": "baxs",
  "cardinaliteAmdtMultiples": "1",
  "etat": "Discuté",
  "signataires": {
    "auteur": {
      "typeAuteur": "Depute",
      "acteurRef": "PA608416",
      "groupePolitiqueRef": "PO730934"
    },
    "cosignatairesRefs": [
      "PA608416",
      "PA642847"
    ],
    "texteAffichable": "M.&#160;Hetzel et M.&#160;Bazin"
  },
  "pointeurFragmentTexte": {
    "division": {
      "titre": "RAPPORT ANNEXÉ",
      "articleDesignationCourte": "ART. 2",
      "type": "ANNEXE",
      "avantAApres": "A",
      "divisionRattachee": "ARTICLE 2",
      "urlDivisionTexteVise": "/15/textes/0659.asp#D_RAPPORT_ANNEXe"
    },
    "alinea": {
      "avantAApres": "Apres",
      "numero": "39"
    }
  },
  "corps": {
    "dispositif": "<p style=\"text-align: justify;\">Apr&#232;s l&#8217;alin&#233;a&#160;39, ins&#233;rer l&#8217;alin&#233;a suivant&#160;: &#171;&#160;La France conditionne la conclusion d&#8217;accords de d&#233;fense &#224; l&#8217;arr&#234;t du financement souverain du terrorisme international&#160;&#187;.</p>",
    "exposeSommaire": "<p>Cet amendement vise &#224; conditionner les accords de d&#233;fense de la France, ou les projets d&#8217;accords de d&#233;fense, &#224; l&#8217;arr&#234;t du financement souverain des r&#233;seaux islamistes radicaux.</p>"
  },
  "representations": [
    {
      "nom": "PDF",
      "typeMime": {
        "type": "application",
        "subType": "PDF"
      },
      "statutRepresentation": {
        "verbatim": true,
        "canonique": true,
        "officielle": true,
        "transcription": false,
        "enregistrement": false
      },
      "contenu": {
        "documentURI": "/15/amendements/0659/CION_DEF/DN268.pdf"
      }
    }
  ],
  "sort": {
    "dateSaisie": "2018-03-13T19:37:36.000+01:00",
    "sortEnSeance": "Rejeté"
  },
  "dateDepot": "2018-03-09T01:00:00.000+01:00",
  "dateDistribution": "2018-03-12T01:00:00.000+01:00",
  "article99": "0",
  "loiReference": {}
}