{
  "uid": "AMANR5L15SEA717460B2200P0D1N24",
  "identifiant": {
    "legislature": "15",
    "numero": "24",
    "numRect": "0",
    "saisine": {
      "texteLegislatifRef": "PIONANR5L15B2200",
      "numeroPartiePLF": "0",
      "organeExamen": "PO717460",
      "mentionSecondeDeliberation": "0"
    }
  },
  "numeroLong": "24",
  "etapeTexte": "1ère lecture (1ère assemblée saisie)",
  "triAmendement": "laaaaaaaaaaaaaaaaaaaaaaaaaaaaaaaaaaaaaaaaaaaaaaaaab",
  "cardinaliteAmdtMultiples": "1",
  "etat": "A discuter",
  "signataires": {
    "auteur": {
      "typeAuteur": "Depute",
      "acteurRef": "PA719608",
      "groupePolitiqueRef": "PO723569"
    },
    "cosignatairesRefs": [
      "PA719608"
    ],
    "texteAffichable": "Mme&#160;M&#233;nard"
  },
  "pointeurFragmentTexte": {
    "division": {
      "titre": "Article 4",
      "articleDesignationCourte": "APRÈS ART. 4",
      "type": "ARTICLE",
      "avantAApres": "Apres",
      "divisionRattachee": "APRÈS L'ARTICLE 4, insérer l'article suivant:",
      "articleAdditionnel": "1",
      "urlDivisionTexteVise": "/15/textes/2200.asp#D_Article_4"
    }
  },
  "corps": {
    "dispositif": "<p style=\"text-align: justify;\">Au plus tard un an apr&#232;s la promulgation de la loi, le Gouvernement remet au Parlement un rapport dressant un &#233;tat des lieux des dispositifs en vigueur qui condamnent les violences au sein des couples et les incidences sur les enfants afin de proposer des solutions pour les am&#233;liorer. </p>",
    "exposeSommaire": "<p style=\"text-align: justify;\">Les dispositifs condamnant les violences au sein des couples, avec les incidences qu'elles ont sur les enfants, doivent &#234;tre am&#233;lior&#233;s.</p><p>En 2018, &#171; 21 enfants (sont morts) &#224; la suite de violences conjugales, dont 5 ont trouv&#233; la mort en m&#234;me temps que l'un de leurs parents &#187;.</p><p>Pour que cette situation ne se reproduise pas, il faut &#233;tablir un rapport pour conna&#238;tre l'effectivit&#233; de notre corpus l&#233;gislatif et ses lacunes.</p>"
  },
  "representations": [
    {
      "nom": "PDF",
      "typeMime": {
        "type": "application",
        "subType": "PDF"
      },
      "statutRepresentation": {
        "verbatim": true,
        "canonique": true,
        "officielle": true,
        "transcription": false,
        "enregistrement": false
      },
      "contenu": {
        "documentURI": "/15/amendements/2200/AN/24.pdf"
      }
    }
  ],
  "dateDepot": "2019-10-07T02:00:00.000+02:00",
  "dateDistribution": "2019-10-08T02:00:00.000+02:00",
  "article99": "0",
  "loiReference": {}
}