{
  "uid": "AMANR5L15PO59047B0714P0D1N10",
  "identifiant": {
    "legislature": "15",
    "numero": "10",
    "numRect": "0",
    "saisine": {
      "texteLegislatifRef": "PRJLANR5L15B0714",
      "numeroPartiePLF": "0",
      "organeExamen": "PO59047",
      "mentionSecondeDeliberation": "0"
    }
  },
  "numeroLong": "AE10",
  "etapeTexte": "1ère lecture (1ère assemblée saisie)",
  "triAmendement": "u",
  "cardinaliteAmdtMultiples": "1",
  "etat": "Discuté",
  "signataires": {
    "auteur": {
      "typeAuteur": "Depute",
      "acteurRef": "PA588884",
      "groupePolitiqueRef": "PO730958"
    },
    "cosignatairesRefs": [
      "PA718868",
      "PA720422",
      "PA2150",
      "PA719578",
      "PA721960",
      "PA720430",
      "PA720286",
      "PA588884",
      "PA720892",
      "PA722142",
      "PA720846",
      "PA721226",
      "PA721210",
      "PA721202",
      "PA719676",
      "PA718860",
      "PA721062"
    ],
    "texteAffichable": "Mme&#160;Autain,  M.&#160;Bernalicis, M.&#160;Coquerel, M.&#160;Ratenon, Mme&#160;Ressiguier, Mme&#160;Rubin, M.&#160;Ruffin, Mme&#160;Taurine, M.&#160;Corbi&#232;re, Mme&#160;Fiat, M.&#160;Lachaud, M.&#160;Larive, M.&#160;M&#233;lenchon, Mme&#160;Obono, Mme&#160;Panot, M.&#160;Prud&apos;homme et M.&#160;Quatennens"
  },
  "pointeurFragmentTexte": {
    "division": {
      "titre": "Article 32",
      "articleDesignationCourte": "ART. 32",
      "type": "ARTICLE",
      "avantAApres": "A",
      "divisionRattachee": "ARTICLE 32",
      "urlDivisionTexteVise": "/15/textes/0714.asp#D_Article_32"
    },
    "alinea": {
      "avantAApres": "Apres",
      "numero": "4"
    }
  },
  "corps": {
    "dispositif": "<p style=\"text-align: justify;\">Compl&#233;ter l&#8217;article par les alin&#233;as suivants&#160;:</p><p style=\"text-align: justify;\">a) Au premier alin&#233;a de l&#8217;article L. 316-1, apr&#232;s les mots &#171;&#160;225-10 du code p&#233;nal&#160;&#187;, sont ins&#233;r&#233;s les mots &#171;&#160;, ainsi que toutes autres infractions p&#233;nales &#224; la condition que le d&#233;p&#244;t de plainte ou le t&#233;moignage eux-m&#234;mes aient pour effet direct ou indirect de porter pr&#233;judice droit au s&#233;jour de l&#8217;int&#233;ress&#233; ou &#224; son activit&#233; professionnelle&#160;&#187;</p>",
    "exposeSommaire": "<p>Par cet amendement de repli, nous proposons ainsi de garantir les droits et libert&#233;s des personnes qui s&#8217;estiment victimes d&#8217;infractions p&#233;nales relevant du code du travail et qui sont t&#233;moins dans de telles proc&#233;dures pouvant aboutir &#224; la condamnation des contrevenants, ce en &#233;largissant la protection de ceux d&#233;non&#231;ant des infractions p&#233;nales, alors que le droit actuel ne permet cette protection que pour les victimes et t&#233;moins d&#8217;infractions p&#233;nales relatives &#224; la traite des &#234;tres humains, le prox&#233;n&#233;tisme, et les victimes de violences conjugales&#160;</p><p>En effet, en l&#8217;&#233;tat du droit, l&#8217;acc&#232;s &#224; un titre de s&#233;jour temporaire ou son renouvellement n&#8217;est seulement automatiquement garanti que pour les personnes victimes de traite des &#234;tres humains ou prox&#233;n&#233;tisme (article L. 31-6 du CESEDA qui ne fait r&#233;f&#233;rence qu&#8217;aux articles 225-4-1 &#224; 225-4-6 et 225-5 &#224; 225-10 du code p&#233;nal), de violences conjugales et de mariage forc&#233; (article L. 316-3 du CESEDA), ou t&#233;moignant dans de telles proc&#233;dures.</p><p>Nous estimons que cette protection doit &#234;tre &#233;tendue aux personnes engag&#233;es dans une proc&#233;dure p&#233;nale pour toutes infractions particuli&#232;rement graves (car relevant du p&#233;nal). En effet, le respect de l&#8217;ordre public p&#233;nal et la recherche et l'identification des auteurs d'infractions p&#233;nales constitue de plus un objectif &#224; valeur constitutionnelle. A ce titre, nous estimons que ceux qui aident &#224; la lutte contre les auteurs d&#8217;infractions p&#233;nales et qui t&#233;moignent dans de telles proc&#233;dures doivent &#234;tre prot&#233;g&#233;s quand ce d&#233;p&#244;t de plainte ou t&#233;moignage pourrait porter pr&#233;judice droit au s&#233;jour de l&#8217;int&#233;ress&#233; ou &#224; son activit&#233; professionnelle (ce qui permet d&#8217;&#233;viter d&#8217;&#233;ventuelles utilisations abusives de ces dispositions).</p><p>Par cet amendement de bon sens, nous proposons donc d&#8217;aider au mieux &#224; la lutte contre les auteurs d'infractions p&#233;nales, &#224; en prot&#233;ger les victimes et les t&#233;moins qui peuvent aider &#224; la condamnation de leurs auteurs.</p>"
  },
  "representations": [
    {
      "nom": "PDF",
      "typeMime": {
        "type": "application",
        "subType": "PDF"
      },
      "statutRepresentation": {
        "verbatim": true,
        "canonique": true,
        "officielle": true,
        "transcription": false,
        "enregistrement": false
      },
      "contenu": {
        "documentURI": "/15/amendements/0714/CION_AFETR/AE10.pdf"
      }
    }
  ],
  "sort": {
    "sortEnSeance": "Non soutenu"
  },
  "dateDepot": "2018-03-23T01:00:00.000+01:00",
  "dateDistribution": "2018-03-27T02:00:00.000+02:00",
  "article99": "0",
  "loiReference": {}
}