{
  "uid": "AMANR5L15SEA717460BTC0259P0D1N79",
  "identifiant": {
    "legislature": "15",
    "numero": "79",
    "numRect": "0",
    "saisine": {
      "texteLegislatifRef": "PNREANR5L15BTC0259",
      "numeroPartiePLF": "0",
      "organeExamen": "PO717460",
      "mentionSecondeDeliberation": "0"
    }
  },
  "numeroLong": "79",
  "etapeTexte": "Lecture unique",
  "triAmendement": "bx",
  "cardinaliteAmdtMultiples": "1",
  "etat": "Discuté",
  "signataires": {
    "auteur": {
      "typeAuteur": "Depute",
      "acteurRef": "PA719146",
      "groupePolitiqueRef": "PO723569"
    },
    "cosignatairesRefs": [
      "PA719138",
      "PA719286",
      "PA1838",
      "PA719146"
    ],
    "texteAffichable": "M.&#160;Acquaviva,  M.&#160;Castellani, M.&#160;Colombani et M.&#160;Lassalle"
  },
  "pointeurFragmentTexte": {
    "division": {
      "titre": "Article unique",
      "articleDesignationCourte": "ART. UNIQUE",
      "type": "ARTICLE",
      "avantAApres": "A",
      "divisionRattachee": "ARTICLE UNIQUE",
      "urlDivisionTexteVise": "/15/textes/0259.asp#D_Article_unique"
    },
    "alinea": {
      "numero": "3"
    }
  },
  "corps": {
    "dispositif": "<p style=\"text-align: justify;\">I.&#160;&#8211;&#160;&#192; l&#8217;alin&#233;a&#160;3, apr&#232;s la premi&#232;re occurrence du mot&#160;:</p><p style=\"text-align: justify;\">&#171;&#160;groupes&#160;&#187;,</p><p style=\"text-align: justify;\">ins&#233;rer les mots&#160;:</p><p style=\"text-align: justify;\">&#171;&#160;ainsi qu&#8217;un d&#233;put&#233; repr&#233;sentant les d&#233;put&#233;s non-inscrits, &#233;lu par les d&#233;put&#233;s n&#8217;appartenant &#224; aucun groupe&#160;&#187;.</p><p style=\"text-align: justify;\">II.&#160;&#8211;&#160;En cons&#233;quence, compl&#233;ter le m&#234;me alin&#233;a par la phrase suivante&#160;:</p><p style=\"text-align: justify;\">&#171;&#160;En cas de partage &#233;gal des voix pour l&#8217;&#233;lection du repr&#233;sentant des d&#233;put&#233;s non-inscrits, le plus &#226;g&#233; des candidats l&#8217;emporte&#160;&#187;.</p>",
    "exposeSommaire": "<p style=\"text-align: justify;\">Il est contraire &#224; l&#8217;esprit des institutions d&#8217;op&#233;rer une diff&#233;renciation de traitement entre les d&#233;put&#233;s appartenant &#224; un groupe parlementaire et les &#171;&#160;non-inscrits&#160;&#187;. Il convient d&#8217;assurer une repr&#233;sentation de l&#8217;ensemble des d&#233;put&#233;s au sein des diff&#233;rentes instances. Cet amendement vise &#224; assurer cette repr&#233;sentation.</p>"
  },
  "representations": [
    {
      "nom": "PDF",
      "typeMime": {
        "type": "application",
        "subType": "PDF"
      },
      "statutRepresentation": {
        "verbatim": true,
        "canonique": true,
        "officielle": true,
        "transcription": false,
        "enregistrement": false
      },
      "contenu": {
        "documentURI": "/15/amendements/0259/AN/79.pdf"
      }
    }
  ],
  "seanceDiscussion": "RUANR5L15S2018IDS20685",
  "sort": {
    "dateSaisie": "2017-10-11T00:00:37.000+02:00",
    "sortEnSeance": "Non soutenu"
  },
  "dateDepot": "2017-10-06T02:00:00.000+02:00",
  "dateDistribution": "2017-10-09T02:00:00.000+02:00",
  "article99": "0",
  "loiReference": {}
}