{
  "uid": "AMANR5L15SEA717460BTC0902P0D1N1454",
  "identifiant": {
    "legislature": "15",
    "numero": "1454",
    "numRect": "0",
    "saisine": {
      "texteLegislatifRef": "PRJLANR5L15BTC0902",
      "numeroPartiePLF": "0",
      "organeExamen": "PO717460",
      "mentionSecondeDeliberation": "0"
    }
  },
  "numeroLong": "1454",
  "etapeTexte": "1ère lecture (1ère assemblée saisie)",
  "triAmendement": "coarzi",
  "cardinaliteAmdtMultiples": "1",
  "etat": "Discuté",
  "signataires": {
    "auteur": {
      "typeAuteur": "Depute",
      "acteurRef": "PA332228",
      "groupePolitiqueRef": "PO744425"
    },
    "cosignatairesRefs": [
      "PA333421",
      "PA331582",
      "PA421348",
      "PA266788",
      "PA267330",
      "PA267355",
      "PA335758",
      "PA942",
      "PA267780",
      "PA267585",
      "PA1960",
      "PA642868",
      "PA721486",
      "PA267241",
      "PA719806",
      "PA720696",
      "PA712014",
      "PA720230",
      "PA331567",
      "PA267766",
      "PA268019",
      "PA721110",
      "PA332228",
      "PA267042"
    ],
    "texteAffichable": "M.&#160;Benoit,  Mme&#160;Auconie, M.&#160;Guy&#160;Bricout, M.&#160;Christophe, M.&#160;Charles&#160;de Courson, Mme&#160;de La Raudi&#232;re, M.&#160;Demilly, Mme&#160;Descamps, M.&#160;Favennec Becot, Mme&#160;Firmin Le Bodo, M.&#160;Herth, M.&#160;Lagarde, M.&#160;Ledoux, M.&#160;Leroy, Mme&#160;Magnier, M.&#160;Morel-&#192;-L&apos;Huissier, M.&#160;Naegelen, M.&#160;Pancher, M.&#160;Riester, Mme&#160;Sanquer, M.&#160;Vercamer, M.&#160;Philippe&#160;Vigier, M.&#160;Villiers et M.&#160;Zumkeller"
  },
  "pointeurFragmentTexte": {
    "division": {
      "titre": "Article PREMIER",
      "articleDesignationCourte": "ART. PREMIER",
      "type": "ARTICLE",
      "avantAApres": "A",
      "divisionRattachee": "ARTICLE PREMIER",
      "urlDivisionTexteVise": "/15/textes/0902.asp#D_Article_1er"
    },
    "alinea": {
      "avantAApres": "Apres",
      "numero": "28"
    }
  },
  "corps": {
    "dispositif": "<p style=\"text-align: justify;\">Apr&#232;s l&#8217;alin&#233;a&#160;28, ins&#233;rer l&#8217;alin&#233;a suivant&#160;:</p><p style=\"text-align: justify;\">&#171;&#160;VI. &#8211; Les contrats conclus entre producteurs et acheteurs portant sur l&#8217;achat de lait ne peuvent exiger que le producteur dispose d&#8217;un outil de stockage par acheteur.&#160;&#187;</p>",
    "exposeSommaire": "<p style=\"text-align: justify;\">Amendement de pr&#233;cision</p><p style=\"text-align: justify;\">L&#8217;objectif de cet amendement est de ne laisser aucune place &#224; l&#8217;&#233;quivoque dans le cas particulier des producteurs de lait.</p>"
  },
  "representations": [
    {
      "nom": "PDF",
      "typeMime": {
        "type": "application",
        "subType": "PDF"
      },
      "statutRepresentation": {
        "verbatim": true,
        "canonique": true,
        "officielle": true,
        "transcription": false,
        "enregistrement": false
      },
      "contenu": {
        "documentURI": "/15/amendements/0902/AN/1454.pdf"
      }
    }
  ],
  "seanceDiscussion": "RUANR5L15S2018IDS21050",
  "sort": {
    "dateSaisie": "2018-05-23T23:57:24.000+02:00",
    "sortEnSeance": "Rejeté"
  },
  "dateDepot": "2018-05-17T02:00:00.000+02:00",
  "dateDistribution": "2018-05-18T02:00:00.000+02:00",
  "article99": "0",
  "loiReference": {}
}