{
  "uid": "AMANR5L15SEA717460BTC1019P0D1N1165",
  "identifiant": {
    "legislature": "15",
    "numero": "1165",
    "numRect": "0",
    "saisine": {
      "texteLegislatifRef": "PRJLANR5L15BTC1019",
      "numeroPartiePLF": "0",
      "organeExamen": "PO717460",
      "mentionSecondeDeliberation": "1"
    }
  },
  "numeroLong": "1165",
  "etapeTexte": "1ère lecture (1ère assemblée saisie)",
  "triAmendement": "awai",
  "cardinaliteAmdtMultiples": "1",
  "etat": "Discuté",
  "signataires": {
    "auteur": {
      "typeAuteur": "Depute",
      "acteurRef": "PA721924",
      "groupePolitiqueRef": "PO730970"
    },
    "cosignatairesRefs": [
      "PA719558",
      "PA1276",
      "PA721608",
      "PA720728",
      "PA721734",
      "PA721530",
      "PA719488",
      "PA719044",
      "PA721984",
      "PA720772",
      "PA722374",
      "PA720092",
      "PA720326",
      "PA719918",
      "PA720652",
      "PA721924",
      "PA717151",
      "PA720178",
      "PA720256",
      "PA720720",
      "PA722284",
      "PA719504",
      "PA719640",
      "PA721836",
      "PA719266",
      "PA720968",
      "PA720334",
      "PA720746",
      "PA720704",
      "PA720162",
      "PA721234",
      "PA722162",
      "PA718978",
      "PA720002",
      "PA719938",
      "PA610733",
      "PA719874",
      "PA721742",
      "PA720976",
      "PA721992",
      "PA721418",
      "PA720924",
      "PA721182",
      "PA720764",
      "PA719210",
      "PA720598"
    ],
    "texteAffichable": "Mme&#160;de Vaucouleurs,  Mme&#160;Benin, Mme&#160;Elimas, M.&#160;Hammouche, Mme&#160;Gallerneau, M.&#160;Isaac-Sibille, M.&#160;Balanant, Mme&#160;Bannier, M.&#160;Barrot, M.&#160;Berta, M.&#160;Bolo, M.&#160;Bourlanges, M.&#160;Bru, M.&#160;Cubertafon, Mme&#160;de Sarnez, Mme&#160;Deprez-Audebert, M.&#160;Duverg&#233;, Mme&#160;El Ha&#239;ry, Mme&#160;Essayan, M.&#160;Fanget, M.&#160;Fesneau, Mme&#160;Florennes, M.&#160;Fuchs, M.&#160;Garcia, Mme&#160;Jacquier-Laforge, M.&#160;Joncour, M.&#160;Lagleize, M.&#160;Lain&#233;, M.&#160;Laqhila, Mme&#160;Lasserre-David, M.&#160;Latombe, Mme&#160;Luquet, M.&#160;Mathiasin, M.&#160;Mattei, Mme&#160;Mette, M.&#160;Michel-Kleisbauer, M.&#160;Mignola, M.&#160;Pahun, Mme&#160;Maud&#160;Petit, M.&#160;Fr&#233;d&#233;ric&#160;Petit, Mme&#160;Poueyto, M.&#160;Ramos, M.&#160;Thierry&#160;Robert, M.&#160;Turquois, Mme&#160;Vichnievsky et M.&#160;Waserman"
  },
  "pointeurFragmentTexte": {
    "division": {
      "titre": "Article 19",
      "articleDesignationCourte": "ART. 19",
      "type": "ARTICLE",
      "avantAApres": "A",
      "divisionRattachee": "ARTICLE 19",
      "urlDivisionTexteVise": "/15/textes/1019.asp#D_Article_19"
    },
    "alinea": {
      "numero": "5"
    }
  },
  "corps": {
    "dispositif": "<p style=\"text-align: justify;\">Compl&#233;ter l&#8217;alin&#233;a&#160;5 par les mots&#160;:</p><p style=\"text-align: justify;\">&#171;&#160;selon une fourchette r&#233;pondant &#224; des crit&#232;res de qualit&#233; des formations&#160;: l&#8217;insertion professionnelle des apprentis sur le territoire national et le bassin d&#8217;emploi, le taux de r&#233;ussite aux examens, le taux de rupture des contrats et le taux de rupture en cours de formation, le taux de poursuite des &#233;tudes.&#160;&#187;</p>",
    "exposeSommaire": "<p>Un co&#251;t de contrat unique par branche ne permet pas de prendre en compte les diff&#233;rences de qualit&#233; existant entre les formations. Certaines formations d&#8217;excellence n&#8217;ont pas le m&#234;me co&#251;t que d&#8217;autres et seront contraintes de revoir leur niveau en cas d&#8217;abaissement des co&#251;ts. Le pr&#233;sent amendement vise donc &#224; introduire une modulation dans la fixation des co&#251;ts au contrat, dans le cadre d&#8217;une fourchette, afin de mieux prendre en compte les particularit&#233;s de chaque formation.</p>"
  },
  "representations": [
    {
      "nom": "PDF",
      "typeMime": {
        "type": "application",
        "subType": "PDF"
      },
      "statutRepresentation": {
        "verbatim": true,
        "canonique": true,
        "officielle": true,
        "transcription": false,
        "enregistrement": false
      },
      "contenu": {
        "documentURI": "/15/amendements/1019/AN/1165.pdf"
      }
    }
  ],
  "seanceDiscussion": "RUANR5L15S2018IDS21105",
  "sort": {
    "dateSaisie": "2018-06-15T17:39:01.000+02:00",
    "sortEnSeance": "Rejeté"
  },
  "dateDepot": "2018-06-07T02:00:00.000+02:00",
  "dateDistribution": "2018-06-12T02:00:00.000+02:00",
  "article99": "0",
  "loiReference": {}
}