{
  "uid": "AMANR5L15PO419865B1831P0D1N1975",
  "identifiant": {
    "legislature": "15",
    "numero": "1975",
    "numRect": "0",
    "saisine": {
      "texteLegislatifRef": "PRJLANR5L15B1831",
      "numeroPartiePLF": "0",
      "organeExamen": "PO419865",
      "mentionSecondeDeliberation": "0"
    }
  },
  "numeroLong": "CD1975",
  "etapeTexte": "1ère lecture (2ème assemblée saisie)",
  "triAmendement": "olaaaaaaaaaaaaaaaaaaaaaaaaaaaaaaaaaaaaaaaaaaaaaaaaol",
  "cardinaliteAmdtMultiples": "1",
  "etat": "Discuté",
  "signataires": {
    "auteur": {
      "typeAuteur": "Depute",
      "acteurRef": "PA609245",
      "groupePolitiqueRef": "PO730934"
    },
    "cosignatairesRefs": [
      "PA340853",
      "PA608016",
      "PA267429",
      "PA712015",
      "PA267735",
      "PA346218",
      "PA606712",
      "PA608416",
      "PA719318",
      "PA266793",
      "PA721636",
      "PA330684",
      "PA1012",
      "PA767",
      "PA605036",
      "PA720210",
      "PA721410",
      "PA267204",
      "PA643089",
      "PA709315",
      "PA718838",
      "PA721678",
      "PA267260",
      "PA718884",
      "PA267289",
      "PA609245"
    ],
    "texteAffichable": "Mme&#160;Lacroute,  M.&#160;Sermier, M.&#160;Lurton, M.&#160;Thi&#233;riot, M.&#160;Door, M.&#160;Cattin, M.&#160;Abad, Mme&#160;Bonnivard, M.&#160;Hetzel, M.&#160;Reda, M.&#160;de la Verpilli&#232;re, M.&#160;Leclerc, Mme&#160;Bazin-Malgras, Mme&#160;Anthoine, M.&#160;Bony, M.&#160;Cinieri, M.&#160;Masson, M.&#160;de Ganay, Mme&#160;Louwagie, M.&#160;Dive, Mme&#160;Beauvais, M.&#160;Parigi, Mme&#160;Poletti, Mme&#160;Val&#233;rie&#160;Boyer, M.&#160;Brun et M.&#160;Viala"
  },
  "pointeurFragmentTexte": {
    "division": {
      "titre": "Article 44 bis",
      "articleDesignationCourte": "APRÈS ART. 44 BIS",
      "type": "ARTICLE",
      "avantAApres": "Apres",
      "divisionRattachee": "APRÈS L'ARTICLE 44 BIS, insérer l'article suivant:",
      "articleAdditionnel": "1",
      "urlDivisionTexteVise": "/15/textes/1831.asp#D_Article_44_bis"
    }
  },
  "corps": {
    "dispositif": "<p style=\"text-align: justify;\">Le chapitre II du titre II du livre II de la premi&#232;re partie du code des transports est ainsi modifi&#233;e&#160;:</p><p style=\"text-align: justify;\">1&#176;&#160;Dans la section 2, avant l&#8217;article L.&#160;1222&#8209;2, il est ins&#233;r&#233; une sous-section 1 ainsi r&#233;dig&#233;e&#160;:</p><p style=\"text-align: justify;\">&#171;&#160;Sous-section 1</p><p style=\"text-align: justify;\">&#171;&#160;L&#8217;organisation de la continuit&#233; du service public en cas de perturbation pr&#233;visible du trafic, hors heures de pointe&#160;&#187;&#160;;</p><p style=\"text-align: justify;\">2&#176;&#160;Dans la section 2, apr&#232;s l&#8217;article L.&#160;1222&#8209;7, il est ins&#233;r&#233; une sous-section 2 ainsi r&#233;dig&#233;e&#160;:</p><p style=\"text-align: justify;\">&#171;&#160;Sous-section 2</p><p style=\"text-align: justify;\">&#171;&#160;L&#8217;organisation de la continuit&#233; du service public en cas de perturbation pr&#233;visible du trafic, en heures de pointe&#160;&#187;&#160;;</p><p style=\"text-align: justify;\">&#171;&#160;<i>Art.&#160;L.&#160;1222&#8209;7&#8209;1</i>.&#160;&#8211;&#160;Par d&#233;rogation aux articles L.&#160;1222&#8209;2 &#224; L.&#160;1222&#8209;7, un service normal sur l&#8217;ensemble du r&#233;seau est garanti, entre 7h00 et 9h00 et entre 17h00 et 19h00, pour permettre la libert&#233; d&#8217;aller et venir, la libert&#233; d&#8217;acc&#232;s aux services publics, la libert&#233; du travail, la libert&#233; du commerce et de l&#8217;industrie et l&#8217;organisation des transports scolaires.</p><p style=\"text-align: justify;\">&#171;&#160;Ce service garanti correspond &#224; la couverture des besoins essentiels de la population. Il garantit &#233;galement l&#8217;acc&#232;s au service public de l&#8217;enseignement les jours d&#8217;examens nationaux. Il prend en compte les besoins particuliers des personnes &#224; mobilit&#233; r&#233;duite.&#160;&#187;.</p><p style=\"text-align: justify;\">3&#176;&#160;Apr&#232;s l&#8217;article L.&#160;1222&#8209;11, il est ins&#233;r&#233; un article L.&#160;1222&#8209;11&#8209;1 ainsi r&#233;dig&#233;&#160;:</p><p style=\"text-align: justify;\">&#171;&#160;<i>Art.&#160;L.&#160;1222&#8209;11&#8209;1</i>.&#160;&#8211;&#160;En cas de d&#233;faut d&#8217;ex&#233;cution dans la mise en &#339;uvre du service garanti pr&#233;vu &#224; l&#8217;article L.&#160;1222&#8209;7&#8209;1, l&#8217;autorit&#233; organisatrice de mobilit&#233; impose &#224; l&#8217;entreprise de transports, quand celle-ci est directement responsable du d&#233;faut d&#8217;ex&#233;cution, un remboursement total des titres de transports aux usagers en fonction de la dur&#233;e d&#8217;inex&#233;cution de ces plans. La charge de ce remboursement ne peut &#234;tre support&#233;e directement par l&#8217;autorit&#233; organisatrice de mobilit&#233;.</p><p style=\"text-align: justify;\">&#171;&#160;L&#8217;autorit&#233; organisatrice de mobilit&#233; d&#233;termine par convention avec l&#8217;entreprise de transports les modalit&#233;s pratiques de ce remboursement selon les cat&#233;gories d&#8217;usagers.&#160;&#187;</p>",
    "exposeSommaire": "<p style=\"text-align: justify;\">Le code des transports contient un chapitre consacr&#233; &#224; &#171;&#160;La continuit&#233; du service en cas de perturbation pr&#233;visible de trafic&#160;&#187;. Ce chapitre concerne les &#171;&#160;services publics de transport terrestre r&#233;gulier de personnes &#224; vocation non touristique, hors transport fluvial.&#160;&#187; (article L.&#160;1222&#8209;1 du code des transports).</p><p style=\"text-align: justify;\">Ces dispositions, introduites dans le code des transports par la loi n&#176; 2007&#8209;1224 du 21 ao&#251;t 2007 sur le dialogue social et la continuit&#233; du service public dans les transports terrestres r&#233;guliers de voyageurs, permet &#224; l&#8217;autorit&#233; organisatrice d&#8217;imposer un niveau minimal de service (article L.&#160;1222&#8209;3) pris en compte dans le cadre d&#8217;un plan de transport (article L.&#160;1222&#8209;4) et donnent le droit aux usagers d&#8217;&#234;tre rembours&#233;s de leur titre d&#232;s lors que la continuit&#233; du transport n&#8217;a pu &#234;tre assur&#233;e.</p><p style=\"text-align: justify;\">Ainsi, en cas de d&#233;faut d&#8217;ex&#233;cution dans la mise en &#339;uvre du plan de transports adapt&#233; ou du plan d&#8217;information des usagers pr&#233;vus &#224; l&#8217;article L.&#160;1222&#8209;4 du code des transports, l&#8217;autorit&#233; organisatrice impose au transporteur, quand celui-ci est directement responsable du d&#233;faut d&#8217;ex&#233;cution, un remboursement total des titres de transports aux usagers en fonction de la dur&#233;e d&#8217;inex&#233;cution de ces plans. La charge de ce remboursement ne peut &#234;tre support&#233;e directement par l&#8217;autorit&#233; organisatrice de mobilit&#233;. L&#8217;autorit&#233; organisatrice d&#233;termine par convention avec le transporteur les modalit&#233;s pratiques de ce remboursement. (article L.&#160;1222&#8209;11)</p><p style=\"text-align: justify;\">Par ailleurs, l&#8217;usager qui n&#8217;a pu utiliser le moyen de transport pour lequel il a contract&#233; un abonnement ou achet&#233; un titre de transport, a droit &#224; la prolongation de la validit&#233; de cet abonnement pour une dur&#233;e &#233;quivalente &#224; la p&#233;riode d&#8217;utilisation dont il a &#233;t&#233; priv&#233;, ou &#224; l&#8217;&#233;change ou au remboursement du titre de transport non utilis&#233; ou de l&#8217;abonnement.</p><p style=\"text-align: justify;\">L&#8217;acte de remboursement est effectu&#233; par l&#8217;autorit&#233; ou l&#8217;entreprise qui lui a d&#233;livr&#233; l&#8217;abonnement ou le titre de transport. Lorsque des p&#233;nalit&#233;s pour non-r&#233;alisation du plan de transport adapt&#233; sont par ailleurs pr&#233;vues, l&#8217;autorit&#233; organisatrice peut d&#233;cider de les affecter au financement du remboursement des usagers. (article L.&#160;1222&#8209;12).</p><p style=\"text-align: justify;\">Toutefois ces dispositions n&#8217;assurent pas obligatoirement un service garanti &#224; 100&#160;%, notamment aux heures de pointe. C&#8217;est pourquoi, cet amendement, qui concilie le droit de gr&#232;ve avec, par ailleurs, le droit de chacun &#224; se d&#233;placer, notamment pour se rendre sur son lieu de travail, impose un service normal garanti aux heures de pointe.</p>"
  },
  "representations": [
    {
      "nom": "PDF",
      "typeMime": {
        "type": "application",
        "subType": "PDF"
      },
      "statutRepresentation": {
        "verbatim": true,
        "canonique": true,
        "officielle": true,
        "transcription": false,
        "enregistrement": false
      },
      "contenu": {
        "documentURI": "/15/amendements/1831/CION-DVP/CD1975.pdf"
      }
    }
  ],
  "sort": {
    "dateSaisie": "2019-05-23T01:17:11.000+02:00",
    "sortEnSeance": "Rejeté"
  },
  "dateDepot": "2019-05-09T02:00:00.000+02:00",
  "dateDistribution": "2019-05-20T02:00:00.000+02:00",
  "article99": "0",
  "loiReference": {
    "codeLoi": "transports",
    "divisionCodeLoi": "L1222-7-1"
  }
}