{
  "uid": "AMANR5L15PO59048B1255P2D1N490",
  "identifiant": {
    "legislature": "15",
    "numero": "490",
    "numRect": "0",
    "saisine": {
      "texteLegislatifRef": "PRJLANR5L15B1255",
      "numeroPartiePLF": "2",
      "organeExamen": "PO59048",
      "mentionSecondeDeliberation": "0"
    }
  },
  "numeroLong": "II-CF490",
  "etapeTexte": "1ère lecture (1ère assemblée saisie)",
  "triAmendement": "aeaaaaaaaaaaaaaaaaaaaaaaaaaaaaaaaaaaaaaaaaaaaaaaaadi",
  "cardinaliteAmdtMultiples": "1",
  "etat": "Discuté",
  "signataires": {
    "auteur": {
      "typeAuteur": "Depute",
      "acteurRef": "PA719242",
      "groupePolitiqueRef": "PO730964"
    },
    "cosignatairesRefs": [
      "PA719242"
    ],
    "texteAffichable": "M.&#160;Moreau"
  },
  "pointeurFragmentTexte": {
    "missionVisee": {
      "idMissionAN": "393",
      "libelleMission": "Agriculture, alimentation, forêt et affaires rurales",
      "codeMissionPLF": "B",
      "libelleMissionPLF": "Répartition, par mission et programme, des crédits du budget général"
    },
    "division": {
      "titre": "ÉTAT B",
      "articleDesignationCourte": "ART. 39",
      "type": "ANNEXE",
      "avantAApres": "A",
      "divisionRattachee": "ARTICLE 39",
      "urlDivisionTexteVise": "/15/textes/1255C.asp#D_ETAT_B"
    }
  },
  "corps": {
    "exposeSommaire": "<p style=\"text-align: justify;\">Le projet de loi pour l&#8217;&#233;quilibre des relations commerciales dans le secteur agricole et alimentaire et une alimentation saine et durable et accessible &#224; tous cr&#233;e les outils pour assurer une meilleure r&#233;mun&#233;ration des produits agricoles. Le projet pr&#233;voit &#233;galement le rel&#232;vement du seuil de revente &#224; perte de 10&#160;% qui augmentera les marges de l&#8217;aval des fili&#232;res agricoles sans garantie d&#8217;une redistribution de cette valeur aux producteurs - pour cette raison, le dispositif est pr&#233;vu sur une dur&#233;e exp&#233;rimentale de deux ans.</p><p style=\"text-align: justify;\">L&#8217;objet du pr&#233;sent amendement est la cr&#233;ation d&#8217;un fonds de transition agricole. Ce fonds public-priv&#233; appel&#233; Initiative pour la transition agro&#233;cologique sera s&#233;curis&#233; &#233;conomiquement par les distributeurs, industries agroalimentaires ou collectivit&#233;s locales via des engagements d&#8217;achats et abond&#233; par les acteurs financiers afin de financer la transition agro&#233;cologique ou biologique des producteurs. Le fonds aura pour objectif d&#8217;offrir aux consommateurs des produits sains, de qualit&#233; et durables. De nombreux agriculteurs souhaitent s&#8217;engager dans la transition mais les risques et freins inh&#233;rents &#224; cette transition sont nombreux&#160;: incertitude sur les d&#233;bouch&#233;s commerciaux, difficult&#233;s techniques li&#233;es au changement de pratiques agricoles et besoins de financement non couverts par l&#8217;offre bancaire actuelle.</p><p style=\"text-align: justify;\"><br /> Suivant l&#8217;initiative pour une transition agro&#233;cologique (ITAE), les besoins de financements des agriculteurs et de la premi&#232;re transformation pour&#160;la mise en place des engagements pris par les fili&#232;res suite aux &#201;tats G&#233;n&#233;raux de l&#8217;Alimentation sont de 4 milliards d&#8217;euros dans les 5 prochaines ann&#233;es. Pour un objectif de 15&#160;% des besoins, soit 600 millions d&#8217;euros cet amendement propose de les financer de la fa&#231;on suivante&#160;:<br /> - 480&#160;millions de financements priv&#233;s pourraient &#234;tre mobilis&#233;s sous forme d&#8217;une tranche dite &#171;&#160;senior&#160;&#187;, la moins risqu&#233;e, apport&#233;e par des institutions bancaires.<br /> - 100&#160;millions d&#8217;euros pour une tranche dite &#171;&#160;junior&#160;&#187;, la plus expos&#233;e au risque, dont 30&#160;millions apport&#233;s par le budget de l&#8217;&#201;tat et le reste par des investisseurs &#224; impact (c&#8217;est &#224; dire &#224; la recherche de b&#233;n&#233;fices sociaux et environnementaux). Cette position &#171;&#160;junior&#160;&#187; &#8211;&#160;ou de premi&#232;re perte&#160;&#8211;&#160;de l&#8217;investissement de l&#8217;&#201;tat permettrait de r&#233;duire le risque des investisseurs priv&#233;s et donc, dans le m&#234;me temps, de catalyser un co-financement plus important. Cet investissement en premi&#232;re perte, plus expos&#233; au risque que le financement priv&#233; r&#233;duit le co&#251;t du financement total et permet d&#8217;adapter le niveau de risque ou la dur&#233;e aux besoins de la transition pour le b&#233;n&#233;fice des agriculteurs participants.</p><p style=\"text-align: justify;\">Le budget de l&#8217;&#201;tat serait utilis&#233; comme levier de financement des op&#233;rateurs priv&#233;s&#160;: avec un effet levier de 30 pour 600, chaque&#160;euro investit par l&#8217;&#201;tat permettrait le financement de 20&#160;euros issus de fonds priv&#233;s.</p><p style=\"text-align: justify;\">Cet amendement pr&#233;voit &#233;galement 20 millions d&#8217;euros d&#8217;assistance technique couvrant &#224; la fois la structuration des projets, l&#8217;accompagnement individuel des agriculteurs et les d&#233;marches d&#8217;innovation et d&#8217;apprentissage collectif.</p><p style=\"text-align: justify;\">Cet amendement de cr&#233;dit augmente la dotation du programme 149 &#171;&#160;Comp&#233;titivit&#233; et durabilit&#233; de l&#8217;agriculture, de l&#8217;agroalimentaire, de la for&#234;t, de la p&#234;che et de l&#8217;aquaculture&#160;&#187; (action 23, &#171;&#160;Appui au renouvellement et &#224; la modernisation des exploitations agricoles&#160;&#187;), en transf&#233;rant des cr&#233;dits du programme 206&#171;&#160;S&#233;curit&#233; et qualit&#233; sanitaires de l&#8217;alimentation&#160;&#187; (action n&#176;6 &#171;&#160;Mise en &#339;uvre de la politique de s&#233;curit&#233; et de qualit&#233; sanitaires de l&#8217;alimentation&#160;&#187;).<br />&#160;</p>",
    "dispositifAmdtCredit": {
      "listeProgrammes": [
        {
          "libelle": "Compétitivité et durabilité de l'agriculture, de l'agroalimentaire, de la forêt, de la pêche et de l'aquaculture",
          "id": "23220",
          "AE": {
            "montantPositif": "50000000",
            "montantNegatif": "0"
          },
          "CP": {
            "montantPositif": "50000000",
            "montantNegatif": "0"
          },
          "action": "modification"
        },
        {
          "libelle": "Sécurité et qualité sanitaires de l'alimentation",
          "id": "23221",
          "AE": {
            "montantPositif": "0",
            "montantNegatif": "50000000"
          },
          "CP": {
            "montantPositif": "0",
            "montantNegatif": "50000000"
          },
          "action": "modification"
        },
        {
          "libelle": "Conduite et pilotage des politiques de l'agriculture",
          "id": "23222",
          "AE": {
            "montantPositif": "0",
            "montantNegatif": "0"
          },
          "CP": {
            "montantPositif": "0",
            "montantNegatif": "0"
          },
          "action": "modification"
        }
      ],
      "totalAE": {
        "montantPositif": "50000000",
        "montantNegatif": "50000000",
        "solde": "0"
      },
      "totalCP": {
        "montantPositif": "50000000",
        "montantNegatif": "50000000",
        "solde": "0"
      }
    }
  },
  "representations": [
    {
      "nom": "PDF",
      "typeMime": {
        "type": "application",
        "subType": "PDF"
      },
      "statutRepresentation": {
        "verbatim": true,
        "canonique": true,
        "officielle": true,
        "transcription": false,
        "enregistrement": false
      },
      "contenu": {
        "documentURI": "/15/amendements/1255C/CION_FIN/CF490.pdf"
      }
    }
  ],
  "sort": {
    "dateSaisie": "2018-10-24T10:17:16.000+02:00",
    "sortEnSeance": "Rejeté"
  },
  "dateDepot": "2018-10-23T02:00:00.000+02:00",
  "dateDistribution": "2018-10-23T02:00:00.000+02:00",
  "article99": "0",
  "loiReference": {}
}