{
  "uid": "AMANR5L15PO59048B1611P0D1N17",
  "identifiant": {
    "legislature": "15",
    "numero": "17",
    "numRect": "0",
    "saisine": {
      "texteLegislatifRef": "PIONANR5L15B1611",
      "numeroPartiePLF": "0",
      "organeExamen": "PO59048",
      "mentionSecondeDeliberation": "0"
    }
  },
  "numeroLong": "CF17",
  "etapeTexte": "1ère lecture (1ère assemblée saisie)",
  "triAmendement": "iaaaaaaaaaaaaaaaaaaaaaaaaaaaaaaaaaaaaaaaaaaaaaaaaao",
  "cardinaliteAmdtMultiples": "1",
  "etat": "Discuté",
  "signataires": {
    "auteur": {
      "typeAuteur": "Depute",
      "acteurRef": "PA721896",
      "groupePolitiqueRef": "PO730940"
    },
    "cosignatairesRefs": [
      "PA721896"
    ],
    "texteAffichable": "Mme&#160;Faucillon"
  },
  "pointeurFragmentTexte": {
    "division": {
      "titre": "Article 3",
      "articleDesignationCourte": "ART. 3",
      "type": "ARTICLE",
      "avantAApres": "A",
      "divisionRattachee": "ARTICLE 3",
      "urlDivisionTexteVise": "/15/textes/1611.asp#D_Article_3"
    },
    "alinea": {
      "avantAApres": "Apres",
      "numero": "2"
    }
  },
  "corps": {
    "dispositif": "<p>Compl&#233;ter cet article par les deux alin&#233;as suivants&#160;:</p><p style=\"text-align: justify;\">&#171;&#160;II.&#160;&#8211;&#160;L&#8217;article L.&#160;518&#8209;10 du m&#234;me code est compl&#233;t&#233; par l&#8217;alin&#233;a suivant&#160;:</p><p style=\"text-align: justify;\">&#171;&#160;Ce rapport d&#233;taille les titres de capital et les titres de cr&#233;ances acquis ou g&#233;r&#233;s par la Caisse des d&#233;p&#244;ts et consignations aupr&#232;s d&#8217;entreprises se livrant &#224; des activit&#233;s d&#8217;exploration et d&#8217;exploitation des hydrocarbures et du charbon et pr&#233;sente sa strat&#233;gie de d&#233;sinvestissement des activit&#233;s incompatibles avec le respect de l&#8217;objectif international de limitation du r&#233;chauffement climatique&#160;&#187;.&#160;&#187;</p>",
    "exposeSommaire": "<p>Le d&#233;sinvestissement du fonds d&#8217;&#233;pargne des entreprises se livrant &#224; des activit&#233;s d&#8217;exploration et d&#8217;exploitation des hydrocarbures et du charbon, pr&#233;vu par l&#8217;article&#160;2 de la proposition de loi, doit constituer un levier pour que l&#8217;ensemble des financements de la Caisse des d&#233;p&#244;ts et consignation, notamment issus de la section g&#233;n&#233;rale, soient conditionn&#233;s au fait que les entreprises cessent de d&#233;velopper des activit&#233;s fossiles.</p><p style=\"text-align: justify;\">Dans ce but, la Caisse des d&#233;p&#244;ts doit faire toute la transparence sur l&#8217;ensemble des financements qu&#8217;elle accorde aux entreprises des secteurs des &#233;nergies fossiles.</p><p style=\"text-align: justify;\">Cet amendement vise donc &#224; faire figurer une information d&#233;taill&#233;e sur ces financements dans le rapport de la commission de surveillance de la Caisse des d&#233;p&#244;ts et consignations, pr&#233;vu &#224; l&#8217;article L.&#160;518&#8209;10 du code mon&#233;taire et financier, qui est remis annuellement au Parlement et qui porte &#171;<i>&#160;sur la direction morale et sur la situation mat&#233;rielle de l&#8217;&#233;tablissement au cours de l&#8217;ann&#233;e expir&#233;e</i>&#160;&#187;, comprenant notamment &#171;<i>&#160;le tableau des ressources et des emplois pr&#233;visionnels de la section g&#233;n&#233;rale et des sections d&#8217;&#233;pargne</i>&#160;&#187;.</p>"
  },
  "representations": [
    {
      "nom": "PDF",
      "typeMime": {
        "type": "application",
        "subType": "PDF"
      },
      "statutRepresentation": {
        "verbatim": true,
        "canonique": true,
        "officielle": true,
        "transcription": false,
        "enregistrement": false
      },
      "contenu": {
        "documentURI": "/15/amendements/1611/CION_FIN/CF17.pdf"
      }
    }
  ],
  "sort": {
    "dateSaisie": "2019-02-20T12:06:14.000+01:00",
    "sortEnSeance": "Adopté"
  },
  "dateDepot": "2019-02-18T01:00:00.000+01:00",
  "dateDistribution": "2019-02-19T01:00:00.000+01:00",
  "article99": "0",
  "loiReference": {}
}