{
  "uid": "AMANR5L15PO59048B2272P2D1N398",
  "identifiant": {
    "legislature": "15",
    "numero": "398",
    "numRect": "0",
    "saisine": {
      "texteLegislatifRef": "PRJLANR5L15B2272",
      "numeroPartiePLF": "2",
      "organeExamen": "PO59048",
      "mentionSecondeDeliberation": "0"
    }
  },
  "numeroLong": "II-CF398",
  "etapeTexte": "1ère lecture (1ère assemblée saisie)",
  "triAmendement": "bkbiaaaaaaaaaaaaaaaaaaaaaaaaaaaaaaaaaaaaaaaaaaaaaaal",
  "cardinaliteAmdtMultiples": "1",
  "etat": "Discuté",
  "signataires": {
    "auteur": {
      "typeAuteur": "Depute",
      "acteurRef": "PA719930",
      "groupePolitiqueRef": "PO758835"
    },
    "cosignatairesRefs": [
      "PA1809",
      "PA1592",
      "PA342415",
      "PA429893",
      "PA608741",
      "PA1008",
      "PA335054",
      "PA605069",
      "PA610681",
      "PA720988",
      "PA332614",
      "PA609590",
      "PA508",
      "PA333818",
      "PA608011",
      "PA337483",
      "PA335532",
      "PA609332",
      "PA340343",
      "PA607553",
      "PA1198",
      "PA340357",
      "PA333285",
      "PA608172",
      "PA643145",
      "PA719930",
      "PA642764",
      "PA267233",
      "PA608695"
    ],
    "texteAffichable": "M.&#160;Vallaud,  M.&#160;Aviragnet, Mme&#160;Bareigts, Mme&#160;Battistel, Mme&#160;Bi&#233;mouret, M.&#160;Bouillon, M.&#160;Jean-Louis&#160;Bricout, M.&#160;Carvounas, M.&#160;Alain&#160;David, Mme&#160;Laurence&#160;Dumont, M.&#160;Faure, M.&#160;Garot, M.&#160;David&#160;Habib, M.&#160;Hutin, M.&#160;Juanico, Mme&#160;Karamanli, M.&#160;J&#233;r&#244;me&#160;Lambert, M.&#160;Letchimy, Mme&#160;Manin, Mme&#160;Pau-Langevin, Mme&#160;Pires Beaune, M.&#160;Potier, M.&#160;Pueyo, Mme&#160;Rabault, M.&#160;Saulignac, Mme&#160;Tolmont, Mme&#160;Untermaier, Mme&#160;Vainqueur-Christophe et Mme&#160;Victory"
  },
  "pointeurFragmentTexte": {
    "missionVisee": {
      "idMissionAN": "829",
      "libelleMission": "Travail et emploi",
      "codeMissionPLF": "B",
      "libelleMissionPLF": "Répartition, par mission et programme, des crédits du budget général"
    },
    "division": {
      "titre": "ÉTAT B",
      "articleDesignationCourte": "ART. 38",
      "type": "ANNEXE",
      "avantAApres": "A",
      "divisionRattachee": "ARTICLE 38",
      "urlDivisionTexteVise": "/15/textes/2272C.asp#D_ETAT_B"
    }
  },
  "corps": {
    "exposeSommaire": "<p style=\"text-align: justify;\">Rappelons que P&#244;le emploi est charg&#233; des principales missions suivantes (art.&#160;L.&#160;5312&#8209;1 du code du travail)&#160;:</p><p style=\"text-align: justify;\">&#8226; prospection du march&#233; du travail et conseil aux entreprises dans leur recrutement&#160;;</p><p style=\"text-align: justify;\">&#8226; accueil et accompagnement des personnes &#224; la recherche d&#8217;un emploi, d&#8217;une formation ou d&#8217;un conseil professionnel&#160;;</p><p style=\"text-align: justify;\">&#8226; tenue de la liste des demandeurs d&#8217;emploi&#160;;</p><p style=\"text-align: justify;\">&#8226; service des allocations du r&#233;gime de l&#8217;assurance ch&#244;mage et du r&#233;gime de solidarit&#233;&#160;;</p><p style=\"text-align: justify;\">&#8226; mise &#224; disposition des actifs d&#8217;un ensemble de prestations facilitant leur orientation sur le march&#233; du travail et leur donnant acc&#232;s &#224; un accompagnement personnalis&#233; &#224; chacune des &#233;tapes de leur parcours professionnel&#160;;</p><p style=\"text-align: justify;\">&#8226; mise &#224; disposition des services de l&#8217;&#201;tat et de l&#8217;Un&#233;dic des donn&#233;es recueillies et trait&#233;es.</p><p style=\"text-align: justify;\">C&#8217;est pourquoi P&#244;le Emploi re&#231;oit annuellement une subvention de l&#8217;&#201;tat pour charges de service public.</p><p style=\"text-align: justify;\">Or, le Gouvernement entend, pour le budget 2020, baisser de 10&#160;% la subvention pour charges de service public attribu&#233;e &#224; P&#244;le emploi, soit une baisse de 136,8 millions d&#8217;euros.</p><p style=\"text-align: justify;\">Le Gouvernement s&#8217;autorise cette coupe majeure au motif de &#171;&#160;<i>tenir compte notamment de la poursuite des efforts de productivit&#233; engag&#233;s par l&#8217;op&#233;rateur dans l&#8217;exercice de ses attributions</i>.&#160;&#187;. Comment P&#244;le Emploi pourra-t-il faire 10&#160;% d&#8217;efforts de productivit&#233; sur ses missions de service public&#160;? Cette pseudo justification est d&#233;nu&#233;e de tout fondement et de nature &#224; d&#233;voyer la parole de l&#8217;&#201;tat. Il convient de r&#233;tablir <i>a minima</i> le montant de cette subvention annuelle.</p><p style=\"text-align: justify;\">Pour des raisons de recevabilit&#233; financi&#232;re au titre de l&#8217;article&#160;40&#176;&#160;de notre Constitution, cet amendement abonde de 136,8 millions d&#8217;euros les cr&#233;dits de l&#8217;action 1 &#171;&#160;Am&#233;lioration du service public de l&#8217;emploi&#160;&#187; du programme 102 &#171;&#160;Acc&#232;s et retour &#224; l&#8217;emploi&#160;&#187;, en diminuant d&#8217;autant les cr&#233;dits de l&#8217;action 3 intitul&#233;e &#171;&#160;D&#233;veloppement de l&#8217;emploi&#160;&#187; programme 103 &#171;&#160;Accompagnement des mutations &#233;conomiques et d&#233;veloppement de l&#8217;emploi&#160;&#187;.</p>",
    "dispositifAmdtCredit": {
      "listeProgrammes": [
        {
          "libelle": "Accès et retour à l'emploi",
          "id": "69234",
          "AE": {
            "montantPositif": "0",
            "montantNegatif": "0"
          },
          "CP": {
            "montantPositif": "136800000",
            "montantNegatif": "0"
          },
          "action": "modification"
        },
        {
          "libelle": "Accompagnement des mutations économiques et développement de l'emploi",
          "id": "69235",
          "AE": {
            "montantPositif": "0",
            "montantNegatif": "0"
          },
          "CP": {
            "montantPositif": "0",
            "montantNegatif": "136800000"
          },
          "action": "modification"
        },
        {
          "libelle": "Amélioration de la qualité de l'emploi et des relations du travail",
          "id": "69236",
          "AE": {
            "montantPositif": "0",
            "montantNegatif": "0"
          },
          "CP": {
            "montantPositif": "0",
            "montantNegatif": "0"
          },
          "action": "modification"
        },
        {
          "libelle": "Conception, gestion et évaluation des politiques de l'emploi et du travail",
          "id": "69237",
          "AE": {
            "montantPositif": "0",
            "montantNegatif": "0"
          },
          "CP": {
            "montantPositif": "0",
            "montantNegatif": "0"
          },
          "action": "modification"
        }
      ],
      "totalAE": {
        "montantPositif": "0",
        "montantNegatif": "0",
        "solde": "0"
      },
      "totalCP": {
        "montantPositif": "136800000",
        "montantNegatif": "136800000",
        "solde": "0"
      }
    }
  },
  "representations": [
    {
      "nom": "PDF",
      "typeMime": {
        "type": "application",
        "subType": "PDF"
      },
      "statutRepresentation": {
        "verbatim": true,
        "canonique": true,
        "officielle": true,
        "transcription": false,
        "enregistrement": false
      },
      "contenu": {
        "documentURI": "/15/amendements/2272C/CION_FIN/CF398.pdf"
      }
    }
  ],
  "sort": {
    "dateSaisie": "2019-10-22T23:15:49.000+02:00",
    "sortEnSeance": "Non soutenu"
  },
  "dateDepot": "2019-10-18T02:00:00.000+02:00",
  "dateDistribution": "2019-10-21T02:00:00.000+02:00",
  "article99": "0",
  "loiReference": {}
}