{
  "uid": "AMANR5L15SEA717460BTC1396P0D1N392",
  "identifiant": {
    "legislature": "15",
    "numero": "392",
    "numRect": "0",
    "saisine": {
      "texteLegislatifRef": "PRJLANR5L15BTC1396",
      "numeroPartiePLF": "0",
      "organeExamen": "PO717460",
      "mentionSecondeDeliberation": "0"
    }
  },
  "numeroLong": "392",
  "etapeTexte": "1ère lecture (2ème assemblée saisie)",
  "triAmendement": "aaoaaaaaaaaaaaaaaaaaaaaaaaaaaaaaaaaaaaaaaaaaaaaaaag",
  "cardinaliteAmdtMultiples": "1",
  "etat": "Discuté",
  "signataires": {
    "auteur": {
      "typeAuteur": "Depute",
      "acteurRef": "PA720430",
      "groupePolitiqueRef": "PO730958"
    },
    "cosignatairesRefs": [
      "PA588884",
      "PA721960",
      "PA719578",
      "PA719676",
      "PA718868",
      "PA718860",
      "PA722142",
      "PA721062",
      "PA721202",
      "PA721226",
      "PA720892",
      "PA720286",
      "PA720430",
      "PA721210",
      "PA720846",
      "PA720422",
      "PA2150"
    ],
    "texteAffichable": "M.&#160;Bernalicis,  Mme&#160;Autain, M.&#160;Coquerel, M.&#160;Corbi&#232;re, Mme&#160;Fiat, M.&#160;Lachaud, M.&#160;Larive, M.&#160;M&#233;lenchon, Mme&#160;Obono, Mme&#160;Panot, M.&#160;Prud&apos;homme, M.&#160;Quatennens, M.&#160;Ratenon, Mme&#160;Ressiguier, Mme&#160;Rubin, M.&#160;Ruffin et Mme&#160;Taurine"
  },
  "pointeurFragmentTexte": {
    "division": {
      "titre": "RAPPORT ANNEXÉ",
      "articleDesignationCourte": "ART. PREMIER",
      "type": "ANNEXE",
      "avantAApres": "A",
      "divisionRattachee": "ARTICLE PREMIER",
      "urlDivisionTexteVise": "/15/textes/1396.asp#D_RAPPORT_ANNEXE"
    },
    "alinea": {
      "avantAApres": "Apres",
      "numero": "205"
    }
  },
  "corps": {
    "dispositif": "<p>Apr&#232;s l&#8217;alin&#233;a&#160;205, ins&#233;rer les sept alin&#233;as suivants&#160;:&#160;</p><p>&#171;&#160;Le Gouvernement cr&#233;e L&#8217;Agence du travail p&#233;nitentiaire et de la formation pour l&#8217;emploi, qui est un service &#224; comp&#233;tence nationale, plac&#233; aupr&#232;s du garde des sceaux, ministre de la justice, ayant pour mission de d&#233;finir une strat&#233;gie globale de l&#8217;emploi et de l&#8217;insertion en articulation avec l&#8217;offre d&#8217;emploi et de formation, d&#8217;&#234;tre l&#8217;unique gestionnaire et employeur des personnes d&#233;tenues, et de d&#233;finir et veiller au droit du travail p&#233;nitentiaire sp&#233;cial. Elle&#160;:</p><p>&#171;&#160;1&#176; d&#233;finit une strat&#233;gie globale de l&#8217;emploi et de la formation dans l&#8217;objectif de favoriser les r&#233;insertion et la pr&#233;vention de la r&#233;cidive des personnes d&#233;tenues&#160;;</p><p>&#171;&#160;2&#176; coordonne les relations du minist&#232;re de la justice avec l&#8217;ensemble de ses partenaires&#160;;</p><p>&#171;&#160;3&#176; centralise et diffuse les informations sur la formation, l&#8217;emploi et sur l&#8217;information juridiques pertinentes aupr&#232;s de ses partenaires et des personnes d&#233;tenues&#160;: notamment par la promotion des structures de l&#8217;insertion par l&#8217;activit&#233; &#233;conomique (SIAE) en d&#233;tention, l&#8217;adaptation des dispositifs de l&#8217;assurance ch&#244;mage pour les personnes d&#233;tenues&#160;;</p><p>&#171;&#160;4&#176; assure la fonction de gestionnaire et d&#8217;employeur des personnes d&#233;tenues dans tous les &#233;tablissements p&#233;nitentiaires en France&#160;;</p><p>&#171;&#160;5&#176; d&#233;finit le droit du travail p&#233;nitentiaire sp&#233;cial applicable dans les &#233;tablissements p&#233;nitentiaires en France&#160;;</p><p>&#171;&#160;6&#176; &#233;labore chaque ann&#233;e un rapport d&#8217;activit&#233; rendu public, qui peut comprendre des propositions d&#8217;&#233;volution du droit de l&#8217;ex&#233;cution des peines.&#160;&#187;</p>",
    "exposeSommaire": "<p style=\"text-align: justify;\">Cet amendement vise &#224; la cr&#233;ation d&#8217;une agence centrale du travail p&#233;nitentiaire et de la formation pour l&#8217;emploi.</p><p style=\"text-align: justify;\">Seulement moins d&#8217;un tiers des personnes d&#233;tenues exerce une activit&#233; r&#233;mun&#233;r&#233;e en d&#233;tention. Le manque de postes est criant et les activit&#233;s de travail propos&#233;es sont r&#233;duites &#224; des activit&#233;s de fa&#231;onnage ou d&#8217;assemblage qui, &#224; l&#8217;ext&#233;rieur, ont, pour la plupart disparues.</p><p style=\"text-align: justify;\">A cela s&#8217;ajoute une situation juridique qui n&#8217;est plus acceptable et dont le statut quo n&#8217;est pas audible ! En effet, La personnes d&#233;tenue qui occupe un emploi en prison est un travailleur sans contrat (acte d&#8217;engagement), qui ne dispose pas d&#8217;indemnit&#233; en cas de ch&#244;mage technique, d&#8217;arr&#234;t maladie ou d&#8217;accident du travail, aucun d&#8217;encadrement de la dur&#233;e du travail, pas de jour de repos garanti, ni de revenu minimum respect&#233;, pas de m&#233;decine du travail&#8230;</p><p style=\"text-align: justify;\">Le groupe de la France insoumise fait le constat que le d&#233;veloppement du travail en d&#233;tention ne fait pas partie des priorit&#233;s strat&#233;giques de l&#8217;administration p&#233;nitentiaire, ni plus largement des pr&#233;occupations de l&#8217;opinion publique. C&#8217;est pourquoi, nous proposons, la cr&#233;ation d'une agence qui pilotera une strat&#233;gie globale de l&#8217;emploi et de la formation, en lien avec un r&#233;seau local aupr&#232;s des directions interr&#233;gionales des services p&#233;nitentiaires. Afin de garantir une &#233;galit&#233; de traitement et une application uniforme sur tout le territoire, cette agence deviendra l&#8217;employeur et le gestionnaire unique des personnes d&#233;tenues et aura en charge de promouvoir aupr&#232;s des structures habilit&#233;s son action.</p><p style=\"text-align: justify;\">Cette agence aura &#224; charge de proposer rapidement une modification de l&#8217;article 33 de la loi loi n&#176; 2009-1436 du 24 novembre 2009 p&#233;nitentiaire.</p>"
  },
  "representations": [
    {
      "nom": "PDF",
      "typeMime": {
        "type": "application",
        "subType": "PDF"
      },
      "statutRepresentation": {
        "verbatim": true,
        "canonique": true,
        "officielle": true,
        "transcription": false,
        "enregistrement": false
      },
      "contenu": {
        "documentURI": "/15/amendements/1396/AN/392.pdf"
      }
    }
  ],
  "seanceDiscussion": "RUANR5L15S2019IDS21370",
  "sort": {
    "dateSaisie": "2018-11-20T23:17:45.000+01:00",
    "sortEnSeance": "Rejeté"
  },
  "dateDepot": "2018-11-14T01:00:00.000+01:00",
  "dateDistribution": "2018-11-18T01:00:00.000+01:00",
  "article99": "0",
  "loiReference": {}
}