{
  "uid": "AMANR5L15SEA717460B2296P0D1N1008",
  "identifiant": {
    "legislature": "15",
    "numero": "1008",
    "numRect": "0",
    "saisine": {
      "texteLegislatifRef": "PRJLANR5L15B2296",
      "numeroPartiePLF": "0",
      "organeExamen": "PO717460",
      "mentionSecondeDeliberation": "1"
    }
  },
  "numeroLong": "1008",
  "etapeTexte": "1ère lecture (1ère assemblée saisie)",
  "triAmendement": "ddaaaaaaaaaaaaaaaaaaaaaaaaaaaaaaaaaaaaaaaaaaaaaaaabzi",
  "cardinaliteAmdtMultiples": "1",
  "etat": "Discuté",
  "signataires": {
    "auteur": {
      "typeAuteur": "Depute",
      "acteurRef": "PA642764",
      "groupePolitiqueRef": "PO758835"
    },
    "cosignatairesRefs": [
      "PA609332",
      "PA337483",
      "PA609590",
      "PA608172",
      "PA607553",
      "PA508",
      "PA608741",
      "PA340357",
      "PA335054",
      "PA332614",
      "PA1198",
      "PA643145",
      "PA429893",
      "PA608695",
      "PA608011",
      "PA340343",
      "PA342415",
      "PA1008",
      "PA610681",
      "PA719930",
      "PA333285",
      "PA605069",
      "PA720988",
      "PA335532",
      "PA1809",
      "PA333818",
      "PA642764",
      "PA1592"
    ],
    "texteAffichable": "M.&#160;Aviragnet,  Mme&#160;Bareigts, Mme&#160;Bi&#233;mouret, Mme&#160;Vainqueur-Christophe, M.&#160;Vallaud, Mme&#160;Rabault, Mme&#160;Battistel, M.&#160;Jean-Louis&#160;Bricout, M.&#160;Carvounas, M.&#160;Alain&#160;David, Mme&#160;Laurence&#160;Dumont, M.&#160;Faure, M.&#160;Garot, M.&#160;David&#160;Habib, M.&#160;Hutin, M.&#160;Juanico, Mme&#160;Karamanli, M.&#160;J&#233;r&#244;me&#160;Lambert, M.&#160;Letchimy, Mme&#160;Manin, Mme&#160;Pau-Langevin, Mme&#160;Pires Beaune, M.&#160;Potier, M.&#160;Pueyo, M.&#160;Saulignac, Mme&#160;Tolmont, Mme&#160;Untermaier et Mme&#160;Victory"
  },
  "pointeurFragmentTexte": {
    "division": {
      "titre": "Article 24",
      "articleDesignationCourte": "ART. 24",
      "type": "ARTICLE",
      "avantAApres": "A",
      "divisionRattachee": "ARTICLE 24",
      "urlDivisionTexteVise": "/15/textes/2296.asp#D_Article_24"
    },
    "alinea": {
      "numero": "2"
    }
  },
  "corps": {
    "dispositif": "<p style=\"text-align: justify;\">&#192; la deuxi&#232;me phrase&#160;de l&#8217;alin&#233;a&#160;2, supprimer les mots&#160;:</p><p style=\"text-align: justify;\">&#171;&#160;du volume d&#8217;activit&#233; et&#160;&#187;.</p>",
    "exposeSommaire": "<p style=\"text-align: justify;\">Cet amendement du groupe socialiste et apparent&#233;s propose de ne pas lier le niveau de garantie pluriannuelle de financement des h&#244;pitaux de proximit&#233; au volume d&#8217;activit&#233; r&#233;alis&#233;.</p><p style=\"text-align: justify;\">En effet, le mode de financement des h&#244;pitaux de proximit&#233; doit tenir compte du fait que les h&#244;pitaux de proximit&#233; assurent une continuit&#233; de service public. Nous savons que les h&#244;pitaux de proximit&#233; n&#8217;auront pas forc&#233;ment, selon la zone g&#233;ographique, un grand volume d&#8217;activit&#233;.</p><p style=\"text-align: justify;\">Il serait particuli&#232;rement injuste de sanctionner doublement les fran&#231;ais des zones les plus recul&#233;es&#160;: des h&#244;pitaux de proximit&#233; sous &#233;quip&#233;s et sous financ&#233;s.</p><p style=\"text-align: justify;\">En effet, si le mod&#232;le des h&#244;pitaux de proximit&#233; comporte une garantie de financement, celle-ci est li&#233;e au volume d&#8217;activit&#233; r&#233;alis&#233; et n&#8217;assure pas, en pratique, la stabilit&#233; des ressources des &#233;tablissements. Les h&#244;pitaux de proximit&#233; situ&#233;s dans un bassin de vie peu dynamique du point de vue d&#233;mographique voient ainsi leur activit&#233; stagner et leurs ressources diminuent en cons&#233;quence d&#8217;ann&#233;e en ann&#233;e.</p><p style=\"text-align: justify;\">Nous devons faire en sorte que leur mode de financement &#233;volue si nous voulons &#233;viter un surendettement des h&#244;pitaux de proximit&#233;.</p>"
  },
  "representations": [
    {
      "nom": "PDF",
      "typeMime": {
        "type": "application",
        "subType": "PDF"
      },
      "statutRepresentation": {
        "verbatim": true,
        "canonique": true,
        "officielle": true,
        "transcription": false,
        "enregistrement": false
      },
      "contenu": {
        "documentURI": "/15/amendements/2296/AN/1008.pdf"
      }
    }
  ],
  "seanceDiscussion": "RUANR5L15S2020IDS21878",
  "sort": {
    "dateSaisie": "2019-10-24T18:20:59.000+02:00",
    "sortEnSeance": "Rejeté"
  },
  "dateDepot": "2019-10-17T02:00:00.000+02:00",
  "dateDistribution": "2019-10-21T02:00:00.000+02:00",
  "article99": "0",
  "loiReference": {}
}