{
  "uid": "AMANR5L15PO757134B1088P0D1N1183",
  "identifiant": {
    "legislature": "15",
    "numero": "1183",
    "numRect": "0",
    "saisine": {
      "texteLegislatifRef": "PRJLANR5L15B1088",
      "numeroPartiePLF": "0",
      "organeExamen": "PO757134",
      "mentionSecondeDeliberation": "0"
    }
  },
  "numeroLong": "1183",
  "etapeTexte": "1ère lecture (1ère assemblée saisie)",
  "triAmendement": "pbaaaaaaaaaaaaaaaaaaaaaaaaaaaaaaaaaaaaaaaaaaaaaaaaabw",
  "cardinaliteAmdtMultiples": "1",
  "etat": "Discuté",
  "signataires": {
    "auteur": {
      "typeAuteur": "Depute",
      "acteurRef": "PA334149",
      "groupePolitiqueRef": "PO730934"
    },
    "cosignatairesRefs": [
      "PA643089",
      "PA334149",
      "PA267378",
      "PA721678"
    ],
    "texteAffichable": "M.&#160;Fasquelle,  M.&#160;Reda, Mme&#160;Levy et M.&#160;Thi&#233;riot"
  },
  "pointeurFragmentTexte": {
    "division": {
      "titre": "Article 71",
      "articleDesignationCourte": "APRÈS ART. 71",
      "type": "ARTICLE",
      "avantAApres": "Apres",
      "divisionRattachee": "APRÈS L'ARTICLE 71, insérer l'article suivant:",
      "articleAdditionnel": "1",
      "urlDivisionTexteVise": "/15/textes/1088.asp#D_Article_71"
    }
  },
  "corps": {
    "dispositif": "<p style=\"text-align: justify;\">La seconde phrase du premier alin&#233;a de l&#8217;article L.&#160;341&#8209;34&#8209;1 du code de la consommation est compl&#233;t&#233;e par les mots&#160;: </p><p style=\"text-align: justify;\">&#171;&#160;, ainsi que de toute clause qui maintiendrait la condition de domiciliation lors de la souscription, par l&#8217;emprunteur, d&#8217;une nouvelle op&#233;ration de financement de cr&#233;dit immobilier dans un autre &#233;tablissement pr&#233;teur.&#160;&#187;</p>",
    "exposeSommaire": "<p style=\"text-align: justify;\">L&#8217;Ordonnance n&#176;2017&#8209;1090 du 1<sup>er</sup> juin 2017 offre la possibilit&#233;, pour les &#233;tablissements de cr&#233;dit pr&#234;teurs, d&#8217;imposer au client particulier, en contrepartie d&#8217;un avantage sur le taux d&#8217;un cr&#233;dit immobilier, la domiciliation des revenus de ce m&#234;me client au sein de l&#8217;&#233;tablissement. Et ce pour une dur&#233;e pouvant aller jusqu&#8217;&#224; 10 ans.</p><p style=\"text-align: justify;\">Cette ordonnance, qui limite pour le tiers des Fran&#231;ais d&#233;tenteurs d&#8217;un cr&#233;dit immobilier, la mobilit&#233; bancaire, pose &#233;galement un probl&#232;me majeur pour tous ceux qui souhaiteraient, alors qu&#8217;ils ont d&#233;j&#224; un cr&#233;dit immobilier, b&#233;n&#233;ficier d&#8217;un second cr&#233;dit pour acheter une r&#233;sidence secondaire ou pour r&#233;aliser un investissement locatif. </p><p style=\"text-align: justify;\">Si ces clients sont soumis &#224; une obligation de domiciliation de revenus pour leur premier cr&#233;dit immobilier, ceux-ci ne pourront pas, dans le cadre de la recherche de leur second cr&#233;dit, faire jouer la concurrence. Impossible en effet de domicilier leurs revenus dans deux banques &#224; la fois. </p><p style=\"text-align: justify;\">De ce fait, la libert&#233; de choix et la concurrence risquent d&#8217;&#234;tre an&#233;anties pour une part importante du march&#233; du cr&#233;dit immobilier, la premi&#232;re banque pouvant imposer ses conditions au client cherchant un second cr&#233;dit immobilier. </p><p style=\"text-align: justify;\">Cet amendement a ainsi pour objectif de r&#233;tablir la concurrence entre les banques en annulant la condition de domiciliation dans les cas o&#249; le client souscrirait un second cr&#233;dit immobilier dans un autre &#233;tablissement pr&#233;teur.</p>"
  },
  "representations": [
    {
      "nom": "PDF",
      "typeMime": {
        "type": "application",
        "subType": "PDF"
      },
      "statutRepresentation": {
        "verbatim": true,
        "canonique": true,
        "officielle": true,
        "transcription": false,
        "enregistrement": false
      },
      "contenu": {
        "documentURI": "/15/amendements/1088/CSPACTE/1183.pdf"
      }
    }
  ],
  "sort": {
    "dateSaisie": "2018-09-15T00:54:54.000+02:00",
    "sortEnSeance": "Retiré"
  },
  "dateDepot": "2018-09-03T02:00:00.000+02:00",
  "dateDistribution": "2018-09-11T02:00:00.000+02:00",
  "article99": "0",
  "loiReference": {
    "codeLoi": "consommation",
    "divisionCodeLoi": "L341-34-1"
  }
}