{
  "uid": "AMANR5L15SEA717460BTC1974P0D1N257",
  "identifiant": {
    "legislature": "15",
    "numero": "257",
    "numRect": "0",
    "saisine": {
      "texteLegislatifRef": "PRJLANR5L15BTC1974",
      "numeroPartiePLF": "0",
      "organeExamen": "PO717460",
      "mentionSecondeDeliberation": "0"
    }
  },
  "numeroLong": "257",
  "etapeTexte": "1ère lecture (2ème assemblée saisie)",
  "triAmendement": "hiaaaiaaaaaaaaaaaaaaaaaaaaaaaaaaaaaaaaaaaaaaaaaaaazzznzzzwo",
  "cardinaliteAmdtMultiples": "1",
  "etat": "Discuté",
  "signataires": {
    "auteur": {
      "typeAuteur": "Depute",
      "acteurRef": "PA718838",
      "groupePolitiqueRef": "PO730934"
    },
    "cosignatairesRefs": [
      "PA2377",
      "PA721506",
      "PA267735",
      "PA720586",
      "PA267527",
      "PA721286",
      "PA266793",
      "PA608416",
      "PA721968",
      "PA608016",
      "PA720210",
      "PA340853",
      "PA609726",
      "PA718838",
      "PA346218",
      "PA721410",
      "PA605036",
      "PA718884",
      "PA606712",
      "PA719318",
      "PA721046",
      "PA721816",
      "PA718780",
      "PA767",
      "PA267429"
    ],
    "texteAffichable": "M.&#160;Brun,  M.&#160;Abad, Mme&#160;Anthoine, M.&#160;Aubert, Mme&#160;Bassire, Mme&#160;Bazin-Malgras, Mme&#160;Beauvais, Mme&#160;Bonnivard, M.&#160;Bony, M.&#160;Boucard, M.&#160;Cinieri, M.&#160;Hetzel, Mme&#160;Kuster, M.&#160;Leclerc, Mme&#160;Louwagie, M.&#160;Masson, M.&#160;Ramadier, M.&#160;Saddier, M.&#160;Vatin, M.&#160;Vialay, M.&#160;Cattin, M.&#160;de Ganay, M.&#160;Lurton, M.&#160;Perrut et Mme&#160;Trastour-Isnart"
  },
  "pointeurFragmentTexte": {
    "division": {
      "titre": "Article 1er A",
      "articleDesignationCourte": "ART. 1ER A",
      "type": "ARTICLE",
      "avantAApres": "A",
      "divisionRattachee": "ARTICLE 1ER A",
      "urlDivisionTexteVise": "/15/textes/1974.asp#D_Article_1er_A"
    },
    "alinea": {
      "numero": "5"
    }
  },
  "corps": {
    "dispositif": "<p style=\"text-align: justify;\">Compl&#233;ter l&#8217;alin&#233;a&#160;5 par les mots&#160;:</p><p style=\"text-align: justify;\">&#171;&#160;ainsi qu&#8217;en int&#233;grant les alternatives &#224; la mobilit&#233; du quotidien comme le t&#233;l&#233;travail&#160;&#187;.</p>",
    "exposeSommaire": "<p style=\"text-align: justify;\">Afin d&#8217;acc&#233;l&#233;rer la transition &#233;nerg&#233;tique certaines mobilit&#233;s du quotidien peuvent &#234;tre &#233;vit&#233;es, le t&#233;l&#233;travail permet d&#8217;exercer son activit&#233; professionnelle chez soi, gr&#226;ce aux outils de t&#233;l&#233;communication. Cela &#224; l&#8217;avantage de permettre d&#8217;&#233;viter dans certaines situations de prendre des transports &#224; fortes &#233;missions.</p>",
    "cartoucheDelaiDepotDepasse": "Sous réserve de son traitement par les services de l'Assemblée nationale et de sa recevabilité"
  },
  "representations": [
    {
      "nom": "PDF",
      "typeMime": {
        "type": "application",
        "subType": "PDF"
      },
      "statutRepresentation": {
        "verbatim": true,
        "canonique": true,
        "officielle": true,
        "transcription": false,
        "enregistrement": false
      },
      "contenu": {
        "documentURI": "/15/amendements/1974/AN/257.pdf"
      }
    }
  ],
  "seanceDiscussion": "RUANR5L15S2019IDS21699",
  "sort": {
    "dateSaisie": "2019-06-13T15:03:20.000+02:00",
    "sortEnSeance": "Rejeté"
  },
  "dateDepot": "2019-05-27T02:00:00.000+02:00",
  "dateDistribution": "2019-06-13T02:00:00.000+02:00",
  "article99": "0",
  "loiReference": {}
}