{
  "uid": "AMANR5L15PO59051B0778P0D1N118",
  "identifiant": {
    "legislature": "15",
    "numero": "118",
    "numRect": "0",
    "saisine": {
      "texteLegislatifRef": "PRJLANR5L15B0778",
      "numeroPartiePLF": "0",
      "organeExamen": "PO59051",
      "mentionSecondeDeliberation": "0"
    }
  },
  "numeroLong": "CL118",
  "etapeTexte": "1ère lecture (1ère assemblée saisie)",
  "triAmendement": "bxu",
  "cardinaliteAmdtMultiples": "1",
  "etat": "Discuté",
  "signataires": {
    "auteur": {
      "typeAuteur": "Depute",
      "acteurRef": "PA718860",
      "groupePolitiqueRef": "PO730958"
    },
    "cosignatairesRefs": [
      "PA721202",
      "PA720422",
      "PA721210",
      "PA719578",
      "PA720430",
      "PA718868",
      "PA721226",
      "PA721062",
      "PA720892",
      "PA2150",
      "PA719676",
      "PA720846",
      "PA721960",
      "PA718860",
      "PA722142",
      "PA588884",
      "PA720286"
    ],
    "texteAffichable": "Mme&#160;Taurine,  Mme&#160;Autain, M.&#160;Bernalicis, M.&#160;Coquerel, M.&#160;Corbi&#232;re, Mme&#160;Fiat, M.&#160;Lachaud, M.&#160;Larive, M.&#160;M&#233;lenchon, Mme&#160;Obono, Mme&#160;Panot, M.&#160;Prud&apos;homme, M.&#160;Quatennens, M.&#160;Ratenon, Mme&#160;Ressiguier, Mme&#160;Rubin et M.&#160;Ruffin"
  },
  "pointeurFragmentTexte": {
    "division": {
      "titre": "Article 2",
      "articleDesignationCourte": "ART. 2",
      "type": "ARTICLE",
      "avantAApres": "A",
      "divisionRattachee": "ARTICLE 2",
      "urlDivisionTexteVise": "/15/textes/0778.asp#D_Article_2"
    },
    "alinea": {
      "avantAApres": "A",
      "numero": "2",
      "alineaDesignation": "Alinéa 2"
    }
  },
  "corps": {
    "dispositif": "<p style=\"text-align: justify;\">R&#233;diger ainsi l&#8217;alin&#233;a&#160;2&#160;:</p><p style=\"text-align: justify;\">&#171;&#160;Lorsque les faits sont commis sur un mineur de moins de treize ans par une personne majeure d&#8217;au moins cinq ans son a&#238;n&#233;e, cette derni&#232;re doit apporter la preuve du consentement du mineur.&#160;&#187;</p>",
    "exposeSommaire": "<p>Le dispositif actuellement pr&#233;vu par le projet de loi n&#8217;est pas satisfaisant pour prot&#233;ger de fa&#231;on convenable les mineur&#183;e&#183;s victimes de viol, puisqu&#8217;il reprend l&#8217;&#233;tat de la jurisprudence qui nous a montr&#233; ses vicissitudes, &#224; plusieurs reprises notamment lors du proc&#232;s dit &#8220;de Pontoise&#8221;, dans lequel, faute de r&#233;ussir &#224; prouver l&#8217;absence de consentement d&#8217;une jeune fille de 11 ans, le viol qu&#8217;elle a subi par un homme &#226;g&#233; de 29 ans a &#233;t&#233; qualifi&#233; d&#8217;atteinte sexuelle.</p><p><br />Il nous semble qu&#8217;il faut, a minima, en ce qui concerne de tr&#232;s jeunes mineur&#183;e&#183;s, que la charge de la preuve soit invers&#233;e : dans ce cas, la pr&#233;somption de non consentement est une n&#233;cessit&#233;.</p><p><br />En l&#8217;&#233;tat actuel du droit, il existe une forme de pr&#233;somption de consentement. Les corps des femmes et des jeunes filles sont pr&#233;sum&#233;s disponibles jusqu&#8217;&#224; ce qu&#8217;elles apportent (elles-m&#234;mes) la preuve du contraire. Cet &#233;tat du droit nous semble archa&#239;que, notamment quand il s&#8217;agit de jeunes victimes.</p><p>&#160;</p><p>La sp&#233;cificit&#233; des violences faites aux femmes, le tr&#232;s faible taux de condamnations et les difficult&#233;s probatoires n&#233;cessitent un traitement sp&#233;cifique.</p><p><br />Il s&#8217;agit de donner des outils suppl&#233;mentaires aux magistrat&#183;e&#183;s et aux jur&#233;&#183;e&#183;s afin d&#8217;&#233;viter des non-lieux en mati&#232;re de viols commis sur de tr&#232;s jeunes mineur&#183;e&#183;s, et envoyer un message &#224; la soci&#233;t&#233; toute enti&#232;re.</p>"
  },
  "representations": [
    {
      "nom": "PDF",
      "typeMime": {
        "type": "application",
        "subType": "PDF"
      },
      "statutRepresentation": {
        "verbatim": true,
        "canonique": true,
        "officielle": true,
        "transcription": false,
        "enregistrement": false
      },
      "contenu": {
        "documentURI": "/15/amendements/0778/CION_LOIS/CL118.pdf"
      }
    }
  ],
  "sort": {
    "dateSaisie": "2018-05-09T18:26:59.000+02:00",
    "sortEnSeance": "Rejeté"
  },
  "dateDepot": "2018-05-04T02:00:00.000+02:00",
  "dateDistribution": "2018-05-07T02:00:00.000+02:00",
  "article99": "0",
  "loiReference": {
    "codeLoi": "1"
  }
}