{
  "uid": "AMANR5L15SEA717460BTC0777P0D1N1",
  "identifiant": {
    "legislature": "15",
    "numero": "1",
    "numRect": "0",
    "saisine": {
      "texteLegislatifRef": "PIONANR5L15BTC0777",
      "numeroPartiePLF": "0",
      "organeExamen": "PO717460",
      "mentionSecondeDeliberation": "0"
    }
  },
  "numeroLong": "1",
  "etapeTexte": "1ère lecture (1ère assemblée saisie)",
  "triAmendement": "i",
  "cardinaliteAmdtMultiples": "1",
  "etat": "Discuté",
  "signataires": {
    "auteur": {
      "typeAuteur": "Depute",
      "acteurRef": "PA267429",
      "groupePolitiqueRef": "PO730934"
    },
    "cosignatairesRefs": [
      "PA267429"
    ],
    "texteAffichable": "M.&#160;Cinieri"
  },
  "pointeurFragmentTexte": {
    "division": {
      "titre": "Article 2",
      "articleDesignationCourte": "APRÈS ART. 2",
      "type": "ARTICLE",
      "avantAApres": "Apres",
      "divisionRattachee": "APRÈS L'ARTICLE 2, insérer l'article suivant:",
      "articleAdditionnel": "1",
      "urlDivisionTexteVise": "/15/textes/0777.asp#D_Article_2"
    }
  },
  "corps": {
    "dispositif": "<p style=\"text-align: justify;\">La section&#160;4 du chapitre&#160;VI du titre&#160;II du livre&#160;II du code p&#233;nal est compl&#233;t&#233;e par un paragraphe&#160;3 ainsi r&#233;dig&#233;&#160;:</p><p style=\"text-align: justify;\">&#171;&#160;Paragraphe&#160;3</p><p style=\"text-align: justify;\">&#171;&#160;De l&#8217;atteinte au secret des affaires des entreprises</p><p style=\"text-align: justify;\">&#171;&#160;<i>Art.&#160;226&#8209;15&#8209;1</i>.&#160;&#8211;&#160;Constituent des informations prot&#233;g&#233;es relevant du secret des affaires d&#8217;une entreprise, quel que soit leur support, les proc&#233;d&#233;s, objets, documents, donn&#233;es ou fichiers, de nature commerciale, industrielle, financi&#232;re, scientifique, technique ou strat&#233;gique, ne pr&#233;sentant pas un caract&#232;re public, dont la divulgation non autoris&#233;e serait de nature &#224; compromettre gravement les int&#233;r&#234;ts de cette entreprise en portant atteinte &#224; son potentiel scientifique et technique, &#224; ses positions strat&#233;giques, &#224; ses int&#233;r&#234;ts commerciaux ou financiers ou &#224; sa capacit&#233; concurrentielle, et qui ont, en cons&#233;quence, fait l&#8217;objet de mesures de protection sp&#233;cifiques destin&#233;es &#224; informer de leur caract&#232;re confidentiel et &#224; garantir celui-ci.</p><p style=\"text-align: justify;\">&#171;&#160;Ces mesures de protection sp&#233;cifiques, prises apr&#232;s une information pr&#233;alable du personnel par le repr&#233;sentant l&#233;gal de l&#8217;entreprise ou par toute personne qu&#8217;il aura pr&#233;alablement d&#233;sign&#233;e par &#233;crit et destin&#233;es &#224; garantir la confidentialit&#233; des informations, sont d&#233;termin&#233;es par d&#233;cret en Conseil d&#8217;&#201;tat.&#160;&#187;</p>",
    "exposeSommaire": "<p style=\"text-align: justify;\">L&#8217;objectif de cet amendement est de donner une d&#233;finition pr&#233;cise de l&#8217;atteinte au secret des affaires.</p>"
  },
  "representations": [
    {
      "nom": "PDF",
      "typeMime": {
        "type": "application",
        "subType": "PDF"
      },
      "statutRepresentation": {
        "verbatim": true,
        "canonique": true,
        "officielle": true,
        "transcription": false,
        "enregistrement": false
      },
      "contenu": {
        "documentURI": "/15/amendements/0777/AN/1.pdf"
      }
    }
  ],
  "seanceDiscussion": "RUANR5L15S2018IDS20966",
  "sort": {
    "dateSaisie": "2018-03-28T16:31:00.000+02:00",
    "sortEnSeance": "Non soutenu"
  },
  "dateDepot": "2018-03-22T01:00:00.000+01:00",
  "dateDistribution": "2018-03-26T02:00:00.000+02:00",
  "article99": "0",
  "loiReference": {
    "codeLoi": "c pénal",
    "divisionCodeLoi": "livre II titre II ch IV section 4t"
  }
}