{
  "uid": "AMANR5L15PO419604B1255P2D1N46",
  "identifiant": {
    "legislature": "15",
    "numero": "46",
    "numRect": "0",
    "saisine": {
      "texteLegislatifRef": "PRJLANR5L15B1255",
      "numeroPartiePLF": "2",
      "organeExamen": "PO419604",
      "mentionSecondeDeliberation": "0"
    }
  },
  "numeroLong": "II-AC46",
  "etapeTexte": "1ère lecture (1ère assemblée saisie)",
  "triAmendement": "alaaaaaaaaaaaaaaaaaaaaaaaaaaaaaaaaaaaaaaaaaaaaaaaaao",
  "cardinaliteAmdtMultiples": "1",
  "etat": "Discuté",
  "signataires": {
    "auteur": {
      "typeAuteur": "Depute",
      "acteurRef": "PA719676",
      "groupePolitiqueRef": "PO730958"
    },
    "cosignatairesRefs": [
      "PA720422",
      "PA720430",
      "PA721226",
      "PA721960",
      "PA720846",
      "PA2150",
      "PA721202",
      "PA588884",
      "PA719578",
      "PA718860",
      "PA719676",
      "PA722142",
      "PA721062",
      "PA721210",
      "PA720286",
      "PA718868",
      "PA720892"
    ],
    "texteAffichable": "Mme&#160;Ressiguier,  Mme&#160;Autain, M.&#160;Bernalicis, M.&#160;Coquerel, M.&#160;Corbi&#232;re, Mme&#160;Fiat, M.&#160;Lachaud, M.&#160;Larive, M.&#160;M&#233;lenchon, Mme&#160;Obono, Mme&#160;Panot, M.&#160;Prud&apos;homme, M.&#160;Quatennens, M.&#160;Ratenon, Mme&#160;Rubin, M.&#160;Ruffin et Mme&#160;Taurine"
  },
  "pointeurFragmentTexte": {
    "missionVisee": {
      "idMissionAN": "413",
      "libelleMission": "Recherche et enseignement supérieur",
      "codeMissionPLF": "B",
      "libelleMissionPLF": "Répartition, par mission et programme, des crédits du budget général"
    },
    "division": {
      "titre": "ÉTAT B",
      "articleDesignationCourte": "ART. 39",
      "type": "ANNEXE",
      "avantAApres": "A",
      "divisionRattachee": "ARTICLE 39",
      "urlDivisionTexteVise": "/15/textes/1255C.asp#D_ETAT_B"
    }
  },
  "corps": {
    "exposeSommaire": "<p style=\"text-align: justify;\">Il est cr&#233;&#233; au sein de cette mission un nouveau programme, num&#233;rot&#233; 901 et intitul&#233;&#160;: &#171;&#160;Recherche pour la transition &#233;cologique&#160;&#187;.</p><p style=\"text-align: justify;\">Cet amendement vise &#224; doter les op&#233;rateurs financ&#233;s sur l&#8217;action 13 &#171;&#160;Recherche partenariale dans le d&#233;veloppement et l&#8217;am&#233;nagement durable&#160;&#187; du programme 190 d&#8217;une part, et sur les activit&#233;s financ&#233;es par l&#8217;action 16 &#171;&#160;Recherche dans le domaine de l&#8217;&#233;nergie nucl&#233;aire&#160;&#187;. Nous souhaitons insister sur l&#8217;urgence climatique, qui doit pr&#233;sider &#224; tout projet de recherche.&#160;</p><p style=\"text-align: justify;\">Malheureusement, le vocabulaire employ&#233; traduit les actions qui seront men&#233;es par le Gouvernement. Par exemple, la cr&#233;ation d&#8217;une nouvelle ligne &#171;&#160;Recherche dans le domaine de l&#8217;&#233;nergie nucl&#233;aire&#160;&#187; nous alarme. S&#8217;il est &#233;vident qu&#8217;il faut lutter pour la transition &#233;cologique et qu&#8217;une partie de la recherche doit &#234;tre consacr&#233;e &#224; la transformation d&#8217;un parc &#233;nerg&#233;tique durable, propre et sans danger, il semble que ce n&#8217;est clairement pas la voie suivie par le Gouvernement.&#160;</p><p style=\"text-align: justify;\">Nous souhaitons donc, pour&#160;abonder ce nouveau programme, diminuer &#224; due concurrence les actions 13 et 16 du programme 190.</p>",
    "dispositifAmdtCredit": {
      "listeProgrammes": [
        {
          "libelle": "Formations supérieures et recherche universitaire",
          "id": "40494",
          "AE": {
            "montantPositif": "0",
            "montantNegatif": "0"
          },
          "CP": {
            "montantPositif": "0",
            "montantNegatif": "0"
          },
          "action": "modification"
        },
        {
          "libelle": "Vie étudiante",
          "id": "40495",
          "AE": {
            "montantPositif": "0",
            "montantNegatif": "0"
          },
          "CP": {
            "montantPositif": "0",
            "montantNegatif": "0"
          },
          "action": "modification"
        },
        {
          "libelle": "Recherches scientifiques et technologiques pluridisciplinaires",
          "id": "40496",
          "AE": {
            "montantPositif": "0",
            "montantNegatif": "0"
          },
          "CP": {
            "montantPositif": "0",
            "montantNegatif": "0"
          },
          "action": "modification"
        },
        {
          "libelle": "Recherche spatiale",
          "id": "40497",
          "AE": {
            "montantPositif": "0",
            "montantNegatif": "0"
          },
          "CP": {
            "montantPositif": "0",
            "montantNegatif": "0"
          },
          "action": "modification"
        },
        {
          "libelle": "Recherche dans les domaines de l'énergie, du développement et de la mobilité durables",
          "id": "40498",
          "AE": {
            "montantPositif": "0",
            "montantNegatif": "434920380"
          },
          "CP": {
            "montantPositif": "0",
            "montantNegatif": "434920380"
          },
          "action": "modification"
        },
        {
          "libelle": "Recherche et enseignement supérieur en matière économique et industrielle",
          "id": "40499",
          "AE": {
            "montantPositif": "0",
            "montantNegatif": "0"
          },
          "CP": {
            "montantPositif": "0",
            "montantNegatif": "0"
          },
          "action": "modification"
        },
        {
          "libelle": "Recherche duale (civile et militaire)",
          "id": "40500",
          "AE": {
            "montantPositif": "0",
            "montantNegatif": "0"
          },
          "CP": {
            "montantPositif": "0",
            "montantNegatif": "0"
          },
          "action": "modification"
        },
        {
          "libelle": "Recherche culturelle et culture scientifique",
          "id": "40501",
          "AE": {
            "montantPositif": "0",
            "montantNegatif": "0"
          },
          "CP": {
            "montantPositif": "0",
            "montantNegatif": "0"
          },
          "action": "modification"
        },
        {
          "libelle": "Enseignement supérieur et recherche agricoles",
          "id": "40502",
          "AE": {
            "montantPositif": "0",
            "montantNegatif": "0"
          },
          "CP": {
            "montantPositif": "0",
            "montantNegatif": "0"
          },
          "action": "modification"
        },
        {
          "libelle": "Recherche pour la transition écologique",
          "id": "40503",
          "AE": {
            "montantPositif": "434920380",
            "montantNegatif": "0"
          },
          "CP": {
            "montantPositif": "434920380",
            "montantNegatif": "0"
          },
          "action": "creation"
        }
      ],
      "totalAE": {
        "montantPositif": "434920380",
        "montantNegatif": "434920380",
        "solde": "0"
      },
      "totalCP": {
        "montantPositif": "434920380",
        "montantNegatif": "434920380",
        "solde": "0"
      }
    }
  },
  "representations": [
    {
      "nom": "PDF",
      "typeMime": {
        "type": "application",
        "subType": "PDF"
      },
      "statutRepresentation": {
        "verbatim": true,
        "canonique": true,
        "officielle": true,
        "transcription": false,
        "enregistrement": false
      },
      "contenu": {
        "documentURI": "/15/amendements/1255C/CION-CEDU/AC46.pdf"
      }
    }
  ],
  "sort": {
    "dateSaisie": "2018-11-07T19:36:38.000+01:00",
    "sortEnSeance": "Rejeté"
  },
  "dateDepot": "2018-10-31T01:00:00.000+01:00",
  "dateDistribution": "2018-11-05T01:00:00.000+01:00",
  "article99": "0",
  "loiReference": {}
}