{
  "uid": "AMANR5L15PO59048B0235P1D1N565",
  "identifiant": {
    "legislature": "15",
    "numero": "565",
    "numRect": "0",
    "saisine": {
      "texteLegislatifRef": "PRJLANR5L15B0235",
      "numeroPartiePLF": "1",
      "organeExamen": "PO59048",
      "mentionSecondeDeliberation": "0"
    }
  },
  "numeroLong": "I-CF565",
  "etapeTexte": "1ère lecture (1ère assemblée saisie)",
  "triAmendement": "ti",
  "cardinaliteAmdtMultiples": "1",
  "etat": "Discuté",
  "signataires": {
    "auteur": {
      "typeAuteur": "Depute",
      "acteurRef": "PA720298",
      "groupePolitiqueRef": "PO730964"
    },
    "cosignatairesRefs": [
      "PA605963",
      "PA718736",
      "PA720298"
    ],
    "texteAffichable": "Mme&#160;Cariou,  M.&#160;Alauzet et Mme&#160;Peyrol"
  },
  "pointeurFragmentTexte": {
    "division": {
      "titre": "Article 14",
      "articleDesignationCourte": "ART. 14",
      "type": "ARTICLE",
      "avantAApres": "A",
      "divisionRattachee": "ARTICLE 14",
      "urlDivisionTexteVise": "/15/textes/0235A.asp#D_Article_14"
    }
  },
  "corps": {
    "dispositif": "<p style=\"text-align: justify;\">R&#233;diger ainsi cet article&#160;:</p><p style=\"text-align: justify;\">&#171;&#160;&#192; la fin de du IX de l&#8217;article&#160;209 du code g&#233;n&#233;ral des imp&#244;ts, il est ajout&#233; la phrase suivante&#160;:</p><p style=\"text-align: justify;\">&#171;&#160;Est assimil&#233;e &#224; une soci&#233;t&#233; &#233;tablie en France au sens du pr&#233;sent alin&#233;a toute soci&#233;t&#233; soumise &#224; l&#8217;imp&#244;t sur les soci&#233;t&#233;s ou &#224; un imp&#244;t &#233;quivalent et ayant son si&#232;ge dans un &#201;tat membre de l&#8217;Union&#160;europ&#233;enne ou dans un autre &#201;tat partie &#224; l&#8217;accord sur l&#8217;Espace &#233;conomique&#160;europ&#233;en ayant conclu avec la France une convention d&#8217;assistance administrative en vue de lutter contre la fraude et l&#8217;&#233;vasion fiscales&#160;&#187;.</p>",
    "exposeSommaire": "<p style=\"text-align: justify;\">Par amendement de son Rapporteur g&#233;n&#233;ral de l&#8217;&#233;poque, Monsieur le Pr&#233;sident Gilles Carrez, la Commission des finances a propos&#233; et obtenu la mise en place, pour les grandes soci&#233;t&#233;s, d&#8217;un m&#233;canisme probatoire particulier pour la d&#233;duction du b&#233;n&#233;fice imposable de certaines charges financi&#232;res (amendement n&#176; 19 Rect., 24 novembre 2011, sur la loi de finances rectificative pour 2011 n&#176; 3952, devenu article&#160;40 de la loi n&#176; 2011&#8209;1978 du 28 d&#233;cembre 2011 de finances rectificative pour 2011).</p><p style=\"text-align: justify;\">Ce syst&#232;me a permis de lutter contre la d&#233;ductibilit&#233; artificielle de co&#251;ts support&#233;s pour la d&#233;tention de titres de participation dans des soci&#233;t&#233;s que la soci&#233;t&#233; fran&#231;aise ne contr&#244;le pas effectivement.</p><p style=\"text-align: justify;\">L&#8217;article&#160;14 du projet de loi de finances propose de proc&#233;der &#224; la suppression de ce m&#233;canisme, face &#224; un risque de contentieux&#160;europ&#233;en sur le sujet en lien avec la libert&#233; d&#8217;&#233;tablissement (articles 49 et suivants du TFUE, ex article&#160;43 et suivants du TCE).</p><p style=\"text-align: justify;\">Le pr&#233;sent amendement propose d&#8217;adopter la deuxi&#232;me solution observ&#233;e par le Gouvernement, telle que mentionn&#233;e dans l&#8217;&#233;valuation pr&#233;alable des articles du PLF 2018 (p. 130 et suivantes), &#224; savoir assimiler les soci&#233;t&#233;s sises dans un &#201;tat membre de l&#8217;Union&#160;europ&#233;enne ou de l&#8217;Espace &#233;conomique&#160;europ&#233;en, et ainsi limiter le dispositif du 209 IX du CGI aux titres de participation en particulier d&#233;tenus par des soci&#233;t&#233;s extra-europ&#233;ennes.</p><p style=\"text-align: justify;\">Il permettra de r&#233;affirmer notre confiance dans nos partenaires&#160;europ&#233;ens, sans pour autant nous priver des effets protecteurs pour notre base fiscale procur&#233;s par cette disposition, en sus des autres outils mis en place depuis la loi de finances rectificatives 2011.</p>"
  },
  "representations": [
    {
      "nom": "PDF",
      "typeMime": {
        "type": "application",
        "subType": "PDF"
      },
      "statutRepresentation": {
        "verbatim": true,
        "canonique": true,
        "officielle": true,
        "transcription": false,
        "enregistrement": false
      },
      "contenu": {
        "documentURI": "/15/amendements/0235A/CION_FIN/CF565.pdf"
      }
    }
  ],
  "sort": {
    "dateSaisie": "2017-10-12T11:10:34.000+02:00",
    "sortEnSeance": "Retiré"
  },
  "dateDepot": "2017-10-07T02:00:00.000+02:00",
  "dateDistribution": "2017-10-11T02:00:00.000+02:00",
  "article99": "0",
  "loiReference": {}
}