{
  "uid": "AMANR5L15SEA717460B0485P0D1N385",
  "identifiant": {
    "legislature": "15",
    "numero": "385",
    "numRect": "0",
    "saisine": {
      "texteLegislatifRef": "PRJLANR5L15B0485",
      "numeroPartiePLF": "0",
      "organeExamen": "PO717460",
      "mentionSecondeDeliberation": "0"
    }
  },
  "numeroLong": "385",
  "etapeTexte": "Nouvelle Lecture",
  "triAmendement": "i",
  "cardinaliteAmdtMultiples": "1",
  "etat": "Discuté",
  "signataires": {
    "auteur": {
      "typeAuteur": "Rapporteur",
      "acteurRef": "PA267336",
      "organeRef": "PO59048",
      "groupePolitiqueRef": "PO730964"
    },
    "cosignatairesRefs": [
      "PA267336"
    ],
    "texteAffichable": "M.&#160;Giraud, rapporteur g&#233;n&#233;ral au nom de la commission des finances"
  },
  "pointeurFragmentTexte": {
    "division": {
      "titre": "Article 16 bis",
      "articleDesignationCourte": "ART. 16 BIS",
      "type": "ARTICLE",
      "avantAApres": "A",
      "divisionRattachee": "ARTICLE 16 BIS",
      "urlDivisionTexteVise": "/15/textes/0485.asp#D_Article_16_bis"
    }
  },
  "corps": {
    "dispositif": "<p style=\"text-align: justify;\">Supprimer cet article.</p>",
    "exposeSommaire": "<p style=\"text-align: justify;\">L&#8217;article 16 <i>bis</i> (nouveau), adopt&#233; par le S&#233;nat en premi&#232;re lecture, pr&#233;voit l&#8217;extension de l&#8217;&#233;ligibilit&#233; au fonds de compensation pour la taxe sur la valeur ajout&#233;e (FCTVA) &#224; certaines d&#233;penses pour le d&#233;veloppement de maisons de sant&#233; dans des communes class&#233;es en &#171;&#160;zones&#160;&#224; surveiller&#160;&#187; en application du sch&#233;ma r&#233;gional de sant&#233;.</p><p style=\"text-align: justify;\">Le pr&#233;sent amendement propose de supprimer cet article.</p>"
  },
  "representations": [
    {
      "nom": "PDF",
      "typeMime": {
        "type": "application",
        "subType": "PDF"
      },
      "statutRepresentation": {
        "verbatim": true,
        "canonique": true,
        "officielle": true,
        "transcription": false,
        "enregistrement": false
      },
      "contenu": {
        "documentURI": "/15/amendements/0485/AN/385.pdf"
      }
    }
  ],
  "seanceDiscussion": "RUANR5L15S2018IDS20841",
  "sort": {
    "dateSaisie": "2017-12-15T18:02:02.000+01:00",
    "sortEnSeance": "Adopté"
  },
  "dateDepot": "2017-12-14T01:00:00.000+01:00",
  "dateDistribution": "2017-12-14T01:00:00.000+01:00",
  "article99": "1",
  "loiReference": {}
}