{
  "uid": "AMANR5L15SEA717460BTC0389P0D1N85",
  "identifiant": {
    "legislature": "15",
    "numero": "85",
    "numRect": "0",
    "saisine": {
      "texteLegislatifRef": "PIONANR5L15BTC0389",
      "numeroPartiePLF": "0",
      "organeExamen": "PO717460",
      "mentionSecondeDeliberation": "0"
    }
  },
  "numeroLong": "85",
  "etapeTexte": "1ère lecture (1ère assemblée saisie)",
  "triAmendement": "abhzd",
  "cardinaliteAmdtMultiples": "1",
  "amendementParent": "AMANR5L15SEA717460BTC0389P0D1N75",
  "etat": "Discuté",
  "signataires": {
    "auteur": {
      "typeAuteur": "Depute",
      "acteurRef": "PA719874",
      "groupePolitiqueRef": "PO730970"
    },
    "cosignatairesRefs": [
      "PA719874"
    ],
    "texteAffichable": "Mme&#160;Jacquier-Laforge"
  },
  "pointeurFragmentTexte": {
    "division": {
      "titre": "Article 7",
      "articleDesignationCourte": "APRÈS ART. 7",
      "type": "ARTICLE",
      "avantAApres": "Apres",
      "divisionRattachee": "APRÈS L'ARTICLE 7, insérer l'article suivant:",
      "articleAdditionnel": "1",
      "urlDivisionTexteVise": "/15/textes/0389.asp#D_Article_7"
    }
  },
  "corps": {
    "dispositif": "<p style=\"text-align: justify;\">&#192; la fin de l'alin&#233;a 2, substituer aux mots&#160;:</p><p style=\"text-align: justify;\">&#171;&#160;au-del&#224; du 1<sup>er</sup> janvier 2018&#160;&#187;,</p><p style=\"text-align: justify;\">les mots&#160;:</p><p style=\"text-align: justify;\">&#171;&#160;jusqu&#8217;au 1<sup>er</sup> janvier 2020&#160;&#187;.</p>",
    "exposeSommaire": "<p>Il est propos&#233; de limiter au 1er janvier 2020 la prolongation des missions d'appui technique de bassin.</p>"
  },
  "representations": [
    {
      "nom": "PDF",
      "typeMime": {
        "type": "application",
        "subType": "PDF"
      },
      "statutRepresentation": {
        "verbatim": true,
        "canonique": true,
        "officielle": true,
        "transcription": false,
        "enregistrement": false
      },
      "contenu": {
        "documentURI": "/15/amendements/0389/AN/85.pdf"
      }
    }
  ],
  "seanceDiscussion": "RUANR5L15S2018IDS20792",
  "sort": {
    "dateSaisie": "2017-11-30T19:05:01.000+01:00",
    "sortEnSeance": "Adopté"
  },
  "dateDepot": "2017-11-29T01:00:00.000+01:00",
  "dateDistribution": "2017-11-29T01:00:00.000+01:00",
  "article99": "0",
  "loiReference": {}
}