{
  "uid": "AMANR5L15PO59048B0235P2D1N235",
  "identifiant": {
    "legislature": "15",
    "numero": "235",
    "numRect": "0",
    "saisine": {
      "texteLegislatifRef": "PRJLANR5L15B0235",
      "numeroPartiePLF": "2",
      "organeExamen": "PO59048",
      "mentionSecondeDeliberation": "0"
    }
  },
  "numeroLong": "II-CF235",
  "etapeTexte": "1ère lecture (1ère assemblée saisie)",
  "triAmendement": "o",
  "cardinaliteAmdtMultiples": "1",
  "etat": "Discuté",
  "signataires": {
    "auteur": {
      "typeAuteur": "Depute",
      "acteurRef": "PA721836",
      "groupePolitiqueRef": "PO730970"
    },
    "cosignatairesRefs": [
      "PA721836",
      "PA721498"
    ],
    "texteAffichable": "M.&#160;Barrot, rapporteur et M.&#160;Guerini"
  },
  "pointeurFragmentTexte": {
    "missionVisee": {
      "idMissionAN": "18",
      "libelleMission": "Immigration, asile et intégration",
      "codeMissionPLF": "B",
      "libelleMissionPLF": "Répartition, par mission et programme, des crédits du budget général"
    },
    "division": {
      "titre": "Article 57",
      "articleDesignationCourte": "ART. 57",
      "type": "ARTICLE",
      "avantAApres": "A",
      "divisionRattachee": "ARTICLE 57",
      "urlDivisionTexteVise": "/15/textes/0235C.asp#D_Article_57"
    }
  },
  "corps": {
    "dispositif": "<p style=\"text-align: justify;\">Apr&#232;s la premi&#232;re occurrence du mot&#160;:</p><p style=\"text-align: justify;\">&#171;&#160;mots&#160;:&#160;&#187;,</p><p style=\"text-align: justify;\">r&#233;diger ainsi la fin de l&#8217;alin&#233;a&#160;2&#160;:</p><p style=\"text-align: justify;\">&#171;&#160;&#171;&#160;au terme du mois qui suit celui de la notification de la d&#233;cision d&#233;finitive concernant cette demande&#160;&#187;, sont remplac&#233;s par les mots&#160;: &#171;&#160;un mois apr&#232;s l&#8217;expiration du d&#233;lai de recours contre la d&#233;cision de l&#8217;Office fran&#231;ais de protection des r&#233;fugi&#233;s et apatrides ou la notification de la d&#233;cision de rejet de la Cour nationale du droit d&#8217;asile ou &#224; la fin du mois au cours duquel a pris fin le droit du demandeur &#224; se maintenir sur le territoire fran&#231;ais dans les conditions pr&#233;vues &#224; l&#8217;article L.&#160;743&#8209;2.&#160;&#187;&#160;&#187;</p>",
    "exposeSommaire": "<p style=\"text-align: justify;\">Cet amendement vise &#224; aligner, pour les personnes d&#233;bout&#233;es du droit d&#8217;asile, le d&#233;lai au terme duquel prend fin le versement de l&#8217;allocation pour demandeur d&#8217;asile (ADA) avec celui d'un mois pr&#233;vu &#224; l'article R.&#160;744-12 du code de l'entr&#233;e et du s&#233;jour des &#233;trangers et du droit d'asile pour pr&#233;parer leur sortie du lieu dans lequel elle sont h&#233;berg&#233;es.</p><p style=\"text-align: justify;\">L'ADA est actuellement vers&#233;e de l'enregistrement de la demande d'asile au guichet unique pour demandeurs d'asile (GUDA) jusqu'&#224; la fin du mois suivant la notification de la d&#233;cision d&#233;finitive relative &#224; cette demande, qu'elle soit positive ou n&#233;gative.</p><p style=\"text-align: justify;\">L'article 57 du projet de loi de finances modifie et pr&#233;cise les modalit&#233;s selon lesquelles prend fin le versement de l&#8217;ADA. L&#8217;alin&#233;a 2 r&#233;duit la dur&#233;e de versement d&#8217;un mois pour les personnes d&#233;bout&#233;es ou qui perdent le droit au maintien sur le territoire fran&#231;ais. L&#8217;alin&#233;a&#160;4 pr&#233;voit le maintien des r&#232;gles actuellement en vigueur pour les personnes qui obtiennent une protection cons&#233;cutivement &#224; une d&#233;cision d&#233;finitive de l&#8217;Office fran&#231;ais pour la protection des r&#233;fugi&#233;s et des apatrides (OFPRA), soit par la Cour nationale du droit d&#8217;asile (CNDA).</p><p style=\"text-align: justify;\">Cette r&#233;daction m&#233;riterait selon eux d&#8217;&#234;tre align&#233;e pour les personnes d&#233;bout&#233;es sur la proc&#233;dure applicable en mati&#232;re de fin du droit &#224; l&#8217;h&#233;bergement, pr&#233;vue au 2&#176; de l&#8217;article R.&#160;744-12 du code de l'entr&#233;e et du s&#233;jour des &#233;trangers et du droit d'asile qui dispose que&#160;: &#171;&#160;Si elle en fait la demande, la personne ayant eu notification d&#8217;une d&#233;cision d&#233;finitive d&#233;favorable est maintenue dans le lieu d'h&#233;bergement pour une dur&#233;e maximale d&#8217;un mois &#224; compter de la date de cette notification. Durant cette p&#233;riode, elle pr&#233;pare avec le gestionnaire les modalit&#233;s de sa sortie.&#160;&#187;</p><p style=\"text-align: justify;\">Fixer un d&#233;lai d&#8217;un mois &#224; compter de la notification comporterait trois avantages pour ces personnes&#160;:</p><p style=\"text-align: justify;\">&#8211;&#160;cela leur permettrait de pr&#233;parer leur retour&#160;;</p><p style=\"text-align: justify;\">&#8211;&#160;cela &#233;viterait de cr&#233;er une in&#233;galit&#233; entre elles fond&#233;e sur la date de notification de la d&#233;cision de rejet les concernant&#160;;</p><p style=\"text-align: justify;\">&#8211;&#160;cela am&#233;liorerait la lisibilit&#233; du dispositif lorsqu&#8217;elle est aussi h&#233;berg&#233;e, puisque le m&#234;me d&#233;lai s&#8217;appliquerait.</p><p style=\"text-align: justify;\">Vos rapporteurs trouvent pertinent, n&#233;anmoins, de maintenir pour les personnes obtenant une protection un r&#233;gime plus favorable, car ce d&#233;lai plus long est n&#233;cessaire &#224; l&#8217;ouverture de leurs droits sociaux le cas &#233;ch&#233;ant. Ils sont en accord, en outre, avec la r&#233;daction de l&#8217;article&#160;57 en tant qu&#8217;elle pr&#233;voit de ne verser l&#8217;ADA aux personnes perdant le droit de se maintenir sur le territoire que jusqu&#8217;&#224; la fin du mois suivant la d&#233;cision les concernant au regard des motifs de celle-ci.</p><p style=\"text-align: justify;\">En cons&#233;quence, cet amendement distingue plus nettement les situations des personnes obtenant une protection (droit inchang&#233;), des personnes d&#233;bout&#233;es (un mois apr&#232;s la fin du d&#233;lai de recours contre une d&#233;cision de l'OFPRA ou apr&#232;s la notification de la d&#233;cision d&#233;finitive de la CNDA) et des personnes perdant le droit de se maintenir sur le territoire (fin du mois de la d&#233;cision).</p>"
  },
  "representations": [
    {
      "nom": "PDF",
      "typeMime": {
        "type": "application",
        "subType": "PDF"
      },
      "statutRepresentation": {
        "verbatim": true,
        "canonique": true,
        "officielle": true,
        "transcription": false,
        "enregistrement": false
      },
      "contenu": {
        "documentURI": "/15/amendements/0235C/CION_TOUTE/CF235.pdf"
      }
    }
  ],
  "sort": {
    "sortEnSeance": "Adopté"
  },
  "dateDepot": "2017-10-30T01:00:00.000+01:00",
  "dateDistribution": "2017-10-30T01:00:00.000+01:00",
  "article99": "0",
  "loiReference": {}
}