{
  "uid": "AMANR5L15SEA717460B1297P0D1N194",
  "identifiant": {
    "legislature": "15",
    "numero": "194",
    "numRect": "0",
    "saisine": {
      "texteLegislatifRef": "PRJLANR5L15B1297",
      "numeroPartiePLF": "0",
      "organeExamen": "PO717460",
      "mentionSecondeDeliberation": "0"
    }
  },
  "numeroLong": "194",
  "etapeTexte": "1ère lecture (1ère assemblée saisie)",
  "triAmendement": "ataaaaaaaaaaaaaaaaaaaaaaaaaaaaaaaaaaaaaaaaaaaaaaaaabaki",
  "cardinaliteAmdtMultiples": "1",
  "etat": "Discuté",
  "signataires": {
    "auteur": {
      "typeAuteur": "Depute",
      "acteurRef": "PA718926",
      "groupePolitiqueRef": "PO730940"
    },
    "cosignatairesRefs": [
      "PA441",
      "PA721270",
      "PA721896",
      "PA335612",
      "PA721012",
      "PA722202",
      "PA720546",
      "PA720692",
      "PA610654",
      "PA610667",
      "PA718926",
      "PA689",
      "PA721118",
      "PA722110",
      "PA718720",
      "PA267306"
    ],
    "texteAffichable": "M.&#160;Dharr&#233;ville,  M.&#160;Nilor, M.&#160;Bruneel, Mme&#160;Bello, M.&#160;Brotherson, Mme&#160;Buffet, M.&#160;Chassaigne, M.&#160;Dufr&#232;gne, Mme&#160;Faucillon, M.&#160;Jumel, Mme&#160;K&#233;clard-Mond&#233;sir, M.&#160;Lecoq, M.&#160;Peu, M.&#160;Fabien&#160;Roussel, M.&#160;Serville et M.&#160;Wulfranc"
  },
  "pointeurFragmentTexte": {
    "division": {
      "titre": "Article 7",
      "articleDesignationCourte": "ART. 7",
      "type": "ARTICLE",
      "avantAApres": "A",
      "divisionRattachee": "ARTICLE 7",
      "urlDivisionTexteVise": "/15/textes/1297.asp#D_Article_7"
    }
  },
  "corps": {
    "dispositif": "<p style=\"text-align: justify;\">Supprimer cet article.</p>",
    "exposeSommaire": "<p style=\"text-align: justify;\">Sous pr&#233;texte de redonner du pouvoir d&#8217;achat <span class=\"del cts-1\"  data-cid=\"2\" data-userid=\"1543\" data-username=\"Emmanuel Larsonneur\" data-time=\"1540216197541\">des</span> <span class=\"ins cts-1\"  data-cid=\"5\" data-userid=\"1543\" data-username=\"Emmanuel Larsonneur\" data-time=\"1540216202218\">aux </span>actifs, la d&#233;socialisation des heures suppl&#233;mentaires est dangereuse &#224; plusieurs titres.</p><p style=\"text-align: justify;\">En premier lieu, cette mesure ne vise que les salari&#233;s en poste dont l&#8217;employeur a d&#233;cid&#233; de leur octroyer des heures suppl&#233;mentaires, laissant de c&#244;t&#233; le plus souvent les franges les plus pr&#233;caires du salariat, les ch&#244;meurs, et les retrait&#233;s. Cette mesure revient donc &#224; redonner du pouvoir d&#8217;achat aux seuls salari&#233;s concern&#233;s au d&#233;triment du versement de prestations sociales pour tous, puisque le financement de cette mesure est assur&#233; par des exon&#233;rations de cotisations sociales salariales non compens&#233;es.</p><p style=\"text-align: justify;\">Par ailleurs, de nombreuses &#233;tudes pointent le risque que fait peser une telle mesure sur la cr&#233;ation d&#8217;emplois. En incitant les employeurs &#224; recourir aux heures suppl&#233;mentaires de leurs salari&#233;s en poste, elle d&#233;courage les embauches en cas de progression du carnet de commandes des entreprises.</p><p style=\"text-align: justify;\">Enfin, cette mesure va &#224; l&#8217;encontre de la n&#233;cessaire r&#233;duction du temps de travail.</p><p style=\"text-align: justify;\">Pour toutes ces raisons, nous proposons de supprimer cet article.</p>"
  },
  "representations": [
    {
      "nom": "PDF",
      "typeMime": {
        "type": "application",
        "subType": "PDF"
      },
      "statutRepresentation": {
        "verbatim": true,
        "canonique": true,
        "officielle": true,
        "transcription": false,
        "enregistrement": false
      },
      "contenu": {
        "documentURI": "/15/amendements/1297/AN/194.pdf"
      }
    }
  ],
  "seanceDiscussion": "RUANR5L15S2019IDS21288",
  "sort": {
    "dateSaisie": "2018-10-24T18:09:28.000+02:00",
    "sortEnSeance": "Rejeté"
  },
  "dateDepot": "2018-10-17T02:00:00.000+02:00",
  "dateDistribution": "2018-10-22T02:00:00.000+02:00",
  "article99": "0",
  "loiReference": {}
}