{
  "uid": "AMANR5L15SEA717460BTC0902P0D1N2268",
  "identifiant": {
    "legislature": "15",
    "numero": "2268",
    "numRect": "0",
    "saisine": {
      "texteLegislatifRef": "PRJLANR5L15BTC0902",
      "numeroPartiePLF": "0",
      "organeExamen": "PO717460",
      "mentionSecondeDeliberation": "0"
    }
  },
  "numeroLong": "2268",
  "etapeTexte": "1ère lecture (1ère assemblée saisie)",
  "triAmendement": "bcti",
  "cardinaliteAmdtMultiples": "1",
  "etat": "Discuté",
  "signataires": {
    "auteur": {
      "typeAuteur": "Depute",
      "acteurRef": "PA719858",
      "groupePolitiqueRef": "PO730964"
    },
    "cosignatairesRefs": [
      "PA722336",
      "PA718930",
      "PA719858",
      "PA720310",
      "PA718962",
      "PA719412",
      "PA721134",
      "PA721514",
      "PA606171",
      "PA719972",
      "PA719080",
      "PA720944",
      "PA609520",
      "PA722312",
      "PA721600",
      "PA722038",
      "PA718710",
      "PA720414",
      "PA719700",
      "PA718894",
      "PA719520",
      "PA719364",
      "PA722228",
      "PA722000",
      "PA719420",
      "PA722236",
      "PA718990",
      "PA719960",
      "PA608641",
      "PA721808",
      "PA719740",
      "PA719718",
      "PA718728",
      "PA605084",
      "PA719632",
      "PA719388",
      "PA721860",
      "PA719372",
      "PA721852",
      "PA720378",
      "PA719194",
      "PA720038",
      "PA720054",
      "PA719258",
      "PA720014",
      "PA719660",
      "PA719652",
      "PA605518",
      "PA718802",
      "PA720116",
      "PA719310",
      "PA720108",
      "PA722094",
      "PA720242",
      "PA720814",
      "PA720278",
      "PA719890",
      "PA719440",
      "PA719338",
      "PA720590",
      "PA722170",
      "PA719882",
      "PA720538",
      "PA721426",
      "PA721718",
      "PA718876",
      "PA719922",
      "PA719092",
      "PA719154",
      "PA719830",
      "PA642695",
      "PA720780",
      "PA607155",
      "PA721372",
      "PA721876",
      "PA719624",
      "PA721278",
      "PA722366"
    ],
    "texteAffichable": "Mme&#160;Limon,  Mme&#160;Le Feur, Mme&#160;de Lavergne, M.&#160;Djebbari, M.&#160;Damien&#160;Adam, M.&#160;Anato, Mme&#160;Beaudouin-Hubiere, M.&#160;Besson-Moreau, Mme&#160;Bessot Ballot, Mme&#160;Blanc, M.&#160;Blein, M.&#160;Bothorel, Mme&#160;Brunet, M.&#160;Cazenove, M.&#160;Cellier, Mme&#160;Crouzet, M.&#160;Daniel, M.&#160;Delpon, M.&#160;D&#233;moulin, Mme&#160;Do, Mme&#160;Dubos, Mme&#160;Faure-Muntian, Mme&#160;Hammerer, Mme&#160;Hennion, M.&#160;Hupp&#233;, M.&#160;Kasbarian, Mme&#160;Le Meur, Mme&#160;Lebec, M.&#160;Lescure, M.&#160;Lioger, M.&#160;Martin, Mme&#160;Melchior, M.&#160;Nogal, Mme&#160;O&apos;Petit, Mme&#160;Oppelt, Mme&#160;Petel, M.&#160;Potterie, M.&#160;Sempastous, M.&#160;Sommer, Mme&#160;Tiegna, Mme&#160;Pascale&#160;Boyer, Mme&#160;Yolaine&#160;de Courson, M.&#160;Fugit, Mme&#160;Josso, Mme&#160;Marsaud, M.&#160;Perrot, Mme&#160;Rossi, Mme&#160;Pompili, Mme&#160;Vanceunebrock-Mialon, M.&#160;Zulesi, Mme&#160;Abba, M.&#160;Arend, Mme&#160;Brulebois, M.&#160;Buchou, M.&#160;Causse, M.&#160;Cesarini, M.&#160;Colas-Roy, Mme&#160;Couillard, Mme&#160;De Temmerman, M.&#160;Dombreval, M.&#160;Haury, Mme&#160;Kerbarh, M.&#160;Krabal, M.&#160;Fran&#231;ois-Michel&#160;Lambert, M.&#160;Leclabart, Mme&#160;Maillart-M&#233;haignerie, Mme&#160;Meynier-Millefert, M.&#160;Morenas, M.&#160;Orphelin, Mme&#160;Panonacle, Mme&#160;Park, M.&#160;Perea, M.&#160;Pichereau, Mme&#160;Riotton, Mme&#160;Sarles, M.&#160;Thi&#233;baut, Mme&#160;Tuffnell, M.&#160;Ferrand et les membres du groupe La R&#233;publique en Marche"
  },
  "pointeurFragmentTexte": {
    "division": {
      "titre": "Article 4",
      "articleDesignationCourte": "ART. 4",
      "type": "ARTICLE",
      "avantAApres": "A",
      "divisionRattachee": "ARTICLE 4",
      "urlDivisionTexteVise": "/15/textes/0902.asp#D_Article_4"
    },
    "alinea": {
      "avantAApres": "A",
      "numero": "7",
      "alineaDesignation": "Alinéa 7"
    }
  },
  "corps": {
    "dispositif": "<p style=\"text-align: justify;\">Apr&#232;s l&#8217;alin&#233;a&#160;7, ins&#233;rer les deux alin&#233;as suivants&#160;:</p><p style=\"text-align: justify;\">&#171;&#160;5&#176; Apr&#232;s le quatri&#232;me alin&#233;a, il est ins&#233;r&#233; un alin&#233;a ainsi r&#233;dig&#233;&#160;:</p><p style=\"text-align: justify;\">&#171;&#160;Il peut &#233;mettre &#224; la demande d&#8217;une organisation membre d&#8217;une interprofession tout avis ou recommandation sur les indicateurs mentionn&#233;s &#224; l&#8217;avant dernier alin&#233;a du II de l&#8217;article&#160;L.&#160;631&#8209;24&#160;&#187;.</p>",
    "exposeSommaire": "<p style=\"text-align: justify;\">Cet amendement vise &#224; permettre au m&#233;diateur des relations commerciales agricoles de recommander des indicateurs quand les interprofessions ne se sont pas saisies de la possibilit&#233; d&#8217;&#233;laborer de tels indicateurs ou n&#8217;ont pas abouti &#224; un consensus en ce sens.</p>"
  },
  "representations": [
    {
      "nom": "PDF",
      "typeMime": {
        "type": "application",
        "subType": "PDF"
      },
      "statutRepresentation": {
        "verbatim": true,
        "canonique": true,
        "officielle": true,
        "transcription": false,
        "enregistrement": false
      },
      "contenu": {
        "documentURI": "/15/amendements/0902/AN/2268.pdf"
      }
    }
  ],
  "seanceDiscussion": "RUANR5L15S2018IDS21052",
  "sort": {
    "dateSaisie": "2018-05-24T17:34:55.000+02:00",
    "sortEnSeance": "Adopté"
  },
  "dateDepot": "2018-05-17T02:00:00.000+02:00",
  "dateDistribution": "2018-05-21T02:00:00.000+02:00",
  "article99": "0",
  "loiReference": {}
}