{
  "uid": "AMANR5L15PO59048B2272P2D1N1514",
  "identifiant": {
    "legislature": "15",
    "numero": "1514",
    "numRect": "0",
    "saisine": {
      "texteLegislatifRef": "PRJLANR5L15B2272",
      "numeroPartiePLF": "2",
      "organeExamen": "PO59048",
      "mentionSecondeDeliberation": "0"
    }
  },
  "numeroLong": "II-CF1514",
  "etapeTexte": "1ère lecture (1ère assemblée saisie)",
  "triAmendement": "jbaaaaaaaaaaaaaaaaaaaaaaaaaaaaaaaaaaaaaaaaaaaaaaaaap",
  "cardinaliteAmdtMultiples": "1",
  "etat": "Discuté",
  "signataires": {
    "auteur": {
      "typeAuteur": "Depute",
      "acteurRef": "PA267336",
      "groupePolitiqueRef": "PO730964"
    },
    "cosignatairesRefs": [
      "PA267336"
    ],
    "texteAffichable": "M.&#160;Giraud, rapporteur g&#233;n&#233;ral"
  },
  "pointeurFragmentTexte": {
    "division": {
      "titre": "Article 59",
      "articleDesignationCourte": "APRÈS ART. 59",
      "type": "ARTICLE",
      "avantAApres": "Apres",
      "divisionRattachee": "APRÈS L'ARTICLE 59, insérer l'article suivant:",
      "articleAdditionnel": "1",
      "urlDivisionTexteVise": "/15/textes/2272C.asp#D_Article_59"
    }
  },
  "corps": {
    "dispositif": "<p style=\"text-align: justify;\">I.&#160;&#8211;&#160;Le 2 <i>septies</i> de l&#8217;article&#160;283 du code g&#233;n&#233;ral des imp&#244;ts est compl&#233;t&#233; par un alin&#233;a ainsi r&#233;dig&#233;&#160;:</p><p style=\"text-align: justify;\">&#171;&#160;Pour les transferts de certificats de garanties d&#8217;origine et de garanties de capacit&#233;s mentionn&#233;es aux articles L.&#160;314&#8209;14 et L.&#160;335&#8209;3 du code de l&#8217;&#233;nergie, la taxe est acquitt&#233;e par l&#8217;assujetti b&#233;n&#233;ficiaire du transfert.&#160;&#187;</p><p style=\"text-align: justify;\">II.&#160;&#8211;&#160;Le I s&#8217;applique aux op&#233;rations factur&#233;es &#224; compter du 1<sup>er</sup> janvier 2020.</p>",
    "exposeSommaire": "<p style=\"text-align: justify;\">Les r&#232;gles europ&#233;ennes de droit commun de la TVA qui r&#233;gissent les transferts de droits incorporels sous la forme de certificats peuvent s&#8217;av&#233;rer propices &#224; certains sch&#233;mas de fraude.</p><p style=\"text-align: justify;\">&#192; cet &#233;gard, alors que l&#8217;acquisition par un assujetti &#233;tabli en France de tels certificats aupr&#232;s d&#8217;un fournisseur &#233;tabli hors de France ne donne pas lieu &#224; un paiement de la TVA (auto-liquidation de la taxe), leur revente &#224; un acheteur &#233;tabli en France est soumise &#224; la TVA dans les conditions habituelles. Si, lors de la revente du certificat, l&#8217;assujetti ne reverse pas au Tr&#233;sor la TVA qui porte sur l&#8217;int&#233;gralit&#233; du prix alors qu&#8217;il n&#8217;a pas support&#233; de TVA &#224; d&#233;duire, le risque de voir se d&#233;velopper une fraude de type &#171;&#160;carrousel&#160;&#187; est r&#233;el.</p><p style=\"text-align: justify;\">Sur le march&#233; de l&#8217;&#233;lectricit&#233;, il existe deux types de certificats&#160;: d&#8217;une part, les certificats de garantie d&#8217;origine (CGO), qui servent &#224; prouver au client final qu&#8217;une part ou une quantit&#233; d&#233;termin&#233;e d&#8217;&#233;nergie a &#233;t&#233; produite &#224; partir de sources d&#8217;&#233;nergie renouvelables ou par cog&#233;n&#233;ration&#160;; d&#8217;autre part, les garanties de capacit&#233;, dont l&#8217;objectif est de garantir &#224; tout instant l&#8217;&#233;quilibre entre production et consommation sur un r&#233;seau &#233;lectrique et ainsi &#224; assurer la s&#233;curit&#233; de l&#8217;approvisionnement, en particulier lors des pics de demande. Ces deux types de certificats sont cessibles et n&#233;gociables de gr&#233; &#224; gr&#233; ou aux ench&#232;res.</p><p style=\"text-align: justify;\">Les instances de l&#8217;Union europ&#233;enne, certains de nos partenaires europ&#233;ens ainsi que les services de contr&#244;le fran&#231;ais ont d&#233;tect&#233; r&#233;cemment des tentatives de fraude &#224; la TVA sur les march&#233;s de CGO.</p><p style=\"text-align: justify;\">Le Royaume-Uni a introduit, le 14 juin 2019, le m&#233;canisme de l&#8217;auto-liquidation de la TVA sur ce march&#233;.</p><p style=\"text-align: justify;\">Afin de pr&#233;venir les risques pr&#233;c&#233;demment d&#233;crits, le pr&#233;sent amendement met en &#339;uvre un dispositif d&#8217;auto-liquidation de la TVA pour les transferts de CGO et de garanties de capacit&#233;s.</p><p style=\"text-align: justify;\">Une telle mesure, d&#233;rogatoire au droit commun de la TVA, est permise sans autorisation pr&#233;alable du Conseil de l&#8217;Union europ&#233;enne. Elle s&#8217;inscrit dans le cadre de l&#8217;exercice de la facult&#233; pr&#233;vue &#224; l&#8217;article&#160;199 <i>bis</i>, paragraphe 1, point f, de la directive n&#176;&#160;2006/112/UE du Conseil du 28&#160;novembre&#160;2006 relative au syst&#232;me commun de la TVA, qui pr&#233;voit que les &#201;tats membres peuvent rendre redevables de la TVA les assujettis destinataires des livraisons de certificats de gaz et d&#8217;&#233;lectricit&#233;.</p><p style=\"text-align: justify;\">.</p>"
  },
  "representations": [
    {
      "nom": "PDF",
      "typeMime": {
        "type": "application",
        "subType": "PDF"
      },
      "statutRepresentation": {
        "verbatim": true,
        "canonique": true,
        "officielle": true,
        "transcription": false,
        "enregistrement": false
      },
      "contenu": {
        "documentURI": "/15/amendements/2272C/CION_FIN/CF1514.pdf"
      }
    }
  ],
  "sort": {
    "dateSaisie": "2019-11-06T22:33:51.000+01:00",
    "sortEnSeance": "Adopté"
  },
  "dateDepot": "2019-11-02T01:00:00.000+01:00",
  "dateDistribution": "2019-11-06T01:00:00.000+01:00",
  "article99": "0",
  "loiReference": {
    "codeLoi": "CGI",
    "divisionCodeLoi": "283"
  }
}