{
  "uid": "AMANR5L15SEA717460BTC0857P0D1N518",
  "identifiant": {
    "legislature": "15",
    "numero": "518",
    "numRect": "0",
    "saisine": {
      "texteLegislatifRef": "PRJLANR5L15BTC0857",
      "numeroPartiePLF": "0",
      "organeExamen": "PO717460",
      "mentionSecondeDeliberation": "0"
    }
  },
  "numeroLong": "518",
  "etapeTexte": "1ère lecture (1ère assemblée saisie)",
  "triAmendement": "aj",
  "cardinaliteAmdtMultiples": "1",
  "etat": "Discuté",
  "signataires": {
    "auteur": {
      "typeAuteur": "Depute",
      "acteurRef": "PA330240",
      "groupePolitiqueRef": "PO730934"
    },
    "cosignatairesRefs": [
      "PA721506",
      "PA266774",
      "PA267289",
      "PA719318",
      "PA643103",
      "PA721054",
      "PA267200",
      "PA267794",
      "PA334149",
      "PA856",
      "PA2529",
      "PA267440",
      "PA2155",
      "PA713448",
      "PA709315",
      "PA607090",
      "PA605036",
      "PA1695",
      "PA336316",
      "PA266776",
      "PA2792",
      "PA718850",
      "PA267260",
      "PA609245",
      "PA643134",
      "PA346218",
      "PA721410",
      "PA267901",
      "PA719272",
      "PA606098",
      "PA718838",
      "PA2960",
      "PA718884",
      "PA721816",
      "PA923",
      "PA720684",
      "PA267735",
      "PA346054",
      "PA267378",
      "PA345722",
      "PA267527",
      "PA998",
      "PA608416",
      "PA1498",
      "PA722390",
      "PA267204",
      "PA720210",
      "PA720630",
      "PA721678",
      "PA720586",
      "PA2796",
      "PA1012",
      "PA266797",
      "PA330684",
      "PA721636",
      "PA719946",
      "PA330240",
      "PA720100",
      "PA606712",
      "PA1874",
      "PA746",
      "PA267429",
      "PA605991",
      "PA2086",
      "PA609726",
      "PA712015",
      "PA332523",
      "PA642847",
      "PA330909",
      "PA267324",
      "PA223837",
      "PA1630",
      "PA266808",
      "PA721070",
      "PA1029",
      "PA718784",
      "PA608016",
      "PA342935",
      "PA267318",
      "PA340853",
      "PA721968",
      "PA721046",
      "PA330788",
      "PA266793",
      "PA721314",
      "PA767",
      "PA748954",
      "PA608826",
      "PA718780",
      "PA2377",
      "PA721474",
      "PA720386",
      "PA720644",
      "PA1327",
      "PA330008",
      "PA721126",
      "PA334654",
      "PA334843",
      "PA2492",
      "PA721286"
    ],
    "texteAffichable": "M.&#160;Ciotti,  M.&#160;Jacob, M.&#160;Abad, Mme&#160;Anthoine, M.&#160;Aubert, Mme&#160;Bassire, M.&#160;Bazin, Mme&#160;Bazin-Malgras, Mme&#160;Beauvais, Mme&#160;Bonnivard, M.&#160;Bony, M.&#160;Boucard, M.&#160;Bouchet, Mme&#160;Val&#233;rie&#160;Boyer, Mme&#160;Brenier, M.&#160;Breton, M.&#160;Brochand, M.&#160;Brun, M.&#160;Carrez, M.&#160;Cattin, M.&#160;Cherpion, M.&#160;Cinieri, M.&#160;Cordier, Mme&#160;Corneloup, M.&#160;Cornut-Gentille, Mme&#160;Dalloz, M.&#160;Dassault, M.&#160;de Ganay, M.&#160;de la Verpilli&#232;re, M.&#160;Deflesselles, M.&#160;Descoeur, M.&#160;Di Filippo, M.&#160;Diard, M.&#160;Dive, M.&#160;Door, Mme&#160;Marianne&#160;Dubois, Mme&#160;Duby-Muller, M.&#160;Pierre-Henri&#160;Dumont, M.&#160;Fasquelle, M.&#160;Ferrara, M.&#160;Forissier, M.&#160;Furst, M.&#160;Gaultier, Mme&#160;Genevard, M.&#160;Goasguen, M.&#160;Gosselin, M.&#160;Grelier, Mme&#160;Guion-Firmin, M.&#160;Herbillon, M.&#160;Hetzel, M.&#160;Huyghe, M.&#160;Kamardine, Mme&#160;Kuster, Mme&#160;Lacroute, M.&#160;Le Fur, Mme&#160;Le Grip, M.&#160;Leclerc, Mme&#160;Levy, M.&#160;Lorion, Mme&#160;Louwagie, M.&#160;Lurton, M.&#160;Emmanuel&#160;Maquet, M.&#160;Marleix, M.&#160;Marlin, M.&#160;Masson, M.&#160;Menuel, Mme&#160;Meunier, M.&#160;Minot, M.&#160;Nury, M.&#160;Parigi, M.&#160;Pauget, M.&#160;Peltier, M.&#160;Perrut, Mme&#160;Poletti, M.&#160;Pradi&#233;, M.&#160;Quentin, M.&#160;Ramadier, Mme&#160;Ramassamy, M.&#160;Reda, M.&#160;Reiss, M.&#160;Reitzer, M.&#160;Reyn&#232;s, M.&#160;Rolland, M.&#160;Saddier, M.&#160;Savignat, M.&#160;Schellenberger, M.&#160;Sermier, M.&#160;Straumann, Mme&#160;Tabarot, M.&#160;Taugourdeau, M.&#160;Teissier, Mme&#160;Trastour-Isnart, Mme&#160;Valentin, M.&#160;Vatin, M.&#160;Verch&#232;re, M.&#160;Viala, M.&#160;Vialay, M.&#160;Jean-Pierre&#160;Vigier, M.&#160;Viry et M.&#160;Woerth"
  },
  "pointeurFragmentTexte": {
    "division": {
      "titre": "Article 19 bis",
      "articleDesignationCourte": "APRÈS ART. 19 BIS",
      "type": "ARTICLE",
      "avantAApres": "Apres",
      "divisionRattachee": "APRÈS L'ARTICLE 19 BIS, insérer l'article suivant:",
      "articleAdditionnel": "1",
      "urlDivisionTexteVise": "/15/textes/0857.asp#D_Article_19_bis"
    }
  },
  "corps": {
    "dispositif": "<p style=\"text-align: justify;\">L&#8217;article L.&#160;611&#8209;3 du code de l&#8217;entr&#233;e et du s&#233;jour des &#233;trangers et du droit d&#8217;asile est compl&#233;t&#233; par un alin&#233;a ainsi r&#233;dig&#233;&#160;:&#160;</p><p style=\"text-align: justify;\">&#171;&#160;Il en est de m&#234;me des personnes d&#233;clar&#233;es majeures &#224; l&#8217;issue de la p&#233;riode provisoire d&#8217;accueil&#160;pr&#233;vue au I de l&#8217;article R.221&#8209;11 du code de l&#8217;action sociale et des familles.&#160;&#187;</p>",
    "exposeSommaire": "<p style=\"text-align: justify;\">Afin de lutter contre le &#171;&#160;nomadisme&#160;&#187; administratif des personnes qui se font passer pour des mineurs priv&#233;s de la protection de leur famille, il est propos&#233; d&#8217;ouvrir la possibilit&#233; de cr&#233;er un fichier biom&#233;trique des personnes d&#233;clar&#233;es majeures &#224; l&#8217;issue de la phase dite &#171;&#160;d&#8217;&#233;valuation&#160;&#187;, qui conduit le conseil d&#233;partemental &#224; statuer sur la situation de l&#8217;ensemble des demandeurs de protection se d&#233;clarant mineurs.&#160;</p><p style=\"text-align: justify;\">L&#8217;objectif est triple&#160;: dans un souci d&#8217;efficacit&#233; de l&#8217;action publique, il s&#8217;agit &#224; la fois de lutter contre les r&#233;&#233;valuations, mais aussi en cons&#233;quence de baisser les d&#233;penses d&#8217;&#233;valuations que consentent les d&#233;partements ainsi que les d&#233;lais actuels d&#8217;investigation, lesquels d&#233;passent largement le d&#233;lai r&#233;glementaire de cinq jours du fait de l&#8217;afflux massif des arriv&#233;es de jeunes migrants.&#160;</p>"
  },
  "representations": [
    {
      "nom": "PDF",
      "typeMime": {
        "type": "application",
        "subType": "PDF"
      },
      "statutRepresentation": {
        "verbatim": true,
        "canonique": true,
        "officielle": true,
        "transcription": false,
        "enregistrement": false
      },
      "contenu": {
        "documentURI": "/15/amendements/0857/AN/518.pdf"
      }
    }
  ],
  "seanceDiscussion": "RUANR5L15S2018IDS21078",
  "sort": {
    "dateSaisie": "2018-04-22T09:37:24.000+02:00",
    "sortEnSeance": "Rejeté"
  },
  "dateDepot": "2018-04-12T02:00:00.000+02:00",
  "dateDistribution": "2018-04-16T02:00:00.000+02:00",
  "article99": "0",
  "loiReference": {
    "codeLoi": "c entrée et séjour étrangers",
    "divisionCodeLoi": "L611-3"
  }
}