{
  "uid": "AMANR5L15SEA717460B1255P2D1N2411",
  "identifiant": {
    "legislature": "15",
    "numero": "2411",
    "numRect": "0",
    "saisine": {
      "texteLegislatifRef": "PRJLANR5L15B1255",
      "numeroPartiePLF": "2",
      "organeExamen": "PO717460",
      "mentionSecondeDeliberation": "0"
    }
  },
  "numeroLong": "II-2411",
  "etapeTexte": "1ère lecture (1ère assemblée saisie)",
  "triAmendement": "ebiaaaaaaaaaaaaaaaaaaaaaaaaaaaaaaaaaaaaaaaaaaaaaaamae",
  "cardinaliteAmdtMultiples": "1",
  "etat": "Discuté",
  "signataires": {
    "auteur": {
      "typeAuteur": "Depute",
      "acteurRef": "PA721836",
      "groupePolitiqueRef": "PO730970"
    },
    "cosignatairesRefs": [
      "PA717151",
      "PA720178",
      "PA720720",
      "PA722284",
      "PA719918",
      "PA718978",
      "PA721992",
      "PA722374",
      "PA721742",
      "PA720704",
      "PA719640",
      "PA719504",
      "PA722162",
      "PA719210",
      "PA721608",
      "PA721734",
      "PA721836",
      "PA719488",
      "PA720002",
      "PA721234",
      "PA720162",
      "PA719874",
      "PA721984",
      "PA720976",
      "PA719044",
      "PA720772",
      "PA720334",
      "PA720968",
      "PA720326",
      "PA720598",
      "PA719266",
      "PA720092",
      "PA720652",
      "PA720764",
      "PA720728",
      "PA720924",
      "PA720746",
      "PA1276",
      "PA721182",
      "PA721530",
      "PA721924",
      "PA721418",
      "PA720256",
      "PA721976",
      "PA719558"
    ],
    "texteAffichable": "M.&#160;Barrot,  M.&#160;Bourlanges, Mme&#160;El Ha&#239;ry, M.&#160;Laqhila, M.&#160;Mattei, M.&#160;Balanant, Mme&#160;Bannier, Mme&#160;Benin, M.&#160;Berta, M.&#160;Bolo, M.&#160;Bru, M.&#160;Cubertafon, Mme&#160;de Sarnez, Mme&#160;de Vaucouleurs, Mme&#160;Deprez-Audebert, M.&#160;Duverg&#233;, Mme&#160;Elimas, Mme&#160;Essayan, M.&#160;Fanget, Mme&#160;Florennes, M.&#160;Fuchs, Mme&#160;Gallerneau, M.&#160;Garcia, M.&#160;Hammouche, M.&#160;Isaac-Sibille, Mme&#160;Jacquier-Laforge, M.&#160;Joncour, M.&#160;Lagleize, M.&#160;Lain&#233;, Mme&#160;Lasserre-David, M.&#160;Latombe, Mme&#160;Luquet, M.&#160;Mathiasin, Mme&#160;Mette, M.&#160;Michel-Kleisbauer, M.&#160;Mignola, M.&#160;Millienne, M.&#160;Pahun, M.&#160;Fr&#233;d&#233;ric&#160;Petit, Mme&#160;Maud&#160;Petit, Mme&#160;Poueyto, M.&#160;Ramos, M.&#160;Turquois, Mme&#160;Vichnievsky et M.&#160;Waserman"
  },
  "pointeurFragmentTexte": {
    "division": {
      "titre": "Article 51",
      "articleDesignationCourte": "APRÈS ART. 51",
      "type": "ARTICLE",
      "avantAApres": "Apres",
      "divisionRattachee": "APRÈS L'ARTICLE 51, insérer l'article suivant:",
      "articleAdditionnel": "1",
      "urlDivisionTexteVise": "/15/textes/1255C.asp#D_Article_51"
    }
  },
  "corps": {
    "dispositif": "<p style=\"text-align: justify;\">I.&#160;&#8211;&#160;Au deuxi&#232;me alin&#233;a du II de l&#8217;article&#160;163 bis G du code g&#233;n&#233;ral des imp&#244;ts, apr&#232;s le mot&#160;: &#171;&#160;d&#233;tiennent&#160;&#187;, sont ins&#233;r&#233;s les mots&#160;: &#171;&#160;directement ou indirectement&#160;&#187;.</p><p style=\"text-align: justify;\">II.&#160;&#8211;&#160;Le I s&#8217;applique aux op&#233;rations r&#233;alis&#233;es &#224; compter&#160;du&#160;1<sup>er</sup> janvier 2019.</p><p style=\"text-align: justify;\">III&#160;&#8211;&#160;La perte de recettes pour l&#8217;&#201;tat est compens&#233;e &#224; due concurrence par la cr&#233;ation d&#8217;une taxe additionnelle aux droits pr&#233;vus aux articles 575 et 575 A du Code g&#233;n&#233;ral des imp&#244;ts.</p>",
    "exposeSommaire": "<p style=\"text-align: justify;\">L&#8217;extension du champ d&#8217;application des bons de souscription de parts de cr&#233;ateur d&#8217;entreprise (BSPCE) est la cons&#233;quence n&#233;cessaire et naturelle de l&#8217;&#233;volution de la place du salari&#233; dans l&#8217;entreprise. En effet, l&#8217;esprit entrepreneurial ne touche pas seulement les entrepreneurs mais &#233;galement les salari&#233;s. De plus en plus de soci&#233;t&#233;s, soucieuses de l&#8217;impulsion de l&#8217;&#233;cosyst&#232;me entrepreneurship et des start-up, d&#233;veloppent une nouvelle approche du travail en dotant leurs salari&#233;s de moyens pour exprimer leur cr&#233;ativit&#233; et leur proactivit&#233;. Donnons donc, &#224; davantage de soci&#233;t&#233;s, les outils de motiver leurs salari&#233;s notamment avec les BSPCE.</p><p style=\"text-align: justify;\">Par cons&#233;quent, les diff&#233;rentes structurations de cha&#238;ne de participation de soci&#233;t&#233;s ne devraient pas limiter les volont&#233;s des entreprises sous-jacentes d&#8217;impliquer leurs salari&#233;s et de les r&#233;mun&#233;rer &#224; hauteur de leurs initiatives entrepreneuriales.</p><p style=\"text-align: justify;\">De plus, le dispositif actuel g&#233;n&#232;re, malgr&#233; une situation similaire, une disparit&#233; de traitement entre les salari&#233;s d&#8217;une filiale et les salari&#233;s d&#8217;une sous-filiale. En effet, les premiers peuvent b&#233;n&#233;ficier des BSPCE contrairement aux seconds.</p><p style=\"text-align: justify;\">Le pr&#233;sent amendement vise donc &#224; pr&#233;ciser la possibilit&#233; pour les soci&#233;t&#233;s &#233;mettrices de BSPCE, d&#8217;en attribuer aux salari&#233;s des filiales ou sous-filiales dont elles d&#233;tiennent directement ou indirectement au moins 75&#160;% du capital ou des droits de vote, pour r&#233;tablir l&#8217;&#233;galit&#233; de traitement entre les salari&#233;s d&#8217;un m&#234;me groupe.</p>"
  },
  "representations": [
    {
      "nom": "PDF",
      "typeMime": {
        "type": "application",
        "subType": "PDF"
      },
      "statutRepresentation": {
        "verbatim": true,
        "canonique": true,
        "officielle": true,
        "transcription": false,
        "enregistrement": false
      },
      "contenu": {
        "documentURI": "/15/amendements/1255C/AN/2411.pdf"
      }
    }
  ],
  "seanceDiscussion": "RUANR5L15S2019IDS21342",
  "sort": {
    "dateSaisie": "2018-11-15T15:37:40.000+01:00",
    "sortEnSeance": "Retiré"
  },
  "dateDepot": "2018-11-12T01:00:00.000+01:00",
  "dateDistribution": "2018-11-13T01:00:00.000+01:00",
  "article99": "0",
  "loiReference": {
    "codeLoi": "CGI",
    "divisionCodeLoi": "163 bis G"
  }
}