{
  "uid": "AMANR5L15PO420120B0008P0D1N3",
  "identifiant": {
    "legislature": "15",
    "numero": "3",
    "numRect": "0",
    "saisine": {
      "texteLegislatifRef": "PRJLANR5L15B0008",
      "numeroPartiePLF": "0",
      "organeExamen": "PO420120",
      "mentionSecondeDeliberation": "0"
    }
  },
  "numeroLong": "AS3",
  "etapeTexte": "1ère lecture (1ère assemblée saisie)",
  "triAmendement": "m",
  "cardinaliteAmdtMultiples": "1",
  "etat": "Discuté",
  "signataires": {
    "auteur": {
      "typeAuteur": "Depute",
      "acteurRef": "PA719072",
      "groupePolitiqueRef": "PO730964"
    },
    "cosignatairesRefs": [
      "PA719072"
    ],
    "texteAffichable": "M.&#160;Mesnier, rapporteur"
  },
  "pointeurFragmentTexte": {
    "division": {
      "titre": "Article unique",
      "articleDesignationCourte": "APRÈS ART. UNIQUE",
      "type": "ARTICLE",
      "avantAApres": "Apres",
      "divisionRattachee": "APRÈS L'ARTICLE UNIQUE, insérer l'article suivant:",
      "articleAdditionnel": "1",
      "chapitreAdditionnel": "0",
      "urlDivisionTexteVise": "/15/textes/0008.asp#D_Article_unique"
    }
  },
  "corps": {
    "dispositif": "<p style=\"text-align: justify;\">Au troisi&#232;me alin&#233;a du I de l&#8217;article&#160;14 de l&#8217;ordonnance n&#176;&#160;2017&#8209;644 du 27 avril 2017 relative &#224; l&#8217;adaptation des dispositions l&#233;gislatives relatives au fonctionnement des ordres des professions de sant&#233;, l&#8217;ann&#233;e&#160;: &#171;&#160;2019&#160;&#187; est remplac&#233;e par l&#8217;ann&#233;e&#160;: &#171;&#160;2020&#160;&#187;.</p>",
    "exposeSommaire": "<p style=\"text-align: justify;\">Cet amendement proc&#232;de au report de l&#8217;application de deux dispositions pr&#233;vues par les ordonnances&#160;:</p><p style=\"text-align: justify;\">- la certification des comptes combin&#233;s au niveau national&#160;;</p><p style=\"text-align: justify;\">- l&#8217;application de la soumission aux r&#232;gles des march&#233;s publics.</p><p style=\"text-align: justify;\">L&#8217;ordonnance pr&#233;voit une application au 1<sup>er</sup> janvier 2019. Il est propos&#233; un d&#233;lai d&#8217;un an suppl&#233;mentaire pour permettre aux ordres de s&#8217;y pr&#233;parer.</p>"
  },
  "representations": [
    {
      "nom": "PDF",
      "typeMime": {
        "type": "application",
        "subType": "PDF"
      },
      "statutRepresentation": {
        "verbatim": true,
        "canonique": true,
        "officielle": true,
        "transcription": false,
        "enregistrement": false
      },
      "contenu": {
        "documentURI": "/15/amendements/0008/CION-SOC/AS3.pdf"
      }
    }
  ],
  "sort": {
    "dateSaisie": "2017-07-12T10:51:31.000+02:00",
    "sortEnSeance": "Adopté"
  },
  "dateDepot": "2017-07-11T02:00:00.000+02:00",
  "dateDistribution": "2017-07-11T02:00:00.000+02:00",
  "article99": "0",
  "loiReference": {
    "codeLoi": "zzz"
  }
}