{
  "uid": "AMANR5L15SEA717460BTC1629P0D1N989",
  "identifiant": {
    "legislature": "15",
    "numero": "989",
    "numRect": "0",
    "saisine": {
      "texteLegislatifRef": "PRJLANR5L15BTC1629",
      "numeroPartiePLF": "0",
      "organeExamen": "PO717460",
      "mentionSecondeDeliberation": "0"
    }
  },
  "numeroLong": "989",
  "etapeTexte": "1ère lecture (1ère assemblée saisie)",
  "triAmendement": "apaaaaaaaaaaaaaaaaaaaaaaaaaaaaaaaaaaaaaaaaaaaaaaaazx",
  "cardinaliteAmdtMultiples": "1",
  "etat": "Irrecevable",
  "signataires": {
    "auteur": {
      "typeAuteur": "Depute",
      "acteurRef": "PA643134",
      "groupePolitiqueRef": "PO730934"
    },
    "cosignatairesRefs": [
      "PA720586",
      "PA719318",
      "PA643134"
    ],
    "texteAffichable": "Mme&#160;Valentin,  Mme&#160;Anthoine et M.&#160;Vatin"
  },
  "pointeurFragmentTexte": {
    "division": {
      "titre": "Article 3",
      "articleDesignationCourte": "APRÈS ART. 3",
      "type": "ARTICLE",
      "avantAApres": "Apres",
      "divisionRattachee": "APRÈS L'ARTICLE 3, insérer l'article suivant:",
      "articleAdditionnel": "1",
      "urlDivisionTexteVise": "/15/textes/1629.asp#D_Article_3"
    }
  },
  "corps": {
    "dispositif": "<p>I-&#160;&#160;&#160;&#160;&#160;&#160;&#160;&#160;&#160;&#160;&#160;&#160;&#160;&#160;&#160;&#160; Le titre premier du livre Ier de la premi&#232;re partie du code de l&#8217;&#233;ducation est compl&#233;t&#233; par un chapitre ainsi r&#233;dig&#233;&#160;:</p><p>&#171;&#160;chapitre IV</p><p>&#171;&#160;Dispositions particuli&#232;res &#224; la scolarisation des enfants dans les territoires de montagne&#160;&#187;</p>",
    "exposeSommaire": "<p>L&#8217;article 15 de la loi montagne s&#8217;applique par la carte scolaire. L&#8217;am&#233;nagement du territoire mais surtout l&#8217;am&#233;nagement global du territoire est un vrai choix politique.</p><p>Les fermetures ne peuvent &#234;tre discut&#233;es uniquement sur la base du seuil du nombre d&#8217;enfants. Cette id&#233;e serait une remise en cause de notre conception fran&#231;aise du service public.</p><p>Pour les zones de montagne, les fermetures d&#8217;&#233;coles ne peuvent &#234;tre discut&#233; sur la base du seuil du nombre d&#8217;enfants.</p><p>La discussion relative &#224; la carte scolaire, les ouvertures et les fermeture d&#8217;&#233;coles dans nos zonez rurales am&#232;nent les habitants &#224; quitter leur commune. Ce m&#233;canisme pervers remet en question l&#8217;&#233;quilibre de nos territoires et aggrave encore un peu plus la fracture sociale et territoriale.</p>"
  },
  "representations": [
    {
      "nom": "PDF",
      "typeMime": {
        "type": "application",
        "subType": "PDF"
      },
      "statutRepresentation": {
        "verbatim": true,
        "canonique": true,
        "officielle": true,
        "transcription": false,
        "enregistrement": false
      },
      "contenu": {
        "documentURI": "/15/amendements/1629/AN/989.pdf"
      }
    }
  ],
  "dateDepot": "2019-02-07T01:00:00.000+01:00",
  "dateDistribution": "2019-02-07T01:00:00.000+01:00",
  "article99": "0",
  "loiReference": {}
}