{
  "uid": "AMANR5L15PO419865B1831P0D1N1188",
  "identifiant": {
    "legislature": "15",
    "numero": "1188",
    "numRect": "0",
    "saisine": {
      "texteLegislatifRef": "PRJLANR5L15B1831",
      "numeroPartiePLF": "0",
      "organeExamen": "PO419865",
      "mentionSecondeDeliberation": "0"
    }
  },
  "numeroLong": "CD1188",
  "etapeTexte": "1ère lecture (2ème assemblée saisie)",
  "triAmendement": "idoaaaaaaaaaaaaaaaaaaaaaaaaaaaaaaaaaaaaaaaaaaaaaaazzzzzzzzzzzzzzzw",
  "cardinaliteAmdtMultiples": "1",
  "etat": "Discuté",
  "signataires": {
    "auteur": {
      "typeAuteur": "Depute",
      "acteurRef": "PA336175",
      "groupePolitiqueRef": "PO759900"
    },
    "cosignatairesRefs": [
      "PA336175",
      "PA608292",
      "PA719138",
      "PA267042"
    ],
    "texteAffichable": "Mme&#160;Pinel,  Mme&#160;Dubi&#233;, M.&#160;Castellani et M.&#160;Favennec Becot"
  },
  "pointeurFragmentTexte": {
    "division": {
      "titre": "Article 1er A",
      "articleDesignationCourte": "ART. 1ER A",
      "type": "ARTICLE",
      "avantAApres": "A",
      "divisionRattachee": "ARTICLE 1ER A",
      "urlDivisionTexteVise": "/15/textes/1831.asp#D_Article_1er_A"
    },
    "alinea": {
      "numero": "5"
    }
  },
  "corps": {
    "dispositif": "<p>Compl&#233;ter l'alin&#233;a 5 par la phrase suivante :</p><p style=\"text-align: justify;\">&#171; L&#8217;&#201;tat posera des objectifs de r&#233;duction du trafic pour les mobilit&#233;s les plus polluantes. &#187;</p>",
    "exposeSommaire": "<p style=\"text-align: justify;\">Le d&#233;placement le moins polluant est celui que l&#8217;on ne r&#233;alise pas. L&#8217;&#201;tat pourra se donner comme objectif, non pas une augmentation des d&#233;placements (en voyageurs-kilom&#232;tres ou en tonnes-kilom&#232;tres), mais une r&#233;duction des d&#233;placements pour les mobilit&#233;s les plus &#233;nergivores. Cet objectif engendrera une dynamique vertueuse puisque cela permettra de consommer moins d&#8217;espace pour la construction d&#8217;infrastructure, de mieux valoriser les r&#233;seaux existants et de r&#233;aliser des &#233;conomies d&#8217;investissement. Il s&#8217;agira en cons&#233;quence de fl&#233;cher les investissements en premier lieu vers le report modal sur les mobilit&#233;s les moins polluantes, au lieu de viser le &#171;&#160;toujours plus de d&#233;placements&#160;&#187; sur toutes les mobilit&#233;s. Parmi les actions vertueuses r&#233;duisant les d&#233;placements contraints et/ou non souhait&#233;s, l&#8217;&#201;tat gagnera &#224; constituer une bo&#238;te &#224; outils d&#8217;actions vertueuses &#224; promouvoir, incluant (1) les services de proximit&#233;, (2) la relocalisation des activit&#233;s, (3) l&#8217;attractivit&#233; des centres-villes/centres-bourgs ou encore (4) la lutte contre l&#8217;&#233;talement urbain</p>"
  },
  "representations": [
    {
      "nom": "PDF",
      "typeMime": {
        "type": "application",
        "subType": "PDF"
      },
      "statutRepresentation": {
        "verbatim": true,
        "canonique": true,
        "officielle": true,
        "transcription": false,
        "enregistrement": false
      },
      "contenu": {
        "documentURI": "/15/amendements/1831/CION-DVP/CD1188.pdf"
      }
    }
  ],
  "sort": {
    "dateSaisie": "2019-05-20T19:48:41.000+02:00",
    "sortEnSeance": "Non soutenu"
  },
  "dateDepot": "2019-05-07T02:00:00.000+02:00",
  "dateDistribution": "2019-05-20T02:00:00.000+02:00",
  "article99": "0",
  "loiReference": {}
}