{
  "uid": "AMANR5L15SEA717460B0235P2D1N1319",
  "identifiant": {
    "legislature": "15",
    "numero": "1319",
    "numRect": "0",
    "saisine": {
      "texteLegislatifRef": "PRJLANR5L15B0235",
      "numeroPartiePLF": "2",
      "organeExamen": "PO717460",
      "mentionSecondeDeliberation": "0"
    }
  },
  "numeroLong": "II-1319",
  "etapeTexte": "1ère lecture (1ère assemblée saisie)",
  "triAmendement": "h",
  "cardinaliteAmdtMultiples": "1",
  "etat": "Discuté",
  "signataires": {
    "auteur": {
      "typeAuteur": "Depute",
      "acteurRef": "PA720430",
      "groupePolitiqueRef": "PO730958"
    },
    "cosignatairesRefs": [
      "PA720430",
      "PA721210",
      "PA720892",
      "PA718860",
      "PA721226",
      "PA2150",
      "PA722142",
      "PA718868",
      "PA719676",
      "PA720846",
      "PA721062",
      "PA720422",
      "PA719578",
      "PA721202",
      "PA721960",
      "PA588884",
      "PA720286"
    ],
    "texteAffichable": "M.&#160;Bernalicis,  Mme&#160;Autain, M.&#160;Coquerel, M.&#160;Corbi&#232;re, Mme&#160;Fiat, M.&#160;Lachaud, M.&#160;Larive, M.&#160;M&#233;lenchon, Mme&#160;Obono, Mme&#160;Panot, M.&#160;Prud&apos;homme, M.&#160;Quatennens, M.&#160;Ratenon, Mme&#160;Ressiguier, Mme&#160;Rubin, M.&#160;Ruffin et Mme&#160;Taurine"
  },
  "pointeurFragmentTexte": {
    "missionVisee": {
      "idMissionAN": "26",
      "libelleMission": "Relations avec les collectivités territoriales",
      "codeMissionPLF": "B",
      "libelleMissionPLF": "Répartition, par mission et programme, des crédits du budget général"
    },
    "division": {
      "titre": "Article 61",
      "articleDesignationCourte": "APRÈS ART. 61",
      "type": "ARTICLE",
      "avantAApres": "Apres",
      "divisionRattachee": "APRÈS L'ARTICLE 61, insérer l'article suivant:",
      "articleAdditionnel": "1",
      "urlDivisionTexteVise": "/15/textes/0235C.asp#D_Article_61"
    }
  },
  "corps": {
    "dispositif": "<p style=\"text-align: justify;\">Le code g&#233;n&#233;ral des collectivit&#233;s territoriales est ainsi modifi&#233;&#160;:</p><p style=\"text-align: justify;\">1&#176; La seconde phrase du 1 du&#160;II de l&#8217;article L.&#160;2336&#8209;1 est compl&#233;t&#233; par les mots&#160;: &#171;&#160;ainsi que, &#224; partir de l&#8217;ann&#233;e civile 2019, &#224; hauteur de 100 millions d&#8217;euros par an, par la cr&#233;ation d&#8217;une taxe additionnelle aux droits mentionn&#233;s aux articles&#160;575 et&#160;575&#160;A du code g&#233;n&#233;ral des imp&#244;ts&#160;;</p><p style=\"text-align: justify;\">2&#176; Apr&#232;s le&#160;<i>b</i> du&#160;2&#176; du&#160;I de l&#8217;article L.&#160;2336&#8209;3, il est ajout&#233; un&#160;<i>c</i> ainsi r&#233;dig&#233;&#160;:</p><p style=\"text-align: justify;\">&#171;&#160;<i>c)</i> De l&#8217;&#233;cart relatif entre le revenu par habitant de l&#8217;ensemble intercommunal ou le revenu par habitant de la commune isol&#233;e, d&#8217;une part, et le revenu par habitant m&#233;dian, d&#8217;autre part. Le revenu pris en compte est le dernier revenu fiscal de r&#233;f&#233;rence connu. La population prise en compte est celle issue du dernier recensement.&#160;&#187;</p>",
    "exposeSommaire": "<p style=\"text-align: justify;\">Cet amendement pr&#233;voit un renforcement de la p&#233;r&#233;quation au niveau territorial, et donc de la redistribution financi&#232;re entre collectivit&#233;s.</p><p style=\"text-align: justify;\">A cet effet, &#224; partir de 2019, nous proposons que le fond de p&#233;r&#233;quation des collectivit&#233;s soit abond&#233; d&#8217;une nouvelle recette ext&#233;rieure (qui ne soit plus une seule redistribution du produit fiscal autonome des collectivit&#233;s), tel que pr&#233;vu par le (I) de cet amendement.</p><p style=\"text-align: justify;\">En outre, le (II) pr&#233;voit que d&#8217;autres crit&#232;res soient pris en compte pour &#233;tablir le caract&#232;re de collectivit&#233;s b&#233;n&#233;ficiaires, &#224; savoir la prise en compte non plus uniquement du revenu fiscal moyen des habitants, qui peut cacher de nombreuses in&#233;galit&#233;s, mais le revenu fiscal m&#233;dian des habitants.</p>"
  },
  "representations": [
    {
      "nom": "PDF",
      "typeMime": {
        "type": "application",
        "subType": "PDF"
      },
      "statutRepresentation": {
        "verbatim": true,
        "canonique": true,
        "officielle": true,
        "transcription": false,
        "enregistrement": false
      },
      "contenu": {
        "documentURI": "/15/amendements/0235C/AN/1319.pdf"
      }
    }
  ],
  "seanceDiscussion": "RUANR5L15S2018IDS20761",
  "sort": {
    "dateSaisie": "2017-11-15T22:19:28.000+01:00",
    "sortEnSeance": "Rejeté"
  },
  "dateDepot": "2017-11-10T01:00:00.000+01:00",
  "dateDistribution": "2017-11-13T01:00:00.000+01:00",
  "article99": "0",
  "loiReference": {
    "codeLoi": "CGCT",
    "divisionCodeLoi": "L2336-1"
  }
}