{
  "uid": "AMANR5L15PO59048B1255P2D1N8",
  "identifiant": {
    "legislature": "15",
    "numero": "8",
    "numRect": "0",
    "saisine": {
      "texteLegislatifRef": "PRJLANR5L15B1255",
      "numeroPartiePLF": "2",
      "organeExamen": "PO59048",
      "mentionSecondeDeliberation": "0"
    }
  },
  "numeroLong": "II-CF8",
  "etapeTexte": "1ère lecture (1ère assemblée saisie)",
  "triAmendement": "jboaaaaaaaaaaaaaaaaaaaaaaaaaaaaaaaaaaaaaaaaaaaaaaabijy",
  "cardinaliteAmdtMultiples": "1",
  "etat": "Discuté",
  "signataires": {
    "auteur": {
      "typeAuteur": "Depute",
      "acteurRef": "PA608016",
      "groupePolitiqueRef": "PO730934"
    },
    "cosignatairesRefs": [
      "PA721678",
      "PA1874",
      "PA267289",
      "PA608016",
      "PA856",
      "PA340853",
      "PA266797",
      "PA721474",
      "PA330684",
      "PA712015",
      "PA643089",
      "PA642847",
      "PA720644",
      "PA267204",
      "PA605036",
      "PA721410",
      "PA721046",
      "PA608416",
      "PA719318",
      "PA718838",
      "PA330909",
      "PA718884"
    ],
    "texteAffichable": "Mme&#160;Louwagie,  M.&#160;Cherpion, M.&#160;Thi&#233;riot, M.&#160;Nury, M.&#160;Sermier, Mme&#160;Bonnivard, Mme&#160;Val&#233;rie&#160;Boyer, Mme&#160;Anthoine, Mme&#160;Bazin-Malgras, M.&#160;Dive, M.&#160;Le Fur, M.&#160;Abad, M.&#160;Gosselin, M.&#160;Bazin, M.&#160;Hetzel, M.&#160;Door, M.&#160;Leclerc, Mme&#160;Bassire, M.&#160;Descoeur, M.&#160;Brun, M.&#160;Viry et M.&#160;Reda"
  },
  "pointeurFragmentTexte": {
    "division": {
      "titre": "Article 53",
      "articleDesignationCourte": "APRÈS ART. 53",
      "type": "ARTICLE",
      "avantAApres": "Apres",
      "divisionRattachee": "APRÈS L'ARTICLE 53, insérer l'article suivant:",
      "articleAdditionnel": "1",
      "urlDivisionTexteVise": "/15/textes/1255C.asp#D_Article_53"
    }
  },
  "corps": {
    "dispositif": "<p style=\"text-align: justify;\">I.&#160;&#8211;&#160;Les exploitations agricoles mentionn&#233;es &#224; l&#8217;article&#160;63 du code g&#233;n&#233;ral des imp&#244;ts peuvent d&#233;duire de leur r&#233;sultat imposable une somme &#233;gale &#224; 40&#160;% de la valeur d&#8217;origine des agro&#233;quipements hors frais financiers, affect&#233;s &#224; leur activit&#233; et qu&#8217;elles acqui&#232;rent &#224; compter du 15 avril 2019 et jusqu&#8217;au 14 avril 2021 lorsque ces derniers r&#233;pondent &#224; des crit&#232;res technologiques et &#233;cologiques d&#233;finis par d&#233;cret.</p><p style=\"text-align: justify;\">II.&#160;&#8211;&#160;La perte de recettes r&#233;sultant pour l&#8217;&#201;tat du pr&#233;sent article est compens&#233;e, &#224; due concurrence, par la cr&#233;ation d&#8217;une taxe additionnelle aux droits pr&#233;vus aux articles&#160;575 et 575&#160;A du code g&#233;n&#233;ral des imp&#244;ts.</p>",
    "exposeSommaire": "<p style=\"text-align: justify;\">Le pr&#233;sent amendement propose d&#8217;introduire, dans le projet de loi de finances (PLF) &#224; partir de 2019, un m&#233;canisme de suramortissement fiscal pour les investissements r&#233;alis&#233;s par les exploitants agricoles.</p><p style=\"text-align: justify;\">Ce dispositif vise &#224; inciter les exploitants agricoles &#224; s&#8217;engager r&#233;solument dans la transition &#233;cologique de leurs exploitations en optant pour des mat&#233;riels technologiques plus respectueux de l&#8217;environnement.</p><p style=\"text-align: justify;\">En effet, le parc actuel de pulv&#233;risateurs en France estim&#233; &#224; 200.000 mat&#233;riels est ancien et son renouvellement annuel limit&#233;&#160;: 3&#160;% &#224; peine d&#8217;&#233;quipements neufs.</p><p style=\"text-align: justify;\">Selon les donn&#233;es du GIP-Pulv&#233;s l&#8217;&#226;ge moyen du parc serait en effet de 15 ans et la dur&#233;e de vie pourrait &#234;tre estim&#233;e entre 20 et 25 ans.</p><p style=\"text-align: justify;\">Par ailleurs, les industriels, comme les instituts de recherche ou de techniques agricoles, s&#8217;accordent pour estimer que l&#8217;utilisation plus r&#233;pandue de ces technologies, pourrait permettre une r&#233;duction significative et rapide de l&#8217;usage des produits Phyto Pharmaceutiques et ainsi, avoir un impact positif sur l&#8217;environnement et l&#8217;utilisateur.</p><p style=\"text-align: justify;\">Cette situation explique que les technologies r&#233;centes de pulv&#233;risation de pr&#233;cision (coupure de tron&#231;on, localisation, guidage) soient peu repr&#233;sent&#233;es sur les parcs actuels et donc peu utilis&#233;es en proportion.</p><p style=\"text-align: justify;\">Mais il faut &#233;galement noter que ces technologies de pulv&#233;risation de pr&#233;cision ne sont pas toujours propos&#233;es ou demand&#233;es par les clients sur les mat&#233;riels r&#233;cents et qu&#8217;une partie non n&#233;gligeable des mat&#233;riels actuellement vendue en neuf n&#8217;en disposent pas pour des raisons de co&#251;t plus &#233;lev&#233; d&#8217;investissement.</p><p style=\"text-align: justify;\">Le pr&#233;sent amendement vise donc &#224; inscrire dans la loi les engagements pris par le Gouvernement, lors de ces derniers mois, afin de favoriser la transition &#233;cologique de notre agriculture, via des incitations fiscales pour les exploitants agricoles.</p>"
  },
  "representations": [
    {
      "nom": "PDF",
      "typeMime": {
        "type": "application",
        "subType": "PDF"
      },
      "statutRepresentation": {
        "verbatim": true,
        "canonique": true,
        "officielle": true,
        "transcription": false,
        "enregistrement": false
      },
      "contenu": {
        "documentURI": "/15/amendements/1255C/CION_FIN/CF8.pdf"
      }
    }
  ],
  "sort": {
    "dateSaisie": "2018-11-07T15:23:24.000+01:00",
    "sortEnSeance": "Rejeté"
  },
  "dateDepot": "2018-10-15T02:00:00.000+02:00",
  "dateDistribution": "2018-11-06T01:00:00.000+01:00",
  "article99": "0",
  "loiReference": {
    "codeLoi": "impôts",
    "divisionCodeLoi": "63"
  }
}