{
  "uid": "AMANR5L15SEA717460BTC1974P0D1N2979",
  "identifiant": {
    "legislature": "15",
    "numero": "2979",
    "numRect": "1",
    "saisine": {
      "texteLegislatifRef": "PRJLANR5L15BTC1974",
      "numeroPartiePLF": "0",
      "organeExamen": "PO717460",
      "mentionSecondeDeliberation": "0"
    }
  },
  "numeroLong": "2979 (Rect)",
  "etapeTexte": "1ère lecture (2ème assemblée saisie)",
  "triAmendement": "eiaaaaaaaaaaaaaaaaaaaaaaaaaaaaaaaaaaaaaaaaaaaaaaaaabbdho",
  "cardinaliteAmdtMultiples": "1",
  "etat": "Discuté",
  "signataires": {
    "auteur": {
      "typeAuteur": "Depute",
      "acteurRef": "PA720652",
      "groupePolitiqueRef": "PO730970"
    },
    "cosignatairesRefs": [
      "PA721734",
      "PA722374",
      "PA719488",
      "PA720256",
      "PA720162",
      "PA721608",
      "PA720728",
      "PA720002",
      "PA719266",
      "PA721924",
      "PA722284",
      "PA720924",
      "PA720976",
      "PA720652",
      "PA720720",
      "PA719874",
      "PA719044",
      "PA721992",
      "PA722162",
      "PA719210",
      "PA720334",
      "PA720598",
      "PA721234",
      "PA719942",
      "PA721976",
      "PA720704",
      "PA721984",
      "PA720968",
      "PA719558",
      "PA719504",
      "PA718978",
      "PA719640",
      "PA721836",
      "PA1276",
      "PA721418",
      "PA719918",
      "PA720326",
      "PA721182",
      "PA720772",
      "PA720764",
      "PA721742",
      "PA717151",
      "PA720092",
      "PA720178",
      "PA720746",
      "PA721530"
    ],
    "texteAffichable": "M.&#160;Duverg&#233;,  Mme&#160;Gallerneau, Mme&#160;Lasserre-David, Mme&#160;Luquet, M.&#160;Millienne, M.&#160;Pahun, M.&#160;Balanant, Mme&#160;Bannier, M.&#160;Barrot, M.&#160;Baudu, Mme&#160;Benin, M.&#160;Berta, M.&#160;Bolo, M.&#160;Bourlanges, M.&#160;Bru, M.&#160;Cubertafon, Mme&#160;de Sarnez, Mme&#160;de Vaucouleurs, Mme&#160;Deprez-Audebert, Mme&#160;El Ha&#239;ry, Mme&#160;Elimas, Mme&#160;Essayan, M.&#160;Fanget, Mme&#160;Florennes, M.&#160;Fuchs, M.&#160;Garcia, M.&#160;Hammouche, M.&#160;Isaac-Sibille, Mme&#160;Jacquier-Laforge, M.&#160;Joncour, M.&#160;Lagleize, M.&#160;Lain&#233;, M.&#160;Laqhila, M.&#160;Latombe, M.&#160;Mathiasin, M.&#160;Mattei, Mme&#160;Mette, M.&#160;Michel-Kleisbauer, M.&#160;Mignola, M.&#160;Fr&#233;d&#233;ric&#160;Petit, Mme&#160;Maud&#160;Petit, Mme&#160;Poueyto, M.&#160;Ramos, M.&#160;Turquois, Mme&#160;Vichnievsky et M.&#160;Waserman"
  },
  "pointeurFragmentTexte": {
    "division": {
      "titre": "Article 26 B",
      "articleDesignationCourte": "ART. 26 B",
      "type": "ARTICLE",
      "avantAApres": "A",
      "divisionRattachee": "ARTICLE 26 B",
      "urlDivisionTexteVise": "/15/textes/1974.asp#D_Article_26_B"
    },
    "alinea": {
      "numero": "2"
    }
  },
  "corps": {
    "dispositif": "<p style=\"text-align: justify;\">Substituer aux alin&#233;as 2 &#224; 5 les deux alin&#233;as suivants&#160;:</p><p style=\"text-align: justify;\">&#171;&#160;A<i>rt.&#160;L.&#160;224&#8209;11</i>.&#160;&#8211;&#160;Les centrales de r&#233;servation mentionn&#233;es &#224; l&#8217;article L.&#160;3142&#8209;1 du code des transports qui mettent en relation un nombre de conducteurs sup&#233;rieur &#224; un seuil fix&#233; par d&#233;cret s&#8217;assurent qu&#8217;une part minimale, croissante dans le temps, des v&#233;hicules utilis&#233;s dans le cadre de la mise en relation qu&#8217;elles assurent sont des v&#233;hicules &#224; faibles &#233;missions tels que d&#233;finis au 1&#176; de l&#8217;article L.&#160;224&#8209;7 du pr&#233;sent code. Les modalit&#233;s d&#8217;application du pr&#233;sent article, et notamment la part minimale de v&#233;hicules &#224; faibles &#233;missions parmi les v&#233;hicules utilis&#233;s dans le cadre de la mise en relation ainsi que l&#8217;&#233;volution de cette part minimale, sont d&#233;finies par d&#233;cret. Cette trajectoire est &#233;tablie en coh&#233;rence avec la strat&#233;gie bas-carbone pr&#233;vue &#224; l&#8217;article L.&#160;222&#8209;1 B du m&#234;me code.</p><p style=\"text-align: justify;\">&#171;&#160;II.&#160;&#8211;&#160;Le I entre en vigueur &#224; compter du 1<sup>er</sup> janvier 2022.&#160;&#187;</p>",
    "exposeSommaire": "<p style=\"text-align: justify;\">La loi de transition &#233;nerg&#233;tique a trac&#233; des objectifs &#224; horizon 2020 de part minimale de v&#233;hicules &#224; faibles &#233;missions dans le renouvellement du parc des voitures particuli&#232;res appartenant &#224; l&#8217;&#201;tat et &#224; ses &#233;tablissements, aux collectivit&#233;s publiques, aux loueurs de v&#233;hicules automobiles, aux exploitants de taxis et de VTC exploitant un parc de plus de 10 v&#233;hicules. L&#8217;article&#160;26 A compl&#232;te ces trajectoires par des obligations concernant les entreprises g&#233;rant un parc de plus de 100 v&#233;hicules en fixant un seuil de 10&#160;% de v&#233;hicules &#224; faibles ou tr&#232;s faibles &#233;missions.</p><p style=\"text-align: justify;\">Le pr&#233;sent amendement propose de compl&#233;ter l&#8217;article&#160;26 A en poussant les centrales de r&#233;servation &#224; d&#233;velopper des flottes de v&#233;hicules plus respectueuses de l&#8217;environnement.</p>"
  },
  "representations": [
    {
      "nom": "PDF",
      "typeMime": {
        "type": "application",
        "subType": "PDF"
      },
      "statutRepresentation": {
        "verbatim": true,
        "canonique": true,
        "officielle": true,
        "transcription": false,
        "enregistrement": false
      },
      "contenu": {
        "documentURI": "/15/amendements/1974/AN/2979.pdf"
      }
    }
  ],
  "seanceDiscussion": "RUANR5L15S2019IDS21695",
  "sort": {
    "dateSaisie": "2019-06-11T21:41:52.000+02:00",
    "sortEnSeance": "Adopté"
  },
  "dateDepot": "2019-05-29T02:00:00.000+02:00",
  "dateDistribution": "2019-06-06T02:00:00.000+02:00",
  "article99": "0",
  "loiReference": {}
}