{
  "uid": "AMANR5L15SEA717460BTC1414P0D1N16",
  "identifiant": {
    "legislature": "15",
    "numero": "16",
    "numRect": "0",
    "saisine": {
      "texteLegislatifRef": "PIONANR5L15BTC1414",
      "numeroPartiePLF": "0",
      "organeExamen": "PO717460",
      "mentionSecondeDeliberation": "0"
    }
  },
  "numeroLong": "16",
  "etapeTexte": "1ère lecture (1ère assemblée saisie)",
  "triAmendement": "eaaaaaaaaaaaaaaaaaaaaaaaaaaaaaaaaaaaaaaaaaaaaaaaaabc",
  "cardinaliteAmdtMultiples": "1",
  "etat": "Discuté",
  "signataires": {
    "auteur": {
      "typeAuteur": "Depute",
      "acteurRef": "PA720846",
      "groupePolitiqueRef": "PO730958"
    },
    "cosignatairesRefs": [
      "PA721226",
      "PA2150",
      "PA721202",
      "PA718860",
      "PA719578",
      "PA720892",
      "PA721960",
      "PA720430",
      "PA721210",
      "PA721062",
      "PA720286",
      "PA720422",
      "PA718868",
      "PA722142",
      "PA720846",
      "PA588884",
      "PA719676"
    ],
    "texteAffichable": "M.&#160;Lachaud,  Mme&#160;Autain, M.&#160;Bernalicis, M.&#160;Coquerel, M.&#160;Corbi&#232;re, Mme&#160;Fiat, M.&#160;Larive, M.&#160;M&#233;lenchon, Mme&#160;Obono, Mme&#160;Panot, M.&#160;Prud&apos;homme, M.&#160;Quatennens, M.&#160;Ratenon, Mme&#160;Ressiguier, Mme&#160;Rubin, M.&#160;Ruffin et Mme&#160;Taurine"
  },
  "pointeurFragmentTexte": {
    "division": {
      "titre": "Article PREMIER",
      "articleDesignationCourte": "APRÈS ART. PREMIER",
      "type": "ARTICLE",
      "avantAApres": "Apres",
      "divisionRattachee": "APRÈS L'ARTICLE PREMIER, insérer l'article suivant:",
      "articleAdditionnel": "1",
      "urlDivisionTexteVise": "/15/textes/1414.asp#D_Article_1er"
    }
  },
  "corps": {
    "dispositif": "<p style=\"text-align: justify;\">L&#8217;article L.&#160;112&#8209;2 du code de l&#8217;action sociale et des familles est compl&#233;t&#233; par un 8&#176;&#160;ainsi r&#233;dig&#233;&#160;:</p><p style=\"text-align: justify;\">&#171;&#160;8&#176;&#160;Des informations et un accompagnement des familles &#224; l&#8217;&#233;ducation sans violence physique ou psychologiques, ni sans aucune autre forme d&#8217;humiliation.</p><p style=\"text-align: justify;\">&#171;&#160;Un d&#233;cret en Conseil d&#8217;&#201;tat &#233;tablit les modalit&#233;s de cet accompagnement, au sein des structures d&#233;j&#224; existantes, de telle sorte qu&#8217;il ne repr&#233;sente pas une charge suppl&#233;mentaire pour l&#8217;&#201;tat.&#160;&#187;</p>",
    "exposeSommaire": "<p style=\"text-align: justify;\">Les violences &#233;ducatives ordinaires touchent 85&#160;% des enfants. Il est urgent de prendre des mesures permettant de lutter de fa&#231;on massive contre l&#8217;ancrage culturel de ces violences dites &#171;&#160;ordinaires&#160;&#187;. C&#8217;est pourquoi, par cet amendement, nous proposons de mettre en place un accompagnement des familles vers une &#233;ducation d&#233;barrass&#233;e de la violence.</p><p style=\"text-align: justify;\">Car les cons&#233;quences de ces violences sont massives, et leur &#233;tendue est mal connue. L&#8217;&#201;tat consid&#232;re qu&#8217;une trentaine d&#8217;enfants meurent chaque ann&#233;e sous les coups des adultes, une r&#233;cente &#233;tude dans le milieu hospitalier fait monter ce chiffre &#224; plus de 200 enfants, et les associations de d&#233;fense des droits des enfants parlent de 600 enfants.</p><p style=\"text-align: justify;\">Le tabou que cette violence repr&#233;sente dans notre soci&#233;t&#233; fait obstacle &#224; ce qu&#8217;une information soit d&#233;livr&#233;e aux parents de fa&#231;on efficace. Il ne faut plus que l&#8217;&#201;tat se cantonne &#224; intervenir&#160;de fa&#231;on cibl&#233;e&#160;: le ciblage est un &#233;chec car&#160;toutes les situations ne sont pas rep&#233;r&#233;es, et c&#8217;est donc &#224; tous les parents que doivent &#234;tre d&#233;livr&#233;es ces informations.</p><p style=\"text-align: justify;\">Il nous a &#233;t&#233; r&#233;torqu&#233; en Commission que cet amendement n&#8217;&#233;tait pas du domaine de la loi.</p><p style=\"text-align: justify;\">Nous avons deux remarques.</p><p style=\"text-align: justify;\">D&#8217;une part, depuis l&#8217;adoption de la loi sur l&#8217;interdiction des t&#233;l&#233;phones portables &#224; l&#8217;&#233;cole, nous avons l&#8217;impression que le champ l&#233;gislatif s&#8217;est consid&#233;rablement &#233;largi au d&#233;triment du r&#233;glementaire. Nous souhaitons &#233;videmment que les r&#232;gles de recevabilit&#233; nous soient appliqu&#233;es de la m&#234;me fa&#231;on qu&#8217;&#224; la majorit&#233;.</p><p style=\"text-align: justify;\">Deuxi&#232;mement, depuis la d&#233;cision 2005&#8209;512DC du Conseil constitutionnel rendue le 22 avril 2005, Le Conseil choisit non pas de censurer les dispositions r&#233;glementaires contenues dans une loi, mais de les &#171;&#160;d&#233;classer&#160;&#187;, c&#8217;est-&#224;-dire de reconna&#238;tre leur nature r&#233;glementaire. Ce n&#8217;est donc pas aux rapporteures ou rapporteurs de projets de lois de finances d&#8217;op&#233;rer une censure que m&#234;me le Conseil constitutionnel n&#8217;op&#232;re plus.</p>"
  },
  "representations": [
    {
      "nom": "PDF",
      "typeMime": {
        "type": "application",
        "subType": "PDF"
      },
      "statutRepresentation": {
        "verbatim": true,
        "canonique": true,
        "officielle": true,
        "transcription": false,
        "enregistrement": false
      },
      "contenu": {
        "documentURI": "/15/amendements/1414/AN/16.pdf"
      }
    }
  ],
  "seanceDiscussion": "RUANR5L15S2019IDS21388",
  "sort": {
    "dateSaisie": "2018-11-29T22:55:14.000+01:00",
    "sortEnSeance": "Rejeté"
  },
  "dateDepot": "2018-11-26T01:00:00.000+01:00",
  "dateDistribution": "2018-11-29T01:00:00.000+01:00",
  "article99": "0",
  "loiReference": {
    "codeLoi": "c action sociale et familles",
    "divisionCodeLoi": "L112-2"
  }
}