{
  "uid": "AMANR5L15SEA717460BTC1396P0D1N1484",
  "identifiant": {
    "legislature": "15",
    "numero": "1484",
    "numRect": "0",
    "saisine": {
      "texteLegislatifRef": "PRJLANR5L15BTC1396",
      "numeroPartiePLF": "0",
      "organeExamen": "PO717460",
      "mentionSecondeDeliberation": "0"
    }
  },
  "numeroLong": "1484",
  "etapeTexte": "1ère lecture (2ème assemblée saisie)",
  "triAmendement": "dtaaaaaaaaaaaaaaaaaaaaaaaaaaaaaaaaaaaaaaaaaaaaaaaac",
  "cardinaliteAmdtMultiples": "1",
  "etat": "Discuté",
  "signataires": {
    "auteur": {
      "typeAuteur": "Depute",
      "acteurRef": "PA721702",
      "groupePolitiqueRef": "PO730964"
    },
    "cosignatairesRefs": [
      "PA721702"
    ],
    "texteAffichable": "M.&#160;Fauvergue"
  },
  "pointeurFragmentTexte": {
    "division": {
      "titre": "Article 32 bis",
      "articleDesignationCourte": "ART. 32 BIS",
      "type": "ARTICLE",
      "avantAApres": "A",
      "divisionRattachee": "ARTICLE 32 BIS",
      "urlDivisionTexteVise": "/15/textes/1396.asp#D_Article_32_bis"
    },
    "alinea": {
      "avantAApres": "Apres",
      "numero": "12"
    }
  },
  "corps": {
    "dispositif": "<p style=\"text-align: justify;\">Apr&#232;s l&#8217;alin&#233;a&#160;12, ins&#233;rer l&#8217;alin&#233;a suivant&#160;:</p><p style=\"text-align: justify;\">&#171;&#160;3&#176; <i>bis</i> Au troisi&#232;me alin&#233;a du I de l&#8217;article&#160;230&#8209;45, les mots&#160;: &#171;&#160;Le second alin&#233;a des articles 100&#8209;4, 100&#8209;6, 230&#8209;38 et 230&#8209;43 du pr&#233;sent code n&#8217;est pas applicable&#160;&#187; sont remplac&#233;s par les mots&#160;: &#171;&#160;Les dispositions du pr&#233;sent code relatives au placement des enregistrements sous scell&#233;s ferm&#233;s et &#224; l&#8217;&#233;tablissement d&#8217;un proc&#232;s-verbal lorsqu&#8217;il est proc&#233;d&#233; &#224; leur destruction&#160;ne sont pas applicables&#160;&#187;.</p>",
    "exposeSommaire": "<p style=\"text-align: justify;\">L&#8217;article&#160;230&#8209;45 du code de proc&#233;dure p&#233;nale relatif la plate-forme nationale des interceptions judiciaires pr&#233;cise que les dispositions des articles 100&#8209;4, 100&#8209;6, 230&#8209;38 et 230&#8209;43 de ce code, qui pr&#233;voient le placement sous scell&#233;s ferm&#233;s des enregistrements en mati&#232;re d&#8217;interception de communication et de g&#233;olocalisation ainsi que l&#8217;&#233;tablissement d&#8217;un proc&#232;s-verbal de l&#8217;op&#233;ration de destruction de ces enregistrements, ne sont pas applicables aux donn&#233;es conserv&#233;es par la plate-forme nationale des interceptions judiciaires, puisque celle-ci est enti&#232;rement d&#233;mat&#233;rialis&#233;e et automatis&#233;e.</p><p style=\"text-align: justify;\">Plut&#244;t que de lister ces articles, il para&#238;t cependant pr&#233;f&#233;rable de pr&#233;ciser la nature des r&#232;gles qui ne s&#8217;appliquent pas, comme le fait d&#233;sormais l&#8217;article&#160;801&#8209;1 du code de proc&#233;dure p&#233;nale relatif &#224; la proc&#233;dure p&#233;nale num&#233;rique, modifi&#233; par l&#8217;article&#160;32 bis du pr&#233;sent projet de loi adopt&#233; par la commission des lois.</p><p style=\"text-align: justify;\">Cet amendement clarifie ainsi le droit existant qui assouplit d&#233;j&#224; les formalit&#233;s applicables,&#160;et &#233;vite de devoir proc&#233;der dans le futur &#224; des coordinations si ces articles &#233;taient compl&#233;t&#233;s ou modifi&#233;s.</p>",
    "cartoucheDelaiDepotDepasse": "Sous réserve de son traitement par les services de l'Assemblée nationale et de sa recevabilité"
  },
  "representations": [
    {
      "nom": "PDF",
      "typeMime": {
        "type": "application",
        "subType": "PDF"
      },
      "statutRepresentation": {
        "verbatim": true,
        "canonique": true,
        "officielle": true,
        "transcription": false,
        "enregistrement": false
      },
      "contenu": {
        "documentURI": "/15/amendements/1396/AN/1484.pdf"
      }
    }
  ],
  "seanceDiscussion": "RUANR5L15S2019IDS21376",
  "sort": {
    "dateSaisie": "2018-11-23T12:59:30.000+01:00",
    "sortEnSeance": "Adopté"
  },
  "dateDepot": "2018-11-15T01:00:00.000+01:00",
  "dateDistribution": "2018-11-23T01:00:00.000+01:00",
  "article99": "0",
  "loiReference": {}
}