{
  "uid": "AMANR5L15PO59048B1490P0D1N614",
  "identifiant": {
    "legislature": "15",
    "numero": "614",
    "numRect": "0",
    "saisine": {
      "texteLegislatifRef": "PRJLANR5L15B1490",
      "numeroPartiePLF": "0",
      "organeExamen": "PO59048",
      "mentionSecondeDeliberation": "0"
    }
  },
  "numeroLong": "CF614",
  "etapeTexte": "Nouvelle Lecture",
  "triAmendement": "bbpaaaaaaaaaaaaaaaaaaaaaaaaaaaaaaaaaaaaaaaaaaaaaaam",
  "cardinaliteAmdtMultiples": "1",
  "etat": "Discuté",
  "signataires": {
    "auteur": {
      "typeAuteur": "Depute",
      "acteurRef": "PA608172",
      "groupePolitiqueRef": "PO758835"
    },
    "cosignatairesRefs": [
      "PA642764",
      "PA605069",
      "PA719930",
      "PA335054",
      "PA1592",
      "PA608695",
      "PA720988",
      "PA340343",
      "PA508",
      "PA608741",
      "PA333285",
      "PA429893",
      "PA333818",
      "PA335532",
      "PA608172",
      "PA1008",
      "PA1198",
      "PA643145",
      "PA337483",
      "PA340357",
      "PA267233",
      "PA342415",
      "PA1809",
      "PA607553",
      "PA609332",
      "PA608011",
      "PA332614",
      "PA610681"
    ],
    "texteAffichable": "Mme&#160;Pires Beaune,  M.&#160;Jean-Louis&#160;Bricout, M.&#160;Aviragnet, Mme&#160;Bareigts, Mme&#160;Battistel, Mme&#160;Bi&#233;mouret, M.&#160;Bouillon, M.&#160;Carvounas, M.&#160;Alain&#160;David, Mme&#160;Laurence&#160;Dumont, M.&#160;Faure, M.&#160;Garot, M.&#160;David&#160;Habib, M.&#160;Hutin, M.&#160;Juanico, Mme&#160;Karamanli, M.&#160;J&#233;r&#244;me&#160;Lambert, M.&#160;Letchimy, Mme&#160;Manin, Mme&#160;Pau-Langevin, M.&#160;Potier, M.&#160;Pueyo, M.&#160;Saulignac, Mme&#160;Tolmont, Mme&#160;Untermaier, Mme&#160;Vainqueur-Christophe, M.&#160;Vallaud et Mme&#160;Victory"
  },
  "pointeurFragmentTexte": {
    "division": {
      "titre": "Article 16 bis C",
      "articleDesignationCourte": "ART. 16 BIS C",
      "type": "ARTICLE",
      "avantAApres": "A",
      "divisionRattachee": "ARTICLE 16 BIS C",
      "urlDivisionTexteVise": "/15/textes/1490.asp#D_Article_16_bis_C"
    }
  },
  "corps": {
    "dispositif": "<p>Supprimer cet article.</p>",
    "exposeSommaire": "<p>Cet amendement du groupe Socialistes et apparent&#233;s vise &#224; supprimer l'article 16 bis C, ins&#233;r&#233; au S&#233;nat, qui rel&#232;ve de 300 000 euros &#224; 500 000 euros l'abattement sur les transmissions d'entreprise en cas de reprise interne, applicable tant aux droits d'enregistrement sur les cessions qu'aux droits de mutation &#224; titre gratuit en cas de donation en pleine propri&#233;t&#233;.</p><p>Actuellement, un abattement de 300 000 euros est pr&#233;vu sur les droits d'enregistrement en cas de cession d'une entreprise en pleine propri&#233;t&#233; et sur les droits de mutation &#224; titre gratuit en cas de donation en pleine propri&#233;t&#233;, afin d'encourager les reprises internes et familiales,</p><p>Le b&#233;n&#233;fice de l'abattement sur les droits d'enregistrement est subordonn&#233; au respect de plusieurs conditions.</p><p>L'activit&#233; de l'entreprise ou de la soci&#233;t&#233; doit &#234;tre industrielle, commerciale, artisanale, agricole ou lib&#233;rale. Ne sont pas incluses les activit&#233;s de gestion, par l'entreprise, de son propre patrimoine mobilier ou immobilier.</p><p>Deux cas doivent &#234;tre distingu&#233;s concernant la qualit&#233; de l'acqu&#233;reur&#160;: il peut s'agir d'une personne titulaire, au sein de l'entreprise, d'un contrat de travail &#224; dur&#233;e ind&#233;termin&#233;e depuis au moins deux ans ou d'un contrat d'apprentissage en cours au jour de la cession (reprise interne), ou bien du conjoint du c&#233;dant, de son partenaire de pacte civil de solidarit&#233; ou encore de ses enfants, de ses parents ou de ses fr&#232;res et soeurs (reprise familiale).</p><p>Si l'objet de la vente (fonds de commerce, parts sociales, client&#232;le, etc.) avait &#233;t&#233; acquis &#224; titre on&#233;reux, il doit avoir &#233;t&#233; d&#233;tenu depuis plus de deux ans par le vendeur.</p><p>Enfin, &#224; la suite de la reprise, les acqu&#233;reurs doivent poursuivre pendant une dur&#233;e minimale de cinq ans l'exploitation de l'entreprise &#171;&#160;&#224; titre d'activit&#233; professionnelle unique et de mani&#232;re effective et continue&#160;&#187;. L'un des acqu&#233;reurs ayant ouvert droit &#224; l'abattement doit assurer, pendant la m&#234;me p&#233;riode, la direction effective de l'entreprise.</p><p>Cependant, une souplesse est pr&#233;vue en cas d'ouverture d'une proc&#233;dure de liquidation judiciaire dans le m&#234;me d&#233;lai&#160;: dans ce cas, le b&#233;n&#233;fice de l'abattement n'est pas remis en cause.</p><p>Les m&#234;mes conditions sont pr&#233;vues par le dispositif sym&#233;trique concernant les droits de mutation &#224; titre gratuit en cas de donation en pleine propri&#233;t&#233;, mais les reprises familiales sont exclues du champ de l'abattement.</p><p>L'abattement applicable en cas de donations aux salari&#233;s pr&#233;sente, pour l'&#201;tat, un co&#251;t d'environ 1 million d'euros tandis que l'abattement en cas de cession &#224; un membre de la famille repr&#233;sente un co&#251;t de 4 millions d'euros.</p><p>Pour les d&#233;put&#233;s socialistes et apparent&#233;s, l'augmentation substantielle de cet avantage fiscal para&#238;t disproportionn&#233;e. Ils souhaitent donc la suppression de l'article 16 bis C.</p>"
  },
  "representations": [
    {
      "nom": "PDF",
      "typeMime": {
        "type": "application",
        "subType": "PDF"
      },
      "statutRepresentation": {
        "verbatim": true,
        "canonique": true,
        "officielle": true,
        "transcription": false,
        "enregistrement": false
      },
      "contenu": {
        "documentURI": "/15/amendements/1490/CION_FIN/CF614.pdf"
      }
    }
  ],
  "sort": {
    "dateSaisie": "2018-12-14T10:47:10.000+01:00",
    "sortEnSeance": "Adopté"
  },
  "dateDepot": "2018-12-13T01:00:00.000+01:00",
  "dateDistribution": "2018-12-14T01:00:00.000+01:00",
  "article99": "0",
  "loiReference": {}
}