{
  "uid": "AMANR5L15SEA717460BTC1019P0D1N1791",
  "identifiant": {
    "legislature": "15",
    "numero": "1791",
    "numRect": "0",
    "saisine": {
      "texteLegislatifRef": "PRJLANR5L15BTC1019",
      "numeroPartiePLF": "0",
      "organeExamen": "PO717460",
      "mentionSecondeDeliberation": "0"
    }
  },
  "numeroLong": "1791",
  "etapeTexte": "1ère lecture (1ère assemblée saisie)",
  "triAmendement": "vjw",
  "cardinaliteAmdtMultiples": "1",
  "etat": "Discuté",
  "signataires": {
    "auteur": {
      "typeAuteur": "Depute",
      "acteurRef": "PA720002",
      "groupePolitiqueRef": "PO730970"
    },
    "cosignatairesRefs": [
      "PA719504",
      "PA721984",
      "PA720002",
      "PA722284",
      "PA720178",
      "PA719044"
    ],
    "texteAffichable": "Mme&#160;El Ha&#239;ry,  M.&#160;Latombe, M.&#160;Lagleize, Mme&#160;Essayan, M.&#160;Garcia et M.&#160;Fuchs"
  },
  "pointeurFragmentTexte": {
    "division": {
      "titre": "Article PREMIER",
      "articleDesignationCourte": "ART. PREMIER",
      "type": "ARTICLE",
      "avantAApres": "A",
      "divisionRattachee": "ARTICLE PREMIER",
      "urlDivisionTexteVise": "/15/textes/1019.asp#D_Article_1er"
    },
    "alinea": {
      "numero": "71"
    }
  },
  "corps": {
    "dispositif": "<p style=\"text-align: justify;\">I. &#8211; &#192; la premi&#232;re phrase de l&#8217;alin&#233;a&#160;71, supprimer le mot&#160;:</p><p style=\"text-align: justify;\">&#171;&#160;interprofessionnelle&#160;&#187;.</p><p style=\"text-align: justify;\">II. &#8211; En cons&#233;quence, proc&#233;der &#224; la m&#234;me suppression &#224; la premi&#232;re phrase de l&#8217;alin&#233;a&#160;80.</p><p style=\"text-align: justify;\">III.&#160;&#8211;&#160;En cons&#233;quence, &#224; la fin de l&#8217;alin&#233;a&#160;81, supprimer le mot&#160;:</p><p style=\"text-align: justify;\">&#171;&#160;interprofessionnel&#160;&#187;.</p>",
    "exposeSommaire": "<p style=\"text-align: justify;\">Le projet de loi confie &#224; une commission paritaire interprofessionnelle r&#233;gionale, agr&#233;&#233;e par l&#8217;autorit&#233; administrative, trois missions essentielles&#160;:</p><p style=\"text-align: justify;\">- le financement des projets de transition professionnelle mobilisant le Compte Personnel de Formation&#160;;</p><p style=\"text-align: justify;\">- l&#8217;attestation du caract&#232;re r&#233;el et s&#233;rieux du projet de reconversion professionnelle&#160;;</p><p style=\"text-align: justify;\">- le suivi de la mise en &#339;uvre du conseil en &#233;volution professionnelle sur le territoire r&#233;gional.</p><p style=\"text-align: justify;\">Il est indispensable d&#8217;&#233;largir la composition de cette commission &#224; des repr&#233;sentants des organisations d&#8217;employeurs repr&#233;sentatives au niveau multi-professionnel.</p><p style=\"text-align: justify;\">En effet il demeure fondamental, dans ce cadre, de prendre en consid&#233;ration les besoins de formation qui s&#8217;expriment dans le champ multi-professionnel, et notamment de faciliter les transitions et reconversions professionnelles au sein ou en direction des secteurs d&#8217;activit&#233; repr&#233;sent&#233;s par les organisations d&#8217;employeurs multi-professionnelles (agriculture, &#233;conomie sociale et solidaire, spectacle vivant).</p><p style=\"text-align: justify;\">Cet &#233;largissement s&#8217;impose tout particuli&#232;rement en ce qui concerne l&#8217;UDES, organisation des employeurs de l&#8217;&#233;conomie sociale et solidaire repr&#233;sentative au niveau national et multi-professionnel. Sa repr&#233;sentativit&#233; en termes de nombre de salari&#233;s se r&#233;v&#232;le en effet sup&#233;rieure &#224; certaines organisations interprofessionnelles et elle compte &#224; ce titre au nombre des principaux contributeurs au CPF.</p><p style=\"text-align: justify;\">Il est donc propos&#233; de modifier en cons&#233;quence le projet de loi, en supprimant toute r&#233;f&#233;rence au caract&#232;re interprofessionnel de la nouvelle commission paritaire.</p>"
  },
  "representations": [
    {
      "nom": "PDF",
      "typeMime": {
        "type": "application",
        "subType": "PDF"
      },
      "statutRepresentation": {
        "verbatim": true,
        "canonique": true,
        "officielle": true,
        "transcription": false,
        "enregistrement": false
      },
      "contenu": {
        "documentURI": "/15/amendements/1019/AN/1791.pdf"
      }
    }
  ],
  "seanceDiscussion": "RUANR5L15S2018IDS21098",
  "sort": {
    "dateSaisie": "2018-06-12T23:01:09.000+02:00",
    "sortEnSeance": "Rejeté"
  },
  "dateDepot": "2018-06-07T02:00:00.000+02:00",
  "dateDistribution": "2018-06-09T02:00:00.000+02:00",
  "article99": "0",
  "loiReference": {}
}