{
  "uid": "AMANR5L15SEA717460BTC1974P0D1N264",
  "identifiant": {
    "legislature": "15",
    "numero": "264",
    "numRect": "0",
    "saisine": {
      "texteLegislatifRef": "PRJLANR5L15BTC1974",
      "numeroPartiePLF": "0",
      "organeExamen": "PO717460",
      "mentionSecondeDeliberation": "0"
    }
  },
  "numeroLong": "264",
  "etapeTexte": "1ère lecture (2ème assemblée saisie)",
  "triAmendement": "hiaaaoaaaaaaaaaaaaaaaaaaaaaaaaaaaaaaaaaaaaaaaaaaaahzzzzzzzzzzzzzzzzzzzzzzzzzzzzzzzzzzzzzzzzzzzzzzzzzu",
  "cardinaliteAmdtMultiples": "1",
  "etat": "Retiré",
  "signataires": {
    "auteur": {
      "typeAuteur": "Depute",
      "acteurRef": "PA720108",
      "groupePolitiqueRef": "PO730964"
    },
    "cosignatairesRefs": [
      "PA720108",
      "PA720002"
    ],
    "texteAffichable": "Mme&#160;Oppelt et Mme&#160;El Ha&#239;ry"
  },
  "pointeurFragmentTexte": {
    "division": {
      "titre": "RAPPORT ANNEXÉ",
      "articleDesignationCourte": "ART. 1ER A",
      "type": "ANNEXE",
      "avantAApres": "A",
      "divisionRattachee": "ARTICLE 1ER A",
      "urlDivisionTexteVise": "/15/textes/1974.asp#D_RAPPORT_ANNEXE"
    },
    "alinea": {
      "avantAApres": "Apres",
      "numero": "47"
    }
  },
  "corps": {
    "dispositif": "<p style=\"text-align: justify;\">Apr&#232;s l&#8217;alin&#233;a&#160;47, ins&#233;rer les trois alin&#233;as suivants&#160;:</p><p style=\"text-align: justify;\">&#171;&#160;L&#8217;&#201;tat et SNCF R&#233;seau appliqueront entre Nantes, Angers et Sabl&#233; un plan de 14,36 M&#8364; d&#8217;acc&#233;l&#233;ration de mise aux standards de protection d&#8217;une ligne &#224; grande vitesse, dont 2,36 M&#8364; de la R&#233;gion. Ce plan pr&#233;voit la pose de cl&#244;ture le long des tron&#231;ons concern&#233;s par des heurts d&#8217;animaux (une des premi&#232;res causes de retard des trains aujourd&#8217;hui), de g&#233;rer la v&#233;g&#233;tation (pour &#233;viter les chutes d&#8217;arbres lors d&#8217;&#233;v&#232;nements climatiques violents), de mettre en place une t&#233;l&#233;d&#233;tection de l&#8217;&#233;tat du r&#233;seau et de multiplier les acc&#232;s aux voies depuis la route pour les engins de r&#233;paration. Ainsi, plus de 70 km de voies b&#233;n&#233;ficieront de cette protection renforc&#233;e d&#8217;ici &#224; 2022.</p><p style=\"text-align: justify;\">&#171;&#160;Dans les quatre ann&#233;es &#224; venir, SNCF r&#233;seau engagera 122 M&#8364; de travaux de r&#233;g&#233;n&#233;ration sur l&#8217;axe structurant entre Nantes et le Mans au titre de son contrat de performance.</p><p style=\"text-align: justify;\">&#171;&#160;Enfin, &#224; l&#8217;issue de la d&#233;finition du sch&#233;ma directeur d&#8217;axe et des n&#339;uds ferroviaires de Nantes et d&#8217;Angers inscrit au contrat de plan &#201;tat-r&#233;gion et en cours d&#8217;&#233;tude par SNCF R&#233;seau, des am&#233;nagements de fiabilit&#233; et de capacit&#233; seront r&#233;alis&#233;s entre Nantes, Angers et Sabl&#233; sur le r&#233;seau existant. Pour ce faire, l&#8217;&#201;tat pr&#233;voit un apport de 4,58 M&#8364;.&#160;&#187;</p>",
    "exposeSommaire": "<p style=\"text-align: justify;\">Le 8 f&#233;vrier 2019 a eu lieu la signature du contrat d&#8217;avenir des Pays de la Loire entre M.&#160;le Premier ministre et Mme Christelle Moran&#231;ais, pr&#233;sidente du Conseil r&#233;gional des Pays de la Loire.</p><p style=\"text-align: justify;\">Ce contrat d&#8217;avenir fixe deux objectifs&#160;:</p><p style=\"text-align: justify;\">-&#160; Renforcer l&#8217;attractivit&#233; et l&#8217;accessibilit&#233; de la R&#233;gion des Pays de la Loire en d&#233;veloppant les mobilit&#233;s et les infrastructures de transport&#160;;</p><p style=\"text-align: justify;\">-&#160; Se projeter vers l&#8217;avenir en incluant dans chaque projet le d&#233;fi de la transition num&#233;rique, le d&#233;fi de l&#8217;&#233;conomie de la connaissance et le d&#233;fi de la transition &#233;cologique.</p><p style=\"text-align: justify;\">Ainsi, la premi&#232;re partie de ce contrat, consacr&#233;e &#224; l&#8217;am&#233;lioration des mobilit&#233;s, comprend 21 projets dont celui d&#8217;am&#233;liorer, &#224; court terme, la qualit&#233; de service de la liaison ferroviaire vers Paris.</p><p style=\"text-align: justify;\">Cet amendement permet d&#8217;insister sur la n&#233;cessit&#233; de renforcer la protection des voies particuli&#232;rement d&#233;grad&#233;es entre Nantes et Paris et sur l&#8217;importance du concours de l&#8217;&#201;tat pour assurer des am&#233;nagements de fiabilit&#233; et de capacit&#233; notamment entre Nantes, Angers et Sabl&#233;.</p>"
  },
  "representations": [
    {
      "nom": "PDF",
      "typeMime": {
        "type": "application",
        "subType": "PDF"
      },
      "statutRepresentation": {
        "verbatim": true,
        "canonique": true,
        "officielle": true,
        "transcription": false,
        "enregistrement": false
      },
      "contenu": {
        "documentURI": "/15/amendements/1974/AN/264.pdf"
      }
    }
  ],
  "dateDepot": "2019-05-27T02:00:00.000+02:00",
  "dateDistribution": "2019-06-11T02:00:00.000+02:00",
  "article99": "0",
  "loiReference": {}
}