{
  "uid": "AMANR5L15SEA717460B1255P2D1N2122",
  "identifiant": {
    "legislature": "15",
    "numero": "2122",
    "numRect": "0",
    "saisine": {
      "texteLegislatifRef": "PRJLANR5L15B1255",
      "numeroPartiePLF": "2",
      "organeExamen": "PO717460",
      "mentionSecondeDeliberation": "0"
    }
  },
  "numeroLong": "II-2122",
  "etapeTexte": "1ère lecture (1ère assemblée saisie)",
  "triAmendement": "fcaaaaaaaaaaaaaaaaaaaaaaaaaaaaaaaaaaaaaaaaaaaaaaaabq",
  "cardinaliteAmdtMultiples": "1",
  "etat": "Discuté",
  "signataires": {
    "auteur": {
      "typeAuteur": "Depute",
      "acteurRef": "PA721270",
      "groupePolitiqueRef": "PO730940"
    },
    "cosignatairesRefs": [
      "PA720546",
      "PA610667",
      "PA718926",
      "PA689",
      "PA335612",
      "PA720692",
      "PA722202",
      "PA722110",
      "PA267306",
      "PA721270",
      "PA718720",
      "PA721896",
      "PA610654",
      "PA721118",
      "PA721012",
      "PA441"
    ],
    "texteAffichable": "M.&#160;Peu,  M.&#160;Dufr&#232;gne, M.&#160;Fabien&#160;Roussel, Mme&#160;Bello, M.&#160;Brotherson, M.&#160;Bruneel, Mme&#160;Buffet, M.&#160;Chassaigne, M.&#160;Dharr&#233;ville, Mme&#160;Faucillon, M.&#160;Jumel, Mme&#160;K&#233;clard-Mond&#233;sir, M.&#160;Lecoq, M.&#160;Nilor, M.&#160;Serville et M.&#160;Wulfranc"
  },
  "pointeurFragmentTexte": {
    "division": {
      "titre": "Article 56",
      "articleDesignationCourte": "APRÈS ART. 56",
      "type": "ARTICLE",
      "avantAApres": "Apres",
      "divisionRattachee": "APRÈS L'ARTICLE 56, insérer l'article suivant:",
      "articleAdditionnel": "1",
      "urlDivisionTexteVise": "/15/textes/1255C.asp#D_Article_56"
    }
  },
  "corps": {
    "dispositif": "<p style=\"text-align: justify;\">I.&#160;&#8211;&#160;L&#8217;article&#160;1384 A du code g&#233;n&#233;ral des imp&#244;ts est compl&#233;t&#233; par un alin&#233;a ainsi r&#233;dig&#233;&#160;:</p><p style=\"text-align: justify;\">&#171;&#160;IV.&#160;&#8211;&#160;L&#8217;exon&#233;ration pr&#233;vue au III peut &#233;galement s&#8217;appliquer, sur d&#233;lib&#233;ration des collectivit&#233;s territoriales et les &#233;tablissements publics de coop&#233;ration intercommunale &#224; fiscalit&#233; propre, prise dans les conditions pr&#233;vues &#224; l&#8217;article&#160;1639 A bis, aux logements anciens r&#233;habilit&#233;s faisant l&#8217;objet d&#8217;un contrat de location-accession en application de la loi n&#176; 84&#8209;595 du 12 juillet 1984 d&#233;finissant la location-accession &#224; la propri&#233;t&#233; immobili&#232;re et destin&#233;s &#224; &#234;tre occup&#233;, &#224; titre de r&#233;sidence principale, par des personnes physiques dont les revenus &#224; la date de signature du contrat pr&#233;liminaire ou, &#224; d&#233;faut, du contrat de location-accession ne d&#233;passent pas les plafonds pr&#233;vus &#224; la premi&#232;re phrase du huiti&#232;me alin&#233;a de l&#8217;article L.&#160;411&#8209;2 du code de la construction et de l&#8217;habitation.&#160;&#187;</p><p style=\"text-align: justify;\">II.&#160;&#8211;&#160;La perte de recettes pour&#160;les collectivit&#233;s territoriales&#160;est compens&#233;e &#224; due concurrence par la cr&#233;ation d&#8217;une taxe additionnelle aux droits mentionn&#233;s aux articles 575 et 575 A du code g&#233;n&#233;ral des imp&#244;ts.&#160;</p>",
    "exposeSommaire": "<p style=\"text-align: justify;\">Les logements faisant l&#8217;objet d&#8217;un contrat de location-accession PSLA b&#233;n&#233;ficient actuellement d&#8217;une exon&#233;ration de taxe fonci&#232;re sur les propri&#233;t&#233;s b&#226;ties (TFPB) de 15 ans, ce r&#233;gime &#233;tant r&#233;serv&#233; aux logements neufs.</p><p style=\"text-align: justify;\">Or, le m&#233;canisme de la location-accession peut &#233;galement &#234;tre int&#233;ressant pour les op&#233;rations d&#8217;accession sociale &#224; la propri&#233;t&#233; r&#233;alis&#233;es dans des immeubles anciens apr&#232;s r&#233;habilitation, notamment dans le cadre de la revitalisation des &#171;&#160;centres-bourgs&#160;&#187;.</p><p style=\"text-align: justify;\">Les auteurs de cet amendement proposent de permettre aux collectivit&#233;s qui souhaitent soutenir de tels projets d&#8217;appliquer cette exon&#233;ration &#224; ces op&#233;rations portant sur les logements anciens.</p>"
  },
  "representations": [
    {
      "nom": "PDF",
      "typeMime": {
        "type": "application",
        "subType": "PDF"
      },
      "statutRepresentation": {
        "verbatim": true,
        "canonique": true,
        "officielle": true,
        "transcription": false,
        "enregistrement": false
      },
      "contenu": {
        "documentURI": "/15/amendements/1255C/AN/2122.pdf"
      }
    }
  ],
  "seanceDiscussion": "RUANR5L15S2019IDS21344",
  "sort": {
    "dateSaisie": "2018-11-16T11:00:54.000+01:00",
    "sortEnSeance": "Non soutenu"
  },
  "dateDepot": "2018-11-12T01:00:00.000+01:00",
  "dateDistribution": "2018-11-14T01:00:00.000+01:00",
  "article99": "0",
  "loiReference": {
    "codeLoi": "CGI",
    "divisionCodeLoi": "1384 A"
  }
}