{
  "uid": "AMANR5L15PO59048B1371P0D1N48",
  "identifiant": {
    "legislature": "15",
    "numero": "48",
    "numRect": "0",
    "saisine": {
      "texteLegislatifRef": "PRJLANR5L15B1371",
      "numeroPartiePLF": "0",
      "organeExamen": "PO59048",
      "mentionSecondeDeliberation": "0"
    }
  },
  "numeroLong": "CF48",
  "etapeTexte": "1ère lecture (1ère assemblée saisie)",
  "triAmendement": "eiaaaaaaaaaaaaaaaaaaaaaaaaaaaaaaaaaaaaaaaaaaaaaaaax",
  "cardinaliteAmdtMultiples": "1",
  "etat": "Discuté",
  "signataires": {
    "auteur": {
      "typeAuteur": "Depute",
      "acteurRef": "PA721202",
      "groupePolitiqueRef": "PO730958"
    },
    "cosignatairesRefs": [
      "PA721210",
      "PA718868",
      "PA719578",
      "PA720286",
      "PA718860",
      "PA2150",
      "PA588884",
      "PA721960",
      "PA720422",
      "PA721226",
      "PA722142",
      "PA721062",
      "PA719676",
      "PA720430",
      "PA721202",
      "PA720846",
      "PA720892"
    ],
    "texteAffichable": "M.&#160;Coquerel,  Mme&#160;Autain, M.&#160;Bernalicis, M.&#160;Corbi&#232;re, Mme&#160;Fiat, M.&#160;Lachaud, M.&#160;Larive, M.&#160;M&#233;lenchon, Mme&#160;Obono, Mme&#160;Panot, M.&#160;Prud&apos;homme, M.&#160;Quatennens, M.&#160;Ratenon, Mme&#160;Ressiguier, Mme&#160;Rubin, M.&#160;Ruffin et Mme&#160;Taurine"
  },
  "pointeurFragmentTexte": {
    "missionVisee": {
      "idMissionAN": "454",
      "libelleMission": "Économie",
      "codeMissionPLF": "B",
      "libelleMissionPLF": "Répartition des crédits pour 2018 ouverts et annulés, par mission et programme, au titre du budget général"
    },
    "division": {
      "titre": "ÉTAT B",
      "articleDesignationCourte": "ART. 5",
      "type": "ANNEXE",
      "avantAApres": "A",
      "divisionRattachee": "ARTICLE 5",
      "urlDivisionTexteVise": "/15/textes/1371.asp#D_ETAT_B"
    }
  },
  "corps": {
    "exposeSommaire": "<p style=\"text-align: justify;\">Par cet amendement, nous nous opposons &#224; l&#8217;annulation de plus de 56 millions d&#8217;euros de cr&#233;dits de la mission &#201;conomie.</p><p style=\"text-align: justify;\">En effet, cette baisse repr&#233;sente 3% du budget total de la mission&#160;! Pour justifier ces annulations, l&#8217;Ex&#233;cutif n&#8217;h&#233;site pas &#224; parler de &#171;&#160;maitrise accrue des d&#233;penses d&#8217;intervention&#160;&#187; de certains programmes. Si l&#8217;on traduit ce langage macronien cela signifie qu&#8217;une pression budg&#233;taire aust&#233;ritaire a &#233;t&#233; impos&#233;e &#224; certains op&#233;rateurs et leurs agents.</p><p style=\"text-align: justify;\">Ce PLFR pr&#233;voit par exemple une baisse de 3,8% pour le programme 134 &#171;&#160;D&#233;veloppement des entreprises et r&#233;gulations&#160;&#187;. L&#8217;Ex&#233;cutif nous explique que le bail de l&#8217;Autorit&#233; de r&#233;gulation des communications &#233;lectroniques et des postes (ARCEP) a &#233;t&#233; renouvel&#233; &#224; un co&#251;t moins &#233;lev&#233;. Mais l&#8217;argent &#233;conomis&#233; n&#8217;aurait-il pas pu &#234;tre revers&#233; &#224; cette autorit&#233;&#160;? Nous sommes s&#251;r qu&#8217;elle aurait pu en faire un bon usage.</p><p style=\"text-align: justify;\">Pour le programme 343 &#171;&#160;Plan France tr&#232;s Haut D&#233;bit&#160;&#187;, nous estimons que les cr&#233;dits auraient d&#251; &#234;tre maintenus.&#160;Nous nous opposons &#224; la logique du Gouvernement qui consiste &#224; faire davantage appel au secteur priv&#233; pour financer le d&#233;ploiement de la fibre dans les campagnes, via les Appels &#224; manifestation d'engagements locaux (AMEL) au d&#233;triment des investissements publics. En outre, les 10,9 millions d&#8217;euros annul&#233;s auraient pu servir les R&#233;seaux d&#8217;initiative publique (RIP), propri&#233;t&#233; des collectivit&#233;s.</p><p style=\"text-align: justify;\">Enfin, pour le programme 220 &#171;&#160;Statistiques et &#233;tudes &#233;conomiques&#160;&#187; qui voit une baisse de 1,75% de son budget, le Gouvernement ne peut pr&#233;texter des annulations de cr&#233;dits au motif que des d&#233;parts plus nombreux que pr&#233;vus ont eu lieu au sein de l&#8217;Insee. D&#8217;ailleurs le PAP 2019 mentionne que l&#8217;Insee doit &#171;&#160;d&#233;velopper sa capacit&#233; a&#768; r&#233;agir rapidement a&#768; de nouvelles sollicitations. En outre, cette orientation comprend aussi un volet relatif a&#768; la transmission des savoirs alors que les d&#233;parts a&#768; la retraite continueront d&#8217;&#234;tre importants dans les ann&#233;es a&#768; venir&#160;&#187; ! Le Gouvernement sait donc pertinemment que les d&#233;parts &#224; venir sont nombreux et que cela menace la transmission de savoirs statistiques pourtant pr&#233;cieux. Aucune annulation de cr&#233;dit ne peut aller en ce sens.</p><p style=\"text-align: justify;\">En somme, aucune baisse de cr&#233;dits ne se justifie pour l&#8217;ensemble de la mission &#201;conomie et nous&#160;les contestons donc en bloc par cet amendement.</p>",
    "dispositifAmdtCredit": {
      "listeProgrammes": [
        {
          "libelle": "Développement des entreprises et régulations",
          "id": "47242",
          "AE": {
            "montantPositif": "0",
            "montantNegatif": "0"
          },
          "CP": {
            "montantPositif": "0",
            "montantNegatif": "0"
          },
          "action": "modification"
        },
        {
          "libelle": "Plan 'France Très haut débit'",
          "id": "47243",
          "AE": {
            "montantPositif": "0",
            "montantNegatif": "0"
          },
          "CP": {
            "montantPositif": "0",
            "montantNegatif": "0"
          },
          "action": "modification"
        },
        {
          "libelle": "Statistiques et études économiques",
          "id": "47244",
          "AE": {
            "montantPositif": "0",
            "montantNegatif": "0"
          },
          "CP": {
            "montantPositif": "0",
            "montantNegatif": "0"
          },
          "action": "modification"
        },
        {
          "libelle": "Stratégie économique et fiscale",
          "id": "47245",
          "AE": {
            "montantPositif": "0",
            "montantNegatif": "0"
          },
          "CP": {
            "montantPositif": "0",
            "montantNegatif": "0"
          },
          "action": "modification"
        }
      ],
      "totalAE": {
        "montantPositif": "0",
        "montantNegatif": "0",
        "solde": "0"
      },
      "totalCP": {
        "montantPositif": "0",
        "montantNegatif": "0",
        "solde": "0"
      }
    }
  },
  "representations": [
    {
      "nom": "PDF",
      "typeMime": {
        "type": "application",
        "subType": "PDF"
      },
      "statutRepresentation": {
        "verbatim": true,
        "canonique": true,
        "officielle": true,
        "transcription": false,
        "enregistrement": false
      },
      "contenu": {
        "documentURI": "/15/amendements/1371/CION_FIN/CF48.pdf"
      }
    }
  ],
  "sort": {
    "dateSaisie": "2018-11-09T09:30:34.000+01:00",
    "sortEnSeance": "Rejeté"
  },
  "dateDepot": "2018-11-08T01:00:00.000+01:00",
  "dateDistribution": "2018-11-08T01:00:00.000+01:00",
  "article99": "0",
  "loiReference": {}
}