{
  "uid": "AMANR5L15PO420120B1168P0D1N14",
  "identifiant": {
    "legislature": "15",
    "numero": "14",
    "numRect": "0",
    "saisine": {
      "texteLegislatifRef": "PRJLANR5L15B1168",
      "numeroPartiePLF": "0",
      "organeExamen": "PO420120",
      "mentionSecondeDeliberation": "0"
    }
  },
  "numeroLong": "AS14",
  "etapeTexte": "Nouvelle Lecture",
  "triAmendement": "u",
  "cardinaliteAmdtMultiples": "1",
  "etat": "Discuté",
  "signataires": {
    "auteur": {
      "typeAuteur": "Depute",
      "acteurRef": "PA721062",
      "groupePolitiqueRef": "PO730958"
    },
    "cosignatairesRefs": [
      "PA2150",
      "PA722142",
      "PA720846",
      "PA719676",
      "PA719578",
      "PA720422",
      "PA721210",
      "PA720892",
      "PA718868",
      "PA588884",
      "PA718860",
      "PA721202",
      "PA720430",
      "PA720286",
      "PA721226",
      "PA721062",
      "PA721960"
    ],
    "texteAffichable": "M.&#160;Ratenon,  Mme&#160;Taurine, M.&#160;Ruffin, Mme&#160;Rubin, Mme&#160;Ressiguier, M.&#160;Quatennens, M.&#160;Prud&apos;homme, Mme&#160;Panot, Mme&#160;Obono, M.&#160;M&#233;lenchon, M.&#160;Larive, M.&#160;Lachaud, Mme&#160;Fiat, M.&#160;Corbi&#232;re, M.&#160;Coquerel, M.&#160;Bernalicis et Mme&#160;Autain"
  },
  "pointeurFragmentTexte": {
    "division": {
      "titre": "Article 6",
      "articleDesignationCourte": "ART. 6",
      "type": "ARTICLE",
      "avantAApres": "A",
      "divisionRattachee": "ARTICLE 6",
      "urlDivisionTexteVise": "/15/textes/1168.asp#D_Article_6"
    },
    "alinea": {
      "avantAApres": "Apres",
      "numero": "44"
    }
  },
  "corps": {
    "dispositif": "<p style=\"text-align: justify;\">Compl&#233;ter cet article par l&#8217;alin&#233;a suivant&#160;:</p><p style=\"text-align: justify;\">&#171;&#160;VI.&#160;<i>(nouveau)</i>.&#160;&#8211;&#160;L&#8217;article L.&#160;4111&#8209;6 du code du travail est compl&#233;t&#233; par un 6&#176; ainsi r&#233;dig&#233;&#160;:</p><p style=\"text-align: justify;\">&#171;&#160;6&#176;&#160;Les conditions dans lesquelles les formations et l&#8217;information des salari&#233;s vis-&#224;-vis des risques pour la sant&#233; et la s&#233;curit&#233; sont actualis&#233;es en fonction de l&#8217;&#233;volution des connaissances en mati&#232;re de dangerosit&#233; des substances chimiques utilis&#233;es&#160;&#187;</p>",
    "exposeSommaire": "<p style=\"text-align: justify;\">Cet amendement vise &#224; assurer l&#8217;actualisation des connaissances des travailleurs vis-&#224;-vis des risques qu&#8217;ils rencontrent au cours de leur travail.&#160;</p><p style=\"text-align: justify;\">L&#8217;histoire de l&#8217;estimation de la dangerosit&#233; des substances utilis&#233;es dans l&#8217;industrie, l&#8217;agroalimentaire ou l&#8217;agriculture est faite d&#8217;expertise scientifique, d&#8217;avis circonstanci&#233;s et de rapports qui ne sont pas imm&#233;diatement connus du grand public. Entre les premi&#232;res alertes et les mesures de pr&#233;vention dans une entreprise il peut s&#8217;&#233;couler des ann&#233;es voires des d&#233;cennies.</p><p style=\"text-align: justify;\">Le cas du glyphosate, utilis&#233; &#224; la fois dans l&#8217;industrie, les m&#233;dicaments et l&#8217;agriculture, est &#224; cet &#233;gard particuli&#232;rement r&#233;v&#233;lateur. Utilis&#233; par herbicide depuis les ann&#233;es 70, il est class&#233; depuis le 20 mars 2015 comme &#171;&#160;probablement canc&#233;rog&#232;ne&#160;&#187; par le Centre international de recherche sur le cancer (CIRC). Pourtant, les bons r&#233;flexes de protection peinent &#224; s&#8217;imposer.</p><p style=\"text-align: justify;\">Le cas de l&#8217;amiante en dit encore plus long sur la n&#233;cessit&#233; pour les travailleurs d&#8217;&#234;tre inform&#233;s sur les risques qu&#8217;ils courent. Malgr&#233; une dangerosit&#233; connu depuis les ann&#233;es 1890, l&#8217;exposition a continu&#233; et les maladies li&#233;es &#224; l&#8217;amiante repr&#233;sentent aujourd&#8217;hui la deuxi&#232;me cause de maladies professionnelles et la premi&#232;re cause de d&#233;c&#232;s li&#233;s au travail.</p><p style=\"text-align: justify;\">L&#8217;inculture des travailleurs vis-&#224;-vis des risques qu&#8217;ils courent est intol&#233;rable. Il est indispensable que la r&#233;glementation veille &#224; la bonne information, tout au long de leur vie, des travailleurs vis-&#224;-vis des risques auxquels ils font face.</p><p style=\"text-align: justify;\"><br /> Cette actualisation des connaissances est faite r&#233;guli&#232;rement par des organismes comme l&#8217;Institut national de recherche et de s&#233;curit&#233; pour la pr&#233;vention des maladies professionnelles et des accidents du travail, dont le budget est pourtant menac&#233;. Il serait urgent de valoriser de telles activit&#233;s de recherche et d&#8217;en permettre une bonne et efficace diffusion dans la population active.</p>"
  },
  "representations": [
    {
      "nom": "PDF",
      "typeMime": {
        "type": "application",
        "subType": "PDF"
      },
      "statutRepresentation": {
        "verbatim": true,
        "canonique": true,
        "officielle": true,
        "transcription": false,
        "enregistrement": false
      },
      "contenu": {
        "documentURI": "/15/amendements/1168/CION-SOC/AS14.pdf"
      }
    }
  ],
  "sort": {
    "dateSaisie": "2018-07-18T12:18:16.000+02:00",
    "sortEnSeance": "Rejeté"
  },
  "dateDepot": "2018-07-17T02:00:00.000+02:00",
  "dateDistribution": "2018-07-18T02:00:00.000+02:00",
  "article99": "0",
  "loiReference": {}
}