{
  "uid": "AMANR5L15SEA717460B1371P0D1N191",
  "identifiant": {
    "legislature": "15",
    "numero": "191",
    "numRect": "0",
    "saisine": {
      "texteLegislatifRef": "PRJLANR5L15B1371",
      "numeroPartiePLF": "0",
      "organeExamen": "PO717460",
      "mentionSecondeDeliberation": "0"
    }
  },
  "numeroLong": "191",
  "etapeTexte": "1ère lecture (1ère assemblée saisie)",
  "triAmendement": "jiaaaaaaaaaaaaaaaaaaaaaaaaaaaaaaaaaaaaaaaaaaaaaaaaijhy",
  "cardinaliteAmdtMultiples": "1",
  "etat": "Discuté",
  "signataires": {
    "auteur": {
      "typeAuteur": "Depute",
      "acteurRef": "PA332523",
      "groupePolitiqueRef": "PO730934"
    },
    "cosignatairesRefs": [
      "PA332523"
    ],
    "texteAffichable": "Mme&#160;Dalloz"
  },
  "pointeurFragmentTexte": {
    "division": {
      "titre": "Article 8",
      "articleDesignationCourte": "APRÈS ART. 8",
      "type": "ARTICLE",
      "avantAApres": "Apres",
      "divisionRattachee": "APRÈS L'ARTICLE 8, insérer l'article suivant:",
      "articleAdditionnel": "1",
      "urlDivisionTexteVise": "/15/textes/1371.asp#D_Article_8"
    }
  },
  "corps": {
    "dispositif": "<p style=\"page-break-after: avoid;\">I.&#160;&#8211;&#160;Le 1 du III de l&#8217;article&#160;204 H du code g&#233;n&#233;ral des imp&#244;ts est ainsi modifi&#233;&#160;:</p><p style=\"page-break-after: avoid;\">1&#176;&#160;Le tableau du <i>a</i> est ainsi r&#233;dig&#233;&#160;:</p><p>&#171;</p><table style=\"width: 242.25pt;\" width=\"0\"><tbody><tr><td style=\"width: 167.25pt; border: solid black 1.0pt; padding: .75pt .75pt .75pt .75pt;\" width=\"227\"><p style=\"page-break-after: avoid;\">&#160;Base mensuelle du pr&#233;l&#232;vement</p></td><td style=\"width: 69.75pt; border: solid black 1.0pt; padding: .75pt .75pt .75pt .75pt;\" width=\"96\"><p style=\"page-break-after: avoid;\">&#160;Taux proportionnel</p></td></tr><tr><td style=\"width: 167.25pt; border: solid black 1.0pt; padding: .75pt .75pt .75pt .75pt;\" width=\"227\"><p style=\"page-break-after: avoid;\">&#160;Inf&#233;rieure ou &#233;gale &#224; 1 558&#160;&#8364;</p></td><td style=\"width: 69.75pt; border: solid black 1.0pt; padding: .75pt .75pt .75pt .75pt;\" width=\"96\"><p style=\"page-break-after: avoid;\">&#160;0&#160;%</p></td></tr><tr><td style=\"width: 167.25pt; border: solid black 1.0pt; padding: .75pt .75pt .75pt .75pt;\" width=\"227\"><p style=\"page-break-after: avoid;\">&#160;De 1 559&#160;&#8364; &#224; 1 635&#160;&#8364;</p></td><td style=\"width: 69.75pt; border: solid black 1.0pt; padding: .75pt .75pt .75pt .75pt;\" width=\"96\"><p style=\"page-break-after: avoid;\">&#160;1&#160;%</p></td></tr><tr><td style=\"width: 167.25pt; border: solid black 1.0pt; padding: .75pt .75pt .75pt .75pt;\" width=\"227\"><p style=\"page-break-after: avoid;\">&#160;De 1 636&#160;&#8364; &#224; 1 721&#160;&#8364;</p></td><td style=\"width: 69.75pt; border: solid black 1.0pt; padding: .75pt .75pt .75pt .75pt;\" width=\"96\"><p style=\"page-break-after: avoid;\">&#160;2&#160;%</p></td></tr><tr><td style=\"width: 167.25pt; border: solid black 1.0pt; padding: .75pt .75pt .75pt .75pt;\" width=\"227\"><p style=\"page-break-after: avoid;\">&#160;De 1 722&#160;&#8364; &#224; 1 816&#160;&#8364;</p></td><td style=\"width: 69.75pt; border: solid black 1.0pt; padding: .75pt .75pt .75pt .75pt;\" width=\"96\"><p style=\"page-break-after: avoid;\">&#160;3&#160;%</p></td></tr><tr><td style=\"width: 167.25pt; border: solid black 1.0pt; padding: .75pt .75pt .75pt .75pt;\" width=\"227\"><p style=\"page-break-after: avoid;\">&#160;De 1 817&#160;&#8364; &#224; 1 923&#160;&#8364;</p></td><td style=\"width: 69.75pt; border: solid black 1.0pt; padding: .75pt .75pt .75pt .75pt;\" width=\"96\"><p style=\"page-break-after: avoid;\">&#160;4&#160;%</p></td></tr><tr><td style=\"width: 167.25pt; border: solid black 1.0pt; padding: .75pt .75pt .75pt .75pt;\" width=\"227\"><p style=\"page-break-after: avoid;\">&#160;De 1 924&#160;&#8364; &#224; 2 527&#160;&#8364;</p></td><td style=\"width: 69.75pt; border: solid black 1.0pt; padding: .75pt .75pt .75pt .75pt;\" width=\"96\"><p style=\"page-break-after: avoid;\">&#160;5&#160;%</p></td></tr><tr><td style=\"width: 167.25pt; border: solid black 1.0pt; padding: .75pt .75pt .75pt .75pt;\" width=\"227\"><p style=\"page-break-after: avoid;\">&#160;De 2 528&#160;&#8364; &#224; 2 966&#160;&#8364;</p></td><td style=\"width: 69.75pt; border: solid black 1.0pt; padding: .75pt .75pt .75pt .75pt;\" width=\"96\"><p style=\"page-break-after: avoid;\">&#160;7&#160;%</p></td></tr><tr><td style=\"width: 167.25pt; border: solid black 1.0pt; padding: .75pt .75pt .75pt .75pt;\" width=\"227\"><p style=\"page-break-after: avoid;\">&#160;De 2 967&#160;&#8364; &#224; 3 337&#160;&#8364;</p></td><td style=\"width: 69.75pt; border: solid black 1.0pt; padding: .75pt .75pt .75pt .75pt;\" width=\"96\"><p style=\"page-break-after: avoid;\">&#160;9&#160;%</p></td></tr><tr><td style=\"width: 167.25pt; border: solid black 1.0pt; padding: .75pt .75pt .75pt .75pt;\" width=\"227\"><p style=\"page-break-after: avoid;\">&#160;De 3 338&#160;&#8364; &#224; 4 106&#160;&#8364;</p></td><td style=\"width: 69.75pt; border: solid black 1.0pt; padding: .75pt .75pt .75pt .75pt;\" width=\"96\"><p style=\"page-break-after: avoid;\">&#160;11&#160;%</p></td></tr><tr><td style=\"width: 167.25pt; border: solid black 1.0pt; padding: .75pt .75pt .75pt .75pt;\" width=\"227\"><p style=\"page-break-after: avoid;\">&#160;De 4 107&#160;&#8364; &#224; 5 337&#160;&#8364;</p></td><td style=\"width: 69.75pt; border: solid black 1.0pt; padding: .75pt .75pt .75pt .75pt;\" width=\"96\"><p style=\"page-break-after: avoid;\">&#160;14&#160;%</p></td></tr><tr><td style=\"width: 167.25pt; border: solid black 1.0pt; padding: .75pt .75pt .75pt .75pt;\" width=\"227\"><p style=\"page-break-after: avoid;\">&#160;De 5 338&#160;&#8364; &#224; 7 058&#160;&#8364;</p></td><td style=\"width: 69.75pt; border: solid black 1.0pt; padding: .75pt .75pt .75pt .75pt;\" width=\"96\"><p style=\"page-break-after: avoid;\">&#160;17&#160;%</p></td></tr><tr><td style=\"width: 167.25pt; border: solid black 1.0pt; padding: .75pt .75pt .75pt .75pt;\" width=\"227\"><p style=\"page-break-after: avoid;\">&#160;De 7 059&#160;&#8364; &#224; 10 022&#160;&#8364;</p></td><td style=\"width: 69.75pt; border: solid black 1.0pt; padding: .75pt .75pt .75pt .75pt;\" width=\"96\"><p style=\"page-break-after: avoid;\">&#160;20&#160;%</p></td></tr><tr><td style=\"width: 167.25pt; border: solid black 1.0pt; padding: .75pt .75pt .75pt .75pt;\" width=\"227\"><p style=\"page-break-after: avoid;\">&#160;De 10 023&#160;&#8364; &#224; 14 375&#160;&#8364;</p></td><td style=\"width: 69.75pt; border: solid black 1.0pt; padding: .75pt .75pt .75pt .75pt;\" width=\"96\"><p style=\"page-break-after: avoid;\">&#160;25&#160;%</p></td></tr><tr><td style=\"width: 167.25pt; border: solid black 1.0pt; padding: .75pt .75pt .75pt .75pt;\" width=\"227\"><p style=\"page-break-after: avoid;\">&#160;De 14 376&#160;&#8364; &#224; 23 953&#160;&#8364;</p></td><td style=\"width: 69.75pt; border: solid black 1.0pt; padding: .75pt .75pt .75pt .75pt;\" width=\"96\"><p style=\"page-break-after: avoid;\">&#160;30&#160;%</p></td></tr><tr><td style=\"width: 167.25pt; border: solid black 1.0pt; padding: .75pt .75pt .75pt .75pt;\" width=\"227\"><p style=\"page-break-after: avoid;\">&#160;De 23 954&#160;&#8364; &#224; 107 578&#160;&#8364;</p></td><td style=\"width: 69.75pt; border: solid black 1.0pt; padding: .75pt .75pt .75pt .75pt;\" width=\"96\"><p style=\"page-break-after: avoid;\">&#160;36&#160;%</p></td></tr><tr><td style=\"width: 167.25pt; border: solid black 1.0pt; padding: .75pt .75pt .75pt .75pt;\" width=\"227\"><p>&#160;Sup&#233;rieure &#224; 107 578&#160;&#8364;</p></td><td style=\"width: 69.75pt; border: solid black 1.0pt; padding: .75pt .75pt .75pt .75pt;\" width=\"96\"><p>&#160;43&#160;%</p></td></tr></tbody></table><p>&#160;&#187;&#160;;</p><p style=\"page-break-after: avoid;\">2&#176; Le tableau du <i>b</i> est ainsi r&#233;dig&#233;&#160;:</p><p>&#171;</p><table style=\"width: 244.5pt;\" width=\"0\"><tbody><tr><td style=\"width: 166.8pt; border: solid black 1.0pt; padding: .75pt .75pt .75pt .75pt;\" width=\"230\"><p style=\"page-break-after: avoid;\">&#160;Base mensuelle du pr&#233;l&#232;vement</p></td><td style=\"width: 68.7pt; border: solid black 1.0pt; padding: .75pt .75pt .75pt .75pt;\" width=\"96\"><p style=\"page-break-after: avoid;\">&#160;Taux proportionnel</p></td></tr><tr><td style=\"width: 166.8pt; border: solid black 1.0pt; padding: .75pt .75pt .75pt .75pt;\" width=\"230\"><p style=\"page-break-after: avoid;\">&#160;Inf&#233;rieure ou &#233;gale &#224; 1 756&#160;&#8364;</p></td><td style=\"width: 68.7pt; border: solid black 1.0pt; padding: .75pt .75pt .75pt .75pt;\" width=\"96\"><p style=\"page-break-after: avoid;\">&#160;0&#160;%</p></td></tr><tr><td style=\"width: 166.8pt; border: solid black 1.0pt; padding: .75pt .75pt .75pt .75pt;\" width=\"230\"><p style=\"page-break-after: avoid;\">&#160;De 1 757&#160;&#8364; &#224; 1 886&#160;&#8364;</p></td><td style=\"width: 68.7pt; border: solid black 1.0pt; padding: .75pt .75pt .75pt .75pt;\" width=\"96\"><p style=\"page-break-after: avoid;\">&#160;1&#160;%</p></td></tr><tr><td style=\"width: 166.8pt; border: solid black 1.0pt; padding: .75pt .75pt .75pt .75pt;\" width=\"230\"><p style=\"page-break-after: avoid;\">&#160;De 1 887&#160;&#8364; &#224; 2 038&#160;&#8364;</p></td><td style=\"width: 68.7pt; border: solid black 1.0pt; padding: .75pt .75pt .75pt .75pt;\" width=\"96\"><p style=\"page-break-after: avoid;\">&#160;2&#160;%</p></td></tr><tr><td style=\"width: 166.8pt; border: solid black 1.0pt; padding: .75pt .75pt .75pt .75pt;\" width=\"230\"><p style=\"page-break-after: avoid;\">&#160;De 2 039&#160;&#8364; &#224; 2 216&#160;&#8364;</p></td><td style=\"width: 68.7pt; border: solid black 1.0pt; padding: .75pt .75pt .75pt .75pt;\" width=\"96\"><p style=\"page-break-after: avoid;\">&#160;3&#160;%</p></td></tr><tr><td style=\"width: 166.8pt; border: solid black 1.0pt; padding: .75pt .75pt .75pt .75pt;\" width=\"230\"><p style=\"page-break-after: avoid;\">&#160;De 2 217&#160;&#8364; &#224; 2 593&#160;&#8364;</p></td><td style=\"width: 68.7pt; border: solid black 1.0pt; padding: .75pt .75pt .75pt .75pt;\" width=\"96\"><p style=\"page-break-after: avoid;\">&#160;4&#160;%</p></td></tr><tr><td style=\"width: 166.8pt; border: solid black 1.0pt; padding: .75pt .75pt .75pt .75pt;\" width=\"230\"><p style=\"page-break-after: avoid;\">&#160;De 2 594&#160;&#8364; &#224; 3 140&#160;&#8364;</p></td><td style=\"width: 68.7pt; border: solid black 1.0pt; padding: .75pt .75pt .75pt .75pt;\" width=\"96\"><p style=\"page-break-after: avoid;\">&#160;5&#160;%</p></td></tr><tr><td style=\"width: 166.8pt; border: solid black 1.0pt; padding: .75pt .75pt .75pt .75pt;\" width=\"230\"><p style=\"page-break-after: avoid;\">&#160;De 3 141&#160;&#8364; &#224; 3 773&#160;&#8364;</p></td><td style=\"width: 68.7pt; border: solid black 1.0pt; padding: .75pt .75pt .75pt .75pt;\" width=\"96\"><p style=\"page-break-after: avoid;\">&#160;7&#160;%</p></td></tr><tr><td style=\"width: 166.8pt; border: solid black 1.0pt; padding: .75pt .75pt .75pt .75pt;\" width=\"230\"><p style=\"page-break-after: avoid;\">&#160;De 3 774&#160;&#8364; &#224; 4 664&#160;&#8364;</p></td><td style=\"width: 68.7pt; border: solid black 1.0pt; padding: .75pt .75pt .75pt .75pt;\" width=\"96\"><p style=\"page-break-after: avoid;\">&#160;9&#160;%</p></td></tr><tr><td style=\"width: 166.8pt; border: solid black 1.0pt; padding: .75pt .75pt .75pt .75pt;\" width=\"230\"><p style=\"page-break-after: avoid;\">&#160;De 4 665&#160;&#8364; &#224; 5 740&#160;&#8364;</p></td><td style=\"width: 68.7pt; border: solid black 1.0pt; padding: .75pt .75pt .75pt .75pt;\" width=\"96\"><p style=\"page-break-after: avoid;\">&#160;11&#160;%</p></td></tr><tr><td style=\"width: 166.8pt; border: solid black 1.0pt; padding: .75pt .75pt .75pt .75pt;\" width=\"230\"><p style=\"page-break-after: avoid;\">&#160;De 5 741&#160;&#8364; &#224; 7 062&#160;&#8364;</p></td><td style=\"width: 68.7pt; border: solid black 1.0pt; padding: .75pt .75pt .75pt .75pt;\" width=\"96\"><p style=\"page-break-after: avoid;\">&#160;14&#160;%</p></td></tr><tr><td style=\"width: 166.8pt; border: solid black 1.0pt; padding: .75pt .75pt .75pt .75pt;\" width=\"230\"><p style=\"page-break-after: avoid;\">&#160;De 7 063&#160;&#8364; &#224; 8 315&#160;&#8364;</p></td><td style=\"width: 68.7pt; border: solid black 1.0pt; padding: .75pt .75pt .75pt .75pt;\" width=\"96\"><p style=\"page-break-after: avoid;\">&#160;17&#160;%</p></td></tr><tr><td style=\"width: 166.8pt; border: solid black 1.0pt; padding: .75pt .75pt .75pt .75pt;\" width=\"230\"><p style=\"page-break-after: avoid;\">&#160;De 8 316&#160;&#8364; &#224; 11 380&#160;&#8364;</p></td><td style=\"width: 68.7pt; border: solid black 1.0pt; padding: .75pt .75pt .75pt .75pt;\" width=\"96\"><p style=\"page-break-after: avoid;\">&#160;20&#160;%</p></td></tr><tr><td style=\"width: 166.8pt; border: solid black 1.0pt; padding: .75pt .75pt .75pt .75pt;\" width=\"230\"><p style=\"page-break-after: avoid;\">&#160;De 11 381&#160;&#8364; &#224; 15 792&#160;&#8364;</p></td><td style=\"width: 68.7pt; border: solid black 1.0pt; padding: .75pt .75pt .75pt .75pt;\" width=\"96\"><p style=\"page-break-after: avoid;\">&#160;25&#160;%</p></td></tr><tr><td style=\"width: 166.8pt; border: solid black 1.0pt; padding: .75pt .75pt .75pt .75pt;\" width=\"230\"><p style=\"page-break-after: avoid;\">&#160;De 15 793&#160;&#8364; &#224; 26 313&#160;&#8364;</p></td><td style=\"width: 68.7pt; border: solid black 1.0pt; padding: .75pt .75pt .75pt .75pt;\" width=\"96\"><p style=\"page-break-after: avoid;\">&#160;30&#160;%</p></td></tr><tr><td style=\"width: 166.8pt; border: solid black 1.0pt; padding: .75pt .75pt .75pt .75pt;\" width=\"230\"><p style=\"page-break-after: avoid;\">&#160;De 26 314&#160;&#8364; &#224; 118 177&#160;&#8364;</p></td><td style=\"width: 68.7pt; border: solid black 1.0pt; padding: .75pt .75pt .75pt .75pt;\" width=\"96\"><p style=\"page-break-after: avoid;\">&#160;36&#160;%</p></td></tr><tr><td style=\"width: 166.8pt; border: solid black 1.0pt; padding: .75pt .75pt .75pt .75pt;\" width=\"230\"><p>&#160;Sup&#233;rieure &#224; 118 177&#160;&#8364;</p></td><td style=\"width: 68.7pt; border: solid black 1.0pt; padding: .75pt .75pt .75pt .75pt;\" width=\"96\"><p>&#160;43&#160;%</p></td></tr></tbody></table><p>&#160;&#187;&#160;;</p><p style=\"page-break-after: avoid;\">3&#176; Le tableau du <i>c</i> est ainsi r&#233;dig&#233;&#160;:</p><p>&#171;&#160;</p><table style=\"width: 240.75pt;\" width=\"0\"><tbody><tr><td style=\"width: 166.5pt; border: solid black 1.0pt; padding: .75pt .75pt .75pt .75pt;\" width=\"226\"><p style=\"page-break-after: avoid;\">&#160;Base mensuelle du pr&#233;l&#232;vement</p></td><td style=\"width: 69.0pt; border: solid black 1.0pt; padding: .75pt .75pt .75pt .75pt;\" width=\"95\"><p style=\"page-break-after: avoid;\">&#160;Taux proportionnel</p></td></tr><tr><td style=\"width: 166.5pt; border: solid black 1.0pt; padding: .75pt .75pt .75pt .75pt;\" width=\"226\"><p style=\"page-break-after: avoid;\">&#160;Inf&#233;rieure ou &#233;gale &#224; 1 870&#160;&#8364;</p></td><td style=\"width: 69.0pt; border: solid black 1.0pt; padding: .75pt .75pt .75pt .75pt;\" width=\"95\"><p style=\"page-break-after: avoid;\">&#160;0&#160;%</p></td></tr><tr><td style=\"width: 166.5pt; border: solid black 1.0pt; padding: .75pt .75pt .75pt .75pt;\" width=\"226\"><p style=\"page-break-after: avoid;\">&#160;De 1 871&#160;&#8364; &#224; 2 036&#160;&#8364;</p></td><td style=\"width: 69.0pt; border: solid black 1.0pt; padding: .75pt .75pt .75pt .75pt;\" width=\"95\"><p style=\"page-break-after: avoid;\">&#160;1&#160;%</p></td></tr><tr><td style=\"width: 166.5pt; border: solid black 1.0pt; padding: .75pt .75pt .75pt .75pt;\" width=\"226\"><p style=\"page-break-after: avoid;\">&#160;De 2 037&#160;&#8364; &#224; 2 234&#160;&#8364;</p></td><td style=\"width: 69.0pt; border: solid black 1.0pt; padding: .75pt .75pt .75pt .75pt;\" width=\"95\"><p style=\"page-break-after: avoid;\">&#160;2&#160;%</p></td></tr><tr><td style=\"width: 166.5pt; border: solid black 1.0pt; padding: .75pt .75pt .75pt .75pt;\" width=\"226\"><p style=\"page-break-after: avoid;\">&#160;De 2 235&#160;&#8364; &#224; 2 477&#160;&#8364;</p></td><td style=\"width: 69.0pt; border: solid black 1.0pt; padding: .75pt .75pt .75pt .75pt;\" width=\"95\"><p style=\"page-break-after: avoid;\">&#160;3&#160;%</p></td></tr><tr><td style=\"width: 166.5pt; border: solid black 1.0pt; padding: .75pt .75pt .75pt .75pt;\" width=\"226\"><p style=\"page-break-after: avoid;\">&#160;De 2 478&#160;&#8364; &#224; 2 859&#160;&#8364;</p></td><td style=\"width: 69.0pt; border: solid black 1.0pt; padding: .75pt .75pt .75pt .75pt;\" width=\"95\"><p style=\"page-break-after: avoid;\">&#160;4&#160;%</p></td></tr><tr><td style=\"width: 166.5pt; border: solid black 1.0pt; padding: .75pt .75pt .75pt .75pt;\" width=\"226\"><p style=\"page-break-after: avoid;\">&#160;De 2 860&#160;&#8364; &#224; 3 481&#160;&#8364;</p></td><td style=\"width: 69.0pt; border: solid black 1.0pt; padding: .75pt .75pt .75pt .75pt;\" width=\"95\"><p style=\"page-break-after: avoid;\">&#160;5&#160;%</p></td></tr><tr><td style=\"width: 166.5pt; border: solid black 1.0pt; padding: .75pt .75pt .75pt .75pt;\" width=\"226\"><p style=\"page-break-after: avoid;\">&#160;De 3 482&#160;&#8364; &#224; 4 446&#160;&#8364;</p></td><td style=\"width: 69.0pt; border: solid black 1.0pt; padding: .75pt .75pt .75pt .75pt;\" width=\"95\"><p style=\"page-break-after: avoid;\">&#160;7&#160;%</p></td></tr><tr><td style=\"width: 166.5pt; border: solid black 1.0pt; padding: .75pt .75pt .75pt .75pt;\" width=\"226\"><p style=\"page-break-after: avoid;\">&#160;De 4 447&#160;&#8364; &#224; 5 081&#160;&#8364;</p></td><td style=\"width: 69.0pt; border: solid black 1.0pt; padding: .75pt .75pt .75pt .75pt;\" width=\"95\"><p style=\"page-break-after: avoid;\">&#160;9&#160;%</p></td></tr><tr><td style=\"width: 166.5pt; border: solid black 1.0pt; padding: .75pt .75pt .75pt .75pt;\" width=\"226\"><p style=\"page-break-after: avoid;\">&#160;De 5 082&#160;&#8364; &#224; 6 253&#160;&#8364;</p></td><td style=\"width: 69.0pt; border: solid black 1.0pt; padding: .75pt .75pt .75pt .75pt;\" width=\"95\"><p style=\"page-break-after: avoid;\">&#160;11&#160;%</p></td></tr><tr><td style=\"width: 166.5pt; border: solid black 1.0pt; padding: .75pt .75pt .75pt .75pt;\" width=\"226\"><p style=\"page-break-after: avoid;\">&#160;De 6 254&#160;&#8364; &#224; 7 397&#160;&#8364;</p></td><td style=\"width: 69.0pt; border: solid black 1.0pt; padding: .75pt .75pt .75pt .75pt;\" width=\"95\"><p style=\"page-break-after: avoid;\">&#160;14&#160;%</p></td></tr><tr><td style=\"width: 166.5pt; border: solid black 1.0pt; padding: .75pt .75pt .75pt .75pt;\" width=\"226\"><p style=\"page-break-after: avoid;\">&#160;De 7 398&#160;&#8364; &#224; 8 708&#160;&#8364;</p></td><td style=\"width: 69.0pt; border: solid black 1.0pt; padding: .75pt .75pt .75pt .75pt;\" width=\"95\"><p style=\"page-break-after: avoid;\">&#160;17&#160;%</p></td></tr><tr><td style=\"width: 166.5pt; border: solid black 1.0pt; padding: .75pt .75pt .75pt .75pt;\" width=\"226\"><p style=\"page-break-after: avoid;\">&#160;De 8 709&#160;&#8364; &#224; 11 797&#160;&#8364;</p></td><td style=\"width: 69.0pt; border: solid black 1.0pt; padding: .75pt .75pt .75pt .75pt;\" width=\"95\"><p style=\"page-break-after: avoid;\">&#160;20&#160;%</p></td></tr><tr><td style=\"width: 166.5pt; border: solid black 1.0pt; padding: .75pt .75pt .75pt .75pt;\" width=\"226\"><p style=\"page-break-after: avoid;\">&#160;De 11 798&#160;&#8364; &#224; 16 236&#160;&#8364;</p></td><td style=\"width: 69.0pt; border: solid black 1.0pt; padding: .75pt .75pt .75pt .75pt;\" width=\"95\"><p style=\"page-break-after: avoid;\">&#160;25&#160;%</p></td></tr><tr><td style=\"width: 166.5pt; border: solid black 1.0pt; padding: .75pt .75pt .75pt .75pt;\" width=\"226\"><p style=\"page-break-after: avoid;\">&#160;De 16 237&#160;&#8364; &#224; 27 053&#160;&#8364;</p></td><td style=\"width: 69.0pt; border: solid black 1.0pt; padding: .75pt .75pt .75pt .75pt;\" width=\"95\"><p style=\"page-break-after: avoid;\">&#160;30&#160;%</p></td></tr><tr><td style=\"width: 166.5pt; border: solid black 1.0pt; padding: .75pt .75pt .75pt .75pt;\" width=\"226\"><p style=\"page-break-after: avoid;\">&#160;De 27 054&#160;&#8364; &#224; 121 502&#160;&#8364;</p></td><td style=\"width: 69.0pt; border: solid black 1.0pt; padding: .75pt .75pt .75pt .75pt;\" width=\"95\"><p style=\"page-break-after: avoid;\">&#160;36&#160;%</p></td></tr><tr><td style=\"width: 166.5pt; border: solid black 1.0pt; padding: .75pt .75pt .75pt .75pt;\" width=\"226\"><p>&#160;Sup&#233;rieure &#224; 121 502&#160;&#8364;</p></td><td style=\"width: 69.0pt; border: solid black 1.0pt; padding: .75pt .75pt .75pt .75pt;\" width=\"95\"><p>&#160;43&#160;%</p></td></tr></tbody></table><p style=\"text-align: right;\">&#160;&#187;.</p><p>II.&#160;&#8211;&#160;Le pr&#233;sent article entre en vigueur le 1<sup>er</sup> janvier 2019.</p><p>III.&#160;&#8211;&#160;La perte de recettes pour l&#8217;&#201;tat est compens&#233;e &#224; due concurrence par la cr&#233;ation d&#8217;une taxe additionnelle aux droits mentionn&#233;s aux articles 575 et 575 A du code g&#233;n&#233;ral des imp&#244;ts.</p>",
    "exposeSommaire": "<p style=\"text-align: justify;\">Cet amendement vise &#224; corriger la m&#233;canique du taux forfaitaire.</p><p style=\"text-align: justify;\">Il est pr&#233;vu dans le cadre de la r&#233;forme que le contribuable puisse demander l&#8217;application par son employeur d&#8217;un taux neutre, &#171;&#160;forfaitaire&#160;&#187;, au lieu des taux calcul&#233;s par l&#8217;administration et tenant compte de ses revenus.</p><p style=\"text-align: justify;\">Ce m&#233;canisme est notamment pr&#233;vu pour les contribuables qui ne souhaiteraient pas que leur employeur ne d&#233;duise, par le niveau de pr&#233;l&#232;vement, d&#8217;informations relevant de leur vie priv&#233;e (existence d&#8217;autres revenus par exemple).</p><p style=\"text-align: justify;\">Or, le taux forfaitaire pr&#233;vu par le projet du gouvernement est tel que son utilisation sera quasi-syst&#233;matiquement d&#233;favorable aux contribuables&#160;: ce dernier devra avancer &#224; l&#8217;&#201;tat jusqu&#8217;&#224; la r&#233;gularisation, l&#8217;ann&#233;e suivante, une somme non n&#233;gligeable pouvant s&#8217;&#233;lever dans certains cas &#224; un mois de salaire&#160;!</p><p style=\"text-align: justify;\">Autre probl&#232;me&#160;: ce taux forfaitaire est source d&#8217;effets de seuil pouvant conduire &#224; une surimposition pour quelques&#160;euros suppl&#233;mentaires de revenu&#160;!</p><p style=\"text-align: justify;\">Le taux forfaitaire &#233;tant le m&#234;me selon que l&#8217;on est c&#233;libataire, mari&#233; ou avec des enfants, les &#233;carts en d&#233;faveur des contribuables existent dans toutes les situations.</p><p style=\"text-align: justify;\">Pire&#160;: ce m&#233;canisme s&#8217;av&#232;re particuli&#232;rement p&#233;nalisant pour les plus jeunes des contribuables, qu&#8217;ils soient nouveaux entrants sur le march&#233; du travail ou encore rattach&#233;s au foyer fiscal de leurs parents, car dans ces cas, le taux forfaitaire, tel que cela est envisag&#233; dans le m&#233;canisme r&#233;sultant de l&#8217;article&#160;60 de la loi de finances pour 2017.</p><p style=\"text-align: justify;\">Pour cette raison, le bar&#232;me du taux forfaitaire doit &#234;tre revu dans un sens o&#249; il ne sera plus syst&#233;matiquement d&#233;favorable.</p><p style=\"text-align: justify;\">Le pr&#233;sent amendement propose un taux calcul&#233; pour un couple de personnes mari&#233;es ayant un enfant &#224; charge et percevant le m&#234;me revenu.</p>"
  },
  "representations": [
    {
      "nom": "PDF",
      "typeMime": {
        "type": "application",
        "subType": "PDF"
      },
      "statutRepresentation": {
        "verbatim": true,
        "canonique": true,
        "officielle": true,
        "transcription": false,
        "enregistrement": false
      },
      "contenu": {
        "documentURI": "/15/amendements/1371/AN/191.pdf"
      }
    }
  ],
  "seanceDiscussion": "RUANR5L15S2019IDS21366",
  "sort": {
    "dateSaisie": "2018-11-13T01:37:05.000+01:00",
    "sortEnSeance": "Rejeté"
  },
  "dateDepot": "2018-11-09T01:00:00.000+01:00",
  "dateDistribution": "2018-11-12T01:00:00.000+01:00",
  "article99": "0",
  "loiReference": {
    "codeLoi": "CGI",
    "divisionCodeLoi": "204 H"
  }
}