{
  "uid": "AMANR5L15SEA717460BTC1019P0D1N88",
  "identifiant": {
    "legislature": "15",
    "numero": "88",
    "numRect": "0",
    "saisine": {
      "texteLegislatifRef": "PRJLANR5L15BTC1019",
      "numeroPartiePLF": "0",
      "organeExamen": "PO717460",
      "mentionSecondeDeliberation": "1"
    }
  },
  "numeroLong": "88",
  "etapeTexte": "1ère lecture (1ère assemblée saisie)",
  "triAmendement": "aji",
  "cardinaliteAmdtMultiples": "1",
  "etat": "Discuté",
  "signataires": {
    "auteur": {
      "typeAuteur": "Depute",
      "acteurRef": "PA719318",
      "groupePolitiqueRef": "PO730934"
    },
    "cosignatairesRefs": [
      "PA720100",
      "PA267378",
      "PA266808",
      "PA721506",
      "PA267450",
      "PA721968",
      "PA605036",
      "PA642847",
      "PA266776",
      "PA721286",
      "PA721046",
      "PA340853",
      "PA718884",
      "PA608016",
      "PA718838",
      "PA346218",
      "PA719318"
    ],
    "texteAffichable": "Mme&#160;Anthoine,  Mme&#160;Bazin-Malgras, M.&#160;Leclerc, M.&#160;Pradi&#233;, M.&#160;Masson, Mme&#160;Levy, M.&#160;Ramadier, M.&#160;Rolland, Mme&#160;Kuster, M.&#160;Vialay, M.&#160;Abad, M.&#160;Bazin, M.&#160;R&#233;mi&#160;Delatte, M.&#160;Reiss, M.&#160;Brun, Mme&#160;Louwagie et Mme&#160;Bassire"
  },
  "pointeurFragmentTexte": {
    "division": {
      "titre": "Article 40",
      "articleDesignationCourte": "ART. 40",
      "type": "ARTICLE",
      "avantAApres": "A",
      "divisionRattachee": "ARTICLE 40",
      "urlDivisionTexteVise": "/15/textes/1019.asp#D_Article_40"
    },
    "alinea": {
      "numero": "4"
    }
  },
  "corps": {
    "dispositif": "<p style=\"text-align: justify;\">Supprimer l&#8217;alin&#233;a&#160;4.</p>",
    "exposeSommaire": "<p style=\"text-align: justify;\">Le gouvernement a lanc&#233; des discussions pour r&#233;former l&#8217;obligation d&#8217;emploi des travailleurs handicap&#233;s, souhaitant faire &#233;voluer nombre de param&#232;tres. La FNATH participe &#224; ces discussions, qui se poursuivent actuellement. Des amendements gouvernementaux devraient &#234;tre pr&#233;sent&#233;s dans le cadre du d&#233;bat parlementaire. C&#8217;est pourquoi les observations ci-apr&#232;s ne portent que sur les dispositions pr&#233;vues dans le projet de loi tel que transmis. L&#8217;association fera part d&#8217;autres observations au fur et &#224; mesure.</p><p style=\"text-align: justify;\">Le projet de loi pr&#233;voit le maintien de l&#8217;obligation d&#8217;emploi dans la loi et fixe le taux &#224; 6&#160;%. Il introduit toutefois une &#233;volution notable puisqu&#8217;il introduit une clause de revoyure tous les cinq ans. La FNATH n&#8217;est pas favorable &#224; cette clause de revoyure, qui introduit plus d&#8217;instabilit&#233;, y compris pour les entreprises. Elle propose donc de la supprimer.</p><p style=\"text-align: justify;\">Toutefois, elle propose &#233;galement des modifications, dans le cas o&#249; elle viendrait &#224; &#234;tre maintenue. Ces modifications visent toutefois &#224; pr&#233;voir&#160;:</p><p style=\"text-align: justify;\">- Que cette r&#233;vision n&#8217;est pas obligatoire mais bien facultative,</p><p style=\"text-align: justify;\">- Qu&#8217;elle fait l&#8217;objet d&#8217;une large concertation suivie d&#8217;effet, par le biais d&#8217;un avis conforme remis par le conseil national consultatif des personnes handicap&#233;es.</p><p style=\"text-align: justify;\">En outre, afin de renforcer le maintien en emploi des personnes handicap&#233;es de plus de 50 ans, particuli&#232;rement touch&#233;es par le ch&#244;mage, il est propos&#233; de pr&#233;voir par d&#233;cret une survalorisation des d&#233;penses d&#233;ductibles les concernant sp&#233;cifiquement.</p>"
  },
  "representations": [
    {
      "nom": "PDF",
      "typeMime": {
        "type": "application",
        "subType": "PDF"
      },
      "statutRepresentation": {
        "verbatim": true,
        "canonique": true,
        "officielle": true,
        "transcription": false,
        "enregistrement": false
      },
      "contenu": {
        "documentURI": "/15/amendements/1019/AN/88.pdf"
      }
    }
  ],
  "seanceDiscussion": "RUANR5L15S2018IDS21106",
  "sort": {
    "dateSaisie": "2018-06-16T00:55:17.000+02:00",
    "sortEnSeance": "Non soutenu"
  },
  "dateDepot": "2018-06-05T02:00:00.000+02:00",
  "dateDistribution": "2018-06-12T02:00:00.000+02:00",
  "article99": "0",
  "loiReference": {}
}