{
  "uid": "AMANR5L15SEA717460B2272P2D1N699",
  "identifiant": {
    "legislature": "15",
    "numero": "699",
    "numRect": "0",
    "saisine": {
      "texteLegislatifRef": "PRJLANR5L15B2272",
      "numeroPartiePLF": "2",
      "organeExamen": "PO717460",
      "mentionSecondeDeliberation": "0"
    }
  },
  "numeroLong": "II-699",
  "etapeTexte": "1ère lecture (1ère assemblée saisie)",
  "triAmendement": "adciaaaaaaaaaaaaaaaaaaaaaaaaaaaaaaaaaaaaaaaaaaaaaazki",
  "cardinaliteAmdtMultiples": "1",
  "etat": "Discuté",
  "signataires": {
    "auteur": {
      "typeAuteur": "Depute",
      "acteurRef": "PA609590",
      "groupePolitiqueRef": "PO758835"
    },
    "cosignatairesRefs": [
      "PA609332",
      "PA608011",
      "PA429893",
      "PA609590"
    ],
    "texteAffichable": "Mme&#160;Rabault,  M.&#160;Pueyo, M.&#160;Carvounas et M.&#160;Faure"
  },
  "pointeurFragmentTexte": {
    "missionVisee": {
      "idMissionAN": "803",
      "libelleMission": "Anciens combattants, mémoire et liens avec la nation",
      "codeMissionPLF": "B",
      "libelleMissionPLF": "Répartition, par mission et programme, des crédits du budget général"
    },
    "division": {
      "titre": "Article 73",
      "articleDesignationCourte": "AVANT ART. 73",
      "type": "ARTICLE",
      "avantAApres": "Avant",
      "divisionRattachee": "AVANT L'ARTICLE 73, insérer l'article suivant:",
      "articleAdditionnel": "1",
      "urlDivisionTexteVise": "/15/textes/2272C.asp#D_Article_73"
    }
  },
  "corps": {
    "dispositif": "<p style=\"text-align: justify;\">Dans un d&#233;lai de trois mois &#224; compter de la promulgation de la pr&#233;sente loi, le Gouvernement remet au Parlement un rapport sur la gestion financi&#232;re du programme des Cadets de la D&#233;fense et sur l&#8217;&#233;ventualit&#233; d&#8217;un &#233;largissement cons&#233;quent de ce dispositif sur l&#8217;ensemble du territoire.</p>",
    "exposeSommaire": "<p style=\"text-align: justify;\">Cet amendement port&#233; par le groupe Socialistes et Apparent&#233;s demande la remise d&#8217;un rapport sur la gestion financi&#232;re du dispositif des Cadets de la D&#233;fense port&#233; par le minist&#232;re des Arm&#233;es afin d&#8217;envisager une &#233;ventuelle mont&#233;e en puissance de ce dispositif. Ce dispositif est financ&#233; dans le cadre de l&#8217;action n&#176;&#160;1 &#171;&#160;liens arm&#233;es jeunesse&#160;&#187; du programme 167 &#171;&#160;Liens entre la Nation et son arm&#233;e&#160;&#187;.</p><p style=\"text-align: justify;\">Les rapports&#160;du groupe de travail de la Commission Arm&#233;es-Jeunesse et des d&#233;put&#233;s&#160;Joaquim PUEYO et Marianne DUBOIS en 2015 d&#233;montraient les&#160;&#233;volutions &#171;&#160;extr&#234;mement positives des jeunes, &#224; la fois dans leur comportement (et) dans leurs r&#233;sultats scolaires&#160;&#187; du fait de leur participation &#224; ce programme.&#160;</p><p style=\"text-align: justify;\">Le groupe de travail et les d&#233;put&#233;s avaient dress&#233; un constat tr&#232;s positif et exprimaient leur volont&#233; de voir&#160;ce dispositif se&#160;d&#233;velopper notamment, par &#171;&#160;l&#8217;accroissement du nombre de centres et la continuit&#233; de l&#8217;offre de fa&#231;on &#224; organiser un continuum avec les pr&#233;parations militaires&#160;&#187;.</p><p style=\"text-align: justify;\">L&#8217;ouverture de nouveaux centres permettrait de r&#233;pondre &#224; une demande croissante et d&#8217;am&#233;liorer le maillage sur l&#8217;ensemble du territoire.</p><p style=\"text-align: justify;\">La pertinence de ce rapport est renforc&#233;e par la mise en place dans les mois &#224; venir du Service National Universel. Il est donc n&#233;cessaire d&#8217;&#233;valuer les dispositifs existants afin de renforcer de p&#233;renniser et d&#233;velopper les programmes performants.</p>"
  },
  "representations": [
    {
      "nom": "PDF",
      "typeMime": {
        "type": "application",
        "subType": "PDF"
      },
      "statutRepresentation": {
        "verbatim": true,
        "canonique": true,
        "officielle": true,
        "transcription": false,
        "enregistrement": false
      },
      "contenu": {
        "documentURI": "/15/amendements/2272C/AN/699.pdf"
      }
    }
  ],
  "seanceDiscussion": "RUANR5L15S2020IDS21896",
  "sort": {
    "dateSaisie": "2019-10-30T22:51:30.000+01:00",
    "sortEnSeance": "Rejeté"
  },
  "dateDepot": "2019-10-25T02:00:00.000+02:00",
  "dateDistribution": "2019-10-29T01:00:00.000+01:00",
  "article99": "0",
  "loiReference": {}
}