{
  "uid": "AMANR5L15SEA717460BTC1173P0D1N491",
  "identifiant": {
    "legislature": "15",
    "numero": "491",
    "numRect": "0",
    "saisine": {
      "texteLegislatifRef": "PRJLANR5L15BTC1173",
      "numeroPartiePLF": "0",
      "organeExamen": "PO717460",
      "mentionSecondeDeliberation": "0"
    }
  },
  "numeroLong": "491",
  "etapeTexte": "Nouvelle Lecture",
  "triAmendement": "i",
  "cardinaliteAmdtMultiples": "1",
  "etat": "Discuté",
  "signataires": {
    "auteur": {
      "typeAuteur": "Gouvernement"
    },
    "texteAffichable": "le Gouvernement"
  },
  "pointeurFragmentTexte": {
    "division": {
      "titre": "Article 9 quater",
      "articleDesignationCourte": "ART. 9 QUATER",
      "type": "ARTICLE",
      "avantAApres": "A",
      "divisionRattachee": "ARTICLE 9 QUATER",
      "urlDivisionTexteVise": "/15/textes/1173.asp#D_Article_9_quater"
    },
    "alinea": {
      "numero": "2"
    }
  },
  "corps": {
    "dispositif": "<p style=\"text-align: justify;\">Apr&#232;s le mot&#160;:</p><p style=\"text-align: justify;\">&#171;&#160;modalit&#233;s&#160;&#187;,</p><p style=\"text-align: justify;\">r&#233;diger ainsi la fin de l&#8217;alin&#233;a&#160;2&#160;:</p><p style=\"text-align: justify;\">&#171;&#160;fix&#233;es par d&#233;cret en Conseil d&#8217;&#201;tat&#160;&#187;.</p>",
    "exposeSommaire": "<p style=\"text-align: justify;\">Amendement r&#233;dactionnel et de coordination.</p>"
  },
  "representations": [
    {
      "nom": "PDF",
      "typeMime": {
        "type": "application",
        "subType": "PDF"
      },
      "statutRepresentation": {
        "verbatim": true,
        "canonique": true,
        "officielle": true,
        "transcription": false,
        "enregistrement": false
      },
      "contenu": {
        "documentURI": "/15/amendements/1173/AN/491.pdf"
      }
    }
  ],
  "seanceDiscussion": "RUANR5L15S2018IDS21204",
  "sort": {
    "dateSaisie": "2018-07-26T17:16:29.000+02:00",
    "sortEnSeance": "Adopté"
  },
  "dateDepot": "2018-07-21T02:00:00.000+02:00",
  "dateDistribution": "2018-07-23T02:00:00.000+02:00",
  "article99": "0",
  "loiReference": {}
}