{
  "uid": "AMANR5L15PO59048B0485P0D1N224",
  "identifiant": {
    "legislature": "15",
    "numero": "224",
    "numRect": "0",
    "saisine": {
      "texteLegislatifRef": "PRJLANR5L15B0485",
      "numeroPartiePLF": "0",
      "organeExamen": "PO59048",
      "mentionSecondeDeliberation": "0"
    }
  },
  "numeroLong": "CF224",
  "etapeTexte": "Nouvelle Lecture",
  "triAmendement": "l",
  "cardinaliteAmdtMultiples": "1",
  "etat": "Discuté",
  "signataires": {
    "auteur": {
      "typeAuteur": "Depute",
      "acteurRef": "PA609590",
      "groupePolitiqueRef": "PO730946"
    },
    "cosignatairesRefs": [
      "PA605069",
      "PA405480",
      "PA608172",
      "PA609590"
    ],
    "texteAffichable": "Mme&#160;Rabault,  M.&#160;Jean-Louis&#160;Bricout, Mme&#160;Pires Beaune et M.&#160;Pupponi"
  },
  "pointeurFragmentTexte": {
    "division": {
      "titre": "Article 12 ter A",
      "articleDesignationCourte": "ART. 12 TER A",
      "type": "ARTICLE",
      "avantAApres": "A",
      "divisionRattachee": "ARTICLE 12 TER A",
      "urlDivisionTexteVise": "/15/textes/0485.asp#D_Article_12_ter_A"
    }
  },
  "corps": {
    "dispositif": "<p>Supprimer cet article.</p><p>&#160;</p>",
    "exposeSommaire": "<p>Dans le cadre de leurs activit&#233;s professionnelles salari&#233;es &#224; l'&#233;tranger de nombreux fran&#231;ais expatri&#233;s souscrivent, eu &#233;gard au faible montant des retraites par r&#233;partition de leurs pays d'accueil, des plans de retraite par capitalisation leur permettant de constituer une &#233;pargne retraite.</p><p>Aux Etats-Unis, le plan de retraite 401(k) est ainsi un plan d'&#233;pargne-retraite qui est financ&#233; par des cotisations des employ&#233;s avec des contributions de contrepartie de l'employeur. L'attraction principale de ces plans, en droit fiscal am&#233;ricain, est qu'ils sont tir&#233;s de salaire avant imp&#244;t, et les fonds de croissance en franchise d'imp&#244;t jusqu'&#224; leur retrait.</p><p>L'article 12&#160;ter A, ins&#233;r&#233; au S&#233;nat,&#160;a pour objet&#160;d'inclure les sommes per&#231;ues au titre de ces plans dans le r&#233;gime de l'impatriation fix&#233; par l'article 115 B du code g&#233;n&#233;ral des imp&#244;ts.&#160;</p><p>Cet amendement vise &#224; supprimer cet article.</p><p>&#160;</p>"
  },
  "representations": [
    {
      "nom": "PDF",
      "typeMime": {
        "type": "application",
        "subType": "PDF"
      },
      "statutRepresentation": {
        "verbatim": true,
        "canonique": true,
        "officielle": true,
        "transcription": false,
        "enregistrement": false
      },
      "contenu": {
        "documentURI": "/15/amendements/0485/CION_FIN/CF224.pdf"
      }
    }
  ],
  "sort": {
    "dateSaisie": "2017-12-14T10:24:56.000+01:00",
    "sortEnSeance": "Adopté"
  },
  "dateDepot": "2017-12-13T01:00:00.000+01:00",
  "dateDistribution": "2017-12-14T01:00:00.000+01:00",
  "article99": "0",
  "loiReference": {}
}