{
  "uid": "AMANR5L15PO420120B0904P0D1N1451",
  "identifiant": {
    "legislature": "15",
    "numero": "1451",
    "numRect": "0",
    "saisine": {
      "texteLegislatifRef": "PRJLANR5L15B0904",
      "numeroPartiePLF": "0",
      "organeExamen": "PO420120",
      "mentionSecondeDeliberation": "0"
    }
  },
  "numeroLong": "AS1451",
  "etapeTexte": "1ère lecture (1ère assemblée saisie)",
  "triAmendement": "cp",
  "cardinaliteAmdtMultiples": "1",
  "etat": "Discuté",
  "signataires": {
    "auteur": {
      "typeAuteur": "Depute",
      "acteurRef": "PA719570",
      "groupePolitiqueRef": "PO730964"
    },
    "cosignatairesRefs": [
      "PA719570"
    ],
    "texteAffichable": "Mme&#160;Fabre, rapporteure"
  },
  "pointeurFragmentTexte": {
    "division": {
      "titre": "Article 11",
      "articleDesignationCourte": "ART. 11",
      "type": "ARTICLE",
      "avantAApres": "A",
      "divisionRattachee": "ARTICLE 11",
      "urlDivisionTexteVise": "/15/textes/0904.asp#D_Article_11"
    },
    "alinea": {
      "avantAApres": "A",
      "numero": "11",
      "alineaDesignation": "Alinéa 11"
    }
  },
  "corps": {
    "dispositif": "<p style=\"text-align: justify;\">Substituer &#224; l&#8217;alin&#233;a&#160;11, les deux alin&#233;as suivants&#160;:&#160;</p><p style=\"text-align: justify;\">&#171;&#160;IV.&#160;&#8211;&#160;L&#8217;article L.&#160;241&#8209;9 est ainsi r&#233;dig&#233;&#160;:&#160;</p><p style=\"text-align: justify;\">&#171;&#160;Le contr&#244;le p&#233;dagogique des formations par apprentissage conduisant &#224; un dipl&#244;me est organis&#233; dans les conditions fix&#233;es &#224; l&#8217;article L.&#160;6211&#8209;2 du code du travail.&#160;&#187;</p>",
    "exposeSommaire": "<p style=\"text-align: justify;\">Amendement r&#233;dactionnel.</p>"
  },
  "representations": [
    {
      "nom": "PDF",
      "typeMime": {
        "type": "application",
        "subType": "PDF"
      },
      "statutRepresentation": {
        "verbatim": true,
        "canonique": true,
        "officielle": true,
        "transcription": false,
        "enregistrement": false
      },
      "contenu": {
        "documentURI": "/15/amendements/0904/CION-SOC/AS1451.pdf"
      }
    }
  ],
  "sort": {
    "dateSaisie": "2018-05-30T23:24:06.000+02:00",
    "sortEnSeance": "Adopté"
  },
  "dateDepot": "2018-05-28T02:00:00.000+02:00",
  "dateDistribution": "2018-05-29T02:00:00.000+02:00",
  "article99": "0",
  "loiReference": {}
}