{
  "uid": "AMANR5L15PO757134B1088P0D1N1325",
  "identifiant": {
    "legislature": "15",
    "numero": "1325",
    "numRect": "0",
    "saisine": {
      "texteLegislatifRef": "PRJLANR5L15B1088",
      "numeroPartiePLF": "0",
      "organeExamen": "PO757134",
      "mentionSecondeDeliberation": "0"
    }
  },
  "numeroLong": "1325",
  "etapeTexte": "1ère lecture (1ère assemblée saisie)",
  "triAmendement": "bmaaaaaaaaaaaaaaaaaaaaaaaaaaaaaaaaaaaaaaaaaaaaaaaaaabczwzx",
  "cardinaliteAmdtMultiples": "1",
  "etat": "Discuté",
  "signataires": {
    "auteur": {
      "typeAuteur": "Depute",
      "acteurRef": "PA331567",
      "groupePolitiqueRef": "PO744425"
    },
    "cosignatairesRefs": [
      "PA331567"
    ],
    "texteAffichable": "Mme&#160;de La Raudi&#232;re"
  },
  "pointeurFragmentTexte": {
    "division": {
      "titre": "Article 19",
      "articleDesignationCourte": "APRÈS ART. 19",
      "type": "ARTICLE",
      "avantAApres": "Apres",
      "divisionRattachee": "APRÈS L'ARTICLE 19, insérer l'article suivant:",
      "articleAdditionnel": "1",
      "urlDivisionTexteVise": "/15/textes/1088.asp#D_Article_19"
    }
  },
  "corps": {
    "dispositif": "<p style=\"text-align: justify;\">&#171;&#160;L&#8217;article L.&#160;313&#8209;30 du code de la consommation est compl&#233;t&#233; par un alin&#233;a ainsi r&#233;dig&#233;&#160;:</p><p style=\"text-align: justify;\">&#171;&#160;&#171;&#160;Le pr&#234;teur informe annuellement l&#8217;emprunteur de la date d&#8217;&#233;ch&#233;ance du contrat d&#8217;assurance vis&#233; &#224; l&#8217;article L.&#160;113&#8209;12&#8209;2 du code des assurances ainsi que des documents &#224; fournir en cas de demande de substitution telle que vis&#233;e au&#160;7&#176; de l&#8217;article L.&#160;313&#8209;25 du pr&#233;sent code. Cette information lui est communiqu&#233;e sans frais. Un d&#233;cret en Conseil d&#8217;&#201;tat pr&#233;cise les modalit&#233;s d&#8217;application du pr&#233;sent alin&#233;a, en fixant la liste exhaustive des documents pr&#233;cit&#233;s ainsi que le format de la date d&#8217;&#233;ch&#233;ance &#224; fournir.&#160;&#187;&#160;&#187;</p>",
    "exposeSommaire": "<p style=\"text-align: justify;\">Le Conseil constitutionnel a jug&#233;, par une d&#233;cision rendue le 12 janvier dernier, que les dispositions, figurant au 1&#176; du I et V de l&#8217;article&#160;10 de la loi n&#176; 2017&#8209;203 du 21 f&#233;vrier 2017, relatives &#224; la r&#233;siliation annuelle des contrats d&#8217;assurance souscrits avant 2017 &#233;taient conformes &#224; la Constitution. A partir de l&#8217;entr&#233;e en vigueur de la loi en janvier 2018 pour les contrats en cours, plus rien ne devait s&#8217;opposer &#224; ce qu&#8217;une v&#233;ritable concurrence s&#8217;instaure sur le march&#233;, jusqu&#8217;&#224; alors scl&#233;ros&#233;, de l&#8217;assurance emprunteur. Pourtant, plusieurs obstacles &#224; l&#8217;application de la loi semblent &#234;tre utilis&#233;s de mani&#232;re r&#233;currente par certains pr&#234;teurs.</p><p style=\"text-align: justify;\">En premier lieu, ceux-ci d&#233;terminent de mani&#232;re arbitraire une date d&#8217;&#233;ch&#233;ance dont les emprunteurs n&#8217;ont le plus souvent pas connaissance, telle que la date d&#8217;adh&#233;sion au contrat d&#8217;assurance par exemple. C&#8217;est pourquoi, afin d&#8217;&#233;viter toute confusion, l&#8217;amendement propose que cette date d&#8217;&#233;ch&#233;ance soit communiqu&#233;e chaque ann&#233;e aux emprunteurs. Le d&#233;cret devra par ailleurs pr&#233;ciser que cette date doit &#234;tre au format jj/mm/aaaa afin d&#8217;&#233;viter toute confusion dans l&#8217;esprit des emprunteurs.</p><p style=\"text-align: justify;\">Par ailleurs, alors que le d&#233;lai de dix jours court &#224; compter de la r&#233;ception de la demande de substitution par l&#8217;emprunteur, de nombreux consommateurs ne parviennent pas &#224; faire courir ce d&#233;lai, leur demande de substitution ne comprenant pas l&#8217;ensemble des documents n&#233;cessaires selon les pr&#234;teurs. Il peut potentiellement s&#8217;agir d&#8217;un moyen dilatoire utilis&#233; par ces derniers afin de limiter le taux de changement d&#8217;assurances. Afin d&#8217;&#233;viter ce type de pratiques, et afin de clarifier l&#8217;information du consommateur, cet amendement propose qu&#8217;un d&#233;cret pr&#233;cise ce que doit contenir cette demande de substitution, mais aussi que le pr&#234;teur informe de mani&#232;re claire, pr&#233;cise et loyale l&#8217;emprunteur des documents &#224; fournir sur une base annuelle.</p>"
  },
  "representations": [
    {
      "nom": "PDF",
      "typeMime": {
        "type": "application",
        "subType": "PDF"
      },
      "statutRepresentation": {
        "verbatim": true,
        "canonique": true,
        "officielle": true,
        "transcription": false,
        "enregistrement": false
      },
      "contenu": {
        "documentURI": "/15/amendements/1088/CSPACTE/1325.pdf"
      }
    }
  ],
  "sort": {
    "dateSaisie": "2018-09-07T23:30:32.000+02:00",
    "sortEnSeance": "Non soutenu"
  },
  "dateDepot": "2018-09-03T02:00:00.000+02:00",
  "dateDistribution": "2018-09-06T02:00:00.000+02:00",
  "article99": "0",
  "loiReference": {
    "codeLoi": "consommation",
    "divisionCodeLoi": "L313-30"
  }
}