{
  "uid": "AMANR5L15SEA717460B0387P0D1N140",
  "identifiant": {
    "legislature": "15",
    "numero": "140",
    "numRect": "0",
    "saisine": {
      "texteLegislatifRef": "PRJLANR5L15B0387",
      "numeroPartiePLF": "0",
      "organeExamen": "PO717460",
      "mentionSecondeDeliberation": "0"
    }
  },
  "numeroLong": "140",
  "etapeTexte": "Nouvelle Lecture",
  "triAmendement": "g",
  "cardinaliteAmdtMultiples": "1",
  "etat": "Discuté",
  "signataires": {
    "auteur": {
      "typeAuteur": "Depute",
      "acteurRef": "PA642788",
      "groupePolitiqueRef": "PO730964"
    },
    "cosignatairesRefs": [
      "PA642788"
    ],
    "texteAffichable": "M.&#160;V&#233;ran"
  },
  "pointeurFragmentTexte": {
    "division": {
      "titre": "Article 11",
      "articleDesignationCourte": "ART. 11",
      "type": "ARTICLE",
      "avantAApres": "A",
      "divisionRattachee": "ARTICLE 11",
      "urlDivisionTexteVise": "/15/textes/0387.asp#D_Article_11"
    },
    "alinea": {
      "numero": "363"
    }
  },
  "corps": {
    "dispositif": "<p style=\"text-align: justify;\">I.&#160;&#8211;&#160;Supprimer l&#8217;alin&#233;a&#160;363.</p><p style=\"text-align: justify;\">II.&#160;&#8211;&#160;En cons&#233;quence, aux alin&#233;as 365 et 366, substituer aux trois occurrences du mot&#160;:</p><p style=\"text-align: justify;\">&#171;&#160;quatri&#232;me&#160;&#187;</p><p style=\"text-align: justify;\">le mot&#160;:</p><p style=\"text-align: justify;\">&#171;&#160;troisi&#232;me&#160;&#187;.</p>",
    "exposeSommaire": "<p style=\"text-align: justify;\">Amendement r&#233;dactionnel visant &#224; supprimer un alin&#233;a redondant.</p>"
  },
  "representations": [
    {
      "nom": "PDF",
      "typeMime": {
        "type": "application",
        "subType": "PDF"
      },
      "statutRepresentation": {
        "verbatim": true,
        "canonique": true,
        "officielle": true,
        "transcription": false,
        "enregistrement": false
      },
      "contenu": {
        "documentURI": "/15/amendements/0387/AN/140.pdf"
      }
    }
  ],
  "seanceDiscussion": "RUANR5L15S2018IDS20789",
  "sort": {
    "dateSaisie": "2017-11-29T17:51:16.000+01:00",
    "sortEnSeance": "Adopté"
  },
  "dateDepot": "2017-11-24T01:00:00.000+01:00",
  "dateDistribution": "2017-11-27T01:00:00.000+01:00",
  "article99": "0",
  "loiReference": {}
}