{
  "uid": "AMANR5L15PO419610B0846P0D1N534",
  "identifiant": {
    "legislature": "15",
    "numero": "534",
    "numRect": "0",
    "saisine": {
      "texteLegislatifRef": "PRJLANR5L15B0846",
      "numeroPartiePLF": "0",
      "organeExamen": "PO419610",
      "mentionSecondeDeliberation": "0"
    }
  },
  "numeroLong": "CE534",
  "etapeTexte": "1ère lecture (1ère assemblée saisie)",
  "triAmendement": "aki",
  "cardinaliteAmdtMultiples": "1",
  "etat": "Discuté",
  "signataires": {
    "auteur": {
      "typeAuteur": "Depute",
      "acteurRef": "PA718850",
      "groupePolitiqueRef": "PO730934"
    },
    "cosignatairesRefs": [
      "PA720684",
      "PA267429",
      "PA718850",
      "PA605036",
      "PA767",
      "PA334654",
      "PA721968",
      "PA719318",
      "PA712015",
      "PA721410",
      "PA267735",
      "PA608416",
      "PA709315",
      "PA608016",
      "PA721054",
      "PA718884",
      "PA721678",
      "PA267378",
      "PA266776"
    ],
    "texteAffichable": "M.&#160;Cordier,  M.&#160;Cinieri, M.&#160;Reda, M.&#160;Abad, Mme&#160;Anthoine, M.&#160;Dive, M.&#160;Cattin, M.&#160;Hetzel, Mme&#160;Levy, M.&#160;Straumann, M.&#160;de Ganay, M.&#160;Vialay, M.&#160;Viala, Mme&#160;Bazin-Malgras, Mme&#160;Bonnivard, M.&#160;Reiss, M.&#160;Lorion, Mme&#160;Louwagie et M.&#160;Pierre-Henri&#160;Dumont"
  },
  "pointeurFragmentTexte": {
    "division": {
      "titre": "Article 25",
      "articleDesignationCourte": "APRÈS ART. 25",
      "type": "ARTICLE",
      "avantAApres": "Apres",
      "divisionRattachee": "APRÈS L'ARTICLE 25, insérer l'article suivant:",
      "articleAdditionnel": "1",
      "urlDivisionTexteVise": "/15/textes/0846.asp#D_Article_25"
    }
  },
  "corps": {
    "dispositif": "<p style=\"text-align: justify;\">Le chapitre&#160;II du titre&#160;V du livre&#160;IV du code de la construction et de l&#8217;habitation est ainsi modifi&#233;&#160;:</p><p style=\"text-align: justify;\">1&#176;&#160;Le troisi&#232;me alin&#233;a de l&#8217;article L.&#160;452&#8209;1 est supprim&#233;&#160;;</p><p style=\"text-align: justify;\">2&#176;&#160;&#192; la seconde phrase de l&#8217;article L.&#160;452&#8209;2&#8209;1, le mot&#160;: &#171;&#160;cinqui&#232;me&#160;&#187; est remplac&#233; par le mot&#160;: &#171;&#160;quatri&#232;me&#160;&#187;&#160;;</p><p style=\"text-align: justify;\">3&#176;&#160;L&#8217;article L.&#160;452&#8209;2&#8209;1&#8209;1 est abrog&#233;&#160;;</p><p style=\"text-align: justify;\">4&#176;&#160;Au second alin&#233;a de l&#8217;article L.&#160;452&#8209;2&#8209;2, apr&#232;s les mots&#160;: &#171;&#160;d&#8217;administration&#160;&#187;, les mots&#160;: &#171;&#160;de la commission de p&#233;r&#233;quation&#160;&#187; sont supprim&#233;s.</p>",
    "exposeSommaire": "<p style=\"text-align: justify;\">L&#8217;article 126 de la loi de finances pour 2018 n&#176; 2017-1837 du 30 d&#233;cembre 2017 met en place une r&#233;duction de loyer de solidarit&#233; (RLS) que les organismes Hlm doivent appliquer aux locataires les plus modestes du parc locatif social.</p><p style=\"text-align: justify;\">Simultan&#233;ment l&#8217;APL des locataires concern&#233;s est diminu&#233;e de mani&#232;re &#224; ce que la baisse de l&#8217;aide soit toujours inf&#233;rieure &#224; la r&#233;duction de loyer de solidarit&#233;. Ce dispositif s&#8217;applique d&#232;s 2018 aux contrats de locations en cours.</p><p style=\"text-align: justify;\">Afin d&#8217;assurer la soutenabilit&#233; de la mesure de RLS pour les bailleurs sociaux, il a &#233;t&#233; pr&#233;vu la cr&#233;ation d&#8217;une commission de p&#233;r&#233;quation au sein de la CGLLS qui accordera des concours financiers aux bailleurs sociaux pour accompagner les fusions et les regroupements de ces organismes (nouvel article L.452-2-1-1&#160;du code de la construction et de l&#8217;habitation).</p><p style=\"text-align: justify;\">Or il existe d&#233;j&#224; au sein de la CGLLS une commission de r&#233;organisation des bailleurs sociaux dont l&#8217;objet est de statuer, notamment, sur les concours financiers destin&#233;s &#224; favoriser la r&#233;organisation de ces organismes (article L.452-2-1 du code de la construction et de l&#8217;habitation).</p><p style=\"text-align: justify;\">Afin de ne pas ajouter de complexit&#233; au dispositif de soutien de la CGLLS, il est propos&#233; de confier &#224; sa commission de r&#233;organisation une comp&#233;tence g&#233;n&#233;rale pour statuer sur les concours financiers destin&#233;s &#224; accompagner les bailleurs sociaux dans tous leurs projets de r&#233;organisation, fusions et regroupements, qu&#8217;ils soient cons&#233;cutifs, ou non, &#224; la mise en &#339;uvre de la RLS.</p><p style=\"text-align: justify;\">En cons&#233;quence, il conviendrait de supprimer la commission de p&#233;r&#233;quation cr&#233;&#233;e par l&#8217;article 126 de la loi de finances pour 2018.</p><p style=\"text-align: justify;\">&#160;</p>"
  },
  "representations": [
    {
      "nom": "PDF",
      "typeMime": {
        "type": "application",
        "subType": "PDF"
      },
      "statutRepresentation": {
        "verbatim": true,
        "canonique": true,
        "officielle": true,
        "transcription": false,
        "enregistrement": false
      },
      "contenu": {
        "documentURI": "/15/amendements/0846/CION-ECO/CE534.pdf"
      }
    }
  ],
  "sort": {
    "dateSaisie": "2018-05-17T09:35:07.000+02:00",
    "sortEnSeance": "Non soutenu"
  },
  "dateDepot": "2018-05-04T02:00:00.000+02:00",
  "dateDistribution": "2018-05-14T02:00:00.000+02:00",
  "article99": "0",
  "loiReference": {
    "codeLoi": "construction et habitation",
    "divisionCodeLoi": "L452-1"
  }
}