{
  "uid": "AMANR5L15SEA717460BTC1918P0D1N223",
  "identifiant": {
    "legislature": "15",
    "numero": "223",
    "numRect": "0",
    "saisine": {
      "texteLegislatifRef": "PRJLANR5L15BTC1918",
      "numeroPartiePLF": "0",
      "organeExamen": "PO717460",
      "mentionSecondeDeliberation": "0"
    }
  },
  "numeroLong": "223",
  "etapeTexte": "1ère lecture (1ère assemblée saisie)",
  "triAmendement": "faaaaaaaaaaaaaaaaaaaaaaaaaaaaaaaaaaaaaaaaaaaaaaaaawu",
  "cardinaliteAmdtMultiples": "1",
  "etat": "Irrecevable",
  "signataires": {
    "auteur": {
      "typeAuteur": "Depute",
      "acteurRef": "PA345722",
      "groupePolitiqueRef": "PO730934"
    },
    "cosignatairesRefs": [
      "PA720210",
      "PA709315",
      "PA720630",
      "PA718838",
      "PA345722",
      "PA722390",
      "PA1874",
      "PA718884",
      "PA719318",
      "PA608416",
      "PA720684",
      "PA2492",
      "PA606712"
    ],
    "texteAffichable": "Mme&#160;Le Grip,  M.&#160;Le Fur, M.&#160;Brun, M.&#160;Pierre-Henri&#160;Dumont, M.&#160;Lurton, M.&#160;Minot, Mme&#160;Anthoine, M.&#160;Viala, Mme&#160;Bazin-Malgras, Mme&#160;Beauvais, M.&#160;Hetzel, Mme&#160;Corneloup et M.&#160;Quentin"
  },
  "pointeurFragmentTexte": {
    "division": {
      "titre": "Article 5",
      "articleDesignationCourte": "ART. 5",
      "type": "ARTICLE",
      "avantAApres": "A",
      "divisionRattachee": "ARTICLE 5",
      "urlDivisionTexteVise": "/15/textes/1918.asp#D_Article_5"
    },
    "alinea": {
      "avantAApres": "Apres",
      "numero": "1"
    }
  },
  "corps": {},
  "representations": [
    {
      "nom": "PDF",
      "typeMime": {
        "type": "application",
        "subType": "PDF"
      },
      "statutRepresentation": {
        "verbatim": true,
        "canonique": true,
        "officielle": true,
        "transcription": false,
        "enregistrement": false
      },
      "contenu": {
        "documentURI": "/15/amendements/1918/AN/223.pdf"
      }
    }
  ],
  "dateDepot": "2019-05-06T02:00:00.000+02:00",
  "dateDistribution": "2019-05-07T02:00:00.000+02:00",
  "article99": "0",
  "loiReference": {}
}