{
  "uid": "AMANR5L15SEA717460BTC1396P0D1N1344",
  "identifiant": {
    "legislature": "15",
    "numero": "1344",
    "numRect": "0",
    "saisine": {
      "texteLegislatifRef": "PRJLANR5L15BTC1396",
      "numeroPartiePLF": "0",
      "organeExamen": "PO717460",
      "mentionSecondeDeliberation": "0"
    }
  },
  "numeroLong": "1344",
  "etapeTexte": "1ère lecture (2ème assemblée saisie)",
  "triAmendement": "dboaaaaaaaaaaaaaaaaaaaaaaaaaaaaaaaaaaaaaaaaaaaaaaacdg",
  "cardinaliteAmdtMultiples": "1",
  "etat": "Discuté",
  "signataires": {
    "auteur": {
      "typeAuteur": "Depute",
      "acteurRef": "PA721270",
      "groupePolitiqueRef": "PO730940"
    },
    "cosignatairesRefs": [
      "PA267306",
      "PA718720",
      "PA610654",
      "PA721012",
      "PA721270",
      "PA721118",
      "PA720692",
      "PA689",
      "PA720546",
      "PA441",
      "PA722202",
      "PA335612",
      "PA722110",
      "PA610667",
      "PA721896",
      "PA718926"
    ],
    "texteAffichable": "M.&#160;Peu,  M.&#160;Jumel, Mme&#160;Faucillon, Mme&#160;Bello, M.&#160;Brotherson, M.&#160;Bruneel, Mme&#160;Buffet, M.&#160;Chassaigne, M.&#160;Dharr&#233;ville, M.&#160;Dufr&#232;gne, Mme&#160;K&#233;clard-Mond&#233;sir, M.&#160;Lecoq, M.&#160;Nilor, M.&#160;Fabien&#160;Roussel, M.&#160;Serville et M.&#160;Wulfranc"
  },
  "pointeurFragmentTexte": {
    "division": {
      "titre": "Article 28",
      "articleDesignationCourte": "ART. 28",
      "type": "ARTICLE",
      "avantAApres": "A",
      "divisionRattachee": "ARTICLE 28",
      "urlDivisionTexteVise": "/15/textes/1396.asp#D_Article_28"
    }
  },
  "corps": {
    "dispositif": "<p style=\"text-align: justify;\">Supprimer cet article.</p>",
    "exposeSommaire": "<p style=\"text-align: justify;\">Sous couvert de simplification, le pr&#233;sent article &#233;tend le recours &#224; l&#8217;enqu&#234;te sous pseudonyme tel qu&#8217;il existe en mati&#232;re de criminalit&#233; et de d&#233;linquance organis&#233;es aux enqu&#234;tes sur tous crimes et d&#233;lits punis d&#8217;une peine d&#8217;emprisonnement. La majorit&#233; est revenue &#224; la version initiale du texte, alors que le S&#233;nat avait restreint l&#8217;utilisation de la technique d&#8217;enqu&#234;te sous pseudonyme aux d&#233;lits punis d&#8217;au moins trois ans d&#8217;emprisonnement.</p><p style=\"text-align: justify;\">Ici, comme le remarque le Conseil national des barreaux, il s&#8217;agit de poursuivre une politique p&#233;nale engag&#233;e depuis la fin de l&#8217;&#233;tat d&#8217;urgence, consistant &#224; incorporer dans le droit commun des dispositions relevant de l&#8217;&#233;tat d&#8217;urgence. Ces dispositions portent une atteinte d&#8217;une exceptionnelle gravit&#233; aux libert&#233;s fondamentales et devraient continuer &#224; &#234;tre r&#233;serv&#233;es aux seules infractions les plus graves commises en bande organis&#233;e.</p><p style=\"text-align: justify;\">Les auteurs de cet amendement r&#233;cusent cette logique liberticide, qui porte atteinte au droit et au respect de la vie priv&#233;e.</p>"
  },
  "representations": [
    {
      "nom": "PDF",
      "typeMime": {
        "type": "application",
        "subType": "PDF"
      },
      "statutRepresentation": {
        "verbatim": true,
        "canonique": true,
        "officielle": true,
        "transcription": false,
        "enregistrement": false
      },
      "contenu": {
        "documentURI": "/15/amendements/1396/AN/1344.pdf"
      }
    }
  ],
  "seanceDiscussion": "RUANR5L15S2019IDS21376",
  "sort": {
    "dateSaisie": "2018-11-23T11:45:45.000+01:00",
    "sortEnSeance": "Non soutenu"
  },
  "dateDepot": "2018-11-15T01:00:00.000+01:00",
  "dateDistribution": "2018-11-20T01:00:00.000+01:00",
  "article99": "0",
  "loiReference": {}
}