{
  "uid": "AMANR5L15SEA717460B0269P0D1N416",
  "identifiant": {
    "legislature": "15",
    "numero": "416",
    "numRect": "0",
    "saisine": {
      "texteLegislatifRef": "PRJLANR5L15B0269",
      "numeroPartiePLF": "0",
      "organeExamen": "PO717460",
      "mentionSecondeDeliberation": "0"
    }
  },
  "numeroLong": "416",
  "etapeTexte": "1ère lecture (1ère assemblée saisie)",
  "triAmendement": "ai",
  "cardinaliteAmdtMultiples": "1",
  "etat": "Irrecevable",
  "signataires": {
    "auteur": {
      "typeAuteur": "Depute",
      "acteurRef": "PA709315",
      "groupePolitiqueRef": "PO730934"
    },
    "cosignatairesRefs": [
      "PA266797",
      "PA718850",
      "PA607090",
      "PA1874",
      "PA642847",
      "PA643134",
      "PA718884",
      "PA608016",
      "PA267429",
      "PA709315",
      "PA330684",
      "PA267378",
      "PA267735",
      "PA605036",
      "PA719318",
      "PA345722",
      "PA721314",
      "PA720684",
      "PA718838"
    ],
    "texteAffichable": "M.&#160;Viala,  Mme&#160;Louwagie, Mme&#160;Levy, M.&#160;Brun, M.&#160;Gosselin, M.&#160;Cordier, M.&#160;Cinieri, M.&#160;Abad, Mme&#160;Anthoine, M.&#160;Le Fur, Mme&#160;Bazin-Malgras, Mme&#160;Valentin, M.&#160;Pierre-Henri&#160;Dumont, M.&#160;de Ganay, M.&#160;Bazin, M.&#160;Schellenberger, Mme&#160;Le Grip, Mme&#160;Val&#233;rie&#160;Boyer et M.&#160;Jean-Pierre&#160;Vigier"
  },
  "pointeurFragmentTexte": {
    "division": {
      "titre": "Article 28",
      "articleDesignationCourte": "APRÈS ART. 28",
      "type": "ARTICLE",
      "avantAApres": "Apres",
      "divisionRattachee": "APRÈS L'ARTICLE 28, insérer l'article suivant:",
      "articleAdditionnel": "1",
      "urlDivisionTexteVise": "/15/textes/0269.asp#D_Article_28"
    }
  },
  "corps": {
    "dispositif": "<p style=\"text-align: justify;\">I.&#160;&#8211;&#160;L&#8217;article L.&#160;341&#8209;16 du code de la s&#233;curit&#233; sociale est ainsi modifi&#233;&#160;:</p><p style=\"text-align: justify;\">1&#176; Apr&#232;s le deuxi&#232;me alin&#233;a, il est ins&#233;r&#233; un alin&#233;a ainsi r&#233;dig&#233;&#160;:</p><p style=\"text-align: justify;\">&#171;&#160;La perte de l&#8217;activit&#233; professionnelle apr&#232;s l&#8217;&#226;ge pr&#233;vu au premier alin&#233;a de l&#8217;article L.&#160;351&#8209;1 ne remet pas en cause le service de la pension d&#8217;invalidit&#233; &#224; condition que l&#8217;assur&#233; soit inscrit sur la liste des demandeurs d&#8217;emploi aupr&#232;s de l&#8217;institution mentionn&#233;e &#224; l&#8217;article L.&#160;5312&#8209;1 du code du travail et qu&#8217;il n&#8217;ait pas accompli dans le r&#233;gime g&#233;n&#233;ral une dur&#233;e d&#8217;assurance au moins &#233;gale &#224; la limit&#233; pr&#233;vue au troisi&#232;me alin&#233;a de l&#8217;article L.&#160;351&#8209;1 du pr&#233;sent code.&#160;&#187;&#160;;</p><p style=\"text-align: justify;\">2&#176; &#192; l&#8217;avant-dernier alin&#233;a, les mots&#160;: &#171;&#160;ce cas, ses&#160;&#187; sont remplac&#233;s par les mots&#160;: &#171;&#160;les cas vis&#233;s aux deuxi&#232;me et troisi&#232;me alin&#233;as du pr&#233;sent article, les&#160;&#187;.&#160;&#187;</p><p style=\"text-align: justify;\">II.&#160;&#8211;&#160;La perte de recettes pour l&#8217;&#201;tat est compens&#233;e &#224; due concurrence par la cr&#233;ation d&#8217;une taxe additionnelle aux droits mentionn&#233;s aux articles 575 et 575 A du code g&#233;n&#233;ral des imp&#244;ts.</p>",
    "exposeSommaire": "<p style=\"text-align: justify;\">L&#8217;amendement a pour objet de pr&#233;voir la possibilit&#233; pour les assur&#233;s invalides, qui ont perdu leur emploi apr&#232;s l&#8217;&#226;ge l&#233;gal de d&#233;part en retraite, de poursuivre leur recherche d&#8217;emploi, d&#232;s lors qu&#8217;ils ne b&#233;n&#233;ficient pas d&#8217;une pension enti&#232;re, sans que la pension vieillesse s&#8217;y substitue de mani&#232;re obligatoire &#224; l&#8217;&#226;ge l&#233;gal. Une inscription en qualit&#233; de demandeur d&#8217;emploi, permet, d&#8217;une part, de pr&#233;sumer l&#8217;aptitude de l&#8217;assur&#233; invalide &#224; l&#8217;exercice d&#8217;une activit&#233; professionnelle et se caract&#233;rise, d&#8217;autre part, par une obligation d&#8217;accomplir des actes positifs et r&#233;p&#233;t&#233;s de recherche d&#8217;emploi et d&#8217;accepter les offres raisonnables d&#8217;emploi. Par cons&#233;quent, la subordination de la poursuite du versement d&#8217;une pension d&#8217;invalidit&#233; &#224; l&#8217;inscription de l&#8217;assur&#233; en qualit&#233; de demandeur d&#8217;emploi appara&#238;t &#234;tre un compromis satisfaisant. Il faudra veiller &#224; ce que cette modification s&#8217;applique de mani&#232;re identique au r&#233;gime agricole et au r&#233;gime social des ind&#233;pendants.</p>"
  },
  "representations": [
    {
      "nom": "PDF",
      "typeMime": {
        "type": "application",
        "subType": "PDF"
      },
      "statutRepresentation": {
        "verbatim": true,
        "canonique": true,
        "officielle": true,
        "transcription": false,
        "enregistrement": false
      },
      "contenu": {
        "documentURI": "/15/amendements/0269/AN/416.pdf"
      }
    }
  ],
  "dateDepot": "2017-10-20T02:00:00.000+02:00",
  "article99": "0",
  "loiReference": {
    "codeLoi": "c sécurité sociale",
    "divisionCodeLoi": "L341-16"
  }
}