{
  "uid": "AMANR5L15PO419604B1481P0D1N482",
  "identifiant": {
    "legislature": "15",
    "numero": "482",
    "numRect": "0",
    "saisine": {
      "texteLegislatifRef": "PRJLANR5L15B1481",
      "numeroPartiePLF": "0",
      "organeExamen": "PO419604",
      "mentionSecondeDeliberation": "0"
    }
  },
  "numeroLong": "AC482",
  "etapeTexte": "1ère lecture (1ère assemblée saisie)",
  "triAmendement": "beaaaaaaaaaaaaaaaaaaaaaaaaaaaaaaaaaaaaaaaaaaaaaaaabhzg",
  "cardinaliteAmdtMultiples": "1",
  "etat": "Retiré",
  "signataires": {
    "auteur": {
      "typeAuteur": "Depute",
      "acteurRef": "PA721600",
      "groupePolitiqueRef": "PO730964"
    },
    "cosignatairesRefs": [
      "PA721600"
    ],
    "texteAffichable": "Mme&#160;Rossi"
  },
  "pointeurFragmentTexte": {
    "division": {
      "titre": "Article 5",
      "articleDesignationCourte": "APRÈS ART. 5",
      "type": "ARTICLE",
      "avantAApres": "Apres",
      "divisionRattachee": "APRÈS L'ARTICLE 5, insérer l'article suivant:",
      "articleAdditionnel": "1",
      "urlDivisionTexteVise": "/15/textes/1481.asp#D_Article_5"
    }
  },
  "corps": {
    "dispositif": "<p style=\"text-align: justify;\">Le gouvernement transmet chaque ann&#233;e au Parlement un rapport sur la p&#233;dagogie mise en &#339;uvre vis a&#768; vis des enfants sourds et sur l&#8217;usage dans le syst&#232;me &#233;ducatif de la langue des signes fran&#231;aise.</p>",
    "exposeSommaire": "<p style=\"text-align: justify;\">En 1998, le rapport Gillot sur &#171;&#160;le droit des sourds&#160;&#187; signalait que, malgr&#233; la publication des textes d&#8217;application, ce droit n&#8217;&#233;tait pas respect&#233; puisque seulement 1&#160;% des &#233;l&#232;ves sourds avaient acc&#232;s &#224; des structures bilingues.</p><p style=\"text-align: justify;\">L&#8217;&#233;difice normatif relatif &#224; l&#8217;enseignement de la langue des signes fran&#231;aise s&#8217;est entre temps d&#233;velopp&#233;, notamment &#224; travers la loi n&#176; 2005&#8209;102 du 11 f&#233;vrier 2005 pour l&#8217;&#233;galit&#233; des droits et des chances, la participation et la citoyennet&#233; des personnes handicap&#233;es. Cette loi consacre le droit &#224; un parcours de formation ne concernant pas seulement l&#8217;&#233;ducation mais aussi le parcours scolaire. La langue des signes fran&#231;aise est d&#233;sormais reconnue comme une langue &#224; part enti&#232;re et tout &#233;l&#232;ve concern&#233; (sourd, fratrie) doit pouvoir recevoir un enseignement de LSF, et celle-ci peut &#234;tre choisie comme &#233;preuve facultative aux examens et concours, y compris ceux de la formation professionnelle.</p><p style=\"text-align: justify;\">N&#233;anmoins, en 2012, le rapport de l&#8217;inspection g&#233;n&#233;rale de l&#8217;&#233;ducation nationale et de l&#8217;inspection g&#233;n&#233;rale de l&#8217;administration de l&#8217;&#233;ducation nationale et de la recherche a fait le constat que, pour la mise en place des projets personnalis&#233;s de scolarisation, la loi n&#8217;est pas appliqu&#233;e sur l&#8217;ensemble du territoire national. Selon les cinq associations nationales qui se mobilisent&#160;pour la scolarisation des enfants sourds dans les structures en langue des signes, 5&#160;% des jeunes sourds seulement ont acc&#232;s &#224; un dispositif d&#8217;enseignement de ce type aujourd&#8217;hui.</p><p style=\"text-align: justify;\">La circulaire de 2017 a mis en place et d&#233;crit les diff&#233;rents parcours au sein du p&#244;le d&#8217;enseignement pour jeunes sourds (PEJS). Toutefois, ce parcours n&#8217;existe pas sur l&#8217;ensemble du territoire. Seules trois r&#233;gions r&#233;pondent &#224; ces exigences, alors qu&#8217;il devrait exister un PEJS dans chaque acad&#233;mie. Seules deux r&#233;gions proposent une fili&#232;re compl&#232;te, de la maternelle au lyc&#233;e et donc une continuit&#233; du parcours scolaire pour les &#233;l&#232;ves sourds signeurs.</p><p style=\"text-align: justify;\">En r&#233;gion &#206;le-de-France, il y a 3 PEJS mais aucune offre de fili&#232;re compl&#232;te. Les acad&#233;mies de Paris ou de Versailles ne proposent que des classes primaires, l&#8217;une &#224; Massy, l&#8217;autre dans le 3&#232; arrondissement. La continuit&#233; du parcours scolaire est donc interrompue.</p><p style=\"text-align: justify;\">En 2018, la possibilit&#233; de mettre en &#339;uvre le droit &#224; un parcours scolaire en LSF d&#233;pend du lieu de vie, car la disparit&#233; r&#233;gionale est &#233;norme. Dans certains &#233;tablissements, les &#233;l&#232;ves ne b&#233;n&#233;ficient seulement que d&#8217;une heure de cours de LSF tous les 15 jours, dans d&#8217;autres ils ont 30 minutes de cours par semaine et d&#8217;autres encore 4 heures de LSF par semaine.</p><p style=\"text-align: justify;\">Les familles et leur enfant qui ont opt&#233; pour une communication bilingue et une scolarisation compl&#232;te de la maternelle au lyc&#233;e en LSF, se trouvent confront&#233;s au non-respect de leur choix. Tr&#232;s peu d&#8217;&#233;l&#232;ves sourds peuvent r&#233;ellement mettre ce choix en pratique. Pour l&#8217;ann&#233;e scolaire 2017/2018, ils ne sont que 245 pour toute la France.</p><p style=\"text-align: justify;\">Pourtant comme l&#8217;a rappel&#233; le Ministre <span class=\"ins cts-1\"  data-cid=\"2\"   data-time=\"1548428961971\">charg&#233; </span>des relations avec le Parlement, le 24 mai 2018 devant la repr&#233;sentation nationale, ce sujet est essentiel car aujourd&#8217;hui, un enfant sur mille na&#238;t sourd. Notre pays compte 300 000 personnes sourdes, mais seulement un tiers d&#8217;entre elles pratiquent la langue des signes fran&#231;aise, contre 170 000 dans le monde.</p><p style=\"text-align: justify;\">Malgr&#233; les textes juridiques et les diff&#233;rentes avanc&#233;es depuis la loi 2005, l&#8217;&#233;gal acc&#232;s &#224; la scolarit&#233; pour nos enfants sourds n&#8217;est toujours pas une r&#233;alit&#233;.</p><p style=\"text-align: justify;\">Par cons&#233;quent, il vous est propos&#233; que le Gouvernement remette un rapport au Parlement afin de disposer d&#8217;&#233;l&#233;ments concrets sur la p&#233;dagogie mise en &#339;uvre vis a&#768; vis des enfants sourds et sur l&#8217;usage dans le syst&#232;me &#233;ducatif de la langue des signes fran&#231;aise.</p>"
  },
  "representations": [
    {
      "nom": "PDF",
      "typeMime": {
        "type": "application",
        "subType": "PDF"
      },
      "statutRepresentation": {
        "verbatim": true,
        "canonique": true,
        "officielle": true,
        "transcription": false,
        "enregistrement": false
      },
      "contenu": {
        "documentURI": "/15/amendements/1481/CION-CEDU/AC482.pdf"
      }
    }
  ],
  "dateDepot": "2019-01-25T01:00:00.000+01:00",
  "dateDistribution": "2019-01-29T01:00:00.000+01:00",
  "article99": "0",
  "loiReference": {
    "codeLoi": "zzzz"
  }
}