{
  "uid": "AMANR5L15SEA717460BTC0174P0D1N174",
  "identifiant": {
    "legislature": "15",
    "numero": "174",
    "numRect": "0",
    "saisine": {
      "texteLegislatifRef": "PRJLANR5L15BTC0174",
      "numeroPartiePLF": "0",
      "organeExamen": "PO717460",
      "mentionSecondeDeliberation": "0"
    }
  },
  "numeroLong": "174",
  "etapeTexte": "1ère lecture (1ère assemblée saisie)",
  "triAmendement": "abt",
  "cardinaliteAmdtMultiples": "1",
  "etat": "Discuté",
  "signataires": {
    "auteur": {
      "typeAuteur": "Depute",
      "acteurRef": "PA335999",
      "groupePolitiqueRef": "PO730946"
    },
    "cosignatairesRefs": [
      "PA605069",
      "PA1008",
      "PA429893",
      "PA1198",
      "PA267233",
      "PA588886",
      "PA608011",
      "PA333285",
      "PA1809",
      "PA719930",
      "PA610681",
      "PA335999",
      "PA330357",
      "PA340343",
      "PA609590",
      "PA332614",
      "PA405480",
      "PA609332",
      "PA608172",
      "PA642764",
      "PA720988",
      "PA333818",
      "PA643145",
      "PA608695",
      "PA335054",
      "PA342415",
      "PA337483",
      "PA607553",
      "PA335532"
    ],
    "texteAffichable": "Mme&#160;Batho,  M.&#160;Garot, M.&#160;Bouillon, M.&#160;Saulignac, M.&#160;Faure, M.&#160;Aviragnet, Mme&#160;Bareigts, Mme&#160;Battistel, M.&#160;Jean-Louis&#160;Bricout, M.&#160;Carvounas, M.&#160;Alain&#160;David, Mme&#160;Laurence&#160;Dumont, M.&#160;Dussopt, M.&#160;Hutin, M.&#160;Juanico, Mme&#160;Karamanli, M.&#160;J&#233;r&#244;me&#160;Lambert, M.&#160;Le Foll, M.&#160;Letchimy, Mme&#160;Manin, Mme&#160;Pau-Langevin, Mme&#160;Pires Beaune, M.&#160;Potier, M.&#160;Pueyo, M.&#160;Pupponi, Mme&#160;Rabault, Mme&#160;Untermaier, Mme&#160;Vainqueur-Christophe et M.&#160;Vallaud"
  },
  "pointeurFragmentTexte": {
    "division": {
      "titre": "Article PREMIER",
      "articleDesignationCourte": "AVANT ART. PREMIER",
      "type": "ARTICLE",
      "avantAApres": "Avant",
      "divisionRattachee": "AVANT L'ARTICLE PREMIER, insérer la division et l'intitulé suivants:",
      "chapitreAdditionnel": "1",
      "urlDivisionTexteVise": "/15/textes/0174.asp#D_Article_1er"
    }
  },
  "corps": {
    "dispositif": "<p style=\"text-align: justify;\">Section 1</p><p style=\"text-align: justify;\">Application de l&#8217;accord de Paris et de l&#8217;objectif de neutralit&#233; carbone en 2050</p><p style=\"text-align: justify;\">Art. ...</p><p style=\"text-align: justify;\">Le 1&#176; du I de l&#8217;article L.&#160;100&#8209;4 du code de l&#8217;&#233;nergie est ainsi modifi&#233;&#160;:</p><p style=\"text-align: justify;\">&#171;&#160;1&#176;&#160;La premi&#232;re phrase est ainsi modifi&#233;e&#160;:</p><p style=\"text-align: justify;\">&#171;&#160;<i>a)&#160;</i>La deuxi&#232;me occurrence du mot&#160;: &#171;&#160;et&#160;&#187;, est remplac&#233;e par le signe &#171;&#160;,&#160;&#187;&#160;;</p><p style=\"text-align: justify;\">&#171;&#160;<i>b)</i>&#160;Elle est compl&#233;t&#233;e par les mots &#171;&#160;et d&#8217;atteindre la neutralit&#233; carbone &#224; l&#8217;horizon 2050, conform&#233;ment aux engagements internationaux de la France pr&#233;cis&#233;s par la loi n&#176;&#160;2016&#8209;786 du 15&#160;juin&#160;2016 autorisant la ratification de l&#8217;accord de Paris adopt&#233; le 12&#160;d&#233;cembre&#160;2015&#160;&#187;.</p><p style=\"text-align: justify;\">&#171;&#160;2&#176;&#160;La deuxi&#232;me phrase est ainsi modifi&#233;e&#160;:</p><p style=\"text-align: justify;\">&#171;<i>&#160;a)</i>&#160;Au d&#233;but, sont ins&#233;r&#233;s les mots&#160;: &#171;&#160;La neutralit&#233; carbone et&#160;&#187;&#160;;</p><p style=\"text-align: justify;\">&#171;<i>&#160;b)</i> Les mots&#160;: &#171;&#160;est&#160;pr&#233;cis&#233;e&#160;&#187; sont remplac&#233;s par les mots&#160;: &#171;&#160;sont pr&#233;cis&#233;es&#160;&#187;&#160;;</p><p style=\"text-align: justify;\">&#171;&#160;<i>c)</i> Elle est compl&#233;t&#233;e par les mots&#160;: &#171;&#160;et la strat&#233;gie bas-carbone mentionn&#233;e &#224; l&#8217;article L.&#160;222&#8209;1B du m&#234;me code&#160;&#187;.</p>",
    "exposeSommaire": "<p style=\"text-align: justify;\">Le pr&#233;sent amendement vise &#224; inscrire la neutralit&#233; carbone et la r&#233;f&#233;rence &#224; l&#8217;Accord de Paris dans les objectifs de la politique &#233;nerg&#233;tique de la Nation relatifs &#224; la lutte contre l&#8217;effet de serre.</p><p style=\"text-align: justify;\">Ce sont en effet ces objectifs qui justifient les dispositions du pr&#233;sent projet de loi mettant fin &#224; la recherche et &#224; l&#8217;exploitation d&#8217;hydrocarbures. Il importe pour la coh&#233;rence des dispositions concernant l&#8217;arr&#234;t de ces activit&#233;s, que les objectifs de long terme de la Nation fassent d&#8217;ores et d&#233;j&#224; explicitement r&#233;f&#233;rence &#224; l&#8217;Accord de Paris et &#224; la neutralit&#233; carbone.</p><p style=\"text-align: justify;\">Le Plan Climat, pr&#233;sent&#233; par le gouvernement le 6 juillet 2017, entend en effet &#224; juste titre organiser la sortie des &#233;nergies fossiles pour atteindre la neutralit&#233; carbone vers le milieu du si&#232;cle. La France souhaite ainsi rehausser son ambition de moyen et long terme, afin d&#8217;acc&#233;l&#233;rer la concr&#233;tisation des engagements inscrits dans l&#8217;Accord de Paris sur le climat du 12 d&#233;cembre 2015.</p><p style=\"text-align: justify;\">Pour concr&#233;tiser cette volont&#233; politique forte, une r&#233;vision de la strat&#233;gie nationale bas-carbone et de la programmation pluriannuelle de l&#8217;&#233;nergie (PPE) sera r&#233;alis&#233;e avant la fin 2018, par voie r&#232;glementaire tel que pr&#233;vu par les dispositions du code de l&#8217;&#233;nergie.</p><p style=\"text-align: justify;\">Il appartient donc au l&#233;gislateur d&#8217;inscrire la neutralit&#233; carbone et l&#8217;Accord de Paris dans le code de l&#8217;&#233;nergie, afin que les dispositions r&#232;glementaires de la PPE et de la strat&#233;gie bas-carbone puissent en pr&#233;voir les conditions d&#8217;application, sans attendre l&#8217;&#233;ventuelle r&#233;vision des objectifs pr&#233;vue au II de l&#8217;article L.&#160;100&#8209;4 du code de l&#8217;&#233;nergie.</p><p style=\"text-align: justify;\">Le pr&#233;sent amendement permettra de proc&#233;der ainsi &#224; la d&#233;finition de la neutralit&#233; carbone par voie r&#232;glementaire.</p><p style=\"text-align: justify;\">L&#8217;article&#160;4(1) de l&#8217;Accord de Paris fait implicitement r&#233;f&#233;rence &#224; la notion de neutralit&#233; carbone en fixant l&#8217;objectif de &#171;&#160;parvenir &#224; un &#233;quilibre entre les &#233;missions anthropiques par les sources et les absorptions anthropiques par les puits de gaz &#224; effet de serre&#160;&#187;.</p>"
  },
  "representations": [
    {
      "nom": "PDF",
      "typeMime": {
        "type": "application",
        "subType": "PDF"
      },
      "statutRepresentation": {
        "verbatim": true,
        "canonique": true,
        "officielle": true,
        "transcription": false,
        "enregistrement": false
      },
      "contenu": {
        "documentURI": "/15/amendements/0174/AN/174.pdf"
      }
    }
  ],
  "seanceDiscussion": "RUANR5L15S2018IDS20678",
  "sort": {
    "dateSaisie": "2017-10-03T22:49:35.000+02:00",
    "sortEnSeance": "Rejeté"
  },
  "dateDepot": "2017-09-29T02:00:00.000+02:00",
  "dateDistribution": "2017-10-02T02:00:00.000+02:00",
  "article99": "0",
  "loiReference": {
    "codeLoi": "c énergie",
    "divisionCodeLoi": "L100-4"
  }
}