{
  "uid": "AMANR5L15PO419865B1831P0D1N1896",
  "identifiant": {
    "legislature": "15",
    "numero": "1896",
    "numRect": "0",
    "saisine": {
      "texteLegislatifRef": "PRJLANR5L15B1831",
      "numeroPartiePLF": "0",
      "organeExamen": "PO419865",
      "mentionSecondeDeliberation": "0"
    }
  },
  "numeroLong": "CD1896",
  "etapeTexte": "1ère lecture (2ème assemblée saisie)",
  "triAmendement": "axaaaaaaaaaaaaaaaaaaaaaaaaaaaaaaaaaaaaaaaaaaaaaaaagi",
  "cardinaliteAmdtMultiples": "1",
  "etat": "Discuté",
  "signataires": {
    "auteur": {
      "typeAuteur": "Depute",
      "acteurRef": "PA718728",
      "groupePolitiqueRef": "PO730964"
    },
    "cosignatairesRefs": [
      "PA718728"
    ],
    "texteAffichable": "Mme&#160;Vanceunebrock-Mialon"
  },
  "pointeurFragmentTexte": {
    "division": {
      "titre": "Article 7",
      "articleDesignationCourte": "ART. 7",
      "type": "ARTICLE",
      "avantAApres": "A",
      "divisionRattachee": "ARTICLE 7",
      "urlDivisionTexteVise": "/15/textes/1831.asp#D_Article_7"
    },
    "alinea": {
      "avantAApres": "Apres",
      "numero": "5"
    }
  },
  "corps": {
    "dispositif": "<p style=\"text-align: justify;\">Apr&#232;s l'alin&#233;a 5, ins&#233;rer les huit alin&#233;as suivants :</p><p style=\"text-align: justify;\">II - L&#8217;article L. 1112-4 du code des transports est ainsi modifi&#233; :</p><p style=\"text-align: justify;\">1&#176; Au premier alin&#233;a, les mots : &#171; des moyens de transport adapt&#233;s &#187; sont remplac&#233;s par les mots : &#171; des services de substitution &#187; ;</p><p style=\"text-align: justify;\">2&#176; Au premier alin&#233;a, les mots : &#171; ces moyens de transport &#187; sont remplac&#233;s par les mots : &#171; ces services de substitution &#187;;</p><p style=\"text-align: justify;\">3&#176; Au premier alin&#233;a, les mots : &#171; ou, en l&#8217;absence d&#8217;une telle autorit&#233;, l&#8217;&#201;tat &#187; sont ins&#233;r&#233;s apr&#232;s les mots : &#171; L&#8217;autorit&#233; organisatrice de transport comp&#233;tente &#187; ;</p><p style=\"text-align: justify;\">4&#176; Apr&#232;s le premier alin&#233;a, ins&#233;rer un alin&#233;a ainsi r&#233;dig&#233; :</p><p style=\"text-align: justify;\">&#171; Les services de substitution peuvent prendre la forme de transports de substitution ou de mesures de substitution. Les transports de substitution sont des services de transport public accessibles se substituant &#224; la desserte d&#8217;une ligne de transport public non accessible ou partiellement accessible. Les mesures de substitution sont des mesures de nature humaine, organisationnelle ou technique permettant de r&#233;aliser le trajet dans des conditions analogues &#224; celles du trajet initialement souhait&#233;. &#187; ;</p><p style=\"text-align: justify;\">5&#176; Au deuxi&#232;me alin&#233;a, les mots : &#171; ces transports de substitution &#187; sont remplac&#233;s par les mots : &#171; ces services de substitution &#187; ;</p><p style=\"text-align: justify;\">III - &#192; l&#8217;article L114-4 du code de l&#8217;action sociale et des familles, apr&#232;s les mots : &#171; transports sp&#233;cialis&#233;s &#187; sont ins&#233;r&#233;s les mots : &#171; ou transports sp&#233;cifiques ou sp&#233;cialement adapt&#233;s &#187;.</p><p style=\"text-align: justify;\">&#160;</p>",
    "exposeSommaire": "<p style=\"text-align: justify;\">Cet&#160;amendement vise en premier lieu&#160;&#224;&#160;clarifier la notion de substitution dans le code des transports et de transport sp&#233;cialis&#233; dans le code de l&#8217;action sociale et des familles.</p><p style=\"text-align: justify;\">Il vient ensuite&#160;&#233;largir la palette des solutions &#224; apporter aux obligations de substitution dans le transport routier de personnes &#224; l&#8217;image de ce qui est d&#233;j&#224; pr&#233;vu dans le ferr&#233; : pas seulement du transport de substitution mais &#233;galement d&#8217;autres mesures de substitution plus simples et plus l&#233;g&#232;res comme les mesures d'accompagnement.</p><p style=\"text-align: justify;\">Ces pr&#233;cisions reprennent en grande partie la directive du 13 avril 2006 d&#8217;application de la loi n&#176;2005-102 du 11 f&#233;vrier 2005 pour l&#8217;accessibilit&#233; des services de transport public terrestres de personnes handicap&#233;es et &#224; mobilit&#233; r&#233;duite.</p><p style=\"text-align: justify;\">Elles permettront ainsi&#160;d&#8217;am&#233;liorer l&#8217;accessibilit&#233; aux r&#233;seaux via des solutions pouvant reposer sur l&#8217;aide humaine,&#160;d&#8217;encadrer des pratiques d&#233;j&#224; existantes d&#8217;accompagnement dans les r&#233;seaux (ex. SYTRAL Lyon) et&#160;de proposer &#233;galement des solutions plus inclusives : usage du r&#233;seau classique, le cas &#233;ch&#233;ant accompagn&#233;, plut&#244;t que du transport sp&#233;cialis&#233;.</p>"
  },
  "representations": [
    {
      "nom": "PDF",
      "typeMime": {
        "type": "application",
        "subType": "PDF"
      },
      "statutRepresentation": {
        "verbatim": true,
        "canonique": true,
        "officielle": true,
        "transcription": false,
        "enregistrement": false
      },
      "contenu": {
        "documentURI": "/15/amendements/1831/CION-DVP/CD1896.pdf"
      }
    }
  ],
  "sort": {
    "dateSaisie": "2019-05-16T19:04:21.000+02:00",
    "sortEnSeance": "Non soutenu"
  },
  "dateDepot": "2019-05-09T02:00:00.000+02:00",
  "dateDistribution": "2019-05-14T02:00:00.000+02:00",
  "article99": "0",
  "loiReference": {
    "codeLoi": "transports",
    "divisionCodeLoi": "L1112-4"
  }
}