{
  "uid": "AMANR5L15PO59051B1802P0D1N771",
  "identifiant": {
    "legislature": "15",
    "numero": "771",
    "numRect": "0",
    "saisine": {
      "texteLegislatifRef": "PRJLANR5L15B1802",
      "numeroPartiePLF": "0",
      "organeExamen": "PO59051",
      "mentionSecondeDeliberation": "0"
    }
  },
  "numeroLong": "CL771",
  "etapeTexte": "1ère lecture (1ère assemblée saisie)",
  "triAmendement": "jbaaaaaaaaaaaaaaaaaaaaaaaaaaaaaaaaaaaaaaaaaaaaaaaaq",
  "cardinaliteAmdtMultiples": "1",
  "etat": "Discuté",
  "signataires": {
    "auteur": {
      "typeAuteur": "Depute",
      "acteurRef": "PA719748",
      "groupePolitiqueRef": "PO730964"
    },
    "cosignatairesRefs": [
      "PA719748"
    ],
    "texteAffichable": "Mme&#160;Chalas, rapporteure"
  },
  "pointeurFragmentTexte": {
    "division": {
      "titre": "Article 26",
      "articleDesignationCourte": "ART. 26",
      "type": "ARTICLE",
      "avantAApres": "A",
      "divisionRattachee": "ARTICLE 26",
      "urlDivisionTexteVise": "/15/textes/1802.asp#D_Article_26"
    },
    "alinea": {
      "numero": "13"
    }
  },
  "corps": {
    "dispositif": "<p style=\"text-align: justify;\">&#192; l&#8217;alin&#233;a&#160;13, substituer &#224; la r&#233;f&#233;rence&#160;:</p><p style=\"text-align: justify;\">&#171;&#160;et&#160;5&#176;&#160;&#187;</p><p style=\"text-align: justify;\">les r&#233;f&#233;rences&#160;:</p><p style=\"text-align: justify;\">&#171;&#160;, 5&#176; et&#160;7&#176;&#160;&#187;.</p>",
    "exposeSommaire": "<p>Amendement de coordination avec la loi &#171; PACTE &#187;.</p><p>La loi &#171; PACTE &#187; a introduit un nouveau 7&#176; &#224; l&#8217;article L. 5424-1 du code du travail pour couvrir les personnels de la Poste dans le cas o&#249; l&#8217;&#201;tat ne d&#233;tiendrait plus la majorit&#233; du capital de cette soci&#233;t&#233;. Il convient donc de compl&#233;ter l&#8217;alin&#233;a 13 de l&#8217;article 26 de la pr&#233;sente loi pour tenir compte de ce 7&#176;.</p>"
  },
  "representations": [
    {
      "nom": "PDF",
      "typeMime": {
        "type": "application",
        "subType": "PDF"
      },
      "statutRepresentation": {
        "verbatim": true,
        "canonique": true,
        "officielle": true,
        "transcription": false,
        "enregistrement": false
      },
      "contenu": {
        "documentURI": "/15/amendements/1802/CION_LOIS/CL771.pdf"
      }
    }
  ],
  "sort": {
    "dateSaisie": "2019-05-03T15:48:01.000+02:00",
    "sortEnSeance": "Adopté"
  },
  "dateDepot": "2019-04-29T02:00:00.000+02:00",
  "dateDistribution": "2019-05-01T02:00:00.000+02:00",
  "article99": "0",
  "loiReference": {}
}