{
  "uid": "AMANR5L15PO59048B1255P1D1N452",
  "identifiant": {
    "legislature": "15",
    "numero": "452",
    "numRect": "0",
    "saisine": {
      "texteLegislatifRef": "PRJLANR5L15B1255",
      "numeroPartiePLF": "1",
      "organeExamen": "PO59048",
      "mentionSecondeDeliberation": "0"
    }
  },
  "numeroLong": "I-CF452",
  "etapeTexte": "1ère lecture (1ère assemblée saisie)",
  "triAmendement": "aoaaaaaaaaaaaaaaaaaaaaaaaaaaaaaaaaaaaaaaaaaaaaaaaafkc",
  "cardinaliteAmdtMultiples": "1",
  "etat": "Discuté",
  "signataires": {
    "auteur": {
      "typeAuteur": "Depute",
      "acteurRef": "PA720952",
      "groupePolitiqueRef": "PO730964"
    },
    "cosignatairesRefs": [
      "PA718728",
      "PA720202",
      "PA720278",
      "PA719448",
      "PA719558",
      "PA720900",
      "PA721776",
      "PA720944",
      "PA721426",
      "PA719740",
      "PA606507",
      "PA719890",
      "PA718962",
      "PA718810",
      "PA720046",
      "PA609520",
      "PA719520",
      "PA721246",
      "PA718978",
      "PA720622",
      "PA719994",
      "PA718930",
      "PA722344",
      "PA722086",
      "PA606639",
      "PA721888",
      "PA721568",
      "PA721624",
      "PA334116",
      "PA719440",
      "PA720916",
      "PA719960",
      "PA719330",
      "PA722150",
      "PA721296",
      "PA719684",
      "PA719186",
      "PA719790",
      "PA720014",
      "PA718744",
      "PA721352",
      "PA721844",
      "PA606202",
      "PA720500",
      "PA719972",
      "PA642695",
      "PA719350",
      "PA721600",
      "PA720214",
      "PA607595",
      "PA720952",
      "PA720002",
      "PA722126",
      "PA720362",
      "PA719814",
      "PA643175",
      "PA719480"
    ],
    "texteAffichable": "M.&#160;Tach&#233;,  M.&#160;Colas-Roy, Mme&#160;Lazaar, Mme&#160;Gaillot, Mme&#160;Piron, M.&#160;Boudi&#233;, Mme&#160;Cazarian, Mme&#160;Kamowski, M.&#160;Houli&#233;, M.&#160;Orphelin, Mme&#160;Rilhac, M.&#160;Baich&#232;re, M.&#160;Chiche, M.&#160;Gaillard, M.&#160;Bothorel, M.&#160;Julien-Laferriere, Mme&#160;Dufeu Schubert, Mme&#160;Bagarry, Mme&#160;Dubost, Mme&#160;Sarles, Mme&#160;Petel, Mme&#160;Chapelier, Mme&#160;Robert, M.&#160;Chalumeau, Mme&#160;Tiegna, M.&#160;Balanant, Mme&#160;Rossi, Mme&#160;Dupont, Mme&#160;Park, M.&#160;Vignal, M.&#160;Zulesi, M.&#160;Taquet, Mme&#160;Krimi, Mme&#160;Val&#233;rie&#160;Petit, Mme&#160;Fran&#231;oise&#160;Dumas, M.&#160;Raphan, M.&#160;Gouffier-Cha, Mme&#160;Tamarelle-Verhaeghe, Mme&#160;Avia, Mme&#160;Vanceunebrock-Mialon, M.&#160;Person, Mme&#160;Pompili, Mme&#160;Khattabi, M.&#160;Cellier, M.&#160;Belhaddad, Mme&#160;Kuric, Mme&#160;Colboc, M.&#160;Pellois, Mme&#160;Jacqueline&#160;Maquet, M.&#160;Laqhila, Mme&#160;Riotton, Mme&#160;El Ha&#239;ry, M.&#160;Gouttefarde, Mme&#160;Brulebois, Mme&#160;Bureau-Bonnard, M.&#160;Nogal et Mme&#160;Faure-Muntian"
  },
  "pointeurFragmentTexte": {
    "division": {
      "titre": "Article 2",
      "articleDesignationCourte": "APRÈS ART. 2",
      "type": "ARTICLE",
      "avantAApres": "Apres",
      "divisionRattachee": "APRÈS L'ARTICLE 2, insérer l'article suivant:",
      "articleAdditionnel": "1",
      "urlDivisionTexteVise": "/15/textes/1255A.asp#D_Article_2"
    }
  },
  "corps": {
    "dispositif": "<p style=\"text-align: justify;\">I.&#160;&#8211;&#160;Apr&#232;s l&#8217;article&#160;200 <i>bis</i> du code g&#233;n&#233;ral des imp&#244;ts, il est ns&#233;r&#233; un article&#160;200 <i>ter</i> &#171;&#160;Cr&#233;dit d&#8217;imp&#244;t solidarit&#233;&#160;&#187; ainsi r&#233;dig&#233;&#160;:</p><p style=\"text-align: justify;\">&#171;&#160;<i>Article&#160;200</i> ter.&#160;&#8211;&#160;Les d&#233;penses engag&#233;es par les contribuables domicili&#233;s en France pour l&#8217;h&#233;bergement d&#8217;un r&#233;fugi&#233; ou demandeur d&#8217;asile au sens des articles L.&#160;711&#8209;1 et L.&#160;741&#8209;1 du code d&#8217;entr&#233;e et de s&#233;jour des &#233;trangers et du droit d&#8217;asile ouvrent droit &#224; un cr&#233;dit d&#8217;imp&#244;t sur le revenu.</p><p style=\"text-align: justify;\">Le cr&#233;dit d&#8217;imp&#244;t est &#233;gal &#224; 5&#160;euros par nuit&#233;e attest&#233;e par une association vis&#233;e au 1. <i>a</i>) ou 1. <i>b</i>) de l&#8217;article&#160;200 du m&#234;me code dans la limite d&#8217;un plafond annuel de 1 500&#160;euros.&#160;&#187;</p><p style=\"text-align: justify;\">II<i>.</i> &#8211; Le I n&#8217;est applicable qu&#8217;aux sommes venant en d&#233;duction de l&#8217;imp&#244;t d&#251;.</p><p style=\"text-align: justify;\">III.&#160;&#8211;&#160;La perte des recettes pour l&#8217;&#201;tat est compens&#233;e, &#224; due concurrence par la cr&#233;ation d&#8217;une taxe additionnelle aux droits vis&#233;s aux articles 575 et 575&#160;A du code g&#233;n&#233;ral des imp&#244;ts.</p>",
    "exposeSommaire": "<p style=\"text-align: justify;\">Le pr&#233;sent article a pour objet de cr&#233;er un cr&#233;dit d&#8217;imp&#244;t solidarit&#233; pour les foyers h&#233;bergeant gratuitement un primo-arrivant, r&#233;fugi&#233; ou demandeur d&#8217;asile.</p><p style=\"text-align: justify;\">&#192; l&#8217;image de la r&#233;duction d&#8217;imp&#244;t pour dons &#224; des associations d&#8217;int&#233;r&#234;t g&#233;n&#233;ral ou d&#8217;utilit&#233; publique qui est ouverte aux frais support&#233;s par les b&#233;n&#233;voles, le cr&#233;dit d&#8217;imp&#244;t repose sur la d&#233;claration par une association agr&#233;&#233;e de dons de nuit&#233;es d&#8217;h&#233;bergement b&#233;n&#233;vole. L&#8217;incitation financi&#232;re est fix&#233;e &#224; 5&#160;euros par nuit&#233;e dans la limite de 1&#160;500&#160;euros par an.</p><p style=\"text-align: justify;\">Cette disposition figurait comme une des propositions du rapport &#171;&#160;72 propositions pour une politique ambitieuse d&#8217;int&#233;gration des &#233;trangers arrivant en France&#160;&#187;, remis au Premier Ministre, en f&#233;vrier 2018.</p>"
  },
  "representations": [
    {
      "nom": "PDF",
      "typeMime": {
        "type": "application",
        "subType": "PDF"
      },
      "statutRepresentation": {
        "verbatim": true,
        "canonique": true,
        "officielle": true,
        "transcription": false,
        "enregistrement": false
      },
      "contenu": {
        "documentURI": "/15/amendements/1255A/CION_FIN/CF452.pdf"
      }
    }
  ],
  "sort": {
    "dateSaisie": "2018-10-09T19:55:11.000+02:00",
    "sortEnSeance": "Retiré"
  },
  "dateDepot": "2018-10-04T02:00:00.000+02:00",
  "dateDistribution": "2018-10-08T02:00:00.000+02:00",
  "article99": "0",
  "loiReference": {
    "codeLoi": "impôts",
    "divisionCodeLoi": "200 ter"
  }
}