{
  "uid": "AMANR5L15PO59051B1802P0D1N19",
  "identifiant": {
    "legislature": "15",
    "numero": "19",
    "numRect": "0",
    "saisine": {
      "texteLegislatifRef": "PRJLANR5L15B1802",
      "numeroPartiePLF": "0",
      "organeExamen": "PO59051",
      "mentionSecondeDeliberation": "0"
    }
  },
  "numeroLong": "CL19",
  "etapeTexte": "1ère lecture (1ère assemblée saisie)",
  "triAmendement": "bgaaaaaaaaaaaaaaaaaaaaaaaaaaaaaaaaaaaaaaaaaaaaaaaaasv",
  "cardinaliteAmdtMultiples": "1",
  "etat": "Discuté",
  "signataires": {
    "auteur": {
      "typeAuteur": "Depute",
      "acteurRef": "PA606098",
      "groupePolitiqueRef": "PO730934"
    },
    "cosignatairesRefs": [
      "PA709315",
      "PA267901",
      "PA346218",
      "PA266797",
      "PA267200",
      "PA267785",
      "PA721678",
      "PA606098",
      "PA721314",
      "PA720100",
      "PA330240",
      "PA267440",
      "PA330008"
    ],
    "texteAffichable": "M.&#160;Marleix,  M.&#160;Breton, M.&#160;Ciotti, M.&#160;Diard, M.&#160;Gosselin, M.&#160;Huyghe, M.&#160;Kamardine, M.&#160;Larriv&#233;, M.&#160;Masson, M.&#160;Pradi&#233;, M.&#160;Reda, M.&#160;Schellenberger et M.&#160;Viala"
  },
  "pointeurFragmentTexte": {
    "division": {
      "titre": "Article 8",
      "articleDesignationCourte": "ART. 8",
      "type": "ARTICLE",
      "avantAApres": "A",
      "divisionRattachee": "ARTICLE 8",
      "urlDivisionTexteVise": "/15/textes/1802.asp#D_Article_8"
    },
    "alinea": {
      "numero": "2"
    }
  },
  "corps": {
    "dispositif": "<p style=\"text-align: justify;\">I.&#160;&#8211;&#160;&#192; l&#8217;alin&#233;a&#160;2, apr&#232;s le mot&#160;: </p><p style=\"text-align: justify;\">&#171;&#160;agent&#160;&#187;, </p><p style=\"text-align: justify;\">ins&#233;rer les mots&#160;:</p><p style=\"text-align: justify;\">&#171;&#160;des cat&#233;gories A et B&#160;&#187;.</p><p style=\"text-align: justify;\">II.&#160;&#8211;&#160;En cons&#233;quence, proc&#233;der &#224; la m&#234;me insertion &#224; l&#8217;alin&#233;a&#160;16.</p>",
    "exposeSommaire": "<p>Cet amendement pr&#233;cise que le contrat de projet propos&#233; &#224; l'article 8 ne peut &#234;tre destin&#233; aux cat&#233;gories C car les emplois remplis par cette cat&#233;gorie ne seront pas concern&#233;s par ce nouveau type de contrat.&#160;</p>"
  },
  "representations": [
    {
      "nom": "PDF",
      "typeMime": {
        "type": "application",
        "subType": "PDF"
      },
      "statutRepresentation": {
        "verbatim": true,
        "canonique": true,
        "officielle": true,
        "transcription": false,
        "enregistrement": false
      },
      "contenu": {
        "documentURI": "/15/amendements/1802/CION_LOIS/CL19.pdf"
      }
    }
  ],
  "sort": {
    "dateSaisie": "2019-05-02T18:32:27.000+02:00",
    "sortEnSeance": "Rejeté"
  },
  "dateDepot": "2019-04-12T02:00:00.000+02:00",
  "dateDistribution": "2019-05-01T02:00:00.000+02:00",
  "article99": "0",
  "loiReference": {
    "codeLoi": "1.1 DC"
  }
}