{
  "uid": "AMANR5L15PO766718B2187P0D1N1403",
  "identifiant": {
    "legislature": "15",
    "numero": "1403",
    "numRect": "0",
    "saisine": {
      "texteLegislatifRef": "PRJLANR5L15B2187",
      "numeroPartiePLF": "0",
      "organeExamen": "PO766718",
      "mentionSecondeDeliberation": "0"
    }
  },
  "numeroLong": "1403",
  "etapeTexte": "1ère lecture (1ère assemblée saisie)",
  "triAmendement": "akaaaaaaaaaaaaaaaaaaaaaaaaaaaaaaaaaaaaaaaaaaaaaaaafcg",
  "cardinaliteAmdtMultiples": "1",
  "etat": "Discuté",
  "signataires": {
    "auteur": {
      "typeAuteur": "Depute",
      "acteurRef": "PA720870",
      "groupePolitiqueRef": "PO730964"
    },
    "cosignatairesRefs": [
      "PA721860",
      "PA718744",
      "PA702054",
      "PA720538",
      "PA720870",
      "PA721600"
    ],
    "texteAffichable": "M.&#160;Mbaye,  M.&#160;Cesarini, Mme&#160;Bagarry, Mme&#160;Rossi, Mme&#160;De Temmerman et M.&#160;Claireaux"
  },
  "pointeurFragmentTexte": {
    "division": {
      "titre": "Article 3",
      "articleDesignationCourte": "ART. 3",
      "type": "ARTICLE",
      "avantAApres": "A",
      "divisionRattachee": "ARTICLE 3",
      "urlDivisionTexteVise": "/15/textes/2187.asp#D_Article_3"
    },
    "alinea": {
      "numero": "9"
    }
  },
  "corps": {
    "dispositif": "<p style=\"text-align: justify;\">Au d&#233;but de l&#8217;alin&#233;a&#160;9, substituer aux mots&#160;:</p><p style=\"text-align: justify;\">&#171;&#160;Tout enfant&#160;&#187;</p><p style=\"text-align: justify;\">les mots&#160;:</p><p style=\"text-align: justify;\">&#171;&#160;Toute personne&#160;&#187;.</p>",
    "exposeSommaire": "<p style=\"text-align: justify;\">Le pr&#233;sent amendement vise &#224; remplacer le terme&#160;&#171;&#160;enfant&#160;&#187; par le terme &#171;&#160;personne&#160;&#187; s&#8217;agissant des dispositions relatives &#224; l&#8217;acc&#232;s aux origines des personnes issues d&#8217;un don de gam&#232;tes.</p><p style=\"text-align: justify;\">En effet, il apparait inopportun d&#8217;infantiliser de la sorte les futurs b&#233;n&#233;ficiaires de l&#8217;acc&#232;s aux origines, a fortiori lorsque l&#8217;on sait que ces derniers devront &#234;tre majeurs afin de jouir de ce droit.</p>"
  },
  "representations": [
    {
      "nom": "PDF",
      "typeMime": {
        "type": "application",
        "subType": "PDF"
      },
      "statutRepresentation": {
        "verbatim": true,
        "canonique": true,
        "officielle": true,
        "transcription": false,
        "enregistrement": false
      },
      "contenu": {
        "documentURI": "/15/amendements/2187/CSBIOETH/1403.pdf"
      }
    }
  ],
  "sort": {
    "dateSaisie": "2019-09-12T15:37:24.000+02:00",
    "sortEnSeance": "Tombé"
  },
  "dateDepot": "2019-09-05T02:00:00.000+02:00",
  "dateDistribution": "2019-09-09T02:00:00.000+02:00",
  "article99": "0",
  "loiReference": {}
}