{
  "uid": "AMANR5L15SEA717460B2272P1D1N1085",
  "identifiant": {
    "legislature": "15",
    "numero": "1085",
    "numRect": "0",
    "saisine": {
      "texteLegislatifRef": "PRJLANR5L15B2272",
      "numeroPartiePLF": "1",
      "organeExamen": "PO717460",
      "mentionSecondeDeliberation": "0"
    }
  },
  "numeroLong": "I-1085",
  "etapeTexte": "1ère lecture (1ère assemblée saisie)",
  "triAmendement": "auaaaaaaaaaaaaaaaaaaaaaaaaaaaaaaaaaaaaaaaaaaaaaaaaocazzzzyi",
  "cardinaliteAmdtMultiples": "1",
  "etat": "Discuté",
  "signataires": {
    "auteur": {
      "typeAuteur": "Depute",
      "acteurRef": "PA720278",
      "groupePolitiqueRef": "PO759900"
    },
    "cosignatairesRefs": [
      "PA720278"
    ],
    "texteAffichable": "M.&#160;Orphelin"
  },
  "pointeurFragmentTexte": {
    "division": {
      "titre": "Article 3",
      "articleDesignationCourte": "APRÈS ART. 3",
      "type": "ARTICLE",
      "avantAApres": "Apres",
      "divisionRattachee": "APRÈS L'ARTICLE 3, insérer l'article suivant:",
      "articleAdditionnel": "1",
      "urlDivisionTexteVise": "/15/textes/2272A.asp#D_Article_3"
    }
  },
  "corps": {
    "dispositif": "<p>I. &#8211; La section V du chapitre II <i>bis</i> du titre IV de la premi&#232;re partie du livre I<sup>er</sup> du code g&#233;n&#233;ral des imp&#244;ts est compl&#233;t&#233;e par un article&#160;976 <i>bis</i> ainsi r&#233;dig&#233;&#160;:</p><p style=\"text-align: justify;\">&#171;&#160;<i>Art.&#160;976 <i>bis</i></i>. &#8211; Sont exon&#233;r&#233;s les espaces naturels.&#160;&#187;</p><p style=\"text-align: justify;\">II. &#8211; La perte de recettes pour l&#8217;&#201;tat r&#233;sultant de l&#8217;instauration de ces exon&#233;rations est compens&#233;e &#224; due concurrence par la cr&#233;ation d&#8217;une taxe additionnelle aux droits pr&#233;vus aux articles 575 et 575 A du code g&#233;n&#233;ral des imp&#244;ts.</p>",
    "exposeSommaire": "<p>Le pr&#233;sent amendement vise &#224; exon&#233;rer de l&#8217;IFI les espaces naturels. En raison de la faible rentabilit&#233; des espaces naturels, la taxation fait peser un risque d&#8217;artificialisation sur ces espaces. Exon&#233;rer de l&#8217;IFI les espaces naturels revient donc &#224; supprimer cette incitation &#224; l&#8217;artificialisation.&#160;</p>"
  },
  "representations": [
    {
      "nom": "PDF",
      "typeMime": {
        "type": "application",
        "subType": "PDF"
      },
      "statutRepresentation": {
        "verbatim": true,
        "canonique": true,
        "officielle": true,
        "transcription": false,
        "enregistrement": false
      },
      "contenu": {
        "documentURI": "/15/amendements/2272A/AN/1085.pdf"
      }
    }
  ],
  "seanceDiscussion": "RUANR5L15S2020IDS21867",
  "sort": {
    "dateSaisie": "2019-10-17T18:04:47.000+02:00",
    "sortEnSeance": "Non soutenu"
  },
  "dateDepot": "2019-10-09T02:00:00.000+02:00",
  "dateDistribution": "2019-10-14T02:00:00.000+02:00",
  "article99": "0",
  "loiReference": {
    "codeLoi": "CGI",
    "divisionCodeLoi": "976 bis"
  }
}