{
  "uid": "AMANR5L15SEA717460BTC2206P0D1N122",
  "identifiant": {
    "legislature": "15",
    "numero": "122",
    "numRect": "0",
    "saisine": {
      "texteLegislatifRef": "PRJLANR5L15BTC2206",
      "numeroPartiePLF": "0",
      "organeExamen": "PO717460",
      "mentionSecondeDeliberation": "0"
    }
  },
  "numeroLong": "122",
  "etapeTexte": "Nouvelle Lecture",
  "triAmendement": "hsaaaaaaaaaaaaaaaaaaaaaaaaaaaaaaaaaaaaaaaaaaaaaaaaff",
  "cardinaliteAmdtMultiples": "1",
  "etat": "Discuté",
  "signataires": {
    "auteur": {
      "typeAuteur": "Depute",
      "acteurRef": "PA718884",
      "groupePolitiqueRef": "PO730934"
    },
    "cosignatairesRefs": [
      "PA767",
      "PA605036",
      "PA718884",
      "PA267785"
    ],
    "texteAffichable": "Mme&#160;Bazin-Malgras,  M.&#160;Larriv&#233;, M.&#160;Abad et M.&#160;Cattin"
  },
  "pointeurFragmentTexte": {
    "division": {
      "titre": "Article 31",
      "articleDesignationCourte": "ART. 31",
      "type": "ARTICLE",
      "avantAApres": "A",
      "divisionRattachee": "ARTICLE 31",
      "urlDivisionTexteVise": "/15/textes/2206.asp#D_Article_31"
    },
    "alinea": {
      "numero": "118"
    }
  },
  "corps": {
    "dispositif": "<p style=\"text-align: justify;\">R&#233;tablir les VI &#224; VIII de l&#8217;alin&#233;a&#160;118 dans la r&#233;daction suivante&#160;:</p><p style=\"text-align: justify;\">&#171;&#160;VI.&#160;&#8211;&#160;&#192; titre exp&#233;rimental, les op&#233;rateurs de transports publics de voyageurs sont autoris&#233;s &#224; mettre en &#339;uvre la transmission et l&#8217;enregistrement d&#8217;images prises sur la voie publique et dans des lieux et &#233;tablissements ouverts au public, au moyen de cam&#233;ras frontales embarqu&#233;es dans les mat&#233;riels roulants qu&#8217;ils exploitent.</p><p style=\"text-align: justify;\">&#171;&#160;L&#8217;enregistrement est permanent mais l&#8217;exploitation des images collect&#233;es par ces syst&#232;mes n&#8217;est autoris&#233;e qu&#8217;aux fins d&#8217;assurer la pr&#233;vention et l&#8217;analyse des accidents de transport.</p><p style=\"text-align: justify;\">&#171;&#160;Les enregistrements dont l&#8217;exploitation est autoris&#233;e ont pour finalit&#233;s exclusives&#160;: l&#8217;am&#233;lioration de la connaissance de l&#8217;accidentologie ferroviaire ainsi que celle des transports guid&#233;s et routiers, la pr&#233;vention de la r&#233;alisation ou de la r&#233;it&#233;ration d&#8217;accident de transport ainsi que la formation et la p&#233;dagogie des personnels de conduite et leur hi&#233;rarchie.</p><p style=\"text-align: justify;\">&#171;&#160;Les enregistrements, hors les cas o&#249; ils sont utilis&#233;s dans le cadre d&#8217;une proc&#233;dure judiciaire, administrative ou disciplinaire, sont effac&#233;s au bout de six&#160;mois.</p><p style=\"text-align: justify;\">&#171;&#160;Ces enregistrements ne peuvent &#234;tre conserv&#233;s sans limitation de dur&#233;e, que dans les conditions garantissant l&#8217;anonymisation de toutes les donn&#233;es &#224; caract&#232;re personnel capt&#233;es.</p><p style=\"text-align: justify;\">&#171;&#160;Les enregistrements qui ne sont pas en lien avec un incident ou un accident de transport ne peuvent pas &#234;tre exploit&#233;s et doivent &#234;tre supprim&#233;s automatiquement dans un d&#233;lai maximal de quinze&#160;jours.</p><p style=\"text-align: justify;\">&#171;&#160;L&#8217;extraction d&#8217;images, rendues anonymes, est autoris&#233;e aux fins de renseigner les rapports d&#8217;enqu&#234;tes ou d&#8217;analyses des accidents de transport qui seront conserv&#233;s autant que de besoin par l&#8217;exploitant ou le gestionnaire d&#8217;infrastructures.</p><p style=\"text-align: justify;\">&#171;&#160;Ces enregistrements sont soumis &#224; la loi&#160;n&#176;&#160;78&#8209;17 du 6&#160;janvier&#160;1978 relative &#224; l&#8217;informatique, aux fichiers et aux libert&#233;s, ainsi qu&#8217;au r&#232;glement&#160;(UE)&#160;2016/679 du Parlement europ&#233;en et du Conseil du 27&#160;avril&#160;2016 relatif &#224; la protection des personnes physiques &#224; l&#8217;&#233;gard du traitement des donn&#233;es &#224; caract&#232;re personnel et &#224; la libre circulation de ces donn&#233;es, et abrogeant la directive&#160;95/46/CE, notamment en ce qui concerne le contr&#244;le de la Commission nationale de l&#8217;informatique et des libert&#233;s et le droit d&#8217;acc&#232;s aux enregistrements.</p><p style=\"text-align: justify;\">&#171;&#160;Une information g&#233;n&#233;rale du public sur l&#8217;emploi de ces cam&#233;ras est organis&#233;e par le ministre charg&#233; des transports.</p><p style=\"text-align: justify;\">&#171;&#160;VII.&#160;&#8211;&#160;Les modalit&#233;s d&#8217;application du&#160;VI et d&#8217;utilisation des donn&#233;es collect&#233;es sont pr&#233;cis&#233;es par un d&#233;cret en Conseil d&#8217;&#201;tat, pris apr&#232;s avis de la Commission nationale de l&#8217;informatique et des libert&#233;s. Ces dispositions sont applicables &#224; compter de la promulgation de la pr&#233;sente loi, pour une dur&#233;e de trois&#160;ans.</p><p style=\"text-align: justify;\">&#171;&#160;VIII.&#160;&#8211;&#160;L&#8217;exp&#233;rimentation mentionn&#233;e au&#160;VI fait l&#8217;objet d&#8217;un bilan de sa mise en&#160;&#339;uvre dans les deux&#160;ans suivant son entr&#233;e en vigueur, afin d&#8217;&#233;valuer l&#8217;opportunit&#233; du maintien de cette mesure.&#160;&#187;</p>",
    "exposeSommaire": "<p>Cet amendement r&#233;tablit des dispositions introduites par le S&#233;nat proposant l&#8217;installation de cam&#233;ras sur les v&#233;hicules de transports publics afin d&#8217;analyser a posteriori les causes d&#8217;accidents et d&#232;s lors de prendre des mesures destin&#233;es &#224; pr&#233;venir ce type d&#8217;incident ou d&#8217;accident, pour se conformer, entre autres, aux pr&#233;conisations du Bureau d&#8217;Enqu&#234;tes sur les Accidents de Transport Terrestre.</p><p>Il convient de r&#233;tablir cette possibilit&#233; qui pourrait faire progresser la s&#233;curit&#233; routi&#232;re.</p>"
  },
  "representations": [
    {
      "nom": "PDF",
      "typeMime": {
        "type": "application",
        "subType": "PDF"
      },
      "statutRepresentation": {
        "verbatim": true,
        "canonique": true,
        "officielle": true,
        "transcription": false,
        "enregistrement": false
      },
      "contenu": {
        "documentURI": "/15/amendements/2206/AN/122.pdf"
      }
    }
  ],
  "seanceDiscussion": "RUANR5L15S2019IDS21806",
  "sort": {
    "dateSaisie": "2019-09-12T17:19:12.000+02:00",
    "sortEnSeance": "Non soutenu"
  },
  "dateDepot": "2019-09-05T02:00:00.000+02:00",
  "dateDistribution": "2019-09-12T02:00:00.000+02:00",
  "article99": "0",
  "loiReference": {}
}