{
  "uid": "AMANR5L15SEA717460BTC0902P0D1N245",
  "identifiant": {
    "legislature": "15",
    "numero": "245",
    "numRect": "0",
    "saisine": {
      "texteLegislatifRef": "PRJLANR5L15BTC0902",
      "numeroPartiePLF": "0",
      "organeExamen": "PO717460",
      "mentionSecondeDeliberation": "0"
    }
  },
  "numeroLong": "245",
  "etapeTexte": "1ère lecture (1ère assemblée saisie)",
  "triAmendement": "cu",
  "cardinaliteAmdtMultiples": "1",
  "etat": "Irrecevable",
  "signataires": {
    "auteur": {
      "typeAuteur": "Depute",
      "acteurRef": "PA332228",
      "groupePolitiqueRef": "PO744425"
    },
    "cosignatairesRefs": [
      "PA721486",
      "PA333421",
      "PA720696",
      "PA702052",
      "PA1960",
      "PA421348",
      "PA267585",
      "PA268019",
      "PA267330",
      "PA2952",
      "PA267780",
      "PA266788",
      "PA267766",
      "PA267042",
      "PA642935",
      "PA712014",
      "PA331582",
      "PA719806",
      "PA642868",
      "PA332228",
      "PA267355",
      "PA335758",
      "PA721110",
      "PA267241",
      "PA267801",
      "PA721094",
      "PA942",
      "PA720230",
      "PA610775",
      "PA331567",
      "PA722030",
      "PA695100"
    ],
    "texteAffichable": "M.&#160;Benoit,  Mme&#160;Auconie, M.&#160;Becht, M.&#160;Bournazel, M.&#160;Guy&#160;Bricout, M.&#160;Christophe, M.&#160;Charles&#160;de Courson, Mme&#160;de La Raudi&#232;re, M.&#160;Demilly, Mme&#160;Descamps, M.&#160;Dunoyer, M.&#160;Favennec Becot, Mme&#160;Firmin Le Bodo, M.&#160;Gom&#232;s, M.&#160;Meyer&#160;Habib, M.&#160;Herth, M.&#160;J&#233;go, M.&#160;Lagarde, M.&#160;Ledoux, M.&#160;Leroy, Mme&#160;Magnier, M.&#160;Morel-&#192;-L&apos;Huissier, M.&#160;Naegelen, M.&#160;Pancher, M.&#160;Riester, Mme&#160;Sage, Mme&#160;Sanquer, M.&#160;Vercamer, M.&#160;Philippe&#160;Vigier, M.&#160;Villiers, M.&#160;Warsmann et M.&#160;Zumkeller"
  },
  "pointeurFragmentTexte": {
    "division": {
      "titre": "Article 10",
      "articleDesignationCourte": "ART. 10",
      "type": "ARTICLE",
      "avantAApres": "A",
      "divisionRattachee": "ARTICLE 10",
      "urlDivisionTexteVise": "/15/textes/0902.asp#D_Article_10"
    },
    "alinea": {
      "avantAApres": "A",
      "numero": "6",
      "alineaDesignation": "Alinéa 6"
    }
  },
  "corps": {
    "dispositif": "<p style=\"text-align: justify;\">Compl&#233;ter l&#8217;alin&#233;a&#160;6 par les mots&#160;:</p><p style=\"text-align: justify;\">&#171;&#160;ainsi que l&#8217;assiette des contributions aux centrales internationales regroupant des distributeurs, demand&#233;es aux fournisseurs, auxquelles adh&#232;rent les distributeurs fran&#231;ais et limiter cette contribution au chiffre d&#8217;affaires r&#233;alis&#233; hors du territoire national.&#160;&#187;</p>",
    "exposeSommaire": "<p style=\"text-align: justify;\">Certains distributeurs exigent une contribution &#224; leur centrale internationale afin d&#8217;accompagner la commercialisation des produits de l&#8217;industriel &#224; l&#8217;&#233;tranger. Si cette id&#233;e peut paraitre pertinente, il s&#8217;av&#232;re que les contreparties sont le plus souvent inexistantes.</p><p style=\"text-align: justify;\">Les conditions demand&#233;es peuvent &#234;tre proche de 4&#160;% du CA factur&#233; et les demandes d&#8217;augmentation annuelle de 0,5&#160;%.</p><p style=\"text-align: justify;\">En cas de rapprochement entre 2 enseignes de distribution diff&#233;rentes, le nouveau partenaire impose aux entreprises d&#8217;appliquer ces conditions.</p><p style=\"text-align: justify;\">L&#8217;objectif &#171;&#160;affich&#233;&#160;&#187; est d&#8217;accompagner la commercialisation des produits &#224; l&#8217;&#233;tranger&#160;: des offres statistiques, l&#8217;organisation de rendez-vous &#171;&#160;cat&#233;goriels&#160;&#187;, des promotions &#171;&#160;internationales, l&#8217;ouverture de nouveaux march&#233;s.</p><p style=\"text-align: justify;\">Mais en r&#233;alit&#233;, cela repr&#233;sente peu de proposition de contreparties versus le niveau des demandes. La loi fran&#231;aise exige normalement un &#233;quilibre entre l&#8217;avantage &#233;conomique demand&#233; et la contrepartie propos&#233;e ce qui n&#8217;est pas le cas.</p><p style=\"text-align: justify;\">Les centrales internationales ont un fort pouvoir de sanction (d&#233;r&#233;f&#233;rencement, fermeture de march&#233;s) en cas de d&#233;saccords. Il peut m&#234;me y avoir remise en cause de plans d&#8217;affaires sign&#233;s en France avec les contrats annuels.</p><p style=\"text-align: justify;\">Un amendement dans le cadre de la loi Sapin 2 &#224; la demande de la DGCCRF a propos&#233; que les contributions aux centrales d&#8217;achat internationales se fassent avec contrepartie alors que les parlementaires avaient retenu en commission de limiter l&#8217;assiette des contributions au chiffre d&#8217;affaire r&#233;alis&#233; &#224; l&#8217;international. Force est de constater que rien n&#8217;a chang&#233; et que les industriels soumis les ann&#233;es pr&#233;c&#233;dentes &#224; cette contribution ont d&#251; pour l&#8217;ann&#233;e 2017 se rendre &#224; Bruxelles, &#224; Gen&#232;ve, &#224; Luxembourg et s&#8217;engager sur de nouvelles contributions afin d&#8217;avoir le droit d&#8217;&#234;tre r&#233;f&#233;renc&#233;s par les centrales de distribution et ce toujours sans r&#233;elle contrepartie.</p><p style=\"text-align: justify;\">Nous souhaitons limiter l&#8217;assiette de ces contributions au chiffre d&#8217;affaires r&#233;alis&#233; hors du territoire national et donc pr&#233;ciser l&#8217;ordonnance en ce sens.</p>"
  },
  "representations": [
    {
      "nom": "PDF",
      "typeMime": {
        "type": "application",
        "subType": "PDF"
      },
      "statutRepresentation": {
        "verbatim": true,
        "canonique": true,
        "officielle": true,
        "transcription": false,
        "enregistrement": false
      },
      "contenu": {
        "documentURI": "/15/amendements/0902/AN/245.pdf"
      }
    }
  ],
  "dateDepot": "2018-05-02T02:00:00.000+02:00",
  "article99": "0",
  "loiReference": {}
}