{
  "uid": "AMANR5L15PO419610B0846P0D1N1857",
  "identifiant": {
    "legislature": "15",
    "numero": "1857",
    "numRect": "0",
    "saisine": {
      "texteLegislatifRef": "PRJLANR5L15B0846",
      "numeroPartiePLF": "0",
      "organeExamen": "PO419610",
      "mentionSecondeDeliberation": "0"
    }
  },
  "numeroLong": "CE1857",
  "etapeTexte": "1ère lecture (1ère assemblée saisie)",
  "triAmendement": "bi",
  "cardinaliteAmdtMultiples": "1",
  "etat": "Discuté",
  "signataires": {
    "auteur": {
      "typeAuteur": "Depute",
      "acteurRef": "PA721270",
      "groupePolitiqueRef": "PO730940"
    },
    "cosignatairesRefs": [
      "PA267306",
      "PA721896",
      "PA610654",
      "PA721012",
      "PA722202",
      "PA689",
      "PA721118",
      "PA718926",
      "PA721270",
      "PA720546",
      "PA610667",
      "PA722110",
      "PA335612",
      "PA718720",
      "PA720692",
      "PA441"
    ],
    "texteAffichable": "M.&#160;Peu,  M.&#160;Wulfranc, M.&#160;Bruneel, Mme&#160;Bello, M.&#160;Brotherson, Mme&#160;Buffet, M.&#160;Chassaigne, M.&#160;Dharr&#233;ville, M.&#160;Dufr&#232;gne, Mme&#160;Faucillon, M.&#160;Jumel, Mme&#160;K&#233;clard-Mond&#233;sir, M.&#160;Lecoq, M.&#160;Nilor, M.&#160;Fabien&#160;Roussel et M.&#160;Serville"
  },
  "pointeurFragmentTexte": {
    "division": {
      "titre": "Article 34",
      "articleDesignationCourte": "ART. 34",
      "type": "ARTICLE",
      "avantAApres": "A",
      "divisionRattachee": "ARTICLE 34",
      "urlDivisionTexteVise": "/15/textes/0846.asp#D_Article_34"
    },
    "alinea": {
      "avantAApres": "A",
      "numero": "24",
      "alineaDesignation": "Alinéa 24"
    }
  },
  "corps": {
    "dispositif": "<p>Apr&#232;s l&#8217;alin&#233;a&#160;24, ins&#233;rer les cinq alin&#233;as suivants&#160;:</p><p>&#171;&#160;I <i>bis</i>. &#8211; Avant la conclusion du contrat, une notice d&#8217;information r&#233;dig&#233;e en des termes clairs et lisibles est remise au locataire. Celle-ci informe le locataire sur les caract&#233;ristiques du bail mobilit&#233; et notamment sur&#160;:</p><p>&#171;&#160;&#8211; l&#8217;interdiction pour le bailleur d&#8217;exiger le versement d&#8217;un d&#233;p&#244;t de garantie ;</p><p>&#171;&#160;&#8211; la proc&#233;dure relative &#224; la garantie VISALE ;</p><p>&#171;&#160;&#8211; les dur&#233;es minimales et maximales pour lesquelles peuvent &#234;tre conclu un bail mobilit&#233; ;</p><p>&#171;&#160;&#8211; l&#8217;interdiction de renouveler celui-ci.&#160;&#187;</p>",
    "exposeSommaire": "<p style=\"text-align: justify;\">Cet amendement vise &#224; &#233;clairer le preneur sur les dispositions particuli&#232;res du bail mobilit&#233; car il n&#8217;existe aucune obligation d&#8217;information pesant sur le bailleur. Sans une telle disposition, le locataire pourrait s&#8217;engager en m&#233;connaissance de ses droits et des protections dont il devrait b&#233;n&#233;ficier.</p><p style=\"text-align: justify;\">Afin d&#8217;&#233;viter ce type de situation, le pr&#233;sent amendement propose que l&#8217;ensemble de ces informations figurent sur une note d&#8217;information qui devra obligatoirement lui &#234;tre remise par le bailleur avant signature du contrat.</p>"
  },
  "representations": [
    {
      "nom": "PDF",
      "typeMime": {
        "type": "application",
        "subType": "PDF"
      },
      "statutRepresentation": {
        "verbatim": true,
        "canonique": true,
        "officielle": true,
        "transcription": false,
        "enregistrement": false
      },
      "contenu": {
        "documentURI": "/15/amendements/0846/CION-ECO/CE1857.pdf"
      }
    }
  ],
  "sort": {
    "dateSaisie": "2018-05-17T19:42:40.000+02:00",
    "sortEnSeance": "Rejeté"
  },
  "dateDepot": "2018-05-09T02:00:00.000+02:00",
  "dateDistribution": "2018-05-15T02:00:00.000+02:00",
  "article99": "0",
  "loiReference": {}
}