{
  "uid": "AMANR5L15PO757134B1088P0D1N773",
  "identifiant": {
    "legislature": "15",
    "numero": "773",
    "numRect": "0",
    "saisine": {
      "texteLegislatifRef": "PRJLANR5L15B1088",
      "numeroPartiePLF": "0",
      "organeExamen": "PO757134",
      "mentionSecondeDeliberation": "0"
    }
  },
  "numeroLong": "773",
  "etapeTexte": "1ère lecture (1ère assemblée saisie)",
  "triAmendement": "fiaaaaaaaaaaaaaaaaaaaaaaaaaaaaaaaaaaaaaaaaaaaaaaaabax",
  "cardinaliteAmdtMultiples": "1",
  "etat": "Discuté",
  "signataires": {
    "auteur": {
      "typeAuteur": "Depute",
      "acteurRef": "PA334149",
      "groupePolitiqueRef": "PO730934"
    },
    "cosignatairesRefs": [
      "PA856",
      "PA267204",
      "PA266797",
      "PA643089",
      "PA2155",
      "PA718780",
      "PA720210",
      "PA267378",
      "PA712015",
      "PA719318",
      "PA718784",
      "PA346054",
      "PA334149",
      "PA721968",
      "PA721474"
    ],
    "texteAffichable": "M.&#160;Fasquelle,  M.&#160;Sermier, M.&#160;Vialay, Mme&#160;Beauvais, M.&#160;Gosselin, M.&#160;Menuel, Mme&#160;Levy, M.&#160;Dive, Mme&#160;Anthoine, M.&#160;Pauget, Mme&#160;Trastour-Isnart, M.&#160;Thi&#233;riot, M.&#160;Viry, M.&#160;Cherpion et M.&#160;Emmanuel&#160;Maquet"
  },
  "pointeurFragmentTexte": {
    "division": {
      "titre": "Article 40",
      "articleDesignationCourte": "APRÈS ART. 40",
      "type": "ARTICLE",
      "avantAApres": "Apres",
      "divisionRattachee": "APRÈS L'ARTICLE 40, insérer l'article suivant:",
      "articleAdditionnel": "1",
      "urlDivisionTexteVise": "/15/textes/1088.asp#D_Article_40"
    }
  },
  "corps": {
    "dispositif": "<p style=\"text-align: justify;\">Apr&#232;s l&#8217;unique alin&#233;a de l&#8217;article&#160;1358 du code civil, il est ins&#233;r&#233; un alin&#233;a ainsi r&#233;dig&#233;&#160;:</p><p style=\"text-align: justify;\">&#171;&#160;Lorsqu&#8217;il est &#233;lectronique, le moyen consiste notamment en l&#8217;usage d&#8217;un dispositif &#233;lectronique d&#8217;enregistrement partag&#233;, de nature publique ou priv&#233;, d&#232;s lors que ledit dispositif &#233;lectronique d&#8217;enregistrement partag&#233; r&#233;pond &#224; des conditions d&#233;finies par d&#233;cret en Conseil d&#8217;&#201;tat.&#160;&#187;</p>",
    "exposeSommaire": "<p style=\"text-align: justify;\">&#192; l&#8217;heure o&#249;, dans le monde entier, la &#171;&#160;Blockchain&#160;&#187; est adopt&#233;e par les &#201;tats et les acteurs priv&#233;s comme mode de preuve de l&#8217;existence et de la datation des &#233;l&#233;ments qui s&#8217;y trouvent enregistr&#233;s, la France, pionni&#232;re dans sa l&#233;gislation sous la d&#233;nomination de &#171;&#160;Dispositif &#201;lectronique d&#8217;Enregistrement Partag&#233;&#160;&#187;, doit, pour des motifs de s&#233;curit&#233; juridique, en favoriser sa r&#233;ception par ses acteurs &#233;conomiques comme ses juridictions.</p><p style=\"text-align: justify;\">Afin d&#8217;&#233;viter de fastidieuses, inutiles, longues et co&#251;teuses expertises judiciaires, lesquelles nuiraient &#224; la rentabilit&#233; &#233;conomique de ces registres num&#233;riques d&#8217;un genre nouveau, nous proposons l&#8217;adoption du pr&#233;sent article, ce qui constituerait un signal fort pour la communaut&#233; de ses utilisateurs et un facilitateur pour nos juridictions.</p><p style=\"text-align: justify;\">En particulier, elle facilite l&#8217;&#233;tablissement de la preuve de l&#8217;origine, de la date et de la nature des apports et contributions intellectuelles dans les processus d&#8217;innovation collaborative, pour lesquelles les enqu&#234;tes montrent que la crainte du vol ou du d&#233;tournement de la propri&#233;t&#233; intellectuelle constitue un frein majeur.</p><p style=\"text-align: justify;\">Les juridictions sont &#233;galement demanderesses de simplicit&#233; et de rapidit&#233; de traitement des contentieux &#224; venir, r&#233;pondant ainsi &#224; l&#8217;objectif de d&#233;sengorgement des services de la Justice, qui pourraient &#234;tre red&#233;ploy&#233;s sur des missions &#224; plus forte valeur ajout&#233;e.</p><p style=\"text-align: justify;\">Afin de s&#8217;assurer d&#8217;un contr&#244;le par l&#8217;&#201;tat des qualit&#233;s essentielles que devront pr&#233;senter les Dispositifs &#201;lectroniques d&#8217;Enregistrement Partag&#233; b&#233;n&#233;ficiaires de la pr&#233;somption de preuve ainsi &#233;dict&#233;e, un D&#233;cret en Conseil d&#8217;&#201;tat en fixera les contours et conditions.</p>"
  },
  "representations": [
    {
      "nom": "PDF",
      "typeMime": {
        "type": "application",
        "subType": "PDF"
      },
      "statutRepresentation": {
        "verbatim": true,
        "canonique": true,
        "officielle": true,
        "transcription": false,
        "enregistrement": false
      },
      "contenu": {
        "documentURI": "/15/amendements/1088/CSPACTE/773.pdf"
      }
    }
  ],
  "sort": {
    "dateSaisie": "2018-09-13T15:39:26.000+02:00",
    "sortEnSeance": "Rejeté"
  },
  "dateDepot": "2018-08-30T02:00:00.000+02:00",
  "dateDistribution": "2018-09-11T02:00:00.000+02:00",
  "article99": "0",
  "loiReference": {
    "codeLoi": "civil",
    "divisionCodeLoi": "1358"
  }
}