{
  "uid": "AMANR5L15SEA717460BTC1175P0D1N168",
  "identifiant": {
    "legislature": "15",
    "numero": "168",
    "numRect": "0",
    "saisine": {
      "texteLegislatifRef": "PRJLANR5L15BTC1175",
      "numeroPartiePLF": "0",
      "organeExamen": "PO717460",
      "mentionSecondeDeliberation": "0"
    }
  },
  "numeroLong": "168",
  "etapeTexte": "Nouvelle Lecture",
  "triAmendement": "kpaaaaaaaaaaaaaaaaaaaaaaaaaaaaaaaaaaaaaaaaaaaaaaaadi",
  "cardinaliteAmdtMultiples": "1",
  "etat": "Discuté",
  "signataires": {
    "auteur": {
      "typeAuteur": "Depute",
      "acteurRef": "PA333421",
      "groupePolitiqueRef": "PO744425"
    },
    "cosignatairesRefs": [
      "PA720996",
      "PA333421",
      "PA608292",
      "PA266788",
      "PA268019",
      "PA720696",
      "PA721486",
      "PA719806",
      "PA336175"
    ],
    "texteAffichable": "M.&#160;Pancher,  Mme&#160;Auconie, M.&#160;Naegelen, M.&#160;Lagarde, M.&#160;Morel-&#192;-L&apos;Huissier, Mme&#160;Pinel, Mme&#160;Dubi&#233;, Mme&#160;Descamps et M.&#160;El Guerrab"
  },
  "pointeurFragmentTexte": {
    "division": {
      "titre": "Article 14",
      "articleDesignationCourte": "ART. 14",
      "type": "ARTICLE",
      "avantAApres": "A",
      "divisionRattachee": "ARTICLE 14",
      "urlDivisionTexteVise": "/15/textes/1175.asp#D_Article_14"
    }
  },
  "corps": {
    "dispositif": "<p>Supprimer cet article.</p>",
    "exposeSommaire": "<p style=\"text-align: justify;\">Cet amendement vise &#224; supprimer la cr&#233;ation de charges nouvelles par l&#8217;interdiction des rabais, ristournes et remises lors de l&#8217;achat des produits phytopharmaceutiques et des biocides.</p>"
  },
  "representations": [
    {
      "nom": "PDF",
      "typeMime": {
        "type": "application",
        "subType": "PDF"
      },
      "statutRepresentation": {
        "verbatim": true,
        "canonique": true,
        "officielle": true,
        "transcription": false,
        "enregistrement": false
      },
      "contenu": {
        "documentURI": "/15/amendements/1175/AN/168.pdf"
      }
    }
  ],
  "seanceDiscussion": "RUANR5L15S2018IDS21237",
  "sort": {
    "dateSaisie": "2018-09-14T23:12:28.000+02:00",
    "sortEnSeance": "Rejeté"
  },
  "dateDepot": "2018-08-01T02:00:00.000+02:00",
  "dateDistribution": "2018-09-11T02:00:00.000+02:00",
  "article99": "0",
  "loiReference": {}
}