{
  "uid": "AMANR5L15SEA717460BTC1237P0D1N1983",
  "identifiant": {
    "legislature": "15",
    "numero": "1983",
    "numRect": "0",
    "saisine": {
      "texteLegislatifRef": "PRJLANR5L15BTC1237",
      "numeroPartiePLF": "0",
      "organeExamen": "PO717460",
      "mentionSecondeDeliberation": "0"
    }
  },
  "numeroLong": "1983",
  "etapeTexte": "1ère lecture (1ère assemblée saisie)",
  "triAmendement": "aboaaaaaaaaaaaaaaaaaaaaaaaaaaaaaaaaaaaaaaaaaaaaaaajhzzzzzzzzzzi",
  "cardinaliteAmdtMultiples": "1",
  "etat": "Discuté",
  "signataires": {
    "auteur": {
      "typeAuteur": "Depute",
      "acteurRef": "PA719608",
      "groupePolitiqueRef": "PO723569"
    },
    "cosignatairesRefs": [
      "PA719608"
    ],
    "texteAffichable": "Mme&#160;M&#233;nard"
  },
  "pointeurFragmentTexte": {
    "division": {
      "titre": "Article 4",
      "articleDesignationCourte": "ART. 4",
      "type": "ARTICLE",
      "avantAApres": "A",
      "divisionRattachee": "ARTICLE 4",
      "urlDivisionTexteVise": "/15/textes/1237.asp#D_Article_4"
    }
  },
  "corps": {
    "dispositif": "<p style=\"text-align: justify;\">Supprimer cet article.</p>",
    "exposeSommaire": "<p style=\"text-align: justify;\">Par ce dispositif, le gouvernement veut supprimer l&#8217;obligation de suivre le stage de pr&#233;paration &#224; l&#8217;installation (SPI).</p><p style=\"text-align: justify;\">Le gouvernement poursuit l&#8217;objectif, extr&#234;mement positif, que les cr&#233;ations d&#8217;entreprise soient les plus p&#233;rennes possible. Or, les entreprises sont les fondateurs ont suivi le SPI ont un taux de survie &#224; trois ans de 75&#160;%, contre seulement 50&#160;% pour ceux qui n&#8217;ont pas suivi ces stages.</p><p style=\"text-align: justify;\">Malgr&#233; leur imperfection, ces stages sont tout de m&#234;me efficaces et favorisent la long&#233;vit&#233; des entreprises. En en supprimant le caract&#232;re obligatoire, le taux de mortalit&#233; des entreprises sera plus &#233;lev&#233;.</p><p style=\"text-align: justify;\">Cette suppression ne me para&#238;t donc pas pertinente.</p>"
  },
  "representations": [
    {
      "nom": "PDF",
      "typeMime": {
        "type": "application",
        "subType": "PDF"
      },
      "statutRepresentation": {
        "verbatim": true,
        "canonique": true,
        "officielle": true,
        "transcription": false,
        "enregistrement": false
      },
      "contenu": {
        "documentURI": "/15/amendements/1237/AN/1983.pdf"
      }
    }
  ],
  "seanceDiscussion": "RUANR5L15S2018IDS21248",
  "sort": {
    "dateSaisie": "2018-09-27T00:25:12.000+02:00",
    "sortEnSeance": "Rejeté"
  },
  "dateDepot": "2018-09-21T02:00:00.000+02:00",
  "dateDistribution": "2018-09-24T02:00:00.000+02:00",
  "article99": "0",
  "loiReference": {}
}