{
  "uid": "AMANR5L15PO59051B0099P0D1N140",
  "identifiant": {
    "legislature": "15",
    "numero": "140",
    "numRect": "0",
    "saisine": {
      "texteLegislatifRef": "PRJLANR5L15B0099",
      "numeroPartiePLF": "0",
      "organeExamen": "PO59051",
      "mentionSecondeDeliberation": "0"
    }
  },
  "numeroLong": "CL140",
  "etapeTexte": "1ère lecture (2ème assemblée saisie)",
  "triAmendement": "f",
  "cardinaliteAmdtMultiples": "1",
  "etat": "Discuté",
  "signataires": {
    "auteur": {
      "typeAuteur": "Gouvernement"
    },
    "texteAffichable": "le Gouvernement"
  },
  "pointeurFragmentTexte": {
    "division": {
      "titre": "Article 2",
      "articleDesignationCourte": "ART. 2",
      "type": "ARTICLE",
      "avantAApres": "A",
      "divisionRattachee": "ARTICLE 2",
      "urlDivisionTexteVise": "/15/textes/0099.asp#D_Article_2"
    },
    "alinea": {
      "numero": "6"
    }
  },
  "corps": {
    "dispositif": "<p>Substituer aux alin&#233;as 6 &#224; 8 les deux alin&#233;as suivants&#160;:</p><p>&#171;&#160;Lorsque l&#8217;administration fiscale estime que le d&#233;put&#233; ne satisfait pas aux obligations mentionn&#233;es au premier alin&#233;a et que cette appr&#233;ciation n&#8217;est pas contest&#233;e par le d&#233;put&#233;, ou lorsqu&#8217;il a &#233;t&#233; statu&#233; par une d&#233;cision juridictionnelle devenue irr&#233;vocable confirmant tout ou partie des manquements, le d&#233;put&#233; met sans d&#233;lai sa situation fiscale en conformit&#233; avec les dispositions applicables. L&#8217;administration fiscale en informe le bureau de l&#8217;Assembl&#233;e nationale.</p><p>&#171;&#160;En l&#8217;absence de mise en conformit&#233;, le bureau de l&#8217;Assembl&#233;e nationale saisit le Conseil constitutionnel qui peut constater, en fonction de la gravit&#233; du manquement aux obligations mentionn&#233;es au premier alin&#233;a, l&#8217;in&#233;ligibilit&#233; du d&#233;put&#233; et le d&#233;clarer d&#233;missionnaire d&#8217;office par la m&#234;me d&#233;cision.&#160;&#187;</p>",
    "exposeSommaire": "<p style=\"text-align: justify;\"><br />Cet amendement vise &#224; r&#233;tablir les dispositions propos&#233;es par le Gouvernement qui pr&#233;voient, pour la clart&#233; et l&#8217;efficacit&#233; du dispositif, que chaque situation fiscale, conforme ou non, donne lieu &#224; la production d&#8217;une information : il s&#8217;agit alors d&#8217;attester que l&#8217;examen de la situation fiscale de tous les &#233;lus a bien &#233;t&#233; fait. A cette fin, l&#8217;organe charg&#233; de la d&#233;ontologie parlementaire serait syst&#233;matiquement inform&#233; des conclusions de l&#8217;administration fiscale apr&#232;s examen du dossier de chaque &#233;lu.</p><p style=\"text-align: justify;\">Par ailleurs, la mise en conformit&#233; des &#233;lus avec leurs obligations fiscales ne peut se concevoir que dans le cadre du droit commun.<br />En cas de divergence de vue avec l&#8217;administration fiscale, le parlementaire conserve en particulier la possibilit&#233; de faire valoir son analyse, en tant que contribuable, avec toutes les garanties attach&#233;es &#224; la proc&#233;dure fiscale.</p><p style=\"text-align: justify;\">En cas de manquement de l&#8217;&#233;lu &#224; ses obligations fiscales, le bureau de l'assembl&#233;e sera inform&#233; par l&#8217;administration fiscale et il sera tenu de saisir le Conseil constitutionnel sans exercer de pouvoir d&#8217;appr&#233;ciation.&#160;</p><p style=\"text-align: justify;\">Le Conseil constitutionnel v&#233;rifiera les faits, entendra la d&#233;fense de l&#8217;&#233;lu et exercera un contr&#244;le de proportionnalit&#233; pour d&#233;terminer s&#8217;il y a lieu de prononcer la d&#233;mission d&#8217;office et l'in&#233;ligibilit&#233;.&#160;</p><p style=\"text-align: justify;\">Le pr&#233;sent amendement du Gouvernement maintient par ailleurs la possibilit&#233; pour le juge de compl&#233;ter le prononc&#233; de la fin de mandat par une in&#233;ligibilit&#233; de trois ans maximum, comme pr&#233;vu dans le texte adopt&#233; par le S&#233;nat.</p>"
  },
  "representations": [
    {
      "nom": "PDF",
      "typeMime": {
        "type": "application",
        "subType": "PDF"
      },
      "statutRepresentation": {
        "verbatim": true,
        "canonique": true,
        "officielle": true,
        "transcription": false,
        "enregistrement": false
      },
      "contenu": {
        "documentURI": "/15/amendements/0099/CION_LOIS/CL140.pdf"
      }
    }
  ],
  "sort": {
    "dateSaisie": "2017-07-20T00:33:02.000+02:00",
    "sortEnSeance": "Adopté"
  },
  "dateDepot": "2017-07-18T02:00:00.000+02:00",
  "dateDistribution": "2017-07-19T02:00:00.000+02:00",
  "article99": "0",
  "loiReference": {}
}