{
  "uid": "AMANR5L15PO59048B2272P1D1N533",
  "identifiant": {
    "legislature": "15",
    "numero": "533",
    "numRect": "0",
    "saisine": {
      "texteLegislatifRef": "PRJLANR5L15B2272",
      "numeroPartiePLF": "1",
      "organeExamen": "PO59048",
      "mentionSecondeDeliberation": "0"
    }
  },
  "numeroLong": "I-CF533",
  "etapeTexte": "1ère lecture (1ère assemblée saisie)",
  "triAmendement": "aoaaaaaaaaaaaaaaaaaaaaaaaaaaaaaaaaaaaaaaaaaaaaaaaaaaao",
  "cardinaliteAmdtMultiples": "1",
  "etat": "Discuté",
  "signataires": {
    "auteur": {
      "typeAuteur": "Depute",
      "acteurRef": "PA721410",
      "groupePolitiqueRef": "PO730934"
    },
    "cosignatairesRefs": [
      "PA722390",
      "PA642847",
      "PA718884",
      "PA719318",
      "PA266793",
      "PA340853",
      "PA721410",
      "PA267260",
      "PA605036",
      "PA721054",
      "PA266797",
      "PA608016",
      "PA336316",
      "PA267429"
    ],
    "texteAffichable": "Mme&#160;Bonnivard,  M.&#160;Bony, M.&#160;Leclerc, Mme&#160;Louwagie, Mme&#160;Corneloup, M.&#160;Abad, M.&#160;Cinieri, M.&#160;Bazin, M.&#160;Bouchet, Mme&#160;Anthoine, Mme&#160;Bazin-Malgras, M.&#160;Lorion, M.&#160;Gosselin et Mme&#160;Poletti"
  },
  "pointeurFragmentTexte": {
    "division": {
      "titre": "Article 2",
      "articleDesignationCourte": "APRÈS ART. 2",
      "type": "ARTICLE",
      "avantAApres": "Apres",
      "divisionRattachee": "APRÈS L'ARTICLE 2, insérer l'article suivant:",
      "articleAdditionnel": "1",
      "urlDivisionTexteVise": "/15/textes/2272A.asp#D_Article_2"
    }
  },
  "corps": {
    "dispositif": "<p style=\"text-align: justify;\">Au 2 de l&#8217;article&#160;4 B du code g&#233;n&#233;ral des imp&#244;ts, apr&#232;s les mots&#160;: &#171;&#160;l&#8217;&#201;tat&#160;&#187;, sont ins&#233;r&#233;s les mots&#160;: &#171;&#160;et les agents territoriaux&#160;&#187;.</p>",
    "exposeSommaire": "<p style=\"text-align: justify;\">Depuis une vingtaine d&#8217;ann&#233;es, les grandes collectivit&#233;s et notamment les r&#233;gions ont renforc&#233; leur pr&#233;sence &#224; Bruxelles par le biais de bureaux de repr&#233;sentation. Il s&#8217;agit en particulier des r&#233;gions Auvergne-Rh&#244;ne-Alpes, Bourgogne-Franche-Comt&#233;, Centre-Val de Loire, Corse, Guadeloupe, Guyane, Hauts-de-France, Normandie, Nouvelle-Aquitaine, Provence-Alpes-C&#244;te d&#8217;Azur. Au total, les collaborateurs des r&#233;gions pr&#233;cit&#233;es sont une quarantaine &#224; travailler en permanence &#224; Bruxelles.</p><p style=\"text-align: justify;\">Or, sur le plan fiscal, il existe une importante disparit&#233; entre le statut des agents territoriaux et celui des agents de l&#8217;&#201;tat en poste &#224; l&#8217;&#233;tranger. Ainsi, alors que l&#8217;article&#160;4 B 2. du code g&#233;n&#233;ral des imp&#244;ts fixe le domicile fiscal des agents de la fonction publique d&#8217;&#201;tat travaillant &#224; l&#8217;&#233;tranger en France, le statut des personnels de la fonction publique territoriale souffre d&#8217;un vide juridique sur cette question qui a pour effet de les p&#233;naliser fiscalement au titre de l&#8217;imp&#244;t sur le revenu. Le domicile fiscal de ces derniers est en effet consid&#233;r&#233; comme &#233;tant &#224; l&#8217;&#233;tranger.</p><p style=\"text-align: justify;\">En vertu du principe de parit&#233; entre les fonctions publiques et afin de corriger cette iniquit&#233; de traitement, le pr&#233;sent amendement proc&#232;de &#224; un alignement du domicile fiscal des agents territoriaux travaillant hors du territoire national sur celui des agents de l&#8217;&#201;tat.&#160;</p><p style=\"text-align: justify;\">Cette &#233;volution l&#233;gislative s&#8217;av&#232;re d&#8217;autant plus n&#233;cessaire qu&#8217;au 1<sup>er</sup> janvier 2020, &#224; situation inchang&#233;e, des taux forfaitaires de 20&#160;% et 30&#160;%, con&#231;us dans une optique de lutte contre l&#8217;&#233;vasion et l&#8217;expatriation fiscales, s&#8217;appliqueront aux non r&#233;sidents.</p>"
  },
  "representations": [
    {
      "nom": "PDF",
      "typeMime": {
        "type": "application",
        "subType": "PDF"
      },
      "statutRepresentation": {
        "verbatim": true,
        "canonique": true,
        "officielle": true,
        "transcription": false,
        "enregistrement": false
      },
      "contenu": {
        "documentURI": "/15/amendements/2272A/CION_FIN/CF533.pdf"
      }
    }
  ],
  "sort": {
    "dateSaisie": "2019-10-08T19:25:00.000+02:00",
    "sortEnSeance": "Adopté"
  },
  "dateDepot": "2019-10-03T02:00:00.000+02:00",
  "dateDistribution": "2019-10-08T02:00:00.000+02:00",
  "article99": "0",
  "loiReference": {
    "codeLoi": "CGI",
    "divisionCodeLoi": "4B"
  }
}