{
  "uid": "AMANR5L15PO59051B0714P0D1N535",
  "identifiant": {
    "legislature": "15",
    "numero": "535",
    "numRect": "0",
    "saisine": {
      "texteLegislatifRef": "PRJLANR5L15B0714",
      "numeroPartiePLF": "0",
      "organeExamen": "PO59051",
      "mentionSecondeDeliberation": "0"
    }
  },
  "numeroLong": "CL535",
  "etapeTexte": "1ère lecture (1ère assemblée saisie)",
  "triAmendement": "li",
  "cardinaliteAmdtMultiples": "1",
  "etat": "Discuté",
  "signataires": {
    "auteur": {
      "typeAuteur": "Depute",
      "acteurRef": "PA721960",
      "groupePolitiqueRef": "PO730958"
    },
    "cosignatairesRefs": [
      "PA721226",
      "PA721210",
      "PA718868",
      "PA718860",
      "PA720430",
      "PA720846",
      "PA588884",
      "PA720422",
      "PA722142",
      "PA721202",
      "PA720286",
      "PA2150",
      "PA721960",
      "PA720892",
      "PA719578",
      "PA721062",
      "PA719676"
    ],
    "texteAffichable": "Mme&#160;Obono,  Mme&#160;Autain, M.&#160;Bernalicis, M.&#160;Coquerel, M.&#160;Corbi&#232;re, Mme&#160;Fiat, M.&#160;Lachaud, M.&#160;Larive, M.&#160;M&#233;lenchon, Mme&#160;Panot, M.&#160;Prud&apos;homme, M.&#160;Quatennens, M.&#160;Ratenon, Mme&#160;Ressiguier, Mme&#160;Rubin, M.&#160;Ruffin et Mme&#160;Taurine"
  },
  "pointeurFragmentTexte": {
    "division": {
      "titre": "Article 23",
      "articleDesignationCourte": "ART. 23",
      "type": "ARTICLE",
      "avantAApres": "A",
      "divisionRattachee": "ARTICLE 23",
      "urlDivisionTexteVise": "/15/textes/0714.asp#D_Article_23"
    },
    "alinea": {
      "avantAApres": "A",
      "numero": "2",
      "alineaDesignation": "Alinéa 2"
    }
  },
  "corps": {
    "dispositif": "<p style=\"border: none; padding: 0cm; text-align: justify;\">I. - &#192; la seconde phrase de l&#8217;alin&#233;a&#160;2, apr&#232;s le mot&#160;:</p><p style=\"border: none; padding: 0cm; text-align: justify;\">&#171;&#160;nouvelles&#160;&#187;,&#160;</p><p style=\"border: none; padding: 0cm; text-align: justify;\">ins&#233;rer les mots&#160;:</p><p style=\"border: none; padding: 0cm; text-align: justify;\">&#171;&#160;de toute nature&#160;&#187;.</p><p style=\"border: none; padding: 0cm; text-align: justify;\">II. - En cons&#233;quence, &#224; la m&#234;me phrase l'alin&#233;a 2, substituer aux mots&#160;:</p><p style=\"border: none; padding: 0cm; text-align: justify;\">&#171;&#160;de ce d&#233;lai&#160;&#187;,&#160;</p><p style=\"border: none; padding: 0cm; text-align: justify;\">les mots&#160;:</p><p style=\"border: none; padding: 0cm; text-align: justify;\">&#171;&#160;d&#8217;un d&#233;lai de&#160;quatre mois&#160;&#187;.</p>",
    "exposeSommaire": "<p style=\"border: none; padding: 0cm; text-align: justify;\">Par cet amendement de repli, nous proposons de garantir le &#171;&#160;droit &#224; saisine&#160;&#187; de l&#8217;administration par tout administr&#233;, qui a notamment &#233;t&#233; consacr&#233; au livre Ier du code des relations entre le public et l&#8217;administration. En l&#8217;esp&#232;ce, nous proposons de supprimer la condition de &#171;&#160;d&#233;lai&#160;&#187; (qui semble par ailleurs eu &#233;gard &#224; la r&#233;daction tr&#232;s impr&#233;cise du projet de loi relever du niveau r&#233;glementaire, et donc n&#8217;&#234;tre pas pr&#233;cis&#233;e dans l&#8217;article m&#234;me &#8230;).</p><p style=\"border: none; padding: 0cm; text-align: justify;\">Ainsi l&#8217;article ne propose en outre pas de d&#233;lai sp&#233;cifique pour restreindre ce &#171;&#160;droit &#224; saisine&#160;&#187;, est ce que ce droit est restreint dans un d&#233;lai de 5 jours, 10 jours, 1 mois, 6 mois, deux ans, durant l&#8217;examen, apr&#232;s une d&#233;cision de l&#8217;OFPRA ou de la CNDA&#160;? Ces manques traduisent les travers &#224; tenter de restreindre le droit &#224; saisine de l&#8217;administration.</p><p style=\"border: none; padding: 0cm; text-align: justify;\">Pour ce faire, nous proposons de consacrer l&#8217;absence de d&#233;lai contraignant, et de rappeler que les &#171;&#160;circonstances nouvelles&#160;&#187; ne doivent pas s&#8217;interpr&#233;ter de mani&#232;re restrictive, mais bien &#234;tre de toute nature, afin que des interpr&#233;tations trop strictes n&#8217;emp&#234;chent &#224; des personnes qui y ont droit de pouvoir saisir l&#8217;administration pour obtenir titre de s&#233;jour sur un autre fondement que celui de l&#8217;asile.</p><p style=\"text-align: justify;\">Par cet amendement de bon sens nous garantissons ainsi aux personnes la possibilit&#233; de pouvoir donc toujours demander la reconnaissance de leur droit au s&#233;jour aupr&#232;s de l&#8217;administration.</p>"
  },
  "representations": [
    {
      "nom": "PDF",
      "typeMime": {
        "type": "application",
        "subType": "PDF"
      },
      "statutRepresentation": {
        "verbatim": true,
        "canonique": true,
        "officielle": true,
        "transcription": false,
        "enregistrement": false
      },
      "contenu": {
        "documentURI": "/15/amendements/0714/CION_LOIS/CL535.pdf"
      }
    }
  ],
  "sort": {
    "dateSaisie": "2018-04-06T18:00:19.000+02:00",
    "sortEnSeance": "Rejeté"
  },
  "dateDepot": "2018-03-30T02:00:00.000+02:00",
  "dateDistribution": "2018-04-02T02:00:00.000+02:00",
  "article99": "0",
  "loiReference": {
    "codeLoi": "4.1"
  }
}