{
  "uid": "AMANR5L15PO757134B1088P0D1N1753",
  "identifiant": {
    "legislature": "15",
    "numero": "1753",
    "numRect": "0",
    "saisine": {
      "texteLegislatifRef": "PRJLANR5L15B1088",
      "numeroPartiePLF": "0",
      "organeExamen": "PO757134",
      "mentionSecondeDeliberation": "0"
    }
  },
  "numeroLong": "1753",
  "etapeTexte": "1ère lecture (1ère assemblée saisie)",
  "triAmendement": "beaaaaaaaaaaaaaaaaaaaaaaaaaaaaaaaaaaaaaaaaaaaaaaaabak",
  "cardinaliteAmdtMultiples": "1",
  "etat": "Discuté",
  "signataires": {
    "auteur": {
      "typeAuteur": "Depute",
      "acteurRef": "PA721764",
      "groupePolitiqueRef": "PO730964"
    },
    "cosignatairesRefs": [
      "PA642724",
      "PA720190",
      "PA721616",
      "PA721434",
      "PA721004",
      "PA720512",
      "PA719830",
      "PA607155",
      "PA718768",
      "PA719740",
      "PA719710",
      "PA722300",
      "PA719024",
      "PA721624",
      "PA718682",
      "PA720242",
      "PA719960",
      "PA719652",
      "PA718794",
      "PA721764",
      "PA721328",
      "PA722228",
      "PA719338",
      "PA722038",
      "PA720576",
      "PA717379",
      "PA720414",
      "PA722000",
      "PA267336",
      "PA720590",
      "PA720108",
      "PA722046",
      "PA720908",
      "PA719890",
      "PA719790",
      "PA721372",
      "PA721158",
      "PA719162",
      "PA718962",
      "PA722366",
      "PA719850",
      "PA719092",
      "PA720154",
      "PA721876",
      "PA719032",
      "PA719326",
      "PA721888",
      "PA719100",
      "PA720298",
      "PA719756",
      "PA720900",
      "PA721542",
      "PA719728",
      "PA719130",
      "PA606639",
      "PA722094",
      "PA718876",
      "PA719550",
      "PA719186",
      "PA677483",
      "PA721150",
      "PA720378",
      "PA719118",
      "PA719814",
      "PA720830",
      "PA718674",
      "PA721352",
      "PA719440",
      "PA719592",
      "PA721916",
      "PA720878",
      "PA720916",
      "PA719364",
      "PA722252",
      "PA721776",
      "PA719154",
      "PA720560",
      "PA720854",
      "PA720022",
      "PA722170",
      "PA721946",
      "PA719480",
      "PA642695",
      "PA719972"
    ],
    "texteAffichable": "Mme&#160;Gregoire,  Mme&#160;Melchior, Mme&#160;O&apos;Petit, M.&#160;Maillard, M.&#160;D&#233;moulin, Mme&#160;Hennion, Mme&#160;Lardet, M.&#160;Le Bohec, M.&#160;Giraud, Mme&#160;Abba, M.&#160;Potterie, Mme&#160;Moutchou, Mme&#160;Brugnera, Mme&#160;Pouzyreff, M.&#160;Anglade, Mme&#160;Lazaar, M.&#160;Zulesi, M.&#160;Holroyd, M.&#160;Perrot, M.&#160;Morenas, M.&#160;Gaillard, M.&#160;Baich&#232;re, M.&#160;Mazars, Mme&#160;Colboc, M.&#160;Bothorel, Mme&#160;Brulebois, M.&#160;Fugit, Mme&#160;Oppelt, M.&#160;Cellier, M.&#160;Besson-Moreau, Mme&#160;Beaudouin-Hubiere, M.&#160;Damien&#160;Adam, M.&#160;Lioger, M.&#160;Sorre, Mme&#160;Khedher, Mme&#160;Berg&#233;, Mme&#160;Tanguy, Mme&#160;Thomas, Mme&#160;Cariou, Mme&#160;Motin, M.&#160;Trompille, M.&#160;Blanchet, M.&#160;Cormier-Bouligeon, Mme&#160;Jacqueline&#160;Dubois, M.&#160;Buchou, Mme&#160;Dominique&#160;David, Mme&#160;Hammerer, M.&#160;Colas-Roy, Mme&#160;Dubr&#233;-Chirat, Mme&#160;H&#233;rin, M.&#160;Saint-Martin, Mme&#160;Givernet, Mme&#160;Tuffnell, M.&#160;Marilossian, Mme&#160;Sarles, Mme&#160;Rilhac, Mme&#160;Avia, Mme&#160;Verdier-Jouclas, M.&#160;Lauzzana, M.&#160;Pietraszewski, Mme&#160;Gipson, Mme&#160;Lakrafi, M.&#160;Martin, Mme&#160;Rixain, M.&#160;Leclabart, M.&#160;Vignal, Mme&#160;Valetta Ardisson, M.&#160;Bouyx, M.&#160;Ardouin, M.&#160;Pichereau, M.&#160;Test&#233;, M.&#160;Chalumeau, Mme&#160;Cazarian, M.&#160;Simian, M.&#160;Rupin, M.&#160;Daniel, M.&#160;Bois, Mme&#160;Goulet, M.&#160;Raphan, Mme&#160;Faure-Muntian, Mme&#160;Michel, Mme&#160;Khattabi, M.&#160;Barbier et Mme&#160;Cloarec"
  },
  "pointeurFragmentTexte": {
    "division": {
      "titre": "Article 15",
      "articleDesignationCourte": "APRÈS ART. 15",
      "type": "ARTICLE",
      "avantAApres": "Apres",
      "divisionRattachee": "APRÈS L'ARTICLE 15, insérer l'article suivant:",
      "articleAdditionnel": "1",
      "urlDivisionTexteVise": "/15/textes/1088.asp#D_Article_15"
    }
  },
  "corps": {
    "dispositif": "<p style=\"text-align: justify;\">Apr&#232;s l&#8217;article L.&#160;626&#8209;12&#8209;1 du code de commerce, il est ins&#233;r&#233; un article L.&#160;626&#8209;12&#8209;1 ainsi r&#233;dig&#233;&#160;:</p><p style=\"text-align: justify;\">&#171;&#160;<i>Art.&#160;L.&#160;626&#8209;12&#8209;1.</i>&#160;&#8211;&#160;En cas de respect de ses engagements par le d&#233;biteur pendant un d&#233;lai de deux ans &#224; compter du jugement arr&#234;tant le plan, les mentions au registre du commerce et des soci&#233;t&#233;s relatives au plan en cours d&#8217;ex&#233;cution sont d&#8217;office supprim&#233;es&#160;&#187;.</p>",
    "exposeSommaire": "<p style=\"text-align: justify;\">Les d&#233;cisions importantes prononc&#233;es durant les proc&#233;dures de sauvegarde, redressement ou liquidation judiciaires par le tribunal (ouverture, prolongation de la p&#233;riode d&#8217;observation, cessions, arr&#234;t&#233; et modification des plans de sauvegarde ou de redressement, r&#233;solution du plan, modification de la date de cessation des paiements, cl&#244;ture, faillite personnelle&#8230;) sont mentionn&#233;es d&#8217;office par le greffe au registre du commerce et des soci&#233;t&#233;s (si le d&#233;biteur en rel&#232;ve). Tout tiers peut en prendre connaissance sur l&#8217;extrait K-Bis de l&#8217;entreprise.</p><p style=\"text-align: justify;\">Pour &#233;viter que l&#8217;entreprise ne demeure marqu&#233;e par les effets d&#8217;une proc&#233;dure collective qui s&#8217;est achev&#233;e par la r&#233;solution des difficult&#233;s qui avaient justifi&#233; l&#8217;ouverture de la proc&#233;dure, ces mentions sont radi&#233;es d&#8217;office lorsqu&#8217;il est mis fin &#224; la sauvegarde par disparition des difficult&#233;s ou, au redressement judiciaire, en raison du d&#233;sint&#233;ressement des cr&#233;anciers ou encore, en cas de constat de l&#8217;ach&#232;vement de l&#8217;ex&#233;cution du plan.</p><p style=\"text-align: justify;\">A &#233;t&#233; consacr&#233; en 2011 un&#160;droit automatique &#224; l&#8217;oubli en faveur du d&#233;biteur ayant montr&#233; sa capacit&#233; &#224; se r&#233;organiser au moyen d&#8217;un plan. Le dispositif ant&#233;rieur a &#233;t&#233; compl&#233;t&#233; en pr&#233;voyant la radiation automatique de ces mentions lorsque le plan est en cours depuis trois ans pour un plan de sauvegarde ou cinq ans pour un plan de redressement. Malgr&#233; ces mesures prises progressivement, ces mentions restent de nature &#224; freiner l&#8217;acc&#232;s au cr&#233;dit et &#224; la possibilit&#233; pour les entreprises, de r&#233;pondre aux appels d&#8217;offres, ou encore de retrouver des relations normales avec leurs interlocuteurs. </p><p style=\"text-align: justify;\">Pour favoriser v&#233;ritablement le rebond de ces entrepreneurs, il est donc propos&#233; d&#8217;harmoniser la dur&#233;e d&#8217;inscription sur le Kbis de ces informations et de la r&#233;duire &#224; deux ans, pour l&#8217;ensemble des plans (sauvegarde et redressement).</p>"
  },
  "representations": [
    {
      "nom": "PDF",
      "typeMime": {
        "type": "application",
        "subType": "PDF"
      },
      "statutRepresentation": {
        "verbatim": true,
        "canonique": true,
        "officielle": true,
        "transcription": false,
        "enregistrement": false
      },
      "contenu": {
        "documentURI": "/15/amendements/1088/CSPACTE/1753.pdf"
      }
    }
  ],
  "sort": {
    "dateSaisie": "2018-09-07T22:32:54.000+02:00",
    "sortEnSeance": "Retiré"
  },
  "dateDepot": "2018-09-03T02:00:00.000+02:00",
  "dateDistribution": "2018-09-06T02:00:00.000+02:00",
  "article99": "0",
  "loiReference": {
    "codeLoi": "commerce",
    "divisionCodeLoi": "L626-12-1"
  }
}