{
  "uid": "AMANR5L15PO419610B2272P2D1N11",
  "identifiant": {
    "legislature": "15",
    "numero": "11",
    "numRect": "0",
    "saisine": {
      "texteLegislatifRef": "PRJLANR5L15B2272",
      "numeroPartiePLF": "2",
      "organeExamen": "PO419610",
      "mentionSecondeDeliberation": "0"
    }
  },
  "numeroLong": "II-CE11",
  "etapeTexte": "1ère lecture (1ère assemblée saisie)",
  "triAmendement": "abeaaaaaaaaaaaaaaaaaaaaaaaaaaaaaaaaaaaaaaaaaaaaaaabi",
  "cardinaliteAmdtMultiples": "1",
  "etat": "Discuté",
  "signataires": {
    "auteur": {
      "typeAuteur": "Depute",
      "acteurRef": "PA607553",
      "groupePolitiqueRef": "PO758835"
    },
    "cosignatairesRefs": [
      "PA1008",
      "PA1809",
      "PA609590",
      "PA333285",
      "PA608011",
      "PA267233",
      "PA605069",
      "PA642764",
      "PA609332",
      "PA607553",
      "PA429893",
      "PA1592",
      "PA335532",
      "PA332614",
      "PA340357",
      "PA720988",
      "PA342415",
      "PA608741",
      "PA608695",
      "PA610681",
      "PA508",
      "PA340343",
      "PA333818",
      "PA337483",
      "PA643145",
      "PA719930",
      "PA1198",
      "PA608172",
      "PA335054"
    ],
    "texteAffichable": "M.&#160;Potier,  Mme&#160;Battistel, M.&#160;Letchimy, Mme&#160;Bi&#233;mouret, M.&#160;Aviragnet, Mme&#160;Bareigts, M.&#160;Bouillon, M.&#160;Jean-Louis&#160;Bricout, M.&#160;Carvounas, M.&#160;Alain&#160;David, Mme&#160;Laurence&#160;Dumont, M.&#160;Faure, M.&#160;Garot, M.&#160;David&#160;Habib, M.&#160;Hutin, M.&#160;Juanico, Mme&#160;Karamanli, M.&#160;J&#233;r&#244;me&#160;Lambert, Mme&#160;Manin, Mme&#160;Pau-Langevin, Mme&#160;Pires Beaune, M.&#160;Pueyo, Mme&#160;Rabault, M.&#160;Saulignac, Mme&#160;Tolmont, Mme&#160;Untermaier, Mme&#160;Vainqueur-Christophe, M.&#160;Vallaud, Mme&#160;Victory et les membres du groupe Socialistes et apparent&#233;s"
  },
  "pointeurFragmentTexte": {
    "missionVisee": {
      "idMissionAN": "801",
      "libelleMission": "Agriculture, alimentation, forêt et affaires rurales",
      "codeMissionPLF": "B",
      "libelleMissionPLF": "Répartition, par mission et programme, des crédits du budget général"
    },
    "division": {
      "titre": "ÉTAT B",
      "articleDesignationCourte": "ART. 38",
      "type": "ANNEXE",
      "avantAApres": "A",
      "divisionRattachee": "ARTICLE 38",
      "urlDivisionTexteVise": "/15/textes/2272C.asp#D_ETAT_B"
    }
  },
  "corps": {
    "exposeSommaire": "<p style=\"text-align: justify;\">Cet amendement du groupe Socialistes et apparent&#233;s ponctionne 450 000&#160;euros du programme 149 en ses actions n&#176;&#160;21 &#171;&#160;adaptation des fili&#232;res &#224; l&#8217;&#233;volution des march&#233;&#160;&#187; &#224; hauteur de 150 000&#160;euros, n&#176;&#160;24 &#171;&#160;gestion &#233;quilibr&#233;e et durable des territoires &#224; hauteur de 150 000&#160;euros et n&#176;&#160;27 &#171;&#160;moyens de mise en &#339;uvre des politiques&#160;&#187; &#224; hauteur de 150 000&#160;euros afin d&#8217;abonder &#224; la m&#234;me hauteur l&#8217;action n&#176;&#160;1 &#171;&#160;pr&#233;vention et gestion des risques inh&#233;rents &#224; la production v&#233;g&#233;tale&#160;&#187; du programme 206 en direction de l&#8217;exp&#233;rimentation des fermes DEPHY.</p><p style=\"text-align: justify;\">Consid&#233;rant l&#8217;objectif du Gouvernement de multiplier par 10 d&#8217;ici 2021 des fermes exp&#233;rimentales DEPHY et au vu des d&#233;fis auxquels sont confront&#233;s nos mod&#232;les agricoles, il convient d&#8217;aller plus et de mobiliser rapidement et sensiblement le secteur afin de changer d&#8217;&#233;chelle en mati&#232;re d&#8217;agro&#233;cologie. Aussi cet amendement - sur lequel il serait &#233;videmment souhaitable de lever le gage - vise &#224; augmenter le budget de l&#8217;action 01 du programme budg&#233;taire dont l&#8217;objectif est de promouvoir les m&#233;thodes alternatives &#224; l&#8217;utilisation de produits phytosanitaires.</p>",
    "cartoucheDelaiDepotDepasse": "Sous réserve de son traitement par les services de l'Assemblée nationale et de sa recevabilité",
    "dispositifAmdtCredit": {
      "listeProgrammes": [
        {
          "libelle": "Compétitivité et durabilité de l'agriculture, de l'agroalimentaire, de la forêt, de la pêche et de l'aquaculture",
          "id": "59508",
          "AE": {
            "montantPositif": "0",
            "montantNegatif": "450000"
          },
          "CP": {
            "montantPositif": "0",
            "montantNegatif": "450000"
          },
          "action": "modification"
        },
        {
          "libelle": "Sécurité et qualité sanitaires de l'alimentation",
          "id": "59509",
          "AE": {
            "montantPositif": "450000",
            "montantNegatif": "0"
          },
          "CP": {
            "montantPositif": "450000",
            "montantNegatif": "0"
          },
          "action": "modification"
        },
        {
          "libelle": "Conduite et pilotage des politiques de l'agriculture",
          "id": "59510",
          "AE": {
            "montantPositif": "0",
            "montantNegatif": "0"
          },
          "CP": {
            "montantPositif": "0",
            "montantNegatif": "0"
          },
          "action": "modification"
        }
      ],
      "totalAE": {
        "montantPositif": "450000",
        "montantNegatif": "450000",
        "solde": "0"
      },
      "totalCP": {
        "montantPositif": "450000",
        "montantNegatif": "450000",
        "solde": "0"
      }
    }
  },
  "representations": [
    {
      "nom": "PDF",
      "typeMime": {
        "type": "application",
        "subType": "PDF"
      },
      "statutRepresentation": {
        "verbatim": true,
        "canonique": true,
        "officielle": true,
        "transcription": false,
        "enregistrement": false
      },
      "contenu": {
        "documentURI": "/15/amendements/2272C/CION-ECO/CE11.pdf"
      }
    }
  ],
  "sort": {
    "dateSaisie": "2019-10-16T11:26:27.000+02:00",
    "sortEnSeance": "Adopté"
  },
  "dateDepot": "2019-10-12T02:00:00.000+02:00",
  "dateDistribution": "2019-10-16T02:00:00.000+02:00",
  "article99": "0",
  "loiReference": {}
}