{
  "uid": "AMANR5L15SEA717460BTC1974P0D1N1864",
  "identifiant": {
    "legislature": "15",
    "numero": "1864",
    "numRect": "0",
    "saisine": {
      "texteLegislatifRef": "PRJLANR5L15BTC1974",
      "numeroPartiePLF": "0",
      "organeExamen": "PO717460",
      "mentionSecondeDeliberation": "0"
    }
  },
  "numeroLong": "1864",
  "etapeTexte": "1ère lecture (2ème assemblée saisie)",
  "triAmendement": "eboaaaaaaaaaaaaaaaaaaaaaaaaaaaaaaaaaaaaaaaaaaaaaaabadi",
  "cardinaliteAmdtMultiples": "1",
  "etat": "Discuté",
  "signataires": {
    "auteur": {
      "typeAuteur": "Depute",
      "acteurRef": "PA605518",
      "groupePolitiqueRef": "PO759900"
    },
    "cosignatairesRefs": [
      "PA605518"
    ],
    "texteAffichable": "M.&#160;Fran&#231;ois-Michel&#160;Lambert"
  },
  "pointeurFragmentTexte": {
    "division": {
      "titre": "Article 26 AA",
      "articleDesignationCourte": "ART. 26 AA",
      "type": "ARTICLE",
      "avantAApres": "A",
      "divisionRattachee": "ARTICLE 26 AA",
      "urlDivisionTexteVise": "/15/textes/1974.asp#D_Article_26_AA"
    },
    "alinea": {
      "numero": "3"
    }
  },
  "corps": {
    "dispositif": "<p>Substituer aux alin&#233;as 3 et 4 les trois alin&#233;as suivants&#160;:</p><p style=\"text-align: justify;\">&#171;&#160;1&#176; Une multiplication par cinq du nombre de voitures particuli&#232;res &#224; tr&#232;s faibles &#233;missions, au sens de l&#8217;article L.&#160;318&#8209;1 du code de la route, neufs vendus en 2022 par rapport au nombre de voitures particuli&#232;res &#224; tr&#232;s faibles &#233;missions vendues en 2017.</p><p style=\"text-align: justify;\">&#171;&#160;2&#176; Une hausse de la part de march&#233; des v&#233;hicules de transport routier de marchandises, dont le poids total autoris&#233; en charge est sup&#233;rieur ou &#233;gal &#224; 3,5 tonnes, &#224; faibles &#233;missions au sens de l&#8217;article L.&#160;224&#8209;8 du code de l&#8217;environnement, neufs vendus en 2025 pour atteindre une part au moins &#233;gale &#224; 18&#160;%.&#160;</p><p style=\"text-align: justify;\">&#171;&#160;3&#176; La fin de la vente des voitures particuli&#232;res et des v&#233;hicules utilitaires l&#233;gers neufs &#233;mettant des gaz &#224; effet de serre, d&#8217;ici &#224; 2040.&#160;&#187;</p>",
    "exposeSommaire": "<p style=\"text-align: justify;\">Cet amendement vise &#224; inscrire les objectifs de d&#233;veloppement des v&#233;hicules &#224; faibles &#233;missions, tels que fix&#233;s par le Plan Climat pr&#233;sent&#233; par le Gouvernement en juillet 2017 et le contrat strat&#233;gique de fili&#232;re sign&#233; par le Gouvernement et le secteur automobile en mai 2018, dans le projet de loi.</p><p style=\"text-align: justify;\">La politique de mobilit&#233; doit r&#233;pondre &#224; des crit&#232;res d&#8217;&#233;quit&#233; sociale et d&#8217;excellence environnementale. De ce fait, les mesures envisag&#233;es dans le projet de loi doivent venir servir les objectifs de d&#233;carbonation de l&#8217;&#233;conomie et d&#8217;am&#233;lioration de la qualit&#233; de l&#8217;air.</p><p style=\"text-align: justify;\">Alors m&#234;me que la Commission europ&#233;enne repr&#233;cise dans sa feuille de route 2050 que, pour atteindre les objectifs de l&#8217;accord de Paris, les v&#233;hicules arrivant sur le march&#233; en 2040 devront ne pas &#233;mettre de gaz &#224; effet de serre, il faut que la France montre toute son ambition &#224; respecter ces objectifs en les inscrivant dans le corps de la loi et non simplement dans l&#8217;expos&#233; des motifs.</p><p style=\"text-align: justify;\">De m&#234;me, il importe de retranscrire les objectifs du Contrat strat&#233;gique de fili&#232;re qui repr&#233;sentent l&#8217;engagement conjoint de l&#8217;&#201;tat et de la fili&#232;re en mati&#232;re de mobilit&#233; &#233;lectrique &#224; horizon 2022 pour les voitures particuli&#232;res et &#224; l&#8217;horizon 2025 pour les v&#233;hicules de transport routier de marchandises.</p>"
  },
  "representations": [
    {
      "nom": "PDF",
      "typeMime": {
        "type": "application",
        "subType": "PDF"
      },
      "statutRepresentation": {
        "verbatim": true,
        "canonique": true,
        "officielle": true,
        "transcription": false,
        "enregistrement": false
      },
      "contenu": {
        "documentURI": "/15/amendements/1974/AN/1864.pdf"
      }
    }
  ],
  "seanceDiscussion": "RUANR5L15S2019IDS21694",
  "sort": {
    "dateSaisie": "2019-06-11T16:51:23.000+02:00",
    "sortEnSeance": "Rejeté"
  },
  "dateDepot": "2019-05-29T02:00:00.000+02:00",
  "dateDistribution": "2019-06-04T02:00:00.000+02:00",
  "article99": "0",
  "loiReference": {}
}