{
  "uid": "AMANR5L15PO419865B2272P1D1N11",
  "identifiant": {
    "legislature": "15",
    "numero": "11",
    "numRect": "0",
    "saisine": {
      "texteLegislatifRef": "PRJLANR5L15B2272",
      "numeroPartiePLF": "1",
      "organeExamen": "PO419865",
      "mentionSecondeDeliberation": "0"
    }
  },
  "numeroLong": "I-CD11",
  "etapeTexte": "1ère lecture (1ère assemblée saisie)",
  "triAmendement": "baaaaaaaaaaaaaaaaaaaaaaaaaaaaaaaaaaaaaaaaaaaaaaaaaevo",
  "cardinaliteAmdtMultiples": "1",
  "etat": "Irrecevable",
  "signataires": {
    "auteur": {
      "typeAuteur": "Depute",
      "acteurRef": "PA330909",
      "groupePolitiqueRef": "PO730934"
    },
    "cosignatairesRefs": [
      "PA722390",
      "PA330909",
      "PA720210"
    ],
    "texteAffichable": "M.&#160;Descoeur,  Mme&#160;Corneloup et Mme&#160;Beauvais"
  },
  "pointeurFragmentTexte": {
    "division": {
      "titre": "Article 4",
      "articleDesignationCourte": "ART. 4",
      "type": "ARTICLE",
      "avantAApres": "A",
      "divisionRattachee": "ARTICLE 4",
      "urlDivisionTexteVise": "/15/textes/2272A.asp#D_Article_4"
    },
    "alinea": {
      "avantAApres": "Apres",
      "numero": "44"
    }
  },
  "corps": {},
  "representations": [
    {
      "nom": "PDF",
      "typeMime": {
        "type": "application",
        "subType": "PDF"
      },
      "statutRepresentation": {
        "verbatim": true,
        "canonique": true,
        "officielle": true,
        "transcription": false,
        "enregistrement": false
      },
      "contenu": {
        "documentURI": "/15/amendements/2272A/CION-DVP/CD11.pdf"
      }
    }
  ],
  "dateDepot": "2019-10-02T02:00:00.000+02:00",
  "dateDistribution": "2019-10-05T02:00:00.000+02:00",
  "article99": "0",
  "loiReference": {}
}