{
  "uid": "AMANR5L15PO419865B1831P0D1N1764",
  "identifiant": {
    "legislature": "15",
    "numero": "1764",
    "numRect": "0",
    "saisine": {
      "texteLegislatifRef": "PRJLANR5L15B1831",
      "numeroPartiePLF": "0",
      "organeExamen": "PO419865",
      "mentionSecondeDeliberation": "0"
    }
  },
  "numeroLong": "CD1764",
  "etapeTexte": "1ère lecture (2ème assemblée saisie)",
  "triAmendement": "fuaaaaaaaaaaaaaaaaaaaaaaaaaaaaaaaaaaaaaaaaaaaaaaaaj",
  "cardinaliteAmdtMultiples": "1",
  "etat": "Discuté",
  "signataires": {
    "auteur": {
      "typeAuteur": "Depute",
      "acteurRef": "PA267585",
      "groupePolitiqueRef": "PO744425"
    },
    "cosignatairesRefs": [
      "PA720230",
      "PA721194",
      "PA267766",
      "PA332228",
      "PA267241",
      "PA268019",
      "PA267585",
      "PA695100",
      "PA719806"
    ],
    "texteAffichable": "M.&#160;Vercamer,  Mme&#160;Auconie, M.&#160;Benoit, M.&#160;Guy&#160;Bricout, M.&#160;Demilly, Mme&#160;Fr&#233;d&#233;rique&#160;Dumas, M.&#160;Meyer&#160;Habib, M.&#160;Lagarde et Mme&#160;Magnier"
  },
  "pointeurFragmentTexte": {
    "division": {
      "titre": "Article 26 C",
      "articleDesignationCourte": "APRÈS ART. 26 C",
      "type": "ARTICLE",
      "avantAApres": "Apres",
      "divisionRattachee": "APRÈS L'ARTICLE 26 C, insérer l'article suivant:",
      "articleAdditionnel": "1",
      "urlDivisionTexteVise": "/15/textes/1831.asp#D_Article_26_C"
    }
  },
  "corps": {
    "dispositif": "<p>Dans un d&#233;lai d&#8217;un an &#224; compter de la promulgation de la pr&#233;sente loi, le Gouvernement remet au Parlement un rapport proposant des solutions afin d&#8217;endiguer la pollution atmosph&#233;rique g&#233;n&#233;r&#233;e par les &#233;manations des bateaux.</p>",
    "exposeSommaire": "<p>Cet amendement demande au Gouvernement de remettre un rapport au Parlement dans lequel il pr&#233;sente des solutions afin d&#8217;endiguer la pollution atmosph&#233;rique g&#233;n&#233;r&#233;e par les &#233;manations des bateaux.</p>"
  },
  "representations": [
    {
      "nom": "PDF",
      "typeMime": {
        "type": "application",
        "subType": "PDF"
      },
      "statutRepresentation": {
        "verbatim": true,
        "canonique": true,
        "officielle": true,
        "transcription": false,
        "enregistrement": false
      },
      "contenu": {
        "documentURI": "/15/amendements/1831/CION-DVP/CD1764.pdf"
      }
    }
  ],
  "sort": {
    "dateSaisie": "2019-05-18T00:16:07.000+02:00",
    "sortEnSeance": "Non soutenu"
  },
  "dateDepot": "2019-05-09T02:00:00.000+02:00",
  "dateDistribution": "2019-05-16T02:00:00.000+02:00",
  "article99": "0",
  "loiReference": {
    "codeLoi": "xxrapport"
  }
}