{
  "uid": "AMANR5L15PO744107B0424P0D1N659",
  "identifiant": {
    "legislature": "15",
    "numero": "659",
    "numRect": "0",
    "saisine": {
      "texteLegislatifRef": "PRJLANR5L15B0424",
      "numeroPartiePLF": "0",
      "organeExamen": "PO744107",
      "mentionSecondeDeliberation": "0"
    }
  },
  "numeroLong": "659",
  "etapeTexte": "1ère lecture (1ère assemblée saisie)",
  "triAmendement": "ks",
  "cardinaliteAmdtMultiples": "1",
  "etat": "Discuté",
  "signataires": {
    "auteur": {
      "typeAuteur": "Depute",
      "acteurRef": "PA721498",
      "groupePolitiqueRef": "PO730964"
    },
    "cosignatairesRefs": [
      "PA721498"
    ],
    "texteAffichable": "M.&#160;Guerini, rapporteur"
  },
  "pointeurFragmentTexte": {
    "division": {
      "titre": "Article 2",
      "articleDesignationCourte": "ART. 2",
      "type": "ARTICLE",
      "avantAApres": "A",
      "divisionRattachee": "ARTICLE 2",
      "urlDivisionTexteVise": "/15/textes/0424.asp#D_Article_2"
    },
    "alinea": {
      "numero": "15"
    }
  },
  "corps": {
    "dispositif": "<p style=\"text-align: justify;\">Au d&#233;but de l&#8217;alin&#233;a&#160;15, substituer au mot&#160;:</p><p style=\"text-align: justify;\">&#171;&#160;Les&#160;&#187;,</p><p style=\"text-align: justify;\">le mot&#160;:</p><p style=\"text-align: justify;\">&#171;&#160;Ces&#160;&#187;.</p>",
    "exposeSommaire": "<p style=\"text-align: justify;\">Amendement r&#233;dactionnel.</p>"
  },
  "representations": [
    {
      "nom": "PDF",
      "typeMime": {
        "type": "application",
        "subType": "PDF"
      },
      "statutRepresentation": {
        "verbatim": true,
        "canonique": true,
        "officielle": true,
        "transcription": false,
        "enregistrement": false
      },
      "contenu": {
        "documentURI": "/15/amendements/0424/CSCONF/659.pdf"
      }
    }
  ],
  "sort": {
    "dateSaisie": "2018-01-15T19:03:26.000+01:00",
    "sortEnSeance": "Adopté"
  },
  "dateDepot": "2018-01-11T01:00:00.000+01:00",
  "dateDistribution": "2018-01-15T01:00:00.000+01:00",
  "article99": "0",
  "loiReference": {}
}