{
  "uid": "AMANR5L15PO59048B1255P1D1N1106",
  "identifiant": {
    "legislature": "15",
    "numero": "1106",
    "numRect": "0",
    "saisine": {
      "texteLegislatifRef": "PRJLANR5L15B1255",
      "numeroPartiePLF": "1",
      "organeExamen": "PO59048",
      "mentionSecondeDeliberation": "0"
    }
  },
  "numeroLong": "I-CF1106",
  "etapeTexte": "1ère lecture (1ère assemblée saisie)",
  "triAmendement": "eoaaaaaaaaaaaaaaaaaaaaaaaaaaaaaaaaaaaaaaaaaaaaaaaabbbddzo",
  "cardinaliteAmdtMultiples": "1",
  "etat": "Discuté",
  "signataires": {
    "auteur": {
      "typeAuteur": "Depute",
      "acteurRef": "PA608172",
      "groupePolitiqueRef": "PO758835"
    },
    "cosignatairesRefs": [
      "PA1592",
      "PA605069",
      "PA608741",
      "PA1198",
      "PA333818",
      "PA337483",
      "PA267233",
      "PA429893",
      "PA1809",
      "PA643145",
      "PA1008",
      "PA340357",
      "PA342415",
      "PA642764",
      "PA333285",
      "PA719930",
      "PA340343",
      "PA508",
      "PA335532",
      "PA609332",
      "PA609590",
      "PA608172",
      "PA332614",
      "PA335054",
      "PA607553",
      "PA610681",
      "PA720988",
      "PA608695",
      "PA608011",
      "PA405480"
    ],
    "texteAffichable": "Mme&#160;Pires Beaune,  M.&#160;Jean-Louis&#160;Bricout, M.&#160;Pupponi, Mme&#160;Rabault, M.&#160;Aviragnet, Mme&#160;Bareigts, Mme&#160;Battistel, Mme&#160;Bi&#233;mouret, M.&#160;Bouillon, M.&#160;Carvounas, M.&#160;Alain&#160;David, Mme&#160;Laurence&#160;Dumont, M.&#160;Faure, M.&#160;Garot, M.&#160;David&#160;Habib, M.&#160;Hutin, M.&#160;Juanico, Mme&#160;Karamanli, M.&#160;J&#233;r&#244;me&#160;Lambert, M.&#160;Letchimy, Mme&#160;Manin, Mme&#160;Pau-Langevin, M.&#160;Potier, M.&#160;Pueyo, M.&#160;Saulignac, Mme&#160;Tolmont, Mme&#160;Untermaier, Mme&#160;Vainqueur-Christophe, M.&#160;Vallaud et Mme&#160;Victory"
  },
  "pointeurFragmentTexte": {
    "division": {
      "titre": "Article 19",
      "articleDesignationCourte": "APRÈS ART. 19",
      "type": "ARTICLE",
      "avantAApres": "Apres",
      "divisionRattachee": "APRÈS L'ARTICLE 19, insérer l'article suivant:",
      "articleAdditionnel": "1",
      "urlDivisionTexteVise": "/15/textes/1255A.asp#D_Article_19"
    }
  },
  "corps": {
    "dispositif": "<p>I. Une fraction du produit de la taxe int&#233;rieure de consommation sur les produits &#233;nerg&#233;tiques pr&#233;vue &#224; l&#8217;article 265 du code des douanes revenant &#224; l&#8217;&#201;tat est attribu&#233;e aux collectivit&#233;s territoriales ou leurs groupements ayant adopt&#233; un plan climat-air-&#233;nergie territorial conform&#233;ment au I de l&#8217;article L. 229-26 du code de l&#8217;environnement.</p><p>Cette fraction est calcul&#233;e de mani&#232;re &#224; ce que le montant vers&#233; &#224; chaque &#233;tablissement public de coop&#233;ration intercommunale concern&#233; et &#224; la M&#233;tropole de Lyon s&#8217;&#233;l&#232;ve &#224; 10 &#8364; par habitant.</p><p>Pour la M&#233;tropole du Grand Paris, les &#233;tablissements publics territoriaux et Paris, cette fraction est &#233;gale &#224; 5 &#8364; par habitant.</p><p>II. &#8211; Une fraction du produit de la taxe int&#233;rieure de consommation sur les produits &#233;nerg&#233;tiques pr&#233;vue &#224; l&#8217;article 265 du code des douanes revenant &#224; l&#8217;&#201;tat est attribu&#233;e aux collectivit&#233;s territoriales ayant adopt&#233; un sch&#233;ma r&#233;gional du climat, de l&#8217;air et de l&#8217;&#233;nergie conform&#233;ment &#224; l&#8217;article L. 222-1 du code de l&#8217;environnement ou un sch&#233;ma r&#233;gional d&#8217;am&#233;nagement, de d&#233;veloppement durable et d&#8217;&#233;galit&#233; des territoires conform&#233;ment &#224; l&#8217;article L. 4251-1 du code g&#233;n&#233;ral des collectivit&#233;s territoriales.</p><p>Cette fraction est calcul&#233;e de mani&#232;re &#224; ce que le montant vers&#233; &#224; chaque collectivit&#233; concern&#233;e s&#8217;&#233;l&#232;ve &#224; 5 &#8364; par habitant.</p><p>III. &#8211; La perte de recettes r&#233;sultant pour l&#8217;&#201;tat du I et du II ci-dessus est compens&#233;e, &#224; due concurrence, par la cr&#233;ation d&#8217;une taxe additionnelle aux droits pr&#233;vus aux articles 575 et 575 A du code g&#233;n&#233;ral des imp&#244;ts.</p>",
    "exposeSommaire": "<p>Cet amendement port&#233; par le groupe Socialistes et apparent&#233;s fl&#232;che une fraction de TICPE en direction des collectivit&#233;s territoriales ou de leurs groupements qui ont adopt&#233; un plan climat-air-&#233;nergie ou un sch&#233;ma r&#233;gional du climat, de l'air et de l'&#233;nergie.</p><p>Ainsi, les EPCI &#224; fiscalit&#233; propre qui ont adopt&#233; un plan climat-air-&#233;nergie b&#233;n&#233;ficieraient d'une fraction de TICPE &#233;gale &#224; 10 euros par habitant. Les r&#233;gions qui ont adopt&#233; un sch&#233;ma r&#233;gional du climat, de l'air et de l'&#233;nergie b&#233;n&#233;ficieraient, quant &#224; elles, d'une fraction de TICPE &#233;gale &#224; 5 euros par habitant.</p><p>Ce fl&#233;chage contribuerait &#224; la r&#233;alisation des objectifs fix&#233;s dans la loi n&#176; 2015-992 du 17 ao&#251;t 2015 relative &#224; la transition &#233;nerg&#233;tique pour la croissance verte. Sans les collectivit&#233;s, il est en effet impossible de les atteindre. Or, aujourd'hui, si les collectivit&#233;s ont davantage de comp&#233;tences dans le domaine de la transition &#233;nerg&#233;tique, elles n'ont b&#233;n&#233;fici&#233; d'aucun transfert de moyens.</p><p>Cet amendement a &#233;t&#233; propos&#233; au groupe Socialistes et apparent&#233;s par AMORCE, R&#233;gions de France et la Ville de Paris.</p>"
  },
  "representations": [
    {
      "nom": "PDF",
      "typeMime": {
        "type": "application",
        "subType": "PDF"
      },
      "statutRepresentation": {
        "verbatim": true,
        "canonique": true,
        "officielle": true,
        "transcription": false,
        "enregistrement": false
      },
      "contenu": {
        "documentURI": "/15/amendements/1255A/CION_FIN/CF1106.pdf"
      }
    }
  ],
  "sort": {
    "dateSaisie": "2018-10-11T09:14:39.000+02:00",
    "sortEnSeance": "Retiré"
  },
  "dateDepot": "2018-10-05T02:00:00.000+02:00",
  "dateDistribution": "2018-10-09T02:00:00.000+02:00",
  "article99": "0",
  "loiReference": {
    "codeLoi": "douanes",
    "divisionCodeLoi": "265"
  }
}