{
  "uid": "AMANR5L15SEA717460BTC1974P0D1N398",
  "identifiant": {
    "legislature": "15",
    "numero": "398",
    "numRect": "0",
    "saisine": {
      "texteLegislatifRef": "PRJLANR5L15BTC1974",
      "numeroPartiePLF": "0",
      "organeExamen": "PO717460",
      "mentionSecondeDeliberation": "0"
    }
  },
  "numeroLong": "398",
  "etapeTexte": "1ère lecture (2ème assemblée saisie)",
  "triAmendement": "adcaaaaaaaaaaaaaaaaaaaaaaaaaaaaaaaaaaaaaaaaaaaaaaaagodddx",
  "cardinaliteAmdtMultiples": "1",
  "etat": "Discuté",
  "signataires": {
    "auteur": {
      "typeAuteur": "Depute",
      "acteurRef": "PA643103",
      "groupePolitiqueRef": "PO730934"
    },
    "cosignatairesRefs": [
      "PA643103"
    ],
    "texteAffichable": "M.&#160;Ferrara"
  },
  "pointeurFragmentTexte": {
    "division": {
      "titre": "Article PREMIER",
      "articleDesignationCourte": "ART. PREMIER",
      "type": "ARTICLE",
      "avantAApres": "A",
      "divisionRattachee": "ARTICLE PREMIER",
      "urlDivisionTexteVise": "/15/textes/1974.asp#D_Article_1er"
    },
    "alinea": {
      "numero": "5"
    }
  },
  "corps": {
    "dispositif": "<p>&#192; l&#8217;alin&#233;a&#160;5, substituer aux mots&#160;:</p><p style=\"text-align: justify;\">&#171;&#160;des massifs de montagne et des&#160;&#187;</p><p style=\"text-align: justify;\">les mots&#160;:</p><p style=\"text-align: justify;\">&#171;&#160; en termes de mobilit&#233; quotidienne et de fluidit&#233; du trafic routier en particulier pour les massifs de montagne et les&#160;&#187;.</p>",
    "exposeSommaire": "<p style=\"text-align: justify;\">Cet amendement vise &#224; inscrire parmi les objectifs de la programmation des infrastructures l&#8217;importance du d&#233;senclavement pour les massifs de montagne qui en sont particuli&#232;rement affect&#233;s et l&#8217;am&#233;lioration de la mobilit&#233; quotidienne &#224; l&#8217;int&#233;rieur des massifs en fluidifiant le trafic routier, notamment dans les territoires transfrontaliers.</p>"
  },
  "representations": [
    {
      "nom": "PDF",
      "typeMime": {
        "type": "application",
        "subType": "PDF"
      },
      "statutRepresentation": {
        "verbatim": true,
        "canonique": true,
        "officielle": true,
        "transcription": false,
        "enregistrement": false
      },
      "contenu": {
        "documentURI": "/15/amendements/1974/AN/398.pdf"
      }
    }
  ],
  "seanceDiscussion": "RUANR5L15S2019IDS21674",
  "sort": {
    "dateSaisie": "2019-06-03T23:26:36.000+02:00",
    "sortEnSeance": "Non soutenu"
  },
  "dateDepot": "2019-05-27T02:00:00.000+02:00",
  "dateDistribution": "2019-06-01T02:00:00.000+02:00",
  "article99": "0",
  "loiReference": {}
}