{
  "uid": "AMANR5L15SEA717460BTC1175P0D1N901",
  "identifiant": {
    "legislature": "15",
    "numero": "901",
    "numRect": "0",
    "saisine": {
      "texteLegislatifRef": "PRJLANR5L15BTC1175",
      "numeroPartiePLF": "0",
      "organeExamen": "PO717460",
      "mentionSecondeDeliberation": "0"
    }
  },
  "numeroLong": "901",
  "etapeTexte": "Nouvelle Lecture",
  "triAmendement": "ojaaaaaaaaaaaaaaaaaaaaaaaaaaaaaaaaaaaaaaaaaaaaaaaaibkzf",
  "cardinaliteAmdtMultiples": "1",
  "etat": "Discuté",
  "signataires": {
    "auteur": {
      "typeAuteur": "Depute",
      "acteurRef": "PA335999",
      "groupePolitiqueRef": "PO723569"
    },
    "cosignatairesRefs": [
      "PA335999"
    ],
    "texteAffichable": "Mme&#160;Batho"
  },
  "pointeurFragmentTexte": {
    "division": {
      "titre": "Article 14 septies",
      "articleDesignationCourte": "ART. 14 SEPTIES",
      "type": "ARTICLE",
      "avantAApres": "A",
      "divisionRattachee": "ARTICLE 14 SEPTIES",
      "urlDivisionTexteVise": "/15/textes/1175.asp#D_Article_14_septies"
    },
    "alinea": {
      "avantAApres": "Apres",
      "numero": "10"
    }
  },
  "corps": {
    "dispositif": "<p>Apr&#232;s l&#8217;alin&#233;a&#160;10, ins&#233;rer les deux alin&#233;as suivants&#160;:</p><p>&#171; 3&#176; Est ajout&#233; un IV ainsi r&#233;dig&#233; :</p><p style=\"text-align: justify;\">&#171;&#160;IV.&#160;&#8211;&#160;L&#8217;utilisation des produits phytopharmaceutiques contenant la substance active &#171;&#160;glyphosate&#160;&#187; est interdite &#224; compter du 1<sup>er</sup> juillet 2021.&#160;&#187;</p>",
    "exposeSommaire": "<p style=\"text-align: justify;\">L&#8217;interdiction du glyphosate doit &#234;tre inscrite dans la loi r&#233;sultant des &#201;tats g&#233;n&#233;raux de l&#8217;alimentation.</p><p style=\"text-align: justify;\">Malgr&#233; l&#8217;annonce du Pr&#233;sident de la R&#233;publique que le glyphosate serait interdit en France&#160;&#171;&#160;d&#232;s que des alternatives seront trouv&#233;es, et au plus tard dans trois ans&#160;&#187;, aucun acte gouvernemental, ni circulaire, ni d&#233;cret, ni article de loi n&#8217;a concr&#233;tis&#233; cet engagement.</p><p style=\"text-align: justify;\">Il va sans dire que le glyphosate fait l&#8217;objet d&#8217;un intense lobbying des firmes de l&#8217;agrochimie dont l&#8217;affaire des Monsanto Papers a illustr&#233; les pratiques. Elles ont d&#8217;ailleurs r&#233;ussi a obtenir au niveau&#160;europ&#233;en le renouvellement de l&#8217;autorisation de cette substance, malgr&#233; son classement comme canc&#233;rig&#232;ne probable par l&#8217;Organisation Mondiale de la Sant&#233;. Et lorsque le pr&#233;sent amendement d&#8217;interdiction du glyphosate a &#233;t&#233; d&#233;pos&#233; en premi&#232;re lecture &#224; l&#8217;Assembl&#233;e nationale, les firmes de l&#8217;agrochimie en avait connaissance... avant les d&#233;put&#233;s&#160;!</p><p style=\"text-align: justify;\">La repr&#233;sentation nationale ne doit c&#233;der &#224; aucune forme de pression ou d&#8217;interf&#233;rence et doit prendre ses responsabilit&#233;s pour prot&#233;ger la sant&#233; des agriculteurs et des citoyens.</p><p style=\"text-align: justify;\">Les engagements r&#233;it&#233;r&#233;s du gouvernement de parvenir &#224; une sortie du glyphosate sans en passer par la loi, gr&#226;ce au volontariat, ne sont pas cr&#233;dibles. En effet l&#8217;ensemble du plan Ecophyto bas&#233; sur la m&#234;me logique volontaire s&#8217;av&#232;re un &#233;chec complet. Une disposition l&#233;gislative s&#8217;av&#232;re donc indispensable.</p><p style=\"text-align: justify;\">La repr&#233;sentation nationale doit en outre tirer les cons&#233;quences du jugement historique rendu le 10 ao&#251;t dernier aux &#201;tats-Unis en faveur du jardinier Dewayne Lee Johnson, victime du glyphosate qui a obtenu la condamnation de la firme Monsanto &#224; une amende de 289 millions de dollars. Ce jugement reconna&#238;t le lien entre exposition au glyphosate et cancer. Il &#233;tablit &#233;galement que les risques pour la sant&#233; publique &#233;taient connues de la firme.</p><p style=\"text-align: justify;\">Dans ces conditions, toute tergiversation et tout nouveau report de la d&#233;cision d&#8217;interdiction du glyphosate expose d&#233;sormais les pouvoirs publics &#224; ce que leur responsabilit&#233; soit mise en cause, y compris sur un plan judiciaire, par les victimes.</p><p style=\"text-align: justify;\">C&#8217;est pourquoi l&#8217;auteure du pr&#233;sent amendement invite solennellement chaque d&#233;put&#233; &#224; voter enfin cette d&#233;cision tr&#232;s attendue par une large majorit&#233; de citoyens.</p>"
  },
  "representations": [
    {
      "nom": "PDF",
      "typeMime": {
        "type": "application",
        "subType": "PDF"
      },
      "statutRepresentation": {
        "verbatim": true,
        "canonique": true,
        "officielle": true,
        "transcription": false,
        "enregistrement": false
      },
      "contenu": {
        "documentURI": "/15/amendements/1175/AN/901.pdf"
      }
    }
  ],
  "seanceDiscussion": "RUANR5L15S2018IDS21237",
  "sort": {
    "dateSaisie": "2018-09-15T04:15:59.000+02:00",
    "sortEnSeance": "Rejeté"
  },
  "dateDepot": "2018-09-08T02:00:00.000+02:00",
  "dateDistribution": "2018-09-11T02:00:00.000+02:00",
  "article99": "0",
  "loiReference": {}
}