{
  "uid": "AMANR5L15SEA717460BTC1175P0D1N464",
  "identifiant": {
    "legislature": "15",
    "numero": "464",
    "numRect": "0",
    "saisine": {
      "texteLegislatifRef": "PRJLANR5L15BTC1175",
      "numeroPartiePLF": "0",
      "organeExamen": "PO717460",
      "mentionSecondeDeliberation": "0"
    }
  },
  "numeroLong": "464",
  "etapeTexte": "Nouvelle Lecture",
  "triAmendement": "lcaaaaaaaaaaaaaaaaaaaaaaaaaaaaaaaaaaaaaaaaaaaaaaaafkkkkkkknzo",
  "cardinaliteAmdtMultiples": "1",
  "etat": "Discuté",
  "signataires": {
    "auteur": {
      "typeAuteur": "Depute",
      "acteurRef": "PA330008",
      "groupePolitiqueRef": "PO730934"
    },
    "cosignatairesRefs": [
      "PA1012",
      "PA330008"
    ],
    "texteAffichable": "M.&#160;Breton et M.&#160;de la Verpilli&#232;re"
  },
  "pointeurFragmentTexte": {
    "division": {
      "titre": "Article 14 bis",
      "articleDesignationCourte": "ART. 14 BIS",
      "type": "ARTICLE",
      "avantAApres": "A",
      "divisionRattachee": "ARTICLE 14 BIS",
      "urlDivisionTexteVise": "/15/textes/1175.asp#D_Article_14_bis"
    },
    "alinea": {
      "numero": "9"
    }
  },
  "corps": {
    "dispositif": "<p style=\"text-align: justify;\">Supprimer les alin&#233;as 9 &#224; 17.</p>",
    "exposeSommaire": "<p style=\"text-align: justify;\">Les alin&#233;as des articles 9 &#224; 17 visent &#224; &#233;tendre aux produits biocides l&#8217;interdiction des rabais, remises et ristournes, sur le mod&#232;le de ce qui est d&#233;j&#224; pr&#233;vu par le texte pour les produits phytopharmaceutiques. Pour ces deux interdictions, il est &#224; noter qu&#8217;aucune &#233;tude d&#8217;impact n&#8217;a &#233;t&#233; pr&#233;alablement r&#233;alis&#233;e.</p><p style=\"text-align: justify;\">Les utilisateurs de biocides, contrairement aux utilisateurs d&#8217;antibiotiques, ne disposent pas actuellement d&#8217;alternatives, et les travaux de recherche de solutions sont encore loin de porter leurs fruits. Aussi, cet amendement vise &#224; supprimer cette interdiction de rabais, remises et ristournes.</p>"
  },
  "representations": [
    {
      "nom": "PDF",
      "typeMime": {
        "type": "application",
        "subType": "PDF"
      },
      "statutRepresentation": {
        "verbatim": true,
        "canonique": true,
        "officielle": true,
        "transcription": false,
        "enregistrement": false
      },
      "contenu": {
        "documentURI": "/15/amendements/1175/AN/464.pdf"
      }
    }
  ],
  "seanceDiscussion": "RUANR5L15S2018IDS21237",
  "sort": {
    "dateSaisie": "2018-09-14T23:15:46.000+02:00",
    "sortEnSeance": "Non soutenu"
  },
  "dateDepot": "2018-09-06T02:00:00.000+02:00",
  "dateDistribution": "2018-09-11T02:00:00.000+02:00",
  "article99": "0",
  "loiReference": {}
}