{
  "uid": "AMANR5L15SEA717460B0911P0D1N226",
  "identifiant": {
    "legislature": "15",
    "numero": "226",
    "numRect": "0",
    "saisine": {
      "texteLegislatifRef": "PRJLANR5L15B0911",
      "numeroPartiePLF": "0",
      "organeExamen": "PO717460",
      "mentionSecondeDeliberation": "0"
    }
  },
  "numeroLong": "226",
  "etapeTexte": "1ère lecture (1ère assemblée saisie)",
  "triAmendement": "jy",
  "cardinaliteAmdtMultiples": "1",
  "etat": "A discuter",
  "signataires": {
    "auteur": {
      "typeAuteur": "Depute",
      "acteurRef": "PA721506",
      "groupePolitiqueRef": "PO730934"
    },
    "cosignatairesRefs": [
      "PA721506"
    ],
    "texteAffichable": "Mme&#160;Kuster"
  },
  "pointeurFragmentTexte": {
    "division": {
      "titre": "Article 4",
      "articleDesignationCourte": "ART. 4",
      "type": "ARTICLE",
      "avantAApres": "A",
      "divisionRattachee": "ARTICLE 4",
      "urlDivisionTexteVise": "/15/textes/0911.asp#D_Article_4"
    }
  },
  "corps": {
    "dispositif": "<p style=\"text-align: justify;\">Supprimer cet article.</p>",
    "exposeSommaire": "<p style=\"text-align: justify;\">Cet article permet de limiter au stade de la commission le droit pour les parlementaires d&#8217;amender certains projets ou propositions de loi. Le texte tel qu&#8217;adopt&#233; en commission est ensuite vot&#233; en s&#233;ance sans pouvoir &#234;tre amend&#233;. Non seulement cette disposition restreint consid&#233;rablement le champ de l&#8217;initiative parlementaire, mais elle r&#233;serve aux seuls membres d&#8217;une commission le droit d&#8217;amender un projet ou une proposition de loi au d&#233;triment de l&#8217;ensemble des d&#233;put&#233;s ou s&#233;nateurs.</p>"
  },
  "representations": [
    {
      "nom": "PDF",
      "typeMime": {
        "type": "application",
        "subType": "PDF"
      },
      "statutRepresentation": {
        "verbatim": true,
        "canonique": true,
        "officielle": true,
        "transcription": false,
        "enregistrement": false
      },
      "contenu": {
        "documentURI": "/15/amendements/0911/AN/226.pdf"
      }
    }
  ],
  "dateDepot": "2018-07-03T02:00:00.000+02:00",
  "dateDistribution": "2018-07-10T02:00:00.000+02:00",
  "article99": "0",
  "loiReference": {}
}