{
  "uid": "AMANR5L15PO419604B1481P0D1N104",
  "identifiant": {
    "legislature": "15",
    "numero": "104",
    "numRect": "0",
    "saisine": {
      "texteLegislatifRef": "PRJLANR5L15B1481",
      "numeroPartiePLF": "0",
      "organeExamen": "PO419604",
      "mentionSecondeDeliberation": "0"
    }
  },
  "numeroLong": "AC104",
  "etapeTexte": "1ère lecture (1ère assemblée saisie)",
  "triAmendement": "akaaaaaaaaaaaaaaaaaaaaaaaaaaaaaaaaaaaaaaaaaaaaaaaacki",
  "cardinaliteAmdtMultiples": "1",
  "etat": "Discuté",
  "signataires": {
    "auteur": {
      "typeAuteur": "Depute",
      "acteurRef": "PA608416",
      "groupePolitiqueRef": "PO730934"
    },
    "cosignatairesRefs": [
      "PA608416"
    ],
    "texteAffichable": "M.&#160;Hetzel"
  },
  "pointeurFragmentTexte": {
    "division": {
      "titre": "Article 2",
      "articleDesignationCourte": "ART. 2",
      "type": "ARTICLE",
      "avantAApres": "A",
      "divisionRattachee": "ARTICLE 2",
      "urlDivisionTexteVise": "/15/textes/1481.asp#D_Article_2"
    }
  },
  "corps": {
    "dispositif": "<p style=\"text-align: justify;\">Supprimer cet article.</p>",
    "exposeSommaire": "<p style=\"text-align: justify;\">Cet article pr&#233;voit d&#8217;abaisser l&#8217;&#226;ge de d&#233;but de l&#8217;obligation d&#8217;instruction &#224; trois ans. La scolarisation est actuellement obligatoire &#224; partir de 6 ans.</p><p style=\"text-align: justify;\">Une telle disposition appara&#238;t totalement symbolique.</p><p style=\"text-align: justify;\">En effet, l&#8217;immense majorit&#233; des enfants &#226;g&#233;s de trois ans fr&#233;quentent l&#8217;&#233;cole maternelle&#160;: ils &#233;taient plus de 795 000 &#224; la rentr&#233;e 2016. Seuls 19740 n&#8217;avaient pas int&#233;gr&#233;s la petite section, soit moins de 2,4&#160;% d&#8217;une classe d&#8217;&#226;ge. Parmi eux, <i>on trouve en autre des enfants handicap&#233;s qui ne peuvent &#234;tre accueillis, faute d&#8217;auxiliaires de vie (AVS) dans les &#233;coles.</i></p><p style=\"text-align: justify;\">Une telle disposition ne para&#238;t pas en phase avec la r&#233;alit&#233;. L&#8217;obligation scolaire entra&#238;nera probablement des contraintes d&#8217;assiduit&#233; accrues, alors que l&#8217;absent&#233;isme ou la pr&#233;sence &#224; temps partiel est actuellement tol&#233;r&#233; dans certains &#233;tablissements.</p><p style=\"text-align: justify;\">Elle soul&#232;ve d&#8217;autres questions. A savoir, l&#8217;allocation de rentr&#233;e scolaire (ARS) va-t-elle &#234;tre vers&#233;e au titre des enfants scolaris&#233;s de 3 &#224; 6 ans&#160;? &#192; l&#8217;heure actuelle, l&#8217;ARS est due aux familles &#171;&#160;pour chaque enfant inscrit en ex&#233;cution de l&#8217;obligation scolaire dans un &#233;tablissement ou organisme d&#8217;enseignement public ou priv&#233;&#160;&#187;, pr&#233;voit l&#8217;article L.&#160;543&#8209;1 du Code de la s&#233;curit&#233; sociale.</p><p style=\"text-align: justify;\">Par ailleurs, cette mesure n&#8217;&#233;tait pas dans le programme du candidat Emmanuel Macron. En revanche, cette id&#233;e &#233;tait d&#233;fendue avec v&#233;h&#233;mence par Mme Najat Vallaud-Belckacem en 2016. Elle a &#233;t&#233; reprise dans le programme du candidat socialiste Benoit Hamon. Cette mesure &#233;tait &#233;galement pr&#244;n&#233;e par Jean-Luc M&#233;lenchon.</p>"
  },
  "representations": [
    {
      "nom": "PDF",
      "typeMime": {
        "type": "application",
        "subType": "PDF"
      },
      "statutRepresentation": {
        "verbatim": true,
        "canonique": true,
        "officielle": true,
        "transcription": false,
        "enregistrement": false
      },
      "contenu": {
        "documentURI": "/15/amendements/1481/CION-CEDU/AC104.pdf"
      }
    }
  ],
  "sort": {
    "dateSaisie": "2019-01-29T23:57:20.000+01:00",
    "sortEnSeance": "Rejeté"
  },
  "dateDepot": "2019-01-23T01:00:00.000+01:00",
  "dateDistribution": "2019-01-28T01:00:00.000+01:00",
  "article99": "0",
  "loiReference": {}
}