{
  "uid": "AMANR5L15SEA717460BTC0971P0D1N545",
  "identifiant": {
    "legislature": "15",
    "numero": "545",
    "numRect": "0",
    "saisine": {
      "texteLegislatifRef": "PRJLANR5L15BTC0971",
      "numeroPartiePLF": "0",
      "organeExamen": "PO717460",
      "mentionSecondeDeliberation": "0"
    }
  },
  "numeroLong": "545",
  "etapeTexte": "1ère lecture (1ère assemblée saisie)",
  "triAmendement": "cf",
  "cardinaliteAmdtMultiples": "1",
  "etat": "Discuté",
  "signataires": {
    "auteur": {
      "typeAuteur": "Depute",
      "acteurRef": "PA712015",
      "groupePolitiqueRef": "PO730934"
    },
    "cosignatairesRefs": [
      "PA718784",
      "PA720684",
      "PA266793",
      "PA643103",
      "PA712015",
      "PA720210",
      "PA266808",
      "PA334149",
      "PA608016",
      "PA346218",
      "PA709315",
      "PA2086",
      "PA721678",
      "PA267429",
      "PA267200",
      "PA267735",
      "PA609245",
      "PA267378",
      "PA1874",
      "PA718838",
      "PA718780",
      "PA346054",
      "PA721286",
      "PA336316",
      "PA721410"
    ],
    "texteAffichable": "M.&#160;Dive,  M.&#160;Viala, M.&#160;de Ganay, M.&#160;Brun, M.&#160;Le Fur, M.&#160;Marlin, Mme&#160;Bonnivard, M.&#160;Pierre-Henri&#160;Dumont, M.&#160;Reda, M.&#160;Cinieri, M.&#160;Fasquelle, Mme&#160;Levy, M.&#160;Bony, M.&#160;Ramadier, M.&#160;Emmanuel&#160;Maquet, Mme&#160;Beauvais, M.&#160;Bouchet, Mme&#160;Louwagie, M.&#160;Pauget, M.&#160;Masson, M.&#160;Rolland, M.&#160;Huyghe, M.&#160;Ferrara, Mme&#160;Lacroute et Mme&#160;Trastour-Isnart"
  },
  "pointeurFragmentTexte": {
    "division": {
      "titre": "Article 18",
      "articleDesignationCourte": "ART. 18",
      "type": "ARTICLE",
      "avantAApres": "A",
      "divisionRattachee": "ARTICLE 18",
      "urlDivisionTexteVise": "/15/textes/0971.asp#D_Article_18"
    }
  },
  "corps": {
    "dispositif": "<p>Supprimer cet article.</p>",
    "exposeSommaire": "<p style=\"text-align: justify;\">Simplifier l&#8217;acte de construire ne doit pas se faire au d&#233;triment des personnes en situation de handicap.</p><p style=\"text-align: justify;\">En voulant adapter les exigences d&#8217;accessibilit&#233;, cet article restreint aux personnes &#224; mobilit&#233; r&#233;duite le droit de choisir librement leur lieu de vie (droit universel d&#8217;acc&#232;s au logement), pis, introduit &#171;&#160;une discrimination &#224; l&#8217;entr&#233;e&#160;&#187; dans l&#8217;habitat collectif, en les &#233;cartant par la s&#233;lection, si le bailleur dispose de plusieurs demandes, notamment de personnes valides, au moment de la mise sur le march&#233; de son logement &#171;&#160;&#233;volutif&#160;&#187;.</p><p style=\"text-align: justify;\">En outre, cet article condamne l&#8217;avenir de notre pays, au regard du vieillissement pr&#233;visible de sa population et de la perte d&#8217;autonomie, avec la volont&#233; du maintien &#224; domicile, pour faire face au manque de places dans les EHPAD.</p><p style=\"text-align: justify;\">Enfin, cet article, inscrit dans l&#8217;axe &#171;&#160;construire plus, mieux et moins cher&#160;&#187;, ne r&#233;duira pas les co&#251;ts de construction, ou &#224; la marge, dans la mesure o&#249; l&#8217;habitat, qu&#8217;il soit accessible ou &#233;volutif, rend n&#233;cessaire la r&#233;alisation de la cha&#238;ne d&#8217;accessibilit&#233; depuis la voie publique, dans les parties communes (entr&#233;e des immeubles, &#233;clairages, desserte des &#233;tages&#8230;), et &#224; minima, &#224; l&#8217;int&#233;rieur du logement (&#233;quipement sanitaire).</p><p style=\"text-align: justify;\">Pour ces raisons, il est propos&#233; la suppression de l&#8217;article&#160;18, afin de garantir l&#8217;accessibilit&#233; dans tous les logements, telle qu&#8217;elle est pr&#233;vue par la loi handicap du 11 f&#233;vrier 2005.</p>"
  },
  "representations": [
    {
      "nom": "PDF",
      "typeMime": {
        "type": "application",
        "subType": "PDF"
      },
      "statutRepresentation": {
        "verbatim": true,
        "canonique": true,
        "officielle": true,
        "transcription": false,
        "enregistrement": false
      },
      "contenu": {
        "documentURI": "/15/amendements/0971/AN/545.pdf"
      }
    }
  ],
  "seanceDiscussion": "RUANR5L15S2018IDS21082",
  "sort": {
    "dateSaisie": "2018-06-01T19:23:17.000+02:00",
    "sortEnSeance": "Rejeté"
  },
  "dateDepot": "2018-05-24T02:00:00.000+02:00",
  "dateDistribution": "2018-05-29T02:00:00.000+02:00",
  "article99": "0",
  "loiReference": {}
}