{
  "uid": "AMANR5L15SEA717460BTC1396P0D1N165",
  "identifiant": {
    "legislature": "15",
    "numero": "165",
    "numRect": "0",
    "saisine": {
      "texteLegislatifRef": "PRJLANR5L15BTC1396",
      "numeroPartiePLF": "0",
      "organeExamen": "PO717460",
      "mentionSecondeDeliberation": "0"
    }
  },
  "numeroLong": "165",
  "etapeTexte": "1ère lecture (2ème assemblée saisie)",
  "triAmendement": "aeaaaaaaaaaaaaaaaaaaaaaaaaaaaaaaaaaaaaaaaaaaaaaaaad",
  "cardinaliteAmdtMultiples": "1",
  "etat": "Discuté",
  "signataires": {
    "auteur": {
      "typeAuteur": "Depute",
      "acteurRef": "PA721932",
      "groupePolitiqueRef": "PO723569"
    },
    "cosignatairesRefs": [
      "PA721932"
    ],
    "texteAffichable": "Mme&#160;Lorho"
  },
  "pointeurFragmentTexte": {
    "division": {
      "titre": "Article 4",
      "articleDesignationCourte": "ART. 4",
      "type": "ARTICLE",
      "avantAApres": "A",
      "divisionRattachee": "ARTICLE 4",
      "urlDivisionTexteVise": "/15/textes/1396.asp#D_Article_4"
    },
    "alinea": {
      "avantAApres": "Apres",
      "numero": "8"
    }
  },
  "corps": {
    "dispositif": "<p style=\"text-align: justify;\">Apr&#232;s l&#8217;alin&#233;a&#160;8, ins&#233;rer l&#8217;alin&#233;a suivant&#160;:</p><p style=\"text-align: justify;\">&#171;&#160;Les personnes physiques mentionn&#233;es aux 3&#176; et 4&#176; du I du pr&#233;sent article ne peuvent repr&#233;senter les parties dans le cas du r&#232;glement litigieux d&#8217;une succession.&#160;&#187;</p>",
    "exposeSommaire": "<p style=\"text-align: justify;\">La part de parents jusqu'au 4e degr&#233; b&#233;n&#233;ficiant d'un h&#233;ritage constituait en 2000 pr&#232;s de 11 % des h&#233;ritants, si l'on en croit le rapport n&#176;2850 d&#233;pos&#233; le 15 f&#233;vrier 2006 &#224; l'assembl&#233;e nationale. Dans les cas de successions, la repr&#233;sentation par ces parents du 3e degr&#233; soul&#232;ve la question de la prise d'int&#233;r&#234;t de la part de la personne physique &#224; repr&#233;senter un parent - dans une certaine mesure - &#233;loign&#233;. La repr&#233;sentation par des alli&#233;s ou les alli&#233;s en ligne collat&#233;rale pose la m&#234;me question du caract&#232;re trop &#233;loign&#233; du lien de parentalit&#233; et de la prise d'int&#233;r&#234;t inh&#233;rente &#224; cette position dans les cas de succession. C'est la raison pour laquelle il est propos&#233; d'exclure les cas de succession des possibilit&#233;s de repr&#233;sentation.</p>"
  },
  "representations": [
    {
      "nom": "PDF",
      "typeMime": {
        "type": "application",
        "subType": "PDF"
      },
      "statutRepresentation": {
        "verbatim": true,
        "canonique": true,
        "officielle": true,
        "transcription": false,
        "enregistrement": false
      },
      "contenu": {
        "documentURI": "/15/amendements/1396/AN/165.pdf"
      }
    }
  ],
  "seanceDiscussion": "RUANR5L15S2019IDS21372",
  "sort": {
    "dateSaisie": "2018-11-21T21:41:45.000+01:00",
    "sortEnSeance": "Non soutenu"
  },
  "dateDepot": "2018-11-14T01:00:00.000+01:00",
  "dateDistribution": "2018-11-18T01:00:00.000+01:00",
  "article99": "0",
  "loiReference": {}
}