{
  "uid": "AMANR5L15SEA717460BTC0851P0D1N108",
  "identifiant": {
    "legislature": "15",
    "numero": "108",
    "numRect": "0",
    "saisine": {
      "texteLegislatifRef": "PRJLANR5L15BTC0851",
      "numeroPartiePLF": "0",
      "organeExamen": "PO717460",
      "mentionSecondeDeliberation": "0"
    }
  },
  "numeroLong": "108",
  "etapeTexte": "1ère lecture (1ère assemblée saisie)",
  "triAmendement": "e",
  "cardinaliteAmdtMultiples": "1",
  "etat": "Discuté",
  "signataires": {
    "auteur": {
      "typeAuteur": "Depute",
      "acteurRef": "PA722110",
      "groupePolitiqueRef": "PO730940"
    },
    "cosignatairesRefs": [
      "PA721118",
      "PA718720",
      "PA718926",
      "PA722202",
      "PA441",
      "PA722110",
      "PA721270",
      "PA721896",
      "PA267306",
      "PA610667",
      "PA720546",
      "PA720692",
      "PA610654",
      "PA689",
      "PA610634",
      "PA335612"
    ],
    "texteAffichable": "M.&#160;Wulfranc,  M.&#160;Jumel, M.&#160;Bruneel, M.&#160;Chassaigne, M.&#160;Azerot, Mme&#160;Bello, M.&#160;Brotherson, Mme&#160;Buffet, M.&#160;Dharr&#233;ville, M.&#160;Dufr&#232;gne, Mme&#160;Faucillon, M.&#160;Lecoq, M.&#160;Nilor, M.&#160;Peu, M.&#160;Fabien&#160;Roussel et M.&#160;Serville"
  },
  "pointeurFragmentTexte": {
    "division": {
      "titre": "Article PREMIER",
      "articleDesignationCourte": "AVANT ART. PREMIER",
      "type": "ARTICLE",
      "avantAApres": "Avant",
      "divisionRattachee": "AVANT L'ARTICLE PREMIER, insérer l'article suivant:",
      "articleAdditionnel": "1",
      "urlDivisionTexteVise": "/15/textes/0851.asp#D_Article_1er"
    }
  },
  "corps": {
    "dispositif": "<p style=\"text-align: justify;\">Apr&#232;s l&#8217;article L.&#160;2100&#8209;3 du code des transports, il est ins&#233;r&#233; un article L.&#160;2100&#8209;3&#8209;1 ainsi r&#233;dig&#233;&#160;:</p><p style=\"text-align: justify;\">&#171;&#160;<i>Art.&#160;L.&#160;2100&#8209;3&#8209;1</i>.&#160;&#8211;&#160;Il peut &#234;tre cre&#769;e&#769; des comite&#769;s de ligne, compose&#769;s de repre&#769;sentants du groupe public ferroviaire, d&#8217;usagers, et notamment de repre&#769;sentants d&#8217;associations de personnes handicape&#769;es, de salarie&#769;s du groupe public ferroviaire et d&#8217;e&#769;lus des collectivite&#769;s territoriales pour examiner la de&#769;finition des services ainsi que tout sujet concourant a&#768; leur qualite&#769;.&#160;&#187;</p>",
    "exposeSommaire": "<p style=\"text-align: justify;\">Le pre&#769;sent amendement vise le re&#769;tablissement de la disposition de la loi SRU du 13 de&#769;cembre 2000 relative a&#768; la cre&#769;ation des comite&#769;s de ligne abroge&#769;e par l&#8217;ordonnance n&#176;2010&#8209;1307 du 28 octobre 2010. Les comite&#769;s de ligne, qui se sont ge&#769;ne&#769;ralise&#769;s entre 2002 et 2008, ont permis d&#8217;instaurer un dialogue ine&#769;dit entre les ope&#769;rateurs, les re&#769;gions, les usagers et les syndicats de cheminots. Les auteurs de l&#8217;amendement estiment indispensable de pre&#769;server ces lieux de de&#769;mocratie participative.</p>"
  },
  "representations": [
    {
      "nom": "PDF",
      "typeMime": {
        "type": "application",
        "subType": "PDF"
      },
      "statutRepresentation": {
        "verbatim": true,
        "canonique": true,
        "officielle": true,
        "transcription": false,
        "enregistrement": false
      },
      "contenu": {
        "documentURI": "/15/amendements/0851/AN/108.pdf"
      }
    }
  ],
  "seanceDiscussion": "RUANR5L15S2018IDS20990",
  "sort": {
    "dateSaisie": "2018-04-09T22:45:22.000+02:00",
    "sortEnSeance": "Rejeté"
  },
  "dateDepot": "2018-04-06T02:00:00.000+02:00",
  "dateDistribution": "2018-04-09T02:00:00.000+02:00",
  "article99": "0",
  "loiReference": {
    "codeLoi": "c transports",
    "divisionCodeLoi": "L2100-3-1"
  }
}