{
  "uid": "AMANR5L15PO419865B1831P0D1N3030",
  "identifiant": {
    "legislature": "15",
    "numero": "3030",
    "numRect": "0",
    "saisine": {
      "texteLegislatifRef": "PRJLANR5L15B1831",
      "numeroPartiePLF": "0",
      "organeExamen": "PO419865",
      "mentionSecondeDeliberation": "0"
    }
  },
  "numeroLong": "CD3030",
  "etapeTexte": "1ère lecture (2ème assemblée saisie)",
  "triAmendement": "edaaaaaaaaaaaaaaaaaaaaaaaaaaaaaaaaaaaaaaaaaaaaaaaabwh",
  "cardinaliteAmdtMultiples": "1",
  "etat": "Discuté",
  "signataires": {
    "auteur": {
      "typeAuteur": "Depute",
      "acteurRef": "PA722366",
      "groupePolitiqueRef": "PO730964"
    },
    "cosignatairesRefs": [
      "PA722366"
    ],
    "texteAffichable": "M.&#160;Fugit, rapporteur"
  },
  "pointeurFragmentTexte": {
    "division": {
      "titre": "Article 23",
      "articleDesignationCourte": "ART. 23",
      "type": "ARTICLE",
      "avantAApres": "A",
      "divisionRattachee": "ARTICLE 23",
      "urlDivisionTexteVise": "/15/textes/1831.asp#D_Article_23"
    },
    "alinea": {
      "avantAApres": "Apres",
      "numero": "32"
    }
  },
  "corps": {
    "dispositif": "<p style=\"text-align: justify;\">Apr&#232;s l&#8217;alin&#233;a&#160;32, ins&#233;rer les alin&#233;as suivants&#160;:</p><p style=\"text-align: justify;\">&#171;&#160;<i>Art.&#160;L.&#160;111&#8209;3&#8209;5&#8209;1.</i>&#160;-&#160;Le propri&#233;taire ou, en cas de copropri&#233;t&#233;, le syndicat des copropri&#233;taires d&#8217;un b&#226;timent r&#233;sidentiel comportant un parc de stationnement d&#8217;acc&#232;s s&#233;curis&#233; &#224; usage privatif de plus de vingt emplacements a l&#8217;obligation de proc&#233;der &#224; l&#8217;installation d&#8217;une infrastructure collective de recharge pour v&#233;hicules &#233;lectriques et hybrides rechargeables avant le 1<sup>er</sup> janvier 2025.</p><p style=\"text-align: justify;\">&#171;&#160;Une infrastructure collective de recharge consiste dans le pr&#233;-&#233;quipement mentionn&#233; &#224; l&#8217;article L.&#160;111&#8209;3&#8209;3 du pr&#233;sent code ainsi que dans la cr&#233;ation des installations &#233;lectriques collectives permettant le raccordement ult&#233;rieur de points de charges.</p><p style=\"text-align: justify;\">&#171;&#160;Un d&#233;cret en Conseil d&#8217;&#201;tat d&#233;termine les modalit&#233;s d&#8217;application du pr&#233;sent article.&#160;&#187;</p>",
    "exposeSommaire": "<p style=\"text-align: justify;\">Notre soci&#233;t&#233; est en train d&#8217;op&#233;rer un basculement vers des mobilit&#233;s plus propres, et notamment &#224; faibles &#233;missions, pour lutter contre le changement climatique et pour faire diminuer la pollution de l&#8217;air. Plusieurs articles du projet de loi accompagnent et renforcent cette orientation, en particulier les obligations pesant sur les renouvellements des flottes collectives en v&#233;hicules &#224; faibles &#233;missions, ou l&#8217;objectif de mettre fin &#224; la vente de v&#233;hicules neufs &#224; &#233;nergie fossile en 2040.</p><p style=\"text-align: justify;\">Cette transition impliquera n&#233;cessairement un fort d&#233;veloppement des v&#233;hicules &#233;lectriques et hybrides rechargeables (au sein d&#8217;un mix &#233;nerg&#233;tique diversifi&#233;). Les objectifs du Gouvernement en t&#233;moigne, notamment celui de multiplier par cinq le nombre de v&#233;hicules 100&#160;% &#233;lectriques entre 2017 et 2023 (contrat de fili&#232;re automobile). Dans cette perspective, l&#8217;article&#160;41 de la loi de transition &#233;nerg&#233;tique fixait l&#8217;objectif de 7 millions de points de charge. Par ailleurs, les projections des constructeurs laissent entendre que, dans dix ans, les v&#233;hicules &#233;lectriques ou hybrides rechargeables pourraient repr&#233;senter pr&#232;s de 40&#160;% des ventes de v&#233;hicules neufs.</p><p style=\"text-align: justify;\">Or, en l&#8217;&#233;tat actuel de la l&#233;gislation, les personnes dont l&#8217;emplacement de stationnement est dans une copropri&#233;t&#233; (8,4 millions de logement en France, soit 21&#160;% du parc immobilier) peuvent rencontrer de nombreuses difficult&#233;s pour installer une borne de recharge, le droit &#224; la prise &#233;tant difficile d&#8217;exercice. Le pr&#233;sent projet de loi apporte d&#8217;ailleurs des am&#233;liorations en la mati&#232;re.</p><p style=\"text-align: justify;\">Toutefois, le droit &#224; la prise lui-m&#234;me est insuffisant. En effet, il induit plusieurs effets dissuasifs&#160;:</p><p style=\"text-align: justify;\">1.&#160;Le premier &#224; s&#8217;&#233;quiper d&#8217;un point de recharge peut acquitter l&#8217;essentiel des frais d&#8217;&#233;quipement du parking, ce qui est &#224; la fois dissuasif et injuste&#160;;</p><p style=\"text-align: justify;\">2.&#160;Les raccordement peuvent se faire de mani&#232;re anarchique&#160;: l&#8217;installation initiale supporte le raccordement de quelques points de recharge mais devra &#234;tre ult&#233;rieurement refaite si le nombre de points augmente, entra&#238;nant des surco&#251;ts pour la copropri&#233;t&#233;&#160;;</p><p style=\"text-align: justify;\">3.&#160;Les d&#233;lais de raccordement sont souvent tr&#232;s longs et peuvent atteindre entre six mois et un an, ce qui n&#8217;est pas satisfaisant en cas d&#8217;acquisition de v&#233;hicule.</p><p style=\"text-align: justify;\">Il est donc propos&#233; de cr&#233;er une obligation d&#8217;installation de l&#8217;infrastructure collective permettant l&#8217;installation ult&#233;rieure de points de recharge, qui couplerait pr&#233;-&#233;quipement et installations &#233;lectriques. Afin de laisser le temps aux copropri&#233;t&#233;s de s&#8217;organiser, seules les principales seraient concern&#233;es (plus de 50 emplacements) et l&#8217;obligation n&#8217;interviendrait qu&#8217;&#224; horizon 2025.</p><p style=\"text-align: justify;\">Une telle obligation entre dans les comp&#233;tences du l&#233;gislateur, au vu de la jurisprudence du Conseil constitutionnel. Elle est en effet justifi&#233;e par un motif d&#8217;int&#233;r&#234;t g&#233;n&#233;ral (la protection de l&#8217;environnement et de la sant&#233; publique) et ne porte pas une atteinte disproportionn&#233;e au droit de propri&#233;t&#233;, dans la mesure o&#249; elle s&#8217;exerce uniquement sur des infrastructures collectives (parties communes) et o&#249; les co&#251;ts sont peu &#233;lev&#233;s (environ 7 000&#160;&#8364; pour 46 places de parking, selon l&#8217;AVERE, soit environ 150&#160;&#8364; par copropri&#233;taire), au regard notamment de pr&#233;c&#233;dentes obligations de mises aux normes (des ascenseurs par exemple). Par ailleurs, &#224; terme, elle permettra aux copropri&#233;t&#233;s d&#8217;&#233;conomiser des frais, ces infrastructures collectives devant, en tout &#233;tat de cause, &#234;tre cr&#233;&#233;es &#224; moyen terme.</p><p style=\"text-align: justify;\">Pour les copropri&#233;t&#233;s en difficult&#233;, une aide financi&#232;re pourrait &#234;tre pr&#233;vue, dispositif que l&#8217;article&#160;40 de la Constitution ne permet pas de proposer par voie d&#8217;amendement parlementaire.</p>"
  },
  "representations": [
    {
      "nom": "PDF",
      "typeMime": {
        "type": "application",
        "subType": "PDF"
      },
      "statutRepresentation": {
        "verbatim": true,
        "canonique": true,
        "officielle": true,
        "transcription": false,
        "enregistrement": false
      },
      "contenu": {
        "documentURI": "/15/amendements/1831/CION-DVP/CD3030.pdf"
      }
    }
  ],
  "sort": {
    "dateSaisie": "2019-05-17T19:35:41.000+02:00",
    "sortEnSeance": "Retiré"
  },
  "dateDepot": "2019-05-13T02:00:00.000+02:00",
  "dateDistribution": "2019-05-15T02:00:00.000+02:00",
  "article99": "0",
  "loiReference": {
    "codeLoi": "xxcharge élec"
  }
}