{
  "uid": "AMANR5L15PO766718B2187P0D1N2166",
  "identifiant": {
    "legislature": "15",
    "numero": "2166",
    "numRect": "0",
    "saisine": {
      "texteLegislatifRef": "PRJLANR5L15B2187",
      "numeroPartiePLF": "0",
      "organeExamen": "PO766718",
      "mentionSecondeDeliberation": "0"
    }
  },
  "numeroLong": "2166",
  "etapeTexte": "1ère lecture (1ère assemblée saisie)",
  "triAmendement": "bpaaaaaaaaaaaaaaaaaaaaaaaaaaaaaaaaaaaaaaaaaaaaaaaaws",
  "cardinaliteAmdtMultiples": "1",
  "etat": "Discuté",
  "signataires": {
    "auteur": {
      "typeAuteur": "Depute",
      "acteurRef": "PA340343",
      "groupePolitiqueRef": "PO758835"
    },
    "cosignatairesRefs": [
      "PA340343"
    ],
    "texteAffichable": "M.&#160;Saulignac, rapporteur"
  },
  "pointeurFragmentTexte": {
    "division": {
      "titre": "Article 9",
      "articleDesignationCourte": "ART. 9",
      "type": "ARTICLE",
      "avantAApres": "A",
      "divisionRattachee": "ARTICLE 9",
      "urlDivisionTexteVise": "/15/textes/2187.asp#D_Article_9"
    },
    "alinea": {
      "numero": "18"
    }
  },
  "corps": {
    "dispositif": "<p style=\"text-align: justify;\">&#192; la fin de l&#8217;alin&#233;a&#160;18, substituer aux mots&#160;:</p><p style=\"text-align: justify;\">&#171;&#160;de l&#8217;identifier&#160;&#187;</p><p style=\"text-align: justify;\">les mots&#160;:</p><p style=\"text-align: justify;\">&#171;&#160;identifier cette seconde personne&#160;&#187;.</p>",
    "exposeSommaire": "<p style=\"text-align: justify;\">Amendement r&#233;dactionnel.</p>"
  },
  "representations": [
    {
      "nom": "PDF",
      "typeMime": {
        "type": "application",
        "subType": "PDF"
      },
      "statutRepresentation": {
        "verbatim": true,
        "canonique": true,
        "officielle": true,
        "transcription": false,
        "enregistrement": false
      },
      "contenu": {
        "documentURI": "/15/amendements/2187/CSBIOETH/2166.pdf"
      }
    }
  ],
  "sort": {
    "dateSaisie": "2019-09-13T10:18:20.000+02:00",
    "sortEnSeance": "Adopté"
  },
  "dateDepot": "2019-09-08T02:00:00.000+02:00",
  "dateDistribution": "2019-09-10T02:00:00.000+02:00",
  "article99": "0",
  "loiReference": {}
}