{
  "uid": "AMANR5L15SEA717460BTC1019P0D1N1761",
  "identifiant": {
    "legislature": "15",
    "numero": "1761",
    "numRect": "0",
    "saisine": {
      "texteLegislatifRef": "PRJLANR5L15BTC1019",
      "numeroPartiePLF": "0",
      "organeExamen": "PO717460",
      "mentionSecondeDeliberation": "1"
    }
  },
  "numeroLong": "1761",
  "etapeTexte": "1ère lecture (1ère assemblée saisie)",
  "triAmendement": "cbmkzzzz",
  "cardinaliteAmdtMultiples": "1",
  "etat": "Discuté",
  "signataires": {
    "auteur": {
      "typeAuteur": "Depute",
      "acteurRef": "PA720586",
      "groupePolitiqueRef": "PO730934"
    },
    "cosignatairesRefs": [
      "PA720586"
    ],
    "texteAffichable": "M.&#160;Vatin"
  },
  "pointeurFragmentTexte": {
    "division": {
      "titre": "Article 15",
      "articleDesignationCourte": "ART. 15",
      "type": "ARTICLE",
      "avantAApres": "A",
      "divisionRattachee": "ARTICLE 15",
      "urlDivisionTexteVise": "/15/textes/1019.asp#D_Article_15"
    },
    "alinea": {
      "avantAApres": "Apres",
      "numero": "9"
    }
  },
  "corps": {
    "dispositif": "<p style=\"text-align: justify;\">Apr&#232;s l&#8217;alin&#233;a&#160;9, ins&#233;rer les sept alin&#233;as suivants&#160;:</p><p style=\"text-align: justify;\">&#171;&#160;1&#176;&#160;<i>bis</i>&#160;Apr&#232;s l&#8217;article L.&#160;6121&#8209;1, il est ins&#233;r&#233; un article L.&#160;6121&#8209;1&#8209;1 ainsi r&#233;dig&#233;&#160;:</p><p style=\"text-align: justify;\">&#171;&#160;<i>Art.&#160;L.&#160;6121&#8209;1&#8209;1</i>.&#160;&#8211;&#160;La r&#233;gion, en lien avec les acteurs &#233;conomiques de son territoire, &#233;labore une strat&#233;gie pluriannuelle des formations en alternance. Cette strat&#233;gie est d&#233;battue par le comit&#233; r&#233;gional de l&#8217;emploi, de la formation et de l&#8217;orientation professionnelles puis adopt&#233;e par d&#233;lib&#233;ration du conseil r&#233;gional. Cette strat&#233;gie vise notamment &#224;&#160;:</p><p style=\"text-align: justify;\">&#171;&#160;1&#176;Assurer une offre de formation professionnelle initiale sur l&#8217;ensemble du territoire r&#233;gional et r&#233;pondre aux besoins en comp&#233;tence de la r&#233;gion&#160;;</p><p style=\"text-align: justify;\">&#171;&#160;2&#176; D&#233;finir la politique r&#233;gionale d&#8217;investissement en faveur des centres de formation d&#8217;apprentis, en particulier dans une logique d&#8217;am&#233;nagement du territoire&#160;;</p><p style=\"text-align: justify;\">&#171;&#160;3&#176; Organiser la compl&#233;mentarit&#233; des formations dispens&#233;es par les lyc&#233;es professionnels et les centres de formation d&#8217;apprentis.</p><p style=\"text-align: justify;\">&#171;&#160;Dans le cadre de leurs responsabilit&#233;s en mati&#232;re d&#8217;apprentissage, les branches professionnelles et les op&#233;rateurs de comp&#233;tences prennent en compte la strat&#233;gie adopt&#233;e par le conseil r&#233;gional.</p><p style=\"text-align: justify;\">&#171;&#160;Les branches professionnelles et les op&#233;rateurs de comp&#233;tences transmettent chaque ann&#233;e &#224; la r&#233;gion un bilan de leurs interventions en mati&#232;re d&#8217;apprentissage sur le territoire r&#233;gional, selon des modalit&#233;s fix&#233;es par d&#233;cret en Conseil d&#8217;&#201;tat.&#160;&#187;&#160;;&#160;&#187;.</p>",
    "exposeSommaire": "<p style=\"text-align: justify;\">La r&#233;forme de l&#8217;apprentissage propos&#233;e par le projet de loi ne saurait conduire &#224; ce qu&#8217;il n&#8217;y ait plus un minimum de pilotage public de l&#8217;apprentissage alors m&#234;me qu&#8217;il s&#8217;agit de la formation de nos jeunes et d&#8217;un levier de d&#233;veloppement des territoires. Aussi, le pr&#233;sent amendement pr&#233;voit que la r&#233;gion, en lien avec les acteurs &#233;conomiques et les partenaires sociaux, &#233;labore une strat&#233;gie pluriannuelle des formations en alternance visant notamment &#224;&#160;:</p><p style=\"text-align: justify;\">- assurer une offre de formation professionnelle initiale sur l&#8217;ensemble du territoire r&#233;gional&#160;;</p><p style=\"text-align: justify;\">- d&#233;finir la politique r&#233;gionale d&#8217;investissement en faveur des centres de formation d&#8217;apprentis, en particulier dans une logique d&#8217;am&#233;nagement du territoire&#160;;</p><p style=\"text-align: justify;\">- organiser la compl&#233;mentarit&#233; des formations dispens&#233;es par les lyc&#233;es professionnels et les centres de formation d&#8217;apprentis.</p><p style=\"text-align: justify;\">Il pr&#233;voit en outre, dans un souci de coh&#233;rence avec les responsabilit&#233;s qui sont dor&#233;navant les leurs en mati&#232;re d&#8217;apprentissage, que les branches et les op&#233;rateurs de comp&#233;tence prennent en compte cette strat&#233;gie r&#233;gionale. Enfin, dans l&#8217;optique notamment de la d&#233;finition de la strat&#233;gie r&#233;gionale, les branches et op&#233;rateurs de comp&#233;tence transmettront &#224; la r&#233;gion un bilan annuel de leurs actions.</p>"
  },
  "representations": [
    {
      "nom": "PDF",
      "typeMime": {
        "type": "application",
        "subType": "PDF"
      },
      "statutRepresentation": {
        "verbatim": true,
        "canonique": true,
        "officielle": true,
        "transcription": false,
        "enregistrement": false
      },
      "contenu": {
        "documentURI": "/15/amendements/1019/AN/1761.pdf"
      }
    }
  ],
  "seanceDiscussion": "RUANR5L15S2018IDS21104",
  "sort": {
    "dateSaisie": "2018-06-15T12:29:16.000+02:00",
    "sortEnSeance": "Non soutenu"
  },
  "dateDepot": "2018-06-07T02:00:00.000+02:00",
  "dateDistribution": "2018-06-12T02:00:00.000+02:00",
  "article99": "0",
  "loiReference": {}
}