{
  "uid": "AMANR5L15SEA717460B2272P1D1N381",
  "identifiant": {
    "legislature": "15",
    "numero": "381",
    "numRect": "0",
    "saisine": {
      "texteLegislatifRef": "PRJLANR5L15B2272",
      "numeroPartiePLF": "1",
      "organeExamen": "PO717460",
      "mentionSecondeDeliberation": "0"
    }
  },
  "numeroLong": "I-381",
  "etapeTexte": "1ère lecture (1ère assemblée saisie)",
  "triAmendement": "bcaaaaaaaaaaaaaaaaaaaaaaaaaaaaaaaaaaaaaaaaaaaaaaaajiwkno",
  "cardinaliteAmdtMultiples": "1",
  "etat": "Discuté",
  "signataires": {
    "auteur": {
      "typeAuteur": "Depute",
      "acteurRef": "PA720230",
      "groupePolitiqueRef": "PO767217"
    },
    "cosignatairesRefs": [
      "PA331567",
      "PA268019",
      "PA719806",
      "PA720230",
      "PA610775",
      "PA267780",
      "PA267585",
      "PA721110",
      "PA342601",
      "PA267355",
      "PA267330",
      "PA721486",
      "PA722030",
      "PA332228",
      "PA266788",
      "PA721632",
      "PA720696",
      "PA712014",
      "PA642868"
    ],
    "texteAffichable": "Mme&#160;Magnier,  Mme&#160;Auconie, M.&#160;Benoit, M.&#160;Bournazel, M.&#160;Brindeau, M.&#160;Christophe, Mme&#160;de La Raudi&#232;re, Mme&#160;Descamps, Mme&#160;Firmin Le Bodo, M.&#160;Gom&#232;s, M.&#160;Herth, M.&#160;Lagarde, M.&#160;Ledoux, Mme&#160;Lemoine, M.&#160;Morel-&#192;-L&apos;Huissier, M.&#160;Naegelen, Mme&#160;Sanquer, M.&#160;Vercamer et M.&#160;Zumkeller"
  },
  "pointeurFragmentTexte": {
    "division": {
      "titre": "Article 5",
      "articleDesignationCourte": "APRÈS ART. 5",
      "type": "ARTICLE",
      "avantAApres": "Apres",
      "divisionRattachee": "APRÈS L'ARTICLE 5, insérer l'article suivant:",
      "articleAdditionnel": "1",
      "urlDivisionTexteVise": "/15/textes/2272A.asp#D_Article_5"
    }
  },
  "corps": {
    "dispositif": "<p>Apr&#232;s le quatri&#232;me alin&#233;a de l&#8217;article&#160;3 de la loi n&#176;&#160;72&#8209;657 du 13 juillet 1972 instituant des mesures en faveur de certaines cat&#233;gories de commer&#231;ants et artisans &#226;g&#233;s, il est ins&#233;r&#233; un alin&#233;a ainsi r&#233;dig&#233;&#160;:</p><p style=\"text-align: justify;\">&#171;&#160;Est &#233;galement assujettie &#224; la taxe sur les surfaces commerciales, la surface de stockage des entrep&#244;ts, qui ne sont pas int&#233;gr&#233;s &#224; des magasins de commerce de d&#233;tail et au d&#233;part desquels des biens stock&#233;s sont livr&#233;s directement, ou indirectement &#224; travers des entrep&#244;ts de transit, &#224; destination de toute personne physique ou morale non assujettie &#224; la taxe sur la valeur ajout&#233;e &#224; la suite d&#8217;une commande effectu&#233;e par voie &#233;lectronique, d&#232;s lors qu&#8217;elle d&#233;passe 400 m&#232;tres carr&#233;s. La taxe est due quelle que soit la forme juridique de l&#8217;entreprise qui les exploite d&#232;s lors que son chiffre d&#8217;affaires annuel hors taxes est sup&#233;rieur &#224; 460 000&#160;euros. Toutefois, sont exon&#233;r&#233;es de la taxe sur les surfaces de stockage les entreprises assujetties &#224; la taxe sur la surface de vente des magasins de commerce de d&#233;tail, d&#232;s lors que la surface de vente assujettie &#224; la taxe des magasins de commerce de d&#233;tail qu&#8217;elles exploitent est sup&#233;rieure &#224; la surface de stockage d&#233;finie ci-dessus. Lorsque des entreprises sont li&#233;es au sens du 12 de l&#8217;article&#160;39 du code g&#233;n&#233;ral des imp&#244;ts, cette exon&#233;ration s&#8217;applique &#224; toutes les entreprises li&#233;es, la surface de vente assujettie &#224; la taxe de magasins de commerce de d&#233;tail &#224; retenir &#233;tant la somme des surfaces de vente des magasins de commerce de d&#233;tail exploit&#233;s par l&#8217;ensemble de ces entreprises.&#160;&#187;</p>",
    "exposeSommaire": "<p style=\"text-align: justify;\">&#192; l&#8217;heure des g&#233;ants du num&#233;rique, le commerce fran&#231;ais, qui totalise aujourd&#8217;hui 47 milliards d&#8217;euros d&#8217;imp&#244;ts et autres pr&#233;l&#232;vements est sujet &#224; une fiscalit&#233; ancienne reposant sur le foncier, l&#8217;emp&#234;chant de rivaliser &#224; armes &#233;gales avec ses concurrents&#160;: La pression fiscale qui p&#232;se sur l&#8217;ensemble du commerce physique (jusqu&#8217;&#224; 90 taxes dont plus d&#8217;1/3 li&#233; &#224; la fiscalit&#233; fonci&#232;re) et parall&#232;lement les exemptions dont b&#233;n&#233;ficient les g&#233;ants du num&#233;rique constituent des &#233;l&#233;ments cons&#233;quents de distorsion de concurrence.</p><p style=\"text-align: justify;\">Les taxes locales, pay&#233;es par les acteurs du commerce fran&#231;ais, participent &#224; l&#8217;am&#233;nagement du territoire qu&#8217;utilise les &#171;&#160;pure players&#160;&#187; pour r&#233;aliser leur chiffre d&#8217;affaires alors que eux, a contrario, n&#8217;y contribue pas fiscalement.</p><p style=\"text-align: justify;\">Le pr&#233;sent amendement vise ainsi &#224; r&#233;tablir une &#233;quit&#233; fiscale et territoriale entre tous les acteurs du commerce&#160;:</p><p style=\"text-align: justify;\">&#8211;&#160; En int&#233;grant dans l&#8217;assiette de la Tascom les entrep&#244;ts de stockage des &#171;&#160;pure players&#160;&#187;, consid&#233;rant qu&#8217;ils constituent le dernier maillon avant le consommateur et qu&#8217;ils r&#233;alisent &#224; travers leurs entrep&#244;ts une v&#233;ritable op&#233;ration de vente commerciale, &#224; l&#8217;image des magasins physiques.</p><p style=\"text-align: justify;\">&#8211;&#160; Afin de ne pas doublement p&#233;naliser les acteurs du commerce d&#233;j&#224; redevables de la Tascom, la proposition pr&#233;voit une d&#233;duction de cette nouvelle Tascom pour les acteurs poss&#233;dant &#224; la fois des magasins physiques via leur emprise fonci&#232;re et des entrep&#244;ts logistiques.&#160;</p><p style=\"text-align: justify;\">Ainsi&#160;:</p><p style=\"text-align: justify;\">&#8211;&#160; Les entrep&#244;ts commerciaux des &#171;&#160;pure players&#160;&#187;, v&#233;ritables plateformes de vente commerciale, seront assujetties &#224; cette nouvelle Tascom.</p><p style=\"text-align: justify;\">&#8211;&#160; Un acteur disposant &#224; la fois d&#8217;un magasin et d&#8217;un entrep&#244;t ne continuera &#224; payer que sa Tascom sur son magasin physique, &#224; condition que la surface de vente des magasins de commerce de d&#233;tail soit sup&#233;rieure &#224; la surface de stockage. Cette condition permettant d&#8217;&#233;viter &#224; un &#171;&#160;pure player&#160;&#187; de se soustraire &#224; ce nouvel assujettissement en ouvrant un magasin de plus de 400m&#178;.</p>"
  },
  "representations": [
    {
      "nom": "PDF",
      "typeMime": {
        "type": "application",
        "subType": "PDF"
      },
      "statutRepresentation": {
        "verbatim": true,
        "canonique": true,
        "officielle": true,
        "transcription": false,
        "enregistrement": false
      },
      "contenu": {
        "documentURI": "/15/amendements/2272A/AN/381.pdf"
      }
    }
  ],
  "seanceDiscussion": "RUANR5L15S2020IDS21869",
  "sort": {
    "dateSaisie": "2019-10-18T12:49:01.000+02:00",
    "sortEnSeance": "Retiré"
  },
  "dateDepot": "2019-10-08T02:00:00.000+02:00",
  "dateDistribution": "2019-10-15T02:00:00.000+02:00",
  "article99": "0",
  "loiReference": {
    "codeLoi": "loi 72-657",
    "divisionCodeLoi": "3"
  }
}