{
  "uid": "AMANR5L15SEA717460B0235P2D1N683",
  "identifiant": {
    "legislature": "15",
    "numero": "683",
    "numRect": "0",
    "saisine": {
      "texteLegislatifRef": "PRJLANR5L15B0235",
      "numeroPartiePLF": "2",
      "organeExamen": "PO717460",
      "mentionSecondeDeliberation": "0"
    }
  },
  "numeroLong": "II-683",
  "etapeTexte": "1ère lecture (1ère assemblée saisie)",
  "triAmendement": "az",
  "cardinaliteAmdtMultiples": "1",
  "etat": "Discuté",
  "signataires": {
    "auteur": {
      "typeAuteur": "Depute",
      "acteurRef": "PA608016",
      "groupePolitiqueRef": "PO730934"
    },
    "cosignatairesRefs": [
      "PA334654",
      "PA720210",
      "PA643134",
      "PA1327",
      "PA721968",
      "PA267429",
      "PA332523",
      "PA709315",
      "PA608016",
      "PA642847",
      "PA720644",
      "PA609245",
      "PA718884",
      "PA606712",
      "PA718838",
      "PA718850",
      "PA266797",
      "PA608416"
    ],
    "texteAffichable": "Mme&#160;Louwagie,  M.&#160;Nury, Mme&#160;Bazin-Malgras, Mme&#160;Valentin, M.&#160;Straumann, M.&#160;Bazin, M.&#160;Lurton, M.&#160;Hetzel, Mme&#160;Beauvais, M.&#160;Cinieri, M.&#160;Cordier, M.&#160;Vialay, Mme&#160;Dalloz, Mme&#160;Lacroute, M.&#160;Brun, M.&#160;Gosselin, M.&#160;Viala et M.&#160;Forissier"
  },
  "pointeurFragmentTexte": {
    "division": {
      "titre": "Article 39",
      "articleDesignationCourte": "APRÈS ART. 39",
      "type": "ARTICLE",
      "avantAApres": "Apres",
      "divisionRattachee": "APRÈS L'ARTICLE 39, insérer l'article suivant:",
      "articleAdditionnel": "1",
      "urlDivisionTexteVise": "/15/textes/0235C.asp#D_Article_39"
    }
  },
  "corps": {
    "dispositif": "<p style=\"text-align: justify;\">I.&#160;&#8211;&#160;Apr&#232;s le I <i>quinquies</i> de l&#8217;article&#160;125&#8209;0 A du code g&#233;n&#233;ral des imp&#244;ts, il est ins&#233;r&#233; un I <i>sexies</i> A ainsi r&#233;dig&#233;&#160;:&#160;:</p><p style=\"text-align: justify;\">&#171;&#160;I<i> sexies</i> A.&#160;&#8211;&#160;Sont exon&#233;r&#233;s d&#8217;imp&#244;t sur le revenu, les produits attach&#233;s aux bons ou contrats de capitalisation et placements de m&#234;me nature mentionn&#233;s au I, souscrits &#224; compter du 1<sup>er</sup> janvier 2018, d&#8217;une dur&#233;e &#233;gale ou sup&#233;rieure &#224; huit ans et dans lesquels les primes vers&#233;es sont affect&#233;es pour 50&#160;% au moins en engagements vis&#233;s au chapitre IV du titre II du livre Ier du code des assurances.&#160;&#187;</p><p style=\"text-align: justify;\">II. Les contrats mentionn&#233;s au I, I <i>bis</i> et I <i>ter</i> de l&#8217;article&#160;125&#8209;0 A du code g&#233;n&#233;ral des imp&#244;ts peuvent, par avenant conclu avant le 1<sup>er</sup> juillet 2019, &#234;tre transform&#233;s en contrat mentionn&#233;s au I <i>sexies</i> A. Cette transformation n&#8217;entra&#238;ne pas les cons&#233;quences fiscales d&#8217;un d&#233;nouement du contrat qui conserve son ant&#233;riorit&#233;.</p><p style=\"text-align: justify;\">III.&#160;&#8211;&#160;La perte de recette de recettes pour l&#8217;&#201;tat est compens&#233; &#224; due concurrence par la cr&#233;ation d&#8217;une taxe additionnelle aux droits mentionn&#233;s aux articles 575 et 575 A du code g&#233;n&#233;ral des imp&#244;ts.&#160;</p>",
    "exposeSommaire": "<p style=\"text-align: justify;\">Pour r&#233;pondre &#224; la fois aux attentes des &#233;pargnants et au besoin de financement par&#160;fonds propres&#160;de l&#8217;&#233;conomie, il faut des produits d&#8217;&#233;pargne de long terme, moins liquides, mais pouvant &#233;ventuellement &#234;tre assortis d&#8217;une forme de protection du capital, et b&#233;n&#233;ficiant du rendement plus &#233;lev&#233; des actions dans la dur&#233;e.</p><p style=\"text-align: justify;\">Le pr&#233;sent amendement vise une exon&#233;ration unique aux contrats d&#233;tenus depuis huit ans ou plus et qui ont &#233;t&#233; investis durant cette p&#233;riode en engagements de type&#160;&#171;&#160;eurocroissance&#160;&#187;. L&#8217;objectif est de rediriger de mani&#232;re incitative le capital vers l&#8217;investissement productif et le tissu &#233;conomique de nos entreprises afin de le dynamiser, tout en privil&#233;giant la constitution de la pr&#233;paration &#224; la retraite.</p>"
  },
  "representations": [
    {
      "nom": "PDF",
      "typeMime": {
        "type": "application",
        "subType": "PDF"
      },
      "statutRepresentation": {
        "verbatim": true,
        "canonique": true,
        "officielle": true,
        "transcription": false,
        "enregistrement": false
      },
      "contenu": {
        "documentURI": "/15/amendements/0235C/AN/683.pdf"
      }
    }
  ],
  "seanceDiscussion": "RUANR5L15S2018IDS20766",
  "sort": {
    "dateSaisie": "2017-11-17T18:42:28.000+01:00",
    "sortEnSeance": "Rejeté"
  },
  "dateDepot": "2017-11-03T01:00:00.000+01:00",
  "dateDistribution": "2017-11-15T01:00:00.000+01:00",
  "article99": "0",
  "loiReference": {
    "codeLoi": "CGI",
    "divisionCodeLoi": "125-0 A"
  }
}