{
  "uid": "AMANR5L15SEA717460BTC1237P0D1N1294",
  "identifiant": {
    "legislature": "15",
    "numero": "1294",
    "numRect": "0",
    "saisine": {
      "texteLegislatifRef": "PRJLANR5L15BTC1237",
      "numeroPartiePLF": "0",
      "organeExamen": "PO717460",
      "mentionSecondeDeliberation": "0"
    }
  },
  "numeroLong": "1294",
  "etapeTexte": "1ère lecture (1ère assemblée saisie)",
  "triAmendement": "bacaaaaaaaaaaaaaaaaaaaaaaaaaaaaaaaaaaaaaaaaaaaaaaaihzs",
  "cardinaliteAmdtMultiples": "1",
  "etat": "Discuté",
  "signataires": {
    "auteur": {
      "typeAuteur": "Depute",
      "acteurRef": "PA719146",
      "groupePolitiqueRef": "PO723569"
    },
    "cosignatairesRefs": [
      "PA719146"
    ],
    "texteAffichable": "M.&#160;Acquaviva"
  },
  "pointeurFragmentTexte": {
    "division": {
      "titre": "Article 12",
      "articleDesignationCourte": "ART. 12",
      "type": "ARTICLE",
      "avantAApres": "A",
      "divisionRattachee": "ARTICLE 12",
      "urlDivisionTexteVise": "/15/textes/1237.asp#D_Article_12"
    }
  },
  "corps": {
    "dispositif": "<p>Supprimer cet article.</p>",
    "exposeSommaire": "<p style=\"text-align: justify;\">L&#8217;article&#160;12 vise &#224; supprimer l&#8217;obligation faite aux chefs d&#8217;entreprise assujettis au r&#233;gime de la micro-entreprise de d&#233;dier un compte bancaire &#224; leur activit&#233; professionnelle.</p><p style=\"text-align: justify;\">Cette obligation est toutefois maintenue lorsque le chiffre d&#8217;affaires a d&#233;pass&#233;, pendant deux ann&#233;es civiles cons&#233;cutives, un montant annuel de 10 000&#160;&#8364; (5 000&#160;euros dans la version initiale du projet de loi).</p><p style=\"text-align: justify;\">L&#8217;ouverture d&#8217;un compte bancaire s&#233;par&#233; fait partie des r&#232;gles &#233;l&#233;mentaires de la bonne et saine gestion de l&#8217;activit&#233; pour un chef d&#8217;entreprise, quel que soit le montant de son chiffre d&#8217;affaires et d&#232;s le d&#233;marrage de son activit&#233;, en particulier pour celui qui n&#8217;est pas oblig&#233; de tenir une comptabilit&#233;.</p><p style=\"text-align: justify;\">Le pr&#233;sent amendement vise donc &#224; sauvegarder ce principe et maintenir cette obligation pour les chefs d&#8217;entreprise assujettis au r&#233;gime de la micro-entreprise.</p>"
  },
  "representations": [
    {
      "nom": "PDF",
      "typeMime": {
        "type": "application",
        "subType": "PDF"
      },
      "statutRepresentation": {
        "verbatim": true,
        "canonique": true,
        "officielle": true,
        "transcription": false,
        "enregistrement": false
      },
      "contenu": {
        "documentURI": "/15/amendements/1237/AN/1294.pdf"
      }
    }
  ],
  "seanceDiscussion": "RUANR5L15S2018IDS21251",
  "sort": {
    "dateSaisie": "2018-09-27T19:06:06.000+02:00",
    "sortEnSeance": "Non soutenu"
  },
  "dateDepot": "2018-09-20T02:00:00.000+02:00",
  "dateDistribution": "2018-09-24T02:00:00.000+02:00",
  "article99": "0",
  "loiReference": {}
}