{
  "uid": "AMANR5L15PO757134B1088P0D1N1930",
  "identifiant": {
    "legislature": "15",
    "numero": "1930",
    "numRect": "0",
    "saisine": {
      "texteLegislatifRef": "PRJLANR5L15B1088",
      "numeroPartiePLF": "0",
      "organeExamen": "PO757134",
      "mentionSecondeDeliberation": "0"
    }
  },
  "numeroLong": "1930",
  "etapeTexte": "1ère lecture (1ère assemblée saisie)",
  "triAmendement": "abaaaaaaaaaaaaaaaaaaaaaaaaaaaaaaaaaaaaaaaaaaaaaaaaoddddddddddhzzzvl",
  "cardinaliteAmdtMultiples": "1",
  "etat": "Discuté",
  "signataires": {
    "auteur": {
      "typeAuteur": "Depute",
      "acteurRef": "PA720728",
      "groupePolitiqueRef": "PO730970"
    },
    "cosignatairesRefs": [
      "PA718978",
      "PA720728",
      "PA719874",
      "PA720162",
      "PA720746"
    ],
    "texteAffichable": "M.&#160;Mattei,  M.&#160;Bolo, Mme&#160;Jacquier-Laforge, M.&#160;Laqhila et M.&#160;Waserman"
  },
  "pointeurFragmentTexte": {
    "division": {
      "titre": "Article PREMIER",
      "articleDesignationCourte": "ART. PREMIER",
      "type": "ARTICLE",
      "avantAApres": "A",
      "divisionRattachee": "ARTICLE PREMIER",
      "urlDivisionTexteVise": "/15/textes/1088.asp#D_Article_1er"
    },
    "alinea": {
      "numero": "9"
    }
  },
  "corps": {
    "dispositif": "<p style=\"text-align: justify;\">&#192; la seconde phrase de l&#8217;alin&#233;a&#160;9, substituer &#224; la seconde occurrence du mot&#160;:</p><p style=\"text-align: justify;\">&#171;&#160;des&#160;&#187;,</p><p style=\"text-align: justify;\">les mots&#160;:</p><p style=\"text-align: justify;\">&#171;&#160;de tous les&#160;&#187;.</p>",
    "exposeSommaire": "<p style=\"text-align: justify;\">L&#8217;article&#160;1<sup>er</sup> vise &#224; substituer aux diff&#233;rents r&#233;seaux de centres de formalit&#233;s des entreprises (CFE) un guichet &#233;lectronique unique, collectant l&#8217;ensemble des informations et des pi&#232;ces n&#233;cessaires &#224; l&#8217;&#233;laboration du dossier et constituant l&#8217;interface directe entre les organismes destinataires et les entreprises, quels que soient l&#8217;activit&#233;, le lieu d&#8217;implantation et la forme juridique de ces derni&#232;res. Le dossier serait ensuite d&#233;pos&#233; par voie &#233;lectronique.</p><p style=\"text-align: justify;\">L&#8217;article pr&#233;cise que ce d&#233;p&#244;t vaut d&#233;claration d&#232;s lors qu&#8217;il est r&#233;gulier et complet au regard des r&#232;gles applicables aux formalit&#233;s &#224; accomplir aupr&#232;s des destinataires concern&#233;s.</p><p style=\"text-align: justify;\">Afin de s&#233;curiser juridiquement les effets du d&#233;p&#244;t du dossier par voie &#233;lectronique, il est propos&#233; que tous les destinataires concern&#233;s (les services fiscaux, les Urssaf, les caisses sociales, les r&#233;pertoires des m&#233;tiers et les registres du commerce et des soci&#233;t&#233;s) peuvent en appr&#233;cier la validit&#233;, conform&#233;ment &#224; leurs missions.</p>"
  },
  "representations": [
    {
      "nom": "PDF",
      "typeMime": {
        "type": "application",
        "subType": "PDF"
      },
      "statutRepresentation": {
        "verbatim": true,
        "canonique": true,
        "officielle": true,
        "transcription": false,
        "enregistrement": false
      },
      "contenu": {
        "documentURI": "/15/amendements/1088/CSPACTE/1930.pdf"
      }
    }
  ],
  "sort": {
    "dateSaisie": "2018-09-06T16:06:50.000+02:00",
    "sortEnSeance": "Retiré"
  },
  "dateDepot": "2018-09-03T02:00:00.000+02:00",
  "dateDistribution": "2018-09-05T02:00:00.000+02:00",
  "article99": "0",
  "loiReference": {}
}