{
  "uid": "AMANR5L15SEA717460B0387P0D1N310",
  "identifiant": {
    "legislature": "15",
    "numero": "310",
    "numRect": "0",
    "saisine": {
      "texteLegislatifRef": "PRJLANR5L15B0387",
      "numeroPartiePLF": "0",
      "organeExamen": "PO717460",
      "mentionSecondeDeliberation": "0"
    }
  },
  "numeroLong": "310",
  "etapeTexte": "Nouvelle Lecture",
  "triAmendement": "cxk",
  "cardinaliteAmdtMultiples": "1",
  "etat": "Discuté",
  "signataires": {
    "auteur": {
      "typeAuteur": "Rapporteur",
      "acteurRef": "PA642788",
      "organeRef": "PO420120",
      "groupePolitiqueRef": "PO730964"
    },
    "cosignatairesRefs": [
      "PA642788"
    ],
    "texteAffichable": "M.&#160;V&#233;ran, rapporteur au nom de la commission des affaires sociales"
  },
  "pointeurFragmentTexte": {
    "division": {
      "titre": "Article 7",
      "articleDesignationCourte": "ART. 7",
      "type": "ARTICLE",
      "avantAApres": "A",
      "divisionRattachee": "ARTICLE 7",
      "urlDivisionTexteVise": "/15/textes/0387.asp#D_Article_7"
    },
    "alinea": {
      "numero": "9"
    }
  },
  "corps": {
    "dispositif": "<p>I.&#160;&#8211;&#160;&#192; l&#8217;alin&#233;a&#160;9, r&#233;tablir le <i>d</i> dans la r&#233;daction suivante&#160;:</p><p>&#171;&#160;<i>d)</i>&#160;Au 2&#176; du II, le taux&#160;: &#171;&#160;6,6&#160;%&#160;&#187; est remplac&#233; par le taux&#160;: &#171;&#160;8,3&#160;%&#160;&#187;&#160;;&#160;&#187;</p><p>II.&#160;&#8211;&#160;En cons&#233;quence, supprimer l&#8217;alin&#233;a&#160;60.</p>",
    "exposeSommaire": "<p style=\"text-align: justify;\">Cet amendement r&#233;tablit le texte vot&#233; en premi&#232;re lecture par l&#8217;Assembl&#233;e nationale s&#8217;agissant de l&#8217;augmentation de 1,7&#160;point du taux de contribution sociale g&#233;n&#233;ralis&#233;e (CSG) sur les pensions de retraite et d&#8217;invalidit&#233;.</p><p style=\"text-align: justify;\">Le S&#233;nat a en effet d&#233;cid&#233; de maintenir constant le taux de CSG sur ces revenus, contrairement &#224; ce que pr&#233;voyait le projet de loi initial, non modifi&#233; sur ce point par l&#8217;Assembl&#233;e nationale, au terme d&#8217;un d&#233;bat tr&#232;s nourri.</p><p style=\"text-align: justify;\">Le Gouvernement et la majorit&#233; ont fait le choix de redonner du pouvoir d&#8217;achat aux actifs, en supprimant les cotisations salariales maladie et ch&#244;mage. Le financement de cette mesure essentielle repose sur une augmentation de 1,7&#160;point des taux de CSG, imp&#244;t qui frappe toutes les cat&#233;gories de revenus, notamment les revenus du capital et les pensions de retraite et d&#8217;invalidit&#233;.</p><p style=\"text-align: justify;\">S&#8217;agissant des pensions, il faut pr&#233;ciser plusieurs &#233;l&#233;ments&#160;:</p><ul style=\"text-align: justify;\"><li>le taux de CSG sur ces revenus est plus faible que celui qui frappe les revenus d'activit&#233; (6,6&#160;% contre 7,5&#160;% en l'&#233;tat du droit);</li><li>les pensions les plus modestes, exon&#233;r&#233;es ou assujetties au taux r&#233;duit de 3,8&#160;%, ne sont pas concern&#233;es par la hausse pr&#233;vue par l'article&#160;7. Seules le seront celles qui exc&#232;dent environ 1&#160;400&#160;euros nets par mois pour une personne seule de plus de 65&#160;ans;</li><li>le niveau de vie moyen des retrait&#233;s est, selon les derni&#232;res &#233;tudes disponibles, l&#233;g&#232;rement sup&#233;rieur &#224; celui des actifs (106 pour une base 100, selon le Conseil d'orientation des retraites);</li><li>pour les personnes seules de plus de 65&#160;ans percevant entre 1&#160;400 et 2&#160;500 de pension nette mensuelle, le d&#233;gr&#232;vement de taxe d'habitation pr&#233;vu par le projet de loi de finances pour 2018 devrait permettre, en r&#233;gime de croisi&#232;re, de compenser l'augmentation de CSG.</li></ul><p style=\"text-align: justify;\">Comme en premi&#232;re lecture, il n&#8217;appara&#238;t donc pas souhaitable d&#8217;introduire dans la l&#233;gislation un nouveau taux r&#233;duit de CSG, g&#233;n&#233;rant une perte de recettes de 4,5&#160;milliards d&#8217;euros.&#160;</p>"
  },
  "representations": [
    {
      "nom": "PDF",
      "typeMime": {
        "type": "application",
        "subType": "PDF"
      },
      "statutRepresentation": {
        "verbatim": true,
        "canonique": true,
        "officielle": true,
        "transcription": false,
        "enregistrement": false
      },
      "contenu": {
        "documentURI": "/15/amendements/0387/AN/310.pdf"
      }
    }
  ],
  "seanceDiscussion": "RUANR5L15S2018IDS20788",
  "sort": {
    "dateSaisie": "2017-11-28T22:51:42.000+01:00",
    "sortEnSeance": "Adopté"
  },
  "dateDepot": "2017-11-27T01:00:00.000+01:00",
  "dateDistribution": "2017-11-28T01:00:00.000+01:00",
  "article99": "1",
  "loiReference": {}
}