{
  "uid": "AMANR5L15PO59051B2343P0D1N49",
  "identifiant": {
    "legislature": "15",
    "numero": "49",
    "numRect": "0",
    "saisine": {
      "texteLegislatifRef": "PNREANR5L15B2343",
      "numeroPartiePLF": "0",
      "organeExamen": "PO59051",
      "mentionSecondeDeliberation": "0"
    }
  },
  "numeroLong": "CL49",
  "etapeTexte": "Lecture unique",
  "triAmendement": "eaaaaaaaaaaaaaaaaaaaaaaaaaaaaaaaaaaaaaaaaaaaaaaaaazk",
  "cardinaliteAmdtMultiples": "1",
  "etat": "Discuté",
  "signataires": {
    "auteur": {
      "typeAuteur": "Depute",
      "acteurRef": "PA330240",
      "groupePolitiqueRef": "PO730934"
    },
    "cosignatairesRefs": [
      "PA330684",
      "PA642847",
      "PA605991",
      "PA330240",
      "PA267204",
      "PA719318",
      "PA346218",
      "PA608826",
      "PA608416",
      "PA223837",
      "PA336316",
      "PA722390",
      "PA718884",
      "PA2492",
      "PA721314"
    ],
    "texteAffichable": "M.&#160;Ciotti,  M.&#160;Quentin, M.&#160;Masson, M.&#160;Sermier, Mme&#160;Duby-Muller, Mme&#160;Bazin-Malgras, Mme&#160;Anthoine, M.&#160;Bazin, M.&#160;Hetzel, M.&#160;Schellenberger, M.&#160;Brochand, Mme&#160;Genevard, Mme&#160;Val&#233;rie&#160;Boyer, Mme&#160;Corneloup et M.&#160;Bouchet"
  },
  "pointeurFragmentTexte": {
    "division": {
      "titre": "Article unique",
      "articleDesignationCourte": "ART. UNIQUE",
      "type": "ARTICLE",
      "avantAApres": "A",
      "divisionRattachee": "ARTICLE UNIQUE",
      "urlDivisionTexteVise": "/15/textes/2343.asp#D_Article_unique"
    },
    "alinea": {
      "avantAApres": "A",
      "numero": "28",
      "alineaDesignation": "Alinéa 28"
    }
  },
  "corps": {
    "dispositif": "<p style=\"text-align: justify;\">Compl&#233;ter l&#8217;alin&#233;a&#160;28 par les mots&#160;:</p><p style=\"text-align: justify;\">&#171;&#160;et invite &#224; mener cette r&#233;flexion autour, notamment, d&#8217;une meilleure &#233;valuation de la r&#233;alit&#233; de la minorit&#233; et des modalit&#233;s de prise en charge des mineurs par l&#8217;&#201;tat&#160;&#187;.</p>",
    "exposeSommaire": "<p>En France, le nombre de mineurs non accompagn&#233;s connait une hausse significative:&#160; on recense environ 40&#160;000 mineurs non accompagn&#233;s, contre seulement 264 il y a 20 ans. Cela repr&#233;sente un co&#251;t annuel de pr&#232;s de 2 milliards d&#8217;euros par an pour les d&#233;partements, l&#8217;Etat ne prenant en charge que 15% de ces frais.</p><p>&#160;</p><p>&#160;Dans les Alpes maritimes, 2&#160;238 MNA ont &#233;t&#233; accueillis par le CD06 en 2018 et 1&#160;600 depuis le d&#233;but de l&#8217;ann&#233;e 2019. Pour le D&#233;partement des Alpes-Maritimes cela repr&#233;sente un co&#251;t de 14,1 millions d'euros pr&#233;vus en 2019, en hausse d'1 million d'euros par rapport &#224; 2018. Or seulement 2,4 millions d'euros compens&#233;s par l'Etat.</p><p>La proposition de r&#233;solution &#171;&#160;Demande que s&#8217;intensifie la r&#233;flexion autour des mesures pour traiter de la situation particuli&#232;re des mineurs non accompagn&#233;s en &#233;tablissant une politique et un cadre europ&#233;ens communs.&#160;&#187;. Si cette disposition va dans le bon sens, il convient en outre d&#8217;inviter &#224; une r&#233;flexion autour des modalit&#233;s d&#8217;une meilleure &#233;valuation de la r&#233;alit&#233; de la minorit&#233; et des modalit&#233;s de prise en charge des mineurs par l&#8217;Etat. En effet, leur prise en charge doit en premier lieu relever de la responsabilit&#233; de celui-ci, et non relever des d&#233;partements.</p>"
  },
  "representations": [
    {
      "nom": "PDF",
      "typeMime": {
        "type": "application",
        "subType": "PDF"
      },
      "statutRepresentation": {
        "verbatim": true,
        "canonique": true,
        "officielle": true,
        "transcription": false,
        "enregistrement": false
      },
      "contenu": {
        "documentURI": "/15/amendements/2343/CION_LOIS/CL49.pdf"
      }
    }
  ],
  "sort": {
    "dateSaisie": "2019-11-13T11:56:06.000+01:00",
    "sortEnSeance": "Rejeté"
  },
  "dateDepot": "2019-11-12T01:00:00.000+01:00",
  "dateDistribution": "2019-11-12T01:00:00.000+01:00",
  "article99": "0",
  "loiReference": {
    "codeLoi": "3"
  }
}