{
  "uid": "AMANR5L15PO59048B2272P1D1N1218",
  "identifiant": {
    "legislature": "15",
    "numero": "1218",
    "numRect": "0",
    "saisine": {
      "texteLegislatifRef": "PRJLANR5L15B2272",
      "numeroPartiePLF": "1",
      "organeExamen": "PO59048",
      "mentionSecondeDeliberation": "0"
    }
  },
  "numeroLong": "I-CF1218",
  "etapeTexte": "1ère lecture (1ère assemblée saisie)",
  "triAmendement": "fcaaaaaaaaaaaaaaaaaaaaaaaaaaaaaaaaaaaaaaaaaaaaaaaakkc",
  "cardinaliteAmdtMultiples": "1",
  "etat": "Irrecevable",
  "signataires": {
    "auteur": {
      "typeAuteur": "Depute",
      "acteurRef": "PA719092",
      "groupePolitiqueRef": "PO730964"
    },
    "cosignatairesRefs": [
      "PA609520",
      "PA719092",
      "PA720538"
    ],
    "texteAffichable": "Mme&#160;Tuffnell,  Mme&#160;Pompili et Mme&#160;De Temmerman"
  },
  "pointeurFragmentTexte": {
    "division": {
      "titre": "Article 20",
      "articleDesignationCourte": "APRÈS ART. 20",
      "type": "ARTICLE",
      "avantAApres": "Apres",
      "divisionRattachee": "APRÈS L'ARTICLE 20, insérer l'article suivant:",
      "articleAdditionnel": "1",
      "urlDivisionTexteVise": "/15/textes/2272A.asp#D_Article_20"
    }
  },
  "corps": {},
  "representations": [
    {
      "nom": "PDF",
      "typeMime": {
        "type": "application",
        "subType": "PDF"
      },
      "statutRepresentation": {
        "verbatim": true,
        "canonique": true,
        "officielle": true,
        "transcription": false,
        "enregistrement": false
      },
      "contenu": {
        "documentURI": "/15/amendements/2272A/CION_FIN/CF1218.pdf"
      }
    }
  ],
  "dateDepot": "2019-10-04T02:00:00.000+02:00",
  "dateDistribution": "2019-10-05T02:00:00.000+02:00",
  "article99": "0",
  "loiReference": {
    "codeLoi": "c urbanisme",
    "divisionCodeLoi": "L 331-12"
  }
}