{
  "uid": "AMANR5L15SEA717460BTC1884P0D1N13",
  "identifiant": {
    "legislature": "15",
    "numero": "13",
    "numRect": "0",
    "saisine": {
      "texteLegislatifRef": "PIONANR5L15BTC1884",
      "numeroPartiePLF": "0",
      "organeExamen": "PO717460",
      "mentionSecondeDeliberation": "0"
    }
  },
  "numeroLong": "13",
  "etapeTexte": "deuxième lecture",
  "triAmendement": "daaaaaaaaaaaaaaaaaaaaaaaaaaaaaaaaaaaaaaaaaaaaaaaaag",
  "cardinaliteAmdtMultiples": "1",
  "etat": "Discuté",
  "signataires": {
    "auteur": {
      "typeAuteur": "Depute",
      "acteurRef": "PA718884",
      "groupePolitiqueRef": "PO730934"
    },
    "cosignatairesRefs": [
      "PA718884"
    ],
    "texteAffichable": "Mme&#160;Bazin-Malgras"
  },
  "pointeurFragmentTexte": {
    "division": {
      "titre": "Article 1er ter",
      "articleDesignationCourte": "ART. 1ER TER",
      "type": "ARTICLE",
      "avantAApres": "A",
      "divisionRattachee": "ARTICLE 1ER TER",
      "urlDivisionTexteVise": "/15/textes/1884.asp#D_Articles_1er_ter_et_1er_quater"
    }
  },
  "corps": {
    "dispositif": "<p style=\"text-align: justify;\">R&#233;tablir cet article dans la r&#233;daction suivante&#160;:</p><p style=\"text-align: justify;\">&#171;&#160;Le code du travail est ainsi modifi&#233;&#160;:</p><p style=\"text-align: justify;\">1&#176;&#160;L&#8217;article&#160;L.&#160;3142&#8209;58&#8209;1 est compl&#233;t&#233; par une phrase ainsi r&#233;dig&#233;e&#160;: &#171;&#160;Ce maintien est de droit pour la mise en &#339;uvre, dans la limite d&#8217;un jour ouvrable, du droit &#224; cong&#233; du salari&#233; mentionn&#233; au&#160;1&#176;&#160;de l&#8217;article&#160;L.&#160;3142&#8209;54&#8209;1.&#160;&#187;&#160;;</p><p style=\"text-align: justify;\">2&#176;&#160;Le&#160;1&#176; de l&#8217;article&#160;L.&#160;3142&#8209;59 est compl&#233;t&#233; par les mots&#160;: &#171;&#160;, dont un jour pendant lequel le salari&#233; a droit au maintien total par l&#8217;employeur de sa r&#233;mun&#233;ration pour la mise en &#339;uvre du droit &#224; cong&#233; du salari&#233; mentionn&#233; au&#160;1&#176; de l&#8217;article&#160;L.&#160;3142&#8209;54&#8209;1&#160;&#187;.&#160;&#187;</p>",
    "exposeSommaire": "<p style=\"text-align: justify;\">La commission des affaires culturelles et de l&#8217;&#233;ducation a supprim&#233; l&#8217;article&#160;1<sup>er</sup> <i>ter</i> introduit lors des d&#233;bats au S&#233;nat. Celui-ci a pour objet de pr&#233;voir la r&#233;mun&#233;ration par l&#8217;employeur des cong&#233;s pris par les salari&#233;s exer&#231;ant des activit&#233;s b&#233;n&#233;voles, dans la limite d&#8217;un jour. Cette disposition qui reste mesur&#233;e puisque r&#233;duite &#224; un jour faciliterait consid&#233;rablement l&#8217;engagement associatif.</p><p style=\"text-align: justify;\">Cet amendement propose alors de r&#233;tablir la disposition supprim&#233;e.</p>"
  },
  "representations": [
    {
      "nom": "PDF",
      "typeMime": {
        "type": "application",
        "subType": "PDF"
      },
      "statutRepresentation": {
        "verbatim": true,
        "canonique": true,
        "officielle": true,
        "transcription": false,
        "enregistrement": false
      },
      "contenu": {
        "documentURI": "/15/amendements/1884/AN/13.pdf"
      }
    }
  ],
  "sort": {
    "dateSaisie": "2019-05-09T09:34:29.000+02:00",
    "sortEnSeance": "Non soutenu"
  },
  "dateDepot": "2019-05-06T02:00:00.000+02:00",
  "dateDistribution": "2019-05-07T02:00:00.000+02:00",
  "article99": "0",
  "loiReference": {}
}