{
  "uid": "AMANR5L15SEA717460B2272P1D1N1552",
  "identifiant": {
    "legislature": "15",
    "numero": "1552",
    "numRect": "1",
    "saisine": {
      "texteLegislatifRef": "PRJLANR5L15B2272",
      "numeroPartiePLF": "1",
      "organeExamen": "PO717460",
      "mentionSecondeDeliberation": "0"
    }
  },
  "numeroLong": "I-1552 (Rect)",
  "etapeTexte": "1ère lecture (1ère assemblée saisie)",
  "triAmendement": "bbiaaaaaaaaaaaaaaaaaaaaaaaaaaaaaaaaaaaaaaaaaaaaaaacknzzzwzw",
  "cardinaliteAmdtMultiples": "1",
  "etat": "Discuté",
  "signataires": {
    "auteur": {
      "typeAuteur": "Depute",
      "acteurRef": "PA608172",
      "groupePolitiqueRef": "PO758835"
    },
    "cosignatairesRefs": [
      "PA610681",
      "PA340343",
      "PA607553",
      "PA429893",
      "PA609332",
      "PA642764",
      "PA333818",
      "PA337483",
      "PA719930",
      "PA1592",
      "PA1008",
      "PA1809",
      "PA608741",
      "PA335532",
      "PA267233",
      "PA720988",
      "PA643145",
      "PA342415",
      "PA340357",
      "PA605069",
      "PA508",
      "PA608695",
      "PA335054",
      "PA608011",
      "PA332614",
      "PA1198",
      "PA333285",
      "PA609590",
      "PA608172"
    ],
    "texteAffichable": "Mme&#160;Pires Beaune,  M.&#160;Jean-Louis&#160;Bricout, M.&#160;David&#160;Habib, Mme&#160;Rabault, M.&#160;Aviragnet, Mme&#160;Bareigts, Mme&#160;Battistel, Mme&#160;Bi&#233;mouret, M.&#160;Bouillon, M.&#160;Carvounas, M.&#160;Alain&#160;David, Mme&#160;Laurence&#160;Dumont, M.&#160;Faure, M.&#160;Garot, M.&#160;Hutin, M.&#160;Juanico, Mme&#160;Karamanli, M.&#160;J&#233;r&#244;me&#160;Lambert, M.&#160;Letchimy, Mme&#160;Manin, Mme&#160;Pau-Langevin, M.&#160;Potier, M.&#160;Pueyo, M.&#160;Saulignac, Mme&#160;Tolmont, Mme&#160;Untermaier, Mme&#160;Vainqueur-Christophe, M.&#160;Vallaud, Mme&#160;Victory et les membres du groupe Socialistes et apparent&#233;s"
  },
  "pointeurFragmentTexte": {
    "division": {
      "titre": "Article 5",
      "articleDesignationCourte": "ART. 5",
      "type": "ARTICLE",
      "avantAApres": "A",
      "divisionRattachee": "ARTICLE 5",
      "urlDivisionTexteVise": "/15/textes/2272A.asp#D_Article_5"
    },
    "alinea": {
      "numero": "420"
    }
  },
  "corps": {
    "dispositif": "<p style=\"text-align: justify;\">I.&#160;&#8211;&#160;&#192; l&#8217;alin&#233;a&#160;420, apr&#232;s le mot&#160;:</p><p style=\"text-align: justify;\">&#171;&#160;cours&#160;&#187;,</p><p style=\"text-align: justify;\">ins&#233;rer les mots&#160;:</p><p style=\"text-align: justify;\">&#171;&#160;du premier semestre&#160;&#187;.</p><p style=\"text-align: justify;\">II.&#160;&#8211;&#160;En cons&#233;quence, &#224; l&#8217;alin&#233;a&#160;421, substituer au mot&#160;:&#160;</p><p style=\"text-align: justify;\">&#171;&#160;avril&#160;&#187;</p><p style=\"text-align: justify;\">le mot&#160;:</p><p style=\"text-align: justify;\">&#171;&#160;mars&#160;&#187;.</p>",
    "exposeSommaire": "<p style=\"text-align: justify;\">Cet amendement du groupe Socialistes et apparent&#233;s vise &#224; pr&#233;ciser le calendrier de pr&#233;sentation de l&#8217;&#233;valuation du dispositif de compensation.</p><p style=\"text-align: justify;\">Avec cet amendement, cette &#233;valuation devra &#234;tre pr&#233;sent&#233;e au premier semestre 2023 avec un rapport du Gouvernement remis au Parlement avant le 1<sup>er</sup> f&#233;vrier 2023.</p><p style=\"text-align: justify;\">Pour rappel, ce rapport devra pr&#233;senter les effets du dispositif de compensation et notamment&#160;:</p><ul style=\"text-align: justify;\"><li>les cons&#233;quences sur les ressources financi&#232;res des communes</li><li>l'impact sur l'&#233;volution de la fiscalit&#233; directe locale et, le cas &#233;ch&#233;ant, les cons&#233;quences de la r&#233;vision des valeurs locatives des locaux d'habitation</li><li>l'impact sur le budget de l'&#201;tat</li></ul><p style=\"text-align: justify;\">Cet amendement est issu des travaux de la D&#233;l&#233;gation aux collectivit&#233;s territoriales et &#224; la d&#233;centralisation</p>"
  },
  "representations": [
    {
      "nom": "PDF",
      "typeMime": {
        "type": "application",
        "subType": "PDF"
      },
      "statutRepresentation": {
        "verbatim": true,
        "canonique": true,
        "officielle": true,
        "transcription": false,
        "enregistrement": false
      },
      "contenu": {
        "documentURI": "/15/amendements/2272A/AN/1552.pdf"
      }
    }
  ],
  "seanceDiscussion": "RUANR5L15S2020IDS21869",
  "sort": {
    "dateSaisie": "2019-10-18T10:40:19.000+02:00",
    "sortEnSeance": "Adopté"
  },
  "dateDepot": "2019-10-10T02:00:00.000+02:00",
  "dateDistribution": "2019-10-15T02:00:00.000+02:00",
  "article99": "0",
  "loiReference": {}
}