{
  "uid": "AMANR5L15SEA717460B0911P0D1N281",
  "identifiant": {
    "legislature": "15",
    "numero": "281",
    "numRect": "0",
    "saisine": {
      "texteLegislatifRef": "PRJLANR5L15B0911",
      "numeroPartiePLF": "0",
      "organeExamen": "PO717460",
      "mentionSecondeDeliberation": "0"
    }
  },
  "numeroLong": "281",
  "etapeTexte": "1ère lecture (1ère assemblée saisie)",
  "triAmendement": "arzvzi",
  "cardinaliteAmdtMultiples": "1",
  "etat": "A discuter",
  "signataires": {
    "auteur": {
      "typeAuteur": "Depute",
      "acteurRef": "PA942",
      "groupePolitiqueRef": "PO744425"
    },
    "cosignatairesRefs": [
      "PA722030",
      "PA267355",
      "PA642935",
      "PA331567",
      "PA1960",
      "PA267585",
      "PA335758",
      "PA266788",
      "PA642868",
      "PA719806",
      "PA942",
      "PA721110",
      "PA331582",
      "PA267766",
      "PA702052",
      "PA721094",
      "PA695100",
      "PA720230",
      "PA720696",
      "PA332228",
      "PA268019",
      "PA267042",
      "PA267330",
      "PA267780",
      "PA712014",
      "PA267241",
      "PA721486"
    ],
    "texteAffichable": "M.&#160;Charles&#160;de Courson,  M.&#160;Lagarde, M.&#160;Riester, Mme&#160;Auconie, M.&#160;Becht, M.&#160;Benoit, M.&#160;Bournazel, M.&#160;Guy&#160;Bricout, M.&#160;Christophe, Mme&#160;de La Raudi&#232;re, M.&#160;Demilly, Mme&#160;Descamps, M.&#160;Dunoyer, M.&#160;Favennec Becot, Mme&#160;Firmin Le Bodo, M.&#160;Meyer&#160;Habib, M.&#160;Herth, M.&#160;Ledoux, M.&#160;Leroy, Mme&#160;Magnier, M.&#160;Morel-&#192;-L&apos;Huissier, M.&#160;Naegelen, Mme&#160;Sage, Mme&#160;Sanquer, M.&#160;Vercamer, M.&#160;Philippe&#160;Vigier et M.&#160;Zumkeller"
  },
  "pointeurFragmentTexte": {
    "division": {
      "titre": "Article 2",
      "articleDesignationCourte": "APRÈS ART. 2",
      "type": "ARTICLE",
      "avantAApres": "Apres",
      "divisionRattachee": "APRÈS L'ARTICLE 2, insérer l'article suivant:",
      "articleAdditionnel": "1",
      "urlDivisionTexteVise": "/15/textes/0911.asp#D_Article_2"
    }
  },
  "corps": {
    "dispositif": "<p style=\"text-align: justify;\">L&#8217;article&#160;40 de la Constitution est compl&#233;t&#233; par les mots&#160;: &#171;&#160;non compens&#233;e par la r&#233;duction &#224; due concurrence d&#8217;une charge publique&#160;&#187;.</p>",
    "exposeSommaire": "<p style=\"text-align: justify;\">Cet amendement a pour but de permettre aux parlementaires de pouvoir r&#233;partir des cr&#233;dits budg&#233;taires entre diff&#233;rentes missions et de pr&#233;voir des d&#233;penses suppl&#233;mentaires si elles sont compens&#233;es par des &#233;conomies sur d&#8217;autres d&#233;penses.</p>"
  },
  "representations": [
    {
      "nom": "PDF",
      "typeMime": {
        "type": "application",
        "subType": "PDF"
      },
      "statutRepresentation": {
        "verbatim": true,
        "canonique": true,
        "officielle": true,
        "transcription": false,
        "enregistrement": false
      },
      "contenu": {
        "documentURI": "/15/amendements/0911/AN/281.pdf"
      }
    }
  ],
  "dateDepot": "2018-07-03T02:00:00.000+02:00",
  "dateDistribution": "2018-07-10T02:00:00.000+02:00",
  "article99": "0",
  "loiReference": {
    "codeLoi": "Constitution",
    "divisionCodeLoi": "40"
  }
}