{
  "uid": "AMANR5L15PO420120B1168P0D1N223",
  "identifiant": {
    "legislature": "15",
    "numero": "223",
    "numRect": "0",
    "saisine": {
      "texteLegislatifRef": "PRJLANR5L15B1168",
      "numeroPartiePLF": "0",
      "organeExamen": "PO420120",
      "mentionSecondeDeliberation": "0"
    }
  },
  "numeroLong": "AS223",
  "etapeTexte": "Nouvelle Lecture",
  "triAmendement": "oh",
  "cardinaliteAmdtMultiples": "1",
  "etat": "Discuté",
  "signataires": {
    "auteur": {
      "typeAuteur": "Depute",
      "acteurRef": "PA717379",
      "groupePolitiqueRef": "PO730964"
    },
    "cosignatairesRefs": [
      "PA718694",
      "PA720512",
      "PA720046",
      "PA722086",
      "PA720916",
      "PA718744",
      "PA722102",
      "PA718910",
      "PA718810",
      "PA606171",
      "PA720932",
      "PA722022",
      "PA722268",
      "PA721246",
      "PA331835",
      "PA721710",
      "PA720362",
      "PA719756",
      "PA722126",
      "PA718706",
      "PA718728",
      "PA720480",
      "PA719186",
      "PA720738",
      "PA719980",
      "PA334768",
      "PA721336",
      "PA720170",
      "PA719350",
      "PA717379",
      "PA722150",
      "PA719842",
      "PA719512",
      "PA720074",
      "PA719072",
      "PA642788",
      "PA719540",
      "PA608083",
      "PA722062"
    ],
    "texteAffichable": "M.&#160;Maillard,  M.&#160;Houli&#233;, M.&#160;Pietraszewski, Mme&#160;Bagarry, M.&#160;Belhaddad, M.&#160;Borowczyk, Mme&#160;Bourguignon, Mme&#160;Brocard, M.&#160;Chiche, Mme&#160;Cloarec, M.&#160;Da Silva, M.&#160;Marc&#160;Delatte, Mme&#160;Dufeu Schubert, Mme&#160;Fontaine-Domeizel, Mme&#160;Gaillot, Mme&#160;Grandjean, Mme&#160;Granjus, Mme&#160;Iborra, Mme&#160;Janvier, Mme&#160;Khattabi, M.&#160;Laabid, Mme&#160;Lazaar, Mme&#160;Lecocq, M.&#160;Mesnier, M.&#160;Michels, Mme&#160;Peyron, Mme&#160;Pitollat, Mme&#160;Robert, Mme&#160;Romeiro Dias, Mme&#160;Tamarelle-Verhaeghe, M.&#160;Taquet, M.&#160;Touraine, Mme&#160;Toutut-Picard, Mme&#160;Vanceunebrock-Mialon, Mme&#160;Vidal, Mme&#160;Vignon, M.&#160;V&#233;ran, Mme&#160;Wonner, M.&#160;Ferrand et les membres du groupe La R&#233;publique en Marche"
  },
  "pointeurFragmentTexte": {
    "division": {
      "titre": "Article PREMIER",
      "articleDesignationCourte": "ART. PREMIER",
      "type": "ARTICLE",
      "avantAApres": "A",
      "divisionRattachee": "ARTICLE PREMIER",
      "urlDivisionTexteVise": "/15/textes/1168.asp#D_Article_1er"
    },
    "alinea": {
      "numero": "51"
    }
  },
  "corps": {
    "dispositif": "<p style=\"text-align: justify;\">R&#233;diger ainsi l&#8217;alin&#233;a&#160;51&#160;:</p><p style=\"text-align: justify;\">&#171;&#160;Tous les trois ans &#224; compter de la promulgation de la loi n&#176; &#160;&#160;&#160; du&#160;&#160;&#160;&#160;&#160;&#160; pour la libert&#233; de choisir son avenir professionnel, sur la base du rapport de la Caisse des d&#233;p&#244;ts et consignations mentionn&#233; &#224; l&#8217;article L.&#160;6333&#8209;4, le ministre charg&#233; de la formation professionnelle saisit le conseil d&#8217;administration de France comp&#233;tences pour un avis relatif &#224; l&#8217;actualisation des droits au compte personnel de formation, compte tenu de l&#8217;&#233;volution g&#233;n&#233;rale des prix des biens et services et, plus particuli&#232;rement, de l&#8217;observation des co&#251;ts des organismes de formation par France comp&#233;tences, telle que mentionn&#233;e au 5&#176; de l&#8217;article L.&#160;6123&#8209;5. Une fois cet avis recueilli, une &#233;ventuelle actualisation des droits &#224; l&#8217;alimentation annuelle du compte personnel de formation et des plafonds mentionn&#233;s au pr&#233;sent article ainsi qu&#8217;aux articles L.&#160;6323&#8209;11&#8209;1, L.&#160;6323&#8209;27 et L.&#160;6323&#8209;34 est fix&#233;e par d&#233;cret en Conseil d&#8217;&#201;tat.&#160;&#187;</p>",
    "exposeSommaire": "<p style=\"text-align: justify;\">Le pr&#233;sent amendement vise &#224; r&#233;tablir la r&#233;daction du projet de loi vot&#233; par l&#8217;Assembl&#233;e nationale en premi&#232;re lecture.</p>"
  },
  "representations": [
    {
      "nom": "PDF",
      "typeMime": {
        "type": "application",
        "subType": "PDF"
      },
      "statutRepresentation": {
        "verbatim": true,
        "canonique": true,
        "officielle": true,
        "transcription": false,
        "enregistrement": false
      },
      "contenu": {
        "documentURI": "/15/amendements/1168/CION-SOC/AS223.pdf"
      }
    }
  ],
  "sort": {
    "dateSaisie": "2018-07-18T10:32:44.000+02:00",
    "sortEnSeance": "Adopté"
  },
  "dateDepot": "2018-07-17T02:00:00.000+02:00",
  "dateDistribution": "2018-07-18T02:00:00.000+02:00",
  "article99": "0",
  "loiReference": {}
}