{
  "uid": "AMANR5L15SEA717460BTC1019P0D1N1218",
  "identifiant": {
    "legislature": "15",
    "numero": "1218",
    "numRect": "0",
    "saisine": {
      "texteLegislatifRef": "PRJLANR5L15BTC1019",
      "numeroPartiePLF": "0",
      "organeExamen": "PO717460",
      "mentionSecondeDeliberation": "1"
    }
  },
  "numeroLong": "1218",
  "etapeTexte": "1ère lecture (1ère assemblée saisie)",
  "triAmendement": "ajw",
  "cardinaliteAmdtMultiples": "1",
  "etat": "Discuté",
  "signataires": {
    "auteur": {
      "typeAuteur": "Depute",
      "acteurRef": "PA643134",
      "groupePolitiqueRef": "PO730934"
    },
    "cosignatairesRefs": [
      "PA643134"
    ],
    "texteAffichable": "Mme&#160;Valentin"
  },
  "pointeurFragmentTexte": {
    "division": {
      "titre": "Article 19",
      "articleDesignationCourte": "ART. 19",
      "type": "ARTICLE",
      "avantAApres": "A",
      "divisionRattachee": "ARTICLE 19",
      "urlDivisionTexteVise": "/15/textes/1019.asp#D_Article_19"
    },
    "alinea": {
      "numero": "5"
    }
  },
  "corps": {
    "dispositif": "<p style=\"text-align: justify;\">&#192; l&#8217;alin&#233;a&#160;5, apr&#232;s le mot&#160;:&#160;</p><p style=\"text-align: justify;\">&#171;&#160;assurer&#160;&#187;,&#160;</p><p style=\"text-align: justify;\">ins&#233;rer les mots&#160;:</p><p style=\"text-align: justify;\">&#171;&#160;apr&#232;s concertation avec les r&#233;gions et &#233;valuation des impacts en termes d&#8217;am&#233;nagement du territoire,&#160;&#187;</p>",
    "exposeSommaire": "<p style=\"text-align: justify;\">Cet amendement vise &#224; s&#8217;assurer que la mission confi&#233;e aux op&#233;rateurs de comp&#233;tences de financement des contrats d&#8217;apprentissage et de professionnalisation sera bien exerc&#233;e dans le cadre d&#8217;une concertation avec les r&#233;gions, notamment pour prendre en compte les impacts en termes d&#8217;am&#233;nagement du territoire.</p><p style=\"text-align: justify;\">&#160;</p>"
  },
  "representations": [
    {
      "nom": "PDF",
      "typeMime": {
        "type": "application",
        "subType": "PDF"
      },
      "statutRepresentation": {
        "verbatim": true,
        "canonique": true,
        "officielle": true,
        "transcription": false,
        "enregistrement": false
      },
      "contenu": {
        "documentURI": "/15/amendements/1019/AN/1218.pdf"
      }
    }
  ],
  "seanceDiscussion": "RUANR5L15S2018IDS21105",
  "sort": {
    "dateSaisie": "2018-06-15T17:35:43.000+02:00",
    "sortEnSeance": "Non soutenu"
  },
  "dateDepot": "2018-06-07T02:00:00.000+02:00",
  "dateDistribution": "2018-06-12T02:00:00.000+02:00",
  "article99": "0",
  "loiReference": {}
}