{
  "uid": "AMANR5L15PO59048B2272P2D1N18",
  "identifiant": {
    "legislature": "15",
    "numero": "18",
    "numRect": "0",
    "saisine": {
      "texteLegislatifRef": "PRJLANR5L15B2272",
      "numeroPartiePLF": "2",
      "organeExamen": "PO59048",
      "mentionSecondeDeliberation": "0"
    }
  },
  "numeroLong": "II-CF18",
  "etapeTexte": "1ère lecture (1ère assemblée saisie)",
  "triAmendement": "niaaaaaaaaaaaaaaaaaaaaaaaaaaaaaaaaaaaaaaaaaaaaaaaaaeai",
  "cardinaliteAmdtMultiples": "1",
  "etat": "Discuté",
  "signataires": {
    "auteur": {
      "typeAuteur": "Depute",
      "acteurRef": "PA330909",
      "groupePolitiqueRef": "PO730934"
    },
    "cosignatairesRefs": [
      "PA605036",
      "PA346218",
      "PA718884",
      "PA712015",
      "PA719318",
      "PA340853",
      "PA643134",
      "PA266793",
      "PA267260",
      "PA718780",
      "PA336316",
      "PA721816",
      "PA2155",
      "PA330909",
      "PA767",
      "PA722390",
      "PA608016",
      "PA718838",
      "PA720210",
      "PA643103",
      "PA606712"
    ],
    "texteAffichable": "M.&#160;Descoeur,  Mme&#160;Trastour-Isnart, M.&#160;Ferrara, M.&#160;Masson, M.&#160;Abad, M.&#160;Bony, M.&#160;Leclerc, M.&#160;Cattin, Mme&#160;Corneloup, M.&#160;Brun, Mme&#160;Beauvais, M.&#160;Lurton, M.&#160;Menuel, Mme&#160;Valentin, M.&#160;Bouchet, Mme&#160;Bazin-Malgras, Mme&#160;Anthoine, Mme&#160;Poletti, M.&#160;Boucard, M.&#160;Dive et Mme&#160;Louwagie"
  },
  "pointeurFragmentTexte": {
    "division": {
      "titre": "Article 72",
      "articleDesignationCourte": "APRÈS ART. 72",
      "type": "ARTICLE",
      "avantAApres": "Apres",
      "divisionRattachee": "APRÈS L'ARTICLE 72, insérer l'article suivant:",
      "articleAdditionnel": "1",
      "urlDivisionTexteVise": "/15/textes/2272C.asp#D_Article_72"
    }
  },
  "corps": {
    "dispositif": "<p style=\"text-align: justify;\">I.&#160;&#8211;&#160;Avant le 1<sup>er</sup>&#160;juillet 2021, puis tous les cinq ans, une loi d&#233;termine les objectifs et les priorit&#233;s d&#8217;action de la fiscalit&#233; &#233;cologique.&#160;</p><p style=\"text-align: justify;\">II.&#160;&#8211;&#160;La loi pr&#233;vue au&#160;I pr&#233;cise&#160;:</p><p style=\"text-align: justify;\">1&#176;&#160;Le p&#233;rim&#232;tre des taxes environnementales&#160;;</p><p style=\"text-align: justify;\">2&#176;&#160;Les objectifs vis&#233;s par cette fiscalit&#233;, en coh&#233;rence avec les objectifs pr&#233;vus aux articles L.&#160;110&#8209;1 du code de l&#8217;environnement, L.&#160;100&#8209;4 du code de l&#8217;&#233;nergie, L.&#160;541&#8209;1 du code de l&#8217;environnement et L.&#160;211&#8209;1 du code de l&#8217;environnement&#160;;</p><p style=\"text-align: justify;\">3&#176;&#160;Une trajectoire pr&#233;voyant les taux de chaque taxe environnementale pour une p&#233;riode d&#8217;au moins&#160;cinq ans. Elle indique &#224; ce titre le montant des recettes anticip&#233;es pour chacune des taxes concern&#233;es, en tenant compte des diff&#233;rentes exemptions&#160;;</p><p style=\"text-align: justify;\">4&#176;&#160;Les grands principes d&#8217;affectation des recettes des taxes concern&#233;es, en coh&#233;rence avec les objectifs mentionn&#233;s au 2&#176;&#160;, garantissent l&#8217;&#233;quit&#233; de la fiscalit&#233; &#233;cologique et la protection des m&#233;nages modestes et la territorialisation partielle de ces dispositifs.</p>",
    "exposeSommaire": "<p style=\"text-align: justify;\">La fiscalit&#233; &#233;cologique est un outil majeur de la transition &#233;cologique, qui doit permettre de donner un signal prix sur des comportements consid&#233;r&#233;s comme polluants et de d&#233;gager des recettes permettant de d&#233;velopper des alternatives. Cet outil s&#8217;est consid&#233;rablement d&#233;velopp&#233; ces derni&#232;res ann&#233;es, notamment avec la mise en place de la taxe carbone, qui repr&#233;sente aujourd&#8217;hui environ 8 milliards d&#8217;euros de recettes, ou de la taxe g&#233;n&#233;rale sur les activit&#233;s polluantes. Cette derni&#232;re repr&#233;sente environ 450 millions d&#8217;euros de recettes mais repr&#233;sentera entre 800 millions et 1,4 milliard d&#8217;euros de recettes en 2025 avec l&#8217;augmentation vot&#233;e dans le projet de loi de finances pour 2025. De la m&#234;me mani&#232;re, la gestion de l&#8217;eau s&#8217;est organis&#233;e autour d&#8217;un mod&#232;le de fiscalit&#233; &#233;cologique int&#233;gralement affect&#233;e via les redevances. Ce mod&#232;le a &#233;t&#233; remis en question avec notamment le plafonnement du budget des agences de l&#8217;eau.</p><p style=\"text-align: justify;\">Le mouvement des gilets jaunes, qui s&#8217;est constitu&#233; en r&#233;action &#224; la hausse initialement pr&#233;vue de la taxe carbone, a toutefois marqu&#233; un coup d&#8217;arr&#234;t pour le d&#233;veloppement de cet outil. Constatant le manque de transparence dans l&#8217;utilisation des recettes de la fiscalit&#233; &#233;cologique, le manque de dispositif incitatif en lien avec cette fiscalit&#233; et le manque de dispositif de protection des Fran&#231;ais les plus pr&#233;caires, une part des Fran&#231;ais a massivement rejet&#233; cette fiscalit&#233;. Cette fiscalit&#233; a ainsi &#233;t&#233; per&#231;ue comme incoh&#233;rente et injustement punitive par une partie des Fran&#231;ais, et a donc &#233;t&#233; consid&#233;r&#233;e comme &#171;&#160;une taxe de plus&#160;&#187;, visant essentiellement &#224; d&#233;gager de nouvelles recettes sous couvert d&#8217;&#233;cologie, par ces derniers.</p><p style=\"text-align: justify;\">Cette situation est particuli&#232;rement probl&#233;matique au regard de l&#8217;urgence climatique. Elle p&#233;nalise par exemple les alternatives &#224; l&#8217;utilisation des &#233;nergies fossiles (r&#233;novation &#233;nerg&#233;tique, &#233;nergies renouvelables...), qui auraient d&#251; b&#233;n&#233;ficier d&#8217;un regain de comp&#233;titivit&#233; en raison de la hausse de la taxe carbone.</p><p style=\"text-align: justify;\">Afin de pouvoir cr&#233;er les conditions d&#8217;un d&#233;bat apais&#233; sur la fiscalit&#233; &#233;cologique, et d&#8217;&#233;viter les accusations d&#8217;incoh&#233;rence et de manque de transparence, cet amendement vise &#224; cr&#233;er une loi de programmation de la fiscalit&#233; &#233;cologique. Cette loi viserait &#224; refonder les r&#232;gles de la fiscalit&#233; &#233;cologique. Elle viserait ainsi &#224; cr&#233;er les r&#232;gles d&#8217;une fiscalit&#233; &#233;cologique plus juste, plus efficace, plus incitative que punitive, plus coh&#233;rente et plus protectrice pour les Fran&#231;ais. Ces conditions sont un pr&#233;requis indispensable pour pouvoir &#233;voquer une nouvelle trajectoire pour la fiscalit&#233; &#233;cologique, qui est indispensable au regard de l&#8217;urgence climatique.&#160;</p>"
  },
  "representations": [
    {
      "nom": "PDF",
      "typeMime": {
        "type": "application",
        "subType": "PDF"
      },
      "statutRepresentation": {
        "verbatim": true,
        "canonique": true,
        "officielle": true,
        "transcription": false,
        "enregistrement": false
      },
      "contenu": {
        "documentURI": "/15/amendements/2272C/CION_FIN/CF18.pdf"
      }
    }
  ],
  "sort": {
    "dateSaisie": "2019-11-07T10:07:43.000+01:00",
    "sortEnSeance": "Non soutenu"
  },
  "dateDepot": "2019-10-09T02:00:00.000+02:00",
  "dateDistribution": "2019-11-06T01:00:00.000+01:00",
  "article99": "0",
  "loiReference": {
    "codeLoi": "yy"
  }
}