{
  "uid": "AMANR5L15SEA717460B2296P0D1N1610",
  "identifiant": {
    "legislature": "15",
    "numero": "1610",
    "numRect": "0",
    "saisine": {
      "texteLegislatifRef": "PRJLANR5L15B2296",
      "numeroPartiePLF": "0",
      "organeExamen": "PO717460",
      "mentionSecondeDeliberation": "1"
    }
  },
  "numeroLong": "1610",
  "etapeTexte": "1ère lecture (1ère assemblée saisie)",
  "triAmendement": "boaaaaaaaaaaaaaaaaaaaaaaaaaaaaaaaaaaaaaaaaaaaaaaaaaknzzwzzw",
  "cardinaliteAmdtMultiples": "1",
  "etat": "Discuté",
  "signataires": {
    "auteur": {
      "typeAuteur": "Depute",
      "acteurRef": "PA722390",
      "groupePolitiqueRef": "PO730934"
    },
    "cosignatairesRefs": [
      "PA2377",
      "PA721678",
      "PA722390"
    ],
    "texteAffichable": "Mme&#160;Corneloup,  M.&#160;Reda et M.&#160;Perrut"
  },
  "pointeurFragmentTexte": {
    "division": {
      "titre": "Article 16",
      "articleDesignationCourte": "APRÈS ART. 16",
      "type": "ARTICLE",
      "avantAApres": "Apres",
      "divisionRattachee": "APRÈS L'ARTICLE 16, insérer l'article suivant:",
      "articleAdditionnel": "1",
      "urlDivisionTexteVise": "/15/textes/2296.asp#D_Article_16"
    }
  },
  "corps": {
    "dispositif": "<p>I.&#160;&#8211;&#160;Au&#160;<i>a</i>&#160;de l&#8217;article L.&#160;138&#8209;2 du code de la s&#233;curit&#233; sociale, le taux&#160;: &#171;&#160;1,75&#160;%&#160;&#187; est remplac&#233; par le taux&#160;: &#171;&#160;1,3&#160;%&#160;&#187;.</p><p style=\"text-align: justify;\">II.&#160;&#8211;&#160;La perte de recettes pour les organismes de s&#233;curit&#233; sociale est compens&#233;e &#224; due concurrence par la cr&#233;ation d&#8217;une taxe additionnelle aux droits vis&#233;s aux articles 575 et 575 A du code g&#233;n&#233;ral des imp&#244;ts.</p>",
    "exposeSommaire": "<p style=\"text-align: justify;\">Les entreprises de la r&#233;partition pharmaceutique jouent un r&#244;le crucial dans la cha&#238;ne du m&#233;dicament en assurant l&#8217;approvisionnement de plus de 21.500 pharmacies fran&#231;aises, sur l&#8217;ensemble du territoire. Leurs missions font l&#8217;objet d&#8217;obligations de service public encadr&#233;es par l&#8217;Agence&#160;Nationale de S&#233;curit&#233; du M&#233;dicament (ANSM)&#160;: disposer des stocks de m&#233;dicaments permettant de satisfaire durant au moins 15 jours la consommation habituelle, livrer l&#8217;ensemble des pharmacies d&#8217;officine dans un d&#233;lai de 24h apr&#232;s charque commande et disposer d&#8217;au moins 9 m&#233;dicaments sur 10 commercialis&#233;s en France.</p><p style=\"text-align: justify;\">Dans un contexte de multiplication des tensions d&#8217;approvisionnement de m&#233;dicaments, les r&#233;partiteurs pharmaceutiques sont donc au c&#339;ur de la diminution de l&#8217;impact de ces ruptures.</p><p style=\"text-align: justify;\">D&#232;s lors que ces missions sont confi&#233;es par l&#8217;&#201;tat &#224; des acteurs priv&#233;s, la r&#233;mun&#233;ration de ces derniers est encadr&#233;e par un arr&#234;t&#233; de marge. Par ailleurs, l&#8217;activit&#233; de r&#233;partiteur est soumise &#224; une taxe pr&#233;lev&#233;e par l&#8217;Agence Centrale des Organismes de S&#233;curit&#233; Sociale (ACOSS) au titre de la vente en gros de m&#233;dicaments. L&#8217;assiette de cette contribution est compos&#233;e de trois parts dont la premi&#232;re correspond &#224; un taux de 1,75&#160;% du chiffre d&#8217;affaires hors taxe, r&#233;alis&#233; par l&#8217;entreprise au cours de l&#8217;ann&#233;e civile.</p><p style=\"text-align: justify;\">Or, depuis plusieurs ann&#233;es, le syst&#232;me de r&#233;mun&#233;ration est inadapt&#233; &#224; l&#8217;&#233;volution du march&#233; et n&#8217;est plus viable pour les r&#233;partiteurs pharmaceutiques. Par ailleurs, la profession fait l&#8217;objet d&#8217;une taxation sp&#233;cifique qui p&#233;nalise fortement le secteur o&#249; les marges unitaires sont faibles. Elle ampute le capital dans la mesure o&#249; elle s&#8217;applique au chiffre d&#8217;affaires. Cette contribution, dans sa structuration, comme dans son taux, est devenue totalement obsol&#232;te et confiscatoire. Elle repr&#233;sente aujourd&#8217;hui pr&#232;s de 20&#160;% de la marge r&#233;glement&#233;e et 80&#160;% de l&#8217;exc&#233;dent brut d&#8217;exploitation du secteur.</p><p style=\"text-align: justify;\">Apr&#232;s une perte nette d&#8217;exploitation de 23 millions d&#8217;euros en 2017 et de 46 millions d&#8217;euros en 2018, les projections pour 2021 envisagent une perte de 111 millions d&#8217;euros. Depuis 2008, ce sont au total 297 millions d&#8217;euros de manque &#224; gagner que le secteur a subi.</p><p style=\"text-align: justify;\">En l&#8217;&#233;tat, et en l&#8217;absence de mesures d&#8217;urgence concr&#232;tes, la qualit&#233; de l&#8217;approvisionnement quotidien des Fran&#231;ais en m&#233;dicaments pourrait &#234;tre remise en cause.</p><p style=\"text-align: justify;\">Consciente du risque, la Ministre des Solidarit&#233;s et de la Sant&#233; s&#8217;&#233;tait engag&#233;e lors des d&#233;bats sur le PLFSS 2019 &#171;&#160;&#224; ce que les travaux autour de ce changement de mod&#232;le aboutissent au cours du premier trimestre 2019&#160;&#187;.</p><p style=\"text-align: justify;\">Si des discussions ont &#233;t&#233; entam&#233;es avec le Minist&#232;re afin de proc&#233;der &#224; un nouveau syst&#232;me de r&#233;mun&#233;ration &#224; moyen terme, cet engagement ne s&#8217;est pas concr&#233;tis&#233; &#224; ce stade &#224; travers des mesures correspondant aux besoins de la profession.</p><p style=\"text-align: justify;\">En outre, il est essentiel &#224; court terme de prendre des mesures d&#232;s l&#8217;ann&#233;e 2020 pour &#233;viter un effondrement du circuit du m&#233;dicament. Si une baisse de la contribution ne peut &#224; elle seule r&#233;gler la crise que connait le secteur, elle repr&#233;sente un volet indispensable.</p><p style=\"text-align: justify;\">C&#8217;est pourquoi, &#224; d&#233;faut de traiter sur le fond une refonte compl&#232;te de l&#8217;assiette de cette contribution, cet amendement de repli pr&#233;voit de r&#233;duire son taux &#224; 1,3&#160;% afin de d&#233;gager 50 millions d&#8217;euros pour le secteur de la r&#233;partition qui repr&#233;sente 12.000 emplois en France.</p>"
  },
  "representations": [
    {
      "nom": "PDF",
      "typeMime": {
        "type": "application",
        "subType": "PDF"
      },
      "statutRepresentation": {
        "verbatim": true,
        "canonique": true,
        "officielle": true,
        "transcription": false,
        "enregistrement": false
      },
      "contenu": {
        "documentURI": "/15/amendements/2296/AN/1610.pdf"
      }
    }
  ],
  "seanceDiscussion": "RUANR5L15S2020IDS21878",
  "sort": {
    "dateSaisie": "2019-10-24T15:40:43.000+02:00",
    "sortEnSeance": "Rejeté"
  },
  "dateDepot": "2019-10-18T02:00:00.000+02:00",
  "dateDistribution": "2019-10-21T02:00:00.000+02:00",
  "article99": "0",
  "loiReference": {
    "codeLoi": "c sécurité sociale",
    "divisionCodeLoi": "L138-2"
  }
}