{
  "uid": "AMANR5L15SEA717460B0235P2D1N375",
  "identifiant": {
    "legislature": "15",
    "numero": "375",
    "numRect": "0",
    "saisine": {
      "texteLegislatifRef": "PRJLANR5L15B0235",
      "numeroPartiePLF": "2",
      "organeExamen": "PO717460",
      "mentionSecondeDeliberation": "0"
    }
  },
  "numeroLong": "II-375",
  "etapeTexte": "1ère lecture (1ère assemblée saisie)",
  "triAmendement": "azy",
  "cardinaliteAmdtMultiples": "1",
  "etat": "Discuté",
  "signataires": {
    "auteur": {
      "typeAuteur": "Depute",
      "acteurRef": "PA721270",
      "groupePolitiqueRef": "PO730940"
    },
    "cosignatairesRefs": [
      "PA610654",
      "PA718720",
      "PA721270",
      "PA267306",
      "PA722202",
      "PA720546",
      "PA610634",
      "PA720692",
      "PA610667",
      "PA441",
      "PA721118",
      "PA335612",
      "PA689",
      "PA722110",
      "PA721896",
      "PA718926"
    ],
    "texteAffichable": "M.&#160;Peu,  M.&#160;Wulfranc, M.&#160;Azerot, Mme&#160;Bello, M.&#160;Brotherson, M.&#160;Bruneel, Mme&#160;Buffet, M.&#160;Chassaigne, M.&#160;Dharr&#233;ville, M.&#160;Dufr&#232;gne, Mme&#160;Faucillon, M.&#160;Jumel, M.&#160;Lecoq, M.&#160;Nilor, M.&#160;Fabien&#160;Roussel et M.&#160;Serville"
  },
  "pointeurFragmentTexte": {
    "missionVisee": {
      "idMissionAN": "7",
      "libelleMission": "Cohésion des territoires",
      "codeMissionPLF": "B",
      "libelleMissionPLF": "Répartition, par mission et programme, des crédits du budget général"
    },
    "division": {
      "titre": "Article 52",
      "articleDesignationCourte": "ART. 52",
      "type": "ARTICLE",
      "avantAApres": "A",
      "divisionRattachee": "ARTICLE 52",
      "urlDivisionTexteVise": "/15/textes/0235C.asp#D_Article_52"
    }
  },
  "corps": {
    "dispositif": "<p>Supprimer cet article.</p>",
    "exposeSommaire": "<p style=\"text-align: justify;\">L&#8217;article&#160;52 cr&#233;e une r&#233;duction de loyer de solidarit&#233; (RSL) pour les locataires du parc social dont les ressources sont inf&#233;rieures &#224; un plafond encadr&#233; par la loi et fix&#233; par arr&#234;t&#233;. Cette r&#233;duction est corr&#233;l&#233;e &#224; une baisse du montant de l&#8217;APL, calibr&#233;e de fa&#231;on &#224; ce que la baisse de l&#8217;aide soit toujours inf&#233;rieure &#224; la baisse de loyer. S&#8217;y ajoutent des mesures de gel de l&#8217;indexation des loyers du parc social et des diff&#233;rentes aides personnelles au logement.</p><p style=\"text-align: justify;\">Les objectifs avanc&#233;s &#224; l&#8217;appui de ces mesures sont la r&#233;duction de la d&#233;pense publique li&#233;e &#224; la politique du logement ainsi que l&#8217;am&#233;lioration de l&#8217;acc&#232;s au logement des personnes les plus modestes.</p><p style=\"text-align: justify;\">La baisse des aides personnelles au logement repr&#233;sente un montant estim&#233; &#224; 1,5 milliard d&#8217;euros mais les co&#251;ts cons&#233;cutifs &#224; l&#8217;ensemble des dispositifs qui restent &#224; la charge des bailleurs sociaux seront bien sup&#233;rieurs, de l&#8217;ordre de 2 milliards d&#8217;euros.</p><p style=\"text-align: justify;\">Les contreparties annonc&#233;es par le Gouvernement ne sont pas de nature &#224; compenser l&#8217;impact des mesures pr&#233;vues par l&#8217;article&#160;52.</p><p style=\"text-align: justify;\">Alors que l&#8217;autofinancement annuel des organismes Hlm &#233;tait en 2015 de 2,2 milliards d&#8217;euros et que cet auto financement est enti&#232;rement r&#233;investi dans la production de nouveaux logements locatifs sociaux et la r&#233;habilitation du parc, les dispositions de l&#8217;article&#160;52 en amputant de plus de 75&#160;% l&#8217;autofinancement global du secteur, p&#232;seraient d&#8217;autant sur les investissements et les emplois dans le secteur du b&#226;timent.</p><p style=\"text-align: justify;\">Globalement, d&#232;s 2018, la capacit&#233; des organismes d&#8217;HLM &#224; entretenir et r&#233;habiliter leur patrimoine sera tr&#232;s fortement affaiblie, des programmes de r&#233;novation thermique et de r&#233;novation urbaine devront &#234;tre arr&#234;t&#233;s. En totale contradiction avec la strat&#233;gie du Gouvernement d&#8217;un &#171;&#160;choc de l&#8217;offre&#160;&#187;, la capacit&#233; de production de logements neufs sera fortement entrav&#233;e.</p><p style=\"text-align: justify;\">En outre, ce bouleversement du mod&#232;le &#233;conomique des organismes HLM placera d&#232;s 2018, pr&#232;s de 200 organismes HLM en situation de tr&#232;s grande difficult&#233;. Le choc induit s&#8217;il ne peut &#234;tre totalement d&#233;crit passera in&#233;vitablement par une mise en fragilit&#233; de l&#8217;ensemble d&#8217;un secteur dont la dette est largement garantie par les collectivit&#233;s locales qui a g&#233;n&#233;r&#233; en 2015, 18, milliards d&#8217;euros d&#8217;investissements, rapportant pr&#232;s d&#8217;un milliard d&#8217;euros de TVA. Le secteur Hlm emploie 82&#160;000 salari&#233;s dont de nombreux emplois de proximit&#233; et mobilise l&#8217;&#233;quivalent de 170&#160;000 emplois directs et 120&#160;000 emplois indirects dans la fili&#232;re du b&#226;timent.</p><p style=\"text-align: justify;\">En d&#233;finitive, une telle disposition p&#232;sera tr&#232;s n&#233;gativement sur l&#8217;ensemble de la fili&#232;re du logement, les locataires Hlm s&#8217;en trouveront p&#233;nalis&#233;s par une d&#233;gradation de la qualit&#233; du service et de l&#8217;entretien et l&#8217;offre de logement en faveur des personnes les plus modestes sera diminu&#233;e.</p><p style=\"text-align: justify;\">Le mouvement HLM note par ailleurs l&#8217;extr&#234;me complexit&#233; du dispositif propos&#233; qui fait peser sur les organismes l&#8217;obligation de r&#233;aliser une enqu&#234;te r&#233;glementaire sur les ressources des locataires et la composition familiales. Il rappelle que le co&#251;t du dispositif de suivi des ressources des b&#233;n&#233;ficiaires des aides au logement par la CNAF est &#233;valu&#233; &#224; 600 millions d&#8217;euros selon un rapport parlementaire.</p><p style=\"text-align: justify;\">Cet amendement vise enfin &#233;galement le maintien du b&#233;n&#233;fice de l&#8217;APL pour les nouveaux acc&#233;dants &#224; la propri&#233;t&#233; qui r&#233;pondent aux crit&#232;res fix&#233;s par la r&#232;glementation. Chaque ann&#233;e, ce sont ainsi environ 30.000 m&#233;nages qui peuvent r&#233;aliser leur parcours d&#8217;accession gr&#226;ce &#224; cette aide et qui en seraient priv&#233;s par le maintien de la disposition.</p>"
  },
  "representations": [
    {
      "nom": "PDF",
      "typeMime": {
        "type": "application",
        "subType": "PDF"
      },
      "statutRepresentation": {
        "verbatim": true,
        "canonique": true,
        "officielle": true,
        "transcription": false,
        "enregistrement": false
      },
      "contenu": {
        "documentURI": "/15/amendements/0235C/AN/375.pdf"
      }
    }
  ],
  "seanceDiscussion": "RUANR5L15S2018IDS20733",
  "sort": {
    "dateSaisie": "2017-11-03T01:18:04.000+01:00",
    "sortEnSeance": "Rejeté"
  },
  "dateDepot": "2017-10-28T02:00:00.000+02:00",
  "dateDistribution": "2017-10-31T01:00:00.000+01:00",
  "article99": "0",
  "loiReference": {}
}