{
  "uid": "AMANR5L15PO59048B0485P0D1N70",
  "identifiant": {
    "legislature": "15",
    "numero": "70",
    "numRect": "0",
    "saisine": {
      "texteLegislatifRef": "PRJLANR5L15B0485",
      "numeroPartiePLF": "0",
      "organeExamen": "PO59048",
      "mentionSecondeDeliberation": "0"
    }
  },
  "numeroLong": "CF70",
  "etapeTexte": "Nouvelle Lecture",
  "triAmendement": "b",
  "cardinaliteAmdtMultiples": "1",
  "etat": "Discuté",
  "signataires": {
    "auteur": {
      "typeAuteur": "Depute",
      "acteurRef": "PA746",
      "groupePolitiqueRef": "PO730934"
    },
    "cosignatairesRefs": [
      "PA746"
    ],
    "texteAffichable": "M.&#160;Carrez"
  },
  "pointeurFragmentTexte": {
    "division": {
      "titre": "Article liminaire",
      "articleDesignationCourte": "ART. LIMINAIRE",
      "type": "ARTICLE",
      "avantAApres": "A",
      "divisionRattachee": "ARTICLE LIMINAIRE",
      "urlDivisionTexteVise": "/15/textes/0485.asp#D_Article_liminaire"
    },
    "alinea": {
      "numero": "2"
    }
  },
  "corps": {
    "dispositif": "<p style=\"text-align: justify;\">I.&#160;&#8211;&#160;&#192; la deuxi&#232;me ligne de la troisi&#232;me colonne du tableau de l&#8217;alin&#233;a&#160;2, substituer au nombre&#160;:</p><p style=\"text-align: justify;\">&#171;&#160;&#8211;&#160;2,1&#160;&#187;</p><p style=\"text-align: justify;\">le nombre&#160;:</p><p style=\"text-align: justify;\">&#171;&#160;&#8211;&#160;1,6&#160;&#187;</p><p style=\"text-align: justify;\">II.&#160;&#8211;&#160;En cons&#233;quence, &#224; la derni&#232;re ligne de la troisi&#232;me colonne du tableau de l&#8217;alin&#233;a&#160;2, substituer au nombre&#160;:</p><p style=\"text-align: justify;\">&#171;&#160;&#8211;&#160;2,6&#160;&#187;</p><p style=\"text-align: justify;\">le nombre&#160;:</p><p style=\"text-align: justify;\">&#171;&#160;&#8211;&#160;2,1&#160;&#187;.&#160;&#187;</p>",
    "exposeSommaire": "<p style=\"text-align: justify;\">Cet amendement vise &#224; se conformer aux obligations du trait&#233; sur la stabilit&#233;, la coordination et la gouvernance (TSCG).</p>"
  },
  "representations": [
    {
      "nom": "PDF",
      "typeMime": {
        "type": "application",
        "subType": "PDF"
      },
      "statutRepresentation": {
        "verbatim": true,
        "canonique": true,
        "officielle": true,
        "transcription": false,
        "enregistrement": false
      },
      "contenu": {
        "documentURI": "/15/amendements/0485/CION_FIN/CF70.pdf"
      }
    }
  ],
  "sort": {
    "dateSaisie": "2017-12-14T09:19:27.000+01:00",
    "sortEnSeance": "Non soutenu"
  },
  "dateDepot": "2017-12-13T01:00:00.000+01:00",
  "dateDistribution": "2017-12-14T01:00:00.000+01:00",
  "article99": "0",
  "loiReference": {}
}