{
  "uid": "AMANR5L15PO419865B0155P0D1N80",
  "identifiant": {
    "legislature": "15",
    "numero": "80",
    "numRect": "0",
    "saisine": {
      "texteLegislatifRef": "PRJLANR5L15B0155",
      "numeroPartiePLF": "0",
      "organeExamen": "PO419865",
      "mentionSecondeDeliberation": "0"
    }
  },
  "numeroLong": "CD80",
  "etapeTexte": "1ère lecture (1ère assemblée saisie)",
  "triAmendement": "h",
  "cardinaliteAmdtMultiples": "1",
  "etat": "Discuté",
  "signataires": {
    "auteur": {
      "typeAuteur": "Depute",
      "acteurRef": "PA335999",
      "groupePolitiqueRef": "PO730946"
    },
    "cosignatairesRefs": [
      "PA337483",
      "PA267233",
      "PA340343",
      "PA335999"
    ],
    "texteAffichable": "Mme&#160;Batho,  M.&#160;Saulignac, M.&#160;Bouillon et M.&#160;Letchimy"
  },
  "pointeurFragmentTexte": {
    "division": {
      "titre": "Article PREMIER",
      "articleDesignationCourte": "APRÈS ART. PREMIER",
      "type": "ARTICLE",
      "avantAApres": "Apres",
      "divisionRattachee": "APRÈS L'ARTICLE PREMIER, insérer l'article suivant:",
      "articleAdditionnel": "1",
      "urlDivisionTexteVise": "/15/textes/0155.asp#D_Article_1er"
    }
  },
  "corps": {
    "dispositif": "<p style=\"text-align: justify;\">Apr&#232;s le 4&#176; de l&#8217;article L.&#160;173&#8209;5 du code minier, il est ins&#233;r&#233; un 4&#176;&#160;<i>bis</i> ainsi r&#233;dig&#233;&#160;:</p><p style=\"text-align: justify;\">&#171;&#160;4&#176;&#160;<i>bis</i> Inobservation des dispositions de l&#8217;article L.&#160;111&#8209;5&#8209;1&#160;;&#160;&#187;</p>",
    "exposeSommaire": "<p style=\"text-align: justify;\">En coh&#233;rence avec l&#8217;interdiction des hydrocarbures non conventionnels, le pr&#233;sent amendement propose le retrait du titre minier &#224; son d&#233;tenteur s&#8217;il s&#8217;av&#232;re que celui-ci l&#8217;utilise pour explorer ou exploiter un gisement d&#8217;hydrocarbures non conventionnels.</p>"
  },
  "representations": [
    {
      "nom": "PDF",
      "typeMime": {
        "type": "application",
        "subType": "PDF"
      },
      "statutRepresentation": {
        "verbatim": true,
        "canonique": true,
        "officielle": true,
        "transcription": false,
        "enregistrement": false
      },
      "contenu": {
        "documentURI": "/15/amendements/0155/CION-DVP/CD80.pdf"
      }
    }
  ],
  "sort": {
    "dateSaisie": "2017-09-26T22:51:46.000+02:00",
    "sortEnSeance": "Retiré"
  },
  "dateDepot": "2017-09-22T02:00:00.000+02:00",
  "dateDistribution": "2017-09-23T02:00:00.000+02:00",
  "article99": "0",
  "loiReference": {
    "codeLoi": "minier (nouveau)",
    "divisionCodeLoi": "173-5"
  }
}