{
  "uid": "AMANR5L15SEA717460BTC1629P0D1N882",
  "identifiant": {
    "legislature": "15",
    "numero": "882",
    "numRect": "0",
    "saisine": {
      "texteLegislatifRef": "PRJLANR5L15BTC1629",
      "numeroPartiePLF": "0",
      "organeExamen": "PO717460",
      "mentionSecondeDeliberation": "1"
    }
  },
  "numeroLong": "882",
  "etapeTexte": "1ère lecture (1ère assemblée saisie)",
  "triAmendement": "eaaaaaaaaaaaaaaaaaaaaaaaaaaaaaaaaaaaaaaaaaaaaaaaaawmnw",
  "cardinaliteAmdtMultiples": "1",
  "etat": "Discuté",
  "signataires": {
    "auteur": {
      "typeAuteur": "Depute",
      "acteurRef": "PA642847",
      "groupePolitiqueRef": "PO730934"
    },
    "cosignatairesRefs": [
      "PA642847"
    ],
    "texteAffichable": "M.&#160;Bazin"
  },
  "pointeurFragmentTexte": {
    "division": {
      "titre": "Article 8",
      "articleDesignationCourte": "ART. 8",
      "type": "ARTICLE",
      "avantAApres": "A",
      "divisionRattachee": "ARTICLE 8",
      "urlDivisionTexteVise": "/15/textes/1629.asp#D_Article_8"
    },
    "alinea": {
      "avantAApres": "Apres",
      "numero": "7"
    }
  },
  "corps": {
    "dispositif": "<p style=\"text-align: justify;\">Apr&#232;s l&#8217;alin&#233;a&#160;7, ins&#233;rer l&#8217;alin&#233;a suivant&#160;:</p><p style=\"text-align: justify;\">&#171;&#160;Dans le cadre de ces exp&#233;rimentations, et sous r&#233;serve d&#8217;un accord majoritaire des enseignants de l&#8217;&#233;tablissement, l&#8217;obligation r&#233;glementaire de service&#160;peut &#234;tre constat&#233;e sur une p&#233;riode plus &#233;tendue que le rythme hebdomadaire.&#160;&#187;</p>",
    "exposeSommaire": "<p style=\"text-align: justify;\">Une r&#233;partition innovante des heures d&#8217;enseignement sur l&#8217;ensemble de l&#8217;ann&#233;e scolaire ne peut se r&#233;aliser sans une conception assouplie de l&#8217;ORS des enseignants. Il ne s&#8217;agit en aucun cas d&#8217;augmenter le temps de travail mais de permettre, sous r&#233;serve d&#8217;un accord de la majorit&#233; des enseignants d&#8217;un &#233;tablissement, de comptabiliser cet ORS sur un temps diff&#233;rent de la semaine.</p>"
  },
  "representations": [
    {
      "nom": "PDF",
      "typeMime": {
        "type": "application",
        "subType": "PDF"
      },
      "statutRepresentation": {
        "verbatim": true,
        "canonique": true,
        "officielle": true,
        "transcription": false,
        "enregistrement": false
      },
      "contenu": {
        "documentURI": "/15/amendements/1629/AN/882.pdf"
      }
    }
  ],
  "seanceDiscussion": "RUANR5L15S2019IDS21507",
  "sort": {
    "dateSaisie": "2019-02-15T16:30:49.000+01:00",
    "sortEnSeance": "Non soutenu"
  },
  "dateDepot": "2019-02-07T01:00:00.000+01:00",
  "dateDistribution": "2019-02-11T01:00:00.000+01:00",
  "article99": "0",
  "loiReference": {}
}