{
  "uid": "AMANR5L15SEA717460B2272P1D1N1825",
  "identifiant": {
    "legislature": "15",
    "numero": "1825",
    "numRect": "0",
    "saisine": {
      "texteLegislatifRef": "PRJLANR5L15B2272",
      "numeroPartiePLF": "1",
      "organeExamen": "PO717460",
      "mentionSecondeDeliberation": "0"
    }
  },
  "numeroLong": "I-1825",
  "etapeTexte": "1ère lecture (1ère assemblée saisie)",
  "triAmendement": "ieaaaaaaaaaaaaaaaaaaaaaaaaaaaaaaaaaaaaaaaaaaaaaaaag",
  "cardinaliteAmdtMultiples": "1",
  "etat": "Irrecevable",
  "signataires": {
    "auteur": {
      "typeAuteur": "Depute",
      "acteurRef": "PA721314",
      "groupePolitiqueRef": "PO730934"
    },
    "cosignatairesRefs": [
      "PA767",
      "PA722390",
      "PA721046",
      "PA719318",
      "PA721678",
      "PA266776",
      "PA267735",
      "PA266797",
      "PA643103",
      "PA721410",
      "PA718780",
      "PA608416",
      "PA267204",
      "PA718884",
      "PA642847",
      "PA718850",
      "PA605036",
      "PA609726",
      "PA720684",
      "PA709315",
      "PA346218",
      "PA721314",
      "PA267429",
      "PA340853",
      "PA266793",
      "PA334654",
      "PA720630"
    ],
    "texteAffichable": "M.&#160;Schellenberger,  M.&#160;Bazin, M.&#160;Abad, Mme&#160;Anthoine, M.&#160;Aubert, Mme&#160;Bassire, Mme&#160;Bazin-Malgras, M.&#160;Straumann, M.&#160;Gosselin, M.&#160;Viala, Mme&#160;Bonnivard, M.&#160;Cattin, Mme&#160;Corneloup, M.&#160;Masson, M.&#160;Hetzel, M.&#160;Leclerc, M.&#160;Pierre-Henri&#160;Dumont, M.&#160;de Ganay, M.&#160;Cinieri, M.&#160;Cordier, M.&#160;Reiss, M.&#160;Reda, M.&#160;Sermier, M.&#160;Bony, M.&#160;Ferrara, M.&#160;Minot et Mme&#160;Trastour-Isnart"
  },
  "pointeurFragmentTexte": {
    "division": {
      "titre": "Article 24",
      "articleDesignationCourte": "AVANT ART. 24",
      "type": "ARTICLE",
      "avantAApres": "Avant",
      "divisionRattachee": "AVANT L'ARTICLE 24, insérer l'article suivant:",
      "articleAdditionnel": "1",
      "urlDivisionTexteVise": "/15/textes/2272A.asp#D_Article_24"
    }
  },
  "corps": {},
  "representations": [
    {
      "nom": "PDF",
      "typeMime": {
        "type": "application",
        "subType": "PDF"
      },
      "statutRepresentation": {
        "verbatim": true,
        "canonique": true,
        "officielle": true,
        "transcription": false,
        "enregistrement": false
      },
      "contenu": {
        "documentURI": "/15/amendements/2272A/AN/1825.pdf"
      }
    }
  ],
  "dateDepot": "2019-10-10T02:00:00.000+02:00",
  "dateDistribution": "2019-10-12T02:00:00.000+02:00",
  "article99": "0",
  "loiReference": {
    "codeLoi": "loi 2009-1673",
    "divisionCodeLoi": "78"
  }
}