{
  "uid": "AMANR5L15PO59048B1255P2D1N24",
  "identifiant": {
    "legislature": "15",
    "numero": "24",
    "numRect": "0",
    "saisine": {
      "texteLegislatifRef": "PRJLANR5L15B1255",
      "numeroPartiePLF": "2",
      "organeExamen": "PO59048",
      "mentionSecondeDeliberation": "0"
    }
  },
  "numeroLong": "II-CF24",
  "etapeTexte": "1ère lecture (1ère assemblée saisie)",
  "triAmendement": "jbiaaaaaaaaaaaaaaaaaaaaaaaaaaaaaaaaaaaaaaaaaaaaaaackzo",
  "cardinaliteAmdtMultiples": "1",
  "etat": "Discuté",
  "signataires": {
    "auteur": {
      "typeAuteur": "Depute",
      "acteurRef": "PA330909",
      "groupePolitiqueRef": "PO730934"
    },
    "cosignatairesRefs": [
      "PA719318",
      "PA608416",
      "PA721678",
      "PA721474",
      "PA330909",
      "PA266793",
      "PA718884",
      "PA336316",
      "PA767",
      "PA642847",
      "PA720684",
      "PA332523",
      "PA605036"
    ],
    "texteAffichable": "M.&#160;Descoeur,  M.&#160;Hetzel, M.&#160;Bony, M.&#160;Pierre-Henri&#160;Dumont, M.&#160;Cattin, M.&#160;Abad, M.&#160;Bazin, M.&#160;Bouchet, Mme&#160;Bazin-Malgras, Mme&#160;Anthoine, M.&#160;Viry, Mme&#160;Dalloz et M.&#160;Reda"
  },
  "pointeurFragmentTexte": {
    "division": {
      "titre": "Article 53",
      "articleDesignationCourte": "ART. 53",
      "type": "ARTICLE",
      "avantAApres": "A",
      "divisionRattachee": "ARTICLE 53",
      "urlDivisionTexteVise": "/15/textes/1255C.asp#D_Article_53"
    },
    "alinea": {
      "numero": "4"
    }
  },
  "corps": {
    "dispositif": "<p style=\"text-align: justify;\">I.&#160;&#8211;&#160;&#192; l&#8217;alin&#233;a&#160;4&#160;:</p><p style=\"text-align: justify;\">1&#176;&#160;Substituer aux deux occurrences du montant&#160;:</p><p style=\"text-align: justify;\">&#171;&#160;29&#160;276&#160;&#8364;&#160;&#187;</p><p style=\"text-align: justify;\">les mots&#160;:</p><p style=\"text-align: justify;\">&#171;&#160;quatre fois le salaire minimum de croissance annuel net&#160;&#187;&#160;;</p><p style=\"text-align: justify;\">2&#176;&#160;Substituer au montant&#160;:</p><p style=\"text-align: justify;\">&#171;&#160;58&#160;552&#160;&#8364;&#160;&#187;</p><p style=\"text-align: justify;\">les mots&#160;:</p><p style=\"text-align: justify;\">&#171;&#160;six fois le salaire minimum de croissance annuel net&#160;&#187;.</p><p style=\"text-align: justify;\">II.&#160;&#8211;&#160;&#192;&#160;l&#8217;alin&#233;a&#160;5, supprimer les mots&#160;:</p><p style=\"text-align: justify;\">&#171;&#160;respectivement&#160;&#187;</p><p style=\"text-align: justify;\">et&#160;:</p><p style=\"text-align: justify;\">&#171;&#160;et &#224; 60&#160;%&#160;&#187;.</p><p style=\"text-align: justify;\">III.&#160;&#8211;&#160;Supprimer l&#8217;alin&#233;a&#160;7.</p><p style=\"text-align: justify;\">IV.&#160;&#8211;&#160;La perte de recettes pour l&#8217;&#201;tat est compens&#233;e &#224; due concurrence par la cr&#233;ation d&#8217;une taxe additionnelle aux droits mentionn&#233;s aux articles 575 et 575 A du code g&#233;n&#233;ral des imp&#244;ts.</p>",
    "exposeSommaire": "<p style=\"text-align: justify;\">Il est n&#233;cessaire de plafonner cet abattement fiscal sp&#233;cifique aux jeunes agriculteurs qui b&#233;n&#233;ficient des aides &#224; l&#8217;installation afin de le recentrer sur les exploitants les plus modestes. N&#233;anmoins, les plafonds propos&#233;s dans le pr&#233;sent projet de loi de finances pour 2019 sont incoh&#233;rents car d&#8217;une part ils ne prennent pas en compte le revenu r&#233;ellement per&#231;u par le jeune install&#233; et d&#8217;autre part ils sont incoh&#233;rents avec le montant des aides &#224; l&#8217;installation vers&#233;es aux jeunes agriculteurs.</p><p style=\"text-align: justify;\">Concernant le revenu par les jeunes install&#233;s tout d&#8217;abord. Ces derniers sont oblig&#233;s de se d&#233;gager un revenu sup&#233;rieur pour financer le remboursement d&#8217;emprunts contract&#233;s &#224; titre priv&#233; pour financer notamment le rachat de leur exploitation. Il ne s&#8217;agit donc pas du revenu r&#233;ellement per&#231;u. Ainsi, il est n&#233;cessaire d&#8217;augmenter les plafonds afin de ne pas p&#233;naliser ces jeunes install&#233;s, qui seraient alors redevables de l&#8217;imp&#244;t sur le revenu sur des revenus qu&#8217;ils ne per&#231;oivent pas r&#233;ellement.</p><p style=\"text-align: justify;\">Concernant les aides &#224; l&#8217;installation, et plus g&#233;n&#233;ralement de la Dotation Jeunes Agriculteurs (DJA), l&#224; encore les plafonds sont incoh&#233;rents avec les montants de DJA per&#231;ues par les jeunes agriculteurs qui r&#233;alisent une installation aid&#233;e. En effet, d&#8217;apr&#232;s les derni&#232;res donn&#233;es communiqu&#233;es par le Minist&#232;re de l&#8217;Agriculture et de l&#8217;Alimentation, le montant moyen de la DJA en 2017 est de 27&#160;400&#160;&#8364;, soit quasiment l&#8217;&#233;quivalent de 2 SMIC annuels net. Aussi il ne s&#8217;agit l&#224; que d&#8217;une moyenne et bon nombre de DJA atteignent le double, et m&#234;me parfois plus. Pour ces raisons il est n&#233;cessaire de porter &#224; 100&#160;% l&#8217;abattement fiscal lors de la perception des aides &#224; l&#8217;installation, et ce dans la limite de 6 SMIC annuel net.</p><p style=\"text-align: justify;\">Enfin, il apparait plus pertinent de faire r&#233;f&#233;rence au SMIC annuel net. Cela permet une r&#233;&#233;valuation, automatique, annuelle et adapt&#233;e des plafonds.</p><p style=\"text-align: justify;\">Il s&#8217;agit l&#224; de conditions essentielles pour maintenir un dispositif attractif.</p>"
  },
  "representations": [
    {
      "nom": "PDF",
      "typeMime": {
        "type": "application",
        "subType": "PDF"
      },
      "statutRepresentation": {
        "verbatim": true,
        "canonique": true,
        "officielle": true,
        "transcription": false,
        "enregistrement": false
      },
      "contenu": {
        "documentURI": "/15/amendements/1255C/CION_FIN/CF24.pdf"
      }
    }
  ],
  "sort": {
    "dateSaisie": "2018-11-07T15:09:56.000+01:00",
    "sortEnSeance": "Retiré"
  },
  "dateDepot": "2018-10-16T02:00:00.000+02:00",
  "dateDistribution": "2018-11-06T01:00:00.000+01:00",
  "article99": "0",
  "loiReference": {}
}