{
  "uid": "AMANR5L15SEA717460BTC1396P0D1N1161",
  "identifiant": {
    "legislature": "15",
    "numero": "1161",
    "numRect": "0",
    "saisine": {
      "texteLegislatifRef": "PRJLANR5L15BTC1396",
      "numeroPartiePLF": "0",
      "organeExamen": "PO717460",
      "mentionSecondeDeliberation": "0"
    }
  },
  "numeroLong": "1161",
  "etapeTexte": "1ère lecture (2ème assemblée saisie)",
  "triAmendement": "oiaaaaaaaaaaaaaaaaaaaaaaaaaaaaaaaaaaaaaaaaaaaaaaaap",
  "cardinaliteAmdtMultiples": "1",
  "etat": "Discuté",
  "signataires": {
    "auteur": {
      "typeAuteur": "Depute",
      "acteurRef": "PA330684",
      "groupePolitiqueRef": "PO730934"
    },
    "cosignatairesRefs": [
      "PA330684"
    ],
    "texteAffichable": "Mme&#160;Val&#233;rie&#160;Boyer"
  },
  "pointeurFragmentTexte": {
    "division": {
      "titre": "Article 57",
      "articleDesignationCourte": "APRÈS ART. 57",
      "type": "ARTICLE",
      "avantAApres": "Apres",
      "divisionRattachee": "APRÈS L'ARTICLE 57, insérer l'article suivant:",
      "articleAdditionnel": "1",
      "urlDivisionTexteVise": "/15/textes/1396.asp#D_Article_57"
    }
  },
  "corps": {
    "dispositif": "<p>Dans un d&#233;lai de trois mois &#224; compter de la promulgation de la pr&#233;sente loi, le Gouvernement remet un rapport au Parlement qui &#233;tudie l&#8217;efficacit&#233; du dispositif de l&#8217;ordonnance de protection pr&#233;vu par la loi&#160; n&#176; 2010-769 du 9 juillet 2010, sur l&#8217;exp&#233;rimentation du dispositif de protection &#233;lectronique des victimes de violences conjugales pr&#233;vue par la loi n&#176; 2017-258 du 28 f&#233;vrier 2017 et sur la cr&#233;ation d&#8217;une juridiction sp&#233;cialis&#233;e.</p>",
    "exposeSommaire": "<p>Issue du rapport d&#8217;information du d&#233;put&#233; Guy Geoffroy[1], la loi n&#176; 2010-769 du 9 juillet 2010 relative aux violences faites sp&#233;cifiquement aux femmes, aux violences au sein des couples et &#224; leurs incidences sur les enfants a pr&#233;vu, comme mesure centrale, la cr&#233;ation de l&#8217;ordonnance de protection. Rendue par le juge aux affaires familiales (JAF), celle-ci vise &#224; fournir un cadre d&#8217;ensemble aux femmes victimes de violences. La liste des mesures que peut prendre le JAF sur le fondement de l&#8217;article 515-11 du code civil est particuli&#232;rement compl&#232;te.</p><p>Outre la cr&#233;ation de l&#8217;ordonnance de protection, la loi du 9 juillet 2010 a introduit de nouvelles dispositions p&#233;nales transcrivant la jurisprudence de la Cour de cassation en mati&#232;re de violences. D&#233;sormais, &#171; les violences (&#8230;.) sont r&#233;prim&#233;es quelle que soit leur nature, y compris s&#8217;il s&#8217;agit de violences psychologiques &#187;.</p><p>Malheureusement les chiffres des homicides conjugaux sont encore &#233;lev&#233;s et doivent n&#233;cessairement amener &#224; une remise en cause de notre l&#233;gislation.</p><p>Afin d&#8217;avoir des statistiques et des donn&#233;es fiables,&#160;cet amendement pr&#233;voit que le Gouvernement&#160; remette, dans un d&#233;lai de trois mois &#224; compter de la promulgation de la pr&#233;sente loi, un rapport au Parlement sur l&#8217;efficacit&#233; des mesures de protection pr&#233;vues par la loi&#160; n&#176; 2010-769 du 9 juillet 2010 et sur l&#8217;exp&#233;rimentation du dispositif de protection &#233;lectronique des victimes de violences conjugales pr&#233;vue par la loi n&#176; 2017-258 du 28 f&#233;vrier 2017.</p><p>En effet, bien que la loi du 9 juillet 2010 pr&#233;voie la mise en place d&#8217;un dispositif d&#8217;exp&#233;rimentation de protection &#233;lectronique des victimes de violences conjugales, ce dernier n&#8217;a jamais &#233;t&#233; effectif.</p><p>C&#8217;est ce que propose, &#224; nouveau, de mettre en place la loi du 28 f&#233;vrier 2017.</p><p>Enfin, dans le cadre d&#8217;une future r&#233;forme de la justice familiale et p&#233;nale cet article envisage &#233;galement que le rapport consacre une partie sur l&#8217;efficacit&#233; d&#8217;une juridiction sp&#233;cialis&#233;e qui permettrait un traitement minutieux et particulier, de tous les dossiers comportant des all&#233;gations de violences domestiques sur les personnes et les enfants, avec des intervenants judiciaires, magistrats, experts, m&#233;decins, assistantes sociales, enqu&#234;teurs sociaux, &#233;ducateurs express&#233;ment form&#233;s aux syst&#232;mes de domination, de perversion et de violence sur les personnes.</p><p><br /> <br />[1] Rapport d&#8217;information n&#176; 1799, publi&#233; le 7 juillet 2009.</p>"
  },
  "representations": [
    {
      "nom": "PDF",
      "typeMime": {
        "type": "application",
        "subType": "PDF"
      },
      "statutRepresentation": {
        "verbatim": true,
        "canonique": true,
        "officielle": true,
        "transcription": false,
        "enregistrement": false
      },
      "contenu": {
        "documentURI": "/15/amendements/1396/AN/1161.pdf"
      }
    }
  ],
  "seanceDiscussion": "RUANR5L15S2019IDS21420",
  "sort": {
    "dateSaisie": "2018-12-11T23:40:14.000+01:00",
    "sortEnSeance": "Non soutenu"
  },
  "dateDepot": "2018-11-15T01:00:00.000+01:00",
  "dateDistribution": "2018-11-22T01:00:00.000+01:00",
  "article99": "0",
  "loiReference": {}
}