{
  "uid": "AMANR5L15SEA717460BTC1974P0D1N3604",
  "identifiant": {
    "legislature": "15",
    "numero": "3604",
    "numRect": "0",
    "saisine": {
      "texteLegislatifRef": "PRJLANR5L15BTC1974",
      "numeroPartiePLF": "0",
      "organeExamen": "PO717460",
      "mentionSecondeDeliberation": "0"
    }
  },
  "numeroLong": "3604",
  "etapeTexte": "1ère lecture (2ème assemblée saisie)",
  "triAmendement": "jmaaaaaaaaaaaaaaaaaaaaaaaaaaaaaaaaaaaaaaaaaaaaaaaau",
  "cardinaliteAmdtMultiples": "1",
  "amendementParent": "AMANR5L15SEA717460BTC1974P0D1N1965",
  "etat": "Discuté",
  "signataires": {
    "auteur": {
      "typeAuteur": "Depute",
      "acteurRef": "PA720944",
      "groupePolitiqueRef": "PO730964"
    },
    "cosignatairesRefs": [
      "PA720944"
    ],
    "texteAffichable": "Mme&#160;Park"
  },
  "pointeurFragmentTexte": {
    "division": {
      "titre": "Article 33",
      "articleDesignationCourte": "APRÈS ART. 33",
      "type": "ARTICLE",
      "avantAApres": "Apres",
      "divisionRattachee": "APRÈS L'ARTICLE 33, insérer l'article suivant:",
      "articleAdditionnel": "1",
      "urlDivisionTexteVise": "/15/textes/1974.asp#D_Article_33"
    }
  },
  "corps": {
    "dispositif": "<p style=\"text-align: justify;\">&#192; l&#8217;alin&#233;a&#160;3, substituer &#224; la r&#233;f&#233;rence&#160;:</p><p style=\"text-align: justify;\">&#171;&#160;L.&#160;114&#8209;1&#160;&#187;,</p><p style=\"text-align: justify;\">la r&#233;f&#233;rence&#160;:</p><p style=\"text-align: justify;\">&#171; L.&#160;114&#8209;2&#160;&#187;.</p>",
    "exposeSommaire": "<p>Sous-amendement r&#233;dactionnel.</p>"
  },
  "representations": [
    {
      "nom": "PDF",
      "typeMime": {
        "type": "application",
        "subType": "PDF"
      },
      "statutRepresentation": {
        "verbatim": true,
        "canonique": true,
        "officielle": true,
        "transcription": false,
        "enregistrement": false
      },
      "contenu": {
        "documentURI": "/15/amendements/1974/AN/3604.pdf"
      }
    }
  ],
  "seanceDiscussion": "RUANR5L15S2019IDS21702",
  "sort": {
    "dateSaisie": "2019-06-14T16:47:40.000+02:00",
    "sortEnSeance": "Adopté"
  },
  "dateDepot": "2019-06-14T02:00:00.000+02:00",
  "dateDistribution": "2019-06-14T02:00:00.000+02:00",
  "article99": "0",
  "loiReference": {}
}