{
  "uid": "AMANR5L15PO419865B2274P0D1N13",
  "identifiant": {
    "legislature": "15",
    "numero": "13",
    "numRect": "0",
    "saisine": {
      "texteLegislatifRef": "PRJLANR5L15B2274",
      "numeroPartiePLF": "0",
      "organeExamen": "PO419865",
      "mentionSecondeDeliberation": "0"
    }
  },
  "numeroLong": "CD13",
  "etapeTexte": "1ère lecture (2ème assemblée saisie)",
  "triAmendement": "cpaaaaaaaaaaaaaaaaaaaaaaaaaaaaaaaaaaaaaaaaaaaaaaaafk",
  "cardinaliteAmdtMultiples": "1",
  "etat": "En traitement",
  "signataires": {
    "auteur": {
      "typeAuteur": "Depute",
      "acteurRef": "PA718884",
      "groupePolitiqueRef": "PO730934"
    },
    "cosignatairesRefs": [
      "PA608016",
      "PA718884",
      "PA721506",
      "PA608416",
      "PA721678",
      "PA267378",
      "PA267260",
      "PA266793"
    ],
    "texteAffichable": "Mme&#160;Bazin-Malgras,  M.&#160;Bony, Mme&#160;Louwagie, M.&#160;Hetzel, Mme&#160;Kuster, Mme&#160;Poletti, Mme&#160;Levy et M.&#160;Reda"
  },
  "pointeurFragmentTexte": {
    "division": {
      "titre": "Article 5 bis C",
      "articleDesignationCourte": "ART. 5 BIS C",
      "type": "ARTICLE",
      "avantAApres": "A",
      "divisionRattachee": "ARTICLE 5 BIS C",
      "urlDivisionTexteVise": "/15/textes/2274.asp#D_Article_5_bis_C"
    },
    "alinea": {
      "numero": "2"
    }
  },
  "corps": {
    "dispositif": "<p style=\"text-align: justify;\">&#192; l&#8217;alin&#233;a&#160;2, substituer aux r&#233;f&#233;rences&#160;:</p><p style=\"text-align: justify;\">&#171;&#160;, L.&#160;641&#8209;11, L.&#160;641&#8209;11&#8209;1 et L.&#160;641&#8209;11&#8209;2&#160;&#187;</p><p style=\"text-align: justify;\">la r&#233;f&#233;rence&#160;:</p><p style=\"text-align: justify;\">&#171;&#160;et L.&#160;641&#8209;11&#160;&#187;.</p>",
    "exposeSommaire": "<p style=\"text-align: justify;\">Cet article vise &#224; imposer que les cahiers des charges des signes d&#8217;identification de la qualit&#233; et de l&#8217;origine pr&#233;voient les conditions dans lesquelles les produits sont vendus en vrac.</p><p style=\"text-align: justify;\">Les articles L.&#160;641&#8209;11&#8209;1 et L.&#160;641&#8209;11&#8209;2 du code rural et de la p&#234;che sont inclus dans le p&#233;rim&#232;tre de cette obligation.</p><p style=\"text-align: justify;\">Pourtant ces deux articles concernent les boissons spiritueuses et les produits vinicoles aromatis&#233;s. On con&#231;oit difficilement comment ces produits pourraient &#234;tre vendus en vrac.</p><p style=\"text-align: justify;\">En ce sens, cet amendement propose de ne pas imposer que les cahiers des charges des signes d&#8217;identification de la qualit&#233; et de l&#8217;origine pr&#233;voient les conditions dans lesquelles ces produits soient vendus en vrac.</p>",
    "cartoucheDelaiDepotDepasse": "Sous réserve de son traitement par les services de l'Assemblée nationale et de sa recevabilité"
  },
  "representations": [
    {
      "nom": "PDF",
      "typeMime": {
        "type": "application",
        "subType": "PDF"
      },
      "statutRepresentation": {
        "verbatim": true,
        "canonique": true,
        "officielle": true,
        "transcription": false,
        "enregistrement": false
      },
      "contenu": {
        "documentURI": "/15/amendements/2274/CION-DVP/CD13.pdf"
      }
    }
  ],
  "dateDepot": "2019-11-07T01:00:00.000+01:00",
  "article99": "0",
  "loiReference": {}
}