{
  "uid": "AMANR5L15SEA717460BTC1548P0D1N46",
  "identifiant": {
    "legislature": "15",
    "numero": "46",
    "numRect": "0",
    "saisine": {
      "texteLegislatifRef": "PRJLANR5L15BTC1548",
      "numeroPartiePLF": "0",
      "organeExamen": "PO717460",
      "mentionSecondeDeliberation": "0"
    }
  },
  "numeroLong": "46",
  "etapeTexte": "Nouvelle Lecture",
  "triAmendement": "bakaaaaaaaaaaaaaaaaaaaaaaaaaaaaaaaaaaaaaaaaaaaaaaaakk",
  "cardinaliteAmdtMultiples": "1",
  "etat": "Discuté",
  "signataires": {
    "auteur": {
      "typeAuteur": "Depute",
      "acteurRef": "PA719318",
      "groupePolitiqueRef": "PO730934"
    },
    "cosignatairesRefs": [
      "PA718838",
      "PA267204",
      "PA721474",
      "PA1029",
      "PA642847",
      "PA721678",
      "PA267260",
      "PA719272",
      "PA266793",
      "PA720630",
      "PA267735",
      "PA709315",
      "PA721636",
      "PA1874",
      "PA719318",
      "PA606712",
      "PA608016",
      "PA267378",
      "PA643134",
      "PA346218",
      "PA718884"
    ],
    "texteAffichable": "Mme&#160;Anthoine,  Mme&#160;Bazin-Malgras, M.&#160;Masson, M.&#160;Reda, M.&#160;Lurton, M.&#160;Bony, M.&#160;Bazin, Mme&#160;Levy, Mme&#160;Meunier, M.&#160;Sermier, Mme&#160;Poletti, M.&#160;Deflesselles, Mme&#160;Louwagie, M.&#160;Brun, M.&#160;Le Fur, M.&#160;Parigi, M.&#160;Minot, M.&#160;de Ganay, M.&#160;Viry, Mme&#160;Valentin et M.&#160;Viala"
  },
  "pointeurFragmentTexte": {
    "division": {
      "titre": "Article 12",
      "articleDesignationCourte": "ART. 12",
      "type": "ARTICLE",
      "avantAApres": "A",
      "divisionRattachee": "ARTICLE 12",
      "urlDivisionTexteVise": "/15/textes/1548.asp#D_Article_12"
    },
    "alinea": {
      "avantAApres": "Apres",
      "numero": "1"
    }
  },
  "corps": {
    "dispositif": "<p style=\"text-align: justify;\">Apr&#232;s l&#8217;alin&#233;a&#160;1, ins&#233;rer les trois alin&#233;as suivants&#160;:</p><p style=\"text-align: justify;\">&#171;&#160;1&#176; A L&#8217;article&#160;229&#8209;2 est compl&#233;t&#233; par un alin&#233;a ainsi r&#233;dig&#233;&#160;:</p><p style=\"text-align: justify;\">&#171;&#160;&#171;&#160;3&#176; La proc&#233;dure comprend un ou plusieurs &#233;l&#233;ments d&#8217;extran&#233;it&#233; li&#233;s &#224; la nationalit&#233; &#233;trang&#232;re ou &#224; la r&#233;sidence habituelle &#224; l&#8217;&#233;tranger de l&#8217;un des &#233;poux.&#160;&#187;&#160;;</p><p style=\"text-align: justify;\">&#171;&#160;1&#176; B Le d&#233;but de l&#8217;article&#160;230 est ainsi r&#233;dig&#233;&#160;: &#171;&#160;Dans les cas pr&#233;vus aux 1&#176; et 3&#176; de l&#8217;article&#160;229&#8209;2,... (<i>le reste sans changement</i>).&#160;&#187;</p>",
    "exposeSommaire": "<p style=\"text-align: justify;\">Face aux difficult&#233;s rencontr&#233;es dans certains cas divorce internationaux pour la reconnaissance et la mise en &#339;uvre de la convention de divorce par consentement mutuel par acte sous seing priv&#233; contresign&#233; par avocats, d&#233;pos&#233;e au rang des minutes du notaire, il est propos&#233; de redonner comp&#233;tence au juge judiciaire pour prononcer le divorce comprenant un ou plusieurs &#233;l&#233;ments d&#8217;extran&#233;it&#233; li&#233;s &#224; la nationalit&#233; ou la r&#233;sidence de l&#8217;un des &#233;poux. En effet, m&#234;me dans l&#8217;UE,&#160;de nombreux pays ne reconnaissent pas le divorce par consentement mutuel non judiciaire, faisant ainsi obstacle aux proc&#233;dures d&#8217;ex&#233;cution facilit&#233;e propos&#233;es par les r&#232;glements&#160;europ&#233;ens.</p><p style=\"text-align: justify;\">Consid&#233;rant que les &#233;poux ne pourraient pas consentir mutuellement &#224; leur divorce par acte sous signature priv&#233;e contresign&#233; par avocats lorsque la proc&#233;dure comprend un ou plusieurs &#233;l&#233;ments d&#8217;extran&#233;it&#233; li&#233; &#224; la nationalit&#233; &#233;trang&#232;re ou la r&#233;sidence habituelle &#224; l&#8217;&#233;tranger de l&#8217;un des &#233;poux, cet amendement pr&#233;voit, dans ce cas qu&#8217;il sera fait application de l&#8217;article&#160;230 du code civil. Le divorce pourra &#234;tre demand&#233; conjointement par les &#233;poux lorsqu&#8217;ils s&#8217;entendent sur la rupture du mariage et ses effets en soumettant &#224; l&#8217;approbation du juge une convention r&#233;glant les cons&#233;quences du divorce.</p>"
  },
  "representations": [
    {
      "nom": "PDF",
      "typeMime": {
        "type": "application",
        "subType": "PDF"
      },
      "statutRepresentation": {
        "verbatim": true,
        "canonique": true,
        "officielle": true,
        "transcription": false,
        "enregistrement": false
      },
      "contenu": {
        "documentURI": "/15/amendements/1548/AN/46.pdf"
      }
    }
  ],
  "seanceDiscussion": "RUANR5L15S2019IDS21450",
  "sort": {
    "dateSaisie": "2019-01-17T11:42:15.000+01:00",
    "sortEnSeance": "Non soutenu"
  },
  "dateDepot": "2019-01-07T01:00:00.000+01:00",
  "dateDistribution": "2019-01-14T01:00:00.000+01:00",
  "article99": "0",
  "loiReference": {}
}