{
  "uid": "AMANR5L15PO766718B2187P0D1N1999",
  "identifiant": {
    "legislature": "15",
    "numero": "1999",
    "numRect": "0",
    "saisine": {
      "texteLegislatifRef": "PRJLANR5L15B2187",
      "numeroPartiePLF": "0",
      "organeExamen": "PO766718",
      "mentionSecondeDeliberation": "0"
    }
  },
  "numeroLong": "1999",
  "etapeTexte": "1ère lecture (1ère assemblée saisie)",
  "triAmendement": "apaaaaaaaaaaaaaaaaaaaaaaaaaaaaaaaaaaaaaaaaaaaaaaaakzzzzuo",
  "cardinaliteAmdtMultiples": "1",
  "etat": "Discuté",
  "signataires": {
    "auteur": {
      "typeAuteur": "Depute",
      "acteurRef": "PA721924",
      "groupePolitiqueRef": "PO730970"
    },
    "cosignatairesRefs": [
      "PA719488",
      "PA720326",
      "PA721924"
    ],
    "texteAffichable": "Mme&#160;de Vaucouleurs,  M.&#160;Berta, rapporteur et M.&#160;Hammouche"
  },
  "pointeurFragmentTexte": {
    "division": {
      "titre": "Article 4",
      "articleDesignationCourte": "ART. 4",
      "type": "ARTICLE",
      "avantAApres": "A",
      "divisionRattachee": "ARTICLE 4",
      "urlDivisionTexteVise": "/15/textes/2187.asp#D_Article_4"
    },
    "alinea": {
      "numero": "13"
    }
  },
  "corps": {
    "dispositif": "<p style=\"text-align: justify;\">R&#233;diger ainsi l&#8217;alin&#233;a&#160;13&#160;:</p><p style=\"text-align: justify;\">&#171;&#160;<i>Art.&#160;342&#8209;9.</i>&#160;&#8211;&#160;Lorsque les couples compos&#233;s d&#8217;un homme et d&#8217;une femme, ou de deux femmes, ou les femmes seules, recourent &#224; une assistance m&#233;dicale &#224; la procr&#233;ation avec l&#8217;intervention d&#8217;un tiers donneur dans les conditions pr&#233;vues par le code de la sant&#233; publique, aucun lien de filiation ne peut &#234;tre &#233;tabli entre l&#8217;auteur du don et l&#8217;enfant issu de la procr&#233;ation. Aucune action en responsabilit&#233; ne peut &#234;tre exerc&#233;e &#224; l&#8217;encontre du donneur.&#160;&#187;</p>",
    "exposeSommaire": "<p style=\"text-align: justify;\">Cet amendement vise &#224; int&#233;grer les dispositions pr&#233;alablement sp&#233;cifi&#233;es dans l&#8217;article&#160;311&#8209;19 du code civil qui a &#233;t&#233; supprim&#233; pour les int&#233;grer dans le pr&#233;sent titre VII <i>bis</i>, qui traite l&#8217;ensemble des situations relatives &#224; la filiation dans le cadre de recours &#224; une assistance m&#233;dicale &#224; la procr&#233;ation.</p>"
  },
  "representations": [
    {
      "nom": "PDF",
      "typeMime": {
        "type": "application",
        "subType": "PDF"
      },
      "statutRepresentation": {
        "verbatim": true,
        "canonique": true,
        "officielle": true,
        "transcription": false,
        "enregistrement": false
      },
      "contenu": {
        "documentURI": "/15/amendements/2187/CSBIOETH/1999.pdf"
      }
    }
  ],
  "sort": {
    "dateSaisie": "2019-09-13T00:07:48.000+02:00",
    "sortEnSeance": "Tombé"
  },
  "dateDepot": "2019-09-05T02:00:00.000+02:00",
  "dateDistribution": "2019-09-10T02:00:00.000+02:00",
  "article99": "0",
  "loiReference": {}
}