{
  "uid": "AMANR5L15SEA717460B2272P1D1N3092",
  "identifiant": {
    "legislature": "15",
    "numero": "3092",
    "numRect": "0",
    "saisine": {
      "texteLegislatifRef": "PRJLANR5L15B2272",
      "numeroPartiePLF": "1",
      "organeExamen": "PO717460",
      "mentionSecondeDeliberation": "0"
    }
  },
  "numeroLong": "I-3092",
  "etapeTexte": "1ère lecture (1ère assemblée saisie)",
  "triAmendement": "gaaaaaaaaaaaaaaaaaaaaaaaaaaaaaaaaaaaaaaaaaaaaaaaaabbdzxi",
  "cardinaliteAmdtMultiples": "1",
  "etat": "Discuté",
  "signataires": {
    "auteur": {
      "typeAuteur": "Gouvernement"
    },
    "texteAffichable": "le Gouvernement"
  },
  "pointeurFragmentTexte": {
    "division": {
      "titre": "Article 21",
      "articleDesignationCourte": "ART. 21",
      "type": "ARTICLE",
      "avantAApres": "A",
      "divisionRattachee": "ARTICLE 21",
      "urlDivisionTexteVise": "/15/textes/2272A.asp#D_Article_21"
    }
  },
  "corps": {
    "dispositif": "<p>&#192; l'alin&#233;a 2, substituer au nombre&#160;:</p><p>&#171;&#160;26&#160;801&#160;527&#160;462&#160;&#187;</p><p>le nombre&#160;:</p><p>&#171;&#160;26&#160;851&#160;874&#160;416&#160;&#187;.</p>",
    "exposeSommaire": "<p style=\"text-align: justify;\">Cet amendement tient compte de la modification du sch&#233;ma financier de reprise des ressources au d&#233;partement de La R&#233;union n&#233;cessaire &#224; la mise en &#339;uvre du droit &#224; compensation int&#233;grale de l&#8217;Etat au titre de la recentralisation du RSA.</p><p style=\"text-align: justify;\">En effet, le montant de 26&#160;801&#160;527&#160;462 inscrit initialement dans le projet de loi de finances int&#233;grait une mesure de p&#233;rim&#232;tre sur la DGF de La R&#233;union, dont les dotations forfaitaire et de compensation &#233;taient minor&#233;es respectivement de 46,3&#160;M&#8364; et de 100,7&#160;M&#8364;.</p><p style=\"text-align: justify;\">Afin de tenir compte du souhait exprim&#233; par le d&#233;partement de La R&#233;union d&#8217;int&#233;grer le produit de la taxe sur les tabacs dans le panier de ressources reprises, le Gouvernement propose de modifier le sch&#233;ma initial s&#8217;agissant du financement du solde permettant d&#8217;assurer la compensation int&#233;grale de l&#8217;Etat. Ce solde sera financ&#233; pour moiti&#233; par l&#8217;affectation d&#8217;une fraction du produit de la taxe sur les tabacs au budget g&#233;n&#233;ral de l&#8217;Etat, et pour l&#8217;autre moiti&#233; par une reprise sur la dotation de compensation de la DGF. En cons&#233;quence, il est propos&#233; de r&#233;duire de moiti&#233; la r&#233;faction de la part compensation de la DGF de la R&#233;union, &#224; hauteur de 50,3&#160;M&#8364;.</p>",
    "cartoucheDelaiDepotDepasse": "Sous réserve de son traitement par les services de l'Assemblée nationale et de sa recevabilité"
  },
  "representations": [
    {
      "nom": "PDF",
      "typeMime": {
        "type": "application",
        "subType": "PDF"
      },
      "statutRepresentation": {
        "verbatim": true,
        "canonique": true,
        "officielle": true,
        "transcription": false,
        "enregistrement": false
      },
      "contenu": {
        "documentURI": "/15/amendements/2272A/AN/3092.pdf"
      }
    }
  ],
  "seanceDiscussion": "RUANR5L15S2020IDS21871",
  "sort": {
    "dateSaisie": "2019-10-19T01:56:52.000+02:00",
    "sortEnSeance": "Adopté"
  },
  "dateDepot": "2019-10-19T02:00:00.000+02:00",
  "dateDistribution": "2019-10-19T02:00:00.000+02:00",
  "article99": "1",
  "loiReference": {}
}