{
  "uid": "AMANR5L15PO419604B1616P0D1N25",
  "identifiant": {
    "legislature": "15",
    "numero": "25",
    "numRect": "0",
    "saisine": {
      "texteLegislatifRef": "PIONANR5L15B1616",
      "numeroPartiePLF": "0",
      "organeExamen": "PO419604",
      "mentionSecondeDeliberation": "0"
    }
  },
  "numeroLong": "AC25",
  "etapeTexte": "1ère lecture (2ème assemblée saisie)",
  "triAmendement": "baaaaaaaaaaaaaaaaaaaaaaaaaaaaaaaaaaaaaaaaaaaaaaaaatd",
  "cardinaliteAmdtMultiples": "1",
  "etat": "Discuté",
  "signataires": {
    "auteur": {
      "typeAuteur": "Depute",
      "acteurRef": "PA345722",
      "groupePolitiqueRef": "PO730934"
    },
    "cosignatairesRefs": [
      "PA345722"
    ],
    "texteAffichable": "Mme&#160;Le Grip"
  },
  "pointeurFragmentTexte": {
    "division": {
      "titre": "Article 2",
      "articleDesignationCourte": "ART. 2",
      "type": "ARTICLE",
      "avantAApres": "A",
      "divisionRattachee": "ARTICLE 2",
      "urlDivisionTexteVise": "/15/textes/1616.asp#D_Article_2"
    },
    "alinea": {
      "numero": "2"
    }
  },
  "corps": {
    "dispositif": "<p style=\"text-align: justify;\">&#192; l&#8217;alin&#233;a&#160;2, substituer au mot&#160;:</p><p style=\"text-align: justify;\">&#171;&#160;cinq&#160;&#187; </p><p style=\"text-align: justify;\">le mot&#160;:</p><p style=\"text-align: justify;\">&#171;&#160;deux&#160;&#187;.</p>",
    "exposeSommaire": "<p style=\"text-align: justify;\">La directive relative au droit d&#8217;auteur pour le march&#233; unique num&#233;rique, adopt&#233;e le 26 mars 2019 par le Parlement europ&#233;en, pr&#233;voit une dur&#233;e des droits patrimoniaux des b&#233;n&#233;ficiaires de droits voisins de deux ans. Cet amendement vise donc &#224; transposer le dispositif europ&#233;en dans le droit fran&#231;ais.</p>"
  },
  "representations": [
    {
      "nom": "PDF",
      "typeMime": {
        "type": "application",
        "subType": "PDF"
      },
      "statutRepresentation": {
        "verbatim": true,
        "canonique": true,
        "officielle": true,
        "transcription": false,
        "enregistrement": false
      },
      "contenu": {
        "documentURI": "/15/amendements/1616/CION-CEDU/AC25.pdf"
      }
    }
  ],
  "sort": {
    "dateSaisie": "2019-04-30T17:29:48.000+02:00",
    "sortEnSeance": "Adopté"
  },
  "dateDepot": "2019-04-26T02:00:00.000+02:00",
  "dateDistribution": "2019-04-30T02:00:00.000+02:00",
  "article99": "0",
  "loiReference": {}
}