{
  "uid": "AMANR5L15SEA717460B2272P2D1N2504",
  "identifiant": {
    "legislature": "15",
    "numero": "2504",
    "numRect": "0",
    "saisine": {
      "texteLegislatifRef": "PRJLANR5L15B2272",
      "numeroPartiePLF": "2",
      "organeExamen": "PO717460",
      "mentionSecondeDeliberation": "0"
    }
  },
  "numeroLong": "II-2504",
  "etapeTexte": "1ère lecture (1ère assemblée saisie)",
  "triAmendement": "edaaaaaaaaaaaaaaaaaaaaaaaaaaaaaaaaaaaaaaaaaaaaaaaaan",
  "cardinaliteAmdtMultiples": "1",
  "etat": "Retiré",
  "signataires": {
    "auteur": {
      "typeAuteur": "Depute",
      "acteurRef": "PA720728",
      "groupePolitiqueRef": "PO730970"
    },
    "cosignatairesRefs": [
      "PA718978",
      "PA720728",
      "PA720002"
    ],
    "texteAffichable": "M.&#160;Mattei,  Mme&#160;El Ha&#239;ry et M.&#160;Laqhila"
  },
  "pointeurFragmentTexte": {
    "division": {
      "titre": "Article 47",
      "articleDesignationCourte": "AVANT ART. 47",
      "type": "ARTICLE",
      "avantAApres": "Avant",
      "divisionRattachee": "AVANT L'ARTICLE 47, insérer l'article suivant:",
      "articleAdditionnel": "1",
      "urlDivisionTexteVise": "/15/textes/2272C.asp#D_Article_47"
    }
  },
  "corps": {},
  "representations": [
    {
      "nom": "PDF",
      "typeMime": {
        "type": "application",
        "subType": "PDF"
      },
      "statutRepresentation": {
        "verbatim": true,
        "canonique": true,
        "officielle": true,
        "transcription": false,
        "enregistrement": false
      },
      "contenu": {
        "documentURI": "/15/amendements/2272C/AN/2504.pdf"
      }
    }
  ],
  "dateDepot": "2019-11-08T01:00:00.000+01:00",
  "dateDistribution": "2019-11-10T01:00:00.000+01:00",
  "article99": "0",
  "loiReference": {
    "codeLoi": "CGI",
    "divisionCodeLoi": "151 octies"
  }
}