{
  "uid": "AMANR5L15PO420120B2272P2D1N18",
  "identifiant": {
    "legislature": "15",
    "numero": "18",
    "numRect": "0",
    "saisine": {
      "texteLegislatifRef": "PRJLANR5L15B2272",
      "numeroPartiePLF": "2",
      "organeExamen": "PO420120",
      "mentionSecondeDeliberation": "0"
    }
  },
  "numeroLong": "II-AS18",
  "etapeTexte": "1ère lecture (1ère assemblée saisie)",
  "triAmendement": "abeoaaaaaaaaaaaaaaaaaaaaaaaaaaaaaaaaaaaaaaaaaaaaaabf",
  "cardinaliteAmdtMultiples": "1",
  "etat": "Discuté",
  "signataires": {
    "auteur": {
      "typeAuteur": "Depute",
      "acteurRef": "PA267318",
      "groupePolitiqueRef": "PO730934"
    },
    "cosignatairesRefs": [
      "PA267204",
      "PA267378",
      "PA718780",
      "PA340853",
      "PA608826",
      "PA721678",
      "PA2377",
      "PA267318",
      "PA605036",
      "PA267735",
      "PA606098",
      "PA719318",
      "PA267901",
      "PA606712",
      "PA266776",
      "PA608016",
      "PA721968",
      "PA709315",
      "PA266793",
      "PA267794",
      "PA267260",
      "PA718884",
      "PA721474",
      "PA722390",
      "PA721286",
      "PA605991",
      "PA642847"
    ],
    "texteAffichable": "M.&#160;Grelier,  M.&#160;Ramadier, M.&#160;Kamardine, Mme&#160;Tabarot, M.&#160;Lurton, Mme&#160;Corneloup, M.&#160;Reiss, Mme&#160;Trastour-Isnart, M.&#160;Bony, Mme&#160;Anthoine, Mme&#160;Bazin-Malgras, M.&#160;Perrut, Mme&#160;Genevard, M.&#160;Sermier, M.&#160;Reda, M.&#160;de Ganay, M.&#160;Abad, M.&#160;Leclerc, M.&#160;Bazin, M.&#160;Vialay, M.&#160;Viry, M.&#160;Marleix, Mme&#160;Levy, Mme&#160;Duby-Muller, Mme&#160;Poletti, Mme&#160;Louwagie et M.&#160;Viala"
  },
  "pointeurFragmentTexte": {
    "missionVisee": {
      "idMissionAN": "825",
      "libelleMission": "Santé",
      "codeMissionPLF": "B",
      "libelleMissionPLF": "Répartition, par mission et programme, des crédits du budget général"
    },
    "division": {
      "titre": "Article 78",
      "articleDesignationCourte": "APRÈS ART. 78",
      "type": "ARTICLE",
      "avantAApres": "Apres",
      "divisionRattachee": "APRÈS L'ARTICLE 78, insérer l'article suivant:",
      "articleAdditionnel": "1",
      "urlDivisionTexteVise": "/15/textes/2272C.asp#D_Article_78"
    }
  },
  "corps": {
    "dispositif": "<p style=\"text-align: justify;\">Le Gouvernement pr&#233;sente, en annexe g&#233;n&#233;rale au projet de loi de finances de l&#8217;ann&#233;e, un rapport sur la politique de pr&#233;vention et de promotion de la sant&#233;. &#160;</p><p style=\"text-align: justify;\">Cette annexe rassemble l&#8217;ensemble des moyens d&#233;di&#233;s &#224; la politique de pr&#233;vention et de promotion de la sant&#233;, de l&#8217;&#201;tat, de la s&#233;curit&#233; sociale, des collectivit&#233;s territoriales et des organismes compl&#233;mentaires d&#8217;assurance maladie.</p>",
    "exposeSommaire": "<p><br />La strat&#233;gie nationale de sant&#233; 2017 2022 et le plan pr&#233;vention pr&#233;sent&#233; le 26 mars 2018 marquent un tournant en consacrant la pr&#233;vention comme pierre angulaire de notre syst&#232;me de sant&#233;. L&#8217;un des &#233;l&#233;ments importants de ce plan est dans son approche transversale des actions de pr&#233;vention pour leur financement. Mais, porter l&#8217;ambition du virage pr&#233;ventif suppose de clarifier et de mettre en coh&#233;rence les diff&#233;rents financements et types de financements de la politique de pr&#233;vention.<br />Comme le notait le Haut conseil pour l&#8217;avenir de l&#8217;assurance maladie (HCAAM) en juin 2017, &#171;&#160;il y a autant de p&#233;rim&#232;tres d&#8217;action en mati&#232;re de sant&#233; publique que de types d&#8217;interlocuteurs et cela aux diff&#233;rents &#233;chelons. Les p&#233;rim&#232;tres des acteurs &#233;tatiques, des acteurs de la s&#233;curit&#233; sociale, des collectivit&#233;s locales ou des acteurs priv&#233;s ne sont pas superposables et cette dispersion horizontale est d&#233;multipli&#233;e par la dimension multi-&#233;chelons de l&#8217;action publique en sant&#233;&#160;&#187;. En clair, l&#8217;organisation de la pr&#233;vention est dispers&#233;e, les financements &#233;galement.</p><p>La cr&#233;ation d&#8217;un &#171;&#160;jaune&#160;&#187; budg&#233;taire relatif &#224; la pr&#233;vention retra&#231;ant les financements de l&#8217;Etat, de l&#8217;Assurance maladie, des collectivit&#233;s locales et des organismes compl&#233;mentaires pourra permettre d&#8217;&#233;tayer la programmation financi&#232;re et d&#8217;appr&#233;cier les moyens d&#8217;intervention r&#233;ellement mobilisables et en pluriannuel.</p><p>Le&#160;virage pr&#233;ventif&#160;que nous appelons de nos v&#339;ux suppose cette mise en coh&#233;rence de ces diff&#233;rents financements et types de financements de la pr&#233;vention et une information et une possibilit&#233; de contr&#244;le du Parlement sur ceux-ci. C&#8217;est pourquoi il est n&#233;cessaire, en plus du document &#171;&#160;orange&#160;&#187; retra&#231;ant les seules d&#233;penses de l&#8217;Etat, de b&#233;n&#233;ficier d&#8217;un document retra&#231;ant l&#8217;ensemble des d&#233;penses consacr&#233;es &#224; la pr&#233;vention et &#224; la promotion de la sant&#233;.</p><p>Tel est l&#8217;objet du pr&#233;sent amendement.</p>"
  },
  "representations": [
    {
      "nom": "PDF",
      "typeMime": {
        "type": "application",
        "subType": "PDF"
      },
      "statutRepresentation": {
        "verbatim": true,
        "canonique": true,
        "officielle": true,
        "transcription": false,
        "enregistrement": false
      },
      "contenu": {
        "documentURI": "/15/amendements/2272C/CION-SOC/AS18.pdf"
      }
    }
  ],
  "sort": {
    "dateSaisie": "2019-10-30T18:42:44.000+01:00",
    "sortEnSeance": "Adopté"
  },
  "dateDepot": "2019-10-24T02:00:00.000+02:00",
  "dateDistribution": "2019-10-28T01:00:00.000+01:00",
  "article99": "0",
  "loiReference": {}
}