{
  "uid": "AMANR5L15PO59048B2400P0D1N36",
  "identifiant": {
    "legislature": "15",
    "numero": "36",
    "numRect": "0",
    "saisine": {
      "texteLegislatifRef": "PRJLANR5L15B2400",
      "numeroPartiePLF": "0",
      "organeExamen": "PO59048",
      "mentionSecondeDeliberation": "0"
    }
  },
  "numeroLong": "CF36",
  "etapeTexte": "1ère lecture (1ère assemblée saisie)",
  "triAmendement": "ecaaaaaaaaaaaaaaaaaaaaaaaaaaaaaaaaaaaaaaaaaaaaaaaaw",
  "cardinaliteAmdtMultiples": "1",
  "etat": "Irrecevable",
  "signataires": {
    "auteur": {
      "typeAuteur": "Depute",
      "acteurRef": "PA720402",
      "groupePolitiqueRef": "PO730964"
    },
    "cosignatairesRefs": [
      "PA720402"
    ],
    "texteAffichable": "M.&#160;Paluszkiewicz"
  },
  "pointeurFragmentTexte": {
    "missionVisee": {
      "idMissionAN": "859",
      "libelleMission": "Écologie, développement et mobilité durables",
      "codeMissionPLF": "B",
      "libelleMissionPLF": "Répartition des crédits pour 2019 ouverts et annulés, par mission et programme, au titre du budget général"
    },
    "division": {
      "titre": "ÉTAT B",
      "articleDesignationCourte": "ART. 5",
      "type": "ANNEXE",
      "avantAApres": "A",
      "divisionRattachee": "ARTICLE 5",
      "urlDivisionTexteVise": "/15/textes/2400.asp#D_ETAT_B"
    }
  },
  "corps": {},
  "representations": [
    {
      "nom": "PDF",
      "typeMime": {
        "type": "application",
        "subType": "PDF"
      },
      "statutRepresentation": {
        "verbatim": true,
        "canonique": true,
        "officielle": true,
        "transcription": false,
        "enregistrement": false
      },
      "contenu": {
        "documentURI": "/15/amendements/2400/CION_FIN/CF36.pdf"
      }
    }
  ],
  "dateDepot": "2019-11-08T01:00:00.000+01:00",
  "dateDistribution": "2019-11-09T01:00:00.000+01:00",
  "article99": "0",
  "loiReference": {}
}