{
  "uid": "AMANR5L15SEA717460BTC1761P0D1N1041",
  "identifiant": {
    "legislature": "15",
    "numero": "1041",
    "numRect": "0",
    "saisine": {
      "texteLegislatifRef": "PRJLANR5L15BTC1761",
      "numeroPartiePLF": "0",
      "organeExamen": "PO717460",
      "mentionSecondeDeliberation": "0"
    }
  },
  "numeroLong": "1041",
  "etapeTexte": "Nouvelle Lecture",
  "triAmendement": "aakaaaacaaaaaaaaaaaaaaaaaaaaaaaaaaaaaaaaaaaaaaaaaazzzzzzzzzzzzzzzzzzzs",
  "cardinaliteAmdtMultiples": "1",
  "etat": "Discuté",
  "signataires": {
    "auteur": {
      "typeAuteur": "Depute",
      "acteurRef": "PA719024",
      "groupePolitiqueRef": "PO730964"
    },
    "cosignatairesRefs": [
      "PA719448",
      "PA721024",
      "PA720520",
      "PA720780",
      "PA721004",
      "PA718710",
      "PA721458",
      "PA720900",
      "PA720074",
      "PA718756",
      "PA718682",
      "PA719266",
      "PA718930",
      "PA721600",
      "PA720190",
      "PA677483",
      "PA719664",
      "PA719230",
      "PA720124",
      "PA721398",
      "PA720622",
      "PA721888",
      "PA722022",
      "PA720538",
      "PA722038",
      "PA721278",
      "PA720038",
      "PA719790",
      "PA719024",
      "PA719162",
      "PA267673",
      "PA719388",
      "PA721262",
      "PA719330",
      "PA721234",
      "PA722320",
      "PA720222",
      "PA722008",
      "PA720590",
      "PA718794",
      "PA718674",
      "PA719890",
      "PA720814",
      "PA718728",
      "PA719778",
      "PA721844",
      "PA721514",
      "PA721916",
      "PA720268",
      "PA721522",
      "PA721726",
      "PA720022",
      "PA719364",
      "PA721876",
      "PA642788",
      "PA719100",
      "PA719798",
      "PA722268",
      "PA722366",
      "PA719600",
      "PA722134",
      "PA718802",
      "PA721860",
      "PA722336",
      "PA722312",
      "PA720092",
      "PA606639"
    ],
    "texteAffichable": "M.&#160;Blanchet,  Mme&#160;Bessot Ballot, Mme&#160;Cattelot, Mme&#160;Bureau-Bonnard, Mme&#160;Piron, M.&#160;Raphan, M.&#160;Girardin, M.&#160;Cesarini, Mme&#160;Janvier, Mme&#160;Pouzyreff, Mme&#160;Lakrafi, M.&#160;Folliot, M.&#160;Ardouin, M.&#160;Sorre, Mme&#160;Degois, M.&#160;Perea, M.&#160;Anato, M.&#160;Fugit, M.&#160;Potterie, M.&#160;Damien&#160;Adam, M.&#160;Lauzzana, Mme&#160;Givernet, Mme&#160;Leguille-Balloy, Mme&#160;Petel, M.&#160;V&#233;ran, M.&#160;Cubertafon, Mme&#160;Pascale&#160;Boyer, Mme&#160;Maud&#160;Petit, Mme&#160;Kerbarh, Mme&#160;H&#233;rin, M.&#160;Batut, M.&#160;Lavergne, M.&#160;Roseren, M.&#160;Vignal, Mme&#160;Brulebois, M.&#160;Jolivet, M.&#160;Thi&#233;baut, Mme&#160;Rossi, M.&#160;Vuilletet, M.&#160;Trompille, M.&#160;Damaisin, M.&#160;Lejeune, M.&#160;Gouttefarde, Mme&#160;Amadou, M.&#160;Chalumeau, M.&#160;Morenas, M.&#160;Fi&#233;vet, Mme&#160;Romeiro Dias, Mme&#160;Rilhac, M.&#160;Poulliat, Mme&#160;Le Meur, Mme&#160;Genetet, Mme&#160;Chapelier, Mme&#160;De Temmerman, M.&#160;Labaronne, Mme&#160;Vanceunebrock-Mialon, M.&#160;Mazars, Mme&#160;Bono-Vandorme, Mme&#160;Mauborgne, M.&#160;Sempastous, M.&#160;Kerlogot, Mme&#160;Wonner, M.&#160;Ramos, Mme&#160;Jacqueline&#160;Dubois, Mme&#160;Josso, Mme&#160;O&apos;Petit et M.&#160;Cazenove"
  },
  "pointeurFragmentTexte": {
    "division": {
      "titre": "Article 51",
      "articleDesignationCourte": "ART. 51",
      "type": "ARTICLE",
      "avantAApres": "A",
      "divisionRattachee": "ARTICLE 51",
      "urlDivisionTexteVise": "/15/textes/1761.asp#D_Article_51"
    },
    "alinea": {
      "numero": "10"
    }
  },
  "corps": {
    "dispositif": "<p>&#192; l&#8217;alin&#233;a 10, apr&#232;s le mot&#160;:</p><p>&#171;&#160;amende&#160;&#187;, </p><p>ins&#233;rer les mots&#160;:</p><p>&#171;&#160;de 11 000 &#8364;&#160;&#187;.</p>",
    "exposeSommaire": "<p style=\"text-align: justify;\">Tout comme la loi prot&#232;ge les mineurs des produits addictifs, la pr&#233;vention des conduites &#224; risque telle l&#8217;addiction au jeu doit aussi se faire par la mise en &#339;uvre d&#8217;une politique volontariste et coh&#233;rente.</p><p style=\"text-align: justify;\">Aujourd&#8217;hui, la vente ou l&#8217;offre de jeux d&#8217;argent ou de hasard aux mineurs est compl&#232;tement interdite mais cette interdiction n&#8217;est nullement suivie d&#8217;amende ou d&#8217;une quelconque sanction l&#233;gale ou administrative.</p><p style=\"text-align: justify;\">Le pr&#233;sent amendement propose de punir la vente ou l&#8217;offre &#224; un mineur de jeu d&#8217;argent et de hasard d&#8217;une amende de m&#234;me teneur que la vente de produits addictifs, qui peut monter jusqu&#8217;&#224; 15&#160;000&#160;&#8364; pour la protection des mineurs.</p>"
  },
  "representations": [
    {
      "nom": "PDF",
      "typeMime": {
        "type": "application",
        "subType": "PDF"
      },
      "statutRepresentation": {
        "verbatim": true,
        "canonique": true,
        "officielle": true,
        "transcription": false,
        "enregistrement": false
      },
      "contenu": {
        "documentURI": "/15/amendements/1761/AN/1041.pdf"
      }
    }
  ],
  "seanceDiscussion": "RUANR5L15S2019IDS21550",
  "sort": {
    "dateSaisie": "2019-03-14T23:18:16.000+01:00",
    "sortEnSeance": "Retiré"
  },
  "dateDepot": "2019-03-11T01:00:00.000+01:00",
  "dateDistribution": "2019-03-14T01:00:00.000+01:00",
  "article99": "0",
  "loiReference": {}
}