{
  "uid": "AMANR5L15SEA717460BTC2063P0D1N325",
  "identifiant": {
    "legislature": "15",
    "numero": "325",
    "numRect": "0",
    "saisine": {
      "texteLegislatifRef": "PRJLANR5L15BTC2063",
      "numeroPartiePLF": "0",
      "organeExamen": "PO717460",
      "mentionSecondeDeliberation": "0"
    }
  },
  "numeroLong": "325",
  "etapeTexte": "1ère lecture (1ère assemblée saisie)",
  "triAmendement": "boaaaaaaaaaaaaaaaaaaaaaaaaaaaaaaaaaaaaaaaaaaaaaaaaalobddc",
  "cardinaliteAmdtMultiples": "1",
  "etat": "Discuté",
  "signataires": {
    "auteur": {
      "typeAuteur": "Depute",
      "acteurRef": "PA720278",
      "groupePolitiqueRef": "PO723569"
    },
    "cosignatairesRefs": [
      "PA720278"
    ],
    "texteAffichable": "M.&#160;Orphelin"
  },
  "pointeurFragmentTexte": {
    "division": {
      "titre": "Article 3",
      "articleDesignationCourte": "APRÈS ART. 3",
      "type": "ARTICLE",
      "avantAApres": "Apres",
      "divisionRattachee": "APRÈS L'ARTICLE 3, insérer l'article suivant:",
      "articleAdditionnel": "1",
      "urlDivisionTexteVise": "/15/textes/2063.asp#D_Article_3"
    }
  },
  "corps": {
    "dispositif": "<p style=\"text-align: justify;\">Apr&#232;s le I de l&#8217;article L.&#160;581&#8209;4 du code de l&#8217;environnement, il est ins&#233;r&#233; un I <i>bis</i> ainsi r&#233;dig&#233;&#160;:</p><p style=\"text-align: justify;\">&#171;&#160;I <i>bis</i>. &#8211; Les dispositifs publicitaires num&#233;riques sont interdits.&#160;&#187;</p>",
    "exposeSommaire": "<p style=\"text-align: justify;\">Il est n&#233;cessaire d&#8217;interdire les &#233;crans publicitaires lumineux qui constituent une pollution lumineuse et un gaspillage &#233;nerg&#233;tique.</p><p style=\"text-align: justify;\">De plus en plus nombreux (+16&#160;% en 2017), &#233;nergivores &#224; fabriquer et consommant beaucoup d&#8217;&#233;nergie (l&#8217;&#233;quivalent de la consommation d&#8217;&#233;nergie hors chauffage de trois familles d&#8217;apr&#232;s n&#233;gaWatt) alors que la France s&#8217;est fix&#233; des objectifs de baisse de sa consommation d&#8217;&#233;nergie, ces panneaux publicitaires ne sont pas utiles &#224; la collectivit&#233; dans un contexte d&#8217;urgence climatique et de transition &#233;nerg&#233;tique. Ils ne doivent plus par cons&#233;quent &#234;tre autoris&#233;s.</p><p style=\"text-align: justify;\">Dans son bilan pr&#233;visionnel et son analyse compl&#233;mentaire 2018, RTE qualifie d&#8217;ailleurs les supports publicitaires num&#233;riques de consommations &#171;&#160;superflues&#160;&#187; et &#171;&#160;non-prioritaires&#160;&#187;.</p><p style=\"text-align: justify;\">&#171;&#160;Les principaux gisements de baisse de la consommation portent sur les usages li&#233;s &#224; l&#8217;&#233;clairage, le froid et les technologies de l&#8217;information et de la communication.&#160;&#187;.</p><p style=\"text-align: justify;\">De plus, les effets n&#233;fastes de l&#8217;&#233;clairage nocturne sur la sant&#233; humaine et plus g&#233;n&#233;ralement sur les &#233;cosyst&#232;mes sont de mieux en mieux connus. L&#8217;&#233;clairage public et le mobilier urbain &#233;clair&#233; sont par exemple pour une ville comme Paris les principaux contributeurs &#224; cette pollution lumineuse. Ils doivent par cons&#233;quent &#234;tre mieux r&#233;gul&#233;s.</p><p style=\"text-align: justify;\">Cet amendement a &#233;t&#233; propos&#233; par France Nature Environnement.</p>"
  },
  "representations": [
    {
      "nom": "PDF",
      "typeMime": {
        "type": "application",
        "subType": "PDF"
      },
      "statutRepresentation": {
        "verbatim": true,
        "canonique": true,
        "officielle": true,
        "transcription": false,
        "enregistrement": false
      },
      "contenu": {
        "documentURI": "/15/amendements/2063/AN/325.pdf"
      }
    }
  ],
  "seanceDiscussion": "RUANR5L15S2019IDS21737",
  "sort": {
    "dateSaisie": "2019-06-28T00:15:21.000+02:00",
    "sortEnSeance": "Rejeté"
  },
  "dateDepot": "2019-06-21T02:00:00.000+02:00",
  "dateDistribution": "2019-06-26T02:00:00.000+02:00",
  "article99": "0",
  "loiReference": {
    "codeLoi": "c environnement",
    "divisionCodeLoi": "L581-4"
  }
}