{
  "uid": "AMANR5L15SEA717460BTC1173P0D1N272",
  "identifiant": {
    "legislature": "15",
    "numero": "272",
    "numRect": "0",
    "saisine": {
      "texteLegislatifRef": "PRJLANR5L15BTC1173",
      "numeroPartiePLF": "0",
      "organeExamen": "PO717460",
      "mentionSecondeDeliberation": "0"
    }
  },
  "numeroLong": "272",
  "etapeTexte": "Nouvelle Lecture",
  "triAmendement": "ho",
  "cardinaliteAmdtMultiples": "1",
  "etat": "Discuté",
  "signataires": {
    "auteur": {
      "typeAuteur": "Depute",
      "acteurRef": "PA330240",
      "groupePolitiqueRef": "PO730934"
    },
    "cosignatairesRefs": [
      "PA709315",
      "PA643103",
      "PA767",
      "PA719946",
      "PA605036",
      "PA718838",
      "PA923",
      "PA607090",
      "PA748954",
      "PA720386",
      "PA720630",
      "PA266808",
      "PA605991",
      "PA267785",
      "PA2792",
      "PA334654",
      "PA606098",
      "PA721506",
      "PA721314",
      "PA2796",
      "PA608416",
      "PA856",
      "PA722390",
      "PA330008",
      "PA346054",
      "PA718780",
      "PA606712",
      "PA721126",
      "PA266797",
      "PA267440",
      "PA719318",
      "PA2492",
      "PA267204",
      "PA267378",
      "PA721286",
      "PA713448",
      "PA642847",
      "PA720100",
      "PA334149",
      "PA718784",
      "PA1012",
      "PA1029",
      "PA330240",
      "PA266776",
      "PA266793",
      "PA721636",
      "PA608826",
      "PA721678",
      "PA746",
      "PA336316",
      "PA720210",
      "PA267289",
      "PA721968",
      "PA609245",
      "PA720644",
      "PA267318",
      "PA718884",
      "PA609726",
      "PA345722",
      "PA608016",
      "PA719272",
      "PA346218",
      "PA223837",
      "PA1695",
      "PA721816",
      "PA721474",
      "PA334843",
      "PA718850",
      "PA2377",
      "PA712015",
      "PA2086",
      "PA2960",
      "PA267260",
      "PA266774",
      "PA643089",
      "PA267429",
      "PA267901",
      "PA1874",
      "PA330788",
      "PA267450",
      "PA643134",
      "PA267200",
      "PA267794",
      "PA330684",
      "PA1498",
      "PA332523",
      "PA342935",
      "PA267324",
      "PA998",
      "PA721410",
      "PA2155",
      "PA2529",
      "PA267527",
      "PA1327",
      "PA721054",
      "PA340853",
      "PA267735",
      "PA720684",
      "PA1630",
      "PA330909",
      "PA720586"
    ],
    "texteAffichable": "M.&#160;Ciotti,  M.&#160;Jacob, M.&#160;Abad, Mme&#160;Anthoine, M.&#160;Aubert, M.&#160;Bazin, Mme&#160;Bazin-Malgras, Mme&#160;Beauvais, Mme&#160;Bonnivard, M.&#160;Bony, M.&#160;Boucard, M.&#160;Bouchet, Mme&#160;Val&#233;rie&#160;Boyer, Mme&#160;Brenier, M.&#160;Breton, M.&#160;Brochand, M.&#160;Brun, M.&#160;Carrez, M.&#160;Cattin, M.&#160;Cherpion, M.&#160;Cinieri, M.&#160;Cordier, Mme&#160;Corneloup, M.&#160;Cornut-Gentille, Mme&#160;Dalloz, M.&#160;Dassault, M.&#160;de Ganay, M.&#160;de la Verpilli&#232;re, M.&#160;Deflesselles, M.&#160;R&#233;mi&#160;Delatte, M.&#160;Descoeur, M.&#160;Di Filippo, M.&#160;Diard, M.&#160;Dive, M.&#160;Door, Mme&#160;Marianne&#160;Dubois, Mme&#160;Duby-Muller, M.&#160;Pierre-Henri&#160;Dumont, M.&#160;Fasquelle, M.&#160;Ferrara, M.&#160;Forissier, M.&#160;Furst, M.&#160;Gaultier, Mme&#160;Genevard, M.&#160;Goasguen, M.&#160;Gosselin, M.&#160;Grelier, Mme&#160;Guion-Firmin, M.&#160;Herbillon, M.&#160;Hetzel, M.&#160;Huyghe, M.&#160;Kamardine, Mme&#160;Kuster, Mme&#160;Lacroute, M.&#160;Larriv&#233;, M.&#160;Le Fur, Mme&#160;Le Grip, M.&#160;Leclerc, Mme&#160;Levy, M.&#160;Lorion, Mme&#160;Louwagie, M.&#160;Lurton, M.&#160;Emmanuel&#160;Maquet, M.&#160;Marleix, M.&#160;Marlin, M.&#160;Masson, M.&#160;Menuel, Mme&#160;Meunier, M.&#160;Minot, M.&#160;Nury, M.&#160;Parigi, M.&#160;Pauget, M.&#160;Peltier, M.&#160;Perrut, Mme&#160;Poletti, M.&#160;Pradi&#233;, M.&#160;Quentin, M.&#160;Ramadier, M.&#160;Reda, M.&#160;Reiss, M.&#160;Reitzer, M.&#160;Reyn&#232;s, M.&#160;Rolland, M.&#160;Saddier, M.&#160;Savignat, M.&#160;Schellenberger, M.&#160;Sermier, M.&#160;Straumann, Mme&#160;Tabarot, M.&#160;Taugourdeau, M.&#160;Teissier, M.&#160;Thi&#233;riot, Mme&#160;Trastour-Isnart, Mme&#160;Valentin, M.&#160;Vatin, M.&#160;Verch&#232;re, M.&#160;Viala, M.&#160;Vialay, M.&#160;Jean-Pierre&#160;Vigier, M.&#160;Viry et M.&#160;Woerth"
  },
  "pointeurFragmentTexte": {
    "division": {
      "titre": "Article 11",
      "articleDesignationCourte": "ART. 11",
      "type": "ARTICLE",
      "avantAApres": "A",
      "divisionRattachee": "ARTICLE 11",
      "urlDivisionTexteVise": "/15/textes/1173.asp#D_Article_11"
    },
    "alinea": {
      "avantAApres": "A",
      "numero": "8",
      "alineaDesignation": "Alinéa 8"
    }
  },
  "corps": {
    "dispositif": "<p style=\"text-align: justify;\">&#192; l&#8217;alin&#233;a&#160;8, apr&#232;s la r&#233;f&#233;rence&#160;:</p><p style=\"text-align: justify;\">&#171;&#160;L.&#160;611&#8209;3,&#160;&#187;,</p><p style=\"text-align: justify;\">ins&#233;rer les mots&#160;:</p><p style=\"text-align: justify;\">&#171;&#160;qu&#8217;il a alt&#233;r&#233; volontairement ses empreintes digitales pour emp&#234;cher leur enregistrement,&#160;&#187;.</p>",
    "exposeSommaire": "<p style=\"text-align: justify;\">L&#8217;article&#160;11 est relatif aux modalit&#233;s d&#8217;&#233;loignement des &#233;trangers, sur le r&#233;gime des d&#233;cisions d&#8217;OQTF, d&#8217;ITF et d&#8217;ICTF.</p><p style=\"text-align: justify;\">Cet amendement&#160;revient &#224; la r&#233;daction adopt&#233;e par le S&#233;nat qui permet d&#8217;ajouter comme crit&#232;re &#224; une OQTF la volont&#233; d&#233;lib&#233;r&#233;e d&#8217;emp&#234;cher l&#8217;enregistrement des empreintes digitales et qui portait &#224; 5 ans, au lieu de 3 ans, la dur&#233;e maximale d&#8217;interdiction du territoire, conform&#233;ment &#224; la directive &#171;&#160;retour&#160;&#187;, afin de garantir l&#8217;effectivit&#233; de la mesure d&#8217;&#233;loignement.</p><p style=\"text-align: justify;\">Tel est l&#8217;objet de cet amendement.</p>"
  },
  "representations": [
    {
      "nom": "PDF",
      "typeMime": {
        "type": "application",
        "subType": "PDF"
      },
      "statutRepresentation": {
        "verbatim": true,
        "canonique": true,
        "officielle": true,
        "transcription": false,
        "enregistrement": false
      },
      "contenu": {
        "documentURI": "/15/amendements/1173/AN/272.pdf"
      }
    }
  ],
  "seanceDiscussion": "RUANR5L15S2018IDS21204",
  "sort": {
    "dateSaisie": "2018-07-26T18:31:46.000+02:00",
    "sortEnSeance": "Rejeté"
  },
  "dateDepot": "2018-07-20T02:00:00.000+02:00",
  "dateDistribution": "2018-07-23T02:00:00.000+02:00",
  "article99": "0",
  "loiReference": {}
}