{
  "uid": "AMANR5L15SEA717460BTC0575P0D1N736",
  "identifiant": {
    "legislature": "15",
    "numero": "736",
    "numRect": "0",
    "saisine": {
      "texteLegislatifRef": "PRJLANR5L15BTC0575",
      "numeroPartiePLF": "0",
      "organeExamen": "PO717460",
      "mentionSecondeDeliberation": "0"
    }
  },
  "numeroLong": "736",
  "etapeTexte": "1ère lecture (1ère assemblée saisie)",
  "triAmendement": "aaabdhzx",
  "cardinaliteAmdtMultiples": "1",
  "etat": "Discuté",
  "signataires": {
    "auteur": {
      "typeAuteur": "Depute",
      "acteurRef": "PA718978",
      "groupePolitiqueRef": "PO730970"
    },
    "cosignatairesRefs": [
      "PA718978"
    ],
    "texteAffichable": "M.&#160;Laqhila"
  },
  "pointeurFragmentTexte": {
    "division": {
      "titre": "Article 3",
      "articleDesignationCourte": "APRÈS ART. 3",
      "type": "ARTICLE",
      "avantAApres": "Apres",
      "divisionRattachee": "APRÈS L'ARTICLE 3, insérer l'article suivant:",
      "articleAdditionnel": "1",
      "urlDivisionTexteVise": "/15/textes/0575.asp#D_Article_3"
    }
  },
  "corps": {
    "dispositif": "<p style=\"text-align: justify;\">&#160;I.&#160;&#8211;&#160;Le code g&#233;n&#233;ral des imp&#244;ts est ainsi modifi&#233;&#160;:</p><p style=\"text-align: justify;\">1&#176; Au second alin&#233;a du <i>e</i> de l&#8217;article&#160;787 B , les mots &#171;&#160;les trois mois qui suivent le 31 d&#233;cembre de chaque ann&#233;e&#160;&#187; sont remplac&#233;s par les mots&#160;: &#171;&#160;le d&#233;lai&#160;d&#8217;un&#160;mois &#224; compter de la r&#233;ception d&#8217;un avis de mise en demeure notifi&#233; par l&#8217;administration&#160;&#187;.</p><p style=\"text-align: justify;\">2&#176; Le I de l&#8217;article&#160;1840 G <i>ter</i> est compl&#233;t&#233; par un alin&#233;a ainsi r&#233;dig&#233;&#160;:</p><p style=\"text-align: justify;\">&#171;&#160;Les sanctions &#233;num&#233;r&#233;es &#224; l&#8217;alin&#233;a pr&#233;c&#233;dent ne sont pas applicables pour les engagements pr&#233;vus aux articles 787 B et C d&#232;s lors que les justifications requises sont produites dans le mois de la r&#233;ception d&#8217;un avis de mise en demeure notifi&#233; par l&#8217;administration.&#160;&#187;</p><p style=\"text-align: justify;\">II.&#160;&#8211;&#160;Le I s&#8217;applique aux exercices ouverts &#224; compter du 1<sup>er</sup> janvier 2018.&#160;&#187;</p>",
    "exposeSommaire": "<p style=\"text-align: justify;\">Les exon&#233;rations ou r&#233;ductions de droits d&#8217;enregistrement sont subordonn&#233;es au respect de r&#232;gles de fond et d&#8217;obligations d&#233;claratives.</p><p style=\"text-align: justify;\">Ainsi, selon le I de l&#8217;article 1840 G ter&#160;:</p><p style=\"text-align: justify;\"><i>&#171;&#160;I.- Lorsqu'une exon&#233;ration ou une r&#233;duction de droits d'enregistrement, de taxe de publicit&#233; fonci&#232;re ou de taxe additionnelle aux droits d'enregistrement ou &#224; la taxe de publicit&#233; fonci&#232;re a &#233;t&#233; obtenue en contrepartie du respect d'un engagement ou de la production d'une justification, le non-respect de l'engagement ou le d&#233;faut de production de la justification entra&#238;ne l'obligation de payer les droits dont la mutation a &#233;t&#233; exon&#233;r&#233;e. Les droits, major&#233;s de l'int&#233;r&#234;t de retard pr&#233;vu &#224; l'article 1727, doivent &#234;tre acquitt&#233;s dans le mois qui suit, selon le cas, la rupture de l'engagement ou l'expiration du d&#233;lai pr&#233;vu pour produire la justification requise&#160;&#187;.</i></p><p style=\"text-align: justify;\">S&#8217;il est l&#233;gitime que les conditions de fond soient respect&#233;es pour b&#233;n&#233;ficier des avantages fiscaux concern&#233;s, il est excessif que le d&#233;faut de production d&#8217;une pi&#232;ce justificative entra&#238;ne, sans mise en demeure pr&#233;alable, la remise en cause pure et simple d&#8217;une exon&#233;ration ou d&#8217;une r&#233;duction de droits d&#8217;enregistrement.</p><p style=\"text-align: justify;\">Cette remise en cause est particuli&#232;rement inadapt&#233;e lorsque les obligations d&#233;claratives sont lourdes et contraignantes et s&#8217;&#233;chelonnent sur plusieurs ann&#233;es. Tel est le cas des obligations d&#233;claratives pr&#233;vues dans le cadre du dispositif &#171;&#160;DUTREIL&#160;&#187; aux articles 294 bis &#224; 294 quater de l&#8217;annexe II au CGI qui imposent aux h&#233;ritiers, donataires ou l&#233;gataires d&#8217;actions ou de parts de soci&#233;t&#233;s vis&#233;es par l&#8217;article 787 B d&#233;sireux de b&#233;n&#233;ficier du r&#233;gime fiscal de faveur de remettre au service des imp&#244;ts comp&#233;tent une attestation individuelle annuelle certifiant que les conditions de l&#8217;engagement sont toujours respect&#233;es. Il conviendra de modifier par voie r&#233;glementaire ces deux dispositions afin de respecter le parall&#233;lisme des obligations d&#233;claratives &#224; la charge des soci&#233;t&#233;s transmises et des h&#233;ritiers, donataires ou l&#233;gataires de ladite entreprise.</p><p style=\"text-align: justify;\">Le pr&#233;sent amendement vise donc &#224; rem&#233;dier &#224; cette situation en pr&#233;voyant que le d&#233;faut de production d&#8217;une pi&#232;ce justificative ne remettra pas en cause le b&#233;n&#233;fice de ce r&#233;gime de faveur si le contribuable la produit dans le d&#233;lai d&#8217;un mois de la r&#233;ception d&#8217;une mise en demeure de l&#8217;administration fiscale. La mesure est circonscrite aux r&#233;ductions de droits d&#8217;enregistrement dans le cadre du pacte Dutreil.</p><p style=\"text-align: justify;\">Cette proposition s&#8217;inscrit dans la d&#233;marche de simplification de l&#8217;environnement fiscal et r&#233;glementaire des entreprises voulue par les pouvoirs publics et traduite, notamment, dans le Rapport &#171;&#160;MANDON&#160;&#187; (juillet 2013, Mesure 1-13) qui pr&#233;conise de substituer l&#8217;obligation d&#233;clarative par une obligation de transmission &#224; premi&#232;re demande tant pour la soci&#233;t&#233; au cours de l&#8217;engagement collectif que pour les b&#233;n&#233;ficiaires de la transmission au cours de la p&#233;riode de l&#8217;engagement individuel.</p><p style=\"text-align: justify;\">Cet amendement de simplification n&#8217;entra&#238;ne aucune perte de recettes pour le budget de l&#8217;Etat.</p>"
  },
  "representations": [
    {
      "nom": "PDF",
      "typeMime": {
        "type": "application",
        "subType": "PDF"
      },
      "statutRepresentation": {
        "verbatim": true,
        "canonique": true,
        "officielle": true,
        "transcription": false,
        "enregistrement": false
      },
      "contenu": {
        "documentURI": "/15/amendements/0575/AN/736.pdf"
      }
    }
  ],
  "seanceDiscussion": "RUANR5L15S2018IDS20865",
  "sort": {
    "dateSaisie": "2018-01-24T17:07:44.000+01:00",
    "sortEnSeance": "Rejeté"
  },
  "dateDepot": "2018-01-19T01:00:00.000+01:00",
  "dateDistribution": "2018-01-22T01:00:00.000+01:00",
  "article99": "0",
  "loiReference": {
    "codeLoi": "CGI",
    "divisionCodeLoi": "787 B"
  }
}