{
  "uid": "AMANR5L15PO419610B0846P0D1N1933",
  "identifiant": {
    "legislature": "15",
    "numero": "1933",
    "numRect": "0",
    "saisine": {
      "texteLegislatifRef": "PRJLANR5L15B0846",
      "numeroPartiePLF": "0",
      "organeExamen": "PO419610",
      "mentionSecondeDeliberation": "0"
    }
  },
  "numeroLong": "CE1933",
  "etapeTexte": "1ère lecture (1ère assemblée saisie)",
  "triAmendement": "bt",
  "cardinaliteAmdtMultiples": "1",
  "etat": "Discuté",
  "signataires": {
    "auteur": {
      "typeAuteur": "Depute",
      "acteurRef": "PA719830",
      "groupePolitiqueRef": "PO730964"
    },
    "cosignatairesRefs": [
      "PA719830"
    ],
    "texteAffichable": "M.&#160;D&#233;moulin"
  },
  "pointeurFragmentTexte": {
    "division": {
      "titre": "Article 43",
      "articleDesignationCourte": "ART. 43",
      "type": "ARTICLE",
      "avantAApres": "A",
      "divisionRattachee": "ARTICLE 43",
      "urlDivisionTexteVise": "/15/textes/0846.asp#D_Article_43"
    },
    "alinea": {
      "avantAApres": "Apres",
      "numero": "13"
    }
  },
  "corps": {
    "dispositif": "<p>Apr&#232;s l&#8217;alin&#233;a&#160;13, ins&#233;rer les trois alin&#233;as suivants&#160;:</p><p>&#171;&#160;L&#8217;article L.&#160;345&#8209;2&#8209;2 est ainsi modifi&#233;&#160;:</p><p>&#171;&#160;1&#176;&#160;Apr&#232;s le mot &#171;&#160;humaine&#160;&#187; sont ins&#233;r&#233;s les mots &#171;&#160;et assurant la s&#233;curit&#233; des biens et des personnes&#160;&#187;&#160;;</p><p>&#171;&#160;2&#176;&#160;Apr&#232;s le mot &#171;&#160;hygi&#232;ne&#160;&#187; sont ins&#233;r&#233;s les mots &#171;&#160;ainsi qu&#8217;un service num&#233;rique permettant de sauvegarder les donn&#233;es personnelles&#160;&#187;&#160;&#187;.</p>",
    "exposeSommaire": "<p style=\"text-align: justify;\">Les conditions d&#8217;accueil des personnes sans domicile stable ou fixe doivent permettre une prise en charge compl&#232;te et une reconnexion &#224; la soci&#233;t&#233;.&#160;Il s&#8217;agit donc de pouvoir leur proposer un espace s&#233;curis&#233; dans lequel ils puissent y laisser leurs affaires afin d&#8217;accomplir leurs d&#233;marches en tout qui&#233;tude.</p><p style=\"text-align: justify;\">Dans un second temps, il est des dispositifs innovants assurant la sauvegarde des documents personnels comme la carte d&#8217;identit&#233; nationale, la carte vitale, justificatif de domicile, attestations diverses au travers d&#8217;un espace num&#233;rique d&#233;di&#233; (coffre fort num&#233;rique). Certains dispositifs d&#233;j&#224; mis en place permettent de sauvegarder ce qui &#224; la rue, peu &#234;tre facilement perdu ou vol&#233;. Notre volont&#233; est de g&#233;n&#233;raliser ces dispositifs parfois ignor&#233;s des acteurs du sans-abrisme et permettre l&#8217;accomplissement des d&#233;marches essentielles &#224; la reconnexion dans la soci&#233;t&#233; avec plus de souplesses et moins de contraintes physiques. L&#8217;outil num&#233;rique est d&#8217;ailleurs pr&#233;sent dans une bonne partie des centres d&#8217;h&#233;bergement et dans les services de l&#8217;&#201;tat. Utilisons les.&#160;</p>"
  },
  "representations": [
    {
      "nom": "PDF",
      "typeMime": {
        "type": "application",
        "subType": "PDF"
      },
      "statutRepresentation": {
        "verbatim": true,
        "canonique": true,
        "officielle": true,
        "transcription": false,
        "enregistrement": false
      },
      "contenu": {
        "documentURI": "/15/amendements/0846/CION-ECO/CE1933.pdf"
      }
    }
  ],
  "sort": {
    "dateSaisie": "2018-05-18T12:35:17.000+02:00",
    "sortEnSeance": "Adopté"
  },
  "dateDepot": "2018-05-09T02:00:00.000+02:00",
  "dateDistribution": "2018-05-15T02:00:00.000+02:00",
  "article99": "0",
  "loiReference": {
    "codeLoi": "action sociale et familles",
    "divisionCodeLoi": "L345-2-2"
  }
}