{
  "uid": "AMANR5L15SEA717460BTC1974P0D1N480",
  "identifiant": {
    "legislature": "15",
    "numero": "480",
    "numRect": "0",
    "saisine": {
      "texteLegislatifRef": "PRJLANR5L15BTC1974",
      "numeroPartiePLF": "0",
      "organeExamen": "PO717460",
      "mentionSecondeDeliberation": "0"
    }
  },
  "numeroLong": "480",
  "etapeTexte": "1ère lecture (2ème assemblée saisie)",
  "triAmendement": "hiaaaoaaaaaaaaaaaaaaaaaaaaaaaaaaaaaaaaaaaaaaaaaaaahzzzzzzzzzzzzzzzzzzzzzzzzzzzzzzzzzzzzzzzzzzzzzzzzzzzzzzzzzztzs",
  "cardinaliteAmdtMultiples": "1",
  "etat": "Discuté",
  "signataires": {
    "auteur": {
      "typeAuteur": "Depute",
      "acteurRef": "PA608292",
      "groupePolitiqueRef": "PO759900"
    },
    "cosignatairesRefs": [
      "PA267042",
      "PA719286",
      "PA719138",
      "PA607619",
      "PA755549",
      "PA720996",
      "PA336175",
      "PA405480",
      "PA719146",
      "PA331582",
      "PA605694",
      "PA605518",
      "PA333421",
      "PA608292"
    ],
    "texteAffichable": "Mme&#160;Dubi&#233;,  M.&#160;Acquaviva, M.&#160;Brial, M.&#160;Castellani, M.&#160;Colombani, M.&#160;El Guerrab, M.&#160;Falorni, M.&#160;Favennec Becot, M.&#160;Fran&#231;ois-Michel&#160;Lambert, M.&#160;Molac, M.&#160;Pancher, Mme&#160;Pinel, M.&#160;Pupponi et M.&#160;Philippe&#160;Vigier"
  },
  "pointeurFragmentTexte": {
    "division": {
      "titre": "RAPPORT ANNEXÉ",
      "articleDesignationCourte": "ART. 1ER A",
      "type": "ANNEXE",
      "avantAApres": "A",
      "divisionRattachee": "ARTICLE 1ER A",
      "urlDivisionTexteVise": "/15/textes/1974.asp#D_RAPPORT_ANNEXE"
    },
    "alinea": {
      "numero": "53"
    }
  },
  "corps": {
    "dispositif": "<p>Compl&#233;ter la premi&#232;re phrase de l&#8217;alin&#233;a&#160;53 par les mots&#160;:</p><p style=\"text-align: justify;\">&#171;&#160;, ainsi que des travaux de s&#233;curisation pour &#233;viter les accidents dus aux risques naturels majeurs tels que les &#233;boulements de terrain ou les chutes de blocs&#160;&#187;.</p>",
    "exposeSommaire": "<p style=\"text-align: justify;\">Cet amendement vise &#224; modifier le rapport annex&#233; et approuv&#233; par le pr&#233;sent projet de loi afin d&#8217;y apporter des pr&#233;cisions permettant de souligner diff&#233;rents aspects importants pour les territoires de montagne. Ainsi, la citation de la montagne, incluse dans la r&#233;daction de l&#8217;alin&#233;a&#160;49, trouve sa justification dans la sp&#233;cificit&#233; montagne reconnue par la loi modifi&#233;e n&#176; 85&#8209;30 du 9 janvier 1985.</p>"
  },
  "representations": [
    {
      "nom": "PDF",
      "typeMime": {
        "type": "application",
        "subType": "PDF"
      },
      "statutRepresentation": {
        "verbatim": true,
        "canonique": true,
        "officielle": true,
        "transcription": false,
        "enregistrement": false
      },
      "contenu": {
        "documentURI": "/15/amendements/1974/AN/480.pdf"
      }
    }
  ],
  "seanceDiscussion": "RUANR5L15S2019IDS21699",
  "sort": {
    "dateSaisie": "2019-06-13T19:29:03.000+02:00",
    "sortEnSeance": "Rejeté"
  },
  "dateDepot": "2019-05-27T02:00:00.000+02:00",
  "dateDistribution": "2019-06-05T02:00:00.000+02:00",
  "article99": "0",
  "loiReference": {}
}