{
  "uid": "AMANR5L15PO419610B1135P0D1N477",
  "identifiant": {
    "legislature": "15",
    "numero": "477",
    "numRect": "0",
    "saisine": {
      "texteLegislatifRef": "PRJLANR5L15B1135",
      "numeroPartiePLF": "0",
      "organeExamen": "PO419610",
      "mentionSecondeDeliberation": "0"
    }
  },
  "numeroLong": "CE477",
  "etapeTexte": "Nouvelle Lecture",
  "triAmendement": "i",
  "cardinaliteAmdtMultiples": "1",
  "etat": "Discuté",
  "signataires": {
    "auteur": {
      "typeAuteur": "Gouvernement"
    },
    "texteAffichable": "le Gouvernement"
  },
  "pointeurFragmentTexte": {
    "division": {
      "titre": "Article 10 decies",
      "articleDesignationCourte": "ART. 10 DECIES",
      "type": "ARTICLE",
      "avantAApres": "A",
      "divisionRattachee": "ARTICLE 10 DECIES",
      "urlDivisionTexteVise": "/15/textes/1135.asp#D_Article_10_decies"
    }
  },
  "corps": {
    "dispositif": "<p style=\"text-align: justify;\">Supprimer cet article.</p>",
    "exposeSommaire": "<p style=\"text-align: justify;\">Le Gouvernement partage la volont&#233; d&#8217;&#233;viter au maximum toute sur-transposition inutile. Toutefois, il peut se trouver des cas o&#249; pour des raisons de protection sanitaire par exemple, les autorit&#233;s fran&#231;aises d&#233;cident de prendre des initiatives plus rapidement que les autres &#233;tats-membres de l&#8217;Union&#160;europ&#233;ennes. Il ne faut pas exclure cette possibilit&#233;, dont il faut savoir user avec parcimonie. L&#8217;&#233;tiquetage de l&#8217;origine est un autre exemple de surtransposition pour laquelle il y a un large consensus.</p><p style=\"text-align: justify;\">Par ailleurs, le Gouvernement s&#8217;est saisi de la question g&#233;n&#233;rale de la surtransposition des normes&#160;europ&#233;ennes dans tous les secteurs d&#8217;activit&#233;, y compris dans le domaine agricole.</p><p style=\"text-align: justify;\">&#160;</p>"
  },
  "representations": [
    {
      "nom": "PDF",
      "typeMime": {
        "type": "application",
        "subType": "PDF"
      },
      "statutRepresentation": {
        "verbatim": true,
        "canonique": true,
        "officielle": true,
        "transcription": false,
        "enregistrement": false
      },
      "contenu": {
        "documentURI": "/15/amendements/1135/CION-ECO/CE477.pdf"
      }
    }
  ],
  "sort": {
    "dateSaisie": "2018-07-17T23:24:47.000+02:00",
    "sortEnSeance": "Adopté"
  },
  "dateDepot": "2018-07-13T02:00:00.000+02:00",
  "dateDistribution": "2018-07-16T02:00:00.000+02:00",
  "article99": "0",
  "loiReference": {}
}