{
  "uid": "AMANR5L15PO59051B0536P0D1N18",
  "identifiant": {
    "legislature": "15",
    "numero": "18",
    "numRect": "0",
    "saisine": {
      "texteLegislatifRef": "PIONANR5L15B0536",
      "numeroPartiePLF": "0",
      "organeExamen": "PO59051",
      "mentionSecondeDeliberation": "0"
    }
  },
  "numeroLong": "CL18",
  "etapeTexte": "1ère lecture (1ère assemblée saisie)",
  "triAmendement": "dk",
  "cardinaliteAmdtMultiples": "1",
  "etat": "Discuté",
  "signataires": {
    "auteur": {
      "typeAuteur": "Depute",
      "acteurRef": "PA718894",
      "groupePolitiqueRef": "PO730964"
    },
    "cosignatairesRefs": [
      "PA718894"
    ],
    "texteAffichable": "M.&#160;Dombreval"
  },
  "pointeurFragmentTexte": {
    "division": {
      "titre": "Article PREMIER",
      "articleDesignationCourte": "ART. PREMIER",
      "type": "ARTICLE",
      "avantAApres": "A",
      "divisionRattachee": "ARTICLE PREMIER",
      "urlDivisionTexteVise": "/15/textes/0536.asp#D_Article_1er"
    },
    "alinea": {
      "numero": "1"
    }
  },
  "corps": {
    "dispositif": "<p style=\"text-align: justify;\">&#192; la premi&#232;re phrase de l&#8217;alin&#233;a&#160;1, apr&#232;s la deuxi&#232;me occurrence du mot&#160;:</p><p style=\"text-align: justify;\">&#171;&#160;communes&#160;&#187;,</p><p style=\"text-align: justify;\">ins&#233;rer les mots&#160;:</p><p style=\"text-align: justify;\">&#171;&#160;ou d&#8217;une communaut&#233; d&#8217;agglom&#233;ration&#160;&#187;.</p>",
    "exposeSommaire": "<p>Le transfert &#233;tant obligatoire aux communaut&#233;s de communes et aux communaut&#233;s d'agglom&#233;ration &#224; compter du 1er janvier 2020.&#160;</p><p>cette proposition de loi entend apporter des r&#233;ponses pragmatiques aux pr&#233;occupations des &#233;lus locaux, sans remettre en cause le caract&#232;re obligatoire du transfert de la comp&#233;tence. Ainsi les communes qui n'auraient pas d&#233;j&#224; transf&#233;r&#233; les comp&#233;tences \"eau\" et \"assainissement\" ou l'une d'entre elles, pourront b&#233;n&#233;ficier de l'am&#233;nagement des conditions du transfert qu'elle fasse partie d'une communaut&#233; de communes ou d'une communaut&#233; d'agglom&#233;ration.&#160;</p>"
  },
  "representations": [
    {
      "nom": "PDF",
      "typeMime": {
        "type": "application",
        "subType": "PDF"
      },
      "statutRepresentation": {
        "verbatim": true,
        "canonique": true,
        "officielle": true,
        "transcription": false,
        "enregistrement": false
      },
      "contenu": {
        "documentURI": "/15/amendements/0536/CION_LOIS/CL18.pdf"
      }
    }
  ],
  "sort": {
    "dateSaisie": "2018-01-24T11:13:45.000+01:00",
    "sortEnSeance": "Non soutenu"
  },
  "dateDepot": "2018-01-19T01:00:00.000+01:00",
  "dateDistribution": "2018-01-22T01:00:00.000+01:00",
  "article99": "0",
  "loiReference": {
    "codeLoi": "1.2"
  }
}