{
  "uid": "AMANR5L15SEA717460B0387P0D1N53",
  "identifiant": {
    "legislature": "15",
    "numero": "53",
    "numRect": "0",
    "saisine": {
      "texteLegislatifRef": "PRJLANR5L15B0387",
      "numeroPartiePLF": "0",
      "organeExamen": "PO717460",
      "mentionSecondeDeliberation": "0"
    }
  },
  "numeroLong": "53",
  "etapeTexte": "Nouvelle Lecture",
  "triAmendement": "bn",
  "cardinaliteAmdtMultiples": "1",
  "etat": "Discuté",
  "signataires": {
    "auteur": {
      "typeAuteur": "Depute",
      "acteurRef": "PA720630",
      "groupePolitiqueRef": "PO730934"
    },
    "cosignatairesRefs": [
      "PA720630"
    ],
    "texteAffichable": "M.&#160;Minot"
  },
  "pointeurFragmentTexte": {
    "division": {
      "titre": "Article 8",
      "articleDesignationCourte": "ART. 8",
      "type": "ARTICLE",
      "avantAApres": "A",
      "divisionRattachee": "ARTICLE 8",
      "urlDivisionTexteVise": "/15/textes/0387.asp#D_Article_8"
    },
    "alinea": {
      "numero": "3"
    }
  },
  "corps": {
    "dispositif": "<p style=\"text-align: justify;\">I.&#160;&#8211; &#192; la premi&#232;re phrase de l&#8217;alin&#233;a&#160;3, substituer au nombre&#160;: </p><p style=\"text-align: justify;\">&#171;&#160;6&#160;&#187;</p><p style=\"text-align: justify;\">le nombre&#160;:</p><p style=\"text-align: justify;\">&#171;&#160;7&#160;&#187;.</p><p style=\"text-align: justify;\">II.&#160;&#8211;&#160;En cons&#233;quence, au m&#234;me alin&#233;a, substituer au nombre&#160;:</p><p style=\"text-align: justify;\">&#171;&#160;2,5&#160;&#187; </p><p style=\"text-align: justify;\">le nombre&#160;:</p><p style=\"text-align: justify;\">&#171;&#160;3,5&#160;&#187;.</p><p style=\"text-align: justify;\">III.&#160;&#8211;&#160;Compl&#233;ter cet article par l&#8217;alin&#233;a suivant&#160;:</p><p style=\"text-align: justify;\">&#171;&#160;V.&#160;&#8211;&#160;La perte de recettes pour les organismes de s&#233;curit&#233; sociale est compens&#233;e &#224; due concurrence par l&#8217;affectation d&#8217;une fraction suppl&#233;mentaire de taxe sur la valeur ajout&#233;e &#224; ces organismes.</p>",
    "exposeSommaire": "<p style=\"text-align: justify;\">Cet amendement vise &#224; faire r&#233;ellement baisser le co&#251;t du travail pour les entreprises et non pas, comme le propose le Gouvernement, d&#8217;alourdir la fiscalit&#233; qui p&#232;se sur elles de 8 milliards d&#8217;euros.</p><p style=\"text-align: justify;\">Le Gouvernement propose de transformer le CICE en baisses de cotisations patronales. Sur le principe, ce choix est le bon, puisqu&#8217;il permet de p&#233;renniser ce soutien aux entreprises et de rem&#233;dier au probl&#232;me de d&#233;calage dans le temps du gain du CICE par rapport au fait g&#233;n&#233;rateur.</p><p style=\"text-align: justify;\">Mais en m&#234;me temps, par ce basculement, le Gouvernement choisit de rench&#233;rir le co&#251;t du travail par deux biais&#160;:</p><p style=\"text-align: justify;\">&#8211;&#160;d&#8217;une part, il baisse le taux du CICE de 7 &#224; 6&#160;%, si bien que le &#171;&#160;basculement&#160;&#187; du CICE en all&#232;gements de cotisations se fera sur la base d&#8217;un CICE &#224; 6&#160;% et non &#224; 7&#160;%. Les entreprises y perdent 3,1&#160;milliards d&#8217;euros&#160;;</p><p style=\"text-align: justify;\">&#8211;&#160;d&#8217;autre part, la transformation du CICE en all&#232;gements de charge a pour effet d&#8217;&#233;largir l&#8217;assiette de l&#8217;imp&#244;t sur les soci&#233;t&#233;s (les cotisations patronales en &#233;tant d&#233;ductibles) et donc d&#8217;alourdir la fiscalit&#233; sur les entreprises. Selon Coe Rexecode, la perte serait de l&#8217;ordre de 5 milliards d&#8217;euros pour les entreprises.</p><p style=\"text-align: justify;\">Au total, cette mesure que le Gouvernement pr&#233;sente comme une avanc&#233;e pour les entreprises aura pour effet de faire peser sur elles 8 milliards d&#8217;euros de fiscalit&#233; suppl&#233;mentaire.</p><p style=\"text-align: justify;\">Cet amendement&#160;:</p><p style=\"text-align: justify;\">&#8211;&#160;bascule le CICE en all&#232;gements de cotisations sur la base d&#8217;un CICE &#224; 7&#160;%, c&#8217;est-&#224;-dire son taux actuel, pour que les entreprises ne perdent pas 3,1 milliards d&#8217;euros&#160;;</p><p style=\"text-align: justify;\">&#8211;&#160;&#233;tend les all&#232;gements de charge jusqu&#8217;&#224; 3,5 SMIC, au lieu de 2,5 SMIC. Il s&#8217;agit par-l&#224; de suivre les recommandations du rapport Gallois de 2012 qui a &#233;t&#233; &#224; l&#8217;origine de la cr&#233;ation du CICE. All&#233;ger le co&#251;t du travail &#224; des niveaux de r&#233;mun&#233;ration plus &#233;lev&#233;s permet de dynamiser des secteurs &#224; haute valeur ajout&#233;e, comme l&#8217;industrie ou certains services (bureaux d&#8217;&#233;tude, ing&#233;nierie, informatique, conseils).</p><p style=\"text-align: justify;\">Au total, il s&#8217;agit de baisser le co&#251;t du travail de 13 milliards d&#8217;euros par rapport &#224; ce que pr&#233;voit le Gouvernement.</p>"
  },
  "representations": [
    {
      "nom": "PDF",
      "typeMime": {
        "type": "application",
        "subType": "PDF"
      },
      "statutRepresentation": {
        "verbatim": true,
        "canonique": true,
        "officielle": true,
        "transcription": false,
        "enregistrement": false
      },
      "contenu": {
        "documentURI": "/15/amendements/0387/AN/53.pdf"
      }
    }
  ],
  "seanceDiscussion": "RUANR5L15S2018IDS20789",
  "sort": {
    "dateSaisie": "2017-11-29T16:50:49.000+01:00",
    "sortEnSeance": "Rejeté"
  },
  "dateDepot": "2017-11-23T01:00:00.000+01:00",
  "dateDistribution": "2017-11-27T01:00:00.000+01:00",
  "article99": "0",
  "loiReference": {}
}