{
  "uid": "AMANR5L15PO59048B1490P0D1N656",
  "identifiant": {
    "legislature": "15",
    "numero": "656",
    "numRect": "0",
    "saisine": {
      "texteLegislatifRef": "PRJLANR5L15B1490",
      "numeroPartiePLF": "0",
      "organeExamen": "PO59048",
      "mentionSecondeDeliberation": "0"
    }
  },
  "numeroLong": "CF656",
  "etapeTexte": "Nouvelle Lecture",
  "triAmendement": "ebaaaaaaaaaaaaaaaaaaaaaaaaaaaaaaaaaaaaaaaaaaaaaaaabyzwu",
  "cardinaliteAmdtMultiples": "1",
  "etat": "Discuté",
  "signataires": {
    "auteur": {
      "typeAuteur": "Depute",
      "acteurRef": "PA718860",
      "groupePolitiqueRef": "PO730958"
    },
    "cosignatairesRefs": [
      "PA719676",
      "PA588884",
      "PA721202",
      "PA721062",
      "PA718868",
      "PA722142",
      "PA720892",
      "PA718860",
      "PA721226",
      "PA721960",
      "PA720430",
      "PA2150",
      "PA719578",
      "PA720846",
      "PA720422",
      "PA721210",
      "PA720286"
    ],
    "texteAffichable": "Mme&#160;Taurine,  Mme&#160;Autain, M.&#160;Bernalicis, M.&#160;Coquerel, M.&#160;Corbi&#232;re, Mme&#160;Fiat, M.&#160;Lachaud, M.&#160;Larive, M.&#160;M&#233;lenchon, Mme&#160;Obono, Mme&#160;Panot, M.&#160;Prud&apos;homme, M.&#160;Quatennens, M.&#160;Ratenon, Mme&#160;Ressiguier, Mme&#160;Rubin et M.&#160;Ruffin"
  },
  "pointeurFragmentTexte": {
    "missionVisee": {
      "idMissionAN": "702",
      "libelleMission": "Cohésion des territoires",
      "codeMissionPLF": "B",
      "libelleMissionPLF": "Répartition, par mission et programme, des crédits du budget général"
    },
    "division": {
      "titre": "ÉTAT B",
      "articleDesignationCourte": "ART. 39",
      "type": "ANNEXE",
      "avantAApres": "A",
      "divisionRattachee": "ARTICLE 39",
      "urlDivisionTexteVise": "/15/textes/1490.asp#D_Etat_B"
    }
  },
  "corps": {
    "exposeSommaire": "<p style=\"text-align: justify;\">Le c&#339;ur du mouvement des gilets jaunes est un sentiment d&#8217;abandon par les pouvoirs publics tir&#233; du constat du recul des services publics. Autant de personnes sur les ronds-points qui manifestent leur m&#233;contentement quant &#224; l&#8217;acc&#232;s aux r&#233;seaux, cela devrait interpeller votre majorit&#233; ! Nous ne comptons plus les articles de la presse quotidienne r&#233;gionale et nationale faisant &#233;tat de fermetures de bureaux de poste, d&#8217;h&#244;pitaux, de maternit&#233;s, etc. Cette tendance est d&#8217;autant plus pr&#233;judiciable dans les quartiers prioritaires de la ville o&#249; se concentrent les populations les plus fragiles. Mais l&#8217;outre-mer et les zones rurales ne sont pas en reste.</p><p style=\"text-align: justify;\">D&#8217;apr&#232;s l&#8217;indicateur 2.2 du rapport budg&#233;taire de la mission, intitul&#233; &#171; r&#233;duction du temps d&#8217;acc&#232;s des usagers &#224; une maison de services au public &#187;, en 2018, 75 % de la population des communes de moins de 30 000 habitants dans les 97 d&#233;partements &#233;quip&#233;s sont &#224; moins de 20 minutes d&#8217;une maison de service au public (MSAP). Cela est insuffisant. D&#8217;autant qu&#8217;en zone rurale, un temps de trajet de plus de 20 minutes signifie que ces services ne sont pas dans sa propre commune. Des milliers d&#8217;habitants sans moyens de transports n&#8217;ont donc acc&#232;s &#224; aucun service public. Cela est intol&#233;rable.</p><p style=\"text-align: justify;\">Par cet amendement nous proposons de r&#233;tablir les cr&#233;dits tels que vot&#233;s en premi&#232;re lecture &#224; l'assembl&#233;e nationale et de transf&#233;rer 31 M&#8364; de l&#8217;action 7 du programme 135 qui vise notamment &#224; financer les grandes op&#233;rations d&#8217;urbanisme bien souvent inutiles vers le red&#233;ploiement de l&#8217;acc&#232;s aux services publics par le biais du programme 112 (action 02 &#8211; D&#233;veloppement solidaire et &#233;quilibr&#233; des territoires).</p>",
    "dispositifAmdtCredit": {
      "listeProgrammes": [
        {
          "libelle": "Hébergement, parcours vers le logement et insertion des personnes vulnérables",
          "id": "53800",
          "AE": {
            "montantPositif": "1873114477",
            "montantNegatif": "0"
          },
          "CP": {
            "montantPositif": "1891214477",
            "montantNegatif": "0"
          },
          "action": "modification"
        },
        {
          "libelle": "Aide à l'accès au logement",
          "id": "53801",
          "AE": {
            "montantPositif": "13112551717",
            "montantNegatif": "0"
          },
          "CP": {
            "montantPositif": "13112551717",
            "montantNegatif": "0"
          },
          "action": "modification"
        },
        {
          "libelle": "Urbanisme, territoires et amélioration de l'habitat",
          "id": "53802",
          "AE": {
            "montantPositif": "249934585",
            "montantNegatif": "0"
          },
          "CP": {
            "montantPositif": "249934585",
            "montantNegatif": "0"
          },
          "action": "modification"
        },
        {
          "libelle": "Impulsion et coordination de la politique d'aménagement du territoire",
          "id": "53803",
          "AE": {
            "montantPositif": "230398896",
            "montantNegatif": "0"
          },
          "CP": {
            "montantPositif": "271814179",
            "montantNegatif": "0"
          },
          "action": "modification",
          "lignesCredits": [
            {
              "id": "1923",
              "libelle": "Dont titre 2",
              "AE": {
                "montantPositif": "19932626",
                "montantNegatif": "0"
              },
              "CP": {
                "montantPositif": "19932626",
                "montantNegatif": "0"
              }
            }
          ]
        },
        {
          "libelle": "Interventions territoriales de l'État",
          "id": "53804",
          "AE": {
            "montantPositif": "35569445",
            "montantNegatif": "0"
          },
          "CP": {
            "montantPositif": "25669445",
            "montantNegatif": "0"
          },
          "action": "modification"
        },
        {
          "libelle": "Politique de la ville",
          "id": "53805",
          "AE": {
            "montantPositif": "668935082",
            "montantNegatif": "0"
          },
          "CP": {
            "montantPositif": "508935082",
            "montantNegatif": "0"
          },
          "action": "modification",
          "lignesCredits": [
            {
              "id": "1924",
              "libelle": "Dont titre 2",
              "AE": {
                "montantPositif": "19419002",
                "montantNegatif": "0"
              },
              "CP": {
                "montantPositif": "19419002",
                "montantNegatif": "0"
              }
            }
          ]
        }
      ],
      "totalAE": {
        "montantPositif": "16170504202",
        "montantNegatif": "0",
        "solde": "16170504202"
      },
      "totalCP": {
        "montantPositif": "16060119485",
        "montantNegatif": "0",
        "solde": "16060119485"
      }
    }
  },
  "representations": [
    {
      "nom": "PDF",
      "typeMime": {
        "type": "application",
        "subType": "PDF"
      },
      "statutRepresentation": {
        "verbatim": true,
        "canonique": true,
        "officielle": true,
        "transcription": false,
        "enregistrement": false
      },
      "contenu": {
        "documentURI": "/15/amendements/1490/CION_FIN/CF656.pdf"
      }
    }
  ],
  "sort": {
    "dateSaisie": "2018-12-14T12:31:35.000+01:00",
    "sortEnSeance": "Non soutenu"
  },
  "dateDepot": "2018-12-13T01:00:00.000+01:00",
  "dateDistribution": "2018-12-14T01:00:00.000+01:00",
  "article99": "0",
  "loiReference": {}
}