{
  "uid": "AMANR5L15SEA717460BTC1600P0D1N216",
  "identifiant": {
    "legislature": "15",
    "numero": "216",
    "numRect": "0",
    "saisine": {
      "texteLegislatifRef": "PIONANR5L15BTC1600",
      "numeroPartiePLF": "0",
      "organeExamen": "PO717460",
      "mentionSecondeDeliberation": "0"
    }
  },
  "numeroLong": "216",
  "etapeTexte": "1ère lecture (2ème assemblée saisie)",
  "triAmendement": "joaaaaaaaaaaaaaaaaaaaaaaaaaaaaaaaaaaaaaaaaaaaaaaaab",
  "cardinaliteAmdtMultiples": "1",
  "etat": "Discuté",
  "signataires": {
    "auteur": {
      "typeAuteur": "Depute",
      "acteurRef": "PA643089",
      "groupePolitiqueRef": "PO730934"
    },
    "cosignatairesRefs": [
      "PA1327",
      "PA334654",
      "PA266776",
      "PA718780",
      "PA609245",
      "PA267429",
      "PA643089"
    ],
    "texteAffichable": "M.&#160;Thi&#233;riot,  Mme&#160;Lacroute, M.&#160;Forissier, M.&#160;Straumann, M.&#160;Reiss, Mme&#160;Trastour-Isnart et M.&#160;Cinieri"
  },
  "pointeurFragmentTexte": {
    "division": {
      "titre": "Article 6 bis",
      "articleDesignationCourte": "APRÈS ART. 6 BIS",
      "type": "ARTICLE",
      "avantAApres": "Apres",
      "divisionRattachee": "APRÈS L'ARTICLE 6 BIS, insérer l'article suivant:",
      "articleAdditionnel": "1",
      "urlDivisionTexteVise": "/15/textes/1600.asp#D_Article_6_bis"
    }
  },
  "corps": {
    "dispositif": "<p style=\"text-align: justify;\">Le chapitre I<sup>er</sup> du titre III du livre IV du code p&#233;nal est ainsi modifi&#233;&#160;:</p><p style=\"text-align: justify;\">1&#176; La section 2 est compl&#233;t&#233;e par un article&#160;431&#8209;8&#8209;1 ainsi r&#233;dig&#233;&#160;:</p><p style=\"text-align: justify;\">&#171;&#160;<i>Art.</i> <i>431&#8209;8&#8209;1.</i>&#160;&#8211;&#160;Les articles 375&#8209;2 et 480&#8209;1 du code de proc&#233;dure p&#233;nale s&#8217;appliquent aux auteurs des infractions pr&#233;vues &#224; la pr&#233;sente section ainsi que celles pr&#233;vues par les articles 222&#8209;7 &#224; 222&#8209;13, 222&#8209;14&#8209;2, le premier alin&#233;a de l&#8217;article&#160;322&#8209;1 et par les articles 322&#8209;2, 322&#8209;3, 322&#8209;6 &#224; 322&#8209;10 commises lors du d&#233;roulement d&#8217;un m&#234;me attroupement et dont la connexit&#233; est &#233;tablie.&#160;&#187;</p><p style=\"text-align: justify;\">2&#176; La section 3 est compl&#233;t&#233;e par un article&#160;431&#8209;12&#8209;1 ainsi r&#233;dig&#233;&#160;:</p><p style=\"text-align: justify;\">&#171;&#160;<i>Art.&#160;L.&#160;431&#8209;12&#8209;1.</i>&#160;&#8211;&#160;Les articles 375&#8209;2 et 480&#8209;1 du code de proc&#233;dure p&#233;nale s&#8217;appliquent aux auteurs des infractions pr&#233;vues &#224; la pr&#233;sente section ainsi que celles pr&#233;vues par les articles 222&#8209;7 &#224; 222&#8209;13, 222&#8209;14&#8209;2, le premier alin&#233;a de l&#8217;article&#160;322&#8209;1 et par les articles 322&#8209;2, 322&#8209;3, 322&#8209;6 &#224; 322&#8209;10 commises lors du d&#233;roulement d&#8217;une m&#234;me manifestation et dont la connexit&#233; est &#233;tablie.&#160;&#187;</p>",
    "exposeSommaire": "<p>(Amendement de repli)</p><p style=\"text-align: justify;\">Les bandes de casseurs s&#8217;organisent en faisant commettre les d&#233;lits et crimes les plus dommageables &#224; leurs membres les moins solvables. Cette insolvabilit&#233; d&#8217;un seul leur permet ainsi d&#8217;&#233;chapper collectivement &#224; toute forme de r&#233;paration.</p><p style=\"text-align: justify;\">Afin de contourner cette strat&#233;gie, le pr&#233;sent amendement pr&#233;voit que les auteurs de crimes et d&#233;lits commis &#224; l&#8217;occasion d&#8217;attroupements et de manifestations sont tenus solidairement au paiement des dommages-int&#233;r&#234;ts et que l&#8217;auteur d&#8217;un tel crime ou d&#233;lit puisse, sur d&#233;cision sp&#233;ciale et motiv&#233;e du juge, &#234;tre tenu solidairement des amendes auxquelles ses coauteurs et complices insolvables ont &#233;t&#233; condamn&#233;s.</p><p style=\"text-align: justify;\">L&#8217;amendement applique ainsi au cas sp&#233;cial des infractions connexes commises lors d&#8217;attroupements et de manifestations les dispositions g&#233;n&#233;rales du code proc&#233;dure p&#233;nale relatives &#224; la condamnation in solidum. Cette application ne r&#233;sultant aujourd&#8217;hui seulement que de la jurisprudence (Cass., Crim, 13 mai 2009, n&#176;08&#8209;86.734), il semble en effet opportun d&#8217;inscrire cette solution dans la loi afin de la soustraire aux al&#233;as jurisprudentiels.</p><p style=\"text-align: justify;\">La r&#233;daction propos&#233;e par cet amendement laisse au juge le soin d&#8217;&#233;tablir la connexit&#233; entre les infractions commises par diff&#233;rents auteurs au cours d&#8217;un rassemblement.</p><p style=\"text-align: justify;\">L&#8217;amendement modifie &#233;galement l&#8217;article&#160;7 de la proposition de loi qui dans sa r&#233;daction actuelle permet seulement &#224; l&#8217;&#201;tat d&#8217;exercer une action r&#233;cursoire contre les auteurs du fait dommageable commis &#224; l&#8217;occasion d&#8217;un attroupement. En effet, l&#8217;int&#233;r&#234;t de cette disposition risque fort d&#8217;&#234;tre limit&#233; en cas d&#8217;insolvabilit&#233; du responsable du dommage. Les casseurs agissant en bande, le pr&#233;sent amendement propose donc que l&#8217;&#201;tat puisse &#233;galement se retourner contre les complices ayant particip&#233; &#224; l&#8217;attroupement.</p>"
  },
  "representations": [
    {
      "nom": "PDF",
      "typeMime": {
        "type": "application",
        "subType": "PDF"
      },
      "statutRepresentation": {
        "verbatim": true,
        "canonique": true,
        "officielle": true,
        "transcription": false,
        "enregistrement": false
      },
      "contenu": {
        "documentURI": "/15/amendements/1600/AN/216.pdf"
      }
    }
  ],
  "seanceDiscussion": "RUANR5L15S2019IDS21519",
  "sort": {
    "dateSaisie": "2019-02-01T10:29:46.000+01:00",
    "sortEnSeance": "Non soutenu"
  },
  "dateDepot": "2019-01-25T01:00:00.000+01:00",
  "dateDistribution": "2019-01-28T01:00:00.000+01:00",
  "article99": "0",
  "loiReference": {
    "codeLoi": "c pénal",
    "divisionCodeLoi": "431-8-1"
  }
}