{
  "uid": "AMANR5L15PO59051B2201P0D1N132",
  "identifiant": {
    "legislature": "15",
    "numero": "132",
    "numRect": "0",
    "saisine": {
      "texteLegislatifRef": "PIONANR5L15B2201",
      "numeroPartiePLF": "0",
      "organeExamen": "PO59051",
      "mentionSecondeDeliberation": "0"
    }
  },
  "numeroLong": "CL132",
  "etapeTexte": "1ère lecture (1ère assemblée saisie)",
  "triAmendement": "fiaaaaaaaaaaaaaaaaaaaaaaaaaaaaaaaaaaaaaaaaaaaaaaaan",
  "cardinaliteAmdtMultiples": "1",
  "etat": "Discuté",
  "signataires": {
    "auteur": {
      "typeAuteur": "Depute",
      "acteurRef": "PA720100",
      "groupePolitiqueRef": "PO730934"
    },
    "cosignatairesRefs": [
      "PA720100"
    ],
    "texteAffichable": "M.&#160;Pradi&#233;, rapporteur"
  },
  "pointeurFragmentTexte": {
    "division": {
      "titre": "Article 7",
      "articleDesignationCourte": "ART. 7",
      "type": "ARTICLE",
      "avantAApres": "A",
      "divisionRattachee": "ARTICLE 7",
      "urlDivisionTexteVise": "/15/textes/2201.asp#D_Article_7"
    },
    "alinea": {
      "numero": "10"
    }
  },
  "corps": {
    "dispositif": "<p style=\"text-align: justify;\">Supprimer les alin&#233;as 10 et 11.</p>",
    "exposeSommaire": "<p style=\"text-align: justify;\">L'article 7 institue, par voie d'exp&#233;rimentation, une aide d'urgence pour le logement des victimes de violences qui ont d&#251; quitter leur domicile. La proposition de loi initiale modifiait les cadres d'emploi d'Action Logement pour donner une base l&#233;gale &#224; l'intervention de cet organisme dans le financement de cette politique publique.</p><p style=\"text-align: justify;\">Les auditions pr&#233;paratoires ont cependant montr&#233; le caract&#232;re superf&#233;tatoire d'une telle pr&#233;cision, Action Logement intervenant d&#233;j&#224; pour le relogement des personnes victimes de violences au titre de ses engagements en faveur des personnes d&#233;favoris&#233;es.</p><p style=\"text-align: justify;\">Le pr&#233;sent amendement supprime, en cons&#233;quence, les deux alin&#233;as inutiles.</p>"
  },
  "representations": [
    {
      "nom": "PDF",
      "typeMime": {
        "type": "application",
        "subType": "PDF"
      },
      "statutRepresentation": {
        "verbatim": true,
        "canonique": true,
        "officielle": true,
        "transcription": false,
        "enregistrement": false
      },
      "contenu": {
        "documentURI": "/15/amendements/2201/CION_LOIS/CL132.pdf"
      }
    }
  ],
  "sort": {
    "dateSaisie": "2019-10-02T14:55:32.000+02:00",
    "sortEnSeance": "Adopté"
  },
  "dateDepot": "2019-10-02T02:00:00.000+02:00",
  "dateDistribution": "2019-10-02T02:00:00.000+02:00",
  "article99": "0",
  "loiReference": {}
}