{
  "uid": "AMANR5L15SEA717460BTC1237P0D1N1049",
  "identifiant": {
    "legislature": "15",
    "numero": "1049",
    "numRect": "0",
    "saisine": {
      "texteLegislatifRef": "PRJLANR5L15BTC1237",
      "numeroPartiePLF": "0",
      "organeExamen": "PO717460",
      "mentionSecondeDeliberation": "1"
    }
  },
  "numeroLong": "1049",
  "etapeTexte": "1ère lecture (1ère assemblée saisie)",
  "triAmendement": "roaaaaaaaaaaaaaaaaaaaaaaaaaaaaaaaaaaaaaaaaaaaaaaaam",
  "cardinaliteAmdtMultiples": "1",
  "etat": "Discuté",
  "signataires": {
    "auteur": {
      "typeAuteur": "Depute",
      "acteurRef": "PA719684",
      "groupePolitiqueRef": "PO730964"
    },
    "cosignatairesRefs": [
      "PA719684"
    ],
    "texteAffichable": "Mme&#160;Dubost"
  },
  "pointeurFragmentTexte": {
    "division": {
      "titre": "Article 71",
      "articleDesignationCourte": "APRÈS ART. 71",
      "type": "ARTICLE",
      "avantAApres": "Apres",
      "divisionRattachee": "APRÈS L'ARTICLE 71, insérer l'article suivant:",
      "articleAdditionnel": "1",
      "urlDivisionTexteVise": "/15/textes/1237.asp#D_Article_71"
    }
  },
  "corps": {
    "dispositif": "<p style=\"text-align: justify;\">Aux premier et deuxi&#232;me alin&#233;as du I de l&#8217;article L.&#160;211&#8209;16 du code du tourisme, les deux occurrence des mots&#160;: &#171;&#160;de plein droit&#160;&#187; sont supprim&#233;es.</p>",
    "exposeSommaire": "<p style=\"text-align: justify;\">Cet amendement a pour objet de rendre la transposition de l&#8217;ordonnance plus fid&#232;le au texte d&#8217;origine qui ne pr&#233;voit qu&#8217;une responsabilit&#233; simple. En imposant une responsabilit&#233; &#171;&#160;de plein droit&#160;&#187;, la r&#233;daction propos&#233;e par le projet de loi met en jeu une responsabilit&#233; objective sans faute. Il s&#8217;agit d&#8217;une surtransposition inutile ayant pour cons&#233;quence de conduire les voyagistes fran&#231;ais &#224; payer des cotisations d&#8217;assurance plus &#233;lev&#233;es que celles de leurs concurrents &#233;trangers dont les pays ont, sans exception, opt&#233; pour une transposition fid&#232;le de la directive. Un recours contentieux est actuellement engag&#233; sur ce point.</p>"
  },
  "representations": [
    {
      "nom": "PDF",
      "typeMime": {
        "type": "application",
        "subType": "PDF"
      },
      "statutRepresentation": {
        "verbatim": true,
        "canonique": true,
        "officielle": true,
        "transcription": false,
        "enregistrement": false
      },
      "contenu": {
        "documentURI": "/15/amendements/1237/AN/1049.pdf"
      }
    }
  ],
  "seanceDiscussion": "RUANR5L15S2019IDS21349",
  "sort": {
    "dateSaisie": "2018-10-05T17:33:36.000+02:00",
    "sortEnSeance": "Retiré"
  },
  "dateDepot": "2018-09-20T02:00:00.000+02:00",
  "dateDistribution": "2018-09-27T02:00:00.000+02:00",
  "article99": "0",
  "loiReference": {
    "codeLoi": "c tourisme",
    "divisionCodeLoi": "L211-16"
  }
}