{
  "uid": "AMANR5L15PO59048B2272P1D1N826",
  "identifiant": {
    "legislature": "15",
    "numero": "826",
    "numRect": "0",
    "saisine": {
      "texteLegislatifRef": "PRJLANR5L15B2272",
      "numeroPartiePLF": "1",
      "organeExamen": "PO59048",
      "mentionSecondeDeliberation": "0"
    }
  },
  "numeroLong": "I-CF826",
  "etapeTexte": "1ère lecture (1ère assemblée saisie)",
  "triAmendement": "baaaaaaaaaaaaaaaaaaaaaaaaaaaaaaaaaaaaaaaaaaaaaaaaaek",
  "cardinaliteAmdtMultiples": "1",
  "etat": "Irrecevable",
  "signataires": {
    "auteur": {
      "typeAuteur": "Depute",
      "acteurRef": "PA342415",
      "groupePolitiqueRef": "PO758835"
    },
    "cosignatairesRefs": [
      "PA609590",
      "PA1592",
      "PA608172",
      "PA605069",
      "PA342415"
    ],
    "texteAffichable": "Mme&#160;Battistel,  M.&#160;Jean-Louis&#160;Bricout, Mme&#160;Pires Beaune, M.&#160;David&#160;Habib et Mme&#160;Rabault"
  },
  "pointeurFragmentTexte": {
    "division": {
      "titre": "Article 4",
      "articleDesignationCourte": "ART. 4",
      "type": "ARTICLE",
      "avantAApres": "A",
      "divisionRattachee": "ARTICLE 4",
      "urlDivisionTexteVise": "/15/textes/2272A.asp#D_Article_4"
    },
    "alinea": {
      "numero": "26"
    }
  },
  "corps": {},
  "representations": [
    {
      "nom": "PDF",
      "typeMime": {
        "type": "application",
        "subType": "PDF"
      },
      "statutRepresentation": {
        "verbatim": true,
        "canonique": true,
        "officielle": true,
        "transcription": false,
        "enregistrement": false
      },
      "contenu": {
        "documentURI": "/15/amendements/2272A/CION_FIN/CF826.pdf"
      }
    }
  ],
  "dateDepot": "2019-10-04T02:00:00.000+02:00",
  "dateDistribution": "2019-10-04T02:00:00.000+02:00",
  "article99": "0",
  "loiReference": {}
}