{
  "uid": "AMANR5L15SEA717460BTC1662P0D1N348",
  "identifiant": {
    "legislature": "15",
    "numero": "348",
    "numRect": "0",
    "saisine": {
      "texteLegislatifRef": "PIONANR5L15BTC1662",
      "numeroPartiePLF": "0",
      "organeExamen": "PO717460",
      "mentionSecondeDeliberation": "0"
    }
  },
  "numeroLong": "348",
  "etapeTexte": "1ère lecture (2ème assemblée saisie)",
  "triAmendement": "baaaaaaaaaaaaaaaaaaaaaaaaaaaaaaaaaaaaaaaaaaaaaaaaabbzzzx",
  "cardinaliteAmdtMultiples": "1",
  "etat": "Discuté",
  "signataires": {
    "auteur": {
      "typeAuteur": "Depute",
      "acteurRef": "PA721860",
      "groupePolitiqueRef": "PO730964"
    },
    "cosignatairesRefs": [
      "PA718962",
      "PA719496",
      "PA720054",
      "PA722336",
      "PA719024",
      "PA721860",
      "PA719890",
      "PA720038"
    ],
    "texteAffichable": "M.&#160;Cesarini,  M.&#160;Zulesi, M.&#160;Cabar&#233;, Mme&#160;Josso, M.&#160;Blanchet, Mme&#160;Brulebois, M.&#160;Thi&#233;baut et M.&#160;Haury"
  },
  "pointeurFragmentTexte": {
    "division": {
      "titre": "Article 2",
      "articleDesignationCourte": "ART. 2",
      "type": "ARTICLE",
      "avantAApres": "A",
      "divisionRattachee": "ARTICLE 2",
      "urlDivisionTexteVise": "/15/textes/1662.asp#D_Article_2"
    },
    "alinea": {
      "numero": "2"
    }
  },
  "corps": {
    "dispositif": "<p>Apr&#232;s la troisi&#232;me phrase de l&#8217;alin&#233;a&#160;2, ins&#233;rer la phrase suivante&#160;:</p><p>&#171;&#160;Ce projet de territoire est le r&#233;sultat d&#8217;une concertation et d&#8217;un portage partag&#233; d&#8217;un collectif public/priv&#233;, auquel est associ&#233; le Conseil de d&#233;veloppement, lorsque celui-ci existe.&#160;&#187;</p>",
    "exposeSommaire": "<p>Tout projet de territoire ne peut &#234;tre que l&#8217;&#233;manation d&#8217;une concertation entre toutes les forces vives du territoire qu&#8217;elles soient publiques ou priv&#233;es, c&#8217;est pourquoi il est indispensable que le projet de territoire soit &#233;labor&#233; par les acteurs locaux, publics et priv&#233;s, avec notamment les chambres consulaires, les entreprises, la soci&#233;t&#233; civile, ainsi que les conseils de d&#233;veloppement.</p>"
  },
  "representations": [
    {
      "nom": "PDF",
      "typeMime": {
        "type": "application",
        "subType": "PDF"
      },
      "statutRepresentation": {
        "verbatim": true,
        "canonique": true,
        "officielle": true,
        "transcription": false,
        "enregistrement": false
      },
      "contenu": {
        "documentURI": "/15/amendements/1662/AN/348.pdf"
      }
    }
  ],
  "seanceDiscussion": "RUANR5L15S2019IDS21544",
  "sort": {
    "dateSaisie": "2019-03-12T19:15:23.000+01:00",
    "sortEnSeance": "Rejeté"
  },
  "dateDepot": "2019-03-07T01:00:00.000+01:00",
  "dateDistribution": "2019-03-08T01:00:00.000+01:00",
  "article99": "0",
  "loiReference": {}
}