{
  "uid": "AMANR5L15SEA717460BTC0164P0D1N110",
  "identifiant": {
    "legislature": "15",
    "numero": "110",
    "numRect": "0",
    "saisine": {
      "texteLegislatifRef": "PRJLANR5L15BTC0164",
      "numeroPartiePLF": "0",
      "organeExamen": "PO717460",
      "mentionSecondeDeliberation": "0"
    }
  },
  "numeroLong": "110",
  "etapeTexte": "1ère lecture (2ème assemblée saisie)",
  "triAmendement": "aezzwzzzztxzw",
  "cardinaliteAmdtMultiples": "1",
  "etat": "Discuté",
  "signataires": {
    "auteur": {
      "typeAuteur": "Depute",
      "acteurRef": "PA267440",
      "groupePolitiqueRef": "PO730934"
    },
    "cosignatairesRefs": [
      "PA721314",
      "PA720386",
      "PA721678",
      "PA643134",
      "PA709315",
      "PA330684",
      "PA643103",
      "PA267318",
      "PA608416",
      "PA718838",
      "PA346218",
      "PA721968",
      "PA767",
      "PA718884",
      "PA608016",
      "PA336316",
      "PA267429",
      "PA334654",
      "PA267440",
      "PA223837",
      "PA718850",
      "PA606098",
      "PA267527",
      "PA345722",
      "PA605036"
    ],
    "texteAffichable": "M.&#160;Diard,  M.&#160;Straumann, M.&#160;Brun, M.&#160;Hetzel, M.&#160;Bouchet, M.&#160;Cattin, M.&#160;Cordier, M.&#160;Cinieri, M.&#160;Saddier, M.&#160;Brochand, Mme&#160;Val&#233;rie&#160;Boyer, M.&#160;Grelier, M.&#160;Ferrara, M.&#160;Reda, Mme&#160;Valentin, M.&#160;Vialay, M.&#160;Di Filippo, M.&#160;Schellenberger, M.&#160;Masson, M.&#160;Viala, M.&#160;Abad, Mme&#160;Bazin-Malgras, M.&#160;Marleix, Mme&#160;Louwagie et Mme&#160;Le Grip"
  },
  "pointeurFragmentTexte": {
    "division": {
      "titre": "Article 3",
      "articleDesignationCourte": "ART. 3",
      "type": "ARTICLE",
      "avantAApres": "A",
      "divisionRattachee": "ARTICLE 3",
      "urlDivisionTexteVise": "/15/textes/0164.asp#D_Article_3"
    },
    "alinea": {
      "numero": "24"
    }
  },
  "corps": {
    "dispositif": "<p style=\"text-align: justify;\">Supprimer la troisi&#232;me phrase de l&#8217;alin&#233;a&#160;24.</p>",
    "exposeSommaire": "<p style=\"text-align: justify;\">Cet amendement vise &#224; supprimer l&#8217;obligation de pr&#233;sence d&#8217;&#233;l&#233;ments nouveaux ou compl&#233;mentaires afin de prolonger, au del&#224; d&#8217;une dur&#233;e cumul&#233;e de six mois, les mesures administratives vis&#233;es par l&#8217;article&#160;3 du pr&#233;sent projet de Loi. Il s&#8217;agit de revenir au texte d&#8217;origine avant son passage en commission, car cette obligation d&#8217;&#233;l&#233;ments nouveaux ou compl&#233;mentaires aurait pour cons&#233;quence de mettre fin aux mesures mises en place par le pr&#233;sent projet alors que la dangerosit&#233; de l&#8217;individu en question serait toujours aussi &#233;lev&#233;e, sur les seuls motifs qu&#8217;il n&#8217;y aurait pas d&#8217;&#233;l&#233;ments nouveaux.</p><p style=\"text-align: justify;\">La suppression de cette troisi&#232;me phrase est d&#8217;autant plus possible que la derni&#232;re phrase de cet alin&#233;a&#160;24 dispose bien que &#171;&#160;les mesures sont lev&#233;es d&#232;s que les conditions pr&#233;vues &#224; l&#8217;article L228&#8209;1 ne sont plus satisfaites&#160;&#187;, garantissant le respect de l&#8217;&#233;tat de droit face &#224; d&#8217;&#233;ventuels abus.</p>"
  },
  "representations": [
    {
      "nom": "PDF",
      "typeMime": {
        "type": "application",
        "subType": "PDF"
      },
      "statutRepresentation": {
        "verbatim": true,
        "canonique": true,
        "officielle": true,
        "transcription": false,
        "enregistrement": false
      },
      "contenu": {
        "documentURI": "/15/amendements/0164/AN/110.pdf"
      }
    }
  ],
  "seanceDiscussion": "RUANR5L15S2017IDS20671",
  "sort": {
    "dateSaisie": "2017-09-27T01:04:14.000+02:00",
    "sortEnSeance": "Rejeté"
  },
  "dateDepot": "2017-09-20T02:00:00.000+02:00",
  "dateDistribution": "2017-09-22T02:00:00.000+02:00",
  "article99": "0",
  "loiReference": {}
}