{
  "uid": "AMANR5L15SEA717460BTC1548P0D1N599",
  "identifiant": {
    "legislature": "15",
    "numero": "599",
    "numRect": "0",
    "saisine": {
      "texteLegislatifRef": "PRJLANR5L15BTC1548",
      "numeroPartiePLF": "0",
      "organeExamen": "PO717460",
      "mentionSecondeDeliberation": "0"
    }
  },
  "numeroLong": "599",
  "etapeTexte": "Nouvelle Lecture",
  "triAmendement": "ifaaaaaaaaaaaaaaaaaaaaaaaaaaaaaaaaaaaaaaaaaaaaaaaaf",
  "cardinaliteAmdtMultiples": "1",
  "etat": "Discuté",
  "signataires": {
    "auteur": {
      "typeAuteur": "Depute",
      "acteurRef": "PA719202",
      "groupePolitiqueRef": "PO730964"
    },
    "cosignatairesRefs": [
      "PA719202"
    ],
    "texteAffichable": "M.&#160;Paris"
  },
  "pointeurFragmentTexte": {
    "division": {
      "titre": "Article 45",
      "articleDesignationCourte": "ART. 45",
      "type": "ARTICLE",
      "avantAApres": "A",
      "divisionRattachee": "ARTICLE 45",
      "urlDivisionTexteVise": "/15/textes/1548.asp#D_Article_45"
    },
    "alinea": {
      "numero": "43"
    }
  },
  "corps": {
    "dispositif": "<p style=\"text-align: justify;\">Apr&#232;s le mot&#160;:</p><p style=\"text-align: justify;\">&#171;&#160;l&#233;gislative,&#160;&#187;,</p><p style=\"text-align: justify;\">r&#233;diger ainsi la fin de l&#8217;alin&#233;a&#160;43&#160;:</p><p style=\"text-align: justify;\">&#171;&#160;les r&#233;f&#233;rences au placement sous surveillance &#233;lectronique sont remplac&#233;es par des r&#233;f&#233;rences &#224; la d&#233;tention &#224; domicile sous surveillance &#233;lectronique, sauf lorsqu&#8217;il est fait mention du placement sous surveillance &#233;lectronique mobile.&#160;&#187;</p>",
    "exposeSommaire": "<p style=\"text-align: justify;\">Amendement r&#233;dactionnel.</p>",
    "cartoucheDelaiDepotDepasse": "Sous réserve de son traitement par les services de l'Assemblée nationale et de sa recevabilité"
  },
  "representations": [
    {
      "nom": "PDF",
      "typeMime": {
        "type": "application",
        "subType": "PDF"
      },
      "statutRepresentation": {
        "verbatim": true,
        "canonique": true,
        "officielle": true,
        "transcription": false,
        "enregistrement": false
      },
      "contenu": {
        "documentURI": "/15/amendements/1548/AN/599.pdf"
      }
    }
  ],
  "seanceDiscussion": "RUANR5L15S2019IDS21452",
  "sort": {
    "dateSaisie": "2019-01-17T23:24:43.000+01:00",
    "sortEnSeance": "Adopté"
  },
  "dateDepot": "2019-01-11T01:00:00.000+01:00",
  "dateDistribution": "2019-01-17T01:00:00.000+01:00",
  "article99": "0",
  "loiReference": {}
}