{
  "uid": "AMANR5L15SEA717460B0235P1D1N1012",
  "identifiant": {
    "legislature": "15",
    "numero": "1012",
    "numRect": "0",
    "saisine": {
      "texteLegislatifRef": "PRJLANR5L15B0235",
      "numeroPartiePLF": "1",
      "organeExamen": "PO717460",
      "mentionSecondeDeliberation": "0"
    }
  },
  "numeroLong": "I-1012",
  "etapeTexte": "1ère lecture (1ère assemblée saisie)",
  "triAmendement": "acdddzztgu",
  "cardinaliteAmdtMultiples": "1",
  "etat": "Discuté",
  "signataires": {
    "auteur": {
      "typeAuteur": "Depute",
      "acteurRef": "PA609590",
      "groupePolitiqueRef": "PO730946"
    },
    "cosignatairesRefs": [
      "PA1198",
      "PA335532",
      "PA335999",
      "PA610681",
      "PA405480",
      "PA642764",
      "PA608172",
      "PA719930",
      "PA608011",
      "PA609332",
      "PA335054",
      "PA333818",
      "PA342415",
      "PA333285",
      "PA609590",
      "PA1008",
      "PA607553",
      "PA330357",
      "PA1592",
      "PA588886",
      "PA720988",
      "PA337483",
      "PA508",
      "PA267233",
      "PA332614",
      "PA608695",
      "PA605069",
      "PA643145",
      "PA429893",
      "PA1809",
      "PA340343"
    ],
    "texteAffichable": "Mme&#160;Rabault,  M.&#160;Jean-Louis&#160;Bricout, Mme&#160;Pires Beaune, M.&#160;Pupponi, M.&#160;Faure, M.&#160;Aviragnet, Mme&#160;Bareigts, Mme&#160;Batho, Mme&#160;Battistel, Mme&#160;Bi&#233;mouret, M.&#160;Bouillon, M.&#160;Carvounas, M.&#160;Alain&#160;David, Mme&#160;Laurence&#160;Dumont, M.&#160;Dussopt, M.&#160;Garot, M.&#160;David&#160;Habib, M.&#160;Hutin, M.&#160;Juanico, Mme&#160;Karamanli, M.&#160;J&#233;r&#244;me&#160;Lambert, M.&#160;Le Foll, M.&#160;Letchimy, Mme&#160;Manin, Mme&#160;Pau-Langevin, M.&#160;Potier, M.&#160;Pueyo, M.&#160;Saulignac, Mme&#160;Untermaier, Mme&#160;Vainqueur-Christophe et M.&#160;Vallaud"
  },
  "pointeurFragmentTexte": {
    "division": {
      "titre": "Article 8",
      "articleDesignationCourte": "ART. 8",
      "type": "ARTICLE",
      "avantAApres": "A",
      "divisionRattachee": "ARTICLE 8",
      "urlDivisionTexteVise": "/15/textes/0235A.asp#D_Article_8"
    },
    "alinea": {
      "numero": "4"
    }
  },
  "corps": {
    "dispositif": "<p style=\"text-align: justify;\">I.&#160;&#8211;&#160;R&#233;diger ainsi l&#8217;alin&#233;a&#160;4&#160;:&#160;</p><p style=\"text-align: justify;\">&#171;&#160;a) l&#8217;ann&#233;e&#160;: &#171;&#160;2017&#160;&#187; est remplac&#233;e par l&#8217;ann&#233;e&#160;: &#171;&#160;2018&#160;&#187;&#160;;&#160;&#187;.</p><p style=\"text-align: justify;\">II.&#160;&#8211;&#160;En cons&#233;quence, r&#233;diger ainsi l&#8217;alin&#233;a&#160;8&#160;:&#160;</p><p style=\"text-align: justify;\">&#171;&#160;Toutefois, pour les d&#233;penses mentionn&#233;es au 2&#176; du <i>b</i> du 1, le cr&#233;dit d&#8217;imp&#244;t s&#8217;applique seulement si ces d&#233;penses portent sur des travaux aboutissant &#224; l&#8217;obtention du label &#171;&#160;BBC r&#233;novation 2009&#160;&#187; pr&#233;vu par l&#8217;arr&#234;t&#233; du 29 septembre 2009.&#160;&#187;&#160;</p><p style=\"text-align: justify;\">III.&#160;&#8211;&#160;En cons&#233;quence, supprimer les alin&#233;as 10 et 11.</p><p style=\"text-align: justify;\">IV.&#160;&#8211;&#160;Compl&#233;ter cet article par les deux alin&#233;as suivants&#160;:</p><p style=\"text-align: justify;\">&#171;&#160;III.&#160;&#8211;&#160;Le I n&#8217;est applicable qu&#8217;aux sommes venant en d&#233;duction de l&#8217;imp&#244;t d&#251;.&#160;&#187;</p><p style=\"text-align: justify;\">&#171;&#160;IV.&#160;&#8211;&#160;La perte de recettes pour l&#8217;&#201;tat est compens&#233;e &#224; due concurrence par la cr&#233;ation d&#8217;une taxe additionnelle aux droits vis&#233;s aux articles 575 et 575 A du code g&#233;n&#233;ral des imp&#244;ts.&#160;&#187;</p>",
    "exposeSommaire": "<p style=\"text-align: justify;\">Avec cet article, le Gouvernement envisage&#160;de&#160;:</p><ul style=\"text-align: justify;\"><li>ramener le taux du cr&#233;dit d&#8217;imp&#244;t pour la transition &#233;nerg&#233;tique (CITE) pour les fen&#234;tres, volets isolants et portes de 30 % &#224; 15 % de fa&#231;on r&#233;troactive &#224; compter du 27 septembre 2017&#160;;</li><li>sortir d&#233;finitivement ces mat&#233;riaux du CITE &#224; compter du 28 mars 2018.</li></ul><p style=\"text-align: justify;\">Supprimer de fa&#231;on aussi abrupte une mesure contribuant efficacement aux objectifs de transition &#233;nerg&#233;tique, qui plus est avec un effet r&#233;troactif, appara&#238;t en totale contradiction avec les objectifs &#233;lev&#233;s que s&#8217;est fix&#233; le Gouvernement en la mati&#232;re.</p><p style=\"text-align: justify;\">Le pr&#233;sent amendement propose donc de r&#233;tablir les portes, fen&#234;tres et volets isolants dans le champ du CITE et de maintenir le taux de 30&#160;% pour l&#8217;ann&#233;e 2018. Toutefois, la reconduction de ce dispositif pour 2018 s&#8217;accompagne d&#8217;un renforcement des conditions en mati&#232;re d&#8217;efficacit&#233; &#233;nerg&#233;tique. C&#8217;est pourquoi le cr&#233;dit d&#8217;imp&#244;t ne s&#8217;applique que si les travaux ont permis l&#8217;obtention du label &#171;&#160;BBC r&#233;novation 2009&#160;&#187; pr&#233;vu par l&#8217;arr&#234;t&#233; du 29 septembre 2009.</p><p style=\"text-align: justify;\">Cet amendement s&#8217;inscrit dans le cadre du contre-budget pr&#233;sent&#233; par le groupe Nouvelle Gauche&#160;:<br /> http&#160;://lessocialistes.fr/sites/default/files/AN&#160;%20Nouvelle&#160;%20Gauche&#160;%20contre&#160;%20budget&#160;%20Vdef.pdf</p>"
  },
  "representations": [
    {
      "nom": "PDF",
      "typeMime": {
        "type": "application",
        "subType": "PDF"
      },
      "statutRepresentation": {
        "verbatim": true,
        "canonique": true,
        "officielle": true,
        "transcription": false,
        "enregistrement": false
      },
      "contenu": {
        "documentURI": "/15/amendements/0235A/AN/1012.pdf"
      }
    }
  ],
  "seanceDiscussion": "RUANR5L15S2018IDS20769",
  "sort": {
    "dateSaisie": "2017-10-21T16:59:23.000+02:00",
    "sortEnSeance": "Tombé"
  },
  "dateDepot": "2017-10-13T02:00:00.000+02:00",
  "dateDistribution": "2017-10-16T02:00:00.000+02:00",
  "article99": "0",
  "loiReference": {}
}