{
  "uid": "AMANR5L15PO59051B1695P0D1N3",
  "identifiant": {
    "legislature": "15",
    "numero": "3",
    "numRect": "0",
    "saisine": {
      "texteLegislatifRef": "PRJLANR5L15B1695",
      "numeroPartiePLF": "0",
      "organeExamen": "PO59051",
      "mentionSecondeDeliberation": "0"
    }
  },
  "numeroLong": "CL3",
  "etapeTexte": "1ère lecture (2ème assemblée saisie)",
  "triAmendement": "abiaaaaaaaaaaaaaaaaaaaaaaaaaaaaaaaaaaaaaaaaaaaaaaad",
  "cardinaliteAmdtMultiples": "1",
  "etat": "Discuté",
  "signataires": {
    "auteur": {
      "typeAuteur": "Depute",
      "acteurRef": "PA721062",
      "groupePolitiqueRef": "PO730958"
    },
    "cosignatairesRefs": [
      "PA720846",
      "PA719676",
      "PA721226",
      "PA722142",
      "PA719578",
      "PA588884",
      "PA721202",
      "PA718868",
      "PA720430",
      "PA721062",
      "PA721210",
      "PA718860",
      "PA720422",
      "PA2150",
      "PA721960",
      "PA720286",
      "PA720892"
    ],
    "texteAffichable": "M.&#160;Ratenon,  Mme&#160;Autain, M.&#160;Bernalicis, M.&#160;Coquerel, M.&#160;Corbi&#232;re, Mme&#160;Fiat, M.&#160;Lachaud, M.&#160;Larive, M.&#160;M&#233;lenchon, Mme&#160;Obono, Mme&#160;Panot, M.&#160;Prud&apos;homme, M.&#160;Quatennens, Mme&#160;Ressiguier, Mme&#160;Rubin, M.&#160;Ruffin et Mme&#160;Taurine"
  },
  "pointeurFragmentTexte": {
    "division": {
      "titre": "Article PREMIER",
      "articleDesignationCourte": "ART. PREMIER",
      "type": "ARTICLE",
      "avantAApres": "A",
      "divisionRattachee": "ARTICLE PREMIER",
      "urlDivisionTexteVise": "/15/textes/1695.asp#D_Article_1er"
    },
    "alinea": {
      "numero": "6"
    }
  },
  "corps": {
    "dispositif": "<p style=\"text-align: justify;\">R&#233;diger ainsi l&#8217;alin&#233;a&#160;6&#160;:&#160;</p><p style=\"text-align: justify;\">&#171;&#160;<i>Art.&#160;6&#8209;1</i>.&#160;&#8211;&#160;La R&#233;publique reconna&#238;t la participation de la Polyn&#233;sie fran&#231;aise &#224; la construction de la capacit&#233; de dissuasion nucl&#233;aire et &#224; la d&#233;fense de la Nation ainsi que les pr&#233;judices &#233;conomiques, environnementaux, sanitaires et sociaux caus&#233;s &#224; la Polyn&#233;sie fran&#231;aise par l&#8217;&#201;tat.&#160;&#187;</p>",
    "exposeSommaire": "<p style=\"line-height: 1.2;\">Par cet amendement de r&#233;&#233;criture, nous souhaitons mettre en ad&#233;quation les termes et les faits quant aux essais nucl&#233;aires en Polyn&#233;sie fran&#231;aise.</p><p style=\"text-align: justify;\">Pendant 30 ans, de 1966 &#224; 1996, la France a test&#233; ses bombes nucl&#233;aires en Polyn&#233;sie &#224; 193 reprises. La d&#233;cision du gouvernement fran&#231;ais d&#8217;utiliser le territoire polyn&#233;sien comme site pour ses essais nucl&#233;aires est venue bousculer l&#8217;ensemble du mode de vie de la Polyn&#233;sie aux niveaux &#233;conomique, social, alimentaire, culturel et environnemental. Par cette d&#233;cision unilat&#233;rale, un capitalisme occidental a &#233;t&#233; impos&#233; et a d&#233;tourn&#233; la population locale de ses moyens de subsistance traditionnels. Comble, la toute premi&#232;re bombe largu&#233;e au-dessus de l&#8217;atoll de Moruroa le 2 juillet 1966, a d&#233;riv&#233; jusqu&#8217;&#224; Mangareva, entra&#238;nant l&#8217;&#233;vacuation du ministre des outre-mer, alors que la population locale n&#8217;en a pas &#233;t&#233; inform&#233;e ! Malgr&#233; la connaissance parfaite d&#232;s le d&#233;but des essais de taux de radioactivit&#233; sup&#233;rieurs &#224; la normale (l&#8217;eau potable &#233;tait six fois plus radioactive), les essais ont &#233;t&#233; poursuivis jusqu&#8217;en f&#233;vrier 1996.</p><p style=\"text-align: justify;\">En 2018, Oscar Temaru, politique de l&#8217;opposition en Polyn&#233;sie fran&#231;aise, a d&#233;clar&#233; lors d&#8217;une r&#233;union des Nations unies &#224; New York qu&#8217;une plainte avait &#233;t&#233; d&#233;pos&#233;e contre la France pour <i>&#171; crimes contre l&#8217;humanit&#233; &#187;</i> devant la Cour p&#233;nale internationale, et ce, au nom de <i>&#171; toutes les personnes qui sont mortes des cons&#233;quences du colonialisme nucl&#233;aire &#187;</i>.</p><p style=\"text-align: justify;\">L&#8217; article 1er formule notamment que &#8220;La R&#233;publique reconna&#238;t la contribution de la Polyn&#233;sie fran&#231;aise &#224; la construction de la capacit&#233; de dissuasion nucl&#233;aire et &#224; la d&#233;fense de la Nation.&#8221; Alors que ce territoire paie encore les cons&#233;quences sanitaires, sociales et environnementales des essais, nous estimons qu&#8217;il est indispensable de reconna&#238;tre &#233;galement les pr&#233;judices &#233;conomiques, environnementaux, sanitaires et sociaux g&#233;n&#233;r&#233;s.</p>"
  },
  "representations": [
    {
      "nom": "PDF",
      "typeMime": {
        "type": "application",
        "subType": "PDF"
      },
      "statutRepresentation": {
        "verbatim": true,
        "canonique": true,
        "officielle": true,
        "transcription": false,
        "enregistrement": false
      },
      "contenu": {
        "documentURI": "/15/amendements/1695/CION_LOIS/CL3.pdf"
      }
    }
  ],
  "sort": {
    "dateSaisie": "2019-03-27T19:08:22.000+01:00",
    "sortEnSeance": "Retiré"
  },
  "dateDepot": "2019-03-22T01:00:00.000+01:00",
  "dateDistribution": "2019-03-26T01:00:00.000+01:00",
  "article99": "0",
  "loiReference": {}
}