{
  "uid": "AMANR5L15PO420120B1681P0D1N127",
  "identifiant": {
    "legislature": "15",
    "numero": "127",
    "numRect": "0",
    "saisine": {
      "texteLegislatifRef": "PRJLANR5L15B1681",
      "numeroPartiePLF": "0",
      "organeExamen": "PO420120",
      "mentionSecondeDeliberation": "0"
    }
  },
  "numeroLong": "AS127",
  "etapeTexte": "1ère lecture (1ère assemblée saisie)",
  "triAmendement": "laaaaaaaaaaaaaaaaaaaaaaaaaaaaaaaaaaaaaaaaaaaaaaaaak",
  "cardinaliteAmdtMultiples": "1",
  "etat": "Discuté",
  "signataires": {
    "auteur": {
      "typeAuteur": "Depute",
      "acteurRef": "PA722102",
      "groupePolitiqueRef": "PO730964"
    },
    "cosignatairesRefs": [
      "PA720030",
      "PA722194",
      "PA721522",
      "PA722118",
      "PA719972",
      "PA722228",
      "PA718710",
      "PA702054",
      "PA719100",
      "PA722134",
      "PA719512",
      "PA722102",
      "PA605963",
      "PA720046",
      "PA719440",
      "PA720054",
      "PA719890",
      "PA721946",
      "PA720622",
      "PA722366",
      "PA2449",
      "PA718706",
      "PA720854",
      "PA719692",
      "PA720190",
      "PA721844",
      "PA719294"
    ],
    "texteAffichable": "Mme&#160;Vidal,  M.&#160;Ardouin, M.&#160;Claireaux, M.&#160;Pont, Mme&#160;Dufeu Schubert, M.&#160;Freschi, Mme&#160;Fontaine-Domeizel, M.&#160;Haury, Mme&#160;Bureau-Bonnard, M.&#160;Test&#233;, Mme&#160;Sarles, M.&#160;Alauzet, M.&#160;Eliaou, Mme&#160;Vignon, Mme&#160;Clapot, M.&#160;Leclabart, Mme&#160;Brulebois, M.&#160;Batut, Mme&#160;Pascale&#160;Boyer, Mme&#160;Provendier, M.&#160;Cellier, M.&#160;Fi&#233;vet, M.&#160;Sorre, M.&#160;Marilossian, M.&#160;Fugit, Mme&#160;Sylla et Mme&#160;Piron"
  },
  "pointeurFragmentTexte": {
    "division": {
      "titre": "Article 22",
      "articleDesignationCourte": "APRÈS ART. 22",
      "type": "ARTICLE",
      "avantAApres": "Apres",
      "divisionRattachee": "APRÈS L'ARTICLE 22, insérer l'article suivant:",
      "articleAdditionnel": "1",
      "urlDivisionTexteVise": "/15/textes/1681.asp#D_Article_22"
    }
  },
  "corps": {
    "dispositif": "<p>I.&#160;&#8211;&#160;La section 1 du chapitre III du titre I<sup>er</sup> du livre III du code de l&#8217;action sociale et des familles est ainsi modifi&#233;e&#160;:</p><p style=\"text-align: justify;\">1&#176;&#160;L&#8217;article L.&#160;312&#8209;8 est ainsi modifi&#233;&#160;:</p><p style=\"text-align: justify;\"><i>a)</i>&#160;Le premier alin&#233;a est ainsi r&#233;dig&#233;&#160;:</p><p style=\"text-align: justify;\">&#171;&#160;Dans un objectif d&#8217;am&#233;lioration continue de la qualit&#233;, les &#233;tablissements et services mentionn&#233;s &#224; l&#8217;article L.&#160;312&#8209;1 &#233;valuent et font proc&#233;der &#224; l&#8217;&#233;valuation de la qualit&#233; des prestations qu&#8217;ils d&#233;livrent selon une proc&#233;dure &#233;labor&#233;e par la Haute Autorit&#233; de sant&#233; mentionn&#233;e &#224; l&#8217;article L.&#160;161&#8209;37 du code de la s&#233;curit&#233; sociale. Les organismes pouvant proc&#233;der &#224; cette &#233;valuation sont habilit&#233;s par la Haute Autorit&#233; de sant&#233; qui d&#233;finit le cahier des charges auquel ils sont soumis. Les r&#233;sultats de cette &#233;valuation sont communiqu&#233;s &#224; l&#8217;autorit&#233; ayant d&#233;livr&#233; l&#8217;autorisation ainsi qu&#8217;&#224; la Haute Autorit&#233; de sant&#233;. Un d&#233;cret d&#233;termine les modalit&#233;s de leur publication ainsi que le rythme des &#233;valuations.&#160;&#187;&#160;;</p><p style=\"text-align: justify;\"><i>b)</i>&#160;Les troisi&#232;me, quatri&#232;me, sixi&#232;me et huiti&#232;me alin&#233;as sont supprim&#233;s&#160;;</p><p style=\"text-align: justify;\"><i>c)</i>&#160;Au d&#233;but du cinqui&#232;me alin&#233;a, les mots&#160;: &#171;&#160;Par d&#233;rogation aux dispositions de l&#8217;alin&#233;a pr&#233;c&#233;dent,&#160;&#187; sont supprim&#233;s&#160;;</p><p style=\"text-align: justify;\"><i>d)</i>&#160;&#192; la fin du septi&#232;me alin&#233;a, le mot&#160;: &#171;&#160;externe&#160;&#187; est supprim&#233;&#160;;</p><p style=\"text-align: justify;\"><i>e)</i>&#160;Le dernier alin&#233;a est ainsi modifi&#233;&#160;:</p><p style=\"text-align: justify;\">&#8211;&#160;les mots&#160;: &#171;&#160;les proc&#233;dures&#160;&#187; sont remplac&#233;s par les mots&#160;: &#171;&#160;la proc&#233;dure&#160;&#187;&#160;;</p><p style=\"text-align: justify;\">&#8211;&#160;le mot&#160;: &#171;&#160;r&#233;f&#233;rences&#160;&#187; est remplac&#233; par le mot&#160;: &#171;&#160;r&#233;f&#233;rentiels&#160;&#187;&#160;;</p><p style=\"text-align: justify;\">&#8211;&#160;apr&#232;s le mot &#171;&#160;professionnelles&#160;&#187;, la fin est ainsi r&#233;dig&#233;e&#160;: &#171;&#160;au regard desquelles la qualit&#233; des prestations d&#233;livr&#233;es par les &#233;tablissements et services est &#233;valu&#233;e.&#160;&#187;</p><p style=\"text-align: justify;\">2&#176;&#160;&#192; la seconde phrase du premier alin&#233;a de l&#8217;article L.&#160;313&#8209;1, le mot&#160;:&#160;&#171;&#160;externe&#160;&#187; est supprim&#233; et le mot&#160;: &#171;&#160;troisi&#232;me&#160;&#187; est remplac&#233; par le mot&#160;: &#171;&#160;premier&#160;&#187;.</p><p style=\"text-align: justify;\">II.&#160;&#8211;&#160;Le pr&#233;sent article entre en vigueur le 1<sup>er&#160;</sup>janvier&#160;2021, &#224; l&#8217;exception de la deuxi&#232;me phrase du second alin&#233;a du <i>a</i> du I qui entre en vigueur 1<sup>er&#160;</sup>janvier&#160;2020.</p><p style=\"text-align: justify;\">Les organismes habilit&#233;s avant le 1<sup>er&#160;</sup>janvier&#160;2020 renouvellent leur habilitation aupr&#232;s de la Haute Autorit&#233; de sant&#233; dans un d&#233;lai d&#8217;un an sur la base du cahier des charges d&#233;finies par elle.</p><p style=\"text-align: justify;\">&#160;</p>",
    "exposeSommaire": "<p>Cet amendement fait suite au rapport sur l&#8217;&#233;volution du syst&#232;me d&#8217;&#233;valuation dans les ESSMS, r&#233;dig&#233; par Annie Vidal, dans le cadre des travaux de la MECSS&#160;: &#171;&#160;La d&#233;marche qualit&#233; en EHPAD&#160;: un levier pour le bien-&#234;tre de nos a&#238;n&#233;s&#160;&#187;</p><p style=\"text-align: justify;\">L&#8217;article&#160;72 de la LFSS pour 2018 a transf&#233;r&#233; &#224; la HAS les missions auparavant d&#233;volues &#224; l&#8217;ANESM en mati&#232;re d&#8217;&#233;valuation de la qualit&#233; des &#233;tablissements et services sociaux et m&#233;dico-sociaux (ESSMS).</p><p style=\"text-align: justify;\">Cependant, une &#233;volution des dispositions l&#233;gislatives actuelles est n&#233;cessaire afin de confier &#224; la HAS la comp&#233;tence pour &#233;laborer la proc&#233;dure d&#8217;&#233;valuation des ESSMS et fixer les crit&#232;res et la dur&#233;e d&#8217;habilitation des organismes en charge de l&#8217;&#233;valuation des ESSMS.</p><p style=\"text-align: justify;\">Cette &#233;volution permettra &#224; la HAS de d&#233;finir la proc&#233;dure d&#8217;&#233;valuation des ESSMS, comprenant une auto-&#233;valuation par les ESSMS ainsi qu&#8217;une &#233;valuation r&#233;alis&#233;e par organisme habilit&#233;, reposant sur des r&#233;f&#233;rentiels opposables, compos&#233;s d&#8217;un socle commun &#224; l&#8217;ensemble des structures et des publics ainsi que des volets sp&#233;cifiques pour chaque cat&#233;gorie de structure.</p><p style=\"text-align: justify;\">Les rapports d&#8217;&#233;valuation seront transmis aux autorit&#233;s comp&#233;tentes et &#224; la HAS pour l&#8217;&#233;valuation du dispositif, et ils seront &#233;galement rendus public.</p><p style=\"text-align: justify;\">Par ailleurs, est confi&#233; &#224; la HAS la possibilit&#233; de fixer le cahier des charges pour l&#8217;habilitation des organismes ainsi que la dur&#233;e de cette habilitation permettant l&#8217;&#233;valuation des ESSMS.</p><p style=\"text-align: justify;\">Ces modifications du cadre juridique du dispositif d&#8217;&#233;valuation de la qualit&#233; des ESSMS seront d&#233;terminantes pour renforcer la d&#233;marche qualit&#233; des services et structures, pour plus de transparence, plus de valorisation et plus de confiance.</p>"
  },
  "representations": [
    {
      "nom": "PDF",
      "typeMime": {
        "type": "application",
        "subType": "PDF"
      },
      "statutRepresentation": {
        "verbatim": true,
        "canonique": true,
        "officielle": true,
        "transcription": false,
        "enregistrement": false
      },
      "contenu": {
        "documentURI": "/15/amendements/1681/CION-SOC/AS127.pdf"
      }
    }
  ],
  "sort": {
    "dateSaisie": "2019-03-14T16:06:34.000+01:00",
    "sortEnSeance": "Adopté"
  },
  "dateDepot": "2019-03-06T01:00:00.000+01:00",
  "dateDistribution": "2019-03-12T01:00:00.000+01:00",
  "article99": "0",
  "loiReference": {
    "codeLoi": "action sociale et familles",
    "divisionCodeLoi": "L312-8"
  }
}