{
  "uid": "AMANR5L15SEA717460BTC1175P0D1N124",
  "identifiant": {
    "legislature": "15",
    "numero": "124",
    "numRect": "0",
    "saisine": {
      "texteLegislatifRef": "PRJLANR5L15BTC1175",
      "numeroPartiePLF": "0",
      "organeExamen": "PO717460",
      "mentionSecondeDeliberation": "0"
    }
  },
  "numeroLong": "124",
  "etapeTexte": "Nouvelle Lecture",
  "triAmendement": "ojaaaaaaaaaaaaaaaaaaaaaaaaaaaaaaaaaaaaaaaaaaaaaaaabkl",
  "cardinaliteAmdtMultiples": "1",
  "etat": "Discuté",
  "signataires": {
    "auteur": {
      "typeAuteur": "Depute",
      "acteurRef": "PA332228",
      "groupePolitiqueRef": "PO744425"
    },
    "cosignatairesRefs": [
      "PA720696",
      "PA335758",
      "PA610775",
      "PA267355",
      "PA721486",
      "PA332228",
      "PA712014",
      "PA267241",
      "PA719806",
      "PA267780",
      "PA421348",
      "PA267330",
      "PA642868",
      "PA942",
      "PA721110",
      "PA267042",
      "PA266788",
      "PA331567",
      "PA720230",
      "PA1960"
    ],
    "texteAffichable": "M.&#160;Benoit,  M.&#160;Herth, Mme&#160;Auconie, M.&#160;Christophe, M.&#160;Charles&#160;de Courson, Mme&#160;de La Raudi&#232;re, M.&#160;Demilly, Mme&#160;Descamps, M.&#160;Favennec Becot, Mme&#160;Firmin Le Bodo, M.&#160;Gom&#232;s, M.&#160;Ledoux, M.&#160;Leroy, M.&#160;Morel-&#192;-L&apos;Huissier, M.&#160;Naegelen, M.&#160;Riester, Mme&#160;Sanquer, M.&#160;Villiers, M.&#160;Zumkeller et Mme&#160;Magnier"
  },
  "pointeurFragmentTexte": {
    "division": {
      "titre": "Article 14 septies",
      "articleDesignationCourte": "ART. 14 SEPTIES",
      "type": "ARTICLE",
      "avantAApres": "A",
      "divisionRattachee": "ARTICLE 14 SEPTIES",
      "urlDivisionTexteVise": "/15/textes/1175.asp#D_Article_14_septies"
    },
    "alinea": {
      "numero": "7"
    }
  },
  "corps": {
    "dispositif": "<p style=\"text-align: justify;\">Supprimer les alin&#233;as 7 &#224; 11.</p>",
    "exposeSommaire": "<p style=\"text-align: justify;\">Les chartes de bonnes pratiques concernant l&#8217;application de produis phytosanitaires b&#233;n&#233;ficiant d&#8217;une autorisation de mise sur le march&#233; (AMM) sont en discussion entre agriculteurs, &#233;lus locaux et riverains au niveau d&#233;partemental et sont &#224; d&#233;cliner au niveau local. L&#8217;objectif est de r&#233;pondre aux enjeux de sant&#233; publique et de d&#8217;environnement li&#233;s &#224; l&#8217;utilisation des produits phytosanitaires.</p><p style=\"text-align: justify;\">Cependant, ces d&#233;marches volontaires bas&#233;es sur la concertation et la compr&#233;hension mutuelle, ne doivent pas servir de pr&#233;texte &#224; des mesures l&#233;gislatives qui risquent de conduire &#224; des retraits de terre de la production agricole par l&#8217;introduction de nouvelles Zones Non Trait&#233;es.</p><p style=\"text-align: justify;\">Or ce nouveau paragraphe de l&#8217;article&#160;14 <i>septies</i> fait courir ce risque. Il a &#233;t&#233; introduit par voie d&#8217;amendement gouvernemental, en commission en nouvelle lecture, sans &#233;tude d&#8217;impact.</p><p style=\"text-align: justify;\">Par ailleurs, il transforme les chartes en v&#233;ritables textes r&#233;glementaires avec toutes les cons&#233;quences aff&#233;rentes en termes de sanctions, et revient &#224; privil&#233;gier la norme &#224; l&#8217;engagement. C&#8217;est pourquoi les alin&#233;as 7 &#224; 11 de l&#8217;article&#160;14 <i>septies</i> doivent &#234;tre supprim&#233;s.</p><p style=\"text-align: justify;\">&#160;</p>"
  },
  "representations": [
    {
      "nom": "PDF",
      "typeMime": {
        "type": "application",
        "subType": "PDF"
      },
      "statutRepresentation": {
        "verbatim": true,
        "canonique": true,
        "officielle": true,
        "transcription": false,
        "enregistrement": false
      },
      "contenu": {
        "documentURI": "/15/amendements/1175/AN/124.pdf"
      }
    }
  ],
  "seanceDiscussion": "RUANR5L15S2018IDS21237",
  "sort": {
    "dateSaisie": "2018-09-15T01:14:04.000+02:00",
    "sortEnSeance": "Rejeté"
  },
  "dateDepot": "2018-08-01T02:00:00.000+02:00",
  "dateDistribution": "2018-09-11T02:00:00.000+02:00",
  "article99": "0",
  "loiReference": {}
}