{
  "uid": "AMANR5L15PO59051B1350P0D1N43",
  "identifiant": {
    "legislature": "15",
    "numero": "43",
    "numRect": "0",
    "saisine": {
      "texteLegislatifRef": "PRJLANR5L15B1350",
      "numeroPartiePLF": "0",
      "organeExamen": "PO59051",
      "mentionSecondeDeliberation": "0"
    }
  },
  "numeroLong": "CL43",
  "etapeTexte": "1ère lecture (2ème assemblée saisie)",
  "triAmendement": "saaaaaaaaaaaaaaaaaaaaaaaaaaaaaaaaaaaaaaaaaaaaaaaaam",
  "cardinaliteAmdtMultiples": "1",
  "etat": "Discuté",
  "signataires": {
    "auteur": {
      "typeAuteur": "Gouvernement"
    },
    "texteAffichable": "le Gouvernement"
  },
  "pointeurFragmentTexte": {
    "division": {
      "titre": "Article 9",
      "articleDesignationCourte": "APRÈS ART. 9",
      "type": "ARTICLE",
      "avantAApres": "Apres",
      "divisionRattachee": "APRÈS L'ARTICLE 9, insérer l'article suivant:",
      "articleAdditionnel": "1",
      "urlDivisionTexteVise": "/15/textes/1350.asp#D_Article_9"
    }
  },
  "corps": {
    "dispositif": "<p style=\"text-align: justify;\">&#171;&#160;&#192; compter du&#160;1<sup>er</sup>&#160;janvier&#160;2020, les magistrats exer&#231;ant &#224; titre temporaire poursuivent leur mandat, pour exercer les fonctions pr&#233;vues &#224; l&#8217;article&#160;41&#8209;10 de l&#8217;ordonnance n&#176; 58&#8209;1270 du 22 d&#233;cembre 1958 portant loi organique relative au statut de la magistrature dans sa r&#233;daction r&#233;sultant de l&#8217;article&#160;4 de la pr&#233;sente loi organique, au sein du tribunal de grande instance dans lequel ils ont &#233;t&#233; nomm&#233;s.&#160;&#187;</p>",
    "exposeSommaire": "<p>Le pr&#233;sent amendement a pour objet de prendre en compte la situation des magistrats exer&#231;ant &#224; titre temporaire &#224; la suite de la suppression des fonctions de juge d&#8217;instance et de la fusion des tribunaux d&#8217;instance et des tribunaux de grande instance pr&#233;vue dans le cadre du projet de loi de programmation et de r&#233;forme de la justice 2018-2022 et du pr&#233;sent projet de loi organique.</p><p>La r&#233;forme de l&#8217;organisation judiciaire n&#8217;aura aucun impact sur les magistrats exer&#231;ant &#224; titre temporaire nomm&#233;s dans un tribunal de grande instance pour exercer l&#8217;ensemble des fonctions pr&#233;vues &#224; l&#8217;article 41-10 de l&#8217;ordonnance du 22 d&#233;cembre 1958.</p><p>Toutefois, elle impactera la situation des magistrats exer&#231;ant &#224; titre temporaire nomm&#233;s pour exercer les fonctions de juge d&#8217;instance au sein d&#8217;un tribunal d&#8217;instance ou d&#8217;un tribunal de grande instance.</p><p>Il n&#8217;appara&#238;t cependant pas n&#233;cessaire de renommer ces magistrats. Il convient en effet de relever que tous les magistrats exer&#231;ant &#224; titre temporaire sont nomm&#233;s dans un tribunal de grande instance, ceux exer&#231;ant dans un tribunal d&#8217;instance &#233;tant en outre nomm&#233;s dans le tribunal d&#8217;instance. Aussi poursuivront-ils l&#8217;exercice de leurs fonctions au sein d&#8217;une juridiction dans laquelle ils sont d&#233;j&#224; nomm&#233;s.</p><p>Par ailleurs, les fonctions exerc&#233;es par les magistrats exer&#231;ant &#224; titre temporaire sont list&#233;es &#224; l&#8217;article 41-10 de l&#8217;ordonnance du 22 d&#233;cembre 1958. Celles-ci &#233;voluant peu dans le cadre de la pr&#233;sente r&#233;forme, ces magistrats conna&#238;tront d&#8217;un contentieux quasiment identique &#224; celui qu&#8217;ils connaissent actuellement.</p><p>Afin que ces magistrats puissent poursuivre leur mandat et l&#8217;exercice de leurs fonctions au sein du m&#234;me lieu de justice, il convient de le pr&#233;voir sous la forme d&#8217;une disposition transitoire au sein du projet de loi organique.</p><p>En cons&#233;quence, &#224; l&#8217;instar de la disposition transitoire relative aux magistrats de carri&#232;re exer&#231;ant les fonctions de juge d&#8217;instance, l&#8217;amendement propos&#233; entend donc permettre aux magistrats exer&#231;ant &#224; titre temporaire de poursuivre leur mandat au sein du tribunal de grande instance dans lequel ils sont nomm&#233;s pour exercer les fonctions pr&#233;vues &#224; l&#8217;article 41-10 de l&#8217;ordonnance du 22 d&#233;cembre 1958.</p><p>&#160;</p>"
  },
  "representations": [
    {
      "nom": "PDF",
      "typeMime": {
        "type": "application",
        "subType": "PDF"
      },
      "statutRepresentation": {
        "verbatim": true,
        "canonique": true,
        "officielle": true,
        "transcription": false,
        "enregistrement": false
      },
      "contenu": {
        "documentURI": "/15/amendements/1350/CION_LOIS/CL43.pdf"
      }
    }
  ],
  "sort": {
    "dateSaisie": "2018-11-09T18:37:50.000+01:00",
    "sortEnSeance": "Adopté"
  },
  "dateDepot": "2018-11-06T01:00:00.000+01:00",
  "dateDistribution": "2018-11-08T01:00:00.000+01:00",
  "article99": "0",
  "loiReference": {
    "codeLoi": "zzz"
  }
}