{
  "uid": "AMANR5L15SEA717460B0269P0D1N830",
  "identifiant": {
    "legislature": "15",
    "numero": "830",
    "numRect": "0",
    "saisine": {
      "texteLegislatifRef": "PRJLANR5L15B0269",
      "numeroPartiePLF": "0",
      "organeExamen": "PO717460",
      "mentionSecondeDeliberation": "0"
    }
  },
  "numeroLong": "830",
  "etapeTexte": "1ère lecture (1ère assemblée saisie)",
  "triAmendement": "grni",
  "cardinaliteAmdtMultiples": "1",
  "etat": "Discuté",
  "signataires": {
    "auteur": {
      "typeAuteur": "Depute",
      "acteurRef": "PA642788",
      "groupePolitiqueRef": "PO730964"
    },
    "cosignatairesRefs": [
      "PA642788"
    ],
    "texteAffichable": "M.&#160;V&#233;ran"
  },
  "pointeurFragmentTexte": {
    "division": {
      "titre": "Article 11",
      "articleDesignationCourte": "ART. 11",
      "type": "ARTICLE",
      "avantAApres": "A",
      "divisionRattachee": "ARTICLE 11",
      "urlDivisionTexteVise": "/15/textes/0269.asp#D_Article_11"
    },
    "alinea": {
      "avantAApres": "Apres",
      "numero": "241"
    }
  },
  "corps": {
    "dispositif": "<p>Apr&#232;s l&#8217;alin&#233;a&#160;241, ins&#233;rer les deux alin&#233;as suivants&#160;:</p><p>&#171;&#160;14&#176; <i>bis</i> Au premier alin&#233;a de l&#8217;article L.&#160;161&#8209;15&#8209;4, les mots&#160;: &#171;&#160;des dispositions du dernier alin&#233;a&#160;&#187; sont supprim&#233;s.&#160;</p><p>&#171;&#160;14&#176; <i>ter</i> Au troisi&#232;me alin&#233;a de l&#8217;article L.&#160;168&#8209;7, les r&#233;f&#233;rences&#160;: &#171;&#160;L.&#160;613&#8209;19 &#224; L.&#160;613&#8209;19&#8209;2&#160;&#187;, sont remplac&#233;es par les r&#233;f&#233;rences &#171;&#160;L.&#160;623&#8209;1, L.&#160;623&#8209;2 et L.&#160;623&#8209;3&#160;&#187;.&#160;&#187;.</p>",
    "exposeSommaire": "<p style=\"text-align: justify;\">Amendement de coordination.</p>"
  },
  "representations": [
    {
      "nom": "PDF",
      "typeMime": {
        "type": "application",
        "subType": "PDF"
      },
      "statutRepresentation": {
        "verbatim": true,
        "canonique": true,
        "officielle": true,
        "transcription": false,
        "enregistrement": false
      },
      "contenu": {
        "documentURI": "/15/amendements/0269/AN/830.pdf"
      }
    }
  ],
  "seanceDiscussion": "RUANR5L15S2018IDS20711",
  "sort": {
    "dateSaisie": "2017-10-26T19:56:08.000+02:00",
    "sortEnSeance": "Adopté"
  },
  "dateDepot": "2017-10-20T02:00:00.000+02:00",
  "dateDistribution": "2017-10-23T02:00:00.000+02:00",
  "article99": "0",
  "loiReference": {}
}