{
  "uid": "AMANR5L15PO59046B0659P0D1N180",
  "identifiant": {
    "legislature": "15",
    "numero": "180",
    "numRect": "0",
    "saisine": {
      "texteLegislatifRef": "PRJLANR5L15B0659",
      "numeroPartiePLF": "0",
      "organeExamen": "PO59046",
      "mentionSecondeDeliberation": "0"
    }
  },
  "numeroLong": "DN180",
  "etapeTexte": "1ère lecture (1ère assemblée saisie)",
  "triAmendement": "ac",
  "cardinaliteAmdtMultiples": "1",
  "etat": "Discuté",
  "signataires": {
    "auteur": {
      "typeAuteur": "Depute",
      "acteurRef": "PA720996",
      "groupePolitiqueRef": "PO723569"
    },
    "cosignatairesRefs": [
      "PA720996"
    ],
    "texteAffichable": "M.&#160;El Guerrab"
  },
  "pointeurFragmentTexte": {
    "division": {
      "titre": "Article 15",
      "articleDesignationCourte": "ART. 15",
      "type": "ARTICLE",
      "avantAApres": "A",
      "divisionRattachee": "ARTICLE 15",
      "urlDivisionTexteVise": "/15/textes/0659.asp#D_Article_15"
    },
    "alinea": {
      "avantAApres": "A",
      "numero": "2",
      "alineaDesignation": "Alinéa 2"
    }
  },
  "corps": {
    "dispositif": "<p>R&#233;diger ainsi l&#8217;alin&#233;a 2 : &#171; 1&#176; &#201;tendre le cong&#233; de la ou du bless&#233;(e) &#224; d&#8217;autres hypoth&#232;ses que celles pr&#233;vues &#224; l&#8217;article L. 4138&#8209;3&#8209;1 du code de la d&#233;fense ; &#187;.</p>",
    "exposeSommaire": "<p>Alors que la France est l'une des arm&#233;es les plus f&#233;minis&#233;es au monde avec 15,5 % des effectifs militaires, cet amendement vise &#224; valoriser la pr&#233;sence de ces femmes dans nos arm&#233;es, reconna&#238;tre la diversit&#233; de nos effectifs et garantir l'&#233;galit&#233; femme-homme.</p>"
  },
  "representations": [
    {
      "nom": "PDF",
      "typeMime": {
        "type": "application",
        "subType": "PDF"
      },
      "statutRepresentation": {
        "verbatim": true,
        "canonique": true,
        "officielle": true,
        "transcription": false,
        "enregistrement": false
      },
      "contenu": {
        "documentURI": "/15/amendements/0659/CION_DEF/DN180.pdf"
      }
    }
  ],
  "sort": {
    "dateSaisie": "2018-03-14T11:57:29.000+01:00",
    "sortEnSeance": "Rejeté"
  },
  "dateDepot": "2018-03-09T01:00:00.000+01:00",
  "dateDistribution": "2018-03-12T01:00:00.000+01:00",
  "article99": "0",
  "loiReference": {}
}