{
  "uid": "AMANR5L15SEA717460BTC1772P0D1N58",
  "identifiant": {
    "legislature": "15",
    "numero": "58",
    "numRect": "0",
    "saisine": {
      "texteLegislatifRef": "PIONANR5L15BTC1772",
      "numeroPartiePLF": "0",
      "organeExamen": "PO717460",
      "mentionSecondeDeliberation": "0"
    }
  },
  "numeroLong": "58",
  "etapeTexte": "1ère lecture (1ère assemblée saisie)",
  "triAmendement": "iaaaaaaaaaaaaaaaaaaaaaaaaaaaaaaaaaaaaaaaaaaaaaaaaazzy",
  "cardinaliteAmdtMultiples": "1",
  "etat": "Retiré",
  "signataires": {
    "auteur": {
      "typeAuteur": "Depute",
      "acteurRef": "PA267780",
      "groupePolitiqueRef": "PO744425"
    },
    "cosignatairesRefs": [
      "PA2952",
      "PA721110",
      "PA267766",
      "PA721486",
      "PA421348",
      "PA267585",
      "PA642868",
      "PA721194",
      "PA267330",
      "PA266788",
      "PA342601",
      "PA721094",
      "PA712014",
      "PA331567",
      "PA268019",
      "PA267355",
      "PA720696",
      "PA721174",
      "PA722030",
      "PA610775",
      "PA642935",
      "PA702052",
      "PA267241",
      "PA332228",
      "PA720230",
      "PA695100",
      "PA721632",
      "PA719806",
      "PA267780"
    ],
    "texteAffichable": "Mme&#160;Firmin Le Bodo,  Mme&#160;Auconie, M.&#160;Becht, M.&#160;Benoit, M.&#160;Bournazel, M.&#160;Guy&#160;Bricout, M.&#160;Brindeau, M.&#160;Christophe, Mme&#160;de La Raudi&#232;re, M.&#160;Demilly, Mme&#160;Descamps, Mme&#160;Fr&#233;d&#233;rique&#160;Dumas, M.&#160;Dunoyer, M.&#160;Gom&#232;s, M.&#160;Meyer&#160;Habib, M.&#160;Herth, M.&#160;Lagarde, M.&#160;Ledoux, Mme&#160;Lemoine, Mme&#160;Magnier, M.&#160;Morel-&#192;-L&apos;Huissier, M.&#160;Naegelen, Mme&#160;Sage, Mme&#160;Sanquer, M.&#160;Son-Forget, M.&#160;Vercamer, M.&#160;Villiers, M.&#160;Warsmann et M.&#160;Zumkeller"
  },
  "pointeurFragmentTexte": {
    "division": {
      "titre": "Article 3",
      "articleDesignationCourte": "APRÈS ART. 3",
      "type": "ARTICLE",
      "avantAApres": "Apres",
      "divisionRattachee": "APRÈS L'ARTICLE 3, insérer l'article suivant:",
      "articleAdditionnel": "1",
      "urlDivisionTexteVise": "/15/textes/1772.asp#D_Article_3"
    }
  },
  "corps": {
    "dispositif": "<p>&#160;</p><p>I. &#8211; Dans les trois ans &#224; compter de la promulgation de la pr&#233;sente proposition de loi, le Gouvernement remet au Parlement un rapport d&#8217;&#233;valuation. Ce rapport dresse le bilan des impacts et des cons&#233;quences de cette loi sur les organismes de compl&#233;mentaire sant&#233;, sur l&#8217;acc&#232;s aux droits des usagers, en particuliers les plus pr&#233;caires, et sur les effets induits sur les contrats d&#8217;assurance&#160;en termes de qualit&#233; et de prix.</p><p>&#160;</p><p>II. &#8211; Les articles 1, 2 et 3 de la pr&#233;sente proposition de loi sont applicables jusqu&#8217;au 31 d&#233;cembre 2022.</p>",
    "exposeSommaire": "<p>Cette proposition de loi a pour ambition, sur le mod&#232;le de ce qu&#8217;avait pr&#233;vu la loi Hamon pour les contrats d&#8217;assurance habitation ou automobile, de prot&#233;ger davantage les assur&#233;s en leur donnant davantage de libert&#233; dans le choix de leur compl&#233;mentaire.</p><p>&#160;</p><p>L&#8217;objectif sous-jacent, que nous partageons, est d&#8217;accroitre la concurrence et faire baisser les prix des compl&#233;mentaires, favorisant ainsi le pouvoir d&#8217;achat de nos concitoyens, particuli&#232;rement parmi les plus modestes d&#8217;entre eux.</p><p>&#160;</p><p>Le choix d&#8217;une proposition de loi comme v&#233;hicule l&#233;gislatif au lieu d&#8217;un projet de loi a malheureusement priv&#233; la repr&#233;sentation nationale d&#8217;une &#233;tude d&#8217;impact en bonne et due forme, qui aurait permis de statuer en toute connaissance de cause sur la pertinence d&#8217;une telle &#233;volution, &#224; la fois pour les acteurs du secteur et pour la qualit&#233; de la couverture des Fran&#231;ais.</p><p>&#160;</p><p>Le pr&#233;sent amendement vise donc &#224; inscrire dans la loi une &#171;&#160;clause de revoyure&#160;&#187; et fixe un d&#233;lai d&#8217;application aux dispositions aff&#233;rentes des articles premier, deux et trois.</p><p>&#160;</p><p>Pour garantir l&#8217;effectivit&#233; du contr&#244;le parlementaire, cet amendement pr&#233;voit &#233;galement la remise au Parlement d&#8217;un rapport dans les trois ans &#224; compter de la promulgation de la loi.&#160;</p>"
  },
  "representations": [
    {
      "nom": "PDF",
      "typeMime": {
        "type": "application",
        "subType": "PDF"
      },
      "statutRepresentation": {
        "verbatim": true,
        "canonique": true,
        "officielle": true,
        "transcription": false,
        "enregistrement": false
      },
      "contenu": {
        "documentURI": "/15/amendements/1772/AN/58.pdf"
      }
    }
  ],
  "dateDepot": "2019-03-23T01:00:00.000+01:00",
  "dateDistribution": "2019-03-25T01:00:00.000+01:00",
  "article99": "0",
  "loiReference": {}
}