{
  "uid": "AMANR5L15PO419865B0846P0D1N69",
  "identifiant": {
    "legislature": "15",
    "numero": "69",
    "numRect": "0",
    "saisine": {
      "texteLegislatifRef": "PRJLANR5L15B0846",
      "numeroPartiePLF": "0",
      "organeExamen": "PO419865",
      "mentionSecondeDeliberation": "0"
    }
  },
  "numeroLong": "CD69",
  "etapeTexte": "1ère lecture (1ère assemblée saisie)",
  "triAmendement": "bk",
  "cardinaliteAmdtMultiples": "1",
  "etat": "Discuté",
  "signataires": {
    "auteur": {
      "typeAuteur": "Depute",
      "acteurRef": "PA720278",
      "groupePolitiqueRef": "PO730964"
    },
    "cosignatairesRefs": [
      "PA720278",
      "PA720944",
      "PA609520",
      "PA718962"
    ],
    "texteAffichable": "M.&#160;Orphelin,  Mme&#160;Park, Mme&#160;Pompili et M.&#160;Zulesi"
  },
  "pointeurFragmentTexte": {
    "division": {
      "titre": "Article 21",
      "articleDesignationCourte": "ART. 21",
      "type": "ARTICLE",
      "avantAApres": "A",
      "divisionRattachee": "ARTICLE 21",
      "urlDivisionTexteVise": "/15/textes/0846.asp#D_Article_21"
    },
    "alinea": {
      "avantAApres": "Apres",
      "numero": "2"
    }
  },
  "corps": {
    "dispositif": "<p style=\"text-align: justify;\">Apr&#232;s l&#8217;alin&#233;a&#160;2, ins&#233;rer l&#8217;alin&#233;a suivant&#160;:</p><p style=\"text-align: justify;\">&#171;&#160;<i>aa</i>) Au d&#233;but de cet alin&#233;a, sont ins&#233;r&#233;s les mots&#160;: &#171;&#160;Lorsqu&#8217;il est d&#233;montr&#233; que cela est techniquement possible et soutenable financi&#232;rement dans le cadre d&#8217;une r&#233;novation globale compatible avec les objectifs fran&#231;ais et&#160;europ&#233;ens d&#8217;&#233;conomie d&#8217;&#233;nergie,&#160;&#187;&#160;;&#160;&#187;.</p>",
    "exposeSommaire": "<p style=\"text-align: justify;\">Le pr&#233;sent amendement, inspir&#233; par une association de protection de l&#8217;environnement, vise &#224; adapter la mise en place de l&#8217;IFC en fonction des b&#226;timents et &#224; &#233;tablir une analyse de l&#8217;opportunit&#233; technique et &#233;conomique de l&#8217;individualisation des frais.</p><p style=\"text-align: justify;\">En effet, l&#8217;individualisation des frais n&#8217;est pas forc&#233;ment adapt&#233;e &#224; tous les b&#226;timents, en particulier les b&#226;timents les moins efficaces pour lesquels des travaux de r&#233;novation de l&#8217;enveloppe et des syst&#232;mes sont prioritaires.</p><p style=\"text-align: justify;\">L&#8217;individualisation des frais de chauffage/refroidissement/eau chaude rel&#232;ve d&#8217;une approche de l&#8217;efficacit&#233; &#233;nerg&#233;tique &#224; l&#8217;&#233;chelle de l&#8217;unit&#233; de b&#226;timent, bas&#233;e sur l&#8217;optimisation des &#233;quipements. Cette approche encourage les attitudes individualistes, au d&#233;triment de la coop&#233;ration n&#233;cessaire &#224; la r&#233;alisation d&#8217;un projet de r&#233;novation globale &#224; l&#8217;&#233;chelle du b&#226;timent, incluant l&#8217;enveloppe et l&#8217;ensemble des syst&#232;mes.</p><p style=\"text-align: justify;\">Pour respecter les engagements renforc&#233;s de la France en mati&#232;re de lutte contre le changement climatique (objectif d&#8217;atteinte de la neutralit&#233; carbone dans le plan Climat de 2017), c&#8217;est cette approche globale de la r&#233;novation qui doit &#234;tre privil&#233;gi&#233;e pour une efficacit&#233; optimale sur le plan &#233;nerg&#233;tique et &#233;conomique. C&#8217;est pourquoi l&#8217;analyse de l&#8217;opportunit&#233; technique et &#233;conomique de l&#8217;individualisation des frais doit s&#8217;inscrire dans la perspective plus large et complexe d&#8217;une r&#233;novation globale, afin de privil&#233;gier l&#8217;approche la plus rentable et g&#233;n&#233;ratrice d&#8217;&#233;conomies d&#8217;&#233;nergies sur le long terme, sans biais technologique ou m&#233;thodologique.&#160;</p>"
  },
  "representations": [
    {
      "nom": "PDF",
      "typeMime": {
        "type": "application",
        "subType": "PDF"
      },
      "statutRepresentation": {
        "verbatim": true,
        "canonique": true,
        "officielle": true,
        "transcription": false,
        "enregistrement": false
      },
      "contenu": {
        "documentURI": "/15/amendements/0846/CION-DVP/CD69.pdf"
      }
    }
  ],
  "sort": {
    "dateSaisie": "2018-04-17T19:57:34.000+02:00",
    "sortEnSeance": "Rejeté"
  },
  "dateDepot": "2018-04-13T02:00:00.000+02:00",
  "dateDistribution": "2018-04-14T02:00:00.000+02:00",
  "article99": "0",
  "loiReference": {}
}