{
  "uid": "AMANR5L15SEA717460BTC0446P0D1N71",
  "identifiant": {
    "legislature": "15",
    "numero": "71",
    "numRect": "0",
    "saisine": {
      "texteLegislatifRef": "PRJLANR5L15BTC0446",
      "numeroPartiePLF": "0",
      "organeExamen": "PO717460",
      "mentionSecondeDeliberation": "0"
    }
  },
  "numeroLong": "71",
  "etapeTexte": "1ère lecture (1ère assemblée saisie)",
  "triAmendement": "ryi",
  "cardinaliteAmdtMultiples": "1",
  "etat": "Discuté",
  "signataires": {
    "auteur": {
      "typeAuteur": "Depute",
      "acteurRef": "PA689",
      "groupePolitiqueRef": "PO730940"
    },
    "cosignatairesRefs": [
      "PA722110",
      "PA718926",
      "PA722202",
      "PA718720",
      "PA721896",
      "PA720692",
      "PA335612",
      "PA267306",
      "PA441",
      "PA721270",
      "PA720546",
      "PA689"
    ],
    "texteAffichable": "Mme&#160;Buffet,  Mme&#160;Bello, Mme&#160;Faucillon, M.&#160;Bruneel, M.&#160;Chassaigne, M.&#160;Dharr&#233;ville, M.&#160;Dufr&#232;gne, M.&#160;Jumel, M.&#160;Lecoq, M.&#160;Peu, M.&#160;Fabien&#160;Roussel et M.&#160;Wulfranc"
  },
  "pointeurFragmentTexte": {
    "division": {
      "titre": "Article 4",
      "articleDesignationCourte": "ART. 4",
      "type": "ARTICLE",
      "avantAApres": "A",
      "divisionRattachee": "ARTICLE 4",
      "urlDivisionTexteVise": "/15/textes/0446.asp#D_Article_4"
    },
    "alinea": {
      "avantAApres": "A",
      "numero": "13",
      "alineaDesignation": "Alinéa 13"
    }
  },
  "corps": {
    "dispositif": "<p style=\"text-align: justify;\">Supprimer l&#8217;alin&#233;a 13.</p>",
    "exposeSommaire": "<p style=\"text-align: justify;\">Les doctorantes et doctorants subiront avec cette mesure un impact financier n&#233;gatif important. N&#8217;&#233;tant pas soumis pour leur plus grande part au paiement de l&#8217;actuelle cotisation sociale &#233;tudiante de 217&#160;euros, ils ne sont pas concern&#233;s par la suppression de cette cotisation. En effet, 73&#160;% des doctorantes et doctorants sont couverts par le r&#233;gime g&#233;n&#233;ral, &#233;tant salari&#233;s dans le m&#234;me temps.</p><p style=\"text-align: justify;\">Le projet de loi aurait pour cons&#233;quence de faire passer l&#8217;ensemble des frais obligatoires li&#233;s &#224; leur inscription annuelle en doctorat de 396,10&#160;euros &#224; 525&#160;euros (en tenant compte de la suppression des frais de m&#233;decine pr&#233;ventive de 5,10&#160;euros et d&#8217;une baisse de 16&#160;euros des frais d&#8217;inscription correspondant au fonds de solidarit&#233; et de d&#233;veloppement des initiatives &#233;tudiantes), soit une augmentation de 33&#160;%. La pr&#233;carit&#233; des doctorants et doctorantes &#233;tant d&#233;j&#224; tr&#232;s pr&#233;occupante, cette disposition ne fera que renforcer leurs difficult&#233;s.</p>"
  },
  "representations": [
    {
      "nom": "PDF",
      "typeMime": {
        "type": "application",
        "subType": "PDF"
      },
      "statutRepresentation": {
        "verbatim": true,
        "canonique": true,
        "officielle": true,
        "transcription": false,
        "enregistrement": false
      },
      "contenu": {
        "documentURI": "/15/amendements/0446/AN/71.pdf"
      }
    }
  ],
  "seanceDiscussion": "RUANR5L15S2018IDS20836",
  "sort": {
    "dateSaisie": "2017-12-14T00:59:48.000+01:00",
    "sortEnSeance": "Tombé"
  },
  "dateDepot": "2017-12-08T01:00:00.000+01:00",
  "dateDistribution": "2017-12-11T01:00:00.000+01:00",
  "article99": "0",
  "loiReference": {}
}