{
  "uid": "AMANR5L15PO59051B2078P0D1N9",
  "identifiant": {
    "legislature": "15",
    "numero": "9",
    "numRect": "0",
    "saisine": {
      "texteLegislatifRef": "PIONANR5L15B2078",
      "numeroPartiePLF": "0",
      "organeExamen": "PO59051",
      "mentionSecondeDeliberation": "0"
    }
  },
  "numeroLong": "CL9",
  "etapeTexte": "1ère lecture (2ème assemblée saisie)",
  "triAmendement": "kaaaaaaaaaaaaaaaaaaaaaaaaaaaaaaaaaaaaaaaaaaaaaaaaais",
  "cardinaliteAmdtMultiples": "1",
  "etat": "Discuté",
  "signataires": {
    "auteur": {
      "typeAuteur": "Depute",
      "acteurRef": "PA721932",
      "groupePolitiqueRef": "PO723569"
    },
    "cosignatairesRefs": [
      "PA721932"
    ],
    "texteAffichable": "Mme&#160;Lorho"
  },
  "pointeurFragmentTexte": {
    "division": {
      "titre": "Article 5 bis A",
      "articleDesignationCourte": "ART. 5 BIS A",
      "type": "ARTICLE",
      "avantAApres": "A",
      "divisionRattachee": "ARTICLE 5 BIS A",
      "urlDivisionTexteVise": "/15/textes/2078.asp#D_Article_5_bis_A"
    },
    "alinea": {
      "numero": "2"
    }
  },
  "corps": {
    "dispositif": "<p style=\"text-align: justify;\">Supprimer les deux derni&#232;res phrases de l&#8217;alin&#233;a&#160;2.</p>",
    "exposeSommaire": "<p>Ce dispositif met en place une pr&#233;somption de culpabilit&#233; &#224; l'encontre du candidat dont les affiches ont &#233;t&#233; plac&#233;es sur des emplacements ill&#233;gaux. Cela risque d'entra&#238;ner de nombreuses d&#233;rives. Les affiches sont, en effet, parfois appos&#233;es par des militants sans que les candidats ne puissent avoir aucun contr&#244;le sur ces actions. En droit il est quasiment impossible d'apporter la preuve d'un fait n&#233;gatif. On ne peut en effet d&#233;montrer quelque chose que l'on a pas fait. De plus cela risque de se transformer en strat&#233;gie &#233;lectorale consistant, pour les militants, &#224; apposer des affiches de leur opposant sur des emplacements interdits afin de lui porter un pr&#233;judice financier, sachant qu'il sera presque automatiquement tenu pour responsable.</p><p style=\"text-align: justify;\">Pour ces raisons il me semble pr&#233;f&#233;rable de ne pas conserver ce dispositif.</p>"
  },
  "representations": [
    {
      "nom": "PDF",
      "typeMime": {
        "type": "application",
        "subType": "PDF"
      },
      "statutRepresentation": {
        "verbatim": true,
        "canonique": true,
        "officielle": true,
        "transcription": false,
        "enregistrement": false
      },
      "contenu": {
        "documentURI": "/15/amendements/2078/CION_LOIS/CL9.pdf"
      }
    }
  ],
  "sort": {
    "dateSaisie": "2019-09-09T18:04:31.000+02:00",
    "sortEnSeance": "Non soutenu"
  },
  "dateDepot": "2019-09-05T02:00:00.000+02:00",
  "dateDistribution": "2019-09-06T02:00:00.000+02:00",
  "article99": "0",
  "loiReference": {
    "codeLoi": "3.2",
    "divisionCodeLoi": "id"
  }
}