{
  "uid": "AMANR5L15PO419865B2274P0D1N1359",
  "identifiant": {
    "legislature": "15",
    "numero": "1359",
    "numRect": "0",
    "saisine": {
      "texteLegislatifRef": "PRJLANR5L15B2274",
      "numeroPartiePLF": "0",
      "organeExamen": "PO419865",
      "mentionSecondeDeliberation": "0"
    }
  },
  "numeroLong": "CD1359",
  "etapeTexte": "1ère lecture (2ème assemblée saisie)",
  "triAmendement": "ejaaaaaaaaaaaaaaaaaaaaaaaaaaaaaaaaaaaaaaaaaaaaaaaakkti",
  "cardinaliteAmdtMultiples": "1",
  "etat": "En traitement",
  "signataires": {
    "auteur": {
      "typeAuteur": "Depute",
      "acteurRef": "PA720764",
      "groupePolitiqueRef": "PO730970"
    },
    "cosignatairesRefs": [
      "PA720598",
      "PA721234",
      "PA719044",
      "PA720764",
      "PA721418",
      "PA718978",
      "PA721608",
      "PA720746",
      "PA721984",
      "PA721734",
      "PA719942",
      "PA720976",
      "PA719504",
      "PA720704",
      "PA719266",
      "PA721742",
      "PA720178",
      "PA722284",
      "PA720162",
      "PA722162",
      "PA1276",
      "PA721976",
      "PA720334",
      "PA720728",
      "PA721836",
      "PA719558",
      "PA721996",
      "PA722374",
      "PA721530",
      "PA720968",
      "PA721924",
      "PA720720",
      "PA719640",
      "PA719918",
      "PA720924",
      "PA719488",
      "PA720326",
      "PA719874",
      "PA717151",
      "PA720092",
      "PA719210",
      "PA720256",
      "PA720772",
      "PA720002",
      "PA720652",
      "PA721182"
    ],
    "texteAffichable": "Mme&#160;Lasserre,  M.&#160;Pahun, Mme&#160;Essayan, M.&#160;Loiseau, Mme&#160;Luquet, M.&#160;Millienne, M.&#160;Balanant, Mme&#160;Bannier, M.&#160;Barrot, M.&#160;Baudu, Mme&#160;Benin, M.&#160;Berta, M.&#160;Bolo, M.&#160;Bourlanges, M.&#160;Bru, M.&#160;Cubertafon, Mme&#160;de Sarnez, Mme&#160;de Vaucouleurs, Mme&#160;Deprez-Audebert, M.&#160;Duverg&#233;, Mme&#160;El Ha&#239;ry, Mme&#160;Elimas, M.&#160;Fanget, Mme&#160;Florennes, M.&#160;Fuchs, M.&#160;Garcia, M.&#160;Hammouche, M.&#160;Isaac-Sibille, Mme&#160;Jacquier-Laforge, M.&#160;Joncour, M.&#160;Lagleize, M.&#160;Lain&#233;, M.&#160;Laqhila, M.&#160;Latombe, M.&#160;Mathiasin, M.&#160;Mattei, Mme&#160;Mette, M.&#160;Michel-Kleisbauer, M.&#160;Mignola, M.&#160;Fr&#233;d&#233;ric&#160;Petit, Mme&#160;Maud&#160;Petit, Mme&#160;Poueyto, M.&#160;Ramos, M.&#160;Turquois, Mme&#160;Vichnievsky et M.&#160;Waserman"
  },
  "pointeurFragmentTexte": {
    "division": {
      "titre": "Article 8",
      "articleDesignationCourte": "ART. 8",
      "type": "ARTICLE",
      "avantAApres": "A",
      "divisionRattachee": "ARTICLE 8",
      "urlDivisionTexteVise": "/15/textes/2274.asp#D_Article_8"
    },
    "alinea": {
      "numero": "26"
    }
  },
  "corps": {
    "dispositif": "<p style=\"text-align: justify;\">&#192; l&#8217;alin&#233;a 26, &#160;apr&#232;s les mots &#171; et &#233;lectroniques,&#160;&#187;&#160;ins&#233;rer les mots &#171; y compris les engins de d&#233;placement personnel motoris&#233;s,&#160;&#187;.</p>",
    "exposeSommaire": "<p style=\"text-align: justify;\">Le pr&#233;sent amendement vise &#224; inclure les engins de d&#233;placement personnel motoris&#233;s tels que les trottinettes &#233;lectriques dans le champ de la REP &#233;quipements &#233;lectriques et &#233;lectroniques.</p><p style=\"text-align: justify;\">L&#8217;utilisation croissante des engins de d&#233;placement rend n&#233;cessaire une meilleure gestion de leur fin de vie. En effet, les utilisateurs de ces engins doivent &#234;tre en mesure de s'en d&#233;faire dans le cadre d'une fili&#232;re sp&#233;cifique afin de ne pas perturber le tri et d&#8217;&#233;viter leur d&#233;p&#244;t sauvage dans l'espace public.</p><p style=\"text-align: justify;\">Int&#233;grer ces engins &#224; la REP des &#233;quipements &#233;lectriques et &#233;lectroniques permettra &#233;galement de traiter les substances dangereuses qu'ils contiennent et valoriser certains mat&#233;riaux.</p><p>&#160;</p>",
    "cartoucheDelaiDepotDepasse": "Sous réserve de son traitement par les services de l'Assemblée nationale et de sa recevabilité"
  },
  "representations": [
    {
      "nom": "PDF",
      "typeMime": {
        "type": "application",
        "subType": "PDF"
      },
      "statutRepresentation": {
        "verbatim": true,
        "canonique": true,
        "officielle": true,
        "transcription": false,
        "enregistrement": false
      },
      "contenu": {
        "documentURI": "/15/amendements/2274/CION-DVP/CD1359.pdf"
      }
    }
  ],
  "dateDepot": "2019-11-20T01:00:00.000+01:00",
  "article99": "0",
  "loiReference": {}
}