{
  "uid": "AMANR5L15SEA717460BTC0575P0D1N933",
  "identifiant": {
    "legislature": "15",
    "numero": "933",
    "numRect": "0",
    "saisine": {
      "texteLegislatifRef": "PRJLANR5L15BTC0575",
      "numeroPartiePLF": "0",
      "organeExamen": "PO717460",
      "mentionSecondeDeliberation": "0"
    }
  },
  "numeroLong": "933",
  "etapeTexte": "1ère lecture (1ère assemblée saisie)",
  "triAmendement": "abs",
  "cardinaliteAmdtMultiples": "1",
  "etat": "Discuté",
  "signataires": {
    "auteur": {
      "typeAuteur": "Depute",
      "acteurRef": "PA267440",
      "groupePolitiqueRef": "PO730934"
    },
    "cosignatairesRefs": [
      "PA330684",
      "PA720100",
      "PA720684",
      "PA721968",
      "PA2792",
      "PA1327",
      "PA712015",
      "PA709315",
      "PA1874",
      "PA642847",
      "PA607090",
      "PA721410",
      "PA718838",
      "PA267440"
    ],
    "texteAffichable": "M.&#160;Diard,  M.&#160;Dive, M.&#160;Pradi&#233;, M.&#160;Brun, M.&#160;Bazin, M.&#160;Jean-Pierre&#160;Vigier, M.&#160;Pierre-Henri&#160;Dumont, M.&#160;Le Fur, M.&#160;Forissier, Mme&#160;Val&#233;rie&#160;Boyer, M.&#160;Vialay, M.&#160;Viala, Mme&#160;Bonnivard et M.&#160;Taugourdeau"
  },
  "pointeurFragmentTexte": {
    "division": {
      "titre": "Article 28",
      "articleDesignationCourte": "ART. 28",
      "type": "ARTICLE",
      "avantAApres": "A",
      "divisionRattachee": "ARTICLE 28",
      "urlDivisionTexteVise": "/15/textes/0575.asp#D_Article_28"
    }
  },
  "corps": {
    "dispositif": "<p>Supprimer cet article.</p>",
    "exposeSommaire": "<p style=\"text-align: justify;\">Un des principaux objectifs&#160;de ce projet de loi est de simplifier le fonctionnement de l&#8217;administration, de faciliter ses relations avec ses usagers et d&#8217;am&#233;liorer son efficacit&#233;. Or, les cons&#233;quences de cet articles seront exactement l&#8217;inverse de ce qui est attendu.</p><p style=\"text-align: justify;\">En effet, la fusion des universit&#233;s est contraire au principe de leur ind&#233;pendance et de leur libre administration, en ce qu&#8217;elle concentre le pouvoir d&#233;cisionnel et les moyens administratifs en un seul point. Cette vision jacobine de l&#8217;organisation universitaire conduit en une perte du lien entre les unit&#233;s de formation et de recherche et leurs universit&#233;s de rattachement. L&#8217;administration, complexifi&#233;e, rend plus difficile l&#8217;accomplissement d&#8217;enseignement et de recherche de leurs &#233;tablissements avec des d&#233;lais toujours plus longs, des r&#232;gles qui se cumulent et ralentissent le travail des enseignants-chercheurs.&#160;</p><p style=\"text-align: justify;\">La taille des universit&#233;s est loin d&#8217;&#234;tre un gage de r&#233;ussite, d&#8217;ailleurs, celles qui b&#233;n&#233;ficient de tels rapprochements, regroupements ou fusions ont tendance &#224; confondre l&#8217;adjectif &#171;&#160;grande&#160;&#187; avec &#171;&#160;grosse&#160;&#187;. Pass&#233;e la communication sur le nombre d&#8217;&#233;tudiants inscrits dans l&#8217;universit&#233;, il est toujours plus difficile, dans une grosse structure, d&#8217;adapter les enseignements et la recherche aux besoins de la soci&#233;t&#233; et de la science, ce qui se ressent par la suite dans les r&#233;sultats des &#233;tudiants et leur insertion dans le monde du travail.&#160;</p><p style=\"text-align: justify;\">C&#8217;est pourquoi cet amendement demande la suppression de cet article, pour ne pas effectuer une exp&#233;rimentation, car l&#8217;exp&#233;rimentation suppose une incertitude sur ses r&#233;sultats. Or, ici, l&#8217;&#233;chec est d&#8217;avance certain.&#160;</p>"
  },
  "representations": [
    {
      "nom": "PDF",
      "typeMime": {
        "type": "application",
        "subType": "PDF"
      },
      "statutRepresentation": {
        "verbatim": true,
        "canonique": true,
        "officielle": true,
        "transcription": false,
        "enregistrement": false
      },
      "contenu": {
        "documentURI": "/15/amendements/0575/AN/933.pdf"
      }
    }
  ],
  "seanceDiscussion": "RUANR5L15S2018IDS20867",
  "sort": {
    "dateSaisie": "2018-01-25T12:37:39.000+01:00",
    "sortEnSeance": "Retiré"
  },
  "dateDepot": "2018-01-19T01:00:00.000+01:00",
  "dateDistribution": "2018-01-22T01:00:00.000+01:00",
  "article99": "0",
  "loiReference": {}
}