{
  "uid": "AMANR5L15PO419610B0627P0D1N2090",
  "identifiant": {
    "legislature": "15",
    "numero": "2090",
    "numRect": "0",
    "saisine": {
      "texteLegislatifRef": "PRJLANR5L15B0627",
      "numeroPartiePLF": "0",
      "organeExamen": "PO419610",
      "mentionSecondeDeliberation": "0"
    }
  },
  "numeroLong": "CE2090",
  "etapeTexte": "1ère lecture (1ère assemblée saisie)",
  "triAmendement": "jzzs",
  "cardinaliteAmdtMultiples": "1",
  "etat": "Discuté",
  "signataires": {
    "auteur": {
      "typeAuteur": "Gouvernement"
    },
    "texteAffichable": "le Gouvernement"
  },
  "pointeurFragmentTexte": {
    "division": {
      "titre": "Article 10",
      "articleDesignationCourte": "ART. 10",
      "type": "ARTICLE",
      "avantAApres": "A",
      "divisionRattachee": "ARTICLE 10",
      "urlDivisionTexteVise": "/15/textes/0627.asp#D_Article_10"
    },
    "alinea": {
      "numero": "9"
    }
  },
  "corps": {
    "dispositif": "<p style=\"text-align: justify;\">&#192; l&#8217;alin&#233;a&#160;9, substituer aux mots&#160;:</p><p style=\"text-align: justify;\">&#171;&#160;chaque ordonnance&#160;&#187;,</p><p style=\"text-align: justify;\">les mots&#160;:</p><p style=\"text-align: justify;\">&#171;&#160;l&#8217;ordonnance&#160;&#187;.</p>",
    "exposeSommaire": "<p style=\"text-align: justify;\">Le pr&#233;sent amendement propose deux modifications au 5&#176; de l&#8217;article&#160;10.</p><p style=\"text-align: justify;\">La premi&#232;re modification est r&#233;dactionnelle dans une optique de meilleure lisibilit&#233;.</p><p style=\"text-align: justify;\">La seconde vise &#224; compl&#233;ter l&#8217;habilitation du gouvernement afin qu&#8217;il puisse simplifier les modalit&#233;s de d&#233;termination des sanctions pr&#233;vues au III de l&#8217;article L.&#160;442&#8209;6 du code de commerce. Une telle simplification est n&#233;cessaire notamment s&#8217;agissant de la r&#232;gle, qui soul&#232;ve des difficult&#233;s pratiques de mise en &#339;uvre, selon laquelle le montant de ces sanctions, lorsqu&#8217;elles ne sont pas forfaitaires, doit &#234;tre calcul&#233; sur la base des sommes ind&#251;ment per&#231;ues ou proportionn&#233; aux avantages tir&#233;s du manquement.</p>"
  },
  "representations": [
    {
      "nom": "PDF",
      "typeMime": {
        "type": "application",
        "subType": "PDF"
      },
      "statutRepresentation": {
        "verbatim": true,
        "canonique": true,
        "officielle": true,
        "transcription": false,
        "enregistrement": false
      },
      "contenu": {
        "documentURI": "/15/amendements/0627/CION-ECO/CE2090.pdf"
      }
    }
  ],
  "sort": {
    "dateSaisie": "2018-04-18T21:42:37.000+02:00",
    "sortEnSeance": "Adopté"
  },
  "dateDepot": "2018-04-17T02:00:00.000+02:00",
  "dateDistribution": "2018-04-17T02:00:00.000+02:00",
  "article99": "0",
  "loiReference": {}
}