{
  "uid": "AMANR5L15SEA717460BTC1019P0D1N986",
  "identifiant": {
    "legislature": "15",
    "numero": "986",
    "numRect": "0",
    "saisine": {
      "texteLegislatifRef": "PRJLANR5L15BTC1019",
      "numeroPartiePLF": "0",
      "organeExamen": "PO717460",
      "mentionSecondeDeliberation": "0"
    }
  },
  "numeroLong": "986",
  "etapeTexte": "1ère lecture (1ère assemblée saisie)",
  "triAmendement": "nc",
  "cardinaliteAmdtMultiples": "1",
  "etat": "Discuté",
  "signataires": {
    "auteur": {
      "typeAuteur": "Depute",
      "acteurRef": "PA346054",
      "groupePolitiqueRef": "PO730934"
    },
    "cosignatairesRefs": [
      "PA1874",
      "PA346054",
      "PA718784",
      "PA721286",
      "PA608016",
      "PA721968",
      "PA718838",
      "PA267204"
    ],
    "texteAffichable": "M.&#160;Emmanuel&#160;Maquet,  M.&#160;Brun, M.&#160;Le Fur, M.&#160;Ramadier, Mme&#160;Louwagie, M.&#160;Pauget, M.&#160;Vialay et M.&#160;Sermier"
  },
  "pointeurFragmentTexte": {
    "division": {
      "titre": "Article 4",
      "articleDesignationCourte": "ART. 4",
      "type": "ARTICLE",
      "avantAApres": "A",
      "divisionRattachee": "ARTICLE 4",
      "urlDivisionTexteVise": "/15/textes/1019.asp#D_Article_4"
    },
    "alinea": {
      "avantAApres": "Apres",
      "numero": "37"
    }
  },
  "corps": {
    "dispositif": "<p style=\"text-align: justify;\">Apr&#232;s l&#8217;alin&#233;a&#160;37, ins&#233;rer l&#8217;alin&#233;a suivant&#160;:</p><p style=\"text-align: justify;\">&#171;&#160;4&#176; Par l&#8217;acquisition de tout ou partie d&#8217;une certification de branche ou interbranche.&#160;&#187;</p>",
    "exposeSommaire": "<p style=\"text-align: justify;\">Les branches professionnelles sont responsables de l&#8217;efficience de la formation professionnelle. Pour autant, les certificats de qualification professionnelle (CQP) ayant seulement fait l&#8217;objet d&#8217;une transmission &#224; la commission &#224; la commission nationale de la certification professionnelle (CNCP), ne peuvent ouvrir droit &#224; formation pour une branche connexe.</p><p style=\"text-align: justify;\">Or, ces CQP permettent de faire reconna&#238;tre les comp&#233;tences et savoir-faire n&#233;cessaires &#224; l&#8217;exercice d&#8217;un m&#233;tier. L&#8217;enregistrement au R&#233;pertoire national des certifications professionnelles (RNCP) ne modifie en rien la qualit&#233; de la certification.</p><p style=\"text-align: justify;\">Aussi, les CQP de branche ou interbranche doivent entrer dans la d&#233;finition des certifications professionnelles, sans faire obligation d&#8217;un enregistrement au RNCP. Il est donc demand&#233; d&#8217;ajouter dans la d&#233;finition des certifications professionnelles fix&#233;e par le projet de loi, une r&#233;f&#233;rence &#224; l&#8217;acquisition de tout ou partie d&#8217;une certification de branche ou interbranche.</p>"
  },
  "representations": [
    {
      "nom": "PDF",
      "typeMime": {
        "type": "application",
        "subType": "PDF"
      },
      "statutRepresentation": {
        "verbatim": true,
        "canonique": true,
        "officielle": true,
        "transcription": false,
        "enregistrement": false
      },
      "contenu": {
        "documentURI": "/15/amendements/1019/AN/986.pdf"
      }
    }
  ],
  "seanceDiscussion": "RUANR5L15S2018IDS21100",
  "sort": {
    "dateSaisie": "2018-06-14T00:15:24.000+02:00",
    "sortEnSeance": "Rejeté"
  },
  "dateDepot": "2018-06-07T02:00:00.000+02:00",
  "dateDistribution": "2018-06-09T02:00:00.000+02:00",
  "article99": "0",
  "loiReference": {}
}