{
  "uid": "AMANR5L15SEA717460B2296P0D1N1127",
  "identifiant": {
    "legislature": "15",
    "numero": "1127",
    "numRect": "0",
    "saisine": {
      "texteLegislatifRef": "PRJLANR5L15B2296",
      "numeroPartiePLF": "0",
      "organeExamen": "PO717460",
      "mentionSecondeDeliberation": "1"
    }
  },
  "numeroLong": "1127",
  "etapeTexte": "1ère lecture (1ère assemblée saisie)",
  "triAmendement": "fiaaaaaaaaaaaaaaaaaaaaaaaaaaaaaaaaaaaaaaaaaaaaaaaaco",
  "cardinaliteAmdtMultiples": "1",
  "etat": "Discuté",
  "signataires": {
    "auteur": {
      "typeAuteur": "Depute",
      "acteurRef": "PA721474",
      "groupePolitiqueRef": "PO730934"
    },
    "cosignatairesRefs": [
      "PA340853",
      "PA2155",
      "PA767",
      "PA721474",
      "PA346218",
      "PA267794",
      "PA266793"
    ],
    "texteAffichable": "M.&#160;Viry,  M.&#160;Leclerc, M.&#160;Bony, Mme&#160;Tabarot, M.&#160;Masson, M.&#160;Cattin et M.&#160;Menuel"
  },
  "pointeurFragmentTexte": {
    "division": {
      "titre": "Article 34",
      "articleDesignationCourte": "ART. 34",
      "type": "ARTICLE",
      "avantAApres": "A",
      "divisionRattachee": "ARTICLE 34",
      "urlDivisionTexteVise": "/15/textes/2296.asp#D_Article_34"
    },
    "alinea": {
      "numero": "4"
    }
  },
  "corps": {
    "dispositif": "<p style=\"text-align: justify;\">&#192; la premi&#232;re phrase de l&#8217;alin&#233;a&#160;4, apr&#232;s la premi&#232;re occurrence du mot&#160;: </p><p style=\"text-align: justify;\">&#171;&#160;m&#233;dicament&#160;&#187;, </p><p style=\"text-align: justify;\">ins&#233;rer les mots&#160;:</p><p style=\"text-align: justify;\">&#171;&#160;&#224; l&#8217;exception des m&#233;dicaments d&#233;riv&#233;s du plasma&#160;&#187;.</p>",
    "exposeSommaire": "<p style=\"text-align: justify;\">La France conna&#238;t depuis plusieurs ann&#233;es des difficult&#233;s d&#8217;approvisionnement r&#233;currentes en m&#233;dicaments d&#233;riv&#233;s du plasma. Ces difficult&#233;s sont notamment dues &#224; un accroissement consid&#233;rable, &#224; l&#8217;&#233;chelle mondiale, de la demande en m&#233;dicaments d&#233;riv&#233;s du plasma, et &#224; la raret&#233; de la mati&#232;re premi&#232;re qui les compose, le plasma sanguin, qui ne peut &#234;tre synth&#233;tis&#233; dans un laboratoire.</p><p style=\"text-align: justify;\">Les entreprises pharmaceutiques produisant ces m&#233;dicaments font d&#8217;ores-et-d&#233;j&#224; l&#8217;objet d&#8217;une vigilance sp&#233;cifique s&#8217;agissant de la Constitution de stocks de s&#233;curit&#233;, en lien avec l&#8217;ANSM.</p><p style=\"text-align: justify;\">Au regard de ce contexte international particulier marqu&#233; par d&#8217;importantes tensions d&#8217;approvisionnement, ces entreprises peuvent se trouver dans l&#8217;incapacit&#233; mat&#233;rielle de constituer des stocks de s&#233;curit&#233; correspondant &#224; quatre mois de couverture des besoins en m&#233;dicaments d&#233;riv&#233;s du plasma.</p><p style=\"text-align: justify;\">Afin de tenir compte de cette sp&#233;cificit&#233;, il est propos&#233; de les exclure du p&#233;rim&#232;tre de cette obligation.</p>"
  },
  "representations": [
    {
      "nom": "PDF",
      "typeMime": {
        "type": "application",
        "subType": "PDF"
      },
      "statutRepresentation": {
        "verbatim": true,
        "canonique": true,
        "officielle": true,
        "transcription": false,
        "enregistrement": false
      },
      "contenu": {
        "documentURI": "/15/amendements/2296/AN/1127.pdf"
      }
    }
  ],
  "seanceDiscussion": "RUANR5L15S2020IDS21880",
  "sort": {
    "dateSaisie": "2019-10-25T10:03:23.000+02:00",
    "sortEnSeance": "Non soutenu"
  },
  "dateDepot": "2019-10-18T02:00:00.000+02:00",
  "dateDistribution": "2019-10-22T02:00:00.000+02:00",
  "article99": "0",
  "loiReference": {}
}