{
  "uid": "AMANR5L15PO757134B1088P0D1N1725",
  "identifiant": {
    "legislature": "15",
    "numero": "1725",
    "numRect": "0",
    "saisine": {
      "texteLegislatifRef": "PRJLANR5L15B1088",
      "numeroPartiePLF": "0",
      "organeExamen": "PO757134",
      "mentionSecondeDeliberation": "0"
    }
  },
  "numeroLong": "1725",
  "etapeTexte": "1ère lecture (1ère assemblée saisie)",
  "triAmendement": "dcsaaaaaaaaaaaaaaaaaaaaaaaaaaaaaaaaaaaaaaaaaaaaaaazzzzzzzzzzzzzzzzs",
  "cardinaliteAmdtMultiples": "1",
  "etat": "Discuté",
  "signataires": {
    "auteur": {
      "typeAuteur": "Depute",
      "acteurRef": "PA267336",
      "groupePolitiqueRef": "PO730964"
    },
    "cosignatairesRefs": [
      "PA267336",
      "PA721670"
    ],
    "texteAffichable": "M.&#160;Giraud et Mme&#160;de Montchalin"
  },
  "pointeurFragmentTexte": {
    "division": {
      "titre": "Article 21",
      "articleDesignationCourte": "ART. 21",
      "type": "ARTICLE",
      "avantAApres": "A",
      "divisionRattachee": "ARTICLE 21",
      "urlDivisionTexteVise": "/15/textes/1088.asp#D_Article_21"
    },
    "alinea": {
      "avantAApres": "Apres",
      "numero": "35"
    }
  },
  "corps": {
    "dispositif": "<p style=\"text-align: justify;\">I.&#160;-&#160;Apr&#232;s l&#8217;alin&#233;a&#160;35, ins&#233;rer les deux alin&#233;as suivants&#160;:</p><p style=\"text-align: justify;\">&#171;&#160;3&#176;&#160;Le m&#234;me I est compl&#233;t&#233; par un alin&#233;a ainsi r&#233;dig&#233;&#160;:</p><p style=\"text-align: justify;\">&#171;&#160;3&#176; Le transfert partiel ou total d&#8217;un bon ou contrat mentionn&#233; au 1&#176; du pr&#233;sent I vers une autre entreprise d&#8217;assurance vis&#233;e &#224; l&#8217;article L.&#160;134&#8209;1 du code des assurances n&#8217;entra&#238;ne pas les cons&#233;quences fiscales d&#8217;un d&#233;nouement, &#224; la condition que le contrat souscrit aupr&#232;s de cette derni&#232;re entreprise soit exprim&#233; &#224; hauteur de 30&#160;% au moins en unit&#233;s de comptes vis&#233;es &#224; l&#8217;article L.&#160;131&#8209;1 du code des assurances, en parts de provision de diversification vis&#233;es &#224; l&#8217;article L.&#160;134&#8209;1 du m&#234;me code ou en titres de soci&#233;t&#233;s vis&#233;es au 2 de l&#8217;article L.&#160;221&#8209;32&#8209;2 du code mon&#233;taire et financier.&#160;&#187;</p><p style=\"text-align: justify;\">II.&#160;&#8211;&#160;La perte de recettes pour l&#8217;&#201;tat r&#233;sultant du I est compens&#233;e &#224; due concurrence par la cr&#233;ation d&#8217;une taxe additionnelle aux droits mentionn&#233;s aux articles 575 et 575 A du code g&#233;n&#233;ral des imp&#244;ts.&#160;&#187;.</p>",
    "exposeSommaire": "<p style=\"text-align: justify;\">Le pr&#233;sent amendement vise &#224; permettre la transf&#233;rabilit&#233; d&#8217;un contrat d&#8217;assurance-vie sans que ce transfert n&#8217;emporte les cons&#233;quences fiscales d&#8217;un d&#233;nouement.</p><p style=\"text-align: justify;\">Afin que cette transf&#233;rabilit&#233; ait pour contrepartie un investissement productif dans l&#8217;&#233;conomie, le pr&#233;sent amendement pr&#233;voit que le nouveau contrat devra &#234;tre exprim&#233; &#224; hauteur de 30&#160;% au moins en unit&#233;s de compte, c&#8217;est-&#224;-dire en valeurs mobili&#232;res, en provisions de diversification, c&#8217;est-&#224;-dire la partie dynamique des fonds&#160;euro-croissance ou en titres de PME ou ETI &#233;ligibles au PEA-PME.</p>"
  },
  "representations": [
    {
      "nom": "PDF",
      "typeMime": {
        "type": "application",
        "subType": "PDF"
      },
      "statutRepresentation": {
        "verbatim": true,
        "canonique": true,
        "officielle": true,
        "transcription": false,
        "enregistrement": false
      },
      "contenu": {
        "documentURI": "/15/amendements/1088/CSPACTE/1725.pdf"
      }
    }
  ],
  "sort": {
    "dateSaisie": "2018-09-13T10:41:58.000+02:00",
    "sortEnSeance": "Retiré"
  },
  "dateDepot": "2018-09-03T02:00:00.000+02:00",
  "dateDistribution": "2018-09-06T02:00:00.000+02:00",
  "article99": "0",
  "loiReference": {
    "codeLoi": "impôts",
    "divisionCodeLoi": "125-0 A"
  }
}