{
  "uid": "AMANR5L15PO59048B1255P1D1N170",
  "identifiant": {
    "legislature": "15",
    "numero": "170",
    "numRect": "0",
    "saisine": {
      "texteLegislatifRef": "PRJLANR5L15B1255",
      "numeroPartiePLF": "1",
      "organeExamen": "PO59048",
      "mentionSecondeDeliberation": "0"
    }
  },
  "numeroLong": "I-CF170",
  "etapeTexte": "1ère lecture (1ère assemblée saisie)",
  "triAmendement": "eeaaaaaaaaaaaaaaaaaaaaaaaaaaaaaaaaaaaaaaaaaaaaaaaadhzo",
  "cardinaliteAmdtMultiples": "1",
  "etat": "Discuté",
  "signataires": {
    "auteur": {
      "typeAuteur": "Depute",
      "acteurRef": "PA720230",
      "groupePolitiqueRef": "PO744425"
    },
    "cosignatairesRefs": [
      "PA720230",
      "PA942",
      "PA712014",
      "PA331582"
    ],
    "texteAffichable": "Mme&#160;Magnier,  M.&#160;Charles&#160;de Courson, M.&#160;Ledoux et M.&#160;Philippe&#160;Vigier"
  },
  "pointeurFragmentTexte": {
    "division": {
      "titre": "Article 18",
      "articleDesignationCourte": "ART. 18",
      "type": "ARTICLE",
      "avantAApres": "A",
      "divisionRattachee": "ARTICLE 18",
      "urlDivisionTexteVise": "/15/textes/1255A.asp#D_Article_18"
    },
    "alinea": {
      "numero": "11"
    }
  },
  "corps": {
    "dispositif": "<p>I &#8211; L&#8217;alin&#233;a 11 est ainsi r&#233;dig&#233; :<br />&#171; 1&#176; Pour les exploitants individuels, soit &#224; la diff&#233;rence positive entre la somme de 150 000 &#8364; et le montant de d&#233;ductions pratiqu&#233;es et non encore rapport&#233;es au r&#233;sultat, soit au chiffre d&#8217;affaires moyen des cinq derniers exercices ;</p><p>II &#8211; L&#8217;alin&#233;a 12 est ainsi r&#233;dig&#233; :<br />&#171; 2 &#176; Pour les groupements agricoles d&#8217;exploitation en commun et les exploitations agricoles &#224; responsabilit&#233; limit&#233;e qui n&#8217;ont pas opt&#233; pour le r&#233;gime fiscal des soci&#233;t&#233;s de capitaux, soit &#224; la diff&#233;rence positive entre la somme de 150 000 &#8364;, multipli&#233;e par le nombre des associ&#233;s exploitants, dans la limite de quatre, et le montant des d&#233;ductions pratiqu&#233;es et non encore rapport&#233;es au r&#233;sultat, soit au chiffre d&#8217;affaires moyen des cinq derniers exercices ;&#160; &#187;</p><p>III - Les pertes de recettes r&#233;sultant pour l'Etat du I et II, sont compens&#233;es par la cr&#233;ation d'une taxe additionnelle aux droits pr&#233;vus aux articles 575 et 575 A du Code g&#233;n&#233;ral des imp&#244;ts.</p>",
    "exposeSommaire": "<p>Le pr&#233;sent amendement est un amendement de repli qui vise &#224; porter le plafonnement global de la d&#233;duction pour &#233;pargne de pr&#233;caution &#224; une ann&#233;e de chiffre d&#8217;affaires sans &#233;volution possible en cas de d&#233;veloppement de l'activit&#233; &#224; la hausse. </p><p>Le montant maximum pluriannuel, fix&#233; &#224; 150 000 &#8364; dans le projet de loi de finances pour 2019, n&#8217;apparait pas suffisant ni adapt&#233; &#224; toutes les exploitations dont les tailles &#233;conomiques sont diverses.<br /><br />Afin de r&#233;pondre &#224; des al&#233;as dont l&#8217;ampleur et l&#8217;occurrence sont croissantes, les exploitants agricoles doivent disposer d&#8217;une tr&#233;sorerie ad hoc. Ainsi, la r&#233;serve de pr&#233;caution doit pouvoir atteindre un plafond global &#233;gal &#224; une ann&#233;e de chiffre d&#8217;affaires de l&#8217;exploitation &#233;tabli selon la moyenne des cinq derni&#232;res ann&#233;es. </p><p>S&#8217;il est sup&#233;rieur &#224; ce montant, le plafond de 150 000 &#8364;, tel que propos&#233; dans l&#8217;article 18 du projet de loi de finances pour 2019 peut &#234;tre retenu par l&#8217;exploitant. Ce montant doit permettre de compl&#233;ter l&#8217;intervention des autres outils de gestion des risques, et principalement l&#8217;assurance r&#233;colte, permettant &#224; l&#8217;exploitant de ne pas subir les cons&#233;quences de l&#8217;application de la franchise inh&#233;rente &#224; de tels contrats. Son montant permettrait &#233;galement de r&#233;sister &#224; la fluctuation des prix de vente de ses productions.</p>"
  },
  "representations": [
    {
      "nom": "PDF",
      "typeMime": {
        "type": "application",
        "subType": "PDF"
      },
      "statutRepresentation": {
        "verbatim": true,
        "canonique": true,
        "officielle": true,
        "transcription": false,
        "enregistrement": false
      },
      "contenu": {
        "documentURI": "/15/amendements/1255A/CION_FIN/CF170.pdf"
      }
    }
  ],
  "sort": {
    "dateSaisie": "2018-10-10T22:51:16.000+02:00",
    "sortEnSeance": "Rejeté"
  },
  "dateDepot": "2018-10-03T02:00:00.000+02:00",
  "dateDistribution": "2018-10-09T02:00:00.000+02:00",
  "article99": "0",
  "loiReference": {}
}