{
  "uid": "AMANR5L15SEA717460B2272P1D1N1739",
  "identifiant": {
    "legislature": "15",
    "numero": "1739",
    "numRect": "0",
    "saisine": {
      "texteLegislatifRef": "PRJLANR5L15B2272",
      "numeroPartiePLF": "1",
      "organeExamen": "PO717460",
      "mentionSecondeDeliberation": "0"
    }
  },
  "numeroLong": "I-1739",
  "etapeTexte": "1ère lecture (1ère assemblée saisie)",
  "triAmendement": "aobaaaaaaaaaaaaaaaaaaaaaaaaaaaaaaaaaaaaaaaaaaaaaaazzs",
  "cardinaliteAmdtMultiples": "1",
  "etat": "Discuté",
  "signataires": {
    "auteur": {
      "typeAuteur": "Depute",
      "acteurRef": "PA2960",
      "groupePolitiqueRef": "PO730934"
    },
    "cosignatairesRefs": [
      "PA709315",
      "PA267785",
      "PA267204",
      "PA267440",
      "PA721968",
      "PA608416",
      "PA720644",
      "PA721410",
      "PA267289",
      "PA721636",
      "PA330684",
      "PA643134",
      "PA720210",
      "PA266774",
      "PA606712",
      "PA605991",
      "PA266808",
      "PA267429",
      "PA2492",
      "PA267450",
      "PA1498",
      "PA856",
      "PA336316",
      "PA718850",
      "PA607090",
      "PA330008",
      "PA267901",
      "PA713448",
      "PA330788",
      "PA720100",
      "PA267324",
      "PA721506",
      "PA334149",
      "PA267378",
      "PA923",
      "PA342935",
      "PA1029",
      "PA267260",
      "PA721474",
      "PA266797",
      "PA2529",
      "PA746",
      "PA2792",
      "PA719946",
      "PA759192",
      "PA266776",
      "PA1874",
      "PA718780",
      "PA346054",
      "PA2086",
      "PA721054",
      "PA2960",
      "PA267735",
      "PA721286",
      "PA608826",
      "PA334654",
      "PA721678",
      "PA1630",
      "PA719272",
      "PA332523",
      "PA606098",
      "PA1327",
      "PA718784",
      "PA721070",
      "PA1695",
      "PA2377",
      "PA267200",
      "PA748954",
      "PA2155",
      "PA330909",
      "PA609245",
      "PA330240",
      "PA267318",
      "PA721314",
      "PA720684",
      "PA643089",
      "PA223837",
      "PA267794",
      "PA2796",
      "PA720386",
      "PA334843",
      "PA609726",
      "PA642847",
      "PA720630"
    ],
    "texteAffichable": "M.&#160;Woerth,  M.&#160;Jacob, M.&#160;Aubert, M.&#160;Bazin, Mme&#160;Beauvais, Mme&#160;Bonnivard, M.&#160;Bouchet, Mme&#160;Val&#233;rie&#160;Boyer, Mme&#160;Brenier, M.&#160;Breton, M.&#160;Brochand, M.&#160;Carrez, M.&#160;Cherpion, M.&#160;Cinieri, M.&#160;Ciotti, M.&#160;Cordier, M.&#160;Cornut-Gentille, Mme&#160;Dalloz, M.&#160;de Ganay, M.&#160;Deflesselles, M.&#160;R&#233;mi&#160;Delatte, M.&#160;Descoeur, M.&#160;Di Filippo, M.&#160;Diard, M.&#160;Door, Mme&#160;Marianne&#160;Dubois, Mme&#160;Duby-Muller, M.&#160;Pierre-Henri&#160;Dumont, M.&#160;Fasquelle, M.&#160;Forissier, M.&#160;Furst, M.&#160;Gaultier, Mme&#160;Genevard, M.&#160;Goasguen, M.&#160;Gosselin, M.&#160;Grelier, M.&#160;Herbillon, M.&#160;Hetzel, M.&#160;Huyghe, M.&#160;Kamardine, Mme&#160;Kuster, Mme&#160;Lacroute, M.&#160;Larriv&#233;, M.&#160;Le Fur, Mme&#160;Levy, M.&#160;Lorion, M.&#160;Lurton, M.&#160;Emmanuel&#160;Maquet, M.&#160;Marleix, M.&#160;Marlin, M.&#160;Menuel, Mme&#160;Meunier, M.&#160;Minot, M.&#160;Nury, M.&#160;Parigi, M.&#160;Pauget, M.&#160;Peltier, M.&#160;Perrut, Mme&#160;Poletti, M.&#160;Poudroux, M.&#160;Pradi&#233;, M.&#160;Quentin, M.&#160;Ramadier, Mme&#160;Ramassamy, M.&#160;Reda, M.&#160;Reiss, M.&#160;Reitzer, M.&#160;Reyn&#232;s, M.&#160;Rolland, M.&#160;Savignat, M.&#160;Schellenberger, M.&#160;Sermier, M.&#160;Straumann, Mme&#160;Tabarot, M.&#160;Taugourdeau, M.&#160;Teissier, M.&#160;Thi&#233;riot, Mme&#160;Trastour-Isnart, Mme&#160;Valentin, M.&#160;Verch&#232;re, M.&#160;Viala, M.&#160;Vialay, M.&#160;Jean-Pierre&#160;Vigier et M.&#160;Viry"
  },
  "pointeurFragmentTexte": {
    "division": {
      "titre": "Article 20",
      "articleDesignationCourte": "ART. 20",
      "type": "ARTICLE",
      "avantAApres": "A",
      "divisionRattachee": "ARTICLE 20",
      "urlDivisionTexteVise": "/15/textes/2272A.asp#D_Article_20"
    }
  },
  "corps": {
    "dispositif": "<p style=\"text-align: justify;\">Supprimer cet article.</p>",
    "exposeSommaire": "<p style=\"text-align: justify;\"><span  data-cid=\"2\"   data-time=\"1570711268292\">L&#8217;augmentation de la taxe de solidarit&#233; sur les billets d&#8217;avions va pr&#233;lever 180&#160;millions d&#8217;euros sur le secteur du transport a&#233;rien fran&#231;ais, pourtant confront&#233; &#224; des &#233;carts de comp&#233;titivit&#233;s importants avec ses principaux homologues.</span></p><p style=\"text-align: justify;\"><span  data-cid=\"3\"   data-time=\"1570711268292\">Qualifier d&#8217;&#160;&#171;&#160;&#233;cocontribution&#160;&#187;&#160;cette hausse de taxes est abusif. La taxe de solidarit&#233; est assise sur le nombre de passagers par vols et n&#8217;est donc pas directement fonction des &#233;missions de CO&#178; li&#233;es aux vols. Or, ces &#233;missions varient de fa&#231;on significative selon les mod&#232;les d&#8217;avions ou la qualit&#233; de la navigation a&#233;rienne. Un a&#233;ronef moins &#233;missif et b&#233;n&#233;ficiant d&#8217;un meilleur taux de remplissage sera ainsi plus tax&#233; qu&#8217;un avion plus consommateur de k&#233;ros&#232;ne et transportant moins de passagers.</span></p><p style=\"text-align: justify;\"><span  data-cid=\"4\"   data-time=\"1570711268292\">Il n&#8217;y aura aucun effet incitatif pour les passagers qui ne seront pas mis &#224; contribution&#160;: dans le contexte extr&#234;mement concurrentiel du transport a&#233;rien, les compagnies a&#233;riennes ne pourront pas r&#233;percuter le montant du pr&#233;l&#232;vement sur le prix des billets d&#8217;avion. La nouvelle taxe affectera donc directement leur b&#233;n&#233;fice d&#8217;exploitation.&#160;</span></p><p style=\"text-align: justify;\"><span  data-cid=\"5\"   data-time=\"1570711268292\">Les compagnies a&#233;riennes seront donc priv&#233;es de marges de man&#339;uvres alors qu&#8217;elles doivent investir pour r&#233;duire leur empreinte environnementale (renouvellement de leur flotte avec des avions plus sobres). La nouvelle charge fiscale va les fragiliser sans m&#234;me ouvrir la perspective d&#8217;une diminution du pr&#233;l&#232;vement en cas d&#8217;atteinte d&#8217;objectifs environnementaux.</span></p><p style=\"text-align: justify;\"><span  data-cid=\"6\"   data-time=\"1570711268293\">Il s&#8217;agit donc plus d&#8217;une mesure de rendement que d&#8217;une taxe &#224; vis&#233;e environnementale. L&#8217;&#233;cologie est le pr&#233;texte &#224; des pr&#233;l&#232;vements obligatoires suppl&#233;mentaires.</span></p><p style=\"text-align: justify;\"><span  data-cid=\"7\"   data-time=\"1570711268293\">Plut&#244;t qu&#8217;une taxe nationale qui va p&#233;naliser les compagnies fran&#231;aises en g&#233;n&#233;rant des distorsions de concurrence, il convient d&#8217;intervenir au plan europ&#233;en, comme l&#8217;a rappel&#233; le Conseil des pr&#233;l&#232;vements obligatoires dans son r&#233;cent rapport sur la fiscalit&#233; &#233;cologique. Une taxation du k&#233;ros&#232;ne &#224; l&#8217;&#233;chelle europ&#233;enne serait plus juste aux plans &#233;cologique et &#233;conomique.</span></p><p style=\"text-align: justify;\"><span  data-cid=\"8\"   data-time=\"1570711268293\">&#192; rebours des attentes unanimes d&#8217;all&#232;gement de la fiscalit&#233; sur le secteur qui se sont exprim&#233;es lors des Assises du transport a&#233;rien, le choc fiscal va p&#233;naliser tout particuli&#232;rement le Pavillon fran&#231;ais et g&#233;n&#233;rer des distorsions de concurrence.</span></p><p style=\"text-align: justify;\"><span  data-cid=\"9\"   data-time=\"1570711268293\">Cette hausse intervient au plus mauvais moment, alors que les compagnies a&#233;riennes fran&#231;aises souffrent d&#233;j&#224; d&#8217;un important d&#233;ficit de comp&#233;titivit&#233;, et sont parfois directement menac&#233;es de faillite.</span></p><p style=\"text-align: justify;\"><span  data-cid=\"10\"   data-time=\"1570711268293\">Il convient donc de supprimer cet article.</span></p><p style=\"text-align: justify;\"><span  data-cid=\"11\"   data-time=\"1570711268301\">Cet amendement vise &#224; emp&#234;cher la cr&#233;ation d&#8217;une &#233;cotaxe sur les billets d&#8217;avion.</span><span  data-cid=\"11\"   data-time=\"1570711268301\">Cette hausse importante des taxes sur les billets d&#8217;avion va alourdir encore davantage les imp&#244;ts du secteur a&#233;rien, d&#233;j&#224;&#160;plus tax&#233; en France qu&#8217;ailleurs en Europe.</span><span  data-cid=\"11\"   data-time=\"1570711268301\">Il s&#8217;agit par ailleurs d&#8217;une taxe anti&#233;conomique qui va fragiliser encore davantage les compagnies a&#233;riennes fran&#231;aises, qui souffrent d&#233;j&#224; d&#8217;un important d&#233;ficit de comp&#233;titivit&#233;, et qui sont parfois directement menac&#233;es de faillite. Surtout, dans le contexte extr&#234;mement concurrentiel du transport a&#233;rien, les compagnies a&#233;riennes ne devraient pas pouvoir r&#233;percuter le montant du pr&#233;l&#232;vement sur le prix des billets d&#8217;avion. La nouvelle taxe affectera donc directement leur b&#233;n&#233;fice d&#8217;exploitation. Plut&#244;t qu&#8217;une taxe nationale qui va p&#233;naliser les compagnies fran&#231;aises en g&#233;n&#233;rant des distorsions de concurrence, il serait plus judicieux de r&#233;fl&#233;chir &#224; la mise en place d&#8217;une taxation du k&#233;ros&#232;ne &#224; l&#8217;&#233;chelle europ&#233;enne dont l&#8217;efficacit&#233; &#233;cologique et &#233;conomique serait nettement plus juste.</span><span  data-cid=\"11\"   data-time=\"1570711268301\">Cette taxe fran&#231;aise rel&#232;ve encore une fois de la m&#234;me logique d&#8217;une &#233;cologie punitive o&#249; l&#8217;&#233;cologie sert surtout de pr&#233;texte pour obtenir des recettes fiscales suppl&#233;mentaires. En l&#8217;occurrence, cette taxe a &#233;t&#233; sortie du chapeau par le Gouvernement pour assurer les financements des infrastructures de transport pr&#233;vues par la loi sur l&#8217;orientation des mobilit&#233;s.</span><span  data-cid=\"11\"   data-time=\"1570711268301\">D&#8217;ailleurs la taxe est anti&#233;cologique. En effet, elle est assise sur le nombre de passagers par vols et n&#8217;est donc pas directement fonction des &#233;missions de CO&#178; li&#233;es aux vols. Or, ces &#233;missions varient de fa&#231;on significative selon les mod&#232;les d&#8217;avions ou la qualit&#233; de la navigation a&#233;rienne. Un a&#233;ronef moins &#233;missif et b&#233;n&#233;ficiant d&#8217;un meilleur taux de remplissage sera ainsi plus tax&#233; qu&#8217;un avion plus consommateur de k&#233;ros&#232;ne et transportant moins de passagers. En outre, les niveaux des tarifs sont peu susceptibles de susciter des changements de comportements des utilisateurs du transport a&#233;rien&#160;: il s&#8217;agit donc plus d&#8217;une mesure de rendement que d&#8217;une taxe &#224; vis&#233;e environnementale.</span><span  data-cid=\"11\"   data-time=\"1570711268301\">Enfin, cette taxe pourrait m&#234;me &#234;tre contreproductive sur le plan &#233;cologique en privant les compagnies a&#233;riennes de marges de man&#339;uvres financi&#232;res alors qu&#8217;elles en auraient justement besoin pour investir afin de r&#233;duire leur empreinte environnementale (renouvellement de leur flotte avec des avions de nouvelle g&#233;n&#233;ration moins pollueurs). La nouvelle charge fiscale va fragiliser cet effort sans m&#234;me ouvrir la perspective d&#8217;une diminution du pr&#233;l&#232;vement en cas d&#8217;atteinte d&#8217;objectifs environnementaux.</span><span  data-cid=\"11\"   data-time=\"1570711268301\">Il convient donc de supprimer cet article.</span></p>"
  },
  "representations": [
    {
      "nom": "PDF",
      "typeMime": {
        "type": "application",
        "subType": "PDF"
      },
      "statutRepresentation": {
        "verbatim": true,
        "canonique": true,
        "officielle": true,
        "transcription": false,
        "enregistrement": false
      },
      "contenu": {
        "documentURI": "/15/amendements/2272A/AN/1739.pdf"
      }
    }
  ],
  "seanceDiscussion": "RUANR5L15S2020IDS21866",
  "sort": {
    "dateSaisie": "2019-10-17T11:42:30.000+02:00",
    "sortEnSeance": "Rejeté"
  },
  "dateDepot": "2019-10-10T02:00:00.000+02:00",
  "dateDistribution": "2019-10-17T02:00:00.000+02:00",
  "article99": "0",
  "loiReference": {}
}