{
  "uid": "AMANR5L15SEA717460BTC0971P0D1N2479",
  "identifiant": {
    "legislature": "15",
    "numero": "2479",
    "numRect": "0",
    "saisine": {
      "texteLegislatifRef": "PRJLANR5L15BTC0971",
      "numeroPartiePLF": "0",
      "organeExamen": "PO717460",
      "mentionSecondeDeliberation": "0"
    }
  },
  "numeroLong": "2479",
  "etapeTexte": "1ère lecture (1ère assemblée saisie)",
  "triAmendement": "p",
  "cardinaliteAmdtMultiples": "1",
  "etat": "Discuté",
  "signataires": {
    "auteur": {
      "typeAuteur": "Depute",
      "acteurRef": "PA720378",
      "groupePolitiqueRef": "PO730964"
    },
    "cosignatairesRefs": [
      "PA720378"
    ],
    "texteAffichable": "M.&#160;Lioger"
  },
  "pointeurFragmentTexte": {
    "division": {
      "titre": "Article 12 sexies",
      "articleDesignationCourte": "ART. 12 SEXIES",
      "type": "ARTICLE",
      "avantAApres": "A",
      "divisionRattachee": "ARTICLE 12 SEXIES",
      "urlDivisionTexteVise": "/15/textes/0971.asp#D_Article_12_sexies"
    },
    "alinea": {
      "avantAApres": "A",
      "numero": "2",
      "alineaDesignation": "Alinéa 2"
    }
  },
  "corps": {
    "dispositif": "<p style=\"text-align: justify;\">&#192; la deuxi&#232;me phrase de l&#8217;alin&#233;a&#160;2, substituer au mot&#160;:</p><p style=\"text-align: justify;\">&#171;&#160;et&#160;&#187;</p><p style=\"text-align: justify;\">le mot&#160;:</p><p style=\"text-align: justify;\">&#171;&#160;ou&#160;&#187;.</p>",
    "exposeSommaire": "<p style=\"text-align: justify;\">Cet amendement harmonise la r&#233;daction de l'article 12 sexies avec celle de l'article 12 septies (l'accord de l'autorit&#233; administrative peut &#234;tre refus&#233; si les constructions ou installations sont de nature &#224; porter atteinte &#224; l'environnement <u>ou</u> aux paysages).</p>"
  },
  "representations": [
    {
      "nom": "PDF",
      "typeMime": {
        "type": "application",
        "subType": "PDF"
      },
      "statutRepresentation": {
        "verbatim": true,
        "canonique": true,
        "officielle": true,
        "transcription": false,
        "enregistrement": false
      },
      "contenu": {
        "documentURI": "/15/amendements/0971/AN/2479.pdf"
      }
    }
  ],
  "seanceDiscussion": "RUANR5L15S2018IDS21081",
  "sort": {
    "dateSaisie": "2018-06-01T10:57:28.000+02:00",
    "sortEnSeance": "Adopté"
  },
  "dateDepot": "2018-05-26T02:00:00.000+02:00",
  "dateDistribution": "2018-05-29T02:00:00.000+02:00",
  "article99": "0",
  "loiReference": {}
}