{
  "uid": "AMANR5L15SEA717460BTC0902P0D1N1732",
  "identifiant": {
    "legislature": "15",
    "numero": "1732",
    "numRect": "0",
    "saisine": {
      "texteLegislatifRef": "PRJLANR5L15BTC0902",
      "numeroPartiePLF": "0",
      "organeExamen": "PO717460",
      "mentionSecondeDeliberation": "0"
    }
  },
  "numeroLong": "1732",
  "etapeTexte": "1ère lecture (1ère assemblée saisie)",
  "triAmendement": "amlyzzzzi",
  "cardinaliteAmdtMultiples": "1",
  "etat": "Discuté",
  "signataires": {
    "auteur": {
      "typeAuteur": "Depute",
      "acteurRef": "PA719608",
      "groupePolitiqueRef": "PO723569"
    },
    "cosignatairesRefs": [
      "PA719608"
    ],
    "texteAffichable": "Mme&#160;M&#233;nard"
  },
  "pointeurFragmentTexte": {
    "division": {
      "titre": "Article 15",
      "articleDesignationCourte": "ART. 15",
      "type": "ARTICLE",
      "avantAApres": "A",
      "divisionRattachee": "ARTICLE 15",
      "urlDivisionTexteVise": "/15/textes/0902.asp#D_Article_15"
    },
    "alinea": {
      "avantAApres": "A",
      "numero": "3",
      "alineaDesignation": "Alinéa 3"
    }
  },
  "corps": {
    "dispositif": "<p style=\"text-align: justify;\">&#192; l&#8217;alin&#233;a&#160;3, substituer aux mots&#160;: </p><p style=\"text-align: justify;\">&#171;&#160;capitalistique des&#160;&#187; </p><p style=\"text-align: justify;\">les mots&#160;:</p><p style=\"text-align: justify;\">&#171;&#160;des factures selon les&#160;&#187;.</p>",
    "exposeSommaire": "<p style=\"text-align: justify;\">La s&#233;paration capitalistique entre les structures de conseil et de vente des produits phytopharmaceutiques entra&#238;nera des conflits d&#8217;int&#233;r&#234;ts entre les conseillers et les vendeurs. Elle risque aussi de pousser les agriculteurs, pour des questions de co&#251;ts, &#224; ne plus consulter les conseillers et &#224; se rendre seulement aupr&#232;s des vendeurs. Dans ce cas, l&#8217;objectif de r&#233;duction d&#8217;utilisation des ces produits ne serait pas rempli et serait pr&#233;judiciable aux agriculteurs.</p><p style=\"text-align: justify;\">C&#8217;est la raison pour laquelle, une facture diff&#233;renci&#233;e des structures de vente et de conseil serait pr&#233;f&#233;rable &#224; une s&#233;paration capitalistique des structures. Cet amendement permet ainsi une s&#233;paration de fait mais qui n&#8217;est pas rigide.</p>"
  },
  "representations": [
    {
      "nom": "PDF",
      "typeMime": {
        "type": "application",
        "subType": "PDF"
      },
      "statutRepresentation": {
        "verbatim": true,
        "canonique": true,
        "officielle": true,
        "transcription": false,
        "enregistrement": false
      },
      "contenu": {
        "documentURI": "/15/amendements/0902/AN/1732.pdf"
      }
    }
  ],
  "seanceDiscussion": "RUANR5L15S2018IDS21060",
  "sort": {
    "dateSaisie": "2018-05-29T22:12:09.000+02:00",
    "sortEnSeance": "Rejeté"
  },
  "dateDepot": "2018-05-17T02:00:00.000+02:00",
  "dateDistribution": "2018-05-23T02:00:00.000+02:00",
  "article99": "0",
  "loiReference": {}
}