{
  "uid": "AMANR5L15PO59048B1490P0D1N548",
  "identifiant": {
    "legislature": "15",
    "numero": "548",
    "numRect": "0",
    "saisine": {
      "texteLegislatifRef": "PRJLANR5L15B1490",
      "numeroPartiePLF": "0",
      "organeExamen": "PO59048",
      "mentionSecondeDeliberation": "0"
    }
  },
  "numeroLong": "CF548",
  "etapeTexte": "Nouvelle Lecture",
  "triAmendement": "ebaaaaaaaaaaaaaaaaaaaaaaaaaaaaaaaaaaaaaaaaaaaaaaaabyzwi",
  "cardinaliteAmdtMultiples": "1",
  "etat": "Discuté",
  "signataires": {
    "auteur": {
      "typeAuteur": "Depute",
      "acteurRef": "PA718860",
      "groupePolitiqueRef": "PO730958"
    },
    "cosignatairesRefs": [
      "PA721960",
      "PA720892",
      "PA719578",
      "PA720846",
      "PA720286",
      "PA719676",
      "PA721202",
      "PA2150",
      "PA720430",
      "PA718868",
      "PA718860",
      "PA720422",
      "PA588884",
      "PA721226",
      "PA721210",
      "PA722142",
      "PA721062"
    ],
    "texteAffichable": "Mme&#160;Taurine,  Mme&#160;Autain, M.&#160;Bernalicis, M.&#160;Coquerel, M.&#160;Corbi&#232;re, Mme&#160;Fiat, M.&#160;Lachaud, M.&#160;Larive, M.&#160;M&#233;lenchon, Mme&#160;Obono, Mme&#160;Panot, M.&#160;Prud&apos;homme, M.&#160;Quatennens, M.&#160;Ratenon, Mme&#160;Ressiguier, Mme&#160;Rubin et M.&#160;Ruffin"
  },
  "pointeurFragmentTexte": {
    "missionVisee": {
      "idMissionAN": "702",
      "libelleMission": "Cohésion des territoires",
      "codeMissionPLF": "B",
      "libelleMissionPLF": "Répartition, par mission et programme, des crédits du budget général"
    },
    "division": {
      "titre": "ÉTAT B",
      "articleDesignationCourte": "ART. 39",
      "type": "ANNEXE",
      "avantAApres": "A",
      "divisionRattachee": "ARTICLE 39",
      "urlDivisionTexteVise": "/15/textes/1490.asp#D_Etat_B"
    }
  },
  "corps": {
    "exposeSommaire": "<p style=\"text-align: justify;\">Par cet amendement nous proposons de r&#233;tablir les cr&#233;dits issus du vote en premi&#232;re lecture &#224; l&#8217;assembl&#233;e nationale et de transf&#233;rer 12&#160;&#8364; de l&#8217;action 7 du programme 135 qui vise notamment &#224; financer les grandes op&#233;rations d&#8217;urbanisme bien souvent inutiles vers les aides aux logements (programme 109 action 01). Pourquoi 12&#160;euros&#160;?</p><p style=\"text-align: justify;\">12&#160;&#8364; c&#8217;est ce que le pr&#233;sident Macron a pris en moyenne par personne aux plus pauvres b&#233;n&#233;ficiant des aides aux logements pour le donner aux plus riches. Pourtant, les gilets jaunes ont formul&#233; des revendications pr&#233;cises en mati&#232;re de logement. Notamment l&#8217;indexation des allocations sur l&#8217;inflation ainsi qu&#8217;une politique d&#8217;encadrement des loyers et de d&#233;veloppement des logements &#224; loyers dits mod&#233;r&#233;s.</p><p style=\"text-align: justify;\">Nous soutenons les gilets jaunes dans ces revendications. Par la baisse soudaine et injuste de 5&#160;euros des APL intervenue en 2017, puis le gel intervenu en 2018 (qui a co&#251;t&#233; en moyenne 4,2&#160;euros par b&#233;n&#233;ficiaire) le Gouvernement persiste dans cette politique de &#171;&#160;rabot&#160;&#187; en proposant de relever le montant de l&#8217;APL de seulement 0,3&#160;% pour 2019, ce qui est bien en de&#231;&#224; de l&#8217;inflation pr&#233;vue par ce m&#234;me Gouvernement&#160;: le montant moyen d&#8217;une APL &#233;tant de 231&#160;euros par mois, cette sous-indexation fera de nouveau baisser en moyenne les APL de 2,5&#160;euros par mois en termes r&#233;els (et ce montant sera encore plus &#233;lev&#233; pour ceux qui touchent le plus d&#8217;APL, c&#8217;est-&#224;-dire les plus fragiles). Ainsi, en 2019, les b&#233;n&#233;ficiaires auront perdu en moyenne et en &#171;&#160;termes r&#233;els&#160;&#187; 11,7&#160;euros d&#8217;APL par rapport &#224; la situation avant l&#8217;arriv&#233;e de Macron. Cette somme est &#224; mettre en comparaison aux 253 800&#160;euros offerts &#224; chacun des 5 000 Fran&#231;ais les plus riches. D&#233;cid&#233;ment, le pr&#233;sident Macron est donc un v&#233;ritable robin des bois &#224; l&#8217;envers&#8230; &#192; cela s&#8217;ajoute la &#171;&#160;contemporan&#233;isation des ressources&#160;&#187; de ce PLF 2019 qui r&#233;duit globalement l&#8217;enveloppe d&#233;di&#233;e aux APL de 900 millions d&#8217;euros. C&#8217;est donc pr&#232;s d&#8217;un milliard suppl&#233;mentaire retir&#233; aux 6,5 millions foyers qui touchent des APL et qui sont parmi les plus pauvres.&#160;</p>",
    "dispositifAmdtCredit": {
      "listeProgrammes": [
        {
          "libelle": "Hébergement, parcours vers le logement et insertion des personnes vulnérables",
          "id": "54363",
          "AE": {
            "montantPositif": "1873114477",
            "montantNegatif": "0"
          },
          "CP": {
            "montantPositif": "1891214477",
            "montantNegatif": "0"
          },
          "action": "modification"
        },
        {
          "libelle": "Aide à l'accès au logement",
          "id": "54364",
          "AE": {
            "montantPositif": "13112551729",
            "montantNegatif": "0"
          },
          "CP": {
            "montantPositif": "13112551729",
            "montantNegatif": "0"
          },
          "action": "modification"
        },
        {
          "libelle": "Urbanisme, territoires et amélioration de l'habitat",
          "id": "54365",
          "AE": {
            "montantPositif": "280934573",
            "montantNegatif": "0"
          },
          "CP": {
            "montantPositif": "280934573",
            "montantNegatif": "0"
          },
          "action": "modification"
        },
        {
          "libelle": "Impulsion et coordination de la politique d'aménagement du territoire",
          "id": "54366",
          "AE": {
            "montantPositif": "199398896",
            "montantNegatif": "0"
          },
          "CP": {
            "montantPositif": "240814179",
            "montantNegatif": "0"
          },
          "action": "modification",
          "lignesCredits": [
            {
              "id": "1941",
              "libelle": "Dont titre 2",
              "AE": {
                "montantPositif": "19932626",
                "montantNegatif": "0"
              },
              "CP": {
                "montantPositif": "19932626",
                "montantNegatif": "0"
              }
            }
          ]
        },
        {
          "libelle": "Interventions territoriales de l'État",
          "id": "54367",
          "AE": {
            "montantPositif": "35569445",
            "montantNegatif": "0"
          },
          "CP": {
            "montantPositif": "25669445",
            "montantNegatif": "0"
          },
          "action": "modification"
        },
        {
          "libelle": "Politique de la ville",
          "id": "54368",
          "AE": {
            "montantPositif": "668935082",
            "montantNegatif": "0"
          },
          "CP": {
            "montantPositif": "508935082",
            "montantNegatif": "0"
          },
          "action": "modification",
          "lignesCredits": [
            {
              "id": "1942",
              "libelle": "Dont titre 2",
              "AE": {
                "montantPositif": "19419002",
                "montantNegatif": "0"
              },
              "CP": {
                "montantPositif": "19419002",
                "montantNegatif": "0"
              }
            }
          ]
        }
      ],
      "totalAE": {
        "montantPositif": "16170504202",
        "montantNegatif": "0",
        "solde": "16170504202"
      },
      "totalCP": {
        "montantPositif": "16060119485",
        "montantNegatif": "0",
        "solde": "16060119485"
      }
    }
  },
  "representations": [
    {
      "nom": "PDF",
      "typeMime": {
        "type": "application",
        "subType": "PDF"
      },
      "statutRepresentation": {
        "verbatim": true,
        "canonique": true,
        "officielle": true,
        "transcription": false,
        "enregistrement": false
      },
      "contenu": {
        "documentURI": "/15/amendements/1490/CION_FIN/CF548.pdf"
      }
    }
  ],
  "sort": {
    "dateSaisie": "2018-12-14T12:31:32.000+01:00",
    "sortEnSeance": "Non soutenu"
  },
  "dateDepot": "2018-12-13T01:00:00.000+01:00",
  "dateDistribution": "2018-12-14T01:00:00.000+01:00",
  "article99": "0",
  "loiReference": {}
}