{
  "uid": "AMANR5L15SEA717460B1490P0D1N824",
  "identifiant": {
    "legislature": "15",
    "numero": "824",
    "numRect": "0",
    "saisine": {
      "texteLegislatifRef": "PRJLANR5L15B1490",
      "numeroPartiePLF": "0",
      "organeExamen": "PO717460",
      "mentionSecondeDeliberation": "0"
    }
  },
  "numeroLong": "824",
  "etapeTexte": "Nouvelle Lecture",
  "triAmendement": "dniaaaaaaaaaaaaaaaaaaaaaaaaaaaaaaaaaaaaaaaaaaaaaaacp",
  "cardinaliteAmdtMultiples": "1",
  "etat": "Discuté",
  "signataires": {
    "auteur": {
      "typeAuteur": "Depute",
      "acteurRef": "PA721226",
      "groupePolitiqueRef": "PO730958"
    },
    "cosignatairesRefs": [
      "PA719676",
      "PA721062",
      "PA720422",
      "PA721226",
      "PA721202",
      "PA588884",
      "PA2150",
      "PA720846",
      "PA720892",
      "PA721210",
      "PA721960",
      "PA719578",
      "PA718860",
      "PA722142",
      "PA720286",
      "PA718868",
      "PA720430"
    ],
    "texteAffichable": "Mme&#160;Rubin,  Mme&#160;Autain, M.&#160;Bernalicis, M.&#160;Coquerel, M.&#160;Corbi&#232;re, Mme&#160;Fiat, M.&#160;Lachaud, M.&#160;Larive, M.&#160;M&#233;lenchon, Mme&#160;Obono, Mme&#160;Panot, M.&#160;Prud&apos;homme, M.&#160;Quatennens, M.&#160;Ratenon, Mme&#160;Ressiguier, M.&#160;Ruffin et Mme&#160;Taurine"
  },
  "pointeurFragmentTexte": {
    "division": {
      "titre": "Article 33 bis",
      "articleDesignationCourte": "ART. 33 BIS",
      "type": "ARTICLE",
      "avantAApres": "A",
      "divisionRattachee": "ARTICLE 33 BIS",
      "urlDivisionTexteVise": "/15/textes/1490.asp#D_Article_33_bis"
    }
  },
  "corps": {
    "dispositif": "<p style=\"text-align: justify;\">Apr&#232;s le mot&#160;:</p><p style=\"text-align: justify;\">&#171;&#160;arri&#232;re&#160;&#187;</p><p style=\"text-align: justify;\">r&#233;diger ainsi la fin&#160;:</p><p style=\"text-align: justify;\">&#171;&#160;ne transportant pas les voyageurs et les marchandises dans un compartiment unique.&#160;&#187;</p>",
    "exposeSommaire": "<p style=\"text-align: justify;\">L&#8217;instruction administrative en date du 7 octobre 2015 (BOI-TFP-TVS-10&#8209;20&#8209;20151007) pr&#233;cise injustement que si le v&#233;hicule est &#233;quip&#233; d&#8217;une plate-forme arri&#232;re ne transportant pas les voyageurs et les marchandises dans un compartiment unique (tel un v&#233;hicule de type pick up, &#224; cabine simple ou &#224; double cabine), il n&#8217;est pas soumis &#224; la taxe sur les v&#233;hicules de soci&#233;t&#233;s (TVS). Et est &#233;galement&#160;exempt&#233; de malus &#233;cologique, alors m&#234;me que les autres v&#233;hicules apparent&#233;s de type 4X4 y sont soumis.</p><p style=\"text-align: justify;\">Il convient de supprimer compl&#232;tement la niche fiscale des pickups, dont l&#8217;exon&#233;ration de malus &#233;cologique qui repr&#233;sente &#224; elle seule un manque &#224; gagner de 200 millions d&#8217;euros par an pour l&#8217;&#201;tat. Cette niche fiscale se traduit dans les faits par un march&#233; en plein essor du fait d&#8217;un effet d&#8217;aubaine totalement climaticide.&#160;</p><p style=\"text-align: justify;\">Nous proposons donc de revenir &#224; la version initiale de notre amendement, avant qu&#8217;il ne soit &#233;dulcor&#233; par le S&#233;nat.</p>"
  },
  "representations": [
    {
      "nom": "PDF",
      "typeMime": {
        "type": "application",
        "subType": "PDF"
      },
      "statutRepresentation": {
        "verbatim": true,
        "canonique": true,
        "officielle": true,
        "transcription": false,
        "enregistrement": false
      },
      "contenu": {
        "documentURI": "/15/amendements/1490/AN/824.pdf"
      }
    }
  ],
  "seanceDiscussion": "RUANR5L15S2019IDS21433",
  "sort": {
    "dateSaisie": "2018-12-19T00:47:53.000+01:00",
    "sortEnSeance": "Tombé"
  },
  "dateDepot": "2018-12-14T01:00:00.000+01:00",
  "dateDistribution": "2018-12-17T01:00:00.000+01:00",
  "article99": "0",
  "loiReference": {}
}