{
  "uid": "AMANR5L15SEA717460BTC0857P0D1N496",
  "identifiant": {
    "legislature": "15",
    "numero": "496",
    "numRect": "0",
    "saisine": {
      "texteLegislatifRef": "PRJLANR5L15BTC0857",
      "numeroPartiePLF": "0",
      "organeExamen": "PO717460",
      "mentionSecondeDeliberation": "0"
    }
  },
  "numeroLong": "496",
  "etapeTexte": "1ère lecture (1ère assemblée saisie)",
  "triAmendement": "ifo",
  "cardinaliteAmdtMultiples": "1",
  "etat": "Discuté",
  "signataires": {
    "auteur": {
      "typeAuteur": "Depute",
      "acteurRef": "PA330240",
      "groupePolitiqueRef": "PO730934"
    },
    "cosignatairesRefs": [
      "PA609726",
      "PA330008",
      "PA748954",
      "PA721636",
      "PA267735",
      "PA267901",
      "PA267794",
      "PA267785",
      "PA332523",
      "PA718784",
      "PA721816",
      "PA267378",
      "PA330909",
      "PA721070",
      "PA334149",
      "PA720100",
      "PA718838",
      "PA720644",
      "PA2960",
      "PA720586",
      "PA721410",
      "PA346054",
      "PA713448",
      "PA721126",
      "PA267318",
      "PA998",
      "PA1498",
      "PA721054",
      "PA2792",
      "PA267204",
      "PA712015",
      "PA608016",
      "PA266808",
      "PA342935",
      "PA1695",
      "PA2529",
      "PA643103",
      "PA856",
      "PA923",
      "PA746",
      "PA267440",
      "PA718884",
      "PA643134",
      "PA767",
      "PA608826",
      "PA267527",
      "PA2086",
      "PA330240",
      "PA605991",
      "PA1012",
      "PA2492",
      "PA721968",
      "PA721314",
      "PA721474",
      "PA1029",
      "PA267324",
      "PA1327",
      "PA330788",
      "PA2796",
      "PA267289",
      "PA266797",
      "PA606712",
      "PA721046",
      "PA266774",
      "PA1630"
    ],
    "texteAffichable": "M.&#160;Ciotti,  M.&#160;Jacob, M.&#160;Aubert, Mme&#160;Bassire, Mme&#160;Bazin-Malgras, Mme&#160;Bonnivard, M.&#160;Boucard, Mme&#160;Brenier, M.&#160;Breton, M.&#160;Brun, M.&#160;Carrez, M.&#160;Cattin, M.&#160;Cherpion, M.&#160;Cornut-Gentille, Mme&#160;Dalloz, M.&#160;Dassault, M.&#160;de Ganay, M.&#160;de la Verpilli&#232;re, M.&#160;Deflesselles, M.&#160;Descoeur, M.&#160;Diard, M.&#160;Dive, M.&#160;Door, Mme&#160;Marianne&#160;Dubois, Mme&#160;Duby-Muller, M.&#160;Fasquelle, M.&#160;Ferrara, M.&#160;Forissier, M.&#160;Furst, M.&#160;Gaultier, Mme&#160;Genevard, M.&#160;Goasguen, M.&#160;Gosselin, M.&#160;Grelier, Mme&#160;Guion-Firmin, M.&#160;Herbillon, M.&#160;Kamardine, M.&#160;Larriv&#233;, Mme&#160;Levy, M.&#160;Lorion, Mme&#160;Louwagie, M.&#160;Lurton, M.&#160;Emmanuel&#160;Maquet, M.&#160;Marlin, M.&#160;Nury, M.&#160;Parigi, M.&#160;Pauget, M.&#160;Pradi&#233;, M.&#160;Quentin, Mme&#160;Ramassamy, M.&#160;Reitzer, M.&#160;Reyn&#232;s, M.&#160;Rolland, M.&#160;Saddier, M.&#160;Savignat, M.&#160;Schellenberger, M.&#160;Sermier, Mme&#160;Tabarot, M.&#160;Taugourdeau, M.&#160;Teissier, Mme&#160;Valentin, M.&#160;Vatin, M.&#160;Vialay, M.&#160;Viry et M.&#160;Woerth"
  },
  "pointeurFragmentTexte": {
    "division": {
      "titre": "Article 3",
      "articleDesignationCourte": "ART. 3",
      "type": "ARTICLE",
      "avantAApres": "A",
      "divisionRattachee": "ARTICLE 3",
      "urlDivisionTexteVise": "/15/textes/0857.asp#D_Article_3"
    },
    "alinea": {
      "numero": "2"
    }
  },
  "corps": {
    "dispositif": "<p style=\"text-align: justify;\">Supprimer les alin&#233;as 2 &#224; 4.</p>",
    "exposeSommaire": "<p style=\"text-align: justify;\">Ce projet de loi ne limite en rien le volume des flux migratoires bien au contraire. En pr&#233;voyant l&#8217;octroi de titres de s&#233;jour non seulement aux parents, mais aussi aux fr&#232;res et s&#339;urs des mineurs r&#233;fugi&#233;s, les b&#233;n&#233;ficiaires de la protection internationale vont continuer d&#8217;augmenter alors qu&#8217;en 2017 par exemple, 100 412 demandes d&#8217;asile ont &#233;t&#233; enregistr&#233;es, niveau in&#233;dit et jamais atteint. En cinq ans la demande globale de protection internationale en France a augment&#233; de 40&#160;%. La France doit se doter des moyens de limiter cette pression migratoire.&#160;</p><p style=\"text-align: justify;\">Cet amendement propose donc de supprimer cette disposition.&#160;</p>"
  },
  "representations": [
    {
      "nom": "PDF",
      "typeMime": {
        "type": "application",
        "subType": "PDF"
      },
      "statutRepresentation": {
        "verbatim": true,
        "canonique": true,
        "officielle": true,
        "transcription": false,
        "enregistrement": false
      },
      "contenu": {
        "documentURI": "/15/amendements/0857/AN/496.pdf"
      }
    }
  ],
  "seanceDiscussion": "RUANR5L15S2018IDS21013",
  "sort": {
    "dateSaisie": "2018-04-18T23:51:11.000+02:00",
    "sortEnSeance": "Rejeté"
  },
  "dateDepot": "2018-04-12T02:00:00.000+02:00",
  "dateDistribution": "2018-04-13T02:00:00.000+02:00",
  "article99": "0",
  "loiReference": {}
}