{
  "uid": "AMANR5L15SEA717460BTC1974P0D1N3480",
  "identifiant": {
    "legislature": "15",
    "numero": "3480",
    "numRect": "0",
    "saisine": {
      "texteLegislatifRef": "PRJLANR5L15BTC1974",
      "numeroPartiePLF": "0",
      "organeExamen": "PO717460",
      "mentionSecondeDeliberation": "0"
    }
  },
  "numeroLong": "3480",
  "etapeTexte": "1ère lecture (2ème assemblée saisie)",
  "triAmendement": "ekaaaaaaaaaaaaaaaaaaaaaaaaaaaaaaaaaaaaaaaaaaaaaaaay",
  "cardinaliteAmdtMultiples": "1",
  "etat": "Retiré",
  "signataires": {
    "auteur": {
      "typeAuteur": "Depute",
      "acteurRef": "PA719258",
      "groupePolitiqueRef": "PO730964"
    },
    "cosignatairesRefs": [
      "PA719980",
      "PA605963",
      "PA720652",
      "PA722134",
      "PA719412",
      "PA721600",
      "PA719952",
      "PA719496",
      "PA719258",
      "PA722228",
      "PA720268",
      "PA720342",
      "PA720178",
      "PA720622",
      "PA718728",
      "PA719592",
      "PA719790"
    ],
    "texteAffichable": "M.&#160;Delpon,  M.&#160;Chalumeau, M.&#160;Damaisin, M.&#160;Simian, Mme&#160;Le Feur, M.&#160;Fi&#233;vet, M.&#160;Leclabart, Mme&#160;Rossi, M.&#160;Duverg&#233;, M.&#160;Mis, M.&#160;Borowczyk, Mme&#160;Le Peih, M.&#160;Garcia, M.&#160;Alauzet, Mme&#160;Bureau-Bonnard, M.&#160;Cabar&#233; et Mme&#160;Vanceunebrock-Mialon"
  },
  "pointeurFragmentTexte": {
    "division": {
      "titre": "Article 26 C",
      "articleDesignationCourte": "APRÈS ART. 26 C",
      "type": "ARTICLE",
      "avantAApres": "Apres",
      "divisionRattachee": "APRÈS L'ARTICLE 26 C, insérer l'article suivant:",
      "articleAdditionnel": "1",
      "urlDivisionTexteVise": "/15/textes/1974.asp#D_Article_26_C"
    }
  },
  "corps": {
    "dispositif": "<p style=\"text-align: justify;\">Dans un d&#233;lai de six mois &#224; compter de la promulgation de la pr&#233;sente loi, le Gouvernement remet au Parlement un rapport sur la d&#233;carbonation et la r&#233;duction des &#233;missions polluantes dans le secteur du transport de marchandises. Ce rapport fait un &#233;tat des lieux des solutions existantes et des actions engag&#233;es. Il pr&#233;sente &#233;galement la strat&#233;gie retenue pour la transition &#233;nerg&#233;tique du secteur du transport de marchandises.</p>",
    "exposeSommaire": "<p style=\"text-align: justify;\">Cet amendement demande au Gouvernement de remettre un rapport au Parlement sur la d&#233;carbonation et la r&#233;duction des &#233;missions polluantes dans le secteur du transport de marchandises.</p>"
  },
  "representations": [
    {
      "nom": "PDF",
      "typeMime": {
        "type": "application",
        "subType": "PDF"
      },
      "statutRepresentation": {
        "verbatim": true,
        "canonique": true,
        "officielle": true,
        "transcription": false,
        "enregistrement": false
      },
      "contenu": {
        "documentURI": "/15/amendements/1974/AN/3480.pdf"
      }
    }
  ],
  "dateDepot": "2019-05-29T02:00:00.000+02:00",
  "dateDistribution": "2019-05-29T02:00:00.000+02:00",
  "article99": "0",
  "loiReference": {}
}