{
  "uid": "AMANR5L15PO59051B0675P0D1N99",
  "identifiant": {
    "legislature": "15",
    "numero": "99",
    "numRect": "0",
    "saisine": {
      "texteLegislatifRef": "PIONANR5L15B0675",
      "numeroPartiePLF": "0",
      "organeExamen": "PO59051",
      "mentionSecondeDeliberation": "0"
    }
  },
  "numeroLong": "CL99",
  "etapeTexte": "1ère lecture (1ère assemblée saisie)",
  "triAmendement": "dd",
  "cardinaliteAmdtMultiples": "1",
  "etat": "Discuté",
  "signataires": {
    "auteur": {
      "typeAuteur": "Depute",
      "acteurRef": "PA721364",
      "groupePolitiqueRef": "PO730964"
    },
    "cosignatairesRefs": [
      "PA721364"
    ],
    "texteAffichable": "M.&#160;Gauvain, rapporteur"
  },
  "pointeurFragmentTexte": {
    "division": {
      "titre": "Article PREMIER",
      "articleDesignationCourte": "ART. PREMIER",
      "type": "ARTICLE",
      "avantAApres": "A",
      "divisionRattachee": "ARTICLE PREMIER",
      "urlDivisionTexteVise": "/15/textes/0675.asp#D_Article_1er"
    },
    "alinea": {
      "avantAApres": "A",
      "numero": "17",
      "alineaDesignation": "Alinéa 17"
    }
  },
  "corps": {
    "dispositif": "<p>Supprimer l'alin&#233;a 17.</p>",
    "exposeSommaire": "<p>L&#8217;article 3 de la directive, qui &#233;num&#232;re les cas de d&#233;tention licite, ne mentionne pas le cas d&#8217;un secret des affaires obtenu par &#171;&#160;l&#8217;exp&#233;rience et les comp&#233;tences acquises de mani&#232;re honn&#234;te dans le cadre de l&#8217;exercice normal de son activit&#233; professionnelle&#160;&#187;. Il convient donc de supprimer cette expression figurant au 3&#176; de l&#8217;article L. 151-2 de la proposition de loi.</p>"
  },
  "representations": [
    {
      "nom": "PDF",
      "typeMime": {
        "type": "application",
        "subType": "PDF"
      },
      "statutRepresentation": {
        "verbatim": true,
        "canonique": true,
        "officielle": true,
        "transcription": false,
        "enregistrement": false
      },
      "contenu": {
        "documentURI": "/15/amendements/0675/CION_LOIS/CL99.pdf"
      }
    }
  ],
  "sort": {
    "dateSaisie": "2018-03-21T10:59:44.000+01:00",
    "sortEnSeance": "Adopté"
  },
  "dateDepot": "2018-03-20T01:00:00.000+01:00",
  "dateDistribution": "2018-03-20T01:00:00.000+01:00",
  "article99": "0",
  "loiReference": {
    "codeLoi": "1"
  }
}