{
  "uid": "AMANR5L15PO59048B1255P1D1N1256",
  "identifiant": {
    "legislature": "15",
    "numero": "1256",
    "numRect": "0",
    "saisine": {
      "texteLegislatifRef": "PRJLANR5L15B1255",
      "numeroPartiePLF": "1",
      "organeExamen": "PO59048",
      "mentionSecondeDeliberation": "0"
    }
  },
  "numeroLong": "I-CF1256",
  "etapeTexte": "1ère lecture (1ère assemblée saisie)",
  "triAmendement": "ibaaaaaaaaaaaaaaaaaaaaaaaaaaaaaaaaaaaaaaaaaaaaaaaau",
  "cardinaliteAmdtMultiples": "1",
  "etat": "Irrecevable",
  "signataires": {
    "auteur": {
      "typeAuteur": "Depute",
      "acteurRef": "PA605963",
      "groupePolitiqueRef": "PO730964"
    },
    "cosignatairesRefs": [
      "PA719890",
      "PA718728",
      "PA720278",
      "PA720198",
      "PA720622",
      "PA605963",
      "PA605518",
      "PA719740"
    ],
    "texteAffichable": "M.&#160;Alauzet,  M.&#160;Colas-Roy, M.&#160;Orphelin, M.&#160;Fran&#231;ois-Michel&#160;Lambert, M.&#160;Galbadon, Mme&#160;Bureau-Bonnard, Mme&#160;Brulebois et Mme&#160;Vanceunebrock-Mialon"
  },
  "pointeurFragmentTexte": {
    "division": {
      "titre": "Article 23",
      "articleDesignationCourte": "APRÈS ART. 23",
      "type": "ARTICLE",
      "avantAApres": "Apres",
      "divisionRattachee": "APRÈS L'ARTICLE 23, insérer l'article suivant:",
      "articleAdditionnel": "1",
      "urlDivisionTexteVise": "/15/textes/1255A.asp#D_Article_23"
    }
  },
  "corps": {
    "dispositif": "<p>I. Apr&#232;s l'article 2334-42 du Code g&#233;n&#233;ral des collectivit&#233;s territoriales est ins&#233;r&#233;e une section 7&#160;\"Dotation de soutien &#224; la transition &#233;nerg&#233;tique locale\" contant&#160;un article 2334-43 ainsi r&#233;dig&#233; :</p><p>\"I. Il est institu&#233; une dotation budg&#233;taire de soutien &#224; la transition &#233;nerg&#233;tique locale en faveur des&#160;collectivit&#233;s territoriales mentionn&#233;es &#224; l'article 2334-32 ou &#224; l'alin&#233;a 1 de l'article 2334-42 du pr&#233;sent code&#160;ayant adopt&#233; un plan climat-air-&#233;nergie territorial conform&#233;ment au&#160;I de l&#8217;article&#160;L.&#160;229&#8209;26 du code de l&#8217;environnement.</p><p>II. Cette dotation est financ&#233;e via&#160;un pr&#233;l&#232;vement sur la dotation de soutien &#224; l'investissement local et dotation d'&#233;quipement des territoires ruraux selon les dispositions du B de l'article 2334-42 et de l'alin&#233;a 9 de l'article 2334-35 du pr&#233;sent code.</p><p>III. Cette dotation est attribu&#233;e forfaitairement aux collectivit&#233;s mentionn&#233;es en I en fonction de leur population et dans la limite de 3 euros par habitant en 2019, 5 euros en 2020, 7 euros en 2021 et 10 euros &#224; partir de 2022. Lorsque que les ressources accumul&#233;es suite aux dispositions&#160;pr&#233;vues en II exc&#233;dents les besoins n&#233;cessaires au versement de la dotation de soutien &#224; la transition &#233;nerg&#233;tique locale, l'int&#233;gralit&#233; du&#160;montant restant est restitu&#233;e aux dotations pr&#233;vues en II proportionnellement &#224; leur contribution au financement de la dotation de soutien &#224; la transition &#233;nerg&#233;tique locale.\"</p><p>II. Au B de l'article 2334-42 du code g&#233;n&#233;ral des collectivit&#233;s territoriales :</p><p>1&#176; Remplacer \"65\" par \"6<span class=\"ins cts-1\"  data-cid=\"12\" data-userid=\"93\" data-username=\"Eric Alauzet\" data-time=\"1538984084678\">2</span><span class=\"del cts-1\"  data-cid=\"2\" data-userid=\"93\" data-username=\"Eric Alauzet\" data-time=\"1538983890793\">4,9</span>\"</p><p>2&#176; Remplacer \"35\" par \"3<span class=\"ins cts-1\"  data-cid=\"13\" data-userid=\"93\" data-username=\"Eric Alauzet\" data-time=\"1538984086464\">2</span><span class=\"del cts-1\"  data-cid=\"4\" data-userid=\"93\" data-username=\"Eric Alauzet\" data-time=\"1538983892730\">4,9</span>\"</p><p>3&#176; Apr&#232;s la premi&#232;re phrase, ins&#233;rer la phrase : \"Une part ne pouvant exc&#233;der <span class=\"del cts-1\"  data-cid=\"6\" data-userid=\"93\" data-username=\"Eric Alauzet\" data-time=\"1538983898484\">0,2</span><span class=\"ins cts-1\"  data-cid=\"28\" data-userid=\"93\" data-username=\"Eric Alauzet\" data-time=\"1538984180279\">6</span>% de la dotation de soutien &#224; l'investissement local&#160;est attribu&#233;e &#224; la dotation d&#233;finie &#224; l'article 2334-43 du pr&#233;sent code. En cas de restitution op&#233;r&#233;e selon les modalit&#233;s du III de l'article 2334-43, le montant restitu&#233; &#224; la dotation de soutien &#224; l'investissement local est r&#233;partie &#224; 50% en fonction de la population des r&#233;gions et du D&#233;partement de Mayotte et &#224; 50% en fonction de la population des communes situ&#233;es dans une unit&#233; urbaine de moins de 50 000 habitants appr&#233;ci&#233;e au 1er janvier 2017.\"</p><p>III. A l'article 2334-35 du code g&#233;n&#233;ral des collectivit&#233;s territoriales :</p><p>1&#176; A l'alin&#233;a 2, remplacer \"50\" par \"4<span class=\"ins cts-1\"  data-cid=\"19\" data-userid=\"93\" data-username=\"Eric Alauzet\" data-time=\"1538984116347\">5</span><span class=\"del cts-1\"  data-cid=\"8\" data-userid=\"93\" data-username=\"Eric Alauzet\" data-time=\"1538983915299\">9,95</span>\"</p><p>2&#176; A l'alin&#233;a 5, remplacer \"50\" par \"4<span class=\"ins cts-1\"  data-cid=\"23\" data-userid=\"93\" data-username=\"Eric Alauzet\" data-time=\"1538984125625\">5</span><span class=\"del cts-1\"  data-cid=\"9\" data-userid=\"93\" data-username=\"Eric Alauzet\" data-time=\"1538983916749\">9,95</span>\"</p><p>3&#176; Apr&#232;s l'alin&#233;a 8, ins&#233;rer l'alin&#233;a : \"Une part ne pouvant exc&#233;der <span class=\"del cts-1\"  data-cid=\"24\" data-userid=\"93\" data-username=\"Eric Alauzet\" data-time=\"1538984172550\">0,</span>1<span class=\"ins cts-1\"  data-cid=\"26\" data-userid=\"93\" data-username=\"Eric Alauzet\" data-time=\"1538984174370\">0</span>% de la dotation d'&#233;quipement des territoires ruraux est attribu&#233;e &#224; la dotation d&#233;finie &#224; l'article 2334-43 du pr&#233;sent code. En cas de restitution op&#233;r&#233;e selon les modalit&#233;s du III de l'article 2334-43, le montant restitu&#233; &#224; la dotation d'&#233;quipement des territoires ruraux est r&#233;partie selon les dispositions 1&#176; et 2&#176; du pr&#233;sent article.\"</p>",
    "exposeSommaire": "<p>Le pr&#233;sent amendement vise &#224; doter les EPCI en charge de l&#8217;&#233;laboration et de la mise en &#339;uvre des PCAET d&#8217;une fraction de la DETR et de la DSIL en cr&#233;ant une dotation sp&#233;cifique.</p><p>Cette dotation est financ&#233;e via deux pr&#233;l&#232;vements pouvant atteindre <span class=\"del cts-1\"  data-cid=\"2\" data-userid=\"93\" data-username=\"Eric Alauzet\" data-time=\"1538984217705\">0,</span>1<span class=\"ins cts-1\"  data-cid=\"4\" data-userid=\"93\" data-username=\"Eric Alauzet\" data-time=\"1538984219972\">0</span>% de la DETR et <span class=\"del cts-1\"  data-cid=\"5\" data-userid=\"93\" data-username=\"Eric Alauzet\" data-time=\"1538984222327\">0,2</span><span class=\"ins cts-1\"  data-cid=\"8\" data-userid=\"93\" data-username=\"Eric Alauzet\" data-time=\"1538984225172\">6</span>% de la DSIL. Elle est plafonn&#233;e est l'int&#233;gralit&#233; le d&#233;passement du plafond de ressources d&#233;clenche un reversement du trop-per&#231;u aux DETR et DSIL.</p><p>Elle&#160;vise &#224; stimuler la mise en &#339;uvre de ces outils particuli&#232;rement utiles &#224; la transition &#233;nerg&#233;tique des territoires et permet de r&#233;compenser les collectivit&#233;s qui ont une d&#233;marche responsable. Financ&#233;e directement sur les DETR et DSIL, la mesure ne diminue pas le financement global des collectivit&#233;s ni n'augmente les d&#233;penses de l'Etat en la mati&#232;re.</p><p>Si un tiers des collectivit&#233;s ayant l&#8217;obligation de mettre en &#339;uvre un PCAET b&#233;n&#233;ficie de cette dotation, cela repr&#233;sentera 60 millions d&#8217;euros en 2019, 100 millions d&#8217;euros en 2020, 140 millions en 2021 et 200 millions en 2022.</p><p>&#160;</p>"
  },
  "representations": [
    {
      "nom": "PDF",
      "typeMime": {
        "type": "application",
        "subType": "PDF"
      },
      "statutRepresentation": {
        "verbatim": true,
        "canonique": true,
        "officielle": true,
        "transcription": false,
        "enregistrement": false
      },
      "contenu": {
        "documentURI": "/15/amendements/1255A/CION_FIN/CF1256.pdf"
      }
    }
  ],
  "dateDepot": "2018-10-05T02:00:00.000+02:00",
  "article99": "0",
  "loiReference": {}
}