{
  "uid": "AMANR5L15SEA717460BTC0106P0D1N363",
  "identifiant": {
    "legislature": "15",
    "numero": "363",
    "numRect": "0",
    "saisine": {
      "texteLegislatifRef": "PRJLANR5L15BTC0106",
      "numeroPartiePLF": "0",
      "organeExamen": "PO717460",
      "mentionSecondeDeliberation": "0"
    }
  },
  "numeroLong": "363",
  "etapeTexte": "1ère lecture (2ème assemblée saisie)",
  "triAmendement": "abro",
  "cardinaliteAmdtMultiples": "1",
  "etat": "Discuté",
  "signataires": {
    "auteur": {
      "typeAuteur": "Depute",
      "acteurRef": "PA609332",
      "groupePolitiqueRef": "PO730946"
    },
    "cosignatairesRefs": [
      "PA609332",
      "PA405480",
      "PA1592",
      "PA1198",
      "PA720988",
      "PA1008",
      "PA333285",
      "PA643145"
    ],
    "texteAffichable": "M.&#160;Faure,  M.&#160;Alain&#160;David, Mme&#160;Laurence&#160;Dumont, M.&#160;Garot, M.&#160;David&#160;Habib, Mme&#160;Manin, M.&#160;Pupponi et Mme&#160;Vainqueur-Christophe"
  },
  "pointeurFragmentTexte": {
    "division": {
      "titre": "Article 2",
      "articleDesignationCourte": "APRÈS ART. 2",
      "type": "ARTICLE",
      "avantAApres": "Apres",
      "divisionRattachee": "APRÈS L'ARTICLE 2, insérer l'article suivant:",
      "articleAdditionnel": "1",
      "urlDivisionTexteVise": "/15/textes/0106.asp#D_Article_2"
    }
  },
  "corps": {
    "dispositif": "<p style=\"text-align: justify;\">Apr&#232;s l&#8217;article&#160;1<sup>er</sup> de la loi n&#176;&#160;2010&#8209;838 du 23 juillet 2010 relative &#224; l&#8217;application du cinqui&#232;me alin&#233;a de l&#8217;article&#160;13 de la Constitution, est ins&#233;r&#233; un article&#160;1&#160;<i>bis</i> ainsi r&#233;dig&#233;&#160;:</p><p style=\"text-align: justify;\">&#171;&#160;<i>Art.&#160;1</i>&#160;bis.&#160;&#8211;&#160;Pr&#233;alablement &#224; l&#8217;audition mentionn&#233;e &#224; l&#8217;article pr&#233;c&#233;dent, l&#8217;administration fiscale adresse &#224; la commission permanente comp&#233;tente une attestation constatant que la personne dont la nomination est envisag&#233;e satisfait ou non aux obligation de d&#233;claration et de paiement des imp&#244;ts dont elle est redevable.&#160;&#187;</p>",
    "exposeSommaire": "<p style=\"text-align: justify;\">Cet amendement vise &#224; s&#8217;assurer que les personnes dont la nomination est envisag&#233;e, au titre de l&#8217;article&#160;13 de la Constitution, satisfont &#224; leurs obligations de d&#233;claration et de paiement des imp&#244;ts. Il s&#8217;agit l&#224; d&#8217;une information n&#233;cessaire pour appr&#233;cier la qualit&#233; de la personnalit&#233; appel&#233;e &#224; exercer de haute fonction au service de l&#8217;&#201;tat.</p>"
  },
  "representations": [
    {
      "nom": "PDF",
      "typeMime": {
        "type": "application",
        "subType": "PDF"
      },
      "statutRepresentation": {
        "verbatim": true,
        "canonique": true,
        "officielle": true,
        "transcription": false,
        "enregistrement": false
      },
      "contenu": {
        "documentURI": "/15/amendements/0106/AN/363.pdf"
      }
    }
  ],
  "seanceDiscussion": "RUANR5L15S2017IDS20628",
  "sort": {
    "dateSaisie": "2017-07-25T21:42:33.000+02:00",
    "sortEnSeance": "Rejeté"
  },
  "dateDepot": "2017-07-21T02:00:00.000+02:00",
  "dateDistribution": "2017-07-22T02:00:00.000+02:00",
  "article99": "0",
  "loiReference": {
    "codeLoi": "loi 2010-838",
    "divisionCodeLoi": "1 bis"
  }
}