{
  "uid": "AMANR5L15SEA717460BTC0971P0D1N2863",
  "identifiant": {
    "legislature": "15",
    "numero": "2863",
    "numRect": "0",
    "saisine": {
      "texteLegislatifRef": "PRJLANR5L15BTC0971",
      "numeroPartiePLF": "0",
      "organeExamen": "PO717460",
      "mentionSecondeDeliberation": "0"
    }
  },
  "numeroLong": "2863",
  "etapeTexte": "1ère lecture (1ère assemblée saisie)",
  "triAmendement": "hzknzzzw",
  "cardinaliteAmdtMultiples": "1",
  "etat": "Discuté",
  "signataires": {
    "auteur": {
      "typeAuteur": "Depute",
      "acteurRef": "PA718710",
      "groupePolitiqueRef": "PO730964"
    },
    "cosignatairesRefs": [
      "PA718710"
    ],
    "texteAffichable": "Mme&#160;Pascale&#160;Boyer"
  },
  "pointeurFragmentTexte": {
    "division": {
      "titre": "Article 62 ter",
      "articleDesignationCourte": "APRÈS ART. 62 TER",
      "type": "ARTICLE",
      "avantAApres": "Apres",
      "divisionRattachee": "APRÈS L'ARTICLE 62 TER, insérer l'article suivant:",
      "articleAdditionnel": "1",
      "urlDivisionTexteVise": "/15/textes/0971.asp#D_Article_62_ter"
    }
  },
  "corps": {
    "dispositif": "<p style=\"text-align: justify;\">&#192; L&#8217;article L.&#160;122&#8209;3 du code de l&#8217;urbanisme, apr&#232;s le mot : &#171;&#160;nationale&#160;&#187;, sont ins&#233;r&#233;s les mots : &#171;&#160;, au fonctionnement des r&#233;seaux de communications &#233;lectroniques&#160;&#187;.</p>",
    "exposeSommaire": "<p style=\"text-align: justify;\">Port&#233; par l&#8217;Association nationale des &#233;lus de montagne, cet amendement vise &#224; cr&#233;er en zone de montagne, une d&#233;rogation sp&#233;cifique &#224; l&#8217;obligation de construction en continuit&#233; pour les pyl&#244;nes des r&#233;seaux de communications &#233;lectroniques. En effet, la mise en &#339;uvre de l&#8217;accord sur la couverture mobile va n&#233;cessiter l&#8217;implantation d&#8217;ici 2020 de nouvelles antennes relais (jusqu&#8217;&#224; 5&#160;000 par op&#233;rateur) en particulier dans les zones les moins denses du territoire. Or, en zone de montagne, le code de l&#8217;urbanisme freine la construction de pyl&#244;nes, en dehors des zones urbanis&#233;es, du fait du principe de continuit&#233; d&#8217;urbanisation (article L.&#160;122&#8209;5 du code de l&#8217;urbanisme). &#192; ce jour, il peut &#234;tre d&#233;rog&#233; &#224; ce principe pour des motifs de &#171;&#160;n&#233;cessit&#233; technique imp&#233;rative&#160;&#187;. Dans les faits, peu d&#8217;antennes-relais ont pu b&#233;n&#233;ficier de cette d&#233;rogation dont l&#8217;interpr&#233;tation varie sur le territoire. D&#8217;o&#249; l&#8217;int&#233;r&#234;t du pr&#233;sent amendement qui apporte une garantie juridique &#224; ce type de d&#233;rogation.</p>"
  },
  "representations": [
    {
      "nom": "PDF",
      "typeMime": {
        "type": "application",
        "subType": "PDF"
      },
      "statutRepresentation": {
        "verbatim": true,
        "canonique": true,
        "officielle": true,
        "transcription": false,
        "enregistrement": false
      },
      "contenu": {
        "documentURI": "/15/amendements/0971/AN/2863.pdf"
      }
    }
  ],
  "seanceDiscussion": "RUANR5L15S2018IDS21139",
  "sort": {
    "dateSaisie": "2018-06-09T02:50:11.000+02:00",
    "sortEnSeance": "Non soutenu"
  },
  "dateDepot": "2018-05-26T02:00:00.000+02:00",
  "dateDistribution": "2018-06-01T02:00:00.000+02:00",
  "article99": "0",
  "loiReference": {
    "codeLoi": "c urbanisme",
    "divisionCodeLoi": "L122-3"
  }
}