{
  "uid": "AMANR5L15SEA717460BTC2206P0D1N99",
  "identifiant": {
    "legislature": "15",
    "numero": "99",
    "numRect": "0",
    "saisine": {
      "texteLegislatifRef": "PRJLANR5L15BTC2206",
      "numeroPartiePLF": "0",
      "organeExamen": "PO717460",
      "mentionSecondeDeliberation": "0"
    }
  },
  "numeroLong": "99",
  "etapeTexte": "Nouvelle Lecture",
  "triAmendement": "adiaaaaaaaaaaaaaaaaaaaaaaaaaaaaaaaaaaaaaaaaaaaaaaaaazo",
  "cardinaliteAmdtMultiples": "1",
  "etat": "Discuté",
  "signataires": {
    "auteur": {
      "typeAuteur": "Depute",
      "acteurRef": "PA330909",
      "groupePolitiqueRef": "PO730934"
    },
    "cosignatairesRefs": [
      "PA1874",
      "PA720586",
      "PA2155",
      "PA607090",
      "PA267429",
      "PA346218",
      "PA266776",
      "PA267785",
      "PA608016",
      "PA608416",
      "PA720644",
      "PA642847",
      "PA718780",
      "PA1012",
      "PA721968",
      "PA606712",
      "PA267204",
      "PA334654",
      "PA720386",
      "PA340853",
      "PA709315",
      "PA643134",
      "PA722390",
      "PA767",
      "PA720210",
      "PA712015",
      "PA267260",
      "PA330909",
      "PA718838",
      "PA719318",
      "PA721314",
      "PA267735",
      "PA718884",
      "PA267527"
    ],
    "texteAffichable": "M.&#160;Descoeur,  M.&#160;Sermier, M.&#160;Schellenberger, Mme&#160;Bazin-Malgras, Mme&#160;Anthoine, Mme&#160;Poletti, Mme&#160;Beauvais, M.&#160;Lurton, M.&#160;Vialay, M.&#160;Hetzel, M.&#160;Brun, Mme&#160;Corneloup, M.&#160;Straumann, M.&#160;Reiss, Mme&#160;Valentin, M.&#160;Dive, M.&#160;Vatin, M.&#160;de la Verpilli&#232;re, M.&#160;de Ganay, M.&#160;Di Filippo, M.&#160;Jean-Pierre&#160;Vigier, M.&#160;Leclerc, M.&#160;Saddier, M.&#160;Bazin, M.&#160;Viala, M.&#160;Menuel, M.&#160;Larriv&#233;, M.&#160;Le Fur, M.&#160;Nury, M.&#160;Masson, Mme&#160;Louwagie, M.&#160;Cinieri, Mme&#160;Trastour-Isnart et M.&#160;Cattin"
  },
  "pointeurFragmentTexte": {
    "division": {
      "titre": "Article PREMIER",
      "articleDesignationCourte": "ART. PREMIER",
      "type": "ARTICLE",
      "avantAApres": "A",
      "divisionRattachee": "ARTICLE PREMIER",
      "urlDivisionTexteVise": "/15/textes/2206.asp#D_Article_1er"
    },
    "alinea": {
      "avantAApres": "Apres",
      "numero": "5"
    }
  },
  "corps": {
    "dispositif": "<p>Apr&#232;s l&#8217;alin&#233;a&#160;5, ins&#233;rer l&#8217;alin&#233;a suivant&#160;:</p><p style=\"text-align: justify;\">&#171;&#160;Les zones rurales et de montagne &#233;loign&#233;es des grandes m&#233;tropoles sont identifi&#233;es comme prioritaires en mati&#232;re d&#8217;investissement dans la programmation des infrastructures.&#160;&#187;</p>",
    "exposeSommaire": "<p>Il est pr&#233;vu &#224; travers cet amendement que les zones rurales et de montagne &#233;loign&#233;es des grandes m&#233;tropoles soient consid&#233;r&#233;es comme prioritaires en mati&#232;re d&#8217;investissement.</p>"
  },
  "representations": [
    {
      "nom": "PDF",
      "typeMime": {
        "type": "application",
        "subType": "PDF"
      },
      "statutRepresentation": {
        "verbatim": true,
        "canonique": true,
        "officielle": true,
        "transcription": false,
        "enregistrement": false
      },
      "contenu": {
        "documentURI": "/15/amendements/2206/AN/99.pdf"
      }
    }
  ],
  "seanceDiscussion": "RUANR5L15S2019IDS21801",
  "sort": {
    "dateSaisie": "2019-09-10T19:35:47.000+02:00",
    "sortEnSeance": "Rejeté"
  },
  "dateDepot": "2019-09-05T02:00:00.000+02:00",
  "dateDistribution": "2019-09-09T02:00:00.000+02:00",
  "article99": "0",
  "loiReference": {}
}