{
  "uid": "AMANR5L15PO59048B0235P2D1N588",
  "identifiant": {
    "legislature": "15",
    "numero": "588",
    "numRect": "0",
    "saisine": {
      "texteLegislatifRef": "PRJLANR5L15B0235",
      "numeroPartiePLF": "2",
      "organeExamen": "PO59048",
      "mentionSecondeDeliberation": "0"
    }
  },
  "numeroLong": "II-CF588",
  "etapeTexte": "1ère lecture (1ère assemblée saisie)",
  "triAmendement": "dro",
  "cardinaliteAmdtMultiples": "1",
  "etat": "Discuté",
  "signataires": {
    "auteur": {
      "typeAuteur": "Depute",
      "acteurRef": "PA336175",
      "groupePolitiqueRef": "PO723569"
    },
    "cosignatairesRefs": [
      "PA605694",
      "PA608292",
      "PA336175"
    ],
    "texteAffichable": "Mme&#160;Pinel,  Mme&#160;Dubi&#233; et M.&#160;Falorni"
  },
  "pointeurFragmentTexte": {
    "division": {
      "titre": "Article 39",
      "articleDesignationCourte": "ART. 39",
      "type": "ARTICLE",
      "avantAApres": "A",
      "divisionRattachee": "ARTICLE 39",
      "urlDivisionTexteVise": "/15/textes/0235C.asp#D_Article_39"
    },
    "alinea": {
      "numero": "4"
    }
  },
  "corps": {
    "dispositif": "<p style=\"text-align: justify;\">I.&#160;&#8211;&#160;Supprimer les alin&#233;as 4 et 5.</p><p style=\"text-align: justify;\">II.&#160;&#8211;&#160;Compl&#233;ter cet article par l&#8217;alin&#233;a suivant&#160;:</p><p style=\"text-align: justify;\">&#171;&#160;II.&#160;&#8211;&#160;La perte de recettes pour l&#8217;&#201;tat est compens&#233;e &#224; due concurrence par la cr&#233;ation d&#8217;une taxe additionnelle aux droits mentionn&#233;s aux articles 575 et 575 A du code g&#233;n&#233;ral des imp&#244;ts.</p>",
    "exposeSommaire": "<p style=\"text-align: justify;\">Si cet article entend proroger le dispositif &#171;&#160;Pinel&#160;&#187; pour une dur&#233;e de quatre ans, ce qui est une bonne chose pour le secteur, le recentrage pr&#233;vu uniquement dans les zones tendues entrainera un recul dans la poursuite de la relance de la construction constat&#233;e depuis ces derni&#232;res ann&#233;es. En effet, une telle mesure se traduira par une baisse de plus de 10&#160;000 &#224; 15&#160;000 mises en chantier dans le locatif priv&#233; en raison de l&#8217;exclusion de la zone B2 du dispositif.</p><p style=\"text-align: justify;\">Or, l&#8217;objectif du dispositif est de stimuler la construction de logements neufs dans les zones tendues, de faciliter l&#8217;investissement des Fran&#231;ais dans l&#8217;immobilier locatif neuf, sans compter qu&#8217;il va falloir mettre en place une transition suffisamment longue pour prendre en compte tous les projets, quels que soient leur stade de d&#233;veloppement. Il est par ailleurs important de tenir compte des sp&#233;cificit&#233;s des territoires et notamment des zones littorales ou de montagne qui connaissent un co&#251;t du foncier important li&#233; &#224; l&#8217;&#233;conomie touristique.</p><p style=\"text-align: justify;\">Afin de ne pas p&#233;naliser la capacit&#233; d&#8217;investissement de tous les Fran&#231;ais dans tous les territoires et de ne pas engendrer une crise dans la demande de logements, mais &#233;galement de maintenir l&#8217;effet de relance de la construction que le dispositif a permis et attest&#233; par les chiffres, ces alin&#233;as doivent &#234;tre supprim&#233;s.</p>"
  },
  "representations": [
    {
      "nom": "PDF",
      "typeMime": {
        "type": "application",
        "subType": "PDF"
      },
      "statutRepresentation": {
        "verbatim": true,
        "canonique": true,
        "officielle": true,
        "transcription": false,
        "enregistrement": false
      },
      "contenu": {
        "documentURI": "/15/amendements/0235C/CION_TOUTE/CF588.pdf"
      }
    }
  ],
  "sort": {
    "dateSaisie": "2017-11-09T09:35:58.000+01:00",
    "sortEnSeance": "Rejeté"
  },
  "dateDepot": "2017-11-06T01:00:00.000+01:00",
  "dateDistribution": "2017-11-09T01:00:00.000+01:00",
  "article99": "0",
  "loiReference": {}
}