{
  "uid": "AMANR5L15PO766718B2187P0D1N514",
  "identifiant": {
    "legislature": "15",
    "numero": "514",
    "numRect": "0",
    "saisine": {
      "texteLegislatifRef": "PRJLANR5L15B2187",
      "numeroPartiePLF": "0",
      "organeExamen": "PO766718",
      "mentionSecondeDeliberation": "0"
    }
  },
  "numeroLong": "514",
  "etapeTexte": "1ère lecture (1ère assemblée saisie)",
  "triAmendement": "haaaaaaaaaaaaaaaaaaaaaaaaaaaaaaaaaaaaaaaaaaaaaaaaabzo",
  "cardinaliteAmdtMultiples": "1",
  "etat": "Discuté",
  "signataires": {
    "auteur": {
      "typeAuteur": "Depute",
      "acteurRef": "PA608416",
      "groupePolitiqueRef": "PO730934"
    },
    "cosignatairesRefs": [
      "PA608416"
    ],
    "texteAffichable": "M.&#160;Hetzel"
  },
  "pointeurFragmentTexte": {
    "division": {
      "titre": "Article 19",
      "articleDesignationCourte": "APRÈS ART. 19",
      "type": "ARTICLE",
      "avantAApres": "Apres",
      "divisionRattachee": "APRÈS L'ARTICLE 19, insérer l'article suivant:",
      "articleAdditionnel": "1",
      "urlDivisionTexteVise": "/15/textes/2187.asp#D_Article_19"
    }
  },
  "corps": {
    "dispositif": "<p style=\"text-align: justify;\">Le troisi&#232;me alin&#233;a de l&#8217;article L.&#160;2131&#8209;4-1 du code la de sant&#233; publique est supprim&#233;.</p>",
    "exposeSommaire": "<p style=\"text-align: justify;\">Cet amendement supprime la l&#233;gislation qui r&#233;git le dispositif du b&#233;b&#233;-m&#233;dicament ou &#171;&#160;double DPI&#160;&#187;</p>"
  },
  "representations": [
    {
      "nom": "PDF",
      "typeMime": {
        "type": "application",
        "subType": "PDF"
      },
      "statutRepresentation": {
        "verbatim": true,
        "canonique": true,
        "officielle": true,
        "transcription": false,
        "enregistrement": false
      },
      "contenu": {
        "documentURI": "/15/amendements/2187/CSBIOETH/514.pdf"
      }
    }
  ],
  "sort": {
    "dateSaisie": "2019-09-13T20:22:31.000+02:00",
    "sortEnSeance": "Rejeté"
  },
  "dateDepot": "2019-09-02T02:00:00.000+02:00",
  "dateDistribution": "2019-09-13T02:00:00.000+02:00",
  "article99": "0",
  "loiReference": {
    "codeLoi": "c santé publique",
    "divisionCodeLoi": "L2131-4-1"
  }
}