{
  "uid": "AMANR5L15PO420120B1681P0D1N436",
  "identifiant": {
    "legislature": "15",
    "numero": "436",
    "numRect": "0",
    "saisine": {
      "texteLegislatifRef": "PRJLANR5L15B1681",
      "numeroPartiePLF": "0",
      "organeExamen": "PO420120",
      "mentionSecondeDeliberation": "0"
    }
  },
  "numeroLong": "AS436",
  "etapeTexte": "1ère lecture (1ère assemblée saisie)",
  "triAmendement": "boaaaaaaaaaaaaaaaaaaaaaaaaaaaaaaaaaaaaaaaaaaaaaaaashap",
  "cardinaliteAmdtMultiples": "1",
  "etat": "Discuté",
  "signataires": {
    "auteur": {
      "typeAuteur": "Depute",
      "acteurRef": "PA722312",
      "groupePolitiqueRef": "PO730964"
    },
    "cosignatairesRefs": [
      "PA720622",
      "PA718728",
      "PA720038",
      "PA722000",
      "PA720814",
      "PA721398",
      "PA722312",
      "PA719480",
      "PA721434",
      "PA719326",
      "PA720342",
      "PA719592",
      "PA722366",
      "PA719890",
      "PA721784",
      "PA606639",
      "PA719294",
      "PA721888"
    ],
    "texteAffichable": "Mme&#160;Bessot Ballot,  Mme&#160;Josso, Mme&#160;Lardet, Mme&#160;Brulebois, M.&#160;Simian, Mme&#160;Degois, M.&#160;Vignal, Mme&#160;Gomez-Bassac, Mme&#160;Gipson, M.&#160;Fugit, Mme&#160;Vanceunebrock-Mialon, Mme&#160;Le Peih, Mme&#160;Clapot, M.&#160;Cazenove, M.&#160;Gaillard, M.&#160;Raphan, Mme&#160;Bureau-Bonnard et M.&#160;Buchou"
  },
  "pointeurFragmentTexte": {
    "division": {
      "titre": "Article 7",
      "articleDesignationCourte": "ART. 7",
      "type": "ARTICLE",
      "avantAApres": "A",
      "divisionRattachee": "ARTICLE 7",
      "urlDivisionTexteVise": "/15/textes/1681.asp#D_Article_7"
    },
    "alinea": {
      "numero": "11"
    }
  },
  "corps": {
    "dispositif": "<p style=\"text-align: justify;\">Apr&#232;s le mot&#160;: </p><p style=\"text-align: justify;\">&#171;&#160;territoire&#160;&#187;</p><p style=\"text-align: justify;\">r&#233;diger ainsi la fin de l&#8217;alin&#233;a&#160;11&#160;:</p><p style=\"text-align: justify;\">&#171;&#160;&#224; la suite d&#8217;une &#233;valuation men&#233;e par le conseil territorial de sant&#233;. Les modalit&#233;s d&#8217;&#233;valuation sont fix&#233;es par d&#233;cret.&#160;&#187;&#160;;&#160;&#187;.</p>",
    "exposeSommaire": "<p style=\"text-align: justify;\">L&#8217;article&#160;158 de la loi du 26 janvier 2016 de modernisation de notre syst&#232;me de sant&#233; a institu&#233; des territoires de d&#233;mocratie sanitaire et sur chacun d&#8217;eux la Constitution d&#8217;un conseil territorial de sant&#233; (CTS).</p><p style=\"text-align: justify;\">Le conseil territorial de sant&#233; peut adresser toute proposition pour am&#233;liorer la r&#233;ponse aux besoins de la population sur son territoire, notamment sur l&#8217;organisation des parcours de sant&#233;.</p><p style=\"text-align: justify;\">Ainsi,<b> afin d&#8217;accroitre l&#8217;investissement des instances de d&#233;mocratie en sant&#233;, cet amendement vise &#224; renforcer le r&#244;le du Conseil territorial de sant&#233; en lui donnant une mission d&#8217;&#233;valuation dans le cadre de l&#8217;approbation du PTS par le directeur g&#233;n&#233;ral de l&#8217;agence r&#233;gionale de sant&#233;.</b></p>"
  },
  "representations": [
    {
      "nom": "PDF",
      "typeMime": {
        "type": "application",
        "subType": "PDF"
      },
      "statutRepresentation": {
        "verbatim": true,
        "canonique": true,
        "officielle": true,
        "transcription": false,
        "enregistrement": false
      },
      "contenu": {
        "documentURI": "/15/amendements/1681/CION-SOC/AS436.pdf"
      }
    }
  ],
  "sort": {
    "dateSaisie": "2019-03-13T12:19:09.000+01:00",
    "sortEnSeance": "Retiré"
  },
  "dateDepot": "2019-03-07T01:00:00.000+01:00",
  "dateDistribution": "2019-03-12T01:00:00.000+01:00",
  "article99": "0",
  "loiReference": {
    "codeLoi": "4"
  }
}