{
  "uid": "AMANR5L15SEA717460B2272P2D1N2047",
  "identifiant": {
    "legislature": "15",
    "numero": "2047",
    "numRect": "0",
    "saisine": {
      "texteLegislatifRef": "PRJLANR5L15B2272",
      "numeroPartiePLF": "2",
      "organeExamen": "PO717460",
      "mentionSecondeDeliberation": "1"
    }
  },
  "numeroLong": "II-2047",
  "etapeTexte": "1ère lecture (1ère assemblée saisie)",
  "triAmendement": "faaaaaaaaaaaaaaaaaaaaaaaaaaaaaaaaaaaaaaaaaaaaaaaaaaby",
  "cardinaliteAmdtMultiples": "1",
  "etat": "Discuté",
  "signataires": {
    "auteur": {
      "typeAuteur": "Depute",
      "acteurRef": "PA942",
      "groupePolitiqueRef": "PO759900"
    },
    "cosignatairesRefs": [
      "PA721194",
      "PA336175",
      "PA336439",
      "PA605694",
      "PA405480",
      "PA331582",
      "PA719138",
      "PA720996",
      "PA267042",
      "PA942",
      "PA608292",
      "PA333421",
      "PA719146"
    ],
    "texteAffichable": "M.&#160;Charles&#160;de Courson,  M.&#160;Castellani, M.&#160;Pupponi, M.&#160;Philippe&#160;Vigier, M.&#160;Acquaviva, M.&#160;Cl&#233;ment, Mme&#160;Dubi&#233;, Mme&#160;Fr&#233;d&#233;rique&#160;Dumas, M.&#160;El Guerrab, M.&#160;Falorni, M.&#160;Favennec Becot, M.&#160;Pancher et Mme&#160;Pinel"
  },
  "pointeurFragmentTexte": {
    "division": {
      "titre": "Article 50",
      "articleDesignationCourte": "ART. 50",
      "type": "ARTICLE",
      "avantAApres": "A",
      "divisionRattachee": "ARTICLE 50",
      "urlDivisionTexteVise": "/15/textes/2272C.asp#D_Article_50"
    }
  },
  "corps": {
    "dispositif": "<p style=\"text-align: justify;\">Supprimer cet article.</p><p>&#160;</p>",
    "exposeSommaire": "<p style=\"text-align: justify;\">Le projet de loi de finances pour 2020 entend abaisser de 60&#160;% &#224; 40&#160;% le taux de d&#233;fiscalisation pour les dons d&#8217;entreprises &#224; destination d&#8217;organismes reconnus d&#8217;int&#233;r&#234;t g&#233;n&#233;ral, pour les versements sup&#233;rieurs &#224; 2 millions d&#8217;euros.&#160;</p><p style=\"text-align: justify;\">Dans un contexte de baisse des subventions et apr&#232;s une r&#233;forme sur la taxe d&#8217;apprentissage qui tronquent le budget des grandes &#233;coles et des universit&#233;s, le secteur de l&#8217;enseignement sup&#233;rieur craint que son mod&#232;le &#233;conomique ne se fragilise une nouvelle fois. Rappelons &#233;galement que le passage de l&#8217;ISF &#224; l&#8217;IFI avait d&#233;j&#224; provoqu&#233; un recul des dons aux &#233;coles de pr&#232;s de 4&#160;% entre 2017 et 2018.</p><p style=\"text-align: justify;\">Or, ce m&#233;c&#233;nat d&#8217;entreprises, notamment par le biais de fondations, permet au secteur de l&#8217;enseignement sup&#233;rieur de mener &#224; bien ses missions en faveur de l&#8217;int&#233;r&#234;t g&#233;n&#233;ral. Ce rabot aurait un impact n&#233;gatif &#224; la fois sur les &#233;tudiants, sur le d&#233;veloppement de la recherche et, en cons&#233;quence, sur la comp&#233;titivit&#233; de la France &#224; l&#8217;international.</p><p style=\"text-align: justify;\">En effet, les principaux b&#233;n&#233;ficiaires de ces actions de m&#233;c&#233;nat sont les &#233;tudiants. Pour les &#233;tablissements d&#8217;enseignement sup&#233;rieur, les dons d&#8217;entreprises permettent de financer des bourses et des dispositifs de soutien pour les &#233;tudiants, notamment les plus pr&#233;caires. Les dons permettent de favoriser &#224; la fois l&#8217;ouverture sociale, la diversit&#233;, l&#8217;accompagnement des &#233;tudiants en situation de handicap et la mobilit&#233; internationale.</p><p style=\"text-align: justify;\">D&#8217;autre part, le m&#233;c&#233;nat d&#8217;entreprises finance la recherche et l&#8217;innovation et contribue au rayonnement de la France &#224; l&#8217;international. Ce mode de financement permet de recruter des enseignants-chercheurs et d&#8217;inviter des professeurs &#233;trangers mais aussi de placer la France au centre des innovations p&#233;dagogiques et soci&#233;tales.</p><p style=\"text-align: justify;\">Au regard de l&#8217;enjeu majeur que repr&#233;sente le m&#233;c&#233;nat pour les &#233;tablissements de l&#8217;enseignement sup&#233;rieur, il est donc propos&#233; de supprimer cet article.</p>"
  },
  "representations": [
    {
      "nom": "PDF",
      "typeMime": {
        "type": "application",
        "subType": "PDF"
      },
      "statutRepresentation": {
        "verbatim": true,
        "canonique": true,
        "officielle": true,
        "transcription": false,
        "enregistrement": false
      },
      "contenu": {
        "documentURI": "/15/amendements/2272C/AN/2047.pdf"
      }
    }
  ],
  "seanceDiscussion": "RUANR5L15S2020IDS21924",
  "sort": {
    "dateSaisie": "2019-11-15T12:31:08.000+01:00",
    "sortEnSeance": "Rejeté"
  },
  "dateDepot": "2019-11-06T01:00:00.000+01:00",
  "dateDistribution": "2019-11-15T01:00:00.000+01:00",
  "article99": "0",
  "loiReference": {}
}