{
  "uid": "AMANR5L15PO59048B0235P1D1N452",
  "identifiant": {
    "legislature": "15",
    "numero": "452",
    "numRect": "0",
    "saisine": {
      "texteLegislatifRef": "PRJLANR5L15B0235",
      "numeroPartiePLF": "1",
      "organeExamen": "PO59048",
      "mentionSecondeDeliberation": "0"
    }
  },
  "numeroLong": "I-CF452",
  "etapeTexte": "1ère lecture (1ère assemblée saisie)",
  "triAmendement": "cbwki",
  "cardinaliteAmdtMultiples": "1",
  "etat": "Discuté",
  "signataires": {
    "auteur": {
      "typeAuteur": "Depute",
      "acteurRef": "PA721636",
      "groupePolitiqueRef": "PO730934"
    },
    "cosignatairesRefs": [
      "PA721636"
    ],
    "texteAffichable": "M.&#160;Parigi"
  },
  "pointeurFragmentTexte": {
    "division": {
      "titre": "Article 3",
      "articleDesignationCourte": "ART. 3",
      "type": "ARTICLE",
      "avantAApres": "A",
      "divisionRattachee": "ARTICLE 3",
      "urlDivisionTexteVise": "/15/textes/0235A.asp#D_Article_3"
    },
    "alinea": {
      "avantAApres": "A",
      "numero": "45",
      "alineaDesignation": "Alinéa 45"
    }
  },
  "corps": {
    "dispositif": "<p style=\"text-align: justify;\">I.&#160;&#8211;&#160;Substituer aux alin&#233;as 45 &#224; 48 l&#8217;alin&#233;a suivant&#160;:</p><p style=\"text-align: justify;\">&#171;&#160;L&#8217;article&#160;1641 du code g&#233;n&#233;ral des imp&#244;ts est abrog&#233;.&#160;&#187;</p><p style=\"text-align: justify;\">II.&#160;&#8211;&#160;Compl&#233;ter cet article par l&#8217;alin&#233;a suivant&#160;:</p><p style=\"text-align: justify;\">&#171;&#160;II.&#160;&#8211;&#160;La perte de recettes pour l&#8217;&#201;tat est compens&#233;e &#224; due concurrence par la cr&#233;ation d&#8217;une taxe additionnelle aux droits mentionn&#233;s aux articles 575 et 575 A du code g&#233;n&#233;ral des imp&#244;ts.&#160;&#187;</p>",
    "exposeSommaire": "<p style=\"text-align: justify;\">D&#8217;exon&#233;rations en exon&#233;rations, de d&#233;gr&#232;vements en d&#233;gr&#232;vements, les gouvernements successifs ont sans cesse r&#233;duit la fiscalit&#233; locale ces derni&#232;res ann&#233;es. S&#8217;ajoute &#224; cela des transferts de comp&#233;tence non compens&#233;s, des cr&#233;ations ou extensions de comp&#233;tences qui ne le sont pas non plus, la baisse de la DGF ainsi que toutes les d&#233;cisions qui ne concernent pas directement les collectivit&#233;s mais qui ont un impact, parfois tr&#232;s important, sur leur budget. On peut citer comme exemple les d&#233;cisions relatives aux normes techniques d&#8217;accessibilit&#233; aux transports ou aux &#233;tablissements recevant du public. D&#232;s lors, les collectivit&#233;s participent &#224; l&#8217;assainissement des finances publiques bien au del&#224; de leur part de responsabilit&#233; dans le d&#233;ficit public et dans la dette. Il apparait donc juste que l&#8217;&#201;tat prenne &#224; son compte les frais de d&#233;gr&#232;vement qu&#8217;il &#224; lui m&#234;me d&#233;cider au titre de sa politique fiscale, ainsi que les frais d&#8217;assiette et de recouvrement qui se justifiaient lorsque la fiscalit&#233; locale &#233;tait une r&#233;alit&#233;.</p>"
  },
  "representations": [
    {
      "nom": "PDF",
      "typeMime": {
        "type": "application",
        "subType": "PDF"
      },
      "statutRepresentation": {
        "verbatim": true,
        "canonique": true,
        "officielle": true,
        "transcription": false,
        "enregistrement": false
      },
      "contenu": {
        "documentURI": "/15/amendements/0235A/CION_FIN/CF452.pdf"
      }
    }
  ],
  "sort": {
    "dateSaisie": "2017-10-11T11:07:28.000+02:00",
    "sortEnSeance": "Non soutenu"
  },
  "dateDepot": "2017-10-06T02:00:00.000+02:00",
  "dateDistribution": "2017-10-10T02:00:00.000+02:00",
  "article99": "0",
  "loiReference": {}
}