{
  "uid": "AMANR5L15PO420120B0904P0D1N554",
  "identifiant": {
    "legislature": "15",
    "numero": "554",
    "numRect": "0",
    "saisine": {
      "texteLegislatifRef": "PRJLANR5L15B0904",
      "numeroPartiePLF": "0",
      "organeExamen": "PO420120",
      "mentionSecondeDeliberation": "0"
    }
  },
  "numeroLong": "AS554",
  "etapeTexte": "1ère lecture (1ère assemblée saisie)",
  "triAmendement": "be",
  "cardinaliteAmdtMultiples": "1",
  "etat": "Irrecevable",
  "signataires": {
    "auteur": {
      "typeAuteur": "Depute",
      "acteurRef": "PA643145",
      "groupePolitiqueRef": "PO730946"
    },
    "cosignatairesRefs": [
      "PA643145"
    ],
    "texteAffichable": "Mme&#160;Vainqueur-Christophe"
  },
  "pointeurFragmentTexte": {
    "division": {
      "titre": "Article PREMIER",
      "articleDesignationCourte": "APRÈS ART. PREMIER",
      "type": "ARTICLE",
      "avantAApres": "Apres",
      "divisionRattachee": "APRÈS L'ARTICLE PREMIER, insérer l'article suivant:",
      "articleAdditionnel": "1",
      "urlDivisionTexteVise": "/15/textes/0904.asp#D_Article_1er"
    }
  },
  "corps": {
    "dispositif": "<p style=\"text-align: justify;\">I.&#160;&#8211;&#160;Apr&#232;s l&#8217;article 200 octies du Code g&#233;n&#233;ral des imp&#244;ts est ins&#233;r&#233; un article ainsi r&#233;dig&#233;&#160;:</p><p style=\"text-align: justify;\">&#171;&#160;Article 200 nonies&#160;&#8211;</p><p style=\"text-align: justify;\">&#171;&#160;Les contribuables actifs domicili&#233;s en France au sens de l'article 4 B du code g&#233;n&#233;ral des imp&#244;ts peuvent b&#233;n&#233;ficier d'un cr&#233;dit d'imp&#244;t sur le revenu au titre des d&#233;penses pour les actions de formation effectivement support&#233;es &#224; titre personnel au 31 d&#233;cembre de l'ann&#233;e d'imposition, d&#232;s lors qu&#8217;elles sont r&#233;alis&#233;es dans le cadre d&#8217;un abondement &#224; leur compte personnel d&#8217;activit&#233; &#224; compter de la date d&#8217;application de la pr&#233;sente loi.</p><p style=\"text-align: justify;\">&#171;&#160;Ce cr&#233;dit d&#8217;imp&#244;t s&#8217;applique&#160;:</p><p style=\"text-align: justify;\">&#171;&#160;1&#176; Aux investissements consentis entre le 1er janvier et le 31 d&#233;cembre de l&#8217;ann&#233;e fiscale n-1&#160;;</p><p style=\"text-align: justify;\">&#171;&#160;2&#176; &#192; hauteur de 50&#160;% des d&#233;penses pour les actions de formations r&#233;alis&#233;es et dans la limite d&#8217;un plafond global de versements annuels &#233;gal &#224; 12&#160;000&#160;&#8364;&#160;;</p><p style=\"text-align: justify;\">&#171;&#160;3&#176; Sous r&#233;serve que le contribuable soit en mesure de pr&#233;senter &#224; la demande de l&#8217;administration fiscale une attestation de formation.</p><p style=\"text-align: justify;\">&#171;&#160;Le cr&#233;dit d'imp&#244;t est imput&#233; sur l'imp&#244;t sur le revenu apr&#232;s imputation des r&#233;ductions d'imp&#244;t mentionn&#233;es aux articles 199 quater C &#224; 200 bis, des cr&#233;dits d'imp&#244;t et des pr&#233;l&#232;vements ou retenues non lib&#233;ratoires. S'il exc&#232;de l'imp&#244;t d&#251;, l'exc&#233;dent est restitu&#233;.&#160;&#187;</p><p style=\"text-align: justify;\">II.&#160;&#8211;&#160;La perte de recettes pour l&#8217;&#201;tat est compens&#233;e &#224; due concurrence par la cr&#233;ation d&#8217;une taxe additionnelle aux droits mentionn&#233;s aux articles 575 et 575 A du code g&#233;n&#233;ral des imp&#244;ts.&#160;</p>",
    "exposeSommaire": "<p style=\"text-align: justify;\">Cet amendement vise &#224; instaurer un cr&#233;dit d&#8217;imp&#244;t formation de 50&#160;% pour les actifs qui font le choix d&#8217;abonder leur compte personnel d&#8217;activit&#233; pour pouvoir suivre une formation professionnelle.</p><p style=\"text-align: justify;\">Il s&#8217;agit d&#8217;un dispositif incitatif ayant vocation &#224; encourager cet investissement personnel au caract&#232;re strat&#233;gique, tant pour l&#8217;individu que pour la France qui souffre d&#8217;une p&#233;nurie des comp&#233;tences et forme deux fois moins d&#8217;actifs que les pays voisins. Or les pays de l&#8217;Union&#160;europ&#233;enne en pointe dans la formation ont tous instaur&#233; avec succ&#232;s ce cr&#233;dit d&#8217;imp&#244;t.</p><p style=\"text-align: justify;\">Ce m&#233;canisme simple, attractif et lisible est &#224; la main des individus pour encourager leur engagement dans une d&#233;marche de renforcement de leur employabilit&#233;. Il intervient en compl&#233;ment du CPF r&#233;nov&#233; par la pr&#233;sente loi, afin de faciliter son activation.</p><p style=\"text-align: justify;\">A l&#8217;instar du cr&#233;dit d&#8217;imp&#244;t accord&#233; aux d&#233;penses pour l&#8217;emploi &#224; domicile, le plafond global des d&#233;penses est fix&#233;, dans une limite annuelle, &#224; 12&#160;000&#160;euros. Cela permet aussi d&#8217;encourager les individus &#224; poursuivre des formations longues.</p><p style=\"text-align: justify;\">Il p&#232;se de mani&#232;re raisonnable sur les finances publiques au regard des enjeux de croissance et d&#8217;attractivit&#233; en France li&#233;s &#224; son d&#233;ficit de comp&#233;tences, et va permettre de capitaliser sur une augmentation &#224; terme du PIB rendue possible par l&#8217;augmentation de l&#8217;acc&#232;s &#224; la formation.</p>"
  },
  "representations": [
    {
      "nom": "PDF",
      "typeMime": {
        "type": "application",
        "subType": "PDF"
      },
      "statutRepresentation": {
        "verbatim": true,
        "canonique": true,
        "officielle": true,
        "transcription": false,
        "enregistrement": false
      },
      "contenu": {
        "documentURI": "/15/amendements/0904/CION-SOC/AS554.pdf"
      }
    }
  ],
  "dateDepot": "2018-05-25T02:00:00.000+02:00",
  "dateDistribution": "2018-05-26T02:00:00.000+02:00",
  "article99": "0",
  "loiReference": {
    "codeLoi": "impôts",
    "divisionCodeLoi": "200 octies"
  }
}