{
  "uid": "AMANR5L15SEA717460B1255P2D2N15",
  "identifiant": {
    "legislature": "15",
    "numero": "15",
    "numRect": "0",
    "saisine": {
      "texteLegislatifRef": "PRJLANR5L15B1255",
      "numeroPartiePLF": "2",
      "organeExamen": "PO717460",
      "mentionSecondeDeliberation": "0"
    }
  },
  "numeroLong": "II-15",
  "etapeTexte": "1ère lecture (1ère assemblée saisie)",
  "triAmendement": "elaaaaaaaaaaaaaaaaaaaaaaaaaaaaaaaaaaaaaaaaaaaaaaaai",
  "cardinaliteAmdtMultiples": "1",
  "etat": "Discuté",
  "signataires": {
    "auteur": {
      "typeAuteur": "Gouvernement"
    },
    "texteAffichable": "le Gouvernement"
  },
  "pointeurFragmentTexte": {
    "missionVisee": {
      "idMissionAN": "520",
      "libelleMission": "Sécurités",
      "codeMissionPLF": "B",
      "libelleMissionPLF": "Répartition, par mission et programme, des crédits du budget général"
    },
    "division": {
      "titre": "ÉTAT B",
      "articleDesignationCourte": "ART. 39",
      "type": "ANNEXE",
      "avantAApres": "A",
      "divisionRattachee": "ARTICLE 39",
      "urlDivisionTexteVise": "/15/textes/1255D.asp#D_ETAT_B"
    }
  },
  "corps": {
    "exposeSommaire": "<p style=\"text-align: justify;\">Cet amendement prend en compte les &#233;l&#233;ments suivants&#160;:</p><p style=\"text-align: justify;\">&#160;</p><p style=\"text-align: justify;\">1)&#160;&#160;&#160; Afin de tenir compte des votes intervenus dans le cadre de l&#8217;examen du projet de loi de finances pour 2019, le pr&#233;sent amendement proc&#232;de &#224; une minoration de 19&#160;367&#160;303&#160;&#8364; des autorisations d&#8217;engagement et de 19&#160;367&#160;303&#160;&#8364; des cr&#233;dits de paiement de la mission &#171;&#160;S&#233;curit&#233;s&#160;&#187;. Cette minoration est r&#233;partie de la fa&#231;on suivante :</p><p style=\"text-align: justify;\">-&#160;une minoration de 7&#160;958&#160;358&#160;&#8364; en autorisations d&#8217;engagement et de 7&#160;958&#160;358&#160;&#8364; en cr&#233;dits de paiement du programme &#171;&#160;Police nationale&#160;&#187;&#160;;</p><p style=\"text-align: justify;\">-&#160;une minoration de 9&#160;500&#160;136&#160;&#8364; en autorisations d&#8217;engagement et de 9&#160;500&#160;136&#160;&#8364; en cr&#233;dits de paiement du programme &#171;&#160;Gendarmerie nationale&#160;&#187;&#160;;</p><p style=\"text-align: justify;\">-&#160;une minoration de 254&#160;015&#160;&#8364; en autorisations d&#8217;engagement et de 254&#160;015&#160;&#8364; en cr&#233;dits de paiement du programme &#171;&#160;S&#233;curit&#233; et &#233;ducation routi&#232;res&#160;&#187;&#160;;</p><p style=\"text-align: justify;\">-&#160;une minoration de 1&#160;654&#160;794&#160;&#8364; en autorisations d&#8217;engagement et de 1&#160;654&#160;794&#160;&#8364; en cr&#233;dits de paiement du programme &#171;&#160;S&#233;curit&#233; civile&#160;&#187;&#160;;</p><p style=\"text-align: justify;\">2)&#160;&#160;&#160; Cet amendement vise &#224; tirer les cons&#233;quences sur la mission &#171;&#160;S&#233;curit&#233;s&#160;&#187; des d&#233;cisions annonc&#233;es lors du rendez-vous salarial du 18 juin 2018, concernant d&#8217;une part la revalorisation des indemnit&#233;s kilom&#233;triques et d&#8217;autre part de la revalorisation des bar&#232;mes des frais de nuit&#233;e. &#192; cette fin, il convient de majorer de 7&#160;552&#160;051&#160;&#8364; les autorisations d&#8217;engagement et de 7&#160;552&#160;051&#160;&#8364; les cr&#233;dits de paiement de la mission &#171; S&#233;curit&#233;s &#187;. Ce changement se d&#233;compose ainsi&#160;:</p><p style=\"text-align: justify;\">-&#160;majoration de 6&#160;067&#160;750&#160;&#8364; des autorisations d&#8217;engagement et de 6&#160;067&#160;750&#160;&#8364; des cr&#233;dits de paiement du programme &#171;&#160;Police nationale&#160;&#187;&#160;;</p><p style=\"text-align: justify;\">-&#160;majoration de 911&#160;230&#160;&#8364; des autorisations d&#8217;engagement et de 911&#160;230&#160;&#8364; des cr&#233;dits de paiement du programme &#171;&#160;Gendarmerie nationale&#160;&#187;&#160;;</p><p style=\"text-align: justify;\">-&#160;majoration de 573&#160;071&#160;&#8364; des autorisations d&#8217;engagement et de 573&#160;071&#160;&#8364; des cr&#233;dits de paiement du programme &#171;&#160;S&#233;curit&#233; et &#233;ducation routi&#232;res&#160;&#187;.</p>",
    "cartoucheDelaiDepotDepasse": "Sous réserve de son traitement par les services de l'Assemblée nationale et de sa recevabilité",
    "dispositifAmdtCredit": {
      "listeProgrammes": [
        {
          "libelle": "Police nationale",
          "id": "51092",
          "AE": {
            "montantPositif": "0",
            "montantNegatif": "1890608"
          },
          "CP": {
            "montantPositif": "0",
            "montantNegatif": "1890608"
          },
          "action": "modification"
        },
        {
          "libelle": "Gendarmerie nationale",
          "id": "51093",
          "AE": {
            "montantPositif": "0",
            "montantNegatif": "8588906"
          },
          "CP": {
            "montantPositif": "0",
            "montantNegatif": "8588906"
          },
          "action": "modification"
        },
        {
          "libelle": "Sécurité et éducation routières",
          "id": "51094",
          "AE": {
            "montantPositif": "319056",
            "montantNegatif": "0"
          },
          "CP": {
            "montantPositif": "319056",
            "montantNegatif": "0"
          },
          "action": "modification"
        },
        {
          "libelle": "Sécurité civile",
          "id": "51095",
          "AE": {
            "montantPositif": "0",
            "montantNegatif": "1654794"
          },
          "CP": {
            "montantPositif": "0",
            "montantNegatif": "1654794"
          },
          "action": "modification"
        }
      ],
      "totalAE": {
        "montantPositif": "319056",
        "montantNegatif": "12134308",
        "solde": "-11815252"
      },
      "totalCP": {
        "montantPositif": "319056",
        "montantNegatif": "12134308",
        "solde": "-11815252"
      }
    }
  },
  "representations": [
    {
      "nom": "PDF",
      "typeMime": {
        "type": "application",
        "subType": "PDF"
      },
      "statutRepresentation": {
        "verbatim": true,
        "canonique": true,
        "officielle": true,
        "transcription": false,
        "enregistrement": false
      },
      "contenu": {
        "documentURI": "/15/amendements/1255D/AN/15.pdf"
      }
    }
  ],
  "seanceDiscussion": "RUANR5L15S2019IDS21345",
  "sort": {
    "dateSaisie": "2018-11-16T21:21:50.000+01:00",
    "sortEnSeance": "Adopté"
  },
  "dateDepot": "2018-11-16T01:00:00.000+01:00",
  "dateDistribution": "2018-11-16T01:00:00.000+01:00",
  "article99": "0",
  "loiReference": {}
}