{
  "uid": "AMANR5L15SEA717460BTC0857P0D1N442",
  "identifiant": {
    "legislature": "15",
    "numero": "442",
    "numRect": "0",
    "saisine": {
      "texteLegislatifRef": "PRJLANR5L15BTC0857",
      "numeroPartiePLF": "0",
      "organeExamen": "PO717460",
      "mentionSecondeDeliberation": "0"
    }
  },
  "numeroLong": "442",
  "etapeTexte": "1ère lecture (1ère assemblée saisie)",
  "triAmendement": "bp",
  "cardinaliteAmdtMultiples": "1",
  "etat": "Discuté",
  "signataires": {
    "auteur": {
      "typeAuteur": "Depute",
      "acteurRef": "PA346218",
      "groupePolitiqueRef": "PO730934"
    },
    "cosignatairesRefs": [
      "PA330240",
      "PA718884",
      "PA721314",
      "PA267378",
      "PA642847",
      "PA721286",
      "PA346218",
      "PA718850",
      "PA608416",
      "PA267429",
      "PA608016",
      "PA334654",
      "PA266774",
      "PA1874"
    ],
    "texteAffichable": "M.&#160;Masson,  M.&#160;Bazin, Mme&#160;Bazin-Malgras, M.&#160;Cinieri, M.&#160;Cordier, M.&#160;Hetzel, M.&#160;Le Fur, Mme&#160;Levy, Mme&#160;Louwagie, M.&#160;Ramadier, M.&#160;Ciotti, M.&#160;Furst, M.&#160;Schellenberger et M.&#160;Straumann"
  },
  "pointeurFragmentTexte": {
    "division": {
      "titre": "Article 11",
      "articleDesignationCourte": "ART. 11",
      "type": "ARTICLE",
      "avantAApres": "A",
      "divisionRattachee": "ARTICLE 11",
      "urlDivisionTexteVise": "/15/textes/0857.asp#D_Article_11"
    },
    "alinea": {
      "avantAApres": "Apres",
      "numero": "4"
    }
  },
  "corps": {
    "dispositif": "<p style=\"text-align: justify;\">Apr&#232;s&#160;l&#8217;alin&#233;a&#160;4, ins&#233;rer l&#8217;alin&#233;a suivant&#160;:</p><p style=\"text-align: justify;\">&#171;&#160;1&#176; <i>bis</i>. &#8211; Aux 7&#176; et 8&#176; du m&#234;me I, les mots&#160;: &#171;&#160;depuis plus de trois mois&#160;&#187; sont supprim&#233;s&#160;;&#160;&#187;.</p>",
    "exposeSommaire": "<p style=\"text-align: justify;\">Dans une mati&#232;re o&#249; les d&#233;lais sont un enjeu majeur de r&#233;ussite d&#8217;une politique migratoire et d&#8217;asile &#224; la fois conforme aux valeurs de la R&#233;publique et protectrice de la soci&#233;t&#233; comme de l&#8217;Etat, il n&#8217;y a pas lieu d&#8217;imposer aux autorit&#233;s comp&#233;tentes de d&#233;lai minimum de r&#233;sidence s&#8217;agissant d&#8217;une menace pour l&#8217;ordre public ou de la commission d&#8217;une infraction par un &#233;tranger.</p>"
  },
  "representations": [
    {
      "nom": "PDF",
      "typeMime": {
        "type": "application",
        "subType": "PDF"
      },
      "statutRepresentation": {
        "verbatim": true,
        "canonique": true,
        "officielle": true,
        "transcription": false,
        "enregistrement": false
      },
      "contenu": {
        "documentURI": "/15/amendements/0857/AN/442.pdf"
      }
    }
  ],
  "seanceDiscussion": "RUANR5L15S2018IDS21026",
  "sort": {
    "dateSaisie": "2018-04-21T00:03:08.000+02:00",
    "sortEnSeance": "Rejeté"
  },
  "dateDepot": "2018-04-12T02:00:00.000+02:00",
  "dateDistribution": "2018-04-16T02:00:00.000+02:00",
  "article99": "0",
  "loiReference": {}
}