{
  "uid": "AMANR5L15SEA717460BTC0124P0D1N64",
  "identifiant": {
    "legislature": "15",
    "numero": "64",
    "numRect": "0",
    "saisine": {
      "texteLegislatifRef": "PRJLANR5L15BTC0124",
      "numeroPartiePLF": "0",
      "organeExamen": "PO717460",
      "mentionSecondeDeliberation": "0"
    }
  },
  "numeroLong": "64",
  "etapeTexte": "Nouvelle Lecture",
  "triAmendement": "azs",
  "cardinaliteAmdtMultiples": "1",
  "etat": "Discuté",
  "signataires": {
    "auteur": {
      "typeAuteur": "Depute",
      "acteurRef": "PA267440",
      "groupePolitiqueRef": "PO730934"
    },
    "cosignatairesRefs": [
      "PA267440"
    ],
    "texteAffichable": "M.&#160;Diard"
  },
  "pointeurFragmentTexte": {
    "division": {
      "titre": "Article 9",
      "articleDesignationCourte": "ART. 9",
      "type": "ARTICLE",
      "avantAApres": "A",
      "divisionRattachee": "ARTICLE 9",
      "urlDivisionTexteVise": "/15/textes/0124.asp#D_Article_9"
    }
  },
  "corps": {
    "dispositif": "<p style=\"text-align: justify;\">Supprimer cet article.</p>",
    "exposeSommaire": "<p style=\"text-align: justify;\">Au cours des d&#233;bats sur la discussion de l&#8217;actuel projet de loi organique, le gouvernement a fait part de sa volont&#233; de mettre fin &#224; la r&#233;serve parlementaire.</p><p style=\"text-align: justify;\">Or, de&#160;nombreux t&#233;moignages &#224; propos de cette r&#233;serve ont permis d&#8217;attester qu&#8217;elle est un des nombreux outils de p&#233;r&#233;quation de l&#8217;&#201;tat au profit des collectivit&#233;s locales et aux associations, et ce, gr&#226;ce &#224; la connaissance des parlementaires du tissu associatif et local de leurs circonscriptions, qui en ont fait un outil efficace.</p><p style=\"text-align: justify;\">En plus d&#8217;&#234;tre efficace -on ne compte plus les projets d&#8217;int&#233;r&#234;t g&#233;n&#233;ral qui ont vu le jour gr&#226;ce &#224; la m&#233;diation des d&#233;put&#233;s et de la r&#233;serve parlementaire- cette r&#233;serve est transparente, car les sommes allou&#233;es et leurs b&#233;n&#233;ficiaires figurent sur une liste d&#233;taill&#233;e et rendue publique chaque ann&#233;e.</p><p style=\"text-align: justify;\">Suite &#224; ces arguments,&#160;le Gouvernement a sagement choisi de promettre la mise en place d&#8217;un dispositif de remplacement ou de compensation de la r&#233;serve parlementaire. Or, malheureusement, ces promesses n&#8217;ont &#233;t&#233; traduites par aucune proposition gouvernementale ou majoritaire dans le pr&#233;sent projet de loi. La commission mixte paritaire, qui avait pourtant trouv&#233; un accord sur le projet de loi ordinaire, a &#233;chou&#233; &#224; trouver un texte commun pour le pr&#233;sent projet.</p><p style=\"text-align: justify;\">C&#8217;est pourquoi cet amendement demande la suppression de l&#8217;article&#160;9, dans l&#8217;attente de la pr&#233;sentation d&#8217;une alternative cr&#233;dible sur le devenir de la r&#233;serve parlementaire.</p>"
  },
  "representations": [
    {
      "nom": "PDF",
      "typeMime": {
        "type": "application",
        "subType": "PDF"
      },
      "statutRepresentation": {
        "verbatim": true,
        "canonique": true,
        "officielle": true,
        "transcription": false,
        "enregistrement": false
      },
      "contenu": {
        "documentURI": "/15/amendements/0124/AN/64.pdf"
      }
    }
  ],
  "seanceDiscussion": "RUANR5L15S2017IDS20658",
  "sort": {
    "dateSaisie": "2017-08-03T19:04:57.000+02:00",
    "sortEnSeance": "Non soutenu"
  },
  "dateDepot": "2017-08-02T02:00:00.000+02:00",
  "dateDistribution": "2017-08-03T02:00:00.000+02:00",
  "article99": "0",
  "loiReference": {}
}