{
  "uid": "AMANR5L15PO420120B0904P0D1N543",
  "identifiant": {
    "legislature": "15",
    "numero": "543",
    "numRect": "0",
    "saisine": {
      "texteLegislatifRef": "PRJLANR5L15B0904",
      "numeroPartiePLF": "0",
      "organeExamen": "PO420120",
      "mentionSecondeDeliberation": "0"
    }
  },
  "numeroLong": "AS543",
  "etapeTexte": "1ère lecture (1ère assemblée saisie)",
  "triAmendement": "ps",
  "cardinaliteAmdtMultiples": "1",
  "etat": "Discuté",
  "signataires": {
    "auteur": {
      "typeAuteur": "Depute",
      "acteurRef": "PA267318",
      "groupePolitiqueRef": "PO730934"
    },
    "cosignatairesRefs": [
      "PA642847",
      "PA267318",
      "PA606712",
      "PA722390",
      "PA608016"
    ],
    "texteAffichable": "M.&#160;Grelier,  Mme&#160;Louwagie, M.&#160;Lurton, Mme&#160;Corneloup et M.&#160;Bazin"
  },
  "pointeurFragmentTexte": {
    "division": {
      "titre": "Article 4",
      "articleDesignationCourte": "ART. 4",
      "type": "ARTICLE",
      "avantAApres": "A",
      "divisionRattachee": "ARTICLE 4",
      "urlDivisionTexteVise": "/15/textes/0904.asp#D_Article_4"
    },
    "alinea": {
      "avantAApres": "A",
      "numero": "25",
      "alineaDesignation": "Alinéa 25"
    }
  },
  "corps": {
    "dispositif": "<p style=\"text-align: justify;\">R&#233;diger ainsi l&#8217;alin&#233;a&#160;25&#160;: </p><p style=\"text-align: justify;\">&#171;&#160;La dur&#233;e de l&#8217;autorisation d&#8217;absence du salari&#233; pour la r&#233;alisation d&#8217;un bilan de comp&#233;tences ne peut exc&#233;der vingt-quatre heures du temps de travail cons&#233;cutives ou non.&#160;&#187;</p>",
    "exposeSommaire": "<p>L'amendement pr&#233;sent vise &#224; clarifier la confusion install&#233;e entre la dur&#233;e de la prestation et la dur&#233;e d'absence d'un salari&#233; de son poste de travail autoris&#233;e pour r&#233;aliser le bilan de comp&#233;tences.</p><p>La loi doit prot&#233;ger et garantir la dur&#233;e d'absence maximale du salari&#233; de son poste de travail pour r&#233;aliser le bilan de comp&#233;tences.</p>"
  },
  "representations": [
    {
      "nom": "PDF",
      "typeMime": {
        "type": "application",
        "subType": "PDF"
      },
      "statutRepresentation": {
        "verbatim": true,
        "canonique": true,
        "officielle": true,
        "transcription": false,
        "enregistrement": false
      },
      "contenu": {
        "documentURI": "/15/amendements/0904/CION-SOC/AS543.pdf"
      }
    }
  ],
  "sort": {
    "dateSaisie": "2018-05-30T00:54:28.000+02:00",
    "sortEnSeance": "Retiré"
  },
  "dateDepot": "2018-05-25T02:00:00.000+02:00",
  "dateDistribution": "2018-05-26T02:00:00.000+02:00",
  "article99": "0",
  "loiReference": {}
}