{
  "uid": "AMANR5L15SEA717460B0235P1D1N368",
  "identifiant": {
    "legislature": "15",
    "numero": "368",
    "numRect": "0",
    "saisine": {
      "texteLegislatifRef": "PRJLANR5L15B0235",
      "numeroPartiePLF": "1",
      "organeExamen": "PO717460",
      "mentionSecondeDeliberation": "0"
    }
  },
  "numeroLong": "I-368",
  "etapeTexte": "1ère lecture (1ère assemblée saisie)",
  "triAmendement": "zhu",
  "cardinaliteAmdtMultiples": "1",
  "etat": "Discuté",
  "signataires": {
    "auteur": {
      "typeAuteur": "Depute",
      "acteurRef": "PA712015",
      "groupePolitiqueRef": "PO730934"
    },
    "cosignatairesRefs": [
      "PA719946",
      "PA607090",
      "PA267735",
      "PA718884",
      "PA608016",
      "PA718850",
      "PA712015",
      "PA605036",
      "PA721286",
      "PA609726",
      "PA709315",
      "PA332523",
      "PA345722",
      "PA642847",
      "PA720644",
      "PA719318",
      "PA267429",
      "PA721474"
    ],
    "texteAffichable": "M.&#160;Dive,  M.&#160;Cinieri, M.&#160;Cordier, M.&#160;Nury, Mme&#160;Dalloz, M.&#160;Viala, M.&#160;Jean-Pierre&#160;Vigier, Mme&#160;Anthoine, Mme&#160;Bazin-Malgras, Mme&#160;Louwagie, M.&#160;Viry, M.&#160;Ramadier, M.&#160;Abad, M.&#160;Aubert, M.&#160;Bazin, M.&#160;Peltier, M.&#160;de Ganay et Mme&#160;Le Grip"
  },
  "pointeurFragmentTexte": {
    "division": {
      "titre": "Article 9",
      "articleDesignationCourte": "ART. 9",
      "type": "ARTICLE",
      "avantAApres": "A",
      "divisionRattachee": "ARTICLE 9",
      "urlDivisionTexteVise": "/15/textes/0235A.asp#D_Article_9"
    },
    "alinea": {
      "numero": "3"
    }
  },
  "corps": {
    "dispositif": "<p>&#160;R&#233;diger ainsi la quatre-vingt-quatorzi&#232;me ligne du tableau de l&#8217;alin&#233;a&#160;3&#160;:</p><table style=\"border-collapse: collapse;\"><tbody><tr><td style=\"white-space: normal; border: 1px solid #000000; text-align: center;\">&#160;Super&#233;thanol E85 destin&#233; &#224; &#234;tre utilis&#233;<br />comme carburant</td><td style=\"white-space: normal; border: 1px solid #000000; text-align: center;\">55</td><td style=\"white-space: normal; border: 1px solid #000000; text-align: center;\">Hectolitre</td><td style=\"white-space: normal; border: 1px solid #000000; text-align: center;\">9,41</td><td style=\"white-space: normal; border: 1px solid #000000; text-align: center;\">9,41</td><td style=\"white-space: normal; border: 1px solid #000000; text-align: center;\">9,41</td><td style=\"white-space: normal; border: 1px solid #000000; text-align: center;\">9,41</td><td style=\"white-space: normal; border: 1px solid #000000; text-align: center;\">9,41</td></tr></tbody></table><p>&#160;</p>",
    "exposeSommaire": "<p style=\"text-align: justify;\">Le gouvernement fait du pouvoir d&#8217;achat une des priorit&#233;s de son action, et il souhaite &#233;galement orienter le choix des Fran&#231;ais sur des motorisations autres que Diesel. Les v&#233;hicules roulant au super&#233;thanol (E85) pr&#233;sentent une alternative en raison d&#8217;un bilan CO2 plus favorable que les carburants classiques, ainsi qu&#8217;une faible &#233;mission d&#8217;oxydes d&#8217;azote et de particules.</p><p style=\"text-align: justify;\">Pour ces raisons, la transition &#233;nerg&#233;tique ne doit pas &#234;tre que punitive. Ainsi, cet amendement vise &#224; maintenir le montant des taxes sur le super&#233;thanol au niveau de celui qui &#233;tait en vigueur en 2017.</p>"
  },
  "representations": [
    {
      "nom": "PDF",
      "typeMime": {
        "type": "application",
        "subType": "PDF"
      },
      "statutRepresentation": {
        "verbatim": true,
        "canonique": true,
        "officielle": true,
        "transcription": false,
        "enregistrement": false
      },
      "contenu": {
        "documentURI": "/15/amendements/0235A/AN/368.pdf"
      }
    }
  ],
  "seanceDiscussion": "RUANR5L15S2018IDS20769",
  "sort": {
    "dateSaisie": "2017-10-21T18:41:15.000+02:00",
    "sortEnSeance": "Rejeté"
  },
  "dateDepot": "2017-10-12T02:00:00.000+02:00",
  "dateDistribution": "2017-10-16T02:00:00.000+02:00",
  "article99": "0",
  "loiReference": {}
}