{
  "uid": "AMANR5L15PO59048B0911P0D1N53",
  "identifiant": {
    "legislature": "15",
    "numero": "53",
    "numRect": "0",
    "saisine": {
      "texteLegislatifRef": "PRJLANR5L15B0911",
      "numeroPartiePLF": "0",
      "organeExamen": "PO59048",
      "mentionSecondeDeliberation": "0"
    }
  },
  "numeroLong": "CF53",
  "etapeTexte": "1ère lecture (1ère assemblée saisie)",
  "triAmendement": "btr",
  "cardinaliteAmdtMultiples": "1",
  "etat": "Discuté",
  "signataires": {
    "auteur": {
      "typeAuteur": "Depute",
      "acteurRef": "PA942",
      "groupePolitiqueRef": "PO744425"
    },
    "cosignatairesRefs": [
      "PA942",
      "PA720230",
      "PA331582",
      "PA712014"
    ],
    "texteAffichable": "M.&#160;Charles&#160;de Courson,  M.&#160;Ledoux, M.&#160;Philippe&#160;Vigier et Mme&#160;Magnier"
  },
  "pointeurFragmentTexte": {
    "division": {
      "titre": "Article 2",
      "articleDesignationCourte": "APRÈS ART. 2",
      "type": "ARTICLE",
      "avantAApres": "Apres",
      "divisionRattachee": "APRÈS L'ARTICLE 2, insérer l'article suivant:",
      "articleAdditionnel": "1",
      "urlDivisionTexteVise": "/15/textes/0911.asp#D_Article_2"
    }
  },
  "corps": {
    "dispositif": "<p style=\"text-align: justify;\">A l&#8217;alin&#233;a&#160;18 de l&#8217;article&#160;34 de la Constitution&#160;:</p><p style=\"text-align: justify;\">I. Apr&#232;s les mots &#171;&#160;de l&#8217;&#201;tat&#160;&#187;, sont ins&#233;r&#233;s les mots&#160;:&#171;&#160;, pr&#233;sentent les recettes et les d&#233;penses budg&#233;taires en une section de fonctionnement et une section d&#8217;investissement&#160;&#187;</p><p style=\"text-align: justify;\">II. L&#8217;alin&#233;a est compl&#233;t&#233; par la phrase suivante&#160;: &#171;&#160;A compter de l&#8217;exercice 2022, cette section de fonctionnement ne peut pas &#234;tre pr&#233;sent&#233;e, vot&#233;e et ex&#233;cut&#233;e en d&#233;ficit. En cas de situation d&#8217;urgence exceptionnelle qui &#233;chappe au contr&#244;le de l&#8217;&#201;tat et qui compromet durablement l&#8217;&#233;quilibre des finances publiques, un retour &#224; l&#8217;&#233;quilibre de fonctionnement doit intervenir dans un d&#233;lai raisonnable&#160;&#187;.</p>",
    "exposeSommaire": "<p style=\"text-align: justify;\">Dans sa loi de programmation des finances publiques 2018&#8209;2022, le Gouvernement pr&#233;voit en 2022 un solde structurel de -0,8 points de PIB et un solde public effectif de -0,2 points, soit un retour &#224; un quasi &#233;quilibre des finances publiques.</p><p style=\"text-align: justify;\">Aussi cet amendement pr&#233;voit d&#8217;inscrire dans la Constitution une &#171;&#160;r&#232;gle d&#8217;or&#160;&#187; pour la section de fonctionnement afin de garantir la durabilit&#233; des finances publiques. Il est propos&#233; que le budget de l&#8217;&#201;tat soit vot&#233; &#224; l&#8217;&#233;quilibre pour sa section de fonctionnement. Cette pr&#233;sentation des recettes et des d&#233;penses budg&#233;taires en section de fonctionnement et d&#8217;investissement est pr&#233;vu en annexe aux projets de loi de finances par le 3&#176; de l&#8217;article&#160;51 de la Loi Organique relative aux lois de finances. Il conviendra de modifier cette loi organique pour mieux mettre en avant ces sections de fonctionnement et d&#8217;investissement dans le projet de loi de finances afin de pouvoir la voter.</p><p style=\"text-align: justify;\">Il convient &#233;galement de d&#233;finir en loi organique la notion de d&#233;lai raisonnable.</p><p style=\"text-align: justify;\">Le projet de loi de finances initiale pour 2018 pr&#233;voyait un d&#233;ficit de la section de fonctionnement de 63,4 milliards d&#8217;euros en 2018, soit un effort restant de 15 milliards d&#8217;euros chaque ann&#233;e pour arriver &#224; l&#8217;&#233;quilibre de fonctionnement en 2022.</p>"
  },
  "representations": [
    {
      "nom": "PDF",
      "typeMime": {
        "type": "application",
        "subType": "PDF"
      },
      "statutRepresentation": {
        "verbatim": true,
        "canonique": true,
        "officielle": true,
        "transcription": false,
        "enregistrement": false
      },
      "contenu": {
        "documentURI": "/15/amendements/0911/CION_FIN/CF53.pdf"
      }
    }
  ],
  "sort": {
    "dateSaisie": "2018-06-20T11:52:18.000+02:00",
    "sortEnSeance": "Rejeté"
  },
  "dateDepot": "2018-06-15T02:00:00.000+02:00",
  "dateDistribution": "2018-06-19T02:00:00.000+02:00",
  "article99": "0",
  "loiReference": {
    "codeLoi": "Constitution",
    "divisionCodeLoi": "34"
  }
}