{
  "uid": "AMANR5L15SEA717460BTC1767P0D1N1072",
  "identifiant": {
    "legislature": "15",
    "numero": "1072",
    "numRect": "0",
    "saisine": {
      "texteLegislatifRef": "PRJLANR5L15BTC1767",
      "numeroPartiePLF": "0",
      "organeExamen": "PO717460",
      "mentionSecondeDeliberation": "0"
    }
  },
  "numeroLong": "1072",
  "etapeTexte": "1ère lecture (1ère assemblée saisie)",
  "triAmendement": "paaaaaaaaaaaaaaaaaaaaaaaaaaaaaaaaaaaaaaaaaaaaaaaaaaae",
  "cardinaliteAmdtMultiples": "1",
  "etat": "Irrecevable",
  "signataires": {
    "auteur": {
      "typeAuteur": "Depute",
      "acteurRef": "PA330684",
      "groupePolitiqueRef": "PO730934"
    },
    "cosignatairesRefs": [
      "PA330684"
    ],
    "texteAffichable": "Mme&#160;Val&#233;rie&#160;Boyer"
  },
  "pointeurFragmentTexte": {
    "division": {
      "titre": "Article 23",
      "articleDesignationCourte": "APRÈS ART. 23",
      "type": "ARTICLE",
      "avantAApres": "Apres",
      "divisionRattachee": "APRÈS L'ARTICLE 23, insérer l'article suivant:",
      "articleAdditionnel": "1",
      "urlDivisionTexteVise": "/15/textes/1767.asp#D_Article_23"
    }
  },
  "corps": {
    "dispositif": "<p style=\"text-align: justify;\">Les 1&#176; &#224; 3&#176; de l&#8217;article 226-14 du code p&#233;nal sont remplac&#233;s par cinq alin&#233;as ainsi r&#233;dig&#233;s :</p><p>&#171; 1&#176; Dans les cas o&#249; la loi impose d&#8217;alerter le procureur de la R&#233;publique :</p><p>&#171; Tout professionnel d&#233;sign&#233; au pr&#233;sent alin&#233;a qui, dans l&#8217;exercice de ses fonctions, suspecte des violences physiques, psychologiques ou sexuelles de toute nature, y compris les mutilations sexuelles &#224; l&#8217;encontre d&#8217;un mineur ou d&#8217;une personne qui n&#8217;est pas en mesure de se prot&#233;ger en raison de son &#226;ge ou de son incapacit&#233; physique ou psychique ou d&#8217;un &#233;tat de grossesse, est tenu, sans avoir &#224; recueillir l&#8217;accord de quiconque, d&#8217;en informer sans d&#233;lai le procureur de la R&#233;publique. Les professionnels d&#233;sign&#233;s pour une obligation de signaler au procureur de la R&#233;publique sont tous les m&#233;decins ;</p><p>&#171; 2&#176; Dans les cas o&#249; la loi autorise d&#8217;alerter les autorit&#233;s comp&#233;tentes :</p><p>&#171; Tout autre professionnel ou toute personne qui suspecte ou acquiert la connaissance de violences physiques, psychologiques ou sexuelles de toute nature, y compris les mutilations sexuelles, &#224; l&#8217;encontre d&#8217;un mineur, d&#8217;une personne qui n&#8217;est pas en mesure de se prot&#233;ger en raison de son &#226;ge ou de son incapacit&#233; physique ou psychique ou d&#8217;un &#233;tat de grossesse, ou d&#8217;un adulte, informe sans d&#233;lai le procureur de la R&#233;publique. Lorsqu&#8217;il s&#8217;agit d&#8217;un mineur ou d&#8217;une personne qui n&#8217;est pas en mesure de se prot&#233;ger en raison de son &#226;ge ou de son incapacit&#233; physique ou psychique ou d&#8217;un &#233;tat de grossesse, l&#8217;auteur du signalement n&#8217;a pas &#224; recueillir l&#8217;accord de quiconque ;</p><p>&#171; 3&#176; &#192; tout professionnel ou toute personne qui suspecte ou acquiert la connaissance qu&#8217;un mineur est en danger ou qui risque de l&#8217;&#234;tre. Il informe sans d&#233;lai la cellule d&#233;partementale de recueil, de traitement et d&#8217;&#233;valuation mentionn&#233;e au deuxi&#232;me alin&#233;a de l&#8217;article L. 226-3 du code de l&#8217;action sociale et des familles, des informations pr&#233;occupantes d&#233;finies par le d&#233;cret n&#176; 2013-994 du 7 novembre 2013 organisant la transmission d&#8217;informations entre d&#233;partements en application de l&#8217;article L. 221&#8211;3 du code de l&#8217;action sociale et des familles. &#187;</p>",
    "exposeSommaire": "<p style=\"text-align: justify;\"><u><i><b>Pr&#233;voir l&#8217;obligation pour le m&#233;decin de signaler les suspicions de violences psychologiques, physiques et sexuelles</b></i></u></p><p>L&#8217;enfant ne dispose pas des moyens suffisants pour se prot&#233;ger lui-m&#234;me des violences &#224; son encontre. Les m&#233;decins qui le soignent ont un r&#244;le vital pour le prot&#233;ger.</p><p>Or depuis 1997, &#224; l&#8217;exception des m&#233;decins fonctionnaires de l&#8217;&#201;tat ou fonctionnaires territoriaux qui ont une obligation de signalement selon l&#8217;article 40 de proc&#233;dure p&#233;nale, les m&#233;decins sont face &#224; un dilemme &#233;thique :</p><p>- soit ils signalent et risquent des poursuites, des sanctions disciplinaires, des poursuites p&#233;nales apr&#232;s avoir appliqu&#233; l&#8217;article 226-14 du code p&#233;nal ;</p><p>- soit ils ne signalent pas et risquent d&#8217;&#234;tre l&#8217;objet de poursuites et sanctions p&#233;nales pour ne pas avoir signal&#233; selon les articles 434-3 et 226-3 du code p&#233;nal.</p><p>Ce dilemme explique le faible taux de signalement lorsqu&#8217;un m&#233;decin d&#233;tecte dans l&#8217;exercice de sa profession les signes d&#8217;alerte qui lui permette de suspecter des violences psychologiques, physiques et sexuelles &#224; l&#8217;encontre d&#8217;un mineur.</p><p>L&#8217;introduction de l&#8217;obligation de signaler les suspicions de violences psychologiques, physiques et sexuelles dans l&#8217;article 226-14 du code p&#233;nal est la solution pour mettre un terme &#224; ce dilemme.</p>"
  },
  "representations": [
    {
      "nom": "PDF",
      "typeMime": {
        "type": "application",
        "subType": "PDF"
      },
      "statutRepresentation": {
        "verbatim": true,
        "canonique": true,
        "officielle": true,
        "transcription": false,
        "enregistrement": false
      },
      "contenu": {
        "documentURI": "/15/amendements/1767/AN/1072.pdf"
      }
    }
  ],
  "dateDepot": "2019-03-15T01:00:00.000+01:00",
  "dateDistribution": "2019-03-16T01:00:00.000+01:00",
  "article99": "0",
  "loiReference": {
    "codeLoi": "c pénal",
    "divisionCodeLoi": "226-14"
  }
}