{
  "uid": "AMANR5L15SEA717460B0911P0D1N2221",
  "identifiant": {
    "legislature": "15",
    "numero": "2221",
    "numRect": "0",
    "saisine": {
      "texteLegislatifRef": "PRJLANR5L15B0911",
      "numeroPartiePLF": "0",
      "organeExamen": "PO717460",
      "mentionSecondeDeliberation": "0"
    }
  },
  "numeroLong": "2221",
  "etapeTexte": "1ère lecture (1ère assemblée saisie)",
  "triAmendement": "nwrzi",
  "cardinaliteAmdtMultiples": "1",
  "etat": "A discuter",
  "signataires": {
    "auteur": {
      "typeAuteur": "Depute",
      "acteurRef": "PA719350",
      "groupePolitiqueRef": "PO730964"
    },
    "cosignatairesRefs": [
      "PA720014",
      "PA719350",
      "PA721372",
      "PA722260",
      "PA719718",
      "PA720310",
      "PA720738",
      "PA719456",
      "PA721246",
      "PA719592",
      "PA719092",
      "PA334768",
      "PA719822",
      "PA719528",
      "PA722300",
      "PA719396",
      "PA721726",
      "PA718756",
      "PA606639",
      "PA722070",
      "PA722022",
      "PA718810",
      "PA720900",
      "PA718744",
      "PA719960",
      "PA721710",
      "PA720862",
      "PA722344",
      "PA642724",
      "PA720190",
      "PA720538",
      "PA606507",
      "PA722292",
      "PA719890",
      "PA720552",
      "PA720414",
      "PA718894",
      "PA721398",
      "PA720500",
      "PA721888",
      "PA721194",
      "PA721876",
      "PA718706",
      "PA720022",
      "PA720480",
      "PA720806",
      "PA719692",
      "PA719814",
      "PA719972",
      "PA721024",
      "PA720198",
      "PA718876",
      "PA720242",
      "PA719480",
      "PA721328",
      "PA719330",
      "PA720560",
      "PA719512",
      "PA721624",
      "PA721158",
      "PA720932",
      "PA722336",
      "PA606202",
      "PA719448",
      "PA718802",
      "PA719194",
      "PA718910",
      "PA719684",
      "PA719170",
      "PA720278",
      "PA719464",
      "PA718728",
      "PA720066",
      "PA719294",
      "PA720916",
      "PA609520",
      "PA721776",
      "PA721844",
      "PA720622",
      "PA720154",
      "PA722170",
      "PA719616",
      "PA722178",
      "PA720814",
      "PA721142",
      "PA718990",
      "PA718962",
      "PA720222",
      "PA719364",
      "PA722134",
      "PA720298",
      "PA721150",
      "PA720342",
      "PA721956",
      "PA720402",
      "PA719790",
      "PA718902",
      "PA721792",
      "PA719740",
      "PA719570",
      "PA719728",
      "PA720268",
      "PA722312",
      "PA719024",
      "PA721166",
      "PA719230"
    ],
    "texteAffichable": "Mme&#160;Tamarelle-Verhaeghe,  M.&#160;Villani, M.&#160;Euzet, M.&#160;Eliaou, Mme&#160;Cariou, M.&#160;Orphelin, Mme&#160;Dubost, Mme&#160;Val&#233;rie&#160;Petit, Mme&#160;Pompili, Mme&#160;Forteza, Mme&#160;Rilhac, Mme&#160;Degois, M.&#160;Henriet, Mme&#160;Guerel, M.&#160;Nadot, M.&#160;Blanchet, Mme&#160;Fr&#233;d&#233;rique&#160;Dumas, Mme&#160;M&#246;rch, Mme&#160;Cazebonne, Mme&#160;Goulet, M.&#160;Baich&#232;re, M.&#160;Raphan, Mme&#160;Avia, Mme&#160;Rist, Mme&#160;Sarles, M.&#160;Zulesi, M.&#160;Touraine, M.&#160;Chalumeau, M.&#160;Holroyd, Mme&#160;Lecocq, M.&#160;Boudi&#233;, M.&#160;Besson-Moreau, Mme&#160;Lazaar, M.&#160;Michels, Mme&#160;Vanceunebrock-Mialon, M.&#160;Morenas, Mme&#160;Clapot, M.&#160;Sorre, M.&#160;Damaisin, M.&#160;Portarrieu, M.&#160;Perea, M.&#160;Arend, M.&#160;Maire, Mme&#160;Dubr&#233;-Chirat, M.&#160;Julien-Laferriere, M.&#160;Gouttefarde, M.&#160;Galbadon, M.&#160;Rudigoz, M.&#160;Gaillard, M.&#160;Thi&#233;baut, M.&#160;Anglade, Mme&#160;Bagarry, Mme&#160;Fontaine-Domeizel, Mme&#160;Pitollat, Mme&#160;Le Peih, M.&#160;Lauzzana, Mme&#160;Charvier, Mme&#160;Rauch, Mme&#160;Bono-Vandorme, Mme&#160;Bureau-Bonnard, Mme&#160;Gaillot, Mme&#160;Abba, Mme&#160;Fran&#231;oise&#160;Dumas, Mme&#160;Maillart-M&#233;haignerie, Mme&#160;Tiegna, Mme&#160;Brulebois, Mme&#160;Chapelier, M.&#160;Dombreval, Mme&#160;Bessot Ballot, M.&#160;Barbier, Mme&#160;Yolaine&#160;de Courson, Mme&#160;Gayte, Mme&#160;Piron, Mme&#160;O, Mme&#160;Brugnera, M.&#160;Pichereau, Mme&#160;Romeiro Dias, M.&#160;Fi&#233;vet, M.&#160;Le Bohec, Mme&#160;Genetet, Mme&#160;Beaudouin-Hubiere, Mme&#160;Tuffnell, Mme&#160;Khedher, M.&#160;Simian, Mme&#160;Peyron, Mme&#160;Blanc, M.&#160;Paluszkiewicz, Mme&#160;Faure-Muntian, Mme&#160;Robert, M.&#160;Perrot, M.&#160;Colas-Roy, Mme&#160;De Temmerman, M.&#160;Vignal, Mme&#160;Vignon, M.&#160;Kerlogot, Mme&#160;Colboc, Mme&#160;Fabre, Mme&#160;O&apos;Petit, Mme&#160;Thillaye, M.&#160;C&#233;dric&#160;Roussel, M.&#160;Da Silva, M.&#160;Girardin, Mme&#160;Mauborgne, M.&#160;Larsonneur, M.&#160;Cazenove et M.&#160;Descrozaille"
  },
  "pointeurFragmentTexte": {
    "division": {
      "titre": "Article 4",
      "articleDesignationCourte": "ART. 4",
      "type": "ARTICLE",
      "avantAApres": "A",
      "divisionRattachee": "ARTICLE 4",
      "urlDivisionTexteVise": "/15/textes/0911.asp#D_Article_4"
    },
    "alinea": {
      "avantAApres": "Avant",
      "numero": "1",
      "alineaDesignation": "Avant l'alinéa 1"
    }
  },
  "corps": {
    "dispositif": "<p style=\"text-align: justify;\">Avant l&#8217;alin&#233;a&#160;1, ins&#233;rer l&#8217;alin&#233;a suivant&#160;: </p><p style=\"text-align: justify;\">&#171;&#160;I A . &#8211; &#192; la premi&#232;re phrase du troisi&#232;me alin&#233;a de l&#8217;article&#160;42 de la Constitution, le mot&#160;: &#171;&#160;s&#233;ance&#160;&#187;&#160;est remplac&#233; par le mot&#160;:&#160;&#171;&#160;commission&#160;&#187;.&#160;&#187;</p>",
    "exposeSommaire": "<p style=\"text-align: justify;\">La r&#233;vision constitutionnelle de 2008 a consacr&#233; encore un peu plus le r&#244;le des commissions permanentes dans le cadre du processus l&#233;gislatif. Or, le d&#233;lai de quatre &#224; six semaines entre le d&#233;p&#244;t d&#8217;un texte et son examen continue d&#8217;&#234;tre li&#233; &#224; la s&#233;ance.</p><p style=\"text-align: justify;\">Le pr&#233;sent amendement vise donc &#224; ce que ce d&#233;lai entre le d&#233;p&#244;t et l&#8217;examen du texte concerne la commission. Il permettra ainsi aux commissions de disposer d&#8217;un d&#233;lai suffisamment long pour conduire des travaux pr&#233;paratoires et &#233;clairer les parlementaires sur l&#8217;ensemble des enjeux du texte.</p>"
  },
  "representations": [
    {
      "nom": "PDF",
      "typeMime": {
        "type": "application",
        "subType": "PDF"
      },
      "statutRepresentation": {
        "verbatim": true,
        "canonique": true,
        "officielle": true,
        "transcription": false,
        "enregistrement": false
      },
      "contenu": {
        "documentURI": "/15/amendements/0911/AN/2221.pdf"
      }
    }
  ],
  "dateDepot": "2018-07-06T02:00:00.000+02:00",
  "dateDistribution": "2018-07-10T02:00:00.000+02:00",
  "article99": "0",
  "loiReference": {
    "codeLoi": "Constitution",
    "divisionCodeLoi": "42"
  }
}