{
  "uid": "AMANR5L15PO766718B2187P0D1N641",
  "identifiant": {
    "legislature": "15",
    "numero": "641",
    "numRect": "0",
    "saisine": {
      "texteLegislatifRef": "PRJLANR5L15B2187",
      "numeroPartiePLF": "0",
      "organeExamen": "PO766718",
      "mentionSecondeDeliberation": "0"
    }
  },
  "numeroLong": "641",
  "etapeTexte": "1ère lecture (1ère assemblée saisie)",
  "triAmendement": "acaaaaaaaaaaaaaaaaaaaaaaaaaaaaaaaaaaaaaaaaaaaaaaaavje",
  "cardinaliteAmdtMultiples": "1",
  "etat": "Discuté",
  "signataires": {
    "auteur": {
      "typeAuteur": "Depute",
      "acteurRef": "PA642847",
      "groupePolitiqueRef": "PO730934"
    },
    "cosignatairesRefs": [
      "PA642847"
    ],
    "texteAffichable": "M.&#160;Bazin"
  },
  "pointeurFragmentTexte": {
    "division": {
      "titre": "Article PREMIER",
      "articleDesignationCourte": "ART. PREMIER",
      "type": "ARTICLE",
      "avantAApres": "A",
      "divisionRattachee": "ARTICLE PREMIER",
      "urlDivisionTexteVise": "/15/textes/2187.asp#D_Article_1er"
    },
    "alinea": {
      "avantAApres": "Apres",
      "numero": "7"
    }
  },
  "corps": {
    "dispositif": "<p style=\"text-align: justify;\">Apr&#232;s l&#8217;alin&#233;a&#160;7, ins&#233;rer l&#8217;alin&#233;a suivant&#160;: </p><p style=\"text-align: justify;\">&#171;&#160;Il ne peut &#234;tre con&#231;u avec des gam&#232;tes ne provenant pas d&#8217;un au moins des membres du couple, ou de la femme non mari&#233;e.&#160;&#187;</p>",
    "exposeSommaire": "<p>En supprimant la disposition actuelle emp&#234;chant le double don (spermatozo&#239;des et ovocytes), le texte propos&#233; emp&#234;cherait tout lien biologique de l&#8217;enfant avec ses parents.</p><p style=\"text-align: justify;\">Un enfant pourrait ainsi avoir 3 m&#232;res, ses deux m&#232;res usuelles et une m&#232;re biologique.</p><p style=\"text-align: justify;\">Pourquoi une femme seule ou un couple de femmes n&#8217;apporterait pas au moins une filiation biologique si l&#8217;AMP leur est ouverte demain&#160;? En l&#8217;absence de pathologies, pourquoi faire appel au don d&#8217;ovocytes&#160;?</p><p style=\"text-align: justify;\">Le texte ouvre la possibilit&#233; d&#8217;une AMP avec deux &#171;&#160;tiers donneurs&#160;&#187;&#160;: un homme et une femme. L&#8217;enfant qui en serait issu ne partagerait donc aucun patrimoine g&#233;n&#233;tique avec ses parents. Une disposition qui, en plus de priver un enfant de ses parents biologiques, risque d&#8217;ouvrir demain la porte &#224; un march&#233; de la procr&#233;ation, en permettant aux parents de choisir les caract&#233;ristiques g&#233;n&#233;tiques de leur enfant.</p><p style=\"text-align: justify;\">Cet amendement ne pr&#233;voit qu&#8217;un retour au droit actuel.</p><p style=\"text-align: justify;\">&#160;</p>"
  },
  "representations": [
    {
      "nom": "PDF",
      "typeMime": {
        "type": "application",
        "subType": "PDF"
      },
      "statutRepresentation": {
        "verbatim": true,
        "canonique": true,
        "officielle": true,
        "transcription": false,
        "enregistrement": false
      },
      "contenu": {
        "documentURI": "/15/amendements/2187/CSBIOETH/641.pdf"
      }
    }
  ],
  "sort": {
    "dateSaisie": "2019-09-11T15:06:24.000+02:00",
    "sortEnSeance": "Rejeté"
  },
  "dateDepot": "2019-09-03T02:00:00.000+02:00",
  "dateDistribution": "2019-09-10T02:00:00.000+02:00",
  "article99": "0",
  "loiReference": {}
}