{
  "uid": "AMANR5L15PO766718B2187P0D1N538",
  "identifiant": {
    "legislature": "15",
    "numero": "538",
    "numRect": "0",
    "saisine": {
      "texteLegislatifRef": "PRJLANR5L15B2187",
      "numeroPartiePLF": "0",
      "organeExamen": "PO766718",
      "mentionSecondeDeliberation": "0"
    }
  },
  "numeroLong": "538",
  "etapeTexte": "1ère lecture (1ère assemblée saisie)",
  "triAmendement": "acaaaaaaaaaaaaaaaaaaaaaaaaaaaaaaaaaaaaaaaaaaaaaaaazzraoif",
  "cardinaliteAmdtMultiples": "1",
  "etat": "Retiré",
  "signataires": {
    "auteur": {
      "typeAuteur": "Depute",
      "acteurRef": "PA720116",
      "groupePolitiqueRef": "PO730964"
    },
    "cosignatairesRefs": [
      "PA719108",
      "PA720116"
    ],
    "texteAffichable": "Mme&#160;Brunet et M.&#160;G&#233;rard"
  },
  "pointeurFragmentTexte": {
    "division": {
      "titre": "Article PREMIER",
      "articleDesignationCourte": "ART. PREMIER",
      "type": "ARTICLE",
      "avantAApres": "A",
      "divisionRattachee": "ARTICLE PREMIER",
      "urlDivisionTexteVise": "/15/textes/2187.asp#D_Article_1er"
    },
    "alinea": {
      "numero": "30"
    }
  },
  "corps": {
    "dispositif": "<p style=\"text-align: justify;\">R&#233;diger ainsi l&#8217;alin&#233;a&#160;30&#160;:</p><p style=\"text-align: justify;\">&#171;&#160;4&#176;&#160;Informer ceux-ci de la possibilit&#233; de r&#233;aliser une ins&#233;mination ou un transfert des embryons conserv&#233;s apr&#232;s le d&#233;c&#232;s de l&#8217;un des membres du couple en l&#8217;absence de r&#233;vocation pr&#233;alable du consentement cit&#233; &#224; l&#8217;article L.&#160;311&#8209;20 du code civil et sur l&#8217;impossibilit&#233; de r&#233;aliser ces m&#234;mes proc&#233;dures en cas de rupture du couple dans les conditions d&#233;finies par le m&#234;me article&#160;;&#160;&#187;</p>",
    "exposeSommaire": "<p style=\"text-align: justify;\"><br />Le pr&#233;sent amendement vise &#224; autoriser, apr&#232;s le d&#233;c&#232;s de l&#8217;un des membres du couple<span class=\"del cts-1\"  data-cid=\"11\"   data-time=\"1567498951889\">s</span>, l&#8217;utilisation des gam&#232;tes et le transfert des embryons obtenus lors de la proc&#233;dure d&#8217;AMP &#224; laquelle celui-ci avait consenti de son vivant.</p><p><br />Il s&#8217;agit d&#8217;une recommandation du Conseil d&#8217;Etat qui dans son avis rendu en <span class=\"ins cts-1\"  data-cid=\"13\"   data-time=\"1567498956881\">j</span><span class=\"del cts-1\"  data-cid=\"12\"   data-time=\"1567498956678\">J</span>uillet 2019 le justifie par un souci de coh&#233;rence d&#8217;ensemble de la r&#233;forme puisque la femme survivante, alors seule, pourra acc&#233;der &#224; l&#8217;AMP avec sperme de donneur alors que les embryons obtenus avec son conjoint rejoindraient le circuit classique du don pour permettre &#224; d&#8217;autres couples de r&#233;aliser leurs projets parentaux.</p><p><br />Il semble pr&#233;f&#233;rable d&#8217;autoriser la poursuite des projets parentaux m&#234;me apr&#232;s le d&#233;c&#232;s afin d&#8217;&#233;viter la reprise &#224; z&#233;ro du parcours d&#8217;AMP. Les d&#233;lais d&#8217;obtention d&#8217;une grossesse pour la femme survivante seraient rallong&#233;s et les proc&#233;dures multipli&#233;es. Elle devrait notamment choisir un donneur dont certaines caract&#233;ristiques seraient connues et donc les informations non identifiantes voire l&#8217;identit&#233; du donneur seraient accessibles &#224; la demande de l&#8217;enfant alors qu&#8217;il serait issu d&#8217;un projet parental de couple dont l&#8217;homme serait d&#233;c&#233;d&#233;.</p><p><br />Le pr&#233;sent amendement couvre les deux situations suivantes&#8239;: proc&#233;dure d&#8217;AMP en cours au moment du d&#233;c&#232;s (gam&#232;tes d&#233;j&#224; obtenus) ou <span class=\"ins cts-1\"  data-cid=\"14\"   data-time=\"1567498976530\">la </span>r&#233;utilisation des gam&#232;tes ou embryons conserv&#233;s avant le d&#233;c&#232;s. Les conditions demand&#233;es par le Conseil d&#8217;Etat pour la mise en place de cette mesure sont &#233;galement propos&#233;es.</p><p><br />Les &#233;tudes sociologiques r&#233;alis&#233;es sur les enfants qui ont &#233;t&#233; s&#233;par&#233;s de leur p&#232;re avant leur naissance ou &#224; un tr&#232;s jeune &#226;ge sont <span class=\"del cts-1\"  data-cid=\"17\"   data-time=\"1567498984246\">tr&#232;s </span>univoques et rassurantes sur le devenir des enfants issus d&#8217;une proc&#233;dure d&#8217;AMP post-mortem.</p>"
  },
  "representations": [
    {
      "nom": "PDF",
      "typeMime": {
        "type": "application",
        "subType": "PDF"
      },
      "statutRepresentation": {
        "verbatim": true,
        "canonique": true,
        "officielle": true,
        "transcription": false,
        "enregistrement": false
      },
      "contenu": {
        "documentURI": "/15/amendements/2187/CSBIOETH/538.pdf"
      }
    }
  ],
  "dateDepot": "2019-09-03T02:00:00.000+02:00",
  "dateDistribution": "2019-09-09T02:00:00.000+02:00",
  "article99": "0",
  "loiReference": {
    "codeLoi": "1"
  }
}