{
  "uid": "AMANR5L15PO757134B1673P0D1N254",
  "identifiant": {
    "legislature": "15",
    "numero": "254",
    "numRect": "0",
    "saisine": {
      "texteLegislatifRef": "PRJLANR5L15B1673",
      "numeroPartiePLF": "0",
      "organeExamen": "PO757134",
      "mentionSecondeDeliberation": "0"
    }
  },
  "numeroLong": "254",
  "etapeTexte": "Nouvelle Lecture",
  "triAmendement": "aafaaaaaaaaaaaaaaaaaaaaaaaaaaaaaaaaaaaaaaaaaaaaaaabhdi",
  "cardinaliteAmdtMultiples": "1",
  "etat": "Discuté",
  "signataires": {
    "auteur": {
      "typeAuteur": "Depute",
      "acteurRef": "PA942",
      "groupePolitiqueRef": "PO759900"
    },
    "cosignatairesRefs": [
      "PA336175",
      "PA720996",
      "PA405480",
      "PA333421",
      "PA605694",
      "PA336439",
      "PA719146",
      "PA942",
      "PA267042",
      "PA331582"
    ],
    "texteAffichable": "M.&#160;Charles&#160;de Courson,  M.&#160;Acquaviva, M.&#160;Cl&#233;ment, M.&#160;El Guerrab, M.&#160;Falorni, M.&#160;Favennec Becot, M.&#160;Pancher, Mme&#160;Pinel, M.&#160;Pupponi et M.&#160;Philippe&#160;Vigier"
  },
  "pointeurFragmentTexte": {
    "division": {
      "titre": "Article PREMIER",
      "articleDesignationCourte": "ART. PREMIER",
      "type": "ARTICLE",
      "avantAApres": "A",
      "divisionRattachee": "ARTICLE PREMIER",
      "urlDivisionTexteVise": "/15/textes/1673.asp#D_Article_1er"
    },
    "alinea": {
      "numero": "9"
    }
  },
  "corps": {
    "dispositif": "<p style=\"text-align: justify;\">&#192; la premi&#232;re phrase de l&#8217;alin&#233;a&#160;9, apr&#232;s le mot&#160;:</p><p style=\"text-align: justify;\">&#171;&#160;unique&#160;&#187;,</p><p style=\"text-align: justify;\">ins&#233;rer les mots&#160;:</p><p style=\"text-align: justify;\">&#171;&#160;g&#233;r&#233; par l&#8217;&#201;tat et&#160;&#187;.</p>",
    "exposeSommaire": "<p style=\"text-align: justify;\">Il convient de pr&#233;ciser que l&#8217;unification des d&#233;marches en &#171;&#160;front-office&#160;&#187; se fera par le biais d&#8217;un guichet g&#233;r&#233; par l&#8217;&#201;tat.</p><p>Notons que le service existant (&#171;&#160;Guichet-entreprises&#160;&#187;) est un service &#224; comp&#233;tence nationale.</p>"
  },
  "representations": [
    {
      "nom": "PDF",
      "typeMime": {
        "type": "application",
        "subType": "PDF"
      },
      "statutRepresentation": {
        "verbatim": true,
        "canonique": true,
        "officielle": true,
        "transcription": false,
        "enregistrement": false
      },
      "contenu": {
        "documentURI": "/15/amendements/1673/CSPACTE/254.pdf"
      }
    }
  ],
  "sort": {
    "dateSaisie": "2019-03-05T17:39:28.000+01:00",
    "sortEnSeance": "Rejeté"
  },
  "dateDepot": "2019-02-28T01:00:00.000+01:00",
  "dateDistribution": "2019-03-04T01:00:00.000+01:00",
  "article99": "0",
  "loiReference": {
    "codeLoi": "1"
  }
}