{
  "uid": "AMANR5L15PO420120B1681P0D1N1440",
  "identifiant": {
    "legislature": "15",
    "numero": "1440",
    "numRect": "0",
    "saisine": {
      "texteLegislatifRef": "PRJLANR5L15B1681",
      "numeroPartiePLF": "0",
      "organeExamen": "PO420120",
      "mentionSecondeDeliberation": "0"
    }
  },
  "numeroLong": "AS1440",
  "etapeTexte": "1ère lecture (1ère assemblée saisie)",
  "triAmendement": "caaaaaaaaaaaaaaaaaaaaaaaaaaaaaaaaaaaaaaaaaaaaaaaaatjdln",
  "cardinaliteAmdtMultiples": "1",
  "etat": "Irrecevable",
  "signataires": {
    "auteur": {
      "typeAuteur": "Depute",
      "acteurRef": "PA2377",
      "groupePolitiqueRef": "PO730934"
    },
    "cosignatairesRefs": [
      "PA2377"
    ],
    "texteAffichable": "M.&#160;Perrut"
  },
  "pointeurFragmentTexte": {
    "division": {
      "titre": "Article 8",
      "articleDesignationCourte": "ART. 8",
      "type": "ARTICLE",
      "avantAApres": "A",
      "divisionRattachee": "ARTICLE 8",
      "urlDivisionTexteVise": "/15/textes/1681.asp#D_Article_8"
    },
    "alinea": {
      "numero": "4"
    }
  },
  "corps": {
    "dispositif": "<p style=\"text-align: justify;\">Compl&#233;<i>ter</i> l&#8217;alin&#233;a&#160;4 par les mots&#160;:</p><p style=\"text-align: justify;\">&#171;&#160;et en r&#233;tablissant les &#233;lus locaux dans les instances d&#233;cisionnelles&#160;&#187;.</p>",
    "exposeSommaire": "<p>Les &#233;lus locaux, pourtant directement concern&#233;s et impliqu&#233;s dans ce qui peut concerner les &#233;tablissements de sant&#233;, notamment au regard de la lutte contre les d&#233;serts m&#233;dicaux, ont perdu avec la suppression des conseils d&#8217;administration des h&#244;pitaux, toute responsabilit&#233; dans l&#8217;organisation strat&#233;gique des h&#244;pitaux. Ils ne demandent pas &#224; avoir une voix pr&#233;dominante sur les d&#233;cisions purement m&#233;dicales, mais il est inconcevable de ne pas reconnaitre que les d&#233;cisions relevant de l&#8217;acc&#232;s aux soins ont aussi syst&#233;matiquement un impact sur les territoires en termes de transports, de services, d&#8217;emploi, d&#8217;installation des m&#233;nages&#8230;</p><p>C&#8217;est pourquoi, cette question de gouvernance devra &#234;tre trait&#233;e &#224; l&#8217;occasion de la r&#233;daction des ordonnances annonc&#233;es, qui devront n&#233;cessairement &#234;tre &#233;labor&#233;es en concertation avec les associations d&#8217;&#233;lus.</p>"
  },
  "representations": [
    {
      "nom": "PDF",
      "typeMime": {
        "type": "application",
        "subType": "PDF"
      },
      "statutRepresentation": {
        "verbatim": true,
        "canonique": true,
        "officielle": true,
        "transcription": false,
        "enregistrement": false
      },
      "contenu": {
        "documentURI": "/15/amendements/1681/CION-SOC/AS1440.pdf"
      }
    }
  ],
  "dateDepot": "2019-03-08T01:00:00.000+01:00",
  "dateDistribution": "2019-03-08T01:00:00.000+01:00",
  "article99": "0",
  "loiReference": {}
}