{
  "uid": "AMANR5L15PO59051B1831P0D1N71",
  "identifiant": {
    "legislature": "15",
    "numero": "71",
    "numRect": "0",
    "saisine": {
      "texteLegislatifRef": "PRJLANR5L15B1831",
      "numeroPartiePLF": "0",
      "organeExamen": "PO59051",
      "mentionSecondeDeliberation": "0"
    }
  },
  "numeroLong": "CL71",
  "etapeTexte": "1ère lecture (2ème assemblée saisie)",
  "triAmendement": "araaaaaaaaaaaaaaaaaaaaaaaaaaaaaaaaaaaaaaaaaaaaaaaabo",
  "cardinaliteAmdtMultiples": "1",
  "etat": "Discuté",
  "signataires": {
    "auteur": {
      "typeAuteur": "Depute",
      "acteurRef": "PA266808",
      "groupePolitiqueRef": "PO730934"
    },
    "cosignatairesRefs": [
      "PA340853",
      "PA266808",
      "PA267901",
      "PA1029"
    ],
    "texteAffichable": "M.&#160;Rolland,  M.&#160;Leclerc, M.&#160;Kamardine et M.&#160;Deflesselles"
  },
  "pointeurFragmentTexte": {
    "division": {
      "titre": "Article 5",
      "articleDesignationCourte": "ART. 5",
      "type": "ARTICLE",
      "avantAApres": "A",
      "divisionRattachee": "ARTICLE 5",
      "urlDivisionTexteVise": "/15/textes/1831.asp#D_Article_5"
    },
    "alinea": {
      "numero": "8"
    }
  },
  "corps": {
    "dispositif": "<p style=\"text-align: justify;\">Compl&#233;ter l&#8217;alin&#233;a&#160;8 par les mots&#160;:</p><p style=\"text-align: justify;\">&#171;&#160;telle qu&#8217;encadr&#233;e par les plans locaux d&#8217;urbanisme ou les plans locaux d&#8217;urbanisme intercommunaux&#160;&#187;.</p>",
    "exposeSommaire": "<p style=\"text-align: justify;\">Si la lutte contre l&#8217;&#233;talement urbain constitue un objectif majeur qui ne saurait &#234;tre mis en cause, il n&#8217;en demeure pas moins que sa traduction concr&#232;te ne peut &#234;tre uniforme sur tout le territoire et doit tenir compte des r&#233;alit&#233;s propres aux territoires urbains, ruraux et de montagne.</p><p>Le pr&#233;sent amendement vise &#224; introduire une garantie contre d&#8217;&#233;ventuels plans de mobilit&#233;, prescriptifs en mati&#232;re d&#8217;&#233;talement urbain. Certes, en vertu de la hi&#233;rarchie des normes en cours, il n&#8217;ont pas vocation &#224; l&#8217;&#234;tre. Malgr&#233; tout, l&#8217;utilisation, &#224; l&#8217;alin&#233;a&#160;8 de l&#8217;article&#160;5, de l&#8217;adjectif &#171;&#160;n&#233;cessaire&#160;&#187; pour qualifier la &#171;&#160;limitation de l&#8217;&#233;talement urbain&#160;&#187; confirme que cette &#233;ventualit&#233; n&#8217;a rien d&#8217;improbable, et cette source &#233;ventuelle de contentieux pourrait faire &#233;voluer la jurisprudence en ce sens.</p><p>Il existe donc un risque non n&#233;gligeable que les futurs plans de mobilit&#233; int&#232;grent des consid&#233;rations relatives &#224; l&#8217;&#233;talement urbain et que la vision de l&#8217;autorit&#233; organisatrice des mobilit&#233;s s&#8217;impose aux collectivit&#233;s dans leur PLU ou PLUi sans qu&#8217;elles puissent faire valoir leur vision propre.</p><p>Loin d&#8217;apporter de la confusion en pr&#234;tant au plan de mobilit&#233; une port&#233;e qu&#8217;il n&#8217;aurait pas, ou d&#8217;&#234;tre inop&#233;rant, cet amendement vise &#224; garantir que les PLU ou PLUi conserveront &#224; leur niveau la ma&#238;trise de l&#8217;&#233;tablissement urbain et ne pourront pas se retrouver sanctionn&#233;s pour ne pas avoir respect&#233; le plan de mobilit&#233;.&#160;</p><p>L&#8217;amendement permettra donc de garantir que le plan de mobilit&#233;, comme c&#8217;est le cas actuellement des plans de d&#233;placement urbain (PDU), fasse l&#8217;objet d&#8217;une simple prise en compte.</p><p>Aussi convient-il de s&#8217;assurer, par cet amendement, que le plan de mobilit&#233;, comme c&#8217;est le cas actuellement des plans de d&#233;placement urbain (PDU), fasse l&#8217;objet d&#8217;une simple prise en compte.</p>",
    "cartoucheDelaiDepotDepasse": "Sous réserve de son traitement par les services de l'Assemblée nationale et de sa recevabilité"
  },
  "representations": [
    {
      "nom": "PDF",
      "typeMime": {
        "type": "application",
        "subType": "PDF"
      },
      "statutRepresentation": {
        "verbatim": true,
        "canonique": true,
        "officielle": true,
        "transcription": false,
        "enregistrement": false
      },
      "contenu": {
        "documentURI": "/15/amendements/1831/CION_LOIS/CL71.pdf"
      }
    }
  ],
  "sort": {
    "dateSaisie": "2019-05-07T18:14:26.000+02:00",
    "sortEnSeance": "Non soutenu"
  },
  "dateDepot": "2019-05-02T02:00:00.000+02:00",
  "dateDistribution": "2019-05-07T02:00:00.000+02:00",
  "article99": "0",
  "loiReference": {
    "codeLoi": "id"
  }
}