{
  "uid": "AMANR5L15SEA717460BTC0902P0D1N2558",
  "identifiant": {
    "legislature": "15",
    "numero": "2558",
    "numRect": "0",
    "saisine": {
      "texteLegislatifRef": "PRJLANR5L15BTC0902",
      "numeroPartiePLF": "0",
      "organeExamen": "PO717460",
      "mentionSecondeDeliberation": "0"
    }
  },
  "numeroLong": "2558",
  "etapeTexte": "1ère lecture (1ère assemblée saisie)",
  "triAmendement": "aqzzxzvkkzzzzw",
  "cardinaliteAmdtMultiples": "1",
  "etat": "Discuté",
  "signataires": {
    "auteur": {
      "typeAuteur": "Depute",
      "acteurRef": "PA607619",
      "groupePolitiqueRef": "PO730964"
    },
    "cosignatairesRefs": [
      "PA607619"
    ],
    "texteAffichable": "M.&#160;Molac"
  },
  "pointeurFragmentTexte": {
    "division": {
      "titre": "Article PREMIER",
      "articleDesignationCourte": "ART. PREMIER",
      "type": "ARTICLE",
      "avantAApres": "A",
      "divisionRattachee": "ARTICLE PREMIER",
      "urlDivisionTexteVise": "/15/textes/0902.asp#D_Article_1er"
    },
    "alinea": {
      "avantAApres": "A",
      "numero": "15",
      "alineaDesignation": "Alinéa 15"
    }
  },
  "corps": {
    "dispositif": "<p style=\"text-align: justify;\">Substituer &#224; la deuxi&#232;me phrase de l&#8217;alin&#233;a&#160;15 les deux phrases suivantes&#160;:</p><p style=\"text-align: justify;\">&#171;&#160;Les indicateurs sont diffus&#233;s par les organisations interprofessionnelles. &#192; d&#233;faut, l&#8217;Observatoire de la formation des prix et des marges des produits alimentaires ou l&#8217;&#233;tablissement mentionn&#233; &#224; l&#8217;article L.&#160;621&#8209;1 proposent ou valident des indicateurs.&#160;&#187;&#160;</p>",
    "exposeSommaire": "<p style=\"text-align: justify;\">Cet amendement propose de que les indicateurs utilis&#233;s dans les contrats, qui se doivent d&#8217;&#234;tre neutres et indiscutables, proviennent des organisations interprofessionnelles, lieu d&#8217;&#233;change et de consensus entre les diff&#233;rents maillons des fili&#232;res. En effet, il n&#8217;est pas coh&#233;rent que des op&#233;rateurs disposant d&#8217;indicateurs dans leur fili&#232;re utilisent d&#8217;autres indicateurs qui n&#8217;ont pas re&#231;u l&#8217;aval de l&#8217;ensemble de la fili&#232;re.</p><p style=\"text-align: justify;\">&#192; d&#233;faut d&#8217;indicateurs rendus disponibles par les interprofessions, l&#8217;Observatoire des prix et des marges ainsi que FranceAgriMer o&#249; sont repr&#233;sent&#233;s tous les maillons de la fili&#232;re doivent proposer des indicateurs.</p>"
  },
  "representations": [
    {
      "nom": "PDF",
      "typeMime": {
        "type": "application",
        "subType": "PDF"
      },
      "statutRepresentation": {
        "verbatim": true,
        "canonique": true,
        "officielle": true,
        "transcription": false,
        "enregistrement": false
      },
      "contenu": {
        "documentURI": "/15/amendements/0902/AN/2558.pdf"
      }
    }
  ],
  "seanceDiscussion": "RUANR5L15S2018IDS21049",
  "sort": {
    "dateSaisie": "2018-05-23T20:00:37.000+02:00",
    "sortEnSeance": "Adopté"
  },
  "dateDepot": "2018-05-17T02:00:00.000+02:00",
  "dateDistribution": "2018-05-18T02:00:00.000+02:00",
  "article99": "0",
  "loiReference": {}
}