{
  "uid": "AMANR5L15SEA717460B0911P0D1N1795",
  "identifiant": {
    "legislature": "15",
    "numero": "1795",
    "numRect": "0",
    "saisine": {
      "texteLegislatifRef": "PRJLANR5L15B0911",
      "numeroPartiePLF": "0",
      "organeExamen": "PO717460",
      "mentionSecondeDeliberation": "0"
    }
  },
  "numeroLong": "1795",
  "etapeTexte": "1ère lecture (1ère assemblée saisie)",
  "triAmendement": "aidy",
  "cardinaliteAmdtMultiples": "1",
  "etat": "Discuté",
  "signataires": {
    "auteur": {
      "typeAuteur": "Depute",
      "acteurRef": "PA336175",
      "groupePolitiqueRef": "PO723569"
    },
    "cosignatairesRefs": [
      "PA608292",
      "PA605694",
      "PA336175"
    ],
    "texteAffichable": "Mme&#160;Pinel,  Mme&#160;Dubi&#233; et M.&#160;Falorni"
  },
  "pointeurFragmentTexte": {
    "division": {
      "titre": "Article PREMIER",
      "articleDesignationCourte": "AVANT ART. PREMIER",
      "type": "ARTICLE",
      "avantAApres": "Avant",
      "divisionRattachee": "AVANT L'ARTICLE PREMIER, insérer l'article suivant:",
      "articleAdditionnel": "1",
      "urlDivisionTexteVise": "/15/textes/0911.asp#D_Article_1er"
    }
  },
  "corps": {
    "dispositif": "<p>L&#8217;article&#160;6 de la Constitution est ainsi modifi&#233;&#160;:</p><p>1&#176; Au premier alin&#233;a, le mot&#160;: &#171;&#160;cinq&#160;&#187; est remplac&#233; par le mot&#160;: &#171;&#160;sept&#160;&#187;&#160;;</p><p>2&#176; Apr&#232;s le mot&#160;: &#171;&#160;plus&#160;&#187;, la fin du deuxi&#232;me alin&#233;a est ainsi r&#233;dig&#233;e&#160;: &#171;&#160;d&#8217;un mandat.&#160;&#187;</p>",
    "exposeSommaire": "<p style=\"text-align: justify;\">Cet amendement vise &#224; modifier le mandat pr&#233;sidentiel&#160;d'une dur&#233;e de sept ans, non renouvelable.</p><p style=\"text-align: justify;\">Cela permettrait de donner au Pr&#233;sident de la R&#233;publique davantage de libert&#233; et de capacit&#233; d'action, qui sont aujourd'hui entrav&#233;es par la perspective d'une nouvelle &#233;lection, &#224; br&#232;ve &#233;ch&#233;ance. Le Pr&#233;sident de la R&#233;publique pourrait ainsi prendre des r&#233;formes d'ampleur r&#233;clamant plusieurs ann&#233;es de pr&#233;paration, leur mise en &#339;uvre et l'&#233;valuation de leurs effets.</p>"
  },
  "representations": [
    {
      "nom": "PDF",
      "typeMime": {
        "type": "application",
        "subType": "PDF"
      },
      "statutRepresentation": {
        "verbatim": true,
        "canonique": true,
        "officielle": true,
        "transcription": false,
        "enregistrement": false
      },
      "contenu": {
        "documentURI": "/15/amendements/0911/AN/1795.pdf"
      }
    }
  ],
  "seanceDiscussion": "RUANR5L15S2018IDS21167",
  "sort": {
    "dateSaisie": "2018-07-16T17:29:38.000+02:00",
    "sortEnSeance": "Rejeté"
  },
  "dateDepot": "2018-07-06T02:00:00.000+02:00",
  "dateDistribution": "2018-07-09T02:00:00.000+02:00",
  "article99": "0",
  "loiReference": {
    "codeLoi": "Constitution",
    "divisionCodeLoi": "6"
  }
}