{
  "uid": "AMANR5L15SEA717460BTC1974P0D1N2122",
  "identifiant": {
    "legislature": "15",
    "numero": "2122",
    "numRect": "0",
    "saisine": {
      "texteLegislatifRef": "PRJLANR5L15BTC1974",
      "numeroPartiePLF": "0",
      "organeExamen": "PO717460",
      "mentionSecondeDeliberation": "0"
    }
  },
  "numeroLong": "2122",
  "etapeTexte": "1ère lecture (2ème assemblée saisie)",
  "triAmendement": "jwaaaaaaaaaaaaaaaaaaaaaaaaaaaaaaaaaaaaaaaaaaaaaaaao",
  "cardinaliteAmdtMultiples": "1",
  "etat": "Discuté",
  "signataires": {
    "auteur": {
      "typeAuteur": "Depute",
      "acteurRef": "PA720944",
      "groupePolitiqueRef": "PO730964"
    },
    "cosignatairesRefs": [
      "PA720944"
    ],
    "texteAffichable": "Mme&#160;Park"
  },
  "pointeurFragmentTexte": {
    "division": {
      "titre": "Article 33 ter",
      "articleDesignationCourte": "ART. 33 TER",
      "type": "ARTICLE",
      "avantAApres": "A",
      "divisionRattachee": "ARTICLE 33 TER",
      "urlDivisionTexteVise": "/15/textes/1974.asp#D_Article_33_ter"
    },
    "alinea": {
      "numero": "8"
    }
  },
  "corps": {
    "dispositif": "<p style=\"text-align: justify;\">&#192; la derni&#232;re phrase de l&#8217;alin&#233;a&#160;8, supprimer les mots&#160;:</p><p style=\"text-align: justify;\">&#171;&#160;, autant que de besoin,&#160;&#187;.</p>",
    "exposeSommaire": "<p>Amendement r&#233;dactionnel.</p>"
  },
  "representations": [
    {
      "nom": "PDF",
      "typeMime": {
        "type": "application",
        "subType": "PDF"
      },
      "statutRepresentation": {
        "verbatim": true,
        "canonique": true,
        "officielle": true,
        "transcription": false,
        "enregistrement": false
      },
      "contenu": {
        "documentURI": "/15/amendements/1974/AN/2122.pdf"
      }
    }
  ],
  "seanceDiscussion": "RUANR5L15S2019IDS21702",
  "sort": {
    "dateSaisie": "2019-06-14T17:07:08.000+02:00",
    "sortEnSeance": "Adopté"
  },
  "dateDepot": "2019-05-29T02:00:00.000+02:00",
  "dateDistribution": "2019-06-14T02:00:00.000+02:00",
  "article99": "0",
  "loiReference": {}
}