{
  "uid": "AMANR5L15PO59048B2272P1D1N1025",
  "identifiant": {
    "legislature": "15",
    "numero": "1025",
    "numRect": "0",
    "saisine": {
      "texteLegislatifRef": "PRJLANR5L15B2272",
      "numeroPartiePLF": "1",
      "organeExamen": "PO59048",
      "mentionSecondeDeliberation": "0"
    }
  },
  "numeroLong": "I-CF1025",
  "etapeTexte": "1ère lecture (1ère assemblée saisie)",
  "triAmendement": "gaaaaaaaaaaaaaaaaaaaaaaaaaaaaaaaaaaaaaaaaaaaaaaaaaagzo",
  "cardinaliteAmdtMultiples": "1",
  "etat": "Discuté",
  "signataires": {
    "auteur": {
      "typeAuteur": "Depute",
      "acteurRef": "PA720764",
      "groupePolitiqueRef": "PO730970"
    },
    "cosignatairesRefs": [
      "PA721976",
      "PA721996",
      "PA717151",
      "PA720728",
      "PA720002",
      "PA721608",
      "PA720598",
      "PA722374",
      "PA719266",
      "PA719918",
      "PA719640",
      "PA719942",
      "PA722162",
      "PA720092",
      "PA720968",
      "PA721984",
      "PA720746",
      "PA720704",
      "PA720720",
      "PA721924",
      "PA719210",
      "PA719558",
      "PA720334",
      "PA720178",
      "PA721530",
      "PA719488",
      "PA719874",
      "PA720652",
      "PA720764",
      "PA721742",
      "PA721836",
      "PA1276",
      "PA720326",
      "PA720256",
      "PA721734",
      "PA718978",
      "PA720924",
      "PA721418",
      "PA720162",
      "PA719044",
      "PA719504",
      "PA720772",
      "PA721182",
      "PA721234",
      "PA720976",
      "PA722284"
    ],
    "texteAffichable": "Mme&#160;Lasserre-David,  M.&#160;Barrot, M.&#160;Duverg&#233;, Mme&#160;El Ha&#239;ry, M.&#160;Laqhila, M.&#160;Mattei, M.&#160;Balanant, Mme&#160;Bannier, M.&#160;Baudu, Mme&#160;Benin, M.&#160;Berta, M.&#160;Bolo, M.&#160;Bourlanges, M.&#160;Bru, M.&#160;Cubertafon, Mme&#160;de Sarnez, Mme&#160;de Vaucouleurs, Mme&#160;Deprez-Audebert, Mme&#160;Elimas, Mme&#160;Essayan, M.&#160;Fanget, Mme&#160;Florennes, M.&#160;Fuchs, M.&#160;Garcia, M.&#160;Hammouche, M.&#160;Isaac-Sibille, Mme&#160;Jacquier-Laforge, M.&#160;Joncour, M.&#160;Lagleize, M.&#160;Lain&#233;, M.&#160;Latombe, M.&#160;Loiseau, Mme&#160;Luquet, M.&#160;Mathiasin, Mme&#160;Mette, M.&#160;Michel-Kleisbauer, M.&#160;Mignola, M.&#160;Millienne, M.&#160;Pahun, M.&#160;Fr&#233;d&#233;ric&#160;Petit, Mme&#160;Maud&#160;Petit, Mme&#160;Poueyto, M.&#160;Ramos, M.&#160;Turquois, Mme&#160;Vichnievsky et M.&#160;Waserman"
  },
  "pointeurFragmentTexte": {
    "division": {
      "titre": "Article 21",
      "articleDesignationCourte": "ART. 21",
      "type": "ARTICLE",
      "avantAApres": "A",
      "divisionRattachee": "ARTICLE 21",
      "urlDivisionTexteVise": "/15/textes/2272A.asp#D_Article_21"
    },
    "alinea": {
      "numero": "4"
    }
  },
  "corps": {
    "dispositif": "<p style=\"text-align: justify;\">I.&#160;&#8211;&#160;&#192; l&#8217;alin&#233;a&#160;4&#160;:</p><p style=\"text-align: justify;\">1&#176;&#160;Substituer &#224; l&#8217;ann&#233;e&#160;:</p><p style=\"text-align: justify;\">&#171;&#160;2020&#160;&#187;</p><p style=\"text-align: justify;\">l&#8217;ann&#233;e&#160;:</p><p style=\"text-align: justify;\">&#171;&#160;2021&#160;&#187;</p><p style=\"text-align: justify;\">2&#176;&#160;Substituer &#224; l&#8217;ann&#233;e&#160;:</p><p style=\"text-align: justify;\">&#171;&#160;2019&#160;&#187;</p><p style=\"text-align: justify;\">l&#8217;ann&#233;e&#160;:&#160;</p><p style=\"text-align: justify;\">&#171;&#160;2020&#160;&#187;.</p><p style=\"text-align: justify;\">II.&#160;&#8211;&#160;La perte de recettes pour l&#8217;&#201;tat est compens&#233;e &#224; due concurrence par la cr&#233;ation d&#8217;une taxe additionnelle aux droits mentionn&#233;s aux articles 575 et 575 A du code g&#233;n&#233;ral des imp&#244;ts.&#160;</p>",
    "exposeSommaire": "<p style=\"text-align: justify;\">Le versement transports (VT) est un imp&#244;t destin&#233; au financement des transports en commun qui touche les employeurs, publics ou priv&#233;s, dont un ou plusieurs &#233;tablissements se situent dans le ressort territorial d&#8217;une Autorit&#233; organisatrice de la mobilit&#233; (AOM).</p><p style=\"text-align: justify;\">En 2017, le taux apparent d&#8217;imposition au titre du versement transport s&#8217;&#233;l&#232;ve &#224; 1,285&#160;%. La recette de versement transport &#233;tait de 8,5 milliards d&#8217;euros en 2017, selon les pr&#233;visions de la comptabilit&#233; nationale.</p><p style=\"text-align: justify;\">Jusqu&#8217;en 2017, les employeurs assujettis &#233;taient ceux qui employaient plus de 9 salari&#233;s.</p><p style=\"text-align: justify;\">Lors de la loi de finances pour 2016, le Gouvernement a annonc&#233; vouloir renforcer les mesures en faveur des petites et moyennes entreprises. Parmi elles, l&#8217;article&#160;15 a port&#233; sur le rel&#232;vement du seuil des contraintes sociales de 9 &#224; 11 salari&#233;s. Afin de compenser int&#233;gralement les pertes de recettes que la r&#233;duction du champ des entreprises assujetties au versement transport g&#233;n&#233;rerait au d&#233;triment des AOM et de la m&#233;tropole de Lyon, la loi de finances pour 2016 a, en parall&#232;le, institu&#233; un nouveau pr&#233;l&#232;vement sur recettes (PSR)</p><p style=\"text-align: justify;\">Toutefois, le pr&#233;sent article&#160;21 pr&#233;voit le plafonnement du PSR de l&#8217;&#201;tat de l&#8217;ordre de 48 020 650&#160;euros.</p><p style=\"text-align: justify;\">Particuli&#232;rement incoh&#233;rent avec la r&#233;cente adoption de la loi d&#8217;orientation des mobilit&#233;s, ce plafond de 48 millions d&#8217;euros ignore de surcro&#238;t le fait qu&#8217;&#224; compter du 1<sup>er</sup> janvier 2020 s&#8217;appliquera l&#8217;article&#160;6 de la loi PACTE lequel, en modifiant les r&#232;gles de franchissement des seuils sociaux, va impacter d&#233;favorablement les recettes des collectivit&#233;s territoriales&#160;: la perte sera nulle les trois premi&#232;res ann&#233;es, correspondra &#224; une perte de 45 millions d&#8217;euros la cinqui&#232;me ann&#233;e avant de se stabiliser &#224; une perte de 30 millions d&#8217;euros en r&#233;gime de croisi&#232;re.</p><p style=\"text-align: justify;\">C&#8217;est pourquoi, sur le mod&#232;le de ce qui a &#233;t&#233; fait pour la suppression des loyers budg&#233;taires du minist&#232;re des Arm&#233;es, d&#233;cal&#233;e d&#8217;un an pour ne laisser aucun doute sur la r&#233;alit&#233; de l&#8217;augmentation du budget de la mission &#171;&#160;D&#233;fense&#160;&#187; lors de la premi&#232;re ann&#233;e de mise en oeuvre de la LPM (loi de programmation militaire), le pr&#233;sent amendement propose de d&#233;caler l&#8217;entr&#233;e en vigueur de cette disposition.</p><p style=\"text-align: justify;\">&#160;</p>"
  },
  "representations": [
    {
      "nom": "PDF",
      "typeMime": {
        "type": "application",
        "subType": "PDF"
      },
      "statutRepresentation": {
        "verbatim": true,
        "canonique": true,
        "officielle": true,
        "transcription": false,
        "enregistrement": false
      },
      "contenu": {
        "documentURI": "/15/amendements/2272A/CION_FIN/CF1025.pdf"
      }
    }
  ],
  "sort": {
    "dateSaisie": "2019-10-10T12:53:02.000+02:00",
    "sortEnSeance": "Rejeté"
  },
  "dateDepot": "2019-10-04T02:00:00.000+02:00",
  "dateDistribution": "2019-10-09T02:00:00.000+02:00",
  "article99": "0",
  "loiReference": {}
}