{
  "uid": "AMANR5L15SEA717460B1297P0D1N695",
  "identifiant": {
    "legislature": "15",
    "numero": "695",
    "numRect": "0",
    "saisine": {
      "texteLegislatifRef": "PRJLANR5L15B1297",
      "numeroPartiePLF": "0",
      "organeExamen": "PO717460",
      "mentionSecondeDeliberation": "0"
    }
  },
  "numeroLong": "695",
  "etapeTexte": "1ère lecture (1ère assemblée saisie)",
  "triAmendement": "jjaaaaaaaaaaaaaaaaaaaaaaaaaaaaaaaaaaaaaaaaaaaaaaaaauo",
  "cardinaliteAmdtMultiples": "1",
  "etat": "Irrecevable",
  "signataires": {
    "auteur": {
      "typeAuteur": "Depute",
      "acteurRef": "PA2377",
      "groupePolitiqueRef": "PO730934"
    },
    "cosignatairesRefs": [
      "PA2377"
    ],
    "texteAffichable": "M.&#160;Perrut"
  },
  "pointeurFragmentTexte": {
    "division": {
      "titre": "Article 41",
      "articleDesignationCourte": "APRÈS ART. 41",
      "type": "ARTICLE",
      "avantAApres": "Apres",
      "divisionRattachee": "APRÈS L'ARTICLE 41, insérer l'article suivant:",
      "articleAdditionnel": "1",
      "urlDivisionTexteVise": "/15/textes/1297.asp#D_Article_41"
    }
  },
  "corps": {
    "dispositif": "<p style=\"text-align: justify;\">I.&#160;&#8211;&#160;&#192; l&#8217;article L.&#160;841&#8209;1 du code de la s&#233;curit&#233; sociale, apr&#232;s la seconde occurrence du mot&#160;: &#171;&#160;salari&#233;s,&#160;&#187; sont ins&#233;r&#233;s les mots&#160;: &#171;&#160;ainsi que les personnes b&#233;n&#233;ficiant de la prestation de compensation pour adulte handicap&#233;e, telle que d&#233;finie &#224; l&#8217;article L.&#160;245&#8209;1 du code de l&#8217;action sociale et des familles, et de l&#8217;allocation d&#8217;&#233;ducation de l&#8217;enfant handicap, telle que d&#233;finie &#224; l&#8217;article L.&#160;541&#8209;1 du code de la s&#233;curit&#233; sociale,&#160;&#187;.</p><p style=\"text-align: justify;\">II. &#8211; La perte de recettes pour l&#8217;&#201;tat est compens&#233;e &#224; due concurrence par la cr&#233;ation d&#8217;une taxe additionnelle aux droits mentionn&#233;s aux articles 575 et 575 A du code g&#233;n&#233;ral des imp&#244;ts.</p><p style=\"text-align: justify;\">III. &#8211; La perte de recettes pour les collectivit&#233;s territoriales est compens&#233;e &#224; due concurrence par la majoration de la dotation globale de fonctionnement et, corr&#233;lativement pour l&#8217;&#201;tat, par la cr&#233;ation d&#8217;une taxe additionnelle aux droits mentionn&#233;s aux articles 575 et 575 A du code g&#233;n&#233;ral des imp&#244;ts.</p><p style=\"text-align: justify;\">IV. &#8211; La perte de recettes pour les organismes de s&#233;curit&#233; sociale est compens&#233;e &#224; due concurrence par la majoration des droits mentionn&#233;s aux articles 575 et 575 A du code g&#233;n&#233;ral des imp&#244;ts.</p>",
    "exposeSommaire": "<p style=\"text-align: justify;\">Cet amendement propose d&#8217;&#233;tendre la prime d&#8217;activit&#233; aux personnes b&#233;n&#233;ficiaires de la prestation de compensation du handicap (PCH) aide-humaine ou l&#8217;allocation d&#8217;&#233;ducation de l&#8217;enfant handicap&#233; (AEEH) et son compl&#233;ment pour s&#8217;occuper de leur enfant handicap&#233; et n&#8217;ayant pas d&#8217;activit&#233; salari&#233;e.</p><p style=\"text-align: justify;\">Bien que la PCH et l&#8217;AEEH ne sont pas consid&#233;r&#233;es comme un revenu, les personnes qui en b&#233;n&#233;ficient travaillent et offrent un service qui, sans elles, serait financi&#232;rement &#224; la charge de la collectivit&#233;.</p><p style=\"text-align: justify;\">C&#8217;est pourquoi il convient d&#8217;&#233;tendre cette prestation.</p>"
  },
  "representations": [
    {
      "nom": "PDF",
      "typeMime": {
        "type": "application",
        "subType": "PDF"
      },
      "statutRepresentation": {
        "verbatim": true,
        "canonique": true,
        "officielle": true,
        "transcription": false,
        "enregistrement": false
      },
      "contenu": {
        "documentURI": "/15/amendements/1297/AN/695.pdf"
      }
    }
  ],
  "dateDepot": "2018-10-18T02:00:00.000+02:00",
  "article99": "0",
  "loiReference": {
    "codeLoi": "c sécurité sociale",
    "divisionCodeLoi": "L841-1"
  }
}